newmtl blinn1SG
illum 4
Kd 0.00 0.00 0.00
Ka 0.00 0.00 0.00
Tf 1.00 1.00 1.00
map_Kd cutlass_diffuse128.png
map_Ka cutlass_AO.png
bump  -bm 1 cutlass_normal128.png
Ni 1.00
Ks 0.00 0.00 0.00
map_Ks cutlass_specular128.png
newmtl blinn2SG
illum 4
Kd 0.00 0.00 0.00
Ka 0.00 0.00 0.00
Tf 1.00 1.00 1.00
map_Kd pistol_diffuse.png
map_Ka pistol_AO.png
bump  -bm 1 pistol_normal.png
Ni 1.00
Ks 0.00 0.00 0.00
map_Ks pistol_specular.png
newmtl blinn3SG
illum 4
Kd 0.00 0.00 0.00
Ka 0.00 0.00 0.00
Tf 1.00 1.00 1.00
map_Kd pirateHat_diffuse.png
map_Ka pirateHat_AO.png
bump  -bm 1 pirateHat_normal.png
Ni 1.00
Ks 0.00 0.00 0.00
map_Ks pirateHat_specular.png
