%YAML 1.1
%TAG !u! tag:unity3d.com,2011:
--- !u!114 &11400000
MonoBehaviour:
  m_ObjectHideFlags: 0
  m_CorrespondingSourceObject: {fileID: 0}
  m_PrefabInstance: {fileID: 0}
  m_PrefabAsset: {fileID: 0}
  m_GameObject: {fileID: 0}
  m_Enabled: 1
  m_EditorHideFlags: 0
  m_Script: {fileID: 0}
  m_Name: FoodMenu
  m_EditorClassIdentifier: Assembly-CSharp::Menu
  foods:
  - {fileID: 11400000, guid: 0c84815848ab26c4c86f8d1ffc82e181, type: 2}
  - {fileID: 11400000, guid: d7e63c3e51993854dabeac4b7d7fa551, type: 2}
  - {fileID: 11400000, guid: 93c3a28b1ba1a5a408004bc3cf5fbfd5, type: 2}
  - {fileID: 11400000, guid: 9b78988be2fdd0e43996af32bc9a17fd, type: 2}
  - {fileID: 11400000, guid: 361d9346453214e40bc645ce54a8bb5b, type: 2}
  - {fileID: 11400000, guid: f41aba1eda488064886cc543a7851af0, type: 2}
  - {fileID: 11400000, guid: 50da20f0499c5fe4cac65eefbc07b6b5, type: 2}
  - {fileID: 11400000, guid: 9c8c70f5282482340b56819336ee96bd, type: 2}
  - {fileID: 11400000, guid: bc3e7e3f1cd208649ba584d62790bffe, type: 2}
  - {fileID: 11400000, guid: d39f597d622964f46a016cd406451898, type: 2}
