{
    "k_leaf": 2,
    "k_top": 2,
    "redundancy_factor": 2,
    "is_k8s": true,
    "machine_mac_addresses": {
        "leaf_1_0_1": {
            "net0": "fe:fc:e8:68:f5:bb",
            "net1": "ce:e3:24:12:62:3f",
            "net2": "e2:c4:f6:78:c6:95"
        },
        "leaf_1_0_2": {
            "net0": "66:1c:87:87:e2:c4",
            "net1": "26:56:b1:00:e9:30",
            "net2": "66:05:56:4f:54:84"
        },
        "leaf_2_0_1": {
            "net0": "aa:9e:d4:5e:3c:ae",
            "net1": "06:cd:bd:ac:99:60",
            "net2": "7a:84:91:b9:f5:7a"
        },
        "leaf_2_0_2": {
            "net0": "16:46:f6:57:54:b7",
            "net1": "7e:5d:3c:ed:96:af",
            "net2": "26:b5:15:16:7b:87"
        },
        "spine_1_1_1": {
            "net0": "86:6e:8e:11:35:f1",
            "net1": "62:72:ff:34:b3:8f",
            "net2": "66:ae:84:e6:fa:f9",
            "net3": "36:32:28:34:a2:84"
        },
        "spine_1_1_2": {
            "net0": "fa:d8:df:10:25:47",
            "net1": "2e:76:7f:3d:3b:67",
            "net2": "c6:32:3b:29:38:e4",
            "net3": "4a:f4:b6:f5:b0:7d"
        },
        "spine_2_1_1": {
            "net0": "d2:3a:95:bf:83:fd",
            "net1": "36:cc:a7:17:74:53",
            "net2": "06:87:73:1f:06:2e",
            "net3": "da:14:e3:dd:77:b5"
        },
        "spine_2_1_2": {
            "net0": "7a:6b:f9:3e:29:52",
            "net1": "3e:98:f6:06:de:f9",
            "net2": "3e:1e:12:5e:38:47",
            "net3": "3a:02:dc:f6:81:1d"
        },
        "tof_1_2_1": {
            "net0": "aa:68:ef:5a:d7:07",
            "net1": "a2:e1:06:9f:af:22",
            "net2": "32:1f:56:43:c3:4a",
            "net3": "62:f6:9b:0f:23:17"
        },
        "tof_1_2_2": {
            "net0": "ee:a3:cb:23:5a:78",
            "net1": "32:2a:79:c2:58:14",
            "net2": "b2:8e:2a:73:20:d1",
            "net3": "da:b0:7b:b1:da:9d"
        }
    },
    "failed_machine": "leaf_1_0_1",
    "failure_time": {
        "leaf_1_0_1": 1622749898.204705,
        "leaf_1_0_2": 1622749898.218128,
        "leaf_2_0_1": 1622749898.7232172,
        "leaf_2_0_2": 1622749898.7366343,
        "spine_1_1_1": 1622749898.7431738,
        "spine_1_1_2": 1622749898.7523293,
        "spine_2_1_1": 1622749898.745416,
        "spine_2_1_2": 1622749898.7542977,
        "tof_1_2_1": 1622749898.7589893,
        "tof_1_2_2": 1622749898.7709258
    }
}