{
    "k_leaf": 6,
    "k_top": 6,
    "redundancy_factor": 3,
    "is_k8s": true,
    "machine_mac_addresses": {
        "leaf_1_0_1": {
            "net0": "72:e2:e9:c8:7c:9d",
            "net1": "22:92:63:1c:59:3c",
            "net2": "ae:1c:5b:23:54:3e",
            "net3": "26:35:c6:86:a8:df",
            "net4": "9a:05:10:9f:fb:d4",
            "net5": "26:b4:b7:2c:4c:23",
            "net6": "1e:91:cb:23:41:e1"
        },
        "leaf_1_0_2": {
            "net0": "76:4c:6b:5c:bb:de",
            "net1": "66:d1:0d:7f:2c:1e",
            "net2": "d2:47:b2:4e:d1:83",
            "net3": "9e:7e:74:58:1d:77",
            "net4": "32:5c:58:06:68:9f",
            "net5": "b2:9a:a9:ff:d5:b3",
            "net6": "c6:86:37:d8:f2:e8"
        },
        "leaf_1_0_3": {
            "net0": "b6:2d:78:d8:27:3d",
            "net1": "66:98:2f:57:41:25",
            "net2": "7e:b6:97:11:e7:2a",
            "net3": "aa:e4:6e:3d:da:bd",
            "net4": "4e:89:7c:c5:a8:24",
            "net5": "b6:63:c2:6f:4c:6a",
            "net6": "0a:4d:88:87:06:bc"
        },
        "leaf_1_0_4": {
            "net0": "ea:04:21:1c:21:46",
            "net1": "e6:47:36:1b:bd:87",
            "net2": "ce:13:9b:df:f7:63",
            "net3": "02:8e:88:9b:97:68",
            "net4": "92:5f:2b:33:3e:4b",
            "net5": "42:97:31:97:1b:19",
            "net6": "ea:5d:2f:5b:f9:5b"
        },
        "leaf_1_0_5": {
            "net0": "0a:8f:f6:cd:d9:f6",
            "net1": "0a:e9:a1:6c:30:65",
            "net2": "aa:4a:15:c3:22:c6",
            "net3": "ba:1f:de:ad:73:04",
            "net4": "aa:76:99:ce:78:d7",
            "net5": "f2:3f:83:37:b2:0d",
            "net6": "22:e7:b6:04:48:c6"
        },
        "leaf_1_0_6": {
            "net0": "f2:67:1d:02:65:cf",
            "net1": "f6:0d:7f:2e:94:d6",
            "net2": "ce:e1:a6:14:6b:4a",
            "net3": "aa:91:0f:d7:63:dc",
            "net4": "f2:1d:5d:b4:fa:c9",
            "net5": "e2:e1:93:b3:8b:b1",
            "net6": "b6:7b:b2:ed:5a:48"
        },
        "leaf_2_0_1": {
            "net0": "b2:7f:3d:5b:28:76",
            "net1": "a2:7b:fa:49:ea:d3",
            "net2": "a2:5d:1b:1d:28:54",
            "net3": "7a:4a:bf:98:1c:40",
            "net4": "4e:de:ce:1b:1b:92",
            "net5": "06:98:02:1f:5c:a7",
            "net6": "ea:2e:6a:c2:6e:b3"
        },
        "leaf_2_0_2": {
            "net0": "0a:ac:17:a4:39:b3",
            "net1": "fe:9e:10:94:57:a0",
            "net2": "82:8c:ec:0e:ee:5f",
            "net3": "0a:ba:5f:87:ae:b9",
            "net4": "8a:4c:6d:6e:15:35",
            "net5": "aa:31:9e:cb:dc:dc",
            "net6": "06:f1:67:cf:85:e9"
        },
        "leaf_2_0_3": {
            "net0": "06:34:7e:0b:4b:ea",
            "net1": "22:b2:74:b1:23:32",
            "net2": "9e:df:f2:97:0d:fc",
            "net3": "46:2d:9e:49:8f:08",
            "net4": "5e:8a:2f:77:b8:d1",
            "net5": "ee:5c:8b:a9:3b:e9",
            "net6": "8e:26:89:d4:03:72"
        },
        "leaf_2_0_4": {
            "net0": "06:de:19:85:b8:1e",
            "net1": "4a:01:9a:f8:1a:0e",
            "net2": "b2:80:61:5c:4a:01",
            "net3": "06:87:ab:e4:0a:03",
            "net4": "da:63:f9:5b:f0:6d",
            "net5": "5a:7f:93:a6:a2:9b",
            "net6": "22:98:db:bb:21:93"
        },
        "leaf_2_0_5": {
            "net0": "5a:df:73:25:53:a1",
            "net1": "06:0a:26:c5:5f:34",
            "net2": "66:1e:0d:56:f4:c8",
            "net3": "16:de:e0:09:d4:73",
            "net4": "6e:1f:d1:f0:0e:d5",
            "net5": "42:67:55:6b:4a:36",
            "net6": "82:14:d7:74:d5:f8"
        },
        "leaf_2_0_6": {
            "net0": "c2:0b:78:73:0b:02",
            "net1": "2a:c1:53:ba:5b:9d",
            "net2": "3e:f6:e7:e9:66:2f",
            "net3": "42:fd:ae:07:16:47",
            "net4": "da:a8:ae:80:54:32",
            "net5": "66:44:66:c6:2c:6d",
            "net6": "4a:06:ee:60:e1:6d"
        },
        "leaf_3_0_1": {
            "net0": "8a:0b:13:6c:d9:86",
            "net1": "aa:78:f4:2f:25:e1",
            "net2": "d6:c3:e6:f1:00:5f",
            "net3": "76:c3:9e:41:f0:34",
            "net4": "f2:97:58:4b:46:28",
            "net5": "b6:f1:6a:26:5f:d4",
            "net6": "96:2e:81:2c:fd:4e"
        },
        "leaf_3_0_2": {
            "net0": "3a:ce:f5:48:5f:66",
            "net1": "9a:36:21:68:24:8a",
            "net2": "7a:dc:49:9e:84:aa",
            "net3": "be:ac:5b:73:d7:5e",
            "net4": "02:b3:bb:12:d0:e5",
            "net5": "de:51:bb:6f:12:6c",
            "net6": "86:dd:a7:ae:ec:c9"
        },
        "leaf_3_0_3": {
            "net0": "2e:f7:ae:e2:fe:d4",
            "net1": "be:5c:a0:b5:55:54",
            "net2": "0a:6d:4e:5b:b7:9a",
            "net3": "fe:fe:bb:67:6a:2a",
            "net4": "7e:da:55:34:0a:13",
            "net5": "a6:34:93:d7:0b:f6",
            "net6": "52:04:36:ea:4b:bc"
        },
        "leaf_3_0_4": {
            "net0": "22:8a:72:07:e7:3d",
            "net1": "02:d4:62:ac:66:a2",
            "net2": "a6:31:60:f4:39:62",
            "net3": "02:6d:30:41:a3:42",
            "net4": "8a:50:3e:59:9a:07",
            "net5": "52:ed:7e:67:d8:a5",
            "net6": "66:af:94:cf:4d:48"
        },
        "leaf_3_0_5": {
            "net0": "0a:17:0e:6c:c1:53",
            "net1": "76:47:07:9a:4b:8e",
            "net2": "62:bd:43:e2:eb:33",
            "net3": "7a:e9:ab:85:60:8e",
            "net4": "76:c5:fa:a1:b3:20",
            "net5": "e2:c2:57:35:b2:b5",
            "net6": "a6:9e:8f:1a:e6:ae"
        },
        "leaf_3_0_6": {
            "net0": "96:c7:d0:84:fb:25",
            "net1": "06:29:e6:76:9b:4e",
            "net2": "b2:bd:63:8e:f6:86",
            "net3": "9a:33:f0:8d:ad:b3",
            "net4": "f2:d8:73:f9:b0:a3",
            "net5": "22:75:d1:23:78:01",
            "net6": "e2:3e:09:11:ea:01"
        },
        "leaf_4_0_1": {
            "net0": "7e:84:5d:8e:c2:cc",
            "net1": "66:75:eb:3a:ff:0a",
            "net2": "b6:b1:cc:b4:e4:66",
            "net3": "6a:d0:29:01:f8:5a",
            "net4": "72:e3:c4:82:ef:f6",
            "net5": "be:69:4e:91:00:b2",
            "net6": "ce:3c:fa:ce:db:74"
        },
        "leaf_4_0_2": {
            "net0": "b2:25:4a:1d:f8:db",
            "net1": "1e:c6:19:be:f6:9a",
            "net2": "12:0b:95:df:67:93",
            "net3": "9a:b1:bb:0b:45:b1",
            "net4": "7a:92:68:ab:26:d7",
            "net5": "de:e8:24:3a:1d:40",
            "net6": "4a:67:df:f0:31:1e"
        },
        "leaf_4_0_3": {
            "net0": "aa:6e:e1:27:e7:db",
            "net1": "46:d8:af:0a:a1:c3",
            "net2": "a6:68:bd:ac:e2:b3",
            "net3": "26:58:0c:52:0d:30",
            "net4": "da:5a:4b:bd:9f:bc",
            "net5": "8a:26:18:e4:12:1e",
            "net6": "0a:cf:08:b0:5f:59"
        },
        "leaf_4_0_4": {
            "net0": "62:25:ff:52:23:15",
            "net1": "3e:14:f4:3c:8f:71",
            "net2": "0a:4c:e9:00:97:4c",
            "net3": "2a:9e:80:7d:88:ef",
            "net4": "6e:72:dc:b2:7f:92",
            "net5": "66:68:f8:45:0f:a9",
            "net6": "76:3f:bd:d0:86:92"
        },
        "leaf_4_0_5": {
            "net0": "ca:3d:03:20:bc:3e",
            "net1": "f2:31:08:dd:7d:6e",
            "net2": "5a:dd:24:7b:4c:c2",
            "net3": "76:7b:58:91:04:09",
            "net4": "a2:ac:24:ae:d2:41",
            "net5": "d6:1b:a8:d0:72:2f",
            "net6": "da:3a:5c:4d:79:39"
        },
        "leaf_4_0_6": {
            "net0": "62:53:70:a5:c5:7a",
            "net1": "aa:31:35:53:f0:78",
            "net2": "aa:39:1c:e7:ce:d7",
            "net3": "86:a8:c1:9b:a1:b1",
            "net4": "be:30:6d:0d:88:e3",
            "net5": "1e:0d:eb:19:03:96",
            "net6": "02:36:bd:0b:47:45"
        },
        "spine_1_1_1": {
            "net0": "66:cb:50:dd:66:99",
            "net1": "d6:97:89:87:f9:cb",
            "net10": "3a:90:a0:f7:9e:18",
            "net11": "96:9b:a3:68:bb:ad",
            "net2": "ca:61:3d:7d:c3:66",
            "net3": "7a:ff:00:5e:05:de",
            "net4": "7e:b2:c6:6b:96:2a",
            "net5": "be:9c:73:d8:65:53",
            "net6": "12:ea:b8:c7:83:b5",
            "net7": "82:52:93:1e:c4:e1",
            "net8": "9a:9c:bb:32:3a:9c",
            "net9": "9a:bd:a9:d8:fb:35"
        },
        "spine_1_1_2": {
            "net0": "72:a3:0d:48:9f:d3",
            "net1": "7e:9e:f2:e8:4d:a6",
            "net10": "12:56:46:fa:84:64",
            "net11": "b6:eb:6b:d9:af:56",
            "net2": "32:13:0d:27:8e:33",
            "net3": "9e:06:53:18:a6:25",
            "net4": "3a:10:3f:b8:da:c8",
            "net5": "2a:b8:32:67:87:ab",
            "net6": "26:8f:32:d4:29:77",
            "net7": "7e:30:68:f4:0a:e8",
            "net8": "3e:91:6a:86:11:2d",
            "net9": "b2:8e:46:6b:56:57"
        },
        "spine_1_1_3": {
            "net0": "56:15:e1:9b:da:48",
            "net1": "aa:90:5e:f5:a4:dc",
            "net10": "3a:c1:e3:ec:c6:bf",
            "net11": "2a:09:ff:e3:8f:7f",
            "net2": "52:8c:78:1c:0c:9d",
            "net3": "9a:64:6c:84:b8:40",
            "net4": "ae:71:fe:4d:dd:76",
            "net5": "46:91:2f:75:4b:90",
            "net6": "46:0b:08:b0:af:80",
            "net7": "16:b8:bf:93:9e:06",
            "net8": "06:6f:9c:2c:fd:4f",
            "net9": "a6:b7:66:1a:25:8e"
        },
        "spine_1_1_4": {
            "net0": "ce:b7:0a:98:7e:be",
            "net1": "66:d6:93:8f:f3:28",
            "net10": "2e:5c:a5:6b:a8:5b",
            "net11": "1e:de:c2:af:bc:af",
            "net2": "de:fc:c1:e0:4e:fb",
            "net3": "ee:b4:5b:55:7f:0e",
            "net4": "52:6b:c2:87:1b:82",
            "net5": "b6:23:4c:c3:82:dd",
            "net6": "7e:23:e2:f9:02:74",
            "net7": "ba:2e:2b:73:4d:d1",
            "net8": "c6:14:82:4f:ed:a8",
            "net9": "ea:a8:0e:cb:ca:6c"
        },
        "spine_1_1_5": {
            "net0": "ee:f8:49:ad:d6:6d",
            "net1": "52:94:f6:25:4c:fc",
            "net10": "ba:18:ef:e0:c4:ae",
            "net11": "26:a7:bb:7d:3e:77",
            "net2": "9e:76:9a:d0:12:b2",
            "net3": "56:1f:74:0d:20:3d",
            "net4": "56:1b:f1:fd:c6:4b",
            "net5": "d2:85:e7:33:52:a9",
            "net6": "b6:39:ae:d7:7f:e1",
            "net7": "02:90:ef:94:52:a5",
            "net8": "0a:b1:19:1e:9c:93",
            "net9": "5a:08:f6:50:0d:22"
        },
        "spine_1_1_6": {
            "net0": "b2:5e:a7:d7:46:fa",
            "net1": "6e:73:dd:e6:fa:e3",
            "net10": "66:45:0f:d9:fe:8d",
            "net11": "f2:e2:12:00:a6:6f",
            "net2": "ae:a4:49:73:ae:9f",
            "net3": "0e:54:5f:31:28:52",
            "net4": "1e:67:77:58:50:25",
            "net5": "e6:d5:c9:e8:96:11",
            "net6": "1e:8c:e3:1b:8e:23",
            "net7": "a2:54:db:1c:ef:cc",
            "net8": "86:99:d2:46:f3:5b",
            "net9": "ee:89:64:53:3d:e9"
        },
        "spine_2_1_1": {
            "net0": "ba:e0:7f:67:1f:c9",
            "net1": "fa:2b:b0:e1:f1:89",
            "net10": "22:c6:2a:8a:f7:d7",
            "net11": "86:f7:7e:55:66:0e",
            "net2": "7e:10:f6:c6:9d:84",
            "net3": "96:92:50:8a:26:a6",
            "net4": "9e:d6:c4:a5:89:e2",
            "net5": "fa:29:81:24:e2:c5",
            "net6": "4a:2e:cd:07:29:d1",
            "net7": "a2:c1:33:ba:69:c0",
            "net8": "46:bb:89:48:ca:26",
            "net9": "ea:b9:aa:98:7d:40"
        },
        "spine_2_1_2": {
            "net0": "12:79:8f:9a:e1:bb",
            "net1": "6e:75:70:e7:6e:7d",
            "net10": "46:e5:b4:85:b3:cc",
            "net11": "fa:26:2a:4c:da:2a",
            "net2": "9e:0a:a2:3b:4b:fe",
            "net3": "76:eb:92:ba:42:ab",
            "net4": "0a:8a:db:30:0e:c3",
            "net5": "d2:3f:d6:30:b1:50",
            "net6": "7e:27:8e:c1:84:11",
            "net7": "9a:e9:6c:2d:ea:1f",
            "net8": "46:b2:45:e1:11:ed",
            "net9": "f2:ef:56:56:5e:a1"
        },
        "spine_2_1_3": {
            "net0": "26:58:25:44:aa:ea",
            "net1": "d2:e3:80:fb:6a:2f",
            "net10": "c2:24:26:d6:aa:b0",
            "net11": "aa:82:e5:9c:40:0e",
            "net2": "d6:45:cf:06:4f:31",
            "net3": "6e:4c:30:2f:a4:93",
            "net4": "2e:ff:d8:83:f0:0f",
            "net5": "12:11:3b:d4:17:1e",
            "net6": "0a:c4:43:01:c3:57",
            "net7": "ee:d3:bb:fe:e1:88",
            "net8": "66:b2:5c:42:b8:9e",
            "net9": "86:81:0f:51:d7:cd"
        },
        "spine_2_1_4": {
            "net0": "aa:56:90:b2:89:fa",
            "net1": "9e:af:aa:ac:55:06",
            "net10": "8a:25:a4:5a:24:d2",
            "net11": "c6:94:2b:7b:71:2b",
            "net2": "be:36:be:30:50:1c",
            "net3": "aa:82:f8:56:dc:4e",
            "net4": "c6:3e:4e:72:01:84",
            "net5": "66:48:ab:21:b6:d0",
            "net6": "2e:aa:b7:0b:a7:7a",
            "net7": "fe:ea:4d:7f:a6:d1",
            "net8": "6a:84:92:63:3f:70",
            "net9": "b2:4c:b4:bf:c3:7b"
        },
        "spine_2_1_5": {
            "net0": "8a:b2:79:f8:8c:f3",
            "net1": "d6:1e:2a:3e:7d:31",
            "net10": "ee:0d:af:f6:1d:13",
            "net11": "7e:bc:43:f1:a4:51",
            "net2": "8a:a9:91:47:eb:b8",
            "net3": "6e:b0:44:93:94:34",
            "net4": "d6:3d:45:c8:a6:3e",
            "net5": "f6:0c:58:bd:78:33",
            "net6": "9e:b6:e3:e3:65:49",
            "net7": "4a:ee:a4:24:48:cf",
            "net8": "62:f3:72:0a:15:f8",
            "net9": "fe:b6:c0:63:87:bb"
        },
        "spine_2_1_6": {
            "net0": "22:79:b1:3c:bf:5f",
            "net1": "3a:1d:1f:57:18:09",
            "net10": "aa:5d:98:83:57:78",
            "net11": "3a:c5:2c:de:f1:a0",
            "net2": "4a:f8:a1:29:c3:8d",
            "net3": "f2:b8:d4:e7:c5:6c",
            "net4": "52:c9:16:97:dc:93",
            "net5": "66:4b:d5:26:05:4f",
            "net6": "ea:63:62:01:92:9d",
            "net7": "7e:1c:b1:3b:76:df",
            "net8": "8e:f8:ed:05:86:35",
            "net9": "7e:a0:13:ec:1d:7e"
        },
        "spine_3_1_1": {
            "net0": "ee:c1:6a:16:42:54",
            "net1": "ca:57:03:69:c6:c7",
            "net10": "3e:79:66:b4:bb:6c",
            "net11": "86:b3:36:f2:f2:6a",
            "net2": "5a:e6:f2:4d:57:a8",
            "net3": "a6:a0:68:bf:a4:07",
            "net4": "56:d2:8d:e9:b7:f2",
            "net5": "92:c4:ab:fe:51:02",
            "net6": "e6:51:fe:64:38:d4",
            "net7": "ea:66:b5:49:e0:26",
            "net8": "9a:97:a2:2e:ce:b4",
            "net9": "5a:73:9b:b6:5d:6f"
        },
        "spine_3_1_2": {
            "net0": "86:48:13:14:17:65",
            "net1": "a2:7b:34:48:ec:5c",
            "net10": "ae:3c:42:10:56:65",
            "net11": "da:e5:64:d8:27:a0",
            "net2": "66:fd:2b:9f:64:66",
            "net3": "ce:16:58:b3:9a:99",
            "net4": "42:a3:27:c2:30:80",
            "net5": "ca:b0:a5:6a:3c:11",
            "net6": "4a:89:32:02:8e:2a",
            "net7": "62:d8:ad:03:c9:02",
            "net8": "8a:25:7c:04:02:03",
            "net9": "6a:93:4a:6d:53:51"
        },
        "spine_3_1_3": {
            "net0": "8a:9b:b1:5f:f2:57",
            "net1": "a2:16:3c:e5:cc:8f",
            "net10": "ca:b3:83:c3:2a:42",
            "net11": "be:d0:95:1a:4d:db",
            "net2": "fa:92:33:cd:51:62",
            "net3": "5a:9b:7f:b4:62:66",
            "net4": "8a:83:7b:e8:af:1e",
            "net5": "a6:89:38:35:51:57",
            "net6": "fe:86:39:51:7b:1f",
            "net7": "56:3c:44:ec:f8:f5",
            "net8": "66:b9:1c:24:29:05",
            "net9": "ce:37:93:d0:48:73"
        },
        "spine_3_1_4": {
            "net0": "1a:78:05:dc:c9:b1",
            "net1": "82:fa:ee:86:d8:3f",
            "net10": "72:20:fe:5d:e1:6f",
            "net11": "96:f6:ee:37:18:32",
            "net2": "9a:95:ad:80:c1:c0",
            "net3": "72:dc:93:ea:ca:34",
            "net4": "c6:7b:2c:35:8f:00",
            "net5": "02:79:4d:15:88:80",
            "net6": "6a:e3:7c:98:5c:62",
            "net7": "ca:09:a1:b1:c2:5b",
            "net8": "3a:84:8c:5b:76:07",
            "net9": "fa:31:54:30:eb:12"
        },
        "spine_3_1_5": {
            "net0": "0e:9a:fe:b7:2d:76",
            "net1": "9a:63:12:44:03:ff",
            "net10": "ce:c6:c8:ea:e3:32",
            "net11": "22:30:2f:f4:52:7d",
            "net2": "aa:30:82:31:b4:6f",
            "net3": "7e:67:1d:18:ea:35",
            "net4": "8e:b3:b0:71:e2:32",
            "net5": "d6:25:29:78:de:fa",
            "net6": "32:94:e3:2f:85:0d",
            "net7": "4a:7b:1d:19:6b:0d",
            "net8": "f6:39:8d:4d:a4:65",
            "net9": "42:f5:8e:b0:2e:6a"
        },
        "spine_3_1_6": {
            "net0": "ca:5e:7a:9e:60:2e",
            "net1": "6e:3e:0c:f7:ce:33",
            "net10": "8e:f4:75:9d:c5:c2",
            "net11": "be:50:53:f4:a4:c3",
            "net2": "76:b0:c1:8b:80:81",
            "net3": "7a:ed:60:36:dc:88",
            "net4": "ee:21:4e:06:6d:6a",
            "net5": "d6:dd:2c:d0:3a:2a",
            "net6": "da:ac:b3:fe:f7:57",
            "net7": "4e:4d:fa:b1:42:19",
            "net8": "d2:88:4b:7d:c9:0f",
            "net9": "0a:24:12:80:8c:58"
        },
        "spine_4_1_1": {
            "net0": "2e:94:3b:55:91:e8",
            "net1": "ea:04:39:76:76:e0",
            "net10": "f6:62:54:97:be:b9",
            "net11": "d2:46:92:1b:86:df",
            "net2": "da:09:9b:12:c4:5e",
            "net3": "9a:d8:34:5e:52:9d",
            "net4": "8e:0a:73:1c:e0:3f",
            "net5": "76:22:2e:28:23:4f",
            "net6": "82:dc:83:e0:77:e3",
            "net7": "56:92:5c:45:db:0f",
            "net8": "9a:fb:43:ef:50:09",
            "net9": "12:26:fd:f9:9d:71"
        },
        "spine_4_1_2": {
            "net0": "0a:93:a7:29:d9:6a",
            "net1": "aa:05:02:c6:7a:60",
            "net10": "d6:1a:85:73:4c:93",
            "net11": "06:ea:04:34:16:01",
            "net2": "3e:d8:5a:9c:12:cf",
            "net3": "1a:ee:fa:c5:81:ae",
            "net4": "da:f3:2d:12:49:2a",
            "net5": "aa:a4:ed:14:da:50",
            "net6": "8e:de:48:44:dd:b4",
            "net7": "6e:ea:c1:6d:34:40",
            "net8": "aa:47:61:a2:22:3d",
            "net9": "8e:2d:dc:79:8f:e4"
        },
        "spine_4_1_3": {
            "net0": "22:2a:90:b2:35:12",
            "net1": "fa:af:97:82:fb:d8",
            "net10": "52:d1:be:bb:81:8b",
            "net11": "92:32:6e:86:d4:a3",
            "net2": "86:d8:8b:f6:14:69",
            "net3": "42:74:5c:0e:43:bc",
            "net4": "c2:3d:d7:a3:cc:e4",
            "net5": "a6:64:a7:1f:21:9f",
            "net6": "9e:86:0b:61:1d:04",
            "net7": "22:ee:90:2c:e4:4d",
            "net8": "b2:0d:ae:39:f9:d8",
            "net9": "36:ff:a6:34:85:09"
        },
        "spine_4_1_4": {
            "net0": "56:63:49:21:33:a8",
            "net1": "ca:54:7a:25:ba:13",
            "net10": "2a:61:9f:24:36:18",
            "net11": "56:9d:ff:14:e4:b3",
            "net2": "b2:a0:79:2e:07:b7",
            "net3": "1e:a9:72:ab:4b:82",
            "net4": "7e:63:45:e8:d6:a0",
            "net5": "5a:30:54:b9:d6:4f",
            "net6": "52:be:db:18:4d:a1",
            "net7": "3a:e3:20:11:41:d2",
            "net8": "36:ea:18:ae:73:33",
            "net9": "d2:a7:36:10:59:19"
        },
        "spine_4_1_5": {
            "net0": "32:0a:69:e2:8d:2b",
            "net1": "5e:44:7f:25:58:24",
            "net10": "b2:a4:e3:0e:0f:82",
            "net11": "ba:3f:81:a4:37:a3",
            "net2": "2a:08:39:91:ec:d0",
            "net3": "26:6a:d4:96:06:13",
            "net4": "b6:f4:7e:17:27:a5",
            "net5": "92:0e:f5:5f:dc:c4",
            "net6": "ee:ad:2e:17:d7:0b",
            "net7": "da:ad:2e:37:11:e4",
            "net8": "66:d6:50:94:15:0c",
            "net9": "b6:49:68:99:c4:74"
        },
        "spine_4_1_6": {
            "net0": "da:2d:88:c7:b0:a3",
            "net1": "d2:8e:a3:4f:d6:2e",
            "net10": "16:3d:50:1a:59:a9",
            "net11": "42:d2:5b:06:bc:4a",
            "net2": "82:ca:f0:bf:d2:7b",
            "net3": "9e:e6:9a:cd:da:44",
            "net4": "be:f4:6d:ee:6c:55",
            "net5": "36:49:5b:b9:c4:67",
            "net6": "76:3b:4d:12:6f:f4",
            "net7": "36:b3:08:5b:96:a0",
            "net8": "e6:e5:5e:9f:b6:a1",
            "net9": "ce:fc:b6:ae:1d:e2"
        },
        "tof_1_2_1": {
            "net0": "c2:5b:59:8a:31:d7",
            "net1": "aa:87:fa:1d:22:54",
            "net10": "56:58:bd:a1:4c:57",
            "net11": "a2:2d:44:5a:fa:c9",
            "net12": "6e:ff:02:b9:18:74",
            "net2": "86:79:7a:18:dc:20",
            "net3": "82:8a:38:b7:9b:8d",
            "net4": "9a:80:8b:37:47:c8",
            "net5": "3a:86:f2:d7:10:f1",
            "net6": "e2:b0:95:88:7d:27",
            "net7": "ee:7f:a7:44:9b:dd",
            "net8": "46:a3:94:90:2a:b0",
            "net9": "3a:d5:6d:d4:8e:a3"
        },
        "tof_1_2_2": {
            "net0": "9e:f5:be:72:39:ed",
            "net1": "ca:ac:61:31:2a:ae",
            "net10": "da:ed:1c:50:53:71",
            "net11": "ba:f6:70:15:6b:b2",
            "net12": "36:65:e6:6b:2f:d2",
            "net2": "a6:9d:de:3b:b3:d3",
            "net3": "62:50:b1:7a:b0:42",
            "net4": "96:3f:f4:a5:e5:9f",
            "net5": "8e:f4:ca:bb:59:cd",
            "net6": "76:50:ab:d9:e3:a2",
            "net7": "6a:2b:b8:e9:e6:5e",
            "net8": "e2:ec:7c:68:0c:60",
            "net9": "2e:e2:fe:0d:e9:07"
        },
        "tof_1_2_3": {
            "net0": "b6:c8:1a:3b:14:39",
            "net1": "c2:68:92:14:88:54",
            "net10": "b2:e6:ab:3a:91:a1",
            "net11": "32:f1:27:71:a3:3e",
            "net12": "fa:e6:9f:93:48:61",
            "net2": "72:9b:2f:aa:d7:47",
            "net3": "12:78:61:c0:45:43",
            "net4": "da:fb:d3:c9:7f:db",
            "net5": "b2:a7:b3:b0:d2:48",
            "net6": "4a:25:e5:22:cd:c9",
            "net7": "06:ff:ac:61:ed:1d",
            "net8": "66:6a:f5:84:84:15",
            "net9": "3a:1c:ea:91:88:ed"
        },
        "tof_1_2_4": {
            "net0": "66:01:db:0f:4f:dc",
            "net1": "06:79:59:c3:88:32",
            "net10": "4a:c8:2e:9b:a1:1f",
            "net11": "b2:b8:4d:00:c1:88",
            "net12": "7a:df:e3:86:0d:26",
            "net2": "a2:ec:b7:c5:69:9d",
            "net3": "ca:39:c6:55:51:0d",
            "net4": "62:09:7c:8c:76:56",
            "net5": "ca:77:a5:06:77:42",
            "net6": "7a:cc:49:5b:c9:63",
            "net7": "d2:6a:0d:75:ac:aa",
            "net8": "d6:a6:a7:0e:f5:e0",
            "net9": "fa:36:76:13:b1:a7"
        },
        "tof_1_2_5": {
            "net0": "3e:aa:74:98:89:32",
            "net1": "6e:b7:a2:c5:19:05",
            "net10": "16:b0:fe:c8:fe:e0",
            "net11": "de:27:35:23:9c:2e",
            "net12": "56:26:e5:6f:ce:42",
            "net2": "5a:75:55:fd:3b:21",
            "net3": "e2:70:b9:00:8b:4d",
            "net4": "86:a7:1b:0d:23:9e",
            "net5": "52:76:94:0a:b0:73",
            "net6": "d6:2b:a7:31:70:4e",
            "net7": "d6:43:a0:d8:f6:ac",
            "net8": "92:f3:eb:9b:44:e7",
            "net9": "76:57:da:44:62:e2"
        },
        "tof_1_2_6": {
            "net0": "d6:db:2f:66:c9:b8",
            "net1": "f2:cc:90:aa:e4:97",
            "net10": "a2:57:e7:25:c6:66",
            "net11": "de:69:54:bf:b7:49",
            "net12": "26:4c:81:69:4a:3f",
            "net2": "be:66:3d:a8:e3:83",
            "net3": "02:5d:97:46:33:2c",
            "net4": "76:20:81:91:84:d7",
            "net5": "46:4d:ad:d9:50:56",
            "net6": "a6:b3:8a:da:9d:b0",
            "net7": "7a:96:b0:bf:05:d8",
            "net8": "ce:6e:07:c0:97:17",
            "net9": "3a:06:7a:b4:33:6c"
        },
        "tof_2_2_1": {
            "net0": "22:59:90:09:cd:bb",
            "net1": "8a:2f:e6:00:69:e2",
            "net10": "52:e0:28:f7:cf:db",
            "net11": "1a:c5:3e:14:19:f8",
            "net12": "26:83:62:d6:c0:74",
            "net2": "52:4c:45:47:0f:06",
            "net3": "3a:8f:21:20:af:06",
            "net4": "6a:aa:4b:74:69:97",
            "net5": "aa:9a:98:e3:73:5b",
            "net6": "e2:05:d2:2c:6f:cc",
            "net7": "fa:28:4e:f8:90:b6",
            "net8": "9a:7e:81:37:87:89",
            "net9": "fa:4d:dc:76:40:95"
        },
        "tof_2_2_2": {
            "net0": "2a:6b:89:fb:6f:20",
            "net1": "a6:60:0c:f2:8f:b4",
            "net10": "a6:f2:70:4a:5e:5a",
            "net11": "4e:de:14:e8:e6:c9",
            "net12": "d2:39:fc:b6:ca:17",
            "net2": "46:d9:07:10:84:da",
            "net3": "b6:0a:f0:41:90:09",
            "net4": "22:8f:69:d3:69:6b",
            "net5": "32:05:c2:32:93:a9",
            "net6": "26:31:78:01:ee:b7",
            "net7": "1e:c1:89:7e:5e:7a",
            "net8": "3e:4d:5e:29:e3:47",
            "net9": "56:d6:07:61:2c:34"
        },
        "tof_2_2_3": {
            "net0": "46:0e:67:29:4c:36",
            "net1": "f2:e6:55:e3:ef:71",
            "net10": "e2:9d:2c:7f:16:af",
            "net11": "f6:04:4b:f8:95:e8",
            "net12": "2a:02:7c:57:8e:be",
            "net2": "fe:bd:00:1e:11:34",
            "net3": "02:ca:b4:5f:64:20",
            "net4": "0e:34:fe:ce:fd:ac",
            "net5": "4e:e2:61:d9:b4:46",
            "net6": "f2:34:7d:5a:60:ef",
            "net7": "1e:df:54:28:a9:f8",
            "net8": "0e:e9:4b:9d:51:bc",
            "net9": "b2:f3:45:a6:e9:81"
        },
        "tof_2_2_4": {
            "net0": "02:e0:fa:f7:73:a5",
            "net1": "52:76:a7:4e:6d:b0",
            "net10": "56:ce:06:13:b1:50",
            "net11": "da:d9:5f:f2:c1:fd",
            "net12": "16:bc:9b:0c:16:c6",
            "net2": "1e:4d:92:6e:96:21",
            "net3": "02:6f:11:b4:28:f9",
            "net4": "62:c4:82:ee:b1:e9",
            "net5": "02:2c:f2:00:81:57",
            "net6": "ca:eb:55:f3:84:7e",
            "net7": "c2:ac:5e:d5:82:63",
            "net8": "82:a8:d2:22:ca:66",
            "net9": "a6:4f:7e:1d:f4:b7"
        },
        "tof_2_2_5": {
            "net0": "22:2e:8b:34:f3:d8",
            "net1": "c2:41:d5:79:72:7f",
            "net10": "96:1c:f9:0b:ec:b4",
            "net11": "06:83:b7:8d:e2:23",
            "net12": "8a:90:b6:a3:da:76",
            "net2": "72:3b:c3:e7:f0:71",
            "net3": "c6:7e:5e:2f:e2:48",
            "net4": "a2:5a:b9:29:b8:e2",
            "net5": "9e:73:29:7e:c8:90",
            "net6": "12:fd:8b:84:7c:1a",
            "net7": "6e:23:a5:2f:18:39",
            "net8": "3a:92:f8:e5:fa:32",
            "net9": "fe:cc:35:ba:74:52"
        },
        "tof_2_2_6": {
            "net0": "ae:3d:ff:a6:83:19",
            "net1": "6a:7a:55:89:00:92",
            "net10": "36:81:36:38:5e:e9",
            "net11": "e6:55:84:d2:d4:c2",
            "net12": "fa:2c:6c:1f:1d:2c",
            "net2": "2e:3c:0f:e9:2f:37",
            "net3": "96:88:cf:b6:7e:c2",
            "net4": "66:00:d1:50:42:48",
            "net5": "b6:39:ab:89:11:78",
            "net6": "de:ce:5f:5f:a0:4e",
            "net7": "02:ce:53:f0:e4:39",
            "net8": "6e:94:93:6e:62:93",
            "net9": "1a:1e:20:ac:a2:99"
        }
    },
    "failed_machine": "leaf_1_0_1",
    "failure_time": {
        "leaf_1_0_1": 1622762524.2201312,
        "leaf_1_0_2": 1622762524.230271,
        "leaf_1_0_3": 1622762524.2407055,
        "leaf_1_0_4": 1622762524.2487512,
        "leaf_1_0_5": 1622762524.2620335,
        "leaf_1_0_6": 1622762524.26694,
        "leaf_2_0_1": 1622762524.2805147,
        "leaf_2_0_2": 1622762524.2854965,
        "leaf_2_0_3": 1622762524.2201557,
        "leaf_2_0_4": 1622762524.2298265,
        "leaf_2_0_5": 1622762524.237205,
        "leaf_2_0_6": 1622762524.2453218,
        "leaf_3_0_1": 1622762524.2514873,
        "leaf_3_0_2": 1622762524.2620716,
        "leaf_3_0_3": 1622762524.2795486,
        "leaf_3_0_4": 1622762524.28579,
        "leaf_3_0_5": 1622762524.289152,
        "leaf_3_0_6": 1622762524.2973938,
        "leaf_4_0_1": 1622762524.3069708,
        "leaf_4_0_2": 1622762524.3114917,
        "leaf_4_0_3": 1622762524.3216505,
        "leaf_4_0_4": 1622762524.3272464,
        "leaf_4_0_5": 1622762524.334167,
        "leaf_4_0_6": 1622762524.3420715,
        "spine_1_1_1": 1622762524.2915342,
        "spine_1_1_2": 1622762524.2965841,
        "spine_1_1_3": 1622762524.3033667,
        "spine_1_1_4": 1622762524.309893,
        "spine_1_1_5": 1622762524.3198152,
        "spine_1_1_6": 1622762524.323359,
        "spine_2_1_1": 1622762524.3317726,
        "spine_2_1_2": 1622762524.3379464,
        "spine_2_1_3": 1622762524.3492882,
        "spine_2_1_4": 1622762524.3536441,
        "spine_2_1_5": 1622762524.3665197,
        "spine_2_1_6": 1622762524.3733766,
        "spine_3_1_1": 1622762524.383592,
        "spine_3_1_2": 1622762524.3910515,
        "spine_3_1_3": 1622762524.399011,
        "spine_3_1_4": 1622762524.4046364,
        "spine_3_1_5": 1622762524.3506799,
        "spine_3_1_6": 1622762524.3605404,
        "spine_4_1_1": 1622762524.3723965,
        "spine_4_1_2": 1622762524.383606,
        "spine_4_1_3": 1622762524.3921027,
        "spine_4_1_4": 1622762524.4003592,
        "spine_4_1_5": 1622762524.4045093,
        "spine_4_1_6": 1622762524.4116778,
        "tof_1_2_1": 1622762524.4113965,
        "tof_1_2_2": 1622762524.4218874,
        "tof_1_2_3": 1622762524.4307203,
        "tof_1_2_4": 1622762524.4394827,
        "tof_1_2_5": 1622762524.4488382,
        "tof_1_2_6": 1622762524.4592407,
        "tof_2_2_1": 1622762524.4679534,
        "tof_2_2_2": 1622762524.4753056,
        "tof_2_2_3": 1622762524.4199226,
        "tof_2_2_4": 1622762524.422549,
        "tof_2_2_5": 1622762524.4289312,
        "tof_2_2_6": 1622762524.4355366
    }
}