{
    "description": "Scenario 4b: Spine spine_1_1_1 failure and recovery with BGP",
    "k_leaf": 12,
    "k_top": 12,
    "redundancy_factor": 12,
    "is_k8s": true,
    "machine_mac_addresses": {
        "leaf_1_0_1": {
            "net0": "ca:d8:be:f1:b7:97",
            "net1": "d2:34:0d:a6:fe:7f",
            "net10": "f6:54:dc:45:29:56",
            "net11": "46:11:77:3a:83:3c",
            "net12": "c2:1b:81:c4:7e:b2",
            "net2": "16:aa:0b:00:f2:87",
            "net3": "16:a9:d1:4e:1c:34",
            "net4": "32:f3:f5:d9:5f:01",
            "net5": "c2:b7:e1:9c:6e:70",
            "net6": "2e:07:9c:7a:d4:93",
            "net7": "62:64:17:18:aa:f9",
            "net8": "9e:ed:5a:18:97:b6",
            "net9": "8a:20:44:2f:27:ad"
        },
        "leaf_1_0_10": {
            "net0": "b6:27:d6:c2:9c:be",
            "net1": "2e:59:6e:82:40:d3",
            "net10": "16:39:c0:40:12:ba",
            "net11": "f6:d3:29:05:11:aa",
            "net12": "a6:08:d5:2f:98:77",
            "net2": "76:32:c4:4c:68:68",
            "net3": "be:be:9b:b0:92:ab",
            "net4": "f6:25:59:06:3f:82",
            "net5": "ee:0b:87:25:69:8b",
            "net6": "3a:93:79:9a:b2:3f",
            "net7": "be:13:0f:74:e3:71",
            "net8": "82:17:fc:98:6f:9c",
            "net9": "e2:59:78:11:af:13"
        },
        "leaf_1_0_11": {
            "net0": "12:28:d0:48:99:96",
            "net1": "c2:bb:72:57:91:b6",
            "net10": "52:89:47:59:0b:c5",
            "net11": "46:9f:54:a2:be:aa",
            "net12": "3a:e1:8a:b0:2a:5f",
            "net2": "26:4e:ef:a7:f3:f6",
            "net3": "f2:5e:32:0c:87:77",
            "net4": "36:cb:ac:1d:93:fd",
            "net5": "92:dc:79:38:b7:f1",
            "net6": "7a:4f:57:bf:73:2d",
            "net7": "fe:50:51:10:d3:79",
            "net8": "2e:f8:73:09:1a:00",
            "net9": "46:10:1f:db:3f:a7"
        },
        "leaf_1_0_12": {
            "net0": "ee:12:42:f3:4a:51",
            "net1": "1a:70:ca:6d:9e:43",
            "net10": "1e:36:ef:60:b1:c0",
            "net11": "0a:6a:41:ea:a6:9f",
            "net12": "a6:2a:15:a6:2a:18",
            "net2": "1e:f6:af:70:0d:19",
            "net3": "7e:b2:d5:53:d9:fc",
            "net4": "2e:9d:d9:42:cb:2a",
            "net5": "02:f9:5c:43:bf:ab",
            "net6": "9a:f7:67:c3:9e:a7",
            "net7": "3e:0c:f4:91:8e:a0",
            "net8": "2e:e8:09:47:37:3c",
            "net9": "d6:93:ae:48:59:b4"
        },
        "leaf_1_0_2": {
            "net0": "f2:f8:7c:93:3a:17",
            "net1": "f6:96:e3:e5:53:13",
            "net10": "f2:c0:8d:6f:94:44",
            "net11": "fe:90:59:6a:62:08",
            "net12": "0e:31:cb:56:11:72",
            "net2": "d2:5b:25:d8:4f:c0",
            "net3": "36:9f:20:40:9d:68",
            "net4": "0e:15:23:fc:74:31",
            "net5": "4a:10:83:36:9a:7c",
            "net6": "66:d2:38:2b:bf:40",
            "net7": "06:4c:30:46:f3:41",
            "net8": "e2:60:6d:8b:0d:9b",
            "net9": "ae:ab:1c:72:14:31"
        },
        "leaf_1_0_3": {
            "net0": "62:df:d7:9d:cb:d9",
            "net1": "ba:70:ef:c9:14:3e",
            "net10": "96:30:48:97:c5:7e",
            "net11": "7e:6d:d4:ca:1d:21",
            "net12": "4e:05:af:59:57:76",
            "net2": "9e:10:47:07:32:64",
            "net3": "02:84:91:77:7a:f6",
            "net4": "7a:15:04:78:ab:e6",
            "net5": "06:8d:95:3a:4c:07",
            "net6": "4a:b1:64:cf:a1:d5",
            "net7": "c2:c8:6f:95:10:ca",
            "net8": "ee:f2:ca:7c:c7:42",
            "net9": "b6:3e:09:0f:f9:e9"
        },
        "leaf_1_0_4": {
            "net0": "aa:8b:ce:40:b8:a6",
            "net1": "4a:b2:c6:15:34:34",
            "net10": "b2:f2:57:02:55:c5",
            "net11": "5e:be:7e:3c:ba:de",
            "net12": "72:ad:5b:32:1e:ad",
            "net2": "42:55:f9:48:5d:d5",
            "net3": "6e:1a:73:4a:51:1a",
            "net4": "96:6a:a2:25:14:76",
            "net5": "7a:f1:7f:5c:2c:a4",
            "net6": "f2:e9:27:b4:af:b1",
            "net7": "56:d0:fe:dc:44:e9",
            "net8": "ae:9a:6c:db:3f:74",
            "net9": "26:d3:07:a0:27:d2"
        },
        "leaf_1_0_5": {
            "net0": "12:88:51:b4:bf:71",
            "net1": "12:4a:4f:85:8c:a0",
            "net10": "de:c8:b0:67:3e:fc",
            "net11": "22:c9:74:90:71:ba",
            "net12": "a2:df:52:ab:57:d5",
            "net2": "12:95:0d:93:58:d0",
            "net3": "1e:d8:34:1e:60:fd",
            "net4": "46:a1:82:44:0c:0c",
            "net5": "6e:43:3c:10:e9:81",
            "net6": "7a:a4:6c:48:ae:bc",
            "net7": "4a:87:29:4f:af:ad",
            "net8": "f6:b1:1e:cf:76:1d",
            "net9": "7e:e3:69:ba:b0:ba"
        },
        "leaf_1_0_6": {
            "net0": "e2:c2:0d:b1:a0:5a",
            "net1": "f2:a9:f8:c9:b7:ba",
            "net10": "1e:3c:2c:e6:5a:6d",
            "net11": "1e:bd:c6:21:25:f6",
            "net12": "9a:41:2c:c4:9f:1e",
            "net2": "06:00:15:4e:b1:3c",
            "net3": "fa:cd:79:a2:1e:11",
            "net4": "f6:75:cb:d4:ec:53",
            "net5": "f2:f0:5c:77:42:6a",
            "net6": "7e:5e:d4:4b:48:8c",
            "net7": "1a:2f:0e:6d:4d:26",
            "net8": "6e:40:70:ab:8e:64",
            "net9": "de:6e:34:e0:21:f6"
        },
        "leaf_1_0_7": {
            "net0": "8a:b6:b3:b7:c3:5d",
            "net1": "da:0d:5f:c5:e7:d6",
            "net10": "46:6b:3d:6a:dc:d5",
            "net11": "3a:40:f7:47:28:47",
            "net12": "2e:83:ae:27:a8:f6",
            "net2": "36:31:43:f5:db:05",
            "net3": "26:ee:86:a6:33:26",
            "net4": "ae:08:b3:4a:14:93",
            "net5": "e6:99:80:92:88:2a",
            "net6": "3e:bc:5d:49:31:f9",
            "net7": "7e:2a:3c:f8:66:96",
            "net8": "a6:54:a3:eb:6a:a8",
            "net9": "46:70:ba:98:09:ca"
        },
        "leaf_1_0_8": {
            "net0": "8e:c2:f4:59:e7:8f",
            "net1": "6a:ff:95:7c:bd:a2",
            "net10": "3e:26:d9:17:b5:88",
            "net11": "2a:f5:c6:b3:55:f4",
            "net12": "f6:40:12:aa:76:1f",
            "net2": "42:e6:20:d1:56:a0",
            "net3": "92:40:c4:48:e6:52",
            "net4": "1a:35:7d:1a:99:5c",
            "net5": "c6:fe:d7:8f:a6:27",
            "net6": "5e:14:3a:62:c4:03",
            "net7": "6a:bb:d5:16:e8:36",
            "net8": "3a:a0:5d:03:6c:d9",
            "net9": "96:ad:92:7a:a4:9d"
        },
        "leaf_1_0_9": {
            "net0": "82:ae:b2:6d:f3:ae",
            "net1": "1e:67:23:65:86:c9",
            "net10": "ce:1e:dd:d4:ba:42",
            "net11": "b2:3e:35:d8:d5:70",
            "net12": "12:0a:1f:e0:fa:d3",
            "net2": "86:23:c3:79:18:37",
            "net3": "62:98:72:5c:5c:f2",
            "net4": "7a:74:82:97:11:e5",
            "net5": "0a:47:ae:2d:a2:14",
            "net6": "f2:09:78:8e:5b:4b",
            "net7": "ea:00:fe:fc:c6:86",
            "net8": "ae:ca:57:03:d4:82",
            "net9": "96:41:95:91:25:a2"
        },
        "leaf_2_0_1": {
            "net0": "52:43:77:54:3a:e5",
            "net1": "d6:78:e8:59:80:7f",
            "net10": "52:f2:ad:80:0c:97",
            "net11": "a2:26:2d:70:15:21",
            "net12": "ca:e0:00:d0:17:70",
            "net2": "c6:e8:7f:b3:ab:70",
            "net3": "82:fe:29:bd:80:18",
            "net4": "f6:58:52:ed:28:60",
            "net5": "26:50:c1:12:ea:2b",
            "net6": "12:d8:3e:2c:32:1f",
            "net7": "e2:eb:2f:59:08:d3",
            "net8": "ae:bf:6e:ff:25:70",
            "net9": "86:44:cf:00:6a:a4"
        },
        "leaf_2_0_10": {
            "net0": "66:5b:ba:ae:da:bc",
            "net1": "3e:55:b7:4c:be:af",
            "net10": "0e:66:2c:de:58:96",
            "net11": "fe:37:d1:c7:1b:20",
            "net12": "42:fc:2f:39:67:4c",
            "net2": "6a:63:9f:03:c5:ef",
            "net3": "d2:7f:fa:32:11:5c",
            "net4": "3e:e8:85:31:02:80",
            "net5": "ca:c4:19:21:98:15",
            "net6": "b6:b5:fc:83:a7:f0",
            "net7": "92:83:1a:20:8d:ed",
            "net8": "96:f4:16:e5:7a:de",
            "net9": "ee:12:cd:9c:80:c5"
        },
        "leaf_2_0_11": {
            "net0": "b2:8b:9e:6e:da:81",
            "net1": "0a:8b:06:21:a9:13",
            "net10": "4a:e6:c1:9e:56:f9",
            "net11": "c2:8a:b3:e3:2f:0a",
            "net12": "96:0c:84:99:ad:ef",
            "net2": "9e:d7:53:e4:78:40",
            "net3": "8e:55:8a:29:46:cc",
            "net4": "b6:11:0c:3e:f1:93",
            "net5": "8e:5f:c7:fa:dc:1a",
            "net6": "52:5b:1b:9f:a6:6f",
            "net7": "76:d2:75:d8:8d:ca",
            "net8": "a2:ed:b8:8c:ae:2f",
            "net9": "7e:ec:d5:fb:4d:56"
        },
        "leaf_2_0_12": {
            "net0": "a6:66:4f:85:c8:a7",
            "net1": "c2:6a:33:f7:fe:24",
            "net10": "42:e9:8e:97:8a:dc",
            "net11": "f2:98:23:c4:87:11",
            "net12": "5e:4c:a3:58:37:bb",
            "net2": "36:09:0c:ff:e0:3a",
            "net3": "de:93:d8:bf:c9:a5",
            "net4": "16:91:f7:37:f5:73",
            "net5": "66:c0:4a:81:e7:50",
            "net6": "22:1e:6c:92:17:a1",
            "net7": "86:a2:fb:d7:6e:7d",
            "net8": "fa:55:fa:61:9a:d9",
            "net9": "36:2c:8e:d6:1f:1c"
        },
        "leaf_2_0_2": {
            "net0": "d2:eb:ad:9a:89:22",
            "net1": "1e:37:88:ec:c5:6f",
            "net10": "1e:37:6b:94:04:eb",
            "net11": "96:bc:b7:60:de:73",
            "net12": "b2:54:07:20:bc:fe",
            "net2": "9e:50:5c:f1:5b:0a",
            "net3": "a2:6b:0a:a9:b1:80",
            "net4": "1e:2e:4d:99:11:01",
            "net5": "2e:d3:05:d3:9c:d6",
            "net6": "ea:4c:bb:dc:ce:72",
            "net7": "d6:21:87:ed:29:e8",
            "net8": "52:3d:2c:a5:d4:e7",
            "net9": "7e:95:51:2e:40:f8"
        },
        "leaf_2_0_3": {
            "net0": "16:cd:d5:87:bd:27",
            "net1": "96:20:14:0a:42:fc",
            "net10": "fa:9a:a8:a0:1e:3d",
            "net11": "ae:01:70:a8:29:c3",
            "net12": "7a:18:c6:be:96:b1",
            "net2": "0e:f4:dc:9e:2d:bb",
            "net3": "b2:fd:34:0b:e4:4a",
            "net4": "3a:ee:82:18:8f:13",
            "net5": "76:eb:f5:bd:c9:03",
            "net6": "d2:8e:de:d0:c3:71",
            "net7": "8a:9d:71:af:a0:13",
            "net8": "56:81:56:0a:3f:50",
            "net9": "b2:9e:2c:34:b7:cc"
        },
        "leaf_2_0_4": {
            "net0": "6e:da:19:82:68:a3",
            "net1": "9a:2b:1a:9f:f2:4b",
            "net10": "3a:8c:17:89:7d:f2",
            "net11": "5a:6a:b7:2c:7b:55",
            "net12": "6a:7f:d6:72:d4:bf",
            "net2": "ee:ad:5c:23:f8:d8",
            "net3": "46:89:be:fc:e0:45",
            "net4": "1a:2f:52:fc:2f:85",
            "net5": "b6:15:40:78:aa:ee",
            "net6": "ce:0f:8a:2e:d5:c7",
            "net7": "aa:a1:73:5e:58:b5",
            "net8": "6a:3e:48:15:3a:0a",
            "net9": "92:fe:a9:68:29:4d"
        },
        "leaf_2_0_5": {
            "net0": "a6:1b:93:01:6c:70",
            "net1": "0e:d9:d7:1e:09:4f",
            "net10": "9a:21:8d:93:65:a9",
            "net11": "4a:f0:7f:e2:04:0e",
            "net12": "c2:a9:90:13:89:a4",
            "net2": "4a:ea:3c:8e:39:a3",
            "net3": "5a:88:fd:0c:53:78",
            "net4": "32:25:11:80:a6:c6",
            "net5": "be:df:00:c7:b4:5a",
            "net6": "36:da:c7:26:ed:27",
            "net7": "d6:9a:1b:37:39:c8",
            "net8": "2a:40:c0:dc:70:6c",
            "net9": "3a:55:28:72:0e:b7"
        },
        "leaf_2_0_6": {
            "net0": "aa:14:e4:e0:96:d0",
            "net1": "56:fd:36:d4:bf:22",
            "net10": "4e:a9:8d:86:b8:37",
            "net11": "ea:1a:ef:ca:b4:88",
            "net12": "26:f3:bf:19:bd:26",
            "net2": "56:50:0d:41:e4:f6",
            "net3": "32:60:57:01:1f:00",
            "net4": "46:0f:31:83:c6:0c",
            "net5": "ca:f3:0a:00:b9:f1",
            "net6": "ba:57:59:6c:a3:6c",
            "net7": "5e:98:61:31:b1:b3",
            "net8": "3e:57:69:6b:15:23",
            "net9": "d2:05:87:53:ec:f8"
        },
        "leaf_2_0_7": {
            "net0": "aa:cf:bd:95:c2:93",
            "net1": "9a:6c:af:23:ca:41",
            "net10": "3a:d1:77:8d:3d:30",
            "net11": "fa:00:2e:4d:31:54",
            "net12": "06:1f:c6:bd:ac:a7",
            "net2": "0a:4b:1d:ce:94:3f",
            "net3": "16:45:fe:ea:2f:0e",
            "net4": "16:b2:ea:d9:8d:b7",
            "net5": "ee:1e:b7:cc:af:7d",
            "net6": "aa:54:5c:99:28:94",
            "net7": "52:4b:a5:e0:c3:8a",
            "net8": "52:da:fe:2b:69:07",
            "net9": "42:00:2f:02:1b:9b"
        },
        "leaf_2_0_8": {
            "net0": "5e:29:b7:58:83:69",
            "net1": "4e:c5:79:66:70:f2",
            "net10": "4e:48:38:9b:e3:22",
            "net11": "e6:3d:97:2b:83:c0",
            "net12": "22:00:be:ff:58:2f",
            "net2": "da:ce:84:9e:b8:18",
            "net3": "d2:bf:92:0a:b7:59",
            "net4": "1e:30:1d:76:44:36",
            "net5": "b6:8e:57:ff:4c:01",
            "net6": "4a:fe:5f:b3:0c:8d",
            "net7": "16:da:8a:02:0a:46",
            "net8": "a6:b1:e3:6f:56:78",
            "net9": "92:e1:c5:04:4a:c9"
        },
        "leaf_2_0_9": {
            "net0": "36:76:8a:40:51:3a",
            "net1": "7e:4b:9f:39:bc:36",
            "net10": "ee:ba:ff:5f:31:8e",
            "net11": "ea:a5:66:be:cc:68",
            "net12": "3e:70:91:c6:2b:47",
            "net2": "62:b5:15:5c:d5:6d",
            "net3": "96:21:78:b4:f4:30",
            "net4": "12:d5:53:30:44:4c",
            "net5": "9e:af:fc:9b:5b:1b",
            "net6": "9a:5d:7c:ae:e4:8d",
            "net7": "5a:9a:83:f6:da:fd",
            "net8": "06:f6:54:39:9d:bf",
            "net9": "d6:29:20:3a:e2:4a"
        },
        "spine_1_1_1": {
            "net0": "ca:5c:a0:63:08:05",
            "net1": "9a:d8:bf:b4:6e:e0",
            "net10": "ee:f0:2e:d0:82:93",
            "net11": "b2:f2:63:15:75:29",
            "net12": "46:53:7c:8f:fc:6d",
            "net13": "ee:10:a1:0b:71:d9",
            "net14": "de:f4:0f:5f:6f:bb",
            "net15": "7e:59:d1:20:37:56",
            "net16": "b2:76:6e:bb:e7:0a",
            "net17": "2a:a3:b5:91:e3:59",
            "net18": "8e:12:95:09:0e:33",
            "net19": "76:f7:a9:3e:73:af",
            "net2": "6e:ea:cc:fc:b5:59",
            "net20": "56:7e:f6:0b:23:fa",
            "net21": "c6:6e:c6:90:7c:6b",
            "net22": "66:67:b8:30:9d:d4",
            "net23": "82:b5:ab:7a:5f:4f",
            "net3": "b6:70:d7:bc:ca:47",
            "net4": "4e:58:d5:44:f6:12",
            "net5": "5a:48:01:39:8b:03",
            "net6": "ee:d8:90:72:03:13",
            "net7": "f6:67:8f:a8:7a:c9",
            "net8": "ca:7c:c7:74:a2:0e",
            "net9": "76:a5:3a:c7:38:7a"
        },
        "spine_1_1_10": {
            "net0": "36:31:94:d0:a5:50",
            "net1": "de:9d:41:d5:98:c6",
            "net10": "4e:aa:1b:d9:e2:c2",
            "net11": "d6:c9:8d:51:f6:21",
            "net12": "be:74:d6:fe:77:91",
            "net13": "aa:bf:3f:e7:8e:f1",
            "net14": "0e:a4:41:57:18:23",
            "net15": "da:70:25:e8:ad:72",
            "net16": "06:4a:4a:7c:36:4b",
            "net17": "fa:4d:31:6e:d0:40",
            "net18": "9a:de:7a:95:67:36",
            "net19": "3a:6a:37:56:50:7d",
            "net2": "06:26:bb:e0:0a:ec",
            "net20": "b6:9f:c3:bf:34:a1",
            "net21": "66:9a:73:f0:01:27",
            "net22": "22:2b:5a:aa:1d:a5",
            "net23": "2a:34:86:69:f2:1f",
            "net3": "d2:01:f4:12:a0:12",
            "net4": "4e:4a:92:ce:7a:2f",
            "net5": "fe:1d:47:33:7f:73",
            "net6": "1a:00:fc:30:6b:d3",
            "net7": "8a:43:71:ed:b9:b4",
            "net8": "d2:2f:04:ad:01:8a",
            "net9": "f6:e3:1f:5d:af:5e"
        },
        "spine_1_1_11": {
            "net0": "0a:ae:6d:78:01:5b",
            "net1": "46:7d:29:a9:ed:a2",
            "net10": "e6:26:5f:01:bb:0f",
            "net11": "96:61:07:6f:4b:8d",
            "net12": "3e:b4:ec:22:f3:3d",
            "net13": "9a:07:77:3c:19:17",
            "net14": "32:29:6d:a5:cd:25",
            "net15": "56:3e:fe:07:61:7e",
            "net16": "ea:98:2f:5e:33:39",
            "net17": "8e:8c:06:ea:03:ac",
            "net18": "16:cd:31:8c:17:5c",
            "net19": "e2:7c:4c:e0:5c:4d",
            "net2": "56:e6:67:5d:9c:b2",
            "net20": "1e:f3:d1:39:0f:1f",
            "net21": "ba:d8:ab:bd:3e:06",
            "net22": "72:35:8c:b5:21:c0",
            "net23": "a2:95:94:6c:d9:ed",
            "net3": "b6:0d:8e:9f:fb:46",
            "net4": "42:00:b6:52:05:78",
            "net5": "92:10:75:29:ba:ee",
            "net6": "d6:a8:a4:db:e3:26",
            "net7": "0a:2c:15:fa:f4:02",
            "net8": "2a:6b:94:82:65:32",
            "net9": "7a:b9:7c:4d:a9:48"
        },
        "spine_1_1_12": {
            "net0": "36:61:40:0e:c6:2b",
            "net1": "5a:65:05:16:ef:56",
            "net10": "0a:b2:bc:45:12:47",
            "net11": "76:5f:bb:ea:31:11",
            "net12": "6e:c7:be:cd:6e:e2",
            "net13": "2e:2b:6d:5c:a2:67",
            "net14": "4e:86:a4:0d:73:65",
            "net15": "9e:55:f3:96:72:85",
            "net16": "06:06:c3:c6:0f:ea",
            "net17": "4a:73:c3:6e:f2:9e",
            "net18": "9a:c2:cd:7c:3a:4b",
            "net19": "12:54:27:f2:8c:05",
            "net2": "d6:b6:ed:a3:92:2f",
            "net20": "ee:95:81:e0:a2:ff",
            "net21": "92:5e:e0:96:62:4d",
            "net22": "02:03:97:8a:8f:1c",
            "net23": "4a:af:c1:d8:f2:68",
            "net3": "8e:e1:a9:8f:f0:14",
            "net4": "ba:e0:c4:5a:0c:24",
            "net5": "b6:46:b5:5a:f4:8f",
            "net6": "2e:d8:12:5a:ee:0e",
            "net7": "42:92:93:5a:7c:6e",
            "net8": "52:52:1c:93:aa:08",
            "net9": "06:ce:12:06:57:54"
        },
        "spine_1_1_2": {
            "net0": "4e:cb:03:36:12:41",
            "net1": "ee:ec:bd:6d:da:01",
            "net10": "2a:c5:d5:80:c6:87",
            "net11": "12:15:3d:b2:c5:11",
            "net12": "3e:d1:e2:5d:10:4d",
            "net13": "de:3c:eb:db:78:83",
            "net14": "2a:84:57:ef:96:23",
            "net15": "da:3b:d3:7a:00:ee",
            "net16": "e2:05:d2:b6:3c:9d",
            "net17": "2e:38:b6:af:01:06",
            "net18": "8a:a3:13:64:b4:4d",
            "net19": "ba:a9:a3:53:0a:d2",
            "net2": "ce:56:0b:6f:7b:8a",
            "net20": "96:e4:76:3e:26:8f",
            "net21": "b6:30:da:6d:0f:db",
            "net22": "ce:af:37:8d:25:0a",
            "net23": "86:35:dc:e8:c1:49",
            "net3": "3e:f2:ee:94:3a:9e",
            "net4": "1e:18:ef:fe:18:c1",
            "net5": "f6:e4:9d:1b:ad:99",
            "net6": "9a:62:cd:1d:df:36",
            "net7": "ce:ec:3d:da:c3:28",
            "net8": "5e:b4:85:ba:86:17",
            "net9": "66:0d:61:3a:8a:b9"
        },
        "spine_1_1_3": {
            "net0": "1e:e5:07:df:7a:1c",
            "net1": "7a:02:29:e2:d7:6f",
            "net10": "a6:3a:39:65:7e:ae",
            "net11": "ba:4f:10:a0:5c:f6",
            "net12": "ba:6b:f8:ea:e9:47",
            "net13": "7a:87:ae:d8:29:66",
            "net14": "6e:72:5e:1e:41:8f",
            "net15": "3e:f8:2d:e6:a5:75",
            "net16": "de:d3:b8:eb:d8:b9",
            "net17": "d2:69:b5:c2:a8:de",
            "net18": "16:6a:9a:5c:91:89",
            "net19": "56:c1:17:37:60:40",
            "net2": "52:a6:90:23:3f:a0",
            "net20": "66:2f:5d:ef:39:9d",
            "net21": "6e:8c:43:26:13:4b",
            "net22": "3a:fc:ec:7e:c8:5c",
            "net23": "82:bb:05:44:f5:91",
            "net3": "c2:6f:48:28:9b:ca",
            "net4": "1e:f0:75:7d:a8:48",
            "net5": "4a:17:50:bb:ff:bd",
            "net6": "7e:c4:c1:4b:21:76",
            "net7": "ee:e5:8d:c4:07:3a",
            "net8": "22:04:67:42:fb:f2",
            "net9": "9e:ab:5d:58:11:9d"
        },
        "spine_1_1_4": {
            "net0": "2e:d7:07:d3:05:c4",
            "net1": "5a:b4:af:3b:db:16",
            "net10": "1a:7e:e3:3a:73:0f",
            "net11": "b6:f4:32:de:04:67",
            "net12": "42:5e:a5:d4:49:bf",
            "net13": "4e:f8:29:5c:03:28",
            "net14": "ba:91:61:d3:98:6c",
            "net15": "f6:8d:37:21:ce:47",
            "net16": "fa:eb:40:51:7a:bc",
            "net17": "fe:e9:07:93:e0:17",
            "net18": "e6:60:cc:cd:2a:92",
            "net19": "46:30:f0:f7:2f:3f",
            "net2": "62:d4:c8:35:72:c1",
            "net20": "3e:a6:ff:1a:fd:9b",
            "net21": "16:5a:09:0c:a5:e9",
            "net22": "de:60:13:5e:1d:1e",
            "net23": "72:79:22:d2:17:53",
            "net3": "76:a7:34:f2:8c:81",
            "net4": "ea:2b:e7:88:d9:04",
            "net5": "3a:c2:5e:75:e5:c2",
            "net6": "02:02:c7:cd:ed:ff",
            "net7": "86:6b:a7:1f:22:b4",
            "net8": "46:3d:48:50:6e:64",
            "net9": "1e:ae:dd:d2:e0:db"
        },
        "spine_1_1_5": {
            "net0": "8e:20:e0:62:64:27",
            "net1": "da:43:d2:c6:31:28",
            "net10": "32:b8:6d:60:33:ab",
            "net11": "be:93:5e:4d:ba:95",
            "net12": "16:1f:43:d9:d2:6d",
            "net13": "3a:a4:ee:7e:eb:3a",
            "net14": "b2:d8:92:56:9d:ef",
            "net15": "f6:6f:ab:e4:04:58",
            "net16": "d2:6d:5d:12:4a:a8",
            "net17": "8e:ca:fc:fa:0d:ec",
            "net18": "9a:1f:f2:b3:17:01",
            "net19": "9a:99:b3:cd:66:f0",
            "net2": "9a:50:cb:3d:06:92",
            "net20": "c6:8f:13:b0:22:04",
            "net21": "76:1e:fb:df:6e:bd",
            "net22": "9a:3d:0c:5c:fc:5b",
            "net23": "8e:6d:45:17:c6:31",
            "net3": "f2:53:06:f6:61:20",
            "net4": "a2:72:76:f4:36:5b",
            "net5": "ea:cd:65:03:c6:b9",
            "net6": "16:88:9c:85:c4:a5",
            "net7": "f6:d6:bb:1f:01:fb",
            "net8": "7e:ea:ef:22:30:f2",
            "net9": "5a:33:5b:0f:61:c6"
        },
        "spine_1_1_6": {
            "net0": "ae:32:eb:2e:fb:f4",
            "net1": "be:04:5b:4c:cb:af",
            "net10": "7a:03:f1:a8:ce:51",
            "net11": "da:7e:bb:34:06:a6",
            "net12": "46:e0:86:5e:2c:92",
            "net13": "46:2a:ba:1f:d1:8a",
            "net14": "0a:47:c2:a0:ee:bc",
            "net15": "32:08:e8:f9:dc:50",
            "net16": "6a:74:c8:7e:c9:da",
            "net17": "2e:c7:6b:8a:87:a2",
            "net18": "a2:a2:63:43:4f:83",
            "net19": "c6:d5:55:94:78:90",
            "net2": "8e:7a:47:c8:6d:8c",
            "net20": "0a:18:56:d2:9d:74",
            "net21": "0e:e0:61:f7:73:39",
            "net22": "3a:ee:98:6e:58:e1",
            "net23": "d6:8b:00:37:40:c0",
            "net3": "d6:24:3d:72:36:4d",
            "net4": "a6:e9:89:d3:f0:73",
            "net5": "fe:61:92:6f:d8:d5",
            "net6": "42:d2:98:83:2e:b3",
            "net7": "62:3c:aa:bf:6c:48",
            "net8": "b6:92:c7:95:01:db",
            "net9": "ba:a2:6a:d7:29:4f"
        },
        "spine_1_1_7": {
            "net0": "5a:59:95:0b:e6:55",
            "net1": "7e:ac:f5:a9:20:f2",
            "net10": "4e:51:4e:e2:2b:11",
            "net11": "06:7c:85:dd:d2:98",
            "net12": "1e:3f:90:24:83:6d",
            "net13": "06:aa:e3:5a:ba:ab",
            "net14": "5e:49:d8:1e:54:c7",
            "net15": "92:75:b7:68:88:b1",
            "net16": "c2:3b:3e:ba:ad:a2",
            "net17": "2e:bb:24:dd:2e:6a",
            "net18": "9a:e9:8b:0c:3b:0f",
            "net19": "d6:48:aa:91:a0:c7",
            "net2": "3a:28:85:9c:62:ad",
            "net20": "7a:c8:b9:06:f9:6e",
            "net21": "c6:21:7e:22:1c:71",
            "net22": "da:b6:94:ea:3f:73",
            "net23": "da:29:4d:9e:58:a7",
            "net3": "a2:9b:f9:d3:c5:da",
            "net4": "5e:b4:0f:a9:cb:ab",
            "net5": "ae:bc:ca:bc:d9:b2",
            "net6": "b2:7e:34:5d:1b:63",
            "net7": "ca:24:09:2b:2b:0e",
            "net8": "3e:89:4c:43:d9:02",
            "net9": "76:08:8a:20:0c:90"
        },
        "spine_1_1_8": {
            "net0": "c6:25:c2:b3:f7:37",
            "net1": "22:cf:8a:86:3b:6d",
            "net10": "16:75:a7:9c:b1:b3",
            "net11": "de:03:25:50:b4:1b",
            "net12": "06:dc:af:d2:96:af",
            "net13": "52:5f:6c:73:98:cf",
            "net14": "36:40:7f:d8:6c:da",
            "net15": "0e:e4:8e:9f:51:ed",
            "net16": "f6:47:89:26:e5:e8",
            "net17": "f6:4b:49:11:52:4e",
            "net18": "32:ba:c4:24:6d:9a",
            "net19": "b6:07:ea:e1:30:a9",
            "net2": "de:8d:ec:81:43:d9",
            "net20": "ca:39:2e:fc:54:e6",
            "net21": "fa:92:f3:46:0a:ef",
            "net22": "ca:37:5a:e3:ad:9b",
            "net23": "c6:34:79:12:a0:7c",
            "net3": "2e:d4:a5:e4:bc:09",
            "net4": "fe:2f:e9:92:ef:2c",
            "net5": "06:b2:a7:73:76:93",
            "net6": "86:67:64:9a:71:9f",
            "net7": "a2:78:c8:8c:b8:16",
            "net8": "d2:2d:40:ae:8d:88",
            "net9": "5a:6f:54:a4:d9:a1"
        },
        "spine_1_1_9": {
            "net0": "6a:64:64:da:4e:b5",
            "net1": "5a:96:96:db:43:16",
            "net10": "0e:e2:ac:b6:25:2b",
            "net11": "de:f3:f8:5b:13:85",
            "net12": "6e:f0:93:47:a1:ef",
            "net13": "1a:a7:dd:3d:06:65",
            "net14": "fe:a2:55:0f:87:cd",
            "net15": "8a:bc:b0:26:05:d2",
            "net16": "82:1e:f8:17:b3:da",
            "net17": "62:0d:7c:45:2a:b8",
            "net18": "76:11:cf:b3:a7:76",
            "net19": "36:eb:c2:56:1e:42",
            "net2": "36:6e:5a:56:29:f9",
            "net20": "ce:30:3e:92:50:54",
            "net21": "0a:b1:bd:40:6d:bf",
            "net22": "c6:16:d0:72:10:8e",
            "net23": "26:ce:f1:20:3d:fa",
            "net3": "1e:1c:cd:54:a0:0e",
            "net4": "ae:5c:d8:42:cb:94",
            "net5": "c6:15:dd:46:0f:66",
            "net6": "96:1f:4a:7e:64:54",
            "net7": "0e:7f:91:f0:46:c8",
            "net8": "c2:ee:00:82:00:50",
            "net9": "c2:a5:f2:88:59:a4"
        },
        "spine_2_1_1": {
            "net0": "32:0a:85:0b:10:56",
            "net1": "76:f4:46:1a:c0:25",
            "net10": "3e:7f:d9:a1:bb:c8",
            "net11": "06:c1:4f:6b:6a:63",
            "net12": "c2:1c:e5:8e:9a:0b",
            "net13": "da:3b:b9:da:3c:f2",
            "net14": "8a:6e:89:7b:ff:59",
            "net15": "4e:80:f5:78:e7:f4",
            "net16": "ae:8c:56:4f:7f:17",
            "net17": "86:2b:b1:9c:5b:32",
            "net18": "d2:de:09:d3:a9:b8",
            "net19": "fe:49:3d:dc:e7:48",
            "net2": "76:7b:77:04:65:7e",
            "net20": "ee:d5:2b:28:de:cf",
            "net21": "f6:61:20:71:1f:69",
            "net22": "ce:1d:83:5d:ea:e2",
            "net23": "d2:85:3e:10:ad:73",
            "net3": "c2:ec:29:2f:98:ad",
            "net4": "ba:55:bb:48:58:dc",
            "net5": "b6:38:e4:dd:8c:9f",
            "net6": "02:76:12:9d:cf:a5",
            "net7": "da:ee:60:0e:90:b5",
            "net8": "06:0e:51:a8:cc:d4",
            "net9": "4e:f3:d1:04:41:72"
        },
        "spine_2_1_10": {
            "net0": "a6:05:68:42:8a:d7",
            "net1": "6e:a6:e1:13:37:89",
            "net10": "16:42:6e:7e:33:10",
            "net11": "b2:e9:0c:a9:38:b2",
            "net12": "0e:b8:b5:c8:29:cf",
            "net13": "62:f3:cb:51:0e:8e",
            "net14": "c2:95:2f:53:4c:5f",
            "net15": "32:a0:dd:5c:00:a7",
            "net16": "b6:5d:81:b7:49:5c",
            "net17": "ea:f9:31:9e:94:d8",
            "net18": "d6:9a:f9:d7:8e:b0",
            "net19": "ea:04:06:79:05:a4",
            "net2": "ae:ee:71:f0:ed:97",
            "net20": "da:87:f7:38:2c:7b",
            "net21": "0a:87:cc:16:c8:ee",
            "net22": "be:05:5d:5d:d0:79",
            "net23": "c6:8b:60:e1:6c:bd",
            "net3": "2e:b6:37:f6:e9:74",
            "net4": "0e:7d:87:ed:06:b4",
            "net5": "66:e6:71:26:b7:bb",
            "net6": "fa:66:1c:44:7d:cc",
            "net7": "22:3b:fd:1a:d7:ff",
            "net8": "7a:ec:1e:31:5d:59",
            "net9": "12:ae:33:8b:de:56"
        },
        "spine_2_1_11": {
            "net0": "f2:ff:32:83:bc:e0",
            "net1": "2e:c2:56:6a:05:fa",
            "net10": "06:12:0a:f6:df:6f",
            "net11": "de:a9:6b:18:f1:dd",
            "net12": "3a:55:11:17:d2:99",
            "net13": "0a:e9:29:e0:f7:2a",
            "net14": "c2:ab:22:d5:f8:5b",
            "net15": "6a:f1:d8:71:21:09",
            "net16": "22:8e:99:72:5b:98",
            "net17": "3e:a0:61:f6:c0:cc",
            "net18": "1e:af:b9:70:51:98",
            "net19": "26:c2:43:60:bf:18",
            "net2": "c6:d8:b5:e8:14:23",
            "net20": "ba:42:d8:2b:0d:88",
            "net21": "c6:60:de:a4:1a:2e",
            "net22": "9a:58:37:94:64:37",
            "net23": "ae:a8:8e:ba:5d:3f",
            "net3": "c2:52:88:8b:99:f7",
            "net4": "42:df:a8:8c:8f:2e",
            "net5": "2e:b7:9a:d2:cf:52",
            "net6": "fa:98:ee:89:58:09",
            "net7": "06:5f:82:7d:f2:1d",
            "net8": "56:93:92:8f:63:48",
            "net9": "46:3a:dc:45:36:6b"
        },
        "spine_2_1_12": {
            "net0": "72:e1:1a:33:5a:94",
            "net1": "66:1c:3d:89:6a:ae",
            "net10": "b2:44:ce:4c:14:be",
            "net11": "aa:0d:96:e8:fe:bf",
            "net12": "42:e6:c0:14:18:9b",
            "net13": "36:00:21:15:2b:eb",
            "net14": "4a:dd:d0:a0:d3:c6",
            "net15": "ce:15:19:39:1e:8c",
            "net16": "7a:99:10:b8:a0:ab",
            "net17": "16:3d:0e:a3:22:ac",
            "net18": "2a:8b:91:78:88:c2",
            "net19": "3a:a8:a0:f6:78:ba",
            "net2": "8a:4e:8a:45:fb:38",
            "net20": "ce:fb:35:9b:22:59",
            "net21": "1e:1f:dd:b2:0a:c4",
            "net22": "9a:45:a7:33:17:e6",
            "net23": "5a:dc:bb:fe:8c:ef",
            "net3": "d2:d5:12:12:1c:a3",
            "net4": "16:11:dc:04:8f:e9",
            "net5": "a2:4b:28:23:8b:60",
            "net6": "ee:ea:73:9f:38:f3",
            "net7": "1e:8c:a6:6c:2c:ca",
            "net8": "82:23:4d:8c:be:0f",
            "net9": "4a:c5:10:59:ca:2c"
        },
        "spine_2_1_2": {
            "net0": "ea:a9:66:d0:77:29",
            "net1": "72:4f:9a:ba:86:b6",
            "net10": "f2:91:bf:c3:b0:fd",
            "net11": "da:0f:8d:9b:8a:e1",
            "net12": "26:eb:a4:0e:b9:0c",
            "net13": "d2:f6:fa:82:23:05",
            "net14": "ae:f9:10:ce:e9:ec",
            "net15": "86:b3:ed:ae:c2:c4",
            "net16": "7e:b6:a4:bb:65:49",
            "net17": "6a:d7:92:3e:d6:55",
            "net18": "1e:4e:7e:9c:79:42",
            "net19": "06:6f:59:fe:40:48",
            "net2": "f2:d8:6f:6f:26:c6",
            "net20": "3e:21:1d:93:db:8d",
            "net21": "f2:94:be:17:c2:ee",
            "net22": "9a:47:31:01:eb:b8",
            "net23": "aa:31:dc:12:95:4b",
            "net3": "8e:38:20:4f:f6:02",
            "net4": "52:b4:14:c6:67:2f",
            "net5": "d6:8c:d8:91:0f:f4",
            "net6": "e6:97:cf:35:6c:de",
            "net7": "5a:0e:65:a6:cc:d7",
            "net8": "d2:84:c9:af:7f:56",
            "net9": "fa:f7:9d:8c:e3:c4"
        },
        "spine_2_1_3": {
            "net0": "22:10:d4:8e:c0:2a",
            "net1": "fe:f8:c4:ac:03:6c",
            "net10": "4a:21:be:69:66:e5",
            "net11": "26:f1:2a:36:79:19",
            "net12": "76:59:13:73:09:f1",
            "net13": "76:98:9c:95:2e:45",
            "net14": "ea:86:fc:66:e2:1f",
            "net15": "a6:2f:07:a4:81:b9",
            "net16": "d2:36:49:11:3f:f2",
            "net17": "2e:8b:3a:12:ae:ea",
            "net18": "6a:69:45:5b:e8:57",
            "net19": "9a:4e:59:33:fc:3b",
            "net2": "9e:30:cf:f0:98:ed",
            "net20": "fe:a6:12:c6:2d:b5",
            "net21": "4a:4c:3b:3e:20:74",
            "net22": "72:6c:ac:71:aa:6a",
            "net23": "ee:46:36:e5:aa:9b",
            "net3": "e6:df:a0:81:94:ea",
            "net4": "0e:24:6d:62:2a:95",
            "net5": "06:7e:22:c9:d5:f9",
            "net6": "1a:98:90:cc:5f:6a",
            "net7": "fe:16:bf:f8:83:5a",
            "net8": "46:51:ca:25:50:55",
            "net9": "66:7d:1f:27:8b:8b"
        },
        "spine_2_1_4": {
            "net0": "aa:d9:47:9d:b1:c5",
            "net1": "c6:47:cc:cb:11:e0",
            "net10": "76:ef:dd:ec:66:84",
            "net11": "ce:1a:a1:ae:6c:d8",
            "net12": "26:fe:35:38:21:71",
            "net13": "82:f5:08:8a:92:00",
            "net14": "4a:46:83:c1:57:a4",
            "net15": "f2:46:99:33:a2:62",
            "net16": "0a:36:04:30:0c:54",
            "net17": "4e:a7:ea:d5:80:4a",
            "net18": "4e:ce:35:6a:fb:90",
            "net19": "2e:4f:27:8d:c7:dd",
            "net2": "be:ba:84:6d:6a:7e",
            "net20": "ca:60:42:6c:c0:08",
            "net21": "82:c4:d7:29:65:42",
            "net22": "5e:71:95:55:e0:ed",
            "net23": "22:83:61:a4:f6:bc",
            "net3": "76:2f:6d:00:08:ea",
            "net4": "5e:1b:a1:85:21:89",
            "net5": "9a:00:a1:0a:10:34",
            "net6": "86:22:1b:42:9c:ac",
            "net7": "ce:b7:90:8c:28:25",
            "net8": "f2:a3:18:0d:b2:c1",
            "net9": "46:ad:8b:7d:1c:de"
        },
        "spine_2_1_5": {
            "net0": "f6:a7:8d:6d:6a:27",
            "net1": "6e:30:ca:5f:28:1e",
            "net10": "46:72:cb:ae:94:29",
            "net11": "6a:07:f3:eb:87:b1",
            "net12": "26:f9:81:b1:28:66",
            "net13": "ca:77:25:af:e9:71",
            "net14": "2a:85:c8:60:68:59",
            "net15": "d6:f8:1e:20:aa:30",
            "net16": "26:58:cc:e3:b6:e9",
            "net17": "2a:07:2a:bc:d3:a3",
            "net18": "ee:98:8f:26:4e:3d",
            "net19": "4a:2d:5c:b2:68:43",
            "net2": "76:75:5f:a2:28:da",
            "net20": "8e:ac:23:26:84:ad",
            "net21": "c6:83:da:da:c6:92",
            "net22": "4e:da:00:ad:96:35",
            "net23": "62:24:4d:a1:04:bc",
            "net3": "de:d0:9b:78:45:ff",
            "net4": "82:c6:99:77:32:cd",
            "net5": "02:06:b1:63:5f:f3",
            "net6": "82:86:74:5e:d3:23",
            "net7": "7a:13:02:a5:c1:8e",
            "net8": "22:ba:99:13:29:7d",
            "net9": "3e:68:22:07:a4:bd"
        },
        "spine_2_1_6": {
            "net0": "a2:e3:ba:e4:cb:93",
            "net1": "06:13:44:84:17:41",
            "net10": "0a:96:44:74:5b:dd",
            "net11": "b6:c8:1d:76:f0:37",
            "net12": "42:08:a8:8f:d2:35",
            "net13": "76:9e:73:ab:14:14",
            "net14": "be:65:e5:da:3e:ac",
            "net15": "96:c2:ce:fc:ed:66",
            "net16": "f6:59:6e:3f:66:05",
            "net17": "46:17:5c:99:b2:13",
            "net18": "6a:15:00:64:79:c3",
            "net19": "d6:c7:a8:cf:b0:9f",
            "net2": "9e:a4:62:56:b1:dc",
            "net20": "2a:34:94:ed:45:f5",
            "net21": "f6:5e:bd:4c:7b:33",
            "net22": "8e:c0:a0:5b:81:08",
            "net23": "46:4f:8a:15:63:94",
            "net3": "1a:b7:86:df:d4:02",
            "net4": "32:52:b4:6b:c2:31",
            "net5": "de:6d:6b:38:30:59",
            "net6": "ee:f7:ba:bd:a7:08",
            "net7": "e2:c5:b4:4c:64:99",
            "net8": "f2:80:82:20:38:64",
            "net9": "fa:1f:8d:cb:ae:e5"
        },
        "spine_2_1_7": {
            "net0": "ee:c4:65:f9:d3:73",
            "net1": "ce:3f:df:5b:29:b9",
            "net10": "c2:ef:dd:dc:00:de",
            "net11": "8a:4c:08:1e:1d:11",
            "net12": "92:bd:5b:a3:ec:10",
            "net13": "ee:9b:67:96:a4:2b",
            "net14": "16:ba:28:09:64:33",
            "net15": "ee:28:0a:24:2b:f1",
            "net16": "d6:d8:41:6d:71:e5",
            "net17": "b2:c4:d6:70:5f:c6",
            "net18": "0e:f8:5d:02:87:51",
            "net19": "2a:a7:f5:1c:b9:fe",
            "net2": "2e:02:49:3b:91:d3",
            "net20": "4a:97:3b:37:5a:7b",
            "net21": "ba:af:aa:3b:7c:03",
            "net22": "42:17:15:09:63:74",
            "net23": "32:d3:e7:10:b0:1e",
            "net3": "1a:0c:c2:da:e0:3c",
            "net4": "f2:d1:19:0e:64:bf",
            "net5": "9a:cc:c5:6e:02:c8",
            "net6": "0a:dc:83:52:ee:6e",
            "net7": "26:09:cf:93:be:7c",
            "net8": "a2:0c:8b:a7:38:b9",
            "net9": "92:c4:de:ef:d9:6a"
        },
        "spine_2_1_8": {
            "net0": "22:45:ed:87:ac:8c",
            "net1": "9a:e2:9a:fc:86:d5",
            "net10": "06:f3:67:bf:31:d2",
            "net11": "0e:2f:2d:58:79:db",
            "net12": "46:8d:63:82:1c:17",
            "net13": "02:b6:3a:0e:fe:77",
            "net14": "1e:e5:d8:5e:77:5d",
            "net15": "a2:08:f4:05:01:1f",
            "net16": "2a:55:cf:95:bb:5f",
            "net17": "fe:2b:72:83:bb:ac",
            "net18": "c6:f4:c8:71:dd:5a",
            "net19": "7a:8d:99:30:c5:30",
            "net2": "a2:c1:2f:88:35:b8",
            "net20": "c6:52:d5:8a:fa:f8",
            "net21": "b6:82:75:e3:d8:4e",
            "net22": "da:77:88:1e:e7:e6",
            "net23": "c6:ad:b1:e0:62:6c",
            "net3": "d2:cf:1d:69:e3:7e",
            "net4": "4a:89:c9:65:ce:61",
            "net5": "66:0c:ec:bd:3e:df",
            "net6": "96:0a:72:00:73:6e",
            "net7": "46:6d:de:93:ce:a9",
            "net8": "e2:87:d7:96:35:27",
            "net9": "ea:bf:69:8a:bb:a4"
        },
        "spine_2_1_9": {
            "net0": "76:e4:00:b9:c5:49",
            "net1": "22:09:96:81:ad:fa",
            "net10": "16:c4:9b:ad:d1:ae",
            "net11": "3a:c1:5f:c4:db:6e",
            "net12": "32:95:25:ad:42:ee",
            "net13": "46:55:55:bd:1a:08",
            "net14": "3a:ea:35:c6:f8:b6",
            "net15": "b2:e9:6b:5c:b5:21",
            "net16": "9a:d8:20:a4:b5:8a",
            "net17": "9e:55:6a:fc:bf:c2",
            "net18": "46:3a:7f:67:6d:90",
            "net19": "d6:a4:29:b3:24:59",
            "net2": "6e:c4:39:d2:27:48",
            "net20": "d6:5a:88:f1:40:45",
            "net21": "ae:63:5a:5f:d9:7d",
            "net22": "be:7b:36:49:df:c4",
            "net23": "2a:81:5a:ee:9e:26",
            "net3": "d2:63:01:8d:eb:a3",
            "net4": "46:b6:51:bc:1c:5f",
            "net5": "be:47:e3:94:bd:20",
            "net6": "f6:50:79:10:bb:6f",
            "net7": "6e:b3:b8:67:be:b9",
            "net8": "f6:70:5c:14:83:2b",
            "net9": "fe:dd:b2:a3:6e:a1"
        },
        "tof_1_2_1": {
            "net0": "aa:f0:6d:d5:5b:d7",
            "net1": "62:e5:8f:54:da:3a",
            "net10": "4e:81:16:c1:9a:97",
            "net11": "3e:1f:83:10:e2:65",
            "net12": "6e:bc:b3:8e:3b:8a",
            "net13": "26:ec:cc:cc:72:73",
            "net14": "8a:41:0c:9f:59:db",
            "net15": "ca:46:ea:30:9e:62",
            "net16": "d2:33:b1:2b:93:71",
            "net17": "2e:1a:31:f8:a0:3d",
            "net18": "6e:73:42:b7:46:37",
            "net19": "2a:11:92:3f:8d:6b",
            "net2": "9e:01:54:ea:b9:98",
            "net20": "5a:e3:af:0a:16:50",
            "net21": "72:f8:11:a1:86:ce",
            "net22": "be:85:0f:6c:7d:6f",
            "net23": "02:57:54:67:86:96",
            "net3": "32:1b:4c:92:e5:d3",
            "net4": "7a:c4:42:b6:19:7d",
            "net5": "8a:f7:93:c0:96:4b",
            "net6": "62:71:94:f5:af:4f",
            "net7": "de:41:1f:84:cc:0e",
            "net8": "c2:b7:3f:c3:c7:0e",
            "net9": "3a:7c:b9:6a:6a:91"
        },
        "tof_1_2_10": {
            "net0": "de:c0:58:5d:64:97",
            "net1": "5a:5d:cf:75:88:2f",
            "net10": "7a:54:95:ca:bb:e2",
            "net11": "16:9f:61:ee:40:b0",
            "net12": "a2:dc:0a:e6:9b:60",
            "net13": "8a:c9:51:60:e8:94",
            "net14": "72:05:b5:27:29:25",
            "net15": "a2:a1:f6:71:51:01",
            "net16": "7a:cf:62:e6:58:6c",
            "net17": "82:d9:ab:0a:d5:df",
            "net18": "ce:de:c1:e8:14:61",
            "net19": "aa:a5:b9:f6:8e:06",
            "net2": "26:43:85:fc:d4:48",
            "net20": "9e:43:b4:31:d3:26",
            "net21": "62:b0:24:c1:85:3f",
            "net22": "06:db:7e:53:6d:b8",
            "net23": "06:c7:a7:6d:8c:9b",
            "net3": "c2:f7:cd:b5:77:d0",
            "net4": "a2:00:b8:2a:28:73",
            "net5": "ca:53:9f:0b:70:de",
            "net6": "4a:c0:7f:e7:66:4f",
            "net7": "82:06:7a:f3:e9:10",
            "net8": "0e:84:dc:73:34:12",
            "net9": "92:af:88:ed:c0:00"
        },
        "tof_1_2_11": {
            "net0": "76:52:06:62:d2:a8",
            "net1": "f2:dd:91:ed:f3:f0",
            "net10": "7e:f7:7c:ea:5c:a5",
            "net11": "12:af:3a:8a:90:fb",
            "net12": "4a:fd:8f:b8:a6:f5",
            "net13": "32:86:a2:5f:5f:9c",
            "net14": "6e:86:53:bd:40:69",
            "net15": "2e:ff:1c:65:74:93",
            "net16": "66:cc:da:0d:95:53",
            "net17": "e6:c0:fc:db:4c:90",
            "net18": "46:9a:86:0d:ce:48",
            "net19": "fe:c2:b9:4e:93:02",
            "net2": "8a:c1:c5:69:45:48",
            "net20": "4e:ce:ba:5a:6d:16",
            "net21": "12:e4:89:9c:52:b5",
            "net22": "56:f6:01:98:77:d6",
            "net23": "6a:fa:59:64:f2:95",
            "net3": "1e:9f:3a:16:9e:bf",
            "net4": "02:4d:51:b9:e3:73",
            "net5": "b2:ec:82:e0:a1:f2",
            "net6": "06:aa:f6:eb:8e:3d",
            "net7": "52:e9:66:78:11:c6",
            "net8": "7e:99:24:48:5c:15",
            "net9": "2a:2a:0c:d0:cd:00"
        },
        "tof_1_2_12": {
            "net0": "ca:9e:a8:b0:9c:bd",
            "net1": "aa:77:2b:b3:a9:21",
            "net10": "ae:f1:d5:24:d2:64",
            "net11": "fe:01:d9:c2:86:03",
            "net12": "4e:87:e7:f9:c0:ff",
            "net13": "3e:78:04:69:fb:1c",
            "net14": "3e:dc:45:8e:67:fa",
            "net15": "36:16:43:11:a6:34",
            "net16": "b6:90:3a:2c:3b:59",
            "net17": "f2:71:f5:63:86:f2",
            "net18": "06:f3:ff:63:54:fd",
            "net19": "86:3d:21:7d:98:09",
            "net2": "ca:b9:48:55:85:be",
            "net20": "ae:bc:f9:95:24:04",
            "net21": "be:a1:b9:0d:f4:a3",
            "net22": "3e:76:fd:ab:f7:f5",
            "net23": "ce:78:52:2f:a6:b3",
            "net3": "62:de:18:19:e7:e4",
            "net4": "06:67:1f:c2:44:cb",
            "net5": "a2:91:c3:73:36:34",
            "net6": "8e:28:c8:bd:e6:95",
            "net7": "46:57:a4:4c:e7:3c",
            "net8": "9a:28:d1:a7:2b:90",
            "net9": "aa:71:0f:e4:e3:3e"
        },
        "tof_1_2_2": {
            "net0": "c2:a1:79:ff:15:a3",
            "net1": "5a:5e:6e:4e:04:8f",
            "net10": "46:e9:7e:06:26:b0",
            "net11": "12:4e:b8:e6:1e:a6",
            "net12": "12:c9:e6:c8:60:1c",
            "net13": "66:c1:7d:e1:11:b5",
            "net14": "a2:d7:5c:d4:c2:fe",
            "net15": "7a:07:8d:75:e2:70",
            "net16": "46:bc:e6:b7:18:09",
            "net17": "1a:1c:5a:3e:28:1a",
            "net18": "e2:26:94:fc:df:73",
            "net19": "f2:cb:f6:ba:7b:e5",
            "net2": "36:ed:f1:ce:2a:98",
            "net20": "7e:2d:3b:8d:4f:78",
            "net21": "c2:03:d6:a6:1c:30",
            "net22": "62:45:72:d1:89:f5",
            "net23": "7e:de:b3:87:3c:ff",
            "net3": "62:89:82:b1:56:ca",
            "net4": "de:fc:47:57:d3:58",
            "net5": "d2:64:16:b9:26:ae",
            "net6": "86:ae:b3:18:e4:ee",
            "net7": "de:cd:32:6a:73:6b",
            "net8": "3e:17:e8:8e:db:f4",
            "net9": "b2:63:b1:b2:e1:4a"
        },
        "tof_1_2_3": {
            "net0": "ea:96:dd:e0:80:a8",
            "net1": "e6:c0:61:de:37:67",
            "net10": "f2:00:6c:fc:f3:65",
            "net11": "e6:da:19:61:18:c6",
            "net12": "4a:ef:1c:1f:9f:40",
            "net13": "da:c4:e6:af:a9:8b",
            "net14": "32:12:f6:37:6a:9e",
            "net15": "46:0b:97:e6:17:49",
            "net16": "d2:20:fb:28:b0:7c",
            "net17": "4a:24:35:52:8d:b6",
            "net18": "a6:5b:b9:f3:00:da",
            "net19": "7a:cd:f5:84:74:c8",
            "net2": "72:5a:10:ac:89:11",
            "net20": "ea:0f:71:8e:f6:30",
            "net21": "6a:e2:87:61:a6:6e",
            "net22": "46:6a:64:a5:e8:12",
            "net23": "a2:67:df:bd:ee:93",
            "net3": "ca:f6:f7:3f:ae:9b",
            "net4": "1e:35:2a:50:c8:99",
            "net5": "46:7c:ca:07:2a:15",
            "net6": "b6:1f:ed:fd:36:ed",
            "net7": "f6:a4:63:d6:99:d7",
            "net8": "ce:97:f5:ff:8a:e3",
            "net9": "a6:24:31:5c:2c:dd"
        },
        "tof_1_2_4": {
            "net0": "82:a3:8b:f5:be:41",
            "net1": "ae:0a:d2:9e:95:e4",
            "net10": "86:17:30:b5:24:b3",
            "net11": "5e:d0:18:2e:6b:91",
            "net12": "56:82:2a:e1:86:8d",
            "net13": "96:ed:bc:90:31:d3",
            "net14": "3a:68:cc:30:ed:c6",
            "net15": "3e:f2:ad:ab:2d:d2",
            "net16": "52:71:65:70:a6:f7",
            "net17": "3e:c0:31:2b:93:9e",
            "net18": "ba:33:be:6d:7a:13",
            "net19": "4e:0a:d9:d7:18:21",
            "net2": "c6:c2:ae:63:03:7f",
            "net20": "a2:6b:f8:23:0c:c0",
            "net21": "e6:cf:fc:a9:66:29",
            "net22": "0e:2d:23:b6:b8:7e",
            "net23": "6a:5d:e9:f1:7e:e0",
            "net3": "4e:90:4b:98:57:ca",
            "net4": "02:f2:7b:15:34:4d",
            "net5": "d6:66:fd:bf:df:a5",
            "net6": "96:78:77:f1:49:dc",
            "net7": "c6:90:0f:f0:82:f0",
            "net8": "ba:e4:fa:ab:35:37",
            "net9": "6e:df:26:3a:b4:a3"
        },
        "tof_1_2_5": {
            "net0": "72:18:8a:0e:c9:86",
            "net1": "3e:ac:7b:83:c5:6a",
            "net10": "2e:e5:10:6a:15:46",
            "net11": "0a:0d:16:84:41:a2",
            "net12": "8a:9f:26:6c:a5:9b",
            "net13": "5a:00:51:e3:6c:5e",
            "net14": "6e:bd:52:ec:5b:99",
            "net15": "1e:51:83:fb:1f:30",
            "net16": "1e:e8:5f:6e:c4:6d",
            "net17": "8a:af:79:84:7d:9d",
            "net18": "9a:18:b1:74:65:c2",
            "net19": "66:d3:89:ca:41:f9",
            "net2": "56:d2:35:e8:d9:ec",
            "net20": "fe:3e:3c:eb:79:b5",
            "net21": "42:59:17:b4:2e:46",
            "net22": "a6:a4:a5:60:dd:d6",
            "net23": "7a:53:b6:42:9d:4a",
            "net3": "a2:bb:f2:36:e4:55",
            "net4": "8e:3a:4a:1c:21:19",
            "net5": "da:a3:fb:ba:43:4c",
            "net6": "b2:ce:aa:21:22:69",
            "net7": "06:6f:20:24:a4:c4",
            "net8": "da:92:59:14:2c:22",
            "net9": "06:c5:a1:ed:c3:ae"
        },
        "tof_1_2_6": {
            "net0": "32:b3:f3:09:9d:fa",
            "net1": "ea:34:31:4f:a5:0e",
            "net10": "6a:82:15:d1:ca:bc",
            "net11": "ae:7d:dd:5d:ae:91",
            "net12": "12:28:2b:bd:39:60",
            "net13": "06:72:1e:7c:23:8f",
            "net14": "16:f9:a1:e3:dd:cd",
            "net15": "02:95:a2:1c:d8:d8",
            "net16": "be:b0:40:a6:ec:6e",
            "net17": "6e:6e:34:c6:d5:c8",
            "net18": "aa:7b:8c:16:ed:b8",
            "net19": "b2:b1:ec:87:20:f9",
            "net2": "66:94:af:2d:26:4b",
            "net20": "b2:ab:f9:78:3b:d2",
            "net21": "82:79:e1:85:c4:54",
            "net22": "da:6e:a2:df:ce:a5",
            "net23": "82:72:21:c5:b7:59",
            "net3": "de:32:51:95:14:cf",
            "net4": "fa:ee:e3:34:51:21",
            "net5": "3a:dd:88:81:8d:b0",
            "net6": "32:ae:4a:a1:0c:c0",
            "net7": "be:d9:d9:8a:f5:2f",
            "net8": "b2:0d:0a:9a:22:1c",
            "net9": "4a:e4:d6:ed:df:cf"
        },
        "tof_1_2_7": {
            "net0": "b6:70:68:49:5a:04",
            "net1": "16:b2:11:a4:1c:0b",
            "net10": "9a:2d:29:d4:b6:47",
            "net11": "66:0a:13:7f:2c:88",
            "net12": "9e:2d:d1:79:fe:9c",
            "net13": "2e:7b:48:b2:86:ec",
            "net14": "42:e9:9b:76:84:9b",
            "net15": "4a:9d:c8:9f:04:d2",
            "net16": "e2:d3:fb:79:8b:1e",
            "net17": "1a:40:b4:e9:59:0a",
            "net18": "92:16:29:83:ec:0c",
            "net19": "a6:3f:b4:fb:90:df",
            "net2": "5a:92:9f:63:f3:52",
            "net20": "b6:a4:45:d7:9f:cc",
            "net21": "ce:01:b8:67:9c:de",
            "net22": "6e:61:fd:ff:c8:1a",
            "net23": "4e:c5:25:89:c6:f1",
            "net3": "f2:c3:a5:41:d9:f5",
            "net4": "fe:2b:af:b8:d3:20",
            "net5": "3e:9e:c5:b0:80:cd",
            "net6": "ea:ed:bf:b7:eb:9c",
            "net7": "a2:26:82:b9:bb:df",
            "net8": "7e:6e:e3:56:06:80",
            "net9": "5a:8e:48:a9:86:5b"
        },
        "tof_1_2_8": {
            "net0": "86:d0:35:3c:fa:da",
            "net1": "06:ff:eb:f2:2e:ea",
            "net10": "a6:55:85:94:48:04",
            "net11": "82:a1:98:67:2b:ef",
            "net12": "5e:a4:b3:5a:e1:e2",
            "net13": "de:b7:30:d5:8e:8d",
            "net14": "ba:e6:e9:66:76:b4",
            "net15": "82:52:c9:8c:b8:93",
            "net16": "4a:7e:af:db:a1:4b",
            "net17": "92:8f:01:39:25:5c",
            "net18": "4e:ce:13:84:38:02",
            "net19": "ce:be:25:94:a2:af",
            "net2": "16:06:a0:7d:0f:92",
            "net20": "de:d4:d8:02:3f:87",
            "net21": "e6:4e:6c:7a:49:9f",
            "net22": "d2:f4:e1:d5:a8:7c",
            "net23": "b2:c4:38:9d:c9:e5",
            "net3": "5e:6c:55:3c:b6:9a",
            "net4": "5e:a1:ac:41:59:8c",
            "net5": "02:b2:5f:7a:da:0b",
            "net6": "a2:d0:a7:02:13:de",
            "net7": "f6:02:f4:65:1e:1a",
            "net8": "1a:d0:60:ca:a5:dd",
            "net9": "d6:7f:e8:bc:9f:77"
        },
        "tof_1_2_9": {
            "net0": "b6:7a:77:05:b3:e8",
            "net1": "9e:1e:88:16:ff:9a",
            "net10": "16:44:58:c3:41:4a",
            "net11": "c6:8c:22:b9:54:83",
            "net12": "12:53:82:38:ba:97",
            "net13": "6e:08:23:ed:b0:e2",
            "net14": "9a:fc:18:d8:1d:72",
            "net15": "06:e9:ed:61:c8:07",
            "net16": "32:05:3b:45:4a:57",
            "net17": "5e:17:d4:e0:47:9f",
            "net18": "be:ea:6c:fc:18:ca",
            "net19": "8e:6e:96:dd:47:dd",
            "net2": "7a:77:59:a4:8a:0f",
            "net20": "12:31:d0:f8:1b:80",
            "net21": "06:13:17:85:37:55",
            "net22": "b6:34:43:c7:13:f3",
            "net23": "b2:30:b8:58:ed:2b",
            "net3": "c2:32:26:44:46:a4",
            "net4": "62:21:ed:8d:c9:d7",
            "net5": "4a:e9:e0:1d:22:8c",
            "net6": "e2:53:2b:ef:e8:ea",
            "net7": "d6:ee:ad:73:98:d0",
            "net8": "fe:76:c7:27:8b:fb",
            "net9": "b2:1b:ed:84:6e:91"
        }
    },
    "failed_machine": "spine_1_1_1",
    "failure_time": 1616315940.9478312,
    "recover_time": 1616316058.8767648
}