{
    "k_leaf": 6,
    "k_top": 6,
    "redundancy_factor": 3,
    "is_k8s": true,
    "machine_mac_addresses": {
        "leaf_1_0_1": {
            "net0": "ce:10:49:08:45:00",
            "net1": "9a:83:4e:4f:cd:b0",
            "net2": "92:08:83:cf:bc:9c",
            "net3": "f6:f6:29:82:53:51",
            "net4": "02:72:30:de:a1:0d",
            "net5": "c6:32:cb:59:e3:69",
            "net6": "22:60:98:1a:82:41"
        },
        "leaf_1_0_2": {
            "net0": "76:a6:e7:8a:52:1d",
            "net1": "9a:f7:76:42:05:d9",
            "net2": "3a:cd:c2:49:aa:89",
            "net3": "fe:81:6d:7c:96:52",
            "net4": "82:6e:5f:f2:06:4e",
            "net5": "2a:e9:ce:79:7b:84",
            "net6": "76:b4:db:fe:17:a9"
        },
        "leaf_1_0_3": {
            "net0": "76:b8:79:90:60:58",
            "net1": "b2:38:08:38:1a:af",
            "net2": "ea:92:37:d6:8f:85",
            "net3": "e6:c8:20:36:a1:41",
            "net4": "be:07:47:f1:6e:4c",
            "net5": "f6:1e:be:8b:02:44",
            "net6": "f6:05:c0:20:4a:62"
        },
        "leaf_1_0_4": {
            "net0": "be:06:93:74:2b:4e",
            "net1": "56:8f:3d:62:e1:c3",
            "net2": "86:80:72:cc:b0:42",
            "net3": "32:a2:3a:8f:43:37",
            "net4": "d6:ea:24:9b:14:16",
            "net5": "4a:10:e1:d0:8b:0f",
            "net6": "7a:43:17:39:66:11"
        },
        "leaf_1_0_5": {
            "net0": "22:e2:7d:5c:2c:6f",
            "net1": "02:aa:ce:48:c7:54",
            "net2": "82:94:a3:8f:47:2d",
            "net3": "8e:34:db:04:99:32",
            "net4": "8a:f0:ca:8f:92:e0",
            "net5": "c6:e9:50:58:a5:0c",
            "net6": "a2:63:3a:81:36:9f"
        },
        "leaf_1_0_6": {
            "net0": "a6:6a:33:56:0b:a2",
            "net1": "4e:8b:c9:37:4d:fe",
            "net2": "82:2d:59:27:77:18",
            "net3": "02:8b:14:9a:34:a0",
            "net4": "7e:84:59:ca:87:6e",
            "net5": "26:77:b1:11:48:76",
            "net6": "f2:b6:3b:49:f8:fe"
        },
        "leaf_2_0_1": {
            "net0": "72:51:e6:69:e5:a3",
            "net1": "e6:8c:85:c5:24:8b",
            "net2": "5a:bf:6e:6b:37:a4",
            "net3": "92:3d:db:f6:67:dc",
            "net4": "9a:07:9f:93:94:b6",
            "net5": "ca:2a:3d:9b:63:89",
            "net6": "da:5f:ef:bd:6c:1f"
        },
        "leaf_2_0_2": {
            "net0": "06:7d:48:26:1d:56",
            "net1": "8e:c5:86:5b:b5:07",
            "net2": "36:7f:5b:b5:6d:d9",
            "net3": "9e:4e:21:cb:cd:6b",
            "net4": "9e:d1:f7:75:60:d7",
            "net5": "82:76:04:a5:01:96",
            "net6": "3e:69:7a:f9:ea:b8"
        },
        "leaf_2_0_3": {
            "net0": "72:75:b5:21:10:e8",
            "net1": "02:95:49:9f:33:3f",
            "net2": "6e:a7:04:e9:6f:c9",
            "net3": "56:e6:be:48:d7:e1",
            "net4": "4e:20:56:eb:7b:b1",
            "net5": "b6:be:6f:e4:96:8b",
            "net6": "2e:b7:e9:0e:8e:0c"
        },
        "leaf_2_0_4": {
            "net0": "62:b8:7a:d2:b3:e1",
            "net1": "ca:8d:5a:40:15:c0",
            "net2": "56:67:bc:b7:97:a5",
            "net3": "be:77:2d:45:a1:b8",
            "net4": "b2:42:86:65:ed:ed",
            "net5": "06:35:01:5b:56:60",
            "net6": "aa:08:25:1d:4c:83"
        },
        "leaf_2_0_5": {
            "net0": "86:ba:e6:79:3b:3e",
            "net1": "7e:76:c5:83:23:bc",
            "net2": "9e:ae:b1:1e:be:c7",
            "net3": "62:31:e7:b0:af:3b",
            "net4": "f2:d3:65:62:40:55",
            "net5": "1a:e1:34:2a:47:26",
            "net6": "1a:b1:02:15:3c:83"
        },
        "leaf_2_0_6": {
            "net0": "0e:79:d4:15:91:6e",
            "net1": "e6:bb:85:89:24:8f",
            "net2": "9e:7a:84:1a:ec:b5",
            "net3": "ce:12:3c:2d:bc:14",
            "net4": "a6:2f:56:03:9e:63",
            "net5": "8e:30:fb:46:6e:27",
            "net6": "e6:5a:10:61:89:0f"
        },
        "leaf_3_0_1": {
            "net0": "ee:bd:5a:f5:9a:9f",
            "net1": "92:fb:d7:c6:b5:5a",
            "net2": "66:3d:17:eb:da:70",
            "net3": "92:a7:be:d2:d4:2c",
            "net4": "2a:04:91:8e:51:ca",
            "net5": "ea:a6:4e:6e:d3:e4",
            "net6": "a2:65:c6:9f:85:06"
        },
        "leaf_3_0_2": {
            "net0": "ce:79:29:d5:36:8a",
            "net1": "6a:44:c8:3b:7b:75",
            "net2": "ca:c2:dd:67:1e:52",
            "net3": "5a:7e:0c:26:1b:91",
            "net4": "46:a4:1d:f2:93:65",
            "net5": "32:d2:a3:bb:18:07",
            "net6": "1a:dd:04:81:51:cd"
        },
        "leaf_3_0_3": {
            "net0": "92:ba:6e:1c:1f:98",
            "net1": "da:7e:9e:6a:f5:79",
            "net2": "5e:2c:e9:62:5a:cc",
            "net3": "76:d4:ff:a8:77:ca",
            "net4": "2e:fe:f1:df:cd:5d",
            "net5": "56:1f:39:6c:5b:ee",
            "net6": "b2:04:53:b2:db:63"
        },
        "leaf_3_0_4": {
            "net0": "c6:6e:09:32:3f:bb",
            "net1": "aa:e4:64:5b:ea:c5",
            "net2": "d6:aa:25:61:28:56",
            "net3": "0a:20:0b:c9:46:9f",
            "net4": "62:6c:14:c9:0f:c1",
            "net5": "9e:77:17:31:d0:95",
            "net6": "46:ea:2f:3f:8b:85"
        },
        "leaf_3_0_5": {
            "net0": "52:8b:56:a8:03:a0",
            "net1": "fe:32:e2:29:e8:14",
            "net2": "ea:a1:20:9e:8b:08",
            "net3": "82:2d:cb:2d:04:da",
            "net4": "ba:da:fc:8f:45:a5",
            "net5": "aa:46:94:2d:f7:2a",
            "net6": "9e:3a:32:73:31:4b"
        },
        "leaf_3_0_6": {
            "net0": "e6:90:30:e5:39:ee",
            "net1": "ba:d3:7b:00:2c:4a",
            "net2": "e6:e8:33:d9:b3:75",
            "net3": "fa:e8:c3:15:6d:87",
            "net4": "b6:88:d9:17:95:80",
            "net5": "56:eb:1a:f6:9a:9a",
            "net6": "b2:23:86:61:ef:07"
        },
        "leaf_4_0_1": {
            "net0": "62:4a:88:cf:4c:46",
            "net1": "6a:b7:4f:15:c2:bf",
            "net2": "92:0e:82:82:c9:dd",
            "net3": "56:73:54:39:19:2b",
            "net4": "ea:dc:42:45:34:01",
            "net5": "aa:fe:71:c1:c8:fc",
            "net6": "ee:04:9b:e2:87:09"
        },
        "leaf_4_0_2": {
            "net0": "1e:3d:56:68:0f:4f",
            "net1": "1e:f3:bc:2f:eb:d7",
            "net2": "66:0f:70:95:8d:e6",
            "net3": "8a:f8:66:47:65:34",
            "net4": "0a:64:cd:eb:34:ab",
            "net5": "ea:b5:be:3f:2a:44",
            "net6": "b2:2a:59:ce:94:d4"
        },
        "leaf_4_0_3": {
            "net0": "42:5f:3d:18:f7:84",
            "net1": "22:51:42:7c:b5:88",
            "net2": "4e:c5:68:32:69:a6",
            "net3": "7e:ac:2b:21:7b:af",
            "net4": "2a:42:d8:5e:7a:ea",
            "net5": "96:99:99:ed:93:f0",
            "net6": "6a:74:dc:46:9c:15"
        },
        "leaf_4_0_4": {
            "net0": "d2:af:c6:bb:59:57",
            "net1": "7e:ae:5e:2c:53:35",
            "net2": "7a:8f:7b:b5:33:fb",
            "net3": "6a:1e:2e:dd:b6:bb",
            "net4": "16:2a:1d:77:39:a0",
            "net5": "96:86:42:c4:45:a6",
            "net6": "5e:40:65:72:77:fe"
        },
        "leaf_4_0_5": {
            "net0": "fe:49:8a:8c:38:d9",
            "net1": "72:9c:17:f6:fc:d3",
            "net2": "36:c8:01:6c:e8:68",
            "net3": "2e:a2:08:ce:b1:36",
            "net4": "06:a5:b9:c1:dc:ad",
            "net5": "42:f7:33:0e:86:0b",
            "net6": "b2:ca:0a:72:07:d2"
        },
        "leaf_4_0_6": {
            "net0": "86:75:99:e6:9e:29",
            "net1": "d2:f4:ff:8d:4c:a8",
            "net2": "de:46:35:ae:47:69",
            "net3": "0e:9f:d8:df:90:bc",
            "net4": "ae:91:e7:fd:13:36",
            "net5": "de:62:8f:00:82:89",
            "net6": "22:04:c7:c9:0d:11"
        },
        "spine_1_1_1": {
            "net0": "be:92:fb:54:98:f6",
            "net1": "26:53:9c:6e:7f:dc",
            "net10": "76:fc:f5:33:2b:28",
            "net11": "c6:e0:18:15:b0:cb",
            "net2": "76:7f:f2:09:a6:78",
            "net3": "ca:cd:ec:98:da:0c",
            "net4": "fa:96:13:c1:87:9b",
            "net5": "06:b0:68:3c:9b:54",
            "net6": "da:09:95:7e:4d:83",
            "net7": "fe:93:85:6c:e8:82",
            "net8": "d6:02:d5:e7:91:a8",
            "net9": "d6:36:b4:4c:20:18"
        },
        "spine_1_1_2": {
            "net0": "9e:68:cf:b1:ae:51",
            "net1": "3e:fd:4b:00:fc:31",
            "net10": "72:9c:45:8b:86:e2",
            "net11": "36:87:5d:95:7f:5c",
            "net2": "fa:2d:96:92:c4:67",
            "net3": "86:04:5e:6a:7b:0b",
            "net4": "42:3b:e9:d1:00:4e",
            "net5": "06:79:51:7b:23:df",
            "net6": "ee:ff:51:b1:ef:cf",
            "net7": "be:e4:6f:29:4d:fe",
            "net8": "82:17:23:35:4e:c6",
            "net9": "6a:bd:f4:fd:3c:91"
        },
        "spine_1_1_3": {
            "net0": "06:47:b5:1a:e5:61",
            "net1": "92:7f:46:75:0b:e4",
            "net10": "b6:2d:6e:97:8e:54",
            "net11": "d2:db:1e:04:74:8a",
            "net2": "d2:37:79:2f:49:0e",
            "net3": "fe:b8:0b:fe:40:63",
            "net4": "fe:9c:db:33:a1:79",
            "net5": "ce:33:97:58:9a:86",
            "net6": "7e:bf:3d:6a:fc:4a",
            "net7": "3a:97:d2:29:50:e0",
            "net8": "12:b2:09:8a:e5:96",
            "net9": "26:58:7f:51:f2:4a"
        },
        "spine_1_1_4": {
            "net0": "66:1a:e9:99:d0:cb",
            "net1": "9a:2f:f3:c0:67:f6",
            "net10": "c2:df:59:18:15:de",
            "net11": "12:94:67:d2:23:20",
            "net2": "a2:84:1a:40:52:3a",
            "net3": "ea:71:d7:ed:1e:42",
            "net4": "d6:20:fe:80:e3:9b",
            "net5": "a6:22:31:f4:a8:54",
            "net6": "ee:17:c4:3a:77:4d",
            "net7": "b6:4f:c6:f4:38:d6",
            "net8": "06:ea:77:51:ae:ac",
            "net9": "4a:c3:d4:9c:a3:ed"
        },
        "spine_1_1_5": {
            "net0": "86:fa:91:fb:63:b8",
            "net1": "0e:26:bf:1f:39:6b",
            "net10": "66:10:84:01:03:05",
            "net11": "7a:73:09:7e:e8:0b",
            "net2": "b2:f3:0e:66:60:9f",
            "net3": "6e:64:bd:9e:ba:96",
            "net4": "9e:62:61:3a:a8:78",
            "net5": "96:c8:fb:bd:b2:aa",
            "net6": "4a:35:bd:dd:48:51",
            "net7": "92:8a:8c:e9:f4:87",
            "net8": "12:29:45:87:70:33",
            "net9": "e2:f0:53:66:93:c8"
        },
        "spine_1_1_6": {
            "net0": "82:5d:f2:76:e9:ae",
            "net1": "46:f8:51:3b:11:57",
            "net10": "96:59:a5:ef:95:0c",
            "net11": "96:5b:75:7d:34:bd",
            "net2": "fe:38:fb:38:bb:d2",
            "net3": "12:f5:91:18:18:2c",
            "net4": "2e:27:37:28:ae:38",
            "net5": "ee:fa:1d:8a:26:14",
            "net6": "e6:f9:54:17:45:a2",
            "net7": "16:32:78:f6:97:6e",
            "net8": "82:79:df:df:10:df",
            "net9": "f6:5d:02:ee:e9:02"
        },
        "spine_2_1_1": {
            "net0": "16:82:50:90:bf:6f",
            "net1": "a2:9d:9f:40:15:e6",
            "net10": "fa:01:7b:69:ad:1d",
            "net11": "9e:cc:2f:e1:0b:94",
            "net2": "a2:51:b5:c9:0e:12",
            "net3": "a2:24:c8:c2:4f:ca",
            "net4": "2e:8a:cd:7f:bb:d9",
            "net5": "f2:79:66:17:e1:2f",
            "net6": "8e:93:aa:85:82:74",
            "net7": "e6:ec:a7:eb:7d:56",
            "net8": "d2:2a:4d:1f:fe:57",
            "net9": "9a:59:7d:96:73:d2"
        },
        "spine_2_1_2": {
            "net0": "e6:71:c9:0f:23:0d",
            "net1": "32:bf:d9:f2:92:95",
            "net10": "9e:00:2c:67:36:7c",
            "net11": "b2:b7:56:57:10:a9",
            "net2": "6e:e5:22:4e:0f:3d",
            "net3": "3a:68:bf:bd:55:cf",
            "net4": "fa:87:e4:59:2a:73",
            "net5": "3e:5a:21:3e:39:81",
            "net6": "f2:71:79:79:03:f2",
            "net7": "46:e4:5b:30:5e:cf",
            "net8": "9a:09:19:43:4d:60",
            "net9": "6a:3a:02:85:3b:0b"
        },
        "spine_2_1_3": {
            "net0": "02:85:0e:71:02:bd",
            "net1": "0a:47:83:13:2f:1b",
            "net10": "76:24:13:0a:41:7c",
            "net11": "d6:0f:6b:25:1c:3f",
            "net2": "e6:a7:3c:6f:18:25",
            "net3": "b2:ac:9f:d0:77:cd",
            "net4": "4e:77:bf:09:ba:a5",
            "net5": "8e:69:31:84:25:3d",
            "net6": "3e:6c:ba:ea:c6:f4",
            "net7": "be:0e:8e:b3:84:c9",
            "net8": "62:70:99:a0:30:c6",
            "net9": "66:ec:90:57:ce:9f"
        },
        "spine_2_1_4": {
            "net0": "a2:42:40:3e:34:6f",
            "net1": "0a:e7:d3:ac:f3:b3",
            "net10": "96:e2:87:78:97:54",
            "net11": "c6:83:e4:45:03:58",
            "net2": "ba:4d:5e:f1:cb:91",
            "net3": "02:95:4b:52:b1:9c",
            "net4": "5a:da:00:45:8b:14",
            "net5": "b2:2f:0e:55:65:ee",
            "net6": "ea:c1:1e:98:25:95",
            "net7": "3a:78:b2:f3:1e:76",
            "net8": "52:6c:fc:52:0a:bc",
            "net9": "1e:7f:f2:f1:44:6b"
        },
        "spine_2_1_5": {
            "net0": "8e:a0:85:c9:5c:4a",
            "net1": "56:3e:72:86:3e:bf",
            "net10": "ae:f2:c4:9a:56:37",
            "net11": "de:cb:4e:bf:14:81",
            "net2": "a2:c6:3e:c8:85:da",
            "net3": "6a:5d:a4:04:07:23",
            "net4": "42:ab:e8:6c:de:a0",
            "net5": "4e:a6:ca:74:e4:a9",
            "net6": "7e:76:d5:b6:32:f2",
            "net7": "62:f9:24:d9:d6:79",
            "net8": "2a:6c:8e:58:da:bd",
            "net9": "3e:7d:e9:81:c0:8f"
        },
        "spine_2_1_6": {
            "net0": "46:30:18:05:dd:01",
            "net1": "76:3e:45:1b:5f:03",
            "net10": "c6:ba:3c:54:fb:90",
            "net11": "ea:81:e7:60:2c:d4",
            "net2": "92:ac:85:b7:66:a1",
            "net3": "de:a6:6b:83:d4:8c",
            "net4": "9a:81:9b:4c:a8:52",
            "net5": "2e:c2:3b:30:d6:4e",
            "net6": "e2:94:9d:8b:bd:76",
            "net7": "26:fb:c2:42:1e:9f",
            "net8": "9e:2d:35:76:64:c1",
            "net9": "12:c3:29:51:45:f9"
        },
        "spine_3_1_1": {
            "net0": "52:23:64:e2:cd:9e",
            "net1": "8a:25:b1:ac:34:ff",
            "net10": "fa:d6:1e:aa:d6:12",
            "net11": "9e:42:11:54:68:3a",
            "net2": "22:c9:88:0d:66:75",
            "net3": "ce:d2:cb:e7:7a:85",
            "net4": "6e:e0:37:56:4b:e2",
            "net5": "b6:3f:72:1b:8e:e2",
            "net6": "46:f1:a0:2a:53:5d",
            "net7": "fa:c2:74:26:34:3a",
            "net8": "1a:5d:0c:3a:dd:ec",
            "net9": "9e:6c:b5:17:47:00"
        },
        "spine_3_1_2": {
            "net0": "d6:4c:1c:fb:a8:d3",
            "net1": "6a:40:11:60:53:bf",
            "net10": "76:51:06:ce:c5:57",
            "net11": "ea:c6:1f:fe:09:63",
            "net2": "b6:5f:aa:71:10:84",
            "net3": "ce:ad:6f:c0:87:1c",
            "net4": "6e:f9:8e:03:54:c8",
            "net5": "3e:36:2c:d3:31:3f",
            "net6": "7e:a3:9a:1f:8b:64",
            "net7": "fe:03:99:05:97:33",
            "net8": "8a:8d:78:d5:be:3c",
            "net9": "da:0c:38:64:c1:a6"
        },
        "spine_3_1_3": {
            "net0": "3a:20:19:64:2d:e0",
            "net1": "3a:ab:c6:e9:b3:01",
            "net10": "86:46:d6:ed:f9:96",
            "net11": "be:12:37:1c:ee:88",
            "net2": "f6:28:76:67:2f:d8",
            "net3": "3a:e3:c3:37:5e:ea",
            "net4": "3a:dc:67:9b:91:c1",
            "net5": "aa:3b:c3:35:a4:ac",
            "net6": "f6:98:6d:e3:bf:82",
            "net7": "86:2c:ff:51:4b:5d",
            "net8": "7e:6e:0e:b4:cb:b1",
            "net9": "c2:ee:32:1e:64:21"
        },
        "spine_3_1_4": {
            "net0": "ba:67:6f:ff:ec:c8",
            "net1": "8a:f2:dd:c6:4e:cd",
            "net10": "d6:50:39:94:77:e0",
            "net11": "8a:2a:00:0a:d3:ac",
            "net2": "a2:6a:05:d4:8a:2a",
            "net3": "de:b1:62:82:bd:b0",
            "net4": "5e:19:b9:4e:2c:44",
            "net5": "9a:f7:07:c3:28:bb",
            "net6": "5e:49:de:0f:e7:a7",
            "net7": "de:84:1b:92:86:af",
            "net8": "32:9c:2d:67:63:b4",
            "net9": "66:f7:d4:aa:91:a9"
        },
        "spine_3_1_5": {
            "net0": "b2:02:1e:32:68:c1",
            "net1": "76:50:1e:1d:48:2e",
            "net10": "06:61:d8:b9:7e:ad",
            "net11": "72:ac:47:2c:3b:dc",
            "net2": "56:b6:9c:a0:ee:bc",
            "net3": "56:2d:f8:59:7f:7a",
            "net4": "b6:89:e7:2b:86:c2",
            "net5": "7e:8d:1d:93:b2:05",
            "net6": "7a:0d:30:1a:ef:00",
            "net7": "5e:17:b3:a9:ae:ab",
            "net8": "66:b7:4b:1d:88:d4",
            "net9": "9e:cc:a0:2e:32:67"
        },
        "spine_3_1_6": {
            "net0": "36:62:99:26:8f:64",
            "net1": "fa:b8:7e:12:f2:66",
            "net10": "ae:a0:0f:51:46:7a",
            "net11": "06:0a:44:c1:76:09",
            "net2": "06:a5:df:6b:42:0a",
            "net3": "b2:de:de:08:e4:78",
            "net4": "32:a5:57:32:68:72",
            "net5": "5e:97:14:e0:a2:d1",
            "net6": "c2:3f:a2:ab:04:0a",
            "net7": "be:6b:c7:53:86:7a",
            "net8": "96:b6:24:1b:23:44",
            "net9": "12:e4:00:6e:08:77"
        },
        "spine_4_1_1": {
            "net0": "2e:17:f1:12:90:b8",
            "net1": "f2:71:ce:09:67:4d",
            "net10": "a6:e0:b3:cf:1e:a7",
            "net11": "b6:7d:aa:7c:3a:82",
            "net2": "9a:d3:e3:9e:5e:7f",
            "net3": "6a:45:d1:87:fc:91",
            "net4": "5e:3c:d1:e5:54:99",
            "net5": "3a:4f:56:57:4c:6f",
            "net6": "7e:8f:77:cd:50:da",
            "net7": "ba:80:c0:a0:e0:ac",
            "net8": "9e:a7:3b:8e:24:1f",
            "net9": "7a:f8:94:77:fc:78"
        },
        "spine_4_1_2": {
            "net0": "12:6a:a6:c6:89:19",
            "net1": "9e:ac:d7:0e:48:4f",
            "net10": "12:77:81:3f:ce:76",
            "net11": "ce:e0:d2:d3:b6:d9",
            "net2": "62:2b:a0:72:7f:f2",
            "net3": "a2:5d:fd:fd:c1:9c",
            "net4": "b6:4a:bf:5e:c2:e5",
            "net5": "d6:a1:94:fd:79:dd",
            "net6": "ca:1d:28:55:79:53",
            "net7": "2e:c5:28:0f:d2:99",
            "net8": "8a:7e:ff:d4:26:37",
            "net9": "86:38:99:ae:16:2f"
        },
        "spine_4_1_3": {
            "net0": "f6:fc:cd:8e:c8:79",
            "net1": "7a:f1:32:04:d0:eb",
            "net10": "ee:f0:d4:24:97:ba",
            "net11": "ce:86:75:b4:6f:26",
            "net2": "ae:28:4a:56:f2:68",
            "net3": "ce:98:75:01:3e:b6",
            "net4": "c6:a0:98:d0:02:c4",
            "net5": "e2:40:e4:78:8e:fc",
            "net6": "12:e3:9a:db:70:44",
            "net7": "be:ef:7b:13:b3:d4",
            "net8": "22:d8:b8:08:1a:9b",
            "net9": "c6:1f:bb:54:2e:b4"
        },
        "spine_4_1_4": {
            "net0": "3a:9e:7f:d8:b1:01",
            "net1": "b6:fd:7f:d9:ac:2f",
            "net10": "be:d8:61:7e:8e:66",
            "net11": "a2:de:c6:fc:69:24",
            "net2": "ee:85:19:30:75:ad",
            "net3": "fa:2c:d1:8d:80:ae",
            "net4": "3a:3b:58:34:77:c8",
            "net5": "72:67:db:30:e1:17",
            "net6": "a2:64:9f:9a:ef:39",
            "net7": "6a:7b:60:ef:2c:91",
            "net8": "e2:4d:ce:72:b1:4d",
            "net9": "0a:6b:8b:96:bf:2f"
        },
        "spine_4_1_5": {
            "net0": "c6:aa:22:9f:22:3c",
            "net1": "0a:c6:2f:31:b3:66",
            "net10": "c2:45:eb:09:f6:14",
            "net11": "02:a0:57:73:4b:e3",
            "net2": "c6:ac:f2:b0:c0:d4",
            "net3": "d6:cd:d3:d9:9e:56",
            "net4": "1e:24:c0:f6:dc:5d",
            "net5": "8a:90:3b:ae:f8:65",
            "net6": "c6:1c:ea:94:07:da",
            "net7": "a2:b1:90:b3:78:aa",
            "net8": "66:73:e2:d5:30:ff",
            "net9": "de:e9:96:a4:2d:3f"
        },
        "spine_4_1_6": {
            "net0": "be:11:bc:4c:98:d1",
            "net1": "ae:4a:c8:2a:44:71",
            "net10": "b2:8f:cb:b5:d8:f0",
            "net11": "8e:fa:2c:2d:27:25",
            "net2": "c2:9c:69:9f:03:0a",
            "net3": "12:c1:0a:82:43:73",
            "net4": "62:da:fd:1b:80:4b",
            "net5": "92:c2:6c:cd:84:45",
            "net6": "66:af:cb:aa:59:10",
            "net7": "0a:61:35:9a:e3:3c",
            "net8": "4e:90:c1:19:dd:ac",
            "net9": "9a:95:e9:36:9e:88"
        },
        "tof_1_2_1": {
            "net0": "8a:5f:57:85:e3:59",
            "net1": "a6:f3:70:10:d4:8a",
            "net10": "ce:5f:b7:e6:71:25",
            "net11": "ba:43:d0:e3:d1:d4",
            "net2": "fa:74:31:34:b7:69",
            "net3": "9e:83:ff:fa:da:a9",
            "net4": "e6:65:27:f0:20:06",
            "net5": "8e:85:18:04:ae:cf",
            "net6": "e2:8c:17:bc:07:b0",
            "net7": "ba:f6:62:d7:50:92",
            "net8": "fa:92:92:35:ea:1b",
            "net9": "96:0a:4c:00:3b:ed"
        },
        "tof_1_2_2": {
            "net0": "3e:05:f8:bf:e0:d1",
            "net1": "62:66:39:3b:25:97",
            "net10": "42:85:ea:8d:90:07",
            "net11": "12:30:d9:40:53:89",
            "net2": "9a:49:e8:01:de:2e",
            "net3": "9a:a7:31:c2:c0:a7",
            "net4": "f6:9f:9f:e5:07:57",
            "net5": "d2:37:7e:93:10:f1",
            "net6": "da:5c:16:9c:c1:7e",
            "net7": "02:0e:bf:93:75:86",
            "net8": "7a:c1:ee:cb:40:a5",
            "net9": "fa:72:9e:07:e6:75"
        },
        "tof_1_2_3": {
            "net0": "ba:6a:be:bb:13:87",
            "net1": "de:5c:2d:82:cf:6e",
            "net10": "72:c8:e3:bb:3d:be",
            "net11": "2e:d5:fc:9c:c6:66",
            "net2": "ce:bb:fb:93:ed:b3",
            "net3": "3a:9a:e1:72:03:97",
            "net4": "92:34:11:49:ef:97",
            "net5": "ae:6c:3d:cc:c2:74",
            "net6": "ca:fa:e6:cd:5f:c1",
            "net7": "b2:82:75:28:f7:f7",
            "net8": "b2:98:9f:66:5a:10",
            "net9": "aa:50:ab:a8:fd:fd"
        },
        "tof_1_2_4": {
            "net0": "e2:e7:00:77:3b:be",
            "net1": "8e:0c:e2:d9:81:e5",
            "net10": "be:ea:72:02:ed:10",
            "net11": "22:d8:f6:66:14:a7",
            "net2": "a2:ec:7d:8d:d9:51",
            "net3": "4e:5c:31:1f:92:c1",
            "net4": "2e:be:6b:bc:6e:64",
            "net5": "7e:c1:cd:89:a4:05",
            "net6": "0e:a7:28:8d:bc:17",
            "net7": "d6:f7:a3:49:a0:7b",
            "net8": "ca:be:c3:2a:33:09",
            "net9": "16:83:93:40:57:f4"
        },
        "tof_1_2_5": {
            "net0": "c2:f0:5e:16:48:6c",
            "net1": "d2:59:ef:c8:7d:a5",
            "net10": "72:fd:1c:b5:09:70",
            "net11": "e6:57:e4:cb:ad:a8",
            "net2": "ae:bd:46:ec:38:9e",
            "net3": "e6:9d:c8:81:d6:f8",
            "net4": "c6:d5:92:5a:70:92",
            "net5": "92:72:e3:1e:43:21",
            "net6": "66:fe:65:dd:72:3a",
            "net7": "22:1f:5e:2a:9c:e4",
            "net8": "96:9a:d2:20:d7:8c",
            "net9": "52:8f:1b:6e:76:ee"
        },
        "tof_1_2_6": {
            "net0": "ea:f3:5a:75:e3:92",
            "net1": "12:17:8a:d4:91:c9",
            "net10": "be:7e:7c:47:8b:7e",
            "net11": "5a:8c:b5:dd:39:08",
            "net2": "f2:75:01:08:c6:a1",
            "net3": "1e:f5:0a:ba:07:db",
            "net4": "0e:3f:3c:c4:df:da",
            "net5": "92:36:f1:28:ac:03",
            "net6": "52:7d:69:68:ea:cb",
            "net7": "ea:60:07:68:17:a8",
            "net8": "56:2f:2c:22:ae:1f",
            "net9": "4e:57:9b:00:12:5a"
        },
        "tof_2_2_1": {
            "net0": "82:74:21:8b:0d:2a",
            "net1": "4a:44:bd:1e:97:6b",
            "net10": "fe:e1:b9:dc:92:8f",
            "net11": "86:c6:d5:78:eb:55",
            "net2": "ee:1c:14:7c:a3:da",
            "net3": "02:f9:13:a0:95:90",
            "net4": "e6:26:48:e1:22:c6",
            "net5": "b2:6d:ef:86:7e:43",
            "net6": "4a:5e:ad:bc:f5:39",
            "net7": "da:17:93:f9:0b:75",
            "net8": "4a:63:a6:6f:a6:f1",
            "net9": "22:3e:12:27:8a:ee"
        },
        "tof_2_2_2": {
            "net0": "0e:8b:32:c5:ad:d1",
            "net1": "d2:96:03:d7:0b:1d",
            "net10": "32:8b:ff:66:3c:1f",
            "net11": "b6:5f:cd:50:fe:38",
            "net2": "f6:b8:6e:9a:3b:fc",
            "net3": "8a:5e:1f:b6:0c:25",
            "net4": "ee:71:f4:58:90:cb",
            "net5": "8e:d4:b4:9f:ef:74",
            "net6": "9a:89:47:9e:a6:7b",
            "net7": "32:28:a4:70:e8:ca",
            "net8": "66:3b:f4:ac:94:c8",
            "net9": "02:09:6c:88:12:ae"
        },
        "tof_2_2_3": {
            "net0": "a6:9f:18:8e:09:ba",
            "net1": "26:e6:d9:d8:dd:bf",
            "net10": "66:62:f5:85:9f:98",
            "net11": "4e:9e:14:00:41:25",
            "net2": "ee:4f:c9:84:8c:64",
            "net3": "7a:e2:91:c3:81:17",
            "net4": "de:7d:0a:5d:5a:cb",
            "net5": "66:7f:6e:33:e7:39",
            "net6": "3a:99:71:e2:ef:95",
            "net7": "e2:bd:57:ba:ba:81",
            "net8": "9a:23:0c:85:69:7f",
            "net9": "46:fa:f6:1a:87:15"
        },
        "tof_2_2_4": {
            "net0": "be:13:af:eb:60:dd",
            "net1": "1a:e9:b1:4f:24:33",
            "net10": "b2:0b:01:2f:45:64",
            "net11": "d2:ea:31:46:77:74",
            "net2": "c2:07:08:99:29:38",
            "net3": "fa:54:9d:70:6d:d0",
            "net4": "b6:7b:4d:1f:99:4b",
            "net5": "da:2a:e4:ce:aa:e8",
            "net6": "86:9c:c1:ac:e3:64",
            "net7": "96:cb:e8:0e:47:28",
            "net8": "1a:a3:ea:36:b1:12",
            "net9": "8a:2a:1d:ba:17:8d"
        },
        "tof_2_2_5": {
            "net0": "2e:38:fb:3e:35:0f",
            "net1": "3a:94:55:b8:d1:6d",
            "net10": "8a:c8:ba:a7:79:b0",
            "net11": "2e:a9:2b:cc:8a:ee",
            "net2": "1a:a2:19:b7:c1:b6",
            "net3": "f2:5a:58:73:6b:5e",
            "net4": "66:4d:1d:8d:e1:8b",
            "net5": "f6:69:eb:ec:0d:25",
            "net6": "b6:05:89:6e:fb:1c",
            "net7": "5e:29:b6:57:47:71",
            "net8": "da:0f:61:cf:99:39",
            "net9": "ba:f1:f5:51:68:ec"
        },
        "tof_2_2_6": {
            "net0": "4a:56:81:ff:9c:83",
            "net1": "56:dd:71:c9:8a:c2",
            "net10": "46:6f:fc:b5:3e:9b",
            "net11": "4a:d5:d7:1c:f2:d1",
            "net2": "4e:8d:3f:72:4f:59",
            "net3": "9e:be:49:46:8f:84",
            "net4": "d6:38:d4:f9:24:83",
            "net5": "d6:5a:1e:87:11:72",
            "net6": "72:c4:8f:5c:e2:92",
            "net7": "6e:7a:d3:bf:2f:a4",
            "net8": "8e:b1:35:b1:51:fd",
            "net9": "ca:60:58:12:ad:72"
        }
    },
    "failed_machine": "leaf_1_0_1",
    "failure_time": {
        "leaf_1_0_1": 1621871036.0238512,
        "leaf_1_0_2": 1621871036.0325148,
        "leaf_1_0_3": 1621871036.0486703,
        "leaf_1_0_4": 1621871036.0663655,
        "leaf_1_0_5": 1621871036.0250118,
        "leaf_1_0_6": 1621871036.0356035,
        "leaf_2_0_1": 1621871036.0498133,
        "leaf_2_0_2": 1621871036.0743344,
        "leaf_2_0_3": 1621871036.027211,
        "leaf_2_0_4": 1621871036.0416248,
        "leaf_2_0_5": 1621871036.0583022,
        "leaf_2_0_6": 1621871036.0858307,
        "leaf_3_0_1": 1621871036.0286322,
        "leaf_3_0_2": 1621871036.0404222,
        "leaf_3_0_3": 1621871036.054187,
        "leaf_3_0_4": 1621871036.0826776,
        "leaf_3_0_5": 1621871036.0865035,
        "leaf_3_0_6": 1621871036.1063995,
        "leaf_4_0_1": 1621871036.1225626,
        "leaf_4_0_2": 1621871036.133693,
        "leaf_4_0_3": 1621871036.0897212,
        "leaf_4_0_4": 1621871036.1165133,
        "leaf_4_0_5": 1621871036.130872,
        "leaf_4_0_6": 1621871036.1411283,
        "spine_1_1_1": 1621871036.101171,
        "spine_1_1_2": 1621871036.1119878,
        "spine_1_1_3": 1621871036.1277828,
        "spine_1_1_4": 1621871036.1372783,
        "spine_1_1_5": 1621871036.1075168,
        "spine_1_1_6": 1621871036.1241286,
        "spine_2_1_1": 1621871036.133875,
        "spine_2_1_2": 1621871036.1491904,
        "spine_2_1_3": 1621871036.1500006,
        "spine_2_1_4": 1621871036.1681433,
        "spine_2_1_5": 1621871036.1945841,
        "spine_2_1_6": 1621871036.2243788,
        "spine_3_1_1": 1621871036.1516085,
        "spine_3_1_2": 1621871036.1715019,
        "spine_3_1_3": 1621871036.2002697,
        "spine_3_1_4": 1621871036.2181828,
        "spine_3_1_5": 1621871036.1540139,
        "spine_3_1_6": 1621871036.1896477,
        "spine_4_1_1": 1621871036.2073252,
        "spine_4_1_2": 1621871036.225119,
        "spine_4_1_3": 1621871036.1581192,
        "spine_4_1_4": 1621871036.1812606,
        "spine_4_1_5": 1621871036.203393,
        "spine_4_1_6": 1621871036.2290359,
        "tof_1_2_1": 1621871036.2286773,
        "tof_1_2_2": 1621871036.2400186,
        "tof_1_2_3": 1621871036.254557,
        "tof_1_2_4": 1621871036.267585,
        "tof_1_2_5": 1621871036.2372675,
        "tof_1_2_6": 1621871036.247123,
        "tof_2_2_1": 1621871036.2575433,
        "tof_2_2_2": 1621871036.2756078,
        "tof_2_2_3": 1621871036.238806,
        "tof_2_2_4": 1621871036.252619,
        "tof_2_2_5": 1621871036.2633617,
        "tof_2_2_6": 1621871036.2750373
    }
}