{
    "description": "Scenario 5a: net0 link failure of leaf_1_0_1 with BGP",
    "k_leaf": 8,
    "k_top": 8,
    "redundancy_factor": 2,
    "is_k8s": true,
    "machine_mac_addresses": {
        "leaf_1_0_1": {
            "net0": "5e:aa:07:95:e0:f9",
            "net1": "42:0c:df:56:76:a5",
            "net2": "9e:91:b1:b9:9d:10",
            "net3": "ee:a9:0f:fd:d7:c6",
            "net4": "1a:0c:01:2c:40:67",
            "net5": "32:46:f9:b5:34:bd",
            "net6": "7e:c5:21:86:f5:d7",
            "net7": "9a:04:dd:97:63:64",
            "net8": "da:52:50:93:3c:cc"
        },
        "leaf_1_0_2": {
            "net0": "5e:2f:6a:00:3e:4c",
            "net1": "1e:42:28:8d:e0:0b",
            "net2": "a6:39:8a:3f:99:64",
            "net3": "ba:65:0a:b2:63:2e",
            "net4": "82:e6:7b:4d:eb:fc",
            "net5": "de:aa:6e:c4:d2:a5",
            "net6": "8e:75:da:3d:c8:44",
            "net7": "0a:e3:40:ac:d7:d8",
            "net8": "06:27:6e:32:d2:3e"
        },
        "leaf_1_0_3": {
            "net0": "12:cd:50:d8:45:40",
            "net1": "92:3c:94:13:da:7b",
            "net2": "c2:f6:85:9c:a9:00",
            "net3": "aa:db:23:73:bb:10",
            "net4": "92:76:55:bf:30:c3",
            "net5": "6a:c9:05:e5:ff:a1",
            "net6": "fe:14:ab:3c:29:96",
            "net7": "7e:8f:80:7b:72:99",
            "net8": "36:00:b6:8c:2b:c1"
        },
        "leaf_1_0_4": {
            "net0": "82:0b:1a:df:b8:77",
            "net1": "9a:42:96:9f:ff:36",
            "net2": "3e:bf:f4:ed:9d:06",
            "net3": "6e:1f:b8:1f:6a:5c",
            "net4": "d6:be:8f:4d:a9:bf",
            "net5": "2e:4d:4c:a7:ae:8c",
            "net6": "ae:35:42:d7:ab:25",
            "net7": "22:d6:51:41:fe:16",
            "net8": "5a:05:7a:3f:73:16"
        },
        "leaf_1_0_5": {
            "net0": "c2:39:42:63:04:ed",
            "net1": "82:bd:1b:8e:a1:b4",
            "net2": "62:bc:6b:51:da:f6",
            "net3": "8e:cd:b1:52:1c:fc",
            "net4": "c2:8a:87:ea:a4:31",
            "net5": "8a:82:0b:93:d3:60",
            "net6": "1e:75:dc:d7:98:81",
            "net7": "be:d2:f9:64:2b:a4",
            "net8": "b6:d9:2b:40:cd:a7"
        },
        "leaf_1_0_6": {
            "net0": "e6:86:e1:01:37:7f",
            "net1": "d2:ca:be:0c:4a:3c",
            "net2": "aa:75:69:19:77:14",
            "net3": "42:44:c8:07:0e:84",
            "net4": "a2:18:30:e7:a4:04",
            "net5": "c6:d4:9c:68:fc:66",
            "net6": "1a:ed:6f:f2:4a:f5",
            "net7": "42:0a:ad:6e:e9:5b",
            "net8": "0a:b2:88:74:c7:52"
        },
        "leaf_1_0_7": {
            "net0": "c2:7a:b9:91:6a:1b",
            "net1": "3a:07:55:88:05:12",
            "net2": "26:71:bd:62:00:56",
            "net3": "c6:9b:78:8d:06:d4",
            "net4": "7e:62:13:79:b1:b5",
            "net5": "9a:1d:43:f1:68:b5",
            "net6": "ae:2b:eb:9e:d3:81",
            "net7": "6a:ee:68:e9:3e:a1",
            "net8": "fe:67:58:83:65:b3"
        },
        "leaf_1_0_8": {
            "net0": "be:46:de:0c:4a:c4",
            "net1": "0a:62:b6:25:d2:04",
            "net2": "1a:3a:de:ca:1f:93",
            "net3": "b6:d8:39:14:30:1b",
            "net4": "7e:4f:06:f5:f0:85",
            "net5": "46:7d:4d:72:cf:c9",
            "net6": "9a:02:b0:e6:f5:c7",
            "net7": "62:e0:7a:42:f9:d8",
            "net8": "42:16:d1:fa:23:ee"
        },
        "leaf_2_0_1": {
            "net0": "f2:94:4c:ad:76:dd",
            "net1": "fa:ab:17:b5:49:26",
            "net2": "6e:16:e8:4f:c4:00",
            "net3": "12:aa:50:4d:79:62",
            "net4": "e2:69:a7:0a:15:13",
            "net5": "ae:b4:ba:af:f8:c8",
            "net6": "3e:5c:07:d2:59:b3",
            "net7": "a2:dc:ec:63:62:79",
            "net8": "4e:06:a7:4f:db:8e"
        },
        "leaf_2_0_2": {
            "net0": "26:c1:fd:67:f8:94",
            "net1": "9a:e3:19:63:e5:b5",
            "net2": "8e:3f:0b:fd:9e:8c",
            "net3": "7a:c0:d9:b3:3a:70",
            "net4": "2e:09:30:6f:35:86",
            "net5": "06:be:85:71:d4:5d",
            "net6": "b6:c9:6c:78:25:3f",
            "net7": "16:07:8b:6c:df:0c",
            "net8": "82:ff:fd:4e:8c:cd"
        },
        "leaf_2_0_3": {
            "net0": "66:20:80:3d:90:94",
            "net1": "f2:38:ee:57:00:c5",
            "net2": "66:a6:69:01:e1:01",
            "net3": "fe:11:9f:af:ae:d2",
            "net4": "7e:cf:07:61:a8:18",
            "net5": "d6:be:40:7f:1f:82",
            "net6": "96:39:32:54:3c:a3",
            "net7": "b2:38:cf:0a:46:a5",
            "net8": "e2:bf:de:dc:bc:32"
        },
        "leaf_2_0_4": {
            "net0": "ae:3d:c0:bf:c9:a1",
            "net1": "5a:66:59:05:b7:d6",
            "net2": "0a:a4:a0:00:6e:89",
            "net3": "12:ff:97:54:2a:58",
            "net4": "16:41:cb:69:8e:45",
            "net5": "a2:2b:b9:9c:40:ad",
            "net6": "6e:ce:66:0c:ee:2d",
            "net7": "3a:61:11:53:c6:da",
            "net8": "32:e5:8a:a2:e0:12"
        },
        "leaf_2_0_5": {
            "net0": "7a:1c:9b:80:9b:41",
            "net1": "de:94:fc:b9:63:93",
            "net2": "4a:17:7a:46:b1:92",
            "net3": "0e:b3:4f:c7:db:9b",
            "net4": "2a:38:0b:68:a0:39",
            "net5": "be:4e:1f:47:5b:6c",
            "net6": "46:82:5b:1e:11:20",
            "net7": "b6:7c:03:83:a2:33",
            "net8": "ea:a8:89:71:b4:e3"
        },
        "leaf_2_0_6": {
            "net0": "6e:88:ea:fa:5b:7d",
            "net1": "1e:db:6e:e9:66:16",
            "net2": "fe:e2:99:e9:1b:6e",
            "net3": "da:5a:db:f1:c0:fc",
            "net4": "2a:0e:09:1b:76:de",
            "net5": "32:ae:7e:d3:a1:59",
            "net6": "ae:87:39:94:9a:60",
            "net7": "ca:43:3e:9a:86:d7",
            "net8": "32:f2:b5:8d:18:d2"
        },
        "leaf_2_0_7": {
            "net0": "3a:29:62:a5:0c:ed",
            "net1": "26:c3:58:02:53:33",
            "net2": "ba:0d:c1:81:b6:b4",
            "net3": "0a:bd:2c:46:34:18",
            "net4": "92:94:9e:04:f4:c6",
            "net5": "aa:8d:79:2c:db:73",
            "net6": "9a:d4:8b:2e:61:cf",
            "net7": "ea:7b:6f:12:cf:dc",
            "net8": "b6:73:3b:9b:e0:3f"
        },
        "leaf_2_0_8": {
            "net0": "2a:d0:33:58:4b:24",
            "net1": "ce:17:19:79:96:15",
            "net2": "3a:1f:1d:4e:64:21",
            "net3": "12:27:92:ac:8b:71",
            "net4": "16:50:c7:24:7c:79",
            "net5": "ee:d9:b4:05:8d:30",
            "net6": "56:95:38:2f:8d:77",
            "net7": "8a:98:91:5c:74:aa",
            "net8": "ee:29:fc:b7:05:8e"
        },
        "leaf_3_0_1": {
            "net0": "fa:e0:94:c4:02:d0",
            "net1": "4a:5a:b6:77:de:af",
            "net2": "92:11:82:e0:22:d6",
            "net3": "46:4b:a1:87:aa:e1",
            "net4": "c6:10:ae:96:58:29",
            "net5": "4a:53:a7:19:e3:12",
            "net6": "72:fd:48:0b:4e:32",
            "net7": "2e:91:7b:67:49:2d",
            "net8": "da:f3:23:1b:25:0c"
        },
        "leaf_3_0_2": {
            "net0": "7a:fb:1e:4a:be:41",
            "net1": "ee:03:c2:3c:36:aa",
            "net2": "36:3c:32:f8:7a:94",
            "net3": "1a:86:b0:59:84:72",
            "net4": "36:a4:f9:b8:56:4d",
            "net5": "fa:5f:7b:86:62:db",
            "net6": "ea:b8:5d:b3:10:50",
            "net7": "86:ae:ec:22:18:86",
            "net8": "86:89:33:ab:f9:a1"
        },
        "leaf_3_0_3": {
            "net0": "9a:53:4a:ae:d2:e6",
            "net1": "72:3f:a8:91:32:39",
            "net2": "e6:32:6a:3c:15:75",
            "net3": "92:71:32:fe:9d:b5",
            "net4": "42:41:97:92:52:e7",
            "net5": "9a:24:aa:16:89:7d",
            "net6": "36:bb:96:19:af:d1",
            "net7": "a6:e3:3a:dc:a7:7d",
            "net8": "42:44:7e:12:a7:8b"
        },
        "leaf_3_0_4": {
            "net0": "ea:03:a9:7f:50:dd",
            "net1": "fe:ee:38:3d:a5:9c",
            "net2": "02:0c:f9:de:bc:29",
            "net3": "6e:86:9a:64:d5:94",
            "net4": "ce:c1:a2:53:26:93",
            "net5": "82:92:18:1b:61:b1",
            "net6": "3e:63:48:ad:1b:12",
            "net7": "32:6b:bd:9e:91:96",
            "net8": "4e:bf:ff:3c:61:cf"
        },
        "leaf_3_0_5": {
            "net0": "7e:66:95:14:85:74",
            "net1": "56:6f:17:7b:f4:ce",
            "net2": "6e:09:6c:e1:55:c5",
            "net3": "fa:50:ff:bf:e0:ce",
            "net4": "3e:b8:af:ae:68:35",
            "net5": "4e:28:a2:3d:bf:aa",
            "net6": "c2:ff:99:5b:ca:4e",
            "net7": "42:f4:a2:77:c1:a8",
            "net8": "4e:3d:af:5d:39:5b"
        },
        "leaf_3_0_6": {
            "net0": "a6:51:15:63:1f:a6",
            "net1": "9a:65:11:b5:b4:3a",
            "net2": "1e:b4:27:9b:18:92",
            "net3": "62:0f:02:5c:36:ca",
            "net4": "26:3a:d4:b7:b4:f3",
            "net5": "7e:c9:96:94:f8:71",
            "net6": "6a:14:ce:3e:37:a6",
            "net7": "be:05:84:e6:8d:59",
            "net8": "3e:08:a3:f8:28:65"
        },
        "leaf_3_0_7": {
            "net0": "f2:1b:4f:0e:90:26",
            "net1": "0e:39:02:88:9f:a6",
            "net2": "4e:9e:a2:f9:9e:61",
            "net3": "36:74:35:2c:c9:4e",
            "net4": "52:fd:25:aa:ea:7f",
            "net5": "62:0a:21:df:a7:d4",
            "net6": "7e:ff:40:33:65:9e",
            "net7": "da:b3:09:53:f4:e2",
            "net8": "f6:c2:fb:f2:8a:5d"
        },
        "leaf_3_0_8": {
            "net0": "12:f4:a9:b6:14:82",
            "net1": "62:df:68:c5:16:68",
            "net2": "c6:26:ae:b0:7c:cc",
            "net3": "1a:83:5e:0d:06:33",
            "net4": "9a:66:40:42:70:bc",
            "net5": "f2:39:65:cb:d0:e6",
            "net6": "be:ad:ba:84:8a:eb",
            "net7": "be:7b:fc:32:e1:01",
            "net8": "02:32:69:4d:06:55"
        },
        "leaf_4_0_1": {
            "net0": "7e:70:80:ad:7d:9f",
            "net1": "da:a7:2c:28:9a:1a",
            "net2": "3e:3a:6a:97:3c:5b",
            "net3": "86:b0:19:6f:b6:47",
            "net4": "4a:43:bf:96:8c:88",
            "net5": "2e:8e:78:be:4a:52",
            "net6": "9a:b4:6c:51:bb:4a",
            "net7": "12:5f:b4:1f:2e:68",
            "net8": "fe:e1:80:e6:df:f1"
        },
        "leaf_4_0_2": {
            "net0": "22:f3:b2:2e:7d:f9",
            "net1": "56:18:ea:9c:c5:06",
            "net2": "f6:35:55:01:32:c9",
            "net3": "be:f7:e0:7a:aa:a0",
            "net4": "9e:5a:85:db:63:2a",
            "net5": "b6:65:96:fe:3a:5a",
            "net6": "b2:50:69:36:5d:65",
            "net7": "6e:cd:5c:b5:5b:5e",
            "net8": "e2:78:a7:8c:53:d8"
        },
        "leaf_4_0_3": {
            "net0": "86:e7:57:07:08:9c",
            "net1": "9a:55:9d:07:2b:c2",
            "net2": "0a:bb:b9:0b:0d:b3",
            "net3": "aa:f8:18:e4:58:dd",
            "net4": "1a:ef:42:1b:ad:e7",
            "net5": "f2:31:12:c7:ec:c4",
            "net6": "9e:d3:1b:a4:3f:22",
            "net7": "a6:fb:1f:29:b2:ca",
            "net8": "d2:40:fe:b7:66:02"
        },
        "leaf_4_0_4": {
            "net0": "6a:46:d3:f0:eb:cc",
            "net1": "02:26:16:02:ff:0c",
            "net2": "76:1c:fe:6b:27:0f",
            "net3": "d6:53:0d:a3:4f:70",
            "net4": "12:4f:d0:53:ec:27",
            "net5": "7e:73:ab:a9:4a:34",
            "net6": "4a:b9:3a:7e:a7:0c",
            "net7": "5a:0c:d0:75:77:50",
            "net8": "3e:f3:a2:20:20:6e"
        },
        "leaf_4_0_5": {
            "net0": "72:61:56:0c:8b:87",
            "net1": "96:58:4c:53:0c:65",
            "net2": "e6:dc:12:2a:cc:22",
            "net3": "42:42:bf:6e:4d:ba",
            "net4": "02:0c:af:1b:af:b4",
            "net5": "12:f2:f5:0f:81:a3",
            "net6": "96:f7:53:3d:2d:af",
            "net7": "9a:e6:61:41:ce:67",
            "net8": "de:c4:98:f3:88:2c"
        },
        "leaf_4_0_6": {
            "net0": "86:49:43:a9:37:ee",
            "net1": "36:ff:56:7d:1d:af",
            "net2": "f2:09:cc:5d:1c:65",
            "net3": "0e:5e:fa:75:60:cd",
            "net4": "e2:96:ca:10:3c:11",
            "net5": "d2:07:d3:2e:4a:29",
            "net6": "0e:b1:42:5d:fb:3f",
            "net7": "e2:5a:42:1b:8a:4d",
            "net8": "e6:35:7b:69:54:22"
        },
        "leaf_4_0_7": {
            "net0": "de:33:16:b1:70:0b",
            "net1": "9a:5f:27:38:1e:1a",
            "net2": "36:2f:26:08:70:ca",
            "net3": "7e:3e:ce:25:12:df",
            "net4": "8e:37:1e:82:7d:2f",
            "net5": "da:06:f9:3c:0f:b6",
            "net6": "1a:e9:d6:98:36:f6",
            "net7": "d2:9b:af:c5:c2:54",
            "net8": "02:1c:fd:da:6f:c7"
        },
        "leaf_4_0_8": {
            "net0": "2a:70:be:23:25:c6",
            "net1": "86:0d:4f:cd:6d:23",
            "net2": "56:a5:09:9d:76:2f",
            "net3": "62:a9:63:8a:f4:e7",
            "net4": "be:28:55:5d:f6:b5",
            "net5": "b2:18:79:b4:61:6a",
            "net6": "fe:be:17:f2:fb:c8",
            "net7": "72:49:37:a7:79:81",
            "net8": "66:eb:da:3a:aa:5e"
        },
        "leaf_5_0_1": {
            "net0": "d6:f2:33:0a:a0:71",
            "net1": "02:dd:7d:f1:a7:74",
            "net2": "da:84:a7:34:31:08",
            "net3": "5a:b5:b5:67:8a:64",
            "net4": "ca:2c:4b:89:74:99",
            "net5": "0a:6d:27:2f:82:fe",
            "net6": "62:c7:f0:e0:cc:71",
            "net7": "aa:37:fa:5a:8d:6c",
            "net8": "a6:c8:2c:6c:32:f5"
        },
        "leaf_5_0_2": {
            "net0": "a2:48:92:b6:35:4b",
            "net1": "3e:5c:6f:72:93:17",
            "net2": "66:6b:55:e9:fb:cc",
            "net3": "36:f7:a0:96:1a:eb",
            "net4": "9a:36:76:33:0b:2e",
            "net5": "c2:a4:ee:64:38:22",
            "net6": "f6:d1:61:59:55:81",
            "net7": "92:8c:91:36:3e:1c",
            "net8": "66:d3:4e:4d:2e:7f"
        },
        "leaf_5_0_3": {
            "net0": "aa:88:53:1d:e2:45",
            "net1": "5e:64:4d:b6:41:32",
            "net2": "42:15:7c:86:bc:5f",
            "net3": "76:4b:f9:0f:4e:45",
            "net4": "c6:f9:ae:f5:ef:f8",
            "net5": "f2:b2:e7:80:24:69",
            "net6": "22:19:1a:da:ee:45",
            "net7": "4a:fd:bd:f4:34:5d",
            "net8": "3a:76:ca:86:d2:1c"
        },
        "leaf_5_0_4": {
            "net0": "d2:94:7b:76:06:db",
            "net1": "02:4a:f2:ac:25:7f",
            "net2": "62:57:34:d5:5e:d6",
            "net3": "3e:53:cc:a8:85:00",
            "net4": "ce:b6:ee:e6:57:1d",
            "net5": "ee:d9:18:ff:c0:af",
            "net6": "d2:ac:cc:4f:a6:da",
            "net7": "3e:2b:82:83:3f:8c",
            "net8": "16:4a:0c:c2:b4:2b"
        },
        "leaf_5_0_5": {
            "net0": "22:a7:0b:b1:b5:f3",
            "net1": "fa:ee:13:21:5c:fa",
            "net2": "16:a0:83:8a:fc:79",
            "net3": "4a:97:3c:fa:61:91",
            "net4": "2e:ba:11:a5:9d:2c",
            "net5": "46:61:9d:1a:c1:f3",
            "net6": "6e:64:e6:ce:7e:59",
            "net7": "ea:4d:ea:4e:64:f3",
            "net8": "b2:1a:d9:fb:10:7f"
        },
        "leaf_5_0_6": {
            "net0": "0e:cb:24:1f:b3:c2",
            "net1": "02:b2:3e:ed:b4:7f",
            "net2": "be:22:bd:8f:0f:50",
            "net3": "ce:ab:fb:5e:58:ba",
            "net4": "d6:c3:09:ad:a8:bf",
            "net5": "c2:8b:46:67:89:24",
            "net6": "5e:7e:08:e9:ba:23",
            "net7": "5a:0f:b7:85:f1:c7",
            "net8": "b6:9e:3f:c6:32:10"
        },
        "leaf_5_0_7": {
            "net0": "ba:80:6b:3b:aa:fa",
            "net1": "ca:7c:7c:3f:8a:63",
            "net2": "da:38:c1:9e:dc:35",
            "net3": "1a:dc:d3:2b:58:fa",
            "net4": "aa:ec:01:45:75:21",
            "net5": "72:79:49:8c:f5:49",
            "net6": "7e:ba:d4:de:36:85",
            "net7": "a6:f2:8b:7e:1a:ac",
            "net8": "76:01:b7:a6:f6:d7"
        },
        "leaf_5_0_8": {
            "net0": "ee:b8:03:99:96:ba",
            "net1": "1e:e1:eb:97:29:05",
            "net2": "82:0d:68:02:76:fa",
            "net3": "e2:84:19:4d:7d:01",
            "net4": "0e:45:2d:34:a4:04",
            "net5": "5e:f7:de:7e:9c:9f",
            "net6": "b2:ad:f6:cb:c8:2b",
            "net7": "12:ed:53:7d:e3:81",
            "net8": "c2:b2:c6:67:87:6b"
        },
        "leaf_6_0_1": {
            "net0": "46:69:c3:41:be:f9",
            "net1": "9a:f7:b6:7d:87:f1",
            "net2": "56:34:6f:91:c1:ad",
            "net3": "f2:b2:76:5e:94:3d",
            "net4": "d2:3d:28:e5:4f:63",
            "net5": "9e:58:00:a5:53:a6",
            "net6": "b6:28:71:ea:f6:37",
            "net7": "52:b9:c3:3c:6b:cc",
            "net8": "d2:bb:bd:a7:e7:82"
        },
        "leaf_6_0_2": {
            "net0": "8e:4c:6d:d7:71:d8",
            "net1": "6a:06:74:8a:e2:11",
            "net2": "c2:64:4f:0f:94:72",
            "net3": "92:47:3b:5d:92:a5",
            "net4": "96:66:42:c5:29:59",
            "net5": "6e:00:95:5e:51:42",
            "net6": "96:83:8c:cc:97:5e",
            "net7": "7e:57:52:e2:90:b2",
            "net8": "9e:83:3a:33:f3:e7"
        },
        "leaf_6_0_3": {
            "net0": "92:85:6e:40:c0:3c",
            "net1": "fe:67:da:d2:f5:00",
            "net2": "ee:17:3c:7c:67:24",
            "net3": "b2:65:ad:6f:dd:db",
            "net4": "12:c0:9b:9d:ac:6f",
            "net5": "12:e2:f1:c4:4e:e0",
            "net6": "a2:05:79:7d:39:dc",
            "net7": "42:e5:fb:07:52:e7",
            "net8": "f6:38:b5:96:8b:56"
        },
        "leaf_6_0_4": {
            "net0": "4a:37:b1:8f:f0:fa",
            "net1": "96:ea:f7:69:2b:c4",
            "net2": "fa:df:b8:07:39:53",
            "net3": "42:49:78:8a:e7:c8",
            "net4": "de:db:40:d4:37:f8",
            "net5": "82:56:95:08:86:2a",
            "net6": "66:06:9e:86:92:49",
            "net7": "e2:6e:72:ea:6f:45",
            "net8": "f6:31:38:bb:a2:85"
        },
        "leaf_6_0_5": {
            "net0": "8a:a3:7d:aa:30:99",
            "net1": "c6:28:2b:3d:46:ab",
            "net2": "da:35:2d:44:d2:db",
            "net3": "b2:d6:68:13:dd:70",
            "net4": "7e:71:0d:e5:4e:ea",
            "net5": "72:d5:d0:c4:13:56",
            "net6": "22:00:9c:19:41:a3",
            "net7": "f2:7e:0b:64:88:be",
            "net8": "92:35:1a:90:39:2f"
        },
        "leaf_6_0_6": {
            "net0": "fe:ad:0e:a4:e1:12",
            "net1": "d6:47:e1:2b:82:07",
            "net2": "42:49:58:14:08:ae",
            "net3": "ee:8d:d6:5d:a1:5e",
            "net4": "ee:24:20:aa:5d:bb",
            "net5": "7e:96:07:f0:9a:a4",
            "net6": "c2:4b:29:01:96:27",
            "net7": "22:ea:eb:a6:ec:f1",
            "net8": "da:74:28:51:6a:1e"
        },
        "leaf_6_0_7": {
            "net0": "2a:e6:ef:19:5b:bc",
            "net1": "c2:17:dc:4f:5a:ff",
            "net2": "2e:8a:a2:1c:a7:b9",
            "net3": "a6:d1:6f:d7:67:b2",
            "net4": "7a:31:fa:92:ec:81",
            "net5": "76:dd:d1:fb:4e:e4",
            "net6": "66:7f:29:e3:72:c0",
            "net7": "22:7b:59:34:49:be",
            "net8": "f6:af:e0:9b:50:30"
        },
        "leaf_6_0_8": {
            "net0": "22:45:54:5d:fc:70",
            "net1": "92:52:9f:da:3d:59",
            "net2": "8e:b1:1f:4b:bc:c8",
            "net3": "be:d3:23:33:a5:e7",
            "net4": "a6:c8:0a:65:ce:4a",
            "net5": "1a:4f:08:7d:05:9a",
            "net6": "de:f1:25:cf:65:d9",
            "net7": "82:dc:1f:f3:5d:8c",
            "net8": "9a:8d:4c:65:a1:d3"
        },
        "leaf_7_0_1": {
            "net0": "d6:32:0c:5c:3c:58",
            "net1": "ba:b7:b9:20:bd:f5",
            "net2": "d6:5e:4d:25:d8:a5",
            "net3": "be:56:da:52:a2:fa",
            "net4": "2a:e1:f1:01:6a:9e",
            "net5": "2e:83:22:12:15:68",
            "net6": "c6:c3:61:63:d7:45",
            "net7": "92:2e:29:d5:9b:b8",
            "net8": "d6:e1:c7:41:18:5e"
        },
        "leaf_7_0_2": {
            "net0": "f6:a1:1e:4c:16:cc",
            "net1": "a6:40:1f:1c:5d:89",
            "net2": "d6:3f:a5:5d:65:e6",
            "net3": "22:22:3c:74:04:aa",
            "net4": "9e:85:e5:fd:7c:3e",
            "net5": "0e:22:70:65:ab:e4",
            "net6": "86:1a:ac:e8:1a:c0",
            "net7": "be:eb:ce:1f:e9:b6",
            "net8": "46:53:f9:4e:e1:61"
        },
        "leaf_7_0_3": {
            "net0": "06:7f:c4:22:67:5a",
            "net1": "fe:7c:f1:61:8c:6f",
            "net2": "02:5d:e9:06:b5:e7",
            "net3": "46:b1:59:1f:99:00",
            "net4": "12:72:9b:1c:70:5b",
            "net5": "2a:67:58:64:0c:11",
            "net6": "0e:81:a5:56:0a:26",
            "net7": "52:d1:14:bc:83:22",
            "net8": "b2:15:a1:a9:22:7c"
        },
        "leaf_7_0_4": {
            "net0": "62:eb:a0:68:41:4a",
            "net1": "42:1d:51:8e:75:19",
            "net2": "4e:8e:86:d2:64:fa",
            "net3": "b2:3e:18:ca:c8:de",
            "net4": "52:db:29:41:40:8e",
            "net5": "fa:db:5c:92:4f:e6",
            "net6": "2a:83:2b:51:83:42",
            "net7": "9e:4e:79:f1:97:e7",
            "net8": "ea:3e:ee:25:e9:e8"
        },
        "leaf_7_0_5": {
            "net0": "92:61:b2:1a:28:ba",
            "net1": "4a:85:96:a4:58:30",
            "net2": "52:ba:5d:59:77:c4",
            "net3": "26:b3:4a:24:c4:e7",
            "net4": "26:03:36:a6:5a:cd",
            "net5": "62:15:14:cb:15:27",
            "net6": "76:56:52:a5:0d:52",
            "net7": "9a:23:87:b5:41:2a",
            "net8": "2e:4f:f9:d7:4b:9d"
        },
        "leaf_7_0_6": {
            "net0": "8e:12:01:01:8a:9c",
            "net1": "4e:ed:fb:7e:b9:d3",
            "net2": "9a:68:dc:2d:7f:d0",
            "net3": "4e:85:b9:22:6c:b4",
            "net4": "d2:d0:bf:f6:df:39",
            "net5": "8e:43:50:1f:cd:b7",
            "net6": "42:56:65:19:97:00",
            "net7": "3a:1c:49:32:97:1c",
            "net8": "96:45:db:78:6b:6e"
        },
        "leaf_7_0_7": {
            "net0": "6e:6e:1e:4e:b3:62",
            "net1": "d2:9c:44:8c:88:45",
            "net2": "8e:48:1a:1e:51:85",
            "net3": "d2:59:c4:be:6e:e2",
            "net4": "0a:44:99:f0:91:76",
            "net5": "ba:0b:5c:29:74:3f",
            "net6": "4a:1f:96:5d:bc:c6",
            "net7": "02:81:c3:8d:9b:17",
            "net8": "d6:7b:e1:0e:4b:1e"
        },
        "leaf_7_0_8": {
            "net0": "de:60:0e:19:f9:06",
            "net1": "2e:1c:0f:95:3d:3a",
            "net2": "62:5e:00:f9:ec:44",
            "net3": "8e:5e:23:01:df:1f",
            "net4": "8a:d3:fb:1d:d0:49",
            "net5": "0e:a1:56:df:fa:90",
            "net6": "5e:45:ed:62:35:d1",
            "net7": "fa:4b:47:63:20:c1",
            "net8": "a2:c6:28:20:2e:9e"
        },
        "leaf_8_0_1": {
            "net0": "7e:44:ac:ce:3b:00",
            "net1": "da:42:e8:b5:9d:39",
            "net2": "62:c8:07:bb:be:42",
            "net3": "26:65:da:0f:64:c0",
            "net4": "ce:67:e6:af:49:20",
            "net5": "d2:cd:10:5d:95:62",
            "net6": "e6:a7:63:1b:14:99",
            "net7": "4e:99:50:31:77:e2",
            "net8": "22:b7:7a:d1:6d:7b"
        },
        "leaf_8_0_2": {
            "net0": "16:60:42:cd:9c:93",
            "net1": "e6:13:ae:c0:0e:82",
            "net2": "56:39:21:03:63:31",
            "net3": "7e:1b:3c:f0:39:52",
            "net4": "8a:41:28:a6:3c:68",
            "net5": "2a:2f:97:e2:89:62",
            "net6": "e2:4e:cd:05:c7:38",
            "net7": "4a:03:9a:a6:49:ca",
            "net8": "7a:96:d0:c4:c4:26"
        },
        "leaf_8_0_3": {
            "net0": "2a:9f:f0:b4:59:17",
            "net1": "72:6c:74:67:86:83",
            "net2": "3e:33:ac:c8:ea:40",
            "net3": "c6:0b:0e:b0:c8:79",
            "net4": "0a:1e:7f:a3:ad:f6",
            "net5": "aa:b6:a2:73:67:6d",
            "net6": "a2:27:79:9d:6d:f7",
            "net7": "42:7d:86:81:55:69",
            "net8": "8e:2f:38:d6:d8:50"
        },
        "leaf_8_0_4": {
            "net0": "3e:91:c1:90:70:d7",
            "net1": "62:82:56:10:0f:c3",
            "net2": "72:9b:df:71:85:2e",
            "net3": "c6:38:85:2e:64:87",
            "net4": "7a:07:3e:8d:56:c5",
            "net5": "f2:f6:4a:6d:38:3c",
            "net6": "e2:ba:cd:c5:4d:f0",
            "net7": "92:d3:46:37:23:2c",
            "net8": "46:80:d4:ca:f5:d2"
        },
        "leaf_8_0_5": {
            "net0": "0e:29:66:4d:5f:c0",
            "net1": "2e:bb:ba:85:c9:cb",
            "net2": "7e:6c:77:6f:45:42",
            "net3": "8e:d7:f1:10:98:0c",
            "net4": "ee:ef:a0:ae:8b:b4",
            "net5": "a6:c8:cd:b5:8a:31",
            "net6": "a2:03:1b:08:07:45",
            "net7": "06:21:f0:90:6f:0e",
            "net8": "3a:9c:13:29:e3:01"
        },
        "leaf_8_0_6": {
            "net0": "b6:88:be:fe:69:bf",
            "net1": "4e:f4:4c:61:57:1e",
            "net2": "5e:27:c6:cb:68:61",
            "net3": "5e:79:3c:37:00:56",
            "net4": "4e:23:79:c3:1e:43",
            "net5": "72:52:6f:48:be:8c",
            "net6": "2a:99:2f:aa:3a:a2",
            "net7": "16:49:a1:ce:57:e1",
            "net8": "0a:6b:56:b5:4d:75"
        },
        "leaf_8_0_7": {
            "net0": "5a:7e:83:28:6e:88",
            "net1": "de:fb:4d:1e:40:dc",
            "net2": "12:66:9d:f8:9e:0f",
            "net3": "6e:e8:fb:bf:9b:ee",
            "net4": "32:ea:1a:4d:d9:9c",
            "net5": "fe:e5:2f:db:fe:fe",
            "net6": "ee:41:a5:6d:1d:56",
            "net7": "b2:ef:9a:e7:57:4e",
            "net8": "9e:3e:0a:7a:5a:92"
        },
        "leaf_8_0_8": {
            "net0": "b2:13:4f:c5:ea:e6",
            "net1": "ee:d2:f0:b7:ab:c9",
            "net2": "06:a6:95:bd:4d:43",
            "net3": "0a:28:e6:5b:b0:c7",
            "net4": "ee:ce:73:f5:88:bf",
            "net5": "a2:a7:7a:11:3c:bb",
            "net6": "8e:eb:57:52:0b:a4",
            "net7": "c2:bc:50:26:9f:5e",
            "net8": "7a:33:1e:e9:77:22"
        },
        "spine_1_1_1": {
            "net0": "7a:b5:b9:cc:bf:4a",
            "net1": "a2:cb:3a:47:01:9d",
            "net10": "56:f8:6c:a5:7c:0d",
            "net11": "3e:10:b6:86:a6:e3",
            "net12": "fe:00:bd:ed:04:dd",
            "net13": "de:ae:16:95:0b:b0",
            "net14": "06:39:3f:56:f1:ae",
            "net15": "7a:77:c2:fe:a7:2b",
            "net2": "ce:6e:e3:cf:56:a0",
            "net3": "2a:1f:41:21:98:34",
            "net4": "ae:03:cd:30:b2:a7",
            "net5": "d6:65:2d:1c:32:69",
            "net6": "a2:7d:a1:6b:44:ff",
            "net7": "3e:0a:85:6d:65:8e",
            "net8": "02:81:2c:70:a0:33",
            "net9": "56:8d:42:98:c7:76"
        },
        "spine_1_1_2": {
            "net0": "4e:d0:0f:3a:e2:1c",
            "net1": "fa:83:fd:23:57:cd",
            "net10": "92:d5:08:53:3e:d9",
            "net11": "7e:12:3b:51:03:33",
            "net12": "02:3c:35:ca:29:b6",
            "net13": "0a:96:2b:e8:73:3c",
            "net14": "e6:a1:32:d8:82:bf",
            "net15": "da:dc:37:1f:68:88",
            "net2": "a6:07:86:32:42:28",
            "net3": "92:bb:2a:cc:ca:1a",
            "net4": "0e:6b:cc:af:2d:a8",
            "net5": "4a:32:31:21:54:40",
            "net6": "52:5b:3e:e7:53:b8",
            "net7": "c6:87:d7:95:17:ef",
            "net8": "c6:6d:e1:4d:26:b9",
            "net9": "62:db:1b:03:ad:0d"
        },
        "spine_1_1_3": {
            "net0": "b2:b4:60:02:b9:26",
            "net1": "82:df:d1:8b:64:c7",
            "net10": "da:e8:81:25:b5:8d",
            "net11": "06:44:b8:9f:c7:0e",
            "net12": "de:c7:b7:44:a1:26",
            "net13": "5e:43:c7:32:b0:cf",
            "net14": "c2:d7:bf:f7:26:38",
            "net15": "7e:09:7d:11:f6:be",
            "net2": "0a:7b:b2:35:ec:7c",
            "net3": "e6:47:25:a2:88:da",
            "net4": "ea:66:b1:eb:f1:5a",
            "net5": "16:2f:2c:19:6f:7a",
            "net6": "ae:30:c3:07:10:63",
            "net7": "42:e6:ba:34:b9:e6",
            "net8": "66:12:d6:90:ea:fa",
            "net9": "be:26:1a:59:0f:9a"
        },
        "spine_1_1_4": {
            "net0": "36:81:32:33:af:de",
            "net1": "d2:7e:9e:80:c6:b4",
            "net10": "86:b6:5e:63:ec:81",
            "net11": "86:99:71:60:80:93",
            "net12": "b2:4b:7b:d7:94:b5",
            "net13": "4e:37:f5:52:02:5a",
            "net14": "d2:9b:d7:c3:53:fa",
            "net15": "42:87:13:e6:12:1b",
            "net2": "16:b2:84:8d:be:a2",
            "net3": "12:da:1a:1f:a2:e7",
            "net4": "d6:ef:a6:38:06:6d",
            "net5": "a6:2f:ae:f1:ea:35",
            "net6": "de:5b:79:9b:30:76",
            "net7": "f2:6f:ed:c5:3a:28",
            "net8": "3e:2d:4b:ab:fb:c4",
            "net9": "6e:79:b4:b8:8e:32"
        },
        "spine_1_1_5": {
            "net0": "d2:ec:26:ad:f4:12",
            "net1": "ce:4a:87:1a:ed:ca",
            "net10": "4a:68:8b:a8:7e:08",
            "net11": "66:bd:47:8d:ed:47",
            "net12": "ae:89:3a:0d:6a:70",
            "net13": "c6:56:c8:d5:8b:40",
            "net14": "76:33:8c:db:5f:1a",
            "net15": "d2:f2:3e:01:7c:0e",
            "net2": "c2:ac:6d:77:ee:65",
            "net3": "ee:70:18:16:55:8d",
            "net4": "9e:21:ca:a9:e4:97",
            "net5": "f6:f6:e6:82:16:fc",
            "net6": "1e:7d:79:88:31:81",
            "net7": "fe:e1:20:ef:9a:55",
            "net8": "1e:0b:8c:48:6b:63",
            "net9": "a2:2d:40:0a:7a:12"
        },
        "spine_1_1_6": {
            "net0": "b2:6b:2b:6c:21:a7",
            "net1": "6e:ca:79:c8:e1:f3",
            "net10": "7a:db:7e:f8:22:65",
            "net11": "3e:f5:ce:55:11:a4",
            "net12": "32:08:5f:1e:fe:f7",
            "net13": "0e:fe:3b:ce:11:3e",
            "net14": "ca:b1:98:b3:70:4c",
            "net15": "1a:7b:f5:7d:22:92",
            "net2": "ca:e7:0b:f1:98:e4",
            "net3": "0a:4d:d3:f9:0b:15",
            "net4": "92:d8:76:2a:42:20",
            "net5": "6e:75:ef:3d:94:ea",
            "net6": "d6:f7:50:17:51:26",
            "net7": "fe:58:6a:3f:df:71",
            "net8": "6a:9a:14:e9:47:c8",
            "net9": "fe:05:a1:f2:a2:4a"
        },
        "spine_1_1_7": {
            "net0": "66:a5:a5:ff:59:8c",
            "net1": "92:b3:cc:93:2c:ce",
            "net10": "f6:d1:69:26:4e:c7",
            "net11": "7e:58:a1:16:c6:0a",
            "net12": "92:1a:c0:bb:c0:a5",
            "net13": "fa:01:cb:72:81:68",
            "net14": "82:92:9b:58:ad:cf",
            "net15": "1e:90:56:da:75:bc",
            "net2": "ca:1a:d1:30:bb:8a",
            "net3": "32:76:c9:06:7a:db",
            "net4": "9e:8d:9c:ee:ad:15",
            "net5": "b6:c9:29:03:c3:14",
            "net6": "c6:ab:3e:38:53:f4",
            "net7": "96:a6:65:ae:fb:39",
            "net8": "82:d8:24:83:aa:96",
            "net9": "06:e7:5d:c2:1a:91"
        },
        "spine_1_1_8": {
            "net0": "5a:ca:cf:67:fe:e8",
            "net1": "fe:a0:4e:d1:62:7b",
            "net10": "8e:c7:8b:06:de:27",
            "net11": "02:75:09:5c:8c:1e",
            "net12": "0e:87:ef:8f:6d:a4",
            "net13": "ce:ac:51:d2:b4:a7",
            "net14": "0a:13:d4:bd:0e:b1",
            "net15": "f6:62:ff:94:16:55",
            "net2": "d2:88:a7:0f:51:a3",
            "net3": "72:4f:2d:06:36:6c",
            "net4": "5a:33:7f:36:03:40",
            "net5": "ba:2a:a7:eb:7b:fe",
            "net6": "3e:df:54:0f:ec:fe",
            "net7": "aa:d6:3e:55:f4:9e",
            "net8": "6a:f7:df:05:56:18",
            "net9": "ce:64:4a:4d:9d:05"
        },
        "spine_2_1_1": {
            "net0": "16:2f:9c:60:b2:60",
            "net1": "96:ed:00:11:38:de",
            "net10": "9a:55:9e:33:ea:4c",
            "net11": "62:37:19:af:3c:43",
            "net12": "b6:a8:89:41:f3:7f",
            "net13": "ca:ed:8a:d3:99:9b",
            "net14": "fa:e9:7d:30:84:64",
            "net15": "32:bb:9b:4e:7e:71",
            "net2": "72:6e:00:70:52:b7",
            "net3": "02:67:a7:23:21:c7",
            "net4": "da:50:ee:3e:cf:e0",
            "net5": "32:f0:7a:f4:c4:47",
            "net6": "56:e3:65:c8:74:99",
            "net7": "a2:16:03:5f:a7:87",
            "net8": "7a:48:9a:27:aa:59",
            "net9": "1e:72:9d:15:43:07"
        },
        "spine_2_1_2": {
            "net0": "0a:51:35:68:39:09",
            "net1": "5e:11:0b:ae:79:91",
            "net10": "7a:31:54:86:b2:41",
            "net11": "56:42:94:88:70:94",
            "net12": "2a:ab:f6:5d:a8:17",
            "net13": "36:25:77:02:ee:29",
            "net14": "66:9f:f1:15:e0:c4",
            "net15": "3a:9a:67:90:68:50",
            "net2": "a6:b0:6c:fd:a1:dd",
            "net3": "62:5d:13:30:cf:83",
            "net4": "66:5d:87:cd:74:a6",
            "net5": "62:b2:fb:23:43:07",
            "net6": "36:69:4d:21:5e:53",
            "net7": "42:8e:85:8d:d2:df",
            "net8": "5e:b7:37:8f:29:d6",
            "net9": "a2:e9:d7:92:d6:15"
        },
        "spine_2_1_3": {
            "net0": "42:8f:d4:d5:2c:93",
            "net1": "c6:5f:5d:29:8f:cb",
            "net10": "fa:f3:8a:eb:b5:07",
            "net11": "e2:ba:4d:25:8f:32",
            "net12": "c2:0a:c1:11:64:18",
            "net13": "42:a5:6f:ed:83:b6",
            "net14": "8e:46:24:50:19:4a",
            "net15": "82:df:e7:8b:a6:3c",
            "net2": "ee:d1:25:c8:87:75",
            "net3": "e6:4d:d1:d0:b9:ad",
            "net4": "12:e2:58:b8:51:04",
            "net5": "32:8a:46:f2:67:d0",
            "net6": "fa:5e:db:c4:6b:12",
            "net7": "a6:20:67:73:8e:1d",
            "net8": "02:11:e6:81:4a:7d",
            "net9": "16:c7:38:aa:cc:c4"
        },
        "spine_2_1_4": {
            "net0": "66:9c:51:eb:6e:c3",
            "net1": "b2:be:f1:5a:44:0e",
            "net10": "4a:1c:42:33:93:c7",
            "net11": "72:54:56:3c:6e:88",
            "net12": "0e:91:2f:ea:4f:a8",
            "net13": "96:9e:a1:c8:2e:b2",
            "net14": "f6:a4:d5:f4:f7:81",
            "net15": "32:7f:99:03:a8:4e",
            "net2": "96:02:33:8c:31:44",
            "net3": "3e:db:4d:e2:30:f6",
            "net4": "32:21:65:5a:e2:17",
            "net5": "22:58:80:a3:3d:90",
            "net6": "96:fa:2e:e9:17:d9",
            "net7": "4e:34:10:f6:b9:e7",
            "net8": "3e:f8:3f:fa:08:b1",
            "net9": "0a:5b:7c:6c:13:ce"
        },
        "spine_2_1_5": {
            "net0": "e2:be:61:ea:75:29",
            "net1": "a2:4a:b3:a3:2b:73",
            "net10": "1a:7a:b9:14:13:10",
            "net11": "de:76:35:cc:f5:b6",
            "net12": "0e:b4:76:b1:a4:78",
            "net13": "32:15:3a:92:25:a8",
            "net14": "2a:ff:8e:90:ce:29",
            "net15": "f2:89:c0:0e:33:22",
            "net2": "3a:27:b1:7c:4a:ff",
            "net3": "5e:c2:ba:0a:8a:44",
            "net4": "5e:de:fd:4f:52:f7",
            "net5": "82:6a:21:cc:3e:0a",
            "net6": "92:f3:be:f4:0a:c8",
            "net7": "5a:b0:79:82:61:e5",
            "net8": "42:d8:e7:b2:04:9a",
            "net9": "86:12:a7:c3:5f:b9"
        },
        "spine_2_1_6": {
            "net0": "e6:ef:2e:8b:bc:d6",
            "net1": "ae:b3:0f:53:b9:2b",
            "net10": "f2:71:09:ce:e0:85",
            "net11": "ce:7c:d7:4c:42:c3",
            "net12": "62:90:4e:42:67:f9",
            "net13": "ae:8d:50:48:cf:60",
            "net14": "f6:78:b2:07:46:70",
            "net15": "c2:0f:44:99:f6:29",
            "net2": "f6:91:f2:4d:b0:d6",
            "net3": "2a:78:67:63:3e:d9",
            "net4": "8a:b9:cb:61:a4:99",
            "net5": "7a:1b:72:b5:7d:5d",
            "net6": "66:9b:e7:d8:ce:4c",
            "net7": "7e:a1:70:45:0f:f1",
            "net8": "d6:d9:48:f5:b6:22",
            "net9": "0a:2c:df:41:5e:87"
        },
        "spine_2_1_7": {
            "net0": "da:cc:72:32:d8:c3",
            "net1": "3a:7c:96:8e:d9:b9",
            "net10": "ae:bd:63:57:3f:a6",
            "net11": "7e:f8:4f:7c:e1:ae",
            "net12": "46:51:24:32:05:f5",
            "net13": "ea:90:73:4b:fa:7c",
            "net14": "4a:76:53:98:7c:79",
            "net15": "2a:8b:c3:98:00:f9",
            "net2": "22:bf:ba:ba:59:13",
            "net3": "62:5b:76:cb:43:db",
            "net4": "ba:02:ea:bb:90:9d",
            "net5": "fa:e6:c5:56:63:19",
            "net6": "62:9d:42:58:2e:5e",
            "net7": "e6:1c:28:86:e6:52",
            "net8": "f6:6e:93:c1:82:d4",
            "net9": "9e:4d:b3:9b:7f:47"
        },
        "spine_2_1_8": {
            "net0": "8e:40:34:19:02:2a",
            "net1": "7a:32:a8:0f:b0:50",
            "net10": "4a:a3:68:db:9f:4c",
            "net11": "3a:e5:67:a6:09:df",
            "net12": "3a:18:69:9e:56:09",
            "net13": "ea:12:6a:75:39:48",
            "net14": "a2:ad:93:83:4d:c3",
            "net15": "82:07:d0:fa:9c:ea",
            "net2": "86:12:0f:fc:56:59",
            "net3": "26:8a:dc:1f:32:4e",
            "net4": "e6:28:c1:13:8f:b0",
            "net5": "b6:59:a4:f4:ed:60",
            "net6": "96:ca:43:04:f2:01",
            "net7": "be:98:5f:ac:65:b6",
            "net8": "f6:7b:28:21:ea:ca",
            "net9": "ae:27:3b:63:e4:86"
        },
        "spine_3_1_1": {
            "net0": "3a:97:df:43:04:71",
            "net1": "fa:2e:e4:e7:27:7e",
            "net10": "d6:68:2b:17:a8:70",
            "net11": "7a:0f:e0:cb:98:fa",
            "net12": "be:a2:64:30:2d:62",
            "net13": "22:d6:9a:91:32:40",
            "net14": "06:b6:68:ee:69:0c",
            "net15": "2a:7c:29:7e:a9:0f",
            "net2": "66:e2:ac:ed:f4:44",
            "net3": "5e:aa:fc:c6:fe:6f",
            "net4": "6a:3f:5c:a3:6f:a6",
            "net5": "7e:30:c3:72:66:48",
            "net6": "7a:3c:32:bd:57:75",
            "net7": "c6:30:53:2c:49:f4",
            "net8": "36:94:16:3d:40:19",
            "net9": "22:66:e9:e0:15:2d"
        },
        "spine_3_1_2": {
            "net0": "de:a0:71:5d:8c:0a",
            "net1": "16:63:7c:36:30:6f",
            "net10": "ae:ae:1b:2b:9c:06",
            "net11": "12:89:d8:ec:ac:b2",
            "net12": "ce:e3:81:8c:22:af",
            "net13": "46:a3:fc:38:63:c4",
            "net14": "aa:cc:20:0c:f0:55",
            "net15": "be:90:90:f8:db:29",
            "net2": "16:1e:9b:40:bb:92",
            "net3": "2a:87:3e:e6:46:2a",
            "net4": "7e:e1:71:4b:d9:86",
            "net5": "c2:fb:2c:ec:b7:9e",
            "net6": "96:76:a9:4b:0e:6c",
            "net7": "1e:1e:33:04:99:56",
            "net8": "ba:1b:2b:94:6e:59",
            "net9": "06:e9:5f:4c:91:72"
        },
        "spine_3_1_3": {
            "net0": "e2:ae:48:d6:50:65",
            "net1": "c6:29:a5:ba:f2:fe",
            "net10": "9a:b7:4b:d3:41:7e",
            "net11": "72:08:54:1d:80:93",
            "net12": "92:91:bc:5c:32:ca",
            "net13": "16:65:41:70:ba:37",
            "net14": "3a:68:03:fb:45:ce",
            "net15": "da:1a:43:e9:f7:49",
            "net2": "d6:5d:04:b6:f9:e1",
            "net3": "da:40:2b:93:3a:e7",
            "net4": "da:51:1c:19:01:a1",
            "net5": "36:76:7c:fa:cc:03",
            "net6": "7e:38:b3:89:18:1e",
            "net7": "fa:ba:64:52:fc:12",
            "net8": "5a:80:c6:c7:ac:d4",
            "net9": "3e:9c:47:3a:2e:8a"
        },
        "spine_3_1_4": {
            "net0": "4a:c9:e3:60:cf:f7",
            "net1": "86:7c:fb:06:d8:b4",
            "net10": "fe:55:23:b9:26:a8",
            "net11": "4e:37:d2:81:44:dc",
            "net12": "2e:44:04:d6:2c:20",
            "net13": "56:d6:63:98:23:f3",
            "net14": "72:1e:cd:d9:e2:fd",
            "net15": "9a:e2:0b:bd:2b:5a",
            "net2": "c6:91:c1:f6:41:ef",
            "net3": "82:55:aa:47:a7:c3",
            "net4": "16:a0:a2:ad:5e:ad",
            "net5": "de:6b:06:0f:bb:e9",
            "net6": "32:b0:8c:2d:9d:f3",
            "net7": "b2:32:81:af:2c:86",
            "net8": "ae:e7:8e:56:36:35",
            "net9": "0e:3b:60:5e:cc:c9"
        },
        "spine_3_1_5": {
            "net0": "ae:05:68:97:ac:e6",
            "net1": "56:7c:f6:75:84:b4",
            "net10": "b2:ee:12:f9:5b:e0",
            "net11": "da:67:fa:2e:2f:5e",
            "net12": "4e:fd:7e:65:29:11",
            "net13": "3e:3b:fa:d1:a1:a1",
            "net14": "0a:54:0b:2d:79:f8",
            "net15": "ea:79:cb:ae:61:ed",
            "net2": "2e:53:c4:44:83:71",
            "net3": "62:fc:17:1f:76:59",
            "net4": "c2:e7:c3:ec:3d:74",
            "net5": "7e:7b:c2:11:ff:68",
            "net6": "aa:d9:93:ec:b5:1e",
            "net7": "92:c6:3c:06:ba:6c",
            "net8": "4e:49:00:00:1d:2e",
            "net9": "12:b3:c1:24:ea:21"
        },
        "spine_3_1_6": {
            "net0": "32:12:0e:92:82:05",
            "net1": "b6:29:a8:58:99:ad",
            "net10": "46:58:b4:c8:6a:6a",
            "net11": "16:3f:c9:76:b4:42",
            "net12": "1a:bc:f8:eb:85:be",
            "net13": "ae:81:6b:03:e9:47",
            "net14": "0a:93:7c:d7:d7:9e",
            "net15": "8e:75:0c:67:95:25",
            "net2": "6a:fb:5a:12:df:95",
            "net3": "4e:40:3a:fb:4a:17",
            "net4": "2e:9a:7a:20:15:09",
            "net5": "62:11:be:96:cb:8b",
            "net6": "5a:87:01:84:95:6f",
            "net7": "9a:25:3a:4f:d9:e1",
            "net8": "56:24:7f:a2:52:89",
            "net9": "ba:94:e5:40:7f:96"
        },
        "spine_3_1_7": {
            "net0": "a6:5a:dd:db:3f:71",
            "net1": "46:38:9f:c4:81:29",
            "net10": "fa:7d:45:f5:80:2f",
            "net11": "ba:97:be:be:8d:41",
            "net12": "be:a4:a5:44:9a:0b",
            "net13": "f6:26:f9:d1:90:6a",
            "net14": "0a:84:68:1f:14:61",
            "net15": "1a:f0:46:6f:79:2a",
            "net2": "ea:cc:25:9d:06:3c",
            "net3": "a2:be:7d:02:8c:42",
            "net4": "66:55:e3:d2:7e:14",
            "net5": "ae:49:32:5a:b0:84",
            "net6": "4a:7f:fb:0d:2f:2d",
            "net7": "ba:1a:32:e8:3c:6e",
            "net8": "6e:1c:3e:66:b5:0b",
            "net9": "62:8d:bd:27:7c:6b"
        },
        "spine_3_1_8": {
            "net0": "4e:4d:1e:74:5f:6a",
            "net1": "96:1d:7b:06:2d:e7",
            "net10": "3e:59:21:c5:02:a1",
            "net11": "5a:77:2a:84:ab:bd",
            "net12": "ee:1f:4e:d2:32:9f",
            "net13": "92:59:c2:c8:16:15",
            "net14": "92:22:ce:bd:36:6f",
            "net15": "c6:ea:29:82:f3:30",
            "net2": "ba:64:87:a1:87:ac",
            "net3": "da:0c:fd:0a:4e:57",
            "net4": "6e:8b:43:69:6f:b5",
            "net5": "be:26:44:6e:1e:1c",
            "net6": "7e:d5:90:14:a9:05",
            "net7": "a6:0c:88:15:70:4f",
            "net8": "a6:aa:d6:ec:71:02",
            "net9": "76:96:bd:33:93:3c"
        },
        "spine_4_1_1": {
            "net0": "32:cd:c1:12:42:80",
            "net1": "fa:90:49:0f:7a:35",
            "net10": "32:25:fe:be:d5:62",
            "net11": "46:ad:07:45:9f:3e",
            "net12": "92:94:54:6f:89:87",
            "net13": "d6:42:f1:9b:64:ad",
            "net14": "0e:cf:06:5e:d6:5c",
            "net15": "1e:7a:0d:ed:30:30",
            "net2": "06:31:b8:7b:f9:3a",
            "net3": "b2:33:bf:5b:33:3b",
            "net4": "7a:b8:97:f9:ca:c9",
            "net5": "b2:88:49:2d:b0:ba",
            "net6": "be:9d:00:3b:a8:5d",
            "net7": "e6:cf:ef:cb:ba:bf",
            "net8": "ea:d0:c6:98:f2:df",
            "net9": "a6:66:18:67:75:64"
        },
        "spine_4_1_2": {
            "net0": "06:e5:d8:59:4d:3f",
            "net1": "62:3d:ef:91:ab:cc",
            "net10": "1a:1d:97:61:db:3c",
            "net11": "56:da:5d:40:43:39",
            "net12": "ee:01:0d:fa:3d:28",
            "net13": "8a:86:a1:27:1c:f4",
            "net14": "be:2c:9f:95:8a:87",
            "net15": "ba:fc:4c:c2:ac:6b",
            "net2": "0a:23:51:99:83:ac",
            "net3": "f6:b8:a9:d1:36:47",
            "net4": "36:ad:28:7f:b8:5f",
            "net5": "ee:b2:88:2b:38:94",
            "net6": "16:cd:ff:8f:9a:a2",
            "net7": "02:22:74:93:6d:c1",
            "net8": "7a:fa:10:d3:93:75",
            "net9": "82:79:97:d1:84:d6"
        },
        "spine_4_1_3": {
            "net0": "8e:c6:5e:64:11:29",
            "net1": "26:52:bc:51:8d:0c",
            "net10": "7e:fc:4e:dd:c1:17",
            "net11": "be:63:ac:be:17:10",
            "net12": "6e:5d:1f:ba:86:c7",
            "net13": "8e:c9:cd:44:8d:d9",
            "net14": "06:bf:0e:6d:9a:33",
            "net15": "da:7d:3a:93:8a:d6",
            "net2": "8e:51:16:32:ba:4d",
            "net3": "56:c9:25:dc:55:a7",
            "net4": "a6:31:da:46:55:eb",
            "net5": "fe:8c:1e:a4:4a:3d",
            "net6": "de:c9:d8:a3:54:e8",
            "net7": "c2:1f:5a:4a:ea:c9",
            "net8": "be:11:2b:f7:15:40",
            "net9": "62:9c:3d:8a:20:0e"
        },
        "spine_4_1_4": {
            "net0": "8e:0a:6d:4c:95:a2",
            "net1": "6e:ac:76:49:1e:7d",
            "net10": "8a:f2:49:c6:0f:f8",
            "net11": "d2:f1:ed:67:67:3d",
            "net12": "52:f4:27:8d:33:45",
            "net13": "72:00:1c:71:e6:bd",
            "net14": "66:ae:c2:50:e3:53",
            "net15": "aa:f7:a2:3a:b7:9e",
            "net2": "d2:7c:06:db:b5:3b",
            "net3": "7e:a7:d7:b5:32:37",
            "net4": "8a:c4:d0:bf:18:b3",
            "net5": "26:5a:15:58:03:4b",
            "net6": "76:22:0e:16:6a:21",
            "net7": "6e:84:47:1c:bc:14",
            "net8": "92:77:6c:41:8d:3e",
            "net9": "f6:c3:42:e0:36:1e"
        },
        "spine_4_1_5": {
            "net0": "82:32:80:53:62:87",
            "net1": "92:ce:dc:93:a0:7d",
            "net10": "d6:0a:f8:7a:b7:b7",
            "net11": "76:37:e7:8a:e7:0f",
            "net12": "86:b0:f5:07:06:27",
            "net13": "ba:55:92:82:1d:6b",
            "net14": "da:d4:92:53:21:b2",
            "net15": "1a:2f:cf:65:79:45",
            "net2": "d2:96:24:f6:a5:b2",
            "net3": "02:ed:fc:75:ed:cd",
            "net4": "62:3e:1d:38:a8:48",
            "net5": "de:ee:b8:05:65:46",
            "net6": "06:cf:c6:a7:9e:ec",
            "net7": "b6:66:30:24:a8:3a",
            "net8": "6e:c6:c3:f9:cd:ad",
            "net9": "de:18:27:ec:76:af"
        },
        "spine_4_1_6": {
            "net0": "66:97:33:74:26:48",
            "net1": "ae:c0:16:d4:8b:9b",
            "net10": "de:86:ab:29:13:1a",
            "net11": "ee:2a:1f:0a:fe:fd",
            "net12": "9e:ec:8f:1a:c0:41",
            "net13": "66:cc:84:53:a7:6e",
            "net14": "62:44:c1:9f:9a:38",
            "net15": "4e:95:4a:98:18:82",
            "net2": "ce:d1:e1:30:aa:3d",
            "net3": "a2:19:b8:cb:71:ea",
            "net4": "56:13:e1:89:d0:58",
            "net5": "ee:3c:09:0f:40:82",
            "net6": "fe:8e:92:be:26:ad",
            "net7": "8e:39:b5:c9:aa:98",
            "net8": "fa:65:09:cf:eb:ff",
            "net9": "6a:9f:44:2e:a5:46"
        },
        "spine_4_1_7": {
            "net0": "72:eb:c9:bf:0f:2e",
            "net1": "fe:8c:73:96:29:47",
            "net10": "16:d7:ab:f7:75:91",
            "net11": "7e:c2:f2:d5:ad:6f",
            "net12": "6a:0f:3c:6e:99:be",
            "net13": "96:d7:17:de:d5:87",
            "net14": "56:28:70:36:b8:a3",
            "net15": "a6:b5:53:1d:5b:7b",
            "net2": "ce:8f:18:0f:77:ae",
            "net3": "4e:6a:84:69:fd:8c",
            "net4": "c6:1d:32:2a:04:3e",
            "net5": "d2:2f:86:1e:fa:e0",
            "net6": "82:25:f8:80:a4:99",
            "net7": "e6:9e:c3:80:b8:e7",
            "net8": "56:8e:b3:9e:1f:b8",
            "net9": "ca:c3:06:ac:7a:4b"
        },
        "spine_4_1_8": {
            "net0": "ee:73:e3:1f:de:c5",
            "net1": "e6:c6:87:49:1d:e7",
            "net10": "ca:5d:48:68:52:ab",
            "net11": "0a:0d:c3:5f:ec:c6",
            "net12": "9a:21:7a:92:5a:1e",
            "net13": "32:60:5d:76:df:03",
            "net14": "c6:a3:50:f7:99:8f",
            "net15": "6e:17:93:ba:ab:b2",
            "net2": "5a:b9:0a:8e:96:7f",
            "net3": "32:ae:16:19:2b:93",
            "net4": "4e:ea:a8:f0:de:20",
            "net5": "0e:69:74:22:c3:cb",
            "net6": "da:7e:50:10:de:0b",
            "net7": "02:0d:4d:68:6e:8e",
            "net8": "52:05:34:6e:20:9f",
            "net9": "42:c9:f8:74:7b:ab"
        },
        "spine_5_1_1": {
            "net0": "1a:ba:c7:a5:48:00",
            "net1": "62:7c:a7:1d:d8:99",
            "net10": "12:c2:75:60:62:17",
            "net11": "3e:1a:75:a2:b5:6d",
            "net12": "86:cf:18:f8:37:ec",
            "net13": "f6:49:32:af:f6:c1",
            "net14": "b6:86:f2:10:e2:7a",
            "net15": "9a:02:4b:0c:02:3a",
            "net2": "26:a9:f9:7b:e2:de",
            "net3": "36:c8:53:00:7f:35",
            "net4": "ce:71:8a:95:38:0a",
            "net5": "7a:cf:90:e4:cd:86",
            "net6": "3a:b0:77:cb:64:71",
            "net7": "32:21:1f:ee:c5:76",
            "net8": "1a:8d:03:bb:86:dd",
            "net9": "a2:38:19:02:4f:6e"
        },
        "spine_5_1_2": {
            "net0": "6a:e5:95:24:fe:35",
            "net1": "de:49:ff:a0:05:5c",
            "net10": "62:d9:6f:13:e9:94",
            "net11": "4e:56:99:28:b7:41",
            "net12": "02:a7:8c:bc:c7:c3",
            "net13": "42:2b:6f:fa:d4:a6",
            "net14": "7a:61:6d:f9:cf:b3",
            "net15": "aa:2e:e7:69:8d:55",
            "net2": "1e:d1:38:84:18:f5",
            "net3": "72:f6:99:41:9d:f8",
            "net4": "2a:d2:43:ab:b1:14",
            "net5": "56:3c:e7:2f:66:59",
            "net6": "da:87:28:59:bc:c7",
            "net7": "72:cd:32:42:3d:e5",
            "net8": "1e:b7:82:08:dd:dc",
            "net9": "82:6e:95:d5:cd:3e"
        },
        "spine_5_1_3": {
            "net0": "2e:8e:08:cd:39:47",
            "net1": "ee:c9:23:41:7e:db",
            "net10": "b6:7e:17:8b:1d:3f",
            "net11": "fe:a3:a6:af:1b:b3",
            "net12": "fe:56:d5:41:7b:6a",
            "net13": "a2:cc:27:45:37:9c",
            "net14": "b2:c5:31:8d:cb:f9",
            "net15": "06:52:ba:fa:3b:c1",
            "net2": "96:26:45:ea:58:74",
            "net3": "36:4a:ec:15:71:da",
            "net4": "62:80:78:e5:58:45",
            "net5": "ae:7e:f5:70:8c:98",
            "net6": "0e:cd:2a:c0:7d:01",
            "net7": "9a:df:ff:f8:12:0d",
            "net8": "de:ea:31:ab:6f:7d",
            "net9": "0a:cc:be:ae:1e:eb"
        },
        "spine_5_1_4": {
            "net0": "32:18:51:c2:fe:b0",
            "net1": "d2:d6:9c:40:c9:da",
            "net10": "c2:e2:96:b8:c5:78",
            "net11": "3a:17:85:28:be:b6",
            "net12": "6e:34:04:a5:b1:f0",
            "net13": "6e:e7:45:6e:ae:63",
            "net14": "66:4d:7c:84:14:27",
            "net15": "ce:81:02:a8:ce:65",
            "net2": "e6:66:c2:ab:b4:05",
            "net3": "6a:03:96:10:60:47",
            "net4": "22:72:8b:4d:0f:0d",
            "net5": "36:df:e0:37:fd:1f",
            "net6": "82:0c:a4:87:e5:0e",
            "net7": "a6:ed:9c:b8:2d:7e",
            "net8": "82:bc:25:f1:ed:41",
            "net9": "8a:fd:68:b4:d4:6c"
        },
        "spine_5_1_5": {
            "net0": "ba:75:a0:53:f1:12",
            "net1": "2e:a9:ff:13:6b:b9",
            "net10": "ce:95:cf:d0:3c:ae",
            "net11": "aa:e3:e8:b3:09:42",
            "net12": "aa:39:c0:19:d9:c8",
            "net13": "5a:8e:e2:bc:d8:38",
            "net14": "52:ae:4f:70:fc:dc",
            "net15": "de:23:97:6b:02:8e",
            "net2": "ae:86:92:cd:af:1a",
            "net3": "aa:2c:99:5b:d4:a9",
            "net4": "3a:df:b6:41:50:82",
            "net5": "fe:f7:0c:ec:87:b6",
            "net6": "fe:a1:21:3e:21:44",
            "net7": "ee:bb:f8:0e:e9:bc",
            "net8": "8e:73:8e:63:b4:3f",
            "net9": "36:e6:37:a1:02:50"
        },
        "spine_5_1_6": {
            "net0": "5a:46:1e:7e:47:3d",
            "net1": "b6:f3:90:8c:05:91",
            "net10": "7a:bd:3e:d6:29:51",
            "net11": "be:9e:3d:56:a4:30",
            "net12": "8a:5f:c1:71:af:9d",
            "net13": "ca:4f:79:03:4e:b8",
            "net14": "9e:20:6c:86:a7:d0",
            "net15": "fe:f2:00:1b:1f:ac",
            "net2": "d2:97:2b:05:66:31",
            "net3": "5a:ef:12:bb:e3:e5",
            "net4": "ba:d2:fc:bf:10:09",
            "net5": "ee:70:f8:13:81:f2",
            "net6": "b2:27:17:56:64:6c",
            "net7": "96:a2:0c:ef:63:cd",
            "net8": "be:a5:cc:1b:74:16",
            "net9": "4e:81:36:86:b1:8f"
        },
        "spine_5_1_7": {
            "net0": "52:5a:f3:d5:c0:7c",
            "net1": "92:d3:a4:89:17:b5",
            "net10": "ca:c4:de:5c:be:98",
            "net11": "4e:7b:14:ee:b2:93",
            "net12": "06:dc:b0:03:a9:d2",
            "net13": "b6:74:0d:9b:2f:5e",
            "net14": "32:40:44:5f:9c:0a",
            "net15": "e6:f2:8e:49:3a:d0",
            "net2": "26:94:ff:90:23:56",
            "net3": "e6:a0:e0:58:05:c9",
            "net4": "06:5a:23:27:3e:f7",
            "net5": "26:f6:f0:b3:d2:6f",
            "net6": "8a:c4:22:dc:8e:d6",
            "net7": "be:27:b5:81:82:63",
            "net8": "86:99:50:90:b1:35",
            "net9": "7e:c1:1d:60:53:50"
        },
        "spine_5_1_8": {
            "net0": "ea:4e:3e:58:03:58",
            "net1": "32:e1:1f:9b:cd:a5",
            "net10": "b6:95:cb:40:3d:8a",
            "net11": "ea:06:ed:cf:90:40",
            "net12": "82:ac:b3:71:8a:bb",
            "net13": "7e:14:fe:bb:1a:54",
            "net14": "56:cd:08:ec:df:1d",
            "net15": "e6:d9:c6:4f:75:63",
            "net2": "56:10:62:16:e5:bd",
            "net3": "0e:6c:ed:29:40:a1",
            "net4": "9e:e7:2f:ce:ab:f0",
            "net5": "0a:7f:cf:16:c4:df",
            "net6": "2a:2c:a7:e5:01:79",
            "net7": "0a:39:1b:86:2a:79",
            "net8": "22:0d:02:37:f8:d2",
            "net9": "b2:2b:c1:78:f9:81"
        },
        "spine_6_1_1": {
            "net0": "8a:71:61:6b:9e:84",
            "net1": "56:d0:47:5e:b1:b6",
            "net10": "56:ea:d9:8b:04:0d",
            "net11": "82:4e:d3:0c:3f:73",
            "net12": "4e:ed:33:9e:f5:b1",
            "net13": "86:20:30:e3:79:96",
            "net14": "a6:c7:71:0a:dc:62",
            "net15": "c2:1c:9d:0a:5d:b3",
            "net2": "3a:67:a6:d7:86:1b",
            "net3": "aa:f4:c2:eb:2a:fa",
            "net4": "6e:b3:2a:f5:e4:4c",
            "net5": "e2:3f:6d:89:6d:48",
            "net6": "66:65:75:61:c4:cb",
            "net7": "3a:12:af:77:e0:db",
            "net8": "ea:06:6c:b2:a1:b1",
            "net9": "ca:66:fe:89:f8:9d"
        },
        "spine_6_1_2": {
            "net0": "fe:31:56:a8:6b:95",
            "net1": "0a:83:d2:a1:9e:f1",
            "net10": "fe:b6:78:52:69:7b",
            "net11": "76:65:6b:5a:b7:6d",
            "net12": "66:f8:be:29:d2:6d",
            "net13": "fa:d4:08:28:af:a1",
            "net14": "e2:52:37:83:96:57",
            "net15": "02:4b:81:2f:98:2d",
            "net2": "3a:e5:4c:8b:fe:7c",
            "net3": "b6:fb:44:5b:61:95",
            "net4": "ca:c8:f2:dc:db:87",
            "net5": "52:67:ce:f6:bf:37",
            "net6": "fa:64:fc:a0:80:31",
            "net7": "fa:c0:eb:a5:80:59",
            "net8": "86:bf:f9:5d:c0:cb",
            "net9": "06:f1:53:4d:6b:4b"
        },
        "spine_6_1_3": {
            "net0": "8e:b0:96:9d:00:25",
            "net1": "6a:05:7b:dc:f4:b8",
            "net10": "5a:53:b3:12:e3:f0",
            "net11": "c2:11:5e:53:4f:41",
            "net12": "f6:db:41:d1:33:9b",
            "net13": "fa:45:10:3c:b3:a2",
            "net14": "22:c9:c0:d2:d5:45",
            "net15": "c6:5b:82:ef:82:51",
            "net2": "7e:a0:73:7f:fc:f8",
            "net3": "7e:21:82:22:92:c7",
            "net4": "e2:b7:40:11:75:d5",
            "net5": "b6:df:a5:cc:80:1e",
            "net6": "16:2c:43:5d:91:89",
            "net7": "ba:5e:0b:e0:e1:2e",
            "net8": "2a:00:7a:80:5d:73",
            "net9": "46:c1:c1:4e:26:f6"
        },
        "spine_6_1_4": {
            "net0": "16:a5:77:3b:36:e3",
            "net1": "86:ff:d9:e0:a3:ab",
            "net10": "3a:fb:3f:92:51:05",
            "net11": "e6:a3:0c:f3:50:9b",
            "net12": "16:dd:80:22:e7:b0",
            "net13": "a2:1e:0f:68:93:6b",
            "net14": "f2:b7:42:d7:ca:4b",
            "net15": "ee:88:ad:02:f3:68",
            "net2": "1e:9d:ac:49:74:e2",
            "net3": "aa:0d:37:b3:bd:b2",
            "net4": "12:b7:5a:d8:6f:47",
            "net5": "a6:13:0a:a7:1a:06",
            "net6": "0e:e5:6d:ee:d9:2b",
            "net7": "9e:25:fe:3e:28:dd",
            "net8": "42:cd:76:f9:0f:4f",
            "net9": "d6:e1:a3:3f:bb:e6"
        },
        "spine_6_1_5": {
            "net0": "f6:c1:f1:34:c0:c2",
            "net1": "16:f2:ff:f8:5d:34",
            "net10": "26:06:08:a7:52:c4",
            "net11": "0e:93:92:71:70:e2",
            "net12": "f2:42:84:46:31:df",
            "net13": "e2:ab:42:19:1b:25",
            "net14": "72:33:4f:2c:2c:95",
            "net15": "82:d8:2a:62:c9:f0",
            "net2": "8a:90:7b:07:41:ed",
            "net3": "16:17:25:c5:d3:d4",
            "net4": "8a:88:c5:eb:dd:d2",
            "net5": "c6:84:0f:9e:b1:60",
            "net6": "22:1a:cc:b4:e0:59",
            "net7": "5a:b7:1a:00:0f:a6",
            "net8": "9a:4b:9e:59:ae:d8",
            "net9": "5a:57:bb:ec:73:12"
        },
        "spine_6_1_6": {
            "net0": "96:ba:0c:20:7a:b0",
            "net1": "82:15:77:7a:39:de",
            "net10": "12:4a:4a:8b:7d:92",
            "net11": "26:83:81:90:2f:f9",
            "net12": "96:3a:55:92:67:01",
            "net13": "4a:37:5d:95:ff:b6",
            "net14": "ea:cf:5c:40:74:47",
            "net15": "2e:1a:b4:e2:f5:ac",
            "net2": "5e:2e:95:8d:10:6e",
            "net3": "8e:f6:cc:11:45:53",
            "net4": "56:a0:49:f8:44:f5",
            "net5": "ae:d0:f4:67:4d:7a",
            "net6": "1e:1e:83:cd:0b:3f",
            "net7": "aa:6b:3c:e3:db:86",
            "net8": "ee:fd:42:1a:a9:10",
            "net9": "ce:a4:46:c1:32:af"
        },
        "spine_6_1_7": {
            "net0": "32:c1:2d:1b:47:94",
            "net1": "2a:a0:30:9b:b5:07",
            "net10": "b6:79:36:25:95:e7",
            "net11": "42:86:c1:c2:b1:fe",
            "net12": "1a:6d:be:88:ab:08",
            "net13": "56:e1:30:66:d7:77",
            "net14": "e6:6e:5f:fe:c9:4f",
            "net15": "5e:2f:fe:5c:84:9f",
            "net2": "9a:2e:51:de:57:c8",
            "net3": "da:d1:b5:fa:01:80",
            "net4": "86:9e:1b:3f:b1:80",
            "net5": "26:5e:57:7c:51:f3",
            "net6": "b2:08:c2:58:24:ae",
            "net7": "aa:09:cb:a5:84:c0",
            "net8": "8e:95:f6:23:2c:07",
            "net9": "22:63:de:f8:58:d8"
        },
        "spine_6_1_8": {
            "net0": "1a:30:93:9b:b8:9f",
            "net1": "92:8b:43:0a:0c:7e",
            "net10": "de:ba:ef:e0:5b:8c",
            "net11": "a2:2f:ff:03:31:9e",
            "net12": "52:24:53:56:0d:4c",
            "net13": "0e:31:7b:01:34:4b",
            "net14": "5a:80:5c:56:95:a6",
            "net15": "e6:87:be:1d:64:07",
            "net2": "f2:5c:dc:64:af:c2",
            "net3": "f6:63:64:84:a8:92",
            "net4": "42:b3:96:4e:cc:fb",
            "net5": "f6:05:89:96:f6:9d",
            "net6": "8e:68:eb:de:ae:0d",
            "net7": "52:f8:06:ce:26:58",
            "net8": "86:f0:d2:03:fe:04",
            "net9": "c6:14:10:e4:79:cc"
        },
        "spine_7_1_1": {
            "net0": "aa:e4:52:72:54:c7",
            "net1": "9e:e7:a4:fd:a2:fc",
            "net10": "8e:99:4d:c5:73:57",
            "net11": "8e:a3:64:45:cd:0d",
            "net12": "0a:12:56:ec:ed:3b",
            "net13": "c6:da:80:e6:a0:32",
            "net14": "86:dc:56:26:02:0a",
            "net15": "d6:f1:6b:ec:1e:9e",
            "net2": "ee:90:a4:4f:ac:c5",
            "net3": "32:97:ba:e7:39:ea",
            "net4": "be:61:87:37:00:95",
            "net5": "7a:f8:15:4e:60:21",
            "net6": "8e:d0:10:97:ff:b8",
            "net7": "b6:e1:d2:45:52:f8",
            "net8": "ca:f7:1c:26:ea:be",
            "net9": "0a:ab:8f:d0:3c:a2"
        },
        "spine_7_1_2": {
            "net0": "4e:2b:9e:8f:f0:ee",
            "net1": "16:55:97:95:e6:7a",
            "net10": "76:5c:37:39:f0:f2",
            "net11": "c6:fb:6b:c9:23:4f",
            "net12": "8e:42:3b:6c:64:0c",
            "net13": "3e:3c:28:4d:66:45",
            "net14": "b2:16:1d:9c:f4:cd",
            "net15": "d2:0a:e0:c6:0f:76",
            "net2": "4a:c7:df:59:40:bb",
            "net3": "7a:6c:7c:04:6f:54",
            "net4": "42:b7:25:2f:c7:30",
            "net5": "16:fa:c5:c9:ef:75",
            "net6": "3e:d0:b3:12:e1:e1",
            "net7": "de:31:34:de:78:a7",
            "net8": "1a:6e:8b:f2:b4:a3",
            "net9": "52:ef:31:f0:5f:49"
        },
        "spine_7_1_3": {
            "net0": "1a:a1:08:c3:0a:dc",
            "net1": "9e:61:96:32:53:f3",
            "net10": "f2:70:e3:42:45:c8",
            "net11": "16:aa:c7:ea:ee:77",
            "net12": "ee:63:d7:dd:cb:87",
            "net13": "be:12:66:d0:2f:11",
            "net14": "f6:46:1e:a9:ca:75",
            "net15": "72:c3:e8:63:b6:82",
            "net2": "22:2f:80:65:62:67",
            "net3": "ea:40:81:3c:07:8c",
            "net4": "ae:3a:f7:45:92:91",
            "net5": "a2:54:84:35:54:4b",
            "net6": "26:0b:d7:39:df:f4",
            "net7": "96:a1:31:38:9c:bd",
            "net8": "ca:f5:ad:eb:3e:e5",
            "net9": "b6:c5:cb:42:c8:89"
        },
        "spine_7_1_4": {
            "net0": "06:3b:a6:05:e9:7c",
            "net1": "d2:67:45:af:95:fa",
            "net10": "2e:d7:3a:3a:84:37",
            "net11": "52:82:f3:8c:38:95",
            "net12": "6e:98:1d:c1:a3:d4",
            "net13": "6e:ad:03:cd:ff:28",
            "net14": "be:4d:2e:7c:81:dc",
            "net15": "fe:a5:e6:a7:3f:af",
            "net2": "fa:4a:ba:20:18:9e",
            "net3": "f2:b8:e3:03:ec:9d",
            "net4": "ae:26:a8:71:19:d6",
            "net5": "66:86:7a:f4:02:11",
            "net6": "26:87:4e:21:bb:de",
            "net7": "62:a8:cb:28:86:a1",
            "net8": "fe:74:a2:a9:7d:be",
            "net9": "32:74:89:40:d6:88"
        },
        "spine_7_1_5": {
            "net0": "06:47:a7:22:05:38",
            "net1": "d2:0a:9d:b7:76:e9",
            "net10": "8a:32:13:77:53:1d",
            "net11": "5a:47:60:4a:36:1e",
            "net12": "02:13:2f:7c:4c:57",
            "net13": "ba:77:d5:67:95:c7",
            "net14": "5e:8d:0e:ab:32:fe",
            "net15": "76:cf:80:6a:c2:aa",
            "net2": "5e:4f:32:e4:d1:6e",
            "net3": "56:88:ca:e0:e2:6d",
            "net4": "0a:cc:4f:ca:59:ff",
            "net5": "42:85:d2:7c:e6:e5",
            "net6": "02:a8:14:02:19:90",
            "net7": "ba:83:f4:2d:12:c1",
            "net8": "7a:66:58:d2:6f:14",
            "net9": "ce:dc:4c:9c:8a:0c"
        },
        "spine_7_1_6": {
            "net0": "8e:1e:85:db:7a:c4",
            "net1": "f6:a1:ed:e6:15:be",
            "net10": "7e:76:c2:e8:a2:76",
            "net11": "3e:a8:a0:f5:65:0f",
            "net12": "ca:8e:08:b7:2f:5c",
            "net13": "86:d3:16:00:ed:9d",
            "net14": "02:18:cf:95:f3:57",
            "net15": "ae:9d:05:c4:46:fd",
            "net2": "c2:6d:32:ed:60:02",
            "net3": "96:6e:60:ae:20:7e",
            "net4": "b6:de:3b:c5:dd:10",
            "net5": "f6:75:0f:c0:67:53",
            "net6": "2a:c1:4b:3a:ae:43",
            "net7": "16:6f:e7:3b:05:bb",
            "net8": "5a:61:7f:ad:88:e0",
            "net9": "e6:42:f8:52:34:a9"
        },
        "spine_7_1_7": {
            "net0": "ce:05:84:12:aa:f9",
            "net1": "56:46:82:24:c1:f9",
            "net10": "c6:a2:a0:3e:77:82",
            "net11": "82:2e:c4:fc:78:04",
            "net12": "c2:4a:8a:c6:b5:8f",
            "net13": "f6:de:53:ba:f1:5f",
            "net14": "86:64:9d:36:95:80",
            "net15": "9e:06:00:35:f6:0f",
            "net2": "a6:34:1f:1a:04:f4",
            "net3": "c6:cf:0e:93:79:60",
            "net4": "02:7d:98:09:e1:ee",
            "net5": "96:75:ab:f8:9d:48",
            "net6": "2a:91:72:33:b0:77",
            "net7": "32:3f:74:0a:6a:6a",
            "net8": "8a:61:6d:4d:27:2a",
            "net9": "0a:f5:ac:38:3d:c5"
        },
        "spine_7_1_8": {
            "net0": "22:4b:4b:e5:74:f0",
            "net1": "9e:86:bd:59:e6:6b",
            "net10": "da:58:5b:8e:fa:c5",
            "net11": "4a:29:b9:3e:2b:2e",
            "net12": "4e:96:5e:a4:74:7b",
            "net13": "8a:40:75:f2:5e:9f",
            "net14": "fe:5c:63:91:ec:cd",
            "net15": "be:dc:52:7b:1b:af",
            "net2": "ea:e4:cb:4e:e5:1e",
            "net3": "4e:13:8d:e1:39:28",
            "net4": "7e:69:8c:4a:32:75",
            "net5": "22:4b:d5:59:8a:5d",
            "net6": "06:95:89:d9:cc:a4",
            "net7": "5e:96:26:59:99:5c",
            "net8": "a6:7e:b6:27:39:0b",
            "net9": "66:5b:b3:0a:17:53"
        },
        "spine_8_1_1": {
            "net0": "46:3d:13:f5:32:97",
            "net1": "d2:9d:9c:40:10:f7",
            "net10": "d6:36:ea:23:53:74",
            "net11": "b2:a7:ad:21:da:8b",
            "net12": "5a:e7:26:8c:33:df",
            "net13": "e2:bc:7b:28:ec:78",
            "net14": "d6:25:98:73:41:80",
            "net15": "ba:68:89:69:0a:ba",
            "net2": "c6:93:42:1c:e5:e4",
            "net3": "5a:06:62:8c:13:3f",
            "net4": "c6:1b:4a:12:dc:4f",
            "net5": "3e:cb:f2:70:cf:93",
            "net6": "6a:f8:c5:48:ad:2d",
            "net7": "1a:50:f5:8c:47:d8",
            "net8": "c2:cf:c7:7e:08:13",
            "net9": "da:ce:34:e3:85:1a"
        },
        "spine_8_1_2": {
            "net0": "c2:e5:2a:26:be:c4",
            "net1": "16:d7:5f:22:fb:e0",
            "net10": "3a:61:4d:85:21:92",
            "net11": "be:d6:9b:52:00:c0",
            "net12": "32:ef:9f:c6:23:6a",
            "net13": "9e:46:1a:11:3a:6a",
            "net14": "de:ed:b1:33:73:e3",
            "net15": "56:6f:5b:5d:ed:bd",
            "net2": "d2:38:45:68:b3:46",
            "net3": "d6:65:e3:3d:63:bc",
            "net4": "f6:87:bd:62:9e:66",
            "net5": "16:98:ec:c3:84:2a",
            "net6": "ce:68:e5:76:d3:9f",
            "net7": "9a:51:1d:32:aa:19",
            "net8": "22:02:9f:f3:b5:8b",
            "net9": "26:f3:a6:04:4b:b6"
        },
        "spine_8_1_3": {
            "net0": "b2:20:94:18:7d:6b",
            "net1": "96:b2:8d:f2:75:01",
            "net10": "a6:12:a1:54:0a:fe",
            "net11": "9e:5f:63:13:e5:a2",
            "net12": "56:a1:84:89:52:80",
            "net13": "32:ec:52:9a:24:64",
            "net14": "be:65:87:ab:ae:02",
            "net15": "36:2a:ff:28:a3:63",
            "net2": "1a:96:8b:d6:88:ee",
            "net3": "92:8c:02:1f:c0:5e",
            "net4": "0e:a7:4c:20:73:61",
            "net5": "ce:23:24:c6:3e:e2",
            "net6": "8e:9c:54:93:77:70",
            "net7": "e6:cc:f9:c6:3e:05",
            "net8": "ea:dd:9d:71:d7:a2",
            "net9": "8a:0c:5c:29:66:d8"
        },
        "spine_8_1_4": {
            "net0": "ea:52:bc:44:0a:b2",
            "net1": "32:ef:67:db:22:71",
            "net10": "3e:cd:c7:65:8e:ab",
            "net11": "9e:40:ac:91:3f:37",
            "net12": "12:ab:43:48:40:9b",
            "net13": "b2:f0:fa:a0:14:e5",
            "net14": "d6:13:a3:12:c3:66",
            "net15": "be:a9:24:0f:e7:16",
            "net2": "92:25:c6:5d:72:27",
            "net3": "ae:6b:6b:e4:b4:bb",
            "net4": "32:fb:44:95:33:3c",
            "net5": "1a:19:34:1c:47:46",
            "net6": "46:78:94:a5:a5:bd",
            "net7": "12:1c:a9:1e:08:25",
            "net8": "5e:fb:d4:ff:a6:d5",
            "net9": "aa:9c:06:ee:3b:0c"
        },
        "spine_8_1_5": {
            "net0": "8a:97:84:33:66:0b",
            "net1": "ae:cf:46:df:76:b7",
            "net10": "52:f9:39:7a:ae:24",
            "net11": "ce:bf:ab:1e:83:55",
            "net12": "1e:c5:7c:6c:dc:75",
            "net13": "86:ce:99:04:ad:8a",
            "net14": "e6:f1:6d:85:18:cc",
            "net15": "86:f2:96:a8:46:2a",
            "net2": "26:97:9f:4c:57:d7",
            "net3": "2a:fc:3d:7a:17:ef",
            "net4": "22:1c:13:03:4e:bd",
            "net5": "4a:26:6f:ad:c3:ee",
            "net6": "b2:7a:1f:78:8e:23",
            "net7": "1a:eb:d6:05:a8:5f",
            "net8": "4a:19:f9:15:60:8a",
            "net9": "e2:28:7e:b0:c0:53"
        },
        "spine_8_1_6": {
            "net0": "32:ab:65:04:48:12",
            "net1": "d6:7c:df:a1:0f:77",
            "net10": "3e:51:d5:ef:29:84",
            "net11": "fe:ca:e9:04:df:55",
            "net12": "26:76:8c:ef:df:a1",
            "net13": "5a:08:97:a4:d4:b2",
            "net14": "26:18:72:0f:60:5e",
            "net15": "62:2e:0e:49:80:1a",
            "net2": "16:04:ad:7e:4e:b8",
            "net3": "5e:48:1e:4f:88:0b",
            "net4": "2a:67:65:a7:05:55",
            "net5": "e2:69:b2:4e:1b:1d",
            "net6": "ae:93:7d:3f:99:d5",
            "net7": "86:90:84:11:86:6d",
            "net8": "aa:e4:e9:95:f8:c2",
            "net9": "82:c1:af:bb:85:14"
        },
        "spine_8_1_7": {
            "net0": "72:a9:89:1a:d9:f4",
            "net1": "b6:3b:c8:f2:ca:ad",
            "net10": "02:7e:25:d6:97:40",
            "net11": "e6:b9:38:01:5e:d8",
            "net12": "96:19:29:6b:ba:e5",
            "net13": "de:b8:27:35:54:08",
            "net14": "56:e2:df:07:59:3a",
            "net15": "f6:43:06:45:be:4e",
            "net2": "0a:b6:c8:64:ac:40",
            "net3": "3a:cc:0b:d7:10:0a",
            "net4": "32:ae:e1:83:98:0d",
            "net5": "2a:b7:f3:54:4f:62",
            "net6": "1e:99:33:32:93:c5",
            "net7": "8e:88:9a:24:83:ee",
            "net8": "2a:da:fa:da:fa:e8",
            "net9": "4e:e7:e9:12:78:fd"
        },
        "spine_8_1_8": {
            "net0": "de:c6:45:72:c2:62",
            "net1": "1e:e1:15:cd:50:c7",
            "net10": "26:7c:70:e5:8a:b0",
            "net11": "9e:7b:33:0f:32:b5",
            "net12": "c6:1e:49:6b:c6:62",
            "net13": "76:5f:3c:a5:2a:54",
            "net14": "ce:c5:81:37:62:88",
            "net15": "62:9b:a0:d0:c2:fb",
            "net2": "7a:39:7f:99:65:9e",
            "net3": "3e:86:15:0f:9b:9a",
            "net4": "0a:58:a5:aa:e3:9c",
            "net5": "fa:ce:e1:c9:09:8a",
            "net6": "c2:44:6a:55:a8:34",
            "net7": "b6:27:46:0b:d9:4e",
            "net8": "42:ea:59:31:17:39",
            "net9": "62:70:3d:07:91:04"
        },
        "tof_1_2_1": {
            "net0": "42:46:76:ce:cf:23",
            "net1": "c6:ab:41:c6:f8:6a",
            "net10": "8e:a0:9c:31:14:09",
            "net11": "ca:e4:11:b1:21:fd",
            "net12": "0e:6d:d7:82:5d:8d",
            "net13": "c6:60:18:48:f0:2f",
            "net14": "ea:a7:fb:a5:8d:fc",
            "net15": "0e:0c:23:29:67:06",
            "net2": "3e:e5:1e:a1:38:ff",
            "net3": "5a:f3:a8:d2:ec:df",
            "net4": "6e:e7:ef:5c:9f:49",
            "net5": "fa:ec:88:03:ce:94",
            "net6": "16:e1:7c:39:04:7e",
            "net7": "72:f2:2b:46:74:7b",
            "net8": "02:6a:6c:a2:17:5f",
            "net9": "9a:da:00:a0:09:81"
        },
        "tof_1_2_2": {
            "net0": "4a:11:3a:01:66:f0",
            "net1": "86:d0:a2:57:07:07",
            "net10": "da:60:08:e3:2d:d0",
            "net11": "32:82:de:20:94:6b",
            "net12": "be:8e:9a:73:e2:4b",
            "net13": "d6:3a:1b:b0:b7:2f",
            "net14": "92:d6:a0:f7:f2:19",
            "net15": "12:6c:63:e8:0b:c1",
            "net2": "5a:f6:c7:b6:2e:28",
            "net3": "b2:7b:e6:e0:f8:96",
            "net4": "8e:5e:fb:5f:28:d8",
            "net5": "86:d3:04:e3:da:95",
            "net6": "b6:03:2e:24:3a:69",
            "net7": "42:8c:01:84:2e:04",
            "net8": "b2:c0:75:a6:2d:40",
            "net9": "02:0a:79:30:ac:ad"
        },
        "tof_1_2_3": {
            "net0": "16:f8:5d:57:b6:b6",
            "net1": "c6:51:28:d4:15:e8",
            "net10": "16:3b:50:0c:30:a4",
            "net11": "7a:2b:60:cf:e6:50",
            "net12": "6a:4e:4d:03:88:5b",
            "net13": "b2:e8:7d:9b:70:02",
            "net14": "42:4e:5c:62:a1:e3",
            "net15": "f2:96:c5:f1:07:5f",
            "net2": "ea:77:92:02:c6:11",
            "net3": "f2:1b:be:d4:ea:1f",
            "net4": "fe:9d:1b:d1:8a:ed",
            "net5": "ae:67:0a:43:4e:4c",
            "net6": "62:f9:ad:4f:19:4c",
            "net7": "8a:3e:54:90:46:2e",
            "net8": "32:54:b4:1f:ea:e9",
            "net9": "66:b3:37:66:95:c5"
        },
        "tof_1_2_4": {
            "net0": "c6:06:02:52:f4:3e",
            "net1": "02:dc:98:67:40:95",
            "net10": "9a:68:72:a3:aa:5f",
            "net11": "96:27:f7:03:85:08",
            "net12": "aa:45:13:83:ea:57",
            "net13": "d6:c0:73:74:6d:c6",
            "net14": "2e:08:27:6c:70:9b",
            "net15": "7a:d2:97:29:b3:0c",
            "net2": "66:09:06:9d:d9:84",
            "net3": "0e:fe:c3:7d:b7:d1",
            "net4": "ea:72:66:9b:6d:d5",
            "net5": "d6:07:c0:68:0e:a0",
            "net6": "9a:8c:07:fa:fa:51",
            "net7": "a6:3d:78:6f:54:7c",
            "net8": "7e:52:73:54:91:88",
            "net9": "3e:56:d0:82:89:46"
        },
        "tof_1_2_5": {
            "net0": "46:d9:f4:54:87:20",
            "net1": "16:fe:1a:fa:fb:fe",
            "net10": "9e:2b:e7:4d:e7:40",
            "net11": "96:c3:e3:49:d3:27",
            "net12": "76:ee:4c:cd:11:45",
            "net13": "82:eb:66:a8:e0:f2",
            "net14": "9a:6a:fd:6f:fe:a5",
            "net15": "e2:9e:52:b1:10:d8",
            "net2": "ea:18:1e:63:24:ec",
            "net3": "8e:3b:ff:d3:14:b6",
            "net4": "1e:05:dc:5a:d0:16",
            "net5": "9e:c5:2b:cb:95:b4",
            "net6": "a6:59:bf:7e:ea:ed",
            "net7": "12:5a:1a:89:ad:9f",
            "net8": "b6:4e:49:00:1f:ec",
            "net9": "c2:a1:97:c7:5f:d2"
        },
        "tof_1_2_6": {
            "net0": "66:25:a6:ce:c8:60",
            "net1": "fe:1c:8b:3a:e2:86",
            "net10": "0a:08:dd:1c:6a:0b",
            "net11": "f2:49:b4:56:5b:9c",
            "net12": "ce:42:9d:7f:14:f9",
            "net13": "ca:95:8e:95:7a:e2",
            "net14": "36:c1:34:b8:cd:cc",
            "net15": "a6:93:0f:30:7b:6e",
            "net2": "7a:e5:86:d5:24:06",
            "net3": "f6:99:cc:9c:9e:bc",
            "net4": "56:13:10:d1:06:d5",
            "net5": "b2:7c:66:c6:22:db",
            "net6": "f6:be:06:84:d9:a0",
            "net7": "2a:fc:7a:ce:25:6e",
            "net8": "56:d6:fe:f5:66:a1",
            "net9": "9e:cf:4c:7f:b2:9e"
        },
        "tof_1_2_7": {
            "net0": "2a:1c:88:45:4f:16",
            "net1": "46:cf:07:68:53:c1",
            "net10": "3e:00:34:94:9a:90",
            "net11": "26:85:85:19:06:8d",
            "net12": "22:a2:ee:11:26:88",
            "net13": "12:f6:49:dd:05:ab",
            "net14": "56:1c:1f:03:f1:40",
            "net15": "02:93:9e:dc:46:29",
            "net2": "4e:d8:ac:5f:67:1f",
            "net3": "b2:49:2e:d0:37:45",
            "net4": "86:c1:73:c5:f2:c3",
            "net5": "96:f8:85:7a:aa:bb",
            "net6": "72:37:30:c4:e9:9c",
            "net7": "c6:a7:a1:d2:07:96",
            "net8": "6a:87:f6:58:dd:93",
            "net9": "be:e7:47:2c:75:d8"
        },
        "tof_1_2_8": {
            "net0": "2e:92:c8:26:f5:ce",
            "net1": "d2:b1:b4:c1:52:4c",
            "net10": "2a:53:70:03:95:0a",
            "net11": "d6:1d:b7:3a:fd:31",
            "net12": "0a:d0:49:b1:aa:aa",
            "net13": "ca:3d:88:5c:3b:3a",
            "net14": "d6:80:c3:dc:a9:77",
            "net15": "c2:52:f4:63:18:6b",
            "net2": "c6:82:b2:5c:fa:5c",
            "net3": "4e:cc:e5:25:69:ab",
            "net4": "2e:75:05:b9:43:5c",
            "net5": "ba:59:f9:a4:6a:83",
            "net6": "72:73:12:f0:a7:15",
            "net7": "5e:fe:63:85:12:11",
            "net8": "d2:6a:31:16:ab:bc",
            "net9": "ea:64:76:46:f4:32"
        },
        "tof_2_2_1": {
            "net0": "d2:4e:34:aa:b1:4d",
            "net1": "ce:12:e3:25:af:b9",
            "net10": "f2:56:22:7f:69:64",
            "net11": "3a:b9:0f:44:36:93",
            "net12": "f2:3f:bf:ca:f5:81",
            "net13": "06:fb:a9:64:85:62",
            "net14": "42:c0:d1:d7:87:28",
            "net15": "d2:f3:03:19:f1:e1",
            "net2": "a2:cf:bc:cc:b6:75",
            "net3": "26:2c:21:57:1f:94",
            "net4": "f2:ff:8b:94:05:01",
            "net5": "6e:c6:a8:49:12:da",
            "net6": "82:29:8e:22:21:18",
            "net7": "ea:37:b9:48:20:f0",
            "net8": "1e:9c:5b:05:06:e2",
            "net9": "12:80:b8:66:bf:e6"
        },
        "tof_2_2_2": {
            "net0": "7e:7f:b7:9b:28:e6",
            "net1": "e2:97:04:de:4e:fe",
            "net10": "0e:3e:c4:b8:14:d9",
            "net11": "da:e4:dd:98:d9:65",
            "net12": "8a:a4:db:f0:de:67",
            "net13": "32:e9:36:4a:20:e4",
            "net14": "ee:af:c9:00:4b:54",
            "net15": "c2:e2:8a:7e:a2:3b",
            "net2": "9e:6c:6c:c6:56:68",
            "net3": "ea:c8:b9:64:a8:b7",
            "net4": "2a:63:81:ff:ae:b3",
            "net5": "0a:56:26:21:60:c7",
            "net6": "0e:a6:19:d6:8f:ea",
            "net7": "da:0a:b1:15:83:b3",
            "net8": "42:c2:96:77:23:3f",
            "net9": "ba:4c:5a:6c:88:32"
        },
        "tof_2_2_3": {
            "net0": "a2:38:0d:ca:68:3d",
            "net1": "4e:d6:3c:78:14:09",
            "net10": "5e:b4:a2:8c:c9:1d",
            "net11": "f6:95:47:7f:28:0c",
            "net12": "d2:be:18:3a:9c:31",
            "net13": "ba:2f:99:d8:e5:00",
            "net14": "02:6c:62:ec:f6:78",
            "net15": "06:22:4e:d2:20:24",
            "net2": "b6:eb:cd:06:05:f0",
            "net3": "6a:0d:14:19:7a:38",
            "net4": "6a:73:51:ec:06:41",
            "net5": "02:bc:84:e8:47:a3",
            "net6": "5a:6a:45:82:18:6e",
            "net7": "72:9f:3f:4b:9b:97",
            "net8": "72:92:80:8f:23:4b",
            "net9": "ea:7b:44:7f:7c:53"
        },
        "tof_2_2_4": {
            "net0": "4e:ab:cd:47:0e:1b",
            "net1": "e6:8b:b6:8e:47:a3",
            "net10": "1e:ab:64:3d:b2:bd",
            "net11": "76:af:8a:25:ab:9b",
            "net12": "ee:ea:7d:7a:9e:54",
            "net13": "fe:d1:4c:f6:ae:77",
            "net14": "ea:ed:44:96:e3:0a",
            "net15": "d2:0d:e7:4f:57:03",
            "net2": "62:b0:6f:c3:72:3a",
            "net3": "62:fe:3f:8b:f7:17",
            "net4": "76:83:99:fb:4a:17",
            "net5": "2a:c6:af:9a:5e:29",
            "net6": "7a:9d:2e:57:bd:10",
            "net7": "fe:9b:ee:aa:5f:86",
            "net8": "22:71:67:11:6b:6a",
            "net9": "96:69:ae:52:47:56"
        },
        "tof_2_2_5": {
            "net0": "4a:1f:a0:2f:f4:9e",
            "net1": "4e:c9:71:1c:39:01",
            "net10": "96:c4:2c:ea:cb:96",
            "net11": "3e:b7:a7:79:bc:a1",
            "net12": "32:39:68:f0:4e:65",
            "net13": "fe:61:e9:0a:17:d1",
            "net14": "9e:f0:9f:cf:07:6e",
            "net15": "f2:49:30:1a:84:b0",
            "net2": "6a:00:ec:c9:50:e9",
            "net3": "5a:59:53:71:85:a5",
            "net4": "0e:da:81:0d:03:99",
            "net5": "ae:98:24:17:62:b2",
            "net6": "5e:18:1e:4a:19:4e",
            "net7": "d2:01:1f:9a:5e:23",
            "net8": "ae:72:1a:dc:7d:20",
            "net9": "ba:5b:1d:46:84:79"
        },
        "tof_2_2_6": {
            "net0": "9e:07:e6:ce:bc:b1",
            "net1": "ba:e2:04:79:ad:14",
            "net10": "da:cc:77:8e:5b:47",
            "net11": "52:e9:cb:0c:86:6c",
            "net12": "fe:8d:3e:8e:39:78",
            "net13": "0a:c0:a3:a2:ca:1c",
            "net14": "3a:96:d8:2d:d6:20",
            "net15": "e2:3e:fb:cc:c7:3f",
            "net2": "ce:5b:a2:c0:a0:5a",
            "net3": "9e:4c:82:53:9e:24",
            "net4": "a2:72:8a:a1:8b:2b",
            "net5": "2a:26:01:7f:df:e8",
            "net6": "5a:06:37:3e:0b:57",
            "net7": "2a:bf:30:8f:6b:8a",
            "net8": "0e:21:aa:bf:dc:71",
            "net9": "72:5b:f9:ea:0e:dd"
        },
        "tof_2_2_7": {
            "net0": "4e:1d:a2:18:fd:6c",
            "net1": "4a:8d:9e:d4:9b:c8",
            "net10": "ee:6c:73:eb:9e:7e",
            "net11": "8a:5d:d3:c7:96:ca",
            "net12": "46:a9:bd:65:49:df",
            "net13": "7a:4a:fe:66:e4:96",
            "net14": "66:77:09:9a:09:a8",
            "net15": "96:79:61:6f:8f:bb",
            "net2": "b2:3e:dc:b5:a0:38",
            "net3": "3a:35:df:c5:eb:3d",
            "net4": "be:7f:05:dc:b7:43",
            "net5": "8e:20:b1:cf:be:d5",
            "net6": "be:ea:24:47:f4:de",
            "net7": "1e:26:81:27:c9:28",
            "net8": "52:6f:97:86:9e:e7",
            "net9": "9e:9f:50:45:3f:74"
        },
        "tof_2_2_8": {
            "net0": "4e:9a:d1:ea:2e:13",
            "net1": "86:6e:a9:c3:f5:05",
            "net10": "be:d2:5a:08:05:e5",
            "net11": "d6:f3:f5:08:1a:c5",
            "net12": "66:fc:22:1c:43:ce",
            "net13": "0a:59:6e:d7:02:45",
            "net14": "42:9f:60:ac:bd:5c",
            "net15": "6e:6f:eb:9b:20:40",
            "net2": "06:1a:be:ee:52:66",
            "net3": "96:99:4d:f4:13:90",
            "net4": "be:46:87:ca:02:4e",
            "net5": "5e:7c:c3:82:d4:52",
            "net6": "e2:73:60:77:d4:8c",
            "net7": "ea:85:c9:52:a5:34",
            "net8": "1a:2f:bb:74:f9:3b",
            "net9": "ca:94:ed:12:eb:42"
        },
        "tof_3_2_1": {
            "net0": "56:8e:08:a7:9a:4e",
            "net1": "16:4c:e0:85:af:99",
            "net10": "7e:37:3f:43:ff:1c",
            "net11": "52:ff:c4:71:72:39",
            "net12": "ee:1e:96:05:32:88",
            "net13": "4a:78:1b:11:8d:81",
            "net14": "ca:e6:dd:ef:f2:1d",
            "net15": "ce:6d:03:3b:df:f6",
            "net2": "8e:3e:1d:c3:56:92",
            "net3": "6a:57:e1:b8:16:aa",
            "net4": "be:0c:d4:ff:2c:d9",
            "net5": "06:3d:67:2f:b0:ab",
            "net6": "06:8f:f0:c0:68:0a",
            "net7": "3a:b4:7e:87:89:95",
            "net8": "b6:fc:16:ae:26:37",
            "net9": "fe:6a:2f:41:34:27"
        },
        "tof_3_2_2": {
            "net0": "4e:5c:c5:08:ef:53",
            "net1": "9a:bd:5c:c3:0b:be",
            "net10": "f2:9e:9b:b6:b2:82",
            "net11": "32:28:e2:6e:91:0a",
            "net12": "2a:f9:0c:12:5a:c0",
            "net13": "0a:50:5c:77:a1:27",
            "net14": "c6:5b:70:ad:79:4a",
            "net15": "96:ab:c8:a0:e5:79",
            "net2": "1a:15:11:0e:1f:db",
            "net3": "6a:e6:c1:68:75:e1",
            "net4": "4e:f9:5f:25:1c:e2",
            "net5": "36:7b:5b:58:75:1a",
            "net6": "2e:db:2d:3a:2c:31",
            "net7": "ee:db:14:1e:57:37",
            "net8": "72:ce:0e:25:cb:0a",
            "net9": "e2:7e:d5:4c:5d:f6"
        },
        "tof_3_2_3": {
            "net0": "fe:5c:be:d9:f4:d2",
            "net1": "36:8b:8c:2c:cd:82",
            "net10": "36:53:8c:c2:92:3f",
            "net11": "be:b9:bf:bd:47:c2",
            "net12": "96:30:96:a7:8f:83",
            "net13": "9a:80:e1:45:de:2d",
            "net14": "4e:9c:15:4d:f5:60",
            "net15": "62:ba:8e:1f:af:25",
            "net2": "12:9b:6f:94:c4:1a",
            "net3": "d6:35:de:03:e4:ef",
            "net4": "36:42:10:39:40:f0",
            "net5": "4e:27:e4:3e:e8:16",
            "net6": "12:a5:8b:45:55:2a",
            "net7": "de:10:a2:af:87:6e",
            "net8": "aa:cd:a9:a3:2f:e7",
            "net9": "ae:42:7c:ad:52:81"
        },
        "tof_3_2_4": {
            "net0": "c6:40:83:bb:86:5b",
            "net1": "5a:d1:72:da:39:8e",
            "net10": "e6:6f:71:8d:ba:52",
            "net11": "3a:ff:ec:c3:12:b2",
            "net12": "72:f5:17:fc:d9:88",
            "net13": "e2:57:27:98:f8:23",
            "net14": "02:47:33:e1:b5:83",
            "net15": "da:d8:03:33:1b:75",
            "net2": "22:ca:29:f4:e5:19",
            "net3": "1a:71:d0:e1:f9:45",
            "net4": "8a:a8:12:de:14:02",
            "net5": "e6:9a:21:67:d3:ff",
            "net6": "56:36:e4:01:b2:39",
            "net7": "1a:28:2f:9c:97:13",
            "net8": "0e:bd:17:b4:aa:8a",
            "net9": "a2:10:37:88:4c:25"
        },
        "tof_3_2_5": {
            "net0": "ca:f4:c2:68:d3:d8",
            "net1": "32:e1:b9:4b:28:78",
            "net10": "7a:5b:ed:bc:e3:d9",
            "net11": "fe:3b:43:f1:e7:e3",
            "net12": "22:4e:e9:4b:5f:cc",
            "net13": "86:d3:bf:d4:57:ff",
            "net14": "a6:a7:eb:40:62:63",
            "net15": "ea:92:a5:49:93:78",
            "net2": "a2:41:9c:8b:ee:f2",
            "net3": "f6:e3:e9:14:b3:0a",
            "net4": "86:7a:1b:4d:17:8a",
            "net5": "b6:00:bd:cb:73:c1",
            "net6": "f6:43:66:ed:25:7d",
            "net7": "9a:06:c0:72:31:00",
            "net8": "1e:06:fe:e3:5c:49",
            "net9": "8a:f0:ba:8b:3a:01"
        },
        "tof_3_2_6": {
            "net0": "ea:53:3c:7e:32:47",
            "net1": "8e:56:6b:72:70:46",
            "net10": "8a:2d:1d:8f:bd:1e",
            "net11": "a2:a7:9c:51:8c:d1",
            "net12": "de:8e:47:24:b9:b1",
            "net13": "a6:2d:54:ae:4f:3f",
            "net14": "da:dd:a6:68:3a:18",
            "net15": "3a:91:54:77:61:1b",
            "net2": "66:74:1d:71:0d:50",
            "net3": "d2:3e:6a:fd:7f:19",
            "net4": "a6:a1:3c:f7:67:3f",
            "net5": "1e:41:28:68:ff:c4",
            "net6": "da:6f:78:73:a6:a2",
            "net7": "aa:8d:29:0a:b3:33",
            "net8": "7a:8e:e5:9b:6b:57",
            "net9": "6e:78:3c:5d:8a:be"
        },
        "tof_3_2_7": {
            "net0": "8e:8c:e4:2d:f8:0a",
            "net1": "1a:3b:f1:3b:3c:3b",
            "net10": "62:d0:23:75:d5:3a",
            "net11": "7e:2c:72:42:6f:52",
            "net12": "76:a1:ad:87:88:2f",
            "net13": "b2:d0:fa:7d:d6:27",
            "net14": "ca:87:e5:69:ca:be",
            "net15": "26:94:e7:d0:0d:6e",
            "net2": "8a:0a:9a:00:ba:ae",
            "net3": "a2:18:f0:73:eb:32",
            "net4": "5e:d7:a0:35:49:28",
            "net5": "7a:f7:93:d1:b6:c4",
            "net6": "66:a0:da:af:dd:a4",
            "net7": "de:6e:61:f4:f2:5b",
            "net8": "c6:5f:de:4d:a0:79",
            "net9": "7a:a2:45:41:4f:65"
        },
        "tof_3_2_8": {
            "net0": "ae:8d:80:ba:d0:17",
            "net1": "4e:65:e8:97:fd:2e",
            "net10": "b6:e3:2a:dd:ea:be",
            "net11": "0a:58:72:79:bb:ab",
            "net12": "1a:00:5f:54:dd:df",
            "net13": "be:94:57:4a:42:61",
            "net14": "fa:5a:ce:a4:07:d1",
            "net15": "ea:c3:ad:e6:4b:d4",
            "net2": "96:d7:4d:48:c8:bc",
            "net3": "7e:1d:19:ad:57:81",
            "net4": "16:03:86:2e:a0:f1",
            "net5": "8a:15:a2:96:dd:d0",
            "net6": "c6:99:82:31:83:73",
            "net7": "8e:fc:09:c1:57:04",
            "net8": "6e:b4:ee:4d:ce:f3",
            "net9": "8a:e1:8d:5e:7c:c5"
        },
        "tof_4_2_1": {
            "net0": "d6:ed:29:db:4b:b0",
            "net1": "52:9a:4f:42:e8:c0",
            "net10": "6e:b2:bb:65:e9:3f",
            "net11": "16:d8:0a:02:41:6b",
            "net12": "22:64:51:50:a9:0b",
            "net13": "f6:26:6a:24:2c:aa",
            "net14": "e6:8c:49:2c:25:bb",
            "net15": "76:10:e2:19:de:12",
            "net2": "1e:81:f8:74:79:b4",
            "net3": "62:bb:8c:2f:6a:fd",
            "net4": "82:0e:23:47:d2:ac",
            "net5": "92:34:b9:ce:31:25",
            "net6": "36:68:34:79:a3:ed",
            "net7": "aa:69:eb:86:01:9f",
            "net8": "2e:90:15:15:be:d7",
            "net9": "3e:96:5f:a0:a7:67"
        },
        "tof_4_2_2": {
            "net0": "a6:49:65:f7:ac:76",
            "net1": "c6:35:d8:c5:e0:ca",
            "net10": "56:fd:f0:02:57:b6",
            "net11": "96:df:c7:d6:cc:1d",
            "net12": "ae:2a:be:70:0f:6c",
            "net13": "02:bc:7f:31:c2:c1",
            "net14": "2a:21:d2:40:3d:73",
            "net15": "4e:6b:6d:c2:2d:15",
            "net2": "c6:5b:d0:12:ec:7f",
            "net3": "3e:70:d4:da:e2:9f",
            "net4": "22:ad:d8:d1:c8:ec",
            "net5": "16:d1:a8:b2:44:6d",
            "net6": "5a:94:ca:6a:bd:b4",
            "net7": "4a:94:8e:a9:93:34",
            "net8": "ca:06:48:81:2c:7d",
            "net9": "72:ef:d0:4b:43:0c"
        },
        "tof_4_2_3": {
            "net0": "ea:06:4b:31:16:89",
            "net1": "3e:ed:f6:96:2f:49",
            "net10": "22:f8:e3:2a:37:69",
            "net11": "ae:43:4a:a1:56:d8",
            "net12": "f6:44:b1:bd:03:6d",
            "net13": "46:f4:6e:aa:86:b9",
            "net14": "8e:c8:49:e2:bc:0f",
            "net15": "fa:d5:d3:37:c1:68",
            "net2": "fe:d0:65:ad:46:06",
            "net3": "4a:bd:82:93:d6:c7",
            "net4": "3e:ae:05:df:25:ea",
            "net5": "b6:d2:79:b1:4b:46",
            "net6": "e2:48:e9:09:70:6c",
            "net7": "52:1e:25:e3:96:82",
            "net8": "1e:fb:b7:af:a7:9f",
            "net9": "1e:01:f6:90:ea:53"
        },
        "tof_4_2_4": {
            "net0": "5e:20:4f:53:cb:03",
            "net1": "4e:03:e9:98:9b:27",
            "net10": "52:f2:77:7d:8a:0e",
            "net11": "a6:a0:69:15:f2:17",
            "net12": "9e:b4:eb:ef:e2:2a",
            "net13": "e6:b6:f5:89:3a:c3",
            "net14": "c6:a8:72:58:ae:f4",
            "net15": "82:f0:1a:47:a0:f7",
            "net2": "6a:15:9d:a4:89:0e",
            "net3": "0a:77:b6:fb:fb:3b",
            "net4": "9a:4c:93:2c:6a:b0",
            "net5": "42:93:1b:c0:a6:a9",
            "net6": "76:29:85:32:f5:3a",
            "net7": "7e:a6:51:75:a5:cf",
            "net8": "fa:63:57:0c:7f:93",
            "net9": "c6:6a:b4:01:19:00"
        },
        "tof_4_2_5": {
            "net0": "ca:e3:ca:dd:c3:27",
            "net1": "3e:51:09:81:76:29",
            "net10": "f6:0e:16:40:2f:5d",
            "net11": "82:ad:15:c2:34:27",
            "net12": "ee:07:fd:08:25:42",
            "net13": "fa:51:3e:7f:c2:ed",
            "net14": "5e:3b:11:9f:4d:1b",
            "net15": "ce:84:53:fa:af:f8",
            "net2": "56:71:df:08:b8:87",
            "net3": "aa:d2:4b:12:c3:5e",
            "net4": "6e:0e:76:cd:be:63",
            "net5": "46:d1:9d:64:2e:6b",
            "net6": "ba:45:18:e3:38:c3",
            "net7": "7a:cf:a7:bd:d0:76",
            "net8": "5a:a4:ec:69:5a:d9",
            "net9": "a6:b9:61:c3:48:a3"
        },
        "tof_4_2_6": {
            "net0": "5a:04:a2:7d:51:53",
            "net1": "5e:9a:0d:95:e5:b3",
            "net10": "c2:dc:7b:2e:80:c6",
            "net11": "22:19:2b:75:3a:f0",
            "net12": "d2:a2:fc:f8:40:b2",
            "net13": "26:51:20:01:f5:e4",
            "net14": "12:0f:36:24:19:0c",
            "net15": "fa:68:f7:c6:60:92",
            "net2": "d6:80:48:c2:c2:b6",
            "net3": "62:f8:5f:fb:cb:4b",
            "net4": "72:db:c5:05:12:26",
            "net5": "c2:a1:12:55:14:c5",
            "net6": "a2:9e:8f:ca:ab:3b",
            "net7": "2a:e8:43:7b:25:8f",
            "net8": "82:bb:5f:29:21:15",
            "net9": "8a:ee:bc:9d:e2:9c"
        },
        "tof_4_2_7": {
            "net0": "42:38:de:27:a1:14",
            "net1": "46:88:13:f8:24:d1",
            "net10": "ea:24:ab:41:56:42",
            "net11": "9a:a7:ef:0f:50:f5",
            "net12": "ae:89:c0:23:99:6b",
            "net13": "9a:cd:0a:e0:47:6e",
            "net14": "b6:3b:e7:b3:48:81",
            "net15": "d2:44:ad:32:9e:85",
            "net2": "0e:d6:9f:99:72:9e",
            "net3": "62:8b:6a:32:fc:d2",
            "net4": "2a:45:d0:0d:a2:5c",
            "net5": "ee:7e:ce:d5:33:0a",
            "net6": "7e:7e:c6:9d:68:3d",
            "net7": "2e:b1:bf:f1:cd:0e",
            "net8": "d6:dc:65:5f:27:53",
            "net9": "26:f0:91:bb:be:b9"
        },
        "tof_4_2_8": {
            "net0": "32:fa:99:b0:85:5f",
            "net1": "36:31:b7:68:28:c1",
            "net10": "8e:c8:97:7e:28:42",
            "net11": "9e:2e:7d:9b:24:ff",
            "net12": "8a:43:b6:22:e8:c8",
            "net13": "f2:78:e1:43:39:0d",
            "net14": "2e:e8:80:d3:c3:7c",
            "net15": "ba:4e:d5:c2:b3:58",
            "net2": "9e:6d:41:46:0e:c1",
            "net3": "52:1a:b4:6d:88:75",
            "net4": "6e:e9:ba:33:19:91",
            "net5": "b2:38:7f:97:52:41",
            "net6": "06:55:3e:9d:f7:fa",
            "net7": "9a:0c:71:17:f1:89",
            "net8": "f6:b0:d7:a6:29:34",
            "net9": "c6:ff:96:b0:ed:45"
        }
    },
    "failed_machine": "leaf_1_0_1",
    "failed_interfaces": [
        "net0"
    ],
    "failure_time": 1616344629.7331796
}