{
    "k_leaf": 14,
    "k_top": 14,
    "redundancy_factor": 14,
    "is_k8s": true,
    "machine_mac_addresses": {
        "leaf_1_0_1": {
            "net0": "7e:ca:04:fe:ed:e7",
            "net1": "e2:f2:4e:4c:6a:f4",
            "net10": "ae:64:69:ac:31:fe",
            "net11": "86:43:2f:09:56:b5",
            "net12": "b2:ae:45:07:6b:0d",
            "net13": "a6:f8:7c:c9:41:6b",
            "net14": "da:6b:9d:cb:8f:4c",
            "net2": "9e:b1:8c:2a:37:95",
            "net3": "82:47:b1:62:63:87",
            "net4": "92:42:ad:c5:db:65",
            "net5": "e2:c5:14:ce:78:cb",
            "net6": "a2:af:2f:4a:2e:b3",
            "net7": "56:2e:86:03:23:ad",
            "net8": "8e:38:28:ec:ef:c2",
            "net9": "62:55:53:71:6c:a5"
        },
        "leaf_1_0_10": {
            "net0": "6e:55:2d:e6:6a:83",
            "net1": "ea:f0:4c:3f:34:0c",
            "net10": "2a:98:59:4e:80:66",
            "net11": "2a:e6:b2:ab:5d:69",
            "net12": "ca:cb:4d:5e:af:d8",
            "net13": "36:97:3b:3e:68:48",
            "net14": "26:61:cb:6e:a5:77",
            "net2": "e2:0a:8d:55:14:ab",
            "net3": "2e:d6:af:ca:c6:df",
            "net4": "c6:d5:aa:e7:6c:ae",
            "net5": "ae:0a:29:67:92:fc",
            "net6": "42:bd:19:1e:ba:0a",
            "net7": "ce:5f:45:02:67:aa",
            "net8": "da:b1:66:05:96:e2",
            "net9": "9a:b8:66:9e:b0:97"
        },
        "leaf_1_0_11": {
            "net0": "9a:a7:cf:ad:1e:27",
            "net1": "a2:ec:99:21:47:bc",
            "net10": "66:b9:53:40:31:79",
            "net11": "7a:87:65:d7:73:6e",
            "net12": "96:65:5f:9f:e7:e6",
            "net13": "de:d5:5a:d1:1d:b7",
            "net14": "ba:04:ad:c5:e5:1e",
            "net2": "86:a4:df:27:1c:7d",
            "net3": "ee:87:4d:e2:6a:59",
            "net4": "0e:31:ce:5e:00:32",
            "net5": "26:49:87:de:9b:93",
            "net6": "32:87:7a:66:d5:f3",
            "net7": "42:f4:f8:48:62:6d",
            "net8": "02:0c:0e:72:ba:c1",
            "net9": "62:81:e5:a3:b9:79"
        },
        "leaf_1_0_12": {
            "net0": "46:1b:f4:8d:eb:ff",
            "net1": "9e:e1:71:7b:e8:a9",
            "net10": "1a:24:fa:15:a3:3d",
            "net11": "46:11:23:8e:87:40",
            "net12": "4a:ee:14:ab:25:a0",
            "net13": "86:19:e1:8f:15:45",
            "net14": "9a:4a:a6:af:cc:bb",
            "net2": "46:36:a9:06:48:01",
            "net3": "12:f1:b1:6c:b5:9c",
            "net4": "8e:2d:9e:d3:72:41",
            "net5": "0e:b2:ab:f3:4d:a5",
            "net6": "7a:43:52:89:0d:4a",
            "net7": "96:9b:9e:e3:33:9a",
            "net8": "62:90:08:e4:f4:2f",
            "net9": "d6:cc:09:6c:53:fb"
        },
        "leaf_1_0_13": {
            "net0": "06:0f:06:2e:21:1e",
            "net1": "6a:a2:55:e0:9a:3e",
            "net10": "fa:40:ef:1e:67:92",
            "net11": "72:bb:35:de:9b:e4",
            "net12": "76:a5:95:5c:2b:8e",
            "net13": "42:1f:0d:c4:04:e0",
            "net14": "b6:7c:68:b9:1d:c8",
            "net2": "7a:64:92:e1:fa:2d",
            "net3": "c2:38:27:9d:ca:67",
            "net4": "56:5b:3d:67:ca:19",
            "net5": "f6:c3:88:d3:c0:0a",
            "net6": "52:d5:45:45:9b:76",
            "net7": "76:84:42:02:3c:47",
            "net8": "0e:50:15:28:16:42",
            "net9": "f6:56:78:60:8b:ab"
        },
        "leaf_1_0_14": {
            "net0": "f2:72:77:99:3a:0a",
            "net1": "ca:f7:fe:3a:b9:c8",
            "net10": "ce:5b:47:33:a7:8a",
            "net11": "e2:5f:31:36:bd:a3",
            "net12": "da:71:f4:66:d1:b6",
            "net13": "2a:3b:bb:8c:77:78",
            "net14": "d2:88:72:8a:d1:f4",
            "net2": "52:d5:7c:f0:20:bc",
            "net3": "f2:26:6c:5d:18:f2",
            "net4": "76:53:02:c0:f2:cc",
            "net5": "52:19:c3:f5:21:3d",
            "net6": "1e:dc:30:e0:d4:35",
            "net7": "f2:6c:b3:40:b4:dc",
            "net8": "86:dd:db:54:cb:11",
            "net9": "36:6e:5a:48:0a:56"
        },
        "leaf_1_0_2": {
            "net0": "f6:fa:f6:7c:77:2b",
            "net1": "92:68:1d:4b:a2:1e",
            "net10": "a2:06:56:83:66:e3",
            "net11": "4a:24:4c:25:db:e8",
            "net12": "ee:04:40:a8:14:e9",
            "net13": "56:6f:0c:ff:8f:fc",
            "net14": "5e:e1:d6:e9:86:6a",
            "net2": "e2:35:89:c1:f8:a0",
            "net3": "52:90:68:15:51:70",
            "net4": "0e:78:82:e9:64:32",
            "net5": "d2:27:74:3e:32:5f",
            "net6": "62:0a:68:1b:fe:11",
            "net7": "3e:16:a5:7b:1f:61",
            "net8": "c2:a8:27:8f:d3:ba",
            "net9": "8e:01:68:b4:1d:90"
        },
        "leaf_1_0_3": {
            "net0": "06:75:f8:37:2f:ad",
            "net1": "72:40:e8:fc:64:5c",
            "net10": "16:90:ab:1a:e5:2f",
            "net11": "06:83:88:29:52:51",
            "net12": "8a:ad:be:61:c4:95",
            "net13": "86:56:7e:7e:a0:58",
            "net14": "aa:5d:90:1a:04:22",
            "net2": "fa:83:7e:f3:30:95",
            "net3": "9a:97:4f:e9:6a:f1",
            "net4": "ee:cc:5d:a7:9f:51",
            "net5": "1e:21:64:b9:91:15",
            "net6": "aa:ca:31:94:48:51",
            "net7": "36:6d:6a:e5:ec:83",
            "net8": "fa:b3:44:dd:bf:dc",
            "net9": "fa:90:16:30:47:f6"
        },
        "leaf_1_0_4": {
            "net0": "9a:c5:37:cd:97:ab",
            "net1": "9a:c8:5b:91:06:db",
            "net10": "ea:21:51:ad:38:6d",
            "net11": "a2:d4:50:75:14:08",
            "net12": "5a:38:2f:86:e8:e0",
            "net13": "4e:f0:8b:e9:ca:dc",
            "net14": "2a:a5:99:b3:bb:45",
            "net2": "4e:0c:46:80:10:aa",
            "net3": "d6:1d:97:ab:11:2a",
            "net4": "8e:2a:9c:e1:c7:66",
            "net5": "e2:60:8a:27:3c:c3",
            "net6": "5a:53:a3:8e:43:37",
            "net7": "32:bf:3b:62:3d:c5",
            "net8": "f6:20:c0:65:a8:b0",
            "net9": "e2:93:56:1b:3b:c5"
        },
        "leaf_1_0_5": {
            "net0": "22:23:98:10:59:a6",
            "net1": "ca:a8:39:6e:34:ac",
            "net10": "be:45:a7:da:9b:b6",
            "net11": "fe:b3:12:d7:9c:d3",
            "net12": "0a:25:67:f9:ad:6e",
            "net13": "ba:b2:5d:21:f5:ee",
            "net14": "92:52:71:6f:ca:61",
            "net2": "d2:3b:07:ad:d1:0b",
            "net3": "12:10:ea:5b:18:64",
            "net4": "0a:4a:4e:74:8c:d0",
            "net5": "d2:e1:40:22:ab:b9",
            "net6": "82:b5:46:90:26:f5",
            "net7": "e2:6a:c8:af:2b:53",
            "net8": "6a:23:71:e2:ca:a2",
            "net9": "c2:86:c9:78:7f:31"
        },
        "leaf_1_0_6": {
            "net0": "12:c7:dd:95:e7:92",
            "net1": "12:05:fd:22:6b:b1",
            "net10": "fa:5b:f8:e8:dc:b0",
            "net11": "9e:6f:8b:21:50:64",
            "net12": "06:8b:e7:3a:1e:31",
            "net13": "8e:44:6f:b7:f6:b0",
            "net14": "0e:f1:5f:95:07:9b",
            "net2": "06:b1:8f:57:4e:4b",
            "net3": "f2:b3:96:48:9c:f6",
            "net4": "9e:cc:5d:7c:bf:e3",
            "net5": "ae:8c:57:4f:4d:a0",
            "net6": "5a:f4:8c:54:93:35",
            "net7": "72:89:3f:15:76:63",
            "net8": "36:c5:ae:19:8e:ab",
            "net9": "ee:83:cf:99:ab:f2"
        },
        "leaf_1_0_7": {
            "net0": "fa:81:04:9c:d2:97",
            "net1": "26:9b:c8:3e:ff:56",
            "net10": "b6:c1:28:ef:46:24",
            "net11": "ae:7a:e6:66:85:ea",
            "net12": "fe:77:05:00:1b:f0",
            "net13": "8e:ed:86:79:04:72",
            "net14": "52:ec:12:7d:6a:ea",
            "net2": "0a:4a:d7:7f:6d:4f",
            "net3": "36:d5:da:10:2a:d2",
            "net4": "c2:d2:a5:ff:de:11",
            "net5": "1a:5c:52:f0:d8:56",
            "net6": "ba:54:1b:ce:fa:f0",
            "net7": "96:0a:40:a5:7e:57",
            "net8": "ca:b8:3a:b5:d0:69",
            "net9": "ce:5f:ec:2d:bf:e4"
        },
        "leaf_1_0_8": {
            "net0": "ea:30:1f:5d:46:5c",
            "net1": "9e:fb:8f:7f:ec:8b",
            "net10": "86:6c:ec:80:8f:c9",
            "net11": "52:98:e3:7c:24:2a",
            "net12": "e6:c4:d7:7b:12:80",
            "net13": "ca:b9:ac:7a:6e:fe",
            "net14": "d6:ab:5f:6e:17:b5",
            "net2": "06:30:2f:1e:4a:f3",
            "net3": "ae:be:a2:f0:77:81",
            "net4": "fe:69:2b:2e:1d:b0",
            "net5": "56:b1:aa:3b:d4:c9",
            "net6": "e2:a0:a6:e9:01:a5",
            "net7": "a6:05:45:4d:1e:ba",
            "net8": "ee:a6:9e:b9:97:38",
            "net9": "06:30:bb:91:4d:00"
        },
        "leaf_1_0_9": {
            "net0": "1a:fe:ba:91:c3:40",
            "net1": "62:66:9e:80:70:74",
            "net10": "4a:30:eb:df:1c:33",
            "net11": "5e:29:17:ef:b8:55",
            "net12": "f2:61:52:84:36:75",
            "net13": "86:59:3c:38:cc:a0",
            "net14": "2e:80:0b:e7:0e:8f",
            "net2": "7e:b3:8d:1f:bd:dd",
            "net3": "46:e2:91:92:a3:9f",
            "net4": "06:0d:7b:ff:a5:26",
            "net5": "ea:bf:b2:e3:2f:a6",
            "net6": "56:94:ec:10:73:b2",
            "net7": "2e:83:af:6d:2c:bb",
            "net8": "da:2b:b0:b3:f9:cf",
            "net9": "3e:a1:a7:af:7a:b7"
        },
        "leaf_2_0_1": {
            "net0": "4a:57:4f:9a:d4:e2",
            "net1": "16:c0:d0:5d:85:b3",
            "net10": "b6:7e:62:2f:aa:f7",
            "net11": "0e:19:bc:49:d1:11",
            "net12": "e6:02:3a:64:75:18",
            "net13": "3a:28:07:6e:00:a0",
            "net14": "82:4e:15:3d:59:0b",
            "net2": "2e:f8:03:61:89:ef",
            "net3": "4e:63:0b:b2:68:07",
            "net4": "26:a2:33:54:64:6a",
            "net5": "6e:9c:5b:00:fb:da",
            "net6": "5e:fc:28:8a:05:b4",
            "net7": "ae:e5:6f:aa:af:47",
            "net8": "ea:09:7a:d8:96:8c",
            "net9": "a2:0a:78:91:85:a5"
        },
        "leaf_2_0_10": {
            "net0": "72:f5:8a:3c:99:f4",
            "net1": "ba:f0:db:e6:7f:e3",
            "net10": "6e:67:d1:8c:87:34",
            "net11": "42:41:a5:46:4c:35",
            "net12": "72:c0:ee:3b:7c:98",
            "net13": "1a:11:b2:f0:98:2a",
            "net14": "02:cd:86:6c:01:a2",
            "net2": "b6:56:0c:5f:56:90",
            "net3": "4e:61:27:e7:1b:ef",
            "net4": "6a:af:2a:ea:90:d8",
            "net5": "9a:cd:84:cf:36:49",
            "net6": "c2:51:0b:05:ce:c4",
            "net7": "76:d5:1f:c9:20:dc",
            "net8": "e6:21:90:12:49:92",
            "net9": "4a:19:c2:ea:51:3d"
        },
        "leaf_2_0_11": {
            "net0": "ee:27:71:dd:a4:16",
            "net1": "ba:41:6c:4f:6c:25",
            "net10": "7a:9e:db:61:23:96",
            "net11": "86:23:51:29:33:31",
            "net12": "16:1d:2b:c7:bc:f4",
            "net13": "d6:3f:b2:eb:73:b4",
            "net14": "1a:b6:1b:d3:75:41",
            "net2": "06:a1:b2:3d:f1:15",
            "net3": "92:af:60:ce:4d:3d",
            "net4": "ae:fe:83:42:0a:ba",
            "net5": "9a:76:57:5a:d0:95",
            "net6": "de:98:4b:b3:93:d0",
            "net7": "72:b6:47:ab:6c:b4",
            "net8": "06:aa:a3:2e:cf:59",
            "net9": "5a:51:5a:44:cb:2d"
        },
        "leaf_2_0_12": {
            "net0": "82:32:26:e8:8f:5a",
            "net1": "f2:32:a7:d8:9f:b0",
            "net10": "d2:d4:65:d0:90:07",
            "net11": "62:93:ac:f1:98:22",
            "net12": "c2:ad:ae:b5:ac:72",
            "net13": "36:8d:57:6e:6a:c5",
            "net14": "82:9a:ad:63:38:4b",
            "net2": "c6:b3:c9:8d:1f:54",
            "net3": "06:f1:3c:49:2b:35",
            "net4": "56:c4:6e:70:d5:14",
            "net5": "8e:ac:50:00:91:ef",
            "net6": "7a:e5:27:22:15:28",
            "net7": "ee:49:c5:6a:f2:8d",
            "net8": "3a:61:42:ee:08:ee",
            "net9": "72:3c:f6:0a:b1:48"
        },
        "leaf_2_0_13": {
            "net0": "02:9a:5e:57:5f:c3",
            "net1": "c6:9f:8b:b6:79:51",
            "net10": "86:cd:a4:98:91:0b",
            "net11": "aa:43:d5:a4:d2:1f",
            "net12": "b2:24:a7:a5:04:9e",
            "net13": "b6:af:10:00:1f:26",
            "net14": "ca:a6:94:da:5b:6b",
            "net2": "ca:79:a1:2b:21:40",
            "net3": "ce:ce:46:43:f3:88",
            "net4": "2a:6e:f2:9a:b7:4d",
            "net5": "56:2c:77:b8:21:a8",
            "net6": "de:a9:2d:0f:41:70",
            "net7": "56:9f:45:81:14:26",
            "net8": "42:7a:45:48:94:95",
            "net9": "de:85:c0:85:20:b4"
        },
        "leaf_2_0_14": {
            "net0": "46:a1:61:0f:31:5e",
            "net1": "3e:a1:7f:b5:93:8b",
            "net10": "f2:cf:41:06:1a:9c",
            "net11": "f2:39:b2:58:ec:ec",
            "net12": "de:54:01:5f:ce:8b",
            "net13": "3a:06:fe:2c:34:14",
            "net14": "6e:ef:c5:34:7e:a6",
            "net2": "52:4d:6b:e5:a1:08",
            "net3": "f2:b3:e9:76:a1:34",
            "net4": "12:3a:e5:2c:c8:a9",
            "net5": "72:c5:35:09:eb:d4",
            "net6": "02:c4:fe:18:01:2a",
            "net7": "3a:2e:56:55:80:3b",
            "net8": "d6:2d:a7:84:50:12",
            "net9": "3e:5a:2f:f9:48:52"
        },
        "leaf_2_0_2": {
            "net0": "c6:e1:d0:db:cf:91",
            "net1": "ba:f4:ff:06:cf:97",
            "net10": "c2:73:4b:71:34:1b",
            "net11": "7e:ea:6d:f5:7e:06",
            "net12": "e2:2e:f7:de:ab:c0",
            "net13": "f2:31:b1:33:1b:bb",
            "net14": "6a:a4:bb:fa:52:a7",
            "net2": "d2:eb:cd:ec:aa:ca",
            "net3": "9a:60:a5:f3:1a:78",
            "net4": "46:8e:e3:38:20:dd",
            "net5": "f6:d8:e3:e6:f5:4a",
            "net6": "ae:f5:83:53:89:d0",
            "net7": "ce:f2:a2:93:52:76",
            "net8": "d6:0b:33:be:ba:dd",
            "net9": "de:a3:ef:c1:e8:c3"
        },
        "leaf_2_0_3": {
            "net0": "12:96:a0:0f:3c:8b",
            "net1": "ca:4a:4b:21:63:60",
            "net10": "76:c0:d5:72:24:53",
            "net11": "a6:d1:01:04:8e:9e",
            "net12": "d2:ee:cb:29:9f:be",
            "net13": "9a:c4:47:18:07:35",
            "net14": "1a:4b:48:64:ea:f5",
            "net2": "8a:ff:23:42:86:8a",
            "net3": "9a:e1:ab:52:ed:7c",
            "net4": "92:9b:6b:5b:ba:53",
            "net5": "1e:bf:a0:07:e0:22",
            "net6": "56:1b:37:f9:3c:76",
            "net7": "02:a2:83:df:80:4d",
            "net8": "72:64:4c:0a:06:7a",
            "net9": "32:07:59:d0:6c:13"
        },
        "leaf_2_0_4": {
            "net0": "ee:f7:a1:e9:d0:44",
            "net1": "3a:18:22:83:e4:81",
            "net10": "2e:c2:4e:af:48:59",
            "net11": "4a:89:83:e2:a1:7d",
            "net12": "9e:b6:31:12:7c:e9",
            "net13": "36:c2:09:fd:98:30",
            "net14": "22:85:35:c2:cb:d4",
            "net2": "7a:c7:fb:40:e4:e1",
            "net3": "fa:0f:94:fc:47:d9",
            "net4": "6a:ec:1d:e2:38:40",
            "net5": "26:37:70:4e:69:8a",
            "net6": "e6:ca:e2:c9:30:7e",
            "net7": "6e:cf:14:98:28:c6",
            "net8": "3a:77:d4:04:12:31",
            "net9": "b2:99:9d:92:de:f4"
        },
        "leaf_2_0_5": {
            "net0": "2a:2a:41:61:78:29",
            "net1": "ce:ef:20:f7:30:46",
            "net10": "42:6b:73:90:65:84",
            "net11": "d2:85:e5:48:0b:8f",
            "net12": "ea:99:8c:2f:bf:8f",
            "net13": "c6:2d:b2:fe:68:d8",
            "net14": "9a:3a:5c:5e:79:df",
            "net2": "c2:45:69:c1:c4:e5",
            "net3": "b2:bd:9c:bb:92:e3",
            "net4": "02:20:06:25:0f:3b",
            "net5": "e6:65:f6:95:0f:5c",
            "net6": "ae:85:9f:3c:10:f8",
            "net7": "d6:f2:6f:34:d9:20",
            "net8": "36:48:94:b3:85:33",
            "net9": "b6:de:f0:a2:a9:cc"
        },
        "leaf_2_0_6": {
            "net0": "3e:7c:90:6c:48:e1",
            "net1": "1e:22:43:0e:d1:50",
            "net10": "a2:6c:a7:b2:e7:0b",
            "net11": "62:6d:2f:90:93:eb",
            "net12": "f6:0a:ca:4e:b9:7f",
            "net13": "1a:68:d8:21:a2:eb",
            "net14": "ca:ea:12:91:bf:71",
            "net2": "d2:93:a8:d4:55:0f",
            "net3": "86:61:9e:c2:0f:32",
            "net4": "f2:36:37:81:23:7c",
            "net5": "0e:64:fd:ee:ae:20",
            "net6": "da:a2:8a:3f:bd:31",
            "net7": "1e:36:d8:2b:98:db",
            "net8": "1a:56:4d:df:82:e6",
            "net9": "e6:21:be:19:fc:b3"
        },
        "leaf_2_0_7": {
            "net0": "d6:50:92:ea:a3:d3",
            "net1": "7a:d7:40:04:88:68",
            "net10": "02:50:28:71:0a:cb",
            "net11": "ea:5f:84:7d:f6:cd",
            "net12": "3a:6a:c6:13:5f:7e",
            "net13": "ce:72:ef:c4:58:19",
            "net14": "ee:e1:88:c2:be:e3",
            "net2": "4e:6e:16:10:8d:32",
            "net3": "7a:12:f5:db:8a:5f",
            "net4": "02:b4:7c:58:99:82",
            "net5": "82:0c:72:48:bb:a6",
            "net6": "86:8b:b9:d3:00:51",
            "net7": "ce:a5:a1:f8:70:52",
            "net8": "c6:80:82:cc:33:d9",
            "net9": "c6:47:be:12:a5:13"
        },
        "leaf_2_0_8": {
            "net0": "9e:29:3f:2d:77:49",
            "net1": "ee:d5:93:ee:f9:5c",
            "net10": "3e:ff:c7:ff:1f:03",
            "net11": "b2:dd:69:f5:88:ac",
            "net12": "aa:32:64:51:00:17",
            "net13": "0a:eb:ec:f2:7f:a5",
            "net14": "c2:cd:2e:3f:45:18",
            "net2": "96:84:60:f1:f7:70",
            "net3": "be:91:7f:30:d2:86",
            "net4": "12:0a:0b:08:db:ae",
            "net5": "4a:df:9a:a8:28:0f",
            "net6": "32:78:46:14:9e:45",
            "net7": "5e:ff:22:63:4e:f8",
            "net8": "4a:09:bc:41:f5:b9",
            "net9": "56:05:4e:25:99:5f"
        },
        "leaf_2_0_9": {
            "net0": "56:6f:97:93:76:01",
            "net1": "66:e4:8c:f1:4f:5b",
            "net10": "66:78:b6:2f:3f:55",
            "net11": "32:eb:ec:c1:bc:6b",
            "net12": "92:f4:d0:08:7f:07",
            "net13": "ee:6b:b9:c8:15:29",
            "net14": "72:d8:8c:87:27:a3",
            "net2": "ee:e1:de:8c:52:3b",
            "net3": "da:4a:ef:5a:ba:06",
            "net4": "66:38:73:e9:df:d2",
            "net5": "52:e0:3f:0e:72:26",
            "net6": "3e:29:58:79:11:3e",
            "net7": "7a:95:01:5d:43:19",
            "net8": "b2:b4:96:f0:a3:50",
            "net9": "72:0d:8e:db:01:0e"
        },
        "spine_1_1_1": {
            "net0": "de:dd:df:05:aa:2b",
            "net1": "1a:f6:9e:e1:1a:81",
            "net10": "ce:d5:05:7f:a4:6a",
            "net11": "de:c3:4a:8b:98:4f",
            "net12": "be:5e:42:73:bf:d0",
            "net13": "66:76:6d:b6:b7:ab",
            "net14": "ba:75:9c:91:b2:98",
            "net15": "56:bd:39:db:2e:8a",
            "net16": "a6:31:fc:f3:86:fc",
            "net17": "5a:80:1d:ee:34:3d",
            "net18": "0e:e6:a0:9d:96:fa",
            "net19": "3e:9f:8e:b1:05:d4",
            "net2": "ee:43:0e:f0:aa:17",
            "net20": "8a:5e:27:a2:7a:1d",
            "net21": "ce:2b:70:62:93:42",
            "net22": "76:92:d5:2b:da:1e",
            "net23": "be:b8:d7:83:db:dc",
            "net24": "4a:22:57:0a:cc:ca",
            "net25": "5e:34:6d:0b:18:6a",
            "net26": "e2:6d:4b:cb:71:20",
            "net27": "3a:e5:f2:86:d8:ca",
            "net3": "a2:6d:17:8c:25:6e",
            "net4": "3e:00:13:76:94:56",
            "net5": "26:6f:ad:97:8d:5c",
            "net6": "aa:78:f5:50:84:04",
            "net7": "56:2c:53:b9:c6:c7",
            "net8": "76:4a:34:f0:bc:3c",
            "net9": "8e:f4:11:d5:24:39"
        },
        "spine_1_1_10": {
            "net0": "16:89:67:87:03:e9",
            "net1": "3e:da:d4:a6:93:3d",
            "net10": "f6:67:42:83:1a:79",
            "net11": "d2:d9:ac:b4:87:39",
            "net12": "42:f5:93:f0:48:c3",
            "net13": "66:13:de:98:95:0a",
            "net14": "b2:7e:ac:6c:70:cf",
            "net15": "aa:2f:a7:61:ba:3e",
            "net16": "26:42:27:77:23:0a",
            "net17": "c6:9e:25:71:53:9a",
            "net18": "e6:d7:4e:2a:bc:6e",
            "net19": "2a:93:61:95:0d:81",
            "net2": "42:16:93:7a:31:0b",
            "net20": "5a:12:08:86:a0:e2",
            "net21": "d2:06:53:43:0f:1c",
            "net22": "06:d6:54:99:85:62",
            "net23": "ce:f4:0c:e0:c1:04",
            "net24": "2e:cd:8d:d1:d7:cc",
            "net25": "e6:29:71:2a:b3:19",
            "net26": "76:76:ee:16:6e:f7",
            "net27": "be:98:77:2a:5b:77",
            "net3": "1a:57:bc:5c:de:92",
            "net4": "fa:21:8b:d4:70:de",
            "net5": "16:60:72:d5:31:d7",
            "net6": "ee:db:d2:24:6f:f1",
            "net7": "ea:2d:e4:68:d1:85",
            "net8": "1a:7a:93:a0:25:5f",
            "net9": "ce:1d:fb:4b:ec:fd"
        },
        "spine_1_1_11": {
            "net0": "e6:d3:2e:d1:d8:fa",
            "net1": "16:60:14:f4:93:16",
            "net10": "e6:16:22:e4:02:56",
            "net11": "76:47:f4:98:4f:59",
            "net12": "2e:82:3f:d0:b4:92",
            "net13": "3e:57:2e:54:66:2e",
            "net14": "d2:ab:5f:d9:35:92",
            "net15": "9e:c0:68:55:ff:4a",
            "net16": "06:b4:0e:42:be:83",
            "net17": "0e:59:85:9f:91:2f",
            "net18": "9e:a4:09:bd:41:e7",
            "net19": "8e:b7:14:25:cc:85",
            "net2": "de:87:dd:90:11:94",
            "net20": "76:30:a4:46:93:fc",
            "net21": "6a:8a:ad:fb:b8:d8",
            "net22": "b2:01:a0:c8:e5:57",
            "net23": "0e:6b:9e:15:6a:48",
            "net24": "52:a1:74:95:c1:f1",
            "net25": "a6:9d:ad:87:43:4b",
            "net26": "ca:3e:42:b3:04:d0",
            "net27": "1a:53:35:51:8e:ed",
            "net3": "e6:e0:5c:4a:a2:b8",
            "net4": "1a:dd:ed:4b:0b:b8",
            "net5": "e6:8d:71:23:5f:80",
            "net6": "f6:19:68:da:2d:3c",
            "net7": "3a:7f:b0:a1:f1:e5",
            "net8": "5a:67:db:78:e5:fd",
            "net9": "6a:8e:74:6f:5a:6d"
        },
        "spine_1_1_12": {
            "net0": "8a:2f:85:cc:39:65",
            "net1": "0e:25:85:1b:8d:12",
            "net10": "0e:74:ac:35:8a:50",
            "net11": "2e:1b:00:2d:8e:fd",
            "net12": "0a:51:6f:5a:2b:85",
            "net13": "52:4f:57:12:7f:ac",
            "net14": "32:4c:a5:0f:f7:18",
            "net15": "a6:ce:b2:66:5f:a8",
            "net16": "6e:c0:3b:fe:c9:dd",
            "net17": "3a:4a:7c:c5:a1:94",
            "net18": "8e:55:c8:34:a2:2d",
            "net19": "72:71:ad:83:63:85",
            "net2": "be:6a:11:2f:1b:00",
            "net20": "62:4a:a5:ae:9b:d8",
            "net21": "ae:10:50:06:ee:31",
            "net22": "76:73:97:c8:2e:33",
            "net23": "c6:d5:f4:89:5a:17",
            "net24": "d2:9b:58:48:93:64",
            "net25": "8e:71:97:41:d5:27",
            "net26": "ae:28:14:1f:4b:c1",
            "net27": "c2:39:cd:61:82:8f",
            "net3": "2a:91:b0:dc:86:bf",
            "net4": "b2:6b:05:18:d2:7f",
            "net5": "46:2a:0e:c8:de:e9",
            "net6": "0e:93:d3:3c:b7:99",
            "net7": "de:ff:a3:ef:b8:49",
            "net8": "7e:9c:4d:38:3c:b7",
            "net9": "a2:de:98:91:5e:e7"
        },
        "spine_1_1_13": {
            "net0": "f2:5a:81:c8:c7:71",
            "net1": "6e:13:76:0a:e9:ff",
            "net10": "aa:49:8c:03:88:08",
            "net11": "32:2b:e4:f9:d2:3e",
            "net12": "d2:29:9e:ff:1f:2e",
            "net13": "d6:10:8a:2b:a3:1a",
            "net14": "ea:9c:cc:14:3e:4e",
            "net15": "16:fb:ae:de:7c:0a",
            "net16": "d6:da:8f:db:83:37",
            "net17": "9e:ed:08:28:7d:50",
            "net18": "c2:e4:31:cb:db:8d",
            "net19": "3e:15:ae:6a:83:8a",
            "net2": "4e:fa:4e:b1:7b:7e",
            "net20": "a6:03:f1:94:9a:54",
            "net21": "e2:4e:64:2f:12:1e",
            "net22": "b6:0a:72:44:e4:1c",
            "net23": "0e:76:db:83:3c:23",
            "net24": "4e:4e:12:c1:00:e5",
            "net25": "a6:0a:cb:a3:31:ed",
            "net26": "82:8b:bb:1e:17:55",
            "net27": "aa:e4:02:46:9f:ca",
            "net3": "f2:2e:55:30:a2:78",
            "net4": "c2:56:97:12:75:50",
            "net5": "72:f9:7a:9f:a7:ba",
            "net6": "8a:a7:0f:c2:38:e1",
            "net7": "3a:ee:73:a0:c5:d2",
            "net8": "86:22:55:9e:44:a9",
            "net9": "e6:62:b5:88:20:bb"
        },
        "spine_1_1_14": {
            "net0": "ba:75:8d:71:9d:81",
            "net1": "7e:87:48:8a:77:e3",
            "net10": "52:17:cc:68:da:c7",
            "net11": "02:38:6e:c3:dc:49",
            "net12": "56:69:66:e6:d0:6c",
            "net13": "c6:d6:d4:91:38:14",
            "net14": "ea:4b:43:2e:72:d2",
            "net15": "aa:d2:77:91:3f:ba",
            "net16": "ce:c1:d3:16:af:51",
            "net17": "66:cc:70:37:3e:6c",
            "net18": "26:10:a5:97:34:94",
            "net19": "82:ee:79:1d:43:9b",
            "net2": "1e:8e:7d:d2:74:10",
            "net20": "de:61:a0:7a:39:e0",
            "net21": "6e:03:94:db:e6:19",
            "net22": "8e:ba:7a:b9:d5:8d",
            "net23": "12:3d:9e:6c:79:0a",
            "net24": "56:54:e0:a4:2d:55",
            "net25": "fe:1d:77:95:d3:47",
            "net26": "9a:31:0d:17:83:09",
            "net27": "ee:37:e6:6f:92:2f",
            "net3": "72:6b:9a:93:29:2e",
            "net4": "b2:28:98:6e:9a:25",
            "net5": "ce:c8:6d:8e:bd:7a",
            "net6": "ee:81:d6:9d:12:2a",
            "net7": "8e:34:c5:c4:27:19",
            "net8": "42:28:26:69:05:f1",
            "net9": "82:5a:ca:86:6c:c1"
        },
        "spine_1_1_2": {
            "net0": "86:fa:71:78:2f:a4",
            "net1": "16:77:27:99:17:b2",
            "net10": "d2:06:63:06:1c:a6",
            "net11": "7a:0a:05:bf:7c:5b",
            "net12": "a2:61:df:a8:87:4e",
            "net13": "e6:6a:c8:4e:b1:fb",
            "net14": "f6:68:d7:c2:6a:10",
            "net15": "9e:77:66:22:7a:cc",
            "net16": "46:8e:cd:46:38:c8",
            "net17": "8a:aa:6e:2b:ec:2b",
            "net18": "ee:50:8c:0f:ff:45",
            "net19": "ba:d9:4b:40:23:5a",
            "net2": "ba:97:5b:01:45:cf",
            "net20": "76:51:6b:ab:55:ad",
            "net21": "86:8a:33:1b:ae:b2",
            "net22": "f6:c4:99:f7:fd:2c",
            "net23": "5a:62:ca:64:ec:8f",
            "net24": "d6:b3:a0:78:83:79",
            "net25": "62:55:de:30:5f:74",
            "net26": "a6:34:5f:18:b9:c2",
            "net27": "be:a8:e8:15:82:e2",
            "net3": "86:26:5f:b8:bb:84",
            "net4": "ea:0a:b3:28:cd:f7",
            "net5": "06:d4:0d:af:f2:a4",
            "net6": "06:66:e2:8b:43:aa",
            "net7": "d6:aa:ff:64:b2:1a",
            "net8": "7a:1e:95:23:59:a4",
            "net9": "b6:3b:0a:21:ae:7d"
        },
        "spine_1_1_3": {
            "net0": "ea:60:e1:68:8d:54",
            "net1": "0e:09:22:92:1c:72",
            "net10": "5a:2e:c4:b8:5d:53",
            "net11": "ce:70:11:b6:70:0b",
            "net12": "4e:75:b6:e4:00:bd",
            "net13": "c2:52:c5:df:87:52",
            "net14": "1e:95:d4:76:22:08",
            "net15": "26:24:65:93:86:f0",
            "net16": "82:89:9b:77:9b:52",
            "net17": "42:eb:20:ac:33:9a",
            "net18": "9a:65:5e:ce:0d:78",
            "net19": "fe:2f:9d:92:9b:0c",
            "net2": "3e:50:e3:21:5f:77",
            "net20": "82:fa:22:43:71:20",
            "net21": "e6:c5:9d:bd:62:27",
            "net22": "26:07:f9:04:22:ed",
            "net23": "f6:e9:99:65:e7:c4",
            "net24": "8e:8b:a7:66:ab:f0",
            "net25": "b6:ac:f1:12:28:f8",
            "net26": "d2:c6:b1:2b:93:60",
            "net27": "02:96:79:be:83:9b",
            "net3": "6a:85:ac:e1:28:80",
            "net4": "4e:06:e7:ee:43:c5",
            "net5": "86:f8:c1:fa:3c:ee",
            "net6": "f2:eb:21:b8:7e:96",
            "net7": "3a:b5:26:34:3e:59",
            "net8": "a6:11:1d:2b:5c:80",
            "net9": "aa:33:f5:05:8b:9e"
        },
        "spine_1_1_4": {
            "net0": "de:73:15:a1:d0:73",
            "net1": "aa:52:d8:e3:8a:44",
            "net10": "f2:81:df:b3:35:05",
            "net11": "42:bb:49:aa:d3:cd",
            "net12": "0e:47:cd:69:15:98",
            "net13": "62:7c:69:aa:9e:73",
            "net14": "86:43:37:37:86:02",
            "net15": "8e:99:b2:4a:62:1c",
            "net16": "2a:b1:42:fb:86:38",
            "net17": "d6:46:08:33:2b:a2",
            "net18": "fe:d2:df:b7:b5:22",
            "net19": "1a:d4:ac:28:aa:38",
            "net2": "2e:6d:91:28:f6:e0",
            "net20": "1a:8d:8a:16:fd:67",
            "net21": "da:25:16:08:f4:1e",
            "net22": "42:ac:23:a4:29:5e",
            "net23": "52:7b:42:d6:d2:98",
            "net24": "e6:03:66:82:71:77",
            "net25": "06:04:0e:cb:af:0d",
            "net26": "6a:25:a0:82:a9:68",
            "net27": "76:de:79:fa:73:f6",
            "net3": "36:63:48:56:03:01",
            "net4": "8e:ee:3b:0b:fd:38",
            "net5": "aa:39:29:55:ba:95",
            "net6": "52:88:6a:9c:7c:74",
            "net7": "5a:e1:80:e4:86:e6",
            "net8": "c6:40:f8:01:77:c8",
            "net9": "ba:79:6e:96:0f:58"
        },
        "spine_1_1_5": {
            "net0": "26:83:2e:72:76:ae",
            "net1": "4e:f1:37:6b:05:56",
            "net10": "ca:ae:6b:26:ad:f9",
            "net11": "7a:12:f2:93:23:e9",
            "net12": "26:a8:dc:de:9f:88",
            "net13": "0e:53:f6:8f:c3:23",
            "net14": "36:44:bf:97:fc:ad",
            "net15": "1e:5d:df:1e:f5:81",
            "net16": "72:62:62:6a:1f:b9",
            "net17": "1a:29:8b:7d:57:84",
            "net18": "f2:53:8d:9d:6a:90",
            "net19": "4e:e7:56:93:76:5c",
            "net2": "d2:57:7c:39:8e:f9",
            "net20": "c2:66:59:fa:c7:3a",
            "net21": "36:38:1c:87:75:eb",
            "net22": "2e:8f:4c:d4:15:61",
            "net23": "ce:24:d0:6a:cc:98",
            "net24": "5e:71:4e:51:6b:ea",
            "net25": "d6:cf:2b:bf:46:d1",
            "net26": "82:c4:87:fb:dd:bf",
            "net27": "5e:fb:94:49:e1:12",
            "net3": "2a:ce:6e:a2:67:f3",
            "net4": "86:86:04:d0:3a:9b",
            "net5": "8e:1e:b9:44:dc:30",
            "net6": "0e:6c:93:78:9f:ef",
            "net7": "32:53:96:15:21:91",
            "net8": "52:3f:91:4d:60:4d",
            "net9": "fa:ae:de:04:bf:87"
        },
        "spine_1_1_6": {
            "net0": "2e:eb:77:df:c8:28",
            "net1": "72:b8:e9:d2:22:2f",
            "net10": "36:92:99:1e:8e:54",
            "net11": "da:f8:d4:37:2e:df",
            "net12": "32:a5:ef:20:fb:9b",
            "net13": "2e:dd:11:b4:44:22",
            "net14": "a6:ce:da:a1:e4:43",
            "net15": "26:63:57:89:b7:59",
            "net16": "52:c8:41:62:01:d7",
            "net17": "4a:fa:13:c3:b0:f2",
            "net18": "d2:4d:6f:5e:7a:70",
            "net19": "6a:0d:6a:b2:e2:b6",
            "net2": "a6:a4:08:48:b9:d8",
            "net20": "fe:53:28:64:46:6f",
            "net21": "1e:32:10:f5:aa:68",
            "net22": "46:57:75:86:77:dc",
            "net23": "9a:44:58:a2:05:ce",
            "net24": "16:65:56:2c:fa:34",
            "net25": "6a:3b:43:fe:72:37",
            "net26": "9e:05:9e:13:94:df",
            "net27": "da:f3:b0:b6:b5:37",
            "net3": "46:1c:db:05:9a:0d",
            "net4": "8e:9a:1f:f0:ee:0e",
            "net5": "f6:95:d6:67:67:75",
            "net6": "5e:d1:cb:f0:0f:4b",
            "net7": "76:0c:f2:c0:ca:4c",
            "net8": "52:f6:36:46:ee:28",
            "net9": "a2:e8:76:8f:77:1c"
        },
        "spine_1_1_7": {
            "net0": "f6:d3:c8:db:60:14",
            "net1": "02:b1:b8:ec:2f:19",
            "net10": "da:a1:2d:ad:b2:54",
            "net11": "5a:7a:f5:1d:c8:66",
            "net12": "5a:f7:f0:03:8e:41",
            "net13": "12:12:18:6b:e2:10",
            "net14": "be:1c:cd:9b:60:dc",
            "net15": "96:23:7f:c8:5f:4a",
            "net16": "3a:29:52:f2:d9:d2",
            "net17": "a2:aa:17:cd:7a:ae",
            "net18": "f2:64:b2:42:d7:f4",
            "net19": "b2:50:3e:0a:e1:0d",
            "net2": "d2:0f:85:eb:69:e4",
            "net20": "7e:71:bf:46:dd:50",
            "net21": "26:5e:f5:bd:3d:32",
            "net22": "ca:b9:10:50:95:da",
            "net23": "a2:03:10:c6:1e:2e",
            "net24": "4e:71:2a:a6:39:31",
            "net25": "56:de:f8:5c:f0:62",
            "net26": "e2:aa:91:8f:91:c6",
            "net27": "62:42:43:eb:96:c9",
            "net3": "9a:9a:e5:ee:71:63",
            "net4": "4e:78:57:bd:8d:8f",
            "net5": "8e:33:70:71:74:36",
            "net6": "5e:2b:6f:2c:10:04",
            "net7": "72:be:75:05:e3:75",
            "net8": "3e:26:c1:3f:44:f5",
            "net9": "22:00:95:5c:fe:ab"
        },
        "spine_1_1_8": {
            "net0": "32:07:24:1d:7d:16",
            "net1": "26:57:6a:4b:2a:cd",
            "net10": "4e:25:6c:c5:aa:55",
            "net11": "da:2e:e1:22:0f:6c",
            "net12": "8e:41:82:2f:21:6a",
            "net13": "5a:1d:29:f5:b2:3f",
            "net14": "a6:e3:c2:77:81:07",
            "net15": "12:e6:c4:8c:38:6a",
            "net16": "9e:41:73:dd:d4:34",
            "net17": "06:c3:00:00:94:11",
            "net18": "0a:23:61:35:53:d8",
            "net19": "36:b2:00:0a:84:19",
            "net2": "e2:de:92:71:3d:37",
            "net20": "fa:25:85:74:cf:86",
            "net21": "6e:ce:a3:e6:2a:58",
            "net22": "02:29:57:56:15:6a",
            "net23": "f2:3e:fc:59:5d:a9",
            "net24": "ce:e9:59:72:01:e8",
            "net25": "fe:e2:65:c5:d7:5c",
            "net26": "06:f4:ea:f5:93:96",
            "net27": "5e:af:19:2a:26:43",
            "net3": "f2:70:59:67:85:fa",
            "net4": "4e:b7:a9:e7:a7:3c",
            "net5": "9a:84:4b:3b:9b:b0",
            "net6": "86:18:bd:63:a1:3e",
            "net7": "8a:16:2e:c2:b0:e0",
            "net8": "ea:20:a7:65:6b:3a",
            "net9": "4e:ec:aa:00:18:c4"
        },
        "spine_1_1_9": {
            "net0": "0e:6b:2b:d6:9e:6a",
            "net1": "c2:d7:78:38:8d:64",
            "net10": "be:6b:87:3d:ba:9d",
            "net11": "0e:29:4c:78:fe:d9",
            "net12": "a2:0b:97:e6:15:a9",
            "net13": "8e:10:e6:1b:51:b3",
            "net14": "f2:a7:3a:89:2a:87",
            "net15": "da:13:11:6c:7f:96",
            "net16": "8a:e1:66:82:f6:0b",
            "net17": "e2:31:96:f4:b0:54",
            "net18": "3e:44:69:2b:2e:b6",
            "net19": "92:ab:41:20:c8:5b",
            "net2": "36:b8:1b:24:b8:22",
            "net20": "82:c7:19:ac:a2:11",
            "net21": "ca:3f:ab:a6:d9:77",
            "net22": "5e:94:74:12:68:37",
            "net23": "f6:a3:1c:c0:2a:12",
            "net24": "76:1f:27:91:da:a1",
            "net25": "9e:35:15:04:68:04",
            "net26": "22:3f:de:46:c7:69",
            "net27": "b6:86:ea:7f:f7:e5",
            "net3": "1e:d5:27:99:3d:2d",
            "net4": "c2:9c:66:5d:40:b0",
            "net5": "fe:e2:82:88:64:d3",
            "net6": "86:f8:83:5d:a3:87",
            "net7": "66:09:a6:ee:f3:46",
            "net8": "e6:39:78:d0:98:27",
            "net9": "02:9d:cd:4a:ab:b5"
        },
        "spine_2_1_1": {
            "net0": "9e:ac:0b:04:7f:5e",
            "net1": "4e:ce:9e:60:be:29",
            "net10": "26:1e:94:54:91:2b",
            "net11": "ea:fa:c6:0a:bd:b5",
            "net12": "ca:b6:8c:2a:37:2e",
            "net13": "42:09:45:b7:6c:3b",
            "net14": "d6:9a:80:b7:6f:95",
            "net15": "b2:d6:89:26:28:98",
            "net16": "0e:0d:7e:f0:bf:32",
            "net17": "6e:38:92:21:56:e6",
            "net18": "9a:a0:5e:10:7a:85",
            "net19": "be:a4:9c:48:58:66",
            "net2": "a2:e4:c5:e4:d5:52",
            "net20": "82:da:39:1c:7b:df",
            "net21": "fa:1f:33:9a:55:a7",
            "net22": "3e:e0:55:b7:77:ba",
            "net23": "ea:7f:dc:d8:09:a7",
            "net24": "b2:ca:92:56:58:31",
            "net25": "d2:8f:a9:43:e5:62",
            "net26": "72:63:16:43:5b:0f",
            "net27": "22:1f:9f:e0:3e:69",
            "net3": "46:88:41:97:b2:a9",
            "net4": "d6:67:8f:98:6e:39",
            "net5": "8e:18:5b:b0:3c:0e",
            "net6": "6a:d0:7a:62:b2:64",
            "net7": "2e:1e:3c:97:b2:6d",
            "net8": "82:12:e0:e8:62:d7",
            "net9": "ca:ad:64:26:e9:1b"
        },
        "spine_2_1_10": {
            "net0": "da:78:3e:8c:48:b1",
            "net1": "52:f5:ff:6d:ea:04",
            "net10": "2e:68:3b:4d:3e:d1",
            "net11": "de:1e:e5:c4:24:78",
            "net12": "ce:de:57:87:d3:80",
            "net13": "56:4a:75:be:78:5f",
            "net14": "92:d0:80:7c:17:b2",
            "net15": "82:e0:3c:00:8d:ae",
            "net16": "16:07:04:af:06:51",
            "net17": "4e:3d:3c:b8:c3:82",
            "net18": "fa:dc:25:10:9f:05",
            "net19": "36:4f:32:6c:4c:75",
            "net2": "82:92:ec:5e:6c:5f",
            "net20": "52:f0:f9:ec:c9:79",
            "net21": "22:5d:fc:09:32:72",
            "net22": "22:ad:8e:dc:b6:b9",
            "net23": "a2:ad:ae:df:21:39",
            "net24": "32:f2:60:09:11:56",
            "net25": "0a:76:a5:e9:80:77",
            "net26": "fa:6a:4f:91:48:23",
            "net27": "22:58:ef:cf:82:8b",
            "net3": "ee:75:c7:1a:2e:d6",
            "net4": "f2:ad:93:af:51:07",
            "net5": "c2:eb:7f:20:72:6f",
            "net6": "ca:c0:14:34:b1:9d",
            "net7": "42:54:6c:14:f2:fd",
            "net8": "f6:bf:b0:73:f5:e9",
            "net9": "52:65:b3:88:03:17"
        },
        "spine_2_1_11": {
            "net0": "86:23:6d:eb:2a:a8",
            "net1": "d2:16:3f:9e:94:b1",
            "net10": "72:39:9b:47:68:1a",
            "net11": "36:dc:a9:97:03:2e",
            "net12": "fe:a9:3c:35:48:2e",
            "net13": "fe:de:f1:56:1d:81",
            "net14": "8e:a7:9d:a4:bd:7f",
            "net15": "42:87:de:a5:17:d7",
            "net16": "8a:5e:7f:25:6b:d7",
            "net17": "4e:1a:45:8e:e0:62",
            "net18": "92:f7:24:8a:77:47",
            "net19": "7e:91:52:02:8a:8b",
            "net2": "e2:a2:23:e8:3b:41",
            "net20": "0e:08:70:76:5b:e5",
            "net21": "72:9a:61:f8:0f:a6",
            "net22": "be:80:f3:31:ee:b7",
            "net23": "6a:6a:46:6f:cb:9e",
            "net24": "3a:e1:b5:7d:f7:79",
            "net25": "de:d8:51:3c:1f:d2",
            "net26": "22:f3:24:c8:78:46",
            "net27": "62:91:8e:9a:39:8a",
            "net3": "8a:eb:99:84:ba:93",
            "net4": "f2:a8:b9:cb:d3:05",
            "net5": "3a:98:6e:c8:ae:67",
            "net6": "32:c7:44:f1:60:a2",
            "net7": "0a:5f:49:4e:8a:7d",
            "net8": "46:df:41:0e:b6:fa",
            "net9": "a6:1e:16:0a:f4:95"
        },
        "spine_2_1_12": {
            "net0": "92:77:21:29:4a:9f",
            "net1": "9e:d5:58:3f:63:18",
            "net10": "c6:f2:69:9a:e0:56",
            "net11": "be:df:b2:50:17:66",
            "net12": "66:98:00:f1:d8:ef",
            "net13": "5a:37:2d:98:11:e7",
            "net14": "5e:3a:00:48:bc:52",
            "net15": "2a:c9:88:c1:12:e1",
            "net16": "86:94:e4:d5:07:ca",
            "net17": "82:ef:ce:d1:b4:47",
            "net18": "82:22:24:1d:46:ca",
            "net19": "92:32:70:ea:e6:a0",
            "net2": "0e:6f:34:02:9b:03",
            "net20": "66:b8:07:64:d5:22",
            "net21": "d6:b9:17:ba:95:b1",
            "net22": "66:09:af:f5:cd:ec",
            "net23": "1e:36:41:b0:fe:14",
            "net24": "6a:a1:ca:b0:12:5f",
            "net25": "8e:ae:dd:e1:ac:b1",
            "net26": "ce:45:6f:16:bf:71",
            "net27": "86:81:74:c5:0e:32",
            "net3": "92:64:4e:41:2b:6f",
            "net4": "12:c0:b7:47:a9:35",
            "net5": "56:eb:89:13:a6:b4",
            "net6": "a2:3a:fc:21:2b:7b",
            "net7": "da:44:8e:a4:16:0c",
            "net8": "ea:de:86:4b:9d:70",
            "net9": "e2:67:5e:20:a7:3c"
        },
        "spine_2_1_13": {
            "net0": "02:b0:ac:d9:fb:e7",
            "net1": "1e:99:fe:70:86:8f",
            "net10": "d2:f1:2e:74:e8:35",
            "net11": "4e:e4:75:46:dc:ea",
            "net12": "76:07:22:c8:50:08",
            "net13": "d6:f5:83:b2:0d:e1",
            "net14": "92:c9:6d:84:18:c5",
            "net15": "e6:37:1e:32:90:f8",
            "net16": "de:cc:bc:fb:07:6f",
            "net17": "d2:8d:a2:dd:2a:55",
            "net18": "ca:4b:f8:9a:97:21",
            "net19": "6e:27:81:ad:da:c0",
            "net2": "02:8b:86:1a:5e:23",
            "net20": "42:4c:d5:25:3b:46",
            "net21": "ee:62:23:97:2e:39",
            "net22": "7e:f3:3b:7a:98:3f",
            "net23": "12:5a:45:81:b2:46",
            "net24": "e6:15:d0:60:97:b2",
            "net25": "e2:33:a7:15:9a:e7",
            "net26": "a6:b0:c8:47:5d:4e",
            "net27": "7e:fb:6d:92:fd:f3",
            "net3": "5a:6b:00:9b:96:eb",
            "net4": "f2:b5:e0:53:85:6a",
            "net5": "4e:f0:b7:c0:ba:1a",
            "net6": "b6:cc:2b:f4:3b:15",
            "net7": "c6:8d:03:2f:59:6e",
            "net8": "ea:d6:e5:b0:b2:85",
            "net9": "9a:c9:e3:84:9d:b2"
        },
        "spine_2_1_14": {
            "net0": "aa:50:e4:37:85:10",
            "net1": "d6:91:b2:0c:f0:dd",
            "net10": "ca:6b:ff:4b:ef:9c",
            "net11": "aa:3a:fe:d7:40:85",
            "net12": "d6:60:01:34:8e:a4",
            "net13": "ce:78:a9:9c:f5:df",
            "net14": "f6:03:b2:5c:63:ea",
            "net15": "76:d9:a8:21:ba:85",
            "net16": "3a:41:de:14:7c:81",
            "net17": "1a:a8:43:ef:93:52",
            "net18": "16:36:2b:0a:fd:c7",
            "net19": "32:43:54:b8:3f:00",
            "net2": "4a:68:c9:e2:ab:ce",
            "net20": "5e:7d:50:35:f9:3c",
            "net21": "7e:53:95:0f:38:5e",
            "net22": "fa:43:b9:c1:61:75",
            "net23": "2e:bf:20:12:50:77",
            "net24": "52:e0:b2:c5:08:25",
            "net25": "4e:d1:9a:dc:6f:6e",
            "net26": "9e:40:fd:f0:1e:e8",
            "net27": "ba:44:5a:a0:44:bb",
            "net3": "8e:d7:94:e3:05:cc",
            "net4": "1a:92:93:a6:44:ab",
            "net5": "66:1b:20:9e:fe:7b",
            "net6": "0e:7f:b0:1e:33:30",
            "net7": "2a:2c:3d:9b:e4:63",
            "net8": "7a:0e:e4:30:9e:e2",
            "net9": "de:30:78:f4:93:b6"
        },
        "spine_2_1_2": {
            "net0": "a2:11:50:87:6e:90",
            "net1": "f6:62:23:40:75:50",
            "net10": "1a:78:a9:ad:79:e2",
            "net11": "fe:ae:4b:21:be:4a",
            "net12": "9a:1e:80:09:62:69",
            "net13": "42:3c:70:24:9f:31",
            "net14": "0a:44:cd:40:38:28",
            "net15": "1e:28:4f:f7:2b:13",
            "net16": "ea:db:bf:8f:64:b9",
            "net17": "92:f3:e9:0f:75:2b",
            "net18": "32:13:ac:fe:42:c4",
            "net19": "5e:73:35:07:7a:f9",
            "net2": "36:bc:60:9c:0c:a9",
            "net20": "26:b2:38:02:10:46",
            "net21": "9e:69:f2:d8:57:39",
            "net22": "d2:8a:ef:48:ab:09",
            "net23": "46:90:70:c8:eb:d5",
            "net24": "be:e7:71:b6:f4:d9",
            "net25": "c2:94:81:13:de:a1",
            "net26": "c6:f8:41:df:a4:82",
            "net27": "82:c4:a8:71:87:18",
            "net3": "f2:57:9f:bf:b7:e5",
            "net4": "be:33:89:2e:e1:a2",
            "net5": "26:8c:f7:80:a1:f6",
            "net6": "be:15:00:25:8f:ee",
            "net7": "46:78:0a:7d:1e:ff",
            "net8": "b2:8e:a2:b5:7c:a3",
            "net9": "62:56:41:14:fa:f7"
        },
        "spine_2_1_3": {
            "net0": "66:1c:3a:13:00:8b",
            "net1": "86:ca:5f:c7:07:ec",
            "net10": "4a:74:fd:c2:ad:a0",
            "net11": "ba:7a:1a:58:da:43",
            "net12": "22:10:a1:91:2c:b3",
            "net13": "0a:4f:04:bc:2f:1f",
            "net14": "2a:8f:94:a7:b4:c0",
            "net15": "d2:c3:d6:a2:85:ac",
            "net16": "c6:98:04:56:0b:5b",
            "net17": "06:ed:0e:06:75:6a",
            "net18": "46:9c:f2:71:04:b2",
            "net19": "6e:80:90:8d:e5:53",
            "net2": "ae:ca:29:75:e9:94",
            "net20": "ca:bd:01:da:95:08",
            "net21": "3a:5e:bd:49:a9:f5",
            "net22": "c2:c1:50:a6:2e:12",
            "net23": "9e:7b:13:de:80:62",
            "net24": "9a:f1:3f:80:33:35",
            "net25": "8e:7c:63:58:82:d6",
            "net26": "b6:11:14:a9:67:38",
            "net27": "12:4a:89:95:bb:27",
            "net3": "ea:a8:9c:4c:91:22",
            "net4": "4a:68:22:35:49:4c",
            "net5": "b2:a0:5c:f7:0c:37",
            "net6": "ce:ac:51:d3:8b:64",
            "net7": "36:86:94:bf:9c:8b",
            "net8": "6e:46:85:5d:89:f6",
            "net9": "36:76:bd:ea:75:6a"
        },
        "spine_2_1_4": {
            "net0": "0a:ed:77:89:a3:0e",
            "net1": "aa:a6:f1:18:7d:9e",
            "net10": "1e:b7:e1:13:35:bd",
            "net11": "fa:0d:59:01:39:6d",
            "net12": "5e:87:d9:5d:d0:57",
            "net13": "da:36:28:ae:22:40",
            "net14": "92:12:b8:55:7d:89",
            "net15": "9e:38:87:75:da:27",
            "net16": "1a:b8:c9:17:72:04",
            "net17": "32:5d:37:b9:50:8c",
            "net18": "b2:32:bb:75:fc:68",
            "net19": "d6:95:6e:83:90:95",
            "net2": "9e:4a:de:18:f3:9b",
            "net20": "2a:88:c8:13:0e:d0",
            "net21": "d6:84:29:88:18:65",
            "net22": "22:45:53:66:58:ac",
            "net23": "02:08:1b:2c:bf:14",
            "net24": "ca:2d:a0:08:e9:cd",
            "net25": "82:cd:93:0c:ce:02",
            "net26": "36:e6:40:de:96:1f",
            "net27": "62:63:a9:d3:cb:5c",
            "net3": "1a:c1:28:e4:6e:3c",
            "net4": "8e:7f:a0:8d:d6:b6",
            "net5": "16:6e:f4:15:54:01",
            "net6": "de:b3:d6:0a:55:e0",
            "net7": "0e:e0:12:52:74:b2",
            "net8": "42:2e:1d:2e:e4:b6",
            "net9": "9e:4e:7d:8c:cb:32"
        },
        "spine_2_1_5": {
            "net0": "92:d0:26:28:67:eb",
            "net1": "02:3d:96:c3:eb:52",
            "net10": "1e:e2:ab:f5:08:f3",
            "net11": "2e:ee:1f:36:cc:0b",
            "net12": "ba:d2:74:1e:5f:09",
            "net13": "e6:0b:f0:19:91:73",
            "net14": "2a:e7:e4:67:7d:06",
            "net15": "3e:0b:19:8d:4e:0d",
            "net16": "1a:1c:d6:68:9a:fa",
            "net17": "12:18:91:7d:d7:ec",
            "net18": "f2:9b:9e:8c:e4:a8",
            "net19": "a2:5d:ff:93:3b:6f",
            "net2": "26:4f:88:a2:d8:bc",
            "net20": "6a:d2:21:6f:38:b4",
            "net21": "5e:cf:b0:90:54:01",
            "net22": "3e:24:3c:46:6c:49",
            "net23": "ea:21:ad:06:84:bd",
            "net24": "aa:15:cb:33:3b:d0",
            "net25": "da:65:03:c8:27:0b",
            "net26": "72:7d:63:80:f3:70",
            "net27": "de:73:46:89:79:19",
            "net3": "da:53:b3:e7:04:f1",
            "net4": "be:fa:b1:6f:14:bc",
            "net5": "46:70:16:1d:10:56",
            "net6": "e6:f0:ab:80:60:02",
            "net7": "6e:ed:64:a0:d9:a7",
            "net8": "96:8a:43:13:7a:09",
            "net9": "c2:b6:e9:f2:4d:cb"
        },
        "spine_2_1_6": {
            "net0": "1a:cd:dd:c5:e8:64",
            "net1": "da:ec:a3:62:ba:d5",
            "net10": "8e:e8:50:f1:9e:a3",
            "net11": "d6:00:5c:bf:93:15",
            "net12": "82:cc:78:5b:e1:f3",
            "net13": "ae:f3:50:57:85:c0",
            "net14": "9a:ea:21:df:5e:20",
            "net15": "f2:ca:7b:ae:a9:ae",
            "net16": "7a:66:0a:92:5e:c9",
            "net17": "d2:ba:ad:8e:7b:8c",
            "net18": "de:f9:a3:68:78:00",
            "net19": "6a:50:c3:08:59:aa",
            "net2": "fa:bc:61:32:76:ff",
            "net20": "3a:10:f1:21:8e:b8",
            "net21": "8a:33:17:d6:13:ec",
            "net22": "ca:5f:bd:f0:f2:41",
            "net23": "2a:20:f3:fe:8a:ee",
            "net24": "4a:ba:c9:84:cf:54",
            "net25": "e6:01:4d:b7:1b:ab",
            "net26": "6a:9d:dd:d7:0d:08",
            "net27": "62:1c:00:37:a1:af",
            "net3": "12:2f:23:e7:54:5e",
            "net4": "1e:e4:e0:f7:a6:3b",
            "net5": "ea:df:71:1f:a5:c1",
            "net6": "5e:86:d3:3d:de:1a",
            "net7": "7a:93:58:c7:7a:13",
            "net8": "36:ee:99:89:f6:25",
            "net9": "22:ae:d2:6b:eb:a5"
        },
        "spine_2_1_7": {
            "net0": "e6:60:22:04:2a:17",
            "net1": "62:4f:25:07:8d:93",
            "net10": "6a:ed:53:6f:ee:b6",
            "net11": "2e:30:9c:d0:c6:35",
            "net12": "e2:6b:71:c9:08:10",
            "net13": "8e:68:b2:f3:74:99",
            "net14": "46:e5:df:62:14:5c",
            "net15": "52:24:1e:16:57:07",
            "net16": "d6:cd:df:69:31:05",
            "net17": "f2:05:4d:39:8a:67",
            "net18": "16:d9:50:2c:69:ee",
            "net19": "f6:ff:30:1f:82:5e",
            "net2": "4e:43:b9:25:03:dc",
            "net20": "4a:ed:ec:3c:dd:14",
            "net21": "b6:2e:14:56:6b:38",
            "net22": "8a:7c:5f:9e:cf:cf",
            "net23": "1e:a0:d8:70:09:94",
            "net24": "9a:04:22:fa:75:ff",
            "net25": "da:cc:46:93:be:29",
            "net26": "6a:dc:49:ee:4f:92",
            "net27": "aa:70:8f:8d:ea:74",
            "net3": "de:65:0f:b1:f6:8a",
            "net4": "ee:df:ca:49:14:22",
            "net5": "5a:55:aa:09:63:68",
            "net6": "0a:6d:03:ed:d8:55",
            "net7": "b2:a0:5a:84:cd:58",
            "net8": "ae:30:98:2f:bb:70",
            "net9": "ee:72:10:55:54:a2"
        },
        "spine_2_1_8": {
            "net0": "c2:de:18:bf:18:a7",
            "net1": "56:a5:52:00:95:28",
            "net10": "5a:7a:fc:09:62:9b",
            "net11": "4a:f9:d1:e8:87:13",
            "net12": "7e:64:4d:a6:ed:2d",
            "net13": "32:bd:5f:7b:15:4b",
            "net14": "22:92:b7:56:8d:96",
            "net15": "02:cc:f1:c1:83:99",
            "net16": "d6:ec:b2:f4:30:70",
            "net17": "26:16:78:43:04:de",
            "net18": "26:b8:58:6f:d5:f8",
            "net19": "be:23:52:66:8d:a7",
            "net2": "1a:8f:f5:d5:f5:f8",
            "net20": "f2:ea:d1:3c:18:b6",
            "net21": "ba:6d:e9:66:ce:2d",
            "net22": "7e:ef:2a:3a:3f:ec",
            "net23": "ca:c8:c4:38:e9:b0",
            "net24": "92:0e:68:13:f3:18",
            "net25": "12:73:d7:42:18:4b",
            "net26": "e2:d5:c1:bf:1c:c2",
            "net27": "9e:f8:be:e8:30:88",
            "net3": "ba:b0:77:d8:5a:f1",
            "net4": "3e:f0:8d:47:04:16",
            "net5": "de:d8:f4:bf:71:13",
            "net6": "8e:29:d5:28:3b:62",
            "net7": "ea:51:28:45:4c:d9",
            "net8": "1a:16:bc:29:ad:f2",
            "net9": "e2:e1:22:aa:33:e0"
        },
        "spine_2_1_9": {
            "net0": "36:d7:a3:b1:91:dd",
            "net1": "9e:18:ca:a2:96:5e",
            "net10": "7e:11:56:e2:65:81",
            "net11": "4e:e2:fe:38:86:11",
            "net12": "3e:ba:60:8d:84:ef",
            "net13": "e2:58:c6:0d:7b:2e",
            "net14": "da:01:da:4a:8b:4e",
            "net15": "4e:94:13:c4:cf:bf",
            "net16": "36:98:ef:0e:22:d3",
            "net17": "be:0f:91:04:04:a5",
            "net18": "9a:21:c6:ed:7c:a1",
            "net19": "ee:8b:f4:c7:09:b9",
            "net2": "72:86:e2:ec:35:d6",
            "net20": "de:1d:1b:ad:38:d4",
            "net21": "76:c5:76:7c:fb:76",
            "net22": "0e:7e:e1:73:c1:41",
            "net23": "3a:4a:bf:4b:50:59",
            "net24": "ba:9b:76:51:4f:ac",
            "net25": "c6:07:39:e2:b0:49",
            "net26": "c2:ab:64:75:24:d7",
            "net27": "f2:b7:b4:81:cd:32",
            "net3": "aa:5b:4f:58:d9:75",
            "net4": "1e:67:62:aa:de:00",
            "net5": "06:4a:c7:b9:3d:33",
            "net6": "42:bb:b5:7d:7e:7a",
            "net7": "7e:41:38:15:94:4b",
            "net8": "a2:25:85:df:ca:cb",
            "net9": "fe:72:bc:b5:92:97"
        },
        "tof_1_2_1": {
            "net0": "52:dc:c7:17:d7:9a",
            "net1": "46:05:76:b4:1d:af",
            "net10": "de:e3:cb:c9:ec:e4",
            "net11": "3a:7a:5b:a7:25:a8",
            "net12": "da:67:05:1a:46:8e",
            "net13": "de:c8:e0:5a:c3:7d",
            "net14": "8e:fa:c4:49:5f:59",
            "net15": "16:d1:f0:e4:d4:e4",
            "net16": "ee:a4:e5:a3:b7:75",
            "net17": "92:2b:5e:28:7e:18",
            "net18": "12:92:b5:a9:c5:a1",
            "net19": "7e:a1:b0:37:01:a5",
            "net2": "8a:12:9d:a0:b8:9b",
            "net20": "8e:b8:3e:ce:93:50",
            "net21": "22:97:c3:ea:05:c5",
            "net22": "c2:54:83:31:75:12",
            "net23": "b6:e2:22:6c:a4:02",
            "net24": "2e:ab:01:f2:22:d2",
            "net25": "0e:9d:65:c2:af:df",
            "net26": "22:c4:2a:4f:24:18",
            "net27": "06:4a:a6:ac:77:8f",
            "net3": "f6:00:b7:79:07:00",
            "net4": "76:08:c7:c1:e6:b9",
            "net5": "ee:ec:09:c4:a2:54",
            "net6": "ce:de:ed:d9:8e:8f",
            "net7": "9e:af:32:84:13:3a",
            "net8": "36:7d:2c:0e:78:e8",
            "net9": "ce:50:22:9b:f0:c6"
        },
        "tof_1_2_10": {
            "net0": "e6:82:a1:6e:f2:5d",
            "net1": "5a:96:38:f3:b4:e2",
            "net10": "56:07:65:4f:2d:f8",
            "net11": "06:aa:1a:5c:9f:36",
            "net12": "e6:9f:a3:51:82:3d",
            "net13": "2e:aa:0b:b7:ec:8d",
            "net14": "c6:24:ac:80:ec:6f",
            "net15": "92:10:51:6b:bc:23",
            "net16": "d2:9a:50:dd:51:c8",
            "net17": "8a:b6:89:ab:f3:a4",
            "net18": "1a:56:08:70:0c:55",
            "net19": "76:85:01:b8:98:2d",
            "net2": "ce:50:17:7e:94:cc",
            "net20": "f2:75:73:13:84:e9",
            "net21": "76:fd:92:04:3a:72",
            "net22": "32:a3:8a:bf:32:6f",
            "net23": "02:53:48:0b:20:49",
            "net24": "3e:36:30:25:d7:6f",
            "net25": "26:ea:7a:97:94:5d",
            "net26": "ae:f9:2f:9f:1e:09",
            "net27": "e2:ff:bc:e0:ba:42",
            "net3": "ae:96:9e:fe:c4:bc",
            "net4": "7e:43:86:b7:3b:b7",
            "net5": "7a:49:28:c5:45:a7",
            "net6": "16:d1:8c:54:89:d3",
            "net7": "52:13:a3:94:10:c2",
            "net8": "2a:e3:65:a2:ce:af",
            "net9": "f6:96:ec:b3:41:46"
        },
        "tof_1_2_11": {
            "net0": "32:88:23:07:3b:2a",
            "net1": "1e:d7:8b:d4:0f:4f",
            "net10": "02:c0:bd:12:f2:e5",
            "net11": "a2:b0:c3:99:18:b6",
            "net12": "fa:f2:e6:68:16:fa",
            "net13": "12:e2:fe:ee:73:76",
            "net14": "f2:6d:2e:39:75:84",
            "net15": "7e:5c:66:08:b8:d5",
            "net16": "1e:73:a8:28:37:01",
            "net17": "0e:eb:c2:e6:cd:92",
            "net18": "ee:a4:09:19:81:4a",
            "net19": "c2:63:6c:fe:13:0b",
            "net2": "0a:b5:29:c5:bc:4c",
            "net20": "12:73:d0:a8:1c:10",
            "net21": "a2:38:33:2a:d9:b1",
            "net22": "76:8e:e4:cc:b2:69",
            "net23": "4e:c4:47:b5:b6:12",
            "net24": "ba:aa:63:01:7f:25",
            "net25": "16:63:1f:fe:d9:3a",
            "net26": "1a:23:b3:c7:65:21",
            "net27": "de:3e:af:12:0c:b1",
            "net3": "82:05:ca:44:ef:47",
            "net4": "42:47:0c:bb:37:42",
            "net5": "ba:d2:ed:0a:84:b4",
            "net6": "a6:df:8a:55:3a:2d",
            "net7": "da:01:41:88:a1:43",
            "net8": "8a:f7:68:05:98:49",
            "net9": "0e:1c:25:5d:0a:5b"
        },
        "tof_1_2_12": {
            "net0": "2e:31:61:79:2d:71",
            "net1": "b6:00:6d:4d:b2:bb",
            "net10": "ae:00:db:c0:8e:94",
            "net11": "36:82:51:9d:2b:32",
            "net12": "4e:d6:e9:d5:9c:b5",
            "net13": "36:87:ff:15:e0:4c",
            "net14": "e2:eb:bb:14:39:ef",
            "net15": "3e:91:14:d8:f7:a0",
            "net16": "4e:a6:a8:3d:e0:4a",
            "net17": "3e:b0:87:62:83:29",
            "net18": "8e:93:8b:e1:1b:4f",
            "net19": "12:54:f0:ca:25:b7",
            "net2": "0e:7a:36:04:37:de",
            "net20": "76:cf:73:31:d0:f6",
            "net21": "de:39:10:87:5b:5c",
            "net22": "f6:6c:fe:3d:2f:a6",
            "net23": "d2:9d:e5:54:57:59",
            "net24": "fe:6c:71:fb:0c:a2",
            "net25": "d6:cc:ed:3c:dc:b6",
            "net26": "da:05:40:8d:bc:35",
            "net27": "42:9c:9e:84:3a:8c",
            "net3": "96:80:f7:7a:77:b9",
            "net4": "e2:66:b4:3d:ae:f0",
            "net5": "9e:63:e8:d7:b6:26",
            "net6": "02:f1:7b:c8:f4:39",
            "net7": "3e:b8:f2:1e:ac:da",
            "net8": "ae:d4:45:ed:d5:8a",
            "net9": "16:e4:77:0f:e5:3c"
        },
        "tof_1_2_13": {
            "net0": "2a:47:dd:8b:49:32",
            "net1": "72:fb:e6:ad:94:17",
            "net10": "4e:31:2a:65:81:8f",
            "net11": "4e:52:ea:8f:d4:e2",
            "net12": "0e:e6:de:6b:e5:10",
            "net13": "22:28:5b:59:12:84",
            "net14": "a6:b6:81:44:51:19",
            "net15": "42:6a:22:5e:12:7c",
            "net16": "2e:fc:9e:a6:79:1b",
            "net17": "c2:04:9a:35:a2:d3",
            "net18": "46:06:f2:fa:d3:69",
            "net19": "fa:0a:d4:80:b3:46",
            "net2": "5a:a1:d2:f0:dc:6c",
            "net20": "92:06:bb:5a:9f:4c",
            "net21": "5e:cb:b0:9d:0a:a1",
            "net22": "d6:f8:0f:7f:bf:41",
            "net23": "02:df:8d:07:ef:04",
            "net24": "4e:cd:29:14:d2:ec",
            "net25": "8a:bf:36:57:a3:2b",
            "net26": "f2:d6:cc:b2:a3:fa",
            "net27": "8a:64:eb:3b:3d:a6",
            "net3": "a6:49:1f:66:ad:18",
            "net4": "12:ad:89:be:8e:9f",
            "net5": "92:cb:49:16:d3:81",
            "net6": "66:4a:11:42:93:98",
            "net7": "52:0b:90:8c:97:86",
            "net8": "26:0b:c5:bb:0d:de",
            "net9": "42:16:f5:22:76:5e"
        },
        "tof_1_2_14": {
            "net0": "c2:27:72:13:0b:8e",
            "net1": "8a:d3:3d:6c:37:1f",
            "net10": "fa:90:5e:3f:ec:3e",
            "net11": "9e:b8:03:13:26:44",
            "net12": "f6:38:13:31:93:ed",
            "net13": "b6:18:89:b0:64:60",
            "net14": "fa:fd:e5:8d:eb:48",
            "net15": "26:ae:f1:eb:37:04",
            "net16": "92:ac:46:56:13:2c",
            "net17": "16:5c:e4:85:a4:a8",
            "net18": "46:02:6c:c8:9f:82",
            "net19": "fa:dc:7c:1e:5a:f5",
            "net2": "36:9b:e5:f5:43:d4",
            "net20": "fa:49:17:9f:3f:9b",
            "net21": "ae:51:7a:70:53:14",
            "net22": "5e:21:8c:e0:5b:55",
            "net23": "7a:52:df:c2:8e:04",
            "net24": "3e:be:e3:5a:9e:e8",
            "net25": "12:73:1c:b3:2b:6e",
            "net26": "46:9b:7b:c7:9b:7a",
            "net27": "a2:d2:ec:9c:a4:07",
            "net3": "5a:4d:65:f8:cd:8c",
            "net4": "2a:32:54:9b:b3:d9",
            "net5": "8e:91:1d:12:63:01",
            "net6": "d2:2e:58:b3:a1:57",
            "net7": "1a:33:de:16:26:a9",
            "net8": "e2:8a:08:dc:69:0f",
            "net9": "9e:a1:60:eb:78:8a"
        },
        "tof_1_2_2": {
            "net0": "8e:4e:89:5a:e3:a8",
            "net1": "c2:69:a0:5e:26:26",
            "net10": "6a:9f:25:cb:de:a0",
            "net11": "76:15:4b:61:dc:d1",
            "net12": "6a:e2:11:79:0b:91",
            "net13": "3e:47:66:f9:97:40",
            "net14": "a2:65:d5:b5:6b:ea",
            "net15": "ba:29:df:d2:75:ba",
            "net16": "8e:bc:64:da:72:62",
            "net17": "02:3d:66:5c:bc:09",
            "net18": "32:b9:8b:a4:10:75",
            "net19": "9e:83:a3:cd:47:82",
            "net2": "a2:95:22:66:ac:b7",
            "net20": "3a:67:ba:eb:5a:c4",
            "net21": "ae:c4:82:4a:f7:45",
            "net22": "5e:98:2a:0a:d3:e5",
            "net23": "9a:65:78:30:05:c2",
            "net24": "7a:11:8f:4c:8e:e0",
            "net25": "72:bd:6a:78:de:00",
            "net26": "f6:d5:b1:73:bd:70",
            "net27": "1e:7a:86:ee:6b:0b",
            "net3": "56:4d:ce:10:76:d3",
            "net4": "62:61:c6:e2:f5:d5",
            "net5": "fa:4b:c3:93:a5:f9",
            "net6": "26:d5:b8:33:5a:de",
            "net7": "a2:1c:1a:14:b5:f0",
            "net8": "f6:df:26:ff:ec:aa",
            "net9": "b6:67:86:8c:ef:0a"
        },
        "tof_1_2_3": {
            "net0": "ee:44:6d:b1:0d:77",
            "net1": "fe:4e:9f:f0:32:1d",
            "net10": "ca:34:26:a7:92:93",
            "net11": "72:f9:f1:70:7b:02",
            "net12": "02:cb:6d:19:77:6e",
            "net13": "46:c3:70:0a:28:b2",
            "net14": "72:c3:34:25:b3:f6",
            "net15": "ca:d0:bb:99:7b:2e",
            "net16": "a6:ab:1a:62:2e:6e",
            "net17": "6a:45:74:e9:8c:3d",
            "net18": "82:47:bb:f6:e5:fb",
            "net19": "22:1d:8e:9d:40:73",
            "net2": "ce:1b:38:6f:21:ae",
            "net20": "06:fb:a5:8b:87:d8",
            "net21": "72:d9:9e:e6:e5:ef",
            "net22": "56:90:89:f3:ce:94",
            "net23": "ce:48:75:83:b8:60",
            "net24": "02:ba:14:a4:c3:f2",
            "net25": "6a:0e:99:30:c0:1f",
            "net26": "46:5f:d9:a0:21:8a",
            "net27": "6a:ca:ce:1d:91:52",
            "net3": "6a:79:4a:de:06:35",
            "net4": "aa:e9:ce:be:d3:f3",
            "net5": "76:68:0c:00:44:8a",
            "net6": "5a:f8:4f:52:de:56",
            "net7": "d2:d0:1d:d4:d8:92",
            "net8": "3e:b5:0d:25:03:eb",
            "net9": "96:7d:08:02:0d:46"
        },
        "tof_1_2_4": {
            "net0": "a2:36:b4:2c:cd:ee",
            "net1": "86:47:2b:76:ad:f8",
            "net10": "5e:b2:b4:fa:f7:02",
            "net11": "0a:03:28:0a:17:66",
            "net12": "c2:bc:28:c2:23:74",
            "net13": "46:33:dd:bf:2b:f7",
            "net14": "42:92:71:b8:4b:b2",
            "net15": "6e:06:2c:b2:8b:1d",
            "net16": "5a:97:aa:52:68:4b",
            "net17": "fe:b2:11:61:fd:d6",
            "net18": "e2:7f:0e:94:d5:06",
            "net19": "4a:7a:f3:ef:b4:12",
            "net2": "fe:85:f5:3d:23:9c",
            "net20": "ce:d2:d5:cb:e1:cc",
            "net21": "32:c9:19:62:a5:0a",
            "net22": "aa:31:91:a4:7e:65",
            "net23": "2e:7d:51:5a:12:ea",
            "net24": "82:7a:01:2a:ca:2e",
            "net25": "46:9d:cc:7a:9d:a1",
            "net26": "8a:a4:90:74:b1:c2",
            "net27": "d2:03:29:d3:95:8d",
            "net3": "66:da:85:05:c4:cf",
            "net4": "32:19:73:01:0e:2a",
            "net5": "02:af:0a:3c:57:5d",
            "net6": "d2:47:c9:52:62:f3",
            "net7": "5a:3b:9b:ab:ef:35",
            "net8": "42:07:9f:56:93:fb",
            "net9": "fa:56:95:64:57:30"
        },
        "tof_1_2_5": {
            "net0": "ca:5d:67:6f:f7:0c",
            "net1": "7e:ee:de:bb:04:b1",
            "net10": "9e:d5:93:e6:28:bc",
            "net11": "66:78:66:a7:d0:e1",
            "net12": "fe:e3:dd:2d:27:8d",
            "net13": "e6:3a:98:db:e1:90",
            "net14": "d6:14:f7:ee:dd:83",
            "net15": "a6:57:08:7a:cc:5a",
            "net16": "16:a6:55:46:c5:34",
            "net17": "e2:74:d6:26:36:b6",
            "net18": "02:55:f2:5f:93:19",
            "net19": "1a:63:38:18:3c:4e",
            "net2": "da:e9:af:3c:1f:a9",
            "net20": "e6:a3:c3:35:f4:6e",
            "net21": "92:20:d0:15:7b:42",
            "net22": "5a:03:d9:dd:a2:1b",
            "net23": "c2:d9:4d:6f:e1:c0",
            "net24": "32:92:05:9d:77:ad",
            "net25": "a2:70:09:28:30:74",
            "net26": "16:2b:23:30:4f:39",
            "net27": "6e:e2:65:53:e4:f6",
            "net3": "96:6b:fb:2c:59:e2",
            "net4": "1e:1e:75:0d:12:bc",
            "net5": "4e:20:8a:5d:21:0a",
            "net6": "a2:f0:b8:1b:d8:b3",
            "net7": "e2:56:b3:59:e7:1d",
            "net8": "42:b2:61:3f:d1:40",
            "net9": "6a:8a:ab:ab:86:83"
        },
        "tof_1_2_6": {
            "net0": "c2:47:10:30:87:e5",
            "net1": "8a:1f:b7:aa:83:ad",
            "net10": "8e:85:db:ad:d0:c4",
            "net11": "92:90:03:f9:90:ac",
            "net12": "ce:a7:34:f3:73:a6",
            "net13": "76:9f:f4:69:3a:d8",
            "net14": "82:66:d8:15:02:03",
            "net15": "46:46:f1:fa:55:a6",
            "net16": "e2:68:65:d7:a1:a2",
            "net17": "6a:1f:8e:15:53:bf",
            "net18": "f6:38:56:43:ef:ef",
            "net19": "0a:8e:06:b8:dc:5b",
            "net2": "ae:a8:3a:22:e2:b0",
            "net20": "9a:82:37:0c:8c:74",
            "net21": "c2:d1:28:1b:e0:d0",
            "net22": "da:16:d6:28:05:ab",
            "net23": "0e:1f:f7:f3:b5:9d",
            "net24": "7e:12:76:b5:be:99",
            "net25": "2a:9d:d6:28:7e:72",
            "net26": "82:54:9c:ea:04:e3",
            "net27": "8e:11:77:5d:af:a4",
            "net3": "9a:0d:da:ca:45:a4",
            "net4": "ae:27:03:db:da:8e",
            "net5": "ea:48:c8:7a:a6:6b",
            "net6": "8e:3d:83:20:93:6c",
            "net7": "5a:92:4e:b2:e0:38",
            "net8": "a6:ff:bd:d3:c7:9f",
            "net9": "0a:c2:e5:4a:6f:79"
        },
        "tof_1_2_7": {
            "net0": "6e:d5:f3:58:97:b5",
            "net1": "9a:2b:0a:75:2c:7e",
            "net10": "86:cb:a3:01:f2:db",
            "net11": "42:12:84:ad:20:6e",
            "net12": "fe:83:33:b9:e8:81",
            "net13": "5e:13:54:b8:e7:70",
            "net14": "4e:2b:4a:49:cd:f3",
            "net15": "d2:bb:b1:1e:3f:3e",
            "net16": "be:92:1a:8d:2a:56",
            "net17": "e6:40:fc:a4:f0:f6",
            "net18": "76:4f:52:31:47:0a",
            "net19": "5e:45:7f:69:bf:a3",
            "net2": "2e:9c:71:a6:88:b0",
            "net20": "3e:44:a8:1c:d9:63",
            "net21": "ba:1e:fa:8e:96:2e",
            "net22": "f2:fd:b2:3d:82:df",
            "net23": "6e:13:65:47:65:9b",
            "net24": "4a:89:9f:e3:69:8a",
            "net25": "ae:7d:c9:b3:35:49",
            "net26": "0a:e5:bf:98:dd:7f",
            "net27": "c2:6f:34:10:e1:b7",
            "net3": "a2:d5:d9:5a:4a:d6",
            "net4": "be:ce:85:c8:56:34",
            "net5": "e6:0c:8d:8a:32:55",
            "net6": "96:af:11:dd:a3:e5",
            "net7": "66:58:ea:3d:38:79",
            "net8": "ae:b4:8e:a9:23:ed",
            "net9": "c6:32:d5:38:7e:c1"
        },
        "tof_1_2_8": {
            "net0": "a2:3a:44:58:60:1e",
            "net1": "16:28:39:6b:a1:b5",
            "net10": "9e:bf:81:b7:fd:bf",
            "net11": "de:62:de:ff:7e:3d",
            "net12": "5a:3b:c5:1c:a4:65",
            "net13": "ee:c0:94:27:f7:30",
            "net14": "0a:23:14:fd:1f:fa",
            "net15": "7a:1f:f4:65:e0:6c",
            "net16": "1e:7f:c9:41:a6:23",
            "net17": "de:39:36:b3:e7:ba",
            "net18": "42:d2:80:7c:2b:44",
            "net19": "ee:aa:71:9a:e5:98",
            "net2": "86:cf:69:75:b3:60",
            "net20": "d2:68:85:d4:79:34",
            "net21": "1e:a9:33:63:f8:a6",
            "net22": "82:28:c3:32:d0:85",
            "net23": "36:e5:60:a8:72:43",
            "net24": "12:38:6d:31:70:88",
            "net25": "de:dc:7f:59:65:59",
            "net26": "62:88:ba:d3:88:a0",
            "net27": "b2:3a:88:bf:80:62",
            "net3": "72:ae:2b:ff:81:b0",
            "net4": "4e:0c:e6:41:8b:18",
            "net5": "8a:39:cc:43:38:da",
            "net6": "4a:07:a2:bb:1c:0b",
            "net7": "5e:66:3c:ef:a0:d7",
            "net8": "de:5c:32:c0:7a:00",
            "net9": "d2:20:e1:85:4f:07"
        },
        "tof_1_2_9": {
            "net0": "0a:07:b2:b6:97:bb",
            "net1": "aa:aa:04:a7:33:9e",
            "net10": "fa:53:b3:91:57:bc",
            "net11": "76:ad:b1:c1:ee:9b",
            "net12": "4a:8e:1f:0e:8a:23",
            "net13": "6e:1e:31:78:2a:f8",
            "net14": "8e:da:cc:a2:6a:f2",
            "net15": "0a:37:3e:22:d7:90",
            "net16": "36:c2:0d:28:58:2d",
            "net17": "46:a6:0d:06:ca:d6",
            "net18": "ee:e3:57:21:a3:9e",
            "net19": "ba:4e:1b:b1:22:48",
            "net2": "82:e2:15:4e:fb:85",
            "net20": "ea:12:3f:d4:4e:8e",
            "net21": "2a:77:51:05:8f:54",
            "net22": "be:ce:74:e5:b5:62",
            "net23": "b6:74:71:77:d5:53",
            "net24": "e6:2b:c4:1d:ab:24",
            "net25": "9a:31:36:93:7e:b4",
            "net26": "f6:e3:ad:28:da:e7",
            "net27": "36:4e:c5:08:d6:b5",
            "net3": "ea:6b:5a:60:9e:7b",
            "net4": "ba:4e:21:70:df:dc",
            "net5": "ca:89:cf:a7:ed:cb",
            "net6": "92:e0:35:74:0f:dc",
            "net7": "ee:8b:b1:28:41:5c",
            "net8": "0a:3b:8e:4f:26:47",
            "net9": "ea:90:5f:c7:2d:f0"
        }
    },
    "failed_machine": "spine_1_1_1",
    "failure_time": {
        "leaf_1_0_1": 1636365848.1758623,
        "leaf_1_0_10": 1636365848.1900783,
        "leaf_1_0_11": 1636365848.1985013,
        "leaf_1_0_12": 1636365848.2149444,
        "leaf_1_0_13": 1636365848.3680148,
        "leaf_1_0_14": 1636365848.392429,
        "leaf_1_0_2": 1636365848.4257061,
        "leaf_1_0_3": 1636365848.437962,
        "leaf_1_0_4": 1636365848.452551,
        "leaf_1_0_5": 1636365848.1758716,
        "leaf_1_0_6": 1636365848.187636,
        "leaf_1_0_7": 1636365848.195817,
        "leaf_1_0_8": 1636365848.2142966,
        "leaf_1_0_9": 1636365848.297911,
        "leaf_2_0_1": 1636365848.3363838,
        "leaf_2_0_10": 1636365848.395022,
        "leaf_2_0_11": 1636365848.4270256,
        "leaf_2_0_12": 1636365848.449669,
        "leaf_2_0_13": 1636365848.4631004,
        "leaf_2_0_14": 1636365848.4798,
        "leaf_2_0_2": 1636365848.4883204,
        "leaf_2_0_3": 1636365848.500842,
        "leaf_2_0_4": 1636365848.6091883,
        "leaf_2_0_5": 1636365848.6504376,
        "leaf_2_0_6": 1636365848.6609702,
        "leaf_2_0_7": 1636365848.6709363,
        "leaf_2_0_8": 1636365848.6799319,
        "leaf_2_0_9": 1636365848.462756,
        "spine_1_1_1": 1636365848.4778929,
        "spine_1_1_10": 1636365848.4881926,
        "spine_1_1_11": 1636365848.4999568,
        "spine_1_1_12": 1636365848.6443663,
        "spine_1_1_13": 1636365848.6506484,
        "spine_1_1_14": 1636365848.6601074,
        "spine_1_1_2": 1636365848.6694758,
        "spine_1_1_3": 1636365848.679173,
        "spine_1_1_4": 1636365848.7282052,
        "spine_1_1_5": 1636365848.7948587,
        "spine_1_1_6": 1636365848.9062169,
        "spine_1_1_7": 1636365848.9188519,
        "spine_1_1_8": 1636365848.943197,
        "spine_1_1_9": 1636365848.9781547,
        "spine_2_1_1": 1636365849.0798576,
        "spine_2_1_10": 1636365849.1146066,
        "spine_2_1_11": 1636365849.1342554,
        "spine_2_1_12": 1636365848.9056427,
        "spine_2_1_13": 1636365848.9148946,
        "spine_2_1_14": 1636365848.9280787,
        "spine_2_1_2": 1636365848.945687,
        "spine_2_1_3": 1636365848.9781644,
        "spine_2_1_4": 1636365849.1061108,
        "spine_2_1_5": 1636365849.1314418,
        "spine_2_1_6": 1636365849.208109,
        "spine_2_1_7": 1636365849.3669395,
        "spine_2_1_8": 1636365849.3201077,
        "spine_2_1_9": 1636365849.369836,
        "tof_1_2_1": 1636365849.3793325,
        "tof_1_2_10": 1636365849.3892188,
        "tof_1_2_11": 1636365849.4479434,
        "tof_1_2_12": 1636365849.503548,
        "tof_1_2_13": 1636365849.6098878,
        "tof_1_2_14": 1636365849.6766126,
        "tof_1_2_2": 1636365849.6859953,
        "tof_1_2_3": 1636365849.3781643,
        "tof_1_2_4": 1636365849.3859963,
        "tof_1_2_5": 1636365849.4467704,
        "tof_1_2_6": 1636365849.5030692,
        "tof_1_2_7": 1636365849.6091952,
        "tof_1_2_8": 1636365849.6156535,
        "tof_1_2_9": 1636365849.6767292
    },
    "recover_time": {
        "leaf_1_0_1": 1636365960.242328,
        "leaf_1_0_10": 1636365960.2664592,
        "leaf_1_0_11": 1636365960.2957592,
        "leaf_1_0_12": 1636365960.3297894,
        "leaf_1_0_13": 1636365960.359051,
        "leaf_1_0_14": 1636365960.3671763,
        "leaf_1_0_2": 1636365960.3813832,
        "leaf_1_0_3": 1636365960.423018,
        "leaf_1_0_4": 1636365960.450965,
        "leaf_1_0_5": 1636365960.2445798,
        "leaf_1_0_6": 1636365960.2607243,
        "leaf_1_0_7": 1636365960.295946,
        "leaf_1_0_8": 1636365960.3300276,
        "leaf_1_0_9": 1636365960.3589828,
        "leaf_2_0_1": 1636365960.37145,
        "leaf_2_0_10": 1636365960.3817694,
        "leaf_2_0_11": 1636365960.423314,
        "leaf_2_0_12": 1636365960.4437094,
        "leaf_2_0_13": 1636365960.452842,
        "leaf_2_0_14": 1636365960.466624,
        "leaf_2_0_2": 1636365960.479285,
        "leaf_2_0_3": 1636365960.4901829,
        "leaf_2_0_4": 1636365960.5031667,
        "leaf_2_0_5": 1636365960.5416293,
        "leaf_2_0_6": 1636365960.598276,
        "leaf_2_0_7": 1636365960.6248505,
        "leaf_2_0_8": 1636365960.6393023,
        "leaf_2_0_9": 1636365960.4687123,
        "spine_1_1_10": 1636365960.4807196,
        "spine_1_1_11": 1636365960.491027,
        "spine_1_1_12": 1636365960.5009627,
        "spine_1_1_13": 1636365960.5415616,
        "spine_1_1_14": 1636365960.5977104,
        "spine_1_1_2": 1636365960.6208625,
        "spine_1_1_3": 1636365960.6319556,
        "spine_1_1_4": 1636365960.6550086,
        "spine_1_1_5": 1636365960.6546488,
        "spine_1_1_6": 1636365960.6696563,
        "spine_1_1_7": 1636365960.8443344,
        "spine_1_1_8": 1636365960.8914728,
        "spine_1_1_9": 1636365960.9041507,
        "spine_2_1_1": 1636365960.9310708,
        "spine_2_1_10": 1636365960.9386988,
        "spine_2_1_11": 1636365960.9525414,
        "spine_2_1_12": 1636365961.1295497,
        "spine_2_1_13": 1636365960.669642,
        "spine_2_1_14": 1636365960.6776927,
        "spine_2_1_2": 1636365960.7453601,
        "spine_2_1_3": 1636365960.9053497,
        "spine_2_1_4": 1636365960.9312215,
        "spine_2_1_5": 1636365960.9423048,
        "spine_2_1_6": 1636365960.9539244,
        "spine_2_1_7": 1636365961.124688,
        "spine_2_1_8": 1636365961.1378987,
        "spine_2_1_9": 1636365961.1397772,
        "tof_1_2_1": 1636365961.1537714,
        "tof_1_2_10": 1636365961.20463,
        "tof_1_2_11": 1636365961.2404833,
        "tof_1_2_12": 1636365961.2703815,
        "tof_1_2_13": 1636365961.3291214,
        "tof_1_2_14": 1636365961.3869402,
        "tof_1_2_2": 1636365961.4020479,
        "tof_1_2_3": 1636365961.4091518,
        "tof_1_2_4": 1636365961.1477187,
        "tof_1_2_5": 1636365961.1874082,
        "tof_1_2_6": 1636365961.2312553,
        "tof_1_2_7": 1636365961.242205,
        "tof_1_2_8": 1636365961.2591953,
        "tof_1_2_9": 1636365961.3193126,
        "spine_1_1_1": 1636365985.4592602
    }
}