{
    "k_leaf": 4,
    "k_top": 4,
    "redundancy_factor": 2,
    "is_k8s": true,
    "machine_mac_addresses": {
        "leaf_1_0_1": {
            "net0": "d2:9f:f9:cc:b1:57",
            "net1": "c6:db:5d:db:6b:74",
            "net2": "26:73:78:96:61:52",
            "net3": "66:3e:1c:70:f6:e3",
            "net4": "9e:9d:90:9d:4a:06"
        },
        "leaf_1_0_2": {
            "net0": "6a:3e:9a:01:db:ec",
            "net1": "4e:f1:b9:de:fb:e1",
            "net2": "b2:3e:4a:ed:86:6d",
            "net3": "a6:2d:5b:0c:ed:73",
            "net4": "f6:fd:36:51:38:c0"
        },
        "leaf_1_0_3": {
            "net0": "46:1e:08:64:20:c8",
            "net1": "b6:a3:17:20:e4:df",
            "net2": "52:fb:cd:f6:0f:39",
            "net3": "de:44:49:97:2e:86",
            "net4": "fe:05:34:5e:0d:7f"
        },
        "leaf_1_0_4": {
            "net0": "ea:bb:3c:46:d0:81",
            "net1": "fa:7b:aa:d1:52:fe",
            "net2": "92:0e:08:fe:1d:d9",
            "net3": "d2:c1:3a:ac:68:74",
            "net4": "72:ed:aa:a1:94:f1"
        },
        "leaf_2_0_1": {
            "net0": "aa:fa:bb:e9:ec:f2",
            "net1": "76:6d:f5:8a:fc:20",
            "net2": "f2:7b:0e:f0:6e:64",
            "net3": "c2:36:4c:eb:b3:58",
            "net4": "c6:45:5f:8a:0d:be"
        },
        "leaf_2_0_2": {
            "net0": "26:1a:72:eb:4f:91",
            "net1": "ba:14:ea:24:34:51",
            "net2": "ce:5c:7b:84:a1:ba",
            "net3": "16:16:40:7b:e3:0c",
            "net4": "26:9f:f7:4b:bb:b9"
        },
        "leaf_2_0_3": {
            "net0": "c6:40:be:98:2e:8e",
            "net1": "ce:40:89:04:ad:4b",
            "net2": "e2:af:dc:68:84:37",
            "net3": "7a:39:d1:d9:45:8d",
            "net4": "7a:77:a6:e1:cf:84"
        },
        "leaf_2_0_4": {
            "net0": "ca:a1:f3:6b:c2:c5",
            "net1": "ee:bc:d1:2a:c6:36",
            "net2": "a6:56:1b:80:ba:24",
            "net3": "ba:fb:46:3c:79:84",
            "net4": "9a:8e:07:9a:16:76"
        },
        "leaf_3_0_1": {
            "net0": "06:6e:77:15:19:07",
            "net1": "22:af:52:4c:53:4c",
            "net2": "e2:bf:e3:83:1c:92",
            "net3": "42:0e:98:63:d2:05",
            "net4": "a6:94:34:d5:0b:9e"
        },
        "leaf_3_0_2": {
            "net0": "76:82:bb:76:fa:98",
            "net1": "6e:29:76:1b:cf:7d",
            "net2": "26:cd:5a:99:e9:9d",
            "net3": "3a:f6:d8:f5:3e:a9",
            "net4": "5a:4c:8a:db:d0:69"
        },
        "leaf_3_0_3": {
            "net0": "fe:18:60:8b:7e:b7",
            "net1": "ee:37:e8:62:1c:df",
            "net2": "82:a3:12:98:8a:1f",
            "net3": "e2:3b:7c:2f:f3:c1",
            "net4": "66:da:1b:51:d0:7e"
        },
        "leaf_3_0_4": {
            "net0": "e6:15:f5:cd:19:2c",
            "net1": "66:4d:88:32:af:3c",
            "net2": "86:3c:14:5d:5e:56",
            "net3": "96:af:da:d3:00:4f",
            "net4": "ca:91:3c:a4:52:c7"
        },
        "leaf_4_0_1": {
            "net0": "f6:5a:88:23:62:a8",
            "net1": "0a:4e:06:d3:61:ce",
            "net2": "da:e7:2f:fc:66:9d",
            "net3": "3e:eb:57:ee:54:26",
            "net4": "5e:b4:57:e0:5e:0d"
        },
        "leaf_4_0_2": {
            "net0": "a2:3a:0a:f0:99:60",
            "net1": "6e:27:5c:60:e8:28",
            "net2": "f6:6e:50:0d:9a:e9",
            "net3": "f2:f5:da:95:3e:24",
            "net4": "56:03:4d:b5:10:1d"
        },
        "leaf_4_0_3": {
            "net0": "3a:6d:00:5f:6b:f0",
            "net1": "7e:b8:ff:82:ae:6f",
            "net2": "76:07:e9:14:25:e0",
            "net3": "62:5a:50:0d:bc:87",
            "net4": "e6:71:24:15:75:c2"
        },
        "leaf_4_0_4": {
            "net0": "2a:ff:64:2a:35:74",
            "net1": "9a:0f:5a:28:16:95",
            "net2": "e2:e1:b5:48:d2:b6",
            "net3": "f2:4e:62:a2:70:1e",
            "net4": "b2:7b:9b:9f:ec:42"
        },
        "spine_1_1_1": {
            "net0": "7a:05:10:54:aa:34",
            "net1": "06:d9:5e:1b:d8:b1",
            "net2": "02:f2:0b:f5:ad:47",
            "net3": "0e:41:36:6a:61:14",
            "net4": "56:49:23:04:b5:e2",
            "net5": "a2:ef:d3:f9:ac:e3",
            "net6": "d2:b6:7c:0c:ee:f4",
            "net7": "c6:43:e0:7e:51:fd"
        },
        "spine_1_1_2": {
            "net0": "26:d2:5d:e8:c0:69",
            "net1": "7e:fc:57:fd:9a:82",
            "net2": "3e:a9:34:0d:1d:48",
            "net3": "02:fd:fc:eb:7e:be",
            "net4": "46:0f:c8:11:9a:02",
            "net5": "16:89:1c:71:c7:43",
            "net6": "f6:02:e8:c7:6e:ab",
            "net7": "7a:8d:19:ed:07:6e"
        },
        "spine_1_1_3": {
            "net0": "96:4d:43:2c:a8:6e",
            "net1": "0a:09:5a:a8:73:a6",
            "net2": "de:9d:a7:8a:3e:70",
            "net3": "3a:4a:c8:d9:a3:0c",
            "net4": "92:2a:eb:fe:68:a7",
            "net5": "d2:90:73:35:15:b3",
            "net6": "ee:38:32:42:09:7c",
            "net7": "2a:0b:c5:0d:ff:1c"
        },
        "spine_1_1_4": {
            "net0": "3a:5f:1c:d9:de:28",
            "net1": "fe:4e:4c:29:ee:b8",
            "net2": "ee:7a:96:f9:62:0a",
            "net3": "7e:b8:93:6a:e2:26",
            "net4": "d6:cc:34:50:96:a6",
            "net5": "5e:cf:c1:05:3e:d4",
            "net6": "36:83:fb:31:e7:b4",
            "net7": "3a:b8:a3:3c:00:21"
        },
        "spine_2_1_1": {
            "net0": "8a:f6:cc:e5:e6:ae",
            "net1": "aa:e4:52:80:e0:ee",
            "net2": "9a:a9:bd:1b:1c:a0",
            "net3": "36:42:55:9a:6d:4c",
            "net4": "ce:d2:3e:30:9c:55",
            "net5": "0a:92:97:e5:37:9f",
            "net6": "7e:e5:d6:6f:b4:48",
            "net7": "6e:f6:28:38:9d:64"
        },
        "spine_2_1_2": {
            "net0": "7a:13:a5:02:d9:3e",
            "net1": "46:d6:f9:23:a9:d9",
            "net2": "4a:30:02:de:ba:7e",
            "net3": "82:1f:38:f8:8e:ac",
            "net4": "26:ad:5e:7f:6b:4e",
            "net5": "42:0f:f5:29:7d:1a",
            "net6": "1e:ca:2e:d9:ac:3f",
            "net7": "ba:9c:37:80:79:ee"
        },
        "spine_2_1_3": {
            "net0": "82:2b:93:f1:42:d8",
            "net1": "26:79:f2:54:e2:88",
            "net2": "ae:36:66:ac:67:22",
            "net3": "d6:5d:78:12:71:ab",
            "net4": "6e:59:61:5d:2e:4d",
            "net5": "96:d7:c0:86:b6:c1",
            "net6": "c2:03:3e:20:bc:fd",
            "net7": "06:a8:dd:9b:b3:0a"
        },
        "spine_2_1_4": {
            "net0": "6a:15:dd:6b:66:07",
            "net1": "2a:b5:3b:dd:1b:84",
            "net2": "e2:92:a9:0d:fe:58",
            "net3": "52:fa:5d:2f:7b:68",
            "net4": "52:99:20:93:0a:e6",
            "net5": "52:f3:2d:c9:22:34",
            "net6": "8a:17:61:c8:3b:ba",
            "net7": "be:81:72:b3:ee:ba"
        },
        "spine_3_1_1": {
            "net0": "06:87:40:2f:88:49",
            "net1": "2e:46:ea:89:bf:bd",
            "net2": "36:cc:26:a3:56:8f",
            "net3": "8e:d1:07:22:ef:cc",
            "net4": "6a:39:f0:03:0b:e5",
            "net5": "4e:55:58:d4:08:c5",
            "net6": "26:1a:e5:db:85:3e",
            "net7": "16:35:38:6e:6c:47"
        },
        "spine_3_1_2": {
            "net0": "ea:55:8a:10:87:c2",
            "net1": "0a:15:59:18:f4:c0",
            "net2": "86:75:10:e9:1c:18",
            "net3": "22:1a:83:a4:ad:ff",
            "net4": "4e:1d:79:31:b9:b4",
            "net5": "0e:ed:94:fe:84:fe",
            "net6": "4a:84:43:4c:8a:3f",
            "net7": "ea:06:dd:db:05:36"
        },
        "spine_3_1_3": {
            "net0": "b6:c5:76:8d:ff:8f",
            "net1": "06:e0:a8:b0:42:3f",
            "net2": "0a:14:2c:75:79:4a",
            "net3": "82:22:57:85:ec:e5",
            "net4": "ba:2d:18:08:91:6d",
            "net5": "fa:6b:b3:4b:06:2a",
            "net6": "fe:42:a8:54:44:93",
            "net7": "ea:a3:69:60:1e:08"
        },
        "spine_3_1_4": {
            "net0": "86:8c:24:2f:00:b3",
            "net1": "7e:03:cd:76:15:08",
            "net2": "7a:57:b8:e6:ee:c8",
            "net3": "76:aa:ae:43:f4:b3",
            "net4": "ea:49:ed:42:66:df",
            "net5": "d6:1b:69:ff:ca:67",
            "net6": "26:4a:9c:13:cd:48",
            "net7": "12:f3:68:48:0d:3e"
        },
        "spine_4_1_1": {
            "net0": "fe:2f:4d:a1:aa:be",
            "net1": "2a:e3:89:97:99:2e",
            "net2": "42:a5:20:06:8a:6f",
            "net3": "76:0a:fc:43:5f:a6",
            "net4": "46:b4:b1:26:12:c0",
            "net5": "42:8b:37:7e:52:32",
            "net6": "ee:e2:1c:49:41:c0",
            "net7": "a6:d6:a6:d8:1a:20"
        },
        "spine_4_1_2": {
            "net0": "ce:dc:2b:14:d3:ca",
            "net1": "0e:37:5b:35:e2:ac",
            "net2": "9e:78:e6:e9:e2:70",
            "net3": "66:de:e2:ed:ba:5f",
            "net4": "6a:76:40:11:3f:d8",
            "net5": "f6:95:ea:26:b5:1b",
            "net6": "ce:fa:da:f4:29:35",
            "net7": "de:11:41:87:72:4e"
        },
        "spine_4_1_3": {
            "net0": "62:55:52:29:dd:f1",
            "net1": "62:0a:49:04:0d:bb",
            "net2": "c2:1d:49:93:7e:e5",
            "net3": "22:1f:f9:37:26:1f",
            "net4": "a2:0e:fa:e5:47:91",
            "net5": "ae:70:d0:e4:cd:67",
            "net6": "92:89:d0:f8:67:d4",
            "net7": "2a:5d:ba:a5:e6:f7"
        },
        "spine_4_1_4": {
            "net0": "b2:f6:bd:7f:8d:bc",
            "net1": "6e:e6:ed:97:19:28",
            "net2": "6e:fb:5e:83:34:a5",
            "net3": "82:f1:b4:b0:9d:2e",
            "net4": "de:12:f9:41:b2:86",
            "net5": "ee:73:23:cf:b4:ff",
            "net6": "0a:df:94:06:36:f2",
            "net7": "7a:53:3f:e7:e0:74"
        },
        "tof_1_2_1": {
            "net0": "96:da:73:30:0d:90",
            "net1": "5a:a4:84:ee:4e:9b",
            "net2": "5a:8c:21:f0:f8:85",
            "net3": "06:9a:f6:62:a1:2a",
            "net4": "b2:73:ac:4b:0b:40",
            "net5": "3a:f6:a6:f1:aa:11",
            "net6": "ae:d2:46:ca:df:64",
            "net7": "9e:2c:7a:10:8e:01"
        },
        "tof_1_2_2": {
            "net0": "a2:db:ab:52:d1:63",
            "net1": "f6:46:06:0b:97:9f",
            "net2": "ca:f3:11:35:75:7c",
            "net3": "66:69:58:a8:ee:d8",
            "net4": "5e:6f:e9:a7:ef:58",
            "net5": "8e:36:c3:d4:06:eb",
            "net6": "2e:ae:77:32:9d:4d",
            "net7": "0a:f5:cc:43:2a:e2"
        },
        "tof_1_2_3": {
            "net0": "1a:64:f9:c0:bb:b6",
            "net1": "2e:e6:2b:7a:d2:68",
            "net2": "26:fc:04:f0:f9:d9",
            "net3": "2e:60:e6:45:b0:fc",
            "net4": "4a:f5:1c:52:24:e9",
            "net5": "d6:5d:5b:99:fd:aa",
            "net6": "aa:f6:ba:0f:ac:7c",
            "net7": "b2:68:69:d2:53:7f"
        },
        "tof_1_2_4": {
            "net0": "be:cf:15:61:b4:7c",
            "net1": "66:05:b5:ba:5c:de",
            "net2": "32:18:4a:a9:1c:e0",
            "net3": "de:68:35:b2:0a:f9",
            "net4": "2a:9b:8a:b8:57:62",
            "net5": "6a:de:e3:e1:20:12",
            "net6": "36:f5:dc:be:8a:51",
            "net7": "ee:13:39:b7:d2:ee"
        },
        "tof_2_2_1": {
            "net0": "f6:2c:52:f5:68:4b",
            "net1": "12:a1:84:fd:89:be",
            "net2": "ae:16:45:f2:e6:b6",
            "net3": "b2:f4:62:b5:89:da",
            "net4": "9a:00:c5:b4:4f:4e",
            "net5": "5a:f5:a3:69:bd:45",
            "net6": "de:05:a9:16:99:2a",
            "net7": "f6:5c:ad:49:85:d1"
        },
        "tof_2_2_2": {
            "net0": "66:95:c2:1d:cb:c9",
            "net1": "2e:20:0a:50:41:fe",
            "net2": "7e:ab:0a:32:6e:37",
            "net3": "d6:91:ba:c7:8d:bf",
            "net4": "1a:81:ad:74:8d:8d",
            "net5": "0a:ea:d0:84:d3:8f",
            "net6": "a6:4d:24:c5:56:87",
            "net7": "86:99:7e:30:ae:be"
        },
        "tof_2_2_3": {
            "net0": "be:dd:08:6f:6b:f9",
            "net1": "22:08:9e:1f:db:06",
            "net2": "de:e0:07:2d:d0:fe",
            "net3": "52:13:59:fb:bc:15",
            "net4": "a6:ff:ea:bf:d1:8c",
            "net5": "d2:33:d6:87:6d:ec",
            "net6": "fe:d7:24:74:d7:87",
            "net7": "46:64:c6:d7:84:7b"
        },
        "tof_2_2_4": {
            "net0": "72:43:fd:c5:88:f6",
            "net1": "ce:d2:e5:ff:fa:95",
            "net2": "96:55:a7:50:e3:5c",
            "net3": "c2:60:1c:5a:f0:02",
            "net4": "c6:93:99:1f:1e:b6",
            "net5": "d6:06:a1:a6:58:b3",
            "net6": "32:88:74:65:95:44",
            "net7": "02:3f:06:66:5b:04"
        }
    },
    "failed_machine": "tof_1_2_1",
    "failure_time": {
        "leaf_1_0_1": 1636461604.3245962,
        "leaf_1_0_2": 1636461605.3342,
        "leaf_1_0_3": 1636461605.3479912,
        "leaf_1_0_4": 1636461604.3605971,
        "leaf_2_0_1": 1636461605.367792,
        "leaf_2_0_2": 1636461604.3227348,
        "leaf_2_0_3": 1636461604.3357062,
        "leaf_2_0_4": 1636461604.3494415,
        "leaf_3_0_1": 1636461604.3594291,
        "leaf_3_0_2": 1636461604.3673794,
        "leaf_3_0_3": 1636461604.3776207,
        "leaf_3_0_4": 1636461604.3856826,
        "leaf_4_0_1": 1636461605.3948705,
        "leaf_4_0_2": 1636461604.4119663,
        "leaf_4_0_3": 1636461604.4191253,
        "leaf_4_0_4": 1636461604.3781676,
        "spine_1_1_1": 1636461604.387291,
        "spine_1_1_2": 1636461604.3990662,
        "spine_1_1_3": 1636461604.4119995,
        "spine_1_1_4": 1636461604.4205027,
        "spine_2_1_1": 1636461604.4270897,
        "spine_2_1_2": 1636461604.435948,
        "spine_2_1_3": 1636461604.443521,
        "spine_2_1_4": 1636461604.4509757,
        "spine_3_1_1": 1636461604.457337,
        "spine_3_1_2": 1636461604.432817,
        "spine_3_1_3": 1636461604.4403176,
        "spine_3_1_4": 1636461605.4459853,
        "spine_4_1_1": 1636461604.4564152,
        "spine_4_1_2": 1636461604.4639192,
        "spine_4_1_3": 1636461604.4666727,
        "spine_4_1_4": 1636461604.4769726,
        "tof_1_2_1": 1636461604.4941602,
        "tof_1_2_2": 1636461604.5038023,
        "tof_1_2_3": 1636461604.5160487,
        "tof_1_2_4": 1636461605.473782,
        "tof_2_2_1": 1636461604.4919815,
        "tof_2_2_2": 1636461604.500291,
        "tof_2_2_3": 1636461604.509544,
        "tof_2_2_4": 1636461604.5238264
    },
    "recover_time": {
        "leaf_1_0_1": 1636461656.3255293,
        "leaf_1_0_2": 1636461657.3371077,
        "leaf_1_0_3": 1636461657.3474674,
        "leaf_1_0_4": 1636461656.3685935,
        "leaf_2_0_1": 1636461657.3786018,
        "leaf_2_0_2": 1636461656.3285146,
        "leaf_2_0_3": 1636461656.3452177,
        "leaf_2_0_4": 1636461656.3548267,
        "leaf_3_0_1": 1636461656.3693948,
        "leaf_3_0_2": 1636461656.380824,
        "leaf_3_0_3": 1636461656.3990936,
        "leaf_3_0_4": 1636461656.422565,
        "leaf_4_0_1": 1636461657.44571,
        "leaf_4_0_2": 1636461656.4593089,
        "leaf_4_0_3": 1636461656.4814973,
        "leaf_4_0_4": 1636461656.395749,
        "spine_1_1_1": 1636461656.4068375,
        "spine_1_1_2": 1636461656.4195442,
        "spine_1_1_3": 1636461656.4284797,
        "spine_1_1_4": 1636461656.4465556,
        "spine_2_1_1": 1636461656.457747,
        "spine_2_1_2": 1636461656.4839606,
        "spine_2_1_3": 1636461656.4944944,
        "spine_2_1_4": 1636461656.5074413,
        "spine_3_1_1": 1636461656.5179803,
        "spine_3_1_2": 1636461656.4909155,
        "spine_3_1_3": 1636461656.5018349,
        "spine_3_1_4": 1636461657.5103016,
        "spine_4_1_1": 1636461656.5244188,
        "spine_4_1_2": 1636461656.539574,
        "spine_4_1_3": 1636461656.5401254,
        "spine_4_1_4": 1636461656.5515022,
        "tof_1_2_2": 1636461656.5598834,
        "tof_1_2_3": 1636461656.5804322,
        "tof_1_2_4": 1636461657.5877478,
        "tof_2_2_1": 1636461656.5580108,
        "tof_2_2_2": 1636461656.5689783,
        "tof_2_2_3": 1636461656.5823474,
        "tof_2_2_4": 1636461656.595376,
        "tof_1_2_1": 1636461673.8838038
    }
}