{
    "k_leaf": 4,
    "k_top": 4,
    "redundancy_factor": 4,
    "is_k8s": true,
    "machine_mac_addresses": {
        "leaf_1_0_1": {
            "net0": "9a:8b:33:46:cf:ce",
            "net1": "ee:34:6d:4a:62:c9",
            "net2": "fa:ba:a6:f9:34:a5",
            "net3": "d2:45:a2:fa:d9:83",
            "net4": "c6:45:21:19:a1:d9"
        },
        "leaf_1_0_2": {
            "net0": "4a:48:02:3d:c0:b8",
            "net1": "7a:71:09:93:dc:b3",
            "net2": "a6:1e:17:3a:0f:6f",
            "net3": "4a:e1:83:d3:2f:8c",
            "net4": "fe:8c:cb:f1:09:2f"
        },
        "leaf_1_0_3": {
            "net0": "a6:ee:a3:60:72:ac",
            "net1": "72:1c:63:c8:54:c7",
            "net2": "6a:a8:a2:14:66:e2",
            "net3": "42:b1:32:e2:83:b7",
            "net4": "7a:d4:53:34:96:3a"
        },
        "leaf_1_0_4": {
            "net0": "ba:65:71:a2:94:23",
            "net1": "16:e2:a3:e6:94:02",
            "net2": "0a:ac:5e:b2:13:3d",
            "net3": "b2:82:3b:5b:7b:43",
            "net4": "6e:d5:ce:85:fe:76"
        },
        "leaf_2_0_1": {
            "net0": "1a:28:6e:cf:24:ef",
            "net1": "fa:3f:9c:b4:8d:6d",
            "net2": "96:72:b7:6d:b8:31",
            "net3": "e6:1d:83:64:6e:be",
            "net4": "ea:3f:bd:02:23:84"
        },
        "leaf_2_0_2": {
            "net0": "86:f6:fe:5c:95:86",
            "net1": "3e:08:42:83:36:22",
            "net2": "0e:cd:38:64:d2:d4",
            "net3": "a2:c6:b7:c0:d7:83",
            "net4": "be:71:1f:63:19:b3"
        },
        "leaf_2_0_3": {
            "net0": "7e:67:32:ab:bf:4a",
            "net1": "82:10:01:e0:2b:dc",
            "net2": "ce:7a:4c:c1:2f:d8",
            "net3": "4e:e4:81:e4:d3:2c",
            "net4": "0e:d4:b0:e0:36:15"
        },
        "leaf_2_0_4": {
            "net0": "7a:9b:4e:f8:43:b2",
            "net1": "ba:9c:cf:d5:81:6c",
            "net2": "d6:86:00:d0:eb:0d",
            "net3": "e6:8a:ea:ac:1f:c8",
            "net4": "d6:b4:71:d7:77:73"
        },
        "spine_1_1_1": {
            "net0": "b6:ae:b6:61:03:f7",
            "net1": "6e:da:0e:48:a2:c8",
            "net2": "ba:cc:c4:59:99:3d",
            "net3": "8a:5b:33:94:0a:b1",
            "net4": "d2:09:d3:02:07:33",
            "net5": "2e:7c:e2:53:8b:05",
            "net6": "86:7d:f8:c1:04:9f",
            "net7": "12:6f:e6:7a:cd:87"
        },
        "spine_1_1_2": {
            "net0": "86:59:54:cd:92:f3",
            "net1": "72:16:0b:9f:1e:79",
            "net2": "92:9e:cc:75:ce:1c",
            "net3": "42:f5:36:5d:4d:2b",
            "net4": "7a:b2:25:f5:30:c9",
            "net5": "72:1a:4c:f3:d1:46",
            "net6": "1a:9d:e4:f0:01:39",
            "net7": "ce:4c:9d:45:35:02"
        },
        "spine_1_1_3": {
            "net0": "1a:80:05:80:e0:02",
            "net1": "06:25:7d:6d:6f:0b",
            "net2": "2a:62:6e:64:92:2b",
            "net3": "0e:0a:2e:40:e2:34",
            "net4": "3a:40:1a:eb:7a:5f",
            "net5": "a2:82:cf:40:3c:bd",
            "net6": "7a:0f:9e:37:f7:d6",
            "net7": "96:4b:c4:ec:18:72"
        },
        "spine_1_1_4": {
            "net0": "5a:cb:bb:48:61:5b",
            "net1": "42:67:20:d5:24:0e",
            "net2": "b6:37:64:88:57:05",
            "net3": "5a:bc:97:76:de:5a",
            "net4": "e6:3a:f1:c6:0b:16",
            "net5": "c2:56:4e:23:19:b2",
            "net6": "de:89:c5:37:de:05",
            "net7": "6e:7c:1d:bc:eb:f7"
        },
        "spine_2_1_1": {
            "net0": "4a:d3:54:bd:55:1c",
            "net1": "5e:fd:03:1d:ca:8a",
            "net2": "b6:22:13:12:40:d6",
            "net3": "5a:ab:a8:55:4d:99",
            "net4": "a2:b3:f0:fd:c1:9e",
            "net5": "ca:f2:db:0d:63:c8",
            "net6": "b6:1e:f1:c2:21:9d",
            "net7": "ca:e1:e5:e3:39:da"
        },
        "spine_2_1_2": {
            "net0": "ee:ed:cc:a0:62:6f",
            "net1": "4e:6b:64:97:7c:f2",
            "net2": "96:25:d7:7c:6f:8f",
            "net3": "96:6d:28:17:5d:78",
            "net4": "ca:ce:2b:8b:66:93",
            "net5": "12:90:75:93:11:d7",
            "net6": "6e:cf:66:ba:be:ee",
            "net7": "86:72:15:eb:3c:d8"
        },
        "spine_2_1_3": {
            "net0": "12:06:2b:72:c3:d0",
            "net1": "c2:8a:c4:a7:2f:ba",
            "net2": "52:79:23:4c:da:2f",
            "net3": "c6:12:a2:2f:a5:0d",
            "net4": "a2:f1:0b:e8:19:d2",
            "net5": "ce:f5:34:68:05:13",
            "net6": "82:4f:f4:16:4a:a8",
            "net7": "0a:72:0b:0b:df:9e"
        },
        "spine_2_1_4": {
            "net0": "2e:20:50:35:5e:e5",
            "net1": "86:09:a0:9a:4f:ce",
            "net2": "aa:a7:2a:8c:1d:0a",
            "net3": "8a:23:1e:d5:40:06",
            "net4": "72:bf:6d:7a:e4:6e",
            "net5": "a6:bc:c0:e2:21:a7",
            "net6": "b6:74:49:44:72:4f",
            "net7": "a2:f2:32:48:7e:f8"
        },
        "tof_1_2_1": {
            "net0": "ae:4b:ca:06:cd:74",
            "net1": "aa:5e:ed:0a:94:71",
            "net2": "32:0b:6e:97:4d:da",
            "net3": "9e:13:83:71:26:af",
            "net4": "f2:f1:72:34:45:09",
            "net5": "16:ce:24:bf:79:8a",
            "net6": "56:aa:d7:85:1c:33",
            "net7": "0a:35:6c:25:89:bd"
        },
        "tof_1_2_2": {
            "net0": "62:42:70:60:81:7e",
            "net1": "86:e0:bc:59:03:58",
            "net2": "9a:69:e6:5d:e2:31",
            "net3": "02:1a:9d:8e:1a:65",
            "net4": "9e:8c:c4:9b:19:4c",
            "net5": "f2:b7:9c:2f:8f:5d",
            "net6": "d2:88:ac:34:76:15",
            "net7": "96:06:d3:6c:3e:0c"
        },
        "tof_1_2_3": {
            "net0": "e6:a2:07:42:7f:e3",
            "net1": "0a:0b:6a:93:35:85",
            "net2": "6e:d0:84:43:cd:be",
            "net3": "de:18:9e:84:80:e0",
            "net4": "4e:aa:6c:de:8a:38",
            "net5": "4a:9e:b4:8e:8a:94",
            "net6": "06:f3:67:e0:c6:a5",
            "net7": "12:b7:10:a2:83:03"
        },
        "tof_1_2_4": {
            "net0": "ba:ef:06:6c:8f:35",
            "net1": "62:7e:03:80:82:04",
            "net2": "de:a7:2b:a7:ee:d5",
            "net3": "7a:e8:77:de:b4:c9",
            "net4": "0a:7b:ca:54:d3:62",
            "net5": "ce:6d:6b:30:10:4b",
            "net6": "4e:23:1e:a8:58:a8",
            "net7": "32:1f:59:34:1e:be"
        }
    },
    "failed_machine": "leaf_1_0_1",
    "failure_time": {
        "leaf_1_0_1": 1622752507.940421,
        "leaf_1_0_2": 1622752507.9515312,
        "leaf_1_0_3": 1622752507.9605474,
        "leaf_1_0_4": 1622752507.9437237,
        "leaf_2_0_1": 1622752507.9556608,
        "leaf_2_0_2": 1622752507.964339,
        "leaf_2_0_3": 1622752507.9677114,
        "leaf_2_0_4": 1622752507.9774153,
        "spine_1_1_1": 1622752507.9880717,
        "spine_1_1_2": 1622752507.9740455,
        "spine_1_1_3": 1622752507.9785833,
        "spine_1_1_4": 1622752507.9891734,
        "spine_2_1_1": 1622752507.9986067,
        "spine_2_1_2": 1622752508.0055532,
        "spine_2_1_3": 1622752508.0148504,
        "spine_2_1_4": 1622752508.002647,
        "tof_1_2_1": 1622752508.0108442,
        "tof_1_2_2": 1622752508.0209603,
        "tof_1_2_3": 1622752508.024489,
        "tof_1_2_4": 1622752508.0343895
    }
}