{
    "k_leaf": 4,
    "k_top": 4,
    "redundancy_factor": 4,
    "is_k8s": false,
    "machine_mac_addresses": {
        "leaf_1_0_1": {
            "eth0": "26:87:95:5a:f8:78",
            "eth1": "ee:0e:79:0e:d0:30",
            "eth2": "6a:26:0e:1f:6f:af",
            "eth3": "5e:07:8e:91:c8:87",
            "eth4": "5e:02:3d:c5:db:6c"
        },
        "leaf_1_0_2": {
            "eth0": "c6:c5:bb:cc:a2:42",
            "eth1": "36:60:3c:5c:74:8d",
            "eth2": "22:8b:5f:7b:de:eb",
            "eth3": "42:df:9c:69:b7:8c",
            "eth4": "12:bf:6f:a5:9b:8f"
        },
        "leaf_1_0_3": {
            "eth0": "c2:f6:9f:75:34:eb",
            "eth1": "1a:b6:6f:b2:89:8f",
            "eth2": "32:6c:03:e8:8a:5c",
            "eth3": "3e:64:60:c7:a8:ed",
            "eth4": "4a:6d:6f:b4:0d:9f"
        },
        "leaf_1_0_4": {
            "eth0": "82:87:b5:1c:44:50",
            "eth1": "f2:3d:da:a7:c5:31",
            "eth2": "1e:85:32:f5:cd:a8",
            "eth3": "de:38:c6:f8:ba:43",
            "eth4": "72:eb:b6:3d:db:66"
        },
        "leaf_2_0_1": {
            "eth0": "ce:55:aa:a4:6d:07",
            "eth1": "aa:cd:37:86:0a:2e",
            "eth2": "72:09:e9:a6:60:db",
            "eth3": "b2:18:9c:98:82:d2",
            "eth4": "2a:7b:3e:a9:9a:84"
        },
        "leaf_2_0_2": {
            "eth0": "26:29:63:ae:6b:27",
            "eth1": "42:d0:f6:bf:ba:86",
            "eth2": "86:36:c0:36:ca:7f",
            "eth3": "52:d6:be:fc:dc:b3",
            "eth4": "96:88:c7:7e:c1:89"
        },
        "leaf_2_0_3": {
            "eth0": "2a:d2:7e:de:1c:29",
            "eth1": "ae:14:64:56:86:19",
            "eth2": "a6:2d:fd:33:cc:4c",
            "eth3": "9e:14:cb:07:56:99",
            "eth4": "e2:5f:ff:42:0f:7b"
        },
        "leaf_2_0_4": {
            "eth0": "b2:b4:33:cb:2e:c2",
            "eth1": "86:26:f4:c6:3c:20",
            "eth2": "32:32:bb:f2:75:6f",
            "eth3": "fe:aa:2a:96:1d:62",
            "eth4": "2e:7e:2d:b2:73:9f"
        },
        "spine_1_1_1": {
            "eth0": "1a:14:8b:fb:c9:f3",
            "eth1": "96:11:7f:4b:31:a3",
            "eth2": "92:46:d2:02:13:56",
            "eth3": "56:63:0c:0b:17:e7",
            "eth4": "1a:1b:4a:a8:2f:ef",
            "eth5": "6e:33:23:63:83:de",
            "eth6": "82:58:38:f0:59:d7",
            "eth7": "22:c7:5f:0f:ed:a3"
        },
        "spine_1_1_2": {
            "eth0": "aa:aa:49:21:56:b7",
            "eth1": "16:d9:3e:39:1a:98",
            "eth2": "d2:39:6f:7d:d7:7e",
            "eth3": "be:c0:f5:89:5d:48",
            "eth4": "5e:07:53:74:fe:3f",
            "eth5": "de:53:cc:79:8d:a3",
            "eth6": "0e:85:2b:da:11:d1",
            "eth7": "5e:0b:ab:10:53:19"
        },
        "spine_1_1_3": {
            "eth0": "d2:f8:f5:60:20:73",
            "eth1": "2a:1c:38:5e:5e:48",
            "eth2": "72:63:42:2d:cf:4a",
            "eth3": "46:0c:f7:0a:5f:19",
            "eth4": "7a:e3:d5:10:8b:0b",
            "eth5": "72:3f:c6:31:6a:91",
            "eth6": "0e:3d:b4:67:c8:ad",
            "eth7": "fa:05:6f:08:3a:c6"
        },
        "spine_1_1_4": {
            "eth0": "7a:81:c1:c1:33:be",
            "eth1": "fe:2e:61:36:75:14",
            "eth2": "ca:47:72:01:a6:04",
            "eth3": "f6:31:90:dc:68:79",
            "eth4": "d2:be:3a:23:0b:0e",
            "eth5": "32:30:98:8c:b5:f8",
            "eth6": "86:a7:ec:ab:89:5f",
            "eth7": "ce:26:79:51:29:11"
        },
        "spine_2_1_1": {
            "eth0": "82:d6:9f:ae:8e:9c",
            "eth1": "5e:5d:7e:d3:26:1a",
            "eth2": "c2:4a:99:ae:5e:95",
            "eth3": "26:96:7a:d8:37:ad",
            "eth4": "aa:37:65:06:bd:2c",
            "eth5": "02:57:fa:ac:14:04",
            "eth6": "8a:2f:9c:23:2b:de",
            "eth7": "d6:bf:01:a5:77:4b"
        },
        "spine_2_1_2": {
            "eth0": "0a:5c:38:6b:b3:08",
            "eth1": "0e:30:15:df:c2:62",
            "eth2": "ce:91:e7:4e:b6:1e",
            "eth3": "62:76:3d:c7:e7:27",
            "eth4": "1e:0c:c4:2e:ba:37",
            "eth5": "fe:8b:3b:1d:b1:17",
            "eth6": "4a:b9:95:dd:7d:cf",
            "eth7": "ea:bb:a9:d0:f8:ef"
        },
        "spine_2_1_3": {
            "eth0": "a6:19:5f:b4:a9:40",
            "eth1": "b6:6c:1f:ff:24:63",
            "eth2": "36:46:c1:01:d5:5e",
            "eth3": "8a:2b:8e:30:dd:06",
            "eth4": "fa:58:cd:72:a1:74",
            "eth5": "ca:80:7c:30:d7:06",
            "eth6": "72:95:42:ac:5d:ef",
            "eth7": "22:2f:a5:e4:88:f3"
        },
        "spine_2_1_4": {
            "eth0": "a6:64:db:f6:4d:2f",
            "eth1": "12:e4:f7:de:e8:d5",
            "eth2": "82:fb:a9:24:91:6c",
            "eth3": "9e:9e:41:5d:de:22",
            "eth4": "c2:71:63:a8:7a:91",
            "eth5": "be:e3:39:72:57:5a",
            "eth6": "da:be:1f:8a:be:b4",
            "eth7": "16:df:9d:1f:0c:ea"
        },
        "tof_1_2_1": {
            "eth0": "56:fe:5e:85:12:6d",
            "eth1": "7e:0f:02:4b:51:9a",
            "eth2": "ca:0a:92:e4:f8:5c",
            "eth3": "9e:46:1a:b0:65:8d",
            "eth4": "aa:71:b3:4e:19:9f",
            "eth5": "22:55:7f:cf:fc:a9",
            "eth6": "32:e9:90:73:d6:b8",
            "eth7": "de:e6:6a:28:46:df"
        },
        "tof_1_2_2": {
            "eth0": "ea:e3:d9:df:b6:f8",
            "eth1": "e6:e8:9e:4d:b6:8e",
            "eth2": "8e:5f:f9:71:cb:4d",
            "eth3": "8e:99:72:1a:82:51",
            "eth4": "96:64:a3:40:fe:56",
            "eth5": "12:85:e2:0f:fc:12",
            "eth6": "3a:54:a7:00:07:ee",
            "eth7": "06:88:92:5d:9b:88"
        },
        "tof_1_2_3": {
            "eth0": "b6:df:ec:73:d1:57",
            "eth1": "32:50:03:5b:a0:ea",
            "eth2": "76:f2:d1:3d:01:26",
            "eth3": "d2:46:fa:d8:16:37",
            "eth4": "02:2d:7f:b9:f3:bc",
            "eth5": "86:94:20:48:a3:84",
            "eth6": "6a:24:f1:16:5f:f5",
            "eth7": "a6:c4:5b:cb:3b:60"
        },
        "tof_1_2_4": {
            "eth0": "2a:86:72:bb:67:01",
            "eth1": "02:d3:d3:0c:da:f1",
            "eth2": "5e:dc:e3:e0:81:a0",
            "eth3": "4a:f9:53:a7:45:83",
            "eth4": "4e:6b:71:39:6d:83",
            "eth5": "5a:90:ad:2a:a9:35",
            "eth6": "ca:01:00:8b:b9:85",
            "eth7": "5a:9b:10:35:e5:e1"
        }
    },
    "failed_machine": "leaf_1_0_1",
    "failure_time": {
        "leaf_1_0_1": 1622026108.0301638,
        "leaf_1_0_2": 1622026108.048101,
        "leaf_1_0_3": 1622026108.0353148,
        "leaf_1_0_4": 1622026108.0512397,
        "leaf_2_0_1": 1622026108.0352945,
        "leaf_2_0_2": 1622026108.045686,
        "leaf_2_0_3": 1622026108.0397828,
        "leaf_2_0_4": 1622026108.0505593,
        "spine_1_1_1": 1622026108.0644217,
        "spine_1_1_2": 1622026108.0806644,
        "spine_1_1_3": 1622026108.0615468,
        "spine_1_1_4": 1622026108.0846024,
        "spine_2_1_1": 1622026108.0647254,
        "spine_2_1_2": 1622026108.0757067,
        "spine_2_1_3": 1622026108.080375,
        "spine_2_1_4": 1622026108.0961537,
        "tof_1_2_1": 1622026108.0948749,
        "tof_1_2_2": 1622026108.1041422,
        "tof_1_2_3": 1622026108.095207,
        "tof_1_2_4": 1622026108.1035316
    }
}