{
    "description": "Scenario 6b: net16 link failure and recovery of spine_1_1_1 with BGP",
    "k_leaf": 16,
    "k_top": 16,
    "redundancy_factor": 16,
    "is_k8s": true,
    "machine_mac_addresses": {
        "leaf_1_0_1": {
            "net0": "02:a5:26:36:69:4c",
            "net1": "e2:d8:2e:02:99:c7",
            "net10": "a6:11:69:51:75:49",
            "net11": "1e:67:2a:34:21:1d",
            "net12": "ea:0e:5d:90:fe:f9",
            "net13": "0e:3b:13:bb:1e:a7",
            "net14": "b2:41:16:cd:8e:f1",
            "net15": "62:af:5a:20:44:0b",
            "net16": "f6:a6:70:20:8d:d0",
            "net2": "46:8c:b1:65:f2:00",
            "net3": "f2:f8:59:a7:5d:50",
            "net4": "0a:aa:e0:d4:40:a9",
            "net5": "72:4d:71:1d:dc:1f",
            "net6": "ee:95:5b:e8:7b:48",
            "net7": "2a:8c:be:ab:8b:b2",
            "net8": "5e:35:8f:35:37:85",
            "net9": "1e:1e:4c:0c:a9:bd"
        },
        "leaf_1_0_10": {
            "net0": "f6:bc:14:a4:00:5a",
            "net1": "0a:b7:74:58:b4:ad",
            "net10": "86:34:23:d7:92:0b",
            "net11": "3e:d7:85:72:5f:69",
            "net12": "16:91:40:28:7b:d1",
            "net13": "be:14:1a:5b:ad:c6",
            "net14": "c2:d4:a3:be:fa:06",
            "net15": "66:67:f1:2a:20:ba",
            "net16": "c6:b5:15:c2:0e:fc",
            "net2": "12:00:10:14:03:a6",
            "net3": "16:cd:4a:d5:35:98",
            "net4": "be:39:5e:b2:a7:ab",
            "net5": "c6:48:b4:25:5a:37",
            "net6": "4a:5c:23:e9:69:cb",
            "net7": "e2:53:5b:73:4a:b1",
            "net8": "9a:96:d9:ea:1c:50",
            "net9": "36:7f:7c:60:7d:cf"
        },
        "leaf_1_0_11": {
            "net0": "5a:bd:aa:10:00:b8",
            "net1": "46:0b:3a:ba:6a:02",
            "net10": "d2:26:11:80:5f:06",
            "net11": "ca:c8:08:07:db:7d",
            "net12": "ee:07:bb:1b:a7:5c",
            "net13": "96:a3:e9:31:1d:91",
            "net14": "b6:d4:f5:42:7c:c7",
            "net15": "76:2e:f1:e6:3b:e8",
            "net16": "5e:bc:6b:ff:3b:ee",
            "net2": "e6:9c:1c:21:ce:93",
            "net3": "d2:e1:ad:df:d2:8d",
            "net4": "6e:0c:a3:5e:7f:c0",
            "net5": "82:f8:96:dc:ff:54",
            "net6": "5a:d5:d1:54:8f:c7",
            "net7": "8a:3f:bf:4f:65:78",
            "net8": "16:fc:a9:c1:2a:bb",
            "net9": "5a:38:8b:3a:d5:be"
        },
        "leaf_1_0_12": {
            "net0": "16:d2:b7:31:5b:10",
            "net1": "66:e1:b8:6a:64:2c",
            "net10": "d6:94:d5:f6:84:b2",
            "net11": "0a:55:d8:52:24:69",
            "net12": "e6:ae:8a:26:48:ad",
            "net13": "e2:99:4f:c1:52:f7",
            "net14": "a2:f6:f7:a1:3e:89",
            "net15": "96:3f:c2:d1:22:19",
            "net16": "a6:eb:da:18:47:0e",
            "net2": "ea:81:56:bc:a3:38",
            "net3": "32:a7:9e:8d:ec:97",
            "net4": "86:06:b5:e7:1f:dc",
            "net5": "4a:ac:3d:85:a4:34",
            "net6": "3a:83:28:f5:61:16",
            "net7": "12:9f:1f:da:72:e1",
            "net8": "ca:20:48:3b:e0:2c",
            "net9": "8a:64:b0:c1:be:3e"
        },
        "leaf_1_0_13": {
            "net0": "f6:14:5d:d5:b4:8f",
            "net1": "ce:d5:e1:b1:26:67",
            "net10": "4a:55:1e:82:8d:98",
            "net11": "7e:96:da:e6:77:9e",
            "net12": "02:f5:dc:e3:f1:59",
            "net13": "de:55:b5:29:6d:4d",
            "net14": "fe:46:75:1c:a5:d4",
            "net15": "7e:b5:8a:5b:6e:af",
            "net16": "c2:6f:05:d7:c6:36",
            "net2": "e2:81:e2:23:c2:02",
            "net3": "a2:5a:24:3e:81:1e",
            "net4": "66:1e:06:60:17:7c",
            "net5": "12:7a:0e:e3:58:ff",
            "net6": "1e:72:21:8d:fa:e7",
            "net7": "0e:22:23:af:0e:d3",
            "net8": "fe:9f:89:fc:ba:7d",
            "net9": "96:ae:1b:66:5f:52"
        },
        "leaf_1_0_14": {
            "net0": "d2:fc:7c:ef:af:45",
            "net1": "36:f0:a1:9d:b4:40",
            "net10": "de:83:9f:6b:ca:67",
            "net11": "f2:3c:29:23:be:6d",
            "net12": "36:39:60:dd:92:a1",
            "net13": "02:5e:b8:1f:7c:d8",
            "net14": "3e:76:e7:ea:2a:22",
            "net15": "46:33:28:80:4b:aa",
            "net16": "be:0b:3d:35:ca:6e",
            "net2": "ba:16:fb:b8:03:e9",
            "net3": "56:91:e4:2d:dd:3d",
            "net4": "d2:2b:94:5f:81:25",
            "net5": "86:fc:df:e1:04:cf",
            "net6": "b6:ab:03:7b:49:08",
            "net7": "82:aa:01:a4:8f:f6",
            "net8": "7a:83:98:9e:ca:7d",
            "net9": "fa:b2:52:0a:aa:9b"
        },
        "leaf_1_0_15": {
            "net0": "de:e8:fe:75:f1:85",
            "net1": "fa:13:c2:12:9a:c8",
            "net10": "6a:ca:72:04:e3:0b",
            "net11": "8e:d1:18:1d:d9:5d",
            "net12": "92:2c:b9:2a:62:7b",
            "net13": "62:da:dd:1c:a1:aa",
            "net14": "6e:ba:78:81:37:6d",
            "net15": "ba:33:4b:02:75:9f",
            "net16": "2a:87:9e:2d:6c:b5",
            "net2": "f2:52:6c:bb:a1:11",
            "net3": "16:23:22:70:c8:f2",
            "net4": "fe:95:72:5d:e7:3d",
            "net5": "56:6c:d1:77:ef:ba",
            "net6": "6e:8b:70:1e:70:72",
            "net7": "06:fa:d5:5a:1a:89",
            "net8": "86:ef:33:60:a5:44",
            "net9": "b2:c9:f9:12:6e:dd"
        },
        "leaf_1_0_16": {
            "net0": "86:4a:4f:b6:39:f3",
            "net1": "02:a3:aa:57:97:ab",
            "net10": "f2:e0:92:b1:56:f8",
            "net11": "f6:93:c8:9e:08:e4",
            "net12": "a2:1a:74:b8:39:d2",
            "net13": "5a:83:b2:5f:97:aa",
            "net14": "ce:97:9f:98:c8:32",
            "net15": "fe:3b:e7:19:02:69",
            "net16": "fe:78:05:7b:e4:45",
            "net2": "82:d2:1d:18:1b:87",
            "net3": "3a:b0:99:14:d3:3b",
            "net4": "76:e5:ad:63:88:24",
            "net5": "c2:1c:d7:69:51:cf",
            "net6": "76:6f:32:84:20:e5",
            "net7": "7a:05:cb:e3:f1:11",
            "net8": "5a:fa:70:7f:59:02",
            "net9": "da:5b:f4:78:38:5a"
        },
        "leaf_1_0_2": {
            "net0": "ea:16:f2:42:8d:2b",
            "net1": "76:2d:a4:67:f6:d1",
            "net10": "ca:ba:7d:55:05:7d",
            "net11": "26:f7:3a:e6:1e:fc",
            "net12": "5a:46:e9:fc:a3:63",
            "net13": "b2:23:99:41:71:71",
            "net14": "0a:0e:da:89:e9:fb",
            "net15": "aa:50:5d:bd:ec:5c",
            "net16": "72:e0:1a:25:a6:0b",
            "net2": "f6:c1:d5:e5:b2:3d",
            "net3": "e2:1a:7d:af:db:a3",
            "net4": "ee:05:85:ae:3a:fe",
            "net5": "82:ad:0b:26:6e:c7",
            "net6": "d2:83:52:11:78:1e",
            "net7": "56:80:e5:f4:65:78",
            "net8": "02:d3:65:98:78:e8",
            "net9": "6a:ad:48:0e:0b:59"
        },
        "leaf_1_0_3": {
            "net0": "42:e8:d8:5b:6f:43",
            "net1": "26:cf:ed:d2:22:2d",
            "net10": "9e:46:54:7e:fc:fd",
            "net11": "e6:e4:1a:a6:2d:7a",
            "net12": "2e:3c:b1:44:aa:8f",
            "net13": "4e:5b:05:96:be:04",
            "net14": "ea:17:3e:c7:c2:7b",
            "net15": "da:cc:6f:c5:96:08",
            "net16": "6e:0e:bd:a1:e4:f7",
            "net2": "ce:ce:f3:d2:fd:38",
            "net3": "ea:33:42:01:07:a5",
            "net4": "8a:79:ec:8d:c1:f5",
            "net5": "36:53:42:92:cd:35",
            "net6": "a2:be:18:38:c4:f0",
            "net7": "6e:7a:6f:a9:82:67",
            "net8": "c2:92:bb:a9:bf:51",
            "net9": "be:0e:e6:6d:61:73"
        },
        "leaf_1_0_4": {
            "net0": "5a:2c:f0:79:cc:34",
            "net1": "3e:76:f5:e7:83:98",
            "net10": "52:3b:6b:0e:ad:e4",
            "net11": "36:1b:50:02:bb:47",
            "net12": "0a:d2:2a:44:14:0e",
            "net13": "46:89:3b:91:88:23",
            "net14": "ca:00:90:c1:63:89",
            "net15": "76:6f:2e:e4:04:5f",
            "net16": "0e:7a:83:29:b6:d1",
            "net2": "4a:35:7a:b5:8b:c9",
            "net3": "1a:85:13:fa:98:26",
            "net4": "82:20:b6:3d:67:0d",
            "net5": "3e:34:28:ad:9c:6e",
            "net6": "7a:d6:2c:30:80:ee",
            "net7": "8e:fd:a9:71:13:09",
            "net8": "22:6c:db:4c:ef:c8",
            "net9": "1a:89:2a:1c:f2:45"
        },
        "leaf_1_0_5": {
            "net0": "b6:19:39:4b:64:6c",
            "net1": "a2:36:0b:83:ac:60",
            "net10": "3e:9b:96:11:59:33",
            "net11": "46:8e:2f:45:ef:b7",
            "net12": "66:3c:8f:74:1e:3c",
            "net13": "a2:a6:37:ff:fd:48",
            "net14": "96:f3:e8:81:4b:15",
            "net15": "92:e8:86:2d:17:37",
            "net16": "72:53:70:07:51:8e",
            "net2": "26:c5:bf:5b:bb:cc",
            "net3": "4a:38:44:f7:f4:74",
            "net4": "56:9d:86:dd:b8:d2",
            "net5": "aa:9d:e1:6a:17:15",
            "net6": "22:e6:36:d0:f1:23",
            "net7": "82:71:a5:9c:1d:1a",
            "net8": "ee:b9:a8:a9:a9:b7",
            "net9": "fe:8f:86:5f:d6:f5"
        },
        "leaf_1_0_6": {
            "net0": "6a:a5:ec:a3:5b:f5",
            "net1": "a2:69:0b:51:d8:b6",
            "net10": "4e:90:9c:b1:bf:bb",
            "net11": "72:c4:cb:75:7f:0d",
            "net12": "5a:9a:48:bb:af:db",
            "net13": "16:91:c8:88:8a:8b",
            "net14": "02:d2:35:a3:54:c2",
            "net15": "b2:32:50:de:f1:c4",
            "net16": "8e:c3:bc:30:bd:56",
            "net2": "2e:a8:74:5c:41:bd",
            "net3": "52:07:f7:a4:d2:dc",
            "net4": "c2:d5:0f:43:31:0d",
            "net5": "d2:1a:79:67:69:74",
            "net6": "7e:9d:8c:f8:ea:82",
            "net7": "3a:ed:48:bc:19:70",
            "net8": "22:eb:e3:ce:fd:25",
            "net9": "ee:67:8e:8f:68:b0"
        },
        "leaf_1_0_7": {
            "net0": "ce:c8:77:10:57:35",
            "net1": "a2:65:b5:93:5e:a1",
            "net10": "7a:71:1d:7e:36:e6",
            "net11": "ca:c7:77:6b:22:90",
            "net12": "d6:54:ec:50:c2:14",
            "net13": "32:28:d2:35:96:f6",
            "net14": "7a:0d:ba:8a:d2:c4",
            "net15": "0a:80:d0:d5:41:88",
            "net16": "6a:6d:f3:e7:78:94",
            "net2": "02:1e:a9:31:65:d1",
            "net3": "fa:52:62:3f:10:7e",
            "net4": "b2:27:b7:ab:3b:99",
            "net5": "be:55:92:69:04:68",
            "net6": "e6:ee:95:94:03:b3",
            "net7": "92:73:fe:fd:49:ee",
            "net8": "ca:d5:51:11:f6:f2",
            "net9": "d2:22:52:92:7b:da"
        },
        "leaf_1_0_8": {
            "net0": "8e:1b:56:d4:cc:6c",
            "net1": "ea:3a:ec:89:9a:52",
            "net10": "ea:9d:53:32:2d:1b",
            "net11": "52:9b:ac:e1:72:ba",
            "net12": "aa:c3:ca:21:f9:1d",
            "net13": "a6:95:d2:7a:aa:3f",
            "net14": "12:3d:82:40:d3:d7",
            "net15": "5e:20:5a:0c:d0:6a",
            "net16": "e6:cc:34:cc:2f:4d",
            "net2": "52:8a:cb:ba:62:c6",
            "net3": "22:26:9d:7a:8e:a2",
            "net4": "a2:02:39:57:5e:5f",
            "net5": "9e:4c:a0:fc:df:8b",
            "net6": "26:ec:6c:9c:3c:e0",
            "net7": "f6:f6:50:9b:b5:9a",
            "net8": "ea:9f:e8:71:db:e0",
            "net9": "3a:ec:6e:ac:70:ab"
        },
        "leaf_1_0_9": {
            "net0": "e6:7f:50:fc:9e:fd",
            "net1": "c2:e2:32:c7:eb:47",
            "net10": "ee:37:e6:c4:bd:56",
            "net11": "b2:6d:5a:5a:35:d8",
            "net12": "d2:a1:36:0e:0f:9e",
            "net13": "da:c8:ac:ac:b8:5a",
            "net14": "ba:ca:0c:37:6b:85",
            "net15": "8e:be:e0:d4:3f:95",
            "net16": "66:34:f5:c9:63:1b",
            "net2": "d2:5d:3b:05:81:80",
            "net3": "ca:f5:c5:c3:6a:c2",
            "net4": "76:83:c9:88:1b:62",
            "net5": "e2:bd:2a:5a:c1:9e",
            "net6": "3e:ee:dd:a7:41:b3",
            "net7": "e6:6c:d5:f7:d1:dd",
            "net8": "5e:9c:9b:e5:24:b6",
            "net9": "da:f7:c0:a9:71:5d"
        },
        "leaf_2_0_1": {
            "net0": "be:d2:9f:26:b2:38",
            "net1": "5a:81:ba:66:bd:e5",
            "net10": "92:2f:da:07:e9:ee",
            "net11": "12:90:93:b7:f9:bb",
            "net12": "56:31:72:b6:19:d6",
            "net13": "72:31:a1:8c:8c:b0",
            "net14": "e2:37:eb:cb:7d:a3",
            "net15": "da:23:1c:12:27:ab",
            "net16": "f2:6b:95:91:41:5a",
            "net2": "d2:74:f1:02:f1:14",
            "net3": "b6:55:e3:80:27:d4",
            "net4": "9e:f5:ef:cc:49:48",
            "net5": "52:12:98:3d:65:33",
            "net6": "36:45:ed:82:10:f2",
            "net7": "36:5b:6e:c5:a0:2f",
            "net8": "9a:d3:56:d7:17:51",
            "net9": "d2:c3:23:44:d3:59"
        },
        "leaf_2_0_10": {
            "net0": "ce:aa:d0:6e:79:a3",
            "net1": "8a:29:d4:bb:85:b9",
            "net10": "d6:1b:e2:1d:0f:aa",
            "net11": "de:1b:2e:56:62:b4",
            "net12": "3e:3a:61:78:52:49",
            "net13": "aa:71:0a:78:c0:3f",
            "net14": "3a:a3:88:96:77:85",
            "net15": "5e:53:44:82:55:b8",
            "net16": "82:80:49:01:f0:b7",
            "net2": "76:d5:b5:67:71:a6",
            "net3": "92:75:82:90:c1:a0",
            "net4": "22:92:56:11:1a:a8",
            "net5": "72:6e:da:53:94:ef",
            "net6": "a2:01:40:c1:52:f0",
            "net7": "56:13:53:e2:27:6b",
            "net8": "f2:ec:11:c3:d2:d2",
            "net9": "a2:98:65:f9:5d:01"
        },
        "leaf_2_0_11": {
            "net0": "c2:32:21:e2:c5:3d",
            "net1": "1e:22:27:a3:8a:a5",
            "net10": "02:e4:c7:f3:5f:93",
            "net11": "ba:71:c3:d1:19:9b",
            "net12": "d6:64:03:90:c3:ee",
            "net13": "f2:75:fa:82:a1:55",
            "net14": "22:8b:51:e3:fc:c0",
            "net15": "f2:91:6d:50:48:96",
            "net16": "1a:b8:ea:84:81:d9",
            "net2": "5a:69:b0:11:47:52",
            "net3": "86:d4:f5:2a:40:16",
            "net4": "36:3b:6b:bd:87:45",
            "net5": "f2:22:45:8b:92:a0",
            "net6": "2a:93:39:8f:ae:52",
            "net7": "f6:9f:62:ab:08:36",
            "net8": "a6:23:8a:d6:fc:28",
            "net9": "6a:59:f4:8a:ad:fd"
        },
        "leaf_2_0_12": {
            "net0": "46:1f:dc:83:07:22",
            "net1": "36:84:5a:f5:e0:84",
            "net10": "c2:1f:84:fa:af:05",
            "net11": "b2:ba:73:9d:e5:6a",
            "net12": "8a:6c:7c:6c:51:49",
            "net13": "36:df:90:ef:cd:a1",
            "net14": "6a:7f:09:eb:d2:f0",
            "net15": "3e:3b:70:3d:bd:90",
            "net16": "a6:98:20:bf:ce:65",
            "net2": "5a:cf:83:c3:e7:2c",
            "net3": "4a:7a:68:49:c2:d4",
            "net4": "ce:0f:e5:91:e2:b9",
            "net5": "c2:14:2e:06:5a:0c",
            "net6": "4e:1a:fd:2d:9a:69",
            "net7": "d2:b0:7f:c3:54:59",
            "net8": "e2:f0:4f:61:f8:d9",
            "net9": "22:48:a7:41:98:97"
        },
        "leaf_2_0_13": {
            "net0": "e2:5c:51:3a:8e:92",
            "net1": "6e:9e:b5:46:c7:b0",
            "net10": "72:c8:f9:94:76:c1",
            "net11": "e6:bc:d0:3f:ce:d1",
            "net12": "4e:69:ba:f8:91:b3",
            "net13": "42:bc:12:56:ad:3b",
            "net14": "3e:0d:8f:7d:32:77",
            "net15": "fe:be:74:15:e7:51",
            "net16": "be:7e:3c:82:81:5d",
            "net2": "22:0c:3f:0f:77:e1",
            "net3": "9e:76:43:c3:ac:aa",
            "net4": "fa:32:08:b7:7b:ef",
            "net5": "0a:96:89:81:01:20",
            "net6": "9e:47:fd:99:b5:aa",
            "net7": "56:90:6f:e3:e9:f0",
            "net8": "32:3b:f0:28:26:7a",
            "net9": "42:db:31:3e:01:fb"
        },
        "leaf_2_0_14": {
            "net0": "d2:39:8d:d0:22:04",
            "net1": "de:97:51:cd:04:ea",
            "net10": "3e:50:7e:cf:ee:86",
            "net11": "2e:64:74:ae:ca:5b",
            "net12": "96:43:c9:f1:50:af",
            "net13": "36:23:92:34:ba:f9",
            "net14": "9e:b9:ff:60:3c:96",
            "net15": "e6:c6:4d:db:4f:46",
            "net16": "3e:2f:d6:a3:37:f8",
            "net2": "b6:22:63:88:10:e2",
            "net3": "5e:e9:2b:45:4f:92",
            "net4": "5a:e2:0a:94:ef:ec",
            "net5": "46:b4:2d:d4:4f:0c",
            "net6": "12:ea:9a:0e:12:e0",
            "net7": "da:c6:55:14:5a:ac",
            "net8": "da:91:e7:3c:a1:c5",
            "net9": "22:d5:0d:5f:d6:01"
        },
        "leaf_2_0_15": {
            "net0": "a6:17:30:4c:f0:62",
            "net1": "8e:8d:40:e7:91:b2",
            "net10": "6a:99:19:d0:fe:d0",
            "net11": "66:9c:a7:08:85:96",
            "net12": "b2:71:9f:64:6e:74",
            "net13": "ea:d7:1a:67:89:a3",
            "net14": "56:43:36:0b:4e:37",
            "net15": "8a:23:f8:f9:9f:3b",
            "net16": "52:5c:a0:1b:95:d1",
            "net2": "7a:d9:35:0a:bd:64",
            "net3": "66:f6:bd:e5:0c:d0",
            "net4": "36:c4:0c:80:41:01",
            "net5": "62:0b:d1:9b:b7:8e",
            "net6": "ba:9d:07:08:a6:f6",
            "net7": "de:ba:ad:16:71:e7",
            "net8": "fe:91:69:4b:96:39",
            "net9": "22:33:27:bb:6a:bb"
        },
        "leaf_2_0_16": {
            "net0": "52:4d:90:f7:86:53",
            "net1": "92:36:22:95:8f:b9",
            "net10": "a6:81:31:f2:4f:a7",
            "net11": "ea:c4:75:84:ec:b3",
            "net12": "e2:b0:f4:9d:fa:85",
            "net13": "36:ac:15:5a:f8:b5",
            "net14": "a6:33:71:58:84:3c",
            "net15": "3a:43:d2:30:39:73",
            "net16": "c2:99:15:f8:f5:ab",
            "net2": "de:fe:0a:93:38:a5",
            "net3": "96:fb:77:27:84:8d",
            "net4": "36:21:0d:f8:b1:75",
            "net5": "9a:af:53:f8:bf:16",
            "net6": "1e:85:7a:e9:a4:e5",
            "net7": "5e:36:39:40:6f:5f",
            "net8": "06:fd:40:44:4d:51",
            "net9": "36:11:f1:01:9c:4f"
        },
        "leaf_2_0_2": {
            "net0": "a6:93:35:d1:a5:bf",
            "net1": "be:5b:6e:c2:cf:45",
            "net10": "7e:b3:3e:70:3d:43",
            "net11": "12:cc:7a:43:ba:f4",
            "net12": "7a:b0:1f:b7:81:11",
            "net13": "da:6c:79:05:d3:9f",
            "net14": "1e:ad:d3:f9:c5:9f",
            "net15": "52:4b:9d:1b:16:a2",
            "net16": "76:3f:6d:73:3e:52",
            "net2": "be:92:a3:ee:72:4e",
            "net3": "46:4e:65:a9:0f:b0",
            "net4": "6a:dc:d7:4d:48:e7",
            "net5": "52:fb:b9:20:a1:d5",
            "net6": "9a:96:9c:aa:9f:e9",
            "net7": "0a:e3:65:71:d2:c0",
            "net8": "4a:e5:a6:9a:37:d9",
            "net9": "ea:4d:23:ce:91:ef"
        },
        "leaf_2_0_3": {
            "net0": "1a:a0:c2:c2:28:cb",
            "net1": "72:ab:4a:47:0f:ac",
            "net10": "fe:7a:cd:dc:2e:61",
            "net11": "a2:34:61:f4:06:6d",
            "net12": "76:2d:17:47:a9:c5",
            "net13": "3e:ef:fb:b1:e8:61",
            "net14": "0e:da:ee:5e:49:6e",
            "net15": "e2:f9:a4:24:38:48",
            "net16": "8a:d7:21:12:76:ba",
            "net2": "8e:fe:f6:39:97:3f",
            "net3": "da:d3:10:63:47:76",
            "net4": "a2:0a:6e:1e:91:9d",
            "net5": "5a:f3:57:2f:e0:59",
            "net6": "86:f5:54:0d:7d:a0",
            "net7": "8a:a4:54:dd:85:23",
            "net8": "ea:63:9e:39:80:77",
            "net9": "96:9b:4e:fc:4f:d9"
        },
        "leaf_2_0_4": {
            "net0": "52:29:c9:3d:3f:f9",
            "net1": "8a:e1:60:78:cd:75",
            "net10": "36:61:54:5a:f8:14",
            "net11": "a2:d2:f7:50:fb:f1",
            "net12": "da:38:19:af:ab:b4",
            "net13": "8e:01:f6:bd:8f:14",
            "net14": "82:84:cc:53:84:ee",
            "net15": "da:78:cc:d1:21:e2",
            "net16": "b2:90:b2:79:01:71",
            "net2": "6e:79:89:61:e3:54",
            "net3": "c2:72:d2:a5:7e:13",
            "net4": "16:1a:cd:5e:5b:cb",
            "net5": "ce:78:65:cc:d5:cf",
            "net6": "5e:a1:29:9b:dc:53",
            "net7": "96:c2:6d:af:32:b5",
            "net8": "a2:da:08:e1:3b:b6",
            "net9": "02:14:09:4f:ff:5c"
        },
        "leaf_2_0_5": {
            "net0": "f2:2e:d9:02:01:be",
            "net1": "f6:ce:6e:42:95:03",
            "net10": "62:8a:5c:c9:b8:6c",
            "net11": "b2:d1:50:e7:cb:a2",
            "net12": "82:13:f5:36:38:64",
            "net13": "7a:a8:41:f5:19:87",
            "net14": "d2:4f:53:df:ab:f5",
            "net15": "02:22:71:4b:c0:0a",
            "net16": "2a:4b:0e:da:22:23",
            "net2": "82:c7:8d:0f:33:d2",
            "net3": "a6:b9:57:a9:f6:cf",
            "net4": "3e:fd:64:7f:8c:b0",
            "net5": "22:e5:0a:0c:9a:04",
            "net6": "d6:c1:67:fb:85:b3",
            "net7": "0e:3d:90:17:6b:3d",
            "net8": "06:69:6b:f4:42:cf",
            "net9": "5a:8f:e2:27:08:9c"
        },
        "leaf_2_0_6": {
            "net0": "6e:60:d6:28:3b:1e",
            "net1": "5e:4e:d1:58:0a:a0",
            "net10": "5a:8a:94:60:4c:8a",
            "net11": "72:29:da:aa:1b:f6",
            "net12": "1e:20:b7:02:f4:58",
            "net13": "fe:d7:d5:17:d8:77",
            "net14": "7a:80:21:3f:50:d7",
            "net15": "22:f5:40:29:9a:f0",
            "net16": "0a:74:fe:1b:28:12",
            "net2": "7a:76:bf:a8:ee:a3",
            "net3": "5a:e4:42:1e:4d:d2",
            "net4": "3e:63:48:e7:86:f2",
            "net5": "e2:fe:b6:76:b0:f3",
            "net6": "22:54:2f:a4:f2:2d",
            "net7": "22:47:ce:a3:cd:58",
            "net8": "ee:cc:51:33:20:5b",
            "net9": "86:3c:55:15:90:4e"
        },
        "leaf_2_0_7": {
            "net0": "82:cf:93:68:43:ff",
            "net1": "4a:4e:a5:ec:6e:0e",
            "net10": "72:a6:ff:b0:3e:5f",
            "net11": "56:fa:83:74:6b:75",
            "net12": "b6:0a:dc:84:79:00",
            "net13": "02:8b:48:d9:f2:ce",
            "net14": "12:0f:43:a2:28:79",
            "net15": "ca:5c:54:4d:77:2f",
            "net16": "7e:d4:16:d7:c0:a3",
            "net2": "22:6f:f0:9c:f3:79",
            "net3": "92:8d:ca:4f:2f:f3",
            "net4": "a6:19:37:97:b8:d7",
            "net5": "4e:6a:60:33:26:91",
            "net6": "da:ab:44:39:ab:17",
            "net7": "1e:40:d3:58:b7:a8",
            "net8": "2a:ff:f8:4f:7f:bf",
            "net9": "92:03:80:55:1c:16"
        },
        "leaf_2_0_8": {
            "net0": "36:85:ec:1e:3d:eb",
            "net1": "1e:98:7f:29:c8:2a",
            "net10": "6a:dd:71:7a:04:ce",
            "net11": "b2:6b:89:d2:52:cf",
            "net12": "96:65:fe:9a:ba:db",
            "net13": "66:cd:dc:75:3f:a8",
            "net14": "ea:e9:ae:75:6c:f3",
            "net15": "1a:2b:90:7a:05:2d",
            "net16": "b6:53:ca:c3:1c:26",
            "net2": "d6:d2:c1:1d:f4:6a",
            "net3": "0a:3f:e1:f0:3b:7d",
            "net4": "f2:52:b4:d1:da:6b",
            "net5": "5e:f0:95:eb:63:e2",
            "net6": "7e:6f:f9:09:c6:66",
            "net7": "7e:f8:5d:63:b7:3f",
            "net8": "12:d4:25:19:ef:e5",
            "net9": "ae:95:e9:46:6f:a2"
        },
        "leaf_2_0_9": {
            "net0": "46:a8:04:79:74:9f",
            "net1": "26:13:02:81:77:0b",
            "net10": "8a:96:7b:ff:cd:dc",
            "net11": "5a:24:9f:c7:e1:6e",
            "net12": "16:a9:84:95:41:4c",
            "net13": "2a:d6:5a:b0:b7:fd",
            "net14": "02:89:fa:ba:62:19",
            "net15": "7e:2b:72:b9:fb:4b",
            "net16": "e6:cb:2e:08:ca:3c",
            "net2": "86:e8:37:a7:13:49",
            "net3": "da:d6:ac:e1:60:70",
            "net4": "ce:6c:38:bb:9e:1c",
            "net5": "fe:3d:bb:2b:09:71",
            "net6": "16:f7:49:9f:86:b6",
            "net7": "86:8a:9c:05:a3:3c",
            "net8": "4a:b5:41:49:a5:1e",
            "net9": "b2:fd:73:1e:85:ce"
        },
        "spine_1_1_1": {
            "net0": "fe:4c:b9:7f:8f:1b",
            "net1": "56:59:c8:3d:4d:0b",
            "net10": "02:66:20:0f:f1:00",
            "net11": "66:21:66:0b:c4:93",
            "net12": "f6:b2:ed:da:12:e9",
            "net13": "32:ce:13:f6:cd:db",
            "net14": "da:bd:f7:b9:0a:96",
            "net15": "42:6b:08:e7:76:02",
            "net16": "5e:05:75:15:d7:69",
            "net17": "1a:bc:35:b3:fa:5f",
            "net18": "e2:48:7b:2f:d4:a3",
            "net19": "76:71:66:56:7e:70",
            "net2": "c2:ef:88:43:cc:91",
            "net20": "4a:6f:41:16:bd:7b",
            "net21": "12:a5:fb:83:b5:8c",
            "net22": "6e:df:b3:d0:3b:e0",
            "net23": "7e:50:77:9b:41:e3",
            "net24": "6a:8b:30:fd:4e:4d",
            "net25": "16:0d:4d:11:25:56",
            "net26": "f2:77:cd:e2:80:26",
            "net27": "f6:b8:97:2d:3d:fe",
            "net28": "ea:f4:91:ce:f4:69",
            "net29": "6e:88:56:c8:22:83",
            "net3": "5e:55:83:21:7c:ca",
            "net30": "f2:8d:88:5d:4b:be",
            "net31": "16:92:4e:46:f8:34",
            "net4": "9a:33:fe:0e:38:7c",
            "net5": "56:75:26:12:14:fb",
            "net6": "36:e9:d3:22:2a:2a",
            "net7": "92:43:fd:2b:57:bd",
            "net8": "a2:e6:3e:f9:f2:0f",
            "net9": "6a:75:7b:87:ae:a2"
        },
        "spine_1_1_10": {
            "net0": "72:4e:bb:8c:77:bc",
            "net1": "ae:88:b9:a4:b3:52",
            "net10": "3e:8e:0a:35:ae:40",
            "net11": "ea:09:86:b8:69:65",
            "net12": "86:14:38:f8:14:6b",
            "net13": "72:9a:89:ae:ed:e5",
            "net14": "ea:a7:6b:23:b8:da",
            "net15": "de:39:12:54:fd:a9",
            "net16": "5a:93:74:69:8a:db",
            "net17": "1e:72:9a:37:4e:68",
            "net18": "b6:01:ce:f9:91:48",
            "net19": "76:19:69:b6:96:4f",
            "net2": "c6:dc:9d:3c:b0:37",
            "net20": "9e:58:28:16:11:39",
            "net21": "aa:ba:9f:7e:d7:64",
            "net22": "32:cf:90:65:db:6f",
            "net23": "3a:c5:89:f5:40:cf",
            "net24": "76:32:9a:5b:29:a1",
            "net25": "52:06:99:87:65:60",
            "net26": "e2:8f:18:07:b9:c0",
            "net27": "ce:d7:e1:fa:b9:f6",
            "net28": "a2:78:c3:eb:d8:6c",
            "net29": "7e:12:0a:14:b3:34",
            "net3": "36:7a:f0:cf:37:93",
            "net30": "3a:ba:b6:ed:bb:5a",
            "net31": "a2:4e:86:bf:d5:fe",
            "net4": "4a:8e:d8:1a:a0:9b",
            "net5": "d2:f6:a7:15:58:5f",
            "net6": "b2:e3:ba:82:cd:95",
            "net7": "4e:c6:57:e6:0b:c3",
            "net8": "42:29:a8:fe:68:87",
            "net9": "3e:1f:b0:83:b8:6e"
        },
        "spine_1_1_11": {
            "net0": "1a:4a:b5:34:8b:29",
            "net1": "22:be:b9:74:25:e4",
            "net10": "7e:6a:82:60:ec:ed",
            "net11": "5e:0e:3f:dc:51:27",
            "net12": "ca:67:ce:37:bc:32",
            "net13": "e6:d1:54:b9:57:36",
            "net14": "ea:bd:05:72:54:e2",
            "net15": "5a:9a:40:ce:a1:5b",
            "net16": "6a:c8:82:4c:ba:8a",
            "net17": "1e:e7:1c:4e:b7:8f",
            "net18": "9a:35:d2:f6:3e:81",
            "net19": "1e:74:23:7f:89:7a",
            "net2": "72:77:85:a7:5a:cd",
            "net20": "12:d8:c0:9d:58:98",
            "net21": "d6:9e:ca:20:a9:b2",
            "net22": "02:37:65:07:bb:dc",
            "net23": "a6:35:5c:79:2f:cc",
            "net24": "ca:92:98:fa:db:4c",
            "net25": "a2:57:2a:8c:be:89",
            "net26": "a2:ff:9e:35:50:ee",
            "net27": "22:73:7c:93:62:70",
            "net28": "ba:b0:75:0f:ff:ef",
            "net29": "52:86:01:d1:ab:7a",
            "net3": "c6:7a:6a:0c:9d:04",
            "net30": "a2:1c:25:ea:4b:83",
            "net31": "ba:52:72:00:42:5d",
            "net4": "06:6b:32:53:e4:f1",
            "net5": "e6:5c:01:6a:6c:8d",
            "net6": "76:a7:09:32:8c:0b",
            "net7": "a2:a3:98:f7:a2:46",
            "net8": "6a:11:58:8e:af:9a",
            "net9": "12:0b:8b:f8:08:68"
        },
        "spine_1_1_12": {
            "net0": "fa:1c:6d:5c:3d:83",
            "net1": "6e:b4:95:8a:8e:8c",
            "net10": "de:b7:28:26:37:27",
            "net11": "a2:f6:37:57:8c:66",
            "net12": "a6:a0:77:b2:34:7a",
            "net13": "b2:56:5f:01:ed:76",
            "net14": "2a:a7:38:d3:08:4c",
            "net15": "c2:46:ee:38:14:ae",
            "net16": "ee:8f:ff:29:03:47",
            "net17": "3e:77:40:34:d3:9d",
            "net18": "a6:92:78:c6:57:e3",
            "net19": "46:48:44:27:b2:3c",
            "net2": "f6:92:73:3e:83:80",
            "net20": "76:1c:49:38:07:9b",
            "net21": "ba:e6:2b:8c:0e:5b",
            "net22": "2a:b1:1f:6f:98:d4",
            "net23": "96:30:21:bf:cb:54",
            "net24": "be:4f:e6:64:b3:a6",
            "net25": "f2:9a:1f:ad:df:70",
            "net26": "aa:47:f8:6f:f8:2d",
            "net27": "0a:ad:c3:82:d9:95",
            "net28": "3a:5c:7e:c5:8f:66",
            "net29": "d6:1d:09:8e:d9:0c",
            "net3": "f6:1f:54:89:59:1b",
            "net30": "9a:79:49:de:b4:39",
            "net31": "86:1d:15:34:01:32",
            "net4": "c6:7f:ce:f9:09:48",
            "net5": "66:9d:9b:94:e0:5e",
            "net6": "fe:b4:45:51:25:d7",
            "net7": "96:f2:f3:bf:fc:01",
            "net8": "aa:8d:cf:c8:ad:a6",
            "net9": "b6:35:fa:bf:2d:f7"
        },
        "spine_1_1_13": {
            "net0": "16:1d:a3:84:6a:dc",
            "net1": "72:7d:dd:15:08:d5",
            "net10": "be:0b:a6:85:a9:bc",
            "net11": "1e:aa:76:90:51:a3",
            "net12": "be:8e:e9:23:1d:d9",
            "net13": "52:8c:3f:87:46:55",
            "net14": "0e:6c:0c:41:56:74",
            "net15": "ce:20:61:62:0b:cb",
            "net16": "aa:6d:3c:7e:7b:3a",
            "net17": "52:dd:b8:0b:40:aa",
            "net18": "0e:a6:73:ca:52:fc",
            "net19": "aa:78:04:60:8a:4c",
            "net2": "c2:0e:14:13:63:2a",
            "net20": "9e:a2:aa:55:d7:0f",
            "net21": "1a:c2:5d:88:a3:60",
            "net22": "0a:a4:08:57:12:7c",
            "net23": "c6:bb:cd:46:14:06",
            "net24": "36:48:d7:06:60:16",
            "net25": "8a:0e:bf:9c:95:75",
            "net26": "d6:e1:3d:4b:40:fd",
            "net27": "9a:f5:16:8b:3b:9f",
            "net28": "e6:86:10:62:fd:52",
            "net29": "66:ed:8c:63:ef:24",
            "net3": "9a:a4:65:9c:8e:75",
            "net30": "5e:fd:87:55:e5:b0",
            "net31": "a2:4d:3f:4f:d5:84",
            "net4": "72:a0:a4:95:29:8c",
            "net5": "36:19:bb:3c:8c:69",
            "net6": "0e:14:e3:57:aa:bb",
            "net7": "3e:7c:41:2b:29:1c",
            "net8": "0e:ad:3e:0f:c2:91",
            "net9": "0a:75:62:43:1b:34"
        },
        "spine_1_1_14": {
            "net0": "6a:95:99:e7:37:5f",
            "net1": "ea:5f:2a:cd:6a:9b",
            "net10": "02:54:0d:a1:11:34",
            "net11": "16:e9:2d:28:72:31",
            "net12": "62:19:c8:c1:d2:47",
            "net13": "5e:39:76:42:dc:d9",
            "net14": "f6:c7:ad:f9:d7:7a",
            "net15": "22:71:18:5c:22:af",
            "net16": "66:f0:08:88:a2:d2",
            "net17": "0a:1d:1e:4f:5e:27",
            "net18": "16:61:9a:cb:02:7b",
            "net19": "a6:03:50:09:62:ba",
            "net2": "0a:86:50:8d:df:83",
            "net20": "3a:c7:6f:fb:df:cc",
            "net21": "42:6f:ea:11:72:ac",
            "net22": "8e:f7:f5:6a:6f:61",
            "net23": "e2:c7:d6:c1:d1:08",
            "net24": "aa:a6:25:c8:3e:9e",
            "net25": "36:59:8c:c8:ad:62",
            "net26": "2e:46:8b:3a:30:8a",
            "net27": "c2:d8:35:86:f3:3c",
            "net28": "ee:51:ae:fb:0e:30",
            "net29": "9a:99:88:e1:30:76",
            "net3": "1a:34:a4:ec:72:e5",
            "net30": "8e:42:e1:47:ad:9f",
            "net31": "52:9b:0d:1b:24:8d",
            "net4": "9e:2f:74:d0:8b:12",
            "net5": "f2:2d:fd:07:05:69",
            "net6": "46:e9:e0:09:51:05",
            "net7": "da:82:8b:83:20:c7",
            "net8": "aa:1c:ff:3a:66:93",
            "net9": "e2:38:f7:c6:87:4a"
        },
        "spine_1_1_15": {
            "net0": "0e:9b:17:01:91:04",
            "net1": "0e:68:b7:5b:1f:6d",
            "net10": "5e:e2:d7:d5:50:41",
            "net11": "36:cc:1d:10:c6:d5",
            "net12": "6e:11:c7:b5:27:48",
            "net13": "2a:70:c9:90:5a:eb",
            "net14": "de:04:9d:fa:5a:77",
            "net15": "6e:8b:99:6f:51:d5",
            "net16": "da:a9:e9:fc:b7:ac",
            "net17": "d6:aa:bb:b0:f9:0f",
            "net18": "32:fa:dc:c2:09:2c",
            "net19": "d6:55:4f:7a:0f:b6",
            "net2": "d6:e2:23:05:13:9e",
            "net20": "46:ed:1f:85:cc:f0",
            "net21": "22:b4:7d:eb:54:9a",
            "net22": "6e:45:8f:f6:82:e1",
            "net23": "36:4f:dc:b6:30:62",
            "net24": "76:9f:30:0d:f3:76",
            "net25": "2a:c8:a1:d0:df:ec",
            "net26": "0a:15:a8:cf:ff:62",
            "net27": "1a:27:b8:15:ef:3a",
            "net28": "32:7f:9a:d5:be:88",
            "net29": "ce:aa:6f:07:91:50",
            "net3": "8e:69:e3:14:18:c0",
            "net30": "7e:cf:f0:79:a3:81",
            "net31": "4e:02:f2:53:be:86",
            "net4": "fe:c9:d7:95:94:65",
            "net5": "62:da:39:d6:ca:6a",
            "net6": "92:fe:e1:ba:bc:5f",
            "net7": "16:4d:fd:75:38:f0",
            "net8": "5e:26:ab:8d:1f:db",
            "net9": "1a:1e:72:ca:d1:5b"
        },
        "spine_1_1_16": {
            "net0": "2a:69:f0:15:d2:d4",
            "net1": "ea:8f:a9:05:a0:af",
            "net10": "ba:4f:25:ef:c6:35",
            "net11": "8a:1a:f0:55:59:f4",
            "net12": "26:00:6e:d3:8e:da",
            "net13": "a6:23:09:35:a2:a4",
            "net14": "aa:8e:7b:e4:d5:95",
            "net15": "4e:5e:fb:a6:d7:b7",
            "net16": "3a:b9:09:81:e8:55",
            "net17": "a6:56:f9:32:1e:b6",
            "net18": "a6:88:05:18:4c:b6",
            "net19": "aa:06:bb:9d:c7:39",
            "net2": "62:cf:8b:14:8c:6a",
            "net20": "c2:2f:6d:0a:9b:ac",
            "net21": "62:6c:ef:d3:ca:95",
            "net22": "d6:ee:ff:2e:87:cf",
            "net23": "56:a5:df:4e:35:b5",
            "net24": "6e:95:8f:fc:d0:8c",
            "net25": "fe:5d:cc:fb:9d:e1",
            "net26": "6e:57:a4:c8:ca:4f",
            "net27": "c2:0d:2b:30:40:a3",
            "net28": "3a:ae:c3:42:1b:8d",
            "net29": "66:bd:4a:28:4d:30",
            "net3": "1e:ed:01:d9:8e:a2",
            "net30": "ae:59:a1:ef:6a:09",
            "net31": "76:f9:08:c0:a3:39",
            "net4": "56:79:df:a5:ef:90",
            "net5": "36:dd:1a:f6:37:9a",
            "net6": "c6:51:80:d1:2b:ba",
            "net7": "7e:55:45:ff:b8:c8",
            "net8": "42:15:76:7f:19:e8",
            "net9": "ba:6a:23:fd:6e:6d"
        },
        "spine_1_1_2": {
            "net0": "82:f6:da:58:d8:fa",
            "net1": "66:f8:79:b3:b0:73",
            "net10": "52:26:ec:87:69:66",
            "net11": "9e:cd:e8:9a:ea:0a",
            "net12": "fa:b8:77:8a:a0:38",
            "net13": "52:9f:c2:6c:56:61",
            "net14": "b6:88:58:ce:aa:a1",
            "net15": "a6:e7:89:55:bb:1e",
            "net16": "9e:84:df:af:3c:56",
            "net17": "26:1f:ab:60:35:25",
            "net18": "7e:74:81:5e:d1:a1",
            "net19": "8e:81:8a:b2:ed:77",
            "net2": "26:68:40:a9:b1:3f",
            "net20": "72:f3:b9:21:3c:e4",
            "net21": "b6:8b:ac:38:40:f0",
            "net22": "1a:3d:dc:ca:e9:ee",
            "net23": "3e:ec:9c:4d:f8:ec",
            "net24": "22:ba:16:a5:7e:4d",
            "net25": "0a:8f:97:55:20:ee",
            "net26": "8e:df:1e:21:ff:da",
            "net27": "22:eb:08:3b:3d:2e",
            "net28": "aa:c8:e6:6f:04:d1",
            "net29": "76:ae:7f:6d:67:a5",
            "net3": "52:6e:fd:af:6a:9c",
            "net30": "b6:34:99:ce:d3:57",
            "net31": "86:04:e4:29:40:61",
            "net4": "56:33:27:87:dd:b9",
            "net5": "c2:d4:d5:85:e8:41",
            "net6": "8e:86:58:fc:57:7a",
            "net7": "f6:57:69:1d:4c:89",
            "net8": "3e:43:86:7b:74:12",
            "net9": "1e:79:cb:19:28:27"
        },
        "spine_1_1_3": {
            "net0": "ea:a3:34:fd:7d:3f",
            "net1": "be:02:37:e4:84:72",
            "net10": "e2:3a:d6:af:7a:13",
            "net11": "8e:d5:d5:69:0f:6a",
            "net12": "c6:b1:45:81:b9:3e",
            "net13": "02:5c:8a:1c:90:43",
            "net14": "c2:f9:da:e3:08:4c",
            "net15": "36:33:57:1c:7a:e7",
            "net16": "fa:54:ba:53:47:c8",
            "net17": "e6:1a:f9:d0:e4:09",
            "net18": "0e:cc:25:02:12:4f",
            "net19": "4e:f0:56:47:c2:7f",
            "net2": "46:13:e5:41:f0:32",
            "net20": "96:dd:8c:80:79:3c",
            "net21": "82:19:a9:bd:de:6c",
            "net22": "de:1b:f1:c0:e8:b9",
            "net23": "aa:1a:0c:a7:4f:52",
            "net24": "92:b4:1c:c9:a9:3b",
            "net25": "aa:81:29:4d:5d:7f",
            "net26": "0a:45:89:47:58:49",
            "net27": "ea:4d:76:90:43:7d",
            "net28": "e2:e0:6e:4f:3b:ec",
            "net29": "56:1a:b0:8f:16:7f",
            "net3": "92:df:e2:69:70:ff",
            "net30": "ce:72:19:2b:fc:e8",
            "net31": "32:09:56:e0:4c:f8",
            "net4": "f6:39:08:e1:25:83",
            "net5": "2a:11:e1:95:5e:74",
            "net6": "fa:69:44:ab:9a:3d",
            "net7": "fe:58:8c:07:92:36",
            "net8": "42:6b:ad:17:57:a1",
            "net9": "e6:10:26:ad:72:e3"
        },
        "spine_1_1_4": {
            "net0": "6e:44:e8:90:37:78",
            "net1": "8e:70:2f:c1:49:dd",
            "net10": "3a:02:b8:03:5d:8e",
            "net11": "3e:b1:63:43:3c:c8",
            "net12": "8a:80:d7:54:8a:ad",
            "net13": "3a:1f:2c:2b:a4:6b",
            "net14": "b6:a4:99:31:aa:ea",
            "net15": "46:02:8c:c3:45:6c",
            "net16": "ce:47:63:2b:ea:cf",
            "net17": "7e:6c:b7:14:6f:fb",
            "net18": "4e:a8:5a:79:2d:25",
            "net19": "ce:79:0e:b2:e1:f3",
            "net2": "3e:35:bd:80:b4:70",
            "net20": "de:1d:ab:d6:d3:c6",
            "net21": "12:d3:7d:ce:76:61",
            "net22": "1a:27:dd:9d:5a:09",
            "net23": "d6:10:1c:69:48:55",
            "net24": "6e:8c:6d:a5:0d:6c",
            "net25": "86:ea:b9:9d:99:62",
            "net26": "6e:d0:84:ed:8d:d5",
            "net27": "ee:29:df:8a:b1:b8",
            "net28": "c2:af:6e:b5:8a:47",
            "net29": "12:65:93:c8:c3:37",
            "net3": "1a:1b:c4:47:98:12",
            "net30": "2a:94:1a:72:ce:34",
            "net31": "96:10:83:fc:d3:41",
            "net4": "0a:3a:f1:20:65:98",
            "net5": "5a:44:79:43:13:96",
            "net6": "b2:e3:87:e2:f8:b6",
            "net7": "0a:b6:e1:c3:b5:ec",
            "net8": "8a:dd:49:1b:60:a1",
            "net9": "be:9f:36:97:b8:5f"
        },
        "spine_1_1_5": {
            "net0": "fa:f9:15:29:a6:7c",
            "net1": "d6:2e:64:f6:2d:0b",
            "net10": "7a:f6:94:f1:d4:68",
            "net11": "3a:a8:6f:c5:e0:bf",
            "net12": "ba:a0:0f:c7:83:ce",
            "net13": "aa:ed:80:11:e5:71",
            "net14": "de:9d:5f:77:72:3f",
            "net15": "6e:91:8e:5f:52:79",
            "net16": "d2:39:cf:d6:fb:c9",
            "net17": "52:3f:6c:6b:57:cf",
            "net18": "36:86:42:a5:84:25",
            "net19": "da:71:ce:3b:4e:44",
            "net2": "76:f3:7c:27:f0:86",
            "net20": "06:47:57:dd:30:5e",
            "net21": "be:8b:2a:6d:8b:8c",
            "net22": "ae:3f:c9:b9:a1:4b",
            "net23": "e2:0f:bf:22:75:3d",
            "net24": "c6:02:b8:e6:07:6b",
            "net25": "3e:49:cd:c4:d0:81",
            "net26": "ce:7b:86:c3:f5:26",
            "net27": "0a:32:9b:e2:b9:ad",
            "net28": "4e:68:ea:12:35:78",
            "net29": "62:1e:28:e1:f1:93",
            "net3": "0e:65:ac:3e:63:39",
            "net30": "6a:a5:66:d9:18:b6",
            "net31": "32:01:ae:ab:8a:24",
            "net4": "d6:2b:19:fb:1f:a6",
            "net5": "e2:00:d5:8f:85:a5",
            "net6": "6a:81:8e:63:0a:6a",
            "net7": "ca:58:f0:31:3e:2c",
            "net8": "5e:0d:65:46:33:45",
            "net9": "42:07:8a:a6:64:47"
        },
        "spine_1_1_6": {
            "net0": "22:94:b8:1c:18:8d",
            "net1": "52:74:94:65:fa:09",
            "net10": "b2:7a:33:fe:25:fe",
            "net11": "2e:f6:45:fc:9e:dd",
            "net12": "6a:0f:b4:7f:cb:a5",
            "net13": "76:9d:a7:d1:f2:88",
            "net14": "fa:ab:e0:eb:75:27",
            "net15": "b6:89:ea:52:c0:29",
            "net16": "fe:51:84:9d:96:4d",
            "net17": "1e:3c:b4:85:26:13",
            "net18": "4e:f0:52:7c:31:2d",
            "net19": "72:a9:fe:43:aa:c0",
            "net2": "16:e4:72:d8:3f:67",
            "net20": "46:f6:6f:26:ff:26",
            "net21": "f6:fc:21:51:9f:e6",
            "net22": "2a:b8:c4:c6:0a:a6",
            "net23": "0e:3d:f6:2f:0f:6f",
            "net24": "b6:f1:db:d2:47:e8",
            "net25": "52:25:de:10:22:bd",
            "net26": "62:ef:04:26:6c:c3",
            "net27": "62:01:8e:da:ac:0f",
            "net28": "2e:d7:26:43:7e:ad",
            "net29": "76:7b:cf:0a:eb:dd",
            "net3": "ba:23:d5:f9:fc:65",
            "net30": "c2:02:74:b2:25:8f",
            "net31": "7a:73:2c:70:85:46",
            "net4": "4e:da:71:e1:c0:f6",
            "net5": "ca:44:07:2e:de:16",
            "net6": "86:d6:ab:ad:1e:f0",
            "net7": "0a:44:43:d1:c4:d0",
            "net8": "82:33:6b:90:48:9d",
            "net9": "c2:51:2c:df:8f:5b"
        },
        "spine_1_1_7": {
            "net0": "56:90:c6:54:54:5d",
            "net1": "fe:da:28:25:3a:3f",
            "net10": "36:fa:ff:5d:c5:72",
            "net11": "62:b9:aa:2f:cd:a4",
            "net12": "26:a0:79:3e:f2:da",
            "net13": "12:16:02:b1:58:ca",
            "net14": "26:28:9f:bf:cf:25",
            "net15": "62:65:f5:aa:66:2d",
            "net16": "82:db:78:58:20:b8",
            "net17": "fa:a0:46:ca:0b:e7",
            "net18": "e2:12:38:9d:cf:8b",
            "net19": "0a:92:34:25:d4:66",
            "net2": "fa:a8:09:e6:a3:5c",
            "net20": "92:35:3f:77:bd:10",
            "net21": "52:d2:67:fd:d9:a0",
            "net22": "de:91:28:d1:13:65",
            "net23": "ae:0f:15:b0:3b:cc",
            "net24": "36:82:1e:09:5e:89",
            "net25": "6a:ed:e3:d3:4a:18",
            "net26": "32:74:46:c4:bb:f2",
            "net27": "46:de:9f:7e:44:d5",
            "net28": "46:c7:f6:a0:5b:bf",
            "net29": "56:f5:ac:a5:b6:7c",
            "net3": "26:03:85:29:65:99",
            "net30": "86:5d:84:41:3e:69",
            "net31": "d6:70:d5:2d:02:dd",
            "net4": "5a:7d:90:ff:30:00",
            "net5": "1a:fa:84:59:09:08",
            "net6": "62:c3:7d:cf:74:a3",
            "net7": "66:83:cb:b8:e3:13",
            "net8": "62:1e:c9:ed:69:77",
            "net9": "da:15:c8:b0:fb:cc"
        },
        "spine_1_1_8": {
            "net0": "32:b0:04:fc:0e:7a",
            "net1": "f6:85:fb:cd:78:98",
            "net10": "32:21:73:ec:88:b1",
            "net11": "12:49:ca:46:94:ff",
            "net12": "46:d6:12:29:e3:39",
            "net13": "02:4d:01:e7:e2:58",
            "net14": "fe:ee:67:4d:4e:80",
            "net15": "3a:93:7e:22:1e:34",
            "net16": "ea:60:70:b3:8c:be",
            "net17": "32:0d:66:85:e2:29",
            "net18": "e2:21:4a:35:a8:c1",
            "net19": "7a:87:8b:15:53:f2",
            "net2": "b2:4d:ae:c9:26:7c",
            "net20": "32:aa:5f:ab:9f:97",
            "net21": "16:c2:5e:bd:68:93",
            "net22": "4a:eb:ea:8b:3e:35",
            "net23": "92:da:5c:54:87:8a",
            "net24": "ce:c6:e0:5a:17:76",
            "net25": "56:2e:f7:cd:4e:6c",
            "net26": "ee:be:2e:0a:98:da",
            "net27": "4e:25:00:a7:8c:e9",
            "net28": "ea:90:0d:d2:b3:50",
            "net29": "12:92:0d:62:56:d2",
            "net3": "72:34:f9:64:2f:9e",
            "net30": "3a:6d:95:93:08:95",
            "net31": "e6:f1:c2:fb:31:3f",
            "net4": "9a:bb:17:54:31:de",
            "net5": "12:9e:4a:92:18:2c",
            "net6": "86:f6:64:62:0a:3f",
            "net7": "d2:f0:a2:3a:a4:10",
            "net8": "fa:b2:82:8f:3d:c8",
            "net9": "c6:4e:58:7a:2e:1f"
        },
        "spine_1_1_9": {
            "net0": "96:54:bd:b9:fc:18",
            "net1": "36:d8:cf:d3:be:8a",
            "net10": "2e:0a:ad:52:b9:34",
            "net11": "fe:26:eb:c3:5f:c5",
            "net12": "06:b5:dd:10:df:8f",
            "net13": "76:49:ef:da:68:09",
            "net14": "7a:14:ad:3a:2d:b7",
            "net15": "12:d1:d0:19:18:81",
            "net16": "7e:fe:96:5a:1a:a0",
            "net17": "ee:3b:53:93:5b:bf",
            "net18": "fa:c4:1d:0c:05:7e",
            "net19": "06:a1:6d:9b:00:a7",
            "net2": "4e:5d:78:de:4c:55",
            "net20": "d6:80:af:24:66:1b",
            "net21": "e6:ba:7d:d5:cc:66",
            "net22": "b6:fa:68:3c:a7:d4",
            "net23": "4a:4a:e2:32:a5:55",
            "net24": "f2:60:37:2a:e8:4c",
            "net25": "ca:c0:8d:fa:10:f6",
            "net26": "7a:32:d2:33:f9:d8",
            "net27": "a2:ff:58:b4:48:5b",
            "net28": "02:f4:90:bd:49:82",
            "net29": "26:08:09:50:86:bf",
            "net3": "a2:d7:d7:5f:84:fb",
            "net30": "a2:58:1d:75:10:f0",
            "net31": "56:2a:99:2d:16:67",
            "net4": "a6:12:d2:4b:c6:f7",
            "net5": "52:68:1e:c1:1a:64",
            "net6": "e2:95:81:de:62:a4",
            "net7": "c6:d4:41:3e:e8:35",
            "net8": "a6:72:cf:6e:5c:3a",
            "net9": "56:e7:1b:47:2f:4e"
        },
        "spine_2_1_1": {
            "net0": "d6:73:ef:69:8c:23",
            "net1": "da:ef:58:68:4c:c8",
            "net10": "7e:cc:0d:d9:60:a0",
            "net11": "8e:83:6d:a7:44:7a",
            "net12": "a6:07:1e:a8:ef:85",
            "net13": "ca:61:06:48:56:2d",
            "net14": "32:0a:82:45:5b:81",
            "net15": "3a:13:9c:46:91:0e",
            "net16": "aa:c9:3d:9f:fc:ac",
            "net17": "32:05:bb:c4:8a:bf",
            "net18": "82:48:52:9a:b4:d5",
            "net19": "a2:26:86:8b:d3:ae",
            "net2": "12:eb:8f:cf:2c:fb",
            "net20": "7a:91:52:10:bf:e5",
            "net21": "c6:43:44:a8:56:b1",
            "net22": "4e:ee:73:bb:71:3c",
            "net23": "5e:99:d5:af:8e:9b",
            "net24": "32:bb:fe:17:d8:95",
            "net25": "02:87:32:a0:3a:c5",
            "net26": "36:10:bb:17:56:a3",
            "net27": "4e:c6:c1:ce:41:f2",
            "net28": "a2:f9:e3:36:0d:2b",
            "net29": "02:c8:2d:1f:ab:45",
            "net3": "de:54:96:e8:49:33",
            "net30": "b2:44:b0:07:38:8b",
            "net31": "06:76:f3:88:a1:78",
            "net4": "72:8e:11:7e:e9:d7",
            "net5": "66:85:e1:d5:6f:b5",
            "net6": "06:47:9f:12:4d:79",
            "net7": "da:68:bf:83:c1:7a",
            "net8": "36:d1:b4:90:05:26",
            "net9": "86:b1:27:49:87:12"
        },
        "spine_2_1_10": {
            "net0": "2a:4e:62:d8:70:95",
            "net1": "9e:fb:4c:cb:bd:17",
            "net10": "ca:20:7d:46:03:55",
            "net11": "46:bc:16:f7:9b:12",
            "net12": "d6:16:3a:22:af:a5",
            "net13": "3a:19:10:4b:2f:bd",
            "net14": "46:97:67:b5:a5:be",
            "net15": "be:9b:aa:29:9b:74",
            "net16": "46:50:b9:e9:8e:fc",
            "net17": "6a:d6:77:f6:d8:8f",
            "net18": "06:cb:3c:c5:df:19",
            "net19": "e2:cc:f5:2e:e9:64",
            "net2": "ba:a0:1c:db:b7:8e",
            "net20": "26:1c:f8:9a:c3:b3",
            "net21": "06:51:37:72:3f:13",
            "net22": "da:54:79:60:69:ea",
            "net23": "72:3d:54:8e:b9:3b",
            "net24": "ae:5e:bc:6a:34:0d",
            "net25": "6a:a3:35:17:26:74",
            "net26": "ea:d3:30:06:c6:4a",
            "net27": "d6:18:bc:5a:f2:c9",
            "net28": "3a:d0:ac:49:72:4c",
            "net29": "d6:55:43:ea:91:2c",
            "net3": "9a:f6:77:97:18:3e",
            "net30": "ba:de:bd:9e:a8:a4",
            "net31": "ea:eb:df:ed:7a:a1",
            "net4": "a6:e0:4d:a1:66:26",
            "net5": "3e:8d:40:48:c8:a6",
            "net6": "0a:52:7b:db:4c:28",
            "net7": "a6:2f:1b:7b:23:28",
            "net8": "82:da:49:b2:73:5f",
            "net9": "ca:9c:91:f1:3a:57"
        },
        "spine_2_1_11": {
            "net0": "7a:f6:26:3d:bc:d1",
            "net1": "ba:b9:c5:fc:a9:02",
            "net10": "d2:d9:2e:e3:61:f5",
            "net11": "de:bd:53:d8:41:bc",
            "net12": "76:94:c1:8d:da:ac",
            "net13": "26:f4:54:cb:3c:29",
            "net14": "4a:10:60:08:63:1c",
            "net15": "72:18:e0:46:62:c7",
            "net16": "9e:ec:0b:d6:fa:c2",
            "net17": "d2:67:0c:26:8a:f2",
            "net18": "d6:ff:cc:9e:db:3d",
            "net19": "62:06:e9:33:6c:6d",
            "net2": "fa:1d:bc:2c:57:96",
            "net20": "5a:13:ed:51:cb:86",
            "net21": "62:60:53:19:b3:45",
            "net22": "42:e5:5d:a3:2a:e5",
            "net23": "82:a2:7d:21:14:44",
            "net24": "52:35:a1:a4:22:94",
            "net25": "6a:62:0e:6c:a6:f7",
            "net26": "ee:0a:34:c1:f1:d4",
            "net27": "92:67:47:c6:d8:74",
            "net28": "7e:48:92:31:ce:52",
            "net29": "d6:26:1e:c5:63:53",
            "net3": "02:34:2c:df:fd:ab",
            "net30": "c6:ec:82:63:ab:f8",
            "net31": "be:20:a9:9b:0e:fb",
            "net4": "b2:0c:49:dc:86:a3",
            "net5": "1e:e0:14:29:c9:5d",
            "net6": "52:25:86:45:f5:65",
            "net7": "c6:86:f9:99:aa:49",
            "net8": "f2:86:4b:c1:9f:d6",
            "net9": "8a:47:d4:93:9b:b7"
        },
        "spine_2_1_12": {
            "net0": "66:36:f0:e0:1a:83",
            "net1": "ee:d6:ab:71:80:52",
            "net10": "9a:18:91:59:ef:45",
            "net11": "4e:a0:9a:c8:31:30",
            "net12": "e2:b7:18:80:b2:de",
            "net13": "9e:5d:bc:7a:4e:b6",
            "net14": "46:0a:4d:d0:8b:ac",
            "net15": "52:e5:c7:28:ec:ff",
            "net16": "66:34:df:be:28:98",
            "net17": "aa:e9:e4:8a:ed:f7",
            "net18": "8a:e1:e8:2e:ea:59",
            "net19": "aa:a8:33:57:eb:9d",
            "net2": "76:74:1e:6d:dc:6d",
            "net20": "5a:27:40:8c:5b:07",
            "net21": "56:df:37:31:7a:28",
            "net22": "96:28:c4:46:48:5d",
            "net23": "3a:88:9a:2c:03:09",
            "net24": "62:51:90:0d:ec:ed",
            "net25": "ee:7b:4d:e6:ec:d3",
            "net26": "82:96:a2:61:0e:9a",
            "net27": "0e:cd:ea:f9:22:20",
            "net28": "f2:9c:05:90:bc:cf",
            "net29": "ba:2e:f9:e9:3a:71",
            "net3": "5a:48:3f:b9:5d:3e",
            "net30": "f2:04:0d:5f:ad:a7",
            "net31": "52:ab:42:53:68:30",
            "net4": "96:ec:4f:c2:a0:3c",
            "net5": "6e:98:de:8d:5a:2f",
            "net6": "a6:84:22:f8:62:b0",
            "net7": "4a:c5:9e:de:dd:bc",
            "net8": "66:5d:9e:15:be:69",
            "net9": "6e:ec:0c:e8:7b:63"
        },
        "spine_2_1_13": {
            "net0": "62:cd:e9:da:92:f7",
            "net1": "ca:a8:a4:ac:33:21",
            "net10": "d2:36:6e:2b:d3:65",
            "net11": "32:f2:f5:bb:e4:50",
            "net12": "b2:55:e1:64:e7:91",
            "net13": "fe:df:c7:4f:fa:48",
            "net14": "82:57:44:43:e8:ca",
            "net15": "ba:f7:a8:8c:26:58",
            "net16": "3e:a5:61:ab:81:dc",
            "net17": "02:29:17:73:72:e7",
            "net18": "fa:7c:8d:f0:85:e4",
            "net19": "a6:c6:9b:88:67:77",
            "net2": "8e:db:1c:1c:08:06",
            "net20": "2e:39:f0:4f:a7:43",
            "net21": "1a:47:e8:4e:c4:fc",
            "net22": "e2:1f:67:b1:be:b9",
            "net23": "16:cb:19:0c:5c:b1",
            "net24": "7a:1a:36:82:21:a9",
            "net25": "32:8c:7e:8c:83:74",
            "net26": "8e:1d:68:7d:d2:14",
            "net27": "36:2d:55:04:f6:d1",
            "net28": "8e:88:ba:11:35:8d",
            "net29": "46:44:f0:ec:ac:a9",
            "net3": "22:6d:8b:ae:ba:39",
            "net30": "f2:9b:73:c4:1c:12",
            "net31": "ae:23:eb:0a:43:66",
            "net4": "22:ba:bc:16:93:5d",
            "net5": "aa:ed:a6:66:f8:66",
            "net6": "52:79:50:48:7c:df",
            "net7": "1e:99:58:2d:1b:4c",
            "net8": "22:ab:63:25:4b:6c",
            "net9": "a2:bd:78:58:1a:e2"
        },
        "spine_2_1_14": {
            "net0": "b6:ee:e3:2b:68:ac",
            "net1": "62:ab:9e:6d:8e:ae",
            "net10": "d2:7d:43:b0:20:18",
            "net11": "46:6a:4e:da:f2:88",
            "net12": "f2:74:41:df:0c:65",
            "net13": "d6:87:cc:2c:29:ec",
            "net14": "c2:a0:1d:f3:f1:ad",
            "net15": "2e:57:6b:60:2c:1e",
            "net16": "6e:16:e7:8d:4c:81",
            "net17": "d2:56:8b:d5:07:18",
            "net18": "62:8a:31:43:8f:b0",
            "net19": "82:2b:ac:f8:32:8c",
            "net2": "f2:27:86:ba:5b:b5",
            "net20": "92:eb:99:a0:b9:f1",
            "net21": "12:a9:5d:15:20:51",
            "net22": "36:ac:a2:ab:99:95",
            "net23": "52:48:18:4f:ec:31",
            "net24": "be:a6:ee:6d:04:fe",
            "net25": "66:bc:ff:85:fe:bb",
            "net26": "1e:e9:e7:85:ea:a9",
            "net27": "7a:af:cc:83:2a:35",
            "net28": "d2:f9:34:da:f4:64",
            "net29": "da:7c:2b:98:8d:73",
            "net3": "e2:a4:59:3a:15:ac",
            "net30": "c2:a9:d8:f1:eb:13",
            "net31": "82:f6:e1:d7:db:df",
            "net4": "7e:6e:29:94:c6:0d",
            "net5": "5a:59:b8:dd:fd:b1",
            "net6": "2a:6c:21:bb:bd:bc",
            "net7": "7e:9a:fb:b0:d5:d2",
            "net8": "8a:20:39:ac:ae:f3",
            "net9": "be:66:56:99:0f:8c"
        },
        "spine_2_1_15": {
            "net0": "32:09:a6:0a:47:eb",
            "net1": "f6:a3:40:a3:51:2e",
            "net10": "f2:72:d9:66:a1:46",
            "net11": "3a:44:4d:b0:fa:c7",
            "net12": "42:0c:fd:73:d5:b4",
            "net13": "6e:0c:73:8b:b4:e2",
            "net14": "56:a8:f6:d1:9d:98",
            "net15": "9a:26:3c:79:75:c6",
            "net16": "d6:97:5f:e1:32:77",
            "net17": "de:13:6c:f9:21:73",
            "net18": "06:0c:0e:e4:1a:08",
            "net19": "8e:0f:3a:4d:a1:e7",
            "net2": "52:ed:a7:8a:56:2f",
            "net20": "5e:e7:36:0e:9d:a8",
            "net21": "76:33:4e:d7:68:1d",
            "net22": "56:79:b5:d0:03:cc",
            "net23": "42:89:3d:69:10:54",
            "net24": "92:b9:fb:c9:18:c5",
            "net25": "b2:93:87:87:5f:d9",
            "net26": "4e:25:c1:68:e3:64",
            "net27": "0e:f8:13:69:dd:4f",
            "net28": "f6:42:4c:81:03:40",
            "net29": "a2:71:8d:01:ad:9c",
            "net3": "36:2e:e3:ed:a7:56",
            "net30": "f2:c4:29:43:1a:8c",
            "net31": "be:6c:7b:9a:30:0c",
            "net4": "76:fd:7a:e6:bd:6b",
            "net5": "e6:43:a9:d0:c4:f4",
            "net6": "a6:a1:ab:fc:17:79",
            "net7": "32:a5:aa:29:78:8a",
            "net8": "fe:04:ef:54:d2:9c",
            "net9": "e2:50:26:93:3f:7f"
        },
        "spine_2_1_16": {
            "net0": "b2:75:08:60:3a:7e",
            "net1": "32:7b:34:fe:de:36",
            "net10": "5a:76:21:85:5d:aa",
            "net11": "16:14:3b:75:53:56",
            "net12": "a2:69:19:28:7d:0e",
            "net13": "c2:e8:08:73:57:85",
            "net14": "a2:c4:5d:b4:fd:f9",
            "net15": "c6:04:4e:63:f2:5a",
            "net16": "d6:66:4e:10:41:2f",
            "net17": "42:80:99:59:92:91",
            "net18": "2e:29:09:34:b9:06",
            "net19": "22:e8:09:53:da:d6",
            "net2": "ba:52:d3:79:dd:fa",
            "net20": "4e:3d:0a:6d:ed:37",
            "net21": "4e:5c:97:dc:95:a5",
            "net22": "9a:2d:b5:fb:27:de",
            "net23": "66:11:51:2d:f8:b7",
            "net24": "86:6e:d2:92:8c:e3",
            "net25": "66:1d:6f:fd:7b:7e",
            "net26": "f6:ae:47:f1:7a:36",
            "net27": "7a:6b:4d:45:6a:08",
            "net28": "ea:1a:a4:55:7f:23",
            "net29": "e6:c5:99:82:50:9b",
            "net3": "c6:19:1f:78:c5:d6",
            "net30": "da:5b:ec:a7:3d:de",
            "net31": "2e:c8:c4:73:9c:a9",
            "net4": "36:4b:01:d3:40:e2",
            "net5": "7e:64:98:4b:95:55",
            "net6": "ca:a0:cf:d7:1c:16",
            "net7": "ae:8b:16:1d:4a:01",
            "net8": "d2:ab:c5:b1:2c:ab",
            "net9": "96:eb:68:8d:27:a9"
        },
        "spine_2_1_2": {
            "net0": "ba:27:f8:1d:92:99",
            "net1": "96:c3:78:53:43:d3",
            "net10": "86:20:1a:68:34:d6",
            "net11": "52:fb:27:19:05:f2",
            "net12": "c6:37:1e:88:92:94",
            "net13": "3a:b5:de:91:23:e3",
            "net14": "f6:8b:76:66:ce:18",
            "net15": "02:c4:ba:4c:88:15",
            "net16": "42:4f:90:3a:01:a9",
            "net17": "a2:4b:c7:dd:22:8c",
            "net18": "6e:24:28:f0:c8:7a",
            "net19": "ba:fc:75:eb:50:82",
            "net2": "1a:ad:c7:9a:20:9c",
            "net20": "52:73:7c:d4:af:f8",
            "net21": "be:cd:d5:3d:6d:17",
            "net22": "82:8e:b5:b8:81:4a",
            "net23": "7a:25:3f:98:35:ab",
            "net24": "f6:c5:2f:ce:a9:41",
            "net25": "6e:c7:6b:38:84:77",
            "net26": "6e:8e:07:8b:f4:5b",
            "net27": "9e:83:e0:93:2f:a0",
            "net28": "46:72:02:82:95:08",
            "net29": "ba:c8:91:fc:81:c0",
            "net3": "42:3d:4d:8e:7d:4c",
            "net30": "da:75:43:2f:85:8f",
            "net31": "f6:22:3c:fe:44:d9",
            "net4": "32:95:eb:e7:51:24",
            "net5": "6a:5c:40:15:07:c5",
            "net6": "e6:fc:20:e9:b9:68",
            "net7": "5a:97:af:fb:db:dc",
            "net8": "d6:6b:f7:a0:7b:d0",
            "net9": "52:b2:34:e7:25:07"
        },
        "spine_2_1_3": {
            "net0": "e2:9e:5d:d4:f1:69",
            "net1": "4e:df:02:7d:ea:f3",
            "net10": "2a:c3:31:c6:d1:da",
            "net11": "be:a7:c3:3e:1a:13",
            "net12": "4e:b2:c5:ff:3f:ee",
            "net13": "1e:88:f8:4a:32:57",
            "net14": "fe:8a:5b:1a:c4:65",
            "net15": "aa:1f:89:15:2c:43",
            "net16": "96:2a:fa:ea:9b:ae",
            "net17": "2e:b6:29:ab:36:17",
            "net18": "16:70:4a:8e:03:d1",
            "net19": "b2:a0:c2:f5:b6:e9",
            "net2": "a6:a1:eb:9c:21:db",
            "net20": "fa:5e:fd:f0:77:43",
            "net21": "06:57:4f:11:7a:22",
            "net22": "12:2a:ed:5d:19:40",
            "net23": "ca:2c:fb:f9:a3:d0",
            "net24": "ae:24:aa:c1:40:2a",
            "net25": "66:cb:b0:a8:d0:e6",
            "net26": "22:b6:cc:42:1e:69",
            "net27": "6a:23:23:1c:a9:17",
            "net28": "66:bb:88:4c:66:48",
            "net29": "f2:42:27:8f:49:17",
            "net3": "92:7c:4b:56:4a:36",
            "net30": "1e:9d:ea:95:ed:9e",
            "net31": "16:a0:77:c7:1d:53",
            "net4": "b2:be:96:21:0d:7b",
            "net5": "82:7c:2e:8c:5c:8e",
            "net6": "52:1a:63:8a:a2:80",
            "net7": "32:2f:1a:ab:33:0a",
            "net8": "2a:9e:67:9a:40:95",
            "net9": "56:03:fa:3a:5d:51"
        },
        "spine_2_1_4": {
            "net0": "16:c5:9a:48:72:dc",
            "net1": "1e:51:ce:48:1e:8b",
            "net10": "36:5c:39:87:9e:c0",
            "net11": "62:49:a3:31:63:df",
            "net12": "b6:d5:43:f9:c3:f7",
            "net13": "1e:6d:90:8a:c6:81",
            "net14": "d2:98:d3:59:e9:f9",
            "net15": "7e:ae:54:c4:b6:92",
            "net16": "86:01:b1:a4:83:b1",
            "net17": "3a:64:a6:88:8f:0c",
            "net18": "b6:e1:43:63:a6:ab",
            "net19": "62:fa:a0:18:8d:8b",
            "net2": "1e:71:3a:a0:09:4c",
            "net20": "a2:7c:9d:f1:d4:1d",
            "net21": "36:83:6a:95:ec:86",
            "net22": "ee:14:db:cb:7e:94",
            "net23": "2a:17:9c:86:fe:de",
            "net24": "7a:c1:d7:51:d6:a9",
            "net25": "52:4b:e6:f8:a9:b5",
            "net26": "46:07:d0:de:4f:10",
            "net27": "82:5f:46:f4:d9:db",
            "net28": "d2:12:2d:3a:59:15",
            "net29": "0a:e1:c8:47:8d:2a",
            "net3": "86:5d:cf:a8:12:0c",
            "net30": "96:65:f7:80:24:f1",
            "net31": "4e:8d:63:ae:73:47",
            "net4": "36:51:bb:85:ca:b7",
            "net5": "0e:81:db:b0:86:b0",
            "net6": "9a:95:79:53:2d:29",
            "net7": "82:f5:41:5a:f1:f4",
            "net8": "3e:57:af:2d:de:48",
            "net9": "0a:8d:3f:5b:22:e7"
        },
        "spine_2_1_5": {
            "net0": "8a:83:bf:a4:35:53",
            "net1": "0a:26:8a:2c:01:2f",
            "net10": "5e:eb:26:d5:a0:ab",
            "net11": "66:01:7a:d2:f6:c9",
            "net12": "e2:0f:e1:61:70:0e",
            "net13": "7e:8e:b4:ce:6c:01",
            "net14": "72:91:45:05:64:3e",
            "net15": "aa:57:ed:7d:78:56",
            "net16": "e6:9d:e2:02:31:61",
            "net17": "06:b9:d5:78:99:59",
            "net18": "de:06:09:54:13:c0",
            "net19": "6e:bc:17:ed:06:22",
            "net2": "ba:46:22:0a:32:2a",
            "net20": "6e:17:b1:fb:5e:eb",
            "net21": "6a:4f:c3:f9:22:ec",
            "net22": "ce:dc:ea:00:39:f3",
            "net23": "62:65:7b:71:4b:aa",
            "net24": "da:0e:5c:56:fd:1c",
            "net25": "2e:39:ed:6c:29:f9",
            "net26": "9a:54:91:3d:3a:84",
            "net27": "2a:e6:0f:d6:ef:b0",
            "net28": "52:ad:f4:62:4b:d2",
            "net29": "66:69:d9:a6:bc:87",
            "net3": "f6:47:6f:4f:45:b1",
            "net30": "c6:ba:32:f3:52:0d",
            "net31": "8a:a0:69:24:ca:e5",
            "net4": "46:b4:99:79:30:7c",
            "net5": "26:f6:ec:3f:33:66",
            "net6": "42:1d:cf:c1:4a:e3",
            "net7": "5a:f8:6c:d9:89:8e",
            "net8": "9a:77:d2:61:72:6d",
            "net9": "c6:58:b7:9b:a9:88"
        },
        "spine_2_1_6": {
            "net0": "f2:a0:3e:67:d6:d0",
            "net1": "26:d9:cf:ab:ee:21",
            "net10": "22:56:de:18:06:c4",
            "net11": "2e:53:42:23:a8:34",
            "net12": "06:6e:2e:51:4e:0c",
            "net13": "96:53:3e:06:bd:bd",
            "net14": "32:c2:e1:39:73:a0",
            "net15": "ae:bf:cb:bc:0d:00",
            "net16": "8e:40:f4:82:cd:1b",
            "net17": "6e:b4:e7:96:03:61",
            "net18": "06:e2:9e:ca:cc:02",
            "net19": "fe:00:e4:11:cc:f2",
            "net2": "ae:51:b0:6b:ce:d3",
            "net20": "0a:7c:73:e3:8f:13",
            "net21": "6e:cc:d2:f5:92:75",
            "net22": "26:3f:07:c9:27:3d",
            "net23": "e2:9e:80:e0:bb:b4",
            "net24": "c2:7e:4b:9b:a0:36",
            "net25": "9a:ae:f9:1d:6d:c9",
            "net26": "7a:78:c2:4b:d7:c6",
            "net27": "1e:a3:d3:a9:ee:18",
            "net28": "9e:de:41:19:0d:00",
            "net29": "9a:e1:08:7d:60:37",
            "net3": "f6:52:65:fd:2d:15",
            "net30": "6a:b4:d8:cf:35:b6",
            "net31": "36:3b:2c:31:0e:3f",
            "net4": "16:c6:af:a6:ec:30",
            "net5": "3e:b0:cd:b3:d3:2e",
            "net6": "32:55:1b:f3:a9:49",
            "net7": "0a:f0:3b:f6:f1:fe",
            "net8": "e6:f5:cf:8c:1b:ae",
            "net9": "56:a5:68:d0:3e:c5"
        },
        "spine_2_1_7": {
            "net0": "ba:0a:64:5f:c4:9b",
            "net1": "f6:bb:da:bb:c9:52",
            "net10": "22:d0:55:c6:53:cc",
            "net11": "c6:bd:46:c2:ed:25",
            "net12": "9a:3e:4d:39:f2:bd",
            "net13": "be:9d:96:a3:c6:71",
            "net14": "fe:8c:60:ee:cc:65",
            "net15": "9e:da:60:3d:81:8c",
            "net16": "da:d8:f0:96:7c:27",
            "net17": "36:4e:b4:18:88:c4",
            "net18": "fa:61:ec:24:fc:fe",
            "net19": "66:d8:8f:68:78:6d",
            "net2": "12:ba:3f:3e:88:a0",
            "net20": "3a:58:51:29:5c:2e",
            "net21": "06:ce:e9:5c:53:04",
            "net22": "5a:ae:7c:97:ad:fb",
            "net23": "8e:b0:69:24:65:0f",
            "net24": "0a:54:33:0c:97:93",
            "net25": "e2:a6:cc:4b:c4:c6",
            "net26": "96:be:98:eb:e4:3b",
            "net27": "fa:52:d5:25:fa:51",
            "net28": "52:65:98:9a:0a:d1",
            "net29": "f2:70:e2:7f:14:8a",
            "net3": "7e:3f:32:ba:69:fb",
            "net30": "fa:30:c2:71:34:07",
            "net31": "02:8d:f9:65:c7:2d",
            "net4": "02:04:a2:c9:7f:73",
            "net5": "12:7c:19:b0:55:6e",
            "net6": "ae:87:c9:be:bb:d1",
            "net7": "a6:fb:dd:79:d5:e6",
            "net8": "02:d6:d8:5c:b7:78",
            "net9": "22:c7:2e:fc:77:2f"
        },
        "spine_2_1_8": {
            "net0": "52:5d:a0:8b:48:a9",
            "net1": "f6:b3:97:f5:ec:df",
            "net10": "8e:20:3d:7f:ba:6a",
            "net11": "26:40:2d:a2:d8:5f",
            "net12": "02:f9:ab:fc:6c:e8",
            "net13": "4a:e2:5e:b5:ab:6a",
            "net14": "4a:23:75:c2:fd:86",
            "net15": "ce:c6:5c:5c:e3:61",
            "net16": "aa:86:16:c9:25:8d",
            "net17": "b2:45:66:a0:25:d9",
            "net18": "16:45:60:f2:b6:b4",
            "net19": "de:c3:b3:0a:f3:91",
            "net2": "1e:a9:12:56:5b:aa",
            "net20": "a2:39:43:f0:e5:72",
            "net21": "0e:74:53:b0:fe:e9",
            "net22": "be:13:40:bd:cd:25",
            "net23": "2e:38:bc:ae:89:d3",
            "net24": "e2:1f:6b:aa:f2:b7",
            "net25": "ea:9d:d0:51:a2:6c",
            "net26": "ba:d0:16:85:52:00",
            "net27": "62:60:c5:47:d1:c2",
            "net28": "a6:e2:8b:69:15:dd",
            "net29": "a6:c1:57:54:26:5d",
            "net3": "c2:d7:ba:30:35:de",
            "net30": "ea:fa:4c:51:8f:3e",
            "net31": "a2:9b:02:d9:3f:a2",
            "net4": "ae:e5:06:92:da:c9",
            "net5": "b6:51:5f:d3:c6:f9",
            "net6": "56:41:16:8b:45:d3",
            "net7": "5e:8f:4f:a7:39:4a",
            "net8": "82:81:c2:ae:45:c8",
            "net9": "fe:56:d3:56:63:34"
        },
        "spine_2_1_9": {
            "net0": "9e:75:02:63:00:64",
            "net1": "ee:34:5b:66:f2:07",
            "net10": "d2:f3:4e:02:cc:6b",
            "net11": "26:71:12:79:16:d3",
            "net12": "ca:2d:da:fc:72:4d",
            "net13": "62:76:7f:d5:b4:60",
            "net14": "f6:83:b4:66:75:f3",
            "net15": "3a:78:f6:01:74:1e",
            "net16": "d6:6d:59:5a:38:6a",
            "net17": "f6:45:e1:a6:bc:64",
            "net18": "b6:56:42:b3:19:c0",
            "net19": "8a:9f:e1:0c:5c:18",
            "net2": "1e:e9:9e:12:84:80",
            "net20": "42:31:49:8e:0a:4e",
            "net21": "2e:f6:5d:66:0c:29",
            "net22": "fe:73:d9:f6:af:28",
            "net23": "4e:f3:86:13:43:e2",
            "net24": "62:55:59:ab:ce:5a",
            "net25": "8e:3b:2b:bd:8b:88",
            "net26": "fe:9b:b8:fe:f5:c6",
            "net27": "f2:cb:eb:ce:9f:62",
            "net28": "c2:ad:a5:0b:e9:a4",
            "net29": "5e:81:2e:d3:d4:c0",
            "net3": "a2:95:69:c1:1d:14",
            "net30": "fe:8f:74:5b:28:9d",
            "net31": "06:c9:fc:22:27:98",
            "net4": "8a:6a:6b:29:99:56",
            "net5": "a2:82:59:a2:bd:01",
            "net6": "da:30:18:e1:e4:e2",
            "net7": "fa:51:46:6e:35:88",
            "net8": "76:7b:02:68:b0:e5",
            "net9": "be:35:0c:e6:a7:a3"
        },
        "tof_1_2_1": {
            "net0": "3a:e6:ee:64:7d:93",
            "net1": "82:66:93:5c:82:e1",
            "net10": "3e:7f:ed:e4:50:67",
            "net11": "a2:f4:10:44:0f:9e",
            "net12": "a6:df:f1:2e:c8:94",
            "net13": "d2:9d:1d:10:53:e6",
            "net14": "a2:97:92:36:d5:80",
            "net15": "16:37:15:53:a1:fd",
            "net16": "36:cc:4e:c0:cc:8c",
            "net17": "fa:c2:f6:57:85:65",
            "net18": "4a:3b:0c:cf:20:f9",
            "net19": "a2:02:58:53:5b:41",
            "net2": "8a:86:eb:67:29:6e",
            "net20": "aa:4b:7b:d7:50:2f",
            "net21": "fa:8f:e3:23:cf:26",
            "net22": "72:83:6d:64:9b:fa",
            "net23": "a2:08:ec:b5:6f:df",
            "net24": "06:23:b0:d0:2e:31",
            "net25": "26:9a:d5:c0:6a:d6",
            "net26": "56:93:04:b3:22:cf",
            "net27": "ce:dc:fd:15:cc:c6",
            "net28": "32:58:56:8c:f4:01",
            "net29": "3e:b9:67:5a:2c:db",
            "net3": "0a:c6:a0:4c:46:5d",
            "net30": "66:9b:b5:83:d7:77",
            "net31": "12:07:55:f1:52:63",
            "net4": "5e:b3:45:99:7e:e1",
            "net5": "56:87:de:db:48:f4",
            "net6": "9a:0d:cf:47:e4:06",
            "net7": "3a:6c:aa:62:7d:a2",
            "net8": "42:d2:4c:03:88:98",
            "net9": "de:98:61:e4:93:a2"
        },
        "tof_1_2_10": {
            "net0": "d2:ec:de:df:d1:14",
            "net1": "5a:12:ae:60:d8:fe",
            "net10": "56:b5:2f:4a:19:39",
            "net11": "ca:79:ee:e4:80:c0",
            "net12": "ae:af:c8:6c:e8:65",
            "net13": "62:2f:ff:b0:22:c8",
            "net14": "52:8a:95:db:cb:00",
            "net15": "fe:7e:f4:d5:67:37",
            "net16": "42:78:29:99:f6:05",
            "net17": "f6:09:a8:4a:d4:e8",
            "net18": "76:38:b8:a9:32:7c",
            "net19": "ae:68:ec:22:65:6d",
            "net2": "4a:66:df:b0:e4:ba",
            "net20": "5a:25:3c:38:9d:e9",
            "net21": "f6:b5:20:30:79:2b",
            "net22": "6a:e3:a0:71:bf:09",
            "net23": "62:76:a3:55:c0:96",
            "net24": "aa:04:61:48:4f:70",
            "net25": "62:60:5b:f8:ab:5a",
            "net26": "4a:e9:5e:22:96:f2",
            "net27": "3e:18:1d:89:93:d2",
            "net28": "be:9d:6d:ef:57:c6",
            "net29": "fe:93:0f:45:7d:ec",
            "net3": "42:61:93:11:2e:1b",
            "net30": "32:2f:80:87:be:0f",
            "net31": "12:d5:c5:54:2c:36",
            "net4": "6e:20:29:0d:eb:54",
            "net5": "ce:28:f2:f6:cf:c3",
            "net6": "06:77:17:72:fc:34",
            "net7": "b2:37:4a:72:77:c4",
            "net8": "ee:80:ed:8b:41:3f",
            "net9": "52:19:5b:78:6e:67"
        },
        "tof_1_2_11": {
            "net0": "e2:b4:99:83:12:3d",
            "net1": "b2:f2:21:42:7c:f8",
            "net10": "9a:a0:f2:40:c9:5f",
            "net11": "ee:a8:82:29:2d:fb",
            "net12": "86:2f:aa:fc:b7:5d",
            "net13": "5a:b7:c0:5b:fe:0b",
            "net14": "d6:46:b2:84:ae:0d",
            "net15": "ce:b5:14:ac:40:d5",
            "net16": "52:3d:2a:bd:8a:7c",
            "net17": "42:45:a0:39:d6:cc",
            "net18": "8a:be:05:2d:2e:03",
            "net19": "96:f4:34:c4:9f:1d",
            "net2": "1a:cb:46:93:74:0c",
            "net20": "2e:b8:96:38:e7:7b",
            "net21": "ca:c8:8f:25:6c:5c",
            "net22": "4a:bf:9b:fa:a5:90",
            "net23": "c2:26:18:c8:ea:2e",
            "net24": "02:f5:f8:5c:06:43",
            "net25": "16:7d:ef:6a:12:1f",
            "net26": "a2:19:c0:08:71:a0",
            "net27": "de:5f:18:ae:6c:6f",
            "net28": "92:c7:b0:aa:3d:8a",
            "net29": "76:82:c8:c8:84:d2",
            "net3": "16:f9:c0:4b:d8:01",
            "net30": "ca:52:c8:5c:cd:4e",
            "net31": "06:9a:2a:4c:c0:47",
            "net4": "2a:1a:1b:a8:46:d4",
            "net5": "ae:a1:ef:19:64:e0",
            "net6": "ba:73:eb:f3:bf:73",
            "net7": "e2:cf:60:bc:8e:13",
            "net8": "8e:a6:46:37:8c:5b",
            "net9": "1e:b9:b5:10:84:c2"
        },
        "tof_1_2_12": {
            "net0": "b6:7d:56:a0:b6:92",
            "net1": "16:c1:c6:a3:21:0e",
            "net10": "9e:fa:de:cf:96:18",
            "net11": "ba:9b:36:1c:82:e1",
            "net12": "0a:53:98:98:67:61",
            "net13": "16:4a:c4:09:ac:31",
            "net14": "be:1a:d0:4d:e8:3f",
            "net15": "2a:48:17:a5:40:5f",
            "net16": "2a:d4:5b:e3:81:f6",
            "net17": "a6:f1:df:2f:79:4e",
            "net18": "62:f8:0d:3f:c5:ff",
            "net19": "f2:44:a5:3c:11:f4",
            "net2": "46:ae:13:11:fc:30",
            "net20": "3a:a7:f8:00:fb:1d",
            "net21": "26:b3:fb:08:fc:b3",
            "net22": "5a:6a:e4:3f:19:c9",
            "net23": "5a:99:22:31:0c:8f",
            "net24": "1e:91:50:3d:32:0b",
            "net25": "c2:87:48:1f:3d:b4",
            "net26": "ea:38:81:79:45:c6",
            "net27": "02:e5:ca:72:29:39",
            "net28": "de:62:bc:58:3d:4c",
            "net29": "42:ad:49:c7:00:05",
            "net3": "a2:a9:6b:9e:da:9a",
            "net30": "02:5f:cb:0c:c1:7c",
            "net31": "8e:c9:29:79:c5:2b",
            "net4": "f6:24:01:d0:ce:45",
            "net5": "5e:cf:3b:d6:ea:c2",
            "net6": "de:04:77:7b:a7:aa",
            "net7": "3a:03:7b:c9:56:ff",
            "net8": "7a:50:6e:77:f2:e4",
            "net9": "92:4d:d3:98:01:18"
        },
        "tof_1_2_13": {
            "net0": "56:6b:fb:de:44:91",
            "net1": "6a:35:28:47:18:04",
            "net10": "96:ad:4e:fc:9f:aa",
            "net11": "9a:fc:75:24:72:62",
            "net12": "2a:cb:b4:bb:4d:b7",
            "net13": "aa:5c:a5:8e:c1:c4",
            "net14": "ae:aa:c9:cc:09:db",
            "net15": "f6:1c:75:99:75:e8",
            "net16": "46:fc:9b:24:f6:2c",
            "net17": "9e:ee:0d:39:3f:f5",
            "net18": "be:36:95:cd:07:86",
            "net19": "82:a2:3f:26:a8:b4",
            "net2": "1e:30:ab:de:07:74",
            "net20": "c6:14:19:55:38:71",
            "net21": "7a:79:6e:63:3e:d3",
            "net22": "4a:41:87:a6:88:62",
            "net23": "6e:de:52:d3:cb:86",
            "net24": "66:7a:91:06:dc:27",
            "net25": "4a:c9:62:f5:05:5e",
            "net26": "4a:d0:c6:fe:40:44",
            "net27": "ea:39:30:d9:e5:e1",
            "net28": "8e:21:69:f4:0c:60",
            "net29": "82:a6:73:4e:dc:b2",
            "net3": "8a:67:88:8b:b9:70",
            "net30": "36:f2:9c:28:4b:7e",
            "net31": "d2:42:19:74:ac:d0",
            "net4": "ba:f1:9e:b1:0a:0b",
            "net5": "fe:c9:55:62:43:cc",
            "net6": "1e:98:78:8d:9b:bd",
            "net7": "46:40:8c:7a:72:8a",
            "net8": "42:57:b7:5e:b5:38",
            "net9": "a2:d8:cc:70:37:f8"
        },
        "tof_1_2_14": {
            "net0": "82:80:7a:a1:9c:ae",
            "net1": "8a:6c:72:a2:37:fd",
            "net10": "36:78:9d:16:c8:10",
            "net11": "4e:80:74:be:66:a4",
            "net12": "72:6d:4d:cf:b0:72",
            "net13": "e2:55:1d:76:97:16",
            "net14": "c2:96:94:45:05:db",
            "net15": "3e:81:0c:cf:31:6b",
            "net16": "72:fb:f3:a3:20:f6",
            "net17": "8a:ac:09:b7:fb:bc",
            "net18": "f6:68:3c:f7:e9:25",
            "net19": "32:a6:4a:bc:e2:31",
            "net2": "76:3d:c5:62:f7:47",
            "net20": "32:d4:3c:54:e0:02",
            "net21": "da:42:08:a9:fc:5d",
            "net22": "ea:ce:8a:d7:58:f0",
            "net23": "26:17:c0:70:80:0f",
            "net24": "36:0f:65:c3:19:f8",
            "net25": "72:23:54:68:fe:18",
            "net26": "4a:5c:71:1a:0e:89",
            "net27": "76:41:c6:72:b4:38",
            "net28": "82:e9:57:35:e6:37",
            "net29": "16:d5:7f:34:b6:65",
            "net3": "3a:fe:cf:ff:78:20",
            "net30": "06:18:b0:02:ce:6d",
            "net31": "ee:88:bf:4e:6d:9e",
            "net4": "a6:1a:9f:5c:93:bd",
            "net5": "e2:12:7d:73:99:2e",
            "net6": "8a:05:18:c7:b9:d5",
            "net7": "de:b4:7d:09:24:ca",
            "net8": "9e:b2:14:c2:5a:69",
            "net9": "92:34:73:85:cf:c7"
        },
        "tof_1_2_15": {
            "net0": "96:cb:92:7f:8c:69",
            "net1": "8e:11:42:e7:57:16",
            "net10": "0a:82:03:23:d4:d4",
            "net11": "0e:43:e3:05:06:75",
            "net12": "ca:96:c6:56:08:00",
            "net13": "a6:03:10:1c:f5:ce",
            "net14": "46:24:48:f5:fc:04",
            "net15": "9a:b9:cb:37:62:b7",
            "net16": "26:c2:f8:ea:29:29",
            "net17": "8e:3b:50:1f:01:37",
            "net18": "3a:0a:4d:cf:6e:82",
            "net19": "52:ca:cb:0b:95:9f",
            "net2": "42:46:8a:26:1a:83",
            "net20": "16:33:38:12:c5:a9",
            "net21": "f2:d5:3c:ec:29:d1",
            "net22": "66:dc:02:c3:da:ff",
            "net23": "a2:79:29:35:8a:01",
            "net24": "8a:62:9e:c6:42:b0",
            "net25": "ba:43:50:79:b2:a9",
            "net26": "8e:75:c6:4b:32:c2",
            "net27": "46:84:88:58:a7:1a",
            "net28": "ca:06:af:a3:23:4a",
            "net29": "ca:83:59:f1:ce:e8",
            "net3": "16:de:b8:e6:10:17",
            "net30": "26:14:24:0f:4e:13",
            "net31": "4e:2b:13:46:84:c2",
            "net4": "da:e6:8b:46:5c:13",
            "net5": "56:f4:4a:b4:69:b7",
            "net6": "ea:e5:e2:cf:5d:0e",
            "net7": "f6:6a:8b:b6:fc:dd",
            "net8": "42:e7:3e:48:c3:9e",
            "net9": "52:29:ea:b4:19:e3"
        },
        "tof_1_2_16": {
            "net0": "92:aa:95:af:6e:08",
            "net1": "6e:59:89:d3:82:7d",
            "net10": "9e:32:4a:af:75:44",
            "net11": "ca:be:fd:96:3b:10",
            "net12": "7a:2f:08:62:1e:d8",
            "net13": "7e:63:be:e9:1b:00",
            "net14": "5e:fb:c2:51:8e:6a",
            "net15": "aa:f7:bd:8b:1c:91",
            "net16": "5e:2a:e2:95:b0:6a",
            "net17": "b6:86:93:a6:4d:e7",
            "net18": "0a:66:14:19:3e:ba",
            "net19": "92:13:98:bc:14:96",
            "net2": "82:5e:15:a8:66:34",
            "net20": "d6:43:f2:26:fd:95",
            "net21": "26:03:91:28:b6:15",
            "net22": "66:bc:e7:8f:cf:b0",
            "net23": "46:87:bf:b7:59:6d",
            "net24": "8a:d1:2c:ac:02:00",
            "net25": "56:f6:a8:30:19:f0",
            "net26": "b6:36:82:b9:51:ab",
            "net27": "6e:03:07:d9:d0:0d",
            "net28": "12:84:bb:e5:c6:58",
            "net29": "3a:6d:63:72:63:4d",
            "net3": "26:18:74:5d:fe:01",
            "net30": "0a:8e:65:1e:2f:ca",
            "net31": "52:22:90:8a:3f:a1",
            "net4": "aa:04:92:0e:d8:63",
            "net5": "da:32:8c:8a:dd:32",
            "net6": "0a:3d:a5:0b:59:93",
            "net7": "4a:69:95:49:b1:cb",
            "net8": "56:0d:f7:fa:29:7c",
            "net9": "3e:e5:f3:c4:46:7a"
        },
        "tof_1_2_2": {
            "net0": "c2:b7:3c:df:74:f9",
            "net1": "46:68:29:66:c8:37",
            "net10": "9a:53:cb:2f:2a:23",
            "net11": "7a:3b:c6:b9:67:1b",
            "net12": "4a:2c:6c:07:3b:73",
            "net13": "ee:61:94:fc:0a:52",
            "net14": "b6:c2:de:a7:ab:48",
            "net15": "a2:a0:9c:8a:f8:89",
            "net16": "d6:a1:14:be:a5:9a",
            "net17": "da:6a:e5:c4:b7:93",
            "net18": "8e:d1:7a:06:9b:42",
            "net19": "da:2a:17:d3:c3:d0",
            "net2": "e6:46:28:e5:70:2a",
            "net20": "1a:70:c6:ed:97:73",
            "net21": "0a:62:38:6c:be:b5",
            "net22": "9a:b9:2d:d1:d0:98",
            "net23": "72:fc:5e:36:d4:a5",
            "net24": "56:7d:3d:30:92:87",
            "net25": "d2:a7:e2:47:05:56",
            "net26": "0a:eb:a8:0e:39:2d",
            "net27": "9a:d6:44:27:31:0c",
            "net28": "1e:1c:be:51:92:04",
            "net29": "52:2b:e4:a4:ab:34",
            "net3": "7a:b7:77:30:21:ca",
            "net30": "0a:4c:cb:9d:2f:4c",
            "net31": "9e:7a:4b:7f:ac:12",
            "net4": "6e:72:a7:2b:c6:4f",
            "net5": "62:58:3f:f8:dc:4a",
            "net6": "de:9d:a4:02:af:d3",
            "net7": "0e:86:05:8e:a2:84",
            "net8": "da:c0:c9:6f:d5:e5",
            "net9": "2a:62:af:6d:75:ef"
        },
        "tof_1_2_3": {
            "net0": "ee:69:a5:9d:3a:66",
            "net1": "da:0b:e1:b5:10:1a",
            "net10": "c6:b3:ec:1f:89:70",
            "net11": "72:f5:af:f6:6c:bc",
            "net12": "ce:a6:92:ee:38:2e",
            "net13": "76:37:1d:e5:b4:ce",
            "net14": "fa:53:1a:ed:8b:03",
            "net15": "ce:6b:d9:81:c9:86",
            "net16": "4e:c0:01:39:d2:bb",
            "net17": "0a:77:63:d9:3d:d7",
            "net18": "ea:f5:72:67:fb:0a",
            "net19": "62:44:7a:cd:19:13",
            "net2": "86:ef:0c:8c:72:6c",
            "net20": "06:50:cf:16:df:21",
            "net21": "1a:e4:ae:60:9d:82",
            "net22": "fa:71:28:e4:50:88",
            "net23": "36:c0:5f:fd:e6:ba",
            "net24": "92:3a:76:32:e4:c2",
            "net25": "2a:a3:41:a2:3a:4c",
            "net26": "82:5e:fc:a0:ae:09",
            "net27": "b2:72:c6:2f:ff:13",
            "net28": "66:44:d3:31:66:67",
            "net29": "f2:b1:0e:9f:83:78",
            "net3": "ba:47:29:e9:62:78",
            "net30": "c6:03:e3:79:90:1a",
            "net31": "96:64:3c:72:48:5b",
            "net4": "c2:74:ab:e0:7f:5f",
            "net5": "0e:a3:50:ba:1f:da",
            "net6": "86:f3:95:1d:b1:87",
            "net7": "b6:77:95:f6:74:cd",
            "net8": "2e:ac:47:46:ce:20",
            "net9": "26:e5:fa:59:23:4f"
        },
        "tof_1_2_4": {
            "net0": "62:7d:c7:c2:65:e1",
            "net1": "6e:d7:ae:74:df:f8",
            "net10": "3a:15:32:fb:9f:ba",
            "net11": "1a:0a:87:9b:fb:fe",
            "net12": "ca:4c:9b:36:de:cf",
            "net13": "6a:3b:8b:8a:5f:68",
            "net14": "ce:28:b3:46:81:da",
            "net15": "52:72:02:18:83:d6",
            "net16": "ba:b6:c2:4b:96:65",
            "net17": "c6:24:72:37:bb:41",
            "net18": "12:38:28:af:2b:1f",
            "net19": "76:15:a1:87:9d:62",
            "net2": "52:1e:0d:fd:9b:54",
            "net20": "06:92:af:1e:50:fc",
            "net21": "2e:17:8a:79:05:06",
            "net22": "42:cb:88:71:72:15",
            "net23": "ee:15:45:56:20:54",
            "net24": "12:3b:92:55:6a:12",
            "net25": "56:dd:f3:6f:fd:0a",
            "net26": "82:bf:e4:d7:d4:84",
            "net27": "ba:31:17:af:28:93",
            "net28": "56:6c:39:14:fa:95",
            "net29": "8e:73:a2:5c:ad:9b",
            "net3": "82:0d:68:f8:4e:08",
            "net30": "be:d6:fa:bc:5d:7e",
            "net31": "0e:d0:38:5b:c8:56",
            "net4": "da:b1:ae:68:2c:0c",
            "net5": "96:72:e7:0d:42:13",
            "net6": "8a:16:62:8a:e6:2c",
            "net7": "86:53:19:2a:13:52",
            "net8": "de:ab:ad:b2:f1:57",
            "net9": "16:96:95:b9:b6:39"
        },
        "tof_1_2_5": {
            "net0": "be:df:97:71:7f:50",
            "net1": "a6:fd:05:c9:6a:22",
            "net10": "3e:49:8e:fa:16:70",
            "net11": "6a:33:e0:41:40:fd",
            "net12": "3e:57:a2:c3:31:8b",
            "net13": "4e:10:90:04:a5:70",
            "net14": "26:c1:2e:3d:94:b3",
            "net15": "ba:0f:ef:7c:a7:ad",
            "net16": "b6:2b:f5:1b:dd:1d",
            "net17": "de:07:e4:9c:93:c7",
            "net18": "e6:bb:09:af:26:b7",
            "net19": "56:5f:0d:c4:34:b1",
            "net2": "2a:b1:5c:46:d4:0d",
            "net20": "0e:46:06:fa:9a:4b",
            "net21": "8e:8b:5c:ff:da:10",
            "net22": "d6:aa:ea:c1:2c:9a",
            "net23": "8a:49:85:02:da:bb",
            "net24": "ca:c0:6c:c6:fe:7c",
            "net25": "ee:0f:ea:88:63:ca",
            "net26": "1a:d4:2b:1e:b5:06",
            "net27": "52:f6:69:1f:f4:14",
            "net28": "4e:e2:fe:85:40:dc",
            "net29": "b6:16:f1:8e:79:80",
            "net3": "1a:8d:16:3f:e3:d5",
            "net30": "4e:b8:28:e0:b1:dd",
            "net31": "ea:4f:93:1b:ea:65",
            "net4": "da:4b:6c:91:97:ae",
            "net5": "6e:dd:c4:34:84:42",
            "net6": "ea:01:b4:43:7d:a3",
            "net7": "26:cb:8c:5e:a0:a7",
            "net8": "12:19:6a:23:bd:4b",
            "net9": "06:2c:78:8b:51:42"
        },
        "tof_1_2_6": {
            "net0": "3a:a6:d6:c3:ca:a6",
            "net1": "d6:01:79:bf:96:22",
            "net10": "be:1e:25:be:ce:36",
            "net11": "de:39:1c:88:77:0c",
            "net12": "a2:a2:63:31:b6:ec",
            "net13": "02:52:fe:48:71:0b",
            "net14": "36:f4:e2:e3:37:94",
            "net15": "fe:ac:cd:a5:c1:aa",
            "net16": "f2:ef:4d:1b:0e:2d",
            "net17": "56:87:68:5e:b9:8b",
            "net18": "fe:67:97:d1:c4:d9",
            "net19": "46:3a:48:4b:6a:89",
            "net2": "f6:ff:35:64:39:d2",
            "net20": "b6:85:a8:8b:f0:a9",
            "net21": "82:b9:e4:c8:97:c9",
            "net22": "c6:b9:9e:a7:09:15",
            "net23": "0a:0f:c7:48:0b:d6",
            "net24": "7a:ff:af:f8:58:a0",
            "net25": "0e:60:26:52:8f:9a",
            "net26": "5a:30:03:ec:9e:28",
            "net27": "8e:65:e6:7d:b8:dd",
            "net28": "46:59:5c:d8:25:81",
            "net29": "5a:23:d7:b3:5b:83",
            "net3": "5e:16:d9:b4:99:5a",
            "net30": "f6:96:3e:84:9b:2a",
            "net31": "d6:ab:e4:30:61:c5",
            "net4": "1a:91:17:d2:32:d8",
            "net5": "56:0e:3a:41:d6:b0",
            "net6": "a2:bd:c8:83:ff:a7",
            "net7": "ea:b8:f1:0f:4a:24",
            "net8": "82:64:60:c0:31:68",
            "net9": "e2:d0:7e:d2:1a:c7"
        },
        "tof_1_2_7": {
            "net0": "fa:ab:7d:37:e0:37",
            "net1": "ce:b9:89:ff:6f:33",
            "net10": "fe:68:9e:46:92:75",
            "net11": "32:4a:1d:7e:49:e3",
            "net12": "2a:cf:95:19:be:f7",
            "net13": "b2:8b:2f:f5:d9:78",
            "net14": "d6:a3:c7:ac:1f:84",
            "net15": "2a:a4:2a:86:0d:94",
            "net16": "62:d2:3f:d5:0b:25",
            "net17": "aa:8a:3c:b2:3b:32",
            "net18": "3a:a3:c7:5b:92:57",
            "net19": "1e:66:aa:ce:1d:f3",
            "net2": "56:85:12:8a:68:77",
            "net20": "9e:98:91:55:91:65",
            "net21": "82:91:f8:d9:e9:83",
            "net22": "26:c1:2d:45:ba:83",
            "net23": "46:f2:e6:4d:e8:53",
            "net24": "1a:f3:d3:4d:f7:15",
            "net25": "e2:56:14:bb:4c:9e",
            "net26": "6e:a6:64:2b:da:18",
            "net27": "8e:1e:14:bd:9b:b3",
            "net28": "fe:6c:dd:ea:2c:00",
            "net29": "42:ae:83:39:4a:00",
            "net3": "c6:aa:a9:6d:08:b6",
            "net30": "56:81:40:df:74:fb",
            "net31": "5a:0b:44:49:37:a4",
            "net4": "16:5a:a4:ad:97:3a",
            "net5": "3a:36:d2:39:cc:74",
            "net6": "9a:08:3c:51:d5:2a",
            "net7": "ca:7a:04:16:a8:30",
            "net8": "02:a7:c5:a0:ff:df",
            "net9": "c6:d6:1e:3e:9c:79"
        },
        "tof_1_2_8": {
            "net0": "7a:8c:d5:f5:95:66",
            "net1": "7e:fa:b8:31:10:5e",
            "net10": "56:13:0f:43:76:3f",
            "net11": "1e:ef:eb:20:6c:02",
            "net12": "62:9a:0e:04:2b:35",
            "net13": "da:92:90:cf:ba:dd",
            "net14": "ca:34:bc:62:24:9e",
            "net15": "9e:1c:11:db:c7:b8",
            "net16": "9a:63:10:12:be:b7",
            "net17": "66:54:2b:d3:67:7e",
            "net18": "e6:e3:d7:16:ca:68",
            "net19": "be:41:0f:04:15:0d",
            "net2": "46:07:7d:d0:ce:3c",
            "net20": "c6:18:54:67:91:60",
            "net21": "66:69:3e:1f:2b:55",
            "net22": "32:fd:ea:cb:e5:96",
            "net23": "9a:b6:aa:9d:02:93",
            "net24": "86:09:f6:9c:ed:99",
            "net25": "aa:15:c0:0e:d9:6f",
            "net26": "02:38:e1:1a:3c:29",
            "net27": "a2:8a:02:e8:96:93",
            "net28": "ca:05:6b:2a:01:fd",
            "net29": "aa:e1:30:2b:67:14",
            "net3": "06:c4:35:b9:3d:34",
            "net30": "8a:94:05:15:7c:28",
            "net31": "aa:38:52:50:82:3b",
            "net4": "3a:d5:11:db:49:30",
            "net5": "ee:c9:13:e8:c2:51",
            "net6": "8a:60:db:80:cf:d0",
            "net7": "26:da:13:eb:da:1f",
            "net8": "96:fc:18:18:8a:8b",
            "net9": "a2:7c:72:85:f1:f5"
        },
        "tof_1_2_9": {
            "net0": "ca:d9:85:eb:7e:81",
            "net1": "8a:43:68:df:0e:2f",
            "net10": "2a:21:35:28:89:17",
            "net11": "72:a7:f7:e7:8f:49",
            "net12": "36:05:b6:dd:4d:6a",
            "net13": "0e:6c:ea:69:21:c1",
            "net14": "da:87:75:46:d1:08",
            "net15": "a2:e1:9b:56:1d:69",
            "net16": "02:ac:58:aa:49:29",
            "net17": "6a:bb:44:8c:5e:ae",
            "net18": "a2:4a:37:05:0e:1d",
            "net19": "8a:46:9c:4a:e7:49",
            "net2": "8e:91:e2:c5:cd:07",
            "net20": "12:c8:63:fc:c5:76",
            "net21": "22:53:0d:ff:f3:8d",
            "net22": "5e:5a:41:a6:7f:63",
            "net23": "ea:65:0a:32:12:4d",
            "net24": "3e:08:59:4d:3d:9f",
            "net25": "8e:7a:94:9d:7a:01",
            "net26": "ce:fc:74:6a:8d:10",
            "net27": "2a:89:5b:74:6b:2e",
            "net28": "3a:1f:57:a1:2d:04",
            "net29": "4e:e4:43:a0:81:41",
            "net3": "82:53:89:2c:32:22",
            "net30": "d6:80:ea:ee:42:60",
            "net31": "42:19:92:ad:d3:1a",
            "net4": "0a:d0:03:44:32:e8",
            "net5": "3a:61:e7:0e:51:28",
            "net6": "8a:f1:aa:65:76:31",
            "net7": "8e:82:e4:df:13:48",
            "net8": "4e:92:43:b0:4f:59",
            "net9": "d6:93:04:29:a3:06"
        }
    },
    "failed_machine": "spine_1_1_1",
    "failed_interfaces": [
        "net16"
    ],
    "failure_time": 1616414842.1621022,
    "recover_time": 1616414954.5107625
}