{
    "description": "Scenario 3b: Spine spine_1_1_1 failure with BGP",
    "k_leaf": 8,
    "k_top": 8,
    "redundancy_factor": 2,
    "is_k8s": true,
    "machine_mac_addresses": {
        "leaf_1_0_1": {
            "net0": "5e:00:9d:d3:f5:31",
            "net1": "9a:3b:0f:14:32:5e",
            "net2": "be:3b:ec:66:c0:d6",
            "net3": "ca:30:be:55:26:aa",
            "net4": "4a:eb:79:07:f7:37",
            "net5": "56:67:3d:73:8b:5a",
            "net6": "9a:e5:da:e1:13:df",
            "net7": "7a:ba:94:43:c0:11",
            "net8": "12:cf:d9:f0:bb:53"
        },
        "leaf_1_0_2": {
            "net0": "56:bc:d4:b6:93:61",
            "net1": "5a:9c:ba:ec:ce:2c",
            "net2": "ce:92:e3:00:11:0a",
            "net3": "36:bf:d8:8b:bf:85",
            "net4": "aa:5d:14:4f:ab:ae",
            "net5": "62:16:4e:a4:82:8c",
            "net6": "7e:0d:d4:bb:eb:72",
            "net7": "36:dd:f5:de:01:6a",
            "net8": "a6:41:81:57:7a:c7"
        },
        "leaf_1_0_3": {
            "net0": "fe:ec:e3:d9:ea:83",
            "net1": "12:7d:5d:3f:d9:7b",
            "net2": "ee:2f:63:7e:e0:66",
            "net3": "3a:11:42:69:60:52",
            "net4": "26:6a:82:82:7e:cc",
            "net5": "72:2a:e3:5a:f8:98",
            "net6": "26:ae:31:a2:49:e1",
            "net7": "66:a6:d1:fe:d7:2d",
            "net8": "06:c7:01:55:06:f5"
        },
        "leaf_1_0_4": {
            "net0": "9a:3e:7b:2b:79:e6",
            "net1": "56:11:d7:93:6e:66",
            "net2": "0e:bf:fc:d7:b4:27",
            "net3": "a6:ec:3f:e0:1e:41",
            "net4": "c2:06:2c:e3:80:7c",
            "net5": "e2:14:d5:b4:c4:89",
            "net6": "02:0c:92:65:a7:68",
            "net7": "46:73:3b:b9:2a:df",
            "net8": "ba:6f:5d:33:1e:b0"
        },
        "leaf_1_0_5": {
            "net0": "c6:7c:24:b7:41:14",
            "net1": "ee:0c:4a:1d:70:e4",
            "net2": "0e:00:e8:0f:df:00",
            "net3": "d2:6c:75:17:15:87",
            "net4": "ee:c8:1a:84:92:32",
            "net5": "96:71:85:f6:f6:6f",
            "net6": "7a:6b:39:19:e4:7b",
            "net7": "32:85:09:6d:04:a4",
            "net8": "6a:b5:79:bf:0b:f7"
        },
        "leaf_1_0_6": {
            "net0": "d2:20:54:60:8b:c7",
            "net1": "02:ae:b9:95:0b:46",
            "net2": "7e:93:0c:12:b5:4a",
            "net3": "2e:cc:c3:ac:03:bc",
            "net4": "ee:41:cd:dd:6c:6e",
            "net5": "9e:7c:30:0e:17:8f",
            "net6": "fa:91:2a:e8:eb:42",
            "net7": "86:ea:0b:48:50:27",
            "net8": "b2:ee:04:da:b9:07"
        },
        "leaf_1_0_7": {
            "net0": "7a:f2:7f:ea:07:24",
            "net1": "62:59:4e:45:77:e0",
            "net2": "42:53:77:6e:24:54",
            "net3": "f2:bd:9d:18:91:46",
            "net4": "26:3f:75:c8:f1:db",
            "net5": "e2:bf:5e:33:cd:de",
            "net6": "2a:67:6c:b6:ce:7b",
            "net7": "9a:e1:66:ad:bd:ce",
            "net8": "ee:ae:c2:d6:88:36"
        },
        "leaf_1_0_8": {
            "net0": "a2:40:72:b8:75:64",
            "net1": "7a:8a:ba:a7:67:42",
            "net2": "7a:83:5a:ed:6b:77",
            "net3": "12:1d:66:02:99:db",
            "net4": "ce:88:d6:b3:a8:28",
            "net5": "22:58:10:18:b6:f1",
            "net6": "72:3d:26:50:d5:ec",
            "net7": "06:cf:b3:df:7f:8f",
            "net8": "e2:62:7b:fd:65:0d"
        },
        "leaf_2_0_1": {
            "net0": "06:fe:72:2d:9e:2f",
            "net1": "7e:88:2f:7e:f4:5b",
            "net2": "42:3b:08:9c:40:08",
            "net3": "a6:b1:57:c9:8d:94",
            "net4": "2a:86:14:34:5e:85",
            "net5": "f2:11:fa:b3:c3:b8",
            "net6": "ce:72:52:4b:09:b5",
            "net7": "2e:f8:43:d0:67:9d",
            "net8": "de:b8:8f:f8:39:f3"
        },
        "leaf_2_0_2": {
            "net0": "b2:35:b2:53:75:49",
            "net1": "6a:9f:67:50:26:f3",
            "net2": "e2:12:10:77:ff:f9",
            "net3": "ce:81:5a:9c:bd:1e",
            "net4": "1e:47:11:af:66:04",
            "net5": "5a:93:b4:98:a7:17",
            "net6": "c2:d0:15:f9:a6:64",
            "net7": "82:0e:ca:50:ff:60",
            "net8": "b2:8c:77:6b:25:0e"
        },
        "leaf_2_0_3": {
            "net0": "02:c3:e3:50:3b:20",
            "net1": "ca:b7:18:81:db:2f",
            "net2": "b6:1c:fc:8f:a6:cd",
            "net3": "5a:d5:bd:03:1a:22",
            "net4": "1a:af:b0:ae:b5:16",
            "net5": "0a:24:58:fd:ef:b0",
            "net6": "e2:b5:e5:b9:8d:e2",
            "net7": "8e:f6:ed:9d:33:32",
            "net8": "ce:79:4e:22:82:5c"
        },
        "leaf_2_0_4": {
            "net0": "be:b5:06:88:30:a4",
            "net1": "ea:f6:ba:2a:18:9b",
            "net2": "22:79:c1:4e:eb:c6",
            "net3": "96:8a:8e:a0:db:1d",
            "net4": "56:cd:ca:d4:3f:fa",
            "net5": "ae:79:83:ea:cd:29",
            "net6": "de:05:d9:02:13:88",
            "net7": "3e:8d:4e:37:7e:9b",
            "net8": "e6:1a:80:30:c1:20"
        },
        "leaf_2_0_5": {
            "net0": "96:02:e7:11:54:45",
            "net1": "0e:18:a9:09:25:5b",
            "net2": "4e:cf:66:d0:8d:16",
            "net3": "3a:6b:da:be:94:8e",
            "net4": "ce:f4:1f:ac:6c:de",
            "net5": "52:82:0c:b5:69:56",
            "net6": "6a:57:6e:36:c4:1a",
            "net7": "ba:94:67:59:ea:42",
            "net8": "62:6f:6d:66:bf:7a"
        },
        "leaf_2_0_6": {
            "net0": "76:b9:f8:17:73:a5",
            "net1": "de:d6:3b:f9:26:db",
            "net2": "5a:fc:0d:bd:ca:85",
            "net3": "5a:78:50:aa:64:e4",
            "net4": "9a:96:84:8b:40:4d",
            "net5": "62:e3:22:46:43:80",
            "net6": "7a:f3:f1:6d:7e:5a",
            "net7": "56:7e:a4:d9:25:c6",
            "net8": "8a:0d:60:2a:f9:3e"
        },
        "leaf_2_0_7": {
            "net0": "22:d3:c1:f2:35:3c",
            "net1": "76:ea:1c:ff:5b:d0",
            "net2": "f6:3b:ed:f7:49:a7",
            "net3": "2e:c0:17:dc:4c:f6",
            "net4": "76:f1:c4:bb:fd:5f",
            "net5": "c6:6f:c9:2f:7b:98",
            "net6": "c6:8e:06:96:0f:51",
            "net7": "56:47:6a:66:04:94",
            "net8": "76:8d:f2:85:96:b1"
        },
        "leaf_2_0_8": {
            "net0": "96:f0:84:d6:44:6e",
            "net1": "f2:9e:c2:45:c1:58",
            "net2": "36:12:71:46:b9:38",
            "net3": "3e:96:08:e1:3b:c3",
            "net4": "2e:4a:42:4c:86:29",
            "net5": "82:7d:61:4d:93:4c",
            "net6": "b6:3d:d1:37:61:b2",
            "net7": "b6:28:d7:c3:20:b1",
            "net8": "ea:31:98:ca:84:ce"
        },
        "leaf_3_0_1": {
            "net0": "c6:95:ed:a0:f8:a5",
            "net1": "ea:ab:8f:c0:7a:1d",
            "net2": "02:5c:31:13:79:cd",
            "net3": "06:28:20:82:b0:8c",
            "net4": "82:37:ac:97:b7:54",
            "net5": "82:c9:f2:6b:14:34",
            "net6": "5a:63:a5:31:25:b4",
            "net7": "ee:97:67:b6:06:6f",
            "net8": "a2:e5:00:a5:28:36"
        },
        "leaf_3_0_2": {
            "net0": "2a:92:96:d3:e0:b8",
            "net1": "ea:11:f7:71:83:24",
            "net2": "02:ba:1a:e2:7e:4e",
            "net3": "92:bd:8e:06:9a:0c",
            "net4": "0a:23:f3:d3:ab:c3",
            "net5": "c2:dd:3a:57:fe:6c",
            "net6": "2a:d2:ba:37:bd:8f",
            "net7": "ce:56:1e:34:70:b4",
            "net8": "de:6a:24:54:b8:40"
        },
        "leaf_3_0_3": {
            "net0": "12:0a:96:de:f4:c5",
            "net1": "fe:47:31:38:ad:67",
            "net2": "d2:56:16:b9:6e:12",
            "net3": "e6:a8:8f:e0:30:a7",
            "net4": "8a:f4:47:6d:a5:bd",
            "net5": "5a:26:6c:5b:81:10",
            "net6": "ae:45:12:d5:bc:3b",
            "net7": "06:6e:fa:cb:68:9d",
            "net8": "e6:b6:58:a6:2f:9a"
        },
        "leaf_3_0_4": {
            "net0": "32:16:fe:07:85:57",
            "net1": "fa:11:a8:7e:38:75",
            "net2": "ba:b0:39:4c:8b:9f",
            "net3": "7a:6a:67:1b:af:10",
            "net4": "c2:00:da:af:47:8f",
            "net5": "1e:47:b7:29:d5:41",
            "net6": "9a:28:6f:32:1c:2b",
            "net7": "ca:f4:5e:b6:14:66",
            "net8": "9a:77:e3:4b:ed:24"
        },
        "leaf_3_0_5": {
            "net0": "62:b8:29:8f:b7:c6",
            "net1": "b2:4d:d7:49:54:f8",
            "net2": "22:4f:8d:c4:9a:cc",
            "net3": "66:d3:1e:da:3f:28",
            "net4": "da:9c:16:d4:9f:5b",
            "net5": "0e:ad:62:a8:51:8f",
            "net6": "ba:e3:d5:e5:21:fb",
            "net7": "76:e8:2b:4c:a6:76",
            "net8": "7a:49:02:f1:16:66"
        },
        "leaf_3_0_6": {
            "net0": "8e:e3:8d:e6:e8:d8",
            "net1": "a2:d3:aa:b8:47:18",
            "net2": "5e:ff:a1:c9:9d:ea",
            "net3": "f6:31:41:d7:5c:51",
            "net4": "de:c9:54:6e:46:63",
            "net5": "46:3b:e7:e4:ed:46",
            "net6": "72:16:62:b5:2d:da",
            "net7": "72:ac:05:88:4a:72",
            "net8": "72:82:91:89:4d:2a"
        },
        "leaf_3_0_7": {
            "net0": "16:0d:6d:d5:16:33",
            "net1": "ca:8f:81:1f:58:b3",
            "net2": "d2:5b:b9:2b:03:30",
            "net3": "86:c9:7d:9d:ec:03",
            "net4": "0a:2b:ad:2f:14:a5",
            "net5": "b2:b9:d7:c5:fc:ae",
            "net6": "16:bf:fa:61:17:ae",
            "net7": "2a:5d:a5:01:cb:0c",
            "net8": "a6:1c:9c:35:53:8f"
        },
        "leaf_3_0_8": {
            "net0": "ae:a4:bb:b6:8d:03",
            "net1": "e6:0b:7e:3b:ea:f4",
            "net2": "76:ec:21:9c:13:86",
            "net3": "6e:58:56:66:2a:e5",
            "net4": "3e:9e:a2:42:ff:c8",
            "net5": "0a:d1:48:d5:3e:92",
            "net6": "0e:6d:88:64:a6:44",
            "net7": "b2:05:d8:d9:be:97",
            "net8": "2e:5e:7f:3a:51:15"
        },
        "leaf_4_0_1": {
            "net0": "da:56:79:f9:5a:70",
            "net1": "92:56:9d:b3:3c:df",
            "net2": "76:fa:c8:92:9d:06",
            "net3": "e6:7d:fa:78:70:95",
            "net4": "66:f4:8d:2c:73:be",
            "net5": "8e:dc:95:62:6f:82",
            "net6": "6e:5a:c8:65:8d:d1",
            "net7": "8e:02:a5:2c:a1:6a",
            "net8": "9e:59:b6:ab:24:31"
        },
        "leaf_4_0_2": {
            "net0": "ca:01:1d:4c:d2:6d",
            "net1": "ba:23:a5:f1:62:cb",
            "net2": "6a:4a:c4:63:14:c3",
            "net3": "ca:19:f9:42:2a:4e",
            "net4": "96:c4:f9:24:4c:72",
            "net5": "8a:eb:fe:a6:10:97",
            "net6": "22:28:b3:a0:11:c1",
            "net7": "26:1d:79:7f:1c:6c",
            "net8": "36:55:3b:c5:da:92"
        },
        "leaf_4_0_3": {
            "net0": "16:6b:1e:a7:33:18",
            "net1": "06:a1:eb:05:22:3e",
            "net2": "62:20:43:24:33:9e",
            "net3": "16:60:50:b1:31:e6",
            "net4": "96:ba:08:6d:e1:aa",
            "net5": "8a:17:c0:c7:80:0e",
            "net6": "fa:a9:80:84:9d:96",
            "net7": "8e:11:4d:92:1f:56",
            "net8": "8a:64:54:9f:31:f3"
        },
        "leaf_4_0_4": {
            "net0": "f6:49:6b:4b:fb:e2",
            "net1": "d6:dc:f2:eb:d6:25",
            "net2": "86:9e:cf:8e:02:93",
            "net3": "46:32:cb:24:f9:76",
            "net4": "92:74:88:dc:c4:de",
            "net5": "12:53:f8:d8:0d:f7",
            "net6": "fe:6f:22:e8:73:ef",
            "net7": "e6:cf:e1:d6:6c:e7",
            "net8": "fa:01:b7:88:5f:2d"
        },
        "leaf_4_0_5": {
            "net0": "ee:28:1b:5d:d7:34",
            "net1": "fa:52:f8:b6:fa:9b",
            "net2": "b6:3e:5a:64:9b:9d",
            "net3": "ae:96:1a:3f:b6:ae",
            "net4": "5e:0a:08:13:ff:9d",
            "net5": "36:e9:55:c5:89:a5",
            "net6": "22:43:0c:1b:a6:9a",
            "net7": "a6:0a:c1:13:e7:20",
            "net8": "d6:b5:d0:4d:e5:92"
        },
        "leaf_4_0_6": {
            "net0": "ca:2f:de:34:9a:49",
            "net1": "7e:d8:2f:1e:ab:72",
            "net2": "36:61:44:10:1f:bf",
            "net3": "0e:76:41:77:38:3d",
            "net4": "5a:03:83:23:73:c8",
            "net5": "ca:bc:82:2e:ec:d4",
            "net6": "5e:a6:27:90:f0:b8",
            "net7": "76:44:94:c1:a2:53",
            "net8": "b2:3c:4f:53:0d:ec"
        },
        "leaf_4_0_7": {
            "net0": "c2:5e:97:57:fc:51",
            "net1": "a2:8b:77:fb:cc:d1",
            "net2": "6a:c3:6c:ac:d3:bf",
            "net3": "86:0a:99:83:5d:81",
            "net4": "b6:99:c1:05:b4:a8",
            "net5": "9a:4f:a8:ff:e9:d5",
            "net6": "12:b0:24:90:0d:f1",
            "net7": "92:b3:80:9b:b7:d1",
            "net8": "16:c2:3c:f7:50:6e"
        },
        "leaf_4_0_8": {
            "net0": "fa:e9:d0:a7:5b:77",
            "net1": "fa:67:ba:4f:62:9d",
            "net2": "ae:66:5a:9e:bc:10",
            "net3": "06:2b:28:cb:97:90",
            "net4": "32:ea:e8:e7:d8:70",
            "net5": "62:41:08:61:f0:8d",
            "net6": "42:ad:80:cb:f2:d5",
            "net7": "aa:da:ac:58:e9:1b",
            "net8": "22:e4:4f:c4:94:fb"
        },
        "leaf_5_0_1": {
            "net0": "22:eb:04:98:1d:7f",
            "net1": "ea:27:7a:4e:6d:43",
            "net2": "3a:c1:6c:03:ce:de",
            "net3": "f6:23:c9:25:3e:24",
            "net4": "02:07:59:43:9d:3e",
            "net5": "9e:20:1b:89:74:aa",
            "net6": "1e:be:e5:a9:5e:0e",
            "net7": "d2:0e:08:da:da:1f",
            "net8": "3e:7e:1e:eb:c0:3d"
        },
        "leaf_5_0_2": {
            "net0": "36:9c:11:01:37:24",
            "net1": "0a:2b:2a:cf:8a:fe",
            "net2": "d2:b5:c0:6f:b8:47",
            "net3": "4e:98:dd:1d:6b:6c",
            "net4": "02:81:b8:64:2e:0d",
            "net5": "6e:33:80:52:61:3e",
            "net6": "4e:0d:ad:99:cc:7b",
            "net7": "c6:0a:af:9a:06:65",
            "net8": "1e:3d:f7:f8:8d:ae"
        },
        "leaf_5_0_3": {
            "net0": "e6:eb:b7:61:39:74",
            "net1": "aa:25:fd:bc:2d:14",
            "net2": "ea:b1:7b:d1:a7:06",
            "net3": "76:56:29:3c:90:b9",
            "net4": "42:43:a2:9c:0d:09",
            "net5": "fe:08:db:3a:65:60",
            "net6": "82:8d:31:10:a5:2d",
            "net7": "76:44:db:06:3d:16",
            "net8": "4e:0d:57:55:90:97"
        },
        "leaf_5_0_4": {
            "net0": "c2:05:da:4f:b7:2b",
            "net1": "66:7c:b9:b8:2b:2c",
            "net2": "2e:4c:75:2f:ea:11",
            "net3": "46:a6:ec:82:9b:34",
            "net4": "ee:8b:ef:43:54:9b",
            "net5": "8a:ab:90:37:6f:83",
            "net6": "36:19:71:c9:7c:ed",
            "net7": "de:24:c3:5f:7b:2c",
            "net8": "7a:85:6b:b8:7a:f1"
        },
        "leaf_5_0_5": {
            "net0": "ea:70:9b:06:9e:76",
            "net1": "8e:57:8b:d7:e2:19",
            "net2": "0a:3b:50:74:45:10",
            "net3": "06:53:4c:2b:84:95",
            "net4": "3a:93:51:5e:23:eb",
            "net5": "22:3b:78:95:3b:0f",
            "net6": "2a:8d:30:ea:a0:0e",
            "net7": "1a:5e:56:84:95:1f",
            "net8": "82:88:58:91:9f:31"
        },
        "leaf_5_0_6": {
            "net0": "9e:21:12:06:53:61",
            "net1": "22:8f:11:96:ac:73",
            "net2": "ba:83:e6:07:37:af",
            "net3": "be:60:51:0d:4e:70",
            "net4": "26:4c:3e:da:54:f9",
            "net5": "4a:f7:90:a6:f4:be",
            "net6": "52:dd:e1:e0:39:bd",
            "net7": "ea:1b:94:19:1b:58",
            "net8": "b6:a9:86:63:9a:15"
        },
        "leaf_5_0_7": {
            "net0": "16:f2:bb:51:b3:f5",
            "net1": "de:f9:d2:64:7b:63",
            "net2": "52:37:74:92:58:9a",
            "net3": "da:e6:b6:28:29:8a",
            "net4": "0e:b4:df:ad:ba:fe",
            "net5": "e2:ac:37:48:4a:da",
            "net6": "a6:dd:ce:40:8d:39",
            "net7": "3e:9f:9c:66:75:5a",
            "net8": "52:f8:c2:ca:95:0f"
        },
        "leaf_5_0_8": {
            "net0": "22:f5:f6:64:f9:7b",
            "net1": "46:ed:71:40:9d:61",
            "net2": "ea:48:33:f9:cd:83",
            "net3": "46:b3:56:c1:14:6b",
            "net4": "e2:57:a8:cc:71:55",
            "net5": "d6:28:32:41:67:53",
            "net6": "c2:a0:02:72:0c:fe",
            "net7": "ba:93:ca:eb:d6:ca",
            "net8": "ce:8a:e1:e8:b8:54"
        },
        "leaf_6_0_1": {
            "net0": "aa:0f:d3:76:a7:45",
            "net1": "ae:0c:6c:16:4a:64",
            "net2": "02:b8:53:18:66:7b",
            "net3": "f6:36:f6:a6:03:17",
            "net4": "86:b3:f6:b9:d7:71",
            "net5": "8e:83:1c:39:9a:25",
            "net6": "7a:cd:7d:12:89:be",
            "net7": "2e:25:f2:73:9b:81",
            "net8": "92:e5:c8:db:42:81"
        },
        "leaf_6_0_2": {
            "net0": "da:8a:18:88:61:ed",
            "net1": "e6:48:d8:42:7f:e1",
            "net2": "7a:9d:03:7b:2e:49",
            "net3": "22:1d:29:98:72:f5",
            "net4": "fe:30:43:ae:e4:67",
            "net5": "3e:82:a5:72:3f:03",
            "net6": "b2:d8:78:a5:63:9d",
            "net7": "b6:a4:ac:4f:a6:21",
            "net8": "2a:67:d9:66:74:33"
        },
        "leaf_6_0_3": {
            "net0": "46:38:81:4d:ce:91",
            "net1": "ca:b9:28:58:bf:78",
            "net2": "ba:1e:05:ce:6b:38",
            "net3": "52:ed:be:60:44:a8",
            "net4": "36:b6:5e:0b:47:d5",
            "net5": "ca:27:74:c7:e8:aa",
            "net6": "ae:be:71:6c:f0:12",
            "net7": "3e:e1:01:95:0f:bf",
            "net8": "fa:d2:14:65:ce:8f"
        },
        "leaf_6_0_4": {
            "net0": "2e:06:ac:3a:ce:fe",
            "net1": "36:65:20:33:5f:3a",
            "net2": "2a:77:40:1a:81:03",
            "net3": "42:91:52:10:2e:7b",
            "net4": "36:b7:10:d9:61:d7",
            "net5": "4e:26:f2:ad:c8:4b",
            "net6": "f2:b5:63:7d:69:ef",
            "net7": "3a:a1:88:85:e3:22",
            "net8": "6a:8c:51:2c:e1:60"
        },
        "leaf_6_0_5": {
            "net0": "1e:cf:58:d5:15:68",
            "net1": "32:c3:b7:1a:8a:8a",
            "net2": "0e:92:99:2f:0a:c8",
            "net3": "b6:46:5e:d5:90:b7",
            "net4": "2e:f9:1b:41:5e:b1",
            "net5": "02:1f:2a:fe:3c:40",
            "net6": "22:c5:67:38:3e:f4",
            "net7": "5a:7c:4c:fd:95:fd",
            "net8": "fe:a5:6a:89:05:fa"
        },
        "leaf_6_0_6": {
            "net0": "1e:c1:ce:f2:8b:34",
            "net1": "0e:77:70:e5:6c:3a",
            "net2": "16:b0:a2:e8:3e:4d",
            "net3": "22:c7:bc:86:dd:d1",
            "net4": "9e:24:16:fa:43:dd",
            "net5": "6a:b2:44:ea:b1:80",
            "net6": "86:d3:b4:94:9c:83",
            "net7": "1e:07:c0:d1:33:3f",
            "net8": "12:f0:18:0e:58:f2"
        },
        "leaf_6_0_7": {
            "net0": "a6:f4:cf:e5:29:71",
            "net1": "56:23:c5:cd:83:3c",
            "net2": "8a:ea:8a:7a:f9:d5",
            "net3": "ba:d6:87:e7:ac:f5",
            "net4": "1e:c9:f5:db:d5:5a",
            "net5": "ea:32:14:4c:eb:30",
            "net6": "e2:59:88:c1:d6:37",
            "net7": "96:fb:d7:6e:55:c2",
            "net8": "aa:8a:e0:b2:e5:0a"
        },
        "leaf_6_0_8": {
            "net0": "ae:54:e5:98:d1:e9",
            "net1": "ba:85:59:5f:a7:04",
            "net2": "8e:76:af:65:f1:72",
            "net3": "02:cc:9f:fd:34:32",
            "net4": "92:ce:39:1d:85:52",
            "net5": "ee:2e:d1:ed:78:ee",
            "net6": "d6:f7:f7:67:f2:72",
            "net7": "16:3d:f2:81:1e:49",
            "net8": "be:67:d5:bb:06:ab"
        },
        "leaf_7_0_1": {
            "net0": "3e:c0:7a:09:3f:e5",
            "net1": "f2:3d:41:09:1e:2d",
            "net2": "96:d8:29:15:55:8c",
            "net3": "82:5a:18:b3:e4:24",
            "net4": "b6:16:3e:3d:6a:cf",
            "net5": "8a:af:d9:bf:8a:ef",
            "net6": "06:70:7f:72:21:0b",
            "net7": "f6:9e:f3:20:a2:fb",
            "net8": "0a:50:94:18:d2:c7"
        },
        "leaf_7_0_2": {
            "net0": "72:63:2b:3e:50:e9",
            "net1": "aa:73:97:56:23:07",
            "net2": "12:2d:c3:fd:5a:28",
            "net3": "2e:57:e5:2e:c2:67",
            "net4": "16:75:68:4a:d4:6b",
            "net5": "32:c6:5d:f7:26:cc",
            "net6": "7a:ce:ce:3e:2e:bd",
            "net7": "b6:27:bc:92:18:62",
            "net8": "f6:11:88:ca:24:83"
        },
        "leaf_7_0_3": {
            "net0": "72:18:53:15:94:5f",
            "net1": "f6:36:b7:1c:ad:b9",
            "net2": "fa:a2:5b:23:a5:7b",
            "net3": "3a:50:39:77:02:7b",
            "net4": "0a:d5:e3:84:3e:ad",
            "net5": "a2:19:ae:4d:ef:8d",
            "net6": "f6:d7:5b:7c:82:4b",
            "net7": "06:43:11:15:a5:e9",
            "net8": "5a:75:92:05:e4:aa"
        },
        "leaf_7_0_4": {
            "net0": "3e:ed:49:3d:e0:39",
            "net1": "aa:65:06:7e:71:ce",
            "net2": "be:6c:53:7f:d3:76",
            "net3": "ae:5d:22:b5:0b:5c",
            "net4": "1a:c2:92:ab:41:8b",
            "net5": "76:eb:44:c2:5a:da",
            "net6": "aa:f4:4d:31:0b:90",
            "net7": "8a:7d:d1:5d:02:38",
            "net8": "ce:f2:51:b4:36:a7"
        },
        "leaf_7_0_5": {
            "net0": "d2:35:ad:94:3a:32",
            "net1": "16:cd:d7:2e:c0:11",
            "net2": "7e:6d:65:79:da:1c",
            "net3": "72:cf:fc:83:19:17",
            "net4": "3e:5e:8c:10:a0:ec",
            "net5": "5e:bd:de:8e:e7:13",
            "net6": "b2:96:83:ce:b4:7e",
            "net7": "7e:06:4c:1e:53:ed",
            "net8": "b2:62:77:e0:cf:64"
        },
        "leaf_7_0_6": {
            "net0": "3e:1f:68:e8:b8:29",
            "net1": "62:0e:92:ba:23:20",
            "net2": "2a:0a:7a:f4:1f:d1",
            "net3": "6a:9e:0d:17:71:80",
            "net4": "be:fe:5d:da:a0:0b",
            "net5": "c6:2e:d0:fb:7d:8a",
            "net6": "36:8a:f8:31:48:45",
            "net7": "8e:49:9f:3b:ba:55",
            "net8": "7a:1f:69:b9:06:86"
        },
        "leaf_7_0_7": {
            "net0": "d6:3c:de:f7:90:fd",
            "net1": "7a:ed:a5:57:a6:7f",
            "net2": "86:a1:19:56:8e:9c",
            "net3": "96:cd:0d:ab:f4:12",
            "net4": "22:28:7c:55:22:41",
            "net5": "36:09:e9:00:17:59",
            "net6": "aa:cb:4a:00:3b:70",
            "net7": "b2:ff:09:68:1a:f6",
            "net8": "ae:28:76:ab:d3:e4"
        },
        "leaf_7_0_8": {
            "net0": "a6:6d:96:0e:38:d1",
            "net1": "06:e2:9f:cd:05:16",
            "net2": "26:58:77:6c:b1:8f",
            "net3": "1e:84:b3:b3:3f:d3",
            "net4": "72:db:3e:3c:04:84",
            "net5": "5a:bb:17:b6:af:72",
            "net6": "ee:25:28:d9:a8:45",
            "net7": "1e:9c:73:81:e8:cb",
            "net8": "7a:b8:4d:86:13:6c"
        },
        "leaf_8_0_1": {
            "net0": "d2:0e:1e:64:8f:69",
            "net1": "6a:f8:e7:55:86:e6",
            "net2": "86:7c:ee:ea:9c:0a",
            "net3": "4a:d2:7d:b1:a1:c2",
            "net4": "22:05:e7:37:d2:c3",
            "net5": "3e:2a:7a:a4:2c:66",
            "net6": "92:76:75:6a:08:10",
            "net7": "4a:11:97:a8:70:87",
            "net8": "12:79:fc:11:dd:0d"
        },
        "leaf_8_0_2": {
            "net0": "aa:d6:2d:5c:ed:d4",
            "net1": "06:4c:f3:12:ae:64",
            "net2": "5a:e4:0f:60:dc:09",
            "net3": "96:ae:64:1e:08:7f",
            "net4": "66:e8:92:0f:81:dc",
            "net5": "52:68:d2:bd:27:70",
            "net6": "5a:be:3c:33:68:11",
            "net7": "52:17:d7:43:7d:2b",
            "net8": "82:f0:56:67:a9:ac"
        },
        "leaf_8_0_3": {
            "net0": "da:58:b1:ad:98:92",
            "net1": "a6:3e:7b:7d:ea:80",
            "net2": "ea:6e:41:93:aa:72",
            "net3": "6e:a6:b1:4f:0b:13",
            "net4": "ce:f7:f1:7b:66:73",
            "net5": "42:e0:54:d3:f2:56",
            "net6": "96:ab:b7:e4:ff:9e",
            "net7": "2e:c1:f4:41:79:08",
            "net8": "76:45:1f:6e:5c:db"
        },
        "leaf_8_0_4": {
            "net0": "72:d6:3a:eb:bc:cc",
            "net1": "c6:5a:07:9d:3f:00",
            "net2": "9a:c2:0b:b5:bb:bc",
            "net3": "b2:b3:2f:55:4f:59",
            "net4": "5a:ef:6e:55:ac:9c",
            "net5": "76:8e:7c:38:cc:4a",
            "net6": "36:65:a6:29:8f:f0",
            "net7": "1e:0a:8d:43:4d:9b",
            "net8": "e6:40:2b:07:60:ae"
        },
        "leaf_8_0_5": {
            "net0": "a6:65:06:13:bd:9d",
            "net1": "96:df:a4:9e:ce:fd",
            "net2": "9a:8b:e1:a8:9d:bb",
            "net3": "8a:80:88:b6:4d:d3",
            "net4": "ae:9b:74:48:44:bf",
            "net5": "6a:79:2b:77:03:b3",
            "net6": "b6:b8:84:8f:34:a9",
            "net7": "72:71:b2:1d:10:f4",
            "net8": "46:ea:65:8e:bd:b9"
        },
        "leaf_8_0_6": {
            "net0": "46:73:18:f9:17:f3",
            "net1": "96:41:c6:a6:35:4e",
            "net2": "e6:e7:48:a1:a6:5b",
            "net3": "d6:df:fd:a6:25:5f",
            "net4": "9a:83:4b:eb:cf:ec",
            "net5": "aa:96:16:6f:84:4b",
            "net6": "02:19:c3:4c:52:88",
            "net7": "56:78:a3:b7:e6:ad",
            "net8": "16:73:4f:4a:84:61"
        },
        "leaf_8_0_7": {
            "net0": "06:5f:c0:b5:fb:ac",
            "net1": "72:64:79:16:70:56",
            "net2": "c2:31:c2:15:ab:e3",
            "net3": "46:42:78:7d:9c:4d",
            "net4": "46:a2:ab:4c:97:92",
            "net5": "1e:5a:68:38:71:67",
            "net6": "2e:95:83:44:e0:17",
            "net7": "a6:48:06:c9:e1:50",
            "net8": "22:b1:9d:bc:1d:08"
        },
        "leaf_8_0_8": {
            "net0": "f2:59:5e:ae:c1:53",
            "net1": "aa:1c:a1:74:5e:99",
            "net2": "9e:af:4f:fc:aa:d3",
            "net3": "32:22:bf:ef:a8:2a",
            "net4": "8e:d0:42:cf:96:19",
            "net5": "ee:2d:aa:6d:87:c5",
            "net6": "6a:92:2b:b1:4f:36",
            "net7": "6a:e2:f2:28:7e:ab",
            "net8": "52:08:88:06:23:73"
        },
        "spine_1_1_1": {
            "net0": "da:e8:d6:61:57:18",
            "net1": "ce:9e:09:0f:8c:22",
            "net10": "7e:17:13:bb:27:c8",
            "net11": "c6:c4:90:d1:a0:c9",
            "net12": "52:b4:f6:d5:d6:2c",
            "net13": "8a:84:f9:ce:4c:c7",
            "net14": "fa:31:4c:2d:54:4b",
            "net15": "3a:3b:ad:a5:58:18",
            "net2": "56:45:bd:cd:4b:e9",
            "net3": "0a:ac:88:06:09:b2",
            "net4": "ce:c4:84:36:62:af",
            "net5": "ea:c5:67:2c:8b:d9",
            "net6": "e2:53:96:72:b7:40",
            "net7": "4e:fb:d2:bb:59:42",
            "net8": "a2:d2:0a:fa:ab:a1",
            "net9": "0e:48:ae:1a:45:d8"
        },
        "spine_1_1_2": {
            "net0": "de:8e:82:97:9f:46",
            "net1": "a6:f3:41:45:8e:46",
            "net10": "62:b3:6f:df:63:16",
            "net11": "f6:8f:f6:cc:2c:75",
            "net12": "26:cf:ff:d4:ea:45",
            "net13": "ce:ca:c2:53:57:e5",
            "net14": "12:25:66:41:7e:dc",
            "net15": "c6:24:a8:89:cf:28",
            "net2": "92:8b:b6:02:34:3d",
            "net3": "0e:82:8c:ba:2c:7a",
            "net4": "1e:3f:12:c3:c3:4c",
            "net5": "be:00:79:c9:b7:b8",
            "net6": "7e:c0:f6:9f:cd:9d",
            "net7": "f2:4c:a5:9e:64:eb",
            "net8": "5a:0e:93:4a:3d:b1",
            "net9": "7a:15:ad:be:46:64"
        },
        "spine_1_1_3": {
            "net0": "f6:d6:b0:7a:3c:e3",
            "net1": "9a:c1:2b:be:4f:34",
            "net10": "8a:be:21:17:49:58",
            "net11": "26:b1:e5:92:5f:06",
            "net12": "46:73:63:d1:b7:98",
            "net13": "86:9e:ef:37:4a:93",
            "net14": "ca:d3:c7:ce:56:b0",
            "net15": "96:cc:43:6e:19:79",
            "net2": "16:04:f8:cd:84:b3",
            "net3": "06:77:3b:24:24:2c",
            "net4": "56:d3:9f:a9:a3:b3",
            "net5": "6a:d2:51:db:c3:30",
            "net6": "c6:78:f4:43:26:97",
            "net7": "ca:48:8e:49:38:4f",
            "net8": "82:c5:3b:72:46:2e",
            "net9": "1e:30:a3:67:1f:50"
        },
        "spine_1_1_4": {
            "net0": "da:a1:64:0e:09:19",
            "net1": "96:60:a5:a0:c2:8e",
            "net10": "a2:24:08:54:e2:e9",
            "net11": "3a:58:26:e8:1c:06",
            "net12": "8e:88:f3:e3:ab:7a",
            "net13": "6e:5d:f6:67:e6:71",
            "net14": "f2:d0:fe:28:49:a1",
            "net15": "f2:a9:a3:bc:67:7e",
            "net2": "ae:32:01:ec:bb:f7",
            "net3": "ea:16:74:bc:ad:b2",
            "net4": "5a:3a:4f:42:ad:33",
            "net5": "42:44:0a:70:15:ac",
            "net6": "12:90:4c:15:86:3d",
            "net7": "22:fa:21:fb:93:5a",
            "net8": "1a:f9:38:be:a0:b0",
            "net9": "6e:a5:ce:08:c1:65"
        },
        "spine_1_1_5": {
            "net0": "ba:7a:1d:89:0b:80",
            "net1": "6e:92:e2:d9:3d:6a",
            "net10": "ca:57:23:85:e1:f7",
            "net11": "92:4f:4e:d7:08:dc",
            "net12": "d2:cf:33:86:68:2f",
            "net13": "c6:c0:38:80:89:f1",
            "net14": "06:ed:73:bd:02:fb",
            "net15": "0a:eb:6c:a2:d5:07",
            "net2": "16:5e:c1:c6:ac:a6",
            "net3": "a2:01:bd:c9:e8:65",
            "net4": "76:87:ce:cc:30:14",
            "net5": "de:86:87:ec:c3:53",
            "net6": "a6:21:95:b0:2f:a3",
            "net7": "3a:34:d4:d2:07:1d",
            "net8": "36:5e:99:89:bf:c4",
            "net9": "96:44:73:bf:70:67"
        },
        "spine_1_1_6": {
            "net0": "e2:e6:8c:f7:3f:46",
            "net1": "86:a2:7e:0d:1e:d8",
            "net10": "aa:b3:34:1e:11:49",
            "net11": "e6:f1:be:9a:71:53",
            "net12": "82:f0:8e:6f:ac:a3",
            "net13": "96:1c:91:00:73:76",
            "net14": "b6:1c:60:0e:b2:ab",
            "net15": "f6:4f:3d:21:ae:03",
            "net2": "5e:0f:d0:ea:a8:1e",
            "net3": "ba:59:e4:24:ad:5d",
            "net4": "e2:8b:32:b0:8a:f7",
            "net5": "8a:75:f7:be:e0:48",
            "net6": "2e:d1:79:4a:e6:04",
            "net7": "92:78:74:0c:53:f6",
            "net8": "06:9e:5c:c7:de:0b",
            "net9": "36:63:62:44:bf:f3"
        },
        "spine_1_1_7": {
            "net0": "da:58:05:d9:d7:d5",
            "net1": "8a:b2:82:c9:b9:c4",
            "net10": "b2:e9:5b:a2:ee:36",
            "net11": "92:ae:d8:91:14:42",
            "net12": "d6:3e:bf:64:5b:aa",
            "net13": "b6:8f:70:e0:eb:6b",
            "net14": "c6:b5:e3:32:18:e6",
            "net15": "8a:44:18:c0:bf:09",
            "net2": "9a:79:69:57:78:09",
            "net3": "22:cf:4b:d3:a9:1f",
            "net4": "86:5c:f0:af:0f:21",
            "net5": "0a:28:22:d3:6a:b2",
            "net6": "e6:c4:8d:55:a7:35",
            "net7": "4a:98:14:55:b0:82",
            "net8": "4a:3f:60:63:f2:9d",
            "net9": "12:3c:0b:b9:6c:8f"
        },
        "spine_1_1_8": {
            "net0": "7e:2f:a8:98:4f:e1",
            "net1": "a2:8d:5b:a4:61:0f",
            "net10": "86:46:3d:8c:82:b0",
            "net11": "46:40:16:22:e6:6c",
            "net12": "e2:17:d0:d1:a7:e6",
            "net13": "ce:16:7e:0b:4f:0b",
            "net14": "9e:44:90:2c:eb:13",
            "net15": "f2:59:42:f6:79:9d",
            "net2": "6a:9e:84:cf:71:2e",
            "net3": "26:23:25:1c:19:7e",
            "net4": "5e:7c:3b:ff:15:4e",
            "net5": "32:10:9d:6c:09:9f",
            "net6": "da:c2:66:ae:e5:e2",
            "net7": "62:8e:6f:e7:ae:6e",
            "net8": "da:d3:a4:6d:6e:90",
            "net9": "ae:09:7f:f0:d7:08"
        },
        "spine_2_1_1": {
            "net0": "6e:ae:a4:79:bf:c1",
            "net1": "aa:cb:2b:d6:3a:e1",
            "net10": "ae:54:5c:d3:01:c4",
            "net11": "92:a0:63:fe:87:7a",
            "net12": "66:7e:c6:ef:77:5c",
            "net13": "16:ef:0a:3f:57:90",
            "net14": "1a:c4:b5:97:81:cf",
            "net15": "82:ce:74:c4:da:5a",
            "net2": "5a:c0:fd:b0:f6:da",
            "net3": "4e:bc:1b:ac:45:53",
            "net4": "46:69:98:ae:5c:dc",
            "net5": "86:d4:b4:50:f4:36",
            "net6": "ba:77:a1:53:36:46",
            "net7": "7a:63:85:1e:8b:fa",
            "net8": "3e:33:ff:51:b0:bf",
            "net9": "f6:b9:56:10:c4:e8"
        },
        "spine_2_1_2": {
            "net0": "9e:3f:ae:1c:90:9e",
            "net1": "be:ee:26:99:3b:ee",
            "net10": "52:6f:ce:a3:fc:c5",
            "net11": "0a:cb:c0:92:21:43",
            "net12": "e6:01:49:12:c6:41",
            "net13": "4e:f8:51:10:40:33",
            "net14": "b2:15:6c:75:c9:10",
            "net15": "02:7e:d3:86:cc:ea",
            "net2": "9e:f2:07:62:1a:6e",
            "net3": "b6:e9:64:6a:b5:2c",
            "net4": "5e:c9:d1:10:c6:b6",
            "net5": "1e:6f:99:49:dd:6a",
            "net6": "22:35:99:b6:d0:fc",
            "net7": "32:dc:da:da:da:b9",
            "net8": "ae:e5:e5:c1:35:3c",
            "net9": "0a:8b:50:94:5c:24"
        },
        "spine_2_1_3": {
            "net0": "36:4e:f3:2f:aa:91",
            "net1": "da:53:a6:6a:3e:4a",
            "net10": "0a:7a:8d:b0:1f:26",
            "net11": "12:05:9d:aa:28:df",
            "net12": "56:ad:e9:de:bf:e0",
            "net13": "36:a7:88:ea:e4:8e",
            "net14": "1a:22:06:1b:87:07",
            "net15": "76:bb:63:4b:43:5f",
            "net2": "0a:ce:0c:ac:b8:15",
            "net3": "1e:05:76:86:86:19",
            "net4": "aa:81:8d:18:ff:86",
            "net5": "46:6f:fc:4b:b4:5d",
            "net6": "c2:1e:6a:9f:99:ed",
            "net7": "42:59:27:0f:fd:39",
            "net8": "da:f8:16:7d:41:71",
            "net9": "7a:04:60:48:a9:b3"
        },
        "spine_2_1_4": {
            "net0": "da:a9:3e:29:53:b3",
            "net1": "da:3e:a7:02:97:3a",
            "net10": "12:db:aa:d5:f8:6d",
            "net11": "7a:07:6d:36:89:83",
            "net12": "b2:f5:71:db:f3:81",
            "net13": "22:dd:a5:58:18:9d",
            "net14": "f6:42:a0:35:2a:8c",
            "net15": "56:5c:23:ea:0d:46",
            "net2": "1e:30:72:f3:9d:57",
            "net3": "9a:2a:4a:16:6d:0c",
            "net4": "7a:a9:d8:c6:f3:0a",
            "net5": "12:7b:4d:70:46:1b",
            "net6": "ce:b5:64:61:3f:a3",
            "net7": "ea:2d:5f:9c:14:0f",
            "net8": "0a:7d:bb:df:62:b5",
            "net9": "92:67:cf:ea:32:14"
        },
        "spine_2_1_5": {
            "net0": "ee:9f:a2:f8:ab:ae",
            "net1": "e2:84:1c:72:73:63",
            "net10": "b6:d0:04:71:38:bf",
            "net11": "aa:4b:b1:5a:a7:40",
            "net12": "96:ce:b4:d3:3c:c5",
            "net13": "4a:04:23:6d:2f:f3",
            "net14": "ee:47:20:ec:04:5b",
            "net15": "ee:12:9b:96:20:53",
            "net2": "3a:58:60:4a:d3:77",
            "net3": "de:2b:02:52:ec:fd",
            "net4": "7e:57:07:22:14:15",
            "net5": "36:54:cc:7b:4d:fa",
            "net6": "d6:31:49:a4:ed:c8",
            "net7": "d6:7b:9b:92:00:6c",
            "net8": "52:d9:93:33:06:5c",
            "net9": "66:dd:b2:f2:e2:d3"
        },
        "spine_2_1_6": {
            "net0": "02:80:5a:d0:d5:70",
            "net1": "72:99:0d:61:c4:8e",
            "net10": "e6:a4:10:6a:9b:fa",
            "net11": "1a:fa:cc:18:7a:67",
            "net12": "92:b7:46:ca:62:41",
            "net13": "6a:13:a4:5f:ae:3f",
            "net14": "9e:7b:a8:46:68:f4",
            "net15": "72:78:b3:fa:41:26",
            "net2": "0a:e1:b2:77:13:72",
            "net3": "3a:5b:01:f9:d9:59",
            "net4": "86:42:20:76:53:4a",
            "net5": "d2:61:18:21:2a:39",
            "net6": "1a:4b:09:68:3f:03",
            "net7": "aa:61:8d:ed:2c:3a",
            "net8": "6e:6f:9c:df:02:65",
            "net9": "06:e1:8b:ed:2f:d0"
        },
        "spine_2_1_7": {
            "net0": "4a:e0:84:96:12:87",
            "net1": "aa:42:06:28:13:fb",
            "net10": "42:c4:68:0c:24:5b",
            "net11": "d6:54:c1:7b:26:b9",
            "net12": "12:0b:e3:f8:22:4d",
            "net13": "d2:75:48:fb:dc:e1",
            "net14": "f2:c6:b7:f3:77:f5",
            "net15": "ce:6f:b2:23:9a:ea",
            "net2": "a6:df:27:be:f4:f5",
            "net3": "3a:21:e0:c2:4e:bd",
            "net4": "12:7d:a4:d6:ba:7a",
            "net5": "de:df:66:01:71:6d",
            "net6": "2e:17:2d:a9:23:9b",
            "net7": "82:94:d2:e2:04:da",
            "net8": "0a:6b:a1:c8:30:2f",
            "net9": "0a:54:64:9b:48:1a"
        },
        "spine_2_1_8": {
            "net0": "6e:44:c4:08:6a:2e",
            "net1": "9e:62:68:03:01:b6",
            "net10": "7a:49:f9:1d:48:c9",
            "net11": "1e:6e:ad:97:17:fa",
            "net12": "76:0c:f7:76:b4:9e",
            "net13": "ce:c7:18:9c:15:cf",
            "net14": "42:c5:1b:7b:64:cb",
            "net15": "ae:8c:e7:c8:43:9f",
            "net2": "ee:fc:87:57:b4:38",
            "net3": "6e:43:82:01:46:86",
            "net4": "de:36:42:4b:eb:9a",
            "net5": "ce:81:ef:83:b6:5f",
            "net6": "d2:82:74:7c:7d:20",
            "net7": "ba:73:2c:36:aa:a8",
            "net8": "8e:49:f7:bb:73:a5",
            "net9": "8a:94:e3:fe:d6:75"
        },
        "spine_3_1_1": {
            "net0": "56:72:73:97:58:07",
            "net1": "9a:a1:b1:b4:bc:38",
            "net10": "e2:28:3e:d8:f8:42",
            "net11": "32:7b:44:d2:57:27",
            "net12": "1e:b5:5e:94:e4:14",
            "net13": "3e:d5:54:4a:bb:56",
            "net14": "06:20:41:93:44:77",
            "net15": "da:50:fb:01:3a:07",
            "net2": "9e:c9:60:f0:62:0a",
            "net3": "26:c2:2d:50:54:f6",
            "net4": "fe:35:c5:73:1c:10",
            "net5": "4e:82:d1:be:aa:d4",
            "net6": "9e:da:c4:63:da:75",
            "net7": "b2:55:9d:92:db:aa",
            "net8": "96:9b:b7:bd:9d:50",
            "net9": "8e:9f:93:18:45:2a"
        },
        "spine_3_1_2": {
            "net0": "3a:7a:b6:ad:50:e3",
            "net1": "16:7f:ed:db:df:a0",
            "net10": "a6:74:7f:a7:d2:27",
            "net11": "ae:d3:14:4b:32:2f",
            "net12": "b6:90:55:62:2e:bc",
            "net13": "2e:6b:4f:07:cc:58",
            "net14": "0a:54:b9:eb:01:fb",
            "net15": "e2:8f:2d:51:13:5f",
            "net2": "5e:11:e8:73:be:bd",
            "net3": "ba:5c:1b:48:b5:41",
            "net4": "c2:dd:5f:4e:bd:4e",
            "net5": "96:f6:b7:ee:79:7e",
            "net6": "2a:2c:2d:74:73:4a",
            "net7": "be:f5:7f:66:4e:86",
            "net8": "32:b8:41:ee:ce:8c",
            "net9": "aa:c2:7d:75:fe:f5"
        },
        "spine_3_1_3": {
            "net0": "ca:df:f8:f3:7d:01",
            "net1": "de:9d:1b:c4:58:16",
            "net10": "ba:ba:d3:cd:37:6d",
            "net11": "b2:8f:76:eb:19:36",
            "net12": "de:15:21:6f:78:78",
            "net13": "6a:9b:c5:f9:45:07",
            "net14": "be:49:b9:9b:f3:7f",
            "net15": "96:33:4a:c4:d2:ee",
            "net2": "e2:92:1d:5d:8f:82",
            "net3": "ca:53:b0:7a:92:c0",
            "net4": "2a:19:ad:b5:80:8c",
            "net5": "52:f1:96:27:9c:e0",
            "net6": "72:c1:09:29:18:d4",
            "net7": "46:87:8e:95:24:ab",
            "net8": "3a:f7:47:59:8c:28",
            "net9": "66:1e:63:88:af:a7"
        },
        "spine_3_1_4": {
            "net0": "12:1a:8c:99:6c:f5",
            "net1": "42:a2:66:08:ee:a3",
            "net10": "e6:00:d3:1f:16:d1",
            "net11": "42:fb:55:d0:8d:eb",
            "net12": "f2:de:59:b2:f9:e0",
            "net13": "f6:05:a7:12:19:f1",
            "net14": "92:1b:2f:fc:db:b5",
            "net15": "5a:13:8d:3b:9a:8d",
            "net2": "be:2c:3b:92:a0:16",
            "net3": "b2:ed:ce:99:a3:4b",
            "net4": "0a:72:c0:b8:4c:29",
            "net5": "12:a2:24:c5:86:f4",
            "net6": "9e:3d:9b:8a:8f:93",
            "net7": "6a:3f:4f:61:20:52",
            "net8": "96:67:5c:67:6f:a5",
            "net9": "02:8a:59:a3:f5:30"
        },
        "spine_3_1_5": {
            "net0": "82:2f:ce:bc:8d:f4",
            "net1": "86:98:e3:9e:9d:18",
            "net10": "12:45:32:b2:35:fb",
            "net11": "ee:78:eb:25:50:21",
            "net12": "ce:9b:2b:b5:a5:75",
            "net13": "12:c9:40:1e:e2:aa",
            "net14": "c6:b0:f8:fd:a5:21",
            "net15": "42:fe:d5:e8:8d:11",
            "net2": "f2:1f:a7:8d:71:2b",
            "net3": "96:a3:65:68:e5:ad",
            "net4": "5a:7f:a1:50:a6:f5",
            "net5": "5a:02:27:19:28:a9",
            "net6": "6e:d2:91:ae:75:d2",
            "net7": "e2:41:36:c7:de:0a",
            "net8": "a6:67:02:1f:d6:85",
            "net9": "4e:e9:8f:1c:d9:b0"
        },
        "spine_3_1_6": {
            "net0": "12:6e:0b:93:23:40",
            "net1": "a6:ae:22:15:b8:08",
            "net10": "92:8d:66:9e:9e:f5",
            "net11": "fe:c2:e0:4c:39:77",
            "net12": "66:5c:b1:b8:b0:70",
            "net13": "32:af:12:32:bc:37",
            "net14": "9a:43:7c:be:7a:b5",
            "net15": "92:c8:b7:2c:1a:40",
            "net2": "c2:f1:cf:d4:81:6a",
            "net3": "0e:4f:20:d0:1a:74",
            "net4": "76:ec:12:71:8d:56",
            "net5": "8e:7b:ae:77:59:d7",
            "net6": "ce:07:92:3b:d2:bf",
            "net7": "72:82:dd:bd:a5:0b",
            "net8": "de:3b:d8:b1:f7:09",
            "net9": "ba:60:a0:6e:a1:c1"
        },
        "spine_3_1_7": {
            "net0": "22:eb:7a:a6:e1:25",
            "net1": "7a:66:09:54:32:74",
            "net10": "5e:ff:13:d9:69:5c",
            "net11": "f6:57:e1:cf:fd:aa",
            "net12": "6a:62:00:42:c7:3a",
            "net13": "aa:7f:92:fc:a7:c2",
            "net14": "46:ef:37:03:73:0c",
            "net15": "a6:b7:e9:8a:9c:a2",
            "net2": "8e:06:28:ab:6a:b9",
            "net3": "16:03:6e:78:93:f2",
            "net4": "b6:ef:25:9d:00:b7",
            "net5": "06:e1:b0:07:19:29",
            "net6": "8e:84:c1:d7:87:1d",
            "net7": "8a:07:6f:5a:ac:c3",
            "net8": "1e:f2:f2:87:2f:11",
            "net9": "86:e8:6b:5c:91:98"
        },
        "spine_3_1_8": {
            "net0": "9e:df:b0:ed:93:ed",
            "net1": "c2:25:f9:50:d4:c6",
            "net10": "32:55:0f:a7:8c:8a",
            "net11": "d2:86:35:d9:71:0b",
            "net12": "0e:c1:54:f7:d1:af",
            "net13": "4a:45:8e:63:d6:7c",
            "net14": "fe:d7:8c:55:0b:37",
            "net15": "06:e7:90:68:6f:42",
            "net2": "2a:c6:3d:ef:76:e2",
            "net3": "76:bd:c0:35:58:0a",
            "net4": "be:04:7f:ec:a9:70",
            "net5": "4e:95:7d:76:41:ab",
            "net6": "02:80:01:f4:4a:35",
            "net7": "8a:c4:fb:45:fe:9d",
            "net8": "1a:15:66:70:41:e5",
            "net9": "72:0e:74:e5:12:e5"
        },
        "spine_4_1_1": {
            "net0": "92:6a:c4:ae:2a:d8",
            "net1": "e2:2b:98:06:78:e2",
            "net10": "2a:11:d2:2c:73:29",
            "net11": "66:7b:30:b3:e1:de",
            "net12": "ce:32:61:a5:0f:31",
            "net13": "f2:8c:e1:d6:b6:3e",
            "net14": "e2:36:7b:d7:54:0b",
            "net15": "3a:a5:07:d0:ed:c9",
            "net2": "7a:ce:3f:28:bd:84",
            "net3": "26:60:93:28:56:4d",
            "net4": "16:a7:57:9f:9d:1b",
            "net5": "be:16:b8:09:a0:28",
            "net6": "62:bd:e1:fc:96:9b",
            "net7": "7e:41:5b:19:b7:ba",
            "net8": "b2:db:8a:d3:81:3b",
            "net9": "ee:4b:47:d4:e4:a7"
        },
        "spine_4_1_2": {
            "net0": "2e:38:0b:e8:36:dc",
            "net1": "7e:62:b7:46:d7:1c",
            "net10": "6e:35:dd:0a:21:49",
            "net11": "46:eb:d0:5e:54:fd",
            "net12": "c2:28:a3:77:56:e9",
            "net13": "fe:ca:65:64:95:1a",
            "net14": "76:12:c8:4a:67:10",
            "net15": "ee:b9:0c:ae:b1:61",
            "net2": "e6:ae:98:3d:c6:d6",
            "net3": "de:a2:56:aa:c1:85",
            "net4": "0e:0d:1b:b7:a8:68",
            "net5": "36:c5:99:8e:05:55",
            "net6": "8e:4b:a3:76:2d:29",
            "net7": "52:8f:82:65:ec:4c",
            "net8": "ca:9d:5c:4b:e3:9c",
            "net9": "a6:bb:4a:c9:61:13"
        },
        "spine_4_1_3": {
            "net0": "92:bc:6e:29:a4:e2",
            "net1": "d6:4e:6e:82:e8:ed",
            "net10": "ea:d7:09:41:76:44",
            "net11": "06:2e:4d:7a:1f:fc",
            "net12": "da:f6:43:df:b1:7d",
            "net13": "b6:fe:58:98:ff:3b",
            "net14": "5e:13:06:4b:3f:ed",
            "net15": "d6:25:1d:ef:47:bd",
            "net2": "0e:ca:a0:1a:e3:84",
            "net3": "7a:5d:86:e4:ca:a7",
            "net4": "8a:2d:2b:20:f9:b8",
            "net5": "3e:28:68:e7:63:bf",
            "net6": "4a:04:5a:f1:07:83",
            "net7": "d2:51:77:b2:01:3b",
            "net8": "f2:02:50:ea:10:1e",
            "net9": "c6:f0:92:c3:50:de"
        },
        "spine_4_1_4": {
            "net0": "22:0b:83:b9:19:3e",
            "net1": "06:c7:87:c5:a9:ca",
            "net10": "9a:2b:8c:46:91:85",
            "net11": "3e:d2:8c:b4:bd:43",
            "net12": "4a:96:ed:2a:2e:58",
            "net13": "76:dd:a0:a1:96:89",
            "net14": "9e:25:21:77:be:77",
            "net15": "e6:e9:e1:25:e3:d4",
            "net2": "76:44:7a:be:e2:82",
            "net3": "d2:d7:50:98:5e:26",
            "net4": "c2:d6:54:53:0a:61",
            "net5": "e6:2c:db:a3:c2:c7",
            "net6": "fe:22:93:aa:87:91",
            "net7": "fa:99:77:66:c4:b4",
            "net8": "76:e6:65:23:d5:1b",
            "net9": "d6:1c:f2:09:d6:b3"
        },
        "spine_4_1_5": {
            "net0": "b2:13:aa:9d:80:a1",
            "net1": "3e:d0:f6:a1:b6:18",
            "net10": "1e:1a:3f:be:e4:3f",
            "net11": "a2:a8:ec:3d:71:43",
            "net12": "2a:31:f5:92:33:5c",
            "net13": "72:e5:53:86:40:d6",
            "net14": "92:74:17:f3:59:0e",
            "net15": "06:82:45:58:6e:42",
            "net2": "d6:fd:af:62:bc:1e",
            "net3": "02:0c:b3:8e:35:ff",
            "net4": "b2:24:5f:39:21:90",
            "net5": "ee:53:60:dd:a3:43",
            "net6": "36:0f:95:e8:19:84",
            "net7": "3a:38:9b:2d:6c:92",
            "net8": "a6:54:9d:02:11:b6",
            "net9": "96:25:4a:ad:50:61"
        },
        "spine_4_1_6": {
            "net0": "62:4f:3a:c5:63:c2",
            "net1": "66:34:a1:ef:2d:2b",
            "net10": "5e:ac:0a:d2:12:c3",
            "net11": "be:ab:ba:e5:7b:3c",
            "net12": "3a:d3:ab:12:9c:87",
            "net13": "2a:6c:58:b1:d0:65",
            "net14": "a2:94:b9:98:90:83",
            "net15": "fa:90:6e:c2:90:a0",
            "net2": "56:2f:d7:5f:a4:9a",
            "net3": "c6:aa:f5:95:7c:48",
            "net4": "aa:68:87:1b:e0:47",
            "net5": "b6:ac:e0:4e:38:ab",
            "net6": "06:fa:4e:52:d4:93",
            "net7": "d6:3b:5a:e1:a4:a8",
            "net8": "a6:ae:13:93:25:89",
            "net9": "42:de:db:0b:a6:df"
        },
        "spine_4_1_7": {
            "net0": "4e:17:89:b6:80:ab",
            "net1": "12:8d:5a:4d:ac:f9",
            "net10": "1e:86:5a:4c:be:5e",
            "net11": "56:e1:7f:a7:8b:15",
            "net12": "36:29:7c:01:e6:af",
            "net13": "56:d1:cf:1f:a0:65",
            "net14": "4e:83:de:cb:e5:b3",
            "net15": "0a:d6:e0:4f:2f:a6",
            "net2": "06:62:c0:54:6a:f0",
            "net3": "1a:c7:6f:58:9b:fe",
            "net4": "0e:75:41:fe:37:4d",
            "net5": "aa:80:8c:19:90:7b",
            "net6": "96:af:8d:b6:80:4e",
            "net7": "6e:f5:43:4d:d3:ec",
            "net8": "e6:44:28:ad:00:0d",
            "net9": "02:b9:d7:c6:f1:1c"
        },
        "spine_4_1_8": {
            "net0": "7a:41:d1:76:a5:ca",
            "net1": "8a:6f:be:30:fc:ad",
            "net10": "ce:08:6b:5d:52:06",
            "net11": "72:0b:d6:64:cf:eb",
            "net12": "3e:76:3d:e0:55:e0",
            "net13": "8a:e7:36:3d:c2:32",
            "net14": "26:69:57:8e:74:93",
            "net15": "c2:d6:93:7b:c7:dd",
            "net2": "e2:61:7a:77:40:7a",
            "net3": "16:72:85:ab:eb:2d",
            "net4": "32:92:14:50:21:82",
            "net5": "f2:6e:83:cb:4b:47",
            "net6": "2e:42:fa:f4:b1:51",
            "net7": "c2:47:33:9e:39:c8",
            "net8": "3e:34:d6:30:51:82",
            "net9": "86:f6:60:76:af:20"
        },
        "spine_5_1_1": {
            "net0": "92:73:0b:ed:ba:5f",
            "net1": "aa:d0:5b:03:80:d1",
            "net10": "3a:d7:45:2c:a1:93",
            "net11": "ca:58:81:d9:dd:a6",
            "net12": "72:1a:02:b9:34:b4",
            "net13": "8a:f7:15:30:4b:e3",
            "net14": "b6:98:25:8c:53:ae",
            "net15": "42:b8:00:39:49:db",
            "net2": "0a:39:53:9b:57:a5",
            "net3": "32:08:fa:fc:ae:83",
            "net4": "8a:06:be:3b:41:84",
            "net5": "a2:3f:08:10:e1:2a",
            "net6": "22:4a:9f:05:86:08",
            "net7": "6a:6b:06:b9:72:da",
            "net8": "2e:ba:80:74:fb:01",
            "net9": "6a:17:81:d9:97:b2"
        },
        "spine_5_1_2": {
            "net0": "3a:58:2c:8d:5d:dc",
            "net1": "6e:35:12:c7:0a:80",
            "net10": "8a:da:6c:7d:ff:a4",
            "net11": "6a:81:30:b7:39:4e",
            "net12": "de:00:20:0c:36:d8",
            "net13": "56:92:61:98:f8:eb",
            "net14": "5a:ee:ee:40:1c:64",
            "net15": "0a:44:0f:d5:c8:59",
            "net2": "4e:93:84:bf:a5:55",
            "net3": "e6:1d:e8:17:08:e1",
            "net4": "9a:19:ab:3c:40:55",
            "net5": "4a:92:aa:ef:91:bf",
            "net6": "a2:68:2e:f6:ed:97",
            "net7": "c2:78:c2:97:b1:dd",
            "net8": "aa:eb:d3:25:57:03",
            "net9": "1e:c6:9f:dd:67:e4"
        },
        "spine_5_1_3": {
            "net0": "2a:b6:bb:7d:6f:90",
            "net1": "0e:d7:ee:82:89:03",
            "net10": "62:cc:9b:af:5e:0a",
            "net11": "7e:7e:11:21:ec:17",
            "net12": "3a:c8:98:09:97:34",
            "net13": "0e:cf:21:d9:c9:db",
            "net14": "1a:68:8d:eb:9d:3b",
            "net15": "52:bd:31:b0:31:ab",
            "net2": "fe:34:e9:d6:fb:10",
            "net3": "82:5d:f2:c5:95:d7",
            "net4": "3e:e6:8d:c8:0c:ce",
            "net5": "62:d6:01:7c:5e:02",
            "net6": "06:87:9f:f6:bc:da",
            "net7": "ba:fe:10:36:24:25",
            "net8": "36:2c:72:f8:6d:eb",
            "net9": "a2:d9:42:b0:35:de"
        },
        "spine_5_1_4": {
            "net0": "ae:52:0d:8b:b4:e8",
            "net1": "52:64:2e:f9:cb:61",
            "net10": "e6:a4:20:ff:7b:41",
            "net11": "3a:0c:68:5b:d8:39",
            "net12": "a2:66:46:ce:85:4e",
            "net13": "e2:12:1d:05:18:76",
            "net14": "ee:3f:3f:92:77:88",
            "net15": "f2:d8:0f:73:18:1d",
            "net2": "6a:2d:d8:d8:c1:98",
            "net3": "6e:3c:47:95:e2:03",
            "net4": "4e:4f:df:b2:b9:7f",
            "net5": "06:72:3a:c8:41:bd",
            "net6": "ce:b9:51:22:4c:a5",
            "net7": "22:07:5a:49:8e:0a",
            "net8": "92:ee:f8:62:44:8c",
            "net9": "2a:88:62:43:13:b0"
        },
        "spine_5_1_5": {
            "net0": "02:14:8f:4c:b7:6d",
            "net1": "7a:9d:74:90:94:ca",
            "net10": "06:06:c1:82:01:ae",
            "net11": "0e:ba:0f:05:be:c3",
            "net12": "3a:a9:8c:e8:eb:8c",
            "net13": "b2:fe:a4:3a:b6:b2",
            "net14": "7a:1b:cc:8f:1b:1a",
            "net15": "f2:e9:e4:da:d5:7a",
            "net2": "8e:e4:25:3d:2c:ae",
            "net3": "9e:42:86:95:72:cb",
            "net4": "82:d3:0c:2a:48:b2",
            "net5": "42:0a:d9:12:f6:2e",
            "net6": "1a:7a:0c:7b:e6:c1",
            "net7": "ce:a9:9f:82:c9:32",
            "net8": "8a:95:3f:28:4e:3c",
            "net9": "3a:af:ad:84:2a:2e"
        },
        "spine_5_1_6": {
            "net0": "ea:47:e6:76:61:c5",
            "net1": "d6:09:29:6d:bb:bb",
            "net10": "06:a8:22:c7:cf:77",
            "net11": "86:21:57:f9:9a:e0",
            "net12": "c2:eb:34:70:a5:70",
            "net13": "52:82:51:78:44:df",
            "net14": "be:99:b7:d4:9a:ca",
            "net15": "9a:05:ee:9f:0d:67",
            "net2": "0a:e2:f3:74:8b:11",
            "net3": "f6:30:fb:17:7f:35",
            "net4": "d2:a3:db:8a:b9:92",
            "net5": "ce:47:17:3d:dc:fc",
            "net6": "d2:fe:bc:27:1a:6c",
            "net7": "f2:13:7e:75:80:d6",
            "net8": "76:40:d2:c6:6a:5f",
            "net9": "4a:ac:ff:ae:ea:f5"
        },
        "spine_5_1_7": {
            "net0": "aa:51:98:c2:d5:1a",
            "net1": "b6:be:a5:5d:00:67",
            "net10": "3a:e6:61:e0:b7:e5",
            "net11": "3e:0d:b2:ac:54:96",
            "net12": "06:8e:aa:b8:02:1a",
            "net13": "96:73:98:05:f0:61",
            "net14": "a2:db:c6:5b:b5:3f",
            "net15": "8e:9b:d1:dd:39:26",
            "net2": "7a:f2:ec:b9:31:58",
            "net3": "92:75:ad:7a:0a:5e",
            "net4": "26:72:d8:07:d3:fc",
            "net5": "3e:e6:c7:68:1c:af",
            "net6": "be:05:4d:fa:ef:1e",
            "net7": "e2:97:30:d0:70:f8",
            "net8": "ae:62:ef:f5:d8:42",
            "net9": "c6:99:c1:ed:58:f8"
        },
        "spine_5_1_8": {
            "net0": "96:30:8e:ba:18:2e",
            "net1": "5e:97:5e:d2:4c:55",
            "net10": "7a:df:cf:20:04:5c",
            "net11": "66:0b:cb:00:da:3b",
            "net12": "16:3c:1d:04:70:0c",
            "net13": "aa:8a:93:3f:a7:6b",
            "net14": "12:19:12:4b:21:4c",
            "net15": "c2:2c:31:de:cf:47",
            "net2": "8e:60:a2:e0:fe:fd",
            "net3": "a2:11:1c:0d:15:ab",
            "net4": "be:b3:60:fe:0b:f4",
            "net5": "06:36:0d:c8:fa:70",
            "net6": "4a:e8:31:af:b3:9e",
            "net7": "92:01:dd:7a:75:71",
            "net8": "ae:f1:88:cb:16:07",
            "net9": "4a:cb:9b:3e:8a:91"
        },
        "spine_6_1_1": {
            "net0": "aa:8a:9c:9a:9d:14",
            "net1": "de:23:10:fd:c8:3e",
            "net10": "36:c0:05:5d:ac:04",
            "net11": "9a:fb:d4:5f:8f:6a",
            "net12": "fa:15:f0:ac:f2:fe",
            "net13": "36:55:85:57:a5:1f",
            "net14": "46:77:a9:cc:49:e6",
            "net15": "06:98:6f:5c:c2:c3",
            "net2": "e2:0c:d7:c9:a0:72",
            "net3": "3a:a7:92:70:4b:a3",
            "net4": "82:bb:1c:96:a3:70",
            "net5": "72:ff:f5:dd:37:55",
            "net6": "8e:ed:4f:fb:8d:f4",
            "net7": "e6:90:2e:a5:7d:3d",
            "net8": "52:28:3d:56:8d:ca",
            "net9": "1a:d6:39:1f:25:de"
        },
        "spine_6_1_2": {
            "net0": "52:31:a8:f1:07:bb",
            "net1": "9a:06:74:68:ef:ea",
            "net10": "f6:1b:c2:d8:a5:b6",
            "net11": "76:f2:56:cb:c0:82",
            "net12": "7a:35:63:14:04:64",
            "net13": "ea:6b:a6:f3:18:04",
            "net14": "12:8d:31:06:ac:52",
            "net15": "02:f7:44:20:d6:d0",
            "net2": "e2:b3:66:ad:f0:b3",
            "net3": "f2:a7:d0:b7:48:9e",
            "net4": "82:39:4a:da:cd:d2",
            "net5": "ee:a7:ee:0c:41:8f",
            "net6": "fe:d0:09:f1:b2:99",
            "net7": "76:1d:0f:26:c7:f2",
            "net8": "36:b5:72:19:f0:4f",
            "net9": "fa:1e:5d:5d:aa:e1"
        },
        "spine_6_1_3": {
            "net0": "96:a0:95:49:35:7c",
            "net1": "32:c4:da:1a:bc:c9",
            "net10": "de:3c:57:9c:52:55",
            "net11": "e2:0d:c8:73:cf:61",
            "net12": "66:c4:4d:99:00:08",
            "net13": "1a:f2:23:f6:89:76",
            "net14": "d2:ae:7b:85:03:6e",
            "net15": "b2:98:6e:5d:75:80",
            "net2": "22:64:43:35:c7:b6",
            "net3": "26:5d:cb:40:98:bb",
            "net4": "32:3d:db:1c:32:6a",
            "net5": "3a:ae:0b:a6:96:be",
            "net6": "e6:a2:02:89:1e:e2",
            "net7": "36:1e:8f:07:1a:43",
            "net8": "fa:49:97:68:ad:54",
            "net9": "4e:63:43:db:b9:b0"
        },
        "spine_6_1_4": {
            "net0": "fa:44:78:2b:31:52",
            "net1": "12:6c:ac:11:d4:41",
            "net10": "c6:92:02:19:53:6f",
            "net11": "62:07:e0:22:da:b5",
            "net12": "9e:13:db:4b:f9:f7",
            "net13": "b6:80:19:72:04:84",
            "net14": "aa:0f:dd:d4:71:c9",
            "net15": "d2:45:a9:9b:9b:bd",
            "net2": "4a:7d:97:bf:df:b6",
            "net3": "2e:e4:c3:2d:cc:5a",
            "net4": "f2:c0:28:9e:a8:15",
            "net5": "36:99:c5:12:24:ae",
            "net6": "7e:eb:f5:6e:9c:93",
            "net7": "06:2b:a0:df:e3:66",
            "net8": "0e:d0:56:51:e2:a4",
            "net9": "82:d3:7a:3a:50:f4"
        },
        "spine_6_1_5": {
            "net0": "76:a7:a3:80:93:e3",
            "net1": "ae:7c:4e:4d:69:6b",
            "net10": "f6:f8:45:41:70:d1",
            "net11": "a6:82:5b:0b:7b:a8",
            "net12": "82:5c:3f:7a:08:a9",
            "net13": "22:3b:94:30:ff:bb",
            "net14": "ca:1d:a8:30:d3:c2",
            "net15": "32:1a:62:56:25:4a",
            "net2": "ea:56:c0:9f:65:d2",
            "net3": "22:1e:d9:16:a8:29",
            "net4": "5e:ad:d6:e1:a1:37",
            "net5": "b6:78:91:c3:89:f7",
            "net6": "6e:08:1d:17:f1:02",
            "net7": "ee:ea:39:8c:99:82",
            "net8": "02:21:b9:11:75:c8",
            "net9": "aa:b7:1f:cf:fd:9f"
        },
        "spine_6_1_6": {
            "net0": "9e:a6:34:74:b6:35",
            "net1": "aa:a5:62:8f:da:88",
            "net10": "2a:65:6a:49:63:70",
            "net11": "c2:94:10:76:95:46",
            "net12": "82:8b:23:70:7c:ca",
            "net13": "ce:57:c1:2e:4e:86",
            "net14": "1a:bc:58:6c:df:6c",
            "net15": "ee:74:62:01:2a:87",
            "net2": "9a:b9:86:41:21:88",
            "net3": "0e:42:f0:6c:ab:64",
            "net4": "c6:64:18:3b:a7:48",
            "net5": "0a:ff:9b:cf:d0:48",
            "net6": "de:24:b8:a6:3c:d0",
            "net7": "3a:00:90:b3:9a:44",
            "net8": "e2:cb:e1:bf:a5:c0",
            "net9": "ce:92:27:53:f8:a6"
        },
        "spine_6_1_7": {
            "net0": "fa:2c:ea:09:05:07",
            "net1": "de:95:f8:1e:43:4a",
            "net10": "76:7b:db:63:ea:8c",
            "net11": "46:fa:48:8e:ee:c7",
            "net12": "5a:2f:59:1d:6f:6a",
            "net13": "42:c7:3c:0b:9c:1b",
            "net14": "ca:1f:33:aa:f3:44",
            "net15": "5e:51:ff:a0:4c:7a",
            "net2": "16:4b:72:54:9b:e7",
            "net3": "b6:71:8f:cd:d2:6c",
            "net4": "22:1c:8c:e9:37:01",
            "net5": "ba:fb:b9:02:17:c8",
            "net6": "1e:f2:ce:a5:6b:ed",
            "net7": "0e:6b:ee:65:04:1d",
            "net8": "72:96:47:77:e8:07",
            "net9": "76:82:5e:6c:7f:c6"
        },
        "spine_6_1_8": {
            "net0": "92:61:32:9e:17:c8",
            "net1": "da:6a:4c:de:67:2a",
            "net10": "3a:59:26:a1:0d:5b",
            "net11": "f6:b5:70:48:97:89",
            "net12": "8a:4d:7f:4f:a6:2d",
            "net13": "0e:ff:24:ed:3e:25",
            "net14": "c2:e3:22:4c:b6:05",
            "net15": "0a:0c:d4:9c:a9:f4",
            "net2": "ca:d2:54:99:8e:00",
            "net3": "32:32:6b:16:32:e9",
            "net4": "d2:61:7a:a5:03:72",
            "net5": "22:01:e5:b6:d8:0f",
            "net6": "42:08:5f:18:79:f3",
            "net7": "1e:75:a3:88:fd:ad",
            "net8": "0a:c4:f2:ad:bf:eb",
            "net9": "ee:ee:bc:cc:1c:f4"
        },
        "spine_7_1_1": {
            "net0": "42:42:d6:f3:23:cb",
            "net1": "a2:79:b8:3e:fd:c9",
            "net10": "56:68:c1:76:5d:5f",
            "net11": "be:04:1a:42:06:7e",
            "net12": "5e:8b:86:cf:01:bb",
            "net13": "de:76:19:ba:04:6c",
            "net14": "92:18:aa:d8:98:cb",
            "net15": "de:9f:c6:cc:01:c3",
            "net2": "26:b0:cb:32:a0:3c",
            "net3": "0e:35:93:ad:34:d9",
            "net4": "32:78:4a:6a:c7:45",
            "net5": "3a:f3:ed:95:99:09",
            "net6": "2e:ef:e2:bf:37:07",
            "net7": "62:33:99:38:69:75",
            "net8": "f2:14:93:1d:2e:d5",
            "net9": "6e:02:f5:54:f5:6d"
        },
        "spine_7_1_2": {
            "net0": "de:76:01:65:81:47",
            "net1": "16:60:e0:e9:e1:2c",
            "net10": "fe:d6:48:61:17:27",
            "net11": "ba:38:5c:73:83:f1",
            "net12": "a6:41:53:56:6d:cf",
            "net13": "be:21:6a:61:02:8b",
            "net14": "42:47:b6:f2:c0:48",
            "net15": "52:00:b1:cd:49:0d",
            "net2": "86:a4:84:e6:c1:c5",
            "net3": "f2:8f:10:1d:5e:ce",
            "net4": "82:4a:03:fe:d3:39",
            "net5": "ca:bf:ef:e6:88:22",
            "net6": "72:35:0a:b8:ee:22",
            "net7": "ce:34:35:9d:65:d3",
            "net8": "f2:ff:06:2b:a0:50",
            "net9": "7a:fb:37:49:c8:fc"
        },
        "spine_7_1_3": {
            "net0": "a6:6a:5d:9d:91:66",
            "net1": "12:9a:b3:a2:9b:5c",
            "net10": "f2:78:c4:dc:f5:de",
            "net11": "f2:33:f1:83:99:03",
            "net12": "ba:01:c7:8c:a2:30",
            "net13": "0a:ed:40:16:ae:25",
            "net14": "26:f7:78:b0:fb:6c",
            "net15": "de:5c:77:f9:9f:38",
            "net2": "86:86:21:c6:e0:2d",
            "net3": "6a:f8:bc:4a:65:b7",
            "net4": "62:a2:81:08:8f:d8",
            "net5": "fa:cb:ba:33:58:bd",
            "net6": "9a:b5:b2:98:2b:15",
            "net7": "aa:c4:dd:e6:15:53",
            "net8": "e2:6a:fd:92:f4:4b",
            "net9": "12:06:19:38:3a:7d"
        },
        "spine_7_1_4": {
            "net0": "3e:e3:13:1a:9b:eb",
            "net1": "c2:e6:0a:b8:2a:24",
            "net10": "aa:4a:08:1b:da:0d",
            "net11": "c2:55:91:6c:6a:aa",
            "net12": "a2:23:49:6b:e5:c4",
            "net13": "92:c8:3c:8e:ba:dd",
            "net14": "52:e5:41:d1:b0:76",
            "net15": "be:ce:59:39:ce:78",
            "net2": "62:92:c4:55:9a:be",
            "net3": "5e:a0:67:85:ac:91",
            "net4": "66:92:45:17:e7:e5",
            "net5": "5a:eb:c2:fb:cb:a4",
            "net6": "f6:a3:ca:f2:1a:f8",
            "net7": "3a:7f:e6:76:ca:1e",
            "net8": "da:fe:cc:dd:79:2b",
            "net9": "7e:3a:30:30:a2:ee"
        },
        "spine_7_1_5": {
            "net0": "82:6d:df:a5:e0:50",
            "net1": "9e:9c:ea:49:43:c7",
            "net10": "ba:30:ed:a5:82:5d",
            "net11": "5e:93:38:26:c4:22",
            "net12": "ee:c2:b3:b8:38:be",
            "net13": "16:7b:00:ce:80:0b",
            "net14": "be:c8:6d:16:da:5d",
            "net15": "8e:fd:e6:20:10:f9",
            "net2": "7a:0e:c9:43:76:03",
            "net3": "4e:fb:88:39:08:3d",
            "net4": "ca:d8:32:f6:9a:88",
            "net5": "22:88:96:0f:3c:c1",
            "net6": "76:ab:72:fc:42:34",
            "net7": "fe:ad:2a:e1:01:54",
            "net8": "52:65:86:97:c8:31",
            "net9": "6e:89:0f:65:6c:de"
        },
        "spine_7_1_6": {
            "net0": "5e:61:39:cb:72:64",
            "net1": "86:5e:74:45:4a:8f",
            "net10": "3a:96:ff:a9:33:0e",
            "net11": "4a:a2:aa:d1:1a:1f",
            "net12": "5a:b4:b8:27:8a:2c",
            "net13": "92:c2:eb:0f:d1:e2",
            "net14": "ce:6f:d4:a4:68:00",
            "net15": "1e:14:db:7b:f3:ce",
            "net2": "7e:62:89:c2:b7:5b",
            "net3": "ea:2a:c5:94:77:78",
            "net4": "b2:7c:45:47:12:ab",
            "net5": "4e:ca:db:13:b8:98",
            "net6": "de:de:f1:a3:9e:0b",
            "net7": "d6:2c:79:f3:e5:a9",
            "net8": "ba:0a:38:82:a8:9d",
            "net9": "da:c8:67:c6:34:0b"
        },
        "spine_7_1_7": {
            "net0": "9e:7e:70:83:ca:18",
            "net1": "ba:e3:a4:40:87:b3",
            "net10": "36:78:fb:f1:08:94",
            "net11": "7a:e3:63:49:42:1f",
            "net12": "e6:22:4e:e9:b7:80",
            "net13": "26:2a:ab:7a:52:90",
            "net14": "62:df:30:1a:63:e0",
            "net15": "1e:e9:3b:9d:94:c1",
            "net2": "d6:af:67:3b:bf:3f",
            "net3": "d6:21:69:fe:2a:9e",
            "net4": "86:b3:54:13:2d:56",
            "net5": "e6:46:d9:42:f4:ec",
            "net6": "ce:8e:79:da:77:74",
            "net7": "6e:54:cd:17:f3:4a",
            "net8": "d2:39:cd:bd:b1:3a",
            "net9": "3e:73:f3:be:11:42"
        },
        "spine_7_1_8": {
            "net0": "02:19:43:f4:05:b2",
            "net1": "b2:ba:27:66:07:c3",
            "net10": "ae:ae:66:95:e9:58",
            "net11": "5a:31:47:8c:19:c2",
            "net12": "26:22:1d:11:1d:e3",
            "net13": "ba:b2:06:57:9d:7a",
            "net14": "aa:be:97:3c:2a:01",
            "net15": "62:63:6a:23:ca:a8",
            "net2": "4e:41:69:ad:c3:56",
            "net3": "52:e1:88:b1:90:24",
            "net4": "3a:96:8f:a7:59:d5",
            "net5": "92:da:7b:12:c6:12",
            "net6": "4e:e3:9c:26:ff:83",
            "net7": "8a:39:78:71:33:1f",
            "net8": "2e:02:b4:07:d4:89",
            "net9": "4e:2d:91:d9:5e:0e"
        },
        "spine_8_1_1": {
            "net0": "e2:c0:41:b8:ca:f8",
            "net1": "1e:5b:55:a0:08:0d",
            "net10": "f2:6a:bf:f0:e7:90",
            "net11": "da:94:62:87:79:bd",
            "net12": "06:56:2f:18:c0:4a",
            "net13": "b6:b1:2a:3d:49:82",
            "net14": "9a:b5:43:e8:c1:7c",
            "net15": "8e:a5:8c:fa:09:df",
            "net2": "ca:02:02:42:60:f3",
            "net3": "42:f3:f0:d4:00:79",
            "net4": "c6:96:f2:a9:b5:bd",
            "net5": "32:44:c2:bc:b1:ec",
            "net6": "7a:a7:f2:5d:b2:5b",
            "net7": "ae:7b:ae:73:f9:eb",
            "net8": "76:7b:e9:93:0f:3b",
            "net9": "c6:78:ac:bc:c5:2f"
        },
        "spine_8_1_2": {
            "net0": "86:bc:9d:6d:95:7f",
            "net1": "02:6d:27:dd:fe:72",
            "net10": "ba:e7:ce:0a:e9:53",
            "net11": "7e:27:5d:cb:dd:66",
            "net12": "32:db:2b:3d:d3:20",
            "net13": "1a:42:40:f3:02:56",
            "net14": "82:8f:ca:f2:e0:6c",
            "net15": "c2:39:f9:cc:34:e2",
            "net2": "76:7d:43:77:bf:15",
            "net3": "b6:89:bc:cc:64:74",
            "net4": "c2:b2:fa:29:9f:42",
            "net5": "c6:a7:62:a7:6d:23",
            "net6": "92:5f:d8:ff:ba:9b",
            "net7": "fa:2b:43:6a:29:98",
            "net8": "aa:35:de:51:7c:96",
            "net9": "ca:1c:29:dc:9a:1c"
        },
        "spine_8_1_3": {
            "net0": "66:4b:d8:e4:ea:02",
            "net1": "f6:e2:34:be:ad:a1",
            "net10": "72:7a:75:ef:9e:07",
            "net11": "c2:8c:76:aa:c4:76",
            "net12": "0a:66:ae:1a:8d:d9",
            "net13": "ca:ba:b8:3b:0a:a5",
            "net14": "c2:9a:85:b6:ea:e3",
            "net15": "26:51:35:62:a8:4e",
            "net2": "02:5b:fd:07:b5:0f",
            "net3": "7a:15:e9:35:13:ef",
            "net4": "66:9e:e2:20:5d:b6",
            "net5": "7e:20:49:31:75:d9",
            "net6": "8e:2b:f8:16:e4:7c",
            "net7": "56:9f:20:dd:19:45",
            "net8": "fe:b4:f9:6a:31:16",
            "net9": "3e:82:a6:a1:6a:ae"
        },
        "spine_8_1_4": {
            "net0": "f6:e3:66:8b:6b:37",
            "net1": "c2:e0:d0:ac:2f:c6",
            "net10": "e6:fb:d2:3e:ce:1f",
            "net11": "7e:25:3f:43:96:31",
            "net12": "9a:2c:d7:a6:f3:89",
            "net13": "9e:8e:3d:df:65:1a",
            "net14": "0a:34:ff:12:78:b3",
            "net15": "e6:fc:24:22:1f:93",
            "net2": "ea:d9:3a:c0:4e:e5",
            "net3": "42:b0:52:8e:11:0d",
            "net4": "02:75:17:8f:21:79",
            "net5": "ee:20:09:5d:ca:f1",
            "net6": "5e:85:0e:99:92:42",
            "net7": "52:d4:e3:65:c5:9a",
            "net8": "4a:70:72:3f:95:39",
            "net9": "3a:8a:cf:35:7d:f6"
        },
        "spine_8_1_5": {
            "net0": "c2:b7:a4:80:b6:8a",
            "net1": "7a:c0:d5:2b:3d:52",
            "net10": "ce:f0:9e:32:d1:e8",
            "net11": "36:bc:30:1d:9c:84",
            "net12": "1a:b3:90:66:82:0e",
            "net13": "a6:f1:8a:29:15:f5",
            "net14": "1e:e5:c4:86:3c:11",
            "net15": "36:0b:a9:cc:ca:05",
            "net2": "de:b1:47:be:1c:ea",
            "net3": "3a:71:3e:23:ec:33",
            "net4": "f2:72:64:a5:d3:16",
            "net5": "de:1e:29:9b:5a:d3",
            "net6": "72:01:10:96:f2:23",
            "net7": "ea:f9:3e:ec:7a:18",
            "net8": "36:31:4c:39:cb:bc",
            "net9": "be:fe:83:e0:2e:d0"
        },
        "spine_8_1_6": {
            "net0": "12:79:fc:24:6b:d2",
            "net1": "82:2b:6c:e0:27:de",
            "net10": "86:12:d3:da:c6:fe",
            "net11": "4e:5d:90:02:4b:dd",
            "net12": "4a:e1:36:6d:36:9a",
            "net13": "d6:30:eb:ec:45:94",
            "net14": "92:9b:eb:b1:38:ff",
            "net15": "56:a2:63:75:1d:d3",
            "net2": "4e:b6:cc:d3:f2:b6",
            "net3": "0a:49:e1:7b:d7:25",
            "net4": "4a:85:be:9e:35:e0",
            "net5": "5e:69:a0:3e:4b:f0",
            "net6": "e2:84:05:93:65:28",
            "net7": "b6:8b:15:98:03:00",
            "net8": "be:75:b3:29:bf:8c",
            "net9": "36:ee:2b:c5:d5:91"
        },
        "spine_8_1_7": {
            "net0": "3a:32:af:d9:dc:8a",
            "net1": "2a:28:c7:80:c2:ec",
            "net10": "2a:58:be:5a:99:7e",
            "net11": "86:a7:1c:7b:92:7c",
            "net12": "1a:ef:0a:2b:23:37",
            "net13": "66:c2:52:37:d6:0e",
            "net14": "a6:e1:d3:de:50:4c",
            "net15": "5e:b5:a3:4d:86:9b",
            "net2": "06:5c:ac:04:fb:c0",
            "net3": "5e:b7:a4:d5:4f:02",
            "net4": "da:dd:8b:6b:59:cf",
            "net5": "ee:b1:e0:8a:30:ec",
            "net6": "5a:6b:0f:76:d7:5a",
            "net7": "c2:59:de:47:b0:95",
            "net8": "02:90:ac:18:bc:1c",
            "net9": "6e:0d:08:3b:80:a9"
        },
        "spine_8_1_8": {
            "net0": "9a:65:c4:ea:44:57",
            "net1": "4a:44:fe:49:09:ac",
            "net10": "16:0e:c7:ff:cb:1a",
            "net11": "02:4b:a9:3b:0a:1c",
            "net12": "ae:de:52:f2:19:5c",
            "net13": "86:f5:17:e7:60:31",
            "net14": "66:1d:ee:04:78:bc",
            "net15": "72:7b:55:78:65:65",
            "net2": "0e:9c:1b:49:d8:23",
            "net3": "ca:06:eb:3a:f2:41",
            "net4": "f6:4a:79:d0:ab:df",
            "net5": "b2:8b:b1:8e:66:fe",
            "net6": "b6:89:7f:04:50:61",
            "net7": "82:45:57:9d:99:4d",
            "net8": "de:de:7a:97:43:3f",
            "net9": "56:6c:1a:80:60:2e"
        },
        "tof_1_2_1": {
            "net0": "e6:8d:8a:2a:68:15",
            "net1": "3e:3b:23:f4:2d:16",
            "net10": "5a:74:dc:6f:d5:3b",
            "net11": "aa:81:85:c6:6d:06",
            "net12": "d6:db:2e:83:03:49",
            "net13": "ae:36:98:70:e4:4c",
            "net14": "c2:eb:3e:de:a5:01",
            "net15": "62:09:7d:98:26:00",
            "net2": "f6:b5:d2:5e:51:76",
            "net3": "76:2f:b5:da:9e:55",
            "net4": "76:b3:a7:67:aa:b3",
            "net5": "1e:22:4a:b9:c7:b1",
            "net6": "da:78:a8:92:dd:9e",
            "net7": "12:88:80:77:bf:f2",
            "net8": "ba:94:3f:6f:3c:b6",
            "net9": "06:5f:ae:90:72:8a"
        },
        "tof_1_2_2": {
            "net0": "12:7f:14:52:e4:a4",
            "net1": "46:46:ac:05:86:dd",
            "net10": "1e:c0:bd:a0:80:d9",
            "net11": "82:ad:d9:8e:21:e5",
            "net12": "c2:0c:9d:f8:77:21",
            "net13": "b2:56:69:b6:de:9d",
            "net14": "ee:91:e3:09:6e:83",
            "net15": "56:d0:c9:7a:0e:16",
            "net2": "b2:c4:e6:4e:b0:ec",
            "net3": "62:84:b7:46:b6:bf",
            "net4": "56:33:66:79:ce:45",
            "net5": "ea:cd:73:ae:5b:47",
            "net6": "5e:3e:b1:83:13:6c",
            "net7": "f6:0c:be:de:6e:f1",
            "net8": "ce:39:7d:c6:1d:18",
            "net9": "fa:98:d1:fd:ab:c2"
        },
        "tof_1_2_3": {
            "net0": "c2:0b:ef:d2:1c:88",
            "net1": "5a:ac:d4:fd:63:3f",
            "net10": "e2:6d:4b:73:18:67",
            "net11": "7e:44:e7:b3:41:45",
            "net12": "0a:e8:fe:fb:9c:0e",
            "net13": "4a:45:4f:ff:c1:35",
            "net14": "3e:7d:2f:40:91:bc",
            "net15": "32:fa:4d:58:08:7c",
            "net2": "22:8e:6b:56:33:83",
            "net3": "36:a6:5a:2b:50:9d",
            "net4": "2e:87:76:00:f7:c2",
            "net5": "aa:0a:36:ee:43:9c",
            "net6": "12:2a:36:5b:58:06",
            "net7": "aa:bd:6e:f7:2a:d9",
            "net8": "d6:b7:1d:7c:6d:a4",
            "net9": "fe:81:82:06:5c:c9"
        },
        "tof_1_2_4": {
            "net0": "aa:cd:82:bd:c4:5b",
            "net1": "06:fe:c3:92:11:59",
            "net10": "7e:80:b0:b5:73:08",
            "net11": "a6:f9:2c:71:67:5d",
            "net12": "62:2a:2e:63:a5:f1",
            "net13": "4e:d0:45:59:f6:bd",
            "net14": "e2:86:b5:10:e9:1d",
            "net15": "62:ab:b7:0f:8f:5e",
            "net2": "96:a8:2f:23:92:28",
            "net3": "8e:a8:f3:5c:93:43",
            "net4": "3a:b7:3a:30:d9:85",
            "net5": "e2:ed:a4:3e:b3:f7",
            "net6": "72:33:90:56:51:90",
            "net7": "0a:28:cf:6e:11:e5",
            "net8": "e6:57:99:5d:1c:44",
            "net9": "5e:04:f2:85:09:55"
        },
        "tof_1_2_5": {
            "net0": "62:1c:d9:49:ea:6e",
            "net1": "fe:97:7e:1d:a5:67",
            "net10": "5e:20:0c:67:b6:ec",
            "net11": "4a:61:33:6e:0f:2b",
            "net12": "2e:7e:a0:4c:f2:eb",
            "net13": "7a:fe:c8:8c:55:ec",
            "net14": "6a:a0:3e:e0:00:b9",
            "net15": "36:17:31:d6:b5:d5",
            "net2": "a2:db:d0:21:4f:da",
            "net3": "fa:78:81:10:ac:6b",
            "net4": "be:9d:94:2a:42:51",
            "net5": "46:1a:af:07:b2:4b",
            "net6": "c2:0d:d5:23:8b:42",
            "net7": "36:13:91:35:3e:1c",
            "net8": "56:ed:8d:17:78:37",
            "net9": "5a:dc:0c:42:f1:22"
        },
        "tof_1_2_6": {
            "net0": "ba:ef:56:e7:1b:02",
            "net1": "d6:6a:f2:c4:23:b9",
            "net10": "6a:c3:95:7f:46:cf",
            "net11": "32:13:f3:6f:81:16",
            "net12": "06:50:3a:e6:66:26",
            "net13": "5e:99:b8:5c:76:72",
            "net14": "9e:c3:ba:11:b6:49",
            "net15": "9a:3e:80:f1:a3:ec",
            "net2": "6a:c4:a1:63:14:04",
            "net3": "3e:e6:5e:ea:7b:1c",
            "net4": "ce:f9:4c:6e:cb:75",
            "net5": "06:b4:22:75:3e:fd",
            "net6": "6a:3f:95:dc:23:b6",
            "net7": "2e:65:b5:a6:7d:32",
            "net8": "e2:c7:39:fb:26:79",
            "net9": "de:02:8c:32:fd:0d"
        },
        "tof_1_2_7": {
            "net0": "42:52:9e:0f:63:b8",
            "net1": "e6:9b:7e:f5:f1:d1",
            "net10": "82:3a:25:cc:d1:84",
            "net11": "62:17:b1:c8:9b:ef",
            "net12": "42:da:9d:bf:f4:4e",
            "net13": "e6:46:dc:d6:e8:d5",
            "net14": "42:1b:7c:34:19:7d",
            "net15": "42:ea:ce:9f:e7:11",
            "net2": "92:e3:58:53:a8:ad",
            "net3": "86:fa:f1:c0:db:e3",
            "net4": "2e:81:91:2a:84:7a",
            "net5": "b2:2c:4b:1f:b7:85",
            "net6": "9e:fd:df:01:40:ee",
            "net7": "0a:24:9e:5c:23:31",
            "net8": "f6:b3:e0:dd:73:33",
            "net9": "76:03:02:de:85:c0"
        },
        "tof_1_2_8": {
            "net0": "de:44:ef:ca:4c:8e",
            "net1": "7e:2f:1d:47:38:c7",
            "net10": "ce:02:5b:b1:b1:62",
            "net11": "ae:85:77:e2:78:1e",
            "net12": "de:35:f1:54:33:e9",
            "net13": "92:c0:7f:de:3e:a6",
            "net14": "c6:37:1e:d3:74:a2",
            "net15": "ca:bf:0a:84:60:83",
            "net2": "6a:f1:5f:17:8d:29",
            "net3": "be:ce:c4:ec:34:17",
            "net4": "c6:64:e3:97:4c:13",
            "net5": "26:3e:f1:1e:48:c2",
            "net6": "f6:4d:a7:4f:63:34",
            "net7": "1e:28:ea:09:39:db",
            "net8": "8e:9b:7f:56:9b:e7",
            "net9": "1e:14:01:ba:8b:4c"
        },
        "tof_2_2_1": {
            "net0": "be:c6:c8:e3:30:ad",
            "net1": "26:ef:33:dd:55:7a",
            "net10": "aa:e9:ee:9e:42:f8",
            "net11": "be:37:51:3b:8a:92",
            "net12": "36:a0:30:ad:e3:8c",
            "net13": "c6:6f:ce:f8:1d:c1",
            "net14": "76:42:1e:a1:07:3f",
            "net15": "a6:ee:73:47:29:04",
            "net2": "de:c1:b8:1c:f8:b6",
            "net3": "e2:af:57:19:48:46",
            "net4": "7e:f1:3d:7f:92:74",
            "net5": "5a:ed:92:66:7e:db",
            "net6": "56:01:73:95:d3:db",
            "net7": "22:60:46:c7:ab:eb",
            "net8": "1e:01:22:08:93:b5",
            "net9": "1e:d2:6d:c5:01:4c"
        },
        "tof_2_2_2": {
            "net0": "46:07:5f:50:55:35",
            "net1": "92:3f:0f:98:1f:02",
            "net10": "5a:c8:64:75:ab:73",
            "net11": "9a:3d:7d:78:10:75",
            "net12": "c6:6e:99:db:ba:c5",
            "net13": "4a:95:0f:a1:6f:23",
            "net14": "2e:c5:0e:30:a1:13",
            "net15": "8e:85:a6:3a:76:b5",
            "net2": "36:3f:af:91:12:83",
            "net3": "c6:90:b6:a5:47:84",
            "net4": "4a:a5:04:6a:8f:fb",
            "net5": "5a:8d:a7:3a:9d:c0",
            "net6": "96:82:a3:98:a8:8d",
            "net7": "22:82:d2:87:04:ec",
            "net8": "1a:32:9c:85:c1:91",
            "net9": "7a:d4:a9:b9:c6:d9"
        },
        "tof_2_2_3": {
            "net0": "22:54:cf:c3:3e:bf",
            "net1": "4e:e5:ed:07:a7:1a",
            "net10": "ce:db:68:40:13:c6",
            "net11": "8a:d0:9f:47:8b:ba",
            "net12": "1e:1d:78:46:b6:56",
            "net13": "52:0d:cf:18:d4:17",
            "net14": "ce:2d:6d:f5:f5:75",
            "net15": "1a:6e:16:df:12:29",
            "net2": "46:85:71:99:78:97",
            "net3": "c6:4b:9b:e5:a1:9f",
            "net4": "22:7e:a6:81:2c:b4",
            "net5": "d2:4f:a0:7e:61:c2",
            "net6": "6e:03:f1:60:27:f8",
            "net7": "e6:b1:73:c4:24:65",
            "net8": "1e:0a:26:0a:84:a9",
            "net9": "02:be:b5:39:24:31"
        },
        "tof_2_2_4": {
            "net0": "9a:b4:8e:65:8a:51",
            "net1": "ba:41:a2:20:60:a5",
            "net10": "c6:0c:e3:21:9e:81",
            "net11": "a6:4d:97:13:d1:6a",
            "net12": "d6:6d:9b:a1:84:ed",
            "net13": "b2:26:24:b5:fd:9b",
            "net14": "62:b3:4c:a7:94:e9",
            "net15": "3e:61:40:a2:09:72",
            "net2": "2e:aa:0e:5b:aa:51",
            "net3": "2e:0a:b5:db:d1:b2",
            "net4": "2a:fa:6a:d9:67:cf",
            "net5": "42:27:e8:46:8b:0c",
            "net6": "ce:16:a6:de:99:44",
            "net7": "de:4c:d8:6c:ce:eb",
            "net8": "2e:4c:17:9a:d3:00",
            "net9": "f6:e7:e9:8c:28:1e"
        },
        "tof_2_2_5": {
            "net0": "72:e1:64:cf:f2:14",
            "net1": "be:12:6a:46:52:28",
            "net10": "12:57:03:4e:02:fa",
            "net11": "36:4a:2d:d6:1c:b6",
            "net12": "86:38:1b:9b:58:60",
            "net13": "c6:a8:68:9c:52:54",
            "net14": "12:d1:7a:d7:f4:bc",
            "net15": "f6:cd:10:79:ee:11",
            "net2": "e6:24:ac:7e:41:b8",
            "net3": "a2:d9:cd:ab:bf:f0",
            "net4": "4e:11:ba:04:20:b4",
            "net5": "56:f3:dd:c4:34:8f",
            "net6": "1a:82:e7:91:91:53",
            "net7": "5e:02:8a:c8:79:ca",
            "net8": "f2:9b:84:36:99:08",
            "net9": "c2:89:92:48:2e:e3"
        },
        "tof_2_2_6": {
            "net0": "ba:ff:cf:a0:11:25",
            "net1": "5a:fd:96:98:46:7b",
            "net10": "86:a4:3c:e9:79:3f",
            "net11": "b2:6b:9b:ea:24:66",
            "net12": "c6:11:ca:73:20:3f",
            "net13": "fa:1c:6a:9b:1b:a9",
            "net14": "3a:10:88:4b:04:cb",
            "net15": "1a:2f:b9:cc:3b:2d",
            "net2": "9e:ac:a8:81:44:7e",
            "net3": "06:5a:34:c2:3c:93",
            "net4": "82:53:9b:72:4d:45",
            "net5": "02:a3:76:f6:bb:a6",
            "net6": "42:60:0c:4c:84:4a",
            "net7": "c6:fb:85:d7:31:a6",
            "net8": "42:3b:84:61:1f:fa",
            "net9": "ea:25:6d:03:20:8c"
        },
        "tof_2_2_7": {
            "net0": "fa:1d:1a:4a:4f:c2",
            "net1": "76:cc:bf:b6:b2:ac",
            "net10": "0a:6b:1b:ac:1c:90",
            "net11": "6a:60:56:45:32:3f",
            "net12": "02:79:d2:fb:96:a5",
            "net13": "66:4c:6d:51:a7:21",
            "net14": "2a:46:68:62:54:ff",
            "net15": "4a:8e:8b:80:17:48",
            "net2": "ae:00:89:6e:cc:ca",
            "net3": "d6:4a:60:80:54:3c",
            "net4": "26:b5:b8:91:ca:91",
            "net5": "b2:37:a5:56:cd:9b",
            "net6": "72:38:ab:7e:24:e3",
            "net7": "e6:e0:63:81:6d:19",
            "net8": "8a:42:ff:a4:f9:ee",
            "net9": "46:83:f3:7e:12:10"
        },
        "tof_2_2_8": {
            "net0": "3e:6a:86:3a:90:3c",
            "net1": "52:41:09:a1:a4:2b",
            "net10": "e6:11:c5:ac:bb:45",
            "net11": "06:3f:bc:cd:ed:c3",
            "net12": "1e:56:94:23:22:04",
            "net13": "6e:80:57:3e:36:5f",
            "net14": "46:53:53:bc:1a:2b",
            "net15": "aa:4b:92:1c:1b:51",
            "net2": "d6:62:90:4f:a6:89",
            "net3": "1e:a6:68:1e:f5:0a",
            "net4": "ce:d1:c5:a0:f5:e8",
            "net5": "02:60:d6:9f:23:10",
            "net6": "0a:2a:13:f3:57:e1",
            "net7": "56:4a:bc:4b:80:17",
            "net8": "de:d7:38:49:e3:62",
            "net9": "1e:65:70:9e:00:73"
        },
        "tof_3_2_1": {
            "net0": "12:1d:68:3e:28:3b",
            "net1": "62:f5:0b:ee:5f:bd",
            "net10": "36:e8:24:5a:82:91",
            "net11": "22:7b:6c:ba:1f:d1",
            "net12": "96:57:a2:a9:47:03",
            "net13": "fa:de:95:5d:93:24",
            "net14": "b2:e4:ab:8c:c8:70",
            "net15": "ea:13:e5:a7:85:90",
            "net2": "56:96:f9:b4:f8:4c",
            "net3": "26:68:22:52:28:2d",
            "net4": "72:05:75:38:c4:42",
            "net5": "32:f3:6d:42:b3:9c",
            "net6": "a2:fc:9c:c9:7b:35",
            "net7": "fe:1a:3d:29:0b:48",
            "net8": "62:5f:e3:f7:0f:e1",
            "net9": "76:63:41:93:9c:b6"
        },
        "tof_3_2_2": {
            "net0": "0a:e6:90:9b:24:97",
            "net1": "5e:bc:97:c9:18:2c",
            "net10": "2e:6b:5d:59:9e:57",
            "net11": "f2:9c:51:fb:dd:9f",
            "net12": "de:e2:d7:6f:1e:6d",
            "net13": "4a:cd:a1:bc:b8:bb",
            "net14": "ae:5b:6c:20:a1:15",
            "net15": "26:2c:72:9b:9d:db",
            "net2": "ea:2b:12:ea:27:c6",
            "net3": "36:69:ea:10:16:72",
            "net4": "3a:2d:67:31:89:dd",
            "net5": "fe:49:74:bc:26:a6",
            "net6": "52:6e:71:b5:7a:48",
            "net7": "66:84:8d:81:a5:b7",
            "net8": "12:60:59:ba:25:b6",
            "net9": "a2:02:75:98:05:05"
        },
        "tof_3_2_3": {
            "net0": "5e:33:22:c5:60:2d",
            "net1": "0a:2c:d7:e9:99:43",
            "net10": "12:c6:c1:3d:d9:28",
            "net11": "5a:57:38:9a:d0:ac",
            "net12": "56:fa:ae:31:15:a8",
            "net13": "9a:41:1c:94:5a:31",
            "net14": "ee:8e:ba:9e:34:fa",
            "net15": "e2:3e:d0:71:2a:7a",
            "net2": "56:8c:98:97:5c:dd",
            "net3": "3e:69:9a:43:9a:8c",
            "net4": "1e:d0:81:be:94:c4",
            "net5": "02:8b:32:0e:ec:d6",
            "net6": "82:cb:b9:76:cd:31",
            "net7": "3e:97:c0:7c:ee:01",
            "net8": "16:bb:58:c8:60:50",
            "net9": "4a:6c:ac:7b:5a:40"
        },
        "tof_3_2_4": {
            "net0": "aa:19:0d:e4:ff:39",
            "net1": "46:c0:29:47:b0:9b",
            "net10": "86:09:5b:19:a7:8b",
            "net11": "02:ec:a0:4f:7d:cc",
            "net12": "9a:e6:9a:dc:7c:79",
            "net13": "ee:8a:a1:14:37:48",
            "net14": "16:61:a9:54:74:fe",
            "net15": "de:29:3e:3a:3b:28",
            "net2": "e6:7d:93:51:30:3d",
            "net3": "b6:cd:e7:f3:4e:df",
            "net4": "ce:9a:39:67:d9:28",
            "net5": "d2:49:ea:eb:96:47",
            "net6": "3a:96:d0:dc:68:aa",
            "net7": "c2:e3:dd:97:43:17",
            "net8": "06:a5:67:97:d5:55",
            "net9": "76:d0:b4:35:81:0a"
        },
        "tof_3_2_5": {
            "net0": "52:e2:e8:84:5b:26",
            "net1": "26:80:db:20:40:3f",
            "net10": "22:9c:fb:cb:d0:bc",
            "net11": "22:d3:be:c4:6e:7c",
            "net12": "fa:66:62:a2:80:70",
            "net13": "3e:c5:4f:b1:b6:a3",
            "net14": "66:63:df:71:f3:95",
            "net15": "02:7e:f3:31:8f:8d",
            "net2": "d2:9f:4b:12:69:06",
            "net3": "3a:d3:ab:fb:b8:a8",
            "net4": "1e:05:c6:5c:8a:66",
            "net5": "ce:6e:76:88:0b:b0",
            "net6": "c2:71:1d:b6:07:98",
            "net7": "b2:f2:ed:50:f2:8a",
            "net8": "46:d6:5e:11:41:23",
            "net9": "4a:58:5b:56:6a:11"
        },
        "tof_3_2_6": {
            "net0": "9e:b9:a3:be:91:d5",
            "net1": "fa:6a:27:63:1e:c3",
            "net10": "e6:3d:32:e5:6f:58",
            "net11": "ca:c9:52:79:c2:1e",
            "net12": "c6:5f:9f:f0:fa:26",
            "net13": "1a:2a:6e:ee:67:c4",
            "net14": "ba:61:ba:c6:59:18",
            "net15": "86:35:5c:d4:d5:f4",
            "net2": "82:d0:2f:d9:d7:e4",
            "net3": "ea:65:dc:cb:13:dc",
            "net4": "de:fc:9a:cd:85:3d",
            "net5": "92:7e:96:be:47:6d",
            "net6": "2a:55:50:2c:a7:18",
            "net7": "86:14:09:86:ac:50",
            "net8": "76:3f:88:49:47:5b",
            "net9": "be:f7:1e:c1:02:f5"
        },
        "tof_3_2_7": {
            "net0": "0a:0c:fe:61:96:83",
            "net1": "ca:43:bb:d1:17:9a",
            "net10": "86:af:17:c3:14:7e",
            "net11": "c2:c7:9e:fe:ca:20",
            "net12": "c6:5d:9f:e4:07:73",
            "net13": "c6:d2:09:33:9c:48",
            "net14": "52:af:de:5a:41:2f",
            "net15": "9e:cd:b6:3f:ec:ae",
            "net2": "66:4f:6a:5a:6d:32",
            "net3": "12:c5:7b:fe:ea:40",
            "net4": "0a:2a:0e:2d:1a:0e",
            "net5": "2a:00:6e:24:02:f3",
            "net6": "66:c7:c3:91:c5:a7",
            "net7": "da:33:7b:f1:92:d3",
            "net8": "02:f6:8d:11:8c:e3",
            "net9": "c6:a7:53:4e:11:6b"
        },
        "tof_3_2_8": {
            "net0": "aa:9d:cb:5c:0b:c5",
            "net1": "f2:17:82:ce:ef:22",
            "net10": "aa:14:4e:08:a9:ff",
            "net11": "1a:db:ab:35:a0:c3",
            "net12": "1e:56:09:49:2d:ae",
            "net13": "9a:f5:1b:89:07:64",
            "net14": "32:bc:0f:88:0e:c0",
            "net15": "0a:49:94:c6:7a:01",
            "net2": "d6:13:86:a5:47:9e",
            "net3": "7e:35:8e:a0:c7:6b",
            "net4": "ee:10:17:0b:c1:3b",
            "net5": "d2:2a:5d:9c:e6:03",
            "net6": "66:cc:22:4d:ef:4f",
            "net7": "52:bb:88:77:99:dd",
            "net8": "fe:a9:ba:ff:c7:e1",
            "net9": "22:73:20:eb:d1:b2"
        },
        "tof_4_2_1": {
            "net0": "76:6b:76:f3:5f:f0",
            "net1": "0e:23:ed:83:f7:d6",
            "net10": "ea:7d:06:18:44:a1",
            "net11": "6a:41:27:41:b1:62",
            "net12": "46:0a:f9:36:7a:62",
            "net13": "76:6b:ce:23:28:29",
            "net14": "da:7b:c8:a1:47:50",
            "net15": "be:48:75:f3:b4:af",
            "net2": "5a:0c:ef:a3:68:76",
            "net3": "f6:19:59:89:9a:55",
            "net4": "ca:7f:4d:84:ca:8c",
            "net5": "1a:c5:98:75:32:9c",
            "net6": "ba:90:a2:36:48:f5",
            "net7": "62:90:01:93:4a:dd",
            "net8": "7e:d5:8a:7d:22:d1",
            "net9": "fe:c6:36:ee:28:79"
        },
        "tof_4_2_2": {
            "net0": "de:8c:06:ed:b4:42",
            "net1": "ea:a1:3e:b1:5c:67",
            "net10": "62:6f:43:94:eb:b7",
            "net11": "de:a2:80:cd:db:97",
            "net12": "92:9c:99:0d:90:d4",
            "net13": "b2:43:15:0b:7a:69",
            "net14": "a6:99:a6:c2:1d:74",
            "net15": "c6:96:fa:21:e5:e4",
            "net2": "c2:2a:ff:1f:fc:3c",
            "net3": "66:53:e3:b3:59:c8",
            "net4": "ba:60:68:14:3b:8b",
            "net5": "1a:f6:6f:ce:86:a9",
            "net6": "6a:38:47:23:33:66",
            "net7": "92:62:77:fd:7a:f5",
            "net8": "36:c0:a6:5e:b9:2a",
            "net9": "6a:8b:2f:ea:6a:68"
        },
        "tof_4_2_3": {
            "net0": "56:f6:ef:0f:d9:17",
            "net1": "32:fe:06:92:a9:ef",
            "net10": "26:6d:7d:81:db:35",
            "net11": "26:96:7a:c4:74:94",
            "net12": "8e:47:fe:0a:dc:71",
            "net13": "5e:e5:00:04:6b:0e",
            "net14": "26:5f:00:2b:e4:56",
            "net15": "fa:bb:6e:9c:dc:6c",
            "net2": "62:3c:c5:13:8f:a1",
            "net3": "92:e6:ed:1f:b9:86",
            "net4": "ce:ff:84:60:02:09",
            "net5": "e6:82:a6:75:7e:85",
            "net6": "0e:f2:34:35:0a:ac",
            "net7": "16:21:8b:4b:fb:05",
            "net8": "1a:6b:79:5b:f4:de",
            "net9": "1e:b4:e5:b1:e1:4a"
        },
        "tof_4_2_4": {
            "net0": "be:31:c2:7b:24:58",
            "net1": "de:52:af:5c:db:ee",
            "net10": "fa:40:a0:18:ff:d5",
            "net11": "2e:8d:02:1a:9f:49",
            "net12": "d2:21:46:b9:7d:ff",
            "net13": "42:06:55:d7:63:74",
            "net14": "5a:c7:00:a6:5b:1a",
            "net15": "0a:85:c7:fa:45:90",
            "net2": "22:99:4a:77:fa:a6",
            "net3": "82:91:32:d6:01:8b",
            "net4": "8e:13:fc:bc:c4:80",
            "net5": "76:0a:00:2b:5a:b9",
            "net6": "16:96:bd:a3:c3:ab",
            "net7": "9a:fb:1e:92:7e:8b",
            "net8": "a6:37:cd:de:cb:0e",
            "net9": "1e:ce:9a:80:c8:f9"
        },
        "tof_4_2_5": {
            "net0": "ee:cf:3d:1d:72:fb",
            "net1": "e2:ee:28:70:3a:52",
            "net10": "de:ab:ae:99:78:ef",
            "net11": "52:96:ba:a0:92:0f",
            "net12": "4e:6e:0c:5b:04:e7",
            "net13": "1a:cb:0f:be:5e:76",
            "net14": "9e:52:7d:f5:9a:72",
            "net15": "82:05:60:81:94:94",
            "net2": "72:04:4b:60:e1:f8",
            "net3": "f6:40:dd:14:45:5c",
            "net4": "26:f4:ce:cd:c4:db",
            "net5": "b6:af:82:93:37:bd",
            "net6": "da:ce:79:f0:df:f0",
            "net7": "8a:08:4c:6c:c4:1c",
            "net8": "0a:a8:c5:ad:b1:cb",
            "net9": "36:2c:81:69:f8:a6"
        },
        "tof_4_2_6": {
            "net0": "62:a6:49:52:99:24",
            "net1": "1e:6f:e0:d5:35:ec",
            "net10": "2e:21:38:b1:9f:11",
            "net11": "ee:67:36:bb:92:cb",
            "net12": "6a:4d:bf:4d:e6:ed",
            "net13": "5e:1a:c9:4c:89:35",
            "net14": "ea:aa:0b:d6:fd:0b",
            "net15": "1e:0c:86:bf:f5:dc",
            "net2": "c2:0b:28:dd:ee:7d",
            "net3": "e2:3d:7f:be:77:41",
            "net4": "6a:1f:b7:97:ec:9f",
            "net5": "da:27:15:da:44:bb",
            "net6": "6e:bc:41:34:8f:ff",
            "net7": "32:44:95:66:28:2a",
            "net8": "1a:d0:d6:96:9d:81",
            "net9": "ea:3c:64:ec:d7:10"
        },
        "tof_4_2_7": {
            "net0": "b6:12:89:47:53:b9",
            "net1": "86:79:22:b1:32:2d",
            "net10": "fe:ab:6a:8a:c3:4c",
            "net11": "8a:e6:cf:37:b0:af",
            "net12": "1e:ca:42:8d:5c:b5",
            "net13": "c6:00:0e:0c:24:6d",
            "net14": "f2:70:84:25:85:8d",
            "net15": "32:b4:4b:dd:d7:fa",
            "net2": "66:55:8b:19:a3:5f",
            "net3": "16:19:81:2a:2a:83",
            "net4": "0a:c2:38:83:05:a6",
            "net5": "ce:71:0c:26:a0:a1",
            "net6": "7e:29:39:ac:a9:81",
            "net7": "c6:3d:be:54:3c:b5",
            "net8": "de:eb:03:76:5d:ae",
            "net9": "26:54:bd:1f:47:7d"
        },
        "tof_4_2_8": {
            "net0": "ca:0a:42:fe:e7:7c",
            "net1": "3a:c7:5d:cf:4e:f5",
            "net10": "da:ce:a4:0a:90:3e",
            "net11": "fa:de:d5:f5:5e:11",
            "net12": "8a:25:8b:79:53:16",
            "net13": "da:a4:66:c0:8e:72",
            "net14": "fa:9a:76:ce:13:ba",
            "net15": "16:7b:1c:19:0e:2a",
            "net2": "1a:66:7d:94:cb:59",
            "net3": "ae:6c:91:23:27:41",
            "net4": "c2:95:cb:1e:8e:e1",
            "net5": "06:28:33:a4:68:70",
            "net6": "56:6e:6e:cc:c6:6d",
            "net7": "0a:f0:48:58:9e:ce",
            "net8": "d2:a0:70:73:a4:8c",
            "net9": "62:88:ea:f7:ce:be"
        }
    },
    "failed_machine": "spine_1_1_1",
    "failure_time": 1613209554.0346131
}