{
    "k_leaf": 8,
    "k_top": 8,
    "redundancy_factor": 8,
    "is_k8s": true,
    "machine_mac_addresses": {
        "leaf_1_0_1": {
            "net0": "9e:91:97:0f:ec:2d",
            "net1": "ce:76:f3:68:f7:55",
            "net2": "86:a9:90:7c:47:bd",
            "net3": "82:b6:59:92:e9:b5",
            "net4": "8e:74:1b:46:d7:58",
            "net5": "f6:ca:ef:4d:e5:ec",
            "net6": "32:3c:93:39:da:86",
            "net7": "92:e7:93:05:87:38",
            "net8": "82:eb:08:0b:08:4b"
        },
        "leaf_1_0_2": {
            "net0": "82:81:c6:3b:66:8c",
            "net1": "3a:1d:c9:b5:ea:85",
            "net2": "66:0d:f0:bc:b2:a5",
            "net3": "c2:ec:48:54:1b:c4",
            "net4": "4e:41:86:73:f0:60",
            "net5": "56:3f:43:4c:f4:e1",
            "net6": "5e:93:9d:d5:ac:d3",
            "net7": "da:d9:7d:b6:b9:20",
            "net8": "ca:dd:11:62:ce:b0"
        },
        "leaf_1_0_3": {
            "net0": "ee:83:24:8d:3c:31",
            "net1": "f2:ce:23:14:de:ec",
            "net2": "f6:f4:78:08:4a:e1",
            "net3": "02:cd:3a:28:89:f2",
            "net4": "c2:29:0a:e3:26:eb",
            "net5": "62:4e:ee:e4:f1:f8",
            "net6": "6e:1d:c1:63:c9:d9",
            "net7": "5a:63:b8:60:21:6c",
            "net8": "d6:be:f6:b6:38:33"
        },
        "leaf_1_0_4": {
            "net0": "d6:e1:d1:bd:50:b3",
            "net1": "92:cc:85:68:a4:12",
            "net2": "e2:bd:a2:71:f7:9a",
            "net3": "2e:9b:0f:a2:e7:bb",
            "net4": "26:5c:81:1d:d4:b8",
            "net5": "2a:6e:58:c0:ed:a3",
            "net6": "9a:7c:73:61:44:a8",
            "net7": "76:ba:65:4f:72:5d",
            "net8": "2a:01:5b:31:85:bc"
        },
        "leaf_1_0_5": {
            "net0": "fa:5e:8d:6b:c1:df",
            "net1": "d2:4f:ea:8a:b1:e8",
            "net2": "3a:98:25:f2:61:21",
            "net3": "82:74:18:e6:f7:81",
            "net4": "6a:2d:e1:8c:64:78",
            "net5": "aa:17:9d:df:3d:8d",
            "net6": "d6:24:0d:7a:ac:d6",
            "net7": "02:28:9b:d1:8d:7b",
            "net8": "8e:59:48:e9:92:38"
        },
        "leaf_1_0_6": {
            "net0": "56:d6:3d:56:62:8e",
            "net1": "b6:35:22:dd:e3:29",
            "net2": "f2:e6:fa:94:bc:45",
            "net3": "52:0f:47:72:a3:e2",
            "net4": "26:6e:53:dc:80:de",
            "net5": "86:83:f5:76:ba:14",
            "net6": "8e:54:87:e7:d1:53",
            "net7": "9e:88:3f:9e:a2:c1",
            "net8": "5e:20:e2:42:e1:91"
        },
        "leaf_1_0_7": {
            "net0": "0a:26:ba:86:54:a3",
            "net1": "12:4f:43:d3:fc:8d",
            "net2": "3a:f9:c2:5f:f2:04",
            "net3": "82:b5:d1:63:80:62",
            "net4": "d2:13:ae:72:65:0e",
            "net5": "ba:6b:d1:ca:c5:6f",
            "net6": "9a:28:75:f5:86:f0",
            "net7": "36:b9:89:0a:69:4d",
            "net8": "0e:7c:91:1f:4c:8a"
        },
        "leaf_1_0_8": {
            "net0": "22:b8:f0:f2:39:a0",
            "net1": "22:96:65:f1:da:2c",
            "net2": "fa:5f:93:35:f8:79",
            "net3": "3e:f7:2f:f1:a7:c1",
            "net4": "0e:9c:ae:4f:fe:ae",
            "net5": "4a:9e:24:70:5d:94",
            "net6": "02:08:5c:13:4c:dd",
            "net7": "0a:02:33:1f:ef:33",
            "net8": "4e:78:3b:bb:9e:aa"
        },
        "leaf_2_0_1": {
            "net0": "16:ed:47:dc:f0:59",
            "net1": "36:67:92:20:6b:79",
            "net2": "2a:49:8f:5e:47:39",
            "net3": "2a:31:cd:2c:46:48",
            "net4": "0e:d6:fc:3c:65:e0",
            "net5": "7a:ae:7f:0a:e9:22",
            "net6": "26:e7:f4:58:07:95",
            "net7": "f6:fc:b6:0d:3b:c1",
            "net8": "f2:d7:97:a4:4e:e7"
        },
        "leaf_2_0_2": {
            "net0": "7a:20:43:28:d1:2a",
            "net1": "6a:68:50:17:44:fb",
            "net2": "e6:c8:2e:fb:93:2b",
            "net3": "fe:18:68:7b:13:79",
            "net4": "82:d2:52:41:bd:a9",
            "net5": "5a:71:d1:65:09:28",
            "net6": "4a:d0:c4:7f:fa:bf",
            "net7": "22:a4:76:e7:9b:92",
            "net8": "3a:b3:c0:ef:49:fc"
        },
        "leaf_2_0_3": {
            "net0": "a2:17:72:ed:ec:6e",
            "net1": "86:ac:86:00:d2:72",
            "net2": "12:fb:41:49:c8:e5",
            "net3": "7e:a3:37:ea:b8:73",
            "net4": "6a:75:c1:1d:2a:82",
            "net5": "ba:ff:29:13:56:1f",
            "net6": "da:04:ab:12:5c:46",
            "net7": "5e:f8:98:fe:88:1c",
            "net8": "6e:76:4f:9a:bb:0c"
        },
        "leaf_2_0_4": {
            "net0": "c2:4a:56:ec:48:2e",
            "net1": "5e:33:f4:6d:fd:a4",
            "net2": "c2:92:6f:95:0a:c0",
            "net3": "06:2f:43:d9:bf:8c",
            "net4": "c6:59:29:b7:cd:12",
            "net5": "c6:9c:10:9d:83:a3",
            "net6": "2a:cc:f2:8b:72:b8",
            "net7": "46:72:86:0a:02:41",
            "net8": "4a:c1:4d:dc:8a:fa"
        },
        "leaf_2_0_5": {
            "net0": "12:d4:f1:18:1b:b2",
            "net1": "da:2a:5f:52:19:17",
            "net2": "ae:7f:ff:6a:de:7c",
            "net3": "9e:8d:e0:17:f4:19",
            "net4": "fe:6c:11:9d:3d:10",
            "net5": "02:be:65:f0:54:0b",
            "net6": "0e:c6:fd:94:0b:70",
            "net7": "72:66:27:8b:25:f5",
            "net8": "02:c2:3d:20:e5:27"
        },
        "leaf_2_0_6": {
            "net0": "f2:3d:da:23:4e:d2",
            "net1": "d6:2d:3c:a5:88:a3",
            "net2": "56:d8:68:8f:9b:5f",
            "net3": "82:90:e5:e3:81:b3",
            "net4": "12:b2:9b:f8:31:97",
            "net5": "12:15:c2:7f:6f:b0",
            "net6": "1e:c8:c7:f2:1e:df",
            "net7": "96:e3:04:c4:0e:4a",
            "net8": "2e:37:4b:73:c6:28"
        },
        "leaf_2_0_7": {
            "net0": "7e:4f:e7:5f:07:cd",
            "net1": "be:25:0a:1c:52:31",
            "net2": "7e:29:4c:be:f5:1b",
            "net3": "82:f0:68:6d:67:5b",
            "net4": "b6:5b:49:b7:17:2e",
            "net5": "76:21:d4:f6:96:ca",
            "net6": "ee:82:38:53:b0:8f",
            "net7": "6e:64:f5:5e:6f:41",
            "net8": "22:e8:02:d6:53:32"
        },
        "leaf_2_0_8": {
            "net0": "6e:79:c1:54:56:4a",
            "net1": "66:0d:37:b6:b2:fd",
            "net2": "1e:89:43:66:c7:76",
            "net3": "5a:f4:13:22:ac:2d",
            "net4": "fa:c6:e2:4c:2a:c5",
            "net5": "42:42:1c:62:b6:b9",
            "net6": "2e:57:93:a8:d4:2c",
            "net7": "72:69:4e:1b:fe:a1",
            "net8": "36:77:b4:da:cc:0c"
        },
        "spine_1_1_1": {
            "net0": "1a:68:c0:df:44:a6",
            "net1": "16:ef:8f:b1:b4:94",
            "net10": "ae:6d:96:b6:3c:22",
            "net11": "aa:9f:e3:c5:56:a2",
            "net12": "2a:d2:ea:ff:04:ac",
            "net13": "56:0f:06:7d:f3:23",
            "net14": "f6:72:47:a7:88:58",
            "net15": "de:ea:6e:48:18:09",
            "net2": "a6:85:b1:ee:41:9e",
            "net3": "76:c8:ee:14:cd:27",
            "net4": "ee:50:5b:bb:cb:a3",
            "net5": "ea:3e:be:df:03:bf",
            "net6": "36:8f:a8:5a:78:7c",
            "net7": "56:10:86:b5:0c:a0",
            "net8": "7e:3b:a0:fb:f5:65",
            "net9": "9a:a0:f2:4e:d9:03"
        },
        "spine_1_1_2": {
            "net0": "9e:e0:d7:d7:c5:59",
            "net1": "82:9b:ec:7e:1b:55",
            "net10": "12:af:e2:63:4d:cd",
            "net11": "fa:c3:43:fa:30:0b",
            "net12": "c6:97:e2:fa:3c:c5",
            "net13": "b2:03:7a:52:6e:a6",
            "net14": "fa:b5:e1:2a:9a:04",
            "net15": "26:92:d1:8a:77:8e",
            "net2": "e6:b1:09:61:74:7e",
            "net3": "42:53:8e:d3:65:94",
            "net4": "c2:6e:0b:2f:5e:7d",
            "net5": "86:a0:8e:68:0b:84",
            "net6": "76:8a:3b:bd:3a:69",
            "net7": "1e:c9:40:bd:6c:d7",
            "net8": "c6:d4:e1:29:bd:2d",
            "net9": "62:42:30:5e:3b:ca"
        },
        "spine_1_1_3": {
            "net0": "02:af:b8:69:5d:f7",
            "net1": "2e:64:4b:7f:d8:55",
            "net10": "32:d7:3f:d1:af:d8",
            "net11": "fe:32:54:c9:7e:6f",
            "net12": "32:b3:e6:df:14:b0",
            "net13": "0a:35:6f:f8:6f:54",
            "net14": "0e:47:53:a2:81:56",
            "net15": "b2:d3:1d:35:e5:52",
            "net2": "9a:2f:6f:86:eb:c9",
            "net3": "26:0f:5a:77:a6:de",
            "net4": "f2:26:92:1a:9b:ef",
            "net5": "2e:a2:c2:38:0f:d4",
            "net6": "22:7b:d8:c6:b1:13",
            "net7": "d2:97:f6:1c:f2:87",
            "net8": "de:ab:ad:2d:ac:94",
            "net9": "e2:26:aa:93:75:6b"
        },
        "spine_1_1_4": {
            "net0": "82:4c:96:98:e7:7a",
            "net1": "1a:19:64:ea:01:9c",
            "net10": "6e:a6:fd:65:f3:90",
            "net11": "9e:23:f0:88:28:e2",
            "net12": "3e:bd:b7:2c:4a:3a",
            "net13": "de:7a:02:f4:85:04",
            "net14": "2e:d6:da:4e:0f:eb",
            "net15": "ea:54:b6:08:f0:f5",
            "net2": "aa:34:f3:9a:39:95",
            "net3": "0e:65:74:49:6e:84",
            "net4": "4e:1c:8e:53:4c:f9",
            "net5": "6e:5a:4f:44:8f:fd",
            "net6": "a6:83:bc:f2:10:a7",
            "net7": "fa:e8:b3:0b:99:a0",
            "net8": "ca:e1:10:04:31:70",
            "net9": "0e:88:6b:65:59:c7"
        },
        "spine_1_1_5": {
            "net0": "06:42:79:c6:3d:38",
            "net1": "ba:43:16:a7:0b:d3",
            "net10": "c6:63:40:c2:11:56",
            "net11": "1e:d1:76:31:38:2d",
            "net12": "7a:42:e3:62:57:58",
            "net13": "de:09:13:ad:cf:76",
            "net14": "0a:88:c4:2e:0e:ae",
            "net15": "e6:52:55:3f:9a:73",
            "net2": "d2:0b:87:87:2d:17",
            "net3": "8a:60:63:23:c6:73",
            "net4": "7a:5f:e1:5c:81:70",
            "net5": "76:77:24:b4:1b:9c",
            "net6": "56:62:e3:04:7a:70",
            "net7": "12:6b:d2:92:96:de",
            "net8": "86:cf:27:c1:d6:82",
            "net9": "62:05:8d:69:ba:66"
        },
        "spine_1_1_6": {
            "net0": "ea:96:4b:bb:2f:d0",
            "net1": "92:8c:01:52:5c:da",
            "net10": "fe:f1:22:6a:21:e7",
            "net11": "aa:63:56:7d:53:60",
            "net12": "46:07:da:90:87:39",
            "net13": "a2:83:63:4c:b6:74",
            "net14": "32:52:58:bd:bc:c7",
            "net15": "d6:38:00:8a:72:10",
            "net2": "66:2f:44:a1:86:ed",
            "net3": "8e:33:e1:01:ad:df",
            "net4": "66:31:b1:f9:1b:b8",
            "net5": "22:d3:55:40:a3:5b",
            "net6": "42:40:c7:0b:dc:5a",
            "net7": "f6:3b:90:e1:7c:04",
            "net8": "ba:8f:f9:75:62:5e",
            "net9": "9a:af:05:b1:9f:b5"
        },
        "spine_1_1_7": {
            "net0": "86:c6:94:bc:92:5d",
            "net1": "52:e3:ed:71:8d:b4",
            "net10": "62:16:85:a5:23:14",
            "net11": "16:6e:b2:e6:77:1a",
            "net12": "ba:39:6a:1b:ac:ce",
            "net13": "76:62:ea:6f:6a:d2",
            "net14": "82:c3:14:bb:28:7b",
            "net15": "52:2f:93:91:fa:5f",
            "net2": "ca:a8:89:2a:9c:ed",
            "net3": "c6:5f:71:5f:42:dc",
            "net4": "26:5c:8b:bd:66:1c",
            "net5": "ce:09:4d:03:77:99",
            "net6": "02:57:b6:d0:4d:84",
            "net7": "86:31:77:e0:4a:d9",
            "net8": "5a:ee:5f:4f:8a:af",
            "net9": "0a:c4:c1:67:d0:e6"
        },
        "spine_1_1_8": {
            "net0": "36:e0:94:bf:2f:03",
            "net1": "e2:82:3a:fd:aa:bc",
            "net10": "9a:fb:f9:49:1a:d2",
            "net11": "da:5e:4f:fa:54:54",
            "net12": "2a:a8:84:84:0b:6e",
            "net13": "9a:d5:3f:61:ad:86",
            "net14": "62:e8:49:8b:ab:9c",
            "net15": "66:10:f7:23:a1:30",
            "net2": "a2:5b:b1:34:2a:59",
            "net3": "56:92:3d:e2:95:42",
            "net4": "82:47:e3:12:15:a2",
            "net5": "5e:0a:2b:46:2e:67",
            "net6": "4e:64:98:f1:99:df",
            "net7": "26:2f:01:29:5f:28",
            "net8": "3e:ac:2d:7b:da:b5",
            "net9": "ce:61:16:8f:43:69"
        },
        "spine_2_1_1": {
            "net0": "42:d8:e5:1f:71:83",
            "net1": "96:36:d0:d3:5b:2e",
            "net10": "5e:f6:24:48:d3:ff",
            "net11": "7a:81:5e:13:6c:e6",
            "net12": "c2:00:7d:93:b3:eb",
            "net13": "96:66:e3:cc:f4:30",
            "net14": "d2:e9:28:b0:c8:de",
            "net15": "8e:17:f7:3d:8e:cc",
            "net2": "06:f0:c2:08:75:62",
            "net3": "06:17:73:7e:dc:38",
            "net4": "ca:ab:75:2b:0d:9e",
            "net5": "06:a4:70:d4:c9:9a",
            "net6": "de:0c:0e:1c:43:f3",
            "net7": "6e:3f:9a:76:94:05",
            "net8": "b6:f0:5b:46:2d:67",
            "net9": "42:22:4e:a8:98:4c"
        },
        "spine_2_1_2": {
            "net0": "5e:5d:90:8b:86:8f",
            "net1": "5a:47:5c:4c:cf:ac",
            "net10": "ce:44:c7:f1:d4:fe",
            "net11": "62:4f:52:25:29:67",
            "net12": "3a:4e:72:00:d2:ff",
            "net13": "96:a3:06:d0:04:a1",
            "net14": "2e:7c:94:35:5d:08",
            "net15": "ba:bc:38:6b:7b:f3",
            "net2": "f2:5a:9c:1a:42:d8",
            "net3": "f2:9e:e0:17:bb:21",
            "net4": "a6:9d:1b:18:fa:25",
            "net5": "76:f9:06:db:6d:55",
            "net6": "96:14:25:7d:15:59",
            "net7": "02:97:e6:79:51:1b",
            "net8": "be:93:f5:ed:1a:d7",
            "net9": "3e:5a:ab:53:50:07"
        },
        "spine_2_1_3": {
            "net0": "d2:91:fd:c6:c0:62",
            "net1": "ce:08:bc:36:b0:d2",
            "net10": "de:fa:9e:27:68:da",
            "net11": "4e:e2:63:46:dc:9c",
            "net12": "1e:50:2d:f3:cc:09",
            "net13": "46:e8:42:1b:76:3c",
            "net14": "76:12:6d:c4:36:06",
            "net15": "86:68:4c:b7:00:9a",
            "net2": "b6:47:41:f6:bd:a0",
            "net3": "3e:ba:c2:9c:a3:58",
            "net4": "8e:9a:6d:47:63:18",
            "net5": "4a:d1:c9:09:84:cc",
            "net6": "26:21:07:22:2e:6d",
            "net7": "22:d2:2c:15:99:dd",
            "net8": "9a:7c:e4:93:48:c7",
            "net9": "2e:aa:c8:46:bc:e6"
        },
        "spine_2_1_4": {
            "net0": "d2:84:80:43:03:2f",
            "net1": "2a:16:46:17:ec:14",
            "net10": "7e:0b:e9:75:d7:d8",
            "net11": "7a:6a:86:5c:6b:08",
            "net12": "e2:ec:44:ff:74:f3",
            "net13": "82:4e:43:68:17:42",
            "net14": "b6:cd:9e:95:cf:ec",
            "net15": "e6:4f:d8:b4:cb:16",
            "net2": "d6:07:57:1b:73:43",
            "net3": "52:4c:44:a5:72:ad",
            "net4": "96:0f:69:5c:48:a7",
            "net5": "2e:fa:3e:db:62:5b",
            "net6": "fe:8e:13:f7:59:fe",
            "net7": "4e:e8:fc:71:54:70",
            "net8": "2a:ec:7f:44:37:df",
            "net9": "76:ef:00:c2:c2:8f"
        },
        "spine_2_1_5": {
            "net0": "06:94:a7:4c:1e:96",
            "net1": "d2:13:31:82:ca:f8",
            "net10": "be:6d:f0:60:db:16",
            "net11": "a6:94:a1:3d:88:79",
            "net12": "3e:21:38:25:9c:22",
            "net13": "a6:be:83:92:b1:18",
            "net14": "b2:2c:01:3b:55:bc",
            "net15": "d2:26:52:55:a9:b5",
            "net2": "2e:ff:cf:eb:64:3b",
            "net3": "c6:04:10:ab:53:c2",
            "net4": "3e:0f:9c:c5:f4:3a",
            "net5": "e6:dd:3f:a1:97:b4",
            "net6": "12:8a:74:26:c2:b3",
            "net7": "0a:9d:bb:0a:ef:d5",
            "net8": "26:51:24:6b:84:5a",
            "net9": "9a:c7:5a:75:fc:4a"
        },
        "spine_2_1_6": {
            "net0": "0a:66:e5:51:5b:ea",
            "net1": "ca:07:52:a2:45:81",
            "net10": "c6:c4:5c:79:58:41",
            "net11": "d6:8a:3b:63:74:b4",
            "net12": "da:bd:33:19:7f:15",
            "net13": "aa:cd:bc:30:b9:ff",
            "net14": "7a:a6:bf:13:0d:b0",
            "net15": "b2:d6:a7:33:b1:d1",
            "net2": "7e:88:c7:b4:66:bc",
            "net3": "f2:4e:c1:75:8a:a3",
            "net4": "46:12:13:5d:a0:c9",
            "net5": "9e:d9:79:8b:45:f4",
            "net6": "b2:5e:10:f2:bd:1c",
            "net7": "fa:9b:87:53:65:9e",
            "net8": "a2:45:09:b7:3c:95",
            "net9": "e6:6d:5d:e6:c4:26"
        },
        "spine_2_1_7": {
            "net0": "fa:22:94:6a:e5:34",
            "net1": "d2:13:03:aa:ea:e9",
            "net10": "de:60:90:bc:3f:a6",
            "net11": "46:20:79:2a:83:df",
            "net12": "06:f8:ab:86:9f:7f",
            "net13": "ce:35:7e:61:dd:e5",
            "net14": "be:29:f5:d3:d6:15",
            "net15": "7a:a2:11:3c:43:69",
            "net2": "12:ae:e1:e3:63:99",
            "net3": "ca:c5:e5:ec:75:9f",
            "net4": "4a:0b:75:ba:18:9b",
            "net5": "6e:81:7a:c5:0c:a9",
            "net6": "16:53:22:1e:37:7e",
            "net7": "e2:8c:f4:24:a3:ef",
            "net8": "be:e8:6a:85:ec:2a",
            "net9": "ce:09:e3:1b:92:34"
        },
        "spine_2_1_8": {
            "net0": "da:e0:22:05:7e:ba",
            "net1": "ae:e1:97:af:0f:4c",
            "net10": "da:2b:a6:a2:f0:50",
            "net11": "62:1f:2c:1e:e8:d4",
            "net12": "5a:ee:56:b2:28:a9",
            "net13": "8a:ee:db:ad:7e:fd",
            "net14": "8e:e4:90:15:23:4a",
            "net15": "2a:35:78:df:e1:d8",
            "net2": "b6:80:73:12:8a:6f",
            "net3": "42:73:78:99:7e:4c",
            "net4": "0e:3f:0f:66:77:06",
            "net5": "ca:8c:53:ce:cd:3b",
            "net6": "5e:0d:63:c5:cd:c0",
            "net7": "f6:32:f5:21:43:2a",
            "net8": "d6:6c:a6:6b:28:80",
            "net9": "66:aa:77:90:81:c5"
        },
        "tof_1_2_1": {
            "net0": "a6:cf:4f:5a:a3:72",
            "net1": "be:f2:0f:1e:67:30",
            "net10": "fa:08:22:d8:24:67",
            "net11": "4a:67:c0:79:1f:b2",
            "net12": "1a:f1:cb:10:49:b4",
            "net13": "2e:68:c7:f4:da:53",
            "net14": "1e:90:58:9d:50:6a",
            "net15": "c2:6a:02:47:a1:ea",
            "net2": "06:29:90:d8:4c:ab",
            "net3": "ba:4b:96:3a:a9:22",
            "net4": "ca:f7:0e:ad:a7:0d",
            "net5": "8e:87:b1:ec:87:7f",
            "net6": "e6:7b:e8:59:ac:77",
            "net7": "da:c9:2d:bb:ae:13",
            "net8": "5a:56:ad:5b:f0:a1",
            "net9": "7e:45:0b:67:a1:e5"
        },
        "tof_1_2_2": {
            "net0": "7a:fb:a4:a1:4e:26",
            "net1": "b6:4e:1e:28:44:c1",
            "net10": "ce:b8:d8:71:ac:96",
            "net11": "ba:eb:38:4d:8e:5e",
            "net12": "d2:ed:63:38:c4:b8",
            "net13": "a2:00:95:95:95:ca",
            "net14": "6e:06:b8:0e:75:66",
            "net15": "d6:bb:01:e6:f6:f9",
            "net2": "de:0c:3d:89:bc:d6",
            "net3": "22:34:49:82:6c:ca",
            "net4": "3e:39:5c:35:ea:85",
            "net5": "02:b2:64:1d:01:0a",
            "net6": "a6:eb:2a:63:e3:d8",
            "net7": "02:c1:8b:d6:94:e0",
            "net8": "f6:4c:14:4b:c1:5f",
            "net9": "2e:82:65:72:3b:31"
        },
        "tof_1_2_3": {
            "net0": "1a:0a:dd:49:dd:6a",
            "net1": "b2:58:4c:4f:ac:d7",
            "net10": "aa:21:8f:74:f2:a7",
            "net11": "96:22:c7:bd:e5:4e",
            "net12": "2e:61:94:37:4c:9d",
            "net13": "1e:03:fa:93:c0:4d",
            "net14": "ee:67:04:9f:05:c0",
            "net15": "06:d0:0e:f4:8e:cb",
            "net2": "8a:7b:eb:20:bd:b7",
            "net3": "32:a9:c3:b9:b0:bc",
            "net4": "06:f9:80:9b:8c:26",
            "net5": "a6:5b:7a:20:2d:17",
            "net6": "8e:7a:1c:aa:b4:48",
            "net7": "42:6a:2d:95:98:91",
            "net8": "76:f3:10:f5:d4:b7",
            "net9": "be:b9:74:55:6e:59"
        },
        "tof_1_2_4": {
            "net0": "2e:d0:94:ee:75:2a",
            "net1": "26:96:af:65:22:27",
            "net10": "5a:33:0d:91:5e:6e",
            "net11": "8a:12:27:25:d8:ec",
            "net12": "9e:b3:7d:9b:25:92",
            "net13": "a2:d2:e9:38:8e:58",
            "net14": "b6:f9:e8:ed:77:90",
            "net15": "c2:b3:b5:52:16:8e",
            "net2": "72:ca:90:15:a9:aa",
            "net3": "42:fd:33:e6:6a:8b",
            "net4": "ee:a9:6f:a9:fc:5c",
            "net5": "b6:1b:96:6f:ea:a4",
            "net6": "22:33:82:04:96:b8",
            "net7": "02:4e:d0:ec:05:27",
            "net8": "96:30:08:9a:68:a5",
            "net9": "de:0c:11:82:f6:24"
        },
        "tof_1_2_5": {
            "net0": "42:b3:73:f8:77:cc",
            "net1": "86:f6:e2:46:05:c6",
            "net10": "32:6d:93:69:16:57",
            "net11": "26:d8:fe:4d:a2:13",
            "net12": "72:0e:15:56:ad:9e",
            "net13": "06:7c:f1:84:36:a9",
            "net14": "c6:be:59:69:a9:8f",
            "net15": "9a:b9:55:81:d1:d8",
            "net2": "9a:f5:84:f1:ee:23",
            "net3": "fe:92:25:be:81:4e",
            "net4": "5a:f1:76:b6:5d:fb",
            "net5": "12:eb:87:8c:5a:5f",
            "net6": "ca:9f:42:cd:23:c7",
            "net7": "fe:b6:ec:af:34:21",
            "net8": "3e:7b:6e:71:a8:fe",
            "net9": "5a:a9:13:3d:44:ee"
        },
        "tof_1_2_6": {
            "net0": "32:dc:bf:82:ea:a7",
            "net1": "32:0e:f7:db:01:b0",
            "net10": "8a:38:63:35:40:a7",
            "net11": "92:f7:20:97:c6:aa",
            "net12": "3e:57:60:74:eb:48",
            "net13": "6e:8d:14:fb:98:dc",
            "net14": "22:af:ca:59:56:0c",
            "net15": "2e:02:e4:8d:92:f1",
            "net2": "8a:c1:ba:19:aa:8a",
            "net3": "2a:7a:49:71:59:50",
            "net4": "02:b4:01:2f:64:60",
            "net5": "c2:8f:3c:51:b9:66",
            "net6": "be:d5:a5:6b:39:65",
            "net7": "8e:40:82:e8:d5:3b",
            "net8": "ea:a3:2f:c6:a0:87",
            "net9": "0e:93:ad:bb:cc:7f"
        },
        "tof_1_2_7": {
            "net0": "f2:9b:1b:43:18:99",
            "net1": "82:c7:53:7c:61:56",
            "net10": "4e:93:f3:fe:eb:21",
            "net11": "42:59:90:85:5c:d8",
            "net12": "9a:d0:62:d1:ff:a9",
            "net13": "b2:cb:d0:90:87:ae",
            "net14": "0a:ea:61:20:4f:ca",
            "net15": "02:1a:94:11:fa:ac",
            "net2": "c6:f2:6b:1b:31:20",
            "net3": "ba:3c:23:bc:d7:53",
            "net4": "c6:79:96:34:65:c5",
            "net5": "32:46:95:13:f0:89",
            "net6": "7a:09:e9:6e:e3:73",
            "net7": "7a:45:bd:53:78:8c",
            "net8": "f6:05:a4:26:38:bf",
            "net9": "4a:df:af:ab:43:00"
        },
        "tof_1_2_8": {
            "net0": "72:e7:56:11:e1:44",
            "net1": "3a:ae:1a:cc:89:d3",
            "net10": "82:de:dd:b1:15:46",
            "net11": "e2:75:01:7d:66:47",
            "net12": "7e:34:67:25:d5:31",
            "net13": "7e:ea:23:53:f4:ec",
            "net14": "ae:c4:1a:a1:c0:48",
            "net15": "36:1e:cf:ce:af:43",
            "net2": "ba:98:81:f6:d7:46",
            "net3": "ae:13:5c:7d:10:65",
            "net4": "76:12:c7:50:c2:51",
            "net5": "1a:07:5e:ba:86:45",
            "net6": "4a:75:ae:7b:bc:4e",
            "net7": "62:f5:c5:bc:e1:02",
            "net8": "a2:1c:27:b5:eb:7b",
            "net9": "2e:fb:4a:98:0b:fe"
        }
    },
    "failed_machine": "leaf_1_0_1",
    "failure_time": {
        "leaf_1_0_1": 1622566745.7371314,
        "leaf_1_0_2": 1622566745.7479823,
        "leaf_1_0_3": 1622566745.7548316,
        "leaf_1_0_4": 1622566745.7670176,
        "leaf_1_0_5": 1622566745.7892551,
        "leaf_1_0_6": 1622566745.7417452,
        "leaf_1_0_7": 1622566745.7498865,
        "leaf_1_0_8": 1622566745.7573037,
        "leaf_2_0_1": 1622566745.766501,
        "leaf_2_0_2": 1622566745.778877,
        "leaf_2_0_3": 1622566745.7900844,
        "leaf_2_0_4": 1622566745.7983193,
        "leaf_2_0_5": 1622566745.8046682,
        "leaf_2_0_6": 1622566745.8097057,
        "leaf_2_0_7": 1622566745.816611,
        "leaf_2_0_8": 1622566745.7971325,
        "spine_1_1_1": 1622566745.8051264,
        "spine_1_1_2": 1622566745.8124108,
        "spine_1_1_3": 1622566745.8288183,
        "spine_1_1_4": 1622566745.8381038,
        "spine_1_1_5": 1622566745.830438,
        "spine_1_1_6": 1622566745.845602,
        "spine_1_1_7": 1622566745.853596,
        "spine_1_1_8": 1622566745.8609166,
        "spine_2_1_1": 1622566745.871863,
        "spine_2_1_2": 1622566745.8479156,
        "spine_2_1_3": 1622566745.860898,
        "spine_2_1_4": 1622566745.8701131,
        "spine_2_1_5": 1622566745.8761616,
        "spine_2_1_6": 1622566745.8868084,
        "spine_2_1_7": 1622566745.8769963,
        "spine_2_1_8": 1622566745.8885798,
        "tof_1_2_1": 1622566745.8981655,
        "tof_1_2_2": 1622566745.9036312,
        "tof_1_2_3": 1622566745.911462,
        "tof_1_2_4": 1622566745.8965344,
        "tof_1_2_5": 1622566745.9011,
        "tof_1_2_6": 1622566745.9137623,
        "tof_1_2_7": 1622566745.919638,
        "tof_1_2_8": 1622566745.9261787
    }
}