{
    "k_leaf": 8,
    "k_top": 8,
    "redundancy_factor": 4,
    "is_k8s": true,
    "machine_mac_addresses": {
        "leaf_1_0_1": {
            "net0": "8a:f9:39:6f:1d:d6",
            "net1": "ae:05:cb:b5:37:58",
            "net2": "e6:44:31:e1:ba:cb",
            "net3": "ee:b6:75:cd:82:c2",
            "net4": "e6:56:80:ba:32:52",
            "net5": "fa:db:db:fc:34:7f",
            "net6": "be:25:df:47:2a:b6",
            "net7": "26:5e:67:ab:1e:ee",
            "net8": "06:a2:7e:b8:f5:f0"
        },
        "leaf_1_0_2": {
            "net0": "a6:8d:15:a7:ab:5d",
            "net1": "16:16:67:d8:c4:d9",
            "net2": "c2:d2:be:43:3f:11",
            "net3": "f2:41:ab:9a:81:b9",
            "net4": "22:f7:e4:d5:09:68",
            "net5": "3e:47:66:2e:58:76",
            "net6": "42:39:9b:7a:82:da",
            "net7": "7e:e8:27:e0:5a:96",
            "net8": "f6:8f:b5:84:0a:44"
        },
        "leaf_1_0_3": {
            "net0": "22:9e:0d:f5:c3:98",
            "net1": "96:25:e1:d4:db:8d",
            "net2": "82:77:ba:72:7a:56",
            "net3": "ca:da:95:cc:4e:5c",
            "net4": "b6:43:ac:fe:74:09",
            "net5": "d6:b3:d6:1a:be:87",
            "net6": "4e:17:4a:1c:8f:71",
            "net7": "9e:06:6a:34:61:29",
            "net8": "ca:ed:53:c3:ed:14"
        },
        "leaf_1_0_4": {
            "net0": "ea:00:f2:18:c8:65",
            "net1": "7a:20:6e:6b:87:75",
            "net2": "3a:cf:5f:f0:d0:9e",
            "net3": "1a:72:97:16:56:76",
            "net4": "fe:fe:42:e9:0e:45",
            "net5": "1a:1f:dc:ba:0f:e3",
            "net6": "76:f4:68:11:47:8b",
            "net7": "02:dd:fe:20:f5:e4",
            "net8": "02:47:90:65:b7:45"
        },
        "leaf_1_0_5": {
            "net0": "6a:79:62:bc:78:9d",
            "net1": "06:36:ac:fc:0f:8f",
            "net2": "ae:95:fd:7f:61:b5",
            "net3": "26:b0:1a:3b:a2:02",
            "net4": "a2:96:61:ab:3d:6b",
            "net5": "9e:15:b5:c6:49:8b",
            "net6": "f6:cd:b4:40:0d:2e",
            "net7": "0a:2a:18:c1:2f:b2",
            "net8": "ce:89:12:ed:0c:09"
        },
        "leaf_1_0_6": {
            "net0": "5e:f8:c7:9b:4d:02",
            "net1": "b2:ff:0c:25:bc:3e",
            "net2": "de:14:b5:da:1f:81",
            "net3": "e2:bd:0f:62:87:07",
            "net4": "0a:e4:72:4d:a7:0a",
            "net5": "46:dd:b1:97:c2:f4",
            "net6": "72:23:6d:81:6b:f9",
            "net7": "66:81:28:2d:ca:e6",
            "net8": "1e:8f:84:aa:3a:6e"
        },
        "leaf_1_0_7": {
            "net0": "22:4f:40:3c:31:26",
            "net1": "7e:9d:7f:49:3a:2e",
            "net2": "da:89:ed:45:08:93",
            "net3": "de:31:db:e8:7a:e0",
            "net4": "ae:04:77:6c:b0:6f",
            "net5": "36:d1:b8:9a:32:eb",
            "net6": "6e:e4:4f:2d:21:75",
            "net7": "e2:38:6c:ab:22:22",
            "net8": "52:2d:40:f1:92:3a"
        },
        "leaf_1_0_8": {
            "net0": "c2:45:40:36:76:5f",
            "net1": "0a:7c:91:a9:40:ae",
            "net2": "22:bf:a4:8f:dd:c1",
            "net3": "ca:93:51:7c:7c:fd",
            "net4": "92:2d:63:13:36:a0",
            "net5": "da:e9:1d:6a:07:e5",
            "net6": "ba:08:6f:d7:84:cc",
            "net7": "06:19:76:73:56:e0",
            "net8": "b2:5a:43:85:9b:65"
        },
        "leaf_2_0_1": {
            "net0": "76:73:de:67:4d:88",
            "net1": "42:b0:a3:da:c9:e7",
            "net2": "82:a4:1c:27:3c:12",
            "net3": "ee:03:af:67:0a:87",
            "net4": "ce:09:a0:01:00:f9",
            "net5": "5a:12:d5:31:60:ba",
            "net6": "7a:6d:17:d9:dd:20",
            "net7": "4e:ab:b3:61:32:7b",
            "net8": "86:55:32:d7:c9:ee"
        },
        "leaf_2_0_2": {
            "net0": "9a:71:66:e8:57:19",
            "net1": "9e:12:67:33:a9:3d",
            "net2": "3a:a5:5a:cd:18:13",
            "net3": "02:e5:7a:94:c5:79",
            "net4": "26:1a:eb:29:82:0f",
            "net5": "b2:1e:a5:45:6d:fb",
            "net6": "6e:4f:94:eb:59:f5",
            "net7": "8a:84:d0:4c:2f:58",
            "net8": "66:5d:6e:9c:dc:72"
        },
        "leaf_2_0_3": {
            "net0": "c6:ab:83:ad:44:cf",
            "net1": "ae:7d:50:97:51:1c",
            "net2": "fa:72:37:8b:70:d4",
            "net3": "5a:3d:96:36:80:70",
            "net4": "0e:09:84:da:7c:55",
            "net5": "36:11:0e:5b:c4:8b",
            "net6": "76:a2:15:7b:22:09",
            "net7": "7a:19:09:b9:4c:61",
            "net8": "1a:2d:aa:f0:73:cc"
        },
        "leaf_2_0_4": {
            "net0": "62:d0:3a:71:ee:f3",
            "net1": "02:6e:c3:b0:aa:b4",
            "net2": "62:30:37:32:38:38",
            "net3": "26:3e:b4:46:d5:13",
            "net4": "b2:dc:7f:45:1c:8a",
            "net5": "2a:09:f3:b9:95:d7",
            "net6": "9e:9a:d0:2e:96:85",
            "net7": "a2:66:d1:f1:26:b1",
            "net8": "2a:ef:87:ac:97:4b"
        },
        "leaf_2_0_5": {
            "net0": "46:63:5c:aa:d6:81",
            "net1": "42:2d:b6:a1:41:23",
            "net2": "de:88:05:a2:1a:aa",
            "net3": "12:bc:80:e1:da:ab",
            "net4": "76:93:1d:fb:e3:e3",
            "net5": "1e:50:ac:72:a2:9b",
            "net6": "66:e1:4b:92:a3:0c",
            "net7": "22:4c:cf:62:6f:c2",
            "net8": "c6:d8:05:e8:cc:2f"
        },
        "leaf_2_0_6": {
            "net0": "d2:e4:23:e4:e6:1b",
            "net1": "b2:8a:5f:84:12:28",
            "net2": "ba:88:57:a5:b1:a2",
            "net3": "fa:58:79:ec:bb:a1",
            "net4": "de:c4:69:68:e1:cb",
            "net5": "2e:88:87:20:c3:46",
            "net6": "a6:2a:d5:af:c5:43",
            "net7": "66:7b:98:63:e4:83",
            "net8": "56:23:c5:65:24:1f"
        },
        "leaf_2_0_7": {
            "net0": "56:22:79:65:56:ba",
            "net1": "52:96:22:3e:7b:57",
            "net2": "6e:da:d0:10:a3:46",
            "net3": "4a:47:ae:20:c3:96",
            "net4": "b6:23:2a:39:f8:e0",
            "net5": "7e:dd:53:4e:17:34",
            "net6": "2a:33:e5:9b:f5:14",
            "net7": "26:55:5e:55:11:12",
            "net8": "42:29:a5:e3:9e:ea"
        },
        "leaf_2_0_8": {
            "net0": "6e:0f:a5:f6:71:b8",
            "net1": "d6:d4:aa:c4:3a:92",
            "net2": "42:a7:cf:ce:83:bd",
            "net3": "4e:9f:8c:2c:e5:e1",
            "net4": "6a:fd:4c:75:09:e9",
            "net5": "96:20:3b:bd:29:25",
            "net6": "7a:a9:df:fe:d6:82",
            "net7": "c6:2b:85:09:b1:37",
            "net8": "6a:a0:5c:ee:a6:c4"
        },
        "leaf_3_0_1": {
            "net0": "86:95:7d:13:c3:a6",
            "net1": "fa:a4:dc:24:8e:06",
            "net2": "6a:42:cd:f9:5b:37",
            "net3": "22:62:c7:98:da:98",
            "net4": "a6:cb:a1:ee:e0:73",
            "net5": "e6:a7:a2:dc:cb:93",
            "net6": "ba:7c:fd:7e:5b:49",
            "net7": "fe:04:02:b3:af:9c",
            "net8": "a6:67:a2:bf:77:13"
        },
        "leaf_3_0_2": {
            "net0": "82:a3:27:4c:e6:9b",
            "net1": "82:1c:b7:e1:e0:2e",
            "net2": "92:a7:53:af:1a:d6",
            "net3": "aa:a2:ff:86:1a:74",
            "net4": "3e:98:1b:1e:c3:8c",
            "net5": "ea:58:59:d8:f7:06",
            "net6": "5a:ec:89:da:d4:8d",
            "net7": "7a:ee:3a:6d:0a:73",
            "net8": "c2:23:02:4a:2e:96"
        },
        "leaf_3_0_3": {
            "net0": "4e:2e:80:ee:fe:33",
            "net1": "96:ed:f7:7f:8a:11",
            "net2": "a6:b3:c8:46:ab:38",
            "net3": "f6:82:78:4c:84:45",
            "net4": "ae:d8:88:f0:69:d0",
            "net5": "62:af:4c:fb:42:65",
            "net6": "16:bb:33:ee:e1:5d",
            "net7": "36:a0:85:03:7b:7a",
            "net8": "f6:c2:67:c7:af:99"
        },
        "leaf_3_0_4": {
            "net0": "ce:f8:af:20:30:2c",
            "net1": "46:69:16:cd:00:b7",
            "net2": "12:2d:6c:39:25:59",
            "net3": "32:a7:12:ac:8e:50",
            "net4": "ca:9e:2a:b7:07:9c",
            "net5": "62:53:8e:3b:a3:c5",
            "net6": "62:61:4e:31:5d:31",
            "net7": "c2:5f:5e:39:73:70",
            "net8": "ae:77:17:b0:3d:52"
        },
        "leaf_3_0_5": {
            "net0": "e2:75:0c:7a:30:0c",
            "net1": "62:07:ca:31:f2:ef",
            "net2": "ae:49:d2:9d:7d:2d",
            "net3": "86:5d:90:e5:c9:9b",
            "net4": "22:b9:59:e0:fd:66",
            "net5": "66:91:f6:c9:88:b8",
            "net6": "e2:5d:57:82:85:7c",
            "net7": "46:05:66:23:5f:b6",
            "net8": "d6:a2:3f:c8:9f:1a"
        },
        "leaf_3_0_6": {
            "net0": "52:31:50:0a:91:8c",
            "net1": "9a:6f:8d:e4:f2:cb",
            "net2": "aa:94:82:05:eb:1a",
            "net3": "66:15:68:49:ca:a7",
            "net4": "ca:b6:2d:37:8e:f9",
            "net5": "3e:2c:7f:c6:af:f5",
            "net6": "12:c7:a1:91:5e:9d",
            "net7": "c2:9c:42:b2:24:14",
            "net8": "7e:4d:4b:38:18:76"
        },
        "leaf_3_0_7": {
            "net0": "56:9d:fc:0e:0e:0d",
            "net1": "5a:ab:5f:ab:29:1e",
            "net2": "66:48:e8:33:4b:26",
            "net3": "9a:49:83:97:b5:e9",
            "net4": "56:91:4c:fd:60:90",
            "net5": "ba:6d:4d:74:80:30",
            "net6": "fa:98:b3:79:00:d7",
            "net7": "2e:ac:1e:18:c8:a3",
            "net8": "7a:2d:1c:30:25:c5"
        },
        "leaf_3_0_8": {
            "net0": "ea:c7:7b:71:1e:39",
            "net1": "02:ae:35:fb:e2:9b",
            "net2": "46:5b:87:55:a9:85",
            "net3": "1e:11:4b:4a:02:f8",
            "net4": "32:ba:40:dc:15:ae",
            "net5": "76:2c:f7:76:95:36",
            "net6": "42:64:52:1e:ad:4c",
            "net7": "f2:2b:5a:58:50:bc",
            "net8": "8e:01:8e:37:1f:c8"
        },
        "leaf_4_0_1": {
            "net0": "56:5d:ce:e6:13:1a",
            "net1": "4a:e2:18:3f:e3:62",
            "net2": "96:f7:1b:63:e6:f2",
            "net3": "06:66:50:ab:f1:4b",
            "net4": "0e:32:02:43:8e:2f",
            "net5": "72:a4:fd:04:b2:3b",
            "net6": "2e:31:12:69:d1:0b",
            "net7": "c2:bb:e9:fc:ef:36",
            "net8": "06:8c:19:12:60:46"
        },
        "leaf_4_0_2": {
            "net0": "2e:af:12:77:c2:83",
            "net1": "1a:8e:62:f3:bf:76",
            "net2": "9a:ac:f5:61:9d:b7",
            "net3": "a2:b7:78:16:0e:ab",
            "net4": "6a:f6:2f:d1:aa:f4",
            "net5": "a6:55:32:53:9d:d4",
            "net6": "12:a5:18:79:f1:5d",
            "net7": "a6:9f:ff:2d:00:1c",
            "net8": "1a:85:f1:6f:a0:91"
        },
        "leaf_4_0_3": {
            "net0": "32:ac:df:46:69:ef",
            "net1": "52:48:6f:db:a1:08",
            "net2": "0e:c7:c0:de:10:5a",
            "net3": "8a:c9:cb:1d:82:20",
            "net4": "7e:06:ee:31:8a:ee",
            "net5": "ae:e0:8a:66:c4:4f",
            "net6": "16:f6:81:31:5f:9e",
            "net7": "42:b6:e2:34:5c:a2",
            "net8": "46:27:85:d8:b1:b0"
        },
        "leaf_4_0_4": {
            "net0": "96:48:41:3a:75:23",
            "net1": "ca:80:1d:c3:2e:18",
            "net2": "b6:fd:55:46:8a:d4",
            "net3": "46:81:4b:13:75:65",
            "net4": "12:ba:8f:d1:4a:cf",
            "net5": "0a:6c:6e:4f:7e:c6",
            "net6": "56:18:99:9f:4b:78",
            "net7": "7a:fb:e2:a5:91:77",
            "net8": "c2:9a:12:44:e4:af"
        },
        "leaf_4_0_5": {
            "net0": "66:cf:ed:2e:b4:af",
            "net1": "3e:d5:8a:12:75:04",
            "net2": "9e:b8:2a:56:00:d4",
            "net3": "3a:c7:6a:d6:f6:9e",
            "net4": "2e:c5:53:62:ae:6b",
            "net5": "7a:96:d8:c0:a4:be",
            "net6": "be:0c:51:ce:d0:2e",
            "net7": "42:8d:31:50:56:91",
            "net8": "aa:19:f0:a0:f5:3f"
        },
        "leaf_4_0_6": {
            "net0": "ae:46:e8:09:30:39",
            "net1": "d6:9c:9e:61:d8:fd",
            "net2": "5e:fd:c1:9c:85:59",
            "net3": "36:ad:35:9d:b3:f6",
            "net4": "5e:48:67:3b:9a:bf",
            "net5": "f2:1a:93:f5:83:d9",
            "net6": "32:dc:33:15:77:19",
            "net7": "9e:f5:9d:f3:8b:c1",
            "net8": "56:c3:4c:f2:c9:2c"
        },
        "leaf_4_0_7": {
            "net0": "0e:38:d4:d0:91:f8",
            "net1": "ae:3e:9d:f5:8e:30",
            "net2": "ce:8f:e8:a0:c7:77",
            "net3": "8a:f4:e5:93:6f:08",
            "net4": "c2:89:dc:a6:60:a3",
            "net5": "e6:8a:5f:8f:f0:3c",
            "net6": "ce:7d:7c:6b:30:12",
            "net7": "5e:20:f6:32:ff:83",
            "net8": "b6:71:dd:77:d2:08"
        },
        "leaf_4_0_8": {
            "net0": "6e:f1:47:53:65:74",
            "net1": "fe:ed:37:d1:bf:ed",
            "net2": "72:14:2a:bc:8e:be",
            "net3": "e6:da:ab:2a:2b:ba",
            "net4": "4a:42:22:22:ba:82",
            "net5": "16:ed:33:35:d5:b3",
            "net6": "3e:a7:1e:e8:03:64",
            "net7": "7e:be:0e:92:4f:80",
            "net8": "ca:bf:be:5b:ee:71"
        },
        "spine_1_1_1": {
            "net0": "e6:c5:a0:c7:0a:f5",
            "net1": "22:1a:66:61:21:2f",
            "net10": "ea:d9:25:c2:c7:52",
            "net11": "8a:3d:0a:11:da:60",
            "net12": "6a:0d:a5:6f:2a:2e",
            "net13": "ca:7b:cb:0f:38:08",
            "net14": "36:60:a8:2a:ad:36",
            "net15": "2a:89:47:1b:4f:16",
            "net2": "22:2d:11:38:3b:bf",
            "net3": "06:b6:18:a3:0d:2c",
            "net4": "c6:0b:fc:af:94:c5",
            "net5": "fa:a1:88:17:26:55",
            "net6": "fe:eb:54:97:0f:58",
            "net7": "c6:10:dc:47:a5:1d",
            "net8": "46:d5:ea:31:22:5d",
            "net9": "ae:43:db:e9:58:90"
        },
        "spine_1_1_2": {
            "net0": "7a:a5:ff:ab:a7:9e",
            "net1": "a2:90:4d:f3:45:6c",
            "net10": "5a:5c:e0:d3:63:c8",
            "net11": "7a:a7:c1:5d:f1:28",
            "net12": "82:d7:81:81:f3:52",
            "net13": "d6:d3:9b:6a:31:af",
            "net14": "a2:14:84:0f:59:72",
            "net15": "ba:d9:27:c4:a7:80",
            "net2": "72:f5:6b:8c:a4:7b",
            "net3": "be:c3:ce:12:8a:3d",
            "net4": "26:c2:0f:7d:79:8b",
            "net5": "d6:80:fe:a0:5e:45",
            "net6": "be:d3:0e:75:c4:65",
            "net7": "22:24:69:77:16:69",
            "net8": "0a:d2:c1:ed:8a:82",
            "net9": "36:e4:2c:67:df:c4"
        },
        "spine_1_1_3": {
            "net0": "92:ec:5b:c8:2f:cf",
            "net1": "ba:37:30:73:6e:bf",
            "net10": "7e:60:1b:d0:d7:d9",
            "net11": "ee:e1:6d:fa:73:1c",
            "net12": "46:f5:22:29:a5:09",
            "net13": "fe:0a:83:8a:ea:83",
            "net14": "fe:c2:f0:80:e4:a0",
            "net15": "8a:0f:ff:6a:55:b0",
            "net2": "92:40:0e:53:54:ec",
            "net3": "da:8e:dc:96:8d:e3",
            "net4": "be:15:9b:5d:ea:0a",
            "net5": "ee:a6:47:ae:c9:0c",
            "net6": "1e:ea:0b:5f:00:7e",
            "net7": "c2:99:aa:f6:cc:8b",
            "net8": "72:b0:77:c7:11:ae",
            "net9": "0e:a1:5a:ea:a2:6e"
        },
        "spine_1_1_4": {
            "net0": "06:e6:d4:ae:19:55",
            "net1": "32:d8:0e:b2:5c:26",
            "net10": "da:70:98:79:95:dc",
            "net11": "3e:75:cc:7c:85:18",
            "net12": "56:aa:bb:3d:ea:89",
            "net13": "9e:76:7f:4e:b6:b7",
            "net14": "ae:cb:e4:f4:0f:9f",
            "net15": "ce:25:8d:f0:2d:be",
            "net2": "9e:5b:f1:62:b5:a9",
            "net3": "ea:c3:33:10:bd:aa",
            "net4": "42:2f:ee:29:0e:65",
            "net5": "b2:08:71:db:a6:c1",
            "net6": "9a:57:b1:52:0c:74",
            "net7": "46:d9:3c:0a:fe:bf",
            "net8": "de:8f:63:3d:09:1f",
            "net9": "e2:1d:b0:ba:3d:af"
        },
        "spine_1_1_5": {
            "net0": "ae:5e:f4:ca:63:83",
            "net1": "f6:75:39:64:9d:05",
            "net10": "16:32:fd:71:f4:e1",
            "net11": "a6:3a:a9:a0:ca:6e",
            "net12": "62:8b:25:24:01:15",
            "net13": "b6:cb:ca:88:06:d7",
            "net14": "c6:5a:0e:99:90:90",
            "net15": "c2:3d:f5:0a:79:6e",
            "net2": "82:5e:3b:46:b8:8d",
            "net3": "f6:06:a6:c4:27:4d",
            "net4": "3e:13:da:7a:24:dc",
            "net5": "e2:2b:46:ef:66:6b",
            "net6": "12:ee:7e:98:ff:cf",
            "net7": "3e:ce:b6:92:ab:18",
            "net8": "d2:eb:85:bb:ae:89",
            "net9": "f6:66:d8:38:99:eb"
        },
        "spine_1_1_6": {
            "net0": "a2:3f:78:54:a7:28",
            "net1": "f2:7b:a8:9c:19:de",
            "net10": "ce:f3:dd:a7:5a:aa",
            "net11": "d2:db:41:49:a7:b0",
            "net12": "12:65:bd:ad:5e:ab",
            "net13": "56:3b:f3:7e:ec:49",
            "net14": "ba:9e:2f:a2:e8:02",
            "net15": "86:15:8c:d6:e1:6a",
            "net2": "76:a9:56:e8:b6:55",
            "net3": "ea:67:6c:bf:7a:a4",
            "net4": "da:2e:7b:6f:cf:ea",
            "net5": "6e:92:ea:d0:7b:1f",
            "net6": "ee:f3:d7:de:c0:a5",
            "net7": "0e:b4:b7:72:a4:ed",
            "net8": "22:29:60:72:85:70",
            "net9": "ae:b4:6a:f0:6b:6b"
        },
        "spine_1_1_7": {
            "net0": "ce:92:7e:76:8d:b3",
            "net1": "f2:ac:93:08:7c:b1",
            "net10": "2e:bd:8f:31:15:c8",
            "net11": "aa:89:c2:58:af:bc",
            "net12": "4a:52:fd:85:10:75",
            "net13": "22:e4:c9:35:a0:c8",
            "net14": "8a:db:41:ec:8d:dd",
            "net15": "de:19:0a:9a:48:be",
            "net2": "36:1a:70:11:17:86",
            "net3": "f2:8c:16:a8:5e:04",
            "net4": "6e:f2:ad:4b:b9:77",
            "net5": "aa:75:42:39:95:6d",
            "net6": "16:4b:72:88:42:6d",
            "net7": "4e:20:5a:91:42:c1",
            "net8": "82:43:c6:37:29:6b",
            "net9": "1e:cf:3a:dd:a4:28"
        },
        "spine_1_1_8": {
            "net0": "1a:54:66:eb:57:66",
            "net1": "e6:4e:23:db:80:97",
            "net10": "ee:b1:52:f5:d9:44",
            "net11": "de:70:90:36:b2:0b",
            "net12": "b2:4e:57:cd:45:be",
            "net13": "62:91:11:03:93:b1",
            "net14": "ce:be:d7:b9:f1:68",
            "net15": "3a:ba:01:a4:05:8d",
            "net2": "c2:e9:b6:10:55:66",
            "net3": "42:50:f9:bf:2b:27",
            "net4": "56:e9:13:da:43:69",
            "net5": "42:dd:db:f9:fa:bc",
            "net6": "b2:57:a9:d8:c2:43",
            "net7": "fa:6b:ae:d4:1f:94",
            "net8": "1e:a7:0f:ab:c1:22",
            "net9": "76:cb:05:3c:49:41"
        },
        "spine_2_1_1": {
            "net0": "d6:72:d1:e3:8c:e1",
            "net1": "e6:e0:b7:37:97:07",
            "net10": "a2:e9:04:73:8d:98",
            "net11": "0e:1c:97:fb:96:12",
            "net12": "7a:6c:1b:b2:da:0a",
            "net13": "96:3f:ea:5c:5f:2f",
            "net14": "02:e4:c9:9e:eb:2e",
            "net15": "4e:cb:3a:79:70:15",
            "net2": "be:b6:90:3e:a3:e2",
            "net3": "5e:09:a4:9d:02:a2",
            "net4": "16:b7:1c:d0:b4:e1",
            "net5": "ee:e9:0f:c7:79:10",
            "net6": "da:28:01:b5:a9:2f",
            "net7": "9e:86:8c:27:6d:79",
            "net8": "16:0c:aa:c1:2b:ba",
            "net9": "a6:03:a8:72:c3:6b"
        },
        "spine_2_1_2": {
            "net0": "0e:11:cc:c7:8c:44",
            "net1": "de:5d:15:a5:e7:9e",
            "net10": "ce:5d:fa:ac:26:17",
            "net11": "fe:ad:cd:65:fa:f7",
            "net12": "3a:92:a7:4a:95:b6",
            "net13": "fe:23:76:99:8e:39",
            "net14": "82:a6:0f:ce:a4:f5",
            "net15": "9a:71:5b:e4:09:ba",
            "net2": "5a:23:e3:a6:72:80",
            "net3": "5e:7b:c2:27:8e:dd",
            "net4": "c6:3b:62:20:49:92",
            "net5": "da:f9:fc:05:82:6d",
            "net6": "b6:ad:98:e6:52:9a",
            "net7": "66:c0:e8:b0:70:bd",
            "net8": "96:b7:58:7d:1f:fc",
            "net9": "72:6f:8f:2e:52:a6"
        },
        "spine_2_1_3": {
            "net0": "4a:f6:8d:66:4e:17",
            "net1": "d6:2b:8f:fb:0c:36",
            "net10": "56:f0:90:30:ff:86",
            "net11": "ce:7e:b6:da:d0:28",
            "net12": "1e:74:11:f5:74:f3",
            "net13": "6a:5d:40:a7:a4:04",
            "net14": "e2:38:12:18:4b:f2",
            "net15": "06:ac:38:a0:74:c6",
            "net2": "de:67:1a:ce:d6:df",
            "net3": "fe:f1:d7:51:2b:91",
            "net4": "ae:aa:79:c1:34:c2",
            "net5": "02:13:b5:79:7d:8c",
            "net6": "7e:2e:a7:94:e0:e4",
            "net7": "d2:ea:46:b7:91:57",
            "net8": "be:c9:eb:2c:e1:84",
            "net9": "ce:a4:a6:13:db:d2"
        },
        "spine_2_1_4": {
            "net0": "ea:f7:9d:a0:2d:b4",
            "net1": "96:05:98:5e:f4:9e",
            "net10": "f2:1f:4a:e9:57:cf",
            "net11": "ae:0c:e1:e7:3f:fb",
            "net12": "ee:a5:39:fc:96:c6",
            "net13": "66:86:75:18:4a:bc",
            "net14": "3e:90:5a:11:d8:9c",
            "net15": "b6:49:a6:ef:d9:f3",
            "net2": "02:12:2a:48:1e:f1",
            "net3": "aa:cf:d4:12:28:39",
            "net4": "1a:fe:c6:df:4f:b4",
            "net5": "2e:9e:35:a5:9b:d8",
            "net6": "fa:fc:78:34:da:43",
            "net7": "92:cd:f3:e6:f2:d3",
            "net8": "16:3f:23:d8:d8:fd",
            "net9": "72:c3:e3:72:2d:f1"
        },
        "spine_2_1_5": {
            "net0": "c2:1a:fe:02:c0:46",
            "net1": "d6:f5:41:1c:a7:78",
            "net10": "36:57:ad:71:92:f9",
            "net11": "ea:99:e0:1d:89:9e",
            "net12": "56:a0:82:41:ab:d9",
            "net13": "9e:d2:41:18:83:5d",
            "net14": "22:fd:47:bc:1e:8e",
            "net15": "86:95:d4:23:31:0e",
            "net2": "06:17:53:60:94:a7",
            "net3": "ba:cc:92:d0:7b:22",
            "net4": "1e:af:c5:58:92:95",
            "net5": "5a:4e:35:6a:5e:c3",
            "net6": "1e:7e:f3:f3:23:e0",
            "net7": "92:58:86:b0:05:19",
            "net8": "16:d2:e2:ed:69:28",
            "net9": "6e:14:08:85:26:7f"
        },
        "spine_2_1_6": {
            "net0": "da:b6:54:19:21:62",
            "net1": "9a:55:86:2d:07:d3",
            "net10": "a2:dd:e6:b3:00:5a",
            "net11": "46:2d:9a:af:7b:cb",
            "net12": "42:bd:ff:0a:59:a5",
            "net13": "76:e2:0a:e5:bf:58",
            "net14": "36:7d:78:c3:cd:60",
            "net15": "32:b2:21:ef:7f:03",
            "net2": "2a:1f:1d:c3:e1:74",
            "net3": "96:fe:e6:4f:59:07",
            "net4": "9a:23:da:2d:50:44",
            "net5": "4a:08:ae:97:a5:85",
            "net6": "c6:7a:61:76:5f:05",
            "net7": "5e:20:6a:e3:fc:06",
            "net8": "02:39:70:fd:d6:0a",
            "net9": "6a:e8:7f:05:73:c5"
        },
        "spine_2_1_7": {
            "net0": "a6:6b:29:f1:b3:60",
            "net1": "3e:2d:10:5e:49:cc",
            "net10": "ae:23:e7:51:c6:4b",
            "net11": "ae:b2:55:6c:33:ca",
            "net12": "92:d4:50:10:6e:1e",
            "net13": "66:f6:d9:8f:e9:16",
            "net14": "22:67:f8:1a:0f:2a",
            "net15": "fe:8e:d0:40:94:4b",
            "net2": "b6:ad:f9:05:87:8d",
            "net3": "3a:bc:3e:9f:f9:6a",
            "net4": "1a:e3:8e:a0:58:a8",
            "net5": "9a:32:45:65:1f:3f",
            "net6": "f6:1b:b2:50:e3:4c",
            "net7": "3a:4e:2a:5e:29:89",
            "net8": "aa:05:dd:4b:51:8a",
            "net9": "82:bb:8e:23:a2:bf"
        },
        "spine_2_1_8": {
            "net0": "fe:6e:5c:a2:a0:3d",
            "net1": "a6:2e:96:bb:a9:b3",
            "net10": "de:5d:f2:24:b7:1c",
            "net11": "ca:10:3f:1b:30:f2",
            "net12": "42:d1:f4:c5:18:e9",
            "net13": "92:f1:64:17:f7:00",
            "net14": "72:35:b4:5f:cb:55",
            "net15": "72:7b:1f:81:d8:38",
            "net2": "ee:20:ac:51:43:09",
            "net3": "d2:cb:fa:a2:9b:0e",
            "net4": "ce:18:26:ee:c2:a3",
            "net5": "66:f5:f7:26:e5:a6",
            "net6": "26:c1:68:f2:00:42",
            "net7": "c6:a9:0b:68:48:28",
            "net8": "9e:e7:fc:dc:0d:66",
            "net9": "d2:95:cc:df:01:ab"
        },
        "spine_3_1_1": {
            "net0": "ee:63:98:cf:8a:67",
            "net1": "9a:14:bd:4b:16:0f",
            "net10": "6a:54:b8:57:95:e5",
            "net11": "82:d3:98:e3:9d:a7",
            "net12": "06:ee:2f:61:56:57",
            "net13": "f2:3e:dc:0f:eb:a1",
            "net14": "0a:bb:04:d8:9f:fe",
            "net15": "de:e6:f0:bc:e7:98",
            "net2": "aa:dc:a0:56:1d:4a",
            "net3": "32:0a:a9:23:14:65",
            "net4": "ce:06:eb:22:d5:ae",
            "net5": "5a:43:60:1b:df:52",
            "net6": "82:c8:60:a2:6a:5a",
            "net7": "4a:4c:39:2b:be:04",
            "net8": "86:7e:a6:a8:01:f7",
            "net9": "16:81:f5:ae:c2:f2"
        },
        "spine_3_1_2": {
            "net0": "f2:53:0e:9e:e7:88",
            "net1": "4a:d9:72:df:f5:f4",
            "net10": "e2:0e:35:05:cc:d1",
            "net11": "8e:33:35:e8:58:54",
            "net12": "22:e3:ba:e6:7f:8f",
            "net13": "2a:c2:52:58:16:87",
            "net14": "72:25:13:96:a8:72",
            "net15": "ba:57:87:b9:fd:98",
            "net2": "ea:40:58:c0:6c:1c",
            "net3": "ce:49:80:bf:41:0e",
            "net4": "12:c2:ec:c7:09:d1",
            "net5": "1e:44:2c:a3:77:ff",
            "net6": "82:2d:5c:ea:33:81",
            "net7": "8a:2f:e1:b4:5e:46",
            "net8": "ca:0e:51:25:1b:ee",
            "net9": "72:dd:5d:9d:78:f6"
        },
        "spine_3_1_3": {
            "net0": "9a:63:84:70:70:d9",
            "net1": "b2:da:b7:1a:3f:f3",
            "net10": "56:d0:d7:ce:a6:a5",
            "net11": "62:1b:2c:33:35:da",
            "net12": "52:57:a0:78:f4:02",
            "net13": "ee:3f:e8:fd:0b:19",
            "net14": "d2:73:8f:5a:39:9e",
            "net15": "66:60:27:e1:1f:95",
            "net2": "aa:23:0b:30:ce:10",
            "net3": "ea:fd:7e:1b:26:91",
            "net4": "ee:f3:23:29:68:58",
            "net5": "4e:73:c4:f8:9e:38",
            "net6": "0e:57:ed:ce:cf:4f",
            "net7": "b2:4e:d6:c2:eb:7c",
            "net8": "3e:f0:21:7e:be:eb",
            "net9": "fe:37:04:f8:34:9a"
        },
        "spine_3_1_4": {
            "net0": "92:75:55:72:81:a2",
            "net1": "2a:c8:c8:be:8d:03",
            "net10": "1e:53:e7:47:72:03",
            "net11": "5e:5a:b8:88:52:84",
            "net12": "e2:ff:eb:ab:17:30",
            "net13": "9e:58:b8:58:7e:71",
            "net14": "6e:b2:f0:20:55:81",
            "net15": "aa:24:f9:36:18:13",
            "net2": "36:53:a7:af:81:f5",
            "net3": "02:54:0d:84:33:b1",
            "net4": "06:4a:35:4a:be:0d",
            "net5": "9a:db:86:04:ba:26",
            "net6": "96:c9:95:06:97:7d",
            "net7": "b6:da:2e:a6:81:ef",
            "net8": "aa:2e:5a:5e:fb:95",
            "net9": "2e:e5:c0:ca:88:39"
        },
        "spine_3_1_5": {
            "net0": "c2:dc:2c:7a:f9:55",
            "net1": "32:66:32:2e:e2:8d",
            "net10": "7e:07:c8:d4:a0:95",
            "net11": "2a:5e:2f:5d:8c:62",
            "net12": "0a:a5:10:b6:ba:a3",
            "net13": "32:c2:92:ae:71:79",
            "net14": "42:52:c3:2f:60:c2",
            "net15": "a2:43:76:72:69:32",
            "net2": "fe:75:a8:b6:44:91",
            "net3": "fe:7f:29:19:0f:34",
            "net4": "5a:9f:1e:ac:92:e5",
            "net5": "0e:80:64:e8:76:95",
            "net6": "7e:ad:56:03:e0:11",
            "net7": "5a:51:4d:1a:73:58",
            "net8": "7a:bd:c1:4f:40:96",
            "net9": "5e:91:31:f6:64:f3"
        },
        "spine_3_1_6": {
            "net0": "8e:2f:1b:29:74:69",
            "net1": "36:ef:d6:5f:b6:ee",
            "net10": "e2:62:85:4c:b7:05",
            "net11": "76:a2:f0:cd:17:5a",
            "net12": "ae:b8:09:db:a5:94",
            "net13": "ee:ba:92:91:9b:06",
            "net14": "e2:7d:42:2f:28:19",
            "net15": "ae:fd:8c:42:a5:0e",
            "net2": "32:38:a8:48:93:f4",
            "net3": "b2:97:1d:fc:20:28",
            "net4": "8e:35:c5:d2:cd:e6",
            "net5": "aa:b6:09:03:08:90",
            "net6": "ea:ea:dd:7e:8d:35",
            "net7": "b6:98:ce:5b:50:05",
            "net8": "36:7d:1b:27:0e:03",
            "net9": "e2:05:81:97:09:4b"
        },
        "spine_3_1_7": {
            "net0": "b2:b1:80:08:c1:fc",
            "net1": "06:5f:e5:5d:21:51",
            "net10": "96:54:41:eb:e1:36",
            "net11": "de:3f:e6:08:92:b1",
            "net12": "26:96:93:8d:79:e7",
            "net13": "66:af:0d:34:3d:95",
            "net14": "7a:6b:a1:61:4b:53",
            "net15": "ba:e1:11:48:8b:22",
            "net2": "12:b8:ac:89:a8:cf",
            "net3": "82:d2:7f:d6:bc:1a",
            "net4": "aa:2a:dc:17:ab:64",
            "net5": "5a:85:fd:01:b0:d6",
            "net6": "fa:5c:b0:9a:51:ca",
            "net7": "e6:07:c8:68:52:28",
            "net8": "6e:52:d7:11:9b:c2",
            "net9": "1e:e8:05:9a:d0:13"
        },
        "spine_3_1_8": {
            "net0": "8a:c7:5d:cf:70:23",
            "net1": "de:95:b3:f7:bb:9c",
            "net10": "82:4e:23:70:1b:53",
            "net11": "9e:e6:1f:fe:c0:1d",
            "net12": "da:43:d4:ef:24:ab",
            "net13": "1e:b3:bf:24:f1:d2",
            "net14": "f2:0f:82:87:14:80",
            "net15": "32:d6:62:63:cd:f1",
            "net2": "f6:d5:50:db:8d:6e",
            "net3": "22:39:bd:62:20:4e",
            "net4": "32:de:e4:ae:65:0e",
            "net5": "16:75:7d:0b:7a:bc",
            "net6": "22:2b:35:cc:c0:ab",
            "net7": "0e:90:82:82:2b:1a",
            "net8": "2e:96:53:96:bd:9a",
            "net9": "3e:0f:d8:f9:ad:09"
        },
        "spine_4_1_1": {
            "net0": "9e:f7:b6:23:88:19",
            "net1": "f2:07:a4:a3:11:bf",
            "net10": "b2:4f:51:0c:2c:4b",
            "net11": "e2:a3:c2:4e:b6:68",
            "net12": "66:df:b9:af:23:44",
            "net13": "2e:ef:4e:1d:70:85",
            "net14": "d2:af:9d:1a:4a:e2",
            "net15": "9a:23:6a:3f:e0:7f",
            "net2": "66:b5:ca:34:ac:11",
            "net3": "e6:cf:2e:a1:ca:80",
            "net4": "3e:26:1e:9c:c6:f6",
            "net5": "52:01:24:4e:54:3d",
            "net6": "02:85:30:49:9d:94",
            "net7": "fa:08:41:54:79:d0",
            "net8": "fe:97:28:b6:80:f5",
            "net9": "b2:eb:2b:1e:07:38"
        },
        "spine_4_1_2": {
            "net0": "e2:2a:c3:f0:c1:c2",
            "net1": "e2:c9:48:72:e7:fd",
            "net10": "02:0b:4e:20:8e:c5",
            "net11": "5a:92:ac:5d:c3:14",
            "net12": "96:63:7a:1f:1d:3a",
            "net13": "52:eb:40:4b:96:e8",
            "net14": "22:0d:b4:88:18:36",
            "net15": "ea:4a:a6:ab:dd:82",
            "net2": "8e:e2:8b:4d:9a:a4",
            "net3": "6e:80:ee:be:ae:03",
            "net4": "8e:d7:f9:cc:aa:14",
            "net5": "12:fe:06:c3:e5:98",
            "net6": "c2:b9:96:0e:61:74",
            "net7": "06:3e:43:8f:45:18",
            "net8": "46:ee:b0:56:92:bc",
            "net9": "c2:23:b8:16:f6:6a"
        },
        "spine_4_1_3": {
            "net0": "3e:77:2b:29:e2:e7",
            "net1": "be:86:67:b1:9c:56",
            "net10": "e6:e6:3b:ae:2d:0f",
            "net11": "ee:39:c4:f4:1c:9d",
            "net12": "f6:5e:40:21:f9:35",
            "net13": "fe:3e:af:1b:58:98",
            "net14": "42:2c:2a:f9:0e:6e",
            "net15": "d6:5d:4e:97:bb:2a",
            "net2": "82:d5:15:bf:8f:9f",
            "net3": "6a:ed:b2:05:b3:a7",
            "net4": "be:4f:46:e1:b6:bb",
            "net5": "b6:fa:58:21:6d:d9",
            "net6": "a2:0e:36:8b:e2:4b",
            "net7": "e6:fe:58:f1:99:f9",
            "net8": "c2:06:09:ea:94:cb",
            "net9": "42:45:e5:42:44:b3"
        },
        "spine_4_1_4": {
            "net0": "82:cb:46:fc:70:4a",
            "net1": "e2:b6:35:b1:d3:fb",
            "net10": "8a:0d:e5:b2:f6:cb",
            "net11": "12:4c:65:14:a6:c4",
            "net12": "96:00:fc:3e:e9:38",
            "net13": "16:ea:4a:7b:f1:2f",
            "net14": "ce:fd:7a:9c:ed:35",
            "net15": "6a:40:6d:ad:d3:b7",
            "net2": "b6:21:e9:d6:3f:14",
            "net3": "b2:00:5b:9c:70:9e",
            "net4": "66:1e:34:22:b7:e2",
            "net5": "4e:16:72:01:bf:7d",
            "net6": "42:61:ed:ec:cd:f5",
            "net7": "22:83:75:e8:e1:24",
            "net8": "6a:6c:c0:fb:07:35",
            "net9": "d6:0a:ee:da:d5:7c"
        },
        "spine_4_1_5": {
            "net0": "86:8b:ae:fe:df:4c",
            "net1": "06:50:2f:21:8e:8a",
            "net10": "d6:f2:a3:05:36:d1",
            "net11": "c6:4f:e2:3a:f2:26",
            "net12": "4a:47:a3:e9:b8:10",
            "net13": "4e:8e:d4:88:3e:0d",
            "net14": "ba:9a:31:09:69:9b",
            "net15": "52:e4:33:c4:4b:48",
            "net2": "26:ab:e4:a4:5f:b4",
            "net3": "3e:df:18:66:fb:f4",
            "net4": "1e:89:44:3f:91:d1",
            "net5": "ca:81:f2:23:6b:5b",
            "net6": "5e:d9:09:e0:fc:7b",
            "net7": "46:0a:c9:84:37:c6",
            "net8": "22:7e:44:7f:c4:43",
            "net9": "e6:27:bb:e1:2b:06"
        },
        "spine_4_1_6": {
            "net0": "b2:61:1e:96:76:85",
            "net1": "52:ee:79:6c:b1:d0",
            "net10": "6e:5f:86:01:bf:85",
            "net11": "46:a8:b5:dd:70:86",
            "net12": "ee:7e:11:20:aa:d9",
            "net13": "12:3a:a9:2a:43:ee",
            "net14": "2e:cf:fe:5a:8a:c0",
            "net15": "d6:64:4e:7e:6f:e7",
            "net2": "d2:d2:10:f8:89:19",
            "net3": "a2:b4:28:8d:6a:73",
            "net4": "0e:78:10:03:dd:cb",
            "net5": "d6:25:9b:39:b7:cf",
            "net6": "02:ba:41:1d:a7:cc",
            "net7": "ca:c8:af:60:ba:df",
            "net8": "d6:48:1e:0f:70:af",
            "net9": "be:b0:c5:fc:f7:7a"
        },
        "spine_4_1_7": {
            "net0": "22:d4:2e:3c:57:4c",
            "net1": "7a:1f:bc:e0:5b:03",
            "net10": "f6:3b:41:a6:37:c5",
            "net11": "7e:00:64:f6:8e:4c",
            "net12": "f2:2a:9c:76:4d:96",
            "net13": "d6:ec:ab:1d:ff:15",
            "net14": "2e:95:df:7d:0d:35",
            "net15": "ee:bb:71:37:53:cb",
            "net2": "6a:a5:80:b5:74:4c",
            "net3": "0a:6c:eb:5e:eb:01",
            "net4": "32:04:f0:86:a0:92",
            "net5": "ba:f0:e3:58:a1:4a",
            "net6": "de:a0:63:00:24:ab",
            "net7": "da:89:58:78:77:b6",
            "net8": "7e:10:05:f1:31:90",
            "net9": "c2:ce:03:d3:07:1b"
        },
        "spine_4_1_8": {
            "net0": "ca:b8:f8:d8:54:3a",
            "net1": "ae:e5:b4:d3:67:c0",
            "net10": "16:70:e9:15:0f:f5",
            "net11": "8a:b3:d0:9c:2e:94",
            "net12": "3e:15:96:14:b4:88",
            "net13": "3a:44:47:2c:ed:ec",
            "net14": "56:82:23:19:c8:f1",
            "net15": "de:eb:35:04:30:eb",
            "net2": "46:19:e4:da:ba:ec",
            "net3": "c6:68:4a:e7:73:c0",
            "net4": "3e:18:4e:39:69:d1",
            "net5": "e6:2e:0a:af:e6:82",
            "net6": "9e:98:26:ff:a6:c8",
            "net7": "6a:d8:f9:5e:b7:84",
            "net8": "4a:f4:55:72:10:83",
            "net9": "ba:42:50:0e:92:73"
        },
        "tof_1_2_1": {
            "net0": "ae:cb:c0:7d:00:b6",
            "net1": "7a:2d:97:1a:41:7d",
            "net10": "aa:d3:0e:7b:65:0c",
            "net11": "56:42:91:0a:9e:d4",
            "net12": "da:7e:3c:ba:8a:ef",
            "net13": "b6:1d:53:ef:54:4f",
            "net14": "46:f6:64:94:d5:d3",
            "net15": "aa:26:53:7d:02:12",
            "net2": "92:5e:e3:e8:99:24",
            "net3": "be:91:33:b6:f4:ab",
            "net4": "3a:23:0a:83:02:6d",
            "net5": "c6:93:b6:c7:29:09",
            "net6": "52:73:18:5f:85:87",
            "net7": "32:fc:79:e9:48:c8",
            "net8": "42:1f:6f:ca:19:68",
            "net9": "16:3a:ee:e9:ef:13"
        },
        "tof_1_2_2": {
            "net0": "b2:04:14:6f:50:28",
            "net1": "aa:e5:33:26:1c:77",
            "net10": "3e:18:26:39:7a:87",
            "net11": "a2:82:5d:65:51:8b",
            "net12": "ea:d3:94:90:94:93",
            "net13": "42:2f:bd:23:43:30",
            "net14": "92:15:c1:66:47:b8",
            "net15": "06:07:24:ee:ee:34",
            "net2": "e2:c5:14:d3:76:a8",
            "net3": "16:ae:b7:be:7b:4c",
            "net4": "3e:8c:1e:86:5f:be",
            "net5": "86:8e:0e:ce:2e:e8",
            "net6": "72:81:35:d9:89:7a",
            "net7": "1a:42:65:22:2e:51",
            "net8": "da:d3:36:cc:f5:f8",
            "net9": "82:e1:6c:73:16:68"
        },
        "tof_1_2_3": {
            "net0": "22:17:91:b8:6d:37",
            "net1": "ce:0e:e4:14:f9:ab",
            "net10": "52:3a:74:9a:db:9d",
            "net11": "4a:09:6f:52:ca:89",
            "net12": "3e:95:ea:fe:80:45",
            "net13": "1e:00:0a:83:8a:02",
            "net14": "ee:c2:c1:ad:bf:93",
            "net15": "f2:29:0d:bd:c3:86",
            "net2": "62:08:75:93:cc:4c",
            "net3": "fe:bf:36:1f:ee:0a",
            "net4": "ae:47:29:50:6a:ba",
            "net5": "d2:74:7f:89:f3:11",
            "net6": "86:9c:c5:67:95:02",
            "net7": "52:66:ec:23:7f:7c",
            "net8": "7e:51:d1:a9:c6:f5",
            "net9": "b2:36:56:83:89:a3"
        },
        "tof_1_2_4": {
            "net0": "c6:86:34:2e:5a:a1",
            "net1": "36:f1:f2:9d:df:b8",
            "net10": "9e:b3:05:a5:05:be",
            "net11": "ea:0b:68:40:d2:3f",
            "net12": "a6:47:7d:83:33:04",
            "net13": "f2:f1:3a:ea:91:0c",
            "net14": "26:b7:a8:5c:b1:70",
            "net15": "16:ac:73:c9:e7:b2",
            "net2": "4a:63:4e:0e:48:8e",
            "net3": "8a:0e:77:63:7f:69",
            "net4": "da:c7:99:ca:0e:22",
            "net5": "ca:93:08:ec:68:95",
            "net6": "9a:04:61:8d:21:21",
            "net7": "7a:23:e9:2f:69:94",
            "net8": "c6:de:0d:54:cf:ff",
            "net9": "ee:67:43:26:10:7c"
        },
        "tof_1_2_5": {
            "net0": "c6:57:7f:87:8d:46",
            "net1": "0e:a8:65:70:e7:8f",
            "net10": "46:56:56:e6:d6:40",
            "net11": "86:09:1f:ca:30:08",
            "net12": "ea:e4:12:dd:e0:fb",
            "net13": "e2:a2:4b:4d:28:55",
            "net14": "fe:0a:66:48:f7:3e",
            "net15": "2e:f9:bf:bb:ba:46",
            "net2": "ea:a8:7c:6d:ad:69",
            "net3": "32:8f:80:38:9f:42",
            "net4": "b6:ee:f3:17:86:90",
            "net5": "6e:02:a0:2a:8f:73",
            "net6": "2e:00:38:26:ce:ce",
            "net7": "32:64:f0:a2:f6:27",
            "net8": "b2:94:e7:9b:c4:90",
            "net9": "6e:5f:36:6c:63:9c"
        },
        "tof_1_2_6": {
            "net0": "06:f1:85:72:a2:f6",
            "net1": "da:20:53:28:98:13",
            "net10": "c6:f9:91:f5:0a:97",
            "net11": "ce:a8:f9:85:dc:04",
            "net12": "9a:b2:b4:5b:c4:eb",
            "net13": "2a:cc:16:12:ea:df",
            "net14": "8a:6c:7d:af:a6:cf",
            "net15": "12:27:5b:e9:e4:ae",
            "net2": "6a:63:2e:ee:d7:e2",
            "net3": "d6:1d:51:f6:c3:4d",
            "net4": "9a:e3:88:1a:90:36",
            "net5": "16:47:df:31:c8:ab",
            "net6": "b2:cc:da:3c:f0:d4",
            "net7": "26:57:58:d3:05:18",
            "net8": "ca:e9:a3:18:f8:f5",
            "net9": "8e:7a:c5:f9:9e:ac"
        },
        "tof_1_2_7": {
            "net0": "8e:3c:1b:f7:6e:82",
            "net1": "26:ca:ca:d5:10:60",
            "net10": "ca:9c:f7:d5:e7:0d",
            "net11": "1a:b4:75:90:80:96",
            "net12": "be:53:e3:f0:53:78",
            "net13": "d2:ac:7d:04:d5:b2",
            "net14": "1a:a1:31:70:38:c2",
            "net15": "f2:43:6d:a1:45:14",
            "net2": "56:4e:26:07:d6:98",
            "net3": "22:c9:57:a3:29:51",
            "net4": "12:aa:d6:d6:2a:c4",
            "net5": "4a:ae:48:08:40:d6",
            "net6": "ea:09:14:66:9e:f4",
            "net7": "86:b8:2c:42:d5:52",
            "net8": "62:37:c0:11:6e:90",
            "net9": "3a:5c:6b:64:84:8e"
        },
        "tof_1_2_8": {
            "net0": "b2:b5:04:63:ff:b4",
            "net1": "ae:f6:1d:ee:dc:38",
            "net10": "de:5d:6e:3f:ed:a1",
            "net11": "be:68:e2:ae:31:e1",
            "net12": "e6:c5:fd:24:6e:b7",
            "net13": "0e:06:98:2f:b9:f8",
            "net14": "4e:65:80:68:1a:a6",
            "net15": "ce:cc:96:9b:eb:b3",
            "net2": "76:41:20:5d:a4:c9",
            "net3": "1a:45:24:4a:94:1b",
            "net4": "6a:de:da:f5:ee:59",
            "net5": "5e:11:2a:6b:6c:a0",
            "net6": "3a:69:4b:52:95:c3",
            "net7": "42:2a:f6:af:c5:a3",
            "net8": "d6:e4:84:93:e8:49",
            "net9": "72:e1:43:f0:dd:78"
        },
        "tof_2_2_1": {
            "net0": "ea:95:41:78:e5:ba",
            "net1": "62:a9:d4:c4:5d:c2",
            "net10": "b2:5d:3b:84:1b:8e",
            "net11": "fa:dc:e1:da:40:6b",
            "net12": "be:62:4d:bd:fd:de",
            "net13": "de:e0:70:fb:98:8f",
            "net14": "9e:11:d8:de:bf:ce",
            "net15": "16:8f:51:fe:fe:f8",
            "net2": "82:1f:26:a3:3a:97",
            "net3": "b2:a7:f8:04:ac:bb",
            "net4": "2a:87:c9:fa:53:0d",
            "net5": "76:c9:17:59:13:13",
            "net6": "86:1e:94:d8:86:7e",
            "net7": "c2:d4:54:ed:86:dd",
            "net8": "ee:86:ac:36:a7:8b",
            "net9": "0a:58:40:3c:8d:9d"
        },
        "tof_2_2_2": {
            "net0": "d6:2d:f7:b8:e3:4c",
            "net1": "3a:d5:cc:6c:20:5f",
            "net10": "ea:f9:d2:e7:94:55",
            "net11": "1e:f5:23:e6:ad:ff",
            "net12": "be:64:fd:aa:e2:4f",
            "net13": "6a:d1:92:a5:45:47",
            "net14": "82:ad:87:b0:84:d7",
            "net15": "0e:fa:24:8a:1f:7e",
            "net2": "e6:c4:7b:05:56:c2",
            "net3": "36:40:92:3c:d5:fc",
            "net4": "8e:9d:8e:9c:fc:37",
            "net5": "8e:48:80:2b:f7:1a",
            "net6": "f2:b2:88:89:93:62",
            "net7": "7e:16:c1:e2:5d:00",
            "net8": "52:9e:71:e1:a7:09",
            "net9": "82:13:e0:01:5a:e9"
        },
        "tof_2_2_3": {
            "net0": "c2:89:b7:2b:6a:ad",
            "net1": "3e:f6:64:3f:f5:ee",
            "net10": "82:8a:08:c6:13:54",
            "net11": "c6:8e:a0:37:54:43",
            "net12": "46:57:21:fe:b1:ef",
            "net13": "0a:38:d1:83:cf:1f",
            "net14": "c6:c3:cb:92:3e:4e",
            "net15": "c6:be:e1:ac:83:31",
            "net2": "7a:9d:7d:69:dd:a9",
            "net3": "5e:5c:05:10:23:8e",
            "net4": "fe:5e:34:1f:47:e9",
            "net5": "d2:39:31:0f:88:75",
            "net6": "6a:f0:15:e0:e3:c0",
            "net7": "22:bc:98:6f:f7:50",
            "net8": "e6:d9:23:e3:b6:e1",
            "net9": "6e:e6:10:75:9f:8d"
        },
        "tof_2_2_4": {
            "net0": "5a:82:04:07:8d:98",
            "net1": "fa:57:1e:7c:fa:7a",
            "net10": "7a:d9:0d:94:47:13",
            "net11": "06:75:ec:6d:aa:00",
            "net12": "86:67:82:ea:a8:b8",
            "net13": "62:47:d6:b8:0b:a7",
            "net14": "5a:8c:46:22:e0:63",
            "net15": "72:9b:5f:d6:6d:a8",
            "net2": "8e:f2:35:cd:3e:dc",
            "net3": "d6:56:c5:6d:1b:6a",
            "net4": "7a:ec:d2:f1:64:f6",
            "net5": "96:11:54:f0:2b:f7",
            "net6": "aa:c7:8d:4e:6a:ae",
            "net7": "ea:44:51:50:60:eb",
            "net8": "4a:af:7e:85:36:a7",
            "net9": "0a:63:d5:37:c7:db"
        },
        "tof_2_2_5": {
            "net0": "5a:25:11:c0:cc:48",
            "net1": "ae:fb:4e:18:98:f8",
            "net10": "42:f0:ca:a9:f2:c2",
            "net11": "12:fa:2b:f7:25:34",
            "net12": "2a:c5:4d:b5:4b:75",
            "net13": "1e:6c:a9:fb:e2:61",
            "net14": "f6:2c:c9:bd:e4:2f",
            "net15": "92:4d:a2:16:cd:29",
            "net2": "ca:87:43:c4:2a:79",
            "net3": "a2:35:b3:58:68:2f",
            "net4": "2e:45:c9:35:e2:6e",
            "net5": "aa:0f:16:94:c7:89",
            "net6": "26:cd:b8:f7:2c:89",
            "net7": "2e:a6:b0:5c:28:f1",
            "net8": "82:49:51:6d:25:a1",
            "net9": "0e:cd:9e:fa:fc:dc"
        },
        "tof_2_2_6": {
            "net0": "5e:2f:e3:2f:78:ac",
            "net1": "56:4c:94:b4:f8:ae",
            "net10": "e6:0a:4c:44:e0:3b",
            "net11": "26:e6:84:26:b4:a4",
            "net12": "62:96:6b:cc:f8:1c",
            "net13": "fa:e2:79:d7:e7:77",
            "net14": "72:58:71:44:a5:61",
            "net15": "9a:a5:75:87:b2:c4",
            "net2": "96:1b:1a:a8:18:a9",
            "net3": "2e:e3:51:d8:2c:b9",
            "net4": "0e:0a:d3:a6:dd:36",
            "net5": "8a:b8:d2:7d:3a:ce",
            "net6": "aa:78:d9:a9:ca:07",
            "net7": "86:1e:44:90:31:02",
            "net8": "22:6e:24:1e:60:12",
            "net9": "a6:dc:fc:24:d2:b9"
        },
        "tof_2_2_7": {
            "net0": "2a:f4:1c:4a:15:b0",
            "net1": "1e:78:ec:0d:62:56",
            "net10": "c2:0f:92:cb:32:0a",
            "net11": "da:10:df:40:17:53",
            "net12": "de:c6:4f:fc:b5:3b",
            "net13": "6a:98:8a:e5:96:2e",
            "net14": "02:cb:73:98:9e:e0",
            "net15": "86:d6:b6:2c:45:60",
            "net2": "fe:45:82:f2:4b:ba",
            "net3": "26:49:ca:2a:43:5d",
            "net4": "a2:f2:c6:a9:c3:b9",
            "net5": "c6:e2:0c:b1:3f:64",
            "net6": "7e:9e:67:c2:56:af",
            "net7": "76:81:2c:3c:9f:92",
            "net8": "ba:42:69:f2:5f:d4",
            "net9": "2e:02:a3:0f:b4:37"
        },
        "tof_2_2_8": {
            "net0": "d2:0b:a6:e7:b7:ea",
            "net1": "f6:d0:1b:38:33:06",
            "net10": "9e:b7:01:ed:36:35",
            "net11": "7e:59:2d:cf:d1:91",
            "net12": "f6:7f:21:ff:f5:07",
            "net13": "9a:1e:b1:08:57:61",
            "net14": "a2:f5:2b:b3:76:31",
            "net15": "e2:2a:45:c5:c5:53",
            "net2": "62:83:92:85:2f:b0",
            "net3": "26:ff:b8:f6:4d:59",
            "net4": "06:b6:d5:27:7b:58",
            "net5": "3e:66:c1:c0:a6:0e",
            "net6": "92:85:ba:b7:f9:12",
            "net7": "46:63:65:53:4a:94",
            "net8": "d6:f0:9c:1f:95:8d",
            "net9": "4a:a5:38:4e:37:4a"
        }
    },
    "failed_machine": "spine_1_1_1",
    "failed_interfaces": [
        "net8"
    ],
    "failure_time": {
        "leaf_1_0_1": 1636595223.0969145,
        "leaf_1_0_2": 1636595223.2243845,
        "leaf_1_0_3": 1636595224.2023554,
        "leaf_1_0_4": 1636595223.914372,
        "leaf_1_0_5": 1636595224.560779,
        "leaf_1_0_6": 1636595224.7309968,
        "leaf_1_0_7": 1636595224.7640464,
        "leaf_1_0_8": 1636595225.5451462,
        "leaf_2_0_1": 1636595225.0709906,
        "leaf_2_0_2": 1636595225.087994,
        "leaf_2_0_3": 1636595223.081233,
        "leaf_2_0_4": 1636595223.2222989,
        "leaf_2_0_5": 1636595223.7322986,
        "leaf_2_0_6": 1636595224.2882984,
        "leaf_2_0_7": 1636595224.7333446,
        "leaf_2_0_8": 1636595224.8226123,
        "leaf_3_0_1": 1636595224.9072945,
        "leaf_3_0_2": 1636595224.9686465,
        "leaf_3_0_3": 1636595225.6280093,
        "leaf_3_0_4": 1636595225.0707397,
        "leaf_3_0_5": 1636595225.146606,
        "leaf_3_0_6": 1636595225.2719965,
        "leaf_3_0_7": 1636595225.2900567,
        "leaf_3_0_8": 1636595226.220948,
        "leaf_4_0_1": 1636595225.671814,
        "leaf_4_0_2": 1636595225.687074,
        "leaf_4_0_3": 1636595225.753904,
        "leaf_4_0_4": 1636595225.8107636,
        "leaf_4_0_5": 1636595225.8591533,
        "leaf_4_0_6": 1636595225.941085,
        "leaf_4_0_7": 1636595225.7690773,
        "leaf_4_0_8": 1636595225.276722,
        "spine_1_1_1": 1636595225.8882518,
        "spine_1_1_2": 1636595226.2212741,
        "spine_1_1_3": 1636595225.6829145,
        "spine_1_1_4": 1636595225.6933177,
        "spine_1_1_5": 1636595225.7315974,
        "spine_1_1_6": 1636595225.7447255,
        "spine_1_1_7": 1636595225.8306336,
        "spine_1_1_8": 1636595225.927566,
        "spine_2_1_1": 1636595226.002944,
        "spine_2_1_2": 1636595226.103729,
        "spine_2_1_3": 1636595226.5422688,
        "spine_2_1_4": 1636595226.6540644,
        "spine_2_1_5": 1636595226.6903057,
        "spine_2_1_6": 1636595226.7274377,
        "spine_2_1_7": 1636595227.1765602,
        "spine_2_1_8": 1636595227.27612,
        "spine_3_1_1": 1636595227.2965064,
        "spine_3_1_2": 1636595227.3284562,
        "spine_3_1_3": 1636595225.9801018,
        "spine_3_1_4": 1636595226.0439322,
        "spine_3_1_5": 1636595226.1928146,
        "spine_3_1_6": 1636595226.5429742,
        "spine_3_1_7": 1636595226.734517,
        "spine_3_1_8": 1636595227.1137464,
        "spine_4_1_1": 1636595227.2753577,
        "spine_4_1_2": 1636595227.8898168,
        "spine_4_1_3": 1636595227.3367546,
        "spine_4_1_4": 1636595227.5413022,
        "spine_4_1_5": 1636595227.4575224,
        "spine_4_1_6": 1636595228.1310534,
        "spine_4_1_7": 1636595227.7391655,
        "spine_4_1_8": 1636595227.9943511,
        "tof_1_2_1": 1636595228.805892,
        "tof_1_2_2": 1636595228.9397063,
        "tof_1_2_3": 1636595228.958446,
        "tof_1_2_4": 1636595229.744425,
        "tof_1_2_5": 1636595229.219092,
        "tof_1_2_6": 1636595229.23958,
        "tof_1_2_7": 1636595227.7088869,
        "tof_1_2_8": 1636595227.9039364,
        "tof_2_2_1": 1636595227.9942245,
        "tof_2_2_2": 1636595228.9404917,
        "tof_2_2_3": 1636595228.958981,
        "tof_2_2_4": 1636595229.7040467,
        "tof_2_2_5": 1636595229.1782477,
        "tof_2_2_6": 1636595229.2370605,
        "tof_2_2_7": 1636595229.246559,
        "tof_2_2_8": 1636595230.0681922
    }
}