{
    "k_leaf": 4,
    "k_top": 4,
    "redundancy_factor": 4,
    "is_k8s": false,
    "machine_mac_addresses": {
        "leaf_1_0_1": {
            "eth0": "aa:8a:b0:c4:01:07",
            "eth1": "3a:bc:a3:f1:9c:9e",
            "eth2": "9a:46:22:ae:4d:be",
            "eth3": "de:f4:04:55:32:6b",
            "eth4": "fa:03:ac:2c:51:22"
        },
        "leaf_1_0_2": {
            "eth0": "e2:0b:59:65:c7:a8",
            "eth1": "fa:64:d8:51:1d:98",
            "eth2": "e6:c3:c3:b8:59:f3",
            "eth3": "76:78:0d:30:fe:14",
            "eth4": "3e:da:ad:a5:6d:e1"
        },
        "leaf_1_0_3": {
            "eth0": "2e:3e:aa:c0:0b:4b",
            "eth1": "7a:9f:ab:5c:21:b7",
            "eth2": "ce:2e:83:26:b1:99",
            "eth3": "32:ed:f9:fc:bb:07",
            "eth4": "ea:b7:db:ed:40:bc"
        },
        "leaf_1_0_4": {
            "eth0": "82:b2:df:73:df:3a",
            "eth1": "06:d6:d8:76:2c:5e",
            "eth2": "7a:8a:44:e6:d7:60",
            "eth3": "a6:09:71:0e:12:06",
            "eth4": "0a:17:6d:14:e4:2e"
        },
        "leaf_2_0_1": {
            "eth0": "de:8c:1c:26:5b:72",
            "eth1": "6a:34:9e:0c:e1:b1",
            "eth2": "92:4c:08:f7:b8:9b",
            "eth3": "d6:b4:06:80:fb:4a",
            "eth4": "06:9f:c9:65:c8:5b"
        },
        "leaf_2_0_2": {
            "eth0": "0e:51:6b:4f:80:79",
            "eth1": "b2:cd:43:30:c6:5b",
            "eth2": "92:c1:3f:71:2e:42",
            "eth3": "e6:3b:25:1a:e8:bc",
            "eth4": "76:e4:cd:e0:73:37"
        },
        "leaf_2_0_3": {
            "eth0": "aa:cc:ac:ef:eb:1c",
            "eth1": "ba:3d:46:c2:ac:6e",
            "eth2": "7e:bd:fd:41:d8:1b",
            "eth3": "8a:5c:2e:69:06:03",
            "eth4": "ba:13:73:12:d0:93"
        },
        "leaf_2_0_4": {
            "eth0": "a6:dd:0f:39:c8:85",
            "eth1": "0a:dd:d7:f0:cf:9b",
            "eth2": "a6:8a:ae:1d:92:6d",
            "eth3": "92:99:05:ff:dc:e8",
            "eth4": "ea:6e:a6:93:e2:17"
        },
        "spine_1_1_1": {
            "eth0": "3a:36:d9:a0:bc:25",
            "eth1": "e2:ff:32:3c:75:15",
            "eth2": "ee:47:4b:8a:eb:0e",
            "eth3": "9e:69:13:4e:0a:97",
            "eth4": "de:ed:9a:06:6f:7b",
            "eth5": "fe:c0:84:83:a7:36",
            "eth6": "fa:b6:03:03:4d:9e",
            "eth7": "b6:89:f7:05:cd:53"
        },
        "spine_1_1_2": {
            "eth0": "92:1d:40:22:25:c1",
            "eth1": "da:b9:35:8d:32:f9",
            "eth2": "42:26:cb:1d:d4:93",
            "eth3": "4a:0e:19:77:98:8e",
            "eth4": "be:dd:08:c2:cd:7d",
            "eth5": "82:71:da:02:6a:fe",
            "eth6": "be:34:23:77:ae:fb",
            "eth7": "f2:3b:5c:ea:89:a0"
        },
        "spine_1_1_3": {
            "eth0": "56:29:4f:e8:c1:a9",
            "eth1": "82:dd:8f:ab:3f:b1",
            "eth2": "5a:6d:f6:27:72:38",
            "eth3": "5e:58:bc:77:27:00",
            "eth4": "76:f4:ed:11:8a:a8",
            "eth5": "ae:0f:5d:65:12:48",
            "eth6": "4e:e4:82:e3:23:2d",
            "eth7": "56:9b:71:1b:3e:00"
        },
        "spine_1_1_4": {
            "eth0": "2a:9a:f6:a9:d7:65",
            "eth1": "72:bd:63:c7:ac:3e",
            "eth2": "42:96:b5:67:0d:c5",
            "eth3": "06:29:61:fe:98:6a",
            "eth4": "3e:00:6f:8d:c9:8d",
            "eth5": "8e:91:15:47:3c:8d",
            "eth6": "52:6b:0b:0a:97:62",
            "eth7": "2e:b0:26:4a:69:e1"
        },
        "spine_2_1_1": {
            "eth0": "ea:09:dd:ce:2c:ae",
            "eth1": "ba:ca:7f:49:37:45",
            "eth2": "be:7f:b1:05:83:a4",
            "eth3": "f6:5c:14:6c:10:a3",
            "eth4": "82:97:26:95:34:43",
            "eth5": "76:28:b8:61:65:c1",
            "eth6": "8e:53:18:16:06:57",
            "eth7": "de:0f:d0:ac:f4:d9"
        },
        "spine_2_1_2": {
            "eth0": "72:08:3d:53:98:36",
            "eth1": "ba:33:54:f8:58:49",
            "eth2": "16:43:f1:d2:6b:13",
            "eth3": "8a:66:f5:29:df:61",
            "eth4": "fa:39:f7:97:51:cb",
            "eth5": "02:93:9a:f1:03:38",
            "eth6": "3e:70:37:7c:b6:66",
            "eth7": "22:b3:aa:3a:e9:d5"
        },
        "spine_2_1_3": {
            "eth0": "86:94:9f:13:b4:7d",
            "eth1": "c2:cc:a2:4e:8f:6f",
            "eth2": "06:b4:d3:cf:ec:26",
            "eth3": "c2:33:a9:6d:7a:60",
            "eth4": "36:9e:be:88:9a:a4",
            "eth5": "06:be:f0:5f:20:c7",
            "eth6": "f6:1d:eb:05:92:b5",
            "eth7": "6e:29:ef:ec:54:3e"
        },
        "spine_2_1_4": {
            "eth0": "0a:0c:64:73:4f:0d",
            "eth1": "b2:70:4a:6a:9a:40",
            "eth2": "62:37:2f:09:47:34",
            "eth3": "f2:6d:81:3c:52:6b",
            "eth4": "3a:a6:5f:55:e4:a6",
            "eth5": "d6:7a:55:6a:0e:3a",
            "eth6": "5a:3f:22:dd:b0:6a",
            "eth7": "76:bb:d1:69:34:23"
        },
        "tof_1_2_1": {
            "eth0": "ee:56:4f:f6:c9:26",
            "eth1": "8e:42:63:9c:39:29",
            "eth2": "16:91:ee:41:34:88",
            "eth3": "6e:b2:29:8e:dd:60",
            "eth4": "ba:dc:b4:d1:41:0c",
            "eth5": "7e:e8:50:51:bd:44",
            "eth6": "36:6c:e7:2a:59:1a",
            "eth7": "26:91:cf:18:b7:67"
        },
        "tof_1_2_2": {
            "eth0": "aa:b4:d2:fc:fd:e0",
            "eth1": "3e:93:f3:65:ee:36",
            "eth2": "f6:35:2b:97:c5:51",
            "eth3": "56:11:7c:ee:f6:be",
            "eth4": "56:2f:4d:ff:8e:f1",
            "eth5": "16:55:03:c1:27:c0",
            "eth6": "a6:64:36:fa:2f:27",
            "eth7": "fa:3b:ba:a5:c4:e4"
        },
        "tof_1_2_3": {
            "eth0": "b6:89:34:2c:8c:bd",
            "eth1": "e6:fe:7f:4e:ca:62",
            "eth2": "c2:84:99:d7:06:5e",
            "eth3": "46:c0:7d:d0:0a:d5",
            "eth4": "a2:39:cc:48:4d:7a",
            "eth5": "de:cd:db:34:63:1d",
            "eth6": "5e:cf:02:38:fc:21",
            "eth7": "76:e8:15:b9:3c:b7"
        },
        "tof_1_2_4": {
            "eth0": "4a:53:3c:3d:77:5e",
            "eth1": "7e:00:30:40:11:72",
            "eth2": "a2:22:e1:63:7c:84",
            "eth3": "c2:62:fe:26:b6:c3",
            "eth4": "1e:c7:72:bd:fc:4b",
            "eth5": "d6:31:d2:da:a6:a7",
            "eth6": "9e:b6:8f:06:8a:41",
            "eth7": "06:24:6a:e6:32:69"
        }
    },
    "failed_machine": "leaf_1_0_1",
    "failure_time": {
        "leaf_1_0_1": 1622026507.2760031,
        "leaf_1_0_2": 1622026507.2853453,
        "leaf_1_0_3": 1622026507.2802985,
        "leaf_1_0_4": 1622026507.3035672,
        "leaf_2_0_1": 1622026507.2855406,
        "leaf_2_0_2": 1622026507.2933981,
        "leaf_2_0_3": 1622026507.291517,
        "leaf_2_0_4": 1622026507.3172498,
        "spine_1_1_1": 1622026507.2928638,
        "spine_1_1_2": 1622026507.2981899,
        "spine_1_1_3": 1622026507.3069832,
        "spine_1_1_4": 1622026507.3295357,
        "spine_2_1_1": 1622026507.3126109,
        "spine_2_1_2": 1622026507.329521,
        "spine_2_1_3": 1622026507.3171937,
        "spine_2_1_4": 1622026507.326487,
        "tof_1_2_1": 1622026507.330835,
        "tof_1_2_2": 1622026507.3413255,
        "tof_1_2_3": 1622026507.342376,
        "tof_1_2_4": 1622026507.3472729
    }
}