{
    "k_leaf": 12,
    "k_top": 12,
    "redundancy_factor": 12,
    "is_k8s": true,
    "machine_mac_addresses": {
        "leaf_1_0_1": {
            "net0": "0e:ad:70:4d:77:5a",
            "net1": "f2:dd:b0:0a:8e:d6",
            "net10": "2a:ca:c9:dd:32:cd",
            "net11": "9e:97:e8:c7:91:2b",
            "net12": "3a:20:06:1d:5f:44",
            "net2": "0e:9d:15:e7:c8:4e",
            "net3": "9e:04:c2:c0:b4:47",
            "net4": "c2:28:68:32:28:a3",
            "net5": "7e:43:e7:e6:af:72",
            "net6": "22:a9:4e:7d:00:15",
            "net7": "4e:b9:25:79:13:84",
            "net8": "5e:4b:07:b6:51:28",
            "net9": "0a:4b:a6:99:33:d0"
        },
        "leaf_1_0_10": {
            "net0": "0a:6b:46:d1:e7:ee",
            "net1": "46:d9:5b:8c:ae:cb",
            "net10": "7e:dc:b2:ec:62:b8",
            "net11": "62:ae:b0:eb:b6:25",
            "net12": "6e:3b:cd:cb:bd:e8",
            "net2": "6e:39:9b:ad:39:a2",
            "net3": "42:f3:ef:f2:8d:dd",
            "net4": "ae:70:37:25:71:fe",
            "net5": "d2:aa:0e:d9:13:76",
            "net6": "9a:1a:2f:9d:d6:e4",
            "net7": "ce:de:9f:09:cb:69",
            "net8": "6e:0d:a7:0a:4f:dc",
            "net9": "16:97:c7:d6:f7:40"
        },
        "leaf_1_0_11": {
            "net0": "6a:59:db:a7:08:f3",
            "net1": "e2:7a:e3:c0:04:ff",
            "net10": "96:0f:81:79:8e:b4",
            "net11": "c6:2d:1f:f2:a0:e1",
            "net12": "56:2b:2a:e4:68:53",
            "net2": "ea:05:50:2b:8d:e6",
            "net3": "62:44:98:12:76:ee",
            "net4": "f2:aa:a9:fc:97:32",
            "net5": "6e:98:e9:48:8e:3f",
            "net6": "6e:78:4a:b6:80:3a",
            "net7": "da:83:cd:b0:88:10",
            "net8": "f6:db:26:2c:37:6d",
            "net9": "2a:f7:e1:67:d7:23"
        },
        "leaf_1_0_12": {
            "net0": "62:cd:0b:40:ec:f8",
            "net1": "a6:12:7c:46:fb:7b",
            "net10": "72:34:a8:8a:c6:59",
            "net11": "62:20:6a:67:6b:83",
            "net12": "7a:67:b2:3a:20:4d",
            "net2": "ca:0b:e2:8f:db:20",
            "net3": "fe:2f:8f:43:d3:e1",
            "net4": "82:74:68:ce:05:61",
            "net5": "92:a1:34:ca:27:e0",
            "net6": "c6:58:7c:c6:b1:eb",
            "net7": "02:2f:79:7f:91:49",
            "net8": "4a:26:96:89:54:c7",
            "net9": "c6:83:79:65:66:a0"
        },
        "leaf_1_0_2": {
            "net0": "9e:6e:85:d7:b1:5a",
            "net1": "ba:bf:f3:05:09:6c",
            "net10": "56:d8:12:0a:7d:db",
            "net11": "0e:52:2c:f9:63:8f",
            "net12": "26:8c:11:dd:73:72",
            "net2": "da:91:31:76:88:e9",
            "net3": "26:8c:e3:a4:70:3f",
            "net4": "5e:60:ad:dd:36:b1",
            "net5": "56:d2:86:23:0c:f9",
            "net6": "6e:99:d6:08:52:af",
            "net7": "22:9a:6c:1e:5b:86",
            "net8": "fe:a7:ab:af:cd:f4",
            "net9": "b6:ae:11:db:18:b1"
        },
        "leaf_1_0_3": {
            "net0": "ae:28:cc:17:b2:99",
            "net1": "3a:64:4f:a8:a6:29",
            "net10": "ea:80:36:3d:cc:1c",
            "net11": "ea:f9:c0:ff:41:8e",
            "net12": "f6:c8:60:3b:3c:a3",
            "net2": "ea:e3:07:b3:a4:fe",
            "net3": "92:27:8e:0a:41:be",
            "net4": "5a:ee:cf:b9:ed:35",
            "net5": "92:bb:43:4e:2c:88",
            "net6": "3a:33:9d:81:ce:96",
            "net7": "ae:e1:9d:c4:7b:07",
            "net8": "2a:68:e7:f3:1c:1d",
            "net9": "1e:c9:66:d5:bc:ae"
        },
        "leaf_1_0_4": {
            "net0": "0e:82:5a:e2:e3:f2",
            "net1": "a2:54:8f:ea:01:c4",
            "net10": "76:1a:33:f0:b8:a8",
            "net11": "e2:10:d4:2d:ed:69",
            "net12": "12:dd:18:10:25:d0",
            "net2": "92:db:d8:a7:58:e4",
            "net3": "7e:96:25:fa:15:ad",
            "net4": "f2:0a:3e:81:d0:0e",
            "net5": "fe:b9:a6:09:00:9a",
            "net6": "06:63:fb:ee:a8:87",
            "net7": "9a:28:89:70:32:99",
            "net8": "0e:2d:66:70:4e:42",
            "net9": "7a:ea:54:81:51:11"
        },
        "leaf_1_0_5": {
            "net0": "ea:c9:3a:00:f2:67",
            "net1": "26:f2:ca:61:6d:19",
            "net10": "fa:28:06:68:e5:9a",
            "net11": "06:cb:61:83:aa:57",
            "net12": "e6:6f:1c:ff:f3:4e",
            "net2": "36:65:07:f7:90:df",
            "net3": "1a:11:66:ef:13:be",
            "net4": "8e:08:41:a9:14:9d",
            "net5": "06:fd:ea:5e:55:de",
            "net6": "32:82:f0:f1:f6:75",
            "net7": "22:1f:26:7c:0a:dd",
            "net8": "5e:1b:00:03:3b:53",
            "net9": "e2:76:8c:e6:77:e4"
        },
        "leaf_1_0_6": {
            "net0": "26:db:10:86:29:14",
            "net1": "ca:64:d3:63:11:82",
            "net10": "fe:96:32:34:2f:f2",
            "net11": "ee:0b:e6:15:70:38",
            "net12": "b2:9a:9e:9d:85:df",
            "net2": "b6:67:c1:89:bc:5e",
            "net3": "d2:a8:1f:65:24:fc",
            "net4": "5e:85:ba:17:80:4c",
            "net5": "56:3f:04:b7:f1:18",
            "net6": "c2:0a:77:8e:39:23",
            "net7": "72:f0:df:8f:1a:70",
            "net8": "4a:ee:29:72:91:06",
            "net9": "a2:3f:ec:ef:5b:f8"
        },
        "leaf_1_0_7": {
            "net0": "36:1f:a4:a5:01:db",
            "net1": "6a:35:51:18:54:67",
            "net10": "16:4a:12:f3:9f:10",
            "net11": "4a:d5:db:00:18:cb",
            "net12": "da:2b:46:75:99:e3",
            "net2": "92:56:c2:82:3b:e6",
            "net3": "4a:a9:e8:45:b7:9f",
            "net4": "a2:c7:e7:77:45:65",
            "net5": "26:5a:5e:32:60:5b",
            "net6": "92:34:90:cb:b1:f3",
            "net7": "22:13:f9:6d:eb:05",
            "net8": "3e:e4:42:84:a0:ca",
            "net9": "a6:2d:52:e9:d5:c0"
        },
        "leaf_1_0_8": {
            "net0": "26:74:28:3f:ce:02",
            "net1": "b2:22:e5:ee:12:ef",
            "net10": "26:62:e9:f7:cd:94",
            "net11": "e6:7e:96:69:a3:bf",
            "net12": "1a:04:59:88:7d:bd",
            "net2": "ae:e7:2d:6d:52:5b",
            "net3": "e6:dd:ce:d0:0e:61",
            "net4": "a2:48:62:95:fa:76",
            "net5": "d6:b4:fd:1d:31:84",
            "net6": "42:78:85:87:01:3e",
            "net7": "66:61:38:ea:4f:24",
            "net8": "82:8e:9c:a2:d2:7a",
            "net9": "96:2d:87:c0:c0:87"
        },
        "leaf_1_0_9": {
            "net0": "42:52:0c:df:80:b3",
            "net1": "0e:e0:a1:82:08:59",
            "net10": "9a:66:7b:96:d4:35",
            "net11": "fa:fd:4f:10:ae:8a",
            "net12": "56:36:8c:9f:b7:60",
            "net2": "22:89:5d:13:c5:2c",
            "net3": "9e:d9:ef:f3:0d:73",
            "net4": "0a:c9:cc:d0:de:c9",
            "net5": "c2:68:d3:02:03:dc",
            "net6": "46:4b:9a:b5:0d:96",
            "net7": "86:14:fe:45:66:36",
            "net8": "a6:4e:7e:0d:55:fb",
            "net9": "0a:a2:9b:d2:af:9a"
        },
        "leaf_2_0_1": {
            "net0": "6a:d0:4a:45:a1:06",
            "net1": "6a:cc:3a:f5:d1:31",
            "net10": "3e:05:88:7d:87:03",
            "net11": "0a:ef:d1:e2:8b:12",
            "net12": "8a:79:b5:8d:bf:52",
            "net2": "e6:9d:1e:a5:f7:7a",
            "net3": "ca:b3:13:c7:78:12",
            "net4": "f2:9c:9f:51:19:71",
            "net5": "ba:c2:92:16:d4:ca",
            "net6": "42:76:52:4e:ed:97",
            "net7": "d6:47:0d:61:b4:54",
            "net8": "c2:af:fa:64:f0:97",
            "net9": "02:9b:37:5f:e9:8e"
        },
        "leaf_2_0_10": {
            "net0": "ca:00:45:34:71:4f",
            "net1": "32:de:a6:c1:0c:5e",
            "net10": "e2:29:9b:2c:cc:bc",
            "net11": "9e:1b:e1:8c:b8:fc",
            "net12": "66:48:b4:cf:e0:60",
            "net2": "4a:41:3a:e9:07:a2",
            "net3": "5a:cc:f0:2c:99:4b",
            "net4": "26:ba:11:3e:71:57",
            "net5": "6a:4f:a5:a2:0f:3e",
            "net6": "82:34:8a:da:d1:f3",
            "net7": "a2:2a:15:d5:35:c2",
            "net8": "e2:5c:60:46:f9:68",
            "net9": "aa:3a:ec:33:4f:b8"
        },
        "leaf_2_0_11": {
            "net0": "92:db:ae:9d:e4:44",
            "net1": "22:bd:8c:fb:02:7d",
            "net10": "26:b1:f4:6d:b1:eb",
            "net11": "3e:8e:d4:05:ef:a5",
            "net12": "5a:c9:f2:bd:04:ba",
            "net2": "16:0b:80:33:b4:87",
            "net3": "da:14:c0:d7:dc:e8",
            "net4": "22:59:dc:48:45:1a",
            "net5": "0a:c1:73:25:ce:ee",
            "net6": "92:68:59:5c:11:5b",
            "net7": "4a:c2:76:2a:f1:79",
            "net8": "a6:e9:fe:b2:73:d8",
            "net9": "2e:ba:d0:b1:f6:87"
        },
        "leaf_2_0_12": {
            "net0": "c2:2f:19:d0:2e:3c",
            "net1": "c2:76:13:90:4a:a2",
            "net10": "5a:d4:eb:b3:28:5a",
            "net11": "2a:cb:65:17:d3:bc",
            "net12": "9e:fe:9f:e1:7b:2a",
            "net2": "c2:73:0c:35:d1:1e",
            "net3": "ce:91:bf:86:45:4a",
            "net4": "02:a4:91:c3:7c:eb",
            "net5": "8a:ee:41:c0:df:0d",
            "net6": "aa:c4:91:2d:91:c7",
            "net7": "46:87:b3:e6:fd:5c",
            "net8": "d2:67:ad:63:71:37",
            "net9": "9a:2e:46:13:fd:dc"
        },
        "leaf_2_0_2": {
            "net0": "4a:f9:8f:1d:ce:4f",
            "net1": "52:07:6c:c8:cc:1e",
            "net10": "16:b4:72:dd:ba:e2",
            "net11": "4a:52:06:8e:42:9a",
            "net12": "9a:9e:ce:50:ab:72",
            "net2": "fa:f8:63:cf:28:c6",
            "net3": "a6:c4:91:40:aa:73",
            "net4": "0a:fb:52:d7:6c:3a",
            "net5": "16:de:d4:d7:92:8a",
            "net6": "5a:94:a9:c1:eb:6e",
            "net7": "ba:a0:4e:f1:89:f9",
            "net8": "ba:8f:68:68:be:9a",
            "net9": "ee:02:8e:e6:53:18"
        },
        "leaf_2_0_3": {
            "net0": "ea:3d:b2:1e:49:73",
            "net1": "8e:d4:88:22:dc:f9",
            "net10": "62:ff:38:f2:51:26",
            "net11": "6a:3c:3c:35:d1:18",
            "net12": "1e:99:04:a0:d9:64",
            "net2": "6e:a0:bf:0b:37:ae",
            "net3": "7e:5c:dc:ca:bd:07",
            "net4": "82:3b:fd:6e:40:e7",
            "net5": "42:c6:da:40:7a:4f",
            "net6": "e6:c6:da:e1:a5:63",
            "net7": "d6:cf:b4:41:3d:e2",
            "net8": "86:3a:7c:68:11:54",
            "net9": "62:78:d3:c4:f5:af"
        },
        "leaf_2_0_4": {
            "net0": "da:3e:e7:41:31:09",
            "net1": "72:1e:f7:e4:6c:4a",
            "net10": "8e:e2:60:d8:65:ee",
            "net11": "f6:39:fa:4c:7f:86",
            "net12": "26:8c:f9:b1:b2:54",
            "net2": "0a:f8:7f:60:e2:49",
            "net3": "aa:ae:c5:1a:45:6c",
            "net4": "96:4f:87:89:71:90",
            "net5": "ce:65:93:5f:ee:18",
            "net6": "76:24:b0:2c:8e:9d",
            "net7": "02:1c:18:1f:93:1e",
            "net8": "a6:ac:b4:6a:65:df",
            "net9": "1a:8e:eb:c0:7f:b0"
        },
        "leaf_2_0_5": {
            "net0": "d2:2b:c4:20:4f:eb",
            "net1": "4a:02:92:99:44:aa",
            "net10": "52:dc:ce:5e:ad:7b",
            "net11": "9a:6e:99:17:cd:14",
            "net12": "ee:fc:a1:0b:a4:c5",
            "net2": "3e:0b:03:5c:32:53",
            "net3": "f6:39:0a:50:25:fd",
            "net4": "96:32:da:dc:e6:bc",
            "net5": "fe:e0:40:2a:f1:f8",
            "net6": "16:32:c9:b1:e4:49",
            "net7": "8e:c4:ad:5a:5a:bf",
            "net8": "b6:ff:77:bf:d7:1b",
            "net9": "76:5d:5c:ba:99:06"
        },
        "leaf_2_0_6": {
            "net0": "ea:38:39:2d:e2:89",
            "net1": "2a:db:2b:9e:ec:42",
            "net10": "3e:6d:77:1a:27:3b",
            "net11": "fe:5b:89:46:92:8c",
            "net12": "a2:70:65:56:e1:0e",
            "net2": "ae:b7:d2:3d:49:e0",
            "net3": "b6:bb:9d:50:a4:4c",
            "net4": "e2:13:f5:30:8c:67",
            "net5": "46:da:32:ad:f4:27",
            "net6": "22:05:cf:d0:91:fc",
            "net7": "92:fb:ba:49:9f:9d",
            "net8": "0e:13:1f:01:a6:20",
            "net9": "da:3c:06:49:31:31"
        },
        "leaf_2_0_7": {
            "net0": "56:92:11:a6:dc:40",
            "net1": "fa:18:ed:c6:68:d1",
            "net10": "a6:7f:67:f2:8f:f6",
            "net11": "3e:ed:34:dc:25:75",
            "net12": "b2:26:11:1f:a6:ae",
            "net2": "42:cb:94:3c:e1:c5",
            "net3": "4a:a3:73:38:ea:33",
            "net4": "32:99:ba:3f:ad:d4",
            "net5": "6e:87:1f:fb:a4:ad",
            "net6": "42:22:c8:57:93:7e",
            "net7": "da:73:41:ec:30:4f",
            "net8": "22:13:43:b2:2a:e7",
            "net9": "4e:1d:ad:f4:81:a2"
        },
        "leaf_2_0_8": {
            "net0": "46:2a:42:65:2a:ff",
            "net1": "9a:b1:16:f2:1a:56",
            "net10": "16:d4:be:ea:b5:45",
            "net11": "7a:0d:45:2c:df:ee",
            "net12": "2e:28:73:7b:75:71",
            "net2": "8a:27:94:1b:f3:b3",
            "net3": "7e:fa:69:7e:01:cf",
            "net4": "92:3c:f2:eb:4e:73",
            "net5": "d6:f6:61:dc:c5:af",
            "net6": "a2:9f:61:55:a1:6b",
            "net7": "c2:a1:2e:b4:92:8b",
            "net8": "e6:3b:3f:db:00:2b",
            "net9": "76:be:59:b4:77:3a"
        },
        "leaf_2_0_9": {
            "net0": "5a:89:64:9f:60:49",
            "net1": "ba:b2:dd:5e:4e:5b",
            "net10": "7a:75:6c:e1:31:94",
            "net11": "b6:c9:6b:03:4b:51",
            "net12": "72:5c:6e:ec:e9:40",
            "net2": "7a:be:c4:d4:05:ee",
            "net3": "8a:33:38:a0:54:2a",
            "net4": "16:50:ee:91:2d:c7",
            "net5": "be:c2:f3:9f:fb:30",
            "net6": "3e:e1:28:27:94:a2",
            "net7": "32:a0:45:0d:11:8d",
            "net8": "ba:3b:31:5d:6e:24",
            "net9": "36:8e:22:45:f2:1a"
        },
        "spine_1_1_1": {
            "net0": "6e:80:39:9c:71:7f",
            "net1": "2e:1e:7a:78:5f:04",
            "net10": "fa:23:e7:6f:75:a9",
            "net11": "d6:5f:52:46:81:7e",
            "net12": "1a:78:65:2e:6b:81",
            "net13": "4e:ac:df:aa:d7:d5",
            "net14": "4e:68:7f:04:47:39",
            "net15": "ce:79:ff:01:67:03",
            "net16": "da:55:1b:29:43:b1",
            "net17": "32:31:97:0c:f1:49",
            "net18": "be:56:3d:35:a8:e9",
            "net19": "c6:77:8a:d9:3e:99",
            "net2": "3a:42:a9:b6:0c:7a",
            "net20": "66:34:9e:64:60:b7",
            "net21": "c2:22:68:47:45:2b",
            "net22": "ee:6d:25:47:c5:fa",
            "net23": "e2:58:74:2f:6c:78",
            "net3": "2a:b1:fd:24:3f:a0",
            "net4": "0a:fd:82:09:a6:3c",
            "net5": "fa:f0:9f:e5:e3:f9",
            "net6": "3a:c9:f4:a7:85:f8",
            "net7": "d2:cf:7c:08:fa:96",
            "net8": "06:8d:f6:fa:95:8e",
            "net9": "6e:ac:08:78:f2:25"
        },
        "spine_1_1_10": {
            "net0": "4a:57:0f:8f:5e:dd",
            "net1": "fa:a5:da:58:a9:02",
            "net10": "b6:00:a6:ad:d9:21",
            "net11": "6e:1f:3e:ed:3d:d7",
            "net12": "8a:07:14:0c:f2:ec",
            "net13": "56:4c:cd:b4:8d:1b",
            "net14": "46:b5:68:43:56:91",
            "net15": "fe:1b:5e:4f:e8:82",
            "net16": "fa:dd:9c:78:1f:25",
            "net17": "d2:f1:6f:3b:1f:df",
            "net18": "e6:85:c8:d9:d9:24",
            "net19": "e6:64:b4:02:f5:4a",
            "net2": "96:49:89:18:8b:29",
            "net20": "2e:d4:c7:ae:3c:85",
            "net21": "f6:d3:2d:a0:75:5a",
            "net22": "da:3c:ce:c0:c1:ba",
            "net23": "a6:31:2e:dc:ca:3f",
            "net3": "0a:e6:b1:9a:cb:0e",
            "net4": "de:c4:6b:10:59:b0",
            "net5": "2e:4a:2c:bc:85:b8",
            "net6": "ca:9d:e4:e2:8e:52",
            "net7": "7e:a3:98:66:11:a8",
            "net8": "ea:58:66:d5:53:d0",
            "net9": "16:5b:2a:e4:ba:54"
        },
        "spine_1_1_11": {
            "net0": "06:d1:73:4e:8f:ad",
            "net1": "aa:0f:62:cc:0e:e5",
            "net10": "3a:98:32:72:3b:5a",
            "net11": "66:7b:df:8e:ea:47",
            "net12": "e6:62:cb:6f:50:a3",
            "net13": "6a:b5:8e:87:d2:f7",
            "net14": "1e:63:47:9b:b2:c7",
            "net15": "32:03:c6:53:e0:1e",
            "net16": "c2:f4:77:9f:a0:6a",
            "net17": "6e:df:64:38:ad:fd",
            "net18": "c2:ba:c2:c5:04:4e",
            "net19": "ea:55:22:f0:68:35",
            "net2": "5a:4d:df:33:3f:48",
            "net20": "1e:9f:7d:c5:d2:73",
            "net21": "b2:bc:42:a8:d3:db",
            "net22": "ea:14:3e:19:09:15",
            "net23": "de:c5:e4:3e:2c:76",
            "net3": "3e:b5:10:9d:07:d4",
            "net4": "12:8a:cc:60:0d:37",
            "net5": "c6:7b:84:ff:a8:15",
            "net6": "fe:90:83:f7:2c:63",
            "net7": "9a:9e:99:08:57:68",
            "net8": "6e:d9:dc:1b:dd:f2",
            "net9": "62:89:dc:53:16:04"
        },
        "spine_1_1_12": {
            "net0": "fa:31:d8:78:55:d5",
            "net1": "12:84:f8:1d:70:87",
            "net10": "82:c5:6c:7b:a9:b4",
            "net11": "c6:34:51:08:1f:f1",
            "net12": "16:26:88:7c:1a:46",
            "net13": "6a:3c:60:fc:e3:b8",
            "net14": "06:bc:07:87:70:ac",
            "net15": "0a:48:a0:b9:f7:ab",
            "net16": "8e:bd:bf:07:20:a0",
            "net17": "5a:7d:a1:67:62:bb",
            "net18": "e2:57:a4:d6:0d:38",
            "net19": "12:6a:4c:89:63:32",
            "net2": "8e:81:83:1a:9e:99",
            "net20": "2e:f3:78:c9:33:d0",
            "net21": "ba:05:f4:61:cb:d1",
            "net22": "be:fb:bf:15:3a:c3",
            "net23": "16:d6:2d:f2:48:6e",
            "net3": "76:b4:1e:1d:97:42",
            "net4": "a6:68:b8:b0:fa:93",
            "net5": "ae:5b:de:bb:3a:8b",
            "net6": "6a:8a:df:5b:47:06",
            "net7": "96:8a:2e:0d:5a:b3",
            "net8": "5a:65:1e:de:8b:3e",
            "net9": "ce:64:e7:26:f3:72"
        },
        "spine_1_1_2": {
            "net0": "1a:ae:dc:27:09:87",
            "net1": "92:06:c2:a8:f3:84",
            "net10": "ca:04:46:a0:be:e3",
            "net11": "fe:93:4c:1a:26:24",
            "net12": "9e:3c:fc:0e:8d:dc",
            "net13": "16:cf:7d:77:2e:3a",
            "net14": "9e:02:39:e0:39:7e",
            "net15": "62:7f:87:80:41:2b",
            "net16": "0a:41:88:1e:dc:c0",
            "net17": "ca:2a:08:5c:9a:c6",
            "net18": "5a:7a:76:fa:2f:f9",
            "net19": "62:3d:95:a3:22:78",
            "net2": "a6:89:63:34:70:57",
            "net20": "c2:d9:7f:80:49:8a",
            "net21": "36:3b:ed:15:cf:63",
            "net22": "8a:7d:9b:fa:e5:42",
            "net23": "d6:28:a8:98:ed:1b",
            "net3": "22:1d:ec:69:a2:e1",
            "net4": "72:f0:b3:8a:f5:c3",
            "net5": "72:e8:e4:7a:93:d1",
            "net6": "52:1b:c3:a1:41:f0",
            "net7": "12:bd:24:a4:21:35",
            "net8": "e2:98:0a:39:ad:26",
            "net9": "9a:d6:e7:95:a2:74"
        },
        "spine_1_1_3": {
            "net0": "c6:b3:e5:e7:cc:23",
            "net1": "a2:ea:4c:75:ee:78",
            "net10": "ba:18:d2:e7:8e:eb",
            "net11": "da:39:60:7c:05:70",
            "net12": "9a:b7:74:18:00:3c",
            "net13": "56:77:78:de:28:03",
            "net14": "32:55:17:e8:e5:93",
            "net15": "de:c4:76:5a:64:a9",
            "net16": "ba:b0:db:df:a1:48",
            "net17": "9a:20:fd:60:4d:f0",
            "net18": "ae:b2:9b:ff:c1:e8",
            "net19": "e6:f1:e3:5b:e7:a3",
            "net2": "ea:77:85:b6:8a:8b",
            "net20": "32:30:1e:4f:27:63",
            "net21": "b6:73:e2:00:c6:61",
            "net22": "12:f1:f0:36:67:76",
            "net23": "f2:25:a6:ee:e0:be",
            "net3": "1e:20:9a:63:21:ee",
            "net4": "86:41:07:f7:95:9c",
            "net5": "56:37:ba:34:ba:33",
            "net6": "8a:27:6f:e4:29:13",
            "net7": "6a:ad:28:5b:59:de",
            "net8": "d2:c8:98:c3:03:88",
            "net9": "92:e6:30:5d:80:a5"
        },
        "spine_1_1_4": {
            "net0": "66:89:12:0e:5a:95",
            "net1": "42:38:56:18:ee:79",
            "net10": "1a:53:50:4f:22:b9",
            "net11": "8e:0e:93:82:a1:40",
            "net12": "76:3b:ce:37:13:95",
            "net13": "c6:22:28:69:71:ab",
            "net14": "0e:85:31:13:45:cd",
            "net15": "0a:e0:ba:fa:32:c5",
            "net16": "d2:3e:c7:69:74:49",
            "net17": "6a:86:93:91:7a:37",
            "net18": "32:76:bc:33:53:1d",
            "net19": "66:c9:61:94:9f:94",
            "net2": "ba:06:50:ec:fc:56",
            "net20": "8e:48:7b:7e:f7:27",
            "net21": "96:73:ce:b4:11:bf",
            "net22": "0a:ce:a8:59:70:20",
            "net23": "92:2e:45:d9:51:88",
            "net3": "02:95:5c:1b:2a:9e",
            "net4": "b6:ee:b5:a8:2b:f9",
            "net5": "fe:b9:f8:5c:59:a0",
            "net6": "be:eb:2a:1f:e5:31",
            "net7": "7a:e7:54:25:b2:22",
            "net8": "96:8b:70:14:43:50",
            "net9": "96:b0:1b:76:1f:1d"
        },
        "spine_1_1_5": {
            "net0": "e6:28:ea:08:f3:65",
            "net1": "ca:af:14:25:db:57",
            "net10": "2e:27:4f:4c:bf:e0",
            "net11": "82:a0:f7:04:50:7c",
            "net12": "0e:86:89:59:fc:49",
            "net13": "86:71:37:5c:da:86",
            "net14": "36:0c:d7:88:7b:45",
            "net15": "46:57:73:ab:c2:13",
            "net16": "f2:0a:ce:32:5b:81",
            "net17": "fe:75:99:cf:5e:0b",
            "net18": "d6:2b:66:29:1f:5b",
            "net19": "9e:25:7a:37:d6:9f",
            "net2": "d2:2c:8d:da:82:4b",
            "net20": "a6:f6:a9:d3:11:b3",
            "net21": "fe:24:91:74:9e:05",
            "net22": "12:57:1f:c2:a3:db",
            "net23": "46:65:39:b0:c7:05",
            "net3": "ea:58:00:23:34:21",
            "net4": "9e:55:8a:3b:1c:6a",
            "net5": "12:be:3c:7a:3b:2d",
            "net6": "b6:32:38:56:a2:c0",
            "net7": "66:7f:f7:a3:d5:10",
            "net8": "82:40:31:64:cb:0f",
            "net9": "62:6b:bb:31:0b:41"
        },
        "spine_1_1_6": {
            "net0": "92:07:d7:4a:8d:5d",
            "net1": "ae:5f:32:43:c7:e0",
            "net10": "8e:89:e4:89:2c:dd",
            "net11": "16:9d:b3:4d:5d:6d",
            "net12": "2e:37:14:6d:c2:b3",
            "net13": "66:4e:24:fb:c0:1a",
            "net14": "0e:a6:8a:0c:8c:d1",
            "net15": "66:d2:a0:5b:31:5a",
            "net16": "22:03:42:c9:20:77",
            "net17": "3e:9d:47:23:30:ee",
            "net18": "d2:cd:da:db:8a:b5",
            "net19": "b2:e9:01:48:c3:52",
            "net2": "22:d8:58:ad:59:1b",
            "net20": "2a:06:82:1a:a1:58",
            "net21": "9e:93:ad:79:ee:33",
            "net22": "1a:5e:7d:db:91:0c",
            "net23": "7e:0b:90:7e:0e:1e",
            "net3": "82:2d:8e:72:d1:1f",
            "net4": "32:c8:cd:e0:b9:8c",
            "net5": "9e:56:68:8b:0b:98",
            "net6": "6a:14:b5:20:f8:72",
            "net7": "4a:b2:33:f8:a0:99",
            "net8": "d2:a5:86:e1:aa:d2",
            "net9": "96:89:e5:0c:83:a7"
        },
        "spine_1_1_7": {
            "net0": "0e:6c:3a:c9:d1:0c",
            "net1": "56:6a:a4:33:da:c4",
            "net10": "66:af:19:76:1c:3d",
            "net11": "72:38:3b:49:93:8a",
            "net12": "d6:27:39:3b:b7:45",
            "net13": "8a:d9:20:64:95:ef",
            "net14": "be:64:3e:77:7d:fd",
            "net15": "2e:a9:06:d6:b7:9a",
            "net16": "6a:fc:20:4a:69:77",
            "net17": "56:61:a3:57:93:29",
            "net18": "2e:8a:82:b2:b5:1b",
            "net19": "82:af:07:7f:ac:27",
            "net2": "4a:a4:f4:1d:9f:a1",
            "net20": "32:c7:62:d3:af:f2",
            "net21": "42:a7:cd:e5:c7:76",
            "net22": "2a:02:0b:3f:04:f7",
            "net23": "52:c5:1b:76:da:16",
            "net3": "fe:c5:f9:ef:99:45",
            "net4": "62:a1:e7:58:a9:86",
            "net5": "76:74:94:f3:cb:29",
            "net6": "aa:b7:21:11:89:9a",
            "net7": "2e:41:3a:0f:d4:ef",
            "net8": "4e:c7:34:01:5f:d7",
            "net9": "82:86:70:af:91:af"
        },
        "spine_1_1_8": {
            "net0": "f6:8e:ec:3a:7f:24",
            "net1": "4e:81:c5:41:b5:f1",
            "net10": "fe:67:a9:dd:04:a4",
            "net11": "4a:71:6b:28:9e:d7",
            "net12": "c2:ff:5e:b9:8a:31",
            "net13": "da:0a:03:fc:47:ea",
            "net14": "8a:f1:ce:47:53:07",
            "net15": "52:ee:fc:e6:75:16",
            "net16": "ca:6b:7a:d1:eb:6e",
            "net17": "02:bc:f6:63:94:79",
            "net18": "ca:38:bc:4c:54:b0",
            "net19": "f2:ee:25:34:24:6e",
            "net2": "aa:a8:a9:61:e3:62",
            "net20": "f2:d1:36:16:99:7d",
            "net21": "72:24:44:84:85:1f",
            "net22": "ce:b7:85:07:61:f7",
            "net23": "7a:40:99:20:f9:c1",
            "net3": "7a:9c:c3:db:83:18",
            "net4": "56:00:53:a7:b4:1f",
            "net5": "e2:33:56:63:ce:8a",
            "net6": "ca:38:76:fa:57:58",
            "net7": "12:06:eb:75:72:e6",
            "net8": "3a:a9:06:a0:09:28",
            "net9": "c2:54:c4:73:9b:f7"
        },
        "spine_1_1_9": {
            "net0": "0e:3d:a6:a6:ef:f6",
            "net1": "7a:96:26:50:c9:72",
            "net10": "a2:b9:2a:19:6d:34",
            "net11": "8e:4b:87:05:02:d2",
            "net12": "f6:27:da:81:30:d9",
            "net13": "b6:98:78:e2:30:b3",
            "net14": "c2:e8:1c:d6:89:85",
            "net15": "2a:b7:87:5b:15:94",
            "net16": "2e:a4:77:3d:c2:09",
            "net17": "ba:8a:e4:29:b5:3c",
            "net18": "6a:f4:fb:38:bf:43",
            "net19": "ba:76:f0:9d:72:37",
            "net2": "22:5b:14:89:44:50",
            "net20": "ca:a0:36:51:e1:6a",
            "net21": "22:03:11:43:b8:43",
            "net22": "a6:b4:84:c5:ed:27",
            "net23": "0a:88:18:0f:0b:c3",
            "net3": "02:6b:f2:09:f7:fc",
            "net4": "f2:a7:57:06:67:cb",
            "net5": "2e:80:0e:4d:77:0d",
            "net6": "16:4f:33:df:8d:71",
            "net7": "d2:ec:c2:a8:92:c1",
            "net8": "7e:de:1b:3f:3f:8a",
            "net9": "4a:e6:67:5d:fc:b3"
        },
        "spine_2_1_1": {
            "net0": "3e:18:e9:a6:6d:a2",
            "net1": "5a:77:06:83:22:db",
            "net10": "8a:26:ee:91:bd:c5",
            "net11": "ee:7c:ca:ae:85:89",
            "net12": "b2:8d:1a:07:ff:df",
            "net13": "0a:6f:0e:1e:d5:5b",
            "net14": "5e:e1:c5:53:d1:36",
            "net15": "66:45:65:3b:ce:54",
            "net16": "72:ce:95:0f:5e:2d",
            "net17": "4e:13:d0:74:b7:d8",
            "net18": "1a:2b:46:4f:41:9e",
            "net19": "0a:f9:c0:43:61:af",
            "net2": "32:47:61:fc:67:49",
            "net20": "76:26:b1:af:f7:cf",
            "net21": "32:6b:25:66:ff:a4",
            "net22": "1e:be:f5:dc:f3:8a",
            "net23": "7e:62:15:23:d2:d0",
            "net3": "d2:df:fa:f8:c2:3f",
            "net4": "46:c1:c8:01:ba:52",
            "net5": "2e:54:4c:81:37:f7",
            "net6": "ee:11:5a:73:53:a0",
            "net7": "12:cc:6c:bb:28:d8",
            "net8": "7a:8f:0b:36:85:a0",
            "net9": "3a:a9:95:22:77:ac"
        },
        "spine_2_1_10": {
            "net0": "e2:a7:30:2a:9c:0d",
            "net1": "ea:79:5d:8b:82:3f",
            "net10": "ba:c8:5b:9c:1c:f2",
            "net11": "3a:28:28:ff:14:4f",
            "net12": "52:34:9e:c1:26:8d",
            "net13": "12:67:38:f5:ce:80",
            "net14": "72:00:4b:2f:75:1a",
            "net15": "26:d7:ca:1e:ea:d3",
            "net16": "de:46:55:9a:f8:e7",
            "net17": "e6:3d:9c:c8:ee:ac",
            "net18": "be:7a:88:8d:d5:82",
            "net19": "06:13:de:2e:5a:44",
            "net2": "5e:c9:a2:bc:f9:ae",
            "net20": "66:a2:67:01:60:76",
            "net21": "1e:19:70:de:3b:02",
            "net22": "c6:f5:08:52:e5:fa",
            "net23": "56:e8:ca:4e:6b:7c",
            "net3": "4a:22:b3:b5:28:1a",
            "net4": "ea:5f:87:c3:2f:4b",
            "net5": "16:9c:01:31:62:2b",
            "net6": "46:b5:79:b4:e5:ff",
            "net7": "ae:fb:05:32:f0:69",
            "net8": "a2:4b:2b:79:df:ca",
            "net9": "b2:72:9f:ef:e0:23"
        },
        "spine_2_1_11": {
            "net0": "a2:d4:5f:a9:d5:de",
            "net1": "32:8b:3d:3b:05:14",
            "net10": "a2:b6:d4:94:de:37",
            "net11": "82:c0:3a:76:4c:07",
            "net12": "42:f6:98:a9:d4:77",
            "net13": "26:97:a4:27:af:b0",
            "net14": "6a:39:1e:02:14:1b",
            "net15": "3e:12:fc:28:c7:f0",
            "net16": "c2:db:dc:38:08:51",
            "net17": "12:d9:3c:1c:12:20",
            "net18": "e6:35:17:88:9c:cb",
            "net19": "42:a8:4b:fe:70:33",
            "net2": "2e:37:5e:81:9b:d9",
            "net20": "e6:cd:d0:33:e6:86",
            "net21": "3e:56:84:be:b8:39",
            "net22": "16:ad:c8:cc:3d:b5",
            "net23": "ba:73:42:5e:8d:15",
            "net3": "f2:a8:9d:64:b9:41",
            "net4": "b6:4f:c7:a0:ea:fa",
            "net5": "6e:98:c7:d8:9a:ee",
            "net6": "9e:d5:dc:14:cc:33",
            "net7": "52:bb:e6:eb:55:93",
            "net8": "9e:d1:de:46:cb:aa",
            "net9": "1e:c7:1d:82:03:48"
        },
        "spine_2_1_12": {
            "net0": "1e:cb:d5:2f:b0:b4",
            "net1": "d6:30:72:6a:60:21",
            "net10": "86:38:ba:f6:ec:4e",
            "net11": "22:4b:26:14:ab:e9",
            "net12": "0e:b7:16:80:f1:14",
            "net13": "ea:4e:af:c3:3d:68",
            "net14": "f2:4d:47:b0:d3:e9",
            "net15": "3e:2d:c5:0e:7b:bc",
            "net16": "22:8c:4e:ca:a4:85",
            "net17": "8a:b3:46:76:cf:29",
            "net18": "f6:7f:0a:8d:7b:e9",
            "net19": "ee:fd:27:8c:8d:39",
            "net2": "0e:41:8a:65:be:ae",
            "net20": "1e:e6:db:33:af:cc",
            "net21": "fe:1a:06:ee:b5:4d",
            "net22": "6e:07:3f:b4:00:90",
            "net23": "a6:f8:0f:56:8e:58",
            "net3": "6a:52:0f:e0:44:9b",
            "net4": "0e:0e:04:cb:5f:bd",
            "net5": "8e:33:db:24:16:c9",
            "net6": "06:27:9b:80:93:87",
            "net7": "1e:a8:00:64:b1:83",
            "net8": "2a:aa:e9:6c:81:d5",
            "net9": "0e:8c:5a:65:e1:54"
        },
        "spine_2_1_2": {
            "net0": "1a:85:f5:b6:bb:a3",
            "net1": "b2:77:a5:33:fb:97",
            "net10": "a2:04:a8:84:50:23",
            "net11": "3e:77:3a:44:e7:68",
            "net12": "b2:20:89:dc:d8:69",
            "net13": "8e:5f:a1:45:5b:04",
            "net14": "ae:01:99:11:93:e7",
            "net15": "fa:1d:ba:55:2f:c3",
            "net16": "be:b2:18:2f:24:36",
            "net17": "32:15:b1:a6:2a:9e",
            "net18": "1a:0a:d6:09:af:8f",
            "net19": "06:28:24:b3:82:cc",
            "net2": "8a:6a:aa:f6:6c:dd",
            "net20": "2e:74:bc:5f:bd:8c",
            "net21": "be:d4:38:05:9a:06",
            "net22": "d6:06:02:c4:62:95",
            "net23": "96:98:09:7d:4a:7f",
            "net3": "56:0c:34:5e:74:da",
            "net4": "ae:8a:f5:61:87:6f",
            "net5": "ea:0b:47:44:7a:f1",
            "net6": "92:d5:98:1f:33:73",
            "net7": "92:a6:47:6c:88:14",
            "net8": "a6:e6:4a:5a:b7:01",
            "net9": "da:98:85:76:77:c7"
        },
        "spine_2_1_3": {
            "net0": "36:a9:dc:fe:a5:65",
            "net1": "aa:2a:a7:45:6e:5f",
            "net10": "de:89:61:96:d0:df",
            "net11": "62:48:75:18:95:c8",
            "net12": "02:f0:63:de:41:c8",
            "net13": "16:d9:a0:b6:cf:4c",
            "net14": "62:03:3d:84:f8:18",
            "net15": "62:d5:4d:25:18:0f",
            "net16": "8e:e1:92:28:99:32",
            "net17": "66:06:42:b4:09:35",
            "net18": "6e:33:9c:3f:e0:f6",
            "net19": "c6:48:69:3d:de:d8",
            "net2": "82:2b:ad:67:8b:f6",
            "net20": "ea:14:73:bd:ab:24",
            "net21": "f2:50:da:c7:c3:18",
            "net22": "ea:e9:c5:9d:8c:61",
            "net23": "92:ed:ae:e5:1b:61",
            "net3": "b2:b4:48:f1:8c:f6",
            "net4": "fe:93:f3:50:4b:26",
            "net5": "2e:6f:19:84:68:01",
            "net6": "ae:ff:87:7d:de:77",
            "net7": "1a:f0:cb:f6:1b:ba",
            "net8": "5e:1c:72:58:9c:7c",
            "net9": "22:1c:f1:3d:bb:ba"
        },
        "spine_2_1_4": {
            "net0": "ca:d6:ef:18:f2:97",
            "net1": "36:f7:64:d4:dc:11",
            "net10": "a6:f3:3c:d3:b2:ce",
            "net11": "1e:f2:2c:ec:43:02",
            "net12": "7a:b9:35:97:db:38",
            "net13": "16:5c:94:2b:55:0f",
            "net14": "56:fe:bc:6e:91:d0",
            "net15": "6a:3c:f1:ce:a5:53",
            "net16": "36:f9:3d:f2:3f:c7",
            "net17": "42:4b:d9:62:aa:01",
            "net18": "d2:a0:a1:a3:16:57",
            "net19": "6a:68:29:c4:ec:cd",
            "net2": "62:a2:cb:6b:33:04",
            "net20": "7a:5d:a1:8b:55:4b",
            "net21": "f6:36:4a:07:33:91",
            "net22": "de:75:b6:ec:6a:de",
            "net23": "9e:50:41:9e:aa:c5",
            "net3": "ce:49:2e:3b:2e:7a",
            "net4": "16:fa:22:56:0f:12",
            "net5": "1a:c1:5b:e4:76:3d",
            "net6": "ba:26:eb:4a:de:e9",
            "net7": "76:63:f6:77:73:1f",
            "net8": "8e:3d:7c:d3:49:91",
            "net9": "3e:b4:e8:8f:e6:2c"
        },
        "spine_2_1_5": {
            "net0": "da:7f:46:16:24:f2",
            "net1": "8e:07:92:f2:77:51",
            "net10": "e6:31:9b:86:c6:4c",
            "net11": "46:e1:ee:8d:55:29",
            "net12": "e6:34:61:b4:41:c7",
            "net13": "02:00:b3:c8:d6:2f",
            "net14": "92:9d:90:27:ec:f6",
            "net15": "22:6a:85:08:f6:4e",
            "net16": "8a:3b:4d:f3:c8:5c",
            "net17": "ca:ce:cd:9b:72:1d",
            "net18": "3e:42:5f:0a:3b:92",
            "net19": "ae:e8:fd:2c:94:86",
            "net2": "96:71:50:42:7d:6e",
            "net20": "ee:24:45:07:a3:f6",
            "net21": "d6:fc:52:d2:81:b5",
            "net22": "c2:f2:c5:74:d1:25",
            "net23": "26:96:68:83:8b:77",
            "net3": "ea:f4:46:ab:6d:76",
            "net4": "7e:be:68:48:86:c4",
            "net5": "1a:44:9c:20:d6:fc",
            "net6": "4a:1a:aa:09:8b:c3",
            "net7": "92:27:36:dc:b1:af",
            "net8": "ba:ee:20:3a:05:82",
            "net9": "f2:07:9e:77:f9:31"
        },
        "spine_2_1_6": {
            "net0": "96:9c:be:b4:74:ac",
            "net1": "ce:fd:41:fd:d6:b8",
            "net10": "ba:fc:90:b0:c7:c7",
            "net11": "2a:f9:5f:0d:40:a2",
            "net12": "9e:55:78:01:74:27",
            "net13": "a2:66:5b:13:35:6d",
            "net14": "2a:02:f3:6c:37:d5",
            "net15": "ae:ea:85:68:9d:b8",
            "net16": "86:4a:61:5e:88:91",
            "net17": "9e:ca:ca:53:5e:29",
            "net18": "26:d5:19:4b:2b:7a",
            "net19": "4a:e6:e2:97:86:be",
            "net2": "b2:22:41:02:33:6f",
            "net20": "7a:be:26:99:73:74",
            "net21": "76:0f:df:82:ba:36",
            "net22": "46:36:ba:03:8d:95",
            "net23": "9e:bc:00:35:f6:c9",
            "net3": "4a:1d:c3:b8:27:ee",
            "net4": "92:24:71:73:08:55",
            "net5": "72:47:9e:fd:55:e9",
            "net6": "02:79:0a:a4:5c:e9",
            "net7": "be:8c:1e:cc:19:ec",
            "net8": "3e:18:e1:c8:96:e9",
            "net9": "b6:b3:35:82:eb:58"
        },
        "spine_2_1_7": {
            "net0": "e2:93:3e:0e:b3:c2",
            "net1": "fa:1b:b5:b3:bc:bf",
            "net10": "f6:20:e2:3d:03:26",
            "net11": "a6:74:c6:8a:1d:7e",
            "net12": "96:e7:38:7b:4e:04",
            "net13": "12:cf:5a:8b:83:80",
            "net14": "9e:15:56:b9:b3:81",
            "net15": "6a:b5:27:51:b1:36",
            "net16": "5e:bc:50:40:d6:cf",
            "net17": "ae:f7:46:bc:69:1f",
            "net18": "82:a9:7c:8f:3e:84",
            "net19": "46:72:52:80:8b:92",
            "net2": "ce:10:98:1d:ab:90",
            "net20": "42:47:73:72:17:1c",
            "net21": "fa:36:bc:af:ed:a0",
            "net22": "46:7e:0c:ef:dc:48",
            "net23": "d6:8e:31:a2:a3:02",
            "net3": "6a:77:71:77:8c:b8",
            "net4": "42:3a:a6:44:a7:72",
            "net5": "42:84:d4:4f:99:f8",
            "net6": "e2:c0:d3:64:38:c6",
            "net7": "12:3d:ee:96:7a:ef",
            "net8": "ca:bc:92:a0:94:c3",
            "net9": "9e:6f:15:64:99:18"
        },
        "spine_2_1_8": {
            "net0": "ae:86:47:7e:a1:24",
            "net1": "fa:6d:41:2f:f9:66",
            "net10": "56:cf:8f:32:02:37",
            "net11": "3a:84:07:7f:05:b8",
            "net12": "3e:2e:6c:8f:f1:e0",
            "net13": "76:1f:9d:32:a4:82",
            "net14": "aa:44:04:67:31:57",
            "net15": "ce:ba:e3:4d:55:4e",
            "net16": "16:62:52:3e:02:67",
            "net17": "36:e6:66:cd:ac:bd",
            "net18": "3e:2c:99:10:18:a2",
            "net19": "1a:0b:01:49:98:36",
            "net2": "22:99:e5:56:bd:ea",
            "net20": "72:17:3b:38:65:b6",
            "net21": "26:7e:2e:64:40:3a",
            "net22": "92:34:6c:e2:d2:f7",
            "net23": "6a:ea:64:63:71:0f",
            "net3": "56:4c:ce:43:f1:cd",
            "net4": "f6:44:0b:f0:80:cd",
            "net5": "b2:23:02:e2:78:88",
            "net6": "c2:fc:14:6b:45:4d",
            "net7": "5a:9e:c9:ac:89:4e",
            "net8": "0a:4c:a7:6f:a3:eb",
            "net9": "26:6e:c5:39:ed:81"
        },
        "spine_2_1_9": {
            "net0": "66:f1:b6:a7:a5:24",
            "net1": "66:71:73:59:d4:07",
            "net10": "de:1a:c0:f4:0c:91",
            "net11": "32:8b:cf:65:fe:51",
            "net12": "26:c2:33:a8:f6:fd",
            "net13": "82:94:da:36:80:51",
            "net14": "da:f4:72:3f:93:c6",
            "net15": "5a:ef:10:69:17:b4",
            "net16": "1a:09:70:e5:70:ca",
            "net17": "3e:3a:72:33:c2:0c",
            "net18": "42:f2:74:2b:76:13",
            "net19": "92:96:d8:1c:1f:d7",
            "net2": "ea:59:e8:ec:b5:6e",
            "net20": "8e:66:ba:6f:65:2a",
            "net21": "a6:d8:b5:fc:23:26",
            "net22": "22:b1:d8:a8:48:8e",
            "net23": "36:cb:1e:a8:0e:b5",
            "net3": "a6:cf:6e:16:5d:b1",
            "net4": "f2:25:c9:48:d8:30",
            "net5": "16:93:21:44:99:ac",
            "net6": "aa:b9:25:98:31:80",
            "net7": "26:ba:c9:ec:bb:bb",
            "net8": "ae:95:a4:93:8d:dd",
            "net9": "c6:0a:21:bb:5f:c3"
        },
        "tof_1_2_1": {
            "net0": "a6:44:de:c8:f0:a5",
            "net1": "76:9b:b3:34:bd:2e",
            "net10": "0a:14:d5:3e:49:36",
            "net11": "02:0e:aa:14:29:93",
            "net12": "da:b1:b8:ef:6c:41",
            "net13": "a2:7c:80:13:16:e3",
            "net14": "3e:24:e5:eb:0c:3f",
            "net15": "36:1d:9f:f8:cd:5f",
            "net16": "ce:31:55:3f:ca:8c",
            "net17": "be:5e:a8:9d:36:37",
            "net18": "76:99:39:a8:99:ec",
            "net19": "36:16:f4:bc:e8:a7",
            "net2": "62:bf:fd:7e:9e:4e",
            "net20": "86:fe:bf:b6:59:6b",
            "net21": "d2:58:f3:41:47:37",
            "net22": "c2:9b:db:49:ae:cd",
            "net23": "e6:74:13:43:10:00",
            "net3": "4a:d3:d0:b6:6b:1e",
            "net4": "6e:b0:fc:1d:0c:50",
            "net5": "42:0d:bc:d8:25:2b",
            "net6": "f6:05:23:3d:03:cc",
            "net7": "f2:3a:3b:66:20:69",
            "net8": "02:dd:7d:81:db:cd",
            "net9": "da:f7:cd:46:ac:ac"
        },
        "tof_1_2_10": {
            "net0": "3e:2a:40:ec:a6:52",
            "net1": "be:78:cf:28:b9:71",
            "net10": "c6:a8:89:83:af:1a",
            "net11": "9a:30:5b:55:f0:f5",
            "net12": "ba:ce:fd:a7:ab:9c",
            "net13": "5a:8b:21:9e:c3:71",
            "net14": "c2:35:f7:c7:a3:f3",
            "net15": "fe:c6:2b:c3:d3:14",
            "net16": "fe:f3:d1:fc:3a:1e",
            "net17": "ca:96:0e:3b:80:c5",
            "net18": "1a:23:4a:ef:10:bf",
            "net19": "ba:3f:ea:1c:72:41",
            "net2": "ca:ba:20:ae:12:73",
            "net20": "42:53:0d:a8:10:20",
            "net21": "76:78:fc:be:31:b9",
            "net22": "fa:99:73:3e:98:65",
            "net23": "56:f7:f2:cc:3f:c4",
            "net3": "92:84:77:3d:b9:58",
            "net4": "da:54:45:1b:41:63",
            "net5": "ca:a4:4b:a9:2e:1a",
            "net6": "96:c2:f2:1c:2e:43",
            "net7": "86:e2:83:89:0b:db",
            "net8": "3e:78:c8:0d:77:93",
            "net9": "42:78:22:51:d8:d8"
        },
        "tof_1_2_11": {
            "net0": "36:f8:42:77:a2:50",
            "net1": "4e:f6:bb:e6:fb:cb",
            "net10": "26:51:fe:85:a1:d8",
            "net11": "c2:b0:d7:9f:d2:74",
            "net12": "0a:7a:4a:d3:e0:0c",
            "net13": "06:a4:db:1b:e1:1d",
            "net14": "22:08:f6:61:2f:02",
            "net15": "02:e6:6a:38:a6:2b",
            "net16": "b2:ab:af:b2:b3:68",
            "net17": "66:26:31:1d:ff:ee",
            "net18": "e2:f6:f5:13:27:f4",
            "net19": "92:89:36:62:e2:5b",
            "net2": "0a:f1:38:08:1a:32",
            "net20": "ea:d1:c2:c0:e0:2a",
            "net21": "86:62:b0:d2:a8:ca",
            "net22": "2e:7a:7e:2f:ef:c1",
            "net23": "5a:e1:4c:f7:14:ec",
            "net3": "c2:b4:a4:44:b3:6a",
            "net4": "56:a8:8d:08:14:fc",
            "net5": "8e:a9:3c:84:20:22",
            "net6": "5e:29:5d:bc:17:f0",
            "net7": "fa:ee:0a:b9:1f:a7",
            "net8": "06:10:34:10:6e:2f",
            "net9": "4e:4a:11:2e:1a:fd"
        },
        "tof_1_2_12": {
            "net0": "76:ee:be:ce:f4:20",
            "net1": "8a:3c:94:d8:8f:47",
            "net10": "06:98:53:4c:ce:3d",
            "net11": "c6:22:21:2d:bf:7d",
            "net12": "5a:e3:a3:d0:8a:d7",
            "net13": "36:d9:37:6a:dc:35",
            "net14": "2e:cc:fa:2a:e7:34",
            "net15": "8a:3e:87:f0:cc:81",
            "net16": "02:ed:bd:f2:63:e3",
            "net17": "ee:94:16:af:0d:5d",
            "net18": "a2:99:3a:82:d3:50",
            "net19": "e2:5b:b3:4f:c8:1b",
            "net2": "2e:c9:98:16:a0:37",
            "net20": "52:56:1f:1c:ff:b8",
            "net21": "ca:ce:c7:b6:c6:0b",
            "net22": "3e:b4:c0:b1:2b:f4",
            "net23": "a6:c0:4e:c9:cf:84",
            "net3": "72:92:81:92:15:0e",
            "net4": "7e:81:da:eb:35:e8",
            "net5": "ee:76:dc:9b:d5:2b",
            "net6": "b2:91:c2:2d:56:75",
            "net7": "0e:8a:81:ef:bb:90",
            "net8": "b6:ab:c2:1d:db:7a",
            "net9": "52:41:34:c6:ca:ba"
        },
        "tof_1_2_2": {
            "net0": "56:6d:78:51:1e:f6",
            "net1": "fa:9b:ef:3b:26:89",
            "net10": "ae:48:1c:8b:69:43",
            "net11": "86:ea:2d:4c:37:2b",
            "net12": "5e:97:02:fe:40:c4",
            "net13": "6a:0a:ad:05:76:37",
            "net14": "76:51:79:82:15:fc",
            "net15": "be:e4:53:83:05:bf",
            "net16": "0e:3c:86:75:7f:44",
            "net17": "ae:2e:2f:6d:e5:32",
            "net18": "5a:01:11:51:b6:ed",
            "net19": "de:85:c4:63:17:97",
            "net2": "82:ff:1c:73:c7:86",
            "net20": "52:1f:6c:ae:04:ad",
            "net21": "c6:cd:5d:62:7f:e0",
            "net22": "be:41:ce:ff:47:64",
            "net23": "82:7c:af:11:07:68",
            "net3": "3e:55:94:5d:b5:bf",
            "net4": "e6:94:79:67:b9:a3",
            "net5": "fa:74:a8:72:96:10",
            "net6": "c2:26:59:aa:91:ea",
            "net7": "a2:49:71:b4:7a:76",
            "net8": "ca:b2:9e:3e:3f:2d",
            "net9": "ae:47:8c:65:16:1b"
        },
        "tof_1_2_3": {
            "net0": "d6:cb:5e:ad:05:db",
            "net1": "7a:bc:da:65:99:bd",
            "net10": "9e:b7:43:f3:81:ae",
            "net11": "9a:2e:a3:58:b1:e8",
            "net12": "3a:38:cc:f4:fc:5f",
            "net13": "36:3a:3b:4e:9c:57",
            "net14": "92:d3:6c:00:94:d3",
            "net15": "86:b9:5e:89:40:e0",
            "net16": "ba:4a:89:8b:08:8a",
            "net17": "92:50:18:a2:bd:b7",
            "net18": "96:1c:4b:42:e5:22",
            "net19": "26:55:ee:1d:94:ac",
            "net2": "8e:2f:21:56:96:f0",
            "net20": "46:4c:21:45:c4:fc",
            "net21": "7a:e9:00:a8:fe:72",
            "net22": "b2:73:38:91:fd:ef",
            "net23": "76:3e:76:a5:5b:88",
            "net3": "fe:8b:e6:4a:ee:23",
            "net4": "42:a3:57:ec:4a:cf",
            "net5": "fe:c6:da:e0:62:3e",
            "net6": "b6:c0:7c:23:9b:8d",
            "net7": "4a:3b:d3:44:20:42",
            "net8": "1e:83:cc:75:34:28",
            "net9": "d6:f0:73:4f:89:e8"
        },
        "tof_1_2_4": {
            "net0": "22:44:b9:37:40:4c",
            "net1": "82:6a:55:87:08:f4",
            "net10": "4e:4c:ba:80:bc:e7",
            "net11": "4a:4b:f1:b4:5f:ec",
            "net12": "8a:3e:3c:c8:10:5e",
            "net13": "ce:dd:27:99:21:d6",
            "net14": "fa:32:0d:05:a9:aa",
            "net15": "ba:8b:71:00:4d:bb",
            "net16": "4e:0f:56:57:31:75",
            "net17": "16:75:93:e8:6d:57",
            "net18": "4e:64:20:3b:59:87",
            "net19": "f2:f4:2b:56:04:75",
            "net2": "76:61:65:05:ab:e1",
            "net20": "4e:aa:b8:a7:27:35",
            "net21": "a6:76:fc:ed:6b:10",
            "net22": "aa:3e:5d:3b:c8:02",
            "net23": "9a:52:74:a7:90:31",
            "net3": "3e:5f:ea:9e:4e:47",
            "net4": "be:16:e2:20:f6:ad",
            "net5": "fa:7a:cb:b2:3e:9b",
            "net6": "a6:2e:00:d3:6f:ee",
            "net7": "86:c2:c4:92:51:64",
            "net8": "2a:06:19:8e:3a:ff",
            "net9": "ea:5a:fc:6c:39:3f"
        },
        "tof_1_2_5": {
            "net0": "62:3f:24:c9:20:60",
            "net1": "4a:83:b1:ef:df:b9",
            "net10": "2a:95:74:0f:6b:17",
            "net11": "42:87:08:44:72:50",
            "net12": "ea:0c:f6:99:c8:69",
            "net13": "2a:97:60:16:17:e6",
            "net14": "6e:41:c0:de:ef:bf",
            "net15": "02:89:1d:b8:8d:6c",
            "net16": "be:bf:d3:7d:24:e5",
            "net17": "82:9f:81:f0:a5:8b",
            "net18": "a2:e2:83:5c:37:96",
            "net19": "be:15:35:b4:51:76",
            "net2": "02:67:c3:e9:94:eb",
            "net20": "d2:8d:e3:21:50:a8",
            "net21": "62:f7:06:24:f9:ef",
            "net22": "de:8e:33:0b:76:f5",
            "net23": "ee:86:79:e0:f5:36",
            "net3": "fe:21:b1:4f:db:96",
            "net4": "ee:12:bf:75:61:5a",
            "net5": "96:1e:00:97:10:3a",
            "net6": "ca:9f:dc:52:be:df",
            "net7": "fe:9b:f2:c2:5b:ac",
            "net8": "6e:80:0e:cd:e9:0f",
            "net9": "76:21:1e:9c:b3:a4"
        },
        "tof_1_2_6": {
            "net0": "9e:51:49:aa:5f:80",
            "net1": "d6:c6:cd:51:5e:cb",
            "net10": "a2:16:43:4f:fc:69",
            "net11": "06:dc:db:3e:10:77",
            "net12": "a6:f0:f3:02:66:10",
            "net13": "32:dc:b8:4f:80:5b",
            "net14": "36:73:bd:9e:f4:3b",
            "net15": "16:08:e2:da:45:01",
            "net16": "ea:f7:d6:b9:ef:96",
            "net17": "26:80:a5:2d:69:93",
            "net18": "7a:ab:73:2f:d1:8a",
            "net19": "96:5b:db:7c:54:19",
            "net2": "a6:c3:d8:59:7d:f6",
            "net20": "da:13:eb:e4:12:46",
            "net21": "4a:bb:0e:2a:95:40",
            "net22": "be:a5:22:29:5f:0d",
            "net23": "aa:43:00:9c:85:ae",
            "net3": "ce:f2:81:00:34:bd",
            "net4": "26:76:85:cf:d2:cc",
            "net5": "d6:a0:92:ae:41:e6",
            "net6": "fa:db:0b:f8:5d:16",
            "net7": "12:2e:ea:02:7c:1e",
            "net8": "ca:45:d1:a2:77:58",
            "net9": "da:d4:d4:18:78:3d"
        },
        "tof_1_2_7": {
            "net0": "b6:2b:bc:ba:5c:37",
            "net1": "52:9e:46:00:f4:c3",
            "net10": "b6:0e:54:c9:6f:e5",
            "net11": "ba:8a:e9:d0:b1:83",
            "net12": "96:c3:55:1d:20:dc",
            "net13": "5a:fb:0d:a6:5e:de",
            "net14": "f6:fa:40:5f:1b:dc",
            "net15": "66:00:df:97:f4:4d",
            "net16": "a2:83:ca:6a:fc:ac",
            "net17": "7e:85:f2:07:5f:bb",
            "net18": "7a:10:57:fd:34:3b",
            "net19": "0a:a5:b9:c2:fa:84",
            "net2": "16:d4:bf:db:8c:aa",
            "net20": "b2:d0:32:99:3b:19",
            "net21": "de:fb:6b:fa:73:63",
            "net22": "16:6e:5d:84:9a:b3",
            "net23": "8e:6b:e7:ce:a5:86",
            "net3": "6a:18:1a:0c:68:bd",
            "net4": "06:8f:f9:b5:c7:e2",
            "net5": "36:a6:a4:17:11:60",
            "net6": "da:d7:df:91:73:74",
            "net7": "f6:80:5b:5f:9d:12",
            "net8": "96:78:62:ca:c5:8a",
            "net9": "ba:cb:24:7e:60:0c"
        },
        "tof_1_2_8": {
            "net0": "8e:00:fa:2e:10:70",
            "net1": "9e:89:43:0d:eb:69",
            "net10": "ae:72:fc:15:32:eb",
            "net11": "62:28:82:cf:6f:ff",
            "net12": "de:3b:f0:93:a8:bc",
            "net13": "52:5b:5b:10:a3:da",
            "net14": "2a:00:85:1c:cd:3f",
            "net15": "fe:f5:6a:5a:50:78",
            "net16": "96:7a:e5:ee:52:43",
            "net17": "e6:cd:11:28:3d:d7",
            "net18": "4a:ed:89:a9:ee:5a",
            "net19": "2e:4a:45:09:42:e2",
            "net2": "16:69:06:e8:5a:46",
            "net20": "ba:7c:b1:9e:cf:88",
            "net21": "7a:2a:ed:19:7b:8d",
            "net22": "d6:68:6b:0a:6b:60",
            "net23": "7a:29:28:72:e1:1f",
            "net3": "56:45:47:94:8d:d9",
            "net4": "b2:2e:b5:c7:d7:01",
            "net5": "22:3b:d4:2e:6a:57",
            "net6": "fa:52:79:da:8d:7e",
            "net7": "0a:4c:b3:ea:fe:06",
            "net8": "82:ed:3c:b5:bc:b2",
            "net9": "62:b7:e3:17:d3:48"
        },
        "tof_1_2_9": {
            "net0": "ee:5a:86:e8:95:d7",
            "net1": "f2:cd:1f:56:e1:cd",
            "net10": "ea:84:e8:28:33:17",
            "net11": "b6:bf:f2:82:a5:8c",
            "net12": "ca:cf:73:ed:e5:59",
            "net13": "d6:31:76:ee:36:6b",
            "net14": "f6:db:4f:c1:3a:3b",
            "net15": "aa:47:a9:b9:6d:69",
            "net16": "22:b0:7e:ee:78:57",
            "net17": "da:52:28:7d:6a:9d",
            "net18": "9a:93:8f:bf:72:11",
            "net19": "66:ed:76:e9:25:dc",
            "net2": "8e:8f:c7:6d:59:7c",
            "net20": "fe:0f:a4:d2:c5:7d",
            "net21": "0e:86:76:38:43:1e",
            "net22": "8e:eb:91:8b:a3:65",
            "net23": "e6:26:ba:d4:0d:d6",
            "net3": "22:d3:4e:fc:63:71",
            "net4": "66:b7:3f:0d:75:76",
            "net5": "e2:c5:45:40:59:45",
            "net6": "e2:cb:69:61:bd:56",
            "net7": "26:1c:a0:ba:1c:74",
            "net8": "72:6c:ad:41:d5:32",
            "net9": "4a:7d:e8:e3:dd:76"
        }
    },
    "failed_machine": "leaf_1_0_1",
    "failed_interfaces": [
        "net0"
    ],
    "failure_time": {
        "leaf_1_0_1": 1636564431.941905,
        "leaf_1_0_10": 1636564431.9525132,
        "leaf_1_0_11": 1636564431.959958,
        "leaf_1_0_12": 1636564431.9755976,
        "leaf_1_0_2": 1636564431.9903605,
        "leaf_1_0_3": 1636564432.2833176,
        "leaf_1_0_4": 1636564432.0203662,
        "leaf_1_0_5": 1636564432.3096447,
        "leaf_1_0_6": 1636564431.9388456,
        "leaf_1_0_7": 1636564432.2295592,
        "leaf_1_0_8": 1636564431.9739244,
        "leaf_1_0_9": 1636564431.9857597,
        "leaf_2_0_1": 1636564431.9949124,
        "leaf_2_0_10": 1636564432.0105677,
        "leaf_2_0_11": 1636564432.0205352,
        "leaf_2_0_12": 1636564432.0381675,
        "leaf_2_0_2": 1636564432.0440989,
        "leaf_2_0_3": 1636564432.056491,
        "leaf_2_0_4": 1636564432.0672898,
        "leaf_2_0_5": 1636564432.0883005,
        "leaf_2_0_6": 1636564432.3719747,
        "leaf_2_0_7": 1636564432.108079,
        "leaf_2_0_8": 1636564432.1208947,
        "leaf_2_0_9": 1636564432.1377697,
        "spine_1_1_1": 1636564432.0487862,
        "spine_1_1_10": 1636564432.0581076,
        "spine_1_1_11": 1636564432.0684721,
        "spine_1_1_12": 1636564432.0875828,
        "spine_1_1_2": 1636564432.099823,
        "spine_1_1_3": 1636564432.1121495,
        "spine_1_1_4": 1636564432.3967023,
        "spine_1_1_5": 1636564432.1345224,
        "spine_1_1_6": 1636564432.416441,
        "spine_1_1_7": 1636564432.151088,
        "spine_1_1_8": 1636564432.1595173,
        "spine_1_1_9": 1636564432.1694007,
        "spine_2_1_1": 1636564432.1786625,
        "spine_2_1_10": 1636564432.1910336,
        "spine_2_1_11": 1636564432.4725718,
        "spine_2_1_12": 1636564432.20918,
        "spine_2_1_2": 1636564432.145732,
        "spine_2_1_3": 1636564432.1606417,
        "spine_2_1_4": 1636564432.1703935,
        "spine_2_1_5": 1636564432.1784525,
        "spine_2_1_6": 1636564432.1890957,
        "spine_2_1_7": 1636564432.195887,
        "spine_2_1_8": 1636564432.2047205,
        "spine_2_1_9": 1636564432.4909618,
        "tof_1_2_1": 1636564432.220803,
        "tof_1_2_10": 1636564432.2309144,
        "tof_1_2_11": 1636564432.2425163,
        "tof_1_2_12": 1636564432.2546928,
        "tof_1_2_2": 1636564432.2719522,
        "tof_1_2_3": 1636564432.2830133,
        "tof_1_2_4": 1636564432.564609,
        "tof_1_2_5": 1636564432.3046706,
        "tof_1_2_6": 1636564432.2294981,
        "tof_1_2_7": 1636564432.2413867,
        "tof_1_2_8": 1636564432.2516315,
        "tof_1_2_9": 1636564432.2710924
    }
}