{
    "k_leaf": 10,
    "k_top": 10,
    "redundancy_factor": 5,
    "is_k8s": true,
    "machine_mac_addresses": {
        "leaf_1_0_1": {
            "net0": "aa:0b:8a:c1:99:69",
            "net1": "7a:64:75:0a:3d:8b",
            "net10": "f6:27:71:2c:05:65",
            "net2": "ca:5b:11:ef:62:3f",
            "net3": "a6:e3:66:20:30:13",
            "net4": "0e:c0:e8:41:8d:ce",
            "net5": "5e:46:db:4e:8f:12",
            "net6": "5e:f3:03:3a:3f:5c",
            "net7": "aa:fa:3a:60:19:5b",
            "net8": "8a:0f:c0:ae:c7:83",
            "net9": "9e:cc:b0:02:65:bd"
        },
        "leaf_1_0_10": {
            "net0": "36:3c:41:84:28:b9",
            "net1": "da:5c:13:4f:6b:b7",
            "net10": "f6:f0:1c:58:f8:a0",
            "net2": "5e:0b:04:bf:34:5e",
            "net3": "3a:a1:81:89:ab:4b",
            "net4": "3e:b6:c4:97:fc:13",
            "net5": "3e:a2:23:d8:ef:0f",
            "net6": "0e:23:c9:4f:d0:bf",
            "net7": "36:dd:8f:58:0d:70",
            "net8": "46:f7:d0:88:bb:5e",
            "net9": "9e:f4:a1:ea:c8:cd"
        },
        "leaf_1_0_2": {
            "net0": "ba:17:e0:66:73:5e",
            "net1": "7a:73:3b:68:be:c6",
            "net10": "66:13:5c:a5:f2:d5",
            "net2": "06:78:35:1f:84:cc",
            "net3": "5a:11:5c:a3:c5:98",
            "net4": "8e:e2:b4:e3:d9:ac",
            "net5": "82:de:7a:a4:17:32",
            "net6": "86:6d:25:ee:8a:62",
            "net7": "0a:83:38:ba:a5:6b",
            "net8": "66:66:ad:fd:ee:f7",
            "net9": "86:b1:c1:12:c7:5c"
        },
        "leaf_1_0_3": {
            "net0": "c6:a2:65:ac:e8:bf",
            "net1": "ae:93:d3:79:21:d8",
            "net10": "3a:1f:37:83:18:6c",
            "net2": "86:bb:29:c1:08:82",
            "net3": "1e:90:02:4f:e8:02",
            "net4": "06:74:4d:5c:a8:2a",
            "net5": "8a:33:46:fc:59:d0",
            "net6": "0a:2c:53:26:57:37",
            "net7": "9e:4e:28:22:3d:5b",
            "net8": "76:f7:30:a2:5d:90",
            "net9": "6e:b9:12:d3:4d:a6"
        },
        "leaf_1_0_4": {
            "net0": "86:0e:fd:27:5c:3d",
            "net1": "02:86:45:24:95:a2",
            "net10": "86:37:60:5f:43:fc",
            "net2": "9e:17:f6:6d:52:b6",
            "net3": "4e:28:87:12:0f:a7",
            "net4": "ba:29:bc:92:2f:4d",
            "net5": "8a:d0:90:58:a0:a0",
            "net6": "c6:0e:18:cc:ec:6a",
            "net7": "66:e5:32:a7:cc:51",
            "net8": "8e:11:d4:9e:46:cb",
            "net9": "b2:7c:ce:0b:9a:86"
        },
        "leaf_1_0_5": {
            "net0": "e6:be:ee:80:d2:7a",
            "net1": "be:46:8d:3c:be:b9",
            "net10": "fe:77:9b:67:8f:5e",
            "net2": "86:62:40:e2:76:bb",
            "net3": "16:28:ea:fa:00:3b",
            "net4": "6e:a4:34:ad:08:37",
            "net5": "ee:84:9d:8f:14:b0",
            "net6": "12:b2:77:65:b0:cd",
            "net7": "c2:26:8a:0d:4b:7f",
            "net8": "1a:14:cd:9d:d5:5e",
            "net9": "fe:1f:8f:1f:4b:c2"
        },
        "leaf_1_0_6": {
            "net0": "0e:5b:84:af:9f:3f",
            "net1": "2a:fb:ab:d8:7e:1c",
            "net10": "62:19:91:8e:0a:41",
            "net2": "d6:36:e3:cc:77:47",
            "net3": "8a:cf:da:ed:1e:c8",
            "net4": "d6:2d:a9:d6:eb:98",
            "net5": "82:6e:78:b2:f0:c1",
            "net6": "02:5f:aa:9c:73:ae",
            "net7": "3a:72:bc:74:3d:ff",
            "net8": "72:5a:0b:b9:84:d1",
            "net9": "42:de:91:b6:a3:3b"
        },
        "leaf_1_0_7": {
            "net0": "fe:95:b9:d5:fb:91",
            "net1": "6e:9d:4e:d1:91:d4",
            "net10": "da:02:57:a4:29:73",
            "net2": "d6:c7:68:64:03:c8",
            "net3": "36:f6:93:b0:63:08",
            "net4": "16:c1:27:c5:41:99",
            "net5": "12:49:30:e5:20:3c",
            "net6": "76:06:f4:c2:92:ee",
            "net7": "32:4c:dd:78:bf:3e",
            "net8": "12:b1:4d:9a:73:f9",
            "net9": "9e:ce:30:fe:c2:22"
        },
        "leaf_1_0_8": {
            "net0": "de:ac:5b:8d:5e:97",
            "net1": "4e:a0:02:af:f8:f1",
            "net10": "2e:0e:5e:f6:29:42",
            "net2": "d2:9f:8a:8d:ad:22",
            "net3": "1e:7a:6b:ec:aa:d6",
            "net4": "8a:ff:d4:cc:e7:fe",
            "net5": "0a:47:1b:aa:86:1d",
            "net6": "4e:43:a2:f6:c4:5a",
            "net7": "1e:9a:59:ff:57:4d",
            "net8": "62:ee:f8:13:1c:50",
            "net9": "c2:4e:94:4e:ff:05"
        },
        "leaf_1_0_9": {
            "net0": "0e:fd:61:da:70:eb",
            "net1": "be:48:40:73:fe:8c",
            "net10": "22:fe:f2:8c:07:b1",
            "net2": "da:d4:e0:b5:a1:52",
            "net3": "92:44:96:2c:29:74",
            "net4": "7e:f7:c4:fa:92:ee",
            "net5": "02:90:54:3d:c9:37",
            "net6": "66:10:85:23:d2:dc",
            "net7": "b2:f7:35:a9:9d:a6",
            "net8": "66:37:c4:34:10:3c",
            "net9": "2a:fe:cb:f7:72:b4"
        },
        "leaf_2_0_1": {
            "net0": "26:b7:2c:4e:96:ba",
            "net1": "fe:6d:e4:00:67:bc",
            "net10": "6e:d8:d7:f3:17:c2",
            "net2": "e2:31:c9:25:cc:01",
            "net3": "22:e3:64:68:76:ea",
            "net4": "1e:80:6a:f0:07:a3",
            "net5": "2a:84:b9:48:4f:15",
            "net6": "4e:12:14:11:04:07",
            "net7": "7a:a8:e5:7a:ca:cc",
            "net8": "22:4f:60:55:e1:3f",
            "net9": "22:93:4b:0c:bc:91"
        },
        "leaf_2_0_10": {
            "net0": "66:e7:33:8b:6d:5c",
            "net1": "c2:e4:1c:35:0d:3d",
            "net10": "9a:7f:ba:15:57:b5",
            "net2": "02:01:0a:36:34:02",
            "net3": "3a:0b:0c:c5:a3:f3",
            "net4": "fa:85:c3:ed:b9:cb",
            "net5": "5e:ab:fa:f4:f5:f7",
            "net6": "f2:3b:95:e2:44:21",
            "net7": "5e:41:f0:54:c7:d0",
            "net8": "46:9a:25:cc:64:53",
            "net9": "e6:34:62:ee:83:6b"
        },
        "leaf_2_0_2": {
            "net0": "d2:20:31:02:ff:96",
            "net1": "72:eb:ad:dc:dc:ed",
            "net10": "b2:a0:93:83:63:e4",
            "net2": "ee:47:90:9f:a8:8c",
            "net3": "9a:9e:5d:7a:28:1e",
            "net4": "a2:e4:0f:fd:a8:93",
            "net5": "5a:99:f3:23:d2:0f",
            "net6": "fa:e8:92:3e:55:c9",
            "net7": "1e:40:0b:c6:80:5b",
            "net8": "52:a8:3a:b7:73:45",
            "net9": "6e:09:16:69:2d:25"
        },
        "leaf_2_0_3": {
            "net0": "26:fb:09:ba:d7:7c",
            "net1": "fe:e5:42:ac:84:a2",
            "net10": "66:be:cf:6f:73:92",
            "net2": "e2:d1:42:63:a6:cb",
            "net3": "6e:1e:3d:93:b4:f4",
            "net4": "2a:a9:2f:b5:3d:bf",
            "net5": "e2:12:96:d6:de:6b",
            "net6": "6a:6e:ba:5e:dc:2b",
            "net7": "ce:ee:e0:3f:e1:9b",
            "net8": "26:7e:8d:0a:48:ea",
            "net9": "8a:40:fc:13:19:74"
        },
        "leaf_2_0_4": {
            "net0": "52:9e:1e:83:36:06",
            "net1": "56:03:a8:1c:f4:7b",
            "net10": "72:ff:72:9d:21:57",
            "net2": "2a:de:21:cd:ba:0a",
            "net3": "6a:a4:dd:d4:17:d9",
            "net4": "22:1e:c0:84:26:3b",
            "net5": "4a:a6:50:1d:93:6b",
            "net6": "96:3c:ff:98:8e:0b",
            "net7": "3e:cd:93:14:21:56",
            "net8": "72:84:3a:20:b2:2c",
            "net9": "e6:8e:82:d2:39:b2"
        },
        "leaf_2_0_5": {
            "net0": "66:f8:d3:20:fa:94",
            "net1": "e6:6a:4f:e8:8d:09",
            "net10": "1a:90:47:dd:d6:93",
            "net2": "92:53:b9:7f:a7:18",
            "net3": "1e:df:25:9a:33:11",
            "net4": "4e:a2:92:c0:71:fd",
            "net5": "06:82:03:e6:f5:b8",
            "net6": "da:f3:02:c4:85:63",
            "net7": "ee:b0:dd:6e:36:28",
            "net8": "72:f4:e9:6d:c4:1c",
            "net9": "52:21:1e:d5:c4:35"
        },
        "leaf_2_0_6": {
            "net0": "aa:e0:46:39:02:d3",
            "net1": "6e:70:dd:7f:00:62",
            "net10": "e2:84:66:eb:e5:69",
            "net2": "2e:da:f0:31:29:26",
            "net3": "3a:b4:fb:47:ce:89",
            "net4": "4a:01:a3:fa:29:67",
            "net5": "be:2b:9a:2e:0f:7a",
            "net6": "26:19:2f:03:31:0e",
            "net7": "e6:ac:b4:73:90:27",
            "net8": "aa:5d:5e:a2:f8:86",
            "net9": "1e:8c:3e:1b:d5:6e"
        },
        "leaf_2_0_7": {
            "net0": "4e:bd:6e:5c:d2:7a",
            "net1": "ca:74:3d:b9:9e:cb",
            "net10": "e2:13:2e:b7:07:10",
            "net2": "ea:10:28:d8:6b:e6",
            "net3": "22:d6:cf:62:ad:07",
            "net4": "46:28:cf:db:d5:76",
            "net5": "f6:f5:5d:4d:a6:e8",
            "net6": "c6:47:6c:ef:6a:81",
            "net7": "c6:d5:46:f8:9c:08",
            "net8": "f2:58:84:b0:df:33",
            "net9": "46:20:84:0d:4f:41"
        },
        "leaf_2_0_8": {
            "net0": "ee:ed:9e:51:62:d9",
            "net1": "56:e2:e9:38:86:5d",
            "net10": "ce:3f:a2:81:70:c8",
            "net2": "ba:49:96:26:8c:b9",
            "net3": "32:4a:09:77:1d:d6",
            "net4": "0e:92:7b:c9:87:ff",
            "net5": "2a:fa:4a:60:6d:45",
            "net6": "4e:ae:0a:1b:1b:a7",
            "net7": "be:e7:de:3f:7f:10",
            "net8": "12:65:03:45:f9:82",
            "net9": "fe:7f:f9:6f:f4:97"
        },
        "leaf_2_0_9": {
            "net0": "66:c1:d0:ca:73:fc",
            "net1": "a2:96:b5:e6:1f:04",
            "net10": "82:6f:a0:54:45:a9",
            "net2": "12:56:6c:ed:12:14",
            "net3": "3a:d0:d3:d2:9b:42",
            "net4": "26:82:af:dd:3d:79",
            "net5": "7e:1a:a8:46:39:fc",
            "net6": "ca:f3:a2:9c:4d:a1",
            "net7": "62:af:8f:e1:77:21",
            "net8": "c6:80:ca:03:f4:69",
            "net9": "4a:37:06:07:e2:ac"
        },
        "leaf_3_0_1": {
            "net0": "aa:84:3b:bf:c4:7e",
            "net1": "de:b5:8f:96:a2:18",
            "net10": "b2:98:ea:10:18:51",
            "net2": "8a:63:73:96:0c:18",
            "net3": "1a:11:d9:b0:7d:b2",
            "net4": "d2:f3:18:f9:c0:b3",
            "net5": "52:99:3d:26:80:63",
            "net6": "6e:b1:20:ef:7e:89",
            "net7": "5a:ab:c5:68:cf:14",
            "net8": "16:4c:d7:39:d8:e0",
            "net9": "5e:a8:02:2b:48:02"
        },
        "leaf_3_0_10": {
            "net0": "1e:0f:51:2c:24:73",
            "net1": "ba:6c:89:72:05:fe",
            "net10": "a2:3b:0b:6b:54:5b",
            "net2": "3a:46:16:53:f6:c6",
            "net3": "a6:98:7c:a0:95:75",
            "net4": "1e:d2:9b:51:7e:9f",
            "net5": "76:90:bf:61:cb:d5",
            "net6": "b6:25:79:d4:c3:59",
            "net7": "c6:46:48:af:2c:4b",
            "net8": "06:62:e7:e4:29:49",
            "net9": "96:5a:87:fb:28:48"
        },
        "leaf_3_0_2": {
            "net0": "2a:f1:76:f7:9a:21",
            "net1": "aa:f5:78:e7:ba:2d",
            "net10": "02:f1:62:d7:7f:6a",
            "net2": "92:af:60:40:27:2a",
            "net3": "ae:39:64:aa:45:13",
            "net4": "36:d4:6e:d5:bd:53",
            "net5": "7e:96:82:e5:96:00",
            "net6": "ee:b4:e4:22:1d:c8",
            "net7": "ca:7d:82:47:04:ff",
            "net8": "a6:76:66:8b:be:fd",
            "net9": "f6:92:ef:f9:1d:5b"
        },
        "leaf_3_0_3": {
            "net0": "46:a2:2b:74:80:3f",
            "net1": "c6:a1:a0:9d:c3:3c",
            "net10": "da:77:cc:e7:fb:58",
            "net2": "8e:80:8a:40:1c:17",
            "net3": "2a:8b:6b:ad:c3:8e",
            "net4": "8e:02:b1:b0:f3:8c",
            "net5": "ee:cf:6f:cd:60:94",
            "net6": "be:09:bc:c1:54:72",
            "net7": "de:68:e2:40:6b:96",
            "net8": "42:ae:e4:78:01:72",
            "net9": "aa:bc:68:14:56:eb"
        },
        "leaf_3_0_4": {
            "net0": "3a:b4:85:da:25:dc",
            "net1": "52:83:ac:97:a4:d6",
            "net10": "2e:9b:e3:9b:f9:20",
            "net2": "3a:be:cf:1a:f1:29",
            "net3": "7a:27:2d:9d:a3:90",
            "net4": "7a:9d:54:28:01:cf",
            "net5": "0e:9d:8c:2b:40:df",
            "net6": "ce:9e:7b:58:39:4c",
            "net7": "16:bb:bf:d6:fb:d6",
            "net8": "5a:8c:3d:3f:a8:09",
            "net9": "52:e1:bb:35:70:87"
        },
        "leaf_3_0_5": {
            "net0": "26:f3:45:3f:9b:3b",
            "net1": "7e:08:38:cf:0a:3a",
            "net10": "9e:c2:c5:a3:8c:8d",
            "net2": "ee:0c:13:62:4f:f0",
            "net3": "02:10:e3:03:60:fe",
            "net4": "66:f1:d2:64:87:d5",
            "net5": "a2:24:2b:07:fa:19",
            "net6": "02:96:83:33:b3:60",
            "net7": "ce:22:d0:3f:43:e9",
            "net8": "82:76:c7:c9:98:2d",
            "net9": "92:87:4e:2b:72:90"
        },
        "leaf_3_0_6": {
            "net0": "ea:d8:1d:9b:35:36",
            "net1": "b2:85:6d:f8:3b:c1",
            "net10": "26:4c:56:1f:96:40",
            "net2": "be:d7:fa:61:01:59",
            "net3": "aa:8b:99:0f:ed:d8",
            "net4": "e6:23:a3:40:6d:d7",
            "net5": "26:60:43:c9:d8:97",
            "net6": "16:7c:68:4e:39:c7",
            "net7": "2e:2a:f8:51:a2:f2",
            "net8": "b2:70:8f:7d:77:76",
            "net9": "d2:ba:07:91:72:2a"
        },
        "leaf_3_0_7": {
            "net0": "4a:3a:d0:53:ac:e7",
            "net1": "02:ff:5e:2e:69:34",
            "net10": "ee:e6:4b:69:d6:58",
            "net2": "26:8c:74:20:a3:d3",
            "net3": "ce:d9:d4:75:1e:7f",
            "net4": "86:21:5c:73:b5:81",
            "net5": "42:f0:b4:b0:e5:a5",
            "net6": "6e:4f:4e:11:23:54",
            "net7": "3a:63:97:fa:33:4d",
            "net8": "36:96:49:a0:53:66",
            "net9": "fe:62:8d:20:31:97"
        },
        "leaf_3_0_8": {
            "net0": "42:26:59:61:97:19",
            "net1": "ce:f8:cd:f2:15:bc",
            "net10": "ea:25:f3:b5:d5:2d",
            "net2": "ee:5a:2b:71:b2:95",
            "net3": "5a:72:44:f7:1e:b4",
            "net4": "12:82:a9:88:0a:16",
            "net5": "5e:eb:e9:b2:d9:a4",
            "net6": "c6:bc:58:43:ae:74",
            "net7": "06:08:cf:5d:0f:ab",
            "net8": "ea:0a:b8:85:03:d3",
            "net9": "72:7d:37:d2:47:b6"
        },
        "leaf_3_0_9": {
            "net0": "0a:dd:aa:24:53:de",
            "net1": "7e:0d:d7:59:e3:09",
            "net10": "fe:ab:06:13:fa:f4",
            "net2": "de:73:7e:f9:50:fc",
            "net3": "8a:ff:29:1a:2a:6d",
            "net4": "3a:41:19:30:52:92",
            "net5": "7e:32:ee:5d:df:0f",
            "net6": "72:98:38:d8:56:d7",
            "net7": "26:a2:8b:5e:4c:6b",
            "net8": "7a:f7:91:da:10:e6",
            "net9": "8a:f7:49:82:1a:81"
        },
        "leaf_4_0_1": {
            "net0": "ca:82:95:bf:b8:88",
            "net1": "8a:56:79:c8:6c:90",
            "net10": "7a:2e:e0:60:21:32",
            "net2": "b6:a4:c8:8d:a6:0a",
            "net3": "7e:60:a2:0b:94:6b",
            "net4": "5e:b3:04:c9:ac:c7",
            "net5": "ae:ac:0a:82:e8:a7",
            "net6": "6a:5a:50:49:22:57",
            "net7": "62:ae:3a:93:97:88",
            "net8": "fa:66:63:15:de:83",
            "net9": "0e:44:1c:2a:31:71"
        },
        "leaf_4_0_10": {
            "net0": "e6:d7:bc:6f:b2:31",
            "net1": "6a:25:66:c3:88:e9",
            "net10": "56:27:b0:e8:0d:6e",
            "net2": "56:19:06:9c:11:7c",
            "net3": "de:85:bb:63:da:aa",
            "net4": "f2:34:76:e2:d6:f9",
            "net5": "26:b9:da:f3:76:65",
            "net6": "86:64:36:0a:31:c5",
            "net7": "4e:b5:a5:81:2e:01",
            "net8": "8e:57:8f:1c:4f:26",
            "net9": "ae:f4:74:0b:30:06"
        },
        "leaf_4_0_2": {
            "net0": "f6:40:1c:d8:ff:3c",
            "net1": "4a:23:a7:d2:f5:f0",
            "net10": "f6:07:4d:ed:f8:8e",
            "net2": "12:ef:0f:46:20:1c",
            "net3": "ee:8d:2c:a7:44:e4",
            "net4": "8e:62:e0:e5:be:81",
            "net5": "a2:2b:7c:ce:f6:f8",
            "net6": "56:1e:e8:24:10:ad",
            "net7": "82:78:eb:79:10:7c",
            "net8": "b2:a2:f0:8e:6f:47",
            "net9": "9e:35:3b:e3:95:e6"
        },
        "leaf_4_0_3": {
            "net0": "be:d4:69:2f:65:e1",
            "net1": "b6:3f:88:d7:1d:42",
            "net10": "06:26:b1:86:a3:19",
            "net2": "ca:21:09:57:1a:32",
            "net3": "4a:80:92:06:f5:1e",
            "net4": "fe:7a:69:e5:4a:94",
            "net5": "e2:a9:26:23:04:29",
            "net6": "3e:46:98:7b:b0:45",
            "net7": "86:83:e2:4f:f7:8e",
            "net8": "2a:2f:31:b2:96:ea",
            "net9": "8a:5d:70:3b:4b:16"
        },
        "leaf_4_0_4": {
            "net0": "96:2f:c3:69:0f:e9",
            "net1": "b6:0b:96:1b:ac:80",
            "net10": "5e:78:52:ea:2a:b8",
            "net2": "de:11:3e:4e:8d:d2",
            "net3": "52:19:7d:80:3d:0b",
            "net4": "de:ff:9a:8f:8b:04",
            "net5": "62:9d:22:92:09:8d",
            "net6": "da:4c:e0:36:ba:ca",
            "net7": "e6:f9:12:5a:37:38",
            "net8": "fe:f2:7a:b6:88:a0",
            "net9": "3a:c7:7b:d0:18:74"
        },
        "leaf_4_0_5": {
            "net0": "32:43:94:9a:ed:19",
            "net1": "96:36:b3:a4:00:c8",
            "net10": "1a:b9:0a:ba:ed:60",
            "net2": "2e:a8:10:f8:86:0c",
            "net3": "2e:d5:27:03:16:3d",
            "net4": "2a:06:c7:1a:c9:4a",
            "net5": "2a:c5:93:07:b3:bc",
            "net6": "f2:05:55:e8:61:b7",
            "net7": "ae:54:9e:d4:32:5c",
            "net8": "4a:88:29:43:c1:28",
            "net9": "be:b5:f0:11:3f:d6"
        },
        "leaf_4_0_6": {
            "net0": "ee:bd:77:e5:02:9e",
            "net1": "56:53:32:d8:bc:5c",
            "net10": "62:3b:1e:6f:bd:ab",
            "net2": "72:dc:b9:6e:6c:e8",
            "net3": "b6:a1:d5:36:a3:46",
            "net4": "8e:20:71:3d:1f:59",
            "net5": "62:48:b0:0f:23:72",
            "net6": "da:d7:cf:b8:f7:f9",
            "net7": "b2:97:80:5e:74:64",
            "net8": "4e:01:ab:fb:b9:8a",
            "net9": "62:d8:3e:8e:1b:74"
        },
        "leaf_4_0_7": {
            "net0": "1e:fa:17:a4:71:6a",
            "net1": "9a:29:e2:c8:af:8b",
            "net10": "82:0d:fc:f9:22:14",
            "net2": "02:ea:3e:96:c7:d4",
            "net3": "ae:4f:82:dc:3d:e0",
            "net4": "1e:80:3b:f1:a2:5d",
            "net5": "9a:7d:19:b7:bf:e4",
            "net6": "ae:73:03:95:18:e5",
            "net7": "5a:cf:f3:af:07:96",
            "net8": "6a:5a:9a:13:97:a4",
            "net9": "32:e2:32:e3:b4:0e"
        },
        "leaf_4_0_8": {
            "net0": "96:b6:cb:bf:c8:73",
            "net1": "6a:23:af:be:6b:36",
            "net10": "86:1b:d1:7f:26:d9",
            "net2": "2e:e5:81:da:4d:ab",
            "net3": "42:e8:58:54:5d:23",
            "net4": "ea:38:5f:9a:58:68",
            "net5": "ae:38:ba:94:a1:19",
            "net6": "e2:76:ab:4d:37:14",
            "net7": "5a:17:fb:c0:c9:9a",
            "net8": "92:99:68:a9:d9:67",
            "net9": "2e:8b:45:9e:b2:be"
        },
        "leaf_4_0_9": {
            "net0": "8a:fd:df:59:15:91",
            "net1": "3e:ba:c1:56:cc:91",
            "net10": "52:ab:37:f1:eb:69",
            "net2": "82:b1:61:84:8d:2e",
            "net3": "86:c4:5c:0e:86:0f",
            "net4": "6a:08:5a:6d:0b:c4",
            "net5": "26:d9:1a:7c:fc:25",
            "net6": "6e:10:be:ee:29:38",
            "net7": "c6:c1:c6:0b:49:5a",
            "net8": "5e:86:4c:13:cb:bc",
            "net9": "3e:2e:14:d4:5a:6b"
        },
        "spine_1_1_1": {
            "net0": "0a:f1:56:64:65:89",
            "net1": "62:56:39:a4:08:c1",
            "net10": "4e:51:d6:6b:e1:31",
            "net11": "8e:1b:c7:8b:63:12",
            "net12": "ca:6d:96:a3:04:23",
            "net13": "22:ab:04:fe:11:91",
            "net14": "ce:90:6c:5a:13:5d",
            "net15": "7e:e9:7d:91:e4:3d",
            "net16": "26:1f:f2:db:e0:10",
            "net17": "0a:07:ea:25:b9:78",
            "net18": "f6:8a:27:bd:9d:88",
            "net19": "ca:5c:bb:c0:a6:2e",
            "net2": "0e:bc:79:0b:ee:b3",
            "net3": "2e:5f:00:cc:e8:45",
            "net4": "12:bd:ae:9b:9b:bf",
            "net5": "1a:3e:44:49:62:dc",
            "net6": "7e:81:c6:51:f9:b8",
            "net7": "9e:16:a1:2b:19:36",
            "net8": "72:22:dd:6c:d0:29",
            "net9": "6e:31:37:c7:a3:02"
        },
        "spine_1_1_10": {
            "net0": "be:4e:50:ed:1f:68",
            "net1": "66:8a:2b:1d:76:9f",
            "net10": "c6:61:f5:fb:05:21",
            "net11": "fe:7b:7a:2e:8b:76",
            "net12": "06:4e:ee:64:f3:a3",
            "net13": "16:f5:bb:48:8f:4e",
            "net14": "c2:f9:98:ee:a2:4e",
            "net15": "e6:2b:7f:66:45:06",
            "net16": "d2:87:df:a7:d8:32",
            "net17": "16:42:85:a9:1d:ee",
            "net18": "7a:e7:47:3b:37:33",
            "net19": "e2:c1:a6:eb:9e:a8",
            "net2": "b2:ab:75:3f:f2:49",
            "net3": "4e:db:6f:3e:f9:79",
            "net4": "6a:07:7a:2b:40:14",
            "net5": "9a:c4:af:91:d3:69",
            "net6": "06:28:d6:5e:81:df",
            "net7": "66:70:50:e5:4f:af",
            "net8": "e2:3d:5e:16:b4:83",
            "net9": "3e:ea:c5:9c:43:79"
        },
        "spine_1_1_2": {
            "net0": "d2:68:1a:96:21:a2",
            "net1": "ae:fc:3b:84:a0:75",
            "net10": "1e:4a:f2:dd:6b:6b",
            "net11": "e2:5d:fb:dc:ff:45",
            "net12": "52:e9:a9:c9:75:2e",
            "net13": "ee:e6:a0:11:be:c2",
            "net14": "76:bd:bb:87:9e:ef",
            "net15": "0a:a2:bd:40:a1:45",
            "net16": "ee:5b:e4:08:d8:fc",
            "net17": "ea:05:af:56:1b:2b",
            "net18": "5e:66:b1:5d:60:1f",
            "net19": "2e:8c:92:62:bc:0d",
            "net2": "b6:6f:50:67:a5:d3",
            "net3": "5e:4a:d9:41:1c:a6",
            "net4": "c6:24:7f:79:44:70",
            "net5": "0a:59:81:fe:f9:d3",
            "net6": "fe:1d:19:67:cf:49",
            "net7": "c6:0e:29:d1:71:a3",
            "net8": "1e:44:e5:78:b5:48",
            "net9": "62:e5:89:ec:93:0e"
        },
        "spine_1_1_3": {
            "net0": "1a:b5:a5:e3:be:04",
            "net1": "9e:42:4b:43:13:9a",
            "net10": "2a:9d:e1:6e:91:c9",
            "net11": "ba:e3:eb:a6:a2:78",
            "net12": "02:27:3a:ed:57:8e",
            "net13": "8a:fb:8d:ea:7a:0c",
            "net14": "b6:05:a3:30:ce:d3",
            "net15": "5e:03:b9:70:f3:b3",
            "net16": "8e:5f:27:a1:bc:af",
            "net17": "7e:3c:51:fa:46:41",
            "net18": "52:b4:e6:72:1a:3b",
            "net19": "aa:e6:4b:be:65:6c",
            "net2": "ea:c0:99:e2:88:15",
            "net3": "32:a0:5b:fd:27:1f",
            "net4": "22:4b:fe:9f:69:20",
            "net5": "72:13:87:df:37:fc",
            "net6": "b6:a0:ce:6d:f8:58",
            "net7": "ae:df:9e:06:10:91",
            "net8": "ae:17:80:2f:39:25",
            "net9": "56:dc:0c:53:1d:5e"
        },
        "spine_1_1_4": {
            "net0": "4e:11:9b:63:53:89",
            "net1": "7e:8d:cf:fc:fc:8f",
            "net10": "ca:4a:17:31:56:61",
            "net11": "c2:c6:b2:70:89:09",
            "net12": "5e:9b:5f:99:3e:7c",
            "net13": "82:6d:5d:42:1b:7f",
            "net14": "fe:76:09:df:91:12",
            "net15": "d6:ec:d9:7e:3c:04",
            "net16": "f6:29:36:38:e7:f5",
            "net17": "96:b8:f2:55:f7:9a",
            "net18": "1e:28:1b:5e:23:ce",
            "net19": "9e:a1:01:2f:97:9f",
            "net2": "46:10:7e:08:40:44",
            "net3": "0e:bb:6e:7b:5d:bd",
            "net4": "e6:56:a7:d1:5c:94",
            "net5": "8a:4e:42:61:bc:4a",
            "net6": "22:41:19:05:fb:57",
            "net7": "8a:ff:b7:4d:7f:23",
            "net8": "32:1e:19:76:9c:a9",
            "net9": "f6:4e:68:d7:41:43"
        },
        "spine_1_1_5": {
            "net0": "36:95:fe:28:22:70",
            "net1": "02:84:c1:78:f9:b3",
            "net10": "9e:a4:39:08:52:4e",
            "net11": "02:f2:20:01:af:66",
            "net12": "6e:c2:40:96:93:97",
            "net13": "8e:2f:80:f3:cc:93",
            "net14": "1a:8f:f2:83:03:88",
            "net15": "9a:be:d3:c0:4c:03",
            "net16": "c6:53:a1:39:ec:dc",
            "net17": "0a:6d:b5:c5:a4:cb",
            "net18": "a6:cd:b1:dd:2b:90",
            "net19": "0a:c6:bd:3e:3d:cb",
            "net2": "7a:b4:df:0a:d0:e4",
            "net3": "ae:dc:19:0b:12:12",
            "net4": "8a:95:b2:18:02:3d",
            "net5": "fe:ba:f6:cb:ba:1e",
            "net6": "2a:21:34:ad:0a:02",
            "net7": "6e:64:5d:94:94:03",
            "net8": "82:14:a2:23:ae:49",
            "net9": "c2:23:89:41:58:d3"
        },
        "spine_1_1_6": {
            "net0": "82:b9:7d:23:77:b0",
            "net1": "16:b2:5a:2e:3a:21",
            "net10": "ce:d5:c3:6d:91:ea",
            "net11": "b6:0a:1b:de:81:93",
            "net12": "f2:c9:5b:1e:7e:cd",
            "net13": "ea:67:7b:3b:5e:70",
            "net14": "0e:eb:0c:d0:cd:6e",
            "net15": "1a:02:71:e5:32:e7",
            "net16": "fa:55:a8:e1:cc:3f",
            "net17": "32:fb:d3:39:86:2c",
            "net18": "56:6d:94:47:a8:4c",
            "net19": "a6:78:6f:b9:b6:74",
            "net2": "ba:9f:c7:b6:1a:0f",
            "net3": "ee:8c:f0:d2:41:9a",
            "net4": "42:ce:19:e7:db:f4",
            "net5": "0e:56:b2:21:cd:20",
            "net6": "be:05:bd:7b:fa:6f",
            "net7": "de:79:9f:76:c7:c0",
            "net8": "6e:66:b8:5e:4c:4d",
            "net9": "8a:cf:91:2e:2f:22"
        },
        "spine_1_1_7": {
            "net0": "a2:00:a2:d5:88:0c",
            "net1": "da:59:40:53:f5:ee",
            "net10": "ca:29:6d:52:d7:47",
            "net11": "a2:24:5d:2d:a7:2b",
            "net12": "d2:3c:65:d7:4a:c2",
            "net13": "ae:82:e5:c4:72:e2",
            "net14": "de:c4:b2:38:19:7b",
            "net15": "02:13:03:ac:dc:73",
            "net16": "0a:c3:90:d0:bc:0a",
            "net17": "4e:6c:19:ef:9e:a2",
            "net18": "1a:4b:fd:9b:15:ff",
            "net19": "f6:d7:8d:dd:65:57",
            "net2": "56:f0:67:89:57:d9",
            "net3": "da:82:81:de:ce:76",
            "net4": "2a:dc:b8:51:07:7b",
            "net5": "3e:aa:58:03:d8:68",
            "net6": "06:a0:b7:28:a1:c9",
            "net7": "2a:fc:20:cf:4a:06",
            "net8": "ba:20:0c:99:40:d9",
            "net9": "86:b8:4e:d8:39:bc"
        },
        "spine_1_1_8": {
            "net0": "66:b5:c2:88:14:b8",
            "net1": "f2:70:c6:08:15:d4",
            "net10": "d2:d3:c8:00:67:71",
            "net11": "66:7a:21:3a:39:5c",
            "net12": "82:21:12:a9:83:61",
            "net13": "3e:ef:28:a3:48:1f",
            "net14": "9a:15:94:fa:c4:44",
            "net15": "7e:45:06:d4:e2:7d",
            "net16": "2a:6c:a2:bd:c4:9f",
            "net17": "62:26:fe:de:f2:be",
            "net18": "d6:53:7c:7f:7d:bc",
            "net19": "12:ca:ce:1a:79:96",
            "net2": "aa:e8:b2:44:af:73",
            "net3": "1a:4a:bb:36:89:af",
            "net4": "5e:b6:e5:8c:ef:03",
            "net5": "72:b5:ce:35:49:f4",
            "net6": "96:0f:49:78:9b:03",
            "net7": "be:fa:4d:3c:b7:39",
            "net8": "2a:58:5c:42:39:90",
            "net9": "be:b6:77:fe:a1:a6"
        },
        "spine_1_1_9": {
            "net0": "0a:2d:50:84:99:bc",
            "net1": "3a:32:98:ae:3e:84",
            "net10": "36:b0:1a:f3:b2:83",
            "net11": "da:1c:f5:17:ee:49",
            "net12": "ea:ff:66:4f:1c:27",
            "net13": "02:b9:fe:26:31:f0",
            "net14": "e6:ac:74:af:49:4f",
            "net15": "76:7a:24:45:24:08",
            "net16": "b2:77:88:ba:e4:09",
            "net17": "d6:ac:8e:22:47:8a",
            "net18": "6a:7e:6e:5a:7d:28",
            "net19": "d6:1f:1a:ee:55:59",
            "net2": "f2:ed:14:a7:19:d8",
            "net3": "3e:d7:93:9e:90:ee",
            "net4": "56:81:b0:3c:bf:7d",
            "net5": "ce:6b:96:6d:8e:e3",
            "net6": "d2:e3:df:87:14:c0",
            "net7": "06:14:db:42:e0:5b",
            "net8": "76:30:fd:72:ae:7c",
            "net9": "ea:fa:46:6f:26:1b"
        },
        "spine_2_1_1": {
            "net0": "96:27:9b:be:c4:73",
            "net1": "ba:5e:78:a4:b9:3d",
            "net10": "ca:5f:d7:7f:a5:45",
            "net11": "de:c4:dc:54:10:69",
            "net12": "aa:52:17:37:14:70",
            "net13": "d2:49:f2:ec:c4:61",
            "net14": "7a:a6:85:3a:c4:e7",
            "net15": "0a:f4:c3:2d:90:c8",
            "net16": "e2:06:9d:f8:3a:f4",
            "net17": "aa:ad:db:eb:1f:80",
            "net18": "96:ab:7c:68:0b:2a",
            "net19": "be:58:2c:64:c9:c6",
            "net2": "3e:c6:51:cf:a9:2c",
            "net3": "3e:6a:74:29:4b:e2",
            "net4": "5a:bd:c1:e9:59:80",
            "net5": "a6:39:df:52:18:a8",
            "net6": "92:e8:29:3f:dc:aa",
            "net7": "22:bd:6d:17:00:dc",
            "net8": "0a:1a:cb:62:bc:b1",
            "net9": "d6:2f:7c:3d:56:30"
        },
        "spine_2_1_10": {
            "net0": "7a:ba:6d:e8:65:97",
            "net1": "a2:3e:be:8f:7f:d8",
            "net10": "9e:66:0e:ba:f1:45",
            "net11": "36:e9:52:13:5e:33",
            "net12": "fa:d3:05:2a:84:16",
            "net13": "36:af:70:99:23:77",
            "net14": "46:35:d0:c6:71:38",
            "net15": "06:5f:64:d4:f5:e1",
            "net16": "d6:e9:67:1a:a3:60",
            "net17": "1e:c9:d5:3e:a4:79",
            "net18": "f6:bd:f5:96:2e:9c",
            "net19": "5a:46:0f:da:84:9e",
            "net2": "3e:6f:38:d5:87:77",
            "net3": "92:17:57:1e:72:b5",
            "net4": "a2:72:92:70:fc:e4",
            "net5": "c6:aa:f5:86:90:4f",
            "net6": "6a:18:22:23:01:17",
            "net7": "3e:46:9e:37:12:89",
            "net8": "72:16:2a:d4:52:06",
            "net9": "ca:bb:8b:ee:04:44"
        },
        "spine_2_1_2": {
            "net0": "46:ae:6e:c5:dd:73",
            "net1": "de:44:23:06:48:0c",
            "net10": "ee:6e:ba:9c:ea:79",
            "net11": "66:86:27:5a:a0:a4",
            "net12": "26:73:5f:33:34:fa",
            "net13": "7e:d9:69:36:89:c5",
            "net14": "b2:56:1f:76:c4:3a",
            "net15": "62:92:b2:15:a2:d8",
            "net16": "96:c7:e8:a9:54:7e",
            "net17": "46:b4:8d:5f:13:80",
            "net18": "5a:dd:8d:ab:57:42",
            "net19": "f2:bc:9c:4a:7e:9b",
            "net2": "ca:28:ca:b7:84:96",
            "net3": "ca:45:a4:5a:b7:6d",
            "net4": "f6:85:c7:95:c1:26",
            "net5": "9a:75:f2:b4:ea:8f",
            "net6": "16:1e:fb:a1:f5:98",
            "net7": "2a:9c:49:e5:af:cb",
            "net8": "9a:fd:1b:ba:f2:cf",
            "net9": "e6:b8:05:00:7d:9e"
        },
        "spine_2_1_3": {
            "net0": "d6:c7:98:1a:8b:75",
            "net1": "a2:3a:09:2e:e8:9a",
            "net10": "aa:49:33:71:ae:cc",
            "net11": "ca:0f:3b:3a:3d:9b",
            "net12": "62:fc:94:82:e9:c7",
            "net13": "e6:17:69:2b:d8:54",
            "net14": "f2:ae:36:35:2c:34",
            "net15": "82:e4:0a:03:c5:12",
            "net16": "fe:19:ad:5f:8a:f0",
            "net17": "e6:bc:fc:ba:d0:0b",
            "net18": "a2:55:fb:b9:dc:3c",
            "net19": "96:c6:96:e0:2c:27",
            "net2": "d6:7c:48:08:da:e7",
            "net3": "9e:19:99:bd:10:10",
            "net4": "16:fe:be:56:bf:9b",
            "net5": "ba:3c:d7:37:37:33",
            "net6": "9a:5f:73:d3:f8:c6",
            "net7": "1a:03:97:86:10:b7",
            "net8": "ce:fa:97:27:d7:c5",
            "net9": "ba:8d:25:5b:7d:d0"
        },
        "spine_2_1_4": {
            "net0": "36:7d:f8:9f:6c:98",
            "net1": "f2:5b:df:c6:77:07",
            "net10": "6a:f5:e6:38:fb:51",
            "net11": "b6:d4:1c:31:ea:ad",
            "net12": "12:d4:0e:d6:e5:fd",
            "net13": "72:8e:7c:df:2a:fe",
            "net14": "6a:b7:94:a3:c0:9c",
            "net15": "36:2a:11:1f:94:3f",
            "net16": "8a:37:a7:e6:3f:04",
            "net17": "ba:6f:c9:0b:ff:66",
            "net18": "4e:ed:4c:71:f8:9b",
            "net19": "7a:8f:8f:d6:50:87",
            "net2": "a2:f3:6d:fe:5a:5b",
            "net3": "c6:e1:d6:5d:bc:54",
            "net4": "0e:db:3c:05:60:38",
            "net5": "0e:e3:20:d4:45:8a",
            "net6": "36:df:2f:69:87:c5",
            "net7": "da:5b:7d:9b:37:6f",
            "net8": "66:63:2e:e3:f8:1b",
            "net9": "92:bb:d2:e1:91:6d"
        },
        "spine_2_1_5": {
            "net0": "66:c6:f7:b7:2d:70",
            "net1": "6e:55:4f:f2:c1:9d",
            "net10": "7a:90:de:4d:72:a6",
            "net11": "ce:7f:d6:0c:c7:a8",
            "net12": "36:39:38:08:5d:7b",
            "net13": "12:27:99:87:aa:dc",
            "net14": "ae:10:67:dc:b6:db",
            "net15": "2a:19:b6:7c:c4:7a",
            "net16": "92:e8:95:d8:34:5d",
            "net17": "92:26:17:9f:62:ef",
            "net18": "42:98:03:b0:87:ec",
            "net19": "ae:a8:b4:98:ed:27",
            "net2": "56:1f:8a:a3:94:d5",
            "net3": "1a:51:bf:f7:71:ba",
            "net4": "f6:30:c2:4f:eb:7a",
            "net5": "1a:32:63:32:70:04",
            "net6": "4a:dc:ed:77:58:47",
            "net7": "d2:2d:54:85:07:73",
            "net8": "82:2a:d7:29:9d:24",
            "net9": "66:2f:d9:3a:38:14"
        },
        "spine_2_1_6": {
            "net0": "92:85:4c:44:ed:2d",
            "net1": "66:ff:f9:bb:f2:be",
            "net10": "66:24:2b:b1:2b:8c",
            "net11": "82:db:12:78:f8:f8",
            "net12": "ee:a6:62:ee:f3:ec",
            "net13": "d2:bd:09:38:ff:e8",
            "net14": "32:11:5b:e3:eb:cc",
            "net15": "ba:8d:04:9b:3d:0f",
            "net16": "46:aa:3f:79:6e:f1",
            "net17": "9a:ef:8d:f9:9d:de",
            "net18": "f6:e8:ae:e8:ed:cc",
            "net19": "9e:e3:02:6d:f4:47",
            "net2": "8e:d0:80:0a:8d:82",
            "net3": "a6:50:03:89:61:de",
            "net4": "e2:a4:71:b6:44:29",
            "net5": "ce:09:ae:3f:cb:87",
            "net6": "56:1d:05:58:f2:f1",
            "net7": "ea:07:8d:9c:42:42",
            "net8": "0e:bd:6d:ab:d4:79",
            "net9": "26:ef:5d:9e:a3:b0"
        },
        "spine_2_1_7": {
            "net0": "ba:38:b7:c2:95:0a",
            "net1": "76:1c:32:c2:f9:25",
            "net10": "ca:ff:1a:87:f9:d0",
            "net11": "e6:9c:1e:b2:0a:89",
            "net12": "f2:45:31:42:e8:6e",
            "net13": "de:0c:4d:ff:a8:96",
            "net14": "f2:90:cb:b6:dc:c3",
            "net15": "52:aa:14:d2:16:20",
            "net16": "9a:da:22:a5:ee:5c",
            "net17": "ce:3d:a0:68:11:91",
            "net18": "7a:76:25:54:dd:67",
            "net19": "72:fc:55:df:03:9b",
            "net2": "06:0e:33:5f:ba:0e",
            "net3": "ce:96:31:38:4f:47",
            "net4": "fe:39:0b:12:49:1a",
            "net5": "72:ce:21:a3:9c:16",
            "net6": "de:69:c4:a6:16:62",
            "net7": "de:a9:29:06:fe:1a",
            "net8": "aa:2e:22:db:1b:68",
            "net9": "fe:71:38:88:a2:26"
        },
        "spine_2_1_8": {
            "net0": "d6:94:d3:eb:a4:e5",
            "net1": "3a:2c:38:72:1a:a6",
            "net10": "0e:9f:f9:0e:1a:27",
            "net11": "62:ed:6b:9d:49:80",
            "net12": "42:92:98:dc:8c:f5",
            "net13": "b2:5e:db:81:7a:07",
            "net14": "f2:a3:a5:85:0f:02",
            "net15": "b6:a5:37:69:31:97",
            "net16": "9a:76:00:3f:4a:f7",
            "net17": "1a:94:96:11:95:c8",
            "net18": "1a:55:32:c2:41:95",
            "net19": "ea:d8:08:14:17:53",
            "net2": "96:36:80:7a:98:ba",
            "net3": "4e:5d:4a:68:84:e4",
            "net4": "5e:a9:d8:9b:38:21",
            "net5": "12:d8:04:ed:8d:bc",
            "net6": "ce:96:69:b4:c4:b6",
            "net7": "0e:92:05:bd:ee:74",
            "net8": "12:94:55:e5:1c:63",
            "net9": "d6:19:9b:d5:b0:ad"
        },
        "spine_2_1_9": {
            "net0": "1a:5a:17:40:df:92",
            "net1": "ba:97:b0:08:6d:40",
            "net10": "7e:d1:74:52:33:1f",
            "net11": "5e:06:01:54:0b:b6",
            "net12": "f6:04:af:be:aa:02",
            "net13": "86:60:12:db:fd:71",
            "net14": "5e:0b:c7:ff:42:5f",
            "net15": "d6:04:1d:32:df:88",
            "net16": "02:0a:4b:e5:bd:b5",
            "net17": "0e:73:53:24:92:5d",
            "net18": "ee:3a:0b:85:c4:63",
            "net19": "ee:31:80:b2:b9:5c",
            "net2": "26:f7:09:1f:6a:85",
            "net3": "2a:e7:0a:38:3f:44",
            "net4": "82:67:31:0e:37:29",
            "net5": "86:8f:7b:94:07:3d",
            "net6": "9a:63:e3:5a:fb:4f",
            "net7": "ee:5b:d3:ba:dd:17",
            "net8": "8e:c5:14:c4:11:fe",
            "net9": "e6:68:e8:41:34:75"
        },
        "spine_3_1_1": {
            "net0": "36:fc:a4:0b:42:55",
            "net1": "8e:03:05:95:7f:cc",
            "net10": "c6:03:7d:9b:3c:b1",
            "net11": "62:8d:e3:4a:1f:07",
            "net12": "e6:a6:20:22:fc:76",
            "net13": "2e:f0:92:63:ce:05",
            "net14": "fa:b0:c1:ca:4b:e1",
            "net15": "e6:da:ce:18:8f:2f",
            "net16": "ee:df:b6:f0:4f:40",
            "net17": "82:9a:36:0e:33:53",
            "net18": "86:e9:a1:38:8d:6f",
            "net19": "1e:c4:43:c7:b8:8f",
            "net2": "aa:30:ce:4e:26:30",
            "net3": "e2:40:71:57:1d:d6",
            "net4": "6e:d8:70:7e:63:72",
            "net5": "da:24:3e:c4:0c:8d",
            "net6": "6e:bd:f3:6d:ac:5f",
            "net7": "b2:3f:c8:c6:9d:20",
            "net8": "3a:1c:30:f8:93:70",
            "net9": "82:1c:b7:4e:30:2c"
        },
        "spine_3_1_10": {
            "net0": "12:6e:b1:ac:4c:30",
            "net1": "92:b1:b8:54:dc:5b",
            "net10": "22:a0:e8:e4:e5:a2",
            "net11": "fa:f5:e7:3b:1b:72",
            "net12": "3a:52:df:73:00:8d",
            "net13": "3e:15:44:5d:23:ea",
            "net14": "be:12:d1:66:96:90",
            "net15": "62:1e:77:97:b4:34",
            "net16": "7e:8d:99:f7:1f:b5",
            "net17": "8a:53:e0:2a:78:4e",
            "net18": "7e:9e:ff:9a:25:62",
            "net19": "8a:ac:35:90:f6:bf",
            "net2": "ce:8e:65:75:44:98",
            "net3": "1e:16:d4:73:11:f6",
            "net4": "f6:a1:1e:be:a2:75",
            "net5": "7e:d3:18:ff:d7:f1",
            "net6": "ea:74:08:98:13:40",
            "net7": "e2:dd:96:30:96:6d",
            "net8": "1a:5c:95:c0:47:08",
            "net9": "a2:8f:cf:e0:dd:29"
        },
        "spine_3_1_2": {
            "net0": "e2:ed:38:4f:b3:13",
            "net1": "4a:b1:65:c2:ee:6b",
            "net10": "ee:84:90:7e:f7:f8",
            "net11": "6e:a3:b7:f4:26:c3",
            "net12": "3a:81:a3:0a:e8:ea",
            "net13": "3a:8e:9d:91:3f:eb",
            "net14": "92:7e:cd:45:cf:84",
            "net15": "fa:d5:c5:c9:84:db",
            "net16": "e2:55:af:0a:ad:71",
            "net17": "56:7b:dc:c0:52:8f",
            "net18": "fa:72:b3:4c:e6:23",
            "net19": "76:22:9d:b5:1f:c2",
            "net2": "ca:e5:86:21:6e:75",
            "net3": "52:41:0f:70:bc:87",
            "net4": "b2:f4:38:6a:bc:b5",
            "net5": "36:8f:5d:44:9b:b3",
            "net6": "ee:bc:e6:79:f8:a2",
            "net7": "52:33:9d:7d:af:38",
            "net8": "5a:c9:d0:83:de:2f",
            "net9": "12:01:ba:a3:ea:cc"
        },
        "spine_3_1_3": {
            "net0": "5a:90:b6:9b:f7:66",
            "net1": "fe:ec:dc:08:a7:aa",
            "net10": "7a:bc:34:62:b8:66",
            "net11": "8e:99:22:cf:20:2a",
            "net12": "f2:b5:59:4c:56:fd",
            "net13": "5e:14:36:03:83:01",
            "net14": "c6:ff:33:d1:4f:ad",
            "net15": "32:28:30:aa:ef:1f",
            "net16": "da:34:89:af:e0:b5",
            "net17": "32:7e:15:37:8a:45",
            "net18": "9e:c4:c6:61:fa:8a",
            "net19": "f2:d8:bc:03:d9:43",
            "net2": "9a:69:b8:ef:f4:08",
            "net3": "6a:c8:05:bc:05:21",
            "net4": "b2:90:bc:97:d1:cd",
            "net5": "32:ad:34:fa:fb:56",
            "net6": "fe:4e:6b:99:5d:7b",
            "net7": "6a:56:f6:81:d1:1d",
            "net8": "b2:f7:41:20:ae:3b",
            "net9": "52:b4:01:07:e9:11"
        },
        "spine_3_1_4": {
            "net0": "c2:03:e5:6c:ff:bc",
            "net1": "4e:6c:5d:d6:e7:2e",
            "net10": "0e:94:ea:62:3b:f1",
            "net11": "6a:ce:f1:24:f1:02",
            "net12": "ae:38:59:43:15:a4",
            "net13": "fe:08:34:4b:a3:65",
            "net14": "72:00:dc:06:42:77",
            "net15": "12:98:92:bf:35:c3",
            "net16": "6a:96:bf:59:8e:c9",
            "net17": "6a:27:1b:8c:1e:29",
            "net18": "92:08:08:80:e3:66",
            "net19": "46:0e:6f:6a:13:c7",
            "net2": "92:89:9d:ea:af:24",
            "net3": "c2:b7:72:cd:1a:9c",
            "net4": "ce:a6:28:12:ba:28",
            "net5": "0e:64:02:a8:85:3c",
            "net6": "42:4e:0d:25:66:83",
            "net7": "42:92:0a:b9:37:4d",
            "net8": "ee:d2:55:b5:fd:db",
            "net9": "7a:ae:79:b0:fd:77"
        },
        "spine_3_1_5": {
            "net0": "fe:bd:97:a1:3d:d1",
            "net1": "4a:1c:e9:00:f3:c3",
            "net10": "e2:e2:e0:6e:a6:d5",
            "net11": "a2:e0:78:0e:a0:c7",
            "net12": "22:cc:7b:ca:85:be",
            "net13": "2a:b3:64:d3:bf:b5",
            "net14": "4a:ca:3e:bd:d5:ce",
            "net15": "2e:83:05:35:7b:08",
            "net16": "76:a0:ad:72:5a:f5",
            "net17": "fa:27:34:7d:fa:5f",
            "net18": "52:93:2f:58:45:f8",
            "net19": "4e:32:2f:68:2f:5d",
            "net2": "52:6a:24:7a:a0:f5",
            "net3": "82:fe:15:5b:15:95",
            "net4": "12:37:ba:77:63:ab",
            "net5": "ae:79:56:aa:09:cb",
            "net6": "16:94:0f:5b:99:46",
            "net7": "5e:bd:e4:0d:22:93",
            "net8": "96:25:14:6f:21:06",
            "net9": "66:4e:45:88:2b:c4"
        },
        "spine_3_1_6": {
            "net0": "6a:16:a4:36:a7:f2",
            "net1": "ce:d0:0c:3f:ec:31",
            "net10": "1e:73:d3:0e:bd:9a",
            "net11": "d6:e9:bb:fc:e1:9b",
            "net12": "e6:65:51:57:fa:d5",
            "net13": "32:ac:5e:88:8b:37",
            "net14": "0e:50:e2:78:24:0b",
            "net15": "22:7f:9c:4b:ee:c1",
            "net16": "66:39:74:65:8b:67",
            "net17": "f6:ab:27:10:1a:dd",
            "net18": "12:43:21:4e:3d:42",
            "net19": "7a:ac:52:00:4b:75",
            "net2": "4a:8c:1b:71:82:4a",
            "net3": "1e:d4:43:82:6a:73",
            "net4": "b6:9d:e9:fd:2d:fe",
            "net5": "52:6d:46:52:86:ea",
            "net6": "f6:25:b5:a7:f4:e1",
            "net7": "5a:64:af:8b:3c:9d",
            "net8": "82:f3:d5:c7:7e:00",
            "net9": "ee:c8:0d:93:36:79"
        },
        "spine_3_1_7": {
            "net0": "2e:7a:15:bc:e9:d4",
            "net1": "36:97:38:1f:77:27",
            "net10": "56:df:c3:1f:7b:bc",
            "net11": "8a:05:9f:14:6d:3d",
            "net12": "4e:30:b9:7a:71:af",
            "net13": "36:5a:51:c0:6c:e8",
            "net14": "6a:3a:17:4a:fd:1c",
            "net15": "ce:2a:58:cc:d0:bf",
            "net16": "02:2c:29:94:3b:89",
            "net17": "ea:28:e2:ae:d1:a5",
            "net18": "96:b3:b0:79:ed:92",
            "net19": "76:64:b5:d0:1b:a7",
            "net2": "3e:94:6e:7f:fe:0c",
            "net3": "96:02:2e:a8:03:36",
            "net4": "8e:3a:c3:1c:d7:66",
            "net5": "a2:3e:ac:6d:01:e5",
            "net6": "16:d9:6b:bd:02:97",
            "net7": "f2:5d:7e:fe:db:b2",
            "net8": "6a:ed:fe:6a:80:6c",
            "net9": "aa:7c:37:68:b0:b3"
        },
        "spine_3_1_8": {
            "net0": "9a:b4:49:61:92:fb",
            "net1": "8e:3b:2f:70:e4:7a",
            "net10": "2a:e8:f3:1d:a6:f5",
            "net11": "26:52:18:6c:46:17",
            "net12": "12:ee:44:6e:09:f5",
            "net13": "9a:64:db:82:c0:85",
            "net14": "22:be:1e:60:21:8b",
            "net15": "1a:1e:cd:61:0b:18",
            "net16": "2a:e6:ba:c9:23:52",
            "net17": "ea:a1:1c:cb:31:dc",
            "net18": "f2:46:c7:7f:e2:c3",
            "net19": "92:35:bc:41:ea:40",
            "net2": "d6:8c:83:62:2a:ab",
            "net3": "06:fe:3c:d8:2c:16",
            "net4": "c6:76:de:db:d6:91",
            "net5": "c6:37:22:a5:ae:8c",
            "net6": "f6:f3:5f:3c:79:29",
            "net7": "5e:88:ed:ba:55:2d",
            "net8": "1a:4c:2e:bd:ef:77",
            "net9": "3e:f9:e9:90:e3:5e"
        },
        "spine_3_1_9": {
            "net0": "1a:64:73:91:61:2d",
            "net1": "9a:d7:cc:af:3d:c5",
            "net10": "de:7b:cc:3f:ba:eb",
            "net11": "3a:52:03:a7:75:3a",
            "net12": "42:7e:f6:e2:8f:0d",
            "net13": "56:6f:14:c7:bf:c1",
            "net14": "46:15:ed:3a:81:be",
            "net15": "aa:dc:2f:15:51:5d",
            "net16": "de:e8:ee:64:81:c0",
            "net17": "ca:ec:42:59:3c:dd",
            "net18": "b6:e2:cc:ca:27:79",
            "net19": "5a:e7:ea:30:f8:87",
            "net2": "2e:9b:c6:cd:a2:ed",
            "net3": "ca:a8:bf:50:a9:7c",
            "net4": "2e:7d:1c:74:d4:da",
            "net5": "06:36:2b:ba:fc:9f",
            "net6": "26:fb:01:72:85:64",
            "net7": "de:73:97:de:27:25",
            "net8": "12:65:4e:0e:3f:59",
            "net9": "1a:fa:b5:80:3d:2e"
        },
        "spine_4_1_1": {
            "net0": "1a:f0:47:af:c5:93",
            "net1": "b6:ab:cb:23:4d:7b",
            "net10": "82:b1:2a:f6:43:48",
            "net11": "b2:37:7a:bc:60:ca",
            "net12": "be:a6:42:c0:21:5b",
            "net13": "aa:61:ed:38:d7:92",
            "net14": "82:94:08:5a:e4:d9",
            "net15": "46:3f:f8:0e:be:4c",
            "net16": "4e:4d:f4:0c:41:61",
            "net17": "e6:38:ef:db:4d:5b",
            "net18": "3e:e0:06:21:c9:18",
            "net19": "6a:ff:fc:ea:3e:32",
            "net2": "9e:29:34:35:09:3d",
            "net3": "4e:9f:9e:1d:a4:be",
            "net4": "6a:07:26:88:43:6d",
            "net5": "16:4a:3c:ee:d3:83",
            "net6": "92:f9:a4:1e:36:40",
            "net7": "be:40:10:ad:e7:fb",
            "net8": "7a:b4:33:3d:e0:fc",
            "net9": "2a:1c:ba:b2:4f:2b"
        },
        "spine_4_1_10": {
            "net0": "2e:d1:2d:80:28:e8",
            "net1": "7a:33:55:73:70:3b",
            "net10": "1a:79:fa:9c:99:5c",
            "net11": "26:f1:9a:73:8c:a8",
            "net12": "6e:07:4c:12:2e:45",
            "net13": "8e:d7:f5:62:74:1b",
            "net14": "6a:65:28:54:69:9a",
            "net15": "a6:23:f6:a7:55:eb",
            "net16": "5e:bb:35:06:25:06",
            "net17": "52:3b:2f:f2:52:e6",
            "net18": "62:7a:6a:72:b8:3c",
            "net19": "72:c3:6a:f2:35:32",
            "net2": "8a:9f:48:ed:69:90",
            "net3": "2e:fb:ba:d4:1d:33",
            "net4": "0a:2c:4c:a2:ee:21",
            "net5": "7e:4d:a9:06:9d:80",
            "net6": "ce:dc:c7:71:e1:e9",
            "net7": "96:28:c4:99:c7:fe",
            "net8": "f2:1d:75:2b:e3:1c",
            "net9": "62:03:51:8b:1b:19"
        },
        "spine_4_1_2": {
            "net0": "9a:69:a9:7f:c9:49",
            "net1": "16:a0:56:83:b4:81",
            "net10": "ae:89:46:9a:32:e9",
            "net11": "1e:74:d6:6c:fc:e2",
            "net12": "e6:a2:ab:d3:4f:ce",
            "net13": "32:e8:50:74:9f:b7",
            "net14": "7a:29:d7:73:bf:d9",
            "net15": "72:40:1c:33:b1:57",
            "net16": "d2:0d:53:ae:1c:23",
            "net17": "0e:af:3d:8d:ca:0b",
            "net18": "de:88:e3:db:a4:c1",
            "net19": "3a:2c:1b:71:8a:b9",
            "net2": "3a:e7:b8:36:95:28",
            "net3": "a6:60:c2:27:4f:2d",
            "net4": "1a:02:e7:34:d3:bf",
            "net5": "4e:ba:f6:69:9e:45",
            "net6": "1e:6f:43:37:b7:b3",
            "net7": "9e:06:68:f9:05:2c",
            "net8": "0a:c7:57:9a:88:43",
            "net9": "46:ca:b5:91:e2:75"
        },
        "spine_4_1_3": {
            "net0": "76:cb:e8:aa:ee:46",
            "net1": "82:3a:da:28:60:9a",
            "net10": "12:10:22:07:a2:f1",
            "net11": "ea:61:31:2d:24:a8",
            "net12": "b2:93:a8:4c:e6:19",
            "net13": "a6:13:da:06:d9:39",
            "net14": "1e:fa:81:59:12:05",
            "net15": "ee:8f:cb:82:65:1a",
            "net16": "52:b3:89:71:dd:47",
            "net17": "ba:f4:79:ba:3d:58",
            "net18": "2e:d6:6a:75:2e:53",
            "net19": "72:66:01:9e:ca:10",
            "net2": "7a:be:7f:b2:7e:81",
            "net3": "0a:87:3a:f4:fb:a8",
            "net4": "fe:71:b2:80:19:10",
            "net5": "e2:2e:e1:6f:83:ad",
            "net6": "5e:c1:34:4b:6c:fb",
            "net7": "76:30:e1:8f:e9:1a",
            "net8": "92:e5:9c:01:90:b9",
            "net9": "52:f4:f8:48:bb:36"
        },
        "spine_4_1_4": {
            "net0": "3a:fd:19:25:d3:a7",
            "net1": "da:1a:d9:a2:e6:87",
            "net10": "b6:75:c5:8c:cb:d2",
            "net11": "02:e3:11:c5:d6:e4",
            "net12": "86:e2:3a:7d:bd:d1",
            "net13": "22:88:43:c5:a3:75",
            "net14": "7a:e7:ab:47:65:82",
            "net15": "d2:64:46:50:ae:e8",
            "net16": "96:d5:f9:c0:cc:45",
            "net17": "8e:49:5b:c5:67:54",
            "net18": "42:55:40:f8:31:de",
            "net19": "ba:fa:e2:f1:c2:cc",
            "net2": "46:a3:d2:e2:4d:57",
            "net3": "1e:d5:b7:65:ad:2d",
            "net4": "4e:64:fb:16:94:b3",
            "net5": "6a:a9:03:37:d6:76",
            "net6": "8a:8e:75:c1:f8:45",
            "net7": "72:f9:46:88:13:aa",
            "net8": "d2:9d:cb:56:17:4a",
            "net9": "82:40:ea:18:fd:6d"
        },
        "spine_4_1_5": {
            "net0": "86:15:cc:ab:33:b2",
            "net1": "16:49:51:49:c5:71",
            "net10": "be:41:76:7c:e3:47",
            "net11": "f6:93:60:a3:52:7b",
            "net12": "ca:82:83:10:3c:3a",
            "net13": "ca:8a:fb:0b:4a:5a",
            "net14": "c6:67:80:5e:e9:f1",
            "net15": "8e:a3:89:8c:af:03",
            "net16": "7a:01:13:68:72:c8",
            "net17": "3a:31:f2:d4:c6:19",
            "net18": "e6:53:44:e2:70:95",
            "net19": "6e:0e:f5:7b:95:28",
            "net2": "9e:4a:8c:63:c4:5c",
            "net3": "02:42:d5:28:b2:55",
            "net4": "46:a8:4b:9b:b7:c2",
            "net5": "86:31:71:91:66:f4",
            "net6": "4e:27:54:30:03:d3",
            "net7": "22:99:a1:76:be:3d",
            "net8": "52:0f:13:9f:65:da",
            "net9": "ce:c6:ac:3e:4c:fa"
        },
        "spine_4_1_6": {
            "net0": "7a:6c:16:6d:e2:27",
            "net1": "02:00:92:59:cc:d5",
            "net10": "1a:11:23:84:36:84",
            "net11": "9e:1b:9d:27:b3:65",
            "net12": "0e:5a:71:09:04:ec",
            "net13": "4a:69:08:25:6e:3c",
            "net14": "36:96:69:e0:a1:64",
            "net15": "e2:e2:cd:c3:c8:6a",
            "net16": "7a:b0:d1:5b:0c:f7",
            "net17": "5a:de:92:3f:15:54",
            "net18": "42:91:3d:1a:82:38",
            "net19": "c2:26:c3:79:60:36",
            "net2": "56:79:6a:f8:12:23",
            "net3": "82:ff:2f:fc:d2:c9",
            "net4": "22:d3:a6:0f:97:ab",
            "net5": "6e:42:53:56:cb:35",
            "net6": "4e:eb:f1:9f:3c:08",
            "net7": "e6:b2:9f:2a:9b:09",
            "net8": "ca:0e:5d:2d:97:ec",
            "net9": "26:32:3e:be:42:05"
        },
        "spine_4_1_7": {
            "net0": "2e:10:18:9e:23:33",
            "net1": "a6:96:fc:37:bb:6f",
            "net10": "46:31:1d:cc:63:7b",
            "net11": "d2:e9:f7:12:42:94",
            "net12": "7a:55:dc:c1:5e:63",
            "net13": "42:5b:30:75:f1:46",
            "net14": "42:57:2e:94:28:63",
            "net15": "42:cd:77:05:d6:4e",
            "net16": "fa:57:0c:1c:77:d9",
            "net17": "7a:3a:d4:ef:87:06",
            "net18": "e6:36:73:d6:0f:db",
            "net19": "ae:76:56:5f:f7:26",
            "net2": "7e:de:4b:69:40:0e",
            "net3": "ba:7b:ad:1a:4b:ee",
            "net4": "b2:f0:f7:1f:91:e8",
            "net5": "06:57:85:32:7a:72",
            "net6": "66:5a:5c:e4:e5:da",
            "net7": "6a:ab:e5:16:b9:89",
            "net8": "ba:5d:dc:65:7f:75",
            "net9": "72:37:62:12:01:a1"
        },
        "spine_4_1_8": {
            "net0": "66:04:bc:f8:a0:d0",
            "net1": "da:d8:64:19:b0:6d",
            "net10": "de:85:9b:5e:6c:de",
            "net11": "1a:e3:42:88:48:8e",
            "net12": "c2:2f:c3:91:93:ae",
            "net13": "3e:3a:47:35:4e:d9",
            "net14": "be:06:62:11:2d:ec",
            "net15": "c2:22:f8:fe:bf:d2",
            "net16": "ca:26:30:13:4f:ae",
            "net17": "5e:65:1f:fe:e8:a0",
            "net18": "5a:7e:37:59:b2:a3",
            "net19": "66:3b:7f:0d:11:76",
            "net2": "a2:bb:84:64:d0:62",
            "net3": "16:e8:cf:b0:11:28",
            "net4": "aa:a9:05:f3:af:26",
            "net5": "52:25:a7:78:d3:84",
            "net6": "de:ca:f6:3d:6f:e2",
            "net7": "86:27:07:3f:bd:a3",
            "net8": "d6:99:c3:5b:d7:65",
            "net9": "32:b2:53:d9:5e:57"
        },
        "spine_4_1_9": {
            "net0": "16:23:16:a3:97:b2",
            "net1": "b2:d1:e6:db:68:2e",
            "net10": "96:e4:4a:46:a4:65",
            "net11": "02:9f:51:6b:35:b4",
            "net12": "d2:b0:af:c8:b1:b9",
            "net13": "3a:72:5d:64:9f:17",
            "net14": "86:e4:b0:4c:0c:ea",
            "net15": "6a:79:fe:ab:78:e3",
            "net16": "4a:7c:fb:87:4c:90",
            "net17": "fe:79:0c:9a:15:71",
            "net18": "8a:a0:f4:bf:77:4a",
            "net19": "b6:9e:09:c0:db:fc",
            "net2": "1a:39:79:60:89:1b",
            "net3": "56:73:10:df:26:24",
            "net4": "9e:b0:04:74:2a:4e",
            "net5": "ca:b3:75:56:f4:e9",
            "net6": "ce:c9:aa:59:01:cf",
            "net7": "52:aa:c8:3c:66:71",
            "net8": "de:2a:b0:ce:3e:9e",
            "net9": "1a:37:23:26:f4:db"
        },
        "tof_1_2_1": {
            "net0": "7e:ca:07:6f:da:61",
            "net1": "0e:47:6f:a0:bc:6b",
            "net10": "16:79:ce:df:58:da",
            "net11": "66:74:0a:c2:0f:b8",
            "net12": "16:36:50:e5:5a:07",
            "net13": "fe:c0:9e:8c:04:75",
            "net14": "46:48:7d:fb:97:4a",
            "net15": "72:1e:ea:33:c7:4b",
            "net16": "16:2e:54:f6:89:87",
            "net17": "f6:18:fe:64:09:3a",
            "net18": "96:51:a7:0e:fa:68",
            "net19": "1e:11:30:d4:3b:ba",
            "net2": "12:47:43:b6:fc:20",
            "net3": "aa:29:cc:1a:8f:83",
            "net4": "2a:53:23:d5:0e:54",
            "net5": "fa:ec:17:91:4d:c9",
            "net6": "72:7c:82:9b:6c:5d",
            "net7": "f6:76:bf:76:ba:72",
            "net8": "da:01:e3:0c:7e:fa",
            "net9": "6e:d0:e7:83:3e:5b"
        },
        "tof_1_2_10": {
            "net0": "72:3c:4c:86:3f:f9",
            "net1": "52:ed:97:d3:1e:c9",
            "net10": "1e:35:40:a8:4d:92",
            "net11": "72:a8:0e:e7:27:90",
            "net12": "02:d8:83:e7:07:8d",
            "net13": "36:67:b6:7f:98:92",
            "net14": "3e:ea:69:91:37:5e",
            "net15": "c2:7f:c9:7b:c4:c2",
            "net16": "86:a5:74:08:e8:89",
            "net17": "96:e5:ce:c2:ba:e5",
            "net18": "ee:c1:f1:de:b8:2e",
            "net19": "be:be:49:1d:a0:4a",
            "net2": "b6:2f:bc:c7:89:73",
            "net3": "32:c4:ee:98:cc:96",
            "net4": "92:65:a8:e3:83:0d",
            "net5": "8e:4c:32:87:7c:b3",
            "net6": "22:01:8e:0b:72:14",
            "net7": "06:bb:63:dd:c5:bf",
            "net8": "2e:a4:96:45:f6:78",
            "net9": "32:a5:04:cd:b0:dc"
        },
        "tof_1_2_2": {
            "net0": "6e:38:de:9c:d7:6b",
            "net1": "9e:39:8d:40:4c:84",
            "net10": "02:1f:5a:a6:57:f0",
            "net11": "72:27:83:d7:2b:07",
            "net12": "ba:dc:c5:28:5a:84",
            "net13": "36:cd:cc:8b:f7:ae",
            "net14": "96:b1:3f:3a:5f:6c",
            "net15": "1a:f8:7b:ff:36:76",
            "net16": "ae:05:ec:8e:ba:5f",
            "net17": "5e:65:a7:ae:74:d7",
            "net18": "26:56:a0:7c:9f:84",
            "net19": "0a:25:eb:79:0e:fb",
            "net2": "b6:ea:c6:b0:6e:12",
            "net3": "36:27:8e:04:db:94",
            "net4": "d6:47:4d:8d:c8:3e",
            "net5": "f2:98:18:14:42:6f",
            "net6": "d2:9c:97:87:94:00",
            "net7": "9a:29:b8:aa:9f:db",
            "net8": "6e:d7:58:bf:b7:2a",
            "net9": "a2:38:bb:ea:37:72"
        },
        "tof_1_2_3": {
            "net0": "26:69:1d:51:bb:62",
            "net1": "3a:da:dd:af:7f:dd",
            "net10": "aa:b6:bf:8d:71:44",
            "net11": "ce:f8:9b:98:b9:b8",
            "net12": "8a:0f:ec:bf:aa:66",
            "net13": "6a:5a:39:bf:64:df",
            "net14": "3e:06:99:ac:9e:88",
            "net15": "d6:53:24:e9:ff:61",
            "net16": "2e:4f:7d:d0:12:bd",
            "net17": "d2:31:50:96:e0:13",
            "net18": "5a:a0:b7:4a:5a:91",
            "net19": "b2:3b:1b:54:f0:9b",
            "net2": "ca:4c:ee:f1:28:79",
            "net3": "92:41:d2:ac:e0:6f",
            "net4": "22:e7:cf:d9:73:e9",
            "net5": "e2:8c:52:ad:1d:02",
            "net6": "56:f5:eb:6e:fd:90",
            "net7": "ca:50:41:e2:15:d4",
            "net8": "1a:f1:c3:e3:d7:7f",
            "net9": "7e:f5:18:31:55:8e"
        },
        "tof_1_2_4": {
            "net0": "ea:1c:02:66:7c:56",
            "net1": "de:d1:b0:50:7b:21",
            "net10": "82:05:f4:69:54:53",
            "net11": "7a:dc:53:bf:c0:61",
            "net12": "ee:a8:48:39:15:b6",
            "net13": "4e:1c:dd:88:c0:0a",
            "net14": "8a:37:f1:ea:f4:fb",
            "net15": "72:d0:60:a5:75:f2",
            "net16": "3a:db:02:2e:36:de",
            "net17": "42:91:ec:41:a9:be",
            "net18": "1e:19:d7:50:70:89",
            "net19": "5e:a3:7c:5d:f3:41",
            "net2": "56:39:22:6e:91:33",
            "net3": "22:01:b4:f7:6b:f5",
            "net4": "32:69:aa:20:cd:72",
            "net5": "ca:d6:63:d0:a4:d0",
            "net6": "d6:e2:c1:3c:ef:12",
            "net7": "a6:00:18:b2:7e:d2",
            "net8": "a2:d5:36:8f:ac:38",
            "net9": "72:83:64:22:1c:ea"
        },
        "tof_1_2_5": {
            "net0": "22:a7:f0:55:3e:a6",
            "net1": "0e:12:2f:98:16:8f",
            "net10": "0a:57:7a:e6:81:8c",
            "net11": "06:b4:23:c7:0a:fe",
            "net12": "46:83:94:3b:93:e5",
            "net13": "16:84:d7:ed:5a:c9",
            "net14": "66:53:28:98:2c:c9",
            "net15": "96:db:ba:13:9a:db",
            "net16": "c6:ec:62:7c:a3:f6",
            "net17": "3a:d9:9c:b6:12:8e",
            "net18": "ca:24:43:0d:92:23",
            "net19": "0e:92:ac:92:5c:ab",
            "net2": "56:23:60:7e:40:c0",
            "net3": "a2:28:2e:87:80:d2",
            "net4": "12:e6:9b:98:97:f4",
            "net5": "e6:e4:03:55:bd:83",
            "net6": "46:ee:03:b1:25:06",
            "net7": "16:4c:55:72:fa:f8",
            "net8": "d2:1a:39:ac:43:11",
            "net9": "6e:35:41:ee:f3:ae"
        },
        "tof_1_2_6": {
            "net0": "66:6e:98:96:cc:ee",
            "net1": "ae:03:f8:49:af:cf",
            "net10": "72:f9:f8:0f:f1:17",
            "net11": "22:c6:bf:ef:fc:8e",
            "net12": "4e:ff:d1:d8:ce:1a",
            "net13": "2a:e2:ba:eb:4e:c6",
            "net14": "8e:f9:de:1d:30:58",
            "net15": "f2:bb:4e:7c:1c:e5",
            "net16": "ee:c0:64:ea:d5:98",
            "net17": "8e:14:eb:01:08:b0",
            "net18": "3e:6a:9e:ab:fb:51",
            "net19": "7e:72:04:6e:b8:4f",
            "net2": "a2:c0:9f:12:8e:16",
            "net3": "6a:ba:2e:24:0b:e1",
            "net4": "8a:11:83:c2:79:24",
            "net5": "1e:09:19:54:c4:10",
            "net6": "de:84:c1:41:a4:61",
            "net7": "d2:ed:74:c6:ce:e9",
            "net8": "d6:f9:38:26:f8:3b",
            "net9": "3a:b4:d7:87:ce:5b"
        },
        "tof_1_2_7": {
            "net0": "ea:79:c5:ab:3a:e1",
            "net1": "72:09:08:9e:54:5a",
            "net10": "5e:18:d0:9a:92:6a",
            "net11": "6e:0f:54:96:56:77",
            "net12": "96:6d:4a:fa:63:53",
            "net13": "26:d9:32:9d:af:85",
            "net14": "2e:2c:fd:dc:1d:3a",
            "net15": "6e:5f:90:38:69:10",
            "net16": "f2:fd:5b:5f:16:a7",
            "net17": "1a:b0:22:80:31:74",
            "net18": "42:1a:bc:cb:bd:1e",
            "net19": "12:ee:3f:49:ae:6c",
            "net2": "76:99:23:dc:73:b5",
            "net3": "ae:96:e6:ac:3b:89",
            "net4": "3a:0f:32:22:f8:eb",
            "net5": "e2:fb:f4:5a:4a:9d",
            "net6": "ae:79:7b:59:b4:d1",
            "net7": "0e:2c:ec:54:fe:94",
            "net8": "ea:95:db:d4:ff:fe",
            "net9": "d2:6f:74:c6:0b:9c"
        },
        "tof_1_2_8": {
            "net0": "96:83:04:d8:35:de",
            "net1": "5a:d5:46:bc:8b:8a",
            "net10": "be:2f:1d:e3:ec:c4",
            "net11": "aa:ed:7d:1b:76:41",
            "net12": "d2:ce:66:79:cf:ed",
            "net13": "da:9c:10:0a:ac:25",
            "net14": "92:55:fb:5f:c6:86",
            "net15": "ee:29:27:a4:b2:09",
            "net16": "fe:ef:1d:ed:23:70",
            "net17": "4a:1e:18:06:d3:e8",
            "net18": "ae:22:bb:d7:5d:25",
            "net19": "46:68:3d:f2:e4:49",
            "net2": "72:bd:33:75:50:0e",
            "net3": "26:ec:80:a8:1c:72",
            "net4": "e2:d3:6b:69:d0:c1",
            "net5": "be:5f:83:18:bb:29",
            "net6": "1a:62:50:02:6d:4c",
            "net7": "16:c2:eb:09:24:a3",
            "net8": "22:ed:01:18:87:e6",
            "net9": "b6:4a:e8:85:f3:9a"
        },
        "tof_1_2_9": {
            "net0": "7e:fe:0c:b1:ac:ee",
            "net1": "4e:10:2d:08:d3:c6",
            "net10": "ee:6b:84:2d:4e:f7",
            "net11": "fa:45:69:02:1b:99",
            "net12": "fa:3c:01:63:4b:bb",
            "net13": "ae:36:75:15:64:87",
            "net14": "ce:44:1e:fb:22:7d",
            "net15": "2a:af:0a:a2:a6:78",
            "net16": "66:25:08:a6:fe:f7",
            "net17": "ee:cc:1f:df:24:93",
            "net18": "de:4d:16:54:00:b5",
            "net19": "12:a6:05:56:88:57",
            "net2": "e6:35:a7:9d:0b:3d",
            "net3": "56:7e:bb:5d:48:4f",
            "net4": "4a:bd:b2:9b:c0:69",
            "net5": "fe:d7:4c:3b:c6:4d",
            "net6": "2a:5f:48:b9:e2:59",
            "net7": "ea:9e:e1:99:d4:5a",
            "net8": "2e:12:33:46:f2:c4",
            "net9": "e2:9e:dc:6b:4c:0b"
        },
        "tof_2_2_1": {
            "net0": "42:a3:67:0b:a3:4d",
            "net1": "4e:97:65:56:31:12",
            "net10": "aa:43:9d:8c:10:73",
            "net11": "0a:f4:b4:09:26:eb",
            "net12": "2e:2c:e1:82:78:63",
            "net13": "9e:c3:87:34:ac:0e",
            "net14": "8a:2a:1d:88:17:e1",
            "net15": "e2:68:61:e3:29:3b",
            "net16": "72:95:97:03:b9:b5",
            "net17": "f6:95:11:b7:66:5b",
            "net18": "aa:6f:b5:9f:8c:09",
            "net19": "5e:a7:6e:21:f8:06",
            "net2": "2a:fe:14:99:0e:01",
            "net3": "8a:ff:d5:b8:72:d2",
            "net4": "a6:e5:6a:08:13:11",
            "net5": "02:97:88:09:63:73",
            "net6": "12:1d:2a:90:24:9d",
            "net7": "fe:1d:17:1d:e3:b4",
            "net8": "e2:7f:fa:ee:cb:6d",
            "net9": "c2:7a:69:c6:21:ad"
        },
        "tof_2_2_10": {
            "net0": "22:2d:10:5c:1c:57",
            "net1": "e6:c0:67:88:09:ba",
            "net10": "96:f8:13:1c:af:d5",
            "net11": "c2:4e:f9:50:c0:3c",
            "net12": "8e:25:96:3f:5e:c0",
            "net13": "72:b5:72:46:20:62",
            "net14": "72:3e:80:90:ea:8b",
            "net15": "3e:59:d1:fb:4a:a5",
            "net16": "e6:2e:20:4c:d1:31",
            "net17": "56:66:12:48:24:ce",
            "net18": "da:30:57:14:be:b9",
            "net19": "9a:b0:26:06:c1:ce",
            "net2": "7e:62:c3:c8:e3:f4",
            "net3": "ce:c2:d6:7e:c0:8d",
            "net4": "8a:12:c7:4a:b7:a5",
            "net5": "f6:6c:af:ed:ad:3a",
            "net6": "a2:a0:68:5a:4e:7c",
            "net7": "6e:1e:22:a5:f2:9a",
            "net8": "d2:c9:b0:05:09:15",
            "net9": "9e:4b:d6:ab:d7:f7"
        },
        "tof_2_2_2": {
            "net0": "9a:55:87:f1:37:71",
            "net1": "22:d0:9e:7f:ce:58",
            "net10": "02:f2:fc:1e:24:99",
            "net11": "36:ca:d8:46:bf:5d",
            "net12": "22:a8:90:53:e2:0c",
            "net13": "42:bb:75:18:a1:f6",
            "net14": "9e:02:af:cf:2e:c5",
            "net15": "3a:7d:93:6e:a7:62",
            "net16": "b2:12:93:18:a1:a2",
            "net17": "ae:28:61:0d:47:64",
            "net18": "da:c6:cc:1b:a1:91",
            "net19": "7a:b8:fe:59:e1:68",
            "net2": "e6:7a:9f:cd:40:75",
            "net3": "06:cc:65:87:d4:7e",
            "net4": "4e:48:e5:cc:9e:bc",
            "net5": "16:0e:98:c8:67:f3",
            "net6": "ee:19:37:c4:c5:77",
            "net7": "52:a8:24:70:73:f6",
            "net8": "12:dc:9c:d4:16:8a",
            "net9": "6e:ab:e9:9c:25:4c"
        },
        "tof_2_2_3": {
            "net0": "86:d5:9e:a4:1c:21",
            "net1": "de:12:e5:19:89:9c",
            "net10": "ba:4a:dd:46:97:8b",
            "net11": "a6:48:66:80:3f:52",
            "net12": "5e:71:36:8a:6b:de",
            "net13": "b2:fd:d9:47:76:a7",
            "net14": "6e:0d:e3:ce:37:81",
            "net15": "6a:55:b3:0c:be:f8",
            "net16": "fa:a8:9c:7b:ed:7c",
            "net17": "22:b9:eb:74:6f:99",
            "net18": "02:b9:0f:c4:08:ec",
            "net19": "82:ba:c6:68:a0:9d",
            "net2": "96:91:c8:bb:7b:2a",
            "net3": "c2:8c:61:ff:06:46",
            "net4": "12:00:68:58:b4:02",
            "net5": "3a:26:fe:e8:a4:37",
            "net6": "b2:08:9c:66:9a:d7",
            "net7": "9a:60:92:65:e3:55",
            "net8": "7a:50:aa:2b:b8:95",
            "net9": "52:c2:a8:de:69:07"
        },
        "tof_2_2_4": {
            "net0": "aa:c6:20:f0:aa:14",
            "net1": "c2:83:5b:76:c7:4e",
            "net10": "ea:47:99:96:09:b1",
            "net11": "2a:d9:73:9c:47:51",
            "net12": "72:11:3d:15:d1:fe",
            "net13": "86:31:97:23:5d:21",
            "net14": "32:ff:1c:bb:b7:91",
            "net15": "4a:3e:df:29:59:d5",
            "net16": "82:5b:1f:2b:4c:00",
            "net17": "86:c2:85:7c:3c:61",
            "net18": "ca:aa:3d:ac:bc:d2",
            "net19": "ce:bb:41:de:c9:c4",
            "net2": "de:92:28:de:82:20",
            "net3": "4e:3b:5b:9f:4d:08",
            "net4": "6e:09:f3:d6:c8:87",
            "net5": "e2:63:dc:21:4b:a0",
            "net6": "ba:03:42:05:4d:61",
            "net7": "da:b2:f3:9c:93:a7",
            "net8": "b2:d3:19:b8:77:17",
            "net9": "3e:c0:eb:17:85:eb"
        },
        "tof_2_2_5": {
            "net0": "fa:e8:9a:cc:3a:e0",
            "net1": "52:32:cd:24:42:fd",
            "net10": "ee:bf:47:44:06:0d",
            "net11": "22:54:e5:a2:41:a0",
            "net12": "d2:4e:d5:f3:f8:5c",
            "net13": "2a:c3:35:77:26:f8",
            "net14": "ea:de:55:45:6b:e9",
            "net15": "ca:52:11:7d:1f:90",
            "net16": "fa:e6:56:32:cd:83",
            "net17": "8a:84:c0:24:21:e9",
            "net18": "26:c1:d2:78:56:dc",
            "net19": "f6:67:32:5e:1d:a8",
            "net2": "3a:f3:fb:af:32:13",
            "net3": "a2:4c:e6:c0:29:c3",
            "net4": "8a:a3:57:e1:35:a7",
            "net5": "a2:ee:cf:d8:44:33",
            "net6": "ba:37:32:a7:6b:31",
            "net7": "ae:44:bc:14:2e:1c",
            "net8": "be:20:43:3a:ac:47",
            "net9": "f6:62:d7:de:5a:a1"
        },
        "tof_2_2_6": {
            "net0": "fa:6b:0d:6d:d7:57",
            "net1": "6a:6b:2c:42:b2:e0",
            "net10": "0a:c3:1b:27:52:fe",
            "net11": "2e:ea:6b:ef:d0:f2",
            "net12": "9a:06:d2:67:35:a5",
            "net13": "ce:19:02:65:80:59",
            "net14": "86:dd:05:17:15:5b",
            "net15": "3a:15:a8:f7:28:f3",
            "net16": "52:f6:6a:89:9a:6d",
            "net17": "ce:18:f4:46:cb:cc",
            "net18": "4a:fa:af:2c:a3:82",
            "net19": "fa:18:9a:3d:cf:7c",
            "net2": "f2:f6:0c:43:63:d1",
            "net3": "9e:bf:09:8f:7c:8e",
            "net4": "3a:3f:99:fc:73:cc",
            "net5": "0a:18:38:e7:5a:e2",
            "net6": "7e:15:91:42:40:00",
            "net7": "4a:aa:0d:06:a0:17",
            "net8": "1a:4b:ce:1d:80:d2",
            "net9": "8e:3e:68:cf:09:b3"
        },
        "tof_2_2_7": {
            "net0": "9a:29:9a:cf:85:a8",
            "net1": "fe:60:b2:a9:63:9e",
            "net10": "92:11:cc:09:8f:0b",
            "net11": "86:ed:09:52:8c:d8",
            "net12": "da:ff:3b:85:b8:bd",
            "net13": "4e:e5:de:f3:16:76",
            "net14": "7a:c2:7a:d5:2c:b7",
            "net15": "46:c4:96:bd:da:3f",
            "net16": "86:6c:b6:41:04:44",
            "net17": "72:11:96:13:61:5e",
            "net18": "fe:1d:74:6a:58:93",
            "net19": "26:0b:a9:31:5a:9e",
            "net2": "92:2e:9c:81:cc:2e",
            "net3": "06:44:d0:a2:54:e4",
            "net4": "4a:7c:e3:37:2d:e8",
            "net5": "0a:6c:4b:5b:0d:f3",
            "net6": "26:d8:00:eb:76:7f",
            "net7": "fa:63:8a:23:4b:a3",
            "net8": "8e:a3:3f:7c:10:70",
            "net9": "2e:2b:23:86:8a:35"
        },
        "tof_2_2_8": {
            "net0": "72:bd:a2:43:4a:28",
            "net1": "a6:2b:fc:34:da:23",
            "net10": "ca:00:b6:16:42:b4",
            "net11": "7a:86:d7:ef:b0:74",
            "net12": "b6:ef:cf:77:9a:8d",
            "net13": "a2:4e:cf:1b:c4:bf",
            "net14": "b2:ae:36:c5:26:ed",
            "net15": "de:4b:c3:4c:4f:58",
            "net16": "da:92:b8:f2:97:71",
            "net17": "2a:e7:ee:03:d0:41",
            "net18": "a6:36:a8:4b:db:0d",
            "net19": "52:e0:e7:4c:f1:b4",
            "net2": "2e:c8:06:52:55:00",
            "net3": "d2:70:f4:41:f7:79",
            "net4": "a6:05:ba:dd:b1:f4",
            "net5": "9a:20:96:d1:00:b3",
            "net6": "ae:c4:5f:be:44:fc",
            "net7": "5a:dc:27:ce:f4:b5",
            "net8": "d6:78:1d:f1:0a:2c",
            "net9": "9e:b8:47:68:31:9d"
        },
        "tof_2_2_9": {
            "net0": "f6:d4:c3:02:f4:2e",
            "net1": "3a:0e:44:83:53:42",
            "net10": "66:2a:74:0b:69:fe",
            "net11": "32:ed:ed:ef:6d:65",
            "net12": "32:1e:76:3e:1d:24",
            "net13": "3e:26:e5:84:ea:55",
            "net14": "92:de:24:ea:97:80",
            "net15": "6e:c5:82:90:87:e0",
            "net16": "e6:d0:92:54:42:ef",
            "net17": "c2:0a:e9:36:69:f8",
            "net18": "22:4b:d6:cb:0f:69",
            "net19": "52:79:44:eb:59:c1",
            "net2": "56:b6:8e:c9:2b:ce",
            "net3": "c2:8e:0a:db:98:f2",
            "net4": "da:ef:58:74:c3:62",
            "net5": "5a:d1:e3:b6:68:e6",
            "net6": "96:bb:9a:40:68:a6",
            "net7": "06:4d:c3:5e:3c:b6",
            "net8": "fa:45:04:51:b7:96",
            "net9": "ee:cc:68:9d:a2:5b"
        }
    },
    "failed_machine": "tof_1_2_1",
    "failure_time": {
        "leaf_1_0_1": 1636474914.3738115,
        "leaf_1_0_10": 1636474914.393812,
        "leaf_1_0_2": 1636474914.4057343,
        "leaf_1_0_3": 1636474914.4538794,
        "leaf_1_0_4": 1636474914.4782014,
        "leaf_1_0_5": 1636474914.4910285,
        "leaf_1_0_6": 1636474914.5142844,
        "leaf_1_0_7": 1636474914.5274901,
        "leaf_1_0_8": 1636474914.5911548,
        "leaf_1_0_9": 1636474914.6030238,
        "leaf_2_0_1": 1636474914.613707,
        "leaf_2_0_10": 1636474915.7681239,
        "leaf_2_0_2": 1636474915.7937841,
        "leaf_2_0_3": 1636474915.5142665,
        "leaf_2_0_4": 1636474914.3973157,
        "leaf_2_0_5": 1636474914.4072008,
        "leaf_2_0_6": 1636474914.4696536,
        "leaf_2_0_7": 1636474914.4874868,
        "leaf_2_0_8": 1636474914.4947562,
        "leaf_2_0_9": 1636474915.6451578,
        "leaf_3_0_1": 1636474914.5301728,
        "leaf_3_0_10": 1636474914.5849738,
        "leaf_3_0_2": 1636474915.7348626,
        "leaf_3_0_3": 1636474914.6121478,
        "leaf_3_0_4": 1636474914.6284986,
        "leaf_3_0_5": 1636474914.6392264,
        "leaf_3_0_6": 1636474914.679649,
        "leaf_3_0_7": 1636474914.6973085,
        "leaf_3_0_8": 1636474914.7149553,
        "leaf_3_0_9": 1636474914.7359567,
        "leaf_4_0_1": 1636474914.7498364,
        "leaf_4_0_10": 1636474914.8033254,
        "leaf_4_0_2": 1636474915.9590569,
        "leaf_4_0_3": 1636474914.8397923,
        "leaf_4_0_4": 1636474914.8540971,
        "leaf_4_0_5": 1636474914.9157734,
        "leaf_4_0_6": 1636474914.9387958,
        "leaf_4_0_7": 1636474914.9490283,
        "leaf_4_0_8": 1636474914.9566739,
        "leaf_4_0_9": 1636474914.6890981,
        "spine_1_1_1": 1636474914.7005076,
        "spine_1_1_10": 1636474914.711831,
        "spine_1_1_2": 1636474914.723403,
        "spine_1_1_3": 1636474914.738949,
        "spine_1_1_4": 1636474914.74948,
        "spine_1_1_5": 1636474915.906137,
        "spine_1_1_6": 1636474914.8083913,
        "spine_1_1_7": 1636474914.8243675,
        "spine_1_1_8": 1636474914.8384154,
        "spine_1_1_9": 1636474914.8529043,
        "spine_2_1_1": 1636474914.9190497,
        "spine_2_1_10": 1636474914.94861,
        "spine_2_1_2": 1636474914.9550269,
        "spine_2_1_3": 1636474914.9679937,
        "spine_2_1_4": 1636474914.9763672,
        "spine_2_1_5": 1636474914.9936168,
        "spine_2_1_6": 1636474915.0600226,
        "spine_2_1_7": 1636474915.0749147,
        "spine_2_1_8": 1636474915.0861049,
        "spine_2_1_9": 1636474916.2416322,
        "spine_3_1_1": 1636474915.180958,
        "spine_3_1_10": 1636474916.3449185,
        "spine_3_1_2": 1636474916.380456,
        "spine_3_1_3": 1636474915.2877333,
        "spine_3_1_4": 1636474915.3110182,
        "spine_3_1_5": 1636474914.9723697,
        "spine_3_1_6": 1636474914.9784896,
        "spine_3_1_7": 1636474915.010067,
        "spine_3_1_8": 1636474915.0789235,
        "spine_3_1_9": 1636474916.2249002,
        "spine_4_1_1": 1636474916.2805266,
        "spine_4_1_10": 1636474915.1772385,
        "spine_4_1_2": 1636474915.1964989,
        "spine_4_1_3": 1636474915.243723,
        "spine_4_1_4": 1636474915.2810252,
        "spine_4_1_5": 1636474915.287986,
        "spine_4_1_6": 1636474915.3087049,
        "spine_4_1_7": 1636474915.386628,
        "spine_4_1_8": 1636474915.396583,
        "spine_4_1_9": 1636474915.4292235,
        "tof_1_2_1": 1636474916.5783658,
        "tof_1_2_10": 1636474915.469568,
        "tof_1_2_2": 1636474915.5134473,
        "tof_1_2_3": 1636474915.5262933,
        "tof_1_2_4": 1636474915.5395322,
        "tof_1_2_5": 1636474915.549969,
        "tof_1_2_6": 1636474915.5624907,
        "tof_1_2_7": 1636474915.595652,
        "tof_1_2_8": 1636474915.6212,
        "tof_1_2_9": 1636474915.642826,
        "tof_2_2_1": 1636474915.649621,
        "tof_2_2_10": 1636474915.397017,
        "tof_2_2_2": 1636474916.5567307,
        "tof_2_2_3": 1636474915.4358995,
        "tof_2_2_4": 1636474915.4434984,
        "tof_2_2_5": 1636474916.6027153,
        "tof_2_2_6": 1636474915.5111074,
        "tof_2_2_7": 1636474915.5230424,
        "tof_2_2_8": 1636474916.6717255,
        "tof_2_2_9": 1636474915.5437229
    },
    "recover_time": {
        "leaf_1_0_1": 1636474985.0608478,
        "leaf_1_0_10": 1636474985.0790582,
        "leaf_1_0_2": 1636474985.0906255,
        "leaf_1_0_3": 1636474985.1021543,
        "leaf_1_0_4": 1636474985.1184845,
        "leaf_1_0_5": 1636474985.1300592,
        "leaf_1_0_6": 1636474985.1414492,
        "leaf_1_0_7": 1636474985.1548045,
        "leaf_1_0_8": 1636474985.170324,
        "leaf_1_0_9": 1636474985.1853762,
        "leaf_2_0_1": 1636474985.19864,
        "leaf_2_0_10": 1636474986.3466601,
        "leaf_2_0_2": 1636474986.3533046,
        "leaf_2_0_3": 1636474986.1974707,
        "leaf_2_0_4": 1636474985.0786712,
        "leaf_2_0_5": 1636474985.088573,
        "leaf_2_0_6": 1636474985.0971918,
        "leaf_2_0_7": 1636474985.1136987,
        "leaf_2_0_8": 1636474985.1290967,
        "leaf_2_0_9": 1636474986.2801979,
        "leaf_3_0_1": 1636474985.1668115,
        "leaf_3_0_10": 1636474985.1765065,
        "leaf_3_0_2": 1636474986.3204443,
        "leaf_3_0_3": 1636474985.1917057,
        "leaf_3_0_4": 1636474985.2016432,
        "leaf_3_0_5": 1636474985.2166355,
        "leaf_3_0_6": 1636474985.2282765,
        "leaf_3_0_7": 1636474985.235487,
        "leaf_3_0_8": 1636474985.2602234,
        "leaf_3_0_9": 1636474985.268813,
        "leaf_4_0_1": 1636474985.2808208,
        "leaf_4_0_10": 1636474985.2892919,
        "leaf_4_0_2": 1636474986.4376638,
        "leaf_4_0_3": 1636474985.321397,
        "leaf_4_0_4": 1636474985.329416,
        "leaf_4_0_5": 1636474985.337644,
        "leaf_4_0_6": 1636474985.3738134,
        "leaf_4_0_7": 1636474985.3925688,
        "leaf_4_0_8": 1636474985.401374,
        "leaf_4_0_9": 1636474985.2306685,
        "spine_1_1_1": 1636474985.2455826,
        "spine_1_1_10": 1636474985.259465,
        "spine_1_1_2": 1636474985.267651,
        "spine_1_1_3": 1636474985.279001,
        "spine_1_1_4": 1636474985.28443,
        "spine_1_1_5": 1636474986.4354784,
        "spine_1_1_6": 1636474985.3062658,
        "spine_1_1_7": 1636474985.3265038,
        "spine_1_1_8": 1636474985.334489,
        "spine_1_1_9": 1636474985.372517,
        "spine_2_1_1": 1636474985.3836772,
        "spine_2_1_10": 1636474985.4012523,
        "spine_2_1_2": 1636474985.4102643,
        "spine_2_1_3": 1636474985.4329436,
        "spine_2_1_4": 1636474985.440717,
        "spine_2_1_5": 1636474985.4764109,
        "spine_2_1_6": 1636474985.5129294,
        "spine_2_1_7": 1636474985.5305922,
        "spine_2_1_8": 1636474985.544422,
        "spine_2_1_9": 1636474986.689719,
        "spine_3_1_1": 1636474985.563158,
        "spine_3_1_10": 1636474986.7184308,
        "spine_3_1_2": 1636474986.7308087,
        "spine_3_1_3": 1636474985.6141794,
        "spine_3_1_4": 1636474985.6254077,
        "spine_3_1_5": 1636474985.4142504,
        "spine_3_1_6": 1636474985.4337826,
        "spine_3_1_7": 1636474985.444514,
        "spine_3_1_8": 1636474985.4748697,
        "spine_3_1_9": 1636474986.637769,
        "spine_4_1_1": 1636474986.6494343,
        "spine_4_1_10": 1636474985.5209248,
        "spine_4_1_2": 1636474985.530952,
        "spine_4_1_3": 1636474985.5398638,
        "spine_4_1_4": 1636474985.5548575,
        "spine_4_1_5": 1636474985.5656066,
        "spine_4_1_6": 1636474985.5806315,
        "spine_4_1_7": 1636474985.5904925,
        "spine_4_1_8": 1636474985.6041765,
        "spine_4_1_9": 1636474985.6204393,
        "tof_1_2_10": 1636474985.631254,
        "tof_1_2_2": 1636474985.6393702,
        "tof_1_2_3": 1636474985.6637828,
        "tof_1_2_4": 1636474985.6768563,
        "tof_1_2_5": 1636474985.6981633,
        "tof_1_2_6": 1636474985.7065835,
        "tof_1_2_7": 1636474985.715224,
        "tof_1_2_8": 1636474985.7320974,
        "tof_1_2_9": 1636474985.759158,
        "tof_2_2_1": 1636474985.7639952,
        "tof_2_2_10": 1636474985.7759943,
        "tof_2_2_2": 1636474986.7729044,
        "tof_2_2_3": 1636474985.6458416,
        "tof_2_2_4": 1636474985.6582859,
        "tof_2_2_5": 1636474986.8104074,
        "tof_2_2_6": 1636474985.6999269,
        "tof_2_2_7": 1636474985.7123957,
        "tof_2_2_8": 1636474986.8692,
        "tof_2_2_9": 1636474985.7413447,
        "tof_1_2_1": 1636475009.831519
    }
}