{
    "k_leaf": 8,
    "k_top": 8,
    "redundancy_factor": 8,
    "is_k8s": true,
    "machine_mac_addresses": {
        "leaf_1_0_1": {
            "net0": "fe:21:75:0e:bc:ca",
            "net1": "fe:38:a4:3c:11:20",
            "net2": "3a:34:2b:31:30:ce",
            "net3": "2a:a8:83:ae:19:1a",
            "net4": "c6:4a:c8:fd:10:4c",
            "net5": "4e:86:91:6c:5e:84",
            "net6": "8e:fc:7d:d0:8f:b0",
            "net7": "96:9c:f9:5f:d8:41",
            "net8": "d2:f3:53:72:82:a5"
        },
        "leaf_1_0_2": {
            "net0": "16:70:e5:de:9e:69",
            "net1": "0a:e6:ff:49:68:80",
            "net2": "8e:5a:ca:05:f4:e8",
            "net3": "12:51:00:35:94:d8",
            "net4": "fa:e0:40:79:b1:68",
            "net5": "82:b2:da:71:19:85",
            "net6": "be:90:50:4f:24:6e",
            "net7": "6e:8f:4a:0b:19:51",
            "net8": "b6:3e:20:7b:4d:0c"
        },
        "leaf_1_0_3": {
            "net0": "52:87:12:4f:c9:08",
            "net1": "fe:09:e4:11:d0:ba",
            "net2": "56:b8:d1:2a:15:72",
            "net3": "ee:1d:48:84:bb:25",
            "net4": "7a:ef:dd:15:c2:d2",
            "net5": "92:c1:d7:74:01:2e",
            "net6": "52:f1:ac:20:1c:8d",
            "net7": "e2:24:14:6d:08:08",
            "net8": "d6:98:54:24:65:91"
        },
        "leaf_1_0_4": {
            "net0": "b2:83:ac:13:78:fd",
            "net1": "ee:61:48:47:02:c3",
            "net2": "d6:e3:3e:e8:ea:3f",
            "net3": "62:db:49:00:dc:78",
            "net4": "3a:43:56:08:7f:ec",
            "net5": "4a:f2:38:f2:c4:1a",
            "net6": "3a:ac:12:72:8d:17",
            "net7": "a2:30:b1:c7:ad:69",
            "net8": "fe:13:e9:98:04:ca"
        },
        "leaf_1_0_5": {
            "net0": "da:b5:e4:fe:aa:49",
            "net1": "aa:06:c0:5d:35:b1",
            "net2": "e6:c7:9a:12:69:60",
            "net3": "52:04:49:8b:04:28",
            "net4": "22:71:7f:67:dc:f8",
            "net5": "2e:5e:ed:fc:e3:5f",
            "net6": "96:0b:53:6c:9a:91",
            "net7": "be:18:ed:f8:d0:84",
            "net8": "8e:2c:bc:c8:9c:19"
        },
        "leaf_1_0_6": {
            "net0": "32:96:4e:fa:2e:b6",
            "net1": "1e:11:5a:96:d2:38",
            "net2": "be:e7:d1:3d:48:5d",
            "net3": "0a:51:9a:bc:92:f8",
            "net4": "46:ad:2d:c8:41:d7",
            "net5": "b2:63:c5:9f:2a:60",
            "net6": "66:be:b8:4d:54:c0",
            "net7": "62:8b:ec:c3:1d:1f",
            "net8": "fa:82:8f:11:f0:f0"
        },
        "leaf_1_0_7": {
            "net0": "62:05:63:9b:96:d1",
            "net1": "f6:f3:9a:b6:a3:df",
            "net2": "fa:22:1d:a7:ac:2d",
            "net3": "6a:c6:9c:bf:49:67",
            "net4": "b2:0e:85:00:3d:1c",
            "net5": "62:72:15:f1:21:37",
            "net6": "86:0a:a0:48:34:aa",
            "net7": "4e:f9:96:0d:ee:4a",
            "net8": "56:49:9f:4c:2c:f0"
        },
        "leaf_1_0_8": {
            "net0": "36:eb:c0:fc:a1:f3",
            "net1": "52:16:a3:2e:bb:a2",
            "net2": "8e:f1:41:b0:e7:b3",
            "net3": "16:1d:e1:44:45:7f",
            "net4": "8e:98:8c:5a:0e:d0",
            "net5": "d2:92:d8:0e:0c:28",
            "net6": "ae:a9:4c:2f:e0:f2",
            "net7": "b6:32:e2:fb:d3:d9",
            "net8": "0e:59:72:52:8d:b7"
        },
        "leaf_2_0_1": {
            "net0": "92:38:dd:8c:05:39",
            "net1": "26:49:3a:f4:ad:1d",
            "net2": "72:e7:ea:e9:fa:b9",
            "net3": "82:f6:3f:b5:a5:e8",
            "net4": "12:8a:9a:a9:63:5b",
            "net5": "26:a0:c2:44:a9:32",
            "net6": "6a:fc:6c:22:d1:74",
            "net7": "0e:fe:8b:1c:39:f1",
            "net8": "82:ab:51:f2:fb:75"
        },
        "leaf_2_0_2": {
            "net0": "6a:7a:ac:08:52:d4",
            "net1": "4e:83:1d:6d:c9:30",
            "net2": "82:a1:f8:e3:3d:23",
            "net3": "d2:a0:08:a2:c6:f0",
            "net4": "f6:0d:11:84:1c:04",
            "net5": "6e:af:c7:9f:f8:c3",
            "net6": "6a:3d:40:bb:d9:1d",
            "net7": "36:da:2e:d8:e0:94",
            "net8": "8e:62:7a:a8:27:19"
        },
        "leaf_2_0_3": {
            "net0": "3e:50:01:14:e7:2c",
            "net1": "c6:45:6a:9a:d9:e7",
            "net2": "1e:c4:66:f4:20:09",
            "net3": "7a:5a:10:32:1d:9f",
            "net4": "d2:18:17:2b:71:2e",
            "net5": "a6:6e:3b:88:e0:c3",
            "net6": "de:46:d8:f1:5b:ce",
            "net7": "be:42:69:ad:31:6a",
            "net8": "de:1f:c4:ca:4b:e5"
        },
        "leaf_2_0_4": {
            "net0": "7e:86:ef:15:93:ce",
            "net1": "0a:e7:f3:04:c5:d9",
            "net2": "f2:11:f5:60:64:52",
            "net3": "e2:bb:95:ac:25:a3",
            "net4": "ba:b1:b8:d4:87:5e",
            "net5": "d6:bf:5d:f2:fb:cf",
            "net6": "2a:aa:71:43:7d:c9",
            "net7": "0a:be:a8:43:c4:2f",
            "net8": "0a:e1:e5:46:73:1c"
        },
        "leaf_2_0_5": {
            "net0": "ae:f1:e1:3c:72:47",
            "net1": "8a:9b:8d:61:41:c2",
            "net2": "6a:10:2d:b5:0a:87",
            "net3": "a2:32:09:bd:6d:70",
            "net4": "12:41:c9:49:a8:72",
            "net5": "ce:11:17:cb:5f:7d",
            "net6": "7e:1d:8c:7d:da:73",
            "net7": "5a:95:35:c6:f5:46",
            "net8": "7a:fc:36:ea:47:8f"
        },
        "leaf_2_0_6": {
            "net0": "be:3c:8c:05:25:68",
            "net1": "b2:03:d9:55:36:35",
            "net2": "22:e2:52:5d:b0:25",
            "net3": "fa:08:20:6f:b1:ae",
            "net4": "6a:a7:bd:0c:a8:57",
            "net5": "82:cd:2f:a3:79:fb",
            "net6": "4a:ca:d2:19:19:5e",
            "net7": "ae:3d:a8:1e:e2:fb",
            "net8": "6e:9a:eb:a5:3a:08"
        },
        "leaf_2_0_7": {
            "net0": "02:f6:f6:e7:cc:c4",
            "net1": "ba:9a:d4:42:09:cc",
            "net2": "22:42:39:d3:9b:36",
            "net3": "b2:dc:1d:ce:34:20",
            "net4": "3a:a6:a1:22:98:78",
            "net5": "ce:86:d5:d2:21:aa",
            "net6": "d2:43:f3:9a:73:dd",
            "net7": "72:44:36:e2:e8:f8",
            "net8": "0e:56:fd:c7:52:7d"
        },
        "leaf_2_0_8": {
            "net0": "32:b2:e2:9d:d1:08",
            "net1": "02:73:c0:8b:d7:c6",
            "net2": "76:c2:94:98:c0:e6",
            "net3": "b2:51:e0:c5:24:59",
            "net4": "6e:4a:f6:24:c7:18",
            "net5": "0e:27:0c:94:2c:ac",
            "net6": "3e:80:88:c6:13:3b",
            "net7": "ce:80:bd:a0:f5:ca",
            "net8": "fe:03:65:d3:6e:6a"
        },
        "spine_1_1_1": {
            "net0": "7a:ce:1e:4b:76:aa",
            "net1": "02:91:e7:06:68:c6",
            "net10": "2a:33:7e:d3:0f:56",
            "net11": "2a:aa:76:eb:66:44",
            "net12": "c2:55:56:90:c7:81",
            "net13": "12:5c:34:b6:1e:bc",
            "net14": "22:29:3c:05:ec:68",
            "net15": "f6:b7:f8:84:70:ee",
            "net2": "72:0c:87:b8:bc:85",
            "net3": "3a:61:d5:77:4b:84",
            "net4": "86:f5:9f:c7:19:c2",
            "net5": "7e:d0:e5:3b:c0:98",
            "net6": "fe:89:f6:d4:4f:08",
            "net7": "ba:23:55:cd:bf:52",
            "net8": "22:d3:c5:54:0d:0f",
            "net9": "ee:5a:a8:55:03:5d"
        },
        "spine_1_1_2": {
            "net0": "16:e1:b4:79:73:07",
            "net1": "16:41:aa:46:53:6e",
            "net10": "d6:82:cc:ad:6a:77",
            "net11": "4e:92:1b:d0:54:b4",
            "net12": "16:a9:61:23:31:8f",
            "net13": "62:4f:ef:ae:8a:fa",
            "net14": "f6:eb:03:fd:13:67",
            "net15": "ee:09:e8:69:b1:af",
            "net2": "82:86:2d:d7:2a:a8",
            "net3": "9a:b1:7d:7d:c7:29",
            "net4": "d2:66:31:a4:58:84",
            "net5": "52:48:a1:ae:94:b1",
            "net6": "06:83:97:5a:1e:30",
            "net7": "8a:2d:a7:22:66:c7",
            "net8": "2a:ad:dd:dd:ed:bf",
            "net9": "52:e3:99:de:00:72"
        },
        "spine_1_1_3": {
            "net0": "3e:92:66:87:3c:07",
            "net1": "b6:10:88:b1:6b:40",
            "net10": "46:5c:ae:d9:bb:89",
            "net11": "3a:77:0f:61:4a:d5",
            "net12": "36:c6:11:28:10:e3",
            "net13": "8e:90:fe:c8:13:de",
            "net14": "2e:2f:07:50:a3:d0",
            "net15": "ba:ac:59:7f:e4:e0",
            "net2": "ba:1a:98:9a:05:83",
            "net3": "46:0d:c6:d8:76:b2",
            "net4": "6a:59:52:8d:82:0c",
            "net5": "66:a4:f6:f4:e0:46",
            "net6": "7a:42:1e:6c:62:b4",
            "net7": "86:f5:db:00:85:e0",
            "net8": "e6:6f:48:0c:16:24",
            "net9": "aa:b5:e7:cc:2f:a8"
        },
        "spine_1_1_4": {
            "net0": "96:8e:58:5b:85:27",
            "net1": "b6:ff:8f:8d:dd:f9",
            "net10": "d2:60:12:02:38:fa",
            "net11": "16:c0:13:c9:b5:eb",
            "net12": "86:ce:f8:04:dd:1c",
            "net13": "fe:60:ad:66:4e:40",
            "net14": "e6:a4:94:a3:9c:57",
            "net15": "66:59:50:0a:64:8a",
            "net2": "96:78:d8:ca:e6:a2",
            "net3": "ba:75:40:cd:d8:36",
            "net4": "3a:cd:2e:cd:83:af",
            "net5": "26:a7:fd:85:ef:1f",
            "net6": "1a:f9:7b:fe:31:e5",
            "net7": "d6:9a:f9:9d:82:09",
            "net8": "86:ee:fe:30:ac:70",
            "net9": "8a:4f:59:2b:8c:5c"
        },
        "spine_1_1_5": {
            "net0": "fa:77:6e:50:87:40",
            "net1": "e2:f5:4b:ac:59:55",
            "net10": "9a:4b:89:c2:bb:c4",
            "net11": "56:f6:89:5e:4d:92",
            "net12": "06:b9:1e:8f:f0:04",
            "net13": "4e:ea:83:88:77:4f",
            "net14": "2a:b5:83:5d:bd:ce",
            "net15": "2a:73:64:c2:16:fc",
            "net2": "7e:b2:c3:16:fe:db",
            "net3": "02:4f:d0:5e:22:0a",
            "net4": "ba:92:22:1b:96:9f",
            "net5": "2a:c2:6c:ab:d2:53",
            "net6": "92:b6:12:0d:bc:a3",
            "net7": "72:4a:ae:a3:a3:69",
            "net8": "5e:2c:09:41:82:b0",
            "net9": "72:83:71:28:34:f1"
        },
        "spine_1_1_6": {
            "net0": "2e:df:a4:a9:82:5d",
            "net1": "4e:b6:8a:d7:78:80",
            "net10": "52:2c:48:43:e9:d9",
            "net11": "ea:21:dc:01:7f:7a",
            "net12": "2a:c6:4c:dd:42:67",
            "net13": "ee:88:a8:aa:81:e3",
            "net14": "ae:cf:e3:bd:0e:96",
            "net15": "3e:6b:64:12:d9:cc",
            "net2": "8a:66:b7:2c:08:c1",
            "net3": "72:64:bb:29:86:4a",
            "net4": "ea:10:aa:f1:c2:28",
            "net5": "f6:45:1b:13:54:33",
            "net6": "c2:53:3e:43:b3:7f",
            "net7": "0a:ce:aa:a7:db:26",
            "net8": "aa:6d:0d:d6:19:77",
            "net9": "8a:58:ab:1f:d3:21"
        },
        "spine_1_1_7": {
            "net0": "b6:3f:8e:f4:a3:f5",
            "net1": "62:33:d4:4f:64:6e",
            "net10": "de:42:6b:ab:64:57",
            "net11": "7e:03:b5:0b:dc:d3",
            "net12": "3a:ce:4b:bf:63:ec",
            "net13": "c6:3d:cf:2e:dd:98",
            "net14": "8e:8f:fd:a0:b1:02",
            "net15": "16:d9:c7:7d:cb:04",
            "net2": "0a:72:09:9f:a6:a6",
            "net3": "5a:69:e8:08:2a:c7",
            "net4": "26:18:4e:15:06:41",
            "net5": "8a:03:49:2f:77:cd",
            "net6": "16:13:1a:1a:19:9f",
            "net7": "8e:50:9c:0c:45:eb",
            "net8": "7e:96:fe:bd:d8:56",
            "net9": "82:20:39:75:cf:de"
        },
        "spine_1_1_8": {
            "net0": "c2:b7:bf:a8:4e:0b",
            "net1": "62:b3:71:30:26:65",
            "net10": "36:b4:73:dd:c2:99",
            "net11": "be:ba:52:eb:33:69",
            "net12": "fa:a1:7d:0f:a8:6e",
            "net13": "ae:64:f8:68:28:2b",
            "net14": "36:12:ce:27:e2:1c",
            "net15": "0e:c1:62:2a:82:27",
            "net2": "4e:0a:c8:b2:c0:d2",
            "net3": "2a:f5:48:6d:2e:8a",
            "net4": "96:b6:dd:e4:e7:97",
            "net5": "9e:42:57:60:3d:b6",
            "net6": "ca:b7:10:f6:ca:fd",
            "net7": "42:d7:8c:32:ac:b8",
            "net8": "1a:28:8d:1a:67:c3",
            "net9": "36:c2:b6:09:d3:6f"
        },
        "spine_2_1_1": {
            "net0": "a2:34:47:d1:8d:30",
            "net1": "e2:45:4a:3f:9b:e6",
            "net10": "7e:e2:65:ab:fe:d9",
            "net11": "42:9c:45:d4:34:56",
            "net12": "76:1c:25:82:ae:d9",
            "net13": "ee:38:54:4e:47:4b",
            "net14": "12:2d:84:ab:14:70",
            "net15": "7a:df:e5:c9:fe:55",
            "net2": "96:ea:d4:c9:19:16",
            "net3": "5e:7c:29:8e:9c:4e",
            "net4": "2a:54:16:88:ce:9a",
            "net5": "ea:64:af:66:9c:6d",
            "net6": "fa:31:1f:60:08:92",
            "net7": "96:81:3d:e2:98:d1",
            "net8": "72:01:1f:61:b3:ab",
            "net9": "e6:b2:bd:79:a3:b9"
        },
        "spine_2_1_2": {
            "net0": "fa:aa:c1:19:4c:fe",
            "net1": "12:43:19:64:91:36",
            "net10": "b2:ac:e3:5b:db:77",
            "net11": "1e:6c:41:e5:11:34",
            "net12": "a2:5e:81:43:f4:47",
            "net13": "ca:ce:9f:84:bb:1c",
            "net14": "c2:81:be:31:c4:ff",
            "net15": "ce:1e:df:2f:f3:08",
            "net2": "fa:02:6f:11:0c:ed",
            "net3": "ba:2f:bd:aa:09:aa",
            "net4": "a2:00:ac:bf:77:f9",
            "net5": "b6:f8:65:de:07:dd",
            "net6": "16:38:75:5b:56:e9",
            "net7": "62:3d:7c:00:79:23",
            "net8": "d2:83:68:f3:ae:b2",
            "net9": "be:92:c5:45:89:17"
        },
        "spine_2_1_3": {
            "net0": "ba:e2:2d:c1:87:da",
            "net1": "7a:64:2c:8a:a1:75",
            "net10": "f6:1b:db:11:11:04",
            "net11": "3e:46:58:fd:88:29",
            "net12": "5a:69:60:90:93:3c",
            "net13": "5e:03:78:f7:bf:f3",
            "net14": "86:00:b5:38:f6:3f",
            "net15": "02:36:d8:2a:8d:7c",
            "net2": "d6:ba:fb:2e:1c:e2",
            "net3": "a6:29:34:00:ea:f7",
            "net4": "3e:ea:e1:42:70:00",
            "net5": "8e:49:78:76:6b:1f",
            "net6": "1e:4f:26:82:ca:36",
            "net7": "26:b6:a3:cb:12:16",
            "net8": "66:0d:c3:9e:fc:b7",
            "net9": "6e:2c:0d:de:63:3d"
        },
        "spine_2_1_4": {
            "net0": "ca:2f:85:96:88:e4",
            "net1": "7e:a9:07:59:01:0c",
            "net10": "6e:37:fa:3a:55:96",
            "net11": "4a:c0:e7:c8:51:68",
            "net12": "22:d5:93:30:8c:1e",
            "net13": "42:76:d9:29:3a:4b",
            "net14": "ca:44:d3:e3:d9:f1",
            "net15": "9e:19:c9:57:ec:d1",
            "net2": "a2:49:c7:c1:a5:d5",
            "net3": "ba:a6:6c:0d:47:90",
            "net4": "de:31:ed:6d:0f:fc",
            "net5": "46:3a:8f:e3:e3:fa",
            "net6": "d6:ed:b3:5e:66:e1",
            "net7": "ee:2c:e4:73:3e:34",
            "net8": "a2:6f:25:3c:2e:8c",
            "net9": "2a:0d:55:4d:fb:ea"
        },
        "spine_2_1_5": {
            "net0": "0e:eb:2f:1f:33:6b",
            "net1": "2e:9d:80:ca:10:0d",
            "net10": "62:6c:74:ed:48:ea",
            "net11": "46:a0:e9:82:d4:39",
            "net12": "9e:1b:bd:c8:dd:28",
            "net13": "2a:a9:b9:ba:34:7b",
            "net14": "a6:ae:fc:e0:e4:9a",
            "net15": "ee:21:31:d4:63:59",
            "net2": "f6:5a:2c:ff:8b:94",
            "net3": "16:4c:fe:7f:54:41",
            "net4": "5a:d3:8c:fb:96:0c",
            "net5": "1a:67:4b:76:49:22",
            "net6": "d6:1a:fb:30:6a:5e",
            "net7": "6e:16:e5:5e:fc:c2",
            "net8": "0e:07:96:65:6a:bf",
            "net9": "92:8c:80:b2:da:75"
        },
        "spine_2_1_6": {
            "net0": "7e:62:81:27:15:5e",
            "net1": "fe:59:bc:e8:49:26",
            "net10": "be:c0:1a:c2:bf:2e",
            "net11": "46:c7:ef:a4:ad:f2",
            "net12": "a2:7b:21:d9:20:4a",
            "net13": "3e:64:d9:f1:96:b2",
            "net14": "36:a8:f8:2f:de:86",
            "net15": "be:86:55:45:6e:36",
            "net2": "52:5a:0b:bc:6a:4a",
            "net3": "0a:96:cd:2c:f7:38",
            "net4": "4a:1c:55:cc:c8:f9",
            "net5": "d6:23:a2:84:9f:a8",
            "net6": "36:57:5e:57:0a:10",
            "net7": "66:f3:cc:5c:08:fd",
            "net8": "f6:60:06:40:8e:df",
            "net9": "6e:9b:43:4d:2c:9c"
        },
        "spine_2_1_7": {
            "net0": "3a:52:57:52:a6:53",
            "net1": "1a:c9:80:54:19:52",
            "net10": "a6:2a:79:25:ce:9b",
            "net11": "72:07:40:c3:62:01",
            "net12": "f6:6a:21:a9:7c:1f",
            "net13": "32:84:9d:64:93:b5",
            "net14": "96:d9:76:de:3f:b7",
            "net15": "ee:6b:e3:e8:15:3c",
            "net2": "92:39:76:10:6c:ab",
            "net3": "6a:4e:41:2e:4d:8e",
            "net4": "02:00:7a:7c:cd:f8",
            "net5": "e6:f2:40:21:dd:00",
            "net6": "4e:0c:29:07:f9:4f",
            "net7": "92:74:25:b9:8e:d6",
            "net8": "b6:b8:b1:c0:8d:43",
            "net9": "46:32:29:80:b4:54"
        },
        "spine_2_1_8": {
            "net0": "0a:df:96:5c:84:22",
            "net1": "f2:df:c9:8c:98:04",
            "net10": "5e:64:62:88:09:d6",
            "net11": "f2:0d:1d:37:fe:8a",
            "net12": "9e:90:16:41:c2:03",
            "net13": "5a:84:64:6b:2a:63",
            "net14": "fa:ab:49:5a:4b:53",
            "net15": "72:64:60:86:a4:ac",
            "net2": "ea:c4:e7:5d:cd:69",
            "net3": "ce:b9:b8:f3:30:f3",
            "net4": "22:8f:cf:2f:32:b7",
            "net5": "d6:7a:31:15:52:31",
            "net6": "16:a8:eb:76:36:c2",
            "net7": "be:d0:ad:fc:fc:8d",
            "net8": "02:e6:90:a4:96:12",
            "net9": "4e:dd:84:d7:df:63"
        },
        "tof_1_2_1": {
            "net0": "66:ef:82:53:18:0c",
            "net1": "12:11:fd:f5:0d:58",
            "net10": "3e:e9:85:1d:ee:5e",
            "net11": "ca:a9:d4:7d:eb:84",
            "net12": "02:00:1f:f7:85:67",
            "net13": "96:5e:f4:36:b1:a2",
            "net14": "e6:d2:f3:da:32:fa",
            "net15": "6a:0e:fd:96:e9:26",
            "net2": "66:37:a5:73:86:85",
            "net3": "0a:fa:fe:28:c4:6b",
            "net4": "2a:58:69:4c:1f:93",
            "net5": "1e:01:bf:18:b2:0f",
            "net6": "36:18:53:65:49:35",
            "net7": "72:b5:ec:51:00:01",
            "net8": "5a:83:05:e3:08:20",
            "net9": "46:50:7f:1f:8b:8e"
        },
        "tof_1_2_2": {
            "net0": "96:97:dd:f4:e8:bb",
            "net1": "4a:e3:03:cb:c8:71",
            "net10": "7e:eb:65:42:23:5e",
            "net11": "fe:cb:5b:4a:28:99",
            "net12": "22:48:14:4c:0a:51",
            "net13": "ae:e8:a6:b5:08:e4",
            "net14": "7a:e8:6a:60:58:e7",
            "net15": "0e:64:42:e2:a5:2c",
            "net2": "be:93:8f:96:e6:25",
            "net3": "82:3b:68:ae:75:40",
            "net4": "6a:d9:34:d8:94:82",
            "net5": "de:fc:f3:a5:2a:29",
            "net6": "aa:54:8f:bc:22:0f",
            "net7": "22:93:18:8f:17:1a",
            "net8": "2a:6d:2e:0e:8a:17",
            "net9": "26:e1:11:e1:5b:71"
        },
        "tof_1_2_3": {
            "net0": "b2:26:66:7e:13:f9",
            "net1": "4e:ab:11:47:cb:9c",
            "net10": "6a:85:fc:cc:6c:ed",
            "net11": "f2:93:b7:eb:3c:fa",
            "net12": "6a:40:57:8d:56:45",
            "net13": "a6:7d:52:86:8a:94",
            "net14": "ee:83:78:19:c5:31",
            "net15": "56:1b:c4:a4:44:55",
            "net2": "fa:22:c9:ac:75:b1",
            "net3": "ba:b4:cf:80:d9:aa",
            "net4": "d6:5a:27:f8:73:f9",
            "net5": "92:44:84:b6:7a:dc",
            "net6": "9a:ad:3c:be:20:c8",
            "net7": "06:01:a5:25:1e:23",
            "net8": "ae:43:2f:ea:f4:24",
            "net9": "b2:78:4c:34:bd:2d"
        },
        "tof_1_2_4": {
            "net0": "ee:8c:39:81:a0:85",
            "net1": "36:cc:8d:66:93:39",
            "net10": "96:b3:6a:f4:3c:d1",
            "net11": "c6:a2:de:4d:e4:0a",
            "net12": "de:9e:2b:44:bc:99",
            "net13": "62:61:06:99:2a:43",
            "net14": "da:b4:37:7b:4b:8c",
            "net15": "7e:7e:31:58:ac:70",
            "net2": "f2:76:c8:98:6e:fb",
            "net3": "82:f0:86:f8:1d:ae",
            "net4": "7a:fb:36:e0:83:69",
            "net5": "26:6f:7e:47:8a:4d",
            "net6": "9e:88:51:5c:97:87",
            "net7": "0e:6a:a4:55:4b:44",
            "net8": "d2:41:36:e5:e6:70",
            "net9": "76:6c:31:a9:45:19"
        },
        "tof_1_2_5": {
            "net0": "a2:b6:8d:a5:95:87",
            "net1": "d6:0e:11:76:ad:b1",
            "net10": "02:b2:be:46:5b:e3",
            "net11": "96:da:2e:08:2a:0c",
            "net12": "e2:e8:f1:e0:3b:dd",
            "net13": "ea:63:da:8e:8f:42",
            "net14": "36:50:35:48:8d:b4",
            "net15": "9e:6c:aa:08:e7:90",
            "net2": "52:b5:8a:da:46:4c",
            "net3": "3e:95:02:e1:4e:99",
            "net4": "ee:66:04:c1:8f:75",
            "net5": "ce:3b:4a:e6:cb:e6",
            "net6": "8a:94:06:35:28:d1",
            "net7": "ea:61:c7:e7:60:92",
            "net8": "0e:d1:61:fe:f0:b0",
            "net9": "5e:b3:a6:ec:cd:15"
        },
        "tof_1_2_6": {
            "net0": "26:6c:67:49:6c:4f",
            "net1": "be:bf:a3:e3:18:68",
            "net10": "ce:62:8c:0b:be:a3",
            "net11": "0e:ee:4b:08:80:8a",
            "net12": "da:6c:b3:ae:d0:56",
            "net13": "12:cd:9c:8a:eb:7b",
            "net14": "c6:72:10:44:e5:e8",
            "net15": "da:08:4d:a6:fb:a9",
            "net2": "8a:55:fa:7c:99:a8",
            "net3": "e6:60:6b:b1:d6:88",
            "net4": "0e:92:03:5f:7d:8f",
            "net5": "b6:49:8b:19:84:02",
            "net6": "32:78:fd:4d:b5:31",
            "net7": "76:87:8c:62:dc:b6",
            "net8": "5e:d1:d1:33:86:c6",
            "net9": "de:69:a9:02:c8:cc"
        },
        "tof_1_2_7": {
            "net0": "a2:7f:58:42:f9:1e",
            "net1": "12:e0:8b:f7:72:d8",
            "net10": "2e:85:2c:87:1a:4e",
            "net11": "8e:24:55:84:2c:f5",
            "net12": "12:bf:ea:2e:e9:37",
            "net13": "92:f3:47:ec:9f:68",
            "net14": "d2:c4:9e:fc:15:e2",
            "net15": "62:ca:36:32:3d:41",
            "net2": "fe:bc:de:6e:e1:e2",
            "net3": "e6:ef:dc:d7:18:e5",
            "net4": "66:ae:92:9d:ec:5d",
            "net5": "4a:e7:96:1b:53:e6",
            "net6": "8e:a0:a0:0b:cf:c7",
            "net7": "16:46:d7:47:f0:3a",
            "net8": "d2:c7:ac:89:04:eb",
            "net9": "56:7b:43:74:28:05"
        },
        "tof_1_2_8": {
            "net0": "aa:0c:91:21:6d:a0",
            "net1": "26:72:75:91:fa:57",
            "net10": "0a:d4:55:be:b5:17",
            "net11": "32:a4:50:31:2c:ed",
            "net12": "1a:d5:a0:60:34:5d",
            "net13": "46:72:c0:64:9c:40",
            "net14": "86:57:46:b5:e1:bc",
            "net15": "5e:db:19:d7:4f:90",
            "net2": "5e:ae:d8:b3:5e:8d",
            "net3": "7e:ec:3d:21:9c:18",
            "net4": "c6:ce:4d:04:ab:95",
            "net5": "d2:75:24:ec:a5:5d",
            "net6": "de:43:a8:69:d6:fc",
            "net7": "b6:d3:af:ff:e9:df",
            "net8": "a2:4d:b7:aa:e8:b8",
            "net9": "4a:57:f7:d1:1d:c9"
        }
    },
    "failed_machine": "leaf_1_0_1",
    "failure_time": {
        "leaf_1_0_1": 1622567115.4875245,
        "leaf_1_0_2": 1622567115.4964557,
        "leaf_1_0_3": 1622567115.5077777,
        "leaf_1_0_4": 1622567115.5156937,
        "leaf_1_0_5": 1622567115.5246894,
        "leaf_1_0_6": 1622567115.4869063,
        "leaf_1_0_7": 1622567115.4947298,
        "leaf_1_0_8": 1622567115.5049117,
        "leaf_2_0_1": 1622567115.5105798,
        "leaf_2_0_2": 1622567115.5225334,
        "leaf_2_0_3": 1622567115.5361166,
        "leaf_2_0_4": 1622567115.5489118,
        "leaf_2_0_5": 1622567115.558044,
        "leaf_2_0_6": 1622567115.5740864,
        "leaf_2_0_7": 1622567115.58614,
        "leaf_2_0_8": 1622567115.5360434,
        "spine_1_1_1": 1622567115.5464928,
        "spine_1_1_2": 1622567115.5565677,
        "spine_1_1_3": 1622567115.5744212,
        "spine_1_1_4": 1622567115.5884764,
        "spine_1_1_5": 1622567115.5971255,
        "spine_1_1_6": 1622567115.608203,
        "spine_1_1_7": 1622567115.624395,
        "spine_1_1_8": 1622567115.6342719,
        "spine_2_1_1": 1622567115.6409247,
        "spine_2_1_2": 1622567115.5983317,
        "spine_2_1_3": 1622567115.6095948,
        "spine_2_1_4": 1622567115.6210535,
        "spine_2_1_5": 1622567115.6306512,
        "spine_2_1_6": 1622567115.637221,
        "spine_2_1_7": 1622567115.64944,
        "spine_2_1_8": 1622567115.6580584,
        "tof_1_2_1": 1622567115.6672776,
        "tof_1_2_2": 1622567115.683809,
        "tof_1_2_3": 1622567115.697001,
        "tof_1_2_4": 1622567115.650466,
        "tof_1_2_5": 1622567115.6644723,
        "tof_1_2_6": 1622567115.673003,
        "tof_1_2_7": 1622567115.6840422,
        "tof_1_2_8": 1622567115.696594
    }
}