{
    "description": "Scenario 6a: net0 link failure and recovery of leaf_1_0_1 with BGP",
    "k_leaf": 12,
    "k_top": 12,
    "redundancy_factor": 12,
    "is_k8s": true,
    "machine_mac_addresses": {
        "leaf_1_0_1": {
            "net0": "c6:d8:ab:67:5b:3f",
            "net1": "82:da:c1:d6:1b:d3",
            "net10": "e6:48:5f:af:86:30",
            "net11": "3e:9b:4b:05:65:00",
            "net12": "46:a3:1b:eb:35:5b",
            "net2": "52:b0:05:a4:a8:a9",
            "net3": "fa:db:fd:5d:d9:0d",
            "net4": "5e:87:37:ac:06:9b",
            "net5": "ce:69:34:7d:35:60",
            "net6": "ca:4f:6d:cf:bc:ef",
            "net7": "d2:0c:39:c6:8e:9c",
            "net8": "0a:47:76:67:8f:1d",
            "net9": "a2:46:1a:ab:60:18"
        },
        "leaf_1_0_10": {
            "net0": "6e:6e:d2:38:92:bd",
            "net1": "0a:1b:23:40:ee:d8",
            "net10": "fe:bb:65:31:45:f9",
            "net11": "b6:47:a8:3a:98:6c",
            "net12": "8e:c6:02:e4:35:40",
            "net2": "be:c3:52:20:56:25",
            "net3": "92:be:24:ea:0a:72",
            "net4": "6e:d9:c0:b7:d2:05",
            "net5": "d2:54:1e:43:a6:8c",
            "net6": "36:26:59:f3:4b:d6",
            "net7": "e2:5d:d2:e6:ef:af",
            "net8": "aa:05:5d:ac:a8:b2",
            "net9": "c6:fb:c3:73:22:2f"
        },
        "leaf_1_0_11": {
            "net0": "76:5a:fb:1b:10:5a",
            "net1": "c2:58:7e:3c:10:bb",
            "net10": "62:8f:d9:a4:74:db",
            "net11": "3e:ed:d6:d3:f8:13",
            "net12": "d2:06:70:37:5e:43",
            "net2": "0a:88:f2:5e:69:88",
            "net3": "e2:8b:7b:4d:06:97",
            "net4": "6a:1f:fe:e4:1d:8e",
            "net5": "5e:30:02:ce:54:fc",
            "net6": "9e:f0:16:c0:6b:22",
            "net7": "7e:3c:ae:61:df:1f",
            "net8": "2a:8b:f1:29:63:f6",
            "net9": "3a:12:a8:55:8d:18"
        },
        "leaf_1_0_12": {
            "net0": "2e:09:8a:8a:63:d0",
            "net1": "aa:7c:63:6d:44:4c",
            "net10": "6a:52:c8:53:b9:50",
            "net11": "12:67:3f:22:25:79",
            "net12": "5e:9c:e2:ff:cf:8b",
            "net2": "02:7c:db:7c:b4:d4",
            "net3": "0a:c3:46:80:3f:8d",
            "net4": "1a:ae:dd:51:96:c8",
            "net5": "2a:ec:59:79:1e:5f",
            "net6": "1a:d4:e1:54:77:2e",
            "net7": "5e:dd:e6:9c:b5:51",
            "net8": "d6:72:c4:e4:7f:84",
            "net9": "9a:db:87:3e:a6:2b"
        },
        "leaf_1_0_2": {
            "net0": "3a:ab:12:a3:91:f5",
            "net1": "32:19:50:86:c8:9f",
            "net10": "52:88:3c:34:21:53",
            "net11": "da:36:14:cb:f1:96",
            "net12": "8e:b2:03:61:a4:f1",
            "net2": "9e:13:31:5b:0f:32",
            "net3": "f6:cd:40:b1:e2:d6",
            "net4": "9a:f9:6d:db:c3:28",
            "net5": "da:ef:02:6f:23:89",
            "net6": "9a:66:3c:35:66:13",
            "net7": "5a:fd:dc:69:4e:ca",
            "net8": "5a:eb:ee:6d:49:ab",
            "net9": "fe:e7:a9:7a:73:b6"
        },
        "leaf_1_0_3": {
            "net0": "d6:25:5a:fc:4b:4f",
            "net1": "42:09:b0:43:de:f8",
            "net10": "46:35:cb:ee:f2:1a",
            "net11": "9e:72:81:d0:69:f3",
            "net12": "ce:de:3d:22:8e:92",
            "net2": "12:5f:92:bc:e4:77",
            "net3": "e6:56:d1:71:88:27",
            "net4": "ae:f9:1b:00:64:ed",
            "net5": "b2:65:65:f1:2c:4f",
            "net6": "0e:26:f5:34:94:46",
            "net7": "72:4a:18:6f:c1:6f",
            "net8": "0e:1a:33:1f:5f:20",
            "net9": "ca:45:7c:45:53:37"
        },
        "leaf_1_0_4": {
            "net0": "5e:e2:43:84:40:b0",
            "net1": "4a:65:23:bb:62:67",
            "net10": "4e:f6:72:dd:27:07",
            "net11": "f6:1c:65:54:87:55",
            "net12": "4a:ce:c2:e5:38:72",
            "net2": "8a:f3:e9:c5:dd:56",
            "net3": "12:9e:00:ae:ed:8f",
            "net4": "66:82:c9:be:55:b0",
            "net5": "9a:83:59:0d:7d:e3",
            "net6": "9e:3a:24:f4:92:26",
            "net7": "7e:60:7b:17:e7:a6",
            "net8": "2e:35:72:f8:02:61",
            "net9": "72:bc:55:76:b1:c7"
        },
        "leaf_1_0_5": {
            "net0": "c6:97:fd:57:17:77",
            "net1": "8e:4e:39:7f:dc:0d",
            "net10": "2a:97:ef:e7:cb:32",
            "net11": "72:81:f4:d2:f5:9d",
            "net12": "de:fa:50:4c:52:33",
            "net2": "9e:e4:87:22:15:22",
            "net3": "62:e8:77:59:bf:3a",
            "net4": "e2:27:8b:53:93:db",
            "net5": "82:cb:fa:51:a9:95",
            "net6": "22:82:ad:2c:4a:c3",
            "net7": "4a:be:87:a8:a4:e5",
            "net8": "f2:ce:50:c9:6c:9b",
            "net9": "ce:55:1d:6d:41:3e"
        },
        "leaf_1_0_6": {
            "net0": "4e:45:00:49:8f:12",
            "net1": "56:bc:67:f1:a1:50",
            "net10": "9a:32:f0:bd:e6:d1",
            "net11": "16:05:53:90:43:39",
            "net12": "1a:42:9b:4d:3e:5c",
            "net2": "f6:83:68:5f:d0:b7",
            "net3": "86:10:a8:5b:50:3d",
            "net4": "2e:8b:65:d9:1a:40",
            "net5": "6e:f9:be:fc:98:1f",
            "net6": "e6:8d:f3:85:94:97",
            "net7": "a2:6f:a1:94:c3:4a",
            "net8": "9a:ec:91:c2:56:7a",
            "net9": "b6:47:71:cf:de:81"
        },
        "leaf_1_0_7": {
            "net0": "22:9d:de:34:53:ae",
            "net1": "46:f7:87:cd:7f:a6",
            "net10": "46:2b:6e:57:30:f5",
            "net11": "52:f6:e6:89:9d:9f",
            "net12": "82:c8:3f:b0:15:6e",
            "net2": "62:97:56:20:62:73",
            "net3": "fa:88:4e:25:93:43",
            "net4": "1e:0a:f5:c4:9e:f6",
            "net5": "7a:99:1a:1f:b5:b7",
            "net6": "5e:f4:44:8b:1d:d3",
            "net7": "46:fb:f5:c2:10:05",
            "net8": "ea:25:6d:0d:d6:24",
            "net9": "ce:54:f6:98:13:27"
        },
        "leaf_1_0_8": {
            "net0": "42:96:37:29:ee:98",
            "net1": "2a:e4:0a:2b:74:c8",
            "net10": "06:68:b6:18:21:c2",
            "net11": "06:9c:2c:a5:5d:84",
            "net12": "f6:26:ab:66:8a:fc",
            "net2": "e2:26:8e:8a:b1:7a",
            "net3": "d6:f8:63:99:c8:3e",
            "net4": "ee:82:a9:cd:b7:79",
            "net5": "66:8f:88:91:25:bb",
            "net6": "f2:cf:16:eb:83:c5",
            "net7": "ea:92:27:43:e8:67",
            "net8": "02:02:46:28:72:24",
            "net9": "92:1e:56:1b:c3:b0"
        },
        "leaf_1_0_9": {
            "net0": "2e:e4:87:f6:14:a4",
            "net1": "ee:4a:a1:e5:bb:85",
            "net10": "96:59:35:0a:8d:27",
            "net11": "ce:ff:bd:6a:f0:e9",
            "net12": "b6:a9:6e:4c:1c:f2",
            "net2": "da:8a:ff:4b:df:a2",
            "net3": "96:42:d9:e3:f2:32",
            "net4": "b2:f0:47:78:a5:06",
            "net5": "16:88:4b:e0:63:5e",
            "net6": "f2:28:f5:85:2d:57",
            "net7": "5e:43:41:dc:47:83",
            "net8": "7a:1c:89:da:ab:09",
            "net9": "f6:d9:68:9c:3d:f5"
        },
        "leaf_2_0_1": {
            "net0": "6a:1f:87:9c:5a:82",
            "net1": "da:6e:2f:ef:a2:a5",
            "net10": "fe:25:55:44:ce:8e",
            "net11": "92:d8:6e:7a:80:9a",
            "net12": "b2:79:3f:0e:db:58",
            "net2": "52:0b:03:41:c6:0c",
            "net3": "1e:70:7e:a6:ca:e8",
            "net4": "1a:10:44:ff:4b:42",
            "net5": "c6:02:15:96:25:b6",
            "net6": "92:60:9b:c2:6b:15",
            "net7": "66:40:b2:91:b3:15",
            "net8": "ca:fd:d3:14:24:f4",
            "net9": "4e:73:09:69:a5:cc"
        },
        "leaf_2_0_10": {
            "net0": "6e:11:ce:34:1a:2a",
            "net1": "b6:9e:af:41:90:f6",
            "net10": "ea:f5:95:50:67:e8",
            "net11": "aa:a7:8d:8d:ad:7e",
            "net12": "9e:c3:72:36:a7:f5",
            "net2": "32:99:e4:ec:de:82",
            "net3": "32:f7:7c:e4:5d:95",
            "net4": "3e:a2:c9:b0:97:ed",
            "net5": "6a:3d:74:c0:b5:2c",
            "net6": "16:5f:76:b6:67:1c",
            "net7": "a2:8a:3e:40:57:dd",
            "net8": "fe:8c:87:02:60:94",
            "net9": "ce:e3:7e:2c:b8:3c"
        },
        "leaf_2_0_11": {
            "net0": "82:88:2d:1e:2d:13",
            "net1": "f6:82:1a:0a:4a:70",
            "net10": "8a:d1:dd:d8:61:46",
            "net11": "3a:b6:2c:e3:4e:2c",
            "net12": "56:1d:c2:9c:99:7e",
            "net2": "52:37:af:75:15:3f",
            "net3": "2a:83:0f:cd:a1:59",
            "net4": "fa:fc:6c:53:ea:29",
            "net5": "1e:d7:f1:00:2f:e3",
            "net6": "46:6f:b9:7c:b2:e0",
            "net7": "c6:31:f0:8a:40:0e",
            "net8": "7a:8e:f1:80:be:39",
            "net9": "26:eb:ae:d5:db:fa"
        },
        "leaf_2_0_12": {
            "net0": "aa:9c:e8:0f:ff:24",
            "net1": "7a:73:80:97:ff:47",
            "net10": "de:a4:5f:38:b4:eb",
            "net11": "52:56:ba:10:c6:3b",
            "net12": "c2:f7:84:90:ca:31",
            "net2": "72:fa:9c:2c:ae:2e",
            "net3": "b2:17:c8:02:84:b0",
            "net4": "aa:f6:8a:08:93:a6",
            "net5": "d2:33:a5:86:a9:f1",
            "net6": "ca:86:43:20:61:a3",
            "net7": "8a:32:f8:8c:95:95",
            "net8": "6e:da:1c:62:e0:76",
            "net9": "06:a1:e0:3a:88:f3"
        },
        "leaf_2_0_2": {
            "net0": "be:e5:62:9c:ab:10",
            "net1": "42:89:ed:19:3d:e1",
            "net10": "02:9c:aa:f2:94:b1",
            "net11": "02:02:c8:8d:14:d0",
            "net12": "7e:ea:a3:83:01:46",
            "net2": "86:65:74:d6:c6:82",
            "net3": "fe:82:3b:ba:cb:ab",
            "net4": "a6:5a:d7:22:69:5d",
            "net5": "66:0c:68:10:cd:6d",
            "net6": "1e:66:94:08:60:95",
            "net7": "96:56:88:b4:85:9a",
            "net8": "0e:d1:3c:16:d3:08",
            "net9": "26:2c:a6:c6:e8:67"
        },
        "leaf_2_0_3": {
            "net0": "e2:19:e5:98:3c:8b",
            "net1": "1a:68:66:8a:d6:07",
            "net10": "5a:44:28:99:af:5b",
            "net11": "66:47:28:21:4f:8b",
            "net12": "8e:d9:c5:19:33:a8",
            "net2": "22:17:d1:a7:00:af",
            "net3": "d2:fc:13:47:23:9f",
            "net4": "ca:1c:31:d5:28:84",
            "net5": "fe:77:1f:ad:5b:96",
            "net6": "e6:59:b9:5d:34:da",
            "net7": "6e:ca:08:b1:a0:96",
            "net8": "9a:7b:6b:dc:e1:b8",
            "net9": "16:60:45:bf:0b:d8"
        },
        "leaf_2_0_4": {
            "net0": "da:e0:f1:1a:6e:fa",
            "net1": "a6:25:f8:40:b9:36",
            "net10": "aa:4a:cf:21:24:34",
            "net11": "be:38:23:9f:77:84",
            "net12": "da:d5:90:98:ea:aa",
            "net2": "3e:71:7f:41:b3:fe",
            "net3": "be:12:8f:7d:32:6d",
            "net4": "06:69:71:70:38:4d",
            "net5": "76:a3:9a:cc:16:09",
            "net6": "fa:63:c2:5c:6f:bf",
            "net7": "4a:31:d0:60:23:79",
            "net8": "7a:ec:de:e5:0a:d4",
            "net9": "36:d8:72:da:99:fa"
        },
        "leaf_2_0_5": {
            "net0": "ce:0d:df:d8:69:20",
            "net1": "2a:74:0b:db:92:c9",
            "net10": "86:09:83:1a:08:03",
            "net11": "ea:7f:99:ac:b8:e7",
            "net12": "6e:7f:17:28:ba:81",
            "net2": "4a:55:78:56:db:38",
            "net3": "86:30:56:4d:81:62",
            "net4": "3a:1b:ff:fa:18:b0",
            "net5": "c2:e2:01:84:cd:9d",
            "net6": "82:25:7b:5d:3e:92",
            "net7": "06:a1:db:91:8f:ad",
            "net8": "32:a8:fc:99:8d:42",
            "net9": "da:c3:a2:2b:7b:cc"
        },
        "leaf_2_0_6": {
            "net0": "ba:9c:74:f7:27:75",
            "net1": "4a:72:d5:fd:87:a4",
            "net10": "ea:36:62:96:6c:3d",
            "net11": "b6:13:fe:fc:ff:61",
            "net12": "76:c2:fd:63:17:14",
            "net2": "92:8f:12:2b:8b:dd",
            "net3": "42:88:02:35:cf:59",
            "net4": "a6:46:4e:47:f2:01",
            "net5": "9e:40:9a:46:21:8c",
            "net6": "de:d9:3f:22:ea:3c",
            "net7": "c2:b7:c1:65:0a:c1",
            "net8": "a6:c2:86:9b:49:95",
            "net9": "2a:68:35:35:af:31"
        },
        "leaf_2_0_7": {
            "net0": "72:15:f7:a2:6d:eb",
            "net1": "62:c8:eb:3e:18:9b",
            "net10": "e2:04:20:9f:46:9c",
            "net11": "7e:e1:04:16:e4:4c",
            "net12": "66:d2:b9:9b:5b:be",
            "net2": "ca:de:35:ea:7e:5a",
            "net3": "5e:9e:6d:42:d9:3b",
            "net4": "9e:d2:b8:e5:77:ba",
            "net5": "d2:5f:84:1a:88:af",
            "net6": "c2:28:a0:ac:00:be",
            "net7": "16:76:db:e9:1f:02",
            "net8": "62:21:8a:f2:c4:cb",
            "net9": "0a:91:99:da:e7:a9"
        },
        "leaf_2_0_8": {
            "net0": "6a:46:91:d4:88:94",
            "net1": "be:39:af:b6:a3:65",
            "net10": "ea:ac:1e:12:68:47",
            "net11": "e2:8a:20:0b:5e:e0",
            "net12": "de:78:5e:a9:ad:6c",
            "net2": "c6:da:8f:38:da:4c",
            "net3": "8a:b9:fb:fc:8e:81",
            "net4": "3e:eb:5b:40:e7:db",
            "net5": "f6:44:bd:a0:01:3c",
            "net6": "b2:79:16:c0:d5:89",
            "net7": "42:b5:8b:40:07:e4",
            "net8": "8e:af:d2:a4:5d:38",
            "net9": "a6:0b:d4:37:6c:32"
        },
        "leaf_2_0_9": {
            "net0": "92:c4:57:89:59:c9",
            "net1": "be:9c:f1:f5:a3:bb",
            "net10": "7e:4e:98:41:fc:d0",
            "net11": "de:cd:92:fa:c9:85",
            "net12": "82:e2:11:1f:33:0b",
            "net2": "5e:82:5d:38:3e:66",
            "net3": "ae:7e:ef:c2:ff:9f",
            "net4": "3e:db:c6:1e:45:7a",
            "net5": "1e:7e:57:4c:a6:71",
            "net6": "86:7c:b6:e4:34:4a",
            "net7": "8e:ff:6b:1c:97:b2",
            "net8": "b6:23:dd:a5:57:71",
            "net9": "02:7c:03:d8:ee:5a"
        },
        "spine_1_1_1": {
            "net0": "e6:43:ca:d5:a0:0f",
            "net1": "a2:8d:6a:1b:92:fe",
            "net10": "5a:e3:22:d6:11:24",
            "net11": "72:2c:14:da:33:ec",
            "net12": "ae:75:d3:31:80:41",
            "net13": "ee:e8:9e:ab:da:24",
            "net14": "f6:84:22:33:65:70",
            "net15": "b6:50:35:ea:60:13",
            "net16": "ee:e9:40:ca:65:8f",
            "net17": "2e:a7:a3:83:53:f7",
            "net18": "66:59:4e:89:71:0f",
            "net19": "9a:db:5f:46:f7:62",
            "net2": "46:33:ff:07:33:95",
            "net20": "62:23:e9:2b:fc:3d",
            "net21": "96:79:31:0a:d2:06",
            "net22": "da:ac:82:69:ca:2e",
            "net23": "aa:35:88:8d:43:17",
            "net3": "b6:e1:11:aa:d2:f5",
            "net4": "46:1d:8a:7e:43:c9",
            "net5": "82:88:b6:5f:71:95",
            "net6": "c6:c3:80:83:ea:06",
            "net7": "12:d6:e9:d0:1b:20",
            "net8": "ca:ec:95:0e:cf:4f",
            "net9": "e6:ef:9d:59:ad:77"
        },
        "spine_1_1_10": {
            "net0": "82:2f:cc:3e:a0:47",
            "net1": "6a:e4:77:0c:09:c8",
            "net10": "9a:e6:07:4a:99:af",
            "net11": "06:ed:56:db:5b:84",
            "net12": "6e:26:47:60:5e:0f",
            "net13": "6a:22:46:b8:4e:88",
            "net14": "62:e8:8b:c8:23:b5",
            "net15": "c2:a5:ab:f9:5a:71",
            "net16": "72:91:02:04:2f:ae",
            "net17": "42:40:4b:6a:a3:4d",
            "net18": "f2:50:e5:ff:b3:f5",
            "net19": "82:33:30:96:b7:aa",
            "net2": "7a:4a:68:72:59:5a",
            "net20": "66:86:50:08:c7:c5",
            "net21": "96:a4:31:b4:cf:ea",
            "net22": "e6:70:21:cb:28:a5",
            "net23": "d2:80:ff:57:ea:85",
            "net3": "36:1d:0c:1a:cc:73",
            "net4": "12:53:01:09:91:6b",
            "net5": "b6:a5:01:99:b1:1c",
            "net6": "7a:bd:c6:65:79:40",
            "net7": "ca:b8:b9:c9:bb:f0",
            "net8": "c6:d4:d2:72:0f:6c",
            "net9": "a2:e2:d8:18:b8:1c"
        },
        "spine_1_1_11": {
            "net0": "5a:7a:5b:7c:ca:11",
            "net1": "d2:13:db:ba:2a:18",
            "net10": "42:46:e8:b8:1e:08",
            "net11": "36:ca:df:80:73:01",
            "net12": "de:49:21:44:d6:f0",
            "net13": "ce:6a:11:48:4e:9e",
            "net14": "7a:08:34:af:5f:83",
            "net15": "7e:eb:71:04:03:45",
            "net16": "12:40:7c:29:36:a0",
            "net17": "fe:30:50:d7:fe:93",
            "net18": "42:91:42:8c:3c:7d",
            "net19": "0a:20:6e:d2:86:5b",
            "net2": "36:e1:ae:ef:85:2a",
            "net20": "de:80:b1:93:b4:72",
            "net21": "3a:05:d2:6d:c9:fb",
            "net22": "ca:ec:a2:c9:2b:05",
            "net23": "3a:77:99:68:70:31",
            "net3": "ba:92:b3:72:c9:f5",
            "net4": "66:4e:8f:9c:78:67",
            "net5": "32:71:b7:ba:ab:7b",
            "net6": "8e:dd:1a:3e:51:ad",
            "net7": "3a:da:3c:bb:cb:0c",
            "net8": "9a:a0:7d:14:d3:77",
            "net9": "6e:f7:5f:a8:44:e6"
        },
        "spine_1_1_12": {
            "net0": "ca:28:53:12:4e:60",
            "net1": "32:59:3b:9d:02:b0",
            "net10": "1e:16:a9:e4:90:14",
            "net11": "d2:eb:38:2a:55:e4",
            "net12": "ea:de:07:14:41:d5",
            "net13": "d2:54:34:88:32:37",
            "net14": "9e:84:46:e1:89:3e",
            "net15": "f6:f2:24:9e:51:67",
            "net16": "2e:bd:32:d4:b6:05",
            "net17": "8e:e4:02:7d:f8:e9",
            "net18": "a6:0a:3d:85:cb:39",
            "net19": "46:05:a9:b5:83:98",
            "net2": "96:0d:c5:cc:1c:08",
            "net20": "e2:69:82:f6:68:75",
            "net21": "d6:cb:d6:78:72:af",
            "net22": "6a:36:57:ba:2c:1f",
            "net23": "da:7a:53:fe:b9:17",
            "net3": "c6:fc:d8:ec:17:35",
            "net4": "0e:76:25:8e:a9:5d",
            "net5": "02:43:08:7c:9f:e8",
            "net6": "e6:20:b1:09:7c:e3",
            "net7": "e2:09:89:44:a0:1e",
            "net8": "8a:f8:20:30:1a:9b",
            "net9": "4e:6c:81:b5:f4:47"
        },
        "spine_1_1_2": {
            "net0": "3e:5d:30:eb:28:cf",
            "net1": "5e:87:f3:6d:38:6c",
            "net10": "e2:cb:75:1e:98:90",
            "net11": "ba:76:99:16:ba:68",
            "net12": "4e:df:0d:af:d7:61",
            "net13": "e2:ec:ef:73:25:36",
            "net14": "3a:79:c1:0f:01:d9",
            "net15": "96:7a:87:22:57:83",
            "net16": "26:99:ba:9e:65:11",
            "net17": "02:62:16:4a:4b:95",
            "net18": "02:bb:1d:79:12:2f",
            "net19": "6a:46:eb:02:81:6a",
            "net2": "f2:8e:2a:c3:73:e7",
            "net20": "ae:81:26:ad:d2:80",
            "net21": "22:3a:ab:f7:e4:31",
            "net22": "c6:d2:78:07:02:19",
            "net23": "56:4b:b1:7b:87:3e",
            "net3": "76:15:d2:0e:17:15",
            "net4": "d2:37:f7:d2:b2:61",
            "net5": "fa:d1:fe:0d:07:c9",
            "net6": "ce:a1:ea:07:37:a6",
            "net7": "96:e9:eb:61:b2:ac",
            "net8": "8a:74:59:a8:da:71",
            "net9": "0a:46:65:d0:d7:ef"
        },
        "spine_1_1_3": {
            "net0": "fa:4c:5b:66:3d:3c",
            "net1": "ae:e6:28:e1:45:aa",
            "net10": "22:c9:c8:d9:2f:01",
            "net11": "52:67:e3:83:7e:2c",
            "net12": "de:91:d6:b9:f7:8c",
            "net13": "b6:d8:b8:47:bb:19",
            "net14": "b6:ce:41:46:36:4a",
            "net15": "8a:2b:34:b1:56:7d",
            "net16": "7e:8e:ab:37:c8:af",
            "net17": "4a:06:a3:9d:8e:88",
            "net18": "2e:da:59:08:03:c8",
            "net19": "aa:3b:eb:2a:86:35",
            "net2": "86:fd:0f:1e:bb:c3",
            "net20": "76:4f:50:4d:da:06",
            "net21": "be:6c:eb:b6:55:85",
            "net22": "b6:7d:70:6b:67:1d",
            "net23": "ce:7b:ca:73:68:1c",
            "net3": "92:a7:d0:0a:0c:20",
            "net4": "1e:79:e6:8c:ce:f3",
            "net5": "2e:dd:bd:51:58:44",
            "net6": "b2:9d:02:a1:8d:71",
            "net7": "ba:ba:e1:38:9f:e7",
            "net8": "46:5d:c1:3d:9c:9c",
            "net9": "32:b4:e9:3b:67:15"
        },
        "spine_1_1_4": {
            "net0": "a6:51:8e:95:36:e0",
            "net1": "9e:7e:3c:05:76:c9",
            "net10": "02:74:d7:36:d2:1a",
            "net11": "e2:27:71:e6:54:cf",
            "net12": "76:cc:e7:c8:d8:19",
            "net13": "4a:50:64:a5:23:7b",
            "net14": "2a:9c:51:f1:45:c8",
            "net15": "76:a6:ec:ba:d8:d5",
            "net16": "a2:bf:63:14:0c:6f",
            "net17": "46:00:60:a3:a5:4c",
            "net18": "36:cf:17:ea:f8:61",
            "net19": "42:8a:5e:f3:26:50",
            "net2": "5e:87:e5:e9:af:55",
            "net20": "5e:fe:c6:c5:bc:a7",
            "net21": "fa:e2:fb:5c:55:79",
            "net22": "3a:11:80:47:e7:8e",
            "net23": "3a:04:9c:ff:23:6f",
            "net3": "2a:86:6e:44:7d:18",
            "net4": "e6:cd:2a:2a:df:07",
            "net5": "2a:66:7d:d5:72:6f",
            "net6": "ca:eb:84:e2:ca:76",
            "net7": "8a:d3:8e:ee:15:bd",
            "net8": "ae:bd:29:ac:32:69",
            "net9": "f6:59:c1:f0:47:cb"
        },
        "spine_1_1_5": {
            "net0": "aa:f9:3c:48:7a:2a",
            "net1": "aa:c6:d9:3c:9e:59",
            "net10": "9e:1f:71:2b:39:32",
            "net11": "c2:28:2d:01:b8:36",
            "net12": "16:be:f1:0c:d5:c5",
            "net13": "66:1e:f7:28:a2:9a",
            "net14": "c6:54:64:81:f9:7d",
            "net15": "fe:bc:77:c5:ff:b1",
            "net16": "e2:f9:a6:8e:89:41",
            "net17": "d6:bd:03:bc:c4:e9",
            "net18": "66:cc:1a:24:b2:23",
            "net19": "0a:6e:3b:a4:04:41",
            "net2": "56:d1:eb:9d:1d:57",
            "net20": "f2:ce:b7:f2:7a:a7",
            "net21": "7a:dc:c1:a2:9c:d1",
            "net22": "b6:e7:ed:39:b5:38",
            "net23": "42:7c:f1:aa:09:78",
            "net3": "ae:72:14:09:e2:b9",
            "net4": "9e:f5:c7:76:0b:4f",
            "net5": "92:bd:d4:2c:63:35",
            "net6": "ee:26:11:34:c8:da",
            "net7": "e6:70:66:27:ec:13",
            "net8": "1e:c7:06:ef:f2:f9",
            "net9": "ea:e3:e9:a1:dc:0b"
        },
        "spine_1_1_6": {
            "net0": "c2:bc:22:57:00:f5",
            "net1": "76:03:8a:94:5d:2b",
            "net10": "2e:25:19:b3:fb:39",
            "net11": "d2:29:12:1d:7d:b9",
            "net12": "da:4e:fe:e2:45:de",
            "net13": "a6:ce:34:92:aa:46",
            "net14": "62:de:91:2d:37:f8",
            "net15": "4a:26:34:0c:7f:14",
            "net16": "36:76:15:ba:de:1b",
            "net17": "9a:54:5c:9e:e2:ad",
            "net18": "7a:c6:87:16:20:3d",
            "net19": "da:c1:11:28:f1:8d",
            "net2": "92:09:65:23:52:9c",
            "net20": "6e:b8:94:20:98:ff",
            "net21": "f6:a8:b5:c6:8d:a8",
            "net22": "be:25:68:69:23:89",
            "net23": "7e:4a:85:93:cc:3c",
            "net3": "8e:61:91:17:dd:70",
            "net4": "f2:8e:51:6c:0b:dc",
            "net5": "fe:10:b5:b7:b4:b3",
            "net6": "12:ff:9e:a3:e0:b7",
            "net7": "9e:b3:9a:be:e9:74",
            "net8": "a6:0b:ec:b4:bd:60",
            "net9": "c6:fb:ae:98:4a:2c"
        },
        "spine_1_1_7": {
            "net0": "32:cb:58:6e:94:5e",
            "net1": "82:d3:bd:b8:6d:f0",
            "net10": "3e:46:d6:21:de:c8",
            "net11": "46:2e:e4:0a:b5:c1",
            "net12": "be:b9:0d:33:f1:e1",
            "net13": "4a:16:09:2c:c7:f9",
            "net14": "b6:ae:bc:8c:61:42",
            "net15": "8a:ee:8b:82:50:a8",
            "net16": "d2:90:9f:be:e9:2e",
            "net17": "a2:05:2f:2c:34:a1",
            "net18": "d2:76:76:7f:56:f7",
            "net19": "66:cb:54:98:13:22",
            "net2": "5a:d4:cf:0b:86:f1",
            "net20": "56:44:5f:79:8d:70",
            "net21": "3e:33:a3:e7:00:70",
            "net22": "b6:e1:6e:e5:a0:72",
            "net23": "76:57:c0:d8:66:6a",
            "net3": "d6:3f:5e:f7:c4:8a",
            "net4": "1a:65:65:5d:dc:c0",
            "net5": "22:51:d9:e0:48:64",
            "net6": "ca:11:39:60:c9:aa",
            "net7": "32:d0:21:d5:55:6b",
            "net8": "e2:55:19:1e:64:a9",
            "net9": "42:14:80:86:87:56"
        },
        "spine_1_1_8": {
            "net0": "9e:28:01:18:1d:2a",
            "net1": "06:e3:c8:3f:b4:e8",
            "net10": "66:95:77:90:b5:d1",
            "net11": "c2:52:45:18:b3:e9",
            "net12": "96:fb:12:3e:29:8c",
            "net13": "de:59:34:4f:c3:94",
            "net14": "7e:0b:ff:62:e7:a6",
            "net15": "ba:e6:86:f2:12:6a",
            "net16": "8e:45:49:8c:b8:6e",
            "net17": "fa:07:c8:17:c8:74",
            "net18": "f2:78:c7:6a:2f:c3",
            "net19": "3a:eb:9b:35:0f:36",
            "net2": "a6:43:2d:93:8c:0f",
            "net20": "82:6d:da:2c:3d:0e",
            "net21": "7e:d2:e6:a1:9b:17",
            "net22": "72:a4:e8:7a:56:1f",
            "net23": "a2:59:32:02:af:53",
            "net3": "5a:6c:4f:5e:57:33",
            "net4": "b2:37:8e:dc:52:9e",
            "net5": "ae:33:67:28:95:91",
            "net6": "c2:09:94:0b:7b:c3",
            "net7": "e2:04:2d:a9:5e:90",
            "net8": "2a:b3:f1:9c:7b:96",
            "net9": "b6:29:74:bf:71:ba"
        },
        "spine_1_1_9": {
            "net0": "7a:13:2b:a0:b5:da",
            "net1": "ba:a2:dd:86:7a:16",
            "net10": "02:9f:15:ca:d4:a6",
            "net11": "66:a4:7f:40:98:40",
            "net12": "e2:86:0c:f5:65:ad",
            "net13": "96:7f:11:d1:11:cf",
            "net14": "0a:50:1d:cf:f8:75",
            "net15": "a6:f5:a6:a0:e5:e4",
            "net16": "12:74:38:44:63:4e",
            "net17": "22:ea:80:89:af:88",
            "net18": "1e:5e:6d:d7:0e:d2",
            "net19": "ce:0e:2b:ef:31:98",
            "net2": "86:cb:3f:0f:db:f2",
            "net20": "ae:67:c4:34:1a:af",
            "net21": "92:94:88:f6:21:ad",
            "net22": "da:c1:48:01:74:c0",
            "net23": "82:fc:85:d9:77:f1",
            "net3": "42:00:71:54:db:ed",
            "net4": "d6:c1:8b:6e:b3:cd",
            "net5": "ce:a6:54:ff:d0:42",
            "net6": "ee:eb:94:31:75:c1",
            "net7": "be:e7:58:42:e6:63",
            "net8": "26:ef:7a:13:80:40",
            "net9": "52:74:e4:ba:55:c7"
        },
        "spine_2_1_1": {
            "net0": "ca:75:f2:ac:50:af",
            "net1": "8a:3c:26:b2:5e:82",
            "net10": "8a:53:cf:ca:60:5d",
            "net11": "b2:42:a8:73:af:3f",
            "net12": "0a:d6:36:09:8b:d6",
            "net13": "f6:c5:36:77:e9:34",
            "net14": "ae:b3:37:0e:2c:23",
            "net15": "3a:78:a2:cb:3c:df",
            "net16": "7e:53:fb:04:5a:1a",
            "net17": "6a:14:ab:14:8e:9d",
            "net18": "5e:a7:da:07:8f:fd",
            "net19": "f2:04:20:81:0f:0f",
            "net2": "4e:da:a2:7f:44:1e",
            "net20": "9e:57:fe:41:32:e4",
            "net21": "aa:79:60:2a:55:a2",
            "net22": "6a:a0:70:44:b8:5a",
            "net23": "22:66:f0:fd:03:3c",
            "net3": "ae:2f:05:f0:4d:b3",
            "net4": "1e:07:cf:7d:a8:74",
            "net5": "c6:05:6e:c9:1e:0d",
            "net6": "0e:6a:91:ce:6d:a0",
            "net7": "7a:1f:4c:03:f8:1d",
            "net8": "46:f6:89:69:04:71",
            "net9": "92:a9:9b:98:98:6a"
        },
        "spine_2_1_10": {
            "net0": "4e:0e:3c:c2:89:3f",
            "net1": "b6:03:6e:3e:85:87",
            "net10": "86:cc:3d:c0:eb:36",
            "net11": "36:ff:2c:c1:1c:22",
            "net12": "ce:2a:f7:ff:dd:a1",
            "net13": "62:f2:54:38:16:52",
            "net14": "fe:bb:18:8b:33:5f",
            "net15": "56:15:56:d5:db:9e",
            "net16": "36:d0:b5:02:d5:11",
            "net17": "52:cc:2a:cd:34:3f",
            "net18": "32:5a:4f:65:10:95",
            "net19": "e2:72:d8:86:b5:bd",
            "net2": "4e:85:bb:3a:7e:73",
            "net20": "4a:9c:ce:83:ac:a7",
            "net21": "76:a5:a3:42:65:2f",
            "net22": "2e:27:0e:67:4c:16",
            "net23": "aa:cf:bb:6e:33:c4",
            "net3": "46:27:23:21:e8:1b",
            "net4": "b6:0e:c1:cd:3f:a6",
            "net5": "52:c5:c0:c6:73:86",
            "net6": "ee:68:2a:23:1a:59",
            "net7": "ce:39:a3:8a:45:46",
            "net8": "6e:3c:c7:b4:d9:86",
            "net9": "fe:9a:f3:1e:e7:32"
        },
        "spine_2_1_11": {
            "net0": "f2:41:1a:25:ac:70",
            "net1": "96:95:ff:f9:2b:66",
            "net10": "9a:20:7c:1e:35:ad",
            "net11": "3a:89:cb:62:f6:79",
            "net12": "06:9c:2f:95:9f:c6",
            "net13": "92:c9:cc:69:22:76",
            "net14": "8e:d8:76:bb:5d:be",
            "net15": "4e:61:33:66:33:45",
            "net16": "5a:69:3c:49:49:07",
            "net17": "ba:7c:70:2e:60:0b",
            "net18": "fe:32:a5:f5:30:17",
            "net19": "7e:ed:9c:ee:8f:9f",
            "net2": "92:a7:25:1e:d3:e9",
            "net20": "52:17:34:72:23:29",
            "net21": "ca:16:e0:d2:d2:be",
            "net22": "4a:24:60:51:b0:a0",
            "net23": "7a:ef:1f:ff:69:24",
            "net3": "36:cd:28:fb:3a:80",
            "net4": "de:ae:96:ef:29:28",
            "net5": "2e:62:96:56:6d:c3",
            "net6": "d6:d9:b2:11:e4:69",
            "net7": "06:1c:7c:32:8b:76",
            "net8": "72:59:9d:20:e8:50",
            "net9": "de:b3:8b:69:5d:0a"
        },
        "spine_2_1_12": {
            "net0": "46:53:70:e0:10:cf",
            "net1": "62:56:1c:44:65:f3",
            "net10": "ea:d7:8d:f8:bb:87",
            "net11": "7e:c1:73:20:2f:71",
            "net12": "ba:c0:64:66:62:0f",
            "net13": "7e:8f:2c:32:0d:03",
            "net14": "7a:c0:8f:fc:6e:3d",
            "net15": "0a:f3:88:e6:3c:a1",
            "net16": "f2:80:1e:b2:08:85",
            "net17": "92:ad:c8:35:b8:e7",
            "net18": "e2:a2:c7:f7:a8:98",
            "net19": "f2:8c:8c:19:92:8a",
            "net2": "4e:f9:19:3b:bf:01",
            "net20": "6a:ce:25:95:5a:76",
            "net21": "aa:72:d0:19:09:df",
            "net22": "76:8c:ca:ea:8e:8d",
            "net23": "66:cc:a0:82:34:93",
            "net3": "e2:70:ae:89:49:82",
            "net4": "36:64:4a:26:a3:a7",
            "net5": "0e:e7:51:0d:5f:1f",
            "net6": "86:11:f8:af:79:f7",
            "net7": "42:34:1a:42:a4:77",
            "net8": "16:45:be:38:a6:50",
            "net9": "da:89:ea:28:9c:58"
        },
        "spine_2_1_2": {
            "net0": "b2:03:f9:24:78:92",
            "net1": "8a:f8:45:11:62:4a",
            "net10": "8e:e7:7e:89:f8:ff",
            "net11": "ea:f2:03:42:4c:46",
            "net12": "f2:43:54:eb:c6:cb",
            "net13": "32:c4:56:38:ab:22",
            "net14": "d2:74:c4:62:61:33",
            "net15": "46:f6:86:50:f5:fa",
            "net16": "26:56:70:29:8b:6f",
            "net17": "16:c9:bb:b1:43:04",
            "net18": "42:6f:29:b6:74:c3",
            "net19": "52:29:67:73:04:75",
            "net2": "b6:fc:66:5c:31:2d",
            "net20": "42:d0:31:45:61:8f",
            "net21": "66:3b:a6:74:ac:58",
            "net22": "1e:42:e6:54:4a:5d",
            "net23": "d2:f7:07:ed:ff:90",
            "net3": "2a:87:74:cf:d3:29",
            "net4": "22:66:78:64:c2:1a",
            "net5": "ba:b4:94:a9:cd:c3",
            "net6": "42:53:f9:b1:cd:fa",
            "net7": "6a:da:dd:37:d3:43",
            "net8": "d6:d8:00:21:bf:63",
            "net9": "2a:e8:da:c2:d4:e6"
        },
        "spine_2_1_3": {
            "net0": "c6:2f:3b:9f:5b:1e",
            "net1": "7a:25:1c:73:82:dd",
            "net10": "82:ab:8e:ee:f9:c8",
            "net11": "ba:4c:f6:44:ff:11",
            "net12": "86:f1:fe:48:1e:12",
            "net13": "6e:67:61:74:e7:ae",
            "net14": "16:9c:80:e5:4a:87",
            "net15": "e6:cd:84:a9:23:04",
            "net16": "ce:4c:cc:e9:b3:cd",
            "net17": "a2:be:c0:bd:4b:25",
            "net18": "72:9c:46:2f:71:f4",
            "net19": "6e:57:46:6e:8e:b1",
            "net2": "6a:75:fe:5a:a8:2f",
            "net20": "72:0e:c5:06:1c:50",
            "net21": "1a:02:cb:88:02:55",
            "net22": "52:46:ab:65:6a:70",
            "net23": "8e:ff:de:36:7d:3a",
            "net3": "46:ca:53:aa:32:54",
            "net4": "fe:10:36:e4:d3:f0",
            "net5": "62:61:c6:09:42:68",
            "net6": "8a:43:e7:8d:c7:4d",
            "net7": "4e:31:dc:53:29:02",
            "net8": "42:6a:05:69:fa:d3",
            "net9": "ba:5b:4e:97:34:96"
        },
        "spine_2_1_4": {
            "net0": "e2:14:5d:db:3e:64",
            "net1": "aa:48:ac:cd:47:b0",
            "net10": "aa:99:87:fd:eb:c1",
            "net11": "36:9b:68:75:80:c3",
            "net12": "ee:95:3a:59:68:d6",
            "net13": "86:39:62:76:72:72",
            "net14": "fa:54:8d:1b:18:9b",
            "net15": "d2:4e:c2:5d:1a:fd",
            "net16": "52:de:b1:07:e7:b0",
            "net17": "42:41:7d:e2:e8:1a",
            "net18": "ea:ed:c8:3b:34:a8",
            "net19": "a6:c2:35:01:d2:36",
            "net2": "5a:92:75:74:11:83",
            "net20": "72:20:06:91:85:8a",
            "net21": "b2:75:03:5a:fd:d5",
            "net22": "0a:56:6d:37:d3:f1",
            "net23": "0a:17:73:64:24:49",
            "net3": "ae:3f:a6:6d:04:ea",
            "net4": "9a:9d:7e:8b:11:17",
            "net5": "96:c6:67:a6:a3:8e",
            "net6": "aa:ca:6f:f2:a9:5e",
            "net7": "86:8f:9b:c2:a5:1d",
            "net8": "a6:6e:ea:b2:80:7d",
            "net9": "96:b3:33:40:89:3b"
        },
        "spine_2_1_5": {
            "net0": "ce:80:85:d9:9c:7a",
            "net1": "32:a0:49:9e:8f:6a",
            "net10": "b6:09:9f:aa:c0:e7",
            "net11": "c2:54:74:3f:07:a7",
            "net12": "a6:c3:b0:70:e0:19",
            "net13": "42:92:d0:63:53:f0",
            "net14": "56:fa:14:36:be:43",
            "net15": "fe:77:c9:d7:75:91",
            "net16": "32:a3:72:44:5a:7a",
            "net17": "62:83:03:94:1f:5a",
            "net18": "8a:ae:aa:d1:13:4d",
            "net19": "36:41:da:76:de:b3",
            "net2": "16:d7:9d:45:ca:7f",
            "net20": "9a:d6:f3:94:f5:9c",
            "net21": "6a:f8:f5:62:e6:61",
            "net22": "86:85:82:7c:4c:b3",
            "net23": "76:11:71:39:10:c6",
            "net3": "ea:1b:9d:0c:81:49",
            "net4": "5a:89:35:5d:86:ca",
            "net5": "12:f1:83:e9:fb:a4",
            "net6": "ba:2e:ad:d0:b2:63",
            "net7": "8e:27:7c:e0:d5:69",
            "net8": "be:6b:b4:11:91:38",
            "net9": "8a:13:ea:97:3f:41"
        },
        "spine_2_1_6": {
            "net0": "36:de:62:49:27:4a",
            "net1": "9a:e9:05:04:93:e7",
            "net10": "6e:89:b0:f4:13:8e",
            "net11": "f6:7d:0f:86:9d:32",
            "net12": "a2:ce:0a:c2:f6:6a",
            "net13": "52:eb:22:a3:04:9a",
            "net14": "1e:47:15:16:a4:b2",
            "net15": "5e:11:b0:dc:b2:cd",
            "net16": "36:11:9e:2d:40:4d",
            "net17": "d2:d0:77:6e:cc:bd",
            "net18": "d6:60:18:50:00:20",
            "net19": "92:c2:b6:04:c3:cf",
            "net2": "0a:3c:1a:91:c5:0d",
            "net20": "06:43:b4:8d:b4:ed",
            "net21": "c2:11:b3:06:df:82",
            "net22": "da:c9:44:a1:01:48",
            "net23": "e6:da:8f:c2:90:f3",
            "net3": "5e:36:b2:31:0f:db",
            "net4": "c6:05:07:c0:3e:86",
            "net5": "9e:63:d6:53:ed:e8",
            "net6": "ca:e5:72:ef:ce:ce",
            "net7": "92:e6:a1:19:a4:17",
            "net8": "42:ca:b2:28:f8:e0",
            "net9": "26:7d:05:bb:7c:0e"
        },
        "spine_2_1_7": {
            "net0": "52:29:4c:7e:fc:92",
            "net1": "5a:2e:67:ea:8e:cb",
            "net10": "12:06:da:c4:f7:e0",
            "net11": "8e:47:52:6f:26:27",
            "net12": "46:af:f6:8c:ec:8a",
            "net13": "16:12:84:0e:7e:58",
            "net14": "2a:87:bf:6d:d6:d8",
            "net15": "12:9f:5f:2e:ad:e9",
            "net16": "52:c2:5b:31:a2:c7",
            "net17": "e2:d2:a9:db:7e:ee",
            "net18": "da:0d:73:8e:fc:a5",
            "net19": "1e:a9:b6:e2:62:dd",
            "net2": "96:ec:9d:ff:62:5a",
            "net20": "da:66:f1:a0:b5:ac",
            "net21": "ba:c9:6d:6f:f6:c7",
            "net22": "72:37:9c:80:19:51",
            "net23": "d6:75:82:72:38:6a",
            "net3": "9a:5c:d7:9a:5f:e1",
            "net4": "da:91:c4:b7:49:15",
            "net5": "7a:d7:77:fb:24:3f",
            "net6": "a2:82:98:f2:b3:72",
            "net7": "4e:a2:c8:ff:b3:e2",
            "net8": "e6:f5:ba:5c:f2:09",
            "net9": "be:84:94:fc:88:50"
        },
        "spine_2_1_8": {
            "net0": "fa:c9:64:95:0c:4c",
            "net1": "36:9d:66:fc:ad:ce",
            "net10": "ce:95:b8:84:4f:0d",
            "net11": "9a:f1:cc:ae:af:d1",
            "net12": "36:3c:eb:30:6b:30",
            "net13": "22:3f:8e:17:ae:a7",
            "net14": "a2:26:02:4f:60:4d",
            "net15": "6e:cf:6a:b9:30:04",
            "net16": "56:23:76:55:5a:ab",
            "net17": "2a:ef:ca:33:ce:73",
            "net18": "5a:fb:e8:50:63:87",
            "net19": "2e:b9:8b:fa:32:a4",
            "net2": "36:ef:0a:9c:3c:a8",
            "net20": "46:99:29:9d:bb:a8",
            "net21": "f2:f9:73:31:3f:ba",
            "net22": "16:e2:61:c5:66:85",
            "net23": "52:a5:fe:7c:d4:df",
            "net3": "06:9d:9b:57:95:4e",
            "net4": "22:ef:a7:6d:cb:5f",
            "net5": "62:f5:a9:62:77:c3",
            "net6": "32:43:e1:1c:33:89",
            "net7": "ca:e6:05:55:d9:5a",
            "net8": "e2:79:3e:9c:d2:ba",
            "net9": "0a:a9:45:39:84:0b"
        },
        "spine_2_1_9": {
            "net0": "b6:ca:6a:5e:01:68",
            "net1": "42:83:f0:2f:f9:0b",
            "net10": "72:52:50:8e:ca:e8",
            "net11": "ea:c5:45:ef:a7:ac",
            "net12": "12:02:81:87:73:38",
            "net13": "16:69:7b:77:d1:f6",
            "net14": "f6:f2:5b:b3:23:0c",
            "net15": "86:63:8f:68:08:7b",
            "net16": "5a:cf:5d:4e:08:4b",
            "net17": "e2:c1:40:d3:07:65",
            "net18": "ca:3b:87:18:85:d6",
            "net19": "ce:ca:85:f9:b0:f0",
            "net2": "2a:4d:ad:cf:c8:f5",
            "net20": "b2:67:b4:35:5c:60",
            "net21": "9e:ed:44:1a:d2:8b",
            "net22": "ca:24:09:4d:29:b6",
            "net23": "8e:b5:42:9d:9b:78",
            "net3": "62:00:b9:d5:2b:48",
            "net4": "a6:ee:12:2f:e7:e9",
            "net5": "26:0f:d4:db:21:af",
            "net6": "32:15:92:f4:5b:b5",
            "net7": "36:5d:a1:f8:dd:90",
            "net8": "4e:ef:08:2d:27:a9",
            "net9": "3e:0d:46:86:7a:c3"
        },
        "tof_1_2_1": {
            "net0": "a6:34:86:84:ac:39",
            "net1": "06:a6:e8:47:04:5a",
            "net10": "9a:a9:25:dd:08:15",
            "net11": "2e:ca:41:3d:0d:04",
            "net12": "9a:74:88:3b:54:f7",
            "net13": "fa:14:c9:af:a8:3f",
            "net14": "2e:89:d8:dc:ea:70",
            "net15": "7a:1b:06:c4:b8:a1",
            "net16": "1e:7c:2b:e7:5d:ac",
            "net17": "5a:44:01:69:75:84",
            "net18": "a2:76:0b:ba:4c:ca",
            "net19": "fe:25:c0:7f:be:5d",
            "net2": "1e:18:e9:04:61:d5",
            "net20": "2a:50:83:e1:dc:19",
            "net21": "8e:57:0b:a6:55:6d",
            "net22": "72:53:9d:fb:0d:73",
            "net23": "4e:f0:a4:f9:31:e3",
            "net3": "8a:f9:d1:17:b0:6f",
            "net4": "82:3d:3a:ef:41:45",
            "net5": "fa:05:2f:b9:81:07",
            "net6": "6e:89:bc:c1:c2:bc",
            "net7": "be:eb:65:18:c6:18",
            "net8": "16:65:41:16:7b:6b",
            "net9": "76:c9:f2:ad:81:44"
        },
        "tof_1_2_10": {
            "net0": "c2:cd:48:dc:2d:1d",
            "net1": "42:15:91:32:1e:b3",
            "net10": "7e:e6:58:a4:22:01",
            "net11": "e2:fe:5b:73:d3:7a",
            "net12": "7a:da:5a:72:d1:92",
            "net13": "be:b2:29:63:20:33",
            "net14": "56:1b:e1:1a:f2:99",
            "net15": "82:56:42:b4:ca:11",
            "net16": "c2:4c:0f:32:b9:aa",
            "net17": "be:42:95:84:7d:90",
            "net18": "e6:56:19:18:d5:85",
            "net19": "fe:25:81:be:24:76",
            "net2": "4a:cd:35:4d:13:da",
            "net20": "c2:8a:bb:e0:4f:49",
            "net21": "de:a6:ca:b3:80:7f",
            "net22": "76:b8:92:37:ff:0c",
            "net23": "32:eb:87:86:16:1e",
            "net3": "6a:64:87:b6:12:44",
            "net4": "32:7b:18:0f:c7:55",
            "net5": "f2:61:e7:36:88:52",
            "net6": "c2:0c:67:de:89:10",
            "net7": "c6:8b:84:74:30:da",
            "net8": "ca:e3:fc:9b:a8:3a",
            "net9": "92:53:e4:bd:cb:9e"
        },
        "tof_1_2_11": {
            "net0": "b6:49:0e:31:da:be",
            "net1": "5e:98:97:3c:ff:93",
            "net10": "86:57:ba:72:2f:c5",
            "net11": "3e:7b:b8:31:44:f5",
            "net12": "f6:c1:19:58:a6:c4",
            "net13": "3e:d4:64:8f:b5:43",
            "net14": "ae:fe:17:85:5d:53",
            "net15": "e6:8b:d2:d8:06:31",
            "net16": "36:07:90:b4:fd:14",
            "net17": "b2:3d:6a:1f:1f:c9",
            "net18": "ba:30:4b:6a:70:8c",
            "net19": "a6:a9:e4:99:90:47",
            "net2": "ea:50:56:d0:6c:cf",
            "net20": "46:2f:12:ff:e7:82",
            "net21": "76:0e:5b:fd:66:f8",
            "net22": "6e:2f:75:77:21:f9",
            "net23": "b6:77:5b:dc:b2:d5",
            "net3": "16:4c:d1:f0:12:40",
            "net4": "86:bb:ec:ea:b8:7e",
            "net5": "fe:f2:d0:dd:f2:e4",
            "net6": "de:fb:48:5e:df:74",
            "net7": "36:5f:30:a1:de:b3",
            "net8": "ca:64:b9:ca:41:96",
            "net9": "42:40:97:eb:73:e2"
        },
        "tof_1_2_12": {
            "net0": "4e:36:b9:20:86:e3",
            "net1": "8a:39:af:be:34:89",
            "net10": "0a:98:e9:64:e9:e9",
            "net11": "26:2e:90:76:17:8c",
            "net12": "b6:0a:60:c7:d6:ff",
            "net13": "22:5b:ce:e6:b8:bc",
            "net14": "26:45:00:88:fc:c5",
            "net15": "e2:af:ed:c9:03:15",
            "net16": "5e:3d:38:4b:0f:49",
            "net17": "d2:8c:e7:30:eb:5d",
            "net18": "f6:89:1d:3c:d2:4f",
            "net19": "7a:d4:a6:fd:ce:52",
            "net2": "9a:1e:92:a8:ce:0d",
            "net20": "26:d3:c9:3b:37:08",
            "net21": "c2:8f:30:41:0f:38",
            "net22": "06:7a:ab:09:da:30",
            "net23": "6a:e2:76:3a:09:b9",
            "net3": "e2:76:ab:52:49:5a",
            "net4": "6e:0c:63:c6:ff:4f",
            "net5": "c2:09:4a:98:0e:89",
            "net6": "86:b9:f6:d7:8d:18",
            "net7": "66:7e:94:6d:4d:a4",
            "net8": "6e:51:48:7e:85:d5",
            "net9": "fa:ac:38:8f:61:13"
        },
        "tof_1_2_2": {
            "net0": "9a:56:5c:55:ed:3a",
            "net1": "ea:a1:f1:c2:97:16",
            "net10": "06:b1:cf:ab:e6:91",
            "net11": "3e:31:9f:b6:ad:0b",
            "net12": "f2:7a:73:a5:eb:84",
            "net13": "c6:df:77:d3:bd:b9",
            "net14": "ee:a7:51:ef:fb:2a",
            "net15": "5e:0d:01:1f:7b:4a",
            "net16": "ca:5a:bb:f4:75:c1",
            "net17": "fa:65:a4:35:af:a3",
            "net18": "de:89:77:0d:09:28",
            "net19": "ce:86:37:e9:ce:2d",
            "net2": "06:c1:fd:fd:a6:cd",
            "net20": "76:69:33:93:45:32",
            "net21": "9a:84:83:8a:22:15",
            "net22": "4e:bf:ff:56:3d:a1",
            "net23": "e2:4a:58:d7:8e:dc",
            "net3": "aa:c1:85:92:75:7f",
            "net4": "96:22:44:52:8e:d6",
            "net5": "ca:eb:30:aa:b8:c0",
            "net6": "d2:b2:37:0a:6e:1a",
            "net7": "ae:dd:b4:92:46:54",
            "net8": "92:56:b1:8d:b2:6f",
            "net9": "92:81:e7:92:d0:9d"
        },
        "tof_1_2_3": {
            "net0": "ca:7d:9f:87:ac:81",
            "net1": "b2:fc:dd:56:5e:f8",
            "net10": "4a:15:8d:4e:57:b0",
            "net11": "16:3b:df:40:c6:ab",
            "net12": "4e:b5:c4:ce:c8:2f",
            "net13": "46:d7:be:64:8f:20",
            "net14": "16:f1:a1:51:7b:65",
            "net15": "56:1e:d9:89:29:da",
            "net16": "a6:44:f7:ed:d8:b8",
            "net17": "ae:75:d3:c2:0d:be",
            "net18": "ca:f3:96:ab:bd:c2",
            "net19": "b2:04:cf:72:2d:23",
            "net2": "7a:55:59:67:31:38",
            "net20": "12:0f:2b:a0:50:fb",
            "net21": "d2:34:8a:55:1e:73",
            "net22": "06:f4:18:2e:22:9b",
            "net23": "8a:05:52:03:22:e0",
            "net3": "76:71:e8:12:e3:68",
            "net4": "da:1f:89:d3:a4:25",
            "net5": "e2:35:89:ea:db:f0",
            "net6": "1e:37:b2:e6:d6:52",
            "net7": "26:80:29:59:1d:2e",
            "net8": "ce:fd:ac:1c:bd:87",
            "net9": "ca:39:7a:23:fa:7f"
        },
        "tof_1_2_4": {
            "net0": "a6:3b:33:d0:83:a9",
            "net1": "8a:d4:8d:58:38:b2",
            "net10": "ea:43:c4:1e:46:29",
            "net11": "1e:22:76:ce:3a:26",
            "net12": "66:e8:63:bf:05:10",
            "net13": "f2:90:41:02:89:dc",
            "net14": "d6:07:84:ec:b4:68",
            "net15": "da:f8:9e:cd:1d:75",
            "net16": "66:7e:41:e3:4e:d9",
            "net17": "3a:1d:5c:db:7d:b7",
            "net18": "e6:48:9c:31:e0:45",
            "net19": "2e:ee:7d:d2:5b:5b",
            "net2": "fa:e3:fc:9b:60:a6",
            "net20": "5e:f8:67:5e:f0:a7",
            "net21": "96:de:2b:4d:bb:03",
            "net22": "7e:a5:a7:99:38:67",
            "net23": "76:c6:35:7a:5a:14",
            "net3": "6a:b3:15:70:ed:58",
            "net4": "fa:6c:27:03:e6:3c",
            "net5": "ce:66:15:f3:df:ac",
            "net6": "7a:af:72:67:2c:de",
            "net7": "ea:2e:4a:d5:e6:8d",
            "net8": "5a:88:00:9c:0e:f0",
            "net9": "8a:b2:ed:b7:af:66"
        },
        "tof_1_2_5": {
            "net0": "d6:a8:60:d4:d9:e3",
            "net1": "7a:32:91:ac:25:7e",
            "net10": "ba:64:b5:b2:d1:f3",
            "net11": "3e:6f:01:87:eb:ae",
            "net12": "aa:83:f0:be:11:38",
            "net13": "c6:39:74:19:84:56",
            "net14": "ae:cf:0e:72:57:37",
            "net15": "06:dc:12:93:e9:f7",
            "net16": "32:4c:1e:eb:5c:30",
            "net17": "be:1f:77:74:7d:b7",
            "net18": "b6:6f:de:39:2b:22",
            "net19": "0e:71:55:a0:cd:88",
            "net2": "1e:df:e4:f3:57:d3",
            "net20": "46:5b:3e:ac:16:6a",
            "net21": "8a:b6:3c:aa:27:70",
            "net22": "7a:0f:e7:d3:bc:4f",
            "net23": "c6:94:99:d0:55:e1",
            "net3": "4e:08:6f:84:e8:a1",
            "net4": "82:13:d0:81:79:9d",
            "net5": "fe:9c:76:b5:2c:19",
            "net6": "f6:31:05:0c:eb:02",
            "net7": "5e:f6:09:bf:e0:13",
            "net8": "fa:14:e2:3a:c7:8d",
            "net9": "ce:6e:c2:df:66:dc"
        },
        "tof_1_2_6": {
            "net0": "62:03:39:81:49:17",
            "net1": "fa:fd:93:f9:96:26",
            "net10": "72:2e:5e:c0:81:a0",
            "net11": "4a:b7:60:b5:8b:a7",
            "net12": "76:ff:45:8c:a4:73",
            "net13": "96:b2:a4:8f:24:ec",
            "net14": "fa:16:3c:d9:f0:41",
            "net15": "ee:88:52:f1:62:cb",
            "net16": "1a:59:4f:d6:34:7d",
            "net17": "fa:c4:3d:e1:9b:4c",
            "net18": "ee:12:b5:c9:8a:a8",
            "net19": "c6:79:63:ea:1c:7e",
            "net2": "02:8a:6c:d2:08:38",
            "net20": "a2:ef:1c:56:cb:7d",
            "net21": "b6:0c:85:c2:d8:0d",
            "net22": "46:5e:ca:d7:02:2d",
            "net23": "e6:62:2e:91:f0:73",
            "net3": "96:ac:d7:aa:11:7a",
            "net4": "66:4a:cf:7b:21:0c",
            "net5": "de:1e:62:c0:6c:33",
            "net6": "32:eb:04:cd:f7:dc",
            "net7": "86:6d:bb:0d:34:34",
            "net8": "c2:54:6f:1b:ca:e3",
            "net9": "86:0c:d0:28:27:8e"
        },
        "tof_1_2_7": {
            "net0": "3a:07:14:dc:3c:cb",
            "net1": "ae:54:9f:f6:da:22",
            "net10": "36:1b:ed:a2:70:8e",
            "net11": "9a:be:77:eb:b7:10",
            "net12": "de:f0:96:0f:18:a1",
            "net13": "12:33:85:3d:2c:53",
            "net14": "12:95:f2:10:69:13",
            "net15": "92:59:e0:93:46:bb",
            "net16": "76:d4:45:99:6b:06",
            "net17": "02:12:61:9b:55:08",
            "net18": "a6:83:02:db:7a:8d",
            "net19": "62:bb:33:b1:ff:45",
            "net2": "96:a6:d1:22:28:54",
            "net20": "a2:76:e2:da:2d:7d",
            "net21": "a6:58:7f:a4:7b:e8",
            "net22": "aa:3a:35:a4:65:13",
            "net23": "d6:44:5f:33:01:bd",
            "net3": "de:00:49:bb:d5:1d",
            "net4": "6e:41:8d:c0:00:2e",
            "net5": "be:76:76:8c:2d:99",
            "net6": "52:11:6f:be:4c:4c",
            "net7": "ae:d2:bc:9e:53:a1",
            "net8": "6a:25:ab:82:2f:d0",
            "net9": "f6:e8:ae:00:19:26"
        },
        "tof_1_2_8": {
            "net0": "ae:39:98:cc:7e:db",
            "net1": "a6:63:21:37:fd:72",
            "net10": "46:ba:fd:e5:a2:ee",
            "net11": "a2:b1:50:73:b6:86",
            "net12": "72:35:bb:ed:25:55",
            "net13": "32:0c:e7:c8:70:43",
            "net14": "36:b3:04:e7:d6:f4",
            "net15": "b2:3f:3f:05:16:a8",
            "net16": "56:e0:27:3f:36:22",
            "net17": "42:4b:3f:de:26:a2",
            "net18": "ea:80:9a:e9:07:2a",
            "net19": "e2:f1:c9:0d:15:af",
            "net2": "de:96:b1:8a:ca:b8",
            "net20": "d6:ad:53:0d:81:6f",
            "net21": "36:24:57:e9:7c:0f",
            "net22": "da:58:7c:30:e0:19",
            "net23": "c2:d2:d2:82:14:ec",
            "net3": "06:38:4a:9e:41:79",
            "net4": "8a:e1:03:1d:8c:8b",
            "net5": "b6:a0:47:5f:5f:aa",
            "net6": "16:5a:59:a8:80:22",
            "net7": "2e:b0:4d:dd:99:3b",
            "net8": "6a:d8:29:67:b5:5c",
            "net9": "66:dd:e3:3f:3c:fb"
        },
        "tof_1_2_9": {
            "net0": "2e:f8:53:1c:8f:b8",
            "net1": "8e:dc:0e:3c:54:b9",
            "net10": "c2:30:84:09:c9:f9",
            "net11": "3a:6b:51:2d:2d:96",
            "net12": "9a:12:1c:cd:b1:22",
            "net13": "0a:e8:68:f5:30:19",
            "net14": "9a:2f:a9:20:e4:a3",
            "net15": "7a:d9:b7:3e:94:3f",
            "net16": "8e:02:e1:39:88:01",
            "net17": "12:61:a4:0e:f6:1a",
            "net18": "2e:a6:13:47:66:1b",
            "net19": "6e:97:7b:20:ec:c0",
            "net2": "62:82:ea:ec:84:e2",
            "net20": "5a:91:49:91:8e:39",
            "net21": "9e:aa:43:a4:e8:bb",
            "net22": "26:4f:c2:0b:d1:ae",
            "net23": "9e:b1:ce:b3:46:1c",
            "net3": "fa:22:6c:9c:a3:7c",
            "net4": "da:19:f9:b5:f0:2f",
            "net5": "02:16:7e:f7:55:69",
            "net6": "6a:a2:bf:8b:da:34",
            "net7": "c2:0e:13:91:b8:35",
            "net8": "0e:1c:4a:36:5f:a6",
            "net9": "f2:2d:8b:7c:34:23"
        }
    },
    "failed_machine": "leaf_1_0_1",
    "failed_interfaces": [
        "net0"
    ],
    "failure_time": 1614970557.3424501,
    "recover_time": 1614970797.879898
}