{
    "description": "Scenario 4b: Spine spine_1_1_1 failure and recovery with BGP",
    "k_leaf": 8,
    "k_top": 8,
    "redundancy_factor": 2,
    "is_k8s": true,
    "machine_mac_addresses": {
        "leaf_1_0_1": {
            "net0": "36:74:c2:a0:c0:dd",
            "net1": "7a:e0:d7:09:6c:b9",
            "net2": "2e:c1:b5:4a:84:8c",
            "net3": "c2:81:df:6f:05:b5",
            "net4": "12:c8:13:73:7d:0f",
            "net5": "3e:0a:b3:b9:38:d4",
            "net6": "86:9a:ca:b1:b3:0f",
            "net7": "02:ef:9e:0b:e1:70",
            "net8": "76:50:72:bf:18:f1"
        },
        "leaf_1_0_2": {
            "net0": "9a:ec:89:36:3c:2c",
            "net1": "0a:d0:a8:94:bd:38",
            "net2": "ce:4e:3a:c1:9f:dd",
            "net3": "8a:46:04:10:89:66",
            "net4": "d6:3e:e0:b7:32:75",
            "net5": "8e:a2:30:cc:49:61",
            "net6": "5e:00:54:68:ed:b8",
            "net7": "a6:3a:89:3e:87:f5",
            "net8": "d2:60:f9:27:4c:3b"
        },
        "leaf_1_0_3": {
            "net0": "ba:b1:e8:e0:a6:4d",
            "net1": "0a:90:19:43:97:b4",
            "net2": "d6:fc:b5:0e:3b:5a",
            "net3": "96:62:92:c0:e1:db",
            "net4": "4e:07:bc:d6:2c:d5",
            "net5": "da:93:c8:ef:02:dd",
            "net6": "36:6c:bc:a2:fa:38",
            "net7": "36:38:8b:bd:9e:a0",
            "net8": "42:8d:0f:7c:f8:5b"
        },
        "leaf_1_0_4": {
            "net0": "9a:3d:19:8c:95:9b",
            "net1": "b2:e7:ed:5a:36:94",
            "net2": "76:e0:e2:15:c1:a9",
            "net3": "4a:23:00:8d:e0:53",
            "net4": "4e:33:54:64:eb:d3",
            "net5": "ae:78:9a:48:bb:c0",
            "net6": "66:74:26:cb:05:7d",
            "net7": "9a:3a:fe:9b:da:b3",
            "net8": "0e:83:2d:88:2c:24"
        },
        "leaf_1_0_5": {
            "net0": "5a:51:5d:68:36:b2",
            "net1": "7a:b0:a7:0b:98:47",
            "net2": "92:e2:e2:e0:99:e4",
            "net3": "32:aa:5a:41:fa:1d",
            "net4": "f2:5f:d6:46:dd:f6",
            "net5": "1e:6c:c6:b2:9d:08",
            "net6": "1e:f0:20:3a:fb:8f",
            "net7": "4a:b7:92:be:11:04",
            "net8": "06:28:c0:0e:d6:1c"
        },
        "leaf_1_0_6": {
            "net0": "6a:8d:a5:3e:18:ce",
            "net1": "4e:ec:1f:a5:47:25",
            "net2": "3a:3c:61:c6:20:91",
            "net3": "86:cb:f5:47:c2:90",
            "net4": "7e:76:d0:2e:d6:0c",
            "net5": "02:a0:76:a4:b9:7f",
            "net6": "4a:a3:ca:2d:54:f3",
            "net7": "7e:2c:ce:15:3a:d5",
            "net8": "f2:9c:61:95:a3:2d"
        },
        "leaf_1_0_7": {
            "net0": "02:15:5d:cb:37:71",
            "net1": "ae:35:ac:dc:3e:82",
            "net2": "0e:00:b4:ba:b5:35",
            "net3": "d2:f5:23:07:c3:1f",
            "net4": "1e:42:03:91:a3:16",
            "net5": "e2:d3:79:85:e8:88",
            "net6": "42:92:97:db:d8:23",
            "net7": "62:e4:cf:35:93:f2",
            "net8": "56:5c:a1:15:4e:da"
        },
        "leaf_1_0_8": {
            "net0": "b6:cc:15:34:54:3d",
            "net1": "0e:39:5c:6c:ef:90",
            "net2": "d2:02:08:17:a7:ad",
            "net3": "d6:70:25:e9:ce:45",
            "net4": "5a:1d:d3:45:db:11",
            "net5": "92:4b:47:59:5d:b5",
            "net6": "16:fe:51:1f:af:d0",
            "net7": "de:2b:80:e8:65:fc",
            "net8": "06:72:20:66:3b:62"
        },
        "leaf_2_0_1": {
            "net0": "4a:3f:e0:d2:a2:4e",
            "net1": "06:8c:95:79:7c:ab",
            "net2": "8e:2d:a9:d5:ed:1f",
            "net3": "0a:68:2c:1e:26:21",
            "net4": "aa:48:50:79:93:23",
            "net5": "46:7a:11:9f:18:27",
            "net6": "f2:ba:e7:f7:51:f3",
            "net7": "92:07:5e:ed:02:32",
            "net8": "36:b3:32:ab:c7:97"
        },
        "leaf_2_0_2": {
            "net0": "3e:0b:27:0c:f2:97",
            "net1": "32:bb:ae:5e:cf:0b",
            "net2": "fa:13:e5:50:09:d4",
            "net3": "86:46:b9:7d:e7:22",
            "net4": "02:bb:78:5b:ce:65",
            "net5": "32:5e:80:f6:f0:4b",
            "net6": "f6:13:6d:c5:9d:f0",
            "net7": "72:a3:c4:7e:03:43",
            "net8": "9e:ef:9f:54:84:ea"
        },
        "leaf_2_0_3": {
            "net0": "3e:e0:fd:20:ea:56",
            "net1": "02:5d:7a:ec:1f:21",
            "net2": "96:c9:c8:7a:49:07",
            "net3": "06:d9:fe:79:f3:11",
            "net4": "c6:6d:5a:0e:82:4a",
            "net5": "ba:73:3c:97:a0:c5",
            "net6": "ca:50:d4:68:60:72",
            "net7": "4e:22:89:35:23:41",
            "net8": "ba:db:65:c7:75:e9"
        },
        "leaf_2_0_4": {
            "net0": "e2:68:c8:27:98:b6",
            "net1": "8a:f7:a9:4f:e9:e2",
            "net2": "e6:94:8e:ef:70:24",
            "net3": "be:ad:f7:a5:84:ed",
            "net4": "22:33:ff:41:7a:ef",
            "net5": "26:1a:0e:8e:fa:3a",
            "net6": "f2:03:08:e1:07:35",
            "net7": "1e:bf:d8:58:dc:d5",
            "net8": "92:55:b5:d5:1f:91"
        },
        "leaf_2_0_5": {
            "net0": "4a:f8:37:de:51:d0",
            "net1": "36:25:39:55:56:5b",
            "net2": "f6:73:b2:2a:20:b1",
            "net3": "2e:a6:d9:23:6b:e3",
            "net4": "6e:bb:e1:7c:04:e7",
            "net5": "ba:90:85:51:bf:f3",
            "net6": "d2:b2:f5:f0:85:a4",
            "net7": "2e:73:83:9d:78:8c",
            "net8": "be:aa:69:33:9c:27"
        },
        "leaf_2_0_6": {
            "net0": "1e:05:3f:3d:31:a5",
            "net1": "ba:cc:8e:fd:09:1b",
            "net2": "46:b0:5a:fa:1d:50",
            "net3": "fa:a1:1d:f5:63:04",
            "net4": "da:cc:58:55:e5:03",
            "net5": "76:a5:1d:43:0a:a7",
            "net6": "92:25:92:2c:89:36",
            "net7": "2a:2d:43:d8:f5:f0",
            "net8": "02:de:43:f9:a0:53"
        },
        "leaf_2_0_7": {
            "net0": "a6:e9:bb:d1:58:04",
            "net1": "f6:97:09:01:cd:8c",
            "net2": "9a:2c:17:ae:8f:2c",
            "net3": "1e:2a:b4:57:1a:95",
            "net4": "2a:5c:24:90:56:4d",
            "net5": "9e:20:9a:3a:a4:e1",
            "net6": "8e:72:a1:4b:23:d6",
            "net7": "66:89:27:b2:86:c4",
            "net8": "fa:50:b0:7f:54:fc"
        },
        "leaf_2_0_8": {
            "net0": "2a:9a:33:73:45:5d",
            "net1": "2e:df:88:4b:44:d5",
            "net2": "56:e3:c3:ac:a0:9c",
            "net3": "62:e0:3f:6c:ad:03",
            "net4": "ea:30:7b:d2:e3:55",
            "net5": "be:74:83:3c:6b:e4",
            "net6": "da:3f:41:6a:40:98",
            "net7": "b2:34:21:e1:23:d4",
            "net8": "a2:24:70:0d:e6:47"
        },
        "leaf_3_0_1": {
            "net0": "22:9a:17:7c:ab:77",
            "net1": "ca:65:d6:9f:44:5c",
            "net2": "c6:14:82:ee:43:f2",
            "net3": "3a:4d:6e:b9:81:94",
            "net4": "8a:3e:4b:01:3c:c8",
            "net5": "0a:01:6a:95:f9:4e",
            "net6": "fa:5e:57:3f:2a:79",
            "net7": "b6:90:90:10:a8:de",
            "net8": "d2:c9:e9:78:bc:f1"
        },
        "leaf_3_0_2": {
            "net0": "e2:00:1f:70:a3:5c",
            "net1": "96:90:f8:77:98:fd",
            "net2": "66:86:69:3c:ac:0a",
            "net3": "b6:ab:f4:b0:5c:3e",
            "net4": "96:a1:89:ea:5e:5f",
            "net5": "82:23:e9:2d:47:aa",
            "net6": "c6:d8:a3:05:9f:68",
            "net7": "4a:b0:5a:13:e4:33",
            "net8": "0a:ca:30:8b:84:1b"
        },
        "leaf_3_0_3": {
            "net0": "4e:47:a7:67:fa:c9",
            "net1": "02:13:a3:7a:f7:cf",
            "net2": "7a:b4:81:ef:35:60",
            "net3": "0e:f5:ed:c2:01:c5",
            "net4": "b6:a2:39:b8:f9:6d",
            "net5": "fa:5f:8e:12:51:cf",
            "net6": "b2:21:b7:d7:52:81",
            "net7": "e2:f7:a4:78:7f:28",
            "net8": "fa:cd:14:cb:31:af"
        },
        "leaf_3_0_4": {
            "net0": "36:8a:86:b3:42:29",
            "net1": "ba:df:73:f2:61:58",
            "net2": "fe:04:f9:a1:e6:ff",
            "net3": "ee:e2:04:99:2a:be",
            "net4": "ce:4e:b7:38:c6:07",
            "net5": "9e:d1:82:35:83:74",
            "net6": "b2:cf:a0:ee:28:ec",
            "net7": "2e:06:2f:a4:0d:7b",
            "net8": "42:93:dd:9e:36:5f"
        },
        "leaf_3_0_5": {
            "net0": "56:f9:6d:3f:ca:97",
            "net1": "62:40:ba:33:b0:d5",
            "net2": "da:0c:0b:ec:e2:9f",
            "net3": "02:c0:0a:c6:43:10",
            "net4": "e6:c9:c4:ed:b1:0f",
            "net5": "52:e8:2b:97:b3:86",
            "net6": "2a:11:b0:fb:9a:e0",
            "net7": "de:5c:51:46:04:4f",
            "net8": "02:86:5d:22:56:04"
        },
        "leaf_3_0_6": {
            "net0": "ea:49:08:aa:2b:90",
            "net1": "52:7d:b0:09:1c:2d",
            "net2": "22:63:7d:a2:d2:5e",
            "net3": "c2:d6:09:f7:96:00",
            "net4": "9a:9d:a8:05:82:cd",
            "net5": "82:c9:32:94:7a:0f",
            "net6": "a2:ef:de:03:e6:10",
            "net7": "12:c0:fa:6d:f2:50",
            "net8": "a6:2c:e4:23:18:01"
        },
        "leaf_3_0_7": {
            "net0": "66:c2:dc:4a:70:4c",
            "net1": "a2:d4:5a:6c:4b:76",
            "net2": "5a:84:28:ca:e8:04",
            "net3": "de:77:a5:ad:ac:51",
            "net4": "5a:04:7d:52:8a:86",
            "net5": "8a:9b:ee:85:b5:85",
            "net6": "fe:fb:5b:da:1b:e5",
            "net7": "e2:c6:d4:b8:d5:1b",
            "net8": "1a:d9:1f:16:71:54"
        },
        "leaf_3_0_8": {
            "net0": "4e:78:c0:87:51:b5",
            "net1": "46:04:b4:52:b0:ac",
            "net2": "02:c0:01:27:29:7f",
            "net3": "92:e1:c8:92:8d:f5",
            "net4": "2e:a4:f9:ff:af:f5",
            "net5": "56:9c:f9:ab:7d:d2",
            "net6": "6e:fd:0d:19:e3:54",
            "net7": "9a:31:40:d4:17:07",
            "net8": "e6:89:7e:fd:66:5d"
        },
        "leaf_4_0_1": {
            "net0": "62:95:8a:0a:24:ee",
            "net1": "96:22:2a:9b:a4:0d",
            "net2": "ae:3d:b7:06:5f:7c",
            "net3": "fe:18:9a:f5:55:0d",
            "net4": "b6:6f:e3:30:9d:f0",
            "net5": "72:9f:da:16:3b:b4",
            "net6": "36:c8:93:5f:40:6d",
            "net7": "aa:89:b2:a1:0a:e0",
            "net8": "76:73:dd:fb:85:cb"
        },
        "leaf_4_0_2": {
            "net0": "52:41:72:2f:37:7f",
            "net1": "4e:65:48:9a:87:54",
            "net2": "32:d6:10:0e:c1:38",
            "net3": "ea:f4:dd:06:74:aa",
            "net4": "0a:00:04:77:7f:4b",
            "net5": "16:29:31:b4:e2:c8",
            "net6": "76:ba:59:e1:73:b7",
            "net7": "ea:14:0b:88:43:54",
            "net8": "7a:54:54:ab:b1:5f"
        },
        "leaf_4_0_3": {
            "net0": "02:e3:92:14:7e:f6",
            "net1": "72:13:a2:af:91:06",
            "net2": "be:54:f4:76:fc:fc",
            "net3": "26:91:3f:b8:73:fe",
            "net4": "7e:ad:bc:f4:65:11",
            "net5": "12:56:14:56:3b:0d",
            "net6": "ba:dc:12:8b:8f:bd",
            "net7": "6e:d2:ac:df:e3:79",
            "net8": "f2:13:20:12:99:15"
        },
        "leaf_4_0_4": {
            "net0": "be:2f:6a:e6:d8:6f",
            "net1": "fa:8a:5b:3e:e0:20",
            "net2": "66:b9:74:62:02:66",
            "net3": "26:a3:a3:24:32:fd",
            "net4": "76:66:87:52:8f:a5",
            "net5": "de:75:dd:c7:a9:86",
            "net6": "5a:15:7a:c6:73:89",
            "net7": "ea:df:43:9e:62:49",
            "net8": "b2:6c:55:8e:f6:e6"
        },
        "leaf_4_0_5": {
            "net0": "6e:19:66:63:1b:ad",
            "net1": "46:23:91:5b:5b:cc",
            "net2": "12:ad:05:05:ee:55",
            "net3": "82:d4:de:18:e1:e4",
            "net4": "36:8a:05:5d:d9:60",
            "net5": "2e:49:80:42:4f:e7",
            "net6": "2a:c3:e3:f4:47:1c",
            "net7": "4a:07:a8:23:da:37",
            "net8": "5a:71:0f:03:dd:30"
        },
        "leaf_4_0_6": {
            "net0": "46:da:08:d6:52:3d",
            "net1": "62:44:9c:9d:3c:35",
            "net2": "6a:92:a2:8b:e3:03",
            "net3": "e6:a2:75:c6:2c:05",
            "net4": "ee:09:c7:01:12:42",
            "net5": "ca:e9:19:86:c6:3a",
            "net6": "fe:00:b2:ae:af:29",
            "net7": "7a:6e:30:fb:e4:18",
            "net8": "6a:61:77:eb:78:7b"
        },
        "leaf_4_0_7": {
            "net0": "62:67:40:cd:c6:56",
            "net1": "42:f5:98:1a:8f:ac",
            "net2": "1a:b7:2d:b3:bb:c3",
            "net3": "ca:f6:83:7b:89:2c",
            "net4": "06:a0:d1:1c:c5:bb",
            "net5": "7a:cd:7e:ad:e7:63",
            "net6": "8a:65:75:39:2f:2f",
            "net7": "b6:ea:e8:4c:3f:ba",
            "net8": "46:c7:15:b4:bb:66"
        },
        "leaf_4_0_8": {
            "net0": "96:ed:ac:27:b5:d1",
            "net1": "32:28:5f:59:7f:99",
            "net2": "fe:e7:39:cc:40:d7",
            "net3": "66:67:b6:c3:da:f3",
            "net4": "06:43:65:d1:ad:92",
            "net5": "26:fc:b1:40:02:18",
            "net6": "c2:af:e7:61:8a:19",
            "net7": "3a:96:a7:88:28:b2",
            "net8": "a6:88:05:7b:1e:00"
        },
        "leaf_5_0_1": {
            "net0": "de:50:8a:16:16:3a",
            "net1": "be:b9:41:8a:86:5f",
            "net2": "ba:78:cb:60:10:b9",
            "net3": "1e:0a:c5:c5:73:9b",
            "net4": "62:3e:d1:2f:1c:be",
            "net5": "92:8a:9a:08:9d:a7",
            "net6": "06:21:82:55:a9:47",
            "net7": "3a:49:94:c8:1a:6b",
            "net8": "0e:12:48:4e:0a:d3"
        },
        "leaf_5_0_2": {
            "net0": "9a:0f:47:ee:b3:9b",
            "net1": "d2:f3:0b:cb:ac:1c",
            "net2": "76:db:da:9b:5c:d7",
            "net3": "1a:4b:52:47:9e:89",
            "net4": "32:75:dd:96:1f:05",
            "net5": "02:5c:2e:40:82:b7",
            "net6": "16:d3:bd:4a:63:7c",
            "net7": "4e:aa:4b:0d:98:31",
            "net8": "82:17:f1:de:5c:e1"
        },
        "leaf_5_0_3": {
            "net0": "5e:de:75:1c:8f:6b",
            "net1": "ba:ee:c3:88:60:21",
            "net2": "92:36:41:9a:c2:c6",
            "net3": "62:39:86:6a:73:2f",
            "net4": "22:2e:12:72:1d:25",
            "net5": "fe:69:b4:04:7d:df",
            "net6": "16:7f:10:cb:a5:18",
            "net7": "1a:71:a1:11:7e:f3",
            "net8": "d6:2a:d3:f7:22:0b"
        },
        "leaf_5_0_4": {
            "net0": "9e:4b:5d:6d:1e:f0",
            "net1": "42:cc:30:81:7f:70",
            "net2": "06:0f:fe:2a:a1:2d",
            "net3": "2a:64:2a:50:e5:75",
            "net4": "86:20:71:55:f4:81",
            "net5": "c6:4a:89:ad:65:06",
            "net6": "66:4b:02:b6:ec:c0",
            "net7": "36:60:4a:42:72:fb",
            "net8": "26:00:fd:f8:28:d1"
        },
        "leaf_5_0_5": {
            "net0": "16:ed:9d:5e:a4:c7",
            "net1": "66:0b:cc:c8:7a:51",
            "net2": "f6:80:a3:fb:6f:1d",
            "net3": "d6:42:ab:c6:25:a9",
            "net4": "d6:f1:b6:d0:d8:98",
            "net5": "1a:a8:da:12:52:7c",
            "net6": "9e:38:b7:3d:e1:ea",
            "net7": "46:96:a4:68:f8:0c",
            "net8": "9e:c0:62:ba:02:53"
        },
        "leaf_5_0_6": {
            "net0": "fe:78:28:37:17:4e",
            "net1": "1e:19:ee:20:5c:0a",
            "net2": "22:b0:ed:6c:d1:e9",
            "net3": "02:1e:78:60:15:49",
            "net4": "92:60:19:cc:25:93",
            "net5": "c6:ad:48:42:86:cc",
            "net6": "d6:37:26:60:ba:ee",
            "net7": "96:8c:34:f8:7e:21",
            "net8": "92:fb:a9:7b:52:98"
        },
        "leaf_5_0_7": {
            "net0": "36:5c:26:e5:be:c6",
            "net1": "12:c7:2a:5f:e1:d2",
            "net2": "be:cb:e1:62:b6:c3",
            "net3": "86:b0:dc:7f:05:37",
            "net4": "9a:89:92:b8:ab:13",
            "net5": "ba:ce:b0:74:cc:08",
            "net6": "22:03:4b:64:e7:83",
            "net7": "62:41:c2:ca:c5:be",
            "net8": "96:cb:70:dc:6d:62"
        },
        "leaf_5_0_8": {
            "net0": "16:c4:76:5b:3c:e5",
            "net1": "06:30:90:38:ad:b9",
            "net2": "c6:78:40:38:21:35",
            "net3": "d6:a2:f4:ee:e0:1a",
            "net4": "ba:47:ea:c1:f6:bc",
            "net5": "72:45:d6:75:26:5f",
            "net6": "12:71:65:b5:43:1c",
            "net7": "76:86:a0:ba:38:03",
            "net8": "36:32:af:00:43:c0"
        },
        "leaf_6_0_1": {
            "net0": "5a:7b:09:e0:61:7e",
            "net1": "fe:be:f6:8d:55:fa",
            "net2": "3e:1c:17:b1:ff:48",
            "net3": "0a:0e:e2:6f:09:0e",
            "net4": "d2:62:18:78:fb:83",
            "net5": "06:4e:29:bf:88:9c",
            "net6": "62:27:80:7b:d0:f6",
            "net7": "6a:fd:84:4d:21:83",
            "net8": "06:da:60:1f:ef:12"
        },
        "leaf_6_0_2": {
            "net0": "6e:ea:81:d1:7e:0f",
            "net1": "3e:40:93:00:8e:5e",
            "net2": "1e:40:91:b1:0e:39",
            "net3": "56:f2:4b:0e:2a:26",
            "net4": "22:d3:23:7d:5c:ad",
            "net5": "42:54:71:f3:0d:ae",
            "net6": "96:ec:06:22:03:c1",
            "net7": "b6:fb:d3:64:e6:9a",
            "net8": "ae:75:1a:1c:6f:2b"
        },
        "leaf_6_0_3": {
            "net0": "46:d8:77:89:05:77",
            "net1": "b2:e7:9a:da:ca:a2",
            "net2": "3a:4b:bb:a7:04:d4",
            "net3": "5e:c4:b4:2c:5c:0b",
            "net4": "ba:f9:10:f6:9f:af",
            "net5": "a6:23:3c:e5:f6:64",
            "net6": "ce:de:4b:f5:85:f6",
            "net7": "46:4a:94:01:f5:5b",
            "net8": "92:fa:47:2b:32:bc"
        },
        "leaf_6_0_4": {
            "net0": "32:75:18:ed:f8:f4",
            "net1": "56:c2:e1:62:39:81",
            "net2": "3e:bf:e7:bf:ad:b3",
            "net3": "d2:1d:af:a4:1b:4c",
            "net4": "a2:78:33:ee:49:61",
            "net5": "b6:e2:af:81:0c:37",
            "net6": "12:c2:28:98:c5:43",
            "net7": "62:f7:b2:79:9d:74",
            "net8": "3a:64:4d:b4:40:12"
        },
        "leaf_6_0_5": {
            "net0": "ee:69:6d:76:78:02",
            "net1": "76:49:fc:83:57:43",
            "net2": "a6:42:3d:2d:ef:5a",
            "net3": "4a:51:7b:12:ba:46",
            "net4": "da:9e:07:9e:52:79",
            "net5": "06:28:15:e0:c6:81",
            "net6": "d2:ee:20:d3:cd:e8",
            "net7": "02:57:35:f1:cd:f5",
            "net8": "02:f8:b0:cd:8b:a8"
        },
        "leaf_6_0_6": {
            "net0": "42:8c:e8:94:aa:a3",
            "net1": "36:66:bb:06:b5:bf",
            "net2": "ee:d1:c3:d1:7b:6a",
            "net3": "96:f0:4b:73:f6:b3",
            "net4": "f2:4e:6b:9d:68:b1",
            "net5": "e2:6f:ee:f6:f6:1a",
            "net6": "b6:db:59:14:ef:c2",
            "net7": "d6:b4:e4:0b:26:f5",
            "net8": "ee:cc:c5:94:c0:c2"
        },
        "leaf_6_0_7": {
            "net0": "96:07:4a:dd:ae:40",
            "net1": "ce:27:2d:70:47:43",
            "net2": "ce:e6:7f:de:18:f4",
            "net3": "22:e0:c9:b9:40:03",
            "net4": "d2:a6:b8:fc:3c:09",
            "net5": "86:b2:4d:35:40:b4",
            "net6": "2a:3f:b9:22:75:83",
            "net7": "6e:fd:44:7c:92:e2",
            "net8": "2a:50:32:c7:2d:b6"
        },
        "leaf_6_0_8": {
            "net0": "82:17:eb:ef:5f:93",
            "net1": "72:9b:43:ea:5c:76",
            "net2": "d2:bd:13:d4:67:ab",
            "net3": "e2:fd:7a:b7:4c:ef",
            "net4": "6e:5b:47:90:68:31",
            "net5": "9a:5f:92:f7:ea:76",
            "net6": "02:28:db:d4:04:5e",
            "net7": "16:18:56:58:50:5f",
            "net8": "52:b0:f6:3e:cc:fd"
        },
        "leaf_7_0_1": {
            "net0": "da:76:dd:3a:4d:68",
            "net1": "62:64:b2:c5:18:b7",
            "net2": "12:1f:d1:b7:c8:79",
            "net3": "5e:da:b1:17:b5:b2",
            "net4": "6a:84:8f:59:e7:8c",
            "net5": "36:b4:09:c8:b8:d7",
            "net6": "8e:e5:14:94:2d:c5",
            "net7": "aa:d5:35:eb:9a:4e",
            "net8": "7a:61:9f:fb:ef:65"
        },
        "leaf_7_0_2": {
            "net0": "9a:ec:ab:7f:13:df",
            "net1": "86:53:ac:ef:09:26",
            "net2": "52:63:66:fa:90:2e",
            "net3": "2e:b7:da:52:8f:93",
            "net4": "4a:27:12:6b:e4:97",
            "net5": "4e:c0:50:ae:f3:1d",
            "net6": "66:81:60:1c:41:2f",
            "net7": "be:be:9e:9e:6d:77",
            "net8": "e6:2c:7d:14:c4:e2"
        },
        "leaf_7_0_3": {
            "net0": "02:6d:29:1a:27:52",
            "net1": "22:fb:3c:c8:97:94",
            "net2": "22:3f:c8:f9:2b:97",
            "net3": "02:f7:10:e0:2a:c2",
            "net4": "e6:e3:aa:3a:d6:36",
            "net5": "4e:e0:4f:16:29:04",
            "net6": "36:b7:38:73:c5:f8",
            "net7": "a2:96:1a:5e:f6:e3",
            "net8": "7e:a1:0c:c6:84:26"
        },
        "leaf_7_0_4": {
            "net0": "6e:56:dd:d7:63:e3",
            "net1": "4a:0c:19:14:4b:01",
            "net2": "06:dd:ab:45:d1:62",
            "net3": "fe:5c:db:4b:de:62",
            "net4": "e2:cf:64:2c:97:74",
            "net5": "6e:61:be:82:78:d6",
            "net6": "ee:b0:ca:97:c0:dc",
            "net7": "12:e6:8b:83:10:1a",
            "net8": "aa:a2:ae:c0:33:3b"
        },
        "leaf_7_0_5": {
            "net0": "2e:99:d9:41:2d:77",
            "net1": "e6:38:07:6c:69:f5",
            "net2": "fa:34:0b:5c:a0:0e",
            "net3": "4e:80:b0:33:7d:1f",
            "net4": "c6:fa:e5:1e:e7:6f",
            "net5": "9e:67:c5:4f:79:c7",
            "net6": "e2:28:4f:5e:ab:95",
            "net7": "ca:ac:44:f8:c3:ee",
            "net8": "7a:f5:ec:88:9c:45"
        },
        "leaf_7_0_6": {
            "net0": "ca:25:3b:ba:9a:20",
            "net1": "82:37:d9:91:3c:c0",
            "net2": "a2:7b:a4:fa:ae:2c",
            "net3": "2e:b1:bf:cc:52:e3",
            "net4": "86:8a:b4:e6:c8:23",
            "net5": "e2:14:45:86:5d:0b",
            "net6": "ae:ee:60:b9:9f:7d",
            "net7": "d2:09:01:c8:e0:fa",
            "net8": "c6:02:7d:24:72:03"
        },
        "leaf_7_0_7": {
            "net0": "f6:23:48:3f:58:da",
            "net1": "22:1c:13:5b:c6:00",
            "net2": "2a:5f:7c:7e:b5:e0",
            "net3": "e2:de:40:f8:af:66",
            "net4": "c2:d6:2a:a1:d9:d5",
            "net5": "96:4d:96:79:1d:4c",
            "net6": "9a:2b:42:83:fa:22",
            "net7": "96:cc:37:04:7c:01",
            "net8": "fa:61:25:34:5b:10"
        },
        "leaf_7_0_8": {
            "net0": "4e:cb:91:69:d1:1a",
            "net1": "56:ed:55:95:8e:b3",
            "net2": "ce:75:3e:4a:7a:aa",
            "net3": "32:92:61:9b:22:4d",
            "net4": "4e:59:2d:2d:a9:ce",
            "net5": "12:ea:f2:b0:54:e6",
            "net6": "d2:62:b7:de:d6:56",
            "net7": "9e:ff:00:fb:21:01",
            "net8": "a6:8b:57:7e:11:2a"
        },
        "leaf_8_0_1": {
            "net0": "86:66:2a:16:17:d8",
            "net1": "1a:cb:3f:ad:8a:4e",
            "net2": "02:dd:af:9d:98:02",
            "net3": "f2:46:19:8d:88:20",
            "net4": "d2:c8:ad:0a:55:cc",
            "net5": "4e:e3:28:96:34:a3",
            "net6": "ba:a6:d8:b5:85:84",
            "net7": "be:87:da:52:86:31",
            "net8": "9a:48:90:52:62:b0"
        },
        "leaf_8_0_2": {
            "net0": "e2:46:c0:bd:8b:33",
            "net1": "12:bf:6f:8f:b8:e5",
            "net2": "d2:69:93:cd:25:f3",
            "net3": "56:e7:c4:dd:3d:4f",
            "net4": "f6:be:ba:da:18:00",
            "net5": "b6:5b:f8:7c:e4:48",
            "net6": "4e:94:ef:60:7a:73",
            "net7": "8a:a1:c2:a6:47:d9",
            "net8": "16:fb:4a:68:17:b8"
        },
        "leaf_8_0_3": {
            "net0": "e6:01:16:50:49:c8",
            "net1": "be:13:b3:3b:7f:80",
            "net2": "46:55:97:32:6d:51",
            "net3": "ce:25:8b:da:da:ed",
            "net4": "aa:46:53:47:ba:5e",
            "net5": "26:c3:64:b3:bb:a2",
            "net6": "1e:a8:c7:25:d5:52",
            "net7": "26:25:33:5f:b4:43",
            "net8": "5a:9b:fc:ad:16:e5"
        },
        "leaf_8_0_4": {
            "net0": "8e:18:69:93:75:e7",
            "net1": "a2:25:13:e9:e7:3c",
            "net2": "1e:20:28:73:a9:ea",
            "net3": "82:39:4a:f1:98:c2",
            "net4": "5e:7d:fa:b8:31:fa",
            "net5": "da:1b:ee:95:bc:ef",
            "net6": "32:66:d7:99:42:47",
            "net7": "ea:7d:c2:88:1e:4f",
            "net8": "e2:09:3d:0e:7d:ee"
        },
        "leaf_8_0_5": {
            "net0": "d2:4f:1a:2f:12:2c",
            "net1": "0e:aa:aa:a9:63:f9",
            "net2": "4e:f4:f3:a7:85:b8",
            "net3": "8a:eb:fc:de:3c:b6",
            "net4": "7a:5a:53:6f:b1:c5",
            "net5": "da:37:9f:79:42:2a",
            "net6": "7e:84:61:cf:2b:81",
            "net7": "3a:1f:64:cf:ba:8c",
            "net8": "42:11:27:e8:9b:8d"
        },
        "leaf_8_0_6": {
            "net0": "96:1b:97:2c:f4:58",
            "net1": "c6:ef:95:14:63:fe",
            "net2": "c2:66:4a:85:3c:22",
            "net3": "66:aa:0a:44:ed:b5",
            "net4": "42:53:f5:3c:92:7d",
            "net5": "da:80:b8:4d:4f:a3",
            "net6": "92:a0:83:77:64:28",
            "net7": "92:f2:ab:55:cc:c7",
            "net8": "2e:41:99:de:d9:7a"
        },
        "leaf_8_0_7": {
            "net0": "aa:0f:ae:7b:dd:1d",
            "net1": "62:fc:24:77:8a:c5",
            "net2": "56:bb:ea:a8:9b:aa",
            "net3": "36:47:c6:70:7d:d7",
            "net4": "5e:94:6f:ab:6d:cc",
            "net5": "56:46:60:d5:06:f7",
            "net6": "86:93:81:05:4c:66",
            "net7": "d2:17:34:ba:e9:9b",
            "net8": "ce:6a:2b:78:b7:9c"
        },
        "leaf_8_0_8": {
            "net0": "e6:39:a4:61:2b:34",
            "net1": "72:bc:59:f2:a5:d7",
            "net2": "b6:3b:3c:6b:4d:27",
            "net3": "22:7a:cc:ab:7e:5f",
            "net4": "b6:2b:bc:16:f0:49",
            "net5": "b6:a4:3e:d2:c1:44",
            "net6": "6a:64:66:10:88:12",
            "net7": "86:93:03:74:8c:a8",
            "net8": "aa:02:78:13:76:26"
        },
        "spine_1_1_1": {
            "net0": "52:2f:3d:dc:6c:c3",
            "net1": "46:35:dd:7e:db:c9",
            "net10": "9a:26:43:3a:3e:d2",
            "net11": "4e:0a:2a:9f:b9:7b",
            "net12": "12:42:af:bc:87:ce",
            "net13": "26:3f:e3:f0:2a:b9",
            "net14": "e2:c6:0b:a4:3c:03",
            "net15": "b6:99:88:e4:37:43",
            "net2": "6a:56:26:fe:ab:b3",
            "net3": "f2:02:34:8f:00:5d",
            "net4": "9a:9a:3c:0b:5d:fa",
            "net5": "4e:89:cd:1d:18:2e",
            "net6": "36:7f:65:b5:d7:dc",
            "net7": "2e:a5:77:60:e4:96",
            "net8": "1e:74:97:54:69:52",
            "net9": "9e:c2:03:1e:61:7a"
        },
        "spine_1_1_2": {
            "net0": "46:d8:fc:56:e3:5e",
            "net1": "aa:7e:70:c5:9d:52",
            "net10": "9e:ba:2a:99:ac:f0",
            "net11": "6a:2b:ff:88:30:10",
            "net12": "8e:67:5c:41:fc:e1",
            "net13": "9e:d5:3a:e9:f0:41",
            "net14": "72:95:ea:a7:f2:d3",
            "net15": "c2:68:e5:24:fa:e9",
            "net2": "82:e5:0d:20:11:1a",
            "net3": "fe:8a:85:37:88:ef",
            "net4": "26:e9:80:95:c7:27",
            "net5": "82:f5:27:dd:49:f9",
            "net6": "ca:70:d9:13:25:3c",
            "net7": "02:44:40:8c:49:65",
            "net8": "36:73:84:90:8b:f7",
            "net9": "7a:25:59:fc:72:dc"
        },
        "spine_1_1_3": {
            "net0": "b6:0b:69:20:fe:58",
            "net1": "a2:ef:09:68:89:a4",
            "net10": "ee:bb:fb:63:ee:e4",
            "net11": "3a:bd:29:a6:0d:fc",
            "net12": "4e:91:36:bd:ac:44",
            "net13": "a2:ec:39:a1:df:bc",
            "net14": "12:be:31:c2:08:1d",
            "net15": "1a:29:ac:5e:13:18",
            "net2": "06:ff:3a:00:d1:98",
            "net3": "3e:70:dc:f9:bf:49",
            "net4": "a2:67:8f:10:de:f1",
            "net5": "f2:05:21:47:c5:62",
            "net6": "ee:ea:fd:d4:a3:62",
            "net7": "36:28:cc:83:5c:fa",
            "net8": "92:8a:08:34:26:61",
            "net9": "fa:a9:68:56:9b:ee"
        },
        "spine_1_1_4": {
            "net0": "ee:f7:79:48:f5:e1",
            "net1": "d6:ad:41:73:df:2d",
            "net10": "6a:c1:6b:b2:5d:4d",
            "net11": "a6:3b:14:64:5f:6c",
            "net12": "ea:d5:1e:14:7a:fd",
            "net13": "da:58:c4:7b:e4:85",
            "net14": "aa:ea:ac:7a:37:4d",
            "net15": "76:51:5f:0f:c3:0b",
            "net2": "76:d8:d2:90:9d:2a",
            "net3": "d2:fc:60:b3:83:a1",
            "net4": "3a:5c:2e:6e:36:6a",
            "net5": "e2:f2:71:22:84:e6",
            "net6": "0a:12:a0:d1:75:42",
            "net7": "56:70:66:ec:21:3f",
            "net8": "22:24:2e:52:47:c9",
            "net9": "fe:e2:14:47:00:b0"
        },
        "spine_1_1_5": {
            "net0": "ee:3e:b2:54:26:42",
            "net1": "62:22:d5:89:1d:d0",
            "net10": "72:3d:83:47:79:11",
            "net11": "0a:f5:d9:1d:7e:5c",
            "net12": "1e:dc:3b:c9:42:0a",
            "net13": "aa:e5:3c:fc:1d:f2",
            "net14": "f6:c3:53:7e:2d:57",
            "net15": "d2:5c:c5:0b:42:4c",
            "net2": "02:09:f2:45:0c:ba",
            "net3": "52:c0:e3:8a:55:94",
            "net4": "12:13:e5:9e:20:2b",
            "net5": "ee:45:26:d9:16:ee",
            "net6": "ae:9e:c0:86:5a:b5",
            "net7": "26:f9:19:e6:8b:34",
            "net8": "1a:e7:54:b6:92:13",
            "net9": "8e:dc:81:dc:83:4b"
        },
        "spine_1_1_6": {
            "net0": "ca:b5:52:51:73:89",
            "net1": "2a:8f:ed:d4:9f:f0",
            "net10": "9e:99:ab:c3:35:7d",
            "net11": "72:af:86:fa:55:04",
            "net12": "42:26:25:46:35:7c",
            "net13": "12:95:8f:b9:85:4d",
            "net14": "76:a7:2c:8a:14:60",
            "net15": "ba:be:4e:f4:c5:63",
            "net2": "fe:89:ed:18:95:25",
            "net3": "4e:dd:11:bf:97:58",
            "net4": "56:54:69:85:1e:14",
            "net5": "4e:bd:c3:f6:f2:f8",
            "net6": "26:e9:b0:bc:b8:bd",
            "net7": "1e:ad:47:27:6f:96",
            "net8": "b6:7c:ce:39:b7:a2",
            "net9": "1a:29:ec:a9:ef:df"
        },
        "spine_1_1_7": {
            "net0": "ce:bc:8f:04:35:69",
            "net1": "6e:4b:9e:42:7d:58",
            "net10": "d2:97:e9:30:5e:cb",
            "net11": "ee:f9:dc:9e:29:51",
            "net12": "3a:55:f3:d4:f5:bc",
            "net13": "1a:a6:a8:6e:ae:73",
            "net14": "b2:3f:bf:2d:0c:2b",
            "net15": "4e:09:f4:99:b0:52",
            "net2": "f6:45:67:fd:a6:40",
            "net3": "26:61:0b:1e:e5:24",
            "net4": "3a:72:a1:8e:c7:99",
            "net5": "5a:3c:1d:7b:58:25",
            "net6": "aa:76:f3:c4:44:c5",
            "net7": "d2:ae:e0:c5:e2:cc",
            "net8": "92:ee:24:5a:7e:93",
            "net9": "22:93:24:67:b7:c4"
        },
        "spine_1_1_8": {
            "net0": "72:46:16:fa:63:8c",
            "net1": "2e:ad:76:44:43:d9",
            "net10": "ca:93:d2:fc:ab:71",
            "net11": "de:96:3e:61:b6:c6",
            "net12": "2a:ad:4d:6d:4f:35",
            "net13": "22:7d:8d:bf:44:ca",
            "net14": "1a:96:a2:89:b5:13",
            "net15": "1e:ef:4d:4e:47:6d",
            "net2": "c2:20:86:1b:2f:73",
            "net3": "d2:03:01:97:8e:e6",
            "net4": "22:64:51:89:05:97",
            "net5": "da:98:0f:e5:8e:72",
            "net6": "56:0f:26:48:0f:1b",
            "net7": "82:3a:c6:c2:f8:b0",
            "net8": "86:43:63:bc:dc:5d",
            "net9": "e6:ad:58:87:45:7d"
        },
        "spine_2_1_1": {
            "net0": "ae:b2:74:99:30:07",
            "net1": "32:f1:bf:f8:67:65",
            "net10": "4a:19:8a:91:8c:47",
            "net11": "b2:7d:26:c8:10:b9",
            "net12": "c6:1b:f4:a4:83:20",
            "net13": "fa:d1:58:d9:36:1b",
            "net14": "06:bc:6d:3f:23:f9",
            "net15": "f2:15:02:ed:33:76",
            "net2": "8a:40:e2:9a:62:0f",
            "net3": "7a:bd:a6:c1:e5:6e",
            "net4": "62:aa:0d:4e:61:41",
            "net5": "02:e5:1c:1c:f8:b8",
            "net6": "f2:ba:ae:63:9b:bb",
            "net7": "0a:8f:68:c6:4e:f8",
            "net8": "8a:10:1c:d0:26:05",
            "net9": "ee:2b:02:c2:b2:ce"
        },
        "spine_2_1_2": {
            "net0": "62:d5:e7:74:82:b2",
            "net1": "2a:6e:5b:d9:28:c5",
            "net10": "2a:93:84:bf:f7:60",
            "net11": "96:0a:63:1e:9c:3c",
            "net12": "c6:cf:3f:19:15:f1",
            "net13": "5a:7b:a3:a6:89:fc",
            "net14": "d2:a3:7e:96:d3:9a",
            "net15": "62:b6:cf:36:fb:9a",
            "net2": "56:3c:af:bd:ef:43",
            "net3": "1a:3f:92:3e:f7:d9",
            "net4": "ce:36:64:f9:85:24",
            "net5": "6e:f7:cf:47:7e:5c",
            "net6": "ba:1e:68:4d:65:b3",
            "net7": "d2:f4:a7:b0:84:3f",
            "net8": "22:8f:5b:4b:c1:72",
            "net9": "d6:d9:57:98:bd:9a"
        },
        "spine_2_1_3": {
            "net0": "de:cd:7d:10:e1:4b",
            "net1": "9e:da:c0:ce:3e:58",
            "net10": "36:4d:ef:5e:af:d5",
            "net11": "fe:ff:6f:14:0d:50",
            "net12": "2e:f7:b4:d7:9f:99",
            "net13": "a2:ac:17:82:16:40",
            "net14": "9a:47:b2:02:1c:bd",
            "net15": "66:8b:6e:86:25:86",
            "net2": "f2:dd:ea:3c:52:11",
            "net3": "66:b2:83:a3:48:bb",
            "net4": "7e:71:56:b9:61:78",
            "net5": "6a:4f:06:af:65:a8",
            "net6": "6e:36:5a:be:ff:ec",
            "net7": "96:bf:97:63:05:77",
            "net8": "82:27:6d:0e:dc:fe",
            "net9": "8e:b2:b8:9b:40:9a"
        },
        "spine_2_1_4": {
            "net0": "b2:5f:99:6a:25:27",
            "net1": "d2:e9:2b:af:67:e4",
            "net10": "6e:a7:4a:1f:7d:6e",
            "net11": "ea:50:a9:2f:6c:30",
            "net12": "3e:0b:6e:59:2c:04",
            "net13": "8a:63:f0:64:61:d2",
            "net14": "f6:33:d5:d4:77:29",
            "net15": "0a:49:85:7a:6d:21",
            "net2": "16:55:7f:62:93:fe",
            "net3": "e6:fa:f7:a3:7f:32",
            "net4": "ce:54:29:b6:11:8b",
            "net5": "4a:40:68:46:34:42",
            "net6": "5e:04:4c:59:67:f0",
            "net7": "5e:c0:53:e0:78:dc",
            "net8": "f2:18:23:3e:d8:55",
            "net9": "4e:ec:74:2a:9e:94"
        },
        "spine_2_1_5": {
            "net0": "02:0e:ce:b8:d9:d7",
            "net1": "ba:45:94:fb:75:3b",
            "net10": "b2:5a:e4:a5:1a:46",
            "net11": "36:63:de:b9:b2:b6",
            "net12": "8e:a1:16:b8:53:e8",
            "net13": "fe:13:a3:7d:18:d8",
            "net14": "62:66:2d:62:7c:79",
            "net15": "96:2e:28:6d:1d:52",
            "net2": "4e:4f:c0:ac:a6:cf",
            "net3": "36:52:5b:95:f0:7f",
            "net4": "b6:52:2a:92:5d:23",
            "net5": "8a:e9:a4:e9:5d:7f",
            "net6": "06:0c:46:01:77:61",
            "net7": "66:71:63:29:6a:ba",
            "net8": "5e:70:d7:0d:d1:ce",
            "net9": "a2:0b:41:e8:28:7f"
        },
        "spine_2_1_6": {
            "net0": "46:80:48:db:52:3a",
            "net1": "a2:33:a9:d3:20:dd",
            "net10": "e2:05:30:a6:70:1d",
            "net11": "16:b3:6e:f8:ef:91",
            "net12": "76:11:6b:13:5c:c9",
            "net13": "be:bf:67:d2:c2:b5",
            "net14": "b2:d4:38:cc:4f:45",
            "net15": "c6:61:40:ee:71:31",
            "net2": "d2:40:46:b1:91:32",
            "net3": "b2:88:e3:16:12:4a",
            "net4": "76:95:f2:be:75:3a",
            "net5": "6a:d5:70:08:a9:31",
            "net6": "3a:c4:c6:04:81:ad",
            "net7": "b6:84:72:77:0b:bf",
            "net8": "e6:63:df:f0:41:5d",
            "net9": "6e:e8:9c:bf:7d:f4"
        },
        "spine_2_1_7": {
            "net0": "92:3f:83:b0:f3:22",
            "net1": "9a:d0:88:3e:9e:e2",
            "net10": "92:0c:ee:eb:65:1c",
            "net11": "1a:ca:c8:4a:c3:f3",
            "net12": "7a:18:27:98:33:6c",
            "net13": "36:43:fc:6d:32:ef",
            "net14": "52:d6:b2:08:75:af",
            "net15": "5e:35:75:cf:9b:44",
            "net2": "aa:ef:6a:dc:ae:fb",
            "net3": "7a:b6:5c:fc:cc:b7",
            "net4": "16:a6:0d:db:97:cd",
            "net5": "f6:ff:ab:f8:09:2d",
            "net6": "3a:f1:08:7a:a5:77",
            "net7": "12:4a:9c:31:3b:02",
            "net8": "7e:fe:05:12:eb:c2",
            "net9": "2e:29:ee:7c:2f:63"
        },
        "spine_2_1_8": {
            "net0": "ca:1b:e3:10:56:90",
            "net1": "32:cb:e5:56:86:67",
            "net10": "12:bd:5f:a0:19:0e",
            "net11": "42:fa:91:19:58:2e",
            "net12": "46:de:2a:6d:c2:b3",
            "net13": "7e:a9:86:e2:cd:09",
            "net14": "26:82:11:b4:6a:f8",
            "net15": "66:3a:a0:ee:78:87",
            "net2": "b2:ac:06:a7:92:81",
            "net3": "52:bb:d3:c1:24:c1",
            "net4": "ca:c7:1f:a1:ec:1f",
            "net5": "8a:7c:e1:c0:da:0a",
            "net6": "e2:03:8e:41:f9:96",
            "net7": "c6:e8:61:df:ea:a0",
            "net8": "3e:ee:9c:e5:b1:a5",
            "net9": "c2:44:72:91:fc:27"
        },
        "spine_3_1_1": {
            "net0": "36:13:04:3b:42:e4",
            "net1": "2a:83:c3:e2:61:dd",
            "net10": "9e:3d:34:4f:ef:b6",
            "net11": "ee:d7:62:d3:92:99",
            "net12": "c2:e2:16:f2:cf:e2",
            "net13": "86:85:54:6c:2f:e8",
            "net14": "6e:9a:11:08:c5:d9",
            "net15": "02:34:99:40:67:62",
            "net2": "72:d6:3f:59:1f:fd",
            "net3": "4e:b1:6d:1d:8e:de",
            "net4": "ea:2c:13:d1:f8:dd",
            "net5": "be:f3:3e:29:42:a7",
            "net6": "ea:d9:4d:e3:a0:99",
            "net7": "12:60:45:97:2a:a2",
            "net8": "16:f5:0c:96:07:a3",
            "net9": "da:a4:97:b9:e1:48"
        },
        "spine_3_1_2": {
            "net0": "b2:20:22:6e:e8:f3",
            "net1": "1e:b8:be:a9:ed:2c",
            "net10": "f2:a6:58:0d:a4:02",
            "net11": "62:45:c2:1e:28:f6",
            "net12": "de:2e:d8:91:e2:64",
            "net13": "a6:9d:81:c2:a3:e9",
            "net14": "16:8c:dc:0f:cb:78",
            "net15": "76:14:09:b8:7b:a9",
            "net2": "e6:30:0f:9f:9a:e7",
            "net3": "ee:f4:b6:b2:b7:19",
            "net4": "6e:cc:91:de:6b:35",
            "net5": "3e:25:6e:6e:dd:e1",
            "net6": "5e:22:80:29:ed:e8",
            "net7": "62:18:5c:f2:f6:70",
            "net8": "06:b4:56:fb:3b:92",
            "net9": "3e:2b:21:de:5d:6e"
        },
        "spine_3_1_3": {
            "net0": "7a:1e:06:32:73:2d",
            "net1": "c6:97:b4:8a:5a:55",
            "net10": "b6:31:32:5c:9e:c8",
            "net11": "d2:23:ac:c4:24:6f",
            "net12": "e2:92:e9:20:c1:bf",
            "net13": "12:47:dc:7d:49:1c",
            "net14": "12:95:34:3f:38:d1",
            "net15": "ea:9e:0a:52:ef:d4",
            "net2": "b2:6c:a2:9a:24:24",
            "net3": "12:81:ad:df:6f:a2",
            "net4": "ee:95:10:4f:b5:06",
            "net5": "1a:47:0d:55:18:c7",
            "net6": "46:db:ba:98:1e:8a",
            "net7": "ca:79:8c:bf:c2:53",
            "net8": "8a:14:32:ec:27:5a",
            "net9": "d6:be:19:de:98:77"
        },
        "spine_3_1_4": {
            "net0": "92:62:87:a1:0f:42",
            "net1": "02:5f:b5:87:36:6e",
            "net10": "0e:3c:03:cb:7d:6f",
            "net11": "3a:03:87:2f:68:75",
            "net12": "4e:36:d7:1b:4d:61",
            "net13": "76:74:36:b0:0c:7e",
            "net14": "0a:5e:e7:bc:5b:24",
            "net15": "ea:7a:8e:d0:2d:2a",
            "net2": "0e:38:a2:cd:a8:02",
            "net3": "be:c3:4e:49:6c:e1",
            "net4": "2a:a0:78:84:9d:f5",
            "net5": "6e:6d:28:cd:c9:1a",
            "net6": "32:26:1b:94:dc:7a",
            "net7": "fe:30:8d:40:e5:ce",
            "net8": "02:67:be:5b:cb:6b",
            "net9": "76:e8:82:65:ff:9f"
        },
        "spine_3_1_5": {
            "net0": "5a:b5:10:95:14:da",
            "net1": "2a:c1:94:78:ea:e1",
            "net10": "16:82:84:0d:be:83",
            "net11": "36:42:32:55:ee:6e",
            "net12": "42:23:d9:ed:9d:c9",
            "net13": "c6:8d:be:ad:99:e8",
            "net14": "f2:52:10:f3:ec:23",
            "net15": "36:a5:49:57:1b:9a",
            "net2": "5a:62:22:f3:b7:27",
            "net3": "c2:c4:cd:03:53:e9",
            "net4": "ee:42:9d:d0:04:53",
            "net5": "3a:8b:3a:57:46:3d",
            "net6": "7e:c2:d8:4f:0c:e9",
            "net7": "d2:65:6c:01:a6:a9",
            "net8": "1a:ef:c4:fa:35:f3",
            "net9": "8e:34:ff:be:03:b9"
        },
        "spine_3_1_6": {
            "net0": "c6:15:da:0c:57:fc",
            "net1": "2a:2b:da:22:6d:32",
            "net10": "a2:c7:ed:d1:2e:69",
            "net11": "da:e6:ab:ab:04:5c",
            "net12": "8a:f3:c8:ab:96:fd",
            "net13": "02:03:82:c4:d2:7a",
            "net14": "ae:7d:49:ee:b7:39",
            "net15": "8a:39:df:86:4f:9c",
            "net2": "6e:6f:25:1d:a8:f1",
            "net3": "de:b0:bf:d2:33:9c",
            "net4": "76:51:62:87:3d:94",
            "net5": "ba:f6:38:18:01:85",
            "net6": "5e:4e:5c:cc:98:3f",
            "net7": "72:dd:41:a7:96:63",
            "net8": "22:3b:16:39:97:f1",
            "net9": "26:38:11:7c:9f:3a"
        },
        "spine_3_1_7": {
            "net0": "0e:a8:69:83:9f:da",
            "net1": "9a:6b:f2:01:0c:fe",
            "net10": "ce:7b:d1:b6:82:9f",
            "net11": "f6:5a:57:2f:b0:1a",
            "net12": "0a:0e:2c:33:1c:75",
            "net13": "1a:84:85:4b:2b:c3",
            "net14": "12:80:99:f5:e1:2f",
            "net15": "de:41:ea:c7:81:95",
            "net2": "02:62:28:7c:94:16",
            "net3": "4e:a1:46:d9:cf:e9",
            "net4": "0a:ba:50:d2:4c:6f",
            "net5": "7a:53:ab:ae:76:13",
            "net6": "c6:93:d3:8c:3b:41",
            "net7": "d2:1b:1c:89:6b:52",
            "net8": "42:c1:ed:34:60:8e",
            "net9": "1e:da:14:0e:22:8c"
        },
        "spine_3_1_8": {
            "net0": "4a:9c:81:a8:0b:57",
            "net1": "de:93:3e:d9:0b:55",
            "net10": "56:64:5a:a0:05:a9",
            "net11": "5a:55:87:f4:ac:e2",
            "net12": "de:3a:40:a8:ab:ec",
            "net13": "22:a5:cb:4c:c8:80",
            "net14": "0a:d1:2b:09:07:ba",
            "net15": "82:ff:08:fd:92:43",
            "net2": "66:08:9c:9e:dd:d6",
            "net3": "26:1b:9e:82:92:25",
            "net4": "aa:f2:e3:da:a9:10",
            "net5": "6a:d3:4d:0d:27:36",
            "net6": "22:5b:d8:90:ac:04",
            "net7": "3e:1a:27:c2:35:84",
            "net8": "8a:8d:60:05:22:77",
            "net9": "ea:b4:bd:d1:99:ef"
        },
        "spine_4_1_1": {
            "net0": "76:40:b7:46:55:51",
            "net1": "c6:5a:9b:af:22:bb",
            "net10": "16:a3:64:07:06:8e",
            "net11": "de:07:5a:b1:80:45",
            "net12": "d6:4b:db:6d:01:ba",
            "net13": "6a:1a:aa:d5:ff:f5",
            "net14": "ee:5f:49:b4:26:56",
            "net15": "16:01:26:bc:b3:49",
            "net2": "2e:67:2d:f3:11:5e",
            "net3": "52:58:c2:ff:f0:c9",
            "net4": "0a:7d:f0:2e:7f:2d",
            "net5": "36:6e:6f:52:8f:d8",
            "net6": "2a:2b:a4:0f:70:4f",
            "net7": "7a:eb:c5:29:6f:90",
            "net8": "ba:bb:55:91:13:95",
            "net9": "ce:e0:10:5e:bd:2d"
        },
        "spine_4_1_2": {
            "net0": "62:95:f5:b2:d1:19",
            "net1": "c6:8c:04:a7:9e:10",
            "net10": "0e:16:f7:e8:35:6a",
            "net11": "0e:31:45:85:89:1c",
            "net12": "ce:43:34:a7:a4:fb",
            "net13": "ba:30:74:a7:ae:d1",
            "net14": "c6:30:d6:84:51:88",
            "net15": "0e:e3:9d:6f:19:13",
            "net2": "42:07:78:0b:25:00",
            "net3": "4e:d6:78:6c:a9:9f",
            "net4": "4a:32:1e:27:08:ce",
            "net5": "92:4d:05:77:64:11",
            "net6": "fa:fb:3b:66:2a:1b",
            "net7": "32:55:2a:c2:cd:c2",
            "net8": "ee:e6:fe:93:d9:2a",
            "net9": "9e:61:ab:e2:1c:27"
        },
        "spine_4_1_3": {
            "net0": "06:fd:70:13:51:f7",
            "net1": "6e:c3:bb:80:10:9e",
            "net10": "0e:59:74:db:9c:21",
            "net11": "12:92:81:29:60:0b",
            "net12": "0e:a4:d3:eb:ba:a1",
            "net13": "8e:c3:32:cf:6f:d4",
            "net14": "42:1f:47:0c:2f:28",
            "net15": "72:8e:a8:9a:93:8d",
            "net2": "f2:7b:80:e3:05:3e",
            "net3": "fa:03:89:e0:3c:4d",
            "net4": "ba:91:ba:64:f2:b9",
            "net5": "2e:00:be:56:01:bb",
            "net6": "8e:4d:f9:30:75:7b",
            "net7": "02:d6:06:95:25:54",
            "net8": "c6:42:7b:27:22:fb",
            "net9": "86:d0:a0:4c:8d:d6"
        },
        "spine_4_1_4": {
            "net0": "b6:8e:9e:cc:29:58",
            "net1": "ba:1f:94:3e:7b:11",
            "net10": "76:4b:84:3e:2c:2f",
            "net11": "72:b9:2b:4f:35:6f",
            "net12": "52:17:64:44:18:5f",
            "net13": "f6:18:cc:83:7f:ed",
            "net14": "62:41:bb:14:ab:2a",
            "net15": "e2:75:b8:bf:71:75",
            "net2": "2a:12:7c:b6:4e:60",
            "net3": "42:1d:27:bf:61:40",
            "net4": "b6:a4:50:d5:bf:e8",
            "net5": "d6:e6:e6:3c:52:d4",
            "net6": "76:c3:27:73:38:7e",
            "net7": "ca:31:2d:88:7b:eb",
            "net8": "72:b8:ad:c2:57:e3",
            "net9": "b6:b8:d0:ba:39:03"
        },
        "spine_4_1_5": {
            "net0": "b2:3e:e6:ec:08:c5",
            "net1": "8e:15:fe:6c:64:3e",
            "net10": "fa:37:e1:52:ed:02",
            "net11": "36:3e:04:79:ad:8b",
            "net12": "e6:d9:56:d6:b4:64",
            "net13": "a6:f0:37:66:3b:be",
            "net14": "7a:dd:d0:23:33:56",
            "net15": "36:fc:18:87:c7:32",
            "net2": "ce:74:27:d1:ed:0e",
            "net3": "92:fb:2c:27:09:7b",
            "net4": "0e:8d:9c:db:4e:31",
            "net5": "16:d0:a9:ec:92:29",
            "net6": "da:78:8e:67:ef:79",
            "net7": "46:f1:1a:3d:db:fd",
            "net8": "d2:d8:ab:91:62:b1",
            "net9": "ce:76:3b:d0:18:bd"
        },
        "spine_4_1_6": {
            "net0": "22:0d:ad:ca:0e:9c",
            "net1": "e6:5a:38:40:60:2c",
            "net10": "d2:e3:66:6c:7d:f8",
            "net11": "36:76:6e:85:1b:e3",
            "net12": "32:10:ff:f2:42:6d",
            "net13": "26:7b:46:4b:a5:9c",
            "net14": "ca:3c:7e:b7:72:70",
            "net15": "7e:55:af:58:fe:db",
            "net2": "8e:96:a7:44:27:d9",
            "net3": "62:6d:ba:87:9f:68",
            "net4": "96:07:b6:69:c3:6b",
            "net5": "22:d9:a3:44:fd:62",
            "net6": "ee:d9:ea:b8:c5:fc",
            "net7": "9a:c0:d6:54:12:07",
            "net8": "a6:09:ad:b6:f9:e5",
            "net9": "8a:14:8a:d8:6a:52"
        },
        "spine_4_1_7": {
            "net0": "42:82:0f:23:25:fe",
            "net1": "c2:1d:0b:a6:26:52",
            "net10": "86:b9:5c:dc:e6:26",
            "net11": "a2:06:ce:e4:7f:f9",
            "net12": "1e:d0:a0:d2:0e:86",
            "net13": "1a:63:d5:47:d8:8d",
            "net14": "4a:8f:49:dc:0f:6e",
            "net15": "da:42:0f:6a:a9:54",
            "net2": "fa:eb:15:a5:71:07",
            "net3": "a6:8f:1f:63:dc:77",
            "net4": "ae:82:d5:33:db:fb",
            "net5": "c6:b9:9d:33:7a:3e",
            "net6": "8a:8a:3f:1b:d1:d1",
            "net7": "aa:5a:ed:22:34:29",
            "net8": "06:d5:dc:db:e7:0e",
            "net9": "12:c8:92:70:08:84"
        },
        "spine_4_1_8": {
            "net0": "2a:53:45:93:57:f3",
            "net1": "be:33:97:78:01:6e",
            "net10": "96:41:96:17:89:31",
            "net11": "5e:fa:aa:24:65:5a",
            "net12": "56:42:af:33:a0:3b",
            "net13": "fa:1b:1e:75:30:24",
            "net14": "fa:55:52:d3:ab:35",
            "net15": "0a:f3:45:4e:40:5a",
            "net2": "86:92:a5:3a:2b:1d",
            "net3": "ce:cf:05:d7:86:2d",
            "net4": "fa:48:f9:91:aa:c0",
            "net5": "5a:16:61:24:c8:d2",
            "net6": "a2:5f:00:30:e7:ec",
            "net7": "be:c9:1b:b2:8f:1b",
            "net8": "ae:28:41:48:17:8c",
            "net9": "aa:e5:da:26:fc:43"
        },
        "spine_5_1_1": {
            "net0": "02:84:d0:e8:20:ee",
            "net1": "36:3b:8e:1c:9b:25",
            "net10": "2e:01:b3:5a:d4:bb",
            "net11": "46:a0:9a:90:0a:4c",
            "net12": "22:51:7e:b8:7d:b9",
            "net13": "ce:e0:27:2d:11:2a",
            "net14": "82:36:99:9e:ad:01",
            "net15": "de:06:e1:ef:66:62",
            "net2": "fa:ae:64:ae:f4:73",
            "net3": "0a:29:60:7f:8c:09",
            "net4": "72:68:78:57:a0:f4",
            "net5": "e6:cf:99:bd:e1:11",
            "net6": "46:da:6b:4d:b6:95",
            "net7": "4e:1c:da:16:f1:93",
            "net8": "ee:0e:44:ae:db:a8",
            "net9": "b2:b5:16:67:a2:93"
        },
        "spine_5_1_2": {
            "net0": "52:83:97:e6:b9:30",
            "net1": "2e:ee:e5:6e:08:63",
            "net10": "de:f2:a3:13:5a:ba",
            "net11": "f2:b2:35:53:24:6c",
            "net12": "e2:3b:93:e8:3b:47",
            "net13": "0e:4f:97:66:7c:f4",
            "net14": "a6:98:7b:d7:08:f1",
            "net15": "5a:ce:e9:1f:72:e0",
            "net2": "f6:59:bc:c4:56:8f",
            "net3": "be:77:a5:44:99:42",
            "net4": "1a:76:2b:9f:82:76",
            "net5": "3a:dc:a3:f4:02:fa",
            "net6": "ee:4b:0e:dd:13:bd",
            "net7": "4e:2e:c9:4e:4f:00",
            "net8": "6e:ff:d3:64:91:c3",
            "net9": "ca:a2:65:90:63:e7"
        },
        "spine_5_1_3": {
            "net0": "be:86:23:da:94:2e",
            "net1": "92:89:c7:c6:f7:a4",
            "net10": "ba:93:00:17:a4:57",
            "net11": "46:be:d3:0a:58:a0",
            "net12": "62:12:20:26:cc:36",
            "net13": "8a:97:ff:fe:fa:b1",
            "net14": "b2:e7:b9:fa:53:19",
            "net15": "0e:76:6c:2c:5f:1f",
            "net2": "4e:e2:c8:ef:d9:a2",
            "net3": "b6:b1:c3:ad:3e:49",
            "net4": "9e:df:51:e7:0b:ce",
            "net5": "2e:2e:24:6e:34:7c",
            "net6": "56:a0:23:0e:b7:07",
            "net7": "9e:2b:05:d6:47:15",
            "net8": "b6:13:bb:e6:18:7a",
            "net9": "ca:b3:15:73:98:8a"
        },
        "spine_5_1_4": {
            "net0": "b2:9b:f7:a4:fe:61",
            "net1": "f6:36:99:a6:b5:c1",
            "net10": "22:19:68:bf:27:dd",
            "net11": "8a:03:8b:b3:82:d7",
            "net12": "be:d2:ca:a5:20:d1",
            "net13": "0a:54:c4:d1:1e:65",
            "net14": "de:f1:3c:14:5c:07",
            "net15": "da:64:b6:2f:59:d5",
            "net2": "ea:b9:d9:51:09:52",
            "net3": "e6:5f:14:d3:e0:e4",
            "net4": "3a:de:91:86:54:79",
            "net5": "ea:29:2b:8b:02:77",
            "net6": "72:b2:92:cd:1f:12",
            "net7": "76:21:a5:6d:c0:92",
            "net8": "e6:91:9b:8c:4b:31",
            "net9": "a6:2c:66:ac:bd:72"
        },
        "spine_5_1_5": {
            "net0": "66:d5:53:15:24:5b",
            "net1": "56:94:47:50:7f:84",
            "net10": "6a:82:fa:1e:a6:15",
            "net11": "e2:36:48:e7:93:26",
            "net12": "aa:cc:36:35:2b:80",
            "net13": "3a:b0:56:e8:a7:99",
            "net14": "72:fe:40:c2:7d:42",
            "net15": "aa:35:a5:9f:27:c2",
            "net2": "ae:40:c7:85:a7:a0",
            "net3": "76:45:f0:23:72:4a",
            "net4": "6e:19:90:8e:4a:54",
            "net5": "02:bf:a6:97:21:33",
            "net6": "2e:37:0f:eb:77:7c",
            "net7": "da:99:3f:88:c6:84",
            "net8": "b6:e0:92:e7:47:09",
            "net9": "1e:7f:eb:4c:06:0b"
        },
        "spine_5_1_6": {
            "net0": "8a:b4:f1:99:c7:fa",
            "net1": "32:eb:21:65:6f:d1",
            "net10": "12:dc:e4:fb:56:f1",
            "net11": "e2:2a:05:c8:8a:e2",
            "net12": "f2:0f:2b:d4:3e:0c",
            "net13": "0e:ea:c1:c9:d6:9f",
            "net14": "ce:2f:9f:9a:cd:4e",
            "net15": "52:cf:c3:90:b4:5a",
            "net2": "fe:7e:83:61:23:32",
            "net3": "06:69:f0:e1:7e:3d",
            "net4": "e6:9f:2a:62:c2:0c",
            "net5": "4a:bf:da:7e:11:f4",
            "net6": "02:61:97:a3:ce:bc",
            "net7": "66:f9:51:1c:48:c6",
            "net8": "b6:44:36:ca:00:28",
            "net9": "f6:27:42:f4:ca:36"
        },
        "spine_5_1_7": {
            "net0": "aa:b3:e3:34:34:e3",
            "net1": "6e:31:ef:12:fa:61",
            "net10": "a2:a4:b3:7d:a0:39",
            "net11": "52:52:b4:ed:14:3c",
            "net12": "22:92:4c:24:3b:60",
            "net13": "46:b0:1e:3c:4e:46",
            "net14": "8a:c9:29:1d:be:1c",
            "net15": "12:ce:d3:5f:fb:32",
            "net2": "d6:60:bc:aa:7c:8a",
            "net3": "c2:aa:86:55:11:5f",
            "net4": "6a:ca:ee:36:c2:2e",
            "net5": "56:f2:0e:d4:98:4f",
            "net6": "2e:28:8c:a0:c0:af",
            "net7": "86:c6:63:a1:2f:64",
            "net8": "12:d7:0f:11:b6:f3",
            "net9": "12:eb:ba:75:ea:4c"
        },
        "spine_5_1_8": {
            "net0": "36:11:bf:97:76:1c",
            "net1": "5e:8e:e4:6b:e9:27",
            "net10": "e2:06:ee:d2:43:76",
            "net11": "fa:2a:3c:76:8b:ac",
            "net12": "72:ef:7c:e8:f2:65",
            "net13": "2e:8c:0a:b5:dc:6d",
            "net14": "da:96:5c:48:2f:89",
            "net15": "aa:e1:97:89:a4:eb",
            "net2": "66:3b:c6:10:e3:41",
            "net3": "1a:cb:a8:d3:3e:9f",
            "net4": "5a:24:35:ab:2e:fc",
            "net5": "06:6f:ee:dd:39:ca",
            "net6": "b2:06:bb:a8:c6:0d",
            "net7": "be:53:d9:a5:6d:f9",
            "net8": "f2:68:e5:cd:9e:c6",
            "net9": "76:5d:d4:3f:05:e4"
        },
        "spine_6_1_1": {
            "net0": "b2:d7:92:82:2b:da",
            "net1": "22:d3:05:13:34:fe",
            "net10": "5a:d9:2b:03:67:94",
            "net11": "da:97:f6:78:03:03",
            "net12": "22:3a:60:ba:63:a9",
            "net13": "da:7f:cd:50:e5:0c",
            "net14": "26:d4:b8:20:d7:20",
            "net15": "a2:e3:d9:12:67:bd",
            "net2": "3a:fe:c7:76:0e:55",
            "net3": "1e:7d:49:3e:f8:53",
            "net4": "6e:ec:a7:13:6a:d7",
            "net5": "ea:93:1a:78:ff:35",
            "net6": "26:91:b9:57:13:2e",
            "net7": "1e:be:83:e9:e5:fa",
            "net8": "aa:b1:5e:c2:c7:4d",
            "net9": "d6:7a:e1:1a:7d:26"
        },
        "spine_6_1_2": {
            "net0": "4a:d6:67:88:55:db",
            "net1": "b2:91:92:ae:36:75",
            "net10": "ba:c2:dc:3b:f7:e9",
            "net11": "26:dd:74:4b:95:b3",
            "net12": "42:fc:bd:08:6a:a2",
            "net13": "9e:91:86:71:23:8e",
            "net14": "ca:d9:f6:6b:50:d4",
            "net15": "ea:3a:5f:f5:39:f5",
            "net2": "b6:07:9d:8e:36:09",
            "net3": "ce:97:4e:45:96:0f",
            "net4": "1a:4a:60:dd:bb:61",
            "net5": "ba:4e:52:6f:05:0e",
            "net6": "22:f7:64:ff:d9:bc",
            "net7": "c6:94:85:49:56:56",
            "net8": "6e:e6:da:fa:1b:e8",
            "net9": "4e:a4:0e:6a:d2:e4"
        },
        "spine_6_1_3": {
            "net0": "42:28:05:98:cd:b0",
            "net1": "b2:7b:26:1d:6f:70",
            "net10": "1a:1a:e4:de:56:77",
            "net11": "2e:a8:e6:5e:eb:a9",
            "net12": "8a:5c:ad:96:33:c7",
            "net13": "ea:65:48:f4:4e:7f",
            "net14": "aa:56:e7:40:94:1a",
            "net15": "e2:8f:63:17:8d:de",
            "net2": "12:58:36:39:7d:ee",
            "net3": "86:48:f4:7a:f4:ca",
            "net4": "9e:88:bb:03:55:57",
            "net5": "9a:27:5c:2e:9c:db",
            "net6": "4a:8c:f1:79:31:88",
            "net7": "8a:30:e5:8f:07:1a",
            "net8": "1a:05:9b:e8:75:1e",
            "net9": "06:f9:5f:89:0a:80"
        },
        "spine_6_1_4": {
            "net0": "3e:3e:56:2c:d7:1d",
            "net1": "a2:e8:d9:59:c8:c0",
            "net10": "6e:63:8b:6c:5e:93",
            "net11": "5a:83:11:2b:77:8b",
            "net12": "92:a5:37:14:88:66",
            "net13": "a2:29:49:5d:55:5d",
            "net14": "8a:5d:2f:e4:b0:10",
            "net15": "92:72:88:20:8b:b5",
            "net2": "96:18:10:d0:88:cd",
            "net3": "ba:9e:21:25:e3:3b",
            "net4": "82:85:63:37:1f:76",
            "net5": "b2:fd:fb:4e:29:37",
            "net6": "86:0c:e4:b6:ae:86",
            "net7": "16:03:bb:5d:a3:c7",
            "net8": "4e:a2:b0:46:3f:00",
            "net9": "a2:2d:fa:82:7f:d6"
        },
        "spine_6_1_5": {
            "net0": "12:5d:e5:c2:94:7a",
            "net1": "2a:30:a4:ac:10:33",
            "net10": "7e:b1:2f:92:86:6a",
            "net11": "0e:73:f6:1f:d7:d4",
            "net12": "aa:70:4d:39:20:db",
            "net13": "2a:12:46:62:63:4e",
            "net14": "6a:5a:13:b2:a4:1c",
            "net15": "ea:91:7c:49:97:2e",
            "net2": "f6:6f:b2:a6:a7:e8",
            "net3": "a6:3a:11:f1:8a:47",
            "net4": "36:a0:c1:8d:74:57",
            "net5": "a2:e4:3b:41:77:b8",
            "net6": "aa:43:67:39:d7:9f",
            "net7": "36:19:9e:4b:a0:3b",
            "net8": "52:82:79:25:4f:3a",
            "net9": "16:67:c6:c7:71:b9"
        },
        "spine_6_1_6": {
            "net0": "4e:76:4f:69:ef:c2",
            "net1": "ee:64:e3:f8:7b:25",
            "net10": "ba:5c:d4:0e:0c:7f",
            "net11": "ca:bb:98:ee:64:fd",
            "net12": "c2:0a:c9:e1:74:db",
            "net13": "8a:58:43:eb:46:d7",
            "net14": "8e:3b:63:4c:1a:c3",
            "net15": "ee:67:4f:3a:68:4c",
            "net2": "4a:35:e3:2c:86:31",
            "net3": "b6:79:dc:d1:f1:2b",
            "net4": "ae:b6:36:a7:47:e7",
            "net5": "ee:0f:5c:dc:ab:dd",
            "net6": "9e:c9:8a:38:e4:ec",
            "net7": "fa:84:75:af:64:81",
            "net8": "9e:61:86:df:a2:48",
            "net9": "02:3b:50:8e:ca:9c"
        },
        "spine_6_1_7": {
            "net0": "42:31:e3:a8:88:d0",
            "net1": "1a:7d:12:75:52:bf",
            "net10": "9e:78:f4:da:d6:fe",
            "net11": "da:52:42:42:76:52",
            "net12": "92:fb:d2:fb:97:db",
            "net13": "5e:34:3f:0a:ef:6f",
            "net14": "ca:a0:93:79:4d:bc",
            "net15": "66:e6:e7:77:8a:20",
            "net2": "9e:6d:c6:50:5c:92",
            "net3": "66:d3:a8:7d:0d:78",
            "net4": "ca:5c:b5:f4:1a:e6",
            "net5": "2a:8e:e9:c2:9f:d2",
            "net6": "8e:f6:e1:55:4d:24",
            "net7": "c6:0a:10:39:ca:2e",
            "net8": "fa:c3:fa:3d:0b:db",
            "net9": "22:fb:a8:29:ed:22"
        },
        "spine_6_1_8": {
            "net0": "f6:6d:55:52:99:e5",
            "net1": "16:d7:78:5d:b1:ce",
            "net10": "7e:22:68:23:b6:2c",
            "net11": "42:af:c9:31:66:f6",
            "net12": "d2:a4:5f:22:0e:f9",
            "net13": "da:3b:9a:42:21:1f",
            "net14": "12:d3:c7:85:e8:12",
            "net15": "da:12:ad:5b:7e:82",
            "net2": "0e:1d:2b:90:7f:71",
            "net3": "7a:6b:80:98:c7:3f",
            "net4": "16:ff:54:33:ae:e5",
            "net5": "82:46:a7:62:e1:3d",
            "net6": "6a:08:f2:10:ff:fd",
            "net7": "92:b0:36:41:0b:a9",
            "net8": "76:02:a3:c1:d8:fb",
            "net9": "4a:12:d2:ae:89:f8"
        },
        "spine_7_1_1": {
            "net0": "b2:40:e1:f5:03:f8",
            "net1": "1a:d3:4f:42:79:ba",
            "net10": "36:b7:b6:f7:59:c0",
            "net11": "82:23:e1:f2:93:ac",
            "net12": "e6:ea:93:7a:8d:51",
            "net13": "aa:c5:4e:e8:6a:1f",
            "net14": "fa:a2:c7:c8:e5:c4",
            "net15": "c6:66:5e:69:be:b5",
            "net2": "7e:2d:a0:8b:7b:e9",
            "net3": "3a:25:7a:ab:f4:68",
            "net4": "ea:d8:1a:27:49:66",
            "net5": "7a:c9:ed:a5:ed:72",
            "net6": "fe:ab:6a:ab:9b:0b",
            "net7": "ba:0a:c0:22:8d:f8",
            "net8": "82:bc:40:18:8b:53",
            "net9": "ca:59:b3:13:52:55"
        },
        "spine_7_1_2": {
            "net0": "2e:32:24:dd:25:83",
            "net1": "c2:4d:80:04:6f:5f",
            "net10": "42:34:c2:d2:6f:02",
            "net11": "76:8a:fc:90:19:f8",
            "net12": "fe:4a:0a:e0:a4:33",
            "net13": "aa:b3:d6:10:19:b3",
            "net14": "82:b6:e0:b5:7e:30",
            "net15": "4a:ff:86:53:b8:4f",
            "net2": "4a:07:47:35:5a:2f",
            "net3": "2e:d7:66:7b:4f:b6",
            "net4": "6a:87:ca:db:56:84",
            "net5": "7e:54:76:6b:5c:eb",
            "net6": "c2:f2:ee:db:06:6e",
            "net7": "f6:ac:d7:65:39:6e",
            "net8": "9a:fe:04:ca:66:af",
            "net9": "96:6b:07:03:da:5b"
        },
        "spine_7_1_3": {
            "net0": "e2:a0:af:2f:00:68",
            "net1": "36:c5:2c:bc:92:63",
            "net10": "e6:77:e3:08:be:14",
            "net11": "62:1e:e6:13:f4:9b",
            "net12": "a2:13:cc:49:57:6c",
            "net13": "46:d7:fb:63:cc:ca",
            "net14": "92:b8:28:03:92:b1",
            "net15": "a2:3c:e7:2b:02:5f",
            "net2": "a6:1d:93:d3:7a:54",
            "net3": "6e:c4:67:75:d4:0c",
            "net4": "ae:23:6b:4f:16:17",
            "net5": "1a:52:5b:25:6d:6a",
            "net6": "06:5d:d7:44:62:86",
            "net7": "02:64:d9:cc:9c:00",
            "net8": "3e:ab:71:de:2d:38",
            "net9": "ea:c2:1c:67:1c:53"
        },
        "spine_7_1_4": {
            "net0": "c6:a8:67:e6:85:0c",
            "net1": "ee:3e:2a:4d:96:04",
            "net10": "6e:a2:0e:2a:e5:b5",
            "net11": "96:13:c6:0c:b1:41",
            "net12": "3e:93:43:59:11:0e",
            "net13": "36:ca:07:10:d0:24",
            "net14": "ba:01:08:36:25:ab",
            "net15": "06:67:02:01:ed:db",
            "net2": "d6:9d:22:25:dd:d8",
            "net3": "26:86:dd:56:9d:ca",
            "net4": "c2:a2:39:4f:ec:be",
            "net5": "06:e7:19:db:ff:cd",
            "net6": "5a:58:f5:d1:3a:1c",
            "net7": "be:40:fc:eb:37:d2",
            "net8": "e6:d6:12:ef:d0:05",
            "net9": "f6:2c:34:b1:34:d4"
        },
        "spine_7_1_5": {
            "net0": "c6:7f:14:8f:59:28",
            "net1": "f2:08:cc:0e:33:d8",
            "net10": "46:be:6d:78:f4:be",
            "net11": "d6:80:a6:98:2a:df",
            "net12": "de:3a:82:06:38:f8",
            "net13": "aa:44:88:19:30:16",
            "net14": "a2:aa:8e:a5:3a:87",
            "net15": "3a:84:a0:3d:66:fc",
            "net2": "16:64:48:d6:fb:4b",
            "net3": "b6:c6:e1:ca:81:9e",
            "net4": "32:a9:d0:a1:a5:38",
            "net5": "a6:bb:fc:86:9c:d8",
            "net6": "22:83:95:89:50:09",
            "net7": "5e:2c:d0:1c:04:0b",
            "net8": "a6:cf:79:21:b0:32",
            "net9": "22:7b:b9:b1:a9:97"
        },
        "spine_7_1_6": {
            "net0": "26:c8:20:38:26:e4",
            "net1": "ca:e7:f5:e8:ba:a9",
            "net10": "7e:bc:2c:64:43:15",
            "net11": "22:23:0e:9f:03:5a",
            "net12": "4a:1f:ef:7d:d5:22",
            "net13": "76:ae:4d:8b:9c:58",
            "net14": "36:ff:ac:b3:50:ae",
            "net15": "ea:73:7e:bb:02:78",
            "net2": "4a:81:02:33:87:31",
            "net3": "9a:21:1f:8d:e1:ce",
            "net4": "5a:a1:0f:9d:8f:fb",
            "net5": "d6:15:7a:f7:66:7c",
            "net6": "9a:15:2a:cf:b3:eb",
            "net7": "4e:ea:a6:3e:33:9c",
            "net8": "a2:e7:93:3e:55:ac",
            "net9": "ca:71:44:46:7a:0a"
        },
        "spine_7_1_7": {
            "net0": "7a:6d:ea:99:7a:37",
            "net1": "f2:16:ef:54:2b:dd",
            "net10": "8e:de:0a:dc:3d:5d",
            "net11": "e6:f1:da:b2:5c:d4",
            "net12": "72:11:df:c4:a1:b5",
            "net13": "8a:2a:64:9c:f2:c6",
            "net14": "ce:81:9f:34:f5:e5",
            "net15": "46:86:c4:61:f9:d2",
            "net2": "0a:ef:f9:65:52:11",
            "net3": "26:3c:6b:f2:ff:e8",
            "net4": "86:07:6e:3b:3f:44",
            "net5": "ce:48:13:7e:4a:c6",
            "net6": "1e:16:ce:4a:8b:ea",
            "net7": "7e:51:c2:ee:37:c3",
            "net8": "fa:51:36:f5:da:f5",
            "net9": "7a:14:67:2f:15:49"
        },
        "spine_7_1_8": {
            "net0": "16:74:60:7f:65:f0",
            "net1": "2e:ba:8d:a5:a5:23",
            "net10": "1a:e9:72:66:9e:d8",
            "net11": "0a:e5:cb:2b:99:45",
            "net12": "1a:7b:0c:f8:5e:48",
            "net13": "56:13:8c:e1:36:cc",
            "net14": "82:d8:37:6e:b6:4d",
            "net15": "da:0b:41:5e:2b:ac",
            "net2": "0a:4f:0a:35:13:b6",
            "net3": "fa:3f:b7:9b:36:b6",
            "net4": "16:62:04:f9:89:0d",
            "net5": "de:48:66:bc:5f:d0",
            "net6": "f2:4b:df:04:f8:97",
            "net7": "5e:c8:f0:47:5f:82",
            "net8": "62:8b:72:28:7c:9a",
            "net9": "d6:34:88:b6:85:b6"
        },
        "spine_8_1_1": {
            "net0": "6a:b1:bb:46:fc:a9",
            "net1": "06:3b:98:d5:94:de",
            "net10": "12:c4:85:e2:9a:c8",
            "net11": "4a:90:8f:2c:47:20",
            "net12": "f6:42:f1:0c:ad:4b",
            "net13": "0e:f2:44:a9:a6:fe",
            "net14": "b6:e1:fc:38:9f:2b",
            "net15": "0a:fd:25:99:c5:49",
            "net2": "f6:1c:f0:48:f2:77",
            "net3": "22:dd:69:e8:b8:9b",
            "net4": "7e:a9:af:39:00:be",
            "net5": "ba:f7:24:d6:a5:4e",
            "net6": "aa:60:fe:e9:93:4d",
            "net7": "8a:67:e6:1d:d7:7e",
            "net8": "3e:08:6c:20:63:55",
            "net9": "32:0f:78:5c:ee:82"
        },
        "spine_8_1_2": {
            "net0": "6e:59:97:b9:45:bb",
            "net1": "0a:da:60:aa:9a:8e",
            "net10": "32:23:62:a7:d2:0f",
            "net11": "76:ef:86:ce:6c:c9",
            "net12": "4e:70:bc:f6:28:11",
            "net13": "da:a8:15:94:97:7b",
            "net14": "da:dd:65:fd:03:ec",
            "net15": "6e:70:f2:b5:92:d2",
            "net2": "1a:c5:4f:c7:1c:a3",
            "net3": "06:89:8f:65:0e:6d",
            "net4": "56:2a:0c:05:59:91",
            "net5": "9e:3e:85:42:6d:09",
            "net6": "e2:68:2f:4a:58:70",
            "net7": "0e:02:09:f9:0c:27",
            "net8": "1a:1b:e3:fd:50:1d",
            "net9": "26:00:21:08:40:b7"
        },
        "spine_8_1_3": {
            "net0": "26:f0:97:9f:61:87",
            "net1": "1e:93:64:ae:0b:5b",
            "net10": "a6:1f:d5:93:c1:1c",
            "net11": "56:96:22:73:93:f1",
            "net12": "c6:71:2a:3a:ee:a6",
            "net13": "ea:73:8a:a3:35:76",
            "net14": "2a:16:24:37:2e:e5",
            "net15": "b6:53:aa:12:0f:3b",
            "net2": "0a:71:2d:91:a4:37",
            "net3": "0a:6a:fa:e6:68:8b",
            "net4": "fe:51:89:0b:12:ae",
            "net5": "66:d4:7c:5e:7a:79",
            "net6": "26:7a:3e:11:24:04",
            "net7": "72:3e:a9:2c:c7:65",
            "net8": "5a:d4:c2:a6:06:be",
            "net9": "ae:64:f2:a3:e9:48"
        },
        "spine_8_1_4": {
            "net0": "5a:06:18:d5:7a:9e",
            "net1": "2e:fa:e6:79:e3:8c",
            "net10": "7a:99:d1:9a:0a:fc",
            "net11": "86:11:68:4f:7b:c0",
            "net12": "d2:33:c9:11:bd:f0",
            "net13": "e2:33:aa:d1:82:93",
            "net14": "7a:56:89:be:fb:28",
            "net15": "1a:a9:48:f1:99:cf",
            "net2": "82:b9:0e:38:60:5c",
            "net3": "ce:c5:b3:d2:c3:f3",
            "net4": "22:c9:e5:c7:03:95",
            "net5": "82:d8:be:83:de:b6",
            "net6": "5e:e1:9e:e6:0e:d5",
            "net7": "fa:7c:1b:00:48:90",
            "net8": "a2:14:f3:d0:dc:bb",
            "net9": "52:07:eb:82:cb:48"
        },
        "spine_8_1_5": {
            "net0": "de:e6:f5:1a:21:d8",
            "net1": "9a:2e:06:f8:c8:de",
            "net10": "82:7d:cc:85:4f:99",
            "net11": "ae:39:1f:b0:9c:48",
            "net12": "9e:f0:a7:48:77:e2",
            "net13": "da:46:80:04:e7:e3",
            "net14": "6e:01:4a:1f:0f:2a",
            "net15": "6e:d6:ad:2d:3e:c1",
            "net2": "c2:b1:6a:18:84:fb",
            "net3": "d6:7b:97:e7:f4:f8",
            "net4": "f6:72:5d:52:c4:80",
            "net5": "42:92:3b:a2:9a:39",
            "net6": "ca:a1:bf:ca:22:ff",
            "net7": "e6:3e:ee:7e:9b:d9",
            "net8": "96:f4:98:07:b3:89",
            "net9": "aa:71:5a:ea:df:ce"
        },
        "spine_8_1_6": {
            "net0": "fe:a4:b7:15:14:82",
            "net1": "e6:83:fc:82:fb:cf",
            "net10": "ba:36:c8:ae:20:2e",
            "net11": "4e:bd:07:9e:c4:9f",
            "net12": "56:d3:40:12:49:01",
            "net13": "a6:46:82:ab:c0:da",
            "net14": "c6:98:36:2f:db:56",
            "net15": "92:f9:68:2f:dc:78",
            "net2": "06:43:82:2e:6c:b2",
            "net3": "6a:78:ce:fc:27:25",
            "net4": "5e:54:24:f6:52:e8",
            "net5": "ba:2f:c3:21:15:47",
            "net6": "b6:65:00:88:03:35",
            "net7": "9a:ee:08:e2:ff:74",
            "net8": "62:2f:04:a9:36:e8",
            "net9": "ee:f8:ab:bb:69:c0"
        },
        "spine_8_1_7": {
            "net0": "76:44:ec:1c:38:f9",
            "net1": "de:a4:03:62:73:0d",
            "net10": "d6:a1:34:c7:74:29",
            "net11": "52:b2:0f:7b:26:57",
            "net12": "c2:5f:93:3a:d2:11",
            "net13": "9a:4b:5c:b1:ca:15",
            "net14": "b6:80:61:f8:33:15",
            "net15": "16:6c:8a:f3:a8:56",
            "net2": "26:86:97:fa:29:ae",
            "net3": "aa:36:db:cc:e8:2a",
            "net4": "0e:87:04:23:24:ae",
            "net5": "ee:f9:05:95:79:39",
            "net6": "4a:91:8c:99:a3:f5",
            "net7": "b6:06:ab:3f:94:ff",
            "net8": "e2:16:d8:9d:79:53",
            "net9": "6a:20:65:62:6b:8e"
        },
        "spine_8_1_8": {
            "net0": "86:90:59:76:f2:3b",
            "net1": "9a:9a:26:09:12:74",
            "net10": "22:7f:63:d5:91:2c",
            "net11": "c6:7b:31:d1:1d:4f",
            "net12": "ee:c1:de:c0:5b:35",
            "net13": "ae:a0:79:cf:a0:63",
            "net14": "6e:7d:c2:ee:6f:17",
            "net15": "92:61:79:d7:87:52",
            "net2": "4e:3b:ea:b1:a3:eb",
            "net3": "52:c9:b4:ba:1b:34",
            "net4": "56:7b:6e:4e:d1:63",
            "net5": "16:c1:e9:d6:6a:e0",
            "net6": "ca:3f:d5:2d:c2:7c",
            "net7": "6e:5e:e9:38:60:30",
            "net8": "36:86:4e:d0:f1:18",
            "net9": "9a:1b:06:d4:b5:f7"
        },
        "tof_1_2_1": {
            "net0": "86:6e:75:f4:f0:e7",
            "net1": "6a:65:6a:83:e4:69",
            "net10": "82:25:63:d9:b2:03",
            "net11": "c2:05:6e:f0:e7:76",
            "net12": "8e:99:f3:a4:2c:06",
            "net13": "6a:4c:84:0a:95:9c",
            "net14": "26:91:a2:95:83:53",
            "net15": "f6:2f:a8:80:67:00",
            "net2": "3a:a3:4b:84:c7:37",
            "net3": "42:5a:29:0c:8f:3e",
            "net4": "d2:c4:8c:00:b4:58",
            "net5": "5a:d1:c3:81:87:2d",
            "net6": "da:e6:f0:50:2c:0a",
            "net7": "de:8c:d6:aa:ff:af",
            "net8": "4e:2d:40:9c:6b:1d",
            "net9": "62:70:49:c9:11:f4"
        },
        "tof_1_2_2": {
            "net0": "6a:ba:e3:b1:cf:b1",
            "net1": "fa:cb:fa:bd:dd:ea",
            "net10": "3a:3c:53:44:f3:f8",
            "net11": "3e:f7:59:27:8a:50",
            "net12": "26:c5:c1:13:95:9b",
            "net13": "2a:6f:fd:1e:9b:a6",
            "net14": "c6:51:4a:b3:c7:e9",
            "net15": "1a:dc:9e:4d:63:5f",
            "net2": "7e:e7:e6:1d:2a:4b",
            "net3": "56:72:7b:27:1a:24",
            "net4": "22:a8:29:77:2a:b9",
            "net5": "ea:4d:13:80:d5:5d",
            "net6": "96:9f:61:9f:9c:d9",
            "net7": "a6:a0:ac:73:bc:5b",
            "net8": "2a:83:09:40:39:98",
            "net9": "e2:eb:c0:91:c1:51"
        },
        "tof_1_2_3": {
            "net0": "e6:b0:11:ce:e0:a3",
            "net1": "66:f8:81:34:40:87",
            "net10": "6a:a6:cb:bb:94:73",
            "net11": "ee:ef:76:5e:d2:c8",
            "net12": "72:3e:a1:77:67:cd",
            "net13": "e6:b3:83:24:22:63",
            "net14": "42:e7:5f:f0:3d:e9",
            "net15": "56:47:7e:68:62:e6",
            "net2": "de:7d:61:4e:fe:48",
            "net3": "92:d7:9c:d0:33:6f",
            "net4": "da:9e:b4:a0:28:ee",
            "net5": "de:f5:8c:9b:96:7c",
            "net6": "5a:c2:63:15:bf:7b",
            "net7": "e2:1c:0b:b5:21:9b",
            "net8": "fe:90:a3:b8:97:5b",
            "net9": "ee:46:27:74:e8:6e"
        },
        "tof_1_2_4": {
            "net0": "da:9b:09:65:9e:16",
            "net1": "72:49:3f:7e:ac:01",
            "net10": "ca:f1:e5:ec:46:88",
            "net11": "de:2a:e8:e7:74:2c",
            "net12": "86:f0:d8:26:cf:db",
            "net13": "46:ed:7c:39:fa:d6",
            "net14": "2a:06:c8:e2:ef:8e",
            "net15": "82:54:f3:62:d4:4d",
            "net2": "2e:42:2e:25:aa:4e",
            "net3": "f2:c1:b0:b9:6c:62",
            "net4": "8a:0e:57:da:4d:e6",
            "net5": "b6:14:c7:71:c9:db",
            "net6": "5e:62:c9:a7:fd:04",
            "net7": "72:04:34:7b:f8:8a",
            "net8": "d2:90:91:3e:ef:fb",
            "net9": "de:b1:d7:53:fc:a1"
        },
        "tof_1_2_5": {
            "net0": "96:22:77:e0:2e:1f",
            "net1": "36:c9:4d:1b:ab:9c",
            "net10": "b6:60:25:09:7f:7a",
            "net11": "b6:20:f6:ae:09:8e",
            "net12": "2a:44:f8:c9:cb:68",
            "net13": "66:70:a2:3f:f1:11",
            "net14": "72:2b:8f:dc:f9:8e",
            "net15": "da:6f:95:54:df:32",
            "net2": "26:00:90:b1:2f:e1",
            "net3": "ca:a3:50:2d:9a:b9",
            "net4": "2e:3b:7d:1a:2b:cf",
            "net5": "ee:8a:bb:36:66:6e",
            "net6": "a2:75:39:2e:92:74",
            "net7": "02:89:90:9c:7f:a0",
            "net8": "2a:a1:88:fe:b2:fa",
            "net9": "6e:a4:b9:90:d1:97"
        },
        "tof_1_2_6": {
            "net0": "86:1e:51:e3:38:7e",
            "net1": "a2:db:9c:6b:56:f3",
            "net10": "ae:c2:f8:c1:91:05",
            "net11": "3a:b2:b1:4b:d3:6e",
            "net12": "fe:19:39:84:b6:0b",
            "net13": "6a:19:69:43:b8:b5",
            "net14": "a2:63:16:90:38:32",
            "net15": "e2:9d:18:c6:f8:36",
            "net2": "6a:e5:1b:ac:b3:82",
            "net3": "ba:47:36:8c:41:c0",
            "net4": "d6:f8:b9:c0:8f:b2",
            "net5": "6e:71:5e:d5:48:aa",
            "net6": "6a:67:64:56:e1:05",
            "net7": "16:ac:d1:1a:e2:9a",
            "net8": "6a:a5:37:2a:28:b8",
            "net9": "e6:61:be:60:59:62"
        },
        "tof_1_2_7": {
            "net0": "76:b6:4a:2d:06:e3",
            "net1": "d6:41:3f:54:cd:b0",
            "net10": "f6:56:67:bd:42:4e",
            "net11": "62:29:96:9a:ad:19",
            "net12": "12:e2:d3:07:95:a3",
            "net13": "3e:64:af:6f:4a:59",
            "net14": "e6:55:5b:a9:b0:ad",
            "net15": "0a:d6:f2:7d:d8:67",
            "net2": "c2:00:f6:a8:0c:1d",
            "net3": "8a:5c:35:5f:15:a3",
            "net4": "56:2c:f1:28:68:01",
            "net5": "2e:2d:3d:8f:a4:25",
            "net6": "4a:0d:d8:8e:f5:1f",
            "net7": "ae:50:26:83:28:76",
            "net8": "46:e2:11:42:5c:bc",
            "net9": "a2:df:32:60:36:20"
        },
        "tof_1_2_8": {
            "net0": "d6:6a:4c:cd:de:93",
            "net1": "ba:59:44:41:6d:b6",
            "net10": "46:d8:ad:7e:f2:97",
            "net11": "56:57:f7:e4:33:d7",
            "net12": "2e:29:07:f6:a4:7d",
            "net13": "26:7c:ab:ab:dd:94",
            "net14": "42:ab:53:be:d6:3b",
            "net15": "5a:fb:bc:6f:80:5f",
            "net2": "16:ea:b7:6e:f6:6e",
            "net3": "ae:9e:4e:80:4f:2d",
            "net4": "9a:0e:7b:a8:c9:9d",
            "net5": "66:a4:ab:03:16:da",
            "net6": "56:c1:9d:a2:14:80",
            "net7": "62:bf:44:bc:b7:52",
            "net8": "aa:52:30:cd:f5:f0",
            "net9": "76:cd:a3:e8:b2:0d"
        },
        "tof_2_2_1": {
            "net0": "46:38:ee:22:34:f5",
            "net1": "9e:b4:ab:01:77:f1",
            "net10": "96:54:4c:84:ae:a7",
            "net11": "f2:c8:8e:54:69:86",
            "net12": "e6:2a:68:f2:71:38",
            "net13": "6e:c6:bf:e2:04:bb",
            "net14": "82:cf:c3:42:84:7d",
            "net15": "fe:1a:ca:02:a2:69",
            "net2": "42:4c:01:ab:08:7c",
            "net3": "e2:84:7e:23:8c:24",
            "net4": "12:92:b9:28:46:e4",
            "net5": "02:5a:7e:55:cf:f1",
            "net6": "86:f2:f4:a1:e2:70",
            "net7": "a2:fa:42:2c:e9:31",
            "net8": "ba:0d:c9:e3:ab:24",
            "net9": "b2:a7:26:bf:1d:ca"
        },
        "tof_2_2_2": {
            "net0": "aa:aa:b2:ed:f1:40",
            "net1": "ae:31:53:72:30:68",
            "net10": "8e:9b:74:e8:9f:80",
            "net11": "66:63:69:0a:70:d2",
            "net12": "46:e0:a8:a2:27:a1",
            "net13": "da:ca:e1:9d:02:7e",
            "net14": "a2:70:de:43:c6:00",
            "net15": "a2:67:30:0f:f4:35",
            "net2": "52:a5:7f:07:31:81",
            "net3": "ae:c8:43:83:58:cc",
            "net4": "76:11:23:5b:c2:39",
            "net5": "4e:17:56:19:fa:3a",
            "net6": "02:9e:f4:a1:5f:3c",
            "net7": "ee:36:70:17:ef:c4",
            "net8": "9a:68:4c:14:9f:cd",
            "net9": "de:d2:c2:98:18:ea"
        },
        "tof_2_2_3": {
            "net0": "7a:75:39:0f:f0:82",
            "net1": "76:94:db:2d:a8:4e",
            "net10": "ea:45:61:27:bb:4b",
            "net11": "86:5f:7f:6b:d6:e6",
            "net12": "a2:8c:1e:09:db:26",
            "net13": "56:a6:a3:79:6e:c3",
            "net14": "82:b8:15:a5:5c:da",
            "net15": "0a:bc:f4:e7:4a:9f",
            "net2": "76:4f:d2:c7:f0:c2",
            "net3": "42:45:e1:e0:ce:28",
            "net4": "8a:5e:0a:e4:c2:e4",
            "net5": "76:7c:92:53:ee:d3",
            "net6": "5e:16:ed:76:5a:7e",
            "net7": "f2:a4:82:63:a9:54",
            "net8": "4e:a7:11:65:bf:9a",
            "net9": "22:78:1f:40:fa:15"
        },
        "tof_2_2_4": {
            "net0": "c2:28:07:81:ed:16",
            "net1": "9a:4f:d4:f9:a0:4b",
            "net10": "c6:b4:65:2b:b6:92",
            "net11": "06:59:64:33:46:2b",
            "net12": "d6:56:76:3c:62:51",
            "net13": "fa:6c:43:28:95:c9",
            "net14": "02:73:ac:a6:d8:17",
            "net15": "a2:ef:56:3f:61:99",
            "net2": "e6:a8:ec:25:9b:b6",
            "net3": "0a:50:e3:41:8f:a0",
            "net4": "4e:f0:c3:75:51:63",
            "net5": "4a:0c:63:95:38:5f",
            "net6": "6a:ad:54:35:dc:3d",
            "net7": "06:4c:2c:29:5a:e4",
            "net8": "32:cc:eb:6c:bb:86",
            "net9": "02:24:f3:eb:92:23"
        },
        "tof_2_2_5": {
            "net0": "ee:8a:3e:21:59:aa",
            "net1": "f2:a7:e0:9c:14:c5",
            "net10": "da:ef:b0:9b:1a:b9",
            "net11": "16:6b:00:51:d8:11",
            "net12": "32:d3:a8:d1:58:83",
            "net13": "62:dc:a5:dc:aa:c9",
            "net14": "9a:6f:a8:7c:36:9f",
            "net15": "1e:fd:50:a5:d2:6c",
            "net2": "f2:0e:67:9a:75:30",
            "net3": "0e:0d:aa:0e:10:25",
            "net4": "86:7f:9c:0b:a6:7e",
            "net5": "d6:e4:13:dd:fe:6b",
            "net6": "42:51:80:cb:38:ec",
            "net7": "4a:b2:6c:10:be:46",
            "net8": "06:4d:b3:d7:f9:ca",
            "net9": "a2:5e:c8:5e:ff:67"
        },
        "tof_2_2_6": {
            "net0": "c6:d1:21:74:43:81",
            "net1": "7a:3f:ca:d0:b6:68",
            "net10": "7a:ec:dd:fd:1e:b7",
            "net11": "3e:fb:42:f8:20:91",
            "net12": "52:6b:b2:00:9e:13",
            "net13": "2e:b3:fd:72:90:44",
            "net14": "7e:e2:ac:24:14:b8",
            "net15": "9a:7f:dd:f4:ab:94",
            "net2": "f2:a6:a0:61:8e:8b",
            "net3": "c6:3d:19:87:f1:3a",
            "net4": "fa:7e:0b:c7:9d:1a",
            "net5": "d2:1a:59:f6:d0:23",
            "net6": "26:2a:47:95:b3:c8",
            "net7": "56:b5:f2:83:bf:65",
            "net8": "c6:6d:da:8f:75:1b",
            "net9": "3e:e0:2d:77:06:7e"
        },
        "tof_2_2_7": {
            "net0": "fa:d4:8f:3d:c2:61",
            "net1": "4e:64:fc:21:41:5c",
            "net10": "0e:25:ea:92:61:d4",
            "net11": "a6:11:ab:57:23:2c",
            "net12": "f6:80:0f:21:a8:25",
            "net13": "22:ab:da:bf:31:1c",
            "net14": "76:66:4d:da:82:9c",
            "net15": "4a:b1:6a:22:e5:13",
            "net2": "82:a4:ed:41:91:8e",
            "net3": "8a:97:64:0b:f1:1b",
            "net4": "1e:e5:47:3f:b2:c7",
            "net5": "d2:82:f1:24:df:6c",
            "net6": "9e:ee:0e:08:a8:61",
            "net7": "4e:05:0b:83:86:42",
            "net8": "fe:17:be:7e:7e:c2",
            "net9": "02:20:64:2d:bd:5e"
        },
        "tof_2_2_8": {
            "net0": "a2:ce:c2:5b:af:5f",
            "net1": "96:08:af:3b:40:9f",
            "net10": "3e:3d:dd:21:7d:3f",
            "net11": "1e:65:51:80:9b:6d",
            "net12": "26:22:bb:93:f0:ae",
            "net13": "a6:3a:88:6b:31:da",
            "net14": "72:8d:c3:12:8d:1a",
            "net15": "36:8a:54:43:b1:6f",
            "net2": "76:21:98:a0:d4:6e",
            "net3": "92:8c:1a:75:58:47",
            "net4": "26:c3:b2:20:a0:3f",
            "net5": "76:85:48:41:50:38",
            "net6": "52:31:3d:18:4f:b8",
            "net7": "d6:00:b8:6f:c8:f5",
            "net8": "1e:17:d5:9b:8a:4e",
            "net9": "8e:ca:54:21:4b:dc"
        },
        "tof_3_2_1": {
            "net0": "b6:6c:85:d4:16:64",
            "net1": "92:a1:24:e2:e7:ed",
            "net10": "aa:59:85:93:05:7c",
            "net11": "be:98:fd:74:aa:b3",
            "net12": "62:5a:7a:46:8b:89",
            "net13": "26:cd:7c:ce:bc:b1",
            "net14": "a2:cc:55:d4:04:ab",
            "net15": "82:39:3e:54:91:4b",
            "net2": "16:c7:45:ee:84:7f",
            "net3": "9a:03:ee:bf:f6:b2",
            "net4": "e2:80:5a:e4:ed:77",
            "net5": "9a:c2:4c:83:d8:2b",
            "net6": "fe:26:31:d5:a4:72",
            "net7": "6e:29:bb:1b:cc:07",
            "net8": "1a:ee:55:d8:be:b9",
            "net9": "ca:36:27:e7:12:dc"
        },
        "tof_3_2_2": {
            "net0": "62:a3:c0:0f:64:ca",
            "net1": "aa:14:92:0c:ec:bf",
            "net10": "5e:c4:39:67:2b:75",
            "net11": "9e:48:b8:96:a8:75",
            "net12": "82:9f:67:a2:a1:7a",
            "net13": "f6:46:74:af:29:71",
            "net14": "a2:99:a6:50:f3:0f",
            "net15": "a6:32:c3:47:13:53",
            "net2": "96:b0:f0:1c:aa:56",
            "net3": "66:c0:c5:a4:cb:b5",
            "net4": "4a:da:d6:e6:43:88",
            "net5": "92:65:01:4f:34:12",
            "net6": "9a:06:5d:c0:09:0d",
            "net7": "0e:72:54:8d:43:0d",
            "net8": "e6:6d:ca:2a:51:4d",
            "net9": "82:23:96:86:b4:fa"
        },
        "tof_3_2_3": {
            "net0": "1a:89:81:b0:4d:4c",
            "net1": "7a:9f:34:8f:b5:cf",
            "net10": "a6:ca:a5:a7:c3:39",
            "net11": "06:a6:2e:ac:59:09",
            "net12": "7e:b8:fe:4d:b7:bb",
            "net13": "56:c1:f6:9b:42:4d",
            "net14": "86:14:07:fb:b9:0a",
            "net15": "d6:b7:52:f3:6e:70",
            "net2": "ea:d6:fb:9a:5c:b1",
            "net3": "9e:91:e6:29:0f:a8",
            "net4": "0a:5b:27:55:d3:c2",
            "net5": "f6:98:1a:d7:2a:ee",
            "net6": "f6:9e:da:39:ae:d2",
            "net7": "6e:a8:79:81:7a:f4",
            "net8": "fe:4f:4d:7a:82:f0",
            "net9": "82:0b:da:59:51:bb"
        },
        "tof_3_2_4": {
            "net0": "ba:7a:08:f4:87:d6",
            "net1": "4e:b3:2c:d0:aa:87",
            "net10": "7e:c0:d7:fa:95:5f",
            "net11": "1a:8e:76:41:d3:01",
            "net12": "c2:7c:e8:d7:90:63",
            "net13": "4e:6a:45:d1:8b:a9",
            "net14": "9e:dd:79:5c:be:1a",
            "net15": "6e:67:a9:e2:dc:4d",
            "net2": "52:67:d6:33:f1:62",
            "net3": "7a:f8:02:3b:e1:64",
            "net4": "da:f0:6f:57:3c:3a",
            "net5": "e2:ff:59:d7:bc:26",
            "net6": "ca:59:f6:4d:25:18",
            "net7": "92:be:b7:0d:eb:4f",
            "net8": "aa:f6:70:52:9c:80",
            "net9": "e6:90:75:32:4f:cb"
        },
        "tof_3_2_5": {
            "net0": "c6:20:68:d4:7a:7f",
            "net1": "8a:fc:e6:aa:bf:a0",
            "net10": "7e:7c:2f:e7:ad:e1",
            "net11": "42:94:a6:1a:64:09",
            "net12": "6e:cc:85:48:c3:e5",
            "net13": "8a:c0:5c:29:32:ff",
            "net14": "62:37:48:99:ae:c9",
            "net15": "b2:1c:f5:4d:20:a0",
            "net2": "1a:a0:ab:31:e2:f8",
            "net3": "7a:5e:95:7d:9c:d5",
            "net4": "ce:9d:bf:e5:1e:9f",
            "net5": "ee:56:cf:24:ba:8f",
            "net6": "9e:4f:88:00:67:98",
            "net7": "b6:ec:cf:27:26:c6",
            "net8": "a2:b9:9e:c3:24:38",
            "net9": "5a:ea:f3:9f:ae:95"
        },
        "tof_3_2_6": {
            "net0": "b2:00:e5:e8:4a:dc",
            "net1": "5a:eb:76:24:f6:48",
            "net10": "06:39:df:0f:25:de",
            "net11": "3a:37:50:15:f0:2b",
            "net12": "d6:8f:3c:7d:31:e8",
            "net13": "ae:45:f5:d9:58:d1",
            "net14": "f2:48:fc:f6:a2:5c",
            "net15": "f2:4d:1d:61:30:af",
            "net2": "f6:e2:af:a3:fe:29",
            "net3": "26:e2:01:b0:7d:ed",
            "net4": "92:af:51:1d:6c:6d",
            "net5": "aa:51:c5:4a:75:28",
            "net6": "ae:dc:94:d5:f4:54",
            "net7": "ba:ee:5a:a1:d7:cd",
            "net8": "8a:45:4a:65:68:e1",
            "net9": "de:b0:f5:41:a4:16"
        },
        "tof_3_2_7": {
            "net0": "be:d7:76:c4:42:1f",
            "net1": "b6:a3:40:2e:25:b0",
            "net10": "72:3b:bd:76:f0:c5",
            "net11": "e6:7b:6d:8d:8c:f9",
            "net12": "92:33:3a:52:0f:44",
            "net13": "a2:33:62:1d:be:b8",
            "net14": "82:22:40:c5:69:07",
            "net15": "f2:0c:f9:fc:b9:70",
            "net2": "1e:83:56:88:c9:7b",
            "net3": "12:d7:56:86:56:f4",
            "net4": "fe:77:09:d1:8c:50",
            "net5": "8a:fb:2f:9a:20:90",
            "net6": "62:d9:d7:fe:7b:49",
            "net7": "12:0f:b2:11:c0:fd",
            "net8": "5e:bf:a5:86:9a:a8",
            "net9": "06:74:07:8b:08:16"
        },
        "tof_3_2_8": {
            "net0": "2a:08:31:c0:f9:d4",
            "net1": "d2:81:6a:6f:16:84",
            "net10": "56:7a:3d:8b:b1:c1",
            "net11": "aa:c8:79:70:f4:ac",
            "net12": "76:50:30:fc:bb:d9",
            "net13": "16:8f:1a:85:20:d4",
            "net14": "fe:99:4f:c2:7f:79",
            "net15": "d2:94:a7:d1:04:39",
            "net2": "d6:41:eb:39:54:ad",
            "net3": "8e:e8:24:c0:dd:80",
            "net4": "9a:ca:7c:62:5d:32",
            "net5": "36:b1:c1:9b:56:0e",
            "net6": "12:8c:9f:a3:63:7f",
            "net7": "8a:62:ea:db:f5:7f",
            "net8": "32:aa:aa:f7:70:e6",
            "net9": "ca:fb:dd:76:82:67"
        },
        "tof_4_2_1": {
            "net0": "b6:3b:2f:73:25:34",
            "net1": "2a:52:53:0a:2d:d3",
            "net10": "b2:5e:2f:27:be:5b",
            "net11": "6a:79:4b:84:35:c8",
            "net12": "c6:c0:a0:fe:b4:b9",
            "net13": "e2:b6:77:b5:4f:e5",
            "net14": "c2:5d:de:84:ff:a3",
            "net15": "e6:c0:56:df:25:30",
            "net2": "3e:35:41:50:b5:81",
            "net3": "16:8d:74:d4:d9:da",
            "net4": "4a:97:29:76:c4:9a",
            "net5": "da:fa:b7:35:6b:6c",
            "net6": "0a:d5:38:b3:14:84",
            "net7": "3e:54:98:da:c3:b0",
            "net8": "de:aa:fc:d3:a8:8e",
            "net9": "2e:a5:cb:5d:d2:bd"
        },
        "tof_4_2_2": {
            "net0": "6a:14:f0:06:3f:74",
            "net1": "aa:f6:b7:5a:86:b9",
            "net10": "32:34:5d:46:86:1a",
            "net11": "e2:cd:8a:b3:88:d2",
            "net12": "ca:af:9a:fd:5d:ad",
            "net13": "9e:09:ad:c5:ad:bb",
            "net14": "ba:e6:0a:82:01:42",
            "net15": "da:46:18:39:c1:68",
            "net2": "5a:e8:f2:85:67:41",
            "net3": "fa:41:5d:f3:dc:98",
            "net4": "ae:49:35:bb:b9:4f",
            "net5": "22:8c:d7:25:01:59",
            "net6": "7e:7b:36:eb:43:26",
            "net7": "9a:22:d9:c5:47:b0",
            "net8": "2e:5d:1c:6e:7e:44",
            "net9": "b6:ad:fe:0a:a2:d3"
        },
        "tof_4_2_3": {
            "net0": "02:ac:76:c1:1f:1a",
            "net1": "ba:47:46:10:64:b6",
            "net10": "4e:6a:45:8a:b1:90",
            "net11": "8e:a7:ef:53:44:30",
            "net12": "de:59:d4:91:17:d6",
            "net13": "56:be:8e:90:60:e2",
            "net14": "aa:26:c2:1e:a7:ce",
            "net15": "7e:cb:8b:a9:02:10",
            "net2": "66:b2:6c:cf:9f:44",
            "net3": "8a:6f:26:4e:5c:cb",
            "net4": "6a:ad:70:bd:ff:36",
            "net5": "5e:13:b7:ff:e5:11",
            "net6": "9a:38:e1:b5:20:f1",
            "net7": "9e:dc:88:ca:dd:c6",
            "net8": "3a:e6:3d:ad:42:8c",
            "net9": "62:0c:e0:6f:e5:05"
        },
        "tof_4_2_4": {
            "net0": "be:92:85:40:c0:bf",
            "net1": "2e:f2:98:f6:7d:0a",
            "net10": "5e:c4:51:e0:95:65",
            "net11": "ee:9b:67:c4:ec:61",
            "net12": "0e:15:2d:df:cb:5f",
            "net13": "9a:00:f8:7b:3d:f9",
            "net14": "e6:ea:9c:90:84:c0",
            "net15": "6a:f4:8f:a7:ce:81",
            "net2": "4a:bc:13:da:86:d8",
            "net3": "c2:c0:76:16:c8:eb",
            "net4": "12:b5:0b:ba:fc:26",
            "net5": "da:0a:97:8e:ba:f6",
            "net6": "c6:30:78:58:51:f2",
            "net7": "16:63:56:33:2d:45",
            "net8": "46:0d:8b:5e:06:98",
            "net9": "de:d4:c7:bd:7f:89"
        },
        "tof_4_2_5": {
            "net0": "a6:43:90:44:5a:d8",
            "net1": "02:28:d8:8b:35:97",
            "net10": "b2:e2:73:4d:a1:28",
            "net11": "ce:c2:61:59:fb:b2",
            "net12": "8a:75:50:30:57:5e",
            "net13": "fa:9e:75:18:68:c4",
            "net14": "66:b4:e7:80:4a:09",
            "net15": "72:8e:94:a6:e9:4e",
            "net2": "46:2f:43:48:74:e6",
            "net3": "26:f9:5d:e4:02:e4",
            "net4": "2a:ad:cf:f5:e9:ef",
            "net5": "0a:86:fa:8d:94:5e",
            "net6": "c2:27:a8:94:d6:87",
            "net7": "56:5e:88:99:6a:6a",
            "net8": "7a:61:48:c1:39:97",
            "net9": "92:cd:e1:74:f4:50"
        },
        "tof_4_2_6": {
            "net0": "96:13:4d:a7:f5:c7",
            "net1": "96:b1:5f:fa:dd:09",
            "net10": "b2:3d:1d:11:70:72",
            "net11": "c6:76:36:f6:6f:9d",
            "net12": "4a:48:41:9c:25:68",
            "net13": "1e:a2:75:d6:25:9a",
            "net14": "6a:fc:98:a5:4c:13",
            "net15": "c2:b5:08:78:db:fd",
            "net2": "fe:62:03:39:5b:1a",
            "net3": "46:92:92:aa:91:c8",
            "net4": "46:eb:6d:09:7c:06",
            "net5": "36:91:57:60:ae:aa",
            "net6": "92:d5:a2:f2:15:0d",
            "net7": "e2:ad:6a:88:24:12",
            "net8": "a6:03:1b:dd:96:0b",
            "net9": "ba:65:10:59:8a:4a"
        },
        "tof_4_2_7": {
            "net0": "1a:e9:7c:75:17:83",
            "net1": "c6:04:b3:4b:7e:dd",
            "net10": "46:ec:65:0f:8f:29",
            "net11": "12:ba:45:0f:01:66",
            "net12": "96:7a:15:b4:c2:fc",
            "net13": "a6:7e:ba:03:93:d3",
            "net14": "b2:ca:3e:ca:7b:38",
            "net15": "ae:c5:f4:68:eb:ba",
            "net2": "02:a1:66:e4:0f:d7",
            "net3": "ba:c7:87:25:1f:11",
            "net4": "6a:22:7e:48:ce:03",
            "net5": "6a:74:25:64:b6:73",
            "net6": "52:2d:9f:e5:c0:cb",
            "net7": "72:9f:e2:e3:32:34",
            "net8": "76:71:14:39:d6:4f",
            "net9": "82:2d:22:2a:47:f9"
        },
        "tof_4_2_8": {
            "net0": "82:2d:d5:9b:ba:b0",
            "net1": "6a:43:9d:76:03:28",
            "net10": "de:36:4e:6b:bb:9c",
            "net11": "2e:d1:92:83:4e:b0",
            "net12": "e6:dd:fe:25:a6:75",
            "net13": "32:9f:ad:15:59:e5",
            "net14": "7e:70:4f:19:87:a1",
            "net15": "4e:e5:8e:74:e4:f3",
            "net2": "d2:84:12:2f:69:29",
            "net3": "ba:1e:88:92:42:9e",
            "net4": "aa:fd:22:9b:ef:7d",
            "net5": "a6:60:94:5b:d6:fd",
            "net6": "fe:b4:3f:12:72:76",
            "net7": "7e:47:31:0b:3b:01",
            "net8": "26:5a:8e:a8:c3:7d",
            "net9": "2a:2f:a4:c2:68:20"
        }
    },
    "failed_machine": "spine_1_1_1",
    "failure_time": 1614471611.5445704,
    "recover_time": 1614471895.086768
}