{
    "k_leaf": 8,
    "k_top": 8,
    "redundancy_factor": 4,
    "is_k8s": true,
    "machine_mac_addresses": {
        "leaf_1_0_1": {
            "net0": "ea:92:35:47:e5:49",
            "net1": "de:1b:cf:1d:8f:ae",
            "net2": "fe:9c:43:f9:5d:f2",
            "net3": "9a:19:d3:95:1e:e2",
            "net4": "b2:02:6d:f1:8b:00",
            "net5": "9e:9b:f2:ea:c6:e2",
            "net6": "da:68:66:2a:11:e4",
            "net7": "da:d6:81:33:db:a4",
            "net8": "c6:e8:b4:d4:42:5b"
        },
        "leaf_1_0_2": {
            "net0": "96:4c:aa:55:83:16",
            "net1": "e2:6d:88:2b:75:ac",
            "net2": "c6:c2:3f:8f:43:33",
            "net3": "76:60:3e:4e:36:2e",
            "net4": "56:ec:ac:e0:b6:16",
            "net5": "9e:d0:c1:4f:39:85",
            "net6": "de:73:fc:7f:ff:3b",
            "net7": "46:66:5c:7e:97:cb",
            "net8": "3a:88:f8:18:57:55"
        },
        "leaf_1_0_3": {
            "net0": "72:6e:0d:43:68:81",
            "net1": "8a:49:da:45:10:2c",
            "net2": "32:ea:44:cd:4c:e0",
            "net3": "5e:9d:8d:78:c3:27",
            "net4": "aa:55:31:44:20:a6",
            "net5": "3a:ec:e3:3a:50:5f",
            "net6": "b2:69:7a:d0:65:82",
            "net7": "ee:48:80:ba:20:ac",
            "net8": "46:cb:07:dd:3b:ba"
        },
        "leaf_1_0_4": {
            "net0": "3e:08:e7:13:36:17",
            "net1": "36:0a:6c:3a:97:97",
            "net2": "e2:ac:bf:ae:b3:03",
            "net3": "76:4c:b9:14:be:8a",
            "net4": "4a:bd:db:7e:f8:b7",
            "net5": "c6:ba:32:8c:39:8e",
            "net6": "46:ca:52:5a:ee:7c",
            "net7": "2a:69:f6:9a:8c:83",
            "net8": "9a:24:17:98:73:5c"
        },
        "leaf_1_0_5": {
            "net0": "02:cd:f3:b5:41:f3",
            "net1": "5a:99:ad:17:df:c7",
            "net2": "de:26:a0:5a:12:05",
            "net3": "4e:3c:33:cc:14:c9",
            "net4": "0e:ea:a5:91:7b:51",
            "net5": "02:71:58:f0:aa:9c",
            "net6": "06:31:de:47:da:f6",
            "net7": "ae:43:03:d2:51:42",
            "net8": "1a:3d:f0:80:63:cc"
        },
        "leaf_1_0_6": {
            "net0": "36:a3:62:72:2e:0e",
            "net1": "e6:5f:4b:51:01:98",
            "net2": "aa:21:a3:cf:e4:67",
            "net3": "6a:ff:0d:51:a6:ef",
            "net4": "a2:8a:3d:b0:5d:47",
            "net5": "4e:80:43:38:ac:33",
            "net6": "aa:db:ae:1d:5f:ef",
            "net7": "6e:6a:df:35:a7:2a",
            "net8": "7e:ad:d7:31:ea:a8"
        },
        "leaf_1_0_7": {
            "net0": "ba:af:85:9b:45:1f",
            "net1": "32:fa:b7:b9:76:69",
            "net2": "86:f9:e2:b0:90:f4",
            "net3": "9a:8e:62:23:43:6a",
            "net4": "ae:80:d4:84:c9:0d",
            "net5": "c6:b7:f7:c5:f8:b2",
            "net6": "e6:95:b1:e7:03:59",
            "net7": "5e:d8:4c:75:77:5d",
            "net8": "ae:10:bd:5e:35:ab"
        },
        "leaf_1_0_8": {
            "net0": "72:24:00:92:e0:05",
            "net1": "d6:fa:ee:0a:a7:b0",
            "net2": "fa:f9:1a:67:17:ee",
            "net3": "c2:06:c4:d9:0d:5c",
            "net4": "76:6a:e4:9c:34:5c",
            "net5": "86:11:15:a0:91:1e",
            "net6": "5a:c7:14:b4:ea:c7",
            "net7": "ce:0f:4f:d1:cc:c7",
            "net8": "a6:eb:22:d2:34:78"
        },
        "leaf_2_0_1": {
            "net0": "aa:4c:ab:0b:26:37",
            "net1": "fe:c6:38:46:9b:23",
            "net2": "0e:95:e0:4f:a0:10",
            "net3": "26:3e:97:eb:89:2d",
            "net4": "ca:3b:08:cc:85:d8",
            "net5": "ae:48:f8:cd:c3:9a",
            "net6": "de:8c:b1:c2:65:20",
            "net7": "c2:13:9e:bf:54:be",
            "net8": "16:18:0a:28:74:fd"
        },
        "leaf_2_0_2": {
            "net0": "a2:31:fa:f6:f0:0f",
            "net1": "f2:4a:d9:af:9a:d4",
            "net2": "4a:27:f3:6b:20:c4",
            "net3": "2a:f2:63:ff:8c:17",
            "net4": "42:09:5a:11:f4:8b",
            "net5": "ee:6b:d9:7b:ec:2c",
            "net6": "76:84:2b:f1:90:4b",
            "net7": "f2:e2:0c:a5:77:ec",
            "net8": "36:e3:b8:54:de:60"
        },
        "leaf_2_0_3": {
            "net0": "86:4e:7c:1e:8b:84",
            "net1": "8e:bf:63:36:48:5f",
            "net2": "0e:3a:f2:fb:f7:50",
            "net3": "9a:9c:ac:37:0a:49",
            "net4": "f6:11:db:fd:85:ca",
            "net5": "fa:79:05:75:a2:8f",
            "net6": "fa:a9:9e:b7:30:9e",
            "net7": "ce:72:45:34:cf:79",
            "net8": "82:1d:71:b4:c8:d8"
        },
        "leaf_2_0_4": {
            "net0": "ee:c5:35:12:75:ba",
            "net1": "a2:2e:8a:6d:81:c4",
            "net2": "da:d0:8d:a2:27:5b",
            "net3": "e6:94:79:59:3c:78",
            "net4": "16:f8:78:8b:07:b1",
            "net5": "96:07:14:c1:6d:b8",
            "net6": "62:97:5f:61:34:fa",
            "net7": "9e:d5:df:94:49:be",
            "net8": "8e:4f:9c:59:64:cc"
        },
        "leaf_2_0_5": {
            "net0": "26:e0:5b:37:16:e9",
            "net1": "9e:a6:e6:a1:8a:3a",
            "net2": "9e:56:75:87:66:6e",
            "net3": "f6:de:91:1f:27:85",
            "net4": "6a:51:b1:68:3e:15",
            "net5": "7e:90:45:3e:c4:ce",
            "net6": "32:ed:77:ae:97:de",
            "net7": "96:28:85:6c:13:54",
            "net8": "a2:b3:b0:6f:e7:79"
        },
        "leaf_2_0_6": {
            "net0": "42:c3:40:e5:ce:3e",
            "net1": "46:83:68:ec:c3:12",
            "net2": "ca:c9:b1:63:06:e5",
            "net3": "d6:c1:ac:40:b2:58",
            "net4": "ea:8f:22:ef:f0:1d",
            "net5": "ae:0c:d9:e2:0a:3d",
            "net6": "ea:32:cd:99:df:eb",
            "net7": "ea:85:ee:3a:b9:1a",
            "net8": "d2:3b:5a:0d:1b:5d"
        },
        "leaf_2_0_7": {
            "net0": "6e:e5:d7:53:26:44",
            "net1": "0a:f0:ec:6f:d5:d0",
            "net2": "9a:50:8e:fb:ca:6b",
            "net3": "e2:5f:2d:6a:02:ff",
            "net4": "8e:78:ed:17:b1:6f",
            "net5": "06:37:3b:6a:e5:33",
            "net6": "26:6b:3c:66:a2:31",
            "net7": "9e:f3:10:bd:da:1a",
            "net8": "46:3a:62:73:9f:b3"
        },
        "leaf_2_0_8": {
            "net0": "26:b5:e3:fd:49:66",
            "net1": "46:ef:93:4f:78:3c",
            "net2": "c6:41:e9:f0:b0:aa",
            "net3": "da:54:a6:94:36:89",
            "net4": "ea:77:20:35:be:41",
            "net5": "5e:14:38:f3:74:7f",
            "net6": "c2:42:74:f8:c9:92",
            "net7": "de:2b:75:30:70:01",
            "net8": "aa:50:71:43:8e:1e"
        },
        "leaf_3_0_1": {
            "net0": "36:bd:85:87:d7:9f",
            "net1": "52:4c:20:d2:ec:70",
            "net2": "52:5c:ef:c7:e1:a2",
            "net3": "5a:0b:cf:85:c3:5b",
            "net4": "ba:9b:4b:8e:5b:16",
            "net5": "16:50:52:c1:ae:de",
            "net6": "ce:be:30:90:7e:91",
            "net7": "ce:48:c7:1b:82:16",
            "net8": "96:b0:02:38:c9:5f"
        },
        "leaf_3_0_2": {
            "net0": "c6:e5:c7:d9:66:ee",
            "net1": "4a:d8:55:70:9a:3a",
            "net2": "1e:17:3a:7d:51:ad",
            "net3": "de:34:bb:4e:11:10",
            "net4": "2e:2d:22:6c:23:0d",
            "net5": "2a:d5:e2:31:f1:bc",
            "net6": "b2:a3:3d:ad:a4:af",
            "net7": "d2:64:5c:64:8e:af",
            "net8": "5a:d6:55:74:76:11"
        },
        "leaf_3_0_3": {
            "net0": "c2:80:4b:5f:42:84",
            "net1": "3e:76:32:02:de:00",
            "net2": "76:01:b0:36:e7:65",
            "net3": "ae:15:ce:b1:10:4c",
            "net4": "ca:e1:df:27:0f:09",
            "net5": "16:28:be:05:18:38",
            "net6": "72:b1:40:2f:b1:99",
            "net7": "b6:85:9c:85:b8:15",
            "net8": "2a:bd:43:75:c6:25"
        },
        "leaf_3_0_4": {
            "net0": "5a:d2:eb:b1:9d:b3",
            "net1": "96:48:0e:41:13:7a",
            "net2": "46:c3:31:19:0c:92",
            "net3": "02:1c:87:5b:c1:47",
            "net4": "aa:36:20:d9:c6:f2",
            "net5": "ae:ce:3a:9c:f7:3a",
            "net6": "4e:45:43:65:03:ad",
            "net7": "2e:5b:fe:02:b0:cc",
            "net8": "42:24:75:71:53:af"
        },
        "leaf_3_0_5": {
            "net0": "c2:4c:7e:50:e4:09",
            "net1": "1e:d0:d4:d1:4c:f3",
            "net2": "3a:1a:20:18:87:1b",
            "net3": "2a:27:93:8f:8c:ce",
            "net4": "ca:5f:ee:d7:45:c4",
            "net5": "92:d4:ea:47:3e:2a",
            "net6": "a2:20:5b:ce:5b:e1",
            "net7": "c6:72:8c:c3:4a:11",
            "net8": "92:e7:ee:8f:02:43"
        },
        "leaf_3_0_6": {
            "net0": "6a:1c:5d:d5:2f:c5",
            "net1": "96:f5:50:80:1d:34",
            "net2": "a2:4d:e2:78:b1:46",
            "net3": "4e:35:25:db:32:27",
            "net4": "ba:b4:a7:da:e6:18",
            "net5": "6a:97:cf:58:49:d3",
            "net6": "f2:21:c1:de:c3:f9",
            "net7": "ea:12:be:d2:b1:51",
            "net8": "42:e0:dd:12:a7:df"
        },
        "leaf_3_0_7": {
            "net0": "9e:ba:45:17:31:68",
            "net1": "da:07:05:82:fd:fe",
            "net2": "0a:18:5a:10:e7:92",
            "net3": "a6:9a:53:a0:26:ab",
            "net4": "9e:d2:3c:a4:7b:8a",
            "net5": "4e:b8:ad:09:9f:08",
            "net6": "12:4c:72:63:47:60",
            "net7": "fe:25:c6:be:36:dd",
            "net8": "f6:0f:91:1b:06:fe"
        },
        "leaf_3_0_8": {
            "net0": "c6:7c:62:27:d4:ee",
            "net1": "56:24:2b:94:c2:da",
            "net2": "36:bf:9b:92:10:7a",
            "net3": "22:e8:c9:b4:82:f5",
            "net4": "c2:af:a1:82:76:0d",
            "net5": "5a:3c:c9:0a:4c:03",
            "net6": "c6:fc:79:38:98:8c",
            "net7": "d2:b0:6e:27:8e:e0",
            "net8": "d2:04:c3:b2:02:e3"
        },
        "leaf_4_0_1": {
            "net0": "a6:7e:8e:90:aa:ba",
            "net1": "32:38:7c:2c:31:36",
            "net2": "5e:b8:fb:76:79:9f",
            "net3": "a6:31:ac:84:e7:24",
            "net4": "8e:02:7a:b2:d2:5f",
            "net5": "4e:7d:09:ba:28:77",
            "net6": "1a:5f:8c:ac:ce:f8",
            "net7": "56:df:a1:94:fd:f9",
            "net8": "56:91:bf:35:2f:2b"
        },
        "leaf_4_0_2": {
            "net0": "ae:bd:92:99:05:8a",
            "net1": "e6:ae:bf:0e:9d:75",
            "net2": "26:fd:2b:c1:b0:09",
            "net3": "4a:1e:72:18:68:a7",
            "net4": "3e:e8:16:33:bd:a4",
            "net5": "aa:9e:53:92:d8:1d",
            "net6": "52:c4:04:06:d9:6e",
            "net7": "d6:c3:ae:6b:0c:ab",
            "net8": "f6:c9:f2:fa:ba:45"
        },
        "leaf_4_0_3": {
            "net0": "56:71:0c:09:92:ec",
            "net1": "9a:d5:76:20:aa:a6",
            "net2": "ce:d3:c0:a2:7e:a5",
            "net3": "a6:db:3b:f5:0d:76",
            "net4": "8a:62:8c:8a:2d:66",
            "net5": "1e:35:d7:e6:bc:3e",
            "net6": "7a:b9:71:c7:e5:3d",
            "net7": "ca:a5:49:fa:07:d0",
            "net8": "8e:fc:80:c0:a3:02"
        },
        "leaf_4_0_4": {
            "net0": "06:e1:78:b3:d5:fe",
            "net1": "4a:11:f3:ea:14:55",
            "net2": "0a:d4:7b:a7:7b:30",
            "net3": "02:19:f5:8b:56:aa",
            "net4": "4e:08:df:f9:ff:7a",
            "net5": "42:80:38:13:c4:c9",
            "net6": "0a:2b:64:80:05:4e",
            "net7": "f2:45:07:93:1f:94",
            "net8": "e6:5e:fe:67:33:bb"
        },
        "leaf_4_0_5": {
            "net0": "5e:bb:b9:7f:03:c9",
            "net1": "ae:c0:b8:23:59:bf",
            "net2": "be:50:ac:c5:50:2d",
            "net3": "76:8f:3b:15:7b:82",
            "net4": "22:65:8d:ca:52:b4",
            "net5": "f2:19:a9:07:b2:d7",
            "net6": "82:ad:4f:66:00:71",
            "net7": "6e:69:db:da:da:0f",
            "net8": "72:44:be:f6:7f:25"
        },
        "leaf_4_0_6": {
            "net0": "6e:9f:88:33:7b:91",
            "net1": "be:79:71:20:29:71",
            "net2": "9a:d5:32:51:82:4f",
            "net3": "42:4a:0b:b8:4b:5d",
            "net4": "96:d0:bf:27:86:0c",
            "net5": "5a:8b:49:75:d7:0d",
            "net6": "ca:56:75:81:0b:36",
            "net7": "c2:98:34:a5:bd:4c",
            "net8": "f2:1a:d3:6c:db:e3"
        },
        "leaf_4_0_7": {
            "net0": "ae:76:8b:ea:b5:a0",
            "net1": "32:75:0c:05:47:00",
            "net2": "4a:85:45:61:53:cf",
            "net3": "46:25:45:5f:0f:2b",
            "net4": "da:3e:fb:60:2b:7d",
            "net5": "ca:b7:1b:5f:a8:a0",
            "net6": "12:7d:11:3a:b0:02",
            "net7": "b6:21:7d:c9:fc:d8",
            "net8": "02:76:94:2a:b7:96"
        },
        "leaf_4_0_8": {
            "net0": "c2:ae:c4:48:6a:f2",
            "net1": "ea:d4:da:29:32:7b",
            "net2": "8e:8f:3c:3b:da:1c",
            "net3": "5e:11:de:ee:d1:ab",
            "net4": "5e:ff:7d:30:27:a8",
            "net5": "f2:70:d3:aa:8e:3f",
            "net6": "06:aa:f4:7b:07:4d",
            "net7": "5a:22:0c:b1:66:ad",
            "net8": "6e:4b:36:c7:b7:60"
        },
        "spine_1_1_1": {
            "net0": "86:ad:16:b6:ed:40",
            "net1": "aa:8b:d3:68:c7:f0",
            "net10": "ee:7b:f1:19:c6:d6",
            "net11": "72:eb:0f:b9:52:0b",
            "net12": "6a:18:01:88:be:ba",
            "net13": "06:2e:8a:3e:94:a3",
            "net14": "06:09:a5:19:a0:0e",
            "net15": "82:0f:92:a0:5f:14",
            "net2": "fe:4c:6d:3a:9f:f9",
            "net3": "e6:49:d8:0f:50:3f",
            "net4": "8e:46:b3:b0:13:c9",
            "net5": "3a:22:f8:5d:5c:01",
            "net6": "1e:62:e4:87:d5:fe",
            "net7": "62:82:af:fa:1c:30",
            "net8": "92:8c:65:ff:0b:97",
            "net9": "4e:50:40:ab:f3:21"
        },
        "spine_1_1_2": {
            "net0": "f2:77:29:8a:e4:08",
            "net1": "26:61:c3:6b:2a:4d",
            "net10": "ee:d2:51:09:49:13",
            "net11": "b2:f5:16:65:92:0b",
            "net12": "f6:8b:58:4a:e6:9e",
            "net13": "e2:6b:80:1e:fe:9b",
            "net14": "5e:06:cd:9c:17:f1",
            "net15": "8e:bf:00:ec:0a:b4",
            "net2": "9e:7e:00:f1:32:cc",
            "net3": "26:77:dc:d1:84:28",
            "net4": "d2:c3:85:66:4f:6a",
            "net5": "b6:e0:1d:20:43:9f",
            "net6": "86:a4:52:a6:a1:73",
            "net7": "06:39:03:17:07:e4",
            "net8": "36:cf:3d:ba:32:d5",
            "net9": "66:9f:1b:e8:31:47"
        },
        "spine_1_1_3": {
            "net0": "02:20:b4:cb:6c:63",
            "net1": "d2:72:7a:38:16:f9",
            "net10": "e2:db:e2:4e:76:11",
            "net11": "72:91:e5:d8:79:21",
            "net12": "ce:ba:d0:90:af:64",
            "net13": "3a:65:45:13:84:35",
            "net14": "c2:6d:e3:ee:dc:fe",
            "net15": "2a:44:c2:88:7f:e3",
            "net2": "66:00:12:85:18:39",
            "net3": "8a:1c:de:94:c2:50",
            "net4": "66:01:30:66:94:a0",
            "net5": "4a:77:f1:30:0c:61",
            "net6": "c2:4f:4d:3d:d0:c7",
            "net7": "b6:5d:78:2c:b6:c1",
            "net8": "86:df:f6:7e:65:12",
            "net9": "2a:21:b4:4f:5e:ab"
        },
        "spine_1_1_4": {
            "net0": "52:d4:36:96:e7:ce",
            "net1": "ee:a0:de:7a:14:ce",
            "net10": "e2:8b:be:57:61:9a",
            "net11": "2e:4f:cb:51:07:2e",
            "net12": "a2:89:c1:88:36:ac",
            "net13": "3e:fe:f5:c2:9c:b7",
            "net14": "be:f0:79:16:5a:2b",
            "net15": "7e:45:5c:d7:86:12",
            "net2": "d2:9e:73:38:6a:33",
            "net3": "2e:84:bd:fe:b2:07",
            "net4": "82:91:d8:63:ec:11",
            "net5": "c6:27:d8:be:e9:18",
            "net6": "7a:ca:44:41:c3:e8",
            "net7": "3a:87:d7:0d:e6:99",
            "net8": "be:39:b6:70:bd:9b",
            "net9": "26:c5:68:b6:0a:43"
        },
        "spine_1_1_5": {
            "net0": "ca:e8:66:53:3b:35",
            "net1": "32:97:cb:fe:da:08",
            "net10": "6e:ec:b7:87:e6:54",
            "net11": "86:68:02:a3:ae:5b",
            "net12": "62:20:ae:b7:16:b1",
            "net13": "6e:ce:44:7f:43:f1",
            "net14": "5a:f1:b0:9b:42:0c",
            "net15": "32:9f:5a:ad:08:d5",
            "net2": "c2:7a:f1:c9:ba:72",
            "net3": "8e:ba:a5:34:e8:ee",
            "net4": "12:2b:5c:f2:ec:34",
            "net5": "b2:96:8d:bb:a4:0e",
            "net6": "12:38:42:d6:61:90",
            "net7": "6a:d0:d6:b9:b9:4b",
            "net8": "c2:24:bb:8d:67:0c",
            "net9": "56:17:97:f4:86:6c"
        },
        "spine_1_1_6": {
            "net0": "be:60:fe:4a:3e:b3",
            "net1": "96:c9:cb:32:a2:37",
            "net10": "be:85:37:67:91:46",
            "net11": "0a:35:45:26:44:e7",
            "net12": "be:ae:ff:82:35:0a",
            "net13": "22:dd:f4:2d:57:10",
            "net14": "1e:68:e9:d1:64:e1",
            "net15": "02:1f:50:2a:db:45",
            "net2": "f6:12:44:25:b9:0c",
            "net3": "d2:bc:ed:9c:7a:aa",
            "net4": "8e:b2:77:7e:92:77",
            "net5": "fe:55:58:62:f2:56",
            "net6": "2a:b8:f4:fa:4f:9c",
            "net7": "86:32:97:4b:44:99",
            "net8": "de:e7:63:69:59:9e",
            "net9": "9e:4f:f1:3f:36:5b"
        },
        "spine_1_1_7": {
            "net0": "fa:31:f6:20:cf:50",
            "net1": "9a:b3:9b:f8:14:2c",
            "net10": "86:10:64:60:c4:14",
            "net11": "9e:b7:49:01:a1:0c",
            "net12": "ea:6e:f8:e8:2e:50",
            "net13": "5a:d7:c3:59:76:73",
            "net14": "aa:6a:f5:9a:1b:db",
            "net15": "52:40:3b:5d:79:63",
            "net2": "82:33:60:f8:5d:d0",
            "net3": "a2:9a:bf:9a:8f:f9",
            "net4": "22:d9:35:e6:96:3b",
            "net5": "ce:5e:9d:a7:57:b5",
            "net6": "fa:6d:1b:dd:1b:eb",
            "net7": "5a:da:d7:31:8f:00",
            "net8": "66:0a:11:3f:c4:4e",
            "net9": "ae:ab:b5:b1:56:76"
        },
        "spine_1_1_8": {
            "net0": "02:b0:44:62:24:d2",
            "net1": "e2:4c:1e:dc:3f:5a",
            "net10": "ea:13:2a:17:76:50",
            "net11": "72:89:3b:c7:cd:3c",
            "net12": "be:5a:9e:8e:eb:92",
            "net13": "aa:21:d7:8c:c9:0e",
            "net14": "4e:3a:71:40:0e:26",
            "net15": "1a:37:c9:a0:c4:12",
            "net2": "72:f0:19:d4:ab:a7",
            "net3": "02:08:7c:ee:06:ab",
            "net4": "26:a2:86:dc:18:e7",
            "net5": "7e:33:0a:ef:07:2b",
            "net6": "fa:e6:eb:15:b3:fd",
            "net7": "26:cd:45:57:1b:ca",
            "net8": "86:03:03:74:67:10",
            "net9": "92:73:a3:b6:93:e0"
        },
        "spine_2_1_1": {
            "net0": "ea:0d:7e:7a:dc:1c",
            "net1": "6e:f6:c9:74:71:77",
            "net10": "9e:0e:c0:7b:45:14",
            "net11": "0a:e4:a4:a4:7b:86",
            "net12": "86:76:b4:47:83:b5",
            "net13": "96:87:99:fd:31:e7",
            "net14": "4e:2f:71:b1:76:4c",
            "net15": "06:d6:76:5e:30:e0",
            "net2": "46:17:e6:a0:42:b3",
            "net3": "82:ff:8d:ce:0a:0b",
            "net4": "92:e8:4c:ab:dd:4d",
            "net5": "8a:8c:ab:06:32:ec",
            "net6": "76:4c:2b:8a:ef:7f",
            "net7": "4a:74:3d:ff:cc:9e",
            "net8": "3a:77:56:cc:33:8a",
            "net9": "56:fa:78:8c:4f:30"
        },
        "spine_2_1_2": {
            "net0": "f2:af:1e:4f:72:d8",
            "net1": "1e:6c:12:21:24:65",
            "net10": "82:18:df:51:76:10",
            "net11": "b6:05:33:d6:4f:82",
            "net12": "0a:49:fd:a8:26:d9",
            "net13": "b2:70:bf:4a:6c:d1",
            "net14": "36:13:8d:a6:19:06",
            "net15": "32:cb:cc:ae:5a:a6",
            "net2": "66:61:bd:52:fd:87",
            "net3": "ee:de:cf:1e:e5:37",
            "net4": "ca:f9:3b:82:d5:16",
            "net5": "f2:fb:9f:cc:f6:7c",
            "net6": "2a:e8:e2:0f:2b:1e",
            "net7": "c2:8c:cb:b1:e4:c2",
            "net8": "4e:33:1a:ed:10:74",
            "net9": "16:55:31:dc:34:4e"
        },
        "spine_2_1_3": {
            "net0": "56:7b:5d:79:17:cd",
            "net1": "7a:0d:88:3e:ce:48",
            "net10": "9a:ef:30:60:f1:ce",
            "net11": "da:a9:6c:3f:ba:56",
            "net12": "26:f0:84:ff:c9:63",
            "net13": "82:15:71:04:7a:c4",
            "net14": "42:f4:95:ff:91:3d",
            "net15": "26:f0:e8:da:59:f3",
            "net2": "7e:5d:5c:63:54:7c",
            "net3": "26:99:dd:e7:42:0f",
            "net4": "36:fd:7e:66:50:c8",
            "net5": "36:38:67:56:9f:cd",
            "net6": "ae:7d:f4:0d:6f:de",
            "net7": "92:4d:39:5d:bc:db",
            "net8": "5a:6e:b9:9e:b0:fc",
            "net9": "da:3f:36:86:5b:1d"
        },
        "spine_2_1_4": {
            "net0": "d6:dd:b3:18:ed:aa",
            "net1": "fa:df:fd:e1:06:31",
            "net10": "f2:20:8b:67:ca:7e",
            "net11": "d6:50:9e:9f:43:f9",
            "net12": "4e:ff:65:c2:38:63",
            "net13": "26:52:c0:7a:e9:a7",
            "net14": "8e:ad:af:71:97:a3",
            "net15": "86:f9:8d:58:10:4d",
            "net2": "56:19:8b:45:2a:1a",
            "net3": "6a:df:72:39:84:7e",
            "net4": "6a:f5:80:1b:e2:2b",
            "net5": "72:16:86:54:49:97",
            "net6": "1e:d5:13:fd:c7:d8",
            "net7": "ca:05:07:a8:c3:29",
            "net8": "12:83:b9:af:c7:8a",
            "net9": "32:89:ec:d9:13:ee"
        },
        "spine_2_1_5": {
            "net0": "fa:76:47:31:97:e0",
            "net1": "e2:33:95:07:49:94",
            "net10": "1a:f5:69:f1:66:0d",
            "net11": "36:f3:fa:9f:a7:05",
            "net12": "ca:4d:83:95:1f:f6",
            "net13": "fa:66:fd:34:c6:ad",
            "net14": "86:7a:bc:64:f8:af",
            "net15": "4e:f1:2a:61:b0:4f",
            "net2": "96:25:c0:db:57:c7",
            "net3": "2e:13:da:ae:38:02",
            "net4": "5e:2d:d2:1a:47:57",
            "net5": "66:1c:bc:65:9a:f5",
            "net6": "22:4f:7b:f1:80:1f",
            "net7": "8e:35:81:80:f5:82",
            "net8": "9a:fe:3d:c4:f5:94",
            "net9": "4a:d7:32:3d:8a:32"
        },
        "spine_2_1_6": {
            "net0": "fa:21:c4:39:ee:c7",
            "net1": "4a:d6:be:0f:e7:7c",
            "net10": "b2:19:7d:73:21:79",
            "net11": "3a:38:c3:d3:12:32",
            "net12": "8a:fd:3d:39:44:89",
            "net13": "52:82:a1:de:bc:37",
            "net14": "9e:b4:a2:bb:02:86",
            "net15": "f2:af:88:66:97:40",
            "net2": "3e:49:55:cc:ae:c9",
            "net3": "b6:2a:65:2f:cd:ac",
            "net4": "da:e9:42:6f:f0:0e",
            "net5": "ee:66:43:53:ed:76",
            "net6": "f2:2d:9c:48:f4:f7",
            "net7": "a2:e7:94:01:45:38",
            "net8": "66:eb:29:ac:58:26",
            "net9": "b6:f4:53:85:94:e5"
        },
        "spine_2_1_7": {
            "net0": "ae:0a:7f:24:0c:25",
            "net1": "c2:fe:93:53:d9:17",
            "net10": "0a:cd:75:e7:c4:7f",
            "net11": "c2:22:d0:33:70:af",
            "net12": "36:0d:62:04:0b:29",
            "net13": "6a:73:af:b2:7b:9f",
            "net14": "e6:98:ef:df:50:31",
            "net15": "1a:19:9b:e0:e7:4e",
            "net2": "86:f1:95:83:2e:21",
            "net3": "c6:6d:9a:97:8e:c0",
            "net4": "02:b2:55:3f:37:c1",
            "net5": "1a:cc:0c:d1:68:c8",
            "net6": "4a:9f:8b:6f:10:0d",
            "net7": "ea:bc:f0:ac:8b:a4",
            "net8": "b6:87:62:b9:37:6b",
            "net9": "42:17:6e:4f:b4:5d"
        },
        "spine_2_1_8": {
            "net0": "5e:0d:79:1b:ba:20",
            "net1": "ae:ad:92:b8:af:7b",
            "net10": "a2:63:a1:a1:a5:a6",
            "net11": "d2:d2:1d:ec:65:f5",
            "net12": "7e:c4:6a:1d:fb:a9",
            "net13": "ce:7b:8e:f9:73:ff",
            "net14": "26:68:d9:05:d2:23",
            "net15": "46:9c:e8:0e:aa:7a",
            "net2": "86:ec:19:7f:a8:0d",
            "net3": "36:c5:41:65:bb:db",
            "net4": "c6:a1:92:5e:fb:5a",
            "net5": "56:be:a4:67:d3:80",
            "net6": "66:e8:f0:33:b9:9b",
            "net7": "52:4f:0d:d2:4b:7c",
            "net8": "12:62:16:69:ab:4a",
            "net9": "56:0e:19:7a:76:1c"
        },
        "spine_3_1_1": {
            "net0": "d2:7e:80:ae:b9:ef",
            "net1": "0a:30:a3:9e:ea:e2",
            "net10": "e2:35:15:6e:5a:fb",
            "net11": "36:d3:f1:f6:8b:01",
            "net12": "72:84:98:3c:31:b3",
            "net13": "26:ae:c6:d9:b8:17",
            "net14": "12:a9:2a:5a:43:4b",
            "net15": "52:38:a9:20:85:f5",
            "net2": "c6:34:8a:53:67:a1",
            "net3": "ba:14:e1:58:f2:87",
            "net4": "ea:eb:b9:4a:35:18",
            "net5": "e2:40:76:fb:a4:9f",
            "net6": "ca:ff:46:1a:ad:76",
            "net7": "2e:32:d1:e2:e9:16",
            "net8": "5e:08:ad:16:48:42",
            "net9": "be:6a:35:85:dc:dd"
        },
        "spine_3_1_2": {
            "net0": "c2:ac:08:69:1d:c3",
            "net1": "4e:c1:21:4e:9d:08",
            "net10": "92:55:ef:b8:f6:66",
            "net11": "32:f1:f2:60:86:e8",
            "net12": "52:ca:76:5a:db:e6",
            "net13": "2a:c8:59:9a:fb:d4",
            "net14": "a2:e2:ca:f7:5e:a4",
            "net15": "6a:36:68:31:79:d2",
            "net2": "ce:5d:4d:d1:d7:db",
            "net3": "22:bf:f6:78:8b:aa",
            "net4": "66:ba:ac:4f:da:d5",
            "net5": "aa:35:cf:7e:24:30",
            "net6": "ae:5a:9b:9b:15:2b",
            "net7": "76:37:c1:01:da:96",
            "net8": "7a:63:6a:d5:12:60",
            "net9": "76:c9:02:49:03:13"
        },
        "spine_3_1_3": {
            "net0": "f2:08:b1:91:73:72",
            "net1": "3a:69:99:5e:f0:57",
            "net10": "c2:3a:b3:a8:a6:a8",
            "net11": "1e:53:55:05:96:53",
            "net12": "ba:56:3e:34:12:d3",
            "net13": "0a:77:11:d7:17:4c",
            "net14": "fa:b7:4f:a4:68:9a",
            "net15": "1e:86:43:b8:f5:3f",
            "net2": "3a:43:2c:79:96:26",
            "net3": "a2:ac:a5:a0:05:34",
            "net4": "66:12:7b:10:f5:d2",
            "net5": "ba:c3:69:9b:a3:13",
            "net6": "3a:e7:31:66:82:aa",
            "net7": "2a:10:52:e9:2d:fa",
            "net8": "6a:12:0b:36:a2:56",
            "net9": "36:2a:63:99:dc:f7"
        },
        "spine_3_1_4": {
            "net0": "7a:38:a5:92:e3:38",
            "net1": "46:36:bd:1c:ec:eb",
            "net10": "36:0c:84:79:88:9c",
            "net11": "e2:15:c9:04:54:62",
            "net12": "aa:4a:fa:48:a5:cd",
            "net13": "72:fc:ea:b5:95:1d",
            "net14": "fa:67:e6:88:4e:b5",
            "net15": "4a:5c:5e:f7:6c:04",
            "net2": "1a:b0:1c:4f:f1:c1",
            "net3": "46:f7:ab:f3:31:a4",
            "net4": "ee:b7:2a:d7:bb:ad",
            "net5": "1e:9a:90:1e:4f:19",
            "net6": "8a:df:ad:70:21:c8",
            "net7": "c2:10:29:10:11:ed",
            "net8": "de:af:9e:96:09:18",
            "net9": "46:a7:67:e1:01:95"
        },
        "spine_3_1_5": {
            "net0": "2e:f5:66:ae:f2:8e",
            "net1": "4a:e6:78:2d:02:dc",
            "net10": "62:48:c8:09:ab:c4",
            "net11": "46:c7:d5:02:80:13",
            "net12": "82:5c:ef:a7:bb:d8",
            "net13": "8a:0d:de:6e:3f:20",
            "net14": "5a:83:e2:51:c8:2b",
            "net15": "e6:43:dc:bd:5f:77",
            "net2": "4e:35:64:3d:04:e2",
            "net3": "22:7e:c8:d1:16:92",
            "net4": "32:00:07:8c:a1:30",
            "net5": "16:a7:8a:1c:71:88",
            "net6": "6e:75:e1:fb:fc:ed",
            "net7": "ea:df:99:e1:c3:05",
            "net8": "12:0e:aa:1d:02:5c",
            "net9": "56:14:0d:cd:70:71"
        },
        "spine_3_1_6": {
            "net0": "ea:36:fb:6d:58:64",
            "net1": "d2:f5:ab:42:7e:1c",
            "net10": "32:7d:33:cd:bf:d3",
            "net11": "da:86:df:58:ca:86",
            "net12": "32:7d:c9:a4:b8:d3",
            "net13": "22:38:2a:10:5a:12",
            "net14": "ea:be:fb:7e:f0:2d",
            "net15": "1a:aa:d7:bd:74:5d",
            "net2": "2a:95:00:c3:66:70",
            "net3": "ba:b2:1e:3c:1b:f9",
            "net4": "36:82:95:2c:7d:8b",
            "net5": "5e:e3:83:b0:d7:e8",
            "net6": "6a:0c:15:eb:1e:94",
            "net7": "be:ad:0f:aa:86:cc",
            "net8": "7a:ae:cf:95:20:13",
            "net9": "92:37:0f:8f:8b:91"
        },
        "spine_3_1_7": {
            "net0": "be:62:78:fb:ea:ad",
            "net1": "7a:6f:1d:ae:2d:f7",
            "net10": "ce:4a:58:c1:a3:8a",
            "net11": "8a:5b:c9:11:11:ee",
            "net12": "be:0d:06:fc:f7:3f",
            "net13": "92:ed:e5:ce:3c:d3",
            "net14": "9a:23:5f:32:90:2b",
            "net15": "02:76:63:e4:c1:9c",
            "net2": "da:86:10:2c:39:cd",
            "net3": "6a:5a:9d:39:b3:87",
            "net4": "e6:be:6c:91:ba:22",
            "net5": "b6:ff:12:0a:a5:c8",
            "net6": "1e:0e:b1:ac:c6:f0",
            "net7": "a2:8c:46:c5:2e:05",
            "net8": "72:38:3a:f7:5a:00",
            "net9": "ca:b4:89:9d:f7:ea"
        },
        "spine_3_1_8": {
            "net0": "d6:f4:30:21:1e:25",
            "net1": "1a:fa:bd:02:b6:27",
            "net10": "fe:9a:d8:c2:a4:2b",
            "net11": "7a:6d:77:06:45:ec",
            "net12": "16:d2:b5:d4:66:62",
            "net13": "22:19:94:53:8a:9f",
            "net14": "da:a4:1c:cc:78:d8",
            "net15": "fe:a4:24:30:88:50",
            "net2": "f6:27:3b:f0:5e:cb",
            "net3": "5a:a0:20:50:ee:c1",
            "net4": "f6:7e:52:ee:35:32",
            "net5": "72:45:1f:ed:2d:7f",
            "net6": "6e:71:dd:a2:7a:44",
            "net7": "82:7d:be:d5:6c:df",
            "net8": "c2:1d:f4:cf:1f:5d",
            "net9": "46:31:98:d9:2f:ae"
        },
        "spine_4_1_1": {
            "net0": "12:43:55:f3:24:26",
            "net1": "9a:b7:54:c1:15:53",
            "net10": "b2:7d:58:26:63:09",
            "net11": "ba:f6:7e:f7:c3:10",
            "net12": "de:39:c2:b1:a1:b1",
            "net13": "fe:47:50:4b:f5:a9",
            "net14": "fa:44:4f:62:f6:b5",
            "net15": "8e:0c:20:0b:77:85",
            "net2": "c2:65:a5:df:e9:82",
            "net3": "72:52:f9:1b:ee:80",
            "net4": "6a:bc:02:3f:28:90",
            "net5": "0a:d5:a2:b6:eb:a5",
            "net6": "7a:6e:ec:ae:09:3d",
            "net7": "1a:35:9a:d5:f1:46",
            "net8": "0a:0f:06:61:61:63",
            "net9": "2a:19:26:50:d9:59"
        },
        "spine_4_1_2": {
            "net0": "9a:4d:aa:29:b5:5e",
            "net1": "52:f4:8b:2f:50:40",
            "net10": "6a:10:20:0a:b9:92",
            "net11": "16:27:df:2f:a0:75",
            "net12": "fe:1c:2e:9f:c8:ea",
            "net13": "8e:57:06:b8:be:0b",
            "net14": "ae:34:1b:4b:56:d5",
            "net15": "b2:ae:22:bb:b4:ce",
            "net2": "9a:39:e1:bf:fd:9d",
            "net3": "66:53:87:45:1b:02",
            "net4": "86:e2:61:fc:66:fd",
            "net5": "3e:8e:8a:b4:ff:11",
            "net6": "1e:cd:c7:41:48:ce",
            "net7": "92:2d:b4:36:b8:d2",
            "net8": "f2:76:84:b1:30:07",
            "net9": "1a:3b:aa:8e:c1:17"
        },
        "spine_4_1_3": {
            "net0": "ae:63:d4:81:50:81",
            "net1": "32:9c:cc:c2:45:1e",
            "net10": "76:a6:5b:af:4f:d8",
            "net11": "a6:c7:be:f9:57:da",
            "net12": "fe:68:79:3b:98:8e",
            "net13": "66:3e:c4:05:3c:63",
            "net14": "ea:11:14:5d:a6:b0",
            "net15": "ba:d0:98:80:11:b7",
            "net2": "aa:74:6c:1e:0b:b8",
            "net3": "4e:05:93:38:31:ff",
            "net4": "3a:1f:56:76:00:95",
            "net5": "82:0d:58:ee:50:dd",
            "net6": "92:9e:0d:26:24:ce",
            "net7": "d6:13:db:13:5c:79",
            "net8": "36:e8:5f:3e:9f:74",
            "net9": "92:8b:af:85:4f:f0"
        },
        "spine_4_1_4": {
            "net0": "02:61:4f:7b:f4:79",
            "net1": "16:d2:b9:91:ff:36",
            "net10": "e2:c6:78:38:b6:41",
            "net11": "ee:0b:f2:fa:ae:66",
            "net12": "7a:f6:25:0a:02:04",
            "net13": "0e:b2:36:e6:56:c7",
            "net14": "36:0b:a6:92:e7:9c",
            "net15": "a2:6f:39:09:82:8a",
            "net2": "5a:6c:a8:39:95:2d",
            "net3": "d6:75:b6:e9:b9:e5",
            "net4": "2e:f3:1d:47:c9:75",
            "net5": "02:af:96:52:1f:ef",
            "net6": "7a:74:81:5c:83:c9",
            "net7": "6e:3e:38:cc:48:73",
            "net8": "4e:44:da:1d:bf:61",
            "net9": "4a:fc:22:97:2c:3e"
        },
        "spine_4_1_5": {
            "net0": "42:07:0a:1a:5c:d7",
            "net1": "1e:a2:4d:bf:54:91",
            "net10": "3a:e8:7a:26:04:b1",
            "net11": "c2:66:c2:af:2e:18",
            "net12": "c6:47:9c:26:b4:bc",
            "net13": "1e:56:62:51:ff:15",
            "net14": "c6:aa:f1:35:7a:04",
            "net15": "ee:02:fa:bb:1a:f0",
            "net2": "fa:4c:23:9b:73:c4",
            "net3": "72:ca:f9:b3:06:a6",
            "net4": "16:dc:b1:81:59:00",
            "net5": "4a:f3:28:ec:60:cb",
            "net6": "f6:27:59:75:f5:26",
            "net7": "c6:e2:f7:f1:9f:d8",
            "net8": "26:29:07:05:cc:a1",
            "net9": "6a:fe:58:93:d0:29"
        },
        "spine_4_1_6": {
            "net0": "d6:e6:de:ba:d2:70",
            "net1": "fe:55:17:f3:1e:37",
            "net10": "96:b7:cd:5f:c9:e6",
            "net11": "72:da:cf:d7:38:2a",
            "net12": "8e:8b:cf:c4:11:17",
            "net13": "46:52:83:90:29:17",
            "net14": "f6:30:54:83:88:d9",
            "net15": "72:54:e3:16:ac:ec",
            "net2": "aa:54:3d:c0:ff:66",
            "net3": "26:03:8f:f2:b3:33",
            "net4": "86:ce:38:86:c1:b2",
            "net5": "da:e7:f8:67:35:f7",
            "net6": "12:44:24:c1:71:fc",
            "net7": "26:e8:1f:db:46:89",
            "net8": "ee:0e:ac:76:01:22",
            "net9": "36:b1:c2:db:48:bf"
        },
        "spine_4_1_7": {
            "net0": "be:7e:10:ef:80:8a",
            "net1": "f2:ba:ad:9e:67:31",
            "net10": "32:04:39:ef:81:7a",
            "net11": "e2:4d:d4:b5:7d:c5",
            "net12": "6a:0d:f9:7e:3e:0f",
            "net13": "8e:71:5c:7b:8d:36",
            "net14": "6a:d2:18:12:d6:5e",
            "net15": "82:83:8e:4d:95:6c",
            "net2": "86:5c:11:3b:ff:fc",
            "net3": "5a:54:41:1c:22:b4",
            "net4": "d6:88:0c:1d:24:a9",
            "net5": "56:1a:23:e0:04:7a",
            "net6": "d2:65:e5:1f:a2:62",
            "net7": "ba:75:5b:83:27:96",
            "net8": "62:83:20:b6:fb:9f",
            "net9": "ae:66:e5:d9:30:a9"
        },
        "spine_4_1_8": {
            "net0": "a2:10:18:01:ca:60",
            "net1": "c6:e2:70:d6:f4:b9",
            "net10": "02:32:1f:f4:72:e8",
            "net11": "16:74:26:f9:24:38",
            "net12": "7e:83:28:3a:e6:d5",
            "net13": "42:d2:3e:d7:9b:e7",
            "net14": "a2:cf:55:4b:fb:0c",
            "net15": "f2:c0:f3:ea:61:91",
            "net2": "a2:eb:70:a8:fc:e4",
            "net3": "32:0e:7a:b1:18:f3",
            "net4": "92:48:cd:70:61:ee",
            "net5": "b2:38:dd:61:6c:4a",
            "net6": "46:73:f3:de:61:f9",
            "net7": "5e:5c:8d:c3:bb:12",
            "net8": "2e:21:6d:7f:2f:f6",
            "net9": "72:d9:c3:5a:48:e4"
        },
        "tof_1_2_1": {
            "net0": "82:66:ae:5c:c4:3e",
            "net1": "ce:e9:ca:d5:16:41",
            "net10": "a2:54:c5:67:d3:fe",
            "net11": "f2:ca:d1:0e:74:81",
            "net12": "4e:c9:e3:cd:19:80",
            "net13": "be:94:94:19:24:66",
            "net14": "d2:7c:05:1c:99:d5",
            "net15": "1e:c9:33:d2:0b:14",
            "net2": "ea:02:d9:91:79:ea",
            "net3": "62:14:66:85:b3:16",
            "net4": "0a:79:e6:7b:bb:6b",
            "net5": "f2:c1:a0:19:25:dd",
            "net6": "56:c4:fa:53:b7:09",
            "net7": "46:e9:fe:c1:a1:81",
            "net8": "92:f8:60:f0:21:1f",
            "net9": "7a:38:5a:c1:96:95"
        },
        "tof_1_2_2": {
            "net0": "02:19:b7:1f:47:58",
            "net1": "8a:1b:f6:c1:e6:c0",
            "net10": "da:2f:a4:30:83:61",
            "net11": "be:33:93:a0:72:ad",
            "net12": "46:42:6f:39:47:c2",
            "net13": "02:a0:68:bf:ff:dc",
            "net14": "42:f3:2b:90:8e:0f",
            "net15": "0a:2c:ea:20:bb:8c",
            "net2": "62:65:63:1c:a6:54",
            "net3": "6e:f8:a1:ec:6f:a8",
            "net4": "a2:d1:dd:ac:97:b5",
            "net5": "de:e6:7e:01:c4:6b",
            "net6": "fe:13:17:07:1e:6b",
            "net7": "da:bf:bc:fc:d7:0f",
            "net8": "ee:95:13:0c:26:f8",
            "net9": "ce:3c:df:19:47:d1"
        },
        "tof_1_2_3": {
            "net0": "f6:91:01:d4:8b:73",
            "net1": "f6:df:11:58:18:36",
            "net10": "e6:a8:9b:73:15:d8",
            "net11": "46:3f:e1:a9:77:45",
            "net12": "46:e8:35:fc:06:f4",
            "net13": "9e:40:d6:64:ef:e3",
            "net14": "d6:13:41:0e:72:90",
            "net15": "0e:6b:eb:62:09:c7",
            "net2": "ee:57:29:b3:42:ad",
            "net3": "5e:ab:f7:2c:f2:1d",
            "net4": "b6:06:33:04:0b:14",
            "net5": "ee:98:1c:dd:a9:e6",
            "net6": "fa:39:8c:dd:b7:52",
            "net7": "4a:08:81:d3:d3:f1",
            "net8": "1a:c5:7c:67:cd:45",
            "net9": "9e:1b:da:96:0f:e5"
        },
        "tof_1_2_4": {
            "net0": "76:96:d1:c4:31:3c",
            "net1": "02:99:f8:20:6d:28",
            "net10": "ce:19:17:7f:72:29",
            "net11": "9e:32:6c:96:7f:d3",
            "net12": "c6:c5:cd:1d:90:08",
            "net13": "72:24:39:2b:13:d9",
            "net14": "ee:c8:df:d3:25:42",
            "net15": "86:d5:ad:b6:66:9a",
            "net2": "76:be:c4:b2:a2:3b",
            "net3": "22:96:48:39:36:6e",
            "net4": "26:87:55:3b:70:e0",
            "net5": "fe:3d:fb:4f:6b:9d",
            "net6": "02:65:8d:4f:34:69",
            "net7": "52:65:e8:c5:b3:25",
            "net8": "86:7f:cc:65:17:58",
            "net9": "0e:a1:20:7e:ff:ba"
        },
        "tof_1_2_5": {
            "net0": "72:51:16:bb:b3:22",
            "net1": "7e:7f:65:b9:24:c1",
            "net10": "f2:60:c5:9b:db:56",
            "net11": "e6:3d:96:28:48:12",
            "net12": "ee:f4:9a:a8:b5:12",
            "net13": "ce:8f:1b:d7:88:36",
            "net14": "06:33:5f:17:4d:40",
            "net15": "a2:de:2c:b4:41:86",
            "net2": "52:46:72:47:9a:27",
            "net3": "92:e8:64:52:c2:54",
            "net4": "82:75:b1:c7:9e:f8",
            "net5": "6e:35:a7:8d:f8:7f",
            "net6": "e6:62:37:1f:32:82",
            "net7": "8a:83:23:96:6c:86",
            "net8": "da:bf:20:a7:81:28",
            "net9": "36:dd:66:56:9a:de"
        },
        "tof_1_2_6": {
            "net0": "86:fd:3e:7f:0c:5d",
            "net1": "b2:2b:4e:68:fe:d1",
            "net10": "52:c6:8a:73:e8:a0",
            "net11": "aa:ea:7f:70:61:3d",
            "net12": "22:dc:e9:f4:c2:78",
            "net13": "86:67:f7:2e:54:19",
            "net14": "fa:24:c2:16:97:38",
            "net15": "c6:74:a3:5c:e1:f4",
            "net2": "26:86:c8:f0:c1:fc",
            "net3": "da:c5:18:54:20:af",
            "net4": "86:85:36:d3:d6:9b",
            "net5": "66:b8:5f:df:0a:f2",
            "net6": "ea:94:b2:bc:27:45",
            "net7": "26:11:e9:72:ae:fd",
            "net8": "2e:ef:cd:fe:14:42",
            "net9": "96:74:6c:4e:58:e9"
        },
        "tof_1_2_7": {
            "net0": "52:95:1c:7e:6f:9d",
            "net1": "0a:ac:e6:8e:86:6f",
            "net10": "ae:5c:6e:81:28:08",
            "net11": "22:a7:0b:29:ef:23",
            "net12": "d2:49:1e:5d:38:92",
            "net13": "be:ee:c5:f1:db:b9",
            "net14": "0e:81:46:38:05:bf",
            "net15": "22:1a:69:eb:56:85",
            "net2": "16:48:0f:66:00:fd",
            "net3": "7e:70:4c:f1:d2:9b",
            "net4": "06:1c:78:97:90:be",
            "net5": "b6:f5:b4:ce:35:37",
            "net6": "ce:7e:60:e8:d2:73",
            "net7": "46:38:e1:32:f1:f2",
            "net8": "fa:28:29:ca:7c:83",
            "net9": "ba:64:d9:f9:f5:d2"
        },
        "tof_1_2_8": {
            "net0": "1a:f2:c1:8d:69:a9",
            "net1": "7e:78:7f:1d:97:35",
            "net10": "f2:50:bb:a7:c8:3f",
            "net11": "8e:f2:82:c6:c2:39",
            "net12": "7e:3e:b5:ed:51:85",
            "net13": "2a:12:ff:d2:84:da",
            "net14": "ae:c7:9e:eb:d4:7d",
            "net15": "c6:c6:ed:b1:51:64",
            "net2": "4a:97:e8:95:e0:c4",
            "net3": "f2:c5:c0:b8:e1:b0",
            "net4": "ca:e0:3c:0b:25:d7",
            "net5": "ae:ec:22:b5:79:45",
            "net6": "32:b0:a1:78:c7:75",
            "net7": "ee:38:b5:f1:9a:0b",
            "net8": "4a:ad:4f:ad:63:93",
            "net9": "92:d1:e4:1d:a1:38"
        },
        "tof_2_2_1": {
            "net0": "2e:58:57:40:67:63",
            "net1": "86:0b:a0:9c:a3:fd",
            "net10": "ee:8c:39:5f:15:c8",
            "net11": "e6:a1:b3:2c:91:9f",
            "net12": "62:01:35:22:49:81",
            "net13": "e2:d7:4d:ed:9d:a9",
            "net14": "16:29:42:28:e4:2e",
            "net15": "e2:cd:21:a2:3d:b9",
            "net2": "e2:0a:0a:9c:de:b9",
            "net3": "9a:10:e4:87:80:d2",
            "net4": "2e:28:20:8d:35:12",
            "net5": "8a:ec:2f:1b:87:a2",
            "net6": "c6:84:82:aa:0f:0e",
            "net7": "ba:e0:c0:a0:cf:58",
            "net8": "e6:73:05:87:bc:70",
            "net9": "ae:f9:57:38:42:88"
        },
        "tof_2_2_2": {
            "net0": "9e:3f:9d:f2:76:3e",
            "net1": "ee:ba:66:4c:97:03",
            "net10": "16:21:d4:1a:7e:9c",
            "net11": "0e:53:5e:a4:2d:0f",
            "net12": "fa:24:1e:57:03:12",
            "net13": "0a:90:43:8a:cd:0a",
            "net14": "ee:24:de:2d:59:c2",
            "net15": "f2:e9:da:8d:d2:cb",
            "net2": "4e:05:dc:26:c8:d4",
            "net3": "1e:fa:3f:1b:41:fb",
            "net4": "c2:ac:35:c6:1c:a7",
            "net5": "2e:8b:a0:56:43:7e",
            "net6": "2a:92:f9:e0:11:2f",
            "net7": "c6:7d:f0:c2:bd:3f",
            "net8": "7a:b6:d5:59:9a:dc",
            "net9": "ae:fa:31:b3:ff:95"
        },
        "tof_2_2_3": {
            "net0": "72:f0:6c:91:a8:34",
            "net1": "f2:74:8f:19:92:1c",
            "net10": "a2:00:68:11:17:b1",
            "net11": "6e:9f:91:eb:f1:5c",
            "net12": "42:0c:dd:6d:3a:3b",
            "net13": "ca:26:f9:bc:72:f5",
            "net14": "c6:41:83:c3:be:41",
            "net15": "92:21:c1:c0:81:af",
            "net2": "3e:a5:75:92:2d:f4",
            "net3": "ba:f2:7a:bd:d6:d8",
            "net4": "ba:94:ff:7b:6a:ec",
            "net5": "c6:fc:8b:e1:65:f2",
            "net6": "72:ca:f1:89:97:3b",
            "net7": "62:38:ca:73:38:79",
            "net8": "66:76:b9:38:63:c5",
            "net9": "be:1e:fc:aa:19:e9"
        },
        "tof_2_2_4": {
            "net0": "12:a8:88:78:b1:6a",
            "net1": "da:ae:f4:de:67:87",
            "net10": "9e:69:cb:d7:9e:c4",
            "net11": "8a:18:07:44:be:cc",
            "net12": "fe:b3:2d:13:a6:f5",
            "net13": "da:d3:79:b6:ff:c7",
            "net14": "56:e3:d4:79:c6:92",
            "net15": "0a:c6:dc:79:d3:73",
            "net2": "be:21:f4:70:7b:e6",
            "net3": "96:8d:8b:d0:2f:93",
            "net4": "86:66:2b:e0:f4:05",
            "net5": "62:42:29:49:e5:87",
            "net6": "02:f5:bc:ab:43:43",
            "net7": "46:8b:4d:f0:76:0a",
            "net8": "3a:d7:45:ea:02:38",
            "net9": "2a:f2:16:6e:f1:cc"
        },
        "tof_2_2_5": {
            "net0": "5a:4d:85:70:29:ce",
            "net1": "7a:ad:4c:5e:93:78",
            "net10": "f2:d9:a1:25:87:58",
            "net11": "9e:c2:62:4f:2a:23",
            "net12": "4e:9c:a8:ad:ba:e7",
            "net13": "1e:f0:d9:3a:fe:49",
            "net14": "72:10:59:4a:d1:d4",
            "net15": "42:a6:e6:41:94:f4",
            "net2": "aa:34:87:48:ae:4e",
            "net3": "06:14:73:d7:d7:2e",
            "net4": "3e:b9:39:6b:2d:9a",
            "net5": "ee:fd:7b:6d:25:d5",
            "net6": "b2:b3:95:16:13:da",
            "net7": "66:b6:75:6b:04:2e",
            "net8": "52:b5:6d:e4:ad:aa",
            "net9": "e6:c9:bc:69:33:79"
        },
        "tof_2_2_6": {
            "net0": "c2:a5:6c:15:7c:6a",
            "net1": "fe:51:c5:2a:bd:12",
            "net10": "b6:f7:96:e4:d5:87",
            "net11": "66:ce:db:f1:aa:ea",
            "net12": "76:fe:65:82:66:e0",
            "net13": "06:f0:8c:77:f7:a0",
            "net14": "32:45:b1:dc:5f:3b",
            "net15": "ae:00:f6:2f:61:01",
            "net2": "8a:90:f5:7b:84:cb",
            "net3": "ba:b5:63:4f:c8:8e",
            "net4": "b2:03:02:aa:04:c2",
            "net5": "76:96:b6:35:7d:e4",
            "net6": "6a:ce:7d:57:b1:c3",
            "net7": "86:37:c3:24:00:90",
            "net8": "22:78:e4:ae:07:1f",
            "net9": "8e:7f:f5:49:25:b1"
        },
        "tof_2_2_7": {
            "net0": "fa:1c:ee:f8:e1:59",
            "net1": "4a:31:7c:b9:fa:7f",
            "net10": "8a:7b:92:34:54:2f",
            "net11": "92:85:6f:2f:1a:f9",
            "net12": "aa:9c:ac:aa:0e:ae",
            "net13": "3a:c0:f7:c6:8e:66",
            "net14": "72:71:d3:0d:ef:18",
            "net15": "7e:6f:96:b6:4a:6b",
            "net2": "02:cc:2d:0c:4f:9b",
            "net3": "06:37:0f:cd:4b:5b",
            "net4": "36:c4:4e:cb:87:47",
            "net5": "4a:3e:6d:db:05:be",
            "net6": "9a:e3:60:af:8e:bd",
            "net7": "0a:2d:f9:cb:44:93",
            "net8": "96:a0:80:df:e0:76",
            "net9": "ea:e3:e7:20:9e:ae"
        },
        "tof_2_2_8": {
            "net0": "ce:3f:93:25:37:8f",
            "net1": "f2:50:b7:d5:bf:ae",
            "net10": "32:2d:47:3e:17:8a",
            "net11": "ba:44:d0:48:32:a5",
            "net12": "a6:71:9c:c7:eb:f2",
            "net13": "9a:ad:74:5d:3d:db",
            "net14": "e2:00:ce:f1:63:00",
            "net15": "d6:cb:9b:29:1d:64",
            "net2": "fa:45:a1:70:f0:94",
            "net3": "26:f7:fd:fc:ac:c4",
            "net4": "c6:41:d0:f7:ea:7a",
            "net5": "ea:5f:06:56:c7:3a",
            "net6": "de:73:7c:11:a7:8f",
            "net7": "c6:02:9e:7c:8e:9e",
            "net8": "5e:93:bb:0c:55:45",
            "net9": "be:c2:d4:5f:b9:2a"
        }
    },
    "failed_machine": "leaf_1_0_1",
    "failure_time": {
        "leaf_1_0_1": 1621946687.1891496,
        "leaf_1_0_2": 1621946687.1959617,
        "leaf_1_0_3": 1621946687.2187579,
        "leaf_1_0_4": 1621946687.2388399,
        "leaf_1_0_5": 1621946687.25768,
        "leaf_1_0_6": 1621946687.189663,
        "leaf_1_0_7": 1621946687.2042305,
        "leaf_1_0_8": 1621946687.2282176,
        "leaf_2_0_1": 1621946687.253016,
        "leaf_2_0_2": 1621946687.2647414,
        "leaf_2_0_3": 1621946687.190006,
        "leaf_2_0_4": 1621946687.2040749,
        "leaf_2_0_5": 1621946687.2243857,
        "leaf_2_0_6": 1621946687.2531188,
        "leaf_2_0_7": 1621946687.2632322,
        "leaf_2_0_8": 1621946687.191794,
        "leaf_3_0_1": 1621946687.213554,
        "leaf_3_0_2": 1621946687.2402864,
        "leaf_3_0_3": 1621946687.2576876,
        "leaf_3_0_4": 1621946687.2698355,
        "leaf_3_0_5": 1621946687.2721493,
        "leaf_3_0_6": 1621946687.2879887,
        "leaf_3_0_7": 1621946687.2961192,
        "leaf_3_0_8": 1621946687.307222,
        "leaf_4_0_1": 1621946681.6589282,
        "leaf_4_0_2": 1621946687.2742078,
        "leaf_4_0_3": 1621946687.2906964,
        "leaf_4_0_4": 1621946687.30724,
        "leaf_4_0_5": 1621946687.3152053,
        "leaf_4_0_6": 1621946687.3348856,
        "leaf_4_0_7": 1621946687.2746177,
        "leaf_4_0_8": 1621946687.2888544,
        "spine_1_1_1": 1621946687.300028,
        "spine_1_1_2": 1621946687.3165305,
        "spine_1_1_3": 1621946681.6684222,
        "spine_1_1_4": 1621946681.627852,
        "spine_1_1_5": 1621946681.6399305,
        "spine_1_1_6": 1621946687.3120127,
        "spine_1_1_7": 1621946687.326771,
        "spine_1_1_8": 1621946687.3456254,
        "spine_2_1_1": 1621946687.3291698,
        "spine_2_1_2": 1621946687.3601801,
        "spine_2_1_3": 1621946687.370065,
        "spine_2_1_4": 1621946681.7197175,
        "spine_2_1_5": 1621946687.3887477,
        "spine_2_1_6": 1621946687.3540208,
        "spine_2_1_7": 1621946687.3670607,
        "spine_2_1_8": 1621946687.3787627,
        "spine_3_1_1": 1621946687.390198,
        "spine_3_1_2": 1621946681.7437508,
        "spine_3_1_3": 1621946687.3600025,
        "spine_3_1_4": 1621946681.7142694,
        "spine_3_1_5": 1621946687.3827257,
        "spine_3_1_6": 1621946681.7324967,
        "spine_3_1_7": 1621946687.4045875,
        "spine_3_1_8": 1621946687.364733,
        "spine_4_1_1": 1621946687.375139,
        "spine_4_1_2": 1621946681.7290797,
        "spine_4_1_3": 1621946687.4027624,
        "spine_4_1_4": 1621946687.417572,
        "spine_4_1_5": 1621946687.3991933,
        "spine_4_1_6": 1621946687.410798,
        "spine_4_1_7": 1621946687.424261,
        "spine_4_1_8": 1621946687.4410937,
        "tof_1_2_1": 1621946681.8004384,
        "tof_1_2_2": 1621946687.4184945,
        "tof_1_2_3": 1621946687.4373047,
        "tof_1_2_4": 1621946687.4609447,
        "tof_1_2_5": 1621946687.4724898,
        "tof_1_2_6": 1621946687.4781888,
        "tof_1_2_7": 1621946687.4215016,
        "tof_1_2_8": 1621946687.438262,
        "tof_2_2_1": 1621946687.45901,
        "tof_2_2_2": 1621946687.4706204,
        "tof_2_2_3": 1621946687.4726,
        "tof_2_2_4": 1621946687.434827,
        "tof_2_2_5": 1621946687.4557745,
        "tof_2_2_6": 1621946687.4632597,
        "tof_2_2_7": 1621946687.4718938,
        "tof_2_2_8": 1621946687.4770052
    }
}