{
    "k_leaf": 2,
    "k_top": 2,
    "redundancy_factor": 2,
    "is_k8s": false,
    "machine_mac_addresses": {
        "leaf_1_0_1": {
            "eth0": "fe:05:06:79:8e:cd",
            "eth1": "72:ac:b4:ae:e2:ac",
            "eth2": "3a:12:98:06:2b:81"
        },
        "leaf_1_0_2": {
            "eth0": "96:d3:00:1b:9e:e4",
            "eth1": "de:d7:cf:ba:3d:82",
            "eth2": "fa:b0:53:36:06:c9"
        },
        "leaf_2_0_1": {
            "eth0": "2a:d3:9e:08:e4:47",
            "eth1": "92:83:54:95:01:b8",
            "eth2": "5a:49:f5:6b:42:22"
        },
        "leaf_2_0_2": {
            "eth0": "8a:16:3b:ab:35:e9",
            "eth1": "d2:06:b0:00:a4:e0",
            "eth2": "26:03:9d:38:33:e7"
        },
        "spine_1_1_1": {
            "eth0": "86:6d:71:4d:a1:fd",
            "eth1": "02:60:33:ea:93:fb",
            "eth2": "d2:e6:33:9b:63:70",
            "eth3": "56:fc:c1:bc:cf:1b"
        },
        "spine_1_1_2": {
            "eth0": "da:1b:70:5c:5e:ac",
            "eth1": "2a:5a:60:c2:72:88",
            "eth2": "7e:30:83:5f:b2:a0",
            "eth3": "ca:f0:d2:3f:ed:e9"
        },
        "spine_2_1_1": {
            "eth0": "02:1b:c7:8c:fd:50",
            "eth1": "1a:2e:da:4b:3d:c8",
            "eth2": "3e:a2:09:83:4f:9a",
            "eth3": "ca:7c:ef:be:b5:29"
        },
        "spine_2_1_2": {
            "eth0": "ba:30:e4:90:88:9b",
            "eth1": "36:1f:b6:7b:0c:68",
            "eth2": "3a:fc:a9:0a:e9:b3",
            "eth3": "1e:01:2d:6c:90:be"
        },
        "tof_1_2_1": {
            "eth0": "2a:84:02:fd:fd:05",
            "eth1": "b6:a5:85:58:8e:e0",
            "eth2": "82:c1:84:ea:0c:48",
            "eth3": "96:84:21:23:8e:e1"
        },
        "tof_1_2_2": {
            "eth0": "8a:74:9b:58:bf:bd",
            "eth1": "2a:79:b3:8b:32:e3",
            "eth2": "d6:a5:3b:c8:33:01",
            "eth3": "a6:7c:0f:1e:6d:71"
        }
    },
    "failed_machine": "leaf_1_0_1",
    "failure_time": {
        "leaf_1_0_1": 1622024391.1145332,
        "leaf_1_0_2": 1622024391.1156545,
        "leaf_2_0_1": 1622024391.1180515,
        "leaf_2_0_2": 1622024391.1239622,
        "spine_1_1_1": 1622024391.1239257,
        "spine_1_1_2": 1622024391.131463,
        "spine_2_1_1": 1622024391.1310723,
        "spine_2_1_2": 1622024391.131866,
        "tof_1_2_1": 1622024391.1386945,
        "tof_1_2_2": 1622024391.1388576
    }
}