{
    "description": "Scenario 4c: ToF tof_1_2_1 failure and recovery with BGP",
    "k_leaf": 8,
    "k_top": 8,
    "redundancy_factor": 4,
    "is_k8s": true,
    "machine_mac_addresses": {
        "leaf_1_0_1": {
            "net0": "6a:0c:73:a0:a6:cc",
            "net1": "0e:05:79:4b:e8:3c",
            "net2": "66:22:85:c3:b4:41",
            "net3": "a2:ee:ea:9c:2b:78",
            "net4": "a6:fe:f0:28:39:ae",
            "net5": "b6:41:54:c1:08:15",
            "net6": "86:24:30:1a:11:87",
            "net7": "92:3c:05:cf:0e:9d",
            "net8": "7a:14:5c:a5:30:a4"
        },
        "leaf_1_0_2": {
            "net0": "8e:1e:1e:ca:1c:9f",
            "net1": "86:05:6b:46:0b:2e",
            "net2": "56:46:08:d1:9d:f7",
            "net3": "92:8c:22:bc:44:0b",
            "net4": "36:80:72:3c:a2:17",
            "net5": "ee:e8:56:4a:46:3f",
            "net6": "32:f3:16:d3:44:40",
            "net7": "3a:5c:8d:f7:97:3f",
            "net8": "d6:ef:21:49:76:d9"
        },
        "leaf_1_0_3": {
            "net0": "ea:34:23:b5:d6:d7",
            "net1": "3e:2c:76:d6:9f:9b",
            "net2": "32:08:92:7c:19:15",
            "net3": "56:72:f9:c0:3f:9d",
            "net4": "1e:65:7f:03:1f:2d",
            "net5": "a6:5a:1d:1b:28:d0",
            "net6": "de:d9:d9:9d:f1:6d",
            "net7": "72:b0:a6:88:09:e7",
            "net8": "66:6f:02:22:4a:3f"
        },
        "leaf_1_0_4": {
            "net0": "7e:21:fa:f4:14:96",
            "net1": "ee:92:2c:19:25:f2",
            "net2": "92:48:7f:3a:3f:51",
            "net3": "4e:bd:78:fc:e8:1d",
            "net4": "62:c8:44:e7:32:f3",
            "net5": "b6:f3:61:59:45:45",
            "net6": "52:88:3f:29:66:2a",
            "net7": "2a:f3:3a:ff:03:77",
            "net8": "06:e5:db:3f:b6:a0"
        },
        "leaf_1_0_5": {
            "net0": "86:a3:f1:37:5c:24",
            "net1": "0e:60:8c:31:51:6d",
            "net2": "76:48:d5:c5:05:46",
            "net3": "e6:07:b5:92:7b:bb",
            "net4": "c6:57:75:94:d9:e3",
            "net5": "e6:06:63:c3:67:d8",
            "net6": "aa:bc:9e:50:8b:d6",
            "net7": "92:f2:72:7e:17:a5",
            "net8": "b2:db:56:a3:37:8b"
        },
        "leaf_1_0_6": {
            "net0": "72:6d:08:ba:b9:12",
            "net1": "ce:5c:44:27:f0:f3",
            "net2": "06:2a:7f:39:9b:de",
            "net3": "46:f6:05:50:5a:dd",
            "net4": "32:b8:ce:42:7d:64",
            "net5": "c6:97:cf:bf:b9:7a",
            "net6": "ee:ea:b6:8d:dd:fd",
            "net7": "ae:0e:af:8e:a1:a5",
            "net8": "7e:a6:33:7c:34:13"
        },
        "leaf_1_0_7": {
            "net0": "ee:d6:cb:35:94:76",
            "net1": "4a:6c:3c:9a:c6:93",
            "net2": "22:57:7a:2f:e1:6f",
            "net3": "ae:15:e5:78:82:b1",
            "net4": "8a:fa:b7:c3:de:70",
            "net5": "7e:54:52:26:0b:90",
            "net6": "8a:39:b0:e1:65:fb",
            "net7": "ce:17:5e:a5:3c:8c",
            "net8": "b2:39:07:0d:35:8e"
        },
        "leaf_1_0_8": {
            "net0": "da:8b:ad:a6:61:9d",
            "net1": "9e:5e:9c:40:f7:9b",
            "net2": "4e:a9:36:3c:54:c2",
            "net3": "ca:cb:a4:87:8d:45",
            "net4": "92:f0:c6:76:15:ab",
            "net5": "fa:17:b2:b5:a0:38",
            "net6": "52:b8:63:ac:62:33",
            "net7": "c2:cb:57:af:83:83",
            "net8": "be:12:38:62:f4:78"
        },
        "leaf_2_0_1": {
            "net0": "ca:85:2e:39:b5:1e",
            "net1": "f6:56:7c:50:97:13",
            "net2": "9e:65:70:09:8d:1d",
            "net3": "7a:9a:91:18:78:64",
            "net4": "2a:e2:2f:eb:61:ab",
            "net5": "ce:d1:33:93:88:96",
            "net6": "c6:85:1f:57:0a:7b",
            "net7": "be:56:5d:12:ab:87",
            "net8": "9e:94:72:27:c6:d7"
        },
        "leaf_2_0_2": {
            "net0": "92:49:4c:3d:9c:d6",
            "net1": "aa:62:e7:1a:d6:ce",
            "net2": "16:33:3c:95:27:0a",
            "net3": "f6:3a:7a:64:8a:59",
            "net4": "1e:93:f5:ff:2b:28",
            "net5": "d6:27:91:42:f3:aa",
            "net6": "d2:64:16:1f:1e:58",
            "net7": "4a:f9:53:25:22:ce",
            "net8": "62:f3:b3:00:f1:f6"
        },
        "leaf_2_0_3": {
            "net0": "06:da:a3:2e:24:d3",
            "net1": "fe:79:99:c7:24:fd",
            "net2": "5e:dd:55:a6:67:30",
            "net3": "46:34:38:64:57:3a",
            "net4": "6a:bf:41:10:cf:d7",
            "net5": "de:00:f7:ae:aa:eb",
            "net6": "46:b1:71:bc:ef:4e",
            "net7": "9e:74:6a:18:ea:f4",
            "net8": "0e:2a:e3:bb:88:2b"
        },
        "leaf_2_0_4": {
            "net0": "ca:07:92:ac:ab:4d",
            "net1": "ae:6e:82:3c:45:c9",
            "net2": "76:01:58:a8:f1:49",
            "net3": "22:12:b5:67:54:32",
            "net4": "6e:6d:c5:51:90:67",
            "net5": "7e:67:3a:21:28:e5",
            "net6": "fa:56:27:51:8c:a0",
            "net7": "d2:68:81:be:42:52",
            "net8": "7a:bd:fd:52:5a:a3"
        },
        "leaf_2_0_5": {
            "net0": "da:04:92:0c:29:3f",
            "net1": "de:ee:9d:d6:54:d9",
            "net2": "7a:6a:67:aa:ab:78",
            "net3": "f2:a9:9a:3b:64:c3",
            "net4": "3a:cd:57:25:c1:03",
            "net5": "16:2d:75:84:3d:27",
            "net6": "ce:61:f0:77:9f:78",
            "net7": "32:14:4e:e8:8e:5c",
            "net8": "2e:ef:80:7e:76:c4"
        },
        "leaf_2_0_6": {
            "net0": "0e:a1:92:f1:52:d3",
            "net1": "7a:79:9c:f4:7a:02",
            "net2": "b6:bd:7f:48:60:44",
            "net3": "a6:17:ae:bf:66:c2",
            "net4": "9e:a8:24:43:8a:2f",
            "net5": "fe:b5:62:5e:4a:76",
            "net6": "b2:82:29:e4:cd:09",
            "net7": "9a:85:a7:e5:67:95",
            "net8": "72:3c:d4:f1:ca:df"
        },
        "leaf_2_0_7": {
            "net0": "36:66:68:c1:28:e0",
            "net1": "fe:8c:bf:1f:ce:cd",
            "net2": "22:c4:71:4c:fc:c4",
            "net3": "fe:62:d2:a8:2e:dd",
            "net4": "6e:4a:58:4d:e8:35",
            "net5": "36:ec:31:25:fa:82",
            "net6": "9a:4e:f9:3a:f6:45",
            "net7": "7a:7c:5c:c9:8f:d6",
            "net8": "86:10:b4:37:02:b9"
        },
        "leaf_2_0_8": {
            "net0": "de:a1:69:ea:cc:da",
            "net1": "56:d8:18:60:20:25",
            "net2": "c6:e7:8a:bf:f6:57",
            "net3": "9a:95:bd:57:63:eb",
            "net4": "aa:f4:43:0e:c6:db",
            "net5": "62:80:93:5f:40:98",
            "net6": "92:2a:b4:e7:b6:29",
            "net7": "12:a5:3a:20:ba:7b",
            "net8": "46:d3:e4:99:72:91"
        },
        "leaf_3_0_1": {
            "net0": "72:ec:b2:73:d3:20",
            "net1": "ea:a2:28:4d:72:1e",
            "net2": "06:1c:1f:95:7a:7b",
            "net3": "0e:33:f1:fc:50:6b",
            "net4": "6e:af:ce:5a:9c:d9",
            "net5": "ba:3f:94:bb:8c:59",
            "net6": "c6:cb:1c:3c:4b:be",
            "net7": "6a:e9:a3:fc:3d:e4",
            "net8": "a6:c8:6d:64:aa:7d"
        },
        "leaf_3_0_2": {
            "net0": "fa:97:b9:b3:02:a2",
            "net1": "12:8e:3b:35:d7:b5",
            "net2": "9a:fa:d5:48:37:10",
            "net3": "82:90:d6:14:61:d4",
            "net4": "fa:9f:0f:a2:22:bf",
            "net5": "02:d4:0c:7e:cd:c5",
            "net6": "16:72:51:27:c1:27",
            "net7": "5e:55:e3:ff:62:b7",
            "net8": "7a:20:b1:8f:8a:68"
        },
        "leaf_3_0_3": {
            "net0": "8e:84:87:e7:4e:09",
            "net1": "1e:6c:b5:ad:68:7c",
            "net2": "0e:a2:83:f7:7e:ae",
            "net3": "ba:90:81:f6:bc:c7",
            "net4": "9a:8c:4e:d3:cc:e2",
            "net5": "b2:5e:1a:0b:6e:29",
            "net6": "2a:6b:e4:33:a3:8a",
            "net7": "9e:fe:a6:4f:44:78",
            "net8": "2e:5c:6a:ba:9e:3e"
        },
        "leaf_3_0_4": {
            "net0": "b6:b8:dc:11:6f:91",
            "net1": "4e:8c:82:f7:4c:7a",
            "net2": "4a:4f:56:c7:cc:fc",
            "net3": "52:f4:a4:1f:26:e2",
            "net4": "2a:c0:81:e0:0c:7a",
            "net5": "aa:84:42:ed:32:9e",
            "net6": "9e:24:06:42:49:ea",
            "net7": "e2:db:b2:fb:0c:a8",
            "net8": "3e:89:5c:d3:65:be"
        },
        "leaf_3_0_5": {
            "net0": "ea:0f:1a:59:06:8e",
            "net1": "26:cb:24:58:b9:9a",
            "net2": "72:5e:da:40:7f:6c",
            "net3": "1e:d2:75:2f:b7:81",
            "net4": "46:1e:5a:90:57:ff",
            "net5": "32:c8:59:ef:6d:0a",
            "net6": "a6:cc:6e:ea:5c:e6",
            "net7": "4a:85:f1:88:90:c3",
            "net8": "e6:cb:6e:02:2a:ba"
        },
        "leaf_3_0_6": {
            "net0": "fa:1e:38:40:65:d3",
            "net1": "46:50:ba:b4:0c:87",
            "net2": "2e:87:51:fb:8e:0e",
            "net3": "5e:b5:0b:ae:89:96",
            "net4": "46:f9:ce:c2:95:df",
            "net5": "76:fa:ce:bc:00:72",
            "net6": "8a:21:c7:57:84:a5",
            "net7": "2e:67:1c:e7:3a:71",
            "net8": "aa:ec:66:9a:31:ad"
        },
        "leaf_3_0_7": {
            "net0": "e6:80:18:eb:46:d3",
            "net1": "12:76:af:0e:0e:21",
            "net2": "5e:ee:25:a6:17:97",
            "net3": "f6:b5:b4:b7:77:37",
            "net4": "0a:28:44:f4:9b:e2",
            "net5": "ea:44:b8:73:e7:4e",
            "net6": "8e:95:d9:32:be:a3",
            "net7": "9a:5b:ad:96:8d:35",
            "net8": "ce:ff:19:f8:cb:b5"
        },
        "leaf_3_0_8": {
            "net0": "76:64:01:f9:6d:5e",
            "net1": "a2:52:a0:63:d0:e7",
            "net2": "0a:5b:46:14:11:6a",
            "net3": "26:54:22:37:0c:cb",
            "net4": "2a:d0:d3:6a:2c:53",
            "net5": "ee:03:97:39:b1:f1",
            "net6": "52:34:e9:a9:dc:db",
            "net7": "d2:ed:ba:e3:26:c5",
            "net8": "26:d9:08:b9:41:c3"
        },
        "leaf_4_0_1": {
            "net0": "b6:c0:2b:34:5f:ff",
            "net1": "32:13:57:d5:a7:1f",
            "net2": "e6:d4:b5:cc:19:c9",
            "net3": "fe:3c:a0:2c:02:66",
            "net4": "5e:b8:9f:80:a2:5c",
            "net5": "f2:57:71:95:f3:01",
            "net6": "5e:a2:c8:8f:8d:8b",
            "net7": "fe:42:c3:35:f2:8b",
            "net8": "72:13:5c:80:82:86"
        },
        "leaf_4_0_2": {
            "net0": "a2:d3:81:0b:d4:b0",
            "net1": "1e:90:8b:8d:02:7a",
            "net2": "92:c2:3e:35:13:1b",
            "net3": "b2:2e:42:77:3f:41",
            "net4": "e6:b1:26:a2:e2:90",
            "net5": "4a:67:da:76:c6:14",
            "net6": "4e:f3:8b:4c:c2:30",
            "net7": "e6:5a:0d:06:5f:4e",
            "net8": "02:aa:74:db:97:2d"
        },
        "leaf_4_0_3": {
            "net0": "6a:0c:ae:19:f0:32",
            "net1": "e6:01:ba:0a:da:0b",
            "net2": "ba:a8:f8:5b:ed:66",
            "net3": "3a:ff:b3:e1:74:0c",
            "net4": "ae:19:a8:e0:1d:96",
            "net5": "f6:2a:bc:cd:af:a3",
            "net6": "de:55:cd:1f:6e:cd",
            "net7": "4a:7e:da:3f:d6:3e",
            "net8": "f6:e1:15:96:53:b4"
        },
        "leaf_4_0_4": {
            "net0": "66:ad:35:cb:18:cb",
            "net1": "86:13:89:2c:f2:1c",
            "net2": "fa:83:07:58:db:0b",
            "net3": "5a:df:99:e9:cb:be",
            "net4": "0e:06:70:a4:a9:3e",
            "net5": "62:a9:bd:9d:bf:98",
            "net6": "c6:14:1d:2a:65:47",
            "net7": "42:ce:e5:d2:6f:f3",
            "net8": "12:2d:8e:d6:69:e6"
        },
        "leaf_4_0_5": {
            "net0": "7a:71:4d:54:4b:c3",
            "net1": "2e:d2:a5:f1:59:a6",
            "net2": "46:03:64:ed:43:d0",
            "net3": "52:0e:fd:c8:c7:e1",
            "net4": "1a:21:f5:e5:ab:d4",
            "net5": "56:4e:30:4d:01:09",
            "net6": "6e:66:a2:5d:cf:dd",
            "net7": "5a:4a:ac:69:08:71",
            "net8": "a2:1b:85:27:0a:79"
        },
        "leaf_4_0_6": {
            "net0": "56:ff:61:ab:37:bf",
            "net1": "6a:8a:86:32:86:f8",
            "net2": "d2:a7:ed:54:45:08",
            "net3": "f2:f0:84:8f:df:b3",
            "net4": "1a:a1:80:72:c7:6e",
            "net5": "1a:98:e7:8e:e1:e8",
            "net6": "ba:d5:cf:c6:62:dd",
            "net7": "26:56:79:98:ae:ee",
            "net8": "de:d6:72:8f:21:8e"
        },
        "leaf_4_0_7": {
            "net0": "92:a9:76:96:6b:75",
            "net1": "6a:2c:47:26:f4:7d",
            "net2": "c2:6e:77:e4:f8:48",
            "net3": "9e:30:76:17:d6:f6",
            "net4": "ee:16:e3:1c:55:f7",
            "net5": "32:d6:61:d8:c1:90",
            "net6": "c6:58:98:a4:e5:46",
            "net7": "e2:2a:36:64:61:fc",
            "net8": "fa:8c:5e:34:84:93"
        },
        "leaf_4_0_8": {
            "net0": "be:e2:a2:f0:f8:15",
            "net1": "3a:fb:44:2b:af:26",
            "net2": "b6:3e:e9:21:9e:26",
            "net3": "62:55:d6:04:66:f2",
            "net4": "82:88:f0:73:5b:46",
            "net5": "ee:03:e4:9c:cc:62",
            "net6": "0a:d4:81:28:49:4f",
            "net7": "56:d2:22:fc:41:77",
            "net8": "8a:b0:f4:68:53:83"
        },
        "spine_1_1_1": {
            "net0": "fe:2a:05:fb:cd:74",
            "net1": "aa:fa:47:13:b2:39",
            "net10": "52:a8:9a:f5:e3:96",
            "net11": "c6:b3:03:19:b3:54",
            "net12": "ee:17:16:35:ca:c7",
            "net13": "f6:a5:44:a7:76:40",
            "net14": "22:cb:68:5a:76:5a",
            "net15": "2e:a1:cb:7f:ed:13",
            "net2": "c6:dd:c5:ed:50:9f",
            "net3": "ca:a0:ad:91:28:28",
            "net4": "ae:68:dc:1f:5d:2d",
            "net5": "a2:84:66:2c:bb:1f",
            "net6": "da:d9:61:67:5a:f6",
            "net7": "06:d9:5e:29:46:7c",
            "net8": "5a:2e:71:d0:4a:2f",
            "net9": "e2:6d:da:e1:65:ba"
        },
        "spine_1_1_2": {
            "net0": "ba:1a:a3:a7:fe:d7",
            "net1": "96:1e:77:67:cf:ec",
            "net10": "12:68:15:2f:58:22",
            "net11": "de:de:f9:0b:c6:e8",
            "net12": "1a:65:b2:bb:26:da",
            "net13": "96:c3:ae:5f:3a:8b",
            "net14": "c2:93:c2:f7:5e:ad",
            "net15": "56:32:a7:3b:87:d7",
            "net2": "d6:0a:75:c0:5c:0b",
            "net3": "c6:71:9d:ce:7d:7d",
            "net4": "b6:fd:36:b7:23:e0",
            "net5": "aa:86:ee:4f:7b:ff",
            "net6": "52:db:8a:9b:cd:52",
            "net7": "92:29:b8:ea:d9:28",
            "net8": "02:dd:5f:a8:ab:7c",
            "net9": "8e:a5:f3:7d:94:c2"
        },
        "spine_1_1_3": {
            "net0": "7e:41:97:b4:32:d2",
            "net1": "9a:07:45:22:23:02",
            "net10": "92:ec:77:cf:bc:3e",
            "net11": "d6:b1:ec:a6:78:c6",
            "net12": "c2:ce:f4:07:22:16",
            "net13": "0e:9f:2f:ba:ae:6d",
            "net14": "1e:23:e0:9b:c9:b0",
            "net15": "06:b6:e8:11:a9:d5",
            "net2": "5e:7c:5d:82:2f:32",
            "net3": "0a:f5:17:ce:d0:62",
            "net4": "3a:d0:61:44:ec:eb",
            "net5": "4a:77:86:d9:67:6d",
            "net6": "ba:49:54:12:c6:91",
            "net7": "3e:e0:a2:fa:4f:73",
            "net8": "46:e7:e6:e8:f2:ca",
            "net9": "d6:e5:17:67:ea:e9"
        },
        "spine_1_1_4": {
            "net0": "9a:45:91:7a:80:68",
            "net1": "6a:1f:94:b3:29:76",
            "net10": "ee:cf:8b:60:d0:60",
            "net11": "3e:52:ed:0b:58:50",
            "net12": "a6:0c:c7:9c:3b:6b",
            "net13": "6e:db:ed:48:fc:d3",
            "net14": "a6:a7:c7:69:52:20",
            "net15": "46:f6:d5:66:be:c3",
            "net2": "d2:02:5e:52:bb:c1",
            "net3": "66:ca:bb:6a:6c:a5",
            "net4": "d6:d7:3b:70:b2:14",
            "net5": "3e:c3:f9:03:17:a8",
            "net6": "26:56:fc:a7:25:a5",
            "net7": "32:ef:c9:40:f0:ce",
            "net8": "16:d7:d7:10:90:e5",
            "net9": "2a:1e:dd:15:51:70"
        },
        "spine_1_1_5": {
            "net0": "22:34:cb:31:a6:fe",
            "net1": "2a:77:9c:79:d8:2c",
            "net10": "2e:da:bd:c2:8c:c8",
            "net11": "ce:95:19:77:e6:8c",
            "net12": "22:1d:af:66:29:70",
            "net13": "42:82:7c:75:e2:01",
            "net14": "de:04:73:7a:ce:d9",
            "net15": "22:e7:44:35:8f:7b",
            "net2": "92:3b:a8:4f:32:9a",
            "net3": "a2:fa:49:f2:47:5d",
            "net4": "fa:cf:05:28:68:cd",
            "net5": "1a:09:06:29:5e:e9",
            "net6": "1a:d2:1c:19:e6:47",
            "net7": "d6:fd:c2:65:05:29",
            "net8": "ce:f3:37:27:ae:e3",
            "net9": "ea:cb:1f:19:fe:a3"
        },
        "spine_1_1_6": {
            "net0": "ba:79:41:a6:e5:56",
            "net1": "96:3f:98:e1:bb:14",
            "net10": "da:b6:1c:d0:de:63",
            "net11": "7e:68:a4:f8:4d:7a",
            "net12": "42:cd:08:49:a5:28",
            "net13": "1a:dc:4b:cc:54:64",
            "net14": "c2:f9:de:13:66:a2",
            "net15": "1e:bc:67:a9:90:e2",
            "net2": "5e:b4:1a:0a:c3:3d",
            "net3": "0a:a3:ca:d2:1f:27",
            "net4": "de:1a:76:5d:37:0a",
            "net5": "1a:6f:a3:5e:da:73",
            "net6": "ae:a7:1b:46:52:31",
            "net7": "ea:71:69:ba:16:64",
            "net8": "fe:24:30:0b:07:8a",
            "net9": "ba:3c:21:96:96:f5"
        },
        "spine_1_1_7": {
            "net0": "16:e7:fd:9d:d7:b4",
            "net1": "32:d4:b0:41:61:93",
            "net10": "4a:d6:e0:c1:8b:34",
            "net11": "a2:0b:ee:ef:17:f8",
            "net12": "b2:54:1a:00:d2:4b",
            "net13": "52:93:71:61:9c:4d",
            "net14": "a2:9a:c0:4b:c8:c9",
            "net15": "aa:20:7b:78:ac:80",
            "net2": "e2:5f:d3:b9:fc:db",
            "net3": "aa:9e:c1:7c:60:42",
            "net4": "0e:4b:4a:dd:09:e4",
            "net5": "82:75:1f:49:e7:9b",
            "net6": "62:29:6d:d0:46:f2",
            "net7": "de:90:c1:45:af:7b",
            "net8": "2e:19:a0:5f:79:9e",
            "net9": "5a:4b:4e:9e:be:2f"
        },
        "spine_1_1_8": {
            "net0": "3e:09:b3:c6:bc:3b",
            "net1": "72:e3:b8:71:fa:d7",
            "net10": "c6:44:75:47:b6:e5",
            "net11": "4a:45:60:03:cd:3f",
            "net12": "32:7b:24:df:74:31",
            "net13": "22:0c:24:9f:03:ce",
            "net14": "2a:d7:b0:53:30:c1",
            "net15": "9a:5c:b5:4c:4c:f9",
            "net2": "1e:dc:4f:e7:a8:a8",
            "net3": "b2:ad:85:3a:90:66",
            "net4": "e6:f0:6d:aa:6e:63",
            "net5": "3a:8d:58:7f:0e:5e",
            "net6": "b2:19:38:ae:b7:db",
            "net7": "d2:0b:c3:c8:0a:a1",
            "net8": "12:8f:dc:07:81:1b",
            "net9": "8e:0a:c4:c6:58:54"
        },
        "spine_2_1_1": {
            "net0": "76:18:aa:e5:ba:6e",
            "net1": "86:26:d0:1a:5e:89",
            "net10": "7e:04:43:bf:58:48",
            "net11": "be:0f:ec:51:d7:f9",
            "net12": "7e:75:a8:9d:33:3b",
            "net13": "72:a5:13:b9:ee:79",
            "net14": "be:0b:95:20:ca:8a",
            "net15": "aa:ca:43:b6:5c:75",
            "net2": "82:11:ee:94:4b:a0",
            "net3": "36:77:b2:b7:2b:24",
            "net4": "5a:cc:fa:8d:52:a5",
            "net5": "5a:04:5f:44:9a:eb",
            "net6": "0e:a9:51:2f:65:3b",
            "net7": "42:63:e2:af:d1:57",
            "net8": "9e:49:75:01:9e:26",
            "net9": "e6:5f:e5:65:4a:b2"
        },
        "spine_2_1_2": {
            "net0": "5e:df:39:f9:79:a7",
            "net1": "a2:cf:17:5b:04:f5",
            "net10": "7a:92:69:19:b9:5a",
            "net11": "ce:c4:7d:5c:db:77",
            "net12": "d6:8d:da:3b:6f:fe",
            "net13": "8e:38:9b:2e:cb:ed",
            "net14": "ea:7c:2e:c9:92:d5",
            "net15": "96:6b:7a:b2:ea:43",
            "net2": "16:d2:5e:64:01:78",
            "net3": "d2:16:43:c4:34:af",
            "net4": "4e:c0:62:22:1b:cc",
            "net5": "6a:d7:8b:01:bc:27",
            "net6": "22:08:bb:18:32:02",
            "net7": "56:82:aa:1b:b3:cf",
            "net8": "5a:c2:58:d9:5b:59",
            "net9": "6a:db:df:69:d8:25"
        },
        "spine_2_1_3": {
            "net0": "fe:7f:8e:8a:50:d4",
            "net1": "aa:97:64:16:2a:7d",
            "net10": "0e:d8:fb:f1:40:b1",
            "net11": "7a:b9:7b:43:2a:00",
            "net12": "86:c5:53:64:2f:55",
            "net13": "5e:09:ef:e2:33:4e",
            "net14": "ae:c0:a4:a9:ab:84",
            "net15": "ca:9b:c3:cb:04:92",
            "net2": "82:08:b1:18:d9:7d",
            "net3": "4a:53:b0:0f:47:58",
            "net4": "86:ce:89:93:ac:b6",
            "net5": "b2:2a:32:35:9d:f8",
            "net6": "7e:a7:34:21:2f:91",
            "net7": "aa:4b:83:5f:09:76",
            "net8": "02:95:6a:ed:3d:94",
            "net9": "12:bd:76:4e:19:36"
        },
        "spine_2_1_4": {
            "net0": "82:da:49:16:85:5d",
            "net1": "be:4e:1e:cb:e0:41",
            "net10": "22:5b:e6:82:1f:ae",
            "net11": "2e:c6:a8:9a:b0:f0",
            "net12": "0a:93:df:16:08:1f",
            "net13": "d6:61:39:b3:5c:7a",
            "net14": "5e:bb:07:3b:e3:a1",
            "net15": "2e:a8:85:3a:02:4b",
            "net2": "42:8a:eb:46:14:46",
            "net3": "8a:ad:a0:82:fc:41",
            "net4": "e6:3e:b1:12:66:89",
            "net5": "be:62:61:de:e9:9f",
            "net6": "5a:4c:86:2f:71:f7",
            "net7": "9e:2b:e5:f1:85:78",
            "net8": "0a:f3:87:a7:2c:bd",
            "net9": "02:d3:27:f5:80:e5"
        },
        "spine_2_1_5": {
            "net0": "42:a1:eb:39:a2:a6",
            "net1": "b6:fd:c1:91:4c:f7",
            "net10": "82:4d:21:f3:c8:4f",
            "net11": "66:3a:ba:31:1a:c1",
            "net12": "52:5e:56:00:e2:12",
            "net13": "b2:3c:30:a4:65:7b",
            "net14": "66:aa:66:c3:7b:3f",
            "net15": "1e:9d:d4:91:5f:13",
            "net2": "0a:48:92:5e:6f:5e",
            "net3": "3e:26:60:c4:c5:cc",
            "net4": "8e:46:02:34:54:e9",
            "net5": "56:62:58:8b:3d:70",
            "net6": "be:70:de:a8:5a:95",
            "net7": "4e:bd:9d:d3:f5:a8",
            "net8": "d2:3c:fb:83:7f:1f",
            "net9": "6e:cb:d4:fb:d9:d9"
        },
        "spine_2_1_6": {
            "net0": "a6:20:f2:fb:1a:12",
            "net1": "b6:37:d5:01:d5:d6",
            "net10": "16:c7:ab:5a:9e:66",
            "net11": "42:f8:5b:db:bc:eb",
            "net12": "4a:b2:ec:a8:ae:65",
            "net13": "56:e2:cd:13:11:32",
            "net14": "5e:ea:7e:95:85:50",
            "net15": "7e:34:73:2a:ee:58",
            "net2": "ba:25:a8:55:39:d1",
            "net3": "aa:c3:d3:76:02:80",
            "net4": "22:ab:7f:ef:7f:89",
            "net5": "92:61:54:4b:a2:62",
            "net6": "d2:d5:2c:7a:8e:ac",
            "net7": "7a:16:29:63:e5:7c",
            "net8": "3e:f3:0b:94:1a:08",
            "net9": "aa:4b:5f:5e:5d:05"
        },
        "spine_2_1_7": {
            "net0": "e6:b0:58:f8:f0:f9",
            "net1": "d2:f2:d5:cc:86:ff",
            "net10": "16:97:57:3b:a2:c2",
            "net11": "36:7e:9a:21:21:57",
            "net12": "96:1c:b8:87:33:82",
            "net13": "12:4c:ee:d2:f0:4c",
            "net14": "9e:ea:8f:a9:34:bb",
            "net15": "62:65:bb:63:01:6e",
            "net2": "56:ed:d4:49:a2:ba",
            "net3": "2e:8a:fb:78:68:de",
            "net4": "76:4a:c6:82:e7:1d",
            "net5": "3a:e4:b9:fa:33:40",
            "net6": "fa:c8:f9:99:c8:bb",
            "net7": "5e:9f:84:fc:a1:d0",
            "net8": "d6:ca:a5:1f:67:78",
            "net9": "e6:8e:b1:f5:7b:e6"
        },
        "spine_2_1_8": {
            "net0": "0a:f5:87:80:d4:b9",
            "net1": "aa:e8:84:32:da:f8",
            "net10": "ce:d3:8d:87:07:9b",
            "net11": "d2:7c:73:11:9e:a9",
            "net12": "92:29:99:c5:3f:09",
            "net13": "76:2e:20:60:f2:e2",
            "net14": "6e:a3:fb:15:93:23",
            "net15": "02:f7:bd:e4:cf:b3",
            "net2": "32:17:0d:24:5e:2e",
            "net3": "ce:2d:70:1f:e1:50",
            "net4": "ca:77:ff:d7:95:89",
            "net5": "ee:16:d9:db:7c:3f",
            "net6": "82:b9:8f:40:96:7d",
            "net7": "46:a7:9c:ed:6f:16",
            "net8": "66:59:98:3d:98:62",
            "net9": "fe:dc:4b:a6:2b:16"
        },
        "spine_3_1_1": {
            "net0": "c6:2f:16:63:c3:26",
            "net1": "0a:f8:fe:7d:9f:4a",
            "net10": "86:e6:17:c0:e8:24",
            "net11": "6a:6a:b4:f4:27:01",
            "net12": "e2:38:a0:b6:cd:4c",
            "net13": "fe:f8:f7:e0:06:30",
            "net14": "22:e4:38:98:15:9d",
            "net15": "1e:67:83:63:b9:c7",
            "net2": "a6:de:27:d0:d7:f4",
            "net3": "0a:fe:81:0c:73:52",
            "net4": "b6:4f:eb:b9:75:57",
            "net5": "fa:1d:96:be:15:c7",
            "net6": "4e:3e:7d:07:4f:1d",
            "net7": "86:eb:f3:78:de:c6",
            "net8": "5e:7d:64:e6:e0:d7",
            "net9": "da:da:89:0d:94:57"
        },
        "spine_3_1_2": {
            "net0": "76:b5:6b:74:bf:21",
            "net1": "c6:b1:84:6f:cd:81",
            "net10": "32:2d:76:a2:6a:d1",
            "net11": "b2:ab:dc:1f:09:a1",
            "net12": "5e:29:63:fc:b4:f8",
            "net13": "b2:9e:9f:28:cb:ae",
            "net14": "d2:91:7d:15:b6:18",
            "net15": "12:6b:1e:70:58:b1",
            "net2": "f6:09:72:e1:46:a7",
            "net3": "d2:29:f0:43:08:45",
            "net4": "52:30:e6:2d:a4:e2",
            "net5": "02:bc:f6:aa:5c:e1",
            "net6": "c6:b4:24:ca:44:4b",
            "net7": "a2:0a:ee:95:8e:be",
            "net8": "8a:a6:41:cd:4e:e9",
            "net9": "4e:28:e5:55:8c:0e"
        },
        "spine_3_1_3": {
            "net0": "06:ae:0a:3e:ba:a9",
            "net1": "22:ca:fc:cc:5e:d3",
            "net10": "22:92:0b:cb:8c:02",
            "net11": "ae:67:7e:83:1d:e7",
            "net12": "56:4a:92:b5:b4:3c",
            "net13": "82:ef:b3:c6:e9:b0",
            "net14": "f6:2a:34:8a:09:d1",
            "net15": "96:28:19:ef:a2:9e",
            "net2": "d2:37:bc:23:e5:82",
            "net3": "5a:62:69:dc:91:75",
            "net4": "b2:0b:66:2e:eb:15",
            "net5": "52:e1:02:ce:19:66",
            "net6": "46:3b:d5:32:11:0b",
            "net7": "52:f3:8d:8c:38:70",
            "net8": "76:d0:bc:a7:09:db",
            "net9": "ea:2a:5f:77:f2:51"
        },
        "spine_3_1_4": {
            "net0": "0e:cc:a7:a7:d1:7a",
            "net1": "76:69:5d:46:fe:67",
            "net10": "3a:eb:2e:b4:42:6d",
            "net11": "ee:8c:64:7c:38:e8",
            "net12": "7e:85:a6:71:ac:d3",
            "net13": "aa:ab:57:1b:77:b3",
            "net14": "0a:0e:27:17:d5:da",
            "net15": "d2:de:10:58:af:25",
            "net2": "72:a5:1b:ad:0d:5a",
            "net3": "ca:0b:1f:fb:7d:e6",
            "net4": "26:4c:8b:3e:94:89",
            "net5": "aa:0f:cf:fd:84:57",
            "net6": "ce:79:bb:23:1f:73",
            "net7": "c2:c2:76:81:d5:ee",
            "net8": "c2:62:72:e3:56:e8",
            "net9": "3e:2b:71:04:73:5d"
        },
        "spine_3_1_5": {
            "net0": "ee:b7:4d:21:76:a8",
            "net1": "72:4b:58:ea:63:79",
            "net10": "f2:e9:20:15:71:dd",
            "net11": "de:72:dc:bf:50:d5",
            "net12": "e2:f8:b7:f0:3b:59",
            "net13": "d6:e9:64:93:e8:96",
            "net14": "36:8f:17:23:cf:56",
            "net15": "fa:3d:95:08:6b:33",
            "net2": "82:29:76:13:6e:40",
            "net3": "ce:25:b6:a7:3c:09",
            "net4": "7e:5e:08:23:9e:3e",
            "net5": "26:45:b2:14:f1:42",
            "net6": "92:00:8a:12:c8:2b",
            "net7": "82:e7:e5:0c:35:8a",
            "net8": "aa:80:a3:13:81:0b",
            "net9": "7e:70:df:5b:e1:a8"
        },
        "spine_3_1_6": {
            "net0": "ce:c5:96:d8:47:38",
            "net1": "56:2c:0f:91:79:d7",
            "net10": "32:47:da:af:8b:b1",
            "net11": "ea:a6:ea:4a:92:ff",
            "net12": "f2:48:82:ea:03:e3",
            "net13": "6e:57:d7:e6:06:fa",
            "net14": "ae:25:4e:16:72:d8",
            "net15": "aa:3a:39:be:fa:70",
            "net2": "7a:15:f2:f9:4b:45",
            "net3": "ee:0f:df:fc:f3:0d",
            "net4": "66:ae:c8:47:22:e1",
            "net5": "9a:6d:db:a8:3c:29",
            "net6": "8e:82:0f:e2:5f:93",
            "net7": "f6:05:ac:62:ed:b5",
            "net8": "ee:07:bf:d8:8e:28",
            "net9": "96:d8:1d:97:04:ad"
        },
        "spine_3_1_7": {
            "net0": "6e:f9:37:83:0d:36",
            "net1": "3a:79:ff:06:1a:4a",
            "net10": "16:1f:6d:4a:76:20",
            "net11": "72:bf:2d:3c:58:a2",
            "net12": "ae:1f:81:95:f9:c3",
            "net13": "9a:bc:ea:6f:bd:23",
            "net14": "a6:74:d5:a8:1f:55",
            "net15": "9a:ad:4f:32:4b:ae",
            "net2": "3e:82:6b:28:c2:9c",
            "net3": "e2:53:8f:c9:1c:7f",
            "net4": "52:7b:8d:1a:4d:27",
            "net5": "f2:82:6e:d4:d6:fe",
            "net6": "2e:ed:15:a8:9c:df",
            "net7": "e6:d6:bb:6f:49:e2",
            "net8": "aa:66:71:58:ce:d2",
            "net9": "9e:f5:a0:72:f6:8c"
        },
        "spine_3_1_8": {
            "net0": "0a:3c:3a:f0:ba:1e",
            "net1": "e2:94:96:eb:41:22",
            "net10": "1a:a0:db:a8:58:3e",
            "net11": "6a:86:83:6e:3e:3b",
            "net12": "2a:08:fd:77:be:03",
            "net13": "7e:a0:d0:41:34:50",
            "net14": "0a:f3:04:fd:20:1d",
            "net15": "ae:e9:ef:81:98:82",
            "net2": "b6:41:e6:c5:0e:9a",
            "net3": "7e:55:b2:94:e2:c6",
            "net4": "ea:d0:6f:ce:ff:96",
            "net5": "2a:65:21:7c:44:a5",
            "net6": "c6:3a:00:45:67:6a",
            "net7": "02:3e:1e:b7:64:b2",
            "net8": "1e:b6:9c:02:5a:9a",
            "net9": "32:8c:b7:49:79:36"
        },
        "spine_4_1_1": {
            "net0": "f6:f6:ed:44:65:28",
            "net1": "d6:34:e8:b2:f8:4f",
            "net10": "c6:03:07:9c:3f:df",
            "net11": "e2:31:4a:94:59:f5",
            "net12": "96:75:77:05:fe:dd",
            "net13": "e2:56:0e:05:16:09",
            "net14": "52:39:9f:3a:47:5e",
            "net15": "ae:e3:14:73:fe:b7",
            "net2": "5a:e0:28:8f:f6:90",
            "net3": "66:67:30:2a:fc:7d",
            "net4": "86:55:bd:e1:16:0b",
            "net5": "da:e3:a8:3a:68:fa",
            "net6": "32:56:34:92:cf:6a",
            "net7": "ae:28:10:6b:cc:2b",
            "net8": "46:96:51:99:50:39",
            "net9": "62:72:b2:e2:92:b0"
        },
        "spine_4_1_2": {
            "net0": "8a:30:29:9e:55:a7",
            "net1": "46:45:5a:e0:1e:67",
            "net10": "3a:1e:94:53:f0:d7",
            "net11": "4e:e6:99:f1:62:fb",
            "net12": "fa:82:1a:39:8c:d8",
            "net13": "6a:e7:f2:32:da:82",
            "net14": "3e:68:ba:f2:61:06",
            "net15": "7e:64:2e:69:e3:b3",
            "net2": "12:2f:cd:ae:f1:e4",
            "net3": "ae:0f:6a:f9:ab:3c",
            "net4": "1e:a2:92:13:1d:8c",
            "net5": "62:a4:77:d0:77:e6",
            "net6": "a6:aa:65:e6:70:d6",
            "net7": "b2:72:1d:9c:02:13",
            "net8": "2e:0a:88:6f:b1:8c",
            "net9": "6e:84:6d:2f:fa:2f"
        },
        "spine_4_1_3": {
            "net0": "6e:e3:91:19:d3:34",
            "net1": "0a:e7:53:f4:c3:44",
            "net10": "82:98:d0:d6:b9:a9",
            "net11": "f2:2a:b0:e9:c5:a5",
            "net12": "c2:38:04:52:0a:e2",
            "net13": "de:00:60:64:21:be",
            "net14": "8e:ac:10:eb:24:78",
            "net15": "76:f0:3f:d4:85:0a",
            "net2": "86:36:db:44:61:62",
            "net3": "96:78:42:dd:05:a4",
            "net4": "46:3c:6c:d7:79:6d",
            "net5": "a6:12:de:e5:b5:d8",
            "net6": "56:1b:07:03:84:2f",
            "net7": "ce:9e:c8:f1:fc:ee",
            "net8": "fe:63:5e:8b:75:9c",
            "net9": "0e:59:d3:31:ee:e0"
        },
        "spine_4_1_4": {
            "net0": "62:74:d3:97:24:66",
            "net1": "72:9b:f9:78:36:52",
            "net10": "6e:a5:e0:dd:a1:c6",
            "net11": "ca:ee:73:65:14:74",
            "net12": "aa:83:fd:6d:c1:74",
            "net13": "f6:d9:48:05:a6:ce",
            "net14": "b6:9b:62:3f:bb:ac",
            "net15": "f2:9c:48:df:4b:1b",
            "net2": "c6:07:78:ae:9a:cc",
            "net3": "aa:8c:9e:6b:8f:7c",
            "net4": "2e:3b:e9:82:ec:1c",
            "net5": "3e:9b:31:79:16:06",
            "net6": "36:29:8e:d7:e5:77",
            "net7": "12:91:f9:46:28:72",
            "net8": "3e:90:87:64:5d:12",
            "net9": "72:d7:f2:b5:9d:d6"
        },
        "spine_4_1_5": {
            "net0": "3a:63:c4:fe:07:5e",
            "net1": "8a:c7:72:c6:06:97",
            "net10": "2a:ca:7d:61:13:d5",
            "net11": "16:9a:3e:e3:ff:16",
            "net12": "ba:ea:aa:ee:d2:16",
            "net13": "2a:9d:ad:3b:49:47",
            "net14": "fe:8b:62:e1:ea:26",
            "net15": "2a:c9:68:d7:ec:86",
            "net2": "e2:ba:86:d1:98:86",
            "net3": "26:16:ae:b2:c6:ad",
            "net4": "1e:bc:96:8f:5f:03",
            "net5": "c6:a4:85:0f:41:b9",
            "net6": "16:9a:bf:57:0b:50",
            "net7": "32:36:0a:b0:b0:ac",
            "net8": "62:c2:e9:f8:81:42",
            "net9": "7a:14:61:44:ed:9f"
        },
        "spine_4_1_6": {
            "net0": "e6:82:11:64:1a:99",
            "net1": "46:1e:db:b1:55:bf",
            "net10": "12:a4:10:77:23:1d",
            "net11": "da:04:72:38:15:d7",
            "net12": "96:b3:87:da:e4:02",
            "net13": "a2:4d:95:7c:98:2a",
            "net14": "86:4d:f0:e7:4d:92",
            "net15": "7e:f1:86:35:07:45",
            "net2": "76:46:3e:46:f3:20",
            "net3": "f6:0c:8e:f3:3f:4e",
            "net4": "06:7d:0a:ff:e6:82",
            "net5": "da:1c:27:2d:3e:a3",
            "net6": "52:c6:c2:e0:39:a2",
            "net7": "76:96:91:33:33:e8",
            "net8": "6a:41:32:bd:1f:51",
            "net9": "0a:07:9f:11:d6:9e"
        },
        "spine_4_1_7": {
            "net0": "16:f0:ae:b7:81:9b",
            "net1": "d2:47:33:68:11:a7",
            "net10": "ce:f1:b9:ff:ff:9a",
            "net11": "2a:a9:b8:99:cf:95",
            "net12": "22:6b:d5:a3:89:d3",
            "net13": "16:2f:a4:de:a9:dd",
            "net14": "66:53:e0:83:cd:8c",
            "net15": "42:0c:ce:c1:38:03",
            "net2": "ae:e0:47:eb:01:fd",
            "net3": "e6:3d:7b:e1:03:e6",
            "net4": "22:62:2e:8e:b3:c3",
            "net5": "fa:75:a5:2b:45:81",
            "net6": "6a:43:4f:fe:4c:d2",
            "net7": "7e:10:b7:c8:b7:47",
            "net8": "2e:3e:1c:3c:61:32",
            "net9": "fa:58:59:78:5b:c2"
        },
        "spine_4_1_8": {
            "net0": "a2:52:b2:29:f5:bd",
            "net1": "a2:01:49:59:10:d7",
            "net10": "3e:a5:cb:e5:cc:97",
            "net11": "86:2e:5d:16:d9:d0",
            "net12": "be:4d:7c:3e:f3:13",
            "net13": "d6:05:e8:08:dc:a5",
            "net14": "36:9a:72:52:0e:6a",
            "net15": "f2:da:72:1b:63:f1",
            "net2": "f2:ff:59:30:e8:a3",
            "net3": "7e:d5:01:6d:78:e8",
            "net4": "ae:75:ef:c0:1f:15",
            "net5": "5a:e4:f8:e6:2f:cc",
            "net6": "62:66:e8:fa:22:d4",
            "net7": "a2:42:97:61:36:6e",
            "net8": "32:52:68:91:ae:1b",
            "net9": "ca:16:a4:c6:16:77"
        },
        "tof_1_2_1": {
            "net0": "26:c4:e5:8b:b5:c2",
            "net1": "6a:4e:93:db:93:27",
            "net10": "ee:7d:66:db:94:db",
            "net11": "5e:35:2d:2e:05:2f",
            "net12": "fa:03:52:24:93:7b",
            "net13": "6e:8a:87:97:3a:77",
            "net14": "b2:b9:d6:a3:5f:c3",
            "net15": "5e:88:38:4b:c1:c9",
            "net2": "2e:33:b9:32:da:d8",
            "net3": "16:d6:26:69:e9:c4",
            "net4": "3a:3f:08:0f:23:95",
            "net5": "aa:c5:67:be:9f:27",
            "net6": "62:73:4f:42:33:58",
            "net7": "96:a2:f9:6e:5b:58",
            "net8": "a6:6a:a8:37:dc:3a",
            "net9": "aa:ed:f5:0d:f7:3e"
        },
        "tof_1_2_2": {
            "net0": "02:86:b6:33:37:2c",
            "net1": "d2:e3:30:b1:bd:b2",
            "net10": "6a:f3:34:91:c0:89",
            "net11": "16:4d:81:f9:55:b4",
            "net12": "ae:3b:46:e5:cd:15",
            "net13": "e2:87:76:75:95:a6",
            "net14": "66:63:97:0a:e2:aa",
            "net15": "26:b5:d2:97:51:c0",
            "net2": "12:a0:be:d8:76:3f",
            "net3": "c6:be:a8:e2:4b:c9",
            "net4": "2e:80:ae:32:ee:f7",
            "net5": "02:69:8f:73:54:93",
            "net6": "0e:69:1d:21:7b:20",
            "net7": "ea:d8:50:30:5c:13",
            "net8": "e6:84:c2:9a:62:08",
            "net9": "76:83:5f:4d:f1:4f"
        },
        "tof_1_2_3": {
            "net0": "ee:37:6c:b3:dc:7a",
            "net1": "e2:bc:98:4e:d2:56",
            "net10": "06:b2:33:53:b3:3c",
            "net11": "f2:9c:f0:de:ff:d6",
            "net12": "fa:31:e9:f4:1b:b9",
            "net13": "ea:dc:09:8e:45:3a",
            "net14": "2a:11:2b:54:25:56",
            "net15": "7e:82:bf:e1:1b:cf",
            "net2": "42:39:f0:82:07:fc",
            "net3": "7e:af:59:ab:2f:e4",
            "net4": "ca:d2:7b:0f:0f:ba",
            "net5": "86:bb:0a:a9:86:a2",
            "net6": "f6:c7:78:bb:f3:1a",
            "net7": "8e:79:5d:a6:ce:f8",
            "net8": "a2:aa:dc:aa:a9:ac",
            "net9": "de:74:af:b9:82:d6"
        },
        "tof_1_2_4": {
            "net0": "36:6a:d7:1d:4c:88",
            "net1": "1a:ab:cd:de:e5:f6",
            "net10": "b6:c5:66:19:a0:0e",
            "net11": "aa:68:bf:0a:b7:dd",
            "net12": "7e:5a:9c:22:b2:a0",
            "net13": "ae:81:fb:70:a6:c8",
            "net14": "8a:a1:e5:c0:37:bc",
            "net15": "36:6d:f7:57:14:d7",
            "net2": "2a:c4:b2:1b:ad:59",
            "net3": "7a:7a:d6:42:21:c1",
            "net4": "46:d3:65:79:bd:ae",
            "net5": "ba:03:49:10:77:54",
            "net6": "da:c2:70:9a:a0:1a",
            "net7": "8e:6c:62:2f:3a:ea",
            "net8": "8e:a9:6c:5f:c3:b1",
            "net9": "ea:83:ea:de:ec:a9"
        },
        "tof_1_2_5": {
            "net0": "5a:63:b4:97:83:e2",
            "net1": "d6:d6:4c:2a:85:81",
            "net10": "3a:41:e1:20:9f:a2",
            "net11": "9e:eb:b3:a8:4a:47",
            "net12": "06:93:21:3c:53:16",
            "net13": "a2:12:67:73:ea:3f",
            "net14": "6e:00:cb:3f:76:77",
            "net15": "76:47:ee:9e:ed:1b",
            "net2": "66:53:f5:7c:07:ff",
            "net3": "36:ee:c0:25:a9:41",
            "net4": "da:da:c8:b4:2d:04",
            "net5": "5e:95:03:d7:a0:de",
            "net6": "9e:c6:f7:3f:e2:cc",
            "net7": "a2:af:d9:a6:93:fb",
            "net8": "32:b8:73:c4:12:5b",
            "net9": "e2:29:9a:e7:ad:e4"
        },
        "tof_1_2_6": {
            "net0": "6e:be:ae:58:1d:0a",
            "net1": "ba:47:74:c1:ce:3c",
            "net10": "a2:a1:5f:61:3f:3b",
            "net11": "c2:e3:9c:49:51:6d",
            "net12": "82:19:c4:80:f2:c7",
            "net13": "06:97:f4:76:d9:4e",
            "net14": "5a:e0:37:56:d7:7c",
            "net15": "ea:bc:8f:d9:aa:98",
            "net2": "da:2e:f0:ad:85:42",
            "net3": "22:d5:21:23:a7:33",
            "net4": "32:47:d9:9d:5c:d4",
            "net5": "26:96:7e:3e:af:55",
            "net6": "6a:5e:19:71:52:83",
            "net7": "da:b0:79:46:36:13",
            "net8": "5a:e0:5c:c9:78:dd",
            "net9": "d6:b3:3a:6d:9e:ef"
        },
        "tof_1_2_7": {
            "net0": "1a:29:32:0b:8c:16",
            "net1": "9e:fd:6d:7c:69:f4",
            "net10": "c2:3a:14:f3:fd:49",
            "net11": "e2:b0:c9:26:ff:1a",
            "net12": "7e:c7:ca:44:59:18",
            "net13": "7a:d6:e1:26:ab:df",
            "net14": "de:09:fb:28:90:73",
            "net15": "a6:ac:2e:64:2d:d2",
            "net2": "86:dd:79:50:01:68",
            "net3": "9e:b5:0c:26:0b:fa",
            "net4": "8a:eb:e2:c0:1c:b1",
            "net5": "1e:a4:84:a3:2c:a6",
            "net6": "fe:c9:58:95:4f:48",
            "net7": "36:8b:03:85:24:78",
            "net8": "7a:a2:68:9d:d4:90",
            "net9": "7a:ab:5b:3e:cb:f4"
        },
        "tof_1_2_8": {
            "net0": "d2:44:ca:ba:10:fb",
            "net1": "0a:67:56:99:be:be",
            "net10": "ee:b1:27:b5:c2:de",
            "net11": "16:f3:fc:1b:24:ae",
            "net12": "0a:40:4f:f3:c4:8c",
            "net13": "1a:30:e6:47:f7:1a",
            "net14": "0a:ca:4b:c8:76:e9",
            "net15": "ea:dc:ae:7e:78:b0",
            "net2": "0a:a6:67:7d:2e:8d",
            "net3": "e2:39:c4:9d:0f:ca",
            "net4": "ea:ea:69:ed:e1:6c",
            "net5": "ce:f6:bf:bd:72:77",
            "net6": "aa:49:25:73:d6:fb",
            "net7": "ea:eb:83:8e:5f:c2",
            "net8": "d6:c9:c3:7c:aa:10",
            "net9": "82:4b:77:dd:ab:81"
        },
        "tof_2_2_1": {
            "net0": "32:2a:31:34:14:ca",
            "net1": "86:c6:aa:2c:a8:5e",
            "net10": "be:b5:38:9b:44:74",
            "net11": "a2:f6:b7:47:51:8b",
            "net12": "9a:db:e3:bc:1f:c0",
            "net13": "26:15:55:5f:fd:71",
            "net14": "8a:e4:71:89:6c:13",
            "net15": "ca:f9:e8:a7:a0:65",
            "net2": "e6:f9:6e:d9:32:03",
            "net3": "4a:77:62:ba:49:0e",
            "net4": "8a:9c:25:7b:ca:fd",
            "net5": "f6:e4:3a:b8:b0:a7",
            "net6": "52:bd:2d:2c:5b:e5",
            "net7": "f6:10:02:a8:3b:06",
            "net8": "3e:bd:66:96:7a:44",
            "net9": "7a:86:b0:84:60:8c"
        },
        "tof_2_2_2": {
            "net0": "c2:0b:44:47:fc:99",
            "net1": "5a:6e:63:1e:65:18",
            "net10": "3a:0e:c8:02:eb:eb",
            "net11": "8e:93:b9:bd:40:d6",
            "net12": "d2:17:43:bc:38:2c",
            "net13": "e2:dc:20:34:cd:70",
            "net14": "6e:ec:ab:91:75:c8",
            "net15": "8a:8a:08:6b:b4:2d",
            "net2": "96:db:37:ae:70:2f",
            "net3": "7e:7c:7f:b1:8d:78",
            "net4": "72:0e:32:63:81:f1",
            "net5": "9e:21:27:94:7e:4c",
            "net6": "02:0f:87:0a:64:d4",
            "net7": "d6:ab:d4:83:9e:b2",
            "net8": "fa:e0:40:40:de:a8",
            "net9": "9e:5b:88:0d:73:37"
        },
        "tof_2_2_3": {
            "net0": "da:cb:aa:68:67:dc",
            "net1": "1e:4d:bc:aa:c3:b7",
            "net10": "06:54:77:42:15:76",
            "net11": "02:02:b5:42:ad:03",
            "net12": "46:d2:f6:2e:49:f1",
            "net13": "1a:fa:a0:10:c2:c0",
            "net14": "1a:a6:bd:99:2d:bc",
            "net15": "5a:1d:01:b2:74:f3",
            "net2": "e6:d9:fe:79:ca:ea",
            "net3": "ca:0c:6f:54:c7:21",
            "net4": "96:73:d9:d0:1d:a8",
            "net5": "f2:2a:0b:56:22:10",
            "net6": "5a:ef:e6:de:a9:be",
            "net7": "be:da:e0:fb:d1:4a",
            "net8": "3e:e1:82:d1:ce:15",
            "net9": "52:c1:e9:04:49:1f"
        },
        "tof_2_2_4": {
            "net0": "ea:36:47:f4:9c:27",
            "net1": "e6:4c:84:79:ad:6f",
            "net10": "8e:b4:6b:9b:ae:81",
            "net11": "ea:ee:12:93:c4:02",
            "net12": "c2:34:15:92:93:f1",
            "net13": "c2:2c:4f:5d:08:ba",
            "net14": "52:07:cf:b3:0c:a2",
            "net15": "aa:57:b2:0f:25:cb",
            "net2": "26:14:b0:1f:0d:96",
            "net3": "76:38:6e:05:57:8a",
            "net4": "de:e2:17:41:52:7c",
            "net5": "76:9c:42:be:89:b2",
            "net6": "5a:79:24:ff:dd:59",
            "net7": "3a:e2:10:63:57:3f",
            "net8": "7a:f2:b4:17:66:69",
            "net9": "8a:80:3a:cc:12:50"
        },
        "tof_2_2_5": {
            "net0": "26:2f:0c:72:d5:31",
            "net1": "92:6c:02:53:57:c0",
            "net10": "aa:ea:2a:13:13:d4",
            "net11": "be:50:4e:fd:2a:65",
            "net12": "fe:94:cb:47:1a:98",
            "net13": "ba:f3:f3:62:51:27",
            "net14": "12:a7:13:bb:ae:e4",
            "net15": "32:99:fc:90:22:2d",
            "net2": "7a:9f:75:7e:b3:7d",
            "net3": "0e:b4:5d:b8:30:b0",
            "net4": "e2:da:37:9d:52:da",
            "net5": "4a:86:16:5c:dc:96",
            "net6": "66:8a:27:f9:85:d0",
            "net7": "ba:81:a3:7f:f1:20",
            "net8": "02:ee:7d:3e:b9:00",
            "net9": "e6:c4:af:a3:2d:7a"
        },
        "tof_2_2_6": {
            "net0": "fa:84:8d:03:8e:45",
            "net1": "1a:49:ad:5b:4d:8d",
            "net10": "42:c6:b6:6d:18:07",
            "net11": "8e:8f:5e:0b:87:73",
            "net12": "1e:16:e5:59:ab:ac",
            "net13": "c6:9d:f0:0f:45:5a",
            "net14": "22:f5:6f:c4:6a:ee",
            "net15": "82:77:57:d0:4f:80",
            "net2": "82:67:d8:d2:e0:d3",
            "net3": "4e:8d:44:f2:b9:61",
            "net4": "56:88:ad:89:ed:11",
            "net5": "aa:91:62:31:fa:61",
            "net6": "c6:eb:f9:3d:52:3e",
            "net7": "46:4c:39:da:db:00",
            "net8": "4a:93:4a:1a:71:76",
            "net9": "aa:bc:21:71:ed:66"
        },
        "tof_2_2_7": {
            "net0": "8a:58:c7:01:67:4e",
            "net1": "ca:cd:90:f7:83:6a",
            "net10": "9a:c4:22:4e:3f:4f",
            "net11": "e6:06:5b:e3:81:95",
            "net12": "0a:76:56:65:90:9e",
            "net13": "ba:86:bd:91:b2:f3",
            "net14": "3e:45:d2:2b:a9:d9",
            "net15": "3e:54:43:a0:41:97",
            "net2": "c6:a0:18:1f:08:3f",
            "net3": "ba:04:c1:bc:c1:f4",
            "net4": "e2:bf:6c:b1:9a:2b",
            "net5": "72:b8:3d:e8:8b:2d",
            "net6": "f2:d5:a7:00:be:69",
            "net7": "b2:f1:bd:c7:e3:4a",
            "net8": "de:a1:72:7b:00:a7",
            "net9": "9a:cf:19:bd:1a:89"
        },
        "tof_2_2_8": {
            "net0": "12:00:a5:84:f3:c7",
            "net1": "56:d9:18:4c:92:2b",
            "net10": "aa:5a:94:aa:24:09",
            "net11": "16:bc:75:e9:68:16",
            "net12": "de:30:71:b7:40:3e",
            "net13": "c6:9f:4a:52:43:25",
            "net14": "ee:05:1b:43:33:d7",
            "net15": "0e:2c:5f:6e:c0:59",
            "net2": "32:79:d4:68:0b:8b",
            "net3": "02:45:79:ee:a6:4c",
            "net4": "56:f2:7a:34:d5:51",
            "net5": "16:43:31:2b:58:76",
            "net6": "de:e8:0a:c7:fa:ca",
            "net7": "6e:ff:41:94:50:f6",
            "net8": "76:e7:b5:2d:c4:3a",
            "net9": "5e:38:49:bc:34:5d"
        }
    },
    "failed_machine": "tof_1_2_1",
    "failure_time": 1614497412.5533173,
    "recover_time": 1614497693.6591113
}