{
    "description": "Scenario 6a: net0 link failure and recovery of leaf_1_0_1 with BGP",
    "k_leaf": 6,
    "k_top": 6,
    "redundancy_factor": 3,
    "is_k8s": true,
    "machine_mac_addresses": {
        "leaf_1_0_1": {
            "net0": "2e:58:19:39:e6:6e",
            "net1": "5a:b8:2b:86:a7:42",
            "net2": "96:02:50:ed:df:28",
            "net3": "16:7b:88:e8:da:b3",
            "net4": "42:7b:10:f5:33:5f",
            "net5": "76:2e:3f:bf:0f:ad",
            "net6": "3e:9c:45:d5:79:b9"
        },
        "leaf_1_0_2": {
            "net0": "4a:89:53:80:28:c7",
            "net1": "be:a8:b2:e2:18:ee",
            "net2": "da:f1:41:54:04:15",
            "net3": "46:c1:fd:4e:da:a9",
            "net4": "72:3c:14:e0:00:51",
            "net5": "06:c5:75:bb:2f:71",
            "net6": "0e:99:cb:9a:a9:3b"
        },
        "leaf_1_0_3": {
            "net0": "5a:a5:d6:75:7a:45",
            "net1": "e6:17:4b:4e:55:73",
            "net2": "52:f7:f6:80:c7:6d",
            "net3": "c2:8c:91:ac:8e:44",
            "net4": "92:97:c2:f4:7e:cd",
            "net5": "1a:00:d7:d0:74:2f",
            "net6": "06:23:c2:cf:3b:d2"
        },
        "leaf_1_0_4": {
            "net0": "b6:13:e2:33:6c:4e",
            "net1": "92:5a:9e:64:0e:35",
            "net2": "16:03:e8:bc:69:6f",
            "net3": "de:de:fe:69:55:44",
            "net4": "62:37:f2:99:5f:95",
            "net5": "46:a0:c6:50:79:29",
            "net6": "86:36:65:c8:a2:a0"
        },
        "leaf_1_0_5": {
            "net0": "32:2d:46:25:27:c1",
            "net1": "9a:70:98:a3:ad:30",
            "net2": "66:b7:9a:63:4c:04",
            "net3": "b2:25:b1:6a:0b:12",
            "net4": "3e:97:07:58:d6:59",
            "net5": "be:91:09:c9:7b:5f",
            "net6": "7e:df:25:ab:5f:ed"
        },
        "leaf_1_0_6": {
            "net0": "da:99:09:9a:d7:14",
            "net1": "2e:b4:13:a5:90:26",
            "net2": "62:02:a8:b9:e9:50",
            "net3": "7e:a0:84:45:ad:91",
            "net4": "2a:5e:33:0d:cb:d4",
            "net5": "8a:57:ea:ac:5d:eb",
            "net6": "46:06:b8:82:53:7b"
        },
        "leaf_2_0_1": {
            "net0": "d6:fe:a9:2c:63:1b",
            "net1": "4a:c9:0a:c7:58:87",
            "net2": "ea:fd:0e:45:0a:96",
            "net3": "06:6c:de:0c:22:82",
            "net4": "0e:15:22:f6:cb:2f",
            "net5": "5a:76:e5:62:64:a7",
            "net6": "ce:cd:21:82:27:1e"
        },
        "leaf_2_0_2": {
            "net0": "5e:5d:f6:36:e5:b4",
            "net1": "4e:0f:53:e5:25:c1",
            "net2": "56:1a:4c:c5:38:7b",
            "net3": "ca:a6:7c:1e:ab:d9",
            "net4": "d6:a7:6f:65:12:bc",
            "net5": "4e:b9:b1:a5:bc:3d",
            "net6": "de:4b:ec:95:0b:64"
        },
        "leaf_2_0_3": {
            "net0": "5a:26:2d:d2:34:44",
            "net1": "8a:83:e9:84:ad:6e",
            "net2": "2a:2b:ff:f4:26:8d",
            "net3": "46:62:fe:9c:d2:7c",
            "net4": "3e:a1:fe:9d:3e:f0",
            "net5": "82:6b:4c:1a:76:78",
            "net6": "9a:c3:37:0f:c7:60"
        },
        "leaf_2_0_4": {
            "net0": "de:9f:e5:72:6f:8c",
            "net1": "9a:dc:87:ce:86:ae",
            "net2": "fa:41:e2:6a:af:95",
            "net3": "1a:6a:ba:b8:c2:20",
            "net4": "f6:f3:e3:5e:98:b0",
            "net5": "5e:2e:19:de:29:e4",
            "net6": "72:12:33:60:ec:59"
        },
        "leaf_2_0_5": {
            "net0": "56:38:a4:48:d2:31",
            "net1": "4a:a2:21:e5:fa:bb",
            "net2": "5a:99:f6:da:f4:15",
            "net3": "fe:8c:ae:a4:d0:c1",
            "net4": "d2:47:cf:20:46:62",
            "net5": "96:91:a5:b8:dc:f8",
            "net6": "be:f5:00:9d:72:70"
        },
        "leaf_2_0_6": {
            "net0": "e2:52:1e:cd:ef:1c",
            "net1": "e6:d3:d5:86:24:06",
            "net2": "1a:70:95:ac:b7:e6",
            "net3": "86:b9:e3:f9:f8:f8",
            "net4": "be:bf:81:2c:d0:dd",
            "net5": "e6:17:0f:26:66:0c",
            "net6": "e6:b1:e7:3a:71:1a"
        },
        "leaf_3_0_1": {
            "net0": "72:d3:b7:54:91:96",
            "net1": "e6:e6:71:30:8f:cb",
            "net2": "0a:e9:8b:d4:d0:96",
            "net3": "fa:d2:9a:70:9b:5b",
            "net4": "c2:15:11:75:93:b0",
            "net5": "9a:69:4e:a3:10:03",
            "net6": "6a:97:a2:20:30:20"
        },
        "leaf_3_0_2": {
            "net0": "7e:22:a9:4d:44:de",
            "net1": "d2:f9:8f:e7:7b:78",
            "net2": "fa:e3:fa:3e:67:57",
            "net3": "0a:11:99:1c:99:93",
            "net4": "52:ec:36:67:cf:fa",
            "net5": "d2:34:30:45:64:b0",
            "net6": "2e:d6:6c:b7:06:41"
        },
        "leaf_3_0_3": {
            "net0": "9a:0b:5c:88:c1:bb",
            "net1": "ca:ee:4b:35:f0:b4",
            "net2": "ce:f9:6d:d1:c8:97",
            "net3": "2a:b1:8f:eb:21:ec",
            "net4": "1a:54:38:63:0d:e3",
            "net5": "82:c6:9a:18:d2:33",
            "net6": "62:0b:e1:29:cf:1f"
        },
        "leaf_3_0_4": {
            "net0": "62:89:8d:01:b9:f8",
            "net1": "5a:86:c2:01:18:f8",
            "net2": "b6:cf:fa:c3:12:02",
            "net3": "ae:40:2d:96:38:ba",
            "net4": "16:fd:58:ac:4b:14",
            "net5": "2e:6e:51:7b:04:ee",
            "net6": "36:03:2b:72:07:6f"
        },
        "leaf_3_0_5": {
            "net0": "0a:75:9a:69:53:a8",
            "net1": "62:2d:ea:33:61:44",
            "net2": "7e:ad:a9:f5:5d:77",
            "net3": "9e:f9:7d:9d:97:92",
            "net4": "96:aa:d2:9a:d6:8e",
            "net5": "fe:c2:1a:fd:dc:de",
            "net6": "9a:83:9c:a2:e1:1d"
        },
        "leaf_3_0_6": {
            "net0": "7e:4d:9a:aa:72:7e",
            "net1": "b6:11:02:1e:c0:73",
            "net2": "2e:c1:44:3d:10:05",
            "net3": "72:71:f4:14:78:b9",
            "net4": "aa:e1:29:4c:7f:12",
            "net5": "9a:a8:d2:fc:10:46",
            "net6": "a2:73:63:05:56:a2"
        },
        "leaf_4_0_1": {
            "net0": "aa:1e:1b:9d:82:34",
            "net1": "2e:4e:2f:ca:19:fe",
            "net2": "d6:6b:55:6c:54:ae",
            "net3": "b2:2e:f1:56:c0:c4",
            "net4": "82:cc:9d:10:ba:b0",
            "net5": "ce:68:83:d9:ef:5c",
            "net6": "6e:24:a7:92:9f:c1"
        },
        "leaf_4_0_2": {
            "net0": "96:a9:ad:dc:a5:a5",
            "net1": "2e:db:f0:7e:93:eb",
            "net2": "a6:d1:1c:7a:55:0e",
            "net3": "32:16:28:96:ce:06",
            "net4": "ca:dd:ef:53:cb:cb",
            "net5": "92:9c:ac:21:86:7a",
            "net6": "8a:0e:eb:e9:05:97"
        },
        "leaf_4_0_3": {
            "net0": "52:6b:6d:e8:c8:12",
            "net1": "e6:e3:63:c9:b5:af",
            "net2": "e2:f9:3e:21:01:60",
            "net3": "b2:18:b7:10:54:cb",
            "net4": "b6:46:3a:b5:fd:22",
            "net5": "d6:f1:92:1d:d8:56",
            "net6": "82:9d:20:ba:fd:9b"
        },
        "leaf_4_0_4": {
            "net0": "f6:1f:81:9f:e5:e2",
            "net1": "1e:15:16:06:6d:b2",
            "net2": "f6:24:0a:2d:55:20",
            "net3": "72:0f:0e:4c:cb:3b",
            "net4": "12:83:4e:51:d5:15",
            "net5": "f2:98:c5:f2:73:1a",
            "net6": "da:d7:15:c2:28:74"
        },
        "leaf_4_0_5": {
            "net0": "7a:55:ee:06:3c:f6",
            "net1": "16:12:18:6d:45:0b",
            "net2": "1e:92:7b:ee:cb:9b",
            "net3": "42:f2:f4:13:d7:76",
            "net4": "5e:0d:b0:22:a4:88",
            "net5": "ee:5c:3f:2d:30:39",
            "net6": "86:19:26:e9:a5:97"
        },
        "leaf_4_0_6": {
            "net0": "26:8f:26:22:e8:b3",
            "net1": "fa:c8:45:0f:02:52",
            "net2": "66:8d:3a:cd:39:e0",
            "net3": "b2:ae:89:97:60:00",
            "net4": "36:c7:1a:24:fb:f1",
            "net5": "4e:f7:13:2c:da:62",
            "net6": "2e:ad:66:e0:64:e1"
        },
        "spine_1_1_1": {
            "net0": "92:21:02:41:40:83",
            "net1": "5e:83:fe:7b:60:73",
            "net10": "9a:95:44:46:c4:03",
            "net11": "ca:2e:77:ec:dc:62",
            "net2": "72:f7:f8:d3:32:f7",
            "net3": "a6:7e:c9:16:25:b2",
            "net4": "c2:ad:fd:8e:98:49",
            "net5": "fa:45:f8:7f:1e:34",
            "net6": "6a:8e:bb:6d:3d:f2",
            "net7": "96:5c:2f:dd:97:cf",
            "net8": "e6:87:43:03:fd:8b",
            "net9": "9a:29:6d:5f:35:89"
        },
        "spine_1_1_2": {
            "net0": "86:3d:29:f1:19:0b",
            "net1": "42:40:73:27:ec:16",
            "net10": "06:c9:46:2e:32:40",
            "net11": "5a:b1:c5:77:87:e0",
            "net2": "f6:af:05:77:ea:66",
            "net3": "ee:b9:b7:ee:96:f5",
            "net4": "06:13:37:d9:01:bd",
            "net5": "ae:a2:4b:82:a6:33",
            "net6": "86:8e:84:0c:cf:11",
            "net7": "52:ff:fb:c4:9e:7e",
            "net8": "12:96:a9:93:05:a0",
            "net9": "be:81:9c:56:98:e7"
        },
        "spine_1_1_3": {
            "net0": "82:04:cd:7f:c2:e1",
            "net1": "9e:6c:2d:c3:1e:32",
            "net10": "7e:9c:ac:56:82:d6",
            "net11": "d6:0b:d1:15:f8:f8",
            "net2": "de:39:c7:e2:68:42",
            "net3": "3e:67:8d:72:16:92",
            "net4": "5a:d7:94:f9:9c:17",
            "net5": "ee:f6:97:b9:7b:ff",
            "net6": "82:f5:99:53:14:31",
            "net7": "46:a8:79:11:0f:60",
            "net8": "fe:aa:eb:fa:cb:48",
            "net9": "8e:d6:ad:98:3f:7b"
        },
        "spine_1_1_4": {
            "net0": "26:eb:c9:5d:aa:5b",
            "net1": "46:34:a2:4a:a9:8b",
            "net10": "12:64:5a:08:68:25",
            "net11": "92:86:68:45:a6:4c",
            "net2": "fe:dd:7d:89:e0:6a",
            "net3": "72:b6:86:e8:ee:59",
            "net4": "ea:b5:be:e5:d6:7c",
            "net5": "1e:0a:da:ac:cf:9c",
            "net6": "b6:ed:33:e0:60:ba",
            "net7": "72:a5:51:cf:df:3f",
            "net8": "42:3f:e8:99:44:48",
            "net9": "c2:90:44:ef:ef:33"
        },
        "spine_1_1_5": {
            "net0": "fa:39:8c:2b:4b:60",
            "net1": "46:eb:43:f4:2c:6b",
            "net10": "1a:18:97:fd:2e:57",
            "net11": "ce:eb:e8:dd:6b:8c",
            "net2": "16:43:3a:d1:7e:21",
            "net3": "56:b6:07:a7:a6:06",
            "net4": "d2:ee:28:01:14:17",
            "net5": "b2:f6:4b:19:21:05",
            "net6": "2a:59:5e:53:c1:a3",
            "net7": "46:74:39:b3:63:08",
            "net8": "5e:89:f6:b8:c9:ac",
            "net9": "0a:8f:64:da:c5:6b"
        },
        "spine_1_1_6": {
            "net0": "8e:f8:f3:80:f8:f6",
            "net1": "c2:c9:2f:7f:4c:64",
            "net10": "f2:0e:9d:de:9f:27",
            "net11": "8a:47:5d:4e:3d:62",
            "net2": "b2:a8:cd:ad:bc:66",
            "net3": "66:b1:89:91:83:01",
            "net4": "0a:04:7b:54:89:73",
            "net5": "f2:f4:40:5a:6d:38",
            "net6": "42:ff:3c:49:b9:de",
            "net7": "a6:f0:77:66:72:f9",
            "net8": "ae:25:f1:ae:7f:4e",
            "net9": "7e:f3:82:72:1f:c3"
        },
        "spine_2_1_1": {
            "net0": "3a:83:96:bb:84:3b",
            "net1": "aa:56:f6:f3:d8:0e",
            "net10": "d6:b5:ea:c7:ef:e2",
            "net11": "26:bf:b1:2c:79:99",
            "net2": "76:64:ac:62:a8:19",
            "net3": "72:c9:e3:db:e4:33",
            "net4": "52:ce:e3:8a:49:85",
            "net5": "f6:bd:6d:d9:c9:98",
            "net6": "ea:5d:7c:ee:80:31",
            "net7": "ce:c1:a5:91:b0:10",
            "net8": "76:d7:80:08:ca:2a",
            "net9": "f2:5e:30:ad:f4:5d"
        },
        "spine_2_1_2": {
            "net0": "f6:7f:b1:4d:d8:d0",
            "net1": "e2:e8:d2:4a:f5:1e",
            "net10": "c2:74:1b:b2:34:11",
            "net11": "52:b0:18:c7:c3:e7",
            "net2": "2a:fe:68:ad:ec:69",
            "net3": "f6:9f:7d:f7:84:b6",
            "net4": "02:0f:35:14:2d:68",
            "net5": "22:ed:20:a5:1f:80",
            "net6": "0e:e6:11:f3:aa:d3",
            "net7": "0e:12:6f:d9:bf:33",
            "net8": "ce:60:9a:ca:48:b4",
            "net9": "1e:dd:01:8f:49:76"
        },
        "spine_2_1_3": {
            "net0": "5e:74:bf:54:38:fd",
            "net1": "72:01:88:6e:0f:35",
            "net10": "a6:1b:a5:da:1e:fc",
            "net11": "02:3c:9f:e2:0d:77",
            "net2": "12:12:03:46:36:22",
            "net3": "f2:76:c7:92:06:ce",
            "net4": "ee:c9:6d:19:c1:b0",
            "net5": "2a:5a:61:c3:eb:70",
            "net6": "8e:73:f9:c0:b8:b1",
            "net7": "8a:c8:99:9d:17:d6",
            "net8": "76:e8:40:52:ab:4c",
            "net9": "66:fc:c8:81:55:64"
        },
        "spine_2_1_4": {
            "net0": "fa:aa:ef:7b:91:01",
            "net1": "82:9c:49:cb:de:e5",
            "net10": "be:99:f5:98:8f:ea",
            "net11": "ca:33:58:e9:90:02",
            "net2": "62:30:8f:d8:99:de",
            "net3": "be:c1:8d:57:cf:40",
            "net4": "6e:42:96:ad:18:26",
            "net5": "b6:4c:23:b4:a6:28",
            "net6": "c6:81:2f:f3:02:08",
            "net7": "66:c0:6a:f9:65:97",
            "net8": "2e:b9:28:1b:14:21",
            "net9": "2e:9b:47:a8:f3:ac"
        },
        "spine_2_1_5": {
            "net0": "42:c4:92:0d:0f:52",
            "net1": "fa:8f:6e:ff:80:95",
            "net10": "22:ae:16:3d:fb:21",
            "net11": "9a:d2:18:d8:22:d4",
            "net2": "d6:ae:9c:59:d2:e5",
            "net3": "5a:b6:8c:1e:9a:ce",
            "net4": "ba:c7:67:11:e7:d7",
            "net5": "da:27:d9:e2:e8:97",
            "net6": "72:37:e0:67:ab:41",
            "net7": "76:95:27:83:28:59",
            "net8": "9e:48:cc:1e:96:57",
            "net9": "26:7a:66:8b:8c:df"
        },
        "spine_2_1_6": {
            "net0": "d2:a3:a9:f5:6c:07",
            "net1": "06:43:8a:c5:03:8a",
            "net10": "de:5f:7f:da:a2:04",
            "net11": "5e:d3:b6:df:9d:8c",
            "net2": "36:48:ea:02:9a:d1",
            "net3": "ce:eb:38:2c:21:29",
            "net4": "1a:6b:08:bf:3b:08",
            "net5": "ba:d5:88:05:34:d4",
            "net6": "36:84:df:d2:31:cb",
            "net7": "5a:10:98:e5:74:5b",
            "net8": "0a:3d:7e:d0:1e:6c",
            "net9": "e6:b8:b4:86:a4:52"
        },
        "spine_3_1_1": {
            "net0": "92:a3:09:75:7c:f6",
            "net1": "12:d2:02:a0:b9:87",
            "net10": "16:87:66:0a:93:b1",
            "net11": "6e:e2:ba:d8:17:1d",
            "net2": "7e:63:f8:f3:98:76",
            "net3": "36:94:96:1a:3a:80",
            "net4": "36:46:35:f3:a4:27",
            "net5": "86:86:b2:28:ee:53",
            "net6": "5e:55:24:24:e2:a2",
            "net7": "76:f9:1a:b9:e0:67",
            "net8": "0e:11:66:51:79:d9",
            "net9": "26:e7:6b:bc:8b:78"
        },
        "spine_3_1_2": {
            "net0": "7e:dc:c4:b7:3b:d2",
            "net1": "46:32:0f:3f:0e:fb",
            "net10": "8e:ab:f6:3a:54:66",
            "net11": "96:0f:98:d2:71:73",
            "net2": "62:d3:e0:b1:95:b0",
            "net3": "ce:ee:ec:fb:8b:da",
            "net4": "ce:46:57:6a:2f:4b",
            "net5": "72:32:a5:f4:5b:9f",
            "net6": "ea:3c:6d:07:4b:35",
            "net7": "2e:90:c8:40:37:a6",
            "net8": "a2:25:b4:39:52:d9",
            "net9": "ca:28:68:e8:2c:a4"
        },
        "spine_3_1_3": {
            "net0": "7e:d3:06:fe:3e:02",
            "net1": "9e:72:58:ea:96:47",
            "net10": "ba:43:b0:b9:40:b4",
            "net11": "86:d2:b7:70:7f:46",
            "net2": "d6:13:f7:4a:7a:0c",
            "net3": "2a:cf:30:c1:c7:24",
            "net4": "8a:75:b6:55:90:ec",
            "net5": "92:b9:e5:42:ee:3f",
            "net6": "f6:80:87:66:21:1e",
            "net7": "b6:c2:d9:56:20:de",
            "net8": "92:40:e4:d0:ff:53",
            "net9": "c2:e8:d5:4a:da:31"
        },
        "spine_3_1_4": {
            "net0": "1a:9f:22:b2:c6:65",
            "net1": "fe:2e:3b:94:2e:02",
            "net10": "ba:a4:88:70:e4:32",
            "net11": "1e:8a:9d:f1:76:2f",
            "net2": "3e:82:11:0d:02:3a",
            "net3": "2a:78:ab:b8:5f:ba",
            "net4": "6e:05:8e:98:27:15",
            "net5": "b2:4f:92:26:f9:2a",
            "net6": "3a:59:c1:f9:ad:80",
            "net7": "22:16:da:db:00:75",
            "net8": "d6:ed:38:55:c6:7f",
            "net9": "5a:ca:5a:02:6c:bd"
        },
        "spine_3_1_5": {
            "net0": "ce:56:96:98:9c:0b",
            "net1": "5e:5a:92:ff:f5:38",
            "net10": "52:28:3c:6c:bd:27",
            "net11": "c6:fd:91:f7:78:a8",
            "net2": "96:55:e8:bc:f6:f0",
            "net3": "e2:30:73:e5:ff:50",
            "net4": "5e:00:52:68:0e:fc",
            "net5": "3e:a3:5a:17:09:4e",
            "net6": "1e:dd:d5:50:96:27",
            "net7": "ba:8f:53:aa:1d:11",
            "net8": "32:6c:65:0a:c1:6b",
            "net9": "72:da:40:29:d7:2d"
        },
        "spine_3_1_6": {
            "net0": "46:91:1c:ab:ff:fd",
            "net1": "92:f5:f7:c4:c0:03",
            "net10": "3e:12:6f:9b:00:10",
            "net11": "fe:a8:05:a5:f9:ab",
            "net2": "02:c7:ec:67:aa:4a",
            "net3": "e6:3c:44:0d:5b:c6",
            "net4": "8a:98:b7:6f:3d:37",
            "net5": "de:39:5f:df:2b:0d",
            "net6": "d6:8e:9e:4c:e7:62",
            "net7": "0a:3e:6d:1d:3a:85",
            "net8": "b2:88:aa:e2:94:fe",
            "net9": "7e:1f:df:30:64:80"
        },
        "spine_4_1_1": {
            "net0": "f2:4d:91:49:df:35",
            "net1": "22:04:e9:41:d5:32",
            "net10": "da:4a:50:dc:60:b1",
            "net11": "96:be:f4:a0:29:74",
            "net2": "ea:a5:55:54:c9:e0",
            "net3": "82:11:94:d3:61:94",
            "net4": "e6:fd:fc:48:be:27",
            "net5": "6e:69:46:5e:7e:33",
            "net6": "da:01:6e:5f:18:84",
            "net7": "16:12:06:26:2b:3c",
            "net8": "a2:b6:26:16:11:ae",
            "net9": "ba:12:32:37:d4:c2"
        },
        "spine_4_1_2": {
            "net0": "9e:62:94:21:19:5f",
            "net1": "56:9e:c6:06:68:4d",
            "net10": "8e:da:a6:ae:94:00",
            "net11": "de:04:04:8c:6c:00",
            "net2": "c2:31:0e:f0:ff:65",
            "net3": "c6:bb:b6:7c:28:74",
            "net4": "a6:ca:0a:6e:20:b0",
            "net5": "ca:a1:9d:3a:16:15",
            "net6": "aa:4a:ac:d6:bd:a4",
            "net7": "12:24:7b:db:86:6c",
            "net8": "b6:7a:02:80:c5:1d",
            "net9": "be:37:a6:63:63:14"
        },
        "spine_4_1_3": {
            "net0": "62:ac:1b:6b:46:45",
            "net1": "b6:b3:33:42:77:44",
            "net10": "9a:ce:30:d1:6a:00",
            "net11": "3e:1a:d8:b7:35:84",
            "net2": "ea:66:4c:50:d3:12",
            "net3": "e2:96:6b:df:ca:75",
            "net4": "e6:9d:a3:42:c0:f3",
            "net5": "1e:c2:2d:97:14:1b",
            "net6": "de:5b:39:6b:cd:43",
            "net7": "de:ab:e7:55:27:f0",
            "net8": "2e:f1:6e:51:ff:ba",
            "net9": "0e:ec:7c:16:99:c4"
        },
        "spine_4_1_4": {
            "net0": "86:97:81:3d:cb:90",
            "net1": "d2:8c:a2:c8:bd:93",
            "net10": "a2:e2:bd:3f:fb:6e",
            "net11": "ca:16:e5:ad:0b:e6",
            "net2": "72:59:43:ec:11:45",
            "net3": "5a:41:d8:ce:52:fb",
            "net4": "f6:3c:c4:0b:d4:ed",
            "net5": "7a:70:8d:3a:3c:f2",
            "net6": "86:1e:df:b6:ca:e0",
            "net7": "ba:69:f2:96:06:31",
            "net8": "e6:34:cf:5b:9c:ad",
            "net9": "2a:f5:63:1a:c4:00"
        },
        "spine_4_1_5": {
            "net0": "ce:1f:c2:6d:46:3c",
            "net1": "0e:87:86:78:11:4e",
            "net10": "a6:7e:f2:7d:2c:35",
            "net11": "ce:9c:b4:82:ca:ee",
            "net2": "7e:a9:6a:52:a8:11",
            "net3": "32:a3:d0:3a:62:24",
            "net4": "0a:69:63:d6:5b:84",
            "net5": "fe:74:0f:3d:b6:87",
            "net6": "76:c6:a2:4c:00:a0",
            "net7": "66:66:97:8b:8e:cb",
            "net8": "2e:ec:41:61:19:71",
            "net9": "76:0d:40:f4:35:4e"
        },
        "spine_4_1_6": {
            "net0": "ba:ad:83:80:1f:6c",
            "net1": "8a:da:06:0c:66:39",
            "net10": "a6:1f:8d:b8:24:d8",
            "net11": "fe:7c:5c:10:97:23",
            "net2": "f6:3f:5a:59:a9:b3",
            "net3": "82:27:bc:79:b7:23",
            "net4": "2a:33:b8:7c:63:ed",
            "net5": "46:17:4a:29:7e:bb",
            "net6": "12:da:99:05:9b:a5",
            "net7": "a6:1d:18:18:c9:7e",
            "net8": "42:90:03:02:d3:0b",
            "net9": "82:79:3e:7f:de:38"
        },
        "tof_1_2_1": {
            "net0": "aa:32:3a:5a:f7:14",
            "net1": "fa:3c:1e:fd:4b:28",
            "net10": "f6:76:b3:ed:07:42",
            "net11": "62:1d:72:26:39:f8",
            "net2": "ea:fd:63:ae:21:5f",
            "net3": "8a:a0:64:c9:d0:7d",
            "net4": "12:a5:7a:fd:05:db",
            "net5": "ea:75:b2:f6:64:57",
            "net6": "4a:18:57:2e:26:86",
            "net7": "a2:8f:59:51:20:5d",
            "net8": "2a:9b:7a:35:40:10",
            "net9": "5e:f6:88:9d:54:1f"
        },
        "tof_1_2_2": {
            "net0": "32:e0:06:ec:15:e9",
            "net1": "52:67:a0:37:26:5c",
            "net10": "c6:b0:08:ec:a4:e9",
            "net11": "ba:dc:30:27:0d:67",
            "net2": "72:c6:7b:23:5b:fc",
            "net3": "96:81:bb:f8:25:30",
            "net4": "16:9b:32:ff:30:72",
            "net5": "f2:50:91:92:9d:6c",
            "net6": "c6:04:72:4d:c9:d8",
            "net7": "ae:55:75:40:b8:6e",
            "net8": "a2:42:d0:ea:7a:c8",
            "net9": "5a:dc:4a:dd:d8:b4"
        },
        "tof_1_2_3": {
            "net0": "0a:f6:90:f1:7a:2d",
            "net1": "e6:0b:9f:5d:66:b0",
            "net10": "fa:6a:e5:e2:a8:ff",
            "net11": "f6:89:4f:7e:94:39",
            "net2": "ea:47:4b:24:9a:ee",
            "net3": "ba:d5:9e:a3:da:ee",
            "net4": "ba:c8:22:63:5c:fb",
            "net5": "c6:ad:27:83:ff:9d",
            "net6": "fa:9c:0a:86:b6:69",
            "net7": "da:60:64:00:71:6f",
            "net8": "e2:39:fd:78:0f:e2",
            "net9": "b2:75:42:b7:cb:dc"
        },
        "tof_1_2_4": {
            "net0": "b2:b7:38:b6:71:be",
            "net1": "1a:33:65:68:4b:b4",
            "net10": "4e:cd:b3:c3:10:0a",
            "net11": "d6:9c:8f:40:5e:29",
            "net2": "82:75:b0:89:4a:8e",
            "net3": "6e:1f:d4:d5:8a:3e",
            "net4": "5a:c0:ee:b6:a4:72",
            "net5": "4a:f7:6d:2c:e4:77",
            "net6": "6e:36:b1:b6:71:36",
            "net7": "72:a6:d8:7e:fa:51",
            "net8": "1e:41:24:63:b5:ab",
            "net9": "8e:f3:b1:46:3b:78"
        },
        "tof_1_2_5": {
            "net0": "22:cb:bf:da:36:a4",
            "net1": "fa:15:bb:8d:ed:db",
            "net10": "56:37:dc:ee:1c:71",
            "net11": "d2:73:f6:16:f3:f3",
            "net2": "12:f8:f8:86:9d:72",
            "net3": "9e:69:2a:f4:9b:15",
            "net4": "6e:18:c9:8e:2d:9b",
            "net5": "26:79:df:9c:ba:13",
            "net6": "f6:73:1c:31:0e:8e",
            "net7": "3e:72:42:d1:db:79",
            "net8": "1a:cf:25:6b:5b:7a",
            "net9": "da:57:a0:be:43:fc"
        },
        "tof_1_2_6": {
            "net0": "fa:31:2f:10:d7:ad",
            "net1": "66:c3:6e:28:8f:40",
            "net10": "aa:84:c6:16:49:c3",
            "net11": "92:10:5c:19:34:ee",
            "net2": "b2:5e:c6:03:08:78",
            "net3": "6a:80:c0:b8:f6:1b",
            "net4": "b2:68:24:17:ac:06",
            "net5": "5a:72:c3:22:27:57",
            "net6": "52:16:f3:55:6f:c0",
            "net7": "ca:3b:ff:c4:ca:14",
            "net8": "56:99:e1:eb:67:49",
            "net9": "da:62:58:0b:b1:d6"
        },
        "tof_2_2_1": {
            "net0": "9a:49:53:25:69:d9",
            "net1": "52:f5:1a:11:f0:13",
            "net10": "7e:74:25:50:b4:3c",
            "net11": "76:f1:6b:1c:5c:3e",
            "net2": "8e:f8:01:d4:0a:a8",
            "net3": "e2:fe:8c:40:a7:ab",
            "net4": "5e:44:c3:94:c3:a4",
            "net5": "f6:54:18:06:27:bc",
            "net6": "aa:28:d7:4e:60:de",
            "net7": "5a:b2:20:bc:bd:97",
            "net8": "b6:ef:6b:76:c0:bb",
            "net9": "d6:2a:f0:48:73:db"
        },
        "tof_2_2_2": {
            "net0": "06:18:81:2b:a0:f9",
            "net1": "72:41:0b:dd:66:61",
            "net10": "7e:79:08:e6:cc:b7",
            "net11": "36:9c:6b:88:cd:68",
            "net2": "0e:8b:97:f8:2b:f6",
            "net3": "ba:1f:04:2a:dc:9e",
            "net4": "f6:d2:38:b0:ad:ff",
            "net5": "12:88:2c:d9:5d:ad",
            "net6": "66:c1:7f:dd:0d:73",
            "net7": "5e:99:d6:5d:46:49",
            "net8": "aa:71:97:79:49:da",
            "net9": "82:2b:fa:0f:0e:20"
        },
        "tof_2_2_3": {
            "net0": "ca:13:26:e7:d7:a9",
            "net1": "46:50:ec:f7:70:36",
            "net10": "72:d4:8e:85:fe:db",
            "net11": "7a:78:8b:af:d8:b7",
            "net2": "7a:b0:83:37:e5:34",
            "net3": "9a:34:8d:09:60:8b",
            "net4": "ca:68:3f:c8:7c:e1",
            "net5": "52:1b:7f:49:f7:14",
            "net6": "9a:d3:17:21:79:fd",
            "net7": "06:f9:9b:ee:03:96",
            "net8": "32:de:d5:15:5d:eb",
            "net9": "9e:33:fa:c6:1c:19"
        },
        "tof_2_2_4": {
            "net0": "0e:8f:7a:43:40:ac",
            "net1": "56:0d:a5:ba:e7:37",
            "net10": "e2:b5:53:c1:e5:d6",
            "net11": "be:cc:09:09:62:6f",
            "net2": "a6:ef:c6:db:32:13",
            "net3": "62:4d:a5:46:44:9b",
            "net4": "ae:d2:37:2c:7c:8f",
            "net5": "fe:d8:13:75:9f:53",
            "net6": "6e:1f:a1:e8:37:92",
            "net7": "1a:f2:2c:74:6e:bd",
            "net8": "2a:13:d8:a9:60:ee",
            "net9": "6a:9a:4b:e4:37:59"
        },
        "tof_2_2_5": {
            "net0": "ae:35:ad:58:10:89",
            "net1": "76:3a:87:8f:96:32",
            "net10": "ca:e2:a5:3a:86:31",
            "net11": "ea:73:01:10:3e:93",
            "net2": "7a:00:40:09:f0:3a",
            "net3": "fe:d7:b7:17:e4:e5",
            "net4": "de:9b:fb:d4:21:01",
            "net5": "c2:8f:ca:ed:c7:78",
            "net6": "d2:a1:9c:44:c3:91",
            "net7": "52:e2:4f:b1:4a:45",
            "net8": "5e:15:f0:85:66:10",
            "net9": "b2:81:c9:3f:92:9b"
        },
        "tof_2_2_6": {
            "net0": "e6:32:3e:d9:6e:b8",
            "net1": "66:e3:1c:6f:c1:a9",
            "net10": "b2:7a:68:53:94:34",
            "net11": "26:56:4c:94:ad:af",
            "net2": "d6:a4:96:56:de:d4",
            "net3": "b6:d6:e8:6e:f8:a8",
            "net4": "a2:6b:80:fd:29:55",
            "net5": "46:a0:eb:cf:6e:0a",
            "net6": "ba:52:97:59:7c:d6",
            "net7": "7a:6b:76:19:38:3e",
            "net8": "ee:5c:5d:50:1a:13",
            "net9": "b6:63:1b:bd:85:f6"
        }
    },
    "failed_machine": "leaf_1_0_1",
    "failed_interfaces": [
        "net0"
    ],
    "failure_time": 1616372836.448262,
    "recover_time": 1616372902.7713435
}