{
    "description": "Scenario 3a: Leaf leaf_1_0_1 failure with BGP",
    "k_leaf": 8,
    "k_top": 8,
    "redundancy_factor": 2,
    "is_k8s": true,
    "machine_mac_addresses": {
        "leaf_1_0_1": {
            "net0": "d6:5d:05:03:06:73",
            "net1": "e6:4d:b5:82:6d:6a",
            "net2": "56:d9:81:5c:8c:ee",
            "net3": "2a:0a:32:03:f9:69",
            "net4": "c6:32:ff:d8:9b:ab",
            "net5": "da:1d:ed:04:0e:47",
            "net6": "fe:23:65:90:72:9f",
            "net7": "02:93:4a:c0:ef:dc",
            "net8": "4e:27:29:f5:8f:bc"
        },
        "leaf_1_0_2": {
            "net0": "f6:a5:e0:12:fe:23",
            "net1": "26:75:d0:1c:4e:65",
            "net2": "3a:01:7b:9d:5a:b5",
            "net3": "1a:c5:48:8b:1c:9c",
            "net4": "de:b7:5d:c9:1c:55",
            "net5": "ae:89:47:ce:d7:14",
            "net6": "52:08:6d:9b:c0:b1",
            "net7": "6e:52:35:93:ae:bf",
            "net8": "36:11:bb:88:a8:23"
        },
        "leaf_1_0_3": {
            "net0": "0e:c2:e9:49:be:0d",
            "net1": "f2:18:9f:40:43:5f",
            "net2": "ee:ee:9e:f5:57:fe",
            "net3": "1e:cf:1f:94:b9:97",
            "net4": "32:c5:54:56:72:38",
            "net5": "fa:1a:12:4a:c2:72",
            "net6": "56:18:10:1a:57:ee",
            "net7": "ee:a1:1f:ec:da:b8",
            "net8": "a6:16:c4:0b:2a:e5"
        },
        "leaf_1_0_4": {
            "net0": "6a:f5:0d:21:82:8d",
            "net1": "c2:ca:cb:17:19:6f",
            "net2": "32:6e:c9:2f:3a:87",
            "net3": "ee:7c:75:d0:06:e9",
            "net4": "1e:9f:e8:ef:3b:fb",
            "net5": "4e:76:4f:71:8e:48",
            "net6": "26:29:29:48:ac:49",
            "net7": "be:b0:be:88:12:2d",
            "net8": "b2:d9:42:60:05:78"
        },
        "leaf_1_0_5": {
            "net0": "46:a9:bd:ad:df:87",
            "net1": "32:7a:7d:d9:43:b1",
            "net2": "4a:19:a3:1b:dc:17",
            "net3": "92:66:ef:50:36:3b",
            "net4": "4a:48:9f:56:1a:74",
            "net5": "5a:3c:6a:ad:6b:4b",
            "net6": "ee:e2:a2:c0:65:42",
            "net7": "7a:ab:a9:6a:3a:60",
            "net8": "fe:67:6b:5f:a4:5b"
        },
        "leaf_1_0_6": {
            "net0": "6e:38:7b:f8:41:6b",
            "net1": "ba:48:22:65:f8:22",
            "net2": "06:7d:c8:2f:4b:0f",
            "net3": "f2:39:15:4c:4c:b5",
            "net4": "da:42:f4:b8:ef:0c",
            "net5": "4e:05:fb:60:4c:f3",
            "net6": "4e:3d:07:79:69:d1",
            "net7": "86:e0:64:23:93:23",
            "net8": "12:ce:ab:f7:de:66"
        },
        "leaf_1_0_7": {
            "net0": "92:25:16:b1:66:dd",
            "net1": "a6:ae:2a:22:fd:9d",
            "net2": "6e:46:f4:b0:45:29",
            "net3": "a6:44:66:18:20:0e",
            "net4": "5a:5c:31:42:b0:49",
            "net5": "b6:4a:01:98:7b:66",
            "net6": "16:58:5a:90:89:1a",
            "net7": "b6:54:61:64:fe:dc",
            "net8": "26:89:64:80:ba:8f"
        },
        "leaf_1_0_8": {
            "net0": "06:da:75:48:7c:e3",
            "net1": "62:4f:d5:f9:dc:cf",
            "net2": "e2:fc:b1:09:a3:01",
            "net3": "2a:3b:fc:5f:9d:52",
            "net4": "4e:5d:80:41:c2:88",
            "net5": "1a:cf:49:ee:21:f3",
            "net6": "7e:ad:20:12:c1:64",
            "net7": "ae:0a:a0:10:9f:b5",
            "net8": "ba:52:63:be:7f:b5"
        },
        "leaf_2_0_1": {
            "net0": "0e:57:ec:9f:4d:22",
            "net1": "26:e2:b6:2d:c7:76",
            "net2": "62:2b:80:21:7e:7b",
            "net3": "26:69:0e:8b:74:d4",
            "net4": "5e:4c:8d:e1:dd:a1",
            "net5": "4e:12:5d:33:77:13",
            "net6": "42:b8:00:be:d9:97",
            "net7": "56:d6:32:d3:52:65",
            "net8": "d6:17:a6:3f:13:57"
        },
        "leaf_2_0_2": {
            "net0": "66:8f:84:7f:16:45",
            "net1": "7a:4d:ee:68:5d:6f",
            "net2": "12:1d:70:bb:19:58",
            "net3": "b6:46:a8:bd:95:e1",
            "net4": "ce:6e:a8:80:03:a6",
            "net5": "06:84:b2:af:f5:27",
            "net6": "5e:14:5f:3b:36:1d",
            "net7": "76:5f:73:c6:12:06",
            "net8": "9a:83:98:6b:f8:2b"
        },
        "leaf_2_0_3": {
            "net0": "02:c1:7b:6f:53:e6",
            "net1": "be:00:e6:5e:ae:6a",
            "net2": "e6:cf:6f:33:39:4b",
            "net3": "f2:41:9c:b1:fe:c4",
            "net4": "16:69:8c:3d:17:db",
            "net5": "6e:e5:2e:ce:09:53",
            "net6": "76:81:fd:65:09:5c",
            "net7": "2e:dd:cc:63:44:11",
            "net8": "52:e9:59:42:28:81"
        },
        "leaf_2_0_4": {
            "net0": "9e:5b:08:43:6b:bb",
            "net1": "36:04:02:09:ff:58",
            "net2": "1e:92:01:d3:e1:b5",
            "net3": "ba:bd:b4:e6:d1:bc",
            "net4": "52:b6:fd:76:20:d7",
            "net5": "2a:3c:5f:a7:16:94",
            "net6": "ca:c7:2c:7a:e7:70",
            "net7": "06:93:c8:02:c1:d1",
            "net8": "06:d5:43:8f:ff:2a"
        },
        "leaf_2_0_5": {
            "net0": "b2:7a:46:ed:68:36",
            "net1": "4e:cf:e6:76:22:c2",
            "net2": "52:16:f2:6f:e1:2c",
            "net3": "72:46:b4:f6:b2:90",
            "net4": "96:69:75:8e:43:32",
            "net5": "fa:8d:13:a9:70:a6",
            "net6": "26:c1:64:9c:37:08",
            "net7": "9e:3e:18:d7:33:17",
            "net8": "22:6c:89:ea:66:a8"
        },
        "leaf_2_0_6": {
            "net0": "86:4f:3d:bb:68:2f",
            "net1": "06:94:26:13:fe:96",
            "net2": "4a:58:e0:e5:d7:08",
            "net3": "1e:e4:38:f4:57:d3",
            "net4": "46:d3:bc:88:30:66",
            "net5": "a2:17:3c:10:5c:42",
            "net6": "56:4a:f2:74:47:79",
            "net7": "36:87:5e:5b:9b:20",
            "net8": "d6:65:cf:b2:52:aa"
        },
        "leaf_2_0_7": {
            "net0": "ce:a1:22:d7:88:ca",
            "net1": "de:0c:c7:6f:39:fd",
            "net2": "fa:33:8f:3a:96:b9",
            "net3": "32:9e:64:bc:f1:d7",
            "net4": "52:95:5c:48:c5:a9",
            "net5": "7e:f4:56:56:24:a3",
            "net6": "06:c3:ed:33:3e:a3",
            "net7": "ee:b8:00:a8:6b:f7",
            "net8": "9a:f4:1b:b2:94:e2"
        },
        "leaf_2_0_8": {
            "net0": "b2:97:64:85:29:5b",
            "net1": "5a:9e:70:7b:7e:b8",
            "net2": "06:c2:57:4e:2d:fd",
            "net3": "be:81:c6:54:53:22",
            "net4": "ba:e5:9f:8d:6e:e7",
            "net5": "92:72:b6:8d:c3:ae",
            "net6": "f2:a1:d5:ab:6a:cc",
            "net7": "f2:8b:87:b1:6b:fd",
            "net8": "2e:61:52:37:21:6a"
        },
        "leaf_3_0_1": {
            "net0": "de:7e:54:ea:af:4a",
            "net1": "e6:08:b1:19:f9:54",
            "net2": "82:26:c7:c5:35:8e",
            "net3": "de:61:5a:17:7e:d1",
            "net4": "a2:89:07:ca:2d:e1",
            "net5": "42:f4:68:55:b0:cb",
            "net6": "2e:d9:49:c3:a9:46",
            "net7": "a2:0c:7e:13:6d:09",
            "net8": "86:26:fd:4b:21:75"
        },
        "leaf_3_0_2": {
            "net0": "6e:04:bf:24:07:04",
            "net1": "86:11:f4:c6:6a:ae",
            "net2": "82:8b:56:c9:e5:65",
            "net3": "1e:21:ed:c1:49:b5",
            "net4": "e6:fa:98:89:f2:f2",
            "net5": "f2:16:b6:1c:83:df",
            "net6": "ce:f7:f4:b2:2b:8d",
            "net7": "06:c8:8d:ea:08:4a",
            "net8": "06:46:74:b2:b2:f4"
        },
        "leaf_3_0_3": {
            "net0": "b6:d2:2d:92:0a:12",
            "net1": "4a:dd:ac:39:ea:ad",
            "net2": "ee:15:de:14:7d:c1",
            "net3": "96:1b:79:d6:f5:19",
            "net4": "8e:7b:13:1b:be:5d",
            "net5": "9e:ae:3c:bd:25:9e",
            "net6": "46:ac:b8:87:52:23",
            "net7": "86:3d:43:e3:32:d2",
            "net8": "8e:22:8b:80:ea:e6"
        },
        "leaf_3_0_4": {
            "net0": "6e:88:37:ac:af:e9",
            "net1": "0e:45:bc:ac:be:05",
            "net2": "b2:c4:2b:fd:09:c2",
            "net3": "c6:67:6e:47:0a:db",
            "net4": "0e:25:08:8a:ab:29",
            "net5": "46:68:88:48:90:ae",
            "net6": "86:8b:00:1e:c3:1a",
            "net7": "46:28:27:9b:83:a3",
            "net8": "8e:3f:90:5f:b9:c0"
        },
        "leaf_3_0_5": {
            "net0": "26:76:af:f5:f8:4d",
            "net1": "76:02:31:34:f5:51",
            "net2": "c6:11:45:8f:bb:ee",
            "net3": "86:a5:dd:55:c7:a9",
            "net4": "1e:35:b2:42:17:40",
            "net5": "22:6a:49:14:cc:87",
            "net6": "5a:32:9c:19:99:9d",
            "net7": "be:46:e2:85:b1:ff",
            "net8": "5e:47:2f:68:3a:67"
        },
        "leaf_3_0_6": {
            "net0": "82:da:54:16:40:3c",
            "net1": "82:b1:df:b6:4d:82",
            "net2": "ba:fe:b1:e1:6b:c4",
            "net3": "b2:30:a6:a9:35:0c",
            "net4": "fe:83:e0:bc:2c:45",
            "net5": "16:38:3b:8c:4a:df",
            "net6": "da:e7:64:b4:d6:45",
            "net7": "02:f3:d3:af:70:15",
            "net8": "1e:c9:25:e5:71:27"
        },
        "leaf_3_0_7": {
            "net0": "0a:c8:96:67:09:f3",
            "net1": "72:8f:d3:bb:24:81",
            "net2": "96:fe:d0:15:8a:79",
            "net3": "16:9d:f3:1c:9b:cc",
            "net4": "ba:78:f1:26:d9:5a",
            "net5": "3a:c0:bc:4e:6a:f0",
            "net6": "86:20:c4:70:c8:4a",
            "net7": "9e:79:1f:c8:e8:33",
            "net8": "02:b7:91:9b:9a:5f"
        },
        "leaf_3_0_8": {
            "net0": "4e:04:2a:b2:c5:1c",
            "net1": "42:f2:48:9d:81:aa",
            "net2": "32:92:d5:52:e6:1a",
            "net3": "aa:8d:da:4d:7d:63",
            "net4": "16:c9:d6:79:08:19",
            "net5": "f2:52:da:db:34:df",
            "net6": "12:44:28:45:c0:de",
            "net7": "ca:19:53:a0:5b:58",
            "net8": "ee:c8:df:14:55:1a"
        },
        "leaf_4_0_1": {
            "net0": "aa:bd:30:dd:cb:25",
            "net1": "aa:f5:85:d5:63:27",
            "net2": "c2:2f:d4:0e:8b:b7",
            "net3": "c2:19:af:d3:bc:e6",
            "net4": "f6:d8:8e:8e:65:c8",
            "net5": "2a:08:f6:50:00:03",
            "net6": "0a:f1:ae:df:66:fd",
            "net7": "46:f7:01:67:8b:3e",
            "net8": "9a:88:89:ca:0b:8b"
        },
        "leaf_4_0_2": {
            "net0": "62:06:4e:a8:58:14",
            "net1": "46:ba:0b:f9:50:41",
            "net2": "9e:6d:4d:5f:59:b5",
            "net3": "8e:99:07:77:02:fb",
            "net4": "52:3a:76:7f:a0:44",
            "net5": "8a:f0:e2:29:ab:a0",
            "net6": "3e:e9:9a:77:cd:46",
            "net7": "a2:bd:69:90:1a:77",
            "net8": "62:bb:04:72:e1:80"
        },
        "leaf_4_0_3": {
            "net0": "ea:df:68:b0:29:22",
            "net1": "5a:2f:2e:39:73:3e",
            "net2": "0e:65:84:3c:15:2d",
            "net3": "f2:69:88:d0:b9:8f",
            "net4": "82:17:44:c5:3c:c1",
            "net5": "9a:59:2b:f1:e5:21",
            "net6": "8e:17:0b:04:b7:08",
            "net7": "0e:ab:85:3c:f7:94",
            "net8": "b6:03:23:60:a4:e0"
        },
        "leaf_4_0_4": {
            "net0": "66:7c:bf:45:59:ed",
            "net1": "5a:c7:6d:e6:d7:b6",
            "net2": "16:d0:1b:28:f3:6e",
            "net3": "be:9f:ae:bd:fb:07",
            "net4": "6a:ad:bc:f5:ff:26",
            "net5": "3a:1d:af:b9:b4:42",
            "net6": "9e:84:c6:f3:2b:cc",
            "net7": "f2:00:d1:1d:97:b1",
            "net8": "22:15:cb:45:a1:15"
        },
        "leaf_4_0_5": {
            "net0": "96:a3:f6:08:81:21",
            "net1": "9e:39:a7:0f:2f:64",
            "net2": "a2:a9:3f:31:40:8b",
            "net3": "ca:88:bd:b0:d5:b3",
            "net4": "7e:39:f2:d7:0d:a0",
            "net5": "86:b0:4d:8c:1f:9d",
            "net6": "36:59:14:e9:90:0b",
            "net7": "42:82:f1:53:2d:d3",
            "net8": "3e:17:44:26:53:10"
        },
        "leaf_4_0_6": {
            "net0": "26:7d:c9:7c:a9:40",
            "net1": "06:ff:54:5a:11:44",
            "net2": "aa:a8:3f:84:da:50",
            "net3": "3e:cb:fd:0a:95:ea",
            "net4": "f6:bf:04:3d:cd:03",
            "net5": "de:ff:3e:39:93:2d",
            "net6": "1e:15:37:b9:e1:e6",
            "net7": "26:ef:ef:c6:b4:52",
            "net8": "de:5e:8a:c0:66:0a"
        },
        "leaf_4_0_7": {
            "net0": "82:61:3d:6a:7b:a7",
            "net1": "9e:a6:50:a6:78:10",
            "net2": "1e:de:18:b5:a5:af",
            "net3": "d2:86:cf:60:b0:de",
            "net4": "32:e4:b2:c6:3a:36",
            "net5": "2e:57:56:18:10:b4",
            "net6": "02:ce:6f:65:60:b6",
            "net7": "c2:d0:71:52:e5:e8",
            "net8": "f2:31:9a:2e:9a:fa"
        },
        "leaf_4_0_8": {
            "net0": "6a:35:55:47:03:0e",
            "net1": "36:33:3f:73:bc:0d",
            "net2": "8a:5b:58:6f:af:ee",
            "net3": "e2:f2:ae:49:a2:d3",
            "net4": "ba:91:5b:fd:95:14",
            "net5": "2e:57:ca:7c:52:88",
            "net6": "4e:bc:c2:4b:4b:cc",
            "net7": "16:e8:65:9d:bc:1e",
            "net8": "7a:ed:24:7a:23:87"
        },
        "leaf_5_0_1": {
            "net0": "be:bd:e0:83:9e:85",
            "net1": "8a:aa:f9:08:44:13",
            "net2": "8a:e7:90:4c:e9:9a",
            "net3": "32:c2:c8:77:af:d4",
            "net4": "ca:5b:1c:3b:a6:68",
            "net5": "46:9a:03:0f:b9:e2",
            "net6": "16:de:19:0b:1e:9a",
            "net7": "ce:31:e5:17:a1:6d",
            "net8": "72:96:47:ce:d9:d6"
        },
        "leaf_5_0_2": {
            "net0": "62:57:95:ec:a1:bb",
            "net1": "fe:04:02:56:65:7b",
            "net2": "5a:43:25:a8:5d:94",
            "net3": "4a:cc:78:20:08:5d",
            "net4": "b6:a2:6f:04:b6:20",
            "net5": "de:7a:3b:a0:40:a3",
            "net6": "62:66:86:8a:8a:a0",
            "net7": "3a:8b:0b:12:20:73",
            "net8": "8e:99:e4:f7:45:5d"
        },
        "leaf_5_0_3": {
            "net0": "b2:b8:71:2c:68:2c",
            "net1": "56:ad:f4:55:00:88",
            "net2": "1a:33:68:6b:e2:a6",
            "net3": "86:24:10:69:99:b8",
            "net4": "c6:7e:ef:1b:a6:5e",
            "net5": "72:45:36:d1:23:24",
            "net6": "ba:f4:83:f4:6b:71",
            "net7": "c2:f8:57:07:7c:5b",
            "net8": "16:57:e2:4d:db:28"
        },
        "leaf_5_0_4": {
            "net0": "52:fc:b8:d2:d6:4f",
            "net1": "5a:dd:34:a6:80:8e",
            "net2": "ae:e0:52:38:8a:ad",
            "net3": "5e:ce:8a:f9:46:af",
            "net4": "32:dc:4f:9e:01:8e",
            "net5": "d6:d0:6b:51:60:54",
            "net6": "2a:ef:65:bd:83:23",
            "net7": "de:2a:f7:19:59:63",
            "net8": "0a:e0:18:21:3d:8c"
        },
        "leaf_5_0_5": {
            "net0": "86:c3:cd:a0:5a:2c",
            "net1": "fe:de:57:9f:c8:4e",
            "net2": "8e:d6:d8:eb:6f:bf",
            "net3": "fe:dd:01:8d:57:04",
            "net4": "f2:14:6a:5c:ed:5d",
            "net5": "42:02:75:22:c7:81",
            "net6": "ee:c8:20:18:24:7c",
            "net7": "8a:55:17:e1:ab:54",
            "net8": "da:52:7e:6c:8c:53"
        },
        "leaf_5_0_6": {
            "net0": "f6:8a:4e:a4:10:fe",
            "net1": "c6:99:f4:f1:61:e7",
            "net2": "12:31:66:c2:70:c0",
            "net3": "3e:19:7f:2f:3b:3d",
            "net4": "fa:2a:40:53:50:e5",
            "net5": "fa:50:b7:cd:f7:79",
            "net6": "52:85:df:10:2e:cb",
            "net7": "c6:7e:7a:8f:06:41",
            "net8": "16:8e:55:d5:fe:3d"
        },
        "leaf_5_0_7": {
            "net0": "56:62:01:55:29:f1",
            "net1": "c6:7c:26:12:e1:3c",
            "net2": "b6:49:35:92:9a:ce",
            "net3": "0a:e8:53:3c:61:54",
            "net4": "fe:14:72:05:1c:3c",
            "net5": "be:6b:1c:13:43:d5",
            "net6": "d2:b8:3b:0b:1c:4f",
            "net7": "76:f0:ee:7d:3e:4f",
            "net8": "aa:34:ad:f5:0c:f6"
        },
        "leaf_5_0_8": {
            "net0": "42:e1:18:d4:3c:c2",
            "net1": "2e:6c:fa:36:5b:25",
            "net2": "8e:eb:9f:fe:43:fe",
            "net3": "56:a9:b2:c6:69:04",
            "net4": "8a:b2:4a:d4:21:98",
            "net5": "36:48:0f:e7:1c:bd",
            "net6": "7e:45:68:f6:b5:a7",
            "net7": "6e:9f:50:bd:a5:8b",
            "net8": "6a:0c:05:32:fb:9c"
        },
        "leaf_6_0_1": {
            "net0": "ea:57:f4:22:fe:45",
            "net1": "4e:e5:94:a4:88:93",
            "net2": "16:26:c9:e3:99:ff",
            "net3": "da:72:56:31:33:6f",
            "net4": "ca:72:9b:90:5e:1a",
            "net5": "ca:6b:77:30:26:58",
            "net6": "32:9c:e5:78:9b:18",
            "net7": "aa:87:13:9f:ca:e1",
            "net8": "e6:12:44:e3:ec:01"
        },
        "leaf_6_0_2": {
            "net0": "86:6c:be:aa:b3:e3",
            "net1": "fa:93:b5:87:82:09",
            "net2": "22:c9:17:b5:6c:aa",
            "net3": "ce:64:78:e4:80:3d",
            "net4": "a2:69:d2:8b:57:99",
            "net5": "ee:73:1f:f4:c2:fb",
            "net6": "8a:1a:09:23:8f:99",
            "net7": "de:31:34:fd:95:02",
            "net8": "4a:6d:4e:b9:6b:9c"
        },
        "leaf_6_0_3": {
            "net0": "9e:c6:43:f7:6b:05",
            "net1": "42:8d:2e:6c:a6:61",
            "net2": "96:82:3a:58:7f:ad",
            "net3": "56:f4:de:d2:22:34",
            "net4": "b2:57:8f:e5:ee:e2",
            "net5": "0a:7f:f3:33:3e:f4",
            "net6": "ce:eb:fe:1d:57:17",
            "net7": "f2:ce:11:46:50:01",
            "net8": "ca:1f:bf:92:67:cc"
        },
        "leaf_6_0_4": {
            "net0": "6a:5b:34:2f:e9:01",
            "net1": "ce:8a:96:af:8b:b4",
            "net2": "2a:b2:75:d1:a4:23",
            "net3": "0a:4c:7f:d3:f9:90",
            "net4": "ea:65:3b:6f:01:a0",
            "net5": "06:09:0e:89:a2:22",
            "net6": "fa:c9:00:ad:ad:4d",
            "net7": "8a:82:60:40:e0:1b",
            "net8": "7a:ae:66:c7:20:07"
        },
        "leaf_6_0_5": {
            "net0": "8e:66:72:09:1a:c9",
            "net1": "0a:7a:09:01:a3:0a",
            "net2": "6e:42:b5:42:51:fa",
            "net3": "6e:9b:04:b2:e5:75",
            "net4": "d2:e5:cf:a0:29:58",
            "net5": "e6:2b:78:7f:33:92",
            "net6": "9e:2e:2d:2b:1e:ec",
            "net7": "a2:a1:62:52:22:04",
            "net8": "1a:fc:21:e2:75:7c"
        },
        "leaf_6_0_6": {
            "net0": "22:94:99:b2:17:85",
            "net1": "ee:ba:10:f5:fc:a5",
            "net2": "0e:2d:8c:36:a7:79",
            "net3": "0e:ff:86:46:ee:b4",
            "net4": "6a:19:27:88:f8:42",
            "net5": "4a:53:e6:f4:bd:15",
            "net6": "06:ab:05:82:2e:62",
            "net7": "7e:da:63:00:cd:c0",
            "net8": "c6:92:bf:cc:17:1f"
        },
        "leaf_6_0_7": {
            "net0": "c6:a3:49:44:f1:2f",
            "net1": "12:d6:21:27:a6:c8",
            "net2": "02:bc:cd:8c:19:92",
            "net3": "22:65:10:d5:9f:59",
            "net4": "22:e8:58:1b:72:e0",
            "net5": "a2:0d:74:01:bf:ed",
            "net6": "6a:c2:04:30:61:fa",
            "net7": "46:5e:ff:05:20:e5",
            "net8": "46:93:ee:6f:42:17"
        },
        "leaf_6_0_8": {
            "net0": "f6:af:c7:7e:d5:99",
            "net1": "ba:36:29:59:f6:3b",
            "net2": "76:84:03:0a:40:b9",
            "net3": "1e:fa:8a:05:a2:0e",
            "net4": "ba:ab:66:d2:1b:12",
            "net5": "26:9c:66:76:8b:28",
            "net6": "a2:4e:ec:47:5a:db",
            "net7": "0e:e8:bf:af:dc:95",
            "net8": "c2:bf:9a:50:18:af"
        },
        "leaf_7_0_1": {
            "net0": "82:70:3f:34:a7:83",
            "net1": "3a:1c:df:7e:91:46",
            "net2": "9e:1e:8b:6e:cb:60",
            "net3": "e6:7b:da:7c:4f:ca",
            "net4": "ca:d5:2e:95:4a:9f",
            "net5": "2a:f1:3b:48:24:d0",
            "net6": "e2:18:ad:3c:bb:77",
            "net7": "c6:6a:3c:e5:78:87",
            "net8": "86:a3:11:f5:98:e4"
        },
        "leaf_7_0_2": {
            "net0": "8a:ef:1c:7b:99:e2",
            "net1": "ba:37:50:64:bb:b9",
            "net2": "ee:0a:ab:7c:b9:62",
            "net3": "f6:77:ff:1c:2a:8c",
            "net4": "42:1e:29:40:42:8c",
            "net5": "62:7d:16:90:81:7c",
            "net6": "6e:e7:e4:2a:b5:cb",
            "net7": "ae:8a:e2:53:5c:63",
            "net8": "b6:51:31:e1:ec:2b"
        },
        "leaf_7_0_3": {
            "net0": "3e:b8:a8:03:86:01",
            "net1": "e6:70:30:0b:c7:bd",
            "net2": "ea:f5:f2:a1:64:ca",
            "net3": "9a:fe:c6:91:68:95",
            "net4": "32:0e:96:86:d3:c9",
            "net5": "3e:2d:4f:55:c7:42",
            "net6": "8a:74:57:d5:54:8c",
            "net7": "2a:20:85:1a:9a:2f",
            "net8": "e6:6b:9c:16:f9:80"
        },
        "leaf_7_0_4": {
            "net0": "ca:62:3b:52:b8:0c",
            "net1": "c6:2d:1c:cf:ef:39",
            "net2": "1a:81:b0:aa:72:60",
            "net3": "b2:1f:64:02:b1:d3",
            "net4": "8a:e1:8b:fc:84:e9",
            "net5": "be:c4:ef:34:9a:91",
            "net6": "ee:21:df:6c:de:bc",
            "net7": "a2:11:23:e3:09:b1",
            "net8": "16:80:3e:6d:d7:17"
        },
        "leaf_7_0_5": {
            "net0": "7a:7c:a7:27:60:02",
            "net1": "4e:fd:03:c1:46:1d",
            "net2": "9e:9b:5f:ad:08:5e",
            "net3": "ae:6d:cc:c6:ae:6b",
            "net4": "2e:46:94:90:6f:33",
            "net5": "82:54:d1:18:7d:99",
            "net6": "3e:a0:c1:ff:fa:b4",
            "net7": "96:94:d1:74:f4:34",
            "net8": "52:bb:3d:ca:c2:3c"
        },
        "leaf_7_0_6": {
            "net0": "de:b1:19:4c:69:f1",
            "net1": "02:3d:38:65:a6:04",
            "net2": "36:25:16:e2:f5:a9",
            "net3": "c2:a5:8d:d6:18:1f",
            "net4": "46:c7:3f:f7:bc:53",
            "net5": "26:80:5a:f0:bf:63",
            "net6": "56:3c:77:de:60:d4",
            "net7": "6a:78:17:20:e3:ed",
            "net8": "2a:86:79:83:73:05"
        },
        "leaf_7_0_7": {
            "net0": "86:af:63:d9:5b:d7",
            "net1": "d2:18:a0:c6:e1:7d",
            "net2": "ba:a5:f4:26:e3:33",
            "net3": "fe:26:43:c4:f2:7e",
            "net4": "ae:f9:14:ff:ba:e1",
            "net5": "0a:04:02:af:81:4e",
            "net6": "1a:e1:58:e8:85:2e",
            "net7": "fe:66:51:ca:b1:f9",
            "net8": "02:fa:37:24:8d:06"
        },
        "leaf_7_0_8": {
            "net0": "32:e7:dd:55:99:6f",
            "net1": "42:56:82:f4:b1:0a",
            "net2": "5e:95:68:9a:5c:bf",
            "net3": "5a:e8:ae:7f:a8:2c",
            "net4": "2a:9f:3e:2a:97:26",
            "net5": "06:15:1f:f8:ab:cc",
            "net6": "2e:8c:02:97:d9:aa",
            "net7": "62:47:b8:54:0d:02",
            "net8": "8e:f0:3a:a2:94:ac"
        },
        "leaf_8_0_1": {
            "net0": "e2:fd:a9:65:84:cb",
            "net1": "0a:38:dc:22:d3:a7",
            "net2": "da:02:f9:7d:f4:f2",
            "net3": "56:85:ec:7d:a8:d6",
            "net4": "8a:28:84:04:3c:06",
            "net5": "de:67:06:96:7f:0d",
            "net6": "76:86:79:35:bf:fb",
            "net7": "da:c6:8a:2d:38:5f",
            "net8": "9e:f7:8c:a5:31:c6"
        },
        "leaf_8_0_2": {
            "net0": "6a:bf:c2:20:8c:31",
            "net1": "0e:84:81:0b:35:10",
            "net2": "a2:68:e8:e8:65:84",
            "net3": "d2:df:5a:2b:1e:b7",
            "net4": "fe:61:dd:18:f5:c5",
            "net5": "2e:ec:9a:30:38:f8",
            "net6": "82:b9:6c:b3:fc:bf",
            "net7": "e6:32:76:a8:a7:b8",
            "net8": "de:ca:94:69:e6:81"
        },
        "leaf_8_0_3": {
            "net0": "ce:80:09:af:31:ba",
            "net1": "92:74:70:93:42:ea",
            "net2": "e2:62:75:c6:0b:1c",
            "net3": "d6:16:80:99:1a:f2",
            "net4": "ee:26:54:ce:f6:0a",
            "net5": "9e:45:25:d5:49:d4",
            "net6": "b6:e6:cb:88:68:66",
            "net7": "6a:c0:74:cc:e4:db",
            "net8": "6a:10:bc:32:9d:a0"
        },
        "leaf_8_0_4": {
            "net0": "6e:43:bc:13:0f:f1",
            "net1": "ba:be:90:9f:91:9a",
            "net2": "46:2d:71:f6:73:c7",
            "net3": "ea:76:c1:af:0e:10",
            "net4": "6e:0a:2f:44:18:ca",
            "net5": "02:8f:c2:fa:ed:49",
            "net6": "3a:72:06:72:ac:87",
            "net7": "ca:90:7b:9e:2b:47",
            "net8": "86:7c:b8:c4:74:27"
        },
        "leaf_8_0_5": {
            "net0": "4e:74:ad:fb:d0:f8",
            "net1": "62:34:6e:d8:01:6c",
            "net2": "c2:86:a8:7e:fd:21",
            "net3": "42:86:5d:ef:62:25",
            "net4": "f2:ab:d5:d8:ff:5b",
            "net5": "ce:70:93:5c:34:69",
            "net6": "5a:72:0b:34:8f:00",
            "net7": "6e:99:63:5f:d4:f2",
            "net8": "26:a3:4e:5b:b3:c8"
        },
        "leaf_8_0_6": {
            "net0": "9e:e2:b1:67:bf:4b",
            "net1": "ca:fe:e1:96:81:b0",
            "net2": "12:b1:c8:0e:89:2d",
            "net3": "86:fb:87:52:91:6a",
            "net4": "b6:c1:92:cf:d4:20",
            "net5": "1a:72:57:a6:13:e3",
            "net6": "1a:86:52:df:d7:ca",
            "net7": "62:f2:c6:44:0b:92",
            "net8": "96:bd:ee:cf:17:19"
        },
        "leaf_8_0_7": {
            "net0": "82:2a:5e:e3:87:29",
            "net1": "66:0a:64:cc:6e:5c",
            "net2": "ce:ac:75:48:38:7b",
            "net3": "f2:2f:52:7d:c7:ec",
            "net4": "8a:6d:c9:91:92:5d",
            "net5": "56:c4:ab:77:25:d3",
            "net6": "92:55:1d:ae:70:39",
            "net7": "8e:07:26:24:e6:c0",
            "net8": "66:52:f8:4c:09:c9"
        },
        "leaf_8_0_8": {
            "net0": "0a:71:c9:a4:4c:01",
            "net1": "de:5b:b8:bd:31:c5",
            "net2": "b2:f6:5e:41:bb:1a",
            "net3": "76:f0:18:d1:cf:13",
            "net4": "de:be:83:d8:c0:a3",
            "net5": "0a:67:58:4f:27:84",
            "net6": "ee:1e:c7:31:32:3e",
            "net7": "1e:dc:c5:e2:58:90",
            "net8": "06:7c:02:ca:c5:ea"
        },
        "spine_1_1_1": {
            "net0": "ee:da:60:ff:bb:c3",
            "net1": "5e:2e:6d:a2:4f:10",
            "net10": "4a:c9:32:b6:85:b7",
            "net11": "6e:62:59:30:6a:42",
            "net12": "62:05:7c:7d:2d:34",
            "net13": "8a:b6:10:20:9d:1c",
            "net14": "d2:20:02:7b:5f:a1",
            "net15": "06:3b:be:b0:16:b2",
            "net2": "76:c0:9f:fb:37:b4",
            "net3": "86:2a:6b:a1:86:bb",
            "net4": "b6:f6:2d:28:0c:35",
            "net5": "56:70:85:6d:c5:e1",
            "net6": "36:eb:80:b4:2c:66",
            "net7": "4a:c9:34:fd:86:91",
            "net8": "12:7e:45:96:35:39",
            "net9": "a6:b8:b1:30:ae:8f"
        },
        "spine_1_1_2": {
            "net0": "e2:66:21:f9:2d:9f",
            "net1": "02:a6:1f:71:46:c7",
            "net10": "5a:0e:a5:d3:b8:70",
            "net11": "42:39:58:a7:a1:49",
            "net12": "8e:ac:7a:78:97:3b",
            "net13": "fe:59:79:76:de:bb",
            "net14": "66:47:02:ef:83:d2",
            "net15": "ae:ae:0d:4d:a0:64",
            "net2": "06:25:a3:b7:30:94",
            "net3": "7e:b8:9c:b1:5e:28",
            "net4": "c2:2e:eb:a1:1c:c0",
            "net5": "e2:87:ab:33:02:81",
            "net6": "1e:43:03:26:6e:c4",
            "net7": "4a:41:61:0e:a2:ae",
            "net8": "2e:be:f9:c0:67:d4",
            "net9": "c6:84:d5:12:98:38"
        },
        "spine_1_1_3": {
            "net0": "de:96:57:5a:73:03",
            "net1": "22:5a:5c:01:21:ca",
            "net10": "5e:22:69:03:25:f0",
            "net11": "f6:28:38:75:54:57",
            "net12": "22:43:f9:29:a7:5e",
            "net13": "ca:a7:4f:b1:94:e6",
            "net14": "12:65:c2:6c:28:90",
            "net15": "52:6a:ae:d5:c4:8c",
            "net2": "b2:2e:9f:8f:42:b2",
            "net3": "52:46:5c:b8:89:0e",
            "net4": "3a:67:25:33:12:0a",
            "net5": "d2:ac:1e:9e:25:8a",
            "net6": "fa:b3:27:1f:b9:22",
            "net7": "82:8b:15:ae:f3:18",
            "net8": "9e:d9:50:17:2b:76",
            "net9": "32:4c:0f:11:0f:38"
        },
        "spine_1_1_4": {
            "net0": "d2:3c:e7:74:07:4c",
            "net1": "0e:4b:85:6f:c9:2a",
            "net10": "d6:33:e0:07:23:59",
            "net11": "fe:76:ee:05:ef:59",
            "net12": "a6:4a:b5:6f:3e:21",
            "net13": "be:d3:e7:9f:02:fe",
            "net14": "96:31:0a:ac:7b:b6",
            "net15": "66:99:87:f2:be:d4",
            "net2": "de:d0:ac:ca:a0:35",
            "net3": "fe:10:a3:3b:e1:a3",
            "net4": "16:47:99:29:52:29",
            "net5": "2a:b0:30:22:78:aa",
            "net6": "02:cf:ea:40:42:16",
            "net7": "7e:1b:77:e2:f1:f2",
            "net8": "2a:2d:f6:6a:11:d3",
            "net9": "fe:bf:3f:b9:03:91"
        },
        "spine_1_1_5": {
            "net0": "8e:84:b5:3d:c3:67",
            "net1": "02:9d:03:ae:70:4b",
            "net10": "a2:09:28:e9:72:ff",
            "net11": "0a:0f:6d:93:72:ec",
            "net12": "12:74:27:a0:f9:cc",
            "net13": "de:32:98:32:09:53",
            "net14": "5e:57:57:4b:50:89",
            "net15": "26:8c:70:d7:85:77",
            "net2": "f6:4a:4b:07:31:a8",
            "net3": "9a:8e:a7:97:d0:a5",
            "net4": "5a:64:46:0f:3d:eb",
            "net5": "42:4b:7f:94:d6:a8",
            "net6": "0e:cd:41:2a:32:14",
            "net7": "8e:09:10:a9:a4:cd",
            "net8": "2a:10:c4:84:eb:45",
            "net9": "e2:9f:a2:57:9c:18"
        },
        "spine_1_1_6": {
            "net0": "66:31:21:2c:e1:7c",
            "net1": "3e:a5:f5:39:93:b1",
            "net10": "2e:4f:f5:55:97:7e",
            "net11": "a6:6e:17:a6:2c:7d",
            "net12": "0e:d7:fc:59:94:6f",
            "net13": "32:c6:69:7c:4f:23",
            "net14": "26:4d:6e:31:9e:e1",
            "net15": "b6:69:fa:a6:e8:a2",
            "net2": "7a:98:c4:ad:67:d2",
            "net3": "32:34:18:50:39:e9",
            "net4": "ca:fd:7f:6d:1a:f4",
            "net5": "aa:d1:07:ee:b5:73",
            "net6": "0e:71:99:eb:36:14",
            "net7": "b6:c5:f4:e7:89:6f",
            "net8": "76:e9:5e:54:bc:18",
            "net9": "76:4a:28:52:01:b7"
        },
        "spine_1_1_7": {
            "net0": "b2:ee:b4:c0:a7:1e",
            "net1": "7a:1b:07:03:57:50",
            "net10": "36:41:3d:b8:25:db",
            "net11": "42:ef:de:77:17:40",
            "net12": "ea:a8:14:be:5f:c6",
            "net13": "06:8a:c9:53:07:de",
            "net14": "02:68:a0:f0:f0:14",
            "net15": "b6:c2:6a:8d:c4:1d",
            "net2": "6a:1a:7c:6f:97:1b",
            "net3": "1a:fd:1b:4d:8a:12",
            "net4": "c2:ee:60:4e:2b:03",
            "net5": "6a:47:ff:42:f6:e9",
            "net6": "92:5b:b7:40:4c:4d",
            "net7": "f6:87:b5:67:c9:46",
            "net8": "b6:24:4c:e5:74:cb",
            "net9": "36:e4:a3:2a:06:b5"
        },
        "spine_1_1_8": {
            "net0": "26:7c:d5:08:23:64",
            "net1": "d6:de:0e:50:58:3d",
            "net10": "86:de:98:b9:0d:0d",
            "net11": "9a:36:8e:63:e0:9e",
            "net12": "86:50:25:f7:2c:ac",
            "net13": "26:97:32:86:83:c3",
            "net14": "c2:05:44:f2:a4:d9",
            "net15": "c2:2d:68:c9:b4:b3",
            "net2": "4a:df:2f:fa:19:1f",
            "net3": "ba:a3:d5:ad:ca:82",
            "net4": "ba:17:4b:e9:2b:88",
            "net5": "9a:5b:d0:c5:be:b7",
            "net6": "ca:75:c4:66:8f:cf",
            "net7": "ba:11:4d:2a:d2:d9",
            "net8": "26:8d:b4:91:45:c0",
            "net9": "fe:d1:56:de:dd:ab"
        },
        "spine_2_1_1": {
            "net0": "4a:a7:b1:cb:bc:0a",
            "net1": "8e:88:e3:41:6c:45",
            "net10": "ee:ff:fb:cc:4f:ca",
            "net11": "26:6d:67:86:7a:1e",
            "net12": "f2:14:ef:70:2a:f0",
            "net13": "c6:f1:2d:20:13:9d",
            "net14": "66:00:18:60:e9:2c",
            "net15": "12:aa:05:4c:57:c2",
            "net2": "f6:3e:d9:c0:8d:79",
            "net3": "8e:29:cd:a5:32:c8",
            "net4": "7a:95:70:43:16:ab",
            "net5": "b6:66:55:a1:be:44",
            "net6": "5a:aa:39:52:3c:26",
            "net7": "d2:2b:63:70:c5:fc",
            "net8": "aa:02:43:a3:e2:df",
            "net9": "4a:66:27:d6:e9:da"
        },
        "spine_2_1_2": {
            "net0": "46:f2:43:64:cd:2a",
            "net1": "92:18:6d:28:95:fd",
            "net10": "32:9b:58:11:1d:bd",
            "net11": "4e:42:a6:c9:aa:a9",
            "net12": "86:42:14:69:19:bf",
            "net13": "3e:10:94:96:1b:6a",
            "net14": "5a:c1:38:db:e9:89",
            "net15": "0a:b0:d8:b1:88:c7",
            "net2": "56:3e:b7:7c:54:39",
            "net3": "ce:73:74:21:de:df",
            "net4": "c6:22:17:f5:fd:b8",
            "net5": "be:e1:78:18:02:38",
            "net6": "16:e6:54:c6:e6:43",
            "net7": "86:d5:cf:fd:c1:72",
            "net8": "ce:57:02:9a:0e:f7",
            "net9": "82:e3:6f:8e:50:23"
        },
        "spine_2_1_3": {
            "net0": "ae:d2:e6:6f:65:7c",
            "net1": "22:c0:7e:2e:8d:3b",
            "net10": "f2:45:a5:9d:dc:cc",
            "net11": "0a:5b:68:b7:d4:32",
            "net12": "36:50:bb:a7:f9:2f",
            "net13": "ca:29:b7:9f:f3:02",
            "net14": "7a:75:6f:7b:5c:d8",
            "net15": "ae:fb:b4:ba:fc:ec",
            "net2": "ee:2d:39:1d:57:f1",
            "net3": "96:9a:2a:62:74:5e",
            "net4": "da:9f:b3:30:21:83",
            "net5": "3a:10:2a:83:0a:40",
            "net6": "a6:0b:8a:b3:e5:5d",
            "net7": "9a:88:e4:64:52:e6",
            "net8": "f2:c9:51:f3:81:65",
            "net9": "8a:1a:a0:c2:5f:ca"
        },
        "spine_2_1_4": {
            "net0": "e2:a3:30:05:1d:de",
            "net1": "9e:6b:5d:5a:71:ba",
            "net10": "a6:30:5a:cd:c1:57",
            "net11": "56:86:f9:dd:8a:a1",
            "net12": "26:72:1e:4b:87:5a",
            "net13": "6e:ac:6d:3e:86:ea",
            "net14": "82:97:a7:0c:a0:b6",
            "net15": "c6:53:61:fc:28:b3",
            "net2": "2e:83:98:15:9f:d2",
            "net3": "32:18:91:8e:5d:a3",
            "net4": "2a:ce:55:51:97:9e",
            "net5": "5a:9e:f1:65:36:05",
            "net6": "2a:f1:3c:dd:20:dd",
            "net7": "e2:1d:ee:99:af:b1",
            "net8": "a2:6b:b9:b2:dc:e2",
            "net9": "66:aa:ac:8f:df:7c"
        },
        "spine_2_1_5": {
            "net0": "76:ed:8a:b1:f0:48",
            "net1": "4a:50:7d:02:b5:2e",
            "net10": "d6:40:11:30:fb:2f",
            "net11": "22:71:f3:fd:e5:2e",
            "net12": "c2:1d:e6:71:ed:ce",
            "net13": "46:8c:58:34:25:4f",
            "net14": "2a:97:d2:d9:a8:3d",
            "net15": "3a:8c:ad:c8:1c:81",
            "net2": "aa:b8:23:c3:25:ab",
            "net3": "b2:da:a3:c4:40:de",
            "net4": "fa:a6:d3:37:b9:7e",
            "net5": "9e:5b:a0:61:d1:90",
            "net6": "fe:c9:d9:1f:a6:c2",
            "net7": "66:56:6c:be:0c:b3",
            "net8": "02:37:0c:45:ab:b2",
            "net9": "be:c9:62:16:f1:12"
        },
        "spine_2_1_6": {
            "net0": "16:16:fd:07:e6:b7",
            "net1": "42:a0:d3:75:c5:44",
            "net10": "3a:29:22:f4:22:9e",
            "net11": "aa:3a:15:c9:ee:f6",
            "net12": "ea:c9:8d:78:ef:ad",
            "net13": "b6:1e:39:aa:2c:70",
            "net14": "aa:4d:c9:bf:8f:95",
            "net15": "ce:52:b6:a7:19:4c",
            "net2": "b6:42:ac:4a:a8:7e",
            "net3": "4a:fa:2b:69:ac:cd",
            "net4": "e2:bc:65:13:06:23",
            "net5": "6a:ae:dd:b4:6a:c5",
            "net6": "1a:cc:cd:45:2c:97",
            "net7": "86:f2:31:e6:be:0d",
            "net8": "16:93:c6:f8:8f:5f",
            "net9": "32:f6:f3:2f:d9:f8"
        },
        "spine_2_1_7": {
            "net0": "82:ec:cb:50:2d:df",
            "net1": "96:14:e2:6b:6c:92",
            "net10": "2a:68:ef:cd:e7:fb",
            "net11": "52:84:24:df:ed:85",
            "net12": "5a:f0:77:b1:f9:39",
            "net13": "d2:97:2a:95:12:bb",
            "net14": "96:6b:4d:54:e3:b1",
            "net15": "3a:fb:bf:fb:7f:02",
            "net2": "ca:dd:1f:c8:0c:57",
            "net3": "b2:74:fb:32:06:a6",
            "net4": "fa:7b:9e:ae:64:22",
            "net5": "ee:d4:21:9c:9a:07",
            "net6": "d2:3d:80:70:c2:05",
            "net7": "ba:f8:cb:b2:bd:0a",
            "net8": "8e:ba:a1:4e:af:88",
            "net9": "ce:42:d6:43:82:92"
        },
        "spine_2_1_8": {
            "net0": "26:a7:02:67:b4:e5",
            "net1": "8a:ae:87:36:70:9b",
            "net10": "4a:2b:d4:e4:13:a3",
            "net11": "d6:2e:b8:88:3a:02",
            "net12": "5a:ef:0d:77:a3:37",
            "net13": "d2:60:94:17:d9:34",
            "net14": "a6:90:0d:2e:ec:97",
            "net15": "46:78:7f:14:07:12",
            "net2": "8a:c8:59:83:e4:31",
            "net3": "c2:3e:89:90:6e:67",
            "net4": "4a:d0:3f:ed:9b:3d",
            "net5": "72:56:37:21:9e:25",
            "net6": "1e:41:6d:66:f3:c4",
            "net7": "86:5d:53:8c:7e:29",
            "net8": "5a:e2:d4:68:74:1d",
            "net9": "f6:92:66:95:5e:fb"
        },
        "spine_3_1_1": {
            "net0": "3a:8f:4a:ee:70:41",
            "net1": "9e:01:cf:09:f7:18",
            "net10": "9a:64:35:2b:2b:43",
            "net11": "82:db:91:bf:2a:75",
            "net12": "5e:ef:b6:a0:7e:cd",
            "net13": "f2:81:de:ab:15:fd",
            "net14": "e2:2b:f3:44:a5:3b",
            "net15": "72:93:91:47:b3:aa",
            "net2": "32:19:24:04:fe:97",
            "net3": "c6:d7:da:08:a4:af",
            "net4": "66:ad:0e:05:8a:ae",
            "net5": "52:3d:d0:cc:8a:fb",
            "net6": "d6:6e:d5:2c:88:57",
            "net7": "ea:9f:57:c6:72:bd",
            "net8": "3e:ff:fe:d6:ef:4d",
            "net9": "a2:91:06:4b:1f:88"
        },
        "spine_3_1_2": {
            "net0": "4e:dc:19:37:df:bd",
            "net1": "72:5a:2a:e8:5e:e0",
            "net10": "ba:a2:d4:be:0f:75",
            "net11": "56:55:d6:79:29:9f",
            "net12": "6e:80:5f:d1:69:76",
            "net13": "3e:6f:53:da:6b:84",
            "net14": "86:09:38:b9:43:61",
            "net15": "da:60:67:e8:07:2a",
            "net2": "a6:d6:0f:f2:0a:25",
            "net3": "a2:61:cf:d6:8b:3f",
            "net4": "ea:ed:ff:fa:68:09",
            "net5": "a2:93:7c:a0:05:14",
            "net6": "5e:31:4c:d1:2d:00",
            "net7": "fe:6e:5f:a5:d0:82",
            "net8": "52:bc:ef:68:f4:09",
            "net9": "ba:6e:4c:0e:09:7a"
        },
        "spine_3_1_3": {
            "net0": "06:49:ea:23:83:bd",
            "net1": "b6:74:81:72:ee:c4",
            "net10": "7a:3f:9b:ea:ba:6b",
            "net11": "3e:1d:ce:3c:13:e4",
            "net12": "96:b4:d5:3b:cf:fc",
            "net13": "36:1b:5a:89:32:db",
            "net14": "2e:78:3e:6d:25:61",
            "net15": "76:38:7d:12:60:0e",
            "net2": "6a:6e:a2:b1:50:88",
            "net3": "ca:25:b2:1b:14:02",
            "net4": "72:73:da:70:ce:1b",
            "net5": "e2:4b:a2:fd:aa:15",
            "net6": "ce:95:8f:b4:b0:7b",
            "net7": "ba:0f:e5:64:ba:f6",
            "net8": "f6:48:66:54:1b:e3",
            "net9": "5a:cf:42:cc:84:a8"
        },
        "spine_3_1_4": {
            "net0": "6e:0f:71:a7:61:69",
            "net1": "ce:30:61:cf:89:62",
            "net10": "fe:b1:ba:c8:92:f0",
            "net11": "16:0e:4f:54:38:8a",
            "net12": "12:d3:d6:a8:50:fd",
            "net13": "96:f7:ef:c8:29:86",
            "net14": "96:6f:90:ba:d3:12",
            "net15": "3a:65:da:2d:88:63",
            "net2": "b6:51:b9:4b:2a:ba",
            "net3": "46:fe:e1:21:2b:b6",
            "net4": "c6:cc:d0:c1:c8:0a",
            "net5": "16:1a:7b:99:76:d7",
            "net6": "7e:59:68:15:a1:dc",
            "net7": "5a:e3:a3:f7:3c:82",
            "net8": "c6:17:fb:c7:b5:4c",
            "net9": "72:22:79:e4:60:5f"
        },
        "spine_3_1_5": {
            "net0": "26:5b:7a:93:52:71",
            "net1": "7a:56:6a:70:01:de",
            "net10": "56:ab:e9:53:72:bc",
            "net11": "4a:e9:60:36:e5:6c",
            "net12": "6a:be:ca:99:41:c4",
            "net13": "f2:16:53:23:bb:26",
            "net14": "32:22:45:52:d8:cd",
            "net15": "7a:7c:bb:05:a6:bd",
            "net2": "fe:82:1d:62:5b:30",
            "net3": "36:81:42:d1:ce:9f",
            "net4": "9a:a9:c6:db:fd:62",
            "net5": "26:56:6f:d5:b1:0c",
            "net6": "aa:c1:47:12:74:cc",
            "net7": "96:d2:8d:a1:44:65",
            "net8": "3e:bf:a4:48:82:28",
            "net9": "86:2d:64:11:af:24"
        },
        "spine_3_1_6": {
            "net0": "ce:68:37:99:10:a8",
            "net1": "c6:d8:6a:d6:35:c2",
            "net10": "ca:bc:13:59:8f:98",
            "net11": "7e:ca:3a:b1:b8:2e",
            "net12": "e2:19:75:dc:40:95",
            "net13": "92:29:94:9d:43:3c",
            "net14": "da:18:e4:c7:70:77",
            "net15": "4e:d2:1f:8c:8e:36",
            "net2": "3a:4f:3e:35:0e:4c",
            "net3": "5a:25:7f:d1:c9:f5",
            "net4": "3a:b9:ea:2d:3d:65",
            "net5": "3a:61:c2:a2:cf:0d",
            "net6": "ce:e4:90:6f:5e:c1",
            "net7": "8e:8e:0d:76:86:bd",
            "net8": "0e:a7:77:63:e5:33",
            "net9": "8a:dc:64:1c:2e:04"
        },
        "spine_3_1_7": {
            "net0": "2a:a9:e3:60:d5:df",
            "net1": "6e:0e:57:3c:29:ba",
            "net10": "7e:ad:f7:ce:f0:8d",
            "net11": "0e:04:cd:37:a2:fe",
            "net12": "6e:7a:e0:46:9b:4b",
            "net13": "5a:7d:1d:79:ee:5f",
            "net14": "9e:00:15:21:0d:45",
            "net15": "02:ca:59:f7:79:b1",
            "net2": "0a:c6:6f:fe:d9:eb",
            "net3": "ea:dd:76:aa:51:af",
            "net4": "fe:d1:a0:3a:1e:2b",
            "net5": "76:58:fc:58:e9:47",
            "net6": "be:6e:08:72:d1:21",
            "net7": "aa:43:5c:3b:0b:66",
            "net8": "1a:9d:f0:d7:e5:21",
            "net9": "f2:37:e6:44:9b:95"
        },
        "spine_3_1_8": {
            "net0": "1a:19:74:e1:e5:38",
            "net1": "42:48:ff:0e:77:4c",
            "net10": "62:36:09:b7:dd:a7",
            "net11": "c2:1e:53:44:e7:3d",
            "net12": "1a:54:45:05:13:30",
            "net13": "f6:09:3f:23:ac:a6",
            "net14": "4a:6a:3f:a4:e3:68",
            "net15": "76:3b:dd:25:56:56",
            "net2": "e6:ae:99:21:4a:97",
            "net3": "2a:74:0d:eb:97:c0",
            "net4": "16:7f:80:69:7f:39",
            "net5": "b2:59:16:d3:e0:01",
            "net6": "da:e3:7c:41:f6:b3",
            "net7": "0a:78:8e:d3:2e:4a",
            "net8": "e6:39:2f:fb:9d:80",
            "net9": "b6:f7:5e:eb:4d:dd"
        },
        "spine_4_1_1": {
            "net0": "8e:c1:ae:c7:36:06",
            "net1": "26:ce:2d:87:8f:af",
            "net10": "2e:71:e3:c8:2b:98",
            "net11": "d6:43:f3:7b:90:45",
            "net12": "1a:3c:38:b4:0e:d2",
            "net13": "f6:c1:d4:aa:c3:28",
            "net14": "8e:22:bf:a0:17:4d",
            "net15": "82:e5:6a:89:59:8b",
            "net2": "86:6f:8d:d5:24:a7",
            "net3": "56:ec:d3:9d:e1:f2",
            "net4": "ce:55:77:c8:63:8a",
            "net5": "12:45:b6:98:33:9d",
            "net6": "ea:43:ac:30:8d:87",
            "net7": "ca:29:1e:a7:b2:7e",
            "net8": "76:16:b6:fd:20:cd",
            "net9": "fa:db:60:ff:53:6c"
        },
        "spine_4_1_2": {
            "net0": "ca:50:75:de:14:ed",
            "net1": "f2:9f:e6:1b:92:59",
            "net10": "7e:73:6b:07:6a:3e",
            "net11": "0a:63:fd:03:f5:5b",
            "net12": "1a:6e:79:f3:f2:dc",
            "net13": "92:b5:42:64:33:8a",
            "net14": "be:82:61:27:ae:de",
            "net15": "d6:bf:44:e1:c6:15",
            "net2": "66:ae:2b:2f:d1:72",
            "net3": "22:69:f5:a4:7a:53",
            "net4": "0e:96:24:d5:48:f2",
            "net5": "f6:89:57:2f:6b:c7",
            "net6": "f6:24:42:3b:75:0f",
            "net7": "06:63:ef:2f:45:a4",
            "net8": "c6:ad:5c:db:14:17",
            "net9": "42:c5:ec:b6:a6:aa"
        },
        "spine_4_1_3": {
            "net0": "9a:f7:f5:e2:93:7e",
            "net1": "3a:6d:39:fa:ae:26",
            "net10": "72:87:19:2a:96:db",
            "net11": "c6:1d:ad:66:69:df",
            "net12": "e2:b3:42:ed:d2:d9",
            "net13": "6e:73:95:5a:bb:db",
            "net14": "d2:85:57:67:36:7c",
            "net15": "f6:f7:30:d9:e9:01",
            "net2": "22:c8:a3:cb:b6:29",
            "net3": "76:81:49:29:a2:33",
            "net4": "5e:ef:1d:6f:35:97",
            "net5": "aa:82:de:67:e0:a1",
            "net6": "d2:a8:96:57:fe:76",
            "net7": "82:c6:85:5f:5b:09",
            "net8": "06:37:59:f8:fd:4c",
            "net9": "02:7c:8d:35:66:c6"
        },
        "spine_4_1_4": {
            "net0": "b2:7f:db:3c:7a:48",
            "net1": "46:e1:2b:62:e1:45",
            "net10": "3e:f6:e1:98:90:20",
            "net11": "46:9f:df:e2:d6:06",
            "net12": "0e:44:cf:eb:db:55",
            "net13": "ea:e5:4c:9e:54:03",
            "net14": "42:8d:b8:62:55:3b",
            "net15": "ca:cb:4a:61:9b:94",
            "net2": "62:98:af:4f:18:47",
            "net3": "5e:3e:85:89:1f:34",
            "net4": "fa:3a:2c:f3:6a:6e",
            "net5": "ea:e1:e6:d1:60:9e",
            "net6": "c2:52:6d:73:85:51",
            "net7": "0a:a4:7d:46:22:16",
            "net8": "96:a9:76:63:2c:b4",
            "net9": "6a:3b:34:36:31:79"
        },
        "spine_4_1_5": {
            "net0": "72:48:e2:f0:1e:de",
            "net1": "ca:a5:60:aa:19:56",
            "net10": "ae:e3:4b:b2:93:94",
            "net11": "26:2d:0b:e2:18:c8",
            "net12": "5e:58:7d:80:ea:31",
            "net13": "ca:2c:57:a1:ff:ed",
            "net14": "26:f4:09:41:b3:74",
            "net15": "1e:68:40:a4:be:b2",
            "net2": "9e:4f:21:9b:94:6b",
            "net3": "86:de:a3:e8:55:b1",
            "net4": "62:6f:6f:0e:3c:40",
            "net5": "ee:7c:d5:09:86:8f",
            "net6": "26:42:51:84:a1:fe",
            "net7": "36:b7:ff:c2:46:5f",
            "net8": "46:1c:b5:de:2d:df",
            "net9": "fe:c6:7c:63:98:8d"
        },
        "spine_4_1_6": {
            "net0": "62:3a:2b:c7:b9:f1",
            "net1": "52:0f:41:75:65:94",
            "net10": "42:6a:a5:d1:7f:00",
            "net11": "ae:ff:c0:b4:e3:06",
            "net12": "92:38:c3:97:48:ee",
            "net13": "66:62:82:f9:ae:b7",
            "net14": "7a:1d:2f:81:3c:64",
            "net15": "c6:5e:1b:3f:00:f4",
            "net2": "16:27:39:ad:67:3d",
            "net3": "2e:54:0d:d5:85:f3",
            "net4": "9e:86:fc:2a:60:64",
            "net5": "1e:52:dd:11:4b:bc",
            "net6": "3e:21:a8:95:8e:c9",
            "net7": "ca:93:05:45:36:43",
            "net8": "f2:73:a9:01:f0:44",
            "net9": "1a:f5:85:2a:f6:05"
        },
        "spine_4_1_7": {
            "net0": "6e:b6:53:19:29:e1",
            "net1": "ce:67:f3:fc:4e:20",
            "net10": "12:c7:13:49:86:95",
            "net11": "a2:14:55:a0:1c:a5",
            "net12": "1a:37:c8:a4:6d:06",
            "net13": "82:b6:48:fd:eb:37",
            "net14": "ce:d7:b6:00:b7:c2",
            "net15": "f2:0e:bb:34:a2:93",
            "net2": "9e:f4:bc:8c:32:79",
            "net3": "7e:11:af:96:f3:d8",
            "net4": "be:3d:9f:18:83:82",
            "net5": "b6:22:3d:32:fd:b2",
            "net6": "06:3f:67:4e:70:0d",
            "net7": "36:50:d5:b3:51:d1",
            "net8": "5e:f7:84:72:e5:68",
            "net9": "7e:13:5c:81:7c:94"
        },
        "spine_4_1_8": {
            "net0": "b2:cb:57:37:6b:d4",
            "net1": "2e:2b:48:54:45:6a",
            "net10": "4a:4d:6e:f5:55:57",
            "net11": "f2:6c:c9:47:a2:4d",
            "net12": "7a:d4:29:da:1b:48",
            "net13": "ce:d4:e6:c6:93:24",
            "net14": "de:8b:23:91:bc:12",
            "net15": "06:6d:f8:62:88:24",
            "net2": "16:9e:4b:c6:a8:1d",
            "net3": "6e:b5:01:7e:df:c1",
            "net4": "d6:d4:be:77:a3:19",
            "net5": "b2:e1:62:2a:9e:4b",
            "net6": "22:b4:53:d4:b1:c6",
            "net7": "fa:a4:0c:fa:9b:e1",
            "net8": "62:89:c2:ea:10:9b",
            "net9": "f6:e4:be:18:cb:80"
        },
        "spine_5_1_1": {
            "net0": "e2:b1:f6:ed:5f:09",
            "net1": "6a:ad:d5:67:f6:5b",
            "net10": "2e:58:a6:79:93:d6",
            "net11": "6e:c5:c1:f5:0e:33",
            "net12": "1e:1a:65:55:48:36",
            "net13": "3a:16:10:40:3c:f0",
            "net14": "66:0c:88:27:cc:1a",
            "net15": "fa:96:a2:3b:97:a8",
            "net2": "b2:b1:4b:19:c1:22",
            "net3": "72:5a:d2:6c:4f:91",
            "net4": "52:b9:d0:87:a4:84",
            "net5": "16:65:06:39:09:f9",
            "net6": "96:11:ed:47:3d:8f",
            "net7": "66:26:a7:f6:b6:1e",
            "net8": "4e:60:0a:7e:6e:d0",
            "net9": "fe:30:8e:f2:c0:45"
        },
        "spine_5_1_2": {
            "net0": "b6:ed:b4:28:ba:ac",
            "net1": "1a:04:b0:a8:bf:c0",
            "net10": "6e:c1:62:07:0b:3d",
            "net11": "aa:c5:d4:93:b3:aa",
            "net12": "16:e3:8a:b5:c0:3e",
            "net13": "12:46:60:5d:f4:78",
            "net14": "fe:1b:b4:b9:8f:3e",
            "net15": "22:75:57:8b:20:1f",
            "net2": "f2:0b:21:c0:e7:29",
            "net3": "76:13:c6:3f:35:37",
            "net4": "1a:6e:37:e2:c8:2f",
            "net5": "86:fd:65:f5:cc:fc",
            "net6": "86:da:f2:43:92:8a",
            "net7": "f6:75:b1:57:6b:2b",
            "net8": "e2:80:c2:2f:d8:79",
            "net9": "36:79:f3:72:a5:69"
        },
        "spine_5_1_3": {
            "net0": "b2:3f:54:a0:ea:08",
            "net1": "8a:3a:3b:89:2b:3b",
            "net10": "5e:ab:10:5e:00:d9",
            "net11": "b6:e0:ca:d6:70:80",
            "net12": "2a:1a:c2:39:48:ad",
            "net13": "fe:2b:ca:9f:2a:0c",
            "net14": "1e:6b:21:3f:20:21",
            "net15": "ba:02:25:e4:17:50",
            "net2": "5e:2d:4e:d2:55:ba",
            "net3": "1e:30:25:1e:f3:b9",
            "net4": "0a:cc:53:f8:b4:4b",
            "net5": "42:21:a3:a2:41:9a",
            "net6": "d6:9a:c7:b3:63:0a",
            "net7": "86:d6:10:6d:85:6a",
            "net8": "4e:a0:be:94:c7:67",
            "net9": "ae:d2:69:01:cf:78"
        },
        "spine_5_1_4": {
            "net0": "7e:c7:45:dc:8d:27",
            "net1": "62:4d:33:aa:89:65",
            "net10": "7a:45:61:5e:cb:77",
            "net11": "be:e1:87:f5:91:43",
            "net12": "ae:8a:bf:eb:d7:e7",
            "net13": "5e:91:f4:46:dc:27",
            "net14": "5a:01:7d:5f:b3:cd",
            "net15": "82:a1:05:15:ac:c6",
            "net2": "be:5e:6d:8d:39:48",
            "net3": "ba:9f:de:01:f1:f5",
            "net4": "da:a4:1c:5a:3f:73",
            "net5": "96:58:8c:3e:18:ac",
            "net6": "86:06:95:80:a1:01",
            "net7": "96:47:dc:00:51:9b",
            "net8": "7e:54:47:5d:9f:7c",
            "net9": "ca:c9:d3:a0:a3:5e"
        },
        "spine_5_1_5": {
            "net0": "9e:62:69:8b:1a:65",
            "net1": "96:52:62:8a:f0:08",
            "net10": "f6:d2:14:89:29:4d",
            "net11": "3a:b0:6a:97:e5:ea",
            "net12": "d6:d6:1a:5e:6e:d7",
            "net13": "9a:09:3a:74:a7:7e",
            "net14": "da:f7:27:4f:93:0c",
            "net15": "3e:6a:8d:57:25:83",
            "net2": "ea:53:aa:4d:27:d7",
            "net3": "b2:93:8b:87:dc:33",
            "net4": "26:e0:b3:a9:6f:1b",
            "net5": "b6:69:f1:1b:af:41",
            "net6": "12:16:8b:5b:93:8b",
            "net7": "02:0a:06:3a:3b:d4",
            "net8": "aa:5f:07:59:66:83",
            "net9": "62:72:f9:e9:37:02"
        },
        "spine_5_1_6": {
            "net0": "fe:a3:b1:bc:bc:42",
            "net1": "76:8a:5c:d4:ca:10",
            "net10": "f2:3c:90:a7:34:d3",
            "net11": "22:f5:9c:70:ca:fb",
            "net12": "a6:b3:12:f7:80:7d",
            "net13": "da:02:f4:92:c2:d0",
            "net14": "2a:a2:4e:bb:55:b4",
            "net15": "0e:d6:a6:e2:c9:b3",
            "net2": "72:32:08:88:a2:42",
            "net3": "0e:79:fc:82:09:0b",
            "net4": "c6:9e:80:c0:b5:be",
            "net5": "76:be:4d:5e:f3:cc",
            "net6": "42:65:5d:48:cc:5c",
            "net7": "06:21:53:26:97:69",
            "net8": "8e:a0:e5:ba:c6:b6",
            "net9": "72:62:3d:fb:07:f0"
        },
        "spine_5_1_7": {
            "net0": "8e:2a:41:31:60:78",
            "net1": "5a:65:c9:d1:79:85",
            "net10": "fe:13:98:96:20:11",
            "net11": "06:8b:09:9d:c8:3a",
            "net12": "2e:71:86:0a:2c:63",
            "net13": "6a:24:9d:52:8c:8f",
            "net14": "72:8d:8a:5f:64:ad",
            "net15": "62:73:6d:61:9c:84",
            "net2": "46:a2:cd:92:b5:d9",
            "net3": "fa:e7:19:28:f4:02",
            "net4": "72:3d:b2:f2:9d:61",
            "net5": "32:e9:30:2d:b4:7e",
            "net6": "aa:15:45:f3:f9:90",
            "net7": "6e:85:7d:cd:17:a4",
            "net8": "96:91:2a:e3:13:e2",
            "net9": "76:b0:1a:66:e1:d8"
        },
        "spine_5_1_8": {
            "net0": "56:37:a5:c2:32:75",
            "net1": "ea:38:4a:da:a5:f5",
            "net10": "da:21:16:fb:d8:34",
            "net11": "1e:50:27:5b:70:b5",
            "net12": "92:4f:d3:d1:11:5b",
            "net13": "ca:68:cc:1a:f9:5c",
            "net14": "42:79:a4:19:79:23",
            "net15": "26:65:ec:c5:bf:69",
            "net2": "9e:ac:31:0f:3e:cc",
            "net3": "be:1a:bd:5d:5f:f4",
            "net4": "12:40:c3:db:6b:26",
            "net5": "9a:13:9e:a0:58:18",
            "net6": "4e:39:72:44:0e:1c",
            "net7": "06:2f:9e:7b:bd:16",
            "net8": "36:90:85:ea:d5:2d",
            "net9": "8a:54:3c:c7:1f:41"
        },
        "spine_6_1_1": {
            "net0": "46:ce:4f:d3:0f:f3",
            "net1": "9a:35:08:b5:90:23",
            "net10": "86:67:e8:6f:81:87",
            "net11": "e2:00:5b:b7:d2:05",
            "net12": "0a:ae:80:29:f1:ef",
            "net13": "4e:1d:05:c8:e0:b8",
            "net14": "62:39:f9:a6:fc:99",
            "net15": "36:a6:4e:1b:0f:c1",
            "net2": "7e:d0:cf:b8:5e:a7",
            "net3": "82:17:04:69:16:05",
            "net4": "02:c3:9e:8f:1f:ce",
            "net5": "a2:68:17:88:19:6b",
            "net6": "6a:b8:84:42:ab:bf",
            "net7": "d2:13:c5:bc:20:92",
            "net8": "3a:16:a4:52:ac:dd",
            "net9": "b2:b8:13:d6:13:ac"
        },
        "spine_6_1_2": {
            "net0": "d2:e9:d8:fe:13:80",
            "net1": "8e:77:1c:be:fa:ca",
            "net10": "de:49:22:12:0d:c8",
            "net11": "ea:41:37:0a:31:06",
            "net12": "4a:92:79:26:b6:03",
            "net13": "b6:96:47:c2:47:12",
            "net14": "66:f6:a5:91:f0:38",
            "net15": "b2:ba:49:2f:a0:76",
            "net2": "b6:d6:b7:81:b6:14",
            "net3": "82:31:d5:35:00:68",
            "net4": "3a:54:b2:23:82:83",
            "net5": "32:75:fb:33:0f:05",
            "net6": "32:24:33:0d:b3:da",
            "net7": "a6:48:c8:25:42:5e",
            "net8": "9e:2d:b2:0c:43:7b",
            "net9": "06:4f:b9:ef:fd:37"
        },
        "spine_6_1_3": {
            "net0": "36:ae:a3:22:f6:15",
            "net1": "02:2c:5b:19:04:1b",
            "net10": "2a:39:96:9f:86:a7",
            "net11": "c6:a9:e2:25:8e:b9",
            "net12": "0e:60:62:83:5a:a3",
            "net13": "aa:a4:cd:ab:91:e7",
            "net14": "5a:0b:b2:1f:fa:07",
            "net15": "5e:25:9a:e8:c5:ec",
            "net2": "fa:59:30:c5:5d:7b",
            "net3": "2e:6d:43:52:dd:42",
            "net4": "9e:66:d0:81:f3:95",
            "net5": "2a:2b:fd:29:41:e0",
            "net6": "d2:ec:2b:6f:dc:c2",
            "net7": "ee:d2:7b:23:44:93",
            "net8": "2a:de:4c:12:3d:92",
            "net9": "0e:bb:18:3a:ae:ff"
        },
        "spine_6_1_4": {
            "net0": "ba:0e:fb:21:c8:dd",
            "net1": "0a:d8:ed:94:da:f7",
            "net10": "06:d4:ef:ec:3b:a8",
            "net11": "be:3c:ab:ca:23:ac",
            "net12": "86:75:50:e7:80:07",
            "net13": "0a:f5:6d:ae:f8:e3",
            "net14": "8a:fb:95:ce:62:a7",
            "net15": "e6:5f:bd:fb:de:7f",
            "net2": "22:1f:83:13:e5:f6",
            "net3": "aa:fd:00:b4:57:84",
            "net4": "ca:cb:ba:d8:c5:aa",
            "net5": "4a:d7:95:33:bc:ad",
            "net6": "a2:0d:f1:56:0a:85",
            "net7": "2e:d9:60:35:6d:f7",
            "net8": "ee:06:6c:f3:63:46",
            "net9": "56:46:be:dc:89:6a"
        },
        "spine_6_1_5": {
            "net0": "e2:86:72:90:7b:09",
            "net1": "86:ee:5e:c6:ae:5e",
            "net10": "56:ec:14:2e:d1:0c",
            "net11": "ca:1e:f1:f0:c0:c9",
            "net12": "52:0e:2a:7c:6c:84",
            "net13": "b2:d9:44:07:41:c8",
            "net14": "ce:29:95:87:f3:03",
            "net15": "16:d3:64:ab:34:f0",
            "net2": "f2:0b:fd:82:56:15",
            "net3": "d6:d1:cd:3d:59:21",
            "net4": "66:1b:24:24:6d:3c",
            "net5": "6a:9c:12:30:63:e7",
            "net6": "86:c1:4e:f8:c7:5c",
            "net7": "ae:19:9b:1c:57:90",
            "net8": "1e:e6:7c:81:97:f3",
            "net9": "c2:7f:18:64:81:d1"
        },
        "spine_6_1_6": {
            "net0": "a2:ff:c7:ba:14:62",
            "net1": "ca:d2:c3:07:7b:00",
            "net10": "1e:0d:ad:9e:71:91",
            "net11": "92:f2:33:b3:1b:7e",
            "net12": "9e:29:76:60:21:fb",
            "net13": "ce:c9:81:41:d1:1f",
            "net14": "de:09:f3:43:a6:f4",
            "net15": "6a:0d:65:05:6c:e3",
            "net2": "26:55:4b:1f:54:84",
            "net3": "1e:93:d1:b2:13:4f",
            "net4": "9a:ba:f1:80:64:ad",
            "net5": "0e:9c:02:ad:40:11",
            "net6": "5e:ca:dc:2f:fa:cd",
            "net7": "7e:35:cf:87:54:6e",
            "net8": "fa:06:94:db:34:20",
            "net9": "7a:4a:b9:5e:3e:20"
        },
        "spine_6_1_7": {
            "net0": "ce:ab:fc:24:23:eb",
            "net1": "f2:9c:08:fb:1b:f9",
            "net10": "e6:fa:fc:30:47:74",
            "net11": "ea:41:c3:18:f7:c2",
            "net12": "ae:38:58:c8:dc:cc",
            "net13": "3a:eb:bc:43:6f:04",
            "net14": "4e:02:71:70:ff:99",
            "net15": "8e:5c:b0:f7:ae:bc",
            "net2": "7e:0f:08:9e:78:85",
            "net3": "26:30:e0:f6:30:73",
            "net4": "fa:e1:85:c7:6f:6b",
            "net5": "ea:15:36:04:00:55",
            "net6": "de:c7:f0:13:7f:f3",
            "net7": "16:b5:e1:b5:0c:7b",
            "net8": "a2:3f:9a:8d:a0:cc",
            "net9": "a2:78:1f:61:19:94"
        },
        "spine_6_1_8": {
            "net0": "12:19:e1:86:83:c0",
            "net1": "3a:5f:bb:f3:6e:55",
            "net10": "a2:66:b8:d7:52:24",
            "net11": "aa:1f:9b:f2:ef:45",
            "net12": "6a:a7:a8:77:a2:dd",
            "net13": "36:53:77:bb:ff:7a",
            "net14": "1a:6e:52:b0:ff:84",
            "net15": "0e:3c:b7:d0:47:05",
            "net2": "72:43:5a:38:ad:4b",
            "net3": "8e:55:17:1a:b0:10",
            "net4": "b6:c5:fd:1a:98:c9",
            "net5": "ea:fe:f6:ce:24:a8",
            "net6": "7e:4a:ba:ab:6c:c6",
            "net7": "0a:a8:1e:e1:0a:6d",
            "net8": "f6:2c:d2:55:79:dc",
            "net9": "6a:12:f7:13:1a:28"
        },
        "spine_7_1_1": {
            "net0": "de:62:03:a0:db:68",
            "net1": "e2:17:43:0d:a4:5e",
            "net10": "e2:97:5a:6d:19:9d",
            "net11": "62:ba:0e:34:3e:15",
            "net12": "12:28:e0:e5:d6:23",
            "net13": "fa:b9:3e:ef:42:f6",
            "net14": "5a:a2:f6:ab:bc:8f",
            "net15": "2a:9f:0c:c6:fb:37",
            "net2": "8e:cb:ba:41:0f:2e",
            "net3": "c2:29:79:08:70:9b",
            "net4": "36:47:2e:1d:dd:c4",
            "net5": "7e:f7:2e:b3:08:3f",
            "net6": "f2:8a:45:67:fc:7d",
            "net7": "b2:35:7a:49:85:39",
            "net8": "76:9b:6c:ae:65:28",
            "net9": "d6:53:71:85:80:9b"
        },
        "spine_7_1_2": {
            "net0": "86:45:82:96:e0:16",
            "net1": "8a:ca:0e:47:80:96",
            "net10": "66:ec:ad:08:67:5c",
            "net11": "62:f5:30:43:89:2f",
            "net12": "46:0f:d3:d1:1d:fd",
            "net13": "5e:f9:82:4d:98:2c",
            "net14": "66:d7:1b:35:c5:ab",
            "net15": "96:37:3e:b9:d5:61",
            "net2": "d6:81:3d:95:c2:5f",
            "net3": "52:f1:49:3e:e8:86",
            "net4": "6e:96:a2:3d:7c:ae",
            "net5": "12:4c:20:16:f4:a4",
            "net6": "0e:d8:ad:27:a7:6f",
            "net7": "8e:81:4e:a3:64:76",
            "net8": "0e:c7:a7:b9:33:77",
            "net9": "62:c1:19:13:0a:e4"
        },
        "spine_7_1_3": {
            "net0": "d2:27:ce:ed:56:23",
            "net1": "3e:4b:b0:6e:e4:29",
            "net10": "b2:b4:ba:8f:69:a3",
            "net11": "6e:55:b6:7d:98:7a",
            "net12": "9e:a0:0a:c9:f8:7d",
            "net13": "7e:95:54:1a:e3:4f",
            "net14": "0a:14:10:c8:07:ca",
            "net15": "a6:19:5f:27:9e:6b",
            "net2": "c2:d3:3e:de:1a:3e",
            "net3": "9e:45:80:a4:f2:4d",
            "net4": "0a:d8:f1:60:1a:9b",
            "net5": "aa:32:d1:d8:5e:dd",
            "net6": "6a:38:20:e2:6a:d7",
            "net7": "9a:b8:f8:4d:ef:a1",
            "net8": "3a:98:08:74:55:75",
            "net9": "ce:df:0e:c4:28:59"
        },
        "spine_7_1_4": {
            "net0": "66:01:b0:db:31:0f",
            "net1": "5a:ee:66:1d:9e:e8",
            "net10": "9a:7b:9f:df:d1:ec",
            "net11": "aa:64:cf:e7:91:95",
            "net12": "4e:e0:d6:81:9c:8a",
            "net13": "f6:2e:60:e5:0d:a7",
            "net14": "12:71:66:00:76:d7",
            "net15": "4a:7b:85:a2:68:5b",
            "net2": "32:bf:8f:c5:82:dd",
            "net3": "b6:6c:98:b0:f7:64",
            "net4": "0e:d3:3a:35:10:50",
            "net5": "32:bf:94:83:bf:bc",
            "net6": "5e:64:4d:ad:27:a3",
            "net7": "86:22:c9:e2:0d:b7",
            "net8": "6a:d2:98:af:23:a5",
            "net9": "52:88:aa:b4:c9:9b"
        },
        "spine_7_1_5": {
            "net0": "5e:d2:00:0e:00:a2",
            "net1": "7e:54:cd:69:fb:99",
            "net10": "9e:6c:ce:34:7c:6d",
            "net11": "26:9a:ff:26:41:63",
            "net12": "8e:8f:a9:0a:f2:2d",
            "net13": "5a:47:23:a6:40:5d",
            "net14": "1e:be:e2:2c:f5:f2",
            "net15": "16:a2:47:72:f9:03",
            "net2": "02:f2:43:42:bb:32",
            "net3": "ba:5a:62:12:a4:e2",
            "net4": "da:39:00:48:65:a8",
            "net5": "52:7d:e9:f9:25:13",
            "net6": "ce:d8:0c:47:de:98",
            "net7": "b2:1f:72:a1:c6:53",
            "net8": "36:2d:ea:89:4c:93",
            "net9": "a6:5f:36:0c:dd:8a"
        },
        "spine_7_1_6": {
            "net0": "22:43:4f:5c:36:23",
            "net1": "8a:15:5e:4d:72:8e",
            "net10": "7e:ca:87:81:11:1d",
            "net11": "e2:f4:5a:b3:2a:b6",
            "net12": "be:03:c4:65:00:53",
            "net13": "2a:02:ad:b3:53:22",
            "net14": "3e:6f:45:d2:c9:05",
            "net15": "7e:0c:d3:8c:b2:a5",
            "net2": "c2:a2:b5:26:47:f2",
            "net3": "ee:ea:6b:4c:0f:8d",
            "net4": "fe:ea:9c:bf:16:86",
            "net5": "86:20:79:79:ff:bc",
            "net6": "1a:f7:61:af:f6:1f",
            "net7": "7e:0c:5b:96:36:2e",
            "net8": "f2:38:e6:03:87:4e",
            "net9": "ba:fa:7b:f1:8a:37"
        },
        "spine_7_1_7": {
            "net0": "da:1d:cf:bb:51:7f",
            "net1": "ba:bf:b8:be:d6:6d",
            "net10": "6a:be:c6:9d:77:cf",
            "net11": "aa:9a:96:0d:8f:42",
            "net12": "de:13:2b:58:e9:d6",
            "net13": "a6:7d:38:9f:7c:4f",
            "net14": "7e:05:a7:62:8d:64",
            "net15": "66:f1:d9:3c:b1:01",
            "net2": "1e:8d:77:45:8b:4c",
            "net3": "9a:6d:8d:5e:9b:3a",
            "net4": "46:6f:c6:d0:4d:8c",
            "net5": "56:9e:ef:b2:e8:7e",
            "net6": "82:65:67:f1:74:0d",
            "net7": "a2:ee:7d:61:0d:31",
            "net8": "56:b3:0d:6e:74:68",
            "net9": "d6:84:50:8a:1a:d2"
        },
        "spine_7_1_8": {
            "net0": "ae:e7:00:a1:42:77",
            "net1": "c6:3a:a0:95:68:c6",
            "net10": "96:94:1b:db:71:81",
            "net11": "a6:a1:94:3e:fc:56",
            "net12": "1e:71:1d:ba:d7:f6",
            "net13": "72:e4:1f:06:6b:d3",
            "net14": "2a:38:b0:df:52:7d",
            "net15": "72:b3:35:71:60:c1",
            "net2": "86:ca:6e:2c:38:a3",
            "net3": "c2:20:6b:29:45:dd",
            "net4": "5a:9b:19:15:2e:d7",
            "net5": "86:c1:c6:26:26:bc",
            "net6": "72:5c:cc:fa:41:cf",
            "net7": "c6:fc:f2:c4:eb:b7",
            "net8": "52:8b:52:cc:dc:fb",
            "net9": "aa:8b:1b:27:4c:60"
        },
        "spine_8_1_1": {
            "net0": "3a:50:aa:6f:b2:45",
            "net1": "d6:34:8c:7c:8e:9b",
            "net10": "32:3a:3a:4b:e8:0d",
            "net11": "ea:62:18:89:01:5b",
            "net12": "5a:6f:ee:26:dd:4d",
            "net13": "56:e2:d5:39:0b:41",
            "net14": "96:23:a7:65:6e:10",
            "net15": "0e:71:f6:6d:ed:1f",
            "net2": "7a:2b:63:22:00:18",
            "net3": "7a:aa:b9:f2:eb:c1",
            "net4": "ce:2b:83:bb:4d:b1",
            "net5": "22:13:2c:0e:b5:e7",
            "net6": "46:07:de:4c:0f:e5",
            "net7": "1a:49:62:45:00:67",
            "net8": "52:1f:d6:cd:e9:3a",
            "net9": "0e:9e:ca:46:f7:e9"
        },
        "spine_8_1_2": {
            "net0": "46:2b:48:d2:fe:cb",
            "net1": "a2:17:cf:bb:ec:1f",
            "net10": "2e:9d:50:86:50:1a",
            "net11": "ee:93:1f:86:07:32",
            "net12": "e6:d7:c6:04:4f:26",
            "net13": "c2:60:03:b8:5d:3c",
            "net14": "56:35:c3:b5:e5:bf",
            "net15": "aa:d8:ae:7f:11:22",
            "net2": "e6:7e:6b:4e:a3:dd",
            "net3": "3a:71:fa:1b:bb:e7",
            "net4": "c2:17:6e:ff:49:39",
            "net5": "3e:6b:2f:20:2a:ac",
            "net6": "ca:bd:7f:c8:a4:66",
            "net7": "7a:01:d2:bf:51:ad",
            "net8": "96:04:ff:7e:62:7b",
            "net9": "72:73:e1:6b:59:91"
        },
        "spine_8_1_3": {
            "net0": "ce:e1:44:dc:fc:83",
            "net1": "56:90:65:14:3b:66",
            "net10": "46:f4:41:f7:b3:59",
            "net11": "06:11:20:c7:a0:58",
            "net12": "be:d3:33:a9:75:88",
            "net13": "92:40:ff:6e:e6:6b",
            "net14": "92:35:18:71:b1:b1",
            "net15": "5a:c1:fe:7b:fe:1e",
            "net2": "fe:d6:7b:0d:de:c6",
            "net3": "ea:47:d3:4f:21:56",
            "net4": "e2:69:c6:7e:7a:bf",
            "net5": "22:4d:61:7a:f8:09",
            "net6": "aa:79:3b:5d:60:ac",
            "net7": "76:15:f2:c9:70:1a",
            "net8": "b6:ac:2c:c1:03:17",
            "net9": "8a:4f:81:62:93:28"
        },
        "spine_8_1_4": {
            "net0": "3e:4c:48:29:0b:19",
            "net1": "ca:cd:aa:32:80:65",
            "net10": "f2:4f:5c:c6:50:b1",
            "net11": "2a:bf:47:32:63:c6",
            "net12": "c2:7f:4b:db:1a:5e",
            "net13": "4e:8d:3d:94:cf:b4",
            "net14": "4e:0a:e0:25:3c:0c",
            "net15": "12:f7:2e:c6:57:00",
            "net2": "5a:12:fb:c6:5c:b0",
            "net3": "96:13:7b:54:bd:28",
            "net4": "a2:0c:eb:ab:21:d6",
            "net5": "ce:6d:87:ea:29:f1",
            "net6": "fa:83:11:84:a2:bb",
            "net7": "f2:13:bc:ef:af:7e",
            "net8": "4e:9e:8f:d8:7b:e7",
            "net9": "a6:bf:28:af:76:24"
        },
        "spine_8_1_5": {
            "net0": "a6:f4:e4:5c:f9:ab",
            "net1": "92:19:33:a1:12:03",
            "net10": "f6:40:4d:69:a3:62",
            "net11": "8a:d3:5a:bf:90:2a",
            "net12": "b2:89:5a:ee:05:df",
            "net13": "5e:0d:5b:f2:74:20",
            "net14": "82:fb:29:d9:98:2f",
            "net15": "ba:6e:9e:fb:9a:d8",
            "net2": "d2:86:5f:0e:11:30",
            "net3": "52:86:54:45:61:ed",
            "net4": "5a:f5:b3:0b:dd:02",
            "net5": "9e:13:b6:32:14:d9",
            "net6": "b2:6e:7e:1c:ad:4a",
            "net7": "5e:4b:1b:5b:11:a2",
            "net8": "b6:75:da:6b:b6:e1",
            "net9": "62:68:c4:87:a6:7a"
        },
        "spine_8_1_6": {
            "net0": "72:39:55:43:41:47",
            "net1": "a6:cd:31:4e:c2:bb",
            "net10": "26:85:07:5e:81:f7",
            "net11": "9e:21:4f:30:e7:2b",
            "net12": "8e:7b:ae:be:d3:7d",
            "net13": "2a:d2:f1:02:4f:07",
            "net14": "f6:09:4e:a4:c0:30",
            "net15": "06:da:cc:8f:20:4e",
            "net2": "be:65:77:57:a2:67",
            "net3": "36:14:5c:8c:17:21",
            "net4": "d2:5f:81:62:e9:25",
            "net5": "62:cc:93:85:b3:9c",
            "net6": "d6:e3:3b:58:fd:86",
            "net7": "ee:41:7c:fd:18:a5",
            "net8": "26:d3:1b:6e:ba:2c",
            "net9": "9a:47:09:1d:b8:ca"
        },
        "spine_8_1_7": {
            "net0": "1e:0c:e2:6f:8a:52",
            "net1": "42:f2:bb:17:e4:f3",
            "net10": "8a:31:36:16:70:e4",
            "net11": "82:39:6d:dc:20:65",
            "net12": "fa:8a:d6:6a:49:86",
            "net13": "5e:97:3e:54:a6:50",
            "net14": "4a:2f:df:61:5c:7b",
            "net15": "ae:85:e8:cf:78:c3",
            "net2": "52:72:f4:f0:45:15",
            "net3": "52:36:b7:61:21:b2",
            "net4": "4e:09:93:3d:56:f5",
            "net5": "86:5b:a2:60:93:07",
            "net6": "86:0b:7c:d1:94:90",
            "net7": "ba:3d:73:26:56:77",
            "net8": "f2:1c:b6:be:17:b0",
            "net9": "16:26:f1:75:90:50"
        },
        "spine_8_1_8": {
            "net0": "7a:2d:96:e5:d3:57",
            "net1": "52:c3:24:d0:d8:6d",
            "net10": "5a:52:88:bf:eb:d1",
            "net11": "76:cc:58:67:79:43",
            "net12": "ee:60:b9:41:f0:a0",
            "net13": "7a:64:2a:60:bd:8f",
            "net14": "a6:5f:b8:ed:e4:d4",
            "net15": "56:88:1b:21:c2:64",
            "net2": "a6:ad:99:dc:0d:2f",
            "net3": "9e:68:bb:1e:bd:f6",
            "net4": "a6:53:fa:a4:cc:e7",
            "net5": "7e:07:53:a0:c1:1c",
            "net6": "0a:d2:51:54:7d:73",
            "net7": "16:ef:e6:45:6a:2e",
            "net8": "e2:7f:62:10:5d:9d",
            "net9": "de:60:aa:d6:e1:ca"
        },
        "tof_1_2_1": {
            "net0": "c6:c6:11:76:28:63",
            "net1": "6a:38:68:53:c7:e2",
            "net10": "a2:2c:01:65:d1:c7",
            "net11": "56:54:05:0f:a5:17",
            "net12": "52:fa:2b:48:30:d7",
            "net13": "8a:bd:3d:90:f4:9d",
            "net14": "2a:9f:14:0a:61:b0",
            "net15": "d6:5a:d8:40:5c:12",
            "net2": "ea:1f:6d:2f:06:44",
            "net3": "4a:0c:44:9a:dc:8e",
            "net4": "06:64:7e:d1:37:07",
            "net5": "46:29:98:63:67:e6",
            "net6": "16:35:80:10:66:c1",
            "net7": "6e:dd:11:86:3e:e7",
            "net8": "a6:2e:13:2c:1c:1c",
            "net9": "5a:be:84:0b:94:3d"
        },
        "tof_1_2_2": {
            "net0": "b2:da:7b:52:fa:74",
            "net1": "a2:67:37:05:ba:c8",
            "net10": "62:dd:b1:d8:16:77",
            "net11": "a6:c6:92:27:89:88",
            "net12": "c2:75:a3:e5:62:56",
            "net13": "0e:62:3a:a9:3f:cd",
            "net14": "6e:2d:08:ee:45:84",
            "net15": "8a:39:d6:2c:e0:f9",
            "net2": "fa:03:d8:16:4b:f8",
            "net3": "62:d3:f0:53:02:2b",
            "net4": "92:77:4b:13:24:2b",
            "net5": "d6:ce:1a:41:8d:11",
            "net6": "32:71:ff:ca:8d:26",
            "net7": "3e:72:0b:92:4f:2b",
            "net8": "d6:cd:3e:c8:63:b8",
            "net9": "02:93:7f:da:36:9d"
        },
        "tof_1_2_3": {
            "net0": "e2:77:e7:5a:2f:67",
            "net1": "22:23:57:08:7d:81",
            "net10": "e6:09:6a:eb:2d:7e",
            "net11": "9a:f0:bb:91:c2:6a",
            "net12": "16:ca:e2:e4:4b:f5",
            "net13": "2e:91:82:95:1a:2a",
            "net14": "86:3b:c8:88:8d:af",
            "net15": "ce:6c:0d:8b:8f:36",
            "net2": "5a:31:d3:66:01:2b",
            "net3": "66:e1:b6:d8:de:70",
            "net4": "de:08:f4:cc:4c:20",
            "net5": "6e:e7:9c:b5:14:d1",
            "net6": "fe:6e:42:72:1d:3d",
            "net7": "22:a8:4b:55:57:03",
            "net8": "0e:0b:18:58:db:66",
            "net9": "a2:12:9d:b2:39:98"
        },
        "tof_1_2_4": {
            "net0": "72:9a:52:05:4b:85",
            "net1": "3a:25:c5:66:77:22",
            "net10": "fe:eb:15:39:a8:7c",
            "net11": "46:72:5f:5e:a3:59",
            "net12": "be:20:2e:63:14:a1",
            "net13": "66:a9:0d:d5:5e:bf",
            "net14": "96:44:44:e8:84:16",
            "net15": "52:cf:3b:a4:64:2f",
            "net2": "fe:d2:8c:a5:e0:f7",
            "net3": "a6:3e:5c:aa:0a:e2",
            "net4": "32:13:a9:be:ee:a0",
            "net5": "d2:66:b2:78:80:fb",
            "net6": "ba:8e:a8:4b:5a:06",
            "net7": "b2:09:e3:fb:63:26",
            "net8": "3e:cf:8b:c2:ba:bb",
            "net9": "7a:c3:78:b0:b0:f6"
        },
        "tof_1_2_5": {
            "net0": "aa:5f:0b:5e:8e:9e",
            "net1": "d2:52:91:0b:cf:0b",
            "net10": "06:cc:eb:f9:33:f1",
            "net11": "4a:5b:03:90:ce:e3",
            "net12": "32:25:59:3c:64:8b",
            "net13": "ca:e1:89:38:bb:21",
            "net14": "92:04:0c:9c:2d:b5",
            "net15": "7a:5a:f1:c0:cd:d4",
            "net2": "4a:fd:a9:81:d2:60",
            "net3": "de:6b:af:7d:ad:97",
            "net4": "ee:29:17:c3:d3:6c",
            "net5": "ea:4f:b1:91:7c:91",
            "net6": "5e:b4:9c:97:97:73",
            "net7": "ba:96:88:25:66:8c",
            "net8": "3e:01:9a:9d:e0:b0",
            "net9": "2e:3d:1e:2c:17:d9"
        },
        "tof_1_2_6": {
            "net0": "52:d4:91:b3:d8:cc",
            "net1": "ce:d5:c4:4f:cf:f8",
            "net10": "62:52:9e:39:39:bd",
            "net11": "1a:fa:cc:f9:f1:50",
            "net12": "32:eb:00:72:06:e8",
            "net13": "be:11:1f:ed:49:99",
            "net14": "1e:23:96:c5:f4:7c",
            "net15": "9a:55:2d:e5:02:3c",
            "net2": "c2:6d:57:8f:61:c1",
            "net3": "3e:af:9e:29:6b:fc",
            "net4": "da:73:9a:35:24:53",
            "net5": "5e:bb:43:0c:d6:15",
            "net6": "72:f8:ff:1d:b3:33",
            "net7": "66:e2:2e:19:4d:7e",
            "net8": "3a:19:e8:62:29:f1",
            "net9": "8a:61:b9:dc:c1:b2"
        },
        "tof_1_2_7": {
            "net0": "ea:4c:66:cd:bc:93",
            "net1": "42:c9:d0:f2:4d:b6",
            "net10": "6a:ba:7b:15:75:f6",
            "net11": "66:36:65:f9:73:bb",
            "net12": "22:ea:c1:f0:a7:24",
            "net13": "9a:0d:e9:e9:57:a0",
            "net14": "e2:bf:b6:cb:e3:d5",
            "net15": "1e:55:57:6c:5d:49",
            "net2": "9a:89:ed:52:06:33",
            "net3": "c6:88:36:e8:bd:75",
            "net4": "02:64:b1:85:19:a3",
            "net5": "82:2e:54:f1:52:5a",
            "net6": "22:07:1b:ee:ed:31",
            "net7": "66:d8:c3:3d:7b:32",
            "net8": "1a:39:99:25:a9:d8",
            "net9": "ee:40:6b:25:78:33"
        },
        "tof_1_2_8": {
            "net0": "b2:9e:74:54:e7:26",
            "net1": "b2:89:0e:b4:b9:dd",
            "net10": "f2:0e:20:8d:41:38",
            "net11": "d2:ee:01:83:8d:ef",
            "net12": "1a:51:47:38:e3:f0",
            "net13": "8a:78:57:de:8d:9c",
            "net14": "aa:0f:f4:28:d6:16",
            "net15": "6a:f6:c6:a4:b8:2b",
            "net2": "e6:4b:37:05:5f:ca",
            "net3": "e2:18:8a:1a:e4:bc",
            "net4": "a6:ff:a0:f6:40:55",
            "net5": "3e:53:bb:90:e8:f6",
            "net6": "f2:14:19:36:6e:ee",
            "net7": "3a:c0:67:7f:4e:9a",
            "net8": "2e:92:2c:05:5d:59",
            "net9": "c2:57:df:29:18:ee"
        },
        "tof_2_2_1": {
            "net0": "36:1f:9c:64:e3:b6",
            "net1": "02:b4:6f:0a:ee:1b",
            "net10": "0a:89:fc:d2:9f:af",
            "net11": "ea:ae:f1:e1:67:09",
            "net12": "4a:57:bf:98:3c:4e",
            "net13": "8e:cb:9e:e5:f3:da",
            "net14": "b6:d1:7a:16:11:c8",
            "net15": "c2:5d:e7:31:81:a1",
            "net2": "32:e0:c9:eb:68:42",
            "net3": "42:3c:75:25:61:f7",
            "net4": "2a:2f:2d:08:92:fa",
            "net5": "5e:bb:6a:c6:da:0a",
            "net6": "06:96:ef:db:f8:e5",
            "net7": "ee:ab:fb:96:73:1e",
            "net8": "8e:89:a6:dd:aa:62",
            "net9": "46:84:43:ac:ed:3a"
        },
        "tof_2_2_2": {
            "net0": "9e:51:1a:4a:fb:24",
            "net1": "f6:38:96:75:57:b1",
            "net10": "d2:55:2e:d3:8b:5a",
            "net11": "de:c7:39:4a:da:08",
            "net12": "ae:61:a4:c5:30:a0",
            "net13": "96:76:a4:e6:c8:ac",
            "net14": "be:af:85:7e:2a:08",
            "net15": "ae:3c:bf:8b:fa:33",
            "net2": "36:a5:e1:c2:0d:04",
            "net3": "aa:09:3d:ce:64:e2",
            "net4": "e6:ce:15:6c:fa:7a",
            "net5": "4a:e7:b5:e4:28:d0",
            "net6": "3a:e8:8c:fd:b9:5a",
            "net7": "16:73:8e:5f:12:2a",
            "net8": "76:a3:7b:f2:32:4b",
            "net9": "f2:06:02:32:78:46"
        },
        "tof_2_2_3": {
            "net0": "86:ef:c0:a7:de:ee",
            "net1": "a6:f5:9c:ff:e9:d4",
            "net10": "f2:61:45:86:6f:cc",
            "net11": "86:67:f4:3d:13:81",
            "net12": "e2:0e:e5:97:fb:97",
            "net13": "d6:26:6e:98:2b:f2",
            "net14": "da:a3:fa:67:85:33",
            "net15": "1a:ca:b2:b5:ec:67",
            "net2": "6e:6e:39:14:f8:bf",
            "net3": "42:b6:46:4a:b4:fe",
            "net4": "4a:77:78:bb:a1:f6",
            "net5": "0a:e7:75:90:49:1a",
            "net6": "56:96:02:5f:5d:1b",
            "net7": "1a:b3:70:89:26:ac",
            "net8": "42:fc:fe:c6:05:91",
            "net9": "6e:f4:ee:34:0f:57"
        },
        "tof_2_2_4": {
            "net0": "4a:8a:d5:03:62:aa",
            "net1": "22:dc:3c:ef:c4:f6",
            "net10": "d2:74:d0:3a:a0:38",
            "net11": "c2:d0:d5:c8:d7:95",
            "net12": "9a:ca:76:aa:ff:58",
            "net13": "ea:25:51:f8:48:a8",
            "net14": "5a:6f:47:fd:37:52",
            "net15": "4a:f0:03:d7:15:d9",
            "net2": "72:36:c2:77:67:af",
            "net3": "a6:11:1a:cb:c5:87",
            "net4": "12:8c:13:a5:30:96",
            "net5": "4e:0d:cb:e3:78:18",
            "net6": "6e:30:02:92:c2:f1",
            "net7": "be:6e:ea:0e:d4:b7",
            "net8": "3e:19:5a:fd:f4:f5",
            "net9": "de:22:b2:0a:6a:e7"
        },
        "tof_2_2_5": {
            "net0": "92:d0:0f:b4:45:28",
            "net1": "8a:36:95:7c:f5:b0",
            "net10": "c2:14:dd:2b:0a:c2",
            "net11": "aa:f2:87:c3:1c:d4",
            "net12": "56:5d:3d:86:2f:91",
            "net13": "3a:61:96:15:cc:cc",
            "net14": "8e:4f:45:a0:a4:88",
            "net15": "d6:41:76:fd:f6:d2",
            "net2": "9a:3e:07:3c:85:9c",
            "net3": "ba:72:e1:a2:05:f0",
            "net4": "7e:c8:99:62:c8:8f",
            "net5": "2a:10:c6:58:22:20",
            "net6": "96:06:27:a3:1a:5b",
            "net7": "2e:41:94:c6:87:4d",
            "net8": "3a:b4:e8:26:a7:7d",
            "net9": "ba:11:3d:41:ed:5e"
        },
        "tof_2_2_6": {
            "net0": "26:2e:ab:d6:bb:ed",
            "net1": "0e:b7:5b:7d:18:84",
            "net10": "9a:fb:64:9e:2b:3f",
            "net11": "1a:36:eb:59:66:7f",
            "net12": "76:79:13:0e:51:b1",
            "net13": "f6:8b:b5:80:6a:52",
            "net14": "32:d9:27:d9:e8:3a",
            "net15": "56:a0:88:ae:4c:9c",
            "net2": "6a:db:3c:85:f0:08",
            "net3": "5a:7d:c0:77:5c:19",
            "net4": "8e:54:f2:93:2b:16",
            "net5": "4e:67:2f:ad:ea:6f",
            "net6": "6e:84:18:0e:76:41",
            "net7": "a2:aa:ce:a0:bc:d3",
            "net8": "aa:e0:89:7d:3d:74",
            "net9": "f6:97:1d:bc:a1:b8"
        },
        "tof_2_2_7": {
            "net0": "b2:8f:02:48:43:e5",
            "net1": "1e:36:0e:d6:98:fd",
            "net10": "56:78:ae:02:58:0f",
            "net11": "66:ec:fa:1d:0a:cd",
            "net12": "e2:39:ef:f6:d2:e6",
            "net13": "5e:42:02:c8:c0:d6",
            "net14": "4e:69:3e:56:c7:bb",
            "net15": "fe:0b:50:3f:ac:de",
            "net2": "72:60:ec:d3:84:ef",
            "net3": "e2:98:d2:8f:d3:13",
            "net4": "6e:e2:a5:25:47:70",
            "net5": "6e:11:86:7c:c0:f9",
            "net6": "3a:35:2e:1d:9c:b3",
            "net7": "62:eb:e9:71:e0:c0",
            "net8": "7a:f4:18:0a:7c:a7",
            "net9": "92:2f:69:a5:83:f7"
        },
        "tof_2_2_8": {
            "net0": "ce:fb:a2:92:0b:a4",
            "net1": "9e:73:be:57:f0:54",
            "net10": "da:2d:c2:ef:99:78",
            "net11": "b6:a6:05:79:8d:c7",
            "net12": "66:d1:40:d1:22:31",
            "net13": "d2:92:b9:16:d3:29",
            "net14": "c6:2f:7b:15:75:a2",
            "net15": "f2:21:e3:99:7a:1e",
            "net2": "4e:06:a8:e2:99:47",
            "net3": "22:af:79:dd:10:44",
            "net4": "9e:cd:ca:51:f2:19",
            "net5": "3a:f2:e4:8f:49:ac",
            "net6": "7a:40:51:1c:a7:72",
            "net7": "8e:b3:34:51:66:b6",
            "net8": "ca:8b:69:1e:6d:57",
            "net9": "c2:47:40:ce:3d:9e"
        },
        "tof_3_2_1": {
            "net0": "4a:0a:d2:c6:0a:db",
            "net1": "7e:0a:9c:1a:1c:58",
            "net10": "8a:e7:6e:14:22:8b",
            "net11": "f6:af:94:ec:c9:31",
            "net12": "d2:ae:ed:b1:65:b2",
            "net13": "1a:75:73:d6:ac:c5",
            "net14": "ae:c2:73:13:47:50",
            "net15": "d2:8e:aa:79:29:5b",
            "net2": "ee:9c:79:19:ce:f0",
            "net3": "a2:54:4e:d6:55:5e",
            "net4": "0e:ad:6b:a9:25:96",
            "net5": "42:b5:93:52:86:07",
            "net6": "ba:b8:0a:5c:95:78",
            "net7": "7e:f1:2f:1a:d7:f9",
            "net8": "7e:e9:02:f5:ab:9a",
            "net9": "5e:07:78:42:39:b8"
        },
        "tof_3_2_2": {
            "net0": "6a:09:a8:a9:06:c4",
            "net1": "22:1a:00:c2:a7:f5",
            "net10": "72:76:c4:38:f7:06",
            "net11": "da:88:15:84:6f:e1",
            "net12": "36:37:fc:01:da:16",
            "net13": "5a:16:af:fd:c4:03",
            "net14": "e6:bb:61:0e:3a:dc",
            "net15": "56:93:e0:ba:46:31",
            "net2": "92:4d:a1:51:11:56",
            "net3": "42:67:1d:96:4c:01",
            "net4": "c6:4a:c0:c1:ef:a8",
            "net5": "fa:49:57:fe:07:db",
            "net6": "32:79:63:b1:2e:6e",
            "net7": "26:ec:df:65:86:53",
            "net8": "7a:32:ec:fe:1a:bc",
            "net9": "ae:3e:b6:da:9d:c5"
        },
        "tof_3_2_3": {
            "net0": "aa:6e:c9:a5:cf:08",
            "net1": "8e:5d:78:40:55:31",
            "net10": "d2:d5:6b:19:3b:32",
            "net11": "a2:91:d3:74:4c:34",
            "net12": "16:bb:ea:29:50:12",
            "net13": "2e:47:60:b0:5e:1d",
            "net14": "32:02:47:a8:f5:b1",
            "net15": "7a:a1:8b:06:09:9c",
            "net2": "4e:34:4f:70:40:99",
            "net3": "ea:b6:17:56:16:01",
            "net4": "b6:43:92:c4:9e:b9",
            "net5": "de:38:ae:06:6e:d5",
            "net6": "46:4d:25:32:fc:3a",
            "net7": "c6:f6:52:31:96:ac",
            "net8": "3e:7b:cb:eb:cf:da",
            "net9": "96:7b:01:cc:8c:93"
        },
        "tof_3_2_4": {
            "net0": "a6:30:7f:f0:a7:63",
            "net1": "d2:5c:02:87:a3:41",
            "net10": "22:24:22:39:15:25",
            "net11": "aa:e2:21:79:fa:d9",
            "net12": "8a:9f:d0:b5:b4:4f",
            "net13": "1a:12:15:95:aa:5e",
            "net14": "46:5a:f6:e4:ce:8d",
            "net15": "36:84:21:62:b2:d1",
            "net2": "16:4d:86:3b:af:62",
            "net3": "b2:9f:41:fa:aa:89",
            "net4": "ae:3e:54:72:60:2b",
            "net5": "da:25:7f:f4:57:fe",
            "net6": "4e:05:19:8f:9a:27",
            "net7": "92:fa:24:d5:b1:90",
            "net8": "16:69:83:3a:ce:64",
            "net9": "8a:99:52:8e:58:02"
        },
        "tof_3_2_5": {
            "net0": "ca:81:54:3e:fb:1a",
            "net1": "6e:1d:4b:a6:c4:dc",
            "net10": "56:6b:5c:c2:ff:a4",
            "net11": "1e:a7:35:4d:0b:97",
            "net12": "02:4f:48:2f:3d:91",
            "net13": "0a:08:ae:88:68:9e",
            "net14": "aa:90:8f:13:0b:af",
            "net15": "22:1c:de:6d:57:49",
            "net2": "a6:ff:df:f7:94:21",
            "net3": "26:23:e9:49:0e:4d",
            "net4": "52:1c:cd:0e:fa:92",
            "net5": "ae:ac:8d:76:62:68",
            "net6": "b6:b8:f1:1c:f2:88",
            "net7": "46:a6:f5:9c:db:6f",
            "net8": "8e:54:a5:67:23:bb",
            "net9": "7e:8c:b9:75:05:b6"
        },
        "tof_3_2_6": {
            "net0": "f2:16:00:13:5d:fe",
            "net1": "32:b9:2a:84:c0:3a",
            "net10": "72:f6:b0:6d:7e:03",
            "net11": "0a:2e:93:92:58:7d",
            "net12": "56:bd:60:20:be:64",
            "net13": "0e:8f:c4:30:b0:32",
            "net14": "2a:17:fc:c0:25:dd",
            "net15": "2e:28:91:c3:2b:d1",
            "net2": "46:17:aa:b1:6b:e1",
            "net3": "52:9f:17:46:e4:22",
            "net4": "8e:b4:3c:41:52:38",
            "net5": "5e:1e:42:97:60:e5",
            "net6": "7e:2a:7f:78:0e:ba",
            "net7": "26:4c:ff:d6:5e:b4",
            "net8": "f2:75:c0:e5:00:54",
            "net9": "ee:b5:34:64:b3:b5"
        },
        "tof_3_2_7": {
            "net0": "e2:59:2a:b4:2c:32",
            "net1": "86:e0:65:0a:61:32",
            "net10": "a2:fb:1d:b1:4c:c0",
            "net11": "42:1a:a3:ea:2f:83",
            "net12": "d6:96:7f:8f:5d:5b",
            "net13": "e6:87:9e:85:85:06",
            "net14": "e6:a9:0d:f8:cb:98",
            "net15": "96:42:f7:86:b3:c3",
            "net2": "fe:ad:3d:e8:fe:bf",
            "net3": "b2:1e:0f:bf:17:1d",
            "net4": "be:3a:ae:dd:65:5c",
            "net5": "76:7c:20:9f:f7:4e",
            "net6": "ae:c5:2d:f5:6b:f9",
            "net7": "56:15:aa:c2:a0:8d",
            "net8": "6e:f9:c5:6d:fc:5f",
            "net9": "c6:ce:e1:71:91:bb"
        },
        "tof_3_2_8": {
            "net0": "52:f4:83:2e:a5:a9",
            "net1": "0a:f6:0b:44:32:ca",
            "net10": "d2:9d:2f:7c:d1:70",
            "net11": "0e:16:c3:55:2a:fc",
            "net12": "86:2b:7c:1c:d6:a4",
            "net13": "f2:d7:95:d9:56:37",
            "net14": "32:ec:43:56:cb:b9",
            "net15": "2e:d6:8f:ab:6b:c9",
            "net2": "ca:06:ad:7b:d8:2c",
            "net3": "8a:a0:c0:2f:2f:23",
            "net4": "a2:42:78:15:91:1d",
            "net5": "ca:de:a6:4c:97:51",
            "net6": "3a:68:23:ff:ac:f0",
            "net7": "b2:cb:9d:73:a2:27",
            "net8": "a6:f9:c8:9c:62:c9",
            "net9": "52:fc:66:18:25:b7"
        },
        "tof_4_2_1": {
            "net0": "8e:1d:2b:e6:87:f0",
            "net1": "66:00:51:b5:cd:a8",
            "net10": "b2:84:65:7d:d6:76",
            "net11": "c2:28:6f:d3:7c:16",
            "net12": "16:e9:c7:53:03:b3",
            "net13": "92:87:4d:bb:c8:a9",
            "net14": "be:9a:80:5d:1d:07",
            "net15": "b2:6d:2d:1c:3f:2a",
            "net2": "f2:0c:58:23:69:84",
            "net3": "f2:f7:f4:90:11:18",
            "net4": "ca:c3:d3:89:55:2e",
            "net5": "d2:bb:c8:25:7f:98",
            "net6": "8e:4c:c7:e4:57:0b",
            "net7": "62:e4:1e:a0:85:ee",
            "net8": "32:6e:2d:e9:78:65",
            "net9": "da:0c:31:a0:62:4a"
        },
        "tof_4_2_2": {
            "net0": "0e:82:24:7d:14:30",
            "net1": "b6:96:22:c2:08:cb",
            "net10": "8a:ed:73:3e:77:8a",
            "net11": "c2:45:f8:a1:0b:30",
            "net12": "ae:8e:88:79:60:5f",
            "net13": "56:9e:c6:46:48:b4",
            "net14": "0a:40:b8:cd:1a:30",
            "net15": "4e:0e:d9:9b:80:be",
            "net2": "e2:31:79:ac:27:86",
            "net3": "0a:df:65:8f:5d:53",
            "net4": "0e:48:ca:9d:2f:fc",
            "net5": "9e:3b:a7:dc:a8:33",
            "net6": "ae:66:b9:79:17:41",
            "net7": "36:f7:15:15:62:fa",
            "net8": "66:fb:4f:cf:a2:28",
            "net9": "4e:db:db:df:c1:87"
        },
        "tof_4_2_3": {
            "net0": "2e:f8:99:a5:fc:9e",
            "net1": "ca:6a:42:18:00:57",
            "net10": "4a:81:1b:39:cf:f0",
            "net11": "62:8d:3a:f1:8e:a1",
            "net12": "12:9c:7c:2e:c7:89",
            "net13": "6e:2f:9d:d5:2f:b0",
            "net14": "aa:1c:af:52:c2:10",
            "net15": "f2:0e:c0:08:73:f2",
            "net2": "fa:25:7a:10:1a:1e",
            "net3": "4e:40:39:fa:26:ff",
            "net4": "92:08:02:8a:7c:5f",
            "net5": "de:99:e9:a8:be:6d",
            "net6": "c2:7e:6b:3c:38:52",
            "net7": "32:7e:fd:e3:b4:58",
            "net8": "1e:91:72:d6:98:d4",
            "net9": "ca:f0:58:50:35:08"
        },
        "tof_4_2_4": {
            "net0": "42:ac:c8:44:2b:72",
            "net1": "0a:9f:23:db:44:2a",
            "net10": "1e:4c:c7:47:e6:c9",
            "net11": "06:ac:27:32:fe:fe",
            "net12": "1e:06:0f:20:17:e3",
            "net13": "4e:dd:e4:fa:d6:5e",
            "net14": "36:b2:18:5e:bf:f4",
            "net15": "7a:1a:63:1a:ff:b7",
            "net2": "fa:d8:08:ec:44:df",
            "net3": "fa:91:54:85:9f:e6",
            "net4": "4e:e1:c5:0b:63:63",
            "net5": "8e:3d:2a:81:28:9d",
            "net6": "12:7a:f5:e5:8a:70",
            "net7": "7a:80:3d:8d:67:95",
            "net8": "66:f5:a9:48:0a:0d",
            "net9": "5e:6b:e4:42:4c:56"
        },
        "tof_4_2_5": {
            "net0": "26:97:93:37:6d:9b",
            "net1": "ce:98:8c:a2:0c:61",
            "net10": "ce:49:94:23:ae:19",
            "net11": "96:f9:85:d5:f4:36",
            "net12": "6e:71:20:00:30:34",
            "net13": "f6:76:7c:5c:b2:6d",
            "net14": "9e:35:2b:25:d3:4b",
            "net15": "f6:cd:17:ae:43:04",
            "net2": "4e:e6:ed:7c:ae:b4",
            "net3": "0a:aa:e8:9c:d6:a9",
            "net4": "12:91:2c:5d:1c:a6",
            "net5": "ba:05:c9:8b:7f:58",
            "net6": "c2:6c:03:2d:4b:5e",
            "net7": "7a:da:c6:42:13:ac",
            "net8": "c6:0c:a3:94:be:11",
            "net9": "62:41:f8:40:5f:7a"
        },
        "tof_4_2_6": {
            "net0": "2a:0c:e8:07:00:74",
            "net1": "72:91:3f:72:86:a5",
            "net10": "1e:df:7e:6d:2f:27",
            "net11": "da:bf:bf:d6:3f:71",
            "net12": "9a:86:f6:ab:48:ec",
            "net13": "4e:b2:d9:fa:4d:e0",
            "net14": "62:7d:e5:5a:93:c7",
            "net15": "ca:6e:32:8c:5a:61",
            "net2": "4e:0d:ad:01:90:96",
            "net3": "ca:ce:47:2a:d1:b6",
            "net4": "ce:28:5f:42:47:8b",
            "net5": "b2:bc:14:50:52:3e",
            "net6": "22:72:b4:93:13:e8",
            "net7": "26:40:88:13:ed:3d",
            "net8": "26:b8:28:16:8e:4d",
            "net9": "02:b9:95:ee:ea:e8"
        },
        "tof_4_2_7": {
            "net0": "92:0c:94:82:1d:19",
            "net1": "de:ea:73:eb:93:19",
            "net10": "9e:d3:3f:88:51:a3",
            "net11": "32:6e:d7:9c:ad:b4",
            "net12": "36:92:4c:7a:8c:b6",
            "net13": "56:5c:2b:a5:77:dc",
            "net14": "aa:a6:dd:4a:19:69",
            "net15": "d6:5a:8b:e6:78:e6",
            "net2": "86:79:c9:77:14:33",
            "net3": "1e:0c:e9:1d:72:1c",
            "net4": "96:3b:b7:fc:fe:b6",
            "net5": "fa:5c:15:22:7f:e0",
            "net6": "c6:6e:31:e4:b5:39",
            "net7": "8a:39:71:26:f4:06",
            "net8": "92:c9:0c:cf:cb:84",
            "net9": "06:bf:8a:42:73:8f"
        },
        "tof_4_2_8": {
            "net0": "36:38:9c:ce:60:6e",
            "net1": "0e:e6:d7:cf:a5:fe",
            "net10": "fa:37:32:32:22:b7",
            "net11": "16:70:0b:1e:df:fe",
            "net12": "c2:6a:5c:cf:6b:90",
            "net13": "72:c3:0a:d1:84:6c",
            "net14": "ee:d2:1f:8e:ff:d8",
            "net15": "46:61:98:eb:4a:09",
            "net2": "a2:28:5e:4c:e6:7a",
            "net3": "ba:7b:10:fc:85:58",
            "net4": "aa:af:ab:44:fc:92",
            "net5": "6e:5e:a9:6e:77:0e",
            "net6": "da:f0:ae:a7:a6:a8",
            "net7": "7a:bf:a9:0d:44:ca",
            "net8": "42:bd:8c:99:6e:c6",
            "net9": "c2:ac:1a:f8:3c:2b"
        }
    },
    "failed_machine": "leaf_1_0_1",
    "failure_time": 1616237308.2522984
}