{
    "k_leaf": 14,
    "k_top": 14,
    "redundancy_factor": 14,
    "is_k8s": true,
    "machine_mac_addresses": {
        "leaf_1_0_1": {
            "net0": "c6:eb:c8:8e:35:65",
            "net1": "3e:61:0c:c9:09:47",
            "net10": "36:d2:08:a0:b9:cf",
            "net11": "72:c0:e4:16:ec:e6",
            "net12": "4e:b5:08:ac:0e:a7",
            "net13": "62:e0:83:ff:70:ae",
            "net14": "ea:49:6f:40:aa:5b",
            "net2": "ca:7f:7c:94:6b:e1",
            "net3": "ee:69:8c:58:c4:36",
            "net4": "c6:1a:c4:6a:f6:b4",
            "net5": "e6:5c:cb:e8:54:52",
            "net6": "c6:62:e7:4d:b0:98",
            "net7": "96:3a:5b:e3:e7:cc",
            "net8": "46:35:bb:c8:81:a9",
            "net9": "da:09:1f:fa:4b:7b"
        },
        "leaf_1_0_10": {
            "net0": "06:f9:c9:f7:f4:f7",
            "net1": "9a:88:b6:de:3c:d0",
            "net10": "6a:58:6e:d5:b2:17",
            "net11": "ae:9b:42:e0:7a:3a",
            "net12": "3e:9c:19:56:4c:45",
            "net13": "0a:78:3a:a1:69:8e",
            "net14": "92:38:90:9e:00:da",
            "net2": "e2:c0:15:ad:e7:8d",
            "net3": "66:b8:b3:12:e4:50",
            "net4": "7a:2b:48:de:23:4b",
            "net5": "de:39:81:70:74:26",
            "net6": "7e:36:8d:1e:72:63",
            "net7": "1a:05:2d:95:c6:63",
            "net8": "92:ce:08:d3:39:4d",
            "net9": "1e:74:63:70:61:a3"
        },
        "leaf_1_0_11": {
            "net0": "82:cb:51:f8:44:cf",
            "net1": "1e:c3:d5:7d:5c:c1",
            "net10": "aa:ac:bc:31:72:bc",
            "net11": "5e:89:23:b6:04:26",
            "net12": "ca:30:93:9e:b2:d8",
            "net13": "22:f1:d5:12:a4:a7",
            "net14": "06:0a:21:5e:42:fc",
            "net2": "fe:c8:ea:55:73:2a",
            "net3": "3a:bb:0c:1a:c2:47",
            "net4": "62:e8:35:1d:54:57",
            "net5": "42:1e:05:1a:ec:c3",
            "net6": "0e:61:16:84:85:77",
            "net7": "de:da:69:e5:46:5c",
            "net8": "72:fe:5a:19:27:60",
            "net9": "1a:ae:af:0d:07:a0"
        },
        "leaf_1_0_12": {
            "net0": "7e:59:c1:8b:a2:01",
            "net1": "32:5f:ad:92:32:16",
            "net10": "22:c2:e4:e2:b4:71",
            "net11": "b6:d8:02:d6:f1:d0",
            "net12": "76:9a:88:41:17:e6",
            "net13": "56:f9:b8:a3:a3:94",
            "net14": "46:13:d8:b1:8a:55",
            "net2": "e2:a6:61:78:12:d6",
            "net3": "4a:22:46:ad:80:11",
            "net4": "3e:f8:3a:11:2f:91",
            "net5": "d2:2e:87:a1:a4:41",
            "net6": "c6:14:c2:bc:a3:0f",
            "net7": "ae:e6:49:2e:2f:32",
            "net8": "de:6a:04:6a:1b:08",
            "net9": "a2:8b:b8:b6:17:2a"
        },
        "leaf_1_0_13": {
            "net0": "a6:0b:f4:fc:f3:01",
            "net1": "1e:eb:9f:fe:24:07",
            "net10": "72:f5:df:aa:68:a1",
            "net11": "1e:92:ed:64:0b:19",
            "net12": "ce:a3:cb:15:56:4f",
            "net13": "f6:a5:89:1d:f0:5b",
            "net14": "3a:25:10:70:a3:c9",
            "net2": "5a:12:6f:eb:15:ac",
            "net3": "5e:ff:d9:56:03:ad",
            "net4": "d2:96:30:f5:8b:1b",
            "net5": "22:e9:76:c3:e7:66",
            "net6": "7a:7d:51:2c:54:fc",
            "net7": "46:f0:4c:01:2d:50",
            "net8": "3a:bd:5e:22:7e:53",
            "net9": "ee:84:0e:0c:1b:3e"
        },
        "leaf_1_0_14": {
            "net0": "ca:91:3d:a4:f0:59",
            "net1": "c2:1c:2f:2f:04:fc",
            "net10": "66:42:88:b0:d6:01",
            "net11": "5a:c7:e5:a1:ad:e7",
            "net12": "46:f1:b2:fd:7c:68",
            "net13": "76:4d:5b:42:13:44",
            "net14": "16:8c:2f:25:df:91",
            "net2": "2a:30:24:92:ec:64",
            "net3": "82:6c:b1:76:46:0e",
            "net4": "9e:cd:4b:f4:93:95",
            "net5": "ca:90:dd:43:ed:27",
            "net6": "92:be:e5:1d:b0:7d",
            "net7": "3e:e5:4f:1b:8e:df",
            "net8": "7e:cf:fa:f0:e9:fa",
            "net9": "2a:b8:83:45:f9:3f"
        },
        "leaf_1_0_2": {
            "net0": "56:33:da:42:df:3d",
            "net1": "72:a6:c2:0c:24:27",
            "net10": "e6:23:ec:89:b6:01",
            "net11": "32:41:d5:e7:a9:9c",
            "net12": "ba:10:cb:ba:20:04",
            "net13": "a2:dd:79:75:78:a6",
            "net14": "92:07:0e:4d:99:7a",
            "net2": "7e:9c:b8:fc:1b:bb",
            "net3": "ce:d5:d0:c0:b5:7a",
            "net4": "8e:f2:65:c3:14:a1",
            "net5": "52:95:0e:b2:f2:14",
            "net6": "3a:e9:81:78:d6:2a",
            "net7": "72:40:ae:85:2a:d3",
            "net8": "06:83:10:0a:6d:f0",
            "net9": "52:59:d3:f9:e9:a1"
        },
        "leaf_1_0_3": {
            "net0": "b2:71:f6:1c:aa:a8",
            "net1": "3a:9d:26:2d:de:8f",
            "net10": "22:0a:c8:70:09:85",
            "net11": "72:43:05:8d:6e:b6",
            "net12": "d6:69:9c:51:f6:11",
            "net13": "7a:4f:55:d6:a6:cb",
            "net14": "b6:42:ee:d3:a4:9d",
            "net2": "e6:48:45:ff:04:c4",
            "net3": "fa:b8:89:c0:6c:23",
            "net4": "42:95:9e:d5:e8:f4",
            "net5": "de:5e:86:fe:c5:97",
            "net6": "f6:f9:92:3b:90:b4",
            "net7": "be:2c:5b:e1:fb:9f",
            "net8": "16:50:ae:19:b6:96",
            "net9": "22:79:bd:89:fb:75"
        },
        "leaf_1_0_4": {
            "net0": "de:58:63:6d:b7:e9",
            "net1": "2a:22:ad:88:97:5b",
            "net10": "96:64:5c:45:bf:c3",
            "net11": "26:7b:d9:bc:33:9a",
            "net12": "56:d7:a9:48:17:2f",
            "net13": "de:21:e0:94:6a:e5",
            "net14": "da:c2:dc:ac:7e:f4",
            "net2": "3e:0d:12:dd:1b:7c",
            "net3": "e2:66:30:73:71:d0",
            "net4": "a2:32:37:22:4f:24",
            "net5": "d6:23:89:6a:5a:13",
            "net6": "ea:7d:0a:56:82:e7",
            "net7": "76:31:2c:22:74:4b",
            "net8": "82:24:64:68:87:e6",
            "net9": "fe:28:32:0a:5f:66"
        },
        "leaf_1_0_5": {
            "net0": "fa:99:9b:6f:50:2b",
            "net1": "c6:a0:7b:0f:64:8b",
            "net10": "92:3e:55:b3:4c:c8",
            "net11": "66:47:df:60:65:a3",
            "net12": "8a:09:c1:23:73:98",
            "net13": "e2:93:72:e8:eb:87",
            "net14": "26:96:0b:72:96:96",
            "net2": "6a:f3:bc:f7:66:9d",
            "net3": "2e:60:aa:5c:34:d8",
            "net4": "72:61:6b:7f:b5:7c",
            "net5": "36:9c:1c:9c:18:c2",
            "net6": "fa:41:83:fa:d6:52",
            "net7": "9a:4e:10:1c:0d:a5",
            "net8": "ca:61:93:54:8b:04",
            "net9": "f6:39:50:c9:90:39"
        },
        "leaf_1_0_6": {
            "net0": "aa:f9:3a:59:94:0c",
            "net1": "76:98:75:e2:1c:c8",
            "net10": "be:af:a2:61:5c:a5",
            "net11": "c2:4b:19:c6:de:61",
            "net12": "c2:7c:c4:b3:15:78",
            "net13": "4e:cc:05:05:b2:d0",
            "net14": "b6:cd:e3:80:8b:64",
            "net2": "5a:6c:be:06:1f:ef",
            "net3": "ea:76:13:65:a4:6e",
            "net4": "ea:01:b1:82:0d:78",
            "net5": "ea:cf:e6:b9:48:46",
            "net6": "ca:19:de:e7:f3:aa",
            "net7": "aa:5a:72:c8:ca:5a",
            "net8": "3a:c9:a9:09:ca:b5",
            "net9": "c2:89:6e:88:b6:5e"
        },
        "leaf_1_0_7": {
            "net0": "9a:df:9c:b8:2f:c3",
            "net1": "6e:f9:03:7f:a8:20",
            "net10": "de:4f:79:fa:f7:0e",
            "net11": "be:82:1a:11:ae:f6",
            "net12": "2a:8c:46:c2:b3:26",
            "net13": "1e:ad:eb:84:10:f7",
            "net14": "b2:ac:41:81:44:8f",
            "net2": "92:50:c7:29:83:44",
            "net3": "3a:ea:ee:16:ad:40",
            "net4": "ae:7b:13:47:6c:00",
            "net5": "2e:91:ac:f0:81:af",
            "net6": "5a:d1:7a:0f:49:77",
            "net7": "12:10:a2:2c:44:22",
            "net8": "2a:d1:95:f1:60:f5",
            "net9": "1e:2c:2c:15:9d:75"
        },
        "leaf_1_0_8": {
            "net0": "16:0b:b3:cb:98:35",
            "net1": "ba:2d:fa:1f:d7:37",
            "net10": "8a:57:c3:d5:91:03",
            "net11": "4e:9d:a2:62:4b:38",
            "net12": "fe:31:fa:61:55:10",
            "net13": "8e:20:1d:f4:14:14",
            "net14": "02:5d:e7:38:2a:78",
            "net2": "02:c1:9e:1b:e0:47",
            "net3": "be:e2:73:4c:cc:e4",
            "net4": "26:d2:0e:6c:38:84",
            "net5": "92:17:b4:4b:67:13",
            "net6": "2a:58:58:0b:9f:09",
            "net7": "fe:a3:49:b0:c8:93",
            "net8": "e6:d0:79:48:a4:ea",
            "net9": "fa:b0:5e:53:a9:2e"
        },
        "leaf_1_0_9": {
            "net0": "72:5e:a3:0f:dc:db",
            "net1": "e6:9f:57:e5:7f:4a",
            "net10": "f2:ec:b1:1e:f9:12",
            "net11": "4e:05:35:64:66:05",
            "net12": "96:8e:4f:73:60:d3",
            "net13": "02:71:c6:01:ff:67",
            "net14": "e2:26:66:b1:b9:ad",
            "net2": "ca:d0:9d:9b:3c:9f",
            "net3": "52:21:fb:11:be:45",
            "net4": "02:5d:d3:1a:41:11",
            "net5": "b2:2b:81:f2:19:55",
            "net6": "16:03:16:27:f1:d5",
            "net7": "4e:c0:56:ce:40:a4",
            "net8": "d2:9c:8a:8c:ca:da",
            "net9": "6e:e0:cc:c3:e9:09"
        },
        "leaf_2_0_1": {
            "net0": "66:c8:3b:35:91:1b",
            "net1": "86:c0:f6:6a:8d:c5",
            "net10": "12:46:bd:36:3c:4d",
            "net11": "4a:83:be:37:56:2b",
            "net12": "26:0d:aa:57:66:cb",
            "net13": "12:ce:7d:86:81:20",
            "net14": "c6:bc:ff:7d:91:85",
            "net2": "0e:26:7e:d3:bd:54",
            "net3": "26:72:9e:07:af:79",
            "net4": "a6:47:56:37:d5:05",
            "net5": "ca:b2:28:97:72:72",
            "net6": "a6:5d:90:13:29:37",
            "net7": "2e:67:4f:3b:6b:bd",
            "net8": "0a:64:65:f3:f0:3b",
            "net9": "62:e2:c6:d9:3a:24"
        },
        "leaf_2_0_10": {
            "net0": "62:ce:e9:41:d4:9e",
            "net1": "1e:e5:21:21:6a:6f",
            "net10": "96:25:95:93:89:52",
            "net11": "fa:9b:c5:ac:58:67",
            "net12": "32:c7:3c:a1:da:19",
            "net13": "b6:90:30:ee:48:4e",
            "net14": "ce:b3:35:df:87:d9",
            "net2": "b6:61:1d:ce:4e:99",
            "net3": "16:13:4c:c5:54:c0",
            "net4": "5a:95:46:24:00:5f",
            "net5": "1e:fa:bc:f7:46:b9",
            "net6": "26:63:8f:63:3f:ed",
            "net7": "ba:38:7b:38:27:e6",
            "net8": "f2:a1:1a:2c:f0:2a",
            "net9": "92:1c:7b:77:74:ca"
        },
        "leaf_2_0_11": {
            "net0": "aa:56:1e:bf:05:9e",
            "net1": "66:21:80:9d:8c:2e",
            "net10": "de:28:7c:a9:5b:7b",
            "net11": "ea:da:ad:e0:38:63",
            "net12": "32:48:6d:b9:34:c8",
            "net13": "5e:d8:e3:5d:66:4e",
            "net14": "de:30:51:aa:d0:85",
            "net2": "a6:77:a5:ea:04:89",
            "net3": "4e:6c:f3:5f:96:a2",
            "net4": "02:4d:37:c4:10:c1",
            "net5": "5a:7a:5a:8e:20:5d",
            "net6": "82:60:e4:c5:17:14",
            "net7": "12:ce:ff:24:bc:72",
            "net8": "62:71:69:d0:f4:8e",
            "net9": "ae:1e:55:df:3e:c6"
        },
        "leaf_2_0_12": {
            "net0": "8e:20:09:1b:0d:c5",
            "net1": "c6:c3:90:1d:b5:e1",
            "net10": "ee:05:34:36:a5:08",
            "net11": "82:16:7b:2e:38:80",
            "net12": "76:29:a5:fd:ec:c7",
            "net13": "b2:86:a0:83:8a:d4",
            "net14": "de:58:15:37:e7:6a",
            "net2": "36:0f:50:40:39:8d",
            "net3": "5e:22:cd:41:23:dc",
            "net4": "fa:9b:1e:8d:5a:5c",
            "net5": "16:92:cf:12:0a:97",
            "net6": "4a:39:0c:a5:3e:16",
            "net7": "5a:9e:15:53:0d:09",
            "net8": "06:2b:55:5c:21:d1",
            "net9": "36:d5:13:5d:c4:7f"
        },
        "leaf_2_0_13": {
            "net0": "8e:69:4b:02:70:71",
            "net1": "62:35:27:a1:0e:f7",
            "net10": "1a:79:36:bc:a0:62",
            "net11": "76:d4:65:45:b3:a7",
            "net12": "c6:c3:77:ab:e5:95",
            "net13": "56:81:67:64:67:2d",
            "net14": "4e:50:ca:d1:7d:ba",
            "net2": "ce:35:4e:ec:21:5d",
            "net3": "f2:0a:61:ef:97:eb",
            "net4": "26:ca:ca:e3:5d:df",
            "net5": "72:b8:a3:e3:bd:d0",
            "net6": "66:e1:44:2c:73:00",
            "net7": "ca:e6:e2:67:3e:70",
            "net8": "42:5b:65:94:2d:5a",
            "net9": "7e:a1:c5:d0:07:0f"
        },
        "leaf_2_0_14": {
            "net0": "02:cf:a7:2b:4d:de",
            "net1": "ae:47:94:30:ca:6b",
            "net10": "32:5f:0e:d6:95:ed",
            "net11": "7e:4b:4b:41:ad:5a",
            "net12": "22:34:ee:c5:ca:15",
            "net13": "9e:9f:a4:e0:95:f7",
            "net14": "6e:42:1a:7b:fe:e1",
            "net2": "9e:5f:39:81:c0:3c",
            "net3": "56:60:b8:3e:da:bf",
            "net4": "92:57:92:e9:af:d2",
            "net5": "ea:43:51:9e:0b:37",
            "net6": "f6:09:27:67:74:d6",
            "net7": "e6:9f:c8:e7:66:b8",
            "net8": "7e:3a:30:c1:38:0a",
            "net9": "4e:be:6b:a2:73:5b"
        },
        "leaf_2_0_2": {
            "net0": "9e:c8:43:63:a6:60",
            "net1": "06:60:b5:c2:74:cd",
            "net10": "0a:d2:73:8d:0c:dd",
            "net11": "1e:0f:a1:0b:bc:b1",
            "net12": "5e:ef:26:19:e2:3c",
            "net13": "6e:f4:3a:48:a9:60",
            "net14": "16:ea:48:2b:94:9b",
            "net2": "02:45:55:02:7b:0a",
            "net3": "8a:4b:a6:d9:a3:60",
            "net4": "9e:e2:87:03:4f:44",
            "net5": "a6:61:2f:4e:c7:e1",
            "net6": "02:e6:5b:92:17:d6",
            "net7": "16:6e:a8:89:df:80",
            "net8": "3e:d2:cf:b7:07:39",
            "net9": "da:5b:68:f9:45:4c"
        },
        "leaf_2_0_3": {
            "net0": "d2:15:ef:fa:6d:32",
            "net1": "86:ea:df:fe:5a:76",
            "net10": "32:a9:57:e5:8d:a7",
            "net11": "1e:3e:50:ed:99:f2",
            "net12": "06:38:3b:26:2b:ac",
            "net13": "be:97:ca:a7:b9:b0",
            "net14": "f6:5c:96:ca:9f:60",
            "net2": "12:dc:de:a1:81:c6",
            "net3": "aa:18:55:58:b5:fa",
            "net4": "e6:58:78:9c:a2:c3",
            "net5": "de:d2:b3:b1:9b:1c",
            "net6": "ca:c1:88:d6:17:d3",
            "net7": "da:57:ad:89:b3:5d",
            "net8": "9a:ac:06:1b:ce:cc",
            "net9": "62:72:07:0c:50:06"
        },
        "leaf_2_0_4": {
            "net0": "92:03:a6:94:54:67",
            "net1": "5a:9b:a5:a5:9a:55",
            "net10": "06:6b:f0:1b:b1:d9",
            "net11": "36:a9:fe:4b:9f:de",
            "net12": "7a:5f:a0:13:aa:f5",
            "net13": "be:15:2b:0f:21:9a",
            "net14": "4e:b5:63:cb:5f:a8",
            "net2": "2a:5b:af:8f:68:85",
            "net3": "46:76:b8:8a:5d:d4",
            "net4": "82:e4:30:2c:2a:25",
            "net5": "5e:34:5f:99:db:75",
            "net6": "e2:cb:a8:e7:00:3d",
            "net7": "2a:27:f8:9f:dc:87",
            "net8": "76:5b:00:68:f3:19",
            "net9": "1e:a3:ef:2b:22:75"
        },
        "leaf_2_0_5": {
            "net0": "26:20:cb:4e:6a:96",
            "net1": "1a:7b:f1:bd:94:4c",
            "net10": "2e:01:83:75:13:bf",
            "net11": "62:f7:0d:6d:78:2a",
            "net12": "0a:5a:84:37:b6:9f",
            "net13": "f2:a9:aa:91:1a:e3",
            "net14": "b2:6d:34:34:53:87",
            "net2": "32:bd:ec:51:01:71",
            "net3": "4a:fa:a4:83:7e:da",
            "net4": "f2:ab:0e:b5:d7:05",
            "net5": "3a:60:ad:28:0f:8a",
            "net6": "b6:8c:c1:48:74:cc",
            "net7": "3a:e5:41:7d:11:08",
            "net8": "aa:e2:4e:06:56:f9",
            "net9": "12:0f:77:ad:dc:cf"
        },
        "leaf_2_0_6": {
            "net0": "de:99:87:71:7a:0f",
            "net1": "2e:d9:7e:75:bc:03",
            "net10": "ca:c7:b7:cc:b6:fd",
            "net11": "1e:b8:91:62:f5:6f",
            "net12": "96:8b:b3:8b:cb:7f",
            "net13": "f2:44:78:99:a6:1f",
            "net14": "82:51:42:38:f7:73",
            "net2": "ce:c9:52:c3:6a:08",
            "net3": "3e:41:ce:2d:86:a4",
            "net4": "96:8f:e2:11:a3:9b",
            "net5": "ba:89:d5:e0:d7:9a",
            "net6": "ce:35:9f:3a:b1:92",
            "net7": "7a:a5:69:ba:a0:6e",
            "net8": "ae:78:03:ba:70:6e",
            "net9": "ea:8b:c8:5e:48:50"
        },
        "leaf_2_0_7": {
            "net0": "0e:31:9a:47:e1:44",
            "net1": "ee:80:9d:df:02:0c",
            "net10": "e6:f7:27:80:73:b6",
            "net11": "da:80:4a:48:76:90",
            "net12": "7a:a1:87:e8:31:aa",
            "net13": "0a:b9:1d:56:35:f1",
            "net14": "6e:fc:1d:6c:3d:9b",
            "net2": "2a:5a:76:15:49:2c",
            "net3": "9e:fd:d7:7a:3b:4d",
            "net4": "ea:63:5b:2d:62:36",
            "net5": "f2:7c:62:c6:77:cb",
            "net6": "86:36:db:76:ce:96",
            "net7": "12:6e:a5:75:67:79",
            "net8": "c6:5a:93:da:de:5d",
            "net9": "e2:bb:d2:1a:a3:cc"
        },
        "leaf_2_0_8": {
            "net0": "d6:73:7f:41:32:bb",
            "net1": "ba:b7:93:1b:0e:9d",
            "net10": "0e:fe:8e:82:57:ce",
            "net11": "62:d1:83:58:cc:c7",
            "net12": "de:b5:0a:ce:7a:48",
            "net13": "0a:1d:45:8e:10:04",
            "net14": "da:c1:96:34:1f:8b",
            "net2": "62:7a:a9:2b:43:21",
            "net3": "1a:7f:0a:f9:39:2d",
            "net4": "e6:45:b4:6d:78:40",
            "net5": "1e:cc:7c:ac:2a:de",
            "net6": "ce:c3:38:ad:d6:1a",
            "net7": "f6:7b:ad:d2:c9:76",
            "net8": "76:43:d8:7f:4b:3f",
            "net9": "56:0d:78:99:96:7c"
        },
        "leaf_2_0_9": {
            "net0": "ea:ac:2d:5e:0d:c8",
            "net1": "62:a1:4c:7a:e3:ca",
            "net10": "02:13:8b:f5:2e:eb",
            "net11": "0e:8f:01:d3:d8:56",
            "net12": "56:12:58:bc:20:2b",
            "net13": "d6:b0:64:3d:64:d3",
            "net14": "2a:83:ad:5b:59:e5",
            "net2": "7a:76:52:a1:d2:8f",
            "net3": "f6:85:4d:97:88:62",
            "net4": "36:9d:c5:e9:f8:08",
            "net5": "82:e3:e7:fd:40:25",
            "net6": "6e:e8:b7:58:8d:b4",
            "net7": "f6:98:b8:3a:37:ee",
            "net8": "2e:f6:62:7c:d8:5a",
            "net9": "22:90:e3:4a:c9:77"
        },
        "spine_1_1_1": {
            "net0": "be:49:40:e2:7d:83",
            "net1": "f6:a0:be:68:8b:ff",
            "net10": "6e:2a:50:ae:b5:7b",
            "net11": "8e:32:e3:a0:04:20",
            "net12": "12:e3:05:68:58:16",
            "net13": "c2:fd:b1:6a:bb:63",
            "net14": "02:53:53:2e:87:2c",
            "net15": "a6:25:ee:99:70:ec",
            "net16": "42:bf:1d:62:66:1c",
            "net17": "ca:b1:39:3c:cf:29",
            "net18": "36:9e:9d:06:9f:a4",
            "net19": "7e:1f:36:7c:a5:f6",
            "net2": "46:d4:c3:79:fd:a0",
            "net20": "ca:9b:23:c7:f2:7a",
            "net21": "5a:b6:06:29:11:1d",
            "net22": "46:9a:cf:d5:64:3c",
            "net23": "6e:91:cd:a6:e4:20",
            "net24": "d6:60:95:7d:6c:15",
            "net25": "66:99:45:75:03:4a",
            "net26": "3a:29:dd:c2:36:b6",
            "net27": "b6:4d:2f:a2:4d:24",
            "net3": "56:53:af:cf:e0:84",
            "net4": "2e:1f:68:43:d7:e3",
            "net5": "82:b0:39:d7:50:c6",
            "net6": "e6:c2:89:00:85:bc",
            "net7": "a2:1e:7f:c4:31:5b",
            "net8": "f2:fc:7c:fc:34:1d",
            "net9": "76:c9:c0:ee:e6:20"
        },
        "spine_1_1_10": {
            "net0": "86:30:7f:3b:34:59",
            "net1": "2a:2b:83:07:f3:9c",
            "net10": "fa:9f:8d:66:17:06",
            "net11": "8e:19:16:01:36:45",
            "net12": "3e:a1:6c:db:f5:7c",
            "net13": "22:60:30:50:89:f6",
            "net14": "de:ec:da:31:46:b3",
            "net15": "1e:51:bd:3a:38:08",
            "net16": "5a:b2:02:d6:32:64",
            "net17": "ae:49:c0:f9:4a:1f",
            "net18": "e6:c7:d0:04:98:1f",
            "net19": "ba:97:7f:49:db:9d",
            "net2": "92:31:e6:95:89:18",
            "net20": "ea:87:e6:7a:6a:be",
            "net21": "3e:16:2f:24:f5:82",
            "net22": "8e:77:f5:2b:12:e7",
            "net23": "c2:0c:63:3d:de:3f",
            "net24": "12:32:57:2f:33:18",
            "net25": "3e:a0:e6:02:4c:23",
            "net26": "da:e9:af:5e:dc:f3",
            "net27": "ea:4e:d5:2b:60:85",
            "net3": "36:15:07:d3:da:50",
            "net4": "9e:b6:63:a2:4d:c0",
            "net5": "7e:dc:ec:16:b6:07",
            "net6": "3e:45:39:b3:fd:da",
            "net7": "ee:a8:3d:e3:d5:fc",
            "net8": "76:30:5e:8b:5b:9c",
            "net9": "c2:95:44:9e:ba:d6"
        },
        "spine_1_1_11": {
            "net0": "5e:df:d1:c8:7b:c2",
            "net1": "76:5c:11:22:3a:c6",
            "net10": "62:d2:2e:14:aa:52",
            "net11": "56:7b:89:21:f3:83",
            "net12": "6e:f2:13:e2:ec:0e",
            "net13": "16:ba:76:89:2f:ee",
            "net14": "fa:f1:d4:f9:aa:23",
            "net15": "d6:8f:a8:11:18:0c",
            "net16": "fa:a1:38:0a:b3:90",
            "net17": "26:18:ac:96:fc:67",
            "net18": "e2:51:dd:78:b4:87",
            "net19": "6e:07:78:3d:60:90",
            "net2": "06:32:6f:80:f8:87",
            "net20": "ae:57:2f:bf:b7:5e",
            "net21": "d6:b1:2d:b4:79:a2",
            "net22": "62:08:ca:9a:79:f1",
            "net23": "d6:7f:af:5f:4d:eb",
            "net24": "86:e3:cd:7e:87:16",
            "net25": "26:b8:1f:ba:d0:d2",
            "net26": "3a:cd:21:ed:9b:7f",
            "net27": "26:ce:88:26:cc:25",
            "net3": "82:54:56:ae:9d:e0",
            "net4": "b2:f5:53:14:7f:68",
            "net5": "be:40:20:2d:d4:bf",
            "net6": "4e:e7:6f:b8:2e:f8",
            "net7": "02:24:30:56:6c:6c",
            "net8": "c6:8f:01:3b:fe:7b",
            "net9": "96:a4:0d:16:28:45"
        },
        "spine_1_1_12": {
            "net0": "12:ae:02:ed:f8:3d",
            "net1": "96:5f:8d:bf:ea:8a",
            "net10": "82:d5:98:60:cd:6f",
            "net11": "ca:0e:1c:b0:72:55",
            "net12": "be:94:5a:c1:89:8f",
            "net13": "be:aa:eb:3c:84:fe",
            "net14": "82:f3:af:b7:64:37",
            "net15": "8e:fd:47:ce:85:87",
            "net16": "ca:52:6c:9d:66:b4",
            "net17": "52:c3:cc:83:90:5c",
            "net18": "da:80:71:7b:8d:19",
            "net19": "da:2a:61:e7:2c:59",
            "net2": "2a:08:ea:17:c6:84",
            "net20": "0a:bf:13:f9:5c:7e",
            "net21": "96:4d:35:5f:d7:3f",
            "net22": "42:06:e6:f2:3b:f7",
            "net23": "32:ae:49:c3:bb:6c",
            "net24": "1e:1d:fa:c6:c3:a8",
            "net25": "ae:db:08:29:e2:0d",
            "net26": "32:63:a4:20:3a:e6",
            "net27": "a6:be:36:d4:82:36",
            "net3": "b6:44:8c:b6:8d:26",
            "net4": "d6:75:fc:e3:1b:d7",
            "net5": "22:b0:45:da:cc:bc",
            "net6": "96:93:70:01:9e:de",
            "net7": "2e:f3:a6:23:9a:8a",
            "net8": "66:1b:73:e6:71:16",
            "net9": "06:ff:fe:47:10:ce"
        },
        "spine_1_1_13": {
            "net0": "6e:83:bd:1a:57:03",
            "net1": "ca:fa:9b:49:86:1f",
            "net10": "e2:6c:dd:f4:82:09",
            "net11": "ea:ad:eb:b7:03:e6",
            "net12": "46:a8:b1:c3:6a:26",
            "net13": "56:7a:5d:1d:05:08",
            "net14": "c6:e1:db:5f:82:2d",
            "net15": "42:99:0d:c9:73:ac",
            "net16": "5e:3c:04:9b:1b:8d",
            "net17": "2a:10:1e:46:d8:b2",
            "net18": "5e:34:d9:2e:f3:de",
            "net19": "ba:da:ad:7c:87:b1",
            "net2": "fa:8b:2f:f7:11:b2",
            "net20": "be:cc:f9:0e:f0:f2",
            "net21": "f6:dc:04:fd:be:dd",
            "net22": "c6:a4:85:7a:d4:eb",
            "net23": "b2:69:44:14:54:ac",
            "net24": "2a:e1:5c:f7:9b:91",
            "net25": "22:33:cf:c0:43:b9",
            "net26": "da:f7:4c:98:62:47",
            "net27": "0e:23:64:3f:29:2a",
            "net3": "ce:02:84:dd:91:e3",
            "net4": "ae:bf:e1:81:00:11",
            "net5": "de:1b:bc:f2:69:7d",
            "net6": "96:d5:40:d0:d7:a0",
            "net7": "46:7e:8d:b4:60:68",
            "net8": "2a:b7:ac:1b:b4:02",
            "net9": "a6:25:a5:30:2c:66"
        },
        "spine_1_1_14": {
            "net0": "7a:c9:7d:cc:f1:d7",
            "net1": "6a:a7:28:3c:b0:a9",
            "net10": "32:a5:52:29:a2:36",
            "net11": "a2:ff:64:59:56:e1",
            "net12": "f2:76:d4:8f:78:b1",
            "net13": "72:2e:9c:f7:49:fb",
            "net14": "82:c9:70:87:32:c2",
            "net15": "36:94:ca:72:6a:7d",
            "net16": "02:18:07:96:1b:3c",
            "net17": "6a:b2:3e:63:c3:65",
            "net18": "f6:fb:03:85:23:f2",
            "net19": "ba:f2:8a:36:b7:c7",
            "net2": "ca:e2:30:9f:37:5c",
            "net20": "ba:26:ca:07:b2:a6",
            "net21": "26:55:2b:47:a6:55",
            "net22": "1e:63:b7:ea:9c:4e",
            "net23": "72:ae:4e:36:39:fc",
            "net24": "a6:e5:5c:af:62:88",
            "net25": "5e:8a:04:6d:cf:69",
            "net26": "82:b4:84:10:b2:84",
            "net27": "b6:dd:71:a5:80:ee",
            "net3": "62:88:60:c0:ee:60",
            "net4": "d6:30:83:f1:15:50",
            "net5": "da:c7:55:63:27:60",
            "net6": "5a:44:59:1b:c4:f4",
            "net7": "b2:0c:fa:d7:1f:a1",
            "net8": "0e:4d:48:05:6c:bb",
            "net9": "86:97:bd:3a:37:0a"
        },
        "spine_1_1_2": {
            "net0": "32:9c:5f:77:66:c2",
            "net1": "66:6e:85:6d:9b:9b",
            "net10": "0a:4f:de:e7:a3:ea",
            "net11": "66:a4:f9:e8:94:74",
            "net12": "5e:70:51:6d:07:b8",
            "net13": "de:10:2b:90:d9:bd",
            "net14": "a6:17:a5:73:42:ac",
            "net15": "f6:9e:3d:76:90:ea",
            "net16": "0a:35:83:4f:7c:94",
            "net17": "fa:a0:9b:cf:d1:bc",
            "net18": "ea:84:4b:b3:6b:9a",
            "net19": "3e:55:36:18:8b:43",
            "net2": "6e:c2:32:b9:f1:72",
            "net20": "c6:85:8a:ba:1c:e4",
            "net21": "ba:50:a7:a7:b0:19",
            "net22": "ea:b9:65:a1:ac:87",
            "net23": "3a:8c:77:d4:99:e3",
            "net24": "7e:8b:e6:6f:c4:45",
            "net25": "6e:72:a2:ac:88:2d",
            "net26": "3a:d1:45:5a:e2:76",
            "net27": "be:de:2d:df:89:0c",
            "net3": "76:35:34:7c:35:3c",
            "net4": "62:77:67:b2:ab:e9",
            "net5": "f6:f3:77:11:36:10",
            "net6": "c6:0f:66:90:3a:fe",
            "net7": "22:23:e1:d5:b9:5d",
            "net8": "26:33:5b:10:18:a5",
            "net9": "2a:cd:e6:6f:70:f9"
        },
        "spine_1_1_3": {
            "net0": "66:6c:c8:f1:6d:c4",
            "net1": "d2:32:09:23:12:29",
            "net10": "22:38:f2:76:b5:19",
            "net11": "e6:56:24:ab:7f:46",
            "net12": "82:26:61:07:3f:12",
            "net13": "12:15:1c:c1:60:22",
            "net14": "96:ec:68:05:f3:25",
            "net15": "76:fe:43:5f:9a:aa",
            "net16": "da:af:97:a2:83:c1",
            "net17": "52:ff:37:bf:e2:d2",
            "net18": "ea:3c:e4:7b:36:f5",
            "net19": "22:d6:2f:ee:4a:92",
            "net2": "f6:f7:cc:0c:4a:58",
            "net20": "b2:ec:6c:38:d0:ba",
            "net21": "ae:48:c8:ad:03:ac",
            "net22": "76:94:2f:8b:09:1d",
            "net23": "72:f1:1c:2c:0a:49",
            "net24": "6e:e4:13:bd:cd:1c",
            "net25": "8e:6d:12:54:41:b3",
            "net26": "be:f2:05:a5:a5:bf",
            "net27": "d6:63:30:17:dd:87",
            "net3": "7a:60:45:3e:d9:68",
            "net4": "8e:1d:00:8d:ab:8f",
            "net5": "e6:33:40:59:71:33",
            "net6": "6e:c9:05:0b:49:41",
            "net7": "3e:f2:6f:4d:9c:90",
            "net8": "d6:ee:2f:9e:61:9b",
            "net9": "fa:9f:8a:c1:79:34"
        },
        "spine_1_1_4": {
            "net0": "fe:37:35:04:5b:8d",
            "net1": "da:f1:46:f3:e4:b4",
            "net10": "0a:fd:02:a1:1e:35",
            "net11": "76:f6:65:30:0f:c9",
            "net12": "72:c6:f3:2b:f7:13",
            "net13": "6a:80:ee:11:7e:50",
            "net14": "a2:00:ee:4a:d6:c6",
            "net15": "be:3f:c9:4b:07:43",
            "net16": "76:a3:03:bb:e3:29",
            "net17": "ba:cc:74:db:c8:db",
            "net18": "ba:dd:03:bd:5f:1a",
            "net19": "d6:fb:4f:2d:71:a0",
            "net2": "e6:91:c9:25:a9:f3",
            "net20": "5a:8e:64:9d:59:f4",
            "net21": "b6:63:08:b2:90:f3",
            "net22": "46:4b:9e:b3:d5:96",
            "net23": "0a:5f:af:77:93:c8",
            "net24": "fa:64:8f:c3:3e:aa",
            "net25": "0a:5c:ef:94:b1:a3",
            "net26": "4e:fa:b3:90:3e:e7",
            "net27": "16:40:e0:9d:7b:14",
            "net3": "2a:49:98:01:45:8f",
            "net4": "e6:4b:15:99:44:c8",
            "net5": "8a:72:15:b1:4c:d5",
            "net6": "e2:d0:f4:a3:d4:11",
            "net7": "72:86:fd:eb:5c:6f",
            "net8": "e2:6e:46:be:d7:e5",
            "net9": "c6:38:6c:3b:d5:3e"
        },
        "spine_1_1_5": {
            "net0": "26:1c:5d:bf:ad:6f",
            "net1": "a2:ad:f5:5f:27:cb",
            "net10": "1a:cf:23:1b:5a:f5",
            "net11": "ba:4c:60:84:83:36",
            "net12": "12:ed:54:f2:2e:21",
            "net13": "32:5d:17:46:cd:68",
            "net14": "ba:ae:d1:e2:4e:63",
            "net15": "16:03:16:f1:24:66",
            "net16": "56:77:6c:28:c6:33",
            "net17": "d2:84:f2:7f:db:c6",
            "net18": "ba:16:c2:8d:ad:9e",
            "net19": "b6:5d:0e:b4:7e:de",
            "net2": "92:70:21:9a:cc:fe",
            "net20": "5e:f9:08:18:fa:5e",
            "net21": "ae:e2:31:7f:f1:58",
            "net22": "fa:b1:23:eb:ba:36",
            "net23": "aa:4e:16:cc:eb:50",
            "net24": "aa:b2:6e:b1:e2:e1",
            "net25": "da:92:02:04:e7:18",
            "net26": "56:a5:a6:72:d3:b7",
            "net27": "42:db:6e:cd:a9:91",
            "net3": "92:d4:f0:3f:a1:f9",
            "net4": "1e:82:66:de:7c:68",
            "net5": "66:08:d1:08:a9:6f",
            "net6": "2a:7f:52:dc:17:b7",
            "net7": "f2:53:c0:94:3c:61",
            "net8": "32:20:e3:6e:18:89",
            "net9": "a6:52:45:9e:04:1c"
        },
        "spine_1_1_6": {
            "net0": "0a:f5:00:16:ef:7a",
            "net1": "7a:a5:e3:73:c8:35",
            "net10": "d6:57:62:e8:e3:d6",
            "net11": "c6:e0:07:d0:f5:bb",
            "net12": "a6:50:ef:89:e6:02",
            "net13": "3a:48:cb:13:0b:c8",
            "net14": "06:d3:ee:2e:dd:a3",
            "net15": "c6:0d:d4:43:3e:95",
            "net16": "f6:72:e7:05:87:45",
            "net17": "b2:43:85:d0:26:d5",
            "net18": "52:10:c7:44:88:19",
            "net19": "2a:44:9a:a7:b8:5b",
            "net2": "92:ac:2f:11:de:20",
            "net20": "d6:f2:5a:b5:f8:30",
            "net21": "7a:f5:e5:ab:a4:a6",
            "net22": "aa:2e:31:4f:ef:06",
            "net23": "aa:6d:95:71:bb:89",
            "net24": "3e:59:20:7a:18:cc",
            "net25": "9e:d7:b1:96:33:47",
            "net26": "2a:f8:5e:d5:a0:88",
            "net27": "7a:b8:9f:1a:f5:a7",
            "net3": "e6:ed:fd:3b:8d:33",
            "net4": "36:c6:a1:c6:65:87",
            "net5": "5e:9e:34:9f:a1:34",
            "net6": "9e:04:3e:b8:68:bb",
            "net7": "8e:86:44:22:8f:c0",
            "net8": "76:fa:01:ba:f9:18",
            "net9": "f6:07:78:c4:97:ca"
        },
        "spine_1_1_7": {
            "net0": "ce:a9:fa:5b:e5:09",
            "net1": "ba:e1:2e:42:df:f3",
            "net10": "8a:f7:25:30:a1:9b",
            "net11": "06:3f:ba:f6:04:6d",
            "net12": "5e:01:89:37:b6:76",
            "net13": "92:f6:93:70:da:02",
            "net14": "5e:c8:49:56:c0:b0",
            "net15": "d6:a8:f3:61:f1:8e",
            "net16": "ba:03:8a:7c:1a:4f",
            "net17": "72:00:0e:5e:3d:6e",
            "net18": "de:a0:bd:dc:7d:7b",
            "net19": "0a:c7:df:45:62:b1",
            "net2": "6e:0c:6b:25:98:28",
            "net20": "ea:13:d3:d8:b8:fb",
            "net21": "e2:41:60:a5:f4:c8",
            "net22": "86:be:ad:13:25:ba",
            "net23": "6e:20:6f:7f:ce:33",
            "net24": "b2:10:c9:89:99:c0",
            "net25": "ae:ad:af:79:0d:29",
            "net26": "56:22:9d:4c:ed:b4",
            "net27": "c6:39:f7:56:91:37",
            "net3": "66:a1:45:c9:f4:9d",
            "net4": "5a:e8:7c:42:23:33",
            "net5": "7e:79:85:9a:8e:01",
            "net6": "6a:a2:79:3d:dd:b2",
            "net7": "1a:29:c9:a8:c2:7e",
            "net8": "02:c2:09:80:67:b8",
            "net9": "26:ae:3b:5e:c8:ef"
        },
        "spine_1_1_8": {
            "net0": "d6:67:ba:12:7d:c4",
            "net1": "ce:d7:0e:af:39:97",
            "net10": "12:10:6a:07:5f:64",
            "net11": "ea:22:c5:8b:b6:ea",
            "net12": "26:a4:6b:4e:31:92",
            "net13": "8e:a0:4e:65:a1:17",
            "net14": "72:d9:51:e2:ad:e4",
            "net15": "c6:5e:44:b5:57:34",
            "net16": "aa:dd:12:b8:7e:bb",
            "net17": "ea:7a:f3:bd:7a:7e",
            "net18": "c6:e4:e6:ed:3d:0c",
            "net19": "22:13:ca:3c:c2:d7",
            "net2": "92:31:5b:47:60:ef",
            "net20": "e6:04:32:51:78:82",
            "net21": "6a:28:2d:b2:9e:47",
            "net22": "96:1f:ca:34:92:5d",
            "net23": "ba:e4:5d:46:e3:c2",
            "net24": "96:41:44:32:d1:1b",
            "net25": "0e:fc:20:1c:27:9e",
            "net26": "76:9b:ab:d5:83:d6",
            "net27": "8a:ea:90:0a:f6:c2",
            "net3": "5a:48:b2:b5:7f:2a",
            "net4": "b6:5d:7c:fc:47:4d",
            "net5": "e6:01:9c:84:1b:03",
            "net6": "7a:d2:8c:1e:61:06",
            "net7": "62:49:59:13:ff:18",
            "net8": "ca:51:0c:3d:b7:a5",
            "net9": "6e:79:1f:ed:98:73"
        },
        "spine_1_1_9": {
            "net0": "ce:c2:4f:88:f5:d6",
            "net1": "56:e0:fe:1c:2c:60",
            "net10": "8e:c5:8d:e0:6e:38",
            "net11": "36:1a:fc:6b:dd:ec",
            "net12": "8a:01:0f:02:df:8c",
            "net13": "3e:1f:3f:52:84:71",
            "net14": "8e:18:2e:5c:e3:10",
            "net15": "76:2c:50:d7:63:0a",
            "net16": "ba:11:aa:86:f1:d8",
            "net17": "92:26:f5:ff:86:8c",
            "net18": "da:12:b4:4a:8b:1b",
            "net19": "e2:ec:5b:2c:bb:05",
            "net2": "c2:dd:b1:9b:2f:e0",
            "net20": "26:cb:1d:9f:72:72",
            "net21": "de:cc:37:2a:67:87",
            "net22": "62:49:28:da:9d:2f",
            "net23": "6e:26:e5:25:5d:f8",
            "net24": "6a:9d:3a:dd:90:1e",
            "net25": "16:db:b8:95:01:c8",
            "net26": "66:9d:86:fa:e5:c8",
            "net27": "d2:ef:fa:4f:be:6d",
            "net3": "8e:50:6d:06:b6:cd",
            "net4": "6a:b6:b8:89:16:ab",
            "net5": "4e:f9:36:0f:d9:45",
            "net6": "1e:ad:c1:32:41:8b",
            "net7": "3a:45:84:56:45:d9",
            "net8": "62:05:6a:83:4d:d6",
            "net9": "8e:c2:31:bd:62:87"
        },
        "spine_2_1_1": {
            "net0": "3e:f8:2a:40:72:d9",
            "net1": "9a:30:7a:b6:48:0b",
            "net10": "3a:6c:8b:25:80:74",
            "net11": "76:0f:bd:8c:28:a1",
            "net12": "06:01:ea:86:59:b2",
            "net13": "7a:69:d4:d8:51:6f",
            "net14": "be:44:f4:8e:b5:3f",
            "net15": "4e:c7:08:0c:5f:b3",
            "net16": "86:20:f4:f6:4c:69",
            "net17": "6a:70:41:c8:50:8c",
            "net18": "e2:e8:b6:0a:93:43",
            "net19": "ca:ec:08:12:70:31",
            "net2": "ca:5c:3d:12:ad:20",
            "net20": "22:f0:3e:f8:05:88",
            "net21": "a6:e3:de:02:4a:3d",
            "net22": "22:c2:f2:c7:de:d6",
            "net23": "fa:88:c3:b2:97:90",
            "net24": "2e:7b:fd:e1:76:84",
            "net25": "56:73:06:46:a6:56",
            "net26": "72:6b:d0:36:0b:e3",
            "net27": "26:43:10:a5:5b:0d",
            "net3": "62:6c:c1:c9:db:68",
            "net4": "0a:1f:e5:ec:11:88",
            "net5": "ba:54:48:f6:7e:78",
            "net6": "46:97:1e:af:70:67",
            "net7": "46:f3:85:45:1b:31",
            "net8": "52:b3:e9:3e:d1:43",
            "net9": "8a:a1:98:68:7b:15"
        },
        "spine_2_1_10": {
            "net0": "8a:cb:74:54:a7:2e",
            "net1": "22:0f:ec:3d:1f:d9",
            "net10": "76:44:af:ac:a3:3f",
            "net11": "f2:63:b1:98:ac:63",
            "net12": "56:e3:5d:78:e8:09",
            "net13": "96:5b:3f:a4:d9:f7",
            "net14": "6a:a7:4d:8e:4b:2a",
            "net15": "da:12:16:1b:b0:f6",
            "net16": "92:4b:e4:cf:a3:17",
            "net17": "be:dd:d3:cf:b3:7a",
            "net18": "ee:5a:30:e7:dc:09",
            "net19": "c6:67:17:c3:8b:98",
            "net2": "82:e2:7c:d6:7c:ad",
            "net20": "16:50:3b:1e:61:54",
            "net21": "66:a0:7b:e7:a8:bc",
            "net22": "d2:3a:54:10:83:7e",
            "net23": "ae:b6:36:a5:3a:ff",
            "net24": "be:9c:9c:5f:6b:6b",
            "net25": "8a:9b:a3:d8:39:ed",
            "net26": "76:7c:d4:5f:5d:93",
            "net27": "56:4f:eb:b8:11:bb",
            "net3": "8e:26:b9:1e:bc:26",
            "net4": "da:94:29:67:19:51",
            "net5": "8a:26:39:fd:5b:ac",
            "net6": "52:82:94:72:5c:3a",
            "net7": "1e:e3:94:56:f1:19",
            "net8": "92:12:85:60:fa:eb",
            "net9": "6e:2d:13:4e:b1:e9"
        },
        "spine_2_1_11": {
            "net0": "32:b5:3c:31:79:81",
            "net1": "b2:56:e9:7c:7d:9f",
            "net10": "2e:b8:b6:8b:27:d5",
            "net11": "72:20:bd:8c:85:9b",
            "net12": "e6:c1:56:65:85:35",
            "net13": "be:04:13:45:3e:d8",
            "net14": "b2:f3:3a:51:d6:e9",
            "net15": "96:25:25:98:2c:bd",
            "net16": "12:b6:2a:ba:8e:2d",
            "net17": "e6:7f:1b:93:87:e8",
            "net18": "a2:51:a4:8e:71:23",
            "net19": "8a:d9:67:55:17:4e",
            "net2": "6e:df:45:02:05:ac",
            "net20": "7e:76:98:d2:3e:f0",
            "net21": "66:7a:2b:64:28:a4",
            "net22": "5a:23:ee:42:56:f1",
            "net23": "06:f8:2e:9e:c0:c9",
            "net24": "02:5e:c2:e9:74:8a",
            "net25": "32:34:90:4e:32:c4",
            "net26": "d6:26:3b:b3:75:34",
            "net27": "26:33:a5:74:1b:17",
            "net3": "7e:1d:3f:18:20:ac",
            "net4": "fe:19:10:6a:ad:48",
            "net5": "52:7e:79:96:7d:81",
            "net6": "06:66:39:71:9e:0c",
            "net7": "86:b6:3f:cd:47:ff",
            "net8": "e2:92:45:d7:7f:52",
            "net9": "ca:95:7b:22:76:54"
        },
        "spine_2_1_12": {
            "net0": "de:9d:49:c3:7b:4a",
            "net1": "82:8d:76:da:90:23",
            "net10": "d2:20:f2:ba:97:34",
            "net11": "22:83:b8:92:e7:d2",
            "net12": "1a:e7:67:bb:31:b3",
            "net13": "56:e5:98:81:9c:f4",
            "net14": "8e:00:17:af:78:6e",
            "net15": "92:07:17:c2:ec:4e",
            "net16": "ee:25:31:b5:59:4a",
            "net17": "b6:ca:b0:90:ec:60",
            "net18": "f2:59:b0:65:82:e8",
            "net19": "1e:b8:27:17:18:df",
            "net2": "ee:2a:d8:e4:07:84",
            "net20": "d2:ca:0b:89:77:5e",
            "net21": "26:49:c0:f0:72:f2",
            "net22": "8a:b8:b4:22:ae:b0",
            "net23": "0e:ec:42:ba:9e:8e",
            "net24": "5e:bb:27:30:6e:cf",
            "net25": "9e:44:bf:b9:ae:22",
            "net26": "52:bb:5a:49:76:50",
            "net27": "1a:3e:e4:85:5d:84",
            "net3": "1e:24:78:a5:9d:f1",
            "net4": "da:c2:8d:86:62:49",
            "net5": "b2:e6:04:64:a1:7a",
            "net6": "96:da:d7:dc:d2:aa",
            "net7": "1a:f9:a2:34:40:89",
            "net8": "9a:da:68:da:f0:a0",
            "net9": "f6:57:94:79:3a:df"
        },
        "spine_2_1_13": {
            "net0": "56:8d:0f:1b:10:16",
            "net1": "fe:3b:08:4c:ee:50",
            "net10": "c6:ba:90:45:08:72",
            "net11": "0e:98:a4:72:63:6e",
            "net12": "fa:5e:23:bf:1f:40",
            "net13": "16:a8:8e:80:1a:12",
            "net14": "2a:1b:d0:25:bc:8c",
            "net15": "26:b1:8c:50:95:bb",
            "net16": "c6:83:73:19:59:36",
            "net17": "da:61:17:19:72:5c",
            "net18": "52:4f:29:1f:d9:0a",
            "net19": "fa:c8:a1:aa:07:24",
            "net2": "86:7b:c3:71:3f:1b",
            "net20": "fa:16:0e:53:71:61",
            "net21": "1a:86:fc:86:f8:c2",
            "net22": "de:00:43:d9:eb:4d",
            "net23": "02:7a:f5:c5:07:b0",
            "net24": "12:ca:97:44:8f:b6",
            "net25": "1e:84:10:92:03:90",
            "net26": "06:6a:e8:cc:e8:b6",
            "net27": "62:8f:66:9f:56:58",
            "net3": "ae:e7:20:d6:3d:c3",
            "net4": "ba:ca:a7:ab:27:40",
            "net5": "6e:8d:a2:10:db:98",
            "net6": "ce:c8:9b:7c:ac:40",
            "net7": "da:62:bf:03:96:29",
            "net8": "d6:04:52:9e:09:c6",
            "net9": "46:5c:07:f5:e9:10"
        },
        "spine_2_1_14": {
            "net0": "aa:b3:9b:76:aa:88",
            "net1": "f2:9a:13:3f:13:a1",
            "net10": "7e:ea:51:04:78:12",
            "net11": "6a:bd:65:e3:d5:c7",
            "net12": "de:fe:12:e7:62:65",
            "net13": "16:d9:95:e9:2d:54",
            "net14": "0a:8e:d8:fd:ca:6c",
            "net15": "36:a8:23:6d:46:80",
            "net16": "5a:19:22:d4:b9:af",
            "net17": "12:fe:1d:47:2a:6e",
            "net18": "6e:2a:d3:08:1d:53",
            "net19": "1e:11:bb:41:e2:d8",
            "net2": "d6:2e:0e:58:89:b6",
            "net20": "6a:5d:d4:ad:8f:5e",
            "net21": "72:15:38:cd:54:41",
            "net22": "f6:03:60:cf:d1:e2",
            "net23": "46:8b:c8:77:7c:97",
            "net24": "b6:e8:07:e6:92:2f",
            "net25": "6a:49:92:bd:0c:c7",
            "net26": "72:61:87:70:c6:55",
            "net27": "12:ce:f3:ac:e4:4d",
            "net3": "fa:e1:50:95:f3:c1",
            "net4": "72:e1:7a:74:88:ea",
            "net5": "ee:b4:38:75:6c:4f",
            "net6": "8a:08:6a:9b:f9:0b",
            "net7": "2e:3e:e3:2b:50:51",
            "net8": "ce:99:e0:ee:11:eb",
            "net9": "8a:0a:83:fb:29:46"
        },
        "spine_2_1_2": {
            "net0": "52:02:69:53:f1:e3",
            "net1": "7a:29:aa:19:cc:3b",
            "net10": "fa:97:72:e1:af:e0",
            "net11": "72:6b:19:48:f4:90",
            "net12": "ae:13:86:a5:e4:c4",
            "net13": "f6:49:42:39:ef:b6",
            "net14": "de:5c:57:cb:47:b4",
            "net15": "b2:03:74:05:6d:ed",
            "net16": "ea:13:7b:41:0f:1c",
            "net17": "c6:cf:d0:b6:58:c0",
            "net18": "42:e7:85:6a:c5:2c",
            "net19": "6a:fc:c7:31:a4:95",
            "net2": "ca:5a:82:1c:63:d8",
            "net20": "da:cc:7b:21:77:aa",
            "net21": "ae:7e:5e:47:ac:db",
            "net22": "6a:94:eb:99:7d:2c",
            "net23": "2a:8c:98:df:67:03",
            "net24": "6e:cd:e9:3e:2c:8b",
            "net25": "f2:35:e5:89:73:de",
            "net26": "46:e1:f6:35:ed:ee",
            "net27": "5e:e8:09:f2:06:ad",
            "net3": "8e:5e:81:d1:80:49",
            "net4": "f6:76:ef:96:f0:db",
            "net5": "e2:4c:44:98:c6:72",
            "net6": "16:71:30:ba:02:00",
            "net7": "62:ed:99:84:52:34",
            "net8": "a6:79:43:e5:f7:16",
            "net9": "ae:97:24:b9:11:d5"
        },
        "spine_2_1_3": {
            "net0": "56:a8:91:97:09:cf",
            "net1": "12:49:5a:35:f3:18",
            "net10": "06:1f:2d:07:54:4e",
            "net11": "22:88:5e:96:a3:76",
            "net12": "76:5c:30:9f:a8:69",
            "net13": "f6:5d:98:19:67:a9",
            "net14": "8a:17:95:83:a5:43",
            "net15": "c2:5f:41:26:89:00",
            "net16": "a6:30:e5:f9:15:f7",
            "net17": "5e:f4:6e:6e:0f:e7",
            "net18": "66:f3:57:ac:71:b1",
            "net19": "b6:e9:fe:59:ea:dc",
            "net2": "9e:a5:ee:0b:3c:63",
            "net20": "da:19:fb:7d:50:19",
            "net21": "9a:cd:02:82:bc:90",
            "net22": "66:6e:d4:88:45:44",
            "net23": "32:79:de:ed:e9:ed",
            "net24": "4a:dc:0b:25:ea:17",
            "net25": "3a:82:18:e2:f5:db",
            "net26": "42:74:96:5a:5d:b4",
            "net27": "52:e0:46:30:cf:71",
            "net3": "02:44:1b:18:55:1a",
            "net4": "6a:0b:29:b7:b9:66",
            "net5": "de:25:f2:77:71:14",
            "net6": "36:81:ae:6e:27:a2",
            "net7": "42:02:4b:72:b6:ab",
            "net8": "8e:64:75:34:fc:66",
            "net9": "e6:ca:80:48:2d:5d"
        },
        "spine_2_1_4": {
            "net0": "4a:f2:e1:f4:c6:5d",
            "net1": "82:4b:db:83:6d:e3",
            "net10": "26:28:18:7e:9d:6c",
            "net11": "ca:ce:0c:f1:16:7d",
            "net12": "fa:d9:5e:9d:14:48",
            "net13": "5a:50:dd:09:9a:09",
            "net14": "4e:f7:28:52:8a:aa",
            "net15": "0e:f5:98:5b:a8:5e",
            "net16": "36:2f:62:f8:f5:20",
            "net17": "ba:72:10:7c:95:b2",
            "net18": "0e:83:00:fe:f4:dc",
            "net19": "e6:f6:14:fe:a4:6c",
            "net2": "1e:77:0a:95:5d:3b",
            "net20": "e2:1a:13:8f:99:cb",
            "net21": "86:9c:f6:21:3c:6f",
            "net22": "3e:40:4b:d8:0e:aa",
            "net23": "76:66:d6:90:90:f5",
            "net24": "6e:c6:27:10:72:37",
            "net25": "1a:b1:17:0f:1c:35",
            "net26": "46:10:3c:e0:46:6c",
            "net27": "a2:2a:2b:a8:0c:ec",
            "net3": "82:d6:74:65:79:2f",
            "net4": "12:6a:7a:4f:c7:47",
            "net5": "a2:0a:1a:6e:71:6e",
            "net6": "b6:85:27:7f:cb:a4",
            "net7": "2e:bb:5b:c3:80:74",
            "net8": "32:4e:23:7c:20:59",
            "net9": "46:73:0a:25:50:18"
        },
        "spine_2_1_5": {
            "net0": "ee:dd:94:80:ce:91",
            "net1": "4e:5e:dd:4a:af:1c",
            "net10": "fa:75:6e:07:1a:88",
            "net11": "b6:d4:28:d5:af:db",
            "net12": "1a:3c:53:86:59:7a",
            "net13": "42:8b:76:60:da:de",
            "net14": "82:cf:80:df:65:46",
            "net15": "8e:92:b8:a7:f7:f8",
            "net16": "4a:84:d5:f9:46:74",
            "net17": "a6:ee:f5:5e:3b:60",
            "net18": "8a:e6:a8:d2:66:6a",
            "net19": "62:04:08:58:30:26",
            "net2": "52:78:f2:f3:0a:1a",
            "net20": "7a:19:5a:99:9d:1c",
            "net21": "d6:cc:8b:ba:27:1b",
            "net22": "8a:87:91:22:eb:06",
            "net23": "6e:54:c9:63:6c:b9",
            "net24": "e2:c2:92:44:71:c7",
            "net25": "12:c1:7d:13:ab:ad",
            "net26": "46:ba:07:d5:ab:bf",
            "net27": "c2:a8:3d:5e:5c:fc",
            "net3": "be:61:6c:78:1e:ea",
            "net4": "9a:14:cf:3e:63:ca",
            "net5": "0e:1c:f5:b0:0e:51",
            "net6": "36:86:77:2b:70:e6",
            "net7": "96:81:e3:68:48:a6",
            "net8": "ca:c9:06:9a:5f:67",
            "net9": "42:7f:11:e0:04:f5"
        },
        "spine_2_1_6": {
            "net0": "32:d5:cd:a8:0d:41",
            "net1": "16:82:87:47:a9:63",
            "net10": "b6:32:92:e5:41:10",
            "net11": "a2:41:a8:ff:99:39",
            "net12": "1e:67:c1:d5:65:08",
            "net13": "8e:30:f9:dc:3c:b2",
            "net14": "ca:be:1d:8d:d7:3c",
            "net15": "7a:79:24:73:a1:8c",
            "net16": "76:82:1f:46:c5:e5",
            "net17": "ee:3b:cf:c9:38:62",
            "net18": "2e:85:e7:5d:8d:f2",
            "net19": "9a:b1:70:21:4c:1a",
            "net2": "b2:7f:9d:57:92:ac",
            "net20": "1e:64:9e:1f:61:79",
            "net21": "e6:1a:83:12:92:dd",
            "net22": "9a:9c:45:38:ea:bd",
            "net23": "9a:cb:f1:a6:08:76",
            "net24": "12:da:6d:0d:f4:b9",
            "net25": "be:e4:46:7d:3d:4f",
            "net26": "9e:af:c4:11:92:38",
            "net27": "8a:25:62:bf:c3:ff",
            "net3": "a2:32:59:85:fd:b1",
            "net4": "12:04:51:19:34:00",
            "net5": "0a:7d:ec:34:c3:da",
            "net6": "66:6d:99:50:e6:17",
            "net7": "92:2c:88:07:f3:01",
            "net8": "16:79:1d:eb:10:4f",
            "net9": "e2:91:f7:f3:45:50"
        },
        "spine_2_1_7": {
            "net0": "b2:49:2d:3e:cb:1f",
            "net1": "0a:3a:06:09:85:51",
            "net10": "be:55:d6:8b:a5:6e",
            "net11": "86:7c:e2:db:c5:e4",
            "net12": "1a:08:4b:3d:38:4a",
            "net13": "96:cd:c1:e5:2f:89",
            "net14": "aa:54:84:8c:f6:9a",
            "net15": "c6:32:49:61:f5:bc",
            "net16": "46:e8:c3:8b:0c:4c",
            "net17": "3e:25:d9:6c:78:32",
            "net18": "7e:43:69:05:4f:d6",
            "net19": "6e:8b:b1:40:50:9f",
            "net2": "e6:69:e9:f3:bf:60",
            "net20": "d2:00:e9:63:7b:69",
            "net21": "d2:ae:75:ba:bd:3a",
            "net22": "86:45:e7:e3:8f:d5",
            "net23": "ae:54:21:6b:05:11",
            "net24": "26:7f:c9:c6:51:ef",
            "net25": "06:06:3e:80:21:96",
            "net26": "86:e5:22:33:2f:c8",
            "net27": "d2:9a:fe:07:91:b3",
            "net3": "5a:85:5d:a3:2e:b3",
            "net4": "1a:2b:a3:85:31:b3",
            "net5": "d6:67:b0:78:75:41",
            "net6": "76:9f:97:21:60:54",
            "net7": "02:0b:2e:0d:f6:9c",
            "net8": "f2:fb:a9:2f:b4:45",
            "net9": "8a:58:f9:3a:da:5b"
        },
        "spine_2_1_8": {
            "net0": "76:bf:de:15:68:ed",
            "net1": "22:bb:90:59:fc:8b",
            "net10": "36:a5:41:e8:93:6b",
            "net11": "c6:31:d1:0b:bb:62",
            "net12": "8a:0b:79:d8:cf:34",
            "net13": "7e:16:f6:8a:0c:0b",
            "net14": "8e:91:e5:98:b1:ec",
            "net15": "7e:11:36:c1:c5:9b",
            "net16": "a2:90:86:93:cb:d2",
            "net17": "be:c3:f0:b4:05:6a",
            "net18": "0e:44:90:ea:e7:b2",
            "net19": "2a:1b:e2:82:fb:ca",
            "net2": "16:b9:d4:5e:24:c3",
            "net20": "62:1a:ca:01:9e:44",
            "net21": "12:d9:b9:b3:26:7f",
            "net22": "42:6a:60:2c:64:06",
            "net23": "b6:54:bd:fa:33:e1",
            "net24": "fa:05:1d:d1:a5:af",
            "net25": "3a:e3:49:42:78:26",
            "net26": "6a:3f:4a:94:0b:2a",
            "net27": "8a:7a:58:8d:4b:5c",
            "net3": "1a:70:b3:5d:fb:47",
            "net4": "9a:fc:1a:c0:1f:a8",
            "net5": "de:41:e6:b0:83:4a",
            "net6": "12:7b:9f:4b:e8:0d",
            "net7": "9e:ec:b1:30:27:0e",
            "net8": "0e:71:2c:b5:8c:7e",
            "net9": "06:cb:26:bf:c7:74"
        },
        "spine_2_1_9": {
            "net0": "92:51:fe:41:4a:db",
            "net1": "16:42:ba:e4:a6:17",
            "net10": "fe:90:e4:ee:33:b3",
            "net11": "ae:aa:76:64:0a:cd",
            "net12": "ba:8c:ae:b6:84:8d",
            "net13": "d2:dc:43:05:b6:e8",
            "net14": "fa:71:a7:c6:e0:84",
            "net15": "96:13:fe:ad:af:e6",
            "net16": "fe:b7:3b:dd:5d:ed",
            "net17": "f6:ad:4d:fa:71:f4",
            "net18": "52:01:f6:be:a5:0d",
            "net19": "aa:c5:5e:8e:d5:c7",
            "net2": "ce:db:77:5a:59:b1",
            "net20": "0a:3a:7c:a7:40:d6",
            "net21": "ca:c7:26:04:f6:9e",
            "net22": "16:27:40:3c:fc:6f",
            "net23": "2a:8d:89:2d:3c:bd",
            "net24": "26:54:a4:44:21:ad",
            "net25": "6e:5c:bc:e4:f5:a6",
            "net26": "da:08:3a:09:2c:b3",
            "net27": "9a:3c:bc:8b:be:b5",
            "net3": "ce:1c:8c:6a:76:a1",
            "net4": "12:83:63:0c:42:e5",
            "net5": "b6:f0:c9:65:52:99",
            "net6": "ca:0c:0d:c3:89:3b",
            "net7": "92:82:de:e6:1a:9e",
            "net8": "6e:11:59:aa:dd:3b",
            "net9": "4a:d4:7b:a0:86:c7"
        },
        "tof_1_2_1": {
            "net0": "d2:47:35:66:db:96",
            "net1": "76:23:8f:68:cf:8c",
            "net10": "46:ef:5f:e8:d6:05",
            "net11": "7a:aa:fd:72:8a:b6",
            "net12": "c2:ad:ec:10:8d:50",
            "net13": "1a:2e:4e:0d:9a:04",
            "net14": "26:31:0b:bb:31:e7",
            "net15": "e6:36:8a:7b:0e:8a",
            "net16": "46:2f:ee:f1:f3:60",
            "net17": "ee:c4:c3:1e:68:a0",
            "net18": "c6:2a:79:7e:25:06",
            "net19": "ca:e7:99:80:bb:6d",
            "net2": "32:94:c6:07:07:be",
            "net20": "d6:68:e8:cc:d5:ce",
            "net21": "22:5e:c0:2a:e0:cf",
            "net22": "ee:67:a8:a4:cd:5b",
            "net23": "a6:b2:ed:6b:ed:d4",
            "net24": "7e:7b:f8:4e:5b:ee",
            "net25": "76:53:29:85:85:13",
            "net26": "2a:f7:94:bf:69:07",
            "net27": "da:9f:0f:96:3d:39",
            "net3": "92:b5:0f:ee:ed:b1",
            "net4": "d6:c5:60:88:cd:9b",
            "net5": "6e:d1:ce:35:f9:09",
            "net6": "9a:15:7e:83:a3:c4",
            "net7": "42:90:2c:65:02:16",
            "net8": "ea:6c:e5:a5:a4:8c",
            "net9": "0e:7d:66:be:b4:1c"
        },
        "tof_1_2_10": {
            "net0": "b6:60:3f:a6:c1:76",
            "net1": "b2:1b:75:2c:62:8d",
            "net10": "ea:c8:c0:03:37:87",
            "net11": "1a:5d:f1:4b:d3:8a",
            "net12": "ce:90:1a:9c:04:d3",
            "net13": "92:95:63:fd:1e:80",
            "net14": "8a:b9:c6:07:60:81",
            "net15": "c2:81:db:4a:30:9e",
            "net16": "62:25:3c:76:81:65",
            "net17": "5e:8f:16:44:61:d5",
            "net18": "e6:41:06:93:6c:a4",
            "net19": "5a:80:e0:76:6d:e4",
            "net2": "8e:5d:cd:70:c9:1b",
            "net20": "86:53:e9:f8:b9:06",
            "net21": "52:21:bc:b3:c1:e7",
            "net22": "7e:a2:a6:17:7a:1b",
            "net23": "3a:75:3e:11:dd:33",
            "net24": "e2:20:32:6e:3c:d2",
            "net25": "96:7a:c1:da:fe:00",
            "net26": "22:76:88:be:4e:44",
            "net27": "0e:6e:18:9e:90:50",
            "net3": "be:94:a2:79:77:0a",
            "net4": "6a:7a:e8:e6:22:f2",
            "net5": "e6:20:dd:c7:2a:ae",
            "net6": "42:a2:6d:c7:44:6b",
            "net7": "12:ff:e1:c3:96:16",
            "net8": "2a:aa:0b:02:f9:28",
            "net9": "1e:af:1d:b2:dd:d2"
        },
        "tof_1_2_11": {
            "net0": "e6:0b:b2:d4:96:dc",
            "net1": "32:7f:f2:76:99:75",
            "net10": "0e:58:64:b9:ea:e4",
            "net11": "0e:5d:35:3d:70:d0",
            "net12": "f6:8c:9f:83:4c:d3",
            "net13": "ea:6b:17:00:14:41",
            "net14": "4a:5b:b4:5a:06:63",
            "net15": "02:8b:ef:aa:1f:04",
            "net16": "82:b6:85:9f:35:39",
            "net17": "da:b1:16:74:88:64",
            "net18": "8a:16:79:d0:d9:7d",
            "net19": "12:2c:41:cd:7f:79",
            "net2": "6e:b4:31:ab:61:10",
            "net20": "6e:93:e6:26:99:63",
            "net21": "e2:d3:3b:a5:91:14",
            "net22": "76:06:a4:5e:e0:5d",
            "net23": "7e:4f:fe:14:85:e7",
            "net24": "fa:fb:ca:27:5e:b1",
            "net25": "ee:f6:a1:b8:64:ed",
            "net26": "ce:59:2e:42:47:70",
            "net27": "aa:f7:90:3a:bb:cc",
            "net3": "4a:f4:7f:6e:fe:10",
            "net4": "2e:60:9b:5e:81:45",
            "net5": "f2:8f:fd:f0:7e:29",
            "net6": "52:b5:3a:7b:2c:43",
            "net7": "6a:be:43:94:a5:b1",
            "net8": "16:67:ff:3b:31:60",
            "net9": "66:f8:08:5c:dc:0c"
        },
        "tof_1_2_12": {
            "net0": "4a:dc:6d:38:e3:9a",
            "net1": "8e:63:a3:69:26:6f",
            "net10": "aa:16:4a:74:70:fc",
            "net11": "7a:b8:ee:9c:59:9e",
            "net12": "02:78:08:bc:07:cb",
            "net13": "6e:1c:ca:72:58:40",
            "net14": "8a:d8:4b:4a:61:60",
            "net15": "7a:ae:d0:fd:f3:e8",
            "net16": "ca:05:89:a8:9a:04",
            "net17": "b6:41:32:90:42:34",
            "net18": "7a:a6:86:ae:33:25",
            "net19": "8a:2c:ec:09:8c:d7",
            "net2": "9e:3a:bf:6d:6b:0f",
            "net20": "42:0c:4b:f2:34:41",
            "net21": "9a:a6:b4:23:d6:bd",
            "net22": "12:02:f0:20:31:21",
            "net23": "c2:60:d9:9f:0d:13",
            "net24": "96:05:02:0c:f7:02",
            "net25": "96:57:72:b4:0e:da",
            "net26": "ea:76:df:b8:8a:a5",
            "net27": "06:56:d3:fe:02:67",
            "net3": "42:c1:d7:df:80:a1",
            "net4": "2a:21:b3:4b:c4:db",
            "net5": "82:26:e4:9f:59:3c",
            "net6": "46:ff:d1:d2:88:c8",
            "net7": "66:a9:52:85:33:48",
            "net8": "f6:3a:57:55:dc:fa",
            "net9": "ba:f1:1d:5f:6c:5f"
        },
        "tof_1_2_13": {
            "net0": "ca:66:dd:fa:d7:55",
            "net1": "ae:5e:99:75:53:6b",
            "net10": "ca:f8:67:55:a6:0e",
            "net11": "ce:3d:a3:4f:4b:ec",
            "net12": "62:14:8c:1f:68:a6",
            "net13": "ae:ad:63:55:96:48",
            "net14": "56:fb:a3:74:62:61",
            "net15": "ca:eb:ee:e8:e9:49",
            "net16": "06:8c:55:31:3d:54",
            "net17": "3a:8d:27:73:be:68",
            "net18": "06:09:49:56:dd:60",
            "net19": "0e:fa:9f:b0:6f:67",
            "net2": "f6:ca:98:df:98:2a",
            "net20": "22:ae:45:8c:09:09",
            "net21": "fa:d6:b4:3d:18:54",
            "net22": "82:d8:47:d7:12:74",
            "net23": "da:f3:39:24:25:44",
            "net24": "ba:36:ff:9e:96:9d",
            "net25": "ea:9e:b2:90:65:e7",
            "net26": "fe:c0:b0:f8:62:fc",
            "net27": "4a:21:40:a5:2d:da",
            "net3": "72:a2:ed:05:c2:35",
            "net4": "ba:33:02:c3:3d:9f",
            "net5": "7a:cf:87:84:bb:2d",
            "net6": "f6:a7:e0:cd:9a:c0",
            "net7": "52:10:7e:18:4b:3e",
            "net8": "16:52:10:cc:e2:64",
            "net9": "86:61:05:62:4c:69"
        },
        "tof_1_2_14": {
            "net0": "76:b8:a9:f0:74:ad",
            "net1": "6a:9b:fc:2d:25:9d",
            "net10": "66:44:e3:74:03:a2",
            "net11": "8e:6d:9d:22:ed:cd",
            "net12": "22:49:58:82:5c:ae",
            "net13": "be:3e:61:ce:6d:a6",
            "net14": "ae:04:3a:0e:71:fe",
            "net15": "3e:b0:58:5a:68:9e",
            "net16": "32:2c:36:7a:59:18",
            "net17": "82:28:77:7f:b5:5b",
            "net18": "62:36:8b:10:2d:95",
            "net19": "76:0f:f7:54:f6:74",
            "net2": "46:6f:20:3a:78:3b",
            "net20": "52:9f:da:12:5c:bc",
            "net21": "fe:cc:70:b3:46:77",
            "net22": "8a:f2:f3:32:64:eb",
            "net23": "4e:1b:10:db:1f:14",
            "net24": "6e:1f:55:fd:30:16",
            "net25": "5a:38:22:8f:85:66",
            "net26": "5e:5d:cb:01:81:02",
            "net27": "aa:c5:9b:91:d9:d8",
            "net3": "5e:d7:53:3d:39:73",
            "net4": "86:95:6b:fe:b9:7a",
            "net5": "fa:11:5c:74:60:f3",
            "net6": "6a:f3:b1:74:eb:3e",
            "net7": "0e:44:ca:78:77:08",
            "net8": "9a:ce:44:a9:6e:e7",
            "net9": "82:22:96:44:2b:a2"
        },
        "tof_1_2_2": {
            "net0": "0e:04:e9:50:82:b5",
            "net1": "62:93:e1:67:be:c8",
            "net10": "a2:f2:56:c5:bd:62",
            "net11": "32:66:2f:c5:c4:29",
            "net12": "b6:6d:83:05:8b:23",
            "net13": "f6:23:7c:78:4b:a4",
            "net14": "1a:a2:87:dd:3a:f8",
            "net15": "82:22:ff:a1:1b:44",
            "net16": "a6:b8:50:d6:47:c9",
            "net17": "42:80:bc:06:5d:45",
            "net18": "5e:7a:94:e9:56:82",
            "net19": "ce:5b:34:de:27:ec",
            "net2": "be:86:03:fa:dc:70",
            "net20": "ea:15:5d:f8:cb:f0",
            "net21": "36:4c:a1:e7:d7:25",
            "net22": "26:92:5e:7b:6a:4d",
            "net23": "72:29:fd:b3:08:a9",
            "net24": "7a:a7:e8:d8:d2:9f",
            "net25": "22:e2:6f:c7:1e:4f",
            "net26": "a2:bb:76:aa:00:1e",
            "net27": "7e:7c:49:cc:56:25",
            "net3": "86:2a:65:45:60:19",
            "net4": "ba:eb:8e:6d:d8:da",
            "net5": "0e:88:6d:cd:f1:91",
            "net6": "52:7b:77:c2:1e:35",
            "net7": "f2:a9:b2:92:09:a3",
            "net8": "da:6a:a1:22:86:5e",
            "net9": "f2:94:62:02:4f:1c"
        },
        "tof_1_2_3": {
            "net0": "26:11:d8:70:e5:8b",
            "net1": "86:80:2f:88:36:39",
            "net10": "a6:d9:d9:ed:6e:ce",
            "net11": "2e:35:4d:06:5b:c7",
            "net12": "8a:e5:8d:1f:3f:79",
            "net13": "b6:b5:f5:5d:2a:5f",
            "net14": "f6:25:36:11:ce:fc",
            "net15": "0e:ea:66:15:1a:61",
            "net16": "ce:27:e0:84:82:d9",
            "net17": "66:ee:81:40:ea:c6",
            "net18": "3e:ea:65:fc:46:8e",
            "net19": "fa:1c:21:6d:3f:49",
            "net2": "76:5b:aa:a7:5b:81",
            "net20": "1a:e9:92:4c:84:d0",
            "net21": "be:29:2e:a4:44:e2",
            "net22": "ee:bb:78:2d:ff:60",
            "net23": "e2:47:f0:09:dc:53",
            "net24": "8e:a9:5d:d0:1f:c2",
            "net25": "be:b7:e2:42:9e:45",
            "net26": "66:80:3c:46:ec:35",
            "net27": "d2:6c:f1:8f:2c:f9",
            "net3": "3e:4f:f1:f2:69:e0",
            "net4": "a2:a7:fe:36:d0:3c",
            "net5": "26:b4:94:d0:fd:f3",
            "net6": "ee:83:f5:e8:30:93",
            "net7": "2a:22:d5:13:36:65",
            "net8": "ba:e5:49:98:17:cc",
            "net9": "8a:bd:c6:3b:ed:ba"
        },
        "tof_1_2_4": {
            "net0": "76:36:ae:3e:df:1d",
            "net1": "d2:f3:c1:91:e1:e0",
            "net10": "ca:bf:a4:a4:15:d3",
            "net11": "8e:69:5f:33:5e:c1",
            "net12": "ce:4c:84:1e:e5:2b",
            "net13": "ee:2c:b0:9f:6d:b9",
            "net14": "16:5f:b3:79:28:23",
            "net15": "12:9d:07:77:39:2d",
            "net16": "46:1e:db:70:8d:d6",
            "net17": "a6:7b:f3:4b:9a:3b",
            "net18": "26:6c:b2:43:6d:56",
            "net19": "6a:52:f7:0b:3c:7c",
            "net2": "4e:7d:33:3c:02:f1",
            "net20": "96:85:ff:7a:6d:fb",
            "net21": "2e:11:26:72:22:5f",
            "net22": "0e:56:26:2f:fb:82",
            "net23": "9e:7c:fd:ad:fe:30",
            "net24": "56:e9:f0:3a:29:f4",
            "net25": "56:c5:33:5d:ec:e7",
            "net26": "0a:3d:44:6b:2e:67",
            "net27": "22:89:02:b9:36:b6",
            "net3": "0e:bf:d6:90:fd:2d",
            "net4": "fa:f8:d8:39:d8:6e",
            "net5": "2e:10:dd:ed:72:ef",
            "net6": "6a:41:ba:15:4f:9f",
            "net7": "72:0f:f7:27:3f:8a",
            "net8": "c2:af:f0:26:e0:a0",
            "net9": "2e:bc:f2:0e:e5:46"
        },
        "tof_1_2_5": {
            "net0": "8e:ae:36:b4:90:52",
            "net1": "3a:c1:6d:bd:18:24",
            "net10": "2a:0c:7d:0f:d8:94",
            "net11": "ba:a6:f2:0c:92:32",
            "net12": "3e:cb:ab:35:50:e0",
            "net13": "0e:b3:ae:a2:d5:05",
            "net14": "62:ae:57:44:77:73",
            "net15": "1a:03:fb:45:5f:22",
            "net16": "72:86:0f:9a:0d:99",
            "net17": "fa:d0:62:4f:12:d7",
            "net18": "a6:4a:fd:21:68:f0",
            "net19": "66:b2:74:97:94:ca",
            "net2": "0e:dc:77:20:28:c2",
            "net20": "56:77:1f:84:c7:9d",
            "net21": "3a:f3:de:16:64:bb",
            "net22": "6e:08:3b:17:a0:c3",
            "net23": "ca:aa:ee:54:56:27",
            "net24": "8a:3d:31:77:b9:e1",
            "net25": "e2:7f:66:7b:78:5c",
            "net26": "fe:7e:6c:24:49:0b",
            "net27": "a2:6a:1f:70:94:8e",
            "net3": "56:8e:d5:a3:f2:ca",
            "net4": "22:41:4a:6f:00:b0",
            "net5": "6a:df:c4:4a:4f:c8",
            "net6": "aa:56:5a:8b:f4:77",
            "net7": "56:5d:0a:10:75:9b",
            "net8": "72:d1:9d:c8:68:69",
            "net9": "2e:50:15:b4:57:d2"
        },
        "tof_1_2_6": {
            "net0": "f2:4d:12:fa:0c:36",
            "net1": "42:c4:f2:60:35:0a",
            "net10": "56:48:62:b7:10:a8",
            "net11": "a2:1e:0e:32:8b:a9",
            "net12": "aa:c3:10:d6:45:9e",
            "net13": "16:7a:71:2c:53:75",
            "net14": "f2:92:d4:9e:0e:42",
            "net15": "0a:97:58:83:bc:44",
            "net16": "ea:f5:e8:93:85:8b",
            "net17": "82:e8:45:da:61:a2",
            "net18": "56:8d:12:c4:e2:98",
            "net19": "62:ff:ca:3a:fe:13",
            "net2": "4a:72:16:fd:a6:55",
            "net20": "46:7f:12:ed:56:be",
            "net21": "c2:44:96:59:af:95",
            "net22": "b6:c1:b4:4a:35:b1",
            "net23": "62:33:b8:a9:2a:11",
            "net24": "be:15:a8:6e:96:61",
            "net25": "c2:9e:48:6c:f5:80",
            "net26": "f2:11:23:f4:24:1a",
            "net27": "96:6a:87:c8:f5:bd",
            "net3": "56:33:f6:41:ad:8e",
            "net4": "06:61:26:44:42:bd",
            "net5": "9a:30:89:34:01:67",
            "net6": "46:01:93:d5:f7:fa",
            "net7": "96:14:db:78:1a:b0",
            "net8": "e6:a8:c2:e8:6f:e8",
            "net9": "c6:13:5d:8a:25:dd"
        },
        "tof_1_2_7": {
            "net0": "56:92:ff:9a:23:aa",
            "net1": "b2:26:b1:6a:96:57",
            "net10": "3a:09:a9:c6:39:9d",
            "net11": "2a:fa:e9:b0:2c:e8",
            "net12": "fa:db:a9:55:e2:5d",
            "net13": "46:ce:0c:1e:8b:cd",
            "net14": "3e:a2:b1:7c:09:3c",
            "net15": "ea:f1:5a:81:aa:ce",
            "net16": "fe:46:d4:44:5b:2e",
            "net17": "e2:53:72:39:98:eb",
            "net18": "6a:31:60:72:db:b7",
            "net19": "96:3d:32:2e:80:05",
            "net2": "aa:74:7a:1e:13:e3",
            "net20": "2a:0d:a0:0b:d8:53",
            "net21": "96:7b:9d:03:d4:1f",
            "net22": "ea:fb:21:7e:e1:6f",
            "net23": "d2:b8:12:11:76:f7",
            "net24": "02:51:8a:34:fc:41",
            "net25": "3e:5f:4c:8d:33:9d",
            "net26": "ce:8b:06:21:5e:d9",
            "net27": "06:e5:34:f1:d1:ad",
            "net3": "52:92:37:94:67:f8",
            "net4": "1a:7d:51:ed:23:9f",
            "net5": "7a:32:9f:0a:7d:ae",
            "net6": "b2:bd:69:0b:dc:1c",
            "net7": "fe:c3:af:69:e7:c4",
            "net8": "76:bb:98:b5:2f:ba",
            "net9": "b2:8e:24:44:1b:b8"
        },
        "tof_1_2_8": {
            "net0": "de:c1:20:ff:ad:51",
            "net1": "76:42:19:9e:ab:51",
            "net10": "6e:b7:89:f1:df:08",
            "net11": "12:3e:ee:83:12:00",
            "net12": "b6:e5:fa:01:f8:b0",
            "net13": "0e:78:3d:1c:cf:4d",
            "net14": "de:20:23:5c:2f:41",
            "net15": "f2:57:36:4f:fc:f0",
            "net16": "ba:0a:92:a6:ae:19",
            "net17": "3e:ba:8b:a1:43:63",
            "net18": "0a:d4:cc:62:59:84",
            "net19": "6e:b1:75:03:e2:29",
            "net2": "7a:76:80:9d:94:42",
            "net20": "5a:21:ca:a2:e7:f7",
            "net21": "92:d6:81:44:f3:4b",
            "net22": "be:7a:1a:e5:df:aa",
            "net23": "5a:00:cb:2c:b0:29",
            "net24": "f2:d2:2f:49:e6:33",
            "net25": "a6:18:3d:fd:6c:3b",
            "net26": "0a:27:d9:0a:26:ca",
            "net27": "3a:73:2e:54:ae:3d",
            "net3": "96:f5:c4:a5:0c:1a",
            "net4": "8a:77:7a:17:ec:31",
            "net5": "0e:b4:a0:62:47:53",
            "net6": "92:94:4e:72:8a:02",
            "net7": "96:ec:0c:48:a9:61",
            "net8": "76:13:3c:69:db:50",
            "net9": "1e:19:ab:e4:69:e2"
        },
        "tof_1_2_9": {
            "net0": "ba:00:df:cf:1d:93",
            "net1": "ee:7c:17:df:48:a4",
            "net10": "da:be:8f:9b:6b:a8",
            "net11": "3e:e1:59:22:c9:df",
            "net12": "12:44:68:9f:f7:d5",
            "net13": "f6:be:8b:73:fe:bb",
            "net14": "32:17:80:89:78:83",
            "net15": "6a:4e:fc:32:3f:15",
            "net16": "96:99:da:8f:b2:c3",
            "net17": "32:c6:25:27:f4:64",
            "net18": "1e:b7:6d:5b:08:fc",
            "net19": "2e:cc:bf:11:71:e6",
            "net2": "66:f0:12:68:73:c7",
            "net20": "66:18:4e:d7:d7:7b",
            "net21": "b2:6c:bd:ef:50:25",
            "net22": "e6:4c:17:fc:74:33",
            "net23": "d6:62:55:19:1d:a0",
            "net24": "f6:cd:0e:85:31:40",
            "net25": "da:b0:a0:1f:c9:cb",
            "net26": "96:ba:12:2f:e1:1d",
            "net27": "fa:19:ba:97:f5:56",
            "net3": "f6:00:ac:35:04:02",
            "net4": "c2:12:b9:c1:cb:84",
            "net5": "76:a7:6b:c4:3a:f7",
            "net6": "0a:a3:0b:e6:4f:dd",
            "net7": "a2:21:d5:1e:a6:4b",
            "net8": "4a:75:35:88:4d:a1",
            "net9": "aa:85:a7:36:48:32"
        }
    },
    "failed_machine": "leaf_1_0_1",
    "failure_time": {
        "leaf_1_0_1": 1622139352.4102347,
        "leaf_1_0_10": 1622139352.4602213,
        "leaf_1_0_11": 1622139352.4913018,
        "leaf_1_0_12": 1622139352.53172,
        "leaf_1_0_13": 1622139352.5532706,
        "leaf_1_0_14": 1622139352.412056,
        "leaf_1_0_2": 1622139352.4826622,
        "leaf_1_0_3": 1622139352.5235245,
        "leaf_1_0_4": 1622139352.5418923,
        "leaf_1_0_5": 1622139352.6235344,
        "leaf_1_0_6": 1622139352.425842,
        "leaf_1_0_7": 1622139352.4841807,
        "leaf_1_0_8": 1622139352.5268447,
        "leaf_1_0_9": 1622139352.5388725,
        "leaf_2_0_1": 1622139352.5691104,
        "leaf_2_0_10": 1622139352.4263277,
        "leaf_2_0_11": 1622139352.4846573,
        "leaf_2_0_12": 1622139352.5300648,
        "leaf_2_0_13": 1622139352.5479822,
        "leaf_2_0_14": 1622139352.6568136,
        "leaf_2_0_2": 1622139352.653823,
        "leaf_2_0_3": 1622139352.8152802,
        "leaf_2_0_4": 1622139353.0746381,
        "leaf_2_0_5": 1622139353.1430082,
        "leaf_2_0_6": 1622139353.4270885,
        "leaf_2_0_7": 1622139352.6679828,
        "leaf_2_0_8": 1622139352.9742918,
        "leaf_2_0_9": 1622139353.1432292,
        "spine_1_1_1": 1622139353.4157004,
        "spine_1_1_10": 1622139353.4399376,
        "spine_1_1_11": 1622139352.7252047,
        "spine_1_1_12": 1622139352.8874657,
        "spine_1_1_13": 1622139353.0779262,
        "spine_1_1_14": 1622139353.143438,
        "spine_1_1_2": 1622139353.4395173,
        "spine_1_1_3": 1622139352.8835146,
        "spine_1_1_4": 1622139353.0835152,
        "spine_1_1_5": 1622139353.1436954,
        "spine_1_1_6": 1622139353.4392607,
        "spine_1_1_7": 1622139353.6678264,
        "spine_1_1_8": 1622139353.450021,
        "spine_1_1_9": 1622139353.6945581,
        "spine_2_1_1": 1622139353.8092391,
        "spine_2_1_10": 1622139353.910947,
        "spine_2_1_11": 1622139353.9388347,
        "spine_2_1_12": 1622139353.4660528,
        "spine_2_1_13": 1622139353.664712,
        "spine_2_1_14": 1622139353.6969151,
        "spine_2_1_2": 1622139353.7942805,
        "spine_2_1_3": 1622139353.8604562,
        "spine_2_1_4": 1622139353.6556523,
        "spine_2_1_5": 1622139353.731274,
        "spine_2_1_6": 1622139353.8480604,
        "spine_2_1_7": 1622139353.9147441,
        "spine_2_1_8": 1622139353.9819431,
        "spine_2_1_9": 1622139353.7976234,
        "tof_1_2_1": 1622139353.9105394,
        "tof_1_2_10": 1622139353.9747171,
        "tof_1_2_11": 1622139353.9906607,
        "tof_1_2_12": 1622139354.0250285,
        "tof_1_2_13": 1622139353.919772,
        "tof_1_2_14": 1622139353.9825125,
        "tof_1_2_2": 1622139354.0243058,
        "tof_1_2_3": 1622139354.0356026,
        "tof_1_2_4": 1622139354.070011,
        "tof_1_2_5": 1622139353.9822955,
        "tof_1_2_6": 1622139354.0010989,
        "tof_1_2_7": 1622139354.0610065,
        "tof_1_2_8": 1622139354.0999935,
        "tof_1_2_9": 1622139354.110434
    }
}