{
    "description": "Scenario 3a: Leaf leaf_1_0_1 failure with BGP",
    "k_leaf": 14,
    "k_top": 14,
    "redundancy_factor": 14,
    "is_k8s": true,
    "machine_mac_addresses": {
        "leaf_1_0_1": {
            "net0": "26:70:07:4b:12:3b",
            "net1": "5a:f7:96:dd:80:38",
            "net10": "8a:07:33:44:ef:af",
            "net11": "9e:90:46:86:3f:32",
            "net12": "ea:bd:0e:88:c1:13",
            "net13": "de:5b:e3:dc:7b:72",
            "net14": "b6:97:75:e0:f8:fb",
            "net2": "c2:66:0e:24:a4:b7",
            "net3": "66:fa:b0:60:71:f1",
            "net4": "de:d0:ca:7b:58:f4",
            "net5": "56:44:7f:31:de:14",
            "net6": "0e:61:de:67:12:d0",
            "net7": "a2:ce:24:5e:50:b4",
            "net8": "b6:48:3b:4e:4a:6e",
            "net9": "aa:b4:5e:96:ae:46"
        },
        "leaf_1_0_10": {
            "net0": "4e:84:09:6d:33:e2",
            "net1": "5a:77:06:e6:69:2c",
            "net10": "5a:7f:5d:75:a9:5a",
            "net11": "ee:c8:63:1c:b6:d4",
            "net12": "e2:1e:9c:bd:51:5b",
            "net13": "02:84:54:f0:0c:8a",
            "net14": "06:9c:61:2b:d3:c0",
            "net2": "0e:11:63:ed:8f:71",
            "net3": "56:52:af:11:3a:1d",
            "net4": "16:bf:39:f4:41:4c",
            "net5": "f6:08:32:a6:51:e3",
            "net6": "9a:3a:05:5b:9a:22",
            "net7": "d2:ed:e5:f3:59:87",
            "net8": "e2:51:2d:0c:fc:bd",
            "net9": "62:b3:1f:35:05:02"
        },
        "leaf_1_0_11": {
            "net0": "f2:1b:cf:62:39:c1",
            "net1": "e6:31:a2:9b:72:69",
            "net10": "fa:00:85:6d:14:e9",
            "net11": "c6:08:2d:e2:f5:60",
            "net12": "b6:d9:64:25:b9:67",
            "net13": "4e:44:b5:d0:c2:ec",
            "net14": "0a:ba:f5:38:25:3d",
            "net2": "d2:b1:3e:bd:d9:d3",
            "net3": "b6:16:cf:df:dc:fb",
            "net4": "12:f3:e3:2a:6e:8a",
            "net5": "de:ea:15:07:7a:21",
            "net6": "aa:17:af:44:d6:3a",
            "net7": "4e:be:4e:8d:e3:cd",
            "net8": "82:c2:52:13:7b:c3",
            "net9": "32:a5:33:91:bd:dd"
        },
        "leaf_1_0_12": {
            "net0": "f2:68:91:5d:81:91",
            "net1": "0a:e6:07:b9:76:76",
            "net10": "c6:48:8f:71:20:85",
            "net11": "f2:07:0e:9a:2b:15",
            "net12": "aa:44:bc:96:ad:94",
            "net13": "86:42:b1:00:f8:14",
            "net14": "3a:dc:25:87:39:44",
            "net2": "82:f5:7b:d3:7c:69",
            "net3": "ae:6e:b6:ec:bc:58",
            "net4": "02:b2:e9:dc:4d:4c",
            "net5": "9e:63:b0:b8:97:43",
            "net6": "2a:31:96:36:98:04",
            "net7": "b2:6b:1b:64:2b:7d",
            "net8": "22:c3:45:b5:64:ae",
            "net9": "66:50:61:fa:92:98"
        },
        "leaf_1_0_13": {
            "net0": "6e:09:d1:59:27:dd",
            "net1": "c6:ec:c0:15:7f:85",
            "net10": "d6:8b:01:65:ea:1d",
            "net11": "56:27:65:81:5d:18",
            "net12": "72:73:37:ce:2b:45",
            "net13": "e2:c9:fc:37:15:53",
            "net14": "3e:c0:0c:d7:84:59",
            "net2": "de:f0:04:95:3f:b8",
            "net3": "42:eb:79:d9:46:92",
            "net4": "ba:6e:7d:e9:92:2f",
            "net5": "7e:65:d0:4e:fc:27",
            "net6": "c6:99:54:a5:d4:1c",
            "net7": "2e:02:dc:2f:8a:77",
            "net8": "da:79:8d:03:97:49",
            "net9": "8e:8f:88:a7:55:a6"
        },
        "leaf_1_0_14": {
            "net0": "76:95:5c:11:67:66",
            "net1": "a2:99:7f:7e:57:dd",
            "net10": "32:a4:47:a9:df:47",
            "net11": "be:3a:e2:31:42:59",
            "net12": "82:84:d4:c8:8d:28",
            "net13": "ba:df:29:2a:04:7c",
            "net14": "3e:da:89:2d:78:9c",
            "net2": "8e:51:d2:7a:8e:5e",
            "net3": "f6:f9:05:d3:72:c8",
            "net4": "36:23:02:9a:53:6d",
            "net5": "02:94:c4:37:6e:42",
            "net6": "86:03:bc:22:4e:ea",
            "net7": "1a:8b:33:34:5d:30",
            "net8": "92:e1:81:f3:97:eb",
            "net9": "ce:29:ab:c4:3d:85"
        },
        "leaf_1_0_2": {
            "net0": "a2:55:f7:12:8a:a5",
            "net1": "ce:59:e6:a6:37:7e",
            "net10": "7e:ac:a0:94:6c:ce",
            "net11": "32:c7:63:f8:de:74",
            "net12": "be:52:3a:5a:08:20",
            "net13": "0a:00:2d:f0:eb:75",
            "net14": "3e:bc:1e:48:48:57",
            "net2": "76:69:61:2b:60:5c",
            "net3": "1a:b4:3f:b1:27:4c",
            "net4": "26:e8:3a:4c:31:d9",
            "net5": "ee:00:11:60:55:c5",
            "net6": "36:78:17:64:3d:ea",
            "net7": "66:a1:91:63:dc:a4",
            "net8": "92:1c:86:5a:2c:b4",
            "net9": "ca:e4:d9:34:3c:87"
        },
        "leaf_1_0_3": {
            "net0": "fa:5b:00:2d:76:a9",
            "net1": "fe:5e:3c:e1:ba:63",
            "net10": "ba:4e:13:3a:b2:24",
            "net11": "1a:0a:eb:9e:7c:96",
            "net12": "fa:a0:76:08:98:5c",
            "net13": "b2:9c:1b:e3:af:4c",
            "net14": "c6:dd:5e:f5:a9:5d",
            "net2": "62:93:f7:79:83:9c",
            "net3": "8a:1a:13:46:e3:2c",
            "net4": "42:05:29:d8:0f:14",
            "net5": "6a:33:b8:d3:0f:31",
            "net6": "0e:82:fc:bf:bb:6e",
            "net7": "46:86:41:29:0c:ab",
            "net8": "c2:b0:4c:ba:5a:35",
            "net9": "3e:9f:1a:35:e6:42"
        },
        "leaf_1_0_4": {
            "net0": "4e:98:24:40:46:ee",
            "net1": "4e:44:f6:73:40:bc",
            "net10": "12:3e:de:b2:8c:48",
            "net11": "96:4d:23:59:ca:3e",
            "net12": "a2:c1:93:dd:b6:a6",
            "net13": "3a:d2:82:58:f2:29",
            "net14": "26:e8:30:96:d7:a6",
            "net2": "da:c2:43:c8:68:94",
            "net3": "5a:14:da:f3:00:cc",
            "net4": "be:bb:05:88:37:24",
            "net5": "7a:d5:1e:da:75:c4",
            "net6": "da:f6:0c:8e:f9:f3",
            "net7": "a2:98:1d:b6:e8:72",
            "net8": "ae:d7:a9:63:61:81",
            "net9": "f6:6a:3d:0f:74:9b"
        },
        "leaf_1_0_5": {
            "net0": "42:98:7b:ba:46:3a",
            "net1": "3e:f2:c8:e5:44:77",
            "net10": "9e:91:1f:59:32:3c",
            "net11": "fa:06:37:c8:76:d5",
            "net12": "6a:8a:66:1b:d4:c6",
            "net13": "6e:d3:52:af:ca:b3",
            "net14": "d6:5c:b3:84:0f:fa",
            "net2": "3e:9a:da:03:8c:c7",
            "net3": "82:4d:e4:a2:1e:01",
            "net4": "7e:00:95:cb:ac:c9",
            "net5": "3e:76:78:ac:98:01",
            "net6": "42:56:d3:b9:d9:e2",
            "net7": "ce:3d:07:27:94:41",
            "net8": "42:10:c7:2d:2b:80",
            "net9": "ce:68:4d:19:a0:3a"
        },
        "leaf_1_0_6": {
            "net0": "a6:83:21:22:00:8d",
            "net1": "c2:80:32:f6:d0:45",
            "net10": "1e:d6:f7:55:95:39",
            "net11": "8a:d1:9c:bb:a8:68",
            "net12": "92:4a:ca:2a:21:aa",
            "net13": "ea:c0:ef:93:ea:ed",
            "net14": "6e:a8:dc:67:4d:8a",
            "net2": "32:26:a6:db:c9:9c",
            "net3": "32:e6:11:ef:6d:83",
            "net4": "5a:7c:fd:6a:91:77",
            "net5": "aa:5a:46:77:17:ce",
            "net6": "1e:a0:20:a1:b9:25",
            "net7": "7a:71:a4:79:50:b3",
            "net8": "6a:cb:e1:58:c6:c6",
            "net9": "0a:93:b2:9a:79:7e"
        },
        "leaf_1_0_7": {
            "net0": "fe:77:7e:a4:99:31",
            "net1": "4a:89:5d:bc:14:00",
            "net10": "5a:68:8f:b6:f7:d1",
            "net11": "5a:80:fc:77:3f:8d",
            "net12": "ae:9b:94:4c:92:12",
            "net13": "26:91:a7:37:5e:9f",
            "net14": "4e:38:c6:e0:ed:a1",
            "net2": "06:9f:6a:0c:72:b7",
            "net3": "a6:c7:83:b5:c5:5e",
            "net4": "26:1d:d2:4a:52:8e",
            "net5": "ce:f1:c7:61:76:46",
            "net6": "ea:6f:5d:32:4d:6e",
            "net7": "3e:ea:63:b4:9c:79",
            "net8": "36:d4:35:96:40:9a",
            "net9": "52:88:e5:7b:e2:42"
        },
        "leaf_1_0_8": {
            "net0": "66:bd:e4:dd:29:7f",
            "net1": "b6:9a:a4:90:ab:e5",
            "net10": "0e:01:c9:2f:96:6f",
            "net11": "3e:bc:3a:36:cd:2a",
            "net12": "82:d2:2a:89:96:3b",
            "net13": "ea:01:16:7d:4b:a6",
            "net14": "5e:bb:56:c6:44:0c",
            "net2": "72:35:d6:dd:c8:00",
            "net3": "42:c9:17:80:71:8b",
            "net4": "d2:60:64:df:90:0e",
            "net5": "4e:dd:7b:0e:13:fd",
            "net6": "42:b2:d9:2a:87:03",
            "net7": "ce:ef:fb:df:13:10",
            "net8": "96:fc:a5:72:23:ac",
            "net9": "56:dd:3d:21:74:a7"
        },
        "leaf_1_0_9": {
            "net0": "96:73:9b:88:07:dd",
            "net1": "d2:c9:11:a1:9f:f2",
            "net10": "e6:e0:66:c2:c3:7f",
            "net11": "be:0d:f5:6c:9a:69",
            "net12": "2e:48:8f:eb:39:ca",
            "net13": "96:d9:65:ef:24:7c",
            "net14": "62:4e:93:79:b8:fa",
            "net2": "8a:b2:17:e4:6b:7b",
            "net3": "96:d4:41:0b:51:a2",
            "net4": "b6:a2:b5:b2:84:2c",
            "net5": "b2:42:d4:af:df:f9",
            "net6": "8a:c2:67:d9:c8:40",
            "net7": "22:db:c2:f7:0b:15",
            "net8": "fa:2c:87:b6:ca:a7",
            "net9": "36:91:8c:10:04:64"
        },
        "leaf_2_0_1": {
            "net0": "e2:cc:be:a7:85:c8",
            "net1": "6a:45:7c:97:c5:70",
            "net10": "82:12:4e:a6:2e:c4",
            "net11": "66:bd:a3:c5:21:68",
            "net12": "ca:7f:aa:80:fc:3e",
            "net13": "62:89:32:77:a7:3d",
            "net14": "da:ad:3c:44:e4:cd",
            "net2": "c2:ba:20:7d:96:0c",
            "net3": "c6:c4:27:28:0b:1a",
            "net4": "4e:95:d3:a9:47:19",
            "net5": "1e:50:30:a7:47:4d",
            "net6": "1a:d3:8a:ae:00:36",
            "net7": "ee:81:82:ad:89:38",
            "net8": "e2:c8:98:23:4e:d0",
            "net9": "c6:b7:8d:b4:ef:52"
        },
        "leaf_2_0_10": {
            "net0": "aa:64:de:cf:76:cf",
            "net1": "f6:33:62:29:0d:0f",
            "net10": "fe:d1:16:29:26:c7",
            "net11": "72:63:b3:75:a9:c7",
            "net12": "ee:86:e7:89:1a:67",
            "net13": "26:aa:4a:1e:e4:1d",
            "net14": "2e:df:10:49:e7:dc",
            "net2": "da:9f:da:f7:e7:ee",
            "net3": "5a:31:56:46:0d:e1",
            "net4": "76:20:fc:7f:91:3e",
            "net5": "82:e0:bc:e7:ca:53",
            "net6": "2e:62:80:62:1a:26",
            "net7": "5a:d9:56:38:88:48",
            "net8": "c6:a0:b4:dd:9e:01",
            "net9": "9a:68:7c:13:7c:04"
        },
        "leaf_2_0_11": {
            "net0": "5e:b4:15:6c:dc:6b",
            "net1": "e2:54:ab:32:37:1b",
            "net10": "c6:1e:df:a9:e7:20",
            "net11": "96:31:ff:87:20:71",
            "net12": "82:89:65:c1:82:63",
            "net13": "3a:a4:63:ad:d7:0d",
            "net14": "12:e3:63:47:59:9a",
            "net2": "fa:80:c7:24:8a:e5",
            "net3": "6a:4c:9e:8e:ed:08",
            "net4": "76:24:a2:a2:23:07",
            "net5": "f6:79:db:7e:92:18",
            "net6": "ee:e5:39:a8:4f:e2",
            "net7": "f6:96:83:fa:bf:07",
            "net8": "6e:4c:79:9d:0e:6f",
            "net9": "d6:9d:d1:2b:7d:7c"
        },
        "leaf_2_0_12": {
            "net0": "32:c2:3f:e4:dd:88",
            "net1": "e2:e0:39:65:e9:6a",
            "net10": "d2:93:11:72:a4:cc",
            "net11": "7e:9e:d5:40:e7:23",
            "net12": "f6:bd:89:78:2d:0f",
            "net13": "02:d2:90:14:e2:59",
            "net14": "d6:79:25:c8:9f:c9",
            "net2": "2e:91:1d:7a:6f:f4",
            "net3": "2a:0d:8e:c9:3c:61",
            "net4": "d2:d7:f0:bf:8f:5d",
            "net5": "f6:ea:ba:e5:ee:54",
            "net6": "5e:3d:85:b9:18:96",
            "net7": "0a:56:c8:21:ba:82",
            "net8": "62:07:79:30:88:4f",
            "net9": "f2:4b:c6:ad:bb:69"
        },
        "leaf_2_0_13": {
            "net0": "46:d8:57:1f:a8:fa",
            "net1": "52:1a:a0:42:6a:e6",
            "net10": "96:be:69:36:d2:66",
            "net11": "06:da:48:7e:14:4f",
            "net12": "92:fe:73:a6:6b:25",
            "net13": "c6:7d:81:4c:c2:c5",
            "net14": "c6:77:04:19:fa:21",
            "net2": "ce:b8:05:95:43:1a",
            "net3": "4a:9d:5b:16:11:03",
            "net4": "9e:d3:09:2a:f6:ed",
            "net5": "9a:fb:5e:1e:d2:94",
            "net6": "52:cf:17:4f:29:8c",
            "net7": "f6:31:87:04:ef:6e",
            "net8": "76:fa:b8:ed:d5:d2",
            "net9": "c6:a2:bc:1e:1f:e1"
        },
        "leaf_2_0_14": {
            "net0": "62:91:46:0d:9c:17",
            "net1": "5e:28:50:e1:f5:b7",
            "net10": "b2:89:cd:b0:3a:58",
            "net11": "c2:4e:80:a9:50:cc",
            "net12": "76:58:4d:60:a8:a3",
            "net13": "be:0e:f1:c2:93:ce",
            "net14": "22:85:10:29:1f:1f",
            "net2": "0e:57:d4:a6:b2:41",
            "net3": "2e:d4:f0:f7:35:8c",
            "net4": "1a:fb:1f:58:77:9d",
            "net5": "fa:1b:62:da:34:f4",
            "net6": "da:2a:5e:02:c6:5a",
            "net7": "82:d4:09:29:28:6a",
            "net8": "be:2b:33:04:4d:46",
            "net9": "d2:fd:60:33:3d:6a"
        },
        "leaf_2_0_2": {
            "net0": "36:ec:72:86:63:71",
            "net1": "ce:45:03:81:aa:b6",
            "net10": "ae:ee:62:ae:93:f7",
            "net11": "2e:92:5e:eb:c8:c2",
            "net12": "de:a0:55:33:7e:0e",
            "net13": "2a:1f:7f:f8:80:9b",
            "net14": "52:a5:ea:23:53:4f",
            "net2": "06:50:8f:c3:40:e6",
            "net3": "ce:78:d9:3f:1d:dd",
            "net4": "16:98:00:08:39:5e",
            "net5": "9a:bc:c8:24:97:ff",
            "net6": "56:fb:96:5e:b8:70",
            "net7": "42:5b:2f:18:8b:cf",
            "net8": "d6:1c:80:cc:99:0f",
            "net9": "8e:1a:e1:b7:15:26"
        },
        "leaf_2_0_3": {
            "net0": "d6:93:f0:94:77:da",
            "net1": "2e:ce:d4:25:a6:2d",
            "net10": "66:ac:a9:18:cb:81",
            "net11": "1e:97:01:e8:f4:1f",
            "net12": "ea:68:f7:c7:7b:5e",
            "net13": "9a:53:3a:e5:eb:9b",
            "net14": "22:07:4c:83:a8:7e",
            "net2": "de:0c:64:63:1c:59",
            "net3": "6a:f1:cc:ee:a2:b3",
            "net4": "12:ba:7f:c0:1d:0f",
            "net5": "06:53:49:59:45:8c",
            "net6": "ae:be:65:a5:bb:ac",
            "net7": "56:33:32:12:63:12",
            "net8": "36:71:24:e1:bd:e5",
            "net9": "8a:3b:ba:b9:78:0a"
        },
        "leaf_2_0_4": {
            "net0": "36:2e:ec:7c:8d:73",
            "net1": "ba:d2:b9:e9:e7:d4",
            "net10": "4a:57:de:d4:68:1e",
            "net11": "06:dc:67:f3:87:a7",
            "net12": "6e:22:58:a9:3a:cf",
            "net13": "2a:af:1c:dd:93:5e",
            "net14": "56:8b:07:6f:01:e6",
            "net2": "b6:26:1a:83:84:2f",
            "net3": "ba:d4:ff:a9:97:5f",
            "net4": "fa:1f:85:6b:8d:e2",
            "net5": "26:b4:87:9e:47:5d",
            "net6": "52:4c:96:a8:8f:c6",
            "net7": "1e:5a:b0:55:e1:9b",
            "net8": "0a:6b:fe:23:27:6e",
            "net9": "da:e8:ba:64:42:23"
        },
        "leaf_2_0_5": {
            "net0": "06:7e:36:69:3a:35",
            "net1": "a2:8c:c0:c3:d5:41",
            "net10": "92:02:77:57:fc:0a",
            "net11": "da:91:a5:59:8e:b8",
            "net12": "1e:24:7e:ed:77:13",
            "net13": "3a:3b:99:2a:7d:ff",
            "net14": "aa:b3:36:6d:f7:ec",
            "net2": "22:04:49:9a:32:95",
            "net3": "ae:40:e9:1f:ae:6b",
            "net4": "9e:40:32:bb:e6:81",
            "net5": "5e:01:d1:09:d8:71",
            "net6": "a6:fc:7e:7e:37:5e",
            "net7": "fa:fb:ba:c0:07:84",
            "net8": "2e:65:5e:a6:4d:7a",
            "net9": "1e:9c:74:1d:ba:db"
        },
        "leaf_2_0_6": {
            "net0": "ea:5e:22:44:ce:7a",
            "net1": "8a:aa:f8:10:68:8e",
            "net10": "12:bd:ae:cf:57:19",
            "net11": "b6:16:4f:36:b0:53",
            "net12": "8e:60:9c:63:69:b6",
            "net13": "16:03:dc:35:14:9c",
            "net14": "8e:69:4e:2a:b0:34",
            "net2": "22:31:95:cb:21:28",
            "net3": "ae:a5:40:13:3b:9f",
            "net4": "82:b6:96:aa:5c:a1",
            "net5": "aa:c4:ea:bb:37:37",
            "net6": "6e:28:12:ab:0d:85",
            "net7": "ee:35:9b:9c:f6:7f",
            "net8": "6e:e9:c8:68:e0:33",
            "net9": "02:7b:93:47:1a:23"
        },
        "leaf_2_0_7": {
            "net0": "ee:47:27:ae:3f:c2",
            "net1": "fe:fa:c2:17:3d:70",
            "net10": "4a:b9:ae:33:12:3f",
            "net11": "06:1e:14:5e:ef:f3",
            "net12": "86:5c:ef:b2:11:8c",
            "net13": "16:a3:21:ce:ff:38",
            "net14": "9a:a2:4f:c2:bf:61",
            "net2": "46:b2:94:da:23:5d",
            "net3": "0a:99:62:90:28:c4",
            "net4": "ee:39:f7:89:68:57",
            "net5": "ce:18:32:2a:2c:be",
            "net6": "02:c7:1c:4c:1b:9b",
            "net7": "96:5c:35:47:e8:b7",
            "net8": "6a:8b:be:19:0a:dc",
            "net9": "26:98:2c:4f:d0:fe"
        },
        "leaf_2_0_8": {
            "net0": "f6:e0:e4:01:e9:0d",
            "net1": "7e:55:bd:6f:e5:1e",
            "net10": "5e:cc:46:76:30:be",
            "net11": "92:9c:f1:14:ad:85",
            "net12": "32:d9:c2:f9:4e:ba",
            "net13": "66:2b:d6:c7:ab:89",
            "net14": "fa:d4:88:75:a3:20",
            "net2": "0e:dd:b8:ed:18:5b",
            "net3": "6e:83:fd:eb:98:05",
            "net4": "9e:7d:f4:dc:5c:16",
            "net5": "a2:f2:42:a4:18:52",
            "net6": "b2:97:56:7b:01:6b",
            "net7": "22:dc:87:bd:af:1c",
            "net8": "16:6c:fd:64:3e:79",
            "net9": "c2:ec:da:0e:76:cf"
        },
        "leaf_2_0_9": {
            "net0": "fa:4f:80:06:c9:10",
            "net1": "b2:e2:77:5e:b3:e8",
            "net10": "3e:4c:97:94:f5:df",
            "net11": "fe:43:f7:81:ca:0f",
            "net12": "ca:2e:bf:79:fe:5d",
            "net13": "b6:d1:d2:12:6b:6d",
            "net14": "7a:dc:ca:ef:b4:46",
            "net2": "de:14:4f:80:3e:f8",
            "net3": "a6:1b:58:16:df:a4",
            "net4": "92:1e:b9:2a:77:c1",
            "net5": "d6:8d:98:9d:f8:e9",
            "net6": "f2:0c:a4:d3:52:6c",
            "net7": "96:57:00:00:4d:9a",
            "net8": "22:b9:9b:85:c3:55",
            "net9": "d6:30:c8:69:5c:0d"
        },
        "spine_1_1_1": {
            "net0": "42:eb:10:f4:93:3a",
            "net1": "82:1d:61:b6:17:b2",
            "net10": "fa:d5:02:49:14:5b",
            "net11": "86:46:82:97:65:a1",
            "net12": "6a:de:d8:30:dc:15",
            "net13": "2a:fa:bd:a1:80:3e",
            "net14": "16:2d:39:9d:9d:dc",
            "net15": "06:9d:44:2c:98:58",
            "net16": "9e:02:29:a4:1c:08",
            "net17": "ee:3e:f4:fb:0a:6f",
            "net18": "7a:78:de:7f:4a:dc",
            "net19": "86:c6:96:5f:6b:6b",
            "net2": "c6:d5:d5:cc:66:13",
            "net20": "d6:17:a3:bf:ca:96",
            "net21": "62:34:6c:71:df:f9",
            "net22": "4a:cf:d7:7f:95:83",
            "net23": "5a:fa:d6:dd:38:dc",
            "net24": "b6:6e:ee:d7:24:54",
            "net25": "c2:cb:40:07:12:34",
            "net26": "ea:e8:48:f8:02:39",
            "net27": "32:59:cb:df:91:4e",
            "net3": "6a:6d:bc:b1:9e:3e",
            "net4": "d2:0a:6d:d8:4d:af",
            "net5": "c2:90:b1:2e:3e:f3",
            "net6": "a2:a6:4a:aa:0f:56",
            "net7": "4e:68:1f:08:66:f5",
            "net8": "e2:51:fa:ff:b4:97",
            "net9": "42:1f:e6:a4:dd:0f"
        },
        "spine_1_1_10": {
            "net0": "da:fd:21:0b:92:cb",
            "net1": "ba:e2:f3:70:76:96",
            "net10": "e2:69:40:30:36:79",
            "net11": "56:60:7d:ec:2c:3b",
            "net12": "76:e7:d9:ee:07:3e",
            "net13": "46:46:a0:89:83:0a",
            "net14": "76:e6:1f:42:da:d8",
            "net15": "aa:2a:da:bc:19:c4",
            "net16": "9a:49:cb:66:e9:e5",
            "net17": "de:1a:54:ab:47:d0",
            "net18": "06:a2:66:f0:24:66",
            "net19": "da:b9:1d:ea:a5:cf",
            "net2": "46:91:12:64:7f:bb",
            "net20": "36:cb:c5:1e:5f:db",
            "net21": "f2:00:6c:b7:41:4a",
            "net22": "3e:0a:09:d6:8d:06",
            "net23": "c2:54:0a:61:0d:4a",
            "net24": "86:6a:9e:d8:78:5f",
            "net25": "fa:4f:d7:f6:5b:3d",
            "net26": "62:7f:9e:ad:d8:8d",
            "net27": "1a:63:4f:50:6f:c3",
            "net3": "da:ba:5b:45:82:05",
            "net4": "b2:fd:a4:e5:9d:ba",
            "net5": "3a:77:23:3c:42:1b",
            "net6": "22:a8:e3:9b:5c:05",
            "net7": "f6:a3:4e:1e:02:0f",
            "net8": "a6:bf:41:b6:75:90",
            "net9": "26:f2:96:31:17:b0"
        },
        "spine_1_1_11": {
            "net0": "96:e8:37:5c:5e:a9",
            "net1": "3e:7c:07:41:e2:72",
            "net10": "0e:7f:12:2d:91:e8",
            "net11": "be:78:4b:95:eb:3c",
            "net12": "b6:50:73:65:49:56",
            "net13": "86:ed:e6:a4:50:e0",
            "net14": "be:fd:43:ba:29:0a",
            "net15": "ce:61:3a:8b:af:b0",
            "net16": "f6:e6:f9:5a:24:9a",
            "net17": "86:fa:54:d7:3b:2b",
            "net18": "fe:67:27:40:d7:07",
            "net19": "96:02:b7:ea:0c:95",
            "net2": "82:ba:0e:e8:82:ca",
            "net20": "76:b7:fc:98:70:1f",
            "net21": "be:71:02:db:8f:cf",
            "net22": "7a:31:fe:94:50:c4",
            "net23": "ca:da:5d:3c:40:25",
            "net24": "6e:a3:1a:c9:e6:ba",
            "net25": "a2:e9:cc:d2:7b:bc",
            "net26": "8a:cb:1b:93:e6:1c",
            "net27": "3a:73:c7:5a:0f:5e",
            "net3": "b6:25:63:85:1e:c5",
            "net4": "3a:44:73:4d:c6:92",
            "net5": "4a:be:18:a9:46:76",
            "net6": "fa:8e:a9:b0:d5:3f",
            "net7": "ee:c8:cf:75:9c:1a",
            "net8": "d2:fb:cf:bc:a9:93",
            "net9": "0e:f9:3e:f9:75:79"
        },
        "spine_1_1_12": {
            "net0": "f2:25:70:c6:5a:05",
            "net1": "fe:52:4f:9e:26:d3",
            "net10": "5a:bf:16:3f:11:c9",
            "net11": "72:95:ff:10:a6:8f",
            "net12": "26:cb:cb:21:10:77",
            "net13": "76:ca:63:62:9a:a5",
            "net14": "fa:68:bb:2e:be:5e",
            "net15": "7a:8f:35:06:c5:ce",
            "net16": "2e:58:97:d4:e8:25",
            "net17": "ae:9e:be:19:ee:43",
            "net18": "e2:52:a3:83:f3:b5",
            "net19": "86:41:d3:a3:b0:5a",
            "net2": "82:52:95:cb:cb:48",
            "net20": "8e:bf:c2:5e:a6:3b",
            "net21": "46:14:ad:6c:ad:17",
            "net22": "06:a7:6b:1b:52:06",
            "net23": "be:d3:ff:5d:8b:49",
            "net24": "8e:9c:59:d8:8b:17",
            "net25": "1a:85:e5:36:df:6d",
            "net26": "9e:1d:c7:2a:0b:b1",
            "net27": "ba:61:24:ee:c7:df",
            "net3": "66:88:43:84:ab:44",
            "net4": "8a:2e:3a:79:f3:8f",
            "net5": "c6:ce:c0:f4:b4:6c",
            "net6": "2e:40:e8:88:f2:b9",
            "net7": "86:37:1a:a6:a6:36",
            "net8": "46:74:7c:50:d0:af",
            "net9": "f2:22:3c:a3:c6:e8"
        },
        "spine_1_1_13": {
            "net0": "a2:17:7c:32:b8:35",
            "net1": "0e:8b:fe:07:73:22",
            "net10": "d6:28:1b:42:52:3f",
            "net11": "ce:0e:c8:c5:3e:ea",
            "net12": "f2:80:d3:b1:49:2a",
            "net13": "2a:78:ef:04:d3:8e",
            "net14": "1e:1c:fd:b6:18:7f",
            "net15": "8a:c3:4d:c4:95:7c",
            "net16": "c2:03:d4:95:3e:99",
            "net17": "52:60:7c:6e:6d:8b",
            "net18": "ca:cd:ee:26:90:0a",
            "net19": "46:e3:39:99:b9:62",
            "net2": "52:c3:ef:ac:f2:7e",
            "net20": "c2:f3:16:36:20:81",
            "net21": "5a:19:4d:ad:dc:65",
            "net22": "ba:24:72:a0:4b:73",
            "net23": "0e:21:93:c2:49:72",
            "net24": "d2:0a:98:01:d3:67",
            "net25": "ba:4b:9b:de:85:2f",
            "net26": "2e:b5:89:a6:90:7e",
            "net27": "22:93:f0:98:7d:94",
            "net3": "36:ac:63:9a:20:69",
            "net4": "d6:6b:f4:cd:03:1b",
            "net5": "1e:34:93:37:db:44",
            "net6": "b2:94:70:ab:0e:34",
            "net7": "d6:84:58:ea:d6:17",
            "net8": "86:50:a2:ea:81:a4",
            "net9": "a6:6d:df:72:79:ad"
        },
        "spine_1_1_14": {
            "net0": "32:8b:f9:6a:03:68",
            "net1": "4e:fd:c4:c3:d5:5d",
            "net10": "5a:b3:53:ac:f0:f3",
            "net11": "36:d2:c8:5e:ad:bb",
            "net12": "ca:5c:4a:04:68:c9",
            "net13": "36:59:e9:28:8b:1b",
            "net14": "76:f2:ed:a9:26:ec",
            "net15": "36:35:12:13:65:62",
            "net16": "f2:91:39:32:7b:7a",
            "net17": "9a:f2:57:5e:fc:1b",
            "net18": "22:a6:1f:34:27:57",
            "net19": "b2:f5:05:95:22:b8",
            "net2": "0a:68:f9:f7:3a:82",
            "net20": "c6:2a:5a:50:3f:69",
            "net21": "0e:83:99:e7:b7:04",
            "net22": "1a:a7:e6:12:e7:62",
            "net23": "16:70:58:56:51:cb",
            "net24": "26:35:21:c0:04:83",
            "net25": "6a:91:5d:82:89:da",
            "net26": "9a:a2:c9:b0:dd:29",
            "net27": "92:af:ff:02:8c:7c",
            "net3": "4e:84:e1:10:97:f6",
            "net4": "c2:ac:4a:69:d3:3f",
            "net5": "8e:ab:26:18:5e:ea",
            "net6": "7e:ef:3e:11:ef:84",
            "net7": "46:32:52:07:f6:25",
            "net8": "3e:6c:5a:e6:e5:e6",
            "net9": "2e:8b:df:b2:74:01"
        },
        "spine_1_1_2": {
            "net0": "da:94:ac:9f:4d:99",
            "net1": "1e:4d:66:ce:b4:a4",
            "net10": "96:13:e1:27:df:f7",
            "net11": "b2:ac:b9:7c:39:01",
            "net12": "6a:6f:03:67:b9:b0",
            "net13": "4e:23:55:b8:a2:8e",
            "net14": "4a:bc:54:78:11:cd",
            "net15": "ce:27:70:0f:26:ec",
            "net16": "22:13:71:8f:76:34",
            "net17": "96:92:5f:fc:35:a2",
            "net18": "b2:d1:05:f4:24:2a",
            "net19": "ae:4f:b9:40:66:48",
            "net2": "86:b9:2e:fb:00:47",
            "net20": "7e:65:79:46:1e:2e",
            "net21": "76:80:ff:c2:5f:69",
            "net22": "c2:28:c2:5b:3f:81",
            "net23": "d6:4b:6c:a9:6d:be",
            "net24": "aa:0a:3b:32:43:c2",
            "net25": "32:58:cd:31:9e:0b",
            "net26": "ea:41:c2:c7:0b:9b",
            "net27": "12:3f:24:f2:7b:11",
            "net3": "12:f4:02:90:41:b4",
            "net4": "32:05:01:71:e8:df",
            "net5": "56:cc:f6:89:53:31",
            "net6": "92:6d:60:d0:f2:28",
            "net7": "96:ba:90:7d:8d:9f",
            "net8": "be:1b:de:79:ff:64",
            "net9": "0e:ee:51:09:65:1a"
        },
        "spine_1_1_3": {
            "net0": "3a:d1:68:a1:78:9e",
            "net1": "96:0b:11:91:f0:71",
            "net10": "22:4f:f3:a9:5d:3e",
            "net11": "8a:3d:3d:80:7e:07",
            "net12": "2e:43:7e:4b:04:36",
            "net13": "02:c8:61:ef:fa:a0",
            "net14": "42:01:c2:87:e3:a8",
            "net15": "6a:9d:67:a8:f5:f3",
            "net16": "6e:8e:b9:24:2f:67",
            "net17": "66:88:b2:90:7d:2a",
            "net18": "02:85:21:d1:f6:71",
            "net19": "3e:df:85:af:e0:52",
            "net2": "82:a3:fb:47:4e:d7",
            "net20": "ce:8e:14:ab:7d:71",
            "net21": "da:90:73:61:f3:b2",
            "net22": "2a:b7:5e:e5:28:f7",
            "net23": "5a:3a:1c:67:90:18",
            "net24": "e6:11:65:0f:7d:53",
            "net25": "ca:3e:6f:ef:c6:15",
            "net26": "1e:fe:96:5b:e8:9b",
            "net27": "c2:e1:8a:da:76:5d",
            "net3": "de:b9:ed:33:5e:b1",
            "net4": "6a:e5:48:a1:b0:92",
            "net5": "6a:88:8a:85:7b:68",
            "net6": "42:98:ff:73:c9:df",
            "net7": "62:07:93:82:8f:ac",
            "net8": "0e:f9:c2:68:f0:36",
            "net9": "e2:9e:b2:4d:19:94"
        },
        "spine_1_1_4": {
            "net0": "da:14:56:15:66:63",
            "net1": "66:8b:db:13:ab:7d",
            "net10": "0a:4d:36:05:04:19",
            "net11": "ca:cd:34:a7:b9:46",
            "net12": "76:91:59:b9:02:03",
            "net13": "1a:34:76:b4:60:21",
            "net14": "c6:d0:12:fa:f6:9f",
            "net15": "26:03:09:d9:0c:a3",
            "net16": "8e:96:02:44:35:87",
            "net17": "ea:c3:4a:58:db:f7",
            "net18": "d2:51:41:c4:84:13",
            "net19": "e2:0d:1c:9a:2d:50",
            "net2": "a6:7e:e7:d1:5f:7f",
            "net20": "6a:51:d0:44:7b:fd",
            "net21": "da:e8:e5:d1:bf:f2",
            "net22": "66:ca:cb:ee:7d:d4",
            "net23": "fa:2a:0b:bb:5d:cf",
            "net24": "ce:bb:43:66:57:48",
            "net25": "d6:70:72:94:2d:2a",
            "net26": "aa:b3:18:e5:8e:9b",
            "net27": "e6:91:bd:08:11:2d",
            "net3": "26:d2:e8:e7:1c:74",
            "net4": "ea:40:7d:f7:fa:06",
            "net5": "6e:62:18:25:56:f7",
            "net6": "36:a3:7d:18:74:6e",
            "net7": "f2:1f:3f:aa:6e:a7",
            "net8": "6a:0c:6f:9c:64:c6",
            "net9": "0e:f7:1c:06:e7:4b"
        },
        "spine_1_1_5": {
            "net0": "4e:04:ca:c3:95:83",
            "net1": "f2:a2:5c:90:6f:70",
            "net10": "b2:62:a7:7f:e8:54",
            "net11": "ea:07:ba:27:0f:27",
            "net12": "7a:c1:46:29:a4:37",
            "net13": "ce:01:3d:16:c7:0d",
            "net14": "0e:a2:ff:3f:7b:49",
            "net15": "16:dc:fc:18:81:8c",
            "net16": "2a:ff:12:87:a5:b2",
            "net17": "b2:d9:4d:28:ee:59",
            "net18": "06:46:10:a4:1b:a7",
            "net19": "da:98:a4:1c:04:e2",
            "net2": "d6:7e:03:cc:f4:32",
            "net20": "e2:17:92:ce:0e:48",
            "net21": "a2:cf:be:e0:25:00",
            "net22": "8e:58:b6:96:ad:53",
            "net23": "66:23:4b:fd:a8:18",
            "net24": "0a:e2:40:dc:10:ab",
            "net25": "e6:a9:14:2b:80:bf",
            "net26": "5a:a2:89:26:b8:22",
            "net27": "3e:96:06:81:a7:24",
            "net3": "ae:b3:74:1f:dc:77",
            "net4": "a6:eb:77:63:ad:2f",
            "net5": "de:87:36:8a:d8:be",
            "net6": "9e:b5:05:d4:9d:f3",
            "net7": "3e:10:af:c0:54:64",
            "net8": "b6:61:95:4f:d2:5c",
            "net9": "82:b1:ac:66:8a:18"
        },
        "spine_1_1_6": {
            "net0": "76:3e:53:c2:66:49",
            "net1": "1e:b5:3a:10:8e:25",
            "net10": "ee:49:6e:d6:78:7f",
            "net11": "e2:2f:1a:54:1c:28",
            "net12": "16:74:37:c0:fb:11",
            "net13": "3e:7d:a1:d9:8e:09",
            "net14": "16:de:08:b8:95:3d",
            "net15": "42:0c:0b:6f:8c:f0",
            "net16": "c2:e4:e8:5c:0c:d8",
            "net17": "5a:5a:8c:20:91:10",
            "net18": "16:7e:96:6a:01:1b",
            "net19": "6a:d2:cc:60:e4:01",
            "net2": "ca:8d:f0:b5:64:b7",
            "net20": "5e:13:4b:d9:91:af",
            "net21": "16:54:78:cf:d7:bc",
            "net22": "0e:b4:b3:be:cf:f7",
            "net23": "62:5d:18:83:b6:47",
            "net24": "76:2f:f6:9e:7d:57",
            "net25": "3a:46:53:a4:6f:12",
            "net26": "1a:22:9e:99:65:77",
            "net27": "f6:c9:b8:42:19:89",
            "net3": "7a:82:e1:fc:c6:95",
            "net4": "76:98:5b:d7:79:8f",
            "net5": "e6:5d:87:dd:98:77",
            "net6": "ee:67:43:84:0c:1f",
            "net7": "4e:2e:90:51:8d:9f",
            "net8": "3a:e4:2f:70:a4:4f",
            "net9": "5a:27:47:d3:20:55"
        },
        "spine_1_1_7": {
            "net0": "d2:dd:77:5b:57:5a",
            "net1": "3a:78:90:c6:2b:0f",
            "net10": "6a:32:6d:01:1b:2a",
            "net11": "ce:00:f5:15:03:fa",
            "net12": "16:b3:8d:fa:eb:e4",
            "net13": "ca:21:39:b5:9d:ff",
            "net14": "b2:0b:cb:ea:f3:f0",
            "net15": "46:e5:8c:6b:db:2b",
            "net16": "06:f9:3d:96:b8:a2",
            "net17": "4e:43:cb:39:e1:ca",
            "net18": "32:34:3c:b8:86:27",
            "net19": "2e:1c:11:b6:10:e4",
            "net2": "fa:6e:db:37:47:72",
            "net20": "02:6d:79:ab:ca:77",
            "net21": "6a:82:84:b3:a3:3f",
            "net22": "ee:7f:c6:f4:ec:96",
            "net23": "0a:12:39:15:fb:27",
            "net24": "3a:79:5d:f6:e8:d8",
            "net25": "0a:80:e1:99:fb:81",
            "net26": "8a:83:4b:14:62:c8",
            "net27": "b6:69:66:c5:9b:1c",
            "net3": "ca:3a:fd:ae:77:fa",
            "net4": "0a:96:7a:f1:a2:af",
            "net5": "8a:1d:4c:dc:5d:f7",
            "net6": "b2:79:6e:73:13:a6",
            "net7": "9e:de:7c:ee:84:0c",
            "net8": "1a:15:62:5c:7e:3a",
            "net9": "e6:7e:31:64:1b:9c"
        },
        "spine_1_1_8": {
            "net0": "22:88:c5:86:bb:7c",
            "net1": "ee:58:65:6c:76:2e",
            "net10": "ae:f8:40:f7:c3:d8",
            "net11": "92:7a:fd:5a:6a:dc",
            "net12": "ae:d1:b5:7f:95:9e",
            "net13": "72:59:e4:a9:2e:ac",
            "net14": "f6:6f:98:e0:a8:10",
            "net15": "62:c5:e1:fb:88:40",
            "net16": "0a:63:77:3c:11:23",
            "net17": "56:d7:65:dd:99:4a",
            "net18": "1e:e5:59:79:ef:a6",
            "net19": "32:ef:48:23:95:62",
            "net2": "7e:8b:50:91:7e:f1",
            "net20": "a6:9b:c2:50:ee:28",
            "net21": "0a:df:83:5b:e6:54",
            "net22": "c6:db:a0:42:c8:1d",
            "net23": "aa:66:5c:65:f2:86",
            "net24": "62:43:c8:aa:c1:4c",
            "net25": "a2:0a:4f:f8:aa:0c",
            "net26": "f6:b2:d3:e0:a7:a3",
            "net27": "32:b3:67:ee:64:60",
            "net3": "e6:76:dd:42:bf:78",
            "net4": "2e:f4:f8:3f:59:54",
            "net5": "92:48:31:0e:11:f9",
            "net6": "7e:7c:48:ce:c9:98",
            "net7": "62:00:fb:cd:46:84",
            "net8": "f6:cd:fd:2f:19:de",
            "net9": "12:d5:16:a3:b4:7b"
        },
        "spine_1_1_9": {
            "net0": "ca:0b:50:a6:91:c2",
            "net1": "32:44:64:f5:18:35",
            "net10": "fe:3b:d4:07:32:c2",
            "net11": "da:b3:11:98:10:78",
            "net12": "ee:1c:65:df:f7:b4",
            "net13": "62:bb:e8:cf:f3:e5",
            "net14": "66:d1:36:a3:ab:1b",
            "net15": "d6:35:e3:36:e5:f6",
            "net16": "2a:38:cb:e7:11:74",
            "net17": "c6:a1:91:18:b4:bd",
            "net18": "62:23:6f:41:d4:3a",
            "net19": "3a:2c:89:b1:90:6d",
            "net2": "1a:73:e7:e8:5b:74",
            "net20": "ba:99:a2:34:f9:9e",
            "net21": "c6:cc:c0:2a:a0:2a",
            "net22": "ea:31:78:e2:dd:3b",
            "net23": "be:c8:d5:72:8d:4f",
            "net24": "06:fe:61:67:0c:31",
            "net25": "36:12:91:b9:9f:c3",
            "net26": "7e:3d:7a:eb:2c:32",
            "net27": "5a:52:5d:bd:ee:bf",
            "net3": "f6:3a:66:f8:09:88",
            "net4": "c2:ea:89:e5:78:70",
            "net5": "2e:68:81:1e:7e:37",
            "net6": "2e:33:fd:31:ca:43",
            "net7": "52:79:cc:a0:13:89",
            "net8": "5a:cc:0b:13:22:6c",
            "net9": "56:4b:cd:e8:29:c6"
        },
        "spine_2_1_1": {
            "net0": "fa:82:0f:5e:16:f8",
            "net1": "3a:35:f1:34:11:59",
            "net10": "42:f6:0c:49:dc:f5",
            "net11": "b6:7a:39:ff:7f:9a",
            "net12": "9a:65:57:9d:d0:3c",
            "net13": "e6:fe:de:a0:e0:f0",
            "net14": "e6:a2:20:a3:5f:5c",
            "net15": "56:53:2f:92:76:bc",
            "net16": "86:82:60:1c:1e:ab",
            "net17": "22:a4:17:7c:9c:84",
            "net18": "ea:e5:5f:f0:e5:d5",
            "net19": "92:60:5c:c5:72:0c",
            "net2": "7a:b9:88:61:90:66",
            "net20": "42:1e:17:c0:a9:ac",
            "net21": "16:12:24:8f:af:ef",
            "net22": "5e:1a:bf:a9:3e:8c",
            "net23": "2a:6c:ef:fb:a7:d4",
            "net24": "56:be:ad:97:15:a0",
            "net25": "fa:52:f2:78:39:11",
            "net26": "ea:fc:1f:a2:a0:4a",
            "net27": "c2:f5:71:3b:2f:03",
            "net3": "d6:f1:a3:a9:a2:af",
            "net4": "f2:9d:4e:2a:93:4b",
            "net5": "52:02:f8:06:19:f2",
            "net6": "56:80:08:fc:ae:fb",
            "net7": "56:7b:a7:9d:db:1e",
            "net8": "52:77:c8:54:72:b9",
            "net9": "46:ea:30:ce:94:a3"
        },
        "spine_2_1_10": {
            "net0": "e2:60:4a:c2:2b:ab",
            "net1": "66:13:64:0d:67:a6",
            "net10": "0a:f1:b0:29:af:b5",
            "net11": "52:68:fd:8d:3a:41",
            "net12": "fe:51:ff:4f:07:77",
            "net13": "9a:27:ea:12:88:cc",
            "net14": "0a:a5:16:33:b4:3e",
            "net15": "46:3b:ea:ff:b8:55",
            "net16": "c2:e3:a1:68:11:fa",
            "net17": "26:5d:49:f5:de:b5",
            "net18": "02:c4:36:43:b0:29",
            "net19": "b6:7b:14:ec:57:66",
            "net2": "be:b4:64:fb:ec:1e",
            "net20": "56:f9:5c:a6:d8:24",
            "net21": "36:f7:18:e5:37:31",
            "net22": "b2:33:05:32:6d:68",
            "net23": "e6:bb:60:ec:d2:8f",
            "net24": "d6:c6:78:2f:0d:bf",
            "net25": "16:05:32:2e:81:45",
            "net26": "56:82:7a:8a:ac:af",
            "net27": "32:53:f2:a3:45:47",
            "net3": "ae:80:4f:1b:23:48",
            "net4": "92:d9:80:aa:9b:4d",
            "net5": "b6:49:e7:bc:30:26",
            "net6": "8a:8a:07:49:c2:e3",
            "net7": "fa:89:4c:62:ca:3d",
            "net8": "d6:e5:76:dc:b4:ca",
            "net9": "12:ab:f1:30:52:26"
        },
        "spine_2_1_11": {
            "net0": "de:ba:63:9f:e6:04",
            "net1": "be:39:9f:24:a8:de",
            "net10": "de:31:ec:b1:b2:96",
            "net11": "8a:3c:ed:6e:66:9d",
            "net12": "d2:b9:c1:bc:6a:d0",
            "net13": "22:20:7b:f9:91:67",
            "net14": "72:05:fc:f4:32:ba",
            "net15": "16:92:36:d8:ae:01",
            "net16": "66:3e:32:32:91:1e",
            "net17": "46:5b:70:f6:3d:93",
            "net18": "4a:7f:60:26:ab:73",
            "net19": "d2:64:73:d7:a3:1e",
            "net2": "6a:03:21:bf:08:94",
            "net20": "4a:10:15:e6:9e:ce",
            "net21": "c6:4c:8b:3f:6c:c1",
            "net22": "5a:bb:50:a6:93:69",
            "net23": "ae:3b:1d:a0:84:3e",
            "net24": "ea:e5:69:21:ad:cb",
            "net25": "66:df:4a:cb:fb:26",
            "net26": "0e:16:0b:5f:92:a1",
            "net27": "aa:7d:f3:be:e2:3c",
            "net3": "9a:7c:45:3f:03:a7",
            "net4": "52:a5:07:b3:f3:c3",
            "net5": "96:fd:d8:3d:95:68",
            "net6": "02:0c:ca:21:35:ff",
            "net7": "fa:5d:ba:ca:2e:3b",
            "net8": "92:61:c5:61:4d:68",
            "net9": "ae:bd:d7:77:05:59"
        },
        "spine_2_1_12": {
            "net0": "be:5a:02:04:6b:12",
            "net1": "a2:23:ff:16:70:03",
            "net10": "f2:34:d7:e9:e3:47",
            "net11": "22:e4:a3:52:7d:40",
            "net12": "66:40:3e:04:8f:60",
            "net13": "c2:4a:4a:a7:63:ad",
            "net14": "4a:65:f8:22:73:6b",
            "net15": "ce:87:74:6e:22:00",
            "net16": "1e:90:53:91:d4:00",
            "net17": "2e:e0:0b:6a:b4:b1",
            "net18": "62:f6:b7:e9:6a:3c",
            "net19": "a6:13:65:ca:1f:a9",
            "net2": "6a:a7:21:be:cd:cc",
            "net20": "de:5a:43:8c:60:49",
            "net21": "92:46:05:c4:1c:5b",
            "net22": "02:41:b6:66:a3:00",
            "net23": "fe:2b:d9:b1:7a:60",
            "net24": "62:88:7d:c2:4c:c0",
            "net25": "7a:cb:50:e8:a5:b0",
            "net26": "de:d4:25:6e:32:4b",
            "net27": "e6:08:d1:7d:30:a1",
            "net3": "3a:ef:ae:6e:08:2e",
            "net4": "5e:db:95:01:19:20",
            "net5": "6a:e5:a7:e6:19:d2",
            "net6": "6e:f2:db:c5:82:be",
            "net7": "c6:7c:ad:16:e5:e9",
            "net8": "06:49:1c:b7:5a:d4",
            "net9": "62:16:23:ad:4c:bd"
        },
        "spine_2_1_13": {
            "net0": "82:0f:00:8a:0a:7b",
            "net1": "9a:a9:cb:92:e2:d1",
            "net10": "b6:05:b4:89:4e:d9",
            "net11": "d6:5c:98:d9:5b:2c",
            "net12": "ba:4b:2f:05:e1:dc",
            "net13": "a2:e4:43:75:45:03",
            "net14": "a2:82:10:12:2c:3e",
            "net15": "76:55:a1:50:7e:25",
            "net16": "0e:72:86:ca:ee:57",
            "net17": "0a:c1:39:6a:ca:7b",
            "net18": "da:69:45:66:cb:f8",
            "net19": "a6:12:ba:81:3d:f4",
            "net2": "7e:9c:bc:78:48:59",
            "net20": "46:45:94:b0:1d:52",
            "net21": "d2:30:88:a7:3c:ce",
            "net22": "36:37:0f:e9:a1:57",
            "net23": "1a:6f:e2:c6:19:15",
            "net24": "32:2a:57:f6:7b:7d",
            "net25": "ce:71:45:52:3d:7d",
            "net26": "36:67:2c:30:0a:84",
            "net27": "66:26:5b:0e:eb:ff",
            "net3": "4e:62:f3:50:81:ab",
            "net4": "e2:6e:5c:ff:41:82",
            "net5": "7a:df:ca:44:64:12",
            "net6": "82:59:08:98:b6:85",
            "net7": "ae:d0:b2:c1:77:ad",
            "net8": "1e:69:52:b5:4f:cb",
            "net9": "2e:c8:f5:f1:af:8d"
        },
        "spine_2_1_14": {
            "net0": "be:f7:6a:1e:b1:cd",
            "net1": "96:e9:82:1a:0c:1d",
            "net10": "66:3a:01:b3:38:a7",
            "net11": "d2:5c:e3:1f:55:e4",
            "net12": "06:5f:e1:87:48:11",
            "net13": "e2:14:8b:66:ed:04",
            "net14": "7e:8e:23:32:f6:26",
            "net15": "1a:27:62:8f:32:23",
            "net16": "82:f6:5c:a0:36:72",
            "net17": "92:e2:03:6c:23:ad",
            "net18": "c2:bb:1c:8c:cb:6f",
            "net19": "86:70:63:ee:00:13",
            "net2": "f6:a1:46:30:78:2c",
            "net20": "4a:13:f4:73:f1:ca",
            "net21": "0e:5c:5b:5f:3b:e3",
            "net22": "ee:35:a5:a8:c4:29",
            "net23": "2a:55:97:c4:77:e5",
            "net24": "72:d7:bc:ee:51:f8",
            "net25": "a6:63:81:b9:05:a7",
            "net26": "ea:7f:ff:25:e6:6d",
            "net27": "26:23:e1:c4:64:2d",
            "net3": "a2:37:0a:49:2a:39",
            "net4": "12:1a:19:ea:58:b5",
            "net5": "26:89:8d:71:ff:2e",
            "net6": "ca:74:52:93:24:53",
            "net7": "22:ad:d1:10:5c:15",
            "net8": "72:ef:02:09:e9:42",
            "net9": "76:ca:64:5f:c2:1c"
        },
        "spine_2_1_2": {
            "net0": "9e:2a:d7:7f:99:34",
            "net1": "72:f9:9c:17:cd:ae",
            "net10": "4a:fe:ba:df:fa:21",
            "net11": "ba:a8:6c:6b:4f:33",
            "net12": "8e:dd:98:ac:59:3d",
            "net13": "56:4f:ed:45:30:09",
            "net14": "a6:c4:a5:74:ee:7c",
            "net15": "8e:da:c8:0e:2b:8d",
            "net16": "da:9d:08:67:a7:07",
            "net17": "6a:c5:61:1e:ea:46",
            "net18": "9a:31:0f:bf:8e:65",
            "net19": "6a:8e:6a:d4:2a:e6",
            "net2": "aa:6b:1d:57:68:a5",
            "net20": "72:65:6d:88:22:ac",
            "net21": "2e:ba:cf:26:11:80",
            "net22": "d6:54:0f:97:03:6a",
            "net23": "36:5f:d6:4f:0e:e2",
            "net24": "46:f5:60:da:48:72",
            "net25": "52:4a:b3:70:a8:cc",
            "net26": "d6:fe:a9:0a:2b:6e",
            "net27": "5e:bd:0a:be:16:5d",
            "net3": "0a:75:ac:4a:5b:86",
            "net4": "6e:0c:8f:25:8b:4a",
            "net5": "22:27:90:a4:ed:4e",
            "net6": "82:be:77:aa:74:69",
            "net7": "72:90:e3:ee:eb:7a",
            "net8": "52:1c:14:63:e3:c6",
            "net9": "e6:98:a0:59:e3:f2"
        },
        "spine_2_1_3": {
            "net0": "ba:00:f3:85:aa:28",
            "net1": "32:72:6f:be:bf:35",
            "net10": "32:7b:3b:5f:99:93",
            "net11": "42:4e:bf:f4:06:a1",
            "net12": "0a:88:cd:c2:a4:ee",
            "net13": "42:a4:03:15:b9:a5",
            "net14": "9e:f8:5c:1c:6a:91",
            "net15": "22:b4:57:b3:82:eb",
            "net16": "62:7e:89:18:7e:aa",
            "net17": "fe:9e:b3:56:d9:0d",
            "net18": "da:cc:1d:5c:8e:13",
            "net19": "32:a9:dd:b5:9e:83",
            "net2": "1e:8c:e1:67:ca:10",
            "net20": "56:f2:e3:d4:ab:8a",
            "net21": "5a:7c:48:a2:79:fa",
            "net22": "22:95:54:7e:d6:61",
            "net23": "6e:17:56:83:23:53",
            "net24": "aa:13:a0:cd:22:77",
            "net25": "7e:c5:7b:66:04:b9",
            "net26": "e2:cc:b4:61:7f:cc",
            "net27": "0a:80:1a:35:2e:c7",
            "net3": "fa:67:57:cc:f6:fc",
            "net4": "fe:cf:94:3a:e9:8c",
            "net5": "56:e3:d4:14:1a:02",
            "net6": "56:8d:a0:bb:45:6f",
            "net7": "ba:7c:3d:cb:40:02",
            "net8": "de:84:44:64:a5:94",
            "net9": "fe:88:f7:d3:f8:b8"
        },
        "spine_2_1_4": {
            "net0": "fa:6f:fb:cf:82:e9",
            "net1": "9a:bf:9f:6f:4d:dc",
            "net10": "3a:a4:fa:8f:0b:50",
            "net11": "82:99:40:3c:d5:f2",
            "net12": "ea:50:a2:7d:d9:8e",
            "net13": "de:67:6c:18:a4:90",
            "net14": "06:3c:b0:f8:f2:87",
            "net15": "2a:cb:e0:5a:95:a9",
            "net16": "de:8a:19:cc:c3:26",
            "net17": "7a:34:a2:53:3f:33",
            "net18": "2a:c7:35:0c:78:d5",
            "net19": "16:7b:43:a5:2e:89",
            "net2": "1e:7a:eb:54:ba:d1",
            "net20": "b2:71:86:ea:08:33",
            "net21": "a6:a2:0f:ea:42:81",
            "net22": "ba:3e:65:50:c7:91",
            "net23": "8e:fd:b2:1f:8e:85",
            "net24": "1e:62:f1:35:d1:ca",
            "net25": "0e:89:28:b6:dc:ca",
            "net26": "56:89:fd:f2:3d:fb",
            "net27": "aa:03:97:aa:0f:ea",
            "net3": "ea:5e:2a:0f:e3:de",
            "net4": "4e:1b:a0:71:49:ec",
            "net5": "6e:c6:b3:74:65:34",
            "net6": "26:91:dd:f8:23:f5",
            "net7": "2a:94:e9:1d:21:ed",
            "net8": "a6:15:ee:ee:79:2b",
            "net9": "8e:d1:91:16:7d:d7"
        },
        "spine_2_1_5": {
            "net0": "92:22:36:c7:c8:8f",
            "net1": "9e:cd:65:8a:f0:9d",
            "net10": "62:fb:1c:27:e3:dd",
            "net11": "da:fe:e2:6b:db:d6",
            "net12": "ae:39:f9:c8:b9:bd",
            "net13": "9e:d4:33:3c:90:fc",
            "net14": "7a:14:32:2e:5e:78",
            "net15": "66:1d:0d:2e:5f:dd",
            "net16": "02:08:6d:d3:8a:49",
            "net17": "ea:d8:aa:6a:49:d4",
            "net18": "52:f5:11:3d:97:9e",
            "net19": "46:fe:45:8b:1e:31",
            "net2": "b6:6e:45:9f:eb:1c",
            "net20": "ae:5f:90:85:94:b5",
            "net21": "62:24:4b:cd:37:67",
            "net22": "fa:4a:81:5a:49:ae",
            "net23": "6e:a7:56:40:05:c4",
            "net24": "72:15:e3:28:53:43",
            "net25": "c2:ea:8c:62:07:44",
            "net26": "b2:37:4c:1f:bd:02",
            "net27": "b6:5f:15:29:f4:1f",
            "net3": "ce:8b:79:2a:6b:59",
            "net4": "b2:c0:0e:ff:3c:bb",
            "net5": "32:b3:c2:e5:3f:cc",
            "net6": "3a:2d:88:41:7f:5f",
            "net7": "1a:03:1e:ca:13:7d",
            "net8": "22:77:8a:d8:e7:85",
            "net9": "be:4a:77:d0:e8:78"
        },
        "spine_2_1_6": {
            "net0": "42:b3:02:b3:17:dd",
            "net1": "22:40:8a:46:25:bd",
            "net10": "ba:01:65:68:5f:04",
            "net11": "52:bb:91:7f:6c:2f",
            "net12": "02:a1:61:9f:d9:b4",
            "net13": "f2:c1:39:9a:6d:79",
            "net14": "32:20:06:5f:52:84",
            "net15": "ea:6d:f8:8c:13:9d",
            "net16": "7a:e9:54:b2:28:6c",
            "net17": "ee:5a:fd:69:9f:b8",
            "net18": "ce:9a:23:89:02:2f",
            "net19": "8a:61:6e:80:38:79",
            "net2": "16:1e:f8:23:0f:5d",
            "net20": "5a:70:f1:51:5e:47",
            "net21": "1e:92:05:c5:e2:b2",
            "net22": "36:7a:90:53:a4:f3",
            "net23": "16:e8:b9:6b:a0:23",
            "net24": "ae:25:04:6b:ba:08",
            "net25": "6e:1a:1c:6a:ff:61",
            "net26": "ea:26:4a:6c:6b:c6",
            "net27": "02:c0:fe:f6:47:9d",
            "net3": "f2:a3:26:ad:10:af",
            "net4": "e6:d8:d7:1d:20:bc",
            "net5": "ba:be:2d:b6:16:bc",
            "net6": "5a:09:58:0a:68:cb",
            "net7": "aa:9f:54:5c:9b:63",
            "net8": "fa:62:b3:43:1e:5e",
            "net9": "2e:a1:a9:fd:19:6a"
        },
        "spine_2_1_7": {
            "net0": "3e:f9:47:5c:72:8a",
            "net1": "ca:99:79:b7:b1:32",
            "net10": "d2:fc:65:d1:82:10",
            "net11": "92:ce:38:f5:a5:83",
            "net12": "86:c7:c1:90:ad:95",
            "net13": "f2:97:b3:b9:12:7c",
            "net14": "16:d2:32:2b:49:c7",
            "net15": "4a:e6:04:86:99:77",
            "net16": "4e:dc:0d:3e:6f:09",
            "net17": "c6:b7:ca:40:b5:bd",
            "net18": "aa:bb:c9:7d:7f:f9",
            "net19": "8a:cf:ff:df:82:0d",
            "net2": "a6:1d:c7:da:85:8e",
            "net20": "f2:c7:11:ac:47:f0",
            "net21": "56:c3:ed:a8:04:b5",
            "net22": "16:2b:d8:f4:bb:1b",
            "net23": "a6:1c:80:d9:2f:81",
            "net24": "2a:25:bb:9b:fd:80",
            "net25": "fa:b4:a7:a4:40:ee",
            "net26": "b2:cd:ba:db:73:15",
            "net27": "72:82:26:8b:e8:8f",
            "net3": "5a:39:78:0e:e5:c2",
            "net4": "be:4f:e5:ec:0e:ac",
            "net5": "1a:7f:ba:7c:0f:01",
            "net6": "a6:c3:6d:eb:b2:62",
            "net7": "9a:9d:d2:05:a6:1e",
            "net8": "3e:78:c0:9d:ef:fa",
            "net9": "d2:08:6f:58:4f:9f"
        },
        "spine_2_1_8": {
            "net0": "3e:36:84:d6:95:78",
            "net1": "66:b6:1a:50:93:1a",
            "net10": "ae:74:59:45:23:ad",
            "net11": "96:c4:8d:90:60:c9",
            "net12": "0e:bf:95:3e:7d:89",
            "net13": "f6:18:86:2c:3d:20",
            "net14": "ae:a2:46:65:b5:bf",
            "net15": "4e:bc:c4:cb:39:45",
            "net16": "c2:4e:8d:3e:02:d1",
            "net17": "3a:f0:dd:1e:b6:2e",
            "net18": "d6:8d:e5:83:87:dd",
            "net19": "f6:63:81:22:b0:4e",
            "net2": "76:4e:a4:c0:4a:d8",
            "net20": "16:64:3d:fb:c1:7b",
            "net21": "4a:e8:d7:d5:bc:67",
            "net22": "d2:09:4b:c9:c3:0d",
            "net23": "ea:82:55:c3:16:4a",
            "net24": "0e:2d:94:31:41:d1",
            "net25": "da:73:f6:e2:b7:ec",
            "net26": "9e:f1:74:5d:02:c4",
            "net27": "0e:b7:d3:75:f8:ed",
            "net3": "76:04:3c:43:39:21",
            "net4": "6a:93:7f:c2:4c:f3",
            "net5": "82:d1:b2:78:d4:21",
            "net6": "16:67:02:08:9e:9f",
            "net7": "52:92:23:e4:9f:ae",
            "net8": "7a:ff:7f:79:58:9c",
            "net9": "b6:1a:d3:cf:88:1f"
        },
        "spine_2_1_9": {
            "net0": "46:b5:c7:75:e9:3c",
            "net1": "be:fe:8f:67:c1:d7",
            "net10": "26:df:de:54:f8:6a",
            "net11": "b6:39:b8:a5:0a:bc",
            "net12": "46:57:b6:16:a4:7e",
            "net13": "be:81:23:73:67:8c",
            "net14": "ee:5e:d4:ea:87:72",
            "net15": "e2:46:62:fe:4c:b1",
            "net16": "aa:39:f9:3c:e8:d2",
            "net17": "a6:8b:04:24:1f:b0",
            "net18": "32:af:df:d6:28:c6",
            "net19": "4a:f5:03:fa:3e:0f",
            "net2": "7a:91:4f:95:d7:e4",
            "net20": "5e:df:3b:67:95:41",
            "net21": "3a:a3:0a:8d:af:fb",
            "net22": "ba:a6:19:a1:69:e8",
            "net23": "e6:2c:2c:47:10:54",
            "net24": "4a:28:d7:83:33:d6",
            "net25": "9e:62:ab:eb:cb:20",
            "net26": "ca:7a:e4:d6:75:6c",
            "net27": "aa:7c:c7:cc:f9:d5",
            "net3": "ce:52:b1:9f:d5:bc",
            "net4": "56:4f:ee:4b:e9:f2",
            "net5": "7e:95:4d:8e:5f:3b",
            "net6": "62:ea:7e:90:2e:93",
            "net7": "0a:51:44:32:eb:fc",
            "net8": "56:17:0f:c2:4c:74",
            "net9": "3a:9b:bd:59:11:e2"
        },
        "tof_1_2_1": {
            "net0": "a2:e4:89:a4:2a:0a",
            "net1": "06:fc:c5:dc:fa:7e",
            "net10": "c6:88:17:66:a5:72",
            "net11": "a2:74:26:9f:61:29",
            "net12": "de:ed:be:3c:c4:4c",
            "net13": "ae:a8:16:8f:63:00",
            "net14": "86:3c:40:2b:55:96",
            "net15": "ae:3b:74:2d:ab:30",
            "net16": "1e:23:8e:07:96:4b",
            "net17": "b2:9d:0b:eb:6a:62",
            "net18": "66:06:9e:43:c5:1c",
            "net19": "72:fc:71:79:9a:74",
            "net2": "92:c1:f1:fd:82:75",
            "net20": "f2:c6:da:3a:1d:b3",
            "net21": "b2:a6:16:20:62:2b",
            "net22": "56:71:e6:49:21:ec",
            "net23": "8a:26:a9:30:ab:74",
            "net24": "4e:7b:0d:b7:98:bd",
            "net25": "9e:6e:af:93:1b:49",
            "net26": "8a:7e:aa:97:c4:41",
            "net27": "f2:48:e9:f9:65:e5",
            "net3": "d2:c3:84:15:56:e7",
            "net4": "0a:04:ad:c6:37:dc",
            "net5": "1e:ea:d9:0b:fb:1a",
            "net6": "ea:35:8e:49:25:1e",
            "net7": "32:d9:c0:b7:92:a0",
            "net8": "f6:66:53:7e:05:39",
            "net9": "d6:a4:23:73:3e:41"
        },
        "tof_1_2_10": {
            "net0": "a2:35:eb:af:f7:09",
            "net1": "fa:11:10:ea:8f:a0",
            "net10": "52:ea:50:35:b3:b2",
            "net11": "2a:41:30:9c:8b:04",
            "net12": "12:99:80:b0:3c:1a",
            "net13": "16:f8:43:1b:cb:4e",
            "net14": "16:b6:76:69:1c:ac",
            "net15": "82:58:42:30:d0:60",
            "net16": "76:a5:7e:ba:aa:e4",
            "net17": "76:69:51:c4:6b:86",
            "net18": "86:d7:6e:d6:cf:49",
            "net19": "0e:85:46:5a:d1:00",
            "net2": "c2:d8:ee:c2:5c:d1",
            "net20": "3e:49:81:fc:7d:fb",
            "net21": "ea:48:96:23:dc:1e",
            "net22": "da:4d:f3:47:f0:06",
            "net23": "22:ef:74:09:5c:8a",
            "net24": "0a:51:0b:1b:de:84",
            "net25": "ca:08:59:0f:1c:8d",
            "net26": "c2:83:ac:70:9d:cf",
            "net27": "c6:ae:59:0e:5a:07",
            "net3": "aa:b5:06:05:ea:57",
            "net4": "ae:21:d7:29:8f:a3",
            "net5": "b6:06:f5:1f:fe:c5",
            "net6": "12:40:9e:9b:ce:44",
            "net7": "8e:bb:5f:99:ed:80",
            "net8": "e2:dc:f5:2e:2a:31",
            "net9": "46:78:ee:18:ad:c4"
        },
        "tof_1_2_11": {
            "net0": "ce:c0:c5:bd:e8:7f",
            "net1": "36:8d:c6:56:13:fd",
            "net10": "16:9e:85:a0:31:c6",
            "net11": "b2:61:1e:34:fb:cf",
            "net12": "9a:13:31:ff:dd:40",
            "net13": "b6:c2:ab:bd:0c:a1",
            "net14": "56:89:a2:f6:ca:32",
            "net15": "5e:39:a5:98:8b:27",
            "net16": "a6:cb:31:5a:f0:84",
            "net17": "52:a1:b6:51:f6:c9",
            "net18": "de:3d:97:9f:50:6e",
            "net19": "16:01:7c:dd:3f:19",
            "net2": "06:46:68:9c:8a:4d",
            "net20": "86:63:e8:e6:06:d1",
            "net21": "b6:2a:96:31:e6:f5",
            "net22": "da:bb:30:da:06:6c",
            "net23": "2a:47:41:46:fa:64",
            "net24": "72:9a:7a:51:22:35",
            "net25": "ba:39:c5:42:92:7d",
            "net26": "52:dc:70:8c:87:b9",
            "net27": "6a:05:7f:e7:26:e7",
            "net3": "d2:3f:fa:15:c7:39",
            "net4": "3e:f1:8e:11:3d:5a",
            "net5": "d2:bd:68:46:a0:87",
            "net6": "66:d8:96:7b:28:ae",
            "net7": "c6:3f:1d:a1:a2:bc",
            "net8": "9e:73:67:60:69:de",
            "net9": "12:c0:e3:dd:b0:6d"
        },
        "tof_1_2_12": {
            "net0": "b6:82:68:3c:c7:ba",
            "net1": "16:32:c2:4b:0e:63",
            "net10": "ce:ba:a0:ea:91:64",
            "net11": "5e:7c:a5:a7:61:b9",
            "net12": "52:44:f3:12:6b:e4",
            "net13": "d2:ec:4d:07:25:35",
            "net14": "22:30:cd:1c:d1:3a",
            "net15": "e6:96:ec:8b:68:d8",
            "net16": "42:20:c3:5b:9a:a7",
            "net17": "7a:87:ca:41:c7:18",
            "net18": "de:8a:de:3d:a4:18",
            "net19": "0e:28:ce:f5:01:6f",
            "net2": "56:fa:bf:a6:77:a8",
            "net20": "8a:ee:d2:5b:4a:60",
            "net21": "3e:85:38:ff:0f:8a",
            "net22": "2e:0c:9e:31:f5:da",
            "net23": "fa:2b:ad:79:62:d5",
            "net24": "5a:ae:83:99:b2:be",
            "net25": "ee:71:01:97:87:94",
            "net26": "a6:51:f0:16:a5:90",
            "net27": "42:d1:e9:b9:f3:9a",
            "net3": "66:60:68:ca:a3:2e",
            "net4": "4a:bf:5d:aa:3c:ea",
            "net5": "66:d4:91:1d:3f:af",
            "net6": "52:24:41:04:a3:aa",
            "net7": "02:c8:8d:04:ca:df",
            "net8": "56:f3:a8:5f:93:a6",
            "net9": "9e:89:c8:1e:ba:e4"
        },
        "tof_1_2_13": {
            "net0": "36:59:62:c2:88:4b",
            "net1": "02:76:84:1e:67:fb",
            "net10": "aa:0e:45:0e:3e:a5",
            "net11": "3e:b9:ca:91:d4:5b",
            "net12": "be:a9:e2:b0:ee:7c",
            "net13": "1a:74:8b:69:15:cc",
            "net14": "9e:01:04:ad:56:ed",
            "net15": "f2:8f:2f:6d:c0:89",
            "net16": "66:b1:2d:b6:e1:e2",
            "net17": "de:56:e7:aa:14:cb",
            "net18": "9e:47:a5:9c:d3:8b",
            "net19": "a6:34:96:db:94:8d",
            "net2": "96:eb:d7:7f:3d:68",
            "net20": "b6:4b:ba:ea:73:63",
            "net21": "52:e8:43:94:56:ea",
            "net22": "52:9f:30:6c:16:3f",
            "net23": "c2:93:22:3b:16:e3",
            "net24": "66:f5:05:8f:51:61",
            "net25": "6a:77:6b:ce:42:97",
            "net26": "66:b0:ce:f4:25:d8",
            "net27": "32:cf:04:0b:95:bf",
            "net3": "1a:ac:51:56:32:7b",
            "net4": "e6:aa:af:4c:b1:ae",
            "net5": "a6:77:78:a2:4d:1a",
            "net6": "12:e4:7c:1c:1c:88",
            "net7": "ce:26:fc:f3:2a:2e",
            "net8": "26:cd:91:93:af:41",
            "net9": "4e:4e:8a:bc:8f:a9"
        },
        "tof_1_2_14": {
            "net0": "42:83:cd:89:73:49",
            "net1": "de:db:5c:02:54:30",
            "net10": "a6:2e:7a:47:d8:b8",
            "net11": "26:d9:6d:31:f4:08",
            "net12": "0e:1c:1d:f5:a7:43",
            "net13": "86:7d:9a:ca:39:82",
            "net14": "46:10:cd:ec:c6:e1",
            "net15": "82:d7:8e:2c:6c:64",
            "net16": "6e:32:cd:c8:6c:12",
            "net17": "86:cb:35:9c:bd:91",
            "net18": "c2:dc:b9:e3:74:91",
            "net19": "9e:c8:62:74:64:a0",
            "net2": "a2:55:e9:d5:e7:22",
            "net20": "32:53:cc:c1:94:50",
            "net21": "76:56:5f:55:9d:b2",
            "net22": "62:5f:91:c9:08:ce",
            "net23": "1a:b6:03:17:79:3f",
            "net24": "8e:76:be:79:2e:62",
            "net25": "d2:0e:bd:a8:09:9e",
            "net26": "b6:f1:b2:7f:31:d4",
            "net27": "56:b1:d1:7e:63:3b",
            "net3": "de:a6:e9:94:8f:06",
            "net4": "b6:f2:e6:6b:81:93",
            "net5": "de:66:7f:65:1f:6a",
            "net6": "42:e0:a0:31:6c:1e",
            "net7": "2e:d2:59:9d:dc:d4",
            "net8": "a6:ef:bc:b4:a2:3a",
            "net9": "26:1e:0f:b2:2e:c8"
        },
        "tof_1_2_2": {
            "net0": "02:80:10:62:aa:bf",
            "net1": "ce:50:f7:87:6a:ed",
            "net10": "96:4d:78:fb:a0:08",
            "net11": "1a:d1:e0:97:31:20",
            "net12": "82:a7:e5:d9:e8:b7",
            "net13": "fa:53:1b:90:14:b8",
            "net14": "46:a1:7a:d4:93:4e",
            "net15": "4e:6f:c6:6d:2d:ad",
            "net16": "62:0c:cc:3b:4f:c9",
            "net17": "62:09:98:57:d8:91",
            "net18": "7a:d7:be:3f:aa:09",
            "net19": "62:c1:8f:bd:32:f6",
            "net2": "a2:0d:b6:76:ff:2d",
            "net20": "be:39:de:11:44:da",
            "net21": "c6:c7:51:01:ce:62",
            "net22": "1a:c5:0f:9d:79:65",
            "net23": "ba:e0:60:bc:4a:9e",
            "net24": "5e:ca:03:fc:d5:f6",
            "net25": "3e:2d:8b:d9:63:1f",
            "net26": "56:c1:e0:e7:27:df",
            "net27": "86:6b:f4:d4:7c:16",
            "net3": "02:e5:de:98:4b:47",
            "net4": "66:8c:bb:35:20:ab",
            "net5": "32:1b:18:4c:ae:4b",
            "net6": "4e:47:fa:57:fd:6f",
            "net7": "0e:6e:66:10:22:a2",
            "net8": "da:d6:3f:ae:20:61",
            "net9": "1e:6c:01:ff:0e:d2"
        },
        "tof_1_2_3": {
            "net0": "b2:53:24:61:dc:21",
            "net1": "32:e7:29:8c:87:3f",
            "net10": "4e:7a:36:d7:ba:d9",
            "net11": "96:e5:4d:f0:07:13",
            "net12": "a2:cf:38:29:e8:bc",
            "net13": "7a:41:f6:53:df:24",
            "net14": "66:b6:ad:d5:2b:78",
            "net15": "22:6a:35:ed:4e:35",
            "net16": "52:f8:53:2e:0d:46",
            "net17": "e6:f9:64:bc:ff:50",
            "net18": "1a:e3:14:06:ed:3c",
            "net19": "da:af:43:f3:05:55",
            "net2": "d2:41:06:47:73:d8",
            "net20": "26:46:b5:5f:52:4b",
            "net21": "92:4d:dd:73:08:0c",
            "net22": "5e:91:44:c9:fb:79",
            "net23": "86:56:e0:f3:6c:f3",
            "net24": "52:b6:45:cd:25:81",
            "net25": "f2:ea:f7:63:89:83",
            "net26": "a2:b9:d3:0a:37:e1",
            "net27": "66:65:d1:dc:99:cb",
            "net3": "2e:1a:2e:fd:50:d2",
            "net4": "d6:ab:63:0f:f4:4b",
            "net5": "72:11:ea:a0:a1:de",
            "net6": "62:07:89:5a:8f:e3",
            "net7": "fe:19:dd:31:6a:54",
            "net8": "1a:df:b7:b6:0f:1f",
            "net9": "be:55:d8:cb:2f:18"
        },
        "tof_1_2_4": {
            "net0": "9a:a0:64:a3:17:c2",
            "net1": "3a:aa:c1:e4:90:61",
            "net10": "ae:b3:41:a5:a0:bf",
            "net11": "fe:74:93:b7:b3:f4",
            "net12": "4e:39:37:24:7a:70",
            "net13": "ca:30:88:4c:1d:45",
            "net14": "1e:66:f8:14:86:20",
            "net15": "de:33:d2:42:73:34",
            "net16": "e2:a6:c2:08:c9:71",
            "net17": "d2:e2:29:2b:5d:db",
            "net18": "16:53:68:70:55:c8",
            "net19": "d2:a1:3a:17:39:46",
            "net2": "fa:3e:07:1c:0e:f6",
            "net20": "96:2e:e6:1e:5e:2c",
            "net21": "f2:d8:47:69:19:5f",
            "net22": "72:3b:14:3b:83:b0",
            "net23": "5e:02:8a:4a:bb:f7",
            "net24": "0e:6d:88:9a:b5:42",
            "net25": "32:f3:c3:1b:e7:28",
            "net26": "de:9f:c2:65:1e:8f",
            "net27": "2e:65:78:1a:47:3e",
            "net3": "7a:a7:0b:9e:a3:6e",
            "net4": "8e:1e:54:ef:cc:52",
            "net5": "4a:58:d1:82:3a:dd",
            "net6": "3a:35:4b:73:e0:c6",
            "net7": "4a:09:f4:ae:ae:46",
            "net8": "3a:be:06:a5:43:82",
            "net9": "92:0c:18:f8:e7:a1"
        },
        "tof_1_2_5": {
            "net0": "a2:09:14:7b:3b:0d",
            "net1": "fe:7c:47:d6:12:7e",
            "net10": "06:7b:bf:c3:30:a2",
            "net11": "2e:9e:cb:3c:f0:6d",
            "net12": "86:36:90:bc:03:d0",
            "net13": "d6:dd:18:06:e6:8c",
            "net14": "e6:a1:9e:98:c6:cb",
            "net15": "5a:ce:47:d7:3f:8b",
            "net16": "fa:ee:6b:e3:9a:3d",
            "net17": "ea:c9:8c:91:33:df",
            "net18": "c6:39:ad:0f:64:32",
            "net19": "c2:e0:56:e5:21:59",
            "net2": "d2:72:e8:35:f3:84",
            "net20": "7a:dc:da:f5:d4:8a",
            "net21": "ca:81:2e:e9:ab:e2",
            "net22": "d6:64:4c:f9:70:6c",
            "net23": "6e:98:db:4d:30:2d",
            "net24": "26:e3:b6:21:97:28",
            "net25": "3a:55:c3:d8:82:e2",
            "net26": "42:0f:a4:6a:fe:59",
            "net27": "ae:42:90:d2:26:1b",
            "net3": "0a:ed:e3:e5:48:38",
            "net4": "1a:4f:f3:dc:b3:0c",
            "net5": "de:02:66:1f:7f:2f",
            "net6": "ce:9a:90:2b:4f:43",
            "net7": "76:7f:0c:9a:3e:44",
            "net8": "c2:9a:39:af:27:d8",
            "net9": "36:18:45:a6:e6:cc"
        },
        "tof_1_2_6": {
            "net0": "9e:09:d1:15:d5:f5",
            "net1": "aa:17:d5:ba:40:c1",
            "net10": "82:c2:dd:b4:57:ac",
            "net11": "ce:f6:74:ec:64:ad",
            "net12": "26:89:2f:b7:43:55",
            "net13": "a2:b4:62:e1:40:f7",
            "net14": "32:aa:aa:98:f2:b9",
            "net15": "7e:ba:a0:fe:cd:35",
            "net16": "a2:9d:96:80:3b:cb",
            "net17": "ae:42:70:9d:5d:2a",
            "net18": "2a:12:ea:85:c5:84",
            "net19": "5a:fa:b0:0f:7f:ac",
            "net2": "9e:f8:54:25:35:3c",
            "net20": "aa:ac:7f:02:29:0a",
            "net21": "8e:12:e0:42:aa:cc",
            "net22": "22:c6:0c:ea:d3:71",
            "net23": "32:e4:63:f9:f0:e9",
            "net24": "b6:73:8a:a1:a8:a4",
            "net25": "ee:c7:0c:8d:f3:a4",
            "net26": "6e:ff:dc:f7:9b:c1",
            "net27": "d6:83:d3:5b:ea:69",
            "net3": "be:40:d2:df:5b:60",
            "net4": "56:70:8c:53:5f:2b",
            "net5": "5a:d2:62:e9:21:28",
            "net6": "2a:67:21:f7:95:4c",
            "net7": "4a:06:bc:1b:5b:85",
            "net8": "52:5d:0f:e4:90:35",
            "net9": "42:60:65:e1:56:25"
        },
        "tof_1_2_7": {
            "net0": "9e:e4:12:2d:8a:0d",
            "net1": "ca:56:a4:f9:60:83",
            "net10": "22:de:8b:27:be:14",
            "net11": "e6:db:a9:98:77:bc",
            "net12": "82:5e:00:e6:12:17",
            "net13": "52:1f:19:69:1e:0b",
            "net14": "8a:05:a3:e7:91:43",
            "net15": "72:3c:77:68:b5:29",
            "net16": "46:e0:0f:c9:6c:9d",
            "net17": "0e:62:ad:a7:a0:9d",
            "net18": "66:e9:a8:48:01:52",
            "net19": "42:6a:95:2c:bb:cb",
            "net2": "82:d1:1d:19:9f:f5",
            "net20": "5e:63:57:02:af:93",
            "net21": "ce:db:0f:28:09:cd",
            "net22": "b6:ae:e4:b1:d2:64",
            "net23": "0a:91:88:73:93:f0",
            "net24": "c2:ea:e6:54:1c:ca",
            "net25": "be:bb:b0:38:33:5d",
            "net26": "56:44:92:02:f1:5d",
            "net27": "8e:fe:b9:d1:ea:3b",
            "net3": "7a:d3:9d:2e:4a:cb",
            "net4": "e2:59:73:2b:74:d1",
            "net5": "da:75:96:9a:a4:48",
            "net6": "a2:f3:9a:cb:33:3f",
            "net7": "fa:2c:1a:df:fa:c3",
            "net8": "3e:ca:e0:65:2d:a7",
            "net9": "42:4a:de:4a:76:d7"
        },
        "tof_1_2_8": {
            "net0": "32:52:0d:94:66:03",
            "net1": "42:0f:68:c2:4e:11",
            "net10": "be:bc:9a:80:7c:c0",
            "net11": "9e:ab:60:2c:d0:00",
            "net12": "be:ca:40:49:e4:92",
            "net13": "1e:2a:51:50:3e:bc",
            "net14": "1a:bf:a7:7a:6c:21",
            "net15": "f2:d9:7f:0a:b9:c8",
            "net16": "5e:ff:80:20:eb:da",
            "net17": "b2:69:3b:14:b9:51",
            "net18": "ca:37:fc:3b:bd:7d",
            "net19": "ee:ad:62:ce:49:c3",
            "net2": "aa:af:28:21:2b:df",
            "net20": "82:47:d4:74:bc:bb",
            "net21": "fe:97:eb:b6:2f:78",
            "net22": "da:5e:03:a0:fc:7c",
            "net23": "ca:23:fd:36:78:d3",
            "net24": "8a:e7:82:0d:0f:18",
            "net25": "4e:04:66:95:e8:7e",
            "net26": "02:31:83:3a:df:e7",
            "net27": "c2:f0:52:d7:8e:84",
            "net3": "ce:a2:da:09:fa:bc",
            "net4": "96:93:69:34:80:40",
            "net5": "ea:44:8c:22:7a:ff",
            "net6": "a2:28:19:e6:93:5d",
            "net7": "5e:c6:d5:e7:99:ad",
            "net8": "3a:4d:e1:45:53:0e",
            "net9": "ca:c5:01:4d:c8:f2"
        },
        "tof_1_2_9": {
            "net0": "32:54:e0:74:49:8e",
            "net1": "8e:3f:50:04:a3:05",
            "net10": "52:77:dc:0d:a7:c3",
            "net11": "62:4d:ff:08:ee:f3",
            "net12": "f2:85:0c:f5:56:2e",
            "net13": "6a:47:25:ee:40:44",
            "net14": "5e:14:f2:f6:2a:cc",
            "net15": "8a:56:97:98:37:da",
            "net16": "2e:cb:ad:b6:0c:f0",
            "net17": "4e:e6:f1:f0:81:38",
            "net18": "5a:69:2b:6f:ad:b6",
            "net19": "2e:e1:45:85:27:d9",
            "net2": "32:41:39:19:1a:ff",
            "net20": "3a:a4:3a:52:27:a7",
            "net21": "26:76:b5:ba:19:cd",
            "net22": "8e:85:3a:2b:48:30",
            "net23": "06:44:bc:dc:1f:9a",
            "net24": "92:b4:a6:ea:ae:80",
            "net25": "9a:88:b7:60:4d:85",
            "net26": "b6:39:41:75:6f:7c",
            "net27": "c2:b4:0d:e4:ce:57",
            "net3": "da:64:a7:97:15:f9",
            "net4": "e2:ee:a0:24:5b:36",
            "net5": "52:99:78:90:66:fb",
            "net6": "ee:d5:74:73:b8:8f",
            "net7": "52:36:54:f6:3c:e5",
            "net8": "46:46:f7:26:11:d0",
            "net9": "1a:67:08:35:d0:82"
        }
    },
    "failed_machine": "leaf_1_0_1",
    "failure_time": 1613185944.3464606
}