{
    "k_leaf": 6,
    "k_top": 6,
    "redundancy_factor": 6,
    "is_k8s": true,
    "machine_mac_addresses": {
        "leaf_1_0_1": {
            "net0": "ea:ed:f1:46:a4:a7",
            "net1": "ca:38:57:65:3a:f7",
            "net2": "52:ec:de:3e:bb:04",
            "net3": "3a:33:0c:0b:4c:e3",
            "net4": "3a:17:48:ba:e6:9d",
            "net5": "66:15:b0:da:87:83",
            "net6": "1e:07:37:bd:2f:39"
        },
        "leaf_1_0_2": {
            "net0": "a2:c7:1f:5e:40:fa",
            "net1": "96:d8:65:f4:4a:fb",
            "net2": "1a:59:01:ab:0c:d9",
            "net3": "82:6c:a4:ee:46:4f",
            "net4": "26:76:df:64:28:3b",
            "net5": "ca:89:d7:79:b6:38",
            "net6": "d6:a0:56:3e:ae:5d"
        },
        "leaf_1_0_3": {
            "net0": "8a:96:8c:8a:14:98",
            "net1": "9e:5e:a7:5f:90:b3",
            "net2": "a2:28:71:3d:dd:33",
            "net3": "86:cc:1d:04:bc:37",
            "net4": "e6:d5:b1:b6:64:99",
            "net5": "de:24:39:34:3a:d1",
            "net6": "da:8b:b5:44:cd:2b"
        },
        "leaf_1_0_4": {
            "net0": "9e:af:19:9d:01:7d",
            "net1": "8e:6b:b6:57:40:1d",
            "net2": "06:8d:81:db:69:44",
            "net3": "16:0b:ae:14:86:4b",
            "net4": "66:4a:2f:19:83:b5",
            "net5": "d2:6c:23:df:1f:e2",
            "net6": "e6:61:67:74:6f:4b"
        },
        "leaf_1_0_5": {
            "net0": "ca:4d:b0:75:08:f5",
            "net1": "96:a6:6f:de:65:7f",
            "net2": "66:0e:60:db:cd:8a",
            "net3": "8a:6f:ad:63:e8:86",
            "net4": "52:02:3d:3e:68:56",
            "net5": "d6:98:6a:53:68:2e",
            "net6": "32:7f:86:0a:12:6f"
        },
        "leaf_1_0_6": {
            "net0": "42:48:6c:d5:c6:25",
            "net1": "3e:21:34:e3:1a:5a",
            "net2": "1a:44:6b:60:ea:77",
            "net3": "32:7d:05:07:9c:4f",
            "net4": "92:a8:5e:59:04:6b",
            "net5": "e2:36:29:23:4c:41",
            "net6": "5e:ac:8f:40:d9:5d"
        },
        "leaf_2_0_1": {
            "net0": "46:c2:c0:2d:55:03",
            "net1": "3a:76:7c:d1:62:5a",
            "net2": "6a:4e:72:20:76:b2",
            "net3": "2e:bb:35:75:86:51",
            "net4": "5a:be:19:47:99:8e",
            "net5": "82:47:c1:c0:97:97",
            "net6": "b2:e3:99:e8:7f:1d"
        },
        "leaf_2_0_2": {
            "net0": "6a:62:21:0e:a8:e1",
            "net1": "8e:c4:c2:0c:e8:a7",
            "net2": "4a:ce:43:74:9c:1b",
            "net3": "da:38:9f:0a:92:0b",
            "net4": "ce:60:3c:0f:8a:24",
            "net5": "e6:cf:6c:33:59:fb",
            "net6": "62:79:6e:f8:da:56"
        },
        "leaf_2_0_3": {
            "net0": "96:26:75:c1:6e:3d",
            "net1": "96:b8:e3:a5:66:78",
            "net2": "82:cd:65:b8:2b:7b",
            "net3": "42:7d:50:0b:85:07",
            "net4": "7a:cc:06:3c:b1:39",
            "net5": "76:35:fb:21:5a:23",
            "net6": "c2:77:3c:62:d7:a8"
        },
        "leaf_2_0_4": {
            "net0": "fa:88:26:37:ab:8b",
            "net1": "c2:00:ce:dc:e2:62",
            "net2": "4e:81:3b:0a:f8:62",
            "net3": "6e:22:00:d2:4d:82",
            "net4": "c6:a5:2d:a7:fe:55",
            "net5": "1e:54:57:71:a6:02",
            "net6": "0e:f2:bf:15:33:57"
        },
        "leaf_2_0_5": {
            "net0": "b2:4e:11:85:96:ee",
            "net1": "42:60:8d:ae:e7:07",
            "net2": "52:2f:ef:97:fa:7c",
            "net3": "72:ff:03:61:97:17",
            "net4": "ba:56:9d:35:6f:06",
            "net5": "06:85:2d:9a:73:c0",
            "net6": "a6:5c:b9:ca:fe:13"
        },
        "leaf_2_0_6": {
            "net0": "1e:63:d0:15:3a:f3",
            "net1": "56:d1:ac:ec:9a:1f",
            "net2": "86:23:8f:d2:a2:7b",
            "net3": "26:8a:81:20:8d:b6",
            "net4": "2e:86:eb:f2:d8:8c",
            "net5": "f2:f7:e2:07:19:b2",
            "net6": "52:a0:2a:f6:bc:89"
        },
        "spine_1_1_1": {
            "net0": "8e:66:34:84:47:33",
            "net1": "32:f1:4f:b9:75:56",
            "net10": "0e:40:50:93:2b:45",
            "net11": "36:37:cb:0a:c8:ea",
            "net2": "fa:53:4e:62:ca:b5",
            "net3": "0e:fe:94:36:c7:76",
            "net4": "26:65:27:58:4f:b1",
            "net5": "f2:16:f6:ce:27:7f",
            "net6": "ae:8d:0a:30:c5:4d",
            "net7": "56:13:ec:05:65:fc",
            "net8": "d2:90:14:43:6f:61",
            "net9": "2a:52:55:22:5d:64"
        },
        "spine_1_1_2": {
            "net0": "fa:55:8b:5a:fb:76",
            "net1": "16:b0:57:be:0c:17",
            "net10": "46:36:28:68:18:e3",
            "net11": "c6:1d:5e:cd:c1:13",
            "net2": "2a:b7:2f:7f:28:df",
            "net3": "82:6c:02:4a:59:da",
            "net4": "46:c9:72:6c:8c:ba",
            "net5": "0a:ee:5c:a1:bb:1f",
            "net6": "36:67:62:91:a9:da",
            "net7": "a2:e2:55:4f:80:aa",
            "net8": "22:29:1e:81:19:4b",
            "net9": "96:ff:9d:d9:8a:96"
        },
        "spine_1_1_3": {
            "net0": "fe:43:4d:2c:8a:90",
            "net1": "86:b6:f4:1d:b5:1e",
            "net10": "c2:b8:0b:4b:ec:ef",
            "net11": "26:09:b2:46:6a:ba",
            "net2": "3e:db:fc:92:7d:3f",
            "net3": "ee:93:7c:84:ab:de",
            "net4": "f6:89:fe:4f:70:0b",
            "net5": "b2:1c:9c:2f:83:7d",
            "net6": "92:3a:25:93:dc:8b",
            "net7": "8a:f9:f6:7c:6a:8b",
            "net8": "4a:94:7a:8d:88:d2",
            "net9": "16:fe:8c:c0:cb:1e"
        },
        "spine_1_1_4": {
            "net0": "f6:25:ed:32:1b:ae",
            "net1": "a2:d5:f3:8d:c4:32",
            "net10": "4e:38:a2:58:b1:36",
            "net11": "02:2b:72:6a:ba:0c",
            "net2": "32:75:8b:6c:33:7d",
            "net3": "4a:2c:4c:53:39:3d",
            "net4": "52:13:e2:a3:36:40",
            "net5": "96:36:58:98:43:e8",
            "net6": "46:91:8f:7b:a1:85",
            "net7": "66:15:71:b1:1b:2b",
            "net8": "ba:5a:9e:52:f1:91",
            "net9": "f6:b0:6a:70:76:6d"
        },
        "spine_1_1_5": {
            "net0": "b6:f5:1f:d6:6f:10",
            "net1": "f2:73:50:54:ac:ff",
            "net10": "9e:04:15:b5:4e:6d",
            "net11": "aa:c3:eb:fa:52:9b",
            "net2": "36:e5:e6:83:c6:68",
            "net3": "8e:9c:38:78:52:ed",
            "net4": "92:58:dd:f7:b9:25",
            "net5": "12:2e:16:c6:7f:a1",
            "net6": "0a:d6:51:05:fd:a9",
            "net7": "ae:a2:74:d2:2d:9d",
            "net8": "8a:62:e6:5a:14:95",
            "net9": "06:41:2d:68:c8:d0"
        },
        "spine_1_1_6": {
            "net0": "c2:31:8e:25:ab:11",
            "net1": "92:44:77:2d:a3:5c",
            "net10": "3e:f6:e3:e9:fa:d7",
            "net11": "32:fe:68:75:09:8d",
            "net2": "82:68:c3:5d:51:c3",
            "net3": "de:57:39:96:45:fb",
            "net4": "a2:69:c5:4e:14:3e",
            "net5": "02:6d:5e:da:d4:d9",
            "net6": "66:8b:a1:c0:b2:16",
            "net7": "22:44:94:bf:05:dc",
            "net8": "32:6d:74:45:7e:1a",
            "net9": "1e:6e:f2:85:09:6b"
        },
        "spine_2_1_1": {
            "net0": "c2:ac:27:ff:76:c2",
            "net1": "72:c7:6e:49:2b:ff",
            "net10": "46:15:4d:fc:65:4f",
            "net11": "fe:26:77:b6:ce:d4",
            "net2": "2e:68:f7:cd:60:15",
            "net3": "7e:5c:9a:89:5c:31",
            "net4": "0a:1c:61:f7:01:26",
            "net5": "c6:f9:16:6a:b6:2f",
            "net6": "fa:68:08:3a:10:5a",
            "net7": "3e:b7:71:d3:08:b9",
            "net8": "ee:fe:65:ef:11:4d",
            "net9": "12:e0:92:a0:9a:bc"
        },
        "spine_2_1_2": {
            "net0": "f6:b3:5f:4d:c5:d3",
            "net1": "02:7f:fe:94:df:ce",
            "net10": "b6:ed:a2:2f:b9:29",
            "net11": "4a:93:28:8a:b2:d3",
            "net2": "4a:a1:ce:d6:e8:52",
            "net3": "66:16:56:6d:cb:0f",
            "net4": "8a:48:09:13:7c:ec",
            "net5": "c2:a5:7d:83:b6:16",
            "net6": "8a:72:d2:2a:d1:1b",
            "net7": "8e:87:45:51:63:3e",
            "net8": "c6:8f:87:2c:55:ee",
            "net9": "0a:9e:71:4e:c3:c2"
        },
        "spine_2_1_3": {
            "net0": "82:a1:35:46:83:a4",
            "net1": "26:40:ce:3b:b7:6f",
            "net10": "86:ac:63:db:3a:dd",
            "net11": "42:ee:f2:bf:4e:3f",
            "net2": "86:0a:02:8b:a4:6e",
            "net3": "8a:fc:5f:fa:d9:b1",
            "net4": "02:11:77:32:20:93",
            "net5": "5e:e2:5f:74:07:54",
            "net6": "1e:b4:5a:a9:15:00",
            "net7": "72:db:79:80:a9:84",
            "net8": "96:49:c4:20:c9:c4",
            "net9": "02:38:b0:d2:b4:49"
        },
        "spine_2_1_4": {
            "net0": "26:ac:4e:3c:11:cf",
            "net1": "46:f9:aa:18:7a:40",
            "net10": "0a:71:8d:7b:18:a3",
            "net11": "aa:f9:4b:77:75:af",
            "net2": "c2:02:a0:f7:1e:d1",
            "net3": "fa:6e:37:dc:62:9d",
            "net4": "b2:45:d5:2f:25:85",
            "net5": "6a:15:30:c4:98:74",
            "net6": "56:ac:38:92:c4:f2",
            "net7": "4a:70:81:53:5b:7c",
            "net8": "86:ec:9b:69:b4:5e",
            "net9": "4a:95:84:36:ee:34"
        },
        "spine_2_1_5": {
            "net0": "de:c9:3f:f8:ed:92",
            "net1": "b6:df:bf:de:67:49",
            "net10": "3a:72:d7:16:d0:28",
            "net11": "ce:d9:21:bb:f7:8d",
            "net2": "82:04:8e:c1:b9:5e",
            "net3": "ba:e5:c5:d7:54:85",
            "net4": "5e:4d:53:d5:0b:0d",
            "net5": "12:ce:95:a8:f0:ff",
            "net6": "f6:49:88:d9:70:db",
            "net7": "6a:b5:44:df:d4:30",
            "net8": "de:97:51:99:11:cb",
            "net9": "fe:90:66:bd:ab:ff"
        },
        "spine_2_1_6": {
            "net0": "32:36:fa:b0:0e:01",
            "net1": "5a:62:f6:3d:fa:71",
            "net10": "26:9e:ef:7d:41:ab",
            "net11": "2a:1c:df:14:20:60",
            "net2": "32:23:a6:9a:28:2e",
            "net3": "c6:2a:de:ba:03:eb",
            "net4": "fe:2e:10:86:cf:13",
            "net5": "46:35:bc:20:45:09",
            "net6": "7e:a1:b6:75:65:bd",
            "net7": "ea:e9:6c:b3:85:7e",
            "net8": "fe:7f:6a:da:87:ce",
            "net9": "aa:49:b9:a6:21:21"
        },
        "tof_1_2_1": {
            "net0": "a6:45:03:37:cc:e5",
            "net1": "36:29:b4:99:6a:f8",
            "net10": "22:57:83:31:2f:63",
            "net11": "3a:b3:e6:7d:ce:84",
            "net2": "b2:5e:a1:8d:8a:07",
            "net3": "2a:71:47:42:bd:b8",
            "net4": "d2:53:95:a8:14:7f",
            "net5": "ba:d9:ae:ec:ce:13",
            "net6": "b6:67:d3:2e:b9:07",
            "net7": "6e:48:d2:90:69:06",
            "net8": "82:ad:64:7e:90:24",
            "net9": "42:ce:60:31:6c:de"
        },
        "tof_1_2_2": {
            "net0": "26:4c:03:17:86:3d",
            "net1": "1e:b0:4c:38:c1:55",
            "net10": "ee:38:8e:a5:a9:91",
            "net11": "62:2f:d0:60:37:84",
            "net2": "d6:db:ed:da:87:0d",
            "net3": "66:9c:45:5a:7c:95",
            "net4": "a2:11:84:b8:43:5c",
            "net5": "0e:f5:42:f4:32:6a",
            "net6": "36:95:7e:be:94:56",
            "net7": "86:d7:ac:83:cf:82",
            "net8": "ba:a8:ef:fa:fa:48",
            "net9": "36:1f:e7:a1:7e:0c"
        },
        "tof_1_2_3": {
            "net0": "ba:cd:b6:80:19:42",
            "net1": "9e:1a:b8:86:95:25",
            "net10": "5a:e2:ad:89:e7:7e",
            "net11": "02:97:40:5c:74:bf",
            "net2": "1e:c5:59:71:82:87",
            "net3": "02:67:7b:e1:9a:0c",
            "net4": "fe:af:ef:08:f8:78",
            "net5": "4e:85:0a:b8:76:05",
            "net6": "1a:92:0a:99:db:49",
            "net7": "26:c6:c8:ce:01:19",
            "net8": "8e:55:08:51:a4:ce",
            "net9": "32:33:d7:b4:50:b1"
        },
        "tof_1_2_4": {
            "net0": "7e:95:35:ad:dc:10",
            "net1": "9a:97:38:23:be:9b",
            "net10": "0a:26:f6:37:30:30",
            "net11": "76:cb:cf:80:df:31",
            "net2": "f2:f6:fc:66:dc:82",
            "net3": "a6:9b:bd:58:bd:6f",
            "net4": "76:9a:e3:a0:38:96",
            "net5": "4e:fb:e3:ca:a6:48",
            "net6": "2a:95:9d:85:73:5c",
            "net7": "0e:93:8c:49:1e:c9",
            "net8": "d6:4a:82:f8:ee:d5",
            "net9": "46:b6:02:fd:43:e3"
        },
        "tof_1_2_5": {
            "net0": "2a:fa:ab:bc:ed:18",
            "net1": "26:09:eb:0e:f0:cf",
            "net10": "5e:b7:4d:b4:57:9d",
            "net11": "d2:1b:b0:94:75:25",
            "net2": "7a:48:d1:39:25:0c",
            "net3": "26:d2:e0:fc:68:92",
            "net4": "9a:5f:21:f0:c0:74",
            "net5": "b6:22:98:12:cf:a5",
            "net6": "a6:cf:0d:dc:a7:81",
            "net7": "02:26:e4:aa:fd:69",
            "net8": "6a:ca:e2:d4:79:ae",
            "net9": "9e:b2:3a:3a:26:13"
        },
        "tof_1_2_6": {
            "net0": "1e:97:e3:1a:7f:a3",
            "net1": "0a:dc:9c:7c:9d:01",
            "net10": "42:06:2d:8b:c1:97",
            "net11": "6e:4d:4a:4e:af:29",
            "net2": "76:06:91:31:57:09",
            "net3": "5e:a4:ee:1f:fd:5e",
            "net4": "ce:60:6e:ca:36:51",
            "net5": "c2:a8:f0:04:c0:42",
            "net6": "8a:6c:f5:42:31:6f",
            "net7": "9a:53:b9:8b:d2:02",
            "net8": "32:0c:6e:89:3b:9f",
            "net9": "66:b3:da:1a:a3:10"
        }
    },
    "failed_machine": "leaf_1_0_1",
    "failure_time": {
        "leaf_1_0_1": 1622757002.4939759,
        "leaf_1_0_2": 1622757002.5061257,
        "leaf_1_0_3": 1622757002.5127575,
        "leaf_1_0_4": 1622757002.5158281,
        "leaf_1_0_5": 1622757002.4906871,
        "leaf_1_0_6": 1622757002.5021052,
        "leaf_2_0_1": 1622757002.5138824,
        "leaf_2_0_2": 1622757002.5197086,
        "leaf_2_0_3": 1622757002.5223222,
        "leaf_2_0_4": 1622757002.5336053,
        "leaf_2_0_5": 1622757002.5368178,
        "leaf_2_0_6": 1622757002.544378,
        "spine_1_1_1": 1622757002.52445,
        "spine_1_1_2": 1622757002.5324214,
        "spine_1_1_3": 1622757002.5395133,
        "spine_1_1_4": 1622757002.5493972,
        "spine_1_1_5": 1622757002.5486624,
        "spine_1_1_6": 1622757002.5566063,
        "spine_2_1_1": 1622757002.5655134,
        "spine_2_1_2": 1622757002.572811,
        "spine_2_1_3": 1622757002.5570407,
        "spine_2_1_4": 1622757002.566146,
        "spine_2_1_5": 1622757002.575085,
        "spine_2_1_6": 1622757002.5853333,
        "tof_1_2_1": 1622757002.5770693,
        "tof_1_2_2": 1622757002.5855956,
        "tof_1_2_3": 1622757002.59659,
        "tof_1_2_4": 1622757002.6017315,
        "tof_1_2_5": 1622757002.598898,
        "tof_1_2_6": 1622757002.607526
    }
}