{
    "k_leaf": 2,
    "k_top": 2,
    "redundancy_factor": 2,
    "is_k8s": true,
    "failed_machine": "leaf_1_0_1",
    "failed_interfaces": [
        "net0"
    ],
    "failure_time": {
        "leaf_1_0_1": 1636546722.025123,
        "leaf_1_0_2": 1636546721.9465513,
        "leaf_2_0_1": 1636546722.0277061,
        "leaf_2_0_2": 1636546721.9486313,
        "spine_1_1_1": 1636546721.9560761,
        "spine_1_1_2": 1636546722.0619547,
        "spine_2_1_1": 1636546722.0509593,
        "spine_2_1_2": 1636546721.9703314,
        "tof_1_2_1": 1636546721.9786596,
        "tof_1_2_2": 1636546722.0808291
    },
    "packet_count": {
        "total": [
            282,
            45030
        ],
        "leaf_2_0_2": {
            "total": [
                19,
                2670
            ],
            "net0": {
                "total": [
                    10,
                    1395
                ],
                "psnp": [
                    3,
                    105
                ],
                "lsp": [
                    1,
                    120
                ],
                "csnp": [
                    6,
                    1170
                ]
            },
            "net1": {
                "total": [
                    9,
                    1275
                ],
                "psnp": [
                    3,
                    105
                ],
                "csnp": [
                    6,
                    1170
                ]
            }
        },
        "tof_1_2_2": {
            "total": [
                38,
                6265
            ],
            "net0": {
                "total": [
                    9,
                    1520
                ],
                "lsp": [
                    1,
                    120
                ],
                "csnp": [
                    7,
                    1365
                ],
                "psnp": [
                    1,
                    35
                ]
            },
            "net1": {
                "total": [
                    10,
                    1470
                ],
                "psnp": [
                    3,
                    105
                ],
                "csnp": [
                    7,
                    1365
                ]
            },
            "net2": {
                "total": [
                    9,
                    1620
                ],
                "lsp": [
                    2,
                    255
                ],
                "csnp": [
                    7,
                    1365
                ]
            },
            "net3": {
                "total": [
                    10,
                    1655
                ],
                "lsp": [
                    2,
                    255
                ],
                "csnp": [
                    7,
                    1365
                ],
                "psnp": [
                    1,
                    35
                ]
            }
        },
        "leaf_2_0_1": {
            "total": [
                18,
                2550
            ],
            "net0": {
                "total": [
                    9,
                    1275
                ],
                "psnp": [
                    3,
                    105
                ],
                "csnp": [
                    6,
                    1170
                ]
            },
            "net1": {
                "total": [
                    9,
                    1275
                ],
                "psnp": [
                    3,
                    105
                ],
                "csnp": [
                    6,
                    1170
                ]
            }
        },
        "leaf_1_0_1": {
            "total": [
                8,
                1325
            ],
            "net1": {
                "total": [
                    8,
                    1325
                ],
                "lsp": [
                    1,
                    120
                ],
                "csnp": [
                    6,
                    1170
                ],
                "psnp": [
                    1,
                    35
                ]
            }
        },
        "spine_1_1_1": {
            "total": [
                30,
                5190
            ],
            "net0": {
                "total": [
                    6,
                    1170
                ],
                "csnp": [
                    6,
                    1170
                ]
            },
            "net1": {
                "total": [
                    8,
                    1340
                ],
                "psnp": [
                    1,
                    35
                ],
                "csnp": [
                    6,
                    1170
                ],
                "lsp": [
                    1,
                    135
                ]
            },
            "net2": {
                "total": [
                    8,
                    1340
                ],
                "psnp": [
                    1,
                    35
                ],
                "csnp": [
                    6,
                    1170
                ],
                "lsp": [
                    1,
                    135
                ]
            },
            "net3": {
                "total": [
                    8,
                    1340
                ],
                "psnp": [
                    1,
                    35
                ],
                "csnp": [
                    6,
                    1170
                ],
                "lsp": [
                    1,
                    135
                ]
            }
        },
        "spine_1_1_2": {
            "total": [
                36,
                5655
            ],
            "net0": {
                "total": [
                    8,
                    1340
                ],
                "csnp": [
                    6,
                    1170
                ],
                "psnp": [
                    1,
                    35
                ],
                "lsp": [
                    1,
                    135
                ]
            },
            "net1": {
                "total": [
                    10,
                    1495
                ],
                "csnp": [
                    6,
                    1170
                ],
                "lsp": [
                    2,
                    255
                ],
                "psnp": [
                    2,
                    70
                ]
            },
            "net2": {
                "total": [
                    9,
                    1360
                ],
                "csnp": [
                    6,
                    1170
                ],
                "lsp": [
                    1,
                    120
                ],
                "psnp": [
                    2,
                    70
                ]
            },
            "net3": {
                "total": [
                    9,
                    1460
                ],
                "csnp": [
                    6,
                    1170
                ],
                "lsp": [
                    2,
                    255
                ],
                "psnp": [
                    1,
                    35
                ]
            }
        },
        "tof_1_2_1": {
            "total": [
                38,
                6365
            ],
            "net0": {
                "total": [
                    9,
                    1520
                ],
                "lsp": [
                    1,
                    120
                ],
                "csnp": [
                    7,
                    1365
                ],
                "psnp": [
                    1,
                    35
                ]
            },
            "net1": {
                "total": [
                    10,
                    1570
                ],
                "psnp": [
                    2,
                    70
                ],
                "csnp": [
                    7,
                    1365
                ],
                "lsp": [
                    1,
                    135
                ]
            },
            "net2": {
                "total": [
                    10,
                    1655
                ],
                "lsp": [
                    2,
                    255
                ],
                "csnp": [
                    7,
                    1365
                ],
                "psnp": [
                    1,
                    35
                ]
            },
            "net3": {
                "total": [
                    9,
                    1620
                ],
                "lsp": [
                    2,
                    255
                ],
                "csnp": [
                    7,
                    1365
                ]
            }
        },
        "spine_2_1_2": {
            "total": [
                35,
                5535
            ],
            "net0": {
                "total": [
                    8,
                    1425
                ],
                "csnp": [
                    6,
                    1170
                ],
                "lsp": [
                    2,
                    255
                ]
            },
            "net1": {
                "total": [
                    8,
                    1425
                ],
                "csnp": [
                    6,
                    1170
                ],
                "lsp": [
                    2,
                    255
                ]
            },
            "net2": {
                "total": [
                    9,
                    1275
                ],
                "csnp": [
                    6,
                    1170
                ],
                "psnp": [
                    3,
                    105
                ]
            },
            "net3": {
                "total": [
                    10,
                    1410
                ],
                "csnp": [
                    6,
                    1170
                ],
                "psnp": [
                    3,
                    105
                ],
                "lsp": [
                    1,
                    135
                ]
            }
        },
        "leaf_1_0_2": {
            "total": [
                20,
                3125
            ],
            "net0": {
                "total": [
                    9,
                    1520
                ],
                "lsp": [
                    1,
                    120
                ],
                "csnp": [
                    7,
                    1365
                ],
                "psnp": [
                    1,
                    35
                ]
            },
            "net1": {
                "total": [
                    11,
                    1605
                ],
                "psnp": [
                    3,
                    105
                ],
                "csnp": [
                    7,
                    1365
                ],
                "lsp": [
                    1,
                    135
                ]
            }
        },
        "spine_2_1_1": {
            "total": [
                40,
                6350
            ],
            "net0": {
                "total": [
                    9,
                    1620
                ],
                "csnp": [
                    7,
                    1365
                ],
                "lsp": [
                    2,
                    255
                ]
            },
            "net1": {
                "total": [
                    10,
                    1655
                ],
                "csnp": [
                    7,
                    1365
                ],
                "lsp": [
                    2,
                    255
                ],
                "psnp": [
                    1,
                    35
                ]
            },
            "net2": {
                "total": [
                    11,
                    1605
                ],
                "csnp": [
                    7,
                    1365
                ],
                "psnp": [
                    3,
                    105
                ],
                "lsp": [
                    1,
                    135
                ]
            },
            "net3": {
                "total": [
                    10,
                    1470
                ],
                "csnp": [
                    7,
                    1365
                ],
                "psnp": [
                    3,
                    105
                ]
            }
        }
    },
    "packets_by_collision_domain": {
        "AAAG": 2,
        "AAAI": 2,
        "AAAQ": 3,
        "AAAS": 2,
        "AAAH": 2,
        "AAAJ": 2,
        "AAAR": 2,
        "AAAT": 3,
        "AAAB": 2,
        "AAAD": 2,
        "AAAE": 3,
        "AAAA": 0,
        "AAAK": 2,
        "AAAL": 2,
        "AAAN": 3,
        "AAAO": 2
    },
    "blast_radius": {
        "by_collision_domain": {
            "AAAA": [
                0,
                0
            ],
            "AAAB": [
                0,
                2
            ],
            "AAAD": [
                1,
                2
            ],
            "AAAG": [
                1,
                2
            ],
            "AAAH": [
                1,
                2
            ],
            "AAAE": [
                1,
                3
            ],
            "AAAI": [
                1,
                2
            ],
            "AAAJ": [
                1,
                2
            ],
            "AAAQ": [
                2,
                3
            ],
            "AAAS": [
                2,
                2
            ],
            "AAAR": [
                2,
                2
            ],
            "AAAT": [
                2,
                3
            ],
            "AAAK": [
                3,
                2
            ],
            "AAAN": [
                3,
                3
            ],
            "AAAL": [
                3,
                2
            ],
            "AAAO": [
                3,
                2
            ]
        },
        "by_distance": {
            "0": 2,
            "1": 13,
            "2": 10,
            "3": 9
        }
    },
    "radius_graph": {
        "nodes": [
            {
                "id": "leaf_1_0_2",
                "label": "leaf_1_0_2"
            },
            {
                "id": "spine_1_1_1",
                "label": "spine_1_1_1"
            },
            {
                "id": "tof_1_2_1",
                "label": "tof_1_2_1"
            },
            {
                "id": "spine_2_1_1",
                "label": "spine_2_1_1"
            },
            {
                "id": "spine_2_1_2",
                "label": "spine_2_1_2"
            },
            {
                "id": "spine_1_1_2",
                "label": "spine_1_1_2"
            },
            {
                "id": "tof_1_2_2",
                "label": "tof_1_2_2"
            },
            {
                "id": "leaf_2_0_2",
                "label": "leaf_2_0_2"
            },
            {
                "id": "leaf_2_0_1",
                "label": "leaf_2_0_1"
            },
            {
                "id": "leaf_1_0_1",
                "label": "leaf_1_0_1"
            }
        ],
        "links": [
            {
                "source": "tof_1_2_1",
                "target": "spine_1_1_1",
                "value": 2,
                "label": "AAAG"
            },
            {
                "source": "tof_1_2_1",
                "target": "spine_1_1_2",
                "value": 2,
                "label": "AAAI"
            },
            {
                "source": "tof_1_2_1",
                "target": "spine_2_1_1",
                "value": 3,
                "label": "AAAQ"
            },
            {
                "source": "tof_1_2_1",
                "target": "spine_2_1_2",
                "value": 2,
                "label": "AAAS"
            },
            {
                "source": "tof_1_2_2",
                "target": "spine_1_1_1",
                "value": 2,
                "label": "AAAH"
            },
            {
                "source": "tof_1_2_2",
                "target": "spine_1_1_2",
                "value": 2,
                "label": "AAAJ"
            },
            {
                "source": "tof_1_2_2",
                "target": "spine_2_1_1",
                "value": 2,
                "label": "AAAR"
            },
            {
                "source": "tof_1_2_2",
                "target": "spine_2_1_2",
                "value": 3,
                "label": "AAAT"
            },
            {
                "source": "leaf_1_0_1",
                "target": "spine_1_1_1",
                "value": 0,
                "label": "AAAA"
            },
            {
                "source": "leaf_1_0_1",
                "target": "spine_1_1_2",
                "value": 2,
                "label": "AAAB"
            },
            {
                "source": "leaf_1_0_2",
                "target": "spine_1_1_1",
                "value": 2,
                "label": "AAAD"
            },
            {
                "source": "leaf_1_0_2",
                "target": "spine_1_1_2",
                "value": 3,
                "label": "AAAE"
            },
            {
                "source": "spine_1_1_1",
                "target": "leaf_1_0_1",
                "value": 0,
                "label": "AAAA"
            },
            {
                "source": "spine_1_1_1",
                "target": "leaf_1_0_2",
                "value": 2,
                "label": "AAAD"
            },
            {
                "source": "spine_1_1_1",
                "target": "tof_1_2_1",
                "value": 2,
                "label": "AAAG"
            },
            {
                "source": "spine_1_1_1",
                "target": "tof_1_2_2",
                "value": 2,
                "label": "AAAH"
            },
            {
                "source": "spine_1_1_2",
                "target": "leaf_1_0_1",
                "value": 2,
                "label": "AAAB"
            },
            {
                "source": "spine_1_1_2",
                "target": "leaf_1_0_2",
                "value": 3,
                "label": "AAAE"
            },
            {
                "source": "spine_1_1_2",
                "target": "tof_1_2_1",
                "value": 2,
                "label": "AAAI"
            },
            {
                "source": "spine_1_1_2",
                "target": "tof_1_2_2",
                "value": 2,
                "label": "AAAJ"
            },
            {
                "source": "leaf_2_0_1",
                "target": "spine_2_1_1",
                "value": 2,
                "label": "AAAK"
            },
            {
                "source": "leaf_2_0_1",
                "target": "spine_2_1_2",
                "value": 2,
                "label": "AAAL"
            },
            {
                "source": "leaf_2_0_2",
                "target": "spine_2_1_1",
                "value": 3,
                "label": "AAAN"
            },
            {
                "source": "leaf_2_0_2",
                "target": "spine_2_1_2",
                "value": 2,
                "label": "AAAO"
            },
            {
                "source": "spine_2_1_1",
                "target": "leaf_2_0_1",
                "value": 2,
                "label": "AAAK"
            },
            {
                "source": "spine_2_1_1",
                "target": "leaf_2_0_2",
                "value": 3,
                "label": "AAAN"
            },
            {
                "source": "spine_2_1_1",
                "target": "tof_1_2_1",
                "value": 3,
                "label": "AAAQ"
            },
            {
                "source": "spine_2_1_1",
                "target": "tof_1_2_2",
                "value": 2,
                "label": "AAAR"
            },
            {
                "source": "spine_2_1_2",
                "target": "leaf_2_0_1",
                "value": 2,
                "label": "AAAL"
            },
            {
                "source": "spine_2_1_2",
                "target": "leaf_2_0_2",
                "value": 2,
                "label": "AAAO"
            },
            {
                "source": "spine_2_1_2",
                "target": "tof_1_2_1",
                "value": 2,
                "label": "AAAS"
            },
            {
                "source": "spine_2_1_2",
                "target": "tof_1_2_2",
                "value": 3,
                "label": "AAAT"
            }
        ]
    },
    "max_number_of_rounds": 9,
    "packets_per_round": {
        "0": 0,
        "1": 1,
        "2": 3,
        "3": 7,
        "4": 7,
        "5": 4,
        "6": 3,
        "7": 2,
        "8": 6,
        "9": 1
    },
    "round_graph": {
        "nodes": [
            {
                "id": "leaf_2_0_2-8",
                "label": "leaf_2_0_2-8"
            },
            {
                "id": "spine_2_1_1-3",
                "label": "spine_2_1_1-3"
            },
            {
                "id": "tof_1_2_1-2",
                "label": "tof_1_2_1-2"
            },
            {
                "id": "leaf_1_0_1-0",
                "label": "leaf_1_0_1-0"
            },
            {
                "id": "tof_1_2_1-4",
                "label": "tof_1_2_1-4"
            },
            {
                "id": "leaf_1_0_1-8",
                "label": "leaf_1_0_1-8"
            },
            {
                "id": "leaf_1_0_2-4",
                "label": "leaf_1_0_2-4"
            },
            {
                "id": "spine_2_1_2-9",
                "label": "spine_2_1_2-9"
            },
            {
                "id": "tof_1_2_2-4",
                "label": "tof_1_2_2-4"
            },
            {
                "id": "spine_2_1_2-3",
                "label": "spine_2_1_2-3"
            },
            {
                "id": "spine_2_1_2-7",
                "label": "spine_2_1_2-7"
            },
            {
                "id": "tof_1_2_2-8",
                "label": "tof_1_2_2-8"
            },
            {
                "id": "leaf_2_0_1-4",
                "label": "leaf_2_0_1-4"
            },
            {
                "id": "leaf_2_0_1-6",
                "label": "leaf_2_0_1-6"
            },
            {
                "id": "spine_1_1_1-3",
                "label": "spine_1_1_1-3"
            },
            {
                "id": "spine_2_1_1-5",
                "label": "spine_2_1_1-5"
            },
            {
                "id": "tof_1_2_1-6",
                "label": "tof_1_2_1-6"
            },
            {
                "id": "leaf_2_0_2-4",
                "label": "leaf_2_0_2-4"
            },
            {
                "id": "spine_1_1_2-7",
                "label": "spine_1_1_2-7"
            },
            {
                "id": "leaf_2_0_1-8",
                "label": "leaf_2_0_1-8"
            },
            {
                "id": "leaf_2_0_2-6",
                "label": "leaf_2_0_2-6"
            },
            {
                "id": "leaf_1_0_2-2",
                "label": "leaf_1_0_2-2"
            },
            {
                "id": "spine_1_1_2-1",
                "label": "spine_1_1_2-1"
            },
            {
                "id": "leaf_1_0_2-8",
                "label": "leaf_1_0_2-8"
            },
            {
                "id": "tof_1_2_2-2",
                "label": "tof_1_2_2-2"
            },
            {
                "id": "spine_1_1_2-5",
                "label": "spine_1_1_2-5"
            }
        ],
        "links": [
            {
                "source": "leaf_1_0_1-0",
                "target": "spine_1_1_2-1",
                "value": 1,
                "label": [
                    {
                        "time": 1636546722.78022,
                        "type": "FS-LSP",
                        "LSP ID": "0100.0000.0001.00-00",
                        "Seq.N": 3,
                        "Orig.": "kathara-leaf-1-0-1-116c4f21",
                        "Scope": "Level 2 Circuit Flooding Scope",
                        "Priority": false
                    }
                ]
            },
            {
                "source": "spine_1_1_2-1",
                "target": "tof_1_2_1-2",
                "value": 1,
                "label": [
                    {
                        "time": 1636546723.714072,
                        "type": "LSP",
                        "LSP ID": "0100.0000.0001.00-00",
                        "Seq.N": 3,
                        "Orig.": "kathara-leaf-1-0-1-116c4f21"
                    }
                ]
            },
            {
                "source": "spine_1_1_2-1",
                "target": "tof_1_2_2-2",
                "value": 1,
                "label": [
                    {
                        "time": 1636546723.871567,
                        "type": "LSP",
                        "LSP ID": "0100.0000.0001.00-00",
                        "Seq.N": 3,
                        "Orig.": "kathara-leaf-1-0-1-116c4f21"
                    }
                ]
            },
            {
                "source": "spine_1_1_2-1",
                "target": "leaf_1_0_2-2",
                "value": 1,
                "label": [
                    {
                        "time": 1636546724.23554,
                        "type": "LSP",
                        "LSP ID": "0100.0000.0001.00-00",
                        "Seq.N": 3,
                        "Orig.": "kathara-leaf-1-0-1-116c4f21"
                    }
                ]
            },
            {
                "source": "tof_1_2_1-2",
                "target": "spine_2_1_2-3",
                "value": 1,
                "label": [
                    {
                        "time": 1636546723.623133,
                        "type": "FS-LSP",
                        "LSP ID": "0100.0000.0001.00-00",
                        "Seq.N": 3,
                        "Orig.": "kathara-leaf-1-0-1-116c4f21",
                        "Scope": "Level 2 Circuit Flooding Scope",
                        "Priority": false
                    }
                ]
            },
            {
                "source": "tof_1_2_1-2",
                "target": "spine_2_1_1-3",
                "value": 1,
                "label": [
                    {
                        "time": 1636546723.623172,
                        "type": "FS-LSP",
                        "LSP ID": "0100.0000.0001.00-00",
                        "Seq.N": 3,
                        "Orig.": "kathara-leaf-1-0-1-116c4f21",
                        "Scope": "Level 2 Circuit Flooding Scope",
                        "Priority": false
                    }
                ]
            },
            {
                "source": "tof_1_2_1-2",
                "target": "spine_1_1_1-3",
                "value": 1,
                "label": [
                    {
                        "time": 1636546723.623196,
                        "type": "FS-LSP",
                        "LSP ID": "0100.0000.0001.00-00",
                        "Seq.N": 3,
                        "Orig.": "kathara-leaf-1-0-1-116c4f21",
                        "Scope": "Level 2 Circuit Flooding Scope",
                        "Priority": false
                    }
                ]
            },
            {
                "source": "tof_1_2_2-2",
                "target": "spine_2_1_2-3",
                "value": 1,
                "label": [
                    {
                        "time": 1636546723.872243,
                        "type": "FS-LSP",
                        "LSP ID": "0100.0000.0001.00-00",
                        "Seq.N": 3,
                        "Orig.": "kathara-leaf-1-0-1-116c4f21",
                        "Scope": "Level 2 Circuit Flooding Scope",
                        "Priority": false
                    }
                ]
            },
            {
                "source": "tof_1_2_2-2",
                "target": "spine_2_1_1-3",
                "value": 1,
                "label": [
                    {
                        "time": 1636546723.872374,
                        "type": "FS-LSP",
                        "LSP ID": "0100.0000.0001.00-00",
                        "Seq.N": 3,
                        "Orig.": "kathara-leaf-1-0-1-116c4f21",
                        "Scope": "Level 2 Circuit Flooding Scope",
                        "Priority": false
                    }
                ]
            },
            {
                "source": "tof_1_2_2-2",
                "target": "spine_1_1_1-3",
                "value": 1,
                "label": [
                    {
                        "time": 1636546723.872407,
                        "type": "FS-LSP",
                        "LSP ID": "0100.0000.0001.00-00",
                        "Seq.N": 3,
                        "Orig.": "kathara-leaf-1-0-1-116c4f21",
                        "Scope": "Level 2 Circuit Flooding Scope",
                        "Priority": false
                    }
                ]
            },
            {
                "source": "leaf_1_0_2-2",
                "target": "spine_1_1_1-3",
                "value": 1,
                "label": [
                    {
                        "time": 1636546724.144271,
                        "type": "FS-LSP",
                        "LSP ID": "0100.0000.0001.00-00",
                        "Seq.N": 3,
                        "Orig.": "kathara-leaf-1-0-1-116c4f21",
                        "Scope": "Level 2 Circuit Flooding Scope",
                        "Priority": false
                    }
                ]
            },
            {
                "source": "spine_2_1_2-3",
                "target": "leaf_2_0_1-4",
                "value": 1,
                "label": [
                    {
                        "time": 1636546724.9993,
                        "type": "LSP",
                        "LSP ID": "0100.0000.0001.00-00",
                        "Seq.N": 3,
                        "Orig.": "kathara-leaf-1-0-1-116c4f21"
                    }
                ]
            },
            {
                "source": "spine_2_1_2-3",
                "target": "leaf_2_0_2-4",
                "value": 1,
                "label": [
                    {
                        "time": 1636546725.14238,
                        "type": "LSP",
                        "LSP ID": "0100.0000.0001.00-00",
                        "Seq.N": 3,
                        "Orig.": "kathara-leaf-1-0-1-116c4f21"
                    }
                ]
            },
            {
                "source": "spine_2_1_1-3",
                "target": "leaf_2_0_1-4",
                "value": 1,
                "label": [
                    {
                        "time": 1636546725.090608,
                        "type": "LSP",
                        "LSP ID": "0100.0000.0001.00-00",
                        "Seq.N": 3,
                        "Orig.": "kathara-leaf-1-0-1-116c4f21"
                    }
                ]
            },
            {
                "source": "spine_2_1_1-3",
                "target": "leaf_2_0_2-4",
                "value": 1,
                "label": [
                    {
                        "time": 1636546725.233733,
                        "type": "LSP",
                        "LSP ID": "0100.0000.0001.00-00",
                        "Seq.N": 3,
                        "Orig.": "kathara-leaf-1-0-1-116c4f21"
                    }
                ]
            },
            {
                "source": "spine_1_1_1-3",
                "target": "tof_1_2_2-4",
                "value": 1,
                "label": [
                    {
                        "time": 1636546751.791334,
                        "type": "FS-LSP",
                        "LSP ID": "0100.0000.0002.00-00",
                        "Seq.N": 3,
                        "Orig.": "kathara-spine-1-1-1-de87967a",
                        "Scope": "Level 2 Circuit Flooding Scope",
                        "Priority": false
                    }
                ]
            },
            {
                "source": "spine_1_1_1-3",
                "target": "tof_1_2_1-4",
                "value": 1,
                "label": [
                    {
                        "time": 1636546751.791361,
                        "type": "FS-LSP",
                        "LSP ID": "0100.0000.0002.00-00",
                        "Seq.N": 3,
                        "Orig.": "kathara-spine-1-1-1-de87967a",
                        "Scope": "Level 2 Circuit Flooding Scope",
                        "Priority": false
                    }
                ]
            },
            {
                "source": "spine_1_1_1-3",
                "target": "leaf_1_0_2-4",
                "value": 1,
                "label": [
                    {
                        "time": 1636546751.791375,
                        "type": "FS-LSP",
                        "LSP ID": "0100.0000.0002.00-00",
                        "Seq.N": 3,
                        "Orig.": "kathara-spine-1-1-1-de87967a",
                        "Scope": "Level 2 Circuit Flooding Scope",
                        "Priority": false
                    }
                ]
            },
            {
                "source": "leaf_2_0_2-4",
                "target": "spine_2_1_1-5",
                "value": 1,
                "label": [
                    {
                        "time": 1636546725.143333,
                        "type": "FS-LSP",
                        "LSP ID": "0100.0000.0001.00-00",
                        "Seq.N": 3,
                        "Orig.": "kathara-leaf-1-0-1-116c4f21",
                        "Scope": "Level 2 Circuit Flooding Scope",
                        "Priority": false
                    }
                ]
            },
            {
                "source": "tof_1_2_2-4",
                "target": "spine_2_1_1-5",
                "value": 1,
                "label": [
                    {
                        "time": 1636546752.394487,
                        "type": "LSP",
                        "LSP ID": "0100.0000.0002.00-00",
                        "Seq.N": 3,
                        "Orig.": "kathara-spine-1-1-1-de87967a"
                    }
                ]
            },
            {
                "source": "tof_1_2_1-4",
                "target": "spine_2_1_1-5",
                "value": 1,
                "label": [
                    {
                        "time": 1636546752.302451,
                        "type": "LSP",
                        "LSP ID": "0100.0000.0002.00-00",
                        "Seq.N": 3,
                        "Orig.": "kathara-spine-1-1-1-de87967a"
                    }
                ]
            },
            {
                "source": "leaf_1_0_2-4",
                "target": "spine_1_1_2-5",
                "value": 1,
                "label": [
                    {
                        "time": 1636546752.453398,
                        "type": "LSP",
                        "LSP ID": "0100.0000.0002.00-00",
                        "Seq.N": 3,
                        "Orig.": "kathara-spine-1-1-1-de87967a"
                    }
                ]
            },
            {
                "source": "spine_2_1_1-5",
                "target": "leaf_2_0_2-6",
                "value": 1,
                "label": [
                    {
                        "time": 1636546752.395469,
                        "type": "FS-LSP",
                        "LSP ID": "0100.0000.0002.00-00",
                        "Seq.N": 3,
                        "Orig.": "kathara-spine-1-1-1-de87967a",
                        "Scope": "Level 2 Circuit Flooding Scope",
                        "Priority": false
                    }
                ]
            },
            {
                "source": "spine_2_1_1-5",
                "target": "leaf_2_0_1-6",
                "value": 1,
                "label": [
                    {
                        "time": 1636546752.395482,
                        "type": "FS-LSP",
                        "LSP ID": "0100.0000.0002.00-00",
                        "Seq.N": 3,
                        "Orig.": "kathara-spine-1-1-1-de87967a",
                        "Scope": "Level 2 Circuit Flooding Scope",
                        "Priority": false
                    }
                ]
            },
            {
                "source": "spine_2_1_1-5",
                "target": "tof_1_2_1-6",
                "value": 1,
                "label": [
                    {
                        "time": 1636546752.395492,
                        "type": "FS-LSP",
                        "LSP ID": "0100.0000.0002.00-00",
                        "Seq.N": 3,
                        "Orig.": "kathara-spine-1-1-1-de87967a",
                        "Scope": "Level 2 Circuit Flooding Scope",
                        "Priority": false
                    }
                ]
            },
            {
                "source": "tof_1_2_1-6",
                "target": "spine_1_1_2-7",
                "value": 1,
                "label": [
                    {
                        "time": 1636546752.453088,
                        "type": "LSP",
                        "LSP ID": "0100.0000.0002.00-00",
                        "Seq.N": 3,
                        "Orig.": "kathara-spine-1-1-1-de87967a"
                    }
                ]
            },
            {
                "source": "tof_1_2_1-6",
                "target": "spine_2_1_2-7",
                "value": 1,
                "label": [
                    {
                        "time": 1636546752.467306,
                        "type": "LSP",
                        "LSP ID": "0100.0000.0002.00-00",
                        "Seq.N": 3,
                        "Orig.": "kathara-spine-1-1-1-de87967a"
                    }
                ]
            },
            {
                "source": "spine_1_1_2-7",
                "target": "tof_1_2_2-8",
                "value": 1,
                "label": [
                    {
                        "time": 1636546752.545755,
                        "type": "FS-LSP",
                        "LSP ID": "0100.0000.0002.00-00",
                        "Seq.N": 3,
                        "Orig.": "kathara-spine-1-1-1-de87967a",
                        "Scope": "Level 2 Circuit Flooding Scope",
                        "Priority": false
                    }
                ]
            },
            {
                "source": "spine_1_1_2-7",
                "target": "leaf_1_0_2-8",
                "value": 1,
                "label": [
                    {
                        "time": 1636546752.54578,
                        "type": "FS-LSP",
                        "LSP ID": "0100.0000.0002.00-00",
                        "Seq.N": 3,
                        "Orig.": "kathara-spine-1-1-1-de87967a",
                        "Scope": "Level 2 Circuit Flooding Scope",
                        "Priority": false
                    }
                ]
            },
            {
                "source": "spine_1_1_2-7",
                "target": "leaf_1_0_1-8",
                "value": 1,
                "label": [
                    {
                        "time": 1636546752.545792,
                        "type": "FS-LSP",
                        "LSP ID": "0100.0000.0002.00-00",
                        "Seq.N": 3,
                        "Orig.": "kathara-spine-1-1-1-de87967a",
                        "Scope": "Level 2 Circuit Flooding Scope",
                        "Priority": false
                    }
                ]
            },
            {
                "source": "spine_2_1_2-7",
                "target": "leaf_2_0_2-8",
                "value": 1,
                "label": [
                    {
                        "time": 1636546752.46855,
                        "type": "FS-LSP",
                        "LSP ID": "0100.0000.0002.00-00",
                        "Seq.N": 3,
                        "Orig.": "kathara-spine-1-1-1-de87967a",
                        "Scope": "Level 2 Circuit Flooding Scope",
                        "Priority": false
                    }
                ]
            },
            {
                "source": "spine_2_1_2-7",
                "target": "leaf_2_0_1-8",
                "value": 1,
                "label": [
                    {
                        "time": 1636546752.468596,
                        "type": "FS-LSP",
                        "LSP ID": "0100.0000.0002.00-00",
                        "Seq.N": 3,
                        "Orig.": "kathara-spine-1-1-1-de87967a",
                        "Scope": "Level 2 Circuit Flooding Scope",
                        "Priority": false
                    }
                ]
            },
            {
                "source": "spine_2_1_2-7",
                "target": "tof_1_2_2-8",
                "value": 1,
                "label": [
                    {
                        "time": 1636546752.468619,
                        "type": "FS-LSP",
                        "LSP ID": "0100.0000.0002.00-00",
                        "Seq.N": 3,
                        "Orig.": "kathara-spine-1-1-1-de87967a",
                        "Scope": "Level 2 Circuit Flooding Scope",
                        "Priority": false
                    }
                ]
            },
            {
                "source": "tof_1_2_2-8",
                "target": "spine_2_1_2-9",
                "value": 1,
                "label": [
                    {
                        "time": 1636546752.559787,
                        "type": "LSP",
                        "LSP ID": "0100.0000.0002.00-00",
                        "Seq.N": 3,
                        "Orig.": "kathara-spine-1-1-1-de87967a"
                    }
                ]
            }
        ]
    },
    "logical_time_plot": {
        "points": {
            "leaf_1_0_1": {
                "1": {
                    "time": 1636546722.78022,
                    "type": "FS-LSP",
                    "LSP ID": "0100.0000.0001.00-00",
                    "Seq.N": 3,
                    "Orig.": "kathara-leaf-1-0-1-116c4f21",
                    "Scope": "Level 2 Circuit Flooding Scope",
                    "Priority": false,
                    "Logical Clock": 1
                },
                "25": {
                    "time": 1636546752.546359,
                    "type": "FS-LSP",
                    "LSP ID": "0100.0000.0002.00-00",
                    "Seq.N": 3,
                    "Orig.": "kathara-spine-1-1-1-de87967a",
                    "Scope": "Level 2 Circuit Flooding Scope",
                    "Priority": false,
                    "Logical Clock": 25
                }
            },
            "spine_1_1_2": {
                "2": {
                    "time": 1636546722.780619,
                    "type": "FS-LSP",
                    "LSP ID": "0100.0000.0001.00-00",
                    "Seq.N": 3,
                    "Orig.": "kathara-leaf-1-0-1-116c4f21",
                    "Scope": "Level 2 Circuit Flooding Scope",
                    "Priority": false,
                    "Logical Clock": 2
                },
                "3": {
                    "time": 1636546723.714072,
                    "type": "LSP",
                    "LSP ID": "0100.0000.0001.00-00",
                    "Seq.N": 3,
                    "Orig.": "kathara-leaf-1-0-1-116c4f21",
                    "Logical Clock": 3
                },
                "4": {
                    "time": 1636546723.871567,
                    "type": "LSP",
                    "LSP ID": "0100.0000.0001.00-00",
                    "Seq.N": 3,
                    "Orig.": "kathara-leaf-1-0-1-116c4f21",
                    "Logical Clock": 4
                },
                "5": {
                    "time": 1636546724.23554,
                    "type": "LSP",
                    "LSP ID": "0100.0000.0001.00-00",
                    "Seq.N": 3,
                    "Orig.": "kathara-leaf-1-0-1-116c4f21",
                    "Logical Clock": 5
                },
                "16": {
                    "time": 1636546752.545725,
                    "type": "LSP",
                    "LSP ID": "0100.0000.0002.00-00",
                    "Seq.N": 3,
                    "Orig.": "kathara-spine-1-1-1-de87967a",
                    "Logical Clock": 16
                },
                "21": {
                    "time": 1636546752.545645,
                    "type": "LSP",
                    "LSP ID": "0100.0000.0002.00-00",
                    "Seq.N": 3,
                    "Orig.": "kathara-spine-1-1-1-de87967a",
                    "Logical Clock": 21
                },
                "22": {
                    "time": 1636546752.545755,
                    "type": "FS-LSP",
                    "LSP ID": "0100.0000.0002.00-00",
                    "Seq.N": 3,
                    "Orig.": "kathara-spine-1-1-1-de87967a",
                    "Scope": "Level 2 Circuit Flooding Scope",
                    "Priority": false,
                    "Logical Clock": 22
                },
                "23": {
                    "time": 1636546752.54578,
                    "type": "FS-LSP",
                    "LSP ID": "0100.0000.0002.00-00",
                    "Seq.N": 3,
                    "Orig.": "kathara-spine-1-1-1-de87967a",
                    "Scope": "Level 2 Circuit Flooding Scope",
                    "Priority": false,
                    "Logical Clock": 23
                },
                "24": {
                    "time": 1636546752.545792,
                    "type": "FS-LSP",
                    "LSP ID": "0100.0000.0002.00-00",
                    "Seq.N": 3,
                    "Orig.": "kathara-spine-1-1-1-de87967a",
                    "Scope": "Level 2 Circuit Flooding Scope",
                    "Priority": false,
                    "Logical Clock": 24
                }
            },
            "tof_1_2_1": {
                "4": {
                    "time": 1636546723.622344,
                    "type": "LSP",
                    "LSP ID": "0100.0000.0001.00-00",
                    "Seq.N": 3,
                    "Orig.": "kathara-leaf-1-0-1-116c4f21",
                    "Logical Clock": 4
                },
                "5": {
                    "time": 1636546723.623133,
                    "type": "FS-LSP",
                    "LSP ID": "0100.0000.0001.00-00",
                    "Seq.N": 3,
                    "Orig.": "kathara-leaf-1-0-1-116c4f21",
                    "Scope": "Level 2 Circuit Flooding Scope",
                    "Priority": false,
                    "Logical Clock": 5
                },
                "6": {
                    "time": 1636546723.623172,
                    "type": "FS-LSP",
                    "LSP ID": "0100.0000.0001.00-00",
                    "Seq.N": 3,
                    "Orig.": "kathara-leaf-1-0-1-116c4f21",
                    "Scope": "Level 2 Circuit Flooding Scope",
                    "Priority": false,
                    "Logical Clock": 6
                },
                "7": {
                    "time": 1636546723.623196,
                    "type": "FS-LSP",
                    "LSP ID": "0100.0000.0001.00-00",
                    "Seq.N": 3,
                    "Orig.": "kathara-leaf-1-0-1-116c4f21",
                    "Scope": "Level 2 Circuit Flooding Scope",
                    "Priority": false,
                    "Logical Clock": 7
                },
                "13": {
                    "time": 1636546751.79147,
                    "type": "FS-LSP",
                    "LSP ID": "0100.0000.0002.00-00",
                    "Seq.N": 3,
                    "Orig.": "kathara-spine-1-1-1-de87967a",
                    "Scope": "Level 2 Circuit Flooding Scope",
                    "Priority": false,
                    "Logical Clock": 13
                },
                "14": {
                    "time": 1636546752.302451,
                    "type": "LSP",
                    "LSP ID": "0100.0000.0002.00-00",
                    "Seq.N": 3,
                    "Orig.": "kathara-spine-1-1-1-de87967a",
                    "Logical Clock": 14
                },
                "19": {
                    "time": 1636546752.303662,
                    "type": "FS-LSP",
                    "LSP ID": "0100.0000.0002.00-00",
                    "Seq.N": 3,
                    "Orig.": "kathara-spine-1-1-1-de87967a",
                    "Scope": "Level 2 Circuit Flooding Scope",
                    "Priority": false,
                    "Logical Clock": 19
                },
                "20": {
                    "time": 1636546752.453088,
                    "type": "LSP",
                    "LSP ID": "0100.0000.0002.00-00",
                    "Seq.N": 3,
                    "Orig.": "kathara-spine-1-1-1-de87967a",
                    "Logical Clock": 20
                },
                "21": {
                    "time": 1636546752.467306,
                    "type": "LSP",
                    "LSP ID": "0100.0000.0002.00-00",
                    "Seq.N": 3,
                    "Orig.": "kathara-spine-1-1-1-de87967a",
                    "Logical Clock": 21
                }
            },
            "tof_1_2_2": {
                "5": {
                    "time": 1636546723.872,
                    "type": "LSP",
                    "LSP ID": "0100.0000.0001.00-00",
                    "Seq.N": 3,
                    "Orig.": "kathara-leaf-1-0-1-116c4f21",
                    "Logical Clock": 5
                },
                "6": {
                    "time": 1636546723.872243,
                    "type": "FS-LSP",
                    "LSP ID": "0100.0000.0001.00-00",
                    "Seq.N": 3,
                    "Orig.": "kathara-leaf-1-0-1-116c4f21",
                    "Scope": "Level 2 Circuit Flooding Scope",
                    "Priority": false,
                    "Logical Clock": 6
                },
                "7": {
                    "time": 1636546723.872374,
                    "type": "FS-LSP",
                    "LSP ID": "0100.0000.0001.00-00",
                    "Seq.N": 3,
                    "Orig.": "kathara-leaf-1-0-1-116c4f21",
                    "Scope": "Level 2 Circuit Flooding Scope",
                    "Priority": false,
                    "Logical Clock": 7
                },
                "8": {
                    "time": 1636546723.872407,
                    "type": "FS-LSP",
                    "LSP ID": "0100.0000.0001.00-00",
                    "Seq.N": 3,
                    "Orig.": "kathara-leaf-1-0-1-116c4f21",
                    "Scope": "Level 2 Circuit Flooding Scope",
                    "Priority": false,
                    "Logical Clock": 8
                },
                "12": {
                    "time": 1636546751.883614,
                    "type": "FS-LSP",
                    "LSP ID": "0100.0000.0002.00-00",
                    "Seq.N": 3,
                    "Orig.": "kathara-spine-1-1-1-de87967a",
                    "Scope": "Level 2 Circuit Flooding Scope",
                    "Priority": false,
                    "Logical Clock": 12
                },
                "13": {
                    "time": 1636546752.394487,
                    "type": "LSP",
                    "LSP ID": "0100.0000.0002.00-00",
                    "Seq.N": 3,
                    "Orig.": "kathara-spine-1-1-1-de87967a",
                    "Logical Clock": 13
                },
                "23": {
                    "time": 1636546752.545957,
                    "type": "FS-LSP",
                    "LSP ID": "0100.0000.0002.00-00",
                    "Seq.N": 3,
                    "Orig.": "kathara-spine-1-1-1-de87967a",
                    "Scope": "Level 2 Circuit Flooding Scope",
                    "Priority": false,
                    "Logical Clock": 23
                },
                "26": {
                    "time": 1636546752.56025,
                    "type": "FS-LSP",
                    "LSP ID": "0100.0000.0002.00-00",
                    "Seq.N": 3,
                    "Orig.": "kathara-spine-1-1-1-de87967a",
                    "Scope": "Level 2 Circuit Flooding Scope",
                    "Priority": false,
                    "Logical Clock": 26
                },
                "27": {
                    "time": 1636546752.559787,
                    "type": "LSP",
                    "LSP ID": "0100.0000.0002.00-00",
                    "Seq.N": 3,
                    "Orig.": "kathara-spine-1-1-1-de87967a",
                    "Logical Clock": 27
                }
            },
            "leaf_1_0_2": {
                "6": {
                    "time": 1636546724.1441,
                    "type": "LSP",
                    "LSP ID": "0100.0000.0001.00-00",
                    "Seq.N": 3,
                    "Orig.": "kathara-leaf-1-0-1-116c4f21",
                    "Logical Clock": 6
                },
                "7": {
                    "time": 1636546724.144271,
                    "type": "FS-LSP",
                    "LSP ID": "0100.0000.0001.00-00",
                    "Seq.N": 3,
                    "Orig.": "kathara-leaf-1-0-1-116c4f21",
                    "Scope": "Level 2 Circuit Flooding Scope",
                    "Priority": false,
                    "Logical Clock": 7
                },
                "14": {
                    "time": 1636546751.791938,
                    "type": "FS-LSP",
                    "LSP ID": "0100.0000.0002.00-00",
                    "Seq.N": 3,
                    "Orig.": "kathara-spine-1-1-1-de87967a",
                    "Scope": "Level 2 Circuit Flooding Scope",
                    "Priority": false,
                    "Logical Clock": 14
                },
                "15": {
                    "time": 1636546752.453398,
                    "type": "LSP",
                    "LSP ID": "0100.0000.0002.00-00",
                    "Seq.N": 3,
                    "Orig.": "kathara-spine-1-1-1-de87967a",
                    "Logical Clock": 15
                },
                "24": {
                    "time": 1636546752.454119,
                    "type": "FS-LSP",
                    "LSP ID": "0100.0000.0002.00-00",
                    "Seq.N": 3,
                    "Orig.": "kathara-spine-1-1-1-de87967a",
                    "Scope": "Level 2 Circuit Flooding Scope",
                    "Priority": false,
                    "Logical Clock": 24
                }
            },
            "spine_2_1_2": {
                "6": {
                    "time": 1636546723.624153,
                    "type": "FS-LSP",
                    "LSP ID": "0100.0000.0001.00-00",
                    "Seq.N": 3,
                    "Orig.": "kathara-leaf-1-0-1-116c4f21",
                    "Scope": "Level 2 Circuit Flooding Scope",
                    "Priority": false,
                    "Logical Clock": 6
                },
                "7": {
                    "time": 1636546723.781437,
                    "type": "FS-LSP",
                    "LSP ID": "0100.0000.0001.00-00",
                    "Seq.N": 3,
                    "Orig.": "kathara-leaf-1-0-1-116c4f21",
                    "Scope": "Level 2 Circuit Flooding Scope",
                    "Priority": false,
                    "Logical Clock": 7
                },
                "8": {
                    "time": 1636546724.9993,
                    "type": "LSP",
                    "LSP ID": "0100.0000.0001.00-00",
                    "Seq.N": 3,
                    "Orig.": "kathara-leaf-1-0-1-116c4f21",
                    "Logical Clock": 8
                },
                "9": {
                    "time": 1636546725.14238,
                    "type": "LSP",
                    "LSP ID": "0100.0000.0001.00-00",
                    "Seq.N": 3,
                    "Orig.": "kathara-leaf-1-0-1-116c4f21",
                    "Logical Clock": 9
                },
                "22": {
                    "time": 1636546752.468326,
                    "type": "LSP",
                    "LSP ID": "0100.0000.0002.00-00",
                    "Seq.N": 3,
                    "Orig.": "kathara-spine-1-1-1-de87967a",
                    "Logical Clock": 22
                },
                "23": {
                    "time": 1636546752.46855,
                    "type": "FS-LSP",
                    "LSP ID": "0100.0000.0002.00-00",
                    "Seq.N": 3,
                    "Orig.": "kathara-spine-1-1-1-de87967a",
                    "Scope": "Level 2 Circuit Flooding Scope",
                    "Priority": false,
                    "Logical Clock": 23
                },
                "24": {
                    "time": 1636546752.468596,
                    "type": "FS-LSP",
                    "LSP ID": "0100.0000.0002.00-00",
                    "Seq.N": 3,
                    "Orig.": "kathara-spine-1-1-1-de87967a",
                    "Scope": "Level 2 Circuit Flooding Scope",
                    "Priority": false,
                    "Logical Clock": 24
                },
                "25": {
                    "time": 1636546752.468619,
                    "type": "FS-LSP",
                    "LSP ID": "0100.0000.0002.00-00",
                    "Seq.N": 3,
                    "Orig.": "kathara-spine-1-1-1-de87967a",
                    "Scope": "Level 2 Circuit Flooding Scope",
                    "Priority": false,
                    "Logical Clock": 25
                },
                "28": {
                    "time": 1636546752.468706,
                    "type": "LSP",
                    "LSP ID": "0100.0000.0002.00-00",
                    "Seq.N": 3,
                    "Orig.": "kathara-spine-1-1-1-de87967a",
                    "Logical Clock": 28
                }
            },
            "spine_2_1_1": {
                "7": {
                    "time": 1636546723.715454,
                    "type": "FS-LSP",
                    "LSP ID": "0100.0000.0001.00-00",
                    "Seq.N": 3,
                    "Orig.": "kathara-leaf-1-0-1-116c4f21",
                    "Scope": "Level 2 Circuit Flooding Scope",
                    "Priority": false,
                    "Logical Clock": 7
                },
                "8": {
                    "time": 1636546723.872933,
                    "type": "FS-LSP",
                    "LSP ID": "0100.0000.0001.00-00",
                    "Seq.N": 3,
                    "Orig.": "kathara-leaf-1-0-1-116c4f21",
                    "Scope": "Level 2 Circuit Flooding Scope",
                    "Priority": false,
                    "Logical Clock": 8
                },
                "9": {
                    "time": 1636546725.090608,
                    "type": "LSP",
                    "LSP ID": "0100.0000.0001.00-00",
                    "Seq.N": 3,
                    "Orig.": "kathara-leaf-1-0-1-116c4f21",
                    "Logical Clock": 9
                },
                "10": {
                    "time": 1636546725.233733,
                    "type": "LSP",
                    "LSP ID": "0100.0000.0001.00-00",
                    "Seq.N": 3,
                    "Orig.": "kathara-leaf-1-0-1-116c4f21",
                    "Logical Clock": 10
                },
                "13": {
                    "time": 1636546725.235012,
                    "type": "FS-LSP",
                    "LSP ID": "0100.0000.0001.00-00",
                    "Seq.N": 3,
                    "Orig.": "kathara-leaf-1-0-1-116c4f21",
                    "Scope": "Level 2 Circuit Flooding Scope",
                    "Priority": false,
                    "Logical Clock": 13
                },
                "14": {
                    "time": 1636546752.395147,
                    "type": "LSP",
                    "LSP ID": "0100.0000.0002.00-00",
                    "Seq.N": 3,
                    "Orig.": "kathara-spine-1-1-1-de87967a",
                    "Logical Clock": 14
                },
                "15": {
                    "time": 1636546752.395792,
                    "type": "LSP",
                    "LSP ID": "0100.0000.0002.00-00",
                    "Seq.N": 3,
                    "Orig.": "kathara-spine-1-1-1-de87967a",
                    "Logical Clock": 15
                },
                "16": {
                    "time": 1636546752.395469,
                    "type": "FS-LSP",
                    "LSP ID": "0100.0000.0002.00-00",
                    "Seq.N": 3,
                    "Orig.": "kathara-spine-1-1-1-de87967a",
                    "Scope": "Level 2 Circuit Flooding Scope",
                    "Priority": false,
                    "Logical Clock": 16
                },
                "17": {
                    "time": 1636546752.395482,
                    "type": "FS-LSP",
                    "LSP ID": "0100.0000.0002.00-00",
                    "Seq.N": 3,
                    "Orig.": "kathara-spine-1-1-1-de87967a",
                    "Scope": "Level 2 Circuit Flooding Scope",
                    "Priority": false,
                    "Logical Clock": 17
                },
                "18": {
                    "time": 1636546752.395492,
                    "type": "FS-LSP",
                    "LSP ID": "0100.0000.0002.00-00",
                    "Seq.N": 3,
                    "Orig.": "kathara-spine-1-1-1-de87967a",
                    "Scope": "Level 2 Circuit Flooding Scope",
                    "Priority": false,
                    "Logical Clock": 18
                }
            },
            "spine_1_1_1": {
                "8": {
                    "time": 1636546723.623821,
                    "type": "FS-LSP",
                    "LSP ID": "0100.0000.0001.00-00",
                    "Seq.N": 3,
                    "Orig.": "kathara-leaf-1-0-1-116c4f21",
                    "Scope": "Level 2 Circuit Flooding Scope",
                    "Priority": false,
                    "Logical Clock": 8
                },
                "9": {
                    "time": 1636546723.781128,
                    "type": "FS-LSP",
                    "LSP ID": "0100.0000.0001.00-00",
                    "Seq.N": 3,
                    "Orig.": "kathara-leaf-1-0-1-116c4f21",
                    "Scope": "Level 2 Circuit Flooding Scope",
                    "Priority": false,
                    "Logical Clock": 9
                },
                "10": {
                    "time": 1636546724.144759,
                    "type": "FS-LSP",
                    "LSP ID": "0100.0000.0001.00-00",
                    "Seq.N": 3,
                    "Orig.": "kathara-leaf-1-0-1-116c4f21",
                    "Scope": "Level 2 Circuit Flooding Scope",
                    "Priority": false,
                    "Logical Clock": 10
                },
                "11": {
                    "time": 1636546751.791334,
                    "type": "FS-LSP",
                    "LSP ID": "0100.0000.0002.00-00",
                    "Seq.N": 3,
                    "Orig.": "kathara-spine-1-1-1-de87967a",
                    "Scope": "Level 2 Circuit Flooding Scope",
                    "Priority": false,
                    "Logical Clock": 11
                },
                "12": {
                    "time": 1636546751.791361,
                    "type": "FS-LSP",
                    "LSP ID": "0100.0000.0002.00-00",
                    "Seq.N": 3,
                    "Orig.": "kathara-spine-1-1-1-de87967a",
                    "Scope": "Level 2 Circuit Flooding Scope",
                    "Priority": false,
                    "Logical Clock": 12
                },
                "13": {
                    "time": 1636546751.791375,
                    "type": "FS-LSP",
                    "LSP ID": "0100.0000.0002.00-00",
                    "Seq.N": 3,
                    "Orig.": "kathara-spine-1-1-1-de87967a",
                    "Scope": "Level 2 Circuit Flooding Scope",
                    "Priority": false,
                    "Logical Clock": 13
                }
            },
            "leaf_2_0_1": {
                "9": {
                    "time": 1636546725.091072,
                    "type": "LSP",
                    "LSP ID": "0100.0000.0001.00-00",
                    "Seq.N": 3,
                    "Orig.": "kathara-leaf-1-0-1-116c4f21",
                    "Logical Clock": 9
                },
                "10": {
                    "time": 1636546725.091067,
                    "type": "LSP",
                    "LSP ID": "0100.0000.0001.00-00",
                    "Seq.N": 3,
                    "Orig.": "kathara-leaf-1-0-1-116c4f21",
                    "Logical Clock": 10
                },
                "18": {
                    "time": 1636546752.396112,
                    "type": "FS-LSP",
                    "LSP ID": "0100.0000.0002.00-00",
                    "Seq.N": 3,
                    "Orig.": "kathara-spine-1-1-1-de87967a",
                    "Scope": "Level 2 Circuit Flooding Scope",
                    "Priority": false,
                    "Logical Clock": 18
                },
                "25": {
                    "time": 1636546752.560488,
                    "type": "FS-LSP",
                    "LSP ID": "0100.0000.0002.00-00",
                    "Seq.N": 3,
                    "Orig.": "kathara-spine-1-1-1-de87967a",
                    "Scope": "Level 2 Circuit Flooding Scope",
                    "Priority": false,
                    "Logical Clock": 25
                }
            },
            "leaf_2_0_2": {
                "10": {
                    "time": 1636546725.142782,
                    "type": "LSP",
                    "LSP ID": "0100.0000.0001.00-00",
                    "Seq.N": 3,
                    "Orig.": "kathara-leaf-1-0-1-116c4f21",
                    "Logical Clock": 10
                },
                "11": {
                    "time": 1636546725.142903,
                    "type": "LSP",
                    "LSP ID": "0100.0000.0001.00-00",
                    "Seq.N": 3,
                    "Orig.": "kathara-leaf-1-0-1-116c4f21",
                    "Logical Clock": 11
                },
                "12": {
                    "time": 1636546725.143333,
                    "type": "FS-LSP",
                    "LSP ID": "0100.0000.0001.00-00",
                    "Seq.N": 3,
                    "Orig.": "kathara-leaf-1-0-1-116c4f21",
                    "Scope": "Level 2 Circuit Flooding Scope",
                    "Priority": false,
                    "Logical Clock": 12
                },
                "17": {
                    "time": 1636546752.304409,
                    "type": "FS-LSP",
                    "LSP ID": "0100.0000.0002.00-00",
                    "Seq.N": 3,
                    "Orig.": "kathara-spine-1-1-1-de87967a",
                    "Scope": "Level 2 Circuit Flooding Scope",
                    "Priority": false,
                    "Logical Clock": 17
                },
                "24": {
                    "time": 1636546752.468799,
                    "type": "FS-LSP",
                    "LSP ID": "0100.0000.0002.00-00",
                    "Seq.N": 3,
                    "Orig.": "kathara-spine-1-1-1-de87967a",
                    "Scope": "Level 2 Circuit Flooding Scope",
                    "Priority": false,
                    "Logical Clock": 24
                }
            }
        },
        "edges": [
            [
                [
                    "leaf_1_0_1",
                    1
                ],
                [
                    "spine_1_1_2",
                    2
                ]
            ],
            [
                [
                    "spine_1_1_2",
                    3
                ],
                [
                    "tof_1_2_1",
                    4
                ]
            ],
            [
                [
                    "spine_1_1_2",
                    4
                ],
                [
                    "tof_1_2_2",
                    5
                ]
            ],
            [
                [
                    "spine_1_1_2",
                    5
                ],
                [
                    "leaf_1_0_2",
                    6
                ]
            ],
            [
                [
                    "tof_1_2_1",
                    5
                ],
                [
                    "spine_2_1_2",
                    6
                ]
            ],
            [
                [
                    "tof_1_2_1",
                    6
                ],
                [
                    "spine_2_1_1",
                    7
                ]
            ],
            [
                [
                    "tof_1_2_1",
                    7
                ],
                [
                    "spine_1_1_1",
                    8
                ]
            ],
            [
                [
                    "tof_1_2_2",
                    6
                ],
                [
                    "spine_2_1_2",
                    7
                ]
            ],
            [
                [
                    "tof_1_2_2",
                    7
                ],
                [
                    "spine_2_1_1",
                    8
                ]
            ],
            [
                [
                    "tof_1_2_2",
                    8
                ],
                [
                    "spine_1_1_1",
                    9
                ]
            ],
            [
                [
                    "leaf_1_0_2",
                    7
                ],
                [
                    "spine_1_1_1",
                    10
                ]
            ],
            [
                [
                    "spine_2_1_2",
                    8
                ],
                [
                    "leaf_2_0_1",
                    9
                ]
            ],
            [
                [
                    "spine_2_1_2",
                    9
                ],
                [
                    "leaf_2_0_2",
                    10
                ]
            ],
            [
                [
                    "spine_2_1_1",
                    9
                ],
                [
                    "leaf_2_0_1",
                    10
                ]
            ],
            [
                [
                    "spine_2_1_1",
                    10
                ],
                [
                    "leaf_2_0_2",
                    11
                ]
            ],
            [
                [
                    "spine_1_1_1",
                    11
                ],
                [
                    "tof_1_2_2",
                    12
                ]
            ],
            [
                [
                    "spine_1_1_1",
                    12
                ],
                [
                    "tof_1_2_1",
                    13
                ]
            ],
            [
                [
                    "spine_1_1_1",
                    13
                ],
                [
                    "leaf_1_0_2",
                    14
                ]
            ],
            [
                [
                    "leaf_2_0_2",
                    12
                ],
                [
                    "spine_2_1_1",
                    13
                ]
            ],
            [
                [
                    "tof_1_2_2",
                    13
                ],
                [
                    "spine_2_1_1",
                    14
                ]
            ],
            [
                [
                    "tof_1_2_1",
                    14
                ],
                [
                    "spine_2_1_1",
                    15
                ]
            ],
            [
                [
                    "leaf_1_0_2",
                    15
                ],
                [
                    "spine_1_1_2",
                    16
                ]
            ],
            [
                [
                    "spine_2_1_1",
                    16
                ],
                [
                    "leaf_2_0_2",
                    17
                ]
            ],
            [
                [
                    "spine_2_1_1",
                    17
                ],
                [
                    "leaf_2_0_1",
                    18
                ]
            ],
            [
                [
                    "spine_2_1_1",
                    18
                ],
                [
                    "tof_1_2_1",
                    19
                ]
            ],
            [
                [
                    "tof_1_2_1",
                    20
                ],
                [
                    "spine_1_1_2",
                    21
                ]
            ],
            [
                [
                    "tof_1_2_1",
                    21
                ],
                [
                    "spine_2_1_2",
                    22
                ]
            ],
            [
                [
                    "spine_1_1_2",
                    22
                ],
                [
                    "tof_1_2_2",
                    23
                ]
            ],
            [
                [
                    "spine_1_1_2",
                    23
                ],
                [
                    "leaf_1_0_2",
                    24
                ]
            ],
            [
                [
                    "spine_1_1_2",
                    24
                ],
                [
                    "leaf_1_0_1",
                    25
                ]
            ],
            [
                [
                    "spine_2_1_2",
                    23
                ],
                [
                    "leaf_2_0_2",
                    24
                ]
            ],
            [
                [
                    "spine_2_1_2",
                    24
                ],
                [
                    "leaf_2_0_1",
                    25
                ]
            ],
            [
                [
                    "spine_2_1_2",
                    25
                ],
                [
                    "tof_1_2_2",
                    26
                ]
            ],
            [
                [
                    "tof_1_2_2",
                    27
                ],
                [
                    "spine_2_1_2",
                    28
                ]
            ]
        ]
    },
    "max_scalar_clock": 28
}