{
    "k_leaf": 2,
    "k_top": 2,
    "redundancy_factor": 2,
    "is_k8s": true,
    "machine_mac_addresses": {
        "leaf_1_0_1": {
            "net0": "7e:fc:e7:7b:5a:30",
            "net1": "ca:76:5d:74:16:7b",
            "net2": "9a:6e:a0:19:4c:4b"
        },
        "leaf_1_0_2": {
            "net0": "36:ca:73:83:51:fb",
            "net1": "26:77:0f:2f:79:9b",
            "net2": "7a:0f:1c:9e:05:97"
        },
        "leaf_2_0_1": {
            "net0": "ea:f4:63:6b:e3:71",
            "net1": "ba:ff:de:f0:88:92",
            "net2": "3a:bd:f7:d3:10:c6"
        },
        "leaf_2_0_2": {
            "net0": "be:3e:d9:81:21:01",
            "net1": "16:39:2a:a7:41:d3",
            "net2": "8a:15:b4:9a:0e:e7"
        },
        "spine_1_1_1": {
            "net0": "2e:23:f2:a8:64:3e",
            "net1": "66:7e:ee:02:d0:a6",
            "net2": "7e:74:16:39:31:74",
            "net3": "e2:f4:5f:a0:ff:e2"
        },
        "spine_1_1_2": {
            "net0": "32:19:20:a9:92:16",
            "net1": "9a:fb:65:6f:36:8d",
            "net2": "82:be:77:c6:7a:6e",
            "net3": "3a:77:fb:e8:cc:c7"
        },
        "spine_2_1_1": {
            "net0": "4a:75:c9:ed:a5:a0",
            "net1": "52:cb:88:55:84:1b",
            "net2": "ea:69:ed:5a:08:1e",
            "net3": "2a:04:6c:aa:93:84"
        },
        "spine_2_1_2": {
            "net0": "12:3c:73:e5:95:9f",
            "net1": "0e:fd:d2:45:0a:1a",
            "net2": "b2:3a:a3:ee:73:bf",
            "net3": "26:6c:4c:00:ab:ef"
        },
        "tof_1_2_1": {
            "net0": "b6:95:8f:56:8c:e2",
            "net1": "76:fd:94:94:85:9a",
            "net2": "c6:2d:fa:43:ca:5f",
            "net3": "a6:8d:03:c5:4a:79"
        },
        "tof_1_2_2": {
            "net0": "32:fe:39:e9:5a:85",
            "net1": "fe:21:67:1d:5c:05",
            "net2": "da:2c:b4:a4:af:0f",
            "net3": "3a:df:91:11:b0:3f"
        }
    },
    "failed_machine": "leaf_1_0_1",
    "failure_time": {
        "leaf_1_0_1": 1622464897.6837041,
        "leaf_1_0_2": 1622464897.6927023,
        "leaf_2_0_1": 1622464897.6851635,
        "leaf_2_0_2": 1622464897.6993675,
        "spine_1_1_1": 1622464897.7001956,
        "spine_1_1_2": 1622464897.7123857,
        "spine_2_1_1": 1622464897.7135522,
        "spine_2_1_2": 1622464897.724329,
        "tof_1_2_1": 1622464897.7224293,
        "tof_1_2_2": 1622464897.729425
    }
}