{
    "k_leaf": 6,
    "k_top": 6,
    "redundancy_factor": 3,
    "is_k8s": true,
    "machine_mac_addresses": {
        "leaf_1_0_1": {
            "net0": "7e:74:22:a2:b5:e6",
            "net1": "32:93:2e:c9:80:bb",
            "net2": "6a:4a:a4:49:1d:52",
            "net3": "e2:80:4a:da:26:45",
            "net4": "a2:81:d0:ec:4d:a6",
            "net5": "9a:16:ae:d4:1f:56",
            "net6": "f2:16:af:09:6f:01"
        },
        "leaf_1_0_2": {
            "net0": "f6:f2:33:67:24:fa",
            "net1": "42:10:6d:5d:36:81",
            "net2": "82:1d:30:58:1f:59",
            "net3": "0a:a7:e9:8c:98:64",
            "net4": "66:64:76:8f:04:05",
            "net5": "16:ce:dc:8f:9c:1a",
            "net6": "6e:f0:b6:da:79:c4"
        },
        "leaf_1_0_3": {
            "net0": "8a:83:ce:7c:9d:6b",
            "net1": "3e:93:7d:f2:bf:71",
            "net2": "82:75:44:1b:7c:67",
            "net3": "6a:18:19:4b:b9:07",
            "net4": "ce:38:40:bd:48:28",
            "net5": "d6:8f:6a:e0:bd:e1",
            "net6": "36:4a:90:a7:05:8f"
        },
        "leaf_1_0_4": {
            "net0": "82:af:4d:0f:49:3a",
            "net1": "16:78:cd:45:4c:a6",
            "net2": "62:ea:ce:25:30:4a",
            "net3": "32:6a:9c:6d:c5:21",
            "net4": "4a:15:74:24:e9:a3",
            "net5": "1a:e2:7e:61:ba:40",
            "net6": "46:0c:3a:a1:dc:59"
        },
        "leaf_1_0_5": {
            "net0": "06:07:cb:34:13:cf",
            "net1": "ea:c3:f9:8f:91:48",
            "net2": "9e:95:ff:90:0d:d6",
            "net3": "fe:f9:bb:14:2b:47",
            "net4": "1e:52:e3:c5:fa:e4",
            "net5": "c6:51:47:d8:fe:97",
            "net6": "a6:a0:30:1a:c0:61"
        },
        "leaf_1_0_6": {
            "net0": "ca:eb:39:45:73:e4",
            "net1": "a2:92:6a:dd:b1:fb",
            "net2": "3e:f1:62:78:76:03",
            "net3": "d2:d1:07:c0:1f:ae",
            "net4": "4a:ce:d3:2b:96:43",
            "net5": "de:12:c6:41:f3:b9",
            "net6": "aa:52:9b:d4:29:d0"
        },
        "leaf_2_0_1": {
            "net0": "b6:de:30:8b:49:af",
            "net1": "72:6a:79:d4:7c:93",
            "net2": "4e:c0:6a:7b:f7:1d",
            "net3": "86:a4:5d:75:37:c4",
            "net4": "4a:e4:e3:09:dc:00",
            "net5": "36:94:30:b6:28:dd",
            "net6": "7e:7c:dc:c2:60:a6"
        },
        "leaf_2_0_2": {
            "net0": "ba:b9:f3:f3:8b:31",
            "net1": "5a:79:46:fe:39:19",
            "net2": "ba:4a:e1:43:f9:94",
            "net3": "3a:eb:5d:6f:80:cf",
            "net4": "4a:d4:2b:e0:25:54",
            "net5": "72:55:d2:d2:32:bd",
            "net6": "d2:e0:6d:37:87:94"
        },
        "leaf_2_0_3": {
            "net0": "9e:23:2c:b7:b5:0b",
            "net1": "f6:9c:51:a2:8e:5f",
            "net2": "ba:20:37:c2:df:51",
            "net3": "4e:5d:a8:a2:df:36",
            "net4": "f2:e3:86:2b:3d:e4",
            "net5": "f6:1b:73:e3:cf:20",
            "net6": "3e:35:87:7a:0d:22"
        },
        "leaf_2_0_4": {
            "net0": "ba:ed:9f:97:a5:51",
            "net1": "2e:61:88:28:58:e2",
            "net2": "26:bd:cb:a7:5c:f2",
            "net3": "c6:54:97:92:80:31",
            "net4": "32:fc:aa:73:8a:76",
            "net5": "46:65:27:45:1c:45",
            "net6": "d2:57:91:3c:8e:93"
        },
        "leaf_2_0_5": {
            "net0": "1a:3d:0b:5f:94:12",
            "net1": "46:3d:28:60:7b:2e",
            "net2": "26:67:99:fd:3a:78",
            "net3": "16:d4:aa:26:ba:50",
            "net4": "2e:07:dc:da:d0:9a",
            "net5": "ae:75:93:63:a6:00",
            "net6": "32:e8:71:d7:20:a7"
        },
        "leaf_2_0_6": {
            "net0": "56:34:5d:04:8e:3a",
            "net1": "62:bb:1c:8c:5c:c1",
            "net2": "66:96:56:f2:26:22",
            "net3": "ea:d1:32:ba:22:c2",
            "net4": "f2:62:68:a5:17:fc",
            "net5": "02:52:f5:ec:5b:22",
            "net6": "8a:80:fe:7c:93:32"
        },
        "leaf_3_0_1": {
            "net0": "62:f6:ab:1f:9d:cd",
            "net1": "2a:5f:ea:2d:5b:48",
            "net2": "aa:82:6f:a6:b0:ec",
            "net3": "a2:a7:91:02:66:f0",
            "net4": "0e:a6:ee:76:90:60",
            "net5": "12:e2:0e:9b:27:a8",
            "net6": "fe:ce:91:03:02:aa"
        },
        "leaf_3_0_2": {
            "net0": "de:33:a0:da:2c:0c",
            "net1": "d2:3f:21:12:f7:5e",
            "net2": "9e:e5:ba:9b:76:60",
            "net3": "da:49:cf:01:b2:96",
            "net4": "d2:af:72:34:b3:6f",
            "net5": "e2:19:1b:40:e1:74",
            "net6": "b2:d2:87:dc:d9:0d"
        },
        "leaf_3_0_3": {
            "net0": "66:3e:9c:36:01:69",
            "net1": "f6:26:32:68:da:58",
            "net2": "be:77:ba:d5:96:89",
            "net3": "8e:cb:b5:70:aa:e9",
            "net4": "1a:3a:b0:eb:de:f7",
            "net5": "4e:03:ea:08:a3:06",
            "net6": "92:01:c7:b3:7b:a4"
        },
        "leaf_3_0_4": {
            "net0": "f2:63:9f:42:7a:a7",
            "net1": "4e:f0:04:58:cf:58",
            "net2": "aa:e6:de:df:18:da",
            "net3": "6e:fa:b3:81:61:54",
            "net4": "c6:a0:43:8c:af:3e",
            "net5": "5a:4e:b0:03:f2:08",
            "net6": "76:ce:2f:5e:e4:ac"
        },
        "leaf_3_0_5": {
            "net0": "ce:80:d3:bb:8b:81",
            "net1": "e6:54:85:21:16:be",
            "net2": "66:8d:af:0a:83:c7",
            "net3": "8a:af:f3:d6:cd:3d",
            "net4": "3a:7f:0a:27:2c:98",
            "net5": "6a:6a:7f:ce:29:b4",
            "net6": "7e:4e:d0:20:31:51"
        },
        "leaf_3_0_6": {
            "net0": "c6:c5:0d:44:23:df",
            "net1": "62:fa:69:dd:42:4f",
            "net2": "16:b1:ee:57:f0:57",
            "net3": "e6:5c:bf:97:16:c0",
            "net4": "6e:74:4a:3a:3a:ce",
            "net5": "f6:99:23:6f:9a:53",
            "net6": "3a:10:4a:22:89:97"
        },
        "leaf_4_0_1": {
            "net0": "66:e1:f6:7b:e6:08",
            "net1": "a2:fe:e9:16:97:6e",
            "net2": "e6:8d:96:bb:83:ce",
            "net3": "ea:ce:fe:c5:77:01",
            "net4": "36:7d:7f:81:74:de",
            "net5": "86:70:64:d1:09:97",
            "net6": "36:4b:35:f3:76:71"
        },
        "leaf_4_0_2": {
            "net0": "2a:0a:6b:ed:cf:f4",
            "net1": "aa:87:cd:90:45:16",
            "net2": "0a:8a:ce:6f:3c:e5",
            "net3": "66:50:63:db:fc:f3",
            "net4": "1a:1d:d7:c7:df:8f",
            "net5": "ca:fd:6e:26:57:1a",
            "net6": "82:88:d2:8f:9a:75"
        },
        "leaf_4_0_3": {
            "net0": "96:e2:9f:28:d0:21",
            "net1": "92:5c:8f:f3:b7:2b",
            "net2": "96:9e:aa:cc:03:c6",
            "net3": "02:29:d6:57:70:82",
            "net4": "de:03:a3:57:06:4d",
            "net5": "b2:0e:b5:d0:c6:c4",
            "net6": "a6:01:06:56:f4:45"
        },
        "leaf_4_0_4": {
            "net0": "d2:57:1d:67:94:cb",
            "net1": "8a:b1:34:36:fb:ed",
            "net2": "ba:74:54:30:f0:e8",
            "net3": "ea:04:c8:94:ac:56",
            "net4": "ca:1d:de:4b:c8:b9",
            "net5": "aa:76:55:a5:81:71",
            "net6": "a2:44:30:0f:34:04"
        },
        "leaf_4_0_5": {
            "net0": "8e:c2:f1:3a:a9:cb",
            "net1": "22:b5:ac:e3:69:73",
            "net2": "5a:2d:db:c6:7c:3b",
            "net3": "b2:f6:f2:59:5d:80",
            "net4": "5a:ba:f1:c0:69:4f",
            "net5": "0a:96:d5:76:9a:cf",
            "net6": "5a:0e:07:02:cb:4f"
        },
        "leaf_4_0_6": {
            "net0": "2e:a2:98:b0:d4:1e",
            "net1": "92:4d:75:72:3f:4f",
            "net2": "02:b7:47:8e:91:04",
            "net3": "4e:9a:1f:18:5f:c6",
            "net4": "c6:6b:3f:b4:6f:af",
            "net5": "76:c0:3e:8f:26:90",
            "net6": "fa:3d:13:38:a9:98"
        },
        "spine_1_1_1": {
            "net0": "62:a2:58:c0:de:e0",
            "net1": "b2:b7:0d:12:67:e7",
            "net10": "9e:a8:3f:00:07:30",
            "net11": "c2:6e:a4:c0:fb:c3",
            "net2": "72:ce:60:6a:bb:bc",
            "net3": "f6:35:60:a9:1b:b0",
            "net4": "52:7e:4f:b4:01:e7",
            "net5": "42:c5:47:73:9f:78",
            "net6": "be:f3:ae:b5:92:b2",
            "net7": "4e:d9:ec:df:94:09",
            "net8": "4a:98:0e:af:38:77",
            "net9": "4a:de:00:51:9c:8d"
        },
        "spine_1_1_2": {
            "net0": "d6:c7:d9:ea:91:b3",
            "net1": "fa:26:80:97:21:c9",
            "net10": "d6:cc:8d:09:1a:12",
            "net11": "62:92:27:f0:af:1a",
            "net2": "12:e8:ee:6e:28:16",
            "net3": "66:2e:47:f5:d4:24",
            "net4": "fa:4b:a4:1d:b5:c9",
            "net5": "9a:41:47:39:e7:f1",
            "net6": "fe:dd:81:63:cd:8a",
            "net7": "c6:3a:a3:39:ad:6d",
            "net8": "2e:33:bd:2f:54:aa",
            "net9": "86:99:bb:f2:7f:9c"
        },
        "spine_1_1_3": {
            "net0": "3e:b1:9e:bf:f0:ad",
            "net1": "ee:fb:01:87:bf:0b",
            "net10": "92:7e:a2:4b:c4:45",
            "net11": "b6:15:b1:e7:22:1f",
            "net2": "f6:cd:22:0e:c3:8a",
            "net3": "7a:53:0c:0b:f7:c5",
            "net4": "02:ba:e8:e6:a6:49",
            "net5": "ae:da:80:92:9b:dd",
            "net6": "5e:7f:81:80:e3:c3",
            "net7": "82:42:31:7e:16:7e",
            "net8": "42:d1:6a:1a:9a:e0",
            "net9": "72:48:00:89:d9:4d"
        },
        "spine_1_1_4": {
            "net0": "3e:c7:a5:5c:b1:a0",
            "net1": "0a:7e:a6:31:0f:e2",
            "net10": "ae:89:c2:93:0a:54",
            "net11": "4e:74:89:3b:c5:fd",
            "net2": "ae:54:da:b0:38:23",
            "net3": "22:61:da:7d:11:89",
            "net4": "0e:28:b4:c0:58:3e",
            "net5": "de:43:82:f9:76:3d",
            "net6": "1a:2e:d8:4f:d8:8e",
            "net7": "3e:60:1c:38:61:1e",
            "net8": "36:21:30:3d:64:2a",
            "net9": "82:ff:73:b3:0f:a2"
        },
        "spine_1_1_5": {
            "net0": "8e:6f:b4:27:a5:10",
            "net1": "f6:9f:fc:f2:c2:d0",
            "net10": "fa:22:1c:8b:fb:b4",
            "net11": "2e:a0:2c:81:38:12",
            "net2": "92:eb:8d:31:50:ff",
            "net3": "ba:03:1c:b5:eb:dc",
            "net4": "aa:09:66:c8:01:bb",
            "net5": "0a:ee:7b:f6:8f:c5",
            "net6": "3a:b7:59:80:f0:bb",
            "net7": "4e:36:27:96:c5:1e",
            "net8": "3a:44:2d:5e:25:af",
            "net9": "86:e3:ee:04:97:3e"
        },
        "spine_1_1_6": {
            "net0": "f6:14:7d:26:9d:12",
            "net1": "2e:03:53:40:f2:60",
            "net10": "a2:3c:b6:ee:9c:3c",
            "net11": "36:a0:9f:10:2b:5b",
            "net2": "da:22:85:2a:8f:a9",
            "net3": "d6:17:d0:08:21:b9",
            "net4": "9e:d2:7b:29:d9:fa",
            "net5": "26:6a:ee:09:82:83",
            "net6": "3e:bf:9d:ba:6e:78",
            "net7": "d2:e2:be:a5:bd:f2",
            "net8": "4e:59:1c:5e:61:7a",
            "net9": "c2:52:a8:a1:af:07"
        },
        "spine_2_1_1": {
            "net0": "2a:c3:ba:b8:25:29",
            "net1": "66:36:a2:17:12:54",
            "net10": "d6:5e:d8:6d:97:05",
            "net11": "52:c3:72:07:41:8e",
            "net2": "d2:86:41:ce:ce:c5",
            "net3": "f2:0f:9f:c8:60:00",
            "net4": "9e:06:39:b6:ab:46",
            "net5": "1e:66:72:77:d4:f4",
            "net6": "32:12:7a:38:3d:ed",
            "net7": "a6:81:5a:54:85:50",
            "net8": "52:8a:53:f1:82:28",
            "net9": "ea:f3:09:1c:4f:ff"
        },
        "spine_2_1_2": {
            "net0": "66:d5:20:d3:00:85",
            "net1": "72:69:67:a8:c6:51",
            "net10": "22:56:90:66:73:85",
            "net11": "4a:fe:88:58:bc:77",
            "net2": "86:ae:0a:34:3e:91",
            "net3": "1a:00:a5:f4:4f:83",
            "net4": "ae:1c:ca:52:40:06",
            "net5": "12:be:3a:0f:57:73",
            "net6": "ba:6f:cc:8c:ad:b6",
            "net7": "02:00:7a:4b:6e:54",
            "net8": "ba:69:77:1b:5d:39",
            "net9": "66:0b:7e:3a:a2:6c"
        },
        "spine_2_1_3": {
            "net0": "22:5e:61:c3:e9:35",
            "net1": "66:08:31:ae:93:cb",
            "net10": "42:c7:b8:3f:59:c8",
            "net11": "92:41:4e:6b:f7:9c",
            "net2": "16:1c:71:6d:29:b8",
            "net3": "26:a4:4a:ec:4d:be",
            "net4": "06:aa:e6:3c:19:96",
            "net5": "ca:eb:10:00:29:a5",
            "net6": "8e:c9:a0:a6:8c:c4",
            "net7": "62:e9:70:bd:4d:04",
            "net8": "76:77:59:bf:d8:eb",
            "net9": "aa:40:fa:c0:0d:3b"
        },
        "spine_2_1_4": {
            "net0": "be:82:2f:2f:13:40",
            "net1": "fe:20:16:20:ec:8a",
            "net10": "5a:2f:c0:fe:f4:ec",
            "net11": "c2:e5:b5:3c:fa:88",
            "net2": "9e:5e:f2:10:8e:40",
            "net3": "d6:94:71:5b:a9:7b",
            "net4": "6e:45:d0:32:6f:c0",
            "net5": "62:1f:92:db:f9:18",
            "net6": "9a:b8:bb:65:8b:ea",
            "net7": "fa:10:97:47:04:29",
            "net8": "9e:5a:06:d1:a8:6c",
            "net9": "1e:ee:7b:11:dd:14"
        },
        "spine_2_1_5": {
            "net0": "3a:8f:fa:5f:3a:18",
            "net1": "66:a2:54:0c:1f:c1",
            "net10": "9e:e5:f1:bf:b6:8a",
            "net11": "9e:a6:d5:5d:08:b4",
            "net2": "be:b7:36:43:80:09",
            "net3": "26:01:e8:ee:db:d3",
            "net4": "12:4f:1a:11:f3:9b",
            "net5": "0a:f5:3f:ec:30:2e",
            "net6": "d2:95:c7:3d:47:c8",
            "net7": "0a:c3:80:9d:9a:f0",
            "net8": "2e:45:51:72:2c:0b",
            "net9": "ca:53:77:9b:d3:cb"
        },
        "spine_2_1_6": {
            "net0": "22:41:de:85:1f:3a",
            "net1": "be:2d:24:f8:ba:66",
            "net10": "1a:10:8b:35:c3:f0",
            "net11": "12:48:7e:77:75:24",
            "net2": "ce:f5:65:98:2f:45",
            "net3": "86:03:e4:20:95:92",
            "net4": "2a:c5:39:25:bd:a6",
            "net5": "06:0f:59:eb:3f:b2",
            "net6": "0e:5a:4d:d8:9b:6d",
            "net7": "0e:bc:ed:9c:1b:f2",
            "net8": "c6:a9:83:0e:89:27",
            "net9": "1e:ab:82:55:82:d8"
        },
        "spine_3_1_1": {
            "net0": "be:fd:ef:7d:70:14",
            "net1": "2a:15:fd:1d:9f:c3",
            "net10": "da:09:59:55:20:e0",
            "net11": "8a:33:91:a3:ee:3a",
            "net2": "ee:1d:ff:f2:c7:9b",
            "net3": "aa:da:5e:72:cf:53",
            "net4": "76:d5:13:ee:96:a1",
            "net5": "f2:3d:92:79:c8:fe",
            "net6": "f6:d4:f3:84:47:cb",
            "net7": "8a:99:67:a6:93:d8",
            "net8": "4a:6f:40:b2:5d:8b",
            "net9": "76:57:c1:6e:72:d7"
        },
        "spine_3_1_2": {
            "net0": "c6:1a:8f:d8:a1:ac",
            "net1": "ca:53:3b:75:8e:1b",
            "net10": "3e:73:92:17:30:57",
            "net11": "ea:a0:3a:9f:db:b5",
            "net2": "26:a6:fa:8d:9f:19",
            "net3": "0e:9b:16:6a:77:4a",
            "net4": "66:c5:24:df:50:8c",
            "net5": "76:de:74:30:7a:bc",
            "net6": "8e:ea:67:92:ff:93",
            "net7": "b2:93:7b:60:92:ff",
            "net8": "3a:36:fd:25:aa:93",
            "net9": "be:e2:b6:2b:2b:10"
        },
        "spine_3_1_3": {
            "net0": "5a:bb:50:20:36:4d",
            "net1": "16:8d:27:3e:86:20",
            "net10": "32:c9:e2:c0:30:c2",
            "net11": "02:62:a3:6a:12:59",
            "net2": "7e:a3:cd:33:7e:28",
            "net3": "d6:64:c2:9b:b1:b0",
            "net4": "86:29:fd:84:0e:27",
            "net5": "32:0c:bb:ce:bd:8b",
            "net6": "c2:28:9d:71:f3:8a",
            "net7": "ba:da:0b:c5:5d:71",
            "net8": "36:26:b5:1f:47:76",
            "net9": "c6:bc:8a:66:bb:5e"
        },
        "spine_3_1_4": {
            "net0": "86:66:5b:39:a4:78",
            "net1": "c6:36:ea:98:eb:af",
            "net10": "f2:9b:fd:e7:be:44",
            "net11": "26:4c:db:a9:43:2b",
            "net2": "5e:5f:12:95:46:ce",
            "net3": "c6:b1:b8:a0:7c:0e",
            "net4": "96:75:b7:14:ff:64",
            "net5": "22:fc:58:c4:9a:fd",
            "net6": "ce:ab:be:a5:d0:f6",
            "net7": "b2:53:51:02:66:25",
            "net8": "ba:d2:47:97:79:f8",
            "net9": "52:fb:03:c8:17:fd"
        },
        "spine_3_1_5": {
            "net0": "62:2d:68:21:5c:0e",
            "net1": "d2:56:cb:2c:df:3f",
            "net10": "b2:61:e7:de:c8:c9",
            "net11": "b6:4f:17:80:15:a3",
            "net2": "22:2e:47:7c:17:5f",
            "net3": "66:7d:7d:c9:0a:f4",
            "net4": "4a:c5:72:39:7a:c5",
            "net5": "0a:85:ac:08:c8:4a",
            "net6": "22:90:18:74:0d:73",
            "net7": "e2:74:78:fe:1f:1b",
            "net8": "1a:cb:45:7d:57:6e",
            "net9": "06:cf:ef:de:d4:37"
        },
        "spine_3_1_6": {
            "net0": "a2:7c:2e:e6:39:9b",
            "net1": "1e:3e:ab:ac:6e:f6",
            "net10": "62:b2:18:6e:03:a0",
            "net11": "42:92:9d:f5:34:ca",
            "net2": "5a:f4:64:6c:d6:ed",
            "net3": "ea:17:f4:0d:ce:52",
            "net4": "e6:dd:d0:86:cc:9c",
            "net5": "12:f8:6e:5e:ba:fd",
            "net6": "36:e9:57:6d:96:8a",
            "net7": "aa:1e:78:3c:42:a5",
            "net8": "de:95:5a:9f:2d:b1",
            "net9": "1e:df:9b:78:61:03"
        },
        "spine_4_1_1": {
            "net0": "1e:1a:1b:3c:31:e4",
            "net1": "e6:f5:57:16:db:4d",
            "net10": "0e:8c:1a:0b:17:63",
            "net11": "c2:91:ee:e0:55:07",
            "net2": "96:b9:c7:f2:51:d4",
            "net3": "d6:b7:67:80:d1:51",
            "net4": "a6:f9:2f:bd:18:ff",
            "net5": "e2:86:44:d9:cf:78",
            "net6": "c2:62:e2:43:7c:d2",
            "net7": "0e:53:43:f7:ec:8d",
            "net8": "c6:3a:1b:5c:9a:7f",
            "net9": "32:50:5a:a7:ae:f8"
        },
        "spine_4_1_2": {
            "net0": "32:e4:cb:eb:25:dd",
            "net1": "6e:b0:3f:11:ec:2b",
            "net10": "56:e1:25:62:8d:72",
            "net11": "5a:00:01:c5:0c:f7",
            "net2": "c2:fe:a0:5a:3c:fa",
            "net3": "92:45:fc:ff:6a:d6",
            "net4": "56:59:15:e4:cd:f0",
            "net5": "5a:38:f5:95:97:51",
            "net6": "d6:3e:a9:c2:da:cf",
            "net7": "2a:e7:f3:4c:8b:00",
            "net8": "12:f3:89:94:80:4f",
            "net9": "ea:91:88:47:e6:a8"
        },
        "spine_4_1_3": {
            "net0": "4a:45:bb:37:3b:64",
            "net1": "3a:fb:50:7b:19:6b",
            "net10": "5a:71:6f:b1:27:44",
            "net11": "f2:f5:36:6f:8e:d3",
            "net2": "5e:f7:05:7e:78:72",
            "net3": "0a:0f:7f:b3:96:eb",
            "net4": "0a:5c:73:f4:8a:4f",
            "net5": "ee:bf:db:d3:35:18",
            "net6": "d6:4d:90:a0:8e:5b",
            "net7": "be:8e:89:6d:f5:41",
            "net8": "ce:7c:70:2d:6d:93",
            "net9": "66:7c:ae:d2:34:72"
        },
        "spine_4_1_4": {
            "net0": "6e:fd:6b:a5:a8:71",
            "net1": "3e:31:95:88:69:de",
            "net10": "d6:ea:b3:98:5a:7f",
            "net11": "6a:fd:63:69:e2:3b",
            "net2": "7a:0e:d7:ac:de:d4",
            "net3": "fa:ec:b2:85:da:d4",
            "net4": "66:19:88:c6:1b:f7",
            "net5": "aa:bc:dc:68:d3:66",
            "net6": "36:a1:23:f3:28:45",
            "net7": "8e:13:1b:05:1d:ec",
            "net8": "ea:98:18:41:4f:7c",
            "net9": "a6:37:8f:ac:f1:60"
        },
        "spine_4_1_5": {
            "net0": "72:70:89:53:a7:5b",
            "net1": "e6:a5:31:6e:60:92",
            "net10": "86:a0:65:98:10:36",
            "net11": "26:37:42:7d:3f:ef",
            "net2": "6a:48:47:4a:97:31",
            "net3": "82:6f:96:0e:23:b3",
            "net4": "aa:7f:ae:7d:29:08",
            "net5": "be:90:7b:fa:2a:fb",
            "net6": "b6:27:67:22:ee:4f",
            "net7": "86:4a:de:1b:de:dc",
            "net8": "ce:37:b8:0c:2d:94",
            "net9": "5a:bb:e1:33:72:5d"
        },
        "spine_4_1_6": {
            "net0": "f6:8a:70:df:75:1b",
            "net1": "ea:3b:40:6f:97:12",
            "net10": "32:d7:d7:af:7b:46",
            "net11": "36:17:6c:b8:5d:07",
            "net2": "1e:f9:b5:c9:6c:6f",
            "net3": "46:54:c6:5f:e8:e3",
            "net4": "c6:c3:6a:0d:aa:77",
            "net5": "56:01:50:56:59:ce",
            "net6": "0a:0a:85:f4:79:e4",
            "net7": "4a:2b:21:d6:78:c4",
            "net8": "96:4d:61:a8:7e:2f",
            "net9": "62:6d:7f:b1:f7:f7"
        },
        "tof_1_2_1": {
            "net0": "a6:4d:96:9b:67:9e",
            "net1": "ee:56:5c:a1:30:ae",
            "net10": "4e:9b:10:b2:f0:0c",
            "net11": "2e:2b:2a:a4:a7:b4",
            "net2": "e2:3a:65:03:3d:dc",
            "net3": "3e:e6:17:f5:98:2c",
            "net4": "ee:57:92:b1:c6:1c",
            "net5": "b6:39:1b:69:8a:50",
            "net6": "22:17:c6:3a:41:4f",
            "net7": "56:da:db:e1:e9:3f",
            "net8": "8a:53:62:c8:e0:a1",
            "net9": "7a:40:06:0a:6c:7a"
        },
        "tof_1_2_2": {
            "net0": "96:13:4d:64:19:7a",
            "net1": "ea:8b:f6:73:cb:94",
            "net10": "42:40:47:94:dd:20",
            "net11": "02:aa:3b:d9:f7:da",
            "net2": "ca:aa:50:54:65:a5",
            "net3": "5e:23:51:d2:9a:0e",
            "net4": "a2:67:c9:46:ba:b3",
            "net5": "12:51:85:30:bc:e0",
            "net6": "ba:18:8f:19:a6:6f",
            "net7": "76:bd:75:89:06:c2",
            "net8": "22:bb:b9:e9:0a:72",
            "net9": "42:f5:4b:de:04:f2"
        },
        "tof_1_2_3": {
            "net0": "b6:8b:63:b1:8a:e2",
            "net1": "3e:c8:09:97:79:7a",
            "net10": "3a:e6:81:8f:09:6a",
            "net11": "c2:e3:64:df:33:49",
            "net2": "da:75:a4:9c:73:11",
            "net3": "ee:45:55:44:56:87",
            "net4": "e6:b4:78:58:f8:fc",
            "net5": "22:8e:d8:1d:60:a5",
            "net6": "f6:5f:0b:27:cf:54",
            "net7": "0a:78:13:02:d9:e1",
            "net8": "9a:3e:6e:6c:ee:89",
            "net9": "5e:72:aa:33:b8:4f"
        },
        "tof_1_2_4": {
            "net0": "e2:12:15:df:78:e0",
            "net1": "9e:21:73:b1:3b:a3",
            "net10": "1e:cc:3e:70:2d:5a",
            "net11": "16:5b:61:b8:7d:7d",
            "net2": "22:3b:c3:f4:cb:97",
            "net3": "c6:d7:dd:db:c7:54",
            "net4": "e6:f2:8b:ca:6b:8c",
            "net5": "c6:54:09:87:fc:10",
            "net6": "9e:03:e0:97:05:02",
            "net7": "12:b1:b1:8a:8f:18",
            "net8": "b2:d6:30:ab:e6:58",
            "net9": "56:ce:41:5a:cd:b4"
        },
        "tof_1_2_5": {
            "net0": "9e:b2:e5:7d:d1:b8",
            "net1": "0e:6b:b3:5f:12:be",
            "net10": "c6:a0:b1:26:4a:f9",
            "net11": "ce:07:f2:62:09:ae",
            "net2": "fa:c3:91:d4:1a:74",
            "net3": "b6:b4:34:72:35:22",
            "net4": "22:e0:04:92:2e:f6",
            "net5": "b2:3a:6c:08:b6:1a",
            "net6": "22:cc:25:73:0a:f2",
            "net7": "f2:d9:38:06:76:f8",
            "net8": "02:9c:c5:a2:fb:df",
            "net9": "16:c3:0b:94:45:f1"
        },
        "tof_1_2_6": {
            "net0": "06:e2:f3:75:5c:15",
            "net1": "e6:a7:71:00:4f:95",
            "net10": "7e:ed:3a:69:e5:01",
            "net11": "66:f2:20:89:66:c0",
            "net2": "76:7e:35:e5:52:f6",
            "net3": "8a:fe:43:68:09:93",
            "net4": "56:dc:d2:6a:cc:97",
            "net5": "96:61:09:a8:b5:a6",
            "net6": "76:84:13:15:7e:73",
            "net7": "ca:8a:7d:9c:87:bd",
            "net8": "c6:e5:e5:cf:01:38",
            "net9": "4e:4c:87:fd:ad:fa"
        },
        "tof_2_2_1": {
            "net0": "2e:2b:58:83:aa:43",
            "net1": "9e:fd:b7:ac:4d:2b",
            "net10": "42:da:a2:02:26:03",
            "net11": "0a:d2:bf:cd:8d:fd",
            "net2": "6a:77:25:54:0e:05",
            "net3": "7e:dc:e0:8b:01:9d",
            "net4": "42:7e:dc:2f:44:3b",
            "net5": "7e:e5:60:fa:f7:41",
            "net6": "42:d1:d4:80:25:ca",
            "net7": "1e:10:9e:9f:be:7d",
            "net8": "6e:63:ab:10:c2:a1",
            "net9": "8e:45:10:42:e6:6d"
        },
        "tof_2_2_2": {
            "net0": "2a:42:23:71:88:2d",
            "net1": "26:f9:ae:21:69:a1",
            "net10": "8a:86:2e:b4:e1:de",
            "net11": "56:fd:cc:37:51:36",
            "net2": "d6:11:53:ed:75:5f",
            "net3": "ba:89:a4:ca:f8:17",
            "net4": "7a:e9:6f:dd:23:5d",
            "net5": "4e:85:97:0f:d0:97",
            "net6": "da:cf:58:69:e4:42",
            "net7": "56:8b:2c:6d:c8:07",
            "net8": "16:00:86:f7:26:30",
            "net9": "c2:b0:4f:58:fd:c9"
        },
        "tof_2_2_3": {
            "net0": "3e:2c:b6:f0:c7:a4",
            "net1": "d6:92:e5:23:03:4f",
            "net10": "4e:27:d4:fd:96:9a",
            "net11": "e2:93:3a:06:84:d2",
            "net2": "3e:b2:9b:f7:7d:0d",
            "net3": "ae:28:90:86:90:60",
            "net4": "fa:62:95:3e:36:e7",
            "net5": "52:a5:5c:c9:1d:ff",
            "net6": "1e:4a:db:7a:c7:c3",
            "net7": "96:01:55:ec:c6:4e",
            "net8": "c6:42:65:fd:ce:cc",
            "net9": "aa:27:3b:98:e2:9b"
        },
        "tof_2_2_4": {
            "net0": "be:0d:d4:4a:e7:91",
            "net1": "c6:c1:56:ce:8f:23",
            "net10": "a6:aa:be:ad:39:ad",
            "net11": "66:6c:ce:f9:2e:99",
            "net2": "0e:a1:84:e1:ca:34",
            "net3": "d2:07:d0:20:d4:f9",
            "net4": "c6:30:24:66:5f:b1",
            "net5": "56:41:58:ff:fc:b4",
            "net6": "fe:ea:e1:57:88:93",
            "net7": "b2:37:68:b5:e1:b5",
            "net8": "f6:13:44:7b:56:57",
            "net9": "32:84:58:ac:fa:de"
        },
        "tof_2_2_5": {
            "net0": "5e:ea:c9:ae:fe:65",
            "net1": "62:45:96:df:ce:2a",
            "net10": "22:cf:3b:43:51:b7",
            "net11": "fe:53:48:1c:90:e1",
            "net2": "42:8b:d9:fa:99:4f",
            "net3": "9e:11:5c:fa:6a:84",
            "net4": "26:a3:42:e1:2a:a1",
            "net5": "b6:18:ee:aa:ae:07",
            "net6": "2a:e6:01:bf:5c:4f",
            "net7": "0e:4b:42:70:de:e7",
            "net8": "ca:8f:6e:b5:bf:21",
            "net9": "b2:da:88:12:f9:00"
        },
        "tof_2_2_6": {
            "net0": "1e:a1:be:2f:46:ac",
            "net1": "42:2b:f2:29:e1:28",
            "net10": "3a:02:3d:2a:a9:e0",
            "net11": "12:4e:cd:9b:72:33",
            "net2": "82:3d:cc:38:0c:d3",
            "net3": "fa:b2:76:97:45:a1",
            "net4": "52:49:73:e3:cd:d7",
            "net5": "32:00:37:88:34:d8",
            "net6": "0e:95:2d:7a:e5:49",
            "net7": "fe:09:c6:8e:3e:12",
            "net8": "72:a3:19:2a:0c:6f",
            "net9": "aa:94:ea:e1:42:d5"
        }
    },
    "failed_machine": "leaf_1_0_1",
    "failure_time": {
        "leaf_1_0_1": 1621872322.3424883,
        "leaf_1_0_2": 1621872322.3690987,
        "leaf_1_0_3": 1621872322.404365,
        "leaf_1_0_4": 1621872322.4463093,
        "leaf_1_0_5": 1621872322.351454,
        "leaf_1_0_6": 1621872322.39621,
        "leaf_2_0_1": 1621872322.4178207,
        "leaf_2_0_2": 1621872322.4561558,
        "leaf_2_0_3": 1621872322.3598905,
        "leaf_2_0_4": 1621872322.3852026,
        "leaf_2_0_5": 1621872322.4215927,
        "leaf_2_0_6": 1621872322.4643588,
        "leaf_3_0_1": 1621872322.3600433,
        "leaf_3_0_2": 1621872322.4056654,
        "leaf_3_0_3": 1621872322.4585438,
        "leaf_3_0_4": 1621872322.4705539,
        "leaf_3_0_5": 1621872322.4655063,
        "leaf_3_0_6": 1621872322.4762285,
        "leaf_4_0_1": 1621872322.4923334,
        "leaf_4_0_2": 1621872322.5141916,
        "leaf_4_0_3": 1621872322.4696944,
        "leaf_4_0_4": 1621872322.4917464,
        "leaf_4_0_5": 1621872322.5097706,
        "leaf_4_0_6": 1621872322.5213308,
        "spine_1_1_1": 1621872322.4800146,
        "spine_1_1_2": 1621872322.4950826,
        "spine_1_1_3": 1621872322.5142834,
        "spine_1_1_4": 1621872322.5371354,
        "spine_1_1_5": 1621872322.4925323,
        "spine_1_1_6": 1621872322.5136328,
        "spine_2_1_1": 1621872322.5352788,
        "spine_2_1_2": 1621872322.5517023,
        "spine_2_1_3": 1621872322.5385609,
        "spine_2_1_4": 1621872322.5603163,
        "spine_2_1_5": 1621872322.5769267,
        "spine_2_1_6": 1621872322.599009,
        "spine_3_1_1": 1621872322.544437,
        "spine_3_1_2": 1621872322.570691,
        "spine_3_1_3": 1621872322.584586,
        "spine_3_1_4": 1621872322.6041253,
        "spine_3_1_5": 1621872322.5593932,
        "spine_3_1_6": 1621872322.580656,
        "spine_4_1_1": 1621872322.5955462,
        "spine_4_1_2": 1621872322.6181686,
        "spine_4_1_3": 1621872322.5737228,
        "spine_4_1_4": 1621872322.5856278,
        "spine_4_1_5": 1621872322.607683,
        "spine_4_1_6": 1621872322.6336284,
        "tof_1_2_1": 1621872322.6136177,
        "tof_1_2_2": 1621872322.638461,
        "tof_1_2_3": 1621872322.6594326,
        "tof_1_2_4": 1621872322.672991,
        "tof_1_2_5": 1621872322.618866,
        "tof_1_2_6": 1621872322.6549232,
        "tof_2_2_1": 1621872322.6726606,
        "tof_2_2_2": 1621872322.6896396,
        "tof_2_2_3": 1621872322.6422858,
        "tof_2_2_4": 1621872322.6607502,
        "tof_2_2_5": 1621872322.674735,
        "tof_2_2_6": 1621872322.6906984
    }
}