{
    "k_leaf": 12,
    "k_top": 12,
    "redundancy_factor": 12,
    "is_k8s": true,
    "machine_mac_addresses": {
        "leaf_1_0_1": {
            "net0": "82:ae:48:1f:ea:f0",
            "net1": "1a:0b:04:62:32:29",
            "net10": "0e:da:8e:31:3a:79",
            "net11": "1e:49:db:9a:68:6c",
            "net12": "9a:a4:a4:27:54:d7",
            "net2": "96:78:63:9e:3e:f5",
            "net3": "52:f1:ef:20:c8:01",
            "net4": "02:8f:f7:a3:99:aa",
            "net5": "02:ae:60:24:5a:c9",
            "net6": "5e:3a:ed:30:54:d6",
            "net7": "f2:50:15:4e:77:cb",
            "net8": "d6:b9:3f:58:a4:81",
            "net9": "de:05:38:56:71:58"
        },
        "leaf_1_0_10": {
            "net0": "16:83:ff:38:3c:98",
            "net1": "3a:61:cd:aa:fe:e1",
            "net10": "26:0f:85:53:2e:b0",
            "net11": "6a:45:24:64:74:7f",
            "net12": "d2:06:34:5e:28:86",
            "net2": "86:62:2b:78:6d:7e",
            "net3": "82:01:38:8b:66:d8",
            "net4": "46:ce:4c:bd:09:d2",
            "net5": "2a:b7:34:49:8a:24",
            "net6": "6a:28:80:25:37:5a",
            "net7": "9a:a3:c3:de:78:0f",
            "net8": "7e:90:a8:81:7c:74",
            "net9": "46:65:b7:ba:79:c9"
        },
        "leaf_1_0_11": {
            "net0": "8e:18:a1:b1:b3:48",
            "net1": "6a:68:ce:3e:db:90",
            "net10": "fa:9a:99:79:89:43",
            "net11": "0a:76:dc:df:f1:e2",
            "net12": "3a:c1:9c:87:19:19",
            "net2": "36:1c:bf:6e:c5:89",
            "net3": "52:8e:ac:de:8a:94",
            "net4": "a2:35:f7:dd:00:b6",
            "net5": "be:69:6d:10:70:53",
            "net6": "92:9e:f3:65:52:7b",
            "net7": "02:66:69:51:44:da",
            "net8": "f6:f7:99:f8:53:49",
            "net9": "4e:60:39:ac:44:00"
        },
        "leaf_1_0_12": {
            "net0": "22:23:4c:78:f1:c7",
            "net1": "f2:0f:89:d4:bf:ca",
            "net10": "7e:34:64:a5:f0:af",
            "net11": "12:a9:a9:74:27:e9",
            "net12": "5e:09:76:2f:33:b0",
            "net2": "52:bc:09:d0:cf:dc",
            "net3": "42:a8:bc:41:40:8b",
            "net4": "da:59:44:2f:8f:c5",
            "net5": "c6:d6:15:16:be:87",
            "net6": "92:98:72:5f:48:74",
            "net7": "d6:25:26:f1:cc:ed",
            "net8": "82:8f:bc:db:a0:08",
            "net9": "be:8e:f9:3f:64:93"
        },
        "leaf_1_0_2": {
            "net0": "22:67:3a:1f:1d:92",
            "net1": "76:a0:e8:c5:2b:64",
            "net10": "06:ad:46:48:bf:4f",
            "net11": "ae:e6:84:7b:1b:9f",
            "net12": "4e:d7:f7:14:0f:ec",
            "net2": "fa:24:aa:8c:97:b4",
            "net3": "0a:dc:c0:ab:b0:11",
            "net4": "ce:8b:33:96:4b:22",
            "net5": "6e:aa:75:ef:2a:02",
            "net6": "62:b5:84:4b:39:b8",
            "net7": "4e:ee:fd:d3:a6:32",
            "net8": "56:da:5e:8b:d5:20",
            "net9": "0a:00:50:5d:55:46"
        },
        "leaf_1_0_3": {
            "net0": "0a:e0:01:cd:34:e9",
            "net1": "ae:fb:9f:b2:e3:da",
            "net10": "46:3a:49:10:ec:c1",
            "net11": "ae:1e:cf:71:94:28",
            "net12": "7e:6c:cc:0a:a0:1b",
            "net2": "4a:02:0d:2e:68:41",
            "net3": "9e:02:71:37:0d:8f",
            "net4": "02:3e:63:c8:33:11",
            "net5": "1a:e1:1e:11:54:42",
            "net6": "1e:57:a3:cd:e4:ea",
            "net7": "82:bd:45:8d:03:b3",
            "net8": "22:6f:e9:c0:23:4b",
            "net9": "7e:d9:f2:67:95:9d"
        },
        "leaf_1_0_4": {
            "net0": "be:4d:8a:9b:d7:bc",
            "net1": "ba:30:73:0a:13:44",
            "net10": "76:9d:37:0f:f1:8c",
            "net11": "22:6e:ea:5e:81:5c",
            "net12": "42:b3:cb:69:b7:8a",
            "net2": "be:65:5b:05:4c:51",
            "net3": "6a:57:ad:9a:45:54",
            "net4": "32:a7:e9:50:55:73",
            "net5": "62:52:9b:c9:d2:05",
            "net6": "ea:1c:d6:df:a4:e9",
            "net7": "56:a2:21:d5:7d:b7",
            "net8": "76:2b:38:e4:8b:84",
            "net9": "6e:eb:2b:cc:85:6b"
        },
        "leaf_1_0_5": {
            "net0": "6e:0b:26:ac:dc:a3",
            "net1": "7a:b4:ea:e6:4b:c3",
            "net10": "de:86:60:f3:f9:9c",
            "net11": "de:8a:e9:61:f9:1b",
            "net12": "0a:6c:0f:cf:0e:f5",
            "net2": "c6:84:f0:e9:14:54",
            "net3": "5e:66:5b:10:45:71",
            "net4": "7a:d5:fa:63:34:7f",
            "net5": "0e:7f:d1:5e:4f:ec",
            "net6": "62:dc:ae:ec:b3:d5",
            "net7": "16:42:62:2a:c3:47",
            "net8": "ba:0e:66:39:2e:76",
            "net9": "76:c5:13:02:4e:c7"
        },
        "leaf_1_0_6": {
            "net0": "be:65:86:85:9b:44",
            "net1": "32:97:fd:6a:a7:40",
            "net10": "46:b9:09:81:0e:53",
            "net11": "8e:d4:2c:d5:ae:f6",
            "net12": "f6:98:af:5e:45:24",
            "net2": "76:9f:89:b2:a8:9b",
            "net3": "16:7a:cd:0b:e6:cf",
            "net4": "4a:3b:de:fe:a2:e2",
            "net5": "ee:2a:19:d4:6a:76",
            "net6": "92:54:b5:ac:f0:44",
            "net7": "62:45:f1:52:eb:7c",
            "net8": "fe:77:7d:85:a9:46",
            "net9": "ea:d8:72:11:16:64"
        },
        "leaf_1_0_7": {
            "net0": "36:60:cc:5e:23:25",
            "net1": "16:36:52:e1:dc:91",
            "net10": "62:b4:00:07:7c:ee",
            "net11": "3a:0f:d9:01:bc:4b",
            "net12": "b2:d6:a2:70:34:8b",
            "net2": "5a:f9:8e:e4:79:42",
            "net3": "26:23:ce:4f:30:a3",
            "net4": "d2:6e:fb:2f:71:3e",
            "net5": "de:bf:f0:5b:79:df",
            "net6": "8a:df:e5:ae:12:b7",
            "net7": "1e:5f:8e:24:aa:08",
            "net8": "fe:ad:93:2c:59:b7",
            "net9": "de:6b:29:5e:99:02"
        },
        "leaf_1_0_8": {
            "net0": "86:6c:12:96:90:04",
            "net1": "3a:55:17:04:80:88",
            "net10": "56:5f:df:62:19:e1",
            "net11": "fa:28:f7:7f:03:8e",
            "net12": "c6:c4:3e:be:aa:89",
            "net2": "16:2f:42:63:77:ed",
            "net3": "92:c8:b7:01:ee:73",
            "net4": "aa:24:e9:a3:05:f0",
            "net5": "46:fa:60:56:ed:94",
            "net6": "56:2f:d8:cf:7d:6e",
            "net7": "4a:08:87:5d:ca:21",
            "net8": "fe:0f:9b:dd:ef:fb",
            "net9": "42:d9:ce:93:46:9b"
        },
        "leaf_1_0_9": {
            "net0": "22:b0:0b:ae:99:e3",
            "net1": "1a:f0:e0:e8:56:17",
            "net10": "46:ff:20:bc:39:5e",
            "net11": "b2:fe:4d:89:e4:c8",
            "net12": "42:78:9f:05:65:7b",
            "net2": "9a:cd:bf:bd:48:93",
            "net3": "76:5d:12:18:ad:81",
            "net4": "ee:46:84:86:d1:91",
            "net5": "da:03:4e:5d:f6:3c",
            "net6": "b2:02:06:80:de:e5",
            "net7": "a2:bb:ee:ee:9e:2d",
            "net8": "0a:50:76:a6:1a:b0",
            "net9": "d2:d0:88:74:de:43"
        },
        "leaf_2_0_1": {
            "net0": "d6:61:8d:ac:a3:4c",
            "net1": "b6:74:ad:b3:85:2f",
            "net10": "da:d1:59:5e:9a:00",
            "net11": "fa:2f:d4:93:f9:15",
            "net12": "fe:97:3f:1e:ad:75",
            "net2": "32:d1:63:0e:fa:fc",
            "net3": "4e:dd:9d:a0:63:ee",
            "net4": "b6:d1:91:89:82:87",
            "net5": "0e:77:e1:11:06:ef",
            "net6": "4a:0d:95:13:d6:cb",
            "net7": "36:37:c5:0e:82:42",
            "net8": "3a:06:68:e8:94:87",
            "net9": "8e:7a:96:e0:b8:cb"
        },
        "leaf_2_0_10": {
            "net0": "22:34:a3:54:e6:0f",
            "net1": "8e:52:d2:ce:8f:5b",
            "net10": "6a:44:eb:58:aa:5d",
            "net11": "c2:0a:c2:b1:95:8b",
            "net12": "26:a4:9b:4f:3d:b1",
            "net2": "66:5c:81:6a:18:42",
            "net3": "6e:aa:69:3f:4a:8b",
            "net4": "de:d1:40:46:57:73",
            "net5": "7a:de:39:96:af:64",
            "net6": "36:b8:7f:bb:6f:91",
            "net7": "1a:e6:d9:a4:a6:01",
            "net8": "d6:0c:29:c4:8c:6d",
            "net9": "52:c2:13:52:4d:f6"
        },
        "leaf_2_0_11": {
            "net0": "4e:b0:8b:1a:64:b8",
            "net1": "36:5c:73:d6:dd:ff",
            "net10": "d2:23:9f:d9:37:5f",
            "net11": "6e:c7:3b:04:58:2a",
            "net12": "de:f4:cd:a3:f6:c1",
            "net2": "32:7e:0c:a5:46:06",
            "net3": "4e:73:38:70:9b:55",
            "net4": "aa:7a:f8:e3:75:82",
            "net5": "ba:a6:29:a3:fe:12",
            "net6": "c2:c0:0e:69:9c:9c",
            "net7": "d2:42:27:84:bd:ef",
            "net8": "ee:a6:bc:d2:e8:6c",
            "net9": "c2:a4:53:3e:7f:09"
        },
        "leaf_2_0_12": {
            "net0": "3e:7c:94:24:13:f2",
            "net1": "96:a2:2f:ce:8a:45",
            "net10": "fa:53:45:b7:71:8e",
            "net11": "d2:74:6d:a3:de:45",
            "net12": "22:8c:da:aa:1a:7a",
            "net2": "da:e6:82:98:19:7c",
            "net3": "06:15:67:9a:45:99",
            "net4": "8a:40:77:c0:fa:ce",
            "net5": "aa:ad:be:ed:7c:d4",
            "net6": "3e:5d:40:d4:a7:77",
            "net7": "ae:0d:cf:57:d4:8c",
            "net8": "76:89:9c:d7:c2:4e",
            "net9": "2a:3c:ae:20:d7:dc"
        },
        "leaf_2_0_2": {
            "net0": "fe:57:ce:52:07:25",
            "net1": "ca:b6:7b:3d:45:69",
            "net10": "f6:24:64:77:32:74",
            "net11": "be:ce:b7:69:e5:b6",
            "net12": "ca:be:ad:dc:9e:f2",
            "net2": "12:dc:c6:d5:40:b6",
            "net3": "de:df:a7:e3:d1:eb",
            "net4": "1a:b1:6a:db:d7:1c",
            "net5": "ca:19:33:74:f8:35",
            "net6": "96:b6:13:01:7d:c4",
            "net7": "be:95:bc:ac:c0:79",
            "net8": "6e:6b:38:dc:b0:f1",
            "net9": "36:92:6e:56:c8:b0"
        },
        "leaf_2_0_3": {
            "net0": "3e:cc:2b:88:ae:7f",
            "net1": "e2:f2:77:f0:40:1c",
            "net10": "26:38:69:37:91:85",
            "net11": "ca:34:60:3e:54:42",
            "net12": "02:2d:cf:3b:d3:a8",
            "net2": "e2:3f:44:9c:a5:5d",
            "net3": "22:e5:d7:aa:3a:2f",
            "net4": "86:a0:3c:1a:34:24",
            "net5": "96:d0:66:36:ab:7c",
            "net6": "f2:f8:31:91:c5:97",
            "net7": "22:66:61:2a:0e:ef",
            "net8": "ba:5d:95:7f:65:d2",
            "net9": "3e:1f:9e:51:ac:3e"
        },
        "leaf_2_0_4": {
            "net0": "c6:82:fd:88:19:87",
            "net1": "9e:c9:96:79:ab:d8",
            "net10": "62:9f:b8:e1:cf:df",
            "net11": "5a:0e:e3:6f:c6:77",
            "net12": "aa:01:5f:b1:a1:72",
            "net2": "2e:cc:c9:8b:5c:dc",
            "net3": "a6:84:21:ff:02:d5",
            "net4": "7e:49:c5:d1:88:fb",
            "net5": "1e:2d:97:cb:ed:5e",
            "net6": "3e:7b:00:24:a2:b6",
            "net7": "d2:f6:08:5a:22:ec",
            "net8": "be:d8:b1:03:61:53",
            "net9": "aa:1f:67:9a:38:7f"
        },
        "leaf_2_0_5": {
            "net0": "36:1c:55:9a:a1:43",
            "net1": "a6:7b:60:79:94:bb",
            "net10": "c2:17:cf:19:58:ca",
            "net11": "ba:31:00:a4:0d:39",
            "net12": "8a:91:14:4c:b0:68",
            "net2": "32:2d:b5:22:bd:ca",
            "net3": "c2:ba:fc:c1:98:79",
            "net4": "6a:50:7d:7a:70:c7",
            "net5": "96:93:a4:2a:06:cc",
            "net6": "7e:f4:6c:72:79:71",
            "net7": "4a:21:93:f9:6a:bd",
            "net8": "ba:61:32:aa:85:29",
            "net9": "12:d3:de:49:d0:6a"
        },
        "leaf_2_0_6": {
            "net0": "c2:69:b4:23:d1:8c",
            "net1": "aa:22:11:a2:c4:5c",
            "net10": "2a:b9:02:a8:13:34",
            "net11": "26:c9:c9:cc:83:4c",
            "net12": "5a:97:65:bc:56:ea",
            "net2": "8e:06:e8:32:25:84",
            "net3": "ae:8d:ff:09:5a:87",
            "net4": "fa:e8:86:eb:40:1d",
            "net5": "b6:94:2c:bc:32:16",
            "net6": "ce:14:0c:02:dd:e3",
            "net7": "c2:97:2d:72:22:d7",
            "net8": "9a:d5:bb:96:a3:fd",
            "net9": "36:a7:13:c8:4a:b2"
        },
        "leaf_2_0_7": {
            "net0": "1a:31:51:8f:51:de",
            "net1": "1e:5f:b0:a2:b1:a7",
            "net10": "6a:dd:5f:a3:90:f6",
            "net11": "32:cd:b2:75:88:c3",
            "net12": "a2:cd:27:14:a2:86",
            "net2": "46:c0:60:73:ef:bc",
            "net3": "ce:18:4e:2e:d4:41",
            "net4": "22:c1:ad:0e:aa:fd",
            "net5": "62:2d:ba:8a:c1:c9",
            "net6": "62:54:0f:a9:3f:a0",
            "net7": "2e:c1:df:6b:0f:61",
            "net8": "6a:80:85:34:08:f8",
            "net9": "d2:e1:53:78:c6:f2"
        },
        "leaf_2_0_8": {
            "net0": "0a:5f:3a:6d:26:f9",
            "net1": "f2:a0:0a:82:71:4d",
            "net10": "12:6c:9f:b8:1a:81",
            "net11": "ee:c1:18:08:03:d7",
            "net12": "0e:1f:ea:74:78:c8",
            "net2": "5a:73:cf:66:ae:ae",
            "net3": "f2:d4:60:13:a9:18",
            "net4": "c6:d1:2e:64:06:71",
            "net5": "5a:23:07:bc:10:6b",
            "net6": "e6:bf:0a:af:06:e0",
            "net7": "ca:1d:1a:9e:01:18",
            "net8": "5a:80:a2:2e:20:6e",
            "net9": "3e:0f:55:8d:1a:f3"
        },
        "leaf_2_0_9": {
            "net0": "0e:15:7c:a5:be:26",
            "net1": "7e:f2:18:fc:68:20",
            "net10": "1a:d8:da:53:c5:b9",
            "net11": "da:24:03:f6:41:1c",
            "net12": "d2:5c:62:fe:bd:e0",
            "net2": "c2:a9:c4:12:a8:67",
            "net3": "3e:40:ce:59:87:34",
            "net4": "82:55:04:80:d9:be",
            "net5": "b2:45:31:eb:39:03",
            "net6": "36:51:32:41:b6:92",
            "net7": "86:0e:02:c0:d3:3d",
            "net8": "a2:89:a9:d9:4a:56",
            "net9": "b2:55:f3:77:b7:78"
        },
        "spine_1_1_1": {
            "net0": "b6:9b:ad:9a:a0:1d",
            "net1": "be:12:29:6b:82:86",
            "net10": "22:b2:c8:d1:a2:77",
            "net11": "1a:ce:71:61:f8:6a",
            "net12": "ce:f1:a9:6c:62:5d",
            "net13": "66:f2:93:8e:dd:81",
            "net14": "c6:56:ed:24:bc:8b",
            "net15": "8a:7e:64:b8:69:fc",
            "net16": "ca:f6:45:ec:84:9d",
            "net17": "ae:97:3d:78:d5:de",
            "net18": "6a:39:6a:40:51:cb",
            "net19": "c2:c8:cb:a5:3f:04",
            "net2": "2e:82:4f:0d:bb:c5",
            "net20": "6a:d5:01:19:a6:35",
            "net21": "42:00:2e:92:92:99",
            "net22": "ce:49:ba:69:b4:a0",
            "net23": "16:51:8e:25:01:a9",
            "net3": "ba:7e:41:0e:43:fb",
            "net4": "86:ff:7a:ba:83:e6",
            "net5": "66:36:f1:00:27:e9",
            "net6": "8e:a0:65:e4:b6:20",
            "net7": "62:c0:d7:b8:f7:78",
            "net8": "2e:60:1f:f4:2d:08",
            "net9": "b2:59:57:29:5c:cb"
        },
        "spine_1_1_10": {
            "net0": "42:3a:2e:b1:d7:79",
            "net1": "12:69:51:11:84:ba",
            "net10": "26:8d:b7:77:d3:98",
            "net11": "7e:f1:10:ff:13:ae",
            "net12": "2e:76:56:3f:a0:6a",
            "net13": "f6:a4:f1:b4:4a:23",
            "net14": "12:9d:e9:40:ce:5a",
            "net15": "7e:30:a2:d5:e2:ce",
            "net16": "22:f9:22:f3:11:65",
            "net17": "7a:4b:42:a9:21:c6",
            "net18": "ea:d9:c0:37:bc:ab",
            "net19": "e6:ea:fa:b3:18:75",
            "net2": "2a:fb:1a:57:90:b2",
            "net20": "42:a4:b1:84:e5:13",
            "net21": "fa:7e:a2:bc:1b:b3",
            "net22": "a6:e7:fa:73:3b:24",
            "net23": "ce:64:51:cd:4d:85",
            "net3": "ce:39:2b:f5:aa:b6",
            "net4": "e6:c8:e5:83:8a:6f",
            "net5": "ee:ef:fc:73:2c:98",
            "net6": "32:d7:b5:7c:35:fe",
            "net7": "ae:ff:be:4b:9e:4f",
            "net8": "5a:00:ad:ad:f2:f2",
            "net9": "ee:06:05:e0:52:e0"
        },
        "spine_1_1_11": {
            "net0": "5a:78:81:99:50:bb",
            "net1": "ca:8f:6a:95:82:dc",
            "net10": "52:1f:23:57:ec:b9",
            "net11": "ce:1f:d2:f8:2b:96",
            "net12": "aa:46:6a:0b:7e:9a",
            "net13": "7a:9c:0c:d6:40:25",
            "net14": "4e:41:b0:b2:fc:ea",
            "net15": "1e:46:1b:bc:0a:bb",
            "net16": "1a:9d:95:55:2a:5c",
            "net17": "12:66:f0:0e:61:ca",
            "net18": "3e:c1:37:45:fc:95",
            "net19": "b6:bc:7b:8a:13:24",
            "net2": "62:e4:2e:7a:47:0e",
            "net20": "62:e8:75:33:e8:3a",
            "net21": "72:21:f2:99:31:65",
            "net22": "76:d2:9e:0d:60:d5",
            "net23": "8e:0a:02:b9:85:5a",
            "net3": "36:eb:46:99:41:f3",
            "net4": "2e:c9:d2:c8:a6:2d",
            "net5": "ae:5c:ff:ca:a6:37",
            "net6": "fe:87:dc:92:ba:fd",
            "net7": "4a:2d:db:9b:40:45",
            "net8": "ae:b9:f6:72:99:d7",
            "net9": "16:9a:e0:92:77:55"
        },
        "spine_1_1_12": {
            "net0": "2a:e6:78:38:b0:00",
            "net1": "42:87:8c:0b:0f:29",
            "net10": "a2:e9:06:d3:36:21",
            "net11": "42:70:1d:75:5f:24",
            "net12": "e2:07:81:2b:43:a5",
            "net13": "fa:ed:33:9c:1f:ef",
            "net14": "36:7d:1b:73:34:46",
            "net15": "fe:4e:85:7b:bd:5d",
            "net16": "92:f3:03:f8:04:f0",
            "net17": "7a:25:a4:30:ed:ad",
            "net18": "fe:63:a3:14:9a:bb",
            "net19": "2a:0a:46:5f:e6:3b",
            "net2": "66:1b:23:d2:d3:51",
            "net20": "d2:b7:cf:fb:18:21",
            "net21": "22:fb:57:1c:24:78",
            "net22": "a6:c7:0a:db:ff:bf",
            "net23": "86:7f:d8:cc:d1:e8",
            "net3": "12:84:b4:11:c8:8f",
            "net4": "9a:44:59:23:f3:cf",
            "net5": "0e:88:40:82:d0:65",
            "net6": "32:fa:9d:9d:cf:c0",
            "net7": "66:83:f7:6d:c9:3a",
            "net8": "8a:1c:76:3c:4f:42",
            "net9": "02:f8:40:aa:d5:6b"
        },
        "spine_1_1_2": {
            "net0": "16:80:4d:69:75:2a",
            "net1": "5e:82:f6:af:c4:dc",
            "net10": "be:46:d4:f6:ed:c8",
            "net11": "ee:33:8c:cd:c9:bc",
            "net12": "8a:3d:1c:4f:22:44",
            "net13": "1a:53:34:96:7d:64",
            "net14": "16:95:53:3a:3c:5e",
            "net15": "86:85:01:44:dc:87",
            "net16": "1e:ce:3c:75:bb:b7",
            "net17": "5a:14:fc:1f:38:13",
            "net18": "5e:cf:c9:82:fa:96",
            "net19": "be:0b:95:6e:ff:cd",
            "net2": "ea:80:14:f0:e4:34",
            "net20": "82:f6:59:e0:c1:9b",
            "net21": "9e:23:af:58:3d:27",
            "net22": "22:09:34:31:af:76",
            "net23": "3e:f4:b0:e4:20:a8",
            "net3": "56:5c:29:83:39:d6",
            "net4": "66:a7:76:f3:ed:66",
            "net5": "2e:58:35:6f:94:c2",
            "net6": "8a:71:c9:ef:29:55",
            "net7": "52:6b:28:86:10:62",
            "net8": "6e:b6:8b:86:6b:88",
            "net9": "0a:7a:3a:23:c6:3f"
        },
        "spine_1_1_3": {
            "net0": "3e:a4:1c:ec:17:bd",
            "net1": "4e:80:f3:bd:a1:4c",
            "net10": "2e:6c:ee:f1:26:e4",
            "net11": "ee:57:2c:1e:29:d6",
            "net12": "1a:c7:3f:d3:e5:22",
            "net13": "ce:cd:6f:c3:54:dc",
            "net14": "be:3c:57:39:b2:22",
            "net15": "3a:90:84:da:59:48",
            "net16": "3e:63:d7:65:31:2b",
            "net17": "62:f4:c8:5f:bb:4d",
            "net18": "e2:fc:a4:c5:db:53",
            "net19": "5a:30:c6:8c:80:d8",
            "net2": "86:bb:e1:44:f6:cb",
            "net20": "1a:31:c8:26:90:9d",
            "net21": "86:80:34:71:fe:51",
            "net22": "8a:7f:3b:ac:13:06",
            "net23": "6e:75:bd:f6:5c:70",
            "net3": "ba:c9:91:74:23:38",
            "net4": "1e:c4:03:62:8f:f9",
            "net5": "22:b8:ec:61:c6:b9",
            "net6": "ee:d0:9d:48:72:df",
            "net7": "62:c1:f2:d4:36:7a",
            "net8": "1e:09:5f:3a:22:d7",
            "net9": "7e:20:54:4b:92:55"
        },
        "spine_1_1_4": {
            "net0": "3a:a5:65:be:b5:1f",
            "net1": "3e:3f:81:e7:ae:1a",
            "net10": "2e:90:8d:c4:f0:de",
            "net11": "32:05:cf:36:f0:74",
            "net12": "4e:0a:36:d6:6d:18",
            "net13": "4e:01:45:cf:08:ae",
            "net14": "1e:18:0e:89:72:25",
            "net15": "fe:7c:83:73:34:45",
            "net16": "ee:30:70:f0:7b:8d",
            "net17": "5e:9c:84:cc:a7:78",
            "net18": "fa:f8:83:20:f5:9e",
            "net19": "42:94:73:34:93:84",
            "net2": "ca:41:1b:9a:8e:ee",
            "net20": "16:d4:58:45:ec:b9",
            "net21": "26:53:c9:e4:35:93",
            "net22": "8e:b2:cb:76:02:9b",
            "net23": "aa:e8:57:ac:22:73",
            "net3": "ae:1e:1a:28:74:43",
            "net4": "1e:7c:13:46:7d:15",
            "net5": "16:7f:cf:a1:a3:ad",
            "net6": "aa:e5:c8:1e:77:5d",
            "net7": "ce:b5:6a:87:e6:a1",
            "net8": "36:88:f8:2c:fb:29",
            "net9": "36:11:0d:43:88:0f"
        },
        "spine_1_1_5": {
            "net0": "8e:e9:73:87:c0:27",
            "net1": "76:ac:f0:b7:b0:9d",
            "net10": "8e:86:6f:72:07:c9",
            "net11": "6e:37:92:97:92:13",
            "net12": "be:19:f5:a9:48:c6",
            "net13": "b6:c8:d7:6e:d4:5b",
            "net14": "fa:ed:07:51:3d:4e",
            "net15": "82:22:c7:e5:8e:96",
            "net16": "ae:e7:d0:ac:aa:40",
            "net17": "1e:dc:26:89:e8:3a",
            "net18": "f2:08:b4:44:c7:cc",
            "net19": "22:1c:ef:56:9c:9f",
            "net2": "32:e8:42:74:01:b6",
            "net20": "ca:2b:67:f4:b4:55",
            "net21": "5a:31:39:0c:7e:56",
            "net22": "d6:b9:11:86:89:eb",
            "net23": "d6:9e:e7:4a:72:c9",
            "net3": "62:1e:02:8e:a1:db",
            "net4": "ca:45:ec:f2:21:18",
            "net5": "8e:b9:04:bd:23:ae",
            "net6": "66:94:c2:4a:90:00",
            "net7": "da:1d:d7:3b:a3:74",
            "net8": "06:90:4c:7c:28:34",
            "net9": "be:2a:96:2e:2e:8e"
        },
        "spine_1_1_6": {
            "net0": "c2:9b:4e:51:eb:d2",
            "net1": "96:11:bc:13:fd:7c",
            "net10": "22:d8:52:15:b2:f7",
            "net11": "16:1e:73:e9:32:16",
            "net12": "32:2e:19:12:78:01",
            "net13": "fe:59:15:f4:e5:de",
            "net14": "ee:46:14:f7:f2:f5",
            "net15": "8a:c1:df:c1:ab:c3",
            "net16": "46:ce:e8:17:2a:3d",
            "net17": "92:9a:f5:8a:35:6c",
            "net18": "fa:4e:3c:b3:75:b9",
            "net19": "46:ab:ed:14:de:5f",
            "net2": "26:f1:ff:a8:8b:ce",
            "net20": "ea:9b:8e:a2:55:80",
            "net21": "46:0b:d3:3a:24:cd",
            "net22": "4a:0a:02:91:28:a7",
            "net23": "5e:35:8e:e0:48:0f",
            "net3": "22:a2:bc:dc:e6:a9",
            "net4": "26:e9:4d:25:9e:88",
            "net5": "4a:e6:79:f7:24:60",
            "net6": "0e:5d:53:a9:c9:a1",
            "net7": "e2:5b:ca:01:8c:f0",
            "net8": "62:3c:65:b5:98:7b",
            "net9": "72:28:d7:bc:2b:7f"
        },
        "spine_1_1_7": {
            "net0": "3a:6b:b1:30:fa:52",
            "net1": "1a:36:2c:92:2e:65",
            "net10": "7a:c1:57:c3:91:d4",
            "net11": "42:93:92:f6:51:58",
            "net12": "5a:37:4d:a5:79:c5",
            "net13": "ee:04:8a:3b:80:49",
            "net14": "82:9b:59:a9:be:96",
            "net15": "5e:be:aa:85:e0:5d",
            "net16": "26:e6:80:94:45:56",
            "net17": "3a:4c:ee:4a:0f:87",
            "net18": "56:33:99:e7:b6:c3",
            "net19": "46:0c:77:bb:92:a7",
            "net2": "46:a8:8e:fe:8d:d4",
            "net20": "5e:c2:eb:ce:ec:d5",
            "net21": "9a:bb:83:02:bb:55",
            "net22": "ba:1c:24:c3:31:4c",
            "net23": "8e:a5:19:78:76:cf",
            "net3": "16:55:f5:6b:b3:b3",
            "net4": "c2:b8:69:e2:19:d4",
            "net5": "b2:11:3b:c4:42:2f",
            "net6": "46:2f:d1:ed:4f:cf",
            "net7": "3a:78:06:de:47:42",
            "net8": "5e:c7:db:56:6d:3a",
            "net9": "82:60:05:4b:20:03"
        },
        "spine_1_1_8": {
            "net0": "2a:c1:2e:1e:e3:bc",
            "net1": "02:24:9a:af:d8:fe",
            "net10": "26:ef:80:53:33:04",
            "net11": "da:53:7a:a4:5a:48",
            "net12": "22:c1:e6:ba:f2:89",
            "net13": "32:89:46:83:df:54",
            "net14": "c6:31:69:c5:98:08",
            "net15": "8e:73:a3:38:dd:74",
            "net16": "ba:4e:9e:10:b3:ff",
            "net17": "9e:58:ab:bb:4f:fa",
            "net18": "a6:2a:cf:11:a2:cc",
            "net19": "ee:62:1c:ba:3e:79",
            "net2": "f2:d5:a7:7b:ac:e0",
            "net20": "46:7b:65:f8:19:19",
            "net21": "aa:ec:2a:cc:c7:88",
            "net22": "66:01:52:e3:f4:3c",
            "net23": "46:bc:8b:0e:ae:28",
            "net3": "62:93:7e:45:00:b0",
            "net4": "6a:04:8f:6d:24:50",
            "net5": "92:25:64:3c:9b:81",
            "net6": "c6:13:cf:16:72:f3",
            "net7": "2a:5b:f6:d0:8d:81",
            "net8": "9a:ea:c9:94:b5:6e",
            "net9": "06:52:b5:46:ef:b0"
        },
        "spine_1_1_9": {
            "net0": "7a:af:21:7a:0d:88",
            "net1": "fa:e3:3b:24:be:ee",
            "net10": "42:52:e0:e4:b9:35",
            "net11": "b6:d2:78:bb:b7:66",
            "net12": "32:8e:24:74:aa:ea",
            "net13": "0a:cc:8b:1b:5c:bc",
            "net14": "a6:f2:eb:4b:f9:c0",
            "net15": "02:cd:e7:0f:0e:d9",
            "net16": "82:f5:58:45:c9:fa",
            "net17": "8e:2b:05:9a:25:d0",
            "net18": "02:44:b1:c3:c4:79",
            "net19": "1a:a8:83:ec:a1:10",
            "net2": "5a:e1:ac:05:56:eb",
            "net20": "62:1b:60:7e:39:17",
            "net21": "56:fa:5b:99:52:36",
            "net22": "da:df:54:0f:fb:1d",
            "net23": "9a:40:6d:a7:11:d2",
            "net3": "a6:fb:79:a0:8f:46",
            "net4": "aa:0f:85:7e:56:db",
            "net5": "26:79:3e:b1:c8:08",
            "net6": "1a:db:39:9d:1b:cc",
            "net7": "46:1f:66:fe:7e:57",
            "net8": "62:cf:da:53:8e:47",
            "net9": "7e:fd:3d:80:fe:5b"
        },
        "spine_2_1_1": {
            "net0": "ae:1d:b3:95:fd:c4",
            "net1": "fe:b2:ca:fe:80:ae",
            "net10": "b2:da:43:96:44:d4",
            "net11": "f6:29:89:e1:95:03",
            "net12": "42:40:04:75:68:ae",
            "net13": "9e:a1:c6:a6:22:12",
            "net14": "42:52:b1:f8:19:ab",
            "net15": "9e:c3:07:f6:c0:9b",
            "net16": "7a:3b:5f:7a:18:ed",
            "net17": "42:b6:5f:1e:80:4a",
            "net18": "52:8d:93:0b:41:f7",
            "net19": "6e:36:55:97:5b:33",
            "net2": "d6:18:39:29:68:8b",
            "net20": "62:94:cd:b7:16:19",
            "net21": "9e:0d:65:e3:79:89",
            "net22": "da:b4:89:ae:0c:5d",
            "net23": "46:5b:1d:0b:ca:88",
            "net3": "c6:1f:2c:23:df:e3",
            "net4": "e2:a1:3e:7a:ad:2c",
            "net5": "f2:8a:d0:56:9f:85",
            "net6": "42:72:7b:5a:ef:15",
            "net7": "a6:48:e1:fe:cb:4a",
            "net8": "56:0e:3b:45:a0:9b",
            "net9": "da:a9:cb:87:c0:d7"
        },
        "spine_2_1_10": {
            "net0": "e2:b5:3b:6e:70:bc",
            "net1": "56:22:1b:f7:bd:18",
            "net10": "e2:60:4a:7d:44:a1",
            "net11": "12:1b:79:3d:99:2f",
            "net12": "26:ee:1c:9f:19:f9",
            "net13": "ea:44:54:6d:95:41",
            "net14": "9a:b5:14:41:b5:ac",
            "net15": "f2:8a:c8:33:63:2f",
            "net16": "82:d5:4a:c0:c0:56",
            "net17": "7e:41:88:de:a7:76",
            "net18": "6e:cc:23:78:d6:6d",
            "net19": "1e:56:77:26:11:72",
            "net2": "46:65:c8:dc:e8:7f",
            "net20": "02:e2:5c:40:65:b1",
            "net21": "2a:2b:06:d0:51:6c",
            "net22": "06:90:a3:fc:bf:ba",
            "net23": "1a:db:2e:5b:27:18",
            "net3": "42:db:54:e1:3e:9d",
            "net4": "b2:fb:de:8b:d1:fa",
            "net5": "1e:7b:2c:9a:ce:f9",
            "net6": "6a:5e:13:bc:74:ad",
            "net7": "6a:d2:cf:6d:90:87",
            "net8": "96:a4:d3:1c:61:01",
            "net9": "9e:bd:98:7b:f3:5e"
        },
        "spine_2_1_11": {
            "net0": "46:ae:59:ae:82:68",
            "net1": "d2:dc:2e:79:fb:9e",
            "net10": "a6:ed:28:64:f9:7b",
            "net11": "62:84:3c:a2:ef:d2",
            "net12": "96:9f:13:d1:80:f4",
            "net13": "d6:23:45:48:7b:a6",
            "net14": "fe:24:91:1b:d9:49",
            "net15": "b2:0e:31:4d:63:47",
            "net16": "da:84:e7:e3:6f:33",
            "net17": "52:48:f5:b0:40:53",
            "net18": "be:b1:32:86:2e:f7",
            "net19": "76:71:af:c2:ca:54",
            "net2": "e2:bf:67:eb:02:e2",
            "net20": "02:2f:e2:b2:23:d5",
            "net21": "86:eb:0c:2a:aa:43",
            "net22": "6e:2c:3d:95:2a:2d",
            "net23": "f6:39:0e:8d:67:0c",
            "net3": "26:8e:61:42:97:20",
            "net4": "32:b0:bc:0e:88:b0",
            "net5": "6a:af:54:e9:b0:f6",
            "net6": "3e:83:8e:85:67:28",
            "net7": "7a:9a:b1:9b:cb:03",
            "net8": "aa:08:c4:66:25:be",
            "net9": "fe:f9:29:ec:46:e5"
        },
        "spine_2_1_12": {
            "net0": "26:f2:cd:54:22:af",
            "net1": "ba:74:2a:a7:e5:53",
            "net10": "e2:7d:32:80:ad:90",
            "net11": "a2:96:58:6f:27:0b",
            "net12": "9e:2f:f0:29:da:e4",
            "net13": "76:90:d9:b4:c6:97",
            "net14": "86:58:00:b8:b1:59",
            "net15": "0e:b6:86:54:37:e2",
            "net16": "1e:f6:6b:1a:7c:55",
            "net17": "ee:e3:bd:ca:3e:f8",
            "net18": "fa:17:ee:68:f5:8b",
            "net19": "d2:c6:e8:d3:35:ff",
            "net2": "3a:df:97:19:8a:f0",
            "net20": "ea:3f:bf:2c:56:e4",
            "net21": "da:9e:a3:f2:64:85",
            "net22": "6a:c2:77:2f:d7:26",
            "net23": "ca:fd:b2:7e:27:6c",
            "net3": "52:e4:51:ac:19:ab",
            "net4": "ae:cb:0b:df:5d:77",
            "net5": "ce:4b:c4:34:77:16",
            "net6": "ba:45:dd:ef:99:d8",
            "net7": "26:cc:a6:8d:6a:42",
            "net8": "ea:b8:b9:8f:31:b3",
            "net9": "72:18:77:75:b3:dd"
        },
        "spine_2_1_2": {
            "net0": "62:21:4b:7d:19:d6",
            "net1": "96:b9:d0:86:4c:45",
            "net10": "9a:52:16:20:5c:a7",
            "net11": "e2:b8:a8:d1:c5:b1",
            "net12": "52:9a:bb:f2:ce:b0",
            "net13": "7a:4c:93:43:09:cb",
            "net14": "16:98:57:4f:90:4c",
            "net15": "56:e7:ae:a3:07:ee",
            "net16": "a6:e4:f2:b8:88:2c",
            "net17": "0e:e4:cd:10:a4:0d",
            "net18": "fa:fb:81:c0:e0:32",
            "net19": "be:cf:3d:be:64:34",
            "net2": "ca:41:52:48:79:26",
            "net20": "62:1f:53:1b:0a:b4",
            "net21": "2a:f9:4c:0e:43:30",
            "net22": "fa:c4:a2:2b:82:c9",
            "net23": "72:fa:9e:fd:8c:44",
            "net3": "d2:b0:a7:20:c8:5b",
            "net4": "c2:40:77:ee:c8:78",
            "net5": "ee:ba:84:c6:42:5b",
            "net6": "c6:6e:1f:22:af:fe",
            "net7": "36:56:e8:50:ee:a7",
            "net8": "ae:13:31:d5:87:d9",
            "net9": "2a:44:0e:d8:66:2b"
        },
        "spine_2_1_3": {
            "net0": "2a:4e:fc:62:0f:6d",
            "net1": "b6:36:9d:fb:d8:ac",
            "net10": "2a:f8:8e:3b:87:1c",
            "net11": "de:ad:30:f8:89:d5",
            "net12": "ae:34:e8:51:97:05",
            "net13": "26:1c:30:03:01:2c",
            "net14": "b2:e2:aa:9a:74:66",
            "net15": "16:18:15:44:a7:d7",
            "net16": "de:f8:c7:6a:97:9a",
            "net17": "3e:46:17:b0:cc:c3",
            "net18": "4a:be:00:f7:0e:b4",
            "net19": "6e:2e:b1:3d:80:45",
            "net2": "1a:07:b9:a4:ec:32",
            "net20": "3e:1f:24:03:54:19",
            "net21": "de:55:e8:de:b5:e2",
            "net22": "62:0b:43:66:5c:2d",
            "net23": "6e:92:db:54:e5:be",
            "net3": "86:1f:11:65:e5:1b",
            "net4": "de:1a:ee:60:ac:2b",
            "net5": "1e:4f:9f:e9:eb:c9",
            "net6": "6e:7f:10:d6:c1:a5",
            "net7": "f2:09:ab:96:3f:6e",
            "net8": "de:01:e2:5e:49:9c",
            "net9": "fa:ed:6e:9d:fd:51"
        },
        "spine_2_1_4": {
            "net0": "8e:07:96:75:8a:25",
            "net1": "be:e8:e3:49:b9:a9",
            "net10": "ba:20:a3:46:45:9b",
            "net11": "e6:8d:64:a4:f2:43",
            "net12": "ea:f9:ab:e9:56:37",
            "net13": "5e:7f:f6:f0:e6:a0",
            "net14": "16:82:1d:bf:36:15",
            "net15": "86:e2:b0:e0:b2:33",
            "net16": "92:2a:58:07:88:da",
            "net17": "fa:04:e0:31:67:02",
            "net18": "7a:f7:11:86:ec:13",
            "net19": "82:43:a8:11:64:b6",
            "net2": "da:0d:9e:3b:be:07",
            "net20": "be:ee:43:a8:0d:53",
            "net21": "b2:31:7d:62:fa:e3",
            "net22": "da:27:54:97:01:95",
            "net23": "8e:95:2d:ac:e5:29",
            "net3": "ce:f3:8a:27:1d:06",
            "net4": "de:e2:49:de:6d:91",
            "net5": "de:2d:5e:c4:8b:74",
            "net6": "9e:00:d4:96:28:13",
            "net7": "8e:63:29:59:2a:58",
            "net8": "fe:91:d1:a6:64:87",
            "net9": "22:62:9d:99:42:a7"
        },
        "spine_2_1_5": {
            "net0": "e6:4e:17:84:98:a7",
            "net1": "8e:e7:e4:b1:d1:f4",
            "net10": "9e:6b:63:9b:e4:bb",
            "net11": "da:dd:c2:d7:78:68",
            "net12": "d2:7c:c7:c3:aa:96",
            "net13": "46:f0:17:ae:2d:91",
            "net14": "32:46:aa:d6:74:9d",
            "net15": "56:8f:f3:b1:42:58",
            "net16": "96:d4:1f:bc:f5:98",
            "net17": "76:4a:17:4f:b3:4a",
            "net18": "4e:32:2f:c2:a2:c3",
            "net19": "6e:ab:31:10:ff:67",
            "net2": "be:18:86:64:59:fe",
            "net20": "6e:b0:20:1f:46:2f",
            "net21": "82:de:6b:9e:bd:5a",
            "net22": "66:ac:62:5c:8d:a8",
            "net23": "96:f1:ef:47:cd:84",
            "net3": "5e:d2:8b:ad:41:e3",
            "net4": "4e:19:ab:29:d9:33",
            "net5": "9e:c1:35:ff:4f:e4",
            "net6": "82:f0:ce:94:c7:0a",
            "net7": "72:d2:6d:0f:b4:11",
            "net8": "5e:68:e9:d2:6f:14",
            "net9": "5e:01:de:e0:90:02"
        },
        "spine_2_1_6": {
            "net0": "1a:fb:a9:1a:9b:a6",
            "net1": "86:a6:bb:db:5f:d1",
            "net10": "32:d3:8f:fa:f8:af",
            "net11": "f6:fa:46:55:19:81",
            "net12": "8e:14:9c:67:3b:dd",
            "net13": "12:2e:5b:21:a7:cb",
            "net14": "ee:92:fb:f1:6a:6d",
            "net15": "86:1b:64:87:4d:06",
            "net16": "2a:ca:c8:b5:c9:ff",
            "net17": "0a:e8:84:df:1e:5a",
            "net18": "1a:bf:43:05:bd:02",
            "net19": "f2:36:d0:23:8c:a1",
            "net2": "3e:16:99:53:59:7e",
            "net20": "fe:b9:50:13:6a:c5",
            "net21": "be:13:fa:9c:64:ea",
            "net22": "d6:03:74:9d:9f:21",
            "net23": "aa:ce:95:34:0e:58",
            "net3": "c6:8b:10:63:f8:d9",
            "net4": "f6:4b:78:9f:74:94",
            "net5": "8e:4d:b4:88:cb:e8",
            "net6": "56:ff:c7:97:ff:33",
            "net7": "2e:14:9a:1a:68:36",
            "net8": "76:6e:01:db:26:a8",
            "net9": "ca:b9:ac:e3:00:1b"
        },
        "spine_2_1_7": {
            "net0": "e6:f3:bf:07:a9:e6",
            "net1": "ba:82:0d:f3:03:26",
            "net10": "9e:e9:69:6f:d6:f3",
            "net11": "12:ae:0b:f3:0e:1f",
            "net12": "2e:4c:1b:84:93:be",
            "net13": "f6:bc:1b:6e:9d:27",
            "net14": "06:0f:78:d2:69:ff",
            "net15": "de:b1:fa:f7:c8:7e",
            "net16": "3e:77:66:64:78:34",
            "net17": "be:1b:f2:18:71:ac",
            "net18": "4e:e2:4e:c6:7f:5f",
            "net19": "f2:ec:25:c9:60:1a",
            "net2": "9a:ca:fe:83:14:42",
            "net20": "46:8e:82:e8:4a:eb",
            "net21": "72:34:d5:3c:e0:c5",
            "net22": "92:dc:96:ca:5c:07",
            "net23": "9a:1e:53:fd:9b:38",
            "net3": "46:6c:22:89:f4:7c",
            "net4": "1a:c1:56:61:e2:39",
            "net5": "62:45:a6:2d:64:93",
            "net6": "d6:17:3f:f0:d5:e3",
            "net7": "7a:5a:b8:e0:6d:23",
            "net8": "4e:7e:f9:ff:f0:4e",
            "net9": "7e:14:c0:0e:ee:4d"
        },
        "spine_2_1_8": {
            "net0": "b2:04:e3:64:c7:d1",
            "net1": "f2:77:f1:74:fa:2b",
            "net10": "d2:aa:ac:f4:e3:e6",
            "net11": "ea:3f:b9:1d:20:0d",
            "net12": "de:4d:37:9c:62:0d",
            "net13": "9a:9f:0b:0d:ae:38",
            "net14": "3a:88:65:e0:4b:33",
            "net15": "22:aa:8f:45:03:77",
            "net16": "6a:50:25:1d:ae:e4",
            "net17": "4a:46:c5:99:84:42",
            "net18": "62:7f:25:c9:1c:46",
            "net19": "2a:fc:0e:f2:cf:46",
            "net2": "56:c2:ce:c0:31:d9",
            "net20": "6e:ce:d4:f9:6b:66",
            "net21": "ae:c3:b3:d3:9a:ee",
            "net22": "d2:cf:c1:7e:22:8d",
            "net23": "f2:0d:f9:90:1e:1a",
            "net3": "2a:c6:36:c3:12:ca",
            "net4": "1e:98:6d:85:92:3b",
            "net5": "e6:98:35:4a:4f:a6",
            "net6": "ba:be:b5:6e:c2:c7",
            "net7": "c2:27:af:05:30:87",
            "net8": "32:db:22:a4:24:57",
            "net9": "ae:52:ec:df:69:19"
        },
        "spine_2_1_9": {
            "net0": "be:01:c1:2d:a1:77",
            "net1": "fa:9d:04:e2:bb:6c",
            "net10": "aa:88:69:23:67:ea",
            "net11": "86:10:75:07:2e:41",
            "net12": "02:52:3b:7a:7e:6e",
            "net13": "52:52:54:62:be:b8",
            "net14": "46:82:e8:a1:eb:78",
            "net15": "36:22:9b:36:92:7f",
            "net16": "2a:db:87:6d:e0:c1",
            "net17": "b2:5c:f6:58:fb:e9",
            "net18": "6e:46:b5:b7:a8:f2",
            "net19": "72:66:21:c5:35:62",
            "net2": "46:4f:96:71:ac:97",
            "net20": "92:f0:ef:18:6d:d4",
            "net21": "3e:44:9a:77:70:9f",
            "net22": "32:08:31:00:c8:41",
            "net23": "8e:05:76:34:b7:67",
            "net3": "c6:5e:d0:2d:45:96",
            "net4": "be:7d:32:89:88:d3",
            "net5": "12:bd:3c:37:be:2f",
            "net6": "22:b1:9a:2d:0f:8f",
            "net7": "82:ea:31:35:5e:8e",
            "net8": "d6:2d:4b:26:04:ea",
            "net9": "1e:78:d6:1e:2b:e9"
        },
        "tof_1_2_1": {
            "net0": "7a:14:53:21:c9:02",
            "net1": "c2:a7:7a:6b:49:87",
            "net10": "da:18:46:bd:88:e5",
            "net11": "4e:35:1e:5d:41:70",
            "net12": "96:b1:6c:f3:7f:ed",
            "net13": "1e:9a:ce:c0:3b:2d",
            "net14": "fa:3e:98:19:75:62",
            "net15": "ae:41:c5:20:63:69",
            "net16": "46:e3:4f:3c:c1:b3",
            "net17": "be:cd:48:f5:c9:3c",
            "net18": "6e:6a:2e:a8:52:c6",
            "net19": "16:07:8a:af:46:0e",
            "net2": "ca:68:12:56:0e:90",
            "net20": "de:6a:14:5b:87:2e",
            "net21": "4a:41:6b:bc:1c:15",
            "net22": "e6:92:03:2a:03:b5",
            "net23": "36:75:4d:88:b9:f6",
            "net3": "7a:c5:a0:1a:ae:5b",
            "net4": "fe:28:04:e3:2f:f1",
            "net5": "f6:a2:89:a0:af:43",
            "net6": "8a:47:a4:8f:7e:b9",
            "net7": "f2:9c:6a:95:53:1d",
            "net8": "26:41:6a:d6:4e:ac",
            "net9": "aa:b7:04:1d:4d:42"
        },
        "tof_1_2_10": {
            "net0": "52:56:17:d9:be:95",
            "net1": "8a:20:38:df:8d:a3",
            "net10": "6a:8e:fa:97:cd:c4",
            "net11": "b6:f6:9f:82:de:81",
            "net12": "f2:b4:1b:cc:1f:b7",
            "net13": "4e:f9:84:31:6b:22",
            "net14": "9a:c4:ec:43:44:4d",
            "net15": "fa:b0:03:d0:4d:b3",
            "net16": "c2:55:e7:d0:a7:82",
            "net17": "e6:1a:e1:ae:79:46",
            "net18": "8a:d1:8c:4c:3f:e1",
            "net19": "82:dd:f4:c9:61:82",
            "net2": "e2:92:b8:ef:5e:0c",
            "net20": "5e:b2:1a:b8:30:a4",
            "net21": "82:9d:fb:85:84:9f",
            "net22": "f6:b8:fe:83:0b:3b",
            "net23": "2a:9d:80:a6:c2:7d",
            "net3": "7a:72:6d:18:3d:cf",
            "net4": "e6:1a:1d:7a:1a:ea",
            "net5": "e6:3d:ac:71:5f:fc",
            "net6": "da:de:4c:22:ab:27",
            "net7": "ce:7d:7d:8b:1c:36",
            "net8": "7a:fe:2a:64:0a:39",
            "net9": "ca:8d:b8:c8:a2:89"
        },
        "tof_1_2_11": {
            "net0": "e6:e4:52:e4:1a:46",
            "net1": "b2:81:5e:6e:af:8a",
            "net10": "c6:69:92:1d:77:00",
            "net11": "4e:25:11:4f:f4:2c",
            "net12": "06:0f:27:48:6d:18",
            "net13": "8a:eb:33:8a:e3:80",
            "net14": "d2:d4:d0:1a:fa:c6",
            "net15": "42:b9:2a:a5:ef:82",
            "net16": "b6:7b:88:cd:1a:89",
            "net17": "12:31:36:5b:ba:d4",
            "net18": "8a:17:1e:e1:de:a3",
            "net19": "66:63:da:b5:f0:58",
            "net2": "46:b1:04:c5:ee:35",
            "net20": "2a:bf:d5:b2:7a:86",
            "net21": "26:e0:e2:ff:ae:32",
            "net22": "06:a5:ad:b0:f4:ed",
            "net23": "f2:a5:c8:e6:55:93",
            "net3": "c6:ff:dc:d7:09:5b",
            "net4": "06:75:10:7c:f3:13",
            "net5": "86:aa:38:ab:4c:98",
            "net6": "aa:05:20:58:8c:06",
            "net7": "1e:ad:e0:ed:ef:85",
            "net8": "ee:9c:72:bf:7e:e2",
            "net9": "6a:8e:88:d6:19:56"
        },
        "tof_1_2_12": {
            "net0": "36:ff:0c:f2:71:52",
            "net1": "ba:fb:f0:ef:1e:da",
            "net10": "36:55:65:68:5f:78",
            "net11": "3a:f1:53:52:0b:9d",
            "net12": "ea:e8:8d:02:75:2b",
            "net13": "fa:cc:b1:ef:5b:b0",
            "net14": "22:ab:ae:62:f8:5d",
            "net15": "ba:c1:a4:85:c9:10",
            "net16": "5e:98:5c:39:22:5b",
            "net17": "d6:3d:64:81:89:1d",
            "net18": "da:38:25:79:0d:a7",
            "net19": "be:a7:3e:9b:0e:32",
            "net2": "b2:24:9d:bf:5c:a9",
            "net20": "02:01:5a:c9:0a:0e",
            "net21": "0a:cc:22:7a:3e:5f",
            "net22": "76:13:40:a0:a9:4b",
            "net23": "6a:20:7e:52:78:2b",
            "net3": "ba:3e:b9:fc:54:37",
            "net4": "56:d3:bf:d8:1d:d2",
            "net5": "b6:5c:37:9d:a3:21",
            "net6": "e2:0a:2b:43:e0:42",
            "net7": "b2:a6:01:73:38:69",
            "net8": "c2:1c:cb:c8:b5:d1",
            "net9": "1e:1d:da:16:15:43"
        },
        "tof_1_2_2": {
            "net0": "12:d4:20:dd:17:a6",
            "net1": "ea:2c:aa:1f:dd:6c",
            "net10": "82:8a:25:69:13:2c",
            "net11": "8a:32:53:68:cf:02",
            "net12": "86:c8:f1:ce:0c:ad",
            "net13": "c6:74:69:f8:01:a0",
            "net14": "da:90:55:a1:0f:9a",
            "net15": "9a:b2:7a:3d:c8:bc",
            "net16": "da:3f:32:77:b4:24",
            "net17": "52:a4:2f:d4:85:44",
            "net18": "56:84:f7:e8:3d:31",
            "net19": "76:f8:ad:e8:0a:27",
            "net2": "de:5d:4e:f1:37:7c",
            "net20": "2e:37:57:45:70:21",
            "net21": "86:1d:56:75:ff:79",
            "net22": "4e:77:fc:66:8f:9d",
            "net23": "86:4a:b8:88:46:37",
            "net3": "66:9b:e5:08:9b:0f",
            "net4": "d6:a6:f0:5e:b0:de",
            "net5": "ce:f9:65:5a:69:0d",
            "net6": "1e:62:bd:2a:79:af",
            "net7": "36:22:4c:7d:8f:68",
            "net8": "4a:cf:17:da:a5:02",
            "net9": "2a:e3:f9:2f:64:1a"
        },
        "tof_1_2_3": {
            "net0": "12:b5:15:bb:73:26",
            "net1": "be:9b:e1:8b:66:78",
            "net10": "0e:43:95:51:49:42",
            "net11": "ce:47:f0:92:f4:c3",
            "net12": "96:1d:9e:49:7d:ef",
            "net13": "b6:d2:ec:26:b7:7f",
            "net14": "96:93:96:bc:8a:92",
            "net15": "0e:a9:58:f2:f1:af",
            "net16": "4e:1b:90:7f:aa:ec",
            "net17": "be:7f:d8:7f:f1:1b",
            "net18": "12:f1:ec:80:e1:1a",
            "net19": "da:fe:8a:96:64:98",
            "net2": "da:e8:81:00:43:80",
            "net20": "f6:dd:33:8b:8e:ee",
            "net21": "da:d1:f5:3c:d2:b2",
            "net22": "d2:ea:2b:62:85:90",
            "net23": "92:38:4b:a2:76:25",
            "net3": "86:2c:3b:cf:06:90",
            "net4": "3e:7e:78:72:cd:69",
            "net5": "12:4a:46:a1:82:a1",
            "net6": "fa:f5:fb:6a:79:e4",
            "net7": "26:cf:04:c2:62:bc",
            "net8": "de:e9:2f:40:51:54",
            "net9": "42:a8:b3:fe:11:38"
        },
        "tof_1_2_4": {
            "net0": "52:d1:cc:73:7e:da",
            "net1": "aa:27:63:28:e5:74",
            "net10": "96:b0:1d:e9:f4:1f",
            "net11": "2e:16:c7:03:28:cb",
            "net12": "9e:23:ac:05:19:c3",
            "net13": "f6:ac:09:0b:90:a5",
            "net14": "b2:a0:c1:39:38:0d",
            "net15": "5a:ed:06:76:31:4c",
            "net16": "7a:f4:51:21:2f:15",
            "net17": "2a:2e:49:36:bd:17",
            "net18": "fa:86:d0:20:a7:15",
            "net19": "ca:8d:7f:82:35:23",
            "net2": "6e:ec:a8:09:08:66",
            "net20": "9a:ab:51:e8:08:54",
            "net21": "0a:ac:c1:e4:db:49",
            "net22": "1a:15:6c:ec:50:c3",
            "net23": "fe:ce:1b:1e:2e:84",
            "net3": "6a:22:b7:0b:6e:dd",
            "net4": "0a:c7:41:c8:98:8d",
            "net5": "7e:fd:3b:e3:1c:6f",
            "net6": "06:fa:00:0f:fa:04",
            "net7": "2e:79:27:38:a5:6c",
            "net8": "8e:f2:47:98:37:eb",
            "net9": "3a:f8:c2:d3:1a:50"
        },
        "tof_1_2_5": {
            "net0": "ce:d1:11:09:3f:a8",
            "net1": "92:38:0f:0d:c7:b5",
            "net10": "7a:e5:cc:5c:85:c7",
            "net11": "da:fd:6f:1b:6d:83",
            "net12": "e2:bb:ac:3d:1e:4e",
            "net13": "42:bb:3f:67:5e:41",
            "net14": "9e:7b:0f:6f:a4:0d",
            "net15": "a6:09:ef:15:d5:de",
            "net16": "62:57:b7:ba:e7:d4",
            "net17": "9e:65:43:42:ce:9f",
            "net18": "4a:60:e6:f7:80:1f",
            "net19": "fa:a3:f0:98:6e:41",
            "net2": "ae:7f:f3:7c:51:d7",
            "net20": "a2:72:1e:2a:fc:16",
            "net21": "96:7f:dd:eb:80:5a",
            "net22": "96:b1:c5:b3:d7:7b",
            "net23": "6a:9a:8c:5e:c8:65",
            "net3": "66:c7:1e:e1:c0:8e",
            "net4": "ce:69:89:fd:bd:dc",
            "net5": "1e:85:f5:75:27:37",
            "net6": "d6:cc:4a:ba:70:7e",
            "net7": "46:66:ab:bd:93:ea",
            "net8": "36:bf:ef:2e:9b:65",
            "net9": "ea:84:ef:73:0c:90"
        },
        "tof_1_2_6": {
            "net0": "1e:2f:28:91:5c:28",
            "net1": "a6:d6:bc:04:e6:33",
            "net10": "c6:59:23:f1:74:f0",
            "net11": "6e:5d:8d:22:47:33",
            "net12": "ae:14:75:5c:fb:80",
            "net13": "16:2a:c0:9b:db:ae",
            "net14": "6a:bf:4b:bb:e4:db",
            "net15": "1a:99:61:9e:a6:d5",
            "net16": "82:f2:36:03:c2:e5",
            "net17": "9e:e1:9d:c2:9c:09",
            "net18": "26:52:60:c6:c0:c7",
            "net19": "8e:41:36:ad:9e:a1",
            "net2": "ea:78:e7:65:50:0d",
            "net20": "a6:86:b9:9b:0d:c8",
            "net21": "8a:ae:43:9f:1e:a5",
            "net22": "46:04:94:fd:0a:60",
            "net23": "3a:21:00:ca:37:2c",
            "net3": "c6:7c:b5:4b:0f:34",
            "net4": "46:b2:d4:4f:b5:c7",
            "net5": "2a:8b:94:e0:a1:db",
            "net6": "1a:86:12:c0:96:60",
            "net7": "fa:34:fc:cd:62:0f",
            "net8": "92:7e:2d:45:5e:27",
            "net9": "96:f7:7a:76:c5:cb"
        },
        "tof_1_2_7": {
            "net0": "52:2e:0a:1c:5f:e2",
            "net1": "ee:90:e9:5c:9c:68",
            "net10": "32:1f:2a:5c:dc:67",
            "net11": "66:1c:9a:b2:7b:bf",
            "net12": "ce:b0:d9:8a:6f:b2",
            "net13": "32:0a:bc:46:63:92",
            "net14": "a2:fb:db:15:5a:ee",
            "net15": "32:9b:e3:08:a7:68",
            "net16": "2a:dd:59:6a:cd:87",
            "net17": "c2:a6:ce:c8:bc:61",
            "net18": "82:94:0f:53:09:3f",
            "net19": "d6:9c:50:e2:08:f0",
            "net2": "62:e3:9f:db:22:95",
            "net20": "d2:5b:fa:e8:e5:4d",
            "net21": "42:57:4d:88:4f:f8",
            "net22": "ea:ae:f6:a4:d5:52",
            "net23": "6e:89:b9:fb:43:b4",
            "net3": "42:59:ba:ac:b7:a6",
            "net4": "6a:ec:59:36:26:08",
            "net5": "6e:8c:b5:71:78:56",
            "net6": "62:a2:99:27:3e:73",
            "net7": "ea:07:06:58:b6:36",
            "net8": "0e:0e:ce:75:4f:2f",
            "net9": "52:7a:ad:c1:a4:b0"
        },
        "tof_1_2_8": {
            "net0": "36:24:6e:c7:d3:cc",
            "net1": "86:83:8a:80:cf:51",
            "net10": "66:64:87:ba:24:1f",
            "net11": "0a:42:58:ea:c2:e7",
            "net12": "c2:6b:fe:ec:f9:a9",
            "net13": "66:ef:ca:eb:4c:68",
            "net14": "d2:c3:1a:eb:34:22",
            "net15": "f2:99:cb:5d:60:67",
            "net16": "32:d9:fc:ad:6f:ee",
            "net17": "26:34:e7:42:a2:d6",
            "net18": "52:ab:8e:cc:fb:53",
            "net19": "b6:db:a1:78:a7:d2",
            "net2": "ea:b5:64:a5:db:1f",
            "net20": "3e:cf:23:9d:c1:3f",
            "net21": "5a:9e:2a:91:82:f6",
            "net22": "06:fd:c5:68:c2:a3",
            "net23": "82:b7:60:52:49:af",
            "net3": "aa:79:2b:36:fa:88",
            "net4": "f6:67:ea:ca:93:66",
            "net5": "7e:ce:a9:f1:9c:b0",
            "net6": "16:cb:2f:38:ea:45",
            "net7": "2e:dc:38:67:ff:11",
            "net8": "ee:ce:e1:65:25:0d",
            "net9": "36:ad:08:0d:b6:35"
        },
        "tof_1_2_9": {
            "net0": "56:98:28:c9:03:f9",
            "net1": "52:81:22:56:7c:23",
            "net10": "5a:cf:8d:4b:9a:3a",
            "net11": "2a:e9:bc:36:91:3d",
            "net12": "3a:39:d9:3c:33:85",
            "net13": "72:50:48:c0:11:11",
            "net14": "12:4a:ed:c6:fe:ae",
            "net15": "3a:49:1c:4b:dc:5d",
            "net16": "ea:1b:b1:08:10:93",
            "net17": "d6:50:ee:89:05:33",
            "net18": "2a:b3:84:9d:be:71",
            "net19": "36:8f:21:6f:fa:27",
            "net2": "02:16:13:d4:26:08",
            "net20": "1a:45:79:5f:29:6e",
            "net21": "16:4e:1b:16:2c:ce",
            "net22": "8a:82:bc:0c:38:53",
            "net23": "56:18:70:4d:fb:91",
            "net3": "d2:16:63:e2:27:41",
            "net4": "62:85:f6:bc:37:77",
            "net5": "0e:ff:1c:29:7b:63",
            "net6": "b2:fc:c4:3d:71:9a",
            "net7": "4a:64:b5:c3:cf:3a",
            "net8": "02:9e:2d:1b:9e:31",
            "net9": "56:68:6f:8b:03:9f"
        }
    },
    "failed_machine": "leaf_1_0_1",
    "failure_time": {
        "leaf_1_0_1": 1622133080.4654675,
        "leaf_1_0_10": 1622133080.5101383,
        "leaf_1_0_11": 1622133080.5579941,
        "leaf_1_0_12": 1622133080.5977578,
        "leaf_1_0_2": 1622133080.4661863,
        "leaf_1_0_3": 1622133080.5124884,
        "leaf_1_0_4": 1622133080.561894,
        "leaf_1_0_5": 1622133080.605768,
        "leaf_1_0_6": 1622133080.4660265,
        "leaf_1_0_7": 1622133080.5121753,
        "leaf_1_0_8": 1622133080.5608644,
        "leaf_1_0_9": 1622133080.6138914,
        "leaf_2_0_1": 1622133080.4664927,
        "leaf_2_0_10": 1622133080.5129044,
        "leaf_2_0_11": 1622133080.5602572,
        "leaf_2_0_12": 1622133080.604793,
        "leaf_2_0_2": 1622133080.6167223,
        "leaf_2_0_3": 1622133080.7595036,
        "leaf_2_0_4": 1622133080.7878938,
        "leaf_2_0_5": 1622133080.953583,
        "leaf_2_0_6": 1622133080.7555928,
        "leaf_2_0_7": 1622133080.775192,
        "leaf_2_0_8": 1622133080.9561796,
        "leaf_2_0_9": 1622133081.040614,
        "spine_1_1_1": 1622133080.757526,
        "spine_1_1_10": 1622133080.9270043,
        "spine_1_1_11": 1622133080.961118,
        "spine_1_1_12": 1622133081.0361497,
        "spine_1_1_2": 1622133080.758624,
        "spine_1_1_3": 1622133080.8618286,
        "spine_1_1_4": 1622133080.9763682,
        "spine_1_1_5": 1622133081.043239,
        "spine_1_1_6": 1622133081.0100465,
        "spine_1_1_7": 1622133081.066639,
        "spine_1_1_8": 1622133081.1132452,
        "spine_1_1_9": 1622133081.221705,
        "spine_2_1_1": 1622133081.0698133,
        "spine_2_1_10": 1622133081.1139464,
        "spine_2_1_11": 1622133081.1502442,
        "spine_2_1_12": 1622133081.3527882,
        "spine_2_1_2": 1622133081.0704722,
        "spine_2_1_3": 1622133081.1198063,
        "spine_2_1_4": 1622133081.3597934,
        "spine_2_1_5": 1622133081.3986368,
        "spine_2_1_6": 1622133081.0721743,
        "spine_2_1_7": 1622133081.1228633,
        "spine_2_1_8": 1622133081.336998,
        "spine_2_1_9": 1622133081.3680944,
        "tof_1_2_1": 1622133081.358465,
        "tof_1_2_10": 1622133081.3776956,
        "tof_1_2_11": 1622133081.4129403,
        "tof_1_2_12": 1622133081.4808178,
        "tof_1_2_2": 1622133081.3709877,
        "tof_1_2_3": 1622133081.413188,
        "tof_1_2_4": 1622133081.442878,
        "tof_1_2_5": 1622133081.471275,
        "tof_1_2_6": 1622133081.3829658,
        "tof_1_2_7": 1622133081.4155214,
        "tof_1_2_8": 1622133081.4661274,
        "tof_1_2_9": 1622133081.4821913
    }
}