{
    "description": "Scenario 3a: Leaf leaf_1_0_1 failure with BGP",
    "k_leaf": 6,
    "k_top": 6,
    "redundancy_factor": 6,
    "is_k8s": true,
    "machine_mac_addresses": {
        "leaf_1_0_1": {
            "net0": "72:74:de:57:63:21",
            "net1": "ae:c0:e7:14:60:8e",
            "net2": "c2:14:2d:68:50:d8",
            "net3": "8a:3d:b3:06:82:1e",
            "net4": "92:23:29:0a:7b:ed",
            "net5": "42:c1:e0:15:92:02",
            "net6": "62:e4:d5:34:6c:4c"
        },
        "leaf_1_0_2": {
            "net0": "fe:89:78:29:b8:4c",
            "net1": "06:70:06:d6:0e:16",
            "net2": "ea:7f:20:b4:49:00",
            "net3": "a2:cc:5b:b1:0b:9e",
            "net4": "fe:4f:09:dd:37:a4",
            "net5": "62:83:43:09:4c:91",
            "net6": "9e:85:a6:f1:97:8e"
        },
        "leaf_1_0_3": {
            "net0": "ca:b4:39:70:23:67",
            "net1": "96:df:12:c9:b2:5a",
            "net2": "66:9a:98:f0:9c:67",
            "net3": "4e:b4:90:19:a7:16",
            "net4": "7e:2b:d1:aa:0f:8b",
            "net5": "12:f4:fa:37:7c:2e",
            "net6": "6e:6d:15:64:67:da"
        },
        "leaf_1_0_4": {
            "net0": "b6:5b:a0:bc:fd:7d",
            "net1": "42:41:26:2a:e8:47",
            "net2": "0a:d8:30:6d:2c:c2",
            "net3": "82:e9:ee:af:da:d7",
            "net4": "9a:d5:f9:ad:52:eb",
            "net5": "7a:7e:ac:fc:59:e1",
            "net6": "8a:51:7a:d3:a6:07"
        },
        "leaf_1_0_5": {
            "net0": "12:24:77:b3:98:9d",
            "net1": "2a:ac:76:6b:74:3b",
            "net2": "d6:8b:c2:2c:fd:cf",
            "net3": "6e:a5:91:f1:6f:10",
            "net4": "32:96:7a:81:2f:f7",
            "net5": "6a:58:80:90:ff:9d",
            "net6": "26:2d:14:0f:82:f6"
        },
        "leaf_1_0_6": {
            "net0": "76:1e:d7:e8:11:ef",
            "net1": "76:ac:46:0b:d3:d3",
            "net2": "06:45:cf:68:99:4e",
            "net3": "2a:95:fb:12:7c:3e",
            "net4": "5a:2c:96:24:4e:0d",
            "net5": "b2:09:72:55:70:a3",
            "net6": "06:7a:20:92:41:bc"
        },
        "leaf_2_0_1": {
            "net0": "06:79:c3:95:c7:75",
            "net1": "a2:9c:33:9a:41:7d",
            "net2": "ba:85:f4:f6:85:52",
            "net3": "7e:89:7e:bd:19:89",
            "net4": "8a:39:53:bf:83:a9",
            "net5": "42:48:eb:db:0d:e7",
            "net6": "ae:b8:f3:b8:1e:4f"
        },
        "leaf_2_0_2": {
            "net0": "e6:60:2a:07:a5:f9",
            "net1": "36:f1:25:15:b5:51",
            "net2": "72:87:47:40:cb:53",
            "net3": "8a:0e:87:3e:6a:08",
            "net4": "ea:7d:0c:68:fd:d0",
            "net5": "7e:ef:16:52:3f:b8",
            "net6": "06:5e:e3:05:c0:e2"
        },
        "leaf_2_0_3": {
            "net0": "d6:66:9b:b6:65:fc",
            "net1": "1e:9e:6b:e3:aa:c8",
            "net2": "a2:ad:dc:76:8a:1f",
            "net3": "3e:aa:3e:51:0d:e7",
            "net4": "c6:7b:7f:bc:98:43",
            "net5": "7a:c3:bc:ff:84:8c",
            "net6": "3e:77:07:b9:ea:0d"
        },
        "leaf_2_0_4": {
            "net0": "be:90:34:5c:98:d0",
            "net1": "56:f0:9b:fd:3f:24",
            "net2": "f6:a3:73:c4:a8:0d",
            "net3": "3e:ca:73:a3:b3:c3",
            "net4": "ce:26:77:58:e8:2f",
            "net5": "06:c2:c5:05:ed:82",
            "net6": "82:b2:dd:fa:e7:1b"
        },
        "leaf_2_0_5": {
            "net0": "72:66:c0:02:2e:54",
            "net1": "86:c7:b6:af:cb:4c",
            "net2": "1a:40:12:cb:d6:4e",
            "net3": "fe:4e:6c:26:a3:03",
            "net4": "96:e3:9a:22:f3:ca",
            "net5": "f6:bf:0d:67:e6:94",
            "net6": "72:d1:25:75:4b:26"
        },
        "leaf_2_0_6": {
            "net0": "92:79:7e:1f:b9:14",
            "net1": "ae:de:35:4e:36:72",
            "net2": "ce:e8:71:c3:c1:e9",
            "net3": "36:ea:eb:4d:74:1b",
            "net4": "02:85:b7:67:3f:77",
            "net5": "66:b5:99:5a:ab:94",
            "net6": "42:e4:14:8d:5c:f1"
        },
        "spine_1_1_1": {
            "net0": "aa:dc:b9:47:bf:7e",
            "net1": "92:17:b5:94:42:09",
            "net10": "62:b9:d6:b3:2b:b0",
            "net11": "6e:0b:7c:23:aa:7e",
            "net2": "96:76:a6:21:09:70",
            "net3": "22:7d:53:0a:4a:98",
            "net4": "52:f5:22:02:6b:a6",
            "net5": "b2:ff:63:f9:73:fd",
            "net6": "6a:c6:39:5d:d7:d0",
            "net7": "8a:74:62:08:57:b1",
            "net8": "e2:56:08:f7:d3:24",
            "net9": "d6:12:0d:a5:6d:7b"
        },
        "spine_1_1_2": {
            "net0": "9e:4e:39:d7:32:25",
            "net1": "a2:f5:8b:e8:29:c8",
            "net10": "06:f7:5e:d6:75:fd",
            "net11": "06:25:87:eb:c5:71",
            "net2": "be:53:54:6a:72:72",
            "net3": "3a:f6:92:bc:34:fd",
            "net4": "02:28:b6:1d:1f:9f",
            "net5": "56:44:65:3c:89:b6",
            "net6": "86:45:d6:bc:14:6d",
            "net7": "f2:e0:ac:5d:28:1a",
            "net8": "56:da:f9:1b:4f:b2",
            "net9": "02:f5:de:6d:a5:37"
        },
        "spine_1_1_3": {
            "net0": "36:29:41:d2:b6:d0",
            "net1": "c2:e0:12:78:75:7d",
            "net10": "ae:63:1f:21:af:0c",
            "net11": "e2:db:63:39:e1:b0",
            "net2": "82:0d:90:ff:42:a2",
            "net3": "fa:f6:ee:cd:8f:22",
            "net4": "52:71:22:45:2c:fd",
            "net5": "3a:3b:c7:31:fb:01",
            "net6": "62:9f:4a:fd:7b:c6",
            "net7": "e2:a3:bb:2c:37:39",
            "net8": "8e:b2:2f:7d:0f:f6",
            "net9": "a6:a0:5c:b4:7d:63"
        },
        "spine_1_1_4": {
            "net0": "36:b8:78:06:0a:34",
            "net1": "b2:11:23:ce:ea:53",
            "net10": "6a:e0:48:3c:df:2d",
            "net11": "5a:9d:6c:0c:7b:b8",
            "net2": "26:52:c7:90:fd:a6",
            "net3": "96:1a:5c:32:67:43",
            "net4": "ca:f1:df:56:61:c5",
            "net5": "3a:de:63:62:80:6e",
            "net6": "0e:f0:24:1a:c6:e4",
            "net7": "ae:8d:63:2b:64:ed",
            "net8": "16:42:6f:55:86:58",
            "net9": "72:f5:8f:2e:c0:23"
        },
        "spine_1_1_5": {
            "net0": "16:91:df:21:fb:d9",
            "net1": "9a:79:21:3e:45:46",
            "net10": "fa:4a:8d:b6:74:22",
            "net11": "f2:f6:29:18:62:96",
            "net2": "72:93:14:36:57:bb",
            "net3": "1a:4f:fa:ea:71:f2",
            "net4": "ea:b0:cb:5c:82:08",
            "net5": "4a:25:27:18:4c:10",
            "net6": "02:b5:25:52:dd:18",
            "net7": "2e:28:dd:14:e5:be",
            "net8": "5e:c5:43:51:6f:89",
            "net9": "ca:d1:f5:2c:0e:03"
        },
        "spine_1_1_6": {
            "net0": "ce:b8:15:d1:eb:4f",
            "net1": "b6:7a:f7:9d:e9:66",
            "net10": "82:dd:1d:d8:18:99",
            "net11": "56:c8:34:ee:5c:71",
            "net2": "c2:c9:86:26:97:f7",
            "net3": "fe:fb:67:d2:0c:61",
            "net4": "d2:3f:c6:11:83:24",
            "net5": "6e:c7:7e:1c:52:8b",
            "net6": "86:01:aa:3d:ce:41",
            "net7": "26:44:22:07:ae:17",
            "net8": "4e:7e:eb:0e:ad:21",
            "net9": "a2:cf:e3:12:c7:18"
        },
        "spine_2_1_1": {
            "net0": "7e:f6:86:f9:86:3e",
            "net1": "8e:28:16:da:fe:22",
            "net10": "4e:67:92:c0:b9:57",
            "net11": "6a:cf:5d:8f:b6:96",
            "net2": "f6:d5:68:00:45:85",
            "net3": "ce:cd:83:7b:26:c9",
            "net4": "7e:17:b1:cf:c7:40",
            "net5": "62:10:43:2d:14:87",
            "net6": "16:8d:e5:1f:e7:3e",
            "net7": "9a:8b:16:39:eb:c3",
            "net8": "ae:90:ca:ca:e3:5a",
            "net9": "16:bf:a0:a2:a3:99"
        },
        "spine_2_1_2": {
            "net0": "4a:e7:4c:6c:f8:fd",
            "net1": "36:44:be:cc:87:0d",
            "net10": "6e:19:d1:05:ea:8a",
            "net11": "f6:a7:26:f6:29:0b",
            "net2": "7a:a6:0a:19:b9:c0",
            "net3": "4e:3e:76:96:43:3e",
            "net4": "06:96:d6:d3:0f:58",
            "net5": "6a:82:ba:30:29:b2",
            "net6": "0e:f4:53:37:46:44",
            "net7": "e2:59:62:33:0a:86",
            "net8": "6e:78:d5:77:bc:9d",
            "net9": "ba:82:09:82:8f:9a"
        },
        "spine_2_1_3": {
            "net0": "9a:dd:70:29:33:4b",
            "net1": "4a:bc:70:6c:6e:e6",
            "net10": "4e:54:8b:8d:1b:87",
            "net11": "ca:1d:3c:d9:d6:a8",
            "net2": "ca:75:4b:2a:f8:1b",
            "net3": "ae:81:19:09:6d:b3",
            "net4": "12:ff:0b:8a:16:17",
            "net5": "8a:89:30:a1:e2:f7",
            "net6": "52:a3:5a:07:02:1e",
            "net7": "6e:46:40:9a:93:89",
            "net8": "9e:47:30:1b:6c:67",
            "net9": "fa:b6:6d:0f:b6:95"
        },
        "spine_2_1_4": {
            "net0": "de:8d:67:2d:91:05",
            "net1": "5e:e1:f8:47:36:6f",
            "net10": "a2:d5:ee:ec:38:11",
            "net11": "a6:31:c0:e9:b0:79",
            "net2": "42:03:5f:3b:9b:23",
            "net3": "8a:11:9f:71:95:cc",
            "net4": "92:fe:35:c9:86:f4",
            "net5": "32:f1:19:31:cd:0e",
            "net6": "f2:35:8d:39:6e:98",
            "net7": "66:7a:be:dc:d5:82",
            "net8": "c2:d0:1f:6b:c5:2a",
            "net9": "06:13:2d:a8:c0:0f"
        },
        "spine_2_1_5": {
            "net0": "62:5e:2c:bc:ba:5d",
            "net1": "46:45:b2:37:7c:21",
            "net10": "d2:c2:04:46:0a:3b",
            "net11": "e2:e5:88:cb:10:04",
            "net2": "56:4e:b0:fd:87:92",
            "net3": "9e:02:df:68:eb:29",
            "net4": "ce:63:30:16:13:9a",
            "net5": "4e:40:d3:8e:08:d3",
            "net6": "92:04:34:da:0b:7e",
            "net7": "5e:cf:2d:25:30:20",
            "net8": "32:3a:89:7b:d3:e9",
            "net9": "b2:b0:6d:ac:88:af"
        },
        "spine_2_1_6": {
            "net0": "d2:1c:6e:fd:f6:62",
            "net1": "f6:83:92:fd:d7:c2",
            "net10": "96:15:bd:f7:42:9d",
            "net11": "4a:2c:79:aa:cd:bb",
            "net2": "42:58:ac:de:e7:12",
            "net3": "ea:18:5d:2b:d6:8f",
            "net4": "06:62:f7:2b:eb:4e",
            "net5": "d6:32:6a:11:15:0a",
            "net6": "e2:48:3e:5e:d8:36",
            "net7": "2a:bf:ad:6b:00:86",
            "net8": "3a:68:9e:d0:8c:e2",
            "net9": "36:e2:43:ea:41:39"
        },
        "tof_1_2_1": {
            "net0": "aa:f8:e3:f0:c9:2a",
            "net1": "56:c3:e2:95:50:39",
            "net10": "5a:2b:df:d8:36:5d",
            "net11": "fe:7e:9b:1a:d6:34",
            "net2": "e6:2d:e3:50:59:00",
            "net3": "b2:cc:a2:5b:01:7b",
            "net4": "02:33:35:b8:2e:7e",
            "net5": "f6:dc:35:b1:16:44",
            "net6": "1a:73:a5:c1:98:73",
            "net7": "16:0f:bb:d8:9e:a8",
            "net8": "46:0b:dd:7b:0d:e6",
            "net9": "0a:48:40:48:01:37"
        },
        "tof_1_2_2": {
            "net0": "7e:99:e1:9f:cd:cb",
            "net1": "86:5f:53:fa:78:b9",
            "net10": "3a:9c:d0:20:0d:7b",
            "net11": "d6:30:97:0b:58:8a",
            "net2": "e2:0b:f8:08:31:6e",
            "net3": "72:ea:88:8a:9a:09",
            "net4": "32:ad:d3:fc:57:14",
            "net5": "56:6a:92:60:b0:70",
            "net6": "5a:29:03:12:80:00",
            "net7": "32:aa:6f:25:85:5e",
            "net8": "32:5a:5b:69:49:99",
            "net9": "b6:17:c7:89:54:13"
        },
        "tof_1_2_3": {
            "net0": "02:97:5b:ce:a0:fb",
            "net1": "fa:ec:40:f3:2f:d3",
            "net10": "9e:f6:9c:15:f7:08",
            "net11": "96:d2:19:a8:c6:33",
            "net2": "02:5b:02:f9:6c:f1",
            "net3": "5e:e1:00:2f:fc:fc",
            "net4": "46:b4:7a:8b:d7:d4",
            "net5": "62:c8:bd:cf:03:b2",
            "net6": "2a:81:e7:77:a4:55",
            "net7": "4e:33:1b:11:34:18",
            "net8": "1e:46:f1:9d:94:45",
            "net9": "62:46:a8:84:b1:79"
        },
        "tof_1_2_4": {
            "net0": "6e:ba:c6:a2:76:e0",
            "net1": "32:c4:9f:29:be:63",
            "net10": "96:b2:fd:66:9c:50",
            "net11": "26:af:1a:6e:34:2b",
            "net2": "52:c9:74:9f:76:bb",
            "net3": "f2:88:1a:85:7a:ed",
            "net4": "4e:6b:b9:0c:7f:bb",
            "net5": "be:54:7c:2e:7d:9e",
            "net6": "6a:a9:b0:0c:20:2a",
            "net7": "1e:50:d6:90:b0:34",
            "net8": "b6:9c:f3:82:36:01",
            "net9": "ea:26:46:0c:ed:86"
        },
        "tof_1_2_5": {
            "net0": "c6:2a:08:0f:af:ad",
            "net1": "12:8c:3c:59:eb:f4",
            "net10": "ca:fe:f2:28:77:cd",
            "net11": "a6:d3:61:bf:c6:5e",
            "net2": "66:ef:8e:1d:bc:fe",
            "net3": "4a:2c:ff:98:5f:05",
            "net4": "ae:2d:3b:39:c2:84",
            "net5": "42:c7:a4:b5:36:75",
            "net6": "f6:6c:51:a6:2e:62",
            "net7": "4a:f9:cb:35:e4:2a",
            "net8": "de:b2:1f:25:3c:1e",
            "net9": "82:d4:3a:b3:9a:54"
        },
        "tof_1_2_6": {
            "net0": "b6:0e:eb:94:2a:8c",
            "net1": "ce:f8:3f:ae:db:51",
            "net10": "ba:ed:12:5e:e7:a5",
            "net11": "d2:47:4b:10:7e:5e",
            "net2": "36:6b:6d:43:7c:d5",
            "net3": "02:f0:ef:e2:81:5f",
            "net4": "86:3f:c1:d8:ce:52",
            "net5": "52:be:ca:bd:a1:f1",
            "net6": "5a:80:c8:e7:2c:0d",
            "net7": "2e:75:78:be:bc:c6",
            "net8": "3a:c6:a8:64:94:ed",
            "net9": "ae:80:20:14:24:15"
        }
    },
    "failed_machine": "leaf_1_0_1",
    "failure_time": 1613148265.4483557
}