{
    "description": "Scenario 6b: net6 link failure and recovery of spine_1_1_1 with BGP",
    "k_leaf": 6,
    "k_top": 6,
    "redundancy_factor": 2,
    "is_k8s": true,
    "machine_mac_addresses": {
        "leaf_1_0_1": {
            "net0": "3e:6f:f3:12:9a:b0",
            "net1": "9a:6f:b5:0b:14:cc",
            "net2": "ce:f4:7a:6e:4e:d4",
            "net3": "aa:cc:31:78:30:bc",
            "net4": "ca:a8:44:fe:01:2a",
            "net5": "6a:2c:3d:be:39:68",
            "net6": "72:df:7b:dd:ff:6d"
        },
        "leaf_1_0_2": {
            "net0": "ee:d2:55:ab:61:55",
            "net1": "b2:84:fd:0e:95:df",
            "net2": "52:a8:07:2f:fe:a6",
            "net3": "56:04:25:88:2d:a7",
            "net4": "86:7f:f1:5c:8b:1f",
            "net5": "9a:95:ed:e5:18:75",
            "net6": "8e:0e:4f:ad:12:ae"
        },
        "leaf_1_0_3": {
            "net0": "ea:1a:81:4d:67:1b",
            "net1": "ce:12:8b:86:26:23",
            "net2": "06:50:c4:89:fc:cf",
            "net3": "6e:a1:cc:2f:4f:58",
            "net4": "a6:73:f9:0b:ce:4f",
            "net5": "5a:46:31:75:d0:27",
            "net6": "f2:83:96:74:36:5a"
        },
        "leaf_1_0_4": {
            "net0": "96:92:e1:62:11:52",
            "net1": "02:74:88:f3:6f:d2",
            "net2": "92:a4:47:c2:55:c5",
            "net3": "ce:0e:91:cf:f0:a5",
            "net4": "8e:9f:8c:fa:c6:c9",
            "net5": "f6:13:92:fa:9d:70",
            "net6": "9a:6e:7b:47:3f:73"
        },
        "leaf_1_0_5": {
            "net0": "26:6f:6a:cf:46:5c",
            "net1": "62:9f:46:1d:17:a0",
            "net2": "aa:f3:8f:3d:ad:50",
            "net3": "1e:2a:d3:18:2c:f4",
            "net4": "8e:5b:ec:96:24:56",
            "net5": "e6:87:cc:e6:c9:f5",
            "net6": "de:8e:df:c8:77:d3"
        },
        "leaf_1_0_6": {
            "net0": "1a:c5:f6:a3:63:3f",
            "net1": "92:86:f7:7c:15:76",
            "net2": "7a:80:f5:13:76:a8",
            "net3": "7e:18:db:86:d7:78",
            "net4": "c2:04:c1:b5:1c:8e",
            "net5": "ba:9f:80:c9:4a:20",
            "net6": "da:3d:01:a9:60:87"
        },
        "leaf_2_0_1": {
            "net0": "5a:8b:30:9c:fa:fc",
            "net1": "ca:0e:28:75:d6:d5",
            "net2": "66:56:11:7f:1d:60",
            "net3": "fe:9f:0e:e7:ae:f1",
            "net4": "fe:7a:fb:e5:db:46",
            "net5": "3a:1e:9c:84:41:93",
            "net6": "1e:3c:68:8f:93:56"
        },
        "leaf_2_0_2": {
            "net0": "b6:90:b1:07:b4:7d",
            "net1": "ae:4b:1e:b0:66:11",
            "net2": "86:cf:56:ea:64:70",
            "net3": "0e:14:84:bf:f8:cf",
            "net4": "aa:15:25:42:5c:72",
            "net5": "d6:fa:f1:76:f6:00",
            "net6": "ba:ce:e5:d1:65:ad"
        },
        "leaf_2_0_3": {
            "net0": "e6:56:b6:26:4a:c9",
            "net1": "aa:80:b7:1c:59:4a",
            "net2": "82:40:45:f6:0d:80",
            "net3": "be:06:5f:e4:49:65",
            "net4": "5e:ea:a6:6e:22:84",
            "net5": "46:82:54:d8:59:3e",
            "net6": "ba:31:9e:72:e1:21"
        },
        "leaf_2_0_4": {
            "net0": "92:50:c7:3c:ee:9f",
            "net1": "8a:6f:0b:fe:d1:3a",
            "net2": "56:1a:3b:5c:77:d4",
            "net3": "86:6b:3a:e5:bd:4f",
            "net4": "0e:01:84:e3:c2:5a",
            "net5": "d6:ba:f5:f0:5a:bd",
            "net6": "e6:ba:8b:fe:ad:72"
        },
        "leaf_2_0_5": {
            "net0": "7a:a0:36:a4:f1:09",
            "net1": "c6:16:2c:95:31:32",
            "net2": "32:c0:64:68:3e:e9",
            "net3": "7a:5d:d3:37:c5:b7",
            "net4": "06:55:b2:f8:4f:37",
            "net5": "a6:cb:03:6c:32:6e",
            "net6": "6e:3d:db:34:89:12"
        },
        "leaf_2_0_6": {
            "net0": "96:1c:ec:9c:78:0e",
            "net1": "da:23:54:6c:95:b5",
            "net2": "32:ee:71:61:fc:d5",
            "net3": "e6:9b:b8:7f:7c:15",
            "net4": "ca:ac:9f:2d:a9:1b",
            "net5": "6a:63:39:36:9d:7f",
            "net6": "0e:c7:ce:a6:d4:47"
        },
        "leaf_3_0_1": {
            "net0": "da:5d:41:28:dd:4f",
            "net1": "b2:b6:7f:4e:3d:bd",
            "net2": "76:a9:57:5a:0a:22",
            "net3": "56:9e:09:5e:3e:0c",
            "net4": "a2:c2:52:14:bd:6a",
            "net5": "0a:dd:77:89:4c:b0",
            "net6": "d2:5d:a3:6c:5c:27"
        },
        "leaf_3_0_2": {
            "net0": "2e:fa:a4:9a:e4:7b",
            "net1": "2a:34:3d:b4:aa:6f",
            "net2": "96:f4:64:17:1e:3e",
            "net3": "9a:f6:c0:b9:8e:4a",
            "net4": "ea:ee:97:25:d1:7b",
            "net5": "96:3e:20:92:00:f4",
            "net6": "e2:b9:67:7a:b4:23"
        },
        "leaf_3_0_3": {
            "net0": "32:10:c8:6a:26:3d",
            "net1": "32:3b:3c:c8:94:1c",
            "net2": "0a:98:e4:95:d2:ff",
            "net3": "6e:3b:4d:12:23:fa",
            "net4": "e2:20:65:35:43:9b",
            "net5": "42:bb:38:45:27:1b",
            "net6": "36:01:b9:cb:d9:11"
        },
        "leaf_3_0_4": {
            "net0": "ae:3e:d5:08:b1:a6",
            "net1": "ee:0b:3b:e0:d8:31",
            "net2": "de:33:0f:66:fd:6d",
            "net3": "da:63:c9:ef:53:de",
            "net4": "1a:0c:51:df:d7:08",
            "net5": "5e:db:24:cf:b6:f2",
            "net6": "4a:e6:18:e9:1e:6d"
        },
        "leaf_3_0_5": {
            "net0": "7e:a8:f8:7e:0c:c2",
            "net1": "8e:57:c5:75:0f:48",
            "net2": "06:e5:b6:72:e1:03",
            "net3": "e2:c8:4f:ef:73:26",
            "net4": "32:d6:ce:4f:31:79",
            "net5": "92:81:73:15:ea:85",
            "net6": "66:27:50:8d:53:41"
        },
        "leaf_3_0_6": {
            "net0": "a2:28:0a:b3:92:68",
            "net1": "8a:65:19:bb:4d:80",
            "net2": "12:be:41:ec:20:a8",
            "net3": "e6:07:b7:1e:b2:5e",
            "net4": "92:b2:4b:86:9c:32",
            "net5": "26:28:f4:34:b4:fa",
            "net6": "46:7e:51:8f:25:ab"
        },
        "leaf_4_0_1": {
            "net0": "b6:cf:c1:28:f3:d6",
            "net1": "c6:26:ff:85:11:18",
            "net2": "1e:c0:d6:c2:2a:68",
            "net3": "2e:3a:d6:9a:c8:a7",
            "net4": "52:e5:86:b0:f5:45",
            "net5": "56:17:b8:ae:9e:c0",
            "net6": "42:b5:cf:cd:c0:34"
        },
        "leaf_4_0_2": {
            "net0": "7e:17:36:22:35:71",
            "net1": "72:6b:18:27:24:64",
            "net2": "76:62:af:cd:57:0c",
            "net3": "56:bc:af:ea:48:03",
            "net4": "52:45:b4:b0:e9:ac",
            "net5": "12:3d:57:25:27:53",
            "net6": "96:fc:0d:f6:79:db"
        },
        "leaf_4_0_3": {
            "net0": "f2:ec:2b:d1:ca:cb",
            "net1": "8e:ff:05:b4:06:81",
            "net2": "2a:16:ce:f0:07:87",
            "net3": "0a:ba:6c:7a:19:55",
            "net4": "86:c9:d0:55:85:4f",
            "net5": "ee:76:0a:da:60:1f",
            "net6": "4a:17:f3:7b:cd:1b"
        },
        "leaf_4_0_4": {
            "net0": "42:b7:0b:74:c3:19",
            "net1": "9e:c1:36:df:9b:ad",
            "net2": "36:d1:7a:df:3c:12",
            "net3": "6e:e7:89:79:ee:f3",
            "net4": "66:d7:ba:ee:ba:e0",
            "net5": "f2:8e:0d:db:fe:76",
            "net6": "62:e5:3e:59:07:79"
        },
        "leaf_4_0_5": {
            "net0": "42:f1:bc:78:a8:40",
            "net1": "62:c2:2d:87:e9:a4",
            "net2": "fe:b7:c6:72:67:0a",
            "net3": "7a:e9:6a:48:e8:61",
            "net4": "66:f5:62:59:e3:1e",
            "net5": "72:c1:9d:42:bc:3c",
            "net6": "1a:c2:0f:a1:62:51"
        },
        "leaf_4_0_6": {
            "net0": "da:ed:61:70:15:a2",
            "net1": "4a:ee:ae:2f:7b:ca",
            "net2": "5e:b2:b7:58:31:56",
            "net3": "72:c0:79:4c:93:1b",
            "net4": "e2:54:02:22:44:c0",
            "net5": "02:43:60:0b:2b:51",
            "net6": "16:ff:59:38:34:d5"
        },
        "leaf_5_0_1": {
            "net0": "2a:b3:f0:a8:35:64",
            "net1": "f2:55:2a:da:c0:5a",
            "net2": "3a:3f:65:26:8c:ac",
            "net3": "06:76:ac:6c:0a:ed",
            "net4": "ce:64:19:c7:3b:3a",
            "net5": "56:14:da:1a:db:b5",
            "net6": "76:a7:3c:ff:62:64"
        },
        "leaf_5_0_2": {
            "net0": "4a:63:89:e6:90:a4",
            "net1": "ee:cd:01:d9:0e:2b",
            "net2": "56:f1:c4:8d:b0:98",
            "net3": "36:1d:dd:c2:36:e1",
            "net4": "2a:ba:65:e8:90:c4",
            "net5": "3a:51:32:d2:9a:2c",
            "net6": "76:d1:4e:f9:4b:e7"
        },
        "leaf_5_0_3": {
            "net0": "72:c9:c7:fe:85:13",
            "net1": "e6:6e:09:2c:74:25",
            "net2": "5a:df:54:6a:1a:fb",
            "net3": "26:52:03:ae:94:9f",
            "net4": "96:d7:37:90:43:53",
            "net5": "e2:4a:f0:fe:0e:3d",
            "net6": "d6:f0:54:3b:df:9d"
        },
        "leaf_5_0_4": {
            "net0": "9a:e4:ac:70:3a:b7",
            "net1": "8e:14:ed:9f:2b:ca",
            "net2": "52:1b:95:b6:cd:d7",
            "net3": "ae:a0:ef:25:83:92",
            "net4": "7e:e7:e4:92:d3:78",
            "net5": "92:74:01:63:6e:5c",
            "net6": "3e:b8:61:d3:34:9e"
        },
        "leaf_5_0_5": {
            "net0": "2a:6e:4c:07:3d:9c",
            "net1": "9e:c2:cf:47:69:cb",
            "net2": "82:65:29:7c:0e:02",
            "net3": "6a:24:ce:1f:dc:01",
            "net4": "fe:87:39:49:32:eb",
            "net5": "da:83:22:e1:dd:91",
            "net6": "16:6a:0e:9f:5d:40"
        },
        "leaf_5_0_6": {
            "net0": "5a:ab:58:a7:13:8c",
            "net1": "2a:8e:1b:26:36:f1",
            "net2": "62:d8:1b:d9:91:50",
            "net3": "96:af:cc:8b:ea:aa",
            "net4": "de:75:bd:21:12:5e",
            "net5": "de:1a:5e:8f:97:5a",
            "net6": "42:fc:91:95:0c:b8"
        },
        "leaf_6_0_1": {
            "net0": "76:12:0c:8d:ec:25",
            "net1": "2e:e8:d0:52:a2:7b",
            "net2": "8a:4d:60:c6:e8:a4",
            "net3": "a2:ab:85:f5:46:98",
            "net4": "4a:80:18:66:c5:e3",
            "net5": "f2:89:cd:4a:04:a0",
            "net6": "62:76:ac:60:5b:87"
        },
        "leaf_6_0_2": {
            "net0": "6e:85:b3:1e:fd:39",
            "net1": "62:b7:81:e6:73:53",
            "net2": "72:a3:04:47:b2:ee",
            "net3": "ce:ac:6f:81:c0:58",
            "net4": "f2:8c:9d:31:bc:e3",
            "net5": "16:ca:82:c5:13:aa",
            "net6": "76:06:f8:82:69:51"
        },
        "leaf_6_0_3": {
            "net0": "26:3b:c3:ac:f0:52",
            "net1": "8e:97:25:f2:87:6f",
            "net2": "26:83:00:f3:9e:31",
            "net3": "7a:55:b1:b1:f6:ee",
            "net4": "52:43:05:c7:a2:d6",
            "net5": "06:6d:1d:00:27:1b",
            "net6": "2e:75:74:4e:da:18"
        },
        "leaf_6_0_4": {
            "net0": "32:d4:f0:f2:fb:cb",
            "net1": "72:00:76:c9:d8:8a",
            "net2": "4a:84:2b:c7:a8:3d",
            "net3": "a6:1d:55:b7:29:8c",
            "net4": "36:55:bc:28:4f:02",
            "net5": "12:f1:b9:a0:25:32",
            "net6": "6e:bb:76:2e:51:09"
        },
        "leaf_6_0_5": {
            "net0": "e2:b4:d1:ce:1e:10",
            "net1": "22:26:4b:53:ef:a9",
            "net2": "52:a6:52:0b:e6:86",
            "net3": "aa:06:b4:05:3a:01",
            "net4": "4a:a5:f8:97:a7:94",
            "net5": "2e:e4:92:0e:4a:5b",
            "net6": "c6:42:dd:96:fc:1d"
        },
        "leaf_6_0_6": {
            "net0": "aa:64:b4:a4:e7:39",
            "net1": "32:14:b4:ff:76:73",
            "net2": "06:a7:c6:ef:20:68",
            "net3": "a6:98:f4:1e:21:4a",
            "net4": "3a:0a:3d:6b:54:f3",
            "net5": "9a:60:73:76:a8:e3",
            "net6": "ae:1b:07:7b:0e:1a"
        },
        "spine_1_1_1": {
            "net0": "8e:85:2e:94:46:4c",
            "net1": "d6:f6:1c:83:d7:23",
            "net10": "aa:8f:db:67:59:24",
            "net11": "6e:37:b6:14:6b:27",
            "net2": "8e:f9:26:9e:12:8e",
            "net3": "3e:1f:b1:63:7a:75",
            "net4": "22:04:43:d4:5b:94",
            "net5": "a6:6d:83:51:c5:f3",
            "net6": "f2:11:35:df:84:e1",
            "net7": "fe:a5:2e:f5:4c:0a",
            "net8": "1e:68:b4:1c:1b:3c",
            "net9": "9a:d9:e0:04:32:dd"
        },
        "spine_1_1_2": {
            "net0": "96:63:e8:0e:e7:d5",
            "net1": "e2:96:32:ff:17:ed",
            "net10": "ae:df:75:9b:d9:44",
            "net11": "b6:37:e2:18:40:70",
            "net2": "8a:1a:2a:3d:9a:53",
            "net3": "8e:c6:25:31:43:97",
            "net4": "a6:89:40:3a:15:31",
            "net5": "22:7a:05:d5:60:7c",
            "net6": "ba:6e:37:81:95:24",
            "net7": "fa:1e:a3:f6:32:96",
            "net8": "52:87:e0:49:b9:01",
            "net9": "9a:de:a2:07:1f:b0"
        },
        "spine_1_1_3": {
            "net0": "ce:30:21:cc:96:80",
            "net1": "8a:e5:32:a3:06:24",
            "net10": "ea:d8:01:22:87:41",
            "net11": "d2:7a:a5:ab:53:35",
            "net2": "7a:20:34:ab:cc:d6",
            "net3": "26:37:ee:1c:76:23",
            "net4": "76:eb:0c:22:02:f8",
            "net5": "66:99:2e:ed:70:8c",
            "net6": "4a:4d:6b:26:ca:17",
            "net7": "92:af:5d:22:f5:8e",
            "net8": "5e:39:f3:d4:78:29",
            "net9": "02:2f:1a:dd:51:6f"
        },
        "spine_1_1_4": {
            "net0": "6a:92:50:2e:f3:f8",
            "net1": "22:3f:54:bd:87:9d",
            "net10": "0e:54:e1:f5:02:d7",
            "net11": "b6:aa:1c:69:a4:34",
            "net2": "f2:23:9c:08:43:da",
            "net3": "f2:13:4a:e5:cc:30",
            "net4": "26:27:9e:69:f5:28",
            "net5": "a6:fc:93:7f:aa:df",
            "net6": "a6:27:a8:80:8b:ac",
            "net7": "ce:d1:c4:6b:f5:54",
            "net8": "16:e9:cb:92:04:c8",
            "net9": "82:f8:b9:28:3b:39"
        },
        "spine_1_1_5": {
            "net0": "0e:29:10:fe:36:7c",
            "net1": "a2:5f:30:4e:6c:52",
            "net10": "22:e7:f8:06:b0:11",
            "net11": "b6:e2:de:d7:28:b9",
            "net2": "96:52:27:0c:27:53",
            "net3": "be:7a:b2:1b:db:df",
            "net4": "56:f5:6e:d8:f9:78",
            "net5": "e6:66:90:0f:cf:83",
            "net6": "1e:13:db:3f:69:2c",
            "net7": "8a:38:d5:db:32:2a",
            "net8": "1e:8d:20:6a:eb:75",
            "net9": "9e:f4:f6:1f:b5:b2"
        },
        "spine_1_1_6": {
            "net0": "c2:88:78:12:5f:1c",
            "net1": "fa:18:56:cd:a6:f7",
            "net10": "0a:07:ac:91:7a:4a",
            "net11": "56:2e:d7:5d:ce:44",
            "net2": "ea:c4:f2:63:be:79",
            "net3": "82:55:55:20:5d:aa",
            "net4": "3e:41:08:82:2a:59",
            "net5": "1e:72:12:42:b8:3d",
            "net6": "9e:66:c4:da:7f:76",
            "net7": "0e:30:dd:a1:a8:61",
            "net8": "3e:a8:22:d0:0d:24",
            "net9": "a2:f6:75:13:c7:39"
        },
        "spine_2_1_1": {
            "net0": "ca:92:71:c7:a9:54",
            "net1": "e2:0c:b5:83:09:01",
            "net10": "1a:2b:aa:64:95:24",
            "net11": "2e:3f:b4:86:dc:e2",
            "net2": "16:d4:96:cb:80:26",
            "net3": "1e:41:94:67:02:38",
            "net4": "3e:ec:75:ac:76:93",
            "net5": "7a:11:24:b9:36:d1",
            "net6": "ea:fa:f1:e2:a2:54",
            "net7": "ce:48:1b:e8:7b:2c",
            "net8": "e6:98:22:33:e0:95",
            "net9": "76:54:e7:54:e6:64"
        },
        "spine_2_1_2": {
            "net0": "96:2e:b4:07:e0:af",
            "net1": "a6:8f:22:54:be:f0",
            "net10": "2e:4f:bf:5b:8f:7b",
            "net11": "f2:39:36:5c:ee:c2",
            "net2": "32:eb:96:3b:4e:9b",
            "net3": "8a:b8:ee:da:67:f5",
            "net4": "7e:34:94:fd:39:8d",
            "net5": "ba:a7:c2:fa:7d:0d",
            "net6": "52:13:14:a4:70:8c",
            "net7": "56:f5:15:ce:81:8b",
            "net8": "76:0a:16:6a:c2:59",
            "net9": "da:24:24:2b:dd:e4"
        },
        "spine_2_1_3": {
            "net0": "42:b2:4c:e1:03:18",
            "net1": "e2:6c:13:8e:b2:6a",
            "net10": "0a:35:84:48:e7:2e",
            "net11": "0e:22:5e:bc:0a:04",
            "net2": "86:d4:70:4a:ed:4f",
            "net3": "c6:a7:23:34:71:af",
            "net4": "e6:19:a1:d9:b3:72",
            "net5": "8a:51:2c:de:c4:52",
            "net6": "0a:6f:bc:21:75:15",
            "net7": "f2:cc:96:af:c7:16",
            "net8": "3a:d3:27:79:01:c2",
            "net9": "72:42:8e:0f:f5:6a"
        },
        "spine_2_1_4": {
            "net0": "4a:5b:36:1d:78:b5",
            "net1": "52:b2:e1:e5:3e:39",
            "net10": "2a:bd:a3:fc:38:c1",
            "net11": "16:b7:99:89:d3:f0",
            "net2": "9a:09:47:8b:de:b8",
            "net3": "d2:79:d3:4a:04:e1",
            "net4": "fa:fd:0a:4c:37:d6",
            "net5": "86:ea:19:f4:63:6f",
            "net6": "da:25:38:bb:80:57",
            "net7": "e6:69:d0:d3:30:05",
            "net8": "62:4f:41:c4:db:52",
            "net9": "e2:73:b6:1a:d4:e3"
        },
        "spine_2_1_5": {
            "net0": "9a:ed:64:2d:a5:ac",
            "net1": "0a:a3:6b:32:68:ef",
            "net10": "8a:92:01:e7:8b:fb",
            "net11": "4a:79:0f:b1:0d:af",
            "net2": "52:01:a8:ee:48:1b",
            "net3": "62:c0:47:0b:63:fe",
            "net4": "ae:49:98:84:20:47",
            "net5": "fa:76:66:82:24:bf",
            "net6": "96:a8:c0:f1:23:14",
            "net7": "7a:bc:61:8a:da:1d",
            "net8": "b2:cf:63:f8:64:6b",
            "net9": "22:b9:d6:06:d0:53"
        },
        "spine_2_1_6": {
            "net0": "da:0d:b5:10:c6:74",
            "net1": "e2:11:4a:f0:dc:7f",
            "net10": "c2:9f:0c:7c:55:d0",
            "net11": "32:ae:c0:e2:07:3d",
            "net2": "ca:b1:c9:48:07:1b",
            "net3": "5e:0d:b3:08:5f:4d",
            "net4": "e6:3d:52:7b:5b:73",
            "net5": "ba:25:14:b5:98:1a",
            "net6": "a2:b2:89:31:21:21",
            "net7": "9a:2a:bc:8b:2f:9e",
            "net8": "1a:3b:be:55:89:bd",
            "net9": "56:1a:c9:82:de:31"
        },
        "spine_3_1_1": {
            "net0": "22:db:c3:ba:98:5a",
            "net1": "3a:dc:7b:0b:f5:a8",
            "net10": "ea:e9:7c:5c:8d:f0",
            "net11": "ee:da:e7:de:e1:13",
            "net2": "ba:c7:54:a1:29:99",
            "net3": "d2:37:b8:64:8a:65",
            "net4": "22:e8:64:cc:52:c7",
            "net5": "ae:bc:90:e1:a5:57",
            "net6": "c6:23:57:5b:17:58",
            "net7": "42:15:03:8a:0c:04",
            "net8": "52:00:4d:82:2d:2d",
            "net9": "ae:80:91:11:28:56"
        },
        "spine_3_1_2": {
            "net0": "d6:59:14:93:50:2b",
            "net1": "62:d5:37:c7:78:f0",
            "net10": "7e:b8:6d:c0:a8:93",
            "net11": "a2:01:15:1d:d4:e5",
            "net2": "ba:2e:6f:da:04:eb",
            "net3": "6a:11:f9:eb:4e:cd",
            "net4": "92:fb:c2:dd:02:09",
            "net5": "fe:1e:7a:6b:4f:4f",
            "net6": "2a:61:cb:ed:26:6b",
            "net7": "4a:86:3f:88:4a:2b",
            "net8": "de:a6:ee:8e:e4:02",
            "net9": "f6:eb:2b:9a:32:69"
        },
        "spine_3_1_3": {
            "net0": "ba:b9:e9:10:51:8d",
            "net1": "e6:0f:6f:69:d2:84",
            "net10": "aa:b5:3e:4d:2c:f0",
            "net11": "e6:7f:9f:00:26:dd",
            "net2": "66:6a:ae:68:b9:3a",
            "net3": "16:1b:c4:68:c6:f8",
            "net4": "de:59:76:75:20:08",
            "net5": "ba:f0:a6:7f:ff:e3",
            "net6": "d2:fc:de:ec:44:f2",
            "net7": "8a:ad:19:08:01:9f",
            "net8": "ba:b7:8b:24:49:fa",
            "net9": "ee:4c:d8:40:0a:ff"
        },
        "spine_3_1_4": {
            "net0": "ae:6f:7d:c7:fc:e1",
            "net1": "62:f7:68:5c:de:db",
            "net10": "16:f5:f7:ce:8d:17",
            "net11": "0a:cb:4f:c7:c7:dd",
            "net2": "ae:58:8a:cb:bb:f0",
            "net3": "b6:5a:1d:82:e4:a6",
            "net4": "82:dc:7c:be:83:51",
            "net5": "ca:65:63:58:50:ea",
            "net6": "d2:1a:c8:45:18:c3",
            "net7": "86:5f:22:a1:ae:32",
            "net8": "4e:df:5b:c8:9f:46",
            "net9": "da:31:da:e3:40:82"
        },
        "spine_3_1_5": {
            "net0": "f6:72:e0:73:98:5b",
            "net1": "ca:89:89:8c:8c:02",
            "net10": "ca:2d:34:5f:71:46",
            "net11": "7e:79:93:e5:5b:e3",
            "net2": "76:b9:e7:06:66:ff",
            "net3": "c6:4b:28:6c:a5:52",
            "net4": "42:32:fb:34:31:86",
            "net5": "de:ee:70:c6:f1:91",
            "net6": "4a:55:ba:f2:c9:97",
            "net7": "46:86:3c:fe:1c:7d",
            "net8": "16:43:c0:bd:7e:74",
            "net9": "32:cf:70:24:1c:bc"
        },
        "spine_3_1_6": {
            "net0": "86:29:eb:f4:6e:1d",
            "net1": "aa:4e:9b:ed:7c:1d",
            "net10": "62:a0:d8:f4:f7:cd",
            "net11": "26:56:c9:06:85:82",
            "net2": "36:90:83:7a:86:0c",
            "net3": "1a:74:d6:44:b1:6b",
            "net4": "42:c2:ce:6a:10:3e",
            "net5": "02:9d:91:72:70:be",
            "net6": "fe:a6:ed:be:7a:8a",
            "net7": "c2:43:95:07:42:e8",
            "net8": "76:4f:df:30:8b:94",
            "net9": "0e:ca:b9:5a:07:66"
        },
        "spine_4_1_1": {
            "net0": "0a:51:0a:49:b0:31",
            "net1": "ae:0e:58:1e:3a:48",
            "net10": "32:37:07:37:33:54",
            "net11": "36:8f:ad:e5:2d:a0",
            "net2": "f6:57:33:41:ec:89",
            "net3": "e6:6a:82:c2:b2:e0",
            "net4": "aa:54:13:b3:3a:e2",
            "net5": "e2:9a:ec:29:28:83",
            "net6": "ba:0b:8e:c4:95:2d",
            "net7": "c2:e4:69:b2:dd:92",
            "net8": "fe:28:a3:22:47:00",
            "net9": "26:88:dc:f6:32:10"
        },
        "spine_4_1_2": {
            "net0": "2a:93:25:e8:25:67",
            "net1": "6a:fb:a0:cc:7d:c1",
            "net10": "2a:16:f3:d5:88:2c",
            "net11": "56:67:ab:f9:0e:c1",
            "net2": "9e:0a:3f:09:a2:d2",
            "net3": "ca:2b:6b:93:7a:2f",
            "net4": "8a:2c:7d:1b:93:bd",
            "net5": "4e:a0:23:8a:4f:d1",
            "net6": "22:e3:a1:6f:e4:dc",
            "net7": "c2:27:a2:ab:3c:52",
            "net8": "82:70:71:53:a8:e4",
            "net9": "be:dd:ea:a2:99:c3"
        },
        "spine_4_1_3": {
            "net0": "3a:0d:6f:9f:cb:10",
            "net1": "4a:4c:25:fd:58:90",
            "net10": "12:39:5c:2e:60:8e",
            "net11": "7e:2c:be:d2:35:f2",
            "net2": "be:20:6d:32:c0:1a",
            "net3": "0a:1b:54:4e:0b:a2",
            "net4": "86:7a:a1:33:07:a1",
            "net5": "42:93:9b:f3:f7:b1",
            "net6": "2e:54:78:94:87:71",
            "net7": "4a:cc:fe:b7:39:08",
            "net8": "fe:24:96:03:d3:fe",
            "net9": "42:71:4f:d2:ed:d8"
        },
        "spine_4_1_4": {
            "net0": "9e:31:50:ab:30:de",
            "net1": "c2:b8:98:d1:e3:93",
            "net10": "0a:8a:ad:30:ab:16",
            "net11": "de:6f:20:24:00:cb",
            "net2": "62:47:cb:a8:36:64",
            "net3": "3e:71:4d:06:a4:76",
            "net4": "aa:07:53:df:64:62",
            "net5": "26:77:d1:0d:ef:5a",
            "net6": "2e:24:a6:79:24:e1",
            "net7": "f6:42:2e:39:d5:5b",
            "net8": "2a:a0:eb:37:d6:08",
            "net9": "e6:49:8e:65:d7:ff"
        },
        "spine_4_1_5": {
            "net0": "3a:e7:28:6b:7d:09",
            "net1": "5a:8f:8f:fc:b4:a0",
            "net10": "5a:a9:3b:d2:18:bc",
            "net11": "d6:07:bb:33:ca:9c",
            "net2": "46:7f:0c:cd:d1:5d",
            "net3": "76:a6:19:88:01:ce",
            "net4": "3a:40:9e:5d:6e:68",
            "net5": "7e:54:1c:de:f3:3c",
            "net6": "52:9f:d0:d6:2e:db",
            "net7": "f2:9d:19:d1:ad:a9",
            "net8": "5a:fd:c4:62:05:fc",
            "net9": "8e:0d:fd:ae:6b:2d"
        },
        "spine_4_1_6": {
            "net0": "52:d2:1a:12:b5:40",
            "net1": "16:02:7a:97:f3:68",
            "net10": "7a:57:0c:34:4b:b3",
            "net11": "1e:e7:89:59:76:83",
            "net2": "a6:6d:41:17:0c:a9",
            "net3": "f2:88:ff:2f:fe:c5",
            "net4": "8e:9a:28:31:82:36",
            "net5": "92:65:48:8b:36:de",
            "net6": "5a:85:39:04:4a:c0",
            "net7": "6a:47:53:8c:a4:26",
            "net8": "56:98:6e:93:60:4d",
            "net9": "d6:7a:08:17:91:36"
        },
        "spine_5_1_1": {
            "net0": "16:79:a7:7c:34:f3",
            "net1": "4e:aa:f5:7a:b9:c7",
            "net10": "fe:fd:41:92:f8:28",
            "net11": "26:e8:85:84:88:87",
            "net2": "f6:e2:d3:29:12:67",
            "net3": "f6:19:62:3d:91:07",
            "net4": "2a:13:ee:39:29:b2",
            "net5": "16:40:00:c4:04:06",
            "net6": "86:e2:1a:53:39:87",
            "net7": "86:87:c2:f3:97:61",
            "net8": "da:c8:e8:fc:2d:c0",
            "net9": "b2:de:18:2b:02:08"
        },
        "spine_5_1_2": {
            "net0": "ce:ef:e8:77:8d:da",
            "net1": "6a:5b:3a:75:53:5e",
            "net10": "fa:dc:9f:08:50:9c",
            "net11": "9a:30:a2:8e:5d:1b",
            "net2": "ca:8a:26:3f:16:46",
            "net3": "fa:3e:01:dd:d1:4a",
            "net4": "32:fd:3f:c8:d6:9e",
            "net5": "6e:3a:8b:c2:aa:83",
            "net6": "3e:8d:10:18:2d:2b",
            "net7": "de:09:26:75:0c:2e",
            "net8": "b2:18:36:9e:2c:3b",
            "net9": "16:48:06:8b:6c:cc"
        },
        "spine_5_1_3": {
            "net0": "3a:e8:bd:99:5f:a6",
            "net1": "42:bf:fc:c0:46:96",
            "net10": "0a:dc:f6:77:4a:0e",
            "net11": "5e:48:5f:43:37:b0",
            "net2": "e2:78:a3:ab:00:a6",
            "net3": "fa:2e:24:1a:1c:e1",
            "net4": "9e:d2:f3:84:96:a6",
            "net5": "02:36:d0:04:50:85",
            "net6": "1e:92:1a:ec:c7:fe",
            "net7": "3a:55:49:f1:78:25",
            "net8": "4e:5a:8a:6b:10:27",
            "net9": "76:91:3b:e1:91:8b"
        },
        "spine_5_1_4": {
            "net0": "5e:cd:76:5c:0e:89",
            "net1": "0e:f5:c1:c2:59:04",
            "net10": "0e:95:81:95:92:d8",
            "net11": "5a:54:19:c4:c9:3b",
            "net2": "aa:a4:49:6b:aa:bc",
            "net3": "ea:71:4b:11:95:53",
            "net4": "de:8f:94:26:90:93",
            "net5": "c2:06:9c:9f:c5:ec",
            "net6": "62:8a:f7:29:f4:ef",
            "net7": "ba:d0:b0:43:ff:a8",
            "net8": "22:59:cf:24:ae:c4",
            "net9": "d2:83:3a:bc:91:64"
        },
        "spine_5_1_5": {
            "net0": "16:c7:bc:04:16:78",
            "net1": "6e:fb:bc:5b:53:a9",
            "net10": "7a:6e:e4:e8:e2:fd",
            "net11": "c2:96:6c:78:85:fd",
            "net2": "ca:95:ca:6d:89:00",
            "net3": "92:fa:51:3e:e7:a5",
            "net4": "ce:21:80:eb:81:4d",
            "net5": "6a:f8:1a:30:ed:1b",
            "net6": "52:e0:05:b8:69:c4",
            "net7": "e6:b4:d7:ca:7b:7b",
            "net8": "86:7b:62:44:39:f7",
            "net9": "3e:e2:60:7e:e0:2d"
        },
        "spine_5_1_6": {
            "net0": "4a:b7:1a:b6:b1:cc",
            "net1": "b6:22:49:7b:3b:f5",
            "net10": "0e:e9:a3:11:88:fa",
            "net11": "1e:3e:59:48:0e:5c",
            "net2": "c2:9e:8a:89:b1:2a",
            "net3": "76:b7:81:8f:bb:fc",
            "net4": "4a:3c:dd:2c:55:f7",
            "net5": "be:bc:cf:60:e1:66",
            "net6": "12:3d:95:27:bc:b0",
            "net7": "02:cb:10:32:01:54",
            "net8": "26:84:16:3d:a7:fc",
            "net9": "26:65:9e:ff:b1:b1"
        },
        "spine_6_1_1": {
            "net0": "f2:51:89:1e:07:d1",
            "net1": "aa:30:fc:1b:a6:de",
            "net10": "f6:65:60:37:5c:2e",
            "net11": "46:30:48:ed:05:3e",
            "net2": "9a:44:d3:8c:8a:79",
            "net3": "72:94:2a:97:31:9f",
            "net4": "22:7b:c6:bc:4a:d3",
            "net5": "96:5d:51:e6:80:f2",
            "net6": "7a:ee:81:31:0c:e0",
            "net7": "1a:fa:63:95:69:23",
            "net8": "a2:b1:f5:06:25:21",
            "net9": "fe:d6:51:72:d4:be"
        },
        "spine_6_1_2": {
            "net0": "de:e5:91:52:bf:11",
            "net1": "36:8d:64:63:9b:7a",
            "net10": "ee:54:84:db:70:21",
            "net11": "aa:4c:dc:40:09:20",
            "net2": "96:99:c5:a1:7c:3a",
            "net3": "a2:3d:6f:47:9e:e5",
            "net4": "52:cd:f9:6c:15:00",
            "net5": "42:3d:d2:d2:b4:88",
            "net6": "4e:5c:c8:b0:83:c5",
            "net7": "3e:13:f2:dd:fd:62",
            "net8": "d2:d1:98:2b:2c:46",
            "net9": "ee:3d:fd:17:86:e8"
        },
        "spine_6_1_3": {
            "net0": "2a:bb:7d:f0:38:e8",
            "net1": "72:fa:0d:37:0b:f1",
            "net10": "4a:57:23:4e:6e:d5",
            "net11": "8e:17:99:b1:a9:7c",
            "net2": "46:d9:71:57:23:dc",
            "net3": "c2:1b:74:80:0b:73",
            "net4": "fa:2a:3d:bf:4d:29",
            "net5": "2a:4e:04:a9:bb:ef",
            "net6": "fe:4a:2b:ca:f5:dd",
            "net7": "32:f4:fb:c6:91:b5",
            "net8": "de:44:ba:28:ac:4d",
            "net9": "56:b5:d0:82:de:42"
        },
        "spine_6_1_4": {
            "net0": "4a:ae:27:4c:9e:87",
            "net1": "46:1d:06:27:e7:7e",
            "net10": "56:b4:05:97:8e:91",
            "net11": "6a:3a:b1:2f:e0:40",
            "net2": "76:25:6a:00:c7:11",
            "net3": "ce:40:0f:bc:0f:d1",
            "net4": "7e:38:27:b0:9f:38",
            "net5": "fa:28:37:19:09:ee",
            "net6": "3e:5e:a8:6d:92:80",
            "net7": "66:c0:65:ec:c5:43",
            "net8": "6a:0c:b4:0e:a3:58",
            "net9": "72:59:d3:4b:8a:d2"
        },
        "spine_6_1_5": {
            "net0": "3a:ba:5e:65:c3:a9",
            "net1": "02:8c:a5:a0:6e:1b",
            "net10": "c6:18:2f:fa:b1:19",
            "net11": "76:89:be:bb:10:96",
            "net2": "fe:72:3f:32:84:e4",
            "net3": "6a:e3:3c:9f:55:15",
            "net4": "36:71:53:ee:b5:df",
            "net5": "3a:85:c0:29:76:c4",
            "net6": "72:db:7f:55:55:29",
            "net7": "ee:85:38:69:7b:2b",
            "net8": "f2:8f:55:f5:cc:12",
            "net9": "fa:ea:e1:36:b9:6a"
        },
        "spine_6_1_6": {
            "net0": "ba:d8:cb:d4:5c:1d",
            "net1": "7e:32:1f:f4:97:ab",
            "net10": "66:6d:a2:4f:84:e2",
            "net11": "5e:3a:85:0d:56:4b",
            "net2": "5e:92:1c:db:e9:5a",
            "net3": "aa:05:cb:be:bc:2a",
            "net4": "86:7b:3a:9c:46:87",
            "net5": "d6:86:9a:b8:45:97",
            "net6": "da:2e:3e:bc:27:37",
            "net7": "c2:de:80:3b:52:c1",
            "net8": "d6:3f:3a:ab:d9:f8",
            "net9": "86:53:e2:e3:78:36"
        },
        "tof_1_2_1": {
            "net0": "4a:8c:58:02:05:11",
            "net1": "e2:7e:ea:d2:8f:63",
            "net10": "2a:c3:5b:8c:50:a0",
            "net11": "96:17:cc:a5:ad:58",
            "net2": "c2:6a:1a:3a:cc:e6",
            "net3": "de:21:fc:c5:b0:a9",
            "net4": "56:19:bc:e2:de:27",
            "net5": "7e:99:dc:d3:3f:97",
            "net6": "62:ac:95:76:46:07",
            "net7": "76:9a:16:3c:58:88",
            "net8": "c2:e7:bc:19:84:75",
            "net9": "4a:f5:d3:e1:2a:47"
        },
        "tof_1_2_2": {
            "net0": "2e:99:47:04:1c:cf",
            "net1": "32:6f:4c:3b:61:c1",
            "net10": "ee:83:4d:13:8c:b7",
            "net11": "c6:cd:8d:a2:74:f0",
            "net2": "06:e9:b8:de:19:7a",
            "net3": "96:f3:f7:64:56:09",
            "net4": "da:a2:83:12:54:7a",
            "net5": "9a:1c:86:6c:6c:cb",
            "net6": "8a:62:0c:9f:4a:aa",
            "net7": "4a:0d:a9:d2:69:6b",
            "net8": "a2:4a:c4:00:24:4f",
            "net9": "22:6d:0e:b6:4f:97"
        },
        "tof_1_2_3": {
            "net0": "a6:00:c8:cd:34:57",
            "net1": "ae:65:12:fd:e5:95",
            "net10": "9a:40:e4:ba:05:bf",
            "net11": "72:53:c6:be:f4:b8",
            "net2": "8e:f6:47:3b:6f:b4",
            "net3": "fa:86:a2:b7:8e:ad",
            "net4": "4a:71:c4:0e:91:d7",
            "net5": "fa:f3:50:cc:1a:9a",
            "net6": "b2:82:58:77:9c:10",
            "net7": "ce:67:ed:c8:ac:4c",
            "net8": "82:8b:38:98:51:62",
            "net9": "a2:8f:2b:e9:06:d4"
        },
        "tof_1_2_4": {
            "net0": "36:e4:7a:5d:d1:ca",
            "net1": "aa:91:21:72:e0:62",
            "net10": "ee:89:86:14:28:fa",
            "net11": "e2:09:01:75:29:e7",
            "net2": "da:b3:e3:2d:c2:af",
            "net3": "1a:cf:72:54:f6:a3",
            "net4": "72:20:c9:bb:bf:f3",
            "net5": "1a:9a:af:f6:9d:4f",
            "net6": "ba:35:95:6f:ee:ce",
            "net7": "0a:6d:e9:ee:0b:a4",
            "net8": "ca:a6:9c:c3:b2:52",
            "net9": "26:42:b6:76:d4:91"
        },
        "tof_1_2_5": {
            "net0": "ea:60:78:93:4d:4c",
            "net1": "c2:8e:04:a0:b6:38",
            "net10": "a2:4f:29:82:4f:94",
            "net11": "b6:42:ed:eb:e7:dd",
            "net2": "6e:a5:46:e5:1a:91",
            "net3": "b2:13:a1:f3:50:bc",
            "net4": "76:32:5a:ea:a5:fd",
            "net5": "aa:56:47:77:06:f9",
            "net6": "9a:c5:f5:d7:5d:d6",
            "net7": "8e:d5:96:1f:75:41",
            "net8": "a6:b4:57:74:46:2d",
            "net9": "02:2f:7d:02:23:b2"
        },
        "tof_1_2_6": {
            "net0": "4a:58:6e:ca:fc:23",
            "net1": "56:21:3a:11:c3:e0",
            "net10": "5a:cb:08:bc:83:db",
            "net11": "32:37:53:c7:ca:7d",
            "net2": "e6:e3:8a:2e:ee:43",
            "net3": "5e:43:6e:59:cc:fa",
            "net4": "8e:f5:2e:80:2e:37",
            "net5": "86:c1:c9:6e:14:56",
            "net6": "12:92:d7:3b:6c:d8",
            "net7": "d2:bb:0f:1f:79:1e",
            "net8": "72:cd:d4:b1:d3:39",
            "net9": "22:a0:07:54:42:e3"
        },
        "tof_2_2_1": {
            "net0": "82:41:8e:45:82:1e",
            "net1": "36:1a:f9:79:f7:55",
            "net10": "96:1c:be:d0:e5:1d",
            "net11": "26:71:ff:5d:a9:df",
            "net2": "be:93:9d:f5:7a:0a",
            "net3": "ae:7c:43:23:ee:d0",
            "net4": "d6:a9:bf:5e:eb:f5",
            "net5": "76:b9:93:cb:dc:23",
            "net6": "fe:ec:ac:93:9a:12",
            "net7": "ea:88:b8:de:7b:50",
            "net8": "1a:1e:64:20:93:6f",
            "net9": "fa:1e:5c:26:8a:0b"
        },
        "tof_2_2_2": {
            "net0": "ca:48:96:3b:d9:c0",
            "net1": "1a:53:70:79:9a:fb",
            "net10": "aa:cf:2f:f9:6c:b5",
            "net11": "d2:63:f9:f3:87:48",
            "net2": "62:6e:d2:ad:8b:78",
            "net3": "26:c5:46:64:81:75",
            "net4": "d6:11:83:5b:5b:88",
            "net5": "d2:c0:7e:de:a3:34",
            "net6": "4a:cd:f8:08:8d:a8",
            "net7": "6a:6d:15:c8:f2:e5",
            "net8": "b2:f3:f9:05:bf:b4",
            "net9": "b2:4c:39:ad:bf:c1"
        },
        "tof_2_2_3": {
            "net0": "ce:1c:56:32:11:fd",
            "net1": "f2:04:f6:ca:1b:b4",
            "net10": "32:2f:f1:d4:4b:5a",
            "net11": "f2:0b:86:88:b7:b0",
            "net2": "c2:65:9d:47:dc:5d",
            "net3": "ee:2d:e2:b0:fa:95",
            "net4": "9a:a0:13:06:ed:1f",
            "net5": "e6:a3:e7:81:6d:9a",
            "net6": "62:ad:43:8f:1f:b2",
            "net7": "8a:07:90:32:33:02",
            "net8": "f6:a5:cc:5a:ba:0c",
            "net9": "ea:af:16:42:14:ef"
        },
        "tof_2_2_4": {
            "net0": "fa:ac:f1:85:cb:2d",
            "net1": "76:16:9b:d2:3c:35",
            "net10": "d6:fa:bf:3a:04:7b",
            "net11": "86:ad:ce:0e:fa:f4",
            "net2": "ee:30:2a:cc:3e:79",
            "net3": "ba:87:3a:c2:7c:c7",
            "net4": "7a:c5:87:a1:a7:88",
            "net5": "26:be:3b:02:9d:8e",
            "net6": "2e:88:a8:d4:4c:fc",
            "net7": "7e:7a:8d:c0:41:af",
            "net8": "86:4e:69:38:fb:25",
            "net9": "7a:56:6d:09:93:32"
        },
        "tof_2_2_5": {
            "net0": "ae:21:d5:ca:1f:24",
            "net1": "a2:5c:85:68:c3:13",
            "net10": "0a:05:53:5a:1d:a2",
            "net11": "ee:64:f6:3a:5d:0f",
            "net2": "36:5c:62:41:0c:7b",
            "net3": "ce:ca:34:25:ce:09",
            "net4": "5a:6a:95:42:b3:ab",
            "net5": "8a:32:f7:c5:2a:12",
            "net6": "9a:b8:70:29:e5:81",
            "net7": "c6:13:19:bd:8b:61",
            "net8": "12:f4:d4:a0:bd:2d",
            "net9": "f2:b6:02:c1:67:df"
        },
        "tof_2_2_6": {
            "net0": "de:e3:40:f7:da:d8",
            "net1": "2e:7f:40:b2:84:86",
            "net10": "2e:ad:65:64:e5:d4",
            "net11": "9a:e4:68:5f:29:16",
            "net2": "4a:22:a2:eb:fc:fb",
            "net3": "e6:a7:fa:54:31:a0",
            "net4": "32:38:3c:8d:d5:09",
            "net5": "a2:eb:66:b7:8f:3e",
            "net6": "82:2a:09:7a:7d:2c",
            "net7": "82:84:16:f0:a8:4f",
            "net8": "3a:6e:5e:f0:b8:56",
            "net9": "76:e5:47:0c:1c:4c"
        },
        "tof_3_2_1": {
            "net0": "1e:75:5a:e5:60:7f",
            "net1": "4e:3f:9f:98:7e:65",
            "net10": "c2:60:08:f4:06:c6",
            "net11": "12:60:2c:77:26:39",
            "net2": "66:d4:0c:49:9d:28",
            "net3": "d2:99:e6:5c:49:44",
            "net4": "52:e9:6e:dd:3c:4d",
            "net5": "1a:c2:54:9f:35:f3",
            "net6": "5a:2a:18:bd:61:32",
            "net7": "6e:d1:14:fe:f9:97",
            "net8": "ea:f8:2a:ef:da:8e",
            "net9": "06:43:7b:f7:c4:ec"
        },
        "tof_3_2_2": {
            "net0": "ee:7c:98:f6:75:ff",
            "net1": "52:01:68:d2:c8:b2",
            "net10": "8e:57:d5:69:cf:4d",
            "net11": "76:3e:5b:7d:6b:42",
            "net2": "ae:8c:bd:00:c0:4d",
            "net3": "c2:89:bc:72:ba:d5",
            "net4": "2a:2f:9b:08:03:8a",
            "net5": "9a:a4:e1:ad:07:e5",
            "net6": "be:83:1f:d8:80:dc",
            "net7": "c6:a7:54:27:3c:54",
            "net8": "2e:e4:19:8e:1b:9f",
            "net9": "da:bf:eb:d8:eb:83"
        },
        "tof_3_2_3": {
            "net0": "66:95:cf:ea:e4:01",
            "net1": "92:ae:9b:eb:25:a3",
            "net10": "aa:4e:e0:61:ef:3f",
            "net11": "ca:3d:7d:6d:64:9c",
            "net2": "c6:a9:02:83:46:aa",
            "net3": "d6:f9:22:5c:65:29",
            "net4": "52:70:a0:6d:be:99",
            "net5": "8e:c7:ef:04:11:88",
            "net6": "6a:e6:5e:7e:b1:da",
            "net7": "d2:49:48:3d:23:e2",
            "net8": "da:6b:34:0d:9e:2c",
            "net9": "2a:fa:54:5a:70:fe"
        },
        "tof_3_2_4": {
            "net0": "86:70:08:4c:95:74",
            "net1": "02:d5:fd:47:74:47",
            "net10": "96:45:86:e5:8c:9c",
            "net11": "96:99:13:cb:7c:fe",
            "net2": "3e:06:7d:ea:f0:c9",
            "net3": "42:f5:64:0a:34:35",
            "net4": "4a:2f:f7:a9:11:63",
            "net5": "46:7c:e9:9b:95:1b",
            "net6": "ae:f2:7d:e8:ed:36",
            "net7": "5e:52:c7:58:bb:6d",
            "net8": "62:65:2c:44:23:fb",
            "net9": "86:a2:2c:10:56:6c"
        },
        "tof_3_2_5": {
            "net0": "7a:c7:43:a2:34:04",
            "net1": "0a:2e:88:a2:68:c6",
            "net10": "a2:e5:5b:b7:e8:5e",
            "net11": "e6:08:7b:ef:b9:fa",
            "net2": "1a:20:85:b8:01:51",
            "net3": "62:93:cb:40:1d:33",
            "net4": "56:fa:f9:56:e5:1a",
            "net5": "aa:25:8c:ea:f0:0c",
            "net6": "9a:9c:0a:49:e7:29",
            "net7": "ce:7d:b8:94:32:02",
            "net8": "52:1c:e8:8a:66:f7",
            "net9": "36:4d:df:65:17:3e"
        },
        "tof_3_2_6": {
            "net0": "0e:54:6e:c1:0d:96",
            "net1": "de:e9:b5:5b:9b:fb",
            "net10": "5e:a7:e9:8c:f9:d4",
            "net11": "5a:36:19:ea:92:6e",
            "net2": "12:85:b1:1d:ea:ec",
            "net3": "e2:49:07:92:e3:75",
            "net4": "96:4d:8e:ad:54:e1",
            "net5": "6e:14:06:c2:c9:14",
            "net6": "d6:8d:df:fd:0b:33",
            "net7": "72:2d:e4:55:2d:32",
            "net8": "fe:0e:06:7b:d7:ad",
            "net9": "fe:d0:05:24:b9:1f"
        }
    },
    "failed_machine": "spine_1_1_1",
    "failed_interfaces": [
        "net6"
    ],
    "failure_time": 1614984580.3664854,
    "recover_time": 1614984821.1833394
}