{
    "description": "Scenario 4b: Spine spine_1_1_1 failure and recovery with BGP",
    "k_leaf": 6,
    "k_top": 6,
    "redundancy_factor": 1,
    "is_k8s": true,
    "machine_mac_addresses": {
        "leaf_10_0_1": {
            "net0": "ee:f0:f1:fe:3a:3a",
            "net1": "9a:ab:fe:e5:c0:f8",
            "net2": "4e:2f:22:4b:77:e5",
            "net3": "a2:26:0d:6e:75:7d",
            "net4": "1e:73:25:09:b1:13",
            "net5": "b6:c4:d6:c0:ec:74",
            "net6": "b2:11:5f:e4:ce:5f"
        },
        "leaf_10_0_2": {
            "net0": "5e:1a:18:b5:88:2c",
            "net1": "86:df:70:9a:f2:d5",
            "net2": "b6:61:6c:06:71:c6",
            "net3": "c2:74:63:af:31:2f",
            "net4": "0a:93:4d:89:94:30",
            "net5": "12:13:f8:6c:7f:9e",
            "net6": "66:b2:c5:7b:f3:7c"
        },
        "leaf_10_0_3": {
            "net0": "a2:af:62:89:95:82",
            "net1": "32:d8:d3:49:7f:da",
            "net2": "c2:c3:52:17:1e:02",
            "net3": "1e:0c:f7:9c:21:2c",
            "net4": "92:ee:61:df:d0:58",
            "net5": "ee:3c:15:d6:37:e3",
            "net6": "be:91:3a:fc:8b:d2"
        },
        "leaf_10_0_4": {
            "net0": "3e:22:c8:62:00:27",
            "net1": "2e:d7:75:e0:59:9f",
            "net2": "8e:e9:27:83:77:43",
            "net3": "ba:38:55:92:61:85",
            "net4": "22:54:cf:7d:17:70",
            "net5": "fe:6e:c3:d8:76:4a",
            "net6": "86:d0:03:b7:18:7c"
        },
        "leaf_10_0_5": {
            "net0": "0e:98:49:96:0e:d7",
            "net1": "d2:c1:ae:7b:90:ae",
            "net2": "3a:89:86:2f:a0:97",
            "net3": "d2:b6:5a:eb:1e:e7",
            "net4": "32:2a:d9:47:d1:08",
            "net5": "6e:bf:51:72:19:fb",
            "net6": "be:f0:21:a7:9b:a2"
        },
        "leaf_10_0_6": {
            "net0": "d2:1a:2c:47:7a:7e",
            "net1": "66:39:f8:f5:09:71",
            "net2": "a2:5a:e2:70:87:68",
            "net3": "a6:5f:7e:d8:f9:ce",
            "net4": "32:9f:5f:44:83:da",
            "net5": "c2:0d:a5:9f:3e:8c",
            "net6": "be:6c:4b:a3:f6:ad"
        },
        "leaf_11_0_1": {
            "net0": "b6:1d:be:b3:dd:72",
            "net1": "d2:d7:c2:df:f5:9b",
            "net2": "4a:98:48:c4:d6:83",
            "net3": "5a:a0:60:c6:14:98",
            "net4": "ba:d3:e4:6d:37:eb",
            "net5": "f2:5d:26:29:50:c1",
            "net6": "ba:5d:c0:56:6e:2d"
        },
        "leaf_11_0_2": {
            "net0": "be:4e:e0:71:1b:24",
            "net1": "2a:58:ab:0a:6c:10",
            "net2": "d6:f0:fc:21:91:03",
            "net3": "ba:f4:10:49:cf:df",
            "net4": "d6:ad:55:2c:ee:5e",
            "net5": "b6:63:eb:9b:3d:56",
            "net6": "ee:12:ac:5c:7c:97"
        },
        "leaf_11_0_3": {
            "net0": "2a:78:6b:da:c3:33",
            "net1": "02:40:8d:d9:4c:8c",
            "net2": "06:8c:02:e7:88:63",
            "net3": "2e:43:af:c0:28:54",
            "net4": "8e:06:9e:a9:a5:41",
            "net5": "72:93:7f:9a:bd:56",
            "net6": "ae:de:be:5e:67:88"
        },
        "leaf_11_0_4": {
            "net0": "de:25:51:0d:e5:c0",
            "net1": "a2:29:42:6b:da:a6",
            "net2": "2a:fd:05:2a:c3:b7",
            "net3": "da:f5:9d:67:f5:e3",
            "net4": "6e:7a:06:bb:99:9c",
            "net5": "0a:46:d3:ee:b2:1e",
            "net6": "6a:33:c7:44:91:8a"
        },
        "leaf_11_0_5": {
            "net0": "6e:ee:d0:95:0c:cd",
            "net1": "3a:c7:07:f1:be:a3",
            "net2": "56:7c:d7:3c:de:52",
            "net3": "9e:93:57:a1:1f:d2",
            "net4": "1a:7f:6c:dc:b3:d2",
            "net5": "4a:d1:2a:49:8b:d8",
            "net6": "a2:d5:14:0f:62:77"
        },
        "leaf_11_0_6": {
            "net0": "5a:28:a4:14:2c:2a",
            "net1": "22:57:be:b5:2b:1f",
            "net2": "46:e0:06:d3:d2:37",
            "net3": "46:ce:ac:54:ce:52",
            "net4": "ee:f4:2d:4b:db:00",
            "net5": "02:7d:75:40:ae:0d",
            "net6": "e6:10:62:f8:f9:83"
        },
        "leaf_12_0_1": {
            "net0": "c2:c9:ef:fd:63:0b",
            "net1": "3a:fd:e0:16:1b:e5",
            "net2": "56:b4:54:e4:a7:5f",
            "net3": "62:53:82:95:33:5a",
            "net4": "4a:d3:fd:30:07:67",
            "net5": "a6:52:9f:27:4f:97",
            "net6": "ee:21:eb:a3:79:54"
        },
        "leaf_12_0_2": {
            "net0": "c2:8b:0d:f6:df:9e",
            "net1": "4a:20:87:71:87:11",
            "net2": "ce:a7:d9:d0:a0:c3",
            "net3": "86:c9:5a:a5:04:c0",
            "net4": "42:a3:f2:59:df:b9",
            "net5": "d6:12:ce:b2:d2:7f",
            "net6": "6a:aa:09:30:28:31"
        },
        "leaf_12_0_3": {
            "net0": "6e:fd:f9:32:27:ff",
            "net1": "a6:bc:d5:2d:85:f1",
            "net2": "6e:e9:89:44:dd:ee",
            "net3": "96:d1:d8:5d:a5:63",
            "net4": "1e:da:b1:1a:07:d4",
            "net5": "1e:aa:ec:09:69:b5",
            "net6": "62:6c:19:2b:12:54"
        },
        "leaf_12_0_4": {
            "net0": "3e:b8:ad:10:66:4d",
            "net1": "5e:ae:19:16:74:c8",
            "net2": "86:83:7a:73:b2:98",
            "net3": "fa:63:62:d4:91:24",
            "net4": "0e:c3:84:82:f1:ce",
            "net5": "06:19:b0:56:06:73",
            "net6": "e2:99:b6:ef:35:33"
        },
        "leaf_12_0_5": {
            "net0": "e2:97:91:5e:13:db",
            "net1": "32:06:aa:de:cc:2e",
            "net2": "32:af:b3:78:63:88",
            "net3": "2a:ad:6f:01:63:ee",
            "net4": "4a:16:e9:b4:51:9d",
            "net5": "36:88:db:d8:dd:87",
            "net6": "06:92:ce:b2:7b:16"
        },
        "leaf_12_0_6": {
            "net0": "42:d5:43:d2:ee:64",
            "net1": "5e:0d:24:ec:9e:ad",
            "net2": "2e:38:7c:5f:c6:cb",
            "net3": "92:8e:39:08:13:95",
            "net4": "06:b0:14:c5:57:82",
            "net5": "ca:8a:7e:fa:2e:bd",
            "net6": "b2:f1:25:6c:27:35"
        },
        "leaf_1_0_1": {
            "net0": "d2:83:54:fe:29:25",
            "net1": "76:ae:ea:aa:39:5c",
            "net2": "da:d0:fc:09:5b:1c",
            "net3": "ea:1b:37:b7:ce:ff",
            "net4": "a2:b4:b0:49:5b:b1",
            "net5": "42:a0:b5:ce:56:55",
            "net6": "ce:d4:1d:2e:36:cd"
        },
        "leaf_1_0_2": {
            "net0": "0e:b6:20:14:90:1b",
            "net1": "26:16:c9:1a:b5:00",
            "net2": "0a:ae:30:2a:89:d3",
            "net3": "8a:c5:18:a0:48:7a",
            "net4": "2a:fb:9a:55:8c:64",
            "net5": "e2:f1:f3:11:07:f5",
            "net6": "ca:66:2d:f0:ab:e8"
        },
        "leaf_1_0_3": {
            "net0": "de:d9:08:17:f6:88",
            "net1": "3a:02:63:a4:84:d3",
            "net2": "d6:3b:c7:04:6a:70",
            "net3": "96:40:73:4e:6b:bb",
            "net4": "a2:4b:f2:0e:d8:b0",
            "net5": "e6:c9:36:d2:79:c4",
            "net6": "62:e9:f5:74:80:b3"
        },
        "leaf_1_0_4": {
            "net0": "92:e6:ce:8b:99:bb",
            "net1": "ae:25:a4:5c:54:a9",
            "net2": "6a:8f:32:15:0c:76",
            "net3": "f2:69:fe:d1:0a:88",
            "net4": "da:45:3e:ae:0c:70",
            "net5": "2a:91:3f:a1:61:d0",
            "net6": "c6:ae:47:e3:ae:fe"
        },
        "leaf_1_0_5": {
            "net0": "32:26:53:67:ec:01",
            "net1": "ee:69:ab:e1:14:a3",
            "net2": "66:60:d8:02:04:81",
            "net3": "06:af:b9:02:30:30",
            "net4": "f6:5b:5a:6f:4b:e1",
            "net5": "0a:ff:8c:2a:76:36",
            "net6": "be:5d:a9:2f:d6:13"
        },
        "leaf_1_0_6": {
            "net0": "d6:7e:91:e4:56:a6",
            "net1": "76:ad:a6:be:98:e4",
            "net2": "f6:69:ae:a2:b2:8e",
            "net3": "c6:27:3a:a0:ce:93",
            "net4": "26:1c:d6:ad:54:26",
            "net5": "9e:e9:86:6f:23:5e",
            "net6": "1a:e9:3b:ad:1b:47"
        },
        "leaf_2_0_1": {
            "net0": "c2:89:81:e7:b2:c5",
            "net1": "92:c3:3f:6d:23:ab",
            "net2": "e2:2d:61:20:65:9c",
            "net3": "ce:90:4b:f1:47:3c",
            "net4": "26:71:90:c2:1e:19",
            "net5": "06:5a:8e:aa:7f:d4",
            "net6": "06:71:1b:3b:2b:4d"
        },
        "leaf_2_0_2": {
            "net0": "b6:c7:63:4a:7f:ac",
            "net1": "92:86:14:ab:1b:84",
            "net2": "2a:15:4b:8c:80:a1",
            "net3": "16:31:92:2d:fb:4e",
            "net4": "7e:be:15:7b:b5:78",
            "net5": "9e:2f:d3:38:f0:82",
            "net6": "1e:70:18:9b:30:74"
        },
        "leaf_2_0_3": {
            "net0": "a6:08:0d:70:f7:16",
            "net1": "02:2b:f5:00:d7:e3",
            "net2": "96:40:27:ca:99:0b",
            "net3": "32:20:ad:64:bc:d6",
            "net4": "6a:93:25:20:5c:96",
            "net5": "0e:31:65:6e:30:7c",
            "net6": "32:4b:cd:83:e9:df"
        },
        "leaf_2_0_4": {
            "net0": "22:2b:7b:27:13:69",
            "net1": "22:c6:ff:ed:80:9c",
            "net2": "de:ea:59:4e:1f:02",
            "net3": "3a:ff:0a:3c:1c:bd",
            "net4": "22:ba:a9:19:f4:a4",
            "net5": "7a:f0:a8:8c:8f:31",
            "net6": "3a:9f:6a:7d:ae:0d"
        },
        "leaf_2_0_5": {
            "net0": "52:9a:07:f8:c7:3f",
            "net1": "32:8a:29:85:c2:fd",
            "net2": "fe:38:a2:be:32:89",
            "net3": "82:1b:a3:a5:ef:6c",
            "net4": "ae:d3:0f:70:e4:fe",
            "net5": "96:ac:7a:61:68:d1",
            "net6": "36:72:6c:ee:cb:8e"
        },
        "leaf_2_0_6": {
            "net0": "5a:2a:55:06:53:0c",
            "net1": "c2:44:91:0b:2a:b8",
            "net2": "ce:d9:fa:00:1a:01",
            "net3": "ca:8d:69:f6:2c:a4",
            "net4": "06:ea:2e:cc:2f:70",
            "net5": "f6:a6:af:0b:15:30",
            "net6": "da:73:f8:69:23:43"
        },
        "leaf_3_0_1": {
            "net0": "be:0d:63:83:6d:fd",
            "net1": "42:a0:bf:5a:b1:5b",
            "net2": "22:89:e9:0b:06:af",
            "net3": "72:99:e3:d7:3c:1e",
            "net4": "f2:fd:09:6f:cd:17",
            "net5": "ae:e0:ea:99:f6:27",
            "net6": "72:db:51:d9:d1:e2"
        },
        "leaf_3_0_2": {
            "net0": "ca:f1:a5:72:c1:78",
            "net1": "6a:2f:53:17:eb:63",
            "net2": "e6:74:d1:ff:78:66",
            "net3": "4a:11:01:fd:de:93",
            "net4": "a6:aa:1b:70:89:54",
            "net5": "2e:35:19:74:03:0c",
            "net6": "e6:ba:47:18:20:73"
        },
        "leaf_3_0_3": {
            "net0": "f2:8d:5e:7c:4b:6c",
            "net1": "2e:11:c1:d1:ac:cb",
            "net2": "76:0f:54:fb:6d:54",
            "net3": "ca:b6:63:a7:a6:fa",
            "net4": "fa:45:1f:32:af:fc",
            "net5": "f2:87:a9:51:cd:e3",
            "net6": "0e:63:cf:4a:b5:e1"
        },
        "leaf_3_0_4": {
            "net0": "b6:9e:58:ba:5f:65",
            "net1": "f6:1f:82:42:3c:99",
            "net2": "b6:38:2b:2a:cd:71",
            "net3": "ae:c2:9f:4b:e9:4b",
            "net4": "5e:ad:8d:00:e9:1e",
            "net5": "b6:17:d5:6c:73:5f",
            "net6": "ce:18:7f:ee:2d:74"
        },
        "leaf_3_0_5": {
            "net0": "6e:8e:72:ef:40:8c",
            "net1": "f2:b6:45:03:8c:f0",
            "net2": "be:fb:05:0e:29:1f",
            "net3": "3e:7e:39:d8:47:ff",
            "net4": "ea:5c:a7:3f:97:1a",
            "net5": "ba:b8:50:40:21:f8",
            "net6": "a6:bc:10:15:5f:d4"
        },
        "leaf_3_0_6": {
            "net0": "da:cc:6d:e7:17:e1",
            "net1": "be:a7:d9:9e:e9:a9",
            "net2": "32:1d:e1:8c:1b:6e",
            "net3": "12:42:4f:f5:8a:c0",
            "net4": "ae:ef:34:a6:b8:e5",
            "net5": "aa:8a:cd:ea:60:1f",
            "net6": "ce:9c:b5:0c:b0:14"
        },
        "leaf_4_0_1": {
            "net0": "16:28:8a:65:b8:4b",
            "net1": "96:26:02:82:4b:93",
            "net2": "ba:02:f6:ea:0b:14",
            "net3": "02:9a:b2:69:b4:19",
            "net4": "aa:d4:d4:fd:65:d2",
            "net5": "16:e2:13:b9:b6:85",
            "net6": "26:70:a1:bd:e6:14"
        },
        "leaf_4_0_2": {
            "net0": "12:41:ae:c5:7e:e9",
            "net1": "9a:5d:c3:ee:df:3b",
            "net2": "16:65:1c:05:70:76",
            "net3": "2e:8a:54:79:b0:20",
            "net4": "d2:85:16:b7:c0:da",
            "net5": "52:79:38:f3:fb:a5",
            "net6": "92:25:34:70:c1:09"
        },
        "leaf_4_0_3": {
            "net0": "1a:52:5c:83:52:cd",
            "net1": "6a:b8:f3:86:41:48",
            "net2": "be:af:c7:37:4e:bf",
            "net3": "46:4e:d9:9e:08:8a",
            "net4": "2e:cb:fe:ef:93:26",
            "net5": "6e:3d:b9:42:b5:8a",
            "net6": "8e:16:3f:3c:d0:85"
        },
        "leaf_4_0_4": {
            "net0": "26:51:b5:44:fd:ef",
            "net1": "ee:e9:13:e6:27:ca",
            "net2": "ee:cb:6d:39:cf:e4",
            "net3": "ca:75:6a:e5:4c:4f",
            "net4": "d6:0c:17:28:25:0c",
            "net5": "86:21:ee:3f:84:36",
            "net6": "f6:45:ba:8d:e1:e7"
        },
        "leaf_4_0_5": {
            "net0": "72:47:0b:5f:66:cd",
            "net1": "16:0e:a8:dd:6b:ab",
            "net2": "22:88:e8:4e:1d:88",
            "net3": "76:2f:86:2d:64:b4",
            "net4": "1e:c9:3c:25:83:e1",
            "net5": "8e:b3:93:9f:c9:2b",
            "net6": "32:fc:38:b7:44:83"
        },
        "leaf_4_0_6": {
            "net0": "22:b2:25:d7:75:6d",
            "net1": "2e:28:6e:88:77:ee",
            "net2": "9a:83:55:20:e5:c5",
            "net3": "7e:86:ac:88:96:d1",
            "net4": "ce:81:5d:89:34:5f",
            "net5": "72:ee:7b:b5:df:4f",
            "net6": "52:c6:d7:76:0a:cb"
        },
        "leaf_5_0_1": {
            "net0": "e2:77:d7:57:e6:c4",
            "net1": "aa:4b:6f:87:e2:82",
            "net2": "4e:61:75:56:16:48",
            "net3": "0a:ab:ae:ec:2d:a7",
            "net4": "ca:0e:8e:20:ab:4b",
            "net5": "a6:13:21:13:8c:70",
            "net6": "32:cb:d6:e3:0b:73"
        },
        "leaf_5_0_2": {
            "net0": "ce:e6:11:df:4b:75",
            "net1": "6e:54:0e:3c:9e:71",
            "net2": "5a:06:24:49:3a:4d",
            "net3": "da:ee:41:b2:2a:c4",
            "net4": "82:05:e3:b9:fe:1c",
            "net5": "32:dd:fa:eb:8c:6f",
            "net6": "ea:97:69:3a:4b:8a"
        },
        "leaf_5_0_3": {
            "net0": "be:3e:5c:0d:5e:2b",
            "net1": "66:d8:71:e8:68:39",
            "net2": "9a:ad:2b:72:66:9c",
            "net3": "ca:69:34:d9:b4:0b",
            "net4": "b6:cd:05:c0:35:b2",
            "net5": "82:22:f4:b3:ab:05",
            "net6": "e6:54:c5:80:48:2b"
        },
        "leaf_5_0_4": {
            "net0": "ce:f1:0f:8f:04:44",
            "net1": "ee:fc:ef:51:a5:fc",
            "net2": "1e:25:1b:30:90:e9",
            "net3": "e6:f3:5b:94:2c:09",
            "net4": "b6:6f:ed:90:24:48",
            "net5": "f2:90:58:24:01:da",
            "net6": "4a:b7:e8:5f:9b:e3"
        },
        "leaf_5_0_5": {
            "net0": "12:c4:a5:d6:6e:7d",
            "net1": "6a:2e:f1:57:64:4a",
            "net2": "92:2d:06:cc:7c:81",
            "net3": "7e:a4:45:74:59:9e",
            "net4": "12:7b:31:57:d0:a1",
            "net5": "16:d2:20:78:1c:a0",
            "net6": "0e:4c:37:23:53:2d"
        },
        "leaf_5_0_6": {
            "net0": "12:0a:f2:78:14:61",
            "net1": "aa:61:4e:b3:6c:b7",
            "net2": "4e:04:1a:76:ae:81",
            "net3": "e2:d4:8c:31:64:be",
            "net4": "4a:b6:87:ff:95:f0",
            "net5": "76:f4:82:6f:12:dd",
            "net6": "fe:6c:83:2f:ae:60"
        },
        "leaf_6_0_1": {
            "net0": "22:16:22:91:71:c3",
            "net1": "be:06:26:b2:b2:5b",
            "net2": "8e:e5:47:91:c4:91",
            "net3": "da:7e:36:bf:71:5a",
            "net4": "0a:89:c1:b5:e2:2e",
            "net5": "d2:d5:09:08:51:09",
            "net6": "3a:f2:20:d6:a9:a2"
        },
        "leaf_6_0_2": {
            "net0": "fa:38:5f:e2:e0:dc",
            "net1": "1e:b5:77:7c:7f:c6",
            "net2": "d6:fe:d2:43:7c:3d",
            "net3": "22:28:20:39:74:89",
            "net4": "2a:28:e4:1f:61:40",
            "net5": "b6:94:67:b7:cc:38",
            "net6": "92:0d:4f:6f:f9:bb"
        },
        "leaf_6_0_3": {
            "net0": "3a:8f:da:f6:80:56",
            "net1": "f6:f3:8c:ac:2b:d7",
            "net2": "ee:46:28:cb:18:59",
            "net3": "ae:b5:65:56:42:76",
            "net4": "6e:83:54:a1:41:e7",
            "net5": "7a:81:e4:bb:c8:32",
            "net6": "da:ed:d0:fc:15:07"
        },
        "leaf_6_0_4": {
            "net0": "d2:ae:1d:65:cd:20",
            "net1": "a2:f5:a4:6f:ef:e6",
            "net2": "a6:40:13:bd:06:00",
            "net3": "06:d0:d8:d3:13:51",
            "net4": "1e:bc:e3:e4:34:88",
            "net5": "7e:91:10:ad:bd:b3",
            "net6": "c6:ba:cf:4d:10:4f"
        },
        "leaf_6_0_5": {
            "net0": "2e:43:4f:40:5a:fd",
            "net1": "8a:74:7b:00:7f:fb",
            "net2": "ae:7b:b4:86:d6:ae",
            "net3": "8e:55:a9:2f:cb:b6",
            "net4": "1e:8d:39:5a:b2:04",
            "net5": "42:73:b1:0d:69:b5",
            "net6": "56:7f:a4:da:1b:40"
        },
        "leaf_6_0_6": {
            "net0": "7e:ee:00:1e:8e:4a",
            "net1": "a2:d8:96:d3:3c:95",
            "net2": "d6:76:2d:20:56:4a",
            "net3": "de:e3:25:a2:fe:f7",
            "net4": "56:0d:39:3b:69:75",
            "net5": "9e:21:7b:a7:3e:08",
            "net6": "4e:53:ba:95:55:5b"
        },
        "leaf_7_0_1": {
            "net0": "06:ac:53:3a:c3:30",
            "net1": "f6:80:b8:db:af:74",
            "net2": "26:84:7c:0e:24:76",
            "net3": "3e:81:1a:fb:45:58",
            "net4": "46:f9:3c:0d:4b:8e",
            "net5": "96:7d:e9:4e:9d:06",
            "net6": "72:37:b4:e5:d0:e7"
        },
        "leaf_7_0_2": {
            "net0": "ea:0b:b0:1a:9d:8f",
            "net1": "c2:9b:cf:53:84:29",
            "net2": "da:c1:62:4c:45:34",
            "net3": "ea:57:dc:a3:91:0f",
            "net4": "7e:7b:49:04:5a:11",
            "net5": "ca:ba:77:52:41:d0",
            "net6": "e6:d5:3d:d7:3d:2d"
        },
        "leaf_7_0_3": {
            "net0": "32:04:80:47:bf:ea",
            "net1": "b6:8a:fc:a6:1a:81",
            "net2": "5a:92:a6:f3:54:62",
            "net3": "7e:64:2c:0f:33:e3",
            "net4": "da:bb:7b:90:e8:13",
            "net5": "36:35:e0:31:31:98",
            "net6": "d2:25:ec:b8:06:46"
        },
        "leaf_7_0_4": {
            "net0": "4a:e1:c3:6e:3e:bc",
            "net1": "06:6a:8f:c6:e2:f3",
            "net2": "92:35:39:48:ed:c4",
            "net3": "1a:ae:01:41:1f:ad",
            "net4": "ee:f3:50:50:7a:51",
            "net5": "02:f6:f5:2a:0a:fe",
            "net6": "76:f8:64:4a:3d:09"
        },
        "leaf_7_0_5": {
            "net0": "c2:45:40:d5:31:a9",
            "net1": "3a:2c:7d:27:74:b8",
            "net2": "72:8d:fd:09:ba:a0",
            "net3": "7a:68:3c:02:98:56",
            "net4": "fa:e8:bb:cb:7b:db",
            "net5": "82:8a:a2:3b:e2:47",
            "net6": "da:b0:8f:df:3c:3a"
        },
        "leaf_7_0_6": {
            "net0": "56:dc:0b:17:c8:e3",
            "net1": "1a:38:4b:08:a1:5f",
            "net2": "92:0f:eb:65:89:17",
            "net3": "ce:94:b2:30:d1:a0",
            "net4": "ea:6b:56:c2:3e:4d",
            "net5": "ae:90:d0:23:90:e1",
            "net6": "b2:34:30:1d:35:2a"
        },
        "leaf_8_0_1": {
            "net0": "e6:a5:bb:95:66:dc",
            "net1": "56:48:6f:16:d0:b1",
            "net2": "06:eb:9c:bf:79:39",
            "net3": "06:3c:d2:58:75:09",
            "net4": "e2:48:55:ec:7d:c4",
            "net5": "76:ef:93:d1:bc:4f",
            "net6": "12:fe:a0:4f:7f:7f"
        },
        "leaf_8_0_2": {
            "net0": "ca:27:3f:63:8e:1d",
            "net1": "b2:8e:b6:65:65:41",
            "net2": "8e:46:d7:25:36:8f",
            "net3": "1a:c4:20:fb:2a:36",
            "net4": "7e:eb:5c:94:e4:ac",
            "net5": "0a:25:f0:15:89:ea",
            "net6": "a2:e5:fc:54:14:45"
        },
        "leaf_8_0_3": {
            "net0": "ee:32:9d:65:bb:b2",
            "net1": "e2:3c:97:9d:e8:46",
            "net2": "32:34:04:81:ae:8d",
            "net3": "82:98:b7:32:f2:d4",
            "net4": "5a:cd:25:74:67:77",
            "net5": "0a:21:b7:7d:3d:c6",
            "net6": "f2:8c:8e:8f:a8:82"
        },
        "leaf_8_0_4": {
            "net0": "52:43:0d:a2:5f:ba",
            "net1": "aa:ea:12:74:8b:94",
            "net2": "92:67:93:fd:14:11",
            "net3": "b6:ce:89:50:6c:fa",
            "net4": "9e:fa:ae:a3:07:68",
            "net5": "7a:2b:4a:84:05:44",
            "net6": "1a:23:5b:4c:c7:01"
        },
        "leaf_8_0_5": {
            "net0": "de:5b:d4:a3:d1:d8",
            "net1": "da:da:61:e5:f9:8f",
            "net2": "86:46:42:b7:0a:b8",
            "net3": "d2:73:a9:c8:63:b6",
            "net4": "76:2c:c0:68:db:ca",
            "net5": "22:59:a5:54:f5:9d",
            "net6": "fa:0b:16:54:00:08"
        },
        "leaf_8_0_6": {
            "net0": "c2:31:c0:50:73:d5",
            "net1": "8a:61:51:df:dd:7a",
            "net2": "de:f4:da:9d:93:69",
            "net3": "3e:70:f8:bc:98:75",
            "net4": "6e:cf:2f:57:93:99",
            "net5": "1a:c6:98:c2:96:2c",
            "net6": "3a:ac:8e:70:5d:3b"
        },
        "leaf_9_0_1": {
            "net0": "72:27:1c:9c:9c:e4",
            "net1": "e6:39:99:36:bd:ad",
            "net2": "72:26:88:6d:61:89",
            "net3": "a2:12:1b:03:de:9a",
            "net4": "1e:37:b7:7d:7c:c0",
            "net5": "c2:97:cc:f9:b8:25",
            "net6": "5e:da:af:46:8d:54"
        },
        "leaf_9_0_2": {
            "net0": "3e:a6:2a:47:c9:70",
            "net1": "9e:26:3d:e2:84:94",
            "net2": "a6:fb:2f:71:28:06",
            "net3": "56:d2:c1:9a:fa:a7",
            "net4": "de:71:ad:4d:b8:e8",
            "net5": "62:6e:ea:f4:6c:43",
            "net6": "92:fe:e0:de:b0:20"
        },
        "leaf_9_0_3": {
            "net0": "a6:1f:b0:0a:ad:f3",
            "net1": "12:c0:b1:ce:08:4f",
            "net2": "2e:73:5e:e9:61:65",
            "net3": "72:9c:0e:20:68:04",
            "net4": "1a:86:4e:a0:d0:6e",
            "net5": "72:eb:89:8f:73:82",
            "net6": "a6:ac:8c:01:69:d4"
        },
        "leaf_9_0_4": {
            "net0": "e6:e6:9a:2d:d9:3a",
            "net1": "0e:e5:71:4b:b4:ba",
            "net2": "26:c1:81:11:0d:78",
            "net3": "1a:d2:e0:41:46:ab",
            "net4": "62:54:80:7f:de:2d",
            "net5": "12:98:fd:97:ce:2d",
            "net6": "52:c8:d9:f0:74:0c"
        },
        "leaf_9_0_5": {
            "net0": "a2:13:c4:2e:2f:93",
            "net1": "0e:96:dc:46:75:26",
            "net2": "be:36:82:ec:a0:f0",
            "net3": "52:fc:9a:73:7d:64",
            "net4": "4a:c6:46:38:33:41",
            "net5": "82:f7:80:c0:52:bc",
            "net6": "12:74:97:54:15:bb"
        },
        "leaf_9_0_6": {
            "net0": "be:84:2f:bb:32:9d",
            "net1": "de:b1:ac:44:f4:7f",
            "net2": "52:a5:6c:04:2b:06",
            "net3": "c6:0f:9b:c6:95:fc",
            "net4": "ee:c5:ad:c8:88:0a",
            "net5": "fe:62:ff:4b:a9:9f",
            "net6": "aa:b7:f5:46:a4:5e"
        },
        "spine_10_1_1": {
            "net0": "6e:76:6d:de:74:f6",
            "net1": "fe:6e:33:8e:05:48",
            "net10": "56:04:55:1d:14:07",
            "net11": "e2:d2:12:a2:1d:03",
            "net2": "46:3f:f2:a3:09:35",
            "net3": "d6:1a:f3:aa:81:f3",
            "net4": "c2:ef:b4:11:0f:58",
            "net5": "c2:19:22:ba:5a:ed",
            "net6": "9e:7f:6f:69:78:8b",
            "net7": "ee:db:4b:62:30:5e",
            "net8": "4e:01:1e:60:df:ce",
            "net9": "72:29:21:12:05:0e"
        },
        "spine_10_1_2": {
            "net0": "72:ce:37:f5:06:5d",
            "net1": "fa:c4:5e:a8:ef:0f",
            "net10": "ba:35:af:54:2a:2f",
            "net11": "f6:64:a5:16:7f:a3",
            "net2": "3a:f3:4b:84:c0:06",
            "net3": "86:36:07:cb:2b:db",
            "net4": "3a:b0:58:39:2f:73",
            "net5": "22:07:63:1c:06:20",
            "net6": "16:d6:d3:9a:c6:08",
            "net7": "4e:ff:10:db:99:a6",
            "net8": "06:8a:41:6d:48:0d",
            "net9": "0e:8e:a8:d0:15:06"
        },
        "spine_10_1_3": {
            "net0": "f6:1a:15:9a:87:d8",
            "net1": "ce:c0:34:ec:40:ad",
            "net10": "5a:55:14:d3:c2:26",
            "net11": "b6:ef:3b:f5:bf:a1",
            "net2": "12:64:5f:fb:71:c8",
            "net3": "d2:42:0c:b5:98:cd",
            "net4": "2e:d3:d4:86:a7:13",
            "net5": "8e:e4:71:7e:c6:03",
            "net6": "36:2a:fd:c9:fb:0e",
            "net7": "1e:f5:59:7e:ea:1c",
            "net8": "3a:2a:4b:78:8d:21",
            "net9": "6a:f0:0b:4d:97:6c"
        },
        "spine_10_1_4": {
            "net0": "9a:52:b6:37:b8:81",
            "net1": "2e:97:0f:1b:ec:ed",
            "net10": "36:5e:c2:b5:93:0a",
            "net11": "f6:20:c2:94:64:c2",
            "net2": "06:a6:56:75:a7:b5",
            "net3": "be:17:51:4a:6b:b7",
            "net4": "36:c9:43:fb:3f:bd",
            "net5": "7a:90:00:55:70:77",
            "net6": "a6:d4:ee:2e:3a:05",
            "net7": "6e:44:38:d3:d0:b9",
            "net8": "c2:41:4a:e9:84:73",
            "net9": "ae:46:b4:94:4e:b8"
        },
        "spine_10_1_5": {
            "net0": "be:39:5b:f8:94:66",
            "net1": "66:b0:40:79:25:ba",
            "net10": "22:32:96:97:1a:5b",
            "net11": "0a:f0:59:68:9b:6e",
            "net2": "46:7f:43:21:b1:6d",
            "net3": "5e:26:f9:9d:7b:b1",
            "net4": "12:46:81:0c:e0:e9",
            "net5": "16:6a:fb:a4:f4:c4",
            "net6": "42:65:2d:dc:7c:cc",
            "net7": "ee:22:e6:4a:c7:5d",
            "net8": "de:66:43:5a:de:76",
            "net9": "6a:ad:67:c2:16:0a"
        },
        "spine_10_1_6": {
            "net0": "ce:5d:d6:79:a5:e3",
            "net1": "56:81:d8:0c:6d:df",
            "net10": "56:9f:95:a0:35:c0",
            "net11": "3a:58:f9:a6:6f:65",
            "net2": "6a:cf:06:dc:ac:93",
            "net3": "0a:0f:ba:bf:67:f2",
            "net4": "de:12:c0:c2:cf:ac",
            "net5": "fa:00:82:b7:3e:5c",
            "net6": "a6:94:8f:d4:31:9d",
            "net7": "0a:ad:e0:4c:72:bc",
            "net8": "de:2d:56:01:31:da",
            "net9": "fe:55:a6:df:8c:d4"
        },
        "spine_11_1_1": {
            "net0": "02:0a:a8:46:3e:93",
            "net1": "76:de:56:88:f2:5f",
            "net10": "52:61:8c:80:d8:c5",
            "net11": "d2:ce:57:1f:a7:83",
            "net2": "ae:b0:4b:eb:ca:53",
            "net3": "8a:9c:80:0e:87:d9",
            "net4": "82:b0:f9:3a:03:8c",
            "net5": "f2:7c:b5:16:4e:0b",
            "net6": "4a:67:f8:a9:9c:40",
            "net7": "be:53:fa:df:b2:8e",
            "net8": "4a:13:2d:72:19:57",
            "net9": "76:8e:9f:98:3b:6a"
        },
        "spine_11_1_2": {
            "net0": "2e:b4:c6:94:69:6f",
            "net1": "ea:4d:cd:19:34:3d",
            "net10": "02:e1:dd:eb:b1:9e",
            "net11": "9a:e5:51:ca:87:2c",
            "net2": "06:f3:05:b6:11:eb",
            "net3": "0e:1f:16:1f:01:6d",
            "net4": "be:ba:dc:f4:8b:8f",
            "net5": "ea:82:5d:ee:35:6b",
            "net6": "c6:ab:0a:90:04:3f",
            "net7": "e2:75:af:74:74:89",
            "net8": "fe:b4:bf:5c:be:4f",
            "net9": "f2:0e:38:c8:07:21"
        },
        "spine_11_1_3": {
            "net0": "d2:88:e1:d4:5e:13",
            "net1": "1e:6e:8a:35:59:ee",
            "net10": "be:d1:3f:63:92:76",
            "net11": "f2:be:70:ff:51:00",
            "net2": "c6:b3:99:2a:15:ff",
            "net3": "e6:7d:a6:bb:39:9c",
            "net4": "7a:80:f2:f2:4d:f2",
            "net5": "4e:8f:0e:4c:99:3b",
            "net6": "96:8d:58:c6:43:bf",
            "net7": "9e:07:d3:2a:05:38",
            "net8": "26:6f:a3:f2:24:f8",
            "net9": "a6:c2:06:0f:d7:c2"
        },
        "spine_11_1_4": {
            "net0": "22:93:a6:9a:fb:e0",
            "net1": "de:2e:96:23:74:8e",
            "net10": "4a:8e:6f:d9:55:50",
            "net11": "de:6d:26:a4:d5:50",
            "net2": "1a:8b:0b:57:08:22",
            "net3": "76:20:46:cb:7b:96",
            "net4": "e2:ab:07:9c:c4:5d",
            "net5": "82:d7:09:4a:b5:db",
            "net6": "a2:5e:fd:88:fc:8b",
            "net7": "e2:dc:f3:c6:a5:5f",
            "net8": "82:be:5e:bc:89:62",
            "net9": "06:28:14:aa:ec:d6"
        },
        "spine_11_1_5": {
            "net0": "b2:e2:7b:9b:b4:74",
            "net1": "0e:78:c0:2a:af:13",
            "net10": "52:02:a8:91:88:81",
            "net11": "66:95:37:3d:35:bb",
            "net2": "3a:90:39:5b:48:e2",
            "net3": "82:c2:78:2a:82:c7",
            "net4": "16:8e:09:be:91:a0",
            "net5": "22:c1:a8:3c:3f:05",
            "net6": "ae:70:ed:4a:77:fa",
            "net7": "aa:11:79:47:e3:53",
            "net8": "66:82:27:5f:df:69",
            "net9": "8e:03:3b:a8:10:1e"
        },
        "spine_11_1_6": {
            "net0": "7e:ff:ed:ee:2b:66",
            "net1": "2a:9a:e9:b5:14:bd",
            "net10": "4a:43:02:81:5e:52",
            "net11": "e2:67:86:b0:c2:43",
            "net2": "0e:a4:dc:f2:93:96",
            "net3": "42:55:97:23:88:20",
            "net4": "52:7c:4b:06:e8:46",
            "net5": "3e:a4:76:f1:02:5c",
            "net6": "8e:60:50:01:3d:ac",
            "net7": "12:91:e1:e4:e2:30",
            "net8": "aa:62:80:93:68:5a",
            "net9": "d6:f0:a6:bc:ae:7e"
        },
        "spine_12_1_1": {
            "net0": "4e:ef:b0:c3:79:e1",
            "net1": "ea:3c:59:ca:a9:3e",
            "net10": "c6:b8:74:b3:2b:e6",
            "net11": "a6:f9:1d:96:db:f1",
            "net2": "96:54:eb:bb:42:ad",
            "net3": "de:e2:ab:49:30:3f",
            "net4": "42:10:5b:3b:ab:84",
            "net5": "b6:4d:9c:88:5e:e1",
            "net6": "46:1b:5f:fc:8b:b2",
            "net7": "8e:5c:80:5d:42:66",
            "net8": "96:c2:0e:d9:97:7f",
            "net9": "32:c0:a0:88:8b:f1"
        },
        "spine_12_1_2": {
            "net0": "22:6e:bf:1e:6c:c2",
            "net1": "f6:25:79:26:a9:5d",
            "net10": "92:45:c5:84:0d:63",
            "net11": "22:09:57:ca:c0:3f",
            "net2": "ba:73:d8:8d:f5:e7",
            "net3": "be:ea:9a:43:63:a4",
            "net4": "2e:07:33:3d:19:42",
            "net5": "96:e2:3a:f3:44:d8",
            "net6": "be:78:dd:c4:ea:70",
            "net7": "e2:1f:8c:64:56:47",
            "net8": "5a:b1:20:71:61:3a",
            "net9": "d6:7a:0d:3c:9d:4d"
        },
        "spine_12_1_3": {
            "net0": "8e:62:da:df:d4:95",
            "net1": "2e:fb:0e:97:e2:9a",
            "net10": "a2:46:f1:cb:2c:84",
            "net11": "8e:8b:9e:61:e6:db",
            "net2": "02:3f:f1:24:b8:6f",
            "net3": "f6:e8:a2:52:6b:44",
            "net4": "22:9b:d1:3a:a5:91",
            "net5": "b6:86:e0:50:0b:23",
            "net6": "96:41:52:60:02:ba",
            "net7": "52:4a:c0:a3:34:a8",
            "net8": "62:1f:91:d0:dc:52",
            "net9": "5a:5b:58:e0:bc:f6"
        },
        "spine_12_1_4": {
            "net0": "5a:0d:d1:78:9a:06",
            "net1": "1e:ab:62:7b:01:c1",
            "net10": "96:03:c6:aa:d9:70",
            "net11": "42:24:83:d1:05:c0",
            "net2": "1e:bf:8c:65:30:8b",
            "net3": "ae:47:3a:93:8e:bb",
            "net4": "62:17:c0:31:01:6d",
            "net5": "aa:08:d1:13:64:4d",
            "net6": "b2:1f:39:d3:6c:36",
            "net7": "fe:aa:92:36:3c:42",
            "net8": "4a:40:f5:ba:05:61",
            "net9": "d2:0f:9d:ad:aa:12"
        },
        "spine_12_1_5": {
            "net0": "d2:83:ab:75:60:71",
            "net1": "36:83:5c:87:e4:d7",
            "net10": "42:25:f0:fd:18:94",
            "net11": "b2:cb:0d:a0:f8:2b",
            "net2": "36:32:de:d8:4a:74",
            "net3": "ca:4e:43:0f:2d:9c",
            "net4": "6a:90:8b:02:07:39",
            "net5": "42:0b:61:9b:27:ff",
            "net6": "06:f0:b9:68:f2:7b",
            "net7": "32:f1:11:7d:cc:ff",
            "net8": "92:9d:e4:6d:00:92",
            "net9": "d6:88:60:d1:14:2b"
        },
        "spine_12_1_6": {
            "net0": "1a:d8:72:8a:1f:58",
            "net1": "0e:1c:cc:84:45:2d",
            "net10": "d2:1b:25:dd:0b:b0",
            "net11": "4a:7e:c6:83:53:29",
            "net2": "66:7d:1c:f3:e7:6d",
            "net3": "66:d6:5b:66:a1:dc",
            "net4": "62:bb:d8:13:08:39",
            "net5": "1e:9a:14:cc:2a:81",
            "net6": "5e:b2:5e:99:69:1d",
            "net7": "8e:87:52:4f:63:63",
            "net8": "3a:04:72:8f:28:37",
            "net9": "96:80:d8:54:c5:32"
        },
        "spine_1_1_1": {
            "net0": "b6:e1:bd:cc:2c:62",
            "net1": "d6:76:1f:23:78:2b",
            "net10": "a2:f7:4b:eb:97:6e",
            "net11": "1e:11:79:0b:c4:c9",
            "net2": "b2:57:0a:96:ca:a3",
            "net3": "62:2f:2a:4e:a9:a4",
            "net4": "b6:4c:5d:d9:c2:7a",
            "net5": "de:bb:b8:71:40:23",
            "net6": "2e:3d:b0:30:9d:48",
            "net7": "c6:cb:51:ee:a3:3d",
            "net8": "fa:f3:ac:19:c2:d1",
            "net9": "da:48:97:c4:9c:46"
        },
        "spine_1_1_2": {
            "net0": "fa:6f:23:1e:a6:91",
            "net1": "ee:a3:53:59:18:33",
            "net10": "0e:38:1d:e8:81:54",
            "net11": "3a:5b:04:7e:50:f7",
            "net2": "02:52:63:da:df:aa",
            "net3": "76:53:db:a4:87:b3",
            "net4": "12:83:15:92:de:e2",
            "net5": "5e:32:14:b2:2f:bd",
            "net6": "b2:2c:d1:bf:e9:c6",
            "net7": "9e:b6:61:e6:6d:3e",
            "net8": "2a:8a:e6:d2:a8:f7",
            "net9": "1a:27:d8:3e:c9:97"
        },
        "spine_1_1_3": {
            "net0": "fa:72:2d:fe:bf:97",
            "net1": "12:68:03:28:57:07",
            "net10": "92:b2:fe:ce:87:cd",
            "net11": "4a:1b:ba:74:7a:93",
            "net2": "ce:7f:31:a5:92:e7",
            "net3": "3a:db:2d:2d:56:82",
            "net4": "36:41:d7:41:78:af",
            "net5": "7a:5f:5f:6f:0d:60",
            "net6": "1e:e6:fc:e0:85:48",
            "net7": "c6:11:f8:0a:b1:fd",
            "net8": "ce:0e:cc:5c:e9:6e",
            "net9": "4a:f5:1d:bd:ae:7c"
        },
        "spine_1_1_4": {
            "net0": "d2:50:b5:ca:9d:f1",
            "net1": "d2:c5:62:e5:3d:5a",
            "net10": "b6:3c:b8:89:89:b5",
            "net11": "ea:65:7c:e8:d5:fd",
            "net2": "be:92:1e:9c:dd:72",
            "net3": "e2:96:5d:7c:53:5f",
            "net4": "2e:74:0b:76:6d:52",
            "net5": "3a:ba:7a:f9:51:68",
            "net6": "22:3c:c3:79:97:c0",
            "net7": "1e:bd:84:3f:e0:78",
            "net8": "92:09:e9:25:11:e7",
            "net9": "d6:d5:a4:14:66:96"
        },
        "spine_1_1_5": {
            "net0": "b2:4e:d3:f5:f1:26",
            "net1": "2e:b7:d1:86:67:e8",
            "net10": "72:a9:44:37:a9:04",
            "net11": "e2:e1:e4:6e:c2:8d",
            "net2": "4e:00:6f:82:38:86",
            "net3": "ce:03:e7:6c:3a:cd",
            "net4": "d6:13:25:f8:2f:bf",
            "net5": "8a:3b:62:d0:2a:38",
            "net6": "6a:99:8c:81:2b:1d",
            "net7": "5e:01:8d:ae:a9:ff",
            "net8": "ba:73:36:b9:20:c8",
            "net9": "92:67:5e:c8:6c:2d"
        },
        "spine_1_1_6": {
            "net0": "4a:bf:12:56:d1:79",
            "net1": "aa:08:47:ef:6a:18",
            "net10": "3e:26:c0:6a:83:6b",
            "net11": "22:1a:b1:13:e5:e9",
            "net2": "3e:42:6a:a0:a4:7e",
            "net3": "de:79:e9:92:e6:2c",
            "net4": "6e:2d:21:1e:32:1f",
            "net5": "e2:9d:40:7b:e5:47",
            "net6": "be:91:17:d8:bd:21",
            "net7": "aa:ac:6e:88:3e:64",
            "net8": "7e:e3:f4:cc:a0:15",
            "net9": "ca:e1:f5:6c:05:35"
        },
        "spine_2_1_1": {
            "net0": "72:15:5f:2d:4f:f0",
            "net1": "da:71:5c:5e:d8:54",
            "net10": "16:11:7e:8d:53:16",
            "net11": "4e:14:54:15:42:aa",
            "net2": "de:37:b5:36:f2:c4",
            "net3": "86:16:60:37:21:5d",
            "net4": "c6:1b:77:2c:f6:51",
            "net5": "0e:b3:5c:3b:95:07",
            "net6": "f6:3e:72:4c:83:07",
            "net7": "3e:90:b8:18:b4:a1",
            "net8": "b2:c2:73:6e:0f:7a",
            "net9": "76:57:40:e4:a8:20"
        },
        "spine_2_1_2": {
            "net0": "56:ac:a8:d3:f3:11",
            "net1": "4e:22:2b:6c:48:e7",
            "net10": "fe:4c:f1:94:68:59",
            "net11": "92:a2:7d:35:e5:5b",
            "net2": "5e:74:5b:74:ba:b4",
            "net3": "32:ad:b2:ad:58:c4",
            "net4": "06:76:d9:ae:97:7f",
            "net5": "82:4f:2b:2a:eb:d8",
            "net6": "aa:16:01:15:2f:97",
            "net7": "0a:6f:02:ee:0a:58",
            "net8": "9a:51:f9:0b:24:81",
            "net9": "6e:77:6c:64:0a:aa"
        },
        "spine_2_1_3": {
            "net0": "b6:01:1a:c9:8b:ec",
            "net1": "ce:83:49:79:e3:01",
            "net10": "62:da:4a:a4:a8:b1",
            "net11": "36:ac:f7:f6:29:98",
            "net2": "7a:8d:c8:51:d9:06",
            "net3": "12:f7:08:71:db:24",
            "net4": "9a:ee:d2:c1:be:7d",
            "net5": "8e:8e:28:20:e2:be",
            "net6": "42:ff:d9:4c:05:8e",
            "net7": "22:89:5e:e8:de:fa",
            "net8": "b2:13:92:da:e3:4e",
            "net9": "be:fe:b0:05:44:be"
        },
        "spine_2_1_4": {
            "net0": "e2:e4:a4:48:10:91",
            "net1": "4a:7f:c5:5b:f2:eb",
            "net10": "a2:f4:c0:06:8d:aa",
            "net11": "8e:fa:eb:4c:17:2e",
            "net2": "de:af:cf:7e:e7:7e",
            "net3": "7e:83:77:63:42:c4",
            "net4": "3a:96:05:b2:fb:f0",
            "net5": "12:e9:7c:88:a6:4e",
            "net6": "f2:f1:cf:bf:88:2f",
            "net7": "1e:3a:92:88:e6:73",
            "net8": "ca:3b:77:6a:22:b8",
            "net9": "66:f4:e9:49:5c:ec"
        },
        "spine_2_1_5": {
            "net0": "9a:89:cb:1f:51:c6",
            "net1": "62:1b:16:68:fa:c8",
            "net10": "4a:dd:83:5a:e0:8b",
            "net11": "16:e8:76:01:21:a8",
            "net2": "56:0b:eb:fe:a8:54",
            "net3": "fa:d8:8a:94:62:5f",
            "net4": "52:a5:fb:ee:9f:f1",
            "net5": "16:19:dd:46:2a:f8",
            "net6": "c6:ac:dd:82:6a:d5",
            "net7": "a2:17:ae:53:52:e8",
            "net8": "da:2d:ae:11:fa:89",
            "net9": "62:8e:72:e6:59:0b"
        },
        "spine_2_1_6": {
            "net0": "d2:e7:4a:e3:02:15",
            "net1": "9e:59:10:a1:cd:96",
            "net10": "36:f9:34:2d:00:59",
            "net11": "c6:8b:22:dc:a3:15",
            "net2": "fa:9b:60:9f:24:b1",
            "net3": "8e:25:7c:f0:17:ad",
            "net4": "06:a7:42:35:e8:09",
            "net5": "56:77:6c:bd:ea:28",
            "net6": "6a:e2:f8:83:c6:73",
            "net7": "62:87:c0:8f:0e:94",
            "net8": "16:88:bc:c3:21:2f",
            "net9": "82:70:c1:07:e4:9e"
        },
        "spine_3_1_1": {
            "net0": "7a:e7:f3:48:69:97",
            "net1": "6e:f3:8e:82:2f:ac",
            "net10": "4e:a2:96:32:87:02",
            "net11": "c2:05:ee:46:bf:e3",
            "net2": "3e:1d:72:4c:d1:a1",
            "net3": "b2:1f:97:05:67:3d",
            "net4": "5a:c6:f6:d1:17:f0",
            "net5": "4a:1c:53:d8:65:3f",
            "net6": "ba:b6:fa:cf:6d:b5",
            "net7": "ca:34:bd:f5:27:80",
            "net8": "d2:38:a5:e7:28:ad",
            "net9": "9a:4e:f9:67:7b:89"
        },
        "spine_3_1_2": {
            "net0": "f6:13:18:e5:7c:08",
            "net1": "ce:75:37:1d:84:cb",
            "net10": "66:80:c6:fc:d2:8c",
            "net11": "7e:91:65:0c:ef:84",
            "net2": "32:71:5c:b0:d6:59",
            "net3": "ba:5f:ff:92:a3:ad",
            "net4": "ea:0b:5a:15:c2:ad",
            "net5": "42:06:b7:0f:1a:22",
            "net6": "ca:18:7f:0f:22:fc",
            "net7": "fe:49:54:c9:e6:eb",
            "net8": "b6:6b:68:6c:0c:4f",
            "net9": "ce:01:69:78:1d:93"
        },
        "spine_3_1_3": {
            "net0": "8a:07:76:cf:f1:10",
            "net1": "7a:fe:ec:93:0c:69",
            "net10": "4e:13:06:96:68:b6",
            "net11": "8e:61:0f:17:69:5d",
            "net2": "b6:4e:c2:d2:d9:b0",
            "net3": "d2:1d:e3:5f:e4:6b",
            "net4": "82:8d:28:8f:c5:6d",
            "net5": "6e:71:33:82:d9:e8",
            "net6": "96:db:53:dd:85:9f",
            "net7": "c2:9b:75:34:30:34",
            "net8": "3e:de:02:3e:55:5e",
            "net9": "e6:93:17:21:af:bb"
        },
        "spine_3_1_4": {
            "net0": "16:5e:0e:1c:0d:25",
            "net1": "92:b6:85:7b:7f:67",
            "net10": "2e:02:c9:2f:a9:b7",
            "net11": "7e:53:71:b6:fd:6b",
            "net2": "22:c7:b5:a7:31:ef",
            "net3": "92:86:e2:c0:de:bf",
            "net4": "12:ab:cf:bd:49:d7",
            "net5": "8a:68:e3:26:72:53",
            "net6": "0e:90:46:d6:55:eb",
            "net7": "0e:f7:93:c2:bd:46",
            "net8": "d2:57:fd:29:8b:c2",
            "net9": "46:ec:11:99:90:1b"
        },
        "spine_3_1_5": {
            "net0": "ae:57:50:3d:26:48",
            "net1": "c2:f4:d4:da:4a:3f",
            "net10": "da:8c:be:de:64:b5",
            "net11": "c6:93:74:76:bc:f6",
            "net2": "a2:fc:8c:30:5b:ee",
            "net3": "3a:fe:28:94:40:fb",
            "net4": "3e:84:e5:1a:ef:03",
            "net5": "be:95:2c:36:05:b7",
            "net6": "6a:5e:10:8b:7c:7d",
            "net7": "22:d1:f9:9e:4c:30",
            "net8": "82:3d:7a:d6:71:54",
            "net9": "2a:da:ca:f8:2e:2a"
        },
        "spine_3_1_6": {
            "net0": "02:16:1f:9e:a8:03",
            "net1": "8e:2b:fb:fa:d9:b9",
            "net10": "ee:d9:e7:41:bc:de",
            "net11": "e2:28:a9:a8:a5:0c",
            "net2": "aa:a0:5b:d0:27:19",
            "net3": "de:ac:2f:af:d0:ff",
            "net4": "e6:2d:7c:aa:bc:a8",
            "net5": "82:cd:9d:2c:21:ed",
            "net6": "c6:64:19:eb:9d:0c",
            "net7": "6e:e9:e6:36:ff:84",
            "net8": "8e:da:99:17:0f:4d",
            "net9": "96:bb:5f:dc:a2:f3"
        },
        "spine_4_1_1": {
            "net0": "e6:22:6a:9c:cb:5a",
            "net1": "ca:2c:e3:85:d4:06",
            "net10": "ce:f9:ec:9e:9a:1e",
            "net11": "0a:aa:f6:87:3c:90",
            "net2": "22:cc:72:56:86:39",
            "net3": "16:f7:cf:26:7f:a9",
            "net4": "b2:25:fe:ea:ad:ba",
            "net5": "d6:c2:e8:03:5f:3d",
            "net6": "7a:96:31:b5:bf:1b",
            "net7": "ce:04:ab:7d:b2:a1",
            "net8": "72:61:5b:fd:8d:7b",
            "net9": "e6:60:ea:25:ea:4e"
        },
        "spine_4_1_2": {
            "net0": "9a:0f:3d:5d:9c:0e",
            "net1": "ae:31:fd:dc:44:bc",
            "net10": "16:7f:5e:e3:5e:b5",
            "net11": "6e:eb:99:4f:be:bf",
            "net2": "de:97:d5:5c:ef:0a",
            "net3": "9e:32:21:75:8d:4a",
            "net4": "66:d6:5e:73:4a:b9",
            "net5": "4e:21:37:96:68:e6",
            "net6": "8a:51:6f:09:11:5d",
            "net7": "1e:b0:70:1b:55:49",
            "net8": "ba:f8:26:d8:c1:2a",
            "net9": "46:d8:6c:53:5f:6a"
        },
        "spine_4_1_3": {
            "net0": "72:52:33:49:49:80",
            "net1": "fa:d1:65:78:58:e0",
            "net10": "c6:1b:bf:bf:52:b3",
            "net11": "ae:0b:10:06:0f:28",
            "net2": "76:88:be:51:cd:aa",
            "net3": "9e:00:00:43:06:9c",
            "net4": "4a:a6:fe:f4:40:09",
            "net5": "72:06:96:c3:c1:44",
            "net6": "a2:9a:e2:2b:5a:aa",
            "net7": "9a:86:f6:3c:c9:cd",
            "net8": "26:c7:d8:96:d0:ee",
            "net9": "76:e8:7f:e5:43:7e"
        },
        "spine_4_1_4": {
            "net0": "26:fa:27:4a:e3:80",
            "net1": "ee:34:6f:f9:83:fe",
            "net10": "5e:f5:b3:e2:60:ac",
            "net11": "c2:a9:4f:21:5a:57",
            "net2": "de:7c:45:7d:26:d7",
            "net3": "0e:cd:1c:04:26:34",
            "net4": "82:05:69:4d:2e:b8",
            "net5": "06:73:6c:a2:d6:93",
            "net6": "fa:8d:a6:f0:af:69",
            "net7": "de:7d:cc:91:b3:c5",
            "net8": "e2:50:3e:66:4c:c2",
            "net9": "62:d3:78:96:20:a3"
        },
        "spine_4_1_5": {
            "net0": "7a:34:5d:7c:6f:57",
            "net1": "6a:95:4f:6c:41:9e",
            "net10": "be:af:9a:96:a6:48",
            "net11": "82:e6:f2:5a:a4:66",
            "net2": "e6:d1:21:86:b2:6e",
            "net3": "f2:5a:68:84:13:97",
            "net4": "fa:4f:5b:8d:66:7d",
            "net5": "26:99:27:c8:79:30",
            "net6": "d6:ad:4f:20:b1:85",
            "net7": "52:20:da:78:34:5e",
            "net8": "2a:ff:fe:91:63:b9",
            "net9": "e2:f1:65:a1:3e:ff"
        },
        "spine_4_1_6": {
            "net0": "9a:9c:79:82:e6:6b",
            "net1": "72:4a:39:35:4b:73",
            "net10": "52:9e:20:6f:6b:b6",
            "net11": "be:7a:b3:c1:21:40",
            "net2": "52:61:0f:16:95:22",
            "net3": "fa:d5:9f:ad:c0:41",
            "net4": "0a:1b:19:dc:bf:4d",
            "net5": "da:3d:07:b6:f4:f1",
            "net6": "7a:eb:f7:9c:36:09",
            "net7": "c6:0c:79:8c:ac:59",
            "net8": "6e:e5:1a:10:7d:79",
            "net9": "b6:12:f1:4b:a9:1d"
        },
        "spine_5_1_1": {
            "net0": "e6:da:89:60:b1:b7",
            "net1": "56:40:c8:1e:7c:dd",
            "net10": "e6:df:52:a1:c0:ce",
            "net11": "ca:fb:92:47:c8:98",
            "net2": "ea:fb:ee:43:f7:69",
            "net3": "52:a0:ae:08:2b:0c",
            "net4": "ca:1a:ae:2f:69:ed",
            "net5": "1a:d6:0a:2a:d3:29",
            "net6": "82:e3:74:fa:fe:97",
            "net7": "9a:b9:8f:b8:51:a6",
            "net8": "4a:31:97:70:61:fe",
            "net9": "0e:f9:49:83:ba:f1"
        },
        "spine_5_1_2": {
            "net0": "7e:43:8f:95:f5:6f",
            "net1": "e6:76:6b:f0:de:95",
            "net10": "ce:2b:ed:79:85:7e",
            "net11": "82:51:8f:19:eb:f6",
            "net2": "42:93:22:98:72:fd",
            "net3": "be:48:f9:43:95:fd",
            "net4": "fe:70:3f:68:30:5d",
            "net5": "3e:06:36:cf:39:9f",
            "net6": "32:d1:87:9a:5e:57",
            "net7": "6a:8b:e7:80:a7:48",
            "net8": "d6:04:87:0f:0f:65",
            "net9": "46:50:e2:a9:72:c0"
        },
        "spine_5_1_3": {
            "net0": "2a:07:40:c7:cd:5e",
            "net1": "3e:46:64:54:ad:d4",
            "net10": "ae:8b:d0:a7:f9:fc",
            "net11": "d6:43:22:01:f4:8b",
            "net2": "52:a2:5f:38:fb:fc",
            "net3": "6a:ac:56:83:61:37",
            "net4": "2e:d8:86:f2:00:0b",
            "net5": "72:b4:3a:a9:27:8f",
            "net6": "1a:52:a7:8f:f6:c3",
            "net7": "7a:a0:30:ab:6f:fd",
            "net8": "d2:e0:2a:79:5c:9e",
            "net9": "2e:6b:3a:62:af:96"
        },
        "spine_5_1_4": {
            "net0": "86:93:12:84:5e:09",
            "net1": "42:5f:71:25:91:86",
            "net10": "26:9f:ba:d4:83:fc",
            "net11": "6a:e6:d1:64:f9:fe",
            "net2": "5e:05:c0:90:b4:48",
            "net3": "5a:cc:26:5d:35:36",
            "net4": "a2:08:a1:54:57:b6",
            "net5": "9e:eb:a6:7d:e9:82",
            "net6": "96:96:f3:09:4c:2a",
            "net7": "76:cd:f5:5a:89:d5",
            "net8": "4a:25:03:3b:76:bc",
            "net9": "f6:88:f6:e4:2f:55"
        },
        "spine_5_1_5": {
            "net0": "e6:4e:24:6d:d1:71",
            "net1": "92:e7:19:97:6a:e3",
            "net10": "26:a9:30:97:60:ae",
            "net11": "f2:51:ee:5b:c5:29",
            "net2": "c6:79:a3:03:6b:cb",
            "net3": "8e:72:26:29:2d:8c",
            "net4": "5a:86:c0:07:3d:b7",
            "net5": "3a:a1:98:2b:ed:32",
            "net6": "82:57:a3:46:f3:d7",
            "net7": "f6:2f:1b:39:74:8a",
            "net8": "6e:9c:f6:41:ff:53",
            "net9": "52:41:71:e4:c2:b8"
        },
        "spine_5_1_6": {
            "net0": "ae:b2:20:44:4b:11",
            "net1": "d2:33:a9:b2:a1:2a",
            "net10": "9a:d9:c5:31:d3:71",
            "net11": "66:67:81:3d:e2:47",
            "net2": "e2:df:6a:30:e0:f6",
            "net3": "16:42:f5:48:6f:8c",
            "net4": "be:fd:58:d1:e0:94",
            "net5": "5e:af:c0:c4:b9:8c",
            "net6": "06:a1:dc:0b:8b:cf",
            "net7": "5a:05:91:a1:9a:f9",
            "net8": "ca:de:14:b8:0c:8f",
            "net9": "9e:b3:75:cf:64:7b"
        },
        "spine_6_1_1": {
            "net0": "9a:c9:71:8c:6d:25",
            "net1": "aa:0e:f3:12:e9:64",
            "net10": "ee:91:98:e8:1c:58",
            "net11": "2e:a4:2d:0e:96:4a",
            "net2": "8e:f9:9b:08:1a:7b",
            "net3": "96:fb:3d:59:00:c7",
            "net4": "86:16:e1:93:79:fd",
            "net5": "0a:f3:bf:1f:c2:f3",
            "net6": "4a:78:06:53:8f:47",
            "net7": "16:e8:cb:fc:1c:35",
            "net8": "8a:1a:81:5c:8a:9c",
            "net9": "ca:09:e2:26:fa:4a"
        },
        "spine_6_1_2": {
            "net0": "2e:6a:9a:f2:fe:ae",
            "net1": "c2:7f:31:4f:ad:99",
            "net10": "b6:93:18:6b:06:e4",
            "net11": "42:f5:f7:e7:db:b0",
            "net2": "82:fa:96:72:f9:0e",
            "net3": "5e:7d:5a:7e:97:0e",
            "net4": "ba:1c:f2:23:fc:1b",
            "net5": "c6:61:27:64:44:f9",
            "net6": "4a:5e:b2:f6:e2:0f",
            "net7": "ea:e3:02:79:da:a0",
            "net8": "16:af:70:16:57:fa",
            "net9": "2a:60:91:97:f0:a9"
        },
        "spine_6_1_3": {
            "net0": "76:a1:77:d6:12:a9",
            "net1": "96:08:6f:43:49:9b",
            "net10": "22:eb:a9:7c:a4:13",
            "net11": "2e:90:fe:41:48:f6",
            "net2": "42:b2:6d:0d:16:47",
            "net3": "ea:4d:cd:b0:1f:0b",
            "net4": "0e:82:6a:39:7f:d8",
            "net5": "f6:f9:ae:e2:7a:88",
            "net6": "f2:3a:a2:af:1f:e0",
            "net7": "5a:b2:6b:69:f6:07",
            "net8": "de:f5:e4:36:c8:f9",
            "net9": "16:19:f3:d0:ad:42"
        },
        "spine_6_1_4": {
            "net0": "0a:81:31:a5:eb:26",
            "net1": "32:2d:a2:51:2b:0d",
            "net10": "26:a9:1e:95:25:9f",
            "net11": "ae:ad:25:ef:1a:a3",
            "net2": "5a:8b:1b:0c:d0:95",
            "net3": "12:92:f2:58:bb:e3",
            "net4": "92:e6:2e:c7:3b:e4",
            "net5": "62:37:bd:cd:6a:4f",
            "net6": "5e:96:a1:37:e3:10",
            "net7": "12:05:11:39:9b:15",
            "net8": "f6:e0:35:57:22:a0",
            "net9": "de:44:cd:20:5e:06"
        },
        "spine_6_1_5": {
            "net0": "ae:6d:22:c0:6e:22",
            "net1": "0a:10:ce:65:4d:66",
            "net10": "ba:c1:4b:ab:91:98",
            "net11": "06:c3:39:b3:d2:cb",
            "net2": "96:c4:7a:11:a7:19",
            "net3": "96:b7:35:07:ba:a1",
            "net4": "52:ee:ce:de:42:6c",
            "net5": "fa:7b:ec:29:1a:74",
            "net6": "16:1b:76:9f:fe:6d",
            "net7": "6a:d1:fe:6a:e7:0a",
            "net8": "92:88:72:61:3b:c8",
            "net9": "de:07:a3:68:d5:ec"
        },
        "spine_6_1_6": {
            "net0": "b6:d5:a0:05:7d:3b",
            "net1": "c2:53:6d:44:e7:35",
            "net10": "ae:b0:c2:2d:58:15",
            "net11": "82:4c:75:ff:ef:11",
            "net2": "a2:6d:50:c2:f6:15",
            "net3": "02:3c:5a:cf:79:de",
            "net4": "12:ba:1f:41:ce:23",
            "net5": "82:89:04:b3:f0:69",
            "net6": "e2:95:81:06:ec:d2",
            "net7": "7e:bd:c1:c8:60:e9",
            "net8": "96:31:4f:a8:6d:92",
            "net9": "c2:6e:85:e4:a1:77"
        },
        "spine_7_1_1": {
            "net0": "aa:c3:d1:b3:0c:7c",
            "net1": "02:7b:e5:63:06:a2",
            "net10": "a6:c0:62:dd:e0:e9",
            "net11": "fa:b3:a6:ce:1a:16",
            "net2": "1a:6a:0e:44:37:5b",
            "net3": "7a:46:0b:fc:90:bc",
            "net4": "b6:f0:d6:d7:46:5e",
            "net5": "06:c5:8c:bf:92:35",
            "net6": "16:85:f1:ec:0d:f5",
            "net7": "ae:2a:75:66:e5:08",
            "net8": "c2:1d:7b:1e:54:a9",
            "net9": "da:b5:f5:73:15:ee"
        },
        "spine_7_1_2": {
            "net0": "52:60:aa:00:c6:c7",
            "net1": "fa:6b:3c:91:06:74",
            "net10": "ea:4f:b5:6d:84:9c",
            "net11": "ae:a6:7d:58:6a:8d",
            "net2": "aa:87:91:6d:e0:d1",
            "net3": "f6:77:65:f5:99:31",
            "net4": "0a:f4:8b:4c:80:df",
            "net5": "92:79:4e:ec:35:b2",
            "net6": "d2:75:73:23:81:cf",
            "net7": "92:b9:d2:c1:b3:b4",
            "net8": "9e:7c:42:06:05:a3",
            "net9": "46:57:4f:6d:fd:fb"
        },
        "spine_7_1_3": {
            "net0": "32:42:b6:5c:f8:6a",
            "net1": "8a:94:06:c0:a1:74",
            "net10": "26:a7:0f:78:1c:8b",
            "net11": "52:42:0e:9b:90:5a",
            "net2": "d6:f2:19:3a:26:c7",
            "net3": "9a:af:36:7a:a2:d8",
            "net4": "7a:92:ea:ef:cc:49",
            "net5": "f6:2f:1a:9a:5b:df",
            "net6": "42:41:9a:26:65:ed",
            "net7": "4e:82:39:b9:9e:35",
            "net8": "aa:77:4f:ef:08:7d",
            "net9": "22:91:61:5f:e4:f4"
        },
        "spine_7_1_4": {
            "net0": "4a:02:84:0f:e4:c7",
            "net1": "42:96:04:c9:4a:8b",
            "net10": "72:64:04:e6:40:87",
            "net11": "f6:39:6a:ee:d9:c2",
            "net2": "ca:a4:d8:f0:91:61",
            "net3": "ca:eb:69:23:a8:1e",
            "net4": "12:90:33:c6:46:cf",
            "net5": "52:5d:e2:28:23:73",
            "net6": "d6:ad:4a:bc:a1:5e",
            "net7": "de:93:a4:eb:c1:57",
            "net8": "5e:65:ea:7d:37:dc",
            "net9": "a6:67:95:30:9d:a3"
        },
        "spine_7_1_5": {
            "net0": "da:40:ec:10:ab:c4",
            "net1": "72:f1:d6:85:b6:61",
            "net10": "3e:42:60:8e:88:33",
            "net11": "c6:c8:88:a0:0f:b6",
            "net2": "fa:dd:9d:0a:30:ee",
            "net3": "ea:69:89:c7:3f:e6",
            "net4": "ce:82:6f:10:cd:ee",
            "net5": "52:84:fc:2d:02:cc",
            "net6": "4a:64:39:08:14:ee",
            "net7": "d6:ca:ce:3d:57:33",
            "net8": "a6:fc:01:a8:5f:72",
            "net9": "ca:25:f1:d8:4d:f4"
        },
        "spine_7_1_6": {
            "net0": "7e:4a:95:4e:3c:0a",
            "net1": "8a:f4:45:1a:02:7c",
            "net10": "52:b3:42:5b:4d:16",
            "net11": "06:61:85:42:08:3e",
            "net2": "ba:bd:36:c5:72:88",
            "net3": "c2:ef:4f:68:c7:b3",
            "net4": "9e:e1:8f:20:e8:c1",
            "net5": "f2:43:d7:90:68:65",
            "net6": "76:e3:14:3c:bb:50",
            "net7": "e6:3f:db:4e:67:cd",
            "net8": "5a:ac:90:1c:ac:31",
            "net9": "5e:cc:b5:eb:12:e0"
        },
        "spine_8_1_1": {
            "net0": "9a:03:32:7f:1d:10",
            "net1": "d6:4a:4e:14:d6:94",
            "net10": "52:ca:18:f9:cf:36",
            "net11": "3e:80:8e:18:b3:4a",
            "net2": "86:26:17:bd:2f:3b",
            "net3": "ca:c4:32:92:04:0d",
            "net4": "52:15:f5:5e:76:d3",
            "net5": "f6:61:f0:4d:6b:79",
            "net6": "9a:11:8f:f3:3c:10",
            "net7": "66:20:3c:9c:c5:2d",
            "net8": "7e:10:f0:a4:69:20",
            "net9": "72:a3:18:66:99:3c"
        },
        "spine_8_1_2": {
            "net0": "5a:9e:96:c0:38:96",
            "net1": "e6:c2:cf:0a:7e:3c",
            "net10": "c2:05:b2:3f:2b:4c",
            "net11": "de:ff:f3:8f:69:d0",
            "net2": "72:42:73:5b:5d:98",
            "net3": "7e:30:f8:46:35:56",
            "net4": "22:e2:60:e5:0d:f9",
            "net5": "ea:a3:a1:eb:84:97",
            "net6": "a6:f8:d4:e4:cc:3b",
            "net7": "ca:88:1e:df:a2:5e",
            "net8": "12:fd:51:86:f5:26",
            "net9": "d6:3b:85:60:26:77"
        },
        "spine_8_1_3": {
            "net0": "c2:d5:e7:f0:d3:c4",
            "net1": "aa:3b:af:92:bc:82",
            "net10": "3a:93:d9:5d:d8:b5",
            "net11": "82:ce:6a:0f:88:f6",
            "net2": "9e:31:65:c5:10:49",
            "net3": "ee:86:f0:33:3b:8d",
            "net4": "b6:d6:b3:20:ca:cc",
            "net5": "ae:b1:78:e6:31:1f",
            "net6": "92:1d:be:56:fc:c9",
            "net7": "6e:8e:3e:59:1b:a3",
            "net8": "0a:5c:3d:fe:76:cd",
            "net9": "46:cd:dc:fa:f1:68"
        },
        "spine_8_1_4": {
            "net0": "5a:00:c1:c6:f5:d0",
            "net1": "46:f6:d2:c2:59:ad",
            "net10": "82:02:46:be:2e:9d",
            "net11": "6e:4e:10:cc:f3:82",
            "net2": "e6:b1:63:fe:10:df",
            "net3": "e2:8b:6f:e6:5a:52",
            "net4": "5a:0e:1c:ed:3a:f7",
            "net5": "fa:0c:bd:f7:82:7a",
            "net6": "c2:aa:8f:d2:62:2c",
            "net7": "2a:d4:da:a8:34:ea",
            "net8": "da:22:1b:dc:0d:fa",
            "net9": "a6:1e:04:9c:84:1b"
        },
        "spine_8_1_5": {
            "net0": "22:7e:9b:6b:82:18",
            "net1": "12:d5:17:06:7d:7f",
            "net10": "a6:73:a7:4c:e8:94",
            "net11": "82:ee:73:d2:bb:7a",
            "net2": "b6:9a:f7:f9:c5:e7",
            "net3": "72:b7:c7:1a:22:a5",
            "net4": "3a:d6:4f:18:1a:ea",
            "net5": "1e:af:35:4e:ff:6e",
            "net6": "7e:a8:5b:44:f4:53",
            "net7": "ce:3d:95:95:23:f5",
            "net8": "32:c9:d8:28:25:2e",
            "net9": "26:1e:00:39:b7:11"
        },
        "spine_8_1_6": {
            "net0": "92:ed:72:ec:49:b2",
            "net1": "c2:cb:fb:d6:31:a9",
            "net10": "aa:dd:e9:04:46:a3",
            "net11": "9a:73:19:95:e3:4c",
            "net2": "56:73:04:8c:f6:17",
            "net3": "7a:d7:a6:9f:d5:e4",
            "net4": "4e:82:e4:3a:28:fc",
            "net5": "b2:b6:1c:9e:2d:89",
            "net6": "5e:93:11:4c:64:d9",
            "net7": "8a:72:0b:b8:1e:92",
            "net8": "0e:9f:c6:19:b1:0f",
            "net9": "ea:ea:c7:41:3e:7f"
        },
        "spine_9_1_1": {
            "net0": "4a:f6:9f:1c:63:0a",
            "net1": "da:0b:4f:73:36:cc",
            "net10": "3a:f3:73:48:f3:13",
            "net11": "7e:f7:c4:0c:b5:e1",
            "net2": "1e:03:19:21:1b:11",
            "net3": "82:38:79:2d:5b:22",
            "net4": "66:ec:73:7b:40:b2",
            "net5": "a2:ae:72:92:d2:3f",
            "net6": "36:ae:df:4f:cf:21",
            "net7": "3a:7a:0d:48:df:9e",
            "net8": "f2:a6:46:15:00:88",
            "net9": "f2:4d:98:4f:95:24"
        },
        "spine_9_1_2": {
            "net0": "9a:5c:02:fc:ff:4d",
            "net1": "16:9a:be:cd:95:6b",
            "net10": "52:84:c9:30:80:d0",
            "net11": "22:72:22:21:96:28",
            "net2": "e2:be:fc:aa:1c:c4",
            "net3": "3a:54:10:37:ce:04",
            "net4": "b6:84:95:b8:e7:94",
            "net5": "9a:bd:fd:bf:77:a4",
            "net6": "5e:93:86:26:0c:08",
            "net7": "22:41:9b:1a:e2:14",
            "net8": "da:b8:96:2e:ff:06",
            "net9": "3a:f7:30:63:ee:19"
        },
        "spine_9_1_3": {
            "net0": "52:be:b1:c0:ed:c6",
            "net1": "de:40:46:6b:fb:f8",
            "net10": "66:59:55:df:59:ed",
            "net11": "96:fd:aa:80:a3:17",
            "net2": "62:50:9e:a6:7e:d5",
            "net3": "d6:ab:66:d2:8d:b7",
            "net4": "4a:d1:49:23:f1:ca",
            "net5": "0a:1d:d2:62:69:20",
            "net6": "96:3e:4b:bc:c0:30",
            "net7": "46:35:32:9c:15:3e",
            "net8": "86:02:4a:c6:63:85",
            "net9": "fe:d6:53:67:60:af"
        },
        "spine_9_1_4": {
            "net0": "f6:10:88:29:e8:63",
            "net1": "6a:62:d0:bc:00:8c",
            "net10": "1a:9c:ea:5f:d1:c3",
            "net11": "86:3a:bc:f2:65:5b",
            "net2": "7e:e3:e4:eb:aa:1b",
            "net3": "76:39:f5:21:19:0c",
            "net4": "aa:71:20:57:20:82",
            "net5": "f6:da:2e:5d:fa:49",
            "net6": "4a:bb:0f:a8:83:b1",
            "net7": "8a:ee:58:8d:a3:ac",
            "net8": "62:84:bb:e0:74:30",
            "net9": "ce:0e:89:a5:12:8b"
        },
        "spine_9_1_5": {
            "net0": "0e:27:6b:ad:4d:54",
            "net1": "26:28:04:54:db:8e",
            "net10": "8e:a7:95:4e:ad:ba",
            "net11": "8a:c1:ae:4a:30:56",
            "net2": "3e:eb:09:47:4f:a6",
            "net3": "52:10:0e:d2:b5:99",
            "net4": "be:69:4b:b6:91:b5",
            "net5": "42:cb:25:e2:18:e9",
            "net6": "f2:f3:2d:b7:b5:78",
            "net7": "0e:cd:b7:cb:25:37",
            "net8": "5e:bc:7f:82:42:aa",
            "net9": "de:ee:92:55:df:c8"
        },
        "spine_9_1_6": {
            "net0": "16:a6:1e:c6:fb:1f",
            "net1": "ae:dd:eb:e7:6c:a0",
            "net10": "12:32:bc:8e:93:34",
            "net11": "4e:c6:f7:af:7d:86",
            "net2": "3e:4f:03:8e:98:7e",
            "net3": "f2:bc:af:45:62:02",
            "net4": "66:ca:5c:a5:29:a2",
            "net5": "5a:ee:07:49:1c:49",
            "net6": "c6:ba:59:08:d5:a0",
            "net7": "0a:07:1c:b3:c6:70",
            "net8": "a6:f5:75:2d:8e:ff",
            "net9": "c6:be:03:bf:6a:fc"
        },
        "tof_1_2_1": {
            "net0": "0a:58:9f:bf:36:1b",
            "net1": "c2:cd:0d:ed:bf:7e",
            "net10": "a2:8c:0e:4b:4f:29",
            "net11": "52:ac:30:68:c5:80",
            "net2": "0e:16:85:71:00:49",
            "net3": "76:ed:d7:ce:78:97",
            "net4": "22:ca:ea:b4:1d:fe",
            "net5": "26:95:e1:b5:44:39",
            "net6": "66:46:f3:e6:29:78",
            "net7": "c6:d9:8b:61:3c:eb",
            "net8": "32:1e:d0:ca:30:33",
            "net9": "a2:60:98:2d:4f:c2"
        },
        "tof_1_2_2": {
            "net0": "a6:c6:2c:29:e8:ce",
            "net1": "be:3f:1f:b9:2d:66",
            "net10": "96:41:f8:db:e1:c5",
            "net11": "32:02:b7:23:9e:08",
            "net2": "96:e5:5b:8d:30:60",
            "net3": "ce:3a:95:b4:93:ee",
            "net4": "1e:b4:69:ca:96:8c",
            "net5": "6a:60:60:4d:eb:8a",
            "net6": "ca:1c:ff:06:b4:72",
            "net7": "86:d2:42:8e:a0:37",
            "net8": "0e:be:93:49:7b:98",
            "net9": "66:14:8a:37:3a:4a"
        },
        "tof_1_2_3": {
            "net0": "8e:11:b9:17:31:fd",
            "net1": "b2:4c:73:cf:56:33",
            "net10": "b2:09:f2:7a:52:14",
            "net11": "b2:36:36:9f:af:77",
            "net2": "16:b5:93:6f:ef:92",
            "net3": "b6:a5:b7:10:2a:2f",
            "net4": "42:37:da:69:81:93",
            "net5": "26:ce:74:95:8a:b4",
            "net6": "ae:b0:6a:46:ab:d6",
            "net7": "3e:72:60:c5:ab:cd",
            "net8": "ce:a7:54:f5:42:71",
            "net9": "6e:75:54:5e:c3:07"
        },
        "tof_1_2_4": {
            "net0": "1a:07:ff:82:16:4a",
            "net1": "9e:82:db:04:82:eb",
            "net10": "fa:b1:df:98:e1:ae",
            "net11": "22:1a:74:d1:81:f5",
            "net2": "ee:1b:1f:62:51:aa",
            "net3": "be:5e:d9:96:07:69",
            "net4": "2a:1d:98:a9:70:ad",
            "net5": "42:d1:f2:7f:32:44",
            "net6": "aa:d9:75:dd:a2:44",
            "net7": "fa:1c:86:ae:33:3a",
            "net8": "8e:1a:fb:1b:8f:81",
            "net9": "1a:c8:f9:fa:41:5d"
        },
        "tof_1_2_5": {
            "net0": "5a:0b:2c:03:5f:51",
            "net1": "c2:58:a9:03:f6:f2",
            "net10": "e2:5b:e7:91:f2:d2",
            "net11": "76:40:51:f2:31:e0",
            "net2": "12:44:3d:51:13:2d",
            "net3": "52:4a:83:a2:cd:8d",
            "net4": "96:4a:b4:47:9a:7b",
            "net5": "9a:11:45:3a:ca:03",
            "net6": "4e:55:e0:95:df:45",
            "net7": "4a:5f:1b:9d:11:67",
            "net8": "da:7f:83:43:06:20",
            "net9": "9a:b7:0d:73:a3:fd"
        },
        "tof_1_2_6": {
            "net0": "1a:43:22:7c:ef:9e",
            "net1": "a2:38:88:3d:17:61",
            "net10": "a2:6a:25:d9:43:9c",
            "net11": "b2:bf:f6:a2:d0:0e",
            "net2": "62:17:91:06:46:d5",
            "net3": "4a:19:3b:e2:1e:6e",
            "net4": "56:9c:9a:52:9b:2c",
            "net5": "66:9a:74:e3:80:be",
            "net6": "66:38:ca:1f:75:e2",
            "net7": "26:6f:d9:47:08:e6",
            "net8": "56:e9:f9:85:ab:9e",
            "net9": "16:3c:14:82:9b:d4"
        },
        "tof_2_2_1": {
            "net0": "46:c4:fc:5e:bc:94",
            "net1": "2e:7e:a5:31:83:11",
            "net10": "26:c2:4c:d9:2c:4b",
            "net11": "a6:e6:c3:c7:9c:74",
            "net2": "e6:63:fc:26:eb:99",
            "net3": "6a:c3:9a:3d:b0:bb",
            "net4": "4a:c4:df:cf:1a:75",
            "net5": "ae:7a:8a:fe:d9:92",
            "net6": "c2:1c:65:32:5f:92",
            "net7": "86:56:ab:ee:7a:a6",
            "net8": "7e:9b:e6:d2:98:86",
            "net9": "3e:e2:c9:41:25:6d"
        },
        "tof_2_2_2": {
            "net0": "f6:95:aa:a2:af:ce",
            "net1": "72:a3:29:f1:a8:54",
            "net10": "02:f0:60:88:ea:28",
            "net11": "9e:cc:22:aa:9d:53",
            "net2": "fa:5c:4c:5f:57:c1",
            "net3": "9e:16:d3:ed:53:cc",
            "net4": "06:28:45:f1:a9:cb",
            "net5": "46:8e:12:b5:f0:9d",
            "net6": "ae:13:09:3e:4a:2f",
            "net7": "42:f8:ee:b5:27:5c",
            "net8": "2a:25:d3:81:6d:bd",
            "net9": "de:ce:ff:53:c3:04"
        },
        "tof_2_2_3": {
            "net0": "be:88:3c:dc:f1:8d",
            "net1": "32:3f:44:42:ca:ec",
            "net10": "8a:4e:a0:93:7d:7f",
            "net11": "ba:4e:96:7b:03:03",
            "net2": "de:d4:eb:00:19:ea",
            "net3": "66:b2:8a:72:b5:13",
            "net4": "16:1c:b9:db:bf:22",
            "net5": "8a:c8:6c:3a:03:b9",
            "net6": "7a:34:e0:73:42:c4",
            "net7": "5a:8a:a0:63:6e:68",
            "net8": "7e:29:b0:e8:c0:1c",
            "net9": "0e:7e:3c:7c:2a:f6"
        },
        "tof_2_2_4": {
            "net0": "1e:76:3e:87:a0:db",
            "net1": "36:1e:b6:2c:6b:2b",
            "net10": "66:17:86:97:40:26",
            "net11": "26:dc:d9:43:b8:1d",
            "net2": "8a:ea:34:bf:ae:40",
            "net3": "52:0f:33:98:a1:9e",
            "net4": "42:15:5e:c9:30:46",
            "net5": "96:e0:2e:05:8b:74",
            "net6": "e6:13:fa:c9:4a:2e",
            "net7": "36:33:9f:7a:02:aa",
            "net8": "f6:f8:0c:94:8b:34",
            "net9": "ee:27:8f:79:1c:8e"
        },
        "tof_2_2_5": {
            "net0": "66:7e:ae:31:8e:6f",
            "net1": "16:32:68:6e:8b:95",
            "net10": "e2:66:c6:96:0b:58",
            "net11": "42:ab:ce:bb:8a:58",
            "net2": "a2:a3:d9:4b:6b:ae",
            "net3": "7a:1c:0b:01:e4:19",
            "net4": "3e:56:d6:b4:f0:46",
            "net5": "ee:ae:70:0b:1a:e1",
            "net6": "de:55:fc:0b:85:a9",
            "net7": "f6:f2:c8:1f:8b:4b",
            "net8": "da:a1:d5:dd:94:c6",
            "net9": "7e:48:ec:b6:b8:cd"
        },
        "tof_2_2_6": {
            "net0": "32:55:6d:09:09:fe",
            "net1": "0a:19:eb:18:08:e7",
            "net10": "72:65:8c:a0:89:4e",
            "net11": "16:f0:03:16:50:90",
            "net2": "96:b5:1c:a2:ee:56",
            "net3": "82:04:32:8a:bb:43",
            "net4": "ba:45:6a:3b:0c:76",
            "net5": "ce:80:37:7b:12:64",
            "net6": "1a:2d:3e:9d:11:c8",
            "net7": "d6:ee:3a:a7:49:4b",
            "net8": "3a:07:3f:0f:89:5a",
            "net9": "1e:a5:3d:ec:d4:9c"
        },
        "tof_3_2_1": {
            "net0": "36:78:de:5f:23:2e",
            "net1": "4a:8d:6b:6c:e4:55",
            "net10": "c6:bf:42:c5:0f:eb",
            "net11": "32:ed:fd:95:e6:3c",
            "net2": "0e:d6:ef:6f:65:e9",
            "net3": "76:c2:cb:ff:39:5c",
            "net4": "42:21:e2:6f:3e:cf",
            "net5": "ba:a0:32:89:79:45",
            "net6": "a6:95:17:34:e6:bb",
            "net7": "5a:41:f6:19:f8:4b",
            "net8": "da:52:e4:07:13:f0",
            "net9": "7e:31:8d:04:43:d1"
        },
        "tof_3_2_2": {
            "net0": "4e:b1:2a:f1:b7:c3",
            "net1": "16:58:05:be:7b:80",
            "net10": "56:2f:94:5c:e7:cd",
            "net11": "92:9b:76:d8:29:fc",
            "net2": "3e:f0:0d:79:f2:78",
            "net3": "d2:5d:98:5f:ea:e4",
            "net4": "9a:7c:f6:62:b8:a7",
            "net5": "f6:d4:4c:73:f7:23",
            "net6": "4e:f6:84:6b:5f:7b",
            "net7": "5e:58:7a:e2:17:a7",
            "net8": "ae:e0:cb:44:b4:ea",
            "net9": "b2:e5:04:d4:38:e2"
        },
        "tof_3_2_3": {
            "net0": "92:ab:7d:d3:bb:70",
            "net1": "ca:54:6c:f7:4d:7f",
            "net10": "5e:a9:c9:78:39:ab",
            "net11": "a2:29:5d:46:89:c4",
            "net2": "da:42:bf:71:73:82",
            "net3": "b2:f3:c4:b1:d9:61",
            "net4": "da:90:6f:95:c7:1b",
            "net5": "12:e7:75:7f:71:a3",
            "net6": "4e:aa:a7:07:f7:8b",
            "net7": "66:40:0f:48:b5:88",
            "net8": "6a:0f:db:dd:b2:26",
            "net9": "0e:3c:ea:0c:b1:be"
        },
        "tof_3_2_4": {
            "net0": "12:da:b2:b5:0d:ba",
            "net1": "8a:f0:22:ab:79:00",
            "net10": "4e:9b:44:b9:2e:34",
            "net11": "d2:90:6e:57:db:df",
            "net2": "0e:85:b0:b5:c2:42",
            "net3": "72:7c:49:fc:39:6e",
            "net4": "d6:55:31:4c:5f:b7",
            "net5": "f2:90:9e:b2:9f:47",
            "net6": "b2:96:15:e1:60:63",
            "net7": "66:74:5b:e2:12:11",
            "net8": "f2:a9:6b:03:f1:c3",
            "net9": "a6:b1:e0:b7:4c:c4"
        },
        "tof_3_2_5": {
            "net0": "c6:8d:10:54:01:47",
            "net1": "ba:76:ce:62:23:0c",
            "net10": "4e:ba:03:bb:16:5d",
            "net11": "96:0d:43:60:25:3d",
            "net2": "e6:35:ec:d4:31:f2",
            "net3": "f2:4b:7a:db:d5:2a",
            "net4": "12:2e:91:55:43:20",
            "net5": "b2:b6:cd:e1:4d:db",
            "net6": "12:cc:7b:a8:0b:07",
            "net7": "2a:72:a9:a3:89:63",
            "net8": "aa:8c:3a:df:78:c7",
            "net9": "42:bd:40:d0:23:19"
        },
        "tof_3_2_6": {
            "net0": "d2:ab:98:07:df:05",
            "net1": "9a:26:d4:e4:31:98",
            "net10": "ea:8b:04:99:f4:34",
            "net11": "86:f1:ce:30:17:41",
            "net2": "2e:e9:b8:27:7b:a1",
            "net3": "06:a8:1e:12:72:fc",
            "net4": "f6:d1:07:99:5c:41",
            "net5": "e6:36:44:d2:e8:ed",
            "net6": "32:51:25:7f:0f:68",
            "net7": "3a:57:8f:2f:b4:76",
            "net8": "9a:9e:13:a2:ba:8b",
            "net9": "fe:65:7c:2d:b4:d8"
        },
        "tof_4_2_1": {
            "net0": "7a:0f:cb:c1:00:6d",
            "net1": "36:89:ff:1d:c1:8d",
            "net10": "ce:e3:a7:bd:50:7e",
            "net11": "be:0e:1d:56:5d:e0",
            "net2": "06:dc:ba:5b:61:60",
            "net3": "3a:1b:ae:09:2b:c5",
            "net4": "36:13:ec:3b:dd:e0",
            "net5": "ca:d1:04:28:01:d7",
            "net6": "fa:5d:32:63:41:13",
            "net7": "56:4c:58:9b:3c:f4",
            "net8": "8a:c9:e7:f4:11:57",
            "net9": "6a:a3:6d:bf:68:9c"
        },
        "tof_4_2_2": {
            "net0": "9a:d0:23:2f:b9:5b",
            "net1": "a6:66:c8:74:30:4e",
            "net10": "6a:f4:8f:b6:8f:7c",
            "net11": "3e:71:da:33:66:c2",
            "net2": "7a:e6:33:e4:da:f4",
            "net3": "26:dd:87:0a:db:23",
            "net4": "5a:5c:11:3c:d4:16",
            "net5": "f2:cf:22:4d:f1:58",
            "net6": "e6:a9:e6:dd:e2:72",
            "net7": "6e:6f:11:97:e5:d8",
            "net8": "22:52:35:40:27:24",
            "net9": "26:3b:c5:99:0d:ac"
        },
        "tof_4_2_3": {
            "net0": "8a:be:1a:5e:a6:cf",
            "net1": "6a:dd:27:ea:45:71",
            "net10": "12:ab:9a:f5:c3:2a",
            "net11": "7e:97:76:d0:c6:f2",
            "net2": "12:8f:ef:e3:03:b2",
            "net3": "82:e2:d2:9c:84:dc",
            "net4": "92:89:dd:2f:d3:04",
            "net5": "7a:20:97:3f:27:e9",
            "net6": "6e:e8:da:14:82:b1",
            "net7": "ba:fe:8f:e1:e7:39",
            "net8": "42:75:f7:16:4c:42",
            "net9": "c2:ea:9c:05:d3:0a"
        },
        "tof_4_2_4": {
            "net0": "b2:63:ea:fd:9e:04",
            "net1": "ca:09:f8:a9:65:c7",
            "net10": "ba:bb:24:36:57:b6",
            "net11": "be:0f:5d:48:33:aa",
            "net2": "8e:4c:c2:69:30:5e",
            "net3": "4a:c9:04:39:40:2c",
            "net4": "72:c8:65:f1:48:b9",
            "net5": "36:4c:a4:95:71:ab",
            "net6": "2a:50:5e:01:fa:44",
            "net7": "9e:b3:55:6d:43:c2",
            "net8": "ea:4f:67:6b:dc:da",
            "net9": "ae:1b:69:f3:c1:af"
        },
        "tof_4_2_5": {
            "net0": "66:a5:57:1b:03:46",
            "net1": "4e:d3:67:66:ce:fc",
            "net10": "7a:0b:89:2c:91:cb",
            "net11": "22:10:4e:5a:74:26",
            "net2": "26:b7:ce:77:0b:5d",
            "net3": "3a:18:f4:e7:23:8d",
            "net4": "52:63:b8:7c:5c:00",
            "net5": "c6:81:ba:e1:cf:38",
            "net6": "5e:73:f9:9e:00:9f",
            "net7": "06:ad:56:84:29:5a",
            "net8": "8a:38:84:29:b7:3b",
            "net9": "8e:fd:d0:e9:d9:0b"
        },
        "tof_4_2_6": {
            "net0": "da:54:7a:44:fa:2d",
            "net1": "de:4b:25:bb:1c:d4",
            "net10": "9e:a7:ed:38:ba:9f",
            "net11": "56:46:06:7d:fb:7c",
            "net2": "f6:5a:fa:7d:8d:da",
            "net3": "aa:79:8c:72:16:23",
            "net4": "1a:75:03:57:be:1c",
            "net5": "46:f8:0a:3c:bb:d2",
            "net6": "e6:74:10:60:2b:52",
            "net7": "ba:81:83:1c:05:d9",
            "net8": "8e:b9:1d:e0:12:41",
            "net9": "7a:2b:56:8f:99:87"
        },
        "tof_5_2_1": {
            "net0": "16:3a:73:6f:37:36",
            "net1": "7e:2b:08:f7:cf:d2",
            "net10": "02:4c:51:13:f9:35",
            "net11": "1e:2d:58:07:aa:f2",
            "net2": "ba:1f:04:a0:5c:31",
            "net3": "0e:71:0f:d4:d8:6c",
            "net4": "62:ec:91:38:3a:b2",
            "net5": "ae:ff:b4:86:36:4d",
            "net6": "ca:6c:15:47:55:48",
            "net7": "26:41:ee:ee:0a:84",
            "net8": "aa:ec:bb:8e:11:bd",
            "net9": "8a:15:5d:ed:9f:7d"
        },
        "tof_5_2_2": {
            "net0": "12:3c:c8:a7:68:84",
            "net1": "5a:5b:e4:87:37:b6",
            "net10": "f6:d4:9c:1c:a1:e6",
            "net11": "da:52:5f:83:94:16",
            "net2": "66:a6:b4:b2:db:85",
            "net3": "9e:3e:fc:ea:3e:7f",
            "net4": "e2:90:01:a5:88:6c",
            "net5": "2e:db:b3:48:55:c9",
            "net6": "6a:ea:f0:5a:44:66",
            "net7": "7e:df:75:53:52:4c",
            "net8": "0e:5a:18:b0:b0:b8",
            "net9": "d2:a6:49:f6:d7:b7"
        },
        "tof_5_2_3": {
            "net0": "62:e5:92:fc:a1:5b",
            "net1": "06:46:a7:6d:d3:c7",
            "net10": "be:29:83:63:4c:ae",
            "net11": "0e:0d:e4:f2:19:96",
            "net2": "da:90:15:c4:f2:b1",
            "net3": "4e:98:b0:13:0b:23",
            "net4": "a2:5a:f6:a6:99:a5",
            "net5": "3e:4a:a2:6f:95:83",
            "net6": "3e:57:dd:b2:25:97",
            "net7": "aa:25:83:dc:c4:ee",
            "net8": "de:ec:64:1d:dd:b2",
            "net9": "76:1d:cd:77:0c:17"
        },
        "tof_5_2_4": {
            "net0": "4a:83:ac:62:64:4b",
            "net1": "76:05:26:c0:81:da",
            "net10": "12:7b:8b:6d:f8:04",
            "net11": "ae:10:ce:58:66:fb",
            "net2": "9a:d2:bf:14:9b:16",
            "net3": "96:1c:30:0c:43:d5",
            "net4": "ba:aa:9d:b6:06:fc",
            "net5": "e2:b5:8f:b2:80:35",
            "net6": "12:85:2b:35:11:b3",
            "net7": "9e:b1:50:81:69:52",
            "net8": "1e:43:0f:5e:08:ce",
            "net9": "be:5d:09:be:c9:17"
        },
        "tof_5_2_5": {
            "net0": "2e:6b:67:24:b8:e0",
            "net1": "9e:e4:9e:cc:1c:27",
            "net10": "22:92:ba:24:f4:c7",
            "net11": "5a:47:0b:f1:19:bc",
            "net2": "a6:bc:43:ab:67:46",
            "net3": "f2:f1:61:6a:05:41",
            "net4": "6a:62:91:30:9e:0a",
            "net5": "76:fc:db:f4:b6:33",
            "net6": "56:49:75:5b:3c:a1",
            "net7": "b6:64:c8:4c:ae:35",
            "net8": "22:52:6e:b1:ff:fd",
            "net9": "f6:c0:8d:2e:c3:97"
        },
        "tof_5_2_6": {
            "net0": "36:da:ca:90:5d:75",
            "net1": "a2:96:46:11:44:6a",
            "net10": "ae:57:28:b8:e3:41",
            "net11": "42:ae:00:bf:43:bc",
            "net2": "02:ed:a7:da:8e:d2",
            "net3": "52:2f:46:65:d4:d9",
            "net4": "8a:e0:91:8a:74:69",
            "net5": "7a:93:72:02:a7:1b",
            "net6": "e6:24:42:7f:27:41",
            "net7": "42:7e:61:6a:95:be",
            "net8": "86:c6:99:b6:de:30",
            "net9": "ae:8f:01:db:6b:71"
        },
        "tof_6_2_1": {
            "net0": "56:11:83:6f:d5:87",
            "net1": "ee:ad:7b:d6:a7:46",
            "net10": "8e:75:d4:cd:6a:b5",
            "net11": "f6:f9:d7:51:ee:11",
            "net2": "f6:bd:fe:b4:74:65",
            "net3": "12:94:a6:cb:af:8f",
            "net4": "fa:ae:a4:d7:9f:ea",
            "net5": "6e:f1:d9:75:ba:8e",
            "net6": "52:0e:55:51:89:0a",
            "net7": "52:57:ec:1d:ed:9d",
            "net8": "02:50:b7:d1:0f:85",
            "net9": "56:65:b4:74:01:d1"
        },
        "tof_6_2_2": {
            "net0": "de:f8:90:04:a6:1a",
            "net1": "9a:a3:0b:f6:2f:dc",
            "net10": "3a:87:bb:e7:02:05",
            "net11": "4e:aa:df:b3:d4:bd",
            "net2": "16:73:29:62:c7:00",
            "net3": "4a:96:5b:07:e1:7c",
            "net4": "ea:af:a9:89:c0:5b",
            "net5": "92:b2:fe:35:c5:8a",
            "net6": "3a:69:e5:54:e1:92",
            "net7": "e2:8b:3c:11:54:98",
            "net8": "26:33:f1:4c:c5:66",
            "net9": "32:3e:7f:a3:5d:18"
        },
        "tof_6_2_3": {
            "net0": "0a:c6:09:88:ee:ce",
            "net1": "ba:a8:3b:28:f0:b5",
            "net10": "aa:a1:69:2d:10:67",
            "net11": "02:db:2a:59:11:23",
            "net2": "c6:00:be:32:34:3d",
            "net3": "0a:ec:ec:6c:30:09",
            "net4": "12:9a:5c:a0:e4:38",
            "net5": "da:35:b9:77:10:e6",
            "net6": "2a:f1:13:f2:f7:79",
            "net7": "fa:cd:d1:35:f9:30",
            "net8": "5e:f5:91:6d:51:78",
            "net9": "1a:de:c3:86:f4:b5"
        },
        "tof_6_2_4": {
            "net0": "6e:dc:0a:27:59:03",
            "net1": "b2:33:d1:89:a6:2a",
            "net10": "1a:6b:52:c5:96:28",
            "net11": "a2:e2:c8:6c:21:40",
            "net2": "66:9c:9d:69:3f:98",
            "net3": "d2:8a:1a:4e:bc:db",
            "net4": "aa:64:75:c7:0b:27",
            "net5": "26:d1:3b:e5:77:6f",
            "net6": "5e:fe:1f:ae:af:f1",
            "net7": "6e:ad:9c:99:01:77",
            "net8": "4e:04:27:04:3d:e9",
            "net9": "46:df:7b:21:bd:3d"
        },
        "tof_6_2_5": {
            "net0": "ee:7f:61:57:49:74",
            "net1": "4e:1c:a0:d1:c6:4f",
            "net10": "86:f5:1f:1a:a8:bb",
            "net11": "9e:30:89:00:3a:c6",
            "net2": "2a:00:07:9d:d1:e6",
            "net3": "86:48:4d:f1:5e:8c",
            "net4": "9a:83:4a:0c:de:11",
            "net5": "62:20:f7:0c:52:9e",
            "net6": "12:95:b6:ad:03:8d",
            "net7": "d6:b2:d1:03:78:55",
            "net8": "7a:cd:3a:8b:b2:f1",
            "net9": "92:e2:1f:d9:a9:04"
        },
        "tof_6_2_6": {
            "net0": "de:15:20:a5:68:f4",
            "net1": "ea:39:7a:11:f0:dd",
            "net10": "c6:31:17:6a:87:ab",
            "net11": "d6:3d:32:26:a6:e6",
            "net2": "c2:67:33:d8:3c:17",
            "net3": "52:2a:03:1e:2e:c9",
            "net4": "d2:22:78:5d:b8:21",
            "net5": "02:3a:0c:ab:8c:81",
            "net6": "76:6d:7d:50:b3:bc",
            "net7": "ee:a0:ff:42:cf:cd",
            "net8": "36:a4:29:6b:f2:51",
            "net9": "aa:b8:c4:88:b6:19"
        }
    },
    "failed_machine": "spine_1_1_1",
    "failure_time": 1614468224.2064226,
    "recover_time": 1614468502.0771093
}