{
    "k_leaf": 16,
    "k_top": 16,
    "redundancy_factor": 16,
    "is_k8s": true,
    "machine_mac_addresses": {
        "leaf_1_0_1": {
            "net0": "4e:f6:9e:03:49:70",
            "net1": "ea:9e:17:ea:e0:ac",
            "net10": "42:48:86:b8:77:f7",
            "net11": "d6:28:6f:2e:87:8f",
            "net12": "c2:bb:52:fc:1a:0b",
            "net13": "fe:f3:6c:a1:fb:90",
            "net14": "b6:64:d8:76:a4:dc",
            "net15": "d2:ea:9e:90:68:f2",
            "net16": "6e:3a:53:46:5d:6a",
            "net2": "a6:8c:1f:65:05:5f",
            "net3": "da:4b:e4:dc:6c:ef",
            "net4": "f6:c1:96:9f:bf:c2",
            "net5": "76:bb:92:fc:93:98",
            "net6": "de:e4:07:fb:78:4e",
            "net7": "ea:e0:90:40:1f:c0",
            "net8": "36:55:51:b5:18:bd",
            "net9": "4a:24:99:c1:7b:ab"
        },
        "leaf_1_0_10": {
            "net0": "da:2d:78:2e:96:f9",
            "net1": "66:cf:db:4f:58:9e",
            "net10": "26:c4:ba:d6:7a:62",
            "net11": "62:f1:2b:9d:0f:55",
            "net12": "76:c6:85:e1:76:0e",
            "net13": "4a:3d:ad:56:cd:b8",
            "net14": "e6:43:d6:3f:e9:99",
            "net15": "8a:97:75:e1:a0:af",
            "net16": "a6:78:c6:a8:ee:a3",
            "net2": "1e:1c:04:a5:6a:8c",
            "net3": "ba:84:9d:63:5a:ce",
            "net4": "fe:ed:b0:63:69:72",
            "net5": "c6:0d:94:bd:be:53",
            "net6": "c6:02:7d:c1:73:c5",
            "net7": "46:f9:58:00:03:9d",
            "net8": "b6:74:a0:95:80:0b",
            "net9": "42:e5:3e:81:59:7e"
        },
        "leaf_1_0_11": {
            "net0": "56:da:1e:d7:dc:08",
            "net1": "7e:31:4f:3b:a1:79",
            "net10": "36:53:bc:1a:f5:41",
            "net11": "26:0e:2b:d4:ff:ea",
            "net12": "66:ec:a0:4b:f2:f0",
            "net13": "3a:8c:51:02:0e:51",
            "net14": "02:ef:2d:5a:54:17",
            "net15": "de:0f:38:c7:4b:10",
            "net16": "7e:ca:1e:60:87:41",
            "net2": "ea:76:77:7b:85:e7",
            "net3": "92:30:7c:1c:d7:b6",
            "net4": "f6:b1:e8:f9:3e:60",
            "net5": "fa:50:e9:21:b3:1e",
            "net6": "c2:e6:04:0f:14:91",
            "net7": "22:f0:22:ff:89:eb",
            "net8": "26:8b:66:de:b7:6b",
            "net9": "4e:e7:e4:19:ec:10"
        },
        "leaf_1_0_12": {
            "net0": "6a:ac:c1:05:5d:c4",
            "net1": "96:b0:e5:41:65:e8",
            "net10": "52:8e:bb:a5:ed:14",
            "net11": "9a:2b:1a:00:20:20",
            "net12": "d2:51:97:c8:75:b7",
            "net13": "6a:0c:1c:bf:9d:c7",
            "net14": "d2:f4:de:54:3e:f6",
            "net15": "02:37:0c:1b:27:c6",
            "net16": "9e:f3:3e:57:85:c2",
            "net2": "76:f8:d2:a7:8d:fe",
            "net3": "c2:41:ec:5e:57:38",
            "net4": "82:8d:b1:04:d7:c5",
            "net5": "b2:d2:e5:c0:ad:f1",
            "net6": "42:b0:3c:a9:59:46",
            "net7": "c2:a0:db:b7:53:8b",
            "net8": "3a:33:39:f8:28:e6",
            "net9": "52:03:62:a3:f5:85"
        },
        "leaf_1_0_13": {
            "net0": "ca:ae:58:e2:c2:1f",
            "net1": "be:0b:18:16:33:e2",
            "net10": "6a:73:fc:84:d2:a7",
            "net11": "3a:80:f6:94:99:7a",
            "net12": "b6:ff:14:29:c0:ec",
            "net13": "3a:58:21:91:f8:18",
            "net14": "16:d8:c6:47:30:6e",
            "net15": "aa:e1:3f:1a:8a:7f",
            "net16": "3e:7b:40:6c:6b:73",
            "net2": "da:6e:4c:e6:4a:f1",
            "net3": "2e:a7:58:46:03:dc",
            "net4": "b2:bd:9c:33:82:3e",
            "net5": "36:5f:08:6d:b0:f0",
            "net6": "82:b7:eb:5a:25:4a",
            "net7": "3a:b2:ca:85:60:bd",
            "net8": "d2:11:ee:29:14:33",
            "net9": "5a:ce:98:55:e3:ad"
        },
        "leaf_1_0_14": {
            "net0": "c6:85:64:fc:54:a7",
            "net1": "2a:2e:a6:79:84:28",
            "net10": "8e:51:d6:4a:e5:bf",
            "net11": "3e:c4:19:e3:31:96",
            "net12": "86:a0:97:f8:34:85",
            "net13": "fa:98:b8:3b:18:04",
            "net14": "22:79:25:06:f9:b9",
            "net15": "3a:d1:0d:c9:ad:6e",
            "net16": "32:4e:5e:ee:7d:35",
            "net2": "a2:0c:bc:eb:9e:1c",
            "net3": "b2:ff:6f:2d:ae:7a",
            "net4": "8a:fe:9c:04:be:3a",
            "net5": "12:69:dd:e3:c5:c8",
            "net6": "9a:43:f1:3d:8b:b8",
            "net7": "e6:8a:33:7b:df:e2",
            "net8": "4a:a9:9d:0b:73:16",
            "net9": "96:f5:05:80:ad:da"
        },
        "leaf_1_0_15": {
            "net0": "52:40:20:ff:35:ed",
            "net1": "d6:7d:f8:ac:d4:a4",
            "net10": "52:f7:64:52:5d:2f",
            "net11": "f2:cc:a5:46:10:55",
            "net12": "5a:cc:bd:5c:41:b5",
            "net13": "36:b3:5f:2a:99:13",
            "net14": "ce:c5:5b:69:69:6a",
            "net15": "5a:aa:01:6e:1b:35",
            "net16": "62:76:71:31:9e:e7",
            "net2": "a6:81:5c:6b:1f:e5",
            "net3": "ee:e3:91:2b:a4:f9",
            "net4": "d2:5a:93:3c:69:7f",
            "net5": "2a:a8:96:af:f2:ee",
            "net6": "c2:35:b0:44:d3:58",
            "net7": "3e:bf:14:06:d1:ef",
            "net8": "ba:04:ae:14:a5:88",
            "net9": "d2:2f:db:c0:ae:3b"
        },
        "leaf_1_0_16": {
            "net0": "86:af:50:f0:70:f6",
            "net1": "f2:ba:a9:e4:cc:49",
            "net10": "72:65:16:a0:5a:b5",
            "net11": "16:c0:5e:a2:e4:34",
            "net12": "fa:2c:03:d4:ca:41",
            "net13": "72:4b:d5:7d:35:8a",
            "net14": "76:ff:6f:ac:94:4e",
            "net15": "be:4e:f1:0d:b1:fa",
            "net16": "f6:20:2c:c7:de:63",
            "net2": "aa:f0:66:2d:68:2e",
            "net3": "f6:c4:cb:02:ba:30",
            "net4": "c6:a2:d8:7c:19:cd",
            "net5": "06:8e:c4:c1:17:d4",
            "net6": "76:23:55:dc:1a:e8",
            "net7": "46:fe:e2:e3:3b:d7",
            "net8": "0e:cf:26:32:da:39",
            "net9": "aa:42:08:07:b2:35"
        },
        "leaf_1_0_2": {
            "net0": "5a:7e:36:03:c7:13",
            "net1": "d6:30:8f:0a:03:e4",
            "net10": "0e:56:41:65:4d:32",
            "net11": "92:ae:88:d6:72:6b",
            "net12": "fa:12:e2:fe:8e:ad",
            "net13": "e2:18:f6:17:3a:23",
            "net14": "8e:20:45:a1:d3:70",
            "net15": "1e:c3:67:dd:dd:74",
            "net16": "e6:a9:7d:75:30:c6",
            "net2": "56:0e:bb:f3:77:86",
            "net3": "e6:b7:f2:6a:34:12",
            "net4": "0e:2e:31:ed:13:38",
            "net5": "9a:e1:3c:4d:bf:34",
            "net6": "32:64:4d:c3:dc:d0",
            "net7": "96:fa:17:51:f6:92",
            "net8": "02:f5:98:bb:cd:f5",
            "net9": "0a:bf:49:a3:74:83"
        },
        "leaf_1_0_3": {
            "net0": "16:ad:78:6c:31:65",
            "net1": "2e:12:5a:af:67:1f",
            "net10": "ba:13:0e:c1:14:cd",
            "net11": "ee:7e:9c:7c:ef:00",
            "net12": "0e:09:5d:b2:07:2a",
            "net13": "da:ec:dc:63:69:4e",
            "net14": "12:22:9d:6b:d1:24",
            "net15": "be:25:05:c5:50:a3",
            "net16": "b6:17:a6:b6:82:57",
            "net2": "5e:49:ca:05:7d:ff",
            "net3": "ca:94:10:6b:88:8c",
            "net4": "aa:37:99:80:8a:fe",
            "net5": "0a:97:c9:88:f7:6f",
            "net6": "8a:8d:60:83:59:8e",
            "net7": "ba:0e:63:88:54:37",
            "net8": "66:73:25:92:cd:5e",
            "net9": "6a:ae:c9:a6:d0:0e"
        },
        "leaf_1_0_4": {
            "net0": "ee:12:f0:ac:50:60",
            "net1": "fa:9c:0c:52:3c:1b",
            "net10": "32:8d:88:a6:b9:1b",
            "net11": "a2:5f:75:e9:4c:45",
            "net12": "ce:cc:ee:e1:bc:38",
            "net13": "82:d1:cd:b5:76:84",
            "net14": "16:bd:13:89:ab:55",
            "net15": "7a:4d:07:97:d4:60",
            "net16": "ee:98:be:fe:eb:45",
            "net2": "72:af:f1:57:91:36",
            "net3": "4e:73:48:28:0d:dc",
            "net4": "ae:fc:3c:e8:7b:a3",
            "net5": "fe:a4:28:98:0c:9e",
            "net6": "52:ce:61:52:a8:44",
            "net7": "e2:df:5e:3a:e2:68",
            "net8": "86:ae:02:50:bb:3c",
            "net9": "d2:35:20:6f:09:4d"
        },
        "leaf_1_0_5": {
            "net0": "72:38:c8:9a:93:a2",
            "net1": "0e:56:4f:99:c2:c9",
            "net10": "be:cb:08:c2:05:05",
            "net11": "4a:e2:b2:32:c0:b1",
            "net12": "de:ee:fa:df:ea:ba",
            "net13": "2a:51:5f:d1:9c:7a",
            "net14": "8a:8d:57:8c:25:8d",
            "net15": "ba:8b:aa:28:4e:8c",
            "net16": "f6:3a:b2:ac:1d:dd",
            "net2": "12:19:e6:57:2d:11",
            "net3": "c6:26:a7:85:7e:ea",
            "net4": "2e:e1:b7:9e:4e:e1",
            "net5": "56:e8:70:f4:86:a4",
            "net6": "c2:fc:b2:08:28:7c",
            "net7": "ae:37:f2:a4:0f:b6",
            "net8": "a6:58:0e:12:db:f9",
            "net9": "b2:ba:5c:32:27:20"
        },
        "leaf_1_0_6": {
            "net0": "a2:b1:f6:65:07:fa",
            "net1": "42:1b:cb:a2:d3:18",
            "net10": "1e:a1:87:fb:8d:d5",
            "net11": "e2:3a:46:07:3f:00",
            "net12": "8a:f9:04:60:5a:35",
            "net13": "f6:39:bc:3f:ec:22",
            "net14": "86:4b:75:08:78:0a",
            "net15": "da:f0:22:03:9b:00",
            "net16": "66:a7:42:3a:23:07",
            "net2": "2e:fe:77:63:4d:72",
            "net3": "3a:f1:50:37:63:67",
            "net4": "ae:1a:ea:4f:45:0e",
            "net5": "9a:ac:60:fc:eb:cb",
            "net6": "9e:5b:26:75:17:51",
            "net7": "da:20:b7:38:4f:7e",
            "net8": "3a:d6:c3:51:e8:54",
            "net9": "06:36:35:e1:5a:e2"
        },
        "leaf_1_0_7": {
            "net0": "1a:c7:f8:a4:24:84",
            "net1": "62:f7:e0:6a:f1:df",
            "net10": "d2:7a:ba:88:be:65",
            "net11": "1a:e7:99:91:97:08",
            "net12": "0a:16:ea:29:04:52",
            "net13": "3a:b6:4f:6e:e2:a2",
            "net14": "0e:8a:46:d9:9b:ea",
            "net15": "12:1c:8b:e8:d7:87",
            "net16": "8e:ff:99:eb:e0:0c",
            "net2": "7e:89:60:78:bb:ac",
            "net3": "fa:db:fb:3e:e8:a3",
            "net4": "f2:c6:5a:b9:8c:a2",
            "net5": "8e:5e:ae:c6:18:7f",
            "net6": "9e:18:b0:b5:5c:15",
            "net7": "ca:7e:6f:11:89:16",
            "net8": "9a:09:57:78:eb:e3",
            "net9": "ba:aa:15:bc:24:0b"
        },
        "leaf_1_0_8": {
            "net0": "4a:f1:0f:4b:1e:d1",
            "net1": "0e:d8:aa:d0:08:a3",
            "net10": "42:3c:50:18:6b:e7",
            "net11": "72:47:6e:57:8e:49",
            "net12": "3e:ac:02:76:96:b6",
            "net13": "1e:7b:11:8b:58:00",
            "net14": "32:f0:30:30:89:f4",
            "net15": "ca:b4:41:79:ee:21",
            "net16": "62:16:38:2f:9f:77",
            "net2": "1e:1a:2f:fb:40:1a",
            "net3": "66:c1:51:9f:22:3c",
            "net4": "ee:a3:a7:4e:e3:e2",
            "net5": "de:d5:f6:3a:30:a2",
            "net6": "fe:42:f3:38:61:a6",
            "net7": "c2:15:35:92:86:fa",
            "net8": "7a:36:b9:d5:53:36",
            "net9": "b6:5f:14:43:c7:9b"
        },
        "leaf_1_0_9": {
            "net0": "da:4e:3f:2c:b0:97",
            "net1": "0e:15:6c:ab:2d:4e",
            "net10": "42:ed:40:cd:39:03",
            "net11": "b6:a5:7a:9b:03:c3",
            "net12": "c6:ae:35:c2:13:cc",
            "net13": "46:cc:10:0f:16:05",
            "net14": "7a:36:55:b7:0d:87",
            "net15": "b6:4f:97:20:ed:2a",
            "net16": "96:29:ea:6a:2d:de",
            "net2": "3e:36:a7:f3:e7:59",
            "net3": "1a:cb:df:31:c9:13",
            "net4": "16:88:0a:f1:00:11",
            "net5": "4a:75:84:01:05:5e",
            "net6": "3a:ad:5e:33:53:12",
            "net7": "b2:92:46:3f:e2:6b",
            "net8": "be:b2:1e:cc:b8:9f",
            "net9": "0e:8c:dc:e0:a3:ce"
        },
        "leaf_2_0_1": {
            "net0": "92:ac:e3:b7:69:e8",
            "net1": "e6:9c:2a:0d:c4:5a",
            "net10": "f6:d9:0e:3e:37:29",
            "net11": "9e:62:4f:90:7b:26",
            "net12": "ce:41:f7:a3:ac:9e",
            "net13": "86:4e:ce:d4:2c:37",
            "net14": "f6:9b:d0:82:10:3c",
            "net15": "6e:96:77:19:64:b2",
            "net16": "ee:81:13:25:db:71",
            "net2": "3a:15:b6:da:9b:e7",
            "net3": "82:1e:e8:b8:41:5e",
            "net4": "9a:5d:41:18:fb:24",
            "net5": "7a:5d:76:0d:71:26",
            "net6": "66:94:17:9a:95:10",
            "net7": "ae:8d:78:aa:3a:d9",
            "net8": "3e:9a:cf:5c:d1:7b",
            "net9": "0a:1d:50:f8:87:9c"
        },
        "leaf_2_0_10": {
            "net0": "86:32:88:18:d3:38",
            "net1": "ce:c8:f9:2d:57:b0",
            "net10": "1a:78:3b:ff:07:39",
            "net11": "8a:cd:ec:98:52:a8",
            "net12": "2e:5c:3d:0f:5b:60",
            "net13": "52:01:84:e7:84:da",
            "net14": "da:f8:3d:02:99:6e",
            "net15": "72:28:04:55:fc:eb",
            "net16": "4e:35:49:ad:93:ee",
            "net2": "26:fa:52:f0:3b:5f",
            "net3": "d6:9b:5f:f9:e3:7c",
            "net4": "02:49:3b:da:74:ae",
            "net5": "da:16:6e:b8:52:25",
            "net6": "46:b1:28:3b:fb:0b",
            "net7": "22:39:15:1b:94:b6",
            "net8": "36:ca:42:f1:d8:d5",
            "net9": "2a:05:40:71:fd:30"
        },
        "leaf_2_0_11": {
            "net0": "f2:92:f6:c8:77:bb",
            "net1": "ea:3a:c2:c9:7c:d9",
            "net10": "86:3a:64:b7:81:90",
            "net11": "06:02:12:d4:fe:ef",
            "net12": "ea:7e:d3:de:bd:e3",
            "net13": "ba:61:4d:1a:a5:fe",
            "net14": "96:b2:03:69:58:ad",
            "net15": "ce:78:b3:47:d5:dc",
            "net16": "b6:6f:53:fe:94:b9",
            "net2": "2e:a6:e9:f4:9f:85",
            "net3": "c2:c0:4a:a7:74:6b",
            "net4": "8e:91:00:62:e2:1a",
            "net5": "fa:f6:7c:05:44:37",
            "net6": "72:30:b4:1d:b5:43",
            "net7": "82:a7:4b:fd:61:e5",
            "net8": "ce:0e:c4:b7:fc:9f",
            "net9": "c6:31:41:e4:9c:2c"
        },
        "leaf_2_0_12": {
            "net0": "16:4c:f3:20:dc:56",
            "net1": "36:76:2f:29:03:b6",
            "net10": "aa:38:e9:49:1f:01",
            "net11": "ae:e0:3d:91:6e:c5",
            "net12": "16:b0:53:d4:c6:35",
            "net13": "be:4d:89:75:d7:56",
            "net14": "9a:11:9d:71:61:91",
            "net15": "de:69:74:e6:c2:17",
            "net16": "5e:17:b7:11:ff:ca",
            "net2": "8e:90:cd:6b:d1:7d",
            "net3": "22:95:ca:e0:5e:d9",
            "net4": "e2:72:bf:d6:da:f9",
            "net5": "0e:17:fe:21:c9:d3",
            "net6": "ea:74:03:12:42:55",
            "net7": "9e:b3:ee:5a:5f:e4",
            "net8": "d2:1b:1b:94:0f:79",
            "net9": "62:ac:b1:41:f1:e0"
        },
        "leaf_2_0_13": {
            "net0": "3a:2a:16:f9:e1:0e",
            "net1": "82:98:01:e3:1f:45",
            "net10": "0a:15:81:49:ad:4e",
            "net11": "2a:98:ac:b6:7d:68",
            "net12": "12:eb:be:fc:9c:1f",
            "net13": "3a:c5:f3:e4:1e:2d",
            "net14": "4e:96:f2:4b:94:59",
            "net15": "62:57:9e:32:56:d2",
            "net16": "4a:9d:51:1f:7b:e3",
            "net2": "be:2f:75:a6:08:60",
            "net3": "a2:38:23:0b:3e:4f",
            "net4": "4a:66:73:87:cd:13",
            "net5": "1a:45:d6:a6:ff:88",
            "net6": "b2:75:a3:7e:6b:c4",
            "net7": "de:06:34:b8:35:5f",
            "net8": "32:51:d0:40:e0:aa",
            "net9": "32:c3:41:a3:4a:ca"
        },
        "leaf_2_0_14": {
            "net0": "52:aa:ed:04:42:db",
            "net1": "82:a6:6f:36:2f:6b",
            "net10": "92:21:11:60:ee:73",
            "net11": "5e:8f:55:f4:65:69",
            "net12": "46:11:e8:10:b3:8e",
            "net13": "06:e2:61:66:96:15",
            "net14": "d2:dd:7c:6c:45:66",
            "net15": "ca:5f:c2:b7:ce:3d",
            "net16": "f6:f9:5c:42:63:9a",
            "net2": "1e:fb:b9:8f:26:75",
            "net3": "32:6e:67:07:f0:d9",
            "net4": "06:a7:d3:e0:89:65",
            "net5": "6a:78:ab:91:85:e3",
            "net6": "86:e3:c3:f0:a4:a8",
            "net7": "02:33:ca:cb:16:95",
            "net8": "ca:ea:ad:76:b9:1f",
            "net9": "66:af:6c:f3:fb:85"
        },
        "leaf_2_0_15": {
            "net0": "7e:4b:a9:ef:c6:ec",
            "net1": "52:b6:0f:14:9e:49",
            "net10": "06:1e:70:66:49:b4",
            "net11": "f2:6b:3e:97:87:bb",
            "net12": "e6:dc:17:90:26:cd",
            "net13": "5e:2d:55:92:a9:c6",
            "net14": "4a:e0:07:1d:39:f3",
            "net15": "1e:4d:92:89:c4:74",
            "net16": "7e:68:53:85:6f:7c",
            "net2": "ea:a0:8c:04:8a:d1",
            "net3": "8a:74:0f:cd:f0:3f",
            "net4": "be:56:e9:8c:5e:aa",
            "net5": "fe:36:8f:1a:f9:d0",
            "net6": "5e:aa:ed:6c:33:d3",
            "net7": "7a:af:5d:62:62:89",
            "net8": "1a:a4:a3:4a:d7:ab",
            "net9": "46:76:8c:82:34:09"
        },
        "leaf_2_0_16": {
            "net0": "62:2b:37:50:39:89",
            "net1": "32:18:50:88:e7:f5",
            "net10": "1a:b1:2d:18:eb:94",
            "net11": "46:5c:da:ab:c1:93",
            "net12": "1a:2e:eb:55:e0:d0",
            "net13": "26:9a:33:0b:5b:6f",
            "net14": "4a:bc:8e:77:2d:30",
            "net15": "f6:ee:85:29:83:17",
            "net16": "82:51:43:aa:bc:1f",
            "net2": "92:c6:d8:d8:1d:c1",
            "net3": "02:16:f4:76:f6:d3",
            "net4": "26:19:91:60:a1:57",
            "net5": "fe:be:53:4b:d7:50",
            "net6": "8a:64:39:ac:5b:08",
            "net7": "de:62:c9:48:63:0a",
            "net8": "1e:2f:a6:73:ce:68",
            "net9": "12:88:98:09:d7:85"
        },
        "leaf_2_0_2": {
            "net0": "aa:80:b0:8f:f0:17",
            "net1": "06:23:bb:41:93:e9",
            "net10": "8a:46:ae:13:63:29",
            "net11": "1a:bf:47:75:34:f3",
            "net12": "86:c7:f7:9c:fa:53",
            "net13": "7e:f5:ea:5b:11:7d",
            "net14": "52:60:fc:f4:b5:a2",
            "net15": "4a:3c:22:df:f7:4d",
            "net16": "82:9c:e8:fd:95:6a",
            "net2": "86:f3:21:85:ee:06",
            "net3": "d6:f9:96:ac:09:cd",
            "net4": "a6:8c:c0:bd:37:53",
            "net5": "2e:34:97:7d:49:d0",
            "net6": "3e:65:b4:ed:47:73",
            "net7": "fa:fd:e4:69:6f:3e",
            "net8": "66:16:01:80:ba:b6",
            "net9": "be:46:9f:92:83:e0"
        },
        "leaf_2_0_3": {
            "net0": "32:74:82:e6:13:00",
            "net1": "42:53:46:23:1c:6b",
            "net10": "8e:f8:7f:3a:4e:f5",
            "net11": "96:27:c5:23:e3:34",
            "net12": "96:e8:69:69:0c:9f",
            "net13": "62:b0:c8:a1:b0:bd",
            "net14": "ca:42:14:50:72:96",
            "net15": "b6:51:48:88:78:d0",
            "net16": "92:c1:51:4a:4f:3e",
            "net2": "fa:85:76:c2:61:d0",
            "net3": "2e:2b:94:11:eb:28",
            "net4": "06:9a:bc:3f:61:c3",
            "net5": "7a:33:ca:28:89:d4",
            "net6": "96:9c:f8:03:49:8b",
            "net7": "d6:7b:7d:4c:6d:74",
            "net8": "6a:b6:d0:15:df:a6",
            "net9": "c2:3b:c6:38:d9:c5"
        },
        "leaf_2_0_4": {
            "net0": "fa:26:d7:07:a7:ea",
            "net1": "0e:b5:d6:2e:63:43",
            "net10": "e6:2c:ff:e7:4b:82",
            "net11": "3e:b8:60:bc:1e:40",
            "net12": "f2:40:be:14:54:aa",
            "net13": "22:c1:c2:1e:e7:ca",
            "net14": "8e:12:96:a4:5c:a9",
            "net15": "06:01:d8:c0:c6:9a",
            "net16": "f6:df:66:b0:29:b5",
            "net2": "52:db:6e:7f:6d:86",
            "net3": "2e:ea:62:32:a6:33",
            "net4": "7e:c7:2e:02:f8:21",
            "net5": "f2:7f:5b:d6:60:fe",
            "net6": "ba:78:6f:e3:f3:1c",
            "net7": "82:58:05:95:2a:97",
            "net8": "72:c0:9d:df:28:d4",
            "net9": "ae:08:c9:e2:fe:89"
        },
        "leaf_2_0_5": {
            "net0": "ea:01:df:23:dd:25",
            "net1": "36:c5:86:ff:25:76",
            "net10": "42:5b:cd:b0:25:9f",
            "net11": "b6:8a:59:dd:c0:1e",
            "net12": "0a:fa:01:40:da:c2",
            "net13": "fa:df:6b:a8:db:7b",
            "net14": "72:17:54:b3:09:88",
            "net15": "fa:3e:31:63:62:ca",
            "net16": "7a:28:a4:ff:27:b0",
            "net2": "26:89:55:51:54:37",
            "net3": "0a:43:61:97:79:89",
            "net4": "96:c3:d9:4a:b3:0e",
            "net5": "ae:43:c4:67:05:18",
            "net6": "de:18:55:39:4c:f2",
            "net7": "52:f6:b5:68:03:fe",
            "net8": "06:5b:e9:28:6b:05",
            "net9": "8e:16:61:9d:ad:e7"
        },
        "leaf_2_0_6": {
            "net0": "06:b3:c0:98:5e:d9",
            "net1": "56:35:b0:75:c9:da",
            "net10": "2a:d4:17:a5:45:22",
            "net11": "7e:dd:e7:e5:41:a5",
            "net12": "46:6b:64:ad:71:cf",
            "net13": "ae:53:96:92:2b:30",
            "net14": "32:9a:eb:c5:50:97",
            "net15": "d6:a5:87:df:37:0b",
            "net16": "b2:64:e8:b8:83:b1",
            "net2": "52:03:21:fd:eb:a7",
            "net3": "46:53:61:08:62:9f",
            "net4": "2a:dd:16:d2:6a:39",
            "net5": "6e:ec:c2:fd:79:d6",
            "net6": "42:83:d5:19:ad:71",
            "net7": "a2:9a:69:e4:b5:6d",
            "net8": "7e:15:d4:f0:a3:0b",
            "net9": "66:79:c1:3b:05:86"
        },
        "leaf_2_0_7": {
            "net0": "4a:dd:aa:44:a1:d6",
            "net1": "46:fd:b4:0e:5b:60",
            "net10": "86:24:9d:0c:69:ff",
            "net11": "62:fc:79:78:75:c1",
            "net12": "7a:f3:55:fc:85:81",
            "net13": "8a:69:2c:54:1d:b4",
            "net14": "ba:75:10:47:ef:3d",
            "net15": "62:0f:dd:06:b4:e7",
            "net16": "12:1d:0f:ec:8e:16",
            "net2": "a6:53:b3:6f:d2:7c",
            "net3": "96:a8:62:6d:22:62",
            "net4": "62:87:1c:2f:8f:3e",
            "net5": "62:dc:e7:ac:69:05",
            "net6": "7e:d4:98:f6:e6:a6",
            "net7": "5a:9c:2d:d8:1f:12",
            "net8": "36:da:c8:7b:e3:dd",
            "net9": "c6:d0:ee:44:ee:88"
        },
        "leaf_2_0_8": {
            "net0": "d2:8f:ba:93:b7:8e",
            "net1": "c2:5e:1a:1c:15:12",
            "net10": "aa:ee:bd:4a:98:27",
            "net11": "fa:61:e9:71:66:00",
            "net12": "de:c4:84:1f:ed:e5",
            "net13": "e6:63:0f:e6:54:01",
            "net14": "a6:eb:ad:93:95:1f",
            "net15": "ee:9e:76:41:67:82",
            "net16": "fa:f3:49:27:cb:5c",
            "net2": "5e:1a:85:ec:76:5f",
            "net3": "2a:38:36:d8:26:ce",
            "net4": "da:7e:f7:bc:50:88",
            "net5": "a2:d8:bb:33:8a:32",
            "net6": "ba:cf:ba:9b:b5:cf",
            "net7": "16:9b:04:7e:72:f0",
            "net8": "1e:48:16:86:f0:4e",
            "net9": "7e:98:9e:68:da:37"
        },
        "leaf_2_0_9": {
            "net0": "62:15:ad:3a:40:e2",
            "net1": "2e:f5:aa:d0:17:da",
            "net10": "fa:ac:48:02:4a:85",
            "net11": "4a:33:65:fc:da:f7",
            "net12": "e2:42:39:7b:07:2b",
            "net13": "e6:02:0a:50:99:83",
            "net14": "5e:fe:56:88:ee:83",
            "net15": "b6:81:82:e1:a5:08",
            "net16": "9e:7c:8d:50:f0:b4",
            "net2": "ce:d1:e2:8d:bf:90",
            "net3": "0a:41:18:23:97:4c",
            "net4": "fe:5d:7e:50:a2:bd",
            "net5": "5a:bf:e6:c5:50:3d",
            "net6": "8e:c4:25:ee:b9:30",
            "net7": "62:b3:f1:3e:0d:bf",
            "net8": "e6:b8:a7:4a:53:de",
            "net9": "3e:20:ce:7c:fd:2a"
        },
        "spine_1_1_1": {
            "net0": "0e:e6:23:74:4c:6c",
            "net1": "06:b6:da:3f:63:52",
            "net10": "e6:8f:a6:7e:ce:8c",
            "net11": "92:37:89:7b:70:80",
            "net12": "96:11:c1:60:48:90",
            "net13": "86:c2:b2:ed:ba:1c",
            "net14": "ce:0e:0f:31:f6:77",
            "net15": "7a:9d:21:b6:bc:d9",
            "net16": "26:ff:7c:f4:18:5d",
            "net17": "6e:a1:93:d1:f2:6f",
            "net18": "0a:e7:eb:3e:b4:78",
            "net19": "22:7a:5a:55:fd:73",
            "net2": "06:db:1c:fd:dd:73",
            "net20": "16:97:d8:55:7b:11",
            "net21": "42:08:9a:fc:13:1b",
            "net22": "5e:0f:20:c1:04:90",
            "net23": "46:2d:67:94:d7:f4",
            "net24": "ca:79:22:96:fc:ae",
            "net25": "56:06:ad:0b:4e:22",
            "net26": "ba:b4:cd:74:38:51",
            "net27": "1a:61:40:6b:42:97",
            "net28": "da:df:1c:73:92:9a",
            "net29": "da:1b:20:eb:8f:94",
            "net3": "f6:52:4b:27:5a:07",
            "net30": "66:85:c9:1c:36:1f",
            "net31": "4e:48:1f:2c:69:43",
            "net4": "ba:6d:f9:94:64:66",
            "net5": "e2:35:5c:07:cd:3a",
            "net6": "ee:e6:7e:d9:7f:69",
            "net7": "36:3b:c8:fc:d2:fd",
            "net8": "66:88:aa:cb:24:30",
            "net9": "22:1f:dc:81:e4:49"
        },
        "spine_1_1_10": {
            "net0": "12:4c:81:6d:6d:60",
            "net1": "da:b4:73:b1:97:a5",
            "net10": "6e:3b:64:79:e6:51",
            "net11": "22:9d:76:b8:78:28",
            "net12": "aa:90:bc:79:29:0f",
            "net13": "92:65:96:a6:75:2c",
            "net14": "36:f7:a4:fd:a4:46",
            "net15": "6e:c3:44:f9:49:bc",
            "net16": "be:9f:9c:7f:0f:a0",
            "net17": "0e:69:8d:79:58:c2",
            "net18": "4a:78:d4:54:64:b8",
            "net19": "d6:53:78:e2:05:d0",
            "net2": "9e:15:c5:50:6b:a9",
            "net20": "1e:18:09:6e:53:72",
            "net21": "7e:9d:da:ee:37:9e",
            "net22": "9e:0d:59:ec:e7:78",
            "net23": "6a:47:5c:df:f6:64",
            "net24": "fe:2e:f2:83:9b:34",
            "net25": "0a:db:d1:73:58:be",
            "net26": "fa:31:40:ac:2e:51",
            "net27": "1a:af:de:4f:96:22",
            "net28": "26:10:7b:bb:14:a7",
            "net29": "32:13:62:fd:eb:e6",
            "net3": "f6:50:06:94:2b:b2",
            "net30": "8a:8b:a2:1c:05:2f",
            "net31": "fa:9c:3f:20:0a:2c",
            "net4": "3e:88:20:d6:17:a1",
            "net5": "ce:d9:3e:b8:08:88",
            "net6": "96:26:10:46:22:29",
            "net7": "42:39:90:04:69:80",
            "net8": "3a:6a:a8:07:52:40",
            "net9": "d6:d8:bb:ae:44:03"
        },
        "spine_1_1_11": {
            "net0": "3a:03:2c:ad:ed:cc",
            "net1": "86:5e:37:50:ba:96",
            "net10": "b2:5f:7d:b3:1e:4f",
            "net11": "fe:43:6f:32:86:11",
            "net12": "82:47:4a:ef:bb:36",
            "net13": "26:4d:d7:e2:b2:87",
            "net14": "3a:03:f3:d5:33:54",
            "net15": "16:d1:9a:94:7a:75",
            "net16": "ae:4d:4d:49:85:d4",
            "net17": "ee:6c:db:04:83:9c",
            "net18": "26:44:5e:a1:7b:41",
            "net19": "7a:8d:95:f6:2a:60",
            "net2": "d6:79:0e:ed:ff:fc",
            "net20": "96:ee:08:0d:e1:8f",
            "net21": "76:58:d2:a0:77:1a",
            "net22": "46:62:e4:68:c7:8d",
            "net23": "02:42:52:db:6e:7f",
            "net24": "f6:6a:1b:10:91:31",
            "net25": "8e:9e:fa:ee:f0:6d",
            "net26": "1a:79:c9:fc:bb:c8",
            "net27": "2e:d6:c8:2a:d4:40",
            "net28": "be:a0:09:63:4e:65",
            "net29": "26:27:98:d5:05:b9",
            "net3": "be:0c:c2:c0:20:01",
            "net30": "52:95:37:d9:1d:0a",
            "net31": "0a:19:f1:e5:bf:fb",
            "net4": "aa:4a:17:12:04:8b",
            "net5": "52:8c:f4:45:1e:7b",
            "net6": "36:17:92:5c:ab:d8",
            "net7": "32:af:7d:5c:09:83",
            "net8": "62:ed:a1:f5:d3:43",
            "net9": "52:00:1f:9b:68:dd"
        },
        "spine_1_1_12": {
            "net0": "f2:cd:9a:e8:43:47",
            "net1": "ca:50:4b:d9:eb:98",
            "net10": "1e:67:f5:68:c0:37",
            "net11": "a6:fa:92:22:36:c8",
            "net12": "ca:5e:a1:22:79:26",
            "net13": "aa:ea:b0:bb:db:e1",
            "net14": "b6:d6:cd:83:d9:4b",
            "net15": "ea:38:53:8c:a2:67",
            "net16": "9e:69:9a:f9:fa:9d",
            "net17": "0a:57:5c:2e:ed:64",
            "net18": "0a:43:60:5a:18:bc",
            "net19": "32:3a:bf:68:bd:2f",
            "net2": "26:4e:d7:6f:2c:b6",
            "net20": "f2:2a:66:ba:42:08",
            "net21": "aa:5d:88:b2:89:c1",
            "net22": "0e:12:86:13:18:27",
            "net23": "6a:b7:df:62:af:b3",
            "net24": "26:05:64:91:3f:51",
            "net25": "0e:dc:82:4b:0f:bc",
            "net26": "52:a9:08:7e:50:3e",
            "net27": "46:32:3e:d4:37:88",
            "net28": "aa:89:01:2a:38:0e",
            "net29": "ea:6d:96:50:6a:56",
            "net3": "c2:e3:ad:bc:8f:77",
            "net30": "f6:c9:a4:10:44:49",
            "net31": "f2:2c:1e:4d:0d:2c",
            "net4": "e2:59:33:06:cf:bc",
            "net5": "b6:ad:53:12:49:b4",
            "net6": "56:c6:f3:0f:6e:88",
            "net7": "16:b8:0e:cc:77:95",
            "net8": "1a:0f:93:5d:ff:20",
            "net9": "76:6f:c1:7e:a2:4c"
        },
        "spine_1_1_13": {
            "net0": "aa:ce:cd:6f:b1:84",
            "net1": "8e:d0:e2:a4:27:cc",
            "net10": "56:80:38:19:2f:5b",
            "net11": "12:13:2d:fc:0f:ac",
            "net12": "ce:97:6a:b4:be:d7",
            "net13": "2a:3e:bc:fa:90:fa",
            "net14": "86:2f:53:17:ce:1e",
            "net15": "3a:7d:8c:d3:4e:49",
            "net16": "46:bd:d5:f9:4c:2c",
            "net17": "02:02:b3:86:eb:40",
            "net18": "5e:d2:bd:a7:df:a3",
            "net19": "ee:f5:2f:73:87:6e",
            "net2": "d2:0a:cf:0e:68:c6",
            "net20": "0a:dd:77:3c:24:f8",
            "net21": "52:a5:28:a0:cb:7d",
            "net22": "e6:73:69:0d:28:76",
            "net23": "2a:fd:5b:ff:b2:f0",
            "net24": "42:74:70:25:c7:05",
            "net25": "d2:04:cf:08:5a:9a",
            "net26": "3e:80:6b:d6:22:c5",
            "net27": "32:a3:56:b4:2e:2b",
            "net28": "8a:1f:9b:77:e4:9c",
            "net29": "3a:4b:00:22:fc:7d",
            "net3": "56:ff:a6:f1:1f:9a",
            "net30": "f6:cf:df:bd:85:f1",
            "net31": "26:60:12:b3:e2:4a",
            "net4": "4a:54:4f:ea:8e:1b",
            "net5": "8e:33:ed:62:ca:ab",
            "net6": "46:ab:24:5d:63:ee",
            "net7": "6a:7d:83:65:cd:cc",
            "net8": "f6:7d:44:d5:d0:c2",
            "net9": "a2:bd:3a:44:83:48"
        },
        "spine_1_1_14": {
            "net0": "f6:1b:38:1b:28:03",
            "net1": "c2:b1:76:52:44:56",
            "net10": "ba:f4:ba:49:46:5f",
            "net11": "4e:6a:b4:c1:19:fb",
            "net12": "66:32:89:c8:dd:9f",
            "net13": "d2:f7:ee:fc:38:76",
            "net14": "3a:50:e2:29:3b:6d",
            "net15": "be:05:5c:7d:5c:31",
            "net16": "a6:ad:98:45:e4:a3",
            "net17": "92:fe:f3:1d:0c:b4",
            "net18": "0e:94:b4:4e:b7:1f",
            "net19": "1a:df:63:a3:48:3b",
            "net2": "be:e0:96:30:f6:42",
            "net20": "66:40:8e:78:fe:78",
            "net21": "ae:1b:3c:55:9b:c1",
            "net22": "ee:5e:ad:86:5a:2f",
            "net23": "b6:9b:12:55:87:2b",
            "net24": "1a:a0:2f:b8:dc:3a",
            "net25": "c2:1c:4c:67:37:08",
            "net26": "7e:01:d5:92:8f:a1",
            "net27": "ee:01:0c:5f:81:d9",
            "net28": "e2:78:c8:42:b9:e5",
            "net29": "7a:31:34:39:66:f8",
            "net3": "26:f5:a0:74:fd:ad",
            "net30": "5e:a0:ee:4c:26:8e",
            "net31": "62:a9:36:2a:cb:f3",
            "net4": "72:6c:e7:25:37:1a",
            "net5": "7a:fb:44:23:14:85",
            "net6": "7e:16:61:09:2a:5f",
            "net7": "12:25:93:35:94:e9",
            "net8": "ea:31:4a:8b:d1:50",
            "net9": "42:af:c6:22:21:2f"
        },
        "spine_1_1_15": {
            "net0": "9e:b8:13:d6:d3:67",
            "net1": "46:53:48:b0:af:fc",
            "net10": "7a:ea:5c:c4:7c:76",
            "net11": "c6:a1:a9:21:da:98",
            "net12": "ca:b8:ae:f3:bd:d6",
            "net13": "ca:c6:72:49:8f:c7",
            "net14": "0e:b6:33:1e:b0:8b",
            "net15": "42:27:f1:ef:8e:b5",
            "net16": "da:0c:11:4a:02:75",
            "net17": "fa:b9:1b:11:9e:11",
            "net18": "be:8d:3d:1e:0d:4c",
            "net19": "d6:22:d5:bc:f4:32",
            "net2": "e2:df:3d:c1:fe:3e",
            "net20": "f6:51:44:01:40:04",
            "net21": "92:4d:c5:a4:d0:d1",
            "net22": "76:de:b2:91:1b:56",
            "net23": "86:52:b7:7b:4b:c1",
            "net24": "62:6f:9d:ed:bf:42",
            "net25": "92:58:a9:f4:48:d9",
            "net26": "b6:f3:3a:52:60:f1",
            "net27": "5e:d4:00:a7:60:56",
            "net28": "ee:71:90:35:e5:17",
            "net29": "0e:94:8c:17:e8:98",
            "net3": "0e:7f:17:a8:5c:f2",
            "net30": "82:26:2a:31:77:4a",
            "net31": "7a:ed:67:2d:a7:6d",
            "net4": "76:69:a3:2b:a4:b5",
            "net5": "46:d5:3b:c4:69:b1",
            "net6": "1a:93:a1:72:75:e8",
            "net7": "92:6f:0c:36:04:cc",
            "net8": "de:be:bd:4f:b1:10",
            "net9": "2a:9e:89:88:8e:d2"
        },
        "spine_1_1_16": {
            "net0": "52:34:12:f2:75:1f",
            "net1": "d6:2e:ac:c7:4d:42",
            "net10": "aa:6c:0f:d5:8d:a2",
            "net11": "4a:c9:f2:b8:f9:75",
            "net12": "7e:13:a9:e2:5c:66",
            "net13": "82:70:c4:7e:56:c6",
            "net14": "7a:8b:15:31:73:f9",
            "net15": "56:66:ae:0f:43:d2",
            "net16": "2e:c4:81:0f:41:c8",
            "net17": "aa:1b:6e:ba:75:78",
            "net18": "d2:6b:e0:77:9f:fb",
            "net19": "5a:a8:bc:16:cc:d7",
            "net2": "de:68:8b:0f:d0:78",
            "net20": "f2:a8:8d:55:0c:2d",
            "net21": "5e:bd:0e:d6:e0:bb",
            "net22": "fe:0b:58:dc:ba:76",
            "net23": "ce:1f:2d:90:f3:02",
            "net24": "7a:4f:ab:83:90:5b",
            "net25": "86:17:0b:d2:2e:22",
            "net26": "5a:3e:62:f0:d9:58",
            "net27": "e6:e2:1b:a4:88:d1",
            "net28": "86:69:ee:85:aa:41",
            "net29": "8e:dd:2a:56:4b:23",
            "net3": "7a:01:ae:fa:31:a2",
            "net30": "9a:96:ad:b8:34:c8",
            "net31": "52:bc:d8:e6:21:ef",
            "net4": "ba:fb:aa:88:80:1f",
            "net5": "aa:70:bd:0e:65:f8",
            "net6": "da:97:f6:d9:ed:88",
            "net7": "ce:65:36:2a:f9:08",
            "net8": "7e:b1:e5:91:ed:fb",
            "net9": "9a:d0:df:29:39:b3"
        },
        "spine_1_1_2": {
            "net0": "02:95:8c:88:85:1e",
            "net1": "c6:ea:91:c7:ba:5c",
            "net10": "aa:cc:23:21:72:3f",
            "net11": "ea:75:bc:ea:e0:cc",
            "net12": "46:43:a8:64:84:8d",
            "net13": "e2:0d:ae:bc:02:23",
            "net14": "4e:88:40:01:6e:e1",
            "net15": "c2:7e:43:bd:ec:42",
            "net16": "56:e3:39:f3:0d:1e",
            "net17": "e2:9b:93:19:34:21",
            "net18": "ee:4a:7b:b3:55:62",
            "net19": "62:c3:6d:20:42:c6",
            "net2": "8e:71:04:6f:68:1f",
            "net20": "ca:8e:01:1a:03:e6",
            "net21": "e2:20:39:5c:47:e9",
            "net22": "02:b3:a0:0c:fb:4f",
            "net23": "b2:91:e6:d9:56:09",
            "net24": "4e:03:42:9a:bd:f0",
            "net25": "5a:29:b8:71:d7:cf",
            "net26": "e6:11:ec:d7:60:39",
            "net27": "26:3c:7e:fa:a3:5c",
            "net28": "a6:08:68:14:2d:4d",
            "net29": "5a:f9:b2:81:fe:01",
            "net3": "b6:dc:26:52:fa:84",
            "net30": "82:22:54:5f:60:e8",
            "net31": "de:14:6d:c4:db:49",
            "net4": "0e:6b:09:64:c7:0c",
            "net5": "b6:62:c6:8a:c2:65",
            "net6": "be:e1:e0:ee:7c:b7",
            "net7": "f6:8e:01:a3:e8:93",
            "net8": "06:22:76:c0:5e:9d",
            "net9": "4a:26:e5:e0:9a:50"
        },
        "spine_1_1_3": {
            "net0": "62:db:ef:de:ba:53",
            "net1": "de:98:11:ab:d1:0b",
            "net10": "1a:9d:43:05:30:34",
            "net11": "0a:92:60:ee:ba:5f",
            "net12": "26:be:c5:f2:e8:5c",
            "net13": "46:79:23:1c:00:54",
            "net14": "2a:95:39:5d:f9:d3",
            "net15": "a6:90:ff:c7:75:1e",
            "net16": "9e:b6:fc:eb:55:34",
            "net17": "b6:1f:60:1e:5f:7b",
            "net18": "d6:96:6c:59:d8:0b",
            "net19": "02:b1:e4:4a:35:e7",
            "net2": "8a:02:2e:1e:20:94",
            "net20": "6a:fc:ad:84:ca:6d",
            "net21": "1e:26:42:9f:10:44",
            "net22": "e6:0d:b5:85:78:d2",
            "net23": "72:99:88:db:78:4d",
            "net24": "aa:97:82:cb:b0:ea",
            "net25": "02:11:1e:42:6c:8d",
            "net26": "0e:07:4a:31:d9:dd",
            "net27": "66:2d:29:df:8e:0a",
            "net28": "8a:7e:fb:2d:af:06",
            "net29": "8a:47:b2:44:00:b6",
            "net3": "fe:ae:28:bf:27:f2",
            "net30": "6e:9d:6e:88:01:8a",
            "net31": "5e:a7:0f:07:db:27",
            "net4": "26:e1:20:75:f7:40",
            "net5": "4a:fb:12:39:0e:36",
            "net6": "56:2a:92:aa:ba:e2",
            "net7": "8e:3a:5e:29:11:a3",
            "net8": "7a:97:37:7e:a0:ed",
            "net9": "8e:e8:56:c4:a2:61"
        },
        "spine_1_1_4": {
            "net0": "ca:36:4c:d5:1f:df",
            "net1": "e2:98:83:79:55:8e",
            "net10": "f6:26:c0:77:94:61",
            "net11": "a6:95:17:a0:68:29",
            "net12": "1a:4e:7e:35:13:65",
            "net13": "ba:b5:5e:5b:97:70",
            "net14": "a2:f8:57:04:14:fb",
            "net15": "92:28:80:be:e4:04",
            "net16": "96:b1:b0:6d:72:cd",
            "net17": "46:90:bd:13:d4:fd",
            "net18": "36:0d:9f:50:4b:a2",
            "net19": "32:c6:0c:d7:c2:b9",
            "net2": "9e:e6:cd:16:5d:98",
            "net20": "f2:bc:7e:90:e0:4a",
            "net21": "1a:a4:1a:b5:27:c7",
            "net22": "16:25:a0:da:b4:b0",
            "net23": "72:11:80:85:1e:b2",
            "net24": "ce:d3:a3:7a:05:fc",
            "net25": "7e:6c:45:40:00:4f",
            "net26": "0a:f3:0a:02:31:11",
            "net27": "ae:58:c0:5a:f1:ed",
            "net28": "2a:25:d6:13:b5:2d",
            "net29": "c2:09:02:19:24:02",
            "net3": "b2:b0:15:e3:d9:31",
            "net30": "26:c8:b9:f7:32:6e",
            "net31": "ee:1f:66:48:d2:66",
            "net4": "d6:0a:eb:f4:6b:08",
            "net5": "ca:6e:b4:56:85:b6",
            "net6": "5a:14:f9:ab:61:08",
            "net7": "6a:a8:15:4c:a1:a6",
            "net8": "c2:92:ce:4e:e5:41",
            "net9": "22:f0:2b:68:b1:d6"
        },
        "spine_1_1_5": {
            "net0": "c6:0a:20:74:7b:ac",
            "net1": "26:ff:9a:58:aa:c6",
            "net10": "e2:9c:be:9d:5c:65",
            "net11": "da:37:0f:3d:e4:b9",
            "net12": "92:0f:d6:ca:76:a5",
            "net13": "aa:e7:c7:c0:7a:34",
            "net14": "7e:87:c4:ad:9e:97",
            "net15": "d6:8b:80:d4:9d:27",
            "net16": "c6:99:cd:5f:c9:93",
            "net17": "5e:82:9a:2e:60:10",
            "net18": "de:c4:7b:9d:e8:15",
            "net19": "0e:e8:67:7c:aa:c5",
            "net2": "8e:24:fc:6e:2c:b3",
            "net20": "72:3a:49:d7:fa:f0",
            "net21": "c6:09:0f:df:3b:c9",
            "net22": "96:a9:af:49:3e:cb",
            "net23": "62:23:5e:69:9d:a0",
            "net24": "3a:93:8b:2c:40:36",
            "net25": "0e:8a:c5:0e:1b:f3",
            "net26": "fa:26:dd:2a:6f:70",
            "net27": "8a:6e:54:43:8a:a6",
            "net28": "5e:7d:f3:f3:76:c5",
            "net29": "d2:43:48:20:80:b8",
            "net3": "c2:a4:a7:9b:dd:67",
            "net30": "52:bc:ac:4d:f4:f6",
            "net31": "06:06:40:d3:3d:e9",
            "net4": "e2:54:68:8b:52:9c",
            "net5": "36:c4:3d:71:31:a0",
            "net6": "be:7c:af:c9:58:4f",
            "net7": "ce:23:34:0d:60:cd",
            "net8": "56:0d:c5:4f:ba:9a",
            "net9": "fe:ca:bf:33:1b:65"
        },
        "spine_1_1_6": {
            "net0": "be:e2:c8:af:06:6c",
            "net1": "3a:ec:1a:27:96:6b",
            "net10": "36:1b:22:20:83:46",
            "net11": "72:2e:c8:f4:1d:2a",
            "net12": "52:fe:30:1c:4a:36",
            "net13": "36:61:6a:70:d1:c6",
            "net14": "92:79:50:d5:c9:3a",
            "net15": "9a:44:3d:a4:7d:ef",
            "net16": "0e:1d:cf:87:84:c1",
            "net17": "66:68:70:ba:39:a4",
            "net18": "aa:fb:59:ac:44:a5",
            "net19": "6a:41:66:a7:f0:24",
            "net2": "8e:e1:56:cf:36:d8",
            "net20": "06:0e:79:28:66:ee",
            "net21": "3a:e5:70:01:92:0a",
            "net22": "7a:44:ab:52:36:d5",
            "net23": "c6:51:5f:92:23:e8",
            "net24": "ca:41:df:2c:d2:3d",
            "net25": "ca:6a:08:4b:24:48",
            "net26": "ee:b0:51:e5:bb:76",
            "net27": "66:43:51:47:b8:ab",
            "net28": "ca:5a:14:2c:11:b3",
            "net29": "46:fb:7c:8e:11:b6",
            "net3": "12:94:dc:05:b2:2e",
            "net30": "46:c9:2b:38:cd:83",
            "net31": "0e:aa:5b:28:18:c7",
            "net4": "fa:ff:55:d3:4b:5f",
            "net5": "92:a4:7f:76:13:55",
            "net6": "ea:a8:7e:c6:be:ab",
            "net7": "8e:ee:07:1c:ea:22",
            "net8": "66:bc:58:99:82:00",
            "net9": "ba:63:e8:21:59:41"
        },
        "spine_1_1_7": {
            "net0": "d6:e5:0d:f9:6f:a9",
            "net1": "26:c4:a0:5c:8a:70",
            "net10": "7a:34:63:84:f4:ee",
            "net11": "ba:54:bf:68:27:f7",
            "net12": "82:24:24:1f:f0:4f",
            "net13": "42:eb:d2:3f:6a:04",
            "net14": "e6:7a:1c:f7:30:50",
            "net15": "4a:61:4d:26:7a:64",
            "net16": "a2:b7:a5:f8:78:12",
            "net17": "92:95:aa:a7:b2:99",
            "net18": "b6:3f:ef:75:44:3b",
            "net19": "76:1b:29:55:ee:47",
            "net2": "de:7d:6f:02:5a:75",
            "net20": "92:49:99:77:5d:bf",
            "net21": "5a:0f:30:7f:fc:e4",
            "net22": "ea:e7:fb:6f:33:29",
            "net23": "02:f1:98:2d:eb:f3",
            "net24": "92:71:2e:5b:31:c2",
            "net25": "22:6f:84:23:81:05",
            "net26": "86:29:ee:a0:26:7c",
            "net27": "32:98:47:41:33:ef",
            "net28": "32:17:38:80:2c:24",
            "net29": "a2:58:12:95:7a:31",
            "net3": "22:b8:1c:3b:9f:25",
            "net30": "4a:09:08:32:f8:a2",
            "net31": "62:63:e8:0d:fe:29",
            "net4": "52:35:5b:0d:f0:4e",
            "net5": "c2:d5:a3:f8:a3:f6",
            "net6": "66:29:cd:16:21:83",
            "net7": "92:32:65:6f:52:de",
            "net8": "c2:f3:25:31:72:25",
            "net9": "e2:b2:04:cf:8b:ef"
        },
        "spine_1_1_8": {
            "net0": "9e:33:18:3e:e5:ab",
            "net1": "aa:a4:4c:2b:76:42",
            "net10": "42:00:eb:1f:a1:77",
            "net11": "6e:d5:e2:6b:7a:ac",
            "net12": "4e:5a:42:6d:17:bb",
            "net13": "b2:f3:a6:12:c1:6b",
            "net14": "3e:a3:e8:92:6e:1f",
            "net15": "a2:89:fc:ca:73:83",
            "net16": "12:07:d5:e7:98:13",
            "net17": "8a:42:6f:49:a3:94",
            "net18": "5e:56:47:46:1d:d5",
            "net19": "9e:50:99:4b:51:95",
            "net2": "4a:be:71:c2:f0:0b",
            "net20": "da:ba:40:02:16:8c",
            "net21": "1e:70:56:82:dd:0a",
            "net22": "b2:8f:13:d7:f8:54",
            "net23": "26:04:83:5d:78:c4",
            "net24": "8a:39:38:21:85:7e",
            "net25": "ae:d1:68:bd:91:1a",
            "net26": "ba:c6:46:96:b1:62",
            "net27": "ca:56:24:8d:a7:59",
            "net28": "ce:f9:7c:36:62:15",
            "net29": "be:89:ac:63:31:c0",
            "net3": "b2:a7:22:2d:d9:6c",
            "net30": "3a:59:f7:51:7d:ca",
            "net31": "a6:c6:38:58:18:0e",
            "net4": "ca:1a:87:ef:aa:66",
            "net5": "9a:12:a8:c7:8a:e9",
            "net6": "be:cd:78:d3:6f:40",
            "net7": "76:8c:b8:22:d5:4d",
            "net8": "0e:ee:1a:83:58:27",
            "net9": "4e:c2:54:67:fd:9d"
        },
        "spine_1_1_9": {
            "net0": "e6:d8:01:31:6c:59",
            "net1": "5a:a4:1b:0e:41:f0",
            "net10": "be:b7:2d:85:f4:2e",
            "net11": "ea:73:0e:05:c1:b0",
            "net12": "f2:52:86:2a:fc:86",
            "net13": "e2:08:43:3f:e4:61",
            "net14": "22:10:13:87:c5:e1",
            "net15": "b2:a5:36:aa:ba:bb",
            "net16": "5e:e5:52:75:ba:66",
            "net17": "42:e6:49:d6:2b:e6",
            "net18": "c2:42:33:f0:cc:79",
            "net19": "9a:7d:58:70:11:e3",
            "net2": "ee:76:11:b1:f7:e9",
            "net20": "46:f7:2b:39:38:79",
            "net21": "0a:24:68:e2:bb:4a",
            "net22": "7e:61:bc:9c:81:3c",
            "net23": "92:92:a3:e2:c6:48",
            "net24": "5a:d1:46:84:b8:97",
            "net25": "fa:e8:e6:c3:9b:cf",
            "net26": "42:b1:26:a9:a9:ad",
            "net27": "16:c2:48:0c:ea:b6",
            "net28": "96:e3:8c:94:d4:e5",
            "net29": "92:5b:4b:78:a4:a5",
            "net3": "3e:6b:15:a4:39:a6",
            "net30": "66:0d:40:e1:1c:f9",
            "net31": "aa:16:50:bd:06:bf",
            "net4": "0a:7d:f6:4c:df:50",
            "net5": "6a:ef:87:7e:85:58",
            "net6": "2e:76:9f:9a:ae:18",
            "net7": "d6:f9:8e:f5:2f:13",
            "net8": "ee:0a:af:82:ee:cd",
            "net9": "86:49:2b:92:55:49"
        },
        "spine_2_1_1": {
            "net0": "7a:e7:bb:f4:04:df",
            "net1": "82:d0:fa:fe:94:0b",
            "net10": "22:6e:bb:c8:e3:8c",
            "net11": "de:5c:de:52:59:0e",
            "net12": "da:9c:a6:d7:c1:a5",
            "net13": "9e:15:d3:47:3d:28",
            "net14": "ce:3a:f2:71:10:80",
            "net15": "c6:99:9d:f8:c6:1a",
            "net16": "96:62:56:40:6b:47",
            "net17": "6e:38:28:68:2a:6f",
            "net18": "6e:6c:0a:b0:bc:57",
            "net19": "76:b4:09:da:3b:e9",
            "net2": "f2:c4:6c:da:82:d9",
            "net20": "2e:47:7d:c5:90:88",
            "net21": "ce:1d:7b:58:a7:34",
            "net22": "02:e1:e8:7f:41:b1",
            "net23": "32:0b:6a:8b:bb:3e",
            "net24": "92:23:15:53:4b:56",
            "net25": "ba:ca:45:6a:1f:7c",
            "net26": "22:bb:f6:e4:f9:06",
            "net27": "ee:ec:30:61:9b:ac",
            "net28": "ae:3e:ee:48:d8:ee",
            "net29": "ba:81:6f:fb:65:be",
            "net3": "5e:6a:4f:b1:44:d5",
            "net30": "42:86:06:46:0e:a7",
            "net31": "66:dc:26:dd:66:85",
            "net4": "32:ce:f5:76:12:92",
            "net5": "02:53:8c:45:60:56",
            "net6": "e2:7b:60:f9:84:34",
            "net7": "52:b5:b4:4a:46:b1",
            "net8": "ba:03:80:d3:d4:63",
            "net9": "ce:15:b2:50:f1:f0"
        },
        "spine_2_1_10": {
            "net0": "7e:2b:8c:a0:1b:8b",
            "net1": "ce:74:0d:4a:81:ce",
            "net10": "ca:69:c9:09:8c:7b",
            "net11": "52:b7:ae:73:4f:80",
            "net12": "c2:37:a2:db:37:c4",
            "net13": "d2:bc:75:dd:b0:a0",
            "net14": "86:05:96:f7:f8:bb",
            "net15": "fa:86:4e:f7:b7:ad",
            "net16": "92:a4:0b:c5:95:e5",
            "net17": "de:80:f5:f9:11:c5",
            "net18": "6a:04:84:73:11:4d",
            "net19": "fe:e5:43:23:b8:89",
            "net2": "b6:ba:d3:33:2e:8d",
            "net20": "52:8e:40:9d:e3:72",
            "net21": "96:00:f2:05:5a:6f",
            "net22": "d2:fc:9d:d2:6a:9e",
            "net23": "56:81:62:bd:65:24",
            "net24": "aa:c8:fe:8d:30:a6",
            "net25": "06:6f:09:f1:f5:54",
            "net26": "1a:94:88:74:f5:6a",
            "net27": "16:1a:62:1e:09:f3",
            "net28": "c2:bb:de:c9:07:c5",
            "net29": "ca:aa:bb:7b:bc:cd",
            "net3": "9e:2e:46:20:4e:f1",
            "net30": "46:73:83:b9:85:a7",
            "net31": "f6:3f:ad:1b:c3:97",
            "net4": "a2:8b:e4:d4:49:31",
            "net5": "2e:03:18:09:d9:70",
            "net6": "26:5e:31:40:7d:7d",
            "net7": "26:90:ef:33:08:d8",
            "net8": "e6:cd:36:07:30:39",
            "net9": "12:5a:c4:6c:5c:7f"
        },
        "spine_2_1_11": {
            "net0": "26:f8:d9:9d:c0:25",
            "net1": "86:3e:a3:50:e6:31",
            "net10": "0a:a3:98:9a:88:19",
            "net11": "c2:ec:a1:59:15:75",
            "net12": "ae:00:b1:99:54:1e",
            "net13": "72:ef:ba:b6:dc:71",
            "net14": "5e:31:69:6d:34:20",
            "net15": "86:ce:04:70:d5:35",
            "net16": "e2:0a:b5:9a:96:66",
            "net17": "42:1e:b4:f9:fb:96",
            "net18": "56:e1:2b:8f:4f:62",
            "net19": "1a:a8:be:db:3b:a1",
            "net2": "d6:c5:86:23:3d:d8",
            "net20": "92:73:a2:28:7c:39",
            "net21": "a6:57:68:54:b8:15",
            "net22": "f6:e9:dd:c8:7c:8d",
            "net23": "f6:e3:d4:3e:06:80",
            "net24": "f2:af:c7:e9:1d:9a",
            "net25": "ea:f7:9e:43:fb:27",
            "net26": "fe:9a:44:82:13:8f",
            "net27": "e6:b2:47:c8:d5:34",
            "net28": "d2:50:43:c1:c3:34",
            "net29": "06:30:c0:8e:32:56",
            "net3": "46:b5:f3:5c:75:cc",
            "net30": "36:5d:59:cf:ba:25",
            "net31": "ba:01:6a:f3:89:34",
            "net4": "be:df:f9:8b:63:7f",
            "net5": "6a:7b:9f:c8:0d:a7",
            "net6": "66:e9:72:43:ef:59",
            "net7": "2e:07:74:92:0d:31",
            "net8": "76:93:7b:4b:80:8d",
            "net9": "92:40:8d:90:cb:96"
        },
        "spine_2_1_12": {
            "net0": "32:6d:28:b9:7b:34",
            "net1": "1a:de:82:66:40:d3",
            "net10": "a6:02:f0:d9:cc:6f",
            "net11": "fa:8a:cd:27:0c:bb",
            "net12": "0e:16:ad:e8:c4:be",
            "net13": "ba:5b:b1:a3:a0:2e",
            "net14": "4e:17:eb:de:18:55",
            "net15": "82:46:f8:24:66:a4",
            "net16": "aa:fb:2a:8d:dc:79",
            "net17": "92:8b:68:67:64:8f",
            "net18": "26:f3:65:47:f7:42",
            "net19": "2e:e2:c7:c8:68:1d",
            "net2": "ae:f5:a0:a9:f0:33",
            "net20": "8e:b3:f0:9c:40:db",
            "net21": "ce:3e:c3:77:cf:2e",
            "net22": "36:30:83:a8:50:66",
            "net23": "c6:05:7c:d2:d2:ba",
            "net24": "ee:b5:ea:b7:96:c0",
            "net25": "de:47:df:00:d7:05",
            "net26": "ba:df:db:84:01:5f",
            "net27": "ee:89:d0:be:41:3a",
            "net28": "22:88:3c:bd:8a:d7",
            "net29": "12:f4:9e:4b:05:5d",
            "net3": "f6:ba:93:ac:c8:78",
            "net30": "ce:e9:be:bd:1c:c3",
            "net31": "9e:e5:5d:bf:6c:49",
            "net4": "5a:b6:f3:39:6e:d4",
            "net5": "96:a4:b0:44:20:5f",
            "net6": "9e:79:91:10:a7:05",
            "net7": "c6:26:53:0a:5d:f7",
            "net8": "4a:cc:ec:fb:c8:41",
            "net9": "72:c5:8f:4b:fe:90"
        },
        "spine_2_1_13": {
            "net0": "c2:f3:b3:3c:7e:6a",
            "net1": "e2:d8:cb:22:68:e8",
            "net10": "6e:d5:cd:5f:a8:f1",
            "net11": "fe:4f:4a:15:d4:5c",
            "net12": "f6:47:22:c9:3b:ea",
            "net13": "1e:12:63:28:3f:39",
            "net14": "62:26:0e:cc:df:f6",
            "net15": "36:43:0f:df:85:cc",
            "net16": "b2:37:2c:a1:da:72",
            "net17": "96:6e:0a:07:f2:94",
            "net18": "0e:3a:f6:4c:00:5a",
            "net19": "d6:c5:9e:06:c0:3f",
            "net2": "c6:96:9b:93:14:9a",
            "net20": "fa:c7:1f:7a:a0:bc",
            "net21": "3a:b6:01:fb:e7:4e",
            "net22": "2e:df:ed:c2:0a:bf",
            "net23": "56:69:f7:d2:e9:72",
            "net24": "8e:7a:f4:48:3a:07",
            "net25": "02:f0:c9:07:94:74",
            "net26": "ea:7e:0a:61:8f:a7",
            "net27": "76:34:ae:8a:57:f6",
            "net28": "92:a9:44:7f:ff:80",
            "net29": "ea:13:dd:cd:40:9d",
            "net3": "22:39:38:0c:45:da",
            "net30": "02:2e:b8:2f:f1:0a",
            "net31": "8a:25:52:7e:8c:1b",
            "net4": "a2:ca:2a:f5:6a:5e",
            "net5": "7a:d6:5b:17:fb:25",
            "net6": "96:2e:62:4e:87:55",
            "net7": "16:b9:97:10:dc:62",
            "net8": "52:89:07:64:07:d6",
            "net9": "ca:d6:40:8f:e7:a8"
        },
        "spine_2_1_14": {
            "net0": "7e:9f:1e:78:a7:0e",
            "net1": "c2:11:4a:95:c2:33",
            "net10": "de:e6:ad:a4:b3:c6",
            "net11": "2a:73:48:70:e5:6e",
            "net12": "36:7d:60:dd:65:0a",
            "net13": "36:a1:58:3f:ae:4c",
            "net14": "2e:09:17:93:d3:96",
            "net15": "16:e6:1d:55:16:22",
            "net16": "06:a3:bf:63:92:79",
            "net17": "16:90:ee:b6:74:60",
            "net18": "8e:76:ff:f6:73:84",
            "net19": "06:28:ad:19:ca:53",
            "net2": "1a:03:85:a8:a4:96",
            "net20": "4e:f5:84:74:f5:28",
            "net21": "c6:91:26:c4:15:16",
            "net22": "c2:c6:64:3c:e2:55",
            "net23": "86:2d:d3:6a:79:77",
            "net24": "9e:31:22:32:da:f5",
            "net25": "96:ba:aa:81:bc:a9",
            "net26": "f2:8c:98:48:58:e6",
            "net27": "fa:a1:90:56:86:2e",
            "net28": "ce:9f:45:48:4e:9f",
            "net29": "1e:b5:09:cb:62:32",
            "net3": "b6:ed:7c:9a:e2:bf",
            "net30": "9e:11:87:e3:ef:70",
            "net31": "8a:00:ea:6d:ff:1f",
            "net4": "e2:f1:d6:7d:2b:d6",
            "net5": "02:9b:b4:51:5e:ae",
            "net6": "3e:a0:d2:7e:dd:a3",
            "net7": "22:2b:82:e4:5d:ab",
            "net8": "32:b1:cf:52:3e:18",
            "net9": "aa:ce:ff:a5:6a:c5"
        },
        "spine_2_1_15": {
            "net0": "82:c0:71:9d:dd:b2",
            "net1": "5a:a4:8b:2c:be:02",
            "net10": "f6:0d:60:45:c1:a9",
            "net11": "12:73:6a:48:bb:ed",
            "net12": "f6:55:ae:0a:9f:f4",
            "net13": "7e:33:ba:0d:ee:12",
            "net14": "0e:17:6e:2d:58:8e",
            "net15": "de:05:88:e1:9b:f4",
            "net16": "de:65:f9:ef:06:ed",
            "net17": "9e:22:6a:1f:d0:8e",
            "net18": "a2:a4:70:01:fb:01",
            "net19": "e6:a1:4c:bd:e9:ef",
            "net2": "de:47:3f:17:ce:a2",
            "net20": "f2:a9:4b:6a:35:dc",
            "net21": "c6:d4:28:47:eb:4c",
            "net22": "26:be:c4:a7:1f:62",
            "net23": "8a:15:20:4a:33:1c",
            "net24": "aa:03:da:95:e4:95",
            "net25": "36:b5:65:e5:c6:3d",
            "net26": "56:ff:cf:95:96:cc",
            "net27": "9e:b1:d3:20:7b:02",
            "net28": "a2:55:41:43:8c:46",
            "net29": "2e:d1:c1:20:82:10",
            "net3": "06:10:12:6e:6c:c4",
            "net30": "ba:b8:27:c9:35:8b",
            "net31": "7a:6d:bc:11:11:bf",
            "net4": "76:8a:37:85:26:50",
            "net5": "72:86:89:19:0f:77",
            "net6": "b6:6a:3b:5f:e4:2f",
            "net7": "ea:11:32:70:f2:24",
            "net8": "92:7b:79:cf:49:1d",
            "net9": "ca:0b:fb:64:57:c1"
        },
        "spine_2_1_16": {
            "net0": "2a:a3:41:b7:10:7e",
            "net1": "26:8d:2e:e6:1d:52",
            "net10": "3a:dd:77:a4:5f:4c",
            "net11": "52:53:e7:94:c1:cd",
            "net12": "26:72:06:87:49:ce",
            "net13": "36:e6:49:f1:8d:4d",
            "net14": "22:eb:91:eb:93:c0",
            "net15": "46:00:43:60:ce:d4",
            "net16": "d2:69:99:8d:27:29",
            "net17": "16:0c:be:29:97:d4",
            "net18": "a2:50:e3:5e:fb:92",
            "net19": "e6:77:fc:49:d3:2e",
            "net2": "ce:12:bb:29:63:63",
            "net20": "0a:13:05:a4:7a:70",
            "net21": "4e:f1:4a:09:01:d5",
            "net22": "82:c6:b6:c9:b3:04",
            "net23": "ce:2a:cf:3e:e6:67",
            "net24": "46:11:2d:52:80:15",
            "net25": "ca:4a:cf:3d:be:c1",
            "net26": "2a:6b:d2:64:00:b0",
            "net27": "32:b2:f4:1e:b0:de",
            "net28": "5e:06:da:fc:a6:a7",
            "net29": "e2:92:de:26:f5:be",
            "net3": "42:4b:39:ac:59:17",
            "net30": "22:f9:96:11:f4:4b",
            "net31": "be:40:8c:ed:01:d6",
            "net4": "06:ce:bf:a1:ab:89",
            "net5": "26:5c:bb:33:71:87",
            "net6": "ce:66:9b:1a:89:c4",
            "net7": "96:a6:9d:eb:62:e4",
            "net8": "82:20:9c:f9:9a:ac",
            "net9": "02:98:1b:8a:df:97"
        },
        "spine_2_1_2": {
            "net0": "4a:2d:e9:44:16:87",
            "net1": "5a:18:85:d2:f8:99",
            "net10": "3a:5b:28:b5:4d:ee",
            "net11": "06:05:19:fa:c8:f3",
            "net12": "96:41:4c:80:ae:9e",
            "net13": "02:29:ff:4b:10:5e",
            "net14": "e2:dc:c3:62:84:2a",
            "net15": "be:18:e7:78:c2:d1",
            "net16": "32:ec:1b:1f:30:66",
            "net17": "8a:ec:63:a7:2a:bb",
            "net18": "96:42:08:2f:70:ee",
            "net19": "ca:5b:39:18:c1:44",
            "net2": "26:07:af:ea:df:2d",
            "net20": "de:7d:48:6e:e3:c1",
            "net21": "ee:96:d0:b3:8a:83",
            "net22": "fa:20:e5:41:f1:1e",
            "net23": "6e:d6:5d:44:87:4d",
            "net24": "9a:6a:b9:02:65:98",
            "net25": "36:f5:54:c2:aa:6f",
            "net26": "aa:dc:94:f3:e2:16",
            "net27": "f6:c2:7a:5a:1e:43",
            "net28": "7a:59:d3:ee:e4:e7",
            "net29": "f2:ae:92:3c:fb:e3",
            "net3": "be:b6:7c:e6:01:7c",
            "net30": "be:24:a6:85:2c:c4",
            "net31": "7e:4d:72:12:13:4a",
            "net4": "2a:e9:dc:63:3d:cf",
            "net5": "36:47:d7:9a:79:21",
            "net6": "6a:fe:8e:c6:f2:a1",
            "net7": "ba:f1:a7:c2:08:08",
            "net8": "b6:10:7b:d9:c4:f0",
            "net9": "9e:81:e8:32:09:2d"
        },
        "spine_2_1_3": {
            "net0": "2e:64:d9:be:33:56",
            "net1": "22:96:77:8b:91:80",
            "net10": "7e:72:9b:ae:b4:be",
            "net11": "4e:de:86:ae:ec:47",
            "net12": "36:64:39:75:28:a0",
            "net13": "46:fa:c2:bd:71:f5",
            "net14": "ba:7e:9c:2b:48:b8",
            "net15": "f2:b4:70:47:6d:8d",
            "net16": "e6:b6:cd:6c:97:fe",
            "net17": "fa:63:31:1b:9a:09",
            "net18": "ee:2e:7a:cf:5b:0b",
            "net19": "fa:41:94:48:22:2a",
            "net2": "76:cc:54:dd:4d:96",
            "net20": "92:76:ef:cf:5d:72",
            "net21": "6e:59:af:09:5a:53",
            "net22": "06:f2:ee:a9:50:b3",
            "net23": "a2:34:92:47:e1:94",
            "net24": "fe:22:c5:b9:99:7b",
            "net25": "5e:ab:5d:fc:d2:90",
            "net26": "96:4d:30:d0:3b:66",
            "net27": "e6:26:07:a5:72:18",
            "net28": "92:0d:5e:c8:75:2b",
            "net29": "a6:09:93:d4:03:3a",
            "net3": "6a:b5:c8:50:38:0e",
            "net30": "fa:63:45:f1:20:52",
            "net31": "5e:b9:10:14:c4:1b",
            "net4": "7e:b9:b7:41:a4:7d",
            "net5": "46:a6:49:55:83:c2",
            "net6": "be:e2:77:7a:96:0a",
            "net7": "f2:32:23:24:a4:2e",
            "net8": "76:ad:98:4c:de:d6",
            "net9": "f2:28:a7:5c:4f:fc"
        },
        "spine_2_1_4": {
            "net0": "12:13:1b:ce:93:80",
            "net1": "56:34:f8:5d:25:f6",
            "net10": "c6:d7:12:8c:7c:44",
            "net11": "32:b7:66:8e:10:e5",
            "net12": "c2:db:e9:3d:77:64",
            "net13": "ae:9f:07:3e:c4:ce",
            "net14": "f2:64:2b:b9:38:a8",
            "net15": "b2:f2:5d:20:6a:ee",
            "net16": "c6:6f:2a:b7:95:33",
            "net17": "22:7f:46:81:ba:57",
            "net18": "be:4d:6c:b6:2e:bc",
            "net19": "9a:64:a3:b2:6e:ff",
            "net2": "3e:00:d9:bd:5d:05",
            "net20": "a6:b3:f3:9d:16:dc",
            "net21": "9a:27:1f:aa:ac:f1",
            "net22": "26:85:7a:c5:80:48",
            "net23": "ce:93:53:43:e2:1b",
            "net24": "02:3f:ef:24:8d:67",
            "net25": "ee:74:f6:04:08:4f",
            "net26": "22:5a:9d:01:73:db",
            "net27": "56:cc:d6:40:07:f2",
            "net28": "0a:7a:9d:19:78:a6",
            "net29": "c2:2c:81:e8:bc:73",
            "net3": "b2:64:2c:70:e9:22",
            "net30": "e6:19:f2:2f:db:7b",
            "net31": "46:fe:f9:11:92:7f",
            "net4": "56:e1:cf:b2:98:d4",
            "net5": "c2:c5:a1:0e:10:78",
            "net6": "da:74:dc:76:09:83",
            "net7": "a2:1a:38:23:6c:89",
            "net8": "3e:90:d1:42:57:81",
            "net9": "c6:2f:ce:d7:d6:c8"
        },
        "spine_2_1_5": {
            "net0": "0a:63:3a:9c:a8:36",
            "net1": "b6:8c:7b:97:5c:0d",
            "net10": "f6:b2:03:b8:2b:82",
            "net11": "a2:1f:33:40:25:24",
            "net12": "8a:34:4a:0f:6e:72",
            "net13": "96:09:f6:7a:da:f2",
            "net14": "12:ec:85:12:b6:b5",
            "net15": "aa:d0:67:fb:f4:ba",
            "net16": "ea:70:31:86:8d:99",
            "net17": "be:35:1b:dd:47:8e",
            "net18": "c6:c0:55:41:0d:a1",
            "net19": "ee:75:23:ef:ed:f3",
            "net2": "5e:74:46:6e:ea:d1",
            "net20": "3e:78:3e:41:fd:ae",
            "net21": "36:10:c1:03:b1:5d",
            "net22": "c2:d1:1c:d2:65:cc",
            "net23": "a2:7c:74:ac:f5:a1",
            "net24": "52:f6:1f:a7:8a:16",
            "net25": "ba:fe:5b:4b:53:35",
            "net26": "a2:b7:e0:d5:c5:50",
            "net27": "e6:58:4f:d3:4c:a6",
            "net28": "22:05:4d:a9:32:26",
            "net29": "02:91:51:3d:52:3a",
            "net3": "0e:ad:14:bf:bc:01",
            "net30": "6a:3c:97:6b:b0:7b",
            "net31": "82:c4:d2:94:b8:14",
            "net4": "ce:9e:bb:98:79:ac",
            "net5": "da:7d:36:9c:ab:ad",
            "net6": "32:5c:a0:6c:7b:81",
            "net7": "0e:46:81:55:ea:42",
            "net8": "62:9a:8f:bc:01:85",
            "net9": "2a:59:4c:1c:02:52"
        },
        "spine_2_1_6": {
            "net0": "ae:98:da:d7:43:d7",
            "net1": "f2:b7:5c:2a:17:a2",
            "net10": "4e:39:45:61:71:38",
            "net11": "6e:a4:10:0a:ba:a0",
            "net12": "46:4f:dd:33:74:b6",
            "net13": "0e:2c:86:29:1a:40",
            "net14": "ce:21:f4:6f:51:66",
            "net15": "7e:2a:a3:49:02:d2",
            "net16": "32:be:31:97:53:bf",
            "net17": "b6:26:c1:8f:d8:ef",
            "net18": "ae:06:cf:0b:09:d8",
            "net19": "36:f2:46:92:6a:83",
            "net2": "da:0f:00:07:46:31",
            "net20": "96:7c:f6:06:0d:f3",
            "net21": "ba:b4:9c:d7:31:84",
            "net22": "26:9f:ee:28:7f:08",
            "net23": "e2:1f:f8:e6:6f:d1",
            "net24": "d6:6e:c1:0f:b9:83",
            "net25": "1a:88:8e:7e:43:50",
            "net26": "f2:8a:25:af:77:52",
            "net27": "52:9d:79:a3:1e:92",
            "net28": "3e:b0:63:c2:93:1f",
            "net29": "d6:e6:0e:75:c4:9f",
            "net3": "1e:b6:42:0d:7b:fc",
            "net30": "66:99:51:c8:95:3b",
            "net31": "3a:3f:d1:72:01:02",
            "net4": "c6:36:2f:f5:54:a5",
            "net5": "1a:a3:84:13:2c:df",
            "net6": "2a:c8:a3:04:e3:44",
            "net7": "16:f9:e6:24:4e:36",
            "net8": "9e:10:68:2a:e2:19",
            "net9": "1a:95:f2:52:09:a5"
        },
        "spine_2_1_7": {
            "net0": "2e:29:37:42:ac:78",
            "net1": "16:e1:c2:96:de:e2",
            "net10": "2a:36:7e:82:3c:a7",
            "net11": "16:d1:09:48:1e:c4",
            "net12": "16:8b:8c:94:42:f8",
            "net13": "e2:42:34:57:e2:d2",
            "net14": "4a:d0:f7:a0:65:1c",
            "net15": "de:a3:22:1a:8d:4a",
            "net16": "3e:13:16:06:c5:cc",
            "net17": "fe:f6:0b:25:1c:d1",
            "net18": "0a:77:31:04:ba:38",
            "net19": "82:ca:0a:8b:a1:eb",
            "net2": "22:77:6d:1a:8b:f3",
            "net20": "ba:93:b7:40:a2:2e",
            "net21": "4a:cf:4d:27:83:ca",
            "net22": "42:e8:5a:bb:b9:6b",
            "net23": "42:1a:d3:f1:e8:ed",
            "net24": "ee:70:f4:3c:a7:4a",
            "net25": "6a:b6:03:cf:9e:b1",
            "net26": "72:c7:2c:b0:c8:fd",
            "net27": "a6:c2:97:4a:45:63",
            "net28": "7a:60:c3:4d:ea:74",
            "net29": "de:aa:23:7e:92:5f",
            "net3": "92:46:39:0f:4e:58",
            "net30": "e2:f5:9b:1c:c0:69",
            "net31": "22:9f:c3:74:bf:18",
            "net4": "ca:69:8c:6d:a2:7a",
            "net5": "76:d1:db:d9:69:29",
            "net6": "ce:ee:47:f3:76:de",
            "net7": "2a:a3:5c:f2:81:3c",
            "net8": "92:8c:c8:34:6e:bf",
            "net9": "6e:e8:b9:6e:9c:f0"
        },
        "spine_2_1_8": {
            "net0": "5e:58:6f:02:4f:3f",
            "net1": "46:61:e8:58:f2:bd",
            "net10": "da:e6:1b:6f:b7:71",
            "net11": "8a:5f:ec:f3:50:2d",
            "net12": "2e:59:4f:39:96:87",
            "net13": "6e:09:2c:38:81:d1",
            "net14": "76:27:4b:7a:b1:f7",
            "net15": "32:f8:00:2c:5a:fd",
            "net16": "16:49:c2:8c:cf:f0",
            "net17": "5a:18:24:dc:12:8e",
            "net18": "de:2f:e7:f0:d8:a2",
            "net19": "56:40:23:9b:cd:b6",
            "net2": "b6:a7:d0:b9:80:ba",
            "net20": "d6:d4:b1:d6:8d:46",
            "net21": "76:8d:64:69:5a:fd",
            "net22": "4e:4e:bf:9b:76:bb",
            "net23": "02:75:15:75:dc:5f",
            "net24": "96:12:40:ab:1f:36",
            "net25": "26:48:59:18:f7:b8",
            "net26": "1a:e2:b2:ff:f7:f8",
            "net27": "02:b7:79:ef:8a:16",
            "net28": "ae:e6:02:ee:a4:8f",
            "net29": "1e:9c:3f:1a:02:aa",
            "net3": "7a:28:7b:96:cf:b2",
            "net30": "aa:b1:fd:59:3a:6b",
            "net31": "42:0a:2f:6b:99:55",
            "net4": "c6:70:aa:19:c0:3a",
            "net5": "9a:ce:14:dc:fd:f0",
            "net6": "7e:a0:e0:31:a5:b1",
            "net7": "e6:a3:0e:3d:13:aa",
            "net8": "26:0e:e4:de:7a:33",
            "net9": "7a:54:1a:9f:47:85"
        },
        "spine_2_1_9": {
            "net0": "0e:2f:82:c4:fd:2a",
            "net1": "66:9b:38:98:4e:a1",
            "net10": "e6:97:46:7f:20:48",
            "net11": "46:e3:93:b9:77:06",
            "net12": "e2:f0:be:14:87:dd",
            "net13": "52:cf:ac:9c:38:dc",
            "net14": "5e:68:6b:bb:67:28",
            "net15": "3e:ae:d2:a9:b5:17",
            "net16": "ca:7c:b0:46:af:a8",
            "net17": "2e:d0:d0:92:57:17",
            "net18": "16:0d:76:50:4b:62",
            "net19": "a2:eb:9b:45:7b:d3",
            "net2": "f6:6e:ba:0f:35:93",
            "net20": "9e:94:e3:3c:32:49",
            "net21": "de:c5:9c:2e:0e:4a",
            "net22": "22:11:ee:b5:c1:bf",
            "net23": "ee:e9:15:b9:a0:6b",
            "net24": "fa:1c:bc:29:46:2f",
            "net25": "16:8b:da:54:a0:3f",
            "net26": "f2:00:f4:ca:75:20",
            "net27": "ae:a0:dd:c5:03:b1",
            "net28": "ea:8c:75:dd:67:b2",
            "net29": "7a:45:69:af:20:0b",
            "net3": "9a:94:9f:e6:d2:c0",
            "net30": "52:70:5c:2b:ed:50",
            "net31": "aa:2d:f5:14:ca:4c",
            "net4": "ba:e5:b4:09:be:c0",
            "net5": "f2:eb:48:9a:5b:f3",
            "net6": "be:0c:d1:4d:44:35",
            "net7": "fa:af:be:54:a6:c9",
            "net8": "be:78:a9:e8:e2:53",
            "net9": "3a:2b:fd:47:cf:af"
        },
        "tof_1_2_1": {
            "net0": "72:c8:09:56:bf:60",
            "net1": "46:15:45:f7:67:89",
            "net10": "5e:7d:fa:ca:be:15",
            "net11": "ea:66:44:3b:9f:75",
            "net12": "c2:48:86:ee:62:9c",
            "net13": "3a:60:f3:0b:4d:93",
            "net14": "36:3b:7d:87:6a:fc",
            "net15": "f2:85:b5:55:3f:c2",
            "net16": "12:b2:dc:2d:72:cf",
            "net17": "02:d8:41:74:0a:4e",
            "net18": "b2:a9:41:52:a8:bf",
            "net19": "42:98:27:3a:74:a5",
            "net2": "92:86:56:cc:0d:45",
            "net20": "3a:86:48:14:47:ab",
            "net21": "32:03:ee:b5:3e:55",
            "net22": "fa:da:59:16:b9:1b",
            "net23": "6a:d7:38:8f:cf:fd",
            "net24": "4a:cc:86:87:cd:3d",
            "net25": "06:7a:fa:f6:1b:dc",
            "net26": "de:06:59:0d:9a:a7",
            "net27": "06:9e:17:a5:82:61",
            "net28": "ca:37:2c:5a:41:78",
            "net29": "5e:39:67:29:ab:55",
            "net3": "1a:22:44:44:04:aa",
            "net30": "ea:ad:d0:61:0d:c3",
            "net31": "ba:40:28:09:1f:94",
            "net4": "92:17:73:69:78:a7",
            "net5": "c2:00:8c:f7:48:61",
            "net6": "fe:63:6b:30:a7:ed",
            "net7": "a2:85:6c:2f:76:1f",
            "net8": "56:bd:0d:46:6c:0c",
            "net9": "1a:ad:8b:37:5a:4d"
        },
        "tof_1_2_10": {
            "net0": "8a:93:a8:e8:c1:2b",
            "net1": "2a:a8:e2:1a:65:f4",
            "net10": "ae:ea:ba:df:18:aa",
            "net11": "12:6f:d9:97:69:9c",
            "net12": "f2:ee:92:79:0b:75",
            "net13": "d6:4f:60:08:46:76",
            "net14": "ee:24:bf:50:88:fb",
            "net15": "da:f3:d3:26:d7:88",
            "net16": "a6:59:ff:40:66:b3",
            "net17": "2a:12:f0:ea:fc:65",
            "net18": "ea:4c:9b:ae:f2:2f",
            "net19": "4a:07:45:b0:ea:af",
            "net2": "fe:8b:d2:33:65:d8",
            "net20": "7a:73:2a:8d:02:2b",
            "net21": "3e:13:c8:91:e3:a1",
            "net22": "e2:31:9c:f0:4e:03",
            "net23": "ca:2d:8c:e0:1e:2d",
            "net24": "4a:7e:e5:d5:98:eb",
            "net25": "2a:8e:75:1f:a4:9b",
            "net26": "66:39:92:73:a7:d5",
            "net27": "b2:d5:f7:9f:be:f7",
            "net28": "3e:27:be:8d:86:18",
            "net29": "1a:13:cd:1d:c0:30",
            "net3": "62:1d:fd:aa:bb:25",
            "net30": "c6:75:56:0d:ad:79",
            "net31": "5e:be:45:05:d4:57",
            "net4": "3e:b5:21:3d:45:b7",
            "net5": "e2:10:bf:fd:1b:76",
            "net6": "72:b8:0e:0b:7c:8c",
            "net7": "6a:6b:78:1a:dd:34",
            "net8": "c6:33:46:74:13:ce",
            "net9": "fa:fe:7e:30:c7:f2"
        },
        "tof_1_2_11": {
            "net0": "be:a8:23:31:6f:c7",
            "net1": "32:4c:66:f5:5b:1c",
            "net10": "b2:8d:29:98:85:2f",
            "net11": "92:f9:ca:ad:89:3e",
            "net12": "52:35:0f:72:f8:54",
            "net13": "46:29:c0:57:a6:2b",
            "net14": "be:a3:02:a9:26:8c",
            "net15": "76:81:0a:2a:0f:61",
            "net16": "0a:04:d8:5c:96:08",
            "net17": "8e:64:f8:89:d8:e0",
            "net18": "2a:d4:9b:47:8c:bb",
            "net19": "3e:a9:08:c6:56:65",
            "net2": "92:af:5b:c2:1e:26",
            "net20": "4e:73:1f:6a:93:38",
            "net21": "fa:5f:79:c5:a7:0e",
            "net22": "72:52:d8:5b:7f:37",
            "net23": "92:ed:e5:e7:02:58",
            "net24": "1a:50:c3:a7:35:db",
            "net25": "1a:fd:b3:99:26:65",
            "net26": "a2:a3:80:2a:64:19",
            "net27": "de:48:0d:95:0b:66",
            "net28": "96:05:40:60:69:f7",
            "net29": "d2:ee:16:17:e5:e2",
            "net3": "ee:93:b7:6d:80:8d",
            "net30": "3e:c1:ae:a0:6a:dc",
            "net31": "56:e1:f0:5b:23:cc",
            "net4": "be:e8:00:c9:d0:38",
            "net5": "2e:e1:b0:8d:38:cf",
            "net6": "b2:c5:1c:19:4e:1f",
            "net7": "36:b9:0e:97:e9:d0",
            "net8": "ae:b5:b6:c4:66:c2",
            "net9": "9a:f6:75:24:b7:77"
        },
        "tof_1_2_12": {
            "net0": "e6:65:dc:4c:b8:82",
            "net1": "5a:98:76:fd:96:5b",
            "net10": "92:61:59:bb:87:44",
            "net11": "62:93:67:a0:ec:d9",
            "net12": "8a:2b:2c:8a:81:4a",
            "net13": "da:24:88:f1:a4:bc",
            "net14": "86:f9:76:e7:e4:03",
            "net15": "36:c8:b5:78:f3:14",
            "net16": "e2:5d:cb:ee:fd:d1",
            "net17": "a2:ca:b5:4b:4e:c1",
            "net18": "0a:db:66:79:de:79",
            "net19": "02:77:f2:00:6f:80",
            "net2": "16:eb:0a:db:7c:4d",
            "net20": "7e:bf:76:68:51:51",
            "net21": "62:b4:70:1d:00:2f",
            "net22": "8e:14:1f:1b:a4:d8",
            "net23": "3a:c0:4f:a3:92:1a",
            "net24": "82:e2:13:d9:1c:d6",
            "net25": "f2:e1:3a:80:9f:f9",
            "net26": "72:bf:f1:ee:b5:e2",
            "net27": "36:ff:fc:69:9d:38",
            "net28": "62:b9:d6:a0:cc:48",
            "net29": "b2:24:3b:76:71:de",
            "net3": "f2:93:50:8e:60:30",
            "net30": "46:7c:ca:d5:2c:31",
            "net31": "72:c5:32:4c:e9:88",
            "net4": "3a:fc:7e:37:31:e3",
            "net5": "06:60:87:e2:83:5b",
            "net6": "e2:83:68:90:33:f0",
            "net7": "4a:64:fc:bf:2a:a4",
            "net8": "6a:31:fa:9c:bd:4a",
            "net9": "6a:7e:0b:93:c6:cb"
        },
        "tof_1_2_13": {
            "net0": "62:22:f5:91:55:f3",
            "net1": "fe:a0:e9:3c:30:c0",
            "net10": "66:0d:11:71:a4:b3",
            "net11": "fa:6f:94:f6:e6:f1",
            "net12": "56:7c:31:8b:c4:81",
            "net13": "8a:24:85:10:7f:47",
            "net14": "76:2c:f8:e1:6c:ea",
            "net15": "72:14:1d:7f:03:79",
            "net16": "a2:8c:61:cb:5e:6d",
            "net17": "a6:08:eb:55:59:fb",
            "net18": "9a:da:90:21:ca:cf",
            "net19": "d2:a0:51:1d:c8:35",
            "net2": "ee:3a:bf:f4:71:11",
            "net20": "4a:c3:d8:95:c5:46",
            "net21": "a6:62:c3:c0:97:d0",
            "net22": "66:b9:a6:5c:63:13",
            "net23": "5e:b8:c2:c4:8a:dc",
            "net24": "0a:86:65:8a:da:02",
            "net25": "6e:e3:cb:fa:f9:a8",
            "net26": "a6:fa:6e:17:51:96",
            "net27": "86:c5:62:3d:fe:aa",
            "net28": "4a:17:fc:01:40:9a",
            "net29": "a6:18:c9:b8:fb:71",
            "net3": "16:c5:fe:bd:bb:5e",
            "net30": "8a:73:2f:71:17:d5",
            "net31": "6a:04:f7:20:14:ca",
            "net4": "1a:f7:be:c6:9b:68",
            "net5": "fa:ee:c8:50:e5:16",
            "net6": "5a:56:70:61:c5:04",
            "net7": "92:50:a2:3b:86:91",
            "net8": "36:16:e0:dd:54:99",
            "net9": "3e:1f:fe:b2:c3:9e"
        },
        "tof_1_2_14": {
            "net0": "22:58:13:85:2e:a3",
            "net1": "2a:3b:12:75:98:66",
            "net10": "d6:a8:a8:43:e5:19",
            "net11": "62:40:7c:34:58:ce",
            "net12": "1a:38:59:51:c6:e6",
            "net13": "ea:42:df:87:d7:4c",
            "net14": "e6:37:b8:45:ee:21",
            "net15": "0e:23:b2:95:d7:2e",
            "net16": "46:5e:3e:7b:e3:90",
            "net17": "22:62:b5:af:e8:99",
            "net18": "7e:88:cf:14:8a:fd",
            "net19": "3e:6c:d2:3a:0c:5e",
            "net2": "a2:11:1d:54:d4:7e",
            "net20": "d2:e1:14:92:dd:b6",
            "net21": "7a:3d:00:8b:f6:91",
            "net22": "0e:1b:be:46:e4:d6",
            "net23": "aa:6d:fd:31:fd:a2",
            "net24": "6a:08:bf:b7:e6:a6",
            "net25": "02:d0:08:87:33:94",
            "net26": "56:16:05:3a:bd:31",
            "net27": "6a:20:05:44:41:3b",
            "net28": "7a:f4:05:22:5b:57",
            "net29": "fe:86:28:b5:37:2b",
            "net3": "82:b4:a5:f5:a1:11",
            "net30": "fa:1d:c9:10:8f:de",
            "net31": "56:22:f3:19:5d:a8",
            "net4": "de:52:59:33:3d:6a",
            "net5": "7e:bb:25:7c:ac:1a",
            "net6": "9a:34:c2:3b:84:c4",
            "net7": "c6:de:23:4a:9d:84",
            "net8": "1a:9b:00:43:2f:19",
            "net9": "76:40:84:94:3a:de"
        },
        "tof_1_2_15": {
            "net0": "a2:83:44:f9:71:df",
            "net1": "ca:15:c9:3d:af:21",
            "net10": "fe:5d:e3:3d:df:ec",
            "net11": "62:c4:fd:05:f7:26",
            "net12": "6a:13:4a:0b:ff:f8",
            "net13": "96:c1:33:d5:94:0e",
            "net14": "2e:17:31:07:d2:b0",
            "net15": "36:7b:29:43:e7:67",
            "net16": "f6:b6:d6:4f:e9:7c",
            "net17": "7a:ba:dc:85:9e:08",
            "net18": "c6:fe:43:6a:56:44",
            "net19": "56:a1:ad:e6:a3:a6",
            "net2": "8e:37:7b:ad:c4:44",
            "net20": "12:02:f2:c4:92:9c",
            "net21": "02:3b:c1:81:59:9e",
            "net22": "72:cb:70:9f:a3:c5",
            "net23": "22:12:3b:86:5b:53",
            "net24": "b6:cb:9a:87:84:cf",
            "net25": "1e:ac:77:9e:b3:54",
            "net26": "12:9d:29:dd:a2:5a",
            "net27": "56:03:c4:49:f9:3e",
            "net28": "f2:b0:49:d1:f3:9e",
            "net29": "56:fe:42:af:02:07",
            "net3": "9a:cb:4a:28:6b:90",
            "net30": "9a:a1:94:03:b6:c0",
            "net31": "26:9d:47:fc:c9:7b",
            "net4": "96:f4:83:70:38:5f",
            "net5": "7e:f7:50:ff:d8:34",
            "net6": "0e:28:e7:0a:72:cc",
            "net7": "96:35:0b:87:17:88",
            "net8": "06:20:dc:b6:23:26",
            "net9": "6a:4a:f0:c4:0c:df"
        },
        "tof_1_2_16": {
            "net0": "12:52:b7:9a:31:13",
            "net1": "36:c7:18:56:35:5f",
            "net10": "5a:c0:73:54:17:a6",
            "net11": "86:85:9e:3e:57:12",
            "net12": "d6:cb:0c:32:10:ef",
            "net13": "ca:fe:91:2c:ec:55",
            "net14": "06:1f:df:1e:7f:83",
            "net15": "1e:1c:29:0c:73:95",
            "net16": "52:c9:a9:2d:a3:e8",
            "net17": "6e:f0:f2:a5:7d:3e",
            "net18": "be:3a:ed:f9:a4:e4",
            "net19": "ae:59:e9:5b:a0:00",
            "net2": "2a:90:c1:9a:a0:bb",
            "net20": "8e:e9:1d:97:04:ba",
            "net21": "9a:cb:71:1d:81:a5",
            "net22": "b2:d2:e1:8c:ba:4f",
            "net23": "a6:2a:9e:68:ea:a2",
            "net24": "26:44:44:4a:14:c1",
            "net25": "1e:32:80:69:13:ce",
            "net26": "ba:c5:bc:47:6c:2f",
            "net27": "ee:8a:24:61:91:a7",
            "net28": "ea:50:df:2c:18:38",
            "net29": "8a:88:a7:34:1a:5a",
            "net3": "4e:b9:8a:a5:07:0c",
            "net30": "e6:2d:9c:02:4b:09",
            "net31": "5a:43:46:64:1b:d9",
            "net4": "e6:45:04:3f:87:66",
            "net5": "da:cf:f2:cb:7d:b5",
            "net6": "62:8f:e9:56:2c:fb",
            "net7": "c6:57:86:eb:c3:83",
            "net8": "ae:e3:2f:38:7b:c5",
            "net9": "ce:7e:d6:5f:3f:79"
        },
        "tof_1_2_2": {
            "net0": "92:14:0f:28:3f:48",
            "net1": "16:fb:7a:72:43:ef",
            "net10": "c6:b5:02:d2:d1:90",
            "net11": "ca:ab:1f:ca:bb:f5",
            "net12": "d2:91:ec:8f:93:20",
            "net13": "9a:c9:5e:4d:4a:b3",
            "net14": "9e:bc:f8:94:c5:f4",
            "net15": "26:10:29:c9:d2:cf",
            "net16": "ba:29:52:f3:b4:c1",
            "net17": "96:c3:25:68:3d:06",
            "net18": "06:c4:78:1b:27:87",
            "net19": "8a:cd:9d:34:28:34",
            "net2": "3e:35:d7:fa:fa:ef",
            "net20": "4a:c3:3f:6f:c8:cf",
            "net21": "e6:1f:17:1b:4a:be",
            "net22": "12:2e:e3:fe:02:ee",
            "net23": "be:ad:17:7e:cc:05",
            "net24": "b2:2a:8e:39:da:c8",
            "net25": "72:1a:d8:d3:f5:c8",
            "net26": "aa:7b:b6:27:b0:21",
            "net27": "3a:9d:1f:75:61:af",
            "net28": "1e:0e:59:2f:2b:96",
            "net29": "12:c8:e8:45:39:72",
            "net3": "ea:cb:19:e2:69:07",
            "net30": "b6:1b:51:11:0a:73",
            "net31": "fa:5b:77:8e:8a:15",
            "net4": "1e:68:c9:5a:15:38",
            "net5": "7a:f4:fc:cf:46:a4",
            "net6": "1e:80:d6:91:3e:80",
            "net7": "4a:26:bc:26:73:f5",
            "net8": "2a:42:2d:85:f8:a1",
            "net9": "f2:43:80:2e:93:58"
        },
        "tof_1_2_3": {
            "net0": "b6:62:70:2e:71:43",
            "net1": "c2:e4:bf:ee:79:a3",
            "net10": "f2:fe:01:21:6f:cf",
            "net11": "b6:1b:98:4c:bf:d7",
            "net12": "4a:d7:83:06:6d:8c",
            "net13": "da:2e:2e:9b:4b:e5",
            "net14": "be:52:13:0c:c8:cf",
            "net15": "4a:50:9d:4a:ef:d0",
            "net16": "ee:b9:53:a5:12:a0",
            "net17": "a2:e4:76:b5:bf:fb",
            "net18": "26:90:4d:e4:9e:d0",
            "net19": "7e:f5:01:dd:11:ca",
            "net2": "0e:9c:8a:68:48:41",
            "net20": "fa:db:81:5e:4e:46",
            "net21": "d6:15:5e:d8:c3:68",
            "net22": "2a:40:ae:2b:6e:bc",
            "net23": "9e:bd:52:ef:ad:0e",
            "net24": "02:69:35:aa:5d:cd",
            "net25": "f6:73:a6:60:90:08",
            "net26": "3a:a6:df:09:90:e3",
            "net27": "5e:21:98:5d:63:31",
            "net28": "9e:05:c6:60:97:32",
            "net29": "06:b8:b8:f2:ef:b6",
            "net3": "e2:d5:cc:7e:eb:f8",
            "net30": "52:47:7c:fe:0e:5d",
            "net31": "ae:a5:64:19:cc:c3",
            "net4": "c2:77:25:e0:7f:a0",
            "net5": "0e:09:13:c4:e5:a1",
            "net6": "5e:07:7f:8e:05:64",
            "net7": "8a:2a:df:0d:8d:8b",
            "net8": "22:76:3b:e0:45:1f",
            "net9": "b6:95:c1:55:33:fc"
        },
        "tof_1_2_4": {
            "net0": "ae:87:10:80:9b:4c",
            "net1": "e6:cb:47:a3:44:8b",
            "net10": "d2:18:0a:83:f5:f1",
            "net11": "0e:4a:f0:01:34:b0",
            "net12": "1a:2a:e9:71:5d:cd",
            "net13": "2a:18:91:97:c4:63",
            "net14": "2a:8e:2b:0e:b2:15",
            "net15": "8e:a8:71:0b:85:52",
            "net16": "e2:6a:8f:1d:bc:dc",
            "net17": "f2:b5:2e:e9:82:a1",
            "net18": "66:6f:60:2a:f1:61",
            "net19": "22:b2:2d:ee:3f:02",
            "net2": "7a:36:90:59:86:92",
            "net20": "72:23:3f:5e:09:94",
            "net21": "12:9e:56:a5:de:10",
            "net22": "d2:02:02:93:16:e1",
            "net23": "72:96:ec:5a:fb:a5",
            "net24": "66:5f:23:9f:06:10",
            "net25": "92:a8:8d:c4:0a:f9",
            "net26": "2e:52:14:1d:3f:ca",
            "net27": "62:52:2c:aa:cd:c4",
            "net28": "26:86:2d:d2:f1:83",
            "net29": "92:1c:61:48:0d:bf",
            "net3": "3e:12:63:03:0d:22",
            "net30": "3e:0c:4b:3a:c3:cc",
            "net31": "62:4c:1c:d2:88:81",
            "net4": "ee:91:12:68:7c:1b",
            "net5": "26:12:03:2f:aa:cf",
            "net6": "22:9f:17:c6:76:86",
            "net7": "2a:82:d0:b6:2b:7b",
            "net8": "1a:e1:9a:dd:97:66",
            "net9": "8e:41:5d:05:6f:ec"
        },
        "tof_1_2_5": {
            "net0": "ce:6d:1b:aa:7b:55",
            "net1": "a6:87:9a:a0:8c:32",
            "net10": "b2:3b:dc:8f:81:09",
            "net11": "22:b4:ae:ce:c6:2f",
            "net12": "12:42:c4:f8:20:64",
            "net13": "82:fb:51:d1:a0:e4",
            "net14": "4a:81:86:2c:b5:47",
            "net15": "7e:8c:f2:d8:ab:a5",
            "net16": "92:82:7b:eb:04:63",
            "net17": "be:6b:28:5e:fb:cb",
            "net18": "2e:b5:8c:c3:ee:61",
            "net19": "9a:94:aa:e5:a5:0a",
            "net2": "42:44:a6:b0:9b:6b",
            "net20": "1a:29:b9:03:ed:af",
            "net21": "be:14:cc:26:0e:ad",
            "net22": "ee:9b:27:7c:b7:73",
            "net23": "aa:a3:4b:06:b8:1c",
            "net24": "0a:d5:a2:07:96:0f",
            "net25": "5a:f8:78:a8:3f:ce",
            "net26": "42:03:55:86:98:21",
            "net27": "de:48:23:73:cc:0d",
            "net28": "32:14:b0:33:51:0d",
            "net29": "ce:cb:08:ea:6f:e6",
            "net3": "be:97:2b:34:97:0d",
            "net30": "aa:64:4c:bb:33:43",
            "net31": "26:89:9f:03:e0:8d",
            "net4": "42:8b:ed:43:7f:33",
            "net5": "9a:11:3c:2e:e4:12",
            "net6": "3e:49:6e:f0:30:c3",
            "net7": "22:b0:8d:74:35:c4",
            "net8": "6e:7b:88:d6:c5:5a",
            "net9": "5e:4c:ab:c7:f4:4b"
        },
        "tof_1_2_6": {
            "net0": "72:76:e0:45:99:b1",
            "net1": "2e:fd:0c:68:6c:b1",
            "net10": "6e:7f:47:9f:cf:6c",
            "net11": "b2:13:a8:da:3f:4c",
            "net12": "76:89:62:b8:fa:73",
            "net13": "a6:dc:d1:6c:66:cf",
            "net14": "2a:df:34:bd:1f:55",
            "net15": "76:f1:ca:92:0b:de",
            "net16": "f6:2e:87:bf:78:e8",
            "net17": "ee:e4:06:3b:b7:f1",
            "net18": "d6:b5:b9:52:6a:90",
            "net19": "2a:3e:85:81:06:08",
            "net2": "06:25:76:97:98:6d",
            "net20": "a6:e3:1b:c4:56:ae",
            "net21": "be:3a:f5:53:11:1f",
            "net22": "8a:71:ab:48:83:79",
            "net23": "56:93:b7:d0:e5:c6",
            "net24": "62:93:6c:de:7b:e4",
            "net25": "9e:04:a9:73:93:1d",
            "net26": "ae:14:9e:d6:19:60",
            "net27": "56:07:e4:2c:89:ac",
            "net28": "da:df:66:24:66:8d",
            "net29": "ca:31:84:9a:3a:9b",
            "net3": "8a:de:b3:10:15:0d",
            "net30": "da:7a:f8:57:59:10",
            "net31": "1a:50:16:13:26:45",
            "net4": "96:dd:8d:80:99:f8",
            "net5": "32:ee:2b:1b:ca:81",
            "net6": "42:bb:8d:f6:3e:2d",
            "net7": "5e:1f:a9:b9:fd:31",
            "net8": "12:6e:35:f2:51:f2",
            "net9": "52:fb:22:18:79:6c"
        },
        "tof_1_2_7": {
            "net0": "9a:e8:d7:37:c0:22",
            "net1": "da:f9:09:9f:4a:57",
            "net10": "5e:71:44:7a:a5:25",
            "net11": "b6:78:d6:82:c8:6a",
            "net12": "c6:b0:30:43:65:86",
            "net13": "2a:62:ac:4e:68:01",
            "net14": "a6:c9:83:97:43:99",
            "net15": "2e:5d:5f:e6:b6:4b",
            "net16": "8e:5a:4d:9f:2d:16",
            "net17": "c6:84:db:47:3f:5f",
            "net18": "92:b1:fa:01:c1:37",
            "net19": "3e:78:3b:67:bb:22",
            "net2": "8a:06:7a:2d:c7:7a",
            "net20": "56:ac:6d:c5:75:f6",
            "net21": "82:84:41:06:14:f7",
            "net22": "b2:e0:f2:ef:d3:51",
            "net23": "4e:e7:14:82:9c:1c",
            "net24": "22:73:1d:e3:c6:66",
            "net25": "2a:4d:17:08:67:8d",
            "net26": "56:9c:d9:c6:c7:25",
            "net27": "9a:45:df:b5:dc:e7",
            "net28": "06:b6:7c:f2:d3:36",
            "net29": "fa:db:df:54:fa:28",
            "net3": "c6:bd:e7:7e:9d:39",
            "net30": "9e:10:3f:f6:6b:50",
            "net31": "b6:b3:ea:ad:57:50",
            "net4": "b6:bc:55:21:b2:fd",
            "net5": "fe:49:4a:d0:48:23",
            "net6": "ee:5a:95:11:50:a4",
            "net7": "36:1d:93:93:a6:da",
            "net8": "aa:fe:20:c4:51:7c",
            "net9": "0a:72:71:ca:d8:ba"
        },
        "tof_1_2_8": {
            "net0": "ce:39:be:05:6f:8b",
            "net1": "4a:ae:52:75:65:59",
            "net10": "da:f7:94:3a:22:de",
            "net11": "36:0b:38:7f:18:76",
            "net12": "72:78:66:1f:72:b3",
            "net13": "2a:16:59:71:2b:b7",
            "net14": "be:f5:36:31:39:8c",
            "net15": "a6:04:a2:6f:22:63",
            "net16": "da:87:94:fd:cf:bc",
            "net17": "ca:2f:d0:25:8c:2d",
            "net18": "9a:a0:34:e6:dd:b3",
            "net19": "6a:d6:4b:17:8c:5d",
            "net2": "8e:3e:6f:77:9d:b0",
            "net20": "a2:c9:48:21:f2:78",
            "net21": "1a:3e:56:a8:83:3d",
            "net22": "52:4e:3b:a5:a4:b6",
            "net23": "2a:1e:ba:b7:7a:20",
            "net24": "ba:ea:fd:8c:53:39",
            "net25": "c6:e9:c7:59:f3:72",
            "net26": "e6:ac:e0:f4:db:d6",
            "net27": "02:d2:df:a1:70:95",
            "net28": "6a:38:52:30:9c:15",
            "net29": "e6:99:27:98:20:6d",
            "net3": "06:9e:58:e9:a8:ed",
            "net30": "2e:9e:e4:08:cd:04",
            "net31": "26:1f:69:2b:08:62",
            "net4": "06:30:02:3a:83:90",
            "net5": "ce:34:c4:a4:e8:0b",
            "net6": "c2:c4:b4:3a:d6:b8",
            "net7": "e2:7d:a8:88:ff:e4",
            "net8": "76:29:f2:1f:95:cf",
            "net9": "2a:61:5b:47:8f:03"
        },
        "tof_1_2_9": {
            "net0": "0a:8b:87:2c:b9:60",
            "net1": "0a:36:05:7a:48:17",
            "net10": "b2:8e:a5:3e:f5:c4",
            "net11": "a6:1e:f9:dc:f7:37",
            "net12": "7a:cc:40:e4:40:cb",
            "net13": "aa:6d:6a:88:1d:f1",
            "net14": "f6:ef:bf:00:d6:c1",
            "net15": "92:02:c7:b8:35:a5",
            "net16": "0a:f3:1d:3d:26:eb",
            "net17": "12:e1:35:a3:4d:c7",
            "net18": "06:34:bb:fc:2a:95",
            "net19": "86:4b:f7:5a:85:f5",
            "net2": "d2:b9:7c:f6:02:3c",
            "net20": "b6:6b:90:2d:3f:20",
            "net21": "12:f8:b2:e2:7b:b9",
            "net22": "26:9c:dd:b2:0c:00",
            "net23": "da:93:37:98:be:e0",
            "net24": "02:2b:b0:1d:a4:70",
            "net25": "ca:81:d3:aa:31:59",
            "net26": "aa:95:48:bf:29:28",
            "net27": "5a:f9:c7:d3:5e:7d",
            "net28": "66:1c:31:3c:5b:26",
            "net29": "5e:42:a7:50:50:8c",
            "net3": "7e:45:3a:58:a9:3b",
            "net30": "6a:ac:e4:64:db:f1",
            "net31": "5a:bf:3c:c3:02:7e",
            "net4": "3a:44:d3:f9:ee:74",
            "net5": "5e:e2:96:7e:b8:cc",
            "net6": "3a:e6:83:fb:40:f7",
            "net7": "b2:96:86:0c:15:6b",
            "net8": "d2:b2:17:4b:74:3b",
            "net9": "22:a0:67:e6:48:ed"
        }
    },
    "failed_machine": "leaf_1_0_1",
    "failure_time": {
        "leaf_1_0_1": 1622579857.9435132,
        "leaf_1_0_10": 1622579857.9505913,
        "leaf_1_0_11": 1622579857.96116,
        "leaf_1_0_12": 1622579857.9717603,
        "leaf_1_0_13": 1622579857.979904,
        "leaf_1_0_14": 1622579857.9868798,
        "leaf_1_0_15": 1622579857.993823,
        "leaf_1_0_16": 1622579857.9991567,
        "leaf_1_0_2": 1622579858.0080462,
        "leaf_1_0_3": 1622579858.0152898,
        "leaf_1_0_4": 1622579857.9437866,
        "leaf_1_0_5": 1622579857.9564316,
        "leaf_1_0_6": 1622579857.9619718,
        "leaf_1_0_7": 1622579857.9709988,
        "leaf_1_0_8": 1622579857.9781947,
        "leaf_1_0_9": 1622579857.9877408,
        "leaf_2_0_1": 1622579857.9981573,
        "leaf_2_0_10": 1622579858.0050395,
        "leaf_2_0_11": 1622579858.01231,
        "leaf_2_0_12": 1622579858.0209043,
        "leaf_2_0_13": 1622579858.0220635,
        "leaf_2_0_14": 1622579858.0349445,
        "leaf_2_0_15": 1622579858.0418715,
        "leaf_2_0_16": 1622579858.050019,
        "leaf_2_0_2": 1622579858.0585723,
        "leaf_2_0_3": 1622579858.06746,
        "leaf_2_0_4": 1622579858.0757,
        "leaf_2_0_5": 1622579858.08433,
        "leaf_2_0_6": 1622579858.0918286,
        "leaf_2_0_7": 1622579858.1016,
        "leaf_2_0_8": 1622579858.0328262,
        "leaf_2_0_9": 1622579858.0395033,
        "spine_1_1_1": 1622579858.049781,
        "spine_1_1_10": 1622579858.0600781,
        "spine_1_1_11": 1622579858.0675323,
        "spine_1_1_12": 1622579858.0757432,
        "spine_1_1_13": 1622579858.0858383,
        "spine_1_1_14": 1622579858.0958595,
        "spine_1_1_15": 1622579858.1063666,
        "spine_1_1_16": 1622579858.1156282,
        "spine_1_1_2": 1622579858.1093454,
        "spine_1_1_3": 1622579858.1173801,
        "spine_1_1_4": 1622579858.1264396,
        "spine_1_1_5": 1622579858.143109,
        "spine_1_1_6": 1622579858.150099,
        "spine_1_1_7": 1622579858.157923,
        "spine_1_1_8": 1622579858.1698363,
        "spine_1_1_9": 1622579858.1795561,
        "spine_2_1_1": 1622579858.1994288,
        "spine_2_1_10": 1622579858.2129438,
        "spine_2_1_11": 1622579858.123583,
        "spine_2_1_12": 1622579858.1392858,
        "spine_2_1_13": 1622579858.1518476,
        "spine_2_1_14": 1622579858.1588697,
        "spine_2_1_15": 1622579858.1712203,
        "spine_2_1_16": 1622579858.1806958,
        "spine_2_1_2": 1622579858.2015665,
        "spine_2_1_3": 1622579858.216442,
        "spine_2_1_4": 1622579858.228872,
        "spine_2_1_5": 1622579858.2431767,
        "spine_2_1_6": 1622579858.222634,
        "spine_2_1_7": 1622579858.2297204,
        "spine_2_1_8": 1622579858.2456753,
        "spine_2_1_9": 1622579858.2533123,
        "tof_1_2_1": 1622579858.2599223,
        "tof_1_2_10": 1622579858.2664196,
        "tof_1_2_11": 1622579858.2736092,
        "tof_1_2_12": 1622579858.283951,
        "tof_1_2_13": 1622579858.299167,
        "tof_1_2_14": 1622579858.3155868,
        "tof_1_2_15": 1622579858.2488828,
        "tof_1_2_16": 1622579858.254011,
        "tof_1_2_2": 1622579858.2619417,
        "tof_1_2_3": 1622579858.2687533,
        "tof_1_2_4": 1622579858.2750535,
        "tof_1_2_5": 1622579858.282462,
        "tof_1_2_6": 1622579858.2926867,
        "tof_1_2_7": 1622579858.312401,
        "tof_1_2_8": 1622579858.3209455,
        "tof_1_2_9": 1622579858.3317857
    }
}