{
    "k_leaf": 4,
    "k_top": 4,
    "redundancy_factor": 2,
    "is_k8s": true,
    "machine_mac_addresses": {
        "leaf_1_0_1": {
            "net0": "86:5f:01:78:1a:dd",
            "net1": "a6:72:af:f3:23:0c",
            "net2": "e6:0f:46:c0:33:d7",
            "net3": "ce:72:68:ff:f3:95",
            "net4": "fa:5e:d1:40:f5:df"
        },
        "leaf_1_0_2": {
            "net0": "12:45:8c:4c:ef:4f",
            "net1": "0a:54:cd:a2:a8:36",
            "net2": "ca:ce:9a:38:ae:3d",
            "net3": "96:84:6b:72:77:fd",
            "net4": "16:bb:5d:14:ee:96"
        },
        "leaf_1_0_3": {
            "net0": "b2:75:08:3e:be:c6",
            "net1": "82:a3:ce:6b:0d:f1",
            "net2": "1a:04:80:73:59:03",
            "net3": "8a:02:4f:94:b5:a8",
            "net4": "36:46:22:bc:49:30"
        },
        "leaf_1_0_4": {
            "net0": "32:77:61:2f:cb:db",
            "net1": "6a:b4:8c:7a:a1:05",
            "net2": "62:53:d7:ca:9e:2a",
            "net3": "0a:7d:53:3e:4d:6a",
            "net4": "1a:7e:d9:d0:1c:83"
        },
        "leaf_2_0_1": {
            "net0": "9a:e2:dd:75:86:b0",
            "net1": "9e:e1:77:0d:a2:63",
            "net2": "e6:78:0c:19:2f:27",
            "net3": "92:f5:73:3c:c3:73",
            "net4": "8e:14:84:65:c3:44"
        },
        "leaf_2_0_2": {
            "net0": "2a:73:a7:59:0c:a3",
            "net1": "0a:49:66:ab:82:35",
            "net2": "d6:24:70:7f:13:d3",
            "net3": "36:5d:44:23:01:de",
            "net4": "42:68:6e:ef:b7:ab"
        },
        "leaf_2_0_3": {
            "net0": "62:ba:40:c2:e3:f3",
            "net1": "06:b9:41:6d:e6:98",
            "net2": "da:2d:e3:ae:54:40",
            "net3": "a2:fa:cc:b3:a1:2a",
            "net4": "06:56:20:d7:99:76"
        },
        "leaf_2_0_4": {
            "net0": "ea:e1:ad:dd:02:f2",
            "net1": "8e:1a:ee:eb:2a:72",
            "net2": "72:a5:94:9a:1f:fb",
            "net3": "e2:8c:eb:32:00:0b",
            "net4": "7a:98:1d:0d:a6:4d"
        },
        "leaf_3_0_1": {
            "net0": "76:92:00:a4:bd:bf",
            "net1": "76:47:87:ed:d3:83",
            "net2": "f2:90:68:b4:27:f8",
            "net3": "16:14:3f:e3:0e:73",
            "net4": "62:e0:b7:d8:cc:73"
        },
        "leaf_3_0_2": {
            "net0": "1e:f7:a1:29:b3:5a",
            "net1": "b2:3b:26:9d:a6:c2",
            "net2": "ca:01:ba:0b:dd:26",
            "net3": "ae:15:01:62:f6:3e",
            "net4": "16:c5:3d:42:66:5b"
        },
        "leaf_3_0_3": {
            "net0": "26:90:d7:c4:e8:aa",
            "net1": "02:ea:0a:7b:90:2a",
            "net2": "6e:a8:b9:65:94:03",
            "net3": "4a:fb:93:0a:ae:43",
            "net4": "6a:7b:dc:2c:ea:c3"
        },
        "leaf_3_0_4": {
            "net0": "fa:72:9b:53:ea:ab",
            "net1": "5a:29:c9:fc:76:4f",
            "net2": "22:8c:81:43:19:c4",
            "net3": "1a:fd:df:04:a3:ef",
            "net4": "72:76:ff:5e:71:7a"
        },
        "leaf_4_0_1": {
            "net0": "e2:38:a1:d8:c4:17",
            "net1": "c2:3c:99:cf:34:30",
            "net2": "2a:a1:7c:4f:56:72",
            "net3": "22:73:84:2e:cb:0f",
            "net4": "26:71:79:8d:45:db"
        },
        "leaf_4_0_2": {
            "net0": "06:9d:3a:1c:e5:b1",
            "net1": "be:ad:01:6c:5f:7e",
            "net2": "b6:f9:81:95:9d:a6",
            "net3": "f6:ee:a1:c1:14:8a",
            "net4": "2e:31:35:36:0f:b8"
        },
        "leaf_4_0_3": {
            "net0": "de:a3:8d:bf:4a:d4",
            "net1": "b6:0f:23:f3:e8:77",
            "net2": "06:9b:8a:7f:ed:8b",
            "net3": "1e:fb:b0:39:49:31",
            "net4": "76:90:1f:21:98:4a"
        },
        "leaf_4_0_4": {
            "net0": "d6:5f:16:5b:e0:1f",
            "net1": "5e:d8:9a:2e:0e:a9",
            "net2": "fa:91:a2:aa:1c:e5",
            "net3": "ee:f9:5c:13:73:9a",
            "net4": "a2:07:b9:f7:3e:4a"
        },
        "spine_1_1_1": {
            "net0": "3a:51:a4:96:e5:00",
            "net1": "26:5e:1f:1b:5c:3c",
            "net2": "32:16:33:76:81:2a",
            "net3": "26:e9:29:7c:ee:48",
            "net4": "3e:95:0d:cb:26:31",
            "net5": "5a:5e:db:84:9f:9e",
            "net6": "b6:2c:28:bb:1d:79",
            "net7": "42:80:6e:b2:6b:7b"
        },
        "spine_1_1_2": {
            "net0": "72:24:2b:14:1a:3f",
            "net1": "6e:87:13:1a:df:1d",
            "net2": "8e:f9:db:b9:7e:9b",
            "net3": "d6:05:07:dc:4e:0d",
            "net4": "da:87:f5:e9:5a:f0",
            "net5": "f2:68:f7:3f:a1:67",
            "net6": "ce:5c:cd:8c:62:1f",
            "net7": "22:4d:b7:87:02:4e"
        },
        "spine_1_1_3": {
            "net0": "26:40:8a:38:d8:04",
            "net1": "76:dc:f1:ad:84:10",
            "net2": "1a:4d:98:34:9f:71",
            "net3": "3e:9f:dd:85:2b:05",
            "net4": "8e:f8:ee:c4:63:0c",
            "net5": "82:0e:e0:b7:ad:28",
            "net6": "de:b1:0d:a1:a3:bb",
            "net7": "8a:64:10:61:75:da"
        },
        "spine_1_1_4": {
            "net0": "32:83:ae:ad:f6:67",
            "net1": "c2:35:2c:b2:56:13",
            "net2": "fa:07:dd:c9:6d:62",
            "net3": "ea:dd:8f:c2:7b:d0",
            "net4": "de:f5:27:40:6b:2b",
            "net5": "8e:82:7d:8a:a5:ba",
            "net6": "32:96:0d:5e:31:13",
            "net7": "7a:95:e7:a0:64:c9"
        },
        "spine_2_1_1": {
            "net0": "da:17:10:54:ab:7c",
            "net1": "d2:22:f1:e5:9a:85",
            "net2": "5a:4d:5e:f1:2f:c8",
            "net3": "06:67:03:9a:62:cd",
            "net4": "b6:b5:45:25:7a:09",
            "net5": "36:71:c7:a4:98:23",
            "net6": "ca:a2:d1:ad:db:7c",
            "net7": "32:e1:b7:69:20:93"
        },
        "spine_2_1_2": {
            "net0": "66:23:c5:26:21:27",
            "net1": "7e:66:17:af:6e:14",
            "net2": "ba:ea:d4:19:b8:b0",
            "net3": "2e:82:64:94:02:a6",
            "net4": "96:f7:cd:cb:12:85",
            "net5": "4e:ef:7e:3e:5f:2e",
            "net6": "16:20:ac:e6:80:15",
            "net7": "26:70:ef:fd:b0:b6"
        },
        "spine_2_1_3": {
            "net0": "62:e1:bf:54:ab:33",
            "net1": "e6:42:7f:7a:3e:37",
            "net2": "92:6d:19:c8:01:dc",
            "net3": "52:63:9c:55:69:a7",
            "net4": "76:79:f5:a4:93:0f",
            "net5": "6a:b5:e8:c1:6c:17",
            "net6": "b2:a5:11:a6:a6:ae",
            "net7": "de:10:5a:91:20:48"
        },
        "spine_2_1_4": {
            "net0": "76:11:71:94:4d:9a",
            "net1": "ce:10:0f:a6:90:9a",
            "net2": "1a:d5:9b:89:37:b2",
            "net3": "ee:2b:f0:62:01:dc",
            "net4": "3a:e0:46:36:33:2d",
            "net5": "26:80:62:f3:f7:6b",
            "net6": "72:b5:26:ac:3a:20",
            "net7": "5e:e1:bb:63:25:c0"
        },
        "spine_3_1_1": {
            "net0": "fe:8e:87:a3:c6:1a",
            "net1": "ba:44:5b:11:93:f7",
            "net2": "1e:4d:20:95:e5:d0",
            "net3": "0e:89:51:fa:8c:df",
            "net4": "0a:47:85:a1:be:80",
            "net5": "fe:79:63:de:97:c7",
            "net6": "56:28:bb:a8:08:d7",
            "net7": "4e:5d:dc:db:47:dc"
        },
        "spine_3_1_2": {
            "net0": "2a:87:69:b5:ec:3f",
            "net1": "3e:cb:3f:81:7a:72",
            "net2": "86:da:81:39:6e:13",
            "net3": "02:99:50:81:87:50",
            "net4": "42:51:43:d8:41:b4",
            "net5": "be:29:f5:24:13:6e",
            "net6": "6a:61:df:94:c1:d2",
            "net7": "d2:99:ec:f1:0a:c6"
        },
        "spine_3_1_3": {
            "net0": "32:42:78:d3:b5:5d",
            "net1": "c6:62:d7:33:99:94",
            "net2": "f6:d4:60:1b:ab:fa",
            "net3": "e6:b3:d2:5a:37:c9",
            "net4": "f2:f9:c3:0f:d3:c9",
            "net5": "5e:f4:c2:e1:03:47",
            "net6": "92:c3:c2:27:6d:16",
            "net7": "26:50:f6:ba:fe:02"
        },
        "spine_3_1_4": {
            "net0": "d6:51:aa:70:f2:5f",
            "net1": "be:1f:a0:ea:9c:b3",
            "net2": "2a:13:24:ad:85:6e",
            "net3": "5a:d7:6e:61:c6:fd",
            "net4": "b6:e5:7d:33:12:81",
            "net5": "8e:54:f0:c7:bc:0e",
            "net6": "22:35:d5:09:cb:fa",
            "net7": "b2:f3:36:54:31:17"
        },
        "spine_4_1_1": {
            "net0": "ee:94:dc:90:3e:ef",
            "net1": "f2:c1:09:0e:1b:ac",
            "net2": "3e:bb:6c:6e:f3:41",
            "net3": "62:e7:e8:18:f7:bd",
            "net4": "d6:49:e0:fa:c2:fa",
            "net5": "76:f5:69:3c:53:84",
            "net6": "72:00:36:57:07:00",
            "net7": "4a:20:bd:b6:41:9e"
        },
        "spine_4_1_2": {
            "net0": "ee:17:46:3f:fc:97",
            "net1": "0a:12:59:42:43:e8",
            "net2": "5a:42:06:c3:88:a9",
            "net3": "6a:aa:61:42:c4:4e",
            "net4": "76:bd:6b:19:d5:79",
            "net5": "3e:2d:24:28:59:1b",
            "net6": "ce:4a:16:44:a9:cf",
            "net7": "12:00:b4:f2:4b:90"
        },
        "spine_4_1_3": {
            "net0": "6a:a1:ce:cf:49:e6",
            "net1": "0e:2d:97:a1:9d:37",
            "net2": "0a:a0:81:90:7e:80",
            "net3": "16:5d:a1:8b:4e:d4",
            "net4": "22:85:15:1d:06:3b",
            "net5": "2a:56:ef:b5:8a:f9",
            "net6": "8a:68:0f:d7:11:1f",
            "net7": "d6:f6:6f:50:70:c9"
        },
        "spine_4_1_4": {
            "net0": "2e:cd:2d:ac:b9:c2",
            "net1": "12:cb:da:d6:54:7d",
            "net2": "2e:7a:a8:73:61:65",
            "net3": "d2:01:d5:ff:da:7c",
            "net4": "3e:0e:ba:e8:b1:8b",
            "net5": "8e:08:c6:4d:4d:f8",
            "net6": "f2:a1:34:8b:11:bf",
            "net7": "5a:30:8b:a5:88:02"
        },
        "tof_1_2_1": {
            "net0": "62:26:84:a7:7e:41",
            "net1": "06:0c:3f:a3:c0:a5",
            "net2": "3e:dd:13:f4:bd:df",
            "net3": "72:a3:ec:39:2a:05",
            "net4": "76:51:46:2c:ef:85",
            "net5": "fe:04:d0:a0:82:78",
            "net6": "a2:02:2f:e4:99:7a",
            "net7": "da:81:ec:c5:6b:89",
            "net8": "66:f8:01:a8:1f:02"
        },
        "tof_1_2_2": {
            "net0": "fa:0c:74:0f:26:24",
            "net1": "ce:df:60:52:d7:f2",
            "net2": "da:98:6d:42:ca:49",
            "net3": "c6:e2:f2:34:a4:3d",
            "net4": "42:98:46:7d:5e:8f",
            "net5": "1a:82:68:dc:0a:60",
            "net6": "26:0e:34:a2:25:26",
            "net7": "56:a3:9c:1d:c2:87",
            "net8": "92:7d:dc:c6:0b:0e"
        },
        "tof_1_2_3": {
            "net0": "92:e5:ca:34:4c:ee",
            "net1": "a2:22:8e:7e:cc:c4",
            "net2": "66:82:8d:85:d2:81",
            "net3": "be:b3:9f:42:6a:f4",
            "net4": "36:b1:80:e1:74:13",
            "net5": "56:c1:af:6e:94:61",
            "net6": "ba:34:68:c5:80:f9",
            "net7": "82:11:14:c2:99:d5",
            "net8": "52:42:81:5f:52:6a"
        },
        "tof_1_2_4": {
            "net0": "46:2b:09:eb:7f:64",
            "net1": "d2:c5:27:66:8e:e5",
            "net2": "22:07:ec:18:ff:4b",
            "net3": "92:94:de:1b:d1:93",
            "net4": "12:c1:26:0d:fc:45",
            "net5": "32:d5:3d:bc:18:49",
            "net6": "d2:ba:27:74:80:8f",
            "net7": "b6:9f:86:32:e9:92",
            "net8": "0e:11:43:7b:f5:18"
        },
        "tof_2_2_1": {
            "net0": "a6:b2:ef:19:d4:c8",
            "net1": "ba:71:f9:99:9c:62",
            "net2": "a6:f7:0d:92:2f:17",
            "net3": "ba:2e:43:9b:a0:77",
            "net4": "9e:d5:41:15:25:3c",
            "net5": "76:36:1b:ca:73:02",
            "net6": "9a:57:bc:e7:56:aa",
            "net7": "2a:19:db:2e:d2:4c",
            "net8": "06:cd:3f:33:bf:59"
        },
        "tof_2_2_2": {
            "net0": "06:9b:b1:80:d7:ff",
            "net1": "8e:4a:43:60:52:0b",
            "net2": "d6:5c:30:d8:b8:1c",
            "net3": "ba:53:48:2b:50:a9",
            "net4": "f6:79:a3:09:5f:db",
            "net5": "de:26:a5:3e:88:89",
            "net6": "4e:c4:c5:08:88:c9",
            "net7": "fa:98:96:27:22:c6",
            "net8": "da:54:3a:ad:6b:3f"
        },
        "tof_2_2_3": {
            "net0": "6a:5b:10:f0:39:53",
            "net1": "5e:e6:ac:c9:b8:6d",
            "net2": "3a:f1:ce:bc:3b:86",
            "net3": "4e:18:f8:33:ec:a5",
            "net4": "26:7c:45:72:98:fb",
            "net5": "2e:c2:52:ce:9b:70",
            "net6": "52:88:39:c6:9c:40",
            "net7": "fe:8f:eb:7f:d4:90",
            "net8": "ee:28:dd:8e:ee:db"
        },
        "tof_2_2_4": {
            "net0": "22:66:9a:b5:69:e7",
            "net1": "1a:67:fe:42:5e:93",
            "net2": "86:3e:b4:d1:06:0c",
            "net3": "52:d3:9b:cb:8f:e0",
            "net4": "c6:90:db:c4:57:a6",
            "net5": "ea:81:af:9c:d8:bb",
            "net6": "7a:6b:90:f6:a7:0c",
            "net7": "46:98:26:75:52:10",
            "net8": "22:1d:f4:13:7c:c5"
        }
    },
    "failed_machine": "leaf_1_0_1",
    "failure_time": {
        "leaf_1_0_1": 1622754233.5307162,
        "leaf_1_0_2": 1622754233.5401404,
        "leaf_1_0_3": 1622754233.550267,
        "leaf_1_0_4": 1622754233.5595217,
        "leaf_2_0_1": 1622754233.566078,
        "leaf_2_0_2": 1622754233.5317392,
        "leaf_2_0_3": 1622754233.5424302,
        "leaf_2_0_4": 1622754233.5474012,
        "leaf_3_0_1": 1622754233.5531814,
        "leaf_3_0_2": 1622754233.558587,
        "leaf_3_0_3": 1622754233.5647433,
        "leaf_3_0_4": 1622754233.5739555,
        "leaf_4_0_1": 1622754233.5835695,
        "leaf_4_0_2": 1622754233.5958471,
        "leaf_4_0_3": 1622754233.6013565,
        "leaf_4_0_4": 1622754233.572669,
        "spine_1_1_1": 1622754233.5778754,
        "spine_1_1_2": 1622754233.5861793,
        "spine_1_1_3": 1622754233.595839,
        "spine_1_1_4": 1622754233.6058147,
        "spine_2_1_1": 1622754233.6110265,
        "spine_2_1_2": 1622754233.6211863,
        "spine_2_1_3": 1622754233.640763,
        "spine_2_1_4": 1622754233.6490264,
        "spine_3_1_1": 1622754233.660119,
        "spine_3_1_2": 1622754233.6122932,
        "spine_3_1_3": 1622754233.6252546,
        "spine_3_1_4": 1622754233.6357718,
        "spine_4_1_1": 1622754233.6438973,
        "spine_4_1_2": 1622754233.6515038,
        "spine_4_1_3": 1622754233.659688,
        "spine_4_1_4": 1622754233.6725585,
        "tof_1_2_1": 1622754233.6763422,
        "tof_1_2_2": 1622754233.6806529,
        "tof_1_2_3": 1622754233.688561,
        "tof_1_2_4": 1622754233.669702,
        "tof_2_2_1": 1622754233.6780705,
        "tof_2_2_2": 1622754233.6853886,
        "tof_2_2_3": 1622754233.6956308,
        "tof_2_2_4": 1622754233.7023966
    }
}