{
    "k_leaf": 2,
    "k_top": 2,
    "redundancy_factor": 2,
    "is_k8s": true,
    "failed_machine": "tof_1_2_1",
    "failure_time": {
        "leaf_1_0_1": 1634416610.822696,
        "leaf_1_0_2": 1634416610.837046,
        "leaf_2_0_1": 1634416610.82436,
        "leaf_2_0_2": 1634416610.837914,
        "spine_1_1_1": 1634416610.8597784,
        "spine_1_1_2": 1634416610.8716958,
        "spine_2_1_1": 1634416610.8609476,
        "spine_2_1_2": 1634416610.874282,
        "tof_1_2_1": 1634416610.8823159,
        "tof_1_2_2": 1634416610.8909924
    },
    "packet_count": {
        "total": [
            260,
            45064
        ],
        "leaf_1_0_2": {
            "total": [
                17,
                3019
            ],
            "net0": {
                "total": [
                    9,
                    1599
                ],
                "csnp": [
                    7,
                    1365
                ],
                "lsp": [
                    1,
                    167
                ],
                "psnp": [
                    1,
                    67
                ]
            },
            "net1": {
                "total": [
                    8,
                    1420
                ],
                "csnp": [
                    6,
                    1170
                ],
                "lsp": [
                    1,
                    167
                ],
                "psnp": [
                    1,
                    83
                ]
            }
        },
        "leaf_2_0_1": {
            "total": [
                17,
                2975
            ],
            "net0": {
                "total": [
                    8,
                    1404
                ],
                "csnp": [
                    6,
                    1170
                ],
                "lsp": [
                    1,
                    167
                ],
                "psnp": [
                    1,
                    67
                ]
            },
            "net1": {
                "total": [
                    9,
                    1571
                ],
                "csnp": [
                    6,
                    1170
                ],
                "lsp": [
                    2,
                    334
                ],
                "psnp": [
                    1,
                    67
                ]
            }
        },
        "spine_2_1_1": {
            "total": [
                37,
                6395
            ],
            "net0": {
                "total": [
                    11,
                    1901
                ],
                "csnp": [
                    7,
                    1365
                ],
                "lsp": [
                    3,
                    501
                ],
                "psnp": [
                    1,
                    35
                ]
            },
            "net1": {
                "total": [
                    11,
                    1901
                ],
                "csnp": [
                    7,
                    1365
                ],
                "lsp": [
                    3,
                    501
                ],
                "psnp": [
                    1,
                    35
                ]
            },
            "net2": {
                "total": [
                    6,
                    1170
                ],
                "csnp": [
                    6,
                    1170
                ]
            },
            "net3": {
                "total": [
                    9,
                    1423
                ],
                "csnp": [
                    6,
                    1170
                ],
                "lsp": [
                    1,
                    167
                ],
                "psnp": [
                    2,
                    86
                ]
            }
        },
        "leaf_2_0_2": {
            "total": [
                19,
                3013
            ],
            "net0": {
                "total": [
                    9,
                    1423
                ],
                "csnp": [
                    6,
                    1170
                ],
                "lsp": [
                    1,
                    167
                ],
                "psnp": [
                    2,
                    86
                ]
            },
            "net1": {
                "total": [
                    10,
                    1590
                ],
                "csnp": [
                    6,
                    1170
                ],
                "lsp": [
                    2,
                    334
                ],
                "psnp": [
                    2,
                    86
                ]
            }
        },
        "leaf_1_0_1": {
            "total": [
                16,
                2808
            ],
            "net0": {
                "total": [
                    8,
                    1404
                ],
                "csnp": [
                    6,
                    1170
                ],
                "lsp": [
                    1,
                    167
                ],
                "psnp": [
                    1,
                    67
                ]
            },
            "net1": {
                "total": [
                    8,
                    1404
                ],
                "csnp": [
                    6,
                    1170
                ],
                "lsp": [
                    1,
                    167
                ],
                "psnp": [
                    1,
                    67
                ]
            }
        },
        "spine_1_1_2": {
            "total": [
                39,
                6821
            ],
            "net0": {
                "total": [
                    10,
                    1706
                ],
                "csnp": [
                    6,
                    1170
                ],
                "lsp": [
                    3,
                    501
                ],
                "psnp": [
                    1,
                    35
                ]
            },
            "net1": {
                "total": [
                    11,
                    1873
                ],
                "csnp": [
                    6,
                    1170
                ],
                "lsp": [
                    4,
                    668
                ],
                "psnp": [
                    1,
                    35
                ]
            },
            "net2": {
                "total": [
                    9,
                    1671
                ],
                "csnp": [
                    6,
                    1170
                ],
                "lsp": [
                    3,
                    501
                ]
            },
            "net3": {
                "total": [
                    9,
                    1571
                ],
                "csnp": [
                    6,
                    1170
                ],
                "lsp": [
                    2,
                    334
                ],
                "psnp": [
                    1,
                    67
                ]
            }
        },
        "tof_1_2_2": {
            "total": [
                44,
                7620
            ],
            "net0": {
                "total": [
                    11,
                    1901
                ],
                "csnp": [
                    7,
                    1365
                ],
                "lsp": [
                    3,
                    501
                ],
                "psnp": [
                    1,
                    35
                ]
            },
            "net1": {
                "total": [
                    11,
                    1917
                ],
                "csnp": [
                    7,
                    1365
                ],
                "lsp": [
                    3,
                    501
                ],
                "psnp": [
                    1,
                    51
                ]
            },
            "net2": {
                "total": [
                    11,
                    1901
                ],
                "csnp": [
                    7,
                    1365
                ],
                "lsp": [
                    3,
                    501
                ],
                "psnp": [
                    1,
                    35
                ]
            },
            "net3": {
                "total": [
                    11,
                    1901
                ],
                "csnp": [
                    7,
                    1365
                ],
                "lsp": [
                    3,
                    501
                ],
                "psnp": [
                    1,
                    35
                ]
            }
        },
        "spine_1_1_1": {
            "total": [
                37,
                6395
            ],
            "net0": {
                "total": [
                    11,
                    1901
                ],
                "csnp": [
                    7,
                    1365
                ],
                "lsp": [
                    3,
                    501
                ],
                "psnp": [
                    1,
                    35
                ]
            },
            "net1": {
                "total": [
                    11,
                    1901
                ],
                "csnp": [
                    7,
                    1365
                ],
                "lsp": [
                    3,
                    501
                ],
                "psnp": [
                    1,
                    35
                ]
            },
            "net2": {
                "total": [
                    6,
                    1170
                ],
                "csnp": [
                    6,
                    1170
                ]
            },
            "net3": {
                "total": [
                    9,
                    1423
                ],
                "csnp": [
                    6,
                    1170
                ],
                "lsp": [
                    1,
                    167
                ],
                "psnp": [
                    2,
                    86
                ]
            }
        },
        "spine_2_1_2": {
            "total": [
                34,
                6018
            ],
            "net0": {
                "total": [
                    10,
                    1722
                ],
                "csnp": [
                    6,
                    1170
                ],
                "lsp": [
                    3,
                    501
                ],
                "psnp": [
                    1,
                    51
                ]
            },
            "net1": {
                "total": [
                    10,
                    1722
                ],
                "csnp": [
                    6,
                    1170
                ],
                "lsp": [
                    3,
                    501
                ],
                "psnp": [
                    1,
                    51
                ]
            },
            "net2": {
                "total": [
                    6,
                    1170
                ],
                "csnp": [
                    6,
                    1170
                ]
            },
            "net3": {
                "total": [
                    8,
                    1404
                ],
                "csnp": [
                    6,
                    1170
                ],
                "lsp": [
                    1,
                    167
                ],
                "psnp": [
                    1,
                    67
                ]
            }
        }
    },
    "packets_by_collision_domain": {
        "AAAH": 4,
        "AAAJ": 5,
        "AAAR": 4,
        "AAAT": 4,
        "AAAA": 4,
        "AAAB": 4,
        "AAAD": 4,
        "AAAE": 5,
        "AAAG": 0,
        "AAAI": 3,
        "AAAK": 4,
        "AAAL": 5,
        "AAAN": 4,
        "AAAO": 5,
        "AAAQ": 0,
        "AAAS": 0
    },
    "blast_radius": {
        "by_collision_domain": {
            "AAAG": [
                0,
                0
            ],
            "AAAI": [
                0,
                3
            ],
            "AAAQ": [
                0,
                0
            ],
            "AAAS": [
                0,
                0
            ],
            "AAAK": [
                1,
                4
            ],
            "AAAN": [
                1,
                4
            ],
            "AAAR": [
                1,
                4
            ],
            "AAAL": [
                1,
                5
            ],
            "AAAO": [
                1,
                5
            ],
            "AAAT": [
                1,
                4
            ],
            "AAAB": [
                1,
                4
            ],
            "AAAE": [
                1,
                5
            ],
            "AAAJ": [
                1,
                5
            ],
            "AAAA": [
                1,
                4
            ],
            "AAAD": [
                1,
                4
            ],
            "AAAH": [
                1,
                4
            ]
        },
        "by_distance": {
            "0": 3,
            "1": 52
        }
    },
    "radius_graph": {
        "nodes": [
            {
                "id": "leaf_2_0_2",
                "label": "leaf_2_0_2"
            },
            {
                "id": "leaf_1_0_1",
                "label": "leaf_1_0_1"
            },
            {
                "id": "tof_1_2_2",
                "label": "tof_1_2_2"
            },
            {
                "id": "spine_2_1_1",
                "label": "spine_2_1_1"
            },
            {
                "id": "spine_2_1_2",
                "label": "spine_2_1_2"
            },
            {
                "id": "leaf_1_0_2",
                "label": "leaf_1_0_2"
            },
            {
                "id": "spine_1_1_2",
                "label": "spine_1_1_2"
            },
            {
                "id": "spine_1_1_1",
                "label": "spine_1_1_1"
            },
            {
                "id": "leaf_2_0_1",
                "label": "leaf_2_0_1"
            },
            {
                "id": "tof_1_2_1",
                "label": "tof_1_2_1"
            }
        ],
        "links": [
            {
                "source": "tof_1_2_1",
                "target": "spine_1_1_1",
                "value": 0,
                "label": "AAAG"
            },
            {
                "source": "tof_1_2_1",
                "target": "spine_1_1_2",
                "value": 3,
                "label": "AAAI"
            },
            {
                "source": "tof_1_2_1",
                "target": "spine_2_1_1",
                "value": 0,
                "label": "AAAQ"
            },
            {
                "source": "tof_1_2_1",
                "target": "spine_2_1_2",
                "value": 0,
                "label": "AAAS"
            },
            {
                "source": "tof_1_2_2",
                "target": "spine_1_1_1",
                "value": 4,
                "label": "AAAH"
            },
            {
                "source": "tof_1_2_2",
                "target": "spine_1_1_2",
                "value": 5,
                "label": "AAAJ"
            },
            {
                "source": "tof_1_2_2",
                "target": "spine_2_1_1",
                "value": 4,
                "label": "AAAR"
            },
            {
                "source": "tof_1_2_2",
                "target": "spine_2_1_2",
                "value": 4,
                "label": "AAAT"
            },
            {
                "source": "leaf_1_0_1",
                "target": "spine_1_1_1",
                "value": 4,
                "label": "AAAA"
            },
            {
                "source": "leaf_1_0_1",
                "target": "spine_1_1_2",
                "value": 4,
                "label": "AAAB"
            },
            {
                "source": "leaf_1_0_2",
                "target": "spine_1_1_1",
                "value": 4,
                "label": "AAAD"
            },
            {
                "source": "leaf_1_0_2",
                "target": "spine_1_1_2",
                "value": 5,
                "label": "AAAE"
            },
            {
                "source": "spine_1_1_1",
                "target": "leaf_1_0_1",
                "value": 4,
                "label": "AAAA"
            },
            {
                "source": "spine_1_1_1",
                "target": "leaf_1_0_2",
                "value": 4,
                "label": "AAAD"
            },
            {
                "source": "spine_1_1_1",
                "target": "tof_1_2_1",
                "value": 0,
                "label": "AAAG"
            },
            {
                "source": "spine_1_1_1",
                "target": "tof_1_2_2",
                "value": 4,
                "label": "AAAH"
            },
            {
                "source": "spine_1_1_2",
                "target": "leaf_1_0_1",
                "value": 4,
                "label": "AAAB"
            },
            {
                "source": "spine_1_1_2",
                "target": "leaf_1_0_2",
                "value": 5,
                "label": "AAAE"
            },
            {
                "source": "spine_1_1_2",
                "target": "tof_1_2_1",
                "value": 3,
                "label": "AAAI"
            },
            {
                "source": "spine_1_1_2",
                "target": "tof_1_2_2",
                "value": 5,
                "label": "AAAJ"
            },
            {
                "source": "leaf_2_0_1",
                "target": "spine_2_1_1",
                "value": 4,
                "label": "AAAK"
            },
            {
                "source": "leaf_2_0_1",
                "target": "spine_2_1_2",
                "value": 5,
                "label": "AAAL"
            },
            {
                "source": "leaf_2_0_2",
                "target": "spine_2_1_1",
                "value": 4,
                "label": "AAAN"
            },
            {
                "source": "leaf_2_0_2",
                "target": "spine_2_1_2",
                "value": 5,
                "label": "AAAO"
            },
            {
                "source": "spine_2_1_1",
                "target": "leaf_2_0_1",
                "value": 4,
                "label": "AAAK"
            },
            {
                "source": "spine_2_1_1",
                "target": "leaf_2_0_2",
                "value": 4,
                "label": "AAAN"
            },
            {
                "source": "spine_2_1_1",
                "target": "tof_1_2_1",
                "value": 0,
                "label": "AAAQ"
            },
            {
                "source": "spine_2_1_1",
                "target": "tof_1_2_2",
                "value": 4,
                "label": "AAAR"
            },
            {
                "source": "spine_2_1_2",
                "target": "leaf_2_0_1",
                "value": 5,
                "label": "AAAL"
            },
            {
                "source": "spine_2_1_2",
                "target": "leaf_2_0_2",
                "value": 5,
                "label": "AAAO"
            },
            {
                "source": "spine_2_1_2",
                "target": "tof_1_2_1",
                "value": 0,
                "label": "AAAS"
            },
            {
                "source": "spine_2_1_2",
                "target": "tof_1_2_2",
                "value": 4,
                "label": "AAAT"
            }
        ]
    },
    "max_number_of_rounds": 10,
    "packets_per_round": {
        "0": 0,
        "1": 3,
        "2": 5,
        "3": 8,
        "4": 5,
        "5": 8,
        "6": 5,
        "7": 10,
        "8": 5,
        "9": 4,
        "10": 2
    },
    "round_graph": {
        "nodes": [
            {
                "id": "leaf_2_0_1-9",
                "label": "leaf_2_0_1-9"
            },
            {
                "id": "spine_2_1_1-6",
                "label": "spine_2_1_1-6"
            },
            {
                "id": "tof_1_2_1-3",
                "label": "tof_1_2_1-3"
            },
            {
                "id": "spine_2_1_2-4",
                "label": "spine_2_1_2-4"
            },
            {
                "id": "spine_1_1_2-6",
                "label": "spine_1_1_2-6"
            },
            {
                "id": "leaf_1_0_1-5",
                "label": "leaf_1_0_1-5"
            },
            {
                "id": "spine_1_1_1-8",
                "label": "spine_1_1_1-8"
            },
            {
                "id": "leaf_2_0_2-3",
                "label": "leaf_2_0_2-3"
            },
            {
                "id": "tof_1_2_2-3",
                "label": "tof_1_2_2-3"
            },
            {
                "id": "tof_1_2_1",
                "label": "tof_1_2_1"
            },
            {
                "id": "tof_1_2_2-1",
                "label": "tof_1_2_2-1"
            },
            {
                "id": "spine_1_1_1-4",
                "label": "spine_1_1_1-4"
            },
            {
                "id": "leaf_2_0_1-7",
                "label": "leaf_2_0_1-7"
            },
            {
                "id": "spine_2_1_2-8",
                "label": "spine_2_1_2-8"
            },
            {
                "id": "tof_1_2_2-5",
                "label": "tof_1_2_2-5"
            },
            {
                "id": "leaf_1_0_1-7",
                "label": "leaf_1_0_1-7"
            },
            {
                "id": "leaf_1_0_2-5",
                "label": "leaf_1_0_2-5"
            },
            {
                "id": "tof_1_2_2-7",
                "label": "tof_1_2_2-7"
            },
            {
                "id": "leaf_2_0_2-9",
                "label": "leaf_2_0_2-9"
            },
            {
                "id": "tof_1_2_1-5",
                "label": "tof_1_2_1-5"
            },
            {
                "id": "spine_1_1_2-2",
                "label": "spine_1_1_2-2"
            },
            {
                "id": "leaf_2_0_1-1",
                "label": "leaf_2_0_1-1"
            },
            {
                "id": "spine_2_1_2-0",
                "label": "spine_2_1_2-0"
            },
            {
                "id": "spine_1_1_1-2",
                "label": "spine_1_1_1-2"
            },
            {
                "id": "spine_2_1_2-10",
                "label": "spine_2_1_2-10"
            },
            {
                "id": "leaf_1_0_2-3",
                "label": "leaf_1_0_2-3"
            },
            {
                "id": "spine_1_1_2-4",
                "label": "spine_1_1_2-4"
            },
            {
                "id": "leaf_1_0_2-7",
                "label": "leaf_1_0_2-7"
            },
            {
                "id": "leaf_2_0_2-7",
                "label": "leaf_2_0_2-7"
            },
            {
                "id": "tof_1_2_1-7",
                "label": "tof_1_2_1-7"
            },
            {
                "id": "leaf_2_0_2-1",
                "label": "leaf_2_0_2-1"
            },
            {
                "id": "spine_2_1_1-8",
                "label": "spine_2_1_1-8"
            },
            {
                "id": "spine_2_1_1-2",
                "label": "spine_2_1_1-2"
            },
            {
                "id": "leaf_2_0_1-3",
                "label": "leaf_2_0_1-3"
            },
            {
                "id": "spine_2_1_2-6",
                "label": "spine_2_1_2-6"
            },
            {
                "id": "leaf_1_0_1-3",
                "label": "leaf_1_0_1-3"
            }
        ],
        "links": [
            {
                "source": "tof_1_2_1",
                "target": "spine_2_1_2-0",
                "value": 0
            },
            {
                "source": "spine_2_1_2-0",
                "target": "leaf_2_0_1-1",
                "value": 1,
                "label": [
                    {
                        "time": 1634416640.851296,
                        "type": "LSP",
                        "LSP ID": "0100.0000.0038.00-00",
                        "Seq.N": 4,
                        "Orig.": "kathara-spine-2-1-2-b2da42ea"
                    }
                ]
            },
            {
                "source": "spine_2_1_2-0",
                "target": "leaf_2_0_2-1",
                "value": 1,
                "label": [
                    {
                        "time": 1634416640.851363,
                        "type": "LSP",
                        "LSP ID": "0100.0000.0038.00-00",
                        "Seq.N": 4,
                        "Orig.": "kathara-spine-2-1-2-b2da42ea"
                    }
                ]
            },
            {
                "source": "spine_2_1_2-0",
                "target": "tof_1_2_2-1",
                "value": 1,
                "label": [
                    {
                        "time": 1634416640.851392,
                        "type": "LSP",
                        "LSP ID": "0100.0000.0038.00-00",
                        "Seq.N": 4,
                        "Orig.": "kathara-spine-2-1-2-b2da42ea"
                    }
                ]
            },
            {
                "source": "leaf_2_0_1-1",
                "target": "spine_2_1_1-2",
                "value": 1,
                "label": [
                    {
                        "time": 1634416640.852278,
                        "type": "LSP",
                        "LSP ID": "0100.0000.0038.00-00",
                        "Seq.N": 4,
                        "Orig.": "kathara-spine-2-1-2-b2da42ea"
                    }
                ]
            },
            {
                "source": "leaf_2_0_2-1",
                "target": "spine_2_1_1-2",
                "value": 1,
                "label": [
                    {
                        "time": 1634416640.851763,
                        "type": "LSP",
                        "LSP ID": "0100.0000.0038.00-00",
                        "Seq.N": 4,
                        "Orig.": "kathara-spine-2-1-2-b2da42ea"
                    }
                ]
            },
            {
                "source": "tof_1_2_2-1",
                "target": "spine_1_1_1-2",
                "value": 1,
                "label": [
                    {
                        "time": 1634416640.852318,
                        "type": "LSP",
                        "LSP ID": "0100.0000.0038.00-00",
                        "Seq.N": 4,
                        "Orig.": "kathara-spine-2-1-2-b2da42ea"
                    }
                ]
            },
            {
                "source": "tof_1_2_2-1",
                "target": "spine_1_1_2-2",
                "value": 1,
                "label": [
                    {
                        "time": 1634416640.85237,
                        "type": "LSP",
                        "LSP ID": "0100.0000.0038.00-00",
                        "Seq.N": 4,
                        "Orig.": "kathara-spine-2-1-2-b2da42ea"
                    }
                ]
            },
            {
                "source": "tof_1_2_2-1",
                "target": "spine_2_1_1-2",
                "value": 1,
                "label": [
                    {
                        "time": 1634416640.852393,
                        "type": "LSP",
                        "LSP ID": "0100.0000.0038.00-00",
                        "Seq.N": 4,
                        "Orig.": "kathara-spine-2-1-2-b2da42ea"
                    }
                ]
            },
            {
                "source": "spine_2_1_1-2",
                "target": "leaf_2_0_1-3",
                "value": 1,
                "label": [
                    {
                        "time": 1634416640.86687,
                        "type": "LSP",
                        "LSP ID": "0100.0000.0034.00-00",
                        "Seq.N": 4,
                        "Orig.": "kathara-spine-2-1-1-870f39bf"
                    }
                ]
            },
            {
                "source": "spine_2_1_1-2",
                "target": "leaf_2_0_2-3",
                "value": 1,
                "label": [
                    {
                        "time": 1634416640.866925,
                        "type": "LSP",
                        "LSP ID": "0100.0000.0034.00-00",
                        "Seq.N": 4,
                        "Orig.": "kathara-spine-2-1-1-870f39bf"
                    }
                ]
            },
            {
                "source": "spine_2_1_1-2",
                "target": "tof_1_2_2-3",
                "value": 1,
                "label": [
                    {
                        "time": 1634416640.866953,
                        "type": "LSP",
                        "LSP ID": "0100.0000.0034.00-00",
                        "Seq.N": 4,
                        "Orig.": "kathara-spine-2-1-1-870f39bf"
                    }
                ]
            },
            {
                "source": "spine_1_1_1-2",
                "target": "leaf_1_0_1-3",
                "value": 1,
                "label": [
                    {
                        "time": 1634416640.853217,
                        "type": "LSP",
                        "LSP ID": "0100.0000.0038.00-00",
                        "Seq.N": 4,
                        "Orig.": "kathara-spine-2-1-2-b2da42ea"
                    }
                ]
            },
            {
                "source": "spine_1_1_1-2",
                "target": "leaf_1_0_2-3",
                "value": 1,
                "label": [
                    {
                        "time": 1634416640.853268,
                        "type": "LSP",
                        "LSP ID": "0100.0000.0038.00-00",
                        "Seq.N": 4,
                        "Orig.": "kathara-spine-2-1-2-b2da42ea"
                    }
                ]
            },
            {
                "source": "spine_1_1_2-2",
                "target": "leaf_1_0_1-3",
                "value": 1,
                "label": [
                    {
                        "time": 1634416640.853435,
                        "type": "LSP",
                        "LSP ID": "0100.0000.0038.00-00",
                        "Seq.N": 4,
                        "Orig.": "kathara-spine-2-1-2-b2da42ea"
                    }
                ]
            },
            {
                "source": "spine_1_1_2-2",
                "target": "leaf_1_0_2-3",
                "value": 1,
                "label": [
                    {
                        "time": 1634416640.853503,
                        "type": "LSP",
                        "LSP ID": "0100.0000.0038.00-00",
                        "Seq.N": 4,
                        "Orig.": "kathara-spine-2-1-2-b2da42ea"
                    }
                ]
            },
            {
                "source": "spine_1_1_2-2",
                "target": "tof_1_2_1-3",
                "value": 1,
                "label": [
                    {
                        "time": 1634416640.853524,
                        "type": "LSP",
                        "LSP ID": "0100.0000.0038.00-00",
                        "Seq.N": 4,
                        "Orig.": "kathara-spine-2-1-2-b2da42ea"
                    }
                ]
            },
            {
                "source": "leaf_2_0_1-3",
                "target": "spine_2_1_2-4",
                "value": 1,
                "label": [
                    {
                        "time": 1634416640.86792,
                        "type": "LSP",
                        "LSP ID": "0100.0000.0034.00-00",
                        "Seq.N": 4,
                        "Orig.": "kathara-spine-2-1-1-870f39bf"
                    }
                ]
            },
            {
                "source": "leaf_2_0_2-3",
                "target": "spine_2_1_2-4",
                "value": 1,
                "label": [
                    {
                        "time": 1634416640.867276,
                        "type": "LSP",
                        "LSP ID": "0100.0000.0034.00-00",
                        "Seq.N": 4,
                        "Orig.": "kathara-spine-2-1-1-870f39bf"
                    }
                ]
            },
            {
                "source": "tof_1_2_2-3",
                "target": "spine_1_1_1-4",
                "value": 1,
                "label": [
                    {
                        "time": 1634416640.867895,
                        "type": "LSP",
                        "LSP ID": "0100.0000.0034.00-00",
                        "Seq.N": 4,
                        "Orig.": "kathara-spine-2-1-1-870f39bf"
                    }
                ]
            },
            {
                "source": "tof_1_2_2-3",
                "target": "spine_1_1_2-4",
                "value": 1,
                "label": [
                    {
                        "time": 1634416640.867936,
                        "type": "LSP",
                        "LSP ID": "0100.0000.0034.00-00",
                        "Seq.N": 4,
                        "Orig.": "kathara-spine-2-1-1-870f39bf"
                    }
                ]
            },
            {
                "source": "tof_1_2_2-3",
                "target": "spine_2_1_2-4",
                "value": 1,
                "label": [
                    {
                        "time": 1634416640.867956,
                        "type": "LSP",
                        "LSP ID": "0100.0000.0034.00-00",
                        "Seq.N": 4,
                        "Orig.": "kathara-spine-2-1-1-870f39bf"
                    }
                ]
            },
            {
                "source": "spine_1_1_1-4",
                "target": "leaf_1_0_1-5",
                "value": 2,
                "label": [
                    {
                        "time": 1634416640.868621,
                        "type": "LSP",
                        "LSP ID": "0100.0000.0034.00-00",
                        "Seq.N": 4,
                        "Orig.": "kathara-spine-2-1-1-870f39bf"
                    },
                    {
                        "time": 1634416640.89025,
                        "type": "LSP",
                        "LSP ID": "0100.0000.0002.00-00",
                        "Seq.N": 4,
                        "Orig.": "kathara-spine-1-1-1-de87967a"
                    }
                ]
            },
            {
                "source": "spine_1_1_1-4",
                "target": "leaf_1_0_2-5",
                "value": 2,
                "label": [
                    {
                        "time": 1634416640.86866,
                        "type": "LSP",
                        "LSP ID": "0100.0000.0034.00-00",
                        "Seq.N": 4,
                        "Orig.": "kathara-spine-2-1-1-870f39bf"
                    },
                    {
                        "time": 1634416640.890299,
                        "type": "LSP",
                        "LSP ID": "0100.0000.0002.00-00",
                        "Seq.N": 4,
                        "Orig.": "kathara-spine-1-1-1-de87967a"
                    }
                ]
            },
            {
                "source": "spine_1_1_1-4",
                "target": "tof_1_2_2-5",
                "value": 1,
                "label": [
                    {
                        "time": 1634416640.890324,
                        "type": "LSP",
                        "LSP ID": "0100.0000.0002.00-00",
                        "Seq.N": 4,
                        "Orig.": "kathara-spine-1-1-1-de87967a"
                    }
                ]
            },
            {
                "source": "spine_1_1_2-4",
                "target": "leaf_1_0_1-5",
                "value": 1,
                "label": [
                    {
                        "time": 1634416640.868928,
                        "type": "LSP",
                        "LSP ID": "0100.0000.0034.00-00",
                        "Seq.N": 4,
                        "Orig.": "kathara-spine-2-1-1-870f39bf"
                    }
                ]
            },
            {
                "source": "spine_1_1_2-4",
                "target": "leaf_1_0_2-5",
                "value": 1,
                "label": [
                    {
                        "time": 1634416640.868956,
                        "type": "LSP",
                        "LSP ID": "0100.0000.0034.00-00",
                        "Seq.N": 4,
                        "Orig.": "kathara-spine-2-1-1-870f39bf"
                    }
                ]
            },
            {
                "source": "spine_1_1_2-4",
                "target": "tof_1_2_1-5",
                "value": 1,
                "label": [
                    {
                        "time": 1634416640.868966,
                        "type": "LSP",
                        "LSP ID": "0100.0000.0034.00-00",
                        "Seq.N": 4,
                        "Orig.": "kathara-spine-2-1-1-870f39bf"
                    }
                ]
            },
            {
                "source": "leaf_1_0_1-5",
                "target": "spine_1_1_2-6",
                "value": 1,
                "label": [
                    {
                        "time": 1634416640.891122,
                        "type": "LSP",
                        "LSP ID": "0100.0000.0002.00-00",
                        "Seq.N": 4,
                        "Orig.": "kathara-spine-1-1-1-de87967a"
                    }
                ]
            },
            {
                "source": "leaf_1_0_2-5",
                "target": "spine_1_1_2-6",
                "value": 1,
                "label": [
                    {
                        "time": 1634416640.892214,
                        "type": "LSP",
                        "LSP ID": "0100.0000.0002.00-00",
                        "Seq.N": 4,
                        "Orig.": "kathara-spine-1-1-1-de87967a"
                    }
                ]
            },
            {
                "source": "tof_1_2_2-5",
                "target": "spine_1_1_2-6",
                "value": 1,
                "label": [
                    {
                        "time": 1634416640.891601,
                        "type": "LSP",
                        "LSP ID": "0100.0000.0002.00-00",
                        "Seq.N": 4,
                        "Orig.": "kathara-spine-1-1-1-de87967a"
                    }
                ]
            },
            {
                "source": "tof_1_2_2-5",
                "target": "spine_2_1_1-6",
                "value": 1,
                "label": [
                    {
                        "time": 1634416640.89164,
                        "type": "LSP",
                        "LSP ID": "0100.0000.0002.00-00",
                        "Seq.N": 4,
                        "Orig.": "kathara-spine-1-1-1-de87967a"
                    }
                ]
            },
            {
                "source": "tof_1_2_2-5",
                "target": "spine_2_1_2-6",
                "value": 1,
                "label": [
                    {
                        "time": 1634416640.891659,
                        "type": "LSP",
                        "LSP ID": "0100.0000.0002.00-00",
                        "Seq.N": 4,
                        "Orig.": "kathara-spine-1-1-1-de87967a"
                    }
                ]
            },
            {
                "source": "spine_1_1_2-6",
                "target": "leaf_1_0_2-7",
                "value": 2,
                "label": [
                    {
                        "time": 1634416640.892383,
                        "type": "LSP",
                        "LSP ID": "0100.0000.0002.00-00",
                        "Seq.N": 4,
                        "Orig.": "kathara-spine-1-1-1-de87967a"
                    },
                    {
                        "time": 1634416641.128157,
                        "type": "LSP",
                        "LSP ID": "0100.0000.0006.00-00",
                        "Seq.N": 4,
                        "Orig.": "kathara-spine-1-1-2-8bea2587"
                    }
                ]
            },
            {
                "source": "spine_1_1_2-6",
                "target": "tof_1_2_1-7",
                "value": 1,
                "label": [
                    {
                        "time": 1634416640.89242,
                        "type": "LSP",
                        "LSP ID": "0100.0000.0002.00-00",
                        "Seq.N": 4,
                        "Orig.": "kathara-spine-1-1-1-de87967a"
                    }
                ]
            },
            {
                "source": "spine_1_1_2-6",
                "target": "tof_1_2_2-7",
                "value": 2,
                "label": [
                    {
                        "time": 1634416640.892431,
                        "type": "LSP",
                        "LSP ID": "0100.0000.0002.00-00",
                        "Seq.N": 4,
                        "Orig.": "kathara-spine-1-1-1-de87967a"
                    },
                    {
                        "time": 1634416641.128213,
                        "type": "LSP",
                        "LSP ID": "0100.0000.0006.00-00",
                        "Seq.N": 4,
                        "Orig.": "kathara-spine-1-1-2-8bea2587"
                    }
                ]
            },
            {
                "source": "spine_1_1_2-6",
                "target": "leaf_1_0_1-7",
                "value": 1,
                "label": [
                    {
                        "time": 1634416641.12809,
                        "type": "LSP",
                        "LSP ID": "0100.0000.0006.00-00",
                        "Seq.N": 4,
                        "Orig.": "kathara-spine-1-1-2-8bea2587"
                    }
                ]
            },
            {
                "source": "spine_2_1_1-6",
                "target": "leaf_2_0_1-7",
                "value": 1,
                "label": [
                    {
                        "time": 1634416640.892187,
                        "type": "LSP",
                        "LSP ID": "0100.0000.0002.00-00",
                        "Seq.N": 4,
                        "Orig.": "kathara-spine-1-1-1-de87967a"
                    }
                ]
            },
            {
                "source": "spine_2_1_1-6",
                "target": "leaf_2_0_2-7",
                "value": 1,
                "label": [
                    {
                        "time": 1634416640.892272,
                        "type": "LSP",
                        "LSP ID": "0100.0000.0002.00-00",
                        "Seq.N": 4,
                        "Orig.": "kathara-spine-1-1-1-de87967a"
                    }
                ]
            },
            {
                "source": "spine_2_1_2-6",
                "target": "leaf_2_0_1-7",
                "value": 1,
                "label": [
                    {
                        "time": 1634416640.892546,
                        "type": "LSP",
                        "LSP ID": "0100.0000.0002.00-00",
                        "Seq.N": 4,
                        "Orig.": "kathara-spine-1-1-1-de87967a"
                    }
                ]
            },
            {
                "source": "spine_2_1_2-6",
                "target": "leaf_2_0_2-7",
                "value": 1,
                "label": [
                    {
                        "time": 1634416640.892598,
                        "type": "LSP",
                        "LSP ID": "0100.0000.0002.00-00",
                        "Seq.N": 4,
                        "Orig.": "kathara-spine-1-1-1-de87967a"
                    }
                ]
            },
            {
                "source": "leaf_1_0_2-7",
                "target": "spine_1_1_1-8",
                "value": 1,
                "label": [
                    {
                        "time": 1634416641.129871,
                        "type": "LSP",
                        "LSP ID": "0100.0000.0006.00-00",
                        "Seq.N": 4,
                        "Orig.": "kathara-spine-1-1-2-8bea2587"
                    }
                ]
            },
            {
                "source": "tof_1_2_2-7",
                "target": "spine_1_1_1-8",
                "value": 1,
                "label": [
                    {
                        "time": 1634416641.128877,
                        "type": "LSP",
                        "LSP ID": "0100.0000.0006.00-00",
                        "Seq.N": 4,
                        "Orig.": "kathara-spine-1-1-2-8bea2587"
                    }
                ]
            },
            {
                "source": "tof_1_2_2-7",
                "target": "spine_2_1_1-8",
                "value": 1,
                "label": [
                    {
                        "time": 1634416641.128926,
                        "type": "LSP",
                        "LSP ID": "0100.0000.0006.00-00",
                        "Seq.N": 4,
                        "Orig.": "kathara-spine-1-1-2-8bea2587"
                    }
                ]
            },
            {
                "source": "tof_1_2_2-7",
                "target": "spine_2_1_2-8",
                "value": 1,
                "label": [
                    {
                        "time": 1634416641.128948,
                        "type": "LSP",
                        "LSP ID": "0100.0000.0006.00-00",
                        "Seq.N": 4,
                        "Orig.": "kathara-spine-1-1-2-8bea2587"
                    }
                ]
            },
            {
                "source": "leaf_1_0_1-7",
                "target": "spine_1_1_1-8",
                "value": 1,
                "label": [
                    {
                        "time": 1634416641.128694,
                        "type": "LSP",
                        "LSP ID": "0100.0000.0006.00-00",
                        "Seq.N": 4,
                        "Orig.": "kathara-spine-1-1-2-8bea2587"
                    }
                ]
            },
            {
                "source": "spine_2_1_1-8",
                "target": "leaf_2_0_1-9",
                "value": 1,
                "label": [
                    {
                        "time": 1634416641.129375,
                        "type": "LSP",
                        "LSP ID": "0100.0000.0006.00-00",
                        "Seq.N": 4,
                        "Orig.": "kathara-spine-1-1-2-8bea2587"
                    }
                ]
            },
            {
                "source": "spine_2_1_1-8",
                "target": "leaf_2_0_2-9",
                "value": 1,
                "label": [
                    {
                        "time": 1634416641.129407,
                        "type": "LSP",
                        "LSP ID": "0100.0000.0006.00-00",
                        "Seq.N": 4,
                        "Orig.": "kathara-spine-1-1-2-8bea2587"
                    }
                ]
            },
            {
                "source": "spine_2_1_2-8",
                "target": "leaf_2_0_1-9",
                "value": 1,
                "label": [
                    {
                        "time": 1634416641.129896,
                        "type": "LSP",
                        "LSP ID": "0100.0000.0006.00-00",
                        "Seq.N": 4,
                        "Orig.": "kathara-spine-1-1-2-8bea2587"
                    }
                ]
            },
            {
                "source": "spine_2_1_2-8",
                "target": "leaf_2_0_2-9",
                "value": 1,
                "label": [
                    {
                        "time": 1634416641.12996,
                        "type": "LSP",
                        "LSP ID": "0100.0000.0006.00-00",
                        "Seq.N": 4,
                        "Orig.": "kathara-spine-1-1-2-8bea2587"
                    }
                ]
            },
            {
                "source": "leaf_2_0_1-9",
                "target": "spine_2_1_2-10",
                "value": 1,
                "label": [
                    {
                        "time": 1634416641.130419,
                        "type": "LSP",
                        "LSP ID": "0100.0000.0006.00-00",
                        "Seq.N": 4,
                        "Orig.": "kathara-spine-1-1-2-8bea2587"
                    }
                ]
            },
            {
                "source": "leaf_2_0_2-9",
                "target": "spine_2_1_2-10",
                "value": 1,
                "label": [
                    {
                        "time": 1634416641.129919,
                        "type": "LSP",
                        "LSP ID": "0100.0000.0006.00-00",
                        "Seq.N": 4,
                        "Orig.": "kathara-spine-1-1-2-8bea2587"
                    }
                ]
            }
        ]
    },
    "logical_time_plot": {
        "points": {
            "spine_2_1_2": {
                "1": {
                    "time": 1634416640.851296,
                    "type": "LSP",
                    "LSP ID": "0100.0000.0038.00-00",
                    "Seq.N": 4,
                    "Orig.": "kathara-spine-2-1-2-b2da42ea",
                    "Logical Clock": 1
                },
                "2": {
                    "time": 1634416640.851363,
                    "type": "LSP",
                    "LSP ID": "0100.0000.0038.00-00",
                    "Seq.N": 4,
                    "Orig.": "kathara-spine-2-1-2-b2da42ea",
                    "Logical Clock": 2
                },
                "3": {
                    "time": 1634416640.851392,
                    "type": "LSP",
                    "LSP ID": "0100.0000.0038.00-00",
                    "Seq.N": 4,
                    "Orig.": "kathara-spine-2-1-2-b2da42ea",
                    "Logical Clock": 3
                },
                "12": {
                    "time": 1634416640.868331,
                    "type": "LSP",
                    "LSP ID": "0100.0000.0034.00-00",
                    "Seq.N": 4,
                    "Orig.": "kathara-spine-2-1-1-870f39bf",
                    "Logical Clock": 12
                },
                "13": {
                    "time": 1634416640.868249,
                    "type": "LSP",
                    "LSP ID": "0100.0000.0034.00-00",
                    "Seq.N": 4,
                    "Orig.": "kathara-spine-2-1-1-870f39bf",
                    "Logical Clock": 13
                },
                "16": {
                    "time": 1634416640.868335,
                    "type": "LSP",
                    "LSP ID": "0100.0000.0034.00-00",
                    "Seq.N": 4,
                    "Orig.": "kathara-spine-2-1-1-870f39bf",
                    "Logical Clock": 16
                },
                "24": {
                    "time": 1634416640.892274,
                    "type": "LSP",
                    "LSP ID": "0100.0000.0002.00-00",
                    "Seq.N": 4,
                    "Orig.": "kathara-spine-1-1-1-de87967a",
                    "Logical Clock": 24
                },
                "25": {
                    "time": 1634416640.892546,
                    "type": "LSP",
                    "LSP ID": "0100.0000.0002.00-00",
                    "Seq.N": 4,
                    "Orig.": "kathara-spine-1-1-1-de87967a",
                    "Logical Clock": 25
                },
                "26": {
                    "time": 1634416640.892598,
                    "type": "LSP",
                    "LSP ID": "0100.0000.0002.00-00",
                    "Seq.N": 4,
                    "Orig.": "kathara-spine-1-1-1-de87967a",
                    "Logical Clock": 26
                },
                "34": {
                    "time": 1634416641.129505,
                    "type": "LSP",
                    "LSP ID": "0100.0000.0006.00-00",
                    "Seq.N": 4,
                    "Orig.": "kathara-spine-1-1-2-8bea2587",
                    "Logical Clock": 34
                },
                "35": {
                    "time": 1634416641.129896,
                    "type": "LSP",
                    "LSP ID": "0100.0000.0006.00-00",
                    "Seq.N": 4,
                    "Orig.": "kathara-spine-1-1-2-8bea2587",
                    "Logical Clock": 35
                },
                "36": {
                    "time": 1634416641.12996,
                    "type": "LSP",
                    "LSP ID": "0100.0000.0006.00-00",
                    "Seq.N": 4,
                    "Orig.": "kathara-spine-1-1-2-8bea2587",
                    "Logical Clock": 36
                },
                "38": {
                    "time": 1634416641.130931,
                    "type": "LSP",
                    "LSP ID": "0100.0000.0006.00-00",
                    "Seq.N": 4,
                    "Orig.": "kathara-spine-1-1-2-8bea2587",
                    "Logical Clock": 38
                },
                "39": {
                    "time": 1634416641.130965,
                    "type": "LSP",
                    "LSP ID": "0100.0000.0006.00-00",
                    "Seq.N": 4,
                    "Orig.": "kathara-spine-1-1-2-8bea2587",
                    "Logical Clock": 39
                }
            },
            "leaf_2_0_1": {
                "2": {
                    "time": 1634416640.851951,
                    "type": "LSP",
                    "LSP ID": "0100.0000.0038.00-00",
                    "Seq.N": 4,
                    "Orig.": "kathara-spine-2-1-2-b2da42ea",
                    "Logical Clock": 2
                },
                "3": {
                    "time": 1634416640.852278,
                    "type": "LSP",
                    "LSP ID": "0100.0000.0038.00-00",
                    "Seq.N": 4,
                    "Orig.": "kathara-spine-2-1-2-b2da42ea",
                    "Logical Clock": 3
                },
                "10": {
                    "time": 1634416640.867551,
                    "type": "LSP",
                    "LSP ID": "0100.0000.0034.00-00",
                    "Seq.N": 4,
                    "Orig.": "kathara-spine-2-1-1-870f39bf",
                    "Logical Clock": 10
                },
                "11": {
                    "time": 1634416640.86792,
                    "type": "LSP",
                    "LSP ID": "0100.0000.0034.00-00",
                    "Seq.N": 4,
                    "Orig.": "kathara-spine-2-1-1-870f39bf",
                    "Logical Clock": 11
                },
                "25": {
                    "time": 1634416640.892992,
                    "type": "LSP",
                    "LSP ID": "0100.0000.0002.00-00",
                    "Seq.N": 4,
                    "Orig.": "kathara-spine-1-1-1-de87967a",
                    "Logical Clock": 25
                },
                "26": {
                    "time": 1634416640.892995,
                    "type": "LSP",
                    "LSP ID": "0100.0000.0002.00-00",
                    "Seq.N": 4,
                    "Orig.": "kathara-spine-1-1-1-de87967a",
                    "Logical Clock": 26
                },
                "35": {
                    "time": 1634416641.130123,
                    "type": "LSP",
                    "LSP ID": "0100.0000.0006.00-00",
                    "Seq.N": 4,
                    "Orig.": "kathara-spine-1-1-2-8bea2587",
                    "Logical Clock": 35
                },
                "36": {
                    "time": 1634416641.13052,
                    "type": "LSP",
                    "LSP ID": "0100.0000.0006.00-00",
                    "Seq.N": 4,
                    "Orig.": "kathara-spine-1-1-2-8bea2587",
                    "Logical Clock": 36
                },
                "37": {
                    "time": 1634416641.130419,
                    "type": "LSP",
                    "LSP ID": "0100.0000.0006.00-00",
                    "Seq.N": 4,
                    "Orig.": "kathara-spine-1-1-2-8bea2587",
                    "Logical Clock": 37
                }
            },
            "leaf_2_0_2": {
                "3": {
                    "time": 1634416640.851353,
                    "type": "LSP",
                    "LSP ID": "0100.0000.0038.00-00",
                    "Seq.N": 4,
                    "Orig.": "kathara-spine-2-1-2-b2da42ea",
                    "Logical Clock": 3
                },
                "4": {
                    "time": 1634416640.851763,
                    "type": "LSP",
                    "LSP ID": "0100.0000.0038.00-00",
                    "Seq.N": 4,
                    "Orig.": "kathara-spine-2-1-2-b2da42ea",
                    "Logical Clock": 4
                },
                "11": {
                    "time": 1634416640.866897,
                    "type": "LSP",
                    "LSP ID": "0100.0000.0034.00-00",
                    "Seq.N": 4,
                    "Orig.": "kathara-spine-2-1-1-870f39bf",
                    "Logical Clock": 11
                },
                "12": {
                    "time": 1634416640.867276,
                    "type": "LSP",
                    "LSP ID": "0100.0000.0034.00-00",
                    "Seq.N": 4,
                    "Orig.": "kathara-spine-2-1-1-870f39bf",
                    "Logical Clock": 12
                },
                "26": {
                    "time": 1634416640.892264,
                    "type": "LSP",
                    "LSP ID": "0100.0000.0002.00-00",
                    "Seq.N": 4,
                    "Orig.": "kathara-spine-1-1-1-de87967a",
                    "Logical Clock": 26
                },
                "27": {
                    "time": 1634416640.892269,
                    "type": "LSP",
                    "LSP ID": "0100.0000.0002.00-00",
                    "Seq.N": 4,
                    "Orig.": "kathara-spine-1-1-1-de87967a",
                    "Logical Clock": 27
                },
                "36": {
                    "time": 1634416641.129525,
                    "type": "LSP",
                    "LSP ID": "0100.0000.0006.00-00",
                    "Seq.N": 4,
                    "Orig.": "kathara-spine-1-1-2-8bea2587",
                    "Logical Clock": 36
                },
                "37": {
                    "time": 1634416641.129937,
                    "type": "LSP",
                    "LSP ID": "0100.0000.0006.00-00",
                    "Seq.N": 4,
                    "Orig.": "kathara-spine-1-1-2-8bea2587",
                    "Logical Clock": 37
                },
                "38": {
                    "time": 1634416641.129919,
                    "type": "LSP",
                    "LSP ID": "0100.0000.0006.00-00",
                    "Seq.N": 4,
                    "Orig.": "kathara-spine-1-1-2-8bea2587",
                    "Logical Clock": 38
                }
            },
            "tof_1_2_2": {
                "4": {
                    "time": 1634416640.851977,
                    "type": "LSP",
                    "LSP ID": "0100.0000.0038.00-00",
                    "Seq.N": 4,
                    "Orig.": "kathara-spine-2-1-2-b2da42ea",
                    "Logical Clock": 4
                },
                "5": {
                    "time": 1634416640.852318,
                    "type": "LSP",
                    "LSP ID": "0100.0000.0038.00-00",
                    "Seq.N": 4,
                    "Orig.": "kathara-spine-2-1-2-b2da42ea",
                    "Logical Clock": 5
                },
                "6": {
                    "time": 1634416640.85237,
                    "type": "LSP",
                    "LSP ID": "0100.0000.0038.00-00",
                    "Seq.N": 4,
                    "Orig.": "kathara-spine-2-1-2-b2da42ea",
                    "Logical Clock": 6
                },
                "7": {
                    "time": 1634416640.852393,
                    "type": "LSP",
                    "LSP ID": "0100.0000.0038.00-00",
                    "Seq.N": 4,
                    "Orig.": "kathara-spine-2-1-2-b2da42ea",
                    "Logical Clock": 7
                },
                "12": {
                    "time": 1634416640.867601,
                    "type": "LSP",
                    "LSP ID": "0100.0000.0034.00-00",
                    "Seq.N": 4,
                    "Orig.": "kathara-spine-2-1-1-870f39bf",
                    "Logical Clock": 12
                },
                "13": {
                    "time": 1634416640.867895,
                    "type": "LSP",
                    "LSP ID": "0100.0000.0034.00-00",
                    "Seq.N": 4,
                    "Orig.": "kathara-spine-2-1-1-870f39bf",
                    "Logical Clock": 13
                },
                "14": {
                    "time": 1634416640.867936,
                    "type": "LSP",
                    "LSP ID": "0100.0000.0034.00-00",
                    "Seq.N": 4,
                    "Orig.": "kathara-spine-2-1-1-870f39bf",
                    "Logical Clock": 14
                },
                "15": {
                    "time": 1634416640.867956,
                    "type": "LSP",
                    "LSP ID": "0100.0000.0034.00-00",
                    "Seq.N": 4,
                    "Orig.": "kathara-spine-2-1-1-870f39bf",
                    "Logical Clock": 15
                },
                "20": {
                    "time": 1634416640.891345,
                    "type": "LSP",
                    "LSP ID": "0100.0000.0002.00-00",
                    "Seq.N": 4,
                    "Orig.": "kathara-spine-1-1-1-de87967a",
                    "Logical Clock": 20
                },
                "21": {
                    "time": 1634416640.891601,
                    "type": "LSP",
                    "LSP ID": "0100.0000.0002.00-00",
                    "Seq.N": 4,
                    "Orig.": "kathara-spine-1-1-1-de87967a",
                    "Logical Clock": 21
                },
                "22": {
                    "time": 1634416640.89164,
                    "type": "LSP",
                    "LSP ID": "0100.0000.0002.00-00",
                    "Seq.N": 4,
                    "Orig.": "kathara-spine-1-1-1-de87967a",
                    "Logical Clock": 22
                },
                "23": {
                    "time": 1634416640.891659,
                    "type": "LSP",
                    "LSP ID": "0100.0000.0002.00-00",
                    "Seq.N": 4,
                    "Orig.": "kathara-spine-1-1-1-de87967a",
                    "Logical Clock": 23
                },
                "27": {
                    "time": 1634416640.892491,
                    "type": "LSP",
                    "LSP ID": "0100.0000.0002.00-00",
                    "Seq.N": 4,
                    "Orig.": "kathara-spine-1-1-1-de87967a",
                    "Logical Clock": 27
                },
                "30": {
                    "time": 1634416641.128547,
                    "type": "LSP",
                    "LSP ID": "0100.0000.0006.00-00",
                    "Seq.N": 4,
                    "Orig.": "kathara-spine-1-1-2-8bea2587",
                    "Logical Clock": 30
                },
                "31": {
                    "time": 1634416641.128877,
                    "type": "LSP",
                    "LSP ID": "0100.0000.0006.00-00",
                    "Seq.N": 4,
                    "Orig.": "kathara-spine-1-1-2-8bea2587",
                    "Logical Clock": 31
                },
                "32": {
                    "time": 1634416641.128926,
                    "type": "LSP",
                    "LSP ID": "0100.0000.0006.00-00",
                    "Seq.N": 4,
                    "Orig.": "kathara-spine-1-1-2-8bea2587",
                    "Logical Clock": 32
                },
                "33": {
                    "time": 1634416641.128948,
                    "type": "LSP",
                    "LSP ID": "0100.0000.0006.00-00",
                    "Seq.N": 4,
                    "Orig.": "kathara-spine-1-1-2-8bea2587",
                    "Logical Clock": 33
                }
            },
            "spine_2_1_1": {
                "4": {
                    "time": 1634416640.852633,
                    "type": "LSP",
                    "LSP ID": "0100.0000.0038.00-00",
                    "Seq.N": 4,
                    "Orig.": "kathara-spine-2-1-2-b2da42ea",
                    "Logical Clock": 4
                },
                "5": {
                    "time": 1634416640.852634,
                    "type": "LSP",
                    "LSP ID": "0100.0000.0038.00-00",
                    "Seq.N": 4,
                    "Orig.": "kathara-spine-2-1-2-b2da42ea",
                    "Logical Clock": 5
                },
                "8": {
                    "time": 1634416640.852637,
                    "type": "LSP",
                    "LSP ID": "0100.0000.0038.00-00",
                    "Seq.N": 4,
                    "Orig.": "kathara-spine-2-1-2-b2da42ea",
                    "Logical Clock": 8
                },
                "9": {
                    "time": 1634416640.86687,
                    "type": "LSP",
                    "LSP ID": "0100.0000.0034.00-00",
                    "Seq.N": 4,
                    "Orig.": "kathara-spine-2-1-1-870f39bf",
                    "Logical Clock": 9
                },
                "10": {
                    "time": 1634416640.866925,
                    "type": "LSP",
                    "LSP ID": "0100.0000.0034.00-00",
                    "Seq.N": 4,
                    "Orig.": "kathara-spine-2-1-1-870f39bf",
                    "Logical Clock": 10
                },
                "11": {
                    "time": 1634416640.866953,
                    "type": "LSP",
                    "LSP ID": "0100.0000.0034.00-00",
                    "Seq.N": 4,
                    "Orig.": "kathara-spine-2-1-1-870f39bf",
                    "Logical Clock": 11
                },
                "23": {
                    "time": 1634416640.891832,
                    "type": "LSP",
                    "LSP ID": "0100.0000.0002.00-00",
                    "Seq.N": 4,
                    "Orig.": "kathara-spine-1-1-1-de87967a",
                    "Logical Clock": 23
                },
                "24": {
                    "time": 1634416640.892187,
                    "type": "LSP",
                    "LSP ID": "0100.0000.0002.00-00",
                    "Seq.N": 4,
                    "Orig.": "kathara-spine-1-1-1-de87967a",
                    "Logical Clock": 24
                },
                "25": {
                    "time": 1634416640.892272,
                    "type": "LSP",
                    "LSP ID": "0100.0000.0002.00-00",
                    "Seq.N": 4,
                    "Orig.": "kathara-spine-1-1-1-de87967a",
                    "Logical Clock": 25
                },
                "33": {
                    "time": 1634416641.129233,
                    "type": "LSP",
                    "LSP ID": "0100.0000.0006.00-00",
                    "Seq.N": 4,
                    "Orig.": "kathara-spine-1-1-2-8bea2587",
                    "Logical Clock": 33
                },
                "34": {
                    "time": 1634416641.129375,
                    "type": "LSP",
                    "LSP ID": "0100.0000.0006.00-00",
                    "Seq.N": 4,
                    "Orig.": "kathara-spine-1-1-2-8bea2587",
                    "Logical Clock": 34
                },
                "35": {
                    "time": 1634416641.129407,
                    "type": "LSP",
                    "LSP ID": "0100.0000.0006.00-00",
                    "Seq.N": 4,
                    "Orig.": "kathara-spine-1-1-2-8bea2587",
                    "Logical Clock": 35
                }
            },
            "spine_1_1_1": {
                "6": {
                    "time": 1634416640.852842,
                    "type": "LSP",
                    "LSP ID": "0100.0000.0038.00-00",
                    "Seq.N": 4,
                    "Orig.": "kathara-spine-2-1-2-b2da42ea",
                    "Logical Clock": 6
                },
                "7": {
                    "time": 1634416640.853217,
                    "type": "LSP",
                    "LSP ID": "0100.0000.0038.00-00",
                    "Seq.N": 4,
                    "Orig.": "kathara-spine-2-1-2-b2da42ea",
                    "Logical Clock": 7
                },
                "8": {
                    "time": 1634416640.853268,
                    "type": "LSP",
                    "LSP ID": "0100.0000.0038.00-00",
                    "Seq.N": 4,
                    "Orig.": "kathara-spine-2-1-2-b2da42ea",
                    "Logical Clock": 8
                },
                "14": {
                    "time": 1634416640.86838,
                    "type": "LSP",
                    "LSP ID": "0100.0000.0034.00-00",
                    "Seq.N": 4,
                    "Orig.": "kathara-spine-2-1-1-870f39bf",
                    "Logical Clock": 14
                },
                "15": {
                    "time": 1634416640.868621,
                    "type": "LSP",
                    "LSP ID": "0100.0000.0034.00-00",
                    "Seq.N": 4,
                    "Orig.": "kathara-spine-2-1-1-870f39bf",
                    "Logical Clock": 15
                },
                "16": {
                    "time": 1634416640.86866,
                    "type": "LSP",
                    "LSP ID": "0100.0000.0034.00-00",
                    "Seq.N": 4,
                    "Orig.": "kathara-spine-2-1-1-870f39bf",
                    "Logical Clock": 16
                },
                "17": {
                    "time": 1634416640.89025,
                    "type": "LSP",
                    "LSP ID": "0100.0000.0002.00-00",
                    "Seq.N": 4,
                    "Orig.": "kathara-spine-1-1-1-de87967a",
                    "Logical Clock": 17
                },
                "18": {
                    "time": 1634416640.890299,
                    "type": "LSP",
                    "LSP ID": "0100.0000.0002.00-00",
                    "Seq.N": 4,
                    "Orig.": "kathara-spine-1-1-1-de87967a",
                    "Logical Clock": 18
                },
                "19": {
                    "time": 1634416640.890324,
                    "type": "LSP",
                    "LSP ID": "0100.0000.0002.00-00",
                    "Seq.N": 4,
                    "Orig.": "kathara-spine-1-1-1-de87967a",
                    "Logical Clock": 19
                },
                "31": {
                    "time": 1634416641.129605,
                    "type": "LSP",
                    "LSP ID": "0100.0000.0006.00-00",
                    "Seq.N": 4,
                    "Orig.": "kathara-spine-1-1-2-8bea2587",
                    "Logical Clock": 31
                },
                "32": {
                    "time": 1634416641.129631,
                    "type": "LSP",
                    "LSP ID": "0100.0000.0006.00-00",
                    "Seq.N": 4,
                    "Orig.": "kathara-spine-1-1-2-8bea2587",
                    "Logical Clock": 32
                },
                "33": {
                    "time": 1634416641.129635,
                    "type": "LSP",
                    "LSP ID": "0100.0000.0006.00-00",
                    "Seq.N": 4,
                    "Orig.": "kathara-spine-1-1-2-8bea2587",
                    "Logical Clock": 33
                }
            },
            "spine_1_1_2": {
                "7": {
                    "time": 1634416640.85309,
                    "type": "LSP",
                    "LSP ID": "0100.0000.0038.00-00",
                    "Seq.N": 4,
                    "Orig.": "kathara-spine-2-1-2-b2da42ea",
                    "Logical Clock": 7
                },
                "8": {
                    "time": 1634416640.853435,
                    "type": "LSP",
                    "LSP ID": "0100.0000.0038.00-00",
                    "Seq.N": 4,
                    "Orig.": "kathara-spine-2-1-2-b2da42ea",
                    "Logical Clock": 8
                },
                "9": {
                    "time": 1634416640.853503,
                    "type": "LSP",
                    "LSP ID": "0100.0000.0038.00-00",
                    "Seq.N": 4,
                    "Orig.": "kathara-spine-2-1-2-b2da42ea",
                    "Logical Clock": 9
                },
                "10": {
                    "time": 1634416640.853524,
                    "type": "LSP",
                    "LSP ID": "0100.0000.0038.00-00",
                    "Seq.N": 4,
                    "Orig.": "kathara-spine-2-1-2-b2da42ea",
                    "Logical Clock": 10
                },
                "15": {
                    "time": 1634416640.868631,
                    "type": "LSP",
                    "LSP ID": "0100.0000.0034.00-00",
                    "Seq.N": 4,
                    "Orig.": "kathara-spine-2-1-1-870f39bf",
                    "Logical Clock": 15
                },
                "16": {
                    "time": 1634416640.868928,
                    "type": "LSP",
                    "LSP ID": "0100.0000.0034.00-00",
                    "Seq.N": 4,
                    "Orig.": "kathara-spine-2-1-1-870f39bf",
                    "Logical Clock": 16
                },
                "17": {
                    "time": 1634416640.868956,
                    "type": "LSP",
                    "LSP ID": "0100.0000.0034.00-00",
                    "Seq.N": 4,
                    "Orig.": "kathara-spine-2-1-1-870f39bf",
                    "Logical Clock": 17
                },
                "18": {
                    "time": 1634416640.868966,
                    "type": "LSP",
                    "LSP ID": "0100.0000.0034.00-00",
                    "Seq.N": 4,
                    "Orig.": "kathara-spine-2-1-1-870f39bf",
                    "Logical Clock": 18
                },
                "21": {
                    "time": 1634416640.892041,
                    "type": "LSP",
                    "LSP ID": "0100.0000.0002.00-00",
                    "Seq.N": 4,
                    "Orig.": "kathara-spine-1-1-1-de87967a",
                    "Logical Clock": 21
                },
                "22": {
                    "time": 1634416640.892193,
                    "type": "LSP",
                    "LSP ID": "0100.0000.0002.00-00",
                    "Seq.N": 4,
                    "Orig.": "kathara-spine-1-1-1-de87967a",
                    "Logical Clock": 22
                },
                "23": {
                    "time": 1634416640.89223,
                    "type": "LSP",
                    "LSP ID": "0100.0000.0002.00-00",
                    "Seq.N": 4,
                    "Orig.": "kathara-spine-1-1-1-de87967a",
                    "Logical Clock": 23
                },
                "24": {
                    "time": 1634416640.892383,
                    "type": "LSP",
                    "LSP ID": "0100.0000.0002.00-00",
                    "Seq.N": 4,
                    "Orig.": "kathara-spine-1-1-1-de87967a",
                    "Logical Clock": 24
                },
                "25": {
                    "time": 1634416640.89242,
                    "type": "LSP",
                    "LSP ID": "0100.0000.0002.00-00",
                    "Seq.N": 4,
                    "Orig.": "kathara-spine-1-1-1-de87967a",
                    "Logical Clock": 25
                },
                "26": {
                    "time": 1634416640.892431,
                    "type": "LSP",
                    "LSP ID": "0100.0000.0002.00-00",
                    "Seq.N": 4,
                    "Orig.": "kathara-spine-1-1-1-de87967a",
                    "Logical Clock": 26
                },
                "27": {
                    "time": 1634416641.12809,
                    "type": "LSP",
                    "LSP ID": "0100.0000.0006.00-00",
                    "Seq.N": 4,
                    "Orig.": "kathara-spine-1-1-2-8bea2587",
                    "Logical Clock": 27
                },
                "28": {
                    "time": 1634416641.128157,
                    "type": "LSP",
                    "LSP ID": "0100.0000.0006.00-00",
                    "Seq.N": 4,
                    "Orig.": "kathara-spine-1-1-2-8bea2587",
                    "Logical Clock": 28
                },
                "29": {
                    "time": 1634416641.128213,
                    "type": "LSP",
                    "LSP ID": "0100.0000.0006.00-00",
                    "Seq.N": 4,
                    "Orig.": "kathara-spine-1-1-2-8bea2587",
                    "Logical Clock": 29
                }
            },
            "leaf_1_0_1": {
                "8": {
                    "time": 1634416640.853497,
                    "type": "LSP",
                    "LSP ID": "0100.0000.0038.00-00",
                    "Seq.N": 4,
                    "Orig.": "kathara-spine-2-1-2-b2da42ea",
                    "Logical Clock": 8
                },
                "9": {
                    "time": 1634416640.853493,
                    "type": "LSP",
                    "LSP ID": "0100.0000.0038.00-00",
                    "Seq.N": 4,
                    "Orig.": "kathara-spine-2-1-2-b2da42ea",
                    "Logical Clock": 9
                },
                "16": {
                    "time": 1634416640.86871,
                    "type": "LSP",
                    "LSP ID": "0100.0000.0034.00-00",
                    "Seq.N": 4,
                    "Orig.": "kathara-spine-2-1-1-870f39bf",
                    "Logical Clock": 16
                },
                "18": {
                    "time": 1634416640.890794,
                    "type": "LSP",
                    "LSP ID": "0100.0000.0002.00-00",
                    "Seq.N": 4,
                    "Orig.": "kathara-spine-1-1-1-de87967a",
                    "Logical Clock": 18
                },
                "19": {
                    "time": 1634416640.868714,
                    "type": "LSP",
                    "LSP ID": "0100.0000.0034.00-00",
                    "Seq.N": 4,
                    "Orig.": "kathara-spine-2-1-1-870f39bf",
                    "Logical Clock": 19
                },
                "20": {
                    "time": 1634416640.891122,
                    "type": "LSP",
                    "LSP ID": "0100.0000.0002.00-00",
                    "Seq.N": 4,
                    "Orig.": "kathara-spine-1-1-1-de87967a",
                    "Logical Clock": 20
                },
                "28": {
                    "time": 1634416641.128371,
                    "type": "LSP",
                    "LSP ID": "0100.0000.0006.00-00",
                    "Seq.N": 4,
                    "Orig.": "kathara-spine-1-1-2-8bea2587",
                    "Logical Clock": 28
                },
                "29": {
                    "time": 1634416641.128694,
                    "type": "LSP",
                    "LSP ID": "0100.0000.0006.00-00",
                    "Seq.N": 4,
                    "Orig.": "kathara-spine-1-1-2-8bea2587",
                    "Logical Clock": 29
                }
            },
            "leaf_1_0_2": {
                "9": {
                    "time": 1634416640.854545,
                    "type": "LSP",
                    "LSP ID": "0100.0000.0038.00-00",
                    "Seq.N": 4,
                    "Orig.": "kathara-spine-2-1-2-b2da42ea",
                    "Logical Clock": 9
                },
                "10": {
                    "time": 1634416640.85454,
                    "type": "LSP",
                    "LSP ID": "0100.0000.0038.00-00",
                    "Seq.N": 4,
                    "Orig.": "kathara-spine-2-1-2-b2da42ea",
                    "Logical Clock": 10
                },
                "17": {
                    "time": 1634416640.869823,
                    "type": "LSP",
                    "LSP ID": "0100.0000.0034.00-00",
                    "Seq.N": 4,
                    "Orig.": "kathara-spine-2-1-1-870f39bf",
                    "Logical Clock": 17
                },
                "19": {
                    "time": 1634416640.891829,
                    "type": "LSP",
                    "LSP ID": "0100.0000.0002.00-00",
                    "Seq.N": 4,
                    "Orig.": "kathara-spine-1-1-1-de87967a",
                    "Logical Clock": 19
                },
                "20": {
                    "time": 1634416640.869819,
                    "type": "LSP",
                    "LSP ID": "0100.0000.0034.00-00",
                    "Seq.N": 4,
                    "Orig.": "kathara-spine-2-1-1-870f39bf",
                    "Logical Clock": 20
                },
                "21": {
                    "time": 1634416640.892214,
                    "type": "LSP",
                    "LSP ID": "0100.0000.0002.00-00",
                    "Seq.N": 4,
                    "Orig.": "kathara-spine-1-1-1-de87967a",
                    "Logical Clock": 21
                },
                "25": {
                    "time": 1634416640.893247,
                    "type": "LSP",
                    "LSP ID": "0100.0000.0002.00-00",
                    "Seq.N": 4,
                    "Orig.": "kathara-spine-1-1-1-de87967a",
                    "Logical Clock": 25
                },
                "29": {
                    "time": 1634416641.129483,
                    "type": "LSP",
                    "LSP ID": "0100.0000.0006.00-00",
                    "Seq.N": 4,
                    "Orig.": "kathara-spine-1-1-2-8bea2587",
                    "Logical Clock": 29
                },
                "30": {
                    "time": 1634416641.129871,
                    "type": "LSP",
                    "LSP ID": "0100.0000.0006.00-00",
                    "Seq.N": 4,
                    "Orig.": "kathara-spine-1-1-2-8bea2587",
                    "Logical Clock": 30
                }
            }
        },
        "edges": [
            [
                [
                    "spine_2_1_2",
                    1
                ],
                [
                    "leaf_2_0_1",
                    2
                ]
            ],
            [
                [
                    "spine_2_1_2",
                    2
                ],
                [
                    "leaf_2_0_2",
                    3
                ]
            ],
            [
                [
                    "spine_2_1_2",
                    3
                ],
                [
                    "tof_1_2_2",
                    4
                ]
            ],
            [
                [
                    "leaf_2_0_1",
                    3
                ],
                [
                    "spine_2_1_1",
                    4
                ]
            ],
            [
                [
                    "leaf_2_0_2",
                    4
                ],
                [
                    "spine_2_1_1",
                    5
                ]
            ],
            [
                [
                    "tof_1_2_2",
                    5
                ],
                [
                    "spine_1_1_1",
                    6
                ]
            ],
            [
                [
                    "tof_1_2_2",
                    6
                ],
                [
                    "spine_1_1_2",
                    7
                ]
            ],
            [
                [
                    "tof_1_2_2",
                    7
                ],
                [
                    "spine_2_1_1",
                    8
                ]
            ],
            [
                [
                    "spine_2_1_1",
                    9
                ],
                [
                    "leaf_2_0_1",
                    10
                ]
            ],
            [
                [
                    "spine_2_1_1",
                    10
                ],
                [
                    "leaf_2_0_2",
                    11
                ]
            ],
            [
                [
                    "spine_2_1_1",
                    11
                ],
                [
                    "tof_1_2_2",
                    12
                ]
            ],
            [
                [
                    "spine_1_1_1",
                    7
                ],
                [
                    "leaf_1_0_1",
                    8
                ]
            ],
            [
                [
                    "spine_1_1_1",
                    8
                ],
                [
                    "leaf_1_0_2",
                    9
                ]
            ],
            [
                [
                    "spine_1_1_2",
                    8
                ],
                [
                    "leaf_1_0_1",
                    9
                ]
            ],
            [
                [
                    "spine_1_1_2",
                    9
                ],
                [
                    "leaf_1_0_2",
                    10
                ]
            ],
            [
                [
                    "spine_1_1_2",
                    10
                ],
                [
                    "tof_1_2_1",
                    null
                ]
            ],
            [
                [
                    "leaf_2_0_1",
                    11
                ],
                [
                    "spine_2_1_2",
                    12
                ]
            ],
            [
                [
                    "leaf_2_0_2",
                    12
                ],
                [
                    "spine_2_1_2",
                    13
                ]
            ],
            [
                [
                    "tof_1_2_2",
                    13
                ],
                [
                    "spine_1_1_1",
                    14
                ]
            ],
            [
                [
                    "tof_1_2_2",
                    14
                ],
                [
                    "spine_1_1_2",
                    15
                ]
            ],
            [
                [
                    "tof_1_2_2",
                    15
                ],
                [
                    "spine_2_1_2",
                    16
                ]
            ],
            [
                [
                    "spine_1_1_1",
                    15
                ],
                [
                    "leaf_1_0_1",
                    16
                ]
            ],
            [
                [
                    "spine_1_1_1",
                    16
                ],
                [
                    "leaf_1_0_2",
                    17
                ]
            ],
            [
                [
                    "spine_1_1_1",
                    17
                ],
                [
                    "leaf_1_0_1",
                    18
                ]
            ],
            [
                [
                    "spine_1_1_1",
                    18
                ],
                [
                    "leaf_1_0_2",
                    19
                ]
            ],
            [
                [
                    "spine_1_1_1",
                    19
                ],
                [
                    "tof_1_2_2",
                    20
                ]
            ],
            [
                [
                    "spine_1_1_2",
                    16
                ],
                [
                    "leaf_1_0_1",
                    19
                ]
            ],
            [
                [
                    "spine_1_1_2",
                    17
                ],
                [
                    "leaf_1_0_2",
                    20
                ]
            ],
            [
                [
                    "spine_1_1_2",
                    18
                ],
                [
                    "tof_1_2_1",
                    null
                ]
            ],
            [
                [
                    "leaf_1_0_1",
                    20
                ],
                [
                    "spine_1_1_2",
                    21
                ]
            ],
            [
                [
                    "leaf_1_0_2",
                    21
                ],
                [
                    "spine_1_1_2",
                    22
                ]
            ],
            [
                [
                    "tof_1_2_2",
                    21
                ],
                [
                    "spine_1_1_2",
                    23
                ]
            ],
            [
                [
                    "tof_1_2_2",
                    22
                ],
                [
                    "spine_2_1_1",
                    23
                ]
            ],
            [
                [
                    "tof_1_2_2",
                    23
                ],
                [
                    "spine_2_1_2",
                    24
                ]
            ],
            [
                [
                    "spine_1_1_2",
                    24
                ],
                [
                    "leaf_1_0_2",
                    25
                ]
            ],
            [
                [
                    "spine_1_1_2",
                    25
                ],
                [
                    "tof_1_2_1",
                    null
                ]
            ],
            [
                [
                    "spine_1_1_2",
                    26
                ],
                [
                    "tof_1_2_2",
                    27
                ]
            ],
            [
                [
                    "spine_1_1_2",
                    27
                ],
                [
                    "leaf_1_0_1",
                    28
                ]
            ],
            [
                [
                    "spine_1_1_2",
                    28
                ],
                [
                    "leaf_1_0_2",
                    29
                ]
            ],
            [
                [
                    "spine_1_1_2",
                    29
                ],
                [
                    "tof_1_2_2",
                    30
                ]
            ],
            [
                [
                    "spine_2_1_1",
                    24
                ],
                [
                    "leaf_2_0_1",
                    25
                ]
            ],
            [
                [
                    "spine_2_1_1",
                    25
                ],
                [
                    "leaf_2_0_2",
                    26
                ]
            ],
            [
                [
                    "spine_2_1_2",
                    25
                ],
                [
                    "leaf_2_0_1",
                    26
                ]
            ],
            [
                [
                    "spine_2_1_2",
                    26
                ],
                [
                    "leaf_2_0_2",
                    27
                ]
            ],
            [
                [
                    "leaf_1_0_2",
                    30
                ],
                [
                    "spine_1_1_1",
                    31
                ]
            ],
            [
                [
                    "tof_1_2_2",
                    31
                ],
                [
                    "spine_1_1_1",
                    32
                ]
            ],
            [
                [
                    "tof_1_2_2",
                    32
                ],
                [
                    "spine_2_1_1",
                    33
                ]
            ],
            [
                [
                    "tof_1_2_2",
                    33
                ],
                [
                    "spine_2_1_2",
                    34
                ]
            ],
            [
                [
                    "leaf_1_0_1",
                    29
                ],
                [
                    "spine_1_1_1",
                    33
                ]
            ],
            [
                [
                    "spine_2_1_1",
                    34
                ],
                [
                    "leaf_2_0_1",
                    35
                ]
            ],
            [
                [
                    "spine_2_1_1",
                    35
                ],
                [
                    "leaf_2_0_2",
                    36
                ]
            ],
            [
                [
                    "spine_2_1_2",
                    35
                ],
                [
                    "leaf_2_0_1",
                    36
                ]
            ],
            [
                [
                    "spine_2_1_2",
                    36
                ],
                [
                    "leaf_2_0_2",
                    37
                ]
            ],
            [
                [
                    "leaf_2_0_1",
                    37
                ],
                [
                    "spine_2_1_2",
                    38
                ]
            ],
            [
                [
                    "leaf_2_0_2",
                    38
                ],
                [
                    "spine_2_1_2",
                    39
                ]
            ]
        ]
    },
    "max_scalar_clock": 39
}