{
    "k_leaf": 16,
    "k_top": 16,
    "redundancy_factor": 16,
    "is_k8s": true,
    "machine_mac_addresses": {
        "leaf_1_0_1": {
            "net0": "86:1d:73:8f:2f:27",
            "net1": "6e:6f:bd:89:f3:69",
            "net10": "ce:db:9d:8e:29:9a",
            "net11": "12:b8:63:68:80:8f",
            "net12": "1e:ed:4f:d3:37:f7",
            "net13": "1e:0c:f9:aa:67:2e",
            "net14": "52:db:5d:e6:4f:00",
            "net15": "6a:95:5b:76:f6:3a",
            "net16": "8a:53:69:8e:80:33",
            "net2": "2e:90:30:33:6f:a6",
            "net3": "72:bd:74:e1:12:b9",
            "net4": "52:88:90:f6:8d:13",
            "net5": "62:e4:76:ac:f6:63",
            "net6": "26:96:07:7b:90:45",
            "net7": "0e:6a:69:7d:4e:ea",
            "net8": "32:c1:f1:c0:98:12",
            "net9": "36:e4:bc:c8:2f:e2"
        },
        "leaf_1_0_10": {
            "net0": "c6:dc:8a:7b:11:58",
            "net1": "6a:27:36:c5:27:72",
            "net10": "76:3f:5b:b6:a4:34",
            "net11": "86:14:77:ca:96:b6",
            "net12": "9a:34:e1:1f:98:b4",
            "net13": "6a:65:1d:57:0f:90",
            "net14": "b2:2f:ed:4c:ee:13",
            "net15": "f6:e6:47:80:65:c2",
            "net16": "92:3e:24:df:d0:e3",
            "net2": "92:c9:16:9d:9d:de",
            "net3": "56:94:bc:a1:1f:ee",
            "net4": "42:0b:f7:f5:8e:73",
            "net5": "42:00:da:6c:5d:25",
            "net6": "76:4a:f7:d0:e1:53",
            "net7": "7e:da:e2:3d:81:3f",
            "net8": "a6:3f:53:4f:53:a3",
            "net9": "1a:55:4f:9f:98:55"
        },
        "leaf_1_0_11": {
            "net0": "4e:c3:f1:ef:2c:82",
            "net1": "ce:b0:86:d2:c8:9e",
            "net10": "96:48:b9:e2:72:00",
            "net11": "d2:54:c3:6f:93:11",
            "net12": "aa:e9:b4:de:7f:34",
            "net13": "b6:ef:23:cd:53:10",
            "net14": "82:1e:2e:b9:2d:4d",
            "net15": "7e:54:d8:22:4b:2b",
            "net16": "ea:fd:9b:e6:b5:fd",
            "net2": "7a:6d:b7:40:1c:99",
            "net3": "0e:db:17:c9:7c:43",
            "net4": "62:8b:22:76:28:04",
            "net5": "e6:ed:7e:f3:4d:c1",
            "net6": "46:76:11:f7:9e:89",
            "net7": "d2:bd:fa:c3:8a:03",
            "net8": "ba:e1:b7:8f:eb:16",
            "net9": "3a:35:98:07:aa:ec"
        },
        "leaf_1_0_12": {
            "net0": "e6:47:7b:72:1b:4f",
            "net1": "5a:0e:a1:d2:9c:b1",
            "net10": "fa:5d:2d:33:4f:21",
            "net11": "ca:21:4d:ef:1e:49",
            "net12": "2a:d7:33:bb:da:27",
            "net13": "0e:34:51:27:ac:01",
            "net14": "aa:97:25:fa:5b:fc",
            "net15": "0a:8e:87:0a:38:b3",
            "net16": "9e:01:42:65:a0:4d",
            "net2": "4e:51:51:07:3e:18",
            "net3": "26:38:13:50:a0:ad",
            "net4": "82:d8:9e:2e:8e:da",
            "net5": "3e:9b:d4:b4:9d:5a",
            "net6": "72:ff:ad:c5:84:0b",
            "net7": "ea:b7:f9:56:f1:91",
            "net8": "a2:35:f5:7b:a4:56",
            "net9": "3e:a4:d8:92:a8:9f"
        },
        "leaf_1_0_13": {
            "net0": "8e:4c:95:70:02:6b",
            "net1": "96:23:c5:f6:ab:89",
            "net10": "8e:8c:5c:8a:a1:79",
            "net11": "56:38:0a:63:06:4c",
            "net12": "f2:02:a3:51:fc:ba",
            "net13": "32:16:70:49:8e:81",
            "net14": "d6:d3:6f:e7:97:61",
            "net15": "1e:27:73:1c:1a:a4",
            "net16": "a2:9f:e1:05:70:16",
            "net2": "d6:0c:c0:fe:00:c2",
            "net3": "a2:2c:13:b8:e9:75",
            "net4": "86:19:01:67:10:9b",
            "net5": "42:b0:cc:46:58:b1",
            "net6": "86:99:50:7d:08:3d",
            "net7": "26:b5:5d:b0:78:2c",
            "net8": "1e:63:05:78:71:77",
            "net9": "a6:ec:21:13:30:4a"
        },
        "leaf_1_0_14": {
            "net0": "82:af:b0:02:03:80",
            "net1": "6a:ca:f9:a5:1c:d4",
            "net10": "ee:a2:bd:41:09:60",
            "net11": "ba:5a:36:8b:f6:59",
            "net12": "8e:26:26:13:ca:a2",
            "net13": "86:f0:64:01:50:5e",
            "net14": "e6:51:6a:41:29:9d",
            "net15": "4e:c6:52:3a:4b:e0",
            "net16": "2e:6e:f4:d1:7b:4a",
            "net2": "aa:cb:28:d5:07:35",
            "net3": "56:ce:9d:a0:8a:01",
            "net4": "42:36:b4:64:4d:86",
            "net5": "c6:33:a8:02:6f:f2",
            "net6": "4a:ec:49:db:f8:78",
            "net7": "82:cb:47:9f:a1:be",
            "net8": "06:a4:da:2c:ba:9c",
            "net9": "72:81:a9:c8:d3:23"
        },
        "leaf_1_0_15": {
            "net0": "5e:34:de:72:f3:4f",
            "net1": "d2:71:11:ad:ea:cc",
            "net10": "32:48:cc:2a:ed:19",
            "net11": "ea:a2:c8:88:c3:28",
            "net12": "9e:bc:17:db:ed:1f",
            "net13": "e6:03:d7:5e:20:27",
            "net14": "e2:86:74:b4:9a:08",
            "net15": "46:b8:35:06:ba:ea",
            "net16": "4a:35:22:7b:21:e5",
            "net2": "5e:65:8a:ee:c7:71",
            "net3": "4a:3e:f5:ab:3e:09",
            "net4": "62:15:1a:60:e8:3f",
            "net5": "7a:43:c4:7b:e5:33",
            "net6": "b2:b5:64:cb:86:68",
            "net7": "2e:0a:ab:aa:4d:56",
            "net8": "a2:63:f3:cb:32:f2",
            "net9": "a6:be:c9:fd:76:50"
        },
        "leaf_1_0_16": {
            "net0": "8a:09:83:62:7a:fc",
            "net1": "32:a6:54:41:0e:7f",
            "net10": "92:b1:41:5e:61:03",
            "net11": "d6:8b:d7:0d:d4:96",
            "net12": "9a:b6:0c:1a:a9:55",
            "net13": "32:82:32:28:ba:3a",
            "net14": "72:4a:d3:10:f9:a3",
            "net15": "6e:0f:7c:28:a7:63",
            "net16": "fa:d9:f7:10:14:31",
            "net2": "12:5b:83:ea:56:42",
            "net3": "56:8b:a1:f5:a0:e5",
            "net4": "c2:6b:6e:6e:7e:da",
            "net5": "92:24:63:49:64:e5",
            "net6": "be:f3:3b:48:e9:34",
            "net7": "c2:7c:77:12:94:b6",
            "net8": "ae:d2:e4:d9:b2:b8",
            "net9": "ce:ba:cd:53:54:34"
        },
        "leaf_1_0_2": {
            "net0": "a2:d3:be:04:c7:2e",
            "net1": "da:7c:5d:74:0c:72",
            "net10": "b2:59:c5:e5:61:53",
            "net11": "6e:57:d5:38:82:3c",
            "net12": "ea:68:10:c3:78:4f",
            "net13": "ae:3b:39:bb:bc:2f",
            "net14": "be:4b:bc:80:94:69",
            "net15": "76:99:55:a4:38:b3",
            "net16": "d2:de:a8:f3:39:e7",
            "net2": "3a:ae:44:40:b6:40",
            "net3": "8a:e5:3c:fb:e8:fd",
            "net4": "ae:73:eb:39:66:ff",
            "net5": "e6:47:b2:1b:98:b3",
            "net6": "5e:23:5f:3e:11:67",
            "net7": "1a:bc:6b:cc:7d:05",
            "net8": "d2:06:c5:15:c7:f1",
            "net9": "f6:16:56:da:77:d6"
        },
        "leaf_1_0_3": {
            "net0": "ce:c9:f7:50:81:76",
            "net1": "1e:6b:da:18:59:4f",
            "net10": "ba:96:a3:97:77:57",
            "net11": "62:63:cb:67:61:c4",
            "net12": "6e:14:b5:8a:15:53",
            "net13": "e6:91:0b:9f:0d:be",
            "net14": "3e:b3:69:63:6b:55",
            "net15": "f6:a0:80:05:07:de",
            "net16": "56:33:f6:24:64:47",
            "net2": "32:6c:a9:16:4a:d9",
            "net3": "0a:0e:d4:ef:c1:a9",
            "net4": "a6:8a:62:77:4d:b1",
            "net5": "0a:d9:79:d0:0b:70",
            "net6": "1e:26:5e:47:bd:20",
            "net7": "5e:15:9a:7f:02:dd",
            "net8": "da:f9:cb:ff:41:ca",
            "net9": "56:d8:27:05:e0:56"
        },
        "leaf_1_0_4": {
            "net0": "fa:44:bb:e7:4f:c9",
            "net1": "fa:4f:e4:1f:62:d2",
            "net10": "b6:6e:34:68:4a:dc",
            "net11": "66:d7:48:68:18:58",
            "net12": "5e:d8:da:4f:f2:4e",
            "net13": "2a:77:d4:b8:09:bc",
            "net14": "f6:43:eb:ab:d0:1d",
            "net15": "36:09:b1:38:07:22",
            "net16": "b6:50:2a:72:e2:11",
            "net2": "d2:2c:35:ad:54:ab",
            "net3": "ee:c1:14:e5:d6:f3",
            "net4": "0a:58:b3:67:f2:79",
            "net5": "b2:89:00:8a:de:83",
            "net6": "62:2c:ec:b5:81:73",
            "net7": "96:73:44:3b:13:48",
            "net8": "7e:76:7b:24:9d:57",
            "net9": "46:78:54:8f:b9:91"
        },
        "leaf_1_0_5": {
            "net0": "8e:32:e5:c3:01:b1",
            "net1": "0a:91:0e:e8:e4:e7",
            "net10": "96:80:2f:4d:b9:4c",
            "net11": "1a:90:71:29:c5:16",
            "net12": "c6:67:43:fc:08:60",
            "net13": "b6:c1:a9:6a:93:10",
            "net14": "9a:b6:55:3f:d7:cd",
            "net15": "c6:ad:80:2f:70:3d",
            "net16": "62:d9:70:cb:ed:e3",
            "net2": "62:b7:72:bb:b8:3e",
            "net3": "c2:0d:29:b8:ff:1c",
            "net4": "9e:80:bd:e1:e5:52",
            "net5": "22:25:55:9a:6c:84",
            "net6": "42:87:cc:61:d4:10",
            "net7": "22:85:a2:bb:8e:a6",
            "net8": "76:b2:ee:31:48:85",
            "net9": "d6:9b:11:e0:f2:35"
        },
        "leaf_1_0_6": {
            "net0": "8a:75:8a:0c:6d:68",
            "net1": "22:b0:8a:03:87:4f",
            "net10": "46:bf:a9:2b:ec:0b",
            "net11": "56:38:f9:a1:9d:5a",
            "net12": "b2:ce:a3:30:ee:31",
            "net13": "06:a9:74:0f:0d:bb",
            "net14": "4e:69:af:1e:4c:79",
            "net15": "86:9e:c8:8f:22:47",
            "net16": "5a:f8:38:6d:b4:26",
            "net2": "ea:f6:fe:b7:9d:31",
            "net3": "1e:32:7b:6c:ea:3c",
            "net4": "4e:a1:91:01:46:a2",
            "net5": "8e:6e:a8:2d:2a:27",
            "net6": "ce:fd:ee:33:ce:46",
            "net7": "1a:90:e5:02:e8:e9",
            "net8": "8a:11:84:1e:ab:6b",
            "net9": "22:00:22:b8:55:bc"
        },
        "leaf_1_0_7": {
            "net0": "7a:e3:da:d5:48:a3",
            "net1": "06:82:12:f6:ec:ff",
            "net10": "02:79:fb:17:c4:19",
            "net11": "76:f5:1a:a5:72:ba",
            "net12": "96:d7:06:bf:46:70",
            "net13": "32:f8:db:a7:3b:7d",
            "net14": "52:72:c9:e1:89:27",
            "net15": "be:0a:f7:c7:13:32",
            "net16": "5e:e5:d6:1a:16:c9",
            "net2": "a6:c7:4d:b3:7f:5d",
            "net3": "aa:14:99:29:f4:49",
            "net4": "92:bc:55:56:50:8d",
            "net5": "2e:15:33:83:b5:26",
            "net6": "62:b4:1b:e0:ea:2b",
            "net7": "82:6d:f9:a8:02:46",
            "net8": "16:b2:5f:07:b4:27",
            "net9": "c6:be:79:0c:00:9c"
        },
        "leaf_1_0_8": {
            "net0": "7e:8c:48:81:aa:40",
            "net1": "12:b7:fa:85:ca:7e",
            "net10": "fa:68:d1:cf:99:db",
            "net11": "9e:a5:a6:0c:82:59",
            "net12": "22:b6:96:a7:a0:a3",
            "net13": "4a:1c:23:06:f8:55",
            "net14": "4e:b9:b1:cb:f2:74",
            "net15": "8e:2e:1d:f6:a7:b3",
            "net16": "5e:fe:10:11:37:4c",
            "net2": "36:07:9d:33:39:27",
            "net3": "16:18:87:de:4a:9b",
            "net4": "aa:fe:c7:72:c4:18",
            "net5": "a6:cf:a0:ad:88:f7",
            "net6": "32:77:55:64:3c:80",
            "net7": "0e:3c:af:40:fb:08",
            "net8": "06:31:6c:34:05:d4",
            "net9": "b6:06:f6:68:7a:fc"
        },
        "leaf_1_0_9": {
            "net0": "7e:de:5e:d3:a0:1e",
            "net1": "ae:39:b7:6b:db:52",
            "net10": "ba:fa:91:8b:58:d3",
            "net11": "9e:9d:2d:63:f9:7d",
            "net12": "fa:55:b9:a9:74:88",
            "net13": "86:91:85:ed:e6:c8",
            "net14": "b6:a0:32:ab:44:64",
            "net15": "4e:4a:2a:f3:75:71",
            "net16": "62:55:0d:66:20:e4",
            "net2": "26:54:07:7b:3a:46",
            "net3": "9e:cd:75:cc:fb:8f",
            "net4": "ca:10:14:58:f2:74",
            "net5": "ea:ab:dd:84:0c:40",
            "net6": "8a:02:9c:c9:8e:55",
            "net7": "6e:32:3d:0c:14:c3",
            "net8": "a2:1a:00:b4:5a:fb",
            "net9": "de:b2:74:fb:6e:a3"
        },
        "leaf_2_0_1": {
            "net0": "6e:8f:83:70:81:2a",
            "net1": "1a:7f:c7:b4:7e:f7",
            "net10": "b2:d5:47:41:23:05",
            "net11": "f2:e7:dc:bd:9f:b8",
            "net12": "32:f3:e4:82:fc:1a",
            "net13": "32:13:08:07:93:21",
            "net14": "b2:30:72:36:a3:52",
            "net15": "fe:eb:f2:60:e6:bd",
            "net16": "96:c7:dc:76:c5:3c",
            "net2": "ba:4e:db:d1:14:25",
            "net3": "96:43:16:77:e4:74",
            "net4": "1a:e5:f6:37:b5:5c",
            "net5": "1e:78:c0:80:19:38",
            "net6": "1e:96:d7:f6:ac:26",
            "net7": "76:8f:71:63:aa:08",
            "net8": "c6:08:26:d9:17:ef",
            "net9": "fa:64:ea:ac:e9:84"
        },
        "leaf_2_0_10": {
            "net0": "1a:25:eb:9d:45:f0",
            "net1": "9e:24:08:99:a7:8b",
            "net10": "1a:e8:37:a3:46:9f",
            "net11": "26:6e:dd:ca:9a:0a",
            "net12": "82:8a:bd:ae:b6:b2",
            "net13": "4e:ba:68:fe:a8:7c",
            "net14": "5a:ff:a2:a5:ec:84",
            "net15": "b2:92:a3:d3:7d:e4",
            "net16": "ee:7c:45:79:f5:b7",
            "net2": "f6:db:d3:1c:ff:ec",
            "net3": "4a:19:a9:63:52:93",
            "net4": "1e:62:b2:bc:e6:5e",
            "net5": "9a:a1:d4:9c:aa:5a",
            "net6": "82:7f:0c:38:0b:bb",
            "net7": "92:86:26:6a:63:b2",
            "net8": "52:37:76:65:b4:1b",
            "net9": "62:3c:8c:1b:55:d1"
        },
        "leaf_2_0_11": {
            "net0": "2a:6d:4c:e4:60:27",
            "net1": "e6:b6:9b:9d:c4:22",
            "net10": "c6:84:4a:2c:41:a1",
            "net11": "7a:df:a8:53:d8:d3",
            "net12": "ea:ff:98:f7:a0:3d",
            "net13": "9e:5a:21:4b:24:bc",
            "net14": "66:2b:2d:c7:fa:e6",
            "net15": "1e:45:4c:b4:bf:7f",
            "net16": "de:ed:d5:0f:18:c9",
            "net2": "76:82:44:dd:f4:e2",
            "net3": "ee:de:e5:40:3a:10",
            "net4": "82:e0:06:4a:ee:75",
            "net5": "06:67:87:3b:84:9e",
            "net6": "a2:27:40:55:86:e9",
            "net7": "06:da:57:39:36:b4",
            "net8": "46:eb:6d:1e:9d:0a",
            "net9": "f2:2e:89:ec:81:04"
        },
        "leaf_2_0_12": {
            "net0": "3e:ca:c5:ae:4f:db",
            "net1": "f6:c4:9a:1b:0a:e1",
            "net10": "8a:f1:11:7b:a8:34",
            "net11": "42:45:99:60:e0:38",
            "net12": "3a:0f:61:a9:15:c4",
            "net13": "42:e7:fd:7a:33:27",
            "net14": "56:da:87:e2:75:fb",
            "net15": "b2:fe:1d:17:c7:d4",
            "net16": "22:b3:af:a0:d3:f3",
            "net2": "9a:58:b6:3e:98:2f",
            "net3": "92:48:7e:23:66:6f",
            "net4": "c2:4b:c8:9e:38:1b",
            "net5": "12:2b:eb:5e:38:3b",
            "net6": "3a:20:78:a4:ac:b8",
            "net7": "36:b4:dd:51:0a:1e",
            "net8": "7a:64:cf:49:0f:5d",
            "net9": "ba:b4:6c:be:24:4d"
        },
        "leaf_2_0_13": {
            "net0": "5a:2c:a8:db:9a:35",
            "net1": "3e:16:60:06:27:32",
            "net10": "96:c5:16:59:31:e9",
            "net11": "1a:d9:cb:c5:4f:71",
            "net12": "72:70:f7:9a:b8:4f",
            "net13": "3e:43:ae:53:60:a4",
            "net14": "3a:51:e9:93:a2:19",
            "net15": "7a:30:b3:c6:3c:aa",
            "net16": "da:59:1d:d5:b4:77",
            "net2": "52:97:f5:df:bb:50",
            "net3": "6e:09:ad:bd:27:9e",
            "net4": "96:b4:3f:4a:d2:78",
            "net5": "5e:b2:5d:49:74:50",
            "net6": "62:70:48:c7:62:da",
            "net7": "36:a8:d7:7b:fe:2c",
            "net8": "ae:60:a7:fb:05:21",
            "net9": "62:f7:e1:2e:5d:04"
        },
        "leaf_2_0_14": {
            "net0": "92:44:52:9f:ec:d6",
            "net1": "c2:b2:a9:7b:d8:aa",
            "net10": "3a:86:0a:0c:ce:19",
            "net11": "b2:4e:eb:74:54:75",
            "net12": "0a:0d:67:dd:41:54",
            "net13": "d2:41:b5:4f:6f:fb",
            "net14": "f2:63:25:5e:7a:c1",
            "net15": "52:2b:b0:f9:01:55",
            "net16": "32:93:4c:1d:15:cf",
            "net2": "0a:78:d7:97:49:dc",
            "net3": "52:72:3e:a6:cd:ac",
            "net4": "9a:2b:b0:4b:c7:40",
            "net5": "9e:ca:ba:fe:16:ae",
            "net6": "62:09:f4:d2:37:98",
            "net7": "d6:5c:23:54:b3:a0",
            "net8": "46:ed:f5:ca:cf:6a",
            "net9": "02:b1:25:20:cf:c4"
        },
        "leaf_2_0_15": {
            "net0": "b2:4d:0b:d1:5b:89",
            "net1": "4e:82:af:82:12:fb",
            "net10": "1a:a4:59:dd:ec:0c",
            "net11": "ca:4b:0e:82:ca:ba",
            "net12": "6a:a9:e6:b7:ac:55",
            "net13": "76:ce:ec:c4:dd:93",
            "net14": "66:ed:52:83:3d:26",
            "net15": "e2:b9:29:b2:27:e7",
            "net16": "2a:c3:99:39:b1:18",
            "net2": "8e:e6:dc:0d:58:9b",
            "net3": "5e:a6:fa:b8:cd:65",
            "net4": "b2:03:29:1c:7c:3a",
            "net5": "e6:45:08:e1:65:61",
            "net6": "ba:a1:3f:e4:a1:a2",
            "net7": "32:a4:02:bb:b4:d7",
            "net8": "7a:16:5c:a4:4b:b3",
            "net9": "22:f6:0c:80:0f:5e"
        },
        "leaf_2_0_16": {
            "net0": "12:60:b2:da:22:49",
            "net1": "b2:e2:fe:5d:f5:06",
            "net10": "ce:23:c6:cf:07:4a",
            "net11": "a2:2f:05:b3:a2:35",
            "net12": "22:f9:16:7f:8f:7f",
            "net13": "a6:4b:f8:1c:7e:6d",
            "net14": "9a:dd:ca:bf:c7:72",
            "net15": "ea:59:88:93:46:ad",
            "net16": "2e:d8:00:e6:dd:5b",
            "net2": "7e:31:d1:f5:4c:21",
            "net3": "8a:2b:ff:f2:da:98",
            "net4": "1a:15:b3:3e:a3:bf",
            "net5": "fe:0e:03:30:7d:2c",
            "net6": "0a:93:c6:b4:4e:55",
            "net7": "5e:b4:58:7c:25:0a",
            "net8": "02:5c:1c:0a:88:45",
            "net9": "3e:c1:0a:2a:1a:7b"
        },
        "leaf_2_0_2": {
            "net0": "a2:1f:1e:22:34:01",
            "net1": "7e:39:91:ca:52:31",
            "net10": "06:e6:c1:8b:16:58",
            "net11": "9a:ec:79:d5:c8:8d",
            "net12": "f6:b5:ec:09:d0:fa",
            "net13": "ae:72:e8:9b:d1:c8",
            "net14": "82:f2:7c:3a:f6:b8",
            "net15": "ca:6c:97:b8:c5:89",
            "net16": "4a:10:37:52:3d:50",
            "net2": "2a:4c:78:1d:03:4d",
            "net3": "ae:99:d1:aa:80:34",
            "net4": "f2:aa:fc:1f:cf:4e",
            "net5": "4e:9e:7b:80:94:85",
            "net6": "36:e0:22:82:0d:68",
            "net7": "82:80:ae:39:80:66",
            "net8": "76:99:67:13:e0:81",
            "net9": "9e:90:9f:46:99:c3"
        },
        "leaf_2_0_3": {
            "net0": "66:c0:b9:bc:3e:5f",
            "net1": "de:5a:72:7d:1f:99",
            "net10": "86:05:ea:e8:9b:5a",
            "net11": "32:35:b2:3c:7a:75",
            "net12": "a2:ba:69:2c:77:91",
            "net13": "ce:96:75:3c:20:c2",
            "net14": "12:a9:31:d1:8c:e9",
            "net15": "3a:e2:d1:26:1f:9b",
            "net16": "1e:28:a0:32:4f:44",
            "net2": "b6:15:f1:da:11:ba",
            "net3": "5a:b5:14:11:ad:73",
            "net4": "02:30:08:1b:89:d2",
            "net5": "2e:ca:3b:87:18:e1",
            "net6": "ca:55:b8:4a:5c:f0",
            "net7": "ae:3e:94:fa:c6:cb",
            "net8": "de:eb:81:a8:f0:11",
            "net9": "3a:4f:9b:3d:9c:a7"
        },
        "leaf_2_0_4": {
            "net0": "f2:13:54:00:35:7a",
            "net1": "ca:bd:d7:d0:90:9f",
            "net10": "2a:4a:4f:28:49:99",
            "net11": "0e:c4:76:34:bf:b6",
            "net12": "7a:05:60:35:e7:d8",
            "net13": "76:f2:c9:07:12:c7",
            "net14": "b6:a6:04:91:88:d2",
            "net15": "fe:26:1c:8c:d2:f7",
            "net16": "de:71:be:1b:93:a9",
            "net2": "12:df:0f:87:7e:04",
            "net3": "32:35:7f:38:fc:48",
            "net4": "82:04:87:a4:2f:16",
            "net5": "a2:a1:47:83:b3:21",
            "net6": "9a:b0:71:4f:64:e0",
            "net7": "2e:a8:74:ab:6f:98",
            "net8": "8e:8f:8c:af:68:fc",
            "net9": "1a:8e:71:c0:04:44"
        },
        "leaf_2_0_5": {
            "net0": "f2:d6:cb:96:6d:2e",
            "net1": "ce:f4:da:0d:ae:a1",
            "net10": "2a:ac:8a:0f:2d:84",
            "net11": "a6:4e:0c:e0:7f:8d",
            "net12": "92:d0:dc:f0:65:3e",
            "net13": "7e:88:38:56:cf:ee",
            "net14": "a6:2e:4e:ee:d0:77",
            "net15": "2e:e8:b6:7a:a0:b8",
            "net16": "7a:23:bf:62:37:2b",
            "net2": "f2:4d:27:8d:16:d7",
            "net3": "b2:1b:37:b6:21:8c",
            "net4": "4e:f0:51:1e:fd:eb",
            "net5": "e6:f4:06:df:ce:4f",
            "net6": "ce:a6:0e:fe:bf:0b",
            "net7": "9a:a0:27:36:89:1f",
            "net8": "12:06:07:1f:15:f8",
            "net9": "5a:59:c4:61:b0:72"
        },
        "leaf_2_0_6": {
            "net0": "2a:ee:24:af:0f:a6",
            "net1": "9a:26:02:c1:2e:bb",
            "net10": "c6:7a:51:b4:79:0d",
            "net11": "82:61:f7:ff:0c:4b",
            "net12": "ba:b3:e5:d8:e3:c1",
            "net13": "c6:20:67:59:40:4f",
            "net14": "be:52:4e:e9:68:a6",
            "net15": "de:9b:d9:37:9a:92",
            "net16": "ea:7a:e2:00:ef:e3",
            "net2": "6e:09:37:cd:29:02",
            "net3": "da:0c:00:05:97:0c",
            "net4": "be:0f:52:cc:4f:62",
            "net5": "3e:35:72:e8:dc:81",
            "net6": "ee:76:49:31:79:65",
            "net7": "22:4d:c2:c7:05:4c",
            "net8": "aa:85:13:17:a3:2f",
            "net9": "52:06:65:ec:12:d1"
        },
        "leaf_2_0_7": {
            "net0": "da:f7:53:83:90:5b",
            "net1": "8e:22:f2:ed:94:ec",
            "net10": "32:f2:3d:6f:7a:9f",
            "net11": "92:da:b4:2d:2b:6a",
            "net12": "ea:d0:b1:d2:0d:19",
            "net13": "3a:40:87:2b:0e:29",
            "net14": "3e:cb:cc:e4:28:82",
            "net15": "d2:9c:3d:c3:9a:da",
            "net16": "e2:02:15:da:84:ea",
            "net2": "7e:66:98:13:85:04",
            "net3": "b2:0a:49:e6:31:73",
            "net4": "4a:d3:76:6f:9f:23",
            "net5": "42:53:2e:9c:13:16",
            "net6": "26:1a:08:62:4c:22",
            "net7": "e2:9f:4f:f7:77:dc",
            "net8": "d6:df:a6:94:7a:65",
            "net9": "ea:79:c2:f0:fc:1e"
        },
        "leaf_2_0_8": {
            "net0": "aa:5c:f6:2f:e9:d4",
            "net1": "96:a0:7f:6c:26:a7",
            "net10": "9e:c9:a8:a1:fc:6a",
            "net11": "86:86:dd:5e:de:1f",
            "net12": "fa:48:53:eb:7b:f2",
            "net13": "2e:60:c1:2b:26:0e",
            "net14": "82:11:af:e3:a9:7c",
            "net15": "da:51:de:4b:42:ce",
            "net16": "ca:bf:94:14:d3:81",
            "net2": "8a:3c:46:7f:48:89",
            "net3": "c6:81:f1:8e:ab:4f",
            "net4": "72:2c:dc:8a:04:9a",
            "net5": "d6:03:87:9b:81:16",
            "net6": "6a:d9:89:0c:df:df",
            "net7": "82:2b:b2:b9:cd:da",
            "net8": "a6:e6:50:1c:50:09",
            "net9": "22:3c:59:af:c8:13"
        },
        "leaf_2_0_9": {
            "net0": "5e:23:5b:b6:b7:f0",
            "net1": "e2:a0:6b:79:08:9f",
            "net10": "4e:20:a6:e5:8f:24",
            "net11": "0e:29:33:6c:62:65",
            "net12": "fa:48:16:a1:01:3e",
            "net13": "42:73:fa:c7:51:09",
            "net14": "5e:e9:12:6d:83:d0",
            "net15": "0e:45:53:15:bd:6b",
            "net16": "c6:28:2e:70:4f:9a",
            "net2": "9a:6f:fc:cf:98:df",
            "net3": "ea:eb:e6:99:38:11",
            "net4": "e2:e3:6d:6e:26:b6",
            "net5": "76:e7:57:df:df:5e",
            "net6": "fa:21:bd:cb:95:55",
            "net7": "22:85:a2:74:6e:9a",
            "net8": "b2:2b:27:91:61:f0",
            "net9": "76:e2:42:fd:77:86"
        },
        "spine_1_1_1": {
            "net0": "46:04:e6:cb:b0:e7",
            "net1": "ee:47:ab:e5:8e:79",
            "net10": "fa:ad:2b:c1:39:eb",
            "net11": "a6:1a:13:26:d8:5c",
            "net12": "a2:43:63:d0:d6:f4",
            "net13": "56:fd:06:1d:5d:ca",
            "net14": "2a:dc:17:bb:28:74",
            "net15": "8a:00:b4:86:99:97",
            "net16": "4a:86:a4:1b:32:c6",
            "net17": "36:16:5c:d2:54:b5",
            "net18": "fa:bd:5d:65:03:59",
            "net19": "a6:72:79:bb:da:09",
            "net2": "b2:35:ba:4c:87:54",
            "net20": "e6:4a:1a:09:8b:6a",
            "net21": "0e:12:30:88:d3:d1",
            "net22": "1a:75:1c:73:7d:5a",
            "net23": "4a:d7:6c:75:b0:eb",
            "net24": "ee:e9:78:ab:51:51",
            "net25": "06:8b:95:dd:4f:7e",
            "net26": "9a:7a:6c:85:38:f2",
            "net27": "f6:6d:76:5d:a3:c8",
            "net28": "9a:62:a2:b1:3f:ac",
            "net29": "36:5a:51:21:96:ad",
            "net3": "fa:15:3b:d3:a8:79",
            "net30": "46:0c:5c:34:16:eb",
            "net31": "72:7b:de:89:a4:6e",
            "net4": "fe:13:17:f0:05:c8",
            "net5": "6a:22:50:c2:0c:84",
            "net6": "ea:1e:2a:84:10:13",
            "net7": "ca:de:4a:37:c5:73",
            "net8": "da:b7:f1:cf:20:84",
            "net9": "9e:f9:48:df:c8:31"
        },
        "spine_1_1_10": {
            "net0": "7e:ef:ed:03:c7:5d",
            "net1": "86:2c:69:7a:56:68",
            "net10": "a6:ed:74:c6:fe:6c",
            "net11": "9a:91:14:74:86:fe",
            "net12": "6a:2c:c3:5f:11:78",
            "net13": "ca:38:a0:60:32:02",
            "net14": "0a:32:d7:36:a1:5f",
            "net15": "c6:57:2c:98:7f:a9",
            "net16": "62:41:49:f4:6f:4b",
            "net17": "6e:a7:3f:b0:8a:32",
            "net18": "8a:95:3f:e9:f2:db",
            "net19": "9a:53:85:bd:0d:59",
            "net2": "9a:f9:44:32:25:cc",
            "net20": "f6:5b:d0:2f:71:a7",
            "net21": "4e:9f:d3:c5:dd:eb",
            "net22": "ca:21:33:b4:fd:3b",
            "net23": "72:24:eb:4e:3e:c2",
            "net24": "c6:1c:21:f3:10:2a",
            "net25": "52:e5:1c:ad:b1:44",
            "net26": "7a:33:43:18:dd:7c",
            "net27": "b2:8a:e3:32:47:d7",
            "net28": "72:56:a6:0b:39:68",
            "net29": "12:5b:f2:70:50:4f",
            "net3": "ce:83:d5:29:6f:3a",
            "net30": "f2:61:58:07:1f:19",
            "net31": "22:2c:91:9c:da:aa",
            "net4": "c6:5c:fb:32:8f:37",
            "net5": "d6:42:a4:a0:09:ea",
            "net6": "ee:d3:42:a9:f4:ec",
            "net7": "b6:a4:02:a9:26:dd",
            "net8": "9a:d5:f1:10:59:73",
            "net9": "a6:f4:fd:1b:c5:5b"
        },
        "spine_1_1_11": {
            "net0": "aa:4b:ae:13:07:12",
            "net1": "0e:b9:fa:6e:d7:83",
            "net10": "c6:71:3b:30:b6:48",
            "net11": "ce:e1:50:27:30:ee",
            "net12": "6e:91:72:5d:ac:2f",
            "net13": "4a:ef:68:f9:18:d5",
            "net14": "9e:4c:8c:4d:8f:e1",
            "net15": "ce:66:6f:8f:89:ef",
            "net16": "0e:3d:77:8c:b2:7b",
            "net17": "de:45:af:22:22:f2",
            "net18": "86:2c:f4:ce:46:2a",
            "net19": "ba:b3:07:a8:d6:27",
            "net2": "d6:3e:d8:f5:48:36",
            "net20": "8a:7a:63:51:68:0d",
            "net21": "5a:b1:78:93:40:ee",
            "net22": "2e:fb:6b:88:f5:07",
            "net23": "c6:c6:9b:de:42:3e",
            "net24": "c2:94:c7:29:ca:08",
            "net25": "b2:e6:2a:02:77:3f",
            "net26": "e6:82:95:09:a0:31",
            "net27": "02:77:93:dd:4b:87",
            "net28": "aa:e7:35:d3:bf:69",
            "net29": "2e:b0:b6:30:7a:8b",
            "net3": "6a:81:f9:43:36:59",
            "net30": "e2:80:ab:54:47:c7",
            "net31": "de:71:ed:5f:e7:e9",
            "net4": "d6:f2:eb:f0:60:1c",
            "net5": "32:23:08:35:ce:d5",
            "net6": "32:b8:e3:f7:80:75",
            "net7": "6e:96:16:20:67:54",
            "net8": "f6:08:8f:6d:3c:a9",
            "net9": "42:68:b6:04:6f:e5"
        },
        "spine_1_1_12": {
            "net0": "76:60:a9:56:d5:2f",
            "net1": "06:2b:06:1e:10:b6",
            "net10": "fa:88:4d:6e:86:e1",
            "net11": "be:28:cb:c0:73:1e",
            "net12": "e6:4d:fe:cf:ac:f0",
            "net13": "ce:4f:92:ff:fd:4b",
            "net14": "ae:05:61:82:ae:af",
            "net15": "1a:7c:99:c0:6f:d7",
            "net16": "ce:c6:44:39:b8:00",
            "net17": "da:c6:9e:a0:06:93",
            "net18": "02:f7:18:fa:cd:ec",
            "net19": "16:14:10:ce:30:ff",
            "net2": "4e:27:9f:ea:18:27",
            "net20": "2a:30:e5:de:6b:f4",
            "net21": "52:76:f7:4a:ea:f5",
            "net22": "aa:31:03:c9:59:2f",
            "net23": "96:22:7e:3f:f5:9e",
            "net24": "d2:85:51:47:a5:92",
            "net25": "06:a8:3e:ab:b9:3a",
            "net26": "d6:0e:b4:b9:11:74",
            "net27": "ee:4e:5f:7b:92:d6",
            "net28": "32:26:08:36:bd:a0",
            "net29": "d6:c5:4b:2e:28:d1",
            "net3": "9e:98:b7:69:6c:db",
            "net30": "16:16:8d:9a:93:d2",
            "net31": "6a:49:8f:aa:65:9c",
            "net4": "82:cf:cb:90:9a:a1",
            "net5": "aa:25:97:f0:fd:d5",
            "net6": "12:55:01:79:50:a2",
            "net7": "02:a5:98:b7:4a:57",
            "net8": "1e:47:89:cb:3c:13",
            "net9": "ca:99:f8:9d:c6:8f"
        },
        "spine_1_1_13": {
            "net0": "ba:5a:06:fb:8a:16",
            "net1": "a2:4c:ca:f2:e0:31",
            "net10": "26:a3:5a:fb:21:49",
            "net11": "36:a6:e4:a3:62:31",
            "net12": "d6:a8:1b:64:5d:66",
            "net13": "36:97:8f:ca:d8:50",
            "net14": "1e:f6:97:9c:6b:3a",
            "net15": "e2:6e:12:90:8a:e0",
            "net16": "a6:17:ab:4d:7c:74",
            "net17": "ce:cb:ba:2f:d4:ac",
            "net18": "72:b9:0b:0a:d0:62",
            "net19": "92:c2:38:9d:de:02",
            "net2": "12:b4:47:cd:59:ed",
            "net20": "fe:0d:26:d5:b5:2b",
            "net21": "e2:2d:e8:11:ba:26",
            "net22": "f6:29:fb:29:c0:86",
            "net23": "96:5b:06:21:6b:c3",
            "net24": "1e:28:c0:2c:a4:c7",
            "net25": "ba:85:94:95:78:a1",
            "net26": "6e:5a:d6:db:d0:85",
            "net27": "36:30:b0:4f:a8:3a",
            "net28": "5a:86:b7:bf:da:be",
            "net29": "6e:c2:80:b4:c0:2f",
            "net3": "22:41:0d:4c:6b:5f",
            "net30": "6a:37:3c:d3:29:24",
            "net31": "2a:d2:22:1d:34:60",
            "net4": "66:f7:50:96:c9:1a",
            "net5": "ea:bd:e8:92:78:2d",
            "net6": "ea:21:2c:86:c1:73",
            "net7": "e6:b7:1f:8a:87:8a",
            "net8": "e2:70:13:ef:b9:07",
            "net9": "e2:87:81:b7:f5:67"
        },
        "spine_1_1_14": {
            "net0": "86:98:09:45:27:9f",
            "net1": "3e:5f:13:4d:eb:a9",
            "net10": "9e:ca:ec:10:9c:7b",
            "net11": "5a:b7:f1:f6:c3:3a",
            "net12": "ea:46:4a:46:5b:0e",
            "net13": "3e:ab:99:21:07:10",
            "net14": "1e:76:26:3e:a1:ff",
            "net15": "6a:60:ef:ef:8e:ee",
            "net16": "86:2a:6f:03:74:19",
            "net17": "b6:bd:26:1b:b0:f3",
            "net18": "4e:eb:e3:c4:45:ae",
            "net19": "76:25:e1:49:4a:04",
            "net2": "fa:71:ed:3e:b8:63",
            "net20": "82:f7:b8:17:6b:2d",
            "net21": "52:9d:a1:40:5a:70",
            "net22": "9a:d4:38:29:98:2e",
            "net23": "a6:cf:9b:91:32:59",
            "net24": "92:35:4f:15:8f:da",
            "net25": "4a:f8:a7:3f:a9:16",
            "net26": "1a:04:d7:8c:e2:02",
            "net27": "6e:8f:c0:11:1f:d1",
            "net28": "06:d0:73:fa:9d:de",
            "net29": "b2:53:93:da:4a:d0",
            "net3": "42:d8:fa:d8:88:73",
            "net30": "72:09:c5:ca:19:7a",
            "net31": "76:4f:38:d2:86:cf",
            "net4": "36:f1:7c:d1:b2:f5",
            "net5": "ce:24:91:5c:68:e5",
            "net6": "82:cd:a3:0f:d3:28",
            "net7": "66:c9:1c:ee:2a:39",
            "net8": "22:26:b2:fb:4e:6f",
            "net9": "6e:48:ed:ec:fd:ae"
        },
        "spine_1_1_15": {
            "net0": "72:2c:7d:2d:d3:8b",
            "net1": "8a:9f:ee:e8:7b:6e",
            "net10": "72:3c:9a:7e:85:3c",
            "net11": "ce:bb:60:f0:d5:32",
            "net12": "7e:0a:2a:64:8e:3a",
            "net13": "52:63:dd:f0:f3:be",
            "net14": "72:c7:3c:1e:8c:10",
            "net15": "b6:1e:1f:38:1e:57",
            "net16": "2a:db:ef:84:a9:d4",
            "net17": "8e:9b:70:10:f3:36",
            "net18": "36:75:30:b3:ba:9b",
            "net19": "76:6e:d0:77:02:f2",
            "net2": "c2:af:7c:4b:83:40",
            "net20": "ca:c5:1f:84:d3:72",
            "net21": "a6:d2:8a:09:3c:e2",
            "net22": "ca:16:39:aa:cd:65",
            "net23": "ae:b9:e3:88:8b:f1",
            "net24": "c6:36:95:d2:22:0e",
            "net25": "4e:cf:81:57:98:0c",
            "net26": "f2:e7:b5:8d:49:84",
            "net27": "8a:b7:eb:41:01:ab",
            "net28": "a2:23:d4:68:11:88",
            "net29": "fe:83:08:fc:1a:48",
            "net3": "c2:73:91:8f:ee:da",
            "net30": "d6:cf:66:17:64:d6",
            "net31": "7e:b1:51:47:3f:df",
            "net4": "ce:21:a4:b0:47:be",
            "net5": "fa:92:56:11:b8:b1",
            "net6": "0e:72:82:d0:c4:d9",
            "net7": "aa:3c:13:00:2c:9a",
            "net8": "b6:c0:36:bc:7d:30",
            "net9": "02:5a:de:36:ce:a2"
        },
        "spine_1_1_16": {
            "net0": "d6:3f:14:f5:5e:d9",
            "net1": "4a:c2:8a:21:9a:45",
            "net10": "ce:42:1e:18:58:8f",
            "net11": "92:56:0f:c0:ab:8f",
            "net12": "3e:76:7b:a3:e8:c5",
            "net13": "46:16:a8:8f:50:e0",
            "net14": "66:df:79:3f:30:17",
            "net15": "36:9b:c9:10:f8:97",
            "net16": "3a:54:25:d8:01:af",
            "net17": "2a:87:01:d5:c1:3a",
            "net18": "fa:51:ab:c1:d5:e9",
            "net19": "46:40:b7:2b:9f:4b",
            "net2": "b2:5b:15:0e:69:5b",
            "net20": "26:27:22:74:8a:14",
            "net21": "d2:82:5c:f3:e3:9c",
            "net22": "d2:a6:e0:7a:f7:3a",
            "net23": "ae:56:bb:ff:7a:08",
            "net24": "f6:9a:a2:db:cb:60",
            "net25": "5e:19:18:85:d8:24",
            "net26": "de:f2:59:30:68:57",
            "net27": "c2:91:ed:aa:af:20",
            "net28": "92:80:31:ef:1d:96",
            "net29": "ea:73:c9:62:c3:5e",
            "net3": "86:a7:e9:34:97:d7",
            "net30": "2a:e5:c5:ed:a3:94",
            "net31": "52:b3:4b:34:20:4d",
            "net4": "d2:2a:7c:70:e3:55",
            "net5": "42:64:e3:e9:65:31",
            "net6": "4a:57:a2:fb:b3:57",
            "net7": "06:93:71:be:09:fc",
            "net8": "4e:fb:48:8d:69:6d",
            "net9": "ce:03:2f:91:ca:73"
        },
        "spine_1_1_2": {
            "net0": "3e:c7:8a:f5:38:2d",
            "net1": "ee:ae:20:18:56:0d",
            "net10": "e2:67:71:14:82:24",
            "net11": "42:da:3c:df:6f:75",
            "net12": "72:22:04:e8:82:b3",
            "net13": "5e:71:b0:83:b2:74",
            "net14": "b6:1c:2c:be:43:ba",
            "net15": "62:98:0a:38:fa:4f",
            "net16": "8a:94:3d:cc:42:93",
            "net17": "02:59:e2:d6:9a:8b",
            "net18": "e6:57:fc:bc:93:47",
            "net19": "ea:d9:a3:95:43:8c",
            "net2": "d2:93:e6:fc:29:f2",
            "net20": "62:35:8c:ce:31:d0",
            "net21": "d6:5a:4d:00:5a:b1",
            "net22": "fa:b6:c0:36:48:6e",
            "net23": "d6:4e:64:0f:bf:65",
            "net24": "0e:06:d3:22:c5:96",
            "net25": "7a:bc:00:5c:8c:7c",
            "net26": "ea:ef:b1:39:f0:3c",
            "net27": "c2:a2:cf:32:f5:9d",
            "net28": "42:22:68:2e:00:39",
            "net29": "9a:1c:86:53:b0:bd",
            "net3": "ca:2d:e6:0b:72:10",
            "net30": "de:67:0e:bf:8b:9f",
            "net31": "1e:f6:f7:e2:18:38",
            "net4": "a2:9d:7a:90:30:10",
            "net5": "76:f8:a0:c6:0b:c4",
            "net6": "9e:66:f8:fd:7b:23",
            "net7": "1e:31:9f:72:23:8b",
            "net8": "56:df:86:2c:4f:55",
            "net9": "3e:76:0c:a5:63:77"
        },
        "spine_1_1_3": {
            "net0": "82:b8:92:0e:30:13",
            "net1": "d6:dc:00:66:07:54",
            "net10": "f6:07:bc:1c:eb:13",
            "net11": "fe:a5:73:15:35:1e",
            "net12": "96:ef:b3:ac:fb:4e",
            "net13": "36:81:ce:c7:02:76",
            "net14": "ca:c7:92:06:e9:f6",
            "net15": "1a:ee:ae:e9:f3:18",
            "net16": "a2:87:6f:99:fc:ac",
            "net17": "42:c7:0e:3b:c9:66",
            "net18": "b2:9b:a3:5b:fe:d5",
            "net19": "ae:1f:35:04:9b:c4",
            "net2": "a2:aa:d9:67:2b:05",
            "net20": "9a:f6:c8:39:fd:7e",
            "net21": "36:8c:44:d4:15:37",
            "net22": "de:82:a7:9b:ba:1b",
            "net23": "3a:cc:66:52:bc:f5",
            "net24": "ce:98:13:e3:63:ef",
            "net25": "1e:5d:9e:9c:0f:ec",
            "net26": "5e:16:21:38:0e:4a",
            "net27": "de:23:f4:a3:50:39",
            "net28": "c6:cb:19:5d:35:d1",
            "net29": "c6:4e:d4:96:e0:0f",
            "net3": "32:a8:40:db:9d:3b",
            "net30": "4a:92:5c:2d:26:15",
            "net31": "ba:12:6d:00:a4:95",
            "net4": "0e:9d:06:47:1d:90",
            "net5": "72:6c:18:8e:97:9d",
            "net6": "5e:63:48:f2:64:f7",
            "net7": "5e:38:ec:0b:ee:f2",
            "net8": "4a:b1:27:d7:e3:ae",
            "net9": "56:0c:85:1b:0c:41"
        },
        "spine_1_1_4": {
            "net0": "06:f3:72:4f:24:6f",
            "net1": "2a:e7:a6:7e:67:06",
            "net10": "2a:7e:9f:f9:88:49",
            "net11": "26:d0:93:71:6a:59",
            "net12": "32:c9:57:81:8b:48",
            "net13": "0e:86:cf:61:61:5c",
            "net14": "62:56:ee:7c:88:d2",
            "net15": "7a:f8:d0:44:59:6b",
            "net16": "aa:98:3d:12:d1:35",
            "net17": "0e:47:53:92:96:56",
            "net18": "c6:83:cc:44:4b:f3",
            "net19": "02:41:ad:a6:01:f0",
            "net2": "12:c5:a6:39:d0:8f",
            "net20": "9e:90:67:91:72:2b",
            "net21": "da:36:ac:26:88:73",
            "net22": "ee:39:51:7c:62:05",
            "net23": "56:a0:11:66:72:e2",
            "net24": "0e:5e:bb:a4:64:f6",
            "net25": "ce:af:f5:90:bf:6e",
            "net26": "3a:3b:db:14:0e:7f",
            "net27": "de:f2:fa:f0:6f:b6",
            "net28": "ea:9e:88:f8:b3:2d",
            "net29": "c6:ed:98:23:79:b4",
            "net3": "ca:75:33:fc:d1:0d",
            "net30": "1e:03:e6:08:02:9b",
            "net31": "f2:f1:e3:4f:a2:33",
            "net4": "f2:45:24:01:5c:8e",
            "net5": "be:19:4d:c7:1f:3a",
            "net6": "02:58:b6:da:b5:35",
            "net7": "46:5a:c9:f8:92:c4",
            "net8": "ba:e9:ac:ab:2e:88",
            "net9": "de:3f:ad:a2:3e:33"
        },
        "spine_1_1_5": {
            "net0": "36:ce:e4:c6:90:42",
            "net1": "8a:02:f6:e2:b8:54",
            "net10": "86:62:b6:40:ef:d1",
            "net11": "1e:f7:b1:38:42:3b",
            "net12": "4a:09:d8:17:61:56",
            "net13": "ba:87:a7:64:4f:a9",
            "net14": "26:16:0c:b0:be:f1",
            "net15": "ce:ee:87:9e:2b:61",
            "net16": "12:26:01:39:50:f3",
            "net17": "4a:65:f0:49:21:3d",
            "net18": "0a:fa:ba:17:a7:71",
            "net19": "ae:83:cd:8c:01:81",
            "net2": "86:26:2a:52:fa:1e",
            "net20": "ae:d0:c6:40:85:98",
            "net21": "a6:6d:b1:45:82:1a",
            "net22": "26:2e:f0:ff:1c:d2",
            "net23": "4e:94:03:30:97:3c",
            "net24": "42:12:31:c2:9b:ed",
            "net25": "66:65:79:bd:c3:18",
            "net26": "4a:d7:21:c7:63:ed",
            "net27": "9e:78:b5:be:c0:69",
            "net28": "62:14:f5:64:15:a2",
            "net29": "ba:60:6c:b6:39:1d",
            "net3": "82:a6:00:b4:00:7a",
            "net30": "d6:3b:c9:a5:98:f9",
            "net31": "9a:33:2d:d8:11:f0",
            "net4": "86:0b:ac:b2:e2:15",
            "net5": "46:87:0d:f0:68:46",
            "net6": "aa:36:36:cd:47:44",
            "net7": "c6:df:04:85:94:eb",
            "net8": "36:43:56:71:15:5d",
            "net9": "d6:32:04:75:76:9b"
        },
        "spine_1_1_6": {
            "net0": "c6:bc:b6:51:4f:55",
            "net1": "d6:12:7a:67:e0:b9",
            "net10": "d6:5c:6f:0a:43:48",
            "net11": "f2:fa:c3:4f:5e:f5",
            "net12": "5e:1a:2f:cc:2c:ae",
            "net13": "06:75:fe:bb:2a:f1",
            "net14": "ae:5b:87:3b:70:77",
            "net15": "7e:36:e1:ca:54:ca",
            "net16": "2e:00:a7:ab:58:61",
            "net17": "ca:36:25:ec:14:c3",
            "net18": "16:60:16:77:4e:72",
            "net19": "2e:a7:f9:70:c2:84",
            "net2": "76:81:da:d2:02:60",
            "net20": "de:83:18:93:a4:b1",
            "net21": "26:70:cb:8b:98:0c",
            "net22": "e6:22:85:aa:6c:95",
            "net23": "ae:f5:f4:c3:34:33",
            "net24": "8e:7a:e6:2d:04:32",
            "net25": "4e:72:e1:03:8f:5c",
            "net26": "96:d8:51:92:ee:96",
            "net27": "3a:4f:1e:92:e6:47",
            "net28": "22:c7:5f:d3:f9:c3",
            "net29": "5e:c8:86:83:30:6b",
            "net3": "fe:c2:de:00:01:86",
            "net30": "da:58:b3:33:26:a3",
            "net31": "42:0c:28:cc:d8:09",
            "net4": "8e:26:72:4b:64:cb",
            "net5": "6a:39:30:a2:60:c2",
            "net6": "1a:b7:a9:cd:f1:fc",
            "net7": "4a:a6:ec:07:52:fd",
            "net8": "ca:1c:29:f7:94:ab",
            "net9": "c6:cd:e9:ec:76:53"
        },
        "spine_1_1_7": {
            "net0": "52:ae:13:12:ea:62",
            "net1": "6e:c8:d8:15:54:29",
            "net10": "8e:94:05:55:15:e5",
            "net11": "86:fe:e2:a4:46:af",
            "net12": "22:cf:0b:3b:3b:cb",
            "net13": "52:49:65:09:fd:fd",
            "net14": "d2:fb:86:06:28:b1",
            "net15": "0e:2f:6a:59:fe:f6",
            "net16": "e2:f9:0c:59:4a:f4",
            "net17": "6e:7a:a4:df:2c:92",
            "net18": "4e:49:8b:87:b8:74",
            "net19": "8a:14:5f:aa:fb:a7",
            "net2": "da:0d:60:f3:ff:52",
            "net20": "8e:76:29:cd:00:7f",
            "net21": "4a:f2:f7:e1:d3:95",
            "net22": "ce:64:05:0f:31:5c",
            "net23": "e2:71:ec:5e:0a:28",
            "net24": "66:60:4f:d5:53:0f",
            "net25": "62:47:8c:ee:81:37",
            "net26": "22:3e:05:09:fc:27",
            "net27": "a6:2b:fa:a8:40:24",
            "net28": "ea:f8:b5:21:5a:5b",
            "net29": "f6:f8:e1:6f:79:b4",
            "net3": "32:33:35:54:a7:62",
            "net30": "da:83:39:91:0f:5e",
            "net31": "de:93:be:d2:b5:66",
            "net4": "aa:f0:ea:d4:73:a4",
            "net5": "b6:b6:fe:74:17:9b",
            "net6": "3a:08:4a:59:6a:33",
            "net7": "12:05:72:46:4e:93",
            "net8": "ae:bb:1d:e1:c9:a6",
            "net9": "96:d6:d8:dc:2a:d4"
        },
        "spine_1_1_8": {
            "net0": "7e:51:d6:59:34:e1",
            "net1": "06:f1:9c:92:86:d8",
            "net10": "e2:b6:9d:fa:93:ce",
            "net11": "e2:2d:c6:3c:fd:5f",
            "net12": "16:c2:8f:d7:84:9a",
            "net13": "22:53:d3:2b:67:d6",
            "net14": "6e:e3:d6:ef:b3:f2",
            "net15": "9a:23:09:90:c3:8e",
            "net16": "e2:83:5b:43:53:a2",
            "net17": "2a:af:05:a5:cd:ad",
            "net18": "8a:f8:e3:25:35:6b",
            "net19": "7e:25:f7:16:22:ab",
            "net2": "62:71:a2:8d:3a:5e",
            "net20": "1a:af:28:89:9a:08",
            "net21": "b6:06:ff:b4:6c:65",
            "net22": "a2:0c:c4:81:bd:55",
            "net23": "fa:61:59:5a:67:20",
            "net24": "ae:31:43:f5:63:ed",
            "net25": "ca:f3:8a:e5:29:5f",
            "net26": "d2:6a:d3:cf:0a:2d",
            "net27": "ea:46:dc:89:1a:8c",
            "net28": "ea:f7:23:0b:84:ce",
            "net29": "be:d6:1a:13:c3:00",
            "net3": "92:a3:af:0c:1b:9f",
            "net30": "4e:6b:5c:e7:a1:a3",
            "net31": "fe:66:74:ab:74:13",
            "net4": "8e:08:ef:a0:f0:dd",
            "net5": "8a:b4:63:c8:19:52",
            "net6": "f6:1a:d2:1f:42:0a",
            "net7": "36:06:84:21:5b:69",
            "net8": "3a:d5:1e:83:a9:93",
            "net9": "22:80:9a:f7:7c:fa"
        },
        "spine_1_1_9": {
            "net0": "e2:bc:d5:31:09:d4",
            "net1": "5a:b6:d7:63:11:9f",
            "net10": "36:a1:2e:59:b1:d2",
            "net11": "ca:d7:75:f3:98:a8",
            "net12": "9a:33:bd:e0:fd:62",
            "net13": "b6:87:ee:cf:2e:b6",
            "net14": "3a:d9:48:54:ef:1e",
            "net15": "12:8d:d9:22:fa:38",
            "net16": "6e:08:46:ba:5a:1b",
            "net17": "9a:eb:eb:86:4b:fb",
            "net18": "02:85:cd:21:68:f9",
            "net19": "96:9c:af:e2:a1:36",
            "net2": "0e:3a:81:7d:c9:2d",
            "net20": "32:8a:b8:7c:89:e9",
            "net21": "2e:0e:72:86:74:e9",
            "net22": "92:e3:d9:07:a6:56",
            "net23": "fa:24:a1:f0:31:51",
            "net24": "fa:95:1a:e2:19:e8",
            "net25": "52:67:ea:ba:29:25",
            "net26": "da:c2:cb:49:91:ad",
            "net27": "de:b9:80:37:c5:22",
            "net28": "56:56:d0:e4:63:03",
            "net29": "86:65:60:18:33:52",
            "net3": "c2:56:ea:e7:6f:2e",
            "net30": "da:1b:53:cb:64:5f",
            "net31": "9a:73:25:31:c9:d4",
            "net4": "a2:58:f7:15:af:c6",
            "net5": "6e:f0:41:de:5b:21",
            "net6": "f2:02:f2:b4:e7:54",
            "net7": "aa:c0:db:ad:36:5f",
            "net8": "a6:5b:ec:03:c6:c0",
            "net9": "ca:ed:19:a1:b8:a2"
        },
        "spine_2_1_1": {
            "net0": "72:90:19:e5:db:e6",
            "net1": "ae:b9:fe:36:78:dc",
            "net10": "6e:1f:f5:32:54:de",
            "net11": "da:77:02:e4:18:5a",
            "net12": "12:32:88:e1:14:89",
            "net13": "8e:c4:68:7a:78:89",
            "net14": "1e:96:bd:94:47:2a",
            "net15": "92:43:8b:59:1f:62",
            "net16": "ae:9e:6e:c5:d2:f6",
            "net17": "a6:1f:be:73:46:0e",
            "net18": "52:23:6d:6b:9a:0d",
            "net19": "e2:2d:a7:da:00:2b",
            "net2": "c2:f9:3c:1a:9c:2b",
            "net20": "2e:5a:cd:8d:71:ce",
            "net21": "46:01:29:dc:b4:fe",
            "net22": "e6:00:65:d7:a0:79",
            "net23": "76:47:fc:26:71:77",
            "net24": "4a:88:dd:40:a4:1d",
            "net25": "92:b2:c8:65:19:07",
            "net26": "9a:e7:bf:02:33:b7",
            "net27": "42:bf:3b:48:dd:17",
            "net28": "12:cd:db:96:d5:fd",
            "net29": "16:06:ff:a2:c1:0b",
            "net3": "02:f1:9a:dd:ad:59",
            "net30": "5e:28:66:6c:e3:5f",
            "net31": "e2:81:0d:4d:8e:1e",
            "net4": "e6:c2:39:61:aa:43",
            "net5": "0e:86:f3:80:7b:cf",
            "net6": "ea:24:b2:35:c1:ef",
            "net7": "5e:1b:67:5f:82:f6",
            "net8": "1a:a8:17:d9:28:69",
            "net9": "92:b7:a8:d3:b8:e3"
        },
        "spine_2_1_10": {
            "net0": "be:2e:b9:90:37:13",
            "net1": "1e:31:1d:b6:f4:96",
            "net10": "ce:78:e8:fb:4d:b9",
            "net11": "8a:e1:19:0d:47:31",
            "net12": "6a:6c:ea:ff:c8:92",
            "net13": "9e:91:7f:41:88:e9",
            "net14": "16:5a:a2:2a:65:ea",
            "net15": "66:e0:9e:92:f2:6e",
            "net16": "22:49:b1:7e:63:19",
            "net17": "da:11:60:41:f9:f3",
            "net18": "86:2c:5b:bb:69:ef",
            "net19": "46:5d:0f:4a:91:7d",
            "net2": "ee:66:9d:00:93:40",
            "net20": "96:0d:da:69:e7:66",
            "net21": "6a:a5:a2:a5:ae:77",
            "net22": "36:fa:f6:ac:d3:60",
            "net23": "92:ec:9b:9d:4e:07",
            "net24": "3e:ee:b1:7e:7f:8f",
            "net25": "ce:b5:8e:db:1c:c5",
            "net26": "fe:75:b1:9e:bb:28",
            "net27": "ea:72:f8:6a:e5:1b",
            "net28": "ea:c9:df:50:a0:61",
            "net29": "7a:58:bd:8f:5e:70",
            "net3": "76:7e:8c:b1:a1:e8",
            "net30": "72:a3:a4:38:b6:5d",
            "net31": "1a:d6:34:0d:d8:b8",
            "net4": "e6:ed:0d:24:3c:78",
            "net5": "d6:e1:6c:bb:bc:1a",
            "net6": "36:42:d8:ae:41:05",
            "net7": "a2:82:2f:a6:e0:1d",
            "net8": "be:07:6d:ee:78:d4",
            "net9": "fe:c0:cf:f3:e8:89"
        },
        "spine_2_1_11": {
            "net0": "aa:75:72:37:9f:c5",
            "net1": "96:b6:a1:9d:34:29",
            "net10": "96:fa:ff:6a:61:d6",
            "net11": "be:fe:de:71:98:03",
            "net12": "c2:4a:14:ad:b7:ae",
            "net13": "8e:0a:41:5b:39:df",
            "net14": "82:46:3f:94:97:06",
            "net15": "42:14:f3:7b:ca:04",
            "net16": "42:86:4e:a4:68:3e",
            "net17": "de:58:0f:6d:5f:ec",
            "net18": "72:18:db:a7:a6:23",
            "net19": "8a:f0:3a:f1:39:33",
            "net2": "4e:a2:61:ba:be:97",
            "net20": "b6:4c:75:b7:b8:8e",
            "net21": "9e:45:7f:d1:e0:12",
            "net22": "9e:2e:1e:7b:e4:9e",
            "net23": "da:68:65:93:e6:43",
            "net24": "42:fd:39:20:d1:27",
            "net25": "32:aa:00:2f:e7:92",
            "net26": "56:e2:9c:12:45:e8",
            "net27": "fe:ae:58:b2:cd:60",
            "net28": "06:17:99:f4:9f:cd",
            "net29": "4e:fd:fb:c1:ad:f2",
            "net3": "1a:e4:bc:71:c5:b1",
            "net30": "aa:0c:bf:77:4a:58",
            "net31": "e2:56:d4:b3:fa:5b",
            "net4": "92:7f:a9:62:f1:f1",
            "net5": "5a:3b:3b:56:57:ee",
            "net6": "e6:aa:8c:17:5b:dc",
            "net7": "e2:0c:b5:7f:7a:c1",
            "net8": "96:ac:43:b0:03:65",
            "net9": "0e:87:4b:4e:37:20"
        },
        "spine_2_1_12": {
            "net0": "5a:74:23:3f:50:ce",
            "net1": "8e:3f:5e:bd:3c:f8",
            "net10": "a2:37:c2:7b:9b:55",
            "net11": "1e:f7:2a:c7:a0:a9",
            "net12": "c6:89:c1:72:8d:b5",
            "net13": "b2:41:c7:e0:2c:1e",
            "net14": "be:ba:8b:60:79:cf",
            "net15": "4a:4a:3d:b3:bf:68",
            "net16": "36:32:6a:1b:b9:63",
            "net17": "de:f4:0b:84:86:d4",
            "net18": "32:4b:0b:c1:03:eb",
            "net19": "56:40:d8:5b:53:84",
            "net2": "9e:1d:a0:45:bd:72",
            "net20": "1e:82:ce:2f:f6:a3",
            "net21": "e2:81:dd:5b:43:e7",
            "net22": "2e:0d:db:eb:44:7a",
            "net23": "ba:b6:5e:44:98:c5",
            "net24": "5a:a0:92:09:8a:88",
            "net25": "ca:43:4a:7a:59:8f",
            "net26": "3a:fb:28:45:89:22",
            "net27": "fe:6c:91:44:15:1c",
            "net28": "a2:cd:75:8b:96:07",
            "net29": "5e:20:2c:ad:75:d0",
            "net3": "da:b9:6c:b1:a1:df",
            "net30": "e6:4d:9d:04:93:34",
            "net31": "8e:ce:37:64:bc:02",
            "net4": "ea:b6:92:49:27:b8",
            "net5": "f2:85:a1:e5:65:59",
            "net6": "3e:e8:28:87:5e:8c",
            "net7": "3a:60:0d:fb:64:db",
            "net8": "52:63:73:12:dd:84",
            "net9": "8a:12:37:5b:d2:d0"
        },
        "spine_2_1_13": {
            "net0": "b6:30:b8:c0:d5:3d",
            "net1": "5e:a1:3c:27:1f:1a",
            "net10": "e6:1a:ee:04:44:c7",
            "net11": "9e:e9:0d:ed:bb:94",
            "net12": "56:de:67:8e:ad:b2",
            "net13": "3e:f7:19:fa:33:97",
            "net14": "de:ea:7c:44:8f:29",
            "net15": "1e:03:f7:1b:6c:8a",
            "net16": "9e:1a:84:82:0d:2a",
            "net17": "ca:9c:b9:aa:4b:69",
            "net18": "3a:e0:0d:99:03:39",
            "net19": "76:9f:65:ff:83:3b",
            "net2": "e2:b3:23:0f:2d:4c",
            "net20": "d2:11:c1:81:d7:62",
            "net21": "e6:e2:61:ca:4b:75",
            "net22": "ea:8f:8c:df:0f:77",
            "net23": "9e:68:35:70:c0:f9",
            "net24": "d2:37:7b:33:5c:5b",
            "net25": "ba:dc:9b:36:ed:5e",
            "net26": "72:07:f8:a0:94:ea",
            "net27": "b6:c2:30:6a:ec:f9",
            "net28": "ea:c9:5e:cc:94:13",
            "net29": "86:d0:36:66:c1:26",
            "net3": "a6:1e:3d:7d:5b:46",
            "net30": "5e:e0:47:79:a1:38",
            "net31": "de:68:b7:17:ba:58",
            "net4": "b2:3d:c4:82:58:af",
            "net5": "76:e3:0a:f0:39:47",
            "net6": "c2:4e:d9:79:c1:93",
            "net7": "72:c0:4e:1e:eb:be",
            "net8": "a6:94:91:7b:70:5c",
            "net9": "5a:e1:ad:3c:d3:3c"
        },
        "spine_2_1_14": {
            "net0": "5a:2f:a8:ca:d3:e2",
            "net1": "ee:f7:76:8c:be:55",
            "net10": "4a:da:4b:14:bc:08",
            "net11": "72:59:13:90:52:78",
            "net12": "86:60:d1:15:fc:64",
            "net13": "72:a8:03:b8:04:f7",
            "net14": "f2:93:6b:39:80:bd",
            "net15": "5a:97:ce:82:51:ba",
            "net16": "92:e4:3b:bc:6d:97",
            "net17": "7e:3b:19:ec:66:a0",
            "net18": "2a:da:78:5d:0a:c0",
            "net19": "62:85:01:b4:03:c6",
            "net2": "96:79:e3:37:4a:63",
            "net20": "96:db:51:c6:29:46",
            "net21": "86:c7:45:9c:dd:62",
            "net22": "b2:0f:31:dc:43:0d",
            "net23": "ce:e5:db:c3:02:01",
            "net24": "b6:c8:07:15:3d:7c",
            "net25": "1e:29:1d:dc:f6:1a",
            "net26": "26:72:08:e3:53:6e",
            "net27": "f6:fe:40:bf:de:01",
            "net28": "2a:28:b7:c6:ba:90",
            "net29": "ba:1f:af:62:85:be",
            "net3": "5a:02:76:47:9a:aa",
            "net30": "ea:87:4e:07:17:a1",
            "net31": "9a:4c:fc:51:ff:0c",
            "net4": "ee:e4:36:78:d5:d3",
            "net5": "02:a8:dd:1d:83:7e",
            "net6": "32:8e:76:07:dc:b8",
            "net7": "5e:b1:c4:e1:bd:c9",
            "net8": "d2:a2:19:67:b8:2d",
            "net9": "02:98:9d:a6:0f:19"
        },
        "spine_2_1_15": {
            "net0": "1e:ff:07:34:48:80",
            "net1": "2a:47:df:c4:44:60",
            "net10": "26:18:f4:2a:40:fc",
            "net11": "c2:5d:c2:72:5d:4b",
            "net12": "26:03:f3:99:e5:aa",
            "net13": "8a:c1:11:c0:68:6d",
            "net14": "5e:a9:58:78:52:71",
            "net15": "46:c1:5f:a2:c2:b6",
            "net16": "62:11:1a:eb:b9:ff",
            "net17": "42:84:90:a0:b5:76",
            "net18": "4e:ea:29:95:63:26",
            "net19": "ce:c7:b4:b4:6b:3f",
            "net2": "fe:4b:f2:32:03:0c",
            "net20": "e6:cb:9b:78:b3:16",
            "net21": "66:d9:83:51:98:7d",
            "net22": "6e:a7:2d:ea:99:89",
            "net23": "da:a3:f1:dd:9a:17",
            "net24": "1a:94:c2:16:c9:c0",
            "net25": "52:a1:9d:63:e2:0b",
            "net26": "16:6c:f6:5c:51:5c",
            "net27": "1e:c6:97:22:10:96",
            "net28": "5a:d4:3c:f0:dc:9a",
            "net29": "6e:4d:88:e4:d8:fe",
            "net3": "66:d9:35:8f:5a:4a",
            "net30": "02:05:ad:32:d0:be",
            "net31": "82:7d:0a:d5:5c:00",
            "net4": "0a:05:64:e9:9e:09",
            "net5": "1a:f5:96:52:fb:75",
            "net6": "42:59:33:0e:43:ac",
            "net7": "f6:44:29:08:cb:93",
            "net8": "1e:3d:81:90:eb:ee",
            "net9": "22:7c:bd:42:79:0f"
        },
        "spine_2_1_16": {
            "net0": "7e:fe:92:6e:02:cf",
            "net1": "0e:69:c4:af:89:f3",
            "net10": "e2:80:8d:c6:62:f2",
            "net11": "1a:21:c4:50:75:81",
            "net12": "d6:8c:36:b8:ff:59",
            "net13": "e2:a5:b0:fa:c9:0a",
            "net14": "02:a2:c3:96:7a:94",
            "net15": "8a:2e:0b:7d:eb:9d",
            "net16": "3a:95:db:cb:e6:2a",
            "net17": "2e:34:f9:ca:da:b5",
            "net18": "b6:d2:1a:b1:8e:45",
            "net19": "1e:33:e8:64:42:a8",
            "net2": "1e:81:83:2d:ca:df",
            "net20": "12:0b:09:ed:ac:67",
            "net21": "26:29:eb:0c:a6:b8",
            "net22": "76:94:32:79:7c:91",
            "net23": "e2:9f:6b:d5:3c:ea",
            "net24": "9e:4c:f7:45:27:3a",
            "net25": "26:74:f6:ab:b4:32",
            "net26": "92:96:ea:c5:ae:ba",
            "net27": "be:61:34:3c:8c:b3",
            "net28": "e6:c1:5f:89:14:d8",
            "net29": "c6:43:82:84:93:63",
            "net3": "4e:62:bf:dc:0b:b5",
            "net30": "8e:c9:c9:e0:2b:e0",
            "net31": "26:70:25:a5:f9:19",
            "net4": "62:8d:77:89:2a:0f",
            "net5": "5e:d5:93:c7:e7:6d",
            "net6": "12:a4:d8:a0:67:c1",
            "net7": "c6:4d:b9:a9:c3:c8",
            "net8": "de:d2:b4:5f:18:00",
            "net9": "42:36:2d:25:1b:a8"
        },
        "spine_2_1_2": {
            "net0": "32:23:45:41:e8:1a",
            "net1": "62:f4:de:0b:19:73",
            "net10": "a2:5d:a0:2b:21:f2",
            "net11": "ba:1d:b9:61:bd:9f",
            "net12": "9a:dd:64:99:63:fd",
            "net13": "5a:c8:0d:b3:16:b2",
            "net14": "62:43:ba:f3:8c:4d",
            "net15": "22:22:c0:4b:66:b8",
            "net16": "4e:2b:9f:ee:3e:d5",
            "net17": "d2:ad:49:03:94:31",
            "net18": "7e:6a:1f:a8:bd:e3",
            "net19": "82:bc:d6:e6:06:ce",
            "net2": "56:98:ac:95:3e:4c",
            "net20": "66:8a:0d:c3:fb:4e",
            "net21": "52:70:ba:b9:e3:ad",
            "net22": "86:ca:e9:ef:0d:fc",
            "net23": "06:2a:64:96:28:0c",
            "net24": "72:4e:70:11:b4:55",
            "net25": "8a:06:b4:07:97:b8",
            "net26": "e2:f4:92:03:53:78",
            "net27": "96:cb:54:a8:f9:96",
            "net28": "92:a9:a5:ab:df:4b",
            "net29": "52:bf:5a:fd:58:8e",
            "net3": "86:39:56:57:44:28",
            "net30": "3a:08:b6:be:85:c5",
            "net31": "46:21:b6:2e:42:45",
            "net4": "12:b9:28:b0:ed:e7",
            "net5": "c2:39:c1:78:e9:c4",
            "net6": "12:b7:00:24:89:e0",
            "net7": "66:2f:f0:77:e4:13",
            "net8": "72:a0:31:37:49:8c",
            "net9": "b6:2d:fe:01:e7:ae"
        },
        "spine_2_1_3": {
            "net0": "6e:d6:38:b0:4b:16",
            "net1": "36:d5:56:4e:16:51",
            "net10": "8a:d8:7d:6e:f9:9d",
            "net11": "6a:a3:45:54:9e:f3",
            "net12": "fe:37:bd:c0:f6:f7",
            "net13": "46:8d:8a:84:04:9b",
            "net14": "9a:e9:b4:5a:02:41",
            "net15": "b6:f2:dd:5d:a0:16",
            "net16": "86:a3:63:1d:a2:36",
            "net17": "3e:e9:8b:24:82:4e",
            "net18": "8e:38:d7:d0:9f:91",
            "net19": "82:fe:01:12:7e:a7",
            "net2": "2a:0a:50:10:79:a3",
            "net20": "2e:17:d3:00:f4:ac",
            "net21": "9a:81:db:f3:a3:fb",
            "net22": "06:d6:3e:82:eb:b7",
            "net23": "fa:c9:46:c9:fd:4c",
            "net24": "62:6e:64:85:be:b3",
            "net25": "46:3b:12:5f:26:5c",
            "net26": "7e:bb:e9:71:79:40",
            "net27": "d6:e8:23:d0:c8:9d",
            "net28": "62:97:d6:bf:b6:0c",
            "net29": "c6:aa:aa:20:ce:d5",
            "net3": "2e:d0:86:31:c4:3a",
            "net30": "9e:a4:f1:94:42:3d",
            "net31": "26:dc:ae:38:e3:52",
            "net4": "a2:f0:6a:91:cf:a9",
            "net5": "be:ec:0c:60:5c:1f",
            "net6": "9e:c2:7b:e2:98:bb",
            "net7": "16:83:93:c8:84:0b",
            "net8": "e6:bb:c1:43:70:d8",
            "net9": "76:71:72:a0:22:6e"
        },
        "spine_2_1_4": {
            "net0": "3e:f0:37:a1:b5:27",
            "net1": "0a:c8:0c:e2:8e:ca",
            "net10": "2a:07:bf:e8:19:af",
            "net11": "3a:55:f0:0a:0c:b4",
            "net12": "1e:a0:9d:86:a4:31",
            "net13": "7a:76:d3:49:e5:b2",
            "net14": "f2:b8:b6:cb:8f:40",
            "net15": "0e:8c:9b:55:16:f6",
            "net16": "a2:64:f8:01:1a:66",
            "net17": "1e:a4:63:2a:3a:95",
            "net18": "ca:90:2e:7b:ef:db",
            "net19": "8e:a6:5f:3c:1b:fa",
            "net2": "ea:c0:9c:af:d1:ce",
            "net20": "56:9b:ef:67:31:a1",
            "net21": "7e:37:ad:73:66:7c",
            "net22": "12:31:0a:4e:e6:61",
            "net23": "6e:01:db:89:a9:4d",
            "net24": "62:eb:74:32:8d:44",
            "net25": "ca:92:76:9e:9a:6b",
            "net26": "46:48:7c:13:12:db",
            "net27": "c6:6a:8c:8b:db:e6",
            "net28": "82:8a:98:98:af:93",
            "net29": "3a:28:ad:46:d8:e1",
            "net3": "ea:6a:d1:2b:b6:72",
            "net30": "66:8f:52:ed:18:fa",
            "net31": "62:d3:5a:c5:2b:65",
            "net4": "92:3b:d9:99:1d:33",
            "net5": "06:2e:49:2c:68:87",
            "net6": "92:f0:c2:01:fc:b9",
            "net7": "06:7d:30:db:3d:81",
            "net8": "a2:1b:75:30:dd:23",
            "net9": "b2:a5:ac:09:04:43"
        },
        "spine_2_1_5": {
            "net0": "de:1b:c6:b6:a4:95",
            "net1": "52:13:b6:c6:2f:85",
            "net10": "e6:f8:fc:f2:cf:62",
            "net11": "f2:99:a1:ba:67:0b",
            "net12": "1a:36:4e:81:cb:b7",
            "net13": "8e:59:d0:80:34:df",
            "net14": "f6:0b:be:c8:86:75",
            "net15": "aa:ab:29:63:d5:82",
            "net16": "0a:c8:6b:83:d3:3e",
            "net17": "36:f6:9b:e2:ec:26",
            "net18": "4e:a4:6a:d8:78:4f",
            "net19": "ee:31:89:e5:f7:d9",
            "net2": "e6:b4:f8:47:01:57",
            "net20": "f2:11:61:2c:2d:02",
            "net21": "92:53:d6:22:9e:89",
            "net22": "e2:aa:52:3b:ee:eb",
            "net23": "82:40:82:64:5c:ca",
            "net24": "9a:7c:37:44:87:11",
            "net25": "1e:e2:1c:dc:71:ca",
            "net26": "22:a0:75:dd:02:22",
            "net27": "36:75:c1:c1:e0:50",
            "net28": "ce:57:c2:37:cb:b4",
            "net29": "92:2a:19:13:11:24",
            "net3": "02:ba:31:01:3e:55",
            "net30": "32:7c:12:44:cc:7a",
            "net31": "7a:9f:46:f1:67:7e",
            "net4": "a6:d0:ac:16:ed:29",
            "net5": "62:7c:c0:24:7b:48",
            "net6": "6a:17:0b:c1:08:35",
            "net7": "86:fe:ef:d3:6c:74",
            "net8": "f6:e8:f3:50:68:bc",
            "net9": "52:38:52:79:00:80"
        },
        "spine_2_1_6": {
            "net0": "86:55:bf:c3:10:1a",
            "net1": "fe:bc:06:b7:f4:ca",
            "net10": "e6:33:cd:ef:08:f8",
            "net11": "f2:06:b2:00:1b:50",
            "net12": "6e:23:dc:89:7b:30",
            "net13": "6e:90:46:7b:7f:88",
            "net14": "4e:3f:82:76:99:14",
            "net15": "0e:18:49:22:30:a0",
            "net16": "9e:1a:fb:c6:e1:d6",
            "net17": "46:08:33:1e:e4:8e",
            "net18": "ba:75:ec:a8:99:30",
            "net19": "86:b8:53:f6:c7:29",
            "net2": "8a:70:b2:9b:e7:59",
            "net20": "b6:9a:e8:60:ba:f8",
            "net21": "12:aa:2b:cc:bc:28",
            "net22": "be:6a:59:dd:e3:db",
            "net23": "ae:3d:c3:94:91:7f",
            "net24": "d2:9d:75:b0:a6:cf",
            "net25": "8e:da:7e:ba:1e:1a",
            "net26": "6e:f2:90:7a:a7:43",
            "net27": "f2:33:31:77:f9:8f",
            "net28": "72:d5:98:ea:5a:c9",
            "net29": "06:9b:f9:ff:e1:41",
            "net3": "4a:33:47:55:4a:ba",
            "net30": "66:b1:58:cf:b3:a0",
            "net31": "f2:36:a7:3c:16:b7",
            "net4": "9e:05:39:26:cb:49",
            "net5": "7e:78:c7:73:cc:d3",
            "net6": "52:c4:a8:ce:c3:5d",
            "net7": "02:7e:a7:80:b9:24",
            "net8": "62:af:e7:99:21:65",
            "net9": "8a:39:48:90:fc:b3"
        },
        "spine_2_1_7": {
            "net0": "de:79:07:e8:8d:dc",
            "net1": "ce:75:41:b4:fd:a3",
            "net10": "5a:85:ac:3f:e1:a4",
            "net11": "c2:d5:cd:30:e9:23",
            "net12": "4a:b2:bc:18:ab:6a",
            "net13": "a6:20:c5:8a:8f:7e",
            "net14": "2a:8e:64:4b:0d:32",
            "net15": "06:01:b6:fa:b8:ae",
            "net16": "f2:d8:44:b5:3e:87",
            "net17": "4a:c2:71:3e:55:82",
            "net18": "ae:13:2d:c8:c5:e3",
            "net19": "1e:f1:1c:cb:87:92",
            "net2": "8e:2a:aa:84:86:8d",
            "net20": "e2:4e:b8:41:77:e0",
            "net21": "6a:4e:c2:f7:b7:ba",
            "net22": "2e:58:ce:f0:80:84",
            "net23": "22:e6:1a:a5:0f:11",
            "net24": "1a:5a:09:c6:a9:3a",
            "net25": "06:28:ab:04:22:f1",
            "net26": "46:05:d0:9a:b6:39",
            "net27": "22:80:38:32:84:4b",
            "net28": "92:a2:86:d5:4c:7c",
            "net29": "3a:11:39:75:46:c1",
            "net3": "3a:85:f8:e0:dd:61",
            "net30": "42:16:85:37:65:f2",
            "net31": "62:69:9c:6a:a9:e1",
            "net4": "e2:8e:a7:ce:24:0f",
            "net5": "8a:5f:d1:25:e6:94",
            "net6": "8e:b9:51:59:0c:39",
            "net7": "2e:ad:48:5f:89:c9",
            "net8": "e6:0b:78:7b:9b:09",
            "net9": "7a:d7:cb:05:c9:35"
        },
        "spine_2_1_8": {
            "net0": "16:fe:c8:4d:99:9e",
            "net1": "4e:6b:e3:8c:39:5b",
            "net10": "a2:8e:95:06:b6:9b",
            "net11": "c2:ce:6a:84:f3:af",
            "net12": "9e:fd:ff:f1:b3:fd",
            "net13": "de:7e:3e:06:fa:de",
            "net14": "9e:5c:d4:5c:10:52",
            "net15": "62:a4:6a:13:be:68",
            "net16": "46:52:58:27:0c:ee",
            "net17": "7e:ea:2a:c2:c6:f8",
            "net18": "b6:0a:cc:00:82:73",
            "net19": "d2:09:af:59:8d:d2",
            "net2": "92:92:e1:40:32:42",
            "net20": "b2:dc:1e:af:3e:63",
            "net21": "ce:af:b2:82:9d:92",
            "net22": "1a:4a:12:62:5c:8a",
            "net23": "ca:cb:50:c4:27:39",
            "net24": "92:ba:40:94:20:87",
            "net25": "ce:df:aa:69:91:7f",
            "net26": "5a:46:32:7e:e6:55",
            "net27": "12:8e:e3:1e:5b:29",
            "net28": "5e:0c:33:7c:58:3e",
            "net29": "1e:26:31:98:d1:09",
            "net3": "9e:23:ec:d5:79:e7",
            "net30": "82:e8:da:eb:9e:77",
            "net31": "ce:30:b5:55:59:fe",
            "net4": "32:e3:a3:46:ae:fb",
            "net5": "76:70:a0:75:12:74",
            "net6": "ca:42:21:f9:84:7f",
            "net7": "9e:e7:bc:14:a5:e7",
            "net8": "ca:45:9d:f3:6e:6d",
            "net9": "ea:d8:d4:8d:b5:83"
        },
        "spine_2_1_9": {
            "net0": "76:91:09:4e:ce:0d",
            "net1": "26:d1:7d:3f:5c:4d",
            "net10": "92:68:94:21:e0:89",
            "net11": "96:07:d7:30:75:9a",
            "net12": "ce:f6:f8:02:a7:40",
            "net13": "ca:cf:1c:3d:3e:0e",
            "net14": "16:39:15:13:7e:16",
            "net15": "9a:35:cf:71:e9:63",
            "net16": "1e:ea:b3:10:d4:fe",
            "net17": "1a:c5:f6:cc:f5:ac",
            "net18": "1a:dc:98:1b:44:b4",
            "net19": "c2:c5:6e:90:37:05",
            "net2": "72:42:27:b3:a1:b4",
            "net20": "da:da:ab:42:eb:9b",
            "net21": "e2:67:1e:80:b8:4b",
            "net22": "96:db:84:59:92:09",
            "net23": "8a:4f:45:2d:d5:e9",
            "net24": "6e:db:a1:d9:d6:69",
            "net25": "aa:07:1f:af:18:ab",
            "net26": "ce:95:be:14:7c:78",
            "net27": "1e:53:ce:f7:b7:a3",
            "net28": "2a:f5:7e:08:46:c7",
            "net29": "66:ad:27:2e:3e:07",
            "net3": "9a:ac:0a:80:00:4d",
            "net30": "ca:3b:20:db:3e:57",
            "net31": "66:88:97:5f:31:52",
            "net4": "aa:13:01:12:c1:24",
            "net5": "a6:ab:27:03:6b:99",
            "net6": "52:2a:e7:29:62:9f",
            "net7": "f2:b6:c4:ce:b7:d3",
            "net8": "82:bd:e9:3c:46:4d",
            "net9": "42:95:51:b5:82:9b"
        },
        "tof_1_2_1": {
            "net0": "26:fb:a1:de:60:8f",
            "net1": "22:2b:4d:49:a8:e5",
            "net10": "4a:a9:be:2b:e5:45",
            "net11": "56:87:1b:64:be:42",
            "net12": "ee:bc:e6:98:31:f5",
            "net13": "22:47:24:5f:af:2a",
            "net14": "4e:fa:a1:c7:18:e9",
            "net15": "c2:9e:fd:cb:54:62",
            "net16": "be:d9:99:53:89:17",
            "net17": "5e:a6:db:f2:89:cb",
            "net18": "b2:d7:96:7e:ed:ea",
            "net19": "32:74:e6:45:08:c5",
            "net2": "8e:57:bb:4c:5a:0a",
            "net20": "d6:82:6a:3d:0c:49",
            "net21": "e6:19:39:c6:22:59",
            "net22": "32:1b:14:72:71:c8",
            "net23": "52:6d:5a:cd:42:71",
            "net24": "4e:a7:db:91:4d:59",
            "net25": "7a:20:09:0b:8e:eb",
            "net26": "16:d9:ac:3e:12:34",
            "net27": "2e:e2:1e:1e:e9:19",
            "net28": "12:6c:56:8d:de:81",
            "net29": "a6:ae:ee:9e:93:a2",
            "net3": "86:ac:26:38:b4:62",
            "net30": "12:21:31:35:4a:b4",
            "net31": "96:d2:dd:0f:2f:e6",
            "net4": "a6:4b:8c:64:33:17",
            "net5": "a6:44:4e:b2:ca:b1",
            "net6": "c6:b7:b0:0f:39:48",
            "net7": "c6:d6:57:ba:86:b2",
            "net8": "7e:c7:55:d5:95:3c",
            "net9": "76:70:51:64:4d:1d"
        },
        "tof_1_2_10": {
            "net0": "ce:49:95:df:e6:93",
            "net1": "46:35:64:bc:46:02",
            "net10": "72:87:47:70:c1:75",
            "net11": "aa:87:f3:88:d7:92",
            "net12": "6e:54:25:e8:20:a2",
            "net13": "2e:60:a5:ca:ee:50",
            "net14": "4e:65:ad:42:27:97",
            "net15": "ae:0e:50:ca:67:46",
            "net16": "a6:5e:d4:69:d7:94",
            "net17": "9e:79:01:33:2f:48",
            "net18": "5e:02:67:1b:b9:e2",
            "net19": "82:c8:63:f6:53:c0",
            "net2": "92:37:1f:ba:16:0a",
            "net20": "4e:e5:be:28:9c:62",
            "net21": "d6:a5:39:6b:0f:9e",
            "net22": "5a:a1:16:8e:28:30",
            "net23": "3a:f2:5d:87:6a:b7",
            "net24": "8e:97:65:35:e2:18",
            "net25": "82:bf:1a:73:83:bd",
            "net26": "1e:8f:f8:55:47:ba",
            "net27": "16:ba:fd:5e:b1:d2",
            "net28": "d2:10:93:40:a4:73",
            "net29": "a2:2d:72:b4:95:fc",
            "net3": "36:46:5e:89:81:6c",
            "net30": "ae:f5:54:86:75:24",
            "net31": "3e:01:45:93:36:69",
            "net4": "86:a1:e1:df:0d:31",
            "net5": "3a:13:3b:85:cf:3d",
            "net6": "7e:11:e7:e4:4f:e7",
            "net7": "b2:d2:52:50:07:2c",
            "net8": "5e:77:17:ba:57:e9",
            "net9": "fe:8e:04:68:a3:e6"
        },
        "tof_1_2_11": {
            "net0": "82:6e:64:aa:ca:4f",
            "net1": "0a:0f:cc:ba:db:45",
            "net10": "e2:da:4b:63:69:c4",
            "net11": "9a:d6:c4:75:cc:8d",
            "net12": "82:5c:b3:33:de:45",
            "net13": "ea:e6:d2:b8:e7:2c",
            "net14": "3e:d8:f1:e7:b1:ea",
            "net15": "be:b6:71:cf:a2:fd",
            "net16": "a2:6e:da:82:eb:08",
            "net17": "9a:0d:66:ee:5f:d1",
            "net18": "d6:6c:a3:0e:4a:f0",
            "net19": "e6:ea:60:e2:d3:bf",
            "net2": "5a:74:82:58:6d:52",
            "net20": "5e:cf:b7:b2:2b:bf",
            "net21": "7e:c6:d9:63:2b:22",
            "net22": "86:48:ed:52:1d:6f",
            "net23": "0e:bf:c9:4a:9c:de",
            "net24": "02:f7:57:d6:ed:c7",
            "net25": "12:c9:6a:45:93:4c",
            "net26": "f2:34:db:9a:26:b3",
            "net27": "5a:79:2e:e6:30:7e",
            "net28": "82:d0:fc:44:5e:59",
            "net29": "da:16:af:66:03:1f",
            "net3": "ee:f5:94:cc:63:65",
            "net30": "0a:5b:ef:32:70:bb",
            "net31": "f2:04:0d:68:80:8b",
            "net4": "3e:e8:c2:e6:65:10",
            "net5": "ca:5b:b9:f9:5c:48",
            "net6": "b2:a2:1d:38:2c:49",
            "net7": "22:87:8e:2b:09:0f",
            "net8": "b2:63:4b:16:b1:5e",
            "net9": "76:5f:b1:0e:b2:42"
        },
        "tof_1_2_12": {
            "net0": "36:d9:8a:09:69:4d",
            "net1": "c6:53:07:f6:64:4b",
            "net10": "62:ab:89:b1:03:f0",
            "net11": "2a:db:d5:77:60:c4",
            "net12": "c6:ba:63:8c:86:46",
            "net13": "7a:2c:93:23:5f:2c",
            "net14": "2e:7e:52:15:bc:d8",
            "net15": "52:fe:40:77:70:bb",
            "net16": "62:5c:e3:61:98:9f",
            "net17": "fe:95:ee:8b:82:68",
            "net18": "5a:34:0a:98:a6:66",
            "net19": "de:2a:ce:9b:00:c9",
            "net2": "0a:b7:85:70:4f:89",
            "net20": "0e:36:55:c6:54:08",
            "net21": "02:6e:f0:7a:c3:b9",
            "net22": "52:b7:e8:1c:e4:da",
            "net23": "22:d2:4c:86:8f:eb",
            "net24": "a2:99:d7:02:e8:d6",
            "net25": "de:24:d6:29:9a:b2",
            "net26": "06:45:af:47:d1:62",
            "net27": "a2:c9:46:52:83:ed",
            "net28": "ee:60:ad:5f:73:4b",
            "net29": "ea:30:e4:0d:70:f0",
            "net3": "ee:fe:84:3d:07:16",
            "net30": "ba:83:d7:64:0a:4d",
            "net31": "5e:a8:55:3b:12:e8",
            "net4": "5a:0f:b4:63:32:16",
            "net5": "e6:46:5a:c6:cf:d3",
            "net6": "1a:b3:fd:cf:20:15",
            "net7": "a2:2a:3d:2a:42:b1",
            "net8": "1a:d9:27:03:14:ab",
            "net9": "9e:c4:ae:2c:bf:2e"
        },
        "tof_1_2_13": {
            "net0": "7a:65:68:36:38:d6",
            "net1": "02:f9:0f:11:ca:b5",
            "net10": "12:b3:b7:f2:ec:40",
            "net11": "1e:1c:c1:cc:4f:56",
            "net12": "d6:f5:83:20:d5:e7",
            "net13": "22:79:69:2e:b1:98",
            "net14": "8a:08:22:81:8a:9c",
            "net15": "f6:9c:b4:87:c5:6f",
            "net16": "2a:44:80:50:36:b0",
            "net17": "a2:94:2a:e9:99:3f",
            "net18": "4e:56:2a:cb:c0:73",
            "net19": "2e:53:e5:a0:d7:a4",
            "net2": "ea:70:44:c2:b2:a7",
            "net20": "16:df:d8:6b:79:0a",
            "net21": "66:63:7c:12:37:42",
            "net22": "de:45:1c:cb:b2:1f",
            "net23": "2e:e8:98:39:9b:e5",
            "net24": "92:01:77:5e:18:4f",
            "net25": "0a:ee:78:f4:ff:f2",
            "net26": "ce:e8:c8:44:18:2f",
            "net27": "0a:f3:26:bd:5d:e8",
            "net28": "d6:51:e1:87:dc:9e",
            "net29": "3a:81:58:9a:0b:6f",
            "net3": "3e:82:f5:9c:9f:53",
            "net30": "e2:d8:97:99:02:04",
            "net31": "32:04:e7:be:dc:13",
            "net4": "36:01:1c:e9:ed:0c",
            "net5": "8a:8d:85:d1:fa:e7",
            "net6": "0e:42:2f:f2:35:72",
            "net7": "16:e8:29:f2:e1:ce",
            "net8": "7e:a8:4f:87:8d:f4",
            "net9": "be:b6:49:73:3a:6b"
        },
        "tof_1_2_14": {
            "net0": "c2:89:f5:c5:a9:a9",
            "net1": "a6:58:fa:de:a2:0e",
            "net10": "aa:ec:b0:d4:23:1a",
            "net11": "0e:55:cc:b7:6f:4d",
            "net12": "4e:02:22:20:00:1d",
            "net13": "be:c5:3c:46:0b:7e",
            "net14": "be:b9:49:55:d7:84",
            "net15": "fa:0b:6b:53:a0:09",
            "net16": "6a:cc:a8:e5:d7:b5",
            "net17": "92:3c:b4:01:97:c9",
            "net18": "32:83:70:98:6f:f6",
            "net19": "de:f3:a6:a3:99:b9",
            "net2": "8e:12:07:4f:55:16",
            "net20": "4a:70:5a:7b:f1:e0",
            "net21": "b6:a9:11:be:8c:37",
            "net22": "fe:fa:85:6f:11:87",
            "net23": "8e:46:ca:fb:1b:61",
            "net24": "82:6c:ae:21:db:b1",
            "net25": "1a:7b:e5:34:c7:8d",
            "net26": "46:fe:ea:e2:2e:9e",
            "net27": "ce:a4:87:ca:18:71",
            "net28": "e6:9a:0c:8a:7a:be",
            "net29": "d2:2b:92:cf:5a:f3",
            "net3": "4e:88:17:70:b8:02",
            "net30": "52:63:1b:40:97:40",
            "net31": "56:ab:d9:a5:cf:fa",
            "net4": "5e:c1:44:c7:03:a9",
            "net5": "0a:fb:1f:17:b3:d3",
            "net6": "76:fe:36:02:3d:d0",
            "net7": "56:26:97:25:c9:7d",
            "net8": "36:58:56:9a:53:c0",
            "net9": "3a:4a:d6:4d:93:74"
        },
        "tof_1_2_15": {
            "net0": "a6:6d:3e:32:ec:7b",
            "net1": "a6:a1:23:71:19:c8",
            "net10": "8a:0c:85:eb:61:c5",
            "net11": "06:0e:8b:54:d0:76",
            "net12": "2a:67:c4:97:02:5e",
            "net13": "4e:d0:e3:41:00:b2",
            "net14": "e2:3a:3a:a9:63:95",
            "net15": "ea:b8:ea:b0:33:95",
            "net16": "72:e5:59:93:5d:13",
            "net17": "1e:6d:c9:10:8a:f0",
            "net18": "5a:7a:25:23:cf:75",
            "net19": "72:70:8e:ee:b1:1d",
            "net2": "d2:84:2c:d5:d1:59",
            "net20": "ea:42:cb:aa:c7:5a",
            "net21": "6e:59:f1:8f:bf:26",
            "net22": "0e:7c:84:d8:f1:f6",
            "net23": "16:c1:70:8a:63:38",
            "net24": "d2:65:f2:04:ca:67",
            "net25": "de:cd:95:66:e2:63",
            "net26": "b6:2a:bb:94:ee:38",
            "net27": "5a:10:3b:af:dc:7a",
            "net28": "76:47:5f:c6:e6:f8",
            "net29": "96:44:da:4d:70:fe",
            "net3": "be:2e:29:45:d8:eb",
            "net30": "2e:41:2e:e9:ac:7d",
            "net31": "ee:8d:65:3c:c6:dc",
            "net4": "7e:1d:d9:f7:3c:1f",
            "net5": "f2:e1:ee:58:b8:5f",
            "net6": "26:68:aa:b0:d6:32",
            "net7": "de:68:99:22:76:ea",
            "net8": "b2:21:b1:ee:2c:24",
            "net9": "66:7c:66:dc:ce:1c"
        },
        "tof_1_2_16": {
            "net0": "b6:dc:b9:8c:1a:43",
            "net1": "e6:88:fe:19:34:74",
            "net10": "7e:b8:c3:33:ca:e5",
            "net11": "ee:af:51:dd:0d:29",
            "net12": "ba:54:77:8d:a3:0d",
            "net13": "e6:01:fe:ac:92:07",
            "net14": "ca:b5:e4:8e:0e:d2",
            "net15": "22:29:7f:4b:30:fa",
            "net16": "7a:b9:54:89:74:97",
            "net17": "2e:75:e3:fc:cf:80",
            "net18": "da:c5:f0:36:ee:67",
            "net19": "8e:6b:6b:e2:9d:b8",
            "net2": "02:ed:e9:61:d2:a7",
            "net20": "46:83:31:59:8d:6d",
            "net21": "3a:ba:25:bf:da:6d",
            "net22": "da:29:61:e6:40:a2",
            "net23": "d2:59:74:d9:e2:27",
            "net24": "da:8a:f9:41:fd:fe",
            "net25": "8e:45:c7:65:7b:24",
            "net26": "1e:53:ee:4e:72:d8",
            "net27": "ca:3f:d5:5e:12:40",
            "net28": "4a:a1:2c:49:96:7f",
            "net29": "fe:e9:bf:00:6c:e1",
            "net3": "2e:16:d8:bf:bb:ca",
            "net30": "b6:54:ef:4e:71:10",
            "net31": "0e:6e:fa:75:1f:9e",
            "net4": "32:a4:9d:31:62:d8",
            "net5": "be:f3:7c:d2:78:f1",
            "net6": "46:a4:2b:07:18:eb",
            "net7": "b6:58:ca:68:d4:b5",
            "net8": "4a:86:45:2f:e6:fc",
            "net9": "76:f2:bb:87:e4:2d"
        },
        "tof_1_2_2": {
            "net0": "ca:67:4c:58:5e:ea",
            "net1": "82:1b:dd:cc:49:e6",
            "net10": "f2:88:19:34:63:e5",
            "net11": "ee:15:56:41:41:50",
            "net12": "9e:44:f5:67:7e:99",
            "net13": "0e:5c:10:0e:a8:41",
            "net14": "be:71:da:01:18:29",
            "net15": "a6:f1:e4:65:00:d7",
            "net16": "2e:8b:d8:9c:83:1f",
            "net17": "12:5b:80:3a:20:bf",
            "net18": "f6:b3:72:b5:4d:8d",
            "net19": "3e:26:e4:47:8e:cd",
            "net2": "9e:95:34:b1:bc:51",
            "net20": "b2:7b:17:38:d4:28",
            "net21": "96:21:62:b6:3f:4a",
            "net22": "aa:a8:61:5a:91:0d",
            "net23": "7e:d2:d6:dc:32:1c",
            "net24": "ee:54:3e:32:8d:d3",
            "net25": "d2:4e:47:e2:b1:ab",
            "net26": "12:64:bb:42:7f:82",
            "net27": "3a:51:09:7c:9c:fb",
            "net28": "da:7b:05:6d:e0:27",
            "net29": "fa:27:c4:18:19:48",
            "net3": "36:15:77:80:94:23",
            "net30": "d6:08:b0:26:c8:83",
            "net31": "0a:e3:6e:fd:1a:9d",
            "net4": "72:69:ad:4f:ea:17",
            "net5": "ae:3c:84:94:6e:71",
            "net6": "d6:35:00:8e:33:55",
            "net7": "5e:f7:24:de:b2:ad",
            "net8": "be:b3:97:59:b3:47",
            "net9": "16:af:24:bc:00:cc"
        },
        "tof_1_2_3": {
            "net0": "da:70:cc:8b:47:1c",
            "net1": "72:11:cb:7e:d7:a3",
            "net10": "4e:bc:cc:00:34:0e",
            "net11": "32:ef:c1:b6:b1:b7",
            "net12": "1e:88:7f:93:67:92",
            "net13": "6a:b5:6b:5e:ce:17",
            "net14": "56:78:ed:8e:4a:54",
            "net15": "32:11:b7:ee:e8:0b",
            "net16": "26:6f:ac:3b:27:60",
            "net17": "9e:1b:28:b8:fa:19",
            "net18": "ba:7f:b9:ae:9e:34",
            "net19": "92:37:6d:cd:ec:8e",
            "net2": "5a:4a:79:28:0b:c4",
            "net20": "be:76:68:8b:9d:31",
            "net21": "02:d8:20:75:08:a1",
            "net22": "9e:35:e7:ed:13:97",
            "net23": "4e:8e:53:9d:cd:bd",
            "net24": "06:f4:8f:68:3d:0e",
            "net25": "f2:bc:18:a0:4a:a9",
            "net26": "22:ab:99:e0:2e:ee",
            "net27": "ea:87:56:78:74:59",
            "net28": "be:01:fa:45:ca:e5",
            "net29": "3e:5d:21:3b:67:38",
            "net3": "86:84:bd:16:3c:c0",
            "net30": "06:60:76:7a:5c:1f",
            "net31": "ea:df:7d:58:1b:89",
            "net4": "2e:18:66:23:b0:8f",
            "net5": "0a:69:09:70:d3:06",
            "net6": "1a:4f:20:c7:0f:3d",
            "net7": "02:08:30:db:1f:33",
            "net8": "e6:40:25:4a:12:72",
            "net9": "92:62:27:e9:ad:b2"
        },
        "tof_1_2_4": {
            "net0": "1a:47:ed:04:40:ed",
            "net1": "fa:c8:af:83:f4:73",
            "net10": "02:0a:35:84:c7:df",
            "net11": "de:6d:81:cd:05:9a",
            "net12": "ee:66:6a:39:ac:41",
            "net13": "3a:ae:2e:f4:d0:f9",
            "net14": "a2:9e:6e:89:a3:31",
            "net15": "c6:a3:96:74:90:0a",
            "net16": "7a:ab:57:f7:46:42",
            "net17": "8e:89:4f:e3:dc:8f",
            "net18": "ea:7f:da:17:a2:82",
            "net19": "a6:60:95:84:2c:88",
            "net2": "92:6e:07:9d:df:69",
            "net20": "0e:08:16:2e:b7:f6",
            "net21": "9a:29:9d:8a:82:36",
            "net22": "f6:cb:a5:e3:46:6c",
            "net23": "46:6e:88:95:f5:c1",
            "net24": "ba:4a:1b:1a:c5:57",
            "net25": "9e:a8:ca:a9:7c:1e",
            "net26": "02:bb:77:2f:be:69",
            "net27": "62:bb:dc:c3:62:1a",
            "net28": "d2:bf:d8:76:49:79",
            "net29": "4a:7a:92:c5:d0:6b",
            "net3": "4a:69:3b:25:53:0e",
            "net30": "4e:ba:4a:05:87:70",
            "net31": "ea:68:41:0b:be:69",
            "net4": "72:1e:38:2b:90:87",
            "net5": "d2:c4:55:29:ab:57",
            "net6": "96:40:86:15:08:81",
            "net7": "be:19:e8:3d:f4:cd",
            "net8": "0a:7b:a0:af:da:74",
            "net9": "4a:35:18:c4:1a:78"
        },
        "tof_1_2_5": {
            "net0": "a6:10:3f:28:e7:b0",
            "net1": "02:d0:a7:23:aa:68",
            "net10": "76:0d:5d:a4:53:98",
            "net11": "42:0c:8c:49:49:be",
            "net12": "12:79:3a:03:e7:de",
            "net13": "7a:0c:4f:43:14:7d",
            "net14": "76:f4:d2:de:da:d9",
            "net15": "fa:f7:ee:46:44:b8",
            "net16": "ce:3f:63:b5:eb:48",
            "net17": "b6:f8:74:67:fa:b8",
            "net18": "1a:91:20:8e:b4:6c",
            "net19": "82:db:ee:e6:54:75",
            "net2": "06:2e:bf:69:e4:28",
            "net20": "8e:77:22:09:84:e7",
            "net21": "c6:cf:c6:a4:12:b6",
            "net22": "f2:2e:3e:8b:dd:c4",
            "net23": "aa:f5:a0:b3:10:8c",
            "net24": "da:c3:46:ca:30:5f",
            "net25": "96:1e:da:d6:70:b5",
            "net26": "da:84:1c:49:6f:45",
            "net27": "8e:91:0c:d8:83:6f",
            "net28": "ca:f7:51:92:d7:ae",
            "net29": "9a:87:2f:50:4a:a1",
            "net3": "06:00:41:a0:a1:b8",
            "net30": "86:d6:cc:61:96:10",
            "net31": "72:bc:ae:1e:00:b6",
            "net4": "6e:d0:be:01:ee:9a",
            "net5": "2a:13:19:58:7a:ec",
            "net6": "e2:ec:23:49:4b:fe",
            "net7": "ce:34:14:56:e0:24",
            "net8": "6a:6c:71:14:cf:cf",
            "net9": "76:7b:b2:48:f9:de"
        },
        "tof_1_2_6": {
            "net0": "3e:60:4b:a9:aa:46",
            "net1": "fa:de:38:2d:30:65",
            "net10": "5a:a1:df:e7:87:ec",
            "net11": "42:2e:11:23:8a:1a",
            "net12": "be:e5:c9:14:60:97",
            "net13": "ba:cb:f7:78:ab:f5",
            "net14": "32:c1:fe:b8:64:09",
            "net15": "3e:2c:e6:b6:27:ef",
            "net16": "3e:19:69:6d:63:a7",
            "net17": "ae:28:e9:c4:33:4a",
            "net18": "ae:c4:36:81:b2:27",
            "net19": "26:dd:f4:53:2b:f3",
            "net2": "a2:c8:d2:85:8d:76",
            "net20": "be:7a:e2:ad:a4:ea",
            "net21": "e2:1f:e5:c3:ed:66",
            "net22": "66:78:03:76:a5:6c",
            "net23": "36:3f:63:06:7e:af",
            "net24": "82:99:0c:29:ed:1b",
            "net25": "f6:74:90:48:d4:ec",
            "net26": "96:92:2d:1a:6e:17",
            "net27": "62:29:2c:78:0f:c7",
            "net28": "76:01:ba:98:1b:f2",
            "net29": "ca:8b:d3:60:e1:a2",
            "net3": "56:bc:2d:de:c5:22",
            "net30": "42:73:d4:bc:51:c8",
            "net31": "6e:83:78:fc:2b:fe",
            "net4": "ba:84:5c:7b:49:73",
            "net5": "5e:76:9a:83:8a:83",
            "net6": "82:3a:8a:75:e5:c3",
            "net7": "3e:b2:40:01:dc:f7",
            "net8": "4e:f0:06:9b:3a:b4",
            "net9": "7e:49:d0:6f:f0:3c"
        },
        "tof_1_2_7": {
            "net0": "ce:74:fd:f8:d3:11",
            "net1": "1e:f3:29:83:31:bf",
            "net10": "ce:96:6c:fb:cf:55",
            "net11": "82:90:f5:38:0e:b5",
            "net12": "b6:2a:70:ff:e6:c4",
            "net13": "46:45:7f:f5:31:4e",
            "net14": "ba:e9:02:c5:2d:71",
            "net15": "3a:df:cd:1e:54:43",
            "net16": "ca:bd:14:9a:7c:79",
            "net17": "a6:48:ad:07:a2:a8",
            "net18": "52:6d:e5:79:ac:a5",
            "net19": "9e:cd:e6:d1:f3:2a",
            "net2": "6e:fc:68:c3:29:dd",
            "net20": "b6:ff:ba:46:f4:63",
            "net21": "b2:e2:ec:22:24:27",
            "net22": "42:88:97:85:fa:60",
            "net23": "46:93:d5:31:c3:1f",
            "net24": "4e:30:8e:e5:d3:0b",
            "net25": "ba:03:ff:e9:39:34",
            "net26": "ae:e6:36:9a:79:a1",
            "net27": "6e:e4:69:dc:35:07",
            "net28": "be:4a:86:96:17:bc",
            "net29": "4e:de:b7:40:72:49",
            "net3": "96:08:ba:9c:fa:29",
            "net30": "fe:9e:34:57:92:eb",
            "net31": "86:0b:8c:02:d1:5b",
            "net4": "ca:e0:12:8c:10:0a",
            "net5": "fa:a0:b2:34:03:ea",
            "net6": "96:9c:3e:bb:ab:26",
            "net7": "1e:6e:95:29:81:6c",
            "net8": "82:35:e0:52:29:4f",
            "net9": "ee:3c:7a:8b:80:6e"
        },
        "tof_1_2_8": {
            "net0": "12:2b:c4:ae:14:1d",
            "net1": "a6:7d:0b:81:8f:9e",
            "net10": "0e:ab:4c:9c:97:bc",
            "net11": "de:6e:71:ea:66:08",
            "net12": "ba:0b:02:f7:33:7b",
            "net13": "66:42:c2:ce:7c:0f",
            "net14": "42:29:51:1c:63:5b",
            "net15": "92:67:cb:a3:23:8e",
            "net16": "26:a2:bb:72:db:30",
            "net17": "66:0c:6e:24:b8:bc",
            "net18": "ee:f9:b2:c1:16:a2",
            "net19": "a2:b4:07:74:66:38",
            "net2": "5a:a3:08:77:ac:6d",
            "net20": "1e:42:86:ad:0c:47",
            "net21": "f2:d7:47:e5:e3:0b",
            "net22": "82:46:14:26:8b:bb",
            "net23": "0e:b7:1e:5d:42:9a",
            "net24": "0e:aa:b1:1b:09:bc",
            "net25": "02:5c:84:55:a0:36",
            "net26": "0a:81:34:83:fb:72",
            "net27": "b2:3c:86:cf:82:1a",
            "net28": "4a:8d:44:d3:6a:c2",
            "net29": "2a:d2:10:75:8a:7b",
            "net3": "f2:3a:07:53:bc:1e",
            "net30": "0a:f9:d4:2d:6c:e3",
            "net31": "3e:88:a5:7b:c1:23",
            "net4": "66:e3:66:f1:d2:bb",
            "net5": "86:9a:4a:13:de:fe",
            "net6": "3e:39:d1:fe:87:1a",
            "net7": "62:ae:bf:31:f5:a5",
            "net8": "e2:ea:69:b7:75:fa",
            "net9": "3e:6d:6f:c0:92:d8"
        },
        "tof_1_2_9": {
            "net0": "ca:2a:ef:1f:6c:80",
            "net1": "fa:46:4e:43:f0:2d",
            "net10": "16:26:f3:1d:f8:ec",
            "net11": "0e:4c:d3:39:4e:34",
            "net12": "be:ed:5f:65:56:f9",
            "net13": "a6:fa:5b:26:97:cc",
            "net14": "8e:9f:00:d8:01:3e",
            "net15": "96:db:e2:5a:97:4c",
            "net16": "72:84:02:aa:bb:2d",
            "net17": "16:cc:a6:dd:06:de",
            "net18": "0a:ff:62:c0:67:01",
            "net19": "46:72:f9:43:03:99",
            "net2": "3a:08:f7:71:ed:39",
            "net20": "52:4f:3e:5e:27:9f",
            "net21": "86:4d:be:bd:2d:0e",
            "net22": "ea:3d:69:75:92:9d",
            "net23": "4e:6a:b0:9f:94:39",
            "net24": "f6:0a:cc:66:47:b6",
            "net25": "5e:73:77:e8:ce:24",
            "net26": "16:17:91:8d:54:54",
            "net27": "7a:e8:d1:0b:96:c3",
            "net28": "16:f3:8a:a3:e5:1e",
            "net29": "32:a6:ed:8c:9e:38",
            "net3": "46:ba:d3:ee:05:55",
            "net30": "3e:4d:01:46:87:1f",
            "net31": "ae:66:f7:7c:c2:6f",
            "net4": "22:ed:95:96:ae:03",
            "net5": "32:4a:61:79:8d:54",
            "net6": "3a:30:31:ff:91:02",
            "net7": "c6:1a:49:70:46:7b",
            "net8": "22:40:0f:b8:72:0d",
            "net9": "72:34:ec:38:e6:2d"
        }
    },
    "failed_machine": "leaf_1_0_1",
    "failed_interfaces": [
        "net0"
    ],
    "failure_time": {
        "leaf_1_0_1": 1635541446.45786,
        "leaf_1_0_10": 1635541446.4759798,
        "leaf_1_0_11": 1635541446.484502,
        "leaf_1_0_12": 1635541446.4921198,
        "leaf_1_0_13": 1635541446.5007102,
        "leaf_1_0_14": 1635541446.5092578,
        "leaf_1_0_15": 1635541446.9432662,
        "leaf_1_0_16": 1635541446.530185,
        "leaf_1_0_2": 1635541446.9675145,
        "leaf_1_0_3": 1635541446.5564744,
        "leaf_1_0_4": 1635541446.4581306,
        "leaf_1_0_5": 1635541446.4770386,
        "leaf_1_0_6": 1635541446.486138,
        "leaf_1_0_7": 1635541446.4959044,
        "leaf_1_0_8": 1635541446.5039535,
        "leaf_1_0_9": 1635541446.5108376,
        "leaf_2_0_1": 1635541446.5184515,
        "leaf_2_0_10": 1635541446.5294344,
        "leaf_2_0_11": 1635541446.543825,
        "leaf_2_0_12": 1635541446.5545363,
        "leaf_2_0_13": 1635541446.5590668,
        "leaf_2_0_14": 1635541446.5652473,
        "leaf_2_0_15": 1635541446.571986,
        "leaf_2_0_16": 1635541446.5793931,
        "leaf_2_0_2": 1635541446.5869098,
        "leaf_2_0_3": 1635541446.5966673,
        "leaf_2_0_4": 1635541446.604234,
        "leaf_2_0_5": 1635541446.611043,
        "leaf_2_0_6": 1635541446.6210349,
        "leaf_2_0_7": 1635541447.0527248,
        "leaf_2_0_8": 1635541446.5631099,
        "leaf_2_0_9": 1635541446.9937108,
        "spine_1_1_1": 1635541446.5789616,
        "spine_1_1_10": 1635541446.5851557,
        "spine_1_1_11": 1635541446.5967093,
        "spine_1_1_12": 1635541446.6041856,
        "spine_1_1_13": 1635541447.0376315,
        "spine_1_1_14": 1635541446.6220298,
        "spine_1_1_15": 1635541446.6308415,
        "spine_1_1_16": 1635541446.641058,
        "spine_1_1_2": 1635541446.6387823,
        "spine_1_1_3": 1635541446.6476042,
        "spine_1_1_4": 1635541446.656621,
        "spine_1_1_5": 1635541446.665228,
        "spine_1_1_6": 1635541446.6777325,
        "spine_1_1_7": 1635541446.6861737,
        "spine_1_1_8": 1635541446.6953547,
        "spine_1_1_9": 1635541446.7013006,
        "spine_2_1_1": 1635541446.7094285,
        "spine_2_1_10": 1635541446.7248223,
        "spine_2_1_11": 1635541446.648232,
        "spine_2_1_12": 1635541446.6571746,
        "spine_2_1_13": 1635541447.0909286,
        "spine_2_1_14": 1635541446.6773794,
        "spine_2_1_15": 1635541446.6886685,
        "spine_2_1_16": 1635541446.695774,
        "spine_2_1_2": 1635541446.7011497,
        "spine_2_1_3": 1635541447.1346695,
        "spine_2_1_4": 1635541446.728591,
        "spine_2_1_5": 1635541446.7384138,
        "spine_2_1_6": 1635541447.156304,
        "spine_2_1_7": 1635541446.7416134,
        "spine_2_1_8": 1635541446.7458344,
        "spine_2_1_9": 1635541446.7545512,
        "tof_1_2_1": 1635541446.7657995,
        "tof_1_2_10": 1635541446.7743688,
        "tof_1_2_11": 1635541446.7838438,
        "tof_1_2_12": 1635541447.2147954,
        "tof_1_2_13": 1635541447.2299092,
        "tof_1_2_14": 1635541446.813985,
        "tof_1_2_15": 1635541446.7473478,
        "tof_1_2_16": 1635541446.754251,
        "tof_1_2_2": 1635541446.7635803,
        "tof_1_2_3": 1635541446.7724493,
        "tof_1_2_4": 1635541446.7805967,
        "tof_1_2_5": 1635541446.7890131,
        "tof_1_2_6": 1635541446.7997732,
        "tof_1_2_7": 1635541446.8067636,
        "tof_1_2_8": 1635541446.8176668,
        "tof_1_2_9": 1635541446.8233368
    }
}