{
    "k_leaf": 2,
    "k_top": 2,
    "redundancy_factor": 2,
    "is_k8s": false,
    "machine_mac_addresses": {
        "leaf_1_0_1": {
            "eth0": "5a:cc:f1:95:fd:dd",
            "eth1": "82:7c:89:ec:69:ef",
            "eth2": "ba:aa:8d:df:3c:3b"
        },
        "leaf_1_0_2": {
            "eth0": "12:5c:48:a7:00:e3",
            "eth1": "b6:f7:14:13:35:9f",
            "eth2": "aa:0d:33:b8:4c:3f"
        },
        "leaf_2_0_1": {
            "eth0": "ca:d8:fe:44:21:2e",
            "eth1": "42:6a:f1:19:40:25",
            "eth2": "aa:ed:04:10:83:d7"
        },
        "leaf_2_0_2": {
            "eth0": "8e:35:0b:c1:4f:9b",
            "eth1": "c6:c7:0b:57:da:f5",
            "eth2": "96:85:27:be:52:4d"
        },
        "spine_1_1_1": {
            "eth0": "fa:bc:af:e7:f3:8a",
            "eth1": "de:14:8d:52:0d:69",
            "eth2": "1a:7f:d8:bf:a9:a5",
            "eth3": "ae:d2:74:e6:37:4d"
        },
        "spine_1_1_2": {
            "eth0": "de:73:cf:f8:ad:41",
            "eth1": "82:fa:0a:56:07:d7",
            "eth2": "ea:3a:45:8e:b1:eb",
            "eth3": "4e:03:c0:1a:da:fa"
        },
        "spine_2_1_1": {
            "eth0": "f6:a3:19:ff:a8:53",
            "eth1": "fa:28:44:34:8c:86",
            "eth2": "ea:92:b9:7a:1c:04",
            "eth3": "56:eb:f0:75:ab:85"
        },
        "spine_2_1_2": {
            "eth0": "66:d6:5e:35:62:03",
            "eth1": "02:78:d2:70:05:c1",
            "eth2": "c2:01:fa:10:db:03",
            "eth3": "72:cf:3f:30:d5:58"
        },
        "tof_1_2_1": {
            "eth0": "fe:1c:6e:8f:93:dc",
            "eth1": "c6:c4:a1:b5:7b:b1",
            "eth2": "1a:55:2a:97:47:09",
            "eth3": "5e:66:d2:e3:c5:c3"
        },
        "tof_1_2_2": {
            "eth0": "92:e4:39:c0:bd:bc",
            "eth1": "c6:64:2a:c1:45:ed",
            "eth2": "56:e0:80:ad:6f:e6",
            "eth3": "fe:70:7f:4e:96:3a"
        }
    },
    "failed_machine": "leaf_1_0_1",
    "failure_time": {
        "leaf_1_0_1": 1622025039.1596093,
        "leaf_1_0_2": 1622025039.1710422,
        "leaf_2_0_1": 1622025039.1633053,
        "leaf_2_0_2": 1622025039.1710384,
        "spine_1_1_1": 1622025039.1711588,
        "spine_1_1_2": 1622025039.1805623,
        "spine_2_1_1": 1622025039.1806178,
        "spine_2_1_2": 1622025039.183803,
        "tof_1_2_1": 1622025039.1917791,
        "tof_1_2_2": 1622025039.1912858
    }
}