{
    "k_leaf": 6,
    "k_top": 6,
    "redundancy_factor": 6,
    "is_k8s": true,
    "machine_mac_addresses": {
        "leaf_1_0_1": {
            "net0": "2e:0d:45:0b:7b:51",
            "net1": "b2:60:a5:1b:c0:14",
            "net2": "02:f2:53:10:6d:82",
            "net3": "ea:9a:47:fb:d4:88",
            "net4": "32:40:31:3d:84:55",
            "net5": "e6:cb:e3:ae:78:4b",
            "net6": "3a:19:81:29:9b:08"
        },
        "leaf_1_0_2": {
            "net0": "b2:6c:23:ca:7b:e7",
            "net1": "5e:b1:a4:cd:4d:c9",
            "net2": "ee:b8:05:82:68:f5",
            "net3": "ae:2d:ed:97:08:89",
            "net4": "16:3c:11:62:f1:e9",
            "net5": "e6:ae:4b:97:d3:8d",
            "net6": "66:52:58:9a:37:36"
        },
        "leaf_1_0_3": {
            "net0": "5a:8f:41:c6:14:93",
            "net1": "42:75:e7:92:5d:61",
            "net2": "3a:6e:49:21:c6:39",
            "net3": "06:01:6a:4b:f7:a5",
            "net4": "d2:c4:fa:2b:be:e7",
            "net5": "ee:f3:43:51:8b:47",
            "net6": "2e:34:94:e8:aa:32"
        },
        "leaf_1_0_4": {
            "net0": "66:e4:f9:08:3f:75",
            "net1": "6a:ad:38:e1:40:bb",
            "net2": "76:a1:fe:f8:15:21",
            "net3": "ea:c2:ec:83:09:a3",
            "net4": "36:8c:2e:d2:6b:cb",
            "net5": "0a:38:ec:17:84:d1",
            "net6": "1a:51:03:30:1f:89"
        },
        "leaf_1_0_5": {
            "net0": "6a:d5:4a:09:8a:8c",
            "net1": "ea:6f:ea:0c:19:6b",
            "net2": "2a:f5:6b:5a:f6:42",
            "net3": "4a:14:a3:69:fd:f0",
            "net4": "9a:45:22:68:2f:a9",
            "net5": "5e:36:c4:69:83:cb",
            "net6": "3a:c0:e9:0e:96:0d"
        },
        "leaf_1_0_6": {
            "net0": "f6:a5:eb:f0:04:33",
            "net1": "72:d8:dc:6c:65:43",
            "net2": "02:1b:f5:73:ce:45",
            "net3": "d2:08:1f:e4:2d:39",
            "net4": "4e:cc:43:2f:be:e2",
            "net5": "4e:12:66:0e:62:b5",
            "net6": "32:f7:6f:8b:70:c1"
        },
        "leaf_2_0_1": {
            "net0": "f6:07:60:72:58:fe",
            "net1": "3e:36:7a:f0:4d:7b",
            "net2": "0e:00:5e:91:0d:75",
            "net3": "c6:61:c8:89:88:da",
            "net4": "7e:2d:ef:16:2a:89",
            "net5": "46:0e:ca:80:69:7d",
            "net6": "2e:ef:c4:ed:8c:6d"
        },
        "leaf_2_0_2": {
            "net0": "0e:66:95:31:6d:69",
            "net1": "62:53:22:27:3c:0b",
            "net2": "ce:48:64:09:c1:9e",
            "net3": "96:31:c6:53:f6:52",
            "net4": "be:c5:e7:20:a9:d7",
            "net5": "6e:6e:f5:61:db:8e",
            "net6": "46:7c:69:e0:f5:c4"
        },
        "leaf_2_0_3": {
            "net0": "82:e3:69:7c:6d:db",
            "net1": "82:41:e5:30:81:09",
            "net2": "f2:44:d2:bf:c3:ff",
            "net3": "46:a4:8a:0d:3f:67",
            "net4": "a2:ff:9f:89:37:a3",
            "net5": "e2:67:8d:38:da:84",
            "net6": "4e:54:7c:cb:2c:47"
        },
        "leaf_2_0_4": {
            "net0": "62:ef:1d:09:2f:10",
            "net1": "66:80:4b:6a:05:a7",
            "net2": "da:3d:22:4a:6f:0e",
            "net3": "9a:a4:56:69:18:5b",
            "net4": "4e:72:a3:83:2c:00",
            "net5": "e2:5f:bb:9f:e5:81",
            "net6": "26:93:7f:ea:a7:fc"
        },
        "leaf_2_0_5": {
            "net0": "ee:ca:8a:e8:84:0b",
            "net1": "ee:47:e6:b4:2e:58",
            "net2": "ca:b9:95:1c:6c:c4",
            "net3": "46:7d:65:a1:96:0d",
            "net4": "e6:00:0b:a7:7e:b4",
            "net5": "66:62:cb:d8:ef:6b",
            "net6": "d2:a4:d1:de:96:4a"
        },
        "leaf_2_0_6": {
            "net0": "8a:af:92:05:c6:da",
            "net1": "9a:64:58:91:41:ea",
            "net2": "fa:27:46:94:d1:d2",
            "net3": "7e:88:1e:92:e8:d8",
            "net4": "d6:8c:2a:38:cc:f9",
            "net5": "d2:a9:d1:e9:87:bd",
            "net6": "6a:3f:6a:d7:80:92"
        },
        "spine_1_1_1": {
            "net0": "a2:1e:9e:4c:db:a4",
            "net1": "d2:ce:0b:92:4c:5b",
            "net10": "e6:5c:58:f4:c2:b6",
            "net11": "56:cd:58:7e:72:b2",
            "net2": "92:39:d5:c4:7d:96",
            "net3": "22:23:83:e6:2e:8e",
            "net4": "f2:cd:bc:77:7a:b3",
            "net5": "36:cb:d9:33:3e:4f",
            "net6": "86:6a:24:7b:bc:59",
            "net7": "b2:21:67:30:fa:5a",
            "net8": "36:a8:ac:16:92:b9",
            "net9": "8a:0a:60:ed:6a:b3"
        },
        "spine_1_1_2": {
            "net0": "e2:a5:25:ec:8f:67",
            "net1": "96:12:54:52:9b:7a",
            "net10": "02:64:25:09:ad:3f",
            "net11": "f6:59:97:b3:a8:1c",
            "net2": "02:79:40:4e:35:67",
            "net3": "aa:cc:a0:ab:83:49",
            "net4": "92:26:98:ec:e1:3d",
            "net5": "f2:7f:f1:4d:9b:e3",
            "net6": "f6:b8:2f:7b:ae:6c",
            "net7": "46:c8:f6:b9:1d:45",
            "net8": "86:6d:a1:3d:5d:a2",
            "net9": "0e:b8:86:f3:f4:f6"
        },
        "spine_1_1_3": {
            "net0": "02:13:a7:1b:2f:64",
            "net1": "0a:c2:cd:ed:27:fc",
            "net10": "72:cf:36:7d:6f:f3",
            "net11": "86:fa:ce:75:1d:1c",
            "net2": "06:fa:a1:40:63:14",
            "net3": "06:8d:3d:1d:eb:45",
            "net4": "32:a6:15:9f:2a:db",
            "net5": "6e:9f:b8:c2:0f:d4",
            "net6": "96:7a:dc:83:39:0a",
            "net7": "fe:31:64:6c:69:69",
            "net8": "52:53:55:a7:ec:23",
            "net9": "a6:b4:cf:69:22:0d"
        },
        "spine_1_1_4": {
            "net0": "66:0d:ca:3e:2a:6c",
            "net1": "02:b7:66:7a:85:0f",
            "net10": "b6:ce:be:e2:60:8b",
            "net11": "52:35:9e:5a:f9:0d",
            "net2": "0a:d6:7c:ea:5f:97",
            "net3": "3a:38:d9:40:4e:19",
            "net4": "12:41:75:a4:f4:ab",
            "net5": "e6:ab:4b:1c:68:68",
            "net6": "36:9c:d1:05:9e:fe",
            "net7": "9a:bf:f4:9c:4f:d1",
            "net8": "8a:94:e9:a3:58:4b",
            "net9": "62:d3:13:60:44:bf"
        },
        "spine_1_1_5": {
            "net0": "96:25:50:99:5d:a8",
            "net1": "e6:6d:9c:35:75:cc",
            "net10": "d6:a9:32:06:8a:2c",
            "net11": "56:ad:6d:34:ee:c1",
            "net2": "aa:2f:40:c8:1e:03",
            "net3": "22:3c:3c:96:b5:15",
            "net4": "4e:29:3f:d2:93:f6",
            "net5": "62:14:96:96:c3:d7",
            "net6": "1e:9c:ea:3b:af:bd",
            "net7": "12:45:9f:6f:ab:6d",
            "net8": "4e:a5:b2:50:1a:42",
            "net9": "22:2e:c8:4f:70:ce"
        },
        "spine_1_1_6": {
            "net0": "26:fa:8c:ad:ca:e5",
            "net1": "86:b9:0b:80:cc:e0",
            "net10": "d6:99:32:1a:6e:96",
            "net11": "1a:d6:8e:3a:d1:d3",
            "net2": "3a:b2:ca:cb:9a:dc",
            "net3": "42:46:2b:01:2d:82",
            "net4": "c6:d3:0f:b3:c2:20",
            "net5": "16:e0:21:83:f6:a9",
            "net6": "9a:17:b5:8d:5a:51",
            "net7": "66:36:7b:f4:7b:f7",
            "net8": "f6:da:6f:a2:c0:50",
            "net9": "62:91:fd:59:de:55"
        },
        "spine_2_1_1": {
            "net0": "c6:34:57:93:f5:ad",
            "net1": "8e:47:ad:8a:6b:6a",
            "net10": "32:35:d3:b5:4f:1a",
            "net11": "fa:cf:19:76:4e:e4",
            "net2": "82:28:87:88:da:21",
            "net3": "5e:f7:28:6d:a1:08",
            "net4": "96:fe:a0:82:64:32",
            "net5": "8e:bb:5a:76:bf:77",
            "net6": "fe:33:2f:89:89:11",
            "net7": "12:5d:a7:85:7f:f8",
            "net8": "76:74:64:c9:3f:ce",
            "net9": "be:da:7a:c7:1f:9b"
        },
        "spine_2_1_2": {
            "net0": "c2:c1:97:82:3a:39",
            "net1": "ee:e8:34:aa:b3:09",
            "net10": "e2:1b:7a:71:b8:16",
            "net11": "12:66:54:93:5e:01",
            "net2": "8e:c2:83:51:08:92",
            "net3": "ee:ae:5a:c7:42:bf",
            "net4": "6e:75:0d:23:09:19",
            "net5": "46:4d:7f:f1:ad:0a",
            "net6": "e2:59:60:6b:88:2b",
            "net7": "46:80:5e:3d:3d:bc",
            "net8": "72:57:a9:bb:71:ad",
            "net9": "0e:b9:2d:6f:2a:95"
        },
        "spine_2_1_3": {
            "net0": "36:37:7e:27:4d:4b",
            "net1": "6e:10:c2:51:22:69",
            "net10": "1a:dd:82:a4:69:85",
            "net11": "52:29:ac:04:03:bf",
            "net2": "5a:20:96:19:05:33",
            "net3": "ee:c8:6b:1f:55:65",
            "net4": "8a:f8:68:83:ae:ca",
            "net5": "46:7f:6e:a4:06:ef",
            "net6": "c6:80:ee:29:bb:01",
            "net7": "02:71:31:c9:97:91",
            "net8": "9a:f1:fa:c5:b1:5e",
            "net9": "de:c8:e7:77:61:59"
        },
        "spine_2_1_4": {
            "net0": "56:b4:3c:56:b5:e2",
            "net1": "a2:f8:69:b2:8a:90",
            "net10": "e2:37:9c:e7:70:df",
            "net11": "92:b1:a1:c8:a4:e3",
            "net2": "16:47:87:ca:28:45",
            "net3": "ea:90:23:59:9d:76",
            "net4": "da:ab:28:b9:a9:77",
            "net5": "26:a0:31:cd:5f:16",
            "net6": "f2:b1:00:2c:f3:91",
            "net7": "56:b3:91:ab:ca:e7",
            "net8": "46:f4:a3:80:f5:58",
            "net9": "92:77:d0:b1:82:7c"
        },
        "spine_2_1_5": {
            "net0": "02:ce:01:e5:17:14",
            "net1": "ba:9b:91:28:59:62",
            "net10": "e2:9e:32:81:60:c2",
            "net11": "f2:46:0c:29:bc:3e",
            "net2": "de:8d:7f:df:e3:31",
            "net3": "62:0a:ba:dd:ee:87",
            "net4": "82:67:81:a1:1b:ed",
            "net5": "8a:52:f2:bc:fe:cb",
            "net6": "fe:0a:5b:b8:42:eb",
            "net7": "aa:19:62:ad:98:9f",
            "net8": "96:3f:f2:48:29:51",
            "net9": "82:dc:a7:de:a4:98"
        },
        "spine_2_1_6": {
            "net0": "be:dc:87:f7:6c:22",
            "net1": "92:04:5d:fa:8d:db",
            "net10": "d6:0f:6b:3f:e8:1b",
            "net11": "0e:67:af:95:f7:ef",
            "net2": "0a:37:94:69:5e:48",
            "net3": "96:53:57:20:dd:05",
            "net4": "52:c1:09:71:e1:83",
            "net5": "c2:1c:2d:18:60:c2",
            "net6": "a6:1f:75:c7:8f:44",
            "net7": "9a:cf:8d:ec:4e:a4",
            "net8": "ce:1b:92:0a:90:70",
            "net9": "52:d5:7a:8e:86:00"
        },
        "tof_1_2_1": {
            "net0": "6a:18:4e:a2:50:46",
            "net1": "ba:8c:ba:e5:d0:c1",
            "net10": "06:50:db:d3:ab:4b",
            "net11": "d6:e1:be:29:ae:f6",
            "net2": "86:54:d4:cb:30:83",
            "net3": "a2:b1:96:1d:05:4a",
            "net4": "8e:3a:e9:8c:bf:29",
            "net5": "a6:61:b5:87:40:a4",
            "net6": "8e:a4:cd:f6:31:33",
            "net7": "3a:ab:df:b8:12:40",
            "net8": "ce:d1:46:c8:fe:d3",
            "net9": "1e:4a:56:81:2d:8c"
        },
        "tof_1_2_2": {
            "net0": "ea:a6:a2:3d:e2:17",
            "net1": "ee:21:61:cc:73:f6",
            "net10": "ce:e8:08:ef:17:be",
            "net11": "b2:71:fa:08:23:28",
            "net2": "9a:90:cf:1d:c2:07",
            "net3": "5a:50:5b:f0:2a:9c",
            "net4": "4e:56:e7:ac:bf:68",
            "net5": "d6:0f:89:0e:f2:59",
            "net6": "ae:d7:77:78:4e:27",
            "net7": "32:60:bf:5f:d4:ca",
            "net8": "66:e3:76:50:b0:83",
            "net9": "0a:f3:72:b8:1d:51"
        },
        "tof_1_2_3": {
            "net0": "1a:ab:f5:63:97:3a",
            "net1": "26:a4:a4:03:2f:74",
            "net10": "32:f3:b7:aa:1d:6d",
            "net11": "6a:ee:77:c0:ea:0d",
            "net2": "2e:4a:1e:1c:55:21",
            "net3": "4a:d2:09:0e:23:7d",
            "net4": "6e:16:02:95:03:ea",
            "net5": "da:08:a1:f2:c6:d3",
            "net6": "de:de:ad:df:29:1b",
            "net7": "a6:2b:be:4a:84:e4",
            "net8": "a2:ef:ca:20:51:c1",
            "net9": "d2:92:5a:39:c3:03"
        },
        "tof_1_2_4": {
            "net0": "42:ed:87:b8:6a:3e",
            "net1": "6e:7c:ec:5e:02:83",
            "net10": "c6:00:70:a1:d5:c7",
            "net11": "a2:9d:ed:94:87:c3",
            "net2": "4e:8c:c0:4a:a0:d2",
            "net3": "12:c8:4d:f0:63:9e",
            "net4": "56:4d:31:1b:7e:ee",
            "net5": "86:42:c3:ec:25:e8",
            "net6": "92:1d:b3:da:84:76",
            "net7": "92:65:b3:fa:81:7e",
            "net8": "b2:6c:d2:94:ec:13",
            "net9": "72:72:a6:e2:56:7f"
        },
        "tof_1_2_5": {
            "net0": "5a:99:cc:43:e3:08",
            "net1": "9a:7d:ba:28:18:14",
            "net10": "92:db:98:93:b7:89",
            "net11": "f6:ed:8d:67:13:60",
            "net2": "2e:94:83:65:b7:ce",
            "net3": "de:8f:0b:ef:57:1b",
            "net4": "5a:97:94:2e:50:56",
            "net5": "be:0e:0b:5f:82:cc",
            "net6": "66:bd:35:bb:da:48",
            "net7": "4a:8f:07:dd:9f:f3",
            "net8": "4e:24:7b:ad:68:2d",
            "net9": "92:ab:6b:23:e5:7b"
        },
        "tof_1_2_6": {
            "net0": "0e:f1:86:17:76:8b",
            "net1": "4a:7f:14:e0:b8:14",
            "net10": "46:fa:a2:d4:e8:6f",
            "net11": "3a:77:f0:99:64:9f",
            "net2": "8a:93:f8:e3:06:0c",
            "net3": "9e:f2:6e:76:ba:79",
            "net4": "c6:94:07:44:64:b7",
            "net5": "da:5e:bf:62:0f:73",
            "net6": "ea:1c:ed:f7:6d:76",
            "net7": "22:cb:14:fe:37:70",
            "net8": "02:19:2e:81:b1:89",
            "net9": "52:f9:65:06:8b:63"
        }
    },
    "failed_machine": "leaf_1_0_1",
    "failure_time": {
        "leaf_1_0_1": 1622757299.1210988,
        "leaf_1_0_2": 1622757299.1330988,
        "leaf_1_0_3": 1622757299.1390326,
        "leaf_1_0_4": 1622757299.146528,
        "leaf_1_0_5": 1622757299.1208873,
        "leaf_1_0_6": 1622757299.1315005,
        "leaf_2_0_1": 1622757299.1412468,
        "leaf_2_0_2": 1622757299.1531627,
        "leaf_2_0_3": 1622757299.1556797,
        "leaf_2_0_4": 1622757299.1654015,
        "leaf_2_0_5": 1622757299.1749532,
        "leaf_2_0_6": 1622757299.1874099,
        "spine_1_1_1": 1622757299.1633105,
        "spine_1_1_2": 1622757299.166364,
        "spine_1_1_3": 1622757299.1744416,
        "spine_1_1_4": 1622757299.18583,
        "spine_1_1_5": 1622757299.1986456,
        "spine_1_1_6": 1622757299.2059848,
        "spine_2_1_1": 1622757299.2124262,
        "spine_2_1_2": 1622757299.2207355,
        "spine_2_1_3": 1622757299.1964774,
        "spine_2_1_4": 1622757299.202662,
        "spine_2_1_5": 1622757299.2117746,
        "spine_2_1_6": 1622757299.2186337,
        "tof_1_2_1": 1622757299.227804,
        "tof_1_2_2": 1622757299.239055,
        "tof_1_2_3": 1622757299.2488828,
        "tof_1_2_4": 1622757299.2562785,
        "tof_1_2_5": 1622757299.229401,
        "tof_1_2_6": 1622757299.2431736
    }
}