{
    "k_leaf": 6,
    "k_top": 6,
    "redundancy_factor": 3,
    "is_k8s": true,
    "machine_mac_addresses": {
        "leaf_1_0_1": {
            "net0": "d6:d7:b9:28:36:8e",
            "net1": "02:c6:b9:61:13:61",
            "net2": "22:fb:7c:b9:b7:8a",
            "net3": "4a:57:50:86:f4:33",
            "net4": "ba:00:b7:88:95:97",
            "net5": "7a:cb:dc:da:00:a6",
            "net6": "22:34:7d:77:d1:5d"
        },
        "leaf_1_0_2": {
            "net0": "7e:41:e5:20:8b:e6",
            "net1": "e6:1d:d9:09:aa:11",
            "net2": "d6:51:cc:76:5c:df",
            "net3": "36:a7:64:be:df:c2",
            "net4": "fe:eb:91:6f:dc:a8",
            "net5": "d2:97:6f:cd:1e:91",
            "net6": "fa:e2:f4:0c:95:94"
        },
        "leaf_1_0_3": {
            "net0": "6a:49:d5:21:99:f1",
            "net1": "a6:d5:78:83:ff:0e",
            "net2": "e6:e7:fb:1a:6a:4a",
            "net3": "fe:8e:1f:00:0d:63",
            "net4": "82:59:53:81:39:7b",
            "net5": "ce:29:9c:e1:c2:0d",
            "net6": "2a:0f:7a:60:6d:05"
        },
        "leaf_1_0_4": {
            "net0": "e2:6f:08:66:70:ed",
            "net1": "52:74:76:09:d9:cf",
            "net2": "0a:b6:da:f5:6d:e2",
            "net3": "4e:4e:bd:f3:81:83",
            "net4": "7e:68:50:e1:7b:97",
            "net5": "d6:aa:87:cc:69:b0",
            "net6": "6a:e7:21:33:cb:11"
        },
        "leaf_1_0_5": {
            "net0": "c2:ad:49:6c:b8:5f",
            "net1": "de:4b:0e:06:11:ea",
            "net2": "f2:41:f6:7d:56:7c",
            "net3": "6a:e6:58:a8:a6:2a",
            "net4": "d2:02:8f:14:31:d1",
            "net5": "06:28:4f:24:7d:dc",
            "net6": "da:fc:fe:19:e5:a6"
        },
        "leaf_1_0_6": {
            "net0": "be:86:fc:0a:c1:92",
            "net1": "6a:e3:52:8b:7c:5e",
            "net2": "d6:13:e3:ce:60:fd",
            "net3": "ce:2e:93:0c:f3:96",
            "net4": "ce:1b:b4:73:6c:d8",
            "net5": "82:67:61:31:2c:a2",
            "net6": "76:3d:fc:96:87:54"
        },
        "leaf_2_0_1": {
            "net0": "7a:7c:a4:35:98:c5",
            "net1": "52:97:49:dd:6b:79",
            "net2": "66:1f:a5:f6:8e:e3",
            "net3": "5e:b9:2e:01:23:73",
            "net4": "8a:92:7a:56:da:f2",
            "net5": "92:90:87:fc:c9:f0",
            "net6": "a2:62:16:b7:e7:10"
        },
        "leaf_2_0_2": {
            "net0": "ba:5b:2b:0b:9e:61",
            "net1": "ee:04:5a:71:35:15",
            "net2": "d2:99:7f:9f:04:65",
            "net3": "56:47:99:50:e7:3f",
            "net4": "16:c4:2b:5c:75:6b",
            "net5": "02:0d:67:2e:f3:8f",
            "net6": "6a:ec:ca:78:f5:f7"
        },
        "leaf_2_0_3": {
            "net0": "da:92:d0:d8:b5:a9",
            "net1": "7e:df:c0:33:b9:26",
            "net2": "16:92:3d:a1:84:41",
            "net3": "d2:a5:c2:5c:55:63",
            "net4": "2a:af:b0:d4:3e:84",
            "net5": "ea:fd:22:0c:b6:a5",
            "net6": "62:2c:4e:fc:99:54"
        },
        "leaf_2_0_4": {
            "net0": "5a:80:b6:41:8b:35",
            "net1": "ee:94:b3:ef:12:20",
            "net2": "86:1b:e7:cd:1a:fe",
            "net3": "1a:4f:c3:cb:31:de",
            "net4": "22:cc:f0:ce:ab:84",
            "net5": "0e:53:a5:f4:ee:3e",
            "net6": "da:3f:ff:17:77:97"
        },
        "leaf_2_0_5": {
            "net0": "e2:8b:c3:29:cf:34",
            "net1": "96:bc:78:4c:7e:46",
            "net2": "ce:a9:95:45:0d:92",
            "net3": "62:82:ae:6a:c9:06",
            "net4": "0e:db:23:70:6a:ea",
            "net5": "c6:d7:23:93:97:f4",
            "net6": "da:f6:b1:f3:4f:40"
        },
        "leaf_2_0_6": {
            "net0": "86:62:44:95:42:fa",
            "net1": "86:62:8b:5e:69:25",
            "net2": "b2:cb:2d:c7:46:f2",
            "net3": "06:c2:99:3f:6f:da",
            "net4": "b2:11:a5:b5:5f:9b",
            "net5": "6a:5c:1d:d3:bf:e2",
            "net6": "5e:27:9e:08:b7:d0"
        },
        "leaf_3_0_1": {
            "net0": "92:c3:5d:44:cc:57",
            "net1": "fa:9d:d8:f5:26:90",
            "net2": "fe:d9:42:91:09:9c",
            "net3": "0e:af:c5:db:8a:dc",
            "net4": "96:79:c8:c6:ec:a4",
            "net5": "a6:c0:d5:5e:20:9e",
            "net6": "ae:44:9b:fe:a9:9c"
        },
        "leaf_3_0_2": {
            "net0": "ae:80:ac:3a:b7:af",
            "net1": "ce:24:83:1d:7a:6a",
            "net2": "e6:1d:e2:49:15:0e",
            "net3": "be:3f:d0:6e:e4:e0",
            "net4": "42:cb:17:7c:94:de",
            "net5": "3a:49:41:14:25:56",
            "net6": "5e:c2:25:61:cc:45"
        },
        "leaf_3_0_3": {
            "net0": "56:7c:7e:aa:54:c4",
            "net1": "42:7c:32:4c:8b:6f",
            "net2": "9e:93:99:30:b8:a0",
            "net3": "96:7f:79:2d:82:25",
            "net4": "92:20:a8:8d:0d:30",
            "net5": "82:55:a1:0b:02:c8",
            "net6": "16:9f:54:19:61:04"
        },
        "leaf_3_0_4": {
            "net0": "9e:b4:07:aa:d0:54",
            "net1": "52:82:8f:86:9a:ce",
            "net2": "ee:d0:bf:74:f0:1e",
            "net3": "2a:ca:55:ce:0f:d7",
            "net4": "76:65:53:a6:ff:86",
            "net5": "7a:0d:19:23:b2:86",
            "net6": "c2:d5:51:0d:da:3e"
        },
        "leaf_3_0_5": {
            "net0": "a6:52:e3:19:eb:33",
            "net1": "a6:ea:e3:e9:6e:af",
            "net2": "42:c6:29:ae:09:4a",
            "net3": "f2:40:d9:df:d2:aa",
            "net4": "be:e2:2b:b9:1e:b9",
            "net5": "56:dc:ed:f4:7d:ef",
            "net6": "06:46:37:e7:9d:33"
        },
        "leaf_3_0_6": {
            "net0": "e2:f8:7b:e2:d3:55",
            "net1": "0e:9c:d4:d6:6c:66",
            "net2": "8a:e1:a2:68:7d:a8",
            "net3": "06:f8:74:73:11:a9",
            "net4": "e6:28:8b:26:c5:5c",
            "net5": "5a:13:16:b9:4a:a6",
            "net6": "4e:02:53:34:59:8a"
        },
        "leaf_4_0_1": {
            "net0": "c2:29:87:e8:12:e3",
            "net1": "22:c2:0a:a3:b0:1b",
            "net2": "1a:74:40:20:45:e2",
            "net3": "42:a3:f6:a9:81:ae",
            "net4": "c6:12:6f:91:4d:a3",
            "net5": "0e:41:d0:ae:34:fb",
            "net6": "fa:ff:42:c0:3a:41"
        },
        "leaf_4_0_2": {
            "net0": "16:dd:db:fa:62:b8",
            "net1": "7a:48:3c:c4:e6:53",
            "net2": "3e:a1:45:20:a3:0f",
            "net3": "6e:96:07:fa:17:ed",
            "net4": "ba:88:70:36:7d:61",
            "net5": "3a:c3:cc:b2:4f:c4",
            "net6": "ca:66:d5:82:d5:2c"
        },
        "leaf_4_0_3": {
            "net0": "16:6e:1d:60:d0:e3",
            "net1": "fa:95:df:50:98:bd",
            "net2": "fa:8f:cf:67:a6:a0",
            "net3": "02:32:17:e6:fa:46",
            "net4": "1a:e6:7b:fa:ae:5d",
            "net5": "02:6b:0a:2a:99:d2",
            "net6": "e2:3c:d6:78:7c:2c"
        },
        "leaf_4_0_4": {
            "net0": "76:e4:a4:da:bd:ac",
            "net1": "de:de:50:ba:d8:34",
            "net2": "a6:b7:31:a3:11:76",
            "net3": "f2:76:3b:c6:a4:05",
            "net4": "46:43:0d:78:b0:2e",
            "net5": "8e:b8:da:0b:d5:b0",
            "net6": "8e:50:b3:13:80:5d"
        },
        "leaf_4_0_5": {
            "net0": "76:fc:62:53:4c:d1",
            "net1": "22:96:8e:d7:10:2a",
            "net2": "9e:e5:b0:77:75:86",
            "net3": "46:9b:8d:19:0d:4e",
            "net4": "be:08:d0:8f:1a:15",
            "net5": "12:65:da:06:95:2c",
            "net6": "e6:e8:f5:5a:b8:00"
        },
        "leaf_4_0_6": {
            "net0": "66:c6:96:a9:69:d4",
            "net1": "06:b4:7c:ec:a4:ea",
            "net2": "ca:f9:ec:a2:b4:ec",
            "net3": "36:81:30:fa:cf:2e",
            "net4": "3e:72:83:3b:a8:56",
            "net5": "56:dd:e9:15:c0:2b",
            "net6": "aa:41:1a:75:ab:27"
        },
        "spine_1_1_1": {
            "net0": "02:ce:2f:2b:e4:e4",
            "net1": "f2:8b:3a:12:c0:54",
            "net10": "76:b9:a2:85:82:10",
            "net11": "72:af:a2:5a:c4:73",
            "net2": "fa:9d:32:a7:4f:55",
            "net3": "da:64:f2:4e:60:34",
            "net4": "d6:3f:61:16:ac:01",
            "net5": "02:59:57:58:81:d6",
            "net6": "26:4a:23:48:12:39",
            "net7": "b2:89:94:27:62:e3",
            "net8": "0a:d3:58:e1:bf:b9",
            "net9": "aa:21:44:e2:62:a5"
        },
        "spine_1_1_2": {
            "net0": "de:74:09:af:91:81",
            "net1": "4e:c4:a5:8f:b0:77",
            "net10": "a6:24:79:f8:06:c2",
            "net11": "5e:ff:8d:5a:81:00",
            "net2": "ea:c3:43:aa:be:3a",
            "net3": "0a:d1:5f:73:b1:a4",
            "net4": "ee:9f:e5:40:ac:64",
            "net5": "06:9a:71:ae:d7:48",
            "net6": "5a:36:62:0a:5c:7f",
            "net7": "5a:e2:47:e5:dd:a9",
            "net8": "a6:1a:c0:e8:14:ab",
            "net9": "6e:45:cc:e4:2f:d8"
        },
        "spine_1_1_3": {
            "net0": "76:d2:3d:f2:c0:96",
            "net1": "4a:79:d8:46:cb:a9",
            "net10": "2e:1f:82:a0:75:a7",
            "net11": "46:4c:95:16:28:5c",
            "net2": "1a:fe:29:b3:81:72",
            "net3": "c6:ad:4e:17:d4:d2",
            "net4": "de:5d:c5:ce:cf:a7",
            "net5": "1e:c4:e6:ca:d1:f8",
            "net6": "26:5d:67:67:5a:63",
            "net7": "c6:cb:de:23:14:01",
            "net8": "36:91:7c:93:07:45",
            "net9": "66:8f:ff:76:c9:20"
        },
        "spine_1_1_4": {
            "net0": "0a:f1:8d:3f:ff:35",
            "net1": "2e:da:96:05:8d:71",
            "net10": "4e:07:62:91:c3:7c",
            "net11": "f2:7d:66:f5:22:25",
            "net2": "aa:76:73:1e:7b:89",
            "net3": "fa:fb:97:9d:3d:44",
            "net4": "7a:49:85:88:5d:4c",
            "net5": "da:cc:39:9c:75:5f",
            "net6": "a2:80:ea:52:d6:2b",
            "net7": "06:4e:72:89:69:9b",
            "net8": "62:82:da:a2:46:22",
            "net9": "62:6b:e6:7a:d4:5d"
        },
        "spine_1_1_5": {
            "net0": "ee:92:e5:e4:43:fe",
            "net1": "8e:81:3c:ff:f9:47",
            "net10": "5a:20:d1:d1:b6:2b",
            "net11": "92:c7:20:1a:f0:e0",
            "net2": "06:c2:65:b8:e8:c6",
            "net3": "f6:17:de:43:f2:ba",
            "net4": "02:00:21:98:9f:80",
            "net5": "b2:c4:3a:5b:ec:d6",
            "net6": "ca:a4:78:d4:06:0f",
            "net7": "16:bb:df:b4:3d:cf",
            "net8": "52:17:df:fc:fd:21",
            "net9": "ee:ca:73:bc:dd:97"
        },
        "spine_1_1_6": {
            "net0": "66:e1:fe:16:7f:82",
            "net1": "ee:46:94:b4:d1:66",
            "net10": "8e:6a:6a:a9:58:a2",
            "net11": "86:63:d3:da:b9:92",
            "net2": "1a:7e:93:58:55:15",
            "net3": "26:28:0f:8b:71:32",
            "net4": "fe:7e:0d:33:47:12",
            "net5": "92:48:39:ad:57:3c",
            "net6": "8a:6d:f0:1b:f1:58",
            "net7": "56:b2:66:7c:d2:12",
            "net8": "66:b3:c1:f0:8b:e9",
            "net9": "9a:5a:5a:73:d0:fe"
        },
        "spine_2_1_1": {
            "net0": "72:5d:9d:b7:d8:05",
            "net1": "8e:6d:a4:b6:d0:9f",
            "net10": "76:7b:ae:32:9d:6b",
            "net11": "62:00:b2:88:96:7d",
            "net2": "9e:bc:88:8d:f6:48",
            "net3": "2e:8e:36:89:71:7d",
            "net4": "e2:12:70:80:f0:9f",
            "net5": "c2:f9:d0:87:b8:13",
            "net6": "56:68:fb:a2:bd:59",
            "net7": "86:a2:d3:95:a0:79",
            "net8": "76:34:d3:1e:99:ed",
            "net9": "36:49:c1:19:4c:68"
        },
        "spine_2_1_2": {
            "net0": "f2:74:79:f2:ed:76",
            "net1": "7e:1f:fb:83:c3:53",
            "net10": "1a:d4:d2:62:82:95",
            "net11": "c6:78:c9:fa:50:35",
            "net2": "f6:0a:1b:8b:d3:c2",
            "net3": "0a:c0:f1:08:7d:c5",
            "net4": "d6:2a:d9:d0:3c:5d",
            "net5": "16:3d:1d:87:6a:68",
            "net6": "6e:f7:da:26:de:ce",
            "net7": "e6:75:d0:64:40:72",
            "net8": "d2:8e:81:e7:9e:c8",
            "net9": "0e:e9:1e:52:ff:c4"
        },
        "spine_2_1_3": {
            "net0": "ce:f0:c2:25:10:8d",
            "net1": "8e:a9:be:7c:87:2a",
            "net10": "4a:6d:48:17:36:4d",
            "net11": "ca:0f:8f:b0:8c:7f",
            "net2": "3a:ec:fd:9d:3c:23",
            "net3": "52:78:fc:66:33:40",
            "net4": "92:ec:b9:38:6e:8f",
            "net5": "26:34:ce:65:a5:dd",
            "net6": "de:76:c7:27:21:2c",
            "net7": "32:b9:3e:a0:c1:fe",
            "net8": "46:aa:82:39:0d:db",
            "net9": "36:d7:ad:3a:3b:82"
        },
        "spine_2_1_4": {
            "net0": "c2:37:bc:5a:88:f4",
            "net1": "86:7d:8e:a8:44:1c",
            "net10": "d2:e6:32:34:5a:f4",
            "net11": "9a:82:53:df:f8:93",
            "net2": "26:20:c2:0e:7d:4d",
            "net3": "16:c0:93:5c:52:bc",
            "net4": "7e:0b:31:6e:4f:39",
            "net5": "4a:25:99:b2:bd:37",
            "net6": "9a:ee:67:5e:c4:a0",
            "net7": "b6:45:c3:ed:ab:3e",
            "net8": "2e:6d:2c:97:de:e8",
            "net9": "da:e2:93:74:cc:5a"
        },
        "spine_2_1_5": {
            "net0": "46:0a:6e:63:47:de",
            "net1": "2e:c4:48:68:5c:d5",
            "net10": "72:58:aa:71:e6:99",
            "net11": "8e:43:d3:11:fa:18",
            "net2": "36:e5:e8:77:88:02",
            "net3": "7e:36:52:76:b9:54",
            "net4": "86:06:c8:29:3b:f6",
            "net5": "0e:5c:ef:47:e7:9c",
            "net6": "86:5c:84:c8:e3:6e",
            "net7": "12:88:64:6f:5c:4f",
            "net8": "fe:ea:43:d2:29:cb",
            "net9": "aa:75:b0:79:7e:70"
        },
        "spine_2_1_6": {
            "net0": "d6:3a:09:21:ec:fd",
            "net1": "46:08:d2:cd:e2:f0",
            "net10": "f2:b9:ec:a8:60:cb",
            "net11": "fe:10:f3:ff:48:8e",
            "net2": "42:f1:62:8c:83:3d",
            "net3": "4e:ab:1d:e5:0d:72",
            "net4": "4e:bf:04:90:a3:c0",
            "net5": "2e:b5:53:6b:d0:72",
            "net6": "3e:20:e1:d2:77:49",
            "net7": "e6:db:09:06:97:28",
            "net8": "aa:4a:da:31:23:65",
            "net9": "46:07:d4:04:f7:aa"
        },
        "spine_3_1_1": {
            "net0": "de:70:32:cf:94:a5",
            "net1": "92:79:bf:ee:10:64",
            "net10": "c6:b7:fe:42:c3:69",
            "net11": "86:fb:4f:27:5f:e4",
            "net2": "b2:4c:42:13:ef:0b",
            "net3": "ca:75:5b:74:ce:ec",
            "net4": "32:8f:0d:a6:48:94",
            "net5": "72:6a:f4:73:a7:26",
            "net6": "2a:9d:10:3e:45:84",
            "net7": "06:7e:aa:bd:cd:83",
            "net8": "4a:f7:38:23:0d:97",
            "net9": "a6:e3:fa:12:2d:3b"
        },
        "spine_3_1_2": {
            "net0": "26:59:43:69:29:9a",
            "net1": "da:67:33:fb:e2:d2",
            "net10": "76:bd:cb:3a:e4:b7",
            "net11": "e6:5c:55:5a:a7:b0",
            "net2": "62:fe:12:e2:a7:fe",
            "net3": "5a:78:6a:99:b3:39",
            "net4": "7a:8e:06:da:c6:f4",
            "net5": "f2:81:96:ee:93:44",
            "net6": "92:9c:86:d3:a5:60",
            "net7": "fa:e2:a7:8f:6a:08",
            "net8": "f2:78:a4:1a:aa:77",
            "net9": "42:95:51:f9:3b:f0"
        },
        "spine_3_1_3": {
            "net0": "4a:b8:30:6b:5a:67",
            "net1": "6a:0a:3e:69:30:98",
            "net10": "c2:d9:74:4e:3c:45",
            "net11": "56:ee:0d:e3:ea:61",
            "net2": "2e:cc:6d:7e:96:8f",
            "net3": "9a:81:87:43:24:57",
            "net4": "0a:da:0b:51:1c:03",
            "net5": "92:39:60:80:eb:30",
            "net6": "6e:c8:fb:2f:15:4c",
            "net7": "ee:10:b8:e4:8b:70",
            "net8": "3e:bd:43:ef:f5:98",
            "net9": "96:cd:b2:51:d9:9b"
        },
        "spine_3_1_4": {
            "net0": "d6:df:e1:d9:09:93",
            "net1": "5a:7b:1c:bd:c0:20",
            "net10": "8e:65:cc:a0:90:9b",
            "net11": "22:f7:45:ab:a7:62",
            "net2": "0e:fa:60:fb:2e:97",
            "net3": "7a:bd:46:f3:bd:4a",
            "net4": "b2:25:2f:71:db:76",
            "net5": "46:eb:fb:11:4d:16",
            "net6": "92:63:3b:85:a3:5b",
            "net7": "52:bc:c4:27:a0:40",
            "net8": "ea:c9:c8:3b:16:c3",
            "net9": "4e:29:ff:d2:a0:b8"
        },
        "spine_3_1_5": {
            "net0": "1a:3a:b7:ff:5b:bd",
            "net1": "de:91:1a:44:a6:d0",
            "net10": "3e:77:46:02:8d:58",
            "net11": "da:0f:1d:ff:cd:b7",
            "net2": "72:5c:e7:e8:12:72",
            "net3": "2e:6e:43:c5:58:cd",
            "net4": "f2:21:ad:6b:ab:90",
            "net5": "46:df:5e:24:0f:ee",
            "net6": "1a:3d:2c:d2:2b:0a",
            "net7": "e6:6e:e4:24:3f:05",
            "net8": "7a:5c:aa:2d:32:17",
            "net9": "b6:43:84:aa:f0:bf"
        },
        "spine_3_1_6": {
            "net0": "42:24:de:89:fd:ae",
            "net1": "36:cc:c3:e1:bb:94",
            "net10": "ce:9c:fe:d1:69:03",
            "net11": "56:91:cf:7a:35:ca",
            "net2": "ca:2b:7e:8c:1b:4f",
            "net3": "4a:80:91:29:b6:c6",
            "net4": "e2:8c:17:3c:ca:75",
            "net5": "d6:63:4b:0a:95:56",
            "net6": "ba:9a:4b:e2:2e:d1",
            "net7": "2e:23:8d:a7:15:e0",
            "net8": "b6:b1:50:69:7d:3d",
            "net9": "b2:82:44:42:ea:eb"
        },
        "spine_4_1_1": {
            "net0": "f2:e5:b5:2b:70:7d",
            "net1": "c6:56:d1:b7:55:2c",
            "net10": "36:8e:0c:ac:75:24",
            "net11": "d2:ae:06:c6:bd:5f",
            "net2": "5a:65:4e:01:e6:ea",
            "net3": "36:8f:54:c1:39:87",
            "net4": "fa:6f:bb:73:1a:fa",
            "net5": "b2:79:63:86:2b:01",
            "net6": "ce:07:af:57:ed:3b",
            "net7": "16:29:8b:7a:4d:07",
            "net8": "16:ff:14:24:a3:ca",
            "net9": "e2:d2:03:c2:07:a6"
        },
        "spine_4_1_2": {
            "net0": "06:75:ac:86:48:b8",
            "net1": "7e:1b:c4:0d:44:ea",
            "net10": "66:e0:66:7e:b4:56",
            "net11": "06:69:97:a1:03:a1",
            "net2": "ee:d2:86:4c:0f:cf",
            "net3": "82:57:62:f0:ac:72",
            "net4": "82:e4:87:94:9d:8c",
            "net5": "72:9b:e7:cc:10:7a",
            "net6": "26:b0:b8:87:16:0e",
            "net7": "56:c7:35:ef:87:e5",
            "net8": "d6:3b:04:2e:85:c2",
            "net9": "a2:e4:23:db:50:da"
        },
        "spine_4_1_3": {
            "net0": "16:28:d0:21:1c:70",
            "net1": "72:78:04:ab:ab:4a",
            "net10": "e2:f1:c2:31:77:76",
            "net11": "62:4e:5a:83:2e:f5",
            "net2": "d6:21:0b:93:fa:d5",
            "net3": "de:9a:83:13:42:ff",
            "net4": "92:f9:be:ef:40:70",
            "net5": "a2:ab:0f:2e:28:1f",
            "net6": "5e:a3:19:6d:aa:98",
            "net7": "56:3a:ff:65:04:4e",
            "net8": "5e:8a:2a:8b:a9:39",
            "net9": "d2:67:06:58:da:43"
        },
        "spine_4_1_4": {
            "net0": "4a:8a:94:c7:8d:4a",
            "net1": "ca:55:06:8a:ed:19",
            "net10": "72:67:e7:61:84:c0",
            "net11": "ea:91:db:25:b3:45",
            "net2": "72:12:03:b8:a3:c5",
            "net3": "5a:77:49:1b:d2:a7",
            "net4": "26:77:1b:b9:b3:69",
            "net5": "5e:ee:8a:72:e4:5e",
            "net6": "de:9b:d8:a4:86:93",
            "net7": "ce:21:f8:ca:03:1c",
            "net8": "52:3a:66:7c:19:d4",
            "net9": "ba:d8:12:c4:d0:4d"
        },
        "spine_4_1_5": {
            "net0": "56:35:27:c4:8a:f7",
            "net1": "66:88:90:ed:97:1e",
            "net10": "7a:53:64:78:9c:f1",
            "net11": "d6:d5:02:06:20:01",
            "net2": "1a:2d:7e:2e:3e:e8",
            "net3": "9a:30:11:86:9c:e9",
            "net4": "8e:b3:fd:82:03:7f",
            "net5": "ba:45:f5:5a:cb:77",
            "net6": "42:2c:37:e3:35:84",
            "net7": "2a:7e:12:6b:1a:c8",
            "net8": "7e:b5:f3:b0:cd:ee",
            "net9": "3e:56:36:29:c1:e1"
        },
        "spine_4_1_6": {
            "net0": "2e:b8:58:74:39:c1",
            "net1": "92:c2:b8:53:9f:8b",
            "net10": "16:96:95:bb:4c:c4",
            "net11": "3a:e5:82:09:44:47",
            "net2": "b2:c8:f0:2a:f0:c9",
            "net3": "4e:1a:d1:6e:f5:b7",
            "net4": "5e:6d:e3:e1:2b:c6",
            "net5": "fe:02:8d:4a:a3:84",
            "net6": "0a:8c:13:51:1d:7b",
            "net7": "52:ee:50:b6:39:c6",
            "net8": "fe:66:d3:0e:a3:2c",
            "net9": "da:e1:ea:1c:e8:26"
        },
        "tof_1_2_1": {
            "net0": "2e:d1:18:f3:fc:23",
            "net1": "be:65:5b:cf:59:98",
            "net10": "82:12:5f:7d:18:11",
            "net11": "82:3e:1c:e2:8f:e7",
            "net2": "aa:b5:9d:52:40:98",
            "net3": "6a:47:9e:b3:17:bd",
            "net4": "f6:ec:44:42:32:cd",
            "net5": "06:27:83:94:0a:f6",
            "net6": "2a:d3:4d:0a:16:f1",
            "net7": "d6:4d:6f:92:88:6c",
            "net8": "0e:be:81:dc:86:55",
            "net9": "a6:18:b0:57:34:3b"
        },
        "tof_1_2_2": {
            "net0": "76:53:63:e4:42:1e",
            "net1": "76:d9:b0:e6:38:b5",
            "net10": "1e:a9:f9:e9:73:ee",
            "net11": "c6:48:c8:0b:37:72",
            "net2": "86:06:f0:c6:73:d7",
            "net3": "a2:90:4b:0f:41:51",
            "net4": "9e:ef:1c:a0:07:78",
            "net5": "f6:82:80:82:60:14",
            "net6": "aa:b2:d2:e4:13:e2",
            "net7": "12:61:4b:ed:f8:e7",
            "net8": "72:d4:05:2c:5b:7d",
            "net9": "3a:a4:15:0e:3c:90"
        },
        "tof_1_2_3": {
            "net0": "c2:7d:24:78:28:58",
            "net1": "ca:d6:a4:74:77:4f",
            "net10": "2e:ef:39:23:06:dc",
            "net11": "d2:69:3d:b4:dc:30",
            "net2": "12:bc:73:76:19:a1",
            "net3": "d2:77:dc:ea:3e:72",
            "net4": "d2:59:54:cf:30:9b",
            "net5": "c6:e0:f8:94:95:35",
            "net6": "72:62:40:20:42:9b",
            "net7": "9e:a9:c9:0f:b1:14",
            "net8": "aa:8e:42:bc:4e:f6",
            "net9": "ea:0f:57:07:30:a6"
        },
        "tof_1_2_4": {
            "net0": "82:06:6d:da:d8:0c",
            "net1": "9e:42:ef:8b:1c:a3",
            "net10": "96:ae:d0:f5:fe:a5",
            "net11": "76:2b:c3:0c:e0:b2",
            "net2": "b2:85:b4:8f:bc:34",
            "net3": "76:85:c7:69:93:5f",
            "net4": "9e:35:79:25:eb:ff",
            "net5": "8a:e5:40:c2:f9:62",
            "net6": "12:1c:e6:64:56:a1",
            "net7": "ca:65:0f:e7:c9:c7",
            "net8": "ca:fe:a7:a7:f4:c8",
            "net9": "3a:da:8a:4d:0c:50"
        },
        "tof_1_2_5": {
            "net0": "56:05:9c:e2:87:06",
            "net1": "a6:e0:5f:15:89:c0",
            "net10": "86:dc:7b:99:2f:ea",
            "net11": "42:45:35:31:78:8c",
            "net2": "aa:6b:ae:53:b7:ba",
            "net3": "32:83:45:c7:01:a2",
            "net4": "02:f2:b9:b4:d2:02",
            "net5": "3e:3c:66:7d:d8:32",
            "net6": "e6:59:bb:e0:4e:ea",
            "net7": "c6:a7:ab:dd:f0:60",
            "net8": "c2:6a:7e:e1:a4:b0",
            "net9": "62:76:af:75:40:ca"
        },
        "tof_1_2_6": {
            "net0": "b6:2d:6a:e0:63:86",
            "net1": "1a:59:6a:eb:71:de",
            "net10": "c6:fc:fd:05:bc:6b",
            "net11": "aa:df:63:b5:b3:77",
            "net2": "c2:00:46:db:d7:db",
            "net3": "7e:c5:8b:0d:25:5f",
            "net4": "32:07:96:86:22:9f",
            "net5": "3a:33:7b:d3:5d:82",
            "net6": "72:04:43:92:84:a9",
            "net7": "fa:e9:b1:a3:27:98",
            "net8": "4a:f4:c1:33:36:be",
            "net9": "b6:f1:2c:72:af:53"
        },
        "tof_2_2_1": {
            "net0": "c2:62:f9:5f:1e:69",
            "net1": "6e:86:91:b3:f2:96",
            "net10": "42:b0:4f:f3:9b:7b",
            "net11": "3a:85:a8:1b:22:70",
            "net2": "96:e7:83:73:8e:df",
            "net3": "b2:ef:4d:19:8e:09",
            "net4": "ca:de:18:8f:a5:ea",
            "net5": "a2:44:51:10:5b:10",
            "net6": "12:d2:cb:0b:24:dd",
            "net7": "6a:83:11:e5:32:f2",
            "net8": "72:05:68:5b:60:ea",
            "net9": "7a:b7:de:0c:91:0a"
        },
        "tof_2_2_2": {
            "net0": "02:ae:6d:d8:1a:89",
            "net1": "be:0b:bb:c2:e0:92",
            "net10": "0e:b7:77:7a:36:60",
            "net11": "fe:a7:96:5c:5a:8f",
            "net2": "22:c2:45:37:e2:72",
            "net3": "fe:c3:fd:e2:34:04",
            "net4": "f6:5d:3c:54:5c:c4",
            "net5": "ea:e7:78:aa:da:f9",
            "net6": "42:79:c3:b4:71:03",
            "net7": "ca:cb:4f:75:b7:8d",
            "net8": "42:1a:a5:f1:78:87",
            "net9": "8e:6b:8d:39:06:5e"
        },
        "tof_2_2_3": {
            "net0": "ee:e6:ef:a0:1e:2e",
            "net1": "46:aa:91:c7:f9:a5",
            "net10": "5e:de:bb:9d:32:3b",
            "net11": "ca:d9:e3:57:02:8d",
            "net2": "86:0a:dd:29:7e:c0",
            "net3": "82:4e:ac:db:d5:0d",
            "net4": "32:7d:2a:6b:aa:d0",
            "net5": "3a:2a:6d:ec:b8:09",
            "net6": "92:63:cc:4e:49:3f",
            "net7": "be:b1:60:49:c9:b5",
            "net8": "4e:95:b1:a0:00:08",
            "net9": "52:6a:ab:49:9f:9e"
        },
        "tof_2_2_4": {
            "net0": "fa:44:f3:2e:f8:92",
            "net1": "ba:52:d3:fb:47:6b",
            "net10": "56:6e:34:63:86:4f",
            "net11": "0a:bd:66:6d:5f:72",
            "net2": "26:93:34:f7:a3:86",
            "net3": "56:92:e8:12:23:d6",
            "net4": "1e:82:40:27:1f:b3",
            "net5": "7e:ad:0e:fd:45:16",
            "net6": "9a:3b:68:a2:81:67",
            "net7": "56:38:2a:16:c1:66",
            "net8": "2e:52:fe:d0:80:50",
            "net9": "36:78:be:1c:ca:9b"
        },
        "tof_2_2_5": {
            "net0": "a2:d9:e4:88:be:a0",
            "net1": "72:7a:73:42:01:6f",
            "net10": "92:86:69:6d:d6:45",
            "net11": "06:70:21:eb:a8:85",
            "net2": "be:a1:94:d7:01:1a",
            "net3": "d2:e8:64:d7:4e:87",
            "net4": "72:22:f7:11:48:be",
            "net5": "be:2c:57:c5:32:9c",
            "net6": "52:8f:ec:86:2b:bd",
            "net7": "9e:da:bf:5c:e1:36",
            "net8": "6a:ef:93:36:b3:24",
            "net9": "5a:45:7e:b1:98:64"
        },
        "tof_2_2_6": {
            "net0": "fa:95:ec:e7:8d:8d",
            "net1": "ce:94:c2:5a:6c:41",
            "net10": "3e:29:59:52:d6:7d",
            "net11": "52:8f:64:1f:f0:61",
            "net2": "92:a1:c0:ab:d1:b3",
            "net3": "b6:c9:82:d6:2d:a0",
            "net4": "92:0a:44:3e:11:ff",
            "net5": "12:95:68:70:2d:cc",
            "net6": "46:37:ea:16:ba:ac",
            "net7": "0e:35:00:21:06:3f",
            "net8": "5e:79:ec:fa:1c:39",
            "net9": "f6:be:e8:88:46:ff"
        }
    },
    "failed_machine": "leaf_1_0_1",
    "failed_interfaces": [
        "net0"
    ],
    "failure_time": {
        "leaf_1_0_1": 1636554676.7391167,
        "leaf_1_0_2": 1636554676.772567,
        "leaf_1_0_3": 1636554676.7794628,
        "leaf_1_0_4": 1636554676.8004873,
        "leaf_1_0_5": 1636554676.983977,
        "leaf_1_0_6": 1636554676.8248644,
        "leaf_2_0_1": 1636554676.8351452,
        "leaf_2_0_2": 1636554676.8481302,
        "leaf_2_0_3": 1636554676.7616124,
        "leaf_2_0_4": 1636554676.952869,
        "leaf_2_0_5": 1636554676.801884,
        "leaf_2_0_6": 1636554676.9893198,
        "leaf_3_0_1": 1636554677.0020175,
        "leaf_3_0_2": 1636554676.8661547,
        "leaf_3_0_3": 1636554676.8915026,
        "leaf_3_0_4": 1636554676.9077232,
        "leaf_3_0_5": 1636554676.8670557,
        "leaf_3_0_6": 1636554677.0621967,
        "leaf_4_0_1": 1636554676.8994942,
        "leaf_4_0_2": 1636554676.9146383,
        "leaf_4_0_3": 1636554676.9329762,
        "leaf_4_0_4": 1636554676.945604,
        "leaf_4_0_5": 1636554676.9642732,
        "leaf_4_0_6": 1636554677.1494527,
        "spine_1_1_1": 1636554676.9218934,
        "spine_1_1_2": 1636554676.936115,
        "spine_1_1_3": 1636554676.957113,
        "spine_1_1_4": 1636554676.9757996,
        "spine_1_1_5": 1636554676.999519,
        "spine_1_1_6": 1636554677.0145338,
        "spine_2_1_1": 1636554677.1990688,
        "spine_2_1_2": 1636554677.2200773,
        "spine_2_1_3": 1636554676.9991467,
        "spine_2_1_4": 1636554677.0075936,
        "spine_2_1_5": 1636554677.0256774,
        "spine_2_1_6": 1636554677.050043,
        "spine_3_1_1": 1636554677.07136,
        "spine_3_1_2": 1636554677.0785036,
        "spine_3_1_3": 1636554677.0890152,
        "spine_3_1_4": 1636554677.1072078,
        "spine_3_1_5": 1636554677.0605974,
        "spine_3_1_6": 1636554677.0751686,
        "spine_4_1_1": 1636554677.2590163,
        "spine_4_1_2": 1636554677.275201,
        "spine_4_1_3": 1636554677.1148643,
        "spine_4_1_4": 1636554677.1343148,
        "spine_4_1_5": 1636554677.1450236,
        "spine_4_1_6": 1636554677.1658533,
        "tof_1_2_1": 1636554677.2933502,
        "tof_1_2_2": 1636554677.1326516,
        "tof_1_2_3": 1636554677.175062,
        "tof_1_2_4": 1636554677.1846073,
        "tof_1_2_5": 1636554677.1935601,
        "tof_1_2_6": 1636554677.2100525,
        "tof_2_2_1": 1636554677.2287526,
        "tof_2_2_2": 1636554677.2388551,
        "tof_2_2_3": 1636554677.178353,
        "tof_2_2_4": 1636554677.187397,
        "tof_2_2_5": 1636554677.2041473,
        "tof_2_2_6": 1636554677.2158172
    }
}