{
    "description": "Scenario 7: Partitioned fabric (selecting tof_1_2_1 node) with BGP",
    "k_leaf": 10,
    "k_top": 10,
    "redundancy_factor": 5,
    "is_k8s": true,
    "machine_mac_addresses": {
        "leaf_1_0_1": {
            "net0": "ca:2e:b0:b5:71:df",
            "net1": "02:9d:94:65:31:18",
            "net10": "9e:d1:28:c2:af:fd",
            "net2": "6a:c2:e4:5d:c5:85",
            "net3": "0a:12:8e:20:ab:ef",
            "net4": "2e:ee:7a:0f:8b:8a",
            "net5": "1e:c3:44:17:43:98",
            "net6": "66:db:23:ed:10:3c",
            "net7": "b2:4e:d2:e8:74:ce",
            "net8": "7e:b2:c1:db:0f:7e",
            "net9": "56:c6:18:e5:e3:9d"
        },
        "leaf_1_0_10": {
            "net0": "6a:69:11:f1:b8:94",
            "net1": "46:07:10:34:0a:48",
            "net10": "e2:74:82:bc:69:c5",
            "net2": "a6:9e:ee:31:56:56",
            "net3": "a2:d6:b1:91:c8:66",
            "net4": "7a:d3:9b:51:f9:77",
            "net5": "d2:17:b4:55:b4:3d",
            "net6": "06:61:d7:19:26:fd",
            "net7": "ee:ae:da:5b:97:3a",
            "net8": "9e:37:76:a4:29:0f",
            "net9": "e6:83:77:73:89:94"
        },
        "leaf_1_0_2": {
            "net0": "1e:3f:35:94:53:00",
            "net1": "72:bf:39:15:ea:76",
            "net10": "42:87:05:40:a5:25",
            "net2": "32:44:c5:18:81:fe",
            "net3": "5e:7f:61:78:42:4c",
            "net4": "da:48:c6:ad:55:d0",
            "net5": "92:40:f8:1c:7c:93",
            "net6": "5a:e6:8f:96:4c:73",
            "net7": "5a:05:5e:ed:c2:24",
            "net8": "ee:5f:68:d8:13:a6",
            "net9": "1e:cc:eb:0b:44:fa"
        },
        "leaf_1_0_3": {
            "net0": "e2:21:64:af:54:71",
            "net1": "a6:95:25:cb:fb:73",
            "net10": "a2:a5:3a:8e:02:ff",
            "net2": "b2:97:b8:da:43:91",
            "net3": "3e:40:2b:64:45:3b",
            "net4": "6e:dd:f2:1f:52:f8",
            "net5": "da:a2:90:6c:a3:01",
            "net6": "0e:1d:69:e5:d9:0d",
            "net7": "0e:47:dd:a8:fb:98",
            "net8": "7a:d1:87:4f:14:68",
            "net9": "5a:28:84:84:07:46"
        },
        "leaf_1_0_4": {
            "net0": "ae:82:e7:8c:52:dd",
            "net1": "e6:b5:67:24:2c:50",
            "net10": "0e:ae:a4:09:2b:83",
            "net2": "36:da:e2:56:fb:96",
            "net3": "62:5a:47:26:76:92",
            "net4": "52:df:1f:d6:4f:03",
            "net5": "0a:ed:90:4a:4b:46",
            "net6": "82:a5:d5:f9:e5:0b",
            "net7": "f2:d1:3f:98:cb:01",
            "net8": "be:ef:17:e9:82:4b",
            "net9": "36:03:ad:5e:15:d9"
        },
        "leaf_1_0_5": {
            "net0": "d2:2a:67:dc:fa:45",
            "net1": "6a:e4:9f:e9:2e:a5",
            "net10": "62:91:9b:c6:b5:f5",
            "net2": "9a:fd:3f:ab:32:5f",
            "net3": "e2:43:bc:4a:b6:7e",
            "net4": "42:b3:e0:53:be:d1",
            "net5": "66:b9:70:80:52:93",
            "net6": "06:5f:e2:b3:01:7c",
            "net7": "0a:18:73:b1:c1:35",
            "net8": "5a:3c:47:e6:b7:b3",
            "net9": "fe:be:ce:2a:5b:00"
        },
        "leaf_1_0_6": {
            "net0": "5e:96:e7:76:28:4b",
            "net1": "72:af:6a:a2:b1:17",
            "net10": "ae:da:8a:cd:31:e1",
            "net2": "a2:2d:d3:69:53:18",
            "net3": "4e:6c:c0:25:1c:63",
            "net4": "1a:62:78:2b:a2:f6",
            "net5": "52:0b:75:f9:7b:fb",
            "net6": "7e:de:54:e6:30:48",
            "net7": "9e:5f:94:b6:c6:46",
            "net8": "e6:3d:d0:0c:39:15",
            "net9": "12:ea:8d:7c:be:d6"
        },
        "leaf_1_0_7": {
            "net0": "ca:4f:00:47:07:fd",
            "net1": "3e:f1:55:62:b2:ee",
            "net10": "3a:69:8a:f5:0f:97",
            "net2": "ae:2b:3d:32:72:2a",
            "net3": "0e:8d:aa:ce:e5:ae",
            "net4": "c2:ee:12:0b:76:25",
            "net5": "a2:41:01:c3:28:bc",
            "net6": "b6:59:cd:60:60:b0",
            "net7": "da:90:82:db:35:1f",
            "net8": "a6:67:40:c2:07:8a",
            "net9": "86:5e:60:ea:c8:b9"
        },
        "leaf_1_0_8": {
            "net0": "86:50:35:25:3d:f6",
            "net1": "fe:d0:47:3b:25:3f",
            "net10": "4a:e1:13:f7:ca:f8",
            "net2": "16:cf:65:06:49:64",
            "net3": "b2:03:c1:7f:d6:96",
            "net4": "de:21:f7:e4:ed:1e",
            "net5": "7e:3a:b1:9e:40:ef",
            "net6": "16:c6:cf:0a:cd:d4",
            "net7": "72:40:78:de:8c:75",
            "net8": "9e:01:c3:53:87:6a",
            "net9": "be:42:73:65:33:2b"
        },
        "leaf_1_0_9": {
            "net0": "fe:20:cd:68:7c:de",
            "net1": "12:cd:e0:b8:93:a4",
            "net10": "0a:76:ae:aa:aa:9b",
            "net2": "66:82:53:03:23:09",
            "net3": "1e:26:c1:95:10:ff",
            "net4": "ca:0a:37:28:c4:af",
            "net5": "2a:ed:58:d7:1d:f8",
            "net6": "7e:db:7c:8c:3c:32",
            "net7": "16:12:14:1c:0d:b7",
            "net8": "fa:c0:9c:f6:af:29",
            "net9": "46:7c:2d:ac:ca:ac"
        },
        "leaf_2_0_1": {
            "net0": "f2:aa:93:d9:22:81",
            "net1": "a6:e6:2e:f1:8b:1e",
            "net10": "ce:f3:4e:9d:25:67",
            "net2": "b6:f2:a0:43:f6:a4",
            "net3": "6a:36:07:20:34:96",
            "net4": "fe:bd:18:9a:7b:23",
            "net5": "0e:2c:5a:43:2e:c3",
            "net6": "8a:70:fe:9b:6a:11",
            "net7": "ce:3b:cf:4f:01:80",
            "net8": "fe:92:e1:95:6b:64",
            "net9": "96:e9:8d:e0:ed:3a"
        },
        "leaf_2_0_10": {
            "net0": "3e:47:d5:7f:12:12",
            "net1": "1e:87:6a:b0:f2:8e",
            "net10": "b6:42:93:3d:a3:bd",
            "net2": "ba:ff:41:88:71:62",
            "net3": "6e:69:25:99:ac:ce",
            "net4": "96:48:8c:26:57:8a",
            "net5": "e6:94:72:3f:98:0b",
            "net6": "ba:63:12:1b:69:74",
            "net7": "d6:29:8f:52:f3:a0",
            "net8": "e2:bd:15:06:17:f4",
            "net9": "22:b5:4b:4b:4f:c5"
        },
        "leaf_2_0_2": {
            "net0": "3a:b4:0d:47:f1:22",
            "net1": "8e:bb:cf:6a:50:da",
            "net10": "f6:d5:db:69:a9:5e",
            "net2": "ba:92:0b:ff:d4:fe",
            "net3": "2a:9e:dc:46:94:3f",
            "net4": "b6:a3:1c:81:9d:6e",
            "net5": "52:da:06:fe:63:b6",
            "net6": "0e:2c:7b:9c:c0:ee",
            "net7": "ee:1f:80:89:a7:c8",
            "net8": "c6:cd:64:fe:e9:52",
            "net9": "d6:dd:c6:06:8f:96"
        },
        "leaf_2_0_3": {
            "net0": "82:3b:85:7e:52:64",
            "net1": "5a:71:de:74:30:65",
            "net10": "c6:5c:8e:af:e1:13",
            "net2": "c2:31:58:4b:28:be",
            "net3": "32:a2:92:06:6d:86",
            "net4": "66:93:9f:90:61:60",
            "net5": "62:41:bf:91:b0:6b",
            "net6": "76:e5:bc:99:5b:23",
            "net7": "32:66:dc:89:9c:fc",
            "net8": "9e:84:5e:23:d6:39",
            "net9": "96:b2:33:ff:94:89"
        },
        "leaf_2_0_4": {
            "net0": "4a:01:fb:10:b7:4d",
            "net1": "26:c8:4a:ab:81:5c",
            "net10": "12:00:85:d0:4f:10",
            "net2": "96:61:77:2a:85:19",
            "net3": "f2:e3:3f:d9:c6:87",
            "net4": "8a:93:6a:9c:eb:b5",
            "net5": "fa:dd:28:aa:23:15",
            "net6": "f2:8c:bc:3c:b4:49",
            "net7": "8e:6d:78:51:d7:fc",
            "net8": "26:f4:80:83:1b:7f",
            "net9": "26:5a:bb:7e:73:39"
        },
        "leaf_2_0_5": {
            "net0": "8e:0c:93:76:2a:fd",
            "net1": "06:42:22:c9:27:92",
            "net10": "4a:e0:28:7f:ac:c2",
            "net2": "a6:a3:22:ff:f9:ec",
            "net3": "62:c1:33:d1:55:a9",
            "net4": "56:15:84:37:d2:47",
            "net5": "4a:b8:b0:c4:4c:12",
            "net6": "a6:4d:3b:49:df:19",
            "net7": "76:34:88:24:4e:62",
            "net8": "b6:d9:5c:0c:e8:f9",
            "net9": "fe:08:de:23:17:55"
        },
        "leaf_2_0_6": {
            "net0": "76:a1:cd:52:50:e4",
            "net1": "be:ab:a1:20:15:f7",
            "net10": "6a:5e:88:51:36:2c",
            "net2": "c2:e3:3e:b6:d5:de",
            "net3": "16:56:3b:8c:84:16",
            "net4": "62:da:0b:25:05:c9",
            "net5": "92:55:68:4e:d8:30",
            "net6": "8e:92:dc:ee:e0:ac",
            "net7": "ae:c1:ed:38:58:2f",
            "net8": "36:0b:0a:0d:28:7d",
            "net9": "b2:f7:c6:55:59:58"
        },
        "leaf_2_0_7": {
            "net0": "82:42:af:36:0d:1a",
            "net1": "ee:46:75:05:24:cc",
            "net10": "a2:49:66:e3:d9:2b",
            "net2": "36:d5:44:50:5c:d0",
            "net3": "6e:db:1a:f8:cb:4b",
            "net4": "22:43:3f:d4:a1:03",
            "net5": "fa:c6:93:33:10:4d",
            "net6": "26:35:e8:90:41:c7",
            "net7": "72:62:65:a6:e4:ad",
            "net8": "26:51:24:4b:7e:22",
            "net9": "e2:f8:14:15:aa:6f"
        },
        "leaf_2_0_8": {
            "net0": "da:e4:13:54:39:7f",
            "net1": "e6:20:14:5e:1e:f6",
            "net10": "f2:ad:da:8c:2a:de",
            "net2": "8a:94:a5:db:31:3a",
            "net3": "ae:ff:de:76:dd:14",
            "net4": "c6:a5:ab:5b:39:03",
            "net5": "ce:14:c4:bd:9d:89",
            "net6": "8e:84:81:92:d4:cc",
            "net7": "02:d7:e0:56:0a:63",
            "net8": "da:40:86:1f:67:d2",
            "net9": "fa:79:5a:6f:25:a2"
        },
        "leaf_2_0_9": {
            "net0": "8a:e0:43:80:6e:27",
            "net1": "7e:ac:46:50:1e:4d",
            "net10": "9e:ab:9e:99:d8:e3",
            "net2": "76:31:49:99:88:f7",
            "net3": "6e:84:a5:9e:f8:27",
            "net4": "4a:e7:ea:15:f4:7b",
            "net5": "a6:46:7c:4a:51:2e",
            "net6": "d2:68:94:a4:90:e4",
            "net7": "16:42:d2:be:82:d1",
            "net8": "26:f6:7d:92:1c:79",
            "net9": "d6:a8:82:5b:9d:ec"
        },
        "leaf_3_0_1": {
            "net0": "72:02:b7:ee:99:5c",
            "net1": "96:af:2a:dc:17:24",
            "net10": "26:c4:41:4d:7c:c2",
            "net2": "ea:88:2d:da:6e:d9",
            "net3": "a6:8b:89:a7:98:64",
            "net4": "26:c4:e0:91:a1:d4",
            "net5": "12:16:b0:a1:4a:88",
            "net6": "12:cf:f1:7c:d3:8e",
            "net7": "a6:25:eb:5b:fe:8e",
            "net8": "6a:2c:27:42:48:db",
            "net9": "aa:c3:a8:fd:8d:5a"
        },
        "leaf_3_0_10": {
            "net0": "86:b7:22:0e:2f:d8",
            "net1": "8a:63:16:b6:2b:20",
            "net10": "56:5d:3d:19:c8:11",
            "net2": "1a:41:5c:35:0e:46",
            "net3": "d2:64:6f:b2:6b:2d",
            "net4": "3a:14:5e:17:35:b4",
            "net5": "e2:b8:93:3c:e1:c8",
            "net6": "aa:3f:5c:e1:ee:48",
            "net7": "4a:b4:dc:4b:ab:77",
            "net8": "fe:21:20:6b:65:dc",
            "net9": "0e:62:7b:08:5f:3d"
        },
        "leaf_3_0_2": {
            "net0": "2a:52:c4:b8:87:e5",
            "net1": "1a:54:d1:74:03:bb",
            "net10": "32:9d:cb:de:4e:b4",
            "net2": "d6:a4:49:5b:f9:22",
            "net3": "5e:1d:68:60:53:51",
            "net4": "ce:8a:1d:d8:49:fa",
            "net5": "2e:a8:c3:54:7d:6c",
            "net6": "9e:91:4c:98:bb:3a",
            "net7": "ee:82:fc:27:70:58",
            "net8": "c6:42:17:85:74:15",
            "net9": "26:07:1e:7b:e9:0f"
        },
        "leaf_3_0_3": {
            "net0": "36:5f:9b:72:1e:16",
            "net1": "26:51:22:8d:1c:90",
            "net10": "fa:61:41:71:eb:f4",
            "net2": "1e:38:f1:99:30:55",
            "net3": "46:e2:70:a4:ec:54",
            "net4": "fe:c8:8f:76:a7:a0",
            "net5": "d2:9a:18:c6:cc:44",
            "net6": "46:48:81:13:0d:1a",
            "net7": "9a:25:3f:7d:6d:12",
            "net8": "1a:e1:99:e3:e7:43",
            "net9": "1a:29:9a:ca:ab:2f"
        },
        "leaf_3_0_4": {
            "net0": "4e:da:fc:44:af:6a",
            "net1": "9a:76:b5:8d:b2:44",
            "net10": "22:c8:c0:f3:2a:11",
            "net2": "4e:3e:fd:b6:c9:72",
            "net3": "12:a4:6e:d8:45:f5",
            "net4": "fa:54:e6:00:cc:a6",
            "net5": "7e:62:b3:28:66:ab",
            "net6": "76:34:76:d3:47:91",
            "net7": "ca:6f:fa:fa:f4:ed",
            "net8": "4e:d8:63:46:01:85",
            "net9": "da:78:9d:ab:86:c9"
        },
        "leaf_3_0_5": {
            "net0": "6e:93:39:8a:ef:65",
            "net1": "ce:5c:00:d9:86:ca",
            "net10": "26:d1:95:64:ea:fc",
            "net2": "d2:65:87:7b:87:bd",
            "net3": "de:73:2c:19:0c:f2",
            "net4": "42:19:bb:72:b5:39",
            "net5": "a2:e9:30:4e:be:b9",
            "net6": "f6:c2:a4:dd:39:71",
            "net7": "22:12:5f:08:45:95",
            "net8": "ba:88:06:3c:23:cf",
            "net9": "d2:34:72:16:1c:41"
        },
        "leaf_3_0_6": {
            "net0": "7e:59:ab:fe:74:48",
            "net1": "f6:b1:84:a7:0f:6a",
            "net10": "c2:ac:dd:4c:e3:8a",
            "net2": "a6:ed:13:99:4d:ca",
            "net3": "8e:de:ce:f7:92:91",
            "net4": "d2:2b:7d:b4:71:1a",
            "net5": "da:49:bf:47:6d:3a",
            "net6": "76:9a:e9:b0:39:ef",
            "net7": "72:db:2b:b6:d8:46",
            "net8": "56:f9:0f:fd:21:aa",
            "net9": "32:2f:bd:5c:c0:52"
        },
        "leaf_3_0_7": {
            "net0": "8e:59:e5:a4:30:81",
            "net1": "a6:7e:aa:94:5f:8c",
            "net10": "46:c2:b9:b1:6c:95",
            "net2": "a6:99:98:17:58:db",
            "net3": "92:d3:ce:22:c6:ef",
            "net4": "56:ef:86:c3:91:c1",
            "net5": "c6:60:63:a8:e5:e3",
            "net6": "66:a6:13:fa:70:1f",
            "net7": "22:17:3d:0f:7a:f5",
            "net8": "be:12:10:26:29:38",
            "net9": "7a:a4:fe:e8:79:cc"
        },
        "leaf_3_0_8": {
            "net0": "fe:e6:61:0c:d7:62",
            "net1": "92:01:17:eb:ce:b9",
            "net10": "b2:1e:6d:e9:2c:db",
            "net2": "4a:7d:40:f9:12:33",
            "net3": "02:9b:ad:b6:ab:87",
            "net4": "96:b1:40:0e:15:b2",
            "net5": "de:64:3a:74:68:98",
            "net6": "ca:41:4e:91:52:fb",
            "net7": "5e:89:8b:0a:5d:4f",
            "net8": "22:5b:d6:a2:6d:95",
            "net9": "92:17:d4:4d:b4:5b"
        },
        "leaf_3_0_9": {
            "net0": "1e:8f:10:f9:2d:fb",
            "net1": "b6:5c:c1:cd:11:46",
            "net10": "36:57:8e:ca:96:88",
            "net2": "92:bc:fc:ba:90:ff",
            "net3": "f6:95:be:77:de:1a",
            "net4": "96:28:bf:bb:ab:bf",
            "net5": "5e:ad:41:1d:8b:7c",
            "net6": "ae:87:58:54:40:5e",
            "net7": "96:61:76:15:b8:10",
            "net8": "0a:a4:60:76:d9:04",
            "net9": "76:bc:db:a4:a6:a7"
        },
        "leaf_4_0_1": {
            "net0": "f6:d3:e4:97:89:8c",
            "net1": "12:cd:d5:47:29:15",
            "net10": "3e:3c:09:41:19:03",
            "net2": "8e:74:fb:64:a4:bb",
            "net3": "ae:8b:8d:7d:ba:76",
            "net4": "12:e9:1f:e1:f7:f2",
            "net5": "46:5a:d9:d3:6c:65",
            "net6": "06:fc:1c:f0:3a:65",
            "net7": "3a:68:a9:5e:9e:f5",
            "net8": "e6:0a:d0:c5:54:48",
            "net9": "e6:19:9c:08:48:09"
        },
        "leaf_4_0_10": {
            "net0": "0e:00:a7:44:02:6f",
            "net1": "be:bf:8b:61:4b:9d",
            "net10": "da:c7:17:0e:08:7b",
            "net2": "ea:e5:20:81:2c:0c",
            "net3": "8e:8d:87:11:87:97",
            "net4": "8e:d6:b3:b2:ea:33",
            "net5": "96:bc:99:a8:6a:b5",
            "net6": "8a:92:3f:62:0f:6a",
            "net7": "c2:62:ae:58:79:7f",
            "net8": "16:9a:b1:08:73:0a",
            "net9": "b2:22:1b:21:9e:a2"
        },
        "leaf_4_0_2": {
            "net0": "da:3a:fe:b3:a8:75",
            "net1": "e2:30:e2:3f:e5:a8",
            "net10": "06:0e:d3:fc:91:62",
            "net2": "ea:59:51:51:72:cc",
            "net3": "5e:30:4b:40:f3:4c",
            "net4": "5a:05:e6:0c:95:45",
            "net5": "16:a1:c6:e1:0d:ea",
            "net6": "d6:ce:25:57:f3:07",
            "net7": "16:c9:e2:c1:36:25",
            "net8": "be:83:0a:bd:4d:68",
            "net9": "2a:48:2a:e8:df:ed"
        },
        "leaf_4_0_3": {
            "net0": "aa:56:3a:85:21:cb",
            "net1": "42:5b:39:40:38:12",
            "net10": "7e:9d:7f:6a:9f:15",
            "net2": "f2:cf:85:ec:d3:3e",
            "net3": "3e:81:12:55:c2:09",
            "net4": "76:14:44:d5:c1:df",
            "net5": "8a:28:ea:ae:6b:a4",
            "net6": "12:6d:00:ea:c9:8b",
            "net7": "96:42:a1:f6:35:1c",
            "net8": "ee:2b:52:52:a6:bc",
            "net9": "d6:56:e3:df:13:a0"
        },
        "leaf_4_0_4": {
            "net0": "52:12:03:f2:47:1e",
            "net1": "82:d2:60:6b:2b:17",
            "net10": "d2:63:47:7e:af:2e",
            "net2": "e2:0b:d1:00:1a:42",
            "net3": "3a:7e:04:7c:4f:28",
            "net4": "02:bc:b0:71:86:6f",
            "net5": "ee:6e:89:13:77:34",
            "net6": "b2:35:85:8f:d1:03",
            "net7": "56:d4:be:23:d5:c3",
            "net8": "ca:23:06:32:63:e9",
            "net9": "8e:61:1a:4f:bb:72"
        },
        "leaf_4_0_5": {
            "net0": "f6:2f:8b:ff:22:b8",
            "net1": "02:b3:cd:52:5f:8f",
            "net10": "3e:3c:f3:d2:53:2b",
            "net2": "22:53:44:a8:27:04",
            "net3": "36:52:cb:81:35:64",
            "net4": "3e:53:e7:f8:cc:97",
            "net5": "5e:60:eb:ea:ad:04",
            "net6": "82:ee:51:13:21:cf",
            "net7": "5e:21:ac:31:56:48",
            "net8": "8e:64:6f:98:1d:87",
            "net9": "96:ea:33:76:31:7f"
        },
        "leaf_4_0_6": {
            "net0": "e6:f9:b3:29:cd:d1",
            "net1": "86:c8:56:e1:1f:b0",
            "net10": "b6:6e:82:53:1c:25",
            "net2": "5a:a8:ed:65:b7:09",
            "net3": "c2:b9:1b:21:ee:00",
            "net4": "66:c3:57:1b:e5:f8",
            "net5": "9e:e3:cf:bb:94:0f",
            "net6": "9e:90:43:c1:7d:ac",
            "net7": "b2:2f:64:f7:3d:e3",
            "net8": "de:8d:e1:23:a5:78",
            "net9": "8a:4e:ba:dd:23:16"
        },
        "leaf_4_0_7": {
            "net0": "ce:8c:89:a4:ed:50",
            "net1": "ea:0b:2c:25:1e:e3",
            "net10": "36:35:e4:02:af:9b",
            "net2": "52:ac:b0:69:17:91",
            "net3": "62:6a:fd:c9:3b:6b",
            "net4": "86:c8:58:19:e6:6b",
            "net5": "76:ea:52:8b:24:87",
            "net6": "62:16:8c:ac:7a:67",
            "net7": "ca:ae:a6:fc:c3:ed",
            "net8": "ea:a2:23:d5:ed:a1",
            "net9": "9e:0a:96:2b:ef:94"
        },
        "leaf_4_0_8": {
            "net0": "b6:35:9c:64:b9:7c",
            "net1": "22:95:9e:67:8d:fd",
            "net10": "86:22:76:4b:0b:ca",
            "net2": "76:d2:6e:4f:c5:a7",
            "net3": "ba:c9:f3:59:0f:2a",
            "net4": "f2:4d:3d:cb:be:01",
            "net5": "5e:d2:80:56:a5:9f",
            "net6": "aa:3e:64:26:24:4f",
            "net7": "12:bf:3f:57:a8:c0",
            "net8": "f2:5f:a3:23:1e:55",
            "net9": "a6:1b:e8:d8:43:c0"
        },
        "leaf_4_0_9": {
            "net0": "ea:b8:06:90:ff:b0",
            "net1": "ca:cc:6a:cf:8d:9e",
            "net10": "92:8a:41:c5:50:58",
            "net2": "7e:e6:66:b1:af:69",
            "net3": "0e:94:52:26:5e:00",
            "net4": "66:fc:e5:60:76:0e",
            "net5": "32:02:cb:f1:a1:64",
            "net6": "e6:85:71:47:33:aa",
            "net7": "56:9b:06:38:4a:10",
            "net8": "42:18:38:47:74:d8",
            "net9": "b2:39:c8:d2:99:ca"
        },
        "spine_1_1_1": {
            "net0": "b2:b5:8e:32:44:03",
            "net1": "d6:04:34:f9:a1:80",
            "net10": "5e:2e:4f:e6:9a:da",
            "net11": "3e:91:b1:05:d8:12",
            "net12": "56:cd:2c:f6:d1:cf",
            "net13": "0a:e4:e5:e8:10:ce",
            "net14": "16:ae:70:07:3b:a2",
            "net15": "6a:f9:c8:6d:6e:ea",
            "net16": "0a:81:e4:3a:6f:d1",
            "net17": "ee:52:9a:0b:79:85",
            "net18": "92:2c:c6:91:7a:1c",
            "net19": "ae:6f:03:ad:77:3e",
            "net2": "4a:24:63:a8:88:6d",
            "net3": "62:54:77:c8:2b:e0",
            "net4": "96:e9:be:fd:bc:a3",
            "net5": "12:71:d3:ee:5c:2a",
            "net6": "0a:ea:0e:0a:6a:e1",
            "net7": "e6:71:94:5a:03:51",
            "net8": "f6:3f:3d:b0:57:a1",
            "net9": "52:7d:48:30:78:06"
        },
        "spine_1_1_10": {
            "net0": "be:36:6d:48:9e:55",
            "net1": "d6:47:7c:ac:4c:f5",
            "net10": "36:5d:a9:ea:3e:ce",
            "net11": "52:7f:e0:42:34:3c",
            "net12": "32:b9:89:2b:ca:35",
            "net13": "06:e7:3a:48:07:08",
            "net14": "92:b0:50:68:03:4c",
            "net15": "2a:69:1e:d1:5b:e3",
            "net16": "4e:10:e8:ba:81:94",
            "net17": "3e:1a:c8:af:11:0a",
            "net18": "e6:e6:7c:db:51:b0",
            "net19": "be:b2:ea:d8:46:38",
            "net2": "2e:02:8b:21:2d:4b",
            "net3": "1a:33:d9:1f:e0:78",
            "net4": "86:65:90:1d:43:47",
            "net5": "2e:f7:e8:e9:53:00",
            "net6": "c2:44:26:ba:97:5a",
            "net7": "f2:3b:c0:6b:9e:ce",
            "net8": "36:59:1d:a3:7a:ab",
            "net9": "02:4b:5a:ff:1d:84"
        },
        "spine_1_1_2": {
            "net0": "a2:20:b7:77:36:b9",
            "net1": "0a:e1:f2:13:e6:72",
            "net10": "8e:dc:22:ed:c8:36",
            "net11": "fe:3c:4b:42:10:b0",
            "net12": "1a:28:5d:11:a9:51",
            "net13": "a2:8a:3f:59:c0:7b",
            "net14": "62:7d:65:e9:70:b4",
            "net15": "22:4b:45:5a:18:3b",
            "net16": "12:f4:f2:86:d8:40",
            "net17": "e2:00:17:86:21:0c",
            "net18": "be:02:a0:b6:c7:13",
            "net19": "b2:ba:ad:36:7e:98",
            "net2": "12:cf:d5:4b:6b:8f",
            "net3": "9e:e5:56:6d:a2:0f",
            "net4": "7e:13:9a:dd:1d:97",
            "net5": "3e:de:31:8c:52:2e",
            "net6": "b2:02:c2:74:6f:82",
            "net7": "7e:37:bc:28:33:dd",
            "net8": "ea:c9:02:11:33:0f",
            "net9": "da:2c:4b:df:6d:63"
        },
        "spine_1_1_3": {
            "net0": "fe:3e:9a:57:a1:fe",
            "net1": "2e:1f:a2:9b:a2:c6",
            "net10": "26:c0:30:45:ce:f7",
            "net11": "0a:56:40:3f:27:02",
            "net12": "c6:ee:08:01:5d:66",
            "net13": "c2:53:fe:ee:b3:7d",
            "net14": "42:83:35:a1:5b:a7",
            "net15": "d2:b3:2b:1a:88:1b",
            "net16": "52:aa:4b:08:f6:10",
            "net17": "76:4b:65:41:64:fd",
            "net18": "7a:8d:85:28:3c:fb",
            "net19": "8e:29:78:1f:84:11",
            "net2": "de:aa:78:0e:84:42",
            "net3": "ae:a7:b1:db:e9:66",
            "net4": "86:2f:0b:8a:9b:90",
            "net5": "82:3f:35:19:61:dc",
            "net6": "92:7c:5b:1a:18:de",
            "net7": "56:e1:94:77:76:d8",
            "net8": "0e:79:71:2f:9d:f6",
            "net9": "06:ce:ea:36:2c:77"
        },
        "spine_1_1_4": {
            "net0": "72:c4:09:42:a1:bb",
            "net1": "5a:17:32:58:a4:7c",
            "net10": "ba:4e:fc:e1:45:3e",
            "net11": "e2:ed:1a:56:33:94",
            "net12": "72:e0:46:a6:34:d4",
            "net13": "5a:1f:7f:f8:4b:6a",
            "net14": "66:9e:66:34:78:c9",
            "net15": "96:df:71:8a:fa:5a",
            "net16": "aa:71:75:fe:f2:ba",
            "net17": "b2:b3:d2:5d:7a:18",
            "net18": "da:b4:1a:25:2e:08",
            "net19": "ba:c1:86:72:2f:4d",
            "net2": "26:83:44:cf:4a:06",
            "net3": "5a:26:e9:c8:df:e1",
            "net4": "e2:f8:0e:5f:05:03",
            "net5": "96:ef:8c:03:df:ca",
            "net6": "f6:29:c4:0e:69:cf",
            "net7": "9a:7e:57:e5:59:50",
            "net8": "a2:94:90:8f:85:55",
            "net9": "e6:c2:41:5d:54:ba"
        },
        "spine_1_1_5": {
            "net0": "52:c2:a0:e9:a2:86",
            "net1": "ea:6b:06:45:52:0b",
            "net10": "3a:10:82:b8:7d:f9",
            "net11": "6a:95:a4:41:d1:7d",
            "net12": "f2:5e:c2:69:cc:94",
            "net13": "7a:1e:ec:cb:e1:1e",
            "net14": "a2:f3:5d:8b:36:e4",
            "net15": "1a:60:43:22:dc:71",
            "net16": "2e:d1:10:bf:66:68",
            "net17": "da:1b:a9:76:42:88",
            "net18": "ea:96:83:1c:45:3c",
            "net19": "1a:a1:47:4a:d2:6e",
            "net2": "d2:8e:ab:88:ab:01",
            "net3": "a6:1c:a0:9f:2d:50",
            "net4": "4e:de:44:25:fe:32",
            "net5": "0a:17:48:63:25:d4",
            "net6": "ea:ab:62:15:f8:86",
            "net7": "c2:85:30:cd:d2:b5",
            "net8": "42:7e:fa:f3:f9:fd",
            "net9": "3a:8c:63:d8:ef:e5"
        },
        "spine_1_1_6": {
            "net0": "fa:d7:d9:c5:fc:9c",
            "net1": "12:9a:1a:1b:71:d4",
            "net10": "36:19:f1:78:f1:0f",
            "net11": "96:07:6e:52:fd:85",
            "net12": "86:81:12:8d:a5:bc",
            "net13": "b2:00:9b:c1:92:ff",
            "net14": "2a:15:14:64:9f:6e",
            "net15": "ca:5c:81:3e:f0:3c",
            "net16": "b2:f7:d0:1d:cc:a7",
            "net17": "62:25:23:30:ca:4f",
            "net18": "22:04:a4:22:e9:f4",
            "net19": "be:02:83:42:c4:96",
            "net2": "9a:cc:ec:cb:b0:28",
            "net3": "16:50:35:ea:18:52",
            "net4": "86:55:23:70:52:83",
            "net5": "36:17:50:ef:25:93",
            "net6": "0e:5e:e4:7e:6e:68",
            "net7": "56:cc:3f:b9:e1:14",
            "net8": "96:c0:67:94:1e:1f",
            "net9": "96:3a:02:2f:ec:b7"
        },
        "spine_1_1_7": {
            "net0": "ee:a3:82:69:c9:3a",
            "net1": "ea:0a:27:db:88:bf",
            "net10": "da:34:42:47:15:10",
            "net11": "62:de:a1:59:9b:82",
            "net12": "aa:6e:1b:fe:47:5f",
            "net13": "9a:f6:86:71:f3:a2",
            "net14": "b2:cc:2d:19:b0:47",
            "net15": "a6:c6:60:3c:c7:60",
            "net16": "2e:e0:33:49:18:b3",
            "net17": "2e:fd:49:04:38:ed",
            "net18": "16:e0:9c:41:64:a3",
            "net19": "f6:3f:53:4f:0a:e1",
            "net2": "1a:e8:af:5e:04:f0",
            "net3": "be:66:ce:59:eb:1a",
            "net4": "26:ac:0c:aa:2a:1f",
            "net5": "46:1f:5a:eb:13:ac",
            "net6": "9e:ce:29:09:d6:27",
            "net7": "12:b1:41:e5:a9:f7",
            "net8": "2e:43:94:89:56:b4",
            "net9": "d2:d1:76:b9:91:96"
        },
        "spine_1_1_8": {
            "net0": "1a:3f:bf:d3:e2:32",
            "net1": "9a:7e:35:3a:96:b0",
            "net10": "5a:00:5b:8e:52:ac",
            "net11": "da:27:55:6e:1c:6f",
            "net12": "ce:ed:40:5a:56:ce",
            "net13": "26:7d:11:b2:ff:24",
            "net14": "a2:df:1b:87:0d:ac",
            "net15": "ce:d2:e1:eb:d9:71",
            "net16": "4a:2d:96:ac:8c:46",
            "net17": "c2:ce:67:46:33:2d",
            "net18": "8a:48:e1:54:43:5e",
            "net19": "12:e1:a4:90:eb:51",
            "net2": "1e:fd:fd:e3:de:e8",
            "net3": "0e:10:2b:4b:29:79",
            "net4": "ee:28:f4:bd:03:0e",
            "net5": "02:2c:38:f8:3f:3b",
            "net6": "5e:1d:f0:ed:ad:1a",
            "net7": "ce:1f:c1:fc:d0:cc",
            "net8": "8e:b1:9e:de:8e:2c",
            "net9": "0a:de:11:a6:02:35"
        },
        "spine_1_1_9": {
            "net0": "12:36:eb:70:f1:e7",
            "net1": "fe:e4:5a:fa:5a:c5",
            "net10": "ae:75:1f:57:ec:09",
            "net11": "b2:13:60:fc:8a:10",
            "net12": "7a:1f:36:1e:88:01",
            "net13": "8e:3b:23:61:86:3f",
            "net14": "76:12:af:86:0c:3b",
            "net15": "06:13:ea:d2:8d:80",
            "net16": "b6:b5:44:74:b7:4b",
            "net17": "a2:e8:0c:29:7f:47",
            "net18": "2e:b7:18:47:46:f6",
            "net19": "c6:42:28:fb:1b:4f",
            "net2": "a6:bc:95:aa:6b:f5",
            "net3": "96:dc:28:81:4d:5c",
            "net4": "3e:23:40:fd:35:b6",
            "net5": "12:a4:7e:e5:91:86",
            "net6": "e2:1e:1b:05:79:da",
            "net7": "92:f0:27:80:9e:24",
            "net8": "82:2e:fc:f5:ee:b8",
            "net9": "ce:3e:43:7b:ef:a3"
        },
        "spine_2_1_1": {
            "net0": "8a:70:50:02:14:0b",
            "net1": "8e:7c:f7:31:06:c9",
            "net10": "02:bc:77:e7:b7:df",
            "net11": "1e:3e:e3:d4:2e:02",
            "net12": "9a:28:27:fc:e0:2f",
            "net13": "0a:13:e6:d2:d3:8b",
            "net14": "7e:2a:2a:70:ba:41",
            "net15": "7a:a9:c8:ac:ae:6f",
            "net16": "a6:d5:47:b6:e5:11",
            "net17": "5a:96:8d:cf:10:76",
            "net18": "b2:4d:00:5e:79:5c",
            "net19": "be:37:ce:23:2a:e3",
            "net2": "fe:33:26:bc:85:89",
            "net3": "d2:f3:05:0f:c9:57",
            "net4": "66:7e:d5:f1:48:6c",
            "net5": "42:1b:ae:a0:99:6f",
            "net6": "96:62:b8:ff:b5:de",
            "net7": "76:84:7e:c3:50:bc",
            "net8": "36:46:fa:f3:84:c4",
            "net9": "b6:b4:0f:04:3d:4e"
        },
        "spine_2_1_10": {
            "net0": "66:ca:98:5b:92:82",
            "net1": "1a:fe:71:07:a5:b6",
            "net10": "7e:44:95:61:0d:27",
            "net11": "8a:e6:51:ec:eb:fa",
            "net12": "72:c9:b8:8c:e4:ae",
            "net13": "e2:f3:4a:a2:77:ce",
            "net14": "d6:bc:e4:d0:5f:c4",
            "net15": "ee:89:eb:09:d1:c3",
            "net16": "ae:5d:89:ec:73:c2",
            "net17": "da:0e:20:49:17:ef",
            "net18": "92:b0:9c:e4:8c:76",
            "net19": "4a:c3:e1:37:3d:d8",
            "net2": "fa:9c:88:59:a8:09",
            "net3": "da:4c:86:0f:f7:33",
            "net4": "ce:65:23:cb:20:fd",
            "net5": "ee:d2:44:5e:21:10",
            "net6": "9a:aa:4d:2e:4a:06",
            "net7": "ea:23:a7:26:20:75",
            "net8": "a6:86:0f:8c:16:ae",
            "net9": "72:39:2e:66:b8:7b"
        },
        "spine_2_1_2": {
            "net0": "92:9e:d1:8f:be:3c",
            "net1": "0e:66:4e:65:38:22",
            "net10": "ea:87:32:83:1e:4d",
            "net11": "8e:1f:01:d4:89:04",
            "net12": "62:41:21:2b:59:6e",
            "net13": "92:5b:90:94:ab:de",
            "net14": "56:db:85:07:4a:eb",
            "net15": "96:2e:0f:3f:f2:0c",
            "net16": "8e:18:88:ce:04:69",
            "net17": "de:ee:e0:3f:32:55",
            "net18": "0a:c0:0f:ae:85:61",
            "net19": "46:3e:2d:3e:1c:d0",
            "net2": "92:21:c9:14:24:76",
            "net3": "da:81:5a:e2:d7:0e",
            "net4": "da:4a:f7:1b:76:82",
            "net5": "02:d7:14:d1:bd:25",
            "net6": "f2:dd:d1:24:68:71",
            "net7": "fe:66:04:1f:90:e1",
            "net8": "76:d6:5b:2e:4b:95",
            "net9": "0e:f2:70:53:f1:5e"
        },
        "spine_2_1_3": {
            "net0": "1a:66:64:50:56:0f",
            "net1": "3a:4d:2a:d9:c1:15",
            "net10": "52:54:68:7f:57:1a",
            "net11": "56:a4:49:48:ec:c5",
            "net12": "da:1a:60:cd:33:02",
            "net13": "9a:fe:f0:77:0e:59",
            "net14": "3a:cd:67:a9:4b:4f",
            "net15": "1a:0e:ae:b7:a2:ad",
            "net16": "62:56:85:df:5f:de",
            "net17": "b6:c1:0c:f6:86:d2",
            "net18": "aa:29:0f:23:67:aa",
            "net19": "56:f8:73:1f:09:aa",
            "net2": "4e:b3:b3:9b:e5:24",
            "net3": "16:ec:27:8f:cd:65",
            "net4": "b2:3e:e2:f3:c0:3e",
            "net5": "12:b4:d9:92:88:f0",
            "net6": "46:3b:4a:c2:ae:4f",
            "net7": "7a:df:6e:80:3d:3f",
            "net8": "e6:62:d8:46:9a:6d",
            "net9": "7e:d2:68:3c:ec:f9"
        },
        "spine_2_1_4": {
            "net0": "f6:f5:8c:67:39:5e",
            "net1": "4a:a0:30:d6:bc:2c",
            "net10": "e2:0a:d5:c0:86:b3",
            "net11": "82:42:a9:8d:e7:a0",
            "net12": "3e:be:f7:d3:fc:84",
            "net13": "0e:78:c8:06:49:09",
            "net14": "a2:cd:7b:72:75:05",
            "net15": "a6:34:5c:71:f5:8d",
            "net16": "ba:db:68:8f:85:1c",
            "net17": "f2:8a:56:49:ae:40",
            "net18": "d6:28:7c:e6:6a:40",
            "net19": "0e:21:28:a1:38:1e",
            "net2": "ae:d7:7f:1f:62:ec",
            "net3": "2a:02:bb:fe:ea:5e",
            "net4": "72:e0:23:16:a2:a2",
            "net5": "3e:04:1c:7b:57:9c",
            "net6": "4e:a6:6f:ee:e4:9c",
            "net7": "8a:dd:70:c1:29:26",
            "net8": "66:c2:bb:aa:ce:a3",
            "net9": "b6:b3:6a:43:bd:5b"
        },
        "spine_2_1_5": {
            "net0": "0a:31:b2:12:ff:99",
            "net1": "5a:11:87:4d:20:cc",
            "net10": "7a:30:00:8e:5e:aa",
            "net11": "26:26:7b:d7:c2:1c",
            "net12": "b2:48:1d:a0:2a:3c",
            "net13": "0e:85:ee:73:81:7d",
            "net14": "ae:2e:14:e0:68:2e",
            "net15": "8e:7b:6c:f4:2b:8d",
            "net16": "7a:a1:ad:4c:79:dc",
            "net17": "6e:06:d7:74:67:c8",
            "net18": "ca:22:ca:ac:ba:74",
            "net19": "f6:5e:04:fd:0d:5c",
            "net2": "72:a1:af:42:ed:90",
            "net3": "1a:b9:84:24:3f:65",
            "net4": "b2:0a:f4:fc:f0:41",
            "net5": "9a:ac:37:ca:33:2b",
            "net6": "4e:7a:be:5b:a6:8f",
            "net7": "ea:cf:0d:2b:94:ab",
            "net8": "b6:03:08:f7:5f:0f",
            "net9": "6a:4f:23:7b:c6:76"
        },
        "spine_2_1_6": {
            "net0": "9a:bd:e2:3e:9d:04",
            "net1": "de:0d:77:a2:e8:e0",
            "net10": "7e:f6:a2:70:5a:79",
            "net11": "26:ce:88:85:cd:24",
            "net12": "9a:f9:cb:38:85:cd",
            "net13": "46:99:aa:af:80:2e",
            "net14": "8a:04:5d:22:d0:47",
            "net15": "1a:2f:d0:71:ee:e9",
            "net16": "da:55:12:fd:fe:3d",
            "net17": "ae:05:d3:3d:b6:7d",
            "net18": "e2:e6:6d:68:56:c0",
            "net19": "12:b3:a8:13:42:1c",
            "net2": "be:e2:cf:db:6f:c9",
            "net3": "46:9f:6e:1a:2b:c9",
            "net4": "a6:3a:2c:96:cb:27",
            "net5": "56:a3:cd:42:12:ea",
            "net6": "92:be:bf:36:b2:69",
            "net7": "da:d1:f9:07:af:54",
            "net8": "4a:90:4d:48:5d:1c",
            "net9": "8e:1a:e0:2d:89:ea"
        },
        "spine_2_1_7": {
            "net0": "f6:3c:fa:a6:32:2d",
            "net1": "f2:1d:4c:95:da:13",
            "net10": "06:eb:b8:4e:58:05",
            "net11": "a2:ef:d2:77:91:1f",
            "net12": "7a:36:df:e8:b7:bd",
            "net13": "a6:c2:a7:f7:1b:1d",
            "net14": "b6:74:a2:40:a3:ae",
            "net15": "ee:05:7e:6c:6f:88",
            "net16": "e6:a3:79:c7:86:9b",
            "net17": "62:73:bc:58:b7:26",
            "net18": "c6:37:47:93:73:49",
            "net19": "92:cc:46:88:4f:5e",
            "net2": "be:e9:48:fe:9e:89",
            "net3": "ee:37:2f:aa:74:bc",
            "net4": "6a:df:ee:08:66:cf",
            "net5": "66:05:7c:11:1d:09",
            "net6": "a6:c7:71:c9:83:5c",
            "net7": "82:d4:03:fd:83:9e",
            "net8": "ea:26:ae:93:96:ea",
            "net9": "86:0d:99:3c:88:82"
        },
        "spine_2_1_8": {
            "net0": "42:3c:46:66:54:8f",
            "net1": "b6:0a:ec:9a:31:62",
            "net10": "1a:10:a0:45:2d:ac",
            "net11": "32:d6:3c:2b:0d:85",
            "net12": "a2:43:6d:a9:77:9e",
            "net13": "96:35:6d:6e:c4:cc",
            "net14": "0a:e3:68:b1:66:0d",
            "net15": "5a:93:d9:50:3f:bb",
            "net16": "22:00:9d:65:8c:db",
            "net17": "e2:1e:ab:3a:20:d7",
            "net18": "7a:24:de:3d:03:13",
            "net19": "06:2d:0e:98:fd:df",
            "net2": "6a:96:43:e4:43:6f",
            "net3": "1a:33:98:27:d8:09",
            "net4": "36:b2:be:33:93:6a",
            "net5": "b6:28:ec:53:9b:67",
            "net6": "22:26:9b:bc:a0:e3",
            "net7": "06:27:e9:43:5a:f3",
            "net8": "1e:df:94:01:ef:84",
            "net9": "56:14:44:2a:5b:c9"
        },
        "spine_2_1_9": {
            "net0": "f6:ed:56:da:52:89",
            "net1": "2a:d0:e8:04:dd:f8",
            "net10": "9e:e3:dc:7c:7b:59",
            "net11": "2e:89:36:18:e1:a7",
            "net12": "5a:be:4c:8f:4f:f6",
            "net13": "4e:c0:76:4a:e0:a0",
            "net14": "0e:d3:72:1a:58:e0",
            "net15": "12:45:dc:a8:80:9f",
            "net16": "e2:cb:82:f5:de:93",
            "net17": "e2:0b:e8:7f:fd:75",
            "net18": "72:9f:00:2f:0a:a0",
            "net19": "2a:c0:7a:b9:af:36",
            "net2": "f2:68:f4:8e:ae:6b",
            "net3": "9e:db:43:99:55:cf",
            "net4": "fa:a2:3d:c5:2d:ee",
            "net5": "4e:57:e0:26:5b:7e",
            "net6": "1a:60:5c:22:e4:60",
            "net7": "1e:bf:4b:2c:b5:1b",
            "net8": "86:16:4a:f7:dd:3c",
            "net9": "d6:e4:bf:d4:33:8a"
        },
        "spine_3_1_1": {
            "net0": "b6:eb:89:40:21:75",
            "net1": "12:a7:a0:2a:d6:89",
            "net10": "ca:40:29:85:90:bc",
            "net11": "42:6d:96:63:8d:a9",
            "net12": "56:9e:6b:ae:84:b4",
            "net13": "9e:82:1e:9a:e7:26",
            "net14": "5a:bc:0d:b0:e3:1d",
            "net15": "7e:34:c8:8d:58:99",
            "net16": "ea:17:e6:f6:9d:e9",
            "net17": "ee:d8:c2:bd:62:dd",
            "net18": "92:54:19:22:3e:8a",
            "net19": "22:e1:9a:a8:c8:28",
            "net2": "86:a0:e2:4d:d6:ec",
            "net3": "1a:f6:84:31:f7:9f",
            "net4": "92:4d:66:fc:65:ae",
            "net5": "82:1e:91:b0:cc:f9",
            "net6": "5e:ad:e0:5d:78:fd",
            "net7": "0a:88:db:3c:e6:e0",
            "net8": "b2:a7:c4:d7:66:c7",
            "net9": "52:13:24:37:06:23"
        },
        "spine_3_1_10": {
            "net0": "d6:c8:fd:4e:57:1e",
            "net1": "16:25:ef:a8:9a:6b",
            "net10": "0e:70:d2:9f:d2:4e",
            "net11": "de:0c:05:38:33:67",
            "net12": "a2:08:65:94:57:3d",
            "net13": "22:2c:6c:75:58:88",
            "net14": "12:69:b2:88:71:fa",
            "net15": "22:16:75:5f:a7:50",
            "net16": "aa:ae:1f:1c:9c:a8",
            "net17": "46:d1:db:e0:1f:fb",
            "net18": "ae:cc:ee:a1:c5:65",
            "net19": "c2:16:1a:06:09:63",
            "net2": "62:e2:90:b2:0f:59",
            "net3": "ee:d6:09:f7:c5:e3",
            "net4": "b6:00:f2:f9:25:37",
            "net5": "be:0b:24:f1:22:12",
            "net6": "d2:2f:95:35:82:22",
            "net7": "0e:6c:d4:78:fd:06",
            "net8": "a2:e8:51:67:1a:64",
            "net9": "02:be:45:b2:ad:9b"
        },
        "spine_3_1_2": {
            "net0": "9a:54:d9:3d:3c:f4",
            "net1": "c6:47:e1:e8:3c:8f",
            "net10": "16:18:82:6b:f5:ce",
            "net11": "4a:58:c3:82:5f:51",
            "net12": "d2:83:4d:d5:ea:b9",
            "net13": "86:00:5a:9e:0d:87",
            "net14": "1e:75:09:2f:88:22",
            "net15": "9e:44:57:fe:a6:c8",
            "net16": "8e:c5:7b:8a:32:8f",
            "net17": "9e:34:4c:a9:1d:75",
            "net18": "8e:29:af:b7:40:00",
            "net19": "d2:06:a4:4f:77:50",
            "net2": "96:47:4b:d5:a6:4d",
            "net3": "8e:57:cb:ff:e3:b9",
            "net4": "9e:4a:1c:0c:a6:70",
            "net5": "de:aa:55:fd:b8:1a",
            "net6": "c2:d1:40:d2:25:b9",
            "net7": "b2:ce:0d:43:ab:45",
            "net8": "06:77:78:45:2d:cc",
            "net9": "5a:87:8e:30:6e:84"
        },
        "spine_3_1_3": {
            "net0": "8a:14:e4:dd:a1:b6",
            "net1": "6e:66:76:ef:1a:99",
            "net10": "76:aa:62:5a:1a:66",
            "net11": "72:68:b6:e2:bf:3c",
            "net12": "de:98:fc:85:87:82",
            "net13": "de:73:d2:98:88:14",
            "net14": "fe:4a:6b:c8:ad:c7",
            "net15": "26:27:76:54:9e:21",
            "net16": "7a:6a:96:1d:77:36",
            "net17": "06:d2:47:cf:7e:78",
            "net18": "e2:b1:cd:2b:30:7a",
            "net19": "ba:98:76:58:b3:92",
            "net2": "2e:d8:64:15:8f:9f",
            "net3": "66:6d:77:a1:56:ed",
            "net4": "8a:fb:28:e2:97:28",
            "net5": "16:ae:16:52:12:e4",
            "net6": "d2:69:21:b6:b4:1d",
            "net7": "e2:65:b1:e9:13:40",
            "net8": "7e:76:b7:64:0d:f7",
            "net9": "ea:26:09:39:81:3c"
        },
        "spine_3_1_4": {
            "net0": "e6:8a:b3:41:46:33",
            "net1": "ea:b5:35:70:2f:c4",
            "net10": "8e:98:9a:c6:f1:6b",
            "net11": "da:4c:47:cd:39:6e",
            "net12": "de:86:98:e4:76:ef",
            "net13": "5e:fc:c2:5f:01:b2",
            "net14": "56:02:6d:0b:2d:fc",
            "net15": "52:8d:9d:d0:f1:ef",
            "net16": "6a:39:9f:a1:77:4c",
            "net17": "7a:22:d1:91:5b:9a",
            "net18": "e2:61:06:f4:e9:30",
            "net19": "f2:dc:14:09:61:87",
            "net2": "02:7b:80:39:1b:09",
            "net3": "56:62:be:29:9b:f3",
            "net4": "8e:8a:29:10:87:d8",
            "net5": "c2:02:65:a3:4b:48",
            "net6": "62:3d:43:86:32:f3",
            "net7": "9a:30:e1:ff:b9:65",
            "net8": "06:fa:0a:78:37:53",
            "net9": "46:c5:ea:4b:9b:fa"
        },
        "spine_3_1_5": {
            "net0": "5a:e0:3b:fc:05:33",
            "net1": "ce:33:4a:3c:bb:e3",
            "net10": "ca:d2:f9:f5:30:f1",
            "net11": "96:81:fd:12:d0:84",
            "net12": "9a:b5:7c:25:98:f9",
            "net13": "8e:d1:90:bb:48:d7",
            "net14": "ca:93:14:3e:4a:7a",
            "net15": "ce:59:85:28:0b:51",
            "net16": "be:f7:95:dd:fc:c6",
            "net17": "32:a4:57:20:f7:8b",
            "net18": "ae:01:22:88:61:7e",
            "net19": "a2:39:21:0c:9a:82",
            "net2": "02:95:51:f9:7d:5d",
            "net3": "72:42:72:9c:f1:94",
            "net4": "92:76:10:5b:21:39",
            "net5": "86:20:fa:0f:83:e4",
            "net6": "82:3e:e3:aa:ff:0e",
            "net7": "42:07:94:25:82:a6",
            "net8": "be:00:c1:47:bb:e7",
            "net9": "42:c0:9b:93:fa:0a"
        },
        "spine_3_1_6": {
            "net0": "02:43:c4:d6:1e:bb",
            "net1": "ee:2d:de:97:10:6d",
            "net10": "8e:78:e4:a6:cd:bb",
            "net11": "3e:8d:d7:c9:10:1f",
            "net12": "ca:32:16:41:84:5b",
            "net13": "ae:d3:f3:3f:19:9f",
            "net14": "d2:c2:d4:2d:96:af",
            "net15": "52:04:fb:da:0e:c1",
            "net16": "72:60:46:b2:0e:70",
            "net17": "de:47:f4:22:29:33",
            "net18": "86:e4:1e:53:79:18",
            "net19": "36:12:4e:77:d4:39",
            "net2": "92:5b:27:c2:b8:c4",
            "net3": "56:10:b4:22:47:5b",
            "net4": "ea:96:28:01:e5:0c",
            "net5": "66:e9:54:8b:5f:10",
            "net6": "ca:7a:59:16:48:3c",
            "net7": "7a:62:f8:05:03:bd",
            "net8": "c6:db:56:07:6b:3d",
            "net9": "9e:35:0e:de:a4:08"
        },
        "spine_3_1_7": {
            "net0": "16:d7:38:00:0e:1e",
            "net1": "be:02:5f:26:20:65",
            "net10": "a2:a9:b1:5c:31:f7",
            "net11": "32:b4:43:e0:d4:69",
            "net12": "f2:b4:af:8f:bd:d9",
            "net13": "da:5e:ae:4e:62:63",
            "net14": "56:fa:36:81:5b:89",
            "net15": "32:53:0e:9c:40:d4",
            "net16": "f2:df:4f:bc:3a:da",
            "net17": "5a:d9:e7:d7:04:d3",
            "net18": "92:48:c5:fd:14:9d",
            "net19": "8e:3c:2e:48:11:ce",
            "net2": "66:39:30:f6:40:2d",
            "net3": "2e:c4:99:0a:64:8a",
            "net4": "8e:63:4d:ea:de:4e",
            "net5": "66:61:b8:1e:4c:af",
            "net6": "6a:b9:90:19:af:12",
            "net7": "9a:87:a0:9e:af:c9",
            "net8": "ee:11:cb:9a:f4:b7",
            "net9": "aa:07:67:36:fd:7a"
        },
        "spine_3_1_8": {
            "net0": "2e:bc:bf:28:bb:0c",
            "net1": "0e:87:bf:6b:3d:3c",
            "net10": "6e:32:3a:c2:f8:bc",
            "net11": "8a:15:20:dc:a0:e6",
            "net12": "56:e2:db:60:b6:7f",
            "net13": "a2:74:88:ed:1b:f2",
            "net14": "7a:26:da:16:ef:1e",
            "net15": "92:d0:f2:cb:71:85",
            "net16": "c6:6b:19:54:a7:7a",
            "net17": "3e:10:dc:09:ca:2a",
            "net18": "a6:7e:69:7e:e0:24",
            "net19": "8a:c7:99:1d:e9:c7",
            "net2": "ee:ed:9b:45:d7:56",
            "net3": "da:22:6b:d4:fa:d8",
            "net4": "5a:25:b8:fd:a0:99",
            "net5": "a6:58:f2:95:cd:91",
            "net6": "da:d3:ea:69:1e:5f",
            "net7": "9a:25:15:ab:24:40",
            "net8": "9e:a3:0a:cc:ea:0b",
            "net9": "3e:5d:25:6d:1a:27"
        },
        "spine_3_1_9": {
            "net0": "62:be:87:45:6b:fd",
            "net1": "fe:16:b5:4e:3d:e0",
            "net10": "fe:23:fb:7e:25:73",
            "net11": "26:5d:3e:69:f5:fa",
            "net12": "e2:48:6a:33:4a:cb",
            "net13": "b2:39:ca:68:40:d3",
            "net14": "36:55:2c:e4:38:56",
            "net15": "fa:7d:62:d0:fc:ee",
            "net16": "22:9b:53:79:fd:1a",
            "net17": "06:e2:ab:fb:ef:39",
            "net18": "6a:95:d6:c4:30:a2",
            "net19": "2e:49:50:94:80:e7",
            "net2": "2a:77:bb:51:5a:43",
            "net3": "36:1d:d7:b2:3b:f9",
            "net4": "c2:a0:4c:23:0a:14",
            "net5": "ea:40:19:15:49:98",
            "net6": "be:ab:d0:63:1e:04",
            "net7": "c2:c5:2f:fb:22:92",
            "net8": "0a:8f:43:0c:a6:af",
            "net9": "9a:99:bf:1a:44:d5"
        },
        "spine_4_1_1": {
            "net0": "32:a8:d4:68:dc:8b",
            "net1": "f2:f3:53:52:0f:05",
            "net10": "62:cf:b6:65:94:67",
            "net11": "46:65:d1:86:e2:97",
            "net12": "9a:65:49:91:f0:64",
            "net13": "86:9d:6e:26:09:db",
            "net14": "6a:21:f9:1b:16:43",
            "net15": "0a:b6:3e:ee:17:b5",
            "net16": "6e:59:be:f6:3d:95",
            "net17": "da:6b:0e:65:73:22",
            "net18": "2a:08:bf:19:5e:9c",
            "net19": "5e:7f:22:d2:3d:c4",
            "net2": "da:a8:40:1b:82:22",
            "net3": "ce:00:24:17:c4:03",
            "net4": "0a:a6:dd:45:20:4e",
            "net5": "da:ab:5d:42:ea:c1",
            "net6": "b2:0c:52:35:5c:66",
            "net7": "3e:e7:09:f0:cf:7b",
            "net8": "62:ce:06:e5:00:6e",
            "net9": "fe:9d:3a:46:c1:67"
        },
        "spine_4_1_10": {
            "net0": "4e:f1:98:a2:8d:bc",
            "net1": "16:ab:06:85:6b:e4",
            "net10": "ca:48:89:0b:a3:8f",
            "net11": "36:2e:3e:f4:7f:01",
            "net12": "be:a5:7c:1a:19:b0",
            "net13": "a6:0e:4a:ca:83:14",
            "net14": "3a:60:3d:99:69:fb",
            "net15": "12:48:49:06:9c:af",
            "net16": "6a:18:03:a9:91:d7",
            "net17": "ee:12:32:6a:97:25",
            "net18": "b6:32:bf:7b:29:48",
            "net19": "4e:c6:3c:f6:b1:c0",
            "net2": "ea:70:0f:d8:c5:cb",
            "net3": "7e:af:44:a0:de:d5",
            "net4": "b2:79:81:e2:15:1d",
            "net5": "c6:b4:62:a2:33:4b",
            "net6": "ae:98:f8:e2:4d:02",
            "net7": "96:2c:cb:d4:46:3c",
            "net8": "f6:47:bb:55:b4:16",
            "net9": "d6:16:f2:b4:bb:62"
        },
        "spine_4_1_2": {
            "net0": "86:4c:f4:a6:9b:aa",
            "net1": "5a:e4:a2:97:9e:6a",
            "net10": "8e:ad:11:6e:1a:65",
            "net11": "4a:fb:50:43:96:74",
            "net12": "3a:2e:b7:08:ae:96",
            "net13": "ea:f1:ab:e9:b6:73",
            "net14": "1e:e0:3e:fa:e2:0c",
            "net15": "ae:fd:9c:7c:31:78",
            "net16": "56:01:79:74:f1:5b",
            "net17": "7a:24:a8:8b:9b:87",
            "net18": "e2:6c:08:ac:3b:4d",
            "net19": "7e:25:69:39:aa:5d",
            "net2": "a6:48:76:ca:23:24",
            "net3": "96:0c:30:d9:3f:1b",
            "net4": "b6:7d:2d:b9:1e:75",
            "net5": "5e:15:7d:82:86:b8",
            "net6": "9a:cc:7a:2c:c5:fe",
            "net7": "32:4e:e8:d4:18:3b",
            "net8": "8a:38:fa:39:cb:b5",
            "net9": "52:db:c3:d2:92:ea"
        },
        "spine_4_1_3": {
            "net0": "aa:02:e4:ed:8e:7a",
            "net1": "0e:34:ac:0c:01:e6",
            "net10": "1a:66:fc:c2:80:0b",
            "net11": "ba:60:1d:a8:14:18",
            "net12": "fa:a8:78:60:44:6c",
            "net13": "9e:6e:1d:7b:19:78",
            "net14": "6e:5b:2b:16:29:7d",
            "net15": "1e:0f:b7:c8:db:0d",
            "net16": "46:ce:55:cf:53:a0",
            "net17": "3a:34:b9:2a:2a:54",
            "net18": "6e:c4:b0:7d:d3:41",
            "net19": "d6:b2:d7:c4:de:a7",
            "net2": "26:8a:e7:88:60:fe",
            "net3": "12:9f:22:bb:c9:fc",
            "net4": "ce:95:97:cd:2c:dd",
            "net5": "2a:dd:0d:2b:91:b7",
            "net6": "06:2a:5a:ae:64:4f",
            "net7": "0e:37:77:87:ec:7a",
            "net8": "a6:14:8a:e3:7d:8f",
            "net9": "be:d2:0a:b2:35:fd"
        },
        "spine_4_1_4": {
            "net0": "ba:32:68:23:bf:48",
            "net1": "ae:91:25:67:15:5b",
            "net10": "be:cb:90:82:49:cb",
            "net11": "1e:a6:6c:f8:8e:db",
            "net12": "3a:f6:42:3f:3c:c7",
            "net13": "62:58:a7:93:4d:51",
            "net14": "56:8d:b8:26:59:d5",
            "net15": "b2:22:ab:65:a3:e4",
            "net16": "56:97:98:85:c4:5b",
            "net17": "f2:18:1d:87:bd:d9",
            "net18": "52:3a:75:7d:3b:af",
            "net19": "b6:7c:49:16:f9:ed",
            "net2": "1e:d3:d1:31:d0:0d",
            "net3": "ce:82:92:b5:c2:cd",
            "net4": "5e:3a:a8:31:cb:8d",
            "net5": "9a:f1:3a:96:2f:51",
            "net6": "96:2e:a4:44:34:29",
            "net7": "fe:10:d5:74:9c:d0",
            "net8": "a6:ca:32:3f:68:c2",
            "net9": "7a:b7:09:12:84:15"
        },
        "spine_4_1_5": {
            "net0": "7e:20:d4:9f:d1:11",
            "net1": "3e:f2:c0:6c:f6:9e",
            "net10": "a6:d8:50:57:de:aa",
            "net11": "5a:34:91:25:e7:e4",
            "net12": "e6:e5:06:3c:f3:c0",
            "net13": "de:8d:4a:45:5d:d0",
            "net14": "42:17:5c:7f:3c:cc",
            "net15": "06:1c:a6:85:2b:59",
            "net16": "66:10:a3:09:f0:9e",
            "net17": "16:ef:4d:7b:c5:9f",
            "net18": "ce:e9:d6:f7:b4:9c",
            "net19": "6a:6d:1c:e3:6a:fc",
            "net2": "56:69:c1:36:07:db",
            "net3": "6a:2b:b2:92:2a:ae",
            "net4": "4e:b8:e4:9e:c3:34",
            "net5": "aa:04:97:0f:a7:ff",
            "net6": "02:ea:30:19:5a:de",
            "net7": "52:88:01:49:68:99",
            "net8": "c2:9c:78:18:6d:58",
            "net9": "36:3b:f8:76:e5:47"
        },
        "spine_4_1_6": {
            "net0": "3e:b4:bc:d7:d7:5d",
            "net1": "ee:20:3f:10:37:77",
            "net10": "9e:28:2a:32:ec:d1",
            "net11": "36:30:8b:ff:5c:21",
            "net12": "7e:db:0e:c4:83:fa",
            "net13": "a6:bb:e1:e1:24:64",
            "net14": "1e:91:33:76:32:1b",
            "net15": "72:5b:0b:1c:8c:6b",
            "net16": "6e:77:bc:02:c1:b2",
            "net17": "4a:72:a4:83:c7:9e",
            "net18": "1a:9f:e9:c1:92:d7",
            "net19": "0a:e0:8f:9f:57:75",
            "net2": "96:f7:e2:ab:49:51",
            "net3": "66:67:05:d3:1d:44",
            "net4": "ea:c4:b6:c7:78:09",
            "net5": "d2:97:58:95:4d:90",
            "net6": "ea:08:a7:69:88:26",
            "net7": "c6:5c:0a:04:84:53",
            "net8": "6a:0b:aa:51:74:39",
            "net9": "a6:93:5f:ba:70:27"
        },
        "spine_4_1_7": {
            "net0": "a2:00:e1:d1:e4:47",
            "net1": "fa:63:4f:36:5e:f1",
            "net10": "c2:ae:fd:d2:7e:7b",
            "net11": "62:87:4c:16:32:ba",
            "net12": "3a:7d:0c:29:bf:b1",
            "net13": "42:a0:2b:74:4e:a3",
            "net14": "5a:53:40:42:d0:3c",
            "net15": "de:eb:0f:d9:43:ab",
            "net16": "6a:00:8b:e4:d1:ae",
            "net17": "62:cd:1a:99:df:86",
            "net18": "2a:4a:c3:15:de:45",
            "net19": "2e:7b:27:40:43:35",
            "net2": "c6:3f:67:22:52:4a",
            "net3": "52:e8:87:46:0e:6f",
            "net4": "8a:b8:67:ec:09:23",
            "net5": "da:3b:73:da:28:4a",
            "net6": "5e:ba:87:0d:8c:57",
            "net7": "ce:f1:a0:33:c0:81",
            "net8": "5a:20:e4:88:33:e0",
            "net9": "36:a6:0c:6a:94:ab"
        },
        "spine_4_1_8": {
            "net0": "d2:a1:7b:e1:18:ed",
            "net1": "32:ef:11:10:74:6a",
            "net10": "5e:39:1a:fb:c6:48",
            "net11": "ce:e6:6b:17:9e:e4",
            "net12": "3e:7e:d2:a0:b2:b1",
            "net13": "b6:58:0c:92:ae:9e",
            "net14": "ce:01:c7:0b:eb:bb",
            "net15": "82:d7:6c:ab:14:a6",
            "net16": "22:25:ee:5c:67:95",
            "net17": "4a:a3:fa:98:5c:48",
            "net18": "16:97:4d:9b:d1:a5",
            "net19": "56:ec:b7:6f:f1:b9",
            "net2": "ea:df:e1:ca:36:55",
            "net3": "2a:25:cf:42:ba:19",
            "net4": "fa:c5:64:34:81:48",
            "net5": "32:a9:13:fe:1a:ec",
            "net6": "92:cf:b2:ec:36:0b",
            "net7": "52:0d:b0:b0:ed:10",
            "net8": "16:8a:4d:a8:ea:d8",
            "net9": "5e:88:a4:ae:70:2b"
        },
        "spine_4_1_9": {
            "net0": "9e:33:b1:78:45:c4",
            "net1": "c2:3e:1e:cb:f8:90",
            "net10": "ce:90:71:d8:51:6e",
            "net11": "da:93:88:11:26:15",
            "net12": "32:ef:e5:49:44:25",
            "net13": "9a:a4:e0:09:fb:0c",
            "net14": "42:63:af:b7:4a:8e",
            "net15": "02:19:47:9a:34:de",
            "net16": "d6:33:2c:d1:0f:ae",
            "net17": "4e:01:f2:0d:aa:19",
            "net18": "06:1a:25:f5:93:1e",
            "net19": "46:22:28:f3:ae:3a",
            "net2": "82:11:33:cd:5a:49",
            "net3": "12:03:61:bd:69:f2",
            "net4": "52:ba:2d:36:b8:6a",
            "net5": "56:68:61:ef:17:f1",
            "net6": "d2:7c:69:40:db:51",
            "net7": "66:a1:cd:a2:86:5e",
            "net8": "fe:e9:0a:17:48:d7",
            "net9": "4e:2e:df:bf:5a:94"
        },
        "tof_1_2_1": {
            "net0": "de:38:19:63:20:da",
            "net1": "9a:15:39:69:0c:f9",
            "net10": "02:18:1f:a3:5e:c4",
            "net11": "f2:0d:a6:f2:4d:ea",
            "net12": "0e:a4:0e:cb:bf:40",
            "net13": "06:7e:8f:57:94:7d",
            "net14": "12:5a:24:b6:eb:cf",
            "net15": "2a:ea:6c:1d:b3:1a",
            "net16": "c2:d7:6d:ac:f3:30",
            "net17": "d6:3b:d0:b8:39:aa",
            "net18": "ba:17:ea:4f:66:d6",
            "net19": "0e:2b:b0:de:be:d6",
            "net2": "4a:bf:66:cd:ff:64",
            "net3": "36:7d:92:26:82:db",
            "net4": "02:71:b8:cf:f5:e8",
            "net5": "5a:0f:68:2d:5d:36",
            "net6": "56:da:bb:19:52:c5",
            "net7": "f2:85:b2:d4:ed:ba",
            "net8": "fe:63:32:ab:36:d5",
            "net9": "82:36:9a:8f:67:12"
        },
        "tof_1_2_10": {
            "net0": "ea:dc:73:6e:4f:bb",
            "net1": "36:55:cf:9f:d2:ad",
            "net10": "3a:12:19:ec:ff:bf",
            "net11": "fe:2e:48:a8:88:fb",
            "net12": "a2:0d:21:bd:88:b0",
            "net13": "62:94:6d:4d:12:32",
            "net14": "2a:30:db:1a:aa:f0",
            "net15": "9e:ad:f7:a7:3e:1c",
            "net16": "8e:e4:e9:e6:6e:2a",
            "net17": "8a:83:81:34:7f:3a",
            "net18": "b6:43:d5:3d:a9:13",
            "net19": "ae:00:66:21:a6:58",
            "net2": "96:e7:f5:8a:02:61",
            "net3": "32:f0:f6:f2:f8:ea",
            "net4": "f6:e9:b8:7e:8d:8c",
            "net5": "26:04:e1:cf:e9:95",
            "net6": "26:95:56:c7:db:62",
            "net7": "66:8d:42:2a:b5:87",
            "net8": "92:da:b8:5a:f4:f6",
            "net9": "9e:b5:f3:3c:7d:28"
        },
        "tof_1_2_2": {
            "net0": "86:7a:47:22:86:ad",
            "net1": "ce:ad:d1:5f:71:40",
            "net10": "42:34:18:f5:e6:51",
            "net11": "5a:4d:04:1f:f3:c3",
            "net12": "fe:61:08:84:52:28",
            "net13": "1e:60:e0:d7:0d:a4",
            "net14": "46:a9:d7:1e:c6:39",
            "net15": "6a:ea:e0:99:b2:9b",
            "net16": "06:5a:d4:1c:40:20",
            "net17": "7a:b7:ad:78:f7:ea",
            "net18": "92:db:ce:49:e6:48",
            "net19": "82:9a:1f:1e:22:ea",
            "net2": "9a:cf:93:05:df:96",
            "net3": "16:c2:8c:2f:7a:86",
            "net4": "12:42:e0:f2:19:fb",
            "net5": "c2:c2:05:45:2f:8f",
            "net6": "72:4c:13:6e:0d:5b",
            "net7": "62:10:96:77:93:c3",
            "net8": "8a:40:8d:1b:ab:00",
            "net9": "ea:c6:ff:48:1c:6f"
        },
        "tof_1_2_3": {
            "net0": "42:6e:0f:c8:6f:0d",
            "net1": "6e:d6:41:2f:f0:49",
            "net10": "56:93:9f:12:92:96",
            "net11": "32:a9:bc:85:c4:d6",
            "net12": "a6:cb:9e:8c:3e:2a",
            "net13": "be:89:2b:aa:0a:21",
            "net14": "be:a3:cd:88:08:43",
            "net15": "96:f0:90:9d:c2:74",
            "net16": "de:c4:08:ca:13:bb",
            "net17": "ee:4b:2c:f6:11:87",
            "net18": "c2:36:e6:eb:b8:1e",
            "net19": "32:c0:f2:f2:a7:4e",
            "net2": "aa:41:83:65:0b:ba",
            "net3": "4a:ec:31:c3:c5:d9",
            "net4": "7e:3f:8d:7f:43:7b",
            "net5": "8a:4b:f0:01:35:3b",
            "net6": "7e:62:cb:61:15:1f",
            "net7": "86:a6:c7:68:d9:d1",
            "net8": "ba:9f:c3:50:45:ee",
            "net9": "0e:1e:d9:11:1e:f6"
        },
        "tof_1_2_4": {
            "net0": "ba:23:b6:57:2f:6f",
            "net1": "ae:77:ef:31:fb:a9",
            "net10": "5e:67:1d:bb:d1:3a",
            "net11": "a6:e7:b4:fa:50:6c",
            "net12": "0e:f0:d9:e2:63:5e",
            "net13": "c6:66:26:0d:5d:64",
            "net14": "4a:f2:a5:04:c8:80",
            "net15": "f6:ce:b0:b0:79:61",
            "net16": "8e:68:dc:50:48:9f",
            "net17": "8a:b7:c9:e4:be:ce",
            "net18": "be:1a:38:6a:84:a1",
            "net19": "16:c9:fb:3c:49:8a",
            "net2": "26:8b:a0:0e:ef:a4",
            "net3": "e2:c6:16:4d:8a:1e",
            "net4": "c6:cc:0b:e9:b0:b6",
            "net5": "3e:7e:44:e4:f1:1a",
            "net6": "0a:25:4e:1c:ee:6f",
            "net7": "5e:ee:94:c0:4f:f5",
            "net8": "8e:36:c4:fd:c3:8b",
            "net9": "7e:e7:18:dd:46:db"
        },
        "tof_1_2_5": {
            "net0": "6e:57:ee:b5:2c:a5",
            "net1": "02:01:00:e3:de:73",
            "net10": "2e:1c:cf:f2:7c:f6",
            "net11": "f2:0f:2b:94:0f:6e",
            "net12": "e6:de:bd:64:0a:2a",
            "net13": "52:e1:64:c1:56:15",
            "net14": "4e:52:e4:98:74:57",
            "net15": "aa:ad:99:de:32:d1",
            "net16": "12:21:72:67:1d:47",
            "net17": "9e:74:95:41:9a:3e",
            "net18": "e2:c9:e8:09:d7:19",
            "net19": "7a:79:26:99:0f:8f",
            "net2": "de:06:3b:c4:f3:23",
            "net3": "2a:8b:3d:e6:85:d4",
            "net4": "ea:f2:1d:a9:ee:64",
            "net5": "56:d1:50:d7:96:12",
            "net6": "d6:a1:13:a8:09:dc",
            "net7": "6a:6c:62:51:22:07",
            "net8": "76:13:5d:e1:59:a4",
            "net9": "4e:79:21:e1:37:62"
        },
        "tof_1_2_6": {
            "net0": "b2:ff:b5:ca:90:7c",
            "net1": "96:5c:ea:12:32:30",
            "net10": "ee:71:6b:6a:d2:01",
            "net11": "be:2b:de:43:86:e4",
            "net12": "6e:86:c3:fb:8f:13",
            "net13": "4e:c1:a0:1b:57:65",
            "net14": "8a:4b:7f:ff:8c:d7",
            "net15": "c6:8e:8e:67:b8:3f",
            "net16": "4a:b1:a1:dd:54:4c",
            "net17": "6a:42:13:0b:ce:54",
            "net18": "ce:80:c0:29:e9:1f",
            "net19": "be:25:f1:e9:da:2c",
            "net2": "3e:5a:ee:60:be:34",
            "net3": "6a:f9:3b:9c:3e:fc",
            "net4": "42:02:3e:47:a2:f7",
            "net5": "d2:96:88:43:f2:33",
            "net6": "8a:13:d7:9a:fc:3f",
            "net7": "42:36:c6:fe:2a:98",
            "net8": "f6:6e:0c:4f:c0:bf",
            "net9": "d6:1d:20:ea:b3:2c"
        },
        "tof_1_2_7": {
            "net0": "46:a9:8f:dd:96:31",
            "net1": "d2:c5:c1:50:89:9f",
            "net10": "8a:90:c3:50:16:6d",
            "net11": "4e:e6:7f:92:40:14",
            "net12": "aa:c0:83:89:54:b6",
            "net13": "12:74:e5:4a:07:2b",
            "net14": "82:59:6d:fa:35:55",
            "net15": "4a:2f:a6:82:3b:19",
            "net16": "12:4d:0f:63:7d:d3",
            "net17": "3e:c7:10:e7:af:70",
            "net18": "26:5e:35:72:36:2d",
            "net19": "a2:c2:0e:3b:1d:23",
            "net2": "86:c2:08:dc:cd:f5",
            "net3": "ae:fb:69:6a:f5:17",
            "net4": "76:04:c1:cb:83:24",
            "net5": "e6:8f:de:2d:f1:25",
            "net6": "42:4e:95:bc:5e:ae",
            "net7": "ce:45:89:da:c2:43",
            "net8": "d2:06:3a:3b:2e:0c",
            "net9": "aa:a7:bc:77:8a:38"
        },
        "tof_1_2_8": {
            "net0": "5a:69:7d:6c:41:cf",
            "net1": "66:9b:f0:59:09:4d",
            "net10": "d6:21:12:b0:45:51",
            "net11": "4e:d9:3a:bd:4c:05",
            "net12": "02:22:37:56:4b:6b",
            "net13": "f6:13:ff:e0:36:8d",
            "net14": "9a:fd:06:2c:4f:26",
            "net15": "c6:27:84:b6:21:69",
            "net16": "d2:3f:4c:0f:b2:7a",
            "net17": "c2:1a:99:92:11:1f",
            "net18": "5e:26:a5:2a:e6:81",
            "net19": "ee:b7:78:5e:a9:ee",
            "net2": "ae:96:53:a5:56:53",
            "net3": "c6:d7:d7:9e:87:48",
            "net4": "4e:bb:95:78:83:fa",
            "net5": "86:3f:15:83:34:49",
            "net6": "66:e3:28:ef:fb:e6",
            "net7": "c6:9e:c4:6b:c7:f0",
            "net8": "ea:4c:80:9a:cc:05",
            "net9": "5e:f7:43:99:77:4a"
        },
        "tof_1_2_9": {
            "net0": "f6:d1:0a:e2:75:51",
            "net1": "52:34:c8:6a:87:e7",
            "net10": "fa:ab:bc:df:ad:17",
            "net11": "aa:02:2a:7c:61:ac",
            "net12": "1a:d8:3e:99:9c:4a",
            "net13": "02:06:91:92:71:c9",
            "net14": "82:27:5b:11:17:a8",
            "net15": "d6:36:7c:83:28:c8",
            "net16": "c2:56:b6:18:ec:ad",
            "net17": "6a:f9:d4:44:56:37",
            "net18": "e2:28:06:b6:06:75",
            "net19": "fe:c4:df:e9:1c:93",
            "net2": "6e:8c:ef:49:0f:73",
            "net3": "f2:b4:09:d6:d9:ac",
            "net4": "e2:8e:70:57:8e:b4",
            "net5": "06:da:a8:99:fb:32",
            "net6": "82:0e:8c:55:0e:e7",
            "net7": "2e:5d:30:04:68:14",
            "net8": "da:8f:21:88:70:89",
            "net9": "26:d6:a5:d0:e1:15"
        },
        "tof_2_2_1": {
            "net0": "c2:84:a8:88:55:b4",
            "net1": "46:7a:9f:dc:9f:cd",
            "net10": "d2:7e:ac:4a:c9:a3",
            "net11": "b6:ed:8b:58:5a:4d",
            "net12": "ce:3f:9a:94:43:6e",
            "net13": "8e:46:ab:4c:98:75",
            "net14": "ce:fb:49:95:76:93",
            "net15": "3e:80:3e:4a:51:cd",
            "net16": "12:38:a8:22:3f:d7",
            "net17": "9a:85:85:3a:55:d4",
            "net18": "1a:7d:46:52:d0:d4",
            "net19": "3e:3b:e0:06:8f:5f",
            "net2": "ae:bc:f7:1f:88:01",
            "net3": "9e:8a:a1:a3:08:ef",
            "net4": "e6:cd:e4:8e:8c:cc",
            "net5": "46:9a:f8:b9:8e:fc",
            "net6": "f6:d0:5d:df:1b:30",
            "net7": "32:67:40:80:4e:7e",
            "net8": "36:a5:97:28:06:5e",
            "net9": "2e:fa:f8:66:9e:ff"
        },
        "tof_2_2_10": {
            "net0": "26:2b:57:4c:ec:0f",
            "net1": "a6:24:48:c4:22:06",
            "net10": "56:52:e1:ca:70:46",
            "net11": "e2:a8:85:db:f3:97",
            "net12": "f2:71:a0:21:bb:26",
            "net13": "4e:87:89:10:c6:2f",
            "net14": "8a:76:72:61:d9:12",
            "net15": "52:94:62:58:02:19",
            "net16": "62:9e:2f:b8:79:a8",
            "net17": "1e:f8:fe:1b:e6:4a",
            "net18": "ae:34:7d:19:3d:28",
            "net19": "ca:2b:e7:7a:12:c1",
            "net2": "f6:65:a3:f4:67:11",
            "net3": "42:85:b9:77:17:d0",
            "net4": "22:8b:3c:8b:00:7c",
            "net5": "a6:ed:00:c6:8a:84",
            "net6": "66:33:e6:76:82:7b",
            "net7": "a2:9d:c1:7a:a9:31",
            "net8": "ea:2a:6e:31:1c:aa",
            "net9": "0a:0e:ae:5d:47:54"
        },
        "tof_2_2_2": {
            "net0": "ca:52:ca:c7:80:1e",
            "net1": "5a:22:4e:bf:15:e3",
            "net10": "32:09:40:1a:43:66",
            "net11": "9e:59:cb:25:82:f7",
            "net12": "f6:65:5f:fb:3a:15",
            "net13": "22:ff:91:15:f2:f7",
            "net14": "86:1d:51:4d:35:7f",
            "net15": "16:94:42:22:0b:45",
            "net16": "c2:6a:52:90:6f:55",
            "net17": "d6:18:9e:bd:5a:ef",
            "net18": "1a:0b:4d:fb:3e:ce",
            "net19": "7e:bb:e1:1f:c6:0d",
            "net2": "32:cd:cb:02:e6:f9",
            "net3": "ae:ab:ac:d3:8f:36",
            "net4": "4a:6c:0d:05:36:71",
            "net5": "56:e6:d9:2e:35:99",
            "net6": "5e:ea:0e:7e:a1:96",
            "net7": "96:9b:08:38:38:0f",
            "net8": "1a:8d:27:8f:0e:a4",
            "net9": "d2:1b:e6:7d:62:dc"
        },
        "tof_2_2_3": {
            "net0": "0a:4f:93:7f:56:d2",
            "net1": "06:c4:08:ae:d9:19",
            "net10": "66:84:c4:87:43:8c",
            "net11": "3e:c5:bf:9f:8c:d9",
            "net12": "f2:40:33:da:44:a2",
            "net13": "8a:5f:92:58:67:47",
            "net14": "3e:1b:9f:4c:2b:4a",
            "net15": "da:43:25:d9:49:66",
            "net16": "46:3d:89:8b:68:aa",
            "net17": "86:cd:10:f1:e7:23",
            "net18": "1a:a7:d7:f2:cf:a7",
            "net19": "f2:98:54:d3:24:52",
            "net2": "a6:26:6e:55:ba:7c",
            "net3": "86:77:b2:52:54:be",
            "net4": "a6:cf:7e:9f:3b:3d",
            "net5": "de:c4:a2:3b:7b:36",
            "net6": "c6:dd:5e:1a:50:8d",
            "net7": "a2:9c:b0:78:e7:b2",
            "net8": "9a:13:11:07:0f:a6",
            "net9": "76:78:3b:f4:a5:69"
        },
        "tof_2_2_4": {
            "net0": "16:03:15:ed:b2:d1",
            "net1": "de:a1:13:36:52:be",
            "net10": "aa:d5:9f:1d:fc:58",
            "net11": "4a:5f:8e:36:83:99",
            "net12": "da:d7:19:35:0d:2e",
            "net13": "fa:e7:89:74:5e:8a",
            "net14": "e6:31:8b:93:7c:29",
            "net15": "5e:45:3b:0d:ea:63",
            "net16": "da:a1:95:87:73:33",
            "net17": "7a:73:df:8d:18:77",
            "net18": "e6:65:1e:fc:c5:09",
            "net19": "7a:16:0a:a9:d8:7c",
            "net2": "9a:43:fd:66:da:98",
            "net3": "62:21:f1:7d:a4:60",
            "net4": "d6:e9:b7:a0:b9:5a",
            "net5": "2e:69:97:88:5e:08",
            "net6": "42:ba:7d:b0:2c:4b",
            "net7": "b2:01:72:d1:0e:5d",
            "net8": "26:82:fa:32:0b:8b",
            "net9": "9e:0b:07:bf:47:f2"
        },
        "tof_2_2_5": {
            "net0": "46:46:85:45:48:27",
            "net1": "ca:50:93:8f:52:83",
            "net10": "e6:a9:3b:db:bb:83",
            "net11": "86:85:46:e2:8e:b5",
            "net12": "1a:cb:c3:3a:37:cb",
            "net13": "26:ae:d1:c9:d5:e8",
            "net14": "0a:6d:01:35:02:3f",
            "net15": "32:dd:53:6d:cb:5b",
            "net16": "46:5e:3e:a0:9f:ad",
            "net17": "7a:db:a2:dd:6a:30",
            "net18": "56:b7:18:c1:87:78",
            "net19": "9a:a2:90:c9:68:bd",
            "net2": "8e:03:d3:4f:f5:a6",
            "net3": "46:2d:3c:24:f2:b9",
            "net4": "b6:8b:09:95:ab:18",
            "net5": "f6:aa:a0:50:10:54",
            "net6": "1a:bf:09:73:20:8b",
            "net7": "da:7f:8d:bb:ac:21",
            "net8": "16:3c:03:d1:bd:e3",
            "net9": "4a:d2:5e:7f:8c:31"
        },
        "tof_2_2_6": {
            "net0": "62:d4:7a:45:d7:56",
            "net1": "d2:9b:99:60:3d:10",
            "net10": "ba:29:bf:d3:5b:68",
            "net11": "5a:51:31:87:34:ae",
            "net12": "92:04:a9:ec:3b:e4",
            "net13": "82:78:05:41:ef:8c",
            "net14": "f2:a7:50:4f:46:9d",
            "net15": "ea:ba:16:d2:43:db",
            "net16": "5a:28:78:0b:6e:d0",
            "net17": "c6:5d:3f:fc:41:91",
            "net18": "ee:86:64:a0:53:25",
            "net19": "62:b5:fa:dd:8c:16",
            "net2": "b6:0f:9c:65:f1:9f",
            "net3": "86:a7:7d:69:48:b8",
            "net4": "22:7e:e6:e4:00:5d",
            "net5": "8e:07:12:08:4a:10",
            "net6": "56:a4:d0:59:22:3b",
            "net7": "da:0c:ae:73:3d:6b",
            "net8": "c6:dd:75:40:c6:73",
            "net9": "ca:35:5d:cc:eb:f9"
        },
        "tof_2_2_7": {
            "net0": "36:ac:1c:28:54:bf",
            "net1": "5e:e6:57:f1:4a:81",
            "net10": "26:88:5b:60:43:35",
            "net11": "a2:87:6d:fe:20:78",
            "net12": "8a:f1:46:a6:8e:4f",
            "net13": "9a:a1:69:35:77:26",
            "net14": "ba:aa:e6:74:6a:f8",
            "net15": "06:65:2e:a5:2b:d0",
            "net16": "2a:07:68:63:94:9a",
            "net17": "2e:9a:0c:db:bc:cf",
            "net18": "1a:a4:22:9d:39:ca",
            "net19": "c6:fb:cd:bd:b3:bf",
            "net2": "52:79:af:b3:81:7a",
            "net3": "22:98:09:ed:91:5c",
            "net4": "4e:3e:0c:d1:e3:bc",
            "net5": "5a:b9:60:ad:a8:56",
            "net6": "7a:f0:e7:23:9c:ea",
            "net7": "ba:d6:e3:6b:a2:30",
            "net8": "26:88:ef:0b:73:47",
            "net9": "5e:78:69:2e:8b:e6"
        },
        "tof_2_2_8": {
            "net0": "0a:05:99:68:40:51",
            "net1": "0e:52:c3:f4:1e:97",
            "net10": "06:57:e6:0d:a7:27",
            "net11": "96:84:b6:43:a1:c1",
            "net12": "de:12:9a:dc:c1:71",
            "net13": "ba:01:d6:44:16:d3",
            "net14": "06:67:e7:f5:35:aa",
            "net15": "8e:c3:15:31:cd:a4",
            "net16": "f2:d5:eb:c7:50:19",
            "net17": "ea:6c:0b:d3:d9:55",
            "net18": "6e:f2:c2:cd:28:1b",
            "net19": "02:dd:3a:10:c2:97",
            "net2": "ee:73:57:36:5e:fe",
            "net3": "c6:16:da:ee:45:d7",
            "net4": "ba:28:2a:bb:80:06",
            "net5": "1a:24:59:8c:2c:88",
            "net6": "0e:6e:bb:77:de:f7",
            "net7": "5e:da:a2:9a:12:2d",
            "net8": "62:a2:ef:c2:27:12",
            "net9": "5e:47:7e:fa:52:8a"
        },
        "tof_2_2_9": {
            "net0": "02:b9:31:12:fc:d7",
            "net1": "0a:80:4d:94:93:2f",
            "net10": "4e:05:b3:87:3d:a8",
            "net11": "de:83:83:4e:30:b0",
            "net12": "32:c1:43:18:6b:09",
            "net13": "9e:9b:fd:8d:28:42",
            "net14": "fa:c6:73:7a:68:62",
            "net15": "42:16:c4:db:6c:8d",
            "net16": "72:71:b3:6f:ee:4e",
            "net17": "22:39:3e:7b:93:e9",
            "net18": "22:f5:f0:a4:6e:69",
            "net19": "6a:6b:bb:e8:44:00",
            "net2": "b6:b2:b4:03:a2:33",
            "net3": "52:6c:ff:60:19:7f",
            "net4": "ba:5f:6e:93:cc:c5",
            "net5": "6a:1b:54:9c:a3:fd",
            "net6": "6e:3a:fb:06:e2:9c",
            "net7": "02:9e:f5:fd:aa:92",
            "net8": "0e:6c:d3:7f:7a:18",
            "net9": "be:17:13:82:80:f5"
        }
    },
    "failed_machine": "tof_1_2_1",
    "failed_interfaces": [
        "net0",
        "net1",
        "net2",
        "net3",
        "net4"
    ],
    "failure_time": 1616520015.381036
}