{
    "k_leaf": 12,
    "k_top": 12,
    "redundancy_factor": 12,
    "is_k8s": true,
    "machine_mac_addresses": {
        "leaf_1_0_1": {
            "net0": "9a:70:73:1a:a0:ae",
            "net1": "46:38:07:22:ba:a5",
            "net10": "7a:d9:e9:29:a0:b4",
            "net11": "7a:41:81:59:cf:d0",
            "net12": "76:59:d0:2d:6e:92",
            "net2": "d2:3f:1e:11:ba:61",
            "net3": "26:d9:aa:f2:ba:8c",
            "net4": "6e:ca:cd:0b:62:44",
            "net5": "02:83:96:68:1c:14",
            "net6": "42:60:60:95:7c:29",
            "net7": "3e:97:77:0f:90:1e",
            "net8": "ce:6c:6f:a0:07:78",
            "net9": "fe:36:93:7a:05:a8"
        },
        "leaf_1_0_10": {
            "net0": "8a:ff:ea:1c:76:01",
            "net1": "72:51:44:c7:96:ab",
            "net10": "fe:d8:73:b8:cd:af",
            "net11": "96:9d:31:7a:b9:4d",
            "net12": "26:3f:f1:8b:ba:68",
            "net2": "aa:b0:77:a0:91:f4",
            "net3": "d2:f6:0d:a4:d2:7d",
            "net4": "d2:bd:7b:96:2e:22",
            "net5": "aa:ea:65:9d:9f:7d",
            "net6": "1a:75:ea:5f:a1:26",
            "net7": "1a:4b:ef:2d:7f:c2",
            "net8": "aa:37:72:ed:8e:70",
            "net9": "4e:30:42:bb:61:03"
        },
        "leaf_1_0_11": {
            "net0": "e6:48:f6:80:5e:4a",
            "net1": "f2:0b:cc:c9:a4:3f",
            "net10": "9e:3e:b0:0b:8a:6c",
            "net11": "62:b0:64:16:12:8b",
            "net12": "a2:10:a7:5b:f9:78",
            "net2": "52:ac:29:1d:8c:63",
            "net3": "f2:67:08:5f:4d:61",
            "net4": "3e:96:7f:0b:6a:63",
            "net5": "be:18:49:60:6e:ec",
            "net6": "ba:8e:62:dd:95:fc",
            "net7": "b2:ec:73:12:f9:45",
            "net8": "fa:0e:2f:82:53:44",
            "net9": "ae:3f:5b:21:9e:c2"
        },
        "leaf_1_0_12": {
            "net0": "26:d3:21:fd:2d:61",
            "net1": "9a:15:68:59:d7:16",
            "net10": "0a:97:bf:f7:8e:34",
            "net11": "fa:9d:3e:f0:e6:b8",
            "net12": "a6:8b:f0:ab:a6:b4",
            "net2": "ce:d6:d5:7e:60:82",
            "net3": "66:9c:c2:d9:17:71",
            "net4": "6a:c6:db:07:94:29",
            "net5": "de:3d:15:04:cb:0b",
            "net6": "96:bd:a0:49:c1:39",
            "net7": "86:72:44:2d:89:9b",
            "net8": "f2:f4:92:52:74:e0",
            "net9": "26:e7:df:4c:f7:41"
        },
        "leaf_1_0_2": {
            "net0": "da:b6:97:0e:23:ec",
            "net1": "da:77:c2:eb:e3:cb",
            "net10": "e2:6d:e8:14:02:29",
            "net11": "02:56:de:04:17:e2",
            "net12": "82:85:a8:3c:57:df",
            "net2": "56:75:56:d0:ec:bf",
            "net3": "1a:cf:94:e5:e6:6d",
            "net4": "76:d1:89:29:9f:05",
            "net5": "aa:1f:71:40:6a:50",
            "net6": "f6:af:af:00:33:97",
            "net7": "7a:8e:26:2f:10:53",
            "net8": "c6:d7:a6:29:ef:43",
            "net9": "b2:44:8a:70:df:25"
        },
        "leaf_1_0_3": {
            "net0": "5a:31:6a:1e:25:a0",
            "net1": "66:8b:16:c6:a7:aa",
            "net10": "9e:a2:32:52:e9:82",
            "net11": "ba:a4:42:a8:86:75",
            "net12": "e2:4d:44:4b:fd:36",
            "net2": "4a:af:b2:66:f2:81",
            "net3": "ae:17:d9:d7:ec:d0",
            "net4": "76:e0:4f:1d:89:f2",
            "net5": "ee:31:99:27:28:b5",
            "net6": "1e:ad:68:83:fc:3b",
            "net7": "9a:a2:91:c4:69:3b",
            "net8": "16:90:4e:83:ab:a4",
            "net9": "02:c8:8d:56:fc:b8"
        },
        "leaf_1_0_4": {
            "net0": "ae:c6:ea:9a:c6:c6",
            "net1": "16:fd:46:27:18:48",
            "net10": "de:e0:10:6a:2a:0e",
            "net11": "66:3b:f2:f6:20:18",
            "net12": "0e:e1:6d:de:b9:ee",
            "net2": "f2:c0:b1:cf:05:71",
            "net3": "ba:e3:08:07:ee:16",
            "net4": "82:af:40:dd:b4:66",
            "net5": "a2:e3:b5:3f:9c:5a",
            "net6": "b6:86:ad:58:5e:2b",
            "net7": "8e:f1:03:8f:4e:91",
            "net8": "c2:df:a7:af:5c:bd",
            "net9": "da:81:55:3f:76:1b"
        },
        "leaf_1_0_5": {
            "net0": "7a:a7:1d:d0:87:54",
            "net1": "32:24:2c:60:7b:1b",
            "net10": "46:b6:f9:00:ec:87",
            "net11": "76:e5:0d:aa:98:3c",
            "net12": "ca:c0:49:d1:4b:89",
            "net2": "f6:54:c4:ac:37:03",
            "net3": "ae:de:1c:5d:63:bc",
            "net4": "26:bd:49:81:c1:db",
            "net5": "c6:b8:c6:59:a7:be",
            "net6": "1a:d7:80:80:a2:79",
            "net7": "72:6d:a6:c1:ec:fb",
            "net8": "4e:83:f4:48:1b:b3",
            "net9": "d6:57:c7:ae:44:3c"
        },
        "leaf_1_0_6": {
            "net0": "46:18:b6:16:df:d7",
            "net1": "c6:fa:94:df:1e:1c",
            "net10": "0e:de:9c:49:20:f4",
            "net11": "ea:96:05:13:f6:01",
            "net12": "42:56:26:72:94:75",
            "net2": "1e:d5:70:9c:eb:ee",
            "net3": "f2:72:b4:0f:b3:76",
            "net4": "fa:31:3f:78:55:dd",
            "net5": "c6:ca:e1:b0:57:14",
            "net6": "c2:e4:df:8b:40:87",
            "net7": "e2:86:57:18:63:bf",
            "net8": "52:5e:06:66:b3:38",
            "net9": "26:8c:7b:99:54:8d"
        },
        "leaf_1_0_7": {
            "net0": "9a:63:63:1c:bf:20",
            "net1": "6a:32:bd:24:0a:56",
            "net10": "36:b8:d5:bf:a9:a4",
            "net11": "be:e8:08:78:b9:fa",
            "net12": "02:d3:f2:f6:4a:a4",
            "net2": "0a:d6:9c:30:08:1d",
            "net3": "16:14:70:86:ee:61",
            "net4": "2e:1e:a7:e9:d3:c5",
            "net5": "4e:ae:e6:49:8f:98",
            "net6": "9e:4f:b4:8d:63:95",
            "net7": "56:b4:60:76:8f:d5",
            "net8": "0e:4c:e4:75:cf:e5",
            "net9": "92:2f:2f:7d:23:5e"
        },
        "leaf_1_0_8": {
            "net0": "16:d9:f1:40:3a:b9",
            "net1": "9e:be:00:05:72:28",
            "net10": "96:53:05:9a:37:12",
            "net11": "ee:3f:73:f6:c1:1f",
            "net12": "42:14:91:bf:14:de",
            "net2": "be:b6:92:f1:5c:65",
            "net3": "06:12:42:bf:2c:40",
            "net4": "86:80:06:77:20:cd",
            "net5": "be:04:79:b4:b9:d3",
            "net6": "6e:73:79:28:03:bb",
            "net7": "5e:c1:b8:ae:fd:9e",
            "net8": "9e:10:5d:95:a3:87",
            "net9": "6a:e9:d0:9c:ce:98"
        },
        "leaf_1_0_9": {
            "net0": "e2:ee:6d:7c:24:18",
            "net1": "6e:dc:0f:c1:63:96",
            "net10": "ca:8c:ed:f4:eb:c0",
            "net11": "82:8e:76:ca:ff:e1",
            "net12": "a6:d7:34:0f:ab:93",
            "net2": "62:fb:6a:b3:03:2f",
            "net3": "06:b3:f2:e6:15:77",
            "net4": "02:da:e8:84:40:69",
            "net5": "22:8e:03:62:88:f2",
            "net6": "6e:48:3a:c0:b4:ce",
            "net7": "86:f6:c8:de:cb:0a",
            "net8": "56:20:01:aa:f5:25",
            "net9": "7e:57:9c:38:35:d3"
        },
        "leaf_2_0_1": {
            "net0": "fe:c5:57:27:84:39",
            "net1": "6a:57:94:a4:d2:7d",
            "net10": "3a:48:98:8b:a2:51",
            "net11": "5e:ad:13:99:4b:a7",
            "net12": "1a:08:b8:90:72:a5",
            "net2": "f6:23:ec:8b:39:ae",
            "net3": "02:18:c6:83:df:92",
            "net4": "aa:96:40:78:f6:77",
            "net5": "d2:10:9e:b5:30:fb",
            "net6": "32:cc:cc:84:65:45",
            "net7": "36:d7:67:b6:84:21",
            "net8": "72:37:3b:ea:6b:76",
            "net9": "ae:e4:4f:13:e2:b9"
        },
        "leaf_2_0_10": {
            "net0": "2e:b3:03:4d:21:0d",
            "net1": "e6:d2:4b:64:23:9d",
            "net10": "96:24:e8:10:45:81",
            "net11": "f2:0f:89:17:77:3f",
            "net12": "9a:ab:19:6b:dd:7e",
            "net2": "fa:e0:e6:41:32:13",
            "net3": "4e:cd:4a:eb:05:34",
            "net4": "c2:dc:34:1b:6c:10",
            "net5": "4a:b3:c6:f4:14:ae",
            "net6": "de:d9:58:35:b9:a6",
            "net7": "f2:2f:b1:d7:cc:a2",
            "net8": "8a:f5:37:4f:e2:ed",
            "net9": "76:9a:51:dd:34:d1"
        },
        "leaf_2_0_11": {
            "net0": "66:37:41:6f:fd:8f",
            "net1": "f6:3b:ca:2c:fd:25",
            "net10": "f6:42:1a:21:ff:7d",
            "net11": "52:d9:10:6a:9b:97",
            "net12": "ae:75:46:87:f2:25",
            "net2": "92:af:81:2f:59:47",
            "net3": "ca:c7:f9:3e:59:cd",
            "net4": "da:8a:58:43:74:7e",
            "net5": "da:63:c8:fb:f9:a7",
            "net6": "a6:a2:a8:3f:fe:eb",
            "net7": "ea:87:fa:82:98:ee",
            "net8": "36:13:c6:51:5f:3f",
            "net9": "3e:7d:5b:d9:6b:dc"
        },
        "leaf_2_0_12": {
            "net0": "96:61:ef:5a:c6:50",
            "net1": "92:a4:3f:99:06:6d",
            "net10": "9a:f5:86:7c:c2:92",
            "net11": "0e:6f:3a:c4:d8:24",
            "net12": "aa:fe:b7:cd:ce:ad",
            "net2": "16:69:54:be:4e:b6",
            "net3": "c2:f7:d5:18:63:bc",
            "net4": "d6:33:73:03:71:87",
            "net5": "26:68:43:b4:18:2e",
            "net6": "e6:e6:27:5a:54:88",
            "net7": "a2:f7:42:c7:9d:aa",
            "net8": "8e:c4:7e:59:94:63",
            "net9": "26:d4:2f:52:2f:88"
        },
        "leaf_2_0_2": {
            "net0": "6e:d9:cd:75:32:4b",
            "net1": "22:d3:af:36:b8:46",
            "net10": "06:4e:0c:b8:b8:5d",
            "net11": "a2:a4:f7:75:b5:05",
            "net12": "6e:b3:19:8d:72:2d",
            "net2": "86:91:cb:1f:71:48",
            "net3": "3e:03:9e:16:53:36",
            "net4": "06:56:71:6c:50:d3",
            "net5": "ba:a1:d6:6c:8f:2c",
            "net6": "22:d7:2e:d6:05:05",
            "net7": "42:18:3c:ca:74:e2",
            "net8": "66:be:aa:92:b9:78",
            "net9": "4e:f0:c5:0a:58:9c"
        },
        "leaf_2_0_3": {
            "net0": "b2:5a:0d:8a:f8:8f",
            "net1": "0a:87:c2:37:95:5a",
            "net10": "aa:2f:42:68:eb:6b",
            "net11": "2a:c6:2e:7c:21:f9",
            "net12": "ea:f8:34:9e:87:6d",
            "net2": "ae:81:33:42:64:6c",
            "net3": "06:3e:2b:f4:d8:9d",
            "net4": "8e:19:37:6b:72:b2",
            "net5": "96:08:e5:7b:e3:7d",
            "net6": "a6:c5:7b:8a:bb:d7",
            "net7": "5a:b6:f8:7f:4b:71",
            "net8": "c2:82:a7:28:31:f6",
            "net9": "52:0f:f7:16:d4:19"
        },
        "leaf_2_0_4": {
            "net0": "9e:c6:35:3a:b5:d0",
            "net1": "02:34:b4:59:78:d0",
            "net10": "12:ea:d5:70:3e:71",
            "net11": "f2:74:16:b7:a1:fb",
            "net12": "9e:91:7f:21:4d:e1",
            "net2": "56:77:47:16:37:79",
            "net3": "f2:cd:a3:78:34:24",
            "net4": "42:fe:08:14:35:28",
            "net5": "1e:71:e7:25:32:b9",
            "net6": "56:1c:fb:21:2c:d7",
            "net7": "f6:03:10:17:7d:b4",
            "net8": "76:30:64:4c:11:0a",
            "net9": "a2:7a:a9:bc:e8:75"
        },
        "leaf_2_0_5": {
            "net0": "2a:d7:85:e1:fd:f3",
            "net1": "1e:47:b7:67:2a:f0",
            "net10": "72:0a:91:78:4b:e9",
            "net11": "6a:9d:de:63:59:1f",
            "net12": "82:f7:55:b5:27:30",
            "net2": "f2:dc:cc:38:4e:5b",
            "net3": "ee:b3:3e:fc:17:11",
            "net4": "96:93:31:2d:19:5e",
            "net5": "16:6e:ab:d8:80:69",
            "net6": "3e:30:40:94:24:7c",
            "net7": "66:c8:fa:a8:c7:72",
            "net8": "06:04:98:5f:f1:47",
            "net9": "2e:33:39:13:d7:cf"
        },
        "leaf_2_0_6": {
            "net0": "b6:a2:99:90:75:4d",
            "net1": "0a:f3:86:d4:9e:6b",
            "net10": "fe:79:95:30:ec:dc",
            "net11": "06:c0:f3:b5:75:ae",
            "net12": "1a:fa:7c:7c:88:e6",
            "net2": "aa:73:16:50:e1:62",
            "net3": "7e:81:fd:c6:43:66",
            "net4": "f6:d1:db:ad:d9:6b",
            "net5": "e2:32:0e:6b:e0:b6",
            "net6": "8a:1e:d3:b8:48:43",
            "net7": "aa:f3:6e:49:9b:8b",
            "net8": "c6:e4:76:54:1c:ac",
            "net9": "ae:e4:df:96:b0:e0"
        },
        "leaf_2_0_7": {
            "net0": "62:6b:f0:81:7e:36",
            "net1": "f2:80:28:fc:8d:a8",
            "net10": "0a:4e:46:c0:43:1c",
            "net11": "4e:3d:e2:0b:17:be",
            "net12": "16:17:7a:71:93:60",
            "net2": "ea:1c:58:a0:20:d9",
            "net3": "ae:ce:6c:67:81:e9",
            "net4": "ca:0c:12:a5:27:f6",
            "net5": "fe:73:c5:6d:6d:6b",
            "net6": "ae:18:4b:03:ba:4c",
            "net7": "3e:41:07:43:b5:b6",
            "net8": "2e:81:05:2a:63:6d",
            "net9": "0a:93:23:eb:c1:36"
        },
        "leaf_2_0_8": {
            "net0": "46:28:a3:30:4f:e4",
            "net1": "62:c2:b5:6b:b5:d7",
            "net10": "e6:a3:ed:a6:8f:b8",
            "net11": "02:b6:6a:19:83:50",
            "net12": "86:92:55:46:67:32",
            "net2": "8e:6a:f4:fb:d8:ee",
            "net3": "66:de:7e:fd:a5:ec",
            "net4": "5e:8c:08:9e:e9:10",
            "net5": "66:d8:60:b0:4e:de",
            "net6": "d2:32:4d:61:85:15",
            "net7": "fa:0b:c5:52:ab:eb",
            "net8": "32:ac:4d:d6:13:e4",
            "net9": "8a:b9:24:b4:cd:02"
        },
        "leaf_2_0_9": {
            "net0": "aa:4e:6b:e1:29:fa",
            "net1": "f6:0b:83:49:2d:2b",
            "net10": "7e:59:42:67:96:c0",
            "net11": "aa:18:5f:b5:88:5c",
            "net12": "06:a0:cd:e3:5f:fa",
            "net2": "52:1b:df:15:a1:4a",
            "net3": "ee:ee:a2:e9:19:cd",
            "net4": "5e:db:03:06:a1:b8",
            "net5": "72:33:bd:58:4d:2d",
            "net6": "86:95:9d:f8:a6:6d",
            "net7": "f6:e4:18:5b:1a:5c",
            "net8": "9a:24:37:73:eb:e4",
            "net9": "be:28:e4:90:b7:f6"
        },
        "spine_1_1_1": {
            "net0": "52:6a:2f:78:ea:fa",
            "net1": "2a:ec:91:34:d4:10",
            "net10": "d6:5f:9d:1d:95:d1",
            "net11": "e2:ba:af:87:d7:10",
            "net12": "fe:9d:1d:c6:a4:49",
            "net13": "b2:d2:c8:84:f7:67",
            "net14": "92:7a:89:4c:36:07",
            "net15": "3e:1b:ff:80:46:d4",
            "net16": "de:27:ff:7d:fb:05",
            "net17": "2a:21:b4:f1:89:11",
            "net18": "6e:70:42:19:3f:58",
            "net19": "0e:70:54:5d:6a:83",
            "net2": "6a:b4:42:c8:8a:9d",
            "net20": "1e:e0:73:18:09:fc",
            "net21": "c6:42:ca:35:9a:5c",
            "net22": "8a:ce:a2:b8:ab:58",
            "net23": "ca:81:31:90:37:63",
            "net3": "3e:0f:af:ec:f1:15",
            "net4": "3a:2b:e0:f7:8e:a0",
            "net5": "5e:23:1e:50:0c:f2",
            "net6": "a2:d3:36:6f:06:fa",
            "net7": "9e:4d:d6:98:3d:75",
            "net8": "96:d7:ee:b3:39:0f",
            "net9": "a6:07:9e:9c:36:27"
        },
        "spine_1_1_10": {
            "net0": "ba:1d:d2:ad:76:af",
            "net1": "66:81:11:2d:3b:c5",
            "net10": "16:0c:f3:b8:ae:0e",
            "net11": "1a:06:f1:4a:ee:b6",
            "net12": "5a:53:63:d9:c3:a4",
            "net13": "06:b8:23:fb:5c:b1",
            "net14": "f2:30:35:1b:2b:8b",
            "net15": "5a:5b:65:a3:d6:c9",
            "net16": "b2:ea:ad:b8:ee:b1",
            "net17": "02:2b:68:18:89:e0",
            "net18": "26:27:d9:80:84:e9",
            "net19": "6e:25:f8:e0:6e:04",
            "net2": "32:c3:ff:59:62:84",
            "net20": "ee:0b:57:fe:ea:9a",
            "net21": "ba:4c:b6:8c:bd:0a",
            "net22": "02:bc:75:ca:1c:8b",
            "net23": "36:2e:80:95:03:cf",
            "net3": "3a:ac:16:54:b1:32",
            "net4": "be:d6:8e:24:e5:6c",
            "net5": "1a:71:f8:78:a5:6a",
            "net6": "62:48:53:bb:e8:73",
            "net7": "2e:6d:07:2e:c8:d5",
            "net8": "de:03:fb:03:38:f7",
            "net9": "9a:af:37:84:ce:23"
        },
        "spine_1_1_11": {
            "net0": "4e:46:ce:7c:2f:ce",
            "net1": "62:9c:ba:66:7f:eb",
            "net10": "ea:42:93:f8:cb:e3",
            "net11": "9e:24:13:55:7f:b6",
            "net12": "9e:10:55:66:71:22",
            "net13": "ba:c4:13:0e:c9:80",
            "net14": "7e:24:c1:43:4d:b7",
            "net15": "ea:9e:06:fd:40:d7",
            "net16": "de:e4:d4:15:88:56",
            "net17": "f6:63:ea:2f:76:7f",
            "net18": "c6:60:47:61:ca:bd",
            "net19": "42:22:e5:4b:68:11",
            "net2": "be:e3:85:c3:f8:4e",
            "net20": "d6:8e:ad:f7:04:ef",
            "net21": "a6:87:60:d1:3b:eb",
            "net22": "5e:7a:65:60:1c:59",
            "net23": "96:0b:cc:28:30:88",
            "net3": "4a:06:6c:1d:52:86",
            "net4": "76:d1:15:c7:42:4d",
            "net5": "6e:54:93:4d:75:dc",
            "net6": "7e:7e:6d:4f:92:de",
            "net7": "7e:01:31:96:2a:2c",
            "net8": "e2:14:12:db:b8:a0",
            "net9": "22:c7:7e:5d:0e:b7"
        },
        "spine_1_1_12": {
            "net0": "56:14:e1:51:85:fd",
            "net1": "6a:50:bf:5b:0b:33",
            "net10": "82:4d:2f:ca:d0:aa",
            "net11": "0e:27:c5:f1:0a:b0",
            "net12": "02:5b:8b:53:db:50",
            "net13": "fa:45:c7:cd:89:53",
            "net14": "62:2e:46:2d:c9:2b",
            "net15": "0e:52:03:69:e4:4c",
            "net16": "fe:b8:88:1e:26:5c",
            "net17": "fa:62:96:51:b2:37",
            "net18": "0e:e5:d7:98:7d:e1",
            "net19": "12:0c:90:6f:7f:a7",
            "net2": "c6:26:40:ca:51:45",
            "net20": "26:76:5f:1f:af:cd",
            "net21": "de:c5:25:15:2d:d5",
            "net22": "3e:07:a8:ca:dd:b7",
            "net23": "2a:90:11:dd:85:5e",
            "net3": "42:6e:82:a3:c8:2b",
            "net4": "5e:38:e1:a5:20:2e",
            "net5": "72:11:c1:6c:3f:a0",
            "net6": "de:b0:e7:1a:d0:fe",
            "net7": "fe:48:7a:a6:e4:2d",
            "net8": "e6:3a:6d:79:8d:01",
            "net9": "5a:16:a3:68:08:c5"
        },
        "spine_1_1_2": {
            "net0": "d2:f9:a7:2e:27:ae",
            "net1": "ca:0a:61:a0:0e:a0",
            "net10": "ce:2f:85:ce:9e:ab",
            "net11": "1e:f3:6c:4b:33:9e",
            "net12": "8e:eb:33:c3:6e:3a",
            "net13": "f2:d2:49:9b:8b:3a",
            "net14": "3a:26:5a:49:bb:2e",
            "net15": "4e:8f:c6:4b:f4:90",
            "net16": "ee:05:b4:fd:7e:be",
            "net17": "c6:39:89:78:df:a8",
            "net18": "7a:cc:19:ae:be:0f",
            "net19": "46:81:ad:e8:96:e3",
            "net2": "46:35:e2:ce:81:38",
            "net20": "aa:92:5a:40:8a:c1",
            "net21": "be:b9:0f:1b:0c:28",
            "net22": "e6:d2:4e:8e:f6:0f",
            "net23": "a6:6f:01:b4:95:6f",
            "net3": "ea:3f:2f:b0:23:56",
            "net4": "86:2e:e6:c7:e3:6d",
            "net5": "da:e4:bb:3a:cb:2c",
            "net6": "b6:ca:a8:45:f6:9e",
            "net7": "0a:7a:b7:ca:62:e9",
            "net8": "5a:a9:60:47:a5:3e",
            "net9": "02:e8:c2:a4:7d:1d"
        },
        "spine_1_1_3": {
            "net0": "72:f9:b3:c9:ee:e4",
            "net1": "ce:ec:80:5a:13:f5",
            "net10": "2e:13:05:13:3e:6c",
            "net11": "66:98:b4:64:34:3e",
            "net12": "e6:c9:81:b7:e5:5a",
            "net13": "66:86:ac:27:56:54",
            "net14": "ce:fb:e9:00:fb:e3",
            "net15": "0a:39:f9:4d:dc:f9",
            "net16": "1a:54:a7:7c:32:13",
            "net17": "7e:e6:bb:f5:91:cd",
            "net18": "52:65:f9:f1:85:fd",
            "net19": "2e:7c:6b:1d:a6:3f",
            "net2": "3e:f4:ea:44:83:62",
            "net20": "ee:a1:0f:46:a5:95",
            "net21": "ea:af:46:e0:d6:4b",
            "net22": "ce:5a:b0:38:06:23",
            "net23": "f6:11:0e:e8:46:f8",
            "net3": "d2:75:72:f0:5e:ed",
            "net4": "ea:76:71:9e:70:de",
            "net5": "e2:7b:8c:be:d0:8f",
            "net6": "5a:11:05:27:c1:77",
            "net7": "52:74:3f:5f:76:0d",
            "net8": "3a:68:f3:b4:41:56",
            "net9": "d6:7a:f4:50:55:09"
        },
        "spine_1_1_4": {
            "net0": "82:bb:e7:29:f8:bc",
            "net1": "36:50:65:34:21:05",
            "net10": "8e:0a:2b:1e:b6:8d",
            "net11": "16:9f:84:e9:e7:df",
            "net12": "52:b0:7e:68:b5:7b",
            "net13": "62:3b:c1:50:32:1f",
            "net14": "ea:47:a8:75:67:90",
            "net15": "be:25:c5:cb:c0:b6",
            "net16": "32:02:40:48:3e:d3",
            "net17": "76:92:53:09:f2:26",
            "net18": "d6:9c:18:6d:e8:27",
            "net19": "f6:ed:00:d3:2e:73",
            "net2": "8a:9a:f3:58:84:66",
            "net20": "1a:47:62:5a:1c:bf",
            "net21": "e6:66:aa:d2:fc:88",
            "net22": "8a:c8:ca:ba:91:d2",
            "net23": "12:92:0c:e5:ff:f9",
            "net3": "5a:25:9b:97:e7:dc",
            "net4": "e6:c1:b9:4e:87:ed",
            "net5": "1a:e9:22:a7:7c:66",
            "net6": "e2:5b:19:64:ad:bc",
            "net7": "6a:62:cd:f6:82:49",
            "net8": "0e:9e:a4:71:30:47",
            "net9": "12:68:1d:7c:a7:8b"
        },
        "spine_1_1_5": {
            "net0": "16:93:d3:3e:86:a5",
            "net1": "6e:68:55:3d:57:6c",
            "net10": "9a:98:89:eb:ed:49",
            "net11": "fa:a7:ca:76:5d:30",
            "net12": "ca:3f:ec:90:01:a9",
            "net13": "f6:a5:b2:ad:91:8d",
            "net14": "f2:74:83:5d:95:bd",
            "net15": "e2:89:2d:f6:d0:58",
            "net16": "6a:d6:c9:ff:09:a6",
            "net17": "5e:f0:16:5e:16:cb",
            "net18": "d2:14:4e:c6:61:e2",
            "net19": "4e:67:c9:51:66:2f",
            "net2": "82:c3:7b:db:3a:db",
            "net20": "9a:61:a4:55:e0:23",
            "net21": "b2:96:01:3b:1f:32",
            "net22": "8e:42:f2:5e:12:27",
            "net23": "5a:3d:f3:88:a1:8c",
            "net3": "8e:c4:9c:15:b5:d4",
            "net4": "f6:35:27:c2:9f:8c",
            "net5": "0e:a4:06:3d:07:3f",
            "net6": "1e:55:98:03:da:c0",
            "net7": "72:8a:e9:58:3a:b3",
            "net8": "8a:9e:e6:09:e0:68",
            "net9": "22:92:d0:a9:22:2f"
        },
        "spine_1_1_6": {
            "net0": "56:7a:69:1f:c0:2c",
            "net1": "f6:2f:16:13:46:25",
            "net10": "8a:e9:06:6a:20:b4",
            "net11": "2e:d4:de:fb:fc:0f",
            "net12": "da:99:67:b6:ab:d9",
            "net13": "82:97:22:30:fb:3d",
            "net14": "6a:7a:10:fa:e2:8e",
            "net15": "42:6e:fa:0b:3c:03",
            "net16": "e2:57:59:e4:e5:3e",
            "net17": "4a:a9:eb:8f:e4:83",
            "net18": "62:78:8f:95:33:0a",
            "net19": "be:1c:5d:3d:1a:c7",
            "net2": "2e:b3:69:2c:c7:ad",
            "net20": "56:bd:01:51:0b:66",
            "net21": "ba:f9:83:45:40:28",
            "net22": "7e:d6:4b:3c:9c:2f",
            "net23": "46:2e:01:d5:02:5e",
            "net3": "0a:9c:7f:7e:0a:eb",
            "net4": "da:f8:28:07:5c:e0",
            "net5": "92:d5:08:d1:c9:15",
            "net6": "e2:c6:e0:4d:ab:87",
            "net7": "2e:22:66:4e:14:f0",
            "net8": "42:2f:29:aa:49:d5",
            "net9": "da:30:bb:8e:bc:93"
        },
        "spine_1_1_7": {
            "net0": "62:9a:63:04:0c:8d",
            "net1": "7e:5f:fd:b6:e2:4c",
            "net10": "16:5a:dd:b2:ba:ca",
            "net11": "9e:ee:12:f1:8d:ab",
            "net12": "62:b2:f7:9f:dc:04",
            "net13": "0e:b6:49:d6:fa:74",
            "net14": "4a:0b:eb:9a:4e:63",
            "net15": "5e:1d:e0:73:58:8e",
            "net16": "4a:e3:a4:e2:c5:25",
            "net17": "1a:1b:79:19:ca:22",
            "net18": "ca:49:50:0a:0b:83",
            "net19": "92:8d:11:7e:82:0a",
            "net2": "86:a0:74:ac:5f:81",
            "net20": "2a:2a:8d:aa:67:e9",
            "net21": "ba:ce:19:57:72:21",
            "net22": "a6:86:9f:80:50:c8",
            "net23": "8a:dc:95:76:4c:dd",
            "net3": "32:cb:8c:1c:e3:c6",
            "net4": "2e:4a:e7:82:93:f3",
            "net5": "be:10:aa:d5:2b:36",
            "net6": "76:18:94:4e:93:ca",
            "net7": "4a:15:ee:8f:65:e0",
            "net8": "1a:5c:68:81:d9:b5",
            "net9": "a2:2c:dc:ed:85:26"
        },
        "spine_1_1_8": {
            "net0": "72:8b:02:ca:57:2f",
            "net1": "4e:ba:7a:16:d4:2b",
            "net10": "b2:22:7c:84:de:46",
            "net11": "76:d5:ff:98:5a:ae",
            "net12": "e2:47:ee:00:cf:4c",
            "net13": "fa:fc:50:9f:f7:a3",
            "net14": "82:de:ad:b8:e2:4f",
            "net15": "ae:35:54:c0:01:b3",
            "net16": "ae:d3:80:70:a5:6f",
            "net17": "9a:b1:07:95:54:30",
            "net18": "fa:5c:dc:fe:15:12",
            "net19": "a6:1a:3f:c5:b9:81",
            "net2": "ee:40:68:5c:24:de",
            "net20": "9e:be:88:f8:3e:b3",
            "net21": "aa:93:e6:f6:96:d0",
            "net22": "1a:5f:cc:29:ba:e6",
            "net23": "8a:1b:b5:07:c2:fb",
            "net3": "ae:22:c3:5d:9b:5d",
            "net4": "5e:46:3b:76:35:29",
            "net5": "da:24:98:b1:cf:6c",
            "net6": "8e:f4:dd:bf:80:85",
            "net7": "f6:3b:13:ee:56:2c",
            "net8": "ee:b8:01:d0:11:43",
            "net9": "be:c0:4c:40:2a:0a"
        },
        "spine_1_1_9": {
            "net0": "b6:d8:ec:66:a2:a6",
            "net1": "da:c8:b4:8a:d0:f0",
            "net10": "9a:5a:29:f9:ad:af",
            "net11": "72:a2:e9:ab:18:ee",
            "net12": "f6:39:ea:8c:bd:09",
            "net13": "ba:9d:54:ea:57:76",
            "net14": "c2:37:18:49:04:51",
            "net15": "d6:9d:13:f4:56:3f",
            "net16": "42:fd:e3:ca:51:28",
            "net17": "c2:dd:4c:40:9d:55",
            "net18": "0a:59:20:72:fa:9d",
            "net19": "da:97:a8:a5:f2:2c",
            "net2": "8e:66:b3:80:41:75",
            "net20": "8e:3b:eb:df:0d:48",
            "net21": "42:7a:56:cf:77:99",
            "net22": "d2:9b:b6:2a:d1:45",
            "net23": "fa:3c:a1:12:67:9e",
            "net3": "7a:bf:09:c3:44:cd",
            "net4": "82:8c:43:49:2e:23",
            "net5": "5a:1f:d7:e3:3b:4f",
            "net6": "66:3a:42:a4:60:a9",
            "net7": "32:ff:84:13:09:c5",
            "net8": "66:a5:a7:41:d0:f4",
            "net9": "d2:52:49:a6:d9:58"
        },
        "spine_2_1_1": {
            "net0": "52:34:4b:29:bf:7a",
            "net1": "a6:d2:63:84:eb:e5",
            "net10": "9e:7b:ae:fb:e8:b6",
            "net11": "a6:e4:30:ef:42:01",
            "net12": "22:51:95:fb:6b:d1",
            "net13": "4a:c1:8b:27:03:d3",
            "net14": "ee:65:1d:6a:79:12",
            "net15": "d6:af:7d:0a:cf:51",
            "net16": "ba:4e:0d:ee:1f:f6",
            "net17": "4e:a0:93:b0:ba:48",
            "net18": "32:7d:b7:78:3a:b8",
            "net19": "7e:8e:de:93:ef:3d",
            "net2": "82:18:d7:8d:58:9f",
            "net20": "ee:d5:c0:8c:92:04",
            "net21": "7e:1d:f0:72:1b:6b",
            "net22": "ba:e4:7b:90:bc:7f",
            "net23": "e2:a0:b6:20:45:e1",
            "net3": "12:5b:2c:6f:86:67",
            "net4": "de:b6:b1:51:56:71",
            "net5": "fe:17:72:86:bf:8e",
            "net6": "82:31:5a:e8:33:7d",
            "net7": "c6:0b:87:13:0b:ae",
            "net8": "e6:18:11:f7:c1:79",
            "net9": "3a:63:35:fc:0d:98"
        },
        "spine_2_1_10": {
            "net0": "0a:d6:9f:fb:f3:78",
            "net1": "b2:b6:6f:b8:a8:6d",
            "net10": "2e:53:92:90:42:47",
            "net11": "0a:c7:4e:3a:01:14",
            "net12": "da:b8:28:3a:24:1d",
            "net13": "ba:53:4b:0c:8e:5b",
            "net14": "0a:e1:be:d3:e5:b0",
            "net15": "82:45:e8:d0:14:5e",
            "net16": "c2:63:a3:12:af:5c",
            "net17": "0e:97:b8:61:1c:e9",
            "net18": "36:86:47:60:f6:bd",
            "net19": "fa:13:c8:d4:17:00",
            "net2": "06:99:2e:31:78:9b",
            "net20": "be:c6:a4:05:17:1b",
            "net21": "36:66:8f:a6:54:91",
            "net22": "6a:38:df:bc:d1:f5",
            "net23": "1e:4c:4f:ee:4f:66",
            "net3": "9a:e9:b0:e9:0d:30",
            "net4": "b2:69:71:56:37:db",
            "net5": "0a:d7:ed:ee:72:5c",
            "net6": "b6:56:92:00:b2:07",
            "net7": "32:1b:25:5e:06:f7",
            "net8": "12:8b:b4:04:16:5f",
            "net9": "e2:ec:da:d7:71:38"
        },
        "spine_2_1_11": {
            "net0": "d2:a5:4a:df:18:9c",
            "net1": "76:e3:cc:03:ec:fb",
            "net10": "fe:2c:bc:0f:8e:52",
            "net11": "5e:b4:7f:e1:74:d3",
            "net12": "ca:0d:13:5f:cf:19",
            "net13": "8a:e8:bc:aa:33:b0",
            "net14": "16:9b:af:0a:c6:41",
            "net15": "c2:5d:55:d5:b0:02",
            "net16": "e2:03:dc:ce:ee:cb",
            "net17": "3e:6d:78:7b:35:2e",
            "net18": "c6:9c:67:dc:d1:af",
            "net19": "e6:0d:6e:a8:c6:e7",
            "net2": "ea:4e:38:e7:e3:2a",
            "net20": "26:ba:9e:d8:92:ed",
            "net21": "2e:c3:81:6f:c2:fe",
            "net22": "da:09:cc:b5:03:9c",
            "net23": "4e:94:a8:e7:6b:55",
            "net3": "aa:51:2f:f4:06:d6",
            "net4": "7e:79:61:c4:28:f7",
            "net5": "f2:cd:4c:ae:2a:58",
            "net6": "36:6c:99:29:88:98",
            "net7": "9e:38:88:ea:b2:8c",
            "net8": "ae:5d:5e:4a:0f:54",
            "net9": "ba:70:ee:81:c2:3f"
        },
        "spine_2_1_12": {
            "net0": "6e:9b:7d:a9:69:36",
            "net1": "42:27:a4:3d:ab:ac",
            "net10": "8a:89:2d:b1:3c:c6",
            "net11": "8a:36:2d:d7:9f:dd",
            "net12": "c2:23:c2:e4:18:f4",
            "net13": "9e:da:ee:c9:c6:db",
            "net14": "c2:5b:1f:e9:43:c1",
            "net15": "3e:d2:7c:48:97:aa",
            "net16": "0a:a5:c5:85:db:f6",
            "net17": "ce:bd:46:4a:83:0b",
            "net18": "fe:7b:46:17:34:da",
            "net19": "ae:5d:64:ef:d0:4d",
            "net2": "6a:26:1f:55:5f:78",
            "net20": "7e:3a:df:b6:44:34",
            "net21": "6a:5f:9d:03:ae:5f",
            "net22": "1e:2e:37:2d:54:d8",
            "net23": "ae:9f:84:b4:3f:ae",
            "net3": "c2:f6:26:77:7c:44",
            "net4": "92:b4:8a:ad:b7:c2",
            "net5": "22:33:72:c2:d2:9f",
            "net6": "7a:b6:e1:59:65:38",
            "net7": "92:05:84:17:79:9c",
            "net8": "4a:ad:9f:7b:09:d3",
            "net9": "12:5f:65:7d:42:90"
        },
        "spine_2_1_2": {
            "net0": "3e:3e:3c:ca:49:f5",
            "net1": "da:6e:d3:d7:24:74",
            "net10": "f6:60:a4:18:0f:ce",
            "net11": "e6:6e:a6:b3:2f:45",
            "net12": "62:d9:f3:3c:9f:b8",
            "net13": "92:54:83:9f:94:2e",
            "net14": "72:b9:dd:d4:32:19",
            "net15": "f2:b0:a4:08:a3:a6",
            "net16": "96:4b:fb:2c:5a:06",
            "net17": "a6:a5:59:2f:60:93",
            "net18": "aa:6c:fe:40:60:cd",
            "net19": "b6:ed:8d:f9:4a:e6",
            "net2": "56:ee:98:58:b6:be",
            "net20": "ba:db:b4:2b:e1:54",
            "net21": "76:23:eb:55:35:ef",
            "net22": "f6:85:d5:71:dc:81",
            "net23": "d2:59:6b:bb:99:8e",
            "net3": "8a:1d:89:43:44:92",
            "net4": "e6:34:e0:ff:1a:a9",
            "net5": "5a:62:06:92:d4:b6",
            "net6": "b6:93:78:6b:9a:50",
            "net7": "d2:89:41:84:06:b1",
            "net8": "12:3e:a7:17:7b:47",
            "net9": "ee:dc:4b:e8:d0:52"
        },
        "spine_2_1_3": {
            "net0": "22:d6:d0:18:87:d1",
            "net1": "72:18:e9:0d:e0:65",
            "net10": "5a:0d:75:7f:d2:97",
            "net11": "be:a2:38:d7:89:b5",
            "net12": "16:30:61:d9:70:67",
            "net13": "06:6c:6c:18:d9:d1",
            "net14": "66:98:37:06:3c:d7",
            "net15": "0e:1b:c0:8c:22:0d",
            "net16": "5a:c0:ab:9c:fb:7f",
            "net17": "e6:f4:0a:6f:d0:9d",
            "net18": "f6:71:90:a5:85:ce",
            "net19": "16:53:e0:8d:55:9d",
            "net2": "12:cc:1d:96:ab:31",
            "net20": "d2:b3:e7:43:13:2f",
            "net21": "c2:80:01:f0:2c:5f",
            "net22": "3a:53:18:25:38:14",
            "net23": "02:9d:b8:6f:b7:3d",
            "net3": "36:a5:50:fa:2b:10",
            "net4": "be:2b:5d:cb:c2:91",
            "net5": "26:07:7f:d2:77:a1",
            "net6": "46:aa:cc:85:41:e2",
            "net7": "ee:24:50:9c:8c:1d",
            "net8": "06:e4:e4:f4:4c:5c",
            "net9": "2e:3e:56:1d:fa:17"
        },
        "spine_2_1_4": {
            "net0": "22:6a:69:b8:4e:99",
            "net1": "a6:e0:7d:bd:6b:ff",
            "net10": "36:7a:25:af:8e:5b",
            "net11": "96:fe:1c:96:56:bf",
            "net12": "8a:fd:dc:0b:bf:e9",
            "net13": "b2:0d:91:59:25:4d",
            "net14": "8a:6b:e9:e5:4e:cd",
            "net15": "e6:80:2f:5c:95:ef",
            "net16": "56:80:b3:1a:99:e5",
            "net17": "be:c6:d6:74:41:53",
            "net18": "56:5a:14:a3:be:d3",
            "net19": "06:b0:cd:1b:5d:57",
            "net2": "fa:fc:64:86:f5:87",
            "net20": "a6:61:87:b2:92:1e",
            "net21": "66:54:9d:69:fb:77",
            "net22": "22:ef:9d:73:35:7c",
            "net23": "ce:9f:0f:7a:6f:ae",
            "net3": "d6:72:3b:2a:7b:79",
            "net4": "ea:90:58:9e:f5:85",
            "net5": "7e:3e:77:fe:8b:5a",
            "net6": "f6:0a:28:b0:fc:71",
            "net7": "2a:2c:5b:2d:d4:c4",
            "net8": "7a:ad:45:26:58:90",
            "net9": "4a:68:ee:fe:cf:b5"
        },
        "spine_2_1_5": {
            "net0": "a2:54:9d:e4:6d:56",
            "net1": "52:af:af:8c:b9:96",
            "net10": "ce:ab:a3:9d:97:71",
            "net11": "3e:fe:dc:ce:de:17",
            "net12": "1a:15:7c:75:d1:34",
            "net13": "e2:20:c1:1f:d1:13",
            "net14": "46:10:67:a7:98:c2",
            "net15": "1e:47:51:7c:d7:17",
            "net16": "ea:c4:34:ea:4d:67",
            "net17": "9e:e7:01:7b:af:bb",
            "net18": "86:53:22:f5:fb:20",
            "net19": "56:37:8f:36:72:b8",
            "net2": "a2:a9:87:dc:3c:70",
            "net20": "e2:59:74:c8:57:37",
            "net21": "9a:d4:41:cf:ca:d9",
            "net22": "32:bc:53:8b:8f:1e",
            "net23": "d6:59:99:f7:03:30",
            "net3": "06:d1:04:76:b2:3d",
            "net4": "0a:b5:1d:cb:c8:e7",
            "net5": "c2:ee:b2:13:07:12",
            "net6": "72:23:da:59:8c:70",
            "net7": "0a:ce:48:23:5e:e0",
            "net8": "ae:d8:a2:93:12:25",
            "net9": "26:83:c8:17:e4:91"
        },
        "spine_2_1_6": {
            "net0": "26:2d:a3:85:7e:47",
            "net1": "b2:90:b8:fa:87:5d",
            "net10": "e2:a8:aa:72:47:59",
            "net11": "5e:62:fe:1f:c8:b9",
            "net12": "66:34:05:ab:73:9a",
            "net13": "de:3d:bb:3e:9d:7d",
            "net14": "e6:a0:19:0f:f5:1d",
            "net15": "02:67:4e:88:b3:73",
            "net16": "d2:0d:ee:59:aa:3c",
            "net17": "06:b0:82:80:b5:4c",
            "net18": "22:99:ee:d1:05:32",
            "net19": "d6:f0:ad:9e:a6:1d",
            "net2": "ee:21:9b:80:4f:cf",
            "net20": "3e:7b:11:c2:14:49",
            "net21": "06:37:3d:0d:c2:fc",
            "net22": "f2:9c:7f:d9:a9:bf",
            "net23": "ba:52:76:dd:70:70",
            "net3": "5a:93:32:c6:ed:8f",
            "net4": "96:31:30:9f:aa:59",
            "net5": "36:1a:e7:bf:32:53",
            "net6": "2e:59:5f:21:29:f6",
            "net7": "16:90:4c:18:b2:d0",
            "net8": "da:7a:92:2b:c7:88",
            "net9": "e2:d8:e2:ea:86:20"
        },
        "spine_2_1_7": {
            "net0": "3a:32:7d:5b:f7:d9",
            "net1": "4e:a4:7b:50:2b:ea",
            "net10": "0e:4a:c8:bb:4c:12",
            "net11": "22:c9:c1:13:66:7c",
            "net12": "ba:e0:f8:c6:0a:e8",
            "net13": "5e:b9:e7:38:d5:f0",
            "net14": "8a:d9:9f:97:a0:b0",
            "net15": "de:c2:25:f1:d1:2f",
            "net16": "c6:3e:33:b6:89:09",
            "net17": "7a:d5:50:c5:9e:ae",
            "net18": "5a:bb:c3:b3:fb:22",
            "net19": "26:bd:e6:33:1c:70",
            "net2": "12:a4:c2:27:b4:23",
            "net20": "7e:d8:60:a5:46:76",
            "net21": "76:3e:f0:9c:18:dd",
            "net22": "ee:fd:65:78:42:07",
            "net23": "e2:ec:4c:49:d5:7a",
            "net3": "46:af:a9:ad:f4:d1",
            "net4": "0e:9e:37:44:08:cd",
            "net5": "92:99:6a:2a:3c:e8",
            "net6": "3a:39:ec:cf:74:74",
            "net7": "ee:5e:95:94:89:a8",
            "net8": "b6:61:e5:e5:72:6f",
            "net9": "aa:3d:72:16:50:57"
        },
        "spine_2_1_8": {
            "net0": "2e:62:df:f2:42:ec",
            "net1": "b6:85:97:77:1e:dd",
            "net10": "ce:fa:82:46:7b:2c",
            "net11": "ba:5b:7d:6b:be:36",
            "net12": "ea:ff:70:40:65:38",
            "net13": "f2:b8:27:a1:c7:78",
            "net14": "b6:2c:32:3f:f2:6b",
            "net15": "4a:54:94:1f:c2:31",
            "net16": "7a:bf:8c:7e:a6:fe",
            "net17": "82:44:48:da:08:87",
            "net18": "a2:f6:c2:4b:90:68",
            "net19": "2e:3e:eb:26:a7:01",
            "net2": "36:1b:5c:db:b9:a2",
            "net20": "66:a0:d0:30:4d:5a",
            "net21": "c6:26:47:1b:9f:18",
            "net22": "f2:e7:98:3b:7b:f7",
            "net23": "86:26:96:90:61:7c",
            "net3": "6a:aa:85:29:fd:ad",
            "net4": "ae:b0:f0:f2:ff:7e",
            "net5": "a2:46:6b:ba:70:ad",
            "net6": "b6:74:09:43:15:f8",
            "net7": "4e:18:7c:ff:32:75",
            "net8": "ae:d7:d4:56:97:dc",
            "net9": "b2:23:e2:c0:34:a0"
        },
        "spine_2_1_9": {
            "net0": "2a:fc:e7:5b:df:6f",
            "net1": "0e:43:0a:22:86:79",
            "net10": "c6:17:3e:b7:90:28",
            "net11": "36:5a:e6:70:ff:5b",
            "net12": "8a:14:97:2f:4b:46",
            "net13": "9a:ca:4d:10:cb:29",
            "net14": "2e:52:01:ba:65:e3",
            "net15": "76:c8:27:99:34:c6",
            "net16": "92:91:9e:61:8c:84",
            "net17": "56:7f:09:8c:83:d4",
            "net18": "a2:fc:ca:07:38:01",
            "net19": "62:7e:38:4b:f9:b8",
            "net2": "da:f8:1d:be:6a:c1",
            "net20": "be:fd:05:cb:f3:15",
            "net21": "86:2b:ff:e4:ce:89",
            "net22": "9a:0a:23:79:2a:9f",
            "net23": "66:18:d2:a3:44:f9",
            "net3": "a6:81:41:79:56:30",
            "net4": "36:9a:c6:c5:2b:b7",
            "net5": "5a:72:ed:b2:a4:58",
            "net6": "66:14:b8:a8:2d:93",
            "net7": "76:f6:36:82:70:94",
            "net8": "1e:60:17:2b:f9:16",
            "net9": "32:53:52:ab:cb:43"
        },
        "tof_1_2_1": {
            "net0": "e2:e5:5a:ac:1b:23",
            "net1": "a2:14:05:b3:3c:0f",
            "net10": "e2:2e:62:fa:bc:fa",
            "net11": "7a:dd:01:1c:c7:81",
            "net12": "7a:d3:cb:e2:fa:ba",
            "net13": "7a:a5:7f:5e:cb:3f",
            "net14": "22:c8:d2:97:a8:56",
            "net15": "8e:17:76:fe:34:9a",
            "net16": "a2:fb:f6:08:37:93",
            "net17": "c2:21:cb:1d:6b:20",
            "net18": "a6:ed:a5:4f:bb:5a",
            "net19": "46:01:13:14:45:af",
            "net2": "82:d8:ec:df:a1:ae",
            "net20": "3e:5a:18:f2:fc:ba",
            "net21": "76:9e:f0:ca:3b:da",
            "net22": "ae:86:85:24:c6:3a",
            "net23": "e2:03:23:9c:b6:19",
            "net3": "56:42:65:fc:49:1f",
            "net4": "16:32:34:03:67:20",
            "net5": "a2:ee:a8:91:53:ad",
            "net6": "2a:d8:05:7f:87:fe",
            "net7": "6a:27:80:d9:dc:c8",
            "net8": "fa:3a:e9:f0:c8:8c",
            "net9": "ee:ab:37:78:90:1c"
        },
        "tof_1_2_10": {
            "net0": "0a:be:15:7c:b5:45",
            "net1": "4a:1d:af:d0:8f:56",
            "net10": "5e:1c:1d:75:8b:4e",
            "net11": "22:a2:91:00:35:11",
            "net12": "32:fe:49:03:6e:8c",
            "net13": "9a:dd:9d:1f:9c:83",
            "net14": "da:52:72:a3:9d:87",
            "net15": "7a:1b:1f:76:04:b4",
            "net16": "46:9d:6c:be:f2:bd",
            "net17": "7a:34:4d:a0:07:2e",
            "net18": "26:f7:a8:40:37:d3",
            "net19": "b6:68:3e:7e:a2:8c",
            "net2": "be:0b:c8:4a:56:6a",
            "net20": "2a:96:0d:66:e2:74",
            "net21": "f2:56:08:65:9c:5c",
            "net22": "5a:83:ce:f0:ba:9b",
            "net23": "5e:c9:77:44:94:27",
            "net3": "ce:5d:04:3a:f9:22",
            "net4": "5e:30:73:38:d6:cb",
            "net5": "2e:f9:20:e1:90:ce",
            "net6": "6e:3b:99:b7:d4:ab",
            "net7": "de:bb:41:e3:72:62",
            "net8": "de:e9:6e:1a:68:c0",
            "net9": "1a:82:94:49:2d:56"
        },
        "tof_1_2_11": {
            "net0": "fe:85:d3:83:6e:66",
            "net1": "12:e5:00:b1:7b:56",
            "net10": "36:25:a6:f5:d6:1b",
            "net11": "fa:10:c5:77:f8:96",
            "net12": "0a:de:f2:59:8e:38",
            "net13": "86:3c:d0:57:c7:0c",
            "net14": "e2:80:24:8a:8a:b0",
            "net15": "fe:bd:ff:64:d1:39",
            "net16": "1e:cb:21:d8:1c:de",
            "net17": "62:e8:24:97:30:cf",
            "net18": "fe:bf:6e:3d:42:67",
            "net19": "22:0a:93:1d:5f:6a",
            "net2": "aa:53:43:51:12:a3",
            "net20": "62:95:ed:19:de:76",
            "net21": "92:49:0f:e7:8a:13",
            "net22": "02:39:42:bf:7e:b8",
            "net23": "aa:a0:a3:aa:4e:4f",
            "net3": "da:9b:f4:99:66:9c",
            "net4": "12:f8:45:40:97:ec",
            "net5": "06:48:63:6b:6c:44",
            "net6": "66:03:bf:71:43:ad",
            "net7": "6a:e8:fe:d3:4f:82",
            "net8": "d2:d3:27:ab:d4:a8",
            "net9": "26:f9:5a:fa:7f:ea"
        },
        "tof_1_2_12": {
            "net0": "a6:6d:f9:85:4d:30",
            "net1": "9e:2d:69:a1:c6:7d",
            "net10": "9a:a0:4f:c5:8d:03",
            "net11": "aa:aa:d9:6b:f1:35",
            "net12": "76:0d:ad:b2:ce:88",
            "net13": "5a:fe:01:33:78:d9",
            "net14": "1a:4b:2d:11:2d:2c",
            "net15": "de:c8:41:ce:e1:d2",
            "net16": "06:70:ea:9c:f0:7a",
            "net17": "0e:53:07:30:0e:6e",
            "net18": "5a:0f:45:15:8c:42",
            "net19": "c2:49:38:10:72:3b",
            "net2": "7a:73:ee:ce:e1:85",
            "net20": "fa:82:3c:88:e6:06",
            "net21": "c6:bb:3c:94:4a:d9",
            "net22": "fa:64:ac:77:b3:dc",
            "net23": "62:3c:cb:00:d7:8d",
            "net3": "86:dd:7e:12:7b:81",
            "net4": "a2:5b:b5:f2:cd:67",
            "net5": "7e:4e:e2:44:67:57",
            "net6": "86:21:17:8e:78:ba",
            "net7": "ae:8e:36:3b:3d:f1",
            "net8": "5a:26:0c:53:9e:02",
            "net9": "0a:d0:bc:66:5b:9e"
        },
        "tof_1_2_2": {
            "net0": "e6:3f:d4:ea:79:3b",
            "net1": "3a:17:52:88:08:6d",
            "net10": "3e:84:70:16:90:1e",
            "net11": "66:8d:e6:68:9f:a4",
            "net12": "12:d2:05:4e:86:e8",
            "net13": "4a:57:f9:f6:41:c6",
            "net14": "8e:f1:da:6e:19:35",
            "net15": "e6:ec:90:59:0b:9f",
            "net16": "96:12:b3:de:40:5a",
            "net17": "66:ee:70:0b:1f:54",
            "net18": "da:6c:dd:82:4a:ef",
            "net19": "52:e6:f3:43:6c:af",
            "net2": "4a:c3:c2:86:6d:10",
            "net20": "9a:e1:0c:04:17:90",
            "net21": "46:45:c4:40:b7:f3",
            "net22": "ba:cc:ed:2e:e8:fb",
            "net23": "be:93:f7:31:d6:d2",
            "net3": "a2:c4:45:71:bd:e7",
            "net4": "ce:12:0b:05:9f:4e",
            "net5": "06:39:73:f3:af:dc",
            "net6": "fa:c4:83:9d:ee:c8",
            "net7": "3e:13:c1:54:67:88",
            "net8": "02:c3:ff:eb:ff:b2",
            "net9": "d2:50:a9:ea:cb:cf"
        },
        "tof_1_2_3": {
            "net0": "7e:3d:24:a0:2c:0c",
            "net1": "3a:b6:f1:f3:b2:7b",
            "net10": "0e:63:e3:03:35:1d",
            "net11": "4e:14:7b:4a:bd:53",
            "net12": "ce:33:2c:06:af:3b",
            "net13": "06:47:7e:e2:05:9a",
            "net14": "b2:6e:ab:74:ff:e5",
            "net15": "ee:7d:2b:d3:5e:fc",
            "net16": "f2:4a:d7:d0:b1:33",
            "net17": "e2:c8:ff:d6:2d:eb",
            "net18": "c2:c8:88:7a:b1:54",
            "net19": "fe:7f:22:74:9d:ee",
            "net2": "6e:7e:de:a3:6a:bd",
            "net20": "56:d3:36:b7:96:73",
            "net21": "4a:b0:44:7d:dd:74",
            "net22": "0e:43:98:87:2f:e4",
            "net23": "8e:0f:b2:9c:86:91",
            "net3": "9a:4c:f0:fb:6c:b6",
            "net4": "22:d2:4d:3b:30:d4",
            "net5": "82:ef:4f:8b:e9:a7",
            "net6": "d6:2e:61:92:24:91",
            "net7": "8a:59:52:95:86:d9",
            "net8": "1e:3f:cb:c9:e3:dc",
            "net9": "92:be:5b:ed:09:05"
        },
        "tof_1_2_4": {
            "net0": "0e:ff:bc:81:91:ae",
            "net1": "2e:11:a5:c9:c4:a8",
            "net10": "de:00:3e:e7:8a:35",
            "net11": "26:59:0c:a2:a6:95",
            "net12": "8a:b1:d4:7e:2c:96",
            "net13": "72:e0:6a:21:0c:ad",
            "net14": "7a:5f:fb:a1:cf:bd",
            "net15": "32:e4:f1:62:3e:89",
            "net16": "02:12:12:8e:d1:20",
            "net17": "ce:33:92:48:4d:5f",
            "net18": "de:41:49:f7:61:70",
            "net19": "ca:7b:80:88:9c:da",
            "net2": "3a:e3:bd:b1:06:bd",
            "net20": "0e:2d:de:5f:72:37",
            "net21": "3e:7c:96:d1:26:7f",
            "net22": "72:a0:77:0d:ba:06",
            "net23": "8a:5d:13:b9:b6:a6",
            "net3": "52:f9:5f:b0:d4:31",
            "net4": "3a:99:79:8a:97:a1",
            "net5": "76:56:cb:c9:25:9a",
            "net6": "4a:cd:64:fa:e5:c7",
            "net7": "62:b4:66:41:39:23",
            "net8": "26:84:0c:7f:f3:28",
            "net9": "26:37:ef:13:f0:c7"
        },
        "tof_1_2_5": {
            "net0": "0e:48:b5:d6:98:27",
            "net1": "4a:19:e6:4f:f8:85",
            "net10": "52:6d:31:5c:35:fb",
            "net11": "a6:88:4f:0b:7e:b1",
            "net12": "2e:1e:2d:ee:8f:83",
            "net13": "32:f8:d1:63:f3:24",
            "net14": "46:04:01:a1:9c:68",
            "net15": "1e:b4:29:ae:cf:e3",
            "net16": "3a:33:46:28:ae:d5",
            "net17": "52:00:74:28:ae:c0",
            "net18": "2e:0d:15:52:8f:12",
            "net19": "16:45:6c:e2:66:09",
            "net2": "be:3a:a1:9f:a5:93",
            "net20": "3a:a1:2b:e7:07:ab",
            "net21": "06:d9:a5:ca:f0:c5",
            "net22": "26:0e:25:5b:d8:2a",
            "net23": "06:21:4b:ab:38:38",
            "net3": "ae:67:7d:d1:0b:11",
            "net4": "5a:35:be:91:32:c6",
            "net5": "de:c0:7e:b6:d3:1d",
            "net6": "76:2f:73:e2:c2:23",
            "net7": "a6:93:3e:33:a6:46",
            "net8": "a6:f7:31:a8:72:24",
            "net9": "ea:de:df:48:e0:19"
        },
        "tof_1_2_6": {
            "net0": "5e:d3:fb:61:b0:7e",
            "net1": "e2:3d:1a:84:8f:aa",
            "net10": "da:ea:58:e3:7c:7d",
            "net11": "36:7f:1e:c8:ae:4c",
            "net12": "ea:df:03:ad:cc:d8",
            "net13": "3a:33:d4:39:40:a5",
            "net14": "3a:99:17:4b:49:6d",
            "net15": "06:73:a2:a5:98:8b",
            "net16": "d2:fb:ec:a3:eb:3e",
            "net17": "6a:90:2f:fa:fb:9d",
            "net18": "fa:64:85:54:d3:70",
            "net19": "ba:88:80:04:c2:34",
            "net2": "06:ba:dd:3c:3d:72",
            "net20": "ea:67:32:b5:13:f0",
            "net21": "1a:ea:a1:f4:33:3e",
            "net22": "a6:42:40:47:dd:81",
            "net23": "9a:f6:30:5d:a4:fa",
            "net3": "36:01:62:2e:31:a5",
            "net4": "4e:33:af:cb:b5:0a",
            "net5": "ba:45:49:46:b2:76",
            "net6": "7a:87:ea:1e:17:42",
            "net7": "96:81:a4:c9:75:e1",
            "net8": "42:90:48:f2:48:4d",
            "net9": "16:e4:20:13:c9:c1"
        },
        "tof_1_2_7": {
            "net0": "5e:5d:63:23:6b:ca",
            "net1": "2e:e4:cc:73:72:ed",
            "net10": "d2:4f:07:87:68:1a",
            "net11": "ee:3b:86:a9:a7:64",
            "net12": "3e:3b:3e:20:a8:6f",
            "net13": "72:2d:7b:a6:67:fa",
            "net14": "62:7a:92:cf:71:4f",
            "net15": "ca:a5:06:13:fc:1b",
            "net16": "42:97:d4:aa:b4:d2",
            "net17": "56:19:fb:25:eb:67",
            "net18": "3a:b8:ad:fe:e2:ab",
            "net19": "3a:09:a3:fa:6d:a4",
            "net2": "e6:5d:ba:fc:9b:03",
            "net20": "92:94:cd:de:ac:a8",
            "net21": "96:20:d5:d5:f0:e5",
            "net22": "2e:36:f1:c6:bb:82",
            "net23": "f2:bc:9c:c4:9e:fa",
            "net3": "2a:c0:f4:1e:7b:c7",
            "net4": "22:37:a3:3d:d2:45",
            "net5": "ca:93:30:72:a4:04",
            "net6": "ce:4e:8d:99:9c:67",
            "net7": "3a:63:c2:c3:16:d6",
            "net8": "a2:6c:0a:90:80:10",
            "net9": "ae:79:83:61:26:6f"
        },
        "tof_1_2_8": {
            "net0": "ba:8f:27:c1:53:95",
            "net1": "a6:26:06:b3:25:28",
            "net10": "82:81:22:9f:56:47",
            "net11": "de:bb:a3:0e:ae:93",
            "net12": "16:e3:60:15:e3:49",
            "net13": "ba:46:ad:e9:ea:0c",
            "net14": "ba:c9:b4:20:6f:68",
            "net15": "16:13:dc:80:aa:c5",
            "net16": "56:a8:6a:8d:61:7c",
            "net17": "fa:57:fb:c6:e5:b3",
            "net18": "22:7a:c0:24:1c:5b",
            "net19": "2a:d8:79:34:ee:e1",
            "net2": "2a:c5:15:ba:3a:44",
            "net20": "6a:5f:39:e6:7f:51",
            "net21": "fe:37:45:0a:f5:85",
            "net22": "fe:87:6c:2f:df:bf",
            "net23": "3e:b8:c5:53:0f:00",
            "net3": "22:ab:1b:8f:1d:66",
            "net4": "7a:2c:fd:43:f1:67",
            "net5": "32:07:f7:51:25:42",
            "net6": "a6:0e:82:93:b1:05",
            "net7": "06:33:d4:74:04:7a",
            "net8": "f6:5b:3a:5e:20:e6",
            "net9": "fe:12:71:6c:80:fe"
        },
        "tof_1_2_9": {
            "net0": "52:93:7a:bb:91:74",
            "net1": "26:21:a6:fc:97:8f",
            "net10": "72:a0:e7:31:16:73",
            "net11": "ca:a4:74:ad:14:fd",
            "net12": "0a:55:ef:e7:82:54",
            "net13": "e2:8c:76:81:eb:e9",
            "net14": "56:9c:97:87:7f:f5",
            "net15": "8e:4d:77:e6:40:b3",
            "net16": "3a:9f:39:b4:09:4d",
            "net17": "7e:df:05:25:fe:9f",
            "net18": "d2:a1:2b:ff:aa:8e",
            "net19": "a2:5a:f8:4a:dc:5d",
            "net2": "b6:77:70:37:f1:b2",
            "net20": "12:d4:49:3f:57:57",
            "net21": "0a:15:5f:1f:78:37",
            "net22": "6e:05:e6:3d:20:d0",
            "net23": "6a:0a:98:12:7d:c4",
            "net3": "0a:2f:5f:88:bf:3a",
            "net4": "82:3e:a4:74:73:88",
            "net5": "1a:3b:f8:d6:7b:08",
            "net6": "7a:67:6e:b9:28:7f",
            "net7": "32:67:31:9f:52:99",
            "net8": "56:ab:22:4e:24:b4",
            "net9": "a2:14:f9:6d:05:15"
        }
    },
    "failed_machine": "leaf_1_0_1",
    "failure_time": {
        "leaf_1_0_1": 1635197126.679422,
        "leaf_1_0_10": 1635197127.1237988,
        "leaf_1_0_11": 1635197126.7135549,
        "leaf_1_0_12": 1635197126.7298157,
        "leaf_1_0_2": 1635197126.7548618,
        "leaf_1_0_3": 1635197126.776404,
        "leaf_1_0_4": 1635197126.7919106,
        "leaf_1_0_5": 1635197127.2296638,
        "leaf_1_0_6": 1635197126.6818745,
        "leaf_1_0_7": 1635197126.7109072,
        "leaf_1_0_8": 1635197126.725338,
        "leaf_1_0_9": 1635197126.7548342,
        "leaf_2_0_1": 1635197126.7756457,
        "leaf_2_0_10": 1635197126.7888103,
        "leaf_2_0_11": 1635197126.7996023,
        "leaf_2_0_12": 1635197126.8198955,
        "leaf_2_0_2": 1635197126.8284638,
        "leaf_2_0_3": 1635197126.8456428,
        "leaf_2_0_4": 1635197126.8770385,
        "leaf_2_0_5": 1635197126.8938627,
        "leaf_2_0_6": 1635197126.899697,
        "leaf_2_0_7": 1635197126.908286,
        "leaf_2_0_8": 1635197126.9340181,
        "leaf_2_0_9": 1635197126.9580646,
        "spine_1_1_1": 1635197127.252326,
        "spine_1_1_10": 1635197126.8513312,
        "spine_1_1_11": 1635197126.8761709,
        "spine_1_1_12": 1635197127.321526,
        "spine_1_1_2": 1635197126.9097195,
        "spine_1_1_3": 1635197126.9248817,
        "spine_1_1_4": 1635197126.9359982,
        "spine_1_1_5": 1635197126.9524438,
        "spine_1_1_6": 1635197127.3782547,
        "spine_1_1_7": 1635197126.970552,
        "spine_1_1_8": 1635197126.9878688,
        "spine_1_1_9": 1635197127.4111903,
        "spine_2_1_1": 1635197126.9980345,
        "spine_2_1_10": 1635197127.0281394,
        "spine_2_1_11": 1635197127.0512285,
        "spine_2_1_12": 1635197127.070636,
        "spine_2_1_2": 1635197126.9723701,
        "spine_2_1_3": 1635197126.9780872,
        "spine_2_1_4": 1635197126.9872735,
        "spine_2_1_5": 1635197126.9970803,
        "spine_2_1_6": 1635197127.012847,
        "spine_2_1_7": 1635197127.0256493,
        "spine_2_1_8": 1635197127.0390098,
        "spine_2_1_9": 1635197127.0511007,
        "tof_1_2_1": 1635197127.0758789,
        "tof_1_2_10": 1635197127.0842702,
        "tof_1_2_11": 1635197127.0920227,
        "tof_1_2_12": 1635197127.1216571,
        "tof_1_2_2": 1635197127.135737,
        "tof_1_2_3": 1635197127.1478844,
        "tof_1_2_4": 1635197127.1650136,
        "tof_1_2_5": 1635197127.1706817,
        "tof_1_2_6": 1635197127.0778587,
        "tof_1_2_7": 1635197127.0895948,
        "tof_1_2_8": 1635197127.0948973,
        "tof_1_2_9": 1635197127.1219165
    },
    "recover_time": {
        "leaf_1_0_10": 1635197192.9486487,
        "leaf_1_0_11": 1635197192.5423794,
        "leaf_1_0_12": 1635197192.5579166,
        "leaf_1_0_2": 1635197192.5748577,
        "leaf_1_0_3": 1635197192.5911148,
        "leaf_1_0_4": 1635197192.5980475,
        "leaf_1_0_5": 1635197193.0546377,
        "leaf_1_0_6": 1635197192.6685634,
        "leaf_1_0_7": 1635197192.5386796,
        "leaf_1_0_8": 1635197192.5497918,
        "leaf_1_0_9": 1635197192.5766008,
        "leaf_2_0_1": 1635197192.589322,
        "leaf_2_0_10": 1635197192.5943022,
        "leaf_2_0_11": 1635197192.631786,
        "leaf_2_0_12": 1635197192.66592,
        "leaf_2_0_2": 1635197192.6829996,
        "leaf_2_0_3": 1635197192.6784768,
        "leaf_2_0_4": 1635197192.6929078,
        "leaf_2_0_5": 1635197192.7085853,
        "leaf_2_0_6": 1635197192.7167735,
        "leaf_2_0_7": 1635197192.738875,
        "leaf_2_0_8": 1635197192.7504861,
        "leaf_2_0_9": 1635197192.7729416,
        "spine_1_1_1": 1635197193.2057245,
        "spine_1_1_10": 1635197192.6946084,
        "spine_1_1_11": 1635197192.7073247,
        "spine_1_1_12": 1635197193.1368911,
        "spine_1_1_2": 1635197192.7232559,
        "spine_1_1_3": 1635197192.737848,
        "spine_1_1_4": 1635197192.7522955,
        "spine_1_1_5": 1635197192.7588234,
        "spine_1_1_6": 1635197193.1927934,
        "spine_1_1_7": 1635197192.7843518,
        "spine_1_1_8": 1635197192.8083096,
        "spine_1_1_9": 1635197193.2344017,
        "spine_2_1_1": 1635197192.8294253,
        "spine_2_1_10": 1635197192.853129,
        "spine_2_1_11": 1635197192.863384,
        "spine_2_1_12": 1635197192.9015853,
        "spine_2_1_2": 1635197192.9182835,
        "spine_2_1_3": 1635197192.790452,
        "spine_2_1_4": 1635197192.8099287,
        "spine_2_1_5": 1635197192.829828,
        "spine_2_1_6": 1635197192.871922,
        "spine_2_1_7": 1635197192.915684,
        "spine_2_1_8": 1635197192.9289734,
        "spine_2_1_9": 1635197192.951196,
        "tof_1_2_1": 1635197192.9646068,
        "tof_1_2_10": 1635197192.9289804,
        "tof_1_2_11": 1635197192.9515388,
        "tof_1_2_12": 1635197192.9627485,
        "tof_1_2_2": 1635197192.9767685,
        "tof_1_2_3": 1635197192.990325,
        "tof_1_2_4": 1635197193.0009568,
        "tof_1_2_5": 1635197193.0182457,
        "tof_1_2_6": 1635197193.0339844,
        "tof_1_2_7": 1635197192.9810944,
        "tof_1_2_8": 1635197192.991456,
        "tof_1_2_9": 1635197193.0015543,
        "leaf_1_0_1": 1635197211.0798807
    }
}