{
    "description": "Scenario 3c: ToF tof_1_2_1 failure with BGP",
    "k_leaf": 6,
    "k_top": 6,
    "redundancy_factor": 1,
    "is_k8s": true,
    "machine_mac_addresses": {
        "leaf_10_0_1": {
            "net0": "ce:89:18:fb:40:f1",
            "net1": "d2:e0:88:9e:28:d1",
            "net2": "6a:c5:90:a8:47:c5",
            "net3": "b6:b5:d9:08:85:26",
            "net4": "62:b4:de:7f:b4:62",
            "net5": "a2:1e:1f:70:cf:94",
            "net6": "16:90:50:0a:bc:28"
        },
        "leaf_10_0_2": {
            "net0": "72:d9:a8:63:9a:8a",
            "net1": "16:b9:b4:b2:7d:25",
            "net2": "16:ef:59:c0:3d:70",
            "net3": "c2:97:63:27:9b:de",
            "net4": "e6:04:3f:36:a1:ab",
            "net5": "ca:bf:24:82:25:b9",
            "net6": "96:3f:37:36:2b:75"
        },
        "leaf_10_0_3": {
            "net0": "4a:e3:6f:82:0d:ff",
            "net1": "82:97:61:fc:d6:00",
            "net2": "b2:66:90:92:ec:01",
            "net3": "96:47:21:ff:5e:ee",
            "net4": "c2:5e:d2:96:4e:30",
            "net5": "d2:b5:af:a1:92:a7",
            "net6": "3e:91:90:fb:ec:0a"
        },
        "leaf_10_0_4": {
            "net0": "c2:e6:d5:94:74:f6",
            "net1": "0a:de:12:2e:14:48",
            "net2": "9e:d4:bf:7d:2c:10",
            "net3": "66:32:7a:21:e8:47",
            "net4": "12:d3:ed:21:99:80",
            "net5": "fa:f1:a6:eb:44:5a",
            "net6": "aa:d4:9a:1f:de:f2"
        },
        "leaf_10_0_5": {
            "net0": "ce:c7:f6:5e:c4:96",
            "net1": "ee:be:a7:6b:2e:43",
            "net2": "e2:7b:d3:7a:94:d7",
            "net3": "be:f3:11:bb:1a:24",
            "net4": "62:a7:1d:5f:08:d4",
            "net5": "6a:db:0c:44:e7:cc",
            "net6": "d2:e7:59:02:45:a5"
        },
        "leaf_10_0_6": {
            "net0": "de:8e:d4:f7:8c:df",
            "net1": "4a:fc:d2:51:8b:e9",
            "net2": "36:d4:fa:77:22:84",
            "net3": "fa:9f:af:a8:16:1f",
            "net4": "4a:60:e7:56:c7:a7",
            "net5": "5e:87:23:96:7f:d8",
            "net6": "b6:b5:8d:a8:a1:87"
        },
        "leaf_11_0_1": {
            "net0": "16:08:86:be:2e:91",
            "net1": "9a:74:01:35:19:8d",
            "net2": "72:11:65:08:e2:e8",
            "net3": "9a:e1:77:d9:44:3f",
            "net4": "52:10:6f:fe:af:d4",
            "net5": "82:8a:5d:6c:38:14",
            "net6": "92:4b:21:69:d3:b3"
        },
        "leaf_11_0_2": {
            "net0": "ea:71:71:17:df:22",
            "net1": "ae:e7:24:20:8e:44",
            "net2": "4a:91:79:63:16:fa",
            "net3": "ea:72:ef:83:47:ca",
            "net4": "7e:32:fb:e1:79:aa",
            "net5": "ce:cc:56:ee:4f:fe",
            "net6": "ca:d8:83:72:60:9d"
        },
        "leaf_11_0_3": {
            "net0": "62:e0:95:c5:74:a3",
            "net1": "b6:4e:b5:7c:6a:9b",
            "net2": "96:71:6a:fc:2d:5a",
            "net3": "4e:b8:20:1d:38:2f",
            "net4": "e6:7a:10:f4:87:59",
            "net5": "36:88:31:c3:e7:22",
            "net6": "7a:d6:49:86:8b:57"
        },
        "leaf_11_0_4": {
            "net0": "ca:9c:b1:83:00:8e",
            "net1": "06:c7:ea:71:b7:45",
            "net2": "ea:35:59:fc:6d:38",
            "net3": "92:94:e5:f7:09:8e",
            "net4": "5a:00:fb:f9:cc:37",
            "net5": "7a:0c:67:02:a0:75",
            "net6": "de:dc:47:21:db:14"
        },
        "leaf_11_0_5": {
            "net0": "9a:b5:9c:5a:84:db",
            "net1": "7e:d9:36:23:d4:b5",
            "net2": "c6:89:37:6d:77:b5",
            "net3": "b2:eb:2d:5b:dc:e0",
            "net4": "7e:00:4d:9a:cc:1f",
            "net5": "ba:6c:e6:7c:d0:6c",
            "net6": "16:ae:30:50:f9:a0"
        },
        "leaf_11_0_6": {
            "net0": "96:29:fd:94:9a:5c",
            "net1": "f2:37:53:57:71:1e",
            "net2": "1e:7b:3e:db:9f:c5",
            "net3": "e2:2f:b0:5e:a2:1a",
            "net4": "4e:98:be:3d:85:cc",
            "net5": "26:26:1b:e0:7b:72",
            "net6": "66:76:a4:c6:20:25"
        },
        "leaf_12_0_1": {
            "net0": "46:9f:f3:86:1d:81",
            "net1": "22:46:26:61:a8:5f",
            "net2": "ea:07:f5:47:c6:c7",
            "net3": "1a:ca:3f:08:d4:71",
            "net4": "76:2b:7e:9e:d3:03",
            "net5": "9a:53:7c:d8:49:12",
            "net6": "62:d9:2c:47:3e:2b"
        },
        "leaf_12_0_2": {
            "net0": "46:56:48:a9:36:cb",
            "net1": "ee:50:ee:d0:53:9b",
            "net2": "86:82:45:f4:16:82",
            "net3": "f6:24:a4:07:c2:10",
            "net4": "32:bf:66:10:48:1e",
            "net5": "e2:60:31:21:38:b6",
            "net6": "0e:df:f7:1d:11:a0"
        },
        "leaf_12_0_3": {
            "net0": "36:52:4d:74:83:c4",
            "net1": "ba:51:08:a5:c4:7e",
            "net2": "f2:9f:97:b8:cc:fa",
            "net3": "a2:56:a2:72:5c:84",
            "net4": "5e:79:c1:b4:41:11",
            "net5": "46:b7:74:a0:7e:63",
            "net6": "0e:e8:fa:4b:86:37"
        },
        "leaf_12_0_4": {
            "net0": "f6:b2:1c:43:c5:ef",
            "net1": "b6:79:5f:21:a3:6f",
            "net2": "52:9f:a7:fa:d7:18",
            "net3": "76:2f:9d:00:7a:ed",
            "net4": "22:86:c1:85:a6:da",
            "net5": "7e:81:bc:87:6e:6a",
            "net6": "1e:ea:d4:57:0c:78"
        },
        "leaf_12_0_5": {
            "net0": "16:d9:bd:68:05:87",
            "net1": "92:46:96:92:96:76",
            "net2": "52:89:a5:9c:09:d0",
            "net3": "9a:6a:f1:77:25:1d",
            "net4": "de:d5:36:02:b5:0d",
            "net5": "66:47:bc:55:86:0f",
            "net6": "12:f1:00:84:a8:0c"
        },
        "leaf_12_0_6": {
            "net0": "12:c3:f1:79:36:d9",
            "net1": "8e:2c:cb:45:58:63",
            "net2": "32:07:9f:d6:8a:2a",
            "net3": "a6:87:42:90:65:c2",
            "net4": "4e:5e:02:b9:67:54",
            "net5": "b2:98:29:7f:0c:b0",
            "net6": "aa:27:8b:c5:51:7b"
        },
        "leaf_1_0_1": {
            "net0": "a2:bf:43:cd:53:03",
            "net1": "d2:a3:80:94:a2:b3",
            "net2": "02:2d:1b:10:6f:97",
            "net3": "6e:7f:19:75:b7:40",
            "net4": "aa:27:0f:80:e3:32",
            "net5": "e6:7f:a7:5d:be:21",
            "net6": "8a:5d:cc:ef:6b:86"
        },
        "leaf_1_0_2": {
            "net0": "46:1f:fb:51:ef:18",
            "net1": "92:77:94:c5:1f:3b",
            "net2": "ca:93:c3:8e:43:f8",
            "net3": "a2:68:02:8c:1e:d9",
            "net4": "7a:4b:16:94:5c:b6",
            "net5": "be:fc:25:02:73:6e",
            "net6": "ee:9e:5d:84:b4:a7"
        },
        "leaf_1_0_3": {
            "net0": "16:49:34:e6:24:a2",
            "net1": "e2:3a:eb:cd:6b:5b",
            "net2": "2a:5b:15:df:02:ee",
            "net3": "ae:b3:96:7d:16:7b",
            "net4": "4a:e9:46:71:06:20",
            "net5": "96:98:3d:ad:20:ca",
            "net6": "c2:7d:02:24:76:98"
        },
        "leaf_1_0_4": {
            "net0": "42:31:f0:9b:a6:58",
            "net1": "7e:1b:a4:2f:f2:3d",
            "net2": "62:14:c7:b7:b8:bb",
            "net3": "66:e9:35:a3:80:ba",
            "net4": "22:4e:a2:04:d3:c9",
            "net5": "72:98:4f:7a:dc:de",
            "net6": "da:d4:48:18:b0:ce"
        },
        "leaf_1_0_5": {
            "net0": "8e:41:9a:8e:11:0c",
            "net1": "6a:c2:54:da:b6:f0",
            "net2": "c2:25:bf:8c:cd:b1",
            "net3": "f6:80:ab:25:11:07",
            "net4": "86:49:5f:1f:0d:3f",
            "net5": "c2:fc:8f:32:e2:48",
            "net6": "2e:22:42:b4:fd:58"
        },
        "leaf_1_0_6": {
            "net0": "4e:b2:2c:42:9b:03",
            "net1": "8a:96:27:11:5a:02",
            "net2": "a6:f8:fe:2f:3e:52",
            "net3": "06:3e:9e:2b:be:a1",
            "net4": "ae:64:77:ad:e7:6a",
            "net5": "02:91:df:6a:7e:2f",
            "net6": "b2:c7:c4:92:26:89"
        },
        "leaf_2_0_1": {
            "net0": "f6:07:81:6a:5d:7a",
            "net1": "1a:8b:14:fb:67:6d",
            "net2": "e2:0e:d8:4a:5a:10",
            "net3": "a2:ca:83:ab:c4:21",
            "net4": "3e:0f:24:6b:a5:dd",
            "net5": "8e:59:f8:7d:3e:6a",
            "net6": "8a:82:66:68:d2:35"
        },
        "leaf_2_0_2": {
            "net0": "ae:c4:d2:d1:b7:fd",
            "net1": "62:22:8a:f6:d8:c4",
            "net2": "ba:5b:22:b0:0e:c2",
            "net3": "da:9c:97:b0:07:11",
            "net4": "d2:4c:51:6d:f6:bd",
            "net5": "a2:fd:45:1c:7d:b6",
            "net6": "aa:04:7c:0a:cf:ab"
        },
        "leaf_2_0_3": {
            "net0": "46:ca:1a:a5:4b:f2",
            "net1": "36:ba:75:a8:62:88",
            "net2": "76:86:f1:0b:87:34",
            "net3": "fa:91:ea:f5:86:84",
            "net4": "5e:62:0b:b4:af:74",
            "net5": "aa:e7:a1:43:1d:2f",
            "net6": "a6:62:ca:66:8a:f9"
        },
        "leaf_2_0_4": {
            "net0": "c6:c2:67:a4:e1:06",
            "net1": "0e:2c:88:35:15:80",
            "net2": "ae:38:12:ff:2f:17",
            "net3": "a2:38:d2:33:3c:93",
            "net4": "9a:3a:7c:68:de:64",
            "net5": "1e:4b:e9:dd:b9:0d",
            "net6": "a6:c9:91:75:27:21"
        },
        "leaf_2_0_5": {
            "net0": "ba:43:59:df:39:44",
            "net1": "ea:d3:cd:31:d8:49",
            "net2": "26:3a:81:35:9d:6e",
            "net3": "c2:78:e0:e5:87:04",
            "net4": "56:db:88:1d:d7:12",
            "net5": "2e:99:1b:e6:2f:a4",
            "net6": "56:90:19:dc:18:f5"
        },
        "leaf_2_0_6": {
            "net0": "ca:79:8c:78:53:ea",
            "net1": "f6:b6:15:8b:8c:9a",
            "net2": "56:19:97:b2:79:e6",
            "net3": "5a:7b:d9:2c:35:9f",
            "net4": "16:e1:47:de:34:9f",
            "net5": "fe:ab:aa:d9:8d:d9",
            "net6": "12:5a:3f:8b:9c:86"
        },
        "leaf_3_0_1": {
            "net0": "f6:4c:c6:fa:5c:fa",
            "net1": "f6:b9:d5:77:c3:6e",
            "net2": "3a:bb:c5:36:6b:b2",
            "net3": "32:30:be:21:59:d5",
            "net4": "8a:e0:98:b6:74:e7",
            "net5": "3e:e7:64:ff:72:01",
            "net6": "06:ee:dc:60:7e:26"
        },
        "leaf_3_0_2": {
            "net0": "1e:38:15:6b:1a:8e",
            "net1": "d6:70:16:38:f2:cc",
            "net2": "be:4a:d7:65:4d:f0",
            "net3": "3e:3a:c4:5b:d0:57",
            "net4": "ae:cf:c6:5a:f9:c2",
            "net5": "42:79:69:01:74:38",
            "net6": "86:c6:0a:52:7d:cb"
        },
        "leaf_3_0_3": {
            "net0": "62:45:45:73:2e:4b",
            "net1": "a6:6a:77:18:50:c1",
            "net2": "ee:0e:fd:8e:c6:e4",
            "net3": "e6:49:8a:e5:fd:3d",
            "net4": "06:67:dc:e0:19:98",
            "net5": "c6:92:a8:d2:74:0b",
            "net6": "2e:36:f1:8a:93:9f"
        },
        "leaf_3_0_4": {
            "net0": "fe:0f:ff:22:e9:98",
            "net1": "9e:e6:29:d3:07:63",
            "net2": "8a:ce:39:f4:48:93",
            "net3": "6a:d5:91:5a:47:50",
            "net4": "a6:ee:1b:20:9a:35",
            "net5": "5e:9a:a2:81:0c:72",
            "net6": "ba:34:c9:fc:1b:b9"
        },
        "leaf_3_0_5": {
            "net0": "02:2d:93:85:e6:bf",
            "net1": "ba:c1:ea:fb:05:06",
            "net2": "66:6e:ed:e1:7f:74",
            "net3": "ae:7b:18:38:d2:bf",
            "net4": "36:06:9e:68:88:b7",
            "net5": "8e:8e:a4:c6:67:7a",
            "net6": "de:a1:77:d5:58:23"
        },
        "leaf_3_0_6": {
            "net0": "0a:37:8e:5f:71:83",
            "net1": "f6:62:a7:a3:f4:ac",
            "net2": "1e:d0:2b:d7:b4:fe",
            "net3": "8e:82:d3:af:6c:31",
            "net4": "c6:2c:88:12:bf:96",
            "net5": "0e:88:19:a1:99:94",
            "net6": "ba:fe:72:2a:18:43"
        },
        "leaf_4_0_1": {
            "net0": "42:a6:2a:c1:c5:31",
            "net1": "4a:a2:85:e6:dd:f2",
            "net2": "4e:db:c7:14:95:cf",
            "net3": "06:b4:d8:16:c9:09",
            "net4": "06:de:fc:c4:e1:07",
            "net5": "7a:51:cf:72:38:20",
            "net6": "ea:3e:ac:1b:ed:07"
        },
        "leaf_4_0_2": {
            "net0": "b6:bc:00:1b:29:64",
            "net1": "4a:b4:b5:b1:99:b4",
            "net2": "22:a7:e3:fa:a3:3a",
            "net3": "06:b9:c6:af:1b:7c",
            "net4": "fe:c2:1d:6f:1c:75",
            "net5": "ba:60:bc:76:28:f3",
            "net6": "46:65:30:99:a7:8e"
        },
        "leaf_4_0_3": {
            "net0": "5a:cf:0f:97:a0:4e",
            "net1": "02:66:1d:3a:cf:55",
            "net2": "b6:bd:ab:f1:1f:15",
            "net3": "32:58:0d:d4:e3:21",
            "net4": "3e:f2:68:21:e8:e4",
            "net5": "5a:e1:6d:91:c3:a8",
            "net6": "0a:57:40:a4:37:c6"
        },
        "leaf_4_0_4": {
            "net0": "da:85:6e:11:8d:44",
            "net1": "ce:3e:e6:cd:e9:2d",
            "net2": "be:54:3b:75:a0:d8",
            "net3": "12:3c:c6:f1:0c:11",
            "net4": "d2:68:3f:3f:1f:da",
            "net5": "c6:15:f9:e9:a1:31",
            "net6": "16:27:61:9b:61:ce"
        },
        "leaf_4_0_5": {
            "net0": "96:78:a5:2c:aa:c8",
            "net1": "ea:5e:b1:af:07:16",
            "net2": "9e:8f:8a:ca:a6:4b",
            "net3": "2e:7d:c4:3f:4a:0f",
            "net4": "4e:b2:8d:fe:67:2a",
            "net5": "5a:44:07:26:53:a1",
            "net6": "ee:19:c1:14:8e:5c"
        },
        "leaf_4_0_6": {
            "net0": "d6:c7:33:f0:5c:67",
            "net1": "ee:10:64:ef:ff:e3",
            "net2": "52:95:6a:30:9f:a7",
            "net3": "ca:41:b3:3c:77:59",
            "net4": "f2:94:86:f9:df:6c",
            "net5": "4a:f4:9d:c0:3b:d5",
            "net6": "86:06:7f:b0:ce:de"
        },
        "leaf_5_0_1": {
            "net0": "1e:05:74:4a:94:22",
            "net1": "d2:e7:04:e6:b9:e6",
            "net2": "22:d1:12:be:c6:67",
            "net3": "36:8e:cc:a3:65:1f",
            "net4": "0a:fc:27:11:5e:95",
            "net5": "16:0f:7d:52:a0:17",
            "net6": "ba:e4:e4:82:75:41"
        },
        "leaf_5_0_2": {
            "net0": "92:76:64:3d:c6:1c",
            "net1": "7e:ec:59:39:1f:02",
            "net2": "a6:c9:53:52:d7:33",
            "net3": "12:1f:c1:c4:a5:c7",
            "net4": "12:31:71:9e:65:7e",
            "net5": "da:a0:b0:78:7e:9f",
            "net6": "2e:c1:b7:52:bd:15"
        },
        "leaf_5_0_3": {
            "net0": "d2:a0:65:bc:9a:ea",
            "net1": "02:ca:40:ac:55:68",
            "net2": "6a:29:f2:d8:6c:fd",
            "net3": "66:a9:48:ca:bb:aa",
            "net4": "f6:81:16:2f:6f:9e",
            "net5": "ee:13:6c:73:81:17",
            "net6": "2a:ea:54:b5:af:15"
        },
        "leaf_5_0_4": {
            "net0": "a6:aa:19:d8:eb:25",
            "net1": "b6:99:90:27:cf:f6",
            "net2": "76:1d:2d:65:28:99",
            "net3": "b6:b7:24:0a:00:da",
            "net4": "52:8b:54:e5:75:da",
            "net5": "12:fa:3a:b6:55:62",
            "net6": "1a:fa:97:74:05:25"
        },
        "leaf_5_0_5": {
            "net0": "f2:76:dd:4e:56:d8",
            "net1": "1a:75:9e:14:05:aa",
            "net2": "5a:76:0a:8a:66:2b",
            "net3": "2a:02:ba:49:27:98",
            "net4": "ee:7a:eb:06:9c:fa",
            "net5": "f6:be:03:ea:0c:6f",
            "net6": "e6:5d:5e:f4:52:4a"
        },
        "leaf_5_0_6": {
            "net0": "36:79:d1:7f:5b:bf",
            "net1": "f6:3e:b5:01:ac:28",
            "net2": "7a:e7:95:1b:cc:68",
            "net3": "6a:1c:9e:55:42:01",
            "net4": "4e:dc:e3:0c:ae:26",
            "net5": "7a:ef:94:1b:9c:9a",
            "net6": "fa:c0:8c:40:86:fd"
        },
        "leaf_6_0_1": {
            "net0": "b2:07:03:dd:2e:56",
            "net1": "be:6e:30:eb:e1:da",
            "net2": "3e:af:c8:e9:1b:f9",
            "net3": "8a:37:1b:02:f7:23",
            "net4": "96:29:e9:9d:af:b2",
            "net5": "4a:46:c8:98:ec:a9",
            "net6": "32:88:2d:de:dc:1c"
        },
        "leaf_6_0_2": {
            "net0": "4a:da:5f:f5:ba:71",
            "net1": "8e:69:a6:5a:98:72",
            "net2": "5e:cd:c3:55:72:48",
            "net3": "92:6f:3e:80:22:13",
            "net4": "fa:e9:fb:bb:e1:8e",
            "net5": "b6:97:7a:96:d9:08",
            "net6": "0e:fe:02:29:9c:e1"
        },
        "leaf_6_0_3": {
            "net0": "2a:11:71:54:03:bf",
            "net1": "9e:00:61:b2:13:21",
            "net2": "9e:85:fa:e2:fd:7b",
            "net3": "e6:a0:df:dd:f7:de",
            "net4": "d2:04:27:3e:48:5c",
            "net5": "66:df:f1:c6:95:d7",
            "net6": "b6:93:1a:4a:4d:b2"
        },
        "leaf_6_0_4": {
            "net0": "ce:a3:4b:49:4e:bb",
            "net1": "da:9d:8c:d9:4b:c3",
            "net2": "42:1c:ce:0c:7e:3e",
            "net3": "b6:9f:f1:35:62:5d",
            "net4": "82:77:1e:ad:df:47",
            "net5": "0e:8d:e3:ee:70:b2",
            "net6": "ea:51:d8:ed:89:e0"
        },
        "leaf_6_0_5": {
            "net0": "9a:fc:3f:1a:ed:61",
            "net1": "c2:30:fd:b4:72:a1",
            "net2": "06:e6:3a:78:7c:e3",
            "net3": "2a:93:43:f9:48:97",
            "net4": "ba:65:3a:b2:63:14",
            "net5": "f2:c9:58:97:82:bf",
            "net6": "c2:79:f0:5a:33:13"
        },
        "leaf_6_0_6": {
            "net0": "ce:11:d2:b1:5a:86",
            "net1": "1a:f9:12:e4:ea:d1",
            "net2": "0e:07:ed:6e:c3:b5",
            "net3": "de:7a:25:5d:ef:b8",
            "net4": "56:75:35:1e:c6:65",
            "net5": "5e:03:35:ce:2a:6e",
            "net6": "d6:9b:49:b2:64:1b"
        },
        "leaf_7_0_1": {
            "net0": "0a:67:55:ca:78:0f",
            "net1": "5e:cf:e1:88:f2:6b",
            "net2": "de:79:d5:7f:79:b9",
            "net3": "ea:a1:5d:39:69:ca",
            "net4": "ee:3f:29:ed:3b:32",
            "net5": "92:b3:0f:32:98:7a",
            "net6": "aa:d0:ab:35:49:f0"
        },
        "leaf_7_0_2": {
            "net0": "9a:2e:7c:96:c7:23",
            "net1": "f2:e1:1b:ce:df:e9",
            "net2": "12:6f:da:4f:58:db",
            "net3": "2e:5c:7d:6b:43:8c",
            "net4": "42:1e:20:33:17:fe",
            "net5": "be:4c:f3:5a:4b:1c",
            "net6": "46:a3:ba:c2:94:e8"
        },
        "leaf_7_0_3": {
            "net0": "0e:29:0a:31:9c:d2",
            "net1": "ae:c3:83:e8:e1:25",
            "net2": "e2:75:67:a6:e4:35",
            "net3": "d6:ab:4b:d0:86:83",
            "net4": "5a:11:bf:27:5d:a7",
            "net5": "36:90:3c:db:52:2a",
            "net6": "c6:a2:fb:0d:06:dc"
        },
        "leaf_7_0_4": {
            "net0": "6e:6a:86:71:eb:7f",
            "net1": "0a:2d:88:9f:e9:75",
            "net2": "32:82:d6:79:e1:e8",
            "net3": "32:d4:54:c0:14:c0",
            "net4": "f2:0e:fd:2d:e0:86",
            "net5": "3a:39:93:b1:01:c7",
            "net6": "f6:16:f4:6d:14:b4"
        },
        "leaf_7_0_5": {
            "net0": "be:38:c8:59:90:da",
            "net1": "82:eb:d0:57:c0:82",
            "net2": "de:63:5d:ab:90:89",
            "net3": "de:70:17:20:12:d4",
            "net4": "fe:d7:a5:db:19:86",
            "net5": "e6:ac:05:15:e3:51",
            "net6": "8e:56:ad:06:b1:92"
        },
        "leaf_7_0_6": {
            "net0": "46:61:13:e8:ad:37",
            "net1": "2a:62:84:55:5f:b4",
            "net2": "2e:15:4e:06:08:4f",
            "net3": "ee:51:27:98:89:b8",
            "net4": "92:fb:47:92:7d:8e",
            "net5": "4e:43:77:d9:d9:57",
            "net6": "ca:ff:af:4a:9f:83"
        },
        "leaf_8_0_1": {
            "net0": "de:41:5e:b9:14:26",
            "net1": "22:04:96:ec:13:7f",
            "net2": "ea:ec:9f:43:f6:e9",
            "net3": "9e:62:9e:e7:1c:5f",
            "net4": "4a:a7:da:3d:b0:9a",
            "net5": "1a:e7:6b:78:ad:83",
            "net6": "46:54:19:e8:f7:c2"
        },
        "leaf_8_0_2": {
            "net0": "7e:e1:3d:1f:ce:2e",
            "net1": "6a:df:01:7f:71:c5",
            "net2": "de:cc:db:44:2f:56",
            "net3": "c2:46:9b:9a:e9:23",
            "net4": "5a:67:08:a1:85:27",
            "net5": "32:8e:87:7d:b6:09",
            "net6": "82:c6:a7:48:9d:25"
        },
        "leaf_8_0_3": {
            "net0": "fe:3c:7c:f9:db:de",
            "net1": "5e:76:68:98:78:a7",
            "net2": "fa:ec:57:11:46:2f",
            "net3": "8a:6c:9a:67:18:87",
            "net4": "e2:73:cf:f5:58:20",
            "net5": "7e:0b:d4:af:d5:58",
            "net6": "b6:20:af:6b:ce:a4"
        },
        "leaf_8_0_4": {
            "net0": "66:c0:e2:9c:03:52",
            "net1": "ee:b4:4f:0a:5e:d4",
            "net2": "e6:ca:37:48:23:4b",
            "net3": "36:d0:04:01:31:b6",
            "net4": "66:12:b4:f8:e0:05",
            "net5": "d6:c8:ca:05:4b:f8",
            "net6": "72:2a:7c:75:fa:b5"
        },
        "leaf_8_0_5": {
            "net0": "1e:3b:a8:03:da:9a",
            "net1": "c6:78:22:dc:4b:d8",
            "net2": "42:55:e8:9d:40:8f",
            "net3": "3a:6c:07:46:b6:c9",
            "net4": "5e:ce:9b:76:88:76",
            "net5": "a2:32:11:2a:db:1d",
            "net6": "52:69:b1:2a:4a:b1"
        },
        "leaf_8_0_6": {
            "net0": "be:49:ea:b1:16:92",
            "net1": "36:5f:f5:fe:44:1a",
            "net2": "6e:af:6e:3f:a1:25",
            "net3": "6e:be:4e:95:3e:25",
            "net4": "02:65:8f:57:f0:87",
            "net5": "ae:1a:27:2a:e5:40",
            "net6": "6a:92:29:0e:bf:de"
        },
        "leaf_9_0_1": {
            "net0": "ca:54:13:41:31:f2",
            "net1": "d2:05:e0:79:72:b0",
            "net2": "a6:f7:ff:e6:68:9f",
            "net3": "fe:56:e1:42:0a:e0",
            "net4": "be:20:d3:69:12:4f",
            "net5": "ba:b8:57:51:ab:99",
            "net6": "aa:b4:b9:f7:a7:09"
        },
        "leaf_9_0_2": {
            "net0": "82:98:89:b0:17:c7",
            "net1": "66:0b:0d:68:13:31",
            "net2": "66:fa:fe:05:d6:39",
            "net3": "56:30:af:1e:e1:af",
            "net4": "2e:ce:1f:b5:7f:94",
            "net5": "62:dd:98:cd:4d:fd",
            "net6": "a6:e0:60:27:d7:f4"
        },
        "leaf_9_0_3": {
            "net0": "b2:0b:c3:8f:69:39",
            "net1": "ee:6e:41:44:3e:97",
            "net2": "9e:25:1c:05:89:93",
            "net3": "32:18:e2:44:86:da",
            "net4": "be:84:a7:0a:7c:b5",
            "net5": "0e:71:9e:96:a0:7f",
            "net6": "da:5f:09:36:02:df"
        },
        "leaf_9_0_4": {
            "net0": "92:0f:2a:7b:4d:88",
            "net1": "82:f1:48:4b:4b:cd",
            "net2": "c2:21:27:4d:8f:27",
            "net3": "da:1b:41:f5:db:8d",
            "net4": "7e:f9:29:77:3d:1d",
            "net5": "e6:1c:d2:6a:61:4c",
            "net6": "2e:f6:4a:63:a1:ad"
        },
        "leaf_9_0_5": {
            "net0": "2e:91:a7:d5:a0:4c",
            "net1": "da:e1:86:74:e7:ff",
            "net2": "aa:74:09:8b:24:93",
            "net3": "f2:04:41:13:32:cd",
            "net4": "6a:65:e1:45:6f:c2",
            "net5": "9a:b2:92:b7:f4:6c",
            "net6": "72:4a:4c:87:a7:f3"
        },
        "leaf_9_0_6": {
            "net0": "f6:06:8d:19:a4:25",
            "net1": "72:89:4d:24:24:66",
            "net2": "8a:b8:ad:a8:7a:d8",
            "net3": "e2:33:c8:a0:51:90",
            "net4": "36:e7:e3:36:c5:b4",
            "net5": "52:54:56:b8:33:83",
            "net6": "7e:35:40:31:a6:59"
        },
        "spine_10_1_1": {
            "net0": "7a:fc:d7:c4:e9:fd",
            "net1": "22:5a:97:92:fa:b3",
            "net10": "02:17:89:ad:a9:92",
            "net11": "96:e9:81:71:59:df",
            "net2": "1e:b2:0f:80:8e:aa",
            "net3": "be:1e:78:80:c5:02",
            "net4": "4e:42:5e:ef:63:91",
            "net5": "7a:6d:fb:2b:e5:c9",
            "net6": "be:d0:92:4a:eb:13",
            "net7": "ba:42:6c:2c:56:4d",
            "net8": "f6:b2:69:2b:8b:7f",
            "net9": "3e:8a:f3:ae:76:e7"
        },
        "spine_10_1_2": {
            "net0": "f6:2b:bd:e1:f7:ab",
            "net1": "2a:24:72:41:c5:1a",
            "net10": "b6:d8:76:71:a7:d9",
            "net11": "1a:6d:fb:52:3f:76",
            "net2": "1e:76:24:c0:d3:d4",
            "net3": "f2:87:88:cf:00:d7",
            "net4": "e6:b3:a5:76:61:64",
            "net5": "42:96:1d:79:f4:96",
            "net6": "ee:a3:5d:dc:af:5a",
            "net7": "0a:2d:3d:9f:46:fd",
            "net8": "b2:bf:09:04:6f:33",
            "net9": "5a:17:c4:fa:29:1e"
        },
        "spine_10_1_3": {
            "net0": "4a:bc:f4:87:06:76",
            "net1": "4e:54:8c:bb:6f:4b",
            "net10": "62:ba:9b:78:1f:7f",
            "net11": "32:3f:39:f1:36:80",
            "net2": "fe:ad:bd:f5:50:ec",
            "net3": "5e:f2:7e:f9:b2:46",
            "net4": "f2:28:ce:d3:4b:72",
            "net5": "66:97:85:b9:23:ca",
            "net6": "02:fc:c8:ae:7b:a6",
            "net7": "b2:71:af:d0:04:92",
            "net8": "46:60:1a:1c:3a:57",
            "net9": "d2:38:81:60:b1:8e"
        },
        "spine_10_1_4": {
            "net0": "be:8e:ab:9a:1b:43",
            "net1": "82:93:b3:5e:40:bd",
            "net10": "92:19:39:a6:3a:6f",
            "net11": "fe:9f:0c:19:90:bb",
            "net2": "92:a2:8b:36:1e:d1",
            "net3": "0a:79:33:e5:dd:37",
            "net4": "ea:b2:5a:f0:67:db",
            "net5": "82:10:94:d3:51:48",
            "net6": "c2:28:60:ae:ee:ef",
            "net7": "46:9f:5b:a9:01:4d",
            "net8": "5e:d7:92:a4:f0:a7",
            "net9": "2e:82:3e:eb:d5:4f"
        },
        "spine_10_1_5": {
            "net0": "3a:8e:1c:7e:81:c3",
            "net1": "1e:42:ad:26:91:b4",
            "net10": "06:7e:91:5c:ec:c0",
            "net11": "42:e4:fc:57:1d:00",
            "net2": "52:58:71:4a:82:7a",
            "net3": "92:b6:f3:29:e8:82",
            "net4": "52:98:c0:69:07:52",
            "net5": "3a:2e:15:8f:f3:2b",
            "net6": "f2:80:2c:fa:93:c8",
            "net7": "76:02:38:22:1d:42",
            "net8": "1e:a3:89:6d:95:de",
            "net9": "de:3a:d8:a0:a6:ac"
        },
        "spine_10_1_6": {
            "net0": "26:e7:ac:7a:e1:3e",
            "net1": "ea:d2:95:1f:ee:ab",
            "net10": "42:b5:65:98:53:39",
            "net11": "7a:7a:0c:0b:20:1b",
            "net2": "52:5f:ed:8f:01:8c",
            "net3": "de:df:de:3c:7b:15",
            "net4": "76:f2:41:a1:bf:32",
            "net5": "12:cd:67:9b:08:e0",
            "net6": "82:cd:01:c4:80:7c",
            "net7": "06:37:e8:3c:3e:7d",
            "net8": "26:d0:73:2a:43:8f",
            "net9": "da:6e:71:2b:12:fb"
        },
        "spine_11_1_1": {
            "net0": "5a:66:4a:f4:37:fb",
            "net1": "a2:b0:f1:bd:9e:2a",
            "net10": "5a:d1:55:03:9e:5d",
            "net11": "76:e2:05:3e:fa:fe",
            "net2": "22:f4:c1:28:92:ef",
            "net3": "b6:3c:5a:d2:8b:95",
            "net4": "ba:dd:40:5f:79:48",
            "net5": "e6:2f:c2:65:39:e2",
            "net6": "4a:25:d4:59:96:a7",
            "net7": "16:d4:cb:41:33:89",
            "net8": "a6:c7:ed:f7:17:71",
            "net9": "7e:5e:4e:c5:30:cb"
        },
        "spine_11_1_2": {
            "net0": "c6:2a:bb:cc:df:aa",
            "net1": "b2:50:31:6b:90:a3",
            "net10": "0a:46:13:ec:06:40",
            "net11": "92:ff:fc:a5:1b:69",
            "net2": "26:fd:71:a0:f6:30",
            "net3": "d6:2a:dd:ac:ea:95",
            "net4": "26:44:99:4a:fd:0d",
            "net5": "26:02:74:91:a5:ed",
            "net6": "a2:94:71:0a:bb:86",
            "net7": "ae:d8:88:75:1c:24",
            "net8": "02:e5:b7:b4:df:48",
            "net9": "6a:c9:af:fa:29:e6"
        },
        "spine_11_1_3": {
            "net0": "e2:fb:8e:dc:81:d4",
            "net1": "52:d7:b7:4b:02:5b",
            "net10": "86:5f:a3:f0:9d:02",
            "net11": "be:0e:dc:d2:f5:af",
            "net2": "86:93:8b:72:da:46",
            "net3": "56:95:10:73:4f:cd",
            "net4": "ae:44:85:b0:40:56",
            "net5": "26:b4:67:d8:7a:24",
            "net6": "c6:28:09:ba:18:c3",
            "net7": "da:cc:6e:75:06:75",
            "net8": "52:38:1d:2f:02:59",
            "net9": "ca:18:68:ea:e1:2a"
        },
        "spine_11_1_4": {
            "net0": "9e:30:53:06:60:1f",
            "net1": "56:28:55:ce:92:cb",
            "net10": "8e:3e:5f:4b:da:5e",
            "net11": "92:e8:a8:4a:40:53",
            "net2": "06:ed:bd:11:a2:17",
            "net3": "da:78:29:5b:78:2e",
            "net4": "9a:b8:6f:5c:7a:68",
            "net5": "56:97:e2:99:1e:18",
            "net6": "d2:8d:9e:a7:67:db",
            "net7": "42:25:7b:3a:a9:2d",
            "net8": "ee:84:72:6f:81:43",
            "net9": "1a:9b:93:27:28:1f"
        },
        "spine_11_1_5": {
            "net0": "82:30:a0:5c:60:57",
            "net1": "f2:3d:fb:70:79:cb",
            "net10": "ea:d1:3c:f9:86:bb",
            "net11": "76:af:7b:de:13:dc",
            "net2": "0a:39:74:2b:e8:c2",
            "net3": "0a:20:e6:fd:82:01",
            "net4": "66:55:e7:9f:da:bd",
            "net5": "4e:8f:12:59:65:50",
            "net6": "7a:fe:fd:f9:94:44",
            "net7": "16:e4:c4:26:6a:fd",
            "net8": "9e:f1:73:6e:91:28",
            "net9": "12:35:6e:18:a7:ba"
        },
        "spine_11_1_6": {
            "net0": "2e:60:37:16:32:e7",
            "net1": "92:e6:88:c8:c9:d1",
            "net10": "fa:87:d0:a2:d8:da",
            "net11": "02:3d:35:f8:23:81",
            "net2": "6a:56:5c:06:a9:d9",
            "net3": "a6:ee:18:b9:06:52",
            "net4": "ea:8c:11:56:04:e3",
            "net5": "82:e3:f5:54:d5:e7",
            "net6": "76:5d:f4:7b:45:f7",
            "net7": "82:b7:f5:2e:a2:b3",
            "net8": "7a:73:e8:ad:3b:91",
            "net9": "26:a9:dc:39:26:c0"
        },
        "spine_12_1_1": {
            "net0": "d6:2e:8e:23:7f:8a",
            "net1": "d6:5d:88:1b:18:63",
            "net10": "ae:08:88:00:8d:9a",
            "net11": "1e:ef:01:b7:7a:31",
            "net2": "86:b8:26:b2:dc:28",
            "net3": "ae:15:86:bf:86:ac",
            "net4": "36:dd:b0:e7:f3:08",
            "net5": "32:94:f7:4b:03:62",
            "net6": "a2:0d:f4:25:91:b7",
            "net7": "ea:6b:e9:9a:de:71",
            "net8": "26:ec:4d:64:ad:09",
            "net9": "ba:df:ef:4d:c2:82"
        },
        "spine_12_1_2": {
            "net0": "5e:dd:0d:b5:1e:39",
            "net1": "e2:e2:c8:95:b6:0f",
            "net10": "2a:c7:2b:f6:30:45",
            "net11": "fa:8b:89:82:c2:57",
            "net2": "32:60:78:ca:f8:8d",
            "net3": "26:77:98:38:7a:49",
            "net4": "2a:6a:3f:8e:cb:d3",
            "net5": "5a:a5:4c:cd:89:f5",
            "net6": "4a:76:5e:e2:5e:d4",
            "net7": "ce:44:5f:bc:b3:94",
            "net8": "b6:c5:bc:a2:2d:b4",
            "net9": "32:02:37:a9:56:1b"
        },
        "spine_12_1_3": {
            "net0": "4e:03:74:31:96:e9",
            "net1": "66:49:f3:f1:40:19",
            "net10": "ba:a8:a1:6e:2a:5b",
            "net11": "1a:53:95:ca:c2:97",
            "net2": "e2:01:c5:98:9b:54",
            "net3": "76:1b:e3:f0:ee:65",
            "net4": "b2:9e:54:ad:4b:23",
            "net5": "0a:e7:35:2d:76:3c",
            "net6": "c2:a4:41:1c:b6:a5",
            "net7": "9a:a5:1b:4c:fe:9b",
            "net8": "22:00:0d:75:19:64",
            "net9": "1a:bf:6b:53:87:25"
        },
        "spine_12_1_4": {
            "net0": "76:0c:47:ce:3d:ba",
            "net1": "7e:5b:33:e9:d9:8b",
            "net10": "02:8d:98:0b:97:34",
            "net11": "4e:17:9c:d2:2c:b9",
            "net2": "36:7d:8a:0f:7f:12",
            "net3": "5a:4c:ef:d5:31:ea",
            "net4": "96:29:b4:7c:72:23",
            "net5": "56:f3:f8:0b:be:ac",
            "net6": "f2:34:3c:c2:09:9c",
            "net7": "4a:ca:64:dd:7b:fd",
            "net8": "56:52:14:dc:92:39",
            "net9": "3e:b4:0f:14:a1:88"
        },
        "spine_12_1_5": {
            "net0": "86:28:48:fb:0c:73",
            "net1": "86:85:b5:1a:09:a8",
            "net10": "6e:08:37:3c:d4:95",
            "net11": "52:c8:0a:d1:e1:7d",
            "net2": "1e:0e:a5:55:0e:be",
            "net3": "a6:c9:e5:f7:20:b7",
            "net4": "6a:62:31:34:70:1f",
            "net5": "b6:d7:a4:1f:88:5f",
            "net6": "0e:bd:a0:33:93:35",
            "net7": "b2:e7:78:2f:4a:38",
            "net8": "aa:4b:3d:ab:54:ef",
            "net9": "5e:3a:8b:a4:2e:5b"
        },
        "spine_12_1_6": {
            "net0": "76:6e:84:e8:73:fc",
            "net1": "22:3e:b8:bd:74:94",
            "net10": "06:cc:04:a9:18:fc",
            "net11": "9a:32:38:72:02:1e",
            "net2": "96:2b:2d:cb:0d:80",
            "net3": "76:f9:56:ce:68:1c",
            "net4": "66:2b:b2:6c:1a:f2",
            "net5": "9e:d2:c6:55:16:b5",
            "net6": "96:55:50:d6:4d:da",
            "net7": "6a:83:32:8a:36:18",
            "net8": "d6:60:ef:a9:0b:a3",
            "net9": "2e:ad:d9:ca:7d:92"
        },
        "spine_1_1_1": {
            "net0": "62:40:39:cf:81:19",
            "net1": "e6:ef:cf:99:8f:2a",
            "net10": "aa:0e:07:d9:3b:1b",
            "net11": "e2:b4:c0:a2:e0:70",
            "net2": "56:0a:2a:e8:5d:92",
            "net3": "32:a8:9a:b0:0d:99",
            "net4": "9a:92:b7:11:17:1f",
            "net5": "ee:3b:b0:d1:c0:6b",
            "net6": "22:07:40:35:2a:ba",
            "net7": "62:38:91:44:3d:e3",
            "net8": "c6:b2:38:57:98:b7",
            "net9": "42:e3:e6:b7:54:72"
        },
        "spine_1_1_2": {
            "net0": "66:82:54:65:48:5c",
            "net1": "22:86:5e:32:87:d2",
            "net10": "4e:b7:d2:ac:25:e2",
            "net11": "56:41:3a:ff:ae:2e",
            "net2": "16:02:7d:1f:b3:3a",
            "net3": "d2:fc:b0:38:af:12",
            "net4": "42:fb:9c:83:5d:6a",
            "net5": "a2:8c:63:b0:4a:4c",
            "net6": "ee:32:b0:f2:e8:96",
            "net7": "ae:ca:b6:7c:56:60",
            "net8": "b6:b2:20:f6:c7:a9",
            "net9": "ea:da:9c:82:73:c4"
        },
        "spine_1_1_3": {
            "net0": "76:e8:19:01:1e:7c",
            "net1": "5e:da:81:db:e5:d3",
            "net10": "8a:56:5e:f0:aa:a3",
            "net11": "8a:94:d7:c5:e3:4f",
            "net2": "96:dd:f9:0a:39:67",
            "net3": "da:71:1e:2d:1c:5e",
            "net4": "56:80:d1:0b:f9:11",
            "net5": "d2:f8:aa:b1:76:67",
            "net6": "32:54:c3:bc:f1:ae",
            "net7": "22:f5:fd:1b:f4:a4",
            "net8": "ba:ff:a8:92:15:9b",
            "net9": "56:93:6b:77:42:f0"
        },
        "spine_1_1_4": {
            "net0": "5e:7b:ab:37:a9:1c",
            "net1": "c6:e7:cf:2e:04:19",
            "net10": "aa:21:fe:d2:55:47",
            "net11": "c6:65:a2:36:1e:f9",
            "net2": "52:bf:6e:3c:49:d4",
            "net3": "f6:6e:eb:07:49:f8",
            "net4": "1a:59:51:e6:f0:9b",
            "net5": "d2:38:35:fe:56:f7",
            "net6": "5e:8a:be:28:1f:b9",
            "net7": "2a:95:cd:b4:66:e1",
            "net8": "6a:be:af:6d:61:4c",
            "net9": "8a:c4:ed:c4:a8:a8"
        },
        "spine_1_1_5": {
            "net0": "b6:02:0f:8c:59:1d",
            "net1": "1a:d5:0f:ec:9e:33",
            "net10": "a2:d8:57:56:6c:3b",
            "net11": "1e:14:a6:86:c2:5c",
            "net2": "92:cc:59:19:28:57",
            "net3": "22:3f:de:d8:b0:ea",
            "net4": "e6:27:31:50:bf:b4",
            "net5": "de:2a:d6:2d:cc:ee",
            "net6": "92:c7:0b:7e:c2:93",
            "net7": "1a:64:cc:67:97:8c",
            "net8": "12:ac:ab:d3:61:30",
            "net9": "1a:ee:b9:7e:34:57"
        },
        "spine_1_1_6": {
            "net0": "ca:c7:28:46:43:91",
            "net1": "7e:54:ff:bd:9d:a6",
            "net10": "62:62:c5:d4:8b:46",
            "net11": "72:de:aa:58:98:d1",
            "net2": "7a:9e:28:22:33:f7",
            "net3": "ae:24:b7:97:42:86",
            "net4": "52:76:85:ce:8c:bc",
            "net5": "12:c2:ec:dd:8a:35",
            "net6": "ae:95:ee:ec:d0:e6",
            "net7": "f6:b7:5f:4e:4a:85",
            "net8": "56:87:c4:f0:06:6c",
            "net9": "22:11:b7:57:71:3f"
        },
        "spine_2_1_1": {
            "net0": "a2:c0:a5:00:db:84",
            "net1": "5a:fb:50:4a:aa:08",
            "net10": "b6:22:8a:92:28:6f",
            "net11": "32:c5:89:4b:98:24",
            "net2": "62:7c:41:e2:5f:9a",
            "net3": "ce:e1:bc:99:ef:e3",
            "net4": "6a:7f:8a:b7:b9:5e",
            "net5": "96:0e:c1:6a:9c:28",
            "net6": "fe:3d:a1:3d:ba:72",
            "net7": "ca:2c:a3:04:d2:ad",
            "net8": "96:fb:36:42:82:66",
            "net9": "1a:e2:27:a5:22:a7"
        },
        "spine_2_1_2": {
            "net0": "2e:81:a1:56:fe:5c",
            "net1": "72:0e:25:ec:8c:eb",
            "net10": "a6:e6:17:3e:fe:67",
            "net11": "9e:0f:58:ba:09:c2",
            "net2": "ba:dd:ef:0c:6c:48",
            "net3": "96:63:cb:18:38:67",
            "net4": "ca:14:7e:26:c3:a5",
            "net5": "be:f3:8d:a8:62:d1",
            "net6": "8a:9b:97:57:6a:91",
            "net7": "92:0f:10:61:72:91",
            "net8": "e2:c9:55:85:4d:5d",
            "net9": "6a:67:ef:58:b9:b1"
        },
        "spine_2_1_3": {
            "net0": "96:69:da:c5:dd:88",
            "net1": "3e:c2:2c:00:71:d8",
            "net10": "2e:3c:a8:89:f4:a9",
            "net11": "aa:5f:d5:c0:8d:a7",
            "net2": "2a:bb:76:65:19:48",
            "net3": "7a:32:16:2d:84:1f",
            "net4": "02:c5:94:28:99:d3",
            "net5": "d2:64:ed:45:82:d5",
            "net6": "aa:ac:3e:23:e5:52",
            "net7": "de:dd:a0:4a:e1:a7",
            "net8": "c6:0a:66:8e:1a:03",
            "net9": "8a:dc:9d:6a:b3:8e"
        },
        "spine_2_1_4": {
            "net0": "c2:3e:22:88:d2:02",
            "net1": "62:b1:b9:8d:fd:ee",
            "net10": "ce:05:05:29:8f:4e",
            "net11": "be:7e:9d:84:a4:18",
            "net2": "8e:37:10:6b:3c:49",
            "net3": "9a:53:0f:d3:17:95",
            "net4": "96:cb:d6:e6:01:3b",
            "net5": "8e:29:c3:a6:c0:28",
            "net6": "32:1b:4f:4f:53:d9",
            "net7": "e6:f7:df:63:3f:ec",
            "net8": "0a:33:ea:48:63:bf",
            "net9": "f6:dc:70:51:1a:aa"
        },
        "spine_2_1_5": {
            "net0": "ce:f1:94:9d:6a:82",
            "net1": "be:10:2a:10:ec:61",
            "net10": "26:88:7a:0f:c6:b7",
            "net11": "1a:19:e1:6a:c7:65",
            "net2": "12:97:18:c3:16:24",
            "net3": "1e:7a:53:4d:ff:b7",
            "net4": "a2:16:8f:84:34:59",
            "net5": "9e:d6:f6:47:60:42",
            "net6": "46:36:1c:5e:50:e9",
            "net7": "2a:ff:08:44:ac:d4",
            "net8": "82:a3:6f:03:2c:e1",
            "net9": "ea:91:6a:86:57:5e"
        },
        "spine_2_1_6": {
            "net0": "e2:30:cb:3e:e4:74",
            "net1": "de:a2:0d:c1:cb:be",
            "net10": "5a:07:a0:94:bc:1f",
            "net11": "6e:72:55:e5:76:ac",
            "net2": "ee:46:32:94:34:a3",
            "net3": "6a:26:d4:df:e1:30",
            "net4": "7e:ee:e3:74:38:51",
            "net5": "9e:90:fb:c3:b4:fa",
            "net6": "ca:08:97:05:12:2c",
            "net7": "a6:dd:cf:49:f6:32",
            "net8": "3e:fe:1a:26:f9:93",
            "net9": "ae:06:59:c1:ad:d3"
        },
        "spine_3_1_1": {
            "net0": "7a:24:c8:61:f1:09",
            "net1": "4a:06:d9:c2:d4:4c",
            "net10": "3e:76:d1:ba:e4:13",
            "net11": "5e:ae:e5:75:fd:c9",
            "net2": "42:58:a8:ea:b0:46",
            "net3": "3a:ff:3a:46:64:b2",
            "net4": "02:93:a0:a7:9d:b2",
            "net5": "52:03:e1:6f:cf:c1",
            "net6": "6e:f4:87:9f:1b:26",
            "net7": "62:8b:e9:75:2a:c5",
            "net8": "56:b7:fc:39:bd:78",
            "net9": "6e:4b:e8:c6:26:71"
        },
        "spine_3_1_2": {
            "net0": "92:a4:53:70:75:3e",
            "net1": "4e:e1:1e:6c:3c:9b",
            "net10": "d6:37:3d:af:a2:eb",
            "net11": "e6:95:7c:10:ac:0e",
            "net2": "72:30:00:e8:32:13",
            "net3": "ce:48:d5:2e:7d:44",
            "net4": "9a:67:46:27:5e:8f",
            "net5": "3a:98:73:65:14:4a",
            "net6": "7e:33:70:8b:81:1b",
            "net7": "06:f5:87:ce:98:00",
            "net8": "f2:d0:be:63:b6:56",
            "net9": "86:4e:92:8f:d6:b3"
        },
        "spine_3_1_3": {
            "net0": "3e:9c:71:9e:72:f6",
            "net1": "da:ba:4c:f2:9d:5a",
            "net10": "d2:d8:95:8c:aa:bb",
            "net11": "1a:26:1a:48:63:72",
            "net2": "aa:ae:7b:b9:df:c1",
            "net3": "5e:6f:5c:3f:54:32",
            "net4": "8a:6b:01:63:42:49",
            "net5": "26:82:8b:a9:d1:30",
            "net6": "86:9e:41:3b:ed:06",
            "net7": "b6:cd:84:7d:96:f8",
            "net8": "56:e9:0f:9c:a3:eb",
            "net9": "fe:29:39:c9:3f:af"
        },
        "spine_3_1_4": {
            "net0": "de:39:77:d3:3f:24",
            "net1": "1a:c6:6f:0a:b8:82",
            "net10": "52:e2:09:17:80:33",
            "net11": "f6:8c:39:b8:c7:27",
            "net2": "ea:03:c7:2a:b9:1d",
            "net3": "02:2d:01:49:27:b3",
            "net4": "7e:e8:3b:5f:08:4d",
            "net5": "6e:a6:64:34:3a:1a",
            "net6": "42:fc:c0:5c:72:74",
            "net7": "a6:74:48:82:55:ad",
            "net8": "9a:f2:68:a6:c5:b6",
            "net9": "6e:d3:3e:31:fc:a2"
        },
        "spine_3_1_5": {
            "net0": "12:4e:4c:c0:e6:ab",
            "net1": "ee:30:e2:92:c0:49",
            "net10": "52:c4:6f:34:80:93",
            "net11": "0e:9e:03:5e:20:ff",
            "net2": "3e:94:df:14:fd:86",
            "net3": "4e:6b:f3:9b:1b:a6",
            "net4": "fa:bd:60:2e:0f:80",
            "net5": "ce:35:25:e5:78:66",
            "net6": "42:9a:b3:00:c2:cd",
            "net7": "62:61:9b:fc:ce:90",
            "net8": "be:15:32:39:9f:22",
            "net9": "3a:50:1c:1c:63:01"
        },
        "spine_3_1_6": {
            "net0": "52:6b:f4:0c:37:dc",
            "net1": "3e:c6:46:b7:c8:86",
            "net10": "7e:c9:f7:cc:00:26",
            "net11": "02:dd:5b:4d:ef:08",
            "net2": "a6:37:8c:ef:c7:40",
            "net3": "2a:eb:59:e6:93:4d",
            "net4": "36:5a:03:d2:59:00",
            "net5": "7e:be:9c:48:6e:cf",
            "net6": "fa:0e:8e:cf:54:0c",
            "net7": "42:fa:c3:6e:32:a8",
            "net8": "2e:4a:99:6f:55:0b",
            "net9": "f6:44:25:92:87:58"
        },
        "spine_4_1_1": {
            "net0": "0e:a9:67:e6:fc:10",
            "net1": "7e:f8:3b:f8:ab:83",
            "net10": "da:5e:0a:49:74:8b",
            "net11": "ea:e3:67:d2:37:a9",
            "net2": "be:73:97:76:c6:1b",
            "net3": "b6:2a:bf:20:a2:ce",
            "net4": "de:b3:54:32:26:a4",
            "net5": "7a:f1:29:76:92:a7",
            "net6": "7a:e1:c2:bb:75:d6",
            "net7": "4e:fc:ba:2a:ac:7a",
            "net8": "26:ca:84:a8:91:a7",
            "net9": "96:b9:34:52:13:c1"
        },
        "spine_4_1_2": {
            "net0": "32:9f:75:6f:16:68",
            "net1": "de:f9:f0:38:1e:ab",
            "net10": "72:fc:2b:a1:12:ce",
            "net11": "fa:86:5a:38:5d:2e",
            "net2": "ce:ae:41:68:dd:83",
            "net3": "ba:8b:09:a6:3d:d6",
            "net4": "56:96:fe:0a:e4:d0",
            "net5": "46:57:6a:9f:24:16",
            "net6": "1a:84:51:48:fd:2c",
            "net7": "8a:8d:fc:f6:da:c1",
            "net8": "d2:9f:2d:61:62:72",
            "net9": "f2:24:48:51:d5:e6"
        },
        "spine_4_1_3": {
            "net0": "a6:d7:d6:9f:3d:bf",
            "net1": "92:90:13:64:ab:f3",
            "net10": "1a:5b:2e:ff:8e:07",
            "net11": "22:01:eb:98:aa:53",
            "net2": "ca:ed:12:08:61:91",
            "net3": "8a:17:bc:fc:f5:6e",
            "net4": "9e:a7:70:56:b9:28",
            "net5": "3a:2b:25:c0:fa:1c",
            "net6": "fe:d5:2b:16:33:dc",
            "net7": "c2:e8:90:74:e3:35",
            "net8": "ee:b8:6b:6d:9c:97",
            "net9": "1e:41:a4:8e:89:42"
        },
        "spine_4_1_4": {
            "net0": "ea:27:f4:e0:d8:9d",
            "net1": "ee:2c:96:c1:3b:ff",
            "net10": "02:aa:18:e1:66:c5",
            "net11": "3a:c7:4b:65:17:28",
            "net2": "fa:9f:dd:c0:4b:f3",
            "net3": "06:15:0b:c7:67:df",
            "net4": "56:3e:b7:24:f2:97",
            "net5": "aa:bb:5f:a9:a6:98",
            "net6": "b6:2f:8c:89:2f:1e",
            "net7": "66:0d:62:ff:a9:bb",
            "net8": "de:81:b9:a0:b5:19",
            "net9": "12:38:97:33:fd:9f"
        },
        "spine_4_1_5": {
            "net0": "2e:cc:3a:cd:04:4a",
            "net1": "7e:25:0f:13:33:d9",
            "net10": "96:26:84:78:77:ef",
            "net11": "ce:8d:67:f6:13:4b",
            "net2": "62:3a:83:b4:df:ba",
            "net3": "82:7c:ca:59:ec:35",
            "net4": "82:19:9b:ff:a9:c3",
            "net5": "3a:5c:e9:b5:8f:bb",
            "net6": "96:05:6c:59:7a:53",
            "net7": "3e:36:c0:d3:28:ca",
            "net8": "ee:68:9e:37:d8:42",
            "net9": "aa:7a:f7:dd:a6:6e"
        },
        "spine_4_1_6": {
            "net0": "4e:b8:15:66:b8:f1",
            "net1": "9e:c4:96:4a:be:90",
            "net10": "92:0e:10:3a:c4:a9",
            "net11": "42:0e:46:6c:58:3f",
            "net2": "c6:82:97:d0:b2:39",
            "net3": "4a:6f:d3:1a:91:27",
            "net4": "66:b8:35:0a:3d:84",
            "net5": "42:38:87:5b:25:ae",
            "net6": "42:aa:12:05:6a:96",
            "net7": "96:9c:66:7d:60:c8",
            "net8": "5a:82:95:90:6b:e1",
            "net9": "76:2f:dc:7a:f6:cb"
        },
        "spine_5_1_1": {
            "net0": "5a:4b:0c:f5:51:52",
            "net1": "b2:92:47:26:48:e9",
            "net10": "2e:9b:66:02:96:6a",
            "net11": "ca:0d:bc:98:f9:90",
            "net2": "16:40:5f:9f:52:75",
            "net3": "0a:80:72:ce:a9:12",
            "net4": "f2:9e:43:5a:90:a2",
            "net5": "e6:b0:9e:7c:9b:bb",
            "net6": "62:fd:a6:d6:59:20",
            "net7": "f6:e6:27:50:5c:03",
            "net8": "46:b0:d2:33:3d:68",
            "net9": "02:88:e9:1e:16:84"
        },
        "spine_5_1_2": {
            "net0": "e2:8b:fb:fc:2a:a1",
            "net1": "5a:ca:69:2c:6f:ab",
            "net10": "ea:3f:63:f1:a5:a2",
            "net11": "12:b5:47:c4:a0:d8",
            "net2": "36:de:44:12:91:1d",
            "net3": "02:9a:6f:5f:1f:ff",
            "net4": "52:fd:52:52:80:30",
            "net5": "86:6d:32:6c:bd:c6",
            "net6": "16:61:a3:bc:f7:b6",
            "net7": "a2:6e:15:84:b1:9b",
            "net8": "5e:9f:68:80:1d:79",
            "net9": "22:8f:3f:c4:6e:4b"
        },
        "spine_5_1_3": {
            "net0": "5a:5c:04:5f:97:fd",
            "net1": "4e:2d:c4:7b:cf:4b",
            "net10": "6e:d2:ea:36:e5:79",
            "net11": "02:b8:ea:42:2f:4a",
            "net2": "12:fc:de:bf:45:3a",
            "net3": "32:37:34:ff:a8:a4",
            "net4": "8a:3a:73:7f:17:e3",
            "net5": "3a:6c:3f:ab:fd:44",
            "net6": "96:55:05:05:79:a1",
            "net7": "8a:9a:86:0b:3c:6a",
            "net8": "a2:ce:b5:9b:3e:cb",
            "net9": "a6:06:5a:c1:47:a0"
        },
        "spine_5_1_4": {
            "net0": "e6:a3:14:db:87:95",
            "net1": "d2:1f:b6:aa:ba:46",
            "net10": "4a:a1:f6:d6:6a:67",
            "net11": "fe:30:1c:1f:e4:c7",
            "net2": "be:e6:2a:af:c2:bf",
            "net3": "f6:24:41:6f:d2:02",
            "net4": "c6:92:9e:27:78:48",
            "net5": "7e:18:23:00:0c:02",
            "net6": "3a:c2:22:14:5e:c1",
            "net7": "d2:0f:fb:2c:54:37",
            "net8": "b6:47:0c:c1:97:2c",
            "net9": "8a:16:83:70:f7:91"
        },
        "spine_5_1_5": {
            "net0": "aa:aa:f9:c9:e9:1c",
            "net1": "6a:79:cb:db:5e:f1",
            "net10": "12:e7:e0:e2:0b:cf",
            "net11": "e6:10:90:a5:6d:93",
            "net2": "ba:24:1e:81:bc:97",
            "net3": "aa:cc:7b:17:0d:98",
            "net4": "0e:67:5f:96:e1:49",
            "net5": "de:99:ce:fd:15:c8",
            "net6": "8e:12:49:c5:65:c1",
            "net7": "d6:1d:2a:44:d9:89",
            "net8": "3e:15:a0:51:aa:47",
            "net9": "4a:82:e0:3a:ac:a0"
        },
        "spine_5_1_6": {
            "net0": "22:79:f2:ab:b4:c6",
            "net1": "0e:24:50:8e:4c:de",
            "net10": "82:d4:e5:d8:8f:2c",
            "net11": "1a:fe:8d:1f:4c:2b",
            "net2": "0a:88:b5:43:8f:5b",
            "net3": "e2:fd:b2:99:78:eb",
            "net4": "9e:6d:f6:85:b4:fc",
            "net5": "3e:f0:51:ef:c5:03",
            "net6": "ce:33:08:47:ac:84",
            "net7": "de:bd:cc:db:17:0a",
            "net8": "d6:20:9d:f8:69:dc",
            "net9": "2a:c8:4d:9b:e5:02"
        },
        "spine_6_1_1": {
            "net0": "4a:f8:e5:eb:e2:06",
            "net1": "66:78:67:00:f8:26",
            "net10": "92:31:50:ff:76:f9",
            "net11": "02:68:20:32:5d:de",
            "net2": "aa:ab:4e:bc:04:9f",
            "net3": "a2:11:23:05:13:06",
            "net4": "22:8c:7e:c9:d2:03",
            "net5": "06:9f:a5:68:54:0e",
            "net6": "be:72:c8:e1:a7:f7",
            "net7": "1e:bb:90:11:23:e1",
            "net8": "e2:42:ef:e0:2e:82",
            "net9": "9a:92:9f:a1:75:22"
        },
        "spine_6_1_2": {
            "net0": "46:b0:d6:e1:9f:d0",
            "net1": "ba:d4:c8:aa:75:f8",
            "net10": "fe:08:5f:af:fd:79",
            "net11": "e6:50:4f:9a:92:6a",
            "net2": "2e:e0:0f:d9:b4:44",
            "net3": "3a:7d:b9:57:ad:f5",
            "net4": "12:73:66:79:46:49",
            "net5": "4e:7a:06:c6:a5:14",
            "net6": "46:d6:29:63:9b:e9",
            "net7": "fa:9b:4c:95:b0:4e",
            "net8": "86:c6:57:df:f4:20",
            "net9": "3e:bf:40:57:51:f0"
        },
        "spine_6_1_3": {
            "net0": "12:35:50:7d:c3:8e",
            "net1": "86:fc:7d:3b:38:e9",
            "net10": "ee:39:3e:7a:e7:e3",
            "net11": "12:9b:d1:a5:5b:f7",
            "net2": "4e:39:78:da:36:03",
            "net3": "5a:85:9d:e4:82:55",
            "net4": "aa:54:22:a2:60:a9",
            "net5": "1e:39:0d:51:c5:af",
            "net6": "1a:0b:40:b9:66:44",
            "net7": "e2:ff:4d:51:70:65",
            "net8": "8a:7b:c0:21:fb:bb",
            "net9": "d2:93:7f:a1:47:f0"
        },
        "spine_6_1_4": {
            "net0": "e6:d1:4d:56:f7:ec",
            "net1": "82:59:ed:35:d8:0e",
            "net10": "ca:af:a0:fb:d5:8d",
            "net11": "5e:a4:f0:30:83:af",
            "net2": "ce:b6:49:64:da:d4",
            "net3": "36:31:9b:7a:a8:eb",
            "net4": "42:62:8b:7c:1a:d1",
            "net5": "16:17:8d:3f:e3:f3",
            "net6": "8a:6a:6c:79:93:88",
            "net7": "de:5e:23:24:86:27",
            "net8": "7e:ad:ca:04:6e:db",
            "net9": "56:c6:c4:40:3f:ce"
        },
        "spine_6_1_5": {
            "net0": "86:61:7c:57:32:8c",
            "net1": "b2:df:df:ef:77:8d",
            "net10": "a6:f0:df:86:ec:55",
            "net11": "a2:ad:88:cd:bd:f5",
            "net2": "02:6a:6b:38:e4:d8",
            "net3": "0e:c9:e9:fe:27:9d",
            "net4": "32:2b:4a:ea:2d:39",
            "net5": "ea:9d:93:2b:30:e5",
            "net6": "6e:62:59:5e:75:8b",
            "net7": "7e:13:df:9e:65:6a",
            "net8": "26:4b:9c:f6:62:6f",
            "net9": "96:fa:31:ab:e2:a6"
        },
        "spine_6_1_6": {
            "net0": "1e:54:19:5c:bc:04",
            "net1": "8a:7f:29:9d:81:10",
            "net10": "32:7e:92:11:da:cc",
            "net11": "6a:1d:99:af:7d:4a",
            "net2": "5e:df:49:e4:7a:a4",
            "net3": "36:d7:b6:a7:de:18",
            "net4": "46:29:43:27:5b:74",
            "net5": "4e:3e:6f:d4:76:e3",
            "net6": "12:e6:34:6e:56:5d",
            "net7": "66:eb:b9:9a:fd:37",
            "net8": "4e:da:a2:9b:71:93",
            "net9": "3a:c7:a1:c7:d7:8d"
        },
        "spine_7_1_1": {
            "net0": "a6:96:63:cf:7f:dd",
            "net1": "2e:68:81:c2:e0:21",
            "net10": "9a:d8:d4:2f:c2:86",
            "net11": "1a:2c:d9:db:ab:5a",
            "net2": "5e:0e:1d:99:d1:8c",
            "net3": "d2:5e:20:9a:64:b5",
            "net4": "d6:c3:85:c1:a5:68",
            "net5": "ee:2f:d7:31:8c:a5",
            "net6": "96:6f:8d:21:47:60",
            "net7": "82:99:1c:3d:b3:35",
            "net8": "2e:86:6b:ba:71:94",
            "net9": "be:d6:29:2b:34:68"
        },
        "spine_7_1_2": {
            "net0": "b2:6e:b0:4a:98:68",
            "net1": "de:e3:2b:b0:ee:3a",
            "net10": "26:f2:27:db:6a:ba",
            "net11": "ca:b0:11:8b:8e:7e",
            "net2": "9a:bd:d4:03:12:f9",
            "net3": "c6:f8:04:d6:1b:41",
            "net4": "92:4e:6a:64:70:20",
            "net5": "06:29:38:bf:74:50",
            "net6": "ba:4f:ae:50:e1:26",
            "net7": "9a:ad:0b:34:cf:ba",
            "net8": "62:e3:00:85:e2:3e",
            "net9": "8e:0f:30:17:08:16"
        },
        "spine_7_1_3": {
            "net0": "fe:f9:5e:33:18:b1",
            "net1": "06:88:ae:8f:a4:52",
            "net10": "72:ec:b6:de:cc:cb",
            "net11": "be:1d:e3:40:6d:67",
            "net2": "56:11:df:1c:00:d3",
            "net3": "ae:92:d0:11:b0:80",
            "net4": "7a:e5:58:e5:e9:8b",
            "net5": "fa:98:68:6b:a1:75",
            "net6": "ba:a2:7a:2a:dc:e6",
            "net7": "5a:bb:54:23:87:7b",
            "net8": "aa:50:08:17:69:8c",
            "net9": "46:d9:3a:15:5d:e5"
        },
        "spine_7_1_4": {
            "net0": "3e:0b:0a:c9:e3:c8",
            "net1": "9a:88:31:81:e5:8e",
            "net10": "8e:38:ea:61:8a:8c",
            "net11": "52:2d:a5:48:af:d6",
            "net2": "f6:24:9a:01:a4:60",
            "net3": "6e:22:ca:9e:d0:6b",
            "net4": "82:b6:3b:df:35:14",
            "net5": "16:57:ae:a3:22:4b",
            "net6": "ba:4b:4c:e5:d2:e2",
            "net7": "06:78:b6:9e:19:e6",
            "net8": "4e:ec:1d:ef:39:fb",
            "net9": "96:02:0f:cc:e1:9e"
        },
        "spine_7_1_5": {
            "net0": "8a:04:df:e1:47:75",
            "net1": "7a:36:e1:e8:c8:d0",
            "net10": "5e:52:8a:55:85:1a",
            "net11": "86:7a:de:0f:62:c7",
            "net2": "0a:86:52:27:05:cd",
            "net3": "da:6f:8e:11:f9:b2",
            "net4": "22:d9:53:a2:ed:61",
            "net5": "d6:8f:bb:b1:01:8b",
            "net6": "0e:3c:ea:1e:50:71",
            "net7": "06:c5:7b:54:7b:9e",
            "net8": "ae:f6:81:58:bc:bc",
            "net9": "fa:51:6f:69:12:57"
        },
        "spine_7_1_6": {
            "net0": "3a:fc:6a:b1:bc:f0",
            "net1": "52:bf:87:35:88:d2",
            "net10": "76:32:a0:96:b9:e0",
            "net11": "f2:2d:b2:42:a0:a7",
            "net2": "42:fa:37:92:d9:6c",
            "net3": "72:a0:5a:09:b0:72",
            "net4": "ca:1d:27:b6:37:46",
            "net5": "ea:49:92:3a:da:35",
            "net6": "7e:65:2d:1d:9a:c4",
            "net7": "46:c9:52:50:5a:e5",
            "net8": "16:47:e2:de:c3:6b",
            "net9": "22:b7:1c:e2:56:01"
        },
        "spine_8_1_1": {
            "net0": "b6:d1:20:47:51:78",
            "net1": "4e:e7:b9:75:62:25",
            "net10": "ea:79:ba:9c:d7:cc",
            "net11": "d6:21:a6:b0:32:55",
            "net2": "02:46:ea:f3:42:f4",
            "net3": "fe:e5:4c:51:48:9b",
            "net4": "36:c5:52:53:6e:20",
            "net5": "ce:e4:d4:f6:ec:cf",
            "net6": "a2:cf:f6:6a:d3:80",
            "net7": "8e:c0:b8:10:1c:33",
            "net8": "ae:56:25:66:99:57",
            "net9": "c2:f5:90:70:dc:9f"
        },
        "spine_8_1_2": {
            "net0": "f6:1a:83:c9:bd:30",
            "net1": "da:7f:cd:70:3a:9e",
            "net10": "52:63:b8:cb:db:48",
            "net11": "3a:59:90:8a:ef:b5",
            "net2": "d6:a3:cc:ac:e8:58",
            "net3": "5a:f4:ea:77:6b:bc",
            "net4": "8a:44:d0:32:d9:1d",
            "net5": "0a:e5:cb:dd:93:33",
            "net6": "be:9a:52:54:d3:d1",
            "net7": "ee:97:25:2d:d0:82",
            "net8": "82:cd:69:9c:72:7f",
            "net9": "d6:a4:d4:a7:b6:d9"
        },
        "spine_8_1_3": {
            "net0": "be:9f:f9:db:3d:ce",
            "net1": "d2:fa:51:88:f6:d1",
            "net10": "2e:5f:79:36:42:86",
            "net11": "fa:16:3b:73:40:fb",
            "net2": "62:21:ac:b7:24:9d",
            "net3": "1e:d8:46:f6:ee:88",
            "net4": "1a:92:82:28:15:1b",
            "net5": "fe:53:d8:02:14:d0",
            "net6": "ca:a9:66:b9:d9:10",
            "net7": "ea:d0:b0:95:94:0a",
            "net8": "66:58:83:71:5f:f6",
            "net9": "6a:4d:85:8b:f2:11"
        },
        "spine_8_1_4": {
            "net0": "c6:30:93:a2:a9:71",
            "net1": "52:6c:96:27:f8:5d",
            "net10": "3e:15:f2:5d:7c:fa",
            "net11": "c6:2a:83:99:4a:f0",
            "net2": "7a:ec:03:e9:12:3d",
            "net3": "b2:f0:f6:22:49:7d",
            "net4": "e6:40:68:e5:8f:26",
            "net5": "5e:13:ed:80:5b:6f",
            "net6": "0a:ea:b6:f2:41:f2",
            "net7": "ae:40:68:dd:9e:ba",
            "net8": "02:8d:ec:07:4a:1e",
            "net9": "9e:2a:29:f3:be:73"
        },
        "spine_8_1_5": {
            "net0": "fa:14:6c:a8:58:6e",
            "net1": "5e:15:6f:7d:b3:90",
            "net10": "3a:b8:db:1c:25:d9",
            "net11": "aa:ba:9c:b4:3a:fa",
            "net2": "56:6f:6b:4d:bf:49",
            "net3": "d2:99:24:dc:26:ad",
            "net4": "e2:f7:2b:fc:15:d4",
            "net5": "82:e1:e4:e0:30:a4",
            "net6": "7e:fe:c6:ae:39:44",
            "net7": "02:60:5e:89:78:6c",
            "net8": "16:97:94:cf:4e:af",
            "net9": "0a:83:29:9c:35:97"
        },
        "spine_8_1_6": {
            "net0": "1e:33:dc:ae:e7:19",
            "net1": "26:e5:fd:7f:c7:18",
            "net10": "16:6c:b9:94:8c:89",
            "net11": "fe:96:f2:99:0f:37",
            "net2": "0a:af:31:14:1e:b1",
            "net3": "b2:8a:a4:38:53:b9",
            "net4": "16:b9:4d:11:e8:d5",
            "net5": "a2:f4:05:05:e0:ac",
            "net6": "42:e4:f2:5b:11:9c",
            "net7": "b2:93:21:99:f8:e6",
            "net8": "b6:15:f4:3d:00:96",
            "net9": "ba:c0:15:e8:a4:07"
        },
        "spine_9_1_1": {
            "net0": "1a:76:70:a7:ae:79",
            "net1": "96:34:68:d3:fa:27",
            "net10": "3e:42:1d:b5:1f:cc",
            "net11": "ea:6c:8e:3c:db:61",
            "net2": "06:6e:41:f9:da:10",
            "net3": "0e:c6:f2:46:cb:63",
            "net4": "ae:64:d2:9d:97:66",
            "net5": "ba:46:86:f0:ab:2d",
            "net6": "96:4d:27:d7:49:96",
            "net7": "4e:35:dd:a6:b4:74",
            "net8": "aa:08:96:d3:e1:a0",
            "net9": "3e:99:df:01:0c:a1"
        },
        "spine_9_1_2": {
            "net0": "da:10:aa:79:44:31",
            "net1": "9a:c9:e5:f5:f9:32",
            "net10": "1e:70:bc:cc:eb:c8",
            "net11": "96:66:a1:e8:fb:a1",
            "net2": "ea:17:37:4d:b4:11",
            "net3": "3e:5b:aa:d2:d0:b8",
            "net4": "46:27:01:87:ab:69",
            "net5": "c2:2a:dc:d6:89:f7",
            "net6": "a2:0f:5f:00:3e:af",
            "net7": "7e:14:2d:09:c5:19",
            "net8": "9e:d0:45:99:3a:3d",
            "net9": "2a:ac:3e:54:1a:67"
        },
        "spine_9_1_3": {
            "net0": "82:a7:81:2d:0d:54",
            "net1": "1a:51:01:7e:31:eb",
            "net10": "1e:5e:d2:c2:f4:06",
            "net11": "d6:04:40:69:e3:41",
            "net2": "7a:af:da:2c:3b:9d",
            "net3": "96:14:ac:49:03:60",
            "net4": "ce:c0:41:9e:e2:8b",
            "net5": "42:87:25:ab:3c:89",
            "net6": "8e:7c:56:68:28:97",
            "net7": "e6:46:c6:34:50:e4",
            "net8": "e6:5a:d2:d1:d0:56",
            "net9": "16:f1:d1:b8:52:5a"
        },
        "spine_9_1_4": {
            "net0": "0a:07:bf:ea:f4:e3",
            "net1": "8e:ea:3f:94:a2:2e",
            "net10": "62:63:f7:29:f0:5e",
            "net11": "ae:98:91:ab:5d:33",
            "net2": "32:19:77:d6:7b:3b",
            "net3": "92:47:51:13:61:e7",
            "net4": "42:8b:be:4c:f3:b7",
            "net5": "f6:15:18:f2:d8:66",
            "net6": "82:d5:92:4a:d5:ab",
            "net7": "86:34:01:ba:5b:8f",
            "net8": "f2:08:e7:00:68:a3",
            "net9": "3e:e7:ec:4d:32:67"
        },
        "spine_9_1_5": {
            "net0": "b6:cb:05:d0:b2:9c",
            "net1": "92:c0:80:bf:7f:0d",
            "net10": "32:a5:f1:7c:60:fc",
            "net11": "3a:1d:ae:75:04:52",
            "net2": "86:41:4b:87:34:db",
            "net3": "66:9c:a4:46:09:69",
            "net4": "1a:2f:12:fa:c3:77",
            "net5": "76:04:62:30:22:54",
            "net6": "7a:3a:f8:10:3c:1c",
            "net7": "26:84:a8:b5:97:26",
            "net8": "e6:31:f0:65:c8:8b",
            "net9": "06:1c:de:a0:37:b7"
        },
        "spine_9_1_6": {
            "net0": "0a:8e:a4:20:3e:9c",
            "net1": "f6:ae:4c:f3:80:3b",
            "net10": "c6:2b:48:86:8e:e6",
            "net11": "02:03:e0:ff:b2:3a",
            "net2": "06:67:f8:e8:4b:b1",
            "net3": "46:fc:50:f1:4e:a2",
            "net4": "d2:02:23:37:b9:a8",
            "net5": "a6:c1:9e:81:f7:e0",
            "net6": "76:c9:25:87:ee:58",
            "net7": "c2:0e:3f:d9:7c:22",
            "net8": "be:5f:7e:55:41:c5",
            "net9": "6a:cb:0b:48:1e:de"
        },
        "tof_1_2_1": {
            "net0": "02:12:ee:48:9a:f5",
            "net1": "9e:b3:f5:31:cf:3e",
            "net10": "da:9d:c7:dd:66:47",
            "net11": "d6:e8:d1:50:d5:d2",
            "net2": "d6:ba:ac:ca:2d:d3",
            "net3": "ba:e8:21:05:4f:46",
            "net4": "1a:c9:e0:76:f5:c0",
            "net5": "7a:9d:25:af:d7:f9",
            "net6": "46:f4:ba:a0:08:d9",
            "net7": "4a:f8:e5:8e:30:b3",
            "net8": "a2:eb:ca:c2:57:e8",
            "net9": "92:e6:16:56:fb:21"
        },
        "tof_1_2_2": {
            "net0": "fa:c8:ff:b5:4a:5e",
            "net1": "46:82:c2:1b:10:05",
            "net10": "8e:a8:64:20:1b:e2",
            "net11": "26:f1:56:b7:ec:ee",
            "net2": "8e:31:94:4f:e5:bc",
            "net3": "36:59:07:f3:f5:d5",
            "net4": "62:41:fb:84:9d:1b",
            "net5": "c2:9d:9d:6a:e8:20",
            "net6": "16:d7:68:63:ae:46",
            "net7": "96:55:ed:4d:87:f4",
            "net8": "ea:33:b2:35:57:54",
            "net9": "46:5d:4c:5a:98:5b"
        },
        "tof_1_2_3": {
            "net0": "c6:33:e5:f1:1e:fb",
            "net1": "ae:e7:c3:59:e0:cc",
            "net10": "16:c6:5c:6f:5c:b8",
            "net11": "56:e4:4a:16:39:57",
            "net2": "ce:f3:de:c9:d3:2b",
            "net3": "9a:6e:82:4f:8f:03",
            "net4": "e2:6c:03:f1:89:7c",
            "net5": "da:67:df:e1:f7:f4",
            "net6": "b6:f2:2d:1c:c8:76",
            "net7": "02:01:77:e4:7f:39",
            "net8": "3e:58:8d:64:63:4a",
            "net9": "02:ce:72:c9:ba:11"
        },
        "tof_1_2_4": {
            "net0": "be:d4:7f:27:0a:22",
            "net1": "02:d3:3f:73:67:64",
            "net10": "66:62:b6:f8:51:81",
            "net11": "a2:eb:78:4e:f9:70",
            "net2": "0a:dd:94:4e:f8:0e",
            "net3": "26:fb:47:ff:ed:be",
            "net4": "92:19:55:d1:20:ab",
            "net5": "42:8b:2e:c0:bc:13",
            "net6": "f6:de:21:6d:b7:64",
            "net7": "ae:aa:54:01:72:47",
            "net8": "a2:12:36:0c:a7:61",
            "net9": "92:e6:78:60:e8:fa"
        },
        "tof_1_2_5": {
            "net0": "02:db:5c:a8:2b:60",
            "net1": "72:69:0f:2a:18:8e",
            "net10": "ca:14:36:13:80:a9",
            "net11": "86:32:4b:e2:fd:96",
            "net2": "c6:70:e7:87:aa:ae",
            "net3": "c6:79:ff:6b:ea:b2",
            "net4": "5e:a9:03:de:00:cd",
            "net5": "be:dc:46:af:15:c7",
            "net6": "f2:50:69:d5:a7:2f",
            "net7": "4e:16:b1:3c:95:d5",
            "net8": "fe:dd:85:3d:1a:b4",
            "net9": "ce:ca:ee:9e:88:cb"
        },
        "tof_1_2_6": {
            "net0": "de:99:c7:a1:44:9a",
            "net1": "1a:1c:98:60:7a:b2",
            "net10": "42:42:c0:10:4f:7d",
            "net11": "2e:fe:66:8f:9e:ca",
            "net2": "7e:4a:b1:ba:8b:58",
            "net3": "7e:7d:8a:91:6d:44",
            "net4": "ba:54:2c:86:57:0f",
            "net5": "c2:de:fb:b6:ce:3f",
            "net6": "92:06:e3:63:84:08",
            "net7": "3e:98:10:94:9c:d8",
            "net8": "ea:e4:59:99:ab:d0",
            "net9": "fa:47:1e:00:db:f1"
        },
        "tof_2_2_1": {
            "net0": "d2:5c:10:b5:21:de",
            "net1": "4e:7b:ae:5c:28:2e",
            "net10": "d6:0f:a9:bd:8e:7e",
            "net11": "92:1d:81:41:28:e2",
            "net2": "4a:db:41:8e:11:e6",
            "net3": "0a:f5:19:13:a5:11",
            "net4": "8e:77:02:06:28:fd",
            "net5": "1a:74:7b:ef:c3:41",
            "net6": "4a:9f:13:68:27:04",
            "net7": "02:99:00:90:74:d5",
            "net8": "66:65:2d:e9:42:fe",
            "net9": "e6:eb:a2:10:44:1a"
        },
        "tof_2_2_2": {
            "net0": "1a:fd:d3:0d:ae:ea",
            "net1": "12:fd:23:a1:f1:d0",
            "net10": "aa:b0:4c:8d:6c:b5",
            "net11": "d2:28:8a:47:af:fd",
            "net2": "e6:32:f1:19:5e:b7",
            "net3": "6e:07:56:f4:d5:12",
            "net4": "4a:e1:39:97:ca:79",
            "net5": "ea:7a:13:4d:9a:bb",
            "net6": "62:20:ac:be:6e:5c",
            "net7": "6e:ac:0c:84:7e:09",
            "net8": "42:39:93:85:e7:f1",
            "net9": "fa:4b:1e:85:02:dc"
        },
        "tof_2_2_3": {
            "net0": "1a:58:8a:3a:aa:9d",
            "net1": "62:89:88:9c:91:da",
            "net10": "ce:55:6a:b2:12:89",
            "net11": "9a:8a:b7:6c:1a:64",
            "net2": "66:e8:97:fd:3e:06",
            "net3": "6e:32:00:16:62:e4",
            "net4": "8e:07:fd:04:0d:a9",
            "net5": "0a:d9:c2:0e:81:51",
            "net6": "b2:4d:c3:cc:54:72",
            "net7": "92:58:ae:d9:20:ad",
            "net8": "86:1b:1e:42:72:20",
            "net9": "5e:ad:a4:e2:2a:b8"
        },
        "tof_2_2_4": {
            "net0": "a6:85:cd:61:3c:4d",
            "net1": "a6:0d:19:f5:ab:f7",
            "net10": "8e:14:cf:ef:75:c0",
            "net11": "22:69:9e:dc:46:1d",
            "net2": "5e:f8:e8:92:36:91",
            "net3": "7e:fd:94:ce:fa:28",
            "net4": "06:49:bb:51:dc:70",
            "net5": "8e:cc:be:a9:fb:47",
            "net6": "5a:c9:7b:bc:81:5a",
            "net7": "e2:07:5d:91:d6:ee",
            "net8": "56:55:57:84:5a:22",
            "net9": "fa:5c:9d:f6:ec:3b"
        },
        "tof_2_2_5": {
            "net0": "ae:6d:e2:37:8c:c8",
            "net1": "aa:06:4f:62:31:07",
            "net10": "42:35:52:83:44:ec",
            "net11": "1e:f1:cf:a7:42:61",
            "net2": "52:45:9a:d3:44:51",
            "net3": "52:e4:e4:96:2e:e3",
            "net4": "0a:ea:dd:86:3d:c7",
            "net5": "e2:0c:8a:e8:27:8e",
            "net6": "76:70:b2:13:12:98",
            "net7": "ee:eb:3a:43:87:1e",
            "net8": "9a:91:0b:94:81:73",
            "net9": "f6:b2:8d:cc:a2:d9"
        },
        "tof_2_2_6": {
            "net0": "de:a4:27:d7:c3:66",
            "net1": "aa:d0:18:07:97:ae",
            "net10": "3a:c2:fc:07:37:0a",
            "net11": "fa:b8:10:74:e7:9d",
            "net2": "72:44:d1:99:b8:5d",
            "net3": "c2:fb:7a:ac:1b:74",
            "net4": "9a:1d:af:94:b9:72",
            "net5": "1a:4b:49:a7:24:76",
            "net6": "c2:1a:c3:ea:48:89",
            "net7": "46:cb:1d:d1:f7:d5",
            "net8": "82:c3:45:11:db:63",
            "net9": "c6:bf:5b:6b:17:ce"
        },
        "tof_3_2_1": {
            "net0": "66:b8:fc:9c:22:d6",
            "net1": "7e:0f:b7:fb:bf:da",
            "net10": "5e:42:7e:d0:de:08",
            "net11": "06:86:f3:32:4e:54",
            "net2": "ae:95:ee:ae:71:03",
            "net3": "1e:66:82:b5:b9:df",
            "net4": "b2:f1:07:29:19:5b",
            "net5": "ca:ee:5b:76:24:69",
            "net6": "56:f0:96:c5:65:f4",
            "net7": "b6:38:b5:8c:cd:66",
            "net8": "2e:fa:1e:9a:f5:bf",
            "net9": "22:bf:f1:fc:b2:21"
        },
        "tof_3_2_2": {
            "net0": "ba:45:d7:e8:64:d6",
            "net1": "4e:b3:cd:d2:b0:e7",
            "net10": "fe:b5:cf:00:7f:0f",
            "net11": "82:d6:68:22:a1:95",
            "net2": "8e:12:14:45:41:ba",
            "net3": "b6:a2:69:d5:d3:2e",
            "net4": "2e:65:e1:13:60:37",
            "net5": "36:71:77:35:75:eb",
            "net6": "ee:4a:41:41:f7:19",
            "net7": "b6:fa:32:68:51:81",
            "net8": "0a:b7:88:8d:65:92",
            "net9": "4e:55:22:e6:20:54"
        },
        "tof_3_2_3": {
            "net0": "5a:72:0b:71:07:b3",
            "net1": "ae:a1:ca:93:d5:a9",
            "net10": "ea:66:92:d1:99:c7",
            "net11": "76:6f:02:f2:4a:22",
            "net2": "36:67:16:47:27:1d",
            "net3": "32:a1:56:9e:41:fa",
            "net4": "b2:60:5f:6d:39:cc",
            "net5": "d6:8b:55:06:c9:ce",
            "net6": "e2:39:b3:6b:17:99",
            "net7": "2a:67:ea:3b:9f:ee",
            "net8": "86:c9:0a:59:b5:b4",
            "net9": "3a:78:8a:a0:ef:9e"
        },
        "tof_3_2_4": {
            "net0": "da:b2:70:fa:7a:80",
            "net1": "ae:21:bd:93:79:a5",
            "net10": "3a:90:0e:33:ea:41",
            "net11": "4a:cc:ab:92:5c:13",
            "net2": "36:eb:f3:8b:3e:aa",
            "net3": "36:de:9e:9c:92:d3",
            "net4": "3e:06:58:98:2a:02",
            "net5": "de:78:4f:0e:29:1a",
            "net6": "a6:1a:36:75:a4:f1",
            "net7": "46:2f:4d:98:29:7d",
            "net8": "e2:a2:65:4c:18:4e",
            "net9": "fa:2a:d8:a1:96:2a"
        },
        "tof_3_2_5": {
            "net0": "72:45:55:91:32:97",
            "net1": "1a:36:58:e3:70:6c",
            "net10": "fe:e3:f9:6d:b3:d2",
            "net11": "f6:b2:c5:97:b0:8f",
            "net2": "4a:08:da:25:c7:69",
            "net3": "92:58:30:f2:79:51",
            "net4": "5a:ff:d9:7b:76:ae",
            "net5": "b6:0d:9d:1b:a4:07",
            "net6": "5a:f3:d6:fe:91:cf",
            "net7": "fa:b5:cb:71:c2:12",
            "net8": "ce:27:ba:4e:4f:f9",
            "net9": "a2:a3:db:c1:86:81"
        },
        "tof_3_2_6": {
            "net0": "5e:c4:98:61:f4:af",
            "net1": "c6:e2:f8:95:19:4c",
            "net10": "ba:dc:b7:2c:e9:c6",
            "net11": "7e:c4:7c:af:63:97",
            "net2": "56:46:68:ea:5e:50",
            "net3": "c2:ed:d9:6f:3c:d1",
            "net4": "ae:a1:59:5e:84:29",
            "net5": "82:31:f9:ca:be:e9",
            "net6": "2e:4e:7c:cb:10:8b",
            "net7": "d6:39:f4:b0:45:6e",
            "net8": "3e:4d:ef:ce:de:2b",
            "net9": "ba:fc:63:af:55:ef"
        },
        "tof_4_2_1": {
            "net0": "9e:41:ca:7f:60:13",
            "net1": "96:32:65:a5:59:4e",
            "net10": "1e:97:57:8a:e6:d4",
            "net11": "56:ea:4b:1d:0c:6c",
            "net2": "72:85:8f:73:c1:b3",
            "net3": "76:13:b3:47:9f:3f",
            "net4": "aa:cf:f7:ef:cb:22",
            "net5": "8e:9b:e0:03:54:5c",
            "net6": "4e:52:ba:46:09:22",
            "net7": "d2:c0:18:1c:0a:8a",
            "net8": "16:49:6b:ff:2e:d8",
            "net9": "02:a2:af:28:1c:ae"
        },
        "tof_4_2_2": {
            "net0": "c2:6f:55:02:a3:3b",
            "net1": "26:42:c9:5d:fe:a7",
            "net10": "3e:cb:8a:b1:96:84",
            "net11": "ce:82:b3:dd:c1:ff",
            "net2": "5e:5c:9e:93:b0:f5",
            "net3": "42:b2:19:ed:85:6b",
            "net4": "3e:4c:e9:3c:ae:1d",
            "net5": "c2:a5:63:16:aa:56",
            "net6": "86:b4:52:b4:03:0b",
            "net7": "ee:25:5a:93:ba:1f",
            "net8": "ea:a1:c9:cc:12:c9",
            "net9": "fe:c4:97:16:5b:a2"
        },
        "tof_4_2_3": {
            "net0": "16:71:78:2f:a8:37",
            "net1": "0e:c6:e8:fb:01:18",
            "net10": "d2:33:61:ce:83:69",
            "net11": "fa:b5:9b:2d:53:18",
            "net2": "a2:8f:13:43:67:e3",
            "net3": "8e:ad:b9:c4:9b:8f",
            "net4": "7e:c3:30:79:34:97",
            "net5": "8e:e5:bb:46:cb:9d",
            "net6": "fe:56:bd:e2:c9:97",
            "net7": "ea:ea:10:16:fc:ab",
            "net8": "56:0f:94:e6:5b:24",
            "net9": "6e:b6:a7:8a:6f:43"
        },
        "tof_4_2_4": {
            "net0": "32:80:b5:c6:d4:30",
            "net1": "02:34:fc:14:f1:c0",
            "net10": "1a:ba:52:27:1f:f9",
            "net11": "02:a4:6c:f0:1e:b0",
            "net2": "ba:c5:c1:57:81:f2",
            "net3": "16:e4:a0:f5:33:db",
            "net4": "8e:54:92:1f:3c:8c",
            "net5": "4e:bc:c8:90:9d:3e",
            "net6": "2e:6b:9d:19:44:23",
            "net7": "c6:13:4b:fc:1c:e1",
            "net8": "6e:b1:13:dc:ae:11",
            "net9": "b6:d5:9b:3b:a2:21"
        },
        "tof_4_2_5": {
            "net0": "c2:a3:d3:4a:86:c7",
            "net1": "66:11:ff:5e:96:91",
            "net10": "e2:41:02:bc:b1:c4",
            "net11": "9a:19:19:ed:f9:2b",
            "net2": "fa:94:f3:cb:97:23",
            "net3": "46:b6:3d:76:13:8e",
            "net4": "ee:22:af:ff:d3:27",
            "net5": "9e:de:51:ed:52:9e",
            "net6": "ca:01:af:74:f0:75",
            "net7": "5a:47:fd:02:74:09",
            "net8": "52:eb:7d:42:7a:c4",
            "net9": "3e:c4:49:44:2d:c7"
        },
        "tof_4_2_6": {
            "net0": "ae:2c:15:75:c1:a0",
            "net1": "ce:af:a8:a9:c0:b1",
            "net10": "7e:2d:fc:3c:60:b2",
            "net11": "12:bc:0d:ee:f9:6a",
            "net2": "fa:f8:38:f7:87:e0",
            "net3": "e6:ed:b4:b1:07:38",
            "net4": "f2:93:51:d3:0f:5d",
            "net5": "2a:a1:10:08:07:f1",
            "net6": "de:e9:94:d7:22:f4",
            "net7": "1a:d8:ac:c5:c0:9d",
            "net8": "c2:14:5a:00:cd:78",
            "net9": "de:99:b8:1c:83:96"
        },
        "tof_5_2_1": {
            "net0": "fe:95:c8:98:06:fa",
            "net1": "86:9e:a0:ed:97:fa",
            "net10": "82:31:f6:23:38:3a",
            "net11": "ba:29:a0:f9:55:20",
            "net2": "2a:f2:e7:a7:42:c5",
            "net3": "82:0e:95:4a:03:67",
            "net4": "7e:d3:ee:71:57:da",
            "net5": "8a:64:a3:9f:dd:4b",
            "net6": "02:29:c1:58:8a:b7",
            "net7": "7e:82:b3:26:a1:d9",
            "net8": "56:f0:75:9d:26:6f",
            "net9": "d6:4f:03:c5:e7:1c"
        },
        "tof_5_2_2": {
            "net0": "e2:97:7e:b5:a8:1c",
            "net1": "8a:bd:5e:01:82:74",
            "net10": "ce:24:91:01:17:c3",
            "net11": "a2:62:ce:49:41:2d",
            "net2": "22:1c:60:f0:f3:c3",
            "net3": "fe:a0:e6:f9:e0:c9",
            "net4": "a2:c0:28:6a:bc:7b",
            "net5": "5a:cf:1c:75:67:f3",
            "net6": "9a:3f:e1:2e:5f:96",
            "net7": "6e:61:06:a5:c4:8b",
            "net8": "96:02:04:1f:65:66",
            "net9": "7a:df:ef:ff:6e:1e"
        },
        "tof_5_2_3": {
            "net0": "c6:85:8b:35:75:32",
            "net1": "12:42:5f:88:2e:6e",
            "net10": "7a:a7:39:9b:58:49",
            "net11": "b2:7b:0b:a1:ee:9d",
            "net2": "6a:8a:34:1f:43:01",
            "net3": "36:28:40:bf:a9:ac",
            "net4": "6e:1a:2b:54:11:7f",
            "net5": "f2:46:5f:c1:ff:ef",
            "net6": "56:e3:de:9b:ef:0c",
            "net7": "ba:c9:14:84:d7:4b",
            "net8": "1a:f2:12:d6:ca:96",
            "net9": "6e:fd:09:74:67:9c"
        },
        "tof_5_2_4": {
            "net0": "0e:b9:8c:59:47:db",
            "net1": "7a:c7:67:1a:37:0f",
            "net10": "c2:86:9e:b3:6f:9b",
            "net11": "12:32:cc:5f:55:b5",
            "net2": "96:eb:4c:af:ad:af",
            "net3": "02:07:57:f1:fe:39",
            "net4": "56:b3:78:c6:1d:98",
            "net5": "e6:e4:ef:72:ad:38",
            "net6": "76:6b:8d:9a:e8:2c",
            "net7": "d2:27:ce:94:68:e7",
            "net8": "92:56:ab:c8:d1:ae",
            "net9": "4a:66:1f:aa:1f:e5"
        },
        "tof_5_2_5": {
            "net0": "0e:40:09:5d:cc:ad",
            "net1": "56:27:e7:a4:b8:d6",
            "net10": "16:7b:e1:9a:a4:24",
            "net11": "c2:d1:af:58:de:58",
            "net2": "02:7b:0e:f3:60:32",
            "net3": "fe:d9:ce:eb:86:8a",
            "net4": "9a:35:eb:51:92:da",
            "net5": "aa:2a:a6:3b:28:f1",
            "net6": "ea:ac:6b:12:91:4f",
            "net7": "76:0e:ba:4c:74:45",
            "net8": "d6:65:07:d2:8c:6e",
            "net9": "0e:d6:1a:d7:bb:b5"
        },
        "tof_5_2_6": {
            "net0": "22:12:56:59:7b:0d",
            "net1": "8a:77:f5:35:40:68",
            "net10": "16:f2:16:21:41:d6",
            "net11": "7a:34:73:49:09:c3",
            "net2": "ee:6e:2a:37:9d:d2",
            "net3": "6e:57:c7:0d:5b:21",
            "net4": "32:8d:b6:7b:5c:ed",
            "net5": "92:34:e6:94:1c:1f",
            "net6": "5e:c7:e2:7b:5c:a5",
            "net7": "ca:b5:b3:39:61:a4",
            "net8": "5a:76:c3:7c:e5:8e",
            "net9": "c6:8d:66:11:43:1c"
        },
        "tof_6_2_1": {
            "net0": "fe:ac:ab:6f:21:58",
            "net1": "ba:5e:7b:eb:16:1d",
            "net10": "5a:c6:45:be:a2:0f",
            "net11": "2a:99:64:72:16:e8",
            "net2": "0e:4f:c1:9f:88:ce",
            "net3": "d2:d5:c6:04:63:60",
            "net4": "12:8d:b0:0f:a8:7a",
            "net5": "b2:16:58:fa:63:02",
            "net6": "36:2c:a3:87:7f:2e",
            "net7": "c2:2b:5e:37:a9:a3",
            "net8": "36:b6:61:7e:63:63",
            "net9": "72:33:f4:0b:42:ef"
        },
        "tof_6_2_2": {
            "net0": "32:a5:f9:9b:9d:2b",
            "net1": "d6:d9:c8:28:f1:c2",
            "net10": "36:c4:ca:76:10:d2",
            "net11": "fe:02:60:c8:2f:36",
            "net2": "6e:28:4e:ce:f0:64",
            "net3": "8e:e4:76:b1:9a:db",
            "net4": "92:1a:9c:7d:b8:29",
            "net5": "02:4a:d6:2d:2c:a5",
            "net6": "3a:d0:fb:5f:f3:0f",
            "net7": "fa:d8:74:83:ed:55",
            "net8": "0e:4b:75:11:3d:5c",
            "net9": "ba:93:df:c0:00:1f"
        },
        "tof_6_2_3": {
            "net0": "5a:8e:63:64:47:ae",
            "net1": "3a:68:c9:59:2f:d7",
            "net10": "1e:81:5e:70:d5:fc",
            "net11": "b2:84:f2:bb:9f:6f",
            "net2": "da:ce:48:ad:12:7b",
            "net3": "8a:13:49:53:f2:35",
            "net4": "de:fc:13:59:fc:11",
            "net5": "92:6f:cf:15:b8:60",
            "net6": "4e:28:95:aa:5d:22",
            "net7": "2a:04:6c:70:75:2e",
            "net8": "16:45:a2:29:93:c5",
            "net9": "ea:01:11:7c:b4:2e"
        },
        "tof_6_2_4": {
            "net0": "46:5c:ce:76:a4:9c",
            "net1": "9e:d1:86:f5:5b:cf",
            "net10": "a6:20:cb:24:41:15",
            "net11": "62:33:c8:91:d1:ff",
            "net2": "e2:45:94:53:ec:c0",
            "net3": "e6:0c:14:17:5e:8d",
            "net4": "0e:e9:38:0d:1f:f9",
            "net5": "c6:0c:3f:dd:59:07",
            "net6": "2a:46:45:b7:e9:a8",
            "net7": "a2:d5:e9:a5:b8:4a",
            "net8": "32:fd:77:e0:9d:7d",
            "net9": "26:16:b4:ac:6a:4d"
        },
        "tof_6_2_5": {
            "net0": "3a:6b:67:d5:f8:c2",
            "net1": "da:1a:8e:96:9f:13",
            "net10": "42:35:67:b9:2d:17",
            "net11": "f2:64:3b:64:56:a3",
            "net2": "aa:9f:e2:aa:dd:06",
            "net3": "7a:b2:39:f9:d8:63",
            "net4": "d6:a4:9a:89:c1:10",
            "net5": "e6:4e:54:ef:8b:49",
            "net6": "22:d7:40:e1:92:e1",
            "net7": "e2:60:20:31:23:f4",
            "net8": "52:90:84:fe:85:de",
            "net9": "ea:68:a1:46:aa:43"
        },
        "tof_6_2_6": {
            "net0": "da:b7:34:15:4c:ac",
            "net1": "b2:75:78:fe:c1:d1",
            "net10": "76:71:e5:43:95:9f",
            "net11": "0a:fa:df:a9:14:f5",
            "net2": "7a:14:df:45:ff:74",
            "net3": "3e:35:75:c2:c5:33",
            "net4": "e2:a2:f1:7a:30:a4",
            "net5": "f2:fa:74:09:20:aa",
            "net6": "56:a5:a4:5b:a8:ae",
            "net7": "06:45:9f:54:fc:67",
            "net8": "5a:0c:df:a8:f4:ab",
            "net9": "36:57:e1:c7:cf:e6"
        }
    },
    "failed_machine": "tof_1_2_1",
    "failure_time": 1616278244.8457804
}