{
    "description": "Scenario 3a: Leaf leaf_1_0_1 failure with BGP",
    "k_leaf": 10,
    "k_top": 10,
    "redundancy_factor": 10,
    "is_k8s": true,
    "machine_mac_addresses": {
        "leaf_1_0_1": {
            "net0": "7a:f2:49:73:53:64",
            "net1": "12:24:56:f3:f7:10",
            "net10": "ca:f9:b9:bc:7d:ef",
            "net2": "9e:ca:7f:6d:2a:ad",
            "net3": "5e:9e:b3:22:d7:20",
            "net4": "22:e9:84:7d:7b:68",
            "net5": "8a:b6:ea:67:e6:80",
            "net6": "4a:51:19:35:89:cb",
            "net7": "76:15:49:d4:52:cc",
            "net8": "3a:ef:57:7f:af:20",
            "net9": "12:ca:d1:48:4a:4d"
        },
        "leaf_1_0_10": {
            "net0": "4a:38:92:aa:47:db",
            "net1": "a2:a8:2e:b8:23:58",
            "net10": "fa:d9:ee:2e:ba:dc",
            "net2": "de:28:79:76:b6:6b",
            "net3": "d6:e7:ca:92:d9:84",
            "net4": "3e:d1:b1:fa:df:0f",
            "net5": "2a:a4:3a:c0:df:b2",
            "net6": "12:03:b4:7b:61:4b",
            "net7": "16:4a:ef:8d:c5:a8",
            "net8": "b6:fe:83:00:2d:f1",
            "net9": "42:97:cd:12:c9:8f"
        },
        "leaf_1_0_2": {
            "net0": "b2:90:13:70:c7:35",
            "net1": "d2:0b:09:f3:d2:ff",
            "net10": "8e:3f:06:5b:13:77",
            "net2": "86:65:57:1b:ab:3c",
            "net3": "ce:5b:fb:98:26:8b",
            "net4": "46:e1:bc:47:b4:66",
            "net5": "fe:9e:58:69:43:b0",
            "net6": "7e:f7:10:b8:95:f6",
            "net7": "c6:f2:0e:75:e8:c0",
            "net8": "96:99:1d:52:12:d8",
            "net9": "02:c9:0b:53:f4:7e"
        },
        "leaf_1_0_3": {
            "net0": "92:4d:eb:6c:98:0b",
            "net1": "9e:3f:7a:a0:f3:07",
            "net10": "aa:6a:b3:0a:94:9b",
            "net2": "e2:2d:d7:c6:2f:c0",
            "net3": "7e:b6:3a:94:5f:98",
            "net4": "92:c6:a7:7d:b7:2d",
            "net5": "de:6a:31:36:3f:28",
            "net6": "82:70:fc:a6:19:fc",
            "net7": "9a:35:02:ee:6a:10",
            "net8": "3a:ca:1b:d4:c7:03",
            "net9": "aa:36:2b:22:ba:64"
        },
        "leaf_1_0_4": {
            "net0": "6e:b8:4d:85:86:c8",
            "net1": "f2:2b:51:54:bd:f2",
            "net10": "6a:5b:c7:f0:50:d4",
            "net2": "fa:d2:08:e1:32:30",
            "net3": "f2:57:0f:86:f3:2d",
            "net4": "ca:f7:ba:6b:28:27",
            "net5": "a6:67:56:91:e0:ac",
            "net6": "6a:e6:7b:f7:a1:68",
            "net7": "2e:c8:c4:6d:bc:08",
            "net8": "1a:a4:7d:1b:ff:db",
            "net9": "d2:e8:84:a6:a5:1f"
        },
        "leaf_1_0_5": {
            "net0": "2e:be:9b:73:70:9e",
            "net1": "a6:aa:0b:d8:ff:35",
            "net10": "d6:59:9e:fd:13:0b",
            "net2": "72:5e:10:3f:5c:3e",
            "net3": "9a:60:aa:e1:8a:aa",
            "net4": "f6:3d:5a:2f:43:a0",
            "net5": "46:d2:c3:e4:09:97",
            "net6": "96:0b:0a:c7:c9:e2",
            "net7": "46:3d:66:4e:12:12",
            "net8": "b6:ab:ec:d6:6f:ce",
            "net9": "fe:65:28:b3:11:c2"
        },
        "leaf_1_0_6": {
            "net0": "ae:a1:70:18:13:62",
            "net1": "32:1e:1a:a2:6b:8f",
            "net10": "ae:56:5f:4c:aa:3d",
            "net2": "42:d3:ff:ca:90:2a",
            "net3": "4e:be:40:2a:5d:3c",
            "net4": "32:43:5c:40:51:2b",
            "net5": "3e:b0:d9:15:40:b4",
            "net6": "ae:49:75:6a:ab:86",
            "net7": "ee:cc:30:21:fc:a8",
            "net8": "a6:38:ef:dc:73:b1",
            "net9": "86:5d:a4:48:7e:87"
        },
        "leaf_1_0_7": {
            "net0": "66:e2:63:fa:da:ee",
            "net1": "e6:99:f8:1c:c5:ca",
            "net10": "26:96:a6:09:a6:ad",
            "net2": "32:f8:b7:e2:01:5c",
            "net3": "06:02:b2:3d:4e:7f",
            "net4": "22:b4:0f:f1:e6:49",
            "net5": "6a:a9:e1:b8:eb:4e",
            "net6": "12:c4:b7:36:c5:a1",
            "net7": "92:2a:87:0e:19:d1",
            "net8": "fe:13:d3:97:94:71",
            "net9": "4e:ab:f8:6a:24:f0"
        },
        "leaf_1_0_8": {
            "net0": "ba:19:40:62:fc:98",
            "net1": "2e:85:ec:a2:ca:39",
            "net10": "e2:eb:96:10:35:d2",
            "net2": "ae:98:5d:2b:65:a7",
            "net3": "32:79:85:ef:64:d9",
            "net4": "d6:b1:f0:8d:c8:2f",
            "net5": "a6:60:75:89:9e:d0",
            "net6": "3e:9a:09:14:b6:6a",
            "net7": "1a:88:d4:3d:fd:91",
            "net8": "de:75:5c:05:8c:52",
            "net9": "72:e3:ca:44:22:f0"
        },
        "leaf_1_0_9": {
            "net0": "f6:f8:80:bf:a1:e1",
            "net1": "62:d5:0f:10:89:aa",
            "net10": "02:d2:5f:19:6d:47",
            "net2": "1e:02:52:c0:38:11",
            "net3": "da:57:06:6d:b5:c6",
            "net4": "62:12:f7:86:01:c2",
            "net5": "ea:df:04:27:0a:d5",
            "net6": "a2:e3:11:f7:9f:b5",
            "net7": "c2:d0:c4:8e:32:80",
            "net8": "36:e6:44:68:9e:0e",
            "net9": "c2:02:e9:ba:df:5b"
        },
        "leaf_2_0_1": {
            "net0": "5e:3d:2f:e8:a9:d5",
            "net1": "72:e6:ff:ad:d0:f1",
            "net10": "56:a5:05:5e:e5:9b",
            "net2": "16:bd:70:71:e5:4a",
            "net3": "26:52:c3:f8:6d:80",
            "net4": "3a:04:e3:32:22:56",
            "net5": "72:ab:8d:91:00:5d",
            "net6": "a2:4d:43:84:a2:61",
            "net7": "82:a6:c5:ec:a7:44",
            "net8": "9a:7c:d5:45:9c:18",
            "net9": "4e:5b:0a:9f:ed:38"
        },
        "leaf_2_0_10": {
            "net0": "3e:48:98:fc:c3:a5",
            "net1": "06:a6:36:4d:dc:78",
            "net10": "4e:e6:6d:b7:24:46",
            "net2": "fa:9b:e7:ed:7f:74",
            "net3": "62:b9:b1:d6:62:ee",
            "net4": "72:c4:33:83:44:21",
            "net5": "c2:6c:0e:8c:c8:cc",
            "net6": "f2:b2:51:3d:3e:83",
            "net7": "de:7a:78:75:8d:e1",
            "net8": "62:d7:17:cd:52:f0",
            "net9": "f6:6f:8a:e2:4e:6a"
        },
        "leaf_2_0_2": {
            "net0": "2e:90:44:b9:75:3e",
            "net1": "62:7f:eb:85:06:e9",
            "net10": "4e:be:37:6f:d4:6f",
            "net2": "5e:6a:ec:c0:21:a7",
            "net3": "ba:24:ec:4e:cd:3c",
            "net4": "76:03:86:0a:52:79",
            "net5": "0a:09:bd:81:b7:85",
            "net6": "62:7c:a5:0f:fb:86",
            "net7": "f2:e4:69:51:41:3d",
            "net8": "92:d1:3a:fe:36:1a",
            "net9": "5a:6a:6e:e5:44:8b"
        },
        "leaf_2_0_3": {
            "net0": "7a:52:6c:41:ba:ef",
            "net1": "de:61:58:03:f7:ad",
            "net10": "12:6f:91:e2:d0:22",
            "net2": "ea:76:6f:ae:58:02",
            "net3": "fa:8b:3e:dc:59:33",
            "net4": "32:f1:46:86:9c:dd",
            "net5": "8a:1e:fa:b7:6e:0e",
            "net6": "aa:83:7d:35:80:c9",
            "net7": "36:38:0a:7c:34:11",
            "net8": "be:10:dc:db:9d:0f",
            "net9": "02:8f:c6:44:b2:a3"
        },
        "leaf_2_0_4": {
            "net0": "72:ed:bd:7d:e1:ff",
            "net1": "82:d6:4a:7b:aa:80",
            "net10": "52:fb:38:74:a4:99",
            "net2": "d2:51:59:da:f8:07",
            "net3": "a2:9c:4d:a0:b5:eb",
            "net4": "fe:fe:85:2c:21:f5",
            "net5": "6e:66:7f:d2:1b:97",
            "net6": "da:a7:ef:ab:ad:e6",
            "net7": "2e:ed:d9:2e:eb:26",
            "net8": "16:92:c9:c0:10:81",
            "net9": "9e:f3:fe:9c:82:a2"
        },
        "leaf_2_0_5": {
            "net0": "32:fe:8e:31:71:e8",
            "net1": "1e:0f:51:44:10:9b",
            "net10": "62:2e:fe:d9:8f:2b",
            "net2": "d2:80:7d:ba:ba:e5",
            "net3": "c6:5d:f0:1e:da:0e",
            "net4": "9a:62:6c:a2:82:de",
            "net5": "f2:a8:12:53:4e:26",
            "net6": "ce:a0:ed:1a:41:44",
            "net7": "66:df:de:17:87:73",
            "net8": "2e:d4:2d:d8:95:50",
            "net9": "42:90:f2:01:7d:21"
        },
        "leaf_2_0_6": {
            "net0": "66:81:ed:af:3d:d7",
            "net1": "22:5e:1a:ad:10:a1",
            "net10": "76:58:1f:30:9c:2a",
            "net2": "6e:dc:e3:fc:4c:c9",
            "net3": "96:61:ad:50:36:23",
            "net4": "56:eb:06:58:24:ed",
            "net5": "46:56:64:10:0e:b1",
            "net6": "2e:73:c4:c8:a3:af",
            "net7": "f2:59:1c:74:56:8d",
            "net8": "b2:ec:10:11:b1:27",
            "net9": "0a:25:82:e3:e0:7e"
        },
        "leaf_2_0_7": {
            "net0": "3e:f6:ee:a1:00:1c",
            "net1": "1a:3a:2f:e0:f9:0f",
            "net10": "9e:0b:6c:73:8d:94",
            "net2": "ee:bd:95:38:06:52",
            "net3": "6a:24:ff:41:14:4b",
            "net4": "ce:24:55:a0:ce:fc",
            "net5": "c6:c3:fc:a0:10:20",
            "net6": "2a:dd:0f:00:94:60",
            "net7": "f6:04:d1:71:60:31",
            "net8": "2e:46:ff:f4:8f:ca",
            "net9": "8a:67:ac:d9:8e:36"
        },
        "leaf_2_0_8": {
            "net0": "a2:73:f2:16:7b:d0",
            "net1": "fe:64:b3:7e:49:4f",
            "net10": "66:27:28:d3:b6:bb",
            "net2": "92:ac:51:e4:6f:b3",
            "net3": "be:53:39:6f:13:b2",
            "net4": "de:80:bb:fb:db:54",
            "net5": "72:b3:77:b4:74:16",
            "net6": "9e:06:17:6d:6d:c3",
            "net7": "7e:00:f0:7b:10:3a",
            "net8": "fa:5d:73:7a:45:2f",
            "net9": "9e:71:1d:83:63:fc"
        },
        "leaf_2_0_9": {
            "net0": "c2:5e:fe:bd:c7:03",
            "net1": "ba:9f:bc:c6:a5:66",
            "net10": "82:dd:53:8d:82:b8",
            "net2": "3a:18:52:c4:5e:f8",
            "net3": "2a:28:57:2d:4f:77",
            "net4": "a6:33:c8:17:c4:e4",
            "net5": "5a:47:c4:8d:8b:e4",
            "net6": "9a:27:ad:83:8e:ca",
            "net7": "62:2b:78:33:56:04",
            "net8": "26:75:f2:99:65:ac",
            "net9": "0a:cc:11:cb:ec:5e"
        },
        "spine_1_1_1": {
            "net0": "8e:62:6e:bb:38:4a",
            "net1": "ba:05:c7:5f:51:30",
            "net10": "d2:b2:0f:5c:e6:5e",
            "net11": "de:da:9c:46:80:92",
            "net12": "2e:90:99:e9:e1:4f",
            "net13": "aa:93:c1:b8:6e:4f",
            "net14": "aa:ae:7d:c7:dd:ba",
            "net15": "be:7f:00:62:f5:bc",
            "net16": "e6:09:53:2a:4e:bf",
            "net17": "9a:b9:77:f2:9f:b6",
            "net18": "fe:eb:e7:ee:45:22",
            "net19": "32:e7:28:09:18:64",
            "net2": "ca:c3:e2:25:e9:45",
            "net3": "b2:66:f6:13:11:ab",
            "net4": "f6:13:d5:ff:82:2f",
            "net5": "92:a0:fd:63:79:f9",
            "net6": "8e:e4:ef:15:c3:45",
            "net7": "56:3e:6e:32:36:7f",
            "net8": "da:d1:64:aa:a5:c9",
            "net9": "52:62:be:6e:5a:76"
        },
        "spine_1_1_10": {
            "net0": "da:72:c8:1c:0d:76",
            "net1": "86:4b:50:01:ed:84",
            "net10": "be:88:63:eb:8f:c0",
            "net11": "72:8b:04:11:bb:ca",
            "net12": "0a:d0:0d:d1:aa:fa",
            "net13": "c6:e6:63:a6:c4:49",
            "net14": "f6:15:48:d6:94:b0",
            "net15": "a2:8d:20:39:91:e9",
            "net16": "7e:09:d1:25:af:b4",
            "net17": "b2:ae:f7:ca:14:cb",
            "net18": "46:da:47:74:7e:66",
            "net19": "1a:46:cf:dd:0c:3f",
            "net2": "22:15:35:e4:20:ef",
            "net3": "ae:57:0e:2f:ae:d2",
            "net4": "7a:4a:6e:cc:36:65",
            "net5": "96:8b:a9:13:72:11",
            "net6": "3e:b8:27:2d:6b:a3",
            "net7": "3a:1c:8b:81:71:f0",
            "net8": "06:2e:26:d4:f1:d6",
            "net9": "b2:94:04:3c:9c:b3"
        },
        "spine_1_1_2": {
            "net0": "12:20:ca:69:ec:a6",
            "net1": "0e:bb:8e:42:16:f4",
            "net10": "3e:01:9d:aa:f8:3a",
            "net11": "be:84:73:8c:41:a4",
            "net12": "5e:f5:f5:d7:29:76",
            "net13": "9a:a8:6b:1f:7e:9c",
            "net14": "2e:c9:61:5b:dc:54",
            "net15": "fa:4e:c6:fb:a5:9a",
            "net16": "4e:e1:bf:1c:5a:8c",
            "net17": "2a:a1:1a:5f:7f:32",
            "net18": "6e:72:c5:b2:f9:7d",
            "net19": "3e:b2:36:02:61:12",
            "net2": "9a:ef:4e:b8:f4:6c",
            "net3": "ea:44:9e:34:09:c8",
            "net4": "9a:60:bb:82:f8:d0",
            "net5": "1a:9c:f7:b6:51:92",
            "net6": "76:06:90:e3:00:86",
            "net7": "9e:d0:bd:a5:2a:27",
            "net8": "3a:07:b5:2b:45:ea",
            "net9": "5e:fa:f5:1c:41:4a"
        },
        "spine_1_1_3": {
            "net0": "fa:bb:17:7d:b3:23",
            "net1": "5a:2e:5b:5d:41:29",
            "net10": "86:01:b2:25:8b:b6",
            "net11": "ee:65:66:0b:d9:a8",
            "net12": "a6:41:44:5d:09:6a",
            "net13": "9a:02:be:e7:2f:63",
            "net14": "1e:d2:4b:7e:05:91",
            "net15": "5a:71:59:f1:d7:5b",
            "net16": "ba:02:9c:1e:e2:4d",
            "net17": "9e:f5:41:fd:c7:31",
            "net18": "ce:d2:af:c2:a1:56",
            "net19": "fe:19:07:57:f7:d6",
            "net2": "0e:40:8a:c6:4c:84",
            "net3": "0a:9f:a9:52:7b:2f",
            "net4": "a6:cc:d3:70:1f:37",
            "net5": "4e:a8:a3:db:14:82",
            "net6": "42:d5:10:33:31:94",
            "net7": "a6:5a:35:df:dc:ba",
            "net8": "e2:97:03:10:b2:91",
            "net9": "56:db:fc:44:cf:c5"
        },
        "spine_1_1_4": {
            "net0": "c6:bd:e1:41:dc:03",
            "net1": "7e:3a:c7:b6:1e:91",
            "net10": "d6:86:3e:98:97:44",
            "net11": "06:00:28:eb:97:43",
            "net12": "ba:38:9a:a0:1d:0a",
            "net13": "7a:0c:36:96:6b:6d",
            "net14": "9a:b3:ab:ea:7a:61",
            "net15": "66:e9:06:9a:6e:12",
            "net16": "0e:d7:59:16:7f:56",
            "net17": "ea:57:e2:2a:59:5d",
            "net18": "e6:12:f5:bd:35:34",
            "net19": "9e:17:84:10:c2:a5",
            "net2": "e2:00:f9:96:c0:eb",
            "net3": "ea:fc:21:3d:60:31",
            "net4": "c6:a6:32:ed:74:da",
            "net5": "1e:e0:b3:86:8d:5c",
            "net6": "36:54:73:92:47:c5",
            "net7": "76:80:06:54:dc:51",
            "net8": "e6:ef:2a:e2:ef:dd",
            "net9": "26:6d:b5:ba:58:f9"
        },
        "spine_1_1_5": {
            "net0": "aa:34:20:2a:59:da",
            "net1": "f2:a8:f5:82:81:23",
            "net10": "ba:73:85:92:5d:5d",
            "net11": "ba:51:0c:54:30:bd",
            "net12": "e2:4b:9b:0c:04:52",
            "net13": "0a:c8:56:71:df:7a",
            "net14": "ba:91:28:c0:df:2b",
            "net15": "66:ce:36:15:66:2d",
            "net16": "6e:36:06:8d:0a:52",
            "net17": "4e:41:52:f3:3c:b4",
            "net18": "ae:63:7a:9e:c2:54",
            "net19": "7e:4a:a4:3a:65:77",
            "net2": "fe:94:36:e2:e6:8b",
            "net3": "d2:0f:c0:c4:c1:f7",
            "net4": "e2:c1:f1:a0:8c:72",
            "net5": "12:ba:17:7f:90:c9",
            "net6": "62:69:46:9d:ea:9e",
            "net7": "76:98:7f:19:c8:eb",
            "net8": "72:17:9a:a2:38:9f",
            "net9": "1a:9d:04:28:1e:2a"
        },
        "spine_1_1_6": {
            "net0": "22:f1:3a:84:09:34",
            "net1": "aa:26:72:c6:b7:6b",
            "net10": "de:84:10:30:45:aa",
            "net11": "3e:32:3b:a2:66:b1",
            "net12": "b6:4e:f4:54:c7:e3",
            "net13": "d2:4a:b8:e1:17:da",
            "net14": "8a:b6:15:21:f5:5b",
            "net15": "56:66:f7:05:5e:7c",
            "net16": "d2:46:25:62:95:ed",
            "net17": "9e:bc:1e:37:92:41",
            "net18": "de:4b:b2:06:f2:bd",
            "net19": "46:fb:86:1a:ae:03",
            "net2": "02:f6:a4:c1:80:07",
            "net3": "42:04:0b:84:24:dc",
            "net4": "ca:7a:2b:69:76:97",
            "net5": "e6:9d:54:66:db:2a",
            "net6": "36:d7:dc:80:57:b9",
            "net7": "c6:c0:57:65:18:75",
            "net8": "6e:f6:6a:34:f3:af",
            "net9": "c6:b4:cf:0e:c1:41"
        },
        "spine_1_1_7": {
            "net0": "c2:6d:95:83:08:ea",
            "net1": "b2:26:42:ef:95:bf",
            "net10": "42:28:4d:0e:e6:70",
            "net11": "86:83:d8:ff:48:48",
            "net12": "96:d1:4b:e9:89:26",
            "net13": "72:74:3b:9a:da:8b",
            "net14": "2a:ec:90:2d:c2:9f",
            "net15": "12:41:df:16:65:ec",
            "net16": "7a:90:63:bd:bf:7c",
            "net17": "82:53:31:ef:55:0d",
            "net18": "62:37:8d:c9:ac:7d",
            "net19": "fe:d6:6f:81:10:14",
            "net2": "aa:3e:97:79:e9:b3",
            "net3": "86:3a:68:c4:b6:fc",
            "net4": "9a:c1:7e:63:64:28",
            "net5": "9e:cf:f1:63:a0:c8",
            "net6": "aa:b1:76:4d:23:7e",
            "net7": "2e:f9:f8:06:4b:03",
            "net8": "46:27:8c:50:01:7e",
            "net9": "9a:1b:0e:3b:ec:20"
        },
        "spine_1_1_8": {
            "net0": "36:c2:d3:97:83:16",
            "net1": "92:a9:76:6f:80:75",
            "net10": "1a:3d:ba:e1:39:0e",
            "net11": "0a:53:82:21:19:59",
            "net12": "be:83:fe:fb:87:fd",
            "net13": "1e:38:4a:7a:69:50",
            "net14": "b6:ce:a7:95:1d:87",
            "net15": "8e:f9:28:81:d3:97",
            "net16": "4a:6b:18:66:5c:05",
            "net17": "22:e4:64:db:f8:d3",
            "net18": "b6:20:13:d7:8a:c1",
            "net19": "32:ee:64:7c:98:a9",
            "net2": "1a:e8:6a:30:47:15",
            "net3": "e2:ef:ae:38:1f:d7",
            "net4": "fe:6c:0a:9d:85:02",
            "net5": "a6:15:c4:0b:a5:34",
            "net6": "7e:6e:9f:ec:97:f0",
            "net7": "0e:95:d2:29:4f:3a",
            "net8": "96:e4:ad:74:dd:e2",
            "net9": "f6:b3:d5:3a:fd:d6"
        },
        "spine_1_1_9": {
            "net0": "6a:cb:b4:f4:ec:b1",
            "net1": "8a:6e:3e:d2:f1:57",
            "net10": "02:c1:d0:6d:06:43",
            "net11": "66:d0:ff:9b:13:6e",
            "net12": "26:16:cc:46:f7:80",
            "net13": "82:5a:8d:27:1d:88",
            "net14": "ba:eb:23:4e:6d:d1",
            "net15": "d6:23:9f:3d:07:38",
            "net16": "32:51:b5:5a:17:29",
            "net17": "da:ce:3d:c9:b6:cf",
            "net18": "fe:0a:e7:f8:b4:22",
            "net19": "b6:1b:fe:d8:39:ae",
            "net2": "8a:c4:3a:4e:cd:6c",
            "net3": "6e:48:3d:87:cb:0a",
            "net4": "66:73:db:71:31:97",
            "net5": "1e:52:95:f5:af:83",
            "net6": "4a:33:36:0d:24:8e",
            "net7": "2e:9c:50:9d:9d:96",
            "net8": "26:3e:1e:c2:e4:71",
            "net9": "aa:93:56:05:7e:b2"
        },
        "spine_2_1_1": {
            "net0": "52:7e:cb:64:22:7f",
            "net1": "d2:2b:f0:c0:82:a2",
            "net10": "86:8a:97:26:08:5b",
            "net11": "a6:66:57:61:bc:82",
            "net12": "7a:77:b4:f9:08:f3",
            "net13": "2e:fb:f8:6d:81:7e",
            "net14": "32:aa:fd:49:51:ad",
            "net15": "0a:1c:32:3d:d8:d3",
            "net16": "46:76:9c:aa:9a:a0",
            "net17": "52:ae:76:11:11:98",
            "net18": "9e:7d:35:38:d7:eb",
            "net19": "3a:12:05:ab:b1:93",
            "net2": "42:f9:99:0a:cc:09",
            "net3": "5a:a3:ab:b6:7f:6f",
            "net4": "fe:82:d4:cd:02:15",
            "net5": "5a:2c:24:32:f2:c7",
            "net6": "fa:aa:c9:ce:3b:36",
            "net7": "1e:81:1a:fe:4b:8a",
            "net8": "12:fb:fa:6b:52:36",
            "net9": "0e:15:c5:f5:0b:6a"
        },
        "spine_2_1_10": {
            "net0": "92:f2:50:91:49:2f",
            "net1": "76:c9:96:a7:87:dc",
            "net10": "96:1e:e4:17:14:ba",
            "net11": "7a:59:53:ec:3f:e2",
            "net12": "d2:a7:37:fd:3e:d4",
            "net13": "c2:70:37:f3:67:a9",
            "net14": "32:1e:16:a9:aa:0d",
            "net15": "aa:dc:a1:43:97:06",
            "net16": "1e:a3:a1:8a:a2:8f",
            "net17": "86:a5:a6:e1:a8:1c",
            "net18": "4e:c2:cb:10:82:0f",
            "net19": "fa:55:d7:4d:b4:80",
            "net2": "ca:40:b6:ca:69:8d",
            "net3": "96:82:45:d7:af:63",
            "net4": "1a:85:65:34:49:2e",
            "net5": "72:f8:31:79:39:a4",
            "net6": "7e:b6:93:0b:03:de",
            "net7": "7a:06:1e:86:4b:84",
            "net8": "b2:ae:d1:e4:34:3c",
            "net9": "46:95:d6:0d:ad:23"
        },
        "spine_2_1_2": {
            "net0": "02:98:e5:3e:50:55",
            "net1": "2e:6a:b6:b9:bf:ce",
            "net10": "5e:a4:f2:2a:19:dd",
            "net11": "ba:57:05:b3:4f:41",
            "net12": "66:72:5b:70:5f:93",
            "net13": "5a:77:74:df:f5:23",
            "net14": "a2:a4:4c:70:83:74",
            "net15": "7e:0b:63:b5:f3:15",
            "net16": "8a:6c:9d:93:f0:2d",
            "net17": "f6:77:eb:a8:fd:0b",
            "net18": "aa:29:32:ba:1d:aa",
            "net19": "a2:08:9d:6f:37:ab",
            "net2": "b2:2f:1b:da:b2:69",
            "net3": "02:15:27:ff:cc:57",
            "net4": "66:e2:ef:ac:bb:e9",
            "net5": "d2:0a:a0:cf:75:37",
            "net6": "72:97:3a:f4:2f:03",
            "net7": "1a:9d:a0:e4:35:6f",
            "net8": "4e:95:c8:d1:db:da",
            "net9": "62:b2:e6:60:ed:87"
        },
        "spine_2_1_3": {
            "net0": "ee:ee:a5:ee:4f:44",
            "net1": "72:92:8b:b0:95:d1",
            "net10": "22:14:8e:9b:f5:6c",
            "net11": "d6:47:dc:64:16:51",
            "net12": "e6:ed:d5:b8:2d:6d",
            "net13": "da:88:ee:39:9e:b0",
            "net14": "fa:e7:71:8a:cc:12",
            "net15": "1a:96:0d:43:91:ec",
            "net16": "de:c6:5e:c0:0c:b3",
            "net17": "36:a7:f8:a8:c4:c3",
            "net18": "fe:67:c4:47:b2:15",
            "net19": "82:bc:cd:68:8e:9c",
            "net2": "82:17:bc:f7:20:91",
            "net3": "a6:72:dc:d0:9b:2c",
            "net4": "f2:ff:0b:22:58:04",
            "net5": "e6:46:96:96:ce:e3",
            "net6": "5e:78:df:eb:bf:b4",
            "net7": "1e:f0:74:ed:64:2c",
            "net8": "ea:a4:f1:6b:e4:66",
            "net9": "42:02:cc:5f:f9:bc"
        },
        "spine_2_1_4": {
            "net0": "c2:9e:fd:e0:91:99",
            "net1": "06:41:1f:a6:8a:89",
            "net10": "ae:e5:d8:be:fd:df",
            "net11": "d2:a1:d3:f6:19:e5",
            "net12": "8a:d3:b7:bc:bd:01",
            "net13": "5e:03:ff:51:ca:63",
            "net14": "02:ab:22:6c:0a:e5",
            "net15": "8a:53:67:6e:19:99",
            "net16": "62:33:18:d3:d2:19",
            "net17": "42:93:16:6c:64:7d",
            "net18": "3e:2b:62:c3:98:10",
            "net19": "b2:7e:f5:1a:2a:fa",
            "net2": "62:6b:bd:ac:07:d5",
            "net3": "1e:25:21:11:ee:e9",
            "net4": "e6:35:2c:71:b7:2e",
            "net5": "d2:86:7c:8d:aa:f3",
            "net6": "5e:cc:62:37:d4:e7",
            "net7": "e6:73:25:ee:54:ee",
            "net8": "fe:5f:ae:4f:48:e8",
            "net9": "36:bd:1f:b2:6d:ca"
        },
        "spine_2_1_5": {
            "net0": "e6:52:70:bf:21:37",
            "net1": "de:ef:be:c1:31:21",
            "net10": "f2:1a:37:76:cb:de",
            "net11": "a6:ec:98:ad:a6:91",
            "net12": "8a:a6:76:dc:cf:41",
            "net13": "2e:95:04:9b:8b:88",
            "net14": "22:a8:0e:74:72:35",
            "net15": "ea:3c:be:f2:b7:91",
            "net16": "96:26:5f:7e:1e:a6",
            "net17": "ba:8e:96:15:0d:38",
            "net18": "a2:83:59:f2:23:0a",
            "net19": "9a:a7:ab:26:53:56",
            "net2": "4a:40:e2:1a:59:21",
            "net3": "b6:ac:da:5c:be:29",
            "net4": "ca:36:20:cd:c1:ab",
            "net5": "42:d4:aa:aa:61:90",
            "net6": "c6:75:07:e7:2b:fe",
            "net7": "4e:53:69:e5:3b:81",
            "net8": "9e:00:94:64:e5:9a",
            "net9": "ce:de:55:ee:17:eb"
        },
        "spine_2_1_6": {
            "net0": "0e:da:6a:3c:b5:a7",
            "net1": "56:c9:37:32:a6:c0",
            "net10": "66:3e:bb:23:52:c7",
            "net11": "b6:a3:4c:41:84:92",
            "net12": "ca:ea:c1:b3:8f:a5",
            "net13": "5e:77:05:a5:e0:d2",
            "net14": "ba:f8:ed:d9:59:63",
            "net15": "9a:6f:14:64:1e:ea",
            "net16": "ae:13:c6:6a:ab:41",
            "net17": "3a:90:ea:a2:e2:3d",
            "net18": "e6:67:78:70:21:ec",
            "net19": "c6:75:84:3a:1f:85",
            "net2": "0a:65:02:b6:58:7e",
            "net3": "82:49:53:71:82:0c",
            "net4": "1e:63:88:f4:ab:c9",
            "net5": "ca:e4:8e:72:d6:a6",
            "net6": "26:35:b8:cb:06:5e",
            "net7": "26:0a:12:87:a1:d7",
            "net8": "b2:85:dc:88:c6:d0",
            "net9": "0e:b1:c1:a4:2c:82"
        },
        "spine_2_1_7": {
            "net0": "ca:ec:f2:e4:f5:4b",
            "net1": "b6:52:64:88:da:1d",
            "net10": "8a:53:f2:b9:44:56",
            "net11": "de:80:92:c4:56:c0",
            "net12": "c2:d4:07:34:0f:fe",
            "net13": "7a:ce:ad:ed:91:ee",
            "net14": "0a:7b:f8:86:c0:66",
            "net15": "f2:bb:15:27:5c:a3",
            "net16": "ea:d7:40:d9:4c:d9",
            "net17": "02:ee:05:36:43:09",
            "net18": "3e:19:d0:c0:96:fd",
            "net19": "0e:ec:35:70:24:62",
            "net2": "5e:58:11:f0:37:09",
            "net3": "66:41:59:8c:5b:4a",
            "net4": "5a:f7:14:78:a2:29",
            "net5": "36:81:99:12:7c:3f",
            "net6": "56:23:c0:a6:2a:fa",
            "net7": "e2:7d:93:75:be:70",
            "net8": "5e:2a:ff:3c:b9:d9",
            "net9": "be:96:79:41:82:86"
        },
        "spine_2_1_8": {
            "net0": "e6:bd:bd:6f:4f:17",
            "net1": "9a:1d:00:17:be:4f",
            "net10": "fe:83:7e:48:65:f9",
            "net11": "42:85:5e:71:ab:f9",
            "net12": "6a:32:0a:ef:22:d5",
            "net13": "e6:80:6a:1e:4a:c9",
            "net14": "2a:8d:63:e4:7d:7e",
            "net15": "1a:ca:76:c7:2d:48",
            "net16": "4e:94:4e:5b:e4:09",
            "net17": "86:00:a8:f4:24:0b",
            "net18": "5a:98:0e:ab:48:39",
            "net19": "f6:b1:7f:e1:11:7c",
            "net2": "62:76:33:0d:c2:75",
            "net3": "c2:91:59:ca:fd:cb",
            "net4": "b6:f4:38:59:84:8e",
            "net5": "fe:d5:d0:21:3c:ff",
            "net6": "ae:26:69:15:37:cf",
            "net7": "9a:5a:64:56:46:13",
            "net8": "a6:66:61:86:eb:85",
            "net9": "56:91:a9:9d:f7:31"
        },
        "spine_2_1_9": {
            "net0": "62:40:16:76:52:ee",
            "net1": "96:15:9b:d5:d4:f7",
            "net10": "ae:58:ee:86:88:9a",
            "net11": "6e:16:2e:0b:9f:ec",
            "net12": "ce:b8:f4:65:8c:5c",
            "net13": "22:39:75:ea:f1:71",
            "net14": "52:88:3b:ff:70:33",
            "net15": "7e:2a:e3:aa:c1:b1",
            "net16": "72:62:89:22:3c:ff",
            "net17": "8e:ce:fe:9d:cc:8f",
            "net18": "3e:4c:2f:0c:40:b1",
            "net19": "4a:61:1e:30:ec:80",
            "net2": "3a:15:d5:e9:77:fb",
            "net3": "0a:94:90:43:2a:ae",
            "net4": "1e:1e:c3:26:20:b8",
            "net5": "fa:2a:40:28:f2:01",
            "net6": "6a:4e:81:61:51:eb",
            "net7": "22:19:0f:b1:26:2a",
            "net8": "96:01:6c:b5:cf:cc",
            "net9": "06:f6:d3:5f:1c:bf"
        },
        "tof_1_2_1": {
            "net0": "ce:e7:04:2f:8a:09",
            "net1": "f6:60:f9:84:64:44",
            "net10": "16:95:45:74:98:0a",
            "net11": "3a:a3:8a:86:c4:b5",
            "net12": "5e:6e:f6:d2:23:e7",
            "net13": "b2:5a:f9:90:0e:0e",
            "net14": "e2:34:98:e5:a8:e1",
            "net15": "c2:7c:4f:1f:3e:b1",
            "net16": "72:d4:99:d3:fb:7b",
            "net17": "52:68:d5:30:d6:b7",
            "net18": "3a:09:1a:06:11:67",
            "net19": "2a:0a:7e:8c:8f:e9",
            "net2": "da:14:93:a8:dc:46",
            "net3": "a2:e3:4e:27:83:03",
            "net4": "7a:e3:2a:52:ad:56",
            "net5": "2e:55:f7:4d:6f:5d",
            "net6": "e6:fc:c8:53:87:8b",
            "net7": "6a:f7:65:49:0b:db",
            "net8": "e2:06:83:d6:a6:91",
            "net9": "9e:76:ea:42:01:bf"
        },
        "tof_1_2_10": {
            "net0": "ca:16:ef:30:ff:d0",
            "net1": "72:73:bb:d4:3c:23",
            "net10": "9e:12:69:9e:2a:01",
            "net11": "56:4a:5c:00:4f:0f",
            "net12": "ee:96:29:17:2f:1d",
            "net13": "ea:b6:e8:50:bd:06",
            "net14": "e6:7c:2f:52:5a:59",
            "net15": "1a:cf:9f:9d:27:37",
            "net16": "76:57:dc:2a:c7:63",
            "net17": "2e:85:9d:18:4e:b4",
            "net18": "9a:1a:5f:a8:b9:f4",
            "net19": "f6:6c:f5:c9:7a:5d",
            "net2": "42:a6:63:71:ff:ab",
            "net3": "7e:83:7d:c4:4c:5c",
            "net4": "f2:df:b4:07:23:60",
            "net5": "ea:33:3b:5f:1a:40",
            "net6": "d2:28:0e:7e:a3:b9",
            "net7": "76:71:fb:83:ac:be",
            "net8": "d6:64:f5:05:44:b6",
            "net9": "1a:51:7e:bb:0b:85"
        },
        "tof_1_2_2": {
            "net0": "c6:3e:75:ad:b7:80",
            "net1": "ea:e2:9d:a2:7a:6b",
            "net10": "62:ba:b8:32:33:4d",
            "net11": "62:31:ef:d8:e2:48",
            "net12": "5a:78:f9:fd:75:cc",
            "net13": "8e:29:7e:e8:e7:ef",
            "net14": "06:29:ef:b0:c3:bc",
            "net15": "06:ca:23:45:1b:da",
            "net16": "b2:4d:f9:d7:1e:3f",
            "net17": "e2:d6:e8:6e:6b:c7",
            "net18": "ba:15:f0:22:69:f5",
            "net19": "da:fb:c9:c0:5e:b3",
            "net2": "e6:e4:ba:ca:31:06",
            "net3": "3e:02:8d:94:1d:bb",
            "net4": "ea:d8:0f:a1:1c:8a",
            "net5": "82:86:f8:cc:6d:56",
            "net6": "3a:52:e9:c4:f1:bc",
            "net7": "46:ee:1a:64:30:34",
            "net8": "7a:25:39:a0:1e:3e",
            "net9": "fe:85:1d:7f:a9:d5"
        },
        "tof_1_2_3": {
            "net0": "b2:d5:04:fe:77:47",
            "net1": "a2:68:fe:08:28:ca",
            "net10": "e6:bd:9b:db:61:cf",
            "net11": "92:78:b6:f6:02:59",
            "net12": "62:c5:68:87:55:d5",
            "net13": "5a:9f:17:4d:fc:cc",
            "net14": "be:51:17:f9:97:71",
            "net15": "f6:ac:7e:29:71:b7",
            "net16": "c6:4d:b3:97:72:7a",
            "net17": "4a:57:d8:19:46:34",
            "net18": "2a:d1:c4:93:f5:0e",
            "net19": "fa:d2:06:a2:1a:37",
            "net2": "5a:f9:9a:68:09:bb",
            "net3": "e2:36:87:9f:c5:00",
            "net4": "b2:04:0e:6a:b2:f7",
            "net5": "e6:24:91:7a:e9:61",
            "net6": "b2:b7:97:35:6a:2c",
            "net7": "2e:f2:f7:c8:d3:ef",
            "net8": "6a:4f:13:6b:d6:2a",
            "net9": "d6:8e:61:f5:36:fc"
        },
        "tof_1_2_4": {
            "net0": "9a:87:cc:4d:98:8a",
            "net1": "62:4b:02:19:21:71",
            "net10": "5e:56:b3:28:9d:a2",
            "net11": "7a:1b:21:55:a8:a8",
            "net12": "ea:b8:57:22:f1:e4",
            "net13": "06:74:27:d3:b1:a5",
            "net14": "ca:87:f4:30:b6:56",
            "net15": "b6:6f:9b:76:c5:19",
            "net16": "6a:89:7a:fb:1c:b0",
            "net17": "5e:9b:79:6a:fe:ba",
            "net18": "ca:d7:33:00:8b:29",
            "net19": "46:45:a9:e9:9f:cc",
            "net2": "da:6c:aa:00:0e:c0",
            "net3": "32:44:06:e4:90:87",
            "net4": "5e:0d:d6:01:ce:0a",
            "net5": "de:7d:68:49:2a:9f",
            "net6": "82:46:d3:e2:64:4b",
            "net7": "22:d5:3c:81:3b:7c",
            "net8": "ea:17:ab:2e:05:9a",
            "net9": "66:be:55:00:c7:3a"
        },
        "tof_1_2_5": {
            "net0": "7a:60:e9:ff:6a:9f",
            "net1": "02:d1:71:c9:d5:76",
            "net10": "56:4d:34:bd:66:8f",
            "net11": "d6:68:01:7d:88:0e",
            "net12": "e6:be:38:44:ca:5f",
            "net13": "6a:ff:14:85:17:13",
            "net14": "12:48:6d:65:0e:5b",
            "net15": "92:ef:d6:e1:2f:8e",
            "net16": "ca:dc:47:01:e3:d1",
            "net17": "36:6f:03:01:2c:cf",
            "net18": "f2:d7:06:2c:77:65",
            "net19": "2a:d5:8b:36:10:ef",
            "net2": "b6:8f:8a:5f:2e:6f",
            "net3": "5e:d7:6e:b1:d0:d7",
            "net4": "7a:a5:a1:1d:2a:cf",
            "net5": "c6:be:cd:96:f5:d9",
            "net6": "f6:a1:e9:04:45:90",
            "net7": "32:0a:bb:91:d8:b7",
            "net8": "06:f4:c1:81:1a:c3",
            "net9": "fa:f5:07:90:16:52"
        },
        "tof_1_2_6": {
            "net0": "ea:5e:d5:87:a3:26",
            "net1": "5e:d0:25:05:3a:9b",
            "net10": "06:16:f6:af:5d:a3",
            "net11": "16:8f:21:f7:b0:24",
            "net12": "6e:1c:3c:5c:eb:6f",
            "net13": "6e:98:db:5b:db:2d",
            "net14": "be:88:f9:17:11:39",
            "net15": "8a:f1:06:b3:4d:c6",
            "net16": "46:89:12:20:f4:2c",
            "net17": "46:03:bc:93:19:58",
            "net18": "7e:35:da:a7:25:fc",
            "net19": "d2:0d:3d:28:e2:78",
            "net2": "12:8d:e1:58:bf:c5",
            "net3": "5e:59:42:a0:36:e9",
            "net4": "7a:f1:c8:05:82:ff",
            "net5": "0e:ca:25:33:85:cf",
            "net6": "5e:fb:11:02:5d:10",
            "net7": "62:6a:08:10:bf:7e",
            "net8": "ea:49:b3:eb:52:22",
            "net9": "ba:39:ab:21:07:c3"
        },
        "tof_1_2_7": {
            "net0": "6a:12:90:3f:c7:f9",
            "net1": "12:6d:48:69:85:eb",
            "net10": "d6:b5:10:45:d9:90",
            "net11": "32:12:6c:c7:cd:c7",
            "net12": "42:a1:8d:60:bf:60",
            "net13": "f6:f0:4a:17:8b:d4",
            "net14": "6e:fe:f2:4e:af:e3",
            "net15": "42:0a:1a:2d:26:b7",
            "net16": "be:b0:04:ef:b6:58",
            "net17": "3a:88:24:8d:bf:a4",
            "net18": "ea:76:e7:7a:ac:42",
            "net19": "06:4f:c8:ba:0b:2c",
            "net2": "8e:e4:ae:66:3f:93",
            "net3": "22:3a:7e:81:d4:ba",
            "net4": "06:fd:33:e6:e6:c1",
            "net5": "72:ff:dd:0a:e7:77",
            "net6": "5a:bc:43:d2:a0:55",
            "net7": "52:91:d6:da:77:42",
            "net8": "a2:4b:0a:b8:96:ea",
            "net9": "a6:70:69:61:28:92"
        },
        "tof_1_2_8": {
            "net0": "9e:aa:dd:69:4c:19",
            "net1": "c2:58:bd:86:b3:35",
            "net10": "02:66:0a:eb:ce:1e",
            "net11": "06:de:62:20:88:33",
            "net12": "7a:3e:12:31:e6:8a",
            "net13": "3a:4e:e7:98:b5:cf",
            "net14": "7e:52:9e:0f:ea:26",
            "net15": "e6:80:5f:d9:0f:6f",
            "net16": "f2:0f:74:c4:10:bb",
            "net17": "42:3a:ee:04:8b:a6",
            "net18": "3e:2c:3b:f1:05:ee",
            "net19": "6a:b6:e9:22:64:8f",
            "net2": "4a:f0:53:53:fa:0d",
            "net3": "7a:cc:17:0d:02:bb",
            "net4": "2a:b4:3d:80:8e:8c",
            "net5": "2e:67:e9:9f:bc:11",
            "net6": "ae:79:32:6e:55:d1",
            "net7": "72:db:ce:c7:a7:b6",
            "net8": "76:ea:e0:c1:47:1b",
            "net9": "ca:e9:77:0e:2d:91"
        },
        "tof_1_2_9": {
            "net0": "8e:9d:a8:1a:f5:a9",
            "net1": "76:b6:e7:70:04:73",
            "net10": "c6:da:6e:59:e2:32",
            "net11": "62:c1:04:76:99:b2",
            "net12": "0e:2e:d9:17:62:eb",
            "net13": "3a:c0:bc:2e:eb:fd",
            "net14": "1e:79:cb:d0:ce:f7",
            "net15": "5e:bf:66:69:9a:0d",
            "net16": "7e:92:b1:d0:15:2c",
            "net17": "da:9e:4e:ae:c4:29",
            "net18": "76:ee:72:0d:b2:8b",
            "net19": "36:56:29:cf:6c:c6",
            "net2": "32:52:81:01:05:f5",
            "net3": "2e:92:16:ae:3c:3d",
            "net4": "02:96:70:57:90:9f",
            "net5": "b2:a2:6f:d3:79:e5",
            "net6": "72:79:96:0a:b3:c6",
            "net7": "ee:e2:0c:84:7d:6a",
            "net8": "06:c7:b4:34:a4:dd",
            "net9": "02:2c:1b:6d:0b:e5"
        }
    },
    "failed_machine": "leaf_1_0_1",
    "failure_time": 1613163889.0486448
}