{
    "description": "Scenario 3a: Leaf leaf_1_0_1 failure with BGP",
    "k_leaf": 14,
    "k_top": 14,
    "redundancy_factor": 14,
    "is_k8s": true,
    "machine_mac_addresses": {
        "leaf_1_0_1": {
            "net0": "e2:93:d6:88:14:61",
            "net1": "c6:99:13:c7:7d:07",
            "net10": "82:8e:e8:56:40:92",
            "net11": "ea:80:a1:30:de:52",
            "net12": "ee:da:f9:98:cd:29",
            "net13": "76:22:05:19:8d:1e",
            "net14": "d6:8b:0e:ef:94:31",
            "net2": "56:fb:e4:f9:93:3b",
            "net3": "ca:b0:de:cc:69:9e",
            "net4": "0e:8e:61:da:d2:1c",
            "net5": "ca:bf:f9:61:20:8b",
            "net6": "9e:6a:ef:93:f7:7a",
            "net7": "ee:47:22:c4:79:70",
            "net8": "0e:90:57:39:e4:e2",
            "net9": "f6:f4:fe:65:94:05"
        },
        "leaf_1_0_10": {
            "net0": "8a:98:5b:5b:36:fe",
            "net1": "a2:f0:fe:4e:02:b6",
            "net10": "7e:25:8f:d0:a0:18",
            "net11": "7e:48:2b:5f:b9:0c",
            "net12": "72:90:3d:e4:62:cf",
            "net13": "a6:08:fa:5c:b1:2c",
            "net14": "ae:99:85:0e:d3:00",
            "net2": "26:64:0e:f3:1d:63",
            "net3": "02:c8:c5:ea:01:51",
            "net4": "96:17:ec:c5:11:00",
            "net5": "6e:92:0e:3c:5f:95",
            "net6": "ce:c3:e9:d9:10:fe",
            "net7": "0e:a8:bc:48:2a:7b",
            "net8": "02:47:dd:2f:0a:b0",
            "net9": "6a:2b:6d:26:62:fa"
        },
        "leaf_1_0_11": {
            "net0": "92:81:73:cb:f1:b0",
            "net1": "da:25:28:2f:d3:6e",
            "net10": "e6:48:2c:c2:d5:41",
            "net11": "9e:90:f9:4a:d3:09",
            "net12": "b2:28:85:3a:0a:e9",
            "net13": "72:02:94:fd:22:0e",
            "net14": "e2:62:1e:2b:a5:a6",
            "net2": "b6:00:31:fb:ca:38",
            "net3": "5e:32:a3:76:65:8b",
            "net4": "6a:2f:12:69:03:04",
            "net5": "ea:b6:c0:68:ff:90",
            "net6": "7e:1d:20:6f:ba:9e",
            "net7": "de:8f:94:14:5e:c9",
            "net8": "52:2f:ba:7b:a9:cf",
            "net9": "c2:c2:26:00:39:99"
        },
        "leaf_1_0_12": {
            "net0": "b2:06:2c:29:96:df",
            "net1": "7a:fd:d3:49:20:59",
            "net10": "8a:b5:ab:68:2a:d1",
            "net11": "c2:74:5f:62:0f:7d",
            "net12": "72:0a:a0:81:f7:89",
            "net13": "96:3d:1f:41:f7:b1",
            "net14": "fe:2f:07:44:9b:e7",
            "net2": "7e:b0:09:90:cb:7a",
            "net3": "82:28:2d:c5:2e:77",
            "net4": "46:15:b3:13:c7:e5",
            "net5": "7a:4f:66:9b:d4:19",
            "net6": "fe:39:ea:46:d5:ca",
            "net7": "be:6a:0e:f3:42:e8",
            "net8": "4a:8f:df:87:c3:93",
            "net9": "86:fa:f3:85:9a:07"
        },
        "leaf_1_0_13": {
            "net0": "3e:12:72:e6:ba:a2",
            "net1": "ea:a8:5e:7d:1b:d8",
            "net10": "1a:55:cf:08:43:91",
            "net11": "3e:24:76:bf:2f:0e",
            "net12": "ee:e8:65:30:06:27",
            "net13": "6e:3f:7e:9c:49:63",
            "net14": "c2:9b:a8:ff:18:c2",
            "net2": "72:e6:34:f0:10:ca",
            "net3": "22:0e:d4:b7:18:7d",
            "net4": "be:9f:84:85:a6:93",
            "net5": "2a:70:70:4d:60:bb",
            "net6": "06:5e:b3:bc:4f:6c",
            "net7": "16:a2:e8:4f:c6:3f",
            "net8": "96:ee:50:a5:03:da",
            "net9": "02:95:cf:37:b8:e9"
        },
        "leaf_1_0_14": {
            "net0": "d2:aa:1d:40:3d:ba",
            "net1": "e6:ed:6c:2c:25:2c",
            "net10": "fe:d3:85:2d:67:b8",
            "net11": "0e:3f:88:c7:7b:40",
            "net12": "ca:e8:a3:bb:c1:22",
            "net13": "32:be:49:08:9d:43",
            "net14": "5a:32:e4:f3:2f:a7",
            "net2": "a2:d5:b7:77:e4:fd",
            "net3": "be:82:ed:fc:43:c9",
            "net4": "fa:44:c8:37:42:02",
            "net5": "e2:96:28:f6:79:c2",
            "net6": "7e:1d:70:cf:06:50",
            "net7": "c2:37:35:51:b4:7e",
            "net8": "86:17:6e:7f:32:6c",
            "net9": "66:fb:bc:7f:10:97"
        },
        "leaf_1_0_2": {
            "net0": "c2:21:34:ed:84:8b",
            "net1": "02:51:5b:49:72:a6",
            "net10": "c6:47:43:0c:85:b1",
            "net11": "22:d4:e0:90:21:5b",
            "net12": "2e:13:7f:e1:29:3d",
            "net13": "96:da:3e:29:b7:8f",
            "net14": "ee:79:28:fa:10:aa",
            "net2": "ae:4e:88:89:7e:8a",
            "net3": "7a:6b:2f:73:a1:fb",
            "net4": "96:07:bb:76:33:e2",
            "net5": "0a:a4:bc:29:1d:5f",
            "net6": "2a:a9:91:6e:26:b5",
            "net7": "4a:83:a2:b5:4a:f1",
            "net8": "de:a0:cf:1c:06:23",
            "net9": "66:93:b3:2d:52:7f"
        },
        "leaf_1_0_3": {
            "net0": "5e:8a:df:d2:de:89",
            "net1": "ee:6d:1b:f9:99:ae",
            "net10": "0e:04:29:fe:59:69",
            "net11": "02:53:04:d4:a2:57",
            "net12": "22:70:25:ea:fc:20",
            "net13": "d2:e4:5b:ae:3c:11",
            "net14": "62:c4:fb:f6:99:20",
            "net2": "7a:f2:77:7d:d6:56",
            "net3": "82:9c:c0:ce:b9:e8",
            "net4": "2a:50:01:3c:e1:5d",
            "net5": "6a:4c:6f:5d:58:2d",
            "net6": "2a:d7:a4:e5:2b:49",
            "net7": "96:18:14:b9:58:ca",
            "net8": "8e:7c:93:31:7b:5b",
            "net9": "92:a0:a2:7b:cc:d8"
        },
        "leaf_1_0_4": {
            "net0": "2e:f7:5f:dc:a1:ff",
            "net1": "3e:1f:91:eb:2d:ee",
            "net10": "86:5b:48:b2:63:94",
            "net11": "76:2c:9b:0e:f2:16",
            "net12": "82:64:34:4f:1c:3f",
            "net13": "ce:81:1a:1d:00:02",
            "net14": "26:02:e6:20:b8:c1",
            "net2": "e6:a5:14:66:49:19",
            "net3": "b2:3a:da:8c:7c:80",
            "net4": "7a:7e:c2:50:a3:d5",
            "net5": "4e:9e:eb:3a:05:4b",
            "net6": "5a:52:c9:8d:a1:1c",
            "net7": "76:e5:4a:66:41:ff",
            "net8": "ea:ee:2b:37:df:4e",
            "net9": "f2:c3:62:1e:61:bc"
        },
        "leaf_1_0_5": {
            "net0": "82:64:21:66:36:11",
            "net1": "c6:1f:29:6b:ed:c0",
            "net10": "2e:ab:71:14:82:81",
            "net11": "86:ed:f4:84:f7:3a",
            "net12": "a6:87:6c:28:17:13",
            "net13": "52:66:93:4e:fe:8d",
            "net14": "52:09:61:c5:9d:60",
            "net2": "42:7d:45:94:4a:c6",
            "net3": "26:b8:d4:84:60:b6",
            "net4": "ee:ca:d4:91:f1:57",
            "net5": "3a:27:fb:8c:3b:ec",
            "net6": "12:6c:a2:15:98:da",
            "net7": "ce:8d:21:1c:96:3a",
            "net8": "aa:6e:60:c7:b5:37",
            "net9": "6e:d9:55:b4:b1:88"
        },
        "leaf_1_0_6": {
            "net0": "5a:4f:c2:0e:ad:92",
            "net1": "8e:5b:a2:04:50:0f",
            "net10": "d2:02:c1:07:65:0e",
            "net11": "d6:17:ce:fd:37:76",
            "net12": "aa:62:aa:6e:ae:8a",
            "net13": "0e:f4:7a:cd:42:0e",
            "net14": "7a:f5:b0:07:be:de",
            "net2": "0e:f1:1e:07:d7:77",
            "net3": "12:2c:37:6a:94:af",
            "net4": "9a:57:ac:f8:2a:97",
            "net5": "e2:46:99:5b:9f:d4",
            "net6": "ee:0d:89:fa:a5:bc",
            "net7": "5a:47:fc:3c:e2:4a",
            "net8": "12:67:b6:68:1a:5e",
            "net9": "c2:fa:52:98:e4:3c"
        },
        "leaf_1_0_7": {
            "net0": "0a:72:da:e5:22:91",
            "net1": "5e:99:a2:be:12:17",
            "net10": "e6:e6:6c:d9:e4:b3",
            "net11": "8a:6b:5c:3c:e5:35",
            "net12": "46:f6:34:a8:6f:b0",
            "net13": "fa:e6:3f:ef:41:f5",
            "net14": "e2:8e:97:c4:ce:a8",
            "net2": "b6:61:3d:d2:64:fc",
            "net3": "2e:df:0c:55:aa:21",
            "net4": "02:cc:94:90:eb:68",
            "net5": "0e:fa:56:f5:fd:2f",
            "net6": "76:89:1c:6b:70:a4",
            "net7": "e2:6c:21:8e:60:6c",
            "net8": "3a:b4:54:49:51:fc",
            "net9": "5e:38:09:43:4f:9e"
        },
        "leaf_1_0_8": {
            "net0": "9a:7c:e5:84:9f:a1",
            "net1": "5e:28:f2:73:4d:9b",
            "net10": "1e:ba:1a:9e:54:78",
            "net11": "1e:19:c0:e1:fb:3c",
            "net12": "62:6a:f9:a3:c5:83",
            "net13": "7e:1a:2e:ba:3a:f0",
            "net14": "82:7f:34:79:1f:78",
            "net2": "1a:30:3f:76:02:8a",
            "net3": "e2:3d:f9:d7:c6:03",
            "net4": "b6:aa:9e:bb:b3:a2",
            "net5": "c2:4b:61:64:59:d9",
            "net6": "1a:dc:27:9e:1f:bc",
            "net7": "6e:a5:66:7d:0f:6a",
            "net8": "a6:be:79:b2:94:f6",
            "net9": "7a:0f:81:18:d9:f8"
        },
        "leaf_1_0_9": {
            "net0": "4a:6e:4e:79:a4:34",
            "net1": "c6:ca:b4:37:b2:d6",
            "net10": "36:92:17:88:00:95",
            "net11": "36:20:cc:d3:e4:3e",
            "net12": "72:04:94:aa:fe:24",
            "net13": "06:64:7a:e3:23:77",
            "net14": "06:8b:9f:ab:e3:0b",
            "net2": "6a:39:5c:bc:4c:94",
            "net3": "e2:d0:3c:08:0b:98",
            "net4": "06:cd:ad:b6:eb:69",
            "net5": "4a:2c:4f:f1:d6:00",
            "net6": "e2:90:ff:4e:9a:5e",
            "net7": "2e:51:45:83:2b:38",
            "net8": "16:e3:54:e1:98:63",
            "net9": "6e:dd:72:52:51:09"
        },
        "leaf_2_0_1": {
            "net0": "e2:8f:f3:e4:bb:3a",
            "net1": "56:03:19:b0:51:ca",
            "net10": "12:fd:0e:c1:31:33",
            "net11": "92:25:82:2c:48:e9",
            "net12": "be:b7:0d:1e:cf:29",
            "net13": "e2:59:e9:57:2b:92",
            "net14": "ba:6d:56:5b:ca:55",
            "net2": "82:2a:f0:8d:27:e3",
            "net3": "aa:63:bb:1c:14:0a",
            "net4": "86:5b:27:f6:d7:07",
            "net5": "ee:d3:f4:60:7a:63",
            "net6": "de:96:fe:de:b4:62",
            "net7": "d6:f8:fe:4f:a5:0c",
            "net8": "12:bd:91:2f:89:98",
            "net9": "f2:c7:59:ee:24:5d"
        },
        "leaf_2_0_10": {
            "net0": "8a:67:c0:41:86:53",
            "net1": "2e:0f:2b:3c:a6:ad",
            "net10": "86:01:6d:9d:04:f7",
            "net11": "22:d2:49:c6:aa:90",
            "net12": "56:2e:98:70:0e:10",
            "net13": "c2:a3:00:05:36:f2",
            "net14": "ae:1d:55:cb:11:22",
            "net2": "62:2c:97:5b:5d:fd",
            "net3": "0e:f0:f0:db:b4:bc",
            "net4": "3e:af:05:5d:e2:da",
            "net5": "26:1b:25:7b:d0:93",
            "net6": "82:67:43:62:60:8f",
            "net7": "22:2c:68:9b:ca:49",
            "net8": "5e:17:c8:bc:3c:3b",
            "net9": "ee:26:30:71:ff:ab"
        },
        "leaf_2_0_11": {
            "net0": "26:3a:d4:61:d3:3f",
            "net1": "1e:69:45:f4:ff:68",
            "net10": "ce:da:44:a4:7a:a8",
            "net11": "f6:50:ad:4a:3e:13",
            "net12": "2e:27:2c:6a:db:b2",
            "net13": "b2:01:90:e0:2e:99",
            "net14": "3a:96:ec:21:db:2c",
            "net2": "e6:1d:a4:3b:06:5a",
            "net3": "be:5c:6b:53:de:9e",
            "net4": "26:34:7a:a1:c8:9a",
            "net5": "fa:bb:42:f5:2b:ba",
            "net6": "26:82:52:67:de:2c",
            "net7": "92:82:a9:1f:b9:ee",
            "net8": "0a:32:ad:62:6d:72",
            "net9": "52:fe:c4:bf:77:80"
        },
        "leaf_2_0_12": {
            "net0": "86:67:11:fa:bf:88",
            "net1": "12:47:60:9e:25:3d",
            "net10": "8a:b1:b6:69:69:cf",
            "net11": "02:ce:9c:3e:5e:54",
            "net12": "42:42:1d:d1:c1:07",
            "net13": "36:0e:2b:dd:9b:32",
            "net14": "e6:53:04:c2:6f:ef",
            "net2": "26:bb:8c:69:dd:4e",
            "net3": "26:c2:07:c1:cf:c3",
            "net4": "16:95:23:f0:f4:04",
            "net5": "1e:7f:02:ac:c7:43",
            "net6": "d2:bd:b3:13:f1:c2",
            "net7": "fe:5b:86:31:d3:59",
            "net8": "22:ec:72:74:50:be",
            "net9": "a6:47:8f:45:34:5f"
        },
        "leaf_2_0_13": {
            "net0": "6a:a4:db:35:4d:cb",
            "net1": "06:f5:24:8f:62:38",
            "net10": "8e:9a:4a:05:de:94",
            "net11": "f6:8c:a8:56:43:00",
            "net12": "0a:27:d5:41:84:0e",
            "net13": "7e:c9:f5:c4:9f:5c",
            "net14": "5a:84:b7:63:60:49",
            "net2": "a2:8b:23:b5:de:3a",
            "net3": "72:76:3d:99:81:56",
            "net4": "9e:8e:d8:da:ed:e5",
            "net5": "a2:41:01:a8:54:87",
            "net6": "d6:c5:25:84:19:01",
            "net7": "5a:1c:8c:3b:94:f1",
            "net8": "c6:c2:31:ef:20:cb",
            "net9": "b2:ea:cf:e6:07:f6"
        },
        "leaf_2_0_14": {
            "net0": "a6:f1:0a:8c:ad:85",
            "net1": "c2:19:78:ac:cf:fd",
            "net10": "b2:fc:8f:32:af:1e",
            "net11": "b2:8e:38:5a:85:78",
            "net12": "82:70:1d:40:d0:4e",
            "net13": "fa:28:d7:97:7d:6d",
            "net14": "5a:23:ad:6f:c5:aa",
            "net2": "2a:1b:ec:a7:f4:c5",
            "net3": "ae:2b:e0:d4:a3:80",
            "net4": "16:9e:9c:1d:ac:d5",
            "net5": "46:fb:df:70:3a:d3",
            "net6": "c6:43:c7:9c:16:df",
            "net7": "76:8f:87:3d:d9:28",
            "net8": "ca:8d:a0:df:92:1c",
            "net9": "0a:d5:ba:ed:5a:ab"
        },
        "leaf_2_0_2": {
            "net0": "52:7a:a5:86:49:3d",
            "net1": "8a:f7:79:eb:55:6b",
            "net10": "92:5a:83:2a:39:2e",
            "net11": "36:e0:ad:38:43:0d",
            "net12": "8e:ef:be:62:fe:fe",
            "net13": "fa:4f:8f:b7:45:3e",
            "net14": "b2:d4:d4:a0:c7:58",
            "net2": "b6:1e:66:d0:4b:30",
            "net3": "f6:e1:7b:77:27:90",
            "net4": "e6:7d:c2:e9:c6:b2",
            "net5": "ca:44:cf:98:db:2a",
            "net6": "7e:a1:6d:7b:28:07",
            "net7": "aa:60:c1:dd:66:14",
            "net8": "82:f6:72:bb:72:0c",
            "net9": "e2:f2:77:7f:5c:12"
        },
        "leaf_2_0_3": {
            "net0": "3e:c8:a6:17:42:84",
            "net1": "9e:f3:43:84:ab:5a",
            "net10": "06:ea:0b:1c:e5:95",
            "net11": "a2:26:7f:62:1c:fa",
            "net12": "96:cd:2e:60:c4:db",
            "net13": "fa:2e:83:8e:21:28",
            "net14": "7e:17:11:62:68:52",
            "net2": "46:0b:a4:76:78:47",
            "net3": "7e:e8:08:51:59:1c",
            "net4": "2a:37:68:71:a6:ae",
            "net5": "4a:0e:37:57:4f:e0",
            "net6": "b6:77:05:83:24:d0",
            "net7": "02:56:e8:70:a3:44",
            "net8": "ce:78:66:6b:9c:2a",
            "net9": "fa:c1:24:86:26:67"
        },
        "leaf_2_0_4": {
            "net0": "86:c0:55:9d:9f:45",
            "net1": "de:b0:df:77:eb:e6",
            "net10": "32:20:24:75:9d:5a",
            "net11": "62:be:ee:3e:a3:44",
            "net12": "1a:0c:b0:44:8b:9f",
            "net13": "82:23:f3:47:1d:f0",
            "net14": "9e:df:97:ce:be:46",
            "net2": "22:27:62:b3:f0:64",
            "net3": "9e:7f:12:c4:20:86",
            "net4": "8a:fe:31:6b:73:5b",
            "net5": "da:51:1c:21:35:ce",
            "net6": "8a:34:4d:7a:36:50",
            "net7": "46:fa:42:56:19:8f",
            "net8": "92:9a:36:45:f6:7d",
            "net9": "92:f3:62:b4:8c:95"
        },
        "leaf_2_0_5": {
            "net0": "32:b6:2f:67:ed:06",
            "net1": "16:d2:16:bf:22:9b",
            "net10": "ca:78:a1:c8:5a:cc",
            "net11": "26:00:30:1b:a4:8b",
            "net12": "06:9f:61:02:ce:d3",
            "net13": "ca:70:04:0b:d4:e3",
            "net14": "b6:00:f1:e9:95:99",
            "net2": "de:10:50:21:65:b4",
            "net3": "c6:83:8f:44:e7:69",
            "net4": "46:1c:ca:b5:dd:45",
            "net5": "d2:41:2c:23:d7:34",
            "net6": "9a:74:12:c2:53:34",
            "net7": "a2:a8:aa:61:5f:5b",
            "net8": "a6:42:c2:a6:a1:dc",
            "net9": "4e:f3:84:07:40:f1"
        },
        "leaf_2_0_6": {
            "net0": "92:bb:be:21:8f:e8",
            "net1": "5e:55:58:a8:ad:b7",
            "net10": "de:d4:f2:42:1b:e4",
            "net11": "8a:a2:44:d3:31:18",
            "net12": "6a:63:66:52:6a:9c",
            "net13": "6e:1c:06:f1:f0:a0",
            "net14": "d6:63:8b:d7:81:d7",
            "net2": "56:81:09:a2:9b:b7",
            "net3": "56:0c:12:52:3f:78",
            "net4": "3a:42:45:76:71:51",
            "net5": "b6:a6:99:76:f4:53",
            "net6": "be:6a:86:04:7f:0b",
            "net7": "7e:16:43:72:b3:51",
            "net8": "6e:e0:32:91:e3:b6",
            "net9": "ee:5b:72:a3:9d:b4"
        },
        "leaf_2_0_7": {
            "net0": "46:06:2a:36:41:03",
            "net1": "ae:9c:01:95:0c:b1",
            "net10": "ea:e7:f6:fe:aa:11",
            "net11": "ce:23:4d:88:cf:7a",
            "net12": "f6:41:f4:2c:4b:7f",
            "net13": "aa:75:4f:6e:57:fd",
            "net14": "86:5b:85:ee:9d:92",
            "net2": "72:3d:1a:c8:03:eb",
            "net3": "92:23:cc:cd:ea:49",
            "net4": "d2:23:da:47:c3:ed",
            "net5": "a6:32:6d:cb:2a:35",
            "net6": "0e:8a:f3:07:6b:59",
            "net7": "92:0e:12:97:8d:29",
            "net8": "72:f7:37:aa:3d:c0",
            "net9": "ae:d6:2d:5d:3b:1c"
        },
        "leaf_2_0_8": {
            "net0": "62:95:03:58:40:b8",
            "net1": "62:3c:c6:e5:a6:08",
            "net10": "2e:e6:53:54:08:87",
            "net11": "9a:e4:3c:43:7f:ae",
            "net12": "0e:a0:7e:68:7a:dc",
            "net13": "d6:85:41:14:ee:6c",
            "net14": "46:eb:cc:5b:07:8d",
            "net2": "c6:d6:6a:a9:b3:ba",
            "net3": "4a:b5:1a:9d:0b:8a",
            "net4": "1a:81:e5:0b:2e:20",
            "net5": "96:67:76:cb:f4:73",
            "net6": "be:78:3a:b6:a0:94",
            "net7": "ca:4f:ca:63:a5:8f",
            "net8": "ae:54:d7:ad:eb:1e",
            "net9": "36:0c:28:cc:4f:90"
        },
        "leaf_2_0_9": {
            "net0": "7e:04:86:8f:f4:19",
            "net1": "be:4b:40:bc:c2:cc",
            "net10": "02:54:cf:fe:24:90",
            "net11": "b2:66:9d:77:e4:6b",
            "net12": "02:75:96:dc:1c:36",
            "net13": "c2:11:50:08:68:84",
            "net14": "02:11:7a:cd:96:3e",
            "net2": "46:15:b0:ff:e5:17",
            "net3": "4a:1f:d5:4d:da:3d",
            "net4": "c2:a6:c7:24:9b:20",
            "net5": "4e:cd:5f:e9:c4:52",
            "net6": "8a:8f:32:fc:91:a0",
            "net7": "4e:12:c3:54:82:5c",
            "net8": "42:a3:c1:50:63:00",
            "net9": "56:81:9f:70:47:9f"
        },
        "spine_1_1_1": {
            "net0": "4e:6c:07:dd:09:18",
            "net1": "6a:d6:72:0b:6e:79",
            "net10": "c2:f9:bd:cc:ad:ee",
            "net11": "72:0d:a4:71:c2:f1",
            "net12": "22:c7:34:51:54:49",
            "net13": "4a:53:72:f3:83:b0",
            "net14": "b2:9e:0b:5a:31:89",
            "net15": "ba:cc:61:a1:33:3c",
            "net16": "d6:dc:50:a5:e9:25",
            "net17": "c6:e1:9b:5a:1c:a4",
            "net18": "2e:76:04:31:87:3d",
            "net19": "de:5b:7b:6c:33:f6",
            "net2": "96:20:0b:1f:f9:48",
            "net20": "d6:cf:4c:0c:e2:a3",
            "net21": "5e:a2:e8:18:79:5c",
            "net22": "6e:9a:93:20:42:fc",
            "net23": "3a:46:24:2c:ec:90",
            "net24": "5a:87:37:bf:33:85",
            "net25": "6a:c5:67:a5:09:67",
            "net26": "52:73:fd:79:9b:ba",
            "net27": "f2:44:98:ad:36:e9",
            "net3": "f2:e1:c6:0c:81:44",
            "net4": "2e:16:fd:9c:21:da",
            "net5": "7e:39:da:fb:44:85",
            "net6": "6a:1a:66:4e:d0:e5",
            "net7": "f6:5c:8a:25:b0:d7",
            "net8": "12:64:1a:04:a4:56",
            "net9": "fe:fb:6a:de:e2:ce"
        },
        "spine_1_1_10": {
            "net0": "da:a2:17:48:c1:23",
            "net1": "c6:fa:df:78:87:1d",
            "net10": "52:4e:d9:58:32:c5",
            "net11": "12:1f:8c:27:62:db",
            "net12": "b2:fc:dd:b1:80:7b",
            "net13": "f2:22:eb:7f:9b:5d",
            "net14": "72:19:b1:9f:0a:68",
            "net15": "0a:3a:fb:e1:a1:90",
            "net16": "f6:6d:f9:82:e7:9c",
            "net17": "06:83:fa:5d:1f:4f",
            "net18": "5e:bd:75:ac:6d:3f",
            "net19": "3e:ab:7a:fe:a7:36",
            "net2": "6a:78:12:2c:a5:d4",
            "net20": "6a:a9:20:c4:62:0e",
            "net21": "36:4d:01:03:6d:ca",
            "net22": "92:86:6e:df:37:03",
            "net23": "62:3e:96:1f:95:f1",
            "net24": "7e:bc:ea:38:d7:35",
            "net25": "6e:36:6c:1b:a2:5a",
            "net26": "4e:3f:eb:d8:12:59",
            "net27": "e6:87:c3:e8:61:2e",
            "net3": "aa:82:b9:f0:7a:6a",
            "net4": "c6:c7:8b:12:7d:ef",
            "net5": "9a:49:de:63:59:5c",
            "net6": "c6:6c:a0:a8:01:66",
            "net7": "1e:1b:7c:df:43:6d",
            "net8": "9e:1f:2b:84:da:e5",
            "net9": "1a:53:d4:f3:e9:6f"
        },
        "spine_1_1_11": {
            "net0": "56:0d:58:0d:72:c1",
            "net1": "4e:6d:07:3e:ff:8d",
            "net10": "92:18:36:98:2a:54",
            "net11": "aa:a8:26:23:e3:8c",
            "net12": "46:f6:c1:d5:8e:df",
            "net13": "f6:d5:67:bf:06:ed",
            "net14": "66:e7:ab:51:e8:a1",
            "net15": "da:c7:e0:47:52:27",
            "net16": "02:f8:8a:60:42:59",
            "net17": "a2:42:79:fd:a2:06",
            "net18": "de:85:cd:81:6d:96",
            "net19": "9e:ed:da:a1:7d:40",
            "net2": "82:33:f1:da:08:f6",
            "net20": "8a:2b:ad:24:9b:0b",
            "net21": "ce:a5:1c:da:5b:c3",
            "net22": "3e:58:e7:9f:29:6f",
            "net23": "16:bd:8d:c9:7f:81",
            "net24": "ce:1e:4a:3d:29:8b",
            "net25": "e2:51:df:ec:e9:ce",
            "net26": "32:9e:68:07:15:1f",
            "net27": "62:c5:69:f7:1c:04",
            "net3": "8e:ab:37:02:7b:61",
            "net4": "a2:3a:9f:6e:ef:dc",
            "net5": "fe:55:60:3d:da:d8",
            "net6": "3a:53:dd:89:9b:54",
            "net7": "7a:9c:02:ca:4c:09",
            "net8": "8e:b1:c2:91:d1:84",
            "net9": "f2:9e:f4:e6:41:44"
        },
        "spine_1_1_12": {
            "net0": "fe:e7:7a:ea:60:65",
            "net1": "72:e8:c5:81:17:72",
            "net10": "32:67:98:78:b1:20",
            "net11": "f6:af:f7:a4:0d:01",
            "net12": "2a:5e:be:f9:b7:1c",
            "net13": "c6:93:89:bf:86:c7",
            "net14": "26:9e:0d:96:d1:6f",
            "net15": "ca:f1:fe:0a:18:06",
            "net16": "42:ea:34:26:a2:de",
            "net17": "e2:05:8e:d5:82:7f",
            "net18": "e2:43:c3:2b:18:de",
            "net19": "a6:d8:e6:d6:4d:3f",
            "net2": "a6:55:46:bc:44:26",
            "net20": "32:aa:41:b2:71:ae",
            "net21": "7a:82:4e:b8:84:9d",
            "net22": "7e:f5:b7:6a:ef:cf",
            "net23": "86:eb:8e:52:86:34",
            "net24": "76:c2:e4:11:5f:d3",
            "net25": "22:4a:0a:fb:06:a5",
            "net26": "56:7c:7d:0c:af:28",
            "net27": "ea:c0:e9:73:4b:64",
            "net3": "02:a6:25:d9:13:a1",
            "net4": "32:ea:e7:2f:85:a0",
            "net5": "7e:06:2f:3a:cf:5b",
            "net6": "f2:e0:2f:27:74:9b",
            "net7": "be:39:0e:d6:89:2d",
            "net8": "96:83:67:1d:f2:1b",
            "net9": "ee:68:a5:34:a7:a1"
        },
        "spine_1_1_13": {
            "net0": "a6:bd:5b:1e:03:5e",
            "net1": "da:cf:4d:5a:6d:80",
            "net10": "ea:a5:b5:92:ee:0a",
            "net11": "66:d0:89:fb:83:d3",
            "net12": "16:e4:64:ac:f6:0d",
            "net13": "52:40:e8:f8:e2:d6",
            "net14": "92:22:a2:90:fd:00",
            "net15": "1e:ef:ec:43:00:a9",
            "net16": "b6:95:df:7f:a7:a4",
            "net17": "c6:74:58:cb:71:fa",
            "net18": "36:40:8c:45:6d:a0",
            "net19": "02:61:0d:54:22:8b",
            "net2": "62:22:e3:66:1c:77",
            "net20": "d6:60:34:8e:27:71",
            "net21": "36:45:4b:13:7a:3b",
            "net22": "92:19:2a:d8:30:99",
            "net23": "8a:62:19:5f:2e:32",
            "net24": "b6:56:a5:40:0e:87",
            "net25": "4e:a4:89:36:4e:da",
            "net26": "6e:29:8b:2d:01:de",
            "net27": "a2:58:9a:97:bc:a4",
            "net3": "62:ad:49:ae:e2:f9",
            "net4": "16:97:f1:c3:62:f2",
            "net5": "8e:2d:b4:67:1d:3a",
            "net6": "a2:df:c5:c2:2e:70",
            "net7": "d2:a6:fb:10:6e:a9",
            "net8": "3a:f9:f1:a5:e5:cd",
            "net9": "1a:3c:f9:44:4d:a2"
        },
        "spine_1_1_14": {
            "net0": "6e:ae:11:da:bc:07",
            "net1": "62:d5:d6:f5:05:7b",
            "net10": "d6:82:c0:26:e6:89",
            "net11": "4a:83:a6:1c:93:f6",
            "net12": "12:1b:77:4a:00:4a",
            "net13": "0a:07:c5:ed:af:cd",
            "net14": "7a:fe:3d:cd:3e:89",
            "net15": "36:d7:86:08:b8:c9",
            "net16": "0e:f7:f3:40:80:00",
            "net17": "fe:9e:ab:95:68:cb",
            "net18": "9a:18:cd:08:9b:1d",
            "net19": "1a:00:c8:8c:d1:ca",
            "net2": "92:81:52:44:38:b3",
            "net20": "76:d5:f0:7a:8a:f5",
            "net21": "76:0b:2f:65:de:74",
            "net22": "12:da:3d:32:0e:68",
            "net23": "e6:5a:aa:40:a7:50",
            "net24": "ba:fd:46:2c:f4:8f",
            "net25": "d2:be:d3:f6:91:e1",
            "net26": "76:1e:06:9a:5b:ae",
            "net27": "de:9b:e9:24:61:a1",
            "net3": "da:1e:d0:69:bd:87",
            "net4": "6e:90:f4:eb:41:80",
            "net5": "62:53:1f:13:a3:c3",
            "net6": "d6:92:2b:6d:d5:50",
            "net7": "f2:61:f7:60:70:10",
            "net8": "1e:a0:76:d2:c0:f9",
            "net9": "b2:ad:c8:92:8f:8d"
        },
        "spine_1_1_2": {
            "net0": "62:d8:4c:3c:14:bc",
            "net1": "0a:a7:ac:80:ef:de",
            "net10": "02:66:a6:95:1c:13",
            "net11": "e6:c2:32:8e:98:ad",
            "net12": "26:44:00:9e:4b:bc",
            "net13": "a6:11:06:f1:89:20",
            "net14": "be:de:88:44:d6:ee",
            "net15": "ae:ac:cf:99:42:52",
            "net16": "be:87:6c:87:c7:5c",
            "net17": "b2:b2:2c:fd:8e:24",
            "net18": "52:93:14:d3:03:26",
            "net19": "ce:b2:28:46:db:7e",
            "net2": "fa:b3:1b:f7:0e:77",
            "net20": "7a:a1:25:4b:ce:69",
            "net21": "a2:56:6e:8a:9e:98",
            "net22": "16:e0:12:9d:ba:90",
            "net23": "1a:82:93:85:c2:b9",
            "net24": "02:3e:5a:e0:20:b6",
            "net25": "72:be:d3:f3:23:28",
            "net26": "be:6d:3a:cd:42:ae",
            "net27": "5a:34:b6:8b:4b:d2",
            "net3": "36:63:e7:0f:3f:40",
            "net4": "aa:74:de:47:c0:79",
            "net5": "8a:3c:8d:30:e4:17",
            "net6": "7e:ed:a4:c7:24:ff",
            "net7": "c2:dd:80:42:81:dd",
            "net8": "3a:11:42:77:23:76",
            "net9": "6e:c9:02:41:e9:7c"
        },
        "spine_1_1_3": {
            "net0": "8a:47:8d:40:33:c4",
            "net1": "66:bb:85:df:49:46",
            "net10": "16:6d:24:35:29:9a",
            "net11": "7e:4b:7e:47:4b:be",
            "net12": "2e:8e:e6:87:3a:60",
            "net13": "f6:42:6c:bc:24:18",
            "net14": "8a:eb:f8:fb:bf:5b",
            "net15": "f2:a8:7c:4c:d1:94",
            "net16": "e2:bb:7b:96:24:ae",
            "net17": "ba:54:e0:64:8b:38",
            "net18": "42:77:01:82:a1:d4",
            "net19": "1e:c5:2e:59:58:1f",
            "net2": "42:8a:53:5a:cb:ba",
            "net20": "da:e1:f2:72:ec:bc",
            "net21": "ca:6a:ba:f1:24:39",
            "net22": "9e:b7:d4:59:ff:80",
            "net23": "fe:59:5f:64:fb:87",
            "net24": "2a:0b:f9:b6:ee:c1",
            "net25": "9a:4d:90:9b:d6:6c",
            "net26": "92:64:55:b9:b2:61",
            "net27": "fa:f8:3d:1d:45:0a",
            "net3": "ce:11:e2:4f:49:ca",
            "net4": "5e:bc:f4:eb:f6:ac",
            "net5": "fe:16:c4:c3:3d:c1",
            "net6": "76:56:2e:f8:d3:29",
            "net7": "6a:33:93:10:1c:ae",
            "net8": "1a:9d:08:83:db:9b",
            "net9": "5a:d6:7d:45:19:d2"
        },
        "spine_1_1_4": {
            "net0": "1e:63:cc:ca:d8:38",
            "net1": "3e:f2:27:7d:c5:b1",
            "net10": "7a:82:8c:93:44:5f",
            "net11": "c2:23:b2:93:6d:72",
            "net12": "72:45:01:aa:1f:0d",
            "net13": "72:29:40:cf:ad:b3",
            "net14": "ee:bc:0a:28:5f:ad",
            "net15": "de:db:bd:77:c9:d0",
            "net16": "9a:d6:72:a8:73:42",
            "net17": "66:20:83:e3:61:e5",
            "net18": "66:78:35:c2:d6:ea",
            "net19": "16:cd:3c:93:66:8e",
            "net2": "7a:6a:c7:a7:f5:90",
            "net20": "a6:86:33:f4:08:94",
            "net21": "2a:da:a1:ef:c6:48",
            "net22": "4e:bf:98:8c:87:47",
            "net23": "9a:49:36:64:5e:95",
            "net24": "ca:a8:d8:3e:36:8e",
            "net25": "0e:0f:0d:70:b0:81",
            "net26": "06:aa:91:14:fd:e8",
            "net27": "3a:28:65:bf:b4:7d",
            "net3": "7a:38:d6:e8:f5:1d",
            "net4": "56:5d:71:b3:14:aa",
            "net5": "22:54:98:bc:6d:31",
            "net6": "8e:08:70:21:36:99",
            "net7": "ca:6b:a2:78:f6:e8",
            "net8": "46:6e:de:d6:bc:2e",
            "net9": "de:1c:91:3b:66:d8"
        },
        "spine_1_1_5": {
            "net0": "3e:2d:7c:41:e0:c4",
            "net1": "0e:11:08:6e:7f:0e",
            "net10": "66:17:1b:7b:3c:a9",
            "net11": "e6:52:3a:50:58:df",
            "net12": "ba:02:3c:bd:42:9b",
            "net13": "de:af:ea:23:ba:d9",
            "net14": "0e:84:d8:5d:11:e6",
            "net15": "86:47:c5:73:81:4c",
            "net16": "22:fb:b8:ea:b6:f1",
            "net17": "e2:99:5c:b5:69:53",
            "net18": "76:f3:02:9f:ac:82",
            "net19": "26:a8:f5:d7:c5:3f",
            "net2": "1e:9e:71:eb:4c:05",
            "net20": "fa:ab:77:a4:88:42",
            "net21": "ca:50:84:c6:a8:3f",
            "net22": "9a:3f:21:a7:9d:4b",
            "net23": "ce:40:ad:6a:49:7c",
            "net24": "22:9e:95:a0:ed:a5",
            "net25": "3e:2c:72:65:aa:d7",
            "net26": "46:67:bc:d2:65:f4",
            "net27": "56:c4:53:97:e2:9d",
            "net3": "9a:93:81:ad:04:84",
            "net4": "aa:09:9e:1c:0a:5f",
            "net5": "16:43:56:c8:23:0e",
            "net6": "e6:53:96:39:b8:24",
            "net7": "ee:d5:ca:bf:56:70",
            "net8": "7e:b7:ca:e3:b3:cc",
            "net9": "8a:2c:1d:15:c7:85"
        },
        "spine_1_1_6": {
            "net0": "42:34:69:bc:8c:74",
            "net1": "66:7e:36:85:d7:a3",
            "net10": "8a:71:83:bb:64:d4",
            "net11": "76:8e:9f:32:bb:c6",
            "net12": "1e:33:0f:42:b4:68",
            "net13": "e6:84:48:b9:73:29",
            "net14": "8a:71:66:ff:cf:9f",
            "net15": "c6:a1:6f:70:48:74",
            "net16": "c2:23:37:a2:3b:47",
            "net17": "c2:3f:ca:94:7e:e0",
            "net18": "ce:d1:0e:13:ec:d2",
            "net19": "ae:a9:41:9a:3b:35",
            "net2": "c2:3a:a4:9a:f1:bd",
            "net20": "fe:8d:95:0e:5b:6b",
            "net21": "c2:5d:8d:11:13:b3",
            "net22": "6e:b2:95:da:2a:5e",
            "net23": "26:d1:e0:65:93:e1",
            "net24": "16:bb:37:0e:0e:7f",
            "net25": "0a:da:3a:61:e1:5a",
            "net26": "8a:40:24:19:52:3c",
            "net27": "c6:44:e5:a0:0a:67",
            "net3": "3e:81:8f:c5:bd:28",
            "net4": "e6:15:57:ae:29:ae",
            "net5": "e6:d2:85:a7:34:87",
            "net6": "8e:4c:dc:bc:0b:0f",
            "net7": "1e:cf:69:00:54:ae",
            "net8": "6e:55:db:be:81:0c",
            "net9": "46:7e:22:7c:51:f8"
        },
        "spine_1_1_7": {
            "net0": "52:fd:68:90:31:b1",
            "net1": "ee:47:20:9c:c9:44",
            "net10": "16:c9:57:0d:4e:13",
            "net11": "56:71:18:94:dd:40",
            "net12": "ca:d2:37:1e:35:dd",
            "net13": "aa:87:90:c6:6a:fb",
            "net14": "ba:46:cf:a5:ed:d7",
            "net15": "02:2d:a9:24:d1:a7",
            "net16": "a6:e8:9b:72:79:a6",
            "net17": "22:ad:bb:e3:9a:80",
            "net18": "9e:4c:b0:76:a0:c2",
            "net19": "0e:14:3a:05:35:16",
            "net2": "a6:8a:b4:ff:cb:1d",
            "net20": "9e:82:5c:bc:bb:ac",
            "net21": "b2:73:ce:2b:91:b2",
            "net22": "7e:b9:dc:29:38:84",
            "net23": "4e:c8:cf:13:1c:01",
            "net24": "36:26:ee:09:b7:a8",
            "net25": "e6:0e:65:17:cf:ee",
            "net26": "16:ec:4c:44:5a:af",
            "net27": "6a:53:10:2a:99:88",
            "net3": "5a:cc:1a:be:58:01",
            "net4": "5e:65:82:44:3c:e0",
            "net5": "32:b9:82:fe:3f:4d",
            "net6": "ea:ea:36:16:86:55",
            "net7": "3e:0c:c2:a7:50:42",
            "net8": "b6:dd:f5:37:0c:42",
            "net9": "02:6c:4b:6e:65:dd"
        },
        "spine_1_1_8": {
            "net0": "22:52:d8:e8:a2:76",
            "net1": "8e:52:42:9d:ed:63",
            "net10": "e6:87:1b:50:8a:e2",
            "net11": "a6:75:6c:23:8d:52",
            "net12": "12:88:e2:27:a9:8a",
            "net13": "a6:23:29:9c:4e:09",
            "net14": "82:82:07:3e:f7:17",
            "net15": "26:62:8a:c2:8c:e9",
            "net16": "ca:25:a6:58:9c:e7",
            "net17": "c6:c7:11:5c:53:cf",
            "net18": "f2:77:74:d4:eb:7a",
            "net19": "5e:1a:7a:0d:85:fc",
            "net2": "de:ab:49:82:e6:f2",
            "net20": "9a:5a:5b:4f:20:d1",
            "net21": "3a:bb:56:cb:6a:0e",
            "net22": "5e:a9:9b:7c:74:e8",
            "net23": "ba:71:9e:08:b4:68",
            "net24": "66:4a:fc:70:0f:4f",
            "net25": "22:ac:0e:ce:eb:92",
            "net26": "92:84:29:26:ad:a6",
            "net27": "86:c6:1a:e7:8b:ea",
            "net3": "a2:4a:60:09:b1:20",
            "net4": "02:2b:d8:a9:84:ac",
            "net5": "3e:08:24:a9:25:eb",
            "net6": "e6:0b:cd:c8:a8:dc",
            "net7": "5e:1a:39:66:20:ac",
            "net8": "6a:3d:45:0a:29:02",
            "net9": "e6:ba:94:dd:b4:ad"
        },
        "spine_1_1_9": {
            "net0": "32:73:3e:b5:e0:27",
            "net1": "d6:00:e1:b7:0b:8d",
            "net10": "a6:99:21:a1:a6:22",
            "net11": "aa:56:b5:e2:8c:18",
            "net12": "86:0e:e3:7e:21:56",
            "net13": "6e:90:5f:85:06:4a",
            "net14": "a6:bf:7d:03:3e:33",
            "net15": "62:f2:5e:20:fb:10",
            "net16": "5a:34:98:5f:3c:68",
            "net17": "12:c5:cc:09:89:9e",
            "net18": "56:bb:49:83:07:06",
            "net19": "ce:cc:8d:78:46:d5",
            "net2": "7a:cd:e1:7b:e7:21",
            "net20": "72:ce:08:06:52:26",
            "net21": "b6:d2:ba:cb:0e:bd",
            "net22": "8e:30:3a:3b:f0:92",
            "net23": "aa:64:35:e9:d8:aa",
            "net24": "ce:a5:39:d8:78:3c",
            "net25": "2a:97:33:6f:87:ad",
            "net26": "2a:a0:6e:e3:71:4c",
            "net27": "5a:fb:50:19:79:84",
            "net3": "e6:c0:54:18:97:6b",
            "net4": "32:b2:e4:6a:10:21",
            "net5": "76:25:d3:bc:a1:59",
            "net6": "06:6d:06:5d:09:ca",
            "net7": "a6:a4:16:52:99:f8",
            "net8": "76:85:8e:59:47:99",
            "net9": "02:81:cd:a4:bb:60"
        },
        "spine_2_1_1": {
            "net0": "5a:fd:c9:e6:49:f4",
            "net1": "4e:31:f2:80:8c:2a",
            "net10": "ae:e2:63:64:eb:39",
            "net11": "b6:cb:8c:4c:53:19",
            "net12": "b2:55:34:84:80:4a",
            "net13": "da:96:65:c3:fe:28",
            "net14": "ba:ac:ea:6f:2b:83",
            "net15": "2e:47:07:ce:1a:c5",
            "net16": "62:66:d1:0b:52:de",
            "net17": "5e:a3:c7:82:f6:c8",
            "net18": "32:ff:14:d5:bb:98",
            "net19": "6e:9d:03:40:69:e9",
            "net2": "56:bb:2e:bf:cf:07",
            "net20": "7a:87:ef:8e:da:1e",
            "net21": "aa:2c:fb:8f:df:02",
            "net22": "ce:c2:a0:fc:a5:90",
            "net23": "e2:da:e8:d3:53:13",
            "net24": "c2:94:98:81:a3:74",
            "net25": "d2:cd:ba:0a:10:9f",
            "net26": "36:64:a6:cd:4e:b5",
            "net27": "3e:00:dd:59:50:22",
            "net3": "b2:54:ea:a6:9c:56",
            "net4": "a6:33:a7:af:bc:05",
            "net5": "e2:d1:1b:e9:86:86",
            "net6": "ca:0c:e3:ad:1b:ce",
            "net7": "ca:56:ee:4a:ec:bf",
            "net8": "12:8a:1b:2e:ab:b0",
            "net9": "8a:d8:51:bb:87:79"
        },
        "spine_2_1_10": {
            "net0": "8e:2a:78:fb:ab:80",
            "net1": "e2:a2:bc:c2:f4:94",
            "net10": "0e:6c:84:a1:53:da",
            "net11": "16:88:55:4f:e5:5a",
            "net12": "56:ff:be:0d:2a:85",
            "net13": "be:2f:a2:19:09:44",
            "net14": "ca:75:a3:8b:e1:ef",
            "net15": "36:8f:a4:aa:37:37",
            "net16": "5e:3c:bf:38:98:0d",
            "net17": "1e:f9:9d:99:6a:fb",
            "net18": "8e:0b:ae:27:6e:1c",
            "net19": "de:ca:de:2b:54:9b",
            "net2": "76:43:42:17:d4:9c",
            "net20": "16:e7:30:c2:c2:ac",
            "net21": "3a:56:09:2f:fa:97",
            "net22": "ae:49:5d:b5:f2:9a",
            "net23": "ae:40:f7:9d:ea:48",
            "net24": "4e:a4:e2:69:11:91",
            "net25": "06:67:ac:63:31:8c",
            "net26": "26:d9:32:fb:ae:86",
            "net27": "8a:1b:18:1a:85:ef",
            "net3": "86:43:10:3d:48:c6",
            "net4": "8a:7a:92:63:e3:bf",
            "net5": "96:c0:c4:9f:1c:3e",
            "net6": "a6:b1:05:33:7f:95",
            "net7": "9e:78:3d:cf:7b:97",
            "net8": "f6:1d:b3:47:c7:2c",
            "net9": "2e:b4:aa:14:42:66"
        },
        "spine_2_1_11": {
            "net0": "fe:93:0e:7f:9a:47",
            "net1": "8a:89:c1:3a:26:d9",
            "net10": "5a:6b:00:7f:35:48",
            "net11": "5e:39:6f:f8:5b:ba",
            "net12": "7e:08:df:38:c7:f4",
            "net13": "ee:c8:9e:8b:04:0a",
            "net14": "56:94:02:8b:91:fc",
            "net15": "e6:9a:41:31:d6:78",
            "net16": "36:8b:44:38:30:55",
            "net17": "4a:21:be:e1:08:78",
            "net18": "36:54:18:23:75:5e",
            "net19": "ae:db:1b:2a:2f:1a",
            "net2": "3a:9d:26:05:65:fb",
            "net20": "de:39:02:5d:34:62",
            "net21": "92:f1:0f:e5:6e:63",
            "net22": "7e:af:d9:f4:60:10",
            "net23": "c6:b0:d2:91:f4:9a",
            "net24": "2e:c9:d2:e9:7a:1d",
            "net25": "9a:b8:1f:70:7a:99",
            "net26": "32:d8:3b:46:62:dd",
            "net27": "7e:a7:f5:27:cc:07",
            "net3": "92:41:9f:e4:ab:0a",
            "net4": "3e:45:89:46:a8:2b",
            "net5": "02:20:0b:b5:bc:0d",
            "net6": "96:74:b1:d0:ff:c4",
            "net7": "ae:a2:c8:f6:e6:bc",
            "net8": "ee:f6:6c:ba:96:ba",
            "net9": "42:f3:cb:10:fb:f6"
        },
        "spine_2_1_12": {
            "net0": "2e:2b:a1:80:5a:cd",
            "net1": "b2:bf:8a:77:19:e0",
            "net10": "1e:92:b4:be:41:e0",
            "net11": "62:5a:97:11:9d:8f",
            "net12": "ba:8d:d0:1c:06:d4",
            "net13": "66:da:f5:00:af:82",
            "net14": "f2:c3:8f:4e:4d:23",
            "net15": "6e:94:aa:bd:b5:68",
            "net16": "16:12:c9:54:30:4e",
            "net17": "06:6c:6d:0a:57:e8",
            "net18": "2e:e2:8d:97:e3:06",
            "net19": "32:16:07:2a:bc:32",
            "net2": "ce:18:bf:a0:29:3b",
            "net20": "b2:97:18:b6:f8:6a",
            "net21": "a2:34:25:47:d4:54",
            "net22": "e6:15:32:e2:94:37",
            "net23": "3a:b5:05:a6:5a:71",
            "net24": "7a:66:45:de:f0:e4",
            "net25": "46:4e:1f:23:e2:1e",
            "net26": "6e:a2:88:00:e8:46",
            "net27": "42:be:32:fe:94:95",
            "net3": "b6:e7:32:34:b0:c2",
            "net4": "aa:df:fb:a5:50:49",
            "net5": "82:d0:01:e8:00:27",
            "net6": "b6:90:fd:2a:2e:4b",
            "net7": "86:b9:81:73:64:ca",
            "net8": "3e:2e:03:7f:7e:5f",
            "net9": "d2:35:28:16:91:46"
        },
        "spine_2_1_13": {
            "net0": "fe:14:29:14:90:8c",
            "net1": "ca:f9:f0:a3:a6:17",
            "net10": "a6:f9:d4:5d:1f:6f",
            "net11": "02:97:e7:57:79:da",
            "net12": "16:ac:d1:9e:30:69",
            "net13": "92:65:e8:72:80:99",
            "net14": "f2:ea:8a:62:6b:cf",
            "net15": "06:ea:19:92:0c:fb",
            "net16": "9e:b4:27:55:83:eb",
            "net17": "92:9c:a9:25:41:fd",
            "net18": "a6:23:91:7f:06:3a",
            "net19": "e6:18:0c:ab:83:0c",
            "net2": "66:de:20:81:aa:de",
            "net20": "6a:7e:c0:e5:12:3e",
            "net21": "a6:98:65:b8:82:83",
            "net22": "7e:9d:39:4d:ab:2c",
            "net23": "a2:50:a3:97:c7:25",
            "net24": "02:13:49:f9:64:97",
            "net25": "4a:d7:b4:be:64:96",
            "net26": "ce:34:3b:29:52:2f",
            "net27": "aa:9c:93:49:77:f2",
            "net3": "8a:95:af:98:30:05",
            "net4": "02:68:44:88:a0:b1",
            "net5": "02:17:64:00:2b:0c",
            "net6": "2e:a1:f9:9b:f9:9a",
            "net7": "52:e7:83:07:51:8b",
            "net8": "b2:14:81:cf:f2:8f",
            "net9": "9a:27:16:d0:a0:5e"
        },
        "spine_2_1_14": {
            "net0": "5e:a6:89:4b:c1:fa",
            "net1": "42:e4:47:53:ee:d0",
            "net10": "2e:7f:ca:a0:06:05",
            "net11": "de:fd:b0:57:96:ea",
            "net12": "6a:ad:08:5f:b5:34",
            "net13": "2e:07:4e:ff:eb:67",
            "net14": "82:cd:8f:d3:92:6b",
            "net15": "7e:87:25:6b:e3:05",
            "net16": "4a:87:ea:62:dd:43",
            "net17": "16:41:30:99:70:71",
            "net18": "de:68:fb:76:7f:7a",
            "net19": "f6:d9:f9:9e:b2:e2",
            "net2": "a2:0a:7d:27:92:86",
            "net20": "66:ee:17:bc:d3:0a",
            "net21": "76:bc:21:67:94:50",
            "net22": "fa:8a:86:87:c6:6b",
            "net23": "92:69:17:28:6e:9a",
            "net24": "f2:63:62:72:49:f8",
            "net25": "0a:45:0d:09:ea:a3",
            "net26": "d2:3d:7b:c0:c8:c9",
            "net27": "b6:df:eb:7a:0c:e7",
            "net3": "b6:2d:bc:63:39:27",
            "net4": "72:ec:36:93:2e:4e",
            "net5": "d2:47:75:14:00:98",
            "net6": "2e:e1:0d:f6:9d:7b",
            "net7": "16:41:5f:f7:57:fb",
            "net8": "ae:00:dc:c7:1a:35",
            "net9": "5a:b8:82:27:26:70"
        },
        "spine_2_1_2": {
            "net0": "ce:65:42:60:fd:38",
            "net1": "9a:94:26:c8:e6:25",
            "net10": "02:ff:8f:a7:4b:a2",
            "net11": "82:45:50:79:51:34",
            "net12": "4e:f8:10:06:13:22",
            "net13": "9a:68:19:77:a6:e5",
            "net14": "92:22:88:e3:8f:25",
            "net15": "ca:e9:0f:2c:c5:26",
            "net16": "e2:fd:19:a9:66:37",
            "net17": "7e:1b:3b:3f:ad:72",
            "net18": "3a:59:c1:ec:3f:93",
            "net19": "d6:fd:aa:b3:eb:5b",
            "net2": "66:ea:c0:b8:1c:20",
            "net20": "b2:d9:2b:8f:b5:1d",
            "net21": "1a:5e:17:e1:f9:a6",
            "net22": "56:a8:b8:93:c9:7f",
            "net23": "62:f5:24:9d:f3:cc",
            "net24": "e6:b7:01:54:6b:58",
            "net25": "62:c2:c3:32:3b:5a",
            "net26": "be:90:a9:9a:af:6b",
            "net27": "2e:34:06:d7:37:04",
            "net3": "76:c0:c6:e3:7f:a5",
            "net4": "ea:c0:4d:63:59:6d",
            "net5": "3a:48:f2:c3:c9:d1",
            "net6": "46:e0:a4:a2:20:c3",
            "net7": "3a:0a:50:c1:20:0b",
            "net8": "66:ae:49:b3:64:44",
            "net9": "2e:ca:8d:ec:ec:5b"
        },
        "spine_2_1_3": {
            "net0": "8e:16:85:c1:bc:d7",
            "net1": "4a:f2:f0:42:ca:25",
            "net10": "0a:3d:36:f8:06:05",
            "net11": "12:21:84:a9:c1:62",
            "net12": "92:3e:23:7a:30:ec",
            "net13": "86:2a:06:8f:e0:a7",
            "net14": "e6:37:8b:49:1f:c5",
            "net15": "9a:5b:69:fe:3d:b2",
            "net16": "7a:b9:65:e9:4a:3b",
            "net17": "52:29:9e:b7:99:9f",
            "net18": "26:31:9b:a8:f1:20",
            "net19": "1e:2b:69:42:2a:b3",
            "net2": "2e:c4:6e:1b:d2:d2",
            "net20": "5e:30:5f:14:fb:19",
            "net21": "de:47:c8:67:4b:14",
            "net22": "8a:07:91:d7:6e:89",
            "net23": "ae:76:78:37:13:5e",
            "net24": "ca:f2:44:c0:4e:f4",
            "net25": "72:ca:52:8a:ed:8e",
            "net26": "5a:ca:27:32:ce:8b",
            "net27": "26:17:50:4c:9f:bf",
            "net3": "72:94:34:19:9e:c0",
            "net4": "0e:77:1b:2f:ec:f1",
            "net5": "5e:78:a1:96:e1:95",
            "net6": "4a:03:72:88:0b:bb",
            "net7": "da:2d:3b:d0:54:92",
            "net8": "e6:ab:4c:7f:0d:fc",
            "net9": "ee:16:af:2f:aa:c5"
        },
        "spine_2_1_4": {
            "net0": "26:cc:c5:fa:5f:45",
            "net1": "8e:ae:7d:af:04:48",
            "net10": "2a:05:05:20:6d:65",
            "net11": "9e:42:42:77:52:be",
            "net12": "76:f1:fe:92:5f:0d",
            "net13": "1e:e3:be:e8:9a:87",
            "net14": "7e:70:03:71:a6:46",
            "net15": "06:2d:1d:7a:dd:54",
            "net16": "4a:c9:61:69:8d:cb",
            "net17": "9a:1a:55:b2:97:62",
            "net18": "2a:1c:65:5d:6b:28",
            "net19": "1a:fb:8c:13:76:13",
            "net2": "1a:79:2c:1e:d8:55",
            "net20": "ca:1c:72:43:d7:8e",
            "net21": "4a:04:3d:db:32:2e",
            "net22": "96:cd:4f:70:40:b6",
            "net23": "ce:fe:95:cd:c5:28",
            "net24": "0a:b1:3d:f3:40:29",
            "net25": "9a:81:e2:7c:ef:9a",
            "net26": "82:bf:cf:82:1a:6d",
            "net27": "96:07:2f:cb:95:69",
            "net3": "be:07:42:72:fb:56",
            "net4": "3a:75:a0:04:0a:4c",
            "net5": "ea:2c:36:c0:b3:40",
            "net6": "ca:6b:d9:11:24:d9",
            "net7": "c6:2b:cd:5e:ae:a2",
            "net8": "22:fb:10:8f:0b:1d",
            "net9": "56:98:eb:61:b1:41"
        },
        "spine_2_1_5": {
            "net0": "1e:a5:e4:77:78:e6",
            "net1": "de:01:1c:c0:05:57",
            "net10": "76:86:95:8e:e9:ac",
            "net11": "4a:48:ee:3f:72:34",
            "net12": "ae:c5:fa:c5:66:6a",
            "net13": "8a:ba:f5:a9:b0:07",
            "net14": "ea:13:0c:c5:72:49",
            "net15": "3e:0a:72:9a:ab:a3",
            "net16": "02:c6:32:de:5e:d2",
            "net17": "7e:82:4e:bc:b8:99",
            "net18": "86:ba:65:30:b0:5b",
            "net19": "26:1b:e1:b8:c1:9f",
            "net2": "e6:78:b0:0b:a1:fb",
            "net20": "ca:91:80:61:5d:69",
            "net21": "16:9f:5d:ba:6a:9f",
            "net22": "82:a3:37:23:9b:a4",
            "net23": "9e:51:e2:c2:a7:81",
            "net24": "9e:97:a9:eb:f4:ca",
            "net25": "22:b2:e1:d4:b9:dd",
            "net26": "1e:c7:99:f1:3a:6c",
            "net27": "a2:98:3d:74:9d:e1",
            "net3": "02:e2:0c:1d:08:13",
            "net4": "56:5e:13:23:94:04",
            "net5": "1e:95:ea:63:6c:d0",
            "net6": "c6:72:ef:66:a4:22",
            "net7": "6e:d0:7c:11:2b:c3",
            "net8": "42:a2:76:b7:24:34",
            "net9": "ae:83:b9:2e:7c:32"
        },
        "spine_2_1_6": {
            "net0": "3a:dd:68:e5:b3:83",
            "net1": "5a:b5:17:fc:97:16",
            "net10": "62:9e:a2:a7:ca:4a",
            "net11": "72:d9:ce:09:49:2b",
            "net12": "a2:a1:7b:68:e9:b9",
            "net13": "e2:31:3d:10:03:cf",
            "net14": "ca:6e:13:d8:ca:44",
            "net15": "36:47:00:72:37:c5",
            "net16": "ea:65:92:e5:38:8d",
            "net17": "e6:0e:1b:bd:04:3b",
            "net18": "72:1e:c8:27:2d:21",
            "net19": "f2:c3:ef:ff:f7:dc",
            "net2": "56:8b:27:9c:35:07",
            "net20": "6e:10:5d:d1:72:45",
            "net21": "96:11:7b:41:ef:67",
            "net22": "02:5f:c0:f8:a3:f1",
            "net23": "d6:f7:ec:b9:14:6b",
            "net24": "a6:91:ac:cb:76:89",
            "net25": "ee:af:c2:9f:eb:4f",
            "net26": "fe:03:32:54:50:95",
            "net27": "da:3e:e5:68:6c:91",
            "net3": "5a:2c:39:be:14:4b",
            "net4": "8a:9d:41:c9:ac:03",
            "net5": "92:cf:aa:da:94:50",
            "net6": "0a:e6:79:a8:45:8a",
            "net7": "4e:85:6d:8f:1e:66",
            "net8": "ce:2f:f3:67:46:07",
            "net9": "e6:a9:15:4f:45:d0"
        },
        "spine_2_1_7": {
            "net0": "46:bc:b3:79:b5:37",
            "net1": "8e:38:fa:3c:e1:15",
            "net10": "06:db:17:0a:9f:c0",
            "net11": "f2:5f:c5:76:96:73",
            "net12": "ce:9e:3c:26:8c:d8",
            "net13": "aa:ae:80:59:be:30",
            "net14": "b6:37:23:90:b8:4d",
            "net15": "7e:66:58:d0:25:f1",
            "net16": "ae:28:47:53:62:22",
            "net17": "5a:44:0a:36:2b:06",
            "net18": "b2:bf:2e:ea:02:f1",
            "net19": "26:0a:66:c2:c5:03",
            "net2": "ce:45:c0:e4:81:eb",
            "net20": "ea:08:da:65:87:a2",
            "net21": "d6:b3:a2:a8:7d:03",
            "net22": "96:e3:00:d6:9d:bd",
            "net23": "be:80:db:2d:81:75",
            "net24": "ae:c4:20:63:f8:ae",
            "net25": "5e:62:c6:6b:07:fa",
            "net26": "ca:e4:b2:42:59:71",
            "net27": "c6:e4:c4:05:24:c1",
            "net3": "6e:ec:56:09:65:35",
            "net4": "8e:ce:bd:33:7b:ff",
            "net5": "d2:63:9e:e9:f1:68",
            "net6": "1a:0e:93:80:15:7f",
            "net7": "22:f2:a6:d2:3e:44",
            "net8": "fe:49:c8:92:f3:38",
            "net9": "be:f7:cf:82:2a:45"
        },
        "spine_2_1_8": {
            "net0": "96:a2:8e:f7:ef:78",
            "net1": "a2:0f:0b:10:ed:3e",
            "net10": "aa:76:8f:74:7b:70",
            "net11": "96:9b:a8:a0:7c:1a",
            "net12": "0e:78:83:f1:2c:a6",
            "net13": "0e:81:cd:39:39:3b",
            "net14": "3a:cd:a1:83:f6:c7",
            "net15": "e2:c8:c9:49:8a:34",
            "net16": "56:15:d4:44:89:60",
            "net17": "3a:7a:15:5a:7f:e6",
            "net18": "f2:a0:23:75:2f:e8",
            "net19": "d6:3b:a0:df:39:8c",
            "net2": "8a:21:54:88:b2:dd",
            "net20": "7a:bd:d7:c5:63:b1",
            "net21": "a6:cc:3d:3c:35:f0",
            "net22": "02:db:f5:2b:35:d6",
            "net23": "52:74:e2:e5:79:80",
            "net24": "6a:d3:ee:c7:1c:f9",
            "net25": "3a:9f:0b:e8:b9:cd",
            "net26": "36:65:88:30:93:9f",
            "net27": "e6:8b:dd:d3:f2:1b",
            "net3": "a6:8e:cf:71:80:b2",
            "net4": "d6:1a:4a:16:16:c9",
            "net5": "c6:6e:a0:bb:9d:10",
            "net6": "82:86:9c:97:c1:99",
            "net7": "aa:0a:29:3a:64:18",
            "net8": "be:59:fd:a3:00:0a",
            "net9": "92:28:b2:bd:cf:59"
        },
        "spine_2_1_9": {
            "net0": "de:9b:cf:64:07:30",
            "net1": "3a:7e:34:02:ce:5e",
            "net10": "46:06:a4:4e:60:2e",
            "net11": "66:00:07:8c:c4:7d",
            "net12": "e6:20:83:13:44:06",
            "net13": "fa:7a:10:8e:2c:5f",
            "net14": "0e:11:61:6c:4d:f4",
            "net15": "6e:c2:6f:b7:71:a5",
            "net16": "3e:15:06:90:32:53",
            "net17": "5e:69:16:22:eb:01",
            "net18": "d2:e5:2a:7d:00:ad",
            "net19": "c6:30:e3:b1:76:07",
            "net2": "c6:03:49:94:bd:49",
            "net20": "e6:fa:67:17:ef:2d",
            "net21": "7e:16:15:62:e5:57",
            "net22": "4a:fb:26:c2:98:16",
            "net23": "c6:b8:ea:1d:b8:82",
            "net24": "a6:ca:40:b7:0c:98",
            "net25": "b2:3a:b9:3b:e4:9a",
            "net26": "56:d8:d1:57:d7:39",
            "net27": "fe:90:76:7a:4f:75",
            "net3": "5e:43:ac:66:fc:93",
            "net4": "26:4f:87:62:83:52",
            "net5": "46:32:00:bc:7d:ab",
            "net6": "16:29:b7:c6:c3:79",
            "net7": "7e:20:9d:f7:79:7e",
            "net8": "8e:24:96:75:49:4b",
            "net9": "32:53:81:56:e8:56"
        },
        "tof_1_2_1": {
            "net0": "fa:98:d1:48:b9:71",
            "net1": "82:0d:48:17:a0:28",
            "net10": "be:1c:6f:e9:a8:c2",
            "net11": "96:05:98:60:a2:88",
            "net12": "0e:84:93:aa:a9:61",
            "net13": "7e:9a:64:08:8c:0d",
            "net14": "92:d0:74:34:ee:70",
            "net15": "22:a8:b1:3c:cb:de",
            "net16": "3e:50:63:8c:5c:ab",
            "net17": "72:4e:7b:5b:92:73",
            "net18": "36:94:a5:b2:e7:1d",
            "net19": "1a:57:8a:b9:f1:ed",
            "net2": "72:93:e1:e2:95:eb",
            "net20": "8a:71:f4:02:52:ff",
            "net21": "52:e9:4c:52:44:ad",
            "net22": "56:24:50:11:86:94",
            "net23": "96:ec:87:13:01:d5",
            "net24": "fe:ed:24:e6:ca:9a",
            "net25": "66:a0:78:06:f3:20",
            "net26": "fa:f2:33:4e:5c:6d",
            "net27": "a2:c3:d0:80:20:e1",
            "net3": "2a:cf:cc:08:71:9e",
            "net4": "e6:fd:dc:ac:ec:64",
            "net5": "5e:82:28:6b:e2:65",
            "net6": "56:22:66:1f:a3:33",
            "net7": "1e:8a:e0:80:a1:02",
            "net8": "6a:be:08:86:fc:99",
            "net9": "ea:a9:12:80:4e:1f"
        },
        "tof_1_2_10": {
            "net0": "7a:cd:ce:cc:f3:93",
            "net1": "8a:43:34:b0:0a:9f",
            "net10": "46:3c:84:d6:77:ef",
            "net11": "3a:42:8d:fb:ad:18",
            "net12": "c2:fb:79:d6:a3:f6",
            "net13": "6e:fc:3b:e9:8a:dc",
            "net14": "9e:2b:ee:92:d9:74",
            "net15": "ee:a4:d7:2e:ab:56",
            "net16": "b2:ba:76:cb:25:9a",
            "net17": "ae:8e:f9:7f:e1:3c",
            "net18": "06:fb:49:80:43:84",
            "net19": "d2:ba:ec:3b:3b:fe",
            "net2": "a6:c2:6c:04:5e:c6",
            "net20": "2e:c1:b8:f6:a9:0f",
            "net21": "66:e0:dc:9c:a5:b8",
            "net22": "1a:ad:b1:f8:ac:4e",
            "net23": "ee:0b:5f:e4:7a:c1",
            "net24": "32:79:4b:02:d7:de",
            "net25": "2e:b9:66:03:2f:86",
            "net26": "42:45:c6:8f:0e:df",
            "net27": "6e:6f:1f:a1:6b:56",
            "net3": "ce:10:ca:9f:1c:85",
            "net4": "92:e9:8f:33:b1:24",
            "net5": "ba:b4:c4:cd:e1:21",
            "net6": "a6:17:0a:c7:06:d2",
            "net7": "ea:52:1b:e6:8d:99",
            "net8": "4a:04:a8:2d:7c:1d",
            "net9": "4a:a4:38:e5:9f:1a"
        },
        "tof_1_2_11": {
            "net0": "d2:7e:91:b7:25:29",
            "net1": "be:2f:a9:f0:f5:fc",
            "net10": "52:e7:e2:5b:28:e0",
            "net11": "26:c4:6b:30:ea:a8",
            "net12": "02:cf:0e:a4:83:b2",
            "net13": "86:c7:25:ba:ca:f5",
            "net14": "8a:9e:01:21:e1:0b",
            "net15": "02:69:ab:ef:4c:c7",
            "net16": "fe:f3:67:a2:db:bc",
            "net17": "be:69:5e:5a:23:54",
            "net18": "be:26:79:fb:3e:2b",
            "net19": "56:f6:8f:d9:e9:7c",
            "net2": "da:1f:49:b2:ca:bc",
            "net20": "ea:18:f7:cd:0a:cb",
            "net21": "72:3c:c7:1f:d0:65",
            "net22": "ae:18:26:8c:7c:be",
            "net23": "92:54:b5:48:17:94",
            "net24": "46:46:d3:69:e5:76",
            "net25": "fa:0f:90:a2:0f:c3",
            "net26": "5a:d8:67:0a:96:fd",
            "net27": "1e:9e:44:aa:c7:46",
            "net3": "02:81:b4:db:21:e8",
            "net4": "6e:50:10:d3:38:6b",
            "net5": "ce:06:91:04:9c:13",
            "net6": "0e:e6:3c:27:3d:8e",
            "net7": "b6:45:fa:52:5a:a9",
            "net8": "aa:58:e5:ca:cf:1c",
            "net9": "2e:68:6d:04:63:e8"
        },
        "tof_1_2_12": {
            "net0": "ba:9c:3e:62:e1:50",
            "net1": "5a:ad:90:ed:89:6c",
            "net10": "d6:27:b1:bc:59:22",
            "net11": "86:bd:3d:24:a9:f8",
            "net12": "9a:13:2a:25:e0:e4",
            "net13": "9a:30:54:45:dd:7b",
            "net14": "06:63:3c:ec:8a:21",
            "net15": "2e:e8:d3:a6:25:66",
            "net16": "5e:f2:a4:cb:15:74",
            "net17": "6a:c4:d0:5c:5c:cd",
            "net18": "aa:e6:0c:97:c1:f4",
            "net19": "d2:de:b4:bb:50:34",
            "net2": "0a:34:a0:2e:50:a4",
            "net20": "b2:62:42:27:1f:29",
            "net21": "42:42:f9:83:56:d9",
            "net22": "4a:b6:9c:25:07:b0",
            "net23": "12:85:42:55:4f:69",
            "net24": "42:ec:95:00:aa:db",
            "net25": "9e:88:26:35:ca:98",
            "net26": "de:4b:46:9d:7e:68",
            "net27": "8e:81:c2:4a:51:ed",
            "net3": "be:23:00:c9:17:7c",
            "net4": "3e:aa:86:cc:fa:d5",
            "net5": "36:62:0e:87:fc:7a",
            "net6": "7e:04:d6:6f:40:b8",
            "net7": "8e:a9:be:c3:4a:26",
            "net8": "ce:ee:92:d1:62:b9",
            "net9": "3e:7d:f9:26:0b:2e"
        },
        "tof_1_2_13": {
            "net0": "12:bf:eb:76:fc:ae",
            "net1": "d2:a1:a9:b6:07:d2",
            "net10": "76:81:0d:9d:32:8b",
            "net11": "d6:47:c9:82:78:1f",
            "net12": "ee:c6:a0:17:63:54",
            "net13": "fa:a6:0c:ca:52:9b",
            "net14": "0a:af:88:af:b3:ab",
            "net15": "8e:94:39:df:74:ba",
            "net16": "ca:bc:3c:d2:3e:bc",
            "net17": "2e:0f:40:eb:e6:4e",
            "net18": "16:54:91:af:94:3a",
            "net19": "1e:bb:fc:01:98:40",
            "net2": "86:74:17:9b:d7:fd",
            "net20": "e2:de:13:dc:62:6b",
            "net21": "be:05:03:81:da:5e",
            "net22": "4e:db:9a:a1:1e:9e",
            "net23": "f2:70:a6:d5:51:cf",
            "net24": "4a:b7:3d:75:7c:8c",
            "net25": "3e:00:3b:d3:df:20",
            "net26": "2a:6f:fb:55:2d:e3",
            "net27": "fa:dc:bc:b7:7f:ae",
            "net3": "06:69:15:56:f4:f8",
            "net4": "1a:e6:ff:51:fa:ad",
            "net5": "7a:13:84:00:04:9a",
            "net6": "da:ec:b4:ff:c0:b2",
            "net7": "4a:57:6f:53:a0:90",
            "net8": "ea:9d:91:d5:f4:7a",
            "net9": "b6:e2:3b:5e:de:2c"
        },
        "tof_1_2_14": {
            "net0": "8a:53:ab:05:03:3c",
            "net1": "7a:d6:68:75:25:f2",
            "net10": "e6:78:9b:15:13:e4",
            "net11": "8e:d1:f5:0c:b7:66",
            "net12": "1a:fc:4e:fd:15:18",
            "net13": "96:a8:86:5b:50:7f",
            "net14": "36:27:d2:d1:8a:87",
            "net15": "72:a0:8e:61:0d:9f",
            "net16": "0e:ce:c6:3a:3e:cb",
            "net17": "be:2a:3d:b5:cc:6e",
            "net18": "e6:6f:05:55:5e:7a",
            "net19": "1a:63:27:64:94:f0",
            "net2": "76:ef:0a:33:fd:92",
            "net20": "0a:bc:c3:9a:40:d7",
            "net21": "f6:ff:c0:fe:0d:bc",
            "net22": "de:3c:7d:68:5b:90",
            "net23": "aa:13:71:58:31:21",
            "net24": "f2:36:e0:2a:be:d2",
            "net25": "76:e2:30:5a:e9:33",
            "net26": "d6:6c:bc:44:40:8d",
            "net27": "32:62:e1:a2:1f:b2",
            "net3": "9e:93:9a:18:1d:15",
            "net4": "5a:4d:2a:54:65:e1",
            "net5": "26:f3:bf:96:8b:22",
            "net6": "e2:dc:8a:94:66:47",
            "net7": "02:44:d3:6a:2e:88",
            "net8": "2a:9e:eb:b4:51:c6",
            "net9": "56:73:c3:6b:3a:8e"
        },
        "tof_1_2_2": {
            "net0": "9e:e7:1e:50:5d:6f",
            "net1": "fa:41:be:1d:74:76",
            "net10": "1e:cb:54:ad:ac:57",
            "net11": "ca:c7:38:70:70:a7",
            "net12": "46:f4:87:cc:78:fd",
            "net13": "5a:fe:9e:42:9e:9a",
            "net14": "6a:38:b0:a2:4b:ba",
            "net15": "0e:ce:71:76:89:e8",
            "net16": "32:78:e5:e9:6c:3f",
            "net17": "02:59:ca:be:f8:63",
            "net18": "02:a9:7a:d2:36:ef",
            "net19": "86:d8:c5:e3:4d:11",
            "net2": "9a:79:42:6c:5e:07",
            "net20": "e6:7d:b6:e7:c6:29",
            "net21": "06:57:86:3c:9a:ba",
            "net22": "ee:14:47:da:73:b2",
            "net23": "fe:94:90:26:e0:ef",
            "net24": "36:a0:c0:84:ee:aa",
            "net25": "ce:3b:bb:66:1e:76",
            "net26": "76:a6:6c:2b:d1:fc",
            "net27": "da:cf:7a:6f:d3:52",
            "net3": "22:8b:e7:7a:88:f0",
            "net4": "1e:19:b6:3b:89:6d",
            "net5": "66:90:88:31:15:53",
            "net6": "e2:11:91:d2:1e:0e",
            "net7": "d2:b8:7c:99:83:cc",
            "net8": "86:7e:ba:f5:9f:27",
            "net9": "ea:9e:cb:04:6a:8c"
        },
        "tof_1_2_3": {
            "net0": "46:16:14:dc:05:f7",
            "net1": "7e:8b:c1:60:14:6a",
            "net10": "9e:f2:5f:b1:ef:d1",
            "net11": "e6:17:94:ee:9f:4b",
            "net12": "b6:96:a0:cf:0c:8b",
            "net13": "c6:ca:0a:db:b8:40",
            "net14": "8a:cc:59:ae:9f:a8",
            "net15": "66:02:c4:60:d4:3a",
            "net16": "da:9d:16:80:d8:a6",
            "net17": "1e:de:2c:72:75:f1",
            "net18": "56:e9:b7:b9:aa:c1",
            "net19": "6e:b2:46:5f:5e:b5",
            "net2": "7e:b4:7f:2e:f4:5c",
            "net20": "ca:55:c1:d6:1a:45",
            "net21": "72:62:79:a6:7c:fb",
            "net22": "ce:0e:ef:6a:77:8f",
            "net23": "86:0e:46:40:4b:6c",
            "net24": "8a:31:88:06:70:d6",
            "net25": "c2:e8:a4:fd:18:13",
            "net26": "3e:b6:1c:39:3c:77",
            "net27": "86:39:64:30:75:50",
            "net3": "d2:08:07:93:3a:27",
            "net4": "8a:2f:cd:2f:af:98",
            "net5": "b6:41:d7:06:d3:4d",
            "net6": "ca:50:17:e1:53:44",
            "net7": "fa:b7:66:c1:bc:7d",
            "net8": "ee:14:98:92:26:30",
            "net9": "5a:1b:03:78:6d:6d"
        },
        "tof_1_2_4": {
            "net0": "0a:3c:7e:ad:c0:a4",
            "net1": "6e:dc:4e:e5:8d:9c",
            "net10": "42:b0:98:3c:f7:51",
            "net11": "ca:48:af:7a:ee:4e",
            "net12": "26:ab:ed:04:23:d8",
            "net13": "6a:fe:61:b9:40:58",
            "net14": "2e:46:f6:10:e6:d7",
            "net15": "2e:fd:67:6c:d9:f3",
            "net16": "ee:75:e0:e5:83:5a",
            "net17": "32:35:22:df:dc:e8",
            "net18": "ce:74:a1:db:d9:f3",
            "net19": "ca:08:7a:41:4c:8e",
            "net2": "2e:6d:bf:21:45:8e",
            "net20": "02:71:51:9a:f0:b3",
            "net21": "ae:6b:74:14:39:43",
            "net22": "8a:49:38:84:5f:5b",
            "net23": "fa:6c:c8:5a:3e:39",
            "net24": "a6:cf:f4:6a:19:8b",
            "net25": "3e:c0:65:62:8d:a7",
            "net26": "86:10:00:0f:46:d0",
            "net27": "62:ff:39:af:ff:b9",
            "net3": "7e:45:5e:06:65:f8",
            "net4": "2e:9e:69:32:b6:b7",
            "net5": "0a:56:cd:f2:60:7b",
            "net6": "9a:34:22:9c:bb:a1",
            "net7": "f6:e2:f3:04:d7:59",
            "net8": "ee:9f:33:52:11:c6",
            "net9": "7a:03:5b:66:0a:a1"
        },
        "tof_1_2_5": {
            "net0": "56:e7:08:c5:5b:2d",
            "net1": "da:f0:f9:37:c6:a4",
            "net10": "c6:f4:f4:95:75:48",
            "net11": "62:00:43:38:b0:a0",
            "net12": "62:86:06:fa:c2:ac",
            "net13": "0e:02:07:58:95:46",
            "net14": "5a:91:a9:ce:df:e7",
            "net15": "76:35:ca:24:59:c3",
            "net16": "fa:6c:88:c0:5b:7c",
            "net17": "ce:b1:df:6b:d6:e0",
            "net18": "a2:9f:7b:73:9d:6b",
            "net19": "c2:28:35:fb:fb:d9",
            "net2": "ba:c9:39:cf:fa:be",
            "net20": "1e:55:98:98:a5:d6",
            "net21": "f6:fd:2f:e3:4d:ce",
            "net22": "3a:c6:68:66:a4:9f",
            "net23": "de:3e:4b:5b:a3:de",
            "net24": "ba:df:d0:29:f3:19",
            "net25": "6e:c1:2c:bc:eb:dd",
            "net26": "5a:47:1b:c4:d7:08",
            "net27": "3a:c9:c6:73:27:ed",
            "net3": "42:e0:36:f8:b9:76",
            "net4": "22:f4:3b:10:5d:d0",
            "net5": "4a:fb:e9:7b:63:b0",
            "net6": "36:64:fb:96:2e:51",
            "net7": "12:a6:66:9b:79:1c",
            "net8": "ae:56:23:b0:4a:53",
            "net9": "ea:7d:31:9c:94:d0"
        },
        "tof_1_2_6": {
            "net0": "ae:5c:b1:0c:e0:0a",
            "net1": "92:4a:8a:55:76:04",
            "net10": "fa:41:f5:b0:20:d7",
            "net11": "f2:54:4e:32:e8:e1",
            "net12": "8a:d6:ac:55:2e:1a",
            "net13": "e6:f5:ea:b0:0f:60",
            "net14": "12:53:57:10:a3:df",
            "net15": "7a:10:c6:6a:b3:89",
            "net16": "ce:ef:d3:ea:36:e0",
            "net17": "42:23:df:0f:76:05",
            "net18": "1a:bc:cd:19:aa:e1",
            "net19": "2a:9f:bc:c5:b4:0c",
            "net2": "06:3b:2d:da:6a:ad",
            "net20": "42:f8:e8:11:83:5f",
            "net21": "42:06:dc:ee:da:cf",
            "net22": "02:bc:9b:e9:ff:0a",
            "net23": "22:81:54:e6:e9:0e",
            "net24": "56:dc:6b:cf:21:82",
            "net25": "2a:7d:09:25:c6:ee",
            "net26": "1e:0a:30:32:e9:de",
            "net27": "fa:64:9c:c1:e3:2a",
            "net3": "ea:88:a5:b1:e7:e1",
            "net4": "b2:6a:a1:ef:ad:ff",
            "net5": "ca:c9:29:25:ff:30",
            "net6": "26:fb:29:6a:d7:05",
            "net7": "c6:23:59:fb:19:6c",
            "net8": "72:83:01:06:86:60",
            "net9": "2e:48:4e:ce:8c:04"
        },
        "tof_1_2_7": {
            "net0": "b6:9a:e0:f4:09:f1",
            "net1": "e6:6f:c2:70:f4:17",
            "net10": "3a:63:48:f6:25:3e",
            "net11": "0e:b1:c1:33:87:66",
            "net12": "66:f2:62:38:e9:e1",
            "net13": "b6:12:9e:02:ab:17",
            "net14": "02:81:67:f1:0f:15",
            "net15": "fe:c9:3a:5a:dd:92",
            "net16": "4e:f3:a0:31:cb:6e",
            "net17": "0e:1d:a7:6d:cc:6c",
            "net18": "2e:1c:6d:9e:93:c5",
            "net19": "4a:c9:19:a2:cd:4c",
            "net2": "8e:ab:e2:54:09:dc",
            "net20": "fa:68:e3:0b:9f:a7",
            "net21": "8e:c6:e3:77:c7:86",
            "net22": "d6:f7:25:0f:f5:5c",
            "net23": "fa:2d:37:6e:6e:c5",
            "net24": "b2:df:f6:98:57:b6",
            "net25": "42:00:50:cb:7b:eb",
            "net26": "be:89:27:26:0b:9d",
            "net27": "fa:56:ab:37:6b:7c",
            "net3": "22:8c:54:31:7b:09",
            "net4": "f6:48:34:d1:21:ae",
            "net5": "86:fc:fe:29:30:1d",
            "net6": "02:fb:94:5b:38:df",
            "net7": "e2:3c:02:9a:54:dc",
            "net8": "b2:18:45:6d:20:1f",
            "net9": "52:f8:17:81:b9:af"
        },
        "tof_1_2_8": {
            "net0": "02:0b:8f:bc:fa:a3",
            "net1": "ba:2f:8d:a7:91:b1",
            "net10": "0a:1f:b9:cc:94:bd",
            "net11": "e6:6c:2b:0c:cb:0e",
            "net12": "6a:ef:83:68:61:77",
            "net13": "76:90:9d:1e:24:c4",
            "net14": "72:bc:9b:f0:7a:ae",
            "net15": "5e:4b:53:de:27:05",
            "net16": "9e:ed:a9:0d:87:56",
            "net17": "8a:5f:e8:80:4b:60",
            "net18": "5a:25:72:a2:4a:ff",
            "net19": "32:f8:6f:97:be:39",
            "net2": "4e:78:33:d5:67:08",
            "net20": "be:81:9f:e7:11:45",
            "net21": "ba:22:cf:c5:8a:62",
            "net22": "92:25:01:f2:78:29",
            "net23": "f2:e6:d2:66:d9:e5",
            "net24": "36:77:0b:a1:a4:3a",
            "net25": "1a:d2:21:16:58:91",
            "net26": "2e:e7:2e:9d:0a:bf",
            "net27": "b2:dd:f1:76:76:98",
            "net3": "2a:94:53:57:18:85",
            "net4": "ce:e6:c3:46:6b:5d",
            "net5": "5e:0c:91:e7:18:ec",
            "net6": "e6:51:57:d2:a2:3d",
            "net7": "02:61:d1:43:9a:e2",
            "net8": "c2:3b:66:c3:14:43",
            "net9": "ce:35:1e:c4:fa:37"
        },
        "tof_1_2_9": {
            "net0": "da:2f:11:54:5e:b5",
            "net1": "72:59:c0:41:c8:67",
            "net10": "7e:a7:93:a0:29:a6",
            "net11": "c2:02:4f:e2:73:bb",
            "net12": "9a:2a:c5:3b:2b:24",
            "net13": "42:36:5c:3a:5d:42",
            "net14": "5e:59:e8:fe:5e:ef",
            "net15": "fa:b7:5f:88:67:62",
            "net16": "c2:df:34:f0:b2:54",
            "net17": "72:c3:a1:43:db:2c",
            "net18": "82:15:25:d1:fb:43",
            "net19": "46:01:8d:66:00:4d",
            "net2": "de:d3:6a:e5:d7:22",
            "net20": "ce:c4:16:6c:1f:d4",
            "net21": "be:eb:26:3c:8c:05",
            "net22": "6e:41:3b:de:0a:8e",
            "net23": "3a:45:df:b8:33:04",
            "net24": "66:40:b7:de:10:d0",
            "net25": "fe:97:8d:14:9d:4f",
            "net26": "9e:e3:a3:5d:64:d7",
            "net27": "b2:0c:15:a2:9c:82",
            "net3": "92:48:6e:be:3d:36",
            "net4": "56:e6:ce:6a:7b:a4",
            "net5": "2a:7a:81:9d:87:79",
            "net6": "6a:1d:d2:3b:4c:0e",
            "net7": "fe:1b:a3:f9:8e:61",
            "net8": "46:05:4a:65:d2:af",
            "net9": "4e:13:ed:f3:08:a5"
        }
    },
    "failed_machine": "leaf_1_0_1",
    "failure_time": 1613182714.3617642
}