{
    "description": "Scenario 6a: net0 link failure and recovery of leaf_1_0_1 with BGP",
    "k_leaf": 10,
    "k_top": 10,
    "redundancy_factor": 5,
    "is_k8s": true,
    "machine_mac_addresses": {
        "leaf_1_0_1": {
            "net0": "1e:1a:51:da:e0:d4",
            "net1": "ca:2d:e9:76:f9:c5",
            "net10": "32:37:a9:ba:78:a2",
            "net2": "7e:e9:95:bd:46:6c",
            "net3": "0e:19:6f:ae:88:6c",
            "net4": "3e:ce:56:a5:66:8f",
            "net5": "b6:c5:d0:60:a7:70",
            "net6": "de:e4:d4:d4:c4:9b",
            "net7": "9a:22:95:db:e1:b2",
            "net8": "a2:37:df:49:5c:f2",
            "net9": "0e:58:4c:48:38:19"
        },
        "leaf_1_0_10": {
            "net0": "66:6a:19:3b:7b:e0",
            "net1": "5e:d7:2a:95:ab:2c",
            "net10": "9a:33:41:4f:a0:ed",
            "net2": "ea:81:87:52:05:70",
            "net3": "b6:26:9b:1c:63:00",
            "net4": "5a:cc:e5:74:dd:37",
            "net5": "0e:dd:b8:0a:e0:ed",
            "net6": "22:f6:42:7d:98:f8",
            "net7": "da:72:2f:8c:84:c5",
            "net8": "2e:22:f6:ba:ba:c8",
            "net9": "de:b4:00:e0:e2:6d"
        },
        "leaf_1_0_2": {
            "net0": "5e:7c:46:19:c0:41",
            "net1": "3e:b6:3d:98:cc:5b",
            "net10": "82:d0:c9:34:8e:67",
            "net2": "ca:2a:6d:38:81:e2",
            "net3": "ca:a3:cd:da:8a:f3",
            "net4": "9a:74:0d:4e:20:a4",
            "net5": "16:76:1f:4a:c3:2c",
            "net6": "46:ed:1d:56:c8:77",
            "net7": "36:14:56:df:1a:69",
            "net8": "ee:85:d0:28:d8:3e",
            "net9": "ea:00:c4:79:ca:0d"
        },
        "leaf_1_0_3": {
            "net0": "e6:07:ca:e1:a4:17",
            "net1": "ba:26:d7:18:d9:c4",
            "net10": "e2:af:5f:c2:57:b3",
            "net2": "a2:6a:80:ef:4c:8a",
            "net3": "72:29:3d:0e:8c:59",
            "net4": "1e:57:aa:29:e4:02",
            "net5": "fe:84:c3:1a:5a:77",
            "net6": "0a:78:eb:b1:d1:45",
            "net7": "5e:5c:ed:48:99:ae",
            "net8": "1a:56:f8:a9:7f:62",
            "net9": "b6:b7:1a:63:a8:b6"
        },
        "leaf_1_0_4": {
            "net0": "2a:b7:f0:75:30:ce",
            "net1": "d6:de:9e:73:ba:25",
            "net10": "ae:7b:16:ad:77:50",
            "net2": "6a:a2:8b:5e:a9:8a",
            "net3": "8e:11:53:6e:25:58",
            "net4": "7e:d0:63:95:bd:ee",
            "net5": "26:07:db:29:82:a9",
            "net6": "a6:a8:bb:51:69:62",
            "net7": "2e:5b:87:f2:3b:8d",
            "net8": "b2:e8:f4:7c:c4:52",
            "net9": "62:77:53:d1:6c:0a"
        },
        "leaf_1_0_5": {
            "net0": "16:eb:f8:06:63:da",
            "net1": "12:64:57:3a:56:93",
            "net10": "9e:0c:16:a8:d2:7f",
            "net2": "36:97:be:f5:7f:86",
            "net3": "8a:01:d5:2a:84:36",
            "net4": "2a:d3:4c:19:fe:7e",
            "net5": "a6:44:67:b3:a0:bf",
            "net6": "72:61:83:ca:a9:72",
            "net7": "f2:f3:f6:b7:d2:55",
            "net8": "62:42:19:ab:9f:b5",
            "net9": "7a:c8:0a:dd:ec:83"
        },
        "leaf_1_0_6": {
            "net0": "82:7f:67:ad:61:df",
            "net1": "7a:d7:4e:c6:2d:ba",
            "net10": "6e:d9:70:b1:2c:b1",
            "net2": "fe:4a:bd:c6:13:e1",
            "net3": "4a:82:12:40:27:d5",
            "net4": "12:93:dd:dd:21:46",
            "net5": "86:62:f9:8e:c7:07",
            "net6": "8e:79:70:7c:6d:5b",
            "net7": "5e:bb:a6:43:d4:7b",
            "net8": "52:74:8a:ec:2b:28",
            "net9": "32:4d:6b:e1:a7:26"
        },
        "leaf_1_0_7": {
            "net0": "46:59:ba:9f:07:e0",
            "net1": "62:f3:5c:e9:b1:46",
            "net10": "12:ea:24:1f:68:5b",
            "net2": "be:db:88:75:33:0a",
            "net3": "56:8f:f6:38:db:0d",
            "net4": "ea:99:ba:3f:a9:83",
            "net5": "12:f4:4f:73:7e:da",
            "net6": "0a:8b:87:8a:df:0c",
            "net7": "12:8d:35:6e:40:e2",
            "net8": "f6:89:00:93:f3:a3",
            "net9": "a2:5f:2e:06:56:d8"
        },
        "leaf_1_0_8": {
            "net0": "9a:b6:5b:f7:5f:0d",
            "net1": "42:8c:b9:58:da:66",
            "net10": "06:0b:c5:da:f5:e6",
            "net2": "b2:52:40:32:e5:0a",
            "net3": "ca:05:de:04:d4:cc",
            "net4": "1e:0a:23:1b:3b:b7",
            "net5": "aa:b4:11:e1:95:08",
            "net6": "8e:e6:f5:09:6f:a6",
            "net7": "ae:ff:b5:99:c4:2f",
            "net8": "c2:87:cb:fb:36:43",
            "net9": "b6:67:cf:ea:d5:b9"
        },
        "leaf_1_0_9": {
            "net0": "82:e2:60:07:dc:c2",
            "net1": "c2:3b:67:4c:dd:19",
            "net10": "c2:d0:07:4c:55:0e",
            "net2": "9a:41:0c:2d:bf:e3",
            "net3": "0e:71:49:8f:63:bf",
            "net4": "12:08:fe:76:68:8a",
            "net5": "ca:35:ae:ae:b4:fe",
            "net6": "d2:61:fb:33:f2:96",
            "net7": "46:d3:72:77:0f:88",
            "net8": "ee:b0:19:96:f2:fb",
            "net9": "36:35:58:31:5f:62"
        },
        "leaf_2_0_1": {
            "net0": "be:c8:16:da:bf:8a",
            "net1": "0a:9e:06:08:f9:d7",
            "net10": "5a:af:b2:4c:a4:c1",
            "net2": "8a:77:c5:4c:e1:98",
            "net3": "32:8e:2e:56:c7:df",
            "net4": "56:44:be:c1:c9:60",
            "net5": "36:58:78:b5:44:3a",
            "net6": "96:f6:6c:06:fe:4d",
            "net7": "f2:c7:ed:4d:98:1d",
            "net8": "b6:c6:55:74:6f:c8",
            "net9": "8a:39:97:7d:f8:99"
        },
        "leaf_2_0_10": {
            "net0": "aa:62:31:b8:cf:e6",
            "net1": "aa:d1:6c:80:cc:6e",
            "net10": "1a:b4:84:e9:15:6d",
            "net2": "ae:e4:8f:6c:52:1b",
            "net3": "fe:67:cb:e7:54:a4",
            "net4": "fa:e5:d7:12:cc:45",
            "net5": "c6:75:71:55:b8:09",
            "net6": "1e:17:9c:9b:fb:4b",
            "net7": "a6:53:d1:6a:e1:af",
            "net8": "86:83:c7:84:39:43",
            "net9": "3a:e5:7a:c1:41:75"
        },
        "leaf_2_0_2": {
            "net0": "16:e3:1a:02:eb:dc",
            "net1": "b6:ac:8b:68:de:14",
            "net10": "da:ce:ff:ec:37:f4",
            "net2": "06:bc:83:0d:05:b1",
            "net3": "92:a8:8e:0f:35:96",
            "net4": "26:db:37:f7:9d:e8",
            "net5": "d6:43:56:aa:c9:02",
            "net6": "3e:91:bd:f3:1b:94",
            "net7": "2a:1a:80:1d:e6:d2",
            "net8": "ae:45:2b:7a:5d:78",
            "net9": "46:55:c1:4e:6a:2b"
        },
        "leaf_2_0_3": {
            "net0": "1e:79:03:bc:94:b0",
            "net1": "b2:28:a5:1e:c2:9a",
            "net10": "fe:a1:f0:af:e2:b6",
            "net2": "4e:65:4b:6c:1b:a1",
            "net3": "4e:21:d0:4e:dd:3b",
            "net4": "a2:3a:44:ae:cf:47",
            "net5": "ee:9d:36:4a:40:3f",
            "net6": "b2:9c:1a:d4:78:6b",
            "net7": "f6:06:37:42:1c:1c",
            "net8": "a6:f7:4c:62:69:c0",
            "net9": "c6:1e:a0:2e:e8:e0"
        },
        "leaf_2_0_4": {
            "net0": "de:ea:c0:03:d1:2b",
            "net1": "fa:a9:f4:4d:94:7e",
            "net10": "92:34:94:0a:22:d1",
            "net2": "de:36:01:3d:32:53",
            "net3": "9a:97:5e:ae:21:f5",
            "net4": "ea:46:5c:b3:c6:b2",
            "net5": "2e:5a:01:a7:62:75",
            "net6": "66:e2:20:4b:5b:aa",
            "net7": "62:a8:c4:80:44:c9",
            "net8": "8a:c9:b1:e9:b8:bb",
            "net9": "ba:f1:c8:67:66:0f"
        },
        "leaf_2_0_5": {
            "net0": "4a:bf:b4:46:2d:ad",
            "net1": "d6:8c:91:41:f8:ff",
            "net10": "ce:b7:1b:06:7c:cf",
            "net2": "c2:08:d6:5c:c1:5e",
            "net3": "aa:1d:de:7e:9c:c6",
            "net4": "12:27:86:96:df:9b",
            "net5": "1a:d7:cc:01:c9:87",
            "net6": "1a:8d:fd:19:a7:f6",
            "net7": "5a:63:2c:2b:e0:af",
            "net8": "be:4f:86:be:62:e5",
            "net9": "86:28:82:05:69:65"
        },
        "leaf_2_0_6": {
            "net0": "ae:38:b3:fe:18:2b",
            "net1": "9a:53:22:45:93:ca",
            "net10": "f2:8b:e5:0f:b7:05",
            "net2": "a2:e2:8c:34:5f:51",
            "net3": "fe:12:82:71:c7:71",
            "net4": "0a:33:31:73:12:54",
            "net5": "e2:e3:3d:81:44:73",
            "net6": "ca:e4:55:ee:1e:c6",
            "net7": "9e:11:6d:db:64:03",
            "net8": "d6:43:62:a8:8a:ac",
            "net9": "82:c8:ff:a9:63:dd"
        },
        "leaf_2_0_7": {
            "net0": "a2:0f:73:44:92:a4",
            "net1": "ca:87:0b:c3:22:8c",
            "net10": "32:92:c8:8a:1c:bd",
            "net2": "62:40:62:87:eb:09",
            "net3": "46:6c:22:7a:d6:12",
            "net4": "1e:71:81:3c:56:59",
            "net5": "f2:e3:7e:e8:04:e4",
            "net6": "fa:b9:5f:5c:5a:d2",
            "net7": "8a:1b:8f:2a:7d:2e",
            "net8": "26:f8:c9:ac:39:40",
            "net9": "0a:b0:16:39:78:f7"
        },
        "leaf_2_0_8": {
            "net0": "d2:c4:7c:e5:26:c0",
            "net1": "aa:5c:e4:1e:81:11",
            "net10": "ba:d3:37:41:81:35",
            "net2": "96:b2:6b:0f:e4:5f",
            "net3": "c6:62:19:56:47:a1",
            "net4": "72:d7:11:e6:db:6a",
            "net5": "92:fe:97:be:c2:c0",
            "net6": "5e:77:33:1a:cd:e7",
            "net7": "42:c2:83:c5:49:b2",
            "net8": "72:f8:bf:72:b0:5a",
            "net9": "d2:3a:2d:bb:35:45"
        },
        "leaf_2_0_9": {
            "net0": "32:55:6a:9d:bb:ca",
            "net1": "76:fb:4b:07:32:38",
            "net10": "be:2f:8c:c1:80:01",
            "net2": "c2:67:c6:56:38:b4",
            "net3": "12:78:77:39:19:cc",
            "net4": "0e:49:83:0c:56:34",
            "net5": "8e:bb:4f:2c:71:b8",
            "net6": "02:66:ec:4a:81:89",
            "net7": "8e:f3:94:d8:35:cb",
            "net8": "16:9b:0f:76:ca:1c",
            "net9": "d2:f8:e5:3c:27:e2"
        },
        "leaf_3_0_1": {
            "net0": "96:b7:10:5b:30:1d",
            "net1": "fa:bb:25:c9:02:7f",
            "net10": "52:37:74:83:e1:b7",
            "net2": "e6:92:9e:fd:88:a6",
            "net3": "2a:4c:4e:86:be:a8",
            "net4": "22:f1:79:fe:86:80",
            "net5": "06:05:d5:10:a4:da",
            "net6": "16:e8:75:aa:d3:eb",
            "net7": "ba:45:b7:f6:93:f7",
            "net8": "e2:78:87:e9:69:77",
            "net9": "1e:4f:c7:6e:d2:0e"
        },
        "leaf_3_0_10": {
            "net0": "e2:a1:da:24:fe:fc",
            "net1": "0e:55:ed:b8:17:48",
            "net10": "1a:dd:67:cd:34:44",
            "net2": "b2:f3:c4:92:c0:8c",
            "net3": "c2:e6:cb:63:91:6e",
            "net4": "56:05:2a:2e:67:35",
            "net5": "36:38:fa:20:06:33",
            "net6": "2a:3b:21:a0:0e:ed",
            "net7": "36:10:55:f8:d6:fb",
            "net8": "52:04:c2:e4:29:11",
            "net9": "3a:31:0d:03:9e:11"
        },
        "leaf_3_0_2": {
            "net0": "9e:c0:4c:db:e6:6b",
            "net1": "ea:32:73:bd:08:ab",
            "net10": "9e:fb:26:18:29:5a",
            "net2": "1a:2e:94:04:d8:2f",
            "net3": "ee:b5:84:2b:61:11",
            "net4": "8a:44:9d:8e:79:10",
            "net5": "52:36:ae:5a:28:d6",
            "net6": "c6:08:c9:e4:04:97",
            "net7": "52:37:4d:a9:3a:de",
            "net8": "32:95:b0:75:7f:6f",
            "net9": "16:a3:a5:b3:3d:1c"
        },
        "leaf_3_0_3": {
            "net0": "be:6b:74:b3:f6:8f",
            "net1": "2e:23:44:9a:86:13",
            "net10": "aa:1f:c5:2e:c4:c9",
            "net2": "76:b3:ca:bc:f6:35",
            "net3": "be:3e:ad:69:da:81",
            "net4": "2a:35:5a:f0:cc:1d",
            "net5": "4a:88:35:fa:0e:3d",
            "net6": "6a:f6:be:dd:dc:db",
            "net7": "96:ce:97:11:1d:c1",
            "net8": "c2:94:fb:95:4d:e9",
            "net9": "96:ab:8a:4c:77:07"
        },
        "leaf_3_0_4": {
            "net0": "0e:fb:bd:36:02:5c",
            "net1": "ba:ab:a6:40:71:dd",
            "net10": "26:61:fe:e0:14:a4",
            "net2": "ca:91:20:4a:d8:cc",
            "net3": "e6:da:57:68:2b:8d",
            "net4": "1e:d8:9d:74:0e:53",
            "net5": "d6:39:3f:53:48:a9",
            "net6": "ee:84:ad:99:72:41",
            "net7": "aa:fb:29:2d:e9:0c",
            "net8": "46:49:87:8b:93:c5",
            "net9": "1e:a4:4e:91:a5:50"
        },
        "leaf_3_0_5": {
            "net0": "ca:f4:f9:78:ea:ed",
            "net1": "22:71:3e:8e:de:a2",
            "net10": "42:bb:a4:e8:9d:4d",
            "net2": "42:6a:89:53:a9:37",
            "net3": "92:3e:0f:67:9b:14",
            "net4": "1e:cb:ba:98:74:ed",
            "net5": "de:0f:4d:1c:67:dc",
            "net6": "be:e9:49:06:b5:44",
            "net7": "d6:d7:05:c1:58:15",
            "net8": "9e:bf:04:c0:4f:4e",
            "net9": "fa:07:2a:4d:c1:89"
        },
        "leaf_3_0_6": {
            "net0": "f2:9c:44:67:0d:24",
            "net1": "da:4a:f5:f4:95:20",
            "net10": "26:4b:5e:fc:63:38",
            "net2": "b2:ce:88:40:ce:73",
            "net3": "ee:bf:b1:d1:7e:2c",
            "net4": "72:ac:27:ca:95:fa",
            "net5": "96:a1:99:15:a9:b1",
            "net6": "ea:07:88:9d:d6:99",
            "net7": "6e:1e:42:da:be:28",
            "net8": "02:2c:49:c2:d6:00",
            "net9": "4e:fb:b1:05:4e:7e"
        },
        "leaf_3_0_7": {
            "net0": "26:05:57:27:81:f8",
            "net1": "ca:a2:05:bc:a4:53",
            "net10": "66:28:1d:d3:4e:81",
            "net2": "52:f1:85:b8:d4:28",
            "net3": "da:79:a5:92:ed:61",
            "net4": "a6:2d:79:f0:53:68",
            "net5": "2e:86:5b:26:ba:4f",
            "net6": "4e:86:29:cb:6d:e5",
            "net7": "06:90:2f:ee:e6:39",
            "net8": "26:6b:d1:6b:d3:25",
            "net9": "da:02:7a:b6:77:02"
        },
        "leaf_3_0_8": {
            "net0": "12:d0:75:92:ff:ad",
            "net1": "4a:b1:10:d4:d6:a9",
            "net10": "06:ac:e6:72:a6:96",
            "net2": "2a:2f:b0:ac:ed:e9",
            "net3": "be:31:14:d8:20:f2",
            "net4": "1e:92:61:70:5b:8f",
            "net5": "b6:b4:7e:b5:48:96",
            "net6": "9e:63:77:46:2f:7b",
            "net7": "9e:c9:4c:f2:00:df",
            "net8": "f6:39:cb:77:26:d6",
            "net9": "a2:e6:48:9f:06:47"
        },
        "leaf_3_0_9": {
            "net0": "7e:4b:31:8a:aa:0c",
            "net1": "7e:4f:aa:60:39:2e",
            "net10": "aa:fa:e1:82:5b:70",
            "net2": "82:6b:ca:df:b7:9d",
            "net3": "aa:35:05:a0:0d:1e",
            "net4": "b2:3b:ba:f1:db:ec",
            "net5": "4a:6b:b5:c5:f5:36",
            "net6": "46:2b:f9:15:06:d5",
            "net7": "8e:83:f4:54:ef:e7",
            "net8": "fa:b2:14:63:2f:cc",
            "net9": "16:92:7d:c3:4f:7e"
        },
        "leaf_4_0_1": {
            "net0": "4a:f9:5c:61:15:0d",
            "net1": "9e:db:1d:6d:3d:f4",
            "net10": "62:b4:04:b7:2f:a9",
            "net2": "2e:25:f9:37:c6:bd",
            "net3": "b2:1d:1a:87:f0:a2",
            "net4": "4a:83:b2:56:bc:42",
            "net5": "9e:c1:67:f4:b3:70",
            "net6": "02:a6:d8:57:0d:9b",
            "net7": "b6:5d:41:0d:1f:8d",
            "net8": "1a:8b:7d:a2:62:75",
            "net9": "7a:db:8d:bb:9b:8e"
        },
        "leaf_4_0_10": {
            "net0": "e2:a0:71:f9:53:2b",
            "net1": "ba:33:bf:d8:7b:2a",
            "net10": "ea:40:67:b9:ce:64",
            "net2": "1e:34:2f:92:ee:19",
            "net3": "5e:5b:8f:5d:8c:7b",
            "net4": "ce:de:00:1c:6b:0f",
            "net5": "0e:7e:58:f5:d3:88",
            "net6": "06:57:69:e7:a2:31",
            "net7": "da:c1:26:d3:df:bc",
            "net8": "9e:1a:c0:f3:fb:cb",
            "net9": "5e:1a:20:1b:c4:d2"
        },
        "leaf_4_0_2": {
            "net0": "ea:ef:29:6c:c5:ce",
            "net1": "b2:bf:eb:65:ef:83",
            "net10": "ca:a6:a4:83:4b:01",
            "net2": "16:5b:4f:79:b3:c8",
            "net3": "d6:93:e3:29:5b:8e",
            "net4": "92:a4:c3:ca:af:3b",
            "net5": "be:bc:ae:af:65:ce",
            "net6": "b6:c8:61:7f:a6:80",
            "net7": "56:2b:fd:5a:f5:69",
            "net8": "22:be:fb:ac:7c:b4",
            "net9": "0e:7c:95:95:b9:80"
        },
        "leaf_4_0_3": {
            "net0": "6a:2d:80:5e:2e:38",
            "net1": "6e:28:3c:89:89:89",
            "net10": "7a:1b:36:c8:3f:43",
            "net2": "ae:ce:28:34:9d:3d",
            "net3": "fa:ce:44:11:af:b4",
            "net4": "ce:3a:54:9b:e4:aa",
            "net5": "56:a5:bd:7c:b7:88",
            "net6": "a6:eb:c4:fa:97:22",
            "net7": "e2:f0:14:dc:47:9b",
            "net8": "7e:f2:c4:85:27:da",
            "net9": "ca:3f:c4:b3:1b:71"
        },
        "leaf_4_0_4": {
            "net0": "3a:7f:49:3f:35:27",
            "net1": "9e:96:c4:e8:d1:95",
            "net10": "ba:a9:30:fc:cd:5d",
            "net2": "1e:19:cb:52:f7:e4",
            "net3": "a6:3d:ff:6f:9d:a6",
            "net4": "a6:72:f6:74:19:8d",
            "net5": "62:1f:a7:70:c8:c3",
            "net6": "5a:82:da:28:6b:f0",
            "net7": "06:3c:78:a2:a4:2a",
            "net8": "c6:5a:56:f9:3c:25",
            "net9": "92:6d:f6:4f:a9:e1"
        },
        "leaf_4_0_5": {
            "net0": "06:a2:c2:f7:cc:a4",
            "net1": "9a:7c:de:5b:3e:0a",
            "net10": "f6:fc:2c:85:46:1f",
            "net2": "fa:20:e0:b3:aa:4a",
            "net3": "76:b9:19:05:cb:90",
            "net4": "c6:46:90:86:4f:d7",
            "net5": "9e:0b:89:89:c7:2f",
            "net6": "92:8e:86:43:42:61",
            "net7": "ae:96:f8:0b:07:88",
            "net8": "66:4d:a2:08:32:f3",
            "net9": "d2:d7:60:0e:75:59"
        },
        "leaf_4_0_6": {
            "net0": "52:ea:72:cb:0a:e2",
            "net1": "2e:e0:a3:30:0d:52",
            "net10": "16:d3:28:c1:ca:46",
            "net2": "ee:f0:c3:d0:ee:44",
            "net3": "6a:a9:ea:c3:18:ab",
            "net4": "9a:26:30:a8:3c:3a",
            "net5": "86:04:9a:f0:8e:e8",
            "net6": "66:ab:fe:f0:b1:56",
            "net7": "a6:c0:62:41:54:bc",
            "net8": "d6:1f:48:b0:0b:05",
            "net9": "de:e0:e8:c6:45:5f"
        },
        "leaf_4_0_7": {
            "net0": "72:cb:64:1e:6b:45",
            "net1": "9e:ca:a0:bc:7b:03",
            "net10": "ba:6d:0f:8f:01:64",
            "net2": "fe:0d:f3:6a:30:00",
            "net3": "8e:02:1a:e9:9a:23",
            "net4": "9e:7f:db:bd:ee:24",
            "net5": "ca:60:48:0a:b9:3e",
            "net6": "22:fd:b7:04:07:4c",
            "net7": "16:4b:0c:60:90:1c",
            "net8": "02:0d:4c:9e:da:47",
            "net9": "12:be:09:8e:31:54"
        },
        "leaf_4_0_8": {
            "net0": "6a:63:7f:0a:13:6a",
            "net1": "ca:ae:ac:59:a3:41",
            "net10": "9a:0e:fc:1c:80:09",
            "net2": "8e:7b:10:33:b4:d1",
            "net3": "aa:7f:97:31:c1:7a",
            "net4": "fa:1e:55:f8:c7:64",
            "net5": "32:44:d9:6d:f4:1d",
            "net6": "02:b7:6d:99:cc:3f",
            "net7": "02:4a:fe:47:30:97",
            "net8": "16:f0:95:81:08:cb",
            "net9": "06:ad:2f:7b:d8:17"
        },
        "leaf_4_0_9": {
            "net0": "ca:e7:6c:85:1b:d5",
            "net1": "f6:1e:1a:58:01:c7",
            "net10": "aa:37:ea:32:24:73",
            "net2": "56:97:50:1a:a6:d1",
            "net3": "4e:b4:46:b1:bb:b4",
            "net4": "b2:17:b3:d4:72:ad",
            "net5": "ae:35:f6:59:36:cc",
            "net6": "22:7c:e3:d1:58:f1",
            "net7": "4e:10:75:62:7b:ad",
            "net8": "3e:10:ac:ab:3c:90",
            "net9": "e2:9d:49:40:73:05"
        },
        "spine_1_1_1": {
            "net0": "0a:7c:bb:05:01:87",
            "net1": "3e:b1:80:01:f4:3b",
            "net10": "f2:01:92:c6:3f:9d",
            "net11": "aa:46:7f:a5:44:00",
            "net12": "c2:23:a6:c2:e1:99",
            "net13": "2e:01:f5:3e:06:c5",
            "net14": "ae:b5:33:1b:e5:db",
            "net15": "6a:91:78:e4:05:68",
            "net16": "4a:52:61:ef:d6:43",
            "net17": "62:dc:3b:e2:0a:59",
            "net18": "c2:00:63:73:bc:9d",
            "net19": "4a:db:ee:a3:ff:c9",
            "net2": "46:be:74:45:8c:13",
            "net3": "a2:88:d7:d8:56:90",
            "net4": "c6:c3:78:c2:47:61",
            "net5": "c2:f8:03:26:c6:84",
            "net6": "e2:3c:fb:31:22:1e",
            "net7": "6a:91:e4:cf:23:86",
            "net8": "3a:d0:3a:cd:2c:5b",
            "net9": "fa:b6:0c:fa:c2:c4"
        },
        "spine_1_1_10": {
            "net0": "5a:e3:e0:87:26:86",
            "net1": "66:04:23:98:78:e1",
            "net10": "d2:34:eb:49:cd:9c",
            "net11": "42:00:27:96:4b:5f",
            "net12": "16:65:df:e1:8a:ec",
            "net13": "4e:f2:1f:7d:cb:9f",
            "net14": "92:1c:1c:36:4c:35",
            "net15": "fa:5b:c0:04:d2:17",
            "net16": "fa:76:56:95:22:8d",
            "net17": "fa:79:cd:26:e1:59",
            "net18": "c2:44:da:69:98:2f",
            "net19": "66:69:cb:66:af:6b",
            "net2": "12:a9:5f:ca:1b:e4",
            "net3": "5e:f2:48:b1:96:d4",
            "net4": "8e:ec:fa:bb:f9:19",
            "net5": "c6:5e:67:82:0b:de",
            "net6": "a6:71:85:53:5d:3b",
            "net7": "0a:dc:73:2f:58:f4",
            "net8": "e2:cc:3f:e9:5f:0f",
            "net9": "62:41:29:60:41:1f"
        },
        "spine_1_1_2": {
            "net0": "da:91:af:5c:61:2c",
            "net1": "3a:3f:26:51:50:01",
            "net10": "ce:bd:fe:09:cd:15",
            "net11": "2a:24:49:27:cb:a5",
            "net12": "4e:27:aa:86:da:f2",
            "net13": "5a:f9:70:2e:b1:a5",
            "net14": "0a:39:6f:f4:5d:2e",
            "net15": "9e:e3:aa:3b:93:da",
            "net16": "da:08:76:90:88:d1",
            "net17": "0e:ab:4d:5a:00:d6",
            "net18": "4a:77:63:e3:19:0d",
            "net19": "26:31:34:c1:47:d7",
            "net2": "66:ca:e8:6a:56:6f",
            "net3": "d6:ae:e4:d7:59:d2",
            "net4": "3a:f9:d0:c1:21:fc",
            "net5": "82:e2:36:98:c6:07",
            "net6": "ca:36:d5:15:f1:41",
            "net7": "76:fc:4b:2f:09:bb",
            "net8": "fe:d7:d3:fb:4a:cf",
            "net9": "c6:72:b0:65:2a:5f"
        },
        "spine_1_1_3": {
            "net0": "e2:18:de:e2:11:2d",
            "net1": "6e:ee:eb:1c:e0:0f",
            "net10": "ca:2c:e7:6a:ab:30",
            "net11": "6a:b3:3f:14:33:48",
            "net12": "62:d7:04:02:be:8e",
            "net13": "ce:89:89:c4:27:bb",
            "net14": "72:b2:d1:4c:33:b6",
            "net15": "8a:41:e6:3f:c8:04",
            "net16": "ca:76:35:62:c4:b4",
            "net17": "26:2f:8b:22:ad:b7",
            "net18": "de:e9:b5:25:72:27",
            "net19": "96:1d:eb:d0:cb:1a",
            "net2": "7a:1c:e0:ba:b3:4e",
            "net3": "6a:ec:4e:f6:83:5c",
            "net4": "96:47:bc:a5:e8:9a",
            "net5": "0a:2c:aa:bc:6c:1b",
            "net6": "3e:78:22:46:5d:62",
            "net7": "52:4e:5e:38:8d:26",
            "net8": "c2:c5:14:64:22:97",
            "net9": "b2:36:cc:7b:9f:e0"
        },
        "spine_1_1_4": {
            "net0": "d6:2a:6a:50:7f:91",
            "net1": "72:f3:63:83:41:f3",
            "net10": "de:65:1a:c7:95:1e",
            "net11": "b6:e6:1b:db:f9:ba",
            "net12": "5e:34:3e:af:35:54",
            "net13": "8a:19:68:b5:51:04",
            "net14": "9a:77:92:cc:d4:e3",
            "net15": "a2:17:26:55:01:21",
            "net16": "9e:b7:3a:37:08:89",
            "net17": "ea:9c:91:9c:54:00",
            "net18": "66:7b:f6:a9:95:f3",
            "net19": "aa:b5:3c:e8:7a:b5",
            "net2": "0a:5c:b4:0b:cf:33",
            "net3": "96:57:bd:80:d7:7b",
            "net4": "02:3c:ee:53:f7:06",
            "net5": "8a:55:82:d1:42:5d",
            "net6": "5a:cd:54:2b:d1:43",
            "net7": "da:3c:d1:39:82:dc",
            "net8": "8a:a9:33:0e:e9:e7",
            "net9": "e6:0a:86:ef:82:32"
        },
        "spine_1_1_5": {
            "net0": "42:bd:4f:41:4a:f0",
            "net1": "5e:02:bd:9c:ee:02",
            "net10": "52:4b:f8:db:e0:ae",
            "net11": "1a:3c:07:25:2f:91",
            "net12": "66:9b:63:79:2e:a1",
            "net13": "22:fa:04:1c:a7:8d",
            "net14": "7a:7b:bb:19:0b:89",
            "net15": "a2:3c:90:9a:ae:4f",
            "net16": "0e:a3:9a:e7:d3:db",
            "net17": "42:0a:8e:fa:21:78",
            "net18": "32:02:b2:84:5c:5a",
            "net19": "de:6d:41:70:74:09",
            "net2": "fa:94:36:49:5e:d1",
            "net3": "72:b8:a6:34:2f:a9",
            "net4": "3a:0e:da:b9:95:ed",
            "net5": "2e:09:b3:e8:83:37",
            "net6": "fe:67:cb:df:d6:2c",
            "net7": "c6:aa:1e:66:a9:36",
            "net8": "46:5a:e0:df:d6:7a",
            "net9": "3e:4e:8e:c1:90:85"
        },
        "spine_1_1_6": {
            "net0": "ca:ee:be:b6:6d:99",
            "net1": "06:9c:e3:57:e6:cf",
            "net10": "b6:c9:89:4a:fd:80",
            "net11": "fa:9d:6e:d6:c5:8c",
            "net12": "42:de:6c:e3:40:be",
            "net13": "f2:23:36:2d:f2:e4",
            "net14": "c2:fc:5e:6b:a8:12",
            "net15": "6e:54:da:a3:de:ce",
            "net16": "3a:7a:4b:bc:73:a0",
            "net17": "66:a2:72:f7:0f:45",
            "net18": "0a:1b:49:57:f9:61",
            "net19": "b6:ba:6a:62:37:d3",
            "net2": "32:6e:d7:08:95:d3",
            "net3": "66:a3:82:a3:13:e5",
            "net4": "82:5e:0b:a9:3f:3d",
            "net5": "a2:2d:d7:1b:31:75",
            "net6": "46:7e:25:41:e6:27",
            "net7": "ea:89:15:14:5c:ec",
            "net8": "4a:b0:4e:00:08:6f",
            "net9": "a2:92:9c:8f:3f:8a"
        },
        "spine_1_1_7": {
            "net0": "9a:8c:9e:d4:e2:a0",
            "net1": "22:c4:5a:15:de:28",
            "net10": "32:84:58:bc:6a:4e",
            "net11": "2a:d3:23:96:97:32",
            "net12": "a6:9c:2d:f1:e1:12",
            "net13": "72:5c:a5:ee:1d:ad",
            "net14": "52:25:5c:af:7a:cb",
            "net15": "9a:05:82:30:d9:c0",
            "net16": "ce:24:95:7c:4d:24",
            "net17": "7a:96:13:e6:53:33",
            "net18": "ba:7f:19:e0:08:d7",
            "net19": "32:b7:9d:ad:6b:ec",
            "net2": "da:03:7f:cc:b5:d8",
            "net3": "9e:1a:03:94:eb:29",
            "net4": "16:01:9e:89:8f:ca",
            "net5": "de:e0:eb:56:98:fa",
            "net6": "22:c4:ba:93:fa:e5",
            "net7": "e2:06:28:bf:70:fe",
            "net8": "62:cb:22:b1:83:41",
            "net9": "b2:6a:b2:9a:c5:ef"
        },
        "spine_1_1_8": {
            "net0": "72:92:97:45:50:5c",
            "net1": "12:49:a6:a2:8a:2a",
            "net10": "e2:0c:f4:2c:52:1b",
            "net11": "fe:ad:24:3b:47:f8",
            "net12": "96:47:e7:42:0d:0d",
            "net13": "e6:9e:03:80:e2:02",
            "net14": "f6:d0:ed:f7:75:d4",
            "net15": "d2:8c:09:ff:6d:ff",
            "net16": "c6:c4:4c:09:02:e2",
            "net17": "fa:3b:60:6d:27:6f",
            "net18": "e2:f1:fd:34:37:72",
            "net19": "2e:4f:da:3d:ac:18",
            "net2": "5a:3f:8f:e6:40:1d",
            "net3": "4a:c6:ab:b3:0d:d9",
            "net4": "52:23:40:b2:d6:6d",
            "net5": "32:75:24:17:17:d2",
            "net6": "ce:98:d1:7a:59:81",
            "net7": "d2:1f:e5:f8:72:ea",
            "net8": "4a:5b:91:f7:12:12",
            "net9": "02:d2:88:10:c5:d5"
        },
        "spine_1_1_9": {
            "net0": "b6:08:91:6c:9f:1f",
            "net1": "02:30:cd:5e:fa:1c",
            "net10": "76:2f:6e:75:b8:cf",
            "net11": "f6:a2:09:28:a0:d2",
            "net12": "0e:c0:b8:dc:15:75",
            "net13": "c6:e8:3f:d4:97:75",
            "net14": "8a:08:45:32:dd:52",
            "net15": "36:23:88:f9:b3:15",
            "net16": "76:15:16:ec:62:03",
            "net17": "ee:1e:b0:69:7b:0f",
            "net18": "26:b3:f8:95:cf:15",
            "net19": "9a:59:ba:b4:f8:b7",
            "net2": "1a:e5:78:52:2f:15",
            "net3": "a2:04:7e:9f:66:50",
            "net4": "26:fc:60:75:46:29",
            "net5": "7e:2c:7a:f0:d6:a4",
            "net6": "52:49:a1:35:1d:3d",
            "net7": "3e:68:fe:5f:a5:95",
            "net8": "e6:d7:10:25:e1:3e",
            "net9": "26:a2:32:68:7c:d2"
        },
        "spine_2_1_1": {
            "net0": "ce:d8:05:8a:e8:5d",
            "net1": "6a:42:a0:0a:3e:69",
            "net10": "2a:9d:6e:69:27:40",
            "net11": "92:a3:80:33:57:d3",
            "net12": "62:80:97:28:bd:be",
            "net13": "6a:0c:61:a1:08:21",
            "net14": "de:d5:83:1c:28:30",
            "net15": "4e:29:e0:11:a4:91",
            "net16": "d6:7b:19:88:c4:30",
            "net17": "7e:8a:99:27:58:c9",
            "net18": "e2:84:4c:c9:8a:6e",
            "net19": "ca:0d:35:28:14:ab",
            "net2": "d2:59:3c:b3:00:97",
            "net3": "86:63:6f:e6:a1:25",
            "net4": "ae:85:95:36:e4:78",
            "net5": "26:ce:89:ba:da:7a",
            "net6": "b2:10:a2:91:43:1f",
            "net7": "de:f9:c8:aa:3b:3d",
            "net8": "ce:7b:27:23:0a:9f",
            "net9": "4a:86:b8:3e:95:bb"
        },
        "spine_2_1_10": {
            "net0": "46:36:3f:85:c7:23",
            "net1": "3e:12:e9:85:49:bd",
            "net10": "e2:e5:36:f5:29:ed",
            "net11": "56:f2:ea:1a:fb:92",
            "net12": "46:cc:7a:fb:bc:ad",
            "net13": "c2:75:fd:62:66:7e",
            "net14": "fa:30:ec:87:ca:ba",
            "net15": "ce:b9:de:00:ac:a9",
            "net16": "06:95:73:20:d7:7d",
            "net17": "ba:96:56:d9:eb:71",
            "net18": "ba:1f:b0:1c:70:07",
            "net19": "fa:dd:5e:30:6e:87",
            "net2": "a6:77:a0:0d:c1:ee",
            "net3": "42:f1:80:5e:84:9b",
            "net4": "92:29:1a:66:56:ac",
            "net5": "16:15:8a:dd:88:e6",
            "net6": "8e:f2:d0:ce:20:25",
            "net7": "56:67:dc:66:6c:5e",
            "net8": "36:3f:70:75:da:41",
            "net9": "e2:77:29:b5:25:26"
        },
        "spine_2_1_2": {
            "net0": "a6:b2:ea:c0:b8:fc",
            "net1": "2e:78:1b:33:6e:40",
            "net10": "7a:5a:f8:39:f4:f4",
            "net11": "7a:04:b3:80:ad:ff",
            "net12": "46:ea:fe:90:c7:22",
            "net13": "b6:61:91:28:e8:68",
            "net14": "06:04:d3:17:a5:e9",
            "net15": "6a:99:8d:0c:8d:b9",
            "net16": "ea:22:40:6c:b2:93",
            "net17": "ce:6f:04:6e:c3:44",
            "net18": "e2:1c:bf:5e:3a:0c",
            "net19": "d2:f4:0e:e0:05:60",
            "net2": "ba:91:b0:c5:fe:15",
            "net3": "ae:59:42:f8:d3:bf",
            "net4": "ee:60:7e:7d:9c:e4",
            "net5": "5a:46:0b:1c:80:2b",
            "net6": "e2:c5:22:41:eb:2e",
            "net7": "ae:44:d1:84:62:cd",
            "net8": "a6:50:77:73:89:67",
            "net9": "22:51:0f:51:fb:ee"
        },
        "spine_2_1_3": {
            "net0": "7a:7b:df:9b:18:07",
            "net1": "32:20:0a:a6:ed:27",
            "net10": "c6:3e:a8:05:58:18",
            "net11": "92:5d:34:89:30:a3",
            "net12": "9e:cc:71:8a:26:6c",
            "net13": "9e:ff:a3:57:76:01",
            "net14": "32:d6:98:43:9d:b1",
            "net15": "ba:9e:05:10:4b:23",
            "net16": "be:dd:3b:6e:be:89",
            "net17": "12:38:3a:b9:de:b3",
            "net18": "82:45:18:cc:fa:5a",
            "net19": "fe:f6:77:df:64:6b",
            "net2": "46:a8:b5:b9:39:03",
            "net3": "2a:ce:c0:4f:45:d6",
            "net4": "12:60:e9:da:04:0d",
            "net5": "3e:63:20:0c:bd:ba",
            "net6": "aa:fd:3d:88:66:aa",
            "net7": "da:c0:41:ce:fa:d3",
            "net8": "aa:08:86:d8:97:ed",
            "net9": "e2:c1:4c:f0:da:e8"
        },
        "spine_2_1_4": {
            "net0": "fe:92:41:54:7d:71",
            "net1": "b6:61:03:95:74:d5",
            "net10": "0e:44:8c:4a:e7:f1",
            "net11": "22:77:d0:0d:c8:ff",
            "net12": "ee:16:1f:2e:f7:58",
            "net13": "9a:7e:eb:7b:bc:44",
            "net14": "ba:86:c1:e0:f0:cd",
            "net15": "8a:92:4a:e2:8a:3a",
            "net16": "a6:fa:b5:fd:99:20",
            "net17": "ee:5f:50:55:a6:16",
            "net18": "0e:c2:85:12:b7:8f",
            "net19": "7e:4e:f6:9b:2b:3d",
            "net2": "c6:d8:88:cd:e3:78",
            "net3": "82:c1:bd:b5:1e:14",
            "net4": "56:81:84:52:a9:d8",
            "net5": "0e:a0:cd:91:be:ae",
            "net6": "e2:21:a5:66:4c:02",
            "net7": "4a:08:bc:4b:42:c5",
            "net8": "06:55:5b:ee:fd:af",
            "net9": "e6:51:d2:1f:fc:03"
        },
        "spine_2_1_5": {
            "net0": "e2:46:f3:a9:ed:1a",
            "net1": "82:84:f7:12:06:b0",
            "net10": "7e:8d:00:04:1b:95",
            "net11": "ce:8e:50:eb:0d:49",
            "net12": "4a:63:62:fe:05:10",
            "net13": "9e:01:05:ae:99:58",
            "net14": "96:1b:d9:c9:ca:16",
            "net15": "a2:f0:89:40:31:64",
            "net16": "f2:17:7d:12:d5:3a",
            "net17": "5e:b6:7a:32:b4:af",
            "net18": "66:54:58:1e:68:d4",
            "net19": "7e:68:86:9d:f6:f2",
            "net2": "2e:78:d9:4a:2a:6f",
            "net3": "d2:97:76:52:71:61",
            "net4": "7a:3a:a0:5f:60:38",
            "net5": "42:1e:43:9a:82:84",
            "net6": "96:d6:f6:9a:07:14",
            "net7": "de:42:38:05:de:a0",
            "net8": "fa:3e:8b:99:f1:e4",
            "net9": "1a:c7:44:c3:99:93"
        },
        "spine_2_1_6": {
            "net0": "06:e3:eb:b5:5a:e7",
            "net1": "86:4c:cf:1e:15:84",
            "net10": "66:09:a8:f4:ee:6b",
            "net11": "96:bc:1e:9d:10:e7",
            "net12": "ee:36:4a:d8:68:bb",
            "net13": "3a:5d:90:87:67:47",
            "net14": "b6:b2:51:0d:a0:aa",
            "net15": "96:8b:7d:68:2d:4d",
            "net16": "7a:c5:f3:c2:33:b2",
            "net17": "9a:03:b2:a0:2d:2d",
            "net18": "96:0f:89:8a:26:37",
            "net19": "36:5a:45:86:cc:46",
            "net2": "6a:ce:a4:0c:4a:f6",
            "net3": "36:b1:ce:52:76:29",
            "net4": "b6:55:c6:ad:f2:7a",
            "net5": "46:73:ff:ee:00:7f",
            "net6": "ea:a5:19:34:ed:9a",
            "net7": "a2:e2:8e:48:e0:46",
            "net8": "3e:15:f8:c8:42:f7",
            "net9": "ba:31:d9:cd:fd:85"
        },
        "spine_2_1_7": {
            "net0": "36:1f:a8:3b:4a:8c",
            "net1": "f6:cc:e7:45:04:57",
            "net10": "26:6c:c1:0e:c5:e6",
            "net11": "de:73:c0:f5:23:98",
            "net12": "a2:ed:57:14:bd:ef",
            "net13": "e6:f8:de:f1:19:18",
            "net14": "aa:56:c6:4d:f6:9a",
            "net15": "06:e3:3e:66:a7:42",
            "net16": "3a:12:a1:8c:ca:67",
            "net17": "de:6e:56:91:83:eb",
            "net18": "26:78:ed:18:43:a4",
            "net19": "de:46:14:80:b5:95",
            "net2": "be:7b:de:17:27:b6",
            "net3": "4e:d0:7b:b9:2d:52",
            "net4": "a2:25:c4:16:18:e8",
            "net5": "3e:12:8c:f3:dd:77",
            "net6": "fe:02:27:d0:86:1e",
            "net7": "f2:c7:77:21:48:bc",
            "net8": "16:a6:a2:6b:ae:b7",
            "net9": "6e:e7:79:6e:41:5d"
        },
        "spine_2_1_8": {
            "net0": "56:b3:46:95:ec:e0",
            "net1": "46:46:99:53:c8:d4",
            "net10": "56:d4:72:64:3a:e4",
            "net11": "52:aa:d1:2d:ed:1c",
            "net12": "b6:19:85:af:83:c5",
            "net13": "2e:8e:8c:95:1e:c6",
            "net14": "06:70:0f:e2:02:b7",
            "net15": "a2:d7:20:cd:42:e9",
            "net16": "6a:53:b7:2b:31:bf",
            "net17": "56:ed:d8:fc:68:87",
            "net18": "6e:12:4f:ad:b2:45",
            "net19": "72:41:04:cb:89:df",
            "net2": "a6:cc:f1:1c:93:01",
            "net3": "fa:fa:85:c1:8c:6d",
            "net4": "b2:3d:96:99:13:35",
            "net5": "aa:3b:51:40:0b:94",
            "net6": "4e:58:c8:31:48:00",
            "net7": "76:7a:3f:fa:56:92",
            "net8": "de:fe:45:a8:5c:e9",
            "net9": "da:3f:d9:00:06:98"
        },
        "spine_2_1_9": {
            "net0": "76:1d:00:3c:99:ea",
            "net1": "1a:80:02:c4:5a:ca",
            "net10": "a6:75:89:a9:c8:25",
            "net11": "5e:5e:dc:03:8f:fd",
            "net12": "26:aa:bd:aa:68:9b",
            "net13": "4e:c4:79:7f:54:2a",
            "net14": "da:40:a1:01:9c:44",
            "net15": "b2:39:82:0c:6c:42",
            "net16": "de:25:6d:69:22:eb",
            "net17": "26:11:b3:33:46:c0",
            "net18": "32:a5:b3:76:eb:a2",
            "net19": "02:8f:91:0a:ab:63",
            "net2": "f2:18:3e:1b:fb:07",
            "net3": "22:61:f9:a7:56:99",
            "net4": "66:20:da:0a:10:e8",
            "net5": "0e:d8:de:05:be:02",
            "net6": "8e:76:d5:bd:cc:ad",
            "net7": "92:26:73:1b:1b:b2",
            "net8": "e2:57:45:c9:29:b7",
            "net9": "da:76:af:0e:55:61"
        },
        "spine_3_1_1": {
            "net0": "42:d8:b4:f2:07:2e",
            "net1": "06:78:db:e4:2a:89",
            "net10": "9a:7a:18:5a:39:15",
            "net11": "12:1f:e7:3c:78:f8",
            "net12": "da:89:4d:fb:74:9c",
            "net13": "aa:fb:02:cb:0b:42",
            "net14": "62:af:4f:87:1c:33",
            "net15": "62:35:cb:5b:15:9e",
            "net16": "d6:e2:bd:36:17:91",
            "net17": "de:e4:b4:40:62:1b",
            "net18": "3a:7d:fd:8a:f0:58",
            "net19": "0e:ed:c6:a1:62:6e",
            "net2": "1a:b9:9d:e1:5f:e2",
            "net3": "66:70:0a:96:50:92",
            "net4": "9a:0a:14:c5:95:82",
            "net5": "52:9b:bf:c8:ed:7c",
            "net6": "0e:62:4a:7b:da:83",
            "net7": "76:06:e0:23:ed:d7",
            "net8": "d2:1a:f3:35:46:e5",
            "net9": "b2:67:98:98:94:ed"
        },
        "spine_3_1_10": {
            "net0": "c6:64:d3:32:76:3e",
            "net1": "e6:d9:b3:6f:15:d3",
            "net10": "62:f9:52:cd:b8:e8",
            "net11": "be:b2:90:4e:09:47",
            "net12": "32:76:5c:d1:cf:81",
            "net13": "0e:95:31:52:4f:1c",
            "net14": "36:01:92:10:54:47",
            "net15": "9e:b8:39:29:1a:43",
            "net16": "e2:1b:b3:4d:3b:28",
            "net17": "b6:8c:08:9b:9d:fe",
            "net18": "c6:cc:09:b6:d6:3a",
            "net19": "52:4c:e7:6a:b1:4f",
            "net2": "92:a1:81:ba:1d:ce",
            "net3": "4a:64:af:31:49:76",
            "net4": "6e:bb:5f:7e:35:b5",
            "net5": "0a:83:c8:8d:5b:d5",
            "net6": "7e:ba:ed:d0:a6:58",
            "net7": "e6:6e:c8:2a:0b:6c",
            "net8": "8a:f7:8d:c3:99:f9",
            "net9": "a6:a0:47:ab:c8:02"
        },
        "spine_3_1_2": {
            "net0": "0a:b1:52:a5:be:37",
            "net1": "fe:bd:c4:a2:67:b0",
            "net10": "96:b5:33:81:01:a5",
            "net11": "26:2e:bc:a8:69:ec",
            "net12": "22:f5:79:d2:22:2e",
            "net13": "aa:61:e3:c0:8b:98",
            "net14": "26:f9:a9:55:15:1f",
            "net15": "12:35:28:aa:cd:07",
            "net16": "de:f7:96:d4:18:f0",
            "net17": "de:ad:b0:da:82:05",
            "net18": "4a:a0:e1:80:e4:1f",
            "net19": "52:65:78:56:f0:da",
            "net2": "9e:47:69:20:e3:a3",
            "net3": "aa:36:e8:13:e1:eb",
            "net4": "1a:50:28:41:ec:e9",
            "net5": "1e:25:7a:3a:20:4f",
            "net6": "de:0e:22:91:25:61",
            "net7": "b2:b7:9e:d5:21:a3",
            "net8": "5e:cd:0e:bf:0c:ac",
            "net9": "c2:ee:3e:f6:2f:08"
        },
        "spine_3_1_3": {
            "net0": "7e:bb:73:b5:27:1d",
            "net1": "c6:04:13:f7:87:d1",
            "net10": "ae:98:ac:6c:3c:46",
            "net11": "7e:a9:4f:5e:c2:c1",
            "net12": "f2:3e:32:ed:e3:b5",
            "net13": "da:ef:cb:ca:35:e5",
            "net14": "b2:01:81:96:0a:0d",
            "net15": "66:64:9b:dc:c3:21",
            "net16": "a2:88:cf:d3:30:89",
            "net17": "62:0b:a0:05:ce:78",
            "net18": "3a:4c:7c:f7:f3:34",
            "net19": "5e:93:50:ee:42:bb",
            "net2": "4e:3a:57:13:ca:f7",
            "net3": "76:1b:20:40:9d:c3",
            "net4": "76:02:0c:2b:67:9c",
            "net5": "c6:fe:4d:e6:84:52",
            "net6": "92:0c:fe:f1:fd:a8",
            "net7": "52:fd:f4:bc:57:ba",
            "net8": "a2:db:ff:ba:83:31",
            "net9": "aa:c6:94:5c:23:44"
        },
        "spine_3_1_4": {
            "net0": "b6:b6:30:5a:41:71",
            "net1": "fa:a0:78:51:84:d5",
            "net10": "d6:c4:a5:95:1a:be",
            "net11": "e2:83:0c:28:70:55",
            "net12": "a6:ae:5e:57:52:45",
            "net13": "5e:8d:2e:ae:5c:28",
            "net14": "3a:6f:b9:62:07:19",
            "net15": "72:c2:68:02:c0:4d",
            "net16": "da:a5:78:2f:4f:92",
            "net17": "e6:0e:98:f8:e3:15",
            "net18": "a6:d2:03:0b:6c:3d",
            "net19": "be:4e:b9:8a:10:e6",
            "net2": "32:a4:cf:f0:8b:e6",
            "net3": "96:c3:f3:85:9d:71",
            "net4": "ce:e3:07:18:a9:a6",
            "net5": "7a:a9:ef:70:fe:a8",
            "net6": "6a:4a:da:8f:ba:e2",
            "net7": "c2:f4:bf:fc:48:d6",
            "net8": "46:7d:e1:a7:a2:e4",
            "net9": "3e:50:3c:46:f4:d1"
        },
        "spine_3_1_5": {
            "net0": "ba:76:54:71:e0:ba",
            "net1": "2a:db:cc:e2:ad:28",
            "net10": "66:88:ae:2a:9c:ce",
            "net11": "a6:08:89:f0:9c:76",
            "net12": "c2:ae:2e:50:c6:ba",
            "net13": "a6:00:be:d0:3c:58",
            "net14": "06:d3:05:92:1a:4b",
            "net15": "ca:97:0f:2d:e5:e2",
            "net16": "da:99:9f:5d:21:20",
            "net17": "82:84:11:a3:ac:73",
            "net18": "76:3e:8a:6a:ab:15",
            "net19": "d6:44:be:ab:8c:3e",
            "net2": "6e:22:a6:49:f3:b0",
            "net3": "b2:44:18:0e:b2:be",
            "net4": "a2:76:00:ff:b1:cd",
            "net5": "8e:7a:c5:38:27:9c",
            "net6": "26:17:e1:8d:27:d3",
            "net7": "b2:05:28:3b:17:a8",
            "net8": "da:87:80:3b:01:46",
            "net9": "32:d8:ee:1d:6b:37"
        },
        "spine_3_1_6": {
            "net0": "c2:92:dc:88:9d:5c",
            "net1": "a6:2b:58:c8:dd:66",
            "net10": "76:1b:b6:09:5b:2a",
            "net11": "42:22:45:94:41:5d",
            "net12": "46:83:45:53:bb:2e",
            "net13": "2e:8f:00:e2:e7:5b",
            "net14": "c2:ad:97:d2:6a:2a",
            "net15": "1a:6e:b1:e6:2f:4e",
            "net16": "92:cb:31:2f:b6:ce",
            "net17": "c6:28:52:9b:fc:38",
            "net18": "0e:40:ee:00:79:b1",
            "net19": "06:a0:34:d5:d9:e7",
            "net2": "e2:58:22:20:a6:58",
            "net3": "6e:29:fc:ce:cb:98",
            "net4": "6a:c9:38:1b:7e:73",
            "net5": "8a:0b:72:d1:d9:1b",
            "net6": "66:09:32:7b:a8:2f",
            "net7": "b6:f9:6a:3f:22:df",
            "net8": "0e:43:b1:71:6e:dc",
            "net9": "fe:5d:50:3e:28:01"
        },
        "spine_3_1_7": {
            "net0": "96:a7:14:d5:d3:08",
            "net1": "06:15:5a:80:3f:11",
            "net10": "0a:cc:7c:e1:7e:8f",
            "net11": "d6:a5:89:4a:55:90",
            "net12": "86:35:2b:d0:5c:64",
            "net13": "ea:7e:c4:c3:5b:be",
            "net14": "ee:ad:cd:29:2c:09",
            "net15": "7e:34:a6:ba:c5:50",
            "net16": "4e:f7:90:ca:45:4e",
            "net17": "3a:17:35:2e:65:2c",
            "net18": "5a:33:b5:41:8f:89",
            "net19": "42:d0:7f:a1:23:70",
            "net2": "52:70:1a:c8:41:70",
            "net3": "96:00:d2:13:4c:bc",
            "net4": "e2:d5:40:b9:06:6f",
            "net5": "9e:d7:d6:87:0a:c7",
            "net6": "86:6a:06:58:15:af",
            "net7": "e2:48:80:22:db:6b",
            "net8": "1a:e9:af:40:68:88",
            "net9": "4e:d2:d3:e6:6a:3f"
        },
        "spine_3_1_8": {
            "net0": "6e:a6:97:04:f2:55",
            "net1": "6e:42:e9:e8:0d:34",
            "net10": "8e:83:69:f6:9d:30",
            "net11": "1a:16:2e:0c:10:8f",
            "net12": "f2:05:5b:bd:ac:2f",
            "net13": "fa:09:0b:e0:87:8f",
            "net14": "9e:77:cb:d8:00:0d",
            "net15": "9a:52:ff:73:79:93",
            "net16": "c6:cc:52:69:1a:54",
            "net17": "96:ca:b9:e1:c5:48",
            "net18": "12:fc:a1:76:73:62",
            "net19": "fa:35:77:8d:fb:1d",
            "net2": "6a:66:ba:c9:f7:b1",
            "net3": "e6:89:f7:12:ae:ba",
            "net4": "ea:40:fd:29:bc:80",
            "net5": "6e:18:e5:71:24:c0",
            "net6": "fa:a9:3c:1e:5a:db",
            "net7": "36:18:7a:07:2a:7a",
            "net8": "de:41:80:71:7d:70",
            "net9": "66:f9:1d:1d:f4:97"
        },
        "spine_3_1_9": {
            "net0": "d2:58:16:c8:8f:b9",
            "net1": "1a:66:72:d1:af:f5",
            "net10": "aa:82:38:f2:1d:b0",
            "net11": "0e:fc:9f:ed:92:e2",
            "net12": "b6:4d:b7:ea:06:b9",
            "net13": "2a:e8:f7:6c:74:5c",
            "net14": "76:6c:5d:fe:a2:13",
            "net15": "aa:fc:c3:06:1e:ca",
            "net16": "0a:4b:4d:a2:df:21",
            "net17": "7a:24:86:3c:7c:a6",
            "net18": "3a:30:69:55:4b:bb",
            "net19": "e2:3f:e1:39:eb:d5",
            "net2": "3e:8d:17:82:13:e4",
            "net3": "e2:49:a6:ea:b9:6c",
            "net4": "22:22:af:17:e4:31",
            "net5": "a6:14:0e:bf:45:6b",
            "net6": "f2:d7:04:88:7b:b4",
            "net7": "fe:21:9d:be:fe:f5",
            "net8": "46:d5:16:35:5f:df",
            "net9": "76:3d:b2:98:be:9d"
        },
        "spine_4_1_1": {
            "net0": "06:16:29:36:66:e1",
            "net1": "aa:6e:19:d6:92:78",
            "net10": "52:10:8b:a6:84:3b",
            "net11": "16:2f:59:83:b6:c2",
            "net12": "3e:07:e8:cc:6b:a5",
            "net13": "6e:83:0c:88:a0:4f",
            "net14": "26:f5:d6:d4:fa:0c",
            "net15": "ca:f0:9d:76:18:a7",
            "net16": "be:90:58:0a:6b:86",
            "net17": "ae:9b:34:83:6a:1f",
            "net18": "42:cb:bd:bc:c6:a7",
            "net19": "a6:b5:68:9e:a1:8a",
            "net2": "be:1e:9e:1c:94:92",
            "net3": "f2:1b:fe:41:d0:8a",
            "net4": "5e:e5:06:04:2a:e5",
            "net5": "be:9d:e2:47:89:7f",
            "net6": "22:7e:4d:db:97:36",
            "net7": "1a:02:fc:63:b7:76",
            "net8": "ba:aa:4a:ae:6f:32",
            "net9": "8a:e6:15:af:1e:97"
        },
        "spine_4_1_10": {
            "net0": "a6:93:ee:80:e2:ce",
            "net1": "26:f0:11:59:f1:cc",
            "net10": "6e:29:ef:95:ee:b9",
            "net11": "6a:52:65:83:87:9c",
            "net12": "2e:70:43:63:c4:a9",
            "net13": "fe:c2:51:01:78:2a",
            "net14": "7e:77:36:47:16:27",
            "net15": "36:0b:ce:65:b6:70",
            "net16": "46:5e:c4:c8:3b:f0",
            "net17": "02:d6:80:c2:e9:ad",
            "net18": "9a:99:22:9c:ba:54",
            "net19": "16:73:2d:27:16:66",
            "net2": "b2:d0:87:30:35:e1",
            "net3": "06:e0:a7:80:bc:0f",
            "net4": "7a:c4:a2:7b:8d:97",
            "net5": "a6:96:0a:a0:48:99",
            "net6": "32:ee:f8:b8:2e:9e",
            "net7": "82:15:2e:d8:8a:c5",
            "net8": "f6:02:11:91:52:62",
            "net9": "5e:a5:38:2a:a9:ca"
        },
        "spine_4_1_2": {
            "net0": "da:1b:7d:4a:16:4c",
            "net1": "6a:a9:c0:98:c0:77",
            "net10": "be:02:7f:28:b7:d3",
            "net11": "ae:0e:78:b7:4f:c9",
            "net12": "da:a0:2c:02:ab:44",
            "net13": "f2:d3:6b:57:42:38",
            "net14": "4e:e1:ca:4e:af:d4",
            "net15": "e2:bf:c9:7b:2e:74",
            "net16": "de:8f:9c:43:30:ee",
            "net17": "a6:d2:5d:90:4e:df",
            "net18": "5e:c4:95:a7:f3:9f",
            "net19": "1e:ac:c3:1c:d4:e4",
            "net2": "ca:d8:76:2a:e2:cf",
            "net3": "a2:1a:c0:27:98:f8",
            "net4": "2e:53:e4:76:df:f4",
            "net5": "9e:30:21:d1:a7:3f",
            "net6": "96:ff:86:9d:4c:54",
            "net7": "d2:b7:80:30:1d:6d",
            "net8": "12:0a:07:cc:12:cd",
            "net9": "22:53:22:60:07:26"
        },
        "spine_4_1_3": {
            "net0": "16:96:65:44:35:bb",
            "net1": "32:4e:a1:9e:94:87",
            "net10": "0a:22:e8:87:24:76",
            "net11": "52:0c:97:96:2a:54",
            "net12": "7a:f4:e4:2d:29:b9",
            "net13": "ae:41:9c:c9:17:44",
            "net14": "02:a5:b2:02:3c:45",
            "net15": "82:bc:88:85:cb:e7",
            "net16": "e6:71:51:d2:61:11",
            "net17": "96:a7:55:1f:be:a2",
            "net18": "26:83:ac:39:27:a5",
            "net19": "42:28:bf:51:11:4c",
            "net2": "0e:5e:fc:45:ac:2b",
            "net3": "2e:7e:3c:c6:44:67",
            "net4": "4a:90:e0:b6:e0:85",
            "net5": "7a:b6:79:8b:90:00",
            "net6": "32:44:73:39:e7:7b",
            "net7": "8e:a9:aa:2f:74:2d",
            "net8": "0e:eb:e3:d5:ff:e8",
            "net9": "c2:86:a1:47:88:c9"
        },
        "spine_4_1_4": {
            "net0": "ce:41:61:d8:63:73",
            "net1": "46:f7:01:83:e9:30",
            "net10": "82:59:78:f9:66:11",
            "net11": "96:ea:f3:1d:7e:f5",
            "net12": "e2:4d:4e:18:a0:26",
            "net13": "4a:23:53:6d:c5:22",
            "net14": "72:4d:05:ec:a3:2d",
            "net15": "3e:3a:02:b2:6f:52",
            "net16": "82:9d:9b:e6:6f:91",
            "net17": "3a:a0:d8:ce:d6:3d",
            "net18": "b6:89:2d:1f:08:80",
            "net19": "fa:71:5f:ba:1f:50",
            "net2": "6e:ab:76:54:ae:b9",
            "net3": "92:35:ac:ae:d0:ec",
            "net4": "ca:d7:d7:9f:56:f1",
            "net5": "e2:78:58:7c:df:96",
            "net6": "ea:ea:2d:85:b1:47",
            "net7": "36:23:2d:33:1b:5c",
            "net8": "da:44:fa:51:f0:ef",
            "net9": "b6:21:ce:0c:9c:99"
        },
        "spine_4_1_5": {
            "net0": "26:20:10:46:4b:c0",
            "net1": "7e:cd:0a:1f:cb:95",
            "net10": "1a:c4:5d:d2:13:e3",
            "net11": "36:19:ed:23:4d:60",
            "net12": "62:2f:09:9b:aa:6c",
            "net13": "1a:d7:a7:19:e8:c2",
            "net14": "32:3d:ec:2d:69:d3",
            "net15": "9e:8e:8c:61:64:11",
            "net16": "52:ca:ca:7d:03:c5",
            "net17": "2a:76:f3:fc:c3:e0",
            "net18": "56:26:c9:97:2d:8e",
            "net19": "a2:0b:f5:58:95:70",
            "net2": "3a:7d:98:20:26:a2",
            "net3": "96:bb:9b:46:00:65",
            "net4": "ea:f6:0e:5f:71:f0",
            "net5": "72:bc:3d:be:2b:c0",
            "net6": "6e:0c:94:16:86:56",
            "net7": "8a:de:4b:14:81:35",
            "net8": "82:04:a8:c4:47:59",
            "net9": "82:c6:51:e8:8c:07"
        },
        "spine_4_1_6": {
            "net0": "6e:4f:94:88:34:50",
            "net1": "52:77:80:d4:7b:5c",
            "net10": "3a:ea:08:e2:bf:b6",
            "net11": "92:fc:cd:45:8e:7f",
            "net12": "da:9f:a4:80:0f:3b",
            "net13": "42:cd:d8:f6:3d:87",
            "net14": "86:8f:d2:b5:b9:a6",
            "net15": "1e:07:3f:97:1c:98",
            "net16": "1a:cf:bb:f9:b8:d9",
            "net17": "b2:c0:3e:83:21:ec",
            "net18": "1a:23:d5:e4:85:7a",
            "net19": "86:26:f6:ad:94:ce",
            "net2": "8e:1b:9e:d9:19:c1",
            "net3": "72:0c:8c:ef:da:42",
            "net4": "ce:3b:d0:60:05:3f",
            "net5": "12:eb:f2:15:05:c1",
            "net6": "ce:35:03:2a:7c:3b",
            "net7": "fa:3c:df:df:77:f1",
            "net8": "86:ff:08:9c:85:9a",
            "net9": "96:6c:11:6a:a5:cc"
        },
        "spine_4_1_7": {
            "net0": "aa:94:7a:85:85:fc",
            "net1": "ae:8a:ef:d6:ab:c8",
            "net10": "52:22:bc:a4:08:ab",
            "net11": "76:ac:61:a1:1a:8e",
            "net12": "d2:38:64:45:df:cd",
            "net13": "22:2b:dd:54:8f:4f",
            "net14": "f2:6c:00:e8:a5:f0",
            "net15": "3a:f7:68:35:f0:20",
            "net16": "0a:b1:c8:7b:33:47",
            "net17": "66:0a:44:68:fb:09",
            "net18": "e6:69:f5:4c:a3:31",
            "net19": "76:63:b9:7f:c1:0e",
            "net2": "22:03:5c:6c:8a:0a",
            "net3": "fa:2e:bb:82:a5:67",
            "net4": "9e:c4:3a:2a:98:29",
            "net5": "56:e4:a0:1b:38:ae",
            "net6": "26:89:b3:c5:f8:67",
            "net7": "72:d4:e1:aa:2e:6d",
            "net8": "4a:d0:8a:53:57:44",
            "net9": "9a:95:a2:99:f7:fc"
        },
        "spine_4_1_8": {
            "net0": "5e:e3:b1:ee:e6:79",
            "net1": "16:99:55:d1:f5:b6",
            "net10": "be:68:06:02:91:9e",
            "net11": "be:16:a1:1a:44:fe",
            "net12": "ce:be:3a:ed:84:47",
            "net13": "ca:b2:5d:c1:33:cd",
            "net14": "de:fd:c7:79:07:be",
            "net15": "9e:41:67:85:37:ce",
            "net16": "4e:0c:2d:48:a1:ad",
            "net17": "52:d3:44:ae:15:89",
            "net18": "0e:87:73:eb:09:fa",
            "net19": "e6:b7:4e:de:79:b7",
            "net2": "86:3a:d5:2a:ee:1a",
            "net3": "a2:c7:c4:97:95:0d",
            "net4": "8a:42:ba:c8:e1:76",
            "net5": "26:5e:7b:fe:ad:a5",
            "net6": "3a:45:60:b3:ca:0a",
            "net7": "a2:58:84:41:f0:c4",
            "net8": "72:54:97:b8:29:4a",
            "net9": "7e:d4:ff:23:5d:70"
        },
        "spine_4_1_9": {
            "net0": "0e:64:88:9c:ed:af",
            "net1": "e2:47:a6:33:03:65",
            "net10": "da:88:d1:f1:70:43",
            "net11": "b6:c5:a1:db:0f:c8",
            "net12": "5a:bc:63:52:d0:ff",
            "net13": "e2:36:3c:3f:79:e6",
            "net14": "56:ca:67:c6:30:88",
            "net15": "ea:28:ac:22:ea:2c",
            "net16": "de:cb:e0:aa:da:7a",
            "net17": "5e:90:49:4d:87:4f",
            "net18": "b6:ed:d5:79:b8:8c",
            "net19": "3a:72:87:46:b4:bf",
            "net2": "9e:c7:ef:e6:e4:a9",
            "net3": "8e:e5:5b:c3:b3:1a",
            "net4": "2a:44:ae:f8:2e:28",
            "net5": "22:07:74:af:d4:f8",
            "net6": "76:81:ca:e5:de:93",
            "net7": "a6:ef:52:57:a0:bc",
            "net8": "ce:5d:cc:21:61:e0",
            "net9": "76:a2:37:ea:b8:9e"
        },
        "tof_1_2_1": {
            "net0": "46:3f:15:c3:62:43",
            "net1": "9a:ad:e6:83:a9:e5",
            "net10": "fe:93:e8:f4:1e:5c",
            "net11": "b2:1e:61:9d:ab:2e",
            "net12": "f2:05:72:b3:bc:57",
            "net13": "da:d4:f6:55:3e:ac",
            "net14": "f6:c0:b7:2f:99:57",
            "net15": "c2:bd:2b:41:2b:dd",
            "net16": "72:27:e1:9e:ca:5c",
            "net17": "c2:a1:b7:21:0d:98",
            "net18": "5a:b3:9e:57:11:4d",
            "net19": "82:9e:97:59:f0:37",
            "net2": "72:40:fb:6a:0e:bb",
            "net3": "aa:02:3a:ab:b8:ec",
            "net4": "12:de:5e:0f:3c:28",
            "net5": "86:9f:94:7f:12:0e",
            "net6": "9a:b7:df:fb:6c:d6",
            "net7": "e2:53:47:a2:7b:59",
            "net8": "0e:57:24:32:5b:4d",
            "net9": "4a:94:c2:bb:24:eb"
        },
        "tof_1_2_10": {
            "net0": "ce:db:6d:59:64:8c",
            "net1": "7e:df:9a:57:33:db",
            "net10": "a2:78:9d:9d:c7:0d",
            "net11": "1a:75:64:85:17:00",
            "net12": "6a:63:73:73:4d:38",
            "net13": "da:6f:c9:0e:eb:d6",
            "net14": "b6:06:2e:b8:68:3b",
            "net15": "a6:3b:dd:79:e4:67",
            "net16": "72:3e:d3:99:d0:ed",
            "net17": "5e:2a:7c:ba:b1:4b",
            "net18": "aa:04:3d:f4:81:b9",
            "net19": "92:f7:67:1d:ae:2a",
            "net2": "3a:95:28:33:21:40",
            "net3": "02:a2:f9:f9:2e:4a",
            "net4": "02:6d:49:76:85:2a",
            "net5": "7e:c5:bb:5b:88:de",
            "net6": "0e:54:c2:70:87:d5",
            "net7": "e6:c7:8e:26:df:cb",
            "net8": "d2:26:8c:51:9e:00",
            "net9": "2a:02:b3:4a:7f:35"
        },
        "tof_1_2_2": {
            "net0": "3a:5e:56:83:aa:9f",
            "net1": "1e:1a:b8:62:26:f6",
            "net10": "36:b5:3a:37:6c:df",
            "net11": "2e:85:43:0f:94:b9",
            "net12": "82:fd:0b:a1:3b:f4",
            "net13": "16:82:50:8a:6c:c3",
            "net14": "e6:ae:e3:8b:88:d5",
            "net15": "e2:ee:f6:72:00:d2",
            "net16": "aa:4f:6b:c2:8e:6f",
            "net17": "56:58:25:11:2f:bc",
            "net18": "2e:a8:b8:19:38:11",
            "net19": "16:31:65:50:2e:35",
            "net2": "d2:c2:ad:93:e4:82",
            "net3": "b2:4e:8b:69:f7:aa",
            "net4": "ca:eb:36:ee:a8:e2",
            "net5": "8a:4d:7a:09:38:59",
            "net6": "fa:1f:b0:46:75:6f",
            "net7": "fe:3a:83:01:69:e9",
            "net8": "92:ef:f1:bc:38:48",
            "net9": "52:09:9a:c4:e8:61"
        },
        "tof_1_2_3": {
            "net0": "22:1d:18:db:ea:e0",
            "net1": "ba:97:85:68:99:fe",
            "net10": "d6:f6:dd:2e:a8:59",
            "net11": "ea:02:3e:c3:f8:82",
            "net12": "12:52:73:d5:1f:84",
            "net13": "2e:43:db:60:03:fa",
            "net14": "d6:7d:d8:0c:04:18",
            "net15": "aa:32:33:bd:56:ae",
            "net16": "6e:c5:ec:88:fb:c9",
            "net17": "ae:de:ce:15:a3:74",
            "net18": "3e:a0:1a:79:ba:c7",
            "net19": "22:70:87:3e:1e:53",
            "net2": "da:c2:33:f4:76:b7",
            "net3": "c2:2c:5c:c0:39:0d",
            "net4": "6a:a9:6a:84:38:fd",
            "net5": "2a:5d:8c:ce:75:2d",
            "net6": "5e:79:dc:bf:e8:9e",
            "net7": "0e:eb:54:d2:53:e7",
            "net8": "ee:4c:be:c8:46:8e",
            "net9": "72:02:3c:ad:cd:bd"
        },
        "tof_1_2_4": {
            "net0": "66:27:74:0e:02:5b",
            "net1": "ca:f6:ff:4b:c8:b3",
            "net10": "be:d4:43:33:a1:07",
            "net11": "a2:6b:fe:d7:6e:12",
            "net12": "4e:8a:53:67:bd:2a",
            "net13": "42:34:db:00:76:78",
            "net14": "5e:b4:38:7f:1a:84",
            "net15": "3a:3b:0b:d2:d6:54",
            "net16": "b6:84:36:c8:24:28",
            "net17": "c2:db:8b:07:05:7f",
            "net18": "d2:0a:e9:79:5e:48",
            "net19": "62:19:b8:fb:60:33",
            "net2": "de:77:36:24:99:11",
            "net3": "8a:46:89:ba:ca:00",
            "net4": "0a:fc:5c:30:9e:f8",
            "net5": "66:87:83:0d:fc:01",
            "net6": "f6:47:a5:b4:65:8e",
            "net7": "46:c8:39:32:61:1a",
            "net8": "3a:5d:fe:c3:13:10",
            "net9": "ca:58:0b:a4:0d:1f"
        },
        "tof_1_2_5": {
            "net0": "8a:31:f1:3d:4a:c0",
            "net1": "9e:cf:2d:13:02:81",
            "net10": "22:ba:ef:40:fd:95",
            "net11": "c6:33:18:03:13:d7",
            "net12": "22:da:12:5d:ad:83",
            "net13": "92:fe:a0:40:4d:d7",
            "net14": "12:58:07:1f:d7:07",
            "net15": "f6:8a:11:39:57:b2",
            "net16": "b6:b1:8f:ff:1c:ab",
            "net17": "1a:82:a6:af:e1:a5",
            "net18": "2a:1f:59:e6:b6:fc",
            "net19": "3a:a3:63:b2:8d:73",
            "net2": "56:44:9b:5d:f5:0d",
            "net3": "62:e0:72:05:37:42",
            "net4": "42:cf:ce:37:70:41",
            "net5": "9a:37:e1:19:4d:1a",
            "net6": "2e:f5:15:76:e6:6d",
            "net7": "52:f1:a0:8a:e8:b4",
            "net8": "6a:cf:49:22:ab:e0",
            "net9": "52:9f:05:b3:1d:8f"
        },
        "tof_1_2_6": {
            "net0": "c2:86:4b:63:38:d3",
            "net1": "ca:db:fa:9d:b4:e7",
            "net10": "e6:bf:2e:18:7c:fd",
            "net11": "22:9a:1c:50:68:63",
            "net12": "0e:b2:b3:b7:dd:4e",
            "net13": "02:36:43:dc:4b:3e",
            "net14": "de:47:c4:54:41:2b",
            "net15": "a2:86:20:c7:53:e0",
            "net16": "2e:10:a4:6c:b6:ad",
            "net17": "5a:db:4e:84:24:7f",
            "net18": "0e:cf:c0:8f:a0:cb",
            "net19": "6a:8c:72:b8:f7:0e",
            "net2": "72:cb:96:cc:53:08",
            "net3": "a6:d5:ae:53:fd:b7",
            "net4": "02:30:ce:88:d5:cc",
            "net5": "f6:e5:3e:a0:0b:0d",
            "net6": "fe:58:1a:b6:8c:c1",
            "net7": "ea:56:78:8c:20:0a",
            "net8": "b2:8a:52:c2:66:ac",
            "net9": "0e:85:f3:33:7d:04"
        },
        "tof_1_2_7": {
            "net0": "62:b6:f2:a4:f0:7c",
            "net1": "3a:63:a0:a5:64:ff",
            "net10": "4e:4f:99:76:ad:46",
            "net11": "c6:ad:3b:fa:db:83",
            "net12": "be:a1:9b:a4:85:c4",
            "net13": "66:04:f0:84:20:e8",
            "net14": "e6:3e:44:9d:3a:90",
            "net15": "e6:d8:a7:08:af:ec",
            "net16": "c6:3d:c7:02:c0:04",
            "net17": "d6:f6:a6:05:43:91",
            "net18": "1e:ac:44:0a:50:d0",
            "net19": "f6:3f:80:da:d3:42",
            "net2": "f2:42:a1:41:59:ad",
            "net3": "1e:69:0b:eb:bd:68",
            "net4": "c2:4a:17:c5:22:a7",
            "net5": "12:a4:d0:67:23:2e",
            "net6": "16:5d:8b:e0:b9:08",
            "net7": "d2:68:2b:10:05:7b",
            "net8": "c2:50:d8:e0:03:6a",
            "net9": "62:0c:2c:bf:b2:b3"
        },
        "tof_1_2_8": {
            "net0": "52:fa:bc:0f:c7:7d",
            "net1": "2e:2f:24:a9:a2:c2",
            "net10": "b6:01:f9:e5:a5:41",
            "net11": "62:08:0a:24:7d:37",
            "net12": "12:0f:f2:72:55:09",
            "net13": "9a:6b:8e:dc:c7:34",
            "net14": "8e:8a:c8:a5:7d:f4",
            "net15": "5e:aa:40:ca:43:1d",
            "net16": "5e:45:b7:7f:61:7f",
            "net17": "de:f8:48:fa:2d:73",
            "net18": "e2:fe:1a:7c:06:e1",
            "net19": "6e:e5:56:d3:8f:79",
            "net2": "46:0c:19:13:26:9d",
            "net3": "76:df:72:d4:a9:71",
            "net4": "d2:51:f5:50:4f:4f",
            "net5": "16:69:ee:4a:18:8f",
            "net6": "e6:56:3a:0f:b8:e7",
            "net7": "5a:61:de:f8:bf:99",
            "net8": "ae:04:03:e8:08:17",
            "net9": "7e:0b:66:97:39:04"
        },
        "tof_1_2_9": {
            "net0": "8a:f7:c3:7f:3a:27",
            "net1": "3e:40:a3:bc:89:e3",
            "net10": "ba:ef:5e:07:25:01",
            "net11": "2a:58:85:0e:d9:3f",
            "net12": "46:60:00:28:70:2a",
            "net13": "ae:0d:2f:44:2a:a4",
            "net14": "22:63:20:51:06:73",
            "net15": "5a:7e:37:8a:02:6b",
            "net16": "16:67:8a:2e:b4:e8",
            "net17": "0a:b7:fa:b6:09:88",
            "net18": "56:45:96:60:13:42",
            "net19": "82:31:31:84:99:ff",
            "net2": "6e:6b:cb:c9:7e:b5",
            "net3": "4e:3a:e7:56:ca:10",
            "net4": "2a:da:b5:47:67:71",
            "net5": "6a:88:c0:d3:a2:90",
            "net6": "56:fa:a6:e0:8c:f4",
            "net7": "aa:f2:22:08:8e:f1",
            "net8": "ba:f5:3b:27:54:2c",
            "net9": "26:d8:b8:ab:e4:32"
        },
        "tof_2_2_1": {
            "net0": "4a:0f:fb:ef:45:c2",
            "net1": "46:6a:f0:0d:ec:63",
            "net10": "aa:dc:ec:fc:9b:08",
            "net11": "2a:68:6f:3d:29:24",
            "net12": "f6:29:58:94:dc:b2",
            "net13": "1e:ad:17:ed:4c:d0",
            "net14": "ce:11:61:00:40:78",
            "net15": "6e:9b:dc:a7:9e:db",
            "net16": "6e:8e:95:ab:28:f5",
            "net17": "a2:b7:8e:0b:98:f9",
            "net18": "1e:b3:3a:b0:39:01",
            "net19": "0e:1d:d6:5c:9a:49",
            "net2": "be:c5:7d:f7:62:c6",
            "net3": "9a:4a:f7:28:11:94",
            "net4": "62:3f:4b:ea:a7:65",
            "net5": "42:51:93:ed:a0:f8",
            "net6": "2a:be:a5:9a:b4:9b",
            "net7": "9e:e8:23:77:ad:8b",
            "net8": "d2:a9:cd:1e:2c:fd",
            "net9": "e6:3c:8a:ca:31:90"
        },
        "tof_2_2_10": {
            "net0": "26:7a:b6:28:8f:94",
            "net1": "fe:53:d9:61:80:ce",
            "net10": "de:32:bc:2e:a5:a9",
            "net11": "6e:bb:fd:1a:56:30",
            "net12": "72:5b:2b:fc:aa:f1",
            "net13": "9a:db:86:3b:b1:8f",
            "net14": "8a:ac:5f:be:17:04",
            "net15": "ca:da:18:77:fd:d8",
            "net16": "26:18:7e:05:2e:be",
            "net17": "32:07:04:b3:37:2a",
            "net18": "de:2d:fc:f5:c3:17",
            "net19": "8a:e0:d6:73:74:b2",
            "net2": "ae:42:3d:31:e5:25",
            "net3": "b2:b9:32:e8:4d:51",
            "net4": "32:e7:25:cd:db:2d",
            "net5": "fa:8f:89:1a:31:10",
            "net6": "de:cc:cc:8d:89:cf",
            "net7": "9a:04:11:89:2b:27",
            "net8": "12:3b:0d:bc:55:67",
            "net9": "42:29:8e:0b:aa:b1"
        },
        "tof_2_2_2": {
            "net0": "3e:10:8f:56:3f:ce",
            "net1": "d6:62:53:77:14:26",
            "net10": "66:b8:c6:aa:39:39",
            "net11": "82:40:59:07:5d:bc",
            "net12": "ee:29:b1:2b:f7:88",
            "net13": "0a:b5:36:14:7c:a5",
            "net14": "ea:d9:1d:41:5e:fd",
            "net15": "86:c0:01:59:93:7a",
            "net16": "ce:6e:09:83:6a:47",
            "net17": "ca:c3:34:db:0d:65",
            "net18": "82:53:47:d7:cd:c6",
            "net19": "0e:1f:b3:c0:56:8e",
            "net2": "aa:73:6f:a6:31:78",
            "net3": "62:95:80:ca:ab:9d",
            "net4": "66:68:9e:5a:03:43",
            "net5": "0e:06:37:77:7e:9a",
            "net6": "fe:87:b3:37:e0:21",
            "net7": "7a:8f:36:b9:d0:33",
            "net8": "b6:f7:46:e8:cc:61",
            "net9": "36:23:70:5c:41:a5"
        },
        "tof_2_2_3": {
            "net0": "6e:dd:22:a2:b6:a1",
            "net1": "06:fe:65:2f:3b:1e",
            "net10": "76:fd:1a:ba:06:c2",
            "net11": "5a:46:87:8a:ec:af",
            "net12": "c6:d5:b9:d1:cc:32",
            "net13": "ee:19:b5:4c:f7:86",
            "net14": "ba:3f:57:cd:29:f6",
            "net15": "aa:01:09:7c:e4:f3",
            "net16": "f2:0f:74:82:e6:6c",
            "net17": "62:03:5f:e5:64:a7",
            "net18": "5e:ee:0a:1e:bb:67",
            "net19": "76:13:cd:6c:f7:55",
            "net2": "d6:63:ed:90:6d:c5",
            "net3": "aa:bf:01:0e:65:a2",
            "net4": "de:9d:34:52:71:9b",
            "net5": "4a:c5:b6:cb:5f:29",
            "net6": "c2:06:02:c1:f2:a2",
            "net7": "fe:23:eb:e1:5f:87",
            "net8": "f2:64:88:ee:6c:8e",
            "net9": "52:50:77:74:c1:27"
        },
        "tof_2_2_4": {
            "net0": "2a:17:67:69:4b:a1",
            "net1": "9a:84:7e:3d:da:62",
            "net10": "0a:f4:77:a5:57:46",
            "net11": "0a:33:90:d8:62:cf",
            "net12": "7a:5e:9d:02:54:ff",
            "net13": "2e:b0:74:8f:8f:a4",
            "net14": "ea:7f:fe:07:9f:13",
            "net15": "ce:69:f0:54:44:22",
            "net16": "a2:6d:b5:48:76:58",
            "net17": "c2:e8:e5:37:c1:32",
            "net18": "6e:05:19:e0:06:76",
            "net19": "4a:0a:56:58:18:c5",
            "net2": "da:41:d7:61:b8:df",
            "net3": "82:a8:d4:7e:bd:66",
            "net4": "8e:7f:23:2c:36:af",
            "net5": "72:76:4c:0d:8e:2b",
            "net6": "7e:e0:72:9e:5f:c0",
            "net7": "62:ab:a1:d1:f6:3b",
            "net8": "aa:d0:8b:c9:c0:af",
            "net9": "9a:17:df:ea:e3:f1"
        },
        "tof_2_2_5": {
            "net0": "f6:ad:7b:2b:6e:51",
            "net1": "06:dd:32:2a:c6:00",
            "net10": "da:8f:c6:b6:7b:a4",
            "net11": "a2:e2:b2:ab:d1:d0",
            "net12": "8a:9e:3a:9a:03:56",
            "net13": "a6:b6:71:a0:0d:05",
            "net14": "b2:3e:fc:d1:78:3a",
            "net15": "d6:43:8f:6f:a2:e7",
            "net16": "66:57:e6:4d:ae:86",
            "net17": "c6:d7:bc:63:cd:29",
            "net18": "06:bf:fe:a7:30:d7",
            "net19": "ba:15:ac:30:ef:42",
            "net2": "2e:3f:ec:ea:5c:77",
            "net3": "b6:73:af:4e:bc:89",
            "net4": "26:bf:1c:d5:11:6e",
            "net5": "de:53:bf:cd:5b:1b",
            "net6": "3e:e0:20:99:10:80",
            "net7": "86:f8:13:c6:14:2c",
            "net8": "0e:77:88:13:9f:83",
            "net9": "02:a2:c6:47:d3:ca"
        },
        "tof_2_2_6": {
            "net0": "3e:02:8b:4e:ae:8d",
            "net1": "3a:dc:09:96:a9:21",
            "net10": "7e:43:c4:5c:54:c2",
            "net11": "4a:1e:54:30:80:01",
            "net12": "f2:c2:f8:5b:b6:79",
            "net13": "66:44:eb:85:bc:d0",
            "net14": "12:35:c4:f3:6c:5b",
            "net15": "22:53:9c:34:ab:34",
            "net16": "0a:20:0c:e6:b0:ee",
            "net17": "1e:07:7f:75:98:c1",
            "net18": "ce:7c:a5:cf:7a:34",
            "net19": "16:1f:02:4f:c1:18",
            "net2": "3e:ef:02:47:ad:1a",
            "net3": "a6:ce:aa:0f:94:8a",
            "net4": "0a:7f:5d:9b:b8:5e",
            "net5": "c6:58:36:75:4d:bb",
            "net6": "36:af:d4:55:8a:b9",
            "net7": "a6:c2:0f:df:be:23",
            "net8": "92:a5:e5:3c:50:0a",
            "net9": "06:fa:06:65:33:cf"
        },
        "tof_2_2_7": {
            "net0": "32:48:32:ed:96:91",
            "net1": "96:28:2a:df:d6:09",
            "net10": "96:70:dd:6d:55:54",
            "net11": "be:3b:de:40:02:fc",
            "net12": "7a:c0:97:d6:e4:ae",
            "net13": "12:38:25:58:09:a2",
            "net14": "f6:be:9b:29:aa:c3",
            "net15": "96:96:9a:bb:52:2c",
            "net16": "b6:78:6e:bf:3c:35",
            "net17": "8e:39:a0:78:2e:6c",
            "net18": "2a:2b:3a:eb:ce:d3",
            "net19": "ce:0d:d2:a9:72:b5",
            "net2": "c2:54:f8:91:63:5d",
            "net3": "06:7a:3c:16:61:fc",
            "net4": "1a:c3:19:ba:39:fb",
            "net5": "86:3d:2b:37:b2:a8",
            "net6": "8e:f5:4a:56:b0:d4",
            "net7": "aa:78:0a:a3:60:e7",
            "net8": "96:ff:cb:e4:4c:47",
            "net9": "ee:78:cd:cf:06:f4"
        },
        "tof_2_2_8": {
            "net0": "e6:56:0a:07:18:48",
            "net1": "e6:94:4e:35:91:fb",
            "net10": "82:e5:10:c9:21:90",
            "net11": "de:ca:e6:51:f9:4d",
            "net12": "ba:b2:df:5b:16:d0",
            "net13": "26:76:fb:24:7e:18",
            "net14": "42:3c:0b:4e:6a:ae",
            "net15": "9e:9b:d4:4f:48:51",
            "net16": "1e:96:09:d9:f9:dd",
            "net17": "1a:01:45:04:af:9c",
            "net18": "86:b9:93:ba:b3:02",
            "net19": "36:de:b6:61:b7:a7",
            "net2": "ce:4e:7d:57:a6:3f",
            "net3": "d6:1a:79:7e:98:fc",
            "net4": "fa:4f:53:61:1a:50",
            "net5": "c2:d2:74:7f:29:09",
            "net6": "4a:24:c2:ba:6f:3a",
            "net7": "12:02:db:d6:ea:64",
            "net8": "4e:45:7a:50:f1:de",
            "net9": "86:d8:65:b4:cd:32"
        },
        "tof_2_2_9": {
            "net0": "56:74:f9:c7:bb:e2",
            "net1": "92:1a:39:33:9e:a1",
            "net10": "2a:dd:49:ff:20:1b",
            "net11": "46:98:c9:66:b6:90",
            "net12": "06:cb:b7:17:e7:9b",
            "net13": "1a:30:c0:64:8f:35",
            "net14": "1a:4e:bd:be:ad:29",
            "net15": "12:ed:6a:6a:1c:fd",
            "net16": "3e:1e:6d:b5:8e:ef",
            "net17": "e2:f3:c5:96:a7:68",
            "net18": "ea:3c:ea:b4:2a:61",
            "net19": "7e:ee:f3:65:b5:66",
            "net2": "f6:9e:cb:e3:c9:2d",
            "net3": "be:f5:f8:df:8c:6d",
            "net4": "06:1a:a5:f2:61:ec",
            "net5": "4e:4f:54:a7:a2:22",
            "net6": "26:52:26:50:a9:04",
            "net7": "76:7a:d9:dc:98:6b",
            "net8": "a6:eb:67:1c:ec:a4",
            "net9": "4e:f1:3e:71:93:c4"
        }
    },
    "failed_machine": "leaf_1_0_1",
    "failed_interfaces": [
        "net0"
    ],
    "failure_time": 1616379017.71298,
    "recover_time": 1616379078.5540156
}