{
    "description": "Scenario 3a: Leaf leaf_1_0_1 failure with BGP",
    "k_leaf": 6,
    "k_top": 6,
    "redundancy_factor": 6,
    "is_k8s": true,
    "machine_mac_addresses": {
        "leaf_1_0_1": {
            "net0": "a2:95:c3:b4:b2:f3",
            "net1": "de:dd:04:26:a3:5b",
            "net2": "16:93:a7:d2:cb:49",
            "net3": "36:40:78:02:17:79",
            "net4": "5a:12:77:b3:43:31",
            "net5": "02:07:ae:3c:8c:d6",
            "net6": "12:00:e8:5a:08:e5"
        },
        "leaf_1_0_2": {
            "net0": "d6:42:c3:88:24:66",
            "net1": "d2:1d:5a:60:a2:e2",
            "net2": "12:bd:70:40:12:99",
            "net3": "ca:c0:7a:3b:c0:72",
            "net4": "72:e0:1b:1f:d8:ab",
            "net5": "16:b4:fc:84:29:84",
            "net6": "c2:c7:1d:cb:9c:42"
        },
        "leaf_1_0_3": {
            "net0": "c2:c4:32:7a:3f:a2",
            "net1": "ce:33:32:bd:65:9d",
            "net2": "aa:44:2a:20:32:21",
            "net3": "9e:92:a1:6b:c5:cc",
            "net4": "56:a5:8b:c4:80:3f",
            "net5": "46:64:a1:2a:c8:52",
            "net6": "4e:3f:cc:8e:c8:14"
        },
        "leaf_1_0_4": {
            "net0": "8a:5a:e7:ad:9a:8a",
            "net1": "02:e6:5c:90:e5:64",
            "net2": "22:15:f2:38:26:ef",
            "net3": "6e:cf:ec:08:93:c7",
            "net4": "ce:3e:97:50:1f:e4",
            "net5": "ce:57:5c:b5:58:18",
            "net6": "0e:b9:c4:18:50:ed"
        },
        "leaf_1_0_5": {
            "net0": "9e:a7:63:58:f0:d4",
            "net1": "96:58:f0:dd:de:d1",
            "net2": "76:73:eb:03:1d:d0",
            "net3": "ba:7d:24:8a:00:03",
            "net4": "42:1b:23:7b:86:a8",
            "net5": "42:58:3b:3f:8b:3e",
            "net6": "9e:38:b4:3c:90:ec"
        },
        "leaf_1_0_6": {
            "net0": "a6:5e:be:ec:47:de",
            "net1": "26:1a:4d:d3:85:11",
            "net2": "86:02:da:45:e0:3e",
            "net3": "f6:24:f9:d6:c1:0d",
            "net4": "6a:1f:c4:88:2c:50",
            "net5": "ee:1d:f6:f8:c2:e3",
            "net6": "4a:65:ca:06:2b:22"
        },
        "leaf_2_0_1": {
            "net0": "36:22:c4:e8:7f:9c",
            "net1": "5e:0c:3e:10:0f:56",
            "net2": "fa:fd:b8:23:02:d3",
            "net3": "fe:d4:75:aa:04:0d",
            "net4": "92:90:59:85:3f:e2",
            "net5": "32:6f:ab:ce:da:0e",
            "net6": "6e:05:8a:ab:06:bc"
        },
        "leaf_2_0_2": {
            "net0": "26:81:4c:cf:8a:18",
            "net1": "6e:6d:63:fe:c4:aa",
            "net2": "b2:8e:bb:22:bf:19",
            "net3": "be:44:c3:29:24:c8",
            "net4": "12:03:df:18:80:e2",
            "net5": "c2:64:e0:2c:13:bf",
            "net6": "7a:51:6c:b5:eb:9c"
        },
        "leaf_2_0_3": {
            "net0": "ea:00:d9:6b:1e:b2",
            "net1": "fe:7d:bb:53:5c:c7",
            "net2": "fe:c7:ac:ce:7f:88",
            "net3": "b6:c9:f4:89:44:bf",
            "net4": "62:8f:99:49:3c:d1",
            "net5": "ce:f3:c9:98:b0:04",
            "net6": "1a:d9:b5:d1:bb:07"
        },
        "leaf_2_0_4": {
            "net0": "82:c4:35:e3:a8:70",
            "net1": "da:ad:35:4a:6b:33",
            "net2": "ee:19:73:64:6e:b8",
            "net3": "0a:b0:ce:56:80:28",
            "net4": "76:e4:6c:07:98:c0",
            "net5": "ca:29:36:7f:ff:ac",
            "net6": "96:b8:c0:6c:a5:d1"
        },
        "leaf_2_0_5": {
            "net0": "72:01:92:e3:c9:b9",
            "net1": "4a:42:2a:15:03:ad",
            "net2": "36:4b:a1:94:ea:58",
            "net3": "52:4e:12:05:31:24",
            "net4": "72:dc:2f:6e:9a:2d",
            "net5": "3a:8e:2c:b7:48:58",
            "net6": "aa:6e:ec:41:85:f3"
        },
        "leaf_2_0_6": {
            "net0": "d6:d1:05:a6:4c:af",
            "net1": "f2:0c:f2:98:bd:ec",
            "net2": "52:53:0a:e8:d9:fc",
            "net3": "0a:59:48:d9:22:da",
            "net4": "2e:de:a8:9f:ac:dc",
            "net5": "ee:6a:92:b7:29:ca",
            "net6": "4a:97:b1:68:63:15"
        },
        "spine_1_1_1": {
            "net0": "8e:29:e5:d4:1b:29",
            "net1": "9a:a4:99:8c:29:2e",
            "net10": "92:3a:03:b4:0d:ab",
            "net11": "c2:4e:a1:f2:30:ff",
            "net2": "ce:48:2b:c6:b4:65",
            "net3": "5e:76:47:77:03:a0",
            "net4": "c2:94:c6:5b:69:a8",
            "net5": "76:e8:dc:ad:30:d7",
            "net6": "0a:26:f3:09:01:3a",
            "net7": "66:9e:a6:57:11:6c",
            "net8": "7a:11:0d:db:39:d8",
            "net9": "de:2b:44:98:43:bc"
        },
        "spine_1_1_2": {
            "net0": "e6:4c:51:10:55:b8",
            "net1": "ee:c1:02:d6:d2:50",
            "net10": "36:d1:e8:02:98:a1",
            "net11": "c2:19:12:53:74:ad",
            "net2": "e6:3e:84:a4:88:50",
            "net3": "86:9c:18:0e:ef:c5",
            "net4": "3a:0b:ba:57:60:e6",
            "net5": "be:38:8b:d9:1b:7a",
            "net6": "32:3c:15:05:d0:58",
            "net7": "6a:7e:71:6d:9f:0a",
            "net8": "0e:f1:32:07:31:e8",
            "net9": "ee:44:a1:2a:fa:98"
        },
        "spine_1_1_3": {
            "net0": "32:97:e1:f9:76:6e",
            "net1": "9e:18:9d:f6:0c:fc",
            "net10": "52:5c:b3:02:36:10",
            "net11": "7e:03:87:3e:09:cf",
            "net2": "12:78:d8:24:05:e5",
            "net3": "06:99:65:97:35:59",
            "net4": "66:6f:c0:db:23:a4",
            "net5": "2a:eb:29:d4:6f:07",
            "net6": "1a:1e:c1:d7:63:20",
            "net7": "56:45:51:92:97:3c",
            "net8": "56:d4:30:f1:43:5d",
            "net9": "1a:8a:5e:64:3b:73"
        },
        "spine_1_1_4": {
            "net0": "96:5e:22:b2:05:1e",
            "net1": "26:22:67:f7:79:7a",
            "net10": "a2:57:62:f2:61:67",
            "net11": "da:b5:b1:df:41:a0",
            "net2": "ae:da:ef:57:1a:4e",
            "net3": "72:a7:1d:9c:bf:7b",
            "net4": "e6:6a:b4:e6:d8:a8",
            "net5": "ca:a9:47:8f:87:2b",
            "net6": "6a:b4:14:9f:cd:be",
            "net7": "52:69:bd:25:77:15",
            "net8": "92:dc:25:6d:13:47",
            "net9": "a6:73:97:e7:e2:cd"
        },
        "spine_1_1_5": {
            "net0": "fa:10:58:25:f7:7d",
            "net1": "7e:8f:68:7e:91:f7",
            "net10": "ca:d7:f4:ae:75:44",
            "net11": "fe:c1:55:65:6e:e8",
            "net2": "56:fa:ed:7b:41:93",
            "net3": "26:38:41:d7:5e:37",
            "net4": "ea:93:2e:4f:fd:2c",
            "net5": "46:51:b3:24:3e:79",
            "net6": "3a:24:d6:26:91:9a",
            "net7": "4a:a1:f1:a3:62:24",
            "net8": "42:f8:d0:88:ff:4b",
            "net9": "0e:fd:75:4f:d7:38"
        },
        "spine_1_1_6": {
            "net0": "5e:eb:5a:bd:88:83",
            "net1": "5e:51:ef:8d:20:93",
            "net10": "ba:6c:c7:70:94:a7",
            "net11": "f6:8f:81:19:cf:ef",
            "net2": "1e:c5:e4:8c:13:8c",
            "net3": "56:30:3b:68:f8:64",
            "net4": "0e:09:88:79:85:d9",
            "net5": "e2:31:6a:88:17:e2",
            "net6": "12:36:c4:3f:3c:8c",
            "net7": "a6:ba:b0:66:33:87",
            "net8": "b6:65:a2:50:ce:46",
            "net9": "22:36:bd:45:2d:34"
        },
        "spine_2_1_1": {
            "net0": "6a:a6:60:8a:cb:00",
            "net1": "12:bc:26:3b:d6:bc",
            "net10": "aa:d1:5c:dc:ff:81",
            "net11": "5a:b7:d2:1a:78:c1",
            "net2": "7e:ac:af:5a:1b:ec",
            "net3": "06:e3:6f:33:2c:2e",
            "net4": "de:7a:32:d8:e8:11",
            "net5": "82:1b:94:85:bc:a3",
            "net6": "56:59:3c:f0:5c:87",
            "net7": "86:bb:d2:67:20:73",
            "net8": "ae:03:61:9e:72:c9",
            "net9": "36:3f:58:ac:88:0e"
        },
        "spine_2_1_2": {
            "net0": "8a:38:a5:94:08:ea",
            "net1": "fa:aa:6c:4a:0f:d9",
            "net10": "c2:6d:02:0e:c2:28",
            "net11": "3e:f0:59:55:e6:0f",
            "net2": "7e:2a:64:e9:83:06",
            "net3": "5a:80:bc:c1:00:ff",
            "net4": "9e:89:ce:4f:93:95",
            "net5": "86:c3:e4:4d:e8:4e",
            "net6": "26:40:98:0d:a4:92",
            "net7": "ba:3c:3a:5e:97:b6",
            "net8": "0e:d8:4d:5e:00:cb",
            "net9": "ea:22:3c:b1:09:40"
        },
        "spine_2_1_3": {
            "net0": "62:e1:45:de:40:57",
            "net1": "ce:67:4e:cb:a0:85",
            "net10": "d6:ff:25:ad:f9:75",
            "net11": "92:84:5a:6f:c6:89",
            "net2": "a2:35:8a:8f:0a:f9",
            "net3": "4a:15:1c:f6:f2:e1",
            "net4": "5a:c9:5a:f0:48:51",
            "net5": "96:2e:f5:e7:c6:f1",
            "net6": "92:0e:c1:cf:0d:ab",
            "net7": "0e:85:f7:7b:f1:ce",
            "net8": "8a:56:17:39:d9:cf",
            "net9": "7a:aa:c2:c6:fc:87"
        },
        "spine_2_1_4": {
            "net0": "c2:34:cb:9f:e0:85",
            "net1": "36:6c:a7:6d:50:d7",
            "net10": "ba:9e:2d:26:a6:4c",
            "net11": "ba:bd:bc:19:78:10",
            "net2": "22:3e:13:93:27:13",
            "net3": "fe:0a:75:17:58:ba",
            "net4": "b6:04:d4:41:80:a2",
            "net5": "9a:a9:e8:d4:2f:4a",
            "net6": "2a:40:32:f5:6d:b7",
            "net7": "aa:e4:b0:05:3a:6f",
            "net8": "ce:8c:ff:b1:01:87",
            "net9": "12:c3:3c:3f:b6:7e"
        },
        "spine_2_1_5": {
            "net0": "da:c9:5f:a9:10:50",
            "net1": "52:76:7f:a0:ad:f0",
            "net10": "46:95:94:3f:36:f9",
            "net11": "8a:84:26:88:73:c7",
            "net2": "ae:ae:4a:ff:31:ff",
            "net3": "32:7f:87:e5:18:f8",
            "net4": "46:b9:24:00:14:fb",
            "net5": "8e:2c:1e:41:41:0a",
            "net6": "8e:df:2c:b5:e0:bc",
            "net7": "1e:71:06:15:5c:c9",
            "net8": "6a:b2:3a:1a:a7:a1",
            "net9": "26:0a:15:54:0e:48"
        },
        "spine_2_1_6": {
            "net0": "ee:ce:49:d1:f4:a4",
            "net1": "b6:17:bb:85:d5:50",
            "net10": "32:4e:eb:94:1e:a2",
            "net11": "c2:3a:2c:b6:f8:3e",
            "net2": "56:e2:21:cb:8b:7a",
            "net3": "86:28:32:51:07:82",
            "net4": "02:6d:6c:13:59:63",
            "net5": "d2:e6:02:af:4d:65",
            "net6": "12:4b:01:9e:7d:7e",
            "net7": "c6:57:4c:2b:fe:20",
            "net8": "ea:6f:2b:06:42:a8",
            "net9": "ba:46:15:56:3a:4b"
        },
        "tof_1_2_1": {
            "net0": "ca:2f:63:bc:c1:53",
            "net1": "12:64:54:6f:d4:61",
            "net10": "7a:d8:52:94:7f:c3",
            "net11": "6a:99:8b:c8:83:a7",
            "net2": "aa:bb:7f:ef:13:80",
            "net3": "36:a8:fb:11:50:39",
            "net4": "52:0f:a3:f1:38:f4",
            "net5": "b2:b9:bb:5d:a0:da",
            "net6": "f2:65:20:69:aa:91",
            "net7": "aa:40:c7:73:38:6b",
            "net8": "f2:6f:9a:09:d3:45",
            "net9": "5a:e7:08:db:bb:47"
        },
        "tof_1_2_2": {
            "net0": "5e:52:8e:bb:ca:ba",
            "net1": "ae:40:95:e1:fd:d7",
            "net10": "ae:e8:0c:75:66:a5",
            "net11": "7e:79:df:f3:de:93",
            "net2": "12:f1:8d:3e:82:b5",
            "net3": "02:8c:42:43:9a:9d",
            "net4": "8e:d5:36:fd:e2:60",
            "net5": "0e:ca:76:cd:52:da",
            "net6": "ee:74:db:2c:a0:56",
            "net7": "82:7a:84:73:fd:a5",
            "net8": "ce:fa:c1:41:3b:f5",
            "net9": "92:c1:18:ae:c6:21"
        },
        "tof_1_2_3": {
            "net0": "8a:b6:e1:f4:d6:82",
            "net1": "ce:c4:db:a8:ee:df",
            "net10": "82:23:02:75:3a:2c",
            "net11": "b6:87:77:f0:f6:2c",
            "net2": "ea:15:ff:8b:9c:b1",
            "net3": "1e:6f:f0:95:fa:58",
            "net4": "8e:6a:3c:75:bd:91",
            "net5": "ca:f3:7a:79:77:78",
            "net6": "76:ae:b8:31:e0:38",
            "net7": "ee:0c:43:80:10:01",
            "net8": "26:f5:df:d2:c3:e7",
            "net9": "da:1f:05:3e:a4:f1"
        },
        "tof_1_2_4": {
            "net0": "be:38:e4:4b:f8:bc",
            "net1": "2e:a3:75:19:19:ae",
            "net10": "d6:dc:26:b3:40:0f",
            "net11": "e2:69:2d:fd:02:a9",
            "net2": "be:aa:b0:ca:35:13",
            "net3": "ce:0d:99:e4:95:3f",
            "net4": "9a:7c:75:c4:e9:39",
            "net5": "c6:41:5d:d7:eb:4a",
            "net6": "f2:50:9f:23:cc:b4",
            "net7": "56:4d:48:21:ac:45",
            "net8": "16:5e:3b:ce:a7:82",
            "net9": "8a:39:de:1f:f4:ab"
        },
        "tof_1_2_5": {
            "net0": "42:ab:2d:3c:a4:b8",
            "net1": "02:03:be:12:d2:bb",
            "net10": "2e:72:c7:d9:82:28",
            "net11": "ca:98:d4:86:c5:1b",
            "net2": "0e:6c:48:fc:a0:6f",
            "net3": "26:fe:b5:89:d2:bf",
            "net4": "0e:26:49:66:c8:b9",
            "net5": "0a:26:da:74:52:43",
            "net6": "56:09:d2:2a:37:df",
            "net7": "de:b5:0c:30:45:6a",
            "net8": "d2:36:0a:f9:f2:a3",
            "net9": "82:84:5a:21:c8:97"
        },
        "tof_1_2_6": {
            "net0": "0a:b1:30:de:cd:3c",
            "net1": "ba:15:69:8e:85:82",
            "net10": "5e:82:fc:29:ba:3c",
            "net11": "06:c7:55:ed:14:93",
            "net2": "2a:7d:d9:ab:0e:e5",
            "net3": "6e:e9:7f:e4:1c:06",
            "net4": "c6:2b:2f:7b:c6:0f",
            "net5": "f2:1e:53:82:b5:4a",
            "net6": "86:2b:eb:2f:4a:3e",
            "net7": "46:c7:c2:8b:a2:1b",
            "net8": "1a:a5:bc:d5:76:c5",
            "net9": "e2:65:8b:d0:eb:4e"
        }
    },
    "failed_machine": "leaf_1_0_1",
    "failure_time": 1613150012.2196665
}