{
    "k_leaf": 2,
    "k_top": 2,
    "redundancy_factor": 1,
    "is_k8s": true,
    "failed_machine": "leaf_1_0_1",
    "failure_time": {
        "leaf_1_0_1": 1622466180.3365881,
        "leaf_1_0_2": 1622466180.3475368,
        "leaf_2_0_1": 1622466180.3551314,
        "leaf_2_0_2": 1622466180.3368578,
        "leaf_3_0_1": 1622466180.3449826,
        "leaf_3_0_2": 1622466180.3522184,
        "leaf_4_0_1": 1622466180.358215,
        "leaf_4_0_2": 1622466180.3657138,
        "spine_1_1_1": 1622466180.3740406,
        "spine_1_1_2": 1622466180.3659403,
        "spine_2_1_1": 1622466180.3739338,
        "spine_2_1_2": 1622466180.3789418,
        "spine_3_1_1": 1622466180.3811285,
        "spine_3_1_2": 1622466180.389083,
        "spine_4_1_1": 1622466180.4002352,
        "spine_4_1_2": 1622466180.3868546,
        "tof_1_2_1": 1622466180.3935704,
        "tof_1_2_2": 1622466180.4035199,
        "tof_2_2_1": 1622466180.4077158,
        "tof_2_2_2": 1622466180.4161453
    },
    "packet_count": {
        "total": [
            60,
            1620
        ],
        "leaf_3_0_2": {
            "total": [
                2,
                54
            ],
            "net0": {
                "total": [
                    1,
                    27
                ],
                "withdrawn": [
                    1,
                    27
                ]
            },
            "net1": {
                "total": [
                    1,
                    27
                ],
                "withdrawn": [
                    1,
                    27
                ]
            }
        },
        "leaf_1_0_2": {
            "total": [
                2,
                54
            ],
            "net0": {
                "total": [
                    1,
                    27
                ],
                "withdrawn": [
                    1,
                    27
                ]
            },
            "net1": {
                "total": [
                    1,
                    27
                ],
                "withdrawn": [
                    1,
                    27
                ]
            }
        },
        "leaf_2_0_2": {
            "total": [
                2,
                54
            ],
            "net0": {
                "total": [
                    1,
                    27
                ],
                "withdrawn": [
                    1,
                    27
                ]
            },
            "net1": {
                "total": [
                    1,
                    27
                ],
                "withdrawn": [
                    1,
                    27
                ]
            }
        },
        "leaf_4_0_1": {
            "total": [
                2,
                54
            ],
            "net0": {
                "total": [
                    1,
                    27
                ],
                "withdrawn": [
                    1,
                    27
                ]
            },
            "net1": {
                "total": [
                    1,
                    27
                ],
                "withdrawn": [
                    1,
                    27
                ]
            }
        },
        "leaf_2_0_1": {
            "total": [
                2,
                54
            ],
            "net0": {
                "total": [
                    1,
                    27
                ],
                "withdrawn": [
                    1,
                    27
                ]
            },
            "net1": {
                "total": [
                    1,
                    27
                ],
                "withdrawn": [
                    1,
                    27
                ]
            }
        },
        "leaf_4_0_2": {
            "total": [
                2,
                54
            ],
            "net0": {
                "total": [
                    1,
                    27
                ],
                "withdrawn": [
                    1,
                    27
                ]
            },
            "net1": {
                "total": [
                    1,
                    27
                ],
                "withdrawn": [
                    1,
                    27
                ]
            }
        },
        "leaf_3_0_1": {
            "total": [
                2,
                54
            ],
            "net0": {
                "total": [
                    1,
                    27
                ],
                "withdrawn": [
                    1,
                    27
                ]
            },
            "net1": {
                "total": [
                    1,
                    27
                ],
                "withdrawn": [
                    1,
                    27
                ]
            }
        },
        "tof_1_2_2": {
            "total": [
                4,
                108
            ],
            "net0": {
                "total": [
                    1,
                    27
                ],
                "withdrawn": [
                    1,
                    27
                ]
            },
            "net1": {
                "total": [
                    1,
                    27
                ],
                "withdrawn": [
                    1,
                    27
                ]
            },
            "net2": {
                "total": [
                    1,
                    27
                ],
                "withdrawn": [
                    1,
                    27
                ]
            },
            "net3": {
                "total": [
                    1,
                    27
                ],
                "withdrawn": [
                    1,
                    27
                ]
            }
        },
        "tof_2_2_2": {
            "total": [
                4,
                108
            ],
            "net0": {
                "total": [
                    1,
                    27
                ],
                "withdrawn": [
                    1,
                    27
                ]
            },
            "net1": {
                "total": [
                    1,
                    27
                ],
                "withdrawn": [
                    1,
                    27
                ]
            },
            "net2": {
                "total": [
                    1,
                    27
                ],
                "withdrawn": [
                    1,
                    27
                ]
            },
            "net3": {
                "total": [
                    1,
                    27
                ],
                "withdrawn": [
                    1,
                    27
                ]
            }
        },
        "spine_1_1_2": {
            "total": [
                3,
                81
            ],
            "net1": {
                "total": [
                    1,
                    27
                ],
                "withdrawn": [
                    1,
                    27
                ]
            },
            "net2": {
                "total": [
                    1,
                    27
                ],
                "withdrawn": [
                    1,
                    27
                ]
            },
            "net3": {
                "total": [
                    1,
                    27
                ],
                "withdrawn": [
                    1,
                    27
                ]
            }
        },
        "spine_4_1_2": {
            "total": [
                4,
                108
            ],
            "net0": {
                "total": [
                    1,
                    27
                ],
                "withdrawn": [
                    1,
                    27
                ]
            },
            "net1": {
                "total": [
                    1,
                    27
                ],
                "withdrawn": [
                    1,
                    27
                ]
            },
            "net2": {
                "total": [
                    1,
                    27
                ],
                "withdrawn": [
                    1,
                    27
                ]
            },
            "net3": {
                "total": [
                    1,
                    27
                ],
                "withdrawn": [
                    1,
                    27
                ]
            }
        },
        "spine_3_1_2": {
            "total": [
                4,
                108
            ],
            "net0": {
                "total": [
                    1,
                    27
                ],
                "withdrawn": [
                    1,
                    27
                ]
            },
            "net1": {
                "total": [
                    1,
                    27
                ],
                "withdrawn": [
                    1,
                    27
                ]
            },
            "net2": {
                "total": [
                    1,
                    27
                ],
                "withdrawn": [
                    1,
                    27
                ]
            },
            "net3": {
                "total": [
                    1,
                    27
                ],
                "withdrawn": [
                    1,
                    27
                ]
            }
        },
        "tof_1_2_1": {
            "total": [
                4,
                108
            ],
            "net0": {
                "total": [
                    1,
                    27
                ],
                "withdrawn": [
                    1,
                    27
                ]
            },
            "net1": {
                "total": [
                    1,
                    27
                ],
                "withdrawn": [
                    1,
                    27
                ]
            },
            "net2": {
                "total": [
                    1,
                    27
                ],
                "withdrawn": [
                    1,
                    27
                ]
            },
            "net3": {
                "total": [
                    1,
                    27
                ],
                "withdrawn": [
                    1,
                    27
                ]
            }
        },
        "tof_2_2_1": {
            "total": [
                4,
                108
            ],
            "net0": {
                "total": [
                    1,
                    27
                ],
                "withdrawn": [
                    1,
                    27
                ]
            },
            "net1": {
                "total": [
                    1,
                    27
                ],
                "withdrawn": [
                    1,
                    27
                ]
            },
            "net2": {
                "total": [
                    1,
                    27
                ],
                "withdrawn": [
                    1,
                    27
                ]
            },
            "net3": {
                "total": [
                    1,
                    27
                ],
                "withdrawn": [
                    1,
                    27
                ]
            }
        },
        "spine_2_1_2": {
            "total": [
                4,
                108
            ],
            "net0": {
                "total": [
                    1,
                    27
                ],
                "withdrawn": [
                    1,
                    27
                ]
            },
            "net1": {
                "total": [
                    1,
                    27
                ],
                "withdrawn": [
                    1,
                    27
                ]
            },
            "net2": {
                "total": [
                    1,
                    27
                ],
                "withdrawn": [
                    1,
                    27
                ]
            },
            "net3": {
                "total": [
                    1,
                    27
                ],
                "withdrawn": [
                    1,
                    27
                ]
            }
        },
        "spine_2_1_1": {
            "total": [
                4,
                108
            ],
            "net0": {
                "total": [
                    1,
                    27
                ],
                "withdrawn": [
                    1,
                    27
                ]
            },
            "net1": {
                "total": [
                    1,
                    27
                ],
                "withdrawn": [
                    1,
                    27
                ]
            },
            "net2": {
                "total": [
                    1,
                    27
                ],
                "withdrawn": [
                    1,
                    27
                ]
            },
            "net3": {
                "total": [
                    1,
                    27
                ],
                "withdrawn": [
                    1,
                    27
                ]
            }
        },
        "spine_1_1_1": {
            "total": [
                3,
                81
            ],
            "net1": {
                "total": [
                    1,
                    27
                ],
                "withdrawn": [
                    1,
                    27
                ]
            },
            "net2": {
                "total": [
                    1,
                    27
                ],
                "withdrawn": [
                    1,
                    27
                ]
            },
            "net3": {
                "total": [
                    1,
                    27
                ],
                "withdrawn": [
                    1,
                    27
                ]
            }
        },
        "spine_3_1_1": {
            "total": [
                4,
                108
            ],
            "net0": {
                "total": [
                    1,
                    27
                ],
                "withdrawn": [
                    1,
                    27
                ]
            },
            "net1": {
                "total": [
                    1,
                    27
                ],
                "withdrawn": [
                    1,
                    27
                ]
            },
            "net2": {
                "total": [
                    1,
                    27
                ],
                "withdrawn": [
                    1,
                    27
                ]
            },
            "net3": {
                "total": [
                    1,
                    27
                ],
                "withdrawn": [
                    1,
                    27
                ]
            }
        },
        "spine_4_1_1": {
            "total": [
                4,
                108
            ],
            "net0": {
                "total": [
                    1,
                    27
                ],
                "withdrawn": [
                    1,
                    27
                ]
            },
            "net1": {
                "total": [
                    1,
                    27
                ],
                "withdrawn": [
                    1,
                    27
                ]
            },
            "net2": {
                "total": [
                    1,
                    27
                ],
                "withdrawn": [
                    1,
                    27
                ]
            },
            "net3": {
                "total": [
                    1,
                    27
                ],
                "withdrawn": [
                    1,
                    27
                ]
            }
        }
    },
    "packets_by_collision_domain": {
        "AAAG": 2,
        "AAAQ": 2,
        "AABA": 2,
        "AABK": 2,
        "AAAH": 2,
        "AAAR": 2,
        "AABB": 2,
        "AABL": 2,
        "AAAI": 2,
        "AAAS": 2,
        "AABC": 2,
        "AABM": 2,
        "AAAJ": 2,
        "AAAT": 2,
        "AABD": 2,
        "AABN": 2,
        "AAAD": 2,
        "AAAE": 2,
        "AAAK": 2,
        "AAAL": 2,
        "AAAN": 2,
        "AAAO": 2,
        "AAAU": 2,
        "AAAV": 2,
        "AAAX": 2,
        "AAAY": 2,
        "AABE": 2,
        "AABF": 2,
        "AABH": 2,
        "AABI": 2
    },
    "blast_radius": {
        "by_collision_domain": {
            "AAAD": [
                1,
                2
            ],
            "AAAG": [
                1,
                2
            ],
            "AAAH": [
                1,
                2
            ],
            "AAAE": [
                1,
                2
            ],
            "AAAI": [
                1,
                2
            ],
            "AAAJ": [
                1,
                2
            ],
            "AAAQ": [
                2,
                2
            ],
            "AABA": [
                2,
                2
            ],
            "AABK": [
                2,
                2
            ],
            "AAAR": [
                2,
                2
            ],
            "AABB": [
                2,
                2
            ],
            "AABL": [
                2,
                2
            ],
            "AAAT": [
                2,
                2
            ],
            "AABD": [
                2,
                2
            ],
            "AABN": [
                2,
                2
            ],
            "AAAS": [
                2,
                2
            ],
            "AABC": [
                2,
                2
            ],
            "AABM": [
                2,
                2
            ],
            "AAAU": [
                3,
                2
            ],
            "AAAX": [
                3,
                2
            ],
            "AAAL": [
                3,
                2
            ],
            "AAAO": [
                3,
                2
            ],
            "AAAK": [
                3,
                2
            ],
            "AAAN": [
                3,
                2
            ],
            "AABE": [
                3,
                2
            ],
            "AABH": [
                3,
                2
            ],
            "AABF": [
                3,
                2
            ],
            "AABI": [
                3,
                2
            ],
            "AAAV": [
                3,
                2
            ],
            "AAAY": [
                3,
                2
            ]
        },
        "by_distance": {
            "1": 12,
            "2": 24,
            "3": 24
        }
    },
    "radius_graph": {
        "nodes": [
            {
                "id": "spine_3_1_1",
                "label": "spine_3_1_1"
            },
            {
                "id": "leaf_2_0_1",
                "label": "leaf_2_0_1"
            },
            {
                "id": "spine_2_1_2",
                "label": "spine_2_1_2"
            },
            {
                "id": "leaf_1_0_2",
                "label": "leaf_1_0_2"
            },
            {
                "id": "leaf_4_0_1",
                "label": "leaf_4_0_1"
            },
            {
                "id": "tof_1_2_1",
                "label": "tof_1_2_1"
            },
            {
                "id": "tof_1_2_2",
                "label": "tof_1_2_2"
            },
            {
                "id": "spine_1_1_2",
                "label": "spine_1_1_2"
            },
            {
                "id": "spine_4_1_2",
                "label": "spine_4_1_2"
            },
            {
                "id": "leaf_1_0_1",
                "label": "leaf_1_0_1"
            },
            {
                "id": "leaf_3_0_1",
                "label": "leaf_3_0_1"
            },
            {
                "id": "leaf_2_0_2",
                "label": "leaf_2_0_2"
            },
            {
                "id": "spine_2_1_1",
                "label": "spine_2_1_1"
            },
            {
                "id": "leaf_4_0_2",
                "label": "leaf_4_0_2"
            },
            {
                "id": "leaf_3_0_2",
                "label": "leaf_3_0_2"
            },
            {
                "id": "spine_1_1_1",
                "label": "spine_1_1_1"
            },
            {
                "id": "tof_2_2_2",
                "label": "tof_2_2_2"
            },
            {
                "id": "spine_4_1_1",
                "label": "spine_4_1_1"
            },
            {
                "id": "tof_2_2_1",
                "label": "tof_2_2_1"
            },
            {
                "id": "spine_3_1_2",
                "label": "spine_3_1_2"
            }
        ],
        "links": [
            {
                "source": "tof_1_2_1",
                "target": "spine_1_1_1",
                "value": 2,
                "label": "AAAG"
            },
            {
                "source": "tof_1_2_1",
                "target": "spine_2_1_1",
                "value": 2,
                "label": "AAAQ"
            },
            {
                "source": "tof_1_2_1",
                "target": "spine_3_1_1",
                "value": 2,
                "label": "AABA"
            },
            {
                "source": "tof_1_2_1",
                "target": "spine_4_1_1",
                "value": 2,
                "label": "AABK"
            },
            {
                "source": "tof_1_2_2",
                "target": "spine_1_1_1",
                "value": 2,
                "label": "AAAH"
            },
            {
                "source": "tof_1_2_2",
                "target": "spine_2_1_1",
                "value": 2,
                "label": "AAAR"
            },
            {
                "source": "tof_1_2_2",
                "target": "spine_3_1_1",
                "value": 2,
                "label": "AABB"
            },
            {
                "source": "tof_1_2_2",
                "target": "spine_4_1_1",
                "value": 2,
                "label": "AABL"
            },
            {
                "source": "tof_2_2_1",
                "target": "spine_1_1_2",
                "value": 2,
                "label": "AAAI"
            },
            {
                "source": "tof_2_2_1",
                "target": "spine_2_1_2",
                "value": 2,
                "label": "AAAS"
            },
            {
                "source": "tof_2_2_1",
                "target": "spine_3_1_2",
                "value": 2,
                "label": "AABC"
            },
            {
                "source": "tof_2_2_1",
                "target": "spine_4_1_2",
                "value": 2,
                "label": "AABM"
            },
            {
                "source": "tof_2_2_2",
                "target": "spine_1_1_2",
                "value": 2,
                "label": "AAAJ"
            },
            {
                "source": "tof_2_2_2",
                "target": "spine_2_1_2",
                "value": 2,
                "label": "AAAT"
            },
            {
                "source": "tof_2_2_2",
                "target": "spine_3_1_2",
                "value": 2,
                "label": "AABD"
            },
            {
                "source": "tof_2_2_2",
                "target": "spine_4_1_2",
                "value": 2,
                "label": "AABN"
            },
            {
                "source": "leaf_1_0_1",
                "target": "spine_1_1_1",
                "value": 0,
                "label": "AAAA"
            },
            {
                "source": "leaf_1_0_1",
                "target": "spine_1_1_2",
                "value": 0,
                "label": "AAAB"
            },
            {
                "source": "leaf_1_0_2",
                "target": "spine_1_1_1",
                "value": 2,
                "label": "AAAD"
            },
            {
                "source": "leaf_1_0_2",
                "target": "spine_1_1_2",
                "value": 2,
                "label": "AAAE"
            },
            {
                "source": "spine_1_1_1",
                "target": "leaf_1_0_1",
                "value": 0,
                "label": "AAAA"
            },
            {
                "source": "spine_1_1_1",
                "target": "leaf_1_0_2",
                "value": 2,
                "label": "AAAD"
            },
            {
                "source": "spine_1_1_1",
                "target": "tof_1_2_1",
                "value": 2,
                "label": "AAAG"
            },
            {
                "source": "spine_1_1_1",
                "target": "tof_1_2_2",
                "value": 2,
                "label": "AAAH"
            },
            {
                "source": "spine_1_1_2",
                "target": "leaf_1_0_1",
                "value": 0,
                "label": "AAAB"
            },
            {
                "source": "spine_1_1_2",
                "target": "leaf_1_0_2",
                "value": 2,
                "label": "AAAE"
            },
            {
                "source": "spine_1_1_2",
                "target": "tof_2_2_1",
                "value": 2,
                "label": "AAAI"
            },
            {
                "source": "spine_1_1_2",
                "target": "tof_2_2_2",
                "value": 2,
                "label": "AAAJ"
            },
            {
                "source": "leaf_2_0_1",
                "target": "spine_2_1_1",
                "value": 2,
                "label": "AAAK"
            },
            {
                "source": "leaf_2_0_1",
                "target": "spine_2_1_2",
                "value": 2,
                "label": "AAAL"
            },
            {
                "source": "leaf_2_0_2",
                "target": "spine_2_1_1",
                "value": 2,
                "label": "AAAN"
            },
            {
                "source": "leaf_2_0_2",
                "target": "spine_2_1_2",
                "value": 2,
                "label": "AAAO"
            },
            {
                "source": "spine_2_1_1",
                "target": "leaf_2_0_1",
                "value": 2,
                "label": "AAAK"
            },
            {
                "source": "spine_2_1_1",
                "target": "leaf_2_0_2",
                "value": 2,
                "label": "AAAN"
            },
            {
                "source": "spine_2_1_1",
                "target": "tof_1_2_1",
                "value": 2,
                "label": "AAAQ"
            },
            {
                "source": "spine_2_1_1",
                "target": "tof_1_2_2",
                "value": 2,
                "label": "AAAR"
            },
            {
                "source": "spine_2_1_2",
                "target": "leaf_2_0_1",
                "value": 2,
                "label": "AAAL"
            },
            {
                "source": "spine_2_1_2",
                "target": "leaf_2_0_2",
                "value": 2,
                "label": "AAAO"
            },
            {
                "source": "spine_2_1_2",
                "target": "tof_2_2_1",
                "value": 2,
                "label": "AAAS"
            },
            {
                "source": "spine_2_1_2",
                "target": "tof_2_2_2",
                "value": 2,
                "label": "AAAT"
            },
            {
                "source": "leaf_3_0_1",
                "target": "spine_3_1_1",
                "value": 2,
                "label": "AAAU"
            },
            {
                "source": "leaf_3_0_1",
                "target": "spine_3_1_2",
                "value": 2,
                "label": "AAAV"
            },
            {
                "source": "leaf_3_0_2",
                "target": "spine_3_1_1",
                "value": 2,
                "label": "AAAX"
            },
            {
                "source": "leaf_3_0_2",
                "target": "spine_3_1_2",
                "value": 2,
                "label": "AAAY"
            },
            {
                "source": "spine_3_1_1",
                "target": "leaf_3_0_1",
                "value": 2,
                "label": "AAAU"
            },
            {
                "source": "spine_3_1_1",
                "target": "leaf_3_0_2",
                "value": 2,
                "label": "AAAX"
            },
            {
                "source": "spine_3_1_1",
                "target": "tof_1_2_1",
                "value": 2,
                "label": "AABA"
            },
            {
                "source": "spine_3_1_1",
                "target": "tof_1_2_2",
                "value": 2,
                "label": "AABB"
            },
            {
                "source": "spine_3_1_2",
                "target": "leaf_3_0_1",
                "value": 2,
                "label": "AAAV"
            },
            {
                "source": "spine_3_1_2",
                "target": "leaf_3_0_2",
                "value": 2,
                "label": "AAAY"
            },
            {
                "source": "spine_3_1_2",
                "target": "tof_2_2_1",
                "value": 2,
                "label": "AABC"
            },
            {
                "source": "spine_3_1_2",
                "target": "tof_2_2_2",
                "value": 2,
                "label": "AABD"
            },
            {
                "source": "leaf_4_0_1",
                "target": "spine_4_1_1",
                "value": 2,
                "label": "AABE"
            },
            {
                "source": "leaf_4_0_1",
                "target": "spine_4_1_2",
                "value": 2,
                "label": "AABF"
            },
            {
                "source": "leaf_4_0_2",
                "target": "spine_4_1_1",
                "value": 2,
                "label": "AABH"
            },
            {
                "source": "leaf_4_0_2",
                "target": "spine_4_1_2",
                "value": 2,
                "label": "AABI"
            },
            {
                "source": "spine_4_1_1",
                "target": "leaf_4_0_1",
                "value": 2,
                "label": "AABE"
            },
            {
                "source": "spine_4_1_1",
                "target": "leaf_4_0_2",
                "value": 2,
                "label": "AABH"
            },
            {
                "source": "spine_4_1_1",
                "target": "tof_1_2_1",
                "value": 2,
                "label": "AABK"
            },
            {
                "source": "spine_4_1_1",
                "target": "tof_1_2_2",
                "value": 2,
                "label": "AABL"
            },
            {
                "source": "spine_4_1_2",
                "target": "leaf_4_0_1",
                "value": 2,
                "label": "AABF"
            },
            {
                "source": "spine_4_1_2",
                "target": "leaf_4_0_2",
                "value": 2,
                "label": "AABI"
            },
            {
                "source": "spine_4_1_2",
                "target": "tof_2_2_1",
                "value": 2,
                "label": "AABM"
            },
            {
                "source": "spine_4_1_2",
                "target": "tof_2_2_2",
                "value": 2,
                "label": "AABN"
            }
        ]
    },
    "max_number_of_rounds": 4,
    "packets_per_round": {
        "0": 0,
        "1": 6,
        "2": 18,
        "3": 24,
        "4": 12
    },
    "round_graph": {
        "nodes": [
            {
                "id": "spine_2_1_1-4",
                "label": "spine_2_1_1-4"
            },
            {
                "id": "tof_2_2_1-3",
                "label": "tof_2_2_1-3"
            },
            {
                "id": "spine_1_1_1-0",
                "label": "spine_1_1_1-0"
            },
            {
                "id": "spine_3_1_2-2",
                "label": "spine_3_1_2-2"
            },
            {
                "id": "spine_4_1_2-4",
                "label": "spine_4_1_2-4"
            },
            {
                "id": "spine_4_1_1-4",
                "label": "spine_4_1_1-4"
            },
            {
                "id": "spine_1_1_1-2",
                "label": "spine_1_1_1-2"
            },
            {
                "id": "tof_1_2_1-1",
                "label": "tof_1_2_1-1"
            },
            {
                "id": "tof_2_2_2-1",
                "label": "tof_2_2_2-1"
            },
            {
                "id": "spine_1_1_2-0",
                "label": "spine_1_1_2-0"
            },
            {
                "id": "spine_2_1_2-2",
                "label": "spine_2_1_2-2"
            },
            {
                "id": "leaf_1_0_1",
                "label": "leaf_1_0_1"
            },
            {
                "id": "spine_3_1_1-2",
                "label": "spine_3_1_1-2"
            },
            {
                "id": "leaf_2_0_1-3",
                "label": "leaf_2_0_1-3"
            },
            {
                "id": "leaf_2_0_2-3",
                "label": "leaf_2_0_2-3"
            },
            {
                "id": "spine_3_1_1-4",
                "label": "spine_3_1_1-4"
            },
            {
                "id": "tof_2_2_1-1",
                "label": "tof_2_2_1-1"
            },
            {
                "id": "tof_1_2_1-3",
                "label": "tof_1_2_1-3"
            },
            {
                "id": "leaf_1_0_2-1",
                "label": "leaf_1_0_2-1"
            },
            {
                "id": "tof_1_2_2-1",
                "label": "tof_1_2_2-1"
            },
            {
                "id": "spine_2_1_1-2",
                "label": "spine_2_1_1-2"
            },
            {
                "id": "tof_2_2_2-3",
                "label": "tof_2_2_2-3"
            },
            {
                "id": "leaf_4_0_2-3",
                "label": "leaf_4_0_2-3"
            },
            {
                "id": "tof_1_2_2-3",
                "label": "tof_1_2_2-3"
            },
            {
                "id": "leaf_3_0_2-3",
                "label": "leaf_3_0_2-3"
            },
            {
                "id": "spine_1_1_2-2",
                "label": "spine_1_1_2-2"
            },
            {
                "id": "leaf_4_0_1-3",
                "label": "leaf_4_0_1-3"
            },
            {
                "id": "spine_4_1_1-2",
                "label": "spine_4_1_1-2"
            },
            {
                "id": "leaf_3_0_1-3",
                "label": "leaf_3_0_1-3"
            },
            {
                "id": "spine_3_1_2-4",
                "label": "spine_3_1_2-4"
            },
            {
                "id": "spine_2_1_2-4",
                "label": "spine_2_1_2-4"
            },
            {
                "id": "spine_4_1_2-2",
                "label": "spine_4_1_2-2"
            }
        ],
        "links": [
            {
                "source": "leaf_1_0_1",
                "target": "spine_1_1_2-0",
                "value": 0
            },
            {
                "source": "leaf_1_0_1",
                "target": "spine_1_1_1-0",
                "value": 0
            },
            {
                "source": "spine_1_1_2-0",
                "target": "leaf_1_0_2-1",
                "value": 1,
                "label": [
                    {
                        "time": 1622466181.96638,
                        "type": "Update (WD)",
                        "WD Routes": "200.0.0.0/24"
                    }
                ]
            },
            {
                "source": "spine_1_1_2-0",
                "target": "tof_2_2_1-1",
                "value": 1,
                "label": [
                    {
                        "time": 1622466181.966458,
                        "type": "Update (WD)",
                        "WD Routes": "200.0.0.0/24"
                    }
                ]
            },
            {
                "source": "spine_1_1_2-0",
                "target": "tof_2_2_2-1",
                "value": 1,
                "label": [
                    {
                        "time": 1622466181.966486,
                        "type": "Update (WD)",
                        "WD Routes": "200.0.0.0/24"
                    }
                ]
            },
            {
                "source": "spine_1_1_1-0",
                "target": "leaf_1_0_2-1",
                "value": 1,
                "label": [
                    {
                        "time": 1622466181.966578,
                        "type": "Update (WD)",
                        "WD Routes": "200.0.0.0/24"
                    }
                ]
            },
            {
                "source": "spine_1_1_1-0",
                "target": "tof_1_2_1-1",
                "value": 1,
                "label": [
                    {
                        "time": 1622466181.966733,
                        "type": "Update (WD)",
                        "WD Routes": "200.0.0.0/24"
                    }
                ]
            },
            {
                "source": "spine_1_1_1-0",
                "target": "tof_1_2_2-1",
                "value": 1,
                "label": [
                    {
                        "time": 1622466181.966797,
                        "type": "Update (WD)",
                        "WD Routes": "200.0.0.0/24"
                    }
                ]
            },
            {
                "source": "leaf_1_0_2-1",
                "target": "spine_1_1_2-2",
                "value": 1,
                "label": [
                    {
                        "time": 1622466182.017355,
                        "type": "Update (WD)",
                        "WD Routes": "200.0.0.0/24"
                    }
                ]
            },
            {
                "source": "leaf_1_0_2-1",
                "target": "spine_1_1_1-2",
                "value": 1,
                "label": [
                    {
                        "time": 1622466182.017477,
                        "type": "Update (WD)",
                        "WD Routes": "200.0.0.0/24"
                    }
                ]
            },
            {
                "source": "tof_2_2_1-1",
                "target": "spine_1_1_2-2",
                "value": 1,
                "label": [
                    {
                        "time": 1622466182.017397,
                        "type": "Update (WD)",
                        "WD Routes": "200.0.0.0/24"
                    }
                ]
            },
            {
                "source": "tof_2_2_1-1",
                "target": "spine_2_1_2-2",
                "value": 1,
                "label": [
                    {
                        "time": 1622466182.017534,
                        "type": "Update (WD)",
                        "WD Routes": "200.0.0.0/24"
                    }
                ]
            },
            {
                "source": "tof_2_2_1-1",
                "target": "spine_3_1_2-2",
                "value": 1,
                "label": [
                    {
                        "time": 1622466182.017586,
                        "type": "Update (WD)",
                        "WD Routes": "200.0.0.0/24"
                    }
                ]
            },
            {
                "source": "tof_2_2_1-1",
                "target": "spine_4_1_2-2",
                "value": 1,
                "label": [
                    {
                        "time": 1622466182.017668,
                        "type": "Update (WD)",
                        "WD Routes": "200.0.0.0/24"
                    }
                ]
            },
            {
                "source": "tof_2_2_2-1",
                "target": "spine_1_1_2-2",
                "value": 1,
                "label": [
                    {
                        "time": 1622466182.017716,
                        "type": "Update (WD)",
                        "WD Routes": "200.0.0.0/24"
                    }
                ]
            },
            {
                "source": "tof_2_2_2-1",
                "target": "spine_2_1_2-2",
                "value": 1,
                "label": [
                    {
                        "time": 1622466182.01788,
                        "type": "Update (WD)",
                        "WD Routes": "200.0.0.0/24"
                    }
                ]
            },
            {
                "source": "tof_2_2_2-1",
                "target": "spine_3_1_2-2",
                "value": 1,
                "label": [
                    {
                        "time": 1622466182.018098,
                        "type": "Update (WD)",
                        "WD Routes": "200.0.0.0/24"
                    }
                ]
            },
            {
                "source": "tof_2_2_2-1",
                "target": "spine_4_1_2-2",
                "value": 1,
                "label": [
                    {
                        "time": 1622466182.018216,
                        "type": "Update (WD)",
                        "WD Routes": "200.0.0.0/24"
                    }
                ]
            },
            {
                "source": "tof_1_2_1-1",
                "target": "spine_1_1_1-2",
                "value": 1,
                "label": [
                    {
                        "time": 1622466182.017706,
                        "type": "Update (WD)",
                        "WD Routes": "200.0.0.0/24"
                    }
                ]
            },
            {
                "source": "tof_1_2_1-1",
                "target": "spine_3_1_1-2",
                "value": 1,
                "label": [
                    {
                        "time": 1622466182.017904,
                        "type": "Update (WD)",
                        "WD Routes": "200.0.0.0/24"
                    }
                ]
            },
            {
                "source": "tof_1_2_1-1",
                "target": "spine_2_1_1-2",
                "value": 1,
                "label": [
                    {
                        "time": 1622466182.017959,
                        "type": "Update (WD)",
                        "WD Routes": "200.0.0.0/24"
                    }
                ]
            },
            {
                "source": "tof_1_2_1-1",
                "target": "spine_4_1_1-2",
                "value": 1,
                "label": [
                    {
                        "time": 1622466182.018004,
                        "type": "Update (WD)",
                        "WD Routes": "200.0.0.0/24"
                    }
                ]
            },
            {
                "source": "tof_1_2_2-1",
                "target": "spine_1_1_1-2",
                "value": 1,
                "label": [
                    {
                        "time": 1622466182.017612,
                        "type": "Update (WD)",
                        "WD Routes": "200.0.0.0/24"
                    }
                ]
            },
            {
                "source": "tof_1_2_2-1",
                "target": "spine_2_1_1-2",
                "value": 1,
                "label": [
                    {
                        "time": 1622466182.017906,
                        "type": "Update (WD)",
                        "WD Routes": "200.0.0.0/24"
                    }
                ]
            },
            {
                "source": "tof_1_2_2-1",
                "target": "spine_3_1_1-2",
                "value": 1,
                "label": [
                    {
                        "time": 1622466182.017961,
                        "type": "Update (WD)",
                        "WD Routes": "200.0.0.0/24"
                    }
                ]
            },
            {
                "source": "tof_1_2_2-1",
                "target": "spine_4_1_1-2",
                "value": 1,
                "label": [
                    {
                        "time": 1622466182.018064,
                        "type": "Update (WD)",
                        "WD Routes": "200.0.0.0/24"
                    }
                ]
            },
            {
                "source": "spine_2_1_2-2",
                "target": "leaf_2_0_1-3",
                "value": 1,
                "label": [
                    {
                        "time": 1622466182.068571,
                        "type": "Update (WD)",
                        "WD Routes": "200.0.0.0/24"
                    }
                ]
            },
            {
                "source": "spine_2_1_2-2",
                "target": "leaf_2_0_2-3",
                "value": 1,
                "label": [
                    {
                        "time": 1622466182.068732,
                        "type": "Update (WD)",
                        "WD Routes": "200.0.0.0/24"
                    }
                ]
            },
            {
                "source": "spine_2_1_2-2",
                "target": "tof_2_2_1-3",
                "value": 1,
                "label": [
                    {
                        "time": 1622466182.06885,
                        "type": "Update (WD)",
                        "WD Routes": "200.0.0.0/24"
                    }
                ]
            },
            {
                "source": "spine_2_1_2-2",
                "target": "tof_2_2_2-3",
                "value": 1,
                "label": [
                    {
                        "time": 1622466182.069077,
                        "type": "Update (WD)",
                        "WD Routes": "200.0.0.0/24"
                    }
                ]
            },
            {
                "source": "spine_3_1_2-2",
                "target": "leaf_3_0_1-3",
                "value": 1,
                "label": [
                    {
                        "time": 1622466182.068883,
                        "type": "Update (WD)",
                        "WD Routes": "200.0.0.0/24"
                    }
                ]
            },
            {
                "source": "spine_3_1_2-2",
                "target": "leaf_3_0_2-3",
                "value": 1,
                "label": [
                    {
                        "time": 1622466182.06902,
                        "type": "Update (WD)",
                        "WD Routes": "200.0.0.0/24"
                    }
                ]
            },
            {
                "source": "spine_3_1_2-2",
                "target": "tof_2_2_1-3",
                "value": 1,
                "label": [
                    {
                        "time": 1622466182.069066,
                        "type": "Update (WD)",
                        "WD Routes": "200.0.0.0/24"
                    }
                ]
            },
            {
                "source": "spine_3_1_2-2",
                "target": "tof_2_2_2-3",
                "value": 1,
                "label": [
                    {
                        "time": 1622466182.069149,
                        "type": "Update (WD)",
                        "WD Routes": "200.0.0.0/24"
                    }
                ]
            },
            {
                "source": "spine_4_1_2-2",
                "target": "leaf_4_0_1-3",
                "value": 1,
                "label": [
                    {
                        "time": 1622466182.068837,
                        "type": "Update (WD)",
                        "WD Routes": "200.0.0.0/24"
                    }
                ]
            },
            {
                "source": "spine_4_1_2-2",
                "target": "leaf_4_0_2-3",
                "value": 1,
                "label": [
                    {
                        "time": 1622466182.068984,
                        "type": "Update (WD)",
                        "WD Routes": "200.0.0.0/24"
                    }
                ]
            },
            {
                "source": "spine_4_1_2-2",
                "target": "tof_2_2_1-3",
                "value": 1,
                "label": [
                    {
                        "time": 1622466182.069052,
                        "type": "Update (WD)",
                        "WD Routes": "200.0.0.0/24"
                    }
                ]
            },
            {
                "source": "spine_4_1_2-2",
                "target": "tof_2_2_2-3",
                "value": 1,
                "label": [
                    {
                        "time": 1622466182.06909,
                        "type": "Update (WD)",
                        "WD Routes": "200.0.0.0/24"
                    }
                ]
            },
            {
                "source": "spine_3_1_1-2",
                "target": "leaf_3_0_1-3",
                "value": 1,
                "label": [
                    {
                        "time": 1622466182.068773,
                        "type": "Update (WD)",
                        "WD Routes": "200.0.0.0/24"
                    }
                ]
            },
            {
                "source": "spine_3_1_1-2",
                "target": "leaf_3_0_2-3",
                "value": 1,
                "label": [
                    {
                        "time": 1622466182.068885,
                        "type": "Update (WD)",
                        "WD Routes": "200.0.0.0/24"
                    }
                ]
            },
            {
                "source": "spine_3_1_1-2",
                "target": "tof_1_2_1-3",
                "value": 1,
                "label": [
                    {
                        "time": 1622466182.06892,
                        "type": "Update (WD)",
                        "WD Routes": "200.0.0.0/24"
                    }
                ]
            },
            {
                "source": "spine_3_1_1-2",
                "target": "tof_1_2_2-3",
                "value": 1,
                "label": [
                    {
                        "time": 1622466182.068948,
                        "type": "Update (WD)",
                        "WD Routes": "200.0.0.0/24"
                    }
                ]
            },
            {
                "source": "spine_2_1_1-2",
                "target": "leaf_2_0_1-3",
                "value": 1,
                "label": [
                    {
                        "time": 1622466182.069027,
                        "type": "Update (WD)",
                        "WD Routes": "200.0.0.0/24"
                    }
                ]
            },
            {
                "source": "spine_2_1_1-2",
                "target": "leaf_2_0_2-3",
                "value": 1,
                "label": [
                    {
                        "time": 1622466182.069217,
                        "type": "Update (WD)",
                        "WD Routes": "200.0.0.0/24"
                    }
                ]
            },
            {
                "source": "spine_2_1_1-2",
                "target": "tof_1_2_1-3",
                "value": 1,
                "label": [
                    {
                        "time": 1622466182.069344,
                        "type": "Update (WD)",
                        "WD Routes": "200.0.0.0/24"
                    }
                ]
            },
            {
                "source": "spine_2_1_1-2",
                "target": "tof_1_2_2-3",
                "value": 1,
                "label": [
                    {
                        "time": 1622466182.069462,
                        "type": "Update (WD)",
                        "WD Routes": "200.0.0.0/24"
                    }
                ]
            },
            {
                "source": "spine_4_1_1-2",
                "target": "leaf_4_0_1-3",
                "value": 1,
                "label": [
                    {
                        "time": 1622466182.069196,
                        "type": "Update (WD)",
                        "WD Routes": "200.0.0.0/24"
                    }
                ]
            },
            {
                "source": "spine_4_1_1-2",
                "target": "leaf_4_0_2-3",
                "value": 1,
                "label": [
                    {
                        "time": 1622466182.069286,
                        "type": "Update (WD)",
                        "WD Routes": "200.0.0.0/24"
                    }
                ]
            },
            {
                "source": "spine_4_1_1-2",
                "target": "tof_1_2_1-3",
                "value": 1,
                "label": [
                    {
                        "time": 1622466182.069334,
                        "type": "Update (WD)",
                        "WD Routes": "200.0.0.0/24"
                    }
                ]
            },
            {
                "source": "spine_4_1_1-2",
                "target": "tof_1_2_2-3",
                "value": 1,
                "label": [
                    {
                        "time": 1622466182.069391,
                        "type": "Update (WD)",
                        "WD Routes": "200.0.0.0/24"
                    }
                ]
            },
            {
                "source": "leaf_2_0_1-3",
                "target": "spine_2_1_1-4",
                "value": 1,
                "label": [
                    {
                        "time": 1622466182.120381,
                        "type": "Update (WD)",
                        "WD Routes": "200.0.0.0/24"
                    }
                ]
            },
            {
                "source": "leaf_2_0_1-3",
                "target": "spine_2_1_2-4",
                "value": 1,
                "label": [
                    {
                        "time": 1622466182.12048,
                        "type": "Update (WD)",
                        "WD Routes": "200.0.0.0/24"
                    }
                ]
            },
            {
                "source": "leaf_2_0_2-3",
                "target": "spine_2_1_1-4",
                "value": 1,
                "label": [
                    {
                        "time": 1622466182.119881,
                        "type": "Update (WD)",
                        "WD Routes": "200.0.0.0/24"
                    }
                ]
            },
            {
                "source": "leaf_2_0_2-3",
                "target": "spine_2_1_2-4",
                "value": 1,
                "label": [
                    {
                        "time": 1622466182.120093,
                        "type": "Update (WD)",
                        "WD Routes": "200.0.0.0/24"
                    }
                ]
            },
            {
                "source": "leaf_3_0_1-3",
                "target": "spine_3_1_1-4",
                "value": 1,
                "label": [
                    {
                        "time": 1622466182.119843,
                        "type": "Update (WD)",
                        "WD Routes": "200.0.0.0/24"
                    }
                ]
            },
            {
                "source": "leaf_3_0_1-3",
                "target": "spine_3_1_2-4",
                "value": 1,
                "label": [
                    {
                        "time": 1622466182.119991,
                        "type": "Update (WD)",
                        "WD Routes": "200.0.0.0/24"
                    }
                ]
            },
            {
                "source": "leaf_3_0_2-3",
                "target": "spine_3_1_1-4",
                "value": 1,
                "label": [
                    {
                        "time": 1622466182.119725,
                        "type": "Update (WD)",
                        "WD Routes": "200.0.0.0/24"
                    }
                ]
            },
            {
                "source": "leaf_3_0_2-3",
                "target": "spine_3_1_2-4",
                "value": 1,
                "label": [
                    {
                        "time": 1622466182.119828,
                        "type": "Update (WD)",
                        "WD Routes": "200.0.0.0/24"
                    }
                ]
            },
            {
                "source": "leaf_4_0_1-3",
                "target": "spine_4_1_2-4",
                "value": 1,
                "label": [
                    {
                        "time": 1622466182.119166,
                        "type": "Update (WD)",
                        "WD Routes": "200.0.0.0/24"
                    }
                ]
            },
            {
                "source": "leaf_4_0_1-3",
                "target": "spine_4_1_1-4",
                "value": 1,
                "label": [
                    {
                        "time": 1622466182.119221,
                        "type": "Update (WD)",
                        "WD Routes": "200.0.0.0/24"
                    }
                ]
            },
            {
                "source": "leaf_4_0_2-3",
                "target": "spine_4_1_2-4",
                "value": 1,
                "label": [
                    {
                        "time": 1622466182.119449,
                        "type": "Update (WD)",
                        "WD Routes": "200.0.0.0/24"
                    }
                ]
            },
            {
                "source": "leaf_4_0_2-3",
                "target": "spine_4_1_1-4",
                "value": 1,
                "label": [
                    {
                        "time": 1622466182.119527,
                        "type": "Update (WD)",
                        "WD Routes": "200.0.0.0/24"
                    }
                ]
            }
        ]
    },
    "logical_time_plot": {
        "points": {
            "spine_1_1_2": {
                "1": {
                    "time": 1622466181.96638,
                    "type": "Update (WD)",
                    "WD Routes": "200.0.0.0/24",
                    "Logical Clock": 1
                },
                "2": {
                    "time": 1622466181.966458,
                    "type": "Update (WD)",
                    "WD Routes": "200.0.0.0/24",
                    "Logical Clock": 2
                },
                "3": {
                    "time": 1622466181.966486,
                    "type": "Update (WD)",
                    "WD Routes": "200.0.0.0/24",
                    "Logical Clock": 3
                },
                "5": {
                    "time": 1622466182.017888,
                    "type": "Update (WD)",
                    "WD Routes": "200.0.0.0/24",
                    "Logical Clock": 5
                },
                "6": {
                    "time": 1622466182.017966,
                    "type": "Update (WD)",
                    "WD Routes": "200.0.0.0/24",
                    "Logical Clock": 6
                },
                "7": {
                    "time": 1622466182.018019,
                    "type": "Update (WD)",
                    "WD Routes": "200.0.0.0/24",
                    "Logical Clock": 7
                }
            },
            "leaf_1_0_2": {
                "2": {
                    "time": 1622466181.966794,
                    "type": "Update (WD)",
                    "WD Routes": "200.0.0.0/24",
                    "Logical Clock": 2
                },
                "3": {
                    "time": 1622466181.96687,
                    "type": "Update (WD)",
                    "WD Routes": "200.0.0.0/24",
                    "Logical Clock": 3
                },
                "4": {
                    "time": 1622466182.017355,
                    "type": "Update (WD)",
                    "WD Routes": "200.0.0.0/24",
                    "Logical Clock": 4
                },
                "5": {
                    "time": 1622466182.017477,
                    "type": "Update (WD)",
                    "WD Routes": "200.0.0.0/24",
                    "Logical Clock": 5
                }
            },
            "tof_2_2_1": {
                "3": {
                    "time": 1622466181.966767,
                    "type": "Update (WD)",
                    "WD Routes": "200.0.0.0/24",
                    "Logical Clock": 3
                },
                "4": {
                    "time": 1622466182.017397,
                    "type": "Update (WD)",
                    "WD Routes": "200.0.0.0/24",
                    "Logical Clock": 4
                },
                "5": {
                    "time": 1622466182.017534,
                    "type": "Update (WD)",
                    "WD Routes": "200.0.0.0/24",
                    "Logical Clock": 5
                },
                "6": {
                    "time": 1622466182.017586,
                    "type": "Update (WD)",
                    "WD Routes": "200.0.0.0/24",
                    "Logical Clock": 6
                },
                "7": {
                    "time": 1622466182.017668,
                    "type": "Update (WD)",
                    "WD Routes": "200.0.0.0/24",
                    "Logical Clock": 7
                },
                "11": {
                    "time": 1622466182.069042,
                    "type": "Update (WD)",
                    "WD Routes": "200.0.0.0/24",
                    "Logical Clock": 11
                },
                "12": {
                    "time": 1622466182.069054,
                    "type": "Update (WD)",
                    "WD Routes": "200.0.0.0/24",
                    "Logical Clock": 12
                },
                "13": {
                    "time": 1622466182.068816,
                    "type": "Update (WD)",
                    "WD Routes": "200.0.0.0/24",
                    "Logical Clock": 13
                }
            },
            "tof_2_2_2": {
                "4": {
                    "time": 1622466181.966932,
                    "type": "Update (WD)",
                    "WD Routes": "200.0.0.0/24",
                    "Logical Clock": 4
                },
                "5": {
                    "time": 1622466182.017716,
                    "type": "Update (WD)",
                    "WD Routes": "200.0.0.0/24",
                    "Logical Clock": 5
                },
                "6": {
                    "time": 1622466182.01788,
                    "type": "Update (WD)",
                    "WD Routes": "200.0.0.0/24",
                    "Logical Clock": 6
                },
                "7": {
                    "time": 1622466182.018098,
                    "type": "Update (WD)",
                    "WD Routes": "200.0.0.0/24",
                    "Logical Clock": 7
                },
                "8": {
                    "time": 1622466182.018216,
                    "type": "Update (WD)",
                    "WD Routes": "200.0.0.0/24",
                    "Logical Clock": 8
                },
                "12": {
                    "time": 1622466182.069166,
                    "type": "Update (WD)",
                    "WD Routes": "200.0.0.0/24",
                    "Logical Clock": 12
                },
                "13": {
                    "time": 1622466182.069213,
                    "type": "Update (WD)",
                    "WD Routes": "200.0.0.0/24",
                    "Logical Clock": 13
                },
                "14": {
                    "time": 1622466182.068912,
                    "type": "Update (WD)",
                    "WD Routes": "200.0.0.0/24",
                    "Logical Clock": 14
                }
            },
            "spine_1_1_1": {
                "1": {
                    "time": 1622466181.966578,
                    "type": "Update (WD)",
                    "WD Routes": "200.0.0.0/24",
                    "Logical Clock": 1
                },
                "2": {
                    "time": 1622466181.966733,
                    "type": "Update (WD)",
                    "WD Routes": "200.0.0.0/24",
                    "Logical Clock": 2
                },
                "3": {
                    "time": 1622466181.966797,
                    "type": "Update (WD)",
                    "WD Routes": "200.0.0.0/24",
                    "Logical Clock": 3
                },
                "6": {
                    "time": 1622466182.017891,
                    "type": "Update (WD)",
                    "WD Routes": "200.0.0.0/24",
                    "Logical Clock": 6
                },
                "7": {
                    "time": 1622466182.017988,
                    "type": "Update (WD)",
                    "WD Routes": "200.0.0.0/24",
                    "Logical Clock": 7
                },
                "8": {
                    "time": 1622466182.018154,
                    "type": "Update (WD)",
                    "WD Routes": "200.0.0.0/24",
                    "Logical Clock": 8
                }
            },
            "tof_1_2_1": {
                "3": {
                    "time": 1622466181.967101,
                    "type": "Update (WD)",
                    "WD Routes": "200.0.0.0/24",
                    "Logical Clock": 3
                },
                "4": {
                    "time": 1622466182.017706,
                    "type": "Update (WD)",
                    "WD Routes": "200.0.0.0/24",
                    "Logical Clock": 4
                },
                "5": {
                    "time": 1622466182.017904,
                    "type": "Update (WD)",
                    "WD Routes": "200.0.0.0/24",
                    "Logical Clock": 5
                },
                "6": {
                    "time": 1622466182.017959,
                    "type": "Update (WD)",
                    "WD Routes": "200.0.0.0/24",
                    "Logical Clock": 6
                },
                "7": {
                    "time": 1622466182.018004,
                    "type": "Update (WD)",
                    "WD Routes": "200.0.0.0/24",
                    "Logical Clock": 7
                },
                "12": {
                    "time": 1622466182.069297,
                    "type": "Update (WD)",
                    "WD Routes": "200.0.0.0/24",
                    "Logical Clock": 12
                },
                "13": {
                    "time": 1622466182.069744,
                    "type": "Update (WD)",
                    "WD Routes": "200.0.0.0/24",
                    "Logical Clock": 13
                },
                "14": {
                    "time": 1622466182.069205,
                    "type": "Update (WD)",
                    "WD Routes": "200.0.0.0/24",
                    "Logical Clock": 14
                }
            },
            "tof_1_2_2": {
                "4": {
                    "time": 1622466181.966937,
                    "type": "Update (WD)",
                    "WD Routes": "200.0.0.0/24",
                    "Logical Clock": 4
                },
                "5": {
                    "time": 1622466182.017612,
                    "type": "Update (WD)",
                    "WD Routes": "200.0.0.0/24",
                    "Logical Clock": 5
                },
                "6": {
                    "time": 1622466182.017906,
                    "type": "Update (WD)",
                    "WD Routes": "200.0.0.0/24",
                    "Logical Clock": 6
                },
                "7": {
                    "time": 1622466182.017961,
                    "type": "Update (WD)",
                    "WD Routes": "200.0.0.0/24",
                    "Logical Clock": 7
                },
                "8": {
                    "time": 1622466182.018064,
                    "type": "Update (WD)",
                    "WD Routes": "200.0.0.0/24",
                    "Logical Clock": 8
                },
                "13": {
                    "time": 1622466182.068968,
                    "type": "Update (WD)",
                    "WD Routes": "200.0.0.0/24",
                    "Logical Clock": 13
                },
                "14": {
                    "time": 1622466182.069517,
                    "type": "Update (WD)",
                    "WD Routes": "200.0.0.0/24",
                    "Logical Clock": 14
                },
                "15": {
                    "time": 1622466182.068931,
                    "type": "Update (WD)",
                    "WD Routes": "200.0.0.0/24",
                    "Logical Clock": 15
                }
            },
            "spine_2_1_2": {
                "6": {
                    "time": 1622466182.017988,
                    "type": "Update (WD)",
                    "WD Routes": "200.0.0.0/24",
                    "Logical Clock": 6
                },
                "7": {
                    "time": 1622466182.018335,
                    "type": "Update (WD)",
                    "WD Routes": "200.0.0.0/24",
                    "Logical Clock": 7
                },
                "8": {
                    "time": 1622466182.068571,
                    "type": "Update (WD)",
                    "WD Routes": "200.0.0.0/24",
                    "Logical Clock": 8
                },
                "9": {
                    "time": 1622466182.068732,
                    "type": "Update (WD)",
                    "WD Routes": "200.0.0.0/24",
                    "Logical Clock": 9
                },
                "10": {
                    "time": 1622466182.06885,
                    "type": "Update (WD)",
                    "WD Routes": "200.0.0.0/24",
                    "Logical Clock": 10
                },
                "11": {
                    "time": 1622466182.069077,
                    "type": "Update (WD)",
                    "WD Routes": "200.0.0.0/24",
                    "Logical Clock": 11
                },
                "13": {
                    "time": 1622466182.120684,
                    "type": "Update (WD)",
                    "WD Routes": "200.0.0.0/24",
                    "Logical Clock": 13
                },
                "14": {
                    "time": 1622466182.12049,
                    "type": "Update (WD)",
                    "WD Routes": "200.0.0.0/24",
                    "Logical Clock": 14
                }
            },
            "spine_3_1_2": {
                "7": {
                    "time": 1622466182.018047,
                    "type": "Update (WD)",
                    "WD Routes": "200.0.0.0/24",
                    "Logical Clock": 7
                },
                "8": {
                    "time": 1622466182.018574,
                    "type": "Update (WD)",
                    "WD Routes": "200.0.0.0/24",
                    "Logical Clock": 8
                },
                "9": {
                    "time": 1622466182.068883,
                    "type": "Update (WD)",
                    "WD Routes": "200.0.0.0/24",
                    "Logical Clock": 9
                },
                "10": {
                    "time": 1622466182.06902,
                    "type": "Update (WD)",
                    "WD Routes": "200.0.0.0/24",
                    "Logical Clock": 10
                },
                "11": {
                    "time": 1622466182.069066,
                    "type": "Update (WD)",
                    "WD Routes": "200.0.0.0/24",
                    "Logical Clock": 11
                },
                "12": {
                    "time": 1622466182.069149,
                    "type": "Update (WD)",
                    "WD Routes": "200.0.0.0/24",
                    "Logical Clock": 12
                },
                "14": {
                    "time": 1622466182.120281,
                    "type": "Update (WD)",
                    "WD Routes": "200.0.0.0/24",
                    "Logical Clock": 14
                },
                "15": {
                    "time": 1622466182.120225,
                    "type": "Update (WD)",
                    "WD Routes": "200.0.0.0/24",
                    "Logical Clock": 15
                }
            },
            "spine_4_1_2": {
                "8": {
                    "time": 1622466182.018343,
                    "type": "Update (WD)",
                    "WD Routes": "200.0.0.0/24",
                    "Logical Clock": 8
                },
                "9": {
                    "time": 1622466182.018888,
                    "type": "Update (WD)",
                    "WD Routes": "200.0.0.0/24",
                    "Logical Clock": 9
                },
                "10": {
                    "time": 1622466182.068837,
                    "type": "Update (WD)",
                    "WD Routes": "200.0.0.0/24",
                    "Logical Clock": 10
                },
                "11": {
                    "time": 1622466182.068984,
                    "type": "Update (WD)",
                    "WD Routes": "200.0.0.0/24",
                    "Logical Clock": 11
                },
                "12": {
                    "time": 1622466182.069052,
                    "type": "Update (WD)",
                    "WD Routes": "200.0.0.0/24",
                    "Logical Clock": 12
                },
                "13": {
                    "time": 1622466182.06909,
                    "type": "Update (WD)",
                    "WD Routes": "200.0.0.0/24",
                    "Logical Clock": 13
                },
                "14": {
                    "time": 1622466182.120257,
                    "type": "Update (WD)",
                    "WD Routes": "200.0.0.0/24",
                    "Logical Clock": 14
                },
                "15": {
                    "time": 1622466182.120096,
                    "type": "Update (WD)",
                    "WD Routes": "200.0.0.0/24",
                    "Logical Clock": 15
                }
            },
            "spine_3_1_1": {
                "6": {
                    "time": 1622466182.018121,
                    "type": "Update (WD)",
                    "WD Routes": "200.0.0.0/24",
                    "Logical Clock": 6
                },
                "8": {
                    "time": 1622466182.018391,
                    "type": "Update (WD)",
                    "WD Routes": "200.0.0.0/24",
                    "Logical Clock": 8
                },
                "9": {
                    "time": 1622466182.068773,
                    "type": "Update (WD)",
                    "WD Routes": "200.0.0.0/24",
                    "Logical Clock": 9
                },
                "10": {
                    "time": 1622466182.068885,
                    "type": "Update (WD)",
                    "WD Routes": "200.0.0.0/24",
                    "Logical Clock": 10
                },
                "11": {
                    "time": 1622466182.06892,
                    "type": "Update (WD)",
                    "WD Routes": "200.0.0.0/24",
                    "Logical Clock": 11
                },
                "12": {
                    "time": 1622466182.068948,
                    "type": "Update (WD)",
                    "WD Routes": "200.0.0.0/24",
                    "Logical Clock": 12
                },
                "13": {
                    "time": 1622466182.120097,
                    "type": "Update (WD)",
                    "WD Routes": "200.0.0.0/24",
                    "Logical Clock": 13
                },
                "14": {
                    "time": 1622466182.120076,
                    "type": "Update (WD)",
                    "WD Routes": "200.0.0.0/24",
                    "Logical Clock": 14
                }
            },
            "spine_2_1_1": {
                "7": {
                    "time": 1622466182.018257,
                    "type": "Update (WD)",
                    "WD Routes": "200.0.0.0/24",
                    "Logical Clock": 7
                },
                "8": {
                    "time": 1622466182.018239,
                    "type": "Update (WD)",
                    "WD Routes": "200.0.0.0/24",
                    "Logical Clock": 8
                },
                "9": {
                    "time": 1622466182.069027,
                    "type": "Update (WD)",
                    "WD Routes": "200.0.0.0/24",
                    "Logical Clock": 9
                },
                "10": {
                    "time": 1622466182.069217,
                    "type": "Update (WD)",
                    "WD Routes": "200.0.0.0/24",
                    "Logical Clock": 10
                },
                "11": {
                    "time": 1622466182.069344,
                    "type": "Update (WD)",
                    "WD Routes": "200.0.0.0/24",
                    "Logical Clock": 11
                },
                "12": {
                    "time": 1622466182.069462,
                    "type": "Update (WD)",
                    "WD Routes": "200.0.0.0/24",
                    "Logical Clock": 12
                },
                "13": {
                    "time": 1622466182.120576,
                    "type": "Update (WD)",
                    "WD Routes": "200.0.0.0/24",
                    "Logical Clock": 13
                },
                "14": {
                    "time": 1622466182.120212,
                    "type": "Update (WD)",
                    "WD Routes": "200.0.0.0/24",
                    "Logical Clock": 14
                }
            },
            "spine_4_1_1": {
                "8": {
                    "time": 1622466182.018777,
                    "type": "Update (WD)",
                    "WD Routes": "200.0.0.0/24",
                    "Logical Clock": 8
                },
                "9": {
                    "time": 1622466182.01894,
                    "type": "Update (WD)",
                    "WD Routes": "200.0.0.0/24",
                    "Logical Clock": 9
                },
                "10": {
                    "time": 1622466182.069196,
                    "type": "Update (WD)",
                    "WD Routes": "200.0.0.0/24",
                    "Logical Clock": 10
                },
                "11": {
                    "time": 1622466182.069286,
                    "type": "Update (WD)",
                    "WD Routes": "200.0.0.0/24",
                    "Logical Clock": 11
                },
                "12": {
                    "time": 1622466182.069334,
                    "type": "Update (WD)",
                    "WD Routes": "200.0.0.0/24",
                    "Logical Clock": 12
                },
                "13": {
                    "time": 1622466182.069391,
                    "type": "Update (WD)",
                    "WD Routes": "200.0.0.0/24",
                    "Logical Clock": 13
                },
                "15": {
                    "time": 1622466182.1203,
                    "type": "Update (WD)",
                    "WD Routes": "200.0.0.0/24",
                    "Logical Clock": 15
                },
                "16": {
                    "time": 1622466182.120268,
                    "type": "Update (WD)",
                    "WD Routes": "200.0.0.0/24",
                    "Logical Clock": 16
                }
            },
            "leaf_2_0_1": {
                "9": {
                    "time": 1622466182.070085,
                    "type": "Update (WD)",
                    "WD Routes": "200.0.0.0/24",
                    "Logical Clock": 9
                },
                "10": {
                    "time": 1622466182.0701,
                    "type": "Update (WD)",
                    "WD Routes": "200.0.0.0/24",
                    "Logical Clock": 10
                },
                "11": {
                    "time": 1622466182.120381,
                    "type": "Update (WD)",
                    "WD Routes": "200.0.0.0/24",
                    "Logical Clock": 11
                },
                "12": {
                    "time": 1622466182.12048,
                    "type": "Update (WD)",
                    "WD Routes": "200.0.0.0/24",
                    "Logical Clock": 12
                }
            },
            "leaf_2_0_2": {
                "10": {
                    "time": 1622466182.068852,
                    "type": "Update (WD)",
                    "WD Routes": "200.0.0.0/24",
                    "Logical Clock": 10
                },
                "11": {
                    "time": 1622466182.069376,
                    "type": "Update (WD)",
                    "WD Routes": "200.0.0.0/24",
                    "Logical Clock": 11
                },
                "12": {
                    "time": 1622466182.119881,
                    "type": "Update (WD)",
                    "WD Routes": "200.0.0.0/24",
                    "Logical Clock": 12
                },
                "13": {
                    "time": 1622466182.120093,
                    "type": "Update (WD)",
                    "WD Routes": "200.0.0.0/24",
                    "Logical Clock": 13
                }
            },
            "leaf_3_0_1": {
                "10": {
                    "time": 1622466182.069133,
                    "type": "Update (WD)",
                    "WD Routes": "200.0.0.0/24",
                    "Logical Clock": 10
                },
                "11": {
                    "time": 1622466182.069542,
                    "type": "Update (WD)",
                    "WD Routes": "200.0.0.0/24",
                    "Logical Clock": 11
                },
                "12": {
                    "time": 1622466182.119843,
                    "type": "Update (WD)",
                    "WD Routes": "200.0.0.0/24",
                    "Logical Clock": 12
                },
                "13": {
                    "time": 1622466182.119991,
                    "type": "Update (WD)",
                    "WD Routes": "200.0.0.0/24",
                    "Logical Clock": 13
                }
            },
            "leaf_3_0_2": {
                "11": {
                    "time": 1622466182.069236,
                    "type": "Update (WD)",
                    "WD Routes": "200.0.0.0/24",
                    "Logical Clock": 11
                },
                "12": {
                    "time": 1622466182.069206,
                    "type": "Update (WD)",
                    "WD Routes": "200.0.0.0/24",
                    "Logical Clock": 12
                },
                "13": {
                    "time": 1622466182.119725,
                    "type": "Update (WD)",
                    "WD Routes": "200.0.0.0/24",
                    "Logical Clock": 13
                },
                "14": {
                    "time": 1622466182.119828,
                    "type": "Update (WD)",
                    "WD Routes": "200.0.0.0/24",
                    "Logical Clock": 14
                }
            },
            "leaf_4_0_1": {
                "11": {
                    "time": 1622466182.06859,
                    "type": "Update (WD)",
                    "WD Routes": "200.0.0.0/24",
                    "Logical Clock": 11
                },
                "12": {
                    "time": 1622466182.068753,
                    "type": "Update (WD)",
                    "WD Routes": "200.0.0.0/24",
                    "Logical Clock": 12
                },
                "13": {
                    "time": 1622466182.119166,
                    "type": "Update (WD)",
                    "WD Routes": "200.0.0.0/24",
                    "Logical Clock": 13
                },
                "14": {
                    "time": 1622466182.119221,
                    "type": "Update (WD)",
                    "WD Routes": "200.0.0.0/24",
                    "Logical Clock": 14
                }
            },
            "leaf_4_0_2": {
                "12": {
                    "time": 1622466182.06901,
                    "type": "Update (WD)",
                    "WD Routes": "200.0.0.0/24",
                    "Logical Clock": 12
                },
                "13": {
                    "time": 1622466182.069116,
                    "type": "Update (WD)",
                    "WD Routes": "200.0.0.0/24",
                    "Logical Clock": 13
                },
                "14": {
                    "time": 1622466182.119449,
                    "type": "Update (WD)",
                    "WD Routes": "200.0.0.0/24",
                    "Logical Clock": 14
                },
                "15": {
                    "time": 1622466182.119527,
                    "type": "Update (WD)",
                    "WD Routes": "200.0.0.0/24",
                    "Logical Clock": 15
                }
            }
        },
        "edges": [
            [
                [
                    "spine_1_1_2",
                    1
                ],
                [
                    "leaf_1_0_2",
                    2
                ]
            ],
            [
                [
                    "spine_1_1_2",
                    2
                ],
                [
                    "tof_2_2_1",
                    3
                ]
            ],
            [
                [
                    "spine_1_1_2",
                    3
                ],
                [
                    "tof_2_2_2",
                    4
                ]
            ],
            [
                [
                    "spine_1_1_1",
                    1
                ],
                [
                    "leaf_1_0_2",
                    3
                ]
            ],
            [
                [
                    "spine_1_1_1",
                    2
                ],
                [
                    "tof_1_2_1",
                    3
                ]
            ],
            [
                [
                    "spine_1_1_1",
                    3
                ],
                [
                    "tof_1_2_2",
                    4
                ]
            ],
            [
                [
                    "leaf_1_0_2",
                    4
                ],
                [
                    "spine_1_1_2",
                    5
                ]
            ],
            [
                [
                    "leaf_1_0_2",
                    5
                ],
                [
                    "spine_1_1_1",
                    6
                ]
            ],
            [
                [
                    "tof_2_2_1",
                    4
                ],
                [
                    "spine_1_1_2",
                    6
                ]
            ],
            [
                [
                    "tof_2_2_1",
                    5
                ],
                [
                    "spine_2_1_2",
                    6
                ]
            ],
            [
                [
                    "tof_2_2_1",
                    6
                ],
                [
                    "spine_3_1_2",
                    7
                ]
            ],
            [
                [
                    "tof_2_2_1",
                    7
                ],
                [
                    "spine_4_1_2",
                    8
                ]
            ],
            [
                [
                    "tof_2_2_2",
                    5
                ],
                [
                    "spine_1_1_2",
                    7
                ]
            ],
            [
                [
                    "tof_2_2_2",
                    6
                ],
                [
                    "spine_2_1_2",
                    7
                ]
            ],
            [
                [
                    "tof_2_2_2",
                    7
                ],
                [
                    "spine_3_1_2",
                    8
                ]
            ],
            [
                [
                    "tof_2_2_2",
                    8
                ],
                [
                    "spine_4_1_2",
                    9
                ]
            ],
            [
                [
                    "tof_1_2_1",
                    4
                ],
                [
                    "spine_1_1_1",
                    7
                ]
            ],
            [
                [
                    "tof_1_2_1",
                    5
                ],
                [
                    "spine_3_1_1",
                    6
                ]
            ],
            [
                [
                    "tof_1_2_1",
                    6
                ],
                [
                    "spine_2_1_1",
                    7
                ]
            ],
            [
                [
                    "tof_1_2_1",
                    7
                ],
                [
                    "spine_4_1_1",
                    8
                ]
            ],
            [
                [
                    "tof_1_2_2",
                    5
                ],
                [
                    "spine_1_1_1",
                    8
                ]
            ],
            [
                [
                    "tof_1_2_2",
                    6
                ],
                [
                    "spine_2_1_1",
                    8
                ]
            ],
            [
                [
                    "tof_1_2_2",
                    7
                ],
                [
                    "spine_3_1_1",
                    8
                ]
            ],
            [
                [
                    "tof_1_2_2",
                    8
                ],
                [
                    "spine_4_1_1",
                    9
                ]
            ],
            [
                [
                    "spine_2_1_2",
                    8
                ],
                [
                    "leaf_2_0_1",
                    9
                ]
            ],
            [
                [
                    "spine_2_1_2",
                    9
                ],
                [
                    "leaf_2_0_2",
                    10
                ]
            ],
            [
                [
                    "spine_2_1_2",
                    10
                ],
                [
                    "tof_2_2_1",
                    11
                ]
            ],
            [
                [
                    "spine_2_1_2",
                    11
                ],
                [
                    "tof_2_2_2",
                    12
                ]
            ],
            [
                [
                    "spine_3_1_2",
                    9
                ],
                [
                    "leaf_3_0_1",
                    10
                ]
            ],
            [
                [
                    "spine_3_1_2",
                    10
                ],
                [
                    "leaf_3_0_2",
                    11
                ]
            ],
            [
                [
                    "spine_3_1_2",
                    11
                ],
                [
                    "tof_2_2_1",
                    12
                ]
            ],
            [
                [
                    "spine_3_1_2",
                    12
                ],
                [
                    "tof_2_2_2",
                    13
                ]
            ],
            [
                [
                    "spine_4_1_2",
                    10
                ],
                [
                    "leaf_4_0_1",
                    11
                ]
            ],
            [
                [
                    "spine_4_1_2",
                    11
                ],
                [
                    "leaf_4_0_2",
                    12
                ]
            ],
            [
                [
                    "spine_4_1_2",
                    12
                ],
                [
                    "tof_2_2_1",
                    13
                ]
            ],
            [
                [
                    "spine_4_1_2",
                    13
                ],
                [
                    "tof_2_2_2",
                    14
                ]
            ],
            [
                [
                    "spine_3_1_1",
                    9
                ],
                [
                    "leaf_3_0_1",
                    11
                ]
            ],
            [
                [
                    "spine_3_1_1",
                    10
                ],
                [
                    "leaf_3_0_2",
                    12
                ]
            ],
            [
                [
                    "spine_3_1_1",
                    11
                ],
                [
                    "tof_1_2_1",
                    12
                ]
            ],
            [
                [
                    "spine_3_1_1",
                    12
                ],
                [
                    "tof_1_2_2",
                    13
                ]
            ],
            [
                [
                    "spine_2_1_1",
                    9
                ],
                [
                    "leaf_2_0_1",
                    10
                ]
            ],
            [
                [
                    "spine_2_1_1",
                    10
                ],
                [
                    "leaf_2_0_2",
                    11
                ]
            ],
            [
                [
                    "spine_2_1_1",
                    11
                ],
                [
                    "tof_1_2_1",
                    13
                ]
            ],
            [
                [
                    "spine_2_1_1",
                    12
                ],
                [
                    "tof_1_2_2",
                    14
                ]
            ],
            [
                [
                    "spine_4_1_1",
                    10
                ],
                [
                    "leaf_4_0_1",
                    12
                ]
            ],
            [
                [
                    "spine_4_1_1",
                    11
                ],
                [
                    "leaf_4_0_2",
                    13
                ]
            ],
            [
                [
                    "spine_4_1_1",
                    12
                ],
                [
                    "tof_1_2_1",
                    14
                ]
            ],
            [
                [
                    "spine_4_1_1",
                    13
                ],
                [
                    "tof_1_2_2",
                    15
                ]
            ],
            [
                [
                    "leaf_2_0_1",
                    11
                ],
                [
                    "spine_2_1_1",
                    13
                ]
            ],
            [
                [
                    "leaf_2_0_1",
                    12
                ],
                [
                    "spine_2_1_2",
                    13
                ]
            ],
            [
                [
                    "leaf_2_0_2",
                    12
                ],
                [
                    "spine_2_1_1",
                    14
                ]
            ],
            [
                [
                    "leaf_2_0_2",
                    13
                ],
                [
                    "spine_2_1_2",
                    14
                ]
            ],
            [
                [
                    "leaf_3_0_1",
                    12
                ],
                [
                    "spine_3_1_1",
                    13
                ]
            ],
            [
                [
                    "leaf_3_0_1",
                    13
                ],
                [
                    "spine_3_1_2",
                    14
                ]
            ],
            [
                [
                    "leaf_3_0_2",
                    13
                ],
                [
                    "spine_3_1_1",
                    14
                ]
            ],
            [
                [
                    "leaf_3_0_2",
                    14
                ],
                [
                    "spine_3_1_2",
                    15
                ]
            ],
            [
                [
                    "leaf_4_0_1",
                    13
                ],
                [
                    "spine_4_1_2",
                    14
                ]
            ],
            [
                [
                    "leaf_4_0_1",
                    14
                ],
                [
                    "spine_4_1_1",
                    15
                ]
            ],
            [
                [
                    "leaf_4_0_2",
                    14
                ],
                [
                    "spine_4_1_2",
                    15
                ]
            ],
            [
                [
                    "leaf_4_0_2",
                    15
                ],
                [
                    "spine_4_1_1",
                    16
                ]
            ]
        ]
    },
    "max_scalar_clock": 16
}