{
    "description": "Scenario 4a: Leaf leaf_1_0_1 failure and recovery with BGP",
    "k_leaf": 12,
    "k_top": 12,
    "redundancy_factor": 12,
    "is_k8s": true,
    "machine_mac_addresses": {
        "leaf_1_0_1": {
            "net0": "1e:7f:4e:09:db:1d",
            "net1": "f6:7f:6d:c2:75:6b",
            "net10": "3e:d2:ed:58:e8:c2",
            "net11": "22:15:55:f9:d6:28",
            "net12": "4e:d5:6b:7c:c8:58",
            "net2": "f6:d3:56:23:aa:43",
            "net3": "5e:04:b1:e8:be:9a",
            "net4": "16:b8:7f:4e:bd:7c",
            "net5": "5a:3a:4f:af:45:e2",
            "net6": "d2:9a:fa:fa:ea:cb",
            "net7": "e2:d0:95:49:fb:3e",
            "net8": "8a:9d:06:92:89:9d",
            "net9": "3a:8b:a8:40:7d:d9"
        },
        "leaf_1_0_10": {
            "net0": "b6:1e:31:5a:06:3b",
            "net1": "f2:15:bb:6f:d2:94",
            "net10": "0e:ee:3e:b4:c5:0b",
            "net11": "0a:b8:44:6c:8f:61",
            "net12": "f6:e0:52:7d:ca:2c",
            "net2": "16:47:2f:40:0d:de",
            "net3": "2e:c7:ad:64:5f:d0",
            "net4": "aa:35:f3:c5:b1:56",
            "net5": "52:c9:b2:ae:fb:6e",
            "net6": "6a:a1:06:d5:50:9e",
            "net7": "7a:62:50:bc:b7:77",
            "net8": "0a:6d:93:1f:ca:40",
            "net9": "b2:52:0b:d6:d1:a2"
        },
        "leaf_1_0_11": {
            "net0": "4a:4c:30:4d:f3:2b",
            "net1": "7e:13:26:ad:c8:51",
            "net10": "16:0e:2e:61:b1:95",
            "net11": "7e:c4:2e:39:d3:f2",
            "net12": "8e:9d:23:e9:49:2d",
            "net2": "5e:4c:e8:7b:b6:e0",
            "net3": "2e:67:1e:4d:bb:0a",
            "net4": "1e:b2:d3:b3:ec:ea",
            "net5": "c6:be:fe:16:52:d5",
            "net6": "4a:92:95:08:02:04",
            "net7": "6a:e3:68:06:32:62",
            "net8": "26:e3:d2:5f:34:d0",
            "net9": "8e:51:9f:82:e8:9b"
        },
        "leaf_1_0_12": {
            "net0": "0a:25:95:e8:cb:e1",
            "net1": "ae:94:11:e2:a3:3e",
            "net10": "de:31:5c:8c:10:22",
            "net11": "82:39:51:8d:d0:c8",
            "net12": "8e:f0:1e:b3:7f:1e",
            "net2": "0a:73:95:85:6e:bb",
            "net3": "3e:6d:e9:5a:7e:03",
            "net4": "56:f4:a4:2c:e1:3f",
            "net5": "82:85:78:92:2b:6c",
            "net6": "1e:c0:aa:13:d5:f0",
            "net7": "26:91:21:ff:00:1e",
            "net8": "0a:5f:ba:e6:c6:65",
            "net9": "4a:05:fe:c2:ba:03"
        },
        "leaf_1_0_2": {
            "net0": "ea:b9:76:da:26:57",
            "net1": "ae:93:3d:2f:f2:dd",
            "net10": "16:5f:d8:0c:a6:b1",
            "net11": "da:6b:d7:ad:1d:72",
            "net12": "86:90:13:17:77:cd",
            "net2": "56:01:68:e1:68:ba",
            "net3": "06:37:2b:77:17:c8",
            "net4": "5a:c3:cd:15:72:f5",
            "net5": "1e:b8:67:45:94:51",
            "net6": "a6:70:2d:a9:be:21",
            "net7": "1e:ab:e1:49:cb:19",
            "net8": "ee:48:52:d3:64:e2",
            "net9": "ce:92:5a:63:64:06"
        },
        "leaf_1_0_3": {
            "net0": "36:06:9d:a6:e4:37",
            "net1": "6a:0b:59:6a:8f:00",
            "net10": "16:11:2d:b5:3d:5b",
            "net11": "ce:bd:a8:96:80:1e",
            "net12": "f6:b1:9d:45:1e:45",
            "net2": "fa:a5:7a:49:f2:43",
            "net3": "3e:5e:ad:eb:7e:a6",
            "net4": "46:59:de:39:dc:c0",
            "net5": "ba:71:8b:b4:e3:8b",
            "net6": "1e:fc:39:ff:3d:ca",
            "net7": "be:0f:eb:97:aa:5c",
            "net8": "5e:40:cb:0d:88:30",
            "net9": "e6:ea:af:59:4e:fb"
        },
        "leaf_1_0_4": {
            "net0": "5e:e1:62:fe:68:43",
            "net1": "16:88:b5:a1:2b:c7",
            "net10": "fe:78:c8:69:f7:3c",
            "net11": "ce:6b:e4:27:0a:46",
            "net12": "86:3d:7e:98:a7:5f",
            "net2": "e2:23:ef:f5:25:01",
            "net3": "82:c8:63:6f:03:34",
            "net4": "b2:d0:3b:ef:c9:f6",
            "net5": "8e:df:20:28:41:d7",
            "net6": "6a:80:4f:f3:1e:d7",
            "net7": "0e:05:c7:37:11:a3",
            "net8": "7a:fa:56:4e:5f:be",
            "net9": "e2:95:b6:71:57:37"
        },
        "leaf_1_0_5": {
            "net0": "0a:8c:6f:77:00:3a",
            "net1": "62:af:5c:79:7b:71",
            "net10": "7a:97:97:01:fa:83",
            "net11": "1e:b1:30:ce:82:69",
            "net12": "1a:45:c8:49:a4:b1",
            "net2": "fa:6b:03:33:ae:d6",
            "net3": "9a:e8:46:ae:7f:4c",
            "net4": "5a:87:9b:67:aa:1d",
            "net5": "c2:f3:d1:a4:cb:6c",
            "net6": "16:4a:f8:ba:27:18",
            "net7": "f2:99:f1:b2:3b:5a",
            "net8": "62:84:5f:43:f1:da",
            "net9": "96:2e:68:ee:e9:a5"
        },
        "leaf_1_0_6": {
            "net0": "8e:e7:92:96:b7:ad",
            "net1": "5e:86:2c:92:f8:8d",
            "net10": "7a:dc:1f:a2:f2:ab",
            "net11": "66:09:36:19:86:36",
            "net12": "f2:dc:5c:9d:ce:9c",
            "net2": "ca:49:c8:a7:0c:72",
            "net3": "86:0c:07:aa:83:20",
            "net4": "2a:d5:78:15:19:f3",
            "net5": "36:12:39:e2:7f:b5",
            "net6": "66:92:b3:25:16:cf",
            "net7": "32:7b:1f:a5:e7:4f",
            "net8": "02:1b:8d:06:a4:c2",
            "net9": "5e:c3:b0:93:bd:91"
        },
        "leaf_1_0_7": {
            "net0": "ca:6d:32:48:91:ff",
            "net1": "36:60:4c:3b:4d:57",
            "net10": "72:98:a2:75:63:9a",
            "net11": "3a:65:f2:77:a2:a6",
            "net12": "aa:ee:85:7c:a0:99",
            "net2": "ce:35:8b:28:a6:3c",
            "net3": "9a:62:08:52:a5:dc",
            "net4": "22:49:bb:45:4d:09",
            "net5": "8a:89:63:4a:70:90",
            "net6": "42:af:7e:7d:73:04",
            "net7": "de:22:4a:61:b7:1f",
            "net8": "e2:d7:6b:dd:93:27",
            "net9": "de:3e:9a:c1:4f:09"
        },
        "leaf_1_0_8": {
            "net0": "f6:dc:9f:ef:b4:f8",
            "net1": "66:b7:a6:bb:f2:70",
            "net10": "7a:78:a2:4a:fe:17",
            "net11": "fe:ce:18:bc:d9:ea",
            "net12": "0e:9c:95:9d:58:fb",
            "net2": "82:9b:2d:f3:e9:68",
            "net3": "62:26:7e:53:20:89",
            "net4": "5a:f9:46:dc:c7:2d",
            "net5": "8a:2c:e7:f5:eb:11",
            "net6": "ae:89:22:55:e1:31",
            "net7": "9e:63:18:2e:b5:20",
            "net8": "52:67:a4:16:b7:c6",
            "net9": "16:f1:97:9a:ea:1d"
        },
        "leaf_1_0_9": {
            "net0": "16:c0:b8:50:38:da",
            "net1": "d6:87:c0:a5:e4:89",
            "net10": "2e:70:16:39:39:c2",
            "net11": "62:c2:53:78:10:cd",
            "net12": "0a:42:c7:ca:12:14",
            "net2": "4a:ba:a9:30:ea:d8",
            "net3": "4e:1e:fe:53:07:6c",
            "net4": "4e:71:bb:ee:69:2b",
            "net5": "8e:b1:70:cb:87:4e",
            "net6": "4e:6c:82:8c:41:6c",
            "net7": "d2:c1:67:9b:a6:b0",
            "net8": "f2:86:ae:3c:e6:27",
            "net9": "42:1c:65:09:a2:3c"
        },
        "leaf_2_0_1": {
            "net0": "f6:f7:21:c1:d2:a0",
            "net1": "92:18:1a:37:06:da",
            "net10": "66:54:1b:11:52:4d",
            "net11": "0a:dd:4e:19:77:86",
            "net12": "36:d7:8f:86:60:db",
            "net2": "6e:82:fc:17:f9:d4",
            "net3": "1a:cb:54:0f:99:03",
            "net4": "72:99:2b:2d:01:f4",
            "net5": "96:72:15:7a:bc:e8",
            "net6": "32:c6:24:41:03:3a",
            "net7": "6e:ca:63:98:4b:d7",
            "net8": "f2:1e:10:56:4b:bd",
            "net9": "e6:b3:f3:20:ae:13"
        },
        "leaf_2_0_10": {
            "net0": "1e:3c:98:14:5e:72",
            "net1": "ee:70:84:b4:eb:58",
            "net10": "22:37:54:8f:3e:1f",
            "net11": "9a:6f:cc:98:9d:1e",
            "net12": "2a:ed:39:69:8e:33",
            "net2": "6a:4a:8a:2d:1e:2f",
            "net3": "72:12:06:5e:3e:43",
            "net4": "9e:c0:85:5e:f2:94",
            "net5": "0a:5b:e9:fb:6f:6b",
            "net6": "aa:4b:1a:be:39:a5",
            "net7": "92:3e:53:7f:10:4d",
            "net8": "46:9c:d4:83:c0:02",
            "net9": "3a:73:ca:3e:75:f8"
        },
        "leaf_2_0_11": {
            "net0": "c2:04:df:43:d2:79",
            "net1": "de:07:9b:f2:d1:46",
            "net10": "ce:86:b3:f5:82:1a",
            "net11": "32:7b:0d:18:32:f7",
            "net12": "a2:10:c2:ee:f5:53",
            "net2": "86:de:9d:79:1f:32",
            "net3": "9a:08:8d:37:f3:3a",
            "net4": "6e:38:aa:fd:93:d0",
            "net5": "72:ac:57:01:8b:f7",
            "net6": "ae:34:a6:82:d3:78",
            "net7": "72:a2:f5:cf:b8:d1",
            "net8": "12:aa:d6:ec:26:ce",
            "net9": "32:e7:6e:7a:33:35"
        },
        "leaf_2_0_12": {
            "net0": "c2:3e:b4:b9:5b:1a",
            "net1": "66:4a:c5:37:75:9c",
            "net10": "0e:0f:df:f3:1f:22",
            "net11": "82:65:d8:93:06:52",
            "net12": "9a:3a:cd:b0:8f:f5",
            "net2": "3e:62:18:eb:53:07",
            "net3": "66:e2:15:ca:98:94",
            "net4": "a6:74:fc:b3:f9:f5",
            "net5": "ce:05:b5:52:cd:f0",
            "net6": "62:24:74:3a:52:07",
            "net7": "a6:17:ef:b6:74:3c",
            "net8": "16:b5:98:ce:b8:6e",
            "net9": "92:ea:14:df:b1:c9"
        },
        "leaf_2_0_2": {
            "net0": "92:36:c3:39:41:e3",
            "net1": "aa:00:37:39:15:11",
            "net10": "2a:6d:56:c4:f1:17",
            "net11": "12:fd:bb:4b:bf:1b",
            "net12": "ea:51:a1:ea:5b:c5",
            "net2": "2e:19:9e:5f:3f:0a",
            "net3": "46:58:b8:2d:fb:cf",
            "net4": "2a:d5:69:00:b1:8a",
            "net5": "b6:ab:a5:66:24:ef",
            "net6": "b6:ad:0a:ad:f5:89",
            "net7": "8e:b4:8f:ec:c0:e9",
            "net8": "ee:2a:fc:89:34:45",
            "net9": "e6:c1:5b:c2:af:b3"
        },
        "leaf_2_0_3": {
            "net0": "86:b7:c0:f3:66:b2",
            "net1": "d6:47:d9:5c:52:f4",
            "net10": "62:87:7b:9d:23:a1",
            "net11": "72:2e:ab:fd:d5:4f",
            "net12": "7a:03:70:6b:51:f1",
            "net2": "9a:7d:54:ea:b4:37",
            "net3": "32:8e:c7:70:0a:41",
            "net4": "42:39:b9:67:7f:39",
            "net5": "7a:fe:21:39:f5:00",
            "net6": "46:8a:35:3e:c1:15",
            "net7": "0e:9b:6e:ed:9f:25",
            "net8": "be:98:f8:3c:3c:aa",
            "net9": "2a:5a:f9:2a:1c:f1"
        },
        "leaf_2_0_4": {
            "net0": "ae:e7:fa:a2:20:24",
            "net1": "7e:55:5e:ad:84:de",
            "net10": "a2:5a:0c:f2:54:07",
            "net11": "2a:d2:ea:09:c1:92",
            "net12": "82:0d:bc:0e:d1:5b",
            "net2": "22:d0:53:40:2c:70",
            "net3": "ee:b7:c3:a8:bb:0b",
            "net4": "ae:43:6d:f8:80:2c",
            "net5": "72:59:11:a6:6c:e6",
            "net6": "4e:4f:46:f3:27:a7",
            "net7": "2a:9f:4b:76:ae:ec",
            "net8": "4e:7a:b5:4d:11:62",
            "net9": "aa:be:d1:42:23:05"
        },
        "leaf_2_0_5": {
            "net0": "8a:7d:fb:39:d0:04",
            "net1": "a2:89:0e:29:53:7d",
            "net10": "fe:a4:a3:c3:b7:58",
            "net11": "26:ed:6c:de:5a:81",
            "net12": "c6:c9:f5:d4:0d:d5",
            "net2": "ea:12:c4:b9:43:d9",
            "net3": "0e:80:3b:fc:5a:05",
            "net4": "9e:2a:a4:a6:17:47",
            "net5": "66:d8:18:5c:4d:1f",
            "net6": "6e:c7:d1:2d:5f:33",
            "net7": "a6:c3:58:d1:4e:84",
            "net8": "5e:27:93:4d:c6:99",
            "net9": "ba:6f:b3:2c:46:60"
        },
        "leaf_2_0_6": {
            "net0": "32:cd:2e:25:d8:39",
            "net1": "16:4d:24:64:ee:56",
            "net10": "ce:d8:07:c8:2a:e4",
            "net11": "16:9e:fa:17:21:c8",
            "net12": "f2:0a:0a:ff:27:c3",
            "net2": "6a:f4:01:26:78:28",
            "net3": "da:36:66:01:af:03",
            "net4": "0a:60:7c:0b:e9:d2",
            "net5": "b2:a7:71:83:fe:df",
            "net6": "46:dc:47:b2:47:6d",
            "net7": "ea:30:9b:a6:ca:b7",
            "net8": "b6:7b:9f:e5:61:f5",
            "net9": "72:03:4e:70:60:f9"
        },
        "leaf_2_0_7": {
            "net0": "1a:d5:5b:f0:cb:20",
            "net1": "0e:ed:cd:93:11:b6",
            "net10": "6e:5a:cc:11:78:c3",
            "net11": "6a:b9:90:46:f7:fe",
            "net12": "16:f5:f4:5e:f3:ec",
            "net2": "ba:9a:4b:32:35:83",
            "net3": "ee:4e:b1:47:b9:ce",
            "net4": "be:ad:75:f3:12:d1",
            "net5": "52:19:cb:80:a0:e2",
            "net6": "6a:03:89:bb:28:8e",
            "net7": "3a:a2:94:f4:b4:8c",
            "net8": "e6:0c:30:c3:09:c6",
            "net9": "aa:44:68:73:3a:fa"
        },
        "leaf_2_0_8": {
            "net0": "0e:58:2b:32:96:66",
            "net1": "f2:b9:68:94:b7:f8",
            "net10": "4a:c5:68:a6:b3:e8",
            "net11": "5e:f7:52:12:43:70",
            "net12": "7a:c1:ad:09:cb:11",
            "net2": "1e:6b:b3:47:e0:d9",
            "net3": "1e:0c:7f:eb:2c:02",
            "net4": "0a:04:8b:5d:d8:0b",
            "net5": "b2:40:6f:9c:0d:e4",
            "net6": "1a:f5:10:49:22:e1",
            "net7": "2e:ae:4f:0b:1f:d3",
            "net8": "b6:f1:1f:33:03:29",
            "net9": "ea:2b:0d:69:ea:1a"
        },
        "leaf_2_0_9": {
            "net0": "f2:c9:a3:9e:53:5b",
            "net1": "32:5b:94:9e:1c:ef",
            "net10": "d6:26:9e:12:5a:2d",
            "net11": "7e:b5:8e:62:8f:28",
            "net12": "a6:a0:e6:05:51:e7",
            "net2": "46:4d:19:de:02:dc",
            "net3": "3a:34:2d:2d:3c:76",
            "net4": "22:97:26:c1:62:81",
            "net5": "06:98:16:4e:42:18",
            "net6": "66:c0:dd:aa:8c:78",
            "net7": "52:89:35:3c:c9:de",
            "net8": "82:5a:c7:a8:a6:97",
            "net9": "a6:b4:74:9e:70:1a"
        },
        "spine_1_1_1": {
            "net0": "1a:02:e5:e7:77:13",
            "net1": "86:63:0a:03:e2:5c",
            "net10": "5e:34:58:50:07:69",
            "net11": "06:37:bc:2c:15:26",
            "net12": "e6:4b:a2:b6:25:54",
            "net13": "7a:1b:14:48:c6:1e",
            "net14": "9a:d8:7f:59:b2:68",
            "net15": "36:81:aa:50:a6:73",
            "net16": "0e:39:29:80:f0:39",
            "net17": "3e:47:ea:56:d8:a0",
            "net18": "aa:a8:e2:d6:82:36",
            "net19": "be:4c:7e:87:95:98",
            "net2": "b2:e5:4d:ec:12:62",
            "net20": "62:b2:f8:88:5a:9e",
            "net21": "d6:32:b4:e4:e2:f7",
            "net22": "3e:20:57:ea:7f:3c",
            "net23": "f2:b2:fc:1f:6d:b6",
            "net3": "22:c4:dc:1c:68:77",
            "net4": "d6:4c:27:80:25:5e",
            "net5": "02:9f:be:36:5b:71",
            "net6": "7a:94:d4:3b:b3:48",
            "net7": "d6:76:0d:68:5c:c8",
            "net8": "06:18:d0:10:21:ff",
            "net9": "4e:e4:ed:fb:6f:f3"
        },
        "spine_1_1_10": {
            "net0": "76:7a:23:7d:b7:45",
            "net1": "5e:4f:03:fa:a4:d8",
            "net10": "46:22:f9:05:77:a3",
            "net11": "56:7f:e9:83:db:75",
            "net12": "42:4b:6f:a1:8e:54",
            "net13": "aa:2e:96:40:db:97",
            "net14": "2a:99:ec:8f:23:84",
            "net15": "06:6f:b7:55:88:09",
            "net16": "36:2f:6b:41:10:db",
            "net17": "92:3e:86:9f:a6:f3",
            "net18": "86:5f:68:1d:e2:9c",
            "net19": "fa:1c:15:1d:83:73",
            "net2": "32:36:1a:49:db:48",
            "net20": "52:4b:39:55:a6:5d",
            "net21": "d6:b4:f3:74:1e:c5",
            "net22": "82:c2:cb:37:cb:6c",
            "net23": "e6:8e:6c:18:98:d4",
            "net3": "da:68:a3:5c:9b:62",
            "net4": "ca:6a:3d:b1:3f:7e",
            "net5": "76:b3:4a:68:f4:91",
            "net6": "7e:69:8d:81:c6:6e",
            "net7": "32:77:86:6b:85:25",
            "net8": "36:9d:73:5a:75:eb",
            "net9": "e6:56:e7:11:00:cb"
        },
        "spine_1_1_11": {
            "net0": "4a:20:fa:5d:a3:e0",
            "net1": "12:4c:fb:b5:8f:f4",
            "net10": "96:a9:1f:07:fb:04",
            "net11": "b2:77:c0:96:d4:fd",
            "net12": "32:3e:4e:1e:dd:53",
            "net13": "a6:13:9d:ac:0b:83",
            "net14": "fe:00:c4:58:89:29",
            "net15": "d2:82:95:8e:43:b3",
            "net16": "46:3f:4a:f0:9d:e7",
            "net17": "8a:c5:42:c3:78:78",
            "net18": "b2:15:db:c3:95:82",
            "net19": "0a:6b:d0:f9:47:37",
            "net2": "e2:34:c7:67:59:ac",
            "net20": "8a:fb:5f:19:e2:2e",
            "net21": "36:6c:d7:ff:24:c4",
            "net22": "52:18:33:d8:e3:2b",
            "net23": "76:04:3d:0b:8e:5e",
            "net3": "2e:da:0b:3c:71:b6",
            "net4": "f2:51:f3:60:e1:c8",
            "net5": "e6:22:b0:ab:b8:68",
            "net6": "7e:27:1e:79:19:9c",
            "net7": "f2:7c:c1:0a:07:5e",
            "net8": "2a:54:ac:9d:20:ca",
            "net9": "e6:d6:88:69:76:79"
        },
        "spine_1_1_12": {
            "net0": "0a:a4:89:bb:48:75",
            "net1": "c6:3c:31:ce:e1:af",
            "net10": "96:00:7b:cc:bb:3d",
            "net11": "62:0b:50:b6:65:1d",
            "net12": "82:9c:8f:2d:c6:4f",
            "net13": "b2:82:7e:3f:60:d1",
            "net14": "c2:c9:5b:9b:5c:f6",
            "net15": "7e:33:69:2f:41:3d",
            "net16": "2a:f4:03:e2:69:ad",
            "net17": "4a:d4:26:f1:8b:1c",
            "net18": "86:33:d7:02:59:bd",
            "net19": "72:0c:1a:99:3e:b5",
            "net2": "be:33:47:ce:50:77",
            "net20": "8e:0d:78:ac:89:24",
            "net21": "26:55:d5:8b:57:50",
            "net22": "ca:86:24:bf:82:24",
            "net23": "56:05:b7:cb:a3:e3",
            "net3": "ce:17:cb:47:92:12",
            "net4": "d2:91:6d:e1:9e:80",
            "net5": "e6:e5:9b:73:6d:28",
            "net6": "de:5d:9f:ae:43:42",
            "net7": "6a:d8:65:13:01:86",
            "net8": "7e:26:29:80:fb:89",
            "net9": "62:20:db:1a:13:91"
        },
        "spine_1_1_2": {
            "net0": "8a:ea:f2:a0:db:74",
            "net1": "46:46:f3:4b:1a:3a",
            "net10": "42:b6:fd:af:7e:e7",
            "net11": "76:38:7f:6a:80:9f",
            "net12": "2a:5b:8f:bf:52:d9",
            "net13": "56:d8:2a:f6:99:07",
            "net14": "56:85:a8:22:f5:d1",
            "net15": "6e:b2:62:d8:37:d1",
            "net16": "06:ff:45:49:a6:7c",
            "net17": "f2:eb:54:8c:90:73",
            "net18": "92:0c:92:6c:20:b1",
            "net19": "9e:44:3e:a1:6f:fe",
            "net2": "7e:01:1e:6e:f5:3c",
            "net20": "1a:a5:3d:26:61:de",
            "net21": "be:f9:f5:1a:47:97",
            "net22": "42:90:14:97:86:c6",
            "net23": "7e:c7:94:e7:6f:e1",
            "net3": "62:a2:94:f9:a4:b6",
            "net4": "9e:fb:b6:f9:d2:66",
            "net5": "ba:9b:2b:d9:69:20",
            "net6": "56:e7:88:d1:4b:e5",
            "net7": "3e:51:ae:5c:ac:94",
            "net8": "0e:2b:55:86:29:f2",
            "net9": "d6:ab:3d:70:60:3a"
        },
        "spine_1_1_3": {
            "net0": "06:ba:a6:29:0f:8d",
            "net1": "12:79:ea:20:01:57",
            "net10": "2e:56:b8:ad:53:9c",
            "net11": "f6:32:19:0b:bb:46",
            "net12": "96:22:cd:83:82:f6",
            "net13": "fe:c1:4f:33:fc:d6",
            "net14": "7a:eb:99:6a:d7:d4",
            "net15": "16:60:e8:7d:72:89",
            "net16": "8a:99:5c:4f:52:5b",
            "net17": "3e:95:3e:ce:3d:a8",
            "net18": "f6:6a:15:5c:01:c3",
            "net19": "ba:75:14:4a:6a:79",
            "net2": "aa:77:94:ab:27:c4",
            "net20": "2e:ae:f3:a2:f9:ab",
            "net21": "aa:02:82:83:d1:41",
            "net22": "c2:78:89:88:97:41",
            "net23": "2a:43:04:33:26:47",
            "net3": "fa:0e:35:32:de:79",
            "net4": "26:32:88:53:4e:8f",
            "net5": "7a:29:a9:e3:eb:1f",
            "net6": "2a:41:86:3e:c7:00",
            "net7": "16:4b:f4:19:47:d9",
            "net8": "f6:6b:07:ec:f1:07",
            "net9": "8a:93:52:02:56:e5"
        },
        "spine_1_1_4": {
            "net0": "be:be:05:59:ed:ea",
            "net1": "a6:64:ea:89:56:c9",
            "net10": "2a:27:fb:0d:2e:4a",
            "net11": "96:83:d7:fb:77:f1",
            "net12": "f2:76:fe:33:47:0c",
            "net13": "7e:fe:97:8f:da:f9",
            "net14": "ce:a8:c3:ed:7d:06",
            "net15": "ae:66:00:d8:ed:5d",
            "net16": "8e:60:ea:c4:16:1f",
            "net17": "92:04:61:5f:69:72",
            "net18": "b6:19:34:47:77:7d",
            "net19": "0a:29:80:aa:01:b0",
            "net2": "d2:31:e1:df:9f:6f",
            "net20": "b6:43:a3:b8:5b:1a",
            "net21": "2a:ea:7d:15:57:0f",
            "net22": "26:4f:30:2b:68:d4",
            "net23": "c6:8a:7f:35:8c:b2",
            "net3": "06:b9:13:c9:9b:53",
            "net4": "9a:d8:aa:fd:db:c9",
            "net5": "aa:08:a4:5c:b9:fe",
            "net6": "0e:83:ef:35:b0:23",
            "net7": "46:d2:3e:49:d2:99",
            "net8": "7e:eb:cf:0e:e6:a1",
            "net9": "e6:00:bb:93:b1:8e"
        },
        "spine_1_1_5": {
            "net0": "16:b2:f6:68:72:94",
            "net1": "f2:e8:1a:db:fe:51",
            "net10": "8a:27:fb:7d:c6:1d",
            "net11": "92:64:f4:3f:ae:77",
            "net12": "3e:9e:86:61:a4:78",
            "net13": "72:6b:31:98:92:4d",
            "net14": "8e:9e:f3:9b:3a:a4",
            "net15": "62:1c:a0:b0:a3:ca",
            "net16": "e6:0b:c7:08:44:e2",
            "net17": "de:04:06:e7:46:2a",
            "net18": "0e:2b:40:1a:6c:7e",
            "net19": "46:c4:bd:5c:3d:1a",
            "net2": "fa:aa:0b:2c:0d:cd",
            "net20": "aa:c3:5d:0d:d4:77",
            "net21": "3e:57:14:a6:52:6b",
            "net22": "f6:d0:7a:08:54:9b",
            "net23": "ee:e8:e9:57:c6:66",
            "net3": "32:2e:75:21:28:5e",
            "net4": "7a:47:b7:de:52:e5",
            "net5": "06:93:c4:3c:f4:26",
            "net6": "9a:e4:b7:f8:64:da",
            "net7": "b6:7d:00:20:92:d7",
            "net8": "56:a2:eb:44:47:33",
            "net9": "12:91:74:73:cb:74"
        },
        "spine_1_1_6": {
            "net0": "9e:93:39:4c:a1:5e",
            "net1": "42:e7:9f:7d:cd:e9",
            "net10": "86:d0:23:97:ac:c0",
            "net11": "96:90:a6:40:92:49",
            "net12": "02:15:df:13:fe:61",
            "net13": "92:08:30:44:46:cc",
            "net14": "66:84:73:ba:93:22",
            "net15": "4a:5e:84:d8:cf:19",
            "net16": "be:50:03:ec:84:c8",
            "net17": "32:09:7d:e3:6f:36",
            "net18": "c6:be:58:9b:2f:b8",
            "net19": "92:ab:81:e4:5a:3b",
            "net2": "e2:e5:be:df:2c:ac",
            "net20": "d2:b5:45:bb:75:e2",
            "net21": "0e:c8:a3:10:c4:41",
            "net22": "de:d1:14:d6:8d:01",
            "net23": "0a:e8:07:11:f6:37",
            "net3": "42:bc:d1:fb:31:fd",
            "net4": "3e:7a:cc:69:13:c5",
            "net5": "ae:05:d8:c3:ef:83",
            "net6": "da:5a:54:d1:c9:10",
            "net7": "d6:4a:00:73:bb:28",
            "net8": "32:94:11:d2:91:4b",
            "net9": "8e:d0:7f:42:bd:08"
        },
        "spine_1_1_7": {
            "net0": "f6:c2:61:4c:4e:6a",
            "net1": "86:b9:c7:43:06:9b",
            "net10": "ea:47:e0:26:ba:f7",
            "net11": "d6:8a:71:7f:74:ee",
            "net12": "7e:ea:4d:b7:7f:81",
            "net13": "fa:68:90:87:4f:80",
            "net14": "72:74:d8:5b:f7:37",
            "net15": "62:90:9c:7c:43:d0",
            "net16": "82:7a:3a:40:91:0e",
            "net17": "02:51:cb:b1:b7:2d",
            "net18": "16:78:ef:1e:0f:62",
            "net19": "f2:d3:18:b0:e7:37",
            "net2": "ba:f6:ed:71:f2:44",
            "net20": "96:69:82:72:44:9a",
            "net21": "7e:42:0d:5f:ad:24",
            "net22": "9e:8a:41:54:57:61",
            "net23": "66:c4:02:23:4b:6c",
            "net3": "3a:06:1c:e1:38:87",
            "net4": "be:b1:b7:3a:cd:ee",
            "net5": "f6:ef:98:d8:e3:87",
            "net6": "52:65:34:5e:9c:5a",
            "net7": "06:de:8a:fa:73:33",
            "net8": "76:de:27:2d:db:29",
            "net9": "96:4c:a4:ef:40:48"
        },
        "spine_1_1_8": {
            "net0": "aa:b9:ff:7f:b6:a3",
            "net1": "22:66:03:c1:63:5b",
            "net10": "d6:72:7d:fd:3c:5b",
            "net11": "56:dc:6d:7f:dd:d2",
            "net12": "c2:b8:0f:2f:06:dc",
            "net13": "22:57:60:3a:ba:0e",
            "net14": "26:64:b4:05:e4:7f",
            "net15": "76:93:2b:5c:8d:3e",
            "net16": "be:20:7b:c4:ce:2e",
            "net17": "32:4f:61:f2:3c:1c",
            "net18": "62:5f:fe:04:3e:e6",
            "net19": "36:ce:4f:31:11:a7",
            "net2": "8a:35:35:fa:40:75",
            "net20": "56:39:15:19:84:2b",
            "net21": "7e:5e:09:bd:bf:f3",
            "net22": "5a:bf:e0:94:ae:48",
            "net23": "12:d2:97:35:21:ea",
            "net3": "d6:39:1b:0a:79:76",
            "net4": "36:c2:14:6e:d5:3e",
            "net5": "d6:29:74:a7:9e:21",
            "net6": "86:5f:f7:dc:59:a5",
            "net7": "d6:79:5d:da:df:c7",
            "net8": "ee:3f:89:fb:c0:ec",
            "net9": "06:8e:b6:e9:a8:66"
        },
        "spine_1_1_9": {
            "net0": "32:ed:ed:80:d5:99",
            "net1": "76:d8:de:43:f9:70",
            "net10": "72:8a:17:8d:6a:75",
            "net11": "c2:33:05:bf:15:42",
            "net12": "b2:d7:3f:73:fe:ce",
            "net13": "3a:db:85:2d:cf:8a",
            "net14": "0e:67:d6:e1:03:3f",
            "net15": "86:83:fe:fe:b8:8c",
            "net16": "42:51:63:3d:78:ca",
            "net17": "b2:77:10:d2:a6:f9",
            "net18": "be:04:5f:b1:60:f6",
            "net19": "62:fa:32:03:cb:81",
            "net2": "c6:1a:07:4a:75:9f",
            "net20": "16:28:c7:ee:c0:8b",
            "net21": "b6:0e:0e:54:5a:0b",
            "net22": "5e:6f:cb:c7:72:26",
            "net23": "4e:3d:3b:8d:14:a9",
            "net3": "0a:cf:04:25:24:2d",
            "net4": "56:d1:05:1e:7a:41",
            "net5": "46:12:95:64:f7:fb",
            "net6": "52:2d:42:15:48:c0",
            "net7": "02:55:55:ac:12:4f",
            "net8": "d6:7b:56:5b:e8:84",
            "net9": "0e:37:c6:49:c9:2a"
        },
        "spine_2_1_1": {
            "net0": "0e:b5:81:9a:de:7f",
            "net1": "d2:80:ae:cc:06:6d",
            "net10": "ea:18:4d:0a:5d:b0",
            "net11": "5a:08:ba:cc:78:e7",
            "net12": "56:9e:b2:25:96:52",
            "net13": "de:4f:10:ec:07:eb",
            "net14": "e2:73:d2:e5:51:9e",
            "net15": "5a:88:fa:f8:e9:21",
            "net16": "22:2b:16:43:18:6c",
            "net17": "c6:2d:f6:34:14:8d",
            "net18": "9a:41:b1:c2:c0:bd",
            "net19": "02:a5:40:53:4a:74",
            "net2": "ea:cf:58:34:1c:b1",
            "net20": "c6:5c:95:35:31:6d",
            "net21": "b2:b2:75:a3:5b:a6",
            "net22": "6e:45:c9:c4:71:16",
            "net23": "06:3b:c5:1e:04:72",
            "net3": "b6:10:c7:ae:1c:82",
            "net4": "2a:18:f4:c6:e7:de",
            "net5": "32:21:2d:3c:89:a6",
            "net6": "f2:5f:ac:19:f3:87",
            "net7": "8e:05:26:9b:50:b4",
            "net8": "fa:6e:5a:e7:76:44",
            "net9": "ea:76:ed:ad:eb:2d"
        },
        "spine_2_1_10": {
            "net0": "36:5b:48:ee:81:74",
            "net1": "fa:51:a3:4a:5f:e6",
            "net10": "d2:7e:08:f1:4d:96",
            "net11": "12:42:ed:e5:ba:f8",
            "net12": "7e:15:39:86:fc:17",
            "net13": "62:72:1e:10:42:48",
            "net14": "ae:f2:e6:d6:02:9a",
            "net15": "02:2c:91:ea:43:60",
            "net16": "72:2f:6b:a2:0c:b8",
            "net17": "4a:8b:dc:0a:84:9b",
            "net18": "5e:d4:99:42:4f:f4",
            "net19": "ae:35:cf:6b:de:ce",
            "net2": "ea:7f:0c:76:0c:4f",
            "net20": "32:9f:71:93:d5:31",
            "net21": "6e:31:fb:0f:8f:0e",
            "net22": "7e:ca:e1:92:24:64",
            "net23": "ae:4a:4e:8d:26:08",
            "net3": "12:bd:5b:49:af:28",
            "net4": "f6:b3:c4:9c:d2:c6",
            "net5": "06:ef:3d:13:79:cd",
            "net6": "2e:ac:90:16:ce:46",
            "net7": "06:d2:41:69:26:57",
            "net8": "06:9d:35:fe:2f:77",
            "net9": "02:3a:6b:72:5a:b0"
        },
        "spine_2_1_11": {
            "net0": "26:07:d6:0f:ac:30",
            "net1": "9a:ec:22:df:3d:c1",
            "net10": "2e:b7:77:5d:92:52",
            "net11": "f2:69:49:3a:49:71",
            "net12": "56:49:2e:a7:d6:87",
            "net13": "e2:2b:bd:c4:a2:2e",
            "net14": "12:d4:05:ad:0d:c7",
            "net15": "e2:79:3a:2e:9b:96",
            "net16": "f2:8d:34:2c:90:c2",
            "net17": "2e:a4:cf:ab:14:82",
            "net18": "4e:c4:22:3b:55:21",
            "net19": "96:00:70:0f:d2:46",
            "net2": "3a:8a:f4:16:20:d5",
            "net20": "9e:19:36:51:d7:a7",
            "net21": "42:f6:78:da:17:cd",
            "net22": "4a:3b:ee:00:52:da",
            "net23": "46:67:d6:33:98:54",
            "net3": "32:bf:2e:05:65:e1",
            "net4": "ca:85:b0:dd:6c:d6",
            "net5": "a2:09:50:df:2a:20",
            "net6": "02:82:b6:03:81:89",
            "net7": "16:f1:0b:57:9e:5d",
            "net8": "8a:7f:20:dc:34:b6",
            "net9": "4a:4c:af:fd:1c:59"
        },
        "spine_2_1_12": {
            "net0": "26:9c:6a:d9:c4:9b",
            "net1": "22:cc:62:dc:7c:42",
            "net10": "66:24:17:81:44:ae",
            "net11": "f6:10:94:cc:77:13",
            "net12": "36:4a:e5:37:4f:92",
            "net13": "16:c9:dc:64:92:3e",
            "net14": "3e:53:24:89:4e:fc",
            "net15": "72:a3:54:ef:67:cf",
            "net16": "02:fe:63:8c:63:08",
            "net17": "16:5f:b6:2e:7a:b9",
            "net18": "7e:32:8e:60:7b:f9",
            "net19": "e2:c6:f4:1c:fd:a1",
            "net2": "ee:94:41:60:21:f3",
            "net20": "fe:64:ea:99:14:40",
            "net21": "fa:7e:17:e1:c9:86",
            "net22": "2e:66:68:eb:05:6a",
            "net23": "a6:02:b0:66:f5:23",
            "net3": "62:32:13:6e:4b:33",
            "net4": "aa:86:f2:d7:5a:4d",
            "net5": "f6:c0:71:af:9e:da",
            "net6": "fe:55:8c:64:11:7e",
            "net7": "22:61:4c:cd:5b:89",
            "net8": "02:04:ad:8d:66:9b",
            "net9": "66:70:24:ef:e4:93"
        },
        "spine_2_1_2": {
            "net0": "76:ae:bd:46:d7:b7",
            "net1": "12:cd:6c:b9:7d:81",
            "net10": "86:b4:e9:32:2d:f4",
            "net11": "b2:9a:e5:05:e8:86",
            "net12": "8a:b5:95:e2:cb:a2",
            "net13": "fa:b0:54:bc:c6:2b",
            "net14": "be:e5:f5:f2:e5:b9",
            "net15": "36:f6:05:c0:1d:b9",
            "net16": "62:91:bf:92:68:d0",
            "net17": "a2:dd:c1:05:32:f4",
            "net18": "92:b8:af:68:0b:8f",
            "net19": "8a:07:1d:b8:13:16",
            "net2": "d2:21:87:db:b2:fc",
            "net20": "ee:94:25:60:7b:ff",
            "net21": "96:e4:f8:e4:a5:cd",
            "net22": "e6:eb:3d:04:51:7a",
            "net23": "f6:1d:bf:b0:b3:28",
            "net3": "8a:bf:aa:c0:09:60",
            "net4": "56:c1:b2:6d:fd:4b",
            "net5": "96:d5:98:9e:c2:cc",
            "net6": "b2:7c:d4:f7:ff:e1",
            "net7": "ca:93:91:b6:c3:3c",
            "net8": "ce:9d:4c:ee:9d:78",
            "net9": "da:28:20:4d:09:ee"
        },
        "spine_2_1_3": {
            "net0": "4e:27:5e:bc:2b:33",
            "net1": "82:61:55:e0:ef:13",
            "net10": "26:16:7c:86:b4:da",
            "net11": "52:e9:80:8e:3e:43",
            "net12": "26:8a:95:e3:a1:70",
            "net13": "3a:d6:07:32:a6:91",
            "net14": "ce:0f:36:60:37:3b",
            "net15": "e2:82:57:32:f6:9b",
            "net16": "ee:71:74:87:b3:1a",
            "net17": "d6:34:fc:84:bf:72",
            "net18": "fe:f2:41:e8:03:76",
            "net19": "8e:ff:38:4e:d7:7c",
            "net2": "da:b0:8d:83:b9:6a",
            "net20": "e2:24:eb:53:23:3a",
            "net21": "16:80:02:58:8c:cb",
            "net22": "be:13:ca:fe:0d:7d",
            "net23": "5a:8d:66:91:50:74",
            "net3": "4e:62:d9:15:a5:57",
            "net4": "22:c1:9d:4c:95:d1",
            "net5": "d2:ae:df:df:1c:c7",
            "net6": "9a:80:11:de:08:e0",
            "net7": "ba:36:53:37:9a:08",
            "net8": "fe:35:ef:d0:85:e0",
            "net9": "0e:75:f7:24:24:e7"
        },
        "spine_2_1_4": {
            "net0": "16:b6:22:09:e9:fe",
            "net1": "16:e7:b3:91:d9:cd",
            "net10": "ee:e9:a8:cf:b5:fe",
            "net11": "a6:de:b6:73:3f:af",
            "net12": "b6:ad:10:f4:e2:43",
            "net13": "de:21:ac:97:a9:e5",
            "net14": "e2:5e:d6:40:31:b7",
            "net15": "92:83:cd:3f:51:ba",
            "net16": "ee:e7:b0:2f:92:50",
            "net17": "b6:0a:5e:10:54:7d",
            "net18": "32:d9:ba:75:ff:d1",
            "net19": "92:d7:c5:38:6e:2f",
            "net2": "2e:63:bd:33:08:5c",
            "net20": "ba:8f:cc:08:da:ff",
            "net21": "96:ad:77:15:42:3c",
            "net22": "c6:87:75:38:46:65",
            "net23": "b2:03:32:82:4b:84",
            "net3": "32:e0:2f:6f:57:58",
            "net4": "6e:27:47:94:83:7c",
            "net5": "76:68:44:ce:ad:88",
            "net6": "e2:af:14:d2:7e:e7",
            "net7": "42:13:d8:28:20:50",
            "net8": "5a:c5:a5:23:12:40",
            "net9": "de:90:35:6f:63:21"
        },
        "spine_2_1_5": {
            "net0": "46:eb:d5:a0:4d:22",
            "net1": "8e:98:8a:bf:bb:c6",
            "net10": "42:23:2e:0e:a9:b5",
            "net11": "d2:c6:c6:e2:c8:0c",
            "net12": "be:e8:88:4d:5c:6e",
            "net13": "f2:ac:0c:42:04:28",
            "net14": "9e:82:0b:cb:e5:71",
            "net15": "82:93:3e:67:74:b8",
            "net16": "0a:12:3e:5f:11:ca",
            "net17": "12:1f:05:b1:31:27",
            "net18": "52:ed:86:cd:30:2d",
            "net19": "5a:cd:f8:a6:c9:5f",
            "net2": "ea:e0:1f:8e:20:4a",
            "net20": "2e:67:85:fe:27:6a",
            "net21": "36:c2:0d:fe:24:29",
            "net22": "56:80:b6:b0:a5:ab",
            "net23": "1a:10:3c:ec:45:f5",
            "net3": "ae:f2:f3:de:a9:01",
            "net4": "26:97:b1:39:f5:f3",
            "net5": "4e:77:6b:fa:53:ee",
            "net6": "56:09:57:4d:57:e4",
            "net7": "f6:bd:31:a6:21:14",
            "net8": "12:e6:2c:8d:f2:93",
            "net9": "e2:b9:a2:a1:90:55"
        },
        "spine_2_1_6": {
            "net0": "ca:de:0e:19:59:2b",
            "net1": "fa:6a:6d:f3:09:e8",
            "net10": "fe:87:15:ed:06:2e",
            "net11": "42:f4:1e:a6:a6:aa",
            "net12": "5e:84:bf:a8:ae:26",
            "net13": "86:fc:fa:63:ee:91",
            "net14": "a6:b4:ce:08:be:00",
            "net15": "a6:ad:39:23:e1:c1",
            "net16": "36:27:4e:73:fd:6f",
            "net17": "26:dc:60:23:9a:aa",
            "net18": "22:5c:84:35:b6:52",
            "net19": "ea:28:92:88:34:cc",
            "net2": "42:20:d9:4c:d5:f7",
            "net20": "92:cb:29:ea:7f:12",
            "net21": "86:1b:c4:e7:c0:98",
            "net22": "72:2e:fc:ef:d9:a7",
            "net23": "d2:ff:a0:de:af:26",
            "net3": "6e:06:95:55:2f:14",
            "net4": "82:f9:ca:15:dd:4b",
            "net5": "92:a5:8e:7b:7d:cd",
            "net6": "9e:8d:8d:b9:14:ff",
            "net7": "96:b0:49:eb:22:1a",
            "net8": "7e:16:b9:27:76:90",
            "net9": "b6:59:05:69:ce:88"
        },
        "spine_2_1_7": {
            "net0": "d6:f9:bc:2c:c9:90",
            "net1": "ae:a9:8e:ee:9a:77",
            "net10": "26:cc:4a:b4:3c:b9",
            "net11": "6a:3e:9a:e3:15:ed",
            "net12": "16:39:fa:3d:b6:be",
            "net13": "a6:8c:79:c7:92:4a",
            "net14": "4e:07:be:a7:59:5b",
            "net15": "16:d3:f0:fd:6c:3a",
            "net16": "86:07:0c:4c:36:e5",
            "net17": "fe:b6:e4:f8:88:47",
            "net18": "6e:51:1f:79:64:7b",
            "net19": "0e:6b:59:93:c8:d8",
            "net2": "9e:40:25:b4:cd:bd",
            "net20": "e2:23:74:17:2d:d4",
            "net21": "62:ce:b1:09:3c:76",
            "net22": "5e:80:c8:ec:5a:20",
            "net23": "6a:00:6b:47:c5:03",
            "net3": "96:a2:99:b9:33:a0",
            "net4": "22:aa:ba:27:23:48",
            "net5": "2e:7e:f2:61:3a:5d",
            "net6": "ce:36:1d:ed:08:e3",
            "net7": "de:41:40:7e:03:57",
            "net8": "46:d7:3d:95:97:1d",
            "net9": "c2:15:e4:4f:63:57"
        },
        "spine_2_1_8": {
            "net0": "ee:8a:8d:9c:b6:e9",
            "net1": "be:78:98:70:2f:37",
            "net10": "3a:b5:8a:0a:38:1d",
            "net11": "aa:98:99:39:c1:fb",
            "net12": "8e:22:37:89:69:4d",
            "net13": "1e:dd:2a:31:7f:9a",
            "net14": "0a:99:c4:ff:66:9f",
            "net15": "06:fc:8f:a7:42:db",
            "net16": "2a:d1:85:08:76:5b",
            "net17": "82:2a:8e:50:63:a0",
            "net18": "be:5d:64:8f:67:65",
            "net19": "8e:69:78:60:33:ce",
            "net2": "c2:a1:67:62:69:16",
            "net20": "5a:60:8a:4c:a9:33",
            "net21": "12:ae:c2:14:e2:b0",
            "net22": "e2:58:39:68:84:fe",
            "net23": "ee:0b:c9:a8:34:a4",
            "net3": "a2:3c:00:a5:6a:e1",
            "net4": "0a:38:2f:45:d0:9e",
            "net5": "c2:04:c8:e7:74:58",
            "net6": "36:2f:2b:c7:9c:64",
            "net7": "5e:7e:64:70:19:61",
            "net8": "e2:62:80:1e:d8:31",
            "net9": "36:3e:80:74:99:20"
        },
        "spine_2_1_9": {
            "net0": "62:4d:2b:54:34:bf",
            "net1": "16:b8:9c:9e:4b:6f",
            "net10": "0a:48:be:27:3d:c1",
            "net11": "e2:2d:8f:03:e1:b8",
            "net12": "7a:60:6c:08:91:52",
            "net13": "d2:4e:46:3a:6f:84",
            "net14": "8e:da:ee:39:a3:a3",
            "net15": "56:7b:aa:b1:60:e6",
            "net16": "f6:27:75:84:eb:03",
            "net17": "ea:fb:1c:43:76:56",
            "net18": "36:2d:17:53:6e:99",
            "net19": "1a:5f:36:33:90:fb",
            "net2": "7e:40:36:8b:78:64",
            "net20": "ba:b0:83:fc:42:60",
            "net21": "22:ba:2b:22:5f:ba",
            "net22": "de:d1:1e:c3:7e:51",
            "net23": "02:27:81:2a:df:fc",
            "net3": "3e:f4:97:d8:56:cc",
            "net4": "3e:57:34:c6:0e:40",
            "net5": "ba:31:90:4d:3e:8d",
            "net6": "32:88:a6:02:27:c1",
            "net7": "72:37:e7:58:79:8a",
            "net8": "de:51:26:aa:f9:d4",
            "net9": "3e:ca:08:5e:86:86"
        },
        "tof_1_2_1": {
            "net0": "ba:24:99:d9:e3:e1",
            "net1": "da:d8:7a:f7:1c:dd",
            "net10": "7a:bc:59:7e:50:1f",
            "net11": "76:18:f9:7e:96:05",
            "net12": "aa:d7:3a:f9:d6:72",
            "net13": "fa:10:74:17:2a:da",
            "net14": "6e:e7:83:31:ed:d9",
            "net15": "be:09:52:74:53:6d",
            "net16": "d2:83:34:d1:c3:c3",
            "net17": "b2:dd:ef:53:eb:ea",
            "net18": "36:88:1e:67:17:57",
            "net19": "36:82:a2:ac:1c:ad",
            "net2": "86:c5:81:5f:dc:97",
            "net20": "c6:83:27:df:dd:05",
            "net21": "46:49:39:2b:78:f4",
            "net22": "9a:22:e9:21:af:ce",
            "net23": "ca:ad:10:00:26:7f",
            "net3": "d6:7e:5e:c3:95:eb",
            "net4": "ae:1b:ed:23:04:8a",
            "net5": "16:23:cc:1a:c0:ef",
            "net6": "ae:cc:71:3c:ab:9b",
            "net7": "e6:90:d8:b7:8a:b3",
            "net8": "46:29:32:0d:15:c2",
            "net9": "ce:42:87:b8:fd:71"
        },
        "tof_1_2_10": {
            "net0": "1e:de:fd:d0:20:5d",
            "net1": "c2:f8:8b:42:1f:1a",
            "net10": "06:75:6b:cd:4d:f7",
            "net11": "56:70:11:ed:c9:ec",
            "net12": "1e:07:ee:fb:ee:16",
            "net13": "1e:07:f0:45:69:14",
            "net14": "26:c7:cc:9d:69:aa",
            "net15": "d6:9b:0a:be:b9:87",
            "net16": "1a:db:4f:07:80:68",
            "net17": "aa:81:42:61:ce:14",
            "net18": "62:76:b2:75:46:bf",
            "net19": "36:98:07:93:c5:97",
            "net2": "1a:fb:93:6b:f1:76",
            "net20": "9a:7a:41:db:39:18",
            "net21": "d6:05:fe:9b:fc:3c",
            "net22": "26:b3:64:ff:ed:6a",
            "net23": "1e:00:c7:7a:c6:cb",
            "net3": "3a:3e:ac:50:68:fe",
            "net4": "16:34:41:d6:7e:b2",
            "net5": "2a:62:10:26:d1:d6",
            "net6": "8a:2f:cd:77:2d:41",
            "net7": "06:d3:ed:a0:0a:88",
            "net8": "36:b7:5a:45:42:e7",
            "net9": "32:61:19:e8:8d:7f"
        },
        "tof_1_2_11": {
            "net0": "16:9f:06:2c:d6:a7",
            "net1": "06:2d:69:bb:0a:68",
            "net10": "62:65:0a:8f:5c:e6",
            "net11": "6e:42:c6:bc:45:26",
            "net12": "82:3d:d1:c0:f9:88",
            "net13": "e2:d9:8a:0e:4e:86",
            "net14": "d2:b4:a2:0c:e8:b8",
            "net15": "ca:25:9b:b9:c3:6e",
            "net16": "76:9a:8f:e8:94:91",
            "net17": "ca:93:e9:8f:b7:10",
            "net18": "22:56:25:07:14:f6",
            "net19": "aa:8e:bc:3c:91:77",
            "net2": "86:54:44:80:fd:41",
            "net20": "56:47:e0:f5:ff:d6",
            "net21": "8a:97:51:d9:21:a7",
            "net22": "d6:c7:4a:0a:e5:6b",
            "net23": "f6:32:db:f2:8c:6a",
            "net3": "76:73:c1:94:fe:5c",
            "net4": "2e:3e:fe:ff:06:0c",
            "net5": "6e:fe:ce:60:8d:ed",
            "net6": "2a:ba:91:d7:a4:e3",
            "net7": "ea:bd:33:3c:77:38",
            "net8": "66:3d:bd:34:d5:74",
            "net9": "ea:e1:12:d9:4e:20"
        },
        "tof_1_2_12": {
            "net0": "16:e6:bd:26:b6:51",
            "net1": "d6:15:ae:10:05:75",
            "net10": "5e:19:63:09:4a:6d",
            "net11": "6a:0b:95:83:b1:90",
            "net12": "9a:c7:86:8c:9b:44",
            "net13": "22:42:76:47:dc:56",
            "net14": "6e:89:c3:20:3c:b3",
            "net15": "e2:86:98:67:38:7c",
            "net16": "06:72:61:f7:52:18",
            "net17": "b2:cd:34:af:82:20",
            "net18": "66:cb:30:73:e8:ab",
            "net19": "0e:51:b3:4a:24:e3",
            "net2": "2e:1d:3c:17:a7:9f",
            "net20": "f6:eb:1d:13:1b:1b",
            "net21": "86:50:4f:e4:61:aa",
            "net22": "66:34:b3:0e:fd:5f",
            "net23": "9e:6f:ca:45:a6:36",
            "net3": "26:8a:1a:df:2d:0b",
            "net4": "62:80:aa:84:1f:17",
            "net5": "9e:4c:b4:b0:a6:78",
            "net6": "f2:ee:7d:b2:1c:3f",
            "net7": "ca:ce:9c:10:b0:70",
            "net8": "d2:f0:46:44:2e:4a",
            "net9": "8e:bc:2c:ed:4b:6f"
        },
        "tof_1_2_2": {
            "net0": "42:ca:57:bc:47:53",
            "net1": "e6:66:e1:4b:19:79",
            "net10": "aa:9b:1c:68:3e:a6",
            "net11": "22:e9:3e:00:51:58",
            "net12": "3a:74:65:b3:14:6f",
            "net13": "7a:b4:22:78:1c:50",
            "net14": "5e:ed:13:13:9f:9b",
            "net15": "66:a6:1b:89:97:31",
            "net16": "c2:8b:f2:08:bd:cd",
            "net17": "1a:d5:ea:a2:40:a0",
            "net18": "0a:d6:b9:5a:ba:32",
            "net19": "66:fd:92:64:04:41",
            "net2": "92:16:24:5b:06:e9",
            "net20": "e2:2c:e8:ac:cf:b2",
            "net21": "92:aa:38:fa:5a:ab",
            "net22": "ba:41:7c:f8:8a:d4",
            "net23": "b2:bc:63:52:37:58",
            "net3": "e6:08:81:96:e0:14",
            "net4": "82:1d:72:81:9f:c5",
            "net5": "b6:b6:07:37:ba:50",
            "net6": "8e:ee:bd:43:fb:72",
            "net7": "6e:93:b5:ba:9d:5b",
            "net8": "3e:fb:b8:7d:63:c3",
            "net9": "6e:f3:e0:ff:36:6a"
        },
        "tof_1_2_3": {
            "net0": "4e:10:37:2b:17:43",
            "net1": "de:37:c1:f9:eb:2a",
            "net10": "9e:43:ce:44:a7:8b",
            "net11": "76:82:ea:41:43:0c",
            "net12": "e2:2a:5c:52:55:13",
            "net13": "82:ea:b9:d8:f1:d3",
            "net14": "de:2c:b7:ae:f7:de",
            "net15": "2a:2b:18:22:a0:01",
            "net16": "ce:45:1c:8e:e0:db",
            "net17": "32:98:8e:8f:41:81",
            "net18": "66:6a:9d:29:11:2e",
            "net19": "f6:b9:51:0a:1f:8b",
            "net2": "ce:3f:df:48:35:bd",
            "net20": "3e:77:d2:c3:7d:1c",
            "net21": "d6:5c:cd:aa:35:89",
            "net22": "ae:59:88:08:b1:88",
            "net23": "fa:29:a0:99:ce:e7",
            "net3": "fa:01:1c:6f:8e:11",
            "net4": "5e:b5:65:81:b8:37",
            "net5": "56:b7:88:5d:0d:39",
            "net6": "0e:11:95:3f:8b:31",
            "net7": "1a:85:2d:fa:9b:91",
            "net8": "ce:b7:a2:3f:8a:80",
            "net9": "9e:ea:83:69:4e:8f"
        },
        "tof_1_2_4": {
            "net0": "0a:5d:1e:c0:48:29",
            "net1": "c6:50:90:37:9a:63",
            "net10": "de:65:0d:79:58:f2",
            "net11": "16:30:3e:2c:3f:61",
            "net12": "b6:88:87:eb:7d:28",
            "net13": "a2:14:2e:eb:31:29",
            "net14": "9e:93:5c:6a:c0:91",
            "net15": "fa:dd:fb:c5:1a:66",
            "net16": "c6:53:66:25:8f:5c",
            "net17": "8e:02:e1:7d:b1:5e",
            "net18": "ba:bb:6b:49:c3:ff",
            "net19": "36:95:b4:06:2c:10",
            "net2": "9a:d1:a9:c7:41:d7",
            "net20": "02:31:69:01:8e:e6",
            "net21": "0a:8e:23:bd:13:de",
            "net22": "42:14:31:cd:da:f8",
            "net23": "4a:2c:9d:f9:9b:f3",
            "net3": "22:7b:8a:48:40:7c",
            "net4": "9a:9c:57:05:94:45",
            "net5": "aa:a9:7b:38:49:fe",
            "net6": "12:25:eb:c9:b4:ca",
            "net7": "72:11:02:07:8e:ca",
            "net8": "e6:4c:ab:ab:6a:75",
            "net9": "7e:6d:1d:23:b2:a7"
        },
        "tof_1_2_5": {
            "net0": "16:38:18:a5:4a:8c",
            "net1": "ca:d1:af:b5:5c:ff",
            "net10": "76:80:e3:2c:c2:3c",
            "net11": "be:5c:6c:5b:2d:26",
            "net12": "22:27:20:5f:d6:fb",
            "net13": "96:8f:a7:be:8b:de",
            "net14": "26:b5:1c:65:6c:0b",
            "net15": "62:14:e3:da:f0:e8",
            "net16": "c2:cf:c9:58:55:9c",
            "net17": "5e:c8:22:b9:f8:f7",
            "net18": "8a:34:be:27:c3:eb",
            "net19": "3a:33:01:83:68:0d",
            "net2": "7a:c6:cb:09:ec:a7",
            "net20": "5e:8e:ca:23:eb:70",
            "net21": "72:b6:e0:dd:f7:1b",
            "net22": "6a:94:21:e5:da:b5",
            "net23": "8a:63:2f:8d:50:c9",
            "net3": "fe:38:3f:e1:d6:38",
            "net4": "32:6d:68:a7:ec:19",
            "net5": "96:58:82:8b:4e:bc",
            "net6": "de:82:ec:c8:e9:74",
            "net7": "8e:d2:44:03:f3:f4",
            "net8": "02:73:f8:c7:4e:66",
            "net9": "06:37:a8:2e:b4:75"
        },
        "tof_1_2_6": {
            "net0": "a2:47:e5:95:06:27",
            "net1": "7e:d9:5d:6d:fd:3a",
            "net10": "5a:49:70:cb:15:60",
            "net11": "9a:8b:4a:1d:8d:d5",
            "net12": "d6:a0:82:2a:03:38",
            "net13": "12:72:48:29:e9:cd",
            "net14": "ca:0f:b4:d1:d1:c5",
            "net15": "ae:8c:e8:11:35:08",
            "net16": "0a:1a:19:35:f3:4e",
            "net17": "a6:4c:d3:37:de:b9",
            "net18": "76:0a:c2:7b:fa:9f",
            "net19": "fe:66:7f:75:23:01",
            "net2": "e6:b5:2c:e8:5b:6d",
            "net20": "be:dd:30:39:50:f2",
            "net21": "ba:0c:50:3f:ba:81",
            "net22": "12:7e:8b:cb:36:fc",
            "net23": "52:5a:38:03:39:45",
            "net3": "06:4f:9a:5c:64:58",
            "net4": "ee:6a:99:d1:74:04",
            "net5": "7e:a6:c2:af:f7:16",
            "net6": "ca:49:bd:50:e4:4b",
            "net7": "8e:15:2b:55:66:8f",
            "net8": "d6:6c:97:6c:86:58",
            "net9": "22:b8:4d:19:79:c4"
        },
        "tof_1_2_7": {
            "net0": "c2:fe:d0:f2:c5:1a",
            "net1": "7e:e1:98:db:d3:c9",
            "net10": "2a:cd:9f:45:3c:8d",
            "net11": "a6:a8:97:f7:6f:e0",
            "net12": "42:a9:1f:5b:7f:f6",
            "net13": "76:59:cd:9d:b1:a8",
            "net14": "26:db:fc:77:b6:ff",
            "net15": "d6:5c:d7:fe:7e:e8",
            "net16": "6a:00:81:54:35:ae",
            "net17": "2e:fe:94:a5:00:eb",
            "net18": "8e:b1:34:f0:a2:7a",
            "net19": "1e:1c:6b:59:52:f0",
            "net2": "fe:78:f5:86:72:56",
            "net20": "e2:9a:e0:de:c9:af",
            "net21": "0a:46:5d:12:99:45",
            "net22": "26:ba:a1:dd:fc:fc",
            "net23": "5a:43:23:b9:49:45",
            "net3": "72:a6:4a:a0:83:0a",
            "net4": "6a:bc:a4:8d:a5:5e",
            "net5": "32:94:fe:80:00:ae",
            "net6": "56:6e:b1:e9:ca:2d",
            "net7": "42:6e:d1:3a:c0:89",
            "net8": "f2:87:ba:27:d5:54",
            "net9": "b2:c7:98:4d:3a:69"
        },
        "tof_1_2_8": {
            "net0": "ae:66:d9:d1:d9:11",
            "net1": "e6:36:6d:16:f6:5f",
            "net10": "22:4e:ea:f7:a4:c4",
            "net11": "b6:2a:57:88:04:62",
            "net12": "ae:b3:3b:c5:72:c8",
            "net13": "3a:6d:2c:10:97:bf",
            "net14": "ce:d7:28:41:d8:ad",
            "net15": "c6:b4:6a:61:0e:3d",
            "net16": "0a:f4:19:88:df:36",
            "net17": "62:7f:ce:da:93:73",
            "net18": "1a:b7:e6:cf:6c:c2",
            "net19": "06:09:9c:ad:6e:0f",
            "net2": "82:f3:29:b4:c7:fb",
            "net20": "7e:30:be:75:9c:e9",
            "net21": "5a:a8:9d:0d:49:80",
            "net22": "56:5f:13:22:e9:3e",
            "net23": "9a:af:d3:7c:d1:3a",
            "net3": "76:fa:d9:ac:ee:a3",
            "net4": "c6:ba:cb:0e:82:d1",
            "net5": "26:e8:78:ab:e6:50",
            "net6": "d2:6b:ea:84:ce:9e",
            "net7": "1a:96:35:6c:e0:d2",
            "net8": "26:b4:61:51:de:75",
            "net9": "be:91:a8:07:fa:55"
        },
        "tof_1_2_9": {
            "net0": "96:25:81:21:0f:17",
            "net1": "b2:b7:01:55:87:19",
            "net10": "6e:6a:7f:25:74:7c",
            "net11": "2e:db:94:3e:23:bf",
            "net12": "6a:0f:35:f5:eb:ff",
            "net13": "96:0a:52:ed:93:93",
            "net14": "46:92:d1:2e:ae:e0",
            "net15": "7e:28:cc:8c:be:99",
            "net16": "16:53:11:53:aa:6c",
            "net17": "d2:c3:29:5d:17:d8",
            "net18": "d6:72:89:b4:de:ef",
            "net19": "6a:73:e6:0b:e0:4c",
            "net2": "02:1e:2f:af:35:08",
            "net20": "7a:57:37:f5:62:5d",
            "net21": "ce:d2:70:d6:94:04",
            "net22": "7a:4d:ae:66:1f:ea",
            "net23": "36:29:31:8e:7e:cf",
            "net3": "86:52:42:35:ff:e3",
            "net4": "16:dd:3a:f6:67:78",
            "net5": "a6:c2:31:85:4b:9b",
            "net6": "22:e6:76:12:80:02",
            "net7": "e2:4c:49:91:38:26",
            "net8": "d6:ea:55:30:91:cd",
            "net9": "02:5d:17:72:51:b5"
        }
    },
    "failed_machine": "leaf_1_0_1",
    "failure_time": 1614452432.9001775,
    "recover_time": 1614452707.179469
}