{
    "k_leaf": 14,
    "k_top": 14,
    "redundancy_factor": 14,
    "is_k8s": true,
    "machine_mac_addresses": {
        "leaf_1_0_1": {
            "net0": "76:88:c4:ec:cb:be",
            "net1": "82:12:7e:0e:eb:cc",
            "net10": "1a:da:ab:6d:56:32",
            "net11": "a2:44:cf:8c:fa:b9",
            "net12": "ce:1f:e0:77:91:da",
            "net13": "aa:f8:5f:ac:f3:1b",
            "net14": "8e:7b:35:59:ee:12",
            "net2": "22:11:52:c9:db:9b",
            "net3": "ae:ce:4a:b3:7e:f3",
            "net4": "8a:a0:86:96:37:ec",
            "net5": "aa:ee:5e:e5:68:f9",
            "net6": "ba:81:60:e6:9d:80",
            "net7": "2a:27:0c:95:3e:ac",
            "net8": "6e:93:8c:d2:4d:3e",
            "net9": "26:1b:67:c0:11:59"
        },
        "leaf_1_0_10": {
            "net0": "96:75:a2:c6:4b:29",
            "net1": "7e:67:7a:e2:af:ee",
            "net10": "0e:e9:53:67:94:b5",
            "net11": "2e:e3:d7:07:00:4c",
            "net12": "c2:bd:06:c1:d7:f2",
            "net13": "fe:2b:62:61:52:07",
            "net14": "d6:0e:d4:bb:93:54",
            "net2": "46:3f:16:1e:a2:e1",
            "net3": "7e:a2:2c:37:5e:e2",
            "net4": "06:d4:27:4d:7c:aa",
            "net5": "3a:a0:e9:50:5e:75",
            "net6": "6e:87:ed:c7:f9:a3",
            "net7": "b6:77:c6:e2:da:e3",
            "net8": "be:3e:15:6b:96:58",
            "net9": "ca:35:56:34:63:e2"
        },
        "leaf_1_0_11": {
            "net0": "52:d6:4d:34:41:45",
            "net1": "d2:bf:b3:1a:70:fc",
            "net10": "c2:02:13:b4:d1:66",
            "net11": "02:a5:7c:71:a7:5e",
            "net12": "62:26:02:ec:4e:f7",
            "net13": "96:f6:6d:13:21:1d",
            "net14": "62:7d:74:8e:c2:89",
            "net2": "42:90:9a:f0:9a:cb",
            "net3": "3a:37:6c:4c:c1:3c",
            "net4": "4a:f1:89:ce:25:52",
            "net5": "7a:5f:d4:e5:1e:7a",
            "net6": "ce:cc:84:d5:d6:93",
            "net7": "3e:bf:13:36:d8:b3",
            "net8": "6e:f8:17:a0:13:2f",
            "net9": "82:d2:8f:df:ad:78"
        },
        "leaf_1_0_12": {
            "net0": "e2:ca:b0:a3:c9:3a",
            "net1": "6e:27:15:84:e9:eb",
            "net10": "a6:63:54:51:1f:02",
            "net11": "da:a6:62:04:74:8c",
            "net12": "ba:a3:03:e0:3a:8d",
            "net13": "1e:b1:48:2a:f3:5a",
            "net14": "3e:1b:04:50:c0:a9",
            "net2": "52:e0:f7:49:0c:ac",
            "net3": "2a:cd:fd:e8:14:b3",
            "net4": "c2:46:78:49:dd:a0",
            "net5": "2e:3f:6b:a3:db:44",
            "net6": "02:2e:a3:91:ea:9c",
            "net7": "ae:9f:3e:90:08:a9",
            "net8": "7a:39:0a:50:50:ba",
            "net9": "22:80:ed:fa:56:65"
        },
        "leaf_1_0_13": {
            "net0": "86:ef:60:7c:02:15",
            "net1": "a6:da:10:86:24:15",
            "net10": "ce:b7:29:33:01:47",
            "net11": "66:bd:fa:f3:99:2c",
            "net12": "9a:df:36:d5:dd:2f",
            "net13": "e6:34:1f:f0:3b:73",
            "net14": "e2:ea:f6:ed:b0:25",
            "net2": "f2:4b:c2:3a:0c:e9",
            "net3": "4a:b9:30:93:b9:04",
            "net4": "52:ea:f4:27:4a:08",
            "net5": "7e:d0:c6:17:98:c8",
            "net6": "ce:c3:d5:dd:5f:26",
            "net7": "a2:12:40:9d:80:02",
            "net8": "8e:77:f0:a5:36:19",
            "net9": "e2:3d:aa:b3:cf:4c"
        },
        "leaf_1_0_14": {
            "net0": "22:33:13:f7:71:ca",
            "net1": "46:e4:d3:6d:a5:f4",
            "net10": "72:74:06:c4:e0:f7",
            "net11": "de:57:c4:9d:cf:6d",
            "net12": "d2:f7:43:1c:a3:d5",
            "net13": "42:b9:62:7c:61:2f",
            "net14": "ea:fb:ea:05:96:5c",
            "net2": "06:ca:31:0e:b7:97",
            "net3": "d6:ca:ae:f6:b1:3c",
            "net4": "32:fc:bb:71:4d:af",
            "net5": "f2:93:3e:67:f0:5f",
            "net6": "0a:42:ad:48:5c:21",
            "net7": "f6:a6:18:3a:02:24",
            "net8": "1e:f2:14:09:33:de",
            "net9": "76:6e:2e:b9:f0:b0"
        },
        "leaf_1_0_2": {
            "net0": "3a:03:c8:05:4e:4c",
            "net1": "82:c9:77:f6:bd:e0",
            "net10": "6a:74:55:32:84:88",
            "net11": "2e:63:42:98:cc:7c",
            "net12": "4a:1a:c8:70:fc:ca",
            "net13": "ae:50:7b:62:b2:0d",
            "net14": "aa:b4:4a:0e:97:50",
            "net2": "f6:77:1b:16:68:4b",
            "net3": "4a:97:28:5a:ea:fc",
            "net4": "82:32:ee:25:30:ee",
            "net5": "12:25:82:9b:92:ae",
            "net6": "02:29:55:fa:ca:1a",
            "net7": "6a:fd:ed:6f:f5:c3",
            "net8": "82:19:a8:ed:d2:6d",
            "net9": "6e:2e:a3:5a:f3:d0"
        },
        "leaf_1_0_3": {
            "net0": "f6:04:fe:27:20:4d",
            "net1": "4a:fd:78:3c:a4:1d",
            "net10": "9a:eb:13:d2:87:1a",
            "net11": "56:7e:87:33:a6:94",
            "net12": "5a:1e:22:34:1f:c4",
            "net13": "36:ae:de:f2:e4:0f",
            "net14": "92:6c:64:a0:85:38",
            "net2": "1e:89:37:b4:0c:2d",
            "net3": "06:58:9f:60:cd:b6",
            "net4": "46:77:65:f4:6c:90",
            "net5": "ce:b6:8a:06:90:6a",
            "net6": "3e:1b:20:89:c4:db",
            "net7": "22:02:16:1c:f8:f8",
            "net8": "a6:a5:5f:1a:2b:6d",
            "net9": "ae:b9:48:0f:ad:e9"
        },
        "leaf_1_0_4": {
            "net0": "a2:59:ff:25:90:da",
            "net1": "b6:0d:4d:56:98:23",
            "net10": "42:ad:51:50:83:d9",
            "net11": "4a:21:02:bc:f9:3c",
            "net12": "5a:00:b0:3f:1b:3f",
            "net13": "c2:db:81:2f:b6:f7",
            "net14": "7a:34:1b:1e:6b:6f",
            "net2": "7e:86:f3:3b:79:ee",
            "net3": "c6:0b:9f:9b:39:62",
            "net4": "0a:25:14:98:48:5c",
            "net5": "ea:ca:af:05:e1:05",
            "net6": "12:e2:17:f7:71:98",
            "net7": "a6:27:c5:17:19:13",
            "net8": "72:e4:b7:03:04:08",
            "net9": "f6:a3:e3:a2:90:2f"
        },
        "leaf_1_0_5": {
            "net0": "02:ca:c4:b5:ab:d3",
            "net1": "46:d5:c3:6b:67:4a",
            "net10": "1a:df:d4:9c:19:ce",
            "net11": "06:2f:dd:a9:90:2a",
            "net12": "66:62:74:54:9c:0a",
            "net13": "62:2a:7a:02:06:63",
            "net14": "d2:54:e0:c3:8d:e2",
            "net2": "c2:2b:30:7a:e3:2b",
            "net3": "16:d7:45:b9:9b:55",
            "net4": "4e:32:38:5c:61:47",
            "net5": "5e:31:9d:87:19:31",
            "net6": "86:92:24:ad:6b:84",
            "net7": "f2:84:b4:21:68:d6",
            "net8": "e6:dc:02:be:35:9c",
            "net9": "26:06:1d:b9:a6:7b"
        },
        "leaf_1_0_6": {
            "net0": "72:22:8e:ec:1e:88",
            "net1": "62:59:95:c0:c1:e1",
            "net10": "4e:2b:bd:37:ed:4a",
            "net11": "5a:34:b1:e2:0c:cd",
            "net12": "f6:31:55:28:2e:67",
            "net13": "e6:7f:27:92:10:d4",
            "net14": "a2:e3:b2:58:bc:4a",
            "net2": "ae:01:5c:9d:c7:83",
            "net3": "26:1e:8c:c2:ce:4e",
            "net4": "92:81:f2:08:8d:24",
            "net5": "92:db:92:be:3d:63",
            "net6": "ba:68:68:69:16:4d",
            "net7": "d2:96:db:ab:ad:f7",
            "net8": "ce:a2:bf:f4:99:86",
            "net9": "a2:05:f6:65:a4:85"
        },
        "leaf_1_0_7": {
            "net0": "22:4d:1b:68:39:70",
            "net1": "ca:85:84:54:d5:1e",
            "net10": "42:51:e3:1b:9f:29",
            "net11": "02:27:cf:44:89:46",
            "net12": "d6:2a:3f:77:d6:8d",
            "net13": "ae:b5:91:8f:91:70",
            "net14": "0a:79:c7:79:6c:15",
            "net2": "96:5b:36:62:1a:f9",
            "net3": "fe:28:17:86:d9:8d",
            "net4": "c6:b0:d0:f4:90:0e",
            "net5": "56:59:dc:8e:24:88",
            "net6": "42:b5:ab:56:bc:78",
            "net7": "d6:56:dc:7a:b8:fa",
            "net8": "c2:79:bb:67:ad:31",
            "net9": "3e:79:6a:ad:f5:9b"
        },
        "leaf_1_0_8": {
            "net0": "de:47:fd:69:71:3a",
            "net1": "82:54:04:60:a2:55",
            "net10": "76:a4:9a:cb:a8:a1",
            "net11": "36:c8:fa:aa:36:10",
            "net12": "3e:58:66:30:15:72",
            "net13": "ea:4e:d5:c8:e1:19",
            "net14": "92:0f:9e:92:f3:ca",
            "net2": "96:1c:80:69:37:af",
            "net3": "9a:04:35:14:2b:87",
            "net4": "fe:ef:37:38:64:47",
            "net5": "32:4a:0e:5b:d9:f1",
            "net6": "5a:b0:11:70:e2:2f",
            "net7": "1a:77:7a:ab:19:74",
            "net8": "2e:d0:42:26:ec:cd",
            "net9": "6e:b6:a7:85:75:5c"
        },
        "leaf_1_0_9": {
            "net0": "da:4d:23:a6:2e:5a",
            "net1": "b6:86:f6:a8:0e:0b",
            "net10": "c6:5a:9c:94:d1:45",
            "net11": "26:ba:68:e8:dc:48",
            "net12": "b6:95:c1:a5:64:16",
            "net13": "fa:8e:18:3c:f6:ec",
            "net14": "8e:ad:b2:8e:80:df",
            "net2": "b6:db:7c:af:81:78",
            "net3": "a2:8f:b6:13:d4:2c",
            "net4": "0a:31:c7:49:d5:91",
            "net5": "52:cd:3f:a5:72:1c",
            "net6": "da:be:59:11:a6:42",
            "net7": "16:09:9b:f7:ad:51",
            "net8": "b6:28:8a:9c:38:dd",
            "net9": "e2:0c:60:86:ef:6d"
        },
        "leaf_2_0_1": {
            "net0": "3e:06:a9:62:fa:d3",
            "net1": "3e:03:e8:f5:7a:8f",
            "net10": "a2:1b:4d:56:55:46",
            "net11": "ce:06:9e:2b:85:a8",
            "net12": "b6:6c:1a:d9:0e:59",
            "net13": "06:d4:19:87:9d:82",
            "net14": "3e:dd:85:c7:a6:50",
            "net2": "9a:e7:b7:43:6e:b5",
            "net3": "22:9f:a3:b1:07:11",
            "net4": "3e:5a:44:2d:3f:69",
            "net5": "66:a9:a1:58:f0:4e",
            "net6": "3a:d8:9f:d3:ec:be",
            "net7": "42:de:01:ab:e2:f9",
            "net8": "be:b4:4b:1f:25:13",
            "net9": "72:82:fe:c0:01:db"
        },
        "leaf_2_0_10": {
            "net0": "f2:82:9a:e9:ee:5e",
            "net1": "3e:8a:0e:cb:05:10",
            "net10": "22:0f:e7:62:da:5e",
            "net11": "c6:f1:ee:1c:11:b3",
            "net12": "fa:55:1c:6c:ab:53",
            "net13": "16:51:dd:5d:17:5b",
            "net14": "66:55:0d:b8:8f:05",
            "net2": "76:e1:07:81:b0:23",
            "net3": "2a:fa:87:2e:5d:9c",
            "net4": "86:cd:b4:9f:dd:21",
            "net5": "ce:77:19:67:e3:53",
            "net6": "fa:4e:24:67:1b:3c",
            "net7": "46:b8:44:53:8b:4f",
            "net8": "f6:c3:0e:ef:d0:36",
            "net9": "26:ba:06:d4:d8:fc"
        },
        "leaf_2_0_11": {
            "net0": "06:81:9e:49:53:96",
            "net1": "8e:0c:f7:07:32:15",
            "net10": "3a:c5:05:e5:8d:ee",
            "net11": "72:bd:08:be:19:9c",
            "net12": "9a:3a:04:0a:d0:07",
            "net13": "ce:ed:5f:eb:bf:ac",
            "net14": "02:70:0a:4c:21:a5",
            "net2": "1e:20:6f:c7:eb:0b",
            "net3": "82:27:c7:26:51:ae",
            "net4": "72:d8:73:53:e9:f5",
            "net5": "1e:70:ef:88:ee:b7",
            "net6": "32:3f:ba:75:1f:23",
            "net7": "96:71:22:d7:a0:6e",
            "net8": "1e:c6:8f:62:a7:75",
            "net9": "1a:01:fd:a0:97:ac"
        },
        "leaf_2_0_12": {
            "net0": "d2:28:2c:92:54:2c",
            "net1": "b2:c1:48:e1:c6:17",
            "net10": "8a:f0:98:04:76:e3",
            "net11": "3a:fe:b0:5b:6f:8d",
            "net12": "fe:86:e1:71:f6:05",
            "net13": "ee:3c:66:d5:0d:31",
            "net14": "8e:e1:e0:1c:28:5c",
            "net2": "5a:69:57:2c:92:39",
            "net3": "8e:ab:02:17:db:ac",
            "net4": "36:8c:e5:19:9e:a3",
            "net5": "de:b9:24:fe:4d:86",
            "net6": "ea:36:3b:3c:63:63",
            "net7": "da:a4:c8:25:a6:71",
            "net8": "f6:f6:c0:cd:ce:15",
            "net9": "ce:c9:b7:80:bd:be"
        },
        "leaf_2_0_13": {
            "net0": "4a:cd:8e:e9:06:fb",
            "net1": "0a:6a:c3:06:10:82",
            "net10": "b6:c0:16:2f:e6:02",
            "net11": "4a:51:5d:d7:db:6a",
            "net12": "8a:2f:87:38:4e:13",
            "net13": "46:3b:7f:19:e5:c0",
            "net14": "fe:7b:81:8b:9e:30",
            "net2": "aa:2e:62:2c:fe:ba",
            "net3": "9a:ab:83:dd:2f:52",
            "net4": "5a:94:76:8d:57:c3",
            "net5": "16:2c:e9:be:dd:68",
            "net6": "2e:c3:f0:06:17:22",
            "net7": "22:42:e4:fd:24:75",
            "net8": "7a:39:0f:d8:5a:1d",
            "net9": "f2:63:fd:b9:c3:fd"
        },
        "leaf_2_0_14": {
            "net0": "1e:49:ea:a7:c0:86",
            "net1": "86:d1:0e:54:dc:ac",
            "net10": "b2:7c:82:73:a3:40",
            "net11": "6e:2e:81:8f:cb:df",
            "net12": "92:c5:b6:b0:26:fc",
            "net13": "2a:d5:d4:55:96:15",
            "net14": "72:58:97:cf:0d:b9",
            "net2": "7e:12:dc:f7:8f:3a",
            "net3": "36:da:81:04:2e:b1",
            "net4": "1a:a9:73:1e:fe:aa",
            "net5": "ee:f0:81:b9:15:58",
            "net6": "3e:f8:18:b1:16:9d",
            "net7": "b6:e4:5d:6a:88:46",
            "net8": "fe:63:cd:c8:f0:8f",
            "net9": "22:98:24:ae:94:5b"
        },
        "leaf_2_0_2": {
            "net0": "ce:41:20:c0:86:9a",
            "net1": "e6:77:54:be:e7:1f",
            "net10": "5e:f1:ad:11:f5:2f",
            "net11": "c6:66:a0:54:43:37",
            "net12": "ba:0f:d2:d7:eb:2f",
            "net13": "76:14:eb:b8:4d:4d",
            "net14": "3e:32:0a:16:dd:d5",
            "net2": "b6:32:57:0c:f8:b8",
            "net3": "0e:15:1c:09:9b:53",
            "net4": "a6:7a:ca:bf:49:5b",
            "net5": "e6:0b:5c:55:28:03",
            "net6": "1e:1c:6a:5b:4a:4a",
            "net7": "26:17:12:e3:d9:8c",
            "net8": "12:6d:c6:2a:b1:d1",
            "net9": "fe:27:80:3d:05:97"
        },
        "leaf_2_0_3": {
            "net0": "82:91:d9:8d:0c:bd",
            "net1": "e6:b7:2e:3e:cd:01",
            "net10": "da:61:c3:fd:f2:70",
            "net11": "3a:a4:6c:f0:2e:ef",
            "net12": "f6:43:dd:ad:c0:b9",
            "net13": "ea:e7:b1:5d:30:41",
            "net14": "f2:d4:c5:6b:11:d3",
            "net2": "7a:19:8d:03:db:0c",
            "net3": "46:de:75:ac:c4:59",
            "net4": "96:48:03:37:d5:dc",
            "net5": "be:8b:0a:12:c5:4f",
            "net6": "72:f0:1a:66:38:1a",
            "net7": "5e:36:0d:32:1e:67",
            "net8": "be:c5:90:29:a4:44",
            "net9": "92:9a:61:4e:8a:4e"
        },
        "leaf_2_0_4": {
            "net0": "b2:63:b2:3a:23:e2",
            "net1": "3a:2a:01:bf:d7:7a",
            "net10": "86:a0:cf:28:a8:af",
            "net11": "16:9f:ed:80:b4:b4",
            "net12": "7e:29:2f:af:a3:2e",
            "net13": "6e:61:bd:7d:46:56",
            "net14": "4e:74:a0:36:96:d8",
            "net2": "3a:a2:56:00:2f:32",
            "net3": "ae:6b:14:46:38:ff",
            "net4": "d6:be:16:40:2d:8f",
            "net5": "8e:b9:23:b6:bd:95",
            "net6": "92:7c:e1:4f:51:58",
            "net7": "fe:be:52:df:c8:d1",
            "net8": "1a:79:59:2c:00:43",
            "net9": "6e:2f:48:7f:ef:4b"
        },
        "leaf_2_0_5": {
            "net0": "fa:c2:b4:29:15:2c",
            "net1": "32:0f:ce:fa:0c:66",
            "net10": "3a:52:73:b3:42:48",
            "net11": "66:41:b3:61:04:22",
            "net12": "0e:08:58:ec:16:5d",
            "net13": "32:f2:1c:7c:4d:17",
            "net14": "5e:a5:53:3c:45:fa",
            "net2": "aa:02:85:44:e8:a4",
            "net3": "9a:57:a6:c8:a5:25",
            "net4": "b2:0a:fe:7e:b7:8a",
            "net5": "22:06:90:7a:0d:76",
            "net6": "e2:3e:2d:58:ca:87",
            "net7": "0e:27:90:c1:02:8e",
            "net8": "52:34:48:f7:d8:bf",
            "net9": "4a:c3:1c:9f:08:3e"
        },
        "leaf_2_0_6": {
            "net0": "6a:89:8a:b3:75:10",
            "net1": "4e:9d:9a:89:79:45",
            "net10": "3e:5a:0f:7c:f2:2a",
            "net11": "5a:ea:5b:62:63:97",
            "net12": "56:47:bb:32:35:75",
            "net13": "b2:cd:0a:5f:8c:2c",
            "net14": "8a:2a:46:23:f7:b6",
            "net2": "56:3e:cd:5f:a8:14",
            "net3": "d6:8e:7f:2f:26:f0",
            "net4": "0e:44:ac:80:65:4d",
            "net5": "ce:f5:12:a3:41:5b",
            "net6": "06:75:7e:e4:34:4a",
            "net7": "36:67:2b:5f:fa:e2",
            "net8": "6a:cc:ae:bd:3d:91",
            "net9": "de:7e:f9:d1:5c:c2"
        },
        "leaf_2_0_7": {
            "net0": "fe:cc:7e:35:0a:87",
            "net1": "e2:53:42:9f:8e:6d",
            "net10": "f6:09:59:f3:4f:03",
            "net11": "0e:dd:d6:9b:31:71",
            "net12": "de:52:24:be:f2:5a",
            "net13": "ca:26:4a:a5:57:91",
            "net14": "96:4b:12:41:e7:ed",
            "net2": "92:dd:b3:72:a8:c0",
            "net3": "9e:cd:48:3b:68:07",
            "net4": "0e:72:69:6c:64:66",
            "net5": "82:0d:5f:ee:83:59",
            "net6": "ee:15:b1:46:6b:5e",
            "net7": "1a:20:a7:f5:7e:14",
            "net8": "46:e3:41:92:dc:f9",
            "net9": "9e:37:11:ce:ad:1e"
        },
        "leaf_2_0_8": {
            "net0": "32:2b:68:87:96:29",
            "net1": "42:6f:7e:6d:f5:36",
            "net10": "d2:5c:80:e1:17:24",
            "net11": "6e:96:42:1c:ba:3c",
            "net12": "4a:ff:42:c2:8c:b8",
            "net13": "ee:d3:ea:8a:09:90",
            "net14": "ea:8d:2d:25:41:01",
            "net2": "9a:07:2e:14:9d:23",
            "net3": "76:d0:00:b4:88:fc",
            "net4": "fe:0a:e1:10:e3:54",
            "net5": "1a:4b:47:2b:a8:d5",
            "net6": "ee:72:34:62:6e:b2",
            "net7": "42:0e:81:46:60:f8",
            "net8": "7a:69:5e:b1:af:6c",
            "net9": "b2:02:50:19:30:d3"
        },
        "leaf_2_0_9": {
            "net0": "62:90:6e:da:09:c2",
            "net1": "02:db:bc:6a:94:49",
            "net10": "7a:04:84:fe:af:2d",
            "net11": "16:32:a3:db:56:9b",
            "net12": "3a:8c:c4:37:2d:f0",
            "net13": "ee:23:bb:04:0f:09",
            "net14": "5e:4f:8c:d7:14:a6",
            "net2": "56:eb:2e:7d:00:1b",
            "net3": "0e:1e:75:a0:5a:35",
            "net4": "ea:9a:a5:d3:d3:c0",
            "net5": "fe:7f:b8:33:f9:bd",
            "net6": "ea:e7:17:55:5f:6a",
            "net7": "b2:b7:da:96:97:d7",
            "net8": "a2:f2:26:af:11:e0",
            "net9": "fa:1a:91:27:05:bc"
        },
        "spine_1_1_1": {
            "net0": "da:4f:06:c2:0a:94",
            "net1": "0e:fb:7f:84:9a:4d",
            "net10": "42:f7:5a:1c:cf:92",
            "net11": "f6:a4:74:3b:dc:dd",
            "net12": "e2:f8:47:46:23:65",
            "net13": "be:35:a1:bb:91:02",
            "net14": "de:19:6f:68:c9:04",
            "net15": "6e:4d:44:80:19:db",
            "net16": "b6:46:00:66:5c:c0",
            "net17": "1e:48:80:0a:66:c4",
            "net18": "22:29:0d:7a:2a:92",
            "net19": "12:29:00:41:88:f5",
            "net2": "b6:58:b7:f6:41:e2",
            "net20": "de:a4:12:da:c4:da",
            "net21": "0e:94:f8:c7:24:f0",
            "net22": "ba:88:ed:e0:f6:3f",
            "net23": "12:03:3a:8d:22:ca",
            "net24": "ce:35:ac:f0:65:35",
            "net25": "9a:e8:41:cd:5b:88",
            "net26": "b2:8b:91:d5:ae:72",
            "net27": "ea:e0:8c:0c:42:49",
            "net3": "96:9f:8d:96:3c:fa",
            "net4": "3a:8e:5c:a7:b5:e0",
            "net5": "a6:04:84:6f:e3:d2",
            "net6": "de:4e:e3:d7:8e:c8",
            "net7": "ae:54:ab:35:85:56",
            "net8": "12:5c:90:89:ab:9e",
            "net9": "7a:fa:80:cf:7d:8b"
        },
        "spine_1_1_10": {
            "net0": "7a:95:98:20:a9:7e",
            "net1": "02:c9:49:aa:cb:a3",
            "net10": "86:0a:76:96:c1:10",
            "net11": "42:bf:7a:f9:39:16",
            "net12": "06:48:f0:63:43:26",
            "net13": "da:a1:59:fc:5b:70",
            "net14": "82:aa:51:c8:e6:a0",
            "net15": "be:a4:da:08:95:73",
            "net16": "72:c3:2c:83:5a:ae",
            "net17": "b2:06:3e:39:1b:2f",
            "net18": "b6:2e:98:19:eb:a6",
            "net19": "3e:c4:b1:1c:dc:1a",
            "net2": "ae:b4:7c:57:43:1a",
            "net20": "42:a4:33:94:40:fa",
            "net21": "1e:57:83:76:15:ac",
            "net22": "76:3f:0a:e0:12:ff",
            "net23": "82:0a:48:84:fa:db",
            "net24": "26:2b:4e:7e:bf:c4",
            "net25": "62:12:40:55:37:52",
            "net26": "da:c4:3f:f4:84:85",
            "net27": "82:4d:9d:55:12:57",
            "net3": "9a:bd:d3:ea:02:10",
            "net4": "62:eb:72:e5:26:e3",
            "net5": "66:3d:d4:d6:cf:48",
            "net6": "0e:44:90:b4:1f:57",
            "net7": "5a:7d:25:31:c4:8d",
            "net8": "76:4f:2a:c1:57:8e",
            "net9": "ce:0c:fc:5d:a5:98"
        },
        "spine_1_1_11": {
            "net0": "9a:e8:ef:6a:6a:96",
            "net1": "ee:69:ab:6e:c0:54",
            "net10": "46:1b:65:06:f1:4a",
            "net11": "2a:3d:f1:2a:ce:83",
            "net12": "f6:eb:09:3b:41:22",
            "net13": "96:21:28:2f:91:ef",
            "net14": "6a:43:50:09:13:ee",
            "net15": "5e:a5:56:45:ff:3e",
            "net16": "ae:1b:54:32:4a:e4",
            "net17": "8e:71:42:c4:24:82",
            "net18": "ca:33:ab:59:6c:79",
            "net19": "72:57:6d:b5:3d:88",
            "net2": "ee:59:1c:d9:02:58",
            "net20": "aa:d0:13:13:70:23",
            "net21": "da:e1:bf:b7:32:43",
            "net22": "da:bb:d0:e0:43:4d",
            "net23": "4e:53:2b:41:27:37",
            "net24": "4a:9b:3b:33:85:1f",
            "net25": "ee:07:bf:ce:89:6f",
            "net26": "1a:a1:af:56:db:57",
            "net27": "ae:6f:65:ee:c3:91",
            "net3": "76:9f:fd:5b:fa:19",
            "net4": "d6:a9:7e:6e:95:b5",
            "net5": "96:03:0d:ca:23:fa",
            "net6": "5e:ba:18:bd:f9:d5",
            "net7": "ce:6e:2a:c3:71:67",
            "net8": "fe:bd:a4:ac:fa:fb",
            "net9": "66:d1:df:fd:8a:c1"
        },
        "spine_1_1_12": {
            "net0": "6a:52:11:b1:ef:b5",
            "net1": "4a:75:4e:88:cc:d3",
            "net10": "56:45:a5:02:0b:a4",
            "net11": "e2:f6:a9:45:2a:96",
            "net12": "2a:23:1b:97:9b:9e",
            "net13": "be:59:6f:da:85:c7",
            "net14": "e6:2d:d0:b5:56:71",
            "net15": "da:2b:6e:25:4f:b6",
            "net16": "36:ea:ad:67:99:3c",
            "net17": "ca:b8:56:eb:ac:2d",
            "net18": "0a:9a:52:fa:17:ff",
            "net19": "72:4b:4e:a4:ed:2f",
            "net2": "76:53:66:4f:a4:52",
            "net20": "d2:82:4e:e4:8d:c4",
            "net21": "ee:e8:0e:c5:57:92",
            "net22": "ea:2b:5d:ec:14:5d",
            "net23": "e2:38:10:25:3f:40",
            "net24": "62:b0:5a:16:4a:35",
            "net25": "b6:8c:5b:b6:43:ee",
            "net26": "4a:68:43:9d:5a:f9",
            "net27": "5e:04:f4:71:0c:df",
            "net3": "72:dc:a4:0c:8a:4f",
            "net4": "da:83:a3:e2:2e:fa",
            "net5": "5a:2d:3b:42:30:71",
            "net6": "3e:25:4b:9a:77:d7",
            "net7": "8e:6f:92:d4:1b:c6",
            "net8": "f6:d1:18:32:ab:cf",
            "net9": "5a:72:2a:c8:d3:5b"
        },
        "spine_1_1_13": {
            "net0": "4e:5b:78:d7:3d:08",
            "net1": "e2:6d:7c:6b:2a:96",
            "net10": "62:c6:ce:5d:f0:3f",
            "net11": "0e:4c:c3:e9:ec:9b",
            "net12": "0a:8c:e1:73:24:3e",
            "net13": "b6:8a:43:b6:25:55",
            "net14": "6e:8f:2a:20:d6:84",
            "net15": "b6:b3:da:89:b4:6c",
            "net16": "b2:94:40:80:67:fd",
            "net17": "e2:d3:85:9b:ca:d8",
            "net18": "6e:f0:d2:8d:68:e7",
            "net19": "5a:64:ca:f4:99:68",
            "net2": "72:d3:4c:fe:28:d0",
            "net20": "1a:67:e1:ee:b7:d7",
            "net21": "56:0a:a4:e1:f6:d9",
            "net22": "5a:75:89:6a:42:1e",
            "net23": "12:f5:5c:7e:82:20",
            "net24": "6e:e7:3c:2c:16:c3",
            "net25": "de:47:52:0a:a1:8f",
            "net26": "66:cb:01:5a:db:50",
            "net27": "6e:0c:73:0c:b2:48",
            "net3": "ea:fa:ff:80:99:cc",
            "net4": "5e:ca:e3:03:1f:cf",
            "net5": "fa:b6:da:94:98:13",
            "net6": "0a:c9:a4:34:fa:3d",
            "net7": "4e:cf:59:de:f1:02",
            "net8": "f2:4c:54:89:ad:b4",
            "net9": "0a:08:dc:c7:78:fb"
        },
        "spine_1_1_14": {
            "net0": "ae:0e:8f:50:88:7b",
            "net1": "8e:b8:f6:17:3f:a1",
            "net10": "f2:fb:68:f9:73:de",
            "net11": "06:a5:cf:a7:f4:72",
            "net12": "ea:a4:78:07:be:54",
            "net13": "26:91:25:ea:92:c7",
            "net14": "52:12:7f:99:ba:c5",
            "net15": "da:8b:a5:d5:3b:cb",
            "net16": "82:5c:5a:e9:1f:05",
            "net17": "82:6c:f4:5f:3c:d5",
            "net18": "ba:dc:0d:b5:15:35",
            "net19": "7a:11:66:db:94:26",
            "net2": "16:00:4e:cb:04:c0",
            "net20": "3a:49:ea:f8:3c:75",
            "net21": "ce:ba:3d:9a:36:d9",
            "net22": "b2:70:93:24:ac:bd",
            "net23": "c6:34:3a:0d:87:7a",
            "net24": "f2:58:fa:d0:54:96",
            "net25": "f6:9c:b8:7c:92:f5",
            "net26": "16:8f:ff:f7:d4:78",
            "net27": "4e:bd:16:e2:3a:78",
            "net3": "9a:52:ea:4b:2c:02",
            "net4": "ca:9c:b2:69:ea:f4",
            "net5": "1a:cf:cc:7e:d8:8e",
            "net6": "ca:38:27:f1:c3:46",
            "net7": "36:de:8e:22:80:74",
            "net8": "22:be:9d:e4:f1:e8",
            "net9": "72:40:cc:20:e3:18"
        },
        "spine_1_1_2": {
            "net0": "22:9a:60:58:e2:73",
            "net1": "2a:73:29:69:eb:03",
            "net10": "c2:79:b2:65:03:64",
            "net11": "62:12:1e:7f:1a:2f",
            "net12": "72:ed:53:8f:37:1c",
            "net13": "0a:69:eb:62:2b:2f",
            "net14": "62:80:71:36:5a:21",
            "net15": "72:3a:a9:29:42:f0",
            "net16": "7a:f7:69:03:58:93",
            "net17": "52:3e:10:e8:40:a8",
            "net18": "8a:4f:e0:34:f5:b2",
            "net19": "4a:8f:f1:b7:49:36",
            "net2": "02:f4:b8:78:85:79",
            "net20": "8a:cc:34:89:27:c9",
            "net21": "9a:0e:13:5c:2c:2c",
            "net22": "4e:ae:0a:8f:1e:f4",
            "net23": "42:1f:2d:37:97:3e",
            "net24": "26:fb:fc:b3:bb:11",
            "net25": "92:09:c0:eb:de:cc",
            "net26": "a2:24:04:2f:e5:24",
            "net27": "fe:48:ab:7f:02:b9",
            "net3": "c2:c1:4f:7b:a0:73",
            "net4": "02:78:9c:82:2d:3c",
            "net5": "aa:82:2c:4e:ca:b9",
            "net6": "b6:6e:28:1a:71:8b",
            "net7": "be:c5:10:6f:4b:39",
            "net8": "66:ac:ab:41:25:40",
            "net9": "be:d9:32:1b:1c:1c"
        },
        "spine_1_1_3": {
            "net0": "d2:b9:0f:a2:7c:fe",
            "net1": "1a:e7:f3:30:d5:85",
            "net10": "42:d1:72:07:f8:ec",
            "net11": "62:a1:88:78:d4:0b",
            "net12": "d6:a9:ec:5f:91:f8",
            "net13": "e2:21:0e:81:db:2e",
            "net14": "52:4a:b6:f0:48:64",
            "net15": "a6:43:94:53:6c:72",
            "net16": "3a:de:3f:48:cf:17",
            "net17": "ca:89:50:f1:d1:0b",
            "net18": "32:75:40:f6:9e:14",
            "net19": "86:67:22:54:d1:bb",
            "net2": "ba:71:53:20:0c:d6",
            "net20": "4e:f3:75:49:0c:fc",
            "net21": "ca:cb:c2:b0:0a:0b",
            "net22": "42:0a:b3:d1:ca:80",
            "net23": "3a:85:1a:f2:79:42",
            "net24": "a6:ae:0b:12:6d:f9",
            "net25": "96:ee:e6:af:f9:6d",
            "net26": "3a:31:7b:83:a2:51",
            "net27": "b6:fd:ee:d4:d4:9e",
            "net3": "96:33:da:3e:84:7e",
            "net4": "72:bd:4f:bf:78:c5",
            "net5": "22:dc:4b:ff:90:b6",
            "net6": "b6:ca:ce:9a:c5:ba",
            "net7": "a6:1e:43:06:4d:20",
            "net8": "8a:f3:a5:ee:10:fa",
            "net9": "8a:f7:13:86:bd:b1"
        },
        "spine_1_1_4": {
            "net0": "fe:19:f4:47:12:f2",
            "net1": "ba:88:35:34:fa:26",
            "net10": "0a:15:8a:7e:90:4e",
            "net11": "26:15:e4:18:47:de",
            "net12": "fa:b7:62:87:52:6e",
            "net13": "76:65:dc:b6:59:c9",
            "net14": "9a:6c:f4:51:45:b1",
            "net15": "a2:0e:c9:da:ef:d3",
            "net16": "f2:29:8b:04:2d:53",
            "net17": "e6:cd:b9:76:24:67",
            "net18": "d6:79:6a:5b:75:d3",
            "net19": "f2:75:6f:62:0b:c8",
            "net2": "ae:54:96:fd:79:93",
            "net20": "de:de:66:51:7f:73",
            "net21": "fa:6e:3f:a7:54:48",
            "net22": "ea:3d:0a:16:6c:4c",
            "net23": "fa:55:78:fe:43:75",
            "net24": "0e:76:8b:bd:2b:e1",
            "net25": "56:7d:2e:f5:57:49",
            "net26": "ea:ad:20:02:eb:0d",
            "net27": "1e:51:8b:bd:d3:a4",
            "net3": "22:9e:97:4f:44:9a",
            "net4": "b6:4f:e7:5d:d2:73",
            "net5": "3a:cf:3c:48:47:40",
            "net6": "aa:5c:14:e6:2a:40",
            "net7": "6a:45:bf:5f:ba:45",
            "net8": "c2:ae:58:85:0b:78",
            "net9": "9e:36:17:24:ef:09"
        },
        "spine_1_1_5": {
            "net0": "7e:42:c2:bf:93:12",
            "net1": "9e:fa:01:1c:fc:93",
            "net10": "7a:d7:e5:9b:d3:97",
            "net11": "d6:6e:5e:c9:d6:27",
            "net12": "66:a8:02:f1:72:7e",
            "net13": "be:ef:02:49:f5:3d",
            "net14": "ea:7d:8b:4a:23:73",
            "net15": "6e:16:af:45:15:b2",
            "net16": "92:7d:2b:bc:6a:67",
            "net17": "52:2e:67:9e:fa:2b",
            "net18": "2e:bf:ad:9d:5e:6e",
            "net19": "16:77:10:a2:9f:dc",
            "net2": "7e:ee:2f:5a:7a:3d",
            "net20": "2e:76:b3:a6:67:fc",
            "net21": "42:9d:90:f7:ed:44",
            "net22": "9a:c5:f3:5f:66:09",
            "net23": "26:46:35:9f:4b:52",
            "net24": "ea:d8:25:dc:11:25",
            "net25": "e6:5c:ad:7d:7f:b8",
            "net26": "06:62:25:02:dd:9c",
            "net27": "92:53:0b:10:bc:e2",
            "net3": "e2:3c:9d:3e:47:94",
            "net4": "92:24:f5:ba:f7:6a",
            "net5": "26:d3:32:87:e0:ee",
            "net6": "2a:20:00:d9:94:7c",
            "net7": "12:47:cb:8e:25:0f",
            "net8": "3e:92:f5:df:34:3e",
            "net9": "16:f9:28:2f:39:93"
        },
        "spine_1_1_6": {
            "net0": "12:be:26:6d:d1:05",
            "net1": "2a:2b:0b:97:e1:1e",
            "net10": "46:1c:bf:a6:a1:52",
            "net11": "e2:1b:58:f8:d6:9d",
            "net12": "32:d8:d9:0d:40:8f",
            "net13": "ba:f4:7a:db:81:26",
            "net14": "86:53:ed:bd:1d:85",
            "net15": "9a:b9:19:11:f0:d3",
            "net16": "96:04:1c:2f:87:35",
            "net17": "8a:b0:83:cc:aa:59",
            "net18": "06:fd:81:09:9c:85",
            "net19": "56:27:44:1f:9d:bb",
            "net2": "a6:6d:ea:8e:46:6b",
            "net20": "ea:cf:28:74:71:8c",
            "net21": "22:5f:0f:a6:46:bd",
            "net22": "e6:ca:36:59:5f:74",
            "net23": "52:01:4a:e9:af:67",
            "net24": "36:89:47:43:e2:79",
            "net25": "2e:f7:17:92:1a:55",
            "net26": "9a:f3:a0:24:af:82",
            "net27": "46:cf:bb:68:92:aa",
            "net3": "72:a0:fe:0b:0f:9e",
            "net4": "b6:58:e5:f0:85:6c",
            "net5": "d2:04:bb:0e:36:5d",
            "net6": "c6:2b:e7:48:a9:48",
            "net7": "26:ae:2c:6a:c1:62",
            "net8": "56:48:b0:3e:7c:f2",
            "net9": "56:4b:be:15:82:a4"
        },
        "spine_1_1_7": {
            "net0": "e6:c5:50:f1:2c:2d",
            "net1": "ce:ab:fd:a7:cb:ea",
            "net10": "52:35:ce:c3:84:75",
            "net11": "2e:54:0c:63:13:fd",
            "net12": "ca:b7:e4:f6:16:3f",
            "net13": "12:6b:80:87:3d:4c",
            "net14": "f6:43:e4:ec:d6:6b",
            "net15": "1a:12:cd:68:c0:08",
            "net16": "b2:09:4a:7a:6d:a6",
            "net17": "ae:ac:7c:33:69:f7",
            "net18": "6e:a1:2d:15:84:2d",
            "net19": "22:64:9a:91:06:fe",
            "net2": "76:73:7a:11:e1:3e",
            "net20": "32:a7:78:34:bc:99",
            "net21": "06:21:b7:26:f1:22",
            "net22": "aa:05:44:61:84:be",
            "net23": "1a:fe:64:5e:8a:83",
            "net24": "de:8b:e6:49:1c:92",
            "net25": "fa:d1:06:56:37:59",
            "net26": "f2:98:33:34:0c:2e",
            "net27": "46:95:74:01:26:0f",
            "net3": "ba:14:1e:d0:31:92",
            "net4": "e6:28:c5:fb:e6:92",
            "net5": "be:0f:a3:13:d2:f2",
            "net6": "aa:4d:10:6d:06:27",
            "net7": "26:a3:38:57:1a:e9",
            "net8": "72:3c:7f:23:66:4d",
            "net9": "16:bb:63:44:96:74"
        },
        "spine_1_1_8": {
            "net0": "32:7a:79:48:5a:78",
            "net1": "2e:61:cc:ca:7f:17",
            "net10": "6a:09:4b:20:3b:dc",
            "net11": "6a:c6:43:ba:e9:ca",
            "net12": "86:13:c5:17:af:cc",
            "net13": "ee:70:27:8a:80:da",
            "net14": "e2:03:7d:89:0d:93",
            "net15": "9a:05:cb:63:75:12",
            "net16": "c6:87:e8:c4:82:c8",
            "net17": "3a:c0:b0:80:b8:c5",
            "net18": "56:a3:b7:0a:af:e8",
            "net19": "be:30:65:e0:35:64",
            "net2": "1a:38:7a:62:77:4e",
            "net20": "32:a4:1a:af:b7:10",
            "net21": "8e:2e:aa:4d:fe:53",
            "net22": "da:6f:7e:47:56:61",
            "net23": "fe:30:10:34:9f:44",
            "net24": "56:eb:dc:a2:8c:5f",
            "net25": "a2:b7:92:e8:81:97",
            "net26": "ee:d3:07:f2:98:2f",
            "net27": "86:46:da:b3:78:4f",
            "net3": "46:07:b4:f2:64:d2",
            "net4": "6a:ca:5e:53:6d:90",
            "net5": "7e:9f:81:26:ef:c4",
            "net6": "c6:27:a8:96:af:c5",
            "net7": "a6:c3:fd:10:ac:26",
            "net8": "fa:32:be:2c:d7:eb",
            "net9": "26:f5:e7:a8:59:26"
        },
        "spine_1_1_9": {
            "net0": "36:8c:96:01:84:f2",
            "net1": "6a:b3:9a:42:a7:4a",
            "net10": "02:36:05:ca:5a:fa",
            "net11": "2e:81:39:d3:c4:b3",
            "net12": "ce:94:5c:ae:24:97",
            "net13": "42:8f:57:28:22:d9",
            "net14": "ee:8f:fe:83:db:d4",
            "net15": "e6:18:02:74:94:49",
            "net16": "8a:d1:e0:71:e5:6f",
            "net17": "7e:f7:7b:42:fe:dc",
            "net18": "d6:89:2b:24:56:00",
            "net19": "4e:dc:ce:f7:ab:e8",
            "net2": "26:81:c3:26:f7:07",
            "net20": "9a:94:b6:a5:54:9a",
            "net21": "1a:f8:53:eb:84:11",
            "net22": "86:9c:98:ae:96:c1",
            "net23": "be:2e:f2:a6:65:ef",
            "net24": "fe:7d:f0:57:81:35",
            "net25": "36:22:d6:1b:25:2f",
            "net26": "b6:6b:e0:b3:6d:1f",
            "net27": "36:5d:51:eb:d7:87",
            "net3": "6e:a3:61:ae:c9:06",
            "net4": "c6:6d:4c:61:5a:dc",
            "net5": "6e:62:0a:4f:a1:29",
            "net6": "ee:1e:58:55:3f:02",
            "net7": "ce:79:96:ea:16:d8",
            "net8": "62:45:4d:fa:79:82",
            "net9": "fe:d6:30:99:65:b2"
        },
        "spine_2_1_1": {
            "net0": "62:3d:5b:05:d3:29",
            "net1": "16:57:ce:6a:0f:97",
            "net10": "0a:20:53:b1:1b:b1",
            "net11": "b6:93:74:0d:cb:3e",
            "net12": "0e:ea:45:2a:0c:d0",
            "net13": "fa:f8:b9:bc:d8:c8",
            "net14": "ce:f0:4a:75:05:b3",
            "net15": "a2:3d:cb:48:b4:63",
            "net16": "5e:1e:42:73:91:9b",
            "net17": "9a:fd:77:c2:11:27",
            "net18": "e6:f1:79:b8:20:94",
            "net19": "1a:09:a6:b6:9d:13",
            "net2": "ce:5b:aa:82:8b:0b",
            "net20": "8e:34:50:56:1b:7a",
            "net21": "62:42:15:f1:17:d0",
            "net22": "c6:21:74:59:cb:ae",
            "net23": "8a:1d:6f:3f:92:c3",
            "net24": "ae:a9:57:72:86:4d",
            "net25": "e6:97:c1:ed:ab:af",
            "net26": "06:2d:24:30:cd:40",
            "net27": "ba:31:21:37:42:5f",
            "net3": "be:3f:57:7e:0e:16",
            "net4": "82:f9:c4:d0:41:f0",
            "net5": "16:24:6d:df:9d:31",
            "net6": "76:33:76:f7:0c:c3",
            "net7": "fa:f1:cd:03:59:86",
            "net8": "1a:42:34:d3:03:ee",
            "net9": "f6:33:f8:c6:e2:92"
        },
        "spine_2_1_10": {
            "net0": "76:54:16:5e:e2:2b",
            "net1": "46:41:c0:4e:1f:6f",
            "net10": "46:7a:7f:7e:20:67",
            "net11": "b6:91:e4:51:ea:55",
            "net12": "6a:71:56:3d:84:89",
            "net13": "4e:60:b8:58:51:fa",
            "net14": "86:63:bd:a1:cc:74",
            "net15": "8e:e8:f6:77:27:5b",
            "net16": "32:00:5f:60:1c:a7",
            "net17": "06:7a:20:fc:7f:27",
            "net18": "4a:c1:7d:08:dc:6d",
            "net19": "92:44:9a:6e:5b:d4",
            "net2": "8a:df:97:3c:67:ec",
            "net20": "62:b8:2e:c4:2c:9f",
            "net21": "7a:57:17:34:3f:a0",
            "net22": "d2:5a:4c:00:90:a1",
            "net23": "fa:8c:f4:81:5e:cc",
            "net24": "02:09:b1:c3:a1:d4",
            "net25": "3a:6e:4c:09:a3:75",
            "net26": "12:ab:e2:c4:95:c3",
            "net27": "1a:4a:a9:81:af:99",
            "net3": "ee:c5:70:ae:42:64",
            "net4": "e6:4f:d8:84:a6:c6",
            "net5": "d6:32:4c:e0:f0:90",
            "net6": "ae:fb:2c:56:41:41",
            "net7": "3a:7c:b6:54:fd:3b",
            "net8": "e6:d0:8e:ed:c2:31",
            "net9": "c6:97:23:25:fc:b5"
        },
        "spine_2_1_11": {
            "net0": "ae:32:1e:b4:44:cd",
            "net1": "42:56:0a:70:b5:3a",
            "net10": "2a:f7:f5:0d:b9:58",
            "net11": "fa:9b:b0:6c:00:3a",
            "net12": "12:20:1e:60:f8:76",
            "net13": "f6:7f:9d:dd:1c:9c",
            "net14": "f6:2d:a6:7c:3d:5d",
            "net15": "96:06:a5:99:d3:ad",
            "net16": "3a:e5:15:41:1f:6f",
            "net17": "c2:e3:bc:11:15:25",
            "net18": "a2:25:1b:49:d9:1b",
            "net19": "f6:81:67:7a:1d:12",
            "net2": "8a:b5:d6:3d:f6:ef",
            "net20": "6a:9b:2f:ae:e6:29",
            "net21": "92:ed:19:ac:72:b1",
            "net22": "da:ed:24:84:c9:72",
            "net23": "3e:bf:49:df:b4:c2",
            "net24": "4a:3b:28:4b:fc:9c",
            "net25": "f2:20:3f:be:20:0a",
            "net26": "b6:5a:46:20:78:88",
            "net27": "a2:a3:35:56:f1:8f",
            "net3": "ea:15:46:43:0b:15",
            "net4": "3a:0e:9b:94:ca:79",
            "net5": "d2:2a:09:87:94:f5",
            "net6": "ca:1c:7f:90:cf:82",
            "net7": "0a:4b:ec:bc:51:bb",
            "net8": "4a:27:46:53:30:ac",
            "net9": "9a:63:24:d2:91:b0"
        },
        "spine_2_1_12": {
            "net0": "42:9d:6e:98:fb:7d",
            "net1": "ee:38:02:81:7b:e8",
            "net10": "86:a1:05:58:9e:14",
            "net11": "1a:d6:f1:fb:e7:59",
            "net12": "6e:b7:c3:11:d7:b1",
            "net13": "82:63:d8:58:48:5c",
            "net14": "0a:2d:1b:c5:1f:b6",
            "net15": "a6:bc:b1:26:7e:c3",
            "net16": "5e:61:61:ad:96:aa",
            "net17": "8a:b7:94:65:56:12",
            "net18": "e2:21:d6:d0:4d:5d",
            "net19": "92:97:64:cb:81:ff",
            "net2": "4e:e6:85:96:48:66",
            "net20": "8e:1e:cb:bb:44:0b",
            "net21": "96:1e:dc:20:05:c9",
            "net22": "52:b7:da:7a:17:aa",
            "net23": "5a:53:63:8a:6d:86",
            "net24": "ea:b7:64:4e:57:72",
            "net25": "f6:36:ad:72:ac:0c",
            "net26": "be:da:17:45:6b:d1",
            "net27": "3a:c0:3c:ad:89:51",
            "net3": "de:54:2c:6d:88:a1",
            "net4": "96:33:cd:07:59:ee",
            "net5": "72:5e:fa:33:8b:0e",
            "net6": "fe:81:d7:54:80:6d",
            "net7": "3e:fa:7b:ed:e4:17",
            "net8": "12:85:b1:e7:1f:4d",
            "net9": "6a:7e:b5:23:52:6b"
        },
        "spine_2_1_13": {
            "net0": "6a:a6:8e:19:0e:2f",
            "net1": "ba:14:3e:07:be:63",
            "net10": "5e:96:6a:74:0d:58",
            "net11": "6a:7a:b2:ab:c3:0e",
            "net12": "fa:79:85:bf:df:98",
            "net13": "fe:54:67:81:70:22",
            "net14": "5e:e6:6b:0e:33:3b",
            "net15": "5e:7f:2b:41:2c:86",
            "net16": "fe:ad:85:3d:f4:d0",
            "net17": "a6:5f:2b:b4:af:54",
            "net18": "3e:ed:1a:cd:ad:d1",
            "net19": "6e:05:fd:b8:5d:c3",
            "net2": "6a:f2:9a:0c:76:0a",
            "net20": "6e:f7:27:84:45:59",
            "net21": "8e:62:0c:73:43:ee",
            "net22": "8e:66:7a:24:ba:d6",
            "net23": "7e:60:6a:8c:b4:e7",
            "net24": "c2:38:f1:75:09:47",
            "net25": "3e:94:2e:3f:0a:d9",
            "net26": "d2:fe:71:44:6e:34",
            "net27": "b6:67:16:c4:63:38",
            "net3": "72:0e:02:3f:c5:f3",
            "net4": "1e:fb:d7:10:71:5b",
            "net5": "ae:8d:2f:fd:ee:f6",
            "net6": "fe:83:e4:b3:40:e1",
            "net7": "06:93:1c:11:3b:2f",
            "net8": "0a:30:11:d6:04:71",
            "net9": "3e:24:f1:92:38:ec"
        },
        "spine_2_1_14": {
            "net0": "1a:ec:78:38:13:0f",
            "net1": "76:67:80:85:6a:e4",
            "net10": "ca:47:6c:55:c3:06",
            "net11": "be:4c:d9:f0:a0:b7",
            "net12": "3a:01:cf:3a:a8:7f",
            "net13": "62:ed:a6:bb:05:19",
            "net14": "3e:9c:ca:2a:15:3c",
            "net15": "c2:36:82:63:67:f9",
            "net16": "32:fa:14:0a:0a:8e",
            "net17": "42:79:d7:06:fe:34",
            "net18": "72:e5:82:03:8d:27",
            "net19": "0a:47:92:cd:48:f1",
            "net2": "3a:aa:76:7f:b1:b2",
            "net20": "7a:08:6c:2b:a9:88",
            "net21": "42:08:af:5f:c7:28",
            "net22": "1e:82:11:76:8c:fc",
            "net23": "1a:4f:78:e2:35:e7",
            "net24": "26:0b:97:5f:61:80",
            "net25": "42:63:ea:6c:8e:eb",
            "net26": "da:ce:cb:41:e8:ab",
            "net27": "52:bf:73:89:f1:e9",
            "net3": "de:b4:4a:c3:d0:33",
            "net4": "7e:0c:9e:8a:58:d7",
            "net5": "c2:1a:80:a1:4d:b3",
            "net6": "62:c5:de:34:f5:42",
            "net7": "62:e0:92:7d:3e:e8",
            "net8": "76:38:42:b9:12:c0",
            "net9": "fe:6b:9e:a2:87:64"
        },
        "spine_2_1_2": {
            "net0": "3a:da:59:c5:bb:c9",
            "net1": "fa:dd:68:2a:21:54",
            "net10": "c6:0b:3b:c9:40:ae",
            "net11": "e2:b4:d4:b7:b5:0f",
            "net12": "c2:2b:f4:23:04:e5",
            "net13": "42:82:5d:4e:f2:e9",
            "net14": "f6:13:5b:a1:f9:cf",
            "net15": "2a:4b:fb:27:fd:b1",
            "net16": "72:b8:a9:ea:91:4c",
            "net17": "6e:e1:42:67:44:d1",
            "net18": "d2:7a:90:21:58:c3",
            "net19": "96:cb:c1:a7:aa:d0",
            "net2": "9e:42:b5:24:42:68",
            "net20": "82:62:67:1f:e4:4e",
            "net21": "b2:c7:58:4e:34:3b",
            "net22": "fe:bc:c6:b6:1c:ec",
            "net23": "02:ec:1d:a7:5f:0f",
            "net24": "8e:ff:df:20:30:00",
            "net25": "9a:6a:61:b0:22:7e",
            "net26": "f2:3a:3d:dd:8e:56",
            "net27": "ae:4e:34:3c:86:25",
            "net3": "86:88:6b:77:62:1c",
            "net4": "d6:e8:4a:6b:67:24",
            "net5": "ae:95:a4:6c:3a:94",
            "net6": "de:ea:ae:33:d7:50",
            "net7": "a2:f9:0a:d0:d2:2e",
            "net8": "5a:3a:29:ff:9b:21",
            "net9": "ba:e6:97:ae:9b:42"
        },
        "spine_2_1_3": {
            "net0": "86:8d:d6:ac:99:69",
            "net1": "6a:ea:4c:0c:e2:1e",
            "net10": "36:3e:76:43:fb:66",
            "net11": "de:f9:19:06:a7:51",
            "net12": "0e:6b:05:78:65:4a",
            "net13": "ea:f4:f2:c1:fb:0b",
            "net14": "b6:a4:44:7b:1b:ea",
            "net15": "b6:e0:b4:13:07:3c",
            "net16": "7e:e4:ac:ff:03:4e",
            "net17": "b6:25:8b:7a:7b:90",
            "net18": "76:b2:d9:22:7c:43",
            "net19": "26:a7:04:30:e3:6c",
            "net2": "ee:7a:8d:cb:5a:a8",
            "net20": "c6:b7:d5:b1:8c:08",
            "net21": "ca:00:6b:89:3b:2a",
            "net22": "8e:08:6a:19:fc:5d",
            "net23": "42:e9:ba:fb:15:33",
            "net24": "de:e8:bd:e1:3f:6c",
            "net25": "f6:93:d5:c1:25:6e",
            "net26": "62:d3:ea:2a:95:44",
            "net27": "6a:27:83:9d:7a:b6",
            "net3": "16:47:b1:c9:80:ea",
            "net4": "d2:bf:00:67:1f:63",
            "net5": "d6:03:fa:de:3f:c4",
            "net6": "de:05:e7:08:af:54",
            "net7": "42:f5:42:92:c1:7f",
            "net8": "9e:10:7c:33:16:c6",
            "net9": "a6:e0:bf:65:96:0e"
        },
        "spine_2_1_4": {
            "net0": "9e:fe:a3:b3:45:f3",
            "net1": "4e:84:f5:0d:47:81",
            "net10": "72:af:58:ac:14:63",
            "net11": "f6:f0:76:f2:d0:33",
            "net12": "7a:6f:cf:b4:ee:b9",
            "net13": "a2:5d:7f:d5:bc:44",
            "net14": "be:48:65:90:b6:db",
            "net15": "82:e7:27:10:13:f2",
            "net16": "26:08:4b:ad:02:99",
            "net17": "1e:00:5d:ff:c2:5a",
            "net18": "0a:32:6e:ab:0d:f4",
            "net19": "0a:12:55:f8:2e:1c",
            "net2": "f2:09:07:45:be:44",
            "net20": "8a:12:e5:b7:0f:b4",
            "net21": "d6:d6:e4:09:27:ca",
            "net22": "36:70:b9:6e:d1:70",
            "net23": "16:93:ef:49:60:43",
            "net24": "e2:d3:bf:15:06:34",
            "net25": "16:a6:98:50:44:03",
            "net26": "36:d6:14:67:b2:15",
            "net27": "16:84:90:30:bb:40",
            "net3": "52:f8:54:e6:2c:5f",
            "net4": "62:aa:e6:d4:49:91",
            "net5": "a6:2c:d6:87:6e:b2",
            "net6": "66:c8:23:75:94:f4",
            "net7": "9a:66:68:5c:5e:b6",
            "net8": "ae:7a:6b:54:7b:3e",
            "net9": "ea:46:b0:5e:0f:5c"
        },
        "spine_2_1_5": {
            "net0": "5a:87:40:6a:bd:33",
            "net1": "1e:09:f8:16:07:a5",
            "net10": "ae:f1:9a:a2:6a:84",
            "net11": "02:2f:9c:d1:af:97",
            "net12": "aa:c6:61:54:e2:08",
            "net13": "ae:f8:76:37:a2:e9",
            "net14": "7e:ce:e0:76:32:f1",
            "net15": "b2:6e:e8:98:46:de",
            "net16": "8a:70:6b:79:22:2f",
            "net17": "2a:30:f6:36:c6:4a",
            "net18": "96:3f:88:74:98:3a",
            "net19": "36:26:bf:ec:f7:94",
            "net2": "5e:0f:9d:13:b1:19",
            "net20": "42:ca:95:74:65:9c",
            "net21": "c6:99:e8:1a:79:fe",
            "net22": "6e:5b:59:b9:f0:ae",
            "net23": "fa:49:fb:4e:0f:13",
            "net24": "9a:1c:2c:22:8a:b4",
            "net25": "be:6f:bc:ed:dc:aa",
            "net26": "06:da:7b:64:8f:3b",
            "net27": "e2:15:c3:b4:88:53",
            "net3": "ae:1a:d5:51:4b:48",
            "net4": "92:97:2c:ed:3e:d2",
            "net5": "22:0a:81:2d:57:a4",
            "net6": "e6:d4:42:b8:67:97",
            "net7": "4a:87:10:99:32:0a",
            "net8": "c6:fe:5b:e0:c7:7c",
            "net9": "26:bc:67:d0:6c:e3"
        },
        "spine_2_1_6": {
            "net0": "5a:61:b8:4e:6b:77",
            "net1": "c2:57:ad:ff:cc:04",
            "net10": "fa:b8:d5:8b:52:95",
            "net11": "c2:c2:b8:2b:71:96",
            "net12": "46:22:76:b4:ed:98",
            "net13": "ce:75:7c:fc:79:52",
            "net14": "2e:d9:6d:f2:0e:3a",
            "net15": "ba:f0:3c:9f:de:49",
            "net16": "9a:b4:fb:77:18:af",
            "net17": "46:17:77:ba:2a:cb",
            "net18": "5a:11:9d:9d:a6:c3",
            "net19": "a2:70:80:16:0c:d2",
            "net2": "a6:37:76:64:3d:83",
            "net20": "e2:00:10:03:39:b7",
            "net21": "ee:14:56:01:22:e4",
            "net22": "42:b2:06:a6:18:d6",
            "net23": "ae:04:e7:15:9a:10",
            "net24": "1e:92:d1:6a:80:35",
            "net25": "7e:30:63:cd:ea:99",
            "net26": "ce:11:6b:95:5f:ee",
            "net27": "f2:ae:20:da:6b:48",
            "net3": "02:fc:29:64:71:4d",
            "net4": "52:27:65:ea:29:b6",
            "net5": "02:8e:0f:11:81:05",
            "net6": "6a:aa:37:09:07:83",
            "net7": "26:03:00:90:db:f0",
            "net8": "42:4f:13:42:46:55",
            "net9": "a6:04:a0:10:9e:c3"
        },
        "spine_2_1_7": {
            "net0": "32:5d:05:13:3d:0c",
            "net1": "72:42:77:a2:ae:cc",
            "net10": "26:f3:c5:a6:c1:29",
            "net11": "56:26:16:68:da:8a",
            "net12": "f6:b3:5e:e3:36:da",
            "net13": "82:8d:ef:d7:dc:54",
            "net14": "96:07:a3:6b:9b:ce",
            "net15": "62:e7:50:fa:ab:0c",
            "net16": "76:56:91:fb:ca:79",
            "net17": "26:5f:a9:4f:d3:7e",
            "net18": "56:fb:b3:60:cb:5c",
            "net19": "a2:28:1c:23:7e:b5",
            "net2": "42:76:30:6d:40:96",
            "net20": "0e:1d:15:4e:2f:4e",
            "net21": "4e:20:e6:c9:97:6a",
            "net22": "0e:23:37:31:89:33",
            "net23": "2e:15:a9:a0:66:7d",
            "net24": "0a:ec:c0:81:0f:ac",
            "net25": "0a:92:3a:73:4e:f3",
            "net26": "d6:05:a3:94:a9:b4",
            "net27": "8e:5a:45:fc:f1:46",
            "net3": "9a:d6:9a:7e:76:78",
            "net4": "56:d2:fb:72:1a:dc",
            "net5": "7a:83:e3:1e:c9:fd",
            "net6": "92:c4:98:44:99:72",
            "net7": "4e:f1:af:6a:d7:75",
            "net8": "f6:fa:e2:1e:ad:82",
            "net9": "26:ef:18:54:ab:fb"
        },
        "spine_2_1_8": {
            "net0": "4e:f7:3b:f2:b1:15",
            "net1": "da:3c:99:d8:17:d9",
            "net10": "e2:ea:f7:5a:ab:72",
            "net11": "ce:c2:88:37:81:ac",
            "net12": "e2:d1:d3:44:e2:ef",
            "net13": "8e:4e:9c:67:1d:18",
            "net14": "5a:e1:1b:8b:34:b1",
            "net15": "9a:8c:03:b1:a1:b2",
            "net16": "f6:18:71:36:3e:a8",
            "net17": "16:77:e7:39:5b:43",
            "net18": "fe:ba:0a:51:13:b6",
            "net19": "66:4f:83:e6:b3:fb",
            "net2": "36:b2:4c:e2:16:b7",
            "net20": "c2:3e:d1:28:15:20",
            "net21": "32:fa:65:1a:6c:ca",
            "net22": "72:bf:29:97:ca:8d",
            "net23": "06:bd:87:4c:89:3b",
            "net24": "72:bb:33:07:d7:52",
            "net25": "86:d8:22:19:9b:15",
            "net26": "d6:9a:47:1b:5a:f0",
            "net27": "ba:2c:fd:19:37:47",
            "net3": "5e:22:25:8c:25:7e",
            "net4": "f6:2b:2d:ae:1e:da",
            "net5": "76:00:4a:36:61:51",
            "net6": "42:86:9a:bb:7d:7e",
            "net7": "0a:3d:61:2e:08:52",
            "net8": "8a:ec:af:15:ff:51",
            "net9": "5e:d7:cf:e4:75:7d"
        },
        "spine_2_1_9": {
            "net0": "66:7e:95:b9:b1:01",
            "net1": "4a:7e:39:c0:dc:92",
            "net10": "aa:dd:45:87:df:c6",
            "net11": "76:bf:ea:39:2e:90",
            "net12": "e6:1d:4f:ce:ab:b7",
            "net13": "76:a6:86:f6:66:e8",
            "net14": "42:6d:7c:23:81:ba",
            "net15": "f6:20:c1:4e:01:7f",
            "net16": "82:f6:8b:4a:70:f1",
            "net17": "7e:7b:79:b9:61:0b",
            "net18": "92:c1:fd:56:de:4b",
            "net19": "1e:22:52:0d:22:5e",
            "net2": "46:f9:92:22:f5:0f",
            "net20": "52:f9:12:13:35:8c",
            "net21": "ce:e0:93:0d:4c:47",
            "net22": "52:4e:d4:d8:9d:47",
            "net23": "ba:6c:c8:ed:78:6a",
            "net24": "ee:77:d2:02:1c:49",
            "net25": "ea:4a:23:6b:49:25",
            "net26": "a2:ff:7b:2b:ca:b6",
            "net27": "a6:26:e7:fe:61:0a",
            "net3": "4a:25:ee:7e:8f:86",
            "net4": "9a:06:bd:e6:6a:b4",
            "net5": "1e:ac:e0:cb:a8:22",
            "net6": "5a:83:c2:28:35:40",
            "net7": "a6:a4:b6:6d:33:56",
            "net8": "92:18:6d:d3:d7:46",
            "net9": "d6:b2:6a:f0:1d:db"
        },
        "tof_1_2_1": {
            "net0": "b6:e7:7f:e9:da:de",
            "net1": "76:73:00:06:ab:ba",
            "net10": "ce:9f:e3:33:6c:e4",
            "net11": "ee:18:ec:1e:ab:4d",
            "net12": "fe:9b:b6:55:0a:17",
            "net13": "7e:0a:05:f6:42:90",
            "net14": "ce:cc:11:5c:72:3f",
            "net15": "66:89:21:bb:fd:a6",
            "net16": "ae:ba:75:97:3b:5b",
            "net17": "ca:ca:5c:0a:c1:32",
            "net18": "46:8c:b7:c7:23:e9",
            "net19": "7a:4a:a4:cd:f8:91",
            "net2": "c6:bf:e0:c7:ac:e3",
            "net20": "e6:8a:b6:7e:06:6c",
            "net21": "d6:02:40:c7:95:03",
            "net22": "3e:02:f2:a2:4f:e6",
            "net23": "46:6b:14:0f:c6:ae",
            "net24": "4a:aa:5d:01:fc:72",
            "net25": "aa:65:bb:8b:ce:b9",
            "net26": "5a:7c:f2:2a:c8:60",
            "net27": "a2:89:7a:d2:73:6c",
            "net3": "3a:0b:1a:6c:2c:a5",
            "net4": "0e:e8:65:75:32:73",
            "net5": "9e:54:0c:25:1d:a2",
            "net6": "36:29:16:fe:49:05",
            "net7": "ae:a9:11:f2:3e:4f",
            "net8": "b2:b1:60:b6:65:0f",
            "net9": "f2:93:f8:15:81:ec"
        },
        "tof_1_2_10": {
            "net0": "fa:00:ec:a3:cb:56",
            "net1": "3e:d9:96:58:db:25",
            "net10": "86:64:69:b8:29:6a",
            "net11": "76:b0:35:f9:aa:4d",
            "net12": "e2:7a:77:04:00:29",
            "net13": "d2:13:ec:1c:63:5b",
            "net14": "02:c2:de:ca:7c:f1",
            "net15": "da:a1:78:b8:60:55",
            "net16": "ae:7d:8e:b6:01:7b",
            "net17": "5a:d5:f6:35:be:a4",
            "net18": "4a:71:1a:fc:bc:f5",
            "net19": "72:45:d0:28:21:d3",
            "net2": "72:fc:6d:ff:e9:04",
            "net20": "c2:37:c7:ef:8d:98",
            "net21": "7a:d1:8d:9a:05:ea",
            "net22": "da:95:d0:4a:9e:ed",
            "net23": "c6:db:39:de:38:a6",
            "net24": "2a:f9:fb:be:f1:e3",
            "net25": "7e:85:66:98:26:0e",
            "net26": "be:63:cd:79:ad:79",
            "net27": "52:cb:f2:73:90:aa",
            "net3": "42:56:51:b3:4f:89",
            "net4": "be:9f:5c:38:34:ce",
            "net5": "3a:9f:55:f9:38:c0",
            "net6": "4a:63:2c:4d:52:8d",
            "net7": "3a:2e:ea:8e:5b:43",
            "net8": "7e:e2:aa:06:62:92",
            "net9": "aa:53:6e:35:d3:a0"
        },
        "tof_1_2_11": {
            "net0": "be:86:85:4b:95:df",
            "net1": "66:7d:0e:08:55:a0",
            "net10": "8a:f4:73:29:0d:8b",
            "net11": "ae:f4:a4:a9:8e:3c",
            "net12": "ce:73:6f:c1:16:89",
            "net13": "66:c3:34:50:03:cf",
            "net14": "3e:c4:6a:12:e4:cf",
            "net15": "2e:86:e0:13:c1:51",
            "net16": "f2:d6:3e:5e:b7:fb",
            "net17": "9a:af:39:f0:77:10",
            "net18": "de:9b:cd:55:85:43",
            "net19": "56:ae:91:c8:06:de",
            "net2": "76:61:91:8d:a0:ac",
            "net20": "1a:b1:b2:5f:88:26",
            "net21": "5e:49:53:06:0a:61",
            "net22": "7a:43:46:7b:f0:4c",
            "net23": "a6:77:87:8c:68:8f",
            "net24": "ce:f3:67:6c:0e:2e",
            "net25": "4a:62:22:60:c2:f3",
            "net26": "d6:fa:cb:85:af:1e",
            "net27": "2e:7f:7e:cc:46:93",
            "net3": "96:17:de:36:21:4e",
            "net4": "ee:79:02:18:d1:41",
            "net5": "06:3a:dc:3f:7d:ab",
            "net6": "7e:c7:12:9c:07:d9",
            "net7": "a6:9d:2b:b5:15:13",
            "net8": "8a:29:81:0c:ac:30",
            "net9": "b6:54:0a:aa:de:96"
        },
        "tof_1_2_12": {
            "net0": "7e:22:bf:4b:9c:a5",
            "net1": "3e:2f:8d:c3:fb:8c",
            "net10": "46:68:7c:93:8b:41",
            "net11": "62:fa:e0:3b:17:9e",
            "net12": "fa:8f:5c:82:e4:1c",
            "net13": "aa:51:55:c3:1f:b7",
            "net14": "8a:94:55:86:b6:95",
            "net15": "e2:cd:e5:74:bf:0a",
            "net16": "1e:fb:38:4b:c9:d8",
            "net17": "aa:94:91:6c:cc:a3",
            "net18": "56:48:80:5a:b6:8f",
            "net19": "72:18:74:e1:5d:34",
            "net2": "c6:9f:94:eb:b5:b8",
            "net20": "ca:27:da:22:04:b7",
            "net21": "de:07:35:a1:53:33",
            "net22": "1a:c6:cf:e9:36:c5",
            "net23": "7e:29:8c:b7:50:ff",
            "net24": "ba:a8:6a:83:ea:9a",
            "net25": "36:14:15:4d:c4:f6",
            "net26": "ae:3f:34:30:15:b2",
            "net27": "2e:7d:8c:5a:95:84",
            "net3": "c6:1e:46:f8:80:59",
            "net4": "8a:4e:b4:a3:17:90",
            "net5": "fa:6f:f6:1a:02:fe",
            "net6": "ee:aa:f4:c3:4b:bb",
            "net7": "f6:6c:0f:bd:4c:24",
            "net8": "8e:5e:89:7b:5c:92",
            "net9": "b6:ff:72:99:eb:1b"
        },
        "tof_1_2_13": {
            "net0": "12:ef:3e:a0:a5:ae",
            "net1": "06:85:5d:96:77:73",
            "net10": "7e:d2:73:b1:b1:d5",
            "net11": "66:03:94:1a:e8:61",
            "net12": "1e:a9:bd:a2:fb:4b",
            "net13": "56:63:42:85:d2:f2",
            "net14": "6e:f6:2d:0f:e6:e6",
            "net15": "7a:53:62:17:6e:8e",
            "net16": "1e:5e:e9:53:82:9e",
            "net17": "6e:c7:eb:b1:1f:03",
            "net18": "fa:ad:2b:da:61:d9",
            "net19": "a2:df:af:df:8b:0f",
            "net2": "ae:f0:3e:8d:2f:db",
            "net20": "b6:59:48:95:af:0c",
            "net21": "fe:92:6f:30:d8:fc",
            "net22": "0e:2b:df:43:6a:a8",
            "net23": "8a:01:53:9d:b7:3d",
            "net24": "f6:74:02:fa:cd:2e",
            "net25": "56:d9:71:5b:bc:0b",
            "net26": "d6:3e:8e:21:f3:6e",
            "net27": "96:1b:c8:d5:ca:30",
            "net3": "7a:36:bf:a1:88:ff",
            "net4": "92:0c:67:3f:d7:9d",
            "net5": "5e:7f:8c:ae:d0:ab",
            "net6": "ea:69:75:cc:70:02",
            "net7": "0a:f0:46:8e:e7:56",
            "net8": "f6:98:c9:68:5e:0a",
            "net9": "8e:21:45:0c:ad:61"
        },
        "tof_1_2_14": {
            "net0": "c2:b6:1d:dc:53:69",
            "net1": "2a:61:7f:73:07:ab",
            "net10": "52:b1:fc:f2:8f:2c",
            "net11": "56:d6:de:ec:c1:b2",
            "net12": "e6:0f:24:da:2a:0a",
            "net13": "2a:86:2e:90:10:f1",
            "net14": "a2:1e:3f:c9:41:5f",
            "net15": "ee:5a:3c:da:88:b9",
            "net16": "fa:08:23:21:c9:40",
            "net17": "42:6f:67:7a:2d:cc",
            "net18": "8e:7f:47:2f:4d:56",
            "net19": "b6:5e:6d:b7:e5:61",
            "net2": "56:bb:d2:cc:11:4b",
            "net20": "56:84:81:c6:44:d1",
            "net21": "8a:cb:2a:fc:d7:2d",
            "net22": "06:c6:2f:60:e1:fb",
            "net23": "ba:53:8d:8e:6c:be",
            "net24": "f2:2e:de:52:69:7a",
            "net25": "de:e9:96:e7:68:96",
            "net26": "56:ce:5d:a6:b5:93",
            "net27": "4e:28:db:b0:4d:a5",
            "net3": "32:3a:c2:c7:81:0c",
            "net4": "36:69:b2:40:1d:c9",
            "net5": "da:fb:26:63:67:a4",
            "net6": "3e:e3:1f:12:7a:86",
            "net7": "06:5d:97:37:f4:28",
            "net8": "ea:29:c6:ae:d9:46",
            "net9": "ba:e7:1c:c9:44:be"
        },
        "tof_1_2_2": {
            "net0": "7e:f7:44:1d:92:f5",
            "net1": "ba:48:8d:25:29:1b",
            "net10": "86:1d:28:c5:12:f3",
            "net11": "76:9a:3c:8c:ae:08",
            "net12": "8a:5d:69:b1:6d:44",
            "net13": "a2:17:46:60:a0:1f",
            "net14": "be:43:e0:59:7e:86",
            "net15": "72:87:8d:76:73:0a",
            "net16": "c2:48:59:71:3c:88",
            "net17": "a6:c8:77:d1:a6:b6",
            "net18": "5e:59:20:9e:cb:45",
            "net19": "ee:b8:34:a1:72:b0",
            "net2": "ce:1b:1e:3e:62:5c",
            "net20": "be:af:f4:d7:56:87",
            "net21": "22:c0:ab:e4:69:e2",
            "net22": "0a:a0:f0:85:bd:df",
            "net23": "be:19:aa:ee:83:77",
            "net24": "a2:fc:93:f7:30:a7",
            "net25": "f2:de:66:f0:b9:11",
            "net26": "c2:1b:35:b7:74:bd",
            "net27": "c2:47:57:c4:ee:14",
            "net3": "56:44:fb:c3:d6:3c",
            "net4": "0e:42:77:c6:7c:95",
            "net5": "ee:ce:b6:4e:5d:45",
            "net6": "0a:a4:d2:ba:fd:b1",
            "net7": "be:ce:4a:ab:ce:89",
            "net8": "02:17:55:b8:ca:83",
            "net9": "5e:b5:81:04:eb:e9"
        },
        "tof_1_2_3": {
            "net0": "de:d6:6e:a9:b1:b6",
            "net1": "c2:58:c6:c2:29:3c",
            "net10": "76:3b:cf:a4:49:7c",
            "net11": "32:9e:b5:3a:29:bf",
            "net12": "92:a3:d7:a8:b6:5d",
            "net13": "7e:1e:e3:c5:b0:6e",
            "net14": "02:67:e3:8a:22:1f",
            "net15": "42:bc:be:8f:5b:6c",
            "net16": "4a:73:6e:55:f5:3c",
            "net17": "26:fa:d3:f5:ed:91",
            "net18": "46:3c:54:c9:81:b1",
            "net19": "26:d6:d8:05:2d:97",
            "net2": "9e:8e:f3:81:2a:bf",
            "net20": "c6:ac:21:72:fd:b6",
            "net21": "22:b5:c5:9d:19:4c",
            "net22": "a2:6c:52:eb:10:9e",
            "net23": "ee:a4:70:19:2f:bf",
            "net24": "1a:a2:c1:e0:4a:3d",
            "net25": "0e:75:0c:bb:41:12",
            "net26": "ae:05:14:fd:54:14",
            "net27": "da:a4:25:48:fc:ec",
            "net3": "7e:4f:4e:fc:6a:ca",
            "net4": "52:e0:ec:ff:01:e9",
            "net5": "86:60:67:3d:19:7f",
            "net6": "ce:cd:dd:cc:22:c9",
            "net7": "96:04:50:c2:f3:1b",
            "net8": "9e:1a:dd:d9:9c:e7",
            "net9": "86:c7:4f:77:b8:4a"
        },
        "tof_1_2_4": {
            "net0": "f6:91:61:a7:4a:b3",
            "net1": "82:2c:25:6c:cb:04",
            "net10": "06:d7:2d:e9:f8:95",
            "net11": "a2:ba:80:d3:98:4c",
            "net12": "a6:82:a1:38:b9:1a",
            "net13": "b6:b7:bd:1a:65:62",
            "net14": "9a:2d:eb:0c:c9:25",
            "net15": "6a:d5:6b:da:f6:dd",
            "net16": "9a:ed:44:1b:5b:26",
            "net17": "b6:62:49:68:a0:2c",
            "net18": "9e:ba:7a:02:d4:8c",
            "net19": "3e:09:58:3a:ef:ee",
            "net2": "f6:39:cb:7b:7f:59",
            "net20": "0a:8f:86:65:df:9f",
            "net21": "32:61:68:8d:37:ee",
            "net22": "a6:38:47:d9:54:0f",
            "net23": "52:0e:d5:98:1e:6b",
            "net24": "2a:8e:a0:f0:33:8b",
            "net25": "c6:65:74:19:73:f0",
            "net26": "f6:61:1f:30:cc:9b",
            "net27": "26:be:fb:d6:cc:10",
            "net3": "d2:4e:f8:12:3d:e0",
            "net4": "a6:9a:33:78:a1:da",
            "net5": "e6:5a:a7:7f:73:cb",
            "net6": "de:7a:6a:d3:10:45",
            "net7": "4e:be:8d:62:f3:21",
            "net8": "da:ce:7f:06:5f:61",
            "net9": "a2:d0:d3:fd:69:03"
        },
        "tof_1_2_5": {
            "net0": "72:db:fd:12:d5:42",
            "net1": "3a:b4:d8:64:5b:fe",
            "net10": "ce:ee:64:7b:a3:97",
            "net11": "de:a7:1a:76:12:5f",
            "net12": "02:aa:e6:63:f5:f7",
            "net13": "76:21:a2:77:cd:03",
            "net14": "c2:fd:fb:da:ce:df",
            "net15": "5a:0f:c1:d6:53:e5",
            "net16": "46:a7:9a:4b:da:81",
            "net17": "d2:f3:79:f0:c9:e9",
            "net18": "86:f1:4d:2b:b7:69",
            "net19": "e2:cd:eb:1d:c0:20",
            "net2": "b2:82:7f:e4:21:9d",
            "net20": "ca:18:76:09:6f:6a",
            "net21": "ba:57:9e:60:fd:d8",
            "net22": "46:a8:f8:56:e9:ec",
            "net23": "ba:91:96:dc:bb:71",
            "net24": "4a:4a:4e:51:f4:44",
            "net25": "ee:0e:3f:06:74:e5",
            "net26": "c2:41:0c:3a:ff:95",
            "net27": "2a:19:7a:0d:56:31",
            "net3": "c6:0d:b3:52:7b:66",
            "net4": "0e:cb:9b:b0:c6:e2",
            "net5": "62:b0:06:e7:05:83",
            "net6": "02:e2:73:e1:69:97",
            "net7": "02:4a:db:dc:5c:3e",
            "net8": "3e:a2:58:96:65:35",
            "net9": "c2:2a:48:d4:f0:7a"
        },
        "tof_1_2_6": {
            "net0": "6a:29:d4:74:57:c8",
            "net1": "32:32:9a:f1:14:87",
            "net10": "1a:26:82:cb:b9:e7",
            "net11": "ce:e0:c6:4d:b4:95",
            "net12": "d6:cb:01:f3:fc:2c",
            "net13": "aa:25:4a:fc:6d:8f",
            "net14": "16:f9:72:11:ba:c8",
            "net15": "66:0b:8e:f9:7e:aa",
            "net16": "4e:75:90:71:83:9c",
            "net17": "b2:ac:e9:bc:23:e0",
            "net18": "0a:90:5b:64:1d:2f",
            "net19": "0e:1c:f9:22:4e:bd",
            "net2": "9a:05:77:68:85:19",
            "net20": "d6:41:e1:96:3b:9f",
            "net21": "86:59:83:10:f6:22",
            "net22": "46:2c:c0:eb:a7:3d",
            "net23": "06:d9:8d:48:f6:c6",
            "net24": "62:4e:7a:9e:35:f5",
            "net25": "4a:95:39:f2:af:8c",
            "net26": "0a:b8:70:a7:a7:8d",
            "net27": "b2:89:1e:e7:12:02",
            "net3": "86:f9:61:fe:7e:c7",
            "net4": "fa:ef:2e:ff:5a:d3",
            "net5": "1a:62:5e:94:7a:f5",
            "net6": "32:49:26:09:28:86",
            "net7": "ba:70:27:6d:3d:e8",
            "net8": "0e:5b:5c:f3:47:8f",
            "net9": "ce:08:c0:1c:cd:43"
        },
        "tof_1_2_7": {
            "net0": "22:df:07:01:6a:8c",
            "net1": "36:57:bf:ba:8c:71",
            "net10": "6e:1f:17:75:d8:cb",
            "net11": "1e:36:86:73:13:dd",
            "net12": "32:69:61:7f:ae:1d",
            "net13": "92:19:99:3c:e1:c6",
            "net14": "a6:c5:5a:03:06:d3",
            "net15": "6a:b9:99:9f:6d:15",
            "net16": "be:d0:35:40:c5:bd",
            "net17": "fe:e5:54:67:b9:ff",
            "net18": "8a:9c:b6:75:ea:7e",
            "net19": "ca:17:ad:41:24:a3",
            "net2": "fe:0d:ed:05:a7:3c",
            "net20": "ce:1a:17:fa:91:df",
            "net21": "a2:8a:88:d2:92:f4",
            "net22": "42:61:a2:77:bb:be",
            "net23": "f6:9a:5f:53:00:42",
            "net24": "9a:a6:30:38:32:b7",
            "net25": "3a:5b:36:7c:f6:ae",
            "net26": "2e:fc:37:34:17:37",
            "net27": "be:26:af:f4:b3:1c",
            "net3": "42:7f:17:fe:e7:47",
            "net4": "c6:30:59:a0:ba:89",
            "net5": "12:ea:ba:a7:fb:fb",
            "net6": "7a:38:5a:1f:ac:39",
            "net7": "c2:a7:25:e6:1a:20",
            "net8": "ea:9b:01:89:39:d7",
            "net9": "da:51:b1:7f:40:a4"
        },
        "tof_1_2_8": {
            "net0": "2e:c1:15:de:19:08",
            "net1": "8e:ad:52:a2:ed:92",
            "net10": "5a:d0:22:ce:32:7a",
            "net11": "3e:80:40:8b:49:d4",
            "net12": "ae:1a:6f:fd:cb:31",
            "net13": "2e:c4:aa:55:bb:e9",
            "net14": "d2:06:a4:28:3b:bc",
            "net15": "f6:be:03:bc:2e:02",
            "net16": "2e:27:b0:bd:f2:fd",
            "net17": "c6:99:43:13:39:cd",
            "net18": "b2:8c:63:18:17:0d",
            "net19": "16:ea:c4:e2:ec:c4",
            "net2": "ae:b6:58:16:4a:d7",
            "net20": "96:8f:ec:7d:27:26",
            "net21": "a6:22:3b:a7:64:6f",
            "net22": "a6:86:c2:d4:18:b0",
            "net23": "56:93:e5:8b:fa:c3",
            "net24": "d6:a6:31:78:48:7b",
            "net25": "7e:d5:3b:1e:b7:7b",
            "net26": "76:57:e7:5c:cd:45",
            "net27": "fa:2f:f1:a1:b2:d8",
            "net3": "0e:7a:61:ca:bd:a7",
            "net4": "56:1d:ff:ed:3a:65",
            "net5": "b2:2b:c6:85:0b:d4",
            "net6": "16:02:47:31:e4:b2",
            "net7": "fe:2f:51:36:26:05",
            "net8": "2e:16:a5:ab:6b:40",
            "net9": "9e:bc:a2:7c:f1:9e"
        },
        "tof_1_2_9": {
            "net0": "1e:1d:ec:d1:51:14",
            "net1": "0e:68:37:0e:2e:35",
            "net10": "86:86:ba:65:ad:95",
            "net11": "2e:59:f3:43:11:86",
            "net12": "be:37:3c:78:39:73",
            "net13": "d2:6c:84:bf:7d:2d",
            "net14": "3a:2a:14:de:45:83",
            "net15": "96:9a:8e:bf:91:9b",
            "net16": "82:c5:af:93:b4:83",
            "net17": "0a:83:3e:0d:d6:7f",
            "net18": "5e:44:2b:ef:d9:db",
            "net19": "de:14:3f:da:cd:6d",
            "net2": "06:32:fb:e0:d3:4b",
            "net20": "8a:d5:9b:19:f9:dc",
            "net21": "a6:b7:0f:b5:ed:ac",
            "net22": "82:f1:da:1d:15:fd",
            "net23": "7e:c0:0f:bb:ba:72",
            "net24": "e6:10:fc:3e:58:52",
            "net25": "2a:a5:c5:59:41:9e",
            "net26": "ba:d2:5a:f7:5e:1c",
            "net27": "46:e3:05:82:ba:06",
            "net3": "22:12:3f:2d:f1:cc",
            "net4": "0e:01:ab:e1:a9:9d",
            "net5": "ce:af:8b:bc:1d:8d",
            "net6": "7e:b1:16:09:0f:c7",
            "net7": "da:3e:e2:5f:17:d4",
            "net8": "46:9d:24:79:30:50",
            "net9": "56:6a:e1:c6:8e:53"
        }
    },
    "failed_machine": "leaf_1_0_1",
    "failure_time": {
        "leaf_1_0_1": 1622578529.7168286,
        "leaf_1_0_10": 1622578529.7242572,
        "leaf_1_0_11": 1622578529.7368972,
        "leaf_1_0_12": 1622578529.7460387,
        "leaf_1_0_13": 1622578529.7512941,
        "leaf_1_0_14": 1622578529.771283,
        "leaf_1_0_2": 1622578529.7771454,
        "leaf_1_0_3": 1622578529.788609,
        "leaf_1_0_4": 1622578529.7965677,
        "leaf_1_0_5": 1622578529.7179313,
        "leaf_1_0_6": 1622578529.7282233,
        "leaf_1_0_7": 1622578529.7411711,
        "leaf_1_0_8": 1622578529.7481306,
        "leaf_1_0_9": 1622578529.7558503,
        "leaf_2_0_1": 1622578529.7725306,
        "leaf_2_0_10": 1622578529.7825441,
        "leaf_2_0_11": 1622578529.7900429,
        "leaf_2_0_12": 1622578529.8043392,
        "leaf_2_0_13": 1622578529.8077958,
        "leaf_2_0_14": 1622578529.8157218,
        "leaf_2_0_2": 1622578529.8315804,
        "leaf_2_0_3": 1622578529.842545,
        "leaf_2_0_4": 1622578529.8495595,
        "leaf_2_0_5": 1622578529.856748,
        "leaf_2_0_6": 1622578529.8719485,
        "leaf_2_0_7": 1622578529.8784273,
        "leaf_2_0_8": 1622578529.8823783,
        "leaf_2_0_9": 1622578529.8126116,
        "spine_1_1_1": 1622578529.8220515,
        "spine_1_1_10": 1622578529.8326082,
        "spine_1_1_11": 1622578529.8460937,
        "spine_1_1_12": 1622578529.8550627,
        "spine_1_1_13": 1622578529.8636703,
        "spine_1_1_14": 1622578529.8754644,
        "spine_1_1_2": 1622578529.8836865,
        "spine_1_1_3": 1622578529.8917892,
        "spine_1_1_4": 1622578529.9022315,
        "spine_1_1_5": 1622578529.9168851,
        "spine_1_1_6": 1622578529.9257128,
        "spine_1_1_7": 1622578529.933776,
        "spine_1_1_8": 1622578529.9414184,
        "spine_1_1_9": 1622578529.9503849,
        "spine_2_1_1": 1622578529.9580028,
        "spine_2_1_10": 1622578529.9707167,
        "spine_2_1_11": 1622578529.9816215,
        "spine_2_1_12": 1622578529.902355,
        "spine_2_1_13": 1622578529.9158764,
        "spine_2_1_14": 1622578529.9230974,
        "spine_2_1_2": 1622578529.9331422,
        "spine_2_1_3": 1622578529.941846,
        "spine_2_1_4": 1622578529.9516406,
        "spine_2_1_5": 1622578529.959623,
        "spine_2_1_6": 1622578529.967314,
        "spine_2_1_7": 1622578529.9745522,
        "spine_2_1_8": 1622578529.9846835,
        "spine_2_1_9": 1622578529.9978154,
        "tof_1_2_1": 1622578530.0092258,
        "tof_1_2_10": 1622578530.0226247,
        "tof_1_2_11": 1622578530.0385315,
        "tof_1_2_12": 1622578530.0471306,
        "tof_1_2_13": 1622578530.0581002,
        "tof_1_2_14": 1622578530.0675933,
        "tof_1_2_2": 1622578530.0743597,
        "tof_1_2_3": 1622578529.995346,
        "tof_1_2_4": 1622578530.0125442,
        "tof_1_2_5": 1622578530.0209875,
        "tof_1_2_6": 1622578530.0388715,
        "tof_1_2_7": 1622578530.0499775,
        "tof_1_2_8": 1622578530.0568805,
        "tof_1_2_9": 1622578530.0683835
    }
}