{
    "description": "Scenario 4c: ToF tof_1_2_1 failure and recovery with BGP",
    "k_leaf": 14,
    "k_top": 14,
    "redundancy_factor": 14,
    "is_k8s": true,
    "machine_mac_addresses": {
        "leaf_1_0_1": {
            "net0": "c2:57:3e:ac:bf:2a",
            "net1": "82:26:5b:31:5b:15",
            "net10": "aa:1c:78:4c:40:b5",
            "net11": "f2:48:5d:c0:87:c2",
            "net12": "2a:3c:3a:bf:0a:bd",
            "net13": "6e:00:ed:f5:bf:92",
            "net14": "ae:07:3e:34:7d:3e",
            "net2": "0a:f8:9e:e9:a5:0d",
            "net3": "52:d7:15:6a:62:83",
            "net4": "4e:ef:ee:44:fc:58",
            "net5": "f6:d0:fb:5c:44:15",
            "net6": "ae:e3:e7:72:66:87",
            "net7": "5a:a4:ab:33:fd:0a",
            "net8": "c2:64:ce:71:57:70",
            "net9": "12:74:4c:52:ca:60"
        },
        "leaf_1_0_10": {
            "net0": "ce:46:84:06:e5:0d",
            "net1": "1e:e1:4f:88:ba:39",
            "net10": "7a:6b:9d:61:91:b4",
            "net11": "56:2c:f9:c4:35:18",
            "net12": "02:b1:c3:f3:fe:41",
            "net13": "42:96:21:65:52:38",
            "net14": "ca:ee:d1:03:41:7f",
            "net2": "ee:5a:86:ae:d3:a9",
            "net3": "3a:93:20:15:d6:71",
            "net4": "e2:b2:6d:17:6b:fb",
            "net5": "aa:bc:5b:2b:57:18",
            "net6": "16:78:08:c6:ed:4a",
            "net7": "66:94:93:71:93:37",
            "net8": "2a:1f:51:cf:ac:81",
            "net9": "7a:88:65:4d:8f:4f"
        },
        "leaf_1_0_11": {
            "net0": "6a:8e:df:2b:97:26",
            "net1": "be:6d:39:c8:44:dc",
            "net10": "32:b3:95:25:e6:be",
            "net11": "f2:f6:1c:18:1c:8f",
            "net12": "0e:83:f0:8e:86:e8",
            "net13": "46:d9:6b:00:27:45",
            "net14": "42:fa:29:42:f7:c8",
            "net2": "1a:2b:3e:9f:c6:10",
            "net3": "22:25:d8:04:c9:27",
            "net4": "06:18:d5:71:e2:6f",
            "net5": "2a:12:26:39:f6:0e",
            "net6": "c6:b9:01:e5:ab:e4",
            "net7": "e6:69:f6:40:89:2d",
            "net8": "ca:09:59:c4:01:54",
            "net9": "7a:17:77:86:e8:78"
        },
        "leaf_1_0_12": {
            "net0": "da:33:97:03:be:61",
            "net1": "02:e8:8c:96:db:6f",
            "net10": "56:0b:7b:b0:8b:a4",
            "net11": "96:29:df:98:f7:82",
            "net12": "36:34:a2:ac:8f:69",
            "net13": "6a:a6:86:52:ca:2c",
            "net14": "0e:02:cf:27:72:5e",
            "net2": "0e:4e:bb:e3:63:50",
            "net3": "26:04:71:9b:11:0d",
            "net4": "1a:b6:1a:f4:ce:d2",
            "net5": "12:50:1e:fb:5d:37",
            "net6": "86:ee:6b:4f:db:bd",
            "net7": "06:87:aa:ab:02:28",
            "net8": "56:a0:08:b9:f4:64",
            "net9": "72:47:3e:d4:cc:f6"
        },
        "leaf_1_0_13": {
            "net0": "e2:01:df:ce:ef:b5",
            "net1": "8a:cd:04:c3:4c:fa",
            "net10": "ee:e5:0d:97:70:8f",
            "net11": "ce:d6:02:31:ba:a7",
            "net12": "36:b5:d5:b6:cb:bb",
            "net13": "06:7a:6f:ec:ef:57",
            "net14": "1a:5d:4a:1c:ff:1f",
            "net2": "36:4d:e8:f2:90:07",
            "net3": "7a:69:c8:29:cc:f3",
            "net4": "5a:12:33:11:c3:ec",
            "net5": "d2:42:25:9c:75:f0",
            "net6": "1e:67:3c:10:e7:1a",
            "net7": "92:0c:1c:5b:ce:94",
            "net8": "52:fb:73:e0:c3:d4",
            "net9": "02:59:c9:aa:6c:e0"
        },
        "leaf_1_0_14": {
            "net0": "16:3b:36:79:01:b1",
            "net1": "3e:c1:fc:98:30:9c",
            "net10": "8a:19:29:db:3d:26",
            "net11": "c2:40:9c:9b:32:2b",
            "net12": "82:25:36:08:87:14",
            "net13": "ba:38:31:a6:aa:aa",
            "net14": "32:2f:55:46:4e:b2",
            "net2": "86:08:7e:a9:53:00",
            "net3": "da:6f:a7:8a:a1:f5",
            "net4": "4a:0d:c4:47:23:ff",
            "net5": "f2:6b:d2:5c:a0:02",
            "net6": "d6:9b:06:c8:b4:06",
            "net7": "ee:3c:e4:7b:10:88",
            "net8": "4a:4c:d1:ab:18:a7",
            "net9": "c2:72:57:cf:ab:6a"
        },
        "leaf_1_0_2": {
            "net0": "ce:be:b7:78:f0:72",
            "net1": "e2:4d:8a:7e:bb:a5",
            "net10": "a6:42:48:ed:1a:9d",
            "net11": "16:d1:15:04:2f:06",
            "net12": "62:2f:b4:82:df:e2",
            "net13": "c6:ef:6c:70:1a:05",
            "net14": "16:cc:f7:42:83:23",
            "net2": "0a:0b:df:24:c1:cd",
            "net3": "02:e5:6a:ac:32:94",
            "net4": "d6:08:d1:fa:0d:59",
            "net5": "1a:03:80:e3:4a:65",
            "net6": "aa:98:6e:46:10:8e",
            "net7": "46:2c:dd:35:d1:6e",
            "net8": "0a:d6:2a:ee:aa:66",
            "net9": "1e:1d:5a:9d:f7:e4"
        },
        "leaf_1_0_3": {
            "net0": "12:09:25:d8:5d:1d",
            "net1": "6a:c3:eb:02:dc:fd",
            "net10": "92:18:a7:3e:19:b6",
            "net11": "0e:fc:06:95:4b:0f",
            "net12": "be:5c:50:90:ae:b1",
            "net13": "8a:85:b0:b4:ed:9b",
            "net14": "9e:06:38:ab:58:7d",
            "net2": "7a:d7:63:96:90:65",
            "net3": "6a:c7:f5:ab:da:02",
            "net4": "7e:69:f8:6c:91:8d",
            "net5": "f6:b7:7f:b2:8f:39",
            "net6": "de:06:7a:df:07:cb",
            "net7": "56:38:87:d9:c7:a3",
            "net8": "26:1d:a4:a3:f1:91",
            "net9": "22:72:6f:ce:3a:a7"
        },
        "leaf_1_0_4": {
            "net0": "8a:f8:9c:64:84:c2",
            "net1": "e6:71:28:25:ce:8a",
            "net10": "8a:d3:9b:14:ea:5d",
            "net11": "8e:ad:f8:32:0c:f3",
            "net12": "16:b2:c4:34:b0:2b",
            "net13": "d6:1f:01:50:f0:1e",
            "net14": "da:ea:4b:71:cf:1c",
            "net2": "52:b3:56:86:66:e7",
            "net3": "ca:f1:c4:06:16:23",
            "net4": "4a:f3:5f:a9:a2:3a",
            "net5": "16:29:89:6d:4a:f7",
            "net6": "ae:3e:86:6c:74:30",
            "net7": "be:68:f0:cb:63:1c",
            "net8": "ba:7a:60:15:b0:87",
            "net9": "d2:d7:db:50:8a:6b"
        },
        "leaf_1_0_5": {
            "net0": "0e:19:ab:52:88:e0",
            "net1": "0a:c7:25:72:09:92",
            "net10": "9e:92:36:8c:94:be",
            "net11": "82:09:04:f7:84:a1",
            "net12": "3e:cf:c2:7a:6d:81",
            "net13": "8a:21:f0:fa:2b:30",
            "net14": "2e:a6:56:50:02:4b",
            "net2": "66:06:69:5e:d7:af",
            "net3": "f2:4f:fc:d5:e1:ef",
            "net4": "c6:29:35:8a:2c:11",
            "net5": "fa:84:bd:05:3c:ed",
            "net6": "6e:c9:f2:1a:70:80",
            "net7": "2e:9a:96:5f:65:65",
            "net8": "86:26:a5:2e:3c:df",
            "net9": "fa:a9:8e:aa:5e:4f"
        },
        "leaf_1_0_6": {
            "net0": "3a:8f:e6:a4:41:a4",
            "net1": "8a:57:f4:48:2c:ce",
            "net10": "de:b4:25:49:9e:d9",
            "net11": "a6:fe:80:44:93:5a",
            "net12": "32:49:a9:4e:f4:5a",
            "net13": "6a:34:96:1d:96:ec",
            "net14": "26:0f:69:a4:f7:15",
            "net2": "fe:b0:38:c8:37:ec",
            "net3": "02:f9:d7:b0:45:4a",
            "net4": "86:b6:92:f4:1e:8a",
            "net5": "26:5c:83:df:76:02",
            "net6": "22:b0:5e:2e:ad:f9",
            "net7": "ea:67:72:5b:98:f4",
            "net8": "82:c3:87:c0:73:bd",
            "net9": "12:cd:07:fb:7b:1f"
        },
        "leaf_1_0_7": {
            "net0": "aa:20:13:6e:55:ee",
            "net1": "aa:86:32:fc:28:d1",
            "net10": "8a:02:34:69:53:78",
            "net11": "ee:ec:d9:fd:d9:76",
            "net12": "e2:4e:25:f7:96:e8",
            "net13": "ce:40:5e:ab:2d:bc",
            "net14": "8e:21:06:60:61:8c",
            "net2": "02:45:4d:23:e6:2f",
            "net3": "a6:9b:2d:06:77:41",
            "net4": "0e:86:6c:a1:fb:a8",
            "net5": "aa:80:a8:73:71:b7",
            "net6": "52:b0:aa:35:77:ef",
            "net7": "ea:6b:0e:65:38:0b",
            "net8": "9a:de:77:cf:9b:59",
            "net9": "5a:7e:0c:36:68:f9"
        },
        "leaf_1_0_8": {
            "net0": "9a:33:25:27:a6:e8",
            "net1": "32:98:cc:cc:77:7e",
            "net10": "f2:5a:3e:85:34:0c",
            "net11": "5e:77:33:38:71:c0",
            "net12": "fe:ed:a2:2c:f2:fc",
            "net13": "0a:c0:e4:df:e6:ee",
            "net14": "02:4e:da:27:f4:bc",
            "net2": "92:84:95:0f:4b:9c",
            "net3": "3a:24:b2:14:b7:4e",
            "net4": "96:d8:5e:ee:ad:d5",
            "net5": "52:4e:ab:2d:27:6d",
            "net6": "66:1b:ed:f6:65:19",
            "net7": "82:cb:2a:9e:fe:7e",
            "net8": "62:b3:a8:2e:a6:b5",
            "net9": "f2:57:41:5e:b6:ef"
        },
        "leaf_1_0_9": {
            "net0": "2e:c9:9e:14:16:9e",
            "net1": "ae:b5:80:4b:6b:79",
            "net10": "3a:b5:59:cd:85:88",
            "net11": "fe:d3:1c:93:1e:88",
            "net12": "e6:e9:da:3f:9f:ef",
            "net13": "7a:80:26:21:96:af",
            "net14": "ce:95:3c:d4:21:5b",
            "net2": "6e:b5:4b:d8:ee:f4",
            "net3": "5a:a5:53:31:42:24",
            "net4": "ba:79:e7:9b:50:35",
            "net5": "9a:e0:57:10:dd:2d",
            "net6": "0e:26:f6:a3:43:49",
            "net7": "4e:38:ad:de:03:50",
            "net8": "ba:c5:e7:40:37:1c",
            "net9": "72:9e:58:86:02:0a"
        },
        "leaf_2_0_1": {
            "net0": "02:23:2d:ef:8a:72",
            "net1": "a6:8d:36:45:f8:ab",
            "net10": "46:5c:54:9a:6f:2c",
            "net11": "fa:b6:71:64:ee:f8",
            "net12": "ae:9b:08:61:e3:2c",
            "net13": "72:5d:0a:4b:04:61",
            "net14": "ce:a0:fc:cf:32:74",
            "net2": "fe:d5:3d:80:0f:22",
            "net3": "da:0c:d1:f0:5c:a4",
            "net4": "3a:c8:9d:96:29:da",
            "net5": "86:fa:90:b1:f3:42",
            "net6": "f6:06:b6:20:b3:c7",
            "net7": "ae:d6:96:dd:5a:f8",
            "net8": "e6:1a:5a:c7:ab:67",
            "net9": "32:08:2d:0a:5f:f7"
        },
        "leaf_2_0_10": {
            "net0": "42:e3:c4:44:fa:1d",
            "net1": "86:f2:3b:46:b0:e6",
            "net10": "12:70:d2:e4:c2:f2",
            "net11": "6e:0d:ac:fe:44:09",
            "net12": "ca:64:68:3b:38:17",
            "net13": "5a:a2:ec:b9:b3:2a",
            "net14": "0e:dd:84:50:5a:e5",
            "net2": "8e:72:22:43:95:78",
            "net3": "26:88:7b:94:04:6e",
            "net4": "2e:e6:d8:37:14:b1",
            "net5": "4a:54:66:7a:5f:64",
            "net6": "1e:ad:0d:aa:2d:e2",
            "net7": "fe:16:4f:ab:34:39",
            "net8": "32:25:7a:22:54:3f",
            "net9": "3e:a3:de:6c:eb:1d"
        },
        "leaf_2_0_11": {
            "net0": "5e:eb:da:6b:02:fb",
            "net1": "7e:eb:83:b4:0a:37",
            "net10": "06:53:ab:41:06:5a",
            "net11": "6e:62:25:a5:3b:f7",
            "net12": "ea:30:64:a4:19:12",
            "net13": "9a:b4:22:50:8c:45",
            "net14": "0e:8a:37:dc:75:7e",
            "net2": "e6:59:86:79:39:27",
            "net3": "de:c3:5b:c7:f0:b2",
            "net4": "aa:5d:a5:b8:4f:70",
            "net5": "02:1e:b9:21:54:45",
            "net6": "b6:f2:91:f0:c6:28",
            "net7": "42:7c:48:59:1d:72",
            "net8": "d2:c8:1e:87:6d:17",
            "net9": "ae:c5:2e:b0:b4:1b"
        },
        "leaf_2_0_12": {
            "net0": "ea:b2:84:41:63:bb",
            "net1": "ce:13:61:98:1d:b1",
            "net10": "fe:72:87:e9:4f:83",
            "net11": "2e:bc:b8:6d:5c:14",
            "net12": "62:3b:d4:58:08:33",
            "net13": "06:02:e0:3b:b8:e7",
            "net14": "56:d2:4e:af:4b:cd",
            "net2": "0e:bb:3e:74:e7:fb",
            "net3": "9e:78:10:02:6b:27",
            "net4": "56:e3:8b:fc:f0:60",
            "net5": "22:a1:cc:ea:e6:2a",
            "net6": "1a:2a:fe:19:b9:59",
            "net7": "0a:6a:b2:d7:33:ad",
            "net8": "16:c4:78:1f:d7:4c",
            "net9": "42:fd:b3:9c:6c:66"
        },
        "leaf_2_0_13": {
            "net0": "06:4b:12:a4:11:d6",
            "net1": "1e:5e:91:b7:81:ed",
            "net10": "de:e0:8f:be:1a:ba",
            "net11": "0e:11:4f:a0:8a:e5",
            "net12": "3e:60:f9:f3:d4:31",
            "net13": "16:f6:68:f8:83:3b",
            "net14": "a6:26:65:75:8d:39",
            "net2": "ba:78:12:11:93:ed",
            "net3": "6e:fa:09:43:ae:6f",
            "net4": "22:1e:2c:ab:31:66",
            "net5": "6e:c5:f9:ce:dd:09",
            "net6": "c6:64:3c:e4:25:50",
            "net7": "9a:2a:80:27:74:9f",
            "net8": "7a:89:90:05:a1:1f",
            "net9": "e6:4e:d9:f8:bf:e7"
        },
        "leaf_2_0_14": {
            "net0": "82:f6:01:3e:12:e7",
            "net1": "de:0d:33:73:d0:6c",
            "net10": "2e:03:ff:f7:ec:c9",
            "net11": "22:4b:52:51:07:ed",
            "net12": "3a:33:7f:79:23:c1",
            "net13": "12:02:d5:31:3a:79",
            "net14": "f2:f5:df:02:a2:a0",
            "net2": "ba:07:79:1a:7f:c4",
            "net3": "ca:99:49:15:e7:e7",
            "net4": "6a:e9:90:81:ae:87",
            "net5": "2a:be:9d:ef:4a:e9",
            "net6": "36:af:28:38:cd:6d",
            "net7": "c2:8a:24:3c:b5:69",
            "net8": "9a:28:9c:e6:2c:ef",
            "net9": "4a:60:30:b9:1f:a9"
        },
        "leaf_2_0_2": {
            "net0": "b6:7c:f2:82:d2:c7",
            "net1": "6e:75:8d:e9:25:0e",
            "net10": "8e:91:d7:c5:3b:72",
            "net11": "16:42:de:f2:25:17",
            "net12": "6a:79:9a:5f:d7:3d",
            "net13": "5e:62:61:47:3e:44",
            "net14": "76:64:ed:8d:cf:90",
            "net2": "a6:1a:5c:56:cf:14",
            "net3": "5e:ec:6c:15:57:75",
            "net4": "46:1b:06:02:64:c7",
            "net5": "b2:67:c7:29:c1:72",
            "net6": "22:8c:ff:1f:4c:69",
            "net7": "6a:12:7c:d4:65:16",
            "net8": "52:69:db:40:b7:86",
            "net9": "16:6e:db:68:51:61"
        },
        "leaf_2_0_3": {
            "net0": "f6:8e:b3:f8:91:73",
            "net1": "8e:42:44:24:7a:3e",
            "net10": "c2:76:af:28:cc:3d",
            "net11": "32:d7:f2:0f:8d:c8",
            "net12": "0e:94:4b:d9:19:d2",
            "net13": "66:c9:94:71:9f:31",
            "net14": "6e:8e:97:22:8c:e5",
            "net2": "92:ad:50:80:a9:25",
            "net3": "06:5d:8d:18:94:66",
            "net4": "12:fd:5c:cc:cd:76",
            "net5": "ea:c7:de:fe:12:9e",
            "net6": "da:c3:59:15:a9:6b",
            "net7": "c6:2c:8e:30:56:9f",
            "net8": "32:95:88:8c:34:8f",
            "net9": "0a:42:e9:25:6f:10"
        },
        "leaf_2_0_4": {
            "net0": "12:1c:a6:df:17:2a",
            "net1": "72:4e:cf:dc:2f:59",
            "net10": "c6:27:26:33:cf:60",
            "net11": "ce:f6:cf:ae:6f:9a",
            "net12": "aa:ae:6c:34:fa:13",
            "net13": "3e:ac:f6:73:dc:6d",
            "net14": "12:0a:26:70:3a:7d",
            "net2": "1a:1f:91:51:da:18",
            "net3": "5a:ea:c9:bd:7b:78",
            "net4": "2a:d2:ed:2b:3b:a9",
            "net5": "f6:ec:e9:f6:78:41",
            "net6": "e2:e6:9e:74:7b:38",
            "net7": "8e:44:a7:1f:03:3f",
            "net8": "ee:b9:4f:41:f4:ea",
            "net9": "66:04:7c:e7:75:23"
        },
        "leaf_2_0_5": {
            "net0": "46:b8:da:53:0b:6a",
            "net1": "e6:36:0e:fd:f1:06",
            "net10": "e2:1f:2c:b0:ef:97",
            "net11": "4e:6f:94:c0:d4:16",
            "net12": "d6:89:01:dd:18:9a",
            "net13": "ee:01:08:bb:32:9c",
            "net14": "52:a0:cc:00:dc:39",
            "net2": "f2:8f:bb:4f:70:cb",
            "net3": "72:ec:1b:65:ed:46",
            "net4": "56:ec:f8:26:d4:92",
            "net5": "52:05:34:bc:47:f1",
            "net6": "ae:51:ca:ee:05:d8",
            "net7": "4e:02:06:2d:06:d7",
            "net8": "26:24:57:be:24:0f",
            "net9": "3a:f3:51:c6:8c:7e"
        },
        "leaf_2_0_6": {
            "net0": "46:89:b6:e2:66:ca",
            "net1": "0a:03:6a:9f:08:de",
            "net10": "26:05:fb:bc:fc:b7",
            "net11": "fa:c3:d6:25:36:c5",
            "net12": "1a:06:89:73:fd:37",
            "net13": "0a:2b:41:93:90:2d",
            "net14": "72:3b:9d:4c:b3:34",
            "net2": "8e:9b:2a:48:94:e3",
            "net3": "7a:e8:db:8b:63:5d",
            "net4": "1a:c2:a0:1c:24:fe",
            "net5": "8e:4c:86:b4:d3:8a",
            "net6": "0a:c7:55:ec:93:0c",
            "net7": "2a:ac:c5:86:85:a0",
            "net8": "fe:0d:2c:d2:b6:59",
            "net9": "1e:55:f4:4e:e0:d9"
        },
        "leaf_2_0_7": {
            "net0": "1e:b7:55:eb:e1:dd",
            "net1": "ea:c9:fa:d9:4d:82",
            "net10": "b6:3a:79:ac:24:d2",
            "net11": "ce:52:5a:69:fa:03",
            "net12": "86:eb:f2:5a:c9:a6",
            "net13": "26:8d:bc:61:02:1f",
            "net14": "92:6e:d0:26:ec:96",
            "net2": "d6:f8:34:10:57:17",
            "net3": "6a:63:72:63:71:bd",
            "net4": "0a:f5:ff:87:80:09",
            "net5": "9e:32:71:57:40:a7",
            "net6": "2e:1f:14:20:aa:67",
            "net7": "c2:bb:6f:b7:be:4d",
            "net8": "b2:0b:bd:66:7c:77",
            "net9": "06:0a:85:36:12:95"
        },
        "leaf_2_0_8": {
            "net0": "22:b0:5f:78:2d:30",
            "net1": "16:ef:af:6f:17:53",
            "net10": "9a:40:b2:ba:90:d9",
            "net11": "4a:6a:81:dd:97:86",
            "net12": "12:7f:9e:0d:d1:42",
            "net13": "52:11:65:e6:a9:66",
            "net14": "7a:35:58:f0:ed:8a",
            "net2": "1e:9d:9f:c7:81:52",
            "net3": "72:f5:33:05:c1:ac",
            "net4": "c6:cf:b9:d5:06:2a",
            "net5": "62:9d:d4:ed:0d:a8",
            "net6": "76:49:4c:39:31:3d",
            "net7": "f6:6f:7e:0a:bf:14",
            "net8": "3e:d2:b7:28:a5:b9",
            "net9": "72:5f:15:d7:1c:72"
        },
        "leaf_2_0_9": {
            "net0": "8a:d8:22:97:e7:8b",
            "net1": "56:fb:35:d4:ae:89",
            "net10": "9a:4f:0a:80:b3:ce",
            "net11": "22:af:42:db:a2:ef",
            "net12": "26:af:65:2f:ca:3a",
            "net13": "26:81:5b:e5:a0:78",
            "net14": "62:53:84:ef:dd:cb",
            "net2": "5a:d7:98:a7:ba:d7",
            "net3": "5e:4f:f4:18:f7:5a",
            "net4": "42:b4:90:e3:f8:60",
            "net5": "52:85:ba:21:81:6f",
            "net6": "5e:9d:4b:80:28:20",
            "net7": "da:00:34:2d:94:45",
            "net8": "e6:c7:65:ad:83:93",
            "net9": "d2:08:c9:ce:93:0d"
        },
        "spine_1_1_1": {
            "net0": "a2:a5:81:f7:df:6d",
            "net1": "22:8d:69:d4:b2:99",
            "net10": "8a:81:56:10:ef:a3",
            "net11": "7a:be:c1:98:f2:03",
            "net12": "2a:30:c3:39:ad:ae",
            "net13": "66:f0:89:15:73:b0",
            "net14": "1e:db:ca:7b:ae:cb",
            "net15": "62:cc:7b:a8:6e:48",
            "net16": "ba:fa:59:f4:65:f3",
            "net17": "1a:59:62:41:e6:d4",
            "net18": "ee:1d:9b:fc:7a:e9",
            "net19": "a2:aa:98:cc:5f:88",
            "net2": "9e:ae:bb:49:79:b9",
            "net20": "f6:53:ad:7d:ff:b2",
            "net21": "aa:d1:53:5d:56:e3",
            "net22": "da:4d:82:d2:35:1f",
            "net23": "ca:3a:9d:c2:5a:55",
            "net24": "32:6b:a8:57:f2:e6",
            "net25": "d2:f9:b9:2b:3a:43",
            "net26": "f2:40:97:bd:fe:60",
            "net27": "42:02:f2:8d:d7:43",
            "net3": "82:53:c4:cc:06:3f",
            "net4": "ce:88:94:3e:1f:44",
            "net5": "56:bc:a6:37:a6:37",
            "net6": "76:d4:66:a2:16:96",
            "net7": "76:6f:6a:4f:b6:a2",
            "net8": "9a:08:5f:2b:0b:43",
            "net9": "fe:b4:a5:c0:5a:01"
        },
        "spine_1_1_10": {
            "net0": "32:4d:38:7d:b9:7b",
            "net1": "ea:cd:e6:c6:59:a9",
            "net10": "fa:9f:6a:0b:7f:84",
            "net11": "b2:3a:86:a0:18:2a",
            "net12": "52:37:9e:e3:f7:a1",
            "net13": "d6:88:c5:f0:45:ed",
            "net14": "52:8b:67:d7:e3:fe",
            "net15": "26:33:4e:f9:b0:a5",
            "net16": "82:46:c2:ce:56:c3",
            "net17": "42:78:55:07:a5:a1",
            "net18": "72:8b:45:51:bb:5c",
            "net19": "06:6f:15:66:78:fd",
            "net2": "02:4f:d9:9e:11:88",
            "net20": "e2:1f:ca:ae:03:c0",
            "net21": "d6:11:88:40:fd:96",
            "net22": "7a:ff:b4:d3:f7:ff",
            "net23": "4e:07:a5:2c:88:51",
            "net24": "06:de:6c:4c:61:ad",
            "net25": "b2:ce:8e:5b:06:3a",
            "net26": "b6:5a:35:57:0a:c2",
            "net27": "9e:6f:ea:58:42:c4",
            "net3": "9e:e5:74:34:ec:92",
            "net4": "a2:46:5b:fc:8c:5c",
            "net5": "4e:8b:ab:8c:ae:25",
            "net6": "4a:4d:95:73:38:08",
            "net7": "7a:a7:ee:a7:3a:ff",
            "net8": "76:e9:52:13:b2:04",
            "net9": "22:4d:e3:54:7c:c2"
        },
        "spine_1_1_11": {
            "net0": "0a:ba:54:a8:2d:53",
            "net1": "02:4f:b8:83:b5:82",
            "net10": "da:a4:08:c6:e8:eb",
            "net11": "1a:f6:82:1b:13:87",
            "net12": "32:95:38:06:5e:db",
            "net13": "ca:1d:1f:d9:05:9a",
            "net14": "12:7c:56:ae:72:65",
            "net15": "9a:be:20:18:f8:7d",
            "net16": "f6:64:32:99:fe:c4",
            "net17": "22:5b:b9:dd:35:01",
            "net18": "6a:6d:db:68:a9:c2",
            "net19": "82:dc:31:57:2b:7f",
            "net2": "ba:5e:a7:0f:84:e8",
            "net20": "0e:04:6c:ed:d7:3c",
            "net21": "22:1e:69:ea:65:25",
            "net22": "a2:0b:73:24:09:9d",
            "net23": "72:8b:c5:6c:8e:32",
            "net24": "3a:a7:72:02:d3:19",
            "net25": "4e:3d:29:b2:76:5e",
            "net26": "66:87:48:37:57:c3",
            "net27": "be:60:c1:88:b3:a0",
            "net3": "e2:fc:f1:0a:66:f3",
            "net4": "86:94:3b:f2:56:a3",
            "net5": "ce:fd:07:ae:9d:ea",
            "net6": "c6:07:e3:e5:82:59",
            "net7": "66:ce:39:14:12:5d",
            "net8": "ee:6c:b0:98:7d:b5",
            "net9": "ea:93:04:4f:65:74"
        },
        "spine_1_1_12": {
            "net0": "2a:1a:6c:68:3e:3a",
            "net1": "ee:02:5f:c6:3d:06",
            "net10": "26:c9:13:03:21:b7",
            "net11": "6a:ce:d7:de:87:eb",
            "net12": "92:b1:b2:30:91:a2",
            "net13": "da:bb:6c:e8:70:cb",
            "net14": "ba:3d:3f:b4:47:7d",
            "net15": "52:75:d2:3a:e7:4c",
            "net16": "0e:9e:e4:b2:71:e4",
            "net17": "b6:73:10:fc:7a:b9",
            "net18": "26:f5:d0:ea:b9:6c",
            "net19": "d2:ba:78:d2:9a:5d",
            "net2": "52:1f:50:f6:01:bd",
            "net20": "d2:7e:0a:45:dd:33",
            "net21": "12:86:3e:9d:91:b5",
            "net22": "9a:b9:75:d6:76:f5",
            "net23": "62:30:5d:15:79:56",
            "net24": "ee:70:fb:a8:8b:b8",
            "net25": "d6:d0:fb:73:f0:14",
            "net26": "36:3b:2a:cd:8d:4c",
            "net27": "ce:3b:2e:23:a7:b1",
            "net3": "86:3b:58:64:1f:a8",
            "net4": "4e:e8:de:bf:6e:da",
            "net5": "2a:fb:d5:f7:b1:b3",
            "net6": "5a:0b:dd:75:1b:6c",
            "net7": "2a:f7:4f:68:56:91",
            "net8": "46:5b:b1:28:93:b3",
            "net9": "a6:de:4a:93:42:9f"
        },
        "spine_1_1_13": {
            "net0": "92:69:c9:bd:39:5c",
            "net1": "ea:60:b8:20:ad:03",
            "net10": "3e:a9:02:18:f0:d4",
            "net11": "26:ff:de:0f:97:1d",
            "net12": "16:59:84:4e:59:f5",
            "net13": "82:61:b1:c4:39:9d",
            "net14": "82:7f:b5:70:5b:e6",
            "net15": "26:62:3c:b9:41:25",
            "net16": "6e:ba:d5:44:8d:59",
            "net17": "d2:71:6d:f6:19:c4",
            "net18": "42:bb:f3:90:f8:18",
            "net19": "fa:b8:22:31:f9:be",
            "net2": "72:4c:a4:09:c9:df",
            "net20": "06:ba:46:a0:ff:1a",
            "net21": "ae:85:54:d0:a1:8a",
            "net22": "56:19:90:21:55:31",
            "net23": "ce:1a:28:1e:31:24",
            "net24": "ca:d5:02:df:b7:ef",
            "net25": "b2:62:62:51:ca:01",
            "net26": "ca:9e:b9:14:7a:2a",
            "net27": "9e:21:11:49:27:1d",
            "net3": "46:2b:18:1f:89:26",
            "net4": "ee:7b:7b:f8:02:86",
            "net5": "ae:95:4b:b0:df:aa",
            "net6": "1e:ca:4f:20:8c:dd",
            "net7": "1a:55:d7:9d:70:c9",
            "net8": "96:a7:17:56:9e:32",
            "net9": "86:ef:a7:23:fd:29"
        },
        "spine_1_1_14": {
            "net0": "7a:11:70:04:1c:97",
            "net1": "de:ea:06:70:52:5e",
            "net10": "e6:73:d2:bb:65:68",
            "net11": "02:e1:ac:97:63:71",
            "net12": "f2:50:96:7b:33:ea",
            "net13": "26:23:79:46:78:e9",
            "net14": "66:91:b2:1f:e1:78",
            "net15": "ee:6d:b4:bc:d4:1a",
            "net16": "3e:1c:9d:66:bf:44",
            "net17": "c2:64:9b:8a:1b:c1",
            "net18": "3e:c3:d9:44:50:4d",
            "net19": "5a:11:64:88:46:48",
            "net2": "9a:83:95:95:3e:62",
            "net20": "4a:ba:68:55:d8:36",
            "net21": "5a:dd:97:ba:75:48",
            "net22": "ce:4e:e6:43:36:01",
            "net23": "56:13:39:cc:8c:c4",
            "net24": "5e:d8:55:9e:09:b3",
            "net25": "8e:11:2f:48:a1:2e",
            "net26": "26:a4:f3:92:7f:5b",
            "net27": "b2:e9:10:55:42:0e",
            "net3": "ce:3b:a0:24:70:81",
            "net4": "aa:67:0f:17:e4:ad",
            "net5": "e6:95:d4:4c:67:40",
            "net6": "3a:95:7d:da:64:79",
            "net7": "b6:2b:9b:22:0d:eb",
            "net8": "86:65:af:32:5c:d8",
            "net9": "66:0d:7e:e5:bb:8c"
        },
        "spine_1_1_2": {
            "net0": "e6:6f:74:8a:50:85",
            "net1": "1a:68:81:7a:62:0c",
            "net10": "3a:7c:94:90:3a:3e",
            "net11": "4e:ff:fe:de:df:ac",
            "net12": "ee:16:e1:d9:e8:b1",
            "net13": "42:c9:a3:1d:1a:90",
            "net14": "16:af:91:d4:41:d4",
            "net15": "fe:f8:2f:88:ed:9a",
            "net16": "5a:f8:22:ca:cd:66",
            "net17": "4e:81:6f:eb:ff:e7",
            "net18": "a2:a8:5a:2d:c2:70",
            "net19": "0e:9a:3a:57:13:33",
            "net2": "f2:fb:d6:fe:15:7f",
            "net20": "f6:93:b6:ac:52:06",
            "net21": "8e:a8:b9:d8:12:87",
            "net22": "d6:be:48:82:d1:20",
            "net23": "fa:f7:4d:0d:42:41",
            "net24": "ea:f8:2f:3c:1c:e5",
            "net25": "86:a5:08:f0:d2:36",
            "net26": "96:8e:86:fe:39:ef",
            "net27": "5a:e4:ba:d4:72:0a",
            "net3": "06:ca:12:a6:c6:27",
            "net4": "ee:99:d5:ca:c2:7d",
            "net5": "02:19:0c:8f:ee:8f",
            "net6": "f6:52:f8:56:26:6d",
            "net7": "8a:7b:a2:63:10:22",
            "net8": "e2:80:5b:91:54:d4",
            "net9": "a6:ac:a8:ae:96:f9"
        },
        "spine_1_1_3": {
            "net0": "f6:80:e1:26:50:fa",
            "net1": "2a:d6:d3:cb:db:d4",
            "net10": "da:9d:d7:7d:8e:6b",
            "net11": "0e:c9:11:df:3e:d7",
            "net12": "72:59:7a:08:bf:bd",
            "net13": "f2:82:6c:ec:03:f5",
            "net14": "12:32:4c:6e:82:6a",
            "net15": "46:70:f0:d9:66:27",
            "net16": "76:1d:b5:28:55:b8",
            "net17": "0a:66:4a:2c:d0:c0",
            "net18": "de:96:65:a4:39:86",
            "net19": "0a:df:90:a0:4d:c2",
            "net2": "fa:16:79:49:23:62",
            "net20": "fa:b2:0a:20:50:07",
            "net21": "12:d3:a0:60:4c:a6",
            "net22": "5e:20:c8:a6:5c:2d",
            "net23": "16:34:7d:3e:f1:20",
            "net24": "d6:7b:0e:e1:44:25",
            "net25": "86:cd:fc:d9:d8:d1",
            "net26": "12:02:c7:fb:54:e3",
            "net27": "f6:0a:8b:04:34:54",
            "net3": "1e:0a:ee:86:6d:89",
            "net4": "7a:b0:82:4f:4c:a8",
            "net5": "ce:3c:75:f2:80:5a",
            "net6": "3e:a9:1b:91:33:27",
            "net7": "f6:23:b4:55:05:b9",
            "net8": "92:bd:d0:62:16:69",
            "net9": "96:21:7a:18:bc:f5"
        },
        "spine_1_1_4": {
            "net0": "7e:54:03:84:76:70",
            "net1": "b2:0d:5e:9b:aa:83",
            "net10": "42:9b:81:90:65:ca",
            "net11": "96:16:41:61:94:a3",
            "net12": "9a:29:23:6f:4a:5b",
            "net13": "5e:d4:7f:4a:85:b6",
            "net14": "be:66:a8:5c:13:64",
            "net15": "be:61:42:c9:d5:12",
            "net16": "06:a0:a9:31:f8:e0",
            "net17": "5e:e1:9c:73:60:92",
            "net18": "3e:72:e0:7a:8a:fa",
            "net19": "ce:21:1a:99:30:55",
            "net2": "c2:ae:2c:8a:de:8a",
            "net20": "be:7c:cd:54:f0:a7",
            "net21": "42:39:00:88:d4:65",
            "net22": "22:9a:cb:fc:07:62",
            "net23": "66:96:07:45:01:ff",
            "net24": "32:90:6a:bf:60:3c",
            "net25": "d6:48:85:05:c0:c3",
            "net26": "42:42:8e:7b:fd:9a",
            "net27": "ee:dc:f9:00:b3:b2",
            "net3": "22:15:57:5c:c1:f2",
            "net4": "7a:af:5f:50:b7:2d",
            "net5": "f2:37:bd:bb:2e:63",
            "net6": "fa:8b:1b:a8:b5:97",
            "net7": "d6:bd:61:5a:7f:0f",
            "net8": "2a:e9:4c:23:86:5f",
            "net9": "4e:bd:ee:b8:b4:0a"
        },
        "spine_1_1_5": {
            "net0": "d6:00:e9:f0:e1:49",
            "net1": "7a:b3:66:44:06:44",
            "net10": "a2:2c:4e:c1:be:f3",
            "net11": "da:fd:bf:d3:51:a0",
            "net12": "2e:0e:61:cf:c1:7a",
            "net13": "26:ab:68:d6:5c:ec",
            "net14": "da:e1:80:ea:72:49",
            "net15": "ce:0a:21:16:e5:2e",
            "net16": "56:29:e4:32:fe:11",
            "net17": "d6:98:bd:6b:4a:69",
            "net18": "e6:f6:8c:c2:13:a4",
            "net19": "3e:13:ca:7b:2c:94",
            "net2": "fa:8e:05:c4:1a:66",
            "net20": "2a:7d:2a:12:b4:72",
            "net21": "6e:76:11:55:da:7a",
            "net22": "9e:40:15:5b:c3:f0",
            "net23": "8e:c5:b2:87:f3:d2",
            "net24": "a2:f1:c5:ad:11:4e",
            "net25": "d6:11:0d:3f:dd:52",
            "net26": "56:47:cb:2c:c1:b9",
            "net27": "1e:94:02:9b:58:76",
            "net3": "76:df:44:f6:85:d6",
            "net4": "16:83:04:7a:0f:c2",
            "net5": "1e:66:7c:e7:97:86",
            "net6": "8a:74:e6:89:a1:37",
            "net7": "3e:8e:37:e3:65:6a",
            "net8": "32:a9:de:a1:12:f4",
            "net9": "32:0f:ab:10:5a:e5"
        },
        "spine_1_1_6": {
            "net0": "52:35:44:9f:c8:ee",
            "net1": "6a:5f:ef:73:b9:79",
            "net10": "56:73:25:ea:3b:6c",
            "net11": "e2:45:68:e1:95:32",
            "net12": "fe:d7:2e:49:08:8e",
            "net13": "ae:0d:d9:9f:16:87",
            "net14": "5a:39:8e:9b:4c:a9",
            "net15": "62:41:7d:7c:df:28",
            "net16": "82:4d:de:f9:96:af",
            "net17": "82:78:52:fb:2a:7e",
            "net18": "3e:c8:bc:22:28:26",
            "net19": "62:dd:05:93:14:39",
            "net2": "3a:06:d7:cb:92:86",
            "net20": "02:b6:a9:52:7d:14",
            "net21": "22:d4:95:73:68:c7",
            "net22": "f2:2e:c2:08:38:6e",
            "net23": "02:21:7a:ad:26:0e",
            "net24": "d2:ae:94:ba:05:ac",
            "net25": "46:7b:0f:e9:60:19",
            "net26": "96:c4:86:51:7c:36",
            "net27": "ee:65:d2:57:d3:ce",
            "net3": "ce:37:cd:29:4e:15",
            "net4": "0e:af:f2:a8:71:5d",
            "net5": "9e:bc:25:62:2c:dd",
            "net6": "fe:30:33:85:ef:6a",
            "net7": "36:e6:4e:1e:6b:a5",
            "net8": "06:d4:f5:bc:1a:99",
            "net9": "b2:31:40:ec:88:a0"
        },
        "spine_1_1_7": {
            "net0": "5a:47:24:52:c5:08",
            "net1": "ea:e8:68:4c:d2:8c",
            "net10": "5a:65:62:1a:23:f3",
            "net11": "b2:55:88:01:b4:46",
            "net12": "52:3d:f8:80:b3:90",
            "net13": "ca:10:43:ec:ab:8b",
            "net14": "8a:69:9d:77:54:8f",
            "net15": "7e:97:6a:86:5d:2f",
            "net16": "e6:30:8a:6c:b8:fb",
            "net17": "8a:c9:59:d3:92:7c",
            "net18": "9a:ed:fa:8d:0f:6b",
            "net19": "82:32:90:29:99:bd",
            "net2": "22:50:89:6b:38:de",
            "net20": "46:c6:09:6a:84:11",
            "net21": "b6:9e:68:64:f7:3b",
            "net22": "6e:29:78:35:87:6d",
            "net23": "ea:04:6d:83:80:39",
            "net24": "2e:db:5a:71:38:38",
            "net25": "4e:06:94:31:1c:c5",
            "net26": "92:c9:1c:a1:b0:21",
            "net27": "42:e8:1a:13:82:33",
            "net3": "16:c3:9a:b5:94:e3",
            "net4": "d2:2f:c9:75:c3:21",
            "net5": "42:ee:c1:bd:4c:f4",
            "net6": "f6:02:bd:05:ad:80",
            "net7": "de:85:c9:25:39:5c",
            "net8": "9e:2a:85:d4:8d:9b",
            "net9": "a2:bb:e9:bc:67:4b"
        },
        "spine_1_1_8": {
            "net0": "76:5b:44:4e:14:b4",
            "net1": "26:fd:19:e4:49:8b",
            "net10": "42:f2:7c:82:c7:b3",
            "net11": "e6:9c:96:bb:e5:4e",
            "net12": "b2:f8:03:34:88:6b",
            "net13": "aa:d6:ce:3a:f6:1f",
            "net14": "ce:a3:61:23:c1:30",
            "net15": "96:eb:d5:f6:b3:42",
            "net16": "ca:ab:05:fb:9e:32",
            "net17": "66:f9:28:1e:23:c1",
            "net18": "c6:41:95:bf:b4:bd",
            "net19": "56:41:45:ea:1e:e8",
            "net2": "72:53:e2:7f:8b:f8",
            "net20": "8e:c9:cb:de:69:ce",
            "net21": "ee:5e:20:78:61:05",
            "net22": "2a:d0:e3:21:ee:00",
            "net23": "62:fd:7f:f5:b5:8e",
            "net24": "fa:b2:e7:1a:1d:61",
            "net25": "ce:58:0c:09:61:be",
            "net26": "6a:a7:6f:8b:c8:d1",
            "net27": "16:53:21:f3:1e:ff",
            "net3": "a2:2a:5b:72:d0:f7",
            "net4": "f6:e4:a0:6f:f7:ad",
            "net5": "96:7a:80:71:49:13",
            "net6": "a2:39:74:89:62:55",
            "net7": "3a:e7:fa:e7:18:72",
            "net8": "be:f8:27:5c:19:c4",
            "net9": "3e:b2:64:50:76:32"
        },
        "spine_1_1_9": {
            "net0": "a6:5b:f9:10:1d:e0",
            "net1": "66:b9:e3:e7:ad:6c",
            "net10": "9a:f4:2a:40:12:8c",
            "net11": "f2:46:cd:b6:16:1b",
            "net12": "aa:16:be:49:c1:b2",
            "net13": "4a:9b:e2:1d:de:c6",
            "net14": "4e:14:ba:c7:b2:1a",
            "net15": "de:72:10:64:5b:c7",
            "net16": "72:12:fc:43:da:9a",
            "net17": "2a:57:0a:35:2e:8f",
            "net18": "d2:0f:15:c9:56:fc",
            "net19": "6e:bc:78:b6:27:2c",
            "net2": "22:4f:8a:ba:6b:1a",
            "net20": "ea:ee:1c:34:94:7d",
            "net21": "fe:d4:3d:f1:ea:16",
            "net22": "2e:d9:cc:38:f1:46",
            "net23": "8e:35:9f:52:c3:9b",
            "net24": "ca:c0:60:8c:d5:e9",
            "net25": "0e:7a:d0:4c:5c:ef",
            "net26": "42:6f:fe:9c:3e:cb",
            "net27": "96:26:cf:b2:0f:53",
            "net3": "b2:54:6a:ea:14:33",
            "net4": "ba:9b:f5:20:e1:30",
            "net5": "ca:24:85:fe:9e:98",
            "net6": "8e:d0:58:39:a1:64",
            "net7": "aa:43:7a:c0:1b:88",
            "net8": "f6:3f:0b:cc:b8:e6",
            "net9": "52:d4:aa:9a:e2:c0"
        },
        "spine_2_1_1": {
            "net0": "8a:80:82:32:38:05",
            "net1": "3a:f3:96:8b:e2:f8",
            "net10": "fa:b9:e7:b7:ed:a1",
            "net11": "ca:3a:8a:a6:7e:35",
            "net12": "7e:72:10:b1:24:f6",
            "net13": "4e:d4:71:ed:24:50",
            "net14": "fe:4a:86:d5:f3:8f",
            "net15": "2e:ed:4a:7b:e1:41",
            "net16": "4a:a1:da:5a:41:49",
            "net17": "2a:49:9a:e1:cd:52",
            "net18": "a2:cd:de:04:dd:a7",
            "net19": "22:0e:78:69:ba:1f",
            "net2": "ca:d0:8e:82:64:62",
            "net20": "8e:60:64:c2:47:15",
            "net21": "d2:e1:8e:0d:00:00",
            "net22": "b6:14:ed:89:d2:ae",
            "net23": "52:7a:c6:56:c8:64",
            "net24": "6a:78:68:59:a3:97",
            "net25": "26:32:ec:3b:1c:c1",
            "net26": "22:e6:86:34:00:0e",
            "net27": "f6:1d:57:ff:a6:ad",
            "net3": "be:82:46:7a:9a:be",
            "net4": "ae:db:67:a7:9a:6e",
            "net5": "42:58:35:be:f1:28",
            "net6": "aa:1e:ae:83:ea:99",
            "net7": "e6:c4:54:47:b9:93",
            "net8": "4a:df:18:57:8c:ee",
            "net9": "aa:19:56:e8:94:36"
        },
        "spine_2_1_10": {
            "net0": "76:1e:00:ca:06:29",
            "net1": "f2:c8:86:74:24:f6",
            "net10": "f2:34:d8:58:1d:11",
            "net11": "fe:76:c7:18:2f:ef",
            "net12": "2e:f6:b0:dd:ab:f6",
            "net13": "52:f0:c4:1a:49:2b",
            "net14": "4a:3f:47:e2:54:5d",
            "net15": "02:9a:b2:7a:b6:64",
            "net16": "42:51:e2:b5:eb:f1",
            "net17": "2e:6a:7f:b8:20:c6",
            "net18": "52:c4:af:a2:4c:a4",
            "net19": "62:a8:82:5a:44:75",
            "net2": "0a:95:dd:17:5b:0a",
            "net20": "3e:7e:78:e1:e6:07",
            "net21": "36:b9:4b:d0:cb:68",
            "net22": "82:e5:2c:f1:ad:8a",
            "net23": "26:87:f4:15:e5:a2",
            "net24": "82:4f:df:48:f3:d3",
            "net25": "ce:d4:8c:dc:bf:63",
            "net26": "b6:1d:8f:d3:fc:64",
            "net27": "62:57:78:31:17:f4",
            "net3": "ee:42:57:af:ab:64",
            "net4": "16:33:2f:8c:cd:9a",
            "net5": "ea:9d:4d:3e:8e:d6",
            "net6": "4a:d6:20:72:83:8b",
            "net7": "ea:8d:e2:c6:3c:07",
            "net8": "de:f8:5f:9e:65:30",
            "net9": "62:1b:5e:83:94:18"
        },
        "spine_2_1_11": {
            "net0": "02:46:2e:33:3f:88",
            "net1": "22:f9:cd:e9:42:20",
            "net10": "ea:f9:e4:1b:c9:d0",
            "net11": "a2:92:1c:b2:65:4b",
            "net12": "e2:1f:13:51:86:07",
            "net13": "42:45:4c:6f:b8:aa",
            "net14": "12:62:a1:6a:6a:6a",
            "net15": "c6:75:4b:f9:b6:17",
            "net16": "1e:02:ac:e0:81:e5",
            "net17": "da:c2:2e:62:f5:52",
            "net18": "2a:8c:3b:25:49:66",
            "net19": "f6:4f:f6:17:36:bb",
            "net2": "7e:83:9b:e5:e5:9c",
            "net20": "2e:a9:b4:7c:73:02",
            "net21": "42:1e:d0:59:b2:75",
            "net22": "da:9a:a6:a5:1c:28",
            "net23": "06:8b:1b:89:68:a7",
            "net24": "fe:2e:40:8a:1f:ba",
            "net25": "a6:03:f7:b7:1e:21",
            "net26": "4e:b1:b4:12:08:1c",
            "net27": "86:ce:21:82:52:ff",
            "net3": "5e:7d:53:0b:0a:fa",
            "net4": "06:64:db:7c:96:ec",
            "net5": "86:fb:18:54:dc:06",
            "net6": "c2:8f:66:fb:f6:15",
            "net7": "96:49:c5:09:12:40",
            "net8": "82:90:6c:72:4d:ff",
            "net9": "86:9c:d8:7a:a1:e6"
        },
        "spine_2_1_12": {
            "net0": "c6:05:85:98:15:74",
            "net1": "62:45:0a:17:0e:b5",
            "net10": "6a:83:92:6e:73:09",
            "net11": "12:1a:9e:5d:4a:6e",
            "net12": "16:b8:68:50:30:87",
            "net13": "7a:56:30:b3:00:39",
            "net14": "8a:7f:1d:5b:d3:af",
            "net15": "4a:e8:b7:f5:29:f2",
            "net16": "32:1e:64:c7:43:14",
            "net17": "ca:18:69:6b:2a:98",
            "net18": "0a:9a:68:bc:ce:e8",
            "net19": "ea:5a:29:b0:54:1f",
            "net2": "3e:06:8d:32:dd:e4",
            "net20": "96:dc:4b:12:0b:10",
            "net21": "fe:51:b7:b1:c2:49",
            "net22": "ba:a7:8c:79:61:7f",
            "net23": "3a:7a:33:9f:c9:90",
            "net24": "66:c6:62:5c:78:ee",
            "net25": "e6:a0:2a:39:96:e5",
            "net26": "26:a8:00:b7:62:a0",
            "net27": "3e:73:cb:bc:f9:3c",
            "net3": "ea:4a:82:1e:ed:c9",
            "net4": "5e:ac:4d:4a:9c:50",
            "net5": "16:09:0e:96:45:76",
            "net6": "ae:8e:58:bf:0c:71",
            "net7": "e2:a6:c4:b3:be:ae",
            "net8": "16:ec:d8:ee:cf:37",
            "net9": "7e:56:ed:84:0a:f2"
        },
        "spine_2_1_13": {
            "net0": "16:77:75:18:c8:cd",
            "net1": "ce:8e:fc:46:a9:f1",
            "net10": "f2:de:fb:5a:1a:ec",
            "net11": "8e:20:f8:88:38:df",
            "net12": "da:82:aa:d4:70:e1",
            "net13": "7a:19:b4:6b:73:fb",
            "net14": "5e:f1:fe:3a:4b:20",
            "net15": "ca:60:d0:9b:96:24",
            "net16": "f6:6f:49:3b:c6:cc",
            "net17": "92:7e:91:bc:a2:94",
            "net18": "ae:f0:fd:07:f9:9c",
            "net19": "de:9b:ba:32:59:ee",
            "net2": "f6:f0:82:3a:56:8c",
            "net20": "ea:d8:2a:59:33:b5",
            "net21": "5e:5e:1d:4d:c2:e8",
            "net22": "8e:d8:79:63:6e:85",
            "net23": "4e:cd:de:ae:ec:1b",
            "net24": "1a:48:25:5f:31:f2",
            "net25": "ba:f1:2d:e7:12:29",
            "net26": "32:67:9e:38:7a:5d",
            "net27": "3a:0a:7e:86:8e:80",
            "net3": "b6:ed:b0:89:7a:11",
            "net4": "5e:54:a6:f7:a1:82",
            "net5": "82:fe:80:70:9e:94",
            "net6": "9a:13:77:4b:22:18",
            "net7": "d6:f2:e2:6a:21:25",
            "net8": "26:96:2b:43:e1:70",
            "net9": "da:25:50:1c:48:81"
        },
        "spine_2_1_14": {
            "net0": "f2:28:16:ce:1e:20",
            "net1": "7e:28:e8:d8:fe:d2",
            "net10": "9a:17:f6:6b:0a:36",
            "net11": "ee:e0:c6:df:93:56",
            "net12": "46:ef:59:d5:59:8e",
            "net13": "22:96:1d:db:60:ce",
            "net14": "fa:74:0b:be:c2:85",
            "net15": "e2:e1:8a:f9:b9:7a",
            "net16": "16:41:46:f8:ac:7a",
            "net17": "06:f7:1c:4c:7a:9e",
            "net18": "2e:be:1c:09:45:fa",
            "net19": "de:2d:f7:49:37:ad",
            "net2": "82:63:f1:d6:d5:f5",
            "net20": "72:3a:24:2f:60:ff",
            "net21": "02:56:27:2e:c7:5d",
            "net22": "76:6a:8f:0d:60:9b",
            "net23": "f6:06:59:5c:1b:33",
            "net24": "5a:7b:a6:15:de:b5",
            "net25": "72:e3:da:c4:8b:4f",
            "net26": "b2:1c:e9:cd:9f:0f",
            "net27": "96:61:e1:ea:28:10",
            "net3": "f6:00:0f:e4:fd:9f",
            "net4": "4e:33:ca:dd:80:1a",
            "net5": "46:4e:4b:74:d9:ad",
            "net6": "3e:2d:dc:8b:f0:fa",
            "net7": "ae:6e:59:78:f8:a3",
            "net8": "fa:31:ab:14:3d:ea",
            "net9": "4e:0f:95:d9:58:dd"
        },
        "spine_2_1_2": {
            "net0": "3e:37:8e:59:ee:e8",
            "net1": "e2:c1:79:0d:6c:1e",
            "net10": "22:c3:9a:2d:82:04",
            "net11": "86:a4:a5:f8:d5:b9",
            "net12": "8a:0b:7b:77:95:37",
            "net13": "d6:c5:56:f5:e7:1f",
            "net14": "2e:e6:f3:fd:a8:d6",
            "net15": "42:c1:58:16:95:87",
            "net16": "ba:fb:47:64:33:19",
            "net17": "c6:ce:a1:cf:a3:06",
            "net18": "de:ae:e4:6b:32:83",
            "net19": "c2:72:98:b3:57:f3",
            "net2": "6e:b1:59:56:13:b8",
            "net20": "e2:68:99:a6:a6:cf",
            "net21": "e6:7a:b9:03:d6:37",
            "net22": "de:a3:51:cd:71:05",
            "net23": "1a:45:67:86:26:f1",
            "net24": "32:7b:b9:a4:d3:0c",
            "net25": "8e:d6:05:a8:8e:13",
            "net26": "7a:34:7f:58:18:d1",
            "net27": "16:bb:8c:13:f5:c1",
            "net3": "56:bf:6c:d9:e0:3e",
            "net4": "8e:12:ae:02:48:e9",
            "net5": "12:ad:38:a6:61:cb",
            "net6": "a2:a9:fc:4f:d2:cf",
            "net7": "e6:83:85:83:ce:3c",
            "net8": "4e:07:1f:3d:4f:e4",
            "net9": "b6:bc:4b:85:4a:d4"
        },
        "spine_2_1_3": {
            "net0": "8e:00:6c:23:b4:e0",
            "net1": "56:1f:f4:01:d8:ce",
            "net10": "42:6e:c3:d3:24:3b",
            "net11": "0e:4e:4f:bd:71:2a",
            "net12": "22:8e:3e:79:69:d3",
            "net13": "9e:00:1f:af:8e:71",
            "net14": "76:4f:fb:80:9c:96",
            "net15": "de:f6:7b:1c:4b:3c",
            "net16": "2e:4a:91:77:b7:9c",
            "net17": "a2:24:62:7e:f8:f6",
            "net18": "1a:a2:39:5e:64:df",
            "net19": "d6:d4:c7:f0:88:86",
            "net2": "0e:17:54:48:6b:06",
            "net20": "0e:33:42:d2:66:56",
            "net21": "2e:10:a2:5c:ab:d6",
            "net22": "02:99:ac:57:21:f3",
            "net23": "8e:f2:72:6e:6e:3f",
            "net24": "d6:09:fd:ff:e6:c6",
            "net25": "92:e7:02:c2:5a:47",
            "net26": "0e:0f:f7:f4:64:ef",
            "net27": "ea:0e:62:be:f0:a0",
            "net3": "fa:8c:04:54:23:ab",
            "net4": "a6:3c:71:26:47:75",
            "net5": "66:e9:be:44:73:47",
            "net6": "0e:9e:a6:cb:6e:38",
            "net7": "7e:0b:c1:89:8c:f0",
            "net8": "7e:11:72:46:4d:bb",
            "net9": "32:e4:94:6d:9b:3b"
        },
        "spine_2_1_4": {
            "net0": "1a:0d:76:d8:14:21",
            "net1": "d6:22:8f:b6:a9:1f",
            "net10": "a2:09:8d:5b:7e:0f",
            "net11": "4e:02:a1:45:ea:5c",
            "net12": "f2:d5:55:32:38:4c",
            "net13": "16:cd:88:60:65:b8",
            "net14": "12:ab:e8:12:63:04",
            "net15": "12:f0:40:ae:7d:df",
            "net16": "ce:7e:44:82:39:7a",
            "net17": "d2:9b:2c:cd:48:51",
            "net18": "96:f8:68:42:ca:dd",
            "net19": "9e:a7:f3:e2:29:93",
            "net2": "2e:2d:4e:d7:a0:e4",
            "net20": "5e:5b:96:b7:e8:30",
            "net21": "d6:c0:24:fe:8d:31",
            "net22": "9e:db:d7:06:66:6c",
            "net23": "36:01:25:c2:67:64",
            "net24": "36:7f:ff:a7:10:29",
            "net25": "36:ff:d9:c3:f6:e5",
            "net26": "1a:09:0b:f7:a6:0f",
            "net27": "66:39:6e:63:f8:67",
            "net3": "ce:7a:c8:42:54:22",
            "net4": "36:f8:f4:c1:18:9d",
            "net5": "42:eb:ca:f2:6c:f2",
            "net6": "5e:95:0a:86:4d:b2",
            "net7": "52:1f:43:a7:0c:99",
            "net8": "5e:b9:a0:eb:65:95",
            "net9": "fa:37:f1:9a:ac:9a"
        },
        "spine_2_1_5": {
            "net0": "a6:98:bc:66:d6:9e",
            "net1": "be:0a:ff:99:56:53",
            "net10": "f6:4e:91:69:11:10",
            "net11": "96:de:7d:f9:73:7c",
            "net12": "2e:ee:08:3d:7d:42",
            "net13": "86:b2:2c:ec:39:d1",
            "net14": "8a:c5:6f:df:d2:01",
            "net15": "ce:80:aa:2b:40:29",
            "net16": "42:2a:2c:f1:6c:56",
            "net17": "c6:90:f1:79:7b:ad",
            "net18": "06:07:ef:61:bb:cf",
            "net19": "8e:1f:c8:76:1f:a7",
            "net2": "16:3c:90:bc:63:ba",
            "net20": "86:84:51:dc:3d:d2",
            "net21": "ee:80:70:2d:83:eb",
            "net22": "32:c9:83:54:2d:2f",
            "net23": "aa:47:8a:b6:21:a0",
            "net24": "ee:94:bc:35:3f:bf",
            "net25": "d2:b2:be:5a:73:fc",
            "net26": "9e:ad:02:de:96:a9",
            "net27": "ce:55:db:5b:d5:88",
            "net3": "ee:b8:ab:57:ef:d9",
            "net4": "92:a7:29:d6:c4:ef",
            "net5": "26:e1:76:46:83:ec",
            "net6": "e2:96:78:d6:36:01",
            "net7": "b2:bc:1f:5e:65:02",
            "net8": "36:3e:22:6e:24:8d",
            "net9": "0e:74:15:7d:18:48"
        },
        "spine_2_1_6": {
            "net0": "1a:ab:66:ac:12:3d",
            "net1": "96:90:f3:c9:38:53",
            "net10": "aa:d5:a1:8d:c0:6c",
            "net11": "e6:82:e6:9d:ad:cb",
            "net12": "32:dd:9f:b5:6c:aa",
            "net13": "ca:9a:2f:07:6c:1b",
            "net14": "ee:1d:5d:1f:c7:90",
            "net15": "fa:fa:68:df:df:43",
            "net16": "fa:84:79:71:e8:40",
            "net17": "fe:b5:6b:80:5c:4c",
            "net18": "3e:99:d9:cb:bd:c6",
            "net19": "12:b4:7a:b0:4a:d2",
            "net2": "be:06:e3:6e:f2:5e",
            "net20": "4a:2d:92:2a:2c:af",
            "net21": "d2:c3:24:a6:f3:7d",
            "net22": "c6:81:de:89:4a:b6",
            "net23": "ee:a4:36:b1:b3:6e",
            "net24": "42:e9:c3:0a:3a:f9",
            "net25": "9a:28:70:71:f9:9c",
            "net26": "e2:d2:fb:24:49:12",
            "net27": "1a:bb:df:1b:2d:e4",
            "net3": "12:80:77:2a:43:31",
            "net4": "0e:82:32:2c:de:20",
            "net5": "f2:74:67:13:5c:b7",
            "net6": "22:5c:fe:92:55:ab",
            "net7": "06:f2:c2:a2:0f:f1",
            "net8": "86:e6:56:3a:8b:a7",
            "net9": "ae:3e:3e:aa:7b:89"
        },
        "spine_2_1_7": {
            "net0": "22:87:f8:47:31:16",
            "net1": "2e:62:e6:6a:f9:93",
            "net10": "7a:b6:34:ac:dd:33",
            "net11": "2a:47:90:c4:1e:eb",
            "net12": "e2:ee:5d:61:d0:33",
            "net13": "46:21:c1:20:28:06",
            "net14": "66:03:50:44:c8:9c",
            "net15": "a2:64:bc:ba:ac:85",
            "net16": "de:58:3e:d2:ee:04",
            "net17": "52:1f:da:e1:3d:ff",
            "net18": "2e:5e:93:03:0f:57",
            "net19": "42:21:e0:df:65:49",
            "net2": "26:3e:14:e9:42:03",
            "net20": "6a:3d:3d:f5:92:80",
            "net21": "46:1d:a5:88:24:f1",
            "net22": "ae:4d:e5:9a:0e:ba",
            "net23": "8a:b6:24:6b:0b:cf",
            "net24": "e2:e8:2d:0e:27:a0",
            "net25": "32:d3:6a:5f:41:21",
            "net26": "4e:28:15:8b:99:1a",
            "net27": "72:d4:9b:50:85:c0",
            "net3": "f2:47:df:e6:4c:c8",
            "net4": "02:df:5f:f9:f4:17",
            "net5": "7a:72:a8:d4:ec:00",
            "net6": "a6:48:cb:61:ee:d8",
            "net7": "32:43:14:f5:eb:d6",
            "net8": "9a:51:e1:07:c7:ed",
            "net9": "3e:25:86:7b:2c:bf"
        },
        "spine_2_1_8": {
            "net0": "42:85:46:29:3b:f2",
            "net1": "c6:54:ef:ab:9b:a2",
            "net10": "ae:9f:6f:e5:82:8e",
            "net11": "46:f6:ae:c7:fa:69",
            "net12": "a2:13:e8:07:6e:b9",
            "net13": "f2:61:5c:c1:1e:bb",
            "net14": "36:11:21:22:0c:37",
            "net15": "ce:c6:7c:d2:82:bd",
            "net16": "9a:9a:b7:31:ea:22",
            "net17": "06:b8:10:46:64:f2",
            "net18": "d6:46:a1:c3:25:3b",
            "net19": "b6:f7:c6:d2:7c:6c",
            "net2": "82:f9:a6:be:cf:8e",
            "net20": "1e:f8:52:a9:67:8b",
            "net21": "06:ca:59:e8:2e:03",
            "net22": "5a:9e:fb:f1:ca:8a",
            "net23": "da:f0:ad:b4:cb:46",
            "net24": "76:c0:1f:2b:0e:ac",
            "net25": "0a:a2:e8:1d:c2:97",
            "net26": "4e:64:21:69:4b:3c",
            "net27": "56:eb:f1:91:3b:80",
            "net3": "be:e6:17:87:58:92",
            "net4": "de:18:82:8f:bf:6a",
            "net5": "76:ad:d5:94:4d:02",
            "net6": "ae:a8:e0:5b:cf:70",
            "net7": "ba:88:10:4a:af:f1",
            "net8": "0e:43:aa:1c:87:9d",
            "net9": "ee:59:ed:93:b1:ef"
        },
        "spine_2_1_9": {
            "net0": "12:85:56:3a:44:b0",
            "net1": "56:53:0b:5a:c0:e5",
            "net10": "d2:41:94:ab:18:a7",
            "net11": "f6:22:0e:ea:8a:87",
            "net12": "2a:6a:0e:9c:29:aa",
            "net13": "c6:8d:66:ce:ef:85",
            "net14": "e6:63:5c:da:3d:ea",
            "net15": "d6:b4:d5:8a:09:18",
            "net16": "52:50:df:a7:d8:64",
            "net17": "0e:d3:eb:5c:3d:32",
            "net18": "ea:4a:e5:9a:e1:3e",
            "net19": "5a:d7:fe:79:8a:3f",
            "net2": "0a:35:45:24:71:64",
            "net20": "02:b2:3c:3b:eb:51",
            "net21": "f6:a7:b6:f5:cc:7c",
            "net22": "96:22:80:73:01:ad",
            "net23": "22:86:ce:ad:7f:d0",
            "net24": "f2:09:0b:b1:79:54",
            "net25": "0a:f0:40:ae:8c:3c",
            "net26": "f6:8c:90:c9:ff:c1",
            "net27": "f2:a2:cd:c2:36:d4",
            "net3": "fe:c8:1c:b3:6c:8c",
            "net4": "ee:7c:e5:d3:37:3b",
            "net5": "d6:fe:d1:4f:ea:5e",
            "net6": "a6:6d:8b:3f:d1:49",
            "net7": "7e:c7:d6:88:bb:02",
            "net8": "c2:8c:c6:93:8d:86",
            "net9": "1a:db:54:cd:a4:32"
        },
        "tof_1_2_1": {
            "net0": "ce:9f:7d:66:10:14",
            "net1": "8e:60:1d:84:9e:5b",
            "net10": "a2:ee:79:a7:44:ed",
            "net11": "4e:83:73:b9:44:41",
            "net12": "da:1b:27:d5:7a:fc",
            "net13": "26:da:46:db:6b:ad",
            "net14": "1a:f8:8b:77:e3:20",
            "net15": "56:8d:69:a9:57:15",
            "net16": "0e:3e:d9:29:76:1e",
            "net17": "ba:bc:c3:ad:14:7d",
            "net18": "e2:63:0d:96:1f:ea",
            "net19": "e2:97:60:6e:fc:41",
            "net2": "d6:39:15:b5:b5:d3",
            "net20": "f2:e6:5d:fd:48:3f",
            "net21": "56:1b:78:44:2c:6e",
            "net22": "ae:6c:07:20:c9:b9",
            "net23": "d6:49:5f:dc:17:e6",
            "net24": "32:26:8d:45:b7:02",
            "net25": "b2:7e:47:c5:9e:fa",
            "net26": "46:e7:2f:ab:9c:ee",
            "net27": "8a:3c:fd:9d:d8:62",
            "net3": "2a:93:a5:8e:90:14",
            "net4": "fa:b2:41:2c:e6:33",
            "net5": "5e:32:90:c2:b8:a6",
            "net6": "be:80:81:45:15:0b",
            "net7": "da:7f:41:4b:2b:82",
            "net8": "76:1f:c4:db:f9:1a",
            "net9": "0e:3b:54:fa:68:33"
        },
        "tof_1_2_10": {
            "net0": "16:ae:a8:9c:19:29",
            "net1": "42:db:9d:05:2b:63",
            "net10": "06:90:c2:ac:b5:28",
            "net11": "62:76:bf:71:67:d3",
            "net12": "b2:44:30:7a:a2:b9",
            "net13": "aa:dc:ed:51:19:e7",
            "net14": "e2:0b:b2:0e:7b:0d",
            "net15": "9e:ae:03:f1:a8:13",
            "net16": "ae:bf:4a:a7:db:d8",
            "net17": "3e:5f:d4:2a:50:ac",
            "net18": "22:e3:7e:4f:9b:63",
            "net19": "b6:a5:ea:e9:d9:5c",
            "net2": "de:eb:7a:3f:ee:24",
            "net20": "ce:01:35:26:78:5c",
            "net21": "8a:fb:c7:87:68:19",
            "net22": "f6:57:51:22:d1:d3",
            "net23": "aa:2c:69:66:d9:a6",
            "net24": "c2:e7:87:d6:6d:78",
            "net25": "46:e4:99:6f:e0:a9",
            "net26": "2a:03:6d:0e:10:aa",
            "net27": "96:01:3c:3d:de:ae",
            "net3": "e6:e1:e6:a4:8e:3e",
            "net4": "4a:d0:dc:5e:86:8a",
            "net5": "f2:89:09:d9:60:3b",
            "net6": "ba:fd:75:49:78:51",
            "net7": "d2:cc:b1:87:0d:cb",
            "net8": "66:0d:5a:22:21:d2",
            "net9": "ee:68:bc:96:7c:9f"
        },
        "tof_1_2_11": {
            "net0": "aa:d7:38:aa:ab:6b",
            "net1": "42:01:bf:05:3f:f4",
            "net10": "7a:7f:b2:a3:28:68",
            "net11": "8e:ac:ec:08:f9:64",
            "net12": "42:85:26:f1:6a:f6",
            "net13": "9a:7f:73:9c:25:53",
            "net14": "4a:9d:52:fe:38:26",
            "net15": "02:ef:64:3e:dc:80",
            "net16": "da:80:e6:61:f3:97",
            "net17": "2e:04:0d:13:41:f8",
            "net18": "7e:3a:9f:18:09:d1",
            "net19": "ba:67:47:9f:d0:16",
            "net2": "42:0f:34:07:9a:11",
            "net20": "5a:bd:0c:14:9a:21",
            "net21": "0a:d4:73:4d:28:b7",
            "net22": "b6:90:01:23:bc:9a",
            "net23": "ea:ca:bf:d6:4b:e7",
            "net24": "1a:87:6f:64:ce:88",
            "net25": "12:c5:db:2a:38:b6",
            "net26": "9e:e3:4f:96:6c:79",
            "net27": "96:b3:72:0b:cb:00",
            "net3": "22:26:07:0e:cf:b3",
            "net4": "9e:52:e0:ac:03:83",
            "net5": "f2:aa:f1:c6:60:15",
            "net6": "12:11:96:2e:3c:ec",
            "net7": "9a:a9:c3:01:06:fd",
            "net8": "62:da:dc:b4:5f:05",
            "net9": "66:75:a6:01:cb:a9"
        },
        "tof_1_2_12": {
            "net0": "e2:fb:fb:cf:a4:79",
            "net1": "c2:14:46:c3:9d:8e",
            "net10": "f6:63:53:a0:fe:66",
            "net11": "56:eb:0f:95:cf:07",
            "net12": "86:fd:02:7f:35:76",
            "net13": "62:72:69:6d:4b:0e",
            "net14": "1e:98:a8:6c:c5:96",
            "net15": "d6:91:dd:e7:22:6d",
            "net16": "86:69:b5:f2:4f:3f",
            "net17": "da:ba:39:59:03:4c",
            "net18": "0a:87:40:b9:97:b8",
            "net19": "66:3a:1f:90:1b:41",
            "net2": "c2:1e:29:6d:3c:a5",
            "net20": "6e:62:8d:23:b2:6a",
            "net21": "9a:08:0c:d5:07:85",
            "net22": "de:82:cf:1c:1b:45",
            "net23": "9e:78:f9:07:9e:99",
            "net24": "82:ff:92:a2:c9:92",
            "net25": "3a:61:18:3b:c3:41",
            "net26": "06:56:c9:8d:17:82",
            "net27": "b2:3d:9c:63:1f:d7",
            "net3": "ce:35:af:52:0c:8b",
            "net4": "f6:76:d0:78:8b:b9",
            "net5": "66:97:be:dc:3b:63",
            "net6": "9a:74:a9:78:41:13",
            "net7": "da:5e:a5:7f:fe:5f",
            "net8": "be:0f:45:0f:fb:99",
            "net9": "aa:a5:c2:a9:e2:ba"
        },
        "tof_1_2_13": {
            "net0": "ba:21:34:78:5e:d8",
            "net1": "a2:2c:34:0e:d5:9b",
            "net10": "b6:b5:db:2d:48:49",
            "net11": "b2:96:0d:d5:e3:af",
            "net12": "9a:5a:6d:b7:9d:bd",
            "net13": "82:f0:d4:24:4b:f7",
            "net14": "7e:1a:44:bd:42:1a",
            "net15": "9a:b9:70:6b:3f:8b",
            "net16": "16:f3:03:4e:79:19",
            "net17": "12:af:a7:f5:e1:96",
            "net18": "4e:29:f6:b4:8f:1f",
            "net19": "a2:71:52:91:1f:e4",
            "net2": "2a:43:75:cc:fe:38",
            "net20": "2e:e3:79:7f:cf:36",
            "net21": "0e:34:0c:fd:d0:ab",
            "net22": "b6:fd:df:11:de:cf",
            "net23": "36:94:b7:88:f9:a0",
            "net24": "fe:b7:b2:af:59:ca",
            "net25": "32:37:1e:f6:12:04",
            "net26": "0e:84:86:ba:42:9c",
            "net27": "92:dd:c2:26:aa:72",
            "net3": "d2:ba:e0:9b:02:e9",
            "net4": "ce:64:88:ec:78:69",
            "net5": "9a:e8:b6:2b:c5:5f",
            "net6": "86:27:fd:da:5e:00",
            "net7": "2a:d7:b4:c3:5f:35",
            "net8": "0a:2f:87:05:c3:f5",
            "net9": "26:60:be:96:05:1c"
        },
        "tof_1_2_14": {
            "net0": "9a:07:11:6e:0b:f8",
            "net1": "02:db:59:8b:05:d6",
            "net10": "42:92:b8:ec:d3:3a",
            "net11": "aa:f0:66:07:a0:dc",
            "net12": "92:af:91:e7:73:1e",
            "net13": "ce:a5:c6:4b:f6:9c",
            "net14": "3e:12:79:48:92:c0",
            "net15": "be:26:ea:56:2f:cf",
            "net16": "3a:ab:39:18:b0:d9",
            "net17": "d2:f5:6b:d7:08:f6",
            "net18": "e6:09:22:68:4b:3e",
            "net19": "96:f5:a7:ba:87:35",
            "net2": "36:4c:2c:b7:a8:10",
            "net20": "c2:a8:f0:64:b9:68",
            "net21": "d6:65:c6:c6:3f:cb",
            "net22": "c2:a9:ae:88:51:82",
            "net23": "e6:45:71:f2:29:2d",
            "net24": "d2:1d:51:55:1a:8a",
            "net25": "4e:95:f5:6b:61:7b",
            "net26": "ca:c5:00:28:3e:00",
            "net27": "7a:84:df:45:4c:8a",
            "net3": "3a:b1:3a:fe:ff:7a",
            "net4": "96:8c:4e:cc:8e:d9",
            "net5": "56:2a:a5:5c:d2:4a",
            "net6": "be:6e:6f:82:46:dc",
            "net7": "3e:41:db:69:a2:bc",
            "net8": "5e:71:d4:49:7a:d6",
            "net9": "be:d1:e9:c6:e4:31"
        },
        "tof_1_2_2": {
            "net0": "d2:2e:0d:f7:df:1b",
            "net1": "02:5c:17:01:13:0d",
            "net10": "5a:59:aa:80:3a:8b",
            "net11": "66:53:1e:23:11:ae",
            "net12": "4e:eb:65:a3:de:a1",
            "net13": "4e:25:20:5b:67:d5",
            "net14": "8e:4a:0f:42:0e:f5",
            "net15": "3e:60:79:f7:ba:2d",
            "net16": "be:ae:c4:09:df:5a",
            "net17": "c2:8c:32:c9:1f:58",
            "net18": "ae:43:61:b1:9c:e5",
            "net19": "42:81:40:3e:aa:77",
            "net2": "22:f5:3c:38:f6:ed",
            "net20": "36:37:a7:44:33:ea",
            "net21": "46:24:12:7e:a0:a7",
            "net22": "52:3b:0b:e6:66:c5",
            "net23": "aa:a2:ef:5e:58:a6",
            "net24": "d2:30:77:70:77:f2",
            "net25": "f2:67:86:8a:d6:70",
            "net26": "ee:75:4e:f1:cb:56",
            "net27": "62:34:5b:12:1a:3c",
            "net3": "36:d1:7e:40:54:bd",
            "net4": "22:f0:d4:bd:c2:d4",
            "net5": "ea:59:ba:28:aa:41",
            "net6": "4a:d6:4b:70:47:67",
            "net7": "0a:a2:1a:95:cf:b4",
            "net8": "36:03:de:95:2f:a4",
            "net9": "02:f5:ff:ca:79:73"
        },
        "tof_1_2_3": {
            "net0": "7a:cc:89:9c:ee:d4",
            "net1": "e2:a8:d3:d5:83:3b",
            "net10": "5a:50:2b:16:71:51",
            "net11": "ba:44:1d:d4:50:b1",
            "net12": "42:ce:31:0d:6e:47",
            "net13": "ba:85:11:55:ea:e7",
            "net14": "26:03:b9:e9:a3:4d",
            "net15": "9a:59:f2:91:b3:5a",
            "net16": "6e:38:91:1e:dc:61",
            "net17": "ce:e4:c7:f7:93:20",
            "net18": "02:33:5a:e4:c6:cf",
            "net19": "f6:d9:27:68:8e:07",
            "net2": "ce:af:92:2e:82:13",
            "net20": "b6:cf:99:22:24:80",
            "net21": "96:c7:55:fa:87:c1",
            "net22": "86:05:a6:cb:21:82",
            "net23": "b2:1d:20:e7:84:fe",
            "net24": "06:f0:3f:b6:dc:dc",
            "net25": "8e:6f:63:24:f2:30",
            "net26": "4e:b0:52:c3:10:c0",
            "net27": "7a:bb:6f:1e:f6:af",
            "net3": "fa:65:a2:9e:99:12",
            "net4": "6a:e1:70:5a:ff:39",
            "net5": "5a:61:aa:ca:ff:39",
            "net6": "ba:2b:65:14:7b:02",
            "net7": "ea:1d:30:3a:d6:3d",
            "net8": "86:83:3f:ef:f4:a4",
            "net9": "02:0f:b7:1f:82:90"
        },
        "tof_1_2_4": {
            "net0": "2a:3f:46:7d:77:b3",
            "net1": "4a:ce:92:5b:20:ce",
            "net10": "12:6f:6a:5c:bb:b2",
            "net11": "26:c7:47:1e:44:8e",
            "net12": "5e:e8:e8:00:36:01",
            "net13": "32:12:58:b3:ad:fd",
            "net14": "ba:61:97:a0:a4:3f",
            "net15": "ae:9a:2e:a0:be:8b",
            "net16": "3a:ef:83:1b:76:6b",
            "net17": "1a:1c:3c:16:29:81",
            "net18": "1e:72:95:27:6e:b8",
            "net19": "02:3f:7b:3a:f0:71",
            "net2": "76:1c:4d:25:6f:01",
            "net20": "0a:c8:4c:0d:cf:3a",
            "net21": "5e:38:d5:73:02:06",
            "net22": "7a:78:59:9d:d8:ab",
            "net23": "a6:f2:6e:17:e0:03",
            "net24": "a2:0d:10:23:30:05",
            "net25": "aa:33:cf:e2:9b:d7",
            "net26": "d6:ae:30:a0:e4:81",
            "net27": "4e:76:0b:0d:70:89",
            "net3": "5a:fa:65:76:22:c1",
            "net4": "5a:71:ac:35:20:11",
            "net5": "a2:e1:4a:7b:33:a3",
            "net6": "7a:15:18:c0:80:ca",
            "net7": "32:2b:5c:37:98:18",
            "net8": "9e:9d:0e:8e:9b:f5",
            "net9": "26:0c:6d:32:b6:c9"
        },
        "tof_1_2_5": {
            "net0": "2e:fa:16:79:1f:13",
            "net1": "3e:c5:ec:9b:bf:d9",
            "net10": "8a:01:8c:e1:10:0b",
            "net11": "02:35:fc:4c:13:52",
            "net12": "fa:58:4a:53:7b:cd",
            "net13": "6a:6b:53:d3:73:99",
            "net14": "ca:15:17:42:09:2e",
            "net15": "26:03:b5:0a:fc:62",
            "net16": "de:96:39:ff:7f:dc",
            "net17": "c2:ba:21:b9:d2:43",
            "net18": "92:cd:b3:fb:48:1d",
            "net19": "c2:48:46:30:3a:80",
            "net2": "ea:e6:e5:28:7d:96",
            "net20": "0e:67:6c:a5:bb:de",
            "net21": "2e:58:b7:75:16:7f",
            "net22": "42:e6:23:63:81:dd",
            "net23": "26:e9:b1:b0:e7:8d",
            "net24": "be:4a:c4:fc:78:2d",
            "net25": "6e:23:03:88:af:35",
            "net26": "92:cd:2f:44:ec:48",
            "net27": "e6:12:8b:df:0e:dd",
            "net3": "d2:d9:41:e7:fe:85",
            "net4": "16:98:21:08:52:57",
            "net5": "a2:60:bc:e6:df:ee",
            "net6": "16:9d:76:4a:67:82",
            "net7": "62:1c:25:45:9f:37",
            "net8": "96:3e:61:f7:cc:a9",
            "net9": "ae:61:38:82:b7:73"
        },
        "tof_1_2_6": {
            "net0": "1e:5f:d9:25:23:24",
            "net1": "02:92:85:c2:33:42",
            "net10": "06:8c:75:a8:1f:31",
            "net11": "1a:04:ec:67:3b:c9",
            "net12": "f2:f3:d3:39:c6:b1",
            "net13": "fa:42:27:91:9a:85",
            "net14": "36:8e:1a:d4:73:8f",
            "net15": "a6:ab:22:71:3b:41",
            "net16": "3a:ef:de:c1:d6:a1",
            "net17": "de:48:4b:b7:5b:17",
            "net18": "66:20:37:bc:5a:40",
            "net19": "32:74:65:c7:23:6b",
            "net2": "aa:95:00:d9:2b:3a",
            "net20": "0a:e7:a9:b0:d3:53",
            "net21": "0e:ef:97:d6:b3:61",
            "net22": "da:de:77:d9:34:4f",
            "net23": "06:43:c2:5e:0d:d0",
            "net24": "de:22:e9:81:3c:a5",
            "net25": "e6:37:6e:47:7c:1e",
            "net26": "12:c5:5a:30:7e:03",
            "net27": "fe:6b:0e:f1:3e:70",
            "net3": "6e:60:45:5d:8b:af",
            "net4": "c2:9f:a6:8a:b7:4b",
            "net5": "26:df:1e:be:6f:e3",
            "net6": "fe:26:a5:88:07:4b",
            "net7": "d6:83:b2:55:40:8c",
            "net8": "76:8c:e2:3c:10:9e",
            "net9": "0e:63:40:99:35:cb"
        },
        "tof_1_2_7": {
            "net0": "8e:29:7f:73:c2:f6",
            "net1": "92:c8:5a:31:3a:54",
            "net10": "9a:44:16:aa:b9:35",
            "net11": "7e:57:46:7f:d1:af",
            "net12": "0a:72:fc:ca:88:f7",
            "net13": "4e:d1:75:34:e6:75",
            "net14": "ee:e0:5b:9d:e1:b7",
            "net15": "96:80:80:5a:e2:4d",
            "net16": "b2:c7:3b:18:59:88",
            "net17": "72:eb:e5:d8:01:01",
            "net18": "8a:ae:82:15:60:18",
            "net19": "a2:e0:e4:1f:9c:e0",
            "net2": "de:1f:42:a1:5c:68",
            "net20": "16:de:cc:e7:af:5a",
            "net21": "06:27:50:9c:aa:a7",
            "net22": "fe:43:51:2b:c6:11",
            "net23": "2a:c0:6d:df:2e:b4",
            "net24": "26:fb:c2:69:73:67",
            "net25": "56:33:0c:48:20:9d",
            "net26": "2e:66:96:64:dc:dc",
            "net27": "ae:84:2f:84:fc:67",
            "net3": "0e:05:95:88:42:11",
            "net4": "32:14:19:e9:f6:fb",
            "net5": "da:42:1b:31:ac:15",
            "net6": "06:2f:03:a6:b9:95",
            "net7": "82:de:a1:d4:ee:be",
            "net8": "ce:d4:18:db:65:b4",
            "net9": "72:54:bf:39:50:d1"
        },
        "tof_1_2_8": {
            "net0": "e2:07:f7:57:c3:3b",
            "net1": "de:cb:19:0f:e4:d6",
            "net10": "5e:cd:ea:d5:33:57",
            "net11": "5a:f0:15:ee:d4:40",
            "net12": "8a:82:86:a4:ad:8c",
            "net13": "6a:1f:fb:20:81:72",
            "net14": "ba:51:90:58:4b:f0",
            "net15": "ca:6a:0f:ce:71:2e",
            "net16": "56:68:29:2a:71:b6",
            "net17": "fe:68:05:26:d9:77",
            "net18": "86:1d:97:d9:40:31",
            "net19": "de:f6:75:72:6f:b7",
            "net2": "f2:a5:30:63:62:2a",
            "net20": "42:50:e1:b0:e1:80",
            "net21": "ae:97:cf:e8:66:4e",
            "net22": "56:96:67:0d:fe:37",
            "net23": "be:2e:b7:ce:ef:7a",
            "net24": "76:fe:27:5e:f5:45",
            "net25": "7a:cf:0e:69:02:c4",
            "net26": "e6:25:78:1b:b0:17",
            "net27": "86:1b:4e:f4:b2:11",
            "net3": "42:71:21:3f:35:01",
            "net4": "5a:40:6d:e2:76:a5",
            "net5": "7a:ee:3b:85:1f:5b",
            "net6": "c6:06:ca:4c:17:32",
            "net7": "fa:4f:93:82:a5:ed",
            "net8": "16:2d:2f:bc:40:b8",
            "net9": "62:d1:e4:69:1b:e6"
        },
        "tof_1_2_9": {
            "net0": "36:97:80:56:e3:fc",
            "net1": "ba:8b:51:de:1d:f7",
            "net10": "ea:95:96:f2:3a:bd",
            "net11": "0a:62:ad:a2:35:f5",
            "net12": "3a:64:aa:86:37:30",
            "net13": "3a:86:86:11:8e:b1",
            "net14": "82:e7:95:d2:d8:a6",
            "net15": "ea:2b:30:de:66:37",
            "net16": "f2:12:95:34:6d:02",
            "net17": "76:2e:23:43:b0:5b",
            "net18": "52:e0:da:68:24:8a",
            "net19": "ce:8f:02:17:3c:db",
            "net2": "1a:ae:ef:f4:d2:82",
            "net20": "c2:06:52:33:41:ce",
            "net21": "4a:c1:aa:36:c7:e2",
            "net22": "62:bc:79:cd:23:72",
            "net23": "6a:20:28:9c:97:fa",
            "net24": "6e:3e:58:31:c2:e5",
            "net25": "ae:5c:e5:83:70:c1",
            "net26": "ca:e5:61:9c:8b:b0",
            "net27": "82:7d:a6:c6:3d:8d",
            "net3": "de:70:07:a8:7f:d5",
            "net4": "62:b1:7e:7a:90:db",
            "net5": "aa:65:00:67:b1:4f",
            "net6": "e2:13:9e:f2:6c:93",
            "net7": "12:db:1c:82:84:45",
            "net8": "82:0b:05:fd:ce:9c",
            "net9": "ea:29:a0:ff:b8:d9"
        }
    },
    "failed_machine": "tof_1_2_1",
    "failure_time": 1616337469.3392057,
    "recover_time": 1616337593.0305321
}