{
    "k_leaf": 4,
    "k_top": 4,
    "redundancy_factor": 2,
    "is_k8s": true,
    "machine_mac_addresses": {
        "leaf_1_0_1": {
            "net0": "e2:82:89:30:05:32",
            "net1": "82:63:2e:d8:b2:a4",
            "net2": "de:10:76:7d:c4:4e",
            "net3": "8e:47:9f:d5:40:12",
            "net4": "c6:b8:db:87:bb:fa"
        },
        "leaf_1_0_2": {
            "net0": "9a:ba:70:63:ad:a9",
            "net1": "7a:06:8f:1e:e8:c9",
            "net2": "36:c5:fe:da:0c:b6",
            "net3": "62:d8:27:6d:7c:7f",
            "net4": "76:ac:b4:40:10:ce"
        },
        "leaf_1_0_3": {
            "net0": "f2:ac:56:44:6c:64",
            "net1": "4a:4a:76:60:74:08",
            "net2": "32:7b:cc:43:16:b6",
            "net3": "92:ab:f6:12:9d:d4",
            "net4": "96:e7:09:ff:47:c1"
        },
        "leaf_1_0_4": {
            "net0": "96:73:f5:2b:a7:59",
            "net1": "c2:3c:f4:5e:df:dc",
            "net2": "66:34:1e:cc:30:9f",
            "net3": "6a:3d:fa:77:4e:f4",
            "net4": "e6:95:f6:9b:54:73"
        },
        "leaf_2_0_1": {
            "net0": "26:07:04:a1:83:fa",
            "net1": "82:5c:7e:82:0b:1e",
            "net2": "fe:c7:2d:7d:fa:a1",
            "net3": "7e:d9:01:3d:26:c5",
            "net4": "ee:9f:39:2f:8c:15"
        },
        "leaf_2_0_2": {
            "net0": "06:ab:6f:30:2d:4a",
            "net1": "92:8e:6e:9e:41:8c",
            "net2": "fe:9a:ef:73:1d:e6",
            "net3": "ee:de:03:22:a6:97",
            "net4": "ca:c4:5f:2d:3d:94"
        },
        "leaf_2_0_3": {
            "net0": "8a:74:52:a9:d2:97",
            "net1": "f6:07:31:98:b0:52",
            "net2": "ee:27:29:36:55:44",
            "net3": "76:db:c7:8d:32:14",
            "net4": "ee:e5:e9:63:8a:ec"
        },
        "leaf_2_0_4": {
            "net0": "d2:4f:b7:08:a2:49",
            "net1": "c2:96:99:13:30:b6",
            "net2": "ba:aa:d3:ee:43:2f",
            "net3": "72:69:96:83:d5:a8",
            "net4": "ca:d6:26:b4:54:c6"
        },
        "leaf_3_0_1": {
            "net0": "c2:ae:11:39:64:ce",
            "net1": "da:c7:1a:82:0c:89",
            "net2": "52:17:62:4c:97:67",
            "net3": "8a:2a:2b:d4:b5:b7",
            "net4": "56:77:95:d1:8d:37"
        },
        "leaf_3_0_2": {
            "net0": "ba:fa:bc:19:95:3c",
            "net1": "42:f2:f4:bb:c8:08",
            "net2": "06:5c:14:fe:0a:52",
            "net3": "d6:4b:2a:14:98:6a",
            "net4": "32:84:ac:74:6e:a2"
        },
        "leaf_3_0_3": {
            "net0": "de:92:a2:23:b5:62",
            "net1": "42:bd:90:d7:d7:3c",
            "net2": "ce:19:e5:ad:55:84",
            "net3": "7e:06:ec:8c:a6:73",
            "net4": "76:c4:38:23:47:91"
        },
        "leaf_3_0_4": {
            "net0": "aa:a2:24:5f:bd:c1",
            "net1": "ee:f2:ee:58:c0:0a",
            "net2": "c2:33:d3:ca:8d:d7",
            "net3": "5e:24:ae:bb:51:09",
            "net4": "8a:0c:82:63:1c:1a"
        },
        "leaf_4_0_1": {
            "net0": "ce:52:81:f7:ec:d1",
            "net1": "06:c6:ed:97:c4:e2",
            "net2": "7a:f2:cd:22:06:95",
            "net3": "42:f8:96:ef:e5:ff",
            "net4": "2a:ab:ae:bc:77:45"
        },
        "leaf_4_0_2": {
            "net0": "4e:fa:24:23:2c:20",
            "net1": "a2:8b:0b:4b:83:9d",
            "net2": "a2:bc:d0:4d:c4:0a",
            "net3": "4a:2d:07:ad:76:79",
            "net4": "fa:cb:f2:f3:b1:7f"
        },
        "leaf_4_0_3": {
            "net0": "ea:37:58:13:36:25",
            "net1": "c2:7e:40:5b:a4:b1",
            "net2": "9e:22:71:1b:ae:c8",
            "net3": "da:62:5b:c7:6a:af",
            "net4": "06:22:30:75:db:e2"
        },
        "leaf_4_0_4": {
            "net0": "3e:e5:7a:d4:d9:b9",
            "net1": "76:c6:36:6c:09:e7",
            "net2": "72:b3:ac:85:5e:db",
            "net3": "a2:06:e9:dd:1f:6b",
            "net4": "ee:58:19:2d:0e:7f"
        },
        "spine_1_1_1": {
            "net0": "16:cd:da:d3:cd:cf",
            "net1": "92:a5:3e:65:67:28",
            "net2": "a2:6f:6a:71:30:20",
            "net3": "4a:4e:1e:7e:97:d9",
            "net4": "a6:45:30:7b:ee:0d",
            "net5": "32:6a:97:0b:82:6b",
            "net6": "f2:b8:af:00:7d:48",
            "net7": "56:b8:d2:0f:55:5f"
        },
        "spine_1_1_2": {
            "net0": "fe:e7:b2:8b:ec:0f",
            "net1": "ae:e7:71:41:53:c4",
            "net2": "7e:00:8c:20:cb:89",
            "net3": "56:d9:b1:a2:b8:cb",
            "net4": "66:5f:5d:ad:4f:e9",
            "net5": "d2:b2:a8:f5:63:9f",
            "net6": "c2:e1:ce:51:37:35",
            "net7": "66:df:9c:65:93:ec"
        },
        "spine_1_1_3": {
            "net0": "26:e0:88:63:21:5f",
            "net1": "82:0d:79:7a:7c:13",
            "net2": "c6:7d:86:6a:c9:f8",
            "net3": "42:93:e0:6a:20:20",
            "net4": "9a:59:32:1a:45:be",
            "net5": "12:5b:89:f6:f2:d1",
            "net6": "d2:f8:67:8c:39:ff",
            "net7": "c6:d8:2c:39:a4:ec"
        },
        "spine_1_1_4": {
            "net0": "f6:68:19:7e:69:80",
            "net1": "b6:f8:f0:8c:7b:9e",
            "net2": "62:50:08:bf:9a:27",
            "net3": "b2:ee:da:3c:13:19",
            "net4": "ee:69:9d:5e:4b:40",
            "net5": "4e:c5:c4:2c:68:b5",
            "net6": "0a:e8:fd:db:c1:b3",
            "net7": "ca:3d:59:45:2d:49"
        },
        "spine_2_1_1": {
            "net0": "8e:5b:61:64:47:0e",
            "net1": "3a:96:3e:60:38:93",
            "net2": "c6:d5:ea:d3:1a:f6",
            "net3": "5e:09:f9:8b:e3:4a",
            "net4": "ea:af:7d:fa:d4:4d",
            "net5": "c2:62:04:f9:1e:d8",
            "net6": "ba:85:e9:6d:40:83",
            "net7": "9a:c6:79:73:89:ac"
        },
        "spine_2_1_2": {
            "net0": "12:08:18:28:d2:e3",
            "net1": "da:86:46:8d:fc:b5",
            "net2": "ea:c0:20:d7:cf:72",
            "net3": "52:e1:9b:3a:d2:b5",
            "net4": "8e:5b:92:a0:06:86",
            "net5": "16:26:05:b4:05:93",
            "net6": "42:c2:f3:ea:93:0d",
            "net7": "ce:e4:b9:8b:11:fb"
        },
        "spine_2_1_3": {
            "net0": "ee:05:61:1f:04:74",
            "net1": "ca:63:ef:4a:6c:a6",
            "net2": "92:a2:34:53:f0:13",
            "net3": "8a:21:2c:12:5a:f3",
            "net4": "0e:c0:a8:12:6e:44",
            "net5": "82:ec:4b:6f:f2:0f",
            "net6": "ea:8e:cd:40:e7:b8",
            "net7": "52:ca:f0:42:0c:da"
        },
        "spine_2_1_4": {
            "net0": "5e:61:d1:d8:81:90",
            "net1": "e6:86:bb:54:18:a5",
            "net2": "b2:1f:21:52:fc:15",
            "net3": "46:41:02:30:73:13",
            "net4": "de:97:ad:33:5a:14",
            "net5": "8a:da:d2:0a:b6:fa",
            "net6": "3a:75:cc:2c:a2:41",
            "net7": "36:14:18:3f:f1:a1"
        },
        "spine_3_1_1": {
            "net0": "8a:be:41:8a:79:16",
            "net1": "be:06:e8:56:88:54",
            "net2": "6e:ce:8f:ca:92:3e",
            "net3": "ee:8f:a7:90:a6:7f",
            "net4": "b6:67:22:df:21:28",
            "net5": "86:bd:04:8c:0c:19",
            "net6": "76:78:f0:00:cf:b3",
            "net7": "de:ca:b0:6f:b6:70"
        },
        "spine_3_1_2": {
            "net0": "ae:34:de:77:d7:6f",
            "net1": "fa:21:87:14:dd:a4",
            "net2": "da:fa:84:d1:2f:30",
            "net3": "ae:e6:76:fb:9a:21",
            "net4": "ca:3b:e2:db:1b:d6",
            "net5": "d2:4b:a8:65:bb:e4",
            "net6": "72:15:08:77:9c:78",
            "net7": "36:c2:39:a9:d0:5d"
        },
        "spine_3_1_3": {
            "net0": "3e:7c:60:cd:7c:83",
            "net1": "d6:a8:03:24:78:ed",
            "net2": "da:84:cc:a7:1e:8c",
            "net3": "ea:b3:45:d3:82:b4",
            "net4": "06:bc:3b:21:fd:26",
            "net5": "ba:e5:1a:7d:bf:5e",
            "net6": "2a:aa:13:38:65:eb",
            "net7": "62:74:ea:2c:e1:d7"
        },
        "spine_3_1_4": {
            "net0": "ea:55:37:f8:32:c5",
            "net1": "72:c1:02:31:02:a8",
            "net2": "2a:f4:1e:4e:04:87",
            "net3": "c2:d6:29:77:a3:b9",
            "net4": "9a:ef:be:8a:12:f4",
            "net5": "7e:3a:1a:3b:ed:12",
            "net6": "1a:bd:ed:94:19:ae",
            "net7": "5a:cd:63:fb:98:ed"
        },
        "spine_4_1_1": {
            "net0": "7e:68:ed:b9:a6:73",
            "net1": "46:cf:bf:23:0b:fb",
            "net2": "ae:c0:29:dc:d8:91",
            "net3": "62:10:af:0e:99:ba",
            "net4": "6e:d5:ef:cb:b5:d2",
            "net5": "32:75:ed:5f:a0:42",
            "net6": "5e:7d:e6:25:32:c5",
            "net7": "a2:da:32:48:48:d3"
        },
        "spine_4_1_2": {
            "net0": "2e:d7:b0:5f:a2:c0",
            "net1": "82:95:32:86:d0:1a",
            "net2": "26:ad:ea:58:d8:55",
            "net3": "2e:46:93:b6:55:06",
            "net4": "36:95:42:c5:20:0f",
            "net5": "d2:f9:0f:fc:59:77",
            "net6": "26:bd:2b:d3:a2:bf",
            "net7": "e2:67:5b:95:6b:0c"
        },
        "spine_4_1_3": {
            "net0": "92:29:fe:e0:02:fc",
            "net1": "f2:fc:c1:16:d4:9d",
            "net2": "3a:2b:37:11:95:e2",
            "net3": "9e:a4:6e:f5:93:ee",
            "net4": "82:a1:ff:68:fa:bf",
            "net5": "66:6f:d5:65:3b:92",
            "net6": "42:e8:19:c1:05:e4",
            "net7": "2e:27:5c:4c:93:dc"
        },
        "spine_4_1_4": {
            "net0": "1e:2b:cc:dd:c9:1d",
            "net1": "b2:fc:99:0f:3a:ff",
            "net2": "d2:d8:93:09:d2:0a",
            "net3": "12:ed:aa:90:0e:0b",
            "net4": "d2:e6:3f:9d:1b:12",
            "net5": "5e:5a:bc:6b:c4:31",
            "net6": "b2:af:e1:c2:ff:f0",
            "net7": "86:d2:e5:b5:30:b5"
        },
        "tof_1_2_1": {
            "net0": "8a:25:c5:63:5f:e2",
            "net1": "32:d8:77:a8:e4:5f",
            "net2": "42:fa:4b:bf:5c:25",
            "net3": "2a:c7:a9:25:eb:8d",
            "net4": "16:32:4e:e2:6b:8e",
            "net5": "be:9a:b6:26:cb:03",
            "net6": "ee:23:07:2b:1d:8f",
            "net7": "02:5f:ef:e2:0b:93"
        },
        "tof_1_2_2": {
            "net0": "da:a7:4b:66:ba:ec",
            "net1": "ca:db:3d:0a:ad:f6",
            "net2": "da:6e:e1:fa:7c:5f",
            "net3": "66:3a:1f:28:fb:8f",
            "net4": "76:e6:5e:03:3a:15",
            "net5": "5a:f9:79:1b:49:04",
            "net6": "76:99:06:e1:94:57",
            "net7": "8e:e6:89:70:b8:00"
        },
        "tof_1_2_3": {
            "net0": "2a:b7:97:22:6c:d4",
            "net1": "12:65:e9:d3:69:9b",
            "net2": "8e:60:c5:ac:42:6e",
            "net3": "b2:8d:4a:d1:62:38",
            "net4": "82:c1:2d:76:e8:7b",
            "net5": "2a:a9:75:47:7e:d8",
            "net6": "d2:3f:74:2d:84:b5",
            "net7": "9a:9e:aa:56:9f:c2"
        },
        "tof_1_2_4": {
            "net0": "1e:71:9e:f7:fc:c1",
            "net1": "ae:77:9e:6d:5e:3d",
            "net2": "ba:5e:43:d2:c5:42",
            "net3": "72:19:f3:2b:a0:c7",
            "net4": "e6:bb:04:4a:72:e3",
            "net5": "ea:2a:f9:ad:b3:ce",
            "net6": "52:1f:b0:c8:8c:46",
            "net7": "6e:0d:ce:be:85:c7"
        },
        "tof_2_2_1": {
            "net0": "86:72:da:81:3a:c3",
            "net1": "0a:6c:14:ef:db:24",
            "net2": "c6:86:86:b9:2f:ed",
            "net3": "6a:2e:5c:81:77:ed",
            "net4": "8a:97:76:f4:c4:f2",
            "net5": "8e:84:a0:76:66:02",
            "net6": "96:b2:3a:f0:79:7e",
            "net7": "36:a7:a9:48:9b:1c"
        },
        "tof_2_2_2": {
            "net0": "66:68:3d:48:d8:1e",
            "net1": "1a:54:86:da:fd:92",
            "net2": "ea:9a:5a:33:cb:2e",
            "net3": "36:49:85:b1:29:0d",
            "net4": "02:79:3e:b7:81:99",
            "net5": "1a:32:25:d8:4c:32",
            "net6": "aa:2a:64:20:15:2d",
            "net7": "de:24:8a:fb:0c:d0"
        },
        "tof_2_2_3": {
            "net0": "4e:28:8b:7b:4e:53",
            "net1": "32:cf:1d:4c:88:c0",
            "net2": "ea:60:b5:62:60:5f",
            "net3": "fe:f1:42:1e:2c:a2",
            "net4": "1e:4f:ce:cb:28:00",
            "net5": "1a:25:2a:6f:60:31",
            "net6": "a6:fc:b4:8f:e7:8c",
            "net7": "12:2a:b4:ee:a4:dd"
        },
        "tof_2_2_4": {
            "net0": "42:ca:ff:ff:47:e4",
            "net1": "6e:d0:cc:c5:23:99",
            "net2": "b2:18:ad:61:77:fd",
            "net3": "2a:9a:55:39:19:f4",
            "net4": "8a:0e:6b:8f:d5:4c",
            "net5": "16:7c:bb:29:2d:f4",
            "net6": "b6:bc:b3:a8:ae:49",
            "net7": "d2:53:28:a6:29:41"
        }
    },
    "failed_machine": "leaf_1_0_1",
    "failure_time": {
        "leaf_1_0_1": 1621333632.1698866,
        "leaf_1_0_2": 1621333632.1897662,
        "leaf_1_0_3": 1621333632.203781,
        "leaf_1_0_4": 1621333632.1691701,
        "leaf_2_0_1": 1621333632.1868882,
        "leaf_2_0_2": 1621333632.1964257,
        "leaf_2_0_3": 1621333632.169175,
        "leaf_2_0_4": 1621333632.178262,
        "leaf_3_0_1": 1621333632.194157,
        "leaf_3_0_2": 1621333632.172648,
        "leaf_3_0_3": 1621333632.197683,
        "leaf_3_0_4": 1621333632.2135541,
        "leaf_4_0_1": 1621333632.2098696,
        "leaf_4_0_2": 1621333632.231625,
        "leaf_4_0_3": 1621333632.2400095,
        "leaf_4_0_4": 1621333632.2167478,
        "spine_1_1_1": 1621333632.2355232,
        "spine_1_1_2": 1621333632.2555642,
        "spine_1_1_3": 1621333632.2248447,
        "spine_1_1_4": 1621333632.237947,
        "spine_2_1_1": 1621333632.2509253,
        "spine_2_1_2": 1621333632.2368855,
        "spine_2_1_3": 1621333632.2501411,
        "spine_2_1_4": 1621333632.2636454,
        "spine_3_1_1": 1621333632.2536695,
        "spine_3_1_2": 1621333632.2674687,
        "spine_3_1_3": 1621333632.278751,
        "spine_3_1_4": 1621333632.267692,
        "spine_4_1_1": 1621333632.2959158,
        "spine_4_1_2": 1621333632.3102586,
        "spine_4_1_3": 1621333632.2712448,
        "spine_4_1_4": 1621333632.2991621,
        "tof_1_2_1": 1621333632.322991,
        "tof_1_2_2": 1621333632.273996,
        "tof_1_2_3": 1621333632.298622,
        "tof_1_2_4": 1621333632.31687,
        "tof_2_2_1": 1621333632.3024786,
        "tof_2_2_2": 1621333632.3206115,
        "tof_2_2_3": 1621333632.3292758,
        "tof_2_2_4": 1621333632.3252535
    }
}