{
    "k_leaf": 10,
    "k_top": 10,
    "redundancy_factor": 10,
    "is_k8s": true,
    "machine_mac_addresses": {
        "leaf_1_0_1": {
            "net0": "9a:93:d1:93:1a:0e",
            "net1": "1a:8e:98:0d:5b:62",
            "net10": "82:6b:82:8a:ec:d9",
            "net2": "ea:e5:63:f6:dc:ea",
            "net3": "52:90:63:99:35:e2",
            "net4": "fe:ee:54:f7:47:ae",
            "net5": "66:e9:12:9b:e9:23",
            "net6": "a6:80:79:6c:cc:4c",
            "net7": "ee:19:19:9e:4b:2a",
            "net8": "de:d8:94:c9:9e:7b",
            "net9": "42:35:f8:c7:b6:4f"
        },
        "leaf_1_0_10": {
            "net0": "7e:03:0b:99:7c:3c",
            "net1": "a2:df:60:58:2b:2e",
            "net10": "82:58:82:8f:9a:70",
            "net2": "52:9e:83:17:90:78",
            "net3": "be:d8:2e:85:05:4f",
            "net4": "c2:93:1a:47:85:90",
            "net5": "82:21:76:b1:e3:40",
            "net6": "b2:09:7a:68:6b:2a",
            "net7": "62:91:bd:81:e7:60",
            "net8": "e6:97:9b:b0:94:58",
            "net9": "92:af:3a:ce:82:04"
        },
        "leaf_1_0_2": {
            "net0": "4a:b3:29:8e:0b:bf",
            "net1": "aa:12:de:2c:43:e0",
            "net10": "0a:a1:9a:63:8b:a5",
            "net2": "16:a7:a5:5e:12:df",
            "net3": "96:dc:a7:cb:17:48",
            "net4": "b2:ab:fd:e5:fe:0e",
            "net5": "ae:be:07:ee:5d:61",
            "net6": "1a:1d:dd:8c:d8:17",
            "net7": "66:8c:d5:fc:d9:0a",
            "net8": "02:33:50:8e:ea:c0",
            "net9": "de:c2:99:da:f7:10"
        },
        "leaf_1_0_3": {
            "net0": "12:a3:77:fe:62:78",
            "net1": "02:c6:0d:31:ff:57",
            "net10": "46:dc:a9:1a:3c:32",
            "net2": "3a:45:f2:0d:00:5e",
            "net3": "1a:62:c8:bc:20:7f",
            "net4": "da:bf:c7:7f:12:fc",
            "net5": "6a:a3:e3:96:78:d2",
            "net6": "06:fd:b5:4a:41:ca",
            "net7": "f6:a5:0b:8c:15:b1",
            "net8": "f6:29:c7:b3:f8:1f",
            "net9": "9e:8f:ba:4b:f1:5f"
        },
        "leaf_1_0_4": {
            "net0": "d2:c6:d4:22:10:20",
            "net1": "de:d8:dd:a5:a5:b0",
            "net10": "66:91:ef:c2:96:cc",
            "net2": "be:d0:73:03:42:f1",
            "net3": "12:47:86:76:da:df",
            "net4": "1a:27:7b:ab:b9:0b",
            "net5": "76:e9:d1:3e:53:19",
            "net6": "0e:06:a1:f6:5d:2f",
            "net7": "d2:49:92:fb:cc:43",
            "net8": "da:ec:a9:52:50:36",
            "net9": "92:30:89:1d:f6:56"
        },
        "leaf_1_0_5": {
            "net0": "e2:e7:82:0f:8a:94",
            "net1": "ca:2b:65:fe:78:87",
            "net10": "3a:14:21:20:b5:bb",
            "net2": "02:02:96:b7:62:09",
            "net3": "ca:b1:5b:bb:2f:f9",
            "net4": "7e:db:bd:bb:60:70",
            "net5": "6a:8e:47:8a:18:42",
            "net6": "e2:9b:9b:14:d9:23",
            "net7": "8e:91:90:b0:f6:76",
            "net8": "72:91:1d:38:b4:b2",
            "net9": "6e:2e:88:05:ab:cf"
        },
        "leaf_1_0_6": {
            "net0": "c2:62:e8:f0:bc:19",
            "net1": "c2:a3:3a:86:4f:09",
            "net10": "c6:dc:8b:e8:e3:16",
            "net2": "3a:03:0e:dc:e3:ca",
            "net3": "de:71:15:dc:eb:e2",
            "net4": "42:ca:d7:74:af:3b",
            "net5": "5a:31:d3:7e:92:2e",
            "net6": "32:5d:94:25:c6:0e",
            "net7": "da:99:63:0a:ea:5a",
            "net8": "76:d1:62:52:57:c7",
            "net9": "46:46:dc:c6:8e:fd"
        },
        "leaf_1_0_7": {
            "net0": "46:d7:a0:10:c4:e3",
            "net1": "e2:96:22:10:e5:aa",
            "net10": "86:54:4a:6f:b0:82",
            "net2": "2a:4c:69:eb:4c:77",
            "net3": "3e:35:43:10:66:f3",
            "net4": "fa:b7:46:cb:c9:6e",
            "net5": "5e:e7:dd:a2:4e:9b",
            "net6": "a6:ad:54:b4:d2:ee",
            "net7": "3e:22:b9:7b:30:1e",
            "net8": "ba:eb:14:29:f6:10",
            "net9": "9e:93:44:e2:81:b3"
        },
        "leaf_1_0_8": {
            "net0": "9a:08:1a:9d:b7:49",
            "net1": "a6:5f:81:f0:b2:f0",
            "net10": "ae:7d:8b:62:ba:4c",
            "net2": "66:e5:7a:b0:95:af",
            "net3": "52:a2:53:f4:c4:01",
            "net4": "a2:5e:88:4f:bb:9e",
            "net5": "96:85:84:f2:58:35",
            "net6": "c6:25:6d:11:29:5e",
            "net7": "16:c1:29:3c:50:65",
            "net8": "6e:9f:36:d1:14:2b",
            "net9": "6a:24:d2:cb:b9:5a"
        },
        "leaf_1_0_9": {
            "net0": "fa:fc:ea:89:fd:9f",
            "net1": "4a:33:b9:8a:40:f8",
            "net10": "a2:a6:bd:b1:0d:db",
            "net2": "46:c5:12:4e:5c:9b",
            "net3": "ea:6e:9e:cb:5f:c4",
            "net4": "b2:9e:fb:3a:d8:88",
            "net5": "da:ef:29:bc:4b:d7",
            "net6": "ba:5f:e1:d8:99:e5",
            "net7": "9e:7e:ff:5d:bd:56",
            "net8": "de:b6:65:b8:fb:d4",
            "net9": "12:02:59:da:31:9e"
        },
        "leaf_2_0_1": {
            "net0": "f6:02:5b:02:95:86",
            "net1": "a6:14:7f:03:f2:c4",
            "net10": "2e:86:d8:59:e2:3c",
            "net2": "96:77:99:a7:9f:21",
            "net3": "5a:7a:04:8b:14:7f",
            "net4": "fe:b5:61:b8:88:e0",
            "net5": "02:93:04:d8:46:68",
            "net6": "c2:ca:1a:8d:2a:65",
            "net7": "d6:43:3d:0b:f5:2b",
            "net8": "ca:68:99:ac:10:20",
            "net9": "06:bd:5d:77:d6:3c"
        },
        "leaf_2_0_10": {
            "net0": "fe:9d:b4:e7:19:dc",
            "net1": "8e:f6:05:05:7e:55",
            "net10": "1a:49:3a:55:e2:88",
            "net2": "5a:66:48:e0:10:62",
            "net3": "ee:c7:d6:94:99:26",
            "net4": "16:23:41:48:c7:8f",
            "net5": "3e:51:68:56:f0:30",
            "net6": "de:f7:29:a2:7f:f1",
            "net7": "ee:e7:06:de:f5:8d",
            "net8": "7a:fd:58:12:e0:c7",
            "net9": "e6:d5:3c:99:a0:d9"
        },
        "leaf_2_0_2": {
            "net0": "06:d2:69:b9:79:98",
            "net1": "22:41:53:5c:7a:3b",
            "net10": "aa:ae:f2:36:e5:2e",
            "net2": "8a:cd:fc:be:a6:ff",
            "net3": "ae:89:ec:6f:74:da",
            "net4": "fe:86:56:08:52:7e",
            "net5": "0a:6b:49:44:81:d0",
            "net6": "1a:7c:79:39:d0:d4",
            "net7": "9e:83:f6:cc:3c:ee",
            "net8": "6a:9b:bf:79:a1:5e",
            "net9": "8e:46:0c:e5:78:d6"
        },
        "leaf_2_0_3": {
            "net0": "7e:b1:cd:2f:e0:02",
            "net1": "4a:22:c3:f1:a4:3e",
            "net10": "5e:a5:13:21:0c:07",
            "net2": "9a:4e:49:bd:72:28",
            "net3": "3e:dc:3c:6b:f9:75",
            "net4": "1a:e1:52:36:23:f3",
            "net5": "2e:84:3e:ce:be:44",
            "net6": "72:4e:1d:91:e2:e4",
            "net7": "e2:82:80:98:5e:3e",
            "net8": "f2:b3:97:13:db:15",
            "net9": "2a:1d:9a:88:ba:23"
        },
        "leaf_2_0_4": {
            "net0": "2a:0c:45:63:fc:79",
            "net1": "f2:05:37:8c:76:0e",
            "net10": "32:65:c1:26:89:f0",
            "net2": "76:41:fa:d2:ce:64",
            "net3": "76:87:3d:53:83:ff",
            "net4": "56:5c:79:0f:78:67",
            "net5": "de:4e:ff:dd:b0:b6",
            "net6": "6a:c6:f2:1e:b4:b3",
            "net7": "a2:fb:c0:8a:1d:65",
            "net8": "0a:32:d4:d1:5a:04",
            "net9": "ce:b0:0b:b4:47:21"
        },
        "leaf_2_0_5": {
            "net0": "fe:e7:fe:b6:4f:57",
            "net1": "1a:d5:35:7a:a0:1f",
            "net10": "06:4f:de:22:ff:da",
            "net2": "8a:06:e1:04:29:b9",
            "net3": "0e:76:dc:2e:d2:53",
            "net4": "ae:60:cc:ee:85:b5",
            "net5": "06:77:21:26:0f:31",
            "net6": "46:fa:54:36:8c:0c",
            "net7": "82:5d:44:bd:fa:a0",
            "net8": "4a:9e:71:42:f0:5c",
            "net9": "3e:2d:e4:6c:7d:10"
        },
        "leaf_2_0_6": {
            "net0": "6e:9e:73:06:e0:8c",
            "net1": "5e:da:0e:79:10:a3",
            "net10": "ea:d4:a2:67:c2:42",
            "net2": "16:5c:a4:5a:38:01",
            "net3": "66:fc:59:05:95:e5",
            "net4": "26:0f:fc:55:ac:0f",
            "net5": "e6:67:8e:bf:01:02",
            "net6": "56:a3:83:e7:f5:6c",
            "net7": "56:27:e1:be:90:eb",
            "net8": "aa:80:4c:5c:c7:a5",
            "net9": "12:81:ec:37:fb:1c"
        },
        "leaf_2_0_7": {
            "net0": "da:40:a6:ae:86:b0",
            "net1": "96:ed:28:3a:8d:60",
            "net10": "a6:18:9e:c9:d8:37",
            "net2": "5e:89:42:0a:b7:71",
            "net3": "de:00:22:4b:0d:08",
            "net4": "46:db:5a:fa:ad:27",
            "net5": "16:6a:24:fa:5c:8b",
            "net6": "52:47:0d:38:9c:de",
            "net7": "72:40:81:f0:77:d6",
            "net8": "a6:eb:0c:96:db:ac",
            "net9": "e6:3b:70:02:19:08"
        },
        "leaf_2_0_8": {
            "net0": "ae:35:13:4f:49:59",
            "net1": "7e:ef:14:b8:fd:ed",
            "net10": "9e:d7:39:45:b1:34",
            "net2": "be:f3:6a:c2:31:87",
            "net3": "ca:6e:34:da:0c:d7",
            "net4": "1e:9e:e7:34:9e:57",
            "net5": "5e:a1:f5:a1:31:93",
            "net6": "9e:12:04:53:33:7d",
            "net7": "32:37:af:a3:2b:aa",
            "net8": "ae:1a:29:42:af:b3",
            "net9": "a6:05:a5:35:0e:bc"
        },
        "leaf_2_0_9": {
            "net0": "8a:c0:e8:be:2e:57",
            "net1": "72:0d:93:97:c8:f9",
            "net10": "e2:79:0b:fa:aa:a4",
            "net2": "3a:45:a5:48:a0:13",
            "net3": "3e:1c:f7:28:64:b9",
            "net4": "2a:7b:55:a4:c4:3b",
            "net5": "9a:ce:c9:b7:b2:c0",
            "net6": "4e:37:4a:63:44:9e",
            "net7": "d6:14:3d:aa:f5:95",
            "net8": "e2:84:8a:e6:5f:76",
            "net9": "4a:5f:b2:ab:61:1e"
        },
        "spine_1_1_1": {
            "net0": "ea:27:78:14:77:67",
            "net1": "fa:6f:6c:57:e9:d9",
            "net10": "e6:d8:65:fc:0c:27",
            "net11": "6a:db:2a:4e:d0:46",
            "net12": "9a:61:16:51:ce:54",
            "net13": "52:a8:a5:1b:36:4f",
            "net14": "36:76:d1:71:b5:68",
            "net15": "7e:8f:6a:42:84:5b",
            "net16": "c6:f0:db:6d:d9:5d",
            "net17": "a2:29:a3:6a:d0:dd",
            "net18": "ee:03:c6:a8:b9:25",
            "net19": "1a:70:5e:d4:0e:f6",
            "net2": "72:84:a9:e5:96:0b",
            "net3": "b6:57:c8:f5:5d:95",
            "net4": "52:f0:49:c9:76:66",
            "net5": "ba:fa:66:55:f6:b5",
            "net6": "d2:a0:04:0e:2e:e1",
            "net7": "96:55:0c:1c:8c:72",
            "net8": "06:39:34:ff:c4:c9",
            "net9": "6a:87:d6:73:10:e8"
        },
        "spine_1_1_10": {
            "net0": "42:88:a8:3a:e5:2a",
            "net1": "6e:6b:b5:f9:ed:2d",
            "net10": "72:a3:ce:66:f7:2e",
            "net11": "ae:e3:f7:7f:60:5c",
            "net12": "3a:76:bc:51:d2:c9",
            "net13": "2a:46:16:c5:9f:dd",
            "net14": "ba:8e:ec:7e:72:da",
            "net15": "66:14:62:0a:11:db",
            "net16": "3a:46:86:e4:d2:c3",
            "net17": "7e:60:76:c6:b0:01",
            "net18": "52:14:2f:50:a7:f1",
            "net19": "aa:e6:b5:e7:ec:e6",
            "net2": "66:b5:2f:1f:07:2c",
            "net3": "96:9d:5a:c9:9e:fd",
            "net4": "8a:23:c3:65:bc:80",
            "net5": "2e:e4:89:e2:00:ba",
            "net6": "32:8d:a5:9f:e0:82",
            "net7": "f2:cc:7a:d9:c8:87",
            "net8": "86:b8:88:3c:14:30",
            "net9": "8a:8d:cb:17:95:4e"
        },
        "spine_1_1_2": {
            "net0": "0e:c3:a1:18:1e:91",
            "net1": "da:04:b9:fc:5e:49",
            "net10": "9a:67:a0:f0:70:57",
            "net11": "da:55:38:50:e3:61",
            "net12": "ee:af:ca:6a:5b:64",
            "net13": "7e:22:cb:45:d8:a4",
            "net14": "aa:d4:1b:98:33:4e",
            "net15": "fe:27:6c:55:d1:10",
            "net16": "66:10:0e:24:cc:bb",
            "net17": "fa:10:bb:4d:3d:af",
            "net18": "62:85:f5:aa:e4:24",
            "net19": "d6:3d:cb:81:dc:8b",
            "net2": "12:d8:02:75:a9:d7",
            "net3": "52:a5:74:0b:73:82",
            "net4": "82:15:49:a3:ac:ee",
            "net5": "c2:14:67:8f:34:ec",
            "net6": "32:20:65:76:78:de",
            "net7": "ee:82:42:83:cd:a4",
            "net8": "ce:9e:2f:57:cd:aa",
            "net9": "d2:30:fa:c6:4d:49"
        },
        "spine_1_1_3": {
            "net0": "96:1e:4e:ba:a4:c3",
            "net1": "96:26:af:74:9e:4e",
            "net10": "4a:c9:63:89:b5:30",
            "net11": "aa:9d:b4:3c:18:ea",
            "net12": "fa:2c:df:fa:17:8d",
            "net13": "7a:42:98:f6:57:07",
            "net14": "ba:58:6b:81:f6:ee",
            "net15": "b2:2e:e3:f7:7a:ff",
            "net16": "06:a8:51:36:5e:13",
            "net17": "76:79:ae:bb:dc:47",
            "net18": "1e:c9:e5:57:f3:ae",
            "net19": "2a:d5:2a:83:a5:57",
            "net2": "da:b9:1d:83:11:3a",
            "net3": "16:be:6c:eb:d7:da",
            "net4": "72:a0:aa:c4:26:6c",
            "net5": "ca:e4:62:7a:93:92",
            "net6": "f2:b0:16:f9:0f:a7",
            "net7": "9e:22:a0:33:d7:a4",
            "net8": "3e:64:00:4a:ca:1e",
            "net9": "5e:a6:41:d5:54:04"
        },
        "spine_1_1_4": {
            "net0": "9e:3c:a6:83:c4:07",
            "net1": "da:61:eb:64:2d:ac",
            "net10": "f2:aa:8f:0e:65:73",
            "net11": "96:b0:41:7a:b4:74",
            "net12": "ce:1a:83:32:81:31",
            "net13": "7a:a8:d6:43:fa:1f",
            "net14": "a2:8d:0b:ff:dd:36",
            "net15": "56:e6:c0:ca:59:27",
            "net16": "8e:cd:51:f9:f3:2c",
            "net17": "c6:13:68:11:f7:8c",
            "net18": "aa:c0:29:45:11:46",
            "net19": "02:2c:c2:89:4a:a5",
            "net2": "0e:50:6e:d2:c7:0e",
            "net3": "c2:21:ec:27:f9:6e",
            "net4": "42:91:78:2e:11:c7",
            "net5": "aa:92:65:1e:75:b2",
            "net6": "c6:71:c2:21:b0:73",
            "net7": "0e:66:b1:6d:04:ba",
            "net8": "2a:4f:de:39:41:c0",
            "net9": "9e:61:c8:eb:9a:7a"
        },
        "spine_1_1_5": {
            "net0": "ee:22:61:d7:dd:cd",
            "net1": "4a:d8:23:15:f7:11",
            "net10": "52:85:1a:07:d0:6a",
            "net11": "62:ef:b9:9f:ab:ca",
            "net12": "f6:7e:06:b2:48:75",
            "net13": "76:22:ec:e2:34:92",
            "net14": "d6:a1:f7:d6:92:09",
            "net15": "7e:27:af:82:33:69",
            "net16": "9a:e1:a0:64:7f:4b",
            "net17": "56:a3:45:5c:9a:92",
            "net18": "8e:ca:68:68:62:a0",
            "net19": "de:f4:e3:ac:e9:2d",
            "net2": "ce:d7:a6:80:e9:e2",
            "net3": "46:74:2d:d2:8a:60",
            "net4": "6e:40:0b:f0:e4:9c",
            "net5": "ce:d6:73:9e:d2:7b",
            "net6": "d6:0a:5f:8d:65:9f",
            "net7": "ea:a4:44:e0:5f:aa",
            "net8": "d2:05:66:44:44:c9",
            "net9": "c2:b0:2b:ba:1d:89"
        },
        "spine_1_1_6": {
            "net0": "76:35:91:3d:35:da",
            "net1": "ca:fc:59:ee:8e:09",
            "net10": "02:29:a6:29:93:cb",
            "net11": "6e:df:48:01:20:66",
            "net12": "c6:89:6f:34:53:c6",
            "net13": "ae:fc:1a:50:0d:7c",
            "net14": "2e:c5:6e:66:27:b0",
            "net15": "ee:91:d2:75:65:e7",
            "net16": "46:4d:a2:b0:f7:64",
            "net17": "ee:a4:82:c6:ea:be",
            "net18": "1e:80:7a:53:79:db",
            "net19": "ce:c7:b7:7f:cf:88",
            "net2": "82:a8:6c:63:fe:14",
            "net3": "6a:0f:e3:41:e5:8b",
            "net4": "2a:f2:0f:48:38:ba",
            "net5": "22:18:94:df:ec:b3",
            "net6": "2e:e2:3b:c9:32:34",
            "net7": "8e:52:e6:3c:94:0e",
            "net8": "c2:29:d5:42:ab:c3",
            "net9": "6a:d6:3f:f9:2f:41"
        },
        "spine_1_1_7": {
            "net0": "f6:5a:38:ec:e8:41",
            "net1": "76:a8:87:f1:1c:82",
            "net10": "de:48:02:d9:6f:7f",
            "net11": "1a:a1:39:c9:d7:d4",
            "net12": "b6:9c:22:02:7c:68",
            "net13": "ea:4c:18:55:b3:ba",
            "net14": "62:38:bb:76:68:69",
            "net15": "a2:85:e5:9b:cc:d0",
            "net16": "7a:a5:17:1c:1e:74",
            "net17": "86:fa:30:b3:c5:36",
            "net18": "d2:24:61:50:d5:78",
            "net19": "4a:14:bd:22:8d:dd",
            "net2": "c2:0d:cb:f7:29:5b",
            "net3": "ba:46:96:a4:ba:29",
            "net4": "4e:3c:fd:99:fb:31",
            "net5": "72:1e:5b:e5:b6:8b",
            "net6": "be:c7:84:75:2b:be",
            "net7": "e2:d2:a9:97:38:a7",
            "net8": "7a:9b:cb:1d:36:e1",
            "net9": "aa:fc:a8:37:c6:07"
        },
        "spine_1_1_8": {
            "net0": "da:ab:cd:e2:e4:17",
            "net1": "4e:e3:24:88:b1:7a",
            "net10": "ae:59:7e:29:f1:fb",
            "net11": "6a:c1:6e:89:54:ef",
            "net12": "be:0e:15:36:d9:f0",
            "net13": "d2:de:ef:de:9c:c2",
            "net14": "12:a0:c1:82:ee:ac",
            "net15": "1a:5f:ff:ee:22:44",
            "net16": "ca:d4:a4:50:c7:c7",
            "net17": "f6:c0:d6:4c:34:e3",
            "net18": "ee:19:b0:59:67:8a",
            "net19": "1a:b5:d4:22:71:c8",
            "net2": "9a:af:41:c0:71:e7",
            "net3": "72:12:ef:21:5c:ba",
            "net4": "ae:18:72:9a:ba:ed",
            "net5": "fe:2f:d3:31:2b:96",
            "net6": "22:8c:2e:86:6f:5c",
            "net7": "3a:8b:81:84:3a:1e",
            "net8": "c6:c8:01:c1:df:0d",
            "net9": "5a:43:3d:26:8f:40"
        },
        "spine_1_1_9": {
            "net0": "1e:12:64:13:97:1e",
            "net1": "32:6a:ab:0a:71:37",
            "net10": "46:7b:6f:b3:c4:e2",
            "net11": "7e:8a:4e:02:e3:30",
            "net12": "0e:23:a8:9d:97:c5",
            "net13": "86:da:19:65:91:75",
            "net14": "fa:41:86:e1:d3:37",
            "net15": "56:b9:88:f7:de:87",
            "net16": "b6:1d:9e:7a:d1:bd",
            "net17": "f2:43:13:c4:d6:65",
            "net18": "d2:48:5a:a1:aa:b7",
            "net19": "0a:ea:1b:d6:b1:47",
            "net2": "c2:c1:e8:b9:5b:f4",
            "net3": "fe:70:ca:42:ce:21",
            "net4": "82:25:ac:6f:49:5f",
            "net5": "42:ed:1e:ec:47:4a",
            "net6": "8e:5e:97:79:78:b0",
            "net7": "f2:0d:0d:0f:14:d9",
            "net8": "a6:cb:55:f9:f6:68",
            "net9": "fe:47:79:bf:ad:76"
        },
        "spine_2_1_1": {
            "net0": "de:e6:27:d2:94:bd",
            "net1": "6e:da:d5:b0:dd:7d",
            "net10": "de:71:5f:a7:fe:16",
            "net11": "6e:59:46:49:dd:7f",
            "net12": "a6:f9:61:d9:16:63",
            "net13": "7a:25:60:83:f6:63",
            "net14": "ce:d3:4b:9a:44:00",
            "net15": "76:cb:4d:60:44:86",
            "net16": "3a:76:d9:0c:7a:b3",
            "net17": "1a:d3:c0:de:57:e6",
            "net18": "46:b3:ad:00:3c:4c",
            "net19": "3a:9f:d0:a1:35:6e",
            "net2": "7a:be:55:6c:0c:37",
            "net3": "fa:d1:ce:06:6e:94",
            "net4": "f6:ee:4f:5c:95:c1",
            "net5": "e6:74:2d:6c:a9:21",
            "net6": "9a:12:ac:d5:be:69",
            "net7": "42:87:a2:94:e5:34",
            "net8": "9e:af:a2:85:5e:fa",
            "net9": "42:b9:b2:a6:4d:fb"
        },
        "spine_2_1_10": {
            "net0": "1a:86:99:ff:18:57",
            "net1": "62:c8:af:d3:90:00",
            "net10": "be:25:92:9d:67:36",
            "net11": "72:5d:fd:26:dd:6b",
            "net12": "46:a3:8a:c2:82:dd",
            "net13": "da:19:41:83:a9:94",
            "net14": "e2:24:fd:0a:76:f8",
            "net15": "3e:91:a2:a1:d6:1c",
            "net16": "f6:be:e3:9e:22:9c",
            "net17": "02:ec:86:f0:03:2f",
            "net18": "b2:dd:de:7e:6b:0d",
            "net19": "8a:84:96:c0:b3:88",
            "net2": "96:77:67:99:6a:d5",
            "net3": "92:e1:bf:41:80:bd",
            "net4": "9e:43:f5:c6:c7:ac",
            "net5": "06:42:2b:0e:04:31",
            "net6": "e6:f4:a5:ea:36:b0",
            "net7": "d6:da:a5:51:0b:f4",
            "net8": "0e:bd:8a:50:ee:9b",
            "net9": "8e:52:10:af:dd:d7"
        },
        "spine_2_1_2": {
            "net0": "72:4f:e1:06:49:a5",
            "net1": "5a:1d:e3:d5:3d:5d",
            "net10": "3a:c8:32:e1:dd:56",
            "net11": "0e:d3:71:70:e5:1c",
            "net12": "6a:65:72:33:56:82",
            "net13": "0e:02:13:a3:e0:5b",
            "net14": "46:04:14:58:17:83",
            "net15": "9e:69:3b:5b:89:9e",
            "net16": "1a:2a:15:3f:5b:89",
            "net17": "22:6f:0a:63:ae:21",
            "net18": "3a:c9:8a:58:45:73",
            "net19": "2a:d6:89:3f:17:99",
            "net2": "3e:4d:96:9f:00:09",
            "net3": "72:e4:01:80:5f:f6",
            "net4": "46:4d:73:a3:ab:ce",
            "net5": "52:61:19:60:77:b6",
            "net6": "e2:e1:d8:5d:45:35",
            "net7": "82:c7:dc:69:77:60",
            "net8": "e6:3a:22:55:55:6d",
            "net9": "52:84:a5:2d:7a:11"
        },
        "spine_2_1_3": {
            "net0": "ca:54:2d:41:0e:c1",
            "net1": "fa:e1:7c:98:60:78",
            "net10": "16:5e:30:58:8e:6d",
            "net11": "26:52:9e:fe:ec:42",
            "net12": "2a:ea:17:0e:8d:5c",
            "net13": "3a:4c:61:c2:5c:28",
            "net14": "66:fe:f6:8a:e4:ee",
            "net15": "be:b8:9a:b4:49:b7",
            "net16": "36:1a:9f:e4:df:03",
            "net17": "c2:f9:f1:31:09:30",
            "net18": "86:6e:19:e1:c2:0c",
            "net19": "82:5d:85:39:1f:13",
            "net2": "c2:7f:11:ec:29:c3",
            "net3": "b2:12:e5:c1:eb:18",
            "net4": "e2:a1:98:18:3b:72",
            "net5": "aa:07:44:f3:14:92",
            "net6": "46:4f:76:36:41:20",
            "net7": "3a:1a:7b:e3:6e:fa",
            "net8": "1e:67:39:74:c3:25",
            "net9": "ca:14:f2:e6:58:c0"
        },
        "spine_2_1_4": {
            "net0": "82:ff:e7:4e:c1:ba",
            "net1": "2e:39:95:0b:3b:37",
            "net10": "9a:d6:87:4f:b9:0d",
            "net11": "42:73:3e:7a:a1:e9",
            "net12": "8a:1f:a4:cc:1e:ac",
            "net13": "86:a3:03:66:4c:6b",
            "net14": "4a:38:d3:b5:6f:7d",
            "net15": "36:f3:e8:bf:de:ce",
            "net16": "16:e7:6a:d3:66:96",
            "net17": "4a:bd:29:fe:e6:95",
            "net18": "ca:e0:e9:66:e4:6d",
            "net19": "16:3a:e1:99:16:c5",
            "net2": "46:34:69:9c:65:18",
            "net3": "9a:c2:11:59:6d:87",
            "net4": "ee:61:f0:ec:63:42",
            "net5": "de:c2:d1:2f:43:00",
            "net6": "be:43:c8:1e:72:b3",
            "net7": "e6:8c:c8:8b:c6:02",
            "net8": "26:02:fb:d8:c5:7c",
            "net9": "1a:04:bc:0b:dc:11"
        },
        "spine_2_1_5": {
            "net0": "d2:c3:d1:35:4a:b8",
            "net1": "36:fd:03:ce:56:a9",
            "net10": "66:48:33:79:6d:5e",
            "net11": "0a:13:4a:0e:d7:d0",
            "net12": "96:73:5c:26:17:24",
            "net13": "22:c7:4d:cb:1d:bf",
            "net14": "22:53:e0:5b:c6:d2",
            "net15": "7a:a0:d1:a9:3c:e9",
            "net16": "ba:89:1a:25:2a:3d",
            "net17": "1a:61:9e:0a:d5:02",
            "net18": "fa:1c:7c:82:45:9e",
            "net19": "ca:47:d5:96:99:db",
            "net2": "4a:df:d8:d6:8c:52",
            "net3": "ba:6d:86:b8:e4:d8",
            "net4": "46:e7:f0:c9:1b:14",
            "net5": "26:b3:5e:2a:99:6e",
            "net6": "ea:61:91:9d:53:c0",
            "net7": "2a:6d:11:16:c3:76",
            "net8": "8a:bd:62:59:3b:c1",
            "net9": "e6:7a:9a:7b:08:eb"
        },
        "spine_2_1_6": {
            "net0": "32:37:dc:3e:3c:6d",
            "net1": "c2:ce:73:f1:05:4c",
            "net10": "7a:ac:1b:c0:9b:58",
            "net11": "5e:81:86:8d:9c:48",
            "net12": "e2:d4:45:9c:a9:14",
            "net13": "22:1d:e6:37:f0:33",
            "net14": "6a:08:2e:32:b4:6b",
            "net15": "ba:4e:9f:da:2e:ad",
            "net16": "ee:3e:46:95:91:2f",
            "net17": "e2:0d:cb:26:3e:e1",
            "net18": "fa:38:52:ed:c4:9c",
            "net19": "82:30:f0:d8:ac:4b",
            "net2": "6a:47:06:db:a7:19",
            "net3": "3a:6c:99:a7:4b:de",
            "net4": "b2:f0:1c:fb:6f:1e",
            "net5": "0a:0f:7f:fe:cb:ee",
            "net6": "22:ab:5f:9c:76:38",
            "net7": "46:6f:b4:30:5f:a0",
            "net8": "f2:05:dd:d8:65:e4",
            "net9": "aa:13:e8:bb:4a:32"
        },
        "spine_2_1_7": {
            "net0": "aa:12:48:97:1d:51",
            "net1": "56:4d:5c:30:4f:cb",
            "net10": "b2:00:fa:38:a1:ea",
            "net11": "be:9d:c3:15:8e:d8",
            "net12": "6a:26:84:ff:ed:78",
            "net13": "9a:fe:4b:49:ff:d6",
            "net14": "46:4d:d8:6c:a3:69",
            "net15": "96:25:53:a2:e4:e0",
            "net16": "fa:c9:83:41:21:ca",
            "net17": "ca:14:47:c2:4c:d4",
            "net18": "2a:13:28:c4:1f:34",
            "net19": "ba:94:cc:2d:b2:14",
            "net2": "5a:93:c2:ba:32:2c",
            "net3": "e6:8b:84:2f:2a:4f",
            "net4": "ee:3d:35:2f:d9:5f",
            "net5": "82:f5:a3:86:f1:3d",
            "net6": "46:ce:75:89:64:38",
            "net7": "2a:9d:bc:97:51:27",
            "net8": "b6:f0:20:9a:36:d1",
            "net9": "72:8c:94:9a:57:8f"
        },
        "spine_2_1_8": {
            "net0": "ba:6e:05:d7:15:d8",
            "net1": "76:03:fb:ce:de:6c",
            "net10": "7a:82:7f:fb:42:ab",
            "net11": "56:02:7a:0a:4e:3f",
            "net12": "92:20:f9:72:11:1a",
            "net13": "52:a1:92:e5:cb:76",
            "net14": "4e:e4:14:a6:c8:e3",
            "net15": "76:eb:76:85:d8:7f",
            "net16": "66:f2:3d:8f:cb:4f",
            "net17": "26:2a:2c:b3:27:cf",
            "net18": "16:54:96:e7:b1:45",
            "net19": "26:94:62:b2:d3:e1",
            "net2": "76:7b:0a:73:4e:1e",
            "net3": "8e:f9:a4:c3:c0:e5",
            "net4": "f2:7c:6f:f9:76:1e",
            "net5": "be:87:05:8b:8c:c6",
            "net6": "9a:e4:d8:96:47:0d",
            "net7": "76:b0:2e:89:1e:8e",
            "net8": "a2:28:7b:7f:44:8f",
            "net9": "fa:b0:ab:94:f6:d0"
        },
        "spine_2_1_9": {
            "net0": "9e:23:97:2b:2f:7e",
            "net1": "12:89:7e:a3:8c:a7",
            "net10": "d6:94:91:d5:57:7f",
            "net11": "32:73:12:60:2a:1f",
            "net12": "ee:99:ec:e1:54:64",
            "net13": "be:30:64:97:22:34",
            "net14": "ce:37:9d:7a:64:d1",
            "net15": "4e:8a:8a:a5:ab:0f",
            "net16": "76:f3:9b:8e:c4:92",
            "net17": "2a:68:a7:0b:9a:2c",
            "net18": "02:de:7c:08:a6:2f",
            "net19": "aa:12:67:fd:cd:98",
            "net2": "ce:2b:fd:28:8f:fe",
            "net3": "26:e8:5e:cd:b9:f0",
            "net4": "7e:42:f0:46:23:a6",
            "net5": "72:70:fe:5b:7b:9a",
            "net6": "d2:ad:5b:3e:4a:c5",
            "net7": "3e:00:c4:c3:b7:d6",
            "net8": "72:83:cb:e8:16:3f",
            "net9": "f2:ee:b4:0d:3a:b9"
        },
        "tof_1_2_1": {
            "net0": "0a:c5:b2:b4:30:21",
            "net1": "7a:38:89:d9:e6:dd",
            "net10": "c6:14:51:27:3c:87",
            "net11": "26:d9:eb:ab:e5:82",
            "net12": "2e:cb:0f:f3:98:63",
            "net13": "8e:61:9d:07:44:5c",
            "net14": "d6:f1:1c:97:35:ee",
            "net15": "3e:79:43:3b:31:13",
            "net16": "9a:43:d9:b0:2b:21",
            "net17": "62:c2:b4:70:86:13",
            "net18": "8e:47:d2:da:ae:28",
            "net19": "3e:0b:b2:41:c1:9b",
            "net2": "66:09:cd:88:30:78",
            "net3": "d2:cd:dc:cb:2a:92",
            "net4": "22:cb:98:cc:86:a5",
            "net5": "1e:cf:f7:12:0e:71",
            "net6": "72:20:2e:3e:6f:03",
            "net7": "2e:5a:c8:ba:ac:69",
            "net8": "fe:84:0c:6c:10:08",
            "net9": "fa:a5:86:71:3c:e6"
        },
        "tof_1_2_10": {
            "net0": "2e:9d:2d:39:48:26",
            "net1": "e2:4e:91:8b:5f:8a",
            "net10": "16:f0:b3:00:13:a2",
            "net11": "e2:1a:09:83:95:54",
            "net12": "1e:55:9a:ba:be:be",
            "net13": "32:17:34:fe:f2:ad",
            "net14": "0a:84:b0:c3:39:c4",
            "net15": "8e:f8:80:97:04:62",
            "net16": "5a:ca:2f:7b:ac:b4",
            "net17": "3e:68:5d:25:b7:b8",
            "net18": "4e:46:7e:de:a6:5b",
            "net19": "36:ee:87:ef:d2:01",
            "net2": "e2:fb:c0:a2:50:1b",
            "net3": "fe:87:4e:a5:7f:73",
            "net4": "c2:ae:ad:2d:77:44",
            "net5": "96:c4:25:2a:4a:d0",
            "net6": "1a:3e:a6:b2:33:f4",
            "net7": "a2:c1:3d:bd:ee:44",
            "net8": "c2:53:5e:1b:61:e3",
            "net9": "b6:cb:99:a9:72:23"
        },
        "tof_1_2_2": {
            "net0": "5e:da:36:04:54:1d",
            "net1": "c2:88:9c:ce:58:27",
            "net10": "e2:0f:a0:c8:87:00",
            "net11": "32:47:ac:5a:68:f5",
            "net12": "3e:0b:9b:50:57:8b",
            "net13": "8a:fd:f7:78:0a:42",
            "net14": "3a:6a:67:16:74:c8",
            "net15": "fe:8b:e6:db:59:72",
            "net16": "da:94:2d:2b:21:4e",
            "net17": "da:cc:6c:30:22:80",
            "net18": "16:6b:4e:f8:43:ad",
            "net19": "ce:a9:9c:13:89:34",
            "net2": "0e:5a:31:78:4a:ab",
            "net3": "62:5c:5f:e4:ed:14",
            "net4": "b6:81:0a:e3:43:53",
            "net5": "a2:82:ac:c4:a6:26",
            "net6": "a2:38:65:a6:0a:5a",
            "net7": "9e:83:8a:f2:10:d2",
            "net8": "a2:4a:c6:d2:e2:ed",
            "net9": "32:4f:37:21:61:4c"
        },
        "tof_1_2_3": {
            "net0": "fe:5d:b3:43:55:c4",
            "net1": "16:02:92:72:6b:9d",
            "net10": "9a:f1:54:12:9d:77",
            "net11": "e2:12:89:32:5a:35",
            "net12": "36:c5:4d:0d:92:6e",
            "net13": "96:7f:02:8b:b7:1e",
            "net14": "62:50:42:f7:54:f9",
            "net15": "ee:19:a4:cf:d2:3a",
            "net16": "3e:d7:47:27:74:e3",
            "net17": "0e:bd:67:17:05:2f",
            "net18": "ea:b3:70:99:c3:23",
            "net19": "72:cd:39:2c:59:20",
            "net2": "66:4e:16:07:d3:00",
            "net3": "7e:04:15:6b:81:95",
            "net4": "aa:7f:f2:27:f3:0b",
            "net5": "7a:bf:9d:52:33:79",
            "net6": "92:85:1d:9a:5c:50",
            "net7": "02:50:f7:e0:94:03",
            "net8": "5e:20:4e:62:fd:4d",
            "net9": "e6:ea:0c:34:e6:d8"
        },
        "tof_1_2_4": {
            "net0": "e6:65:ae:31:e2:20",
            "net1": "56:6e:99:0b:a6:fb",
            "net10": "7a:c6:41:8b:87:16",
            "net11": "6e:ec:f6:7e:16:ae",
            "net12": "26:a4:cb:84:18:03",
            "net13": "da:c0:3f:09:19:3a",
            "net14": "e6:e6:b9:03:0a:25",
            "net15": "0a:87:19:0b:7a:b6",
            "net16": "ee:d8:b6:61:42:e9",
            "net17": "12:fe:73:54:c3:21",
            "net18": "f2:ab:42:4c:b8:a8",
            "net19": "6a:5c:c0:3a:5b:74",
            "net2": "4a:b7:48:e0:15:a5",
            "net3": "a6:f1:4f:ce:d6:3d",
            "net4": "0a:a0:ff:7c:12:8e",
            "net5": "6a:71:3f:d8:d5:6b",
            "net6": "c6:f3:7f:a8:9f:73",
            "net7": "36:08:98:77:83:96",
            "net8": "36:a2:83:aa:d7:c8",
            "net9": "f2:2b:c5:44:86:62"
        },
        "tof_1_2_5": {
            "net0": "32:89:7b:a7:ef:82",
            "net1": "4e:dc:d4:f8:48:70",
            "net10": "fe:9d:35:8e:d0:38",
            "net11": "ce:4a:6c:81:cf:21",
            "net12": "4a:3f:68:00:c3:b5",
            "net13": "ba:04:df:60:f4:94",
            "net14": "32:b8:4e:ec:3e:9e",
            "net15": "6a:10:86:51:70:2f",
            "net16": "d2:a8:11:c7:7d:22",
            "net17": "be:f7:e9:3e:9c:00",
            "net18": "a2:d5:28:4e:25:56",
            "net19": "66:c1:d4:8f:b2:d1",
            "net2": "fa:f0:87:70:69:1e",
            "net3": "06:b0:e9:69:8b:c6",
            "net4": "7e:d5:15:4f:c7:a9",
            "net5": "de:a9:ea:77:b4:55",
            "net6": "ce:2b:2c:8f:4b:20",
            "net7": "4a:ba:96:33:e6:cb",
            "net8": "ea:71:e8:7a:62:90",
            "net9": "fa:b9:0d:e8:7f:ae"
        },
        "tof_1_2_6": {
            "net0": "de:da:30:61:b0:da",
            "net1": "ae:e8:61:1d:bd:f6",
            "net10": "3e:c9:ad:db:ba:2b",
            "net11": "9e:40:3f:c0:bc:47",
            "net12": "02:31:bc:e2:61:2d",
            "net13": "be:7e:4d:29:d2:a9",
            "net14": "c2:e8:80:97:04:f0",
            "net15": "ce:63:74:8b:80:45",
            "net16": "86:c7:8a:81:8c:fb",
            "net17": "6e:5f:8c:e4:cd:f9",
            "net18": "52:c7:34:a8:a0:0c",
            "net19": "26:4f:e0:8e:a3:2a",
            "net2": "b2:0e:57:8a:fe:68",
            "net3": "e6:ea:ec:14:ee:d8",
            "net4": "c2:07:bf:7e:60:be",
            "net5": "8e:d2:df:bb:56:17",
            "net6": "e2:9f:c2:47:c1:77",
            "net7": "72:b8:0e:ac:ff:09",
            "net8": "1e:b4:17:7c:01:35",
            "net9": "d2:53:d6:46:3e:e4"
        },
        "tof_1_2_7": {
            "net0": "0e:f0:91:89:5e:c7",
            "net1": "9a:68:b2:7e:02:5c",
            "net10": "ce:2e:5b:bb:bb:e9",
            "net11": "f2:bb:1e:7e:4c:27",
            "net12": "8e:d8:12:45:a4:75",
            "net13": "82:44:d8:a1:c7:a0",
            "net14": "5a:0e:73:39:d6:39",
            "net15": "5e:99:76:77:fd:59",
            "net16": "c6:52:4f:08:2a:25",
            "net17": "16:e9:7b:a7:0e:07",
            "net18": "e2:7e:79:f4:93:98",
            "net19": "42:e7:4e:f0:81:3f",
            "net2": "d6:65:1d:4b:ca:23",
            "net3": "ea:ce:26:3a:e6:54",
            "net4": "5a:be:f2:47:19:5a",
            "net5": "86:db:57:77:12:40",
            "net6": "a2:09:5c:a2:1c:0c",
            "net7": "52:87:53:90:cc:48",
            "net8": "fe:d0:94:d0:31:d9",
            "net9": "1e:87:ef:62:d8:04"
        },
        "tof_1_2_8": {
            "net0": "fe:e1:d8:af:ed:f7",
            "net1": "32:4a:b5:1a:ca:f2",
            "net10": "aa:86:90:d4:ae:37",
            "net11": "7a:66:85:fd:38:69",
            "net12": "8a:8b:91:c5:0e:a5",
            "net13": "22:14:5b:4b:32:89",
            "net14": "0a:80:43:9d:7e:14",
            "net15": "a6:0f:65:e7:63:51",
            "net16": "ae:78:70:db:92:f6",
            "net17": "32:41:fe:74:3d:9d",
            "net18": "a6:4c:4f:5d:a1:52",
            "net19": "f2:93:fe:5a:c5:e8",
            "net2": "fe:c3:10:34:16:84",
            "net3": "02:ff:eb:3c:b4:ef",
            "net4": "42:11:06:c4:46:e2",
            "net5": "1a:de:7f:d3:eb:cb",
            "net6": "ba:63:c2:99:90:59",
            "net7": "72:bf:3b:30:8d:28",
            "net8": "de:39:df:db:2f:7d",
            "net9": "26:e4:36:a4:e3:a1"
        },
        "tof_1_2_9": {
            "net0": "0e:18:60:34:92:32",
            "net1": "0e:24:6a:3e:e3:57",
            "net10": "56:74:c4:d8:5d:92",
            "net11": "96:01:52:2a:30:3d",
            "net12": "6e:22:92:c6:fa:50",
            "net13": "16:18:4f:39:27:22",
            "net14": "86:0f:9d:14:39:6a",
            "net15": "2a:52:0f:7d:ba:69",
            "net16": "b6:0d:16:bd:d5:16",
            "net17": "ae:70:36:e8:47:a1",
            "net18": "9e:3f:b6:cb:19:5a",
            "net19": "62:f1:cf:6c:b0:3b",
            "net2": "6e:17:ee:5b:a6:43",
            "net3": "fa:7d:d1:78:66:c9",
            "net4": "66:ca:da:1b:de:70",
            "net5": "36:8e:b0:27:c6:aa",
            "net6": "8e:d1:22:37:91:4a",
            "net7": "c6:7d:e1:25:c4:ea",
            "net8": "c6:df:7d:17:d8:3f",
            "net9": "aa:6c:33:fe:76:8c"
        }
    },
    "failed_machine": "leaf_1_0_1",
    "failure_time": {
        "leaf_1_0_1": 1622131164.8762958,
        "leaf_1_0_10": 1622131164.88894,
        "leaf_1_0_2": 1622131164.8996882,
        "leaf_1_0_3": 1622131164.9156091,
        "leaf_1_0_4": 1622131164.8757067,
        "leaf_1_0_5": 1622131164.8938277,
        "leaf_1_0_6": 1622131164.9154365,
        "leaf_1_0_7": 1622131164.927967,
        "leaf_1_0_8": 1622131164.8772082,
        "leaf_1_0_9": 1622131164.895303,
        "leaf_2_0_1": 1622131164.9131393,
        "leaf_2_0_10": 1622131164.920344,
        "leaf_2_0_2": 1622131164.8789144,
        "leaf_2_0_3": 1622131164.894473,
        "leaf_2_0_4": 1622131164.905421,
        "leaf_2_0_5": 1622131164.916607,
        "leaf_2_0_6": 1622131164.929866,
        "leaf_2_0_7": 1622131164.940782,
        "leaf_2_0_8": 1622131164.9508736,
        "leaf_2_0_9": 1622131164.962306,
        "spine_1_1_1": 1622131164.9380436,
        "spine_1_1_10": 1622131164.9482071,
        "spine_1_1_2": 1622131164.9578927,
        "spine_1_1_3": 1622131164.9693494,
        "spine_1_1_4": 1622131164.9350684,
        "spine_1_1_5": 1622131164.9433732,
        "spine_1_1_6": 1622131164.9538178,
        "spine_1_1_7": 1622131164.9651124,
        "spine_1_1_8": 1622131164.9376495,
        "spine_1_1_9": 1622131164.9439547,
        "spine_2_1_1": 1622131164.9554884,
        "spine_2_1_10": 1622131164.9682055,
        "spine_2_1_2": 1622131164.9713476,
        "spine_2_1_3": 1622131164.9899483,
        "spine_2_1_4": 1622131165.0061026,
        "spine_2_1_5": 1622131165.0154214,
        "spine_2_1_6": 1622131164.972401,
        "spine_2_1_7": 1622131164.9909053,
        "spine_2_1_8": 1622131165.0053687,
        "spine_2_1_9": 1622131165.0200455,
        "tof_1_2_1": 1622131164.9809346,
        "tof_1_2_10": 1622131164.9901338,
        "tof_1_2_2": 1622131165.0079255,
        "tof_1_2_3": 1622131165.0199602,
        "tof_1_2_4": 1622131164.9831014,
        "tof_1_2_5": 1622131164.992126,
        "tof_1_2_6": 1622131165.013515,
        "tof_1_2_7": 1622131165.025121,
        "tof_1_2_8": 1622131165.0275764,
        "tof_1_2_9": 1622131165.0363941
    }
}