{
    "k_leaf": 8,
    "k_top": 8,
    "redundancy_factor": 8,
    "is_k8s": true,
    "machine_mac_addresses": {
        "leaf_1_0_1": {
            "net0": "ba:a9:0a:7b:4b:79",
            "net1": "42:b5:f3:8a:2a:79",
            "net2": "12:06:c9:36:41:3b",
            "net3": "16:ac:19:7b:a1:cf",
            "net4": "6a:d7:0d:3f:52:ea",
            "net5": "b2:81:1f:49:b8:6d",
            "net6": "36:a1:a4:f4:ec:a3",
            "net7": "4a:13:60:f7:0c:c4",
            "net8": "8a:a5:3d:c3:b3:b4"
        },
        "leaf_1_0_2": {
            "net0": "2a:b0:e3:53:b9:a9",
            "net1": "92:29:0f:4e:7c:51",
            "net2": "56:52:86:49:ab:1d",
            "net3": "0a:09:d2:6c:e2:1f",
            "net4": "da:f6:6c:2f:9b:26",
            "net5": "66:e7:35:ef:bb:55",
            "net6": "7e:f4:a2:9d:ff:53",
            "net7": "de:22:6e:7e:45:74",
            "net8": "32:2c:92:cb:b3:77"
        },
        "leaf_1_0_3": {
            "net0": "0a:88:00:9d:48:87",
            "net1": "42:bb:50:32:86:20",
            "net2": "a2:3d:42:41:c1:b8",
            "net3": "52:c0:ea:7d:de:3a",
            "net4": "32:1e:d1:22:75:6f",
            "net5": "4a:48:1f:08:5b:d3",
            "net6": "02:e7:21:8c:4e:ad",
            "net7": "b2:56:fd:3a:96:80",
            "net8": "76:2e:55:77:75:4a"
        },
        "leaf_1_0_4": {
            "net0": "26:01:f6:9f:99:f8",
            "net1": "9e:f1:87:e2:a5:3f",
            "net2": "76:a6:b9:ab:0f:ea",
            "net3": "be:fc:3c:72:df:40",
            "net4": "7e:8a:c0:b5:d0:2a",
            "net5": "b2:bc:9e:ad:ec:63",
            "net6": "ca:21:2b:17:b7:ea",
            "net7": "de:10:ad:3f:73:43",
            "net8": "fa:c5:fd:81:39:e6"
        },
        "leaf_1_0_5": {
            "net0": "06:c3:4d:72:ec:b3",
            "net1": "fa:da:8a:51:94:fe",
            "net2": "c6:61:32:2f:f7:67",
            "net3": "c6:18:49:59:6c:98",
            "net4": "56:54:7c:83:f3:ee",
            "net5": "9e:38:ba:50:70:d9",
            "net6": "2a:d3:de:33:df:47",
            "net7": "16:d0:7e:38:bc:a7",
            "net8": "d2:3f:e5:7f:a9:3f"
        },
        "leaf_1_0_6": {
            "net0": "ee:c1:3b:6b:f4:8b",
            "net1": "82:ef:d0:eb:2d:f2",
            "net2": "c2:e7:8a:a7:99:ef",
            "net3": "fa:ab:29:1f:c4:0e",
            "net4": "7e:90:74:b7:d3:9c",
            "net5": "e6:2a:69:56:27:d9",
            "net6": "8e:ea:14:e5:30:91",
            "net7": "0a:88:b6:3e:39:3c",
            "net8": "4e:13:1b:93:3a:99"
        },
        "leaf_1_0_7": {
            "net0": "0e:e3:6d:14:f0:d0",
            "net1": "22:95:96:d3:9f:1d",
            "net2": "5a:cd:60:b3:16:10",
            "net3": "f6:d4:a1:94:80:20",
            "net4": "ea:c3:89:70:9a:c0",
            "net5": "a6:06:b5:57:56:83",
            "net6": "be:20:ff:50:dc:3f",
            "net7": "d2:7a:07:40:db:99",
            "net8": "3a:56:f3:8a:81:35"
        },
        "leaf_1_0_8": {
            "net0": "62:b6:d6:78:f4:79",
            "net1": "aa:c2:f4:01:88:84",
            "net2": "5a:a9:1a:99:c1:93",
            "net3": "fe:14:38:0e:00:b6",
            "net4": "56:78:85:5d:c1:d3",
            "net5": "4a:7d:10:02:94:0a",
            "net6": "42:75:c2:1d:c7:9f",
            "net7": "c2:d9:88:fc:01:39",
            "net8": "36:db:78:d5:a9:d1"
        },
        "leaf_2_0_1": {
            "net0": "92:ea:91:1a:43:e3",
            "net1": "e2:f8:bd:5a:2b:c8",
            "net2": "62:ba:47:e2:63:8e",
            "net3": "be:d5:2b:77:8c:e2",
            "net4": "2e:fa:26:36:08:01",
            "net5": "1e:d9:45:d8:51:04",
            "net6": "02:90:cc:a6:fa:e5",
            "net7": "06:73:5a:be:29:11",
            "net8": "66:d4:df:3a:a2:de"
        },
        "leaf_2_0_2": {
            "net0": "4a:bf:60:89:44:cb",
            "net1": "3e:a8:d1:a4:ca:80",
            "net2": "9e:d6:74:0f:1e:db",
            "net3": "6e:0b:5c:f3:6f:33",
            "net4": "c6:e5:53:39:63:8f",
            "net5": "ba:c0:12:2b:bd:38",
            "net6": "22:85:87:6b:51:56",
            "net7": "a6:51:12:49:aa:83",
            "net8": "0e:05:45:c6:b2:f2"
        },
        "leaf_2_0_3": {
            "net0": "86:1c:3f:2c:77:68",
            "net1": "6e:14:69:09:e2:e7",
            "net2": "be:a9:12:5b:af:b8",
            "net3": "32:d1:8c:3d:ed:5b",
            "net4": "da:66:c0:82:98:22",
            "net5": "9a:56:e2:24:4c:95",
            "net6": "62:99:ec:a2:fa:78",
            "net7": "d2:d2:9e:c9:3f:d2",
            "net8": "a6:d8:9b:60:c9:6c"
        },
        "leaf_2_0_4": {
            "net0": "0e:98:69:63:e6:b9",
            "net1": "1e:21:73:c4:da:ee",
            "net2": "0a:d6:58:7f:a8:49",
            "net3": "ee:10:6d:b8:53:18",
            "net4": "66:6a:4b:e8:7f:36",
            "net5": "72:68:f8:47:48:6d",
            "net6": "e2:dd:5a:7b:c6:14",
            "net7": "ea:13:06:ad:3e:b8",
            "net8": "2e:c1:c7:ca:93:d1"
        },
        "leaf_2_0_5": {
            "net0": "e6:3f:db:a9:21:68",
            "net1": "96:b0:a6:13:80:ac",
            "net2": "42:6a:a4:db:28:bd",
            "net3": "8e:cf:0a:80:ff:c5",
            "net4": "de:af:57:be:1b:20",
            "net5": "de:53:3b:6b:7f:d0",
            "net6": "26:57:e1:8c:2d:b2",
            "net7": "c2:5b:53:88:2f:b0",
            "net8": "32:c6:db:d3:4e:a6"
        },
        "leaf_2_0_6": {
            "net0": "92:cb:c8:c4:2e:46",
            "net1": "9e:18:96:ed:56:dd",
            "net2": "86:45:7b:41:11:8b",
            "net3": "3a:5e:7b:14:89:34",
            "net4": "ba:1c:42:8e:0e:8b",
            "net5": "ca:0a:57:82:bd:db",
            "net6": "fe:cf:7c:dd:5b:2b",
            "net7": "6a:a0:b0:77:76:7e",
            "net8": "4a:4b:3a:d4:d0:a1"
        },
        "leaf_2_0_7": {
            "net0": "86:9f:49:70:c8:cb",
            "net1": "3e:c1:4f:3b:58:a7",
            "net2": "42:5d:19:c5:4c:7d",
            "net3": "e6:10:13:90:2c:13",
            "net4": "d6:e7:80:00:05:5e",
            "net5": "5e:be:c3:67:86:60",
            "net6": "8a:7d:39:5a:b1:43",
            "net7": "e2:28:d2:39:52:9d",
            "net8": "8a:74:bb:84:42:59"
        },
        "leaf_2_0_8": {
            "net0": "b6:91:3b:eb:e1:90",
            "net1": "1a:83:81:2a:79:ee",
            "net2": "1e:af:54:10:f0:03",
            "net3": "e2:b0:90:3d:1c:d6",
            "net4": "06:d6:22:44:81:1c",
            "net5": "3a:ee:de:0b:5e:41",
            "net6": "8a:9e:6e:58:0b:cf",
            "net7": "ce:2e:49:e2:1a:68",
            "net8": "e2:57:03:92:f7:0f"
        },
        "spine_1_1_1": {
            "net0": "76:e4:d6:a4:f9:ed",
            "net1": "46:7d:9c:a4:75:63",
            "net10": "7a:7a:fd:98:d5:8d",
            "net11": "1a:23:88:3d:e0:56",
            "net12": "ae:40:60:14:fe:c8",
            "net13": "6e:7a:c1:53:9d:70",
            "net14": "0e:44:c2:c4:3d:03",
            "net15": "36:55:9f:a0:0b:63",
            "net2": "ca:e6:1a:9b:9f:e6",
            "net3": "ba:47:31:c2:af:82",
            "net4": "12:82:48:7a:93:2f",
            "net5": "86:7a:91:ef:5a:00",
            "net6": "fa:d3:24:d6:80:9f",
            "net7": "46:f0:3e:7c:30:53",
            "net8": "ae:af:89:72:7f:98",
            "net9": "fe:a8:23:b2:78:7a"
        },
        "spine_1_1_2": {
            "net0": "76:20:a2:67:a8:2b",
            "net1": "86:6f:26:5c:64:32",
            "net10": "92:35:6e:40:66:8a",
            "net11": "d6:a7:33:d1:59:2b",
            "net12": "22:9d:f0:8c:54:70",
            "net13": "e6:b4:ed:ac:25:0c",
            "net14": "a6:09:40:fe:f9:a3",
            "net15": "3e:78:06:5a:b8:6a",
            "net2": "6a:d5:d2:df:b4:a4",
            "net3": "2a:be:97:a5:7a:df",
            "net4": "5a:f3:e7:38:a9:1d",
            "net5": "22:8e:35:cd:eb:2d",
            "net6": "56:92:25:97:91:5c",
            "net7": "ce:b0:be:01:c2:1f",
            "net8": "16:ae:47:c6:39:ef",
            "net9": "6a:76:e8:e8:77:0f"
        },
        "spine_1_1_3": {
            "net0": "e6:5e:a1:2e:3a:63",
            "net1": "d2:f8:16:74:9a:5d",
            "net10": "56:f0:6a:07:c5:41",
            "net11": "7e:30:a4:c2:0f:d9",
            "net12": "0a:3a:90:a1:af:2a",
            "net13": "76:85:80:6c:4e:7f",
            "net14": "ae:42:18:9c:f0:17",
            "net15": "4a:e7:98:3b:70:f0",
            "net2": "56:cc:5d:0f:34:2e",
            "net3": "36:0f:73:f5:73:82",
            "net4": "be:e6:88:8a:a4:76",
            "net5": "4e:b3:6d:2c:c9:71",
            "net6": "7a:e0:87:d3:d5:a8",
            "net7": "36:ee:6f:70:33:50",
            "net8": "12:ed:68:3a:b7:53",
            "net9": "1a:b1:6d:4b:31:4b"
        },
        "spine_1_1_4": {
            "net0": "0e:ea:8e:70:45:e8",
            "net1": "0e:4a:77:2c:f8:f3",
            "net10": "f6:5a:2b:bd:c1:02",
            "net11": "b6:fe:84:01:c2:30",
            "net12": "32:6c:83:e0:e3:60",
            "net13": "5e:d5:06:e6:c6:40",
            "net14": "ca:00:86:df:12:24",
            "net15": "5e:67:cf:ad:6f:01",
            "net2": "72:5c:b5:a4:84:fd",
            "net3": "ba:8b:cd:26:70:3d",
            "net4": "fe:47:79:f0:bd:6a",
            "net5": "36:a8:40:00:52:21",
            "net6": "3a:e2:a3:dc:d3:44",
            "net7": "5e:93:5f:8a:7f:05",
            "net8": "7e:ce:91:e9:c4:e5",
            "net9": "ee:64:8d:97:6d:7a"
        },
        "spine_1_1_5": {
            "net0": "9e:54:c3:d4:82:e4",
            "net1": "aa:4e:bb:e9:11:fb",
            "net10": "ba:e6:45:84:5b:ff",
            "net11": "16:43:2d:3b:9e:73",
            "net12": "fa:e9:e9:a0:d5:0e",
            "net13": "22:32:69:d2:d4:1e",
            "net14": "5a:f3:78:11:e7:09",
            "net15": "ea:cf:14:15:7c:2d",
            "net2": "f2:23:48:b3:3f:51",
            "net3": "82:cb:8b:77:8b:4d",
            "net4": "3a:06:41:8b:97:c9",
            "net5": "12:a4:15:7c:15:b5",
            "net6": "1e:ec:5f:54:f4:d3",
            "net7": "36:9f:c0:93:3f:1b",
            "net8": "6a:6c:e2:32:5c:18",
            "net9": "52:96:ad:37:28:4f"
        },
        "spine_1_1_6": {
            "net0": "8e:dc:06:83:f2:94",
            "net1": "0a:3b:a8:2c:ea:5f",
            "net10": "52:2c:e8:6d:23:b2",
            "net11": "1e:f3:27:af:e6:17",
            "net12": "1a:3e:3e:d0:03:11",
            "net13": "22:57:38:c5:f9:33",
            "net14": "56:b6:7a:6f:3f:c0",
            "net15": "9e:ad:0b:df:4e:9f",
            "net2": "d6:67:43:e6:67:c5",
            "net3": "1a:a0:4c:ae:a5:ea",
            "net4": "9e:bd:7a:06:5c:bc",
            "net5": "5a:88:92:c5:e9:77",
            "net6": "ba:78:b8:69:58:6c",
            "net7": "22:8c:07:0a:42:a6",
            "net8": "62:ba:c2:e7:d0:d4",
            "net9": "e6:87:af:8d:94:37"
        },
        "spine_1_1_7": {
            "net0": "66:47:ad:7f:f3:47",
            "net1": "da:d8:07:81:c5:f2",
            "net10": "92:cd:8f:b6:5a:ea",
            "net11": "5e:5c:b3:ce:e6:7c",
            "net12": "2e:66:88:77:25:61",
            "net13": "c2:9f:0e:fa:cd:ab",
            "net14": "da:cf:92:6e:4d:ed",
            "net15": "2a:a8:3a:32:96:01",
            "net2": "3a:cf:31:65:93:49",
            "net3": "9a:3d:91:9c:88:fa",
            "net4": "52:88:62:4c:38:21",
            "net5": "aa:b5:08:ff:f2:65",
            "net6": "36:89:fd:50:2b:71",
            "net7": "72:3d:ad:94:9b:a3",
            "net8": "c2:20:6a:be:5c:12",
            "net9": "ae:21:45:87:61:25"
        },
        "spine_1_1_8": {
            "net0": "0e:c3:b8:7e:73:ea",
            "net1": "8e:f2:1c:b0:7c:11",
            "net10": "ee:5b:29:13:c6:4a",
            "net11": "96:5a:4e:07:27:63",
            "net12": "1a:b7:74:ee:6c:b7",
            "net13": "fe:d7:4b:16:9f:c0",
            "net14": "32:7b:7c:56:83:8a",
            "net15": "12:d5:d2:16:8d:36",
            "net2": "c2:8a:f1:e9:53:36",
            "net3": "52:8c:60:ab:b2:5f",
            "net4": "5e:56:79:a0:db:1b",
            "net5": "c2:b0:3c:64:c9:1e",
            "net6": "76:6d:b2:db:ab:c3",
            "net7": "02:36:95:0d:94:d6",
            "net8": "d2:ef:d6:11:c0:f1",
            "net9": "02:e0:73:c4:56:e8"
        },
        "spine_2_1_1": {
            "net0": "42:92:54:43:4d:92",
            "net1": "46:28:3c:30:49:c4",
            "net10": "72:8f:75:2c:95:ee",
            "net11": "2a:24:24:1b:0b:4a",
            "net12": "8e:a5:99:b7:cc:73",
            "net13": "32:bf:ac:15:92:9f",
            "net14": "22:96:fb:2f:7c:41",
            "net15": "da:74:06:ad:09:a6",
            "net2": "9e:58:ec:33:af:18",
            "net3": "a2:ac:89:37:4d:0e",
            "net4": "e6:be:8c:15:65:1e",
            "net5": "aa:96:79:9b:48:cf",
            "net6": "52:50:5d:2f:9f:c9",
            "net7": "16:48:73:52:3c:51",
            "net8": "da:12:0a:c1:a6:da",
            "net9": "2a:8f:eb:5d:d4:ea"
        },
        "spine_2_1_2": {
            "net0": "92:6b:2c:eb:b0:36",
            "net1": "56:aa:ee:c3:17:77",
            "net10": "3a:46:60:b5:04:0e",
            "net11": "86:12:87:46:7d:30",
            "net12": "12:b5:4e:4c:b5:de",
            "net13": "52:79:44:94:aa:95",
            "net14": "0e:da:39:6f:5a:b9",
            "net15": "36:68:7b:32:02:b8",
            "net2": "f2:21:4e:94:20:98",
            "net3": "a6:bf:a1:f9:d4:f3",
            "net4": "12:e9:48:6e:ff:f4",
            "net5": "ce:a5:c6:be:85:f8",
            "net6": "16:c3:88:ae:5c:29",
            "net7": "be:8a:6d:14:0d:e0",
            "net8": "56:07:a0:2b:32:31",
            "net9": "3e:cd:41:66:c4:01"
        },
        "spine_2_1_3": {
            "net0": "26:00:0e:22:54:03",
            "net1": "66:9f:a1:78:c1:ef",
            "net10": "e6:b4:c8:d7:10:ff",
            "net11": "4e:6a:56:8f:d2:91",
            "net12": "1a:14:f8:7f:2b:98",
            "net13": "36:4a:ec:41:6a:22",
            "net14": "4a:a8:01:ae:48:97",
            "net15": "6a:82:e5:99:37:db",
            "net2": "aa:df:14:02:4f:88",
            "net3": "46:5c:03:0d:51:1c",
            "net4": "22:75:16:14:ee:7b",
            "net5": "ee:19:a7:aa:fd:1c",
            "net6": "da:28:7d:c3:3e:9f",
            "net7": "82:f0:f1:e9:5c:6a",
            "net8": "5a:7a:2e:ef:f1:fc",
            "net9": "a2:ce:c2:c2:33:c7"
        },
        "spine_2_1_4": {
            "net0": "9a:8b:1c:fd:f9:6f",
            "net1": "f2:0f:da:15:a5:18",
            "net10": "ba:34:d6:bb:c4:05",
            "net11": "fa:aa:62:48:39:eb",
            "net12": "aa:39:a0:e7:f2:07",
            "net13": "aa:cd:8a:50:74:a5",
            "net14": "42:17:b6:87:2c:d1",
            "net15": "96:e2:0a:c9:c2:bf",
            "net2": "3a:51:89:1d:23:81",
            "net3": "72:b5:76:72:6b:f3",
            "net4": "5a:7f:4c:fc:a0:41",
            "net5": "0a:e2:7a:26:86:79",
            "net6": "56:67:90:5e:b7:64",
            "net7": "82:74:42:ef:46:0c",
            "net8": "e6:9f:04:28:12:59",
            "net9": "92:6f:fd:3b:3d:76"
        },
        "spine_2_1_5": {
            "net0": "8e:c0:bb:cb:9b:f5",
            "net1": "ee:ca:55:2f:e7:9d",
            "net10": "ba:13:6b:59:45:75",
            "net11": "a6:ec:ac:da:03:c1",
            "net12": "5a:31:ff:52:74:a8",
            "net13": "ea:03:75:42:07:7b",
            "net14": "d2:18:ab:40:03:3d",
            "net15": "da:e6:81:48:10:62",
            "net2": "72:b7:1b:7f:38:e3",
            "net3": "8a:19:4c:9a:31:0b",
            "net4": "46:d3:bd:c9:9e:9b",
            "net5": "9e:8f:28:b9:67:b2",
            "net6": "e6:1b:66:21:da:bf",
            "net7": "22:35:af:5e:c9:dd",
            "net8": "a6:2e:44:cf:71:d4",
            "net9": "42:d8:a5:78:bc:46"
        },
        "spine_2_1_6": {
            "net0": "c6:12:89:65:45:08",
            "net1": "d2:6f:80:6c:f1:d9",
            "net10": "92:f8:7d:50:89:10",
            "net11": "e2:bd:1d:6d:cf:e6",
            "net12": "7a:58:21:4d:d2:63",
            "net13": "42:91:5e:ec:26:6e",
            "net14": "7a:ce:48:ee:0a:6b",
            "net15": "22:38:f9:ca:09:bd",
            "net2": "6e:1f:b8:20:2b:0b",
            "net3": "a6:11:ad:85:15:9b",
            "net4": "76:26:9d:92:6c:b5",
            "net5": "d2:9c:e0:2d:a2:d6",
            "net6": "2a:31:05:05:71:31",
            "net7": "2e:f7:cb:83:f2:f4",
            "net8": "b2:c2:96:19:84:62",
            "net9": "d6:36:da:7a:7e:af"
        },
        "spine_2_1_7": {
            "net0": "52:2c:1b:b6:04:d0",
            "net1": "f2:bf:ac:35:0a:d0",
            "net10": "d2:a5:e8:59:ce:c7",
            "net11": "f2:fd:dd:68:34:26",
            "net12": "1a:25:20:3b:b6:f1",
            "net13": "0e:71:45:2d:14:94",
            "net14": "8a:9a:fa:b2:46:f2",
            "net15": "3e:d9:02:1e:91:88",
            "net2": "f2:db:48:c7:fe:cb",
            "net3": "a6:c4:b4:db:14:51",
            "net4": "32:7e:9a:ad:3b:6f",
            "net5": "e2:bf:b3:6e:91:52",
            "net6": "3e:65:d1:02:56:30",
            "net7": "16:60:42:91:1d:4f",
            "net8": "4e:77:6a:05:c8:22",
            "net9": "5a:de:31:48:2a:61"
        },
        "spine_2_1_8": {
            "net0": "e6:6e:52:1c:3f:d1",
            "net1": "f2:e1:cc:52:84:aa",
            "net10": "e6:ed:ab:ca:53:62",
            "net11": "ee:5e:8d:93:5d:33",
            "net12": "aa:0b:71:2c:61:16",
            "net13": "9a:d7:0c:d5:b3:50",
            "net14": "2a:9d:ad:61:21:98",
            "net15": "16:c1:8d:5b:e1:03",
            "net2": "ca:91:7e:9d:19:72",
            "net3": "6a:34:c9:48:53:6e",
            "net4": "82:ac:41:18:13:bb",
            "net5": "42:ee:3e:7f:52:bb",
            "net6": "9a:be:8f:05:b0:7a",
            "net7": "22:06:55:ba:16:13",
            "net8": "4e:c5:72:98:92:83",
            "net9": "ce:cc:fe:15:0e:c0"
        },
        "tof_1_2_1": {
            "net0": "e2:0f:c0:0c:ea:4f",
            "net1": "fa:cf:c9:df:56:68",
            "net10": "56:ff:30:eb:10:c4",
            "net11": "12:4b:3c:65:b4:4a",
            "net12": "c2:74:ac:24:08:73",
            "net13": "7e:0c:d9:b0:7a:47",
            "net14": "d2:92:d0:e8:f2:3e",
            "net15": "fe:c5:be:b4:2b:78",
            "net2": "92:c6:e8:71:6a:f1",
            "net3": "22:f2:e8:62:6d:e0",
            "net4": "4e:3d:7d:89:f3:8e",
            "net5": "4e:03:7e:a3:63:ab",
            "net6": "f6:3f:92:a9:a2:cb",
            "net7": "26:ad:08:eb:8b:77",
            "net8": "e2:e6:34:9d:c5:9c",
            "net9": "fa:66:44:b3:6f:1f"
        },
        "tof_1_2_2": {
            "net0": "4e:a4:3f:34:b6:4b",
            "net1": "de:21:9e:09:87:e0",
            "net10": "2e:a0:97:66:f8:37",
            "net11": "22:05:83:38:f4:88",
            "net12": "7e:eb:28:a1:cd:ab",
            "net13": "96:59:bd:7e:3f:60",
            "net14": "c2:ec:dc:6c:60:4d",
            "net15": "8e:56:7b:f5:5f:11",
            "net2": "b2:69:fa:72:2d:60",
            "net3": "fe:bf:c8:ee:5d:c3",
            "net4": "42:df:fc:8d:7d:8f",
            "net5": "52:59:2e:72:3f:28",
            "net6": "8a:48:14:7e:8b:66",
            "net7": "9a:ee:f6:c8:d4:10",
            "net8": "ca:bb:c8:16:47:c4",
            "net9": "42:a5:59:d1:b2:2c"
        },
        "tof_1_2_3": {
            "net0": "92:e3:b6:20:46:c9",
            "net1": "76:b7:c1:09:37:eb",
            "net10": "7a:60:24:23:74:1d",
            "net11": "da:5e:7c:07:60:4b",
            "net12": "2e:51:72:c1:70:12",
            "net13": "e6:8c:fe:95:b4:db",
            "net14": "ca:08:a2:dd:a8:29",
            "net15": "2a:27:ae:3a:25:d4",
            "net2": "76:87:dd:e6:8a:dd",
            "net3": "56:6d:a2:b8:d9:ae",
            "net4": "32:b8:da:0d:9d:a2",
            "net5": "fe:c8:3a:b7:de:e4",
            "net6": "aa:4b:05:5a:3d:44",
            "net7": "c6:e3:32:f1:1a:cd",
            "net8": "fe:7e:14:92:23:3c",
            "net9": "7a:a7:9c:a0:fe:57"
        },
        "tof_1_2_4": {
            "net0": "36:2f:03:36:5e:33",
            "net1": "7e:19:64:fb:49:d5",
            "net10": "0a:da:a4:a9:ed:7d",
            "net11": "7a:fd:ca:3f:1b:92",
            "net12": "36:ea:fd:2e:b1:59",
            "net13": "72:e3:2d:d8:20:45",
            "net14": "36:18:2b:31:50:fb",
            "net15": "2a:bf:0b:89:ba:5c",
            "net2": "62:4e:5a:17:19:2d",
            "net3": "de:c7:76:e5:ec:40",
            "net4": "26:12:c4:79:c5:ed",
            "net5": "c6:4e:53:27:ac:58",
            "net6": "ae:4d:c9:da:7a:e9",
            "net7": "ae:5d:74:02:b0:5c",
            "net8": "46:00:fe:38:19:a2",
            "net9": "e6:f1:64:a7:7a:28"
        },
        "tof_1_2_5": {
            "net0": "a6:3e:e5:e2:31:c7",
            "net1": "86:50:6f:f8:e7:d0",
            "net10": "32:3a:66:2c:7c:4e",
            "net11": "92:ca:b5:a3:ee:a1",
            "net12": "96:e2:c2:da:91:67",
            "net13": "1e:96:e2:f0:f5:c4",
            "net14": "d6:bd:ba:b9:6f:70",
            "net15": "c2:b6:ee:dc:38:34",
            "net2": "d2:d6:42:d8:70:3b",
            "net3": "de:b3:eb:1a:eb:91",
            "net4": "e6:ba:c9:86:e7:80",
            "net5": "d6:5e:b8:8b:00:7c",
            "net6": "2a:89:4a:6e:8e:c7",
            "net7": "c2:8a:d1:ad:0c:32",
            "net8": "6a:18:3c:a6:c4:03",
            "net9": "02:cb:43:46:74:64"
        },
        "tof_1_2_6": {
            "net0": "36:a6:14:0c:3d:ea",
            "net1": "0e:f5:7e:e5:e2:b6",
            "net10": "5a:73:09:78:b4:83",
            "net11": "9e:a0:39:76:37:28",
            "net12": "76:ef:62:37:df:c4",
            "net13": "4e:fd:97:b2:5f:ea",
            "net14": "ee:bb:e6:3a:18:fa",
            "net15": "d6:8e:57:6d:3a:48",
            "net2": "9a:22:46:b5:28:bd",
            "net3": "d2:24:71:b4:78:43",
            "net4": "0e:dd:3c:94:5b:cd",
            "net5": "5a:57:e3:9f:bc:f6",
            "net6": "f6:d4:52:a7:8e:50",
            "net7": "32:5a:76:ed:58:da",
            "net8": "46:be:93:f6:97:6d",
            "net9": "8e:71:b8:b4:de:4d"
        },
        "tof_1_2_7": {
            "net0": "aa:b6:b3:38:43:46",
            "net1": "1a:92:e1:ed:63:b3",
            "net10": "02:58:ff:c5:d3:95",
            "net11": "6a:bb:3f:ec:0d:88",
            "net12": "96:79:3f:c2:19:f5",
            "net13": "42:13:cd:7e:43:98",
            "net14": "9a:d5:56:b6:20:c2",
            "net15": "06:ac:6f:f1:68:44",
            "net2": "02:96:a8:ef:c6:83",
            "net3": "1e:e2:dc:45:d0:08",
            "net4": "8e:8d:88:f0:19:57",
            "net5": "ca:1e:3b:a8:53:4d",
            "net6": "0a:35:36:97:b0:1f",
            "net7": "d2:98:df:29:70:bc",
            "net8": "4a:f3:7a:8d:aa:00",
            "net9": "52:97:41:4f:c6:24"
        },
        "tof_1_2_8": {
            "net0": "6e:f7:77:9d:17:21",
            "net1": "16:d5:0e:14:9c:a2",
            "net10": "42:3e:ca:69:3b:d4",
            "net11": "7a:80:d6:c9:cf:ba",
            "net12": "3a:2d:83:ae:2f:a9",
            "net13": "12:17:a5:48:fd:08",
            "net14": "52:2a:ab:86:f9:a4",
            "net15": "ba:79:87:fa:7c:49",
            "net2": "fe:22:94:de:c5:a0",
            "net3": "26:7e:cd:17:97:d7",
            "net4": "82:30:5d:96:ea:8d",
            "net5": "86:d5:58:c8:84:1b",
            "net6": "4e:8b:36:c7:a3:5a",
            "net7": "02:ad:c7:1d:8d:53",
            "net8": "16:7c:a7:b7:1c:50",
            "net9": "e2:03:eb:ac:9f:ea"
        }
    },
    "failed_machine": "spine_1_1_1",
    "failure_time": {
        "leaf_1_0_1": 1635326699.0132,
        "leaf_1_0_2": 1635326699.0288117,
        "leaf_1_0_3": 1635326699.0438082,
        "leaf_1_0_4": 1635326699.0554366,
        "leaf_1_0_5": 1635326699.067103,
        "leaf_1_0_6": 1635326700.8008254,
        "leaf_1_0_7": 1635326699.0226989,
        "leaf_1_0_8": 1635326699.0289357,
        "leaf_2_0_1": 1635326699.0420148,
        "leaf_2_0_2": 1635326700.8365972,
        "leaf_2_0_3": 1635326699.0630589,
        "leaf_2_0_4": 1635326699.0765193,
        "leaf_2_0_5": 1635326699.0924325,
        "leaf_2_0_6": 1635326699.1016371,
        "leaf_2_0_7": 1635326699.1091359,
        "leaf_2_0_8": 1635326699.0798612,
        "spine_1_1_1": 1635326699.0873954,
        "spine_1_1_2": 1635326699.0970242,
        "spine_1_1_3": 1635326699.1067712,
        "spine_1_1_4": 1635326699.1135743,
        "spine_1_1_5": 1635326699.1160853,
        "spine_1_1_6": 1635326699.1274707,
        "spine_1_1_7": 1635326699.1390285,
        "spine_1_1_8": 1635326699.1525593,
        "spine_2_1_1": 1635326699.1629913,
        "spine_2_1_2": 1635326699.11941,
        "spine_2_1_3": 1635326700.917205,
        "spine_2_1_4": 1635326699.1399913,
        "spine_2_1_5": 1635326700.9383507,
        "spine_2_1_6": 1635326699.158483,
        "spine_2_1_7": 1635326699.1673696,
        "spine_2_1_8": 1635326699.1770532,
        "tof_1_2_1": 1635326699.1861522,
        "tof_1_2_2": 1635326699.195114,
        "tof_1_2_3": 1635326699.205684,
        "tof_1_2_4": 1635326699.1726491,
        "tof_1_2_5": 1635326699.1801178,
        "tof_1_2_6": 1635326699.1913464,
        "tof_1_2_7": 1635326699.204479,
        "tof_1_2_8": 1635326699.2136774
    },
    "recover_time": {
        "leaf_1_0_1": 1635326757.7836194,
        "leaf_1_0_2": 1635326757.7961411,
        "leaf_1_0_3": 1635326757.8025494,
        "leaf_1_0_4": 1635326757.8147008,
        "leaf_1_0_5": 1635326757.82127,
        "leaf_1_0_6": 1635326757.7812457,
        "leaf_1_0_7": 1635326757.8039136,
        "leaf_1_0_8": 1635326757.81046,
        "leaf_2_0_1": 1635326757.819679,
        "leaf_2_0_2": 1635326759.6212537,
        "leaf_2_0_3": 1635326757.834648,
        "leaf_2_0_4": 1635326757.8387644,
        "leaf_2_0_5": 1635326757.8507166,
        "leaf_2_0_6": 1635326757.8591146,
        "leaf_2_0_7": 1635326757.8659196,
        "leaf_2_0_8": 1635326757.8406959,
        "spine_1_1_2": 1635326757.843384,
        "spine_1_1_3": 1635326757.8519592,
        "spine_1_1_4": 1635326757.8602154,
        "spine_1_1_5": 1635326757.8679585,
        "spine_1_1_6": 1635326757.8711827,
        "spine_1_1_7": 1635326757.8858435,
        "spine_1_1_8": 1635326757.8930259,
        "spine_2_1_1": 1635326757.9057665,
        "spine_2_1_2": 1635326757.9183567,
        "spine_2_1_3": 1635326757.8771684,
        "spine_2_1_4": 1635326757.8848884,
        "spine_2_1_5": 1635326759.68787,
        "spine_2_1_6": 1635326757.9053893,
        "spine_2_1_7": 1635326757.921743,
        "spine_2_1_8": 1635326757.9314861,
        "tof_1_2_1": 1635326757.9415264,
        "tof_1_2_2": 1635326757.9464738,
        "tof_1_2_3": 1635326757.9600651,
        "tof_1_2_4": 1635326757.9631956,
        "tof_1_2_5": 1635326757.9331026,
        "tof_1_2_6": 1635326757.9377532,
        "tof_1_2_7": 1635326757.957271,
        "tof_1_2_8": 1635326757.9610422,
        "spine_1_1_1": 1635326775.302859
    }
}