{
    "k_leaf": 4,
    "k_top": 4,
    "redundancy_factor": 4,
    "is_k8s": true,
    "machine_mac_addresses": {
        "leaf_1_0_1": {
            "net0": "ce:46:dc:9e:de:ca",
            "net1": "d2:5a:d0:be:52:b3",
            "net2": "ea:90:51:e6:4e:0c",
            "net3": "ee:c3:4a:2f:38:9e",
            "net4": "76:36:14:a9:3a:92"
        },
        "leaf_1_0_2": {
            "net0": "92:4f:f4:3e:31:47",
            "net1": "ca:4a:9c:2d:f0:77",
            "net2": "3e:1c:1f:48:b3:62",
            "net3": "36:51:0b:46:8c:6c",
            "net4": "ca:27:5a:d1:d0:47"
        },
        "leaf_1_0_3": {
            "net0": "b6:cd:fa:1e:7c:99",
            "net1": "26:84:b9:5a:aa:6c",
            "net2": "36:3f:21:f2:53:1c",
            "net3": "b6:7b:b3:1b:56:f1",
            "net4": "8a:90:d2:ff:9c:66"
        },
        "leaf_1_0_4": {
            "net0": "02:d2:ec:c3:06:e0",
            "net1": "12:1d:25:d0:c1:7b",
            "net2": "62:3c:6b:07:7d:b4",
            "net3": "8a:e1:93:54:26:49",
            "net4": "72:8b:c1:3c:0c:e0"
        },
        "leaf_2_0_1": {
            "net0": "92:7e:61:89:e6:20",
            "net1": "ee:24:77:97:76:ce",
            "net2": "72:9f:ca:6b:43:52",
            "net3": "86:8b:20:d3:3b:2e",
            "net4": "ba:a2:05:cf:2f:58"
        },
        "leaf_2_0_2": {
            "net0": "ba:e7:86:e2:11:8d",
            "net1": "0a:1d:f4:2e:c3:74",
            "net2": "fa:06:f3:27:10:6e",
            "net3": "d2:a7:6f:80:6c:c1",
            "net4": "26:3c:82:2c:29:ec"
        },
        "leaf_2_0_3": {
            "net0": "b6:cf:c1:11:55:0a",
            "net1": "72:75:01:16:50:b8",
            "net2": "c2:7a:74:03:c5:57",
            "net3": "9e:06:f6:e2:58:45",
            "net4": "ca:fc:5f:99:5a:e0"
        },
        "leaf_2_0_4": {
            "net0": "fa:79:df:20:07:d5",
            "net1": "42:e7:a9:4b:cd:43",
            "net2": "7e:52:67:fb:5e:44",
            "net3": "fe:e0:f5:fa:f3:f6",
            "net4": "3e:21:d3:c8:b8:0d"
        },
        "spine_1_1_1": {
            "net0": "8a:4d:cf:19:9f:0c",
            "net1": "6a:25:bf:90:37:9d",
            "net2": "3a:56:80:04:67:64",
            "net3": "56:40:9f:92:8a:22",
            "net4": "8e:6f:65:81:f0:45",
            "net5": "2a:8e:4e:25:1e:19",
            "net6": "06:30:dd:b1:86:bc",
            "net7": "16:62:53:f3:fe:aa"
        },
        "spine_1_1_2": {
            "net0": "fe:0a:ad:4c:dd:8f",
            "net1": "6a:91:b6:ae:db:79",
            "net2": "f6:89:a3:7a:c5:b3",
            "net3": "76:9c:64:2d:8b:91",
            "net4": "f2:45:73:11:1c:28",
            "net5": "02:46:13:b5:ef:1a",
            "net6": "02:7a:d9:62:c1:44",
            "net7": "c2:ca:36:a5:77:0f"
        },
        "spine_1_1_3": {
            "net0": "ba:ba:95:f9:29:2e",
            "net1": "92:56:ad:8a:cd:3d",
            "net2": "4e:34:98:4f:8f:3c",
            "net3": "fe:0f:50:74:a0:5d",
            "net4": "12:03:5c:d4:6a:95",
            "net5": "12:f7:d8:d6:67:39",
            "net6": "8e:88:0f:35:ca:ea",
            "net7": "da:4a:70:5b:02:0d"
        },
        "spine_1_1_4": {
            "net0": "3a:4b:50:86:a8:1a",
            "net1": "4e:17:b7:eb:05:a4",
            "net2": "5e:66:11:ee:4b:99",
            "net3": "a6:d6:2d:52:9d:f6",
            "net4": "56:4f:ef:44:3b:37",
            "net5": "e6:ec:06:10:4f:f9",
            "net6": "3e:2b:28:42:f9:5d",
            "net7": "96:a3:9c:04:a5:f5"
        },
        "spine_2_1_1": {
            "net0": "ae:80:e7:35:fc:eb",
            "net1": "a6:84:b3:7e:f8:5c",
            "net2": "1e:5c:19:65:4d:92",
            "net3": "4a:fb:9d:5a:2e:17",
            "net4": "be:8f:23:46:da:ab",
            "net5": "46:5d:f9:c9:ad:af",
            "net6": "fa:8c:1f:06:3a:ce",
            "net7": "4e:df:db:5f:bb:f2"
        },
        "spine_2_1_2": {
            "net0": "52:3e:67:f2:5a:6b",
            "net1": "d2:55:1c:95:98:d7",
            "net2": "ae:32:e6:74:b0:2c",
            "net3": "d2:d4:a9:80:f2:b7",
            "net4": "ce:1e:5e:97:6a:3e",
            "net5": "1a:43:8c:8f:3f:ae",
            "net6": "16:2d:d0:3d:7e:8d",
            "net7": "12:17:c3:6d:70:5b"
        },
        "spine_2_1_3": {
            "net0": "ae:da:62:1b:eb:6b",
            "net1": "2a:80:44:5f:1d:6f",
            "net2": "ba:c6:71:22:7c:85",
            "net3": "a6:f7:ca:85:3b:c3",
            "net4": "22:df:b3:89:10:78",
            "net5": "26:8c:16:1b:66:26",
            "net6": "e2:e8:61:3b:c3:51",
            "net7": "3a:81:cb:16:a6:9b"
        },
        "spine_2_1_4": {
            "net0": "62:3d:c0:b3:bb:fb",
            "net1": "1a:43:a3:c1:e0:4f",
            "net2": "82:79:b3:7e:93:c3",
            "net3": "ae:4e:29:1b:1f:b3",
            "net4": "62:29:51:cf:6a:3b",
            "net5": "f6:7d:bc:55:e0:d4",
            "net6": "b6:2b:4c:4e:46:24",
            "net7": "52:30:2c:8e:e3:c9"
        },
        "tof_1_2_1": {
            "net0": "7e:25:82:d3:ee:b1",
            "net1": "ba:9e:1b:39:63:62",
            "net2": "26:ad:11:9a:93:13",
            "net3": "aa:34:1d:01:08:c7",
            "net4": "36:56:11:52:61:ec",
            "net5": "f6:2e:96:57:0f:c9",
            "net6": "7a:88:cf:a3:b3:4c",
            "net7": "b6:10:fc:a7:b4:44"
        },
        "tof_1_2_2": {
            "net0": "0e:40:b8:6f:68:0b",
            "net1": "56:a3:da:90:82:63",
            "net2": "b2:8e:ce:81:97:ec",
            "net3": "72:06:48:4b:61:32",
            "net4": "9e:c6:93:fa:1a:0b",
            "net5": "ea:d2:34:5a:6d:83",
            "net6": "2e:14:27:f8:ad:1f",
            "net7": "fa:cb:ba:b1:b2:3a"
        },
        "tof_1_2_3": {
            "net0": "4a:f4:e7:55:6a:20",
            "net1": "d6:08:17:ee:16:ab",
            "net2": "36:a5:0f:57:17:10",
            "net3": "62:88:59:ca:27:06",
            "net4": "86:ee:f3:9d:3e:c1",
            "net5": "4a:3f:2d:53:de:83",
            "net6": "96:b4:af:26:4a:35",
            "net7": "2a:7e:a9:6d:5e:79"
        },
        "tof_1_2_4": {
            "net0": "92:2f:24:8d:82:1d",
            "net1": "1e:56:c9:d1:a5:b6",
            "net2": "1e:27:6b:ec:dd:02",
            "net3": "be:13:41:ad:ee:27",
            "net4": "2a:e9:0c:76:46:c2",
            "net5": "f2:05:11:48:c6:3b",
            "net6": "66:f2:88:b1:85:69",
            "net7": "76:14:1c:ee:2e:3f"
        }
    },
    "failed_machine": "spine_1_1_1",
    "failure_time": {
        "leaf_1_0_1": 1636063271.7612424,
        "leaf_1_0_2": 1636063271.7722042,
        "leaf_1_0_3": 1636063271.7805495,
        "leaf_1_0_4": 1636063271.7651687,
        "leaf_2_0_1": 1636063271.7752416,
        "leaf_2_0_2": 1636063272.2364302,
        "leaf_2_0_3": 1636063272.243907,
        "leaf_2_0_4": 1636063271.804686,
        "spine_1_1_1": 1636063271.810746,
        "spine_1_1_2": 1636063272.244511,
        "spine_1_1_3": 1636063271.80594,
        "spine_1_1_4": 1636063271.8101506,
        "spine_2_1_1": 1636063271.8196146,
        "spine_2_1_2": 1636063271.832623,
        "spine_2_1_3": 1636063272.300429,
        "spine_2_1_4": 1636063271.8221266,
        "tof_1_2_1": 1636063271.8329957,
        "tof_1_2_2": 1636063271.8505135,
        "tof_1_2_3": 1636063271.8568792,
        "tof_1_2_4": 1636063271.8647764
    }
}