{
    "k_leaf": 2,
    "k_top": 2,
    "redundancy_factor": 2,
    "is_k8s": true,
    "failed_machine": "leaf_1_0_1",
    "failure_time": {
        "leaf_1_0_1": 1622456214.0462942,
        "leaf_1_0_2": 1622456214.0559592,
        "leaf_2_0_1": 1622456214.0563903,
        "leaf_2_0_2": 1622456214.0695539,
        "spine_1_1_1": 1622456214.0668266,
        "spine_1_1_2": 1622456214.0738277,
        "spine_2_1_1": 1622456214.0778031,
        "spine_2_1_2": 1622456214.0838928,
        "tof_1_2_1": 1622456214.0818648,
        "tof_1_2_2": 1622456214.0923529
    },
    "packet_count": {
        "total": [
            28,
            756
        ],
        "leaf_2_0_1": {
            "total": [
                2,
                54
            ],
            "net0": {
                "total": [
                    1,
                    27
                ],
                "withdrawn": [
                    1,
                    27
                ]
            },
            "net1": {
                "total": [
                    1,
                    27
                ],
                "withdrawn": [
                    1,
                    27
                ]
            }
        },
        "leaf_1_0_2": {
            "total": [
                2,
                54
            ],
            "net0": {
                "total": [
                    1,
                    27
                ],
                "withdrawn": [
                    1,
                    27
                ]
            },
            "net1": {
                "total": [
                    1,
                    27
                ],
                "withdrawn": [
                    1,
                    27
                ]
            }
        },
        "spine_2_1_2": {
            "total": [
                4,
                108
            ],
            "net0": {
                "total": [
                    1,
                    27
                ],
                "withdrawn": [
                    1,
                    27
                ]
            },
            "net1": {
                "total": [
                    1,
                    27
                ],
                "withdrawn": [
                    1,
                    27
                ]
            },
            "net2": {
                "total": [
                    1,
                    27
                ],
                "withdrawn": [
                    1,
                    27
                ]
            },
            "net3": {
                "total": [
                    1,
                    27
                ],
                "withdrawn": [
                    1,
                    27
                ]
            }
        },
        "tof_1_2_1": {
            "total": [
                4,
                108
            ],
            "net0": {
                "total": [
                    1,
                    27
                ],
                "withdrawn": [
                    1,
                    27
                ]
            },
            "net1": {
                "total": [
                    1,
                    27
                ],
                "withdrawn": [
                    1,
                    27
                ]
            },
            "net2": {
                "total": [
                    1,
                    27
                ],
                "withdrawn": [
                    1,
                    27
                ]
            },
            "net3": {
                "total": [
                    1,
                    27
                ],
                "withdrawn": [
                    1,
                    27
                ]
            }
        },
        "leaf_2_0_2": {
            "total": [
                2,
                54
            ],
            "net0": {
                "total": [
                    1,
                    27
                ],
                "withdrawn": [
                    1,
                    27
                ]
            },
            "net1": {
                "total": [
                    1,
                    27
                ],
                "withdrawn": [
                    1,
                    27
                ]
            }
        },
        "tof_1_2_2": {
            "total": [
                4,
                108
            ],
            "net0": {
                "total": [
                    1,
                    27
                ],
                "withdrawn": [
                    1,
                    27
                ]
            },
            "net1": {
                "total": [
                    1,
                    27
                ],
                "withdrawn": [
                    1,
                    27
                ]
            },
            "net2": {
                "total": [
                    1,
                    27
                ],
                "withdrawn": [
                    1,
                    27
                ]
            },
            "net3": {
                "total": [
                    1,
                    27
                ],
                "withdrawn": [
                    1,
                    27
                ]
            }
        },
        "spine_1_1_1": {
            "total": [
                3,
                81
            ],
            "net1": {
                "total": [
                    1,
                    27
                ],
                "withdrawn": [
                    1,
                    27
                ]
            },
            "net2": {
                "total": [
                    1,
                    27
                ],
                "withdrawn": [
                    1,
                    27
                ]
            },
            "net3": {
                "total": [
                    1,
                    27
                ],
                "withdrawn": [
                    1,
                    27
                ]
            }
        },
        "spine_2_1_1": {
            "total": [
                4,
                108
            ],
            "net0": {
                "total": [
                    1,
                    27
                ],
                "withdrawn": [
                    1,
                    27
                ]
            },
            "net1": {
                "total": [
                    1,
                    27
                ],
                "withdrawn": [
                    1,
                    27
                ]
            },
            "net2": {
                "total": [
                    1,
                    27
                ],
                "withdrawn": [
                    1,
                    27
                ]
            },
            "net3": {
                "total": [
                    1,
                    27
                ],
                "withdrawn": [
                    1,
                    27
                ]
            }
        },
        "spine_1_1_2": {
            "total": [
                3,
                81
            ],
            "net1": {
                "total": [
                    1,
                    27
                ],
                "withdrawn": [
                    1,
                    27
                ]
            },
            "net2": {
                "total": [
                    1,
                    27
                ],
                "withdrawn": [
                    1,
                    27
                ]
            },
            "net3": {
                "total": [
                    1,
                    27
                ],
                "withdrawn": [
                    1,
                    27
                ]
            }
        }
    },
    "packets_by_collision_domain": {
        "AAAG": 2,
        "AAAI": 2,
        "AAAQ": 2,
        "AAAS": 2,
        "AAAH": 2,
        "AAAJ": 2,
        "AAAR": 2,
        "AAAT": 2,
        "AAAD": 2,
        "AAAE": 2,
        "AAAK": 2,
        "AAAL": 2,
        "AAAN": 2,
        "AAAO": 2
    },
    "blast_radius": {
        "by_collision_domain": {
            "AAAE": [
                1,
                2
            ],
            "AAAI": [
                1,
                2
            ],
            "AAAJ": [
                1,
                2
            ],
            "AAAD": [
                1,
                2
            ],
            "AAAG": [
                1,
                2
            ],
            "AAAH": [
                1,
                2
            ],
            "AAAR": [
                2,
                2
            ],
            "AAAT": [
                2,
                2
            ],
            "AAAQ": [
                2,
                2
            ],
            "AAAS": [
                2,
                2
            ],
            "AAAK": [
                3,
                2
            ],
            "AAAN": [
                3,
                2
            ],
            "AAAL": [
                3,
                2
            ],
            "AAAO": [
                3,
                2
            ]
        },
        "by_distance": {
            "1": 12,
            "2": 8,
            "3": 8
        }
    },
    "radius_graph": {
        "nodes": [
            {
                "id": "leaf_1_0_1",
                "label": "leaf_1_0_1"
            },
            {
                "id": "leaf_2_0_1",
                "label": "leaf_2_0_1"
            },
            {
                "id": "tof_1_2_2",
                "label": "tof_1_2_2"
            },
            {
                "id": "tof_1_2_1",
                "label": "tof_1_2_1"
            },
            {
                "id": "spine_2_1_1",
                "label": "spine_2_1_1"
            },
            {
                "id": "spine_1_1_2",
                "label": "spine_1_1_2"
            },
            {
                "id": "leaf_2_0_2",
                "label": "leaf_2_0_2"
            },
            {
                "id": "spine_2_1_2",
                "label": "spine_2_1_2"
            },
            {
                "id": "leaf_1_0_2",
                "label": "leaf_1_0_2"
            },
            {
                "id": "spine_1_1_1",
                "label": "spine_1_1_1"
            }
        ],
        "links": [
            {
                "source": "tof_1_2_1",
                "target": "spine_1_1_1",
                "value": 2,
                "label": "AAAG"
            },
            {
                "source": "tof_1_2_1",
                "target": "spine_1_1_2",
                "value": 2,
                "label": "AAAI"
            },
            {
                "source": "tof_1_2_1",
                "target": "spine_2_1_1",
                "value": 2,
                "label": "AAAQ"
            },
            {
                "source": "tof_1_2_1",
                "target": "spine_2_1_2",
                "value": 2,
                "label": "AAAS"
            },
            {
                "source": "tof_1_2_2",
                "target": "spine_1_1_1",
                "value": 2,
                "label": "AAAH"
            },
            {
                "source": "tof_1_2_2",
                "target": "spine_1_1_2",
                "value": 2,
                "label": "AAAJ"
            },
            {
                "source": "tof_1_2_2",
                "target": "spine_2_1_1",
                "value": 2,
                "label": "AAAR"
            },
            {
                "source": "tof_1_2_2",
                "target": "spine_2_1_2",
                "value": 2,
                "label": "AAAT"
            },
            {
                "source": "leaf_1_0_1",
                "target": "spine_1_1_1",
                "value": 0,
                "label": "AAAA"
            },
            {
                "source": "leaf_1_0_1",
                "target": "spine_1_1_2",
                "value": 0,
                "label": "AAAB"
            },
            {
                "source": "leaf_1_0_2",
                "target": "spine_1_1_1",
                "value": 2,
                "label": "AAAD"
            },
            {
                "source": "leaf_1_0_2",
                "target": "spine_1_1_2",
                "value": 2,
                "label": "AAAE"
            },
            {
                "source": "spine_1_1_1",
                "target": "leaf_1_0_1",
                "value": 0,
                "label": "AAAA"
            },
            {
                "source": "spine_1_1_1",
                "target": "leaf_1_0_2",
                "value": 2,
                "label": "AAAD"
            },
            {
                "source": "spine_1_1_1",
                "target": "tof_1_2_1",
                "value": 2,
                "label": "AAAG"
            },
            {
                "source": "spine_1_1_1",
                "target": "tof_1_2_2",
                "value": 2,
                "label": "AAAH"
            },
            {
                "source": "spine_1_1_2",
                "target": "leaf_1_0_1",
                "value": 0,
                "label": "AAAB"
            },
            {
                "source": "spine_1_1_2",
                "target": "leaf_1_0_2",
                "value": 2,
                "label": "AAAE"
            },
            {
                "source": "spine_1_1_2",
                "target": "tof_1_2_1",
                "value": 2,
                "label": "AAAI"
            },
            {
                "source": "spine_1_1_2",
                "target": "tof_1_2_2",
                "value": 2,
                "label": "AAAJ"
            },
            {
                "source": "leaf_2_0_1",
                "target": "spine_2_1_1",
                "value": 2,
                "label": "AAAK"
            },
            {
                "source": "leaf_2_0_1",
                "target": "spine_2_1_2",
                "value": 2,
                "label": "AAAL"
            },
            {
                "source": "leaf_2_0_2",
                "target": "spine_2_1_1",
                "value": 2,
                "label": "AAAN"
            },
            {
                "source": "leaf_2_0_2",
                "target": "spine_2_1_2",
                "value": 2,
                "label": "AAAO"
            },
            {
                "source": "spine_2_1_1",
                "target": "leaf_2_0_1",
                "value": 2,
                "label": "AAAK"
            },
            {
                "source": "spine_2_1_1",
                "target": "leaf_2_0_2",
                "value": 2,
                "label": "AAAN"
            },
            {
                "source": "spine_2_1_1",
                "target": "tof_1_2_1",
                "value": 2,
                "label": "AAAQ"
            },
            {
                "source": "spine_2_1_1",
                "target": "tof_1_2_2",
                "value": 2,
                "label": "AAAR"
            },
            {
                "source": "spine_2_1_2",
                "target": "leaf_2_0_1",
                "value": 2,
                "label": "AAAL"
            },
            {
                "source": "spine_2_1_2",
                "target": "leaf_2_0_2",
                "value": 2,
                "label": "AAAO"
            },
            {
                "source": "spine_2_1_2",
                "target": "tof_1_2_1",
                "value": 2,
                "label": "AAAS"
            },
            {
                "source": "spine_2_1_2",
                "target": "tof_1_2_2",
                "value": 2,
                "label": "AAAT"
            }
        ]
    },
    "max_number_of_rounds": 4,
    "packets_per_round": {
        "0": 0,
        "1": 6,
        "2": 10,
        "3": 8,
        "4": 4
    },
    "round_graph": {
        "nodes": [
            {
                "id": "leaf_1_0_1",
                "label": "leaf_1_0_1"
            },
            {
                "id": "spine_1_1_1-2",
                "label": "spine_1_1_1-2"
            },
            {
                "id": "tof_1_2_1-1",
                "label": "tof_1_2_1-1"
            },
            {
                "id": "leaf_2_0_1-3",
                "label": "leaf_2_0_1-3"
            },
            {
                "id": "spine_2_1_1-2",
                "label": "spine_2_1_1-2"
            },
            {
                "id": "spine_1_1_2-2",
                "label": "spine_1_1_2-2"
            },
            {
                "id": "spine_2_1_2-4",
                "label": "spine_2_1_2-4"
            },
            {
                "id": "spine_2_1_1-4",
                "label": "spine_2_1_1-4"
            },
            {
                "id": "spine_1_1_1-0",
                "label": "spine_1_1_1-0"
            },
            {
                "id": "spine_2_1_2-2",
                "label": "spine_2_1_2-2"
            },
            {
                "id": "tof_1_2_2-1",
                "label": "tof_1_2_2-1"
            },
            {
                "id": "spine_1_1_2-0",
                "label": "spine_1_1_2-0"
            },
            {
                "id": "leaf_1_0_2-1",
                "label": "leaf_1_0_2-1"
            },
            {
                "id": "tof_1_2_2-3",
                "label": "tof_1_2_2-3"
            },
            {
                "id": "leaf_2_0_2-3",
                "label": "leaf_2_0_2-3"
            },
            {
                "id": "tof_1_2_1-3",
                "label": "tof_1_2_1-3"
            }
        ],
        "links": [
            {
                "source": "leaf_1_0_1",
                "target": "spine_1_1_1-0",
                "value": 0
            },
            {
                "source": "leaf_1_0_1",
                "target": "spine_1_1_2-0",
                "value": 0
            },
            {
                "source": "spine_1_1_1-0",
                "target": "leaf_1_0_2-1",
                "value": 1,
                "label": [
                    {
                        "time": 1622456215.896083,
                        "type": "Update (WD)",
                        "WD Routes": "200.0.0.0/24"
                    }
                ]
            },
            {
                "source": "spine_1_1_1-0",
                "target": "tof_1_2_1-1",
                "value": 1,
                "label": [
                    {
                        "time": 1622456215.896206,
                        "type": "Update (WD)",
                        "WD Routes": "200.0.0.0/24"
                    }
                ]
            },
            {
                "source": "spine_1_1_1-0",
                "target": "tof_1_2_2-1",
                "value": 1,
                "label": [
                    {
                        "time": 1622456215.896259,
                        "type": "Update (WD)",
                        "WD Routes": "200.0.0.0/24"
                    }
                ]
            },
            {
                "source": "spine_1_1_2-0",
                "target": "leaf_1_0_2-1",
                "value": 1,
                "label": [
                    {
                        "time": 1622456215.896117,
                        "type": "Update (WD)",
                        "WD Routes": "200.0.0.0/24"
                    }
                ]
            },
            {
                "source": "spine_1_1_2-0",
                "target": "tof_1_2_1-1",
                "value": 1,
                "label": [
                    {
                        "time": 1622456215.896224,
                        "type": "Update (WD)",
                        "WD Routes": "200.0.0.0/24"
                    }
                ]
            },
            {
                "source": "spine_1_1_2-0",
                "target": "tof_1_2_2-1",
                "value": 1,
                "label": [
                    {
                        "time": 1622456215.896254,
                        "type": "Update (WD)",
                        "WD Routes": "200.0.0.0/24"
                    }
                ]
            },
            {
                "source": "leaf_1_0_2-1",
                "target": "spine_1_1_1-2",
                "value": 1,
                "label": [
                    {
                        "time": 1622456215.946778,
                        "type": "Update (WD)",
                        "WD Routes": "200.0.0.0/24"
                    }
                ]
            },
            {
                "source": "leaf_1_0_2-1",
                "target": "spine_1_1_2-2",
                "value": 1,
                "label": [
                    {
                        "time": 1622456215.946928,
                        "type": "Update (WD)",
                        "WD Routes": "200.0.0.0/24"
                    }
                ]
            },
            {
                "source": "tof_1_2_1-1",
                "target": "spine_1_1_1-2",
                "value": 1,
                "label": [
                    {
                        "time": 1622456215.947012,
                        "type": "Update (WD)",
                        "WD Routes": "200.0.0.0/24"
                    }
                ]
            },
            {
                "source": "tof_1_2_1-1",
                "target": "spine_1_1_2-2",
                "value": 1,
                "label": [
                    {
                        "time": 1622456215.947165,
                        "type": "Update (WD)",
                        "WD Routes": "200.0.0.0/24"
                    }
                ]
            },
            {
                "source": "tof_1_2_1-1",
                "target": "spine_2_1_1-2",
                "value": 1,
                "label": [
                    {
                        "time": 1622456215.947254,
                        "type": "Update (WD)",
                        "WD Routes": "200.0.0.0/24"
                    }
                ]
            },
            {
                "source": "tof_1_2_1-1",
                "target": "spine_2_1_2-2",
                "value": 1,
                "label": [
                    {
                        "time": 1622456215.947293,
                        "type": "Update (WD)",
                        "WD Routes": "200.0.0.0/24"
                    }
                ]
            },
            {
                "source": "tof_1_2_2-1",
                "target": "spine_1_1_1-2",
                "value": 1,
                "label": [
                    {
                        "time": 1622456215.947,
                        "type": "Update (WD)",
                        "WD Routes": "200.0.0.0/24"
                    }
                ]
            },
            {
                "source": "tof_1_2_2-1",
                "target": "spine_2_1_2-2",
                "value": 1,
                "label": [
                    {
                        "time": 1622456215.947123,
                        "type": "Update (WD)",
                        "WD Routes": "200.0.0.0/24"
                    }
                ]
            },
            {
                "source": "tof_1_2_2-1",
                "target": "spine_1_1_2-2",
                "value": 1,
                "label": [
                    {
                        "time": 1622456215.947186,
                        "type": "Update (WD)",
                        "WD Routes": "200.0.0.0/24"
                    }
                ]
            },
            {
                "source": "tof_1_2_2-1",
                "target": "spine_2_1_1-2",
                "value": 1,
                "label": [
                    {
                        "time": 1622456215.947254,
                        "type": "Update (WD)",
                        "WD Routes": "200.0.0.0/24"
                    }
                ]
            },
            {
                "source": "spine_2_1_1-2",
                "target": "leaf_2_0_1-3",
                "value": 1,
                "label": [
                    {
                        "time": 1622456215.997817,
                        "type": "Update (WD)",
                        "WD Routes": "200.0.0.0/24"
                    }
                ]
            },
            {
                "source": "spine_2_1_1-2",
                "target": "leaf_2_0_2-3",
                "value": 1,
                "label": [
                    {
                        "time": 1622456215.9979,
                        "type": "Update (WD)",
                        "WD Routes": "200.0.0.0/24"
                    }
                ]
            },
            {
                "source": "spine_2_1_1-2",
                "target": "tof_1_2_1-3",
                "value": 1,
                "label": [
                    {
                        "time": 1622456215.99793,
                        "type": "Update (WD)",
                        "WD Routes": "200.0.0.0/24"
                    }
                ]
            },
            {
                "source": "spine_2_1_1-2",
                "target": "tof_1_2_2-3",
                "value": 1,
                "label": [
                    {
                        "time": 1622456215.997954,
                        "type": "Update (WD)",
                        "WD Routes": "200.0.0.0/24"
                    }
                ]
            },
            {
                "source": "spine_2_1_2-2",
                "target": "leaf_2_0_1-3",
                "value": 1,
                "label": [
                    {
                        "time": 1622456215.997724,
                        "type": "Update (WD)",
                        "WD Routes": "200.0.0.0/24"
                    }
                ]
            },
            {
                "source": "spine_2_1_2-2",
                "target": "leaf_2_0_2-3",
                "value": 1,
                "label": [
                    {
                        "time": 1622456215.997812,
                        "type": "Update (WD)",
                        "WD Routes": "200.0.0.0/24"
                    }
                ]
            },
            {
                "source": "spine_2_1_2-2",
                "target": "tof_1_2_1-3",
                "value": 1,
                "label": [
                    {
                        "time": 1622456215.997837,
                        "type": "Update (WD)",
                        "WD Routes": "200.0.0.0/24"
                    }
                ]
            },
            {
                "source": "spine_2_1_2-2",
                "target": "tof_1_2_2-3",
                "value": 1,
                "label": [
                    {
                        "time": 1622456215.997859,
                        "type": "Update (WD)",
                        "WD Routes": "200.0.0.0/24"
                    }
                ]
            },
            {
                "source": "leaf_2_0_1-3",
                "target": "spine_2_1_1-4",
                "value": 1,
                "label": [
                    {
                        "time": 1622456216.048927,
                        "type": "Update (WD)",
                        "WD Routes": "200.0.0.0/24"
                    }
                ]
            },
            {
                "source": "leaf_2_0_1-3",
                "target": "spine_2_1_2-4",
                "value": 1,
                "label": [
                    {
                        "time": 1622456216.049064,
                        "type": "Update (WD)",
                        "WD Routes": "200.0.0.0/24"
                    }
                ]
            },
            {
                "source": "leaf_2_0_2-3",
                "target": "spine_2_1_1-4",
                "value": 1,
                "label": [
                    {
                        "time": 1622456216.048626,
                        "type": "Update (WD)",
                        "WD Routes": "200.0.0.0/24"
                    }
                ]
            },
            {
                "source": "leaf_2_0_2-3",
                "target": "spine_2_1_2-4",
                "value": 1,
                "label": [
                    {
                        "time": 1622456216.048677,
                        "type": "Update (WD)",
                        "WD Routes": "200.0.0.0/24"
                    }
                ]
            }
        ]
    },
    "logical_time_plot": {
        "points": {
            "spine_1_1_1": {
                "1": {
                    "time": 1622456215.896083,
                    "type": "Update (WD)",
                    "WD Routes": "200.0.0.0/24",
                    "Logical Clock": 1
                },
                "2": {
                    "time": 1622456215.896206,
                    "type": "Update (WD)",
                    "WD Routes": "200.0.0.0/24",
                    "Logical Clock": 2
                },
                "3": {
                    "time": 1622456215.896259,
                    "type": "Update (WD)",
                    "WD Routes": "200.0.0.0/24",
                    "Logical Clock": 3
                },
                "5": {
                    "time": 1622456215.947075,
                    "type": "Update (WD)",
                    "WD Routes": "200.0.0.0/24",
                    "Logical Clock": 5
                },
                "6": {
                    "time": 1622456215.947115,
                    "type": "Update (WD)",
                    "WD Routes": "200.0.0.0/24",
                    "Logical Clock": 6
                },
                "7": {
                    "time": 1622456215.94717,
                    "type": "Update (WD)",
                    "WD Routes": "200.0.0.0/24",
                    "Logical Clock": 7
                }
            },
            "leaf_1_0_2": {
                "2": {
                    "time": 1622456215.896337,
                    "type": "Update (WD)",
                    "WD Routes": "200.0.0.0/24",
                    "Logical Clock": 2
                },
                "3": {
                    "time": 1622456215.896269,
                    "type": "Update (WD)",
                    "WD Routes": "200.0.0.0/24",
                    "Logical Clock": 3
                },
                "4": {
                    "time": 1622456215.946778,
                    "type": "Update (WD)",
                    "WD Routes": "200.0.0.0/24",
                    "Logical Clock": 4
                },
                "5": {
                    "time": 1622456215.946928,
                    "type": "Update (WD)",
                    "WD Routes": "200.0.0.0/24",
                    "Logical Clock": 5
                }
            },
            "tof_1_2_1": {
                "3": {
                    "time": 1622456215.896493,
                    "type": "Update (WD)",
                    "WD Routes": "200.0.0.0/24",
                    "Logical Clock": 3
                },
                "4": {
                    "time": 1622456215.896457,
                    "type": "Update (WD)",
                    "WD Routes": "200.0.0.0/24",
                    "Logical Clock": 4
                },
                "5": {
                    "time": 1622456215.947012,
                    "type": "Update (WD)",
                    "WD Routes": "200.0.0.0/24",
                    "Logical Clock": 5
                },
                "6": {
                    "time": 1622456215.947165,
                    "type": "Update (WD)",
                    "WD Routes": "200.0.0.0/24",
                    "Logical Clock": 6
                },
                "7": {
                    "time": 1622456215.947254,
                    "type": "Update (WD)",
                    "WD Routes": "200.0.0.0/24",
                    "Logical Clock": 7
                },
                "8": {
                    "time": 1622456215.947293,
                    "type": "Update (WD)",
                    "WD Routes": "200.0.0.0/24",
                    "Logical Clock": 8
                },
                "14": {
                    "time": 1622456215.998283,
                    "type": "Update (WD)",
                    "WD Routes": "200.0.0.0/24",
                    "Logical Clock": 14
                },
                "15": {
                    "time": 1622456215.998283,
                    "type": "Update (WD)",
                    "WD Routes": "200.0.0.0/24",
                    "Logical Clock": 15
                }
            },
            "tof_1_2_2": {
                "4": {
                    "time": 1622456215.896488,
                    "type": "Update (WD)",
                    "WD Routes": "200.0.0.0/24",
                    "Logical Clock": 4
                },
                "5": {
                    "time": 1622456215.896461,
                    "type": "Update (WD)",
                    "WD Routes": "200.0.0.0/24",
                    "Logical Clock": 5
                },
                "6": {
                    "time": 1622456215.947,
                    "type": "Update (WD)",
                    "WD Routes": "200.0.0.0/24",
                    "Logical Clock": 6
                },
                "7": {
                    "time": 1622456215.947123,
                    "type": "Update (WD)",
                    "WD Routes": "200.0.0.0/24",
                    "Logical Clock": 7
                },
                "8": {
                    "time": 1622456215.947186,
                    "type": "Update (WD)",
                    "WD Routes": "200.0.0.0/24",
                    "Logical Clock": 8
                },
                "9": {
                    "time": 1622456215.947254,
                    "type": "Update (WD)",
                    "WD Routes": "200.0.0.0/24",
                    "Logical Clock": 9
                },
                "15": {
                    "time": 1622456215.998236,
                    "type": "Update (WD)",
                    "WD Routes": "200.0.0.0/24",
                    "Logical Clock": 15
                },
                "16": {
                    "time": 1622456215.998214,
                    "type": "Update (WD)",
                    "WD Routes": "200.0.0.0/24",
                    "Logical Clock": 16
                }
            },
            "spine_1_1_2": {
                "1": {
                    "time": 1622456215.896117,
                    "type": "Update (WD)",
                    "WD Routes": "200.0.0.0/24",
                    "Logical Clock": 1
                },
                "2": {
                    "time": 1622456215.896224,
                    "type": "Update (WD)",
                    "WD Routes": "200.0.0.0/24",
                    "Logical Clock": 2
                },
                "3": {
                    "time": 1622456215.896254,
                    "type": "Update (WD)",
                    "WD Routes": "200.0.0.0/24",
                    "Logical Clock": 3
                },
                "6": {
                    "time": 1622456215.947264,
                    "type": "Update (WD)",
                    "WD Routes": "200.0.0.0/24",
                    "Logical Clock": 6
                },
                "7": {
                    "time": 1622456215.947465,
                    "type": "Update (WD)",
                    "WD Routes": "200.0.0.0/24",
                    "Logical Clock": 7
                },
                "9": {
                    "time": 1622456215.947505,
                    "type": "Update (WD)",
                    "WD Routes": "200.0.0.0/24",
                    "Logical Clock": 9
                }
            },
            "spine_2_1_1": {
                "8": {
                    "time": 1622456215.947444,
                    "type": "Update (WD)",
                    "WD Routes": "200.0.0.0/24",
                    "Logical Clock": 8
                },
                "10": {
                    "time": 1622456215.947391,
                    "type": "Update (WD)",
                    "WD Routes": "200.0.0.0/24",
                    "Logical Clock": 10
                },
                "11": {
                    "time": 1622456215.997817,
                    "type": "Update (WD)",
                    "WD Routes": "200.0.0.0/24",
                    "Logical Clock": 11
                },
                "12": {
                    "time": 1622456215.9979,
                    "type": "Update (WD)",
                    "WD Routes": "200.0.0.0/24",
                    "Logical Clock": 12
                },
                "13": {
                    "time": 1622456215.99793,
                    "type": "Update (WD)",
                    "WD Routes": "200.0.0.0/24",
                    "Logical Clock": 13
                },
                "14": {
                    "time": 1622456215.997954,
                    "type": "Update (WD)",
                    "WD Routes": "200.0.0.0/24",
                    "Logical Clock": 14
                },
                "15": {
                    "time": 1622456216.049078,
                    "type": "Update (WD)",
                    "WD Routes": "200.0.0.0/24",
                    "Logical Clock": 15
                },
                "16": {
                    "time": 1622456216.048882,
                    "type": "Update (WD)",
                    "WD Routes": "200.0.0.0/24",
                    "Logical Clock": 16
                }
            },
            "spine_2_1_2": {
                "9": {
                    "time": 1622456215.947374,
                    "type": "Update (WD)",
                    "WD Routes": "200.0.0.0/24",
                    "Logical Clock": 9
                },
                "10": {
                    "time": 1622456215.947174,
                    "type": "Update (WD)",
                    "WD Routes": "200.0.0.0/24",
                    "Logical Clock": 10
                },
                "11": {
                    "time": 1622456215.997724,
                    "type": "Update (WD)",
                    "WD Routes": "200.0.0.0/24",
                    "Logical Clock": 11
                },
                "12": {
                    "time": 1622456215.997812,
                    "type": "Update (WD)",
                    "WD Routes": "200.0.0.0/24",
                    "Logical Clock": 12
                },
                "13": {
                    "time": 1622456215.997837,
                    "type": "Update (WD)",
                    "WD Routes": "200.0.0.0/24",
                    "Logical Clock": 13
                },
                "14": {
                    "time": 1622456215.997859,
                    "type": "Update (WD)",
                    "WD Routes": "200.0.0.0/24",
                    "Logical Clock": 14
                },
                "16": {
                    "time": 1622456216.049114,
                    "type": "Update (WD)",
                    "WD Routes": "200.0.0.0/24",
                    "Logical Clock": 16
                },
                "17": {
                    "time": 1622456216.048761,
                    "type": "Update (WD)",
                    "WD Routes": "200.0.0.0/24",
                    "Logical Clock": 17
                }
            },
            "leaf_2_0_1": {
                "12": {
                    "time": 1622456215.998328,
                    "type": "Update (WD)",
                    "WD Routes": "200.0.0.0/24",
                    "Logical Clock": 12
                },
                "13": {
                    "time": 1622456215.998327,
                    "type": "Update (WD)",
                    "WD Routes": "200.0.0.0/24",
                    "Logical Clock": 13
                },
                "14": {
                    "time": 1622456216.048927,
                    "type": "Update (WD)",
                    "WD Routes": "200.0.0.0/24",
                    "Logical Clock": 14
                },
                "15": {
                    "time": 1622456216.049064,
                    "type": "Update (WD)",
                    "WD Routes": "200.0.0.0/24",
                    "Logical Clock": 15
                }
            },
            "leaf_2_0_2": {
                "13": {
                    "time": 1622456215.998284,
                    "type": "Update (WD)",
                    "WD Routes": "200.0.0.0/24",
                    "Logical Clock": 13
                },
                "14": {
                    "time": 1622456215.998226,
                    "type": "Update (WD)",
                    "WD Routes": "200.0.0.0/24",
                    "Logical Clock": 14
                },
                "15": {
                    "time": 1622456216.048626,
                    "type": "Update (WD)",
                    "WD Routes": "200.0.0.0/24",
                    "Logical Clock": 15
                },
                "16": {
                    "time": 1622456216.048677,
                    "type": "Update (WD)",
                    "WD Routes": "200.0.0.0/24",
                    "Logical Clock": 16
                }
            }
        },
        "edges": [
            [
                [
                    "spine_1_1_1",
                    1
                ],
                [
                    "leaf_1_0_2",
                    2
                ]
            ],
            [
                [
                    "spine_1_1_1",
                    2
                ],
                [
                    "tof_1_2_1",
                    3
                ]
            ],
            [
                [
                    "spine_1_1_1",
                    3
                ],
                [
                    "tof_1_2_2",
                    4
                ]
            ],
            [
                [
                    "spine_1_1_2",
                    1
                ],
                [
                    "leaf_1_0_2",
                    3
                ]
            ],
            [
                [
                    "spine_1_1_2",
                    2
                ],
                [
                    "tof_1_2_1",
                    4
                ]
            ],
            [
                [
                    "spine_1_1_2",
                    3
                ],
                [
                    "tof_1_2_2",
                    5
                ]
            ],
            [
                [
                    "leaf_1_0_2",
                    4
                ],
                [
                    "spine_1_1_1",
                    5
                ]
            ],
            [
                [
                    "leaf_1_0_2",
                    5
                ],
                [
                    "spine_1_1_2",
                    6
                ]
            ],
            [
                [
                    "tof_1_2_1",
                    5
                ],
                [
                    "spine_1_1_1",
                    6
                ]
            ],
            [
                [
                    "tof_1_2_1",
                    6
                ],
                [
                    "spine_1_1_2",
                    7
                ]
            ],
            [
                [
                    "tof_1_2_1",
                    7
                ],
                [
                    "spine_2_1_1",
                    8
                ]
            ],
            [
                [
                    "tof_1_2_1",
                    8
                ],
                [
                    "spine_2_1_2",
                    9
                ]
            ],
            [
                [
                    "tof_1_2_2",
                    6
                ],
                [
                    "spine_1_1_1",
                    7
                ]
            ],
            [
                [
                    "tof_1_2_2",
                    7
                ],
                [
                    "spine_2_1_2",
                    10
                ]
            ],
            [
                [
                    "tof_1_2_2",
                    8
                ],
                [
                    "spine_1_1_2",
                    9
                ]
            ],
            [
                [
                    "tof_1_2_2",
                    9
                ],
                [
                    "spine_2_1_1",
                    10
                ]
            ],
            [
                [
                    "spine_2_1_1",
                    11
                ],
                [
                    "leaf_2_0_1",
                    12
                ]
            ],
            [
                [
                    "spine_2_1_1",
                    12
                ],
                [
                    "leaf_2_0_2",
                    13
                ]
            ],
            [
                [
                    "spine_2_1_1",
                    13
                ],
                [
                    "tof_1_2_1",
                    14
                ]
            ],
            [
                [
                    "spine_2_1_1",
                    14
                ],
                [
                    "tof_1_2_2",
                    15
                ]
            ],
            [
                [
                    "spine_2_1_2",
                    11
                ],
                [
                    "leaf_2_0_1",
                    13
                ]
            ],
            [
                [
                    "spine_2_1_2",
                    12
                ],
                [
                    "leaf_2_0_2",
                    14
                ]
            ],
            [
                [
                    "spine_2_1_2",
                    13
                ],
                [
                    "tof_1_2_1",
                    15
                ]
            ],
            [
                [
                    "spine_2_1_2",
                    14
                ],
                [
                    "tof_1_2_2",
                    16
                ]
            ],
            [
                [
                    "leaf_2_0_1",
                    14
                ],
                [
                    "spine_2_1_1",
                    15
                ]
            ],
            [
                [
                    "leaf_2_0_1",
                    15
                ],
                [
                    "spine_2_1_2",
                    16
                ]
            ],
            [
                [
                    "leaf_2_0_2",
                    15
                ],
                [
                    "spine_2_1_1",
                    16
                ]
            ],
            [
                [
                    "leaf_2_0_2",
                    16
                ],
                [
                    "spine_2_1_2",
                    17
                ]
            ]
        ]
    },
    "max_scalar_clock": 17
}