{
    "k_leaf": 4,
    "k_top": 4,
    "redundancy_factor": 2,
    "is_k8s": true,
    "machine_mac_addresses": {
        "leaf_1_0_1": {
            "net0": "a6:3c:9c:d7:b3:3f",
            "net1": "da:28:d9:af:fc:c9",
            "net2": "16:f5:77:09:b3:29",
            "net3": "c2:6e:d2:3a:12:07",
            "net4": "26:bb:8d:99:21:dd"
        },
        "leaf_1_0_2": {
            "net0": "ae:d9:71:95:0e:c0",
            "net1": "ca:82:09:20:10:f8",
            "net2": "ea:48:2b:d2:39:b8",
            "net3": "ea:d3:6a:71:24:11",
            "net4": "0e:e3:7d:fb:3c:19"
        },
        "leaf_1_0_3": {
            "net0": "4e:00:40:14:93:6b",
            "net1": "06:ee:f4:44:f7:cf",
            "net2": "c2:ba:42:1e:b0:f4",
            "net3": "5a:e3:d2:0f:48:c3",
            "net4": "56:b3:b3:5a:70:e5"
        },
        "leaf_1_0_4": {
            "net0": "06:13:df:b8:e8:b7",
            "net1": "2e:d3:4d:0f:d2:c8",
            "net2": "be:e7:64:05:47:59",
            "net3": "de:f1:91:c3:e8:cd",
            "net4": "3e:74:f7:53:f0:08"
        },
        "leaf_2_0_1": {
            "net0": "ae:9c:47:92:0b:8e",
            "net1": "2e:02:ea:8e:be:dc",
            "net2": "a6:86:6f:be:b7:75",
            "net3": "5a:0f:c7:7c:23:ad",
            "net4": "32:58:99:bd:6e:23"
        },
        "leaf_2_0_2": {
            "net0": "fe:da:b3:e7:dc:4f",
            "net1": "52:38:33:c8:f4:a1",
            "net2": "12:9c:8c:b9:55:95",
            "net3": "12:c7:bf:b0:03:fa",
            "net4": "16:5d:16:f9:bd:54"
        },
        "leaf_2_0_3": {
            "net0": "6e:e3:94:83:f2:54",
            "net1": "96:5b:68:31:31:b5",
            "net2": "26:e8:84:72:4a:fc",
            "net3": "0a:74:01:7b:1e:43",
            "net4": "3a:5b:a8:55:a4:98"
        },
        "leaf_2_0_4": {
            "net0": "ca:e8:52:fc:a0:79",
            "net1": "ee:34:a4:bd:c8:53",
            "net2": "ba:a4:ff:8e:b8:8c",
            "net3": "36:9d:1f:86:19:d6",
            "net4": "f6:8d:e6:31:fc:5c"
        },
        "leaf_3_0_1": {
            "net0": "96:b6:4e:f5:e5:e5",
            "net1": "f2:00:b7:67:09:70",
            "net2": "16:d8:9c:e5:07:4d",
            "net3": "fe:fc:94:2c:60:74",
            "net4": "5a:a4:f7:85:6e:4a"
        },
        "leaf_3_0_2": {
            "net0": "8e:33:88:5c:4c:a3",
            "net1": "9e:3d:ca:e6:8b:4e",
            "net2": "fa:82:f9:64:45:20",
            "net3": "96:c2:cb:b3:92:7f",
            "net4": "22:fe:de:27:97:d5"
        },
        "leaf_3_0_3": {
            "net0": "de:76:fc:98:a3:25",
            "net1": "36:9a:4c:ff:dc:ff",
            "net2": "f6:16:68:98:31:ee",
            "net3": "e2:d2:1a:55:65:b1",
            "net4": "6a:18:bb:95:e0:7f"
        },
        "leaf_3_0_4": {
            "net0": "02:db:c1:e4:29:73",
            "net1": "5a:11:1a:83:ab:d2",
            "net2": "aa:60:09:34:86:c7",
            "net3": "e6:91:ab:57:dd:be",
            "net4": "1a:8b:27:42:d5:fa"
        },
        "leaf_4_0_1": {
            "net0": "22:cc:bc:91:02:07",
            "net1": "fa:4a:60:fd:5a:4c",
            "net2": "e2:a6:f6:65:6f:b6",
            "net3": "c6:d5:f0:4e:a8:4e",
            "net4": "2e:ca:a8:d8:1e:a4"
        },
        "leaf_4_0_2": {
            "net0": "1a:c6:a2:71:98:2a",
            "net1": "76:01:d4:22:9c:8f",
            "net2": "ea:b3:06:e7:c1:fc",
            "net3": "6e:96:ab:4f:43:bf",
            "net4": "d2:95:37:af:9a:7e"
        },
        "leaf_4_0_3": {
            "net0": "7a:fd:ed:40:3f:80",
            "net1": "06:06:d7:b4:cf:b8",
            "net2": "aa:83:00:0f:39:cc",
            "net3": "16:e4:da:e3:cc:96",
            "net4": "be:49:dc:a7:1b:e5"
        },
        "leaf_4_0_4": {
            "net0": "26:7b:f2:73:ea:bb",
            "net1": "e6:4c:1a:72:b1:f9",
            "net2": "8e:66:ce:57:9d:1b",
            "net3": "fa:ec:6c:5c:d6:6a",
            "net4": "12:5b:96:d4:b3:d3"
        },
        "spine_1_1_1": {
            "net0": "9e:ce:e0:6e:ae:0d",
            "net1": "9a:12:65:80:e6:d0",
            "net2": "ea:b2:ca:f8:ec:f8",
            "net3": "fa:b0:c5:fb:00:f4",
            "net4": "46:3f:01:3a:9e:1d",
            "net5": "0e:8e:78:54:eb:ef",
            "net6": "16:f4:1f:cf:a6:1b",
            "net7": "12:b5:1a:cf:be:c4"
        },
        "spine_1_1_2": {
            "net0": "ea:89:de:18:18:11",
            "net1": "3a:d3:35:e5:1b:5a",
            "net2": "7a:86:8c:ef:a5:03",
            "net3": "f2:b7:f5:d9:91:29",
            "net4": "6e:7f:61:42:41:d5",
            "net5": "7e:b8:84:84:78:86",
            "net6": "6a:6f:e9:db:63:d7",
            "net7": "26:55:fe:0f:63:ee"
        },
        "spine_1_1_3": {
            "net0": "d2:6a:6a:5c:fa:af",
            "net1": "0a:46:eb:35:ec:2d",
            "net2": "4e:90:f4:78:8c:6c",
            "net3": "9a:3b:99:0d:ad:97",
            "net4": "42:3f:7b:90:4f:63",
            "net5": "72:45:85:34:e7:3f",
            "net6": "8e:57:b4:e1:b9:30",
            "net7": "52:0a:8e:05:f1:ab"
        },
        "spine_1_1_4": {
            "net0": "a2:b1:2b:27:fa:65",
            "net1": "c2:00:1a:d2:83:c3",
            "net2": "ea:8c:88:86:06:24",
            "net3": "0e:9e:bf:69:10:24",
            "net4": "9e:d9:d1:32:0a:ab",
            "net5": "c6:cc:98:f0:77:29",
            "net6": "ea:e7:60:4f:db:f6",
            "net7": "06:42:3b:f3:b6:5e"
        },
        "spine_2_1_1": {
            "net0": "5a:5d:36:06:52:2e",
            "net1": "9a:93:15:6b:e2:7d",
            "net2": "fa:41:f7:6e:0e:88",
            "net3": "aa:2d:14:ff:7e:2e",
            "net4": "1e:49:32:5c:bd:61",
            "net5": "8a:5e:2f:8c:aa:b5",
            "net6": "8e:c2:b2:9b:fa:b3",
            "net7": "12:24:7a:cf:97:56"
        },
        "spine_2_1_2": {
            "net0": "46:53:01:c7:2c:b8",
            "net1": "e2:b7:32:a3:fc:4e",
            "net2": "c6:1d:fa:16:ee:b3",
            "net3": "ce:76:64:d3:af:30",
            "net4": "82:90:98:76:c1:81",
            "net5": "fe:87:c4:c1:0f:e7",
            "net6": "1a:ae:9a:99:59:9c",
            "net7": "82:dc:48:02:78:cc"
        },
        "spine_2_1_3": {
            "net0": "7e:71:c4:d7:51:2c",
            "net1": "56:35:10:d9:7f:a6",
            "net2": "de:b1:e8:7b:15:1e",
            "net3": "5e:2d:5d:ea:8c:bb",
            "net4": "ea:d8:b0:c5:c4:c1",
            "net5": "0a:65:ef:88:fd:b5",
            "net6": "a2:3b:d6:58:c4:6c",
            "net7": "ae:d7:ad:bc:9d:b4"
        },
        "spine_2_1_4": {
            "net0": "ba:f4:22:cc:51:d9",
            "net1": "b2:c7:e3:4b:cf:e0",
            "net2": "4a:61:cb:68:e0:0a",
            "net3": "b2:14:f2:44:fe:e4",
            "net4": "62:83:1f:d4:0b:7b",
            "net5": "e6:ae:d6:2d:0b:63",
            "net6": "7a:5e:17:bd:9b:aa",
            "net7": "ea:80:54:42:44:e2"
        },
        "spine_3_1_1": {
            "net0": "42:b8:81:91:32:7e",
            "net1": "26:68:f7:59:68:0c",
            "net2": "92:74:1b:64:71:c6",
            "net3": "fa:c1:5f:af:25:77",
            "net4": "42:ab:aa:0b:5b:64",
            "net5": "22:c4:28:9e:8a:07",
            "net6": "c2:99:b3:41:ef:e0",
            "net7": "22:a8:4c:4c:1c:04"
        },
        "spine_3_1_2": {
            "net0": "66:33:bb:98:49:1d",
            "net1": "82:a4:75:10:e1:4d",
            "net2": "9a:35:f4:52:ec:d4",
            "net3": "6a:23:90:d9:96:98",
            "net4": "c6:cf:aa:d7:15:52",
            "net5": "5e:75:e8:0d:bb:90",
            "net6": "7e:aa:60:32:82:29",
            "net7": "2a:a6:dd:bc:d3:4e"
        },
        "spine_3_1_3": {
            "net0": "8e:34:c2:b2:64:60",
            "net1": "b2:57:63:b2:50:75",
            "net2": "46:91:c6:e5:07:f9",
            "net3": "0e:2f:a4:09:79:66",
            "net4": "f6:c4:9f:09:8b:01",
            "net5": "2e:e5:98:7a:07:72",
            "net6": "fe:20:fc:22:c6:47",
            "net7": "7a:e0:15:9d:07:ae"
        },
        "spine_3_1_4": {
            "net0": "3e:3d:bf:6a:73:f1",
            "net1": "36:16:09:69:ea:82",
            "net2": "b6:7b:0d:74:dc:b7",
            "net3": "e6:94:d6:75:fd:f9",
            "net4": "96:e6:71:50:41:50",
            "net5": "a6:f8:5e:66:fc:d3",
            "net6": "de:bf:24:b3:6a:5d",
            "net7": "06:45:63:3e:de:40"
        },
        "spine_4_1_1": {
            "net0": "5e:82:b0:7e:8e:2a",
            "net1": "a2:7e:a2:1f:b5:ec",
            "net2": "66:46:b8:fc:3c:bf",
            "net3": "d2:90:0c:41:df:37",
            "net4": "e2:78:57:b9:29:1c",
            "net5": "66:af:c6:65:e0:72",
            "net6": "3e:1a:af:c7:89:be",
            "net7": "8e:7e:fa:c5:d6:5c"
        },
        "spine_4_1_2": {
            "net0": "5e:f9:37:9e:1a:3e",
            "net1": "6e:73:ff:86:8f:89",
            "net2": "96:f8:ba:8a:02:47",
            "net3": "fa:81:cb:bd:d0:fa",
            "net4": "22:fe:4a:1f:24:31",
            "net5": "ee:93:20:f9:42:99",
            "net6": "72:8b:34:7d:6d:f9",
            "net7": "fe:8a:3f:3b:3d:65"
        },
        "spine_4_1_3": {
            "net0": "9a:35:68:9e:aa:0b",
            "net1": "32:36:1d:0c:68:76",
            "net2": "ae:06:9c:4b:c9:3b",
            "net3": "36:d3:72:ea:77:84",
            "net4": "4e:6a:15:78:1d:08",
            "net5": "8e:69:89:26:18:df",
            "net6": "12:66:b7:25:2a:a4",
            "net7": "de:d1:94:ab:f7:08"
        },
        "spine_4_1_4": {
            "net0": "06:8c:c3:f5:41:46",
            "net1": "fa:af:74:66:65:a6",
            "net2": "7e:71:65:f7:3e:89",
            "net3": "ca:ef:bb:c0:a7:79",
            "net4": "c6:08:d4:d6:10:1f",
            "net5": "c6:b1:e9:c0:40:36",
            "net6": "02:b4:00:04:5f:b2",
            "net7": "26:bc:6f:23:7c:d7"
        },
        "tof_1_2_1": {
            "net0": "9e:d9:71:70:33:6b",
            "net1": "ba:be:82:8a:75:a3",
            "net2": "b2:10:f3:c7:3c:05",
            "net3": "86:ed:94:d9:20:01",
            "net4": "1e:23:96:c1:fd:f1",
            "net5": "ea:a5:0d:20:89:2a",
            "net6": "fe:2c:03:65:a9:cd",
            "net7": "02:fb:06:56:d1:66"
        },
        "tof_1_2_2": {
            "net0": "da:31:54:ee:85:d4",
            "net1": "be:d5:58:ed:2c:e1",
            "net2": "ae:d9:f9:b8:32:0f",
            "net3": "2e:93:d2:68:b0:25",
            "net4": "2a:79:1b:f8:1b:3c",
            "net5": "fe:18:af:fe:47:ea",
            "net6": "92:96:97:56:f5:b3",
            "net7": "46:0a:77:0a:09:79"
        },
        "tof_1_2_3": {
            "net0": "72:dc:e3:83:ff:00",
            "net1": "72:62:1f:d6:17:f0",
            "net2": "02:99:d7:b2:48:69",
            "net3": "32:9a:8e:3c:2e:58",
            "net4": "fe:de:c0:09:86:bb",
            "net5": "a2:b8:85:7b:3f:05",
            "net6": "32:6d:5e:d9:12:63",
            "net7": "12:64:be:e4:06:6c"
        },
        "tof_1_2_4": {
            "net0": "ee:88:d5:0b:c7:58",
            "net1": "46:9f:a2:3e:63:86",
            "net2": "72:5b:0f:c6:6f:0e",
            "net3": "46:ff:8a:3b:00:2f",
            "net4": "8a:3a:fd:4b:ea:49",
            "net5": "4e:e2:45:bd:0f:61",
            "net6": "a6:0f:57:f0:cf:93",
            "net7": "76:b3:2f:74:e8:99"
        },
        "tof_2_2_1": {
            "net0": "e2:99:9d:c7:a3:86",
            "net1": "36:fa:f0:88:e4:78",
            "net2": "9a:98:93:6f:56:82",
            "net3": "86:b0:86:a7:b7:b4",
            "net4": "36:13:ea:12:61:cd",
            "net5": "36:a1:2a:ed:4e:fd",
            "net6": "72:f7:f9:ee:9a:1f",
            "net7": "4e:96:4b:4f:33:6a"
        },
        "tof_2_2_2": {
            "net0": "ba:61:65:4f:7f:23",
            "net1": "26:ae:b6:23:55:16",
            "net2": "86:ce:a0:0d:a6:f8",
            "net3": "ae:0b:dd:07:03:af",
            "net4": "ae:5f:6a:73:71:57",
            "net5": "aa:89:b5:1c:6f:59",
            "net6": "ca:79:02:c2:9d:d3",
            "net7": "8e:10:7c:90:d1:e7"
        },
        "tof_2_2_3": {
            "net0": "e6:47:3a:b3:3c:e8",
            "net1": "06:61:fc:c4:7a:e5",
            "net2": "c2:23:dc:fc:aa:89",
            "net3": "3a:21:55:eb:d9:26",
            "net4": "66:63:c3:e6:f4:60",
            "net5": "e6:45:4b:3b:1a:0b",
            "net6": "8a:d5:f9:a3:21:b2",
            "net7": "fe:9d:af:05:6e:1d"
        },
        "tof_2_2_4": {
            "net0": "66:99:d8:16:32:c2",
            "net1": "a2:01:9e:87:53:5f",
            "net2": "56:f4:43:46:0b:e6",
            "net3": "e2:f8:71:da:a7:f8",
            "net4": "c6:0b:91:39:6d:a8",
            "net5": "86:69:43:ee:61:bd",
            "net6": "ce:c4:6b:38:a8:21",
            "net7": "6a:b4:a3:4d:11:c5"
        }
    },
    "failed_machine": "leaf_1_0_1",
    "failed_interfaces": [
        "net0"
    ],
    "failure_time": {
        "leaf_1_0_1": 1634562401.7925177,
        "leaf_1_0_2": 1634562401.8158329,
        "leaf_1_0_3": 1634562401.8289528,
        "leaf_1_0_4": 1634562401.8404474,
        "leaf_2_0_1": 1634562401.8496194,
        "leaf_2_0_2": 1634562401.7967122,
        "leaf_2_0_3": 1634562401.818497,
        "leaf_2_0_4": 1634562401.8276467,
        "leaf_3_0_1": 1634562401.8370502,
        "leaf_3_0_2": 1634562401.8497126,
        "leaf_3_0_3": 1634562401.8589232,
        "leaf_3_0_4": 1634562401.8709912,
        "leaf_4_0_1": 1634562401.901442,
        "leaf_4_0_2": 1634562401.907139,
        "leaf_4_0_3": 1634562401.9153576,
        "leaf_4_0_4": 1634562401.8618705,
        "spine_1_1_1": 1634562401.8774168,
        "spine_1_1_2": 1634562401.9012408,
        "spine_1_1_3": 1634562401.9080868,
        "spine_1_1_4": 1634562401.9188178,
        "spine_2_1_1": 1634562401.9297068,
        "spine_2_1_2": 1634562401.9394646,
        "spine_2_1_3": 1634562401.9498973,
        "spine_2_1_4": 1634562401.9577386,
        "spine_3_1_1": 1634562401.9633255,
        "spine_3_1_2": 1634562401.9331472,
        "spine_3_1_3": 1634562401.9466045,
        "spine_3_1_4": 1634562401.9550054,
        "spine_4_1_1": 1634562401.9658687,
        "spine_4_1_2": 1634562401.970295,
        "spine_4_1_3": 1634562401.9730873,
        "spine_4_1_4": 1634562401.9869733,
        "tof_1_2_1": 1634562401.99711,
        "tof_1_2_2": 1634562402.0076683,
        "tof_1_2_3": 1634562402.0262346,
        "tof_1_2_4": 1634562401.9861174,
        "tof_2_2_1": 1634562401.9944172,
        "tof_2_2_2": 1634562402.003926,
        "tof_2_2_3": 1634562402.0282967,
        "tof_2_2_4": 1634562402.039484
    }
}