{
    "k_leaf": 4,
    "k_top": 4,
    "redundancy_factor": 2,
    "is_k8s": true,
    "machine_mac_addresses": {
        "leaf_1_0_1": {
            "net0": "06:c9:cb:62:52:ff",
            "net1": "c2:ba:34:3e:0c:3a",
            "net2": "be:08:a4:51:79:93",
            "net3": "ea:c4:77:33:56:47",
            "net4": "d2:ea:5f:47:ce:35"
        },
        "leaf_1_0_2": {
            "net0": "1e:e4:4c:05:eb:80",
            "net1": "02:cf:ac:d5:a5:a6",
            "net2": "12:5a:b3:01:3e:0e",
            "net3": "26:d6:57:4f:fd:e9",
            "net4": "46:98:90:8c:0a:50"
        },
        "leaf_1_0_3": {
            "net0": "4e:a6:2d:a1:91:5e",
            "net1": "b2:2f:ff:43:cc:b0",
            "net2": "22:3a:75:2a:ba:52",
            "net3": "b6:30:46:6e:25:3a",
            "net4": "de:76:f3:98:45:1c"
        },
        "leaf_1_0_4": {
            "net0": "66:65:61:5c:84:c8",
            "net1": "a6:81:42:bd:bf:fd",
            "net2": "12:17:a8:2b:37:2a",
            "net3": "72:49:4a:96:b3:29",
            "net4": "ae:f7:33:e1:49:73"
        },
        "leaf_2_0_1": {
            "net0": "6a:b0:6e:3b:01:0b",
            "net1": "de:b7:fd:be:f9:cb",
            "net2": "be:76:4b:5e:28:60",
            "net3": "de:f7:4c:80:3f:85",
            "net4": "9a:5c:3d:19:3b:6c"
        },
        "leaf_2_0_2": {
            "net0": "5e:bc:15:98:68:a0",
            "net1": "3a:56:74:c4:62:22",
            "net2": "6e:cb:82:46:2d:f9",
            "net3": "02:97:fb:77:50:ff",
            "net4": "aa:cb:af:6d:4a:4a"
        },
        "leaf_2_0_3": {
            "net0": "c6:b2:ec:b3:e2:e0",
            "net1": "2e:ae:db:f6:58:4a",
            "net2": "86:5e:df:1e:9d:78",
            "net3": "da:30:3a:1e:3d:26",
            "net4": "4a:d9:4f:0d:31:ec"
        },
        "leaf_2_0_4": {
            "net0": "92:47:b1:52:be:3a",
            "net1": "1a:21:98:bb:be:36",
            "net2": "4a:dd:60:db:45:d9",
            "net3": "ea:22:47:dc:56:93",
            "net4": "26:28:ef:bf:a5:36"
        },
        "leaf_3_0_1": {
            "net0": "36:63:e4:bd:ad:4c",
            "net1": "a6:c2:08:01:d2:ba",
            "net2": "62:04:1a:a2:2d:9c",
            "net3": "02:ea:5e:74:41:33",
            "net4": "56:0b:78:d5:93:e6"
        },
        "leaf_3_0_2": {
            "net0": "d6:91:c4:c3:55:23",
            "net1": "ca:00:1b:51:b2:7e",
            "net2": "06:5f:a2:09:37:d8",
            "net3": "8a:ea:c9:dc:e5:08",
            "net4": "f2:6f:c1:40:ab:20"
        },
        "leaf_3_0_3": {
            "net0": "96:8c:6d:09:ac:05",
            "net1": "aa:3a:51:88:d6:ee",
            "net2": "c6:a0:de:35:1f:65",
            "net3": "ea:2e:ef:f5:26:51",
            "net4": "de:7c:d0:de:e6:79"
        },
        "leaf_3_0_4": {
            "net0": "6a:31:ac:8b:43:97",
            "net1": "fa:33:2d:44:b6:ce",
            "net2": "56:32:ad:f6:2d:cb",
            "net3": "0e:9e:7d:6a:73:11",
            "net4": "26:81:75:c8:4f:a2"
        },
        "leaf_4_0_1": {
            "net0": "96:f7:81:e8:5b:7e",
            "net1": "82:12:dd:f8:c5:84",
            "net2": "46:c5:f6:b4:9a:45",
            "net3": "2e:01:11:e4:b1:2b",
            "net4": "2a:b9:0b:39:13:6a"
        },
        "leaf_4_0_2": {
            "net0": "6e:97:d1:d8:4e:12",
            "net1": "8e:51:dd:d4:48:dc",
            "net2": "a6:55:27:24:03:d0",
            "net3": "d2:a4:5e:46:95:50",
            "net4": "da:ef:d1:48:90:a7"
        },
        "leaf_4_0_3": {
            "net0": "86:21:d9:01:e9:dd",
            "net1": "b2:8d:7e:b6:aa:12",
            "net2": "1e:56:ee:28:04:d3",
            "net3": "b6:c6:5b:a2:b5:55",
            "net4": "c2:5b:d1:57:83:e9"
        },
        "leaf_4_0_4": {
            "net0": "9e:6a:e5:33:42:22",
            "net1": "8e:4d:44:7d:af:ec",
            "net2": "9e:27:76:92:ae:e3",
            "net3": "7a:24:69:d3:0c:f7",
            "net4": "7a:a0:92:9c:06:00"
        },
        "spine_1_1_1": {
            "net0": "ba:42:d2:06:f2:d8",
            "net1": "86:eb:8a:3f:3a:b7",
            "net2": "02:81:8f:ef:89:2b",
            "net3": "7e:93:69:09:c7:c5",
            "net4": "4a:e5:58:c6:0b:30",
            "net5": "ca:c9:4a:29:da:53",
            "net6": "1a:b5:34:46:73:89",
            "net7": "d6:39:d1:16:8c:09"
        },
        "spine_1_1_2": {
            "net0": "36:b5:e6:73:e6:b5",
            "net1": "2a:d6:f1:8c:4c:86",
            "net2": "12:b7:9f:cb:64:95",
            "net3": "e2:ea:9b:e0:ea:ae",
            "net4": "76:cc:3a:81:b6:fa",
            "net5": "5e:ff:cd:88:6f:2c",
            "net6": "1a:d7:2d:4f:ae:a6",
            "net7": "66:7a:68:0f:74:be"
        },
        "spine_1_1_3": {
            "net0": "0e:e2:df:03:8d:b7",
            "net1": "12:2c:60:0f:3a:eb",
            "net2": "32:21:7c:7d:8a:c4",
            "net3": "2e:50:90:be:f5:fa",
            "net4": "82:63:95:82:f2:cc",
            "net5": "46:71:99:60:ec:a1",
            "net6": "c2:08:b2:ff:ed:da",
            "net7": "da:f4:34:91:21:95"
        },
        "spine_1_1_4": {
            "net0": "be:b7:ae:54:3e:4f",
            "net1": "0a:dc:a4:26:4d:ad",
            "net2": "9a:b7:f4:8e:fc:2f",
            "net3": "72:9e:8c:52:99:61",
            "net4": "32:97:97:b2:d9:27",
            "net5": "6e:09:32:67:26:4f",
            "net6": "16:ca:c4:f3:95:6a",
            "net7": "e6:69:30:fa:f8:94"
        },
        "spine_2_1_1": {
            "net0": "36:a3:e0:69:16:72",
            "net1": "96:ed:3b:bf:fe:5b",
            "net2": "72:aa:18:fb:16:2d",
            "net3": "5e:bf:ef:c0:79:62",
            "net4": "ae:bc:75:66:0a:6f",
            "net5": "d2:8d:51:87:9f:ae",
            "net6": "16:4b:83:81:49:66",
            "net7": "fe:84:a7:32:28:27"
        },
        "spine_2_1_2": {
            "net0": "92:a7:e8:f7:4f:6d",
            "net1": "02:e5:68:dd:25:71",
            "net2": "be:53:b6:4e:43:4f",
            "net3": "86:7d:1f:94:68:93",
            "net4": "9a:e6:48:7e:ef:c5",
            "net5": "56:5a:69:30:1b:18",
            "net6": "4a:90:f8:61:9d:9b",
            "net7": "ca:7c:7d:a5:8d:1f"
        },
        "spine_2_1_3": {
            "net0": "e6:ac:56:70:0e:e2",
            "net1": "fa:c2:98:86:27:e1",
            "net2": "46:a5:93:8a:e8:55",
            "net3": "06:d2:f4:c4:ea:9d",
            "net4": "1a:d7:40:1e:99:a1",
            "net5": "be:5f:cb:e9:a8:25",
            "net6": "1a:fb:2e:9d:93:3f",
            "net7": "4a:de:c3:0d:17:c7"
        },
        "spine_2_1_4": {
            "net0": "ca:ed:47:00:1a:57",
            "net1": "b6:31:f2:91:63:53",
            "net2": "ba:22:5f:34:4b:f2",
            "net3": "26:88:82:e0:17:52",
            "net4": "c6:ad:02:10:6c:7d",
            "net5": "c2:1f:a0:df:da:76",
            "net6": "5a:3b:e0:6d:f2:e4",
            "net7": "0e:4e:ae:42:5d:60"
        },
        "spine_3_1_1": {
            "net0": "a6:64:49:a9:70:1e",
            "net1": "82:4d:b3:eb:07:5c",
            "net2": "f6:2c:53:58:6f:ef",
            "net3": "f2:97:8c:cd:d6:88",
            "net4": "72:b3:92:e8:eb:9f",
            "net5": "9e:6d:95:94:93:27",
            "net6": "e2:32:8a:91:17:ae",
            "net7": "ba:23:3c:1f:59:96"
        },
        "spine_3_1_2": {
            "net0": "1e:78:fa:27:be:04",
            "net1": "2e:a2:7c:31:cb:18",
            "net2": "c2:dc:b1:26:10:20",
            "net3": "5a:58:46:a9:f6:92",
            "net4": "66:bf:c0:6f:cb:51",
            "net5": "c6:b3:98:ef:e8:52",
            "net6": "e6:f3:69:09:9f:3f",
            "net7": "c2:d3:22:50:76:26"
        },
        "spine_3_1_3": {
            "net0": "5e:17:e9:3e:22:09",
            "net1": "9e:4f:5d:f0:03:8b",
            "net2": "2a:da:b8:f0:51:61",
            "net3": "fa:fa:07:4e:ad:c9",
            "net4": "de:24:36:3a:6b:26",
            "net5": "4e:56:dc:07:61:40",
            "net6": "ea:f8:a7:0a:a8:cb",
            "net7": "1a:71:3f:4f:a4:ca"
        },
        "spine_3_1_4": {
            "net0": "5e:d6:f7:a5:bc:9c",
            "net1": "ca:78:07:34:cb:22",
            "net2": "ea:e8:77:c4:b5:f2",
            "net3": "3e:5c:ea:ed:62:73",
            "net4": "4a:aa:70:07:db:6e",
            "net5": "86:e5:9d:5d:04:1a",
            "net6": "0a:6c:bc:4c:0d:6a",
            "net7": "fa:df:83:81:73:75"
        },
        "spine_4_1_1": {
            "net0": "c2:6e:9b:88:b8:67",
            "net1": "f2:e9:96:53:4d:8b",
            "net2": "ee:8e:a2:8d:3d:20",
            "net3": "e6:a1:ab:1d:5b:3c",
            "net4": "46:80:3f:60:fd:fc",
            "net5": "36:c4:b6:67:c4:00",
            "net6": "6e:4a:3a:16:c6:96",
            "net7": "56:cc:6c:18:f1:09"
        },
        "spine_4_1_2": {
            "net0": "de:b4:61:06:e3:ee",
            "net1": "de:9f:e1:b3:d1:ab",
            "net2": "7a:28:60:09:93:68",
            "net3": "92:39:4b:dd:4f:08",
            "net4": "b6:9f:69:18:34:20",
            "net5": "32:4c:21:38:9c:57",
            "net6": "82:46:46:59:04:09",
            "net7": "72:ea:c9:5b:23:62"
        },
        "spine_4_1_3": {
            "net0": "82:cf:62:d3:48:7f",
            "net1": "fa:43:63:8c:2c:20",
            "net2": "e2:80:1f:99:ff:58",
            "net3": "f6:86:53:79:b8:cd",
            "net4": "f6:26:0e:38:86:fd",
            "net5": "d6:4d:71:de:b7:e5",
            "net6": "a2:ed:da:be:89:eb",
            "net7": "de:5f:44:83:1e:60"
        },
        "spine_4_1_4": {
            "net0": "ea:14:1e:66:73:84",
            "net1": "c6:fe:bd:7b:95:0a",
            "net2": "ee:80:b5:99:6e:68",
            "net3": "1e:07:ff:fd:cf:da",
            "net4": "1e:49:8e:b0:a9:e9",
            "net5": "86:0c:94:34:37:d7",
            "net6": "3e:2d:8f:99:ec:26",
            "net7": "72:41:ca:44:f5:55"
        },
        "tof_1_2_1": {
            "net0": "46:78:91:43:0c:74",
            "net1": "aa:c9:1d:f9:74:ce",
            "net2": "86:0c:b7:b1:24:07",
            "net3": "8e:9c:46:ff:af:f7",
            "net4": "96:77:8c:47:84:c2",
            "net5": "a6:db:6e:b8:fd:e0",
            "net6": "3a:f9:0c:6b:66:fb",
            "net7": "7e:e8:de:21:f9:37"
        },
        "tof_1_2_2": {
            "net0": "3a:8e:8a:30:fd:a7",
            "net1": "9a:3d:29:36:a4:d2",
            "net2": "66:9b:21:ca:38:14",
            "net3": "c6:ba:45:c7:f3:12",
            "net4": "22:6e:08:b2:ad:00",
            "net5": "c6:8b:38:86:94:02",
            "net6": "f6:04:8d:22:da:c3",
            "net7": "82:4a:84:cf:7e:17"
        },
        "tof_1_2_3": {
            "net0": "ea:1b:8f:0b:c4:23",
            "net1": "66:af:e7:f8:6f:53",
            "net2": "ea:c2:49:09:de:9e",
            "net3": "e6:c6:5d:ef:34:3f",
            "net4": "96:97:21:ea:6b:25",
            "net5": "da:ff:c9:d6:c2:4c",
            "net6": "c6:c7:76:61:b7:96",
            "net7": "fe:9f:14:68:38:6e"
        },
        "tof_1_2_4": {
            "net0": "da:41:82:de:27:a2",
            "net1": "e2:f8:ac:3f:45:67",
            "net2": "7a:ad:06:b5:35:c3",
            "net3": "82:d4:68:ae:92:ad",
            "net4": "6a:d9:39:78:37:5e",
            "net5": "ce:7a:3b:21:58:12",
            "net6": "b6:7f:0b:de:eb:c1",
            "net7": "da:63:dd:85:8d:75"
        },
        "tof_2_2_1": {
            "net0": "82:81:60:b0:f2:f9",
            "net1": "72:1f:95:60:d7:2d",
            "net2": "92:25:39:5a:1f:56",
            "net3": "d2:4b:8e:ea:24:08",
            "net4": "92:77:2f:c7:75:20",
            "net5": "ee:a6:93:45:5b:17",
            "net6": "e2:be:a0:62:63:fc",
            "net7": "86:d4:6b:8c:5e:a6"
        },
        "tof_2_2_2": {
            "net0": "d2:0b:87:8e:7a:a6",
            "net1": "86:02:35:5d:d2:db",
            "net2": "42:e9:48:df:4b:20",
            "net3": "d6:86:ed:a7:01:c4",
            "net4": "72:9b:39:cf:dc:36",
            "net5": "52:da:58:66:7c:80",
            "net6": "fa:2b:71:b7:42:b5",
            "net7": "16:5b:e3:fb:e2:8a"
        },
        "tof_2_2_3": {
            "net0": "92:77:63:73:4e:a7",
            "net1": "4a:15:96:ff:73:0d",
            "net2": "ee:7e:42:80:53:3e",
            "net3": "de:62:1e:54:e5:c5",
            "net4": "12:f0:cb:6a:17:84",
            "net5": "76:d5:8e:57:ca:07",
            "net6": "fe:45:6a:b0:ee:e9",
            "net7": "4a:02:68:f2:bd:d2"
        },
        "tof_2_2_4": {
            "net0": "92:35:28:10:6f:be",
            "net1": "0e:94:67:82:ef:69",
            "net2": "be:a5:38:66:3d:e5",
            "net3": "c6:02:ad:b3:58:4f",
            "net4": "d2:8c:0e:a7:46:78",
            "net5": "0e:05:4e:82:17:f4",
            "net6": "1a:4a:6b:29:96:96",
            "net7": "c6:df:41:fa:51:1f"
        }
    },
    "failed_machine": "tof_1_2_1",
    "failure_time": {
        "leaf_1_0_1": 1634421294.3610249,
        "leaf_1_0_2": 1634421294.386014,
        "leaf_1_0_3": 1634421294.399654,
        "leaf_1_0_4": 1634421294.4077039,
        "leaf_2_0_1": 1634421294.4296677,
        "leaf_2_0_2": 1634421294.368323,
        "leaf_2_0_3": 1634421294.3865137,
        "leaf_2_0_4": 1634421294.4030952,
        "leaf_3_0_1": 1634421294.4208782,
        "leaf_3_0_2": 1634421294.4312222,
        "leaf_3_0_3": 1634421294.448264,
        "leaf_3_0_4": 1634421294.4897194,
        "leaf_4_0_1": 1634421294.4999893,
        "leaf_4_0_2": 1634421294.5090153,
        "leaf_4_0_3": 1634421294.5355349,
        "leaf_4_0_4": 1634421294.4626927,
        "spine_1_1_1": 1634421294.4958766,
        "spine_1_1_2": 1634421294.5046508,
        "spine_1_1_3": 1634421294.5136173,
        "spine_1_1_4": 1634421294.5536425,
        "spine_2_1_1": 1634421294.551101,
        "spine_2_1_2": 1634421294.5743861,
        "spine_2_1_3": 1634421294.6090899,
        "spine_2_1_4": 1634421294.6254563,
        "spine_3_1_1": 1634421294.6700432,
        "spine_3_1_2": 1634421294.5715976,
        "spine_3_1_3": 1634421294.6000004,
        "spine_3_1_4": 1634421294.615007,
        "spine_4_1_1": 1634421294.6247826,
        "spine_4_1_2": 1634421294.6660442,
        "spine_4_1_3": 1634421294.7108662,
        "spine_4_1_4": 1634421294.738361,
        "tof_1_2_1": 1634421294.7599065,
        "tof_1_2_2": 1634421294.821199,
        "tof_1_2_3": 1634421294.8479078,
        "tof_1_2_4": 1634421294.710457,
        "tof_2_2_1": 1634421294.7378573,
        "tof_2_2_2": 1634421294.7675514,
        "tof_2_2_3": 1634421294.7962055,
        "tof_2_2_4": 1634421294.8257656
    }
}