{
    "description": "Scenario 6a: net0 link failure and recovery of leaf_1_0_1 with BGP",
    "k_leaf": 6,
    "k_top": 6,
    "redundancy_factor": 2,
    "is_k8s": true,
    "machine_mac_addresses": {
        "leaf_1_0_1": {
            "net0": "f2:d4:ee:55:e8:80",
            "net1": "b2:42:1e:6a:d1:bb",
            "net2": "be:2b:da:73:ed:a9",
            "net3": "32:4d:e8:37:55:57",
            "net4": "b6:09:21:54:b5:00",
            "net5": "7a:5d:3c:ba:e9:bc",
            "net6": "aa:e3:58:28:34:53"
        },
        "leaf_1_0_2": {
            "net0": "3a:67:4a:df:d4:87",
            "net1": "ce:82:b9:75:a0:ce",
            "net2": "4a:1a:3d:b4:10:b1",
            "net3": "86:e2:1a:0c:88:c4",
            "net4": "92:d1:73:1a:34:70",
            "net5": "9a:c1:5e:eb:58:64",
            "net6": "d2:08:37:f5:15:6a"
        },
        "leaf_1_0_3": {
            "net0": "32:16:2c:b9:56:16",
            "net1": "0a:6a:c6:a2:e5:cf",
            "net2": "22:4c:8c:11:db:e3",
            "net3": "92:6c:c1:77:9b:56",
            "net4": "b6:f3:ed:7e:e8:90",
            "net5": "7e:bf:01:b9:87:15",
            "net6": "02:6f:1e:04:e3:a7"
        },
        "leaf_1_0_4": {
            "net0": "26:86:b3:a9:39:a3",
            "net1": "42:9a:f6:67:ef:40",
            "net2": "d6:93:cc:7e:e6:10",
            "net3": "a6:93:1a:64:c2:7d",
            "net4": "ae:51:dd:a6:48:8a",
            "net5": "ca:06:d1:b0:a9:7d",
            "net6": "b2:b9:11:6b:e5:b7"
        },
        "leaf_1_0_5": {
            "net0": "5a:d1:2e:1c:73:fc",
            "net1": "d2:99:22:49:72:5a",
            "net2": "a6:f5:bf:98:20:c8",
            "net3": "7a:9d:3d:86:fa:79",
            "net4": "16:ff:61:13:2e:db",
            "net5": "16:92:ff:ed:ea:d7",
            "net6": "22:ba:ea:07:de:96"
        },
        "leaf_1_0_6": {
            "net0": "26:14:31:45:95:eb",
            "net1": "02:21:80:2e:35:a2",
            "net2": "ce:2b:dc:e4:dc:be",
            "net3": "06:22:7a:92:eb:c4",
            "net4": "a2:db:94:fe:c3:67",
            "net5": "32:f2:66:56:c4:ad",
            "net6": "56:db:e2:29:fd:fd"
        },
        "leaf_2_0_1": {
            "net0": "8e:b0:8b:65:37:13",
            "net1": "96:e9:99:cd:12:9f",
            "net2": "ee:fe:ee:7c:4a:6f",
            "net3": "e6:94:1e:a6:79:83",
            "net4": "e2:84:50:63:4b:f9",
            "net5": "1e:bc:a0:6b:da:bd",
            "net6": "7a:b0:9c:b6:be:1e"
        },
        "leaf_2_0_2": {
            "net0": "0a:52:01:89:83:35",
            "net1": "f2:61:89:ab:ce:0f",
            "net2": "12:0b:80:26:ba:53",
            "net3": "f6:ae:db:4b:f4:1f",
            "net4": "fa:8a:fb:45:1a:cc",
            "net5": "1e:c0:a7:0d:cc:7f",
            "net6": "d2:f6:6b:fe:93:e6"
        },
        "leaf_2_0_3": {
            "net0": "a2:74:2a:74:71:ce",
            "net1": "aa:92:fe:93:e8:b9",
            "net2": "c2:d4:b6:68:fe:93",
            "net3": "de:6c:f5:ec:90:fd",
            "net4": "a6:e7:41:2e:4c:fe",
            "net5": "1e:05:a3:01:d8:09",
            "net6": "86:4c:23:ce:9d:e1"
        },
        "leaf_2_0_4": {
            "net0": "8a:01:89:f5:e8:05",
            "net1": "76:60:ff:25:91:92",
            "net2": "16:b9:47:16:9a:07",
            "net3": "e6:3c:53:4e:78:b8",
            "net4": "3a:97:fc:e0:72:21",
            "net5": "aa:89:41:49:bc:d2",
            "net6": "0a:32:3d:1c:c4:14"
        },
        "leaf_2_0_5": {
            "net0": "f2:a6:71:ac:71:a8",
            "net1": "e6:5c:a8:b8:6a:70",
            "net2": "1e:8d:bf:a5:83:b5",
            "net3": "36:e3:cc:fa:2b:0d",
            "net4": "06:47:ed:bf:6d:33",
            "net5": "5a:84:3a:55:2d:0f",
            "net6": "2e:a0:cc:e6:59:de"
        },
        "leaf_2_0_6": {
            "net0": "6e:1a:8c:6b:3b:fd",
            "net1": "3e:a6:76:f9:48:14",
            "net2": "ee:8d:40:45:e9:63",
            "net3": "ba:6e:ac:10:de:16",
            "net4": "1e:da:31:17:40:0c",
            "net5": "92:d6:a8:09:fc:03",
            "net6": "96:97:a4:cb:30:57"
        },
        "leaf_3_0_1": {
            "net0": "86:47:2b:42:81:f7",
            "net1": "3a:92:e5:36:a7:46",
            "net2": "b2:69:70:35:97:31",
            "net3": "4a:84:5b:c1:ed:73",
            "net4": "8e:79:9e:18:6d:0e",
            "net5": "fe:68:45:67:11:6c",
            "net6": "96:40:89:6e:13:50"
        },
        "leaf_3_0_2": {
            "net0": "02:6a:9c:6a:36:9b",
            "net1": "fe:93:f1:52:1e:e9",
            "net2": "8a:eb:00:da:27:27",
            "net3": "c6:85:59:9f:0a:c7",
            "net4": "3a:d4:f7:4e:88:15",
            "net5": "ba:f8:96:60:4c:46",
            "net6": "72:d4:eb:d7:d4:3a"
        },
        "leaf_3_0_3": {
            "net0": "2a:a9:82:5f:00:e8",
            "net1": "8e:d6:4c:73:32:1d",
            "net2": "a6:d2:74:de:9a:e7",
            "net3": "92:17:85:c6:26:4f",
            "net4": "7e:59:b5:e1:ec:15",
            "net5": "46:0c:29:02:da:2b",
            "net6": "46:0f:0a:79:1b:4b"
        },
        "leaf_3_0_4": {
            "net0": "8a:2a:92:61:39:45",
            "net1": "12:ed:33:e1:df:45",
            "net2": "fa:ce:45:f6:c3:55",
            "net3": "e2:47:25:97:3d:14",
            "net4": "ca:c8:5e:c1:f6:37",
            "net5": "ea:12:97:cb:44:81",
            "net6": "f2:e3:fe:cd:59:3a"
        },
        "leaf_3_0_5": {
            "net0": "be:4c:e7:55:d5:4c",
            "net1": "b6:55:52:d8:d1:59",
            "net2": "f6:22:0e:72:47:df",
            "net3": "0e:68:20:ce:37:f6",
            "net4": "3e:d4:e7:d0:ca:a4",
            "net5": "4e:bc:fd:de:90:6a",
            "net6": "56:9a:f9:95:57:6b"
        },
        "leaf_3_0_6": {
            "net0": "ba:f0:9e:5b:47:e4",
            "net1": "8e:59:82:c3:58:6a",
            "net2": "7e:67:32:0d:ba:b1",
            "net3": "06:1b:3f:d7:6f:10",
            "net4": "ca:78:98:d3:2d:2e",
            "net5": "0a:ef:e7:e4:25:ac",
            "net6": "f6:a9:43:36:45:8d"
        },
        "leaf_4_0_1": {
            "net0": "a2:75:27:2c:31:51",
            "net1": "82:60:65:15:fe:52",
            "net2": "12:3d:e4:91:dc:cf",
            "net3": "c6:d9:6c:2c:d6:79",
            "net4": "62:a6:21:6d:93:88",
            "net5": "7a:5e:bd:10:c6:55",
            "net6": "da:8e:7e:40:c3:36"
        },
        "leaf_4_0_2": {
            "net0": "22:f7:a0:db:51:81",
            "net1": "e6:3d:5d:d8:c8:f4",
            "net2": "f6:3d:da:c7:f7:a1",
            "net3": "ba:c4:ef:ce:dc:e9",
            "net4": "da:0e:5d:a7:32:13",
            "net5": "3a:09:74:6f:20:52",
            "net6": "6a:3d:6f:b7:48:3b"
        },
        "leaf_4_0_3": {
            "net0": "42:f6:09:f6:b7:b9",
            "net1": "b2:29:76:d1:f6:dd",
            "net2": "3a:72:98:47:8c:33",
            "net3": "0a:78:a2:01:c3:08",
            "net4": "76:2c:9f:ff:4c:bc",
            "net5": "2e:71:e0:6f:d7:e8",
            "net6": "0e:c6:66:b3:eb:06"
        },
        "leaf_4_0_4": {
            "net0": "22:d4:aa:37:82:0f",
            "net1": "42:58:83:44:78:0b",
            "net2": "3e:de:a5:42:91:dd",
            "net3": "2e:47:0a:8e:8e:19",
            "net4": "96:23:61:c8:91:91",
            "net5": "1a:b7:5a:e6:43:6b",
            "net6": "96:58:e3:1c:38:3a"
        },
        "leaf_4_0_5": {
            "net0": "9e:7c:10:ec:c2:31",
            "net1": "d2:6f:e6:31:7c:b6",
            "net2": "ee:b7:b4:a0:bc:eb",
            "net3": "4a:af:07:69:83:c1",
            "net4": "56:8d:84:23:6e:26",
            "net5": "96:dc:53:00:4f:8f",
            "net6": "6a:82:11:16:b5:6d"
        },
        "leaf_4_0_6": {
            "net0": "9e:58:56:66:97:10",
            "net1": "56:c0:1e:5c:97:f5",
            "net2": "c2:00:eb:a1:ff:00",
            "net3": "b6:1b:83:7b:0d:85",
            "net4": "ae:39:61:e8:93:54",
            "net5": "22:eb:19:e5:89:dc",
            "net6": "e2:89:0a:df:cc:e2"
        },
        "leaf_5_0_1": {
            "net0": "06:7f:92:f1:0c:a9",
            "net1": "e2:da:1a:b4:18:77",
            "net2": "c6:46:e7:d6:0b:86",
            "net3": "2a:2b:06:38:41:0a",
            "net4": "1a:c1:48:49:35:76",
            "net5": "b6:87:51:0f:0d:db",
            "net6": "06:a2:09:cf:21:7d"
        },
        "leaf_5_0_2": {
            "net0": "52:06:c8:1c:8e:2e",
            "net1": "72:35:2c:7f:f2:d9",
            "net2": "ca:e3:eb:0b:17:99",
            "net3": "da:3f:55:fa:29:a5",
            "net4": "ae:a7:88:e6:a9:39",
            "net5": "a2:35:d1:35:c4:36",
            "net6": "ae:9a:75:3e:a7:d2"
        },
        "leaf_5_0_3": {
            "net0": "6a:56:5f:c2:21:25",
            "net1": "3a:b4:b7:8d:6c:fd",
            "net2": "f2:2c:29:78:cb:8f",
            "net3": "8a:6b:95:54:49:97",
            "net4": "76:8b:16:4f:65:b3",
            "net5": "a6:39:52:e0:11:07",
            "net6": "8e:a8:77:2c:5e:5f"
        },
        "leaf_5_0_4": {
            "net0": "66:c6:3b:f5:17:1d",
            "net1": "fe:5a:33:2a:98:9b",
            "net2": "6e:1d:b6:66:91:77",
            "net3": "96:26:95:23:78:9d",
            "net4": "aa:1d:71:ef:64:58",
            "net5": "1e:83:79:41:85:a8",
            "net6": "2a:bf:08:86:36:4a"
        },
        "leaf_5_0_5": {
            "net0": "62:c4:78:4b:7f:de",
            "net1": "2e:55:8d:4e:f8:b5",
            "net2": "1e:ed:98:bc:5f:35",
            "net3": "ee:c7:1d:a1:55:05",
            "net4": "0a:af:fe:91:9a:fe",
            "net5": "22:a5:bd:02:4d:5c",
            "net6": "c6:a2:52:da:5d:21"
        },
        "leaf_5_0_6": {
            "net0": "b2:93:f1:a0:55:d6",
            "net1": "52:9b:45:52:c7:a1",
            "net2": "de:fe:c3:e3:fb:80",
            "net3": "ee:fc:6c:fb:82:6b",
            "net4": "6a:69:80:f8:8c:22",
            "net5": "be:19:ff:03:b0:e5",
            "net6": "36:22:20:41:21:06"
        },
        "leaf_6_0_1": {
            "net0": "66:00:1c:a4:dc:e5",
            "net1": "c2:78:d3:41:2c:95",
            "net2": "da:80:76:70:72:ae",
            "net3": "32:91:0c:29:3f:93",
            "net4": "6a:99:88:a6:17:91",
            "net5": "9a:6f:49:38:19:c9",
            "net6": "7a:ea:5e:d9:29:bc"
        },
        "leaf_6_0_2": {
            "net0": "ba:b5:38:26:59:93",
            "net1": "aa:04:2f:57:e6:df",
            "net2": "7e:df:76:8c:32:ad",
            "net3": "2a:dd:db:8a:36:ee",
            "net4": "62:59:c8:5b:cb:7d",
            "net5": "da:64:fa:ed:f0:1a",
            "net6": "4a:49:4d:b5:d1:54"
        },
        "leaf_6_0_3": {
            "net0": "46:9a:08:06:0b:a6",
            "net1": "12:1a:68:19:54:9d",
            "net2": "5a:eb:8d:60:6c:54",
            "net3": "22:fc:54:8c:6d:99",
            "net4": "c2:3c:6a:b8:5c:ab",
            "net5": "5e:2e:0c:7f:bc:49",
            "net6": "82:f6:b5:6d:6a:73"
        },
        "leaf_6_0_4": {
            "net0": "32:c6:7f:ba:53:cb",
            "net1": "de:9e:53:79:93:ac",
            "net2": "2a:95:b9:3c:07:d2",
            "net3": "96:26:ba:d2:f6:91",
            "net4": "de:32:0c:ba:1d:cc",
            "net5": "7a:9a:b1:1c:b9:72",
            "net6": "8e:45:29:d2:0d:72"
        },
        "leaf_6_0_5": {
            "net0": "f2:30:a5:f4:71:8d",
            "net1": "e2:09:23:97:29:32",
            "net2": "26:48:5b:95:92:3a",
            "net3": "9a:53:79:99:3c:2d",
            "net4": "66:49:0c:75:93:f3",
            "net5": "1e:0c:4c:f5:23:92",
            "net6": "32:52:1d:41:5e:39"
        },
        "leaf_6_0_6": {
            "net0": "b6:18:66:4f:55:34",
            "net1": "ba:61:3e:18:fb:99",
            "net2": "32:0e:0e:4f:7c:09",
            "net3": "32:b8:62:cb:0a:05",
            "net4": "7e:16:3e:0f:ea:cc",
            "net5": "7a:3f:19:f4:72:a7",
            "net6": "2e:fa:1f:38:6d:09"
        },
        "spine_1_1_1": {
            "net0": "8a:d8:9d:61:7e:60",
            "net1": "86:a2:18:03:3e:7d",
            "net10": "7a:e3:be:5d:5a:f3",
            "net11": "7e:eb:cb:fd:89:49",
            "net2": "a2:b5:fd:b5:10:52",
            "net3": "3a:98:83:43:86:5b",
            "net4": "ca:a5:f9:68:9f:3a",
            "net5": "d6:15:22:71:72:d9",
            "net6": "be:17:c3:26:39:24",
            "net7": "aa:8b:a0:95:fe:0f",
            "net8": "02:02:b1:97:84:c5",
            "net9": "5e:a2:ae:66:6c:6e"
        },
        "spine_1_1_2": {
            "net0": "4a:67:e6:e4:1c:4e",
            "net1": "de:eb:dc:f5:91:2c",
            "net10": "62:69:31:b6:da:e8",
            "net11": "36:f4:33:8e:30:01",
            "net2": "36:96:b8:15:bd:87",
            "net3": "aa:f9:84:63:da:38",
            "net4": "5e:8a:0f:6c:87:1d",
            "net5": "a2:d2:d0:9b:93:bb",
            "net6": "16:a7:7c:2f:81:8e",
            "net7": "56:d6:b6:c4:f9:21",
            "net8": "6e:6f:ec:b6:b1:86",
            "net9": "06:89:8f:b7:cc:18"
        },
        "spine_1_1_3": {
            "net0": "f2:c8:44:1a:88:e8",
            "net1": "c2:61:51:a2:89:32",
            "net10": "e6:c8:15:2d:24:05",
            "net11": "82:e1:ad:57:32:dc",
            "net2": "1a:39:8f:9b:6f:b5",
            "net3": "aa:ab:6d:84:4e:93",
            "net4": "c2:0c:cb:48:e8:94",
            "net5": "12:60:07:d3:9b:8b",
            "net6": "86:7a:c5:df:f3:98",
            "net7": "22:0c:c2:a8:1f:34",
            "net8": "42:69:94:16:f0:f4",
            "net9": "2e:c2:14:04:e1:90"
        },
        "spine_1_1_4": {
            "net0": "d6:92:52:73:9f:34",
            "net1": "62:37:ed:5d:28:42",
            "net10": "0a:a3:41:5d:42:74",
            "net11": "32:d9:1d:01:ca:69",
            "net2": "a6:0b:6d:fd:cc:59",
            "net3": "22:72:b6:6b:72:e0",
            "net4": "4e:15:88:f8:9e:17",
            "net5": "aa:bc:e8:06:06:f3",
            "net6": "16:09:8d:b7:45:4f",
            "net7": "6a:3f:bc:79:aa:91",
            "net8": "56:2a:bd:c7:25:16",
            "net9": "0a:7b:da:5c:a1:95"
        },
        "spine_1_1_5": {
            "net0": "3a:96:cc:e8:9d:be",
            "net1": "fe:cc:e5:30:4c:12",
            "net10": "4a:07:d1:76:b8:69",
            "net11": "be:26:d0:19:72:60",
            "net2": "e2:47:7b:fb:2e:4f",
            "net3": "ce:6c:95:da:03:86",
            "net4": "ca:ed:2c:9d:2f:eb",
            "net5": "4e:74:76:2d:17:06",
            "net6": "9e:b7:ec:3d:c2:c5",
            "net7": "aa:ed:0c:c1:55:2b",
            "net8": "c6:b3:b2:57:cd:21",
            "net9": "ba:3a:bc:62:8e:1d"
        },
        "spine_1_1_6": {
            "net0": "02:52:42:36:93:c3",
            "net1": "be:ba:8b:0b:d2:72",
            "net10": "ce:ce:f4:2f:40:62",
            "net11": "aa:5a:d1:9b:16:b8",
            "net2": "12:e8:a3:0d:0a:72",
            "net3": "36:6c:cd:71:d6:69",
            "net4": "46:34:91:fa:6e:c8",
            "net5": "32:ed:d9:6e:28:28",
            "net6": "26:7b:d1:1a:97:d1",
            "net7": "ba:3a:fd:3b:97:45",
            "net8": "3a:29:65:09:ef:14",
            "net9": "2e:a3:18:3b:b4:f2"
        },
        "spine_2_1_1": {
            "net0": "9e:1b:32:7e:8d:31",
            "net1": "66:fd:c7:ba:be:84",
            "net10": "ee:bc:b9:3c:68:78",
            "net11": "16:97:22:9f:6e:fd",
            "net2": "da:50:a9:ff:0b:ee",
            "net3": "76:91:5c:6c:95:a9",
            "net4": "96:06:27:30:97:96",
            "net5": "8a:19:6b:e7:06:42",
            "net6": "06:2b:49:fd:89:72",
            "net7": "be:56:c1:0a:cd:ec",
            "net8": "7e:84:42:b2:4b:eb",
            "net9": "ea:13:ad:a2:37:ef"
        },
        "spine_2_1_2": {
            "net0": "ba:77:08:c9:b4:10",
            "net1": "de:42:fa:30:5d:1f",
            "net10": "6a:75:46:52:6b:4a",
            "net11": "56:a3:43:fd:a4:53",
            "net2": "8a:fc:d2:0d:50:d5",
            "net3": "3a:67:e0:77:52:8a",
            "net4": "3a:01:1f:2f:a8:f1",
            "net5": "5a:e3:8b:65:b6:74",
            "net6": "ba:ae:d4:a8:62:22",
            "net7": "72:fe:2c:f3:a8:97",
            "net8": "36:fd:9a:24:ef:9d",
            "net9": "9e:9d:4a:aa:d4:25"
        },
        "spine_2_1_3": {
            "net0": "a2:ee:86:44:e5:f7",
            "net1": "52:f5:00:4a:ba:27",
            "net10": "96:a0:55:39:99:23",
            "net11": "de:45:c6:d5:c1:3d",
            "net2": "8e:00:cd:e3:37:a4",
            "net3": "c6:13:cf:64:88:b0",
            "net4": "f2:be:24:30:9d:02",
            "net5": "32:66:b6:c7:70:8e",
            "net6": "32:94:8d:55:fe:45",
            "net7": "02:8f:87:e5:f4:cc",
            "net8": "32:c7:21:c5:25:c0",
            "net9": "22:f9:0b:7a:2c:79"
        },
        "spine_2_1_4": {
            "net0": "5a:4a:99:44:f6:26",
            "net1": "e2:f1:a5:9b:dd:e3",
            "net10": "5a:d6:4b:22:a7:22",
            "net11": "8a:f8:c1:8e:a9:8b",
            "net2": "76:1b:9b:fb:d6:23",
            "net3": "1a:48:3e:15:4f:92",
            "net4": "d6:f4:24:a5:a8:b4",
            "net5": "f6:f0:b5:c3:9b:af",
            "net6": "02:fd:7b:8f:69:56",
            "net7": "6e:e0:f1:ad:90:e9",
            "net8": "0e:08:37:e1:65:92",
            "net9": "a6:87:a9:9f:99:63"
        },
        "spine_2_1_5": {
            "net0": "be:bc:37:a9:b2:d0",
            "net1": "62:33:96:4e:c4:8f",
            "net10": "9e:78:06:1d:d1:bf",
            "net11": "e6:b3:9a:73:91:c9",
            "net2": "c2:68:de:02:77:0e",
            "net3": "92:71:27:dc:fb:2d",
            "net4": "aa:c9:b7:90:da:52",
            "net5": "62:a4:87:e2:2b:4a",
            "net6": "fe:6e:8f:d1:1d:43",
            "net7": "d6:15:2a:93:86:13",
            "net8": "2a:21:a6:e8:f5:bd",
            "net9": "7e:b1:a4:33:4e:89"
        },
        "spine_2_1_6": {
            "net0": "c2:26:24:f6:77:f8",
            "net1": "d2:5b:43:82:d2:03",
            "net10": "a6:47:7d:1e:cf:69",
            "net11": "b2:71:1d:f7:58:b6",
            "net2": "ce:81:5c:25:4f:3c",
            "net3": "f6:99:da:a4:f9:40",
            "net4": "f2:33:e2:e8:ff:a5",
            "net5": "b2:3a:32:d6:f6:71",
            "net6": "02:81:ec:8c:8a:08",
            "net7": "da:2b:7c:0e:b4:9a",
            "net8": "06:5e:41:04:f4:b0",
            "net9": "92:aa:4f:8c:86:40"
        },
        "spine_3_1_1": {
            "net0": "36:6e:85:73:a5:77",
            "net1": "4a:34:de:43:ce:e0",
            "net10": "5e:e8:dd:64:31:08",
            "net11": "8a:39:51:fe:21:63",
            "net2": "26:3f:21:f8:6c:4d",
            "net3": "66:73:aa:e4:24:81",
            "net4": "06:43:9a:de:9a:af",
            "net5": "3a:f6:8c:a8:f8:90",
            "net6": "ba:56:fa:0c:51:04",
            "net7": "9a:cb:22:93:fe:d0",
            "net8": "ee:9a:1a:96:f7:d1",
            "net9": "be:09:16:62:b1:65"
        },
        "spine_3_1_2": {
            "net0": "7e:e4:06:41:5c:21",
            "net1": "2e:57:81:42:d6:f7",
            "net10": "f6:6c:81:4a:c0:cf",
            "net11": "66:87:3a:d1:7e:c5",
            "net2": "96:21:6f:98:dd:27",
            "net3": "76:49:f4:d6:67:e5",
            "net4": "de:5f:ec:df:2d:42",
            "net5": "26:f1:e7:a8:a9:bf",
            "net6": "e6:e6:f9:f1:a6:34",
            "net7": "de:cc:62:19:23:15",
            "net8": "22:8b:7e:0b:3b:80",
            "net9": "b6:f3:f2:8e:1b:68"
        },
        "spine_3_1_3": {
            "net0": "32:4b:07:08:51:19",
            "net1": "8e:90:03:73:ab:2b",
            "net10": "86:36:81:50:06:af",
            "net11": "fa:2d:2f:56:50:7b",
            "net2": "1e:3a:e9:a2:07:9d",
            "net3": "a6:4f:97:a8:64:a4",
            "net4": "22:52:82:d5:f1:fa",
            "net5": "1a:7f:5f:15:a8:53",
            "net6": "56:2b:7b:36:43:02",
            "net7": "3a:86:87:3f:53:25",
            "net8": "d6:03:0e:c4:e9:8a",
            "net9": "fe:f3:e6:b0:7a:9b"
        },
        "spine_3_1_4": {
            "net0": "56:38:f4:f8:7d:68",
            "net1": "66:74:f2:2b:46:31",
            "net10": "e6:18:c5:a2:93:56",
            "net11": "a2:fd:d5:12:1d:19",
            "net2": "e6:5e:39:43:90:48",
            "net3": "16:f9:05:81:ba:d2",
            "net4": "2e:e4:ca:c6:ab:16",
            "net5": "2e:b6:35:33:4b:d2",
            "net6": "6a:ad:4c:c2:3d:3d",
            "net7": "52:0d:e6:dc:5e:91",
            "net8": "b2:3f:b3:52:85:64",
            "net9": "0e:71:05:8c:43:b5"
        },
        "spine_3_1_5": {
            "net0": "9a:0b:44:0c:68:cf",
            "net1": "02:8e:4c:c7:90:c1",
            "net10": "6e:52:3e:26:69:93",
            "net11": "02:bb:c0:f3:d7:97",
            "net2": "36:13:c9:ba:33:2a",
            "net3": "ba:53:06:ff:3b:f2",
            "net4": "ee:75:fe:a5:93:c0",
            "net5": "92:c1:a3:ee:63:7a",
            "net6": "0e:87:0e:99:21:85",
            "net7": "c6:c8:ba:40:8f:ab",
            "net8": "be:db:02:81:88:f9",
            "net9": "c2:f3:f8:72:84:df"
        },
        "spine_3_1_6": {
            "net0": "1a:be:ac:b4:33:ed",
            "net1": "da:f6:7d:22:e9:ca",
            "net10": "22:49:98:dc:c1:ad",
            "net11": "e6:0b:26:fa:65:17",
            "net2": "d6:ff:7a:b5:16:36",
            "net3": "0e:5c:73:96:88:dc",
            "net4": "86:50:6a:27:0f:7c",
            "net5": "7a:2b:bb:2f:95:ab",
            "net6": "7a:a0:34:32:6b:e6",
            "net7": "b2:13:08:ee:6f:f5",
            "net8": "3a:16:fc:b6:7f:f4",
            "net9": "56:e1:0e:1f:4d:6c"
        },
        "spine_4_1_1": {
            "net0": "1e:71:3e:d6:0b:94",
            "net1": "56:e6:0e:14:8b:33",
            "net10": "e2:e0:d1:9f:c0:1f",
            "net11": "56:78:f5:de:52:f8",
            "net2": "3e:5a:d4:c0:0f:51",
            "net3": "6a:16:cf:c9:9c:45",
            "net4": "76:24:44:20:d7:29",
            "net5": "c2:48:9f:c0:7a:e4",
            "net6": "a6:42:25:1f:cb:1f",
            "net7": "2a:f7:89:76:91:74",
            "net8": "16:3a:1a:d3:ed:ee",
            "net9": "c6:ce:ad:c3:64:80"
        },
        "spine_4_1_2": {
            "net0": "2e:4f:40:1f:d5:69",
            "net1": "be:b6:64:9d:33:a3",
            "net10": "fa:83:cf:de:a5:67",
            "net11": "e2:21:02:17:6b:c1",
            "net2": "d2:4c:4b:cb:f6:80",
            "net3": "8a:57:6d:97:66:36",
            "net4": "5a:80:2f:40:93:84",
            "net5": "d2:38:cf:23:dd:51",
            "net6": "32:fa:2d:2f:ce:b8",
            "net7": "fe:da:03:08:b9:ee",
            "net8": "96:d3:bb:93:63:3e",
            "net9": "5a:c1:e6:49:af:94"
        },
        "spine_4_1_3": {
            "net0": "6a:f5:e2:45:b3:e5",
            "net1": "12:c1:e4:68:a1:9f",
            "net10": "26:a2:96:6d:62:33",
            "net11": "52:00:68:46:e1:b7",
            "net2": "0e:2f:92:7a:12:ba",
            "net3": "1a:88:43:64:7c:33",
            "net4": "46:1d:aa:67:eb:29",
            "net5": "1a:ee:00:d5:40:b9",
            "net6": "42:37:31:37:85:3b",
            "net7": "e2:91:8e:51:c3:bb",
            "net8": "ae:87:0a:04:15:58",
            "net9": "66:d5:2b:d0:85:f4"
        },
        "spine_4_1_4": {
            "net0": "76:ac:4c:e1:e6:ca",
            "net1": "ae:43:31:4c:bd:74",
            "net10": "46:1e:3a:36:d5:71",
            "net11": "7e:d4:06:b5:3e:07",
            "net2": "c6:7c:b6:02:c6:4e",
            "net3": "52:e0:09:93:15:3c",
            "net4": "9e:79:da:e9:fa:dc",
            "net5": "62:bb:b9:be:97:5b",
            "net6": "a6:f9:93:4e:d7:6b",
            "net7": "1a:14:81:96:20:1b",
            "net8": "76:f2:c7:37:61:e5",
            "net9": "02:7e:e4:14:e8:8a"
        },
        "spine_4_1_5": {
            "net0": "32:54:20:49:fa:63",
            "net1": "2a:9a:0c:51:29:13",
            "net10": "0e:42:ef:58:ee:ff",
            "net11": "36:4b:d2:9e:94:7c",
            "net2": "ca:1e:64:0c:6e:8f",
            "net3": "9e:bf:43:ef:a4:6a",
            "net4": "3a:48:e3:5c:36:2c",
            "net5": "9a:1e:02:d3:dd:eb",
            "net6": "16:96:98:e5:45:c8",
            "net7": "2a:a5:45:98:f7:6d",
            "net8": "52:c6:de:43:88:9a",
            "net9": "9a:23:2b:e0:5f:fa"
        },
        "spine_4_1_6": {
            "net0": "be:ec:ea:78:eb:e2",
            "net1": "06:de:3c:3b:fb:d2",
            "net10": "e2:dd:68:54:c5:ae",
            "net11": "7e:f2:de:7d:fa:25",
            "net2": "06:69:22:09:c2:c7",
            "net3": "52:08:0b:e9:12:89",
            "net4": "fe:6a:9a:8c:59:c1",
            "net5": "8a:ac:db:9e:21:f5",
            "net6": "92:c5:42:2a:65:76",
            "net7": "92:d0:72:05:21:2f",
            "net8": "06:7f:9c:f3:95:02",
            "net9": "26:8d:52:ab:c4:c8"
        },
        "spine_5_1_1": {
            "net0": "fe:86:a5:3a:af:80",
            "net1": "56:3b:45:92:c6:67",
            "net10": "c6:3c:8b:6e:bd:51",
            "net11": "9e:2a:b2:7e:7b:71",
            "net2": "92:18:96:53:f7:70",
            "net3": "f2:cc:16:d5:7e:0a",
            "net4": "96:c6:21:83:33:a7",
            "net5": "1a:6d:c8:e4:0c:f7",
            "net6": "02:c3:68:ce:48:33",
            "net7": "6e:fb:fb:ba:61:e5",
            "net8": "1e:65:4e:46:ab:b1",
            "net9": "76:05:0e:67:e8:c0"
        },
        "spine_5_1_2": {
            "net0": "fe:65:51:4a:b3:2f",
            "net1": "2e:f4:27:0b:f9:72",
            "net10": "4e:63:ae:2b:16:97",
            "net11": "52:c4:aa:78:16:cb",
            "net2": "e6:b7:a1:83:72:4b",
            "net3": "fa:4d:f1:11:dc:ea",
            "net4": "f2:ed:76:85:a6:62",
            "net5": "da:8b:e0:c5:42:2b",
            "net6": "76:d6:61:27:b5:41",
            "net7": "46:57:13:c9:ef:ad",
            "net8": "c2:bc:11:dc:6a:43",
            "net9": "76:b7:7c:a0:7d:7b"
        },
        "spine_5_1_3": {
            "net0": "ae:00:c2:71:38:88",
            "net1": "c2:6f:0e:68:ba:65",
            "net10": "ca:ce:bc:64:e3:69",
            "net11": "5a:54:35:92:ec:f3",
            "net2": "8e:f9:00:66:77:3d",
            "net3": "3e:dd:88:75:fa:4b",
            "net4": "16:0f:e7:7d:86:8b",
            "net5": "0e:ee:19:a4:35:e4",
            "net6": "c6:02:1a:ad:e7:95",
            "net7": "ea:78:5f:cc:d6:02",
            "net8": "4e:8a:44:71:88:6d",
            "net9": "2e:ce:83:a4:f4:8a"
        },
        "spine_5_1_4": {
            "net0": "16:54:85:2a:e6:8e",
            "net1": "fa:70:d7:b7:33:fa",
            "net10": "0a:38:aa:32:19:a0",
            "net11": "12:68:66:79:6a:2b",
            "net2": "7a:bb:11:18:8d:5d",
            "net3": "e6:3f:e3:ba:06:b4",
            "net4": "e6:8b:cd:05:16:2e",
            "net5": "ae:df:0c:bf:22:f8",
            "net6": "82:6b:da:48:0b:17",
            "net7": "8e:f4:fc:95:d4:5b",
            "net8": "12:70:d9:50:03:12",
            "net9": "5a:b2:41:b9:c7:46"
        },
        "spine_5_1_5": {
            "net0": "92:bb:70:8f:8e:ee",
            "net1": "b6:ec:92:96:a2:6a",
            "net10": "0a:b0:28:68:d8:5d",
            "net11": "76:c8:0d:bb:aa:7d",
            "net2": "0a:7e:0c:30:08:59",
            "net3": "e2:d6:b7:df:2f:ff",
            "net4": "1e:b5:53:f5:e2:07",
            "net5": "ba:5c:77:a1:3b:51",
            "net6": "ea:76:eb:60:36:00",
            "net7": "aa:d8:f9:69:45:35",
            "net8": "a2:ef:14:6f:55:57",
            "net9": "aa:c6:0c:c9:88:78"
        },
        "spine_5_1_6": {
            "net0": "52:64:4e:dd:b2:49",
            "net1": "fa:41:8f:9c:82:9d",
            "net10": "06:d4:c5:cf:49:45",
            "net11": "4e:ed:a6:97:e6:02",
            "net2": "3a:cb:a5:14:56:2d",
            "net3": "ce:d8:89:61:48:e0",
            "net4": "3e:6c:0f:ae:24:c8",
            "net5": "3a:62:85:78:16:a2",
            "net6": "0e:5c:99:6a:88:5f",
            "net7": "fe:96:f8:19:ba:72",
            "net8": "ba:a0:7b:63:45:58",
            "net9": "ea:78:04:1c:4e:9e"
        },
        "spine_6_1_1": {
            "net0": "aa:00:1c:e8:f4:55",
            "net1": "fa:27:43:19:78:5c",
            "net10": "52:6f:f0:e7:5c:ec",
            "net11": "c6:cd:56:d1:84:71",
            "net2": "4a:05:5e:e4:9d:3f",
            "net3": "42:07:f4:80:a0:e7",
            "net4": "8a:13:36:21:37:e2",
            "net5": "ba:77:d0:f6:82:46",
            "net6": "ea:71:03:a6:a2:0b",
            "net7": "96:e4:ab:78:71:a3",
            "net8": "7a:ec:e9:9a:d5:6a",
            "net9": "9e:01:5c:7b:d7:f7"
        },
        "spine_6_1_2": {
            "net0": "6a:ad:7c:2a:2e:1e",
            "net1": "de:3c:bc:cc:35:57",
            "net10": "96:3a:67:4a:db:07",
            "net11": "6a:3d:73:15:ae:10",
            "net2": "72:e5:73:bd:a3:d5",
            "net3": "6e:74:84:9e:1e:d9",
            "net4": "f6:31:8d:0e:10:f0",
            "net5": "72:23:57:fb:b5:d1",
            "net6": "52:90:de:77:6d:f7",
            "net7": "b2:ec:8f:df:9a:5f",
            "net8": "56:9a:d4:76:86:e4",
            "net9": "82:0b:a5:12:72:b0"
        },
        "spine_6_1_3": {
            "net0": "2a:83:95:ef:1a:29",
            "net1": "f6:9c:32:47:24:de",
            "net10": "56:8e:a6:77:92:71",
            "net11": "42:2b:f4:a2:e3:26",
            "net2": "42:b2:e6:2c:64:01",
            "net3": "76:c3:b5:df:cd:69",
            "net4": "6e:60:e0:a1:88:96",
            "net5": "36:42:aa:04:fe:9f",
            "net6": "ee:9b:a1:10:4e:89",
            "net7": "e2:a3:1c:4f:e3:2b",
            "net8": "ea:9b:1b:76:aa:d8",
            "net9": "3a:b9:97:cf:9b:7a"
        },
        "spine_6_1_4": {
            "net0": "26:71:52:52:3d:8a",
            "net1": "ee:24:17:66:f6:72",
            "net10": "4e:14:43:ac:e1:f3",
            "net11": "42:3f:d9:e0:b7:54",
            "net2": "46:fb:a5:3a:68:20",
            "net3": "f6:0a:60:87:16:ac",
            "net4": "6e:e1:85:a1:a6:d4",
            "net5": "5a:8e:59:a7:b3:33",
            "net6": "06:00:2a:7d:1a:09",
            "net7": "aa:9f:90:42:50:24",
            "net8": "52:1e:7c:a1:49:d4",
            "net9": "9e:79:d9:67:50:77"
        },
        "spine_6_1_5": {
            "net0": "6e:7e:4b:e7:52:13",
            "net1": "0a:3d:b1:f7:c0:b8",
            "net10": "46:42:df:22:6e:0e",
            "net11": "3e:34:57:f5:19:06",
            "net2": "72:ab:7c:f9:85:0d",
            "net3": "66:0f:b1:8a:87:bf",
            "net4": "9a:91:59:e6:de:2a",
            "net5": "16:66:ad:3b:cc:e1",
            "net6": "3e:00:7f:b3:cd:8a",
            "net7": "76:87:45:6a:82:02",
            "net8": "6e:5b:0f:2b:29:6d",
            "net9": "ae:e0:f5:09:64:4d"
        },
        "spine_6_1_6": {
            "net0": "c2:fc:4d:09:dd:e7",
            "net1": "f6:d7:49:81:14:f1",
            "net10": "be:b5:45:c5:77:9b",
            "net11": "f2:7d:b0:1e:02:bb",
            "net2": "0a:84:40:6e:fb:ac",
            "net3": "2a:21:d8:c4:8f:96",
            "net4": "d6:74:dd:83:7a:ee",
            "net5": "16:f3:e5:44:bd:67",
            "net6": "62:2f:3d:f4:b3:9e",
            "net7": "c6:e8:1f:73:24:c3",
            "net8": "96:a3:99:3e:51:0e",
            "net9": "06:86:aa:1e:8b:e6"
        },
        "tof_1_2_1": {
            "net0": "e6:d5:3f:ed:87:79",
            "net1": "b2:e5:61:8c:c5:bb",
            "net10": "82:64:d8:88:fa:f2",
            "net11": "92:5c:0d:16:ac:87",
            "net2": "8a:ad:30:f5:d0:8e",
            "net3": "32:23:90:77:d9:4e",
            "net4": "42:7b:7b:b3:5f:ba",
            "net5": "ca:d3:dd:4c:bd:e4",
            "net6": "0a:22:36:f2:a7:d8",
            "net7": "4e:34:02:36:1d:46",
            "net8": "5e:03:96:4c:4d:0b",
            "net9": "52:d1:42:ea:e9:18"
        },
        "tof_1_2_2": {
            "net0": "a6:d6:d3:11:e9:b7",
            "net1": "6e:df:9c:06:09:77",
            "net10": "3e:30:94:01:cf:ac",
            "net11": "a6:88:ab:5f:46:11",
            "net2": "4e:84:34:40:19:85",
            "net3": "52:8d:5f:be:18:30",
            "net4": "c6:7b:3c:09:3d:20",
            "net5": "3a:9a:5d:8a:d3:94",
            "net6": "4a:2e:de:42:08:fd",
            "net7": "86:27:22:6a:e1:c5",
            "net8": "a6:5a:ce:a4:0c:a0",
            "net9": "6a:19:a1:c1:e2:8f"
        },
        "tof_1_2_3": {
            "net0": "32:e3:fe:1e:e4:48",
            "net1": "f2:60:e5:8f:34:df",
            "net10": "52:0c:a0:fb:fc:12",
            "net11": "6e:15:9d:06:fb:77",
            "net2": "b2:1d:12:52:cc:8b",
            "net3": "aa:c6:d3:05:0f:fa",
            "net4": "2e:99:d1:78:45:20",
            "net5": "0a:73:ac:65:77:e0",
            "net6": "1e:9d:66:ef:99:2e",
            "net7": "52:cb:21:cc:70:0e",
            "net8": "86:71:f6:f9:63:8d",
            "net9": "6e:21:2d:a5:7f:22"
        },
        "tof_1_2_4": {
            "net0": "1a:8d:00:9b:fa:c2",
            "net1": "8a:da:1c:2e:6a:79",
            "net10": "66:95:90:60:15:54",
            "net11": "ee:c8:bc:a9:80:4c",
            "net2": "3a:7f:d6:5a:5b:b5",
            "net3": "c2:d7:cc:a4:7e:ab",
            "net4": "8e:82:af:c9:d9:c8",
            "net5": "82:47:80:ca:ac:73",
            "net6": "4e:16:59:ec:b5:8b",
            "net7": "4e:a3:b0:f1:07:96",
            "net8": "c2:0f:a4:97:94:7b",
            "net9": "e6:47:3c:4d:8a:e5"
        },
        "tof_1_2_5": {
            "net0": "ae:5b:97:0a:c0:61",
            "net1": "1a:1e:6a:0a:13:53",
            "net10": "c2:18:c7:ab:1e:15",
            "net11": "02:19:24:61:ac:ae",
            "net2": "46:84:bc:33:e5:37",
            "net3": "66:c4:1e:34:db:1e",
            "net4": "be:13:dc:f9:d8:69",
            "net5": "ba:2f:37:43:56:a7",
            "net6": "d6:8c:37:33:ec:a2",
            "net7": "6e:7a:4b:1d:1f:b9",
            "net8": "86:e8:8b:0a:3f:d6",
            "net9": "ba:2e:1d:f5:56:cf"
        },
        "tof_1_2_6": {
            "net0": "46:12:9f:08:2c:b5",
            "net1": "82:33:a2:bc:ce:41",
            "net10": "9a:f2:0a:b9:d9:e1",
            "net11": "9e:c7:12:85:c7:0d",
            "net2": "96:39:71:5a:c2:6a",
            "net3": "6e:9e:a8:8d:07:47",
            "net4": "e2:bd:4f:91:51:5d",
            "net5": "ce:19:c4:c5:9a:b4",
            "net6": "86:e5:0e:79:59:19",
            "net7": "0e:15:a7:f9:d0:b5",
            "net8": "46:bb:c6:3b:76:d6",
            "net9": "92:08:5c:17:9d:8a"
        },
        "tof_2_2_1": {
            "net0": "3a:4b:77:f5:c7:7a",
            "net1": "4e:81:6c:96:21:71",
            "net10": "aa:59:84:69:6c:63",
            "net11": "52:a1:8a:be:10:1c",
            "net2": "9e:02:91:e5:2d:53",
            "net3": "66:93:c4:73:33:8a",
            "net4": "ee:e3:a3:36:5e:3b",
            "net5": "d6:99:21:59:bc:87",
            "net6": "e6:0a:e6:54:4a:fb",
            "net7": "4e:47:06:25:fb:a9",
            "net8": "e2:e9:e9:61:d3:09",
            "net9": "0e:96:ed:8b:c0:ed"
        },
        "tof_2_2_2": {
            "net0": "5e:24:6e:e0:c1:c5",
            "net1": "9e:ba:a2:3a:28:17",
            "net10": "76:82:62:41:f1:75",
            "net11": "a2:d3:79:af:a1:03",
            "net2": "c2:b2:25:1f:3c:11",
            "net3": "ea:d5:21:a7:77:72",
            "net4": "6a:97:4f:b0:20:42",
            "net5": "fe:1e:aa:f9:11:b9",
            "net6": "ea:cf:8c:e0:72:ea",
            "net7": "be:2f:0f:70:44:f0",
            "net8": "e6:49:70:93:8a:b3",
            "net9": "c2:99:33:18:c7:26"
        },
        "tof_2_2_3": {
            "net0": "8a:38:7f:1c:87:a2",
            "net1": "ca:b7:be:21:5d:02",
            "net10": "4e:e4:b4:49:45:cf",
            "net11": "8a:fa:50:6d:a7:b0",
            "net2": "8e:8f:57:0b:bc:5e",
            "net3": "fa:65:06:5a:2e:04",
            "net4": "ce:74:80:72:45:2d",
            "net5": "ee:ec:50:62:af:3e",
            "net6": "ee:fe:8f:49:64:2a",
            "net7": "ca:7a:92:1e:32:ad",
            "net8": "f2:19:c8:20:15:24",
            "net9": "2e:80:56:dd:b9:86"
        },
        "tof_2_2_4": {
            "net0": "e2:d7:05:13:ca:50",
            "net1": "1e:ca:e6:a9:1c:c9",
            "net10": "2a:4f:63:a2:42:db",
            "net11": "b6:b8:ed:02:af:6c",
            "net2": "5a:78:a7:c0:b0:81",
            "net3": "1a:58:c6:56:6b:9d",
            "net4": "0a:5d:da:5c:52:6a",
            "net5": "66:44:61:42:4c:63",
            "net6": "a6:8c:de:ec:b9:ef",
            "net7": "12:b2:aa:eb:f3:b8",
            "net8": "32:36:18:ad:cd:c3",
            "net9": "66:6c:c2:0f:d0:62"
        },
        "tof_2_2_5": {
            "net0": "de:26:20:37:a0:fb",
            "net1": "62:73:c0:04:35:00",
            "net10": "c2:a1:07:86:82:ce",
            "net11": "56:77:eb:0d:a2:9c",
            "net2": "f2:4f:62:d4:02:5c",
            "net3": "be:fa:d6:96:ac:d3",
            "net4": "ae:0e:18:94:4f:b6",
            "net5": "c6:6d:0e:b8:23:99",
            "net6": "42:ed:ae:ca:cf:da",
            "net7": "62:43:e4:4c:c3:c3",
            "net8": "42:39:64:a1:f7:ac",
            "net9": "fe:22:30:50:2c:6d"
        },
        "tof_2_2_6": {
            "net0": "8a:f6:65:f6:a8:cb",
            "net1": "56:27:79:53:d6:db",
            "net10": "ba:55:37:07:a4:03",
            "net11": "f6:cc:42:ef:f3:a4",
            "net2": "4e:55:83:46:9c:4f",
            "net3": "16:fa:48:ed:47:7a",
            "net4": "8e:ad:98:a0:b0:b4",
            "net5": "4a:5a:74:46:a4:28",
            "net6": "ea:66:53:8b:b2:75",
            "net7": "aa:8f:30:13:de:29",
            "net8": "6e:68:37:c0:dd:d6",
            "net9": "2a:b5:23:a0:ed:37"
        },
        "tof_3_2_1": {
            "net0": "82:ba:cf:f7:e9:5e",
            "net1": "f2:90:50:9a:03:3d",
            "net10": "56:81:08:d2:a5:7e",
            "net11": "32:8b:a9:a7:f4:1e",
            "net2": "0a:7e:85:26:78:1b",
            "net3": "6e:1f:d3:96:8d:14",
            "net4": "46:06:d5:d5:fb:31",
            "net5": "56:64:00:c2:15:c5",
            "net6": "56:67:a9:9f:95:5a",
            "net7": "da:27:b1:70:3c:e0",
            "net8": "2e:03:b3:83:72:02",
            "net9": "6e:82:31:9b:14:72"
        },
        "tof_3_2_2": {
            "net0": "ba:ae:14:6e:4e:5e",
            "net1": "66:0b:c3:61:76:78",
            "net10": "2a:03:3e:a6:d6:c6",
            "net11": "6a:f2:e0:d4:1c:32",
            "net2": "1a:80:52:af:2d:b2",
            "net3": "6a:67:09:9b:24:ac",
            "net4": "a6:fe:5f:ad:bd:69",
            "net5": "26:65:b4:fc:fa:0d",
            "net6": "66:dc:c0:13:21:7c",
            "net7": "3a:b2:3b:56:69:bb",
            "net8": "0e:3c:41:2d:c3:65",
            "net9": "ee:9f:a5:4e:03:47"
        },
        "tof_3_2_3": {
            "net0": "5a:bb:47:ec:db:70",
            "net1": "7e:13:8b:cf:a0:57",
            "net10": "26:a1:08:4a:d3:6d",
            "net11": "b2:59:67:6a:b0:8f",
            "net2": "e2:26:a1:9e:7c:4c",
            "net3": "2e:f6:9c:a5:f3:bd",
            "net4": "fe:4e:99:2f:5b:1d",
            "net5": "f6:ee:da:3e:86:81",
            "net6": "42:d3:1b:3b:1d:74",
            "net7": "36:13:02:bb:01:86",
            "net8": "82:21:7b:bf:8f:cf",
            "net9": "fa:7a:73:a4:ae:b7"
        },
        "tof_3_2_4": {
            "net0": "ea:ef:05:c0:a7:17",
            "net1": "5a:4b:27:4e:52:b4",
            "net10": "72:97:c2:3b:c9:15",
            "net11": "86:2d:d9:1d:ff:09",
            "net2": "5a:19:0d:a3:78:fe",
            "net3": "c6:3c:b9:95:9e:9f",
            "net4": "7e:b7:99:b4:39:77",
            "net5": "76:b3:48:d5:3f:15",
            "net6": "d2:c3:85:53:8e:d0",
            "net7": "2e:91:51:42:1b:39",
            "net8": "d6:27:7e:38:e0:91",
            "net9": "6a:eb:f5:17:fe:71"
        },
        "tof_3_2_5": {
            "net0": "ee:2e:91:04:ef:68",
            "net1": "b6:e0:96:c8:51:79",
            "net10": "a6:77:3d:4d:a2:61",
            "net11": "ea:b0:80:8b:50:e7",
            "net2": "92:96:a3:03:94:4c",
            "net3": "52:39:cf:1a:94:af",
            "net4": "3a:41:6d:f6:31:e5",
            "net5": "56:81:2d:f6:f7:8d",
            "net6": "66:22:d9:34:04:3e",
            "net7": "96:24:c5:d2:03:cc",
            "net8": "8a:40:3b:51:fa:09",
            "net9": "96:b2:e7:e4:f2:4a"
        },
        "tof_3_2_6": {
            "net0": "1e:2a:8b:79:d5:71",
            "net1": "62:00:ff:97:10:4b",
            "net10": "ca:79:9e:2e:c5:4f",
            "net11": "e6:d1:8f:7b:91:a2",
            "net2": "a2:a5:c7:73:59:3c",
            "net3": "b2:4d:27:78:aa:6f",
            "net4": "9a:d1:03:75:61:36",
            "net5": "6a:69:2d:29:4e:3d",
            "net6": "ae:ca:af:16:cb:26",
            "net7": "3a:67:ce:b0:9e:2d",
            "net8": "b6:c2:a7:ae:36:67",
            "net9": "72:33:d3:b9:36:03"
        }
    },
    "failed_machine": "leaf_1_0_1",
    "failed_interfaces": [
        "net0"
    ],
    "failure_time": 1614959060.6536446,
    "recover_time": 1614959301.3939912
}