{
    "k_leaf": 10,
    "k_top": 10,
    "redundancy_factor": 5,
    "is_k8s": true,
    "machine_mac_addresses": {
        "leaf_1_0_1": {
            "net0": "82:ae:47:b3:4b:61",
            "net1": "3e:3b:d5:b6:c3:7e",
            "net10": "0e:8a:5e:ef:82:26",
            "net2": "3a:75:c1:76:40:8f",
            "net3": "9e:8b:db:c8:8a:01",
            "net4": "9e:88:21:3c:c0:07",
            "net5": "de:98:40:99:1a:8c",
            "net6": "0e:65:a7:21:15:9b",
            "net7": "de:68:5a:1d:83:2e",
            "net8": "7e:96:55:f5:d9:30",
            "net9": "aa:2a:c4:3e:f6:93"
        },
        "leaf_1_0_10": {
            "net0": "02:6e:5f:ad:ec:6f",
            "net1": "3a:d5:b2:e5:49:37",
            "net10": "ee:51:8b:14:5f:59",
            "net2": "b6:7f:95:9e:7f:b2",
            "net3": "ba:8e:ab:72:3a:26",
            "net4": "72:8d:5f:9d:90:5e",
            "net5": "aa:79:13:b5:e3:cf",
            "net6": "ea:18:94:36:27:66",
            "net7": "32:b1:5e:af:da:47",
            "net8": "72:29:fb:24:df:9d",
            "net9": "8e:6f:21:ce:11:7e"
        },
        "leaf_1_0_2": {
            "net0": "4a:b2:db:09:5b:80",
            "net1": "2e:8b:f8:ea:af:15",
            "net10": "0e:c7:47:32:3e:55",
            "net2": "da:53:8e:55:92:88",
            "net3": "5a:87:3b:59:65:a4",
            "net4": "3a:e9:99:65:e0:c9",
            "net5": "aa:d7:19:55:86:59",
            "net6": "ba:d5:c7:68:35:ad",
            "net7": "b2:d2:49:d1:7d:5d",
            "net8": "8e:60:bb:d2:c1:3d",
            "net9": "6a:a4:5a:0f:92:7f"
        },
        "leaf_1_0_3": {
            "net0": "56:12:c6:58:fa:bb",
            "net1": "aa:b6:df:fb:da:6a",
            "net10": "7a:4a:da:57:db:7e",
            "net2": "7e:43:04:42:c9:56",
            "net3": "f6:38:66:82:98:36",
            "net4": "6e:69:7f:3f:f3:e3",
            "net5": "7e:1f:c5:88:d7:81",
            "net6": "66:02:d9:cf:a7:6a",
            "net7": "6e:ab:16:22:f2:c6",
            "net8": "5e:44:f4:77:a9:c3",
            "net9": "e2:1b:74:2a:ca:97"
        },
        "leaf_1_0_4": {
            "net0": "1e:0a:01:9b:fa:79",
            "net1": "62:c6:c9:e1:f5:69",
            "net10": "82:de:3f:34:fd:06",
            "net2": "9a:39:6d:36:97:fb",
            "net3": "c6:f2:1b:d0:4b:42",
            "net4": "ea:f0:03:12:74:df",
            "net5": "c2:3b:9e:12:34:2b",
            "net6": "06:46:50:dc:d5:3a",
            "net7": "1a:66:bb:b2:b6:64",
            "net8": "a6:59:da:03:6d:c7",
            "net9": "d2:76:cc:30:48:88"
        },
        "leaf_1_0_5": {
            "net0": "6e:e3:92:b8:28:73",
            "net1": "6a:9e:bb:33:2f:c3",
            "net10": "8e:59:c4:03:51:40",
            "net2": "4a:ee:30:8b:67:87",
            "net3": "12:ae:02:17:5c:b7",
            "net4": "b6:b5:21:c6:54:fd",
            "net5": "42:c1:14:a6:67:f2",
            "net6": "36:48:3f:05:a7:e2",
            "net7": "66:43:a1:a0:0a:a3",
            "net8": "16:68:28:d2:6a:19",
            "net9": "ca:68:fb:ba:91:09"
        },
        "leaf_1_0_6": {
            "net0": "16:04:a5:8d:f7:39",
            "net1": "1e:0b:53:c6:02:5e",
            "net10": "a6:72:8d:36:c2:2e",
            "net2": "2e:56:80:1e:0e:fc",
            "net3": "7a:87:5f:f0:b4:43",
            "net4": "72:02:0f:e3:30:30",
            "net5": "7e:d9:f3:7c:a7:8c",
            "net6": "b6:98:33:9f:df:5f",
            "net7": "c2:bc:a2:2f:a5:78",
            "net8": "7e:27:ee:9d:e8:bb",
            "net9": "ca:3e:b8:48:0a:8e"
        },
        "leaf_1_0_7": {
            "net0": "b2:d7:7a:17:a5:52",
            "net1": "42:14:30:37:23:ae",
            "net10": "ee:f2:16:6e:5e:03",
            "net2": "fe:6c:72:1a:81:3a",
            "net3": "3e:a0:58:64:43:dc",
            "net4": "86:92:3b:ef:4b:c9",
            "net5": "6a:26:41:25:af:87",
            "net6": "a2:7e:d1:b3:c1:6c",
            "net7": "a2:fc:cc:43:b5:4f",
            "net8": "e2:2a:bd:73:65:b9",
            "net9": "ae:df:d6:cb:93:b9"
        },
        "leaf_1_0_8": {
            "net0": "f6:af:f8:2b:86:08",
            "net1": "06:90:50:44:91:8c",
            "net10": "26:f2:a8:5a:5c:0a",
            "net2": "4e:40:e8:a8:56:26",
            "net3": "4a:07:0d:32:0a:a8",
            "net4": "ba:60:9d:f4:dc:41",
            "net5": "2e:da:73:28:2e:90",
            "net6": "22:e3:53:14:ef:6c",
            "net7": "0e:23:cf:4e:96:7b",
            "net8": "2a:43:8b:62:6c:ca",
            "net9": "ae:12:04:d1:91:31"
        },
        "leaf_1_0_9": {
            "net0": "76:32:bd:ee:49:a1",
            "net1": "3e:5c:41:e5:db:ae",
            "net10": "aa:66:35:a9:04:a7",
            "net2": "6e:3a:0a:20:c9:ab",
            "net3": "12:a8:21:7d:d2:c6",
            "net4": "ba:a0:f4:6b:d5:12",
            "net5": "fe:dc:05:32:03:d2",
            "net6": "2a:83:88:d2:86:3e",
            "net7": "f2:3b:14:3b:30:f5",
            "net8": "56:ad:c7:ff:17:82",
            "net9": "96:59:07:c0:dd:ba"
        },
        "leaf_2_0_1": {
            "net0": "ce:ea:51:53:79:00",
            "net1": "ae:f5:8d:52:49:6d",
            "net10": "e2:87:40:ef:b0:5b",
            "net2": "c2:55:13:48:ca:d2",
            "net3": "ee:23:e3:1e:23:7b",
            "net4": "2e:33:9c:47:fc:39",
            "net5": "5a:62:fe:d8:6c:72",
            "net6": "92:ff:c6:9e:ea:41",
            "net7": "46:b2:d9:b6:0f:5d",
            "net8": "72:6c:f2:4d:cc:18",
            "net9": "fe:7e:44:93:0d:e8"
        },
        "leaf_2_0_10": {
            "net0": "0e:98:c1:e3:ea:ad",
            "net1": "6e:23:68:ca:63:71",
            "net10": "e2:69:46:da:e0:1e",
            "net2": "4a:07:9b:f4:ea:56",
            "net3": "72:d4:64:25:90:2c",
            "net4": "2a:b5:3a:b0:2b:10",
            "net5": "3e:f7:06:e9:de:fa",
            "net6": "1a:e2:6a:7b:1f:cb",
            "net7": "ee:9f:c5:ee:92:23",
            "net8": "72:6c:82:ee:bf:4f",
            "net9": "f6:0c:fc:63:44:dc"
        },
        "leaf_2_0_2": {
            "net0": "6a:76:0b:17:43:1f",
            "net1": "d6:1d:d8:b0:0b:65",
            "net10": "7a:28:9a:6a:21:77",
            "net2": "32:0e:3a:24:96:04",
            "net3": "1e:d9:a2:1c:3d:db",
            "net4": "de:e1:5a:7e:65:16",
            "net5": "02:ce:15:7c:28:f5",
            "net6": "32:4a:eb:a0:0f:b8",
            "net7": "ee:68:30:42:32:d9",
            "net8": "52:00:73:90:ee:b7",
            "net9": "82:45:36:5b:98:9d"
        },
        "leaf_2_0_3": {
            "net0": "be:c5:bb:28:50:ee",
            "net1": "a6:75:b7:6d:84:f3",
            "net10": "a2:0b:74:15:9c:60",
            "net2": "c6:94:0b:11:13:63",
            "net3": "da:df:ef:e0:d1:38",
            "net4": "72:44:a7:43:70:ee",
            "net5": "d6:93:32:0d:39:f5",
            "net6": "02:16:7c:df:46:71",
            "net7": "0e:0a:a2:38:7f:40",
            "net8": "0e:aa:93:bc:47:bb",
            "net9": "7e:26:87:84:0c:b0"
        },
        "leaf_2_0_4": {
            "net0": "12:dc:ff:fb:53:d7",
            "net1": "a2:1d:c9:51:6b:9f",
            "net10": "62:46:4b:77:e0:e6",
            "net2": "26:d9:3a:bf:ba:9e",
            "net3": "6a:a4:4f:3b:e8:31",
            "net4": "02:06:87:70:95:3d",
            "net5": "d2:e0:a6:12:17:9d",
            "net6": "a2:d6:e3:7a:f9:72",
            "net7": "26:7c:d9:dc:97:19",
            "net8": "9e:e2:8a:ea:01:6e",
            "net9": "6a:b4:0f:95:fb:ff"
        },
        "leaf_2_0_5": {
            "net0": "ae:e6:0c:f7:4d:b3",
            "net1": "ea:a0:7f:1a:c2:4f",
            "net10": "6e:7d:1a:aa:0c:86",
            "net2": "4a:37:5d:97:5c:8a",
            "net3": "1a:01:af:be:82:59",
            "net4": "36:37:c0:a9:5d:75",
            "net5": "a2:e4:a2:6d:97:e3",
            "net6": "f2:6c:d7:65:7e:9b",
            "net7": "da:34:06:14:da:b4",
            "net8": "ae:a2:20:f7:21:1e",
            "net9": "d6:7c:6f:ec:ba:c5"
        },
        "leaf_2_0_6": {
            "net0": "e6:c5:16:78:b5:58",
            "net1": "72:cc:03:e2:1f:68",
            "net10": "a2:33:ea:25:38:45",
            "net2": "5e:01:77:ae:8a:cf",
            "net3": "3e:6b:bf:94:6e:b5",
            "net4": "3a:ce:fd:7e:cc:1d",
            "net5": "ea:aa:2d:3b:48:c7",
            "net6": "fe:bc:27:9d:b6:c1",
            "net7": "c6:3d:55:68:86:1e",
            "net8": "0a:71:5e:51:54:3a",
            "net9": "1a:c4:da:0d:01:40"
        },
        "leaf_2_0_7": {
            "net0": "c6:57:81:78:f7:c0",
            "net1": "76:89:72:48:6f:88",
            "net10": "a2:cd:e6:d3:91:8b",
            "net2": "ae:2e:65:5c:8e:ce",
            "net3": "e2:da:a6:a3:33:6e",
            "net4": "36:7b:b4:f1:5c:55",
            "net5": "ba:38:fd:54:14:4f",
            "net6": "6e:de:b7:73:9e:d7",
            "net7": "e2:7c:b9:b8:af:52",
            "net8": "c6:ce:22:cb:14:98",
            "net9": "82:3b:20:36:7c:30"
        },
        "leaf_2_0_8": {
            "net0": "8a:09:b2:40:60:79",
            "net1": "c6:7d:9c:2c:a2:f3",
            "net10": "4e:9d:71:9b:4a:2a",
            "net2": "b2:a2:65:7d:cb:1c",
            "net3": "d6:b4:f9:37:c5:61",
            "net4": "52:bd:c7:3d:ec:cd",
            "net5": "c6:69:47:f4:d5:26",
            "net6": "32:27:df:a7:92:73",
            "net7": "2e:13:8c:95:7a:02",
            "net8": "26:54:2d:94:3a:15",
            "net9": "1e:e2:02:5b:c9:9f"
        },
        "leaf_2_0_9": {
            "net0": "fe:37:bb:14:a9:98",
            "net1": "de:91:b7:9f:3c:11",
            "net10": "5e:de:9e:b4:c5:39",
            "net2": "5e:b8:03:94:0d:df",
            "net3": "b6:26:dc:69:40:5e",
            "net4": "96:1d:96:5c:98:9b",
            "net5": "86:71:8e:1e:b9:64",
            "net6": "02:50:c0:ab:02:51",
            "net7": "8e:c9:60:c5:e4:bb",
            "net8": "0a:dd:88:cd:a3:ed",
            "net9": "3e:64:9b:a3:de:e0"
        },
        "leaf_3_0_1": {
            "net0": "a2:c9:63:01:12:84",
            "net1": "f2:f8:74:58:be:47",
            "net10": "fa:18:a8:4c:1f:e1",
            "net2": "ae:7d:b1:34:30:75",
            "net3": "12:20:be:08:77:e2",
            "net4": "12:3e:06:03:99:c7",
            "net5": "5e:22:e8:94:72:8d",
            "net6": "02:d0:2b:a8:29:69",
            "net7": "2a:dc:63:83:73:71",
            "net8": "6a:08:99:0e:21:65",
            "net9": "8e:4e:5c:74:2e:cb"
        },
        "leaf_3_0_10": {
            "net0": "62:e4:e4:e6:37:34",
            "net1": "ee:c2:89:5d:8f:60",
            "net10": "26:99:81:4e:f8:f2",
            "net2": "c6:c7:b5:6e:42:a1",
            "net3": "f2:3a:37:8a:9c:6d",
            "net4": "e2:f4:69:35:0e:0d",
            "net5": "3a:d8:20:41:6e:37",
            "net6": "e2:54:ba:e9:4a:14",
            "net7": "72:59:2c:3b:97:d7",
            "net8": "76:ad:0f:2b:db:67",
            "net9": "42:25:99:fc:82:a5"
        },
        "leaf_3_0_2": {
            "net0": "e6:51:ad:de:83:60",
            "net1": "3e:4c:7d:16:6d:85",
            "net10": "ce:c5:c6:06:4a:a1",
            "net2": "56:ba:b7:84:80:d3",
            "net3": "f6:d9:20:62:0c:75",
            "net4": "ba:c3:55:da:96:3a",
            "net5": "9e:9c:cb:71:9a:86",
            "net6": "b2:56:ed:d2:09:98",
            "net7": "82:db:0c:2b:c8:88",
            "net8": "fa:e8:0e:c8:ce:27",
            "net9": "32:39:67:81:40:89"
        },
        "leaf_3_0_3": {
            "net0": "12:e4:7b:7a:94:9a",
            "net1": "a2:a6:eb:4e:e5:1b",
            "net10": "d6:ac:3d:8d:9f:ed",
            "net2": "66:8d:43:c8:73:89",
            "net3": "76:28:b7:58:29:b4",
            "net4": "2e:fe:a3:78:b5:c3",
            "net5": "9a:c7:49:c2:fa:7c",
            "net6": "b2:a9:a6:77:52:e3",
            "net7": "12:bb:da:7d:6c:c2",
            "net8": "8e:7c:77:5a:f7:e7",
            "net9": "0a:27:99:ed:12:9b"
        },
        "leaf_3_0_4": {
            "net0": "96:dd:73:90:a7:38",
            "net1": "26:8f:58:ef:94:47",
            "net10": "76:1a:d1:ce:33:72",
            "net2": "92:e4:73:38:a5:90",
            "net3": "da:71:7b:eb:8b:e9",
            "net4": "4e:fa:b7:52:0b:97",
            "net5": "b6:4e:1a:3e:c4:56",
            "net6": "be:77:20:b9:50:ec",
            "net7": "7a:5a:ee:70:19:d9",
            "net8": "7e:87:f6:9b:9c:81",
            "net9": "d6:6b:d1:11:81:2e"
        },
        "leaf_3_0_5": {
            "net0": "b2:24:40:d8:7c:88",
            "net1": "7e:83:a6:90:db:21",
            "net10": "b6:7f:f0:1d:5c:a6",
            "net2": "26:b4:55:e7:d3:5c",
            "net3": "12:64:05:18:38:20",
            "net4": "e6:1b:bf:e3:f2:87",
            "net5": "3a:87:9c:36:93:f1",
            "net6": "b2:8f:b9:ce:6a:7b",
            "net7": "5e:00:27:8d:66:9e",
            "net8": "7a:f1:e1:a7:fd:15",
            "net9": "2e:a0:df:b5:d9:d3"
        },
        "leaf_3_0_6": {
            "net0": "26:5f:0d:ef:d3:9a",
            "net1": "ca:0c:76:0c:4a:a7",
            "net10": "32:d3:99:d9:03:18",
            "net2": "ce:96:77:a2:df:24",
            "net3": "c2:86:79:d0:55:72",
            "net4": "e2:bc:b4:9f:80:25",
            "net5": "ca:ea:8e:1b:4b:e5",
            "net6": "a6:3c:5d:4e:5e:c3",
            "net7": "76:1f:ad:d0:e2:f2",
            "net8": "4e:d8:4e:3d:b2:c4",
            "net9": "62:e8:23:f4:b8:69"
        },
        "leaf_3_0_7": {
            "net0": "d2:6b:01:93:0f:cc",
            "net1": "56:ff:8a:f7:7f:f2",
            "net10": "52:fe:3b:cb:60:5f",
            "net2": "06:67:32:90:c9:26",
            "net3": "72:f5:0a:15:e4:f4",
            "net4": "4a:96:2e:d8:bf:3f",
            "net5": "4e:d8:4c:76:a9:68",
            "net6": "f6:ff:cd:4f:3a:20",
            "net7": "fa:dc:73:98:f5:81",
            "net8": "de:82:e6:f8:b7:f9",
            "net9": "96:34:48:82:9d:f8"
        },
        "leaf_3_0_8": {
            "net0": "fe:32:9c:c3:0c:9a",
            "net1": "a6:f5:88:7f:00:4b",
            "net10": "9a:80:12:a2:65:ba",
            "net2": "72:58:d5:45:c0:44",
            "net3": "72:f6:41:73:13:e6",
            "net4": "e2:50:64:e4:34:48",
            "net5": "c2:98:86:21:b5:a4",
            "net6": "52:de:dc:67:53:86",
            "net7": "1e:9a:76:0f:53:ff",
            "net8": "fa:ec:67:ab:4e:ee",
            "net9": "0e:8b:aa:5b:82:7e"
        },
        "leaf_3_0_9": {
            "net0": "aa:52:32:f3:77:0a",
            "net1": "ce:31:77:b5:a5:27",
            "net10": "fa:76:d1:de:60:b6",
            "net2": "22:b5:ea:e9:ac:4c",
            "net3": "3a:32:f1:68:4d:48",
            "net4": "5e:27:78:09:40:70",
            "net5": "da:e7:bb:e5:69:5b",
            "net6": "ae:80:38:77:0d:28",
            "net7": "26:64:bd:39:58:91",
            "net8": "4a:72:68:64:ef:bb",
            "net9": "be:42:67:5f:eb:70"
        },
        "leaf_4_0_1": {
            "net0": "ce:61:b6:02:ee:7a",
            "net1": "2a:e7:c5:cf:af:86",
            "net10": "b6:4b:a3:c9:22:43",
            "net2": "c2:9c:79:6c:7e:22",
            "net3": "12:c5:8d:1b:3a:37",
            "net4": "b2:4d:f1:73:9b:3e",
            "net5": "26:4c:a1:56:e5:cc",
            "net6": "de:95:ca:b8:98:f1",
            "net7": "ae:0c:8f:e7:36:9c",
            "net8": "be:f5:3a:d6:08:25",
            "net9": "52:a2:a0:8c:fc:2c"
        },
        "leaf_4_0_10": {
            "net0": "ba:28:b5:3f:1f:1d",
            "net1": "8a:ab:08:ee:b6:05",
            "net10": "e6:8c:ba:4b:d3:b6",
            "net2": "22:2a:93:5b:45:6a",
            "net3": "6a:46:98:6b:5f:e9",
            "net4": "ee:62:48:5a:ed:74",
            "net5": "02:53:d5:39:5d:be",
            "net6": "76:8c:24:81:d2:37",
            "net7": "ee:d6:7f:8b:fa:51",
            "net8": "92:0f:68:86:71:2a",
            "net9": "c2:44:5b:1d:4c:e3"
        },
        "leaf_4_0_2": {
            "net0": "12:d7:7e:96:aa:ef",
            "net1": "b6:c0:65:6a:33:b5",
            "net10": "82:d8:5e:96:49:93",
            "net2": "5e:7b:5a:46:97:2d",
            "net3": "16:19:e3:37:e2:42",
            "net4": "d2:b7:5e:74:47:de",
            "net5": "6e:6d:6b:c4:8e:fc",
            "net6": "8e:d4:0f:70:eb:3c",
            "net7": "22:22:e7:48:0a:4d",
            "net8": "0a:25:99:48:df:91",
            "net9": "5e:6e:61:b1:5b:f6"
        },
        "leaf_4_0_3": {
            "net0": "36:5e:d8:0a:d1:21",
            "net1": "ca:8f:6d:46:e3:1b",
            "net10": "e2:8b:c9:e8:34:17",
            "net2": "c6:63:53:69:f1:32",
            "net3": "2e:f2:84:a4:63:1b",
            "net4": "9a:4e:7d:8e:e9:e6",
            "net5": "da:5c:32:7e:0d:be",
            "net6": "76:57:1f:19:ec:c4",
            "net7": "32:78:7e:05:19:79",
            "net8": "8e:97:a9:f8:6c:48",
            "net9": "2e:a1:74:46:5b:ec"
        },
        "leaf_4_0_4": {
            "net0": "e6:40:f9:96:13:f2",
            "net1": "82:36:e4:51:b2:56",
            "net10": "72:be:76:18:84:84",
            "net2": "a6:d9:a1:31:75:05",
            "net3": "a2:d2:a6:03:df:36",
            "net4": "a6:18:a8:f0:d8:b6",
            "net5": "6a:80:12:6a:76:74",
            "net6": "ba:39:41:7c:40:e0",
            "net7": "7e:22:64:13:0a:e1",
            "net8": "76:03:22:10:71:d5",
            "net9": "fe:96:35:3f:1e:f6"
        },
        "leaf_4_0_5": {
            "net0": "62:e5:41:95:a9:f1",
            "net1": "96:02:f8:70:69:8a",
            "net10": "ba:51:f7:44:f8:4e",
            "net2": "3a:da:94:df:ee:94",
            "net3": "9e:87:4e:00:e1:13",
            "net4": "e6:7f:b4:7a:94:35",
            "net5": "32:34:76:dc:16:f2",
            "net6": "8e:1a:89:84:03:39",
            "net7": "3a:a4:02:6d:6e:79",
            "net8": "82:bd:e8:7b:7e:b0",
            "net9": "16:99:e1:de:50:e4"
        },
        "leaf_4_0_6": {
            "net0": "c2:5b:60:fd:72:ff",
            "net1": "2e:a3:10:30:7b:08",
            "net10": "5a:0d:8b:70:76:5f",
            "net2": "fe:8c:10:b9:4f:6a",
            "net3": "0e:8b:3a:cc:e8:bd",
            "net4": "1a:e0:c3:b9:72:ca",
            "net5": "62:5e:bf:c6:25:f1",
            "net6": "32:3d:c6:c2:20:9d",
            "net7": "1a:32:db:7f:4f:73",
            "net8": "1a:6e:ff:ee:1e:8d",
            "net9": "8a:41:c0:bb:79:a1"
        },
        "leaf_4_0_7": {
            "net0": "5a:95:96:da:59:1f",
            "net1": "5e:ed:cf:d8:ed:af",
            "net10": "ea:33:4c:52:1d:f8",
            "net2": "b6:d1:e9:35:61:0c",
            "net3": "8a:20:4b:a9:bd:d4",
            "net4": "ce:c1:bb:45:ca:11",
            "net5": "c6:6e:c2:fd:ca:98",
            "net6": "ca:f6:38:84:44:5a",
            "net7": "96:e8:3b:15:7b:8b",
            "net8": "42:75:c0:7f:5b:22",
            "net9": "8e:79:c6:be:58:4c"
        },
        "leaf_4_0_8": {
            "net0": "b2:f6:73:34:d8:12",
            "net1": "a2:89:ec:17:39:e2",
            "net10": "0e:cd:17:9a:91:0b",
            "net2": "ca:40:7a:d1:78:20",
            "net3": "e6:ff:b5:81:69:d3",
            "net4": "3a:8e:35:0c:74:e8",
            "net5": "be:7a:08:9a:51:62",
            "net6": "96:2c:04:ff:5a:9d",
            "net7": "9a:de:40:28:84:e9",
            "net8": "6a:5d:3d:b7:d1:4b",
            "net9": "4e:0c:78:5c:44:4f"
        },
        "leaf_4_0_9": {
            "net0": "8a:5f:9a:54:46:80",
            "net1": "3a:dd:0d:91:2e:01",
            "net10": "3a:d7:ed:dc:de:95",
            "net2": "86:53:d5:32:87:bf",
            "net3": "ba:8a:ff:3a:83:2e",
            "net4": "d6:cc:2e:80:c2:a1",
            "net5": "4a:cb:24:c3:fc:e7",
            "net6": "32:c5:08:c8:48:37",
            "net7": "4e:41:79:97:e4:88",
            "net8": "8e:29:5e:aa:88:19",
            "net9": "3e:bc:cb:a9:fe:89"
        },
        "spine_1_1_1": {
            "net0": "76:7d:9e:1e:21:59",
            "net1": "b2:8c:0a:fc:c7:08",
            "net10": "c6:c2:46:fb:ac:ec",
            "net11": "42:1e:21:90:49:38",
            "net12": "ba:44:06:e0:38:cd",
            "net13": "a2:8c:b4:0c:58:86",
            "net14": "52:1f:1c:eb:8a:55",
            "net15": "22:b6:34:46:c0:98",
            "net16": "22:35:f5:13:ff:f8",
            "net17": "12:c2:46:32:73:07",
            "net18": "12:8a:61:bd:b7:94",
            "net19": "ce:d6:9e:0a:09:83",
            "net2": "8e:77:a5:c5:c9:a3",
            "net3": "da:d3:61:bd:40:5f",
            "net4": "2e:0c:8e:5b:6b:16",
            "net5": "ae:d5:e0:48:b9:f2",
            "net6": "be:3f:35:b1:f9:48",
            "net7": "f6:c8:25:f0:fb:68",
            "net8": "9e:72:72:dc:76:ce",
            "net9": "3e:ad:cb:db:7f:5d"
        },
        "spine_1_1_10": {
            "net0": "fa:c5:cf:cd:89:eb",
            "net1": "1e:23:e6:a2:68:cb",
            "net10": "fe:8c:ab:f9:28:68",
            "net11": "9e:76:87:b0:ed:b8",
            "net12": "7e:88:4d:dc:27:0a",
            "net13": "6e:82:16:d7:20:e1",
            "net14": "3e:c5:64:6b:0e:63",
            "net15": "ce:db:3a:3c:5a:ad",
            "net16": "12:1b:ca:b9:1b:2b",
            "net17": "3e:61:3d:01:db:56",
            "net18": "0e:e0:7a:ab:3c:ef",
            "net19": "c6:66:9a:64:7b:0a",
            "net2": "7a:e9:c6:ae:98:77",
            "net3": "ea:e7:ac:de:25:a0",
            "net4": "a6:55:0e:c3:08:90",
            "net5": "ae:e7:e3:a7:98:a2",
            "net6": "52:44:df:b0:f3:87",
            "net7": "7e:50:41:58:b2:73",
            "net8": "8a:1d:20:88:12:3b",
            "net9": "e2:80:9a:10:e4:64"
        },
        "spine_1_1_2": {
            "net0": "8a:a5:e3:20:e5:f2",
            "net1": "c2:25:cb:d2:3f:d0",
            "net10": "36:bc:9f:c8:2d:06",
            "net11": "c6:55:e5:61:2e:29",
            "net12": "2a:97:05:c6:17:c7",
            "net13": "f2:6b:93:d3:ce:93",
            "net14": "c2:7c:25:83:38:00",
            "net15": "2e:30:cf:5e:2e:f8",
            "net16": "56:bb:62:3c:1f:a2",
            "net17": "22:e3:40:8c:fb:19",
            "net18": "8e:b0:c0:f6:6c:20",
            "net19": "72:2d:37:10:ef:52",
            "net2": "1e:a0:87:a9:de:06",
            "net3": "e6:0a:f6:68:04:0f",
            "net4": "d6:61:84:8f:1b:32",
            "net5": "7a:3b:e8:c8:9a:ed",
            "net6": "32:3a:ed:ea:26:46",
            "net7": "2e:6d:c6:e0:02:f3",
            "net8": "a6:9b:ec:be:4b:bc",
            "net9": "ce:52:71:b0:c5:2d"
        },
        "spine_1_1_3": {
            "net0": "02:b7:45:05:23:0e",
            "net1": "8a:ee:64:99:ba:e6",
            "net10": "16:97:a6:7b:38:c8",
            "net11": "02:0d:fb:7d:c8:eb",
            "net12": "16:f1:1b:c2:8d:b6",
            "net13": "5a:aa:47:43:ed:8b",
            "net14": "3e:51:14:4f:fb:7a",
            "net15": "5e:1d:69:5c:4d:0f",
            "net16": "6a:9b:16:25:69:f0",
            "net17": "d6:d3:e3:a1:7d:dc",
            "net18": "a2:a4:17:fc:52:34",
            "net19": "1a:2d:2f:49:dc:ea",
            "net2": "e2:fc:7f:42:d0:74",
            "net3": "d6:aa:70:15:af:c7",
            "net4": "7a:af:e3:7d:04:37",
            "net5": "62:67:9d:be:48:ba",
            "net6": "82:ee:13:72:e9:5d",
            "net7": "a6:88:67:37:6a:1b",
            "net8": "da:02:91:bd:e0:5a",
            "net9": "1e:9d:f0:fa:3f:60"
        },
        "spine_1_1_4": {
            "net0": "d2:31:aa:33:6e:1b",
            "net1": "3a:cb:54:f7:b3:c9",
            "net10": "26:f4:f1:a2:a3:66",
            "net11": "22:7c:84:3a:ba:13",
            "net12": "f6:e7:c4:dd:a0:72",
            "net13": "2a:b1:8e:ff:e8:88",
            "net14": "f2:fb:f0:61:b5:9a",
            "net15": "2e:71:9c:49:4d:12",
            "net16": "86:1f:f3:c5:2b:8b",
            "net17": "9e:62:84:51:30:2e",
            "net18": "d6:ea:39:1b:64:ac",
            "net19": "4e:9c:5b:6c:a3:e8",
            "net2": "1a:66:a2:55:2a:c3",
            "net3": "8a:11:93:cf:04:be",
            "net4": "c2:15:0c:ad:12:1a",
            "net5": "32:ab:fc:13:04:e1",
            "net6": "22:70:41:8f:ff:b6",
            "net7": "ae:6f:a1:35:6c:d2",
            "net8": "f6:ac:13:5f:93:a2",
            "net9": "ca:8e:e3:8c:aa:6a"
        },
        "spine_1_1_5": {
            "net0": "96:b0:e1:d4:1d:1b",
            "net1": "9a:f2:16:b4:5e:0e",
            "net10": "6e:81:6f:06:00:d6",
            "net11": "3a:c9:c7:d1:2e:80",
            "net12": "be:3d:0e:fb:d6:45",
            "net13": "d2:46:84:be:53:a1",
            "net14": "5e:16:33:32:c3:cd",
            "net15": "4a:6f:d4:5c:69:fc",
            "net16": "de:3b:4f:68:50:af",
            "net17": "6a:01:19:3c:c0:24",
            "net18": "36:3f:79:60:61:c0",
            "net19": "3a:24:d8:59:56:08",
            "net2": "86:6f:d6:3c:70:ff",
            "net3": "ce:e8:bd:26:4f:04",
            "net4": "fe:5f:fc:e3:fa:10",
            "net5": "3e:67:42:a7:b9:f8",
            "net6": "06:cc:78:f9:f0:da",
            "net7": "f2:09:66:d8:01:ec",
            "net8": "4a:16:74:99:ae:2d",
            "net9": "2a:77:cd:8e:d0:c8"
        },
        "spine_1_1_6": {
            "net0": "ae:62:b0:03:aa:1f",
            "net1": "de:3d:77:db:34:12",
            "net10": "e2:b5:5e:5f:a1:32",
            "net11": "ba:28:e1:60:07:ff",
            "net12": "1e:e3:c7:a6:a4:0b",
            "net13": "0e:35:8b:fa:50:c8",
            "net14": "fa:b1:4d:88:4f:2b",
            "net15": "66:8b:ff:98:8a:76",
            "net16": "a6:7d:af:0d:c0:6d",
            "net17": "12:0d:6e:49:d8:91",
            "net18": "82:a0:69:5e:70:fa",
            "net19": "a2:3f:e0:e5:8a:9d",
            "net2": "aa:11:91:f9:98:c1",
            "net3": "76:92:de:90:47:99",
            "net4": "d2:b2:d5:8e:a5:5c",
            "net5": "da:55:e0:32:05:4c",
            "net6": "66:b6:d6:d7:52:79",
            "net7": "b2:5a:9d:4e:f9:cf",
            "net8": "0e:27:76:d7:4d:7c",
            "net9": "ca:6c:e2:03:48:d8"
        },
        "spine_1_1_7": {
            "net0": "6e:85:5b:fa:42:d7",
            "net1": "82:ae:8e:f7:a6:ad",
            "net10": "8a:3c:25:7a:13:68",
            "net11": "ae:6c:05:d9:e8:c8",
            "net12": "6e:89:8f:f0:02:bd",
            "net13": "a6:de:5b:b5:17:2f",
            "net14": "52:3e:13:ae:17:14",
            "net15": "12:2b:b8:a6:3c:46",
            "net16": "d6:1a:c9:f6:88:05",
            "net17": "da:20:e1:9d:11:5e",
            "net18": "16:55:4f:36:25:67",
            "net19": "26:32:ef:e1:3f:fd",
            "net2": "12:8f:8e:d3:db:0b",
            "net3": "9a:92:6c:49:36:a7",
            "net4": "4a:3a:38:05:49:30",
            "net5": "16:2c:8c:c0:77:3b",
            "net6": "ee:2d:8b:a3:24:7c",
            "net7": "92:64:46:bf:27:e6",
            "net8": "ee:ba:72:b1:1c:35",
            "net9": "b2:46:4c:71:49:79"
        },
        "spine_1_1_8": {
            "net0": "9a:52:fb:96:f8:f4",
            "net1": "0a:5b:35:ef:98:a0",
            "net10": "aa:a6:d5:05:40:f5",
            "net11": "76:7d:42:05:95:0f",
            "net12": "1a:0f:35:ff:b2:57",
            "net13": "ae:04:b7:29:23:ed",
            "net14": "9e:91:dc:5c:4b:d9",
            "net15": "06:e7:50:ad:5a:c1",
            "net16": "72:9d:d1:1b:08:5b",
            "net17": "4e:5a:b5:0b:fe:81",
            "net18": "fa:35:e8:34:52:95",
            "net19": "92:c1:4b:a6:77:d0",
            "net2": "fe:1f:8b:28:da:59",
            "net3": "8a:5b:3d:e5:8b:9a",
            "net4": "92:06:30:4b:74:15",
            "net5": "82:e5:92:98:57:15",
            "net6": "de:d7:c4:52:1d:3c",
            "net7": "b6:a2:b2:24:63:59",
            "net8": "e6:85:a9:af:92:0f",
            "net9": "3e:83:4e:dd:07:d6"
        },
        "spine_1_1_9": {
            "net0": "5a:92:2f:e4:bc:fb",
            "net1": "66:f3:74:e1:e2:6e",
            "net10": "c6:d8:ef:e6:9b:38",
            "net11": "aa:76:3a:39:77:76",
            "net12": "02:c6:29:4b:0a:34",
            "net13": "72:3e:90:2a:59:6a",
            "net14": "8a:fa:18:73:fa:4c",
            "net15": "3e:f4:9f:78:b2:d0",
            "net16": "5a:e7:aa:98:61:c3",
            "net17": "d2:89:e8:ac:23:21",
            "net18": "aa:55:fe:90:ca:ea",
            "net19": "82:82:91:36:9d:64",
            "net2": "46:4d:a7:bc:81:8d",
            "net3": "92:21:94:3d:d5:8b",
            "net4": "16:45:0c:55:5f:a8",
            "net5": "b2:15:63:ed:22:a9",
            "net6": "f2:2b:25:1a:e0:a3",
            "net7": "1a:dc:12:4f:b0:7e",
            "net8": "9a:d5:32:f9:80:40",
            "net9": "de:7d:78:01:b8:0b"
        },
        "spine_2_1_1": {
            "net0": "de:e1:40:ab:a1:26",
            "net1": "82:12:8b:9e:1b:ae",
            "net10": "32:0c:84:f7:84:4d",
            "net11": "52:cf:39:aa:dc:b1",
            "net12": "42:49:d2:5f:e1:e1",
            "net13": "46:81:7d:17:42:e5",
            "net14": "52:30:ac:2f:73:b3",
            "net15": "4a:34:28:25:e3:46",
            "net16": "d2:ea:6d:6e:74:66",
            "net17": "3a:9b:d0:f0:76:9c",
            "net18": "32:9e:ba:66:7e:cf",
            "net19": "4e:df:66:13:45:d0",
            "net2": "8e:6b:d4:10:3a:c3",
            "net3": "a2:d1:9d:0f:e4:b7",
            "net4": "b2:d2:db:ce:0b:c7",
            "net5": "ce:e9:48:06:ab:01",
            "net6": "ca:01:2e:af:d7:7c",
            "net7": "22:d7:8b:5a:53:71",
            "net8": "1a:64:d3:a4:9e:c4",
            "net9": "32:a4:5c:68:5d:81"
        },
        "spine_2_1_10": {
            "net0": "5a:dd:f4:9f:8c:d6",
            "net1": "22:f2:fc:19:ed:53",
            "net10": "f2:02:20:df:96:d7",
            "net11": "56:63:c0:14:9b:83",
            "net12": "22:09:33:7e:fb:57",
            "net13": "c2:6c:9a:8f:3a:ae",
            "net14": "86:00:ef:2c:2b:c5",
            "net15": "6e:8f:36:88:0c:32",
            "net16": "96:38:49:a9:2a:2b",
            "net17": "56:30:65:43:75:b4",
            "net18": "66:3b:4a:9d:c4:e1",
            "net19": "de:93:1f:d7:80:d2",
            "net2": "32:fc:59:a9:92:47",
            "net3": "36:c7:00:8a:bc:cb",
            "net4": "be:38:f8:56:98:74",
            "net5": "b2:51:f1:3c:40:d8",
            "net6": "c6:19:9e:8d:87:82",
            "net7": "da:de:a0:62:55:bf",
            "net8": "56:24:0c:53:f4:61",
            "net9": "12:01:11:a8:39:e5"
        },
        "spine_2_1_2": {
            "net0": "fe:2d:d9:c2:09:92",
            "net1": "1a:9f:ad:0c:5d:8c",
            "net10": "1e:11:20:0a:60:f6",
            "net11": "ce:3c:4e:4f:33:18",
            "net12": "8e:98:18:33:9e:7d",
            "net13": "a6:1b:83:2f:7d:12",
            "net14": "fa:44:cf:6f:df:2e",
            "net15": "5e:30:f7:5c:e4:62",
            "net16": "52:a2:ef:88:48:cd",
            "net17": "5a:30:1e:ed:9e:31",
            "net18": "9e:59:db:3f:df:64",
            "net19": "ea:b8:cf:6f:5d:8b",
            "net2": "06:c7:ec:55:cc:d3",
            "net3": "32:a2:96:0e:2f:d9",
            "net4": "1e:3a:25:39:de:5a",
            "net5": "66:0a:3a:eb:11:25",
            "net6": "2e:e0:43:3b:c7:69",
            "net7": "ae:54:e1:de:3d:5b",
            "net8": "a2:1b:25:0d:46:63",
            "net9": "6e:6a:71:8d:52:d0"
        },
        "spine_2_1_3": {
            "net0": "fa:06:42:d0:0c:bd",
            "net1": "12:28:04:97:b7:85",
            "net10": "1e:84:9c:31:96:cc",
            "net11": "4e:16:ca:06:7e:06",
            "net12": "1a:05:f6:33:f3:e7",
            "net13": "be:89:6f:91:37:ee",
            "net14": "be:9d:9c:58:7e:4c",
            "net15": "ee:7e:2a:47:5b:aa",
            "net16": "46:7d:93:96:55:3f",
            "net17": "3e:07:c9:8e:68:1a",
            "net18": "96:63:5f:64:37:95",
            "net19": "b2:8d:85:42:83:92",
            "net2": "e6:0d:fa:ce:0c:15",
            "net3": "92:a4:54:2f:e0:10",
            "net4": "32:f5:fc:15:c2:1d",
            "net5": "a6:54:c6:b9:95:e5",
            "net6": "96:53:d8:72:6e:a5",
            "net7": "02:a5:66:97:8f:91",
            "net8": "8e:5b:cd:63:43:3b",
            "net9": "06:a5:f1:98:b8:f5"
        },
        "spine_2_1_4": {
            "net0": "6a:da:eb:ab:7b:34",
            "net1": "9e:05:6a:32:f6:71",
            "net10": "56:e3:a5:fb:7e:70",
            "net11": "8a:97:28:06:dc:28",
            "net12": "06:86:cc:4e:fe:0d",
            "net13": "9e:db:98:0d:80:96",
            "net14": "d2:e9:ce:27:93:8e",
            "net15": "32:9e:0b:46:ae:a2",
            "net16": "1e:e9:2c:b2:74:8b",
            "net17": "4e:70:46:c3:fe:75",
            "net18": "de:e3:9d:dc:84:91",
            "net19": "6e:9e:c2:a7:e6:ac",
            "net2": "2e:1b:48:b3:96:77",
            "net3": "72:e3:a2:a2:b2:a5",
            "net4": "82:56:ce:3e:e4:c7",
            "net5": "ea:16:1d:2a:63:e3",
            "net6": "22:89:ed:d1:94:12",
            "net7": "de:dd:41:22:70:87",
            "net8": "e2:43:5f:59:7a:94",
            "net9": "7e:aa:45:d2:63:2a"
        },
        "spine_2_1_5": {
            "net0": "02:4a:ee:5a:f7:11",
            "net1": "72:dd:64:a2:94:fc",
            "net10": "da:8f:db:b7:eb:c2",
            "net11": "2a:74:3d:e1:33:b9",
            "net12": "e2:24:5a:b3:e9:1e",
            "net13": "fa:23:04:8e:e9:0d",
            "net14": "b2:81:b4:62:e4:a0",
            "net15": "46:16:c5:e9:8b:82",
            "net16": "3e:14:45:69:fb:f8",
            "net17": "da:87:4b:c5:93:ba",
            "net18": "ba:04:58:40:4b:4b",
            "net19": "ce:2b:27:57:b0:09",
            "net2": "22:e7:42:60:24:98",
            "net3": "72:6c:5a:0a:07:2e",
            "net4": "a2:a5:71:da:ca:ac",
            "net5": "f2:cb:57:64:d0:01",
            "net6": "06:3c:d2:26:d7:6c",
            "net7": "c2:8f:98:28:12:b9",
            "net8": "c2:d6:83:dd:6f:41",
            "net9": "72:3f:2d:ae:38:5f"
        },
        "spine_2_1_6": {
            "net0": "c6:53:19:23:20:0f",
            "net1": "52:fc:0d:f8:99:0b",
            "net10": "b6:b6:f3:4f:90:5d",
            "net11": "fe:54:4c:55:c3:22",
            "net12": "76:d4:49:2c:1b:06",
            "net13": "1a:a1:f7:3c:21:a7",
            "net14": "42:e0:d1:4a:2c:02",
            "net15": "4a:fd:39:3a:94:a5",
            "net16": "be:12:38:2e:62:b0",
            "net17": "9e:99:62:14:1e:ea",
            "net18": "ea:8f:fa:0e:25:71",
            "net19": "da:fe:65:51:3f:2f",
            "net2": "7a:46:c1:5a:7c:a4",
            "net3": "b6:0b:f0:ff:63:16",
            "net4": "5e:b4:7a:81:1e:67",
            "net5": "2a:44:b3:4b:4e:fd",
            "net6": "4e:59:78:97:9d:95",
            "net7": "4a:54:ca:7d:86:66",
            "net8": "6e:58:34:70:00:a5",
            "net9": "6a:66:2c:52:fe:f2"
        },
        "spine_2_1_7": {
            "net0": "72:93:cf:a7:8a:4d",
            "net1": "3a:07:39:e8:eb:80",
            "net10": "0e:6e:1a:ac:15:6e",
            "net11": "aa:e5:09:f9:20:ec",
            "net12": "06:e2:6c:8e:08:8b",
            "net13": "c2:7a:b8:e3:a9:78",
            "net14": "ee:aa:1e:38:60:c8",
            "net15": "4a:3c:c0:08:39:37",
            "net16": "6a:e5:d6:17:50:c5",
            "net17": "46:d3:3d:c4:1d:c4",
            "net18": "d6:6f:20:88:ee:09",
            "net19": "0a:aa:85:eb:f0:77",
            "net2": "be:98:61:42:da:34",
            "net3": "8a:45:11:21:ba:b2",
            "net4": "72:cd:2a:19:79:e1",
            "net5": "f2:d0:ae:da:89:8d",
            "net6": "42:54:34:07:4d:83",
            "net7": "56:11:c8:f6:2f:af",
            "net8": "d2:bb:31:97:e2:ba",
            "net9": "e6:ab:b0:15:6f:9a"
        },
        "spine_2_1_8": {
            "net0": "ee:65:ea:cc:3e:e9",
            "net1": "a6:4f:69:b2:6d:75",
            "net10": "22:4e:7f:45:27:94",
            "net11": "26:2e:a6:d4:fe:a2",
            "net12": "16:89:17:6b:c4:6f",
            "net13": "ba:99:5a:2a:a4:d9",
            "net14": "9e:b4:10:9b:8d:df",
            "net15": "0e:81:df:ea:9b:ca",
            "net16": "7a:d9:ee:a8:ff:e5",
            "net17": "fa:77:0f:e6:62:67",
            "net18": "3a:77:bc:6f:80:3e",
            "net19": "ce:f7:74:a2:0d:dd",
            "net2": "d6:c1:ac:66:73:fa",
            "net3": "72:50:13:39:a8:e2",
            "net4": "0e:74:87:5c:ce:b2",
            "net5": "aa:e8:0c:c4:a7:66",
            "net6": "22:59:00:1a:67:12",
            "net7": "b2:39:0b:a7:e3:9f",
            "net8": "da:f6:d5:76:84:38",
            "net9": "a2:50:b5:ca:0c:e5"
        },
        "spine_2_1_9": {
            "net0": "f6:82:b2:96:4d:40",
            "net1": "2a:bd:fe:d0:22:0b",
            "net10": "06:9b:37:90:ec:2b",
            "net11": "0e:12:7c:11:d8:aa",
            "net12": "8a:ea:09:26:b4:b5",
            "net13": "9e:25:cc:5e:5d:90",
            "net14": "12:18:13:1f:79:3d",
            "net15": "de:a9:dd:c7:21:56",
            "net16": "fa:9f:55:46:53:6c",
            "net17": "66:90:55:20:07:9a",
            "net18": "7e:a6:51:43:4f:25",
            "net19": "d6:54:f7:74:5e:6b",
            "net2": "d6:fa:6e:80:bd:f8",
            "net3": "4a:18:03:45:ae:7b",
            "net4": "1e:f6:4b:ea:f0:04",
            "net5": "1e:8b:bd:6a:83:c2",
            "net6": "fa:cb:4c:a8:36:f9",
            "net7": "92:84:d1:b5:9c:5d",
            "net8": "6a:73:33:02:e3:6a",
            "net9": "2a:1f:49:28:6e:c5"
        },
        "spine_3_1_1": {
            "net0": "42:c9:ce:9f:af:c7",
            "net1": "22:bf:b6:a8:c6:4c",
            "net10": "b2:64:69:61:32:49",
            "net11": "6a:b6:91:32:ba:09",
            "net12": "d2:30:3c:31:c2:75",
            "net13": "0a:bb:c1:49:07:c5",
            "net14": "a2:85:38:69:8c:88",
            "net15": "da:2a:bd:14:94:d9",
            "net16": "1e:a5:f9:10:6f:fd",
            "net17": "1a:94:54:b9:1a:9e",
            "net18": "9a:0c:87:41:b5:24",
            "net19": "fe:87:db:70:cf:2b",
            "net2": "ce:c9:3c:a0:ef:8c",
            "net3": "82:3a:74:e9:71:bd",
            "net4": "4a:02:9d:a2:4e:ca",
            "net5": "36:6d:e4:b4:49:5c",
            "net6": "7a:c3:f7:36:3f:07",
            "net7": "06:01:27:22:ef:17",
            "net8": "92:1a:a5:a6:ce:9e",
            "net9": "56:97:a1:6a:da:2f"
        },
        "spine_3_1_10": {
            "net0": "4e:df:65:d8:9a:22",
            "net1": "9a:f1:32:d0:8e:c4",
            "net10": "62:43:0e:cc:0b:1b",
            "net11": "02:f0:17:e6:8d:00",
            "net12": "92:87:08:97:33:87",
            "net13": "1e:e4:86:38:0d:02",
            "net14": "ca:f4:a4:35:96:bf",
            "net15": "6e:96:33:46:4d:ed",
            "net16": "ea:c3:7e:fa:e1:ad",
            "net17": "ca:d5:f7:78:4b:77",
            "net18": "46:56:8d:4d:f6:bd",
            "net19": "92:d5:57:17:0c:30",
            "net2": "da:7e:7d:fd:d0:c4",
            "net3": "c6:52:1d:2e:f3:65",
            "net4": "52:de:65:89:ff:54",
            "net5": "06:d1:47:6a:85:77",
            "net6": "b6:14:6c:16:3f:d8",
            "net7": "c6:c9:3f:9f:b8:9d",
            "net8": "4a:54:fb:2d:ba:6d",
            "net9": "fe:6c:3b:71:6d:02"
        },
        "spine_3_1_2": {
            "net0": "7e:25:d8:a6:65:77",
            "net1": "46:e9:66:b5:d4:ae",
            "net10": "66:30:ee:5c:7e:23",
            "net11": "26:20:58:33:72:5f",
            "net12": "36:e6:b6:56:60:ab",
            "net13": "52:2e:22:ac:53:fb",
            "net14": "d6:fe:d1:72:d2:ca",
            "net15": "a6:af:db:32:48:81",
            "net16": "a2:1f:67:ad:01:03",
            "net17": "ae:ed:16:1c:4e:1e",
            "net18": "52:a1:1d:20:6d:2a",
            "net19": "62:2a:3f:de:5c:86",
            "net2": "4a:4b:6d:14:8f:ea",
            "net3": "0a:df:44:f3:97:db",
            "net4": "fa:4e:f3:05:13:b2",
            "net5": "7e:04:fe:d5:7f:e4",
            "net6": "3e:4f:46:25:89:e1",
            "net7": "5e:b1:7f:73:4c:d6",
            "net8": "8a:3d:b5:af:56:cd",
            "net9": "42:f7:f5:22:27:f5"
        },
        "spine_3_1_3": {
            "net0": "6a:88:72:cb:b5:e1",
            "net1": "76:36:f6:0c:90:b7",
            "net10": "c6:ac:55:38:49:cc",
            "net11": "8e:de:08:b3:46:39",
            "net12": "b6:ad:ff:8e:18:6f",
            "net13": "3e:6a:25:bc:ab:b5",
            "net14": "66:9d:38:f6:6e:2c",
            "net15": "66:80:70:c1:89:b6",
            "net16": "b6:6e:4f:c8:7b:1a",
            "net17": "5e:d1:b9:c1:48:00",
            "net18": "86:47:83:f1:9b:e8",
            "net19": "3a:1a:5b:5c:27:5d",
            "net2": "4e:52:29:49:c5:9c",
            "net3": "ea:62:d3:0b:e9:45",
            "net4": "f2:f1:1e:b2:53:b2",
            "net5": "86:f0:ce:92:44:b5",
            "net6": "26:f1:5c:b4:b8:b1",
            "net7": "56:fc:3e:40:48:19",
            "net8": "22:08:a6:8f:63:34",
            "net9": "86:34:ce:a6:de:64"
        },
        "spine_3_1_4": {
            "net0": "7a:80:e6:61:7b:41",
            "net1": "02:86:23:93:fd:b6",
            "net10": "c6:0f:11:38:67:4a",
            "net11": "ce:40:81:8b:97:ca",
            "net12": "d6:77:62:9b:27:cd",
            "net13": "fe:2f:fb:c7:87:cf",
            "net14": "26:c1:d7:dc:d5:b7",
            "net15": "9e:28:5d:6b:04:4a",
            "net16": "d2:96:f8:bb:0e:f6",
            "net17": "96:4b:a4:2d:62:8c",
            "net18": "e2:4a:ff:b7:8a:54",
            "net19": "fe:6a:be:8c:c7:af",
            "net2": "12:9f:7f:0f:14:f8",
            "net3": "76:93:45:74:df:71",
            "net4": "92:24:7b:c0:5e:1b",
            "net5": "de:af:c9:ea:17:b6",
            "net6": "b2:bd:7b:39:3a:ef",
            "net7": "82:c1:24:18:5e:f0",
            "net8": "b6:94:d1:8e:70:4f",
            "net9": "be:06:c7:90:c9:f4"
        },
        "spine_3_1_5": {
            "net0": "66:02:05:3d:7f:4b",
            "net1": "42:29:c5:f7:1a:f6",
            "net10": "3a:65:17:0b:9d:c4",
            "net11": "62:92:19:b6:68:a4",
            "net12": "0a:df:bb:26:70:89",
            "net13": "72:5e:ac:7d:76:b7",
            "net14": "ba:0a:76:47:1d:c0",
            "net15": "e6:a1:3f:10:12:3f",
            "net16": "36:80:64:e6:b4:54",
            "net17": "d6:f3:f5:c7:34:6c",
            "net18": "de:e5:05:c6:41:96",
            "net19": "9a:99:fd:a9:a8:8e",
            "net2": "be:97:7c:97:3a:8d",
            "net3": "ca:46:a3:b5:b0:4c",
            "net4": "0a:2f:c8:27:2d:d3",
            "net5": "e6:6c:cf:11:26:0a",
            "net6": "ba:42:35:f7:7c:53",
            "net7": "fa:8f:63:d5:bd:3a",
            "net8": "d2:1e:2f:c3:39:f5",
            "net9": "a6:67:54:51:11:96"
        },
        "spine_3_1_6": {
            "net0": "aa:24:66:b0:91:8e",
            "net1": "5a:9b:67:7b:dc:c6",
            "net10": "8a:8e:48:f6:09:81",
            "net11": "be:35:c0:92:86:44",
            "net12": "8a:00:ae:e0:3b:c4",
            "net13": "96:89:dc:78:95:90",
            "net14": "36:6c:e6:68:11:e2",
            "net15": "fe:3c:d1:f3:7f:1a",
            "net16": "92:0b:87:12:26:6f",
            "net17": "8a:bb:d9:4c:c7:7f",
            "net18": "3a:93:cf:ff:92:70",
            "net19": "fe:18:34:cf:b5:ab",
            "net2": "ee:da:a5:52:dc:9b",
            "net3": "3a:72:d4:cf:be:fd",
            "net4": "a2:3c:52:6f:0e:d5",
            "net5": "4e:15:f6:20:62:96",
            "net6": "de:13:04:b4:15:75",
            "net7": "d2:1a:a5:6c:63:dc",
            "net8": "22:0b:33:97:de:6a",
            "net9": "fa:d7:0e:f9:87:0a"
        },
        "spine_3_1_7": {
            "net0": "f6:60:ba:23:90:4e",
            "net1": "5e:b3:f1:6f:a2:d8",
            "net10": "e6:f2:1f:f1:c3:8b",
            "net11": "b2:b8:32:7d:4d:b9",
            "net12": "9a:5f:a0:1e:44:92",
            "net13": "62:0c:c6:63:f0:a4",
            "net14": "1a:70:e4:b1:75:09",
            "net15": "56:02:cf:71:34:77",
            "net16": "be:b2:b3:cb:09:fc",
            "net17": "66:28:7b:15:e9:15",
            "net18": "06:f5:74:d5:2c:92",
            "net19": "02:02:10:79:fe:18",
            "net2": "46:7a:55:a4:59:74",
            "net3": "52:3c:1c:b8:28:f8",
            "net4": "12:24:4f:3a:87:85",
            "net5": "ce:90:01:33:ec:3e",
            "net6": "c6:41:d8:e6:98:50",
            "net7": "ee:c2:93:3d:cb:63",
            "net8": "8e:73:5d:49:02:d4",
            "net9": "72:37:27:9f:cb:2b"
        },
        "spine_3_1_8": {
            "net0": "1a:ce:ce:ba:a7:74",
            "net1": "7e:e1:0a:05:94:d9",
            "net10": "2e:f2:82:f6:6d:37",
            "net11": "6a:3e:7a:22:8a:04",
            "net12": "f6:67:b4:e3:9a:73",
            "net13": "ba:2c:5d:f5:54:3a",
            "net14": "be:83:f0:8b:9c:82",
            "net15": "1e:85:c0:2a:a0:7b",
            "net16": "fa:55:89:38:c6:b1",
            "net17": "32:20:62:68:eb:80",
            "net18": "3a:84:8d:6a:ca:59",
            "net19": "0e:12:0f:8c:98:93",
            "net2": "e6:ae:c5:34:d6:cf",
            "net3": "0e:33:ed:64:61:f3",
            "net4": "42:fa:cd:a7:62:29",
            "net5": "0e:e0:32:66:21:cb",
            "net6": "92:bf:36:06:54:79",
            "net7": "c6:5b:e8:22:3e:f6",
            "net8": "e2:32:71:4c:a9:b1",
            "net9": "92:1e:f4:73:00:31"
        },
        "spine_3_1_9": {
            "net0": "ea:85:6f:d1:13:4f",
            "net1": "4a:3a:0b:7a:32:1c",
            "net10": "a2:7c:fd:fd:1c:e2",
            "net11": "06:1e:90:8d:79:3e",
            "net12": "92:8c:3f:a0:dc:8b",
            "net13": "be:d9:0b:4d:7b:e0",
            "net14": "b6:4b:0e:0e:e5:ca",
            "net15": "4a:47:cb:42:81:85",
            "net16": "9e:5c:e2:ef:37:ba",
            "net17": "5a:2c:75:4e:29:87",
            "net18": "6e:45:07:4f:14:f3",
            "net19": "2a:9b:9e:08:4a:04",
            "net2": "5a:dc:93:76:f5:e7",
            "net3": "c2:78:da:ce:77:b0",
            "net4": "8e:b8:ef:10:b1:21",
            "net5": "1a:10:51:80:ef:bc",
            "net6": "a6:34:c8:b5:7c:5f",
            "net7": "0e:81:98:69:96:57",
            "net8": "16:a2:84:77:93:b3",
            "net9": "b2:37:af:a2:15:c4"
        },
        "spine_4_1_1": {
            "net0": "2a:a5:f7:93:7c:07",
            "net1": "6a:39:94:72:7b:36",
            "net10": "5a:20:4c:8d:18:44",
            "net11": "ba:76:a3:bf:dc:03",
            "net12": "9e:2e:54:58:2e:bd",
            "net13": "3a:5a:53:b4:db:98",
            "net14": "0e:5b:d7:41:b3:13",
            "net15": "f2:a3:f5:f3:9b:7d",
            "net16": "c6:5f:1c:f0:d5:ec",
            "net17": "ca:34:d0:3b:35:fa",
            "net18": "9a:9d:87:1e:59:2e",
            "net19": "fe:ae:77:aa:5f:48",
            "net2": "ae:19:1f:ac:ee:7a",
            "net3": "6e:c3:a5:0c:6c:46",
            "net4": "0a:05:d3:06:02:f7",
            "net5": "2e:bf:5a:c3:9a:c7",
            "net6": "be:04:fc:3e:c9:74",
            "net7": "ee:cc:07:cf:52:d5",
            "net8": "2e:46:ed:23:fc:be",
            "net9": "5e:12:10:01:ad:24"
        },
        "spine_4_1_10": {
            "net0": "de:70:d4:c1:50:de",
            "net1": "0a:ac:bb:e0:26:a9",
            "net10": "9a:5a:26:01:fd:d2",
            "net11": "fa:68:0e:9b:5c:a7",
            "net12": "12:8f:4a:5b:52:d1",
            "net13": "b2:e6:35:14:75:c6",
            "net14": "aa:16:0f:59:bf:2a",
            "net15": "b6:63:e5:ad:5b:e4",
            "net16": "d6:ba:cf:29:cf:74",
            "net17": "56:64:a9:b7:e4:5a",
            "net18": "06:d6:16:d9:65:ac",
            "net19": "32:db:b2:6e:5a:78",
            "net2": "7e:36:b5:f2:4e:87",
            "net3": "da:7b:46:22:29:8a",
            "net4": "76:5f:fc:7e:ae:82",
            "net5": "c2:4e:95:aa:af:3c",
            "net6": "9e:e2:12:86:1d:1d",
            "net7": "ae:9f:cb:87:98:58",
            "net8": "76:12:04:37:41:45",
            "net9": "aa:ac:99:a3:bf:e8"
        },
        "spine_4_1_2": {
            "net0": "3a:ef:b5:bc:bc:41",
            "net1": "9a:d8:48:69:67:f2",
            "net10": "fe:96:30:28:48:ca",
            "net11": "5e:31:e3:da:d4:06",
            "net12": "16:cb:f6:1f:48:42",
            "net13": "ea:05:97:c5:ca:95",
            "net14": "fa:c5:63:1d:d1:0e",
            "net15": "da:13:ad:3c:01:51",
            "net16": "22:19:e1:fa:59:da",
            "net17": "d6:e9:c4:bb:ed:31",
            "net18": "8a:2e:c0:57:38:d8",
            "net19": "1a:ab:fb:ec:bb:f1",
            "net2": "96:c1:d3:71:59:49",
            "net3": "be:92:79:ec:d9:09",
            "net4": "8a:8e:fe:a2:ad:e1",
            "net5": "d2:7f:8d:7e:d4:28",
            "net6": "b6:c2:4a:48:a9:72",
            "net7": "06:93:2c:33:d2:b9",
            "net8": "4a:c1:9e:54:5f:00",
            "net9": "72:6c:cc:7f:51:b9"
        },
        "spine_4_1_3": {
            "net0": "82:80:d3:81:49:62",
            "net1": "26:0c:db:e1:f6:6d",
            "net10": "5e:8c:cb:3b:d6:df",
            "net11": "6e:fb:39:1d:2f:c8",
            "net12": "4e:b3:5c:6f:ec:dd",
            "net13": "96:72:34:d1:33:1e",
            "net14": "7a:d0:b6:98:3e:a8",
            "net15": "e6:e4:07:bc:ac:ec",
            "net16": "92:11:ea:5e:26:49",
            "net17": "2e:bc:1c:29:c6:72",
            "net18": "9e:e9:3d:0b:49:2b",
            "net19": "92:98:6a:41:ec:a0",
            "net2": "96:38:e6:56:2e:fd",
            "net3": "52:25:27:c7:6e:c9",
            "net4": "16:63:45:5f:24:70",
            "net5": "4e:c6:a3:8b:2d:73",
            "net6": "52:5f:9f:34:25:69",
            "net7": "e2:2c:9a:25:ea:28",
            "net8": "be:07:31:69:08:41",
            "net9": "9e:c4:e1:c1:67:d6"
        },
        "spine_4_1_4": {
            "net0": "16:95:65:b4:60:4a",
            "net1": "46:3f:68:c9:90:64",
            "net10": "3e:97:43:c6:7e:0b",
            "net11": "16:c1:39:57:de:f6",
            "net12": "26:29:17:2b:f3:5c",
            "net13": "c6:0b:89:6a:e2:a4",
            "net14": "2e:a3:4e:97:0a:5c",
            "net15": "5a:a3:98:48:06:43",
            "net16": "52:42:94:89:1e:4d",
            "net17": "8e:d9:bd:38:91:d2",
            "net18": "5e:85:96:83:72:ab",
            "net19": "3a:7b:6a:ba:1d:5d",
            "net2": "ca:cf:3e:e3:67:53",
            "net3": "62:13:c4:71:8b:b6",
            "net4": "c2:da:bb:8b:a4:4c",
            "net5": "56:3c:69:86:8f:e2",
            "net6": "1a:7e:92:bc:5e:52",
            "net7": "a2:d6:94:93:a3:e3",
            "net8": "aa:bb:75:19:84:2b",
            "net9": "72:e6:39:dd:b2:c9"
        },
        "spine_4_1_5": {
            "net0": "5a:68:79:81:fa:18",
            "net1": "fa:c6:71:96:b4:26",
            "net10": "b2:47:6b:11:52:b7",
            "net11": "66:fd:9b:89:6e:8c",
            "net12": "0e:9c:f1:ed:ba:02",
            "net13": "32:09:82:dd:09:53",
            "net14": "f6:f1:96:bd:8a:e8",
            "net15": "ca:71:be:1f:f7:08",
            "net16": "9e:30:c5:80:6f:7f",
            "net17": "1e:bc:c3:5e:c9:2d",
            "net18": "6a:0a:ef:fd:38:b3",
            "net19": "9e:b6:fd:54:3e:b4",
            "net2": "76:1d:e7:94:77:86",
            "net3": "06:f7:db:c0:81:e0",
            "net4": "6a:d6:2a:1a:1f:0a",
            "net5": "32:73:c2:e4:4b:07",
            "net6": "96:ff:e5:bf:f4:7d",
            "net7": "46:d8:24:a5:e3:45",
            "net8": "32:f7:43:21:6c:00",
            "net9": "ca:b0:d5:33:c3:c3"
        },
        "spine_4_1_6": {
            "net0": "d2:67:9b:59:48:54",
            "net1": "6e:62:10:5c:80:2c",
            "net10": "5e:a9:a2:d7:89:76",
            "net11": "f2:4f:ae:3a:4f:c4",
            "net12": "5a:9f:6b:f2:10:64",
            "net13": "36:77:f1:9c:23:ec",
            "net14": "f6:65:9e:74:9e:03",
            "net15": "0a:a7:6d:00:22:d9",
            "net16": "7e:df:82:ee:d4:b3",
            "net17": "1a:81:c0:0a:56:58",
            "net18": "9a:e8:0f:df:9d:db",
            "net19": "06:6d:ad:74:18:2e",
            "net2": "7a:93:97:49:cf:c0",
            "net3": "ee:e2:a4:db:d7:cb",
            "net4": "46:d4:d0:00:c1:6b",
            "net5": "be:65:c4:70:62:0b",
            "net6": "9e:ac:12:07:a3:a2",
            "net7": "62:04:1d:fc:87:d3",
            "net8": "a6:46:1a:f5:a6:b9",
            "net9": "b6:8d:2a:a4:87:d7"
        },
        "spine_4_1_7": {
            "net0": "0e:cc:0f:04:38:38",
            "net1": "ca:bd:73:78:c7:19",
            "net10": "96:fc:22:ab:cb:57",
            "net11": "22:09:d5:27:33:ad",
            "net12": "4a:ec:38:db:78:63",
            "net13": "02:94:a3:a5:c4:08",
            "net14": "f2:d3:af:bd:10:58",
            "net15": "a6:6e:37:b1:cb:84",
            "net16": "f6:2e:4d:25:1f:43",
            "net17": "52:dd:fa:b4:6e:29",
            "net18": "f2:ee:8f:bf:bf:a2",
            "net19": "82:70:cd:f1:bd:b8",
            "net2": "0a:6d:de:4d:3e:95",
            "net3": "02:c7:64:6d:b2:e9",
            "net4": "3e:97:a8:14:0a:aa",
            "net5": "1a:63:6a:77:c0:12",
            "net6": "16:a3:5e:bd:85:8c",
            "net7": "be:47:f9:22:4e:70",
            "net8": "a2:17:38:0f:77:5e",
            "net9": "32:e0:17:70:63:ff"
        },
        "spine_4_1_8": {
            "net0": "f2:e0:7c:99:73:24",
            "net1": "76:15:46:10:a5:c4",
            "net10": "8e:84:1a:f8:f8:7f",
            "net11": "ce:ed:e3:05:7b:83",
            "net12": "be:a2:e5:41:b5:dd",
            "net13": "7e:0f:13:3e:b5:92",
            "net14": "ee:60:f7:71:27:0a",
            "net15": "9a:18:3d:5e:38:36",
            "net16": "1a:1b:2f:3b:4c:9e",
            "net17": "4e:3f:ec:54:86:e1",
            "net18": "fa:a8:42:04:f5:8e",
            "net19": "ea:52:c9:44:f3:81",
            "net2": "0a:75:11:5f:37:15",
            "net3": "52:a0:a1:5b:22:aa",
            "net4": "22:e4:b8:36:12:79",
            "net5": "d6:8a:0c:65:77:41",
            "net6": "b2:b1:85:e0:37:09",
            "net7": "e2:b0:af:1f:60:8c",
            "net8": "a6:df:e6:05:a7:05",
            "net9": "5e:0c:07:76:2a:a7"
        },
        "spine_4_1_9": {
            "net0": "d2:e4:16:5c:08:a0",
            "net1": "96:b7:66:23:e4:89",
            "net10": "7e:0e:93:c1:3a:c9",
            "net11": "9e:a9:3e:d5:72:67",
            "net12": "b6:80:bc:48:53:d4",
            "net13": "6a:c2:32:cc:67:31",
            "net14": "9e:09:d0:ff:2d:c3",
            "net15": "ea:12:f0:5f:c0:70",
            "net16": "86:bc:07:48:4d:8f",
            "net17": "06:2d:9f:2c:28:aa",
            "net18": "f2:e5:1f:0f:81:ee",
            "net19": "8e:a9:4f:5c:57:a3",
            "net2": "de:68:cd:78:fb:a8",
            "net3": "4a:5c:39:9d:19:2d",
            "net4": "d6:b9:0f:50:e4:f4",
            "net5": "8a:b3:0c:6a:45:dc",
            "net6": "4e:fa:c9:49:ba:eb",
            "net7": "aa:56:5d:27:c9:a2",
            "net8": "aa:13:40:9a:c6:28",
            "net9": "8a:1b:46:12:c0:f4"
        },
        "tof_1_2_1": {
            "net0": "86:ac:38:15:4e:92",
            "net1": "d2:e2:ed:f1:7a:e4",
            "net10": "a6:29:76:0d:54:f0",
            "net11": "b6:c2:19:44:99:1a",
            "net12": "ee:13:b8:51:94:39",
            "net13": "fe:0e:8d:fb:02:2d",
            "net14": "8a:14:a6:76:49:d7",
            "net15": "a2:06:b6:a3:0a:44",
            "net16": "02:d0:1b:ac:58:48",
            "net17": "46:7e:c3:24:42:d4",
            "net18": "82:89:62:51:38:6d",
            "net19": "52:15:f4:dc:65:62",
            "net2": "72:2d:4c:d1:61:9e",
            "net3": "56:7b:15:84:ef:93",
            "net4": "42:e1:d2:eb:f4:77",
            "net5": "f2:95:75:bc:a5:da",
            "net6": "1a:9e:15:43:b7:50",
            "net7": "1e:6f:5b:f5:ec:c6",
            "net8": "1a:2b:e2:cf:ac:0c",
            "net9": "d6:06:e7:06:25:79"
        },
        "tof_1_2_10": {
            "net0": "26:c2:6f:f0:1b:0d",
            "net1": "4e:b3:7b:75:c9:9e",
            "net10": "62:73:8e:b8:a6:ff",
            "net11": "d6:1f:15:ff:10:b9",
            "net12": "aa:45:45:53:52:a1",
            "net13": "8e:12:9c:66:1e:21",
            "net14": "46:4c:59:e0:35:19",
            "net15": "a2:cc:6a:90:44:7f",
            "net16": "92:62:1e:81:c1:f6",
            "net17": "a6:4a:a9:a5:84:1f",
            "net18": "c6:d9:45:bd:8e:da",
            "net19": "7a:bd:6b:ef:bc:bd",
            "net2": "76:02:a6:4e:64:a9",
            "net3": "a2:3b:ed:0a:98:6f",
            "net4": "2e:b7:48:64:32:4c",
            "net5": "c6:0e:87:e4:e1:11",
            "net6": "b6:b2:26:28:cd:6a",
            "net7": "76:e6:eb:1b:8f:34",
            "net8": "7a:70:49:9f:2c:53",
            "net9": "36:b9:56:e1:45:ba"
        },
        "tof_1_2_2": {
            "net0": "b2:08:95:60:38:a3",
            "net1": "26:af:21:fd:70:42",
            "net10": "ca:71:71:2f:ee:19",
            "net11": "9a:ab:00:5a:d2:55",
            "net12": "f2:54:a1:81:2d:49",
            "net13": "56:10:b0:71:4d:97",
            "net14": "76:40:ef:bc:84:c6",
            "net15": "3a:f4:17:5e:b4:c1",
            "net16": "a2:f2:4c:27:8a:38",
            "net17": "16:fd:34:76:07:11",
            "net18": "56:02:cf:7b:76:c4",
            "net19": "72:65:59:53:eb:01",
            "net2": "86:64:83:7b:d2:67",
            "net3": "4a:5d:a4:ec:b3:84",
            "net4": "d6:0c:de:61:a2:07",
            "net5": "36:a9:aa:31:24:60",
            "net6": "62:5c:ca:01:53:db",
            "net7": "76:c2:ba:d1:ea:db",
            "net8": "aa:1b:52:b5:65:5a",
            "net9": "6e:66:c8:57:7b:81"
        },
        "tof_1_2_3": {
            "net0": "76:f0:6e:9d:80:8e",
            "net1": "52:28:c4:17:f6:18",
            "net10": "fa:8a:6e:d4:c7:d8",
            "net11": "76:70:cc:5b:39:8c",
            "net12": "3a:4f:f5:be:23:4a",
            "net13": "5a:74:70:3f:a1:18",
            "net14": "06:c1:42:90:bd:15",
            "net15": "2a:19:bf:32:62:b4",
            "net16": "16:b7:e0:4f:e8:41",
            "net17": "7e:3e:44:cb:39:c2",
            "net18": "aa:8b:a9:22:cc:3b",
            "net19": "ea:cd:2d:04:4d:ea",
            "net2": "da:92:a3:fc:54:78",
            "net3": "82:2d:5b:a3:af:9c",
            "net4": "fa:18:9b:98:86:6c",
            "net5": "62:41:80:5f:69:1e",
            "net6": "4a:5f:29:7a:17:f2",
            "net7": "1a:a4:eb:2b:ec:b5",
            "net8": "de:8f:c9:4b:58:88",
            "net9": "ea:53:14:ec:e2:de"
        },
        "tof_1_2_4": {
            "net0": "7e:3a:04:01:7e:f2",
            "net1": "66:17:dd:15:45:5f",
            "net10": "2e:bd:cb:07:de:52",
            "net11": "4e:62:a5:98:5e:fd",
            "net12": "d2:ca:05:b6:50:65",
            "net13": "4e:ac:d2:c8:3f:ce",
            "net14": "f2:3c:62:65:89:d9",
            "net15": "46:c1:c3:a8:1f:bd",
            "net16": "da:7c:e1:cd:98:3b",
            "net17": "22:c1:57:9d:3f:aa",
            "net18": "de:75:c8:ea:27:99",
            "net19": "42:13:7c:35:67:4d",
            "net2": "3a:e9:c0:3c:85:4c",
            "net3": "6a:bf:32:f4:d9:5f",
            "net4": "2e:ac:26:96:27:ad",
            "net5": "da:d2:5d:d6:50:54",
            "net6": "52:ac:49:67:2a:57",
            "net7": "2e:5c:e3:ac:1e:51",
            "net8": "f2:2e:01:30:5c:24",
            "net9": "de:36:c7:e0:ff:2e"
        },
        "tof_1_2_5": {
            "net0": "1a:ef:52:0e:b8:94",
            "net1": "3a:cb:65:64:84:f5",
            "net10": "aa:6c:0f:4f:d6:e0",
            "net11": "86:e3:60:70:1a:2a",
            "net12": "7e:b7:9f:5b:49:98",
            "net13": "7e:1f:d1:50:0e:24",
            "net14": "a2:67:28:af:28:10",
            "net15": "62:01:e7:68:ef:a3",
            "net16": "5e:7f:c0:d8:d2:d4",
            "net17": "a6:5d:9b:e5:f3:06",
            "net18": "3a:fb:f8:db:3a:87",
            "net19": "4a:bd:1d:01:4d:73",
            "net2": "b2:fc:d9:76:86:29",
            "net3": "d2:28:17:6c:9d:5f",
            "net4": "6a:d7:ed:b8:fb:13",
            "net5": "26:04:da:9a:c9:5c",
            "net6": "82:b9:2b:5f:88:e0",
            "net7": "9e:42:4f:f6:28:5c",
            "net8": "f6:ea:0d:f5:e9:63",
            "net9": "da:57:be:4f:bf:f2"
        },
        "tof_1_2_6": {
            "net0": "46:32:2c:73:78:d2",
            "net1": "3e:a9:f2:ab:c3:43",
            "net10": "82:87:3b:da:7c:bc",
            "net11": "9e:e8:2c:7c:15:52",
            "net12": "8e:e6:fc:3d:15:ba",
            "net13": "5a:27:35:5a:d7:b6",
            "net14": "0a:fd:18:32:85:4f",
            "net15": "06:db:13:6b:9f:17",
            "net16": "c2:1f:bc:ed:07:d1",
            "net17": "42:c4:f4:32:f1:9f",
            "net18": "6e:fc:64:52:82:54",
            "net19": "72:f5:8e:aa:34:27",
            "net2": "6a:ae:be:0a:56:98",
            "net3": "12:84:38:69:fe:3f",
            "net4": "56:77:e6:64:5e:e0",
            "net5": "de:31:c5:88:2a:bc",
            "net6": "6e:ad:1a:de:b5:e8",
            "net7": "ea:e7:fb:97:a4:6f",
            "net8": "9a:7c:f7:79:f9:53",
            "net9": "6a:1e:4a:a3:aa:2f"
        },
        "tof_1_2_7": {
            "net0": "ca:61:42:90:9f:76",
            "net1": "4a:eb:d2:eb:66:85",
            "net10": "32:c2:dc:88:e8:8e",
            "net11": "12:3a:92:71:b1:48",
            "net12": "de:4c:7e:65:58:33",
            "net13": "b2:76:36:9f:a2:b9",
            "net14": "b2:33:cf:ed:89:cd",
            "net15": "52:f1:3e:7d:fd:bc",
            "net16": "ba:3b:8b:06:8f:6d",
            "net17": "be:75:39:de:bc:db",
            "net18": "ce:a1:a6:4a:29:9f",
            "net19": "16:89:92:5a:1c:ef",
            "net2": "4a:bb:29:85:23:26",
            "net3": "d6:c2:35:de:bf:71",
            "net4": "46:78:18:28:98:3b",
            "net5": "82:04:ca:8a:38:b6",
            "net6": "1a:89:10:55:a5:65",
            "net7": "76:3d:a6:d9:1d:eb",
            "net8": "0a:14:f3:17:01:c7",
            "net9": "76:94:63:c6:25:ca"
        },
        "tof_1_2_8": {
            "net0": "6e:22:2e:3d:5d:fd",
            "net1": "c6:2c:4f:1e:97:73",
            "net10": "1a:7f:23:e1:3c:88",
            "net11": "fe:29:c3:53:37:bb",
            "net12": "8e:97:4f:ec:9f:f0",
            "net13": "6a:38:a5:ed:8e:fe",
            "net14": "26:81:9e:9d:25:a7",
            "net15": "96:67:4a:f2:77:3a",
            "net16": "3a:87:0d:ed:3e:c8",
            "net17": "7e:4b:7c:67:16:98",
            "net18": "ca:cb:3a:18:1b:d5",
            "net19": "b2:9f:e9:50:40:57",
            "net2": "ae:b0:7b:6c:d5:37",
            "net3": "f2:f1:29:3d:b5:e3",
            "net4": "ae:cd:dd:94:3e:9b",
            "net5": "26:06:c3:f4:72:be",
            "net6": "da:92:77:66:55:ad",
            "net7": "2e:77:b0:e8:01:fe",
            "net8": "ba:2b:c4:46:84:2c",
            "net9": "a6:7a:b8:f5:7d:8c"
        },
        "tof_1_2_9": {
            "net0": "3a:ff:9e:88:7f:60",
            "net1": "d2:3e:3d:4c:1e:35",
            "net10": "26:3b:53:b0:21:37",
            "net11": "9e:a6:9e:28:05:0d",
            "net12": "d6:39:03:52:00:01",
            "net13": "82:e0:21:f7:63:fc",
            "net14": "ce:90:35:d1:c1:21",
            "net15": "f2:50:ef:e9:f5:cc",
            "net16": "0e:f0:ed:cf:77:a8",
            "net17": "d2:af:39:4e:40:90",
            "net18": "02:32:6e:ad:25:f9",
            "net19": "4e:37:b1:04:3a:de",
            "net2": "2a:3b:88:36:7b:92",
            "net3": "7a:79:8c:5a:a3:67",
            "net4": "8a:bb:4c:83:92:46",
            "net5": "5e:8e:4a:50:4d:ae",
            "net6": "22:b6:4e:82:d0:4b",
            "net7": "da:80:4e:a4:34:bd",
            "net8": "ba:70:a9:e5:e8:a8",
            "net9": "0a:3f:35:f1:f3:4a"
        },
        "tof_2_2_1": {
            "net0": "3e:d6:7b:0e:47:b7",
            "net1": "66:0b:33:e0:fb:78",
            "net10": "1e:0e:c8:7a:e6:b9",
            "net11": "1e:4a:25:54:bd:9c",
            "net12": "56:b6:18:90:d3:65",
            "net13": "fe:94:ee:1a:6a:0b",
            "net14": "ee:90:34:d5:af:9e",
            "net15": "0e:4e:ac:8a:fd:94",
            "net16": "f6:53:04:af:ab:a9",
            "net17": "0e:18:12:29:ce:a3",
            "net18": "b6:1f:b1:1a:f3:ca",
            "net19": "76:e4:87:1d:2c:a6",
            "net2": "6e:e4:cc:fd:9e:69",
            "net3": "96:e3:3a:66:29:15",
            "net4": "1e:5b:a9:18:a9:62",
            "net5": "8e:d6:21:62:89:3e",
            "net6": "82:0e:d6:4f:90:bf",
            "net7": "46:94:73:fb:98:90",
            "net8": "2a:22:06:fb:e9:20",
            "net9": "e2:aa:c8:23:40:2f"
        },
        "tof_2_2_10": {
            "net0": "0a:12:de:53:f3:16",
            "net1": "06:f3:f6:cf:0a:2d",
            "net10": "c6:71:3d:58:0b:93",
            "net11": "56:88:37:8b:6a:70",
            "net12": "06:59:20:87:0e:06",
            "net13": "22:37:51:84:8d:62",
            "net14": "9e:d3:28:5e:6c:fe",
            "net15": "96:56:81:84:a1:00",
            "net16": "fe:69:4f:22:50:37",
            "net17": "ee:f3:33:f2:29:d5",
            "net18": "0e:66:91:d8:cf:8b",
            "net19": "76:06:2a:a7:68:51",
            "net2": "66:49:3d:06:17:07",
            "net3": "3e:d3:13:3e:3b:32",
            "net4": "06:8e:31:42:36:68",
            "net5": "92:f7:ca:1e:fa:32",
            "net6": "46:3b:e7:d7:53:11",
            "net7": "76:28:aa:49:ba:78",
            "net8": "62:52:0e:c8:d4:ba",
            "net9": "7a:ed:cd:b0:8f:0f"
        },
        "tof_2_2_2": {
            "net0": "92:c3:75:67:9b:82",
            "net1": "4e:b5:43:6b:cc:e2",
            "net10": "ae:94:00:a8:c1:1e",
            "net11": "c6:83:67:52:d2:6e",
            "net12": "96:57:07:de:30:85",
            "net13": "de:60:19:41:22:73",
            "net14": "e6:3d:fb:59:3d:1d",
            "net15": "6a:a5:40:40:ef:a8",
            "net16": "a2:5f:ec:66:cd:e1",
            "net17": "c2:9b:1e:bd:20:5c",
            "net18": "a6:9a:b1:fd:4f:d0",
            "net19": "2a:39:02:e9:47:94",
            "net2": "f2:c4:db:59:54:d1",
            "net3": "32:fb:5d:23:15:74",
            "net4": "ba:2d:b9:71:df:23",
            "net5": "ea:3c:13:5a:3c:10",
            "net6": "b2:63:7f:56:aa:64",
            "net7": "46:66:19:8a:7e:9b",
            "net8": "ae:f7:1e:77:02:8e",
            "net9": "e2:7e:77:8e:bf:b7"
        },
        "tof_2_2_3": {
            "net0": "5e:df:5b:06:c3:b9",
            "net1": "aa:01:8c:2c:d7:a9",
            "net10": "4a:bc:63:7c:cd:e9",
            "net11": "76:73:5a:96:8a:74",
            "net12": "9a:2e:a3:0c:85:0a",
            "net13": "4e:17:c1:79:7c:73",
            "net14": "22:11:a5:24:5b:6b",
            "net15": "8a:30:55:64:38:f6",
            "net16": "9e:2d:e0:82:56:12",
            "net17": "ee:d6:40:61:29:6c",
            "net18": "ba:f1:a2:5b:b8:17",
            "net19": "e2:cb:d4:31:01:a2",
            "net2": "62:75:ea:f0:dc:0c",
            "net3": "82:3e:d9:0d:6d:c5",
            "net4": "2e:11:93:bd:46:e7",
            "net5": "0e:12:a0:bb:15:13",
            "net6": "02:7e:f8:2a:6a:f5",
            "net7": "a6:f4:4f:4c:dc:31",
            "net8": "72:2c:73:c4:eb:75",
            "net9": "a6:7a:2d:78:21:6b"
        },
        "tof_2_2_4": {
            "net0": "12:91:0a:56:04:fb",
            "net1": "5e:44:c2:f8:ac:d0",
            "net10": "ba:4b:1f:b8:aa:4b",
            "net11": "5a:3e:59:c2:d4:b0",
            "net12": "ce:74:89:59:30:7f",
            "net13": "c6:e7:a8:b8:59:0a",
            "net14": "ee:ec:85:9d:a6:89",
            "net15": "22:49:00:87:6f:5b",
            "net16": "3a:d8:29:cc:4a:8c",
            "net17": "4e:f6:96:0f:26:e8",
            "net18": "e2:cf:bd:80:95:bd",
            "net19": "12:3f:5f:00:80:9c",
            "net2": "1a:34:44:e5:4f:b9",
            "net3": "22:74:72:38:83:1d",
            "net4": "12:cd:48:cf:7c:2d",
            "net5": "ae:80:c9:ec:10:49",
            "net6": "ca:2f:c7:66:53:71",
            "net7": "fa:66:cc:8e:20:c6",
            "net8": "92:ab:b7:ea:e7:51",
            "net9": "86:7f:56:25:ef:ad"
        },
        "tof_2_2_5": {
            "net0": "4e:86:8f:60:4a:bf",
            "net1": "02:a7:a1:29:26:2d",
            "net10": "e6:59:46:60:d6:df",
            "net11": "72:43:88:0d:20:a1",
            "net12": "a6:15:8b:35:d3:d4",
            "net13": "3a:8b:f8:71:78:8b",
            "net14": "f2:70:c2:3c:fe:0c",
            "net15": "6a:50:20:f8:1d:71",
            "net16": "9e:cf:21:49:f9:8e",
            "net17": "42:ef:92:fa:84:21",
            "net18": "66:b3:3a:4a:1f:9e",
            "net19": "5a:2f:87:7a:7d:92",
            "net2": "d2:90:f7:92:ba:fa",
            "net3": "ce:48:67:15:76:97",
            "net4": "f6:0e:aa:cd:1a:7d",
            "net5": "ea:85:70:cd:d6:95",
            "net6": "26:df:6e:5f:bd:67",
            "net7": "1e:6f:d3:91:e3:82",
            "net8": "72:44:f6:3f:4b:2d",
            "net9": "5a:44:24:86:4d:f3"
        },
        "tof_2_2_6": {
            "net0": "c2:ed:a5:0c:0f:2c",
            "net1": "d2:22:bb:cc:a8:18",
            "net10": "36:d5:f4:88:3e:93",
            "net11": "f6:46:ed:88:2c:a5",
            "net12": "c6:7c:b8:c3:28:e2",
            "net13": "e2:7c:60:14:8f:ad",
            "net14": "da:13:f2:39:e8:0a",
            "net15": "ee:ee:f5:62:1a:40",
            "net16": "62:f9:ad:0f:19:2d",
            "net17": "42:e9:04:04:11:1c",
            "net18": "52:c0:e3:92:71:31",
            "net19": "06:cb:46:0c:2d:df",
            "net2": "46:13:7a:af:2c:d0",
            "net3": "ea:08:52:0f:9d:5e",
            "net4": "42:b7:11:f8:13:f9",
            "net5": "ce:87:2d:b3:d4:96",
            "net6": "1e:2a:61:38:a2:64",
            "net7": "3a:ca:90:85:0b:f2",
            "net8": "4a:27:0d:cc:a0:43",
            "net9": "36:2c:b0:1d:64:f3"
        },
        "tof_2_2_7": {
            "net0": "06:d8:25:19:52:87",
            "net1": "ca:4a:94:65:4c:ba",
            "net10": "5a:2c:85:d1:c5:44",
            "net11": "72:13:2b:22:a1:3e",
            "net12": "2e:60:4f:b4:fc:cf",
            "net13": "5e:90:80:1a:ad:af",
            "net14": "32:72:6f:02:c0:6b",
            "net15": "62:77:92:e5:9d:a9",
            "net16": "da:13:a9:3b:09:25",
            "net17": "4a:0a:52:74:8f:e1",
            "net18": "c2:ef:40:d1:61:46",
            "net19": "ee:70:61:40:3f:e9",
            "net2": "e6:35:44:8f:9d:98",
            "net3": "86:a0:79:b7:3e:f4",
            "net4": "22:94:8f:ca:78:5a",
            "net5": "76:56:e2:c0:e7:07",
            "net6": "e2:f7:c3:25:97:2d",
            "net7": "de:78:fb:fe:02:d2",
            "net8": "72:c1:74:6c:b5:84",
            "net9": "92:67:c6:3a:fa:76"
        },
        "tof_2_2_8": {
            "net0": "5a:ef:e5:db:7e:74",
            "net1": "6e:1f:bd:9c:42:97",
            "net10": "82:31:57:c5:5b:55",
            "net11": "12:f2:2f:be:64:a7",
            "net12": "f6:13:89:d1:db:1f",
            "net13": "12:49:56:0f:a9:a5",
            "net14": "12:f0:9d:3c:64:93",
            "net15": "92:0f:58:7e:e6:d0",
            "net16": "86:df:df:4d:36:8e",
            "net17": "06:a3:61:15:45:98",
            "net18": "36:6f:b7:f8:40:71",
            "net19": "1a:10:34:44:33:94",
            "net2": "ca:88:8c:39:6f:e1",
            "net3": "8a:77:8c:3c:04:a1",
            "net4": "86:d8:79:37:c5:90",
            "net5": "ea:2d:72:10:73:ec",
            "net6": "a2:38:6f:57:68:c9",
            "net7": "66:9c:c9:e6:9d:4f",
            "net8": "d2:c6:6f:51:e6:f9",
            "net9": "5e:d9:43:e4:ea:b0"
        },
        "tof_2_2_9": {
            "net0": "2e:c6:c2:c2:e8:09",
            "net1": "1e:da:27:d2:f7:d0",
            "net10": "86:7d:a4:0b:47:76",
            "net11": "3a:a9:e4:35:14:a9",
            "net12": "4a:55:6f:b6:df:01",
            "net13": "6e:51:e8:c3:a2:7d",
            "net14": "46:fd:8f:e4:0d:46",
            "net15": "6a:d4:c5:9d:1a:2f",
            "net16": "f6:2c:bd:90:b8:ba",
            "net17": "12:61:95:4b:c7:92",
            "net18": "a2:cb:af:3a:13:34",
            "net19": "da:9b:62:61:37:d2",
            "net2": "86:b3:85:55:e4:b9",
            "net3": "5e:f4:ea:42:ec:fe",
            "net4": "0a:1d:f3:a8:e6:5e",
            "net5": "86:81:b7:d0:cb:b8",
            "net6": "62:d5:57:54:fc:62",
            "net7": "22:75:fe:63:86:93",
            "net8": "4a:b3:e1:be:c3:7a",
            "net9": "7a:2c:79:ae:3b:9d"
        }
    },
    "failed_machine": "leaf_1_0_1",
    "failure_time": {
        "leaf_1_0_1": 1621875685.40086,
        "leaf_1_0_10": 1621875685.4261715,
        "leaf_1_0_2": 1621875685.4530456,
        "leaf_1_0_3": 1621875685.4786963,
        "leaf_1_0_4": 1621875685.507079,
        "leaf_1_0_5": 1621875685.5280025,
        "leaf_1_0_6": 1621875685.5611944,
        "leaf_1_0_7": 1621875685.4058733,
        "leaf_1_0_8": 1621875685.4310145,
        "leaf_1_0_9": 1621875685.4570155,
        "leaf_2_0_1": 1621875685.4793954,
        "leaf_2_0_10": 1621875685.499474,
        "leaf_2_0_2": 1621875685.507315,
        "leaf_2_0_3": 1621875685.5243216,
        "leaf_2_0_4": 1621875685.4080784,
        "leaf_2_0_5": 1621875685.4385521,
        "leaf_2_0_6": 1621875685.4610925,
        "leaf_2_0_7": 1621875685.491144,
        "leaf_2_0_8": 1621875685.5029757,
        "leaf_2_0_9": 1621875685.5119054,
        "leaf_3_0_1": 1621875685.528662,
        "leaf_3_0_10": 1621875685.4133854,
        "leaf_3_0_2": 1621875685.4448211,
        "leaf_3_0_3": 1621875685.4707954,
        "leaf_3_0_4": 1621875685.4902532,
        "leaf_3_0_5": 1621875685.5040157,
        "leaf_3_0_6": 1621875685.5257242,
        "leaf_3_0_7": 1621875685.545826,
        "leaf_3_0_8": 1621875685.5312378,
        "leaf_3_0_9": 1621875685.56464,
        "leaf_4_0_1": 1621875685.60311,
        "leaf_4_0_10": 1621875685.6207094,
        "leaf_4_0_2": 1621875685.6447325,
        "leaf_4_0_3": 1621875685.6676621,
        "leaf_4_0_4": 1621875685.6905522,
        "leaf_4_0_5": 1621875685.5545025,
        "leaf_4_0_6": 1621875685.566292,
        "leaf_4_0_7": 1621875685.5980086,
        "leaf_4_0_8": 1621875685.6079893,
        "leaf_4_0_9": 1621875685.6354163,
        "spine_1_1_1": 1621875685.6613197,
        "spine_1_1_10": 1621875685.6859677,
        "spine_1_1_2": 1621875685.5827098,
        "spine_1_1_3": 1621875685.6056576,
        "spine_1_1_4": 1621875685.635334,
        "spine_1_1_5": 1621875685.6642654,
        "spine_1_1_6": 1621875685.6886156,
        "spine_1_1_7": 1621875685.7120123,
        "spine_1_1_8": 1621875685.7315633,
        "spine_1_1_9": 1621875685.5849192,
        "spine_2_1_1": 1621875685.6030934,
        "spine_2_1_10": 1621875685.6297395,
        "spine_2_1_2": 1621875685.6540263,
        "spine_2_1_3": 1621875685.6810436,
        "spine_2_1_4": 1621875685.7007067,
        "spine_2_1_5": 1621875685.7215185,
        "spine_2_1_6": 1621875685.7047951,
        "spine_2_1_7": 1621875685.7302926,
        "spine_2_1_8": 1621875685.7421567,
        "spine_2_1_9": 1621875685.7712474,
        "spine_3_1_1": 1621875685.7926235,
        "spine_3_1_10": 1621875685.8079853,
        "spine_3_1_2": 1621875685.8172112,
        "spine_3_1_3": 1621875685.7166803,
        "spine_3_1_4": 1621875685.735422,
        "spine_3_1_5": 1621875685.7639694,
        "spine_3_1_6": 1621875685.7914226,
        "spine_3_1_7": 1621875685.8105361,
        "spine_3_1_8": 1621875685.8374898,
        "spine_3_1_9": 1621875685.876661,
        "spine_4_1_1": 1621875685.737026,
        "spine_4_1_10": 1621875685.7664084,
        "spine_4_1_2": 1621875685.794502,
        "spine_4_1_3": 1621875685.8138049,
        "spine_4_1_4": 1621875685.8435147,
        "spine_4_1_5": 1621875685.8807561,
        "spine_4_1_6": 1621875685.9082122,
        "spine_4_1_7": 1621875685.7466094,
        "spine_4_1_8": 1621875685.7757487,
        "spine_4_1_9": 1621875685.7968936,
        "tof_1_2_1": 1621875685.8126945,
        "tof_1_2_10": 1621875685.837691,
        "tof_1_2_2": 1621875685.8784566,
        "tof_1_2_3": 1621875685.8962183,
        "tof_1_2_4": 1621875685.8417375,
        "tof_1_2_5": 1621875685.882761,
        "tof_1_2_6": 1621875685.9099538,
        "tof_1_2_7": 1621875685.9173932,
        "tof_1_2_8": 1621875685.928109,
        "tof_1_2_9": 1621875685.940276,
        "tof_2_2_1": 1621875685.9556599,
        "tof_2_2_10": 1621875685.8921454,
        "tof_2_2_2": 1621875685.9162376,
        "tof_2_2_3": 1621875685.9333298,
        "tof_2_2_4": 1621875685.9419124,
        "tof_2_2_5": 1621875685.96255,
        "tof_2_2_6": 1621875685.9710336,
        "tof_2_2_7": 1621875685.983484,
        "tof_2_2_8": 1621875685.9170027,
        "tof_2_2_9": 1621875685.938169
    }
}