{
    "description": "Scenario 7: Partitioned fabric (selecting tof_1_2_1 node) with BGP",
    "k_leaf": 10,
    "k_top": 10,
    "redundancy_factor": 5,
    "is_k8s": true,
    "machine_mac_addresses": {
        "leaf_1_0_1": {
            "net0": "0e:1c:10:77:d1:f1",
            "net1": "f2:d5:0d:d2:42:1c",
            "net10": "06:c1:e5:80:a2:ed",
            "net2": "2a:ff:2b:c3:ff:f8",
            "net3": "0e:a2:70:31:32:e0",
            "net4": "66:6d:1a:dd:1e:5b",
            "net5": "d6:48:fb:d4:0b:d0",
            "net6": "56:9c:bc:c5:52:e0",
            "net7": "8a:36:38:ec:a8:82",
            "net8": "4e:29:e3:7b:5f:86",
            "net9": "4a:45:e6:a3:d4:b6"
        },
        "leaf_1_0_10": {
            "net0": "ce:ea:bb:95:f3:cc",
            "net1": "7e:e5:30:21:59:a6",
            "net10": "0a:ae:f3:43:b7:da",
            "net2": "3e:e9:0a:55:96:4a",
            "net3": "92:c7:95:b7:87:b3",
            "net4": "ce:9c:69:2c:e1:88",
            "net5": "06:c8:d7:42:2f:a8",
            "net6": "5e:53:e6:a3:c3:a3",
            "net7": "0a:fb:43:b9:36:4e",
            "net8": "1e:e6:8d:34:1e:bc",
            "net9": "36:31:e5:f3:37:93"
        },
        "leaf_1_0_2": {
            "net0": "e6:d4:a8:b5:8c:bb",
            "net1": "2a:19:a9:1a:92:b9",
            "net10": "12:f2:f7:e9:9e:22",
            "net2": "06:56:e2:3e:b3:28",
            "net3": "82:49:ef:73:3c:b1",
            "net4": "36:98:5d:9c:28:0a",
            "net5": "9a:98:56:5a:e1:97",
            "net6": "f6:43:af:4a:5a:85",
            "net7": "0a:89:df:c8:eb:99",
            "net8": "5a:bf:28:5b:f3:41",
            "net9": "a2:b5:f3:f2:67:f2"
        },
        "leaf_1_0_3": {
            "net0": "82:e7:cf:90:cf:07",
            "net1": "fe:22:a0:29:40:87",
            "net10": "fa:cf:ff:da:74:81",
            "net2": "8e:2e:9c:cc:20:17",
            "net3": "6a:5d:f2:55:d2:b2",
            "net4": "b6:00:b2:29:88:06",
            "net5": "de:c0:63:92:07:bf",
            "net6": "46:b2:53:cd:c6:ba",
            "net7": "e2:28:eb:68:52:79",
            "net8": "22:f7:b7:e3:f6:29",
            "net9": "f6:0b:9e:2f:52:50"
        },
        "leaf_1_0_4": {
            "net0": "ae:58:ae:bb:02:8c",
            "net1": "f2:41:4b:4d:97:6e",
            "net10": "f2:a6:51:3f:45:32",
            "net2": "be:a1:ee:51:7f:75",
            "net3": "3e:d9:7b:ba:0f:01",
            "net4": "62:41:bd:81:f0:1e",
            "net5": "aa:63:18:91:06:8f",
            "net6": "c2:23:a9:55:98:45",
            "net7": "46:5b:a8:fd:c7:05",
            "net8": "ba:fc:c2:b6:89:43",
            "net9": "92:de:fb:38:53:ca"
        },
        "leaf_1_0_5": {
            "net0": "e6:44:36:24:ca:2c",
            "net1": "52:dd:ce:52:a2:70",
            "net10": "5a:37:94:fc:d7:ec",
            "net2": "62:06:2d:ca:1d:2a",
            "net3": "46:8e:28:e2:ef:1b",
            "net4": "62:1a:70:ad:9f:a7",
            "net5": "ea:07:64:d7:d2:75",
            "net6": "82:37:54:a4:23:7d",
            "net7": "ce:3d:a4:7f:31:84",
            "net8": "32:4c:0e:e3:fd:b0",
            "net9": "4a:58:b7:f4:54:4d"
        },
        "leaf_1_0_6": {
            "net0": "b6:78:3d:77:70:8e",
            "net1": "a2:58:21:3e:08:4f",
            "net10": "5e:dd:40:9f:36:87",
            "net2": "1e:ce:2e:fc:6e:61",
            "net3": "d6:29:56:68:49:fd",
            "net4": "4a:60:ed:e8:7b:9e",
            "net5": "6a:dc:d4:9e:3c:50",
            "net6": "5e:ae:59:1f:79:e1",
            "net7": "66:e2:cd:3f:a2:8a",
            "net8": "2e:d1:8b:49:75:0b",
            "net9": "06:1e:dc:13:d6:0e"
        },
        "leaf_1_0_7": {
            "net0": "3e:bc:9d:81:a3:3e",
            "net1": "6e:a3:4d:31:f7:6d",
            "net10": "fa:79:9b:93:62:bf",
            "net2": "c6:11:47:6b:b1:ea",
            "net3": "5e:84:68:52:cf:26",
            "net4": "c6:00:ca:d1:49:57",
            "net5": "a2:ff:13:ef:db:e9",
            "net6": "f6:6c:51:d1:b8:12",
            "net7": "1a:5e:f1:a1:0f:d1",
            "net8": "2e:45:00:34:bc:7e",
            "net9": "3a:ff:40:c2:6a:17"
        },
        "leaf_1_0_8": {
            "net0": "fe:a7:0e:c7:c6:67",
            "net1": "e6:46:82:6b:03:40",
            "net10": "3e:8a:5f:bf:3a:67",
            "net2": "36:d7:98:4c:46:de",
            "net3": "aa:6d:6c:7b:52:1b",
            "net4": "06:f2:19:0c:8d:47",
            "net5": "32:7a:3e:2a:8d:f4",
            "net6": "16:61:56:f4:bd:76",
            "net7": "de:fe:97:c9:a1:14",
            "net8": "96:15:c2:5e:4b:1d",
            "net9": "36:fa:1d:a8:d5:b3"
        },
        "leaf_1_0_9": {
            "net0": "52:d3:cf:65:c8:f2",
            "net1": "82:86:ee:92:2c:7b",
            "net10": "5a:aa:5c:4f:8f:30",
            "net2": "92:6a:8b:8f:76:bf",
            "net3": "8e:b2:f7:70:17:10",
            "net4": "e2:fc:34:75:d8:2b",
            "net5": "c2:6e:5a:8f:ca:ea",
            "net6": "7a:5e:e3:bc:fe:fa",
            "net7": "12:cf:5f:e5:ca:8e",
            "net8": "96:00:61:be:56:74",
            "net9": "ee:dd:35:52:3b:8a"
        },
        "leaf_2_0_1": {
            "net0": "ea:a0:04:cb:27:6e",
            "net1": "1a:35:4c:2e:93:8d",
            "net10": "c2:8a:d9:e7:0d:57",
            "net2": "0a:e6:73:2b:3e:a7",
            "net3": "8e:40:5f:54:4e:ea",
            "net4": "72:0f:3d:d6:1c:24",
            "net5": "fa:94:27:99:17:cb",
            "net6": "26:b1:cc:a8:6c:f5",
            "net7": "fa:c0:f8:bc:94:de",
            "net8": "ba:29:e3:10:e6:76",
            "net9": "5e:64:bd:66:f6:a8"
        },
        "leaf_2_0_10": {
            "net0": "fe:b5:88:d0:e5:07",
            "net1": "e6:bb:aa:ba:ed:60",
            "net10": "a6:3b:57:13:71:9f",
            "net2": "ba:e0:7e:7a:ce:1b",
            "net3": "6a:27:3b:a6:94:4a",
            "net4": "42:61:df:29:6a:ae",
            "net5": "ae:66:6b:87:f4:e9",
            "net6": "8e:16:d6:95:84:c8",
            "net7": "9a:c2:80:3d:8b:d3",
            "net8": "b2:0a:28:8a:da:8d",
            "net9": "02:40:70:60:87:c2"
        },
        "leaf_2_0_2": {
            "net0": "aa:57:b7:c3:3d:e9",
            "net1": "2a:d5:89:ee:57:c2",
            "net10": "46:9e:fb:74:c9:78",
            "net2": "b2:70:e6:56:7b:ba",
            "net3": "9e:ba:8f:e5:08:6e",
            "net4": "22:7b:76:cd:98:d6",
            "net5": "e6:81:42:e5:54:a6",
            "net6": "4e:e3:f9:8e:bb:11",
            "net7": "2e:f4:07:2d:9b:0e",
            "net8": "5e:e2:b6:b7:df:eb",
            "net9": "2e:60:32:63:80:87"
        },
        "leaf_2_0_3": {
            "net0": "ea:49:87:93:b6:f9",
            "net1": "de:31:b5:71:1b:a0",
            "net10": "0e:fe:b9:ff:06:a0",
            "net2": "7a:57:99:bb:3a:f4",
            "net3": "f2:08:f1:14:7b:68",
            "net4": "e2:84:9f:51:e3:eb",
            "net5": "fa:8d:32:88:61:85",
            "net6": "d2:da:1e:b8:19:f0",
            "net7": "da:fa:f0:aa:20:9b",
            "net8": "be:6b:f0:b9:78:45",
            "net9": "b6:40:90:80:6c:37"
        },
        "leaf_2_0_4": {
            "net0": "86:13:6c:9b:3f:5d",
            "net1": "6a:0f:29:4d:7b:16",
            "net10": "8e:6c:30:61:f2:a8",
            "net2": "56:0e:b6:39:8e:b8",
            "net3": "c6:49:a5:ce:da:20",
            "net4": "d6:e9:96:c7:68:34",
            "net5": "fe:9b:46:63:31:5d",
            "net6": "e6:47:0a:6c:db:73",
            "net7": "e6:de:0a:ca:9f:36",
            "net8": "f2:e6:98:f4:38:a3",
            "net9": "12:20:e8:c2:06:05"
        },
        "leaf_2_0_5": {
            "net0": "e2:ad:3d:bd:4e:c3",
            "net1": "d2:68:c2:84:03:70",
            "net10": "8a:99:4b:57:9f:44",
            "net2": "ca:1f:a5:61:33:34",
            "net3": "46:3a:b0:76:45:b6",
            "net4": "9e:0c:99:16:25:7d",
            "net5": "e6:fa:50:7a:d5:b8",
            "net6": "66:79:91:52:de:54",
            "net7": "32:42:a6:bf:a1:a4",
            "net8": "9a:eb:7f:d9:76:a6",
            "net9": "3a:20:a7:d8:6d:02"
        },
        "leaf_2_0_6": {
            "net0": "22:db:74:43:cb:c8",
            "net1": "0a:1e:fc:74:4c:e0",
            "net10": "86:ca:6a:f4:a4:95",
            "net2": "da:c8:0b:e3:0c:d8",
            "net3": "16:b6:1d:d1:b1:76",
            "net4": "1a:a8:97:36:8d:11",
            "net5": "3a:91:a2:57:67:06",
            "net6": "b2:c4:53:4e:4b:8b",
            "net7": "36:d7:44:89:36:cf",
            "net8": "8e:ac:b1:eb:80:fc",
            "net9": "2e:e0:2d:70:c7:d1"
        },
        "leaf_2_0_7": {
            "net0": "0a:6f:cd:22:bc:8c",
            "net1": "36:b4:17:10:e6:48",
            "net10": "16:30:95:1b:e9:0e",
            "net2": "ba:aa:48:4d:5b:41",
            "net3": "8e:d5:66:7e:49:0c",
            "net4": "32:bf:a5:eb:7b:a5",
            "net5": "82:fa:21:e8:2d:37",
            "net6": "f2:25:31:58:e9:34",
            "net7": "0a:ec:6e:53:54:78",
            "net8": "fa:93:97:9f:be:38",
            "net9": "32:01:88:04:ff:ad"
        },
        "leaf_2_0_8": {
            "net0": "ce:a2:9c:bd:9f:ad",
            "net1": "5e:28:6b:3d:40:7d",
            "net10": "ae:0c:5f:7e:a1:ac",
            "net2": "02:74:69:76:87:c8",
            "net3": "ce:cb:03:72:d3:2c",
            "net4": "aa:70:18:66:d8:8b",
            "net5": "0a:91:04:16:b3:f6",
            "net6": "26:f4:1c:8e:01:81",
            "net7": "be:6f:bd:11:0e:86",
            "net8": "7e:54:d1:af:f7:92",
            "net9": "82:0b:e5:a3:ae:2d"
        },
        "leaf_2_0_9": {
            "net0": "fe:c4:7c:19:f2:b2",
            "net1": "e2:10:de:34:16:e9",
            "net10": "16:d3:22:a5:6b:e5",
            "net2": "fe:db:b5:62:6b:3e",
            "net3": "86:07:0e:4c:ed:5c",
            "net4": "7a:17:77:d3:2a:e4",
            "net5": "f2:19:7a:55:f0:e9",
            "net6": "ae:47:4c:f7:d0:86",
            "net7": "ba:84:a8:98:39:fb",
            "net8": "72:5a:e0:3c:5e:c6",
            "net9": "36:f5:08:af:48:e7"
        },
        "leaf_3_0_1": {
            "net0": "fe:1d:a4:28:9b:c8",
            "net1": "9e:e0:45:da:bc:2d",
            "net10": "1e:15:e3:8e:79:90",
            "net2": "f2:1a:11:7b:f2:53",
            "net3": "72:80:26:b4:a0:39",
            "net4": "b6:ce:72:d5:aa:8c",
            "net5": "12:c5:ee:ee:d9:6d",
            "net6": "aa:da:c3:e6:fa:39",
            "net7": "ce:fe:ca:15:e2:0c",
            "net8": "2a:9b:f1:0e:59:f7",
            "net9": "5e:86:31:6b:aa:8c"
        },
        "leaf_3_0_10": {
            "net0": "ba:95:d0:3d:82:da",
            "net1": "46:22:c9:6f:3e:57",
            "net10": "06:44:3b:74:be:36",
            "net2": "0e:19:80:23:e2:3f",
            "net3": "f6:2e:7c:63:9b:0b",
            "net4": "46:5d:7c:92:7b:79",
            "net5": "02:77:0b:82:56:73",
            "net6": "52:4d:bd:17:97:5b",
            "net7": "e6:d7:4d:0c:f4:38",
            "net8": "42:dd:f7:70:db:19",
            "net9": "e6:fe:72:be:f0:ca"
        },
        "leaf_3_0_2": {
            "net0": "2e:ef:ba:ea:e6:f0",
            "net1": "7e:cf:56:d6:25:5e",
            "net10": "5a:98:ef:7c:25:38",
            "net2": "ce:29:cc:9f:ea:6a",
            "net3": "de:6f:8c:16:b2:ee",
            "net4": "96:a3:d6:18:39:1e",
            "net5": "3e:4c:62:09:1a:2e",
            "net6": "d6:c0:39:7a:98:1c",
            "net7": "4e:6c:25:e4:11:30",
            "net8": "b2:a6:de:5f:a5:d4",
            "net9": "b6:c6:3f:36:18:18"
        },
        "leaf_3_0_3": {
            "net0": "86:f2:a1:19:eb:b6",
            "net1": "ae:4f:b6:98:57:85",
            "net10": "0a:7e:b8:b0:5d:f4",
            "net2": "6a:6a:91:d2:bf:33",
            "net3": "0a:24:bc:c1:b9:16",
            "net4": "26:33:87:db:ca:54",
            "net5": "b6:ec:15:db:8b:2b",
            "net6": "ee:b5:54:00:d8:4c",
            "net7": "06:bc:23:e8:97:4b",
            "net8": "62:aa:56:9c:35:ac",
            "net9": "52:5e:5c:66:b8:cb"
        },
        "leaf_3_0_4": {
            "net0": "4a:b1:7e:6c:cc:86",
            "net1": "0a:eb:f3:1e:f9:2d",
            "net10": "ba:25:3e:68:25:32",
            "net2": "f6:39:ee:77:db:4e",
            "net3": "4e:76:54:d5:15:11",
            "net4": "c6:be:78:b7:af:24",
            "net5": "f6:22:4f:3d:b5:f5",
            "net6": "5e:bf:c2:c3:52:60",
            "net7": "0a:f5:21:cc:00:c2",
            "net8": "76:59:13:3f:4f:5f",
            "net9": "22:2d:9a:4d:fe:87"
        },
        "leaf_3_0_5": {
            "net0": "22:b0:d9:0b:b9:e0",
            "net1": "0a:e8:e1:d1:30:e9",
            "net10": "c6:50:09:13:8c:72",
            "net2": "d2:bc:09:ec:f1:c0",
            "net3": "92:22:10:c7:10:13",
            "net4": "a2:cb:e7:89:f4:54",
            "net5": "9a:31:9f:a6:7c:c4",
            "net6": "3e:ba:2f:cf:e3:77",
            "net7": "4e:80:31:0e:5f:54",
            "net8": "ee:91:5b:6e:81:6c",
            "net9": "b6:a5:ac:1e:f2:33"
        },
        "leaf_3_0_6": {
            "net0": "1e:d5:ac:af:9b:21",
            "net1": "1a:a1:75:bf:a6:78",
            "net10": "3a:aa:bd:4c:17:1a",
            "net2": "4a:2e:5e:91:0b:43",
            "net3": "b6:47:c9:d0:f6:f2",
            "net4": "62:9c:07:a1:9d:56",
            "net5": "da:f9:01:8c:8a:fe",
            "net6": "26:24:e1:27:26:5e",
            "net7": "52:85:09:11:b4:91",
            "net8": "e6:86:ca:f2:13:ed",
            "net9": "1a:31:69:eb:1e:c5"
        },
        "leaf_3_0_7": {
            "net0": "f2:31:bc:11:57:b8",
            "net1": "0e:3a:0f:ea:59:99",
            "net10": "da:4f:16:6b:f1:73",
            "net2": "0a:de:56:46:a9:d6",
            "net3": "02:1d:77:35:9a:7d",
            "net4": "72:21:29:58:6c:a9",
            "net5": "e2:33:4d:de:c4:8d",
            "net6": "3e:e6:6c:6e:54:12",
            "net7": "ca:ef:af:b2:13:0f",
            "net8": "aa:92:22:14:6f:a3",
            "net9": "c6:b7:5a:da:ec:ed"
        },
        "leaf_3_0_8": {
            "net0": "9a:07:dd:9e:51:06",
            "net1": "9e:14:04:68:65:78",
            "net10": "1e:e9:6e:9b:9d:61",
            "net2": "6a:df:6d:93:4a:1a",
            "net3": "62:74:02:fd:0c:5f",
            "net4": "86:8f:ca:3f:45:3d",
            "net5": "c6:7c:58:8a:97:12",
            "net6": "d6:11:32:0b:ea:10",
            "net7": "ce:df:97:10:49:3f",
            "net8": "16:6b:61:f1:3f:2f",
            "net9": "b2:65:45:d2:7a:53"
        },
        "leaf_3_0_9": {
            "net0": "b2:17:13:73:05:3a",
            "net1": "8e:40:3e:4e:49:4f",
            "net10": "06:45:95:92:30:25",
            "net2": "82:a3:b8:84:81:12",
            "net3": "76:d2:15:f8:7e:9a",
            "net4": "aa:48:4e:cf:62:7c",
            "net5": "e2:16:f2:dc:58:33",
            "net6": "36:86:ca:9c:88:d8",
            "net7": "fa:7f:dc:c0:96:a9",
            "net8": "22:2a:de:4c:3c:d3",
            "net9": "92:ab:dc:e3:bd:60"
        },
        "leaf_4_0_1": {
            "net0": "0a:6b:1f:87:86:fd",
            "net1": "46:7c:e7:ab:71:52",
            "net10": "9a:d7:ed:a8:96:59",
            "net2": "36:4e:80:29:09:70",
            "net3": "1a:87:c0:34:d6:68",
            "net4": "0e:66:b0:9f:eb:ad",
            "net5": "be:92:68:3f:07:d3",
            "net6": "e2:20:89:e0:d1:2d",
            "net7": "e2:72:11:28:52:73",
            "net8": "76:d5:66:2d:88:ee",
            "net9": "be:03:00:90:04:9e"
        },
        "leaf_4_0_10": {
            "net0": "46:29:fe:52:4c:9e",
            "net1": "8e:fe:9f:ae:1e:51",
            "net10": "02:b5:65:22:b2:9a",
            "net2": "56:25:9f:e8:d6:d3",
            "net3": "ce:1f:f0:f8:36:45",
            "net4": "3e:93:e1:6a:b2:9c",
            "net5": "1e:19:27:38:7a:a4",
            "net6": "1a:9b:46:18:cc:f1",
            "net7": "9e:60:08:13:c5:06",
            "net8": "be:fb:93:6e:26:fb",
            "net9": "da:9e:a9:24:e3:a8"
        },
        "leaf_4_0_2": {
            "net0": "fe:37:dd:c0:43:d2",
            "net1": "76:ae:28:d4:04:b7",
            "net10": "3a:6a:e3:d9:09:b6",
            "net2": "36:00:b6:85:56:ae",
            "net3": "06:0a:5e:27:5d:34",
            "net4": "4e:d2:e7:48:76:26",
            "net5": "02:f7:12:84:2b:71",
            "net6": "ea:30:03:31:c9:5f",
            "net7": "9e:7b:d6:9f:f6:3c",
            "net8": "e6:a6:ab:ec:e8:2b",
            "net9": "a2:1b:72:fe:82:6e"
        },
        "leaf_4_0_3": {
            "net0": "4e:15:de:cd:42:6e",
            "net1": "22:a2:91:b1:ac:ea",
            "net10": "9e:60:54:17:21:b6",
            "net2": "a2:d8:84:37:e0:d1",
            "net3": "ce:53:69:9b:d4:37",
            "net4": "8e:c3:ae:b5:19:8e",
            "net5": "e6:68:37:f0:a2:32",
            "net6": "02:9d:01:73:a4:24",
            "net7": "c2:86:60:48:11:2b",
            "net8": "ba:bb:f7:29:a2:a5",
            "net9": "be:f7:47:29:74:94"
        },
        "leaf_4_0_4": {
            "net0": "a2:cd:08:f7:45:65",
            "net1": "9e:4c:6d:84:5d:fa",
            "net10": "3e:73:16:63:e9:22",
            "net2": "3a:ca:83:50:ab:30",
            "net3": "e6:72:af:96:78:bd",
            "net4": "5e:a6:5b:8c:6c:51",
            "net5": "02:58:d7:13:03:56",
            "net6": "be:8c:3f:1c:d5:68",
            "net7": "3a:7e:ca:db:7f:b5",
            "net8": "c2:eb:72:36:d9:75",
            "net9": "5a:c2:dd:6e:8c:95"
        },
        "leaf_4_0_5": {
            "net0": "ee:e9:e1:c5:31:7d",
            "net1": "da:fc:e8:f6:02:ed",
            "net10": "46:91:94:7a:6f:22",
            "net2": "82:f6:23:e3:6c:c1",
            "net3": "2a:26:ee:09:e8:0f",
            "net4": "02:7b:31:ea:9a:ea",
            "net5": "1e:5d:81:e2:db:65",
            "net6": "56:7a:56:64:e8:f3",
            "net7": "92:58:78:9c:c5:11",
            "net8": "0a:b5:ce:28:be:b6",
            "net9": "72:07:5c:dd:f6:d5"
        },
        "leaf_4_0_6": {
            "net0": "42:cb:81:8c:0c:2b",
            "net1": "26:6b:39:54:88:c2",
            "net10": "de:9e:0a:38:a2:b4",
            "net2": "0e:60:fd:8f:f8:6c",
            "net3": "ce:24:2a:23:00:03",
            "net4": "76:0f:3c:8b:65:00",
            "net5": "8e:55:b5:28:b3:ae",
            "net6": "f6:f9:8f:08:52:07",
            "net7": "22:6c:ef:32:75:13",
            "net8": "0a:12:c2:ad:7b:79",
            "net9": "c2:5a:60:97:c0:46"
        },
        "leaf_4_0_7": {
            "net0": "0e:19:cd:19:f1:1f",
            "net1": "2a:90:37:c5:41:23",
            "net10": "26:ae:75:2b:ae:54",
            "net2": "6e:29:9f:57:4e:97",
            "net3": "16:cf:75:c9:8f:f3",
            "net4": "5a:5d:45:e2:2d:08",
            "net5": "7a:95:ce:ab:ae:a3",
            "net6": "ea:77:d2:4a:82:19",
            "net7": "56:92:9e:ce:94:a1",
            "net8": "ae:d4:48:ea:3f:55",
            "net9": "fa:3b:4e:f0:15:7f"
        },
        "leaf_4_0_8": {
            "net0": "fe:d5:29:e4:a8:d2",
            "net1": "f6:2f:1f:70:1e:22",
            "net10": "ba:bd:74:15:b9:c4",
            "net2": "ce:89:60:72:ab:6a",
            "net3": "fa:98:73:0e:8a:d5",
            "net4": "72:34:84:b2:dc:33",
            "net5": "46:ef:07:b9:51:6b",
            "net6": "f2:99:f5:e7:2c:76",
            "net7": "26:bc:20:7a:d0:ad",
            "net8": "8e:d3:3d:8d:a7:23",
            "net9": "f6:32:fe:ba:18:c3"
        },
        "leaf_4_0_9": {
            "net0": "5a:63:b4:55:fe:db",
            "net1": "6a:5b:53:96:37:5d",
            "net10": "ae:34:2d:ee:61:53",
            "net2": "4e:38:8a:86:2e:cf",
            "net3": "e6:d0:e4:4c:9b:5e",
            "net4": "ce:3b:96:f6:ac:b0",
            "net5": "4e:80:3e:ab:db:ab",
            "net6": "b6:da:1a:3e:73:b3",
            "net7": "b6:38:68:f3:e5:22",
            "net8": "5e:40:6e:cd:ee:b7",
            "net9": "0a:a8:35:cc:61:18"
        },
        "spine_1_1_1": {
            "net0": "36:5e:22:40:89:aa",
            "net1": "2a:8a:57:b2:9e:75",
            "net10": "0a:3e:43:c3:17:6f",
            "net11": "02:91:df:01:0d:37",
            "net12": "1a:6a:ce:06:04:26",
            "net13": "3e:e2:d2:65:a1:19",
            "net14": "86:31:2a:f0:15:da",
            "net15": "96:67:fe:fe:b2:5f",
            "net16": "42:a3:a4:24:36:cb",
            "net17": "8a:d8:2a:c4:5b:69",
            "net18": "36:a6:d4:ac:b6:17",
            "net19": "ce:1c:b3:43:33:63",
            "net2": "e6:6a:ee:b5:0a:ab",
            "net3": "0a:80:2e:45:63:80",
            "net4": "c2:c7:ea:51:fc:d2",
            "net5": "3a:6e:4c:d8:d6:01",
            "net6": "3e:e8:3a:76:11:35",
            "net7": "ea:a6:dc:63:85:79",
            "net8": "de:9e:42:07:d0:8e",
            "net9": "86:67:2e:60:46:4d"
        },
        "spine_1_1_10": {
            "net0": "b2:80:ac:ec:e7:dc",
            "net1": "32:b7:fe:d1:cb:f8",
            "net10": "8e:e1:27:5b:ed:71",
            "net11": "a2:c1:3d:f0:c9:d6",
            "net12": "16:ec:9a:7b:8f:3e",
            "net13": "ae:39:e1:1a:9f:d6",
            "net14": "fe:a2:b4:9a:0d:71",
            "net15": "ba:fe:b4:65:4e:4b",
            "net16": "a2:0c:41:df:07:1f",
            "net17": "ae:be:c9:74:30:ac",
            "net18": "6e:13:80:45:9c:75",
            "net19": "0e:66:9f:04:d1:e4",
            "net2": "f6:cb:a7:be:00:62",
            "net3": "ee:e2:e6:11:34:6d",
            "net4": "16:cc:be:e5:f4:e9",
            "net5": "aa:b1:21:8e:89:3c",
            "net6": "f6:57:0f:9f:ce:90",
            "net7": "76:af:cb:d7:88:0b",
            "net8": "e6:96:71:d0:9d:35",
            "net9": "d6:a6:3b:ca:13:5e"
        },
        "spine_1_1_2": {
            "net0": "82:59:4a:f2:6f:f6",
            "net1": "c6:d1:28:d8:2f:06",
            "net10": "8e:6d:cd:9a:92:b5",
            "net11": "62:e5:5a:51:77:78",
            "net12": "d6:87:46:86:9d:3e",
            "net13": "02:6c:5f:05:da:6e",
            "net14": "06:6f:a1:4f:b2:cd",
            "net15": "8a:c3:b6:9b:67:6d",
            "net16": "b6:95:49:08:80:21",
            "net17": "4a:2f:33:10:fa:09",
            "net18": "2a:71:bb:11:7e:3d",
            "net19": "d6:1a:a4:fc:51:c4",
            "net2": "ce:35:55:89:cd:4f",
            "net3": "ce:2d:3a:72:c9:a1",
            "net4": "36:31:21:06:aa:3a",
            "net5": "be:93:9a:31:54:15",
            "net6": "82:f8:c6:d5:1d:3a",
            "net7": "52:20:34:aa:18:33",
            "net8": "26:d1:dc:e4:6e:8e",
            "net9": "ce:df:83:88:0c:ec"
        },
        "spine_1_1_3": {
            "net0": "8e:06:46:f4:e5:62",
            "net1": "22:78:3a:f8:96:36",
            "net10": "36:26:4e:61:a3:7f",
            "net11": "86:e0:ed:9a:2f:ae",
            "net12": "be:af:3c:58:37:4a",
            "net13": "16:e4:95:f7:8e:42",
            "net14": "06:19:57:45:df:1f",
            "net15": "1e:d4:90:eb:90:d2",
            "net16": "0e:b1:e2:92:40:eb",
            "net17": "4a:6f:b3:44:b5:92",
            "net18": "b2:f6:f9:96:ca:ca",
            "net19": "f2:21:b0:4b:92:c3",
            "net2": "0a:5c:09:0b:03:fa",
            "net3": "5e:fd:84:d7:3a:4a",
            "net4": "fa:67:4f:9c:0f:78",
            "net5": "0a:d5:60:78:c8:52",
            "net6": "56:bd:78:c6:e1:ee",
            "net7": "46:64:7c:1d:bd:86",
            "net8": "9e:3e:79:4a:83:f7",
            "net9": "2e:93:ff:20:a0:fc"
        },
        "spine_1_1_4": {
            "net0": "72:73:ae:27:b6:c5",
            "net1": "36:8c:e1:ab:55:6f",
            "net10": "d2:62:fb:8d:06:13",
            "net11": "26:bb:fc:ea:ed:d6",
            "net12": "fe:e9:a6:af:ce:50",
            "net13": "26:cb:00:c9:32:b2",
            "net14": "e6:1f:6d:2b:ce:62",
            "net15": "aa:a0:b5:d6:a8:ba",
            "net16": "0a:c8:10:7c:40:30",
            "net17": "a2:9c:d7:91:4d:d3",
            "net18": "fe:61:72:73:98:68",
            "net19": "2e:19:af:a7:82:b4",
            "net2": "02:d7:9a:36:43:b7",
            "net3": "4a:11:69:42:86:66",
            "net4": "3e:8f:8f:f8:ef:f6",
            "net5": "96:28:74:b7:b2:30",
            "net6": "5e:52:c1:15:b1:8b",
            "net7": "46:ee:16:6d:49:2c",
            "net8": "86:4d:d9:1c:6f:a6",
            "net9": "7a:89:59:bc:6b:21"
        },
        "spine_1_1_5": {
            "net0": "52:53:b7:98:c0:82",
            "net1": "b2:b8:ba:14:2e:24",
            "net10": "02:df:c4:fa:94:ad",
            "net11": "8a:53:e4:8c:da:9c",
            "net12": "c6:d8:8d:94:19:ce",
            "net13": "62:18:f8:d1:db:1c",
            "net14": "52:8d:80:29:6a:1b",
            "net15": "9e:d2:8d:3d:50:bc",
            "net16": "3a:36:3c:eb:e7:45",
            "net17": "22:8b:a4:53:8f:4b",
            "net18": "b6:74:c9:92:44:54",
            "net19": "1a:2d:5d:bd:09:a6",
            "net2": "92:11:d2:c9:61:37",
            "net3": "4e:0b:9d:fb:b3:b7",
            "net4": "fa:62:ed:33:2f:fd",
            "net5": "7e:25:34:65:03:02",
            "net6": "52:50:54:d1:e5:4c",
            "net7": "9a:06:27:24:65:db",
            "net8": "e2:85:89:9e:9e:2c",
            "net9": "0e:6f:b3:64:5d:12"
        },
        "spine_1_1_6": {
            "net0": "4e:b0:c4:62:f0:d0",
            "net1": "ce:c9:29:19:05:61",
            "net10": "32:bb:93:38:98:a9",
            "net11": "1e:b8:c5:7f:9c:f9",
            "net12": "22:b3:05:09:92:98",
            "net13": "32:25:7c:2b:ec:cf",
            "net14": "56:ed:c0:2a:b1:06",
            "net15": "de:f2:98:66:d1:fa",
            "net16": "92:e1:c1:7e:6e:51",
            "net17": "82:fc:91:e2:b6:2b",
            "net18": "f6:a1:d4:a8:4b:37",
            "net19": "26:f7:8e:d7:c5:a1",
            "net2": "1a:94:89:e9:0f:4b",
            "net3": "82:bb:9c:4d:1b:f2",
            "net4": "52:fb:4a:9f:25:0c",
            "net5": "ea:ec:d0:ac:4d:6a",
            "net6": "ca:a6:d8:50:5f:1b",
            "net7": "e6:54:c9:e5:23:44",
            "net8": "7e:ea:67:63:e2:c4",
            "net9": "0a:53:2a:da:7d:1f"
        },
        "spine_1_1_7": {
            "net0": "52:00:ba:bb:38:07",
            "net1": "52:72:72:18:14:cd",
            "net10": "5a:89:72:0b:13:8f",
            "net11": "3e:21:23:1e:96:18",
            "net12": "16:15:a8:30:4b:cf",
            "net13": "ae:dd:3a:83:3d:9c",
            "net14": "fe:b8:0c:c4:96:62",
            "net15": "56:80:00:91:17:25",
            "net16": "26:d8:04:2e:ec:8a",
            "net17": "92:0d:7f:c7:a7:25",
            "net18": "26:39:28:49:a8:f8",
            "net19": "8e:60:07:8b:83:f3",
            "net2": "6e:e7:b3:39:94:a5",
            "net3": "22:ff:38:47:97:6a",
            "net4": "26:eb:dc:d6:40:11",
            "net5": "a6:29:9e:52:1e:6c",
            "net6": "d6:83:71:f6:8e:99",
            "net7": "76:6d:3c:0e:69:a9",
            "net8": "82:ab:9e:7e:15:44",
            "net9": "56:e4:78:cb:0b:16"
        },
        "spine_1_1_8": {
            "net0": "d6:e2:32:a0:15:aa",
            "net1": "0a:3e:5c:0f:da:a3",
            "net10": "7e:1c:ab:5d:a8:19",
            "net11": "f2:8b:cd:e4:05:9c",
            "net12": "6a:bb:d4:22:6e:4b",
            "net13": "52:64:cd:fc:20:af",
            "net14": "ce:97:5f:32:72:40",
            "net15": "86:66:ca:89:a7:01",
            "net16": "7a:c3:7c:43:af:3c",
            "net17": "42:c1:0a:e0:5d:2b",
            "net18": "b6:44:7c:23:a5:f0",
            "net19": "46:88:46:fa:6d:e1",
            "net2": "1a:62:c1:2a:16:88",
            "net3": "de:41:d9:b7:de:a3",
            "net4": "6e:4e:b9:20:c4:dc",
            "net5": "96:cb:70:bd:c7:9d",
            "net6": "ce:f6:c4:f5:c1:68",
            "net7": "8a:3a:c2:1a:f0:51",
            "net8": "5e:a4:f6:cf:44:e8",
            "net9": "12:e1:5f:a7:10:41"
        },
        "spine_1_1_9": {
            "net0": "f2:bb:f4:c3:1f:8f",
            "net1": "fe:9e:97:6e:83:b2",
            "net10": "5a:55:4d:3b:0b:ed",
            "net11": "02:8c:37:31:2f:f2",
            "net12": "32:f6:09:62:80:2c",
            "net13": "7e:73:c0:3d:5f:d0",
            "net14": "46:51:d4:c9:68:02",
            "net15": "96:c7:8c:bb:b3:49",
            "net16": "12:70:ca:e8:22:bf",
            "net17": "46:23:f3:53:c3:72",
            "net18": "62:b3:5c:f0:62:16",
            "net19": "ea:0a:46:3f:86:c3",
            "net2": "8a:ec:56:77:7e:52",
            "net3": "9a:e3:79:2e:80:d4",
            "net4": "ea:16:6e:7e:47:0f",
            "net5": "1e:56:11:63:ff:7c",
            "net6": "3a:7d:99:16:8c:26",
            "net7": "1e:3b:10:ef:0d:1d",
            "net8": "66:0f:da:bd:61:c9",
            "net9": "6a:4d:de:30:77:27"
        },
        "spine_2_1_1": {
            "net0": "9e:f9:6d:1a:8b:af",
            "net1": "5e:23:2d:53:5b:d7",
            "net10": "36:30:77:ca:38:c5",
            "net11": "12:66:bd:ea:ef:17",
            "net12": "46:d6:76:5d:b9:f5",
            "net13": "86:44:55:a9:28:e9",
            "net14": "5e:fa:40:7e:b9:fa",
            "net15": "52:da:1c:9b:75:48",
            "net16": "e2:4f:cd:4f:84:cc",
            "net17": "5a:5b:31:40:3e:98",
            "net18": "72:e5:b6:fe:a9:c2",
            "net19": "76:06:00:74:b1:ba",
            "net2": "76:ac:32:fa:a5:c7",
            "net3": "46:a7:9f:b5:36:bf",
            "net4": "32:14:3c:08:c9:70",
            "net5": "5e:62:b0:41:2d:d3",
            "net6": "c6:08:ed:b6:3a:a6",
            "net7": "ce:c0:e5:21:c3:09",
            "net8": "fe:99:d0:23:10:ad",
            "net9": "da:93:2b:84:de:eb"
        },
        "spine_2_1_10": {
            "net0": "b6:71:61:bc:14:b5",
            "net1": "96:8a:e4:4f:b2:6e",
            "net10": "46:1a:aa:14:96:e2",
            "net11": "0e:c7:3a:b9:ea:62",
            "net12": "ca:0c:4c:d3:1d:48",
            "net13": "fe:1c:c6:ed:03:00",
            "net14": "62:12:07:fe:bb:cf",
            "net15": "aa:39:9b:96:5e:c3",
            "net16": "a6:8e:24:b0:2f:e2",
            "net17": "ee:b1:24:ba:0e:02",
            "net18": "be:43:c6:60:60:eb",
            "net19": "d6:9a:bb:e4:83:ee",
            "net2": "42:56:33:00:79:ae",
            "net3": "8e:9f:c9:94:78:72",
            "net4": "96:c4:5c:9d:ee:bb",
            "net5": "de:55:40:41:35:de",
            "net6": "4a:42:93:f1:62:c2",
            "net7": "ae:17:e9:67:1f:7b",
            "net8": "66:d1:2e:c6:dc:fb",
            "net9": "d6:e1:74:7e:42:d0"
        },
        "spine_2_1_2": {
            "net0": "52:a1:a3:ce:cf:1e",
            "net1": "26:b3:d8:a8:bb:3d",
            "net10": "96:6c:35:6a:76:5b",
            "net11": "be:d1:8a:42:6f:13",
            "net12": "a6:c6:1c:c8:56:e0",
            "net13": "a6:5f:b9:c0:c1:bf",
            "net14": "42:3b:79:ea:90:b1",
            "net15": "ae:22:0b:8e:78:59",
            "net16": "1e:8f:88:08:fa:bf",
            "net17": "b6:4d:82:02:c2:f0",
            "net18": "7e:9a:d7:23:50:5f",
            "net19": "0e:ad:59:35:12:c0",
            "net2": "3a:bd:c1:27:14:9e",
            "net3": "0e:c5:d6:69:de:f6",
            "net4": "de:f4:53:93:08:3a",
            "net5": "42:83:35:3e:de:fd",
            "net6": "8e:61:02:46:e7:7c",
            "net7": "0a:01:28:97:80:50",
            "net8": "4e:24:4e:8d:6b:03",
            "net9": "82:d3:ce:64:39:7c"
        },
        "spine_2_1_3": {
            "net0": "6a:9a:a4:92:d5:91",
            "net1": "06:5a:ee:d9:91:e5",
            "net10": "0a:28:7a:f6:e9:81",
            "net11": "ea:39:1e:a0:6d:17",
            "net12": "8a:ee:4c:39:2d:83",
            "net13": "ee:a2:01:c3:f3:f5",
            "net14": "ce:1f:38:03:5b:7a",
            "net15": "de:58:93:4a:5a:12",
            "net16": "be:d8:27:98:35:d4",
            "net17": "86:07:43:9a:7e:e1",
            "net18": "32:ce:35:0f:1d:4d",
            "net19": "66:63:59:0c:6f:2f",
            "net2": "66:98:8e:4f:06:8a",
            "net3": "52:8a:37:d1:22:1e",
            "net4": "32:ea:d5:c1:e1:66",
            "net5": "4a:20:17:2b:a4:83",
            "net6": "ae:02:57:fb:81:6f",
            "net7": "3a:d8:19:ea:16:22",
            "net8": "32:e3:04:45:6e:1c",
            "net9": "1a:6e:9e:5e:36:6b"
        },
        "spine_2_1_4": {
            "net0": "9e:ad:2a:84:3e:ce",
            "net1": "ce:47:74:31:64:0a",
            "net10": "4a:54:b3:e5:81:19",
            "net11": "26:69:8c:c7:ce:df",
            "net12": "ce:8c:cb:ba:c4:8a",
            "net13": "42:90:9a:b1:8b:f4",
            "net14": "22:dd:ed:63:6b:bc",
            "net15": "e2:6c:82:39:75:ed",
            "net16": "e6:42:a2:ed:b8:28",
            "net17": "7e:05:62:19:81:cc",
            "net18": "fa:f8:ed:45:18:e1",
            "net19": "5a:12:35:d8:2d:03",
            "net2": "4e:02:0d:da:4b:7a",
            "net3": "3e:a2:3a:e1:0b:60",
            "net4": "76:d1:1a:26:34:fc",
            "net5": "f2:5c:a3:e4:90:d5",
            "net6": "ca:a9:20:de:83:50",
            "net7": "3a:af:d5:20:83:d5",
            "net8": "46:5e:a5:5c:ec:e4",
            "net9": "ae:24:ba:e3:f4:d4"
        },
        "spine_2_1_5": {
            "net0": "d6:78:88:6b:b2:f3",
            "net1": "fa:65:8c:ce:41:fc",
            "net10": "b2:e7:4b:4d:3e:ec",
            "net11": "d2:4d:38:e8:0f:eb",
            "net12": "5a:13:ee:9d:3d:c5",
            "net13": "ba:58:4d:35:c5:c2",
            "net14": "fe:33:91:11:be:35",
            "net15": "86:df:a5:50:ac:4e",
            "net16": "3a:84:c7:8f:33:f3",
            "net17": "e6:a8:97:da:ac:4f",
            "net18": "7e:3f:cd:bb:b5:46",
            "net19": "66:1e:3f:d3:07:e2",
            "net2": "9e:a1:46:e1:1c:2e",
            "net3": "12:8d:40:5c:a6:16",
            "net4": "82:c6:94:da:70:5d",
            "net5": "8e:81:89:4e:14:bc",
            "net6": "06:4f:e8:fa:17:9e",
            "net7": "26:fe:e5:c1:d4:6e",
            "net8": "72:8e:af:57:1c:71",
            "net9": "7e:a7:79:97:24:bc"
        },
        "spine_2_1_6": {
            "net0": "a6:1a:d7:14:01:0e",
            "net1": "ca:d6:d6:f5:c1:27",
            "net10": "96:30:50:d9:4b:83",
            "net11": "36:b7:ba:0b:ec:bc",
            "net12": "0a:89:46:8b:20:ce",
            "net13": "36:61:ac:75:68:df",
            "net14": "3a:a6:e2:bd:59:0a",
            "net15": "06:cb:de:63:f9:3e",
            "net16": "c6:c4:2c:4a:ff:09",
            "net17": "1e:0a:97:4c:86:86",
            "net18": "ce:1b:c2:0e:66:21",
            "net19": "26:7e:a3:3a:79:a6",
            "net2": "2a:0b:ca:b0:d1:d4",
            "net3": "76:c8:b5:a9:44:74",
            "net4": "e2:b2:c7:ad:26:73",
            "net5": "6a:93:d8:2a:8b:01",
            "net6": "7e:c5:71:51:37:2c",
            "net7": "ca:2a:10:a1:48:35",
            "net8": "76:96:3a:37:51:d7",
            "net9": "06:b9:05:71:16:ad"
        },
        "spine_2_1_7": {
            "net0": "6a:e6:a5:eb:7c:bc",
            "net1": "1e:aa:bb:fa:a3:2b",
            "net10": "52:3b:11:17:b9:07",
            "net11": "e6:79:12:c2:78:81",
            "net12": "4a:ab:15:24:a6:8e",
            "net13": "42:40:2b:6d:6b:1e",
            "net14": "76:d9:f6:43:64:3e",
            "net15": "ee:9d:1b:54:32:f1",
            "net16": "b6:9e:d9:d9:db:87",
            "net17": "7e:d0:82:f0:55:b5",
            "net18": "92:37:0e:28:f5:9d",
            "net19": "8e:13:17:28:f2:c5",
            "net2": "f6:29:cf:f6:cc:2d",
            "net3": "3a:78:e1:f7:23:80",
            "net4": "c6:b1:ad:b6:f7:dd",
            "net5": "1a:d6:0a:a2:bf:7a",
            "net6": "b6:f6:a4:5f:24:5b",
            "net7": "82:e4:59:fc:a1:7b",
            "net8": "8a:51:7c:97:f9:48",
            "net9": "b2:5c:cc:c9:84:94"
        },
        "spine_2_1_8": {
            "net0": "0e:0d:44:35:28:df",
            "net1": "d2:ae:c1:23:18:d0",
            "net10": "c2:98:8a:6f:9a:63",
            "net11": "ae:55:60:5b:55:dc",
            "net12": "fa:e2:a8:83:16:c8",
            "net13": "16:3a:6b:9e:35:5c",
            "net14": "1a:cd:a2:54:51:87",
            "net15": "96:6d:78:f5:5e:34",
            "net16": "ca:2c:2c:66:13:6d",
            "net17": "f2:23:08:06:d8:e3",
            "net18": "52:34:ae:0d:7f:ac",
            "net19": "a2:5f:5e:8c:90:24",
            "net2": "1e:eb:fb:ac:c3:32",
            "net3": "9e:09:84:e2:9b:d1",
            "net4": "b2:79:66:e4:30:27",
            "net5": "46:22:85:87:69:e8",
            "net6": "a2:bf:00:7e:2d:5c",
            "net7": "be:67:e7:90:af:ca",
            "net8": "ca:ba:23:88:4d:9a",
            "net9": "0a:68:ab:85:b4:01"
        },
        "spine_2_1_9": {
            "net0": "7a:9d:1f:f6:fd:f9",
            "net1": "ce:23:2b:a7:57:9e",
            "net10": "4e:35:ac:99:8a:02",
            "net11": "66:23:ba:e4:e1:71",
            "net12": "56:16:60:39:d1:32",
            "net13": "7e:b0:c2:be:39:16",
            "net14": "4e:eb:c3:74:f9:3d",
            "net15": "aa:5e:26:80:cb:0a",
            "net16": "92:dd:65:82:24:3d",
            "net17": "2e:e1:e3:19:b1:29",
            "net18": "86:cc:f0:e3:3d:e6",
            "net19": "52:c0:69:b9:14:a6",
            "net2": "62:69:41:77:03:07",
            "net3": "c2:da:bc:9e:61:b9",
            "net4": "c6:56:41:47:36:f1",
            "net5": "36:08:c3:96:57:5f",
            "net6": "f2:44:c0:65:d8:0c",
            "net7": "9e:4e:bb:a1:1e:87",
            "net8": "5a:24:ee:c2:0c:47",
            "net9": "16:df:2b:f6:dc:74"
        },
        "spine_3_1_1": {
            "net0": "9a:df:b6:d7:07:fb",
            "net1": "92:10:11:5a:ef:6d",
            "net10": "6e:97:46:f8:91:72",
            "net11": "4e:fb:98:b6:ab:25",
            "net12": "1a:c7:ef:46:88:39",
            "net13": "7a:ae:5f:30:20:56",
            "net14": "8e:3b:5a:b1:89:12",
            "net15": "3e:c2:a4:49:a7:4b",
            "net16": "ce:22:6b:25:a2:64",
            "net17": "be:09:7f:dc:cd:86",
            "net18": "be:3a:c6:b6:7f:a3",
            "net19": "c2:67:3c:e8:b3:80",
            "net2": "e2:b8:c8:d3:ad:82",
            "net3": "02:8e:3c:bf:10:1a",
            "net4": "8e:e8:a9:27:05:6e",
            "net5": "e6:5a:1f:5f:de:8c",
            "net6": "66:4d:08:32:36:c0",
            "net7": "06:00:72:5e:91:67",
            "net8": "32:14:25:8c:ed:19",
            "net9": "0e:26:0d:d8:a9:ea"
        },
        "spine_3_1_10": {
            "net0": "da:ce:1b:f9:14:45",
            "net1": "26:ae:42:e2:12:cd",
            "net10": "ce:a7:cf:58:dc:83",
            "net11": "3e:81:a6:a3:6a:91",
            "net12": "36:1a:7a:cd:17:e9",
            "net13": "96:11:cf:76:02:12",
            "net14": "a6:02:44:c5:6b:37",
            "net15": "36:1b:2a:72:2c:13",
            "net16": "9a:00:03:42:4b:b3",
            "net17": "c6:22:81:13:4e:af",
            "net18": "e6:68:99:a9:3c:1e",
            "net19": "de:d4:74:ee:40:05",
            "net2": "f2:1e:78:0a:a2:dd",
            "net3": "82:81:dd:36:a0:68",
            "net4": "66:51:4f:4c:ce:38",
            "net5": "d2:4c:2f:bd:d4:61",
            "net6": "52:fb:6f:4f:e4:ee",
            "net7": "d6:96:b3:bb:38:c1",
            "net8": "96:8e:c9:4b:85:85",
            "net9": "da:4a:70:ad:7f:f2"
        },
        "spine_3_1_2": {
            "net0": "02:98:3c:14:2e:ab",
            "net1": "2e:47:f5:7e:d3:84",
            "net10": "be:a5:64:38:fd:f0",
            "net11": "be:a4:83:aa:03:63",
            "net12": "a6:70:8e:c7:eb:2f",
            "net13": "16:5e:b1:d5:26:a0",
            "net14": "5e:20:ae:bb:8d:b8",
            "net15": "22:fe:4b:5e:24:f4",
            "net16": "72:a1:5f:05:ae:34",
            "net17": "fe:04:f7:80:d8:aa",
            "net18": "c6:5d:38:da:fa:11",
            "net19": "3e:30:88:e3:50:1b",
            "net2": "ee:15:1d:05:1e:85",
            "net3": "8e:6b:23:38:12:f7",
            "net4": "06:0f:a2:ee:49:11",
            "net5": "72:7b:ec:47:c1:25",
            "net6": "1a:ad:9f:ff:23:0b",
            "net7": "9e:22:66:ec:52:1b",
            "net8": "36:18:5d:69:d0:9a",
            "net9": "62:c6:9d:bb:25:df"
        },
        "spine_3_1_3": {
            "net0": "2e:2a:bf:7f:63:52",
            "net1": "76:2f:64:76:9f:89",
            "net10": "fa:81:7b:c7:d9:1b",
            "net11": "ee:44:19:1f:b5:12",
            "net12": "ee:e6:0a:01:7a:9b",
            "net13": "a6:ea:87:17:86:9b",
            "net14": "8a:d8:bb:43:36:c9",
            "net15": "b6:49:61:25:72:2f",
            "net16": "12:91:f1:e4:ae:22",
            "net17": "16:9a:c8:74:00:07",
            "net18": "32:7f:d4:88:73:41",
            "net19": "1e:58:4c:68:0f:dc",
            "net2": "c2:84:0a:bf:b7:d1",
            "net3": "2a:49:cf:cf:45:f1",
            "net4": "32:59:48:b8:c0:04",
            "net5": "ae:81:42:5f:e8:df",
            "net6": "fa:71:0a:de:71:c3",
            "net7": "c6:f1:f0:16:7a:47",
            "net8": "4e:ab:14:b8:54:04",
            "net9": "46:ef:f9:1d:43:12"
        },
        "spine_3_1_4": {
            "net0": "1e:0d:a9:c9:aa:45",
            "net1": "36:d3:d1:f9:9f:7b",
            "net10": "66:fa:25:e7:79:9d",
            "net11": "36:c6:94:e5:66:27",
            "net12": "42:02:ca:e5:75:f2",
            "net13": "aa:08:10:02:b5:b6",
            "net14": "06:2a:c7:5e:f7:2a",
            "net15": "1a:97:cf:40:19:b7",
            "net16": "ee:9b:e8:36:16:54",
            "net17": "fe:85:55:fb:71:05",
            "net18": "12:70:a6:6a:3f:4a",
            "net19": "06:b3:ac:f7:24:7a",
            "net2": "3a:c8:f5:c4:b6:c8",
            "net3": "aa:ce:5e:33:22:e7",
            "net4": "a2:d6:b4:f2:62:40",
            "net5": "c2:ef:d7:77:3f:b5",
            "net6": "72:b5:2c:08:7a:8b",
            "net7": "16:7b:92:9e:aa:9b",
            "net8": "a6:65:5e:1c:54:cf",
            "net9": "2e:38:6f:d8:f5:6a"
        },
        "spine_3_1_5": {
            "net0": "e2:09:cd:7d:c2:f4",
            "net1": "22:d5:a3:05:54:4f",
            "net10": "86:f9:4a:6c:92:17",
            "net11": "ba:b4:d9:b1:58:22",
            "net12": "6a:c8:36:32:4c:f5",
            "net13": "9e:49:51:1b:1e:4b",
            "net14": "32:48:a4:42:fa:77",
            "net15": "ea:2c:9a:13:00:d9",
            "net16": "22:94:ad:2b:c0:2d",
            "net17": "3a:29:33:79:9c:7a",
            "net18": "8e:2e:7f:fa:d8:01",
            "net19": "66:2a:4e:02:79:2b",
            "net2": "fe:4c:01:64:d8:fa",
            "net3": "0e:a3:8f:2d:86:fe",
            "net4": "8a:1b:79:f1:d3:bb",
            "net5": "c6:12:61:0b:8e:6d",
            "net6": "e6:3c:f6:41:25:8a",
            "net7": "b2:f1:b2:2e:a3:88",
            "net8": "26:82:92:79:e7:24",
            "net9": "26:26:5c:d8:0e:c9"
        },
        "spine_3_1_6": {
            "net0": "ba:77:6a:7b:d4:4a",
            "net1": "96:a3:13:9d:b3:53",
            "net10": "76:bc:ae:17:83:c0",
            "net11": "0a:a5:b8:31:ff:88",
            "net12": "26:bf:05:41:ff:fb",
            "net13": "96:24:3e:d0:14:11",
            "net14": "5a:13:8c:57:c3:bd",
            "net15": "02:c4:b2:19:79:90",
            "net16": "72:64:62:c3:30:f8",
            "net17": "de:85:43:59:45:06",
            "net18": "22:a8:63:d7:f4:9d",
            "net19": "9e:8b:09:97:b8:6a",
            "net2": "76:92:e7:91:c9:10",
            "net3": "ea:07:4f:82:a4:c6",
            "net4": "02:b6:55:87:55:fa",
            "net5": "b2:e3:45:e3:2c:30",
            "net6": "8a:4a:03:ff:39:84",
            "net7": "02:23:0a:04:fb:8b",
            "net8": "4e:b0:19:f0:11:db",
            "net9": "4a:fb:c2:93:01:75"
        },
        "spine_3_1_7": {
            "net0": "c6:6b:32:61:87:0c",
            "net1": "62:01:d8:6a:99:3d",
            "net10": "e2:38:14:9e:07:7e",
            "net11": "ee:9e:01:e0:41:bc",
            "net12": "d6:aa:c6:0e:9d:e9",
            "net13": "82:a2:f4:db:4f:72",
            "net14": "86:4d:0e:75:34:cc",
            "net15": "6e:d7:f0:18:d8:99",
            "net16": "aa:6d:3b:e9:a2:ac",
            "net17": "aa:dd:5e:80:d9:6b",
            "net18": "36:1e:39:25:25:f3",
            "net19": "3a:d0:f4:dc:15:46",
            "net2": "5a:f0:ad:c6:89:9c",
            "net3": "e2:42:e1:f0:66:dd",
            "net4": "6a:4d:9a:b5:6b:0b",
            "net5": "86:34:bf:9a:9a:db",
            "net6": "46:98:e3:ab:fd:5f",
            "net7": "3a:e8:16:9c:0e:37",
            "net8": "76:b0:05:b4:e9:2a",
            "net9": "1e:21:27:07:fa:50"
        },
        "spine_3_1_8": {
            "net0": "0a:0e:0f:48:8e:59",
            "net1": "c6:8d:ed:37:84:81",
            "net10": "16:db:20:1c:bf:4a",
            "net11": "d2:ac:7a:71:4f:8d",
            "net12": "46:5a:9e:45:fe:17",
            "net13": "da:b7:69:2a:f3:b9",
            "net14": "c2:a3:79:36:0b:c2",
            "net15": "ba:3f:5a:ab:1f:33",
            "net16": "a2:46:a0:31:49:e6",
            "net17": "f2:30:49:33:89:5b",
            "net18": "1a:61:4a:13:2f:5c",
            "net19": "2a:b5:6f:d3:2a:3f",
            "net2": "aa:68:38:65:a5:5d",
            "net3": "16:38:04:bf:4b:a2",
            "net4": "8a:e5:87:a9:43:bc",
            "net5": "2e:ea:11:63:78:6b",
            "net6": "e2:47:58:da:ce:fd",
            "net7": "32:47:17:78:91:df",
            "net8": "42:42:47:74:25:61",
            "net9": "ea:78:b5:9c:32:a5"
        },
        "spine_3_1_9": {
            "net0": "6a:f4:c8:41:87:a7",
            "net1": "1e:24:37:22:8b:c5",
            "net10": "6a:27:6b:2c:45:ea",
            "net11": "7a:ca:1c:10:a8:43",
            "net12": "42:8e:0e:72:15:6d",
            "net13": "de:31:d3:f0:01:ab",
            "net14": "76:68:87:c9:b3:63",
            "net15": "96:74:ff:0a:4a:58",
            "net16": "ae:33:8d:46:1e:b2",
            "net17": "4e:86:30:c0:4f:7f",
            "net18": "8e:3f:e2:d4:ce:4f",
            "net19": "9e:5f:80:d8:4a:63",
            "net2": "c6:60:8f:06:36:d9",
            "net3": "4a:90:fa:95:2d:0a",
            "net4": "6a:55:9b:26:a0:5f",
            "net5": "5e:75:f3:49:9e:50",
            "net6": "d6:e8:8a:d3:6a:31",
            "net7": "7e:05:72:4a:ea:70",
            "net8": "02:8b:e0:d7:7d:db",
            "net9": "92:d9:56:fd:9d:77"
        },
        "spine_4_1_1": {
            "net0": "da:1a:d3:c4:3b:9c",
            "net1": "06:06:d4:d6:f0:df",
            "net10": "9e:52:30:00:a4:ce",
            "net11": "ca:e2:d6:1c:5a:80",
            "net12": "fa:77:34:06:f1:eb",
            "net13": "0a:e5:3c:97:a1:63",
            "net14": "22:94:91:d5:24:12",
            "net15": "ae:56:38:30:d8:d1",
            "net16": "ea:c9:a6:b1:5b:60",
            "net17": "0a:29:c8:41:95:ae",
            "net18": "c6:3a:91:2e:d6:ae",
            "net19": "e2:17:72:78:29:ff",
            "net2": "02:28:e7:db:e2:51",
            "net3": "2a:e5:7c:5c:c7:5c",
            "net4": "e2:7a:e6:0d:27:23",
            "net5": "52:f3:29:e0:70:f9",
            "net6": "82:6a:a3:96:e3:22",
            "net7": "7e:60:bd:c6:68:4c",
            "net8": "e6:d3:80:ed:da:4e",
            "net9": "92:81:c8:de:9c:67"
        },
        "spine_4_1_10": {
            "net0": "e2:24:56:ab:25:6c",
            "net1": "b2:bb:6b:a2:86:ff",
            "net10": "f6:9f:25:fc:bf:08",
            "net11": "16:7f:d7:10:47:84",
            "net12": "ba:9f:00:81:3f:33",
            "net13": "c2:0d:3b:ba:be:de",
            "net14": "66:48:b2:6f:1c:1d",
            "net15": "82:91:3b:85:a8:95",
            "net16": "72:36:23:3d:f6:11",
            "net17": "b2:12:1b:3c:19:b8",
            "net18": "3e:99:c3:2f:6b:38",
            "net19": "ce:b3:cf:7e:1f:c8",
            "net2": "26:d1:06:a3:2b:3a",
            "net3": "56:d3:06:57:d7:9d",
            "net4": "1e:eb:84:c5:7e:e6",
            "net5": "32:d8:c0:f0:87:4e",
            "net6": "36:53:a4:78:72:dc",
            "net7": "a6:1c:df:00:3e:90",
            "net8": "02:cc:25:4b:c9:92",
            "net9": "d2:e5:21:2b:c3:9e"
        },
        "spine_4_1_2": {
            "net0": "f2:30:98:6d:9e:a9",
            "net1": "a2:f7:2d:0a:46:d6",
            "net10": "1e:5c:ae:4c:66:92",
            "net11": "ca:b9:be:e2:fc:c7",
            "net12": "ba:84:74:90:19:39",
            "net13": "de:1a:f6:a9:7d:9b",
            "net14": "b2:6d:1c:31:05:d4",
            "net15": "2e:ec:b9:5c:be:71",
            "net16": "66:99:2d:bf:4d:51",
            "net17": "fa:dd:79:0f:72:90",
            "net18": "2e:ce:f4:c9:b3:c6",
            "net19": "aa:39:d3:01:53:89",
            "net2": "6a:ba:f9:77:91:85",
            "net3": "62:0d:ea:91:9b:e5",
            "net4": "26:f5:57:53:54:55",
            "net5": "5a:85:52:80:93:7d",
            "net6": "62:8f:8b:af:09:d5",
            "net7": "c2:fc:af:06:bd:a4",
            "net8": "52:a8:ab:f9:79:35",
            "net9": "62:f7:1f:46:12:a4"
        },
        "spine_4_1_3": {
            "net0": "76:a2:12:9a:5c:08",
            "net1": "46:28:76:90:e7:93",
            "net10": "ce:54:07:88:23:56",
            "net11": "02:d2:3b:25:96:a7",
            "net12": "ca:4b:f2:58:25:df",
            "net13": "76:2a:99:b8:10:f3",
            "net14": "e2:4a:f9:e4:8e:45",
            "net15": "f2:4e:b2:67:5a:d5",
            "net16": "c2:e1:d6:c5:e7:80",
            "net17": "ea:e0:56:43:f7:a1",
            "net18": "fa:f0:ee:91:56:b7",
            "net19": "1e:85:28:18:cf:4a",
            "net2": "0a:21:9a:88:9e:77",
            "net3": "32:8a:c0:f3:ec:59",
            "net4": "1e:cb:2d:8f:59:6e",
            "net5": "be:49:da:a2:00:68",
            "net6": "46:60:1d:c5:70:6d",
            "net7": "c6:fb:b3:c2:5d:93",
            "net8": "fe:f3:e1:e7:31:9b",
            "net9": "8a:71:f3:d6:2e:90"
        },
        "spine_4_1_4": {
            "net0": "de:12:6f:fb:33:1d",
            "net1": "fe:13:d2:93:0d:96",
            "net10": "c6:28:3c:62:6a:ac",
            "net11": "de:a6:b4:25:b6:41",
            "net12": "72:79:44:b9:e5:7a",
            "net13": "4e:0d:b2:e5:e1:9f",
            "net14": "22:8b:23:e1:fc:a2",
            "net15": "e6:fc:f6:a4:dc:33",
            "net16": "6a:ab:95:d5:95:5e",
            "net17": "42:7b:12:84:94:08",
            "net18": "7e:f3:f6:07:b1:96",
            "net19": "b6:d2:d9:08:d1:3e",
            "net2": "1a:42:63:35:51:a9",
            "net3": "1a:2f:42:9f:2e:d7",
            "net4": "de:6d:10:a5:e1:46",
            "net5": "ca:a9:f8:b7:27:ab",
            "net6": "56:ec:77:d3:61:4c",
            "net7": "7a:41:58:d4:7e:6e",
            "net8": "1e:2b:7a:3e:e8:bf",
            "net9": "9a:8d:c2:ee:3d:0e"
        },
        "spine_4_1_5": {
            "net0": "c2:e8:0a:f0:5e:12",
            "net1": "0a:45:b0:b9:d4:33",
            "net10": "5a:ea:16:11:9f:18",
            "net11": "ee:81:ea:2a:a2:c6",
            "net12": "4a:96:8a:c3:28:64",
            "net13": "ea:9d:2b:08:2c:e3",
            "net14": "62:17:a6:22:01:61",
            "net15": "46:f1:39:46:0c:cf",
            "net16": "e6:8c:90:19:5c:ff",
            "net17": "06:5f:f8:78:29:cb",
            "net18": "4e:12:99:b6:12:e2",
            "net19": "26:1f:13:3e:99:2a",
            "net2": "72:91:d0:38:77:c7",
            "net3": "e2:12:c0:2b:ff:cd",
            "net4": "0e:79:49:6b:b8:b4",
            "net5": "1a:f6:76:6f:07:99",
            "net6": "ca:d9:0f:70:cf:6b",
            "net7": "de:18:7b:86:ac:17",
            "net8": "62:8e:d2:13:83:59",
            "net9": "3e:7b:7a:81:6a:be"
        },
        "spine_4_1_6": {
            "net0": "5e:d0:84:c3:d5:76",
            "net1": "1e:64:d4:23:3b:98",
            "net10": "46:8e:18:c4:15:4b",
            "net11": "16:bc:75:56:db:76",
            "net12": "a2:69:e9:16:9a:aa",
            "net13": "96:24:70:d5:de:62",
            "net14": "0a:7f:57:0e:25:af",
            "net15": "ce:7a:8e:3f:f5:4a",
            "net16": "d6:a5:10:e9:48:ea",
            "net17": "d2:ae:d4:c3:ac:ad",
            "net18": "9a:a8:bd:11:62:ce",
            "net19": "86:61:6c:ee:f9:84",
            "net2": "9e:e6:77:8f:cd:13",
            "net3": "66:fa:eb:ec:21:56",
            "net4": "be:f4:23:17:8e:ae",
            "net5": "4e:ce:3f:94:9f:bd",
            "net6": "26:25:4d:42:84:3c",
            "net7": "86:99:46:3a:95:a7",
            "net8": "de:c3:b1:39:45:05",
            "net9": "06:bb:c3:40:89:0d"
        },
        "spine_4_1_7": {
            "net0": "46:81:0c:be:71:48",
            "net1": "76:75:97:15:85:7b",
            "net10": "ce:28:4b:db:f7:ea",
            "net11": "d2:5f:aa:07:97:71",
            "net12": "d6:38:ed:0f:95:7d",
            "net13": "8e:fc:27:8b:9a:58",
            "net14": "ce:1d:1f:3d:27:be",
            "net15": "6e:04:71:d8:03:bd",
            "net16": "3a:af:d9:5b:11:b1",
            "net17": "66:9b:2e:c0:08:a5",
            "net18": "be:b6:ec:0c:ec:71",
            "net19": "f2:5c:d2:82:0c:bd",
            "net2": "26:f2:45:b6:ea:86",
            "net3": "1e:d1:0a:0a:b1:0b",
            "net4": "8a:34:cc:07:1d:2d",
            "net5": "96:a4:cf:9f:9d:83",
            "net6": "76:06:db:3b:93:39",
            "net7": "ee:cd:f4:fb:c7:26",
            "net8": "32:e2:e1:d9:2f:87",
            "net9": "d6:31:aa:1d:fd:f8"
        },
        "spine_4_1_8": {
            "net0": "2a:09:02:49:0c:2c",
            "net1": "a2:cc:7b:d1:43:e2",
            "net10": "32:b7:85:e8:fe:e9",
            "net11": "e6:22:2f:07:9e:f7",
            "net12": "a6:4a:bf:16:3a:25",
            "net13": "be:78:ef:95:b7:70",
            "net14": "5e:f0:2c:78:59:c0",
            "net15": "ca:3f:24:6a:52:dc",
            "net16": "46:9c:cb:fa:c1:5d",
            "net17": "fe:82:67:97:de:5d",
            "net18": "72:79:e7:7d:a4:61",
            "net19": "3e:f5:9c:2b:87:0e",
            "net2": "82:a0:71:3a:e5:f7",
            "net3": "6a:fe:4a:e5:04:1f",
            "net4": "56:e7:70:62:94:18",
            "net5": "d2:db:97:61:87:39",
            "net6": "8e:a3:12:89:79:16",
            "net7": "96:9c:65:5f:8e:24",
            "net8": "22:8b:29:d3:09:30",
            "net9": "3e:dc:52:b4:54:cd"
        },
        "spine_4_1_9": {
            "net0": "b2:e4:23:9b:3a:93",
            "net1": "ba:af:27:e0:08:51",
            "net10": "e2:40:2d:86:6e:b9",
            "net11": "ca:c6:75:e0:47:17",
            "net12": "d6:e0:d5:68:bc:cc",
            "net13": "a6:83:ce:ff:bc:85",
            "net14": "2e:ee:20:18:62:6a",
            "net15": "ce:dc:d2:10:6c:88",
            "net16": "6a:3e:93:4c:10:74",
            "net17": "aa:68:0f:6a:25:e1",
            "net18": "96:9e:07:cf:f1:03",
            "net19": "aa:3d:2d:a9:54:f2",
            "net2": "c6:54:82:75:f9:f8",
            "net3": "36:3a:e9:4e:36:89",
            "net4": "ea:bd:ff:99:4e:2d",
            "net5": "8a:67:fc:3c:9f:c0",
            "net6": "52:6b:a3:fc:2e:e8",
            "net7": "6e:89:ac:7a:32:91",
            "net8": "e6:b7:fb:4b:6b:cd",
            "net9": "06:3d:bb:ec:c7:2c"
        },
        "tof_1_2_1": {
            "net0": "1e:76:f3:5b:69:6a",
            "net1": "56:b2:e0:44:95:9f",
            "net10": "ca:e5:45:86:f5:52",
            "net11": "5e:c0:69:9f:16:87",
            "net12": "76:f5:7a:59:96:3b",
            "net13": "7a:a4:0b:fe:1a:1e",
            "net14": "da:72:28:39:c3:1e",
            "net15": "e6:5c:04:75:a0:70",
            "net16": "2e:1a:c7:f3:1a:f7",
            "net17": "5e:09:85:63:fd:c7",
            "net18": "ce:72:73:e3:61:90",
            "net19": "da:93:89:80:35:d0",
            "net2": "0a:91:e3:1d:2c:09",
            "net3": "1a:32:3b:af:fe:ca",
            "net4": "c2:ba:1c:4b:9b:a3",
            "net5": "36:6e:20:f5:ea:b2",
            "net6": "9e:65:49:38:b6:99",
            "net7": "5e:f4:26:47:af:e7",
            "net8": "c2:34:af:cd:d3:ca",
            "net9": "d2:58:4f:04:66:d3"
        },
        "tof_1_2_10": {
            "net0": "0e:30:26:99:b7:bb",
            "net1": "fa:24:6c:8f:01:45",
            "net10": "0a:8e:fd:20:41:0f",
            "net11": "b2:04:91:91:db:fa",
            "net12": "36:68:5c:ca:25:0f",
            "net13": "62:4d:ca:ce:8d:c4",
            "net14": "56:69:13:5a:ab:18",
            "net15": "ba:47:60:67:75:30",
            "net16": "b6:cd:11:86:f0:13",
            "net17": "de:40:a9:50:95:7e",
            "net18": "7a:40:cf:17:06:43",
            "net19": "2e:7d:3f:0d:08:d2",
            "net2": "de:18:6c:2a:d2:0c",
            "net3": "f6:ce:0a:84:19:f8",
            "net4": "02:cf:52:b4:ab:78",
            "net5": "12:7d:da:f7:70:a5",
            "net6": "96:34:fd:a8:9a:ec",
            "net7": "4e:ba:18:2f:5d:69",
            "net8": "06:87:f2:05:76:b5",
            "net9": "c6:e0:eb:ab:f5:32"
        },
        "tof_1_2_2": {
            "net0": "3a:bb:17:2d:94:cd",
            "net1": "da:0a:0e:fb:3d:c0",
            "net10": "4e:c4:c5:7b:50:eb",
            "net11": "0a:b1:27:81:48:d5",
            "net12": "3a:83:27:ee:3a:44",
            "net13": "16:99:5a:c4:b3:56",
            "net14": "a2:e2:10:81:38:30",
            "net15": "de:d1:74:3f:7f:c4",
            "net16": "5a:cf:84:bf:16:b2",
            "net17": "72:ab:17:76:4d:eb",
            "net18": "6e:42:81:8d:1f:6d",
            "net19": "16:5a:d7:5a:1f:9e",
            "net2": "ea:22:5c:8d:c9:68",
            "net3": "9a:57:49:41:58:02",
            "net4": "26:4b:2b:e9:a3:dc",
            "net5": "7a:19:d3:9b:dd:9d",
            "net6": "46:e2:0f:db:4b:24",
            "net7": "3a:ad:3e:67:af:48",
            "net8": "12:9d:4d:84:8b:83",
            "net9": "da:24:6a:42:44:fc"
        },
        "tof_1_2_3": {
            "net0": "1e:77:43:0f:1b:b6",
            "net1": "c6:cd:4d:6e:22:52",
            "net10": "86:b3:bd:90:00:9a",
            "net11": "2a:26:f8:1a:84:c4",
            "net12": "ce:13:db:b5:c3:10",
            "net13": "72:a2:d1:79:93:75",
            "net14": "aa:69:fb:86:57:db",
            "net15": "9e:b9:8c:f3:87:36",
            "net16": "6e:b5:73:00:e4:c8",
            "net17": "26:68:fc:ec:66:de",
            "net18": "7e:ba:1d:f7:18:1b",
            "net19": "6e:41:84:82:3b:89",
            "net2": "02:36:4f:6a:42:6e",
            "net3": "ba:34:e7:33:3c:07",
            "net4": "2a:af:51:72:01:fe",
            "net5": "36:49:04:85:9b:3b",
            "net6": "0e:ca:5f:25:86:62",
            "net7": "3a:cf:e7:4a:12:0f",
            "net8": "42:08:93:62:1a:73",
            "net9": "e6:3b:e1:1e:4d:0b"
        },
        "tof_1_2_4": {
            "net0": "26:7e:7e:b8:73:f9",
            "net1": "ea:8f:ad:d8:b8:4b",
            "net10": "5a:fc:5f:e9:b9:d8",
            "net11": "8a:44:97:6f:7d:49",
            "net12": "ba:62:b4:c4:44:e4",
            "net13": "f6:41:4a:24:28:a5",
            "net14": "46:10:df:2d:79:2b",
            "net15": "9e:53:60:e2:d5:19",
            "net16": "36:61:f5:64:22:a0",
            "net17": "72:cc:89:f5:e1:54",
            "net18": "86:1e:af:ed:02:27",
            "net19": "a2:04:53:d9:95:29",
            "net2": "d2:f6:10:a3:32:f0",
            "net3": "9a:66:99:eb:23:73",
            "net4": "f2:ee:d3:d7:21:7e",
            "net5": "96:fa:6b:46:7f:45",
            "net6": "ea:3a:8e:4c:63:0c",
            "net7": "c6:0e:f5:10:93:a1",
            "net8": "82:2a:63:b3:f9:66",
            "net9": "a2:0c:75:0c:a8:96"
        },
        "tof_1_2_5": {
            "net0": "ee:af:72:53:8a:9f",
            "net1": "ba:91:2c:70:a3:ce",
            "net10": "f2:30:98:74:ca:54",
            "net11": "8e:4b:ed:97:48:ae",
            "net12": "12:67:7c:e6:6e:f6",
            "net13": "a6:58:f5:1a:4c:5a",
            "net14": "82:f5:3d:b8:88:c9",
            "net15": "12:8f:e3:07:8d:24",
            "net16": "5a:ae:25:cf:bc:6e",
            "net17": "ce:6d:2e:a2:60:3a",
            "net18": "56:9d:a5:6b:2a:ec",
            "net19": "9e:f2:e9:47:9f:25",
            "net2": "8a:a2:e6:f3:c2:20",
            "net3": "1e:8e:42:d3:a3:32",
            "net4": "7a:77:9d:61:e2:9d",
            "net5": "2e:90:e0:53:91:66",
            "net6": "1a:7d:22:36:49:6f",
            "net7": "e6:05:75:76:6e:d0",
            "net8": "ae:09:a9:5e:8c:78",
            "net9": "92:76:e8:db:c2:02"
        },
        "tof_1_2_6": {
            "net0": "6a:5d:b8:55:6b:f7",
            "net1": "d2:23:47:df:9a:6f",
            "net10": "46:b7:ab:0f:7e:f2",
            "net11": "9e:4b:c6:07:62:d1",
            "net12": "ba:33:41:1b:f1:e5",
            "net13": "7a:29:b5:e9:d4:83",
            "net14": "a2:ca:17:88:4d:01",
            "net15": "1e:47:e3:10:33:d9",
            "net16": "2a:a5:c8:76:a5:7b",
            "net17": "4a:1e:e3:19:d9:61",
            "net18": "a2:9f:43:18:0f:3b",
            "net19": "b2:c1:0d:72:18:b4",
            "net2": "ee:fa:47:fe:27:1c",
            "net3": "e2:9a:09:f2:3c:69",
            "net4": "6a:11:d7:24:81:36",
            "net5": "b6:0f:10:bc:73:a2",
            "net6": "9e:97:24:d3:09:2a",
            "net7": "0a:72:3a:41:7c:71",
            "net8": "e6:31:3c:83:50:60",
            "net9": "76:5c:36:ee:ce:7d"
        },
        "tof_1_2_7": {
            "net0": "c6:2b:6c:2d:9b:ee",
            "net1": "06:e9:55:a3:7b:87",
            "net10": "16:51:5e:7f:d6:27",
            "net11": "fe:17:4a:9c:7c:e2",
            "net12": "fe:2f:6a:e3:34:e2",
            "net13": "36:1a:d6:32:aa:f4",
            "net14": "3a:63:d2:ef:60:b5",
            "net15": "0e:47:26:6b:02:4a",
            "net16": "8a:f6:79:52:3b:40",
            "net17": "ee:27:b0:f7:1a:23",
            "net18": "56:d5:ef:03:d6:5a",
            "net19": "72:49:40:47:81:fc",
            "net2": "b2:8f:0d:fe:8f:9f",
            "net3": "7a:59:9f:ee:bf:59",
            "net4": "66:5c:6a:e0:cc:0f",
            "net5": "3a:d3:e6:45:1f:6f",
            "net6": "c6:59:61:ca:48:d0",
            "net7": "ee:d5:dc:d5:49:35",
            "net8": "42:c0:2f:af:d8:b2",
            "net9": "8a:86:19:e1:8b:76"
        },
        "tof_1_2_8": {
            "net0": "6e:af:b8:39:e9:a6",
            "net1": "52:e3:f9:16:16:9a",
            "net10": "f2:32:4b:00:08:b3",
            "net11": "9e:eb:54:0f:96:ee",
            "net12": "ce:cf:4a:4b:cf:ff",
            "net13": "42:9b:a8:1e:62:f2",
            "net14": "de:c5:f9:2b:2f:bc",
            "net15": "7a:88:53:d5:31:3a",
            "net16": "82:d2:a4:2c:3d:1b",
            "net17": "b2:15:3c:8d:69:24",
            "net18": "0a:73:f0:a1:05:5a",
            "net19": "2e:60:1a:55:9d:81",
            "net2": "de:b2:84:88:3d:0d",
            "net3": "d6:ac:38:f6:6f:64",
            "net4": "ae:9f:06:ea:d9:b2",
            "net5": "46:c6:78:01:4d:1d",
            "net6": "1a:4c:14:a1:44:08",
            "net7": "4e:d5:e0:45:bf:f9",
            "net8": "1e:8e:39:74:ed:b0",
            "net9": "aa:6b:33:88:2d:02"
        },
        "tof_1_2_9": {
            "net0": "46:7b:1d:5b:a8:4d",
            "net1": "3a:d6:51:56:3d:c6",
            "net10": "02:43:37:47:5d:83",
            "net11": "36:8f:b7:40:34:b2",
            "net12": "0e:17:97:79:a4:c9",
            "net13": "96:22:06:9f:d3:9a",
            "net14": "6e:61:82:d9:70:93",
            "net15": "36:79:36:ce:df:86",
            "net16": "86:b6:15:50:46:c9",
            "net17": "6a:0b:d9:64:8e:93",
            "net18": "9e:9e:e6:d3:27:45",
            "net19": "ba:57:03:bb:98:ec",
            "net2": "82:9e:c3:4b:c4:b1",
            "net3": "62:a5:b3:74:45:b9",
            "net4": "3a:24:00:d5:0c:2c",
            "net5": "7e:c6:96:b0:c1:65",
            "net6": "2e:38:c9:35:1b:58",
            "net7": "32:f1:e9:3e:f2:e4",
            "net8": "7e:94:4d:0a:ee:fd",
            "net9": "d2:52:cd:bf:ba:f4"
        },
        "tof_2_2_1": {
            "net0": "e2:c8:41:2a:f2:8b",
            "net1": "2e:80:57:fc:e1:77",
            "net10": "6e:ef:d5:8b:ff:4b",
            "net11": "aa:db:4a:bb:58:70",
            "net12": "7e:e7:36:1e:63:a0",
            "net13": "ba:eb:6a:9b:bf:12",
            "net14": "5e:90:01:db:e9:4f",
            "net15": "b2:d4:ac:63:3c:ff",
            "net16": "06:74:54:55:11:3d",
            "net17": "d6:15:37:a3:50:e2",
            "net18": "0e:ae:99:3c:13:ee",
            "net19": "46:d9:52:69:7f:8b",
            "net2": "16:61:62:33:25:ea",
            "net3": "92:b4:6d:16:db:3f",
            "net4": "9e:b7:dd:00:a8:9b",
            "net5": "12:5b:4b:a7:16:c7",
            "net6": "fa:52:de:48:82:d4",
            "net7": "32:de:22:ec:34:65",
            "net8": "42:19:49:e1:b6:f3",
            "net9": "de:b9:b3:78:b1:79"
        },
        "tof_2_2_10": {
            "net0": "ce:b9:e7:1a:61:e5",
            "net1": "16:f6:8c:18:fe:f1",
            "net10": "62:59:96:6a:65:d7",
            "net11": "5e:46:aa:78:b0:47",
            "net12": "be:d3:d3:bc:0c:ef",
            "net13": "76:d2:64:e9:2f:bd",
            "net14": "42:95:f7:30:5a:5c",
            "net15": "7e:df:81:0e:49:a8",
            "net16": "36:62:41:3d:94:4d",
            "net17": "de:c4:67:54:a7:e2",
            "net18": "ba:76:ef:47:37:73",
            "net19": "16:d8:8c:ae:7a:35",
            "net2": "22:5b:9c:8f:f8:df",
            "net3": "22:a8:fd:b6:33:4a",
            "net4": "76:a9:0d:55:68:cf",
            "net5": "0e:0e:fb:81:66:2d",
            "net6": "32:69:33:f3:3b:8e",
            "net7": "ea:bc:f0:55:5f:40",
            "net8": "fe:1e:2e:60:eb:40",
            "net9": "16:82:a2:69:0d:04"
        },
        "tof_2_2_2": {
            "net0": "e6:4d:d4:97:3c:f1",
            "net1": "22:69:dd:8c:8e:36",
            "net10": "3a:5c:f8:0a:0c:1c",
            "net11": "86:8b:e9:fc:0e:21",
            "net12": "a6:d9:4b:46:ec:42",
            "net13": "3e:02:0d:99:59:3e",
            "net14": "d6:a2:38:0a:d2:81",
            "net15": "e6:d2:eb:95:04:41",
            "net16": "ca:a3:d4:89:61:e1",
            "net17": "22:94:87:c4:aa:b5",
            "net18": "4a:df:4d:7f:cb:4c",
            "net19": "62:b5:f8:db:48:af",
            "net2": "ce:da:56:25:71:79",
            "net3": "9e:a9:bb:80:00:6d",
            "net4": "76:2b:a8:45:8b:13",
            "net5": "1a:b3:7a:02:0b:a5",
            "net6": "5e:58:11:47:9b:fd",
            "net7": "36:8a:1e:16:e0:3b",
            "net8": "8e:e7:91:df:c8:24",
            "net9": "ee:f2:f1:cf:1d:24"
        },
        "tof_2_2_3": {
            "net0": "8e:24:ac:1b:ef:df",
            "net1": "c2:5b:37:bd:60:18",
            "net10": "56:d1:7d:ad:7b:78",
            "net11": "1a:de:09:02:b9:7d",
            "net12": "ee:62:3d:2e:e1:28",
            "net13": "7e:d1:b5:33:6f:56",
            "net14": "52:66:c4:ce:34:3b",
            "net15": "36:2f:cf:e3:bf:5a",
            "net16": "ae:6c:dc:a8:20:bc",
            "net17": "22:15:cf:f5:61:cf",
            "net18": "26:8b:96:ac:49:d1",
            "net19": "a2:04:5d:6c:ef:2d",
            "net2": "42:33:5e:1a:4e:cd",
            "net3": "96:e0:9c:a9:50:e0",
            "net4": "22:e3:46:d3:a0:89",
            "net5": "72:9a:66:7c:c0:0c",
            "net6": "d6:37:25:2d:75:3d",
            "net7": "b6:a5:5e:45:28:a9",
            "net8": "ea:77:94:ce:94:6b",
            "net9": "5e:c4:c3:65:5f:88"
        },
        "tof_2_2_4": {
            "net0": "52:11:78:34:19:5a",
            "net1": "3a:40:7c:05:d1:7b",
            "net10": "52:5e:03:7f:e6:5c",
            "net11": "b6:04:e7:9c:f6:fb",
            "net12": "4a:a9:6a:ec:f5:5a",
            "net13": "32:dc:85:98:5b:01",
            "net14": "fa:d6:bf:f8:b9:05",
            "net15": "ae:0d:8c:d3:08:f8",
            "net16": "e2:a6:0e:25:f7:4a",
            "net17": "4a:1c:51:7f:34:c4",
            "net18": "ae:23:48:32:07:c6",
            "net19": "fe:3c:0d:8c:0b:bb",
            "net2": "06:e3:7e:d7:34:00",
            "net3": "96:51:4b:db:91:c7",
            "net4": "6e:c2:44:63:29:15",
            "net5": "e2:4f:7d:60:a3:3a",
            "net6": "52:17:6a:94:e7:70",
            "net7": "42:26:02:20:88:a6",
            "net8": "be:4d:0c:d8:6b:00",
            "net9": "32:50:df:5e:ca:d9"
        },
        "tof_2_2_5": {
            "net0": "02:49:5b:a0:7c:c5",
            "net1": "3a:2f:05:c4:71:12",
            "net10": "5a:24:37:ba:bd:dd",
            "net11": "f2:3d:b2:2a:03:1b",
            "net12": "aa:64:af:e2:a9:7d",
            "net13": "4a:d3:7d:9a:6c:a4",
            "net14": "5e:31:47:ff:ef:b7",
            "net15": "6a:e6:6f:eb:7a:3c",
            "net16": "66:0e:47:29:67:6e",
            "net17": "9e:8b:45:9a:fa:18",
            "net18": "8e:c4:bf:0c:7e:0c",
            "net19": "fa:36:52:12:10:64",
            "net2": "62:78:62:c7:25:8c",
            "net3": "66:e8:34:cf:3f:8d",
            "net4": "1e:36:21:09:53:c4",
            "net5": "22:07:7e:fd:f3:c3",
            "net6": "aa:da:f5:89:6f:94",
            "net7": "ee:8b:4c:2c:1d:73",
            "net8": "b6:1b:85:52:87:13",
            "net9": "66:1e:1b:07:ee:76"
        },
        "tof_2_2_6": {
            "net0": "d6:40:de:d7:3b:28",
            "net1": "b2:91:f1:83:82:31",
            "net10": "5a:ea:12:43:9e:8d",
            "net11": "62:26:e1:3a:ff:67",
            "net12": "6a:b7:d0:e6:74:87",
            "net13": "f2:79:b2:94:24:14",
            "net14": "da:28:1d:53:79:cf",
            "net15": "b2:8b:17:6a:ab:c7",
            "net16": "96:ef:dd:d2:06:00",
            "net17": "f6:08:11:d1:53:4e",
            "net18": "b2:34:a8:23:aa:c4",
            "net19": "12:e7:50:92:ad:28",
            "net2": "fa:f6:c3:f8:37:f9",
            "net3": "8e:fc:97:8c:94:12",
            "net4": "02:cd:73:48:60:d1",
            "net5": "e2:e4:e7:a6:7e:c2",
            "net6": "fe:d7:f0:b8:41:78",
            "net7": "06:25:65:85:73:a5",
            "net8": "8a:ab:d2:7e:e8:50",
            "net9": "2a:75:d7:bb:34:7f"
        },
        "tof_2_2_7": {
            "net0": "9e:52:1a:d9:82:c7",
            "net1": "5e:12:fb:a4:3b:69",
            "net10": "36:11:a4:6e:57:84",
            "net11": "72:91:7e:05:c5:cc",
            "net12": "12:06:a5:c3:06:a3",
            "net13": "6e:76:d6:ab:58:e0",
            "net14": "a2:49:4b:6a:4a:ce",
            "net15": "16:88:37:5d:b2:f4",
            "net16": "f2:da:ef:b4:37:7f",
            "net17": "9a:e9:66:bb:0b:2c",
            "net18": "22:fd:7a:40:a8:15",
            "net19": "e2:db:1a:a9:e7:fa",
            "net2": "8e:05:45:e0:51:5b",
            "net3": "02:be:e7:f3:3f:03",
            "net4": "c6:ee:bc:2c:a2:01",
            "net5": "1a:3c:e8:96:49:f2",
            "net6": "16:54:10:92:f0:65",
            "net7": "ea:b9:f4:60:5c:e4",
            "net8": "da:25:37:31:30:6e",
            "net9": "8a:cf:31:f8:29:af"
        },
        "tof_2_2_8": {
            "net0": "2a:b3:e5:ae:ca:8e",
            "net1": "be:44:06:7c:37:1b",
            "net10": "0e:ce:bc:2f:8d:8f",
            "net11": "62:2d:84:78:ba:42",
            "net12": "ca:b0:8a:de:65:d3",
            "net13": "ea:0a:70:c5:6b:3c",
            "net14": "16:71:cf:fc:f2:b3",
            "net15": "a6:ae:ab:ae:d0:a2",
            "net16": "76:59:a8:9a:ba:72",
            "net17": "86:40:ff:c8:cb:ef",
            "net18": "ce:2e:e2:74:bc:97",
            "net19": "32:83:3c:8a:df:7d",
            "net2": "9e:66:16:5f:bf:e8",
            "net3": "8a:aa:63:18:b7:32",
            "net4": "52:90:cb:57:74:a7",
            "net5": "52:be:a2:5c:c0:0d",
            "net6": "16:30:8b:25:b6:67",
            "net7": "ca:0c:bf:01:fc:14",
            "net8": "6e:df:97:64:99:5a",
            "net9": "b2:e1:ad:94:50:ea"
        },
        "tof_2_2_9": {
            "net0": "56:99:5b:d2:db:70",
            "net1": "06:06:b6:d0:7d:c0",
            "net10": "ce:ff:17:a9:60:fb",
            "net11": "9a:55:87:aa:31:30",
            "net12": "66:16:a8:b0:89:f7",
            "net13": "6a:86:b0:57:28:23",
            "net14": "da:fc:fb:aa:91:73",
            "net15": "06:2c:34:51:15:7e",
            "net16": "56:fc:27:ac:39:e4",
            "net17": "36:c9:dd:8e:6d:04",
            "net18": "06:26:82:75:54:7a",
            "net19": "9a:1b:16:c8:3f:af",
            "net2": "da:ad:89:9f:88:6e",
            "net3": "62:10:c3:dc:19:43",
            "net4": "62:51:0d:79:e7:0b",
            "net5": "62:64:ae:d9:64:8d",
            "net6": "0e:86:9b:07:6f:8c",
            "net7": "66:7f:b0:9d:e6:4a",
            "net8": "32:0a:f3:f9:4f:fa",
            "net9": "7a:f6:87:18:62:c2"
        }
    },
    "failed_machine": "tof_1_2_1",
    "failed_interfaces": [
        "net0",
        "net1",
        "net2",
        "net3",
        "net4"
    ],
    "failure_time": 1613648236.5359192
}