{
    "k_leaf": 4,
    "k_top": 4,
    "redundancy_factor": 4,
    "is_k8s": true,
    "machine_mac_addresses": {
        "leaf_1_0_1": {
            "net0": "82:72:c2:aa:05:c0",
            "net1": "0a:d9:09:5a:62:e6",
            "net2": "0a:07:3a:6c:47:ac",
            "net3": "96:25:34:35:db:78",
            "net4": "6e:74:ac:4b:68:6e"
        },
        "leaf_1_0_2": {
            "net0": "92:b0:13:3b:c2:7d",
            "net1": "4e:35:7e:f2:9f:71",
            "net2": "f6:6f:6c:40:9c:ee",
            "net3": "16:52:58:10:0d:36",
            "net4": "42:de:2f:a3:b3:59"
        },
        "leaf_1_0_3": {
            "net0": "e2:ae:fb:7a:11:ce",
            "net1": "12:39:c0:3a:a3:e1",
            "net2": "06:fb:63:b8:5e:ca",
            "net3": "fa:56:e0:dd:77:00",
            "net4": "b2:83:e5:1c:62:14"
        },
        "leaf_1_0_4": {
            "net0": "56:33:6e:1f:f3:00",
            "net1": "42:3d:71:f2:5a:8b",
            "net2": "a6:fa:2f:ab:b3:e0",
            "net3": "fe:bf:d6:2c:b4:ff",
            "net4": "42:80:61:ba:f3:17"
        },
        "leaf_2_0_1": {
            "net0": "72:71:91:cf:15:1c",
            "net1": "5e:6f:d9:8a:04:36",
            "net2": "ca:4b:43:e2:bb:c2",
            "net3": "b6:08:b1:0e:c5:94",
            "net4": "8e:47:aa:26:7d:64"
        },
        "leaf_2_0_2": {
            "net0": "12:2f:0a:0d:90:05",
            "net1": "26:8c:bd:27:55:c6",
            "net2": "b2:92:dd:c4:79:d9",
            "net3": "fa:97:d2:39:01:55",
            "net4": "be:c3:f4:e3:8e:de"
        },
        "leaf_2_0_3": {
            "net0": "62:45:7d:43:bc:99",
            "net1": "ea:97:ee:9f:ef:ab",
            "net2": "2a:8d:b2:d3:f9:91",
            "net3": "96:31:95:a0:67:ec",
            "net4": "2e:e6:4c:11:86:7f"
        },
        "leaf_2_0_4": {
            "net0": "c6:8d:65:24:48:63",
            "net1": "52:a0:4b:c3:b9:93",
            "net2": "3e:6b:21:92:2c:9f",
            "net3": "e2:2f:76:34:61:e6",
            "net4": "8e:de:5c:eb:66:06"
        },
        "spine_1_1_1": {
            "net0": "4a:7b:4a:11:b4:e7",
            "net1": "6e:b1:ea:74:91:6c",
            "net2": "52:01:22:ac:39:ed",
            "net3": "de:16:e0:1c:a2:23",
            "net4": "c2:6c:20:be:66:22",
            "net5": "6a:70:0a:04:a7:75",
            "net6": "a6:bc:6b:a4:ae:9a",
            "net7": "2a:d0:fe:63:87:d0"
        },
        "spine_1_1_2": {
            "net0": "4a:a7:ad:e0:a6:dc",
            "net1": "aa:6d:d0:93:11:a3",
            "net2": "9a:16:74:fd:24:1b",
            "net3": "aa:7a:d3:cd:ee:aa",
            "net4": "a6:7f:f1:62:20:84",
            "net5": "12:27:be:5d:8a:0d",
            "net6": "ee:f5:a0:6d:2a:d6",
            "net7": "f2:c0:e1:cf:7e:e7"
        },
        "spine_1_1_3": {
            "net0": "9e:e2:f5:a6:ed:c7",
            "net1": "26:2c:f1:10:06:20",
            "net2": "6e:57:c9:bf:90:ac",
            "net3": "b2:7d:a0:b7:d7:34",
            "net4": "2e:5d:0d:86:55:b1",
            "net5": "16:5a:0d:14:3a:65",
            "net6": "72:28:69:76:44:69",
            "net7": "de:5a:4c:55:87:2a"
        },
        "spine_1_1_4": {
            "net0": "e2:bb:c9:27:9e:8f",
            "net1": "fe:e9:4e:9c:a9:4f",
            "net2": "0a:f1:b2:b0:5e:88",
            "net3": "b2:c4:bd:e0:23:08",
            "net4": "a2:39:9c:43:0a:cf",
            "net5": "32:09:63:24:73:b3",
            "net6": "6a:18:50:43:95:52",
            "net7": "32:fd:e1:6c:75:9d"
        },
        "spine_2_1_1": {
            "net0": "36:d6:0e:31:7b:be",
            "net1": "aa:e0:e6:cc:a4:bf",
            "net2": "ee:e2:bd:a7:92:71",
            "net3": "5e:91:59:4e:27:2c",
            "net4": "7a:92:64:20:52:d6",
            "net5": "4e:5f:b4:2b:0d:82",
            "net6": "ca:96:f8:3d:e8:6f",
            "net7": "3a:bd:ba:b4:10:63"
        },
        "spine_2_1_2": {
            "net0": "86:5e:46:ad:02:c9",
            "net1": "c6:02:bd:7a:75:11",
            "net2": "5e:28:c6:fc:61:38",
            "net3": "f6:2b:58:f1:66:e0",
            "net4": "42:36:04:71:d7:0b",
            "net5": "ee:35:d2:8f:1e:d3",
            "net6": "d2:41:7a:1f:c2:61",
            "net7": "3e:06:8a:03:5a:a6"
        },
        "spine_2_1_3": {
            "net0": "9a:9a:63:34:97:c0",
            "net1": "ee:76:5b:b5:b1:21",
            "net2": "06:88:13:0e:06:96",
            "net3": "2a:a0:e5:de:80:fc",
            "net4": "a2:b7:43:49:51:2b",
            "net5": "96:b5:a2:45:7f:38",
            "net6": "9e:b1:34:a4:80:4e",
            "net7": "66:43:f9:95:8b:bf"
        },
        "spine_2_1_4": {
            "net0": "16:8f:45:2f:5d:77",
            "net1": "3e:cd:51:2b:03:25",
            "net2": "52:b3:b4:01:94:49",
            "net3": "f2:40:b5:13:6d:17",
            "net4": "d2:6a:e9:77:87:9a",
            "net5": "4e:27:cf:7f:51:d0",
            "net6": "76:fb:31:7b:3f:1f",
            "net7": "5e:3c:58:39:65:fe"
        },
        "tof_1_2_1": {
            "net0": "86:96:06:d3:d6:60",
            "net1": "ca:41:00:f8:e8:cf",
            "net2": "72:d4:61:3b:e9:80",
            "net3": "46:b9:31:85:11:a0",
            "net4": "8a:cb:a1:a2:ae:46",
            "net5": "ae:de:20:8a:f9:42",
            "net6": "06:81:e3:f4:3d:66",
            "net7": "32:35:e1:40:2e:62"
        },
        "tof_1_2_2": {
            "net0": "7e:8c:d7:47:52:5f",
            "net1": "aa:04:e2:2b:a1:5e",
            "net2": "aa:92:14:b2:7f:18",
            "net3": "4e:20:a7:ae:2c:f5",
            "net4": "e2:89:ee:a6:4b:09",
            "net5": "0a:5b:c3:c1:5d:4c",
            "net6": "72:7b:13:5e:02:83",
            "net7": "c2:08:df:f7:fb:74"
        },
        "tof_1_2_3": {
            "net0": "ba:17:4d:fa:43:43",
            "net1": "9a:1c:38:1d:b0:47",
            "net2": "76:67:32:cf:1f:41",
            "net3": "92:ed:b9:02:53:75",
            "net4": "4e:31:c6:f1:3a:42",
            "net5": "b2:96:33:ff:76:5d",
            "net6": "e6:b6:55:fc:a9:3c",
            "net7": "ee:9e:e1:10:1c:52"
        },
        "tof_1_2_4": {
            "net0": "c2:78:a0:d5:5d:73",
            "net1": "f2:63:ae:05:f2:9c",
            "net2": "2e:6f:11:53:20:6f",
            "net3": "4e:4c:c6:6b:be:71",
            "net4": "86:44:1b:1d:0b:4f",
            "net5": "ca:d3:c7:6a:2f:88",
            "net6": "0e:d3:2f:54:b9:d1",
            "net7": "aa:08:c6:3b:a0:60"
        }
    },
    "failed_machine": "leaf_1_0_1",
    "failure_time": {
        "leaf_1_0_1": 1622467264.5782628,
        "leaf_1_0_2": 1622467264.5881045,
        "leaf_1_0_3": 1622467264.600953,
        "leaf_1_0_4": 1622467264.580811,
        "leaf_2_0_1": 1622467264.5896158,
        "leaf_2_0_2": 1622467264.6041417,
        "leaf_2_0_3": 1622467264.61254,
        "leaf_2_0_4": 1622467264.6238081,
        "spine_1_1_1": 1622467264.7154248,
        "spine_1_1_2": 1622467264.6161475,
        "spine_1_1_3": 1622467264.6269083,
        "spine_1_1_4": 1622467264.634629,
        "spine_2_1_1": 1622467264.6406496,
        "spine_2_1_2": 1622467264.649187,
        "spine_2_1_3": 1622467264.6554172,
        "spine_2_1_4": 1622467264.6641502,
        "tof_1_2_1": 1622467264.6753757,
        "tof_1_2_2": 1622467264.684024,
        "tof_1_2_3": 1622467264.6935601,
        "tof_1_2_4": 1622467264.7016683
    }
}