{
    "k_leaf": 4,
    "k_top": 4,
    "redundancy_factor": 2,
    "is_k8s": true,
    "machine_mac_addresses": {
        "leaf_1_0_1": {
            "net0": "8e:d7:26:ca:bc:a0",
            "net1": "b2:36:94:75:6f:d1",
            "net2": "d6:2b:3e:1b:37:4b",
            "net3": "5a:2d:a8:21:32:60",
            "net4": "4a:09:b5:12:02:6c"
        },
        "leaf_1_0_2": {
            "net0": "ee:13:83:7f:c7:58",
            "net1": "e6:8f:26:d7:4a:a7",
            "net2": "de:52:92:75:e1:a3",
            "net3": "16:85:5a:6e:51:3c",
            "net4": "3a:2f:37:da:ae:e9"
        },
        "leaf_1_0_3": {
            "net0": "aa:ba:dc:9f:96:6d",
            "net1": "9e:c3:1d:45:9a:bf",
            "net2": "9a:c3:b9:18:85:57",
            "net3": "72:4c:74:75:78:a3",
            "net4": "4a:2e:f1:26:2c:13"
        },
        "leaf_1_0_4": {
            "net0": "c6:d9:3d:b4:fb:f8",
            "net1": "e6:12:e4:48:0a:9b",
            "net2": "d6:77:5b:06:dd:6f",
            "net3": "52:a7:97:cc:7d:6d",
            "net4": "2e:e6:35:e7:7d:f0"
        },
        "leaf_2_0_1": {
            "net0": "4a:bb:5a:99:94:11",
            "net1": "62:b5:ab:1c:b9:84",
            "net2": "1e:47:8b:78:a6:ae",
            "net3": "8a:c8:63:48:33:66",
            "net4": "da:6c:09:56:54:29"
        },
        "leaf_2_0_2": {
            "net0": "92:ad:42:15:e4:9f",
            "net1": "ba:52:34:f1:a1:1f",
            "net2": "46:de:76:09:db:a2",
            "net3": "7e:4c:89:3e:4d:c2",
            "net4": "ba:6a:3f:a3:1b:b0"
        },
        "leaf_2_0_3": {
            "net0": "4e:61:72:04:a9:2d",
            "net1": "ba:85:a1:80:9f:cb",
            "net2": "1e:01:8e:68:01:5d",
            "net3": "0a:ef:07:06:43:a8",
            "net4": "72:f6:73:49:39:f3"
        },
        "leaf_2_0_4": {
            "net0": "12:2f:cd:ca:20:ed",
            "net1": "fe:fa:fc:18:a3:20",
            "net2": "ee:a0:5f:97:fe:27",
            "net3": "1a:f2:c8:58:04:78",
            "net4": "22:b3:d4:d7:1f:5e"
        },
        "leaf_3_0_1": {
            "net0": "1a:be:61:e8:9c:52",
            "net1": "46:dc:5c:9e:12:0f",
            "net2": "fa:2c:ad:f2:a5:4c",
            "net3": "fe:ae:4f:d1:b9:8a",
            "net4": "2a:23:03:6d:e4:e7"
        },
        "leaf_3_0_2": {
            "net0": "ea:a8:a4:09:d7:d7",
            "net1": "a2:f3:37:2a:41:92",
            "net2": "da:ac:6b:4f:db:fd",
            "net3": "8a:5c:6d:e9:bf:ae",
            "net4": "02:89:0d:2b:e0:67"
        },
        "leaf_3_0_3": {
            "net0": "56:38:20:04:36:a6",
            "net1": "ca:d6:60:2d:6a:7d",
            "net2": "de:83:9d:20:c8:7b",
            "net3": "a2:cc:ab:96:8e:12",
            "net4": "0a:8a:39:ee:c7:40"
        },
        "leaf_3_0_4": {
            "net0": "1a:46:d1:40:35:0c",
            "net1": "3e:d4:5c:7a:02:a0",
            "net2": "b6:13:c7:44:de:b8",
            "net3": "e2:10:88:4a:1c:0e",
            "net4": "8a:99:e9:78:d0:6e"
        },
        "leaf_4_0_1": {
            "net0": "96:04:ae:87:e5:94",
            "net1": "62:aa:5a:97:95:82",
            "net2": "5a:17:78:7c:b7:09",
            "net3": "da:d4:9c:74:4d:de",
            "net4": "e2:01:6b:fa:98:29"
        },
        "leaf_4_0_2": {
            "net0": "56:36:5e:70:00:e6",
            "net1": "62:60:55:f3:37:ef",
            "net2": "3a:10:d0:59:70:46",
            "net3": "ba:35:d6:59:e0:6c",
            "net4": "a2:39:04:66:69:c6"
        },
        "leaf_4_0_3": {
            "net0": "22:99:0a:ec:8e:f5",
            "net1": "e6:1f:66:7f:76:97",
            "net2": "8a:b9:bb:25:23:53",
            "net3": "b6:d2:4c:07:f1:c4",
            "net4": "0e:f1:67:a7:0d:42"
        },
        "leaf_4_0_4": {
            "net0": "fa:0c:5c:d7:b6:7a",
            "net1": "0a:8a:8b:1b:ef:0f",
            "net2": "fe:99:30:75:55:f6",
            "net3": "7e:11:a7:ff:32:cf",
            "net4": "0a:13:e2:68:0e:d0"
        },
        "spine_1_1_1": {
            "net0": "32:98:78:8e:2f:c9",
            "net1": "b2:99:ac:48:f8:1f",
            "net2": "72:b6:d3:9d:dd:59",
            "net3": "7a:b4:a6:b2:1f:70",
            "net4": "1e:28:da:6f:4e:df",
            "net5": "12:b7:ef:2a:cc:00",
            "net6": "5e:3c:4e:d0:37:1d",
            "net7": "3a:6d:ab:a8:3b:7d"
        },
        "spine_1_1_2": {
            "net0": "2e:9e:69:f1:98:86",
            "net1": "d2:f5:9b:e1:97:51",
            "net2": "82:f7:21:8f:ad:d8",
            "net3": "06:8c:68:a6:ee:1b",
            "net4": "22:92:18:ff:9c:96",
            "net5": "36:e0:c0:49:94:40",
            "net6": "02:36:dc:d6:d8:4b",
            "net7": "de:74:4a:b3:f3:4e"
        },
        "spine_1_1_3": {
            "net0": "46:8b:f5:23:1a:3a",
            "net1": "26:94:ac:a9:a0:0e",
            "net2": "de:03:2b:e7:69:2b",
            "net3": "66:7a:37:7a:8c:5c",
            "net4": "12:3d:36:1f:48:23",
            "net5": "1a:47:ad:5c:b4:94",
            "net6": "e6:11:b9:e4:62:98",
            "net7": "82:d0:f4:cf:e2:19"
        },
        "spine_1_1_4": {
            "net0": "e6:1b:c5:4b:44:5a",
            "net1": "ba:bd:21:39:27:d9",
            "net2": "82:64:62:e0:cf:3b",
            "net3": "82:30:93:9b:ee:c9",
            "net4": "36:90:68:8f:67:46",
            "net5": "12:bc:27:a2:d2:f4",
            "net6": "d6:b0:9d:8f:ef:25",
            "net7": "a2:ab:5f:d2:1c:21"
        },
        "spine_2_1_1": {
            "net0": "6a:29:7c:fd:e9:bb",
            "net1": "ee:5b:f8:89:92:2c",
            "net2": "b6:6d:f6:69:75:e4",
            "net3": "8e:fe:36:21:68:c3",
            "net4": "f6:ec:33:80:97:3d",
            "net5": "a6:8d:83:3f:10:45",
            "net6": "96:7d:8d:08:3e:87",
            "net7": "2a:8e:17:27:60:e0"
        },
        "spine_2_1_2": {
            "net0": "92:b4:e2:70:2b:40",
            "net1": "c6:3b:a8:0f:89:4e",
            "net2": "a2:94:80:e0:a0:75",
            "net3": "16:0b:6d:17:c2:6f",
            "net4": "f6:78:d7:d9:c6:f8",
            "net5": "c6:fa:c2:30:7a:b1",
            "net6": "d2:ef:e3:9b:ba:15",
            "net7": "4e:03:83:c4:a3:cf"
        },
        "spine_2_1_3": {
            "net0": "e6:f2:64:e2:2c:17",
            "net1": "3e:4c:a2:e7:24:8c",
            "net2": "92:3e:70:ab:70:67",
            "net3": "32:33:e8:4e:dd:b1",
            "net4": "da:36:5c:91:1b:48",
            "net5": "62:9a:35:84:8e:aa",
            "net6": "5e:6c:33:f9:5a:bf",
            "net7": "12:0a:8c:0a:80:ef"
        },
        "spine_2_1_4": {
            "net0": "de:9d:db:73:b7:c2",
            "net1": "c6:0b:8b:c4:30:29",
            "net2": "e6:cb:7c:1e:91:fb",
            "net3": "06:9e:58:92:9b:1b",
            "net4": "fa:3c:84:5e:5a:8c",
            "net5": "72:19:0e:36:36:7d",
            "net6": "36:7c:7a:bd:84:c2",
            "net7": "02:c4:c0:b2:58:ca"
        },
        "spine_3_1_1": {
            "net0": "de:cc:03:46:53:57",
            "net1": "9a:40:59:b1:33:8c",
            "net2": "5e:83:13:ee:5a:14",
            "net3": "86:f8:e2:49:e9:dc",
            "net4": "9e:28:87:42:b4:ab",
            "net5": "b2:a2:50:6c:6c:f5",
            "net6": "6e:61:59:93:1b:8b",
            "net7": "ce:9a:dd:8d:ee:1f"
        },
        "spine_3_1_2": {
            "net0": "1e:8c:90:8c:92:30",
            "net1": "be:d5:bf:f3:b0:54",
            "net2": "ae:4c:a1:2b:59:66",
            "net3": "c2:8e:68:56:dc:bb",
            "net4": "76:29:ea:f4:bb:94",
            "net5": "5a:54:00:44:26:52",
            "net6": "c6:95:4a:a3:50:9a",
            "net7": "3a:b7:79:cd:d1:34"
        },
        "spine_3_1_3": {
            "net0": "fe:45:48:d1:1e:8a",
            "net1": "66:d1:d1:0a:c7:d6",
            "net2": "26:50:a3:ff:cc:13",
            "net3": "ba:4b:ec:fd:86:c5",
            "net4": "fe:64:0c:c9:8b:da",
            "net5": "62:82:d4:a1:a2:12",
            "net6": "52:5b:7a:68:e2:32",
            "net7": "b6:5a:9c:0a:bc:b7"
        },
        "spine_3_1_4": {
            "net0": "26:05:b4:c9:db:d1",
            "net1": "7a:f7:45:70:af:46",
            "net2": "e6:92:9d:1b:06:2b",
            "net3": "7a:c5:ed:d7:79:6c",
            "net4": "96:0f:1e:b6:36:7b",
            "net5": "16:ba:af:5f:a0:d1",
            "net6": "52:16:c5:f6:12:89",
            "net7": "fa:b2:54:41:c0:6c"
        },
        "spine_4_1_1": {
            "net0": "2a:74:69:a9:d7:68",
            "net1": "9e:c3:d1:e3:2c:52",
            "net2": "2a:8e:6e:0c:54:a3",
            "net3": "4a:c6:43:9e:d6:af",
            "net4": "fe:ed:20:9c:ef:40",
            "net5": "6e:72:5e:09:6e:1a",
            "net6": "1e:0d:ec:ab:8f:36",
            "net7": "1e:4e:a4:1d:76:b7"
        },
        "spine_4_1_2": {
            "net0": "ca:61:e0:04:19:12",
            "net1": "46:b5:0a:45:83:83",
            "net2": "fa:ba:8b:6a:5f:82",
            "net3": "92:ea:0a:95:96:ee",
            "net4": "4a:42:c8:04:b2:b7",
            "net5": "46:4c:1f:43:ec:67",
            "net6": "5e:14:c2:ea:b2:91",
            "net7": "a6:c1:76:ac:b6:99"
        },
        "spine_4_1_3": {
            "net0": "7a:a0:1f:66:cb:d3",
            "net1": "1e:ec:08:6e:88:2d",
            "net2": "42:5d:c2:a5:d3:1a",
            "net3": "42:0d:3c:b9:38:8a",
            "net4": "6a:6b:f4:fc:a3:0d",
            "net5": "de:c7:8c:db:75:3b",
            "net6": "d2:73:df:dd:b2:0f",
            "net7": "7a:2a:d2:00:44:cd"
        },
        "spine_4_1_4": {
            "net0": "46:66:bd:dc:65:96",
            "net1": "96:88:f6:a1:8e:8e",
            "net2": "0a:6c:60:2f:c6:72",
            "net3": "7e:71:88:c7:45:23",
            "net4": "2a:e5:12:46:78:5f",
            "net5": "66:30:9c:73:f1:1c",
            "net6": "ce:fc:2f:ca:79:a8",
            "net7": "aa:df:c2:fb:cb:a2"
        },
        "tof_1_2_1": {
            "net0": "52:0e:64:6e:26:da",
            "net1": "ca:81:44:a8:f4:95",
            "net2": "f6:0c:0c:f3:fc:2b",
            "net3": "82:1a:1e:99:23:78",
            "net4": "22:34:37:4f:a7:38",
            "net5": "5a:b0:5a:1f:0e:42",
            "net6": "a6:c6:32:60:0d:8b",
            "net7": "2a:8a:ca:b5:17:6f"
        },
        "tof_1_2_2": {
            "net0": "ee:6d:48:96:8d:4c",
            "net1": "22:7b:2f:ab:ca:4a",
            "net2": "3a:f8:97:1f:4d:73",
            "net3": "a2:a6:3c:ea:65:8b",
            "net4": "86:12:0d:92:bc:82",
            "net5": "8e:1a:fa:ca:08:d1",
            "net6": "8a:07:cf:a9:42:f8",
            "net7": "2a:4a:40:50:74:06"
        },
        "tof_1_2_3": {
            "net0": "a6:34:e2:b1:dd:ea",
            "net1": "ee:12:b8:50:4f:c3",
            "net2": "3e:6d:a2:71:c7:53",
            "net3": "3a:68:ca:bc:6a:eb",
            "net4": "f6:4f:56:ea:b1:c0",
            "net5": "ea:d1:18:a4:00:a1",
            "net6": "12:6c:c7:67:3d:e7",
            "net7": "46:f5:02:40:4c:80"
        },
        "tof_1_2_4": {
            "net0": "ea:8e:d7:87:71:28",
            "net1": "12:86:3b:04:4b:3b",
            "net2": "d6:7a:eb:91:1f:90",
            "net3": "d2:c0:43:fb:4a:12",
            "net4": "f6:03:3e:fd:b0:12",
            "net5": "92:ba:09:4c:9e:d8",
            "net6": "b6:3a:b0:6d:90:f2",
            "net7": "62:68:44:40:41:a4"
        },
        "tof_2_2_1": {
            "net0": "ae:27:a2:0b:00:b5",
            "net1": "ee:db:fa:ea:f5:bf",
            "net2": "f6:0f:b5:a3:db:89",
            "net3": "f2:e2:a2:24:87:e4",
            "net4": "c2:ff:e5:33:c9:51",
            "net5": "a6:31:a4:65:88:29",
            "net6": "a6:d2:94:ff:42:bb",
            "net7": "1a:74:cd:ac:77:c7"
        },
        "tof_2_2_2": {
            "net0": "36:1e:53:45:a2:70",
            "net1": "2a:4e:b2:72:49:ad",
            "net2": "0a:7a:45:5a:a4:ab",
            "net3": "62:b3:e5:fb:51:6f",
            "net4": "fa:ba:04:05:9d:17",
            "net5": "2e:98:c6:c1:6e:49",
            "net6": "fe:cf:d3:51:dc:28",
            "net7": "42:58:e9:31:57:0e"
        },
        "tof_2_2_3": {
            "net0": "aa:f7:c1:17:a6:b8",
            "net1": "0e:10:15:78:b0:2e",
            "net2": "9a:12:64:1a:a9:44",
            "net3": "42:23:31:e5:52:b3",
            "net4": "2e:e5:0d:8a:3c:23",
            "net5": "92:8a:01:4e:9e:e3",
            "net6": "86:0d:f2:83:04:4b",
            "net7": "ce:cc:d2:c6:b7:5f"
        },
        "tof_2_2_4": {
            "net0": "fe:7d:e6:4b:13:13",
            "net1": "ae:d8:0c:96:b2:1e",
            "net2": "26:35:e8:84:2d:4f",
            "net3": "b2:73:e3:1a:b4:99",
            "net4": "d2:87:11:41:1e:44",
            "net5": "62:66:2b:5c:5f:18",
            "net6": "4a:1a:0e:69:3b:13",
            "net7": "76:00:94:e9:15:ad"
        }
    },
    "failed_machine": "leaf_1_0_1",
    "failure_time": {
        "leaf_1_0_1": 1622468446.9113145,
        "leaf_1_0_2": 1622468446.9262002,
        "leaf_1_0_3": 1622468446.9451075,
        "leaf_1_0_4": 1622468446.9584918,
        "leaf_2_0_1": 1622468446.9679348,
        "leaf_2_0_2": 1622468446.912253,
        "leaf_2_0_3": 1622468446.92607,
        "leaf_2_0_4": 1622468446.9422023,
        "leaf_3_0_1": 1622468446.9599037,
        "leaf_3_0_2": 1622468446.9711688,
        "leaf_3_0_3": 1622468446.9757152,
        "leaf_3_0_4": 1622468446.9812655,
        "leaf_4_0_1": 1622468446.9878078,
        "leaf_4_0_2": 1622468446.9958498,
        "leaf_4_0_3": 1622468447.0025601,
        "leaf_4_0_4": 1622468446.9787579,
        "spine_1_1_1": 1622468446.9841266,
        "spine_1_1_2": 1622468446.9909422,
        "spine_1_1_3": 1622468446.9967136,
        "spine_1_1_4": 1622468447.003989,
        "spine_2_1_1": 1622468447.009696,
        "spine_2_1_2": 1622468447.0174932,
        "spine_2_1_3": 1622468447.0282025,
        "spine_2_1_4": 1622468447.0355103,
        "spine_3_1_1": 1622468447.0422182,
        "spine_3_1_2": 1622468447.0142493,
        "spine_3_1_3": 1622468447.025739,
        "spine_3_1_4": 1622468447.0330374,
        "spine_4_1_1": 1622468447.039062,
        "spine_4_1_2": 1622468447.0480664,
        "spine_4_1_3": 1622468447.0504448,
        "spine_4_1_4": 1622468447.0572546,
        "tof_1_2_1": 1622468447.06381,
        "tof_1_2_2": 1622468447.0711455,
        "tof_1_2_3": 1622468447.083587,
        "tof_1_2_4": 1622468447.0541365,
        "tof_2_2_1": 1622468447.0607655,
        "tof_2_2_2": 1622468447.0674608,
        "tof_2_2_3": 1622468447.078301,
        "tof_2_2_4": 1622468447.0899792
    }
}