{
    "description": "Scenario 3c: ToF tof_1_2_1 failure with BGP",
    "k_leaf": 8,
    "k_top": 8,
    "redundancy_factor": 8,
    "is_k8s": true,
    "machine_mac_addresses": {
        "leaf_1_0_1": {
            "net0": "52:f1:9e:b9:19:68",
            "net1": "9a:90:11:3c:91:53",
            "net2": "26:c5:af:87:3b:69",
            "net3": "7a:c9:ca:31:f7:28",
            "net4": "ba:aa:19:7b:1c:09",
            "net5": "12:94:d5:4d:1d:4e",
            "net6": "36:6d:14:7e:e8:32",
            "net7": "5e:e5:1d:eb:c8:11",
            "net8": "16:81:66:0f:ae:da"
        },
        "leaf_1_0_2": {
            "net0": "9e:dd:28:20:0c:8b",
            "net1": "72:30:ce:e4:8d:2a",
            "net2": "7a:c5:3c:a4:0e:be",
            "net3": "42:a1:18:29:df:8f",
            "net4": "d2:75:58:d4:52:63",
            "net5": "b6:3c:fa:e0:b5:45",
            "net6": "0e:2b:17:2c:66:9a",
            "net7": "0a:ea:fa:a1:d9:c1",
            "net8": "ce:66:3d:24:8a:d9"
        },
        "leaf_1_0_3": {
            "net0": "4e:0f:fe:ab:80:31",
            "net1": "42:90:53:5e:f2:8c",
            "net2": "ea:57:ee:c3:9f:66",
            "net3": "26:5d:29:63:7d:45",
            "net4": "da:0e:4f:d4:15:4e",
            "net5": "be:72:51:5f:67:64",
            "net6": "62:98:b7:17:17:f0",
            "net7": "fa:3b:90:eb:e3:5d",
            "net8": "86:a8:9d:58:05:87"
        },
        "leaf_1_0_4": {
            "net0": "c6:d6:22:82:65:20",
            "net1": "72:98:21:c5:26:12",
            "net2": "76:db:1d:74:ea:d7",
            "net3": "c2:d5:94:14:a5:e2",
            "net4": "56:54:2d:da:b1:e9",
            "net5": "c2:21:1f:cd:da:14",
            "net6": "72:4e:33:68:0b:bf",
            "net7": "22:84:20:f1:5e:ad",
            "net8": "66:bd:43:d0:ac:5a"
        },
        "leaf_1_0_5": {
            "net0": "1e:f1:ad:b7:b4:31",
            "net1": "76:be:1e:3b:a3:b0",
            "net2": "6a:0b:5d:84:17:04",
            "net3": "2a:8c:55:3e:c3:70",
            "net4": "72:66:0d:53:f2:de",
            "net5": "0a:a9:95:9c:63:95",
            "net6": "52:cb:ee:c8:8c:9a",
            "net7": "06:ba:12:33:be:88",
            "net8": "46:80:16:4b:d7:aa"
        },
        "leaf_1_0_6": {
            "net0": "3a:9c:d2:7d:38:d8",
            "net1": "3a:7c:6b:26:e2:be",
            "net2": "26:16:4b:ad:21:8b",
            "net3": "5a:02:c7:f3:aa:45",
            "net4": "92:3d:f3:06:e3:f6",
            "net5": "e6:03:9f:bd:cb:7b",
            "net6": "02:2a:5b:ac:35:6a",
            "net7": "0e:9d:4b:2c:19:2c",
            "net8": "52:5e:0a:7a:0f:62"
        },
        "leaf_1_0_7": {
            "net0": "ee:51:66:ba:ca:56",
            "net1": "f6:d1:a2:96:ef:42",
            "net2": "06:04:8a:fd:74:a2",
            "net3": "26:cf:d9:af:92:f9",
            "net4": "0a:3b:5d:08:ee:85",
            "net5": "e6:d6:48:3b:22:55",
            "net6": "e2:11:5b:57:51:56",
            "net7": "86:3d:f3:7e:63:8b",
            "net8": "a6:ac:74:7f:2a:97"
        },
        "leaf_1_0_8": {
            "net0": "3e:af:84:f9:30:27",
            "net1": "7a:74:33:d7:c9:2e",
            "net2": "32:47:e8:bc:04:2b",
            "net3": "8a:ef:5a:0d:e0:24",
            "net4": "2a:1c:10:87:45:d6",
            "net5": "da:7b:0d:04:5d:bd",
            "net6": "56:90:7a:03:5e:56",
            "net7": "c2:99:8a:b3:c9:72",
            "net8": "da:49:ff:40:a9:45"
        },
        "leaf_2_0_1": {
            "net0": "fa:12:64:5d:65:58",
            "net1": "ba:3a:54:57:d8:dd",
            "net2": "22:ea:c7:04:72:0f",
            "net3": "56:8c:31:de:f7:4e",
            "net4": "86:7b:8e:e6:e1:b8",
            "net5": "46:9e:0c:52:79:64",
            "net6": "2a:35:92:ef:ac:23",
            "net7": "9e:f9:5b:46:a8:81",
            "net8": "16:d0:d4:63:f1:11"
        },
        "leaf_2_0_2": {
            "net0": "66:0f:d1:01:d8:67",
            "net1": "a6:6b:b8:14:4e:61",
            "net2": "c6:8d:fe:c9:59:34",
            "net3": "2e:ff:be:75:ba:b3",
            "net4": "3e:9b:cf:b7:7a:a9",
            "net5": "0a:20:40:c3:91:04",
            "net6": "9e:8e:cf:5e:3d:27",
            "net7": "66:de:d2:c7:6d:3c",
            "net8": "92:35:ba:ae:a9:2c"
        },
        "leaf_2_0_3": {
            "net0": "92:66:2d:07:1b:ec",
            "net1": "b6:e5:5d:be:11:1c",
            "net2": "ca:07:4d:08:e7:95",
            "net3": "72:50:8c:0c:e8:d1",
            "net4": "6a:1b:92:32:a3:1b",
            "net5": "7a:e9:c9:00:31:06",
            "net6": "3e:c5:64:ab:08:8f",
            "net7": "de:13:7d:e8:39:5b",
            "net8": "4a:2e:63:c8:89:ff"
        },
        "leaf_2_0_4": {
            "net0": "f2:f1:18:da:2b:08",
            "net1": "66:12:50:be:1b:8b",
            "net2": "a6:b7:89:c1:9b:61",
            "net3": "8a:62:28:3b:f7:85",
            "net4": "f2:01:d5:a2:72:db",
            "net5": "c6:7e:76:3d:99:e2",
            "net6": "e2:0b:7e:15:4a:51",
            "net7": "a6:bb:f7:a6:c8:4b",
            "net8": "22:a2:d5:09:ce:ae"
        },
        "leaf_2_0_5": {
            "net0": "6e:70:54:eb:a6:b6",
            "net1": "76:06:b3:7e:dc:a5",
            "net2": "f2:00:09:82:9c:4d",
            "net3": "5e:47:6b:ec:d2:8a",
            "net4": "f6:55:7d:bb:c6:f4",
            "net5": "4a:06:c6:6e:f7:1c",
            "net6": "06:e4:5d:6c:79:97",
            "net7": "06:17:ba:fe:29:18",
            "net8": "6a:de:17:47:b4:4a"
        },
        "leaf_2_0_6": {
            "net0": "fa:f2:d5:b6:04:31",
            "net1": "7a:fd:9f:dd:38:6f",
            "net2": "3a:99:d6:dd:9b:df",
            "net3": "0e:16:1a:2d:59:58",
            "net4": "82:4c:5c:16:30:24",
            "net5": "da:55:20:60:90:8f",
            "net6": "0e:93:32:24:47:22",
            "net7": "da:48:63:e4:24:6f",
            "net8": "e2:ee:02:b0:06:d9"
        },
        "leaf_2_0_7": {
            "net0": "5a:0c:1b:22:1e:9a",
            "net1": "7e:39:e3:59:ef:59",
            "net2": "06:21:da:2e:74:2e",
            "net3": "f2:68:19:ed:77:b5",
            "net4": "56:19:f6:e2:88:88",
            "net5": "f2:23:d4:97:b7:cb",
            "net6": "fe:03:b9:56:99:0c",
            "net7": "aa:b8:8d:4f:9e:9e",
            "net8": "82:c7:e3:9b:d5:e0"
        },
        "leaf_2_0_8": {
            "net0": "ae:21:f5:e1:2e:58",
            "net1": "da:e4:86:60:24:cc",
            "net2": "3e:25:80:23:ed:7a",
            "net3": "be:00:1d:82:4c:04",
            "net4": "22:ff:bc:99:52:21",
            "net5": "96:92:5c:15:89:00",
            "net6": "e6:e8:ef:4a:79:d7",
            "net7": "62:39:66:c3:56:46",
            "net8": "42:ac:b8:0f:26:7d"
        },
        "spine_1_1_1": {
            "net0": "e6:8a:d0:d1:5b:06",
            "net1": "2e:76:41:60:b8:de",
            "net10": "be:84:c8:f9:4e:31",
            "net11": "de:19:84:85:01:84",
            "net12": "16:f8:b2:66:e8:2c",
            "net13": "26:b6:d6:75:3c:3f",
            "net14": "5a:ed:50:ab:69:41",
            "net15": "72:db:3c:3c:d5:9d",
            "net2": "4a:ca:0d:cf:ec:e2",
            "net3": "f2:70:87:47:38:cd",
            "net4": "76:c8:41:f8:bb:f9",
            "net5": "9e:50:87:a1:97:3d",
            "net6": "3e:68:20:47:aa:a6",
            "net7": "02:f6:33:18:7a:30",
            "net8": "42:6d:8e:5c:a2:4b",
            "net9": "6e:76:c2:a5:23:4d"
        },
        "spine_1_1_2": {
            "net0": "76:e7:64:f2:7b:78",
            "net1": "8e:b6:19:cb:16:7d",
            "net10": "fa:fc:36:3e:6b:5d",
            "net11": "72:83:e9:e9:57:ee",
            "net12": "0a:66:0b:bd:d8:de",
            "net13": "16:d5:9e:12:fc:48",
            "net14": "ae:29:73:8b:74:ae",
            "net15": "6a:71:b4:56:22:7d",
            "net2": "96:8f:cb:72:7e:b5",
            "net3": "ca:7e:ae:4f:60:6c",
            "net4": "46:d8:9e:fd:84:7b",
            "net5": "d2:b2:63:da:dd:0e",
            "net6": "92:4a:e5:d6:66:97",
            "net7": "a2:06:83:7d:5d:b4",
            "net8": "7e:78:48:14:75:f0",
            "net9": "e6:f8:f2:67:17:fc"
        },
        "spine_1_1_3": {
            "net0": "be:ae:d7:0f:a9:3c",
            "net1": "3e:44:7a:8f:d4:67",
            "net10": "86:95:f3:a5:c9:01",
            "net11": "a2:80:1e:e7:80:f8",
            "net12": "c2:bc:eb:c1:64:51",
            "net13": "4e:28:d9:b7:9d:fd",
            "net14": "7e:e2:65:c9:75:23",
            "net15": "62:89:99:88:73:42",
            "net2": "be:68:75:83:5c:4f",
            "net3": "9a:ae:48:6a:2c:1c",
            "net4": "5e:ac:e9:0f:4d:e2",
            "net5": "46:c9:2a:70:1e:e8",
            "net6": "ce:de:d4:c0:a9:34",
            "net7": "6a:b5:5c:22:09:1a",
            "net8": "aa:19:db:59:9d:ea",
            "net9": "ea:a5:62:b0:38:9a"
        },
        "spine_1_1_4": {
            "net0": "a2:89:7a:98:4a:17",
            "net1": "12:c7:fe:60:0f:a2",
            "net10": "26:e3:20:fd:3d:0a",
            "net11": "fe:a9:19:8e:9b:15",
            "net12": "5a:b4:be:a1:34:67",
            "net13": "b2:8f:5e:61:19:02",
            "net14": "3e:bd:30:e2:59:ed",
            "net15": "0a:41:c6:76:20:84",
            "net2": "1e:76:4e:a9:16:0b",
            "net3": "2e:2a:42:a3:8b:3b",
            "net4": "d2:63:3d:4a:71:f2",
            "net5": "86:8c:ef:a0:b5:21",
            "net6": "be:be:48:4d:d2:5d",
            "net7": "c2:20:7a:70:ba:b2",
            "net8": "da:be:10:ec:86:b3",
            "net9": "f6:c3:c5:ea:46:38"
        },
        "spine_1_1_5": {
            "net0": "f6:b7:b8:5e:4e:76",
            "net1": "06:60:39:6e:c8:54",
            "net10": "26:49:fc:d1:5b:48",
            "net11": "82:84:f7:c7:7d:eb",
            "net12": "be:21:5f:91:ea:06",
            "net13": "5a:12:12:11:e5:97",
            "net14": "2a:bf:d3:51:ce:85",
            "net15": "e6:82:21:92:e6:f3",
            "net2": "aa:4e:5b:d1:b6:8c",
            "net3": "6a:49:2c:db:f4:30",
            "net4": "be:ae:5b:ce:96:6a",
            "net5": "7e:96:4d:ce:e2:fc",
            "net6": "d6:4f:8c:05:bc:1e",
            "net7": "82:b3:0f:72:7f:07",
            "net8": "1e:2b:2d:61:8f:ab",
            "net9": "86:bf:d8:3b:7e:2c"
        },
        "spine_1_1_6": {
            "net0": "b6:c7:f5:19:4e:b1",
            "net1": "7a:c8:48:c4:bd:89",
            "net10": "7a:f9:c5:b5:e9:0e",
            "net11": "3e:9b:b0:c8:f2:98",
            "net12": "1e:05:0d:36:29:02",
            "net13": "92:16:f4:cf:0c:88",
            "net14": "f6:f9:5d:73:16:45",
            "net15": "ee:b3:c0:c0:36:1f",
            "net2": "6e:ba:ac:6b:0f:b4",
            "net3": "fe:36:3a:60:9b:a1",
            "net4": "76:b8:54:f5:de:7b",
            "net5": "f6:a3:f3:8b:f3:36",
            "net6": "a2:d1:12:77:85:9b",
            "net7": "06:60:fd:6c:9d:87",
            "net8": "9a:95:b2:3f:4c:eb",
            "net9": "0a:03:61:15:3a:86"
        },
        "spine_1_1_7": {
            "net0": "56:da:3c:08:d7:53",
            "net1": "e2:1d:c4:05:41:21",
            "net10": "e2:a5:e1:9f:0c:15",
            "net11": "4a:9d:3d:51:5e:ec",
            "net12": "6e:f6:42:60:3d:85",
            "net13": "de:b9:e0:4c:9c:08",
            "net14": "c6:b9:92:c7:90:1d",
            "net15": "f6:09:81:1a:b6:52",
            "net2": "42:53:0e:91:21:b0",
            "net3": "3e:0b:68:95:07:7e",
            "net4": "e2:46:c2:54:bc:e2",
            "net5": "46:b3:47:68:99:0e",
            "net6": "62:5d:ea:93:51:1f",
            "net7": "0e:16:72:97:d5:46",
            "net8": "b2:ae:43:54:1d:2e",
            "net9": "ca:1f:12:f9:a2:97"
        },
        "spine_1_1_8": {
            "net0": "3e:7e:2b:03:d2:6c",
            "net1": "72:21:61:8a:17:11",
            "net10": "e6:91:be:68:b6:aa",
            "net11": "42:a9:c1:e3:bc:bb",
            "net12": "fa:0b:6d:cf:6c:10",
            "net13": "9e:3a:e7:ad:15:37",
            "net14": "5a:da:c6:3d:a3:0e",
            "net15": "ca:0d:0d:33:b7:48",
            "net2": "82:42:65:90:25:65",
            "net3": "de:13:fa:29:98:b5",
            "net4": "5e:61:e3:58:af:66",
            "net5": "d6:0f:92:3f:6c:90",
            "net6": "6a:e9:fa:be:b8:85",
            "net7": "2e:0e:d8:64:c0:fc",
            "net8": "8a:64:a5:5a:fc:2d",
            "net9": "36:0a:71:e1:34:d7"
        },
        "spine_2_1_1": {
            "net0": "3e:eb:70:0b:54:15",
            "net1": "8e:66:78:b2:45:5d",
            "net10": "1a:54:48:06:25:04",
            "net11": "06:63:ed:eb:14:d6",
            "net12": "fa:35:f4:cf:7c:c1",
            "net13": "f2:34:93:6c:7c:e0",
            "net14": "96:17:2e:52:38:34",
            "net15": "ba:d2:ca:5e:a4:af",
            "net2": "0a:43:98:aa:28:04",
            "net3": "ca:6f:c4:68:e0:86",
            "net4": "9a:93:8d:6f:c4:18",
            "net5": "1e:7d:cc:40:c2:0d",
            "net6": "06:49:83:00:d2:ad",
            "net7": "22:7f:fe:e0:18:5c",
            "net8": "c2:ee:85:61:67:2d",
            "net9": "46:76:dc:19:a5:83"
        },
        "spine_2_1_2": {
            "net0": "de:c2:53:02:8f:ea",
            "net1": "2a:10:02:37:5d:5b",
            "net10": "4a:18:a9:10:41:e1",
            "net11": "72:5b:75:65:e6:9a",
            "net12": "9e:64:f1:d6:90:4b",
            "net13": "1a:2a:09:20:83:2f",
            "net14": "5a:70:93:f8:c2:5a",
            "net15": "be:55:a7:14:a2:83",
            "net2": "9a:6f:68:b5:61:2f",
            "net3": "ce:e3:01:48:ce:23",
            "net4": "a6:95:42:90:f5:d8",
            "net5": "da:2e:c4:2b:9a:35",
            "net6": "1e:6d:1c:f3:8c:2d",
            "net7": "96:8a:27:08:30:dc",
            "net8": "4a:e6:f8:eb:bb:2e",
            "net9": "1a:b6:80:0e:c2:70"
        },
        "spine_2_1_3": {
            "net0": "3e:f0:57:5e:31:60",
            "net1": "72:44:c1:4c:ff:fb",
            "net10": "da:9e:50:52:20:c4",
            "net11": "ea:23:38:dc:a8:96",
            "net12": "ee:34:19:06:fe:4a",
            "net13": "d6:0e:3b:e1:46:aa",
            "net14": "9e:62:7c:59:a0:ae",
            "net15": "4e:8e:a1:21:70:66",
            "net2": "42:fc:66:53:28:0a",
            "net3": "6a:75:25:df:1f:26",
            "net4": "fa:4f:d1:85:f8:1c",
            "net5": "a2:a7:4a:64:e1:17",
            "net6": "a2:cd:de:01:29:a2",
            "net7": "fa:68:6b:87:9b:c5",
            "net8": "3a:5c:54:86:30:23",
            "net9": "76:c9:a0:99:9a:5a"
        },
        "spine_2_1_4": {
            "net0": "ce:d1:1d:d4:7b:50",
            "net1": "3e:7b:4b:21:04:1e",
            "net10": "3a:ab:63:e9:63:f3",
            "net11": "ca:e8:14:49:18:0e",
            "net12": "b6:3a:05:7b:04:84",
            "net13": "02:f2:aa:84:15:70",
            "net14": "e6:7c:f9:85:b7:85",
            "net15": "f6:4b:ed:5b:42:f6",
            "net2": "3a:68:2e:ef:b1:35",
            "net3": "86:7e:18:02:4c:65",
            "net4": "26:c9:48:fe:82:eb",
            "net5": "fe:d0:c8:ab:35:21",
            "net6": "2a:1f:0e:b1:47:35",
            "net7": "26:82:7a:7c:06:98",
            "net8": "8a:c5:20:f1:6d:6e",
            "net9": "c6:eb:8b:7e:4c:5e"
        },
        "spine_2_1_5": {
            "net0": "22:a7:47:73:99:22",
            "net1": "ca:27:da:94:ac:ea",
            "net10": "6a:a7:cf:4a:40:f7",
            "net11": "4a:8d:2b:3d:88:9a",
            "net12": "e2:0c:48:9a:52:2e",
            "net13": "42:5e:83:4a:65:77",
            "net14": "ca:ab:d7:fc:f8:56",
            "net15": "ee:27:9a:0c:79:d8",
            "net2": "96:13:eb:45:c9:0e",
            "net3": "a2:47:65:56:e2:76",
            "net4": "ca:6f:e2:d5:50:0d",
            "net5": "d6:de:78:a5:69:02",
            "net6": "0a:21:e6:9e:97:ca",
            "net7": "fe:c0:7c:b9:26:50",
            "net8": "1a:44:74:e8:72:49",
            "net9": "16:76:5a:96:cc:84"
        },
        "spine_2_1_6": {
            "net0": "42:fb:a8:73:30:3e",
            "net1": "56:4c:0a:0d:20:88",
            "net10": "ae:de:51:8c:7a:9e",
            "net11": "42:7f:f7:c1:26:b9",
            "net12": "9e:b8:65:fd:be:b3",
            "net13": "92:9a:b5:64:2e:c2",
            "net14": "a2:9f:bc:5b:48:db",
            "net15": "3a:cf:5c:1e:cc:e7",
            "net2": "52:1e:59:0f:d3:66",
            "net3": "32:ab:5b:bb:f9:28",
            "net4": "62:4f:3e:f3:f4:2a",
            "net5": "66:d0:ec:af:46:32",
            "net6": "ba:ca:28:b6:15:4e",
            "net7": "7e:77:19:3b:bb:b7",
            "net8": "4e:ce:e6:6d:28:6a",
            "net9": "32:f4:23:32:34:98"
        },
        "spine_2_1_7": {
            "net0": "d6:e9:2b:3c:d5:3c",
            "net1": "6a:1b:7c:91:79:1b",
            "net10": "6a:be:3a:d6:29:d9",
            "net11": "be:bf:5b:48:52:4d",
            "net12": "06:cd:5f:14:62:d0",
            "net13": "fe:30:9f:56:a5:f7",
            "net14": "06:88:cd:b5:bb:f3",
            "net15": "aa:68:53:66:ea:72",
            "net2": "5a:96:84:41:12:e9",
            "net3": "0a:86:33:c4:74:b8",
            "net4": "52:4e:75:8a:b4:e4",
            "net5": "46:c0:0b:ea:99:9a",
            "net6": "76:8b:a0:85:ab:b2",
            "net7": "8a:15:e3:a4:d1:4c",
            "net8": "42:73:12:21:d7:81",
            "net9": "42:1f:b7:ec:4a:a6"
        },
        "spine_2_1_8": {
            "net0": "a2:c9:16:e5:91:fe",
            "net1": "ba:77:d1:a9:1f:b6",
            "net10": "92:a9:b0:17:0d:48",
            "net11": "46:01:38:b8:6a:dc",
            "net12": "3a:28:b2:b6:ae:fa",
            "net13": "a6:5d:29:e5:9b:f2",
            "net14": "32:6f:84:0d:fc:a3",
            "net15": "ba:74:ce:83:59:7f",
            "net2": "c6:0c:03:06:52:fb",
            "net3": "de:3b:42:6a:46:30",
            "net4": "02:f9:d7:dd:67:dd",
            "net5": "d6:ba:72:ef:bc:34",
            "net6": "ba:98:e4:ab:61:37",
            "net7": "16:d7:99:f7:71:92",
            "net8": "92:23:e5:d6:36:c8",
            "net9": "b2:3f:53:c8:bd:ee"
        },
        "tof_1_2_1": {
            "net0": "8e:b0:17:61:1f:8e",
            "net1": "42:07:13:e2:2d:4f",
            "net10": "66:2b:d5:3e:bc:71",
            "net11": "7a:e8:4b:13:c0:35",
            "net12": "de:e9:84:f2:4d:2d",
            "net13": "fa:97:88:e1:b9:05",
            "net14": "2e:6b:5f:5c:a0:d8",
            "net15": "02:1e:c1:5a:aa:8f",
            "net2": "06:e7:77:bd:d2:f0",
            "net3": "0e:3f:cd:88:56:9c",
            "net4": "fe:c3:45:94:61:3f",
            "net5": "9a:c5:e9:89:94:3c",
            "net6": "3e:b1:b7:94:00:d4",
            "net7": "9e:4f:9a:7e:ba:06",
            "net8": "5a:62:b9:b3:00:08",
            "net9": "92:f8:55:be:44:a5"
        },
        "tof_1_2_2": {
            "net0": "86:9c:5f:ab:c2:be",
            "net1": "be:7b:d5:c6:f2:c0",
            "net10": "3e:eb:44:79:01:1a",
            "net11": "9a:31:5b:96:0d:31",
            "net12": "aa:9a:43:7a:6c:41",
            "net13": "ca:40:16:92:50:7b",
            "net14": "f6:93:bd:5a:be:b2",
            "net15": "8e:00:dd:9a:fd:b5",
            "net2": "5a:d0:27:0b:ff:c0",
            "net3": "f2:6c:81:18:9f:02",
            "net4": "b2:b6:c3:55:61:77",
            "net5": "52:91:98:b0:0b:e3",
            "net6": "86:3b:2a:ef:18:00",
            "net7": "66:03:df:fa:ab:ed",
            "net8": "e6:01:37:08:b5:ce",
            "net9": "e2:d9:c9:01:b4:83"
        },
        "tof_1_2_3": {
            "net0": "6e:26:8a:0b:4d:b9",
            "net1": "6e:74:78:82:ff:fb",
            "net10": "3e:34:3f:70:b3:e1",
            "net11": "56:db:ed:fd:9f:d0",
            "net12": "a2:49:e4:c8:c9:f3",
            "net13": "7a:95:a8:03:e6:4d",
            "net14": "76:75:12:43:96:ab",
            "net15": "f6:be:87:01:44:c1",
            "net2": "32:f4:ea:d5:f2:a9",
            "net3": "8e:63:31:d6:43:46",
            "net4": "ca:01:17:a9:21:1d",
            "net5": "6a:bf:f7:b7:af:1a",
            "net6": "22:80:6a:6b:92:45",
            "net7": "ba:82:2e:8a:e7:df",
            "net8": "56:2e:12:15:c0:64",
            "net9": "4e:ec:54:07:fc:45"
        },
        "tof_1_2_4": {
            "net0": "5a:89:36:d2:4d:2a",
            "net1": "2e:a2:12:3c:34:1f",
            "net10": "a6:6d:ba:28:4c:5c",
            "net11": "b6:13:b0:9a:22:2e",
            "net12": "86:f1:5f:2a:21:5b",
            "net13": "3a:f8:47:7d:9f:53",
            "net14": "f6:52:c7:2f:85:2f",
            "net15": "6e:78:ad:9e:78:59",
            "net2": "7a:f0:c7:ba:59:31",
            "net3": "1e:b7:8b:b2:11:8a",
            "net4": "42:b9:0e:7b:e2:15",
            "net5": "1a:c3:fb:70:59:7b",
            "net6": "66:79:da:10:df:1a",
            "net7": "3a:a8:4d:5e:b1:27",
            "net8": "f2:93:a9:5c:bb:fb",
            "net9": "be:57:6c:96:35:06"
        },
        "tof_1_2_5": {
            "net0": "4a:f0:62:69:c0:1b",
            "net1": "62:44:f1:5a:bc:72",
            "net10": "16:f3:6d:96:03:f9",
            "net11": "ce:9a:b9:a2:cd:8a",
            "net12": "56:5e:15:82:b0:6c",
            "net13": "e6:db:ea:09:da:ec",
            "net14": "ae:9b:06:90:84:4b",
            "net15": "06:97:ba:19:34:77",
            "net2": "ae:62:7a:a5:60:1c",
            "net3": "82:6f:87:e1:d5:f2",
            "net4": "2a:a7:e8:6f:90:97",
            "net5": "a6:f3:0a:df:5a:b2",
            "net6": "ea:c2:e2:a1:14:09",
            "net7": "8a:dc:81:fc:b9:f9",
            "net8": "7e:9a:4d:14:9e:4d",
            "net9": "7a:5b:cc:30:44:3c"
        },
        "tof_1_2_6": {
            "net0": "ca:fc:fa:b0:b3:2c",
            "net1": "ea:c4:98:75:e7:c3",
            "net10": "da:1d:67:21:19:43",
            "net11": "6e:84:94:1e:79:f7",
            "net12": "b2:40:e2:68:76:cf",
            "net13": "de:59:a8:d8:ac:23",
            "net14": "02:c1:09:31:4e:1c",
            "net15": "82:01:1b:b1:4e:4e",
            "net2": "d6:d2:d2:ac:15:60",
            "net3": "4a:21:e4:e3:19:3d",
            "net4": "e6:bc:6c:ac:6a:26",
            "net5": "7a:69:53:ab:07:7e",
            "net6": "92:fd:f0:9d:62:c3",
            "net7": "f2:89:32:24:3a:d6",
            "net8": "ca:3c:3b:b1:e7:84",
            "net9": "56:30:40:d8:d1:29"
        },
        "tof_1_2_7": {
            "net0": "5e:51:6e:ed:49:b0",
            "net1": "86:b5:08:c0:35:da",
            "net10": "52:e6:07:fe:fe:d1",
            "net11": "ce:5d:b1:45:14:c3",
            "net12": "f2:e5:53:6b:5e:6b",
            "net13": "fe:7d:cb:52:49:b4",
            "net14": "0a:b1:fb:5d:a4:99",
            "net15": "9e:49:b3:6e:b0:42",
            "net2": "2a:9d:b8:35:da:3c",
            "net3": "0e:0e:01:eb:e0:2d",
            "net4": "06:f0:e8:ea:f8:ae",
            "net5": "c6:d9:5d:80:07:63",
            "net6": "d6:2a:6d:ca:69:31",
            "net7": "2a:98:7f:e9:36:0f",
            "net8": "72:a3:e0:12:b0:e3",
            "net9": "a2:be:fd:f2:7f:fb"
        },
        "tof_1_2_8": {
            "net0": "ca:83:8c:dd:69:56",
            "net1": "62:ea:9b:e2:6b:d8",
            "net10": "5e:8e:a2:25:54:f5",
            "net11": "c2:8a:4f:2e:b9:9a",
            "net12": "12:a3:c6:d6:1a:08",
            "net13": "7a:c8:1c:48:c8:3e",
            "net14": "92:ab:d8:91:96:a7",
            "net15": "de:9f:62:d7:c1:c5",
            "net2": "12:ca:f8:01:fe:49",
            "net3": "9e:f4:99:41:5b:e6",
            "net4": "46:51:60:93:cc:69",
            "net5": "e2:37:51:73:90:48",
            "net6": "7e:25:b0:8a:de:96",
            "net7": "22:6d:3c:46:52:e3",
            "net8": "ee:9c:88:46:33:c5",
            "net9": "72:16:22:ed:84:da"
        }
    },
    "failed_machine": "tof_1_2_1",
    "failure_time": 1616278720.3119528
}