{
    "description": "Scenario 5b: net14 link failure of spine_1_1_1 with BGP",
    "k_leaf": 14,
    "k_top": 14,
    "redundancy_factor": 14,
    "is_k8s": true,
    "machine_mac_addresses": {
        "leaf_1_0_1": {
            "net0": "e6:89:c0:77:5b:94",
            "net1": "76:87:85:9a:56:f2",
            "net10": "da:f5:5f:60:ff:c0",
            "net11": "46:62:4b:d4:2e:d4",
            "net12": "1a:07:86:9c:cf:ae",
            "net13": "ee:50:bc:84:b1:30",
            "net14": "6e:39:31:75:59:76",
            "net2": "0e:04:9f:23:5e:d9",
            "net3": "ba:6d:e4:e3:43:b9",
            "net4": "7e:47:62:27:a0:60",
            "net5": "66:57:4b:34:22:43",
            "net6": "02:ad:78:67:1f:43",
            "net7": "b2:97:07:02:4f:76",
            "net8": "fa:b8:f7:61:41:56",
            "net9": "ca:8f:40:e8:2d:f6"
        },
        "leaf_1_0_10": {
            "net0": "be:f2:12:a3:7d:ca",
            "net1": "ae:e2:e4:2d:63:25",
            "net10": "2a:de:bc:bc:28:9b",
            "net11": "f2:16:5c:e3:9e:b8",
            "net12": "ca:55:3f:0d:83:5c",
            "net13": "7e:f6:b0:a5:8b:af",
            "net14": "f6:dd:b2:2e:8a:bf",
            "net2": "22:77:6a:4c:cf:2e",
            "net3": "5e:a8:58:53:c6:68",
            "net4": "e6:af:a8:f3:57:ec",
            "net5": "a2:0d:13:f9:d2:31",
            "net6": "ea:2c:29:03:e1:45",
            "net7": "f6:9a:52:72:07:07",
            "net8": "4a:40:00:3d:a0:f1",
            "net9": "4a:03:5f:9b:d9:c1"
        },
        "leaf_1_0_11": {
            "net0": "12:2a:e2:38:d8:ec",
            "net1": "e2:8d:5d:27:cd:59",
            "net10": "72:08:a8:58:bb:0f",
            "net11": "6e:24:6b:de:c1:6e",
            "net12": "b2:50:63:cf:df:0c",
            "net13": "e6:d7:64:23:d3:63",
            "net14": "ae:3d:52:cd:a2:16",
            "net2": "72:ec:dc:01:b0:03",
            "net3": "f6:80:30:08:cf:e2",
            "net4": "0a:6c:ff:88:70:c9",
            "net5": "de:3f:77:8c:0c:23",
            "net6": "b2:79:f6:49:9b:ba",
            "net7": "c2:0c:76:f7:af:01",
            "net8": "0e:69:62:1d:fe:d8",
            "net9": "a2:84:b6:e3:52:3f"
        },
        "leaf_1_0_12": {
            "net0": "ba:fd:b7:b5:77:eb",
            "net1": "fe:29:9a:18:35:51",
            "net10": "0e:f5:38:1d:95:1b",
            "net11": "f2:70:d0:4e:3d:79",
            "net12": "26:42:85:bf:ad:39",
            "net13": "ae:db:ba:c7:f0:fb",
            "net14": "7e:7a:21:c6:6c:30",
            "net2": "da:c4:ba:00:8a:09",
            "net3": "ea:b5:6b:d8:9c:d7",
            "net4": "8a:e8:9b:5c:5f:d4",
            "net5": "aa:bb:06:11:80:4c",
            "net6": "ce:cf:0b:a3:59:9e",
            "net7": "32:36:f4:6f:fb:50",
            "net8": "12:1a:13:f0:9b:e8",
            "net9": "e6:b3:e6:37:36:46"
        },
        "leaf_1_0_13": {
            "net0": "46:9d:c6:b1:03:e5",
            "net1": "da:06:ad:ba:66:27",
            "net10": "be:4f:eb:a8:9a:8e",
            "net11": "c6:14:7e:f9:fa:d9",
            "net12": "4e:63:8e:e7:3c:da",
            "net13": "fe:46:ea:83:f8:f7",
            "net14": "32:b6:35:65:89:d6",
            "net2": "12:cb:58:e3:77:68",
            "net3": "b6:71:27:b8:74:b5",
            "net4": "0a:cc:ae:65:2a:c4",
            "net5": "be:f2:af:d6:46:03",
            "net6": "f6:44:d5:6a:9a:f1",
            "net7": "fe:64:5e:6c:f0:23",
            "net8": "f6:3a:cc:a1:d9:7e",
            "net9": "96:22:f3:81:c3:29"
        },
        "leaf_1_0_14": {
            "net0": "c6:cf:13:55:9d:ae",
            "net1": "ca:42:20:2f:a4:0e",
            "net10": "0a:00:f7:ca:58:1b",
            "net11": "d2:e2:c6:52:8e:38",
            "net12": "c6:3f:24:2f:a3:ae",
            "net13": "72:07:54:4e:a3:e2",
            "net14": "72:43:31:16:65:06",
            "net2": "3a:f5:4c:23:86:67",
            "net3": "76:7f:4a:10:d2:42",
            "net4": "2e:99:ba:2a:58:31",
            "net5": "ce:de:0b:3c:49:b2",
            "net6": "ce:3e:a6:cc:1f:ea",
            "net7": "6e:7a:b4:f4:b2:0a",
            "net8": "5a:a1:d1:03:2a:f7",
            "net9": "b6:40:6c:88:64:09"
        },
        "leaf_1_0_2": {
            "net0": "a6:0f:7d:80:aa:85",
            "net1": "aa:66:1f:a9:d2:2c",
            "net10": "36:a6:4f:a4:7c:3a",
            "net11": "7a:29:60:ad:23:13",
            "net12": "9e:8d:84:26:1a:6d",
            "net13": "52:90:aa:45:93:bc",
            "net14": "72:c8:c1:d6:02:e5",
            "net2": "1e:c2:ef:31:5e:55",
            "net3": "76:59:58:33:b5:0b",
            "net4": "9e:ba:a1:96:53:b0",
            "net5": "4a:46:2f:70:da:15",
            "net6": "42:28:3a:e4:8f:7b",
            "net7": "5e:f0:56:74:de:04",
            "net8": "46:19:95:1f:01:54",
            "net9": "d2:c0:0b:ba:92:48"
        },
        "leaf_1_0_3": {
            "net0": "72:83:66:5c:3e:ca",
            "net1": "c6:81:2b:8f:27:7e",
            "net10": "de:47:fb:7c:16:ea",
            "net11": "6e:f0:7f:8e:89:32",
            "net12": "46:62:56:b9:6f:29",
            "net13": "66:3c:83:9c:12:c2",
            "net14": "b6:33:3e:70:36:96",
            "net2": "fa:8c:72:55:5b:e2",
            "net3": "52:bc:20:60:47:9c",
            "net4": "8e:16:09:61:e5:84",
            "net5": "de:3b:49:5f:84:82",
            "net6": "16:e9:1a:6e:b5:14",
            "net7": "ee:d4:5e:fa:bd:f4",
            "net8": "9a:39:90:81:00:78",
            "net9": "ce:cc:12:98:5a:b9"
        },
        "leaf_1_0_4": {
            "net0": "56:03:16:dd:fb:d6",
            "net1": "5e:67:50:cf:f7:f9",
            "net10": "1e:92:a5:bc:52:37",
            "net11": "4a:16:d5:2f:b5:48",
            "net12": "92:4c:6c:de:29:7b",
            "net13": "4e:13:d7:d8:9a:40",
            "net14": "a2:94:6a:ea:99:54",
            "net2": "0a:2f:aa:03:78:e4",
            "net3": "f2:da:74:0a:45:5a",
            "net4": "72:35:f5:02:51:90",
            "net5": "fe:b7:91:71:f6:3e",
            "net6": "ae:b6:40:72:e6:27",
            "net7": "32:e9:32:09:f6:b8",
            "net8": "6a:f2:0b:d3:84:f9",
            "net9": "9e:03:18:3e:12:f7"
        },
        "leaf_1_0_5": {
            "net0": "aa:fe:1a:ef:fe:9e",
            "net1": "12:a9:8d:95:10:5e",
            "net10": "a6:a6:15:0c:df:33",
            "net11": "4e:6d:0c:b5:c2:20",
            "net12": "de:bf:00:7d:91:51",
            "net13": "86:0b:ca:1b:18:fd",
            "net14": "a2:f6:f8:b3:91:31",
            "net2": "ea:f2:d8:3c:b6:2e",
            "net3": "ea:d3:a7:3e:4b:20",
            "net4": "2e:4f:e8:7a:79:a1",
            "net5": "0a:96:31:68:e6:79",
            "net6": "fe:f9:d7:08:93:96",
            "net7": "32:8a:da:d1:78:2a",
            "net8": "12:c5:43:21:99:2e",
            "net9": "ba:14:2d:12:2c:e6"
        },
        "leaf_1_0_6": {
            "net0": "d2:11:ef:3a:33:63",
            "net1": "06:cd:ad:b4:fa:2d",
            "net10": "e2:b6:e7:96:96:28",
            "net11": "0a:26:eb:5d:6a:f1",
            "net12": "c6:9f:bf:0a:a7:d8",
            "net13": "5e:14:37:04:b9:e8",
            "net14": "76:ab:71:26:16:5b",
            "net2": "d2:8d:b0:83:57:16",
            "net3": "96:7f:73:a5:2b:5e",
            "net4": "22:d2:32:6e:60:2f",
            "net5": "82:75:98:e0:b8:73",
            "net6": "4a:50:6a:7a:a9:0e",
            "net7": "e2:83:9a:e8:23:2c",
            "net8": "7e:c9:17:9c:2f:bd",
            "net9": "42:67:15:a9:92:30"
        },
        "leaf_1_0_7": {
            "net0": "c2:bc:bc:51:b6:05",
            "net1": "a6:b2:0e:c8:f7:f1",
            "net10": "ce:65:4d:a0:2c:7a",
            "net11": "42:77:06:37:32:ff",
            "net12": "7a:73:18:c5:1f:80",
            "net13": "6e:94:a2:04:6c:76",
            "net14": "a2:1b:17:87:46:d0",
            "net2": "d2:7e:c7:f7:75:8d",
            "net3": "52:a1:35:97:ac:ec",
            "net4": "c2:b4:21:29:25:b0",
            "net5": "ee:72:d4:f9:8e:03",
            "net6": "a2:94:03:e7:8a:22",
            "net7": "16:97:a5:3e:b6:00",
            "net8": "6a:3e:c7:e4:48:b9",
            "net9": "9e:f3:54:02:7a:9c"
        },
        "leaf_1_0_8": {
            "net0": "b6:e2:fe:57:a5:30",
            "net1": "e6:be:14:8a:d3:ee",
            "net10": "5e:93:81:ad:80:c7",
            "net11": "32:4a:a5:22:0f:03",
            "net12": "ba:d6:38:2f:d6:51",
            "net13": "52:ff:95:e4:4c:be",
            "net14": "6a:03:6b:ac:65:f8",
            "net2": "f2:07:3c:8c:04:de",
            "net3": "2e:7b:43:e8:89:3f",
            "net4": "0e:33:8f:c5:68:09",
            "net5": "46:25:6f:a2:24:f9",
            "net6": "0a:fe:04:5d:48:fc",
            "net7": "ea:c9:c6:a2:c4:50",
            "net8": "a6:38:1b:6b:18:90",
            "net9": "8a:1d:98:94:65:43"
        },
        "leaf_1_0_9": {
            "net0": "82:5e:c3:ec:b6:6a",
            "net1": "32:7f:94:20:b2:65",
            "net10": "16:9f:6f:2f:7f:bc",
            "net11": "b6:8c:66:a2:12:0d",
            "net12": "8e:da:3a:61:5c:0a",
            "net13": "7a:88:70:4d:08:25",
            "net14": "16:74:79:85:99:15",
            "net2": "ca:e1:81:f9:85:7e",
            "net3": "a2:cf:9c:b2:d6:8a",
            "net4": "aa:7e:0d:e4:2d:13",
            "net5": "c2:28:70:40:28:dd",
            "net6": "a6:8f:84:55:72:76",
            "net7": "8a:8c:1a:07:54:9d",
            "net8": "82:09:76:20:26:52",
            "net9": "f2:45:18:77:2b:4b"
        },
        "leaf_2_0_1": {
            "net0": "de:8f:8a:0e:68:57",
            "net1": "52:12:6c:f9:d0:16",
            "net10": "56:5b:6e:a7:e8:88",
            "net11": "86:6d:2c:6f:ea:67",
            "net12": "8a:83:96:29:38:51",
            "net13": "82:4d:03:d1:8f:fd",
            "net14": "8e:9c:f2:cd:00:73",
            "net2": "9e:d9:1f:63:46:69",
            "net3": "3e:35:0e:57:20:ed",
            "net4": "72:fa:3e:18:f0:6d",
            "net5": "6a:92:3a:ed:c4:4d",
            "net6": "c2:82:f0:52:df:c6",
            "net7": "ca:e5:72:85:c7:80",
            "net8": "ca:9b:f7:63:68:25",
            "net9": "36:b0:02:3a:3e:84"
        },
        "leaf_2_0_10": {
            "net0": "32:c5:89:83:de:56",
            "net1": "fa:c9:62:3c:85:36",
            "net10": "da:28:9a:1b:85:56",
            "net11": "52:5d:54:c4:ca:e5",
            "net12": "d6:fa:f8:02:b2:ed",
            "net13": "ea:fb:72:58:ec:97",
            "net14": "02:dc:2c:2e:c3:54",
            "net2": "c2:81:3f:a1:6c:08",
            "net3": "02:8e:e9:22:9e:3e",
            "net4": "ae:59:74:44:c8:b3",
            "net5": "5a:fb:db:44:29:3b",
            "net6": "4a:a1:c7:a4:e6:03",
            "net7": "02:bd:c4:69:fd:10",
            "net8": "ca:79:94:74:98:6f",
            "net9": "8e:8a:ae:8f:cb:db"
        },
        "leaf_2_0_11": {
            "net0": "de:87:52:00:be:86",
            "net1": "22:4b:a1:1a:a8:62",
            "net10": "3a:66:cb:80:e5:90",
            "net11": "86:9d:8e:96:12:85",
            "net12": "9a:65:83:ff:47:88",
            "net13": "66:77:88:17:fc:a1",
            "net14": "0a:5f:75:02:3f:d2",
            "net2": "36:0c:56:f1:a7:cb",
            "net3": "f6:80:7a:06:0e:a9",
            "net4": "66:77:d0:bf:62:df",
            "net5": "9e:97:da:d1:a6:d4",
            "net6": "22:1b:c1:10:22:27",
            "net7": "6e:00:b4:14:6c:82",
            "net8": "3e:58:c5:97:57:f4",
            "net9": "16:15:45:5f:79:08"
        },
        "leaf_2_0_12": {
            "net0": "92:56:cd:d1:9e:d5",
            "net1": "f2:af:b9:ff:2d:13",
            "net10": "d6:b9:8d:15:93:5f",
            "net11": "26:8c:9a:2b:df:7c",
            "net12": "c6:d8:41:f3:0c:4e",
            "net13": "66:0b:4c:49:9f:8e",
            "net14": "82:30:86:de:03:66",
            "net2": "ea:fe:71:22:54:ba",
            "net3": "d6:a4:92:50:c6:96",
            "net4": "ba:3a:cb:35:26:e5",
            "net5": "fa:4e:b2:e9:23:ac",
            "net6": "9a:12:08:cc:ac:0f",
            "net7": "3a:a1:e9:3b:32:52",
            "net8": "aa:5c:87:cb:16:59",
            "net9": "96:94:4f:76:4d:19"
        },
        "leaf_2_0_13": {
            "net0": "f6:45:62:ab:a7:31",
            "net1": "d6:43:7e:0d:28:12",
            "net10": "ea:1f:66:d8:d0:6f",
            "net11": "ae:fc:2b:fa:63:aa",
            "net12": "da:1f:7f:81:c1:65",
            "net13": "42:b9:72:ac:f8:33",
            "net14": "9e:96:3d:77:85:69",
            "net2": "1a:a2:e9:bb:4d:25",
            "net3": "16:4b:06:58:cb:d6",
            "net4": "d6:7a:31:6f:d0:2f",
            "net5": "0e:bb:4e:d0:70:e1",
            "net6": "f2:c3:5f:a8:e2:8c",
            "net7": "5a:69:ba:e4:55:f5",
            "net8": "2e:ae:fa:4a:7d:01",
            "net9": "0a:8d:7c:16:08:dc"
        },
        "leaf_2_0_14": {
            "net0": "aa:8f:3b:ba:7f:ef",
            "net1": "96:d0:83:0a:6d:6b",
            "net10": "1a:61:c3:16:92:2a",
            "net11": "ce:d5:cd:50:7d:cd",
            "net12": "d6:15:da:a4:10:a6",
            "net13": "6e:92:2a:19:3a:00",
            "net14": "fe:26:ae:75:0d:00",
            "net2": "72:7f:9f:0c:bc:69",
            "net3": "66:ab:b3:10:be:a9",
            "net4": "66:84:a6:8b:4b:e6",
            "net5": "7e:0b:52:04:2d:cf",
            "net6": "9a:b5:10:b0:f8:f8",
            "net7": "be:1e:21:2a:54:d4",
            "net8": "a6:8a:da:22:d7:c8",
            "net9": "86:e5:2e:17:ba:f3"
        },
        "leaf_2_0_2": {
            "net0": "92:4c:e6:af:be:56",
            "net1": "5a:42:a0:08:11:e9",
            "net10": "c6:b6:f3:52:55:c1",
            "net11": "c6:bc:67:e3:93:10",
            "net12": "f6:4d:cd:79:db:13",
            "net13": "a6:6c:ab:9b:b6:4f",
            "net14": "62:66:2b:8f:e1:2a",
            "net2": "9e:d2:4d:62:f4:7b",
            "net3": "ca:ab:81:b5:d8:d0",
            "net4": "56:f0:08:20:2c:7e",
            "net5": "8a:fa:31:d2:26:9f",
            "net6": "1e:20:0e:5a:c7:af",
            "net7": "2a:ab:18:a4:36:d7",
            "net8": "5a:ef:f3:9d:2b:51",
            "net9": "1a:0d:0f:27:f6:c9"
        },
        "leaf_2_0_3": {
            "net0": "e6:a0:b8:18:27:b7",
            "net1": "5a:31:02:0e:0e:c1",
            "net10": "46:0e:6b:5d:ce:cd",
            "net11": "62:6d:50:d3:0f:b5",
            "net12": "52:5d:7c:d8:4a:04",
            "net13": "86:fb:61:3b:a9:eb",
            "net14": "32:ca:29:9e:09:e6",
            "net2": "06:ee:78:56:f9:89",
            "net3": "4e:e4:ed:fd:1b:b6",
            "net4": "92:fb:d9:b3:65:cc",
            "net5": "e2:f0:e6:aa:58:e5",
            "net6": "32:e3:52:84:fc:71",
            "net7": "06:1e:d4:c7:5e:a8",
            "net8": "9e:35:a5:87:5e:47",
            "net9": "62:ef:5d:89:43:d0"
        },
        "leaf_2_0_4": {
            "net0": "06:91:e4:53:ee:96",
            "net1": "1a:31:e9:31:4f:a6",
            "net10": "56:ef:74:39:88:1f",
            "net11": "16:32:55:24:c8:6c",
            "net12": "6e:3e:3d:7f:ef:6e",
            "net13": "4e:eb:a8:9a:55:15",
            "net14": "e2:fd:96:7f:b0:36",
            "net2": "da:40:0b:43:3c:76",
            "net3": "de:2f:61:57:61:62",
            "net4": "6e:3d:0b:12:17:8c",
            "net5": "ea:73:b7:97:25:ae",
            "net6": "2a:69:e8:51:42:66",
            "net7": "46:cc:46:6a:51:ec",
            "net8": "f6:84:1b:8f:08:2c",
            "net9": "5a:bd:30:2e:d2:74"
        },
        "leaf_2_0_5": {
            "net0": "52:1d:91:8e:da:35",
            "net1": "26:7d:0f:db:27:b7",
            "net10": "7a:94:89:7c:d1:ad",
            "net11": "2a:e8:7b:3e:ae:ed",
            "net12": "fe:43:d6:ba:e3:70",
            "net13": "5a:98:14:cd:fc:70",
            "net14": "0a:09:7d:64:af:64",
            "net2": "ba:b0:65:e6:d2:e0",
            "net3": "26:3f:be:af:31:c0",
            "net4": "be:16:e8:b7:c4:c0",
            "net5": "1e:b1:6a:10:10:d9",
            "net6": "c6:16:fb:6c:cd:71",
            "net7": "42:54:5a:5e:db:42",
            "net8": "a6:1b:fb:fb:7a:3f",
            "net9": "5a:05:a5:6d:e6:84"
        },
        "leaf_2_0_6": {
            "net0": "22:73:6c:15:99:b3",
            "net1": "96:3e:d5:2c:f8:c4",
            "net10": "76:b5:fc:00:26:39",
            "net11": "42:ba:c7:5e:33:e2",
            "net12": "ba:25:3b:8f:a9:18",
            "net13": "ce:ae:ee:25:fd:ee",
            "net14": "a2:ca:8f:d3:1c:89",
            "net2": "52:df:0f:0e:22:c6",
            "net3": "ae:03:be:a4:2e:30",
            "net4": "c2:c2:15:47:b1:3d",
            "net5": "32:c6:20:bb:83:8c",
            "net6": "76:48:f7:25:d3:26",
            "net7": "3a:fd:2b:66:ca:42",
            "net8": "e2:57:74:87:94:ca",
            "net9": "8a:51:0c:68:6e:49"
        },
        "leaf_2_0_7": {
            "net0": "f2:9b:ab:a8:dd:19",
            "net1": "9a:8d:ec:9b:d3:00",
            "net10": "a6:c5:eb:38:c3:e2",
            "net11": "12:39:59:c3:c4:ae",
            "net12": "12:0d:01:d1:45:46",
            "net13": "1e:72:89:f5:8d:df",
            "net14": "4e:fd:5e:57:85:f9",
            "net2": "da:45:aa:8a:d3:2e",
            "net3": "b6:23:c0:4e:9a:4e",
            "net4": "2a:af:c9:20:73:7d",
            "net5": "1a:c1:bf:86:25:bc",
            "net6": "e6:a0:b6:31:2a:61",
            "net7": "3e:56:4d:c4:b1:64",
            "net8": "96:69:3d:fe:2e:92",
            "net9": "be:e7:b5:b4:60:e7"
        },
        "leaf_2_0_8": {
            "net0": "06:ac:d2:d3:2b:3a",
            "net1": "ba:7b:92:92:ab:26",
            "net10": "9e:5e:8d:38:23:c1",
            "net11": "9e:7f:bb:0c:aa:db",
            "net12": "66:e4:5d:2f:09:f6",
            "net13": "56:97:a2:0f:14:81",
            "net14": "1a:a6:65:20:b8:36",
            "net2": "f6:e0:07:b2:86:0e",
            "net3": "ba:1e:88:cc:af:0f",
            "net4": "62:07:36:f8:3e:41",
            "net5": "26:bb:ef:04:74:2a",
            "net6": "82:f1:48:4c:bb:5d",
            "net7": "26:fe:57:49:fd:4c",
            "net8": "36:a1:e4:68:1a:4a",
            "net9": "9a:7d:c4:de:92:27"
        },
        "leaf_2_0_9": {
            "net0": "7e:c0:7e:e8:90:a9",
            "net1": "0a:b4:cc:28:d5:7d",
            "net10": "e6:f4:e2:75:b2:b8",
            "net11": "66:f4:6d:aa:64:c6",
            "net12": "0a:86:b4:a3:55:22",
            "net13": "96:49:d0:ba:f5:b7",
            "net14": "e6:78:ee:a2:ac:86",
            "net2": "e2:de:52:ef:c9:f2",
            "net3": "8a:6a:0a:47:cd:50",
            "net4": "fe:81:f6:92:30:8f",
            "net5": "f6:48:79:d9:47:a5",
            "net6": "46:11:07:04:41:cc",
            "net7": "fa:df:46:c9:47:01",
            "net8": "c6:7c:1f:30:3c:4e",
            "net9": "ea:7b:38:3d:4f:e8"
        },
        "spine_1_1_1": {
            "net0": "a2:54:8a:89:e7:4f",
            "net1": "9a:7e:e4:e5:a2:67",
            "net10": "a2:81:44:37:a5:01",
            "net11": "de:1d:06:83:46:8e",
            "net12": "22:2c:4e:1d:e1:6f",
            "net13": "a6:f3:71:4d:ef:64",
            "net14": "ae:43:3b:7e:c5:c9",
            "net15": "a2:b6:88:3a:00:74",
            "net16": "ba:23:c0:ad:1f:a0",
            "net17": "6e:7f:bd:22:85:68",
            "net18": "92:76:59:37:8c:b7",
            "net19": "aa:03:30:07:36:ef",
            "net2": "4a:84:d6:d6:de:e5",
            "net20": "5a:33:d1:32:9d:1e",
            "net21": "7a:4d:99:84:90:13",
            "net22": "9e:93:3a:14:4f:4f",
            "net23": "a6:30:56:a3:ec:d1",
            "net24": "76:78:aa:b6:97:71",
            "net25": "c6:1d:5a:69:cb:63",
            "net26": "6a:8a:7e:98:ca:68",
            "net27": "aa:5f:40:96:ca:13",
            "net3": "46:72:9f:71:9c:b0",
            "net4": "8a:b1:3d:34:92:2f",
            "net5": "42:35:43:f0:c1:34",
            "net6": "16:1c:7f:58:4d:58",
            "net7": "96:3d:c1:f2:91:12",
            "net8": "1a:d7:b0:1a:53:12",
            "net9": "0a:ea:c9:d2:fd:49"
        },
        "spine_1_1_10": {
            "net0": "3e:f4:7e:7b:92:46",
            "net1": "16:4a:e4:71:91:a7",
            "net10": "96:9e:65:99:c8:88",
            "net11": "3e:66:1c:d4:fb:ae",
            "net12": "be:78:6c:d6:e3:42",
            "net13": "3a:69:14:0a:7d:63",
            "net14": "0e:b9:6d:54:3b:b4",
            "net15": "e2:c5:39:c5:3c:b8",
            "net16": "5e:f1:15:54:f8:88",
            "net17": "46:4e:5e:9d:b7:43",
            "net18": "6a:d7:a0:50:da:28",
            "net19": "7e:9e:67:2f:6d:9f",
            "net2": "ba:30:8a:09:be:62",
            "net20": "56:92:29:60:04:9e",
            "net21": "e2:09:c7:95:b5:03",
            "net22": "0e:2c:50:b9:81:98",
            "net23": "be:a7:09:54:1f:09",
            "net24": "da:8b:5e:b7:83:87",
            "net25": "fe:ca:bf:67:4d:0b",
            "net26": "ee:73:da:90:33:94",
            "net27": "76:55:fc:a6:db:d6",
            "net3": "52:9a:86:0f:3a:83",
            "net4": "0e:68:ce:ba:27:1f",
            "net5": "2e:8b:1d:b6:89:aa",
            "net6": "2e:91:ed:8c:8c:e9",
            "net7": "7a:ff:18:e0:41:93",
            "net8": "0e:a9:73:e0:7e:97",
            "net9": "0a:24:0b:a5:f7:ba"
        },
        "spine_1_1_11": {
            "net0": "82:b7:e9:40:9e:79",
            "net1": "5e:1f:79:2b:d2:fe",
            "net10": "32:d0:99:d7:52:7a",
            "net11": "22:a3:c6:48:b1:eb",
            "net12": "e2:3d:e9:ee:ab:8c",
            "net13": "62:30:6f:b1:69:1e",
            "net14": "46:18:61:ef:5a:7e",
            "net15": "8e:11:44:e9:07:01",
            "net16": "aa:40:bb:77:77:0d",
            "net17": "9a:41:ce:3b:71:e4",
            "net18": "8e:2c:b4:5e:47:40",
            "net19": "26:b0:bb:de:d6:31",
            "net2": "12:c8:e3:e7:83:5c",
            "net20": "02:8e:ad:a4:3e:74",
            "net21": "ca:11:e5:f1:e0:9b",
            "net22": "1a:f5:1d:54:e7:63",
            "net23": "72:13:1c:67:4b:25",
            "net24": "a2:b4:ef:89:b3:2c",
            "net25": "26:c9:8a:d0:6c:97",
            "net26": "ce:77:74:d4:53:b0",
            "net27": "6a:b6:11:05:1e:32",
            "net3": "ee:81:41:ee:63:36",
            "net4": "3a:23:23:f9:6f:a9",
            "net5": "72:2c:3c:0c:02:18",
            "net6": "ea:02:f8:c3:bb:7f",
            "net7": "06:6d:0b:1b:ce:05",
            "net8": "42:5e:23:6e:4b:ea",
            "net9": "36:f6:dd:28:b2:bf"
        },
        "spine_1_1_12": {
            "net0": "22:6e:80:21:83:59",
            "net1": "fe:9a:ae:ef:96:2e",
            "net10": "56:36:93:44:25:80",
            "net11": "a2:73:00:44:4c:af",
            "net12": "e6:b5:84:11:cf:1b",
            "net13": "be:5d:b8:dd:da:c2",
            "net14": "be:44:fc:4b:c5:b7",
            "net15": "a6:4a:54:ea:2b:f4",
            "net16": "0a:93:93:4b:d0:66",
            "net17": "2a:d7:8f:f6:e3:02",
            "net18": "d2:02:8d:f9:74:10",
            "net19": "da:10:0a:76:d3:13",
            "net2": "8a:4e:9f:88:37:fa",
            "net20": "36:9d:3b:7b:ec:86",
            "net21": "ba:31:72:04:08:c8",
            "net22": "aa:32:ee:23:d1:48",
            "net23": "56:e9:e7:75:f0:ec",
            "net24": "c2:0b:fc:95:12:bb",
            "net25": "e6:47:4a:d5:aa:7b",
            "net26": "62:34:13:14:36:44",
            "net27": "3a:42:f6:4d:94:5b",
            "net3": "12:f1:9d:3b:36:b0",
            "net4": "4a:f1:78:a9:70:05",
            "net5": "92:59:a3:b3:ac:32",
            "net6": "36:ac:eb:f1:4e:da",
            "net7": "56:ad:b7:26:e7:1c",
            "net8": "0a:49:2c:01:bf:02",
            "net9": "ee:bc:40:0a:d2:00"
        },
        "spine_1_1_13": {
            "net0": "02:40:98:51:88:00",
            "net1": "0e:f4:7c:7f:75:fd",
            "net10": "0a:dc:88:df:67:84",
            "net11": "76:75:41:39:59:1d",
            "net12": "82:e3:25:33:2d:9a",
            "net13": "9e:13:87:4e:11:c6",
            "net14": "de:21:b1:54:9a:07",
            "net15": "ae:73:b9:9e:66:56",
            "net16": "ca:f4:bd:9d:54:af",
            "net17": "3a:a7:a7:9b:dd:a1",
            "net18": "4a:2f:1f:23:cd:73",
            "net19": "a2:06:e0:a5:30:3e",
            "net2": "e6:14:07:62:36:82",
            "net20": "36:bc:7e:0f:32:6e",
            "net21": "6a:b5:d6:de:57:97",
            "net22": "0e:08:34:92:42:a7",
            "net23": "0a:07:25:a0:8b:59",
            "net24": "4e:2e:10:6a:33:78",
            "net25": "4a:bb:b7:3a:28:f2",
            "net26": "da:c4:bd:a3:e2:17",
            "net27": "e2:70:98:f2:ed:97",
            "net3": "a2:b4:16:be:ac:59",
            "net4": "fa:80:a1:35:ce:c7",
            "net5": "ca:00:e7:b0:06:85",
            "net6": "b6:49:fa:b9:06:5b",
            "net7": "86:da:bf:88:90:5f",
            "net8": "d2:e0:56:c9:7f:81",
            "net9": "ba:b6:58:f2:d5:08"
        },
        "spine_1_1_14": {
            "net0": "c2:d9:fe:71:93:e6",
            "net1": "9e:12:6e:ac:83:93",
            "net10": "52:0b:73:66:37:e2",
            "net11": "9e:79:29:e3:8f:b7",
            "net12": "7a:db:e7:71:8a:61",
            "net13": "8a:5a:86:3c:9d:8d",
            "net14": "2a:a5:79:21:dd:c8",
            "net15": "1e:04:95:3c:33:dc",
            "net16": "a6:2b:fb:05:1f:5d",
            "net17": "f2:17:84:84:0a:14",
            "net18": "f6:76:a2:ff:f0:0b",
            "net19": "8e:cb:fa:42:3c:9c",
            "net2": "ca:cb:50:52:66:cc",
            "net20": "3a:25:11:a7:e9:f1",
            "net21": "b6:e9:87:28:68:93",
            "net22": "9e:85:fa:3a:0a:05",
            "net23": "5e:98:ec:2e:e8:21",
            "net24": "46:f1:d4:42:8c:db",
            "net25": "62:25:18:4f:6f:fe",
            "net26": "62:11:40:ae:52:a9",
            "net27": "8a:32:37:ae:ee:64",
            "net3": "ae:0f:23:27:35:08",
            "net4": "e2:b5:74:78:66:db",
            "net5": "26:61:a2:02:72:e5",
            "net6": "be:f0:7f:97:09:18",
            "net7": "06:0d:b3:35:99:14",
            "net8": "a2:0d:5c:44:a5:6f",
            "net9": "4a:bf:4c:ab:60:10"
        },
        "spine_1_1_2": {
            "net0": "a6:b6:43:af:5b:b5",
            "net1": "ee:43:90:45:3f:27",
            "net10": "52:b7:51:d1:e5:65",
            "net11": "ee:0d:86:f5:65:73",
            "net12": "6e:e8:d6:56:55:f5",
            "net13": "16:03:d3:f8:31:94",
            "net14": "4a:d3:68:87:9e:ba",
            "net15": "5a:b4:b6:fe:26:04",
            "net16": "92:ea:ae:dd:f3:f5",
            "net17": "c6:5a:e4:78:70:25",
            "net18": "d2:6c:62:cd:1f:53",
            "net19": "1e:62:3d:17:95:22",
            "net2": "36:28:43:4c:73:e2",
            "net20": "ce:45:83:88:bd:55",
            "net21": "ae:12:28:aa:a9:5e",
            "net22": "52:66:72:6e:4e:7b",
            "net23": "5e:79:d9:61:c8:1e",
            "net24": "6e:02:a3:a5:b5:5d",
            "net25": "ae:52:b8:8c:59:af",
            "net26": "52:c8:fa:a6:80:54",
            "net27": "1e:e4:e3:c4:a8:5a",
            "net3": "1a:86:8e:db:33:0b",
            "net4": "9a:f3:1d:53:93:3d",
            "net5": "5e:4d:18:d7:38:47",
            "net6": "12:b5:32:a7:de:10",
            "net7": "86:55:84:04:fc:3b",
            "net8": "f6:b2:1e:6b:14:48",
            "net9": "56:af:b7:74:0d:8f"
        },
        "spine_1_1_3": {
            "net0": "be:c9:e4:62:81:8b",
            "net1": "fe:f2:44:11:90:a3",
            "net10": "42:75:22:ab:14:1e",
            "net11": "26:e7:b9:1b:f5:54",
            "net12": "8a:a7:01:13:76:a6",
            "net13": "82:b4:a1:12:e6:a2",
            "net14": "de:2f:76:99:f0:9d",
            "net15": "0e:ed:ae:ed:96:7a",
            "net16": "7e:68:43:1b:ef:b9",
            "net17": "e6:93:5a:89:31:e6",
            "net18": "ce:4b:22:39:d1:13",
            "net19": "6a:bd:41:d4:f3:97",
            "net2": "1a:1c:8b:0b:40:ad",
            "net20": "52:81:22:3e:49:55",
            "net21": "5e:7f:78:cc:aa:f2",
            "net22": "52:f6:81:d9:33:a9",
            "net23": "a2:0c:a7:a0:0c:b9",
            "net24": "2a:75:33:2f:7a:b8",
            "net25": "ca:18:5c:9a:0b:2a",
            "net26": "5a:ac:1d:c3:89:21",
            "net27": "86:bd:2c:d9:79:34",
            "net3": "56:92:68:f5:21:65",
            "net4": "8a:77:f3:cc:18:a3",
            "net5": "b2:a1:8b:0a:e1:a1",
            "net6": "b2:b0:18:8b:ba:18",
            "net7": "b6:59:6b:f5:d4:9e",
            "net8": "de:57:1b:4c:e5:ba",
            "net9": "76:47:81:1b:7a:32"
        },
        "spine_1_1_4": {
            "net0": "7e:9e:09:57:15:2c",
            "net1": "52:b8:29:e0:22:4b",
            "net10": "52:ac:d6:9f:31:38",
            "net11": "9e:3d:7f:47:87:33",
            "net12": "7a:8d:e3:70:5d:41",
            "net13": "a6:d3:af:f3:2c:5f",
            "net14": "a2:db:99:e3:be:4b",
            "net15": "a6:72:fe:e2:20:7d",
            "net16": "5e:6d:c4:25:00:98",
            "net17": "ce:10:ac:7d:34:e8",
            "net18": "86:63:04:60:a8:91",
            "net19": "92:51:71:35:e2:42",
            "net2": "56:62:cf:14:4e:fb",
            "net20": "0e:9c:a7:83:38:eb",
            "net21": "56:5f:a1:3f:e9:7e",
            "net22": "aa:9f:78:5e:71:f8",
            "net23": "4e:fa:fe:54:0b:e8",
            "net24": "e2:c4:a1:31:c3:6c",
            "net25": "4e:18:06:1a:c3:57",
            "net26": "b2:d1:96:c3:1f:79",
            "net27": "1e:c3:b4:31:5c:9e",
            "net3": "ae:ba:49:93:f5:37",
            "net4": "ca:0c:dd:ea:59:1a",
            "net5": "06:38:a3:4e:8d:f6",
            "net6": "f6:3e:bb:8e:98:e6",
            "net7": "02:c4:05:46:06:d3",
            "net8": "e2:4c:80:04:1a:9c",
            "net9": "ba:04:78:1d:47:46"
        },
        "spine_1_1_5": {
            "net0": "92:bd:df:12:75:0e",
            "net1": "9a:d0:41:9b:40:98",
            "net10": "72:e4:e3:bd:01:4a",
            "net11": "f2:88:65:4b:60:b9",
            "net12": "fa:6b:17:75:8e:dc",
            "net13": "9a:fb:c6:2a:4e:0f",
            "net14": "46:19:69:27:be:a8",
            "net15": "b2:da:9b:81:3f:ef",
            "net16": "ea:a1:5e:46:29:f3",
            "net17": "56:7b:2c:39:f9:ef",
            "net18": "a2:fb:1d:fd:40:4c",
            "net19": "06:5d:1a:d5:dc:f2",
            "net2": "b2:f7:92:24:31:9d",
            "net20": "ea:da:c2:e3:ca:a0",
            "net21": "0e:13:38:7f:20:98",
            "net22": "9e:76:59:0f:ba:0d",
            "net23": "e6:9a:dc:fb:cf:37",
            "net24": "52:1d:ec:37:65:44",
            "net25": "42:fb:3b:41:4a:60",
            "net26": "ba:8c:84:8d:3f:77",
            "net27": "ae:88:c9:b3:96:6c",
            "net3": "da:4a:2d:9b:ee:63",
            "net4": "32:3b:3e:10:7e:26",
            "net5": "1a:09:58:43:27:85",
            "net6": "b6:79:29:99:f0:ef",
            "net7": "72:82:91:9f:27:b0",
            "net8": "76:ad:26:3d:35:a5",
            "net9": "76:1e:b2:87:c2:30"
        },
        "spine_1_1_6": {
            "net0": "fe:73:9a:60:71:ee",
            "net1": "6e:06:56:09:e1:d8",
            "net10": "1e:db:4f:7c:3d:69",
            "net11": "96:50:01:2f:6d:79",
            "net12": "4a:8e:29:d9:2a:88",
            "net13": "fa:61:7a:fa:9e:f4",
            "net14": "b2:63:61:c7:4a:2c",
            "net15": "e6:9a:c5:6f:ec:04",
            "net16": "7e:21:1f:69:22:9c",
            "net17": "82:3f:15:60:f9:35",
            "net18": "d6:88:33:ab:22:3e",
            "net19": "26:cf:a3:36:22:f9",
            "net2": "d6:f1:b2:ca:81:5d",
            "net20": "c2:55:36:ff:d3:58",
            "net21": "c6:73:b9:9c:a8:e5",
            "net22": "ce:3f:a8:0c:db:ce",
            "net23": "92:e3:a4:a0:68:d9",
            "net24": "56:9c:5f:c8:2c:4c",
            "net25": "8a:8a:18:8f:30:f5",
            "net26": "3e:f1:4f:c5:bc:d2",
            "net27": "32:a6:64:02:c5:51",
            "net3": "62:0b:56:58:2a:23",
            "net4": "ee:2a:30:8f:e6:3e",
            "net5": "42:b3:da:9a:5f:f9",
            "net6": "16:43:d8:5c:9a:ad",
            "net7": "a6:7f:0f:6c:39:1a",
            "net8": "a6:e8:f7:2f:c1:2d",
            "net9": "6e:0e:74:d8:08:63"
        },
        "spine_1_1_7": {
            "net0": "ba:1b:74:de:1a:85",
            "net1": "9e:a3:7e:22:38:a9",
            "net10": "06:52:d5:c5:26:d9",
            "net11": "ce:a6:b6:31:40:65",
            "net12": "62:34:f4:7a:ac:8b",
            "net13": "6a:45:94:5b:63:0c",
            "net14": "96:de:28:67:24:f3",
            "net15": "4a:dd:7a:eb:f2:5c",
            "net16": "de:8d:c6:1f:26:9b",
            "net17": "da:26:19:71:1d:d5",
            "net18": "de:16:aa:a6:0d:27",
            "net19": "e2:87:33:3f:7a:f1",
            "net2": "36:da:94:eb:3e:88",
            "net20": "36:8e:9c:d6:3e:46",
            "net21": "a2:45:01:85:b9:2b",
            "net22": "76:f3:af:b1:5d:a9",
            "net23": "2e:01:57:f3:8c:10",
            "net24": "66:37:7f:b1:bf:26",
            "net25": "ba:38:9d:79:9e:12",
            "net26": "fa:9e:ad:9e:61:af",
            "net27": "7a:bd:da:b6:55:fa",
            "net3": "ae:ac:13:91:46:f0",
            "net4": "1a:e7:79:2f:f6:f3",
            "net5": "2a:79:1a:39:89:50",
            "net6": "ce:10:15:f6:4a:33",
            "net7": "fa:d7:8d:c4:b0:a9",
            "net8": "3e:c0:5e:89:02:cd",
            "net9": "82:0d:93:02:26:92"
        },
        "spine_1_1_8": {
            "net0": "ea:e1:84:74:62:ce",
            "net1": "d2:33:ce:ec:79:ce",
            "net10": "56:4c:b6:32:a0:aa",
            "net11": "36:9f:53:b1:a3:c2",
            "net12": "3a:ad:b9:74:43:cb",
            "net13": "b2:29:d2:9e:3e:cc",
            "net14": "a6:cc:d4:e4:dd:80",
            "net15": "16:2e:6e:d5:88:e5",
            "net16": "6a:54:ca:d8:21:ab",
            "net17": "06:27:22:9e:d2:91",
            "net18": "6e:a1:ed:c5:5d:5f",
            "net19": "4a:00:eb:b8:49:88",
            "net2": "d6:ea:54:ac:a8:56",
            "net20": "36:83:4d:8d:28:e1",
            "net21": "76:3a:07:cd:72:1b",
            "net22": "a2:ba:56:e5:d0:ea",
            "net23": "d6:d1:5d:c5:ae:ec",
            "net24": "ce:b8:1f:4b:dc:3a",
            "net25": "5a:97:9e:30:ea:b6",
            "net26": "ca:4e:8d:31:3c:99",
            "net27": "16:d5:1a:6d:6d:97",
            "net3": "0e:7f:0c:9f:82:55",
            "net4": "3e:84:3d:e4:8f:f8",
            "net5": "6e:f0:73:46:dc:4b",
            "net6": "c6:cb:1e:39:87:2b",
            "net7": "82:3d:f6:7a:56:14",
            "net8": "9e:46:93:fa:d1:3b",
            "net9": "7e:0e:a4:72:f1:59"
        },
        "spine_1_1_9": {
            "net0": "52:85:5a:2a:73:8c",
            "net1": "06:1b:9d:0a:d3:b7",
            "net10": "92:24:17:9d:0e:4b",
            "net11": "b6:ce:41:64:50:ef",
            "net12": "ea:98:15:96:de:d6",
            "net13": "a6:f6:c2:77:60:92",
            "net14": "56:23:69:e3:f9:4c",
            "net15": "42:12:01:24:ed:d3",
            "net16": "06:24:33:8e:65:b4",
            "net17": "a6:7b:34:ac:32:e3",
            "net18": "a2:f0:54:dd:08:50",
            "net19": "96:54:09:2f:0e:4b",
            "net2": "72:60:fd:92:2a:ce",
            "net20": "da:a3:1d:4f:42:09",
            "net21": "0e:14:eb:37:ec:a5",
            "net22": "9e:ab:08:e3:0f:69",
            "net23": "fe:5f:e6:d8:6e:dc",
            "net24": "5e:c3:02:ed:9c:5b",
            "net25": "1a:a1:e1:f1:19:5a",
            "net26": "6e:8f:e4:b8:4a:0b",
            "net27": "16:5a:01:14:b3:a3",
            "net3": "22:19:a7:b5:ea:df",
            "net4": "b6:87:0e:d7:33:9f",
            "net5": "3e:31:87:cf:a4:a9",
            "net6": "be:11:94:88:d7:27",
            "net7": "de:6f:35:59:16:95",
            "net8": "82:93:c5:f3:25:96",
            "net9": "06:83:eb:89:93:90"
        },
        "spine_2_1_1": {
            "net0": "7e:45:2e:80:0e:ed",
            "net1": "32:23:ca:a5:63:d2",
            "net10": "a2:ee:fb:12:95:e6",
            "net11": "46:f0:4a:1e:76:4b",
            "net12": "de:4c:0d:59:ab:23",
            "net13": "22:b3:bc:39:20:90",
            "net14": "a2:72:cd:bb:38:c0",
            "net15": "06:98:f5:cc:8c:f9",
            "net16": "52:87:f2:c2:76:30",
            "net17": "06:d4:b8:7e:15:6b",
            "net18": "0a:27:cc:96:87:14",
            "net19": "62:31:26:a3:3c:71",
            "net2": "12:9d:a1:1b:b7:b3",
            "net20": "26:ee:69:f7:4f:b3",
            "net21": "aa:b9:c2:8b:c8:72",
            "net22": "ca:3d:2f:86:95:63",
            "net23": "32:e4:6b:05:16:2e",
            "net24": "0a:e8:f1:ef:5c:e4",
            "net25": "d6:20:33:96:ee:a5",
            "net26": "be:49:ff:82:ed:8a",
            "net27": "5a:60:1d:de:31:6f",
            "net3": "da:a0:d6:c0:a1:88",
            "net4": "e2:ba:e0:ca:de:0c",
            "net5": "da:5e:ca:79:be:66",
            "net6": "f6:26:e8:0f:02:df",
            "net7": "62:69:fd:bf:9b:92",
            "net8": "5a:3d:09:30:08:53",
            "net9": "46:b7:d3:4b:7e:ce"
        },
        "spine_2_1_10": {
            "net0": "1a:14:ea:06:23:85",
            "net1": "16:8d:fe:f6:e0:62",
            "net10": "1e:2c:56:1f:cf:42",
            "net11": "02:ba:83:a7:b2:08",
            "net12": "c6:d7:26:84:80:00",
            "net13": "aa:a5:ff:64:2a:bb",
            "net14": "c6:bd:88:d3:49:34",
            "net15": "b2:51:a6:34:21:09",
            "net16": "8e:68:f4:04:d7:3c",
            "net17": "d6:3a:8b:c6:c8:70",
            "net18": "d6:ff:b0:3f:f8:50",
            "net19": "c6:41:2a:df:b8:f8",
            "net2": "9a:b6:21:78:63:b5",
            "net20": "7e:e5:09:ed:a9:e4",
            "net21": "52:ef:99:bf:d1:33",
            "net22": "8a:72:c1:dd:d3:38",
            "net23": "32:79:cd:a9:10:31",
            "net24": "f2:c5:22:ff:d8:54",
            "net25": "f6:d4:1d:e2:d4:cf",
            "net26": "ce:31:dd:e1:a3:e6",
            "net27": "76:53:dd:e6:24:47",
            "net3": "82:c7:52:6c:dc:7c",
            "net4": "b6:6e:2d:34:ce:fe",
            "net5": "96:a1:81:f9:c8:69",
            "net6": "22:2c:83:7f:d3:19",
            "net7": "fa:91:f6:80:53:b0",
            "net8": "5a:2f:65:36:71:10",
            "net9": "16:6d:c9:73:e3:4f"
        },
        "spine_2_1_11": {
            "net0": "fe:59:67:27:c7:e3",
            "net1": "2e:0b:bf:94:70:63",
            "net10": "8e:d9:bd:ac:e4:ed",
            "net11": "6a:8a:30:38:95:b5",
            "net12": "7e:33:96:17:1d:2d",
            "net13": "8e:3d:32:60:67:e1",
            "net14": "8a:e4:5f:dc:ae:a1",
            "net15": "4e:96:5d:27:d9:c3",
            "net16": "5a:a0:57:26:08:3b",
            "net17": "b2:2d:6d:3c:73:bd",
            "net18": "7e:8d:8f:fd:d3:fe",
            "net19": "ea:33:8f:e9:09:d6",
            "net2": "e2:58:db:55:64:2c",
            "net20": "12:07:f0:8f:b5:b5",
            "net21": "ca:61:58:2b:d6:3b",
            "net22": "52:d4:80:5c:12:24",
            "net23": "fa:aa:a7:f1:a3:84",
            "net24": "16:87:9b:d5:05:5a",
            "net25": "5a:3b:3e:d1:d6:d5",
            "net26": "26:f8:c5:66:22:92",
            "net27": "b6:8a:39:76:12:44",
            "net3": "9a:03:4c:d0:10:30",
            "net4": "26:b4:ed:69:6a:ef",
            "net5": "3a:34:a2:16:88:1c",
            "net6": "6a:94:0d:32:84:ef",
            "net7": "56:c9:e1:dd:f0:ca",
            "net8": "6a:69:d3:3d:a3:c4",
            "net9": "16:b5:14:70:27:b6"
        },
        "spine_2_1_12": {
            "net0": "2e:1b:05:81:8b:69",
            "net1": "d6:1d:ec:8d:8e:0f",
            "net10": "2a:10:6c:cf:10:7f",
            "net11": "de:09:28:48:89:bb",
            "net12": "36:71:aa:61:28:85",
            "net13": "c2:b4:7f:03:58:2f",
            "net14": "f2:11:07:e6:8d:0b",
            "net15": "de:b2:54:3d:1f:de",
            "net16": "da:54:c4:45:4a:54",
            "net17": "ba:6a:b4:33:ea:20",
            "net18": "56:7c:01:3e:71:b9",
            "net19": "5a:39:28:4a:34:57",
            "net2": "1e:7b:6d:cd:c0:d4",
            "net20": "2e:68:6f:54:30:7b",
            "net21": "4a:b7:23:9b:7b:1f",
            "net22": "ba:6c:7f:cc:b1:e6",
            "net23": "7e:ea:2d:ef:df:76",
            "net24": "1e:e2:42:49:40:58",
            "net25": "fa:42:7e:79:11:3d",
            "net26": "d2:21:7a:49:38:d9",
            "net27": "c2:02:fc:86:6a:f1",
            "net3": "0a:a7:54:a5:92:f8",
            "net4": "5a:46:34:a5:fc:3b",
            "net5": "c2:b6:ff:12:f9:2d",
            "net6": "3a:7e:49:3a:96:16",
            "net7": "a6:cb:5c:39:1f:d6",
            "net8": "16:4e:e7:53:1e:6c",
            "net9": "02:70:9a:d0:ca:5a"
        },
        "spine_2_1_13": {
            "net0": "aa:0d:cd:5b:a4:dd",
            "net1": "92:09:8e:38:54:5c",
            "net10": "2e:1c:03:4c:a5:0a",
            "net11": "ee:49:a3:12:37:df",
            "net12": "06:24:01:2e:72:bc",
            "net13": "1a:45:e9:55:0d:03",
            "net14": "2a:7b:61:78:69:2c",
            "net15": "6a:78:5a:2e:af:ee",
            "net16": "4e:a4:8e:c4:d6:17",
            "net17": "3a:58:af:c4:ac:15",
            "net18": "66:ab:90:1d:18:25",
            "net19": "e2:3d:22:0a:f7:06",
            "net2": "36:6c:c1:26:58:cd",
            "net20": "7a:30:08:4d:ab:ab",
            "net21": "22:ff:63:eb:26:8a",
            "net22": "16:ce:f4:99:5a:8b",
            "net23": "66:f0:17:6e:94:d3",
            "net24": "8e:a0:62:61:fa:0e",
            "net25": "46:7d:d9:f4:e2:29",
            "net26": "56:ce:48:d3:bd:8b",
            "net27": "06:1f:0c:a2:99:9a",
            "net3": "8e:96:42:b6:c8:8c",
            "net4": "72:ba:92:8e:2b:be",
            "net5": "d2:de:ae:e6:7b:3e",
            "net6": "92:8b:c9:b7:ca:1d",
            "net7": "8a:03:59:6d:c1:33",
            "net8": "0a:05:c5:e5:4b:62",
            "net9": "de:2f:20:b2:56:b8"
        },
        "spine_2_1_14": {
            "net0": "52:93:73:80:23:47",
            "net1": "2a:72:f4:bb:fd:31",
            "net10": "26:b7:b1:ab:24:0c",
            "net11": "46:7b:42:b3:cf:53",
            "net12": "1a:67:8f:ed:16:31",
            "net13": "aa:80:58:c0:2a:6a",
            "net14": "76:7b:99:5f:17:62",
            "net15": "e6:0a:1c:11:32:a4",
            "net16": "be:35:a5:4c:b3:6f",
            "net17": "9a:bd:c7:d8:03:a4",
            "net18": "4e:47:b7:6c:e7:8d",
            "net19": "7a:60:51:c3:d6:4c",
            "net2": "3e:ad:ab:1a:b2:e0",
            "net20": "32:fe:7b:71:2e:9a",
            "net21": "ee:3d:4f:95:0d:18",
            "net22": "5e:c7:ee:f8:72:e1",
            "net23": "da:cc:ed:ee:e1:8d",
            "net24": "2e:3b:d9:01:34:7a",
            "net25": "32:aa:34:e2:c4:79",
            "net26": "fa:dd:3c:5c:7f:21",
            "net27": "62:50:73:db:b3:66",
            "net3": "22:89:7f:c7:4b:aa",
            "net4": "e2:0c:91:b0:23:ad",
            "net5": "1e:da:94:27:38:c8",
            "net6": "8e:a8:47:5f:47:67",
            "net7": "72:dd:73:a5:c3:d6",
            "net8": "02:ac:e9:c6:d2:8c",
            "net9": "26:cb:39:56:aa:2a"
        },
        "spine_2_1_2": {
            "net0": "a6:60:e8:77:a0:eb",
            "net1": "62:02:34:39:90:1d",
            "net10": "7a:5a:9e:8e:db:ec",
            "net11": "e6:32:ff:1b:a1:30",
            "net12": "b2:37:ec:20:1f:55",
            "net13": "5a:e2:3a:5e:58:f4",
            "net14": "f6:00:c0:a5:5f:05",
            "net15": "7e:1d:57:aa:9c:6a",
            "net16": "96:9b:7a:4b:e4:f7",
            "net17": "76:87:98:5e:68:81",
            "net18": "b2:c4:68:a2:91:23",
            "net19": "d2:e1:61:b6:cc:0f",
            "net2": "22:88:ac:5e:79:40",
            "net20": "8a:17:a8:ce:d2:bc",
            "net21": "3a:6a:3c:2a:f0:ce",
            "net22": "2e:ed:dc:f2:92:e9",
            "net23": "1a:d3:ae:a3:99:f2",
            "net24": "5a:70:6b:a2:56:e8",
            "net25": "62:f5:1f:f7:2b:2a",
            "net26": "66:6f:c3:71:30:17",
            "net27": "56:56:34:8e:a5:b1",
            "net3": "ce:2b:a5:91:b0:68",
            "net4": "96:f7:6d:2e:8d:22",
            "net5": "ae:37:9c:88:53:98",
            "net6": "6e:10:1c:a0:4c:a6",
            "net7": "2a:c5:bc:ec:7a:5a",
            "net8": "fe:58:bd:6c:d7:60",
            "net9": "52:45:63:0a:cd:1b"
        },
        "spine_2_1_3": {
            "net0": "16:64:39:3d:44:78",
            "net1": "02:fc:36:aa:bd:f2",
            "net10": "1a:26:b8:94:cd:ae",
            "net11": "92:b0:9b:ef:11:71",
            "net12": "42:af:b5:cf:18:06",
            "net13": "22:ff:c9:cb:28:35",
            "net14": "5a:a0:4a:3a:76:9b",
            "net15": "2e:e3:c0:50:65:f3",
            "net16": "ce:03:80:05:fb:0c",
            "net17": "02:1b:7a:50:e1:0e",
            "net18": "d2:6c:86:2a:17:f9",
            "net19": "8a:1a:0a:90:3a:6e",
            "net2": "3a:48:5d:1e:86:57",
            "net20": "9e:b0:fa:98:83:5b",
            "net21": "1e:48:1d:c0:61:b7",
            "net22": "2e:98:a7:81:5e:c7",
            "net23": "2e:da:5d:9c:03:66",
            "net24": "82:35:15:ce:41:27",
            "net25": "5e:9c:96:d4:a8:03",
            "net26": "a2:df:f2:37:30:22",
            "net27": "5a:f8:45:08:98:a7",
            "net3": "62:6f:1b:ba:fc:b7",
            "net4": "d6:96:2a:fe:f2:92",
            "net5": "12:62:3a:34:73:01",
            "net6": "de:4e:05:5f:a3:89",
            "net7": "5a:89:a3:eb:78:82",
            "net8": "fe:5f:db:11:49:d1",
            "net9": "f6:32:36:37:9c:22"
        },
        "spine_2_1_4": {
            "net0": "82:46:74:d7:7d:97",
            "net1": "1e:55:0b:a0:0e:2f",
            "net10": "26:56:61:fb:6f:e4",
            "net11": "36:aa:97:9f:c1:c2",
            "net12": "fe:bf:17:50:fd:b7",
            "net13": "da:40:05:36:26:f8",
            "net14": "1a:36:00:ee:47:93",
            "net15": "36:93:ef:0d:92:42",
            "net16": "86:d0:83:3c:89:a3",
            "net17": "6a:1c:67:04:dd:57",
            "net18": "7e:8f:04:8d:26:52",
            "net19": "fe:7f:32:18:63:da",
            "net2": "a2:d9:e6:24:94:b7",
            "net20": "52:23:cd:3a:ed:3f",
            "net21": "76:19:4d:9f:a7:f1",
            "net22": "6a:c1:af:65:e4:ac",
            "net23": "f2:89:5a:aa:0d:aa",
            "net24": "4e:60:25:e5:89:93",
            "net25": "f2:ea:22:8e:20:c8",
            "net26": "da:53:42:e4:76:e6",
            "net27": "4e:e2:f6:bc:8f:72",
            "net3": "7e:76:2a:d6:9e:74",
            "net4": "86:f4:9c:9e:dd:28",
            "net5": "d2:5b:e1:a2:48:62",
            "net6": "a2:2c:33:48:78:c5",
            "net7": "a2:3d:9d:46:fa:83",
            "net8": "7e:36:a3:fd:33:c8",
            "net9": "5e:23:40:0f:d2:2a"
        },
        "spine_2_1_5": {
            "net0": "b6:50:fd:7b:17:f8",
            "net1": "3a:3b:e8:d3:4c:e8",
            "net10": "06:f6:6d:b5:8c:ad",
            "net11": "f2:12:12:78:42:3a",
            "net12": "0a:c4:ed:51:7b:cf",
            "net13": "5e:35:8a:5a:91:c9",
            "net14": "be:b2:c0:31:d5:3d",
            "net15": "76:eb:30:21:1d:54",
            "net16": "7a:b3:26:54:4a:59",
            "net17": "ce:82:53:58:24:41",
            "net18": "e6:09:a6:fc:16:61",
            "net19": "12:fb:06:51:34:46",
            "net2": "a2:db:63:fe:d9:af",
            "net20": "2a:6f:7b:5d:a6:d4",
            "net21": "6a:67:8f:07:20:5e",
            "net22": "f2:0e:51:72:c1:27",
            "net23": "42:b4:44:ea:5e:a7",
            "net24": "1a:4f:db:f5:73:ee",
            "net25": "e6:05:0c:00:72:5e",
            "net26": "5e:ba:ca:86:8b:68",
            "net27": "0a:c8:81:05:bf:44",
            "net3": "ea:f0:80:f0:db:d8",
            "net4": "96:2f:20:15:73:f0",
            "net5": "02:a8:63:70:28:18",
            "net6": "5e:1b:29:f6:d0:99",
            "net7": "4e:4c:47:f1:4c:5b",
            "net8": "fe:f3:a1:2b:ef:9f",
            "net9": "fe:2a:df:6f:7b:41"
        },
        "spine_2_1_6": {
            "net0": "32:d1:6a:f8:15:01",
            "net1": "9a:6d:57:57:f8:59",
            "net10": "42:58:b0:ca:8b:9f",
            "net11": "9e:b2:25:cd:e3:5c",
            "net12": "c6:ee:8f:dc:e5:69",
            "net13": "36:be:b4:69:78:af",
            "net14": "3e:98:fa:af:bd:50",
            "net15": "2e:2b:1c:be:ad:35",
            "net16": "d6:85:09:85:67:3c",
            "net17": "c2:af:da:30:cf:bd",
            "net18": "36:14:90:e8:78:69",
            "net19": "52:ca:04:da:df:92",
            "net2": "7a:44:75:82:5b:ab",
            "net20": "82:21:75:22:7a:4f",
            "net21": "f6:e7:ef:99:2a:c6",
            "net22": "7e:3a:d0:68:32:1c",
            "net23": "ba:e5:d4:c8:c3:d1",
            "net24": "02:f4:0b:e3:0c:b9",
            "net25": "12:b3:dc:2e:fb:7b",
            "net26": "7e:0b:48:04:49:09",
            "net27": "22:81:fb:8a:a1:bc",
            "net3": "b2:ad:d9:ce:89:e6",
            "net4": "fa:05:ce:6a:e3:48",
            "net5": "4a:c8:ec:97:aa:d6",
            "net6": "0e:b4:e8:49:02:0f",
            "net7": "fa:59:84:3f:a3:4d",
            "net8": "86:02:59:23:df:49",
            "net9": "5e:0a:36:66:d7:8a"
        },
        "spine_2_1_7": {
            "net0": "c2:a8:67:13:e6:3d",
            "net1": "a2:96:c9:63:50:70",
            "net10": "a2:b2:53:56:d4:94",
            "net11": "fe:8f:d1:9f:05:0f",
            "net12": "46:ff:cf:a0:9e:22",
            "net13": "52:96:d9:6b:f2:9b",
            "net14": "1a:aa:b3:2b:80:69",
            "net15": "b2:4e:d4:35:21:b4",
            "net16": "a2:20:ee:17:f9:d4",
            "net17": "6a:a6:37:ab:a1:b5",
            "net18": "46:0c:98:ff:9c:5a",
            "net19": "96:b2:89:a1:16:d4",
            "net2": "1e:7c:6a:75:e3:17",
            "net20": "4e:b5:c5:b0:27:27",
            "net21": "9a:a6:1b:7b:fc:a6",
            "net22": "e6:24:57:95:54:dc",
            "net23": "16:99:44:1b:b1:aa",
            "net24": "f6:0a:61:b4:a4:ae",
            "net25": "86:79:96:f6:ed:e2",
            "net26": "a2:0e:2b:a5:a1:c1",
            "net27": "fa:62:d7:62:4b:01",
            "net3": "d6:7b:a5:bf:4b:23",
            "net4": "06:6c:1d:4b:d0:8f",
            "net5": "56:d0:3e:ad:e3:58",
            "net6": "d2:6f:92:63:1e:30",
            "net7": "3a:45:54:f1:37:a8",
            "net8": "3e:7f:17:4a:d7:1e",
            "net9": "86:7c:b5:a7:ac:49"
        },
        "spine_2_1_8": {
            "net0": "16:36:ca:f8:43:9c",
            "net1": "fe:47:da:9b:5f:b0",
            "net10": "6a:f6:db:c6:24:e5",
            "net11": "8a:bf:8b:49:84:38",
            "net12": "3a:8e:83:29:aa:22",
            "net13": "ae:d0:9c:75:21:8b",
            "net14": "0e:1b:8a:8f:e7:1c",
            "net15": "e6:a7:cf:ad:6f:e3",
            "net16": "0e:4b:7c:6e:7d:6b",
            "net17": "4e:a2:4d:58:d6:21",
            "net18": "c6:de:67:38:69:b5",
            "net19": "ea:f4:23:19:93:92",
            "net2": "9a:a9:67:2c:4a:71",
            "net20": "0a:d0:22:f2:7b:37",
            "net21": "2e:1f:b7:65:fc:89",
            "net22": "12:2a:9b:bd:0b:2c",
            "net23": "1a:61:b6:3b:03:ee",
            "net24": "4a:9f:ba:a8:7d:ad",
            "net25": "3e:18:71:66:ad:b6",
            "net26": "ce:83:d5:3b:52:1d",
            "net27": "26:c5:f7:2e:3d:23",
            "net3": "06:05:cf:43:df:b8",
            "net4": "92:d1:85:71:1e:46",
            "net5": "ba:3e:70:43:cd:bd",
            "net6": "de:bb:85:2d:b7:d8",
            "net7": "d6:b6:c6:c6:2f:58",
            "net8": "86:41:c2:42:9b:f0",
            "net9": "2e:38:1e:36:ed:c8"
        },
        "spine_2_1_9": {
            "net0": "4a:fc:3d:7b:29:f1",
            "net1": "4e:bb:f6:38:f9:47",
            "net10": "6a:46:06:c2:26:ba",
            "net11": "2e:67:bd:4e:cf:25",
            "net12": "b2:7e:b5:6f:ac:61",
            "net13": "5e:cd:d1:0c:5d:6e",
            "net14": "8e:4f:1a:f0:42:85",
            "net15": "5a:81:29:3d:38:37",
            "net16": "2a:3e:58:4e:85:c4",
            "net17": "32:c9:52:c3:cf:4f",
            "net18": "26:f8:10:5c:92:d6",
            "net19": "0e:eb:81:54:f8:bd",
            "net2": "fa:a0:e0:a0:42:98",
            "net20": "da:c9:09:44:fa:6f",
            "net21": "8a:57:d5:bd:f7:78",
            "net22": "06:1b:4a:a5:01:5e",
            "net23": "5a:65:40:97:53:d9",
            "net24": "ee:80:79:68:36:68",
            "net25": "a2:77:1e:c1:97:e8",
            "net26": "6a:12:2a:36:10:ee",
            "net27": "d6:f4:48:a0:ad:95",
            "net3": "b2:2d:ce:5c:9e:94",
            "net4": "ce:ff:e1:76:90:2f",
            "net5": "7a:96:bb:dd:9b:fe",
            "net6": "ea:91:ad:23:c1:c5",
            "net7": "ae:70:d2:8b:75:d5",
            "net8": "d6:5a:85:66:2a:4d",
            "net9": "22:26:fe:02:fe:17"
        },
        "tof_1_2_1": {
            "net0": "f2:3f:fa:ce:c7:f0",
            "net1": "c6:85:6e:6c:42:93",
            "net10": "ca:50:73:e0:18:67",
            "net11": "6a:d4:72:a5:1c:30",
            "net12": "ea:16:bd:35:d3:32",
            "net13": "42:51:e9:d1:b4:73",
            "net14": "26:76:45:2b:9a:02",
            "net15": "3e:dc:41:2c:bb:fa",
            "net16": "22:ea:7d:1c:3e:3c",
            "net17": "da:ca:35:fd:79:16",
            "net18": "22:46:de:e8:6a:93",
            "net19": "62:8e:fb:16:6b:05",
            "net2": "5e:9f:79:a9:ed:db",
            "net20": "d6:d5:6a:e4:d3:be",
            "net21": "fe:8f:95:65:5d:62",
            "net22": "2e:3d:d7:88:b4:ce",
            "net23": "9e:95:48:c5:26:7a",
            "net24": "b6:24:28:3f:3b:43",
            "net25": "52:6d:6f:32:60:54",
            "net26": "fe:72:72:72:8d:cb",
            "net27": "4a:30:d4:5b:87:8d",
            "net3": "e2:73:d0:27:4f:b5",
            "net4": "f6:b1:b2:ea:f3:a9",
            "net5": "c6:1a:3f:0a:61:cb",
            "net6": "c6:8c:bc:16:ca:c2",
            "net7": "82:9c:28:5e:e3:c1",
            "net8": "52:ae:38:6e:09:37",
            "net9": "4a:b5:b6:51:6d:39"
        },
        "tof_1_2_10": {
            "net0": "36:95:88:af:34:62",
            "net1": "5a:c9:0b:b5:bc:04",
            "net10": "e6:f3:2f:b9:f0:99",
            "net11": "42:7d:90:8b:fe:1d",
            "net12": "3a:3e:03:3b:38:57",
            "net13": "ea:a0:9b:06:7d:60",
            "net14": "fe:fc:50:d3:87:8a",
            "net15": "be:75:fb:52:f5:ea",
            "net16": "02:2d:24:45:f1:99",
            "net17": "c6:1e:c1:9f:19:8a",
            "net18": "5e:4b:6f:48:a7:ef",
            "net19": "ca:58:73:06:81:9f",
            "net2": "0e:1a:49:b9:d4:c1",
            "net20": "b2:98:26:64:8a:fb",
            "net21": "72:e3:07:dd:93:b4",
            "net22": "3a:93:d7:c8:ba:cf",
            "net23": "ee:f7:4c:f5:e0:d7",
            "net24": "e6:4a:45:df:a6:83",
            "net25": "56:14:dd:ff:41:13",
            "net26": "d6:c8:6c:aa:4f:dd",
            "net27": "12:dd:27:c1:05:86",
            "net3": "56:ec:ea:a0:3d:44",
            "net4": "d6:11:14:95:81:2b",
            "net5": "e2:a7:46:16:cf:15",
            "net6": "9e:eb:b1:d6:3a:de",
            "net7": "ba:a0:aa:93:07:94",
            "net8": "fa:c7:62:f5:17:02",
            "net9": "8a:e9:dc:89:75:45"
        },
        "tof_1_2_11": {
            "net0": "da:20:fc:f7:65:f2",
            "net1": "c2:e7:37:0e:cf:1c",
            "net10": "0e:ee:03:b8:5e:52",
            "net11": "7a:6a:07:4c:7f:30",
            "net12": "0e:cd:fa:da:e5:99",
            "net13": "0a:ee:ec:78:c8:5b",
            "net14": "6a:6a:55:ca:56:64",
            "net15": "f2:c1:23:61:67:a4",
            "net16": "4a:54:18:01:a7:b4",
            "net17": "52:86:13:a9:e7:79",
            "net18": "5a:ea:8c:0e:50:e7",
            "net19": "16:6a:91:cd:de:b4",
            "net2": "96:50:ba:d7:df:16",
            "net20": "f6:a4:5f:50:bb:bc",
            "net21": "6e:3c:8c:30:a5:66",
            "net22": "46:11:78:b6:95:76",
            "net23": "b6:4f:06:7b:0d:47",
            "net24": "86:f0:ac:17:55:83",
            "net25": "c6:b8:68:4a:17:b4",
            "net26": "6a:53:2a:d8:a3:02",
            "net27": "0a:1f:31:b5:0e:15",
            "net3": "5e:53:b1:48:f2:b5",
            "net4": "12:02:31:35:99:43",
            "net5": "92:de:70:93:01:e8",
            "net6": "0e:d8:aa:91:c5:8e",
            "net7": "1e:c2:03:78:3b:99",
            "net8": "52:b5:74:4d:9a:69",
            "net9": "0e:2e:86:d9:c2:a8"
        },
        "tof_1_2_12": {
            "net0": "66:0e:78:d5:35:1d",
            "net1": "86:2f:96:7a:32:21",
            "net10": "1a:26:31:85:63:0f",
            "net11": "76:fa:04:7b:66:5d",
            "net12": "4a:9d:1d:2b:0a:50",
            "net13": "da:d3:0e:8c:a4:2a",
            "net14": "1a:8b:1b:a6:66:35",
            "net15": "0a:0e:2f:ee:21:ae",
            "net16": "92:d5:31:4f:56:41",
            "net17": "96:74:39:c6:18:d2",
            "net18": "1e:99:96:df:4e:a6",
            "net19": "0a:74:86:cb:56:2d",
            "net2": "aa:bb:d9:66:84:6e",
            "net20": "0e:7e:a3:6e:6e:56",
            "net21": "3e:3b:05:1a:a5:7a",
            "net22": "fe:34:4e:e3:25:6f",
            "net23": "0a:01:d8:50:62:2c",
            "net24": "c2:3d:8c:66:3b:73",
            "net25": "2e:56:50:f1:2b:aa",
            "net26": "4e:da:1b:fc:71:a5",
            "net27": "c2:4e:65:51:f1:de",
            "net3": "32:72:d8:c3:25:45",
            "net4": "6a:64:d0:8a:b1:fe",
            "net5": "3e:a2:25:81:1a:af",
            "net6": "4a:f0:ab:bd:de:c4",
            "net7": "86:f4:14:5e:71:28",
            "net8": "5e:0a:90:2f:ba:df",
            "net9": "56:96:5c:dc:d1:03"
        },
        "tof_1_2_13": {
            "net0": "1e:c7:ec:2a:bc:86",
            "net1": "ae:ab:00:f7:05:8c",
            "net10": "e6:b1:29:43:96:bd",
            "net11": "f6:88:91:82:28:f4",
            "net12": "62:e6:41:d3:cf:70",
            "net13": "c6:1f:fd:0c:5c:95",
            "net14": "0a:a0:46:4f:b5:77",
            "net15": "7e:92:bc:03:26:f8",
            "net16": "6e:9c:a6:51:b0:a5",
            "net17": "ce:4d:81:82:86:f5",
            "net18": "fe:34:b0:ce:58:9b",
            "net19": "fe:25:b3:b2:e4:1f",
            "net2": "ce:1f:42:81:43:35",
            "net20": "b6:4f:00:4e:50:fb",
            "net21": "7e:a3:0a:dd:29:bc",
            "net22": "b2:e1:8d:cb:ed:4a",
            "net23": "a6:48:1b:c6:d3:98",
            "net24": "f6:54:a2:06:03:e6",
            "net25": "da:db:c0:b9:ab:85",
            "net26": "8e:a3:85:bd:9f:33",
            "net27": "06:e7:e2:17:dc:95",
            "net3": "32:5a:10:2b:2c:a1",
            "net4": "72:2a:58:ba:51:10",
            "net5": "5a:e0:ed:32:1d:51",
            "net6": "e6:7a:19:11:88:15",
            "net7": "0a:82:d2:38:0d:be",
            "net8": "96:14:ff:55:79:1d",
            "net9": "3e:97:38:b7:88:8f"
        },
        "tof_1_2_14": {
            "net0": "b2:d6:78:a5:c7:50",
            "net1": "2a:11:15:da:a6:b5",
            "net10": "ee:46:a5:fc:47:f0",
            "net11": "16:dc:76:50:cc:29",
            "net12": "ee:fc:1c:0c:7a:61",
            "net13": "e6:4c:91:82:fc:cd",
            "net14": "42:ea:9b:a0:f7:96",
            "net15": "76:20:08:a5:79:6a",
            "net16": "72:6d:cb:13:80:79",
            "net17": "22:08:de:4e:ed:61",
            "net18": "b6:40:7d:c9:55:23",
            "net19": "f2:b4:8f:0a:e8:52",
            "net2": "b2:29:cd:02:29:56",
            "net20": "fa:a1:75:36:cc:60",
            "net21": "7e:72:55:79:d5:07",
            "net22": "ca:1d:93:5f:fe:10",
            "net23": "c2:f5:3f:f0:67:81",
            "net24": "02:f7:92:e8:7b:80",
            "net25": "b2:33:7b:51:9e:19",
            "net26": "9a:3b:4d:bf:4f:e6",
            "net27": "72:25:e9:ea:cd:4c",
            "net3": "fa:2d:67:ed:6e:2c",
            "net4": "3a:b0:6e:d7:fc:b9",
            "net5": "3a:a0:7c:5a:ba:b0",
            "net6": "06:47:8a:9b:bd:cd",
            "net7": "7e:9a:36:a6:dd:8a",
            "net8": "92:f8:07:cc:9a:2c",
            "net9": "86:46:73:00:fb:72"
        },
        "tof_1_2_2": {
            "net0": "32:ff:fc:1a:4f:5b",
            "net1": "fe:8b:c5:56:6b:89",
            "net10": "76:52:fd:c5:f2:e8",
            "net11": "5e:65:94:d6:6a:9b",
            "net12": "e2:b3:ad:21:57:18",
            "net13": "26:39:9a:70:b4:d5",
            "net14": "f6:c6:a6:4f:fc:b3",
            "net15": "16:53:c4:4c:44:58",
            "net16": "9e:91:35:b6:31:6c",
            "net17": "3e:f1:06:80:79:9e",
            "net18": "5a:2e:b2:1e:74:75",
            "net19": "9e:df:2e:90:bd:14",
            "net2": "86:9d:09:c2:09:e9",
            "net20": "46:35:ea:94:f2:d2",
            "net21": "ae:34:0f:db:d3:ba",
            "net22": "56:3a:c7:47:f8:11",
            "net23": "0a:a3:14:10:db:22",
            "net24": "16:0a:ed:00:65:88",
            "net25": "be:91:41:d8:93:d8",
            "net26": "0a:c4:01:23:67:99",
            "net27": "5e:15:4e:07:81:a0",
            "net3": "5a:f9:d8:3e:a9:5b",
            "net4": "5a:42:0f:ee:ca:6b",
            "net5": "46:12:4e:16:42:26",
            "net6": "ce:c9:1a:7e:70:1b",
            "net7": "36:76:dd:76:93:43",
            "net8": "86:b3:75:d6:e9:33",
            "net9": "86:ba:9b:c5:73:d7"
        },
        "tof_1_2_3": {
            "net0": "d6:6e:39:cd:ec:7a",
            "net1": "a6:67:5b:5a:1d:e4",
            "net10": "0e:f5:86:c4:11:81",
            "net11": "c6:d4:46:6a:46:ff",
            "net12": "6a:bd:ea:a4:bd:4e",
            "net13": "56:06:9d:07:c4:ee",
            "net14": "1e:57:d2:b6:d0:8b",
            "net15": "b6:6f:c3:c9:98:1e",
            "net16": "66:e2:e0:0d:ea:01",
            "net17": "5a:45:71:1f:2d:5f",
            "net18": "1a:90:3c:89:e1:df",
            "net19": "c6:2f:76:d1:ad:8e",
            "net2": "9a:8a:12:a3:ac:ac",
            "net20": "2a:0f:cc:b9:3e:04",
            "net21": "86:2b:85:2d:5a:75",
            "net22": "36:ac:7a:93:9e:e3",
            "net23": "6a:ab:b4:4f:74:d4",
            "net24": "d6:2b:b4:d4:b8:e9",
            "net25": "8a:3e:79:4c:54:54",
            "net26": "a2:09:7d:4d:26:0c",
            "net27": "82:13:f9:a9:e6:8f",
            "net3": "da:0a:9f:0f:7b:61",
            "net4": "72:4f:b1:1e:06:89",
            "net5": "7e:c1:46:7c:97:5f",
            "net6": "ea:01:03:18:e3:db",
            "net7": "a2:3c:ce:7b:63:8c",
            "net8": "96:5d:c6:f7:e7:18",
            "net9": "42:a9:b1:83:9b:59"
        },
        "tof_1_2_4": {
            "net0": "52:37:fe:2c:52:c1",
            "net1": "da:8d:4e:ec:70:e6",
            "net10": "f2:39:da:c2:3e:86",
            "net11": "7a:86:0e:40:58:be",
            "net12": "f6:65:29:72:5e:8a",
            "net13": "e6:f2:07:78:59:d4",
            "net14": "12:bb:94:fc:12:16",
            "net15": "92:43:7c:d0:f6:40",
            "net16": "b6:62:6b:62:dc:4d",
            "net17": "5a:a1:c9:96:51:29",
            "net18": "32:7b:be:f7:15:92",
            "net19": "02:d3:d9:4e:58:93",
            "net2": "ba:5d:3b:16:41:3b",
            "net20": "22:81:f5:43:33:9e",
            "net21": "46:ff:6a:2e:41:ef",
            "net22": "3e:8a:8f:47:2a:f7",
            "net23": "4e:43:cc:89:e7:55",
            "net24": "b2:af:50:9a:2a:49",
            "net25": "7e:08:bf:c8:d5:57",
            "net26": "a2:f1:a1:c7:65:1c",
            "net27": "c6:1b:8e:b9:12:97",
            "net3": "f2:b6:b3:82:2a:44",
            "net4": "22:6b:34:de:0a:f9",
            "net5": "82:02:31:9f:eb:77",
            "net6": "0e:fd:12:1e:db:a0",
            "net7": "16:40:0a:5a:99:9f",
            "net8": "56:47:93:d9:80:8b",
            "net9": "e6:2a:62:49:ef:cc"
        },
        "tof_1_2_5": {
            "net0": "ae:5f:79:f6:d7:16",
            "net1": "9a:b5:a2:5f:4f:a9",
            "net10": "a6:aa:6a:03:33:6e",
            "net11": "32:25:59:b7:11:f2",
            "net12": "9e:d5:48:b6:39:51",
            "net13": "02:31:f0:a8:55:49",
            "net14": "6a:80:49:34:8d:9e",
            "net15": "4e:0b:d3:8a:c0:48",
            "net16": "5a:c4:62:7f:c0:84",
            "net17": "1e:93:b9:f5:10:ee",
            "net18": "86:84:c0:16:d7:ee",
            "net19": "06:98:20:71:68:f9",
            "net2": "8a:95:bd:82:d9:42",
            "net20": "fe:d9:a3:31:45:1c",
            "net21": "56:ac:9d:47:67:36",
            "net22": "22:a6:02:db:aa:dd",
            "net23": "ea:13:3e:4b:0f:4f",
            "net24": "7a:25:6f:3d:ed:e4",
            "net25": "82:bc:22:cd:5f:4d",
            "net26": "d2:33:4d:b4:e6:fd",
            "net27": "7a:52:86:ec:39:bb",
            "net3": "1e:2c:9a:0c:10:be",
            "net4": "be:75:84:37:0e:2f",
            "net5": "e6:41:0d:7b:f1:0e",
            "net6": "ca:6a:cb:30:03:07",
            "net7": "82:2f:82:e9:79:6c",
            "net8": "4a:f8:e7:25:93:95",
            "net9": "96:18:40:b7:08:19"
        },
        "tof_1_2_6": {
            "net0": "46:7e:8e:4b:56:3c",
            "net1": "3a:48:13:c0:82:db",
            "net10": "6e:3b:97:a6:91:b0",
            "net11": "a2:3f:dc:e2:f6:18",
            "net12": "12:68:a6:11:01:22",
            "net13": "9e:df:da:43:51:11",
            "net14": "2e:73:a6:3a:1d:ae",
            "net15": "62:11:99:60:9d:cd",
            "net16": "42:07:bf:ee:c8:76",
            "net17": "b6:4b:d6:1c:ef:aa",
            "net18": "4a:cf:ce:1d:d4:dc",
            "net19": "96:81:fd:d5:dc:7d",
            "net2": "16:f1:f2:60:d9:38",
            "net20": "a2:2e:ef:b6:e9:aa",
            "net21": "92:d8:d4:63:4c:48",
            "net22": "96:13:6f:ad:b5:c6",
            "net23": "fe:82:7d:17:9b:4b",
            "net24": "8a:ea:63:33:e4:2a",
            "net25": "f6:08:f0:85:66:94",
            "net26": "b2:c6:1c:dc:29:37",
            "net27": "02:b8:bc:49:4b:51",
            "net3": "06:04:bb:1e:13:72",
            "net4": "62:fd:45:0e:54:3d",
            "net5": "c6:e7:05:2d:0a:50",
            "net6": "6a:14:d4:88:b1:26",
            "net7": "5e:9e:3f:23:bf:bf",
            "net8": "9e:bb:84:f3:71:4a",
            "net9": "82:56:95:51:6b:75"
        },
        "tof_1_2_7": {
            "net0": "92:ef:25:28:31:44",
            "net1": "8e:eb:5f:5d:6f:ac",
            "net10": "5a:c9:83:36:65:1f",
            "net11": "e2:f2:eb:4d:d9:ba",
            "net12": "66:84:47:5b:ca:41",
            "net13": "56:20:93:6e:2c:20",
            "net14": "3a:9a:82:36:d2:32",
            "net15": "3e:31:8d:05:b6:df",
            "net16": "76:9e:b1:87:4b:ac",
            "net17": "a2:29:ae:05:6b:f9",
            "net18": "b2:18:8b:8c:aa:0c",
            "net19": "fe:21:87:6a:ef:63",
            "net2": "5a:6a:2b:67:f7:92",
            "net20": "1a:9c:ce:90:76:47",
            "net21": "8a:cc:b3:47:45:97",
            "net22": "e2:15:7f:41:0f:27",
            "net23": "1a:db:f8:39:24:d6",
            "net24": "5e:38:d7:49:2b:56",
            "net25": "3e:aa:c3:9d:78:80",
            "net26": "d6:66:47:48:35:de",
            "net27": "96:9f:48:c0:6d:f3",
            "net3": "4e:8e:e3:fc:32:33",
            "net4": "22:12:e5:0d:d6:b0",
            "net5": "22:ed:94:d7:34:02",
            "net6": "6a:a5:fa:90:76:a1",
            "net7": "46:79:63:3a:c3:aa",
            "net8": "72:36:41:6e:76:c9",
            "net9": "2e:c8:c3:60:ca:eb"
        },
        "tof_1_2_8": {
            "net0": "e2:38:eb:c4:37:4c",
            "net1": "82:da:9f:6c:3a:1d",
            "net10": "e2:3a:83:01:7e:f6",
            "net11": "72:b7:0c:a8:01:ea",
            "net12": "e6:30:8c:6b:76:14",
            "net13": "1e:f4:ce:87:f5:84",
            "net14": "9e:1d:dc:72:7b:13",
            "net15": "96:8c:ee:44:70:56",
            "net16": "9e:2d:c0:d4:a8:cf",
            "net17": "1e:11:2f:21:64:8f",
            "net18": "a6:f0:4e:39:25:7f",
            "net19": "3e:26:00:8c:18:21",
            "net2": "8e:26:1b:ae:22:68",
            "net20": "56:b5:da:66:c7:0e",
            "net21": "de:ba:e6:7e:31:eb",
            "net22": "1e:72:0b:97:69:9f",
            "net23": "a6:73:34:84:9e:9a",
            "net24": "26:1c:7e:80:fe:09",
            "net25": "b2:65:93:b0:40:1e",
            "net26": "e6:d6:1c:2d:c5:d1",
            "net27": "9a:28:c8:b1:82:6c",
            "net3": "ea:81:5f:15:2e:86",
            "net4": "26:47:4e:31:33:1e",
            "net5": "fe:44:5a:3a:bf:3e",
            "net6": "92:62:74:69:33:ee",
            "net7": "9e:5c:0b:e7:a2:21",
            "net8": "4e:d6:09:8e:5d:a0",
            "net9": "6e:00:cc:2c:78:03"
        },
        "tof_1_2_9": {
            "net0": "e2:dd:87:1c:c0:c4",
            "net1": "96:d9:ec:f1:ef:47",
            "net10": "7a:f1:40:42:22:c6",
            "net11": "7a:b4:0d:68:3c:00",
            "net12": "2a:5d:0f:b2:86:b6",
            "net13": "66:e9:08:40:68:c0",
            "net14": "7a:eb:9c:8e:e1:79",
            "net15": "6a:1b:7a:90:54:6d",
            "net16": "32:05:17:2e:7e:f1",
            "net17": "86:fa:52:34:e8:04",
            "net18": "3a:78:85:3e:e0:2f",
            "net19": "7a:5b:10:6c:12:c5",
            "net2": "8e:1c:28:4a:22:c5",
            "net20": "1e:e7:9f:30:8a:f9",
            "net21": "9a:96:6a:b4:ba:70",
            "net22": "d2:58:bf:57:60:2e",
            "net23": "02:fb:b5:00:dc:3a",
            "net24": "e6:e3:64:aa:cc:50",
            "net25": "ea:4d:51:1e:b6:9a",
            "net26": "ee:91:07:5b:b8:ec",
            "net27": "32:a1:4b:aa:48:8c",
            "net3": "b6:ed:79:a5:6e:86",
            "net4": "16:9a:ff:e0:19:a7",
            "net5": "be:14:97:b6:91:0e",
            "net6": "be:c4:12:a5:89:5b",
            "net7": "c6:08:d6:02:44:f2",
            "net8": "ae:ea:98:74:67:25",
            "net9": "72:5d:a1:b6:57:d3"
        }
    },
    "failed_machine": "spine_1_1_1",
    "failed_interfaces": [
        "net14"
    ],
    "failure_time": 1613590150.9822958
}