{
    "k_leaf": 6,
    "k_top": 6,
    "redundancy_factor": 3,
    "is_k8s": true,
    "machine_mac_addresses": {
        "leaf_1_0_1": {
            "net0": "ce:1e:77:6d:8a:4f",
            "net1": "a2:2a:fe:5c:2a:12",
            "net2": "ee:22:58:d0:1a:c5",
            "net3": "fe:20:45:40:0a:10",
            "net4": "06:83:24:d7:e0:0c",
            "net5": "22:72:26:bb:dd:b0",
            "net6": "46:d4:24:17:17:53"
        },
        "leaf_1_0_2": {
            "net0": "0a:1f:21:5b:f9:b6",
            "net1": "7e:2c:c0:71:a4:21",
            "net2": "e6:8c:ec:33:cb:86",
            "net3": "82:40:39:d6:e9:34",
            "net4": "ba:5d:f4:73:c7:8e",
            "net5": "ee:92:b0:38:4c:d3",
            "net6": "1e:71:81:b0:30:d3"
        },
        "leaf_1_0_3": {
            "net0": "a2:93:b1:b9:76:c6",
            "net1": "ae:a0:74:30:01:cc",
            "net2": "b6:40:f7:c3:b1:6c",
            "net3": "16:3d:af:c7:7a:80",
            "net4": "66:79:5e:7b:23:33",
            "net5": "e6:35:80:5f:7d:47",
            "net6": "26:f4:04:c8:7a:d2"
        },
        "leaf_1_0_4": {
            "net0": "42:11:59:ad:02:ce",
            "net1": "66:8a:eb:58:30:3b",
            "net2": "26:31:a6:3a:9c:e7",
            "net3": "76:7a:0b:61:4b:2c",
            "net4": "82:dc:f5:04:79:d4",
            "net5": "8e:7f:d4:84:6f:36",
            "net6": "22:df:a8:e4:c9:38"
        },
        "leaf_1_0_5": {
            "net0": "42:7d:1f:2b:61:9e",
            "net1": "02:8c:f0:79:71:4e",
            "net2": "b2:78:72:20:83:06",
            "net3": "d2:72:b4:dd:e5:6b",
            "net4": "9a:8b:a3:8a:c2:24",
            "net5": "3a:85:a6:07:ac:59",
            "net6": "16:0a:81:f6:44:24"
        },
        "leaf_1_0_6": {
            "net0": "f2:f4:c0:44:56:e3",
            "net1": "c2:99:88:e7:0a:e8",
            "net2": "c2:4c:e3:3e:45:50",
            "net3": "a6:48:5b:e1:52:55",
            "net4": "a6:76:dd:e5:81:31",
            "net5": "2a:89:b9:d0:53:e5",
            "net6": "ae:a8:1f:0b:09:8a"
        },
        "leaf_2_0_1": {
            "net0": "36:2b:db:b9:e2:d2",
            "net1": "7a:01:c2:4d:61:3e",
            "net2": "02:dc:2e:40:eb:9b",
            "net3": "f6:c7:33:d8:d3:0a",
            "net4": "1e:77:2b:2a:1f:bb",
            "net5": "0a:68:c5:59:f7:59",
            "net6": "c6:c7:42:12:69:d9"
        },
        "leaf_2_0_2": {
            "net0": "7e:07:34:aa:e9:6e",
            "net1": "7e:01:0d:25:88:86",
            "net2": "0a:f0:a1:7f:e9:ac",
            "net3": "62:8f:7c:f5:87:72",
            "net4": "5e:d2:3d:a9:ef:97",
            "net5": "26:3a:ab:c7:1f:7f",
            "net6": "42:41:5e:4b:ee:3c"
        },
        "leaf_2_0_3": {
            "net0": "aa:0e:86:d4:79:2c",
            "net1": "0a:1a:20:a0:ec:5d",
            "net2": "ca:67:ea:c1:dc:8c",
            "net3": "76:2a:1e:92:49:b4",
            "net4": "fa:95:4b:98:60:63",
            "net5": "f2:65:47:ec:5c:61",
            "net6": "ea:9a:60:93:9e:06"
        },
        "leaf_2_0_4": {
            "net0": "3a:38:7b:2f:59:64",
            "net1": "96:c2:f6:b4:be:46",
            "net2": "32:7b:7e:b6:eb:29",
            "net3": "3e:ea:d6:16:66:32",
            "net4": "b2:e7:4e:8d:d2:0a",
            "net5": "d6:81:ac:67:68:98",
            "net6": "2a:c8:6d:9e:81:9e"
        },
        "leaf_2_0_5": {
            "net0": "36:ec:4f:97:1c:f2",
            "net1": "62:4a:e9:be:e6:d7",
            "net2": "12:d1:d5:bd:b3:40",
            "net3": "be:63:c4:b3:e6:20",
            "net4": "a2:74:a6:fa:10:56",
            "net5": "9e:c7:76:45:64:2e",
            "net6": "36:94:39:69:d2:7d"
        },
        "leaf_2_0_6": {
            "net0": "ee:9f:55:1b:9d:17",
            "net1": "4e:94:c1:07:97:30",
            "net2": "6a:7f:6a:0a:2a:4f",
            "net3": "1a:ba:fb:ab:86:d6",
            "net4": "82:c3:42:3f:5a:56",
            "net5": "16:ac:5b:c7:4e:c3",
            "net6": "6a:f8:27:03:14:ba"
        },
        "leaf_3_0_1": {
            "net0": "be:55:c7:f0:6b:2d",
            "net1": "0a:96:0c:b1:a1:af",
            "net2": "3a:9f:b7:32:d5:26",
            "net3": "62:ea:42:08:a3:97",
            "net4": "56:3e:87:38:6b:26",
            "net5": "8e:89:77:f6:41:97",
            "net6": "b2:b5:39:2b:02:7f"
        },
        "leaf_3_0_2": {
            "net0": "12:c1:21:57:5f:89",
            "net1": "b2:1f:7a:70:76:64",
            "net2": "8a:4e:8b:7e:48:64",
            "net3": "4e:40:43:fd:ec:a7",
            "net4": "32:6e:fd:d1:eb:24",
            "net5": "8a:05:2b:89:0b:5f",
            "net6": "6a:fd:1e:d2:78:0e"
        },
        "leaf_3_0_3": {
            "net0": "92:99:a4:9d:49:d3",
            "net1": "7e:c5:bf:e4:38:13",
            "net2": "06:67:23:ac:64:b1",
            "net3": "9a:a9:cd:43:0c:2b",
            "net4": "7e:3a:13:f5:13:e3",
            "net5": "8a:e3:d5:ee:d1:85",
            "net6": "7a:95:6e:5a:bd:95"
        },
        "leaf_3_0_4": {
            "net0": "6a:5f:f0:d7:41:f4",
            "net1": "86:e5:70:b0:cb:44",
            "net2": "ca:73:b7:b3:31:60",
            "net3": "d2:7e:87:3a:e4:83",
            "net4": "ca:90:30:9c:6c:97",
            "net5": "72:ba:08:97:0a:3f",
            "net6": "02:ea:e6:d0:40:f4"
        },
        "leaf_3_0_5": {
            "net0": "d2:a2:ea:5f:2a:ef",
            "net1": "16:b7:50:2a:ad:4a",
            "net2": "76:3d:5d:57:5d:17",
            "net3": "46:0f:b4:9f:aa:2d",
            "net4": "ea:a2:76:4a:b2:7c",
            "net5": "ca:09:80:9e:97:aa",
            "net6": "6a:f3:48:23:c3:a4"
        },
        "leaf_3_0_6": {
            "net0": "56:3b:e7:6f:5b:67",
            "net1": "0e:fb:be:c7:08:71",
            "net2": "26:cc:a5:a5:2f:c0",
            "net3": "6e:29:89:bb:47:a4",
            "net4": "9a:cc:15:34:ce:af",
            "net5": "d6:2f:dc:d3:17:ed",
            "net6": "9e:a2:70:7a:ae:c6"
        },
        "leaf_4_0_1": {
            "net0": "2a:4b:36:36:53:44",
            "net1": "ea:58:1b:36:2e:ef",
            "net2": "1a:21:58:a9:d4:aa",
            "net3": "26:1e:63:05:37:a2",
            "net4": "66:04:ef:ba:ac:4c",
            "net5": "02:d4:32:83:ac:1a",
            "net6": "be:f1:05:43:dd:86"
        },
        "leaf_4_0_2": {
            "net0": "d6:05:e9:50:0f:a2",
            "net1": "c6:24:3c:c0:01:7c",
            "net2": "42:84:0a:63:30:1c",
            "net3": "2e:c7:b5:6e:c3:eb",
            "net4": "ea:fc:eb:0d:98:bd",
            "net5": "d6:78:9e:c1:7c:85",
            "net6": "f2:65:19:76:9d:43"
        },
        "leaf_4_0_3": {
            "net0": "e2:db:57:e5:a5:a5",
            "net1": "82:28:8f:32:64:fc",
            "net2": "a6:f6:5a:8a:bb:05",
            "net3": "ca:e4:40:ca:e6:d1",
            "net4": "e2:81:a6:69:3d:6f",
            "net5": "a6:06:81:f6:8b:61",
            "net6": "ae:f7:1c:9b:77:0c"
        },
        "leaf_4_0_4": {
            "net0": "0a:0c:c8:50:e6:59",
            "net1": "d6:b4:3f:67:e8:5a",
            "net2": "76:37:a1:5d:2d:ef",
            "net3": "42:bf:c7:eb:ab:51",
            "net4": "ce:d9:14:bd:c1:6b",
            "net5": "e2:ac:7c:a2:31:13",
            "net6": "9e:aa:ce:32:03:94"
        },
        "leaf_4_0_5": {
            "net0": "36:fe:4b:92:a3:4f",
            "net1": "fe:c0:82:80:a0:a1",
            "net2": "aa:b9:a0:f1:62:9d",
            "net3": "76:d5:98:2f:56:3e",
            "net4": "2e:7d:3d:63:3f:cc",
            "net5": "ae:08:bf:34:a6:66",
            "net6": "32:36:7b:13:80:dc"
        },
        "leaf_4_0_6": {
            "net0": "ce:b3:93:6c:d4:fb",
            "net1": "62:b3:8a:05:f6:b1",
            "net2": "ee:f0:46:21:d3:fe",
            "net3": "0a:9f:02:eb:28:d4",
            "net4": "66:0c:72:24:58:fa",
            "net5": "d2:71:f8:fc:23:db",
            "net6": "2e:13:f3:79:04:ab"
        },
        "spine_1_1_1": {
            "net0": "2a:3e:13:03:4b:c2",
            "net1": "4e:92:c1:21:0c:99",
            "net10": "5a:8f:ad:11:1d:45",
            "net11": "e6:65:7e:cc:b3:17",
            "net2": "2e:a0:bd:0a:f7:c7",
            "net3": "2e:45:4d:e9:0f:f4",
            "net4": "9a:31:0a:46:07:2d",
            "net5": "96:d1:f7:15:f1:22",
            "net6": "ee:16:4a:d7:18:04",
            "net7": "82:c2:1d:f3:5d:a1",
            "net8": "e6:7c:42:7f:c9:4a",
            "net9": "42:58:60:c0:f3:74"
        },
        "spine_1_1_2": {
            "net0": "ea:66:03:93:22:41",
            "net1": "d6:a1:9b:45:6f:13",
            "net10": "66:87:b9:4d:63:d5",
            "net11": "fa:0e:58:25:19:1e",
            "net2": "0a:bc:a1:64:a2:da",
            "net3": "62:72:fc:a0:d3:0c",
            "net4": "f2:dd:ae:fb:4e:35",
            "net5": "22:10:60:53:e5:4b",
            "net6": "42:81:4e:21:3f:3b",
            "net7": "6e:43:8b:56:c1:a7",
            "net8": "3e:ee:06:a0:f1:58",
            "net9": "ea:ff:22:58:b0:e6"
        },
        "spine_1_1_3": {
            "net0": "4e:61:e2:4a:51:0f",
            "net1": "d2:f9:5b:64:b3:da",
            "net10": "fa:40:a6:c9:5a:eb",
            "net11": "7a:86:09:bd:f7:de",
            "net2": "2e:9a:37:d2:dc:24",
            "net3": "76:71:f1:75:19:17",
            "net4": "c6:10:ff:c3:8c:91",
            "net5": "3a:9d:3d:41:b7:69",
            "net6": "aa:1b:83:aa:d9:59",
            "net7": "86:f9:e7:bd:43:e6",
            "net8": "46:7c:93:88:06:8c",
            "net9": "72:4a:df:47:5f:e4"
        },
        "spine_1_1_4": {
            "net0": "96:95:f7:9b:f3:30",
            "net1": "da:e7:2c:67:75:3b",
            "net10": "e2:9f:93:04:38:08",
            "net11": "f6:b2:56:83:53:5d",
            "net2": "66:21:eb:9f:b2:62",
            "net3": "ae:de:a1:a0:b9:8f",
            "net4": "da:45:14:4a:99:74",
            "net5": "f6:d2:ea:12:a2:22",
            "net6": "ce:f4:0a:70:5c:d3",
            "net7": "76:f0:5d:74:77:cc",
            "net8": "02:66:8b:32:e7:a8",
            "net9": "42:4a:ce:e9:53:65"
        },
        "spine_1_1_5": {
            "net0": "5a:bf:24:31:d5:15",
            "net1": "d6:3b:2b:11:a7:2c",
            "net10": "4a:34:c1:6f:6d:38",
            "net11": "de:5f:f9:68:13:27",
            "net2": "7a:1e:de:c8:92:2b",
            "net3": "02:ab:a2:da:98:33",
            "net4": "9a:36:20:a2:e7:dd",
            "net5": "ba:ff:fb:5a:55:df",
            "net6": "ca:be:e4:47:fc:d9",
            "net7": "ea:04:13:00:2b:36",
            "net8": "1e:0c:0c:41:09:6b",
            "net9": "2e:af:44:b3:ba:31"
        },
        "spine_1_1_6": {
            "net0": "0a:98:ea:6f:16:d1",
            "net1": "fe:d1:95:7b:09:8b",
            "net10": "b2:69:51:bb:67:a7",
            "net11": "da:03:2d:66:75:e8",
            "net2": "1a:de:da:a1:4b:34",
            "net3": "be:0a:01:72:7a:b4",
            "net4": "ca:97:dc:40:66:8a",
            "net5": "0a:90:f2:ad:95:4a",
            "net6": "da:ee:70:97:55:89",
            "net7": "2e:7d:d3:37:4d:15",
            "net8": "9e:31:4c:0c:b6:0a",
            "net9": "da:f3:df:2e:45:87"
        },
        "spine_2_1_1": {
            "net0": "e6:e4:2a:81:46:1c",
            "net1": "2a:5d:6f:f1:c7:03",
            "net10": "9e:72:78:dc:2c:10",
            "net11": "f6:7a:98:d5:50:6c",
            "net2": "26:d6:50:69:7c:b0",
            "net3": "9e:c7:bf:5e:6f:d6",
            "net4": "a6:97:76:d0:7f:16",
            "net5": "82:d2:f6:57:1b:52",
            "net6": "66:31:0e:3c:7b:c7",
            "net7": "62:f3:20:40:aa:9a",
            "net8": "26:a6:1b:34:ca:c5",
            "net9": "e2:25:c4:ee:44:fa"
        },
        "spine_2_1_2": {
            "net0": "d2:96:55:79:70:c7",
            "net1": "5a:4f:03:aa:f9:af",
            "net10": "02:eb:69:bd:a8:b6",
            "net11": "0e:0b:70:16:59:2d",
            "net2": "e2:ed:4e:2f:f6:64",
            "net3": "96:f0:20:e3:62:6a",
            "net4": "0e:12:fc:d1:b0:e4",
            "net5": "e2:d3:b0:70:c1:03",
            "net6": "da:9d:ad:98:92:94",
            "net7": "d6:5a:18:0f:85:b7",
            "net8": "7e:a5:a1:5e:73:a3",
            "net9": "b6:fd:0e:b8:8e:6e"
        },
        "spine_2_1_3": {
            "net0": "fe:09:0d:be:b8:75",
            "net1": "b6:d8:df:c1:f7:0b",
            "net10": "ca:54:16:ed:31:3e",
            "net11": "9a:18:2f:04:18:9d",
            "net2": "b2:f4:bc:f2:27:c3",
            "net3": "7a:5b:87:19:5b:ab",
            "net4": "96:de:f9:76:49:0d",
            "net5": "42:60:14:42:15:3b",
            "net6": "0a:4f:ec:3d:d3:53",
            "net7": "82:b7:e8:4b:95:6a",
            "net8": "a6:b9:d4:81:c2:52",
            "net9": "0a:78:64:fc:a7:c7"
        },
        "spine_2_1_4": {
            "net0": "42:2d:1a:f7:96:f1",
            "net1": "be:3e:c5:c9:bf:6f",
            "net10": "d6:42:30:b8:6f:dc",
            "net11": "d6:0f:79:ca:7e:9a",
            "net2": "ba:d7:4a:d7:ed:b2",
            "net3": "8a:2c:ce:3e:72:9c",
            "net4": "3e:5f:80:3e:d8:af",
            "net5": "06:79:11:80:ba:98",
            "net6": "0a:5f:12:91:eb:10",
            "net7": "02:79:d0:c1:96:7d",
            "net8": "e2:0b:f1:b9:ad:39",
            "net9": "de:9d:b2:a5:cf:86"
        },
        "spine_2_1_5": {
            "net0": "c6:3b:26:12:d4:08",
            "net1": "d6:7f:c6:ff:12:80",
            "net10": "3a:99:12:81:9b:04",
            "net11": "82:f5:97:e9:27:d2",
            "net2": "f6:fc:4f:1f:ea:bb",
            "net3": "4a:ca:9e:c6:fd:c6",
            "net4": "06:7e:c7:33:2e:66",
            "net5": "52:24:dc:c7:73:0b",
            "net6": "9a:2b:39:43:a4:cb",
            "net7": "7a:2e:3e:1f:3b:6d",
            "net8": "b6:8f:77:1c:c6:cb",
            "net9": "de:a2:02:68:93:f4"
        },
        "spine_2_1_6": {
            "net0": "76:e9:0c:27:eb:b7",
            "net1": "3a:d1:06:ec:20:fb",
            "net10": "3a:e9:ab:22:a1:af",
            "net11": "f6:df:75:4c:e9:f8",
            "net2": "16:e7:0e:8c:96:48",
            "net3": "7e:33:65:3e:dc:07",
            "net4": "7e:9c:57:97:8e:c9",
            "net5": "aa:be:6d:f6:94:22",
            "net6": "f2:bb:79:bc:01:52",
            "net7": "66:f7:93:61:2f:36",
            "net8": "46:43:86:27:bf:a6",
            "net9": "16:34:ac:9f:01:e7"
        },
        "spine_3_1_1": {
            "net0": "3a:2e:c0:b9:84:af",
            "net1": "32:23:f6:ec:12:90",
            "net10": "fa:07:a1:e9:76:3f",
            "net11": "fa:02:56:32:4a:35",
            "net2": "72:38:39:32:2c:00",
            "net3": "9a:73:97:38:e4:24",
            "net4": "6e:b0:cc:c6:1a:b3",
            "net5": "5a:0f:8f:22:80:a8",
            "net6": "ca:05:df:db:7d:6c",
            "net7": "46:c2:d6:c3:54:99",
            "net8": "da:29:07:6c:3c:6f",
            "net9": "62:77:7d:d2:ef:be"
        },
        "spine_3_1_2": {
            "net0": "7e:75:09:30:69:8c",
            "net1": "ba:4c:bf:35:42:31",
            "net10": "c2:04:a4:29:90:43",
            "net11": "6a:57:79:43:68:ba",
            "net2": "d2:70:f0:ae:e7:c8",
            "net3": "12:6f:50:4f:1d:34",
            "net4": "22:e6:28:69:66:e1",
            "net5": "c2:a1:e5:ad:14:8d",
            "net6": "86:1b:d7:f6:7e:58",
            "net7": "ce:f7:97:3a:15:84",
            "net8": "be:39:a3:c5:3f:49",
            "net9": "6a:19:3b:d1:6c:45"
        },
        "spine_3_1_3": {
            "net0": "a6:4e:13:bb:b2:d8",
            "net1": "52:be:ca:92:ac:c6",
            "net10": "6e:9f:fb:d3:0b:23",
            "net11": "3a:9d:42:49:52:dd",
            "net2": "9a:43:00:9e:b6:ca",
            "net3": "d2:5b:46:2a:2a:a4",
            "net4": "92:ec:eb:00:90:a4",
            "net5": "9a:77:f9:0b:c1:6c",
            "net6": "fe:7f:84:3e:ac:36",
            "net7": "b6:c8:71:34:27:6e",
            "net8": "06:03:e2:67:dc:e6",
            "net9": "f6:4a:c4:21:16:78"
        },
        "spine_3_1_4": {
            "net0": "52:2f:6d:cb:a3:93",
            "net1": "ba:1a:69:11:64:fd",
            "net10": "7e:ca:fe:32:df:20",
            "net11": "6e:98:62:35:fb:de",
            "net2": "e2:3a:42:51:9d:c8",
            "net3": "d6:64:c4:dd:89:72",
            "net4": "2a:8c:b0:97:96:68",
            "net5": "7a:72:56:23:3a:40",
            "net6": "8a:36:05:dd:54:9c",
            "net7": "02:47:2b:fa:31:5e",
            "net8": "5e:b7:74:da:c2:a2",
            "net9": "26:98:05:f4:cf:4a"
        },
        "spine_3_1_5": {
            "net0": "02:8b:f7:27:16:95",
            "net1": "72:99:92:99:16:6a",
            "net10": "b6:48:bc:e2:2d:29",
            "net11": "42:24:62:4f:03:53",
            "net2": "ae:dc:3f:0d:7b:0f",
            "net3": "ce:9b:36:85:6f:de",
            "net4": "ee:df:ca:97:91:1c",
            "net5": "ee:a8:99:fa:01:e1",
            "net6": "0a:c8:50:56:43:73",
            "net7": "0e:99:08:59:47:63",
            "net8": "36:45:08:a4:ca:2c",
            "net9": "4e:ee:d4:0c:f8:69"
        },
        "spine_3_1_6": {
            "net0": "9e:03:0b:a2:27:c5",
            "net1": "8a:87:c8:01:48:31",
            "net10": "fa:13:b0:a3:e7:64",
            "net11": "e6:c4:c4:cd:40:b1",
            "net2": "22:88:78:f8:6b:42",
            "net3": "56:fd:38:6d:eb:61",
            "net4": "22:57:85:b6:fd:bf",
            "net5": "1a:bd:e6:d2:57:77",
            "net6": "ce:9c:0a:4e:47:ba",
            "net7": "8a:76:4f:8b:4c:e1",
            "net8": "8a:ca:95:47:16:52",
            "net9": "c6:09:d6:b9:9d:e2"
        },
        "spine_4_1_1": {
            "net0": "1a:a8:d6:2d:b4:68",
            "net1": "6e:7f:ea:60:20:49",
            "net10": "26:9e:6b:09:a6:05",
            "net11": "ca:15:8e:a5:6c:91",
            "net2": "5e:bd:95:7f:e2:62",
            "net3": "be:cf:65:02:6b:c8",
            "net4": "72:e0:97:b7:3b:6e",
            "net5": "be:c1:03:ef:d2:ec",
            "net6": "02:1c:5b:a8:20:78",
            "net7": "fa:36:9d:0e:53:75",
            "net8": "5e:cd:e4:c1:18:14",
            "net9": "56:5f:79:b1:36:ea"
        },
        "spine_4_1_2": {
            "net0": "a2:74:51:08:31:6c",
            "net1": "d2:f3:ed:0d:3b:a5",
            "net10": "1e:32:c7:3f:6f:c2",
            "net11": "52:ce:48:7d:b0:1a",
            "net2": "02:b5:d0:3a:2e:b4",
            "net3": "12:06:27:5d:6c:05",
            "net4": "8a:93:29:19:ea:d2",
            "net5": "22:ff:55:d0:a8:17",
            "net6": "fa:03:8d:7c:8d:88",
            "net7": "4a:e5:ea:fc:fb:a5",
            "net8": "9e:49:19:6e:bd:39",
            "net9": "62:19:b9:78:96:d2"
        },
        "spine_4_1_3": {
            "net0": "42:1a:10:fd:78:d5",
            "net1": "c6:9c:57:10:b1:81",
            "net10": "76:a4:9f:a9:90:99",
            "net11": "52:b0:7c:bd:cd:20",
            "net2": "96:c4:79:ba:58:d6",
            "net3": "f6:f3:3d:bd:3c:ee",
            "net4": "ba:4c:3f:ab:02:7b",
            "net5": "fe:d2:64:15:d6:92",
            "net6": "fe:e3:4e:81:26:84",
            "net7": "be:6f:2f:19:db:18",
            "net8": "ba:60:6d:a8:51:2e",
            "net9": "76:2a:53:79:89:9d"
        },
        "spine_4_1_4": {
            "net0": "fe:70:e7:6b:bc:02",
            "net1": "d2:e0:86:c2:f3:99",
            "net10": "42:00:57:58:88:06",
            "net11": "92:3d:e2:cc:5f:3b",
            "net2": "72:bc:c3:81:1c:44",
            "net3": "ca:91:a2:1e:e3:16",
            "net4": "ce:75:7e:cc:5d:38",
            "net5": "b6:a7:77:33:2d:05",
            "net6": "8a:90:26:e4:f8:af",
            "net7": "da:b5:0c:dd:7f:3d",
            "net8": "be:5d:c3:a7:18:bf",
            "net9": "e6:7f:51:85:d3:ff"
        },
        "spine_4_1_5": {
            "net0": "96:5e:82:cf:15:d0",
            "net1": "6a:2c:35:24:d0:df",
            "net10": "36:a3:59:35:35:9a",
            "net11": "1a:c0:b9:e6:b3:8c",
            "net2": "d2:d7:40:ee:ad:80",
            "net3": "72:09:bb:ff:ff:c1",
            "net4": "0e:55:1d:c6:ba:ab",
            "net5": "46:c5:40:e0:07:5c",
            "net6": "ce:63:d1:3b:b1:86",
            "net7": "8a:a4:71:73:a8:8a",
            "net8": "92:bc:96:a8:36:69",
            "net9": "6e:9f:be:f8:16:f4"
        },
        "spine_4_1_6": {
            "net0": "b6:96:46:47:98:34",
            "net1": "7e:a2:9e:5a:33:35",
            "net10": "96:b4:3a:ce:f0:08",
            "net11": "76:9b:9e:24:e9:02",
            "net2": "26:3c:a9:17:05:4c",
            "net3": "da:b3:65:13:2a:2b",
            "net4": "fe:45:84:39:60:c5",
            "net5": "4a:86:c8:b2:c9:f4",
            "net6": "e6:7d:10:c4:4d:af",
            "net7": "6e:82:76:48:c9:36",
            "net8": "72:5d:f6:f7:1a:65",
            "net9": "12:7a:3e:30:0a:a7"
        },
        "tof_1_2_1": {
            "net0": "66:dc:b0:a2:81:4a",
            "net1": "ee:89:06:a1:0a:0d",
            "net10": "3a:6f:9f:37:39:ae",
            "net11": "32:62:58:21:c4:eb",
            "net2": "82:28:a5:b3:d0:63",
            "net3": "8a:b8:3a:75:be:f6",
            "net4": "36:d1:fb:f2:f7:a2",
            "net5": "0a:93:42:d8:8b:be",
            "net6": "c6:ba:9f:65:21:3c",
            "net7": "de:7e:3e:62:8e:fe",
            "net8": "c6:7d:37:57:99:b9",
            "net9": "aa:cd:51:4c:4e:35"
        },
        "tof_1_2_2": {
            "net0": "4a:7a:ab:97:45:f7",
            "net1": "be:17:9a:64:eb:28",
            "net10": "86:be:be:17:1d:58",
            "net11": "26:45:79:c4:a7:5e",
            "net2": "16:db:ad:47:dd:89",
            "net3": "8e:fd:ba:92:e5:bd",
            "net4": "52:57:ab:a1:ee:f5",
            "net5": "86:f7:48:b3:9a:3d",
            "net6": "c2:00:70:b4:72:5a",
            "net7": "ce:07:2f:60:18:a5",
            "net8": "72:11:54:73:3b:79",
            "net9": "7e:17:af:64:9f:38"
        },
        "tof_1_2_3": {
            "net0": "3a:c3:cc:b9:a8:06",
            "net1": "ea:41:87:1d:9a:b2",
            "net10": "86:cd:1e:e6:f8:a1",
            "net11": "ae:6e:25:9f:09:c1",
            "net2": "36:c5:fc:ef:b2:71",
            "net3": "26:f4:96:9f:3b:8c",
            "net4": "f6:88:ef:9a:46:d1",
            "net5": "12:50:76:85:d3:cd",
            "net6": "9e:1b:78:2d:4f:76",
            "net7": "a6:08:34:f2:41:09",
            "net8": "22:c8:d5:d6:cb:2e",
            "net9": "92:69:5a:26:6b:8c"
        },
        "tof_1_2_4": {
            "net0": "d2:5a:c8:d7:44:d7",
            "net1": "8a:36:71:e5:c0:50",
            "net10": "e6:35:34:b5:75:f2",
            "net11": "0e:8f:00:56:34:88",
            "net2": "fe:32:07:dc:ce:5f",
            "net3": "ee:c1:26:ca:3b:8f",
            "net4": "32:38:8d:43:8c:73",
            "net5": "c2:d6:78:f5:4a:b1",
            "net6": "2e:aa:54:5c:d7:19",
            "net7": "6e:2c:ba:01:b3:35",
            "net8": "06:db:b6:55:ea:57",
            "net9": "f2:ec:a0:b0:47:7a"
        },
        "tof_1_2_5": {
            "net0": "86:76:15:40:04:1a",
            "net1": "f2:91:71:2b:91:7a",
            "net10": "d2:fe:90:98:d0:82",
            "net11": "be:60:12:a2:eb:a8",
            "net2": "a6:5a:d6:d7:f4:bc",
            "net3": "0e:d9:52:22:bb:eb",
            "net4": "72:43:1c:59:3f:4b",
            "net5": "ca:08:1c:c6:59:30",
            "net6": "4e:ac:79:c8:61:9b",
            "net7": "96:1d:96:d4:8d:a2",
            "net8": "fe:a7:55:17:ed:e0",
            "net9": "1a:7b:59:1f:c6:6b"
        },
        "tof_1_2_6": {
            "net0": "2e:e6:a2:65:6e:e9",
            "net1": "aa:80:b6:69:44:0d",
            "net10": "8e:15:a3:62:af:56",
            "net11": "6e:17:a1:0a:cd:fa",
            "net2": "36:d5:ee:cb:0e:82",
            "net3": "b6:3b:95:18:84:b0",
            "net4": "06:47:92:dd:f6:e5",
            "net5": "42:45:6b:3e:ea:66",
            "net6": "b2:74:b2:c6:dc:d5",
            "net7": "8e:97:01:eb:be:73",
            "net8": "ae:8f:27:9a:ad:92",
            "net9": "fa:56:1c:e2:cf:bc"
        },
        "tof_2_2_1": {
            "net0": "c2:06:71:39:a7:47",
            "net1": "6e:5f:44:ca:3b:e7",
            "net10": "8a:e0:1a:7a:9d:c2",
            "net11": "4a:c7:b7:ed:7d:7a",
            "net2": "7a:ac:fd:92:f6:f6",
            "net3": "6e:21:94:bf:95:89",
            "net4": "5a:b7:e1:cd:42:2a",
            "net5": "16:84:b2:00:10:39",
            "net6": "e2:94:6b:1e:8b:6f",
            "net7": "fe:af:2c:c3:3f:15",
            "net8": "de:27:5e:e5:f5:96",
            "net9": "22:d8:47:9e:42:ee"
        },
        "tof_2_2_2": {
            "net0": "6e:08:c2:a6:67:25",
            "net1": "26:a5:7c:a9:b4:5f",
            "net10": "a6:6d:fa:94:78:56",
            "net11": "ba:04:b3:d1:a1:aa",
            "net2": "ae:21:8e:ec:ad:93",
            "net3": "52:34:7b:90:16:a4",
            "net4": "fa:36:57:fd:5b:aa",
            "net5": "72:eb:3b:cc:1e:b6",
            "net6": "22:1f:b6:d0:8a:16",
            "net7": "5a:3f:53:b8:c4:b2",
            "net8": "b2:6d:97:31:37:7c",
            "net9": "56:f4:50:2c:0b:31"
        },
        "tof_2_2_3": {
            "net0": "b6:78:6e:92:77:57",
            "net1": "f6:e0:c5:55:22:68",
            "net10": "ce:f4:77:15:bd:a1",
            "net11": "82:7a:72:8c:7a:2f",
            "net2": "fa:09:e4:40:18:59",
            "net3": "92:8c:1c:89:26:79",
            "net4": "7a:21:e4:5c:e3:b0",
            "net5": "b6:8f:2a:df:a1:19",
            "net6": "9a:99:68:76:aa:45",
            "net7": "06:bf:ec:93:9a:43",
            "net8": "d2:33:2b:ac:46:62",
            "net9": "aa:95:7b:d8:e4:07"
        },
        "tof_2_2_4": {
            "net0": "ea:b2:b4:32:04:5f",
            "net1": "2e:79:6b:c2:3c:c4",
            "net10": "d6:94:99:11:ba:08",
            "net11": "3a:d5:e0:10:41:f9",
            "net2": "d2:b4:2e:79:bb:58",
            "net3": "9a:71:eb:0f:ee:48",
            "net4": "16:a9:9e:eb:26:84",
            "net5": "86:7d:18:7a:8e:1e",
            "net6": "f6:85:28:72:17:2e",
            "net7": "0e:9d:67:e7:0f:14",
            "net8": "86:bf:a6:39:c7:66",
            "net9": "86:33:26:15:5c:36"
        },
        "tof_2_2_5": {
            "net0": "5a:2a:33:7a:2e:28",
            "net1": "e6:34:55:fc:1b:70",
            "net10": "96:ff:93:97:aa:cc",
            "net11": "4a:53:9b:c7:77:b7",
            "net2": "56:24:20:70:53:7d",
            "net3": "1e:75:06:ef:78:ce",
            "net4": "56:33:fe:1d:be:17",
            "net5": "c6:3d:4a:f7:01:d0",
            "net6": "06:5c:3a:9e:4d:f3",
            "net7": "da:8e:4a:b7:92:ed",
            "net8": "d2:1e:6b:6a:6a:4b",
            "net9": "9a:c9:91:bc:ed:77"
        },
        "tof_2_2_6": {
            "net0": "86:bd:ce:7c:1d:63",
            "net1": "c2:84:95:db:25:5f",
            "net10": "6e:fd:24:29:30:fc",
            "net11": "b6:11:88:b3:9c:a4",
            "net2": "72:da:e5:b6:7f:87",
            "net3": "02:ad:d2:7a:ae:dc",
            "net4": "ce:ea:ff:54:dc:c2",
            "net5": "52:ef:ac:fe:d4:53",
            "net6": "c6:c2:ae:0f:40:23",
            "net7": "d2:01:dc:d8:f9:97",
            "net8": "72:4e:14:66:18:e1",
            "net9": "26:1a:ee:c2:53:d4"
        }
    },
    "failed_machine": "spine_1_1_1",
    "failed_interfaces": [
        "net6"
    ],
    "failure_time": {
        "leaf_1_0_1": 1634575338.219705,
        "leaf_1_0_2": 1634575338.3290286,
        "leaf_1_0_3": 1634575338.371545,
        "leaf_1_0_4": 1634575338.4162052,
        "leaf_1_0_5": 1634575338.4708793,
        "leaf_1_0_6": 1634575338.5206535,
        "leaf_2_0_1": 1634575338.579228,
        "leaf_2_0_2": 1634575338.5934258,
        "leaf_2_0_3": 1634575338.227868,
        "leaf_2_0_4": 1634575338.3150694,
        "leaf_2_0_5": 1634575338.3584876,
        "leaf_2_0_6": 1634575338.3722842,
        "leaf_3_0_1": 1634575338.410557,
        "leaf_3_0_2": 1634575338.4321418,
        "leaf_3_0_3": 1634575338.5289338,
        "leaf_3_0_4": 1634575338.5830436,
        "leaf_3_0_5": 1634575338.5937767,
        "leaf_3_0_6": 1634575338.6515214,
        "leaf_4_0_1": 1634575338.6655195,
        "leaf_4_0_2": 1634575338.7593377,
        "leaf_4_0_3": 1634575338.769082,
        "leaf_4_0_4": 1634575338.7754922,
        "leaf_4_0_5": 1634575338.8003328,
        "leaf_4_0_6": 1634575338.8723025,
        "spine_1_1_1": 1634575338.6510057,
        "spine_1_1_2": 1634575338.7100825,
        "spine_1_1_3": 1634575338.7610302,
        "spine_1_1_4": 1634575338.7705698,
        "spine_1_1_5": 1634575338.797046,
        "spine_1_1_6": 1634575338.8664532,
        "spine_2_1_1": 1634575338.8796835,
        "spine_2_1_2": 1634575338.921792,
        "spine_2_1_3": 1634575338.9349382,
        "spine_2_1_4": 1634575338.9539766,
        "spine_2_1_5": 1634575338.9811895,
        "spine_2_1_6": 1634575339.0003655,
        "spine_3_1_1": 1634575339.014793,
        "spine_3_1_2": 1634575339.070962,
        "spine_3_1_3": 1634575339.0884688,
        "spine_3_1_4": 1634575339.1113105,
        "spine_3_1_5": 1634575338.9575896,
        "spine_3_1_6": 1634575339.0070078,
        "spine_4_1_1": 1634575339.0165186,
        "spine_4_1_2": 1634575339.0670314,
        "spine_4_1_3": 1634575339.080488,
        "spine_4_1_4": 1634575339.090614,
        "spine_4_1_5": 1634575339.1116695,
        "spine_4_1_6": 1634575339.1825197,
        "tof_1_2_1": 1634575339.1534748,
        "tof_1_2_2": 1634575339.1846902,
        "tof_1_2_3": 1634575339.2228668,
        "tof_1_2_4": 1634575339.2480075,
        "tof_1_2_5": 1634575339.2900512,
        "tof_1_2_6": 1634575339.3203938,
        "tof_2_2_1": 1634575339.3298159,
        "tof_2_2_2": 1634575339.3408024,
        "tof_2_2_3": 1634575339.219097,
        "tof_2_2_4": 1634575339.2377024,
        "tof_2_2_5": 1634575339.2765522,
        "tof_2_2_6": 1634575339.3080344
    }
}