{
    "description": "Scenario 5b: net6 link failure of spine_1_1_1 with BGP",
    "k_leaf": 6,
    "k_top": 6,
    "redundancy_factor": 3,
    "is_k8s": true,
    "machine_mac_addresses": {
        "leaf_1_0_1": {
            "net0": "4e:ca:4e:d1:b4:75",
            "net1": "aa:4a:de:45:f1:51",
            "net2": "8a:d2:e3:ea:95:d5",
            "net3": "02:84:29:67:dd:aa",
            "net4": "7a:8c:9c:42:28:6b",
            "net5": "b2:05:7a:08:62:7b",
            "net6": "a6:52:88:49:00:da"
        },
        "leaf_1_0_2": {
            "net0": "7a:5c:ce:9b:35:88",
            "net1": "72:82:f6:27:bb:49",
            "net2": "62:54:3e:99:e1:10",
            "net3": "da:64:f2:66:3a:72",
            "net4": "ba:fe:da:a9:b2:72",
            "net5": "fa:f1:fc:f3:58:72",
            "net6": "f2:0e:44:24:fa:bf"
        },
        "leaf_1_0_3": {
            "net0": "92:03:f6:42:5a:59",
            "net1": "6a:0f:3a:60:87:5f",
            "net2": "76:6e:6a:59:17:eb",
            "net3": "fa:f6:64:f8:cc:35",
            "net4": "de:27:8a:31:cf:ba",
            "net5": "da:c1:d0:6d:3f:df",
            "net6": "de:a3:37:6b:05:e3"
        },
        "leaf_1_0_4": {
            "net0": "b6:36:b2:31:50:be",
            "net1": "9e:65:fb:f2:e7:3f",
            "net2": "5a:05:93:9b:3d:90",
            "net3": "0a:81:fc:ed:fc:77",
            "net4": "e2:5a:a3:f0:f1:31",
            "net5": "4a:39:43:36:18:9c",
            "net6": "2e:fc:f5:35:1f:02"
        },
        "leaf_1_0_5": {
            "net0": "ce:b4:6f:32:55:c8",
            "net1": "b2:06:d0:6b:5b:e2",
            "net2": "c2:26:0e:1b:7f:b2",
            "net3": "3e:95:85:ae:80:03",
            "net4": "ea:c6:ad:3e:fd:56",
            "net5": "26:cb:af:ce:35:6b",
            "net6": "5a:02:ac:c3:c0:5d"
        },
        "leaf_1_0_6": {
            "net0": "3e:55:6c:64:5c:4c",
            "net1": "7e:ed:16:b6:fe:8f",
            "net2": "9e:4e:cb:7b:a9:4e",
            "net3": "16:ab:e9:46:f1:97",
            "net4": "8e:78:4b:50:cf:f7",
            "net5": "12:40:f3:99:b8:80",
            "net6": "2e:ab:43:19:80:64"
        },
        "leaf_2_0_1": {
            "net0": "42:c9:85:46:a8:cd",
            "net1": "6e:87:16:56:d4:0f",
            "net2": "e6:55:f3:1f:e1:5d",
            "net3": "46:64:c4:cb:8e:81",
            "net4": "ae:19:d2:51:fa:23",
            "net5": "7a:cd:19:ab:cd:c4",
            "net6": "06:c2:f8:82:a6:d4"
        },
        "leaf_2_0_2": {
            "net0": "c2:48:0c:94:b8:03",
            "net1": "8e:85:68:42:76:88",
            "net2": "f6:94:51:36:1e:76",
            "net3": "82:36:e2:fe:eb:2c",
            "net4": "42:3d:51:62:80:dd",
            "net5": "0e:00:0a:b7:a8:39",
            "net6": "ea:58:8c:9f:79:45"
        },
        "leaf_2_0_3": {
            "net0": "02:ad:37:27:ae:72",
            "net1": "d2:31:f9:02:42:52",
            "net2": "8a:75:c1:39:93:28",
            "net3": "e6:9e:ea:c9:c2:30",
            "net4": "aa:75:20:a2:ee:21",
            "net5": "4e:3a:35:57:7c:78",
            "net6": "e2:74:f1:89:c0:81"
        },
        "leaf_2_0_4": {
            "net0": "42:d3:4f:1a:e5:3c",
            "net1": "aa:1a:bd:f8:c2:56",
            "net2": "56:45:29:64:c0:9f",
            "net3": "0a:48:51:d5:6b:9c",
            "net4": "fe:a2:2b:0a:02:85",
            "net5": "76:2b:e1:7c:d0:6e",
            "net6": "7e:50:4c:6f:af:74"
        },
        "leaf_2_0_5": {
            "net0": "b6:6c:7c:c5:4a:80",
            "net1": "be:be:32:d3:d1:59",
            "net2": "12:63:e2:cc:50:a8",
            "net3": "b2:25:83:e8:6b:9b",
            "net4": "3a:ee:34:a7:65:27",
            "net5": "f6:48:95:e9:3a:17",
            "net6": "46:2d:a7:e1:b3:a1"
        },
        "leaf_2_0_6": {
            "net0": "2a:e8:bf:94:2d:68",
            "net1": "7e:54:0b:5b:17:40",
            "net2": "9a:2c:f7:d6:6c:5d",
            "net3": "fe:59:33:f5:3f:b0",
            "net4": "9e:2d:5b:b7:fa:fd",
            "net5": "6a:3c:59:95:9b:5f",
            "net6": "76:b7:ca:5f:b9:37"
        },
        "leaf_3_0_1": {
            "net0": "72:32:08:1c:26:ae",
            "net1": "ca:5d:e4:90:ae:a8",
            "net2": "26:b8:04:28:52:e9",
            "net3": "4e:89:5b:61:38:b3",
            "net4": "5e:45:46:ee:13:20",
            "net5": "9a:cf:02:4d:0b:bb",
            "net6": "06:c1:fd:3c:02:8f"
        },
        "leaf_3_0_2": {
            "net0": "4e:bf:a7:16:db:76",
            "net1": "82:fb:3a:dc:86:3e",
            "net2": "9a:70:89:6a:60:7c",
            "net3": "52:93:a5:c5:43:13",
            "net4": "1e:a6:59:b6:7f:1f",
            "net5": "c6:f6:80:4d:97:d5",
            "net6": "ce:20:08:dc:c0:34"
        },
        "leaf_3_0_3": {
            "net0": "c2:34:00:fd:99:83",
            "net1": "1e:ee:d0:a9:d9:92",
            "net2": "6e:f1:c6:2e:66:37",
            "net3": "62:fc:8f:cb:61:4d",
            "net4": "d6:65:32:70:bc:6a",
            "net5": "fe:ce:07:9f:4c:c8",
            "net6": "ea:2d:97:ac:1d:7b"
        },
        "leaf_3_0_4": {
            "net0": "ce:29:c6:0f:5d:65",
            "net1": "7a:36:c4:43:1f:a2",
            "net2": "e2:26:d1:ae:33:93",
            "net3": "a6:8a:28:04:60:ed",
            "net4": "b6:58:65:55:79:e3",
            "net5": "16:e7:4c:7d:65:c4",
            "net6": "46:e5:31:a5:1b:a1"
        },
        "leaf_3_0_5": {
            "net0": "22:86:77:6b:02:bd",
            "net1": "42:75:85:c3:d9:ba",
            "net2": "fe:11:6a:1b:78:23",
            "net3": "4a:1f:50:26:87:6f",
            "net4": "b6:15:a6:aa:a6:e1",
            "net5": "5a:6a:4b:63:f5:f5",
            "net6": "ee:c7:0e:18:96:d2"
        },
        "leaf_3_0_6": {
            "net0": "42:b7:fc:d4:de:9e",
            "net1": "1a:49:08:0d:90:04",
            "net2": "12:1d:dc:1c:d4:ab",
            "net3": "46:81:bc:48:06:49",
            "net4": "ce:a8:99:0f:a0:10",
            "net5": "ea:74:63:3b:8e:e5",
            "net6": "e6:93:8e:43:1c:28"
        },
        "leaf_4_0_1": {
            "net0": "da:47:ed:a6:d9:7b",
            "net1": "82:17:d4:54:a3:03",
            "net2": "52:0f:bd:9f:e1:b8",
            "net3": "06:cf:71:74:a6:eb",
            "net4": "22:41:11:11:9f:0e",
            "net5": "86:32:3b:80:0c:bc",
            "net6": "b6:8d:e5:cd:39:32"
        },
        "leaf_4_0_2": {
            "net0": "76:81:65:f9:af:d0",
            "net1": "6a:2c:a3:28:f8:22",
            "net2": "66:73:7e:62:02:5f",
            "net3": "76:7b:43:4c:9e:7a",
            "net4": "76:93:0d:de:90:40",
            "net5": "42:29:89:23:c8:06",
            "net6": "12:45:6d:71:d6:ef"
        },
        "leaf_4_0_3": {
            "net0": "ca:66:82:9a:d7:9d",
            "net1": "e2:45:90:d1:e8:a6",
            "net2": "1e:21:79:dc:c8:5e",
            "net3": "b2:e5:92:d9:ad:ef",
            "net4": "02:c0:1f:9e:55:a4",
            "net5": "be:dc:34:5c:10:11",
            "net6": "06:d8:98:82:a1:d4"
        },
        "leaf_4_0_4": {
            "net0": "7e:ed:a7:1c:b0:de",
            "net1": "82:80:9a:08:b6:90",
            "net2": "f6:00:62:3a:1c:2d",
            "net3": "7e:da:75:8c:97:35",
            "net4": "22:ca:45:a6:63:b9",
            "net5": "9a:fb:b0:ff:42:d8",
            "net6": "a2:43:3c:c2:25:f9"
        },
        "leaf_4_0_5": {
            "net0": "8a:09:ee:22:8c:70",
            "net1": "1e:27:ca:98:af:13",
            "net2": "16:c8:e2:11:3e:35",
            "net3": "96:56:89:c7:f7:b6",
            "net4": "96:37:1b:4a:fc:e0",
            "net5": "6e:a4:98:c8:32:07",
            "net6": "4e:e2:f7:64:1d:7c"
        },
        "leaf_4_0_6": {
            "net0": "b6:8c:98:82:3f:62",
            "net1": "8a:be:10:8e:ad:1d",
            "net2": "3e:0b:53:7b:e7:a8",
            "net3": "6e:2e:7f:35:b1:e9",
            "net4": "3e:8f:17:46:2c:3e",
            "net5": "b2:80:6b:28:7d:1a",
            "net6": "0a:83:77:66:e5:4b"
        },
        "spine_1_1_1": {
            "net0": "ae:0d:82:6d:4a:b1",
            "net1": "52:12:e2:f5:8f:1e",
            "net10": "f2:03:1c:f3:a3:84",
            "net11": "9a:ac:9c:1a:26:df",
            "net2": "9e:dc:a2:6e:b6:cb",
            "net3": "9e:3a:3e:2c:73:21",
            "net4": "7e:98:9e:1b:15:3d",
            "net5": "46:9e:5d:7f:2d:93",
            "net6": "16:1c:36:ef:4b:db",
            "net7": "de:6c:ad:c1:94:3b",
            "net8": "06:f8:16:99:f6:cc",
            "net9": "8a:3f:f0:c7:e7:82"
        },
        "spine_1_1_2": {
            "net0": "1a:a3:3a:c4:26:5c",
            "net1": "16:c2:99:53:4c:9e",
            "net10": "ee:dd:6c:ed:f7:74",
            "net11": "ea:7c:24:53:91:17",
            "net2": "c2:65:de:a4:c0:f1",
            "net3": "c6:ee:ad:7c:23:f2",
            "net4": "72:82:09:2f:f7:e9",
            "net5": "2e:f7:60:a4:a7:5b",
            "net6": "12:b7:c6:23:c6:a6",
            "net7": "36:8b:d5:8b:d0:61",
            "net8": "de:60:3d:ce:e5:cd",
            "net9": "e2:6d:29:f7:42:e7"
        },
        "spine_1_1_3": {
            "net0": "66:74:15:fe:12:d2",
            "net1": "ea:03:75:21:6f:b9",
            "net10": "3a:0e:6d:7d:23:f6",
            "net11": "72:c5:95:42:9d:2e",
            "net2": "d6:17:da:7d:ae:18",
            "net3": "7e:04:30:bb:ab:59",
            "net4": "42:cd:26:d7:3f:8d",
            "net5": "3a:7b:d0:e4:7b:36",
            "net6": "36:ab:25:69:fe:ad",
            "net7": "7a:d0:ad:b8:22:2d",
            "net8": "92:17:f2:4e:ff:ec",
            "net9": "66:09:07:be:02:48"
        },
        "spine_1_1_4": {
            "net0": "86:80:8d:61:95:0b",
            "net1": "be:5f:72:0f:e3:cc",
            "net10": "f6:0e:11:bf:76:0c",
            "net11": "3e:ac:7c:b5:29:6b",
            "net2": "36:4e:90:cc:f4:a0",
            "net3": "de:96:b8:8d:27:ba",
            "net4": "a6:64:5e:68:13:b7",
            "net5": "c6:d7:e6:3e:f9:90",
            "net6": "ba:b6:c1:ef:be:da",
            "net7": "fe:3a:27:8e:66:35",
            "net8": "b2:d8:00:a9:4c:65",
            "net9": "2e:99:61:f7:63:da"
        },
        "spine_1_1_5": {
            "net0": "e2:64:b8:df:fd:07",
            "net1": "ba:85:39:6c:8a:34",
            "net10": "2e:f7:af:7b:48:4e",
            "net11": "12:69:9e:67:31:64",
            "net2": "32:65:6b:38:15:47",
            "net3": "52:6e:5d:73:cc:74",
            "net4": "ee:bf:7a:a7:bb:20",
            "net5": "26:9a:1b:d0:c6:89",
            "net6": "1a:ce:71:ff:24:a4",
            "net7": "a6:78:cd:e9:a5:7a",
            "net8": "7a:87:99:62:7c:ff",
            "net9": "ea:ea:e9:fc:79:06"
        },
        "spine_1_1_6": {
            "net0": "62:52:3c:79:e2:92",
            "net1": "4e:ab:56:36:08:24",
            "net10": "ba:07:29:46:d0:c6",
            "net11": "3e:d1:1f:2e:a1:54",
            "net2": "e2:e7:53:a6:5f:79",
            "net3": "0e:ef:25:8b:7a:6c",
            "net4": "92:5a:6e:a8:f7:e0",
            "net5": "6a:4d:87:98:85:9a",
            "net6": "5e:3d:98:99:a1:2b",
            "net7": "d2:a8:d3:b7:16:0c",
            "net8": "3e:40:cd:f6:7a:30",
            "net9": "fe:84:8d:91:48:73"
        },
        "spine_2_1_1": {
            "net0": "36:63:92:03:57:0b",
            "net1": "d6:75:e1:62:b4:40",
            "net10": "1a:58:7f:8e:38:a3",
            "net11": "b6:ab:1b:82:22:20",
            "net2": "5e:ca:58:a6:dc:cc",
            "net3": "06:3a:a0:4a:db:23",
            "net4": "46:6a:78:8b:29:39",
            "net5": "e6:41:10:76:79:18",
            "net6": "16:c3:98:a1:96:2d",
            "net7": "f6:b1:fe:5b:e8:03",
            "net8": "62:49:14:67:57:89",
            "net9": "9e:3d:dc:1a:c5:76"
        },
        "spine_2_1_2": {
            "net0": "12:d7:7c:b0:de:3b",
            "net1": "9a:f7:5e:f3:f0:0c",
            "net10": "4a:a1:90:91:b6:38",
            "net11": "a2:3f:a2:f9:4c:ad",
            "net2": "4a:f6:36:60:d0:58",
            "net3": "72:d3:7f:67:a0:82",
            "net4": "2a:1e:46:9b:47:03",
            "net5": "a2:e9:1a:3f:28:44",
            "net6": "9e:d4:46:8d:55:0c",
            "net7": "c6:4d:a7:87:2d:e6",
            "net8": "3a:08:2c:c6:b0:e0",
            "net9": "d6:b5:ed:d6:1b:a6"
        },
        "spine_2_1_3": {
            "net0": "aa:08:91:aa:fd:5b",
            "net1": "16:84:92:48:a1:13",
            "net10": "a2:69:00:8d:bd:ed",
            "net11": "de:90:a7:ad:05:0d",
            "net2": "b6:c9:38:9d:e0:fa",
            "net3": "ca:f1:5e:04:b4:69",
            "net4": "ba:fa:f6:79:0a:49",
            "net5": "66:e5:1e:51:50:ae",
            "net6": "a2:de:5f:e4:11:40",
            "net7": "ea:7c:13:83:2a:42",
            "net8": "4e:14:d4:f5:16:ee",
            "net9": "b2:1e:14:e5:a0:4b"
        },
        "spine_2_1_4": {
            "net0": "4e:1e:c6:3c:96:13",
            "net1": "8e:ed:7a:bc:a6:ae",
            "net10": "12:04:62:e2:08:9b",
            "net11": "2e:da:d4:73:b8:84",
            "net2": "06:81:c6:73:92:c7",
            "net3": "02:7e:ce:d0:7f:c7",
            "net4": "56:b1:cc:09:ae:ce",
            "net5": "a6:45:d3:e5:55:8e",
            "net6": "6a:f9:cf:de:e4:c9",
            "net7": "9a:dc:0f:41:d5:4f",
            "net8": "7e:a5:86:56:18:54",
            "net9": "c6:d3:e4:a1:2c:dd"
        },
        "spine_2_1_5": {
            "net0": "d6:de:87:ea:99:73",
            "net1": "ce:ce:20:3d:a1:32",
            "net10": "22:79:ae:12:87:ae",
            "net11": "0e:82:57:0b:bd:fd",
            "net2": "02:f2:65:30:b4:d1",
            "net3": "d2:35:95:c4:14:a4",
            "net4": "16:da:03:b9:12:fb",
            "net5": "6e:05:07:94:83:17",
            "net6": "f2:17:98:13:11:e4",
            "net7": "46:d5:9c:0a:11:2a",
            "net8": "0a:c0:39:3f:65:97",
            "net9": "12:e9:a5:7b:55:5b"
        },
        "spine_2_1_6": {
            "net0": "e6:86:c4:ff:98:1a",
            "net1": "9a:fe:fe:2a:32:11",
            "net10": "62:dd:05:36:7f:08",
            "net11": "e2:2e:fb:7c:d1:9d",
            "net2": "0e:01:f5:cb:53:58",
            "net3": "12:57:6d:7b:78:d9",
            "net4": "a6:8c:dc:95:2f:20",
            "net5": "6a:a1:b1:c0:e7:f8",
            "net6": "06:00:44:e1:48:51",
            "net7": "ee:2c:6f:6c:7b:c9",
            "net8": "ee:a6:66:1a:d4:72",
            "net9": "76:22:3b:ba:a8:96"
        },
        "spine_3_1_1": {
            "net0": "86:38:8c:10:4a:2d",
            "net1": "86:30:0b:41:89:f4",
            "net10": "4e:02:29:60:56:dd",
            "net11": "0e:b1:c8:c7:3f:0e",
            "net2": "3a:0a:a6:4d:4d:42",
            "net3": "9a:d1:6a:0c:ae:2d",
            "net4": "ee:b6:f5:bd:f2:8d",
            "net5": "ca:eb:ef:8c:aa:e0",
            "net6": "b6:9b:ac:22:e6:09",
            "net7": "e2:b5:f1:8d:86:3d",
            "net8": "f6:20:fb:11:a3:70",
            "net9": "66:0a:da:52:79:6e"
        },
        "spine_3_1_2": {
            "net0": "46:51:a9:a9:4c:4c",
            "net1": "ae:91:c0:8b:3e:8c",
            "net10": "12:24:c3:97:0e:5e",
            "net11": "1e:9d:ae:64:26:62",
            "net2": "4a:43:40:37:1a:34",
            "net3": "7a:7f:9b:6f:46:5b",
            "net4": "e2:6c:c8:9d:52:a8",
            "net5": "2a:7e:0c:27:32:76",
            "net6": "3e:0e:a4:20:b8:3d",
            "net7": "fe:9e:af:3e:24:6a",
            "net8": "4e:21:49:1e:76:77",
            "net9": "42:c0:95:ca:70:b4"
        },
        "spine_3_1_3": {
            "net0": "8e:cf:a2:e5:ac:06",
            "net1": "5e:b1:6b:39:7d:0d",
            "net10": "e6:4b:16:b6:36:72",
            "net11": "2e:34:d4:03:e5:4b",
            "net2": "ca:a4:93:ba:b1:46",
            "net3": "82:4e:9e:8c:9e:4b",
            "net4": "d2:59:8c:79:a0:83",
            "net5": "22:36:68:ce:45:5c",
            "net6": "8e:b2:0d:2d:e1:f2",
            "net7": "f2:1f:48:b7:31:11",
            "net8": "fa:a4:1d:bf:bc:9a",
            "net9": "e2:ec:c7:c6:8a:b2"
        },
        "spine_3_1_4": {
            "net0": "72:c9:75:90:1f:8b",
            "net1": "c2:ad:b4:7c:ce:a5",
            "net10": "4e:d7:07:99:9e:56",
            "net11": "72:7f:9b:55:ea:1f",
            "net2": "92:19:61:62:03:54",
            "net3": "9e:98:79:99:89:d8",
            "net4": "c6:3d:c4:e9:ca:2d",
            "net5": "52:9b:dd:e6:9d:2f",
            "net6": "46:94:fe:b9:99:78",
            "net7": "66:ba:29:bb:c8:bc",
            "net8": "5a:79:79:19:54:aa",
            "net9": "e6:d2:04:51:72:ba"
        },
        "spine_3_1_5": {
            "net0": "b2:06:3e:f9:fa:49",
            "net1": "2e:9a:ec:29:4f:59",
            "net10": "02:40:b1:e5:8f:3f",
            "net11": "9e:dc:f1:34:f1:b1",
            "net2": "1a:62:30:bb:69:36",
            "net3": "9a:3e:4c:8e:cf:53",
            "net4": "2e:56:d5:4f:d7:70",
            "net5": "d2:d3:f4:53:ee:f4",
            "net6": "0a:8a:f6:32:8d:d0",
            "net7": "de:53:d9:4d:af:1d",
            "net8": "4e:f9:21:e3:fd:df",
            "net9": "c2:5a:f3:4a:13:54"
        },
        "spine_3_1_6": {
            "net0": "26:15:b1:99:c8:17",
            "net1": "fa:99:5d:08:86:07",
            "net10": "1a:cf:a8:db:45:71",
            "net11": "56:c4:09:ac:09:9f",
            "net2": "76:08:74:9b:ae:c7",
            "net3": "d2:b0:3e:46:8c:cc",
            "net4": "da:92:42:85:ab:ef",
            "net5": "ae:bc:36:3a:1f:49",
            "net6": "a6:9d:cc:8b:90:b1",
            "net7": "02:be:35:11:0b:a3",
            "net8": "3a:a6:81:e3:6f:37",
            "net9": "ca:4d:b1:77:41:9d"
        },
        "spine_4_1_1": {
            "net0": "d2:78:66:76:75:55",
            "net1": "b2:27:48:39:50:12",
            "net10": "c2:70:a7:4a:16:ec",
            "net11": "0e:98:f2:34:7a:02",
            "net2": "66:6a:6a:6b:41:9b",
            "net3": "62:c4:de:5a:69:1d",
            "net4": "d6:16:04:c4:ab:a5",
            "net5": "76:40:6c:f6:dc:ec",
            "net6": "6a:9a:c8:62:f7:98",
            "net7": "7e:89:4a:86:b8:cb",
            "net8": "fa:2b:98:2f:0b:1a",
            "net9": "c2:33:1a:ad:f0:9b"
        },
        "spine_4_1_2": {
            "net0": "32:69:0a:bd:68:60",
            "net1": "16:77:dd:fb:ec:a3",
            "net10": "1e:e3:a3:43:80:5b",
            "net11": "ee:82:80:24:14:5a",
            "net2": "2e:00:4e:31:86:37",
            "net3": "c6:1d:94:fb:4e:bc",
            "net4": "b2:ae:46:43:e1:0d",
            "net5": "b2:09:20:85:41:e1",
            "net6": "de:72:17:d9:cc:a4",
            "net7": "b2:45:57:50:ed:4e",
            "net8": "c6:c1:cf:fc:a4:25",
            "net9": "56:75:1d:a1:3f:6d"
        },
        "spine_4_1_3": {
            "net0": "2e:ba:51:49:bd:eb",
            "net1": "0a:44:a1:cd:12:86",
            "net10": "fa:56:21:f0:38:7f",
            "net11": "02:3a:c8:89:d7:3f",
            "net2": "fe:7b:c2:55:54:51",
            "net3": "c6:3d:e5:e1:62:08",
            "net4": "2e:0b:ec:9b:28:fe",
            "net5": "1a:02:c2:d6:0d:0a",
            "net6": "06:5a:9f:8a:ce:16",
            "net7": "2e:ff:b8:77:68:f3",
            "net8": "e6:65:49:29:4e:bd",
            "net9": "6e:62:a7:45:ba:fd"
        },
        "spine_4_1_4": {
            "net0": "ea:e1:96:fe:b5:8b",
            "net1": "ce:d9:66:a1:6d:fb",
            "net10": "de:ad:cb:5c:de:6a",
            "net11": "66:de:ef:c3:48:ad",
            "net2": "26:4b:a7:9f:1e:17",
            "net3": "92:08:71:bc:9f:6c",
            "net4": "aa:6d:ee:57:d1:88",
            "net5": "aa:82:2e:27:15:40",
            "net6": "9e:a8:49:0b:fe:8b",
            "net7": "d6:eb:b0:66:36:fe",
            "net8": "3a:c6:7c:44:4b:8b",
            "net9": "42:2d:ac:06:31:ee"
        },
        "spine_4_1_5": {
            "net0": "5e:c4:01:85:6a:1d",
            "net1": "e2:f8:99:51:6c:7c",
            "net10": "86:c4:38:c0:9e:8e",
            "net11": "82:fa:2e:bf:25:58",
            "net2": "b2:74:bf:f8:d1:88",
            "net3": "ae:3d:ac:42:ff:a8",
            "net4": "8e:0e:bd:8f:e4:f6",
            "net5": "e6:4f:e6:ff:bf:ee",
            "net6": "b2:c6:d8:45:7c:5d",
            "net7": "6a:d2:ad:97:02:c7",
            "net8": "9a:f8:c5:8f:d7:04",
            "net9": "7e:87:59:da:29:8d"
        },
        "spine_4_1_6": {
            "net0": "46:05:69:8d:6d:85",
            "net1": "ce:c2:7b:56:7e:87",
            "net10": "f2:25:21:af:75:46",
            "net11": "4e:ee:b1:88:7b:eb",
            "net2": "fe:e0:8a:b0:c0:c7",
            "net3": "4a:71:76:65:ba:fe",
            "net4": "3a:6d:48:b3:68:3b",
            "net5": "5a:25:da:f1:4f:18",
            "net6": "e2:69:65:48:f2:b4",
            "net7": "b2:0c:77:e9:40:b8",
            "net8": "be:c1:5c:08:f6:5a",
            "net9": "6a:2b:2d:70:4b:55"
        },
        "tof_1_2_1": {
            "net0": "82:34:94:10:dc:ae",
            "net1": "da:3e:64:1d:72:2a",
            "net10": "12:62:fc:24:ed:70",
            "net11": "1e:5b:74:0b:d0:ad",
            "net2": "ce:bc:1a:84:ce:fb",
            "net3": "26:7b:2a:46:b3:c2",
            "net4": "7a:fe:46:bc:0c:91",
            "net5": "4e:9f:cd:bb:a4:46",
            "net6": "96:c6:0d:12:a9:94",
            "net7": "4a:7c:ba:13:a1:4b",
            "net8": "52:4d:34:1f:6d:f7",
            "net9": "96:76:62:62:58:4b"
        },
        "tof_1_2_2": {
            "net0": "e6:10:b3:a7:b1:dc",
            "net1": "d2:f7:38:8b:b7:d5",
            "net10": "76:22:6d:8b:e4:89",
            "net11": "5a:4c:6c:fb:21:28",
            "net2": "4a:9d:c5:ba:09:ac",
            "net3": "9a:ee:9c:19:c1:31",
            "net4": "be:03:8a:5c:84:b8",
            "net5": "ae:57:96:07:37:7f",
            "net6": "b6:a0:26:36:2f:5e",
            "net7": "c6:c5:ff:c4:31:96",
            "net8": "72:18:4d:e9:f2:2d",
            "net9": "3a:c4:9f:6e:4c:80"
        },
        "tof_1_2_3": {
            "net0": "4a:de:0c:0a:e1:c1",
            "net1": "f6:17:ab:71:d7:e2",
            "net10": "1e:5a:57:c0:b3:ec",
            "net11": "ee:22:72:ca:62:f4",
            "net2": "aa:5f:9d:11:e9:1c",
            "net3": "d6:cb:cd:9c:aa:25",
            "net4": "4e:e0:eb:8a:a0:e1",
            "net5": "66:7b:de:e0:8c:59",
            "net6": "ee:df:da:b4:a8:f1",
            "net7": "02:10:1d:92:19:a4",
            "net8": "72:73:da:53:1d:a0",
            "net9": "52:d9:f2:8b:ff:53"
        },
        "tof_1_2_4": {
            "net0": "1a:8f:74:68:c6:a1",
            "net1": "ca:a4:fd:18:e5:9d",
            "net10": "a2:ab:be:b0:82:41",
            "net11": "4e:9b:bd:85:64:37",
            "net2": "42:ca:ec:88:0d:63",
            "net3": "3a:bb:84:83:a1:f7",
            "net4": "d2:b5:f7:dd:b3:90",
            "net5": "fe:20:ce:8a:72:33",
            "net6": "e6:f9:96:87:60:0d",
            "net7": "62:81:c1:78:9f:07",
            "net8": "0e:7e:0a:79:a3:97",
            "net9": "ca:62:15:16:ef:3d"
        },
        "tof_1_2_5": {
            "net0": "3e:f3:30:aa:e9:61",
            "net1": "8a:61:d0:f1:15:c3",
            "net10": "ae:85:cd:bb:75:cd",
            "net11": "42:a8:12:72:9d:4c",
            "net2": "5e:36:c7:93:8b:1d",
            "net3": "ba:db:5d:a3:14:d5",
            "net4": "c6:92:9f:7b:e4:60",
            "net5": "b2:bb:cb:a9:e4:2f",
            "net6": "4a:94:07:fe:91:b3",
            "net7": "be:52:56:a7:76:e7",
            "net8": "1a:fe:ae:2f:c9:60",
            "net9": "e6:bc:9d:19:55:07"
        },
        "tof_1_2_6": {
            "net0": "5e:b2:34:25:cb:09",
            "net1": "1a:d0:46:94:ba:4c",
            "net10": "ea:7a:80:16:5e:57",
            "net11": "6a:dc:c4:f0:7d:8e",
            "net2": "2e:5a:be:3e:a2:36",
            "net3": "ee:5c:8c:7f:2e:23",
            "net4": "b2:e5:e3:5d:0f:09",
            "net5": "0a:69:7c:45:ba:df",
            "net6": "f6:b1:d6:ba:10:af",
            "net7": "be:cb:af:e7:95:2d",
            "net8": "ce:e2:4e:05:f9:01",
            "net9": "a6:16:07:74:6d:30"
        },
        "tof_2_2_1": {
            "net0": "52:e8:e6:aa:74:c0",
            "net1": "86:23:95:f9:33:57",
            "net10": "c6:d5:6a:0e:3d:7e",
            "net11": "7e:6b:d2:75:28:5d",
            "net2": "0a:e0:25:fa:b9:20",
            "net3": "e2:3e:18:0c:29:e5",
            "net4": "1a:39:0c:07:f4:19",
            "net5": "3e:d7:7f:0f:ef:08",
            "net6": "0a:c3:28:65:50:85",
            "net7": "c2:a3:bb:f5:9e:41",
            "net8": "4a:b6:d3:3c:41:44",
            "net9": "62:94:e6:55:f7:27"
        },
        "tof_2_2_2": {
            "net0": "e2:c4:b0:0b:aa:d1",
            "net1": "ea:56:21:e4:86:78",
            "net10": "b6:29:80:64:4c:ba",
            "net11": "5e:f9:c2:39:c2:ff",
            "net2": "fa:94:d4:9a:ed:25",
            "net3": "b2:2c:1c:b2:9b:31",
            "net4": "fa:45:30:09:de:67",
            "net5": "42:85:2f:21:cb:1e",
            "net6": "e6:b3:bd:8e:52:94",
            "net7": "4a:e7:1b:4c:8d:dd",
            "net8": "5a:1c:bd:f7:de:3c",
            "net9": "5e:9f:bb:89:d0:b4"
        },
        "tof_2_2_3": {
            "net0": "26:e3:8a:8a:a6:4b",
            "net1": "7e:a3:0e:8f:89:28",
            "net10": "5e:e5:e7:c7:24:55",
            "net11": "1a:fc:d9:00:33:62",
            "net2": "0e:ae:32:e2:57:78",
            "net3": "ea:9f:3c:e5:6c:33",
            "net4": "ba:4f:6f:03:1e:e4",
            "net5": "06:d2:49:f5:6c:7e",
            "net6": "a2:f6:bf:05:67:57",
            "net7": "ba:f9:74:fa:85:ab",
            "net8": "b2:8f:ac:06:a3:be",
            "net9": "d2:45:e2:c0:44:b4"
        },
        "tof_2_2_4": {
            "net0": "62:f0:b4:05:3f:80",
            "net1": "6a:89:07:45:00:57",
            "net10": "3e:24:76:e0:8c:b0",
            "net11": "4e:8a:f7:c4:37:55",
            "net2": "ee:b5:04:fb:8b:d3",
            "net3": "fa:1b:21:cc:c7:cd",
            "net4": "0a:d8:b8:d4:77:09",
            "net5": "5a:f1:84:52:84:9e",
            "net6": "ee:e6:09:9b:97:fa",
            "net7": "72:1a:b3:16:84:0e",
            "net8": "32:00:9d:8a:3f:66",
            "net9": "06:70:88:0e:b4:99"
        },
        "tof_2_2_5": {
            "net0": "c6:81:cb:d5:2a:e3",
            "net1": "da:bb:5f:da:1d:0d",
            "net10": "26:79:a3:f7:66:51",
            "net11": "ce:9b:8f:7e:16:4a",
            "net2": "9e:c3:6e:f8:4c:dc",
            "net3": "2e:63:69:c7:88:b2",
            "net4": "ba:f0:c5:c0:05:d6",
            "net5": "fe:f9:34:18:1a:06",
            "net6": "ce:94:0e:85:0a:d1",
            "net7": "82:89:af:62:82:4b",
            "net8": "22:30:ec:dc:c9:d1",
            "net9": "f6:ad:33:1c:c7:50"
        },
        "tof_2_2_6": {
            "net0": "42:3b:ab:ff:5e:bc",
            "net1": "92:a5:23:d9:61:7f",
            "net10": "5e:e9:6c:34:3e:e5",
            "net11": "ea:47:62:38:88:8e",
            "net2": "c2:95:09:af:05:ef",
            "net3": "ae:51:32:b8:bc:fd",
            "net4": "f2:0f:6e:4d:df:93",
            "net5": "ba:44:fc:0a:06:30",
            "net6": "86:ad:b3:bb:c7:7d",
            "net7": "82:b3:89:68:6b:8b",
            "net8": "6a:1e:f4:90:f9:25",
            "net9": "92:13:94:50:4d:8f"
        }
    },
    "failed_machine": "spine_1_1_1",
    "failed_interfaces": [
        "net6"
    ],
    "failure_time": 1613576308.8840432
}