{
    "k_leaf": 2,
    "k_top": 2,
    "redundancy_factor": 2,
    "is_k8s": true,
    "machine_mac_addresses": {
        "leaf_1_0_1": {
            "net0": "06:b1:e7:b9:27:7c",
            "net1": "d6:fd:91:90:ba:64",
            "net2": "ee:15:78:4d:e0:6a"
        },
        "leaf_1_0_2": {
            "net0": "f6:fc:d8:dd:ec:84",
            "net1": "ba:b1:a5:7a:7d:3b",
            "net2": "aa:eb:0a:b8:5f:3f"
        },
        "leaf_2_0_1": {
            "net0": "a2:35:c8:12:37:34",
            "net1": "6e:5e:a9:f8:46:ab",
            "net2": "c6:75:28:cc:a0:a6"
        },
        "leaf_2_0_2": {
            "net0": "92:ba:ee:8d:dd:a7",
            "net1": "66:9e:41:11:10:4e",
            "net2": "4e:03:aa:0a:4f:c5"
        },
        "spine_1_1_1": {
            "net0": "56:f9:c9:67:b8:00",
            "net1": "f2:8b:c0:e3:b0:8e",
            "net2": "c2:3a:ea:b6:b9:73",
            "net3": "b2:fa:c1:41:f2:98"
        },
        "spine_1_1_2": {
            "net0": "ba:4c:22:63:88:d9",
            "net1": "d2:8b:f9:9e:f5:ad",
            "net2": "86:a3:07:8e:09:24",
            "net3": "8a:89:b9:ad:4c:fb"
        },
        "spine_2_1_1": {
            "net0": "82:eb:e1:4f:16:5e",
            "net1": "1e:5b:d1:f4:f6:c4",
            "net2": "5a:a7:e8:30:bb:cb",
            "net3": "9a:c6:37:b1:55:31"
        },
        "spine_2_1_2": {
            "net0": "7e:5c:0c:d4:b5:7c",
            "net1": "82:e3:c0:9a:c8:60",
            "net2": "2a:66:df:aa:0e:38",
            "net3": "6e:ba:85:96:dc:87"
        },
        "tof_1_2_1": {
            "net0": "ae:6a:bc:63:a5:69",
            "net1": "6a:f0:90:fc:5e:5c",
            "net2": "c2:32:85:35:c7:99",
            "net3": "0a:da:24:d2:88:cc"
        },
        "tof_1_2_2": {
            "net0": "a6:d5:02:64:9e:ce",
            "net1": "02:7b:ab:8c:01:e2",
            "net2": "ca:0d:91:61:89:16",
            "net3": "ea:4a:ab:74:6d:b3"
        }
    },
    "failed_machine": "leaf_1_0_1",
    "failure_time": {
        "leaf_1_0_1": 1622749663.6376026,
        "leaf_1_0_2": 1622749663.1441326,
        "leaf_2_0_1": 1622749663.637539,
        "leaf_2_0_2": 1622749663.6453156,
        "spine_1_1_1": 1622749663.653909,
        "spine_1_1_2": 1622749663.66569,
        "spine_2_1_1": 1622749663.6530058,
        "spine_2_1_2": 1622749663.6643565,
        "tof_1_2_1": 1622749663.673217,
        "tof_1_2_2": 1622749663.1851406
    }
}