{
    "k_leaf": 4,
    "k_top": 4,
    "redundancy_factor": 4,
    "is_k8s": true,
    "machine_mac_addresses": {
        "leaf_1_0_1": {
            "net0": "3e:4e:61:9c:83:b2",
            "net1": "e2:2b:57:57:29:50",
            "net2": "ce:1f:25:57:ed:2e",
            "net3": "36:56:cf:2e:05:d1",
            "net4": "32:a9:50:52:2e:f9"
        },
        "leaf_1_0_2": {
            "net0": "d6:66:8c:3d:93:df",
            "net1": "72:97:50:5d:ad:ca",
            "net2": "ee:33:dc:38:0f:ff",
            "net3": "32:5e:73:a3:67:b0",
            "net4": "82:c7:f0:19:06:0e"
        },
        "leaf_1_0_3": {
            "net0": "7e:50:12:3d:d4:dd",
            "net1": "4a:09:36:fc:7e:1c",
            "net2": "76:ba:3e:bd:80:70",
            "net3": "5e:cb:e9:4b:16:cc",
            "net4": "f6:da:6b:d6:64:07"
        },
        "leaf_1_0_4": {
            "net0": "c2:5e:22:dc:c8:f8",
            "net1": "22:63:1d:04:3e:7a",
            "net2": "1e:46:fe:74:82:43",
            "net3": "e6:37:80:db:ec:13",
            "net4": "d2:ce:5e:60:c8:ae"
        },
        "leaf_2_0_1": {
            "net0": "5a:7a:7e:89:17:b5",
            "net1": "1e:a9:63:c7:52:3a",
            "net2": "12:de:94:37:2e:c3",
            "net3": "de:29:e6:d2:8c:a7",
            "net4": "2a:54:47:bc:25:28"
        },
        "leaf_2_0_2": {
            "net0": "36:44:36:dc:85:17",
            "net1": "5a:3f:c1:2d:25:61",
            "net2": "aa:69:57:54:e9:4e",
            "net3": "fe:06:04:e0:e7:e6",
            "net4": "82:2f:2c:85:43:b1"
        },
        "leaf_2_0_3": {
            "net0": "de:74:5a:a9:92:13",
            "net1": "72:29:ce:ad:9b:27",
            "net2": "86:cf:47:4d:d4:72",
            "net3": "ae:05:d9:7e:2b:f6",
            "net4": "d2:2a:3a:94:dd:de"
        },
        "leaf_2_0_4": {
            "net0": "ea:ae:74:bb:a3:f9",
            "net1": "e2:ee:92:1f:3f:39",
            "net2": "46:aa:26:40:d2:41",
            "net3": "a2:c8:db:42:d9:55",
            "net4": "ee:43:07:52:f4:6e"
        },
        "spine_1_1_1": {
            "net0": "a2:be:e6:e1:2f:e2",
            "net1": "ae:32:36:4e:c3:81",
            "net2": "9e:10:8d:42:35:17",
            "net3": "12:12:b7:cc:c6:26",
            "net4": "d6:4c:25:84:ae:b9",
            "net5": "02:7a:df:80:e3:62",
            "net6": "ce:ba:43:f5:c8:e1",
            "net7": "9a:f5:f5:77:04:91"
        },
        "spine_1_1_2": {
            "net0": "ce:21:a3:31:2e:f3",
            "net1": "46:2b:f1:8b:56:e0",
            "net2": "6a:64:07:6c:ca:0c",
            "net3": "26:7b:c1:46:3c:5e",
            "net4": "ba:48:05:b6:ee:ba",
            "net5": "56:f4:b6:46:c6:38",
            "net6": "b6:c2:f1:46:f4:c0",
            "net7": "56:81:90:94:10:f3"
        },
        "spine_1_1_3": {
            "net0": "ea:dd:05:d2:35:99",
            "net1": "4e:75:3d:e5:10:9d",
            "net2": "86:75:64:79:23:d6",
            "net3": "5e:3f:9b:38:19:05",
            "net4": "86:f9:76:f5:c9:42",
            "net5": "7a:56:4c:c1:c0:df",
            "net6": "da:45:a6:bb:f3:32",
            "net7": "72:71:17:d2:2e:de"
        },
        "spine_1_1_4": {
            "net0": "e6:2d:9f:89:a2:ce",
            "net1": "f2:9b:11:e1:20:c2",
            "net2": "fa:b8:94:0b:09:54",
            "net3": "4a:99:96:be:f7:ab",
            "net4": "ee:47:20:6d:ce:a6",
            "net5": "1a:f9:ee:b9:a7:b5",
            "net6": "1e:72:d4:40:c6:d3",
            "net7": "22:3a:04:e9:7c:cc"
        },
        "spine_2_1_1": {
            "net0": "8e:5d:06:cf:5c:da",
            "net1": "06:7e:c3:81:4b:a4",
            "net2": "3e:66:14:a5:a2:87",
            "net3": "fe:56:af:70:c0:f4",
            "net4": "ba:eb:fa:f9:95:e0",
            "net5": "76:07:ee:ad:a1:71",
            "net6": "2e:43:4e:81:f8:e7",
            "net7": "0e:c6:7b:6a:15:db"
        },
        "spine_2_1_2": {
            "net0": "6e:cc:43:8c:7b:65",
            "net1": "12:74:f1:87:ba:4f",
            "net2": "a6:1d:3a:e3:26:8a",
            "net3": "7e:b0:22:1d:a6:36",
            "net4": "a2:30:c2:92:60:8f",
            "net5": "9e:1f:6f:d4:3a:be",
            "net6": "e2:1d:35:31:8a:82",
            "net7": "c2:0d:2e:9e:67:10"
        },
        "spine_2_1_3": {
            "net0": "6e:79:cf:a7:ca:a2",
            "net1": "3e:62:30:68:5a:6e",
            "net2": "ba:c6:09:54:07:d6",
            "net3": "1a:bb:bf:ec:97:20",
            "net4": "86:3c:fe:99:37:8d",
            "net5": "6a:ac:09:0b:83:52",
            "net6": "52:15:a4:0e:83:8f",
            "net7": "92:c4:3c:ee:51:c5"
        },
        "spine_2_1_4": {
            "net0": "e2:73:4a:19:07:ec",
            "net1": "3e:d7:e9:41:c2:d5",
            "net2": "8a:72:6c:2f:0e:7f",
            "net3": "4e:44:77:00:05:3c",
            "net4": "5a:bb:be:7b:e5:15",
            "net5": "8e:80:f9:20:c0:b9",
            "net6": "da:b3:25:9b:ac:e8",
            "net7": "0e:c5:44:e6:f4:d9"
        },
        "tof_1_2_1": {
            "net0": "66:2e:a8:67:b0:ac",
            "net1": "c6:99:bc:a1:e0:7a",
            "net2": "3e:79:9c:4d:71:5c",
            "net3": "1a:2a:be:87:ab:f8",
            "net4": "ae:7f:85:cd:6e:d1",
            "net5": "0a:ca:96:33:af:2c",
            "net6": "da:f1:29:ac:e1:42",
            "net7": "6e:c0:05:1e:d0:01"
        },
        "tof_1_2_2": {
            "net0": "5a:de:af:33:2f:76",
            "net1": "ca:59:32:9f:1f:f9",
            "net2": "ba:4a:ac:d6:1a:20",
            "net3": "4a:8f:6f:0a:e7:56",
            "net4": "e2:5c:80:60:1d:6a",
            "net5": "66:91:48:0b:c2:3e",
            "net6": "02:35:ff:67:5b:5c",
            "net7": "66:e3:01:f5:d5:d2"
        },
        "tof_1_2_3": {
            "net0": "66:78:24:04:4e:68",
            "net1": "06:c5:c8:4b:7b:c1",
            "net2": "2a:58:f4:4c:78:3c",
            "net3": "ae:44:04:e7:33:f6",
            "net4": "1a:de:51:f0:22:12",
            "net5": "ba:a3:a7:fa:55:9b",
            "net6": "06:91:2b:5a:a8:54",
            "net7": "06:93:3e:63:b0:18"
        },
        "tof_1_2_4": {
            "net0": "76:95:b0:9b:fb:e2",
            "net1": "be:b5:fb:28:56:2d",
            "net2": "c2:f9:73:77:f6:00",
            "net3": "f6:ed:f3:89:4f:92",
            "net4": "86:6c:aa:a3:24:ba",
            "net5": "46:a0:fa:52:5b:8d",
            "net6": "72:b7:e5:b4:c0:56",
            "net7": "02:d2:51:a7:02:45"
        }
    },
    "failed_machine": "leaf_1_0_1",
    "failure_time": {
        "leaf_1_0_1": 1622564174.6565197,
        "leaf_1_0_2": 1622564174.6704636,
        "leaf_1_0_3": 1622564174.6763325,
        "leaf_1_0_4": 1622564174.659521,
        "leaf_2_0_1": 1622564174.67144,
        "leaf_2_0_2": 1622564174.6793733,
        "leaf_2_0_3": 1622564174.6832685,
        "leaf_2_0_4": 1622564174.6888673,
        "spine_1_1_1": 1622564174.6967196,
        "spine_1_1_2": 1622564174.687749,
        "spine_1_1_3": 1622564174.6959252,
        "spine_1_1_4": 1622564174.702564,
        "spine_2_1_1": 1622564174.7051358,
        "spine_2_1_2": 1622564174.7128701,
        "spine_2_1_3": 1622564174.7207503,
        "spine_2_1_4": 1622564174.7092252,
        "tof_1_2_1": 1622564174.7159557,
        "tof_1_2_2": 1622564174.7303977,
        "tof_1_2_3": 1622564174.7320986,
        "tof_1_2_4": 1622564174.7437441
    }
}