{
    "k_leaf": 16,
    "k_top": 16,
    "redundancy_factor": 16,
    "is_k8s": true,
    "machine_mac_addresses": {
        "leaf_1_0_1": {
            "net0": "1a:36:34:9c:c1:ef",
            "net1": "62:5c:91:7c:83:5e",
            "net10": "9a:86:61:24:a3:82",
            "net11": "de:25:57:7d:0e:84",
            "net12": "16:e5:68:52:ff:4f",
            "net13": "52:a9:16:44:14:e4",
            "net14": "c2:17:0f:1b:fc:88",
            "net15": "72:8f:28:c2:8d:76",
            "net16": "7e:87:ad:90:3a:04",
            "net2": "9e:2f:3a:a2:7f:01",
            "net3": "e2:6f:f9:91:4e:22",
            "net4": "ce:2d:02:96:80:5b",
            "net5": "aa:6c:c5:5b:9c:b3",
            "net6": "b6:08:32:70:88:59",
            "net7": "8e:47:ef:e6:4e:53",
            "net8": "e6:a3:22:81:b2:a8",
            "net9": "fa:d6:9f:b1:de:9d"
        },
        "leaf_1_0_10": {
            "net0": "9e:21:8c:02:da:02",
            "net1": "46:b8:0f:da:8a:24",
            "net10": "f6:76:f9:f5:3d:09",
            "net11": "c6:17:0c:8c:a0:43",
            "net12": "aa:78:cd:c6:47:77",
            "net13": "12:39:30:23:a0:70",
            "net14": "0e:6e:ef:ac:b5:25",
            "net15": "fe:af:96:00:24:5b",
            "net16": "c2:61:be:43:3b:f0",
            "net2": "46:c4:c1:56:2a:bf",
            "net3": "7a:c6:4d:54:c4:fb",
            "net4": "2e:e5:fd:94:cf:3a",
            "net5": "da:f3:7e:f7:ca:f5",
            "net6": "b6:9c:49:cb:6e:26",
            "net7": "f2:05:4b:59:3e:a8",
            "net8": "1a:c4:63:af:de:e9",
            "net9": "96:52:79:55:24:3e"
        },
        "leaf_1_0_11": {
            "net0": "e6:c2:24:4e:59:fa",
            "net1": "a2:1e:24:9b:0e:e1",
            "net10": "2e:7e:3b:2c:29:75",
            "net11": "46:04:de:8c:22:c3",
            "net12": "da:29:03:fc:14:6e",
            "net13": "4a:ef:7c:50:b2:68",
            "net14": "62:ea:e2:db:0f:2c",
            "net15": "3e:cc:80:a2:04:a8",
            "net16": "fe:05:83:c0:5d:cf",
            "net2": "8e:96:6c:25:8e:06",
            "net3": "32:73:d7:7f:1e:b6",
            "net4": "c2:43:1e:2a:e3:06",
            "net5": "02:fb:f7:61:0d:3b",
            "net6": "e6:6d:ed:60:e3:53",
            "net7": "06:15:d1:2d:1f:69",
            "net8": "46:17:09:e3:fe:99",
            "net9": "d6:7c:50:be:9e:79"
        },
        "leaf_1_0_12": {
            "net0": "aa:16:84:9f:35:ce",
            "net1": "fa:5c:2d:11:24:c5",
            "net10": "e6:50:ea:03:3a:9f",
            "net11": "1e:a6:58:29:d1:79",
            "net12": "a6:fb:e2:69:18:27",
            "net13": "8e:5d:64:c3:23:c2",
            "net14": "d6:5f:c6:1e:41:9d",
            "net15": "96:6a:9c:72:c3:a9",
            "net16": "d6:3b:1f:d9:dc:f2",
            "net2": "2e:2e:e7:80:bb:d2",
            "net3": "b2:59:12:f9:64:81",
            "net4": "62:be:e4:3b:2d:3b",
            "net5": "2a:92:d4:86:a9:b1",
            "net6": "e2:34:48:7f:0a:2f",
            "net7": "e6:1f:3e:88:a5:d9",
            "net8": "46:57:6f:3b:4a:df",
            "net9": "7e:11:67:c9:9e:39"
        },
        "leaf_1_0_13": {
            "net0": "be:4d:e3:11:31:61",
            "net1": "ea:63:46:5e:a6:55",
            "net10": "4a:f9:18:5b:40:3f",
            "net11": "6a:9d:37:d7:84:ef",
            "net12": "3e:68:61:cb:06:85",
            "net13": "62:76:b7:45:5e:d1",
            "net14": "b6:ca:59:04:e1:e3",
            "net15": "1a:91:81:e7:d5:63",
            "net16": "de:f2:32:0b:66:54",
            "net2": "8e:ff:a3:72:ae:a9",
            "net3": "5e:54:ad:89:14:d8",
            "net4": "9e:be:cc:1e:3a:3f",
            "net5": "ce:29:7a:cb:24:98",
            "net6": "c6:81:c7:5e:0f:ea",
            "net7": "5e:26:cd:5b:72:f9",
            "net8": "4a:67:7d:43:6e:e9",
            "net9": "a2:b3:54:54:78:75"
        },
        "leaf_1_0_14": {
            "net0": "1a:79:b6:19:6c:ba",
            "net1": "f2:86:e7:82:77:bb",
            "net10": "16:56:0a:b1:00:c8",
            "net11": "2a:b1:4b:20:fe:d4",
            "net12": "4a:c0:8c:c9:fd:66",
            "net13": "52:a7:7d:99:78:c0",
            "net14": "fe:b7:6b:ae:12:83",
            "net15": "f6:1f:25:95:4a:33",
            "net16": "8a:5d:7e:d4:37:24",
            "net2": "86:12:67:6d:ef:40",
            "net3": "5a:81:d7:98:38:6d",
            "net4": "6a:dd:4d:13:78:b7",
            "net5": "02:f1:e7:c3:f0:2c",
            "net6": "4e:18:b9:41:5f:69",
            "net7": "86:58:11:b1:63:8c",
            "net8": "06:43:a1:b0:63:f3",
            "net9": "92:91:9e:09:cc:48"
        },
        "leaf_1_0_15": {
            "net0": "a6:85:fa:84:28:5b",
            "net1": "4a:fb:05:93:d2:84",
            "net10": "da:30:cd:32:e0:1d",
            "net11": "4a:3b:df:89:8f:fe",
            "net12": "56:9d:d8:c2:81:5b",
            "net13": "a2:4e:58:9b:a8:c6",
            "net14": "0e:73:41:fc:dc:c5",
            "net15": "7e:57:09:b5:05:ed",
            "net16": "72:67:05:25:3d:d6",
            "net2": "0e:95:17:c4:a6:0a",
            "net3": "06:9c:a9:2e:27:ed",
            "net4": "fa:50:5e:43:56:a1",
            "net5": "16:28:39:be:21:10",
            "net6": "e6:6e:e3:46:be:70",
            "net7": "42:45:c0:55:52:c6",
            "net8": "06:26:16:2f:5b:61",
            "net9": "1e:a5:d2:5f:24:05"
        },
        "leaf_1_0_16": {
            "net0": "4a:2b:c8:5d:8e:21",
            "net1": "62:44:08:50:a8:67",
            "net10": "7e:b5:70:73:cb:64",
            "net11": "c2:a6:da:31:a8:6b",
            "net12": "36:b4:23:01:23:28",
            "net13": "7e:61:75:c3:98:c2",
            "net14": "3e:05:47:ce:23:36",
            "net15": "32:61:67:2c:28:e5",
            "net16": "6e:28:c5:73:7b:35",
            "net2": "6e:bc:e6:d2:e0:4d",
            "net3": "16:9f:34:9b:a1:ac",
            "net4": "32:fb:ef:b9:48:24",
            "net5": "de:86:27:bb:28:85",
            "net6": "9a:5c:37:c8:59:7d",
            "net7": "fe:ed:a1:9e:48:d1",
            "net8": "76:ed:f6:02:d8:1b",
            "net9": "f2:f4:2d:27:b8:07"
        },
        "leaf_1_0_2": {
            "net0": "fe:6f:a0:98:e8:b6",
            "net1": "de:b3:8d:79:00:62",
            "net10": "92:ee:3d:79:57:51",
            "net11": "26:d4:bb:46:85:9c",
            "net12": "ee:77:6a:14:91:01",
            "net13": "0a:48:4b:77:ab:72",
            "net14": "5e:d6:2e:70:f7:70",
            "net15": "c2:52:0e:9f:26:86",
            "net16": "4a:c6:80:25:90:c8",
            "net2": "a2:fc:7f:43:19:ed",
            "net3": "66:3a:49:f2:36:d5",
            "net4": "22:38:e0:d3:17:97",
            "net5": "0e:a9:51:ba:1b:bd",
            "net6": "ae:39:c5:ef:c3:1e",
            "net7": "da:57:a8:5c:4e:6c",
            "net8": "d2:26:7f:ad:f9:80",
            "net9": "4e:e2:1e:c2:a0:0a"
        },
        "leaf_1_0_3": {
            "net0": "16:d5:7d:38:52:ce",
            "net1": "06:f1:44:7b:ee:e2",
            "net10": "da:c1:fb:e3:b1:16",
            "net11": "26:32:90:35:a5:f8",
            "net12": "6a:56:51:92:1b:7e",
            "net13": "76:17:2b:0b:f1:c6",
            "net14": "12:e7:f7:96:40:3d",
            "net15": "4e:bb:3d:7d:95:8d",
            "net16": "8e:50:68:57:bd:70",
            "net2": "26:5b:73:5c:d8:a2",
            "net3": "8e:c1:1d:05:5e:5d",
            "net4": "8a:b3:ec:9d:7f:6d",
            "net5": "e2:a2:15:35:6b:7c",
            "net6": "3e:4c:5c:28:1f:40",
            "net7": "e6:3b:e1:cb:06:bf",
            "net8": "06:54:e4:c1:bb:93",
            "net9": "be:5f:eb:19:2b:8b"
        },
        "leaf_1_0_4": {
            "net0": "26:32:66:00:61:e1",
            "net1": "32:c2:d2:47:23:5d",
            "net10": "62:97:61:76:6b:3f",
            "net11": "ba:46:18:76:c4:6f",
            "net12": "12:5d:9b:25:66:21",
            "net13": "3e:0d:ec:f3:70:92",
            "net14": "ae:c2:c2:d7:ff:37",
            "net15": "c2:6d:6d:25:1e:f9",
            "net16": "46:8a:8b:ca:78:19",
            "net2": "b2:b1:5e:1c:3c:af",
            "net3": "6a:c6:fc:ad:ee:40",
            "net4": "a6:64:fc:a0:0b:16",
            "net5": "12:71:73:49:47:64",
            "net6": "ee:9b:cd:6c:6e:3b",
            "net7": "32:5b:38:9e:5e:e4",
            "net8": "f6:3d:4f:d8:21:b3",
            "net9": "0a:24:f7:c6:2a:0b"
        },
        "leaf_1_0_5": {
            "net0": "92:8c:fd:62:42:ed",
            "net1": "ca:70:a1:9e:ad:ca",
            "net10": "26:de:22:bf:cf:11",
            "net11": "82:c5:f9:7b:39:7a",
            "net12": "ea:59:b8:c6:4d:1a",
            "net13": "56:93:85:cc:d1:45",
            "net14": "42:8d:07:27:54:66",
            "net15": "6e:b8:7f:76:ef:6c",
            "net16": "4a:48:fa:fc:e8:60",
            "net2": "ba:f1:ed:69:ea:e9",
            "net3": "72:8a:d3:32:a3:a5",
            "net4": "56:ca:1b:bc:92:a5",
            "net5": "fa:37:8b:dd:bb:82",
            "net6": "82:11:d5:c7:c2:60",
            "net7": "d6:8e:7e:b6:72:a0",
            "net8": "4e:26:ff:8f:90:af",
            "net9": "f2:05:5e:0d:79:e1"
        },
        "leaf_1_0_6": {
            "net0": "a2:87:51:37:e1:8f",
            "net1": "ea:3f:21:80:aa:f9",
            "net10": "ea:5c:f8:10:6d:84",
            "net11": "f2:a1:b9:98:bd:73",
            "net12": "46:ce:f4:db:e8:49",
            "net13": "3a:95:eb:2f:b6:ae",
            "net14": "66:f4:45:75:74:c2",
            "net15": "42:c2:c6:62:70:5d",
            "net16": "06:87:8c:bc:92:73",
            "net2": "16:63:ec:d1:ee:77",
            "net3": "52:61:d4:39:e9:58",
            "net4": "1a:37:68:6a:cc:00",
            "net5": "12:ab:30:50:98:89",
            "net6": "ee:2c:b4:cf:21:6b",
            "net7": "d2:78:8b:5a:9f:07",
            "net8": "42:d0:53:8f:be:d9",
            "net9": "0a:b8:a1:9f:a8:07"
        },
        "leaf_1_0_7": {
            "net0": "ce:ee:00:0b:d7:b3",
            "net1": "46:6c:3c:52:8a:82",
            "net10": "da:e9:b7:ba:81:cf",
            "net11": "86:cd:ea:b8:f6:13",
            "net12": "1a:69:22:84:f3:8d",
            "net13": "4e:ac:a1:96:4f:7a",
            "net14": "56:b2:1a:86:9d:93",
            "net15": "7e:b2:27:03:a9:a7",
            "net16": "9e:64:19:4b:b0:f3",
            "net2": "1a:e9:4b:ef:ea:06",
            "net3": "de:b8:b9:e0:0d:7d",
            "net4": "96:e0:51:1a:0e:a2",
            "net5": "b2:1b:71:44:71:68",
            "net6": "a2:23:77:19:c2:f2",
            "net7": "22:d7:95:21:67:e9",
            "net8": "06:c1:bc:ac:55:98",
            "net9": "aa:76:a7:f5:33:c7"
        },
        "leaf_1_0_8": {
            "net0": "be:8d:0f:f2:31:b7",
            "net1": "2e:52:64:19:da:f8",
            "net10": "06:16:dd:de:ae:b9",
            "net11": "7e:4d:09:06:aa:dd",
            "net12": "82:36:d3:36:e9:25",
            "net13": "e6:38:3c:5b:bf:58",
            "net14": "ea:70:e0:78:fe:76",
            "net15": "0e:32:57:98:92:cf",
            "net16": "96:b5:ec:35:4e:fa",
            "net2": "d6:c8:2c:93:08:d6",
            "net3": "fa:c1:db:d5:4c:4d",
            "net4": "9e:93:28:c2:6b:b3",
            "net5": "56:aa:60:64:12:8c",
            "net6": "f6:b6:3e:6f:e1:b7",
            "net7": "26:04:39:e6:c7:bc",
            "net8": "42:36:0e:85:15:0f",
            "net9": "46:b5:e8:f3:52:ae"
        },
        "leaf_1_0_9": {
            "net0": "82:81:e3:6c:57:bb",
            "net1": "e2:e1:c3:3b:01:0e",
            "net10": "0e:25:39:3b:ea:1c",
            "net11": "36:49:43:58:ae:f8",
            "net12": "4e:3b:a2:45:4f:20",
            "net13": "c2:29:2a:d8:ba:e3",
            "net14": "de:e2:7d:fc:b7:b5",
            "net15": "3a:cc:3c:f6:e2:45",
            "net16": "8a:4b:c5:e6:ad:60",
            "net2": "96:15:ef:ae:4b:36",
            "net3": "fa:73:11:00:ab:81",
            "net4": "b6:73:e1:89:2e:b7",
            "net5": "9e:37:ae:07:c7:a2",
            "net6": "3e:2a:e8:51:1c:fa",
            "net7": "f2:35:e0:f6:7a:b5",
            "net8": "5a:b5:df:ed:e8:11",
            "net9": "f2:34:4c:5a:fc:c3"
        },
        "leaf_2_0_1": {
            "net0": "9e:1d:16:62:dd:c6",
            "net1": "b6:98:82:5c:fb:89",
            "net10": "de:88:04:9a:13:26",
            "net11": "ee:29:92:e0:a8:27",
            "net12": "8a:dc:c2:1c:63:8e",
            "net13": "4e:38:14:20:ae:38",
            "net14": "fe:08:9b:c5:ac:ef",
            "net15": "62:50:5f:59:7d:a0",
            "net16": "96:5d:53:fc:0b:d5",
            "net2": "5a:08:f2:aa:6f:27",
            "net3": "3a:ef:b0:a6:1a:d3",
            "net4": "16:ed:2b:7c:c7:ef",
            "net5": "0a:e0:68:2c:92:19",
            "net6": "f6:52:33:f7:2a:d7",
            "net7": "12:c7:e5:f0:40:b8",
            "net8": "6e:fb:3b:c9:35:a6",
            "net9": "9a:92:57:ed:2d:70"
        },
        "leaf_2_0_10": {
            "net0": "da:c9:aa:ba:6c:95",
            "net1": "3e:71:26:95:28:97",
            "net10": "52:cb:75:32:9f:53",
            "net11": "b2:f2:77:ce:72:a3",
            "net12": "82:be:30:30:e0:f6",
            "net13": "7e:b9:e6:2b:ce:19",
            "net14": "da:49:37:a3:ea:80",
            "net15": "56:6c:78:a9:02:fa",
            "net16": "4e:e9:60:9f:fb:03",
            "net2": "82:9d:06:4e:a6:fc",
            "net3": "f6:82:4a:98:cf:63",
            "net4": "4e:47:26:e4:f5:a1",
            "net5": "3a:eb:d3:51:ae:85",
            "net6": "b2:25:d0:e1:6d:9f",
            "net7": "ea:d6:33:20:92:46",
            "net8": "2a:eb:ba:f6:5c:83",
            "net9": "7a:85:79:9f:b0:52"
        },
        "leaf_2_0_11": {
            "net0": "4a:75:b8:01:e9:69",
            "net1": "4e:e9:69:f0:a0:04",
            "net10": "2e:31:25:8c:59:c9",
            "net11": "de:d1:71:55:71:7f",
            "net12": "8a:7a:0e:65:55:65",
            "net13": "2e:e9:0d:94:c9:e1",
            "net14": "76:7d:53:1e:51:7b",
            "net15": "96:52:d0:9a:83:d4",
            "net16": "22:89:de:d1:48:89",
            "net2": "36:f5:9a:c6:45:f4",
            "net3": "7a:4b:76:e0:91:92",
            "net4": "ae:cd:4d:48:62:f2",
            "net5": "7a:c8:3a:92:6e:35",
            "net6": "4a:5b:3f:ac:66:d7",
            "net7": "12:20:6c:85:3c:44",
            "net8": "b6:21:1f:b1:52:25",
            "net9": "aa:0c:b8:49:c2:44"
        },
        "leaf_2_0_12": {
            "net0": "da:46:f1:b4:0b:f8",
            "net1": "9e:bd:ec:9e:25:75",
            "net10": "f6:08:cf:23:63:a9",
            "net11": "ba:50:aa:00:1e:be",
            "net12": "7e:c5:ad:5b:c2:c8",
            "net13": "be:8a:b0:5c:e4:a5",
            "net14": "e2:02:84:d7:1f:1b",
            "net15": "82:62:be:25:69:b1",
            "net16": "86:da:4c:3d:3f:74",
            "net2": "12:9b:81:f9:23:f6",
            "net3": "ae:e5:20:e5:27:42",
            "net4": "5a:96:75:aa:d7:ea",
            "net5": "8e:73:87:2e:84:b2",
            "net6": "2e:84:c1:72:c8:28",
            "net7": "d2:33:c2:f4:39:7e",
            "net8": "8a:01:90:f9:35:35",
            "net9": "0a:99:e9:82:52:cc"
        },
        "leaf_2_0_13": {
            "net0": "42:ed:43:31:5e:72",
            "net1": "e2:cf:02:7b:93:52",
            "net10": "3e:8d:85:e1:79:4f",
            "net11": "8e:d8:82:bf:93:4e",
            "net12": "8a:bf:44:39:a6:a6",
            "net13": "72:ca:b3:49:b3:48",
            "net14": "5a:45:56:3f:d9:82",
            "net15": "96:ba:c3:36:a8:dc",
            "net16": "ea:27:7b:a1:cd:85",
            "net2": "76:0a:9a:dd:92:78",
            "net3": "be:27:f2:af:bf:57",
            "net4": "12:1a:35:dd:4c:19",
            "net5": "32:e0:ed:b0:90:1d",
            "net6": "e2:d5:73:5b:e6:ab",
            "net7": "5e:62:3f:e0:dd:d2",
            "net8": "52:d7:5f:5a:df:d9",
            "net9": "e2:b9:8f:93:ea:34"
        },
        "leaf_2_0_14": {
            "net0": "3a:fc:d1:30:0c:2a",
            "net1": "1e:8f:38:16:a0:b6",
            "net10": "2e:e5:78:f6:86:1e",
            "net11": "7e:17:63:ad:fa:88",
            "net12": "32:a5:8a:d0:ce:b9",
            "net13": "82:9c:f2:db:3a:8b",
            "net14": "ae:59:9a:4d:33:79",
            "net15": "0e:18:15:c7:ab:5a",
            "net16": "9e:ea:0e:59:5e:91",
            "net2": "de:bc:fa:46:7d:be",
            "net3": "36:26:b5:d4:9d:8c",
            "net4": "92:31:e5:65:72:60",
            "net5": "7e:22:3f:cf:55:f8",
            "net6": "6a:7c:c2:3b:c0:94",
            "net7": "c2:cc:4d:2a:d0:d0",
            "net8": "4a:8f:87:ac:cf:91",
            "net9": "d2:b7:f2:30:3a:7e"
        },
        "leaf_2_0_15": {
            "net0": "7a:74:07:45:94:d4",
            "net1": "32:b8:92:34:1f:d3",
            "net10": "62:7e:0e:1b:80:f4",
            "net11": "12:e0:bc:8d:25:40",
            "net12": "56:f1:94:8d:bc:2d",
            "net13": "4e:6f:29:a7:b7:d1",
            "net14": "8e:82:97:b1:4a:e8",
            "net15": "ee:14:72:09:78:42",
            "net16": "6e:c2:c7:35:e2:a3",
            "net2": "36:c2:c5:fb:04:3b",
            "net3": "c6:3c:d3:b4:cb:26",
            "net4": "aa:8b:91:cc:45:75",
            "net5": "b2:38:19:64:b4:a4",
            "net6": "8a:11:3a:19:24:aa",
            "net7": "f6:ef:4f:54:de:f4",
            "net8": "b6:8c:7a:0d:19:eb",
            "net9": "86:26:75:62:a6:1f"
        },
        "leaf_2_0_16": {
            "net0": "d6:1c:fc:f6:eb:cc",
            "net1": "02:9b:c9:95:81:35",
            "net10": "ee:a5:5f:8b:cc:28",
            "net11": "f6:e7:e8:f7:b3:5d",
            "net12": "3e:c2:12:dd:19:af",
            "net13": "ee:31:8c:a9:af:ed",
            "net14": "a6:62:5d:96:c6:35",
            "net15": "66:fe:e6:13:b7:75",
            "net16": "46:90:90:85:e4:2e",
            "net2": "ca:d4:af:27:a6:6f",
            "net3": "4e:a2:37:8e:18:92",
            "net4": "c6:63:a1:d4:d7:a1",
            "net5": "92:66:49:2b:e6:dc",
            "net6": "1e:50:e0:e1:82:48",
            "net7": "de:ef:fb:36:25:85",
            "net8": "b2:17:e6:a3:ea:3d",
            "net9": "66:67:fa:d4:96:74"
        },
        "leaf_2_0_2": {
            "net0": "fa:ca:9e:6f:3e:57",
            "net1": "ba:fc:bb:9d:3f:e1",
            "net10": "ee:22:cc:d1:ae:30",
            "net11": "16:ef:bf:db:ba:4d",
            "net12": "0e:2d:ef:90:4d:57",
            "net13": "aa:8e:41:a7:7a:bb",
            "net14": "c2:d4:0c:34:bd:75",
            "net15": "52:a5:70:fb:2f:05",
            "net16": "0e:db:17:7a:05:9b",
            "net2": "36:84:dc:87:f8:36",
            "net3": "4e:e6:c0:03:5e:be",
            "net4": "82:98:1f:08:8d:53",
            "net5": "92:34:fc:76:57:65",
            "net6": "ae:fc:fd:0b:1d:94",
            "net7": "4a:5f:1d:76:51:de",
            "net8": "46:16:62:6a:11:23",
            "net9": "02:8e:a2:3e:79:f7"
        },
        "leaf_2_0_3": {
            "net0": "7a:57:32:42:e0:c7",
            "net1": "e6:30:91:93:31:5b",
            "net10": "22:fd:9f:42:31:b0",
            "net11": "ca:2d:71:31:dd:03",
            "net12": "26:fb:6a:1f:e6:c9",
            "net13": "2e:7a:44:c8:d1:0e",
            "net14": "ce:62:20:d2:fc:cb",
            "net15": "c6:68:9c:50:b4:97",
            "net16": "ba:63:c8:1e:64:b5",
            "net2": "76:4f:0d:ac:12:fb",
            "net3": "da:a5:55:89:4e:f7",
            "net4": "16:f6:c6:c3:ce:62",
            "net5": "86:d1:25:14:49:e5",
            "net6": "ee:aa:fa:e3:d6:a1",
            "net7": "76:ae:57:12:33:41",
            "net8": "8e:68:61:55:01:70",
            "net9": "56:21:4d:cf:4c:8a"
        },
        "leaf_2_0_4": {
            "net0": "72:68:47:77:b9:ae",
            "net1": "f6:27:31:fe:42:dd",
            "net10": "d2:6e:52:84:8d:58",
            "net11": "ae:da:1e:b2:a7:09",
            "net12": "9a:c9:cb:c8:bd:b6",
            "net13": "46:88:bc:09:7d:21",
            "net14": "02:34:c3:6d:ef:98",
            "net15": "4e:ca:7c:89:5e:70",
            "net16": "92:13:77:bc:89:56",
            "net2": "9e:41:0b:11:4b:bb",
            "net3": "6e:f0:76:30:28:64",
            "net4": "a2:a9:ca:a5:da:50",
            "net5": "c2:d5:37:41:83:26",
            "net6": "16:23:1c:7c:c0:0f",
            "net7": "be:af:3d:63:c4:40",
            "net8": "4a:08:1f:56:77:fb",
            "net9": "8e:63:db:0a:97:52"
        },
        "leaf_2_0_5": {
            "net0": "aa:b2:5a:a4:5e:cf",
            "net1": "e6:a0:f4:8b:a8:dd",
            "net10": "62:9a:7b:12:10:9f",
            "net11": "1a:f7:3e:63:ca:f2",
            "net12": "ae:5c:3c:a9:d9:29",
            "net13": "06:79:a2:31:74:50",
            "net14": "a2:a1:ae:cc:9e:c8",
            "net15": "0a:3c:a4:5f:76:8c",
            "net16": "46:bf:23:88:74:97",
            "net2": "96:af:1d:91:8d:8e",
            "net3": "66:07:48:d7:b6:24",
            "net4": "76:cc:8b:7e:f3:f2",
            "net5": "ea:87:44:d4:0b:60",
            "net6": "9e:6b:00:8d:e7:fb",
            "net7": "e6:7f:eb:f9:24:90",
            "net8": "ce:df:4d:dd:ac:b6",
            "net9": "8e:34:fa:c2:97:f0"
        },
        "leaf_2_0_6": {
            "net0": "c6:e2:75:ee:04:e9",
            "net1": "de:fc:46:ee:0b:46",
            "net10": "02:f1:b0:d4:d0:4a",
            "net11": "72:77:30:17:24:ff",
            "net12": "72:28:f8:9a:f4:37",
            "net13": "52:d8:c4:9b:ff:f5",
            "net14": "ce:bf:b4:c8:48:61",
            "net15": "86:60:38:78:84:3c",
            "net16": "f6:d5:d7:bf:d2:22",
            "net2": "3a:26:af:f2:aa:f7",
            "net3": "ee:b7:a8:57:3d:85",
            "net4": "ce:b2:27:d5:4e:91",
            "net5": "7a:bd:25:a7:62:24",
            "net6": "52:51:ef:94:54:9d",
            "net7": "7a:ab:c6:18:6d:86",
            "net8": "a2:15:0b:8a:2a:7e",
            "net9": "62:56:ab:80:7a:7d"
        },
        "leaf_2_0_7": {
            "net0": "ca:2b:72:80:69:a7",
            "net1": "26:38:e2:40:63:14",
            "net10": "0e:10:92:c1:0e:84",
            "net11": "0a:20:38:3e:9d:10",
            "net12": "36:2b:10:53:43:90",
            "net13": "da:5e:15:09:44:2d",
            "net14": "fa:fe:01:c5:1c:cc",
            "net15": "1e:33:2a:be:a9:9b",
            "net16": "de:33:68:c1:71:8e",
            "net2": "ea:f8:10:7e:bc:ea",
            "net3": "9a:ff:98:d3:bb:df",
            "net4": "a6:17:bf:83:5b:a1",
            "net5": "fe:11:16:18:37:31",
            "net6": "06:2d:6f:7c:6b:b6",
            "net7": "ba:c1:6b:9a:fa:c3",
            "net8": "8e:36:5c:16:37:00",
            "net9": "7e:38:5d:7f:a0:99"
        },
        "leaf_2_0_8": {
            "net0": "0e:73:46:72:9a:87",
            "net1": "82:40:a0:f9:d1:aa",
            "net10": "fe:71:7d:ec:4c:ed",
            "net11": "4e:51:0d:0c:e7:63",
            "net12": "f6:59:70:65:35:28",
            "net13": "76:17:32:f5:97:e5",
            "net14": "0e:ec:43:9a:f1:b8",
            "net15": "1e:16:29:37:9b:6a",
            "net16": "3a:09:18:23:5e:6e",
            "net2": "ae:f1:e4:50:03:68",
            "net3": "a2:97:d6:5e:07:24",
            "net4": "2a:ae:a4:ac:1a:dd",
            "net5": "be:53:f2:1a:ff:9f",
            "net6": "72:45:fb:2c:25:bd",
            "net7": "ea:93:a7:3f:f1:63",
            "net8": "ca:93:65:ca:d6:19",
            "net9": "ae:74:36:04:2a:2c"
        },
        "leaf_2_0_9": {
            "net0": "32:32:04:0f:b6:ce",
            "net1": "c6:d4:78:74:6e:59",
            "net10": "fe:9a:d8:88:3b:aa",
            "net11": "1e:c1:7e:a3:f2:80",
            "net12": "8a:15:ef:d8:ab:24",
            "net13": "66:9b:8b:8f:ec:ad",
            "net14": "92:41:59:bf:6a:84",
            "net15": "ee:a7:a3:87:ad:d0",
            "net16": "f2:0b:d3:cf:88:02",
            "net2": "f6:ce:e8:fd:6f:ea",
            "net3": "b2:d6:61:7d:a0:ef",
            "net4": "ee:1b:0f:ec:05:29",
            "net5": "f6:fe:11:93:5a:a2",
            "net6": "fe:eb:83:ec:ef:37",
            "net7": "12:27:e8:8c:ca:fa",
            "net8": "76:ae:0a:92:77:be",
            "net9": "2a:20:26:7a:7c:f2"
        },
        "spine_1_1_1": {
            "net0": "8a:bc:50:a9:9d:b8",
            "net1": "a2:a0:3a:68:28:07",
            "net10": "16:91:70:9d:df:16",
            "net11": "82:3b:a7:b7:ff:2e",
            "net12": "ca:5b:aa:15:61:da",
            "net13": "f2:7a:23:9a:9a:31",
            "net14": "66:7c:fb:a9:09:b4",
            "net15": "32:04:3a:cf:60:2e",
            "net16": "8a:33:4e:33:3e:1f",
            "net17": "62:0c:f8:da:36:e7",
            "net18": "8a:b3:78:d0:30:aa",
            "net19": "82:24:a7:78:51:56",
            "net2": "c2:70:7e:b6:f3:a8",
            "net20": "ea:64:63:83:95:ba",
            "net21": "8e:6b:69:18:a6:fb",
            "net22": "5a:e6:23:03:3a:35",
            "net23": "36:6d:60:01:b0:85",
            "net24": "72:a3:65:50:b9:89",
            "net25": "22:34:d0:bc:f5:04",
            "net26": "e2:06:7b:0d:8c:53",
            "net27": "52:f1:cc:83:80:eb",
            "net28": "22:aa:3d:40:23:41",
            "net29": "46:21:ec:92:d0:67",
            "net3": "f6:23:15:be:3b:23",
            "net30": "fa:fc:5a:38:fd:35",
            "net31": "ee:2d:c6:ff:e3:7d",
            "net4": "62:fc:13:6a:42:5a",
            "net5": "9a:09:de:98:8e:ca",
            "net6": "ca:21:64:ec:38:13",
            "net7": "a2:0c:e8:f3:07:a0",
            "net8": "8e:0f:89:ee:1b:56",
            "net9": "de:a4:32:cf:ce:dc"
        },
        "spine_1_1_10": {
            "net0": "c2:0c:69:90:2c:58",
            "net1": "ce:59:cc:38:ac:03",
            "net10": "86:89:7a:da:84:ec",
            "net11": "6a:52:6d:99:d0:0f",
            "net12": "4e:93:db:03:33:4a",
            "net13": "8e:5d:5c:e8:cf:34",
            "net14": "7e:84:00:c7:be:fa",
            "net15": "12:c4:0b:5b:3f:ce",
            "net16": "82:9a:12:02:dc:28",
            "net17": "be:bc:f6:f8:ea:04",
            "net18": "da:4b:19:6e:88:ad",
            "net19": "fe:06:61:12:8d:5f",
            "net2": "32:9b:15:ba:a9:bf",
            "net20": "5e:ee:c1:49:d7:cb",
            "net21": "7e:ce:42:89:29:b6",
            "net22": "22:86:03:03:a7:e6",
            "net23": "e6:01:19:b2:6a:39",
            "net24": "ea:e0:b9:df:c9:ac",
            "net25": "b2:82:14:33:02:f1",
            "net26": "76:de:e0:80:78:07",
            "net27": "b2:08:7f:80:23:16",
            "net28": "4a:78:1e:c7:57:33",
            "net29": "b6:9b:47:40:26:d6",
            "net3": "52:c4:99:3d:dc:f8",
            "net30": "9e:4d:41:05:2b:dd",
            "net31": "d6:0b:8e:ad:ee:5a",
            "net4": "ae:2e:3f:a4:6c:41",
            "net5": "c6:04:be:22:ad:02",
            "net6": "32:30:b7:aa:ff:3d",
            "net7": "ce:b8:7e:03:83:c4",
            "net8": "6e:84:89:02:8e:6c",
            "net9": "ba:b0:bb:50:7c:ea"
        },
        "spine_1_1_11": {
            "net0": "92:3d:f4:a6:29:96",
            "net1": "5a:f7:a4:b7:ed:37",
            "net10": "36:42:05:2d:e9:b3",
            "net11": "aa:0b:78:00:ca:23",
            "net12": "92:cd:aa:bd:d1:98",
            "net13": "d2:e0:7f:3e:56:63",
            "net14": "76:a6:47:e9:e6:c6",
            "net15": "0a:b9:dc:e4:ec:16",
            "net16": "d2:d9:18:17:f6:9d",
            "net17": "1a:69:29:7b:47:a8",
            "net18": "5e:f6:bd:41:24:c5",
            "net19": "f6:75:68:55:13:10",
            "net2": "be:2a:65:20:64:56",
            "net20": "de:19:f9:b3:da:ce",
            "net21": "b6:9f:4e:c2:4e:87",
            "net22": "f6:26:6f:00:55:16",
            "net23": "f6:6e:56:d3:93:68",
            "net24": "a2:37:12:cb:5b:64",
            "net25": "7a:4a:99:08:50:09",
            "net26": "22:24:b1:55:73:07",
            "net27": "f2:23:c9:02:8a:4e",
            "net28": "de:77:51:d8:05:93",
            "net29": "3e:95:87:a5:88:1a",
            "net3": "0e:5a:b1:ab:25:16",
            "net30": "42:62:09:c1:c4:0e",
            "net31": "1a:c5:6d:e3:11:0d",
            "net4": "92:7c:69:88:dd:e8",
            "net5": "5a:d9:17:fd:6e:21",
            "net6": "56:3c:62:96:8b:ec",
            "net7": "96:82:1b:66:f7:bb",
            "net8": "f6:01:ae:78:99:d5",
            "net9": "5e:05:ba:ad:7a:28"
        },
        "spine_1_1_12": {
            "net0": "1a:70:33:eb:35:65",
            "net1": "26:0b:ef:7f:2f:37",
            "net10": "46:9d:2b:e7:cd:49",
            "net11": "02:c1:e5:f7:c1:6a",
            "net12": "ea:4f:34:8e:a3:1d",
            "net13": "b2:06:98:7b:92:b6",
            "net14": "8e:63:cd:ef:ca:7f",
            "net15": "5e:dd:4c:9a:2f:b9",
            "net16": "ca:0f:c8:a5:a6:b5",
            "net17": "5e:60:54:20:1b:c3",
            "net18": "9e:dc:38:59:9b:aa",
            "net19": "f6:b3:33:c0:67:4e",
            "net2": "82:0a:4c:9f:20:b6",
            "net20": "96:67:16:b6:53:99",
            "net21": "62:60:41:81:4d:b0",
            "net22": "42:ec:41:2a:d7:45",
            "net23": "fe:19:d6:33:6d:d9",
            "net24": "ee:7c:d3:32:0f:0a",
            "net25": "da:b7:be:d3:4c:4d",
            "net26": "12:b7:bb:45:ec:91",
            "net27": "ce:58:8e:fe:22:32",
            "net28": "1e:95:f7:16:cd:94",
            "net29": "9a:11:d6:43:27:1c",
            "net3": "9a:0f:06:62:ee:51",
            "net30": "82:34:3b:74:8e:c4",
            "net31": "e2:8b:03:53:8d:56",
            "net4": "6e:76:a9:48:b2:5e",
            "net5": "8a:23:8f:8c:49:9b",
            "net6": "06:f7:13:ef:74:1f",
            "net7": "22:c8:02:1b:3a:d7",
            "net8": "26:1e:c3:9d:3b:7e",
            "net9": "36:70:ba:ab:93:95"
        },
        "spine_1_1_13": {
            "net0": "da:6a:4b:ac:fc:fb",
            "net1": "5a:a1:e6:15:e3:d7",
            "net10": "c2:85:5a:d7:27:cd",
            "net11": "4a:0c:fd:1f:1d:9a",
            "net12": "0e:22:82:82:71:b7",
            "net13": "06:b6:3e:aa:1e:eb",
            "net14": "32:93:e2:be:3d:11",
            "net15": "4e:bf:85:a5:d8:9c",
            "net16": "da:76:56:ea:4c:da",
            "net17": "b2:ff:51:56:4e:7f",
            "net18": "7a:1e:87:64:cb:1d",
            "net19": "12:e0:50:33:fc:85",
            "net2": "ba:5f:23:cf:b5:4c",
            "net20": "1a:e9:43:73:8f:83",
            "net21": "76:4d:86:cf:e6:da",
            "net22": "da:7f:fc:be:14:28",
            "net23": "76:82:29:64:4f:14",
            "net24": "b2:59:20:58:f6:61",
            "net25": "b2:40:96:89:a8:69",
            "net26": "8e:91:fd:1e:90:3f",
            "net27": "c2:94:52:5d:cd:e8",
            "net28": "26:c0:03:1e:b4:ee",
            "net29": "1e:97:50:5d:2c:30",
            "net3": "be:49:fb:c6:32:2d",
            "net30": "26:e8:e9:bb:8e:98",
            "net31": "be:5a:a6:8c:45:95",
            "net4": "62:de:88:e2:b6:f8",
            "net5": "e6:7c:a6:83:8a:74",
            "net6": "aa:2c:61:b2:30:06",
            "net7": "7a:6f:0e:16:05:3b",
            "net8": "1e:53:e8:a7:de:95",
            "net9": "32:5b:b0:a6:83:ee"
        },
        "spine_1_1_14": {
            "net0": "d2:de:93:2e:e0:0a",
            "net1": "6a:ec:43:bc:cc:1b",
            "net10": "ea:e8:44:41:bb:6b",
            "net11": "ba:31:5f:e1:60:08",
            "net12": "1a:3e:a4:72:ae:40",
            "net13": "9a:38:d1:38:e0:6c",
            "net14": "36:ce:cc:a8:6c:96",
            "net15": "36:b1:1f:60:a2:65",
            "net16": "e2:03:de:e1:7b:53",
            "net17": "02:73:07:8e:8c:f6",
            "net18": "4e:6d:8d:f5:aa:98",
            "net19": "aa:d4:32:c3:77:67",
            "net2": "da:be:b2:77:d0:d0",
            "net20": "0e:1f:50:71:56:ea",
            "net21": "b6:7b:b5:65:1b:9c",
            "net22": "6e:49:16:2b:5c:07",
            "net23": "42:90:94:33:71:18",
            "net24": "9a:08:ab:5d:22:ae",
            "net25": "9a:2c:d7:07:80:4d",
            "net26": "f2:a6:3a:57:7b:58",
            "net27": "e6:24:bf:af:f3:a3",
            "net28": "ce:ce:b5:31:c6:e8",
            "net29": "12:eb:ae:94:35:bf",
            "net3": "6e:ef:3c:96:57:65",
            "net30": "9a:b1:06:5c:0a:52",
            "net31": "76:8e:d2:5e:5a:f6",
            "net4": "2a:47:76:90:94:be",
            "net5": "46:dd:bf:64:d8:d5",
            "net6": "72:aa:14:0d:dc:42",
            "net7": "66:2d:f1:08:3e:dc",
            "net8": "02:da:45:5b:d3:c3",
            "net9": "c2:10:16:76:15:ea"
        },
        "spine_1_1_15": {
            "net0": "8a:5b:df:e4:d7:bd",
            "net1": "ea:50:4d:a5:d3:5d",
            "net10": "62:b0:e6:11:5a:0c",
            "net11": "f2:ee:0f:d4:2d:0b",
            "net12": "42:26:cb:fd:ba:f2",
            "net13": "3a:af:e0:b2:08:3a",
            "net14": "2e:db:65:ef:9f:1e",
            "net15": "32:b0:42:b6:c2:69",
            "net16": "d6:73:3e:ab:87:ff",
            "net17": "b6:31:b7:8c:9c:ec",
            "net18": "4a:d5:8d:8c:ec:f0",
            "net19": "3a:4c:39:05:e6:78",
            "net2": "6e:12:1b:ae:5d:28",
            "net20": "66:05:1e:c4:ed:1c",
            "net21": "e6:59:ea:73:4b:72",
            "net22": "da:1f:3e:dd:51:dd",
            "net23": "d6:21:8f:77:8b:b7",
            "net24": "de:55:f9:0f:c1:9b",
            "net25": "96:68:73:ad:8c:ed",
            "net26": "56:46:32:74:da:af",
            "net27": "3e:08:e2:bb:f4:87",
            "net28": "56:0e:a1:c3:d4:9f",
            "net29": "1e:4d:a7:94:6a:a2",
            "net3": "7a:02:49:8d:23:45",
            "net30": "92:8b:d6:db:df:90",
            "net31": "82:3a:90:9b:37:f7",
            "net4": "26:43:d3:b5:be:2b",
            "net5": "ce:28:21:d2:66:fc",
            "net6": "9e:28:b8:d7:c2:2d",
            "net7": "b6:69:7b:ee:a4:ea",
            "net8": "42:7d:9b:54:b5:28",
            "net9": "ae:ff:2c:a2:49:6e"
        },
        "spine_1_1_16": {
            "net0": "e6:b1:9b:8a:8b:04",
            "net1": "0a:ea:5e:ed:a0:fc",
            "net10": "86:4c:7b:11:e1:33",
            "net11": "7a:18:1f:a1:cd:34",
            "net12": "b6:c5:a6:f1:dd:0b",
            "net13": "fa:05:56:4b:86:0e",
            "net14": "f6:33:02:6f:f0:dc",
            "net15": "5e:58:48:92:0e:85",
            "net16": "0a:99:c3:eb:27:32",
            "net17": "6e:8b:85:6b:a1:be",
            "net18": "26:ee:c3:b5:61:e4",
            "net19": "8e:1e:6c:99:9a:71",
            "net2": "52:9d:d5:f8:77:36",
            "net20": "72:1b:33:09:8f:c9",
            "net21": "26:f7:2c:17:79:2a",
            "net22": "ae:11:7d:4e:03:cd",
            "net23": "0e:35:f6:b2:2a:ef",
            "net24": "ea:6d:a5:8b:cd:62",
            "net25": "76:ef:8f:b4:a5:eb",
            "net26": "52:a8:2b:18:d7:8c",
            "net27": "f2:c6:98:03:21:f6",
            "net28": "42:2e:56:73:b9:92",
            "net29": "ae:31:0c:06:48:0f",
            "net3": "32:ed:23:1e:22:b0",
            "net30": "2a:51:37:88:00:6f",
            "net31": "1a:53:3a:ac:1d:f2",
            "net4": "7e:33:c9:0b:0f:ef",
            "net5": "36:3b:4c:30:3e:3c",
            "net6": "8a:f3:ae:2d:d3:58",
            "net7": "a6:6e:04:05:bc:61",
            "net8": "0a:f1:69:10:81:56",
            "net9": "96:57:00:c3:6b:4c"
        },
        "spine_1_1_2": {
            "net0": "de:36:ba:e8:5a:15",
            "net1": "26:aa:e7:6e:e1:b1",
            "net10": "96:27:dc:27:3d:3c",
            "net11": "f6:b0:09:97:a9:86",
            "net12": "fa:61:12:e3:b4:87",
            "net13": "22:c8:e5:84:04:49",
            "net14": "fa:9c:95:82:94:d0",
            "net15": "ee:4f:a1:48:05:50",
            "net16": "f6:7c:6b:e4:c9:18",
            "net17": "66:12:35:db:5b:7c",
            "net18": "8e:41:06:0e:0d:cd",
            "net19": "3a:f5:dc:06:40:51",
            "net2": "ae:a7:0b:9e:3a:64",
            "net20": "12:2f:22:c2:ea:00",
            "net21": "82:4b:6c:de:5e:5e",
            "net22": "1a:95:c9:22:03:2d",
            "net23": "76:41:ad:61:f7:18",
            "net24": "5e:9f:e6:75:38:3f",
            "net25": "4e:6b:96:eb:18:12",
            "net26": "82:79:8d:b6:c8:d9",
            "net27": "76:e1:97:27:f7:c6",
            "net28": "1e:78:09:25:b8:8e",
            "net29": "c2:25:5d:d8:20:a1",
            "net3": "96:82:db:47:8a:cd",
            "net30": "ba:08:b2:b1:8e:f8",
            "net31": "b2:20:f1:24:ce:a2",
            "net4": "72:56:18:3a:97:58",
            "net5": "a6:0f:cf:7a:ab:82",
            "net6": "f2:aa:ec:d2:f2:98",
            "net7": "ba:30:aa:d6:fa:1b",
            "net8": "f6:d1:84:b2:14:d1",
            "net9": "6a:83:7f:0e:14:71"
        },
        "spine_1_1_3": {
            "net0": "fa:71:fa:2e:91:bf",
            "net1": "82:c9:30:19:38:7b",
            "net10": "ee:93:9f:2b:1a:c0",
            "net11": "9e:5f:6b:c5:13:f8",
            "net12": "96:a5:85:aa:96:45",
            "net13": "7e:d8:11:ef:2f:36",
            "net14": "7a:dc:c4:d9:f9:92",
            "net15": "7e:55:3a:5a:f0:c9",
            "net16": "86:cc:dd:de:04:f7",
            "net17": "da:dc:85:37:a1:59",
            "net18": "6a:8a:9d:54:67:c2",
            "net19": "d6:73:d1:fb:35:0e",
            "net2": "9e:a4:ff:29:e2:8d",
            "net20": "2e:a1:b5:5c:c8:a8",
            "net21": "32:f4:12:eb:66:02",
            "net22": "7e:50:8f:de:79:51",
            "net23": "de:99:c1:a3:9a:34",
            "net24": "5a:7c:2f:bb:1f:97",
            "net25": "e2:f1:eb:89:5c:a6",
            "net26": "f6:31:8a:24:18:0d",
            "net27": "6e:90:c0:ef:2a:fb",
            "net28": "d6:11:fa:45:45:5b",
            "net29": "2e:7c:24:8c:cf:20",
            "net3": "92:16:33:58:2d:17",
            "net30": "da:76:2e:ac:72:f2",
            "net31": "ca:39:9a:e5:1e:f9",
            "net4": "2e:8a:ea:c1:a2:a8",
            "net5": "32:b7:01:e6:82:07",
            "net6": "5e:16:2f:cf:e4:f7",
            "net7": "f2:46:c7:84:4b:b9",
            "net8": "ea:96:91:9d:f1:8e",
            "net9": "3a:db:e7:2a:fd:bc"
        },
        "spine_1_1_4": {
            "net0": "ae:fd:a4:e9:5b:85",
            "net1": "5e:6b:c6:a1:c5:f7",
            "net10": "22:44:cf:6d:d8:fe",
            "net11": "96:a5:45:50:28:a9",
            "net12": "f6:09:0d:8e:65:fc",
            "net13": "06:25:18:93:f6:81",
            "net14": "a2:35:d8:90:3b:19",
            "net15": "36:9f:e5:56:98:82",
            "net16": "12:9f:70:2f:59:f4",
            "net17": "ce:3c:ef:91:4f:2e",
            "net18": "0a:6f:63:f9:94:42",
            "net19": "26:13:b2:72:52:97",
            "net2": "02:20:0c:ba:59:2e",
            "net20": "3e:4c:46:a9:c7:2b",
            "net21": "ee:55:d9:f1:91:f2",
            "net22": "86:70:16:70:2a:10",
            "net23": "1a:de:a6:1e:d9:28",
            "net24": "2e:6a:37:f4:b5:c1",
            "net25": "7e:39:63:a5:68:64",
            "net26": "16:27:bb:fb:d6:fe",
            "net27": "7e:10:d7:1b:64:a6",
            "net28": "36:13:69:b9:32:1b",
            "net29": "62:a1:94:6e:13:81",
            "net3": "fa:ed:1a:71:10:c1",
            "net30": "6a:98:53:49:39:1e",
            "net31": "9a:cf:15:63:a6:ea",
            "net4": "7e:96:1d:05:3c:b1",
            "net5": "d6:af:4e:5f:77:cd",
            "net6": "7a:49:81:52:03:4e",
            "net7": "26:05:8d:ee:1e:b0",
            "net8": "36:51:ed:5f:5c:28",
            "net9": "f2:12:e3:cd:d7:6d"
        },
        "spine_1_1_5": {
            "net0": "e2:92:ea:c3:d6:cd",
            "net1": "06:83:f8:1f:c7:72",
            "net10": "2e:06:8b:df:ea:04",
            "net11": "ae:c0:6e:82:86:af",
            "net12": "2a:d3:36:1a:ec:20",
            "net13": "ca:8f:69:97:4f:9d",
            "net14": "ce:72:51:22:06:47",
            "net15": "da:a8:ae:5f:18:68",
            "net16": "ce:45:fc:3f:ec:4d",
            "net17": "92:c3:97:93:f3:0d",
            "net18": "32:0a:45:57:d3:30",
            "net19": "ee:dd:6c:2d:d8:7b",
            "net2": "da:ee:06:ad:79:2a",
            "net20": "e6:ad:16:e5:21:06",
            "net21": "12:e5:75:93:1e:f2",
            "net22": "52:97:dc:ae:a2:fd",
            "net23": "a2:5d:25:38:1f:b3",
            "net24": "8a:77:fe:50:82:1c",
            "net25": "2e:04:ab:3e:99:42",
            "net26": "c6:27:58:af:fa:ff",
            "net27": "b2:1e:b2:86:61:67",
            "net28": "96:d6:c9:d6:2c:4b",
            "net29": "4a:e9:fe:e5:8c:3a",
            "net3": "3e:45:f8:0f:d2:fb",
            "net30": "86:48:63:e8:f2:c5",
            "net31": "aa:fb:b7:00:2e:a4",
            "net4": "f2:cb:84:5f:2f:39",
            "net5": "7a:7d:cf:4a:93:01",
            "net6": "56:f7:b6:29:e9:cc",
            "net7": "a2:73:7d:67:4d:18",
            "net8": "3e:01:ea:db:4e:0c",
            "net9": "6e:6b:ee:d0:c3:0c"
        },
        "spine_1_1_6": {
            "net0": "d2:62:c2:8e:35:15",
            "net1": "b6:ac:bc:52:fa:8d",
            "net10": "c6:2b:2b:0d:d9:5b",
            "net11": "2a:0a:32:13:eb:51",
            "net12": "e6:49:b7:16:24:4d",
            "net13": "26:a6:2d:3a:8b:25",
            "net14": "36:b9:5f:dd:1d:8a",
            "net15": "16:34:f0:70:22:bc",
            "net16": "ba:75:f7:6e:8d:a4",
            "net17": "c6:ab:a4:7c:79:16",
            "net18": "16:c3:37:e8:07:a0",
            "net19": "46:c2:43:a3:89:32",
            "net2": "6e:4b:95:2e:8c:1c",
            "net20": "a2:dd:61:af:35:51",
            "net21": "7e:c5:4e:16:1a:9d",
            "net22": "fe:dd:3b:5f:0a:f5",
            "net23": "5e:8a:99:6a:1c:b0",
            "net24": "82:04:c1:55:11:b9",
            "net25": "86:35:01:66:ed:a2",
            "net26": "26:f8:33:5c:5d:04",
            "net27": "4a:2f:7f:29:ab:a7",
            "net28": "32:81:00:cb:8a:76",
            "net29": "f6:d0:91:98:ac:4a",
            "net3": "9e:18:1d:f4:be:a4",
            "net30": "66:bc:5c:34:7a:f4",
            "net31": "f2:af:f2:f6:cf:71",
            "net4": "3e:19:6f:24:dd:5e",
            "net5": "7e:2c:b0:e4:29:ff",
            "net6": "62:77:11:79:31:e9",
            "net7": "8a:31:22:65:44:56",
            "net8": "c2:13:ba:26:61:f5",
            "net9": "f6:34:36:11:b5:aa"
        },
        "spine_1_1_7": {
            "net0": "1e:da:f2:13:b8:e1",
            "net1": "7a:54:bd:38:ac:12",
            "net10": "32:fa:4a:3b:5f:9a",
            "net11": "6e:77:6e:d0:2f:2c",
            "net12": "4a:1a:b2:cd:73:3f",
            "net13": "22:bf:d0:af:cc:eb",
            "net14": "96:cb:80:da:90:da",
            "net15": "ea:44:58:58:28:f1",
            "net16": "c2:0a:d9:55:30:00",
            "net17": "b6:e9:49:ce:b6:d3",
            "net18": "e2:4b:af:23:4c:e8",
            "net19": "ea:72:bf:38:56:38",
            "net2": "a6:ed:1d:fb:35:08",
            "net20": "4a:a2:04:4e:0d:b7",
            "net21": "ea:4e:b0:9b:12:46",
            "net22": "7a:30:56:60:1f:c0",
            "net23": "6e:8b:8e:46:d6:14",
            "net24": "4a:3c:c6:83:90:f0",
            "net25": "6e:cd:8c:5e:46:b9",
            "net26": "6e:c1:9b:93:a7:33",
            "net27": "ba:82:88:f7:7f:a4",
            "net28": "26:9b:c2:15:dd:da",
            "net29": "9a:ec:b8:7a:4a:59",
            "net3": "4a:d0:41:c5:56:d4",
            "net30": "f6:44:d9:be:ed:30",
            "net31": "0e:eb:42:7e:ea:22",
            "net4": "6e:cb:30:28:df:dc",
            "net5": "0e:ad:d4:17:59:eb",
            "net6": "6a:df:fb:b3:34:6d",
            "net7": "ca:15:14:34:dd:6e",
            "net8": "56:7f:6f:97:7c:b9",
            "net9": "92:ed:2b:64:07:80"
        },
        "spine_1_1_8": {
            "net0": "de:36:7a:63:30:92",
            "net1": "e6:0f:a4:d6:cf:4d",
            "net10": "32:2a:0a:a2:92:73",
            "net11": "ee:fc:d4:cc:51:d8",
            "net12": "de:29:ca:9b:bd:18",
            "net13": "26:8f:01:92:37:00",
            "net14": "6e:22:d7:17:97:46",
            "net15": "ca:f6:df:da:8a:2f",
            "net16": "36:ed:88:9c:8b:64",
            "net17": "ae:6f:fb:67:f8:58",
            "net18": "f6:4f:c5:30:6c:9b",
            "net19": "42:8f:a7:77:eb:55",
            "net2": "1a:ea:6f:b5:75:a6",
            "net20": "ba:d4:1b:5a:7b:10",
            "net21": "42:71:a2:ba:33:e9",
            "net22": "66:17:ac:17:3b:06",
            "net23": "de:70:1a:6e:70:46",
            "net24": "36:7a:ef:e6:df:7c",
            "net25": "c6:a8:bf:4b:37:9c",
            "net26": "4a:af:cd:85:37:b7",
            "net27": "82:43:2b:2c:95:0a",
            "net28": "aa:6e:7a:e8:36:15",
            "net29": "e6:9e:bb:ab:b1:ef",
            "net3": "52:31:ed:a5:6b:e8",
            "net30": "6e:e8:fc:61:2c:af",
            "net31": "ce:da:6e:ab:70:53",
            "net4": "66:77:be:63:44:83",
            "net5": "b6:5b:64:b8:4d:be",
            "net6": "ea:82:be:8c:d8:47",
            "net7": "d6:ee:62:1d:84:c5",
            "net8": "c6:00:c2:8f:b1:3c",
            "net9": "4a:7b:20:bd:7c:6d"
        },
        "spine_1_1_9": {
            "net0": "ae:7e:d0:b4:39:6a",
            "net1": "76:fe:b6:81:23:7a",
            "net10": "5e:f2:ad:41:d1:b0",
            "net11": "e2:0b:44:92:33:b6",
            "net12": "ba:28:11:b4:ff:6f",
            "net13": "ea:e5:c3:fc:53:99",
            "net14": "72:14:ba:97:fb:06",
            "net15": "86:07:72:b0:53:9c",
            "net16": "c6:04:9f:6c:ab:66",
            "net17": "2a:ec:af:f0:0f:c1",
            "net18": "d2:b8:e5:08:ed:d6",
            "net19": "ce:fc:ee:52:dd:d4",
            "net2": "a6:8a:1a:3f:9a:0e",
            "net20": "4e:23:85:80:1c:d1",
            "net21": "3a:f1:a1:39:3c:75",
            "net22": "72:7e:c4:fe:54:de",
            "net23": "5a:c7:c9:82:4d:44",
            "net24": "4e:86:6c:41:ae:23",
            "net25": "1e:4a:ae:93:6f:84",
            "net26": "da:fc:f7:c1:23:29",
            "net27": "ba:ea:da:61:56:4d",
            "net28": "fe:4c:22:72:d8:a2",
            "net29": "d2:22:e3:f4:44:80",
            "net3": "96:66:9e:82:fc:cd",
            "net30": "8e:21:db:9f:0f:67",
            "net31": "2a:06:d2:74:25:eb",
            "net4": "aa:02:e6:64:dd:1c",
            "net5": "22:e3:02:4e:04:9a",
            "net6": "fe:6c:6f:5d:58:f4",
            "net7": "62:7e:6f:37:43:3e",
            "net8": "f6:07:f7:f0:e1:2c",
            "net9": "8e:f0:29:7c:3f:85"
        },
        "spine_2_1_1": {
            "net0": "0e:4d:97:05:6e:17",
            "net1": "3a:70:d3:7a:33:53",
            "net10": "26:66:44:cb:95:0d",
            "net11": "86:5c:0a:e0:60:76",
            "net12": "86:9f:ae:07:ba:b9",
            "net13": "6e:b3:1c:97:53:1e",
            "net14": "4e:32:3b:3e:81:54",
            "net15": "06:42:ea:13:93:66",
            "net16": "76:ca:be:51:d5:00",
            "net17": "06:43:db:78:33:6a",
            "net18": "c2:6a:f6:86:ad:e6",
            "net19": "f2:ca:70:d1:e8:3a",
            "net2": "06:1c:35:8d:ea:60",
            "net20": "76:b3:79:13:dc:17",
            "net21": "e2:f9:7d:10:61:d5",
            "net22": "de:e0:f2:2e:1c:09",
            "net23": "de:3d:81:a2:aa:de",
            "net24": "76:27:b4:0e:01:0d",
            "net25": "32:8d:4a:16:a5:1e",
            "net26": "32:95:15:70:f4:37",
            "net27": "fe:5b:1d:18:c2:8c",
            "net28": "aa:ff:46:17:26:f4",
            "net29": "4e:8b:0f:9b:a1:23",
            "net3": "e6:ac:6b:13:5c:3f",
            "net30": "de:57:64:2f:51:b2",
            "net31": "ba:7e:ed:47:52:11",
            "net4": "52:eb:7f:29:f4:47",
            "net5": "f6:71:19:6b:73:a6",
            "net6": "2e:45:64:43:83:e4",
            "net7": "be:27:22:fa:a0:8c",
            "net8": "7e:37:62:ad:eb:5f",
            "net9": "16:c2:32:98:c0:c5"
        },
        "spine_2_1_10": {
            "net0": "3a:8d:5c:43:ea:58",
            "net1": "d6:da:f9:ab:66:b7",
            "net10": "fe:79:dd:d1:bf:25",
            "net11": "8e:04:28:fd:e9:5c",
            "net12": "c6:98:9e:0d:e2:cc",
            "net13": "86:e5:9d:37:d6:61",
            "net14": "4e:fc:68:42:9b:45",
            "net15": "1e:2d:1b:d2:b9:7c",
            "net16": "de:1a:7b:8a:ab:ea",
            "net17": "ce:58:d1:d2:7c:9a",
            "net18": "7a:f5:98:96:99:c5",
            "net19": "8e:e6:fb:4f:6a:53",
            "net2": "32:93:28:ef:22:84",
            "net20": "86:69:8b:7b:03:ff",
            "net21": "36:f3:f8:f6:a7:85",
            "net22": "3a:a7:e2:d7:e9:3c",
            "net23": "a2:be:3b:c4:97:45",
            "net24": "62:fb:12:97:3f:2f",
            "net25": "7e:94:cc:38:47:8f",
            "net26": "8e:73:52:3c:f1:1f",
            "net27": "b6:d3:da:b0:3b:0b",
            "net28": "8a:e7:83:6b:9a:f4",
            "net29": "72:5d:0b:0e:56:11",
            "net3": "22:5e:45:b2:bb:85",
            "net30": "ba:fc:1d:9a:26:98",
            "net31": "c2:b5:d3:ab:18:cc",
            "net4": "e6:6e:11:d2:7e:c8",
            "net5": "c2:8a:2c:53:6e:96",
            "net6": "4e:98:2d:8c:14:32",
            "net7": "6e:09:fb:11:20:73",
            "net8": "8e:3e:b2:30:0c:f8",
            "net9": "ca:1c:29:ee:e3:31"
        },
        "spine_2_1_11": {
            "net0": "36:a0:f8:bf:b9:aa",
            "net1": "0e:c4:9c:5b:3e:a3",
            "net10": "7e:7d:d5:fe:84:36",
            "net11": "92:7e:cd:a1:c2:68",
            "net12": "aa:55:65:c6:20:fd",
            "net13": "0e:94:ac:c3:fa:cf",
            "net14": "a2:d0:20:61:9b:2d",
            "net15": "56:78:d4:ae:34:85",
            "net16": "f2:22:5f:5a:3a:ee",
            "net17": "72:13:34:be:08:59",
            "net18": "8a:78:58:71:5d:bb",
            "net19": "c2:63:3d:3a:1c:44",
            "net2": "46:f3:2f:58:51:79",
            "net20": "36:27:25:c1:ee:48",
            "net21": "5a:ed:69:a5:1d:0e",
            "net22": "8e:26:d1:5b:e2:ba",
            "net23": "76:e3:f6:d2:94:ad",
            "net24": "f6:e4:e9:31:92:e1",
            "net25": "46:10:f4:b8:c1:1d",
            "net26": "7e:e3:9f:17:0d:91",
            "net27": "62:21:fb:75:27:d8",
            "net28": "76:cc:f8:37:4f:df",
            "net29": "0e:c3:d2:07:77:2d",
            "net3": "92:c7:f4:97:24:ce",
            "net30": "d6:a2:06:0c:b8:81",
            "net31": "ca:86:05:e8:47:db",
            "net4": "5e:7d:32:5f:03:eb",
            "net5": "a2:31:66:e1:24:f9",
            "net6": "96:c4:c4:88:ac:45",
            "net7": "ae:9f:37:fe:ed:62",
            "net8": "fe:bc:80:7b:b4:72",
            "net9": "9e:8f:26:69:90:89"
        },
        "spine_2_1_12": {
            "net0": "36:fb:8d:e1:fb:b2",
            "net1": "0a:5b:d1:a3:36:7e",
            "net10": "fe:b7:53:5f:dd:13",
            "net11": "22:25:97:93:92:c5",
            "net12": "96:99:c1:ac:84:c8",
            "net13": "b2:bf:51:b0:aa:74",
            "net14": "92:a5:c8:c1:6d:57",
            "net15": "36:80:40:cd:fe:3d",
            "net16": "e6:a2:95:75:dd:a2",
            "net17": "f6:dd:91:4c:7b:7b",
            "net18": "72:41:8f:df:5a:46",
            "net19": "7e:0f:0e:e0:85:f5",
            "net2": "6e:85:c6:01:e9:34",
            "net20": "62:c3:dc:ba:9b:a8",
            "net21": "16:21:55:4a:a8:19",
            "net22": "66:8a:21:22:6b:80",
            "net23": "8e:0b:78:dc:6c:71",
            "net24": "2a:21:6a:52:47:be",
            "net25": "5e:8f:07:c3:f5:3f",
            "net26": "16:f6:67:0d:69:10",
            "net27": "b2:0b:00:99:03:fe",
            "net28": "e6:d6:0b:aa:3d:bb",
            "net29": "be:aa:06:40:08:1a",
            "net3": "ae:d7:be:f4:39:7c",
            "net30": "0e:4a:72:02:58:14",
            "net31": "a2:d8:af:cb:ef:84",
            "net4": "c6:ad:67:9c:71:f6",
            "net5": "16:30:1e:c6:49:bd",
            "net6": "a6:ca:c0:a0:0c:d0",
            "net7": "06:4c:a8:b4:b8:2f",
            "net8": "ca:b1:85:24:4a:f2",
            "net9": "ca:bd:18:90:5f:7a"
        },
        "spine_2_1_13": {
            "net0": "6e:d9:6f:f7:cd:65",
            "net1": "3e:26:d1:2a:78:1e",
            "net10": "d2:aa:2a:2a:dd:eb",
            "net11": "d2:69:55:f0:9c:f8",
            "net12": "c6:e4:2c:14:36:95",
            "net13": "5e:91:a6:aa:f5:b0",
            "net14": "92:cb:52:e1:a0:83",
            "net15": "a6:c4:1c:78:03:f4",
            "net16": "72:88:b3:00:91:a6",
            "net17": "9e:db:73:dd:80:b5",
            "net18": "32:2d:88:41:63:83",
            "net19": "7a:9d:d6:69:a9:56",
            "net2": "06:d3:54:76:d8:36",
            "net20": "8e:e7:f3:88:1e:6f",
            "net21": "ca:14:15:2c:29:3c",
            "net22": "76:84:62:6e:54:8a",
            "net23": "4e:80:d9:34:e6:0f",
            "net24": "ba:7b:c8:f5:57:28",
            "net25": "f2:1d:b0:25:5a:df",
            "net26": "6a:06:59:16:d5:78",
            "net27": "c2:b0:2f:50:22:0f",
            "net28": "d6:25:b4:73:3a:30",
            "net29": "7a:55:59:e3:ef:9b",
            "net3": "d6:09:48:66:5a:c2",
            "net30": "06:40:4c:b3:17:32",
            "net31": "06:dc:f6:35:04:f1",
            "net4": "52:61:e2:03:43:7a",
            "net5": "8a:b2:2b:14:26:05",
            "net6": "4e:8a:fa:26:ab:c2",
            "net7": "a2:26:cd:9c:46:b0",
            "net8": "0a:19:20:7d:3e:0e",
            "net9": "ee:11:24:ab:c2:a4"
        },
        "spine_2_1_14": {
            "net0": "06:4c:cb:fa:29:94",
            "net1": "3a:83:c2:21:b2:50",
            "net10": "b2:1a:cc:d2:4c:e5",
            "net11": "4a:04:5f:26:16:8c",
            "net12": "a2:a3:cf:cd:5e:01",
            "net13": "02:f6:0a:1d:8c:d7",
            "net14": "0e:fb:cd:f8:2d:10",
            "net15": "0a:79:fe:f0:d4:f2",
            "net16": "0a:81:7e:f4:c9:4f",
            "net17": "f2:17:69:01:89:42",
            "net18": "2e:29:1e:c7:9f:62",
            "net19": "9a:5f:82:67:eb:71",
            "net2": "3e:bd:01:98:07:36",
            "net20": "86:cc:4c:4f:a2:ed",
            "net21": "a6:8e:76:12:6f:56",
            "net22": "92:09:68:a5:1e:9d",
            "net23": "3a:0f:1a:31:e8:3b",
            "net24": "26:82:93:a1:77:38",
            "net25": "ae:93:5b:24:03:c1",
            "net26": "2e:4a:b2:ec:2d:4f",
            "net27": "e2:45:b6:e2:aa:44",
            "net28": "4e:1a:4d:59:1b:65",
            "net29": "5e:f2:07:b5:15:ec",
            "net3": "26:a0:1f:9a:78:47",
            "net30": "66:08:21:86:d0:f3",
            "net31": "62:82:3b:3b:43:d9",
            "net4": "7e:35:9f:63:2a:3a",
            "net5": "06:65:83:cd:db:3d",
            "net6": "de:3e:5a:33:e3:86",
            "net7": "fa:a7:e1:58:a0:ef",
            "net8": "fe:91:1c:3a:03:be",
            "net9": "8a:2b:27:bc:63:cf"
        },
        "spine_2_1_15": {
            "net0": "2e:5a:c1:49:46:35",
            "net1": "fe:26:14:79:b3:60",
            "net10": "16:c9:6f:46:d5:f6",
            "net11": "32:45:91:a4:a0:4e",
            "net12": "ee:9b:bf:cb:57:1f",
            "net13": "42:ba:e5:b5:fd:bf",
            "net14": "aa:62:9f:4a:1a:98",
            "net15": "ae:c8:68:f5:af:a7",
            "net16": "de:8c:b0:06:ff:96",
            "net17": "5a:77:8b:85:af:15",
            "net18": "32:c4:b8:a4:46:93",
            "net19": "be:b1:52:79:3d:4c",
            "net2": "1a:13:03:a4:f2:ae",
            "net20": "26:71:b2:46:e3:da",
            "net21": "0a:95:16:54:d8:94",
            "net22": "1e:93:24:75:5a:42",
            "net23": "5e:af:2a:03:6e:72",
            "net24": "a2:84:44:fd:37:94",
            "net25": "de:06:6f:c7:6b:03",
            "net26": "a6:0e:d4:2b:fc:ff",
            "net27": "ce:f0:41:57:b9:48",
            "net28": "12:84:71:b9:e8:4b",
            "net29": "3e:e2:81:52:c9:ae",
            "net3": "ba:4c:90:7b:56:55",
            "net30": "4e:b9:cb:a3:da:9c",
            "net31": "d2:30:5b:fd:42:ef",
            "net4": "22:95:e0:0e:9a:08",
            "net5": "ca:85:f1:0a:85:ea",
            "net6": "6a:4f:73:71:79:f7",
            "net7": "32:e5:07:df:6c:2e",
            "net8": "f6:c1:92:ba:26:8b",
            "net9": "36:25:75:bb:f1:f8"
        },
        "spine_2_1_16": {
            "net0": "ee:5f:8a:8a:86:8f",
            "net1": "0e:c7:00:a5:18:77",
            "net10": "d6:a2:9e:6c:3f:63",
            "net11": "1e:c4:b7:4c:3b:97",
            "net12": "2e:96:77:e7:93:ea",
            "net13": "32:0b:78:3c:25:f5",
            "net14": "7e:16:f4:c1:01:c5",
            "net15": "ee:a9:54:25:8a:4a",
            "net16": "ca:be:a1:c3:c7:ba",
            "net17": "5e:9d:4b:0a:09:8e",
            "net18": "e6:a5:76:36:fc:12",
            "net19": "9a:92:e5:82:3f:de",
            "net2": "6a:97:06:f4:63:8f",
            "net20": "36:18:8d:b6:ee:2a",
            "net21": "0a:4b:ff:33:dd:4b",
            "net22": "5a:3f:2b:29:73:00",
            "net23": "22:05:72:bf:fc:78",
            "net24": "e6:9c:96:b1:b0:01",
            "net25": "7a:fd:84:66:5e:cc",
            "net26": "66:62:02:14:45:75",
            "net27": "66:ad:b8:6b:2e:d3",
            "net28": "ca:5e:07:25:58:88",
            "net29": "72:3e:97:8d:f7:20",
            "net3": "5e:96:31:7d:b6:26",
            "net30": "a2:a6:22:32:ae:b1",
            "net31": "72:29:5a:34:c1:23",
            "net4": "2e:ec:97:29:5d:96",
            "net5": "72:62:36:4a:35:8e",
            "net6": "2e:fa:26:9a:cc:1d",
            "net7": "7a:ff:74:b5:bd:7e",
            "net8": "9a:32:c3:69:da:28",
            "net9": "1a:26:9c:5f:4d:0d"
        },
        "spine_2_1_2": {
            "net0": "ca:0c:a7:32:b3:9d",
            "net1": "ea:e0:f8:be:04:ee",
            "net10": "e6:83:b0:a4:e8:38",
            "net11": "0a:a0:52:39:25:4b",
            "net12": "42:3d:f7:6a:71:5c",
            "net13": "ca:83:85:80:ab:93",
            "net14": "a6:d4:56:68:1f:3f",
            "net15": "56:03:59:db:36:93",
            "net16": "b2:e9:ef:5a:7c:18",
            "net17": "e6:b0:30:1c:8e:4b",
            "net18": "e6:0e:6c:40:c1:3d",
            "net19": "be:c7:17:b9:1a:7f",
            "net2": "1a:44:0f:e5:d7:2f",
            "net20": "22:6a:d9:b5:97:45",
            "net21": "82:9f:ce:69:79:36",
            "net22": "ce:ab:e7:14:0c:08",
            "net23": "b2:96:0a:26:08:7d",
            "net24": "46:c1:c1:f9:f9:9f",
            "net25": "16:62:45:65:84:51",
            "net26": "de:00:d8:e4:91:52",
            "net27": "82:0e:c0:b4:3f:cf",
            "net28": "26:fc:57:69:fc:42",
            "net29": "46:1c:98:bc:44:fb",
            "net3": "ae:50:30:5b:43:31",
            "net30": "46:69:43:2c:32:3d",
            "net31": "f2:b3:cf:2e:80:b6",
            "net4": "76:ea:f5:69:fd:bd",
            "net5": "a6:49:8f:66:26:ac",
            "net6": "86:a9:47:4b:fd:8b",
            "net7": "22:1a:f9:98:3c:0c",
            "net8": "b6:79:55:f5:97:17",
            "net9": "f6:65:fa:51:1f:f6"
        },
        "spine_2_1_3": {
            "net0": "b6:98:7e:2e:d8:b9",
            "net1": "06:60:fa:a4:2a:a2",
            "net10": "6e:27:30:2b:5e:7c",
            "net11": "ca:5e:7f:f6:11:64",
            "net12": "c6:cc:93:ba:a3:a9",
            "net13": "9e:97:55:72:9e:54",
            "net14": "8a:ec:cf:d6:8c:b0",
            "net15": "4e:4e:3f:75:29:f4",
            "net16": "82:2a:95:b1:d0:5c",
            "net17": "ea:56:35:f7:fa:ad",
            "net18": "4e:88:10:ce:97:8f",
            "net19": "32:43:d6:83:2d:cf",
            "net2": "26:df:b7:21:9a:84",
            "net20": "0e:38:e2:8c:08:4b",
            "net21": "a6:f0:16:dc:2d:d1",
            "net22": "72:80:08:85:78:78",
            "net23": "a6:4f:ce:07:0c:c9",
            "net24": "4e:c5:2d:5f:2d:d0",
            "net25": "c6:34:e3:99:81:b7",
            "net26": "ee:d2:47:b3:a3:f3",
            "net27": "12:d2:69:25:06:6d",
            "net28": "ba:01:d5:4a:4c:c0",
            "net29": "82:44:15:74:fc:8a",
            "net3": "32:18:59:b2:8c:3f",
            "net30": "9e:3a:cd:dd:b3:6e",
            "net31": "f2:ba:e6:6c:af:05",
            "net4": "f2:f0:4d:b2:6d:f6",
            "net5": "da:3b:47:ab:98:be",
            "net6": "1e:e3:93:67:0c:19",
            "net7": "ee:6b:a6:66:94:c4",
            "net8": "d2:a3:b5:26:bb:dc",
            "net9": "a2:ef:06:bc:99:c1"
        },
        "spine_2_1_4": {
            "net0": "46:48:87:c7:de:00",
            "net1": "8a:74:70:56:43:73",
            "net10": "72:c8:a8:9e:24:98",
            "net11": "62:ff:c2:53:23:49",
            "net12": "3e:38:cb:2c:0d:36",
            "net13": "a2:8d:d0:a2:ce:a5",
            "net14": "9a:c5:2e:52:4f:a6",
            "net15": "8a:40:68:eb:42:d0",
            "net16": "26:fc:4f:2b:c6:0c",
            "net17": "ea:51:c9:29:9c:43",
            "net18": "22:c0:7a:d4:dc:50",
            "net19": "0a:6b:45:b5:d8:d8",
            "net2": "be:e2:b5:0d:33:df",
            "net20": "36:01:b1:cd:9b:49",
            "net21": "36:c4:f5:b5:94:a8",
            "net22": "1e:fa:43:fe:5f:c7",
            "net23": "f2:8c:2a:8a:b0:a4",
            "net24": "4a:bf:d4:66:ac:54",
            "net25": "7a:f2:7e:37:72:cd",
            "net26": "f6:47:4d:04:09:66",
            "net27": "f6:38:a4:5a:83:bd",
            "net28": "ae:90:45:de:c2:b5",
            "net29": "46:fe:55:49:a2:b2",
            "net3": "be:aa:12:ca:04:77",
            "net30": "a2:90:9e:b3:67:a4",
            "net31": "ae:22:c5:5f:c3:f3",
            "net4": "ba:08:d3:0d:2b:d8",
            "net5": "7e:1b:52:19:64:9e",
            "net6": "0e:ed:a0:d7:50:ab",
            "net7": "2a:1e:60:59:b2:a3",
            "net8": "36:6d:15:18:bb:18",
            "net9": "da:da:4c:6b:48:e5"
        },
        "spine_2_1_5": {
            "net0": "46:cd:fa:93:93:8c",
            "net1": "1a:91:82:f6:ec:19",
            "net10": "8a:07:a1:b2:7d:e0",
            "net11": "7e:9e:73:cd:1f:52",
            "net12": "b2:fd:90:d2:02:25",
            "net13": "ca:7f:46:8c:8c:93",
            "net14": "ce:f2:a9:49:e9:d5",
            "net15": "06:cf:13:6b:0c:60",
            "net16": "26:59:10:d3:a9:f7",
            "net17": "d6:e5:04:47:2d:0b",
            "net18": "8e:40:f9:b5:7f:bb",
            "net19": "4a:0f:17:f6:b0:e1",
            "net2": "2a:0b:c4:7c:0f:07",
            "net20": "5e:2b:72:5d:bf:ad",
            "net21": "06:9c:d4:83:22:e2",
            "net22": "86:ee:41:24:6f:75",
            "net23": "f2:63:14:a6:6b:6d",
            "net24": "22:75:97:e3:2a:e5",
            "net25": "0a:c6:13:55:28:64",
            "net26": "ce:f3:cf:95:e9:0b",
            "net27": "6a:55:e9:cc:11:89",
            "net28": "1a:be:c1:e4:7a:b3",
            "net29": "e2:f9:09:3c:a8:34",
            "net3": "d2:32:ce:aa:b4:07",
            "net30": "de:76:58:ec:c4:c8",
            "net31": "da:20:74:b8:d9:df",
            "net4": "0a:f1:eb:58:7c:a2",
            "net5": "66:7f:54:d6:54:30",
            "net6": "62:14:28:f5:7b:c8",
            "net7": "e6:32:4a:b7:f1:63",
            "net8": "1e:08:43:5b:78:9b",
            "net9": "8e:ab:fc:16:35:c7"
        },
        "spine_2_1_6": {
            "net0": "26:f5:a5:05:83:69",
            "net1": "e6:ee:85:b7:cf:17",
            "net10": "46:ff:07:83:61:32",
            "net11": "4a:10:d8:7f:c6:05",
            "net12": "76:10:a5:4e:0c:c0",
            "net13": "32:a8:21:c2:6d:12",
            "net14": "ae:b2:ff:6b:d0:fb",
            "net15": "6a:b1:9d:2e:15:5f",
            "net16": "ea:62:08:6c:a2:f4",
            "net17": "b6:16:a2:53:ac:45",
            "net18": "72:f0:37:a9:16:b9",
            "net19": "d6:71:1d:c9:47:1c",
            "net2": "3e:c0:c7:a7:0f:02",
            "net20": "4e:e1:3b:bc:64:9d",
            "net21": "2e:e7:c5:a1:07:fc",
            "net22": "f2:5b:ec:64:64:54",
            "net23": "ba:2b:f7:43:23:91",
            "net24": "02:f5:9d:ea:fb:bb",
            "net25": "66:16:e9:b2:cd:80",
            "net26": "2e:f5:4d:1a:5f:f3",
            "net27": "7a:ef:bd:c0:df:fb",
            "net28": "ca:35:cf:a5:f1:5d",
            "net29": "46:a2:f6:d3:f8:5b",
            "net3": "b2:bc:41:b8:2d:08",
            "net30": "8a:41:9d:e0:77:bb",
            "net31": "b2:f8:9e:ae:e8:42",
            "net4": "1e:ff:06:b0:be:d9",
            "net5": "f2:3c:62:18:51:a2",
            "net6": "b6:96:cf:d3:da:46",
            "net7": "5e:10:10:86:4d:52",
            "net8": "62:1f:79:6f:cf:1a",
            "net9": "ea:61:f8:79:d0:1b"
        },
        "spine_2_1_7": {
            "net0": "26:55:28:b4:4d:03",
            "net1": "3e:c7:56:c3:a0:b2",
            "net10": "46:30:97:0f:40:d5",
            "net11": "72:79:7d:e0:e8:87",
            "net12": "f6:7a:99:4c:0f:c7",
            "net13": "b6:96:b0:8a:aa:ea",
            "net14": "ae:66:24:9e:48:c0",
            "net15": "c2:7d:69:ed:63:9a",
            "net16": "9e:45:c1:7b:45:80",
            "net17": "fa:fd:da:1b:8d:e6",
            "net18": "fa:53:4d:91:fc:ed",
            "net19": "e2:ab:81:2f:53:a0",
            "net2": "82:8f:fc:10:ac:14",
            "net20": "82:ff:7c:d9:f8:60",
            "net21": "96:ef:7c:0f:5b:17",
            "net22": "c2:08:1c:01:2e:db",
            "net23": "da:df:8e:6a:3e:a9",
            "net24": "ea:d8:39:a6:6e:91",
            "net25": "9e:4a:e9:5e:56:92",
            "net26": "6e:58:70:09:50:54",
            "net27": "32:22:eb:66:c2:34",
            "net28": "ba:2b:ef:c9:56:30",
            "net29": "d6:2f:09:83:cf:77",
            "net3": "ea:ab:55:25:8e:86",
            "net30": "8e:65:e6:7b:8f:d4",
            "net31": "ba:ed:31:f8:69:73",
            "net4": "1e:4d:6b:e8:8b:d7",
            "net5": "0a:07:fd:2f:c8:0c",
            "net6": "16:5e:0e:59:29:80",
            "net7": "26:4a:fb:d4:a3:42",
            "net8": "f2:31:56:a2:4a:a4",
            "net9": "9e:30:1d:fd:85:58"
        },
        "spine_2_1_8": {
            "net0": "ba:58:de:14:6f:cb",
            "net1": "d6:b9:b6:6c:8c:50",
            "net10": "26:f0:89:6b:3f:c0",
            "net11": "ce:66:ce:e1:58:6e",
            "net12": "a2:58:f2:76:c2:9c",
            "net13": "3e:27:30:cf:a9:af",
            "net14": "4e:70:63:18:20:67",
            "net15": "f2:ee:67:f4:7d:7b",
            "net16": "82:bf:76:cc:27:f3",
            "net17": "c2:2b:21:9f:cf:08",
            "net18": "76:f4:82:88:bd:f9",
            "net19": "96:31:a9:2e:ed:ed",
            "net2": "7e:83:f9:93:8a:34",
            "net20": "06:08:f4:2d:92:b3",
            "net21": "42:f9:00:2d:db:46",
            "net22": "66:a0:f0:e6:93:30",
            "net23": "62:e4:8f:ef:8b:93",
            "net24": "3e:67:44:31:b1:50",
            "net25": "4e:de:37:bb:34:cf",
            "net26": "16:3e:bb:db:61:96",
            "net27": "4e:d5:e1:a6:c5:ae",
            "net28": "2e:0d:ea:89:91:f8",
            "net29": "f2:8f:b0:6a:16:21",
            "net3": "3e:7f:95:0e:9f:1c",
            "net30": "72:70:5d:0f:9a:98",
            "net31": "a6:55:cf:06:19:6f",
            "net4": "96:91:ac:f7:d4:69",
            "net5": "8e:de:db:5c:65:06",
            "net6": "7a:f7:3a:44:cd:1c",
            "net7": "6a:ab:21:ab:5a:37",
            "net8": "8a:4f:12:14:bf:6e",
            "net9": "5e:4c:be:b1:4e:fb"
        },
        "spine_2_1_9": {
            "net0": "16:81:80:84:55:93",
            "net1": "22:ac:b0:57:8a:94",
            "net10": "ea:b4:e2:8b:fb:0f",
            "net11": "b6:9a:16:22:5b:fc",
            "net12": "52:75:23:23:75:8a",
            "net13": "1a:31:1c:26:ec:dd",
            "net14": "be:6f:e4:11:27:b0",
            "net15": "c2:e8:55:e1:17:33",
            "net16": "ea:b5:a5:cc:a8:52",
            "net17": "46:56:4e:ab:89:a2",
            "net18": "ba:5f:9e:5e:3e:92",
            "net19": "ae:1d:e3:17:e3:29",
            "net2": "3a:bb:15:a4:0d:c3",
            "net20": "32:0d:ed:f4:ee:cc",
            "net21": "b2:c1:cd:56:6f:18",
            "net22": "c2:52:84:0b:ad:b7",
            "net23": "66:04:f7:50:f5:6a",
            "net24": "56:83:a1:da:63:0c",
            "net25": "ea:8b:ff:3f:78:3b",
            "net26": "fe:f5:cb:de:01:54",
            "net27": "ea:37:2f:04:38:32",
            "net28": "62:a4:14:0a:b3:79",
            "net29": "52:13:b3:a0:f9:fe",
            "net3": "76:05:84:6f:7f:71",
            "net30": "c6:86:74:75:48:68",
            "net31": "de:bf:7d:b0:fa:6c",
            "net4": "ee:fd:fb:3a:fc:e1",
            "net5": "5a:1d:b7:6f:f3:8c",
            "net6": "fa:dc:a9:34:7b:f2",
            "net7": "fa:8a:a1:37:f1:01",
            "net8": "36:4b:21:fb:8a:4e",
            "net9": "ca:8a:66:06:a4:a6"
        },
        "tof_1_2_1": {
            "net0": "e6:36:86:be:b4:47",
            "net1": "ea:e1:dd:d8:fc:89",
            "net10": "b2:c2:cc:95:81:2e",
            "net11": "0e:c3:54:61:3f:3b",
            "net12": "5a:d2:53:ea:3f:2b",
            "net13": "9a:1e:66:a7:95:89",
            "net14": "4e:b2:d7:cf:fe:4f",
            "net15": "ce:eb:94:1c:d3:0f",
            "net16": "2e:35:be:23:c8:e5",
            "net17": "e2:e2:1f:ee:87:37",
            "net18": "82:08:6f:14:e0:42",
            "net19": "26:50:cc:2d:12:11",
            "net2": "b6:68:b8:db:de:18",
            "net20": "5a:61:a5:d6:54:38",
            "net21": "f6:5c:96:9e:ff:5e",
            "net22": "66:fe:ee:53:10:9b",
            "net23": "52:bf:c9:0c:5d:67",
            "net24": "fa:02:f0:f0:91:3c",
            "net25": "2e:97:a9:bc:e0:fa",
            "net26": "12:c0:34:f1:40:75",
            "net27": "9a:48:86:f8:a4:06",
            "net28": "7a:e7:bd:1b:54:3a",
            "net29": "8e:e7:a4:50:e4:78",
            "net3": "12:ef:42:23:e3:41",
            "net30": "ee:b3:99:33:9c:1b",
            "net31": "7e:db:46:c0:3f:b7",
            "net4": "62:0a:fa:5f:95:b9",
            "net5": "ca:8d:e0:51:34:72",
            "net6": "82:db:67:ec:87:02",
            "net7": "2a:2d:18:a1:36:02",
            "net8": "86:54:85:27:c3:e4",
            "net9": "8e:9b:4c:6c:3f:86"
        },
        "tof_1_2_10": {
            "net0": "8a:25:82:6f:af:20",
            "net1": "4e:23:5e:47:61:10",
            "net10": "ba:35:94:79:3b:69",
            "net11": "ee:91:ae:4d:86:87",
            "net12": "ba:33:2e:7a:a5:bc",
            "net13": "46:97:fc:3b:b6:38",
            "net14": "ee:d2:4e:7f:ad:56",
            "net15": "9e:8c:dd:a0:6d:da",
            "net16": "b2:67:ad:23:46:11",
            "net17": "ea:9b:19:33:12:67",
            "net18": "a6:d6:1e:34:58:02",
            "net19": "a2:d7:b1:ec:bf:e8",
            "net2": "62:c7:e4:9e:d1:0d",
            "net20": "56:a4:ab:5d:7c:1e",
            "net21": "6a:d0:74:e9:df:b1",
            "net22": "0a:ed:78:29:59:49",
            "net23": "c6:6d:99:e4:52:7b",
            "net24": "42:9b:41:f8:93:45",
            "net25": "c2:2a:af:66:04:bd",
            "net26": "ce:be:c3:19:2c:8e",
            "net27": "3e:3c:f6:4a:fd:ca",
            "net28": "ba:e7:e3:4e:36:1c",
            "net29": "ae:55:32:55:ce:69",
            "net3": "6e:52:a8:9d:56:cb",
            "net30": "96:d3:f6:02:b5:1d",
            "net31": "7a:28:f5:26:93:26",
            "net4": "92:fc:06:3b:04:92",
            "net5": "be:7b:44:47:70:6b",
            "net6": "fe:e8:45:20:a6:e1",
            "net7": "d6:86:8d:06:59:ab",
            "net8": "ba:6a:b5:29:81:85",
            "net9": "32:86:85:70:45:34"
        },
        "tof_1_2_11": {
            "net0": "52:a0:f9:7b:54:5e",
            "net1": "1a:b5:e7:e9:09:ca",
            "net10": "b6:fd:b8:92:b2:5c",
            "net11": "c2:ba:7c:64:a9:a4",
            "net12": "ba:48:54:6c:e9:5a",
            "net13": "6a:73:63:02:97:2f",
            "net14": "ee:e7:c6:6f:c2:77",
            "net15": "be:0b:0b:26:ea:9a",
            "net16": "5e:a6:82:24:26:86",
            "net17": "ea:ad:0a:21:b4:ad",
            "net18": "4a:f1:b1:b9:37:25",
            "net19": "6a:35:b4:c8:b9:17",
            "net2": "6a:10:1b:a6:bc:c4",
            "net20": "b2:8b:88:32:0f:e0",
            "net21": "f2:b3:78:71:1a:f9",
            "net22": "5e:30:99:b7:63:b1",
            "net23": "7e:6d:1d:fb:5c:7c",
            "net24": "ae:94:d7:f4:42:92",
            "net25": "a2:58:e3:f1:ed:4a",
            "net26": "7e:6b:06:0d:57:a9",
            "net27": "0a:34:e7:0b:7b:00",
            "net28": "a2:11:10:a3:66:bc",
            "net29": "5a:1e:cb:37:8b:22",
            "net3": "1a:30:82:1f:72:fb",
            "net30": "0a:89:52:a7:d6:ab",
            "net31": "2a:79:3c:c5:65:48",
            "net4": "86:4c:7c:1b:8d:96",
            "net5": "5a:16:46:24:e9:83",
            "net6": "a6:71:88:22:7d:19",
            "net7": "de:d4:4a:42:90:7e",
            "net8": "ea:06:a5:d1:21:65",
            "net9": "1e:bd:67:02:73:c2"
        },
        "tof_1_2_12": {
            "net0": "4a:37:b5:b2:9a:35",
            "net1": "a2:38:47:3a:63:e4",
            "net10": "52:4d:28:b2:6a:81",
            "net11": "4e:c1:37:5e:0b:b1",
            "net12": "de:71:88:64:fe:11",
            "net13": "a2:d4:8a:fa:76:aa",
            "net14": "22:ec:b3:d5:8a:ef",
            "net15": "f2:32:ac:8a:28:80",
            "net16": "0a:da:c7:88:a8:e1",
            "net17": "86:45:20:01:6e:d8",
            "net18": "32:b1:04:53:2a:4c",
            "net19": "fa:f9:c1:e2:fb:90",
            "net2": "52:bd:ea:d7:a8:c2",
            "net20": "b6:f7:9d:83:45:d7",
            "net21": "86:47:fc:f2:64:7e",
            "net22": "46:0b:e2:0a:a9:e1",
            "net23": "b6:9f:ac:49:d5:de",
            "net24": "a6:97:69:36:c3:8b",
            "net25": "1e:41:02:ae:f0:56",
            "net26": "3e:b3:ee:8f:0c:88",
            "net27": "e2:6b:15:6a:0c:8d",
            "net28": "4e:3a:8c:ae:1a:b8",
            "net29": "22:7d:78:08:e4:b6",
            "net3": "d2:bd:85:ab:d7:6b",
            "net30": "7a:59:d8:a3:ac:2c",
            "net31": "7e:93:4a:60:73:85",
            "net4": "06:01:7c:d2:db:65",
            "net5": "0a:80:66:a6:a5:8c",
            "net6": "b2:d1:cc:32:7a:f8",
            "net7": "02:57:e3:f1:21:34",
            "net8": "8e:98:ae:0b:4f:78",
            "net9": "be:8c:90:ab:dc:bc"
        },
        "tof_1_2_13": {
            "net0": "7a:c9:e9:fb:ab:a8",
            "net1": "de:9c:09:c2:8c:bc",
            "net10": "d6:a2:f1:ba:61:da",
            "net11": "ba:3b:bf:d7:84:67",
            "net12": "52:51:19:54:ca:9b",
            "net13": "5e:b0:a8:23:a4:b7",
            "net14": "a2:41:f7:77:f8:94",
            "net15": "62:13:50:80:8b:89",
            "net16": "76:4f:53:3d:5d:1f",
            "net17": "b6:44:4e:5b:6d:5c",
            "net18": "e6:4d:77:d8:5d:73",
            "net19": "9e:14:f3:72:25:14",
            "net2": "c6:61:99:ec:06:9f",
            "net20": "82:1b:99:29:f0:e5",
            "net21": "ca:b8:c4:90:bd:66",
            "net22": "ae:db:b3:d7:60:41",
            "net23": "72:e8:51:c5:bb:eb",
            "net24": "8e:36:4d:c1:66:7e",
            "net25": "22:9d:4f:0a:40:1d",
            "net26": "8e:5b:d3:05:cc:a5",
            "net27": "6a:d7:8f:92:37:60",
            "net28": "c6:82:94:18:cb:6a",
            "net29": "ae:79:02:2a:c4:29",
            "net3": "2a:7d:b8:e0:ae:cc",
            "net30": "46:61:03:c7:d5:ee",
            "net31": "c2:e9:2f:ef:46:f4",
            "net4": "ba:7b:d2:0c:34:99",
            "net5": "7e:77:42:94:81:56",
            "net6": "8a:f5:d8:56:ed:c8",
            "net7": "12:93:f3:55:c3:a3",
            "net8": "a2:41:6b:72:a6:41",
            "net9": "ae:3b:54:ce:b5:f3"
        },
        "tof_1_2_14": {
            "net0": "8a:8b:97:77:2f:7d",
            "net1": "ba:27:68:76:fb:c8",
            "net10": "26:e1:a0:bd:d1:01",
            "net11": "be:8a:a0:3f:81:3e",
            "net12": "0a:3f:35:0b:85:fb",
            "net13": "2a:17:00:cf:39:a1",
            "net14": "4a:bc:4b:65:b7:b6",
            "net15": "62:da:44:be:58:b9",
            "net16": "8e:29:ee:43:79:e3",
            "net17": "de:b0:27:26:ca:c4",
            "net18": "9e:84:f3:41:a7:02",
            "net19": "f6:77:88:94:a2:c3",
            "net2": "a2:78:60:8b:74:16",
            "net20": "2a:7f:bf:d8:6c:5f",
            "net21": "4a:00:bd:c5:bd:01",
            "net22": "92:ed:40:61:da:e8",
            "net23": "9a:8e:b3:cd:f5:a5",
            "net24": "8a:74:2c:5c:e5:b9",
            "net25": "da:ed:36:23:37:30",
            "net26": "7a:dd:49:87:7a:d9",
            "net27": "fe:9f:ee:69:0e:41",
            "net28": "e2:24:d0:a1:ab:bf",
            "net29": "c2:1c:20:ad:f5:20",
            "net3": "ae:60:7b:96:ad:24",
            "net30": "c6:9a:e7:91:92:70",
            "net31": "ba:93:53:53:8a:7d",
            "net4": "26:de:cf:c4:95:f2",
            "net5": "16:8c:86:6d:a0:1e",
            "net6": "ca:fe:32:af:3d:04",
            "net7": "da:74:aa:ed:87:d8",
            "net8": "e2:23:cb:92:f0:9e",
            "net9": "fa:cb:d4:7d:f0:8e"
        },
        "tof_1_2_15": {
            "net0": "ee:ef:19:f5:79:6a",
            "net1": "46:f8:06:b4:92:58",
            "net10": "a6:2b:7d:48:c5:18",
            "net11": "aa:84:49:cc:f1:7f",
            "net12": "4a:2d:2e:70:e1:62",
            "net13": "de:aa:de:74:7f:a9",
            "net14": "12:53:35:ca:b5:59",
            "net15": "16:50:02:a3:20:c2",
            "net16": "36:4a:84:c9:c6:2e",
            "net17": "3a:96:5c:2c:08:44",
            "net18": "16:12:01:d8:64:87",
            "net19": "ce:81:5f:b0:80:45",
            "net2": "92:db:0d:69:88:ba",
            "net20": "66:a2:14:64:e0:a5",
            "net21": "3a:10:04:f0:4b:9a",
            "net22": "0e:45:44:67:7a:80",
            "net23": "96:61:fc:92:73:76",
            "net24": "de:b9:ed:ae:bf:f3",
            "net25": "fe:03:73:db:a0:66",
            "net26": "b6:21:bb:0a:dc:ea",
            "net27": "46:5c:5b:5a:58:b7",
            "net28": "3a:f9:95:98:90:64",
            "net29": "c6:54:76:b0:42:66",
            "net3": "ba:05:5d:5f:1d:4e",
            "net30": "96:49:a9:f0:f6:17",
            "net31": "22:fc:53:ea:16:f2",
            "net4": "a2:2f:da:cf:2d:c9",
            "net5": "fe:72:7e:cd:63:52",
            "net6": "66:b1:7f:d5:75:2b",
            "net7": "86:b7:b8:92:a3:81",
            "net8": "06:01:29:d3:87:77",
            "net9": "36:31:cd:31:72:85"
        },
        "tof_1_2_16": {
            "net0": "16:ba:01:45:5e:53",
            "net1": "46:43:a5:59:95:a2",
            "net10": "b6:51:40:40:99:b2",
            "net11": "92:b0:37:87:b1:a5",
            "net12": "ba:9d:d0:7f:2a:5e",
            "net13": "ee:8f:64:24:29:73",
            "net14": "46:18:3c:7d:1a:45",
            "net15": "fe:9f:93:b7:b2:3e",
            "net16": "42:a4:31:1e:f0:38",
            "net17": "de:51:a0:e8:57:d0",
            "net18": "6a:8c:b1:23:c3:9a",
            "net19": "02:50:b4:8e:bb:57",
            "net2": "da:ba:aa:41:a9:0d",
            "net20": "5a:5f:2b:d2:74:74",
            "net21": "2a:85:b9:11:cf:31",
            "net22": "b6:fd:03:ac:02:73",
            "net23": "5a:23:c3:d4:83:51",
            "net24": "1e:13:5b:d1:26:1d",
            "net25": "2e:a2:7b:65:c9:92",
            "net26": "36:78:b5:81:30:14",
            "net27": "fe:88:e7:23:02:97",
            "net28": "92:38:34:f8:99:df",
            "net29": "22:ad:18:6d:53:1d",
            "net3": "16:c2:54:1b:90:10",
            "net30": "5a:b9:f2:1b:7b:e1",
            "net31": "06:1e:84:a4:ec:1d",
            "net4": "d6:71:4c:86:ed:92",
            "net5": "ea:15:63:98:41:a5",
            "net6": "0e:46:05:39:14:3f",
            "net7": "8e:3a:12:0b:01:c9",
            "net8": "6a:9a:43:77:11:e7",
            "net9": "c2:d0:9c:9f:27:b9"
        },
        "tof_1_2_2": {
            "net0": "22:ca:f1:e1:08:cb",
            "net1": "4a:cb:e2:0d:9a:b7",
            "net10": "3a:31:fa:37:eb:a7",
            "net11": "0a:75:94:bf:1a:53",
            "net12": "02:78:cf:cf:8c:f4",
            "net13": "0e:97:5e:ee:36:f8",
            "net14": "6a:76:30:01:da:22",
            "net15": "02:e6:4a:40:ef:8e",
            "net16": "32:fc:09:e7:d3:b8",
            "net17": "42:70:1c:e5:21:44",
            "net18": "12:0d:33:bd:9a:fd",
            "net19": "96:a5:5b:bf:62:4b",
            "net2": "56:4e:d7:66:b1:0b",
            "net20": "42:f9:ff:f5:37:61",
            "net21": "46:f1:db:96:45:0e",
            "net22": "12:47:3c:01:36:fd",
            "net23": "6a:69:49:de:1e:ef",
            "net24": "ae:bc:62:b6:bd:ae",
            "net25": "f2:80:ce:e5:e7:95",
            "net26": "a2:6e:d0:85:69:8f",
            "net27": "ca:ac:e6:dd:de:af",
            "net28": "ba:6e:9c:75:20:75",
            "net29": "36:46:4a:16:2a:6a",
            "net3": "8e:e0:53:57:49:93",
            "net30": "0a:3f:d5:aa:e1:ba",
            "net31": "7a:5a:20:59:b3:97",
            "net4": "d6:6a:b1:48:b0:26",
            "net5": "da:35:4e:12:bf:f4",
            "net6": "f6:88:a3:e1:7e:45",
            "net7": "ea:c6:c3:04:52:42",
            "net8": "56:fd:74:33:7b:a7",
            "net9": "32:fa:0f:74:75:37"
        },
        "tof_1_2_3": {
            "net0": "de:b3:ac:53:73:c6",
            "net1": "b6:ad:db:91:bf:b2",
            "net10": "72:3d:9f:1e:5e:a5",
            "net11": "7e:34:b8:60:6b:e4",
            "net12": "62:26:2a:a3:02:d6",
            "net13": "8e:2f:b9:9d:e4:ff",
            "net14": "66:ff:4b:8b:e8:b1",
            "net15": "f2:1d:4d:6a:92:70",
            "net16": "3a:5c:6a:cb:5c:98",
            "net17": "42:0c:7a:3e:da:3c",
            "net18": "8a:06:63:6f:dd:dc",
            "net19": "ba:a2:0f:6d:11:0a",
            "net2": "d2:87:21:c1:db:78",
            "net20": "de:00:c8:83:65:fb",
            "net21": "6a:ee:65:3c:e3:24",
            "net22": "82:91:dc:2c:ae:11",
            "net23": "1e:75:9e:be:ea:ce",
            "net24": "5a:5a:77:db:c8:c8",
            "net25": "2a:02:e7:b5:c4:b5",
            "net26": "16:d6:97:f8:44:7c",
            "net27": "ca:48:c3:ca:6c:2f",
            "net28": "2e:54:27:b4:d6:ac",
            "net29": "b6:34:71:cd:25:a4",
            "net3": "d2:e5:6a:d5:5d:f5",
            "net30": "b2:81:39:4f:dd:ea",
            "net31": "ee:4b:53:b7:ce:d0",
            "net4": "32:50:b9:2e:5f:ec",
            "net5": "6a:4d:03:05:62:f2",
            "net6": "aa:24:a6:ac:35:14",
            "net7": "12:ef:66:ef:89:48",
            "net8": "ae:09:c6:3d:cb:bc",
            "net9": "22:27:5a:e6:db:9d"
        },
        "tof_1_2_4": {
            "net0": "06:b5:ce:e5:84:73",
            "net1": "26:90:e0:5a:64:6a",
            "net10": "1a:c5:50:0d:50:56",
            "net11": "f2:a3:38:d2:7e:45",
            "net12": "8e:59:22:53:ea:72",
            "net13": "1a:0d:1b:a3:d2:a1",
            "net14": "fe:ff:56:7b:c6:5e",
            "net15": "2e:1d:56:de:cb:6a",
            "net16": "72:41:7e:f1:b8:c9",
            "net17": "02:fe:49:ab:0d:41",
            "net18": "2e:7e:0d:26:3d:39",
            "net19": "e2:37:7a:64:c8:08",
            "net2": "62:61:71:17:23:02",
            "net20": "4e:46:7c:dd:d0:d6",
            "net21": "e6:7e:0f:40:20:bb",
            "net22": "c6:6d:5f:4a:fa:83",
            "net23": "fa:82:25:8c:32:74",
            "net24": "4e:9f:0d:6c:ce:fe",
            "net25": "f6:2a:d0:19:a5:9f",
            "net26": "b2:c6:e8:b3:f5:cc",
            "net27": "ba:c6:b6:1d:11:eb",
            "net28": "7a:bd:14:25:be:52",
            "net29": "72:78:88:39:d4:f5",
            "net3": "32:f7:00:84:ae:00",
            "net30": "e6:f0:bb:4c:83:de",
            "net31": "ea:52:a4:80:e2:35",
            "net4": "9a:e6:2c:b8:63:26",
            "net5": "b2:d4:10:19:22:4c",
            "net6": "de:2b:6b:71:84:ea",
            "net7": "ea:21:c7:1f:b9:fa",
            "net8": "ce:d5:23:36:78:b1",
            "net9": "56:64:11:e3:80:ea"
        },
        "tof_1_2_5": {
            "net0": "fe:4c:1f:6f:96:2b",
            "net1": "e2:ed:18:6d:02:78",
            "net10": "52:d1:79:0f:5a:0f",
            "net11": "7e:98:e2:9e:a9:45",
            "net12": "3a:8d:6d:9b:20:5b",
            "net13": "a6:8c:5f:e8:59:60",
            "net14": "a2:a4:77:1e:d4:af",
            "net15": "76:2d:7b:2b:1b:ad",
            "net16": "26:b2:22:b3:6c:9e",
            "net17": "c6:4a:79:11:de:36",
            "net18": "f6:4a:08:54:bf:20",
            "net19": "9e:cf:7e:0c:a8:c1",
            "net2": "92:53:2b:6a:a7:89",
            "net20": "de:9d:74:cb:d7:15",
            "net21": "c2:cd:23:6e:20:29",
            "net22": "0a:54:3e:48:93:e7",
            "net23": "c6:22:a0:23:3e:28",
            "net24": "1a:d6:af:6e:a5:3e",
            "net25": "ea:bb:29:15:11:81",
            "net26": "8a:f7:ac:6a:d3:86",
            "net27": "fa:b1:4d:85:2e:23",
            "net28": "9e:e9:f4:23:21:41",
            "net29": "86:fd:c0:c9:cb:57",
            "net3": "06:76:5e:fc:75:38",
            "net30": "6e:05:5f:b9:2e:ee",
            "net31": "8e:65:0c:05:49:db",
            "net4": "3e:18:bf:cf:30:92",
            "net5": "f2:be:66:ee:38:37",
            "net6": "72:93:a5:35:ce:6e",
            "net7": "ae:38:04:10:46:cf",
            "net8": "a2:01:9d:be:1b:3d",
            "net9": "a2:7f:ed:dd:f7:83"
        },
        "tof_1_2_6": {
            "net0": "d2:96:ce:ee:0f:c0",
            "net1": "a2:92:4c:16:cc:0d",
            "net10": "1e:0b:91:f1:5c:70",
            "net11": "82:5f:63:52:ba:ae",
            "net12": "8a:0f:57:6b:79:02",
            "net13": "66:04:b5:c4:96:96",
            "net14": "16:55:05:f9:47:c8",
            "net15": "06:86:0f:ca:c6:e4",
            "net16": "52:30:cc:45:16:fc",
            "net17": "96:15:73:51:72:56",
            "net18": "ca:b2:85:73:c1:f9",
            "net19": "3a:c4:2b:0c:82:2f",
            "net2": "d6:33:70:72:b5:46",
            "net20": "02:dc:82:97:b7:49",
            "net21": "fa:2d:d3:fc:a2:fc",
            "net22": "1a:51:32:ee:1f:ca",
            "net23": "62:c2:6e:da:c1:34",
            "net24": "96:08:ee:b3:b9:58",
            "net25": "1e:fb:ae:54:5c:e1",
            "net26": "66:6b:a9:58:75:aa",
            "net27": "fa:e3:f0:a6:9a:82",
            "net28": "62:b8:cd:b6:bd:68",
            "net29": "66:97:8c:26:a4:87",
            "net3": "5a:9c:3e:f3:8c:23",
            "net30": "1a:5a:32:9d:90:3a",
            "net31": "aa:ae:a6:0d:f7:d1",
            "net4": "32:cb:7e:b2:63:8c",
            "net5": "66:ba:85:1d:c8:7b",
            "net6": "8a:15:0a:0c:3d:2c",
            "net7": "fe:ea:ef:d3:16:d3",
            "net8": "c2:d4:73:17:2d:df",
            "net9": "02:4b:e3:35:ce:cb"
        },
        "tof_1_2_7": {
            "net0": "5a:e9:7d:5d:b7:06",
            "net1": "0e:6d:b9:16:49:bf",
            "net10": "e2:c9:4d:fa:9f:00",
            "net11": "36:e9:e7:91:c8:07",
            "net12": "6a:fc:59:dd:03:d7",
            "net13": "2a:b2:f9:14:3a:12",
            "net14": "ce:99:90:24:df:8c",
            "net15": "9a:b0:f5:ac:c6:bd",
            "net16": "5e:7a:03:75:50:c3",
            "net17": "46:98:c9:94:e4:f3",
            "net18": "7e:5e:b1:fc:35:20",
            "net19": "6e:93:b5:ff:5e:a4",
            "net2": "6e:f5:8c:7e:3c:2a",
            "net20": "72:2f:95:20:e4:3a",
            "net21": "f2:96:cf:ca:51:d7",
            "net22": "d2:d7:64:53:e8:28",
            "net23": "0e:52:61:92:6f:46",
            "net24": "36:d4:45:f0:bf:8c",
            "net25": "5a:4f:78:d6:8e:c1",
            "net26": "2e:98:f7:ed:43:34",
            "net27": "b6:66:a8:33:7f:c3",
            "net28": "b2:df:f3:64:b3:ac",
            "net29": "e2:b4:72:24:0b:c4",
            "net3": "0e:f0:0c:33:c5:aa",
            "net30": "9e:ec:8f:04:23:aa",
            "net31": "d6:cf:0b:89:1a:a7",
            "net4": "ea:be:c7:ba:98:5c",
            "net5": "ee:98:64:2b:f5:77",
            "net6": "b6:4b:3c:70:82:c3",
            "net7": "2e:a4:ee:9c:6f:52",
            "net8": "ca:c0:ea:d6:72:fb",
            "net9": "ca:e6:a8:70:2a:88"
        },
        "tof_1_2_8": {
            "net0": "1a:9c:fa:14:75:71",
            "net1": "c6:63:2a:a8:4f:2d",
            "net10": "76:85:33:50:9d:8a",
            "net11": "ea:2c:69:63:70:93",
            "net12": "06:77:fa:83:1e:6a",
            "net13": "16:1d:3b:fa:db:3f",
            "net14": "f2:c8:30:cb:1c:e4",
            "net15": "a2:67:cd:36:5c:a5",
            "net16": "f2:21:51:21:19:f4",
            "net17": "56:50:ad:14:76:1a",
            "net18": "6e:4d:e4:c7:c2:0e",
            "net19": "3e:a6:e3:bc:ac:78",
            "net2": "d2:91:34:c8:23:7c",
            "net20": "06:bf:4b:6d:1d:c5",
            "net21": "5e:5a:aa:30:a3:77",
            "net22": "4e:3f:8c:7e:f7:19",
            "net23": "02:81:77:08:c4:a0",
            "net24": "02:76:1d:04:72:d5",
            "net25": "3a:e9:82:2d:85:cd",
            "net26": "5e:60:cf:b1:bf:10",
            "net27": "42:5c:40:ef:6f:b0",
            "net28": "2a:bd:02:45:ed:a2",
            "net29": "96:2d:d8:dd:5a:15",
            "net3": "be:32:a6:55:b7:8d",
            "net30": "6a:02:9e:72:b2:7f",
            "net31": "5a:e4:08:d2:27:67",
            "net4": "c2:f7:91:26:f6:68",
            "net5": "ea:48:4e:e2:ad:1e",
            "net6": "5e:ea:51:14:1d:ef",
            "net7": "a6:62:c5:6d:79:b2",
            "net8": "1a:d7:01:c5:87:7c",
            "net9": "ae:0d:ca:13:c1:16"
        },
        "tof_1_2_9": {
            "net0": "ba:d7:00:6b:be:3a",
            "net1": "26:b1:aa:ee:80:97",
            "net10": "de:34:88:92:53:35",
            "net11": "f2:51:74:1f:36:ff",
            "net12": "5a:39:8d:5b:03:85",
            "net13": "ae:7d:76:17:fb:d7",
            "net14": "ba:bd:6d:9d:0c:ac",
            "net15": "86:a5:18:81:6e:48",
            "net16": "9e:fd:4d:6c:0f:90",
            "net17": "ba:05:3c:c4:4b:fe",
            "net18": "6a:fc:5b:b2:18:38",
            "net19": "ba:1c:05:f0:08:5a",
            "net2": "be:6a:a6:61:3c:9a",
            "net20": "4a:50:9f:2c:de:af",
            "net21": "36:c8:5c:c7:a5:05",
            "net22": "2e:ea:22:6e:9b:11",
            "net23": "92:da:a6:e2:e1:f2",
            "net24": "e2:b6:5b:77:ce:9b",
            "net25": "5a:c0:55:ac:8b:5d",
            "net26": "b2:c9:a7:63:5d:e9",
            "net27": "fa:60:b3:9c:b2:19",
            "net28": "fa:2c:5d:a2:3d:3e",
            "net29": "92:93:c3:02:77:3c",
            "net3": "46:19:01:2d:74:8f",
            "net30": "b2:d7:a1:97:32:b3",
            "net31": "e6:c2:03:a2:09:ab",
            "net4": "a6:38:16:9e:1c:80",
            "net5": "0e:f7:f3:e5:c7:26",
            "net6": "12:ac:6a:d5:50:80",
            "net7": "f6:27:39:ad:6d:53",
            "net8": "96:16:97:a4:6e:23",
            "net9": "6e:46:a8:9f:11:98"
        }
    },
    "failed_machine": "tof_1_2_1",
    "failure_time": {
        "leaf_1_0_1": 1635179941.5289514,
        "leaf_1_0_10": 1635179941.5389683,
        "leaf_1_0_11": 1635179941.54994,
        "leaf_1_0_12": 1635179941.561897,
        "leaf_1_0_13": 1635179941.5757062,
        "leaf_1_0_14": 1635179941.5880454,
        "leaf_1_0_15": 1635179941.6004658,
        "leaf_1_0_16": 1635179941.6095872,
        "leaf_1_0_2": 1635179941.631615,
        "leaf_1_0_3": 1635179941.6496868,
        "leaf_1_0_4": 1635179941.5348785,
        "leaf_1_0_5": 1635179941.5434067,
        "leaf_1_0_6": 1635179941.5551279,
        "leaf_1_0_7": 1635179941.5622773,
        "leaf_1_0_8": 1635179941.8189547,
        "leaf_1_0_9": 1635179941.5893986,
        "leaf_2_0_1": 1635179941.5972428,
        "leaf_2_0_10": 1635179941.6069753,
        "leaf_2_0_11": 1635179941.6129851,
        "leaf_2_0_12": 1635179941.6309185,
        "leaf_2_0_13": 1635179941.6404176,
        "leaf_2_0_14": 1635179941.6489246,
        "leaf_2_0_15": 1635179941.6734831,
        "leaf_2_0_16": 1635179941.9548204,
        "leaf_2_0_2": 1635179941.9653573,
        "leaf_2_0_3": 1635179941.9747941,
        "leaf_2_0_4": 1635179941.7398496,
        "leaf_2_0_5": 1635179941.9936347,
        "leaf_2_0_6": 1635179941.762159,
        "leaf_2_0_7": 1635179941.775389,
        "leaf_2_0_8": 1635179941.6743515,
        "leaf_2_0_9": 1635179941.7089894,
        "spine_1_1_1": 1635179941.7170832,
        "spine_1_1_10": 1635179941.7276506,
        "spine_1_1_11": 1635179941.738069,
        "spine_1_1_12": 1635179941.7435393,
        "spine_1_1_13": 1635179941.9954352,
        "spine_1_1_14": 1635179941.769626,
        "spine_1_1_15": 1635179941.783871,
        "spine_1_1_16": 1635179941.797722,
        "spine_1_1_2": 1635179941.7832265,
        "spine_1_1_3": 1635179941.793808,
        "spine_1_1_4": 1635179941.8064544,
        "spine_1_1_5": 1635179941.8152869,
        "spine_1_1_6": 1635179941.82601,
        "spine_1_1_7": 1635179941.8448493,
        "spine_1_1_8": 1635179941.8555248,
        "spine_1_1_9": 1635179941.8668823,
        "spine_2_1_1": 1635179941.8780918,
        "spine_2_1_10": 1635179941.8870344,
        "spine_2_1_11": 1635179941.8061683,
        "spine_2_1_12": 1635179941.8156147,
        "spine_2_1_13": 1635179941.8232253,
        "spine_2_1_14": 1635179941.846684,
        "spine_2_1_15": 1635179941.8576226,
        "spine_2_1_16": 1635179941.871074,
        "spine_2_1_2": 1635179941.87893,
        "spine_2_1_3": 1635179941.8906693,
        "spine_2_1_4": 1635179941.9010584,
        "spine_2_1_5": 1635179941.9175856,
        "spine_2_1_6": 1635179941.8938384,
        "spine_2_1_7": 1635179942.1579144,
        "spine_2_1_8": 1635179941.929807,
        "spine_2_1_9": 1635179941.95014,
        "tof_1_2_1": 1635179941.9763172,
        "tof_1_2_10": 1635179941.9836485,
        "tof_1_2_11": 1635179942.0071363,
        "tof_1_2_12": 1635179942.0317023,
        "tof_1_2_13": 1635179942.2803802,
        "tof_1_2_14": 1635179942.0543504,
        "tof_1_2_15": 1635179941.930703,
        "tof_1_2_16": 1635179942.1803412,
        "tof_1_2_2": 1635179941.9476483,
        "tof_1_2_3": 1635179941.9657962,
        "tof_1_2_4": 1635179941.9779034,
        "tof_1_2_5": 1635179941.9863343,
        "tof_1_2_6": 1635179941.9976428,
        "tof_1_2_7": 1635179942.2481587,
        "tof_1_2_8": 1635179942.0295298,
        "tof_1_2_9": 1635179942.0337052
    }
}