{
    "description": "Scenario 3a: Leaf leaf_1_0_1 failure with BGP",
    "k_leaf": 16,
    "k_top": 16,
    "redundancy_factor": 16,
    "is_k8s": true,
    "machine_mac_addresses": {
        "leaf_1_0_1": {
            "net0": "ce:53:c7:96:da:ba",
            "net1": "ba:0b:6b:92:0a:0d",
            "net10": "8a:ae:7c:1e:62:63",
            "net11": "de:cf:bf:d3:75:a8",
            "net12": "32:3e:19:71:cc:62",
            "net13": "62:26:e9:24:95:c5",
            "net14": "a2:12:5d:9a:c5:5e",
            "net15": "1e:e0:b6:a8:c9:8b",
            "net16": "06:53:dc:9c:bf:21",
            "net2": "42:06:6a:01:f2:55",
            "net3": "9e:76:4c:2e:6f:2c",
            "net4": "b2:bc:83:fb:34:d4",
            "net5": "a2:ea:b1:f7:dd:96",
            "net6": "0a:b4:c7:7c:ff:82",
            "net7": "3e:37:af:83:42:7f",
            "net8": "72:49:ff:1c:2f:45",
            "net9": "fe:96:93:c0:05:ae"
        },
        "leaf_1_0_10": {
            "net0": "02:62:ae:f2:ba:fb",
            "net1": "66:22:56:9a:84:b8",
            "net10": "ba:63:30:62:f7:a1",
            "net11": "02:de:be:92:05:28",
            "net12": "12:7b:28:20:d8:9c",
            "net13": "f6:75:90:65:c4:9e",
            "net14": "5e:e8:3a:97:a9:88",
            "net15": "72:ba:8e:54:f7:67",
            "net16": "6e:73:b2:8e:2a:0f",
            "net2": "06:ee:5e:51:01:fe",
            "net3": "9e:8c:ed:f8:0f:64",
            "net4": "32:0d:ea:71:22:33",
            "net5": "82:06:58:64:a2:80",
            "net6": "1e:91:50:80:2c:89",
            "net7": "fe:63:b5:19:79:c7",
            "net8": "06:b9:19:03:b8:fe",
            "net9": "96:60:f8:ec:1e:e2"
        },
        "leaf_1_0_11": {
            "net0": "52:bb:d7:7a:f9:38",
            "net1": "0a:ba:53:1e:72:4e",
            "net10": "06:13:38:95:c4:d6",
            "net11": "b6:20:2c:ec:1f:3a",
            "net12": "66:f9:1f:76:5d:8d",
            "net13": "4a:99:82:9d:62:02",
            "net14": "6a:20:bc:7e:92:32",
            "net15": "9a:15:bb:17:c7:b7",
            "net16": "be:68:29:97:22:aa",
            "net2": "b2:4e:05:a7:9b:7e",
            "net3": "8a:06:d7:19:66:b4",
            "net4": "9e:4b:23:16:a2:a8",
            "net5": "ee:bf:78:95:4b:2b",
            "net6": "82:99:77:f9:01:81",
            "net7": "9e:37:e6:3c:d7:45",
            "net8": "ea:b5:f8:22:85:99",
            "net9": "42:4a:d7:4b:7b:d3"
        },
        "leaf_1_0_12": {
            "net0": "46:76:ed:0f:e5:d7",
            "net1": "2a:05:a4:4f:7e:f7",
            "net10": "42:fb:c0:35:9a:ab",
            "net11": "02:74:5f:5e:97:b3",
            "net12": "a2:a0:11:5f:28:64",
            "net13": "1e:eb:75:fd:23:ee",
            "net14": "b6:53:5a:99:19:d4",
            "net15": "0a:63:d1:d9:64:db",
            "net16": "96:7c:3c:62:fe:6e",
            "net2": "06:50:14:0e:1d:2d",
            "net3": "5e:c4:c4:10:e6:24",
            "net4": "da:0d:81:88:7b:f5",
            "net5": "22:89:2d:8d:34:5e",
            "net6": "8e:cf:6e:a9:5d:72",
            "net7": "6e:cf:c0:cc:a4:c1",
            "net8": "8a:e8:f3:40:f8:03",
            "net9": "16:06:fa:fa:6b:ee"
        },
        "leaf_1_0_13": {
            "net0": "0e:37:c2:1d:24:fb",
            "net1": "0a:16:92:6a:4a:ab",
            "net10": "2a:56:0c:89:db:11",
            "net11": "82:ec:60:24:45:5d",
            "net12": "52:cd:88:5a:9e:2d",
            "net13": "12:b0:83:4f:7e:28",
            "net14": "6e:ef:17:6f:8d:ca",
            "net15": "9e:26:dd:61:ea:26",
            "net16": "16:95:6f:4f:6e:14",
            "net2": "8e:db:f8:0d:c3:fb",
            "net3": "5e:d9:b3:65:77:5b",
            "net4": "a2:c1:5b:cc:95:3c",
            "net5": "42:78:f0:e1:17:bc",
            "net6": "82:72:c1:01:ad:7d",
            "net7": "56:5e:c4:68:3b:c7",
            "net8": "da:e8:5e:88:6c:cb",
            "net9": "82:51:25:b3:b3:3d"
        },
        "leaf_1_0_14": {
            "net0": "de:60:4b:32:d4:8b",
            "net1": "96:40:ec:22:5f:1d",
            "net10": "fe:91:38:bb:86:f8",
            "net11": "7a:79:84:4b:87:3a",
            "net12": "de:17:bd:e9:d9:24",
            "net13": "6e:f8:15:bb:22:52",
            "net14": "ee:e5:2a:e9:11:10",
            "net15": "b6:7e:03:0b:ac:e4",
            "net16": "da:33:8c:4b:5f:f2",
            "net2": "5e:8f:ba:52:6a:2e",
            "net3": "66:18:ca:df:bf:8e",
            "net4": "c2:ca:0c:15:63:a2",
            "net5": "02:ec:6f:2e:7e:a9",
            "net6": "36:ee:37:61:a4:53",
            "net7": "6e:33:73:25:40:27",
            "net8": "8e:7e:7a:21:9a:47",
            "net9": "72:e3:64:ec:ba:50"
        },
        "leaf_1_0_15": {
            "net0": "aa:5e:b6:79:24:d7",
            "net1": "fa:64:a7:ee:47:f7",
            "net10": "f2:f7:01:f1:b5:ed",
            "net11": "02:f1:56:e5:d1:cf",
            "net12": "ea:24:6a:7d:01:cb",
            "net13": "02:12:d6:9b:3d:27",
            "net14": "be:94:53:9f:62:2c",
            "net15": "16:7f:ff:84:46:81",
            "net16": "82:c6:ed:f8:3d:81",
            "net2": "5a:9e:8b:94:9f:ca",
            "net3": "ee:c8:8d:c5:dc:e0",
            "net4": "72:0b:a2:aa:95:6f",
            "net5": "3e:5e:23:01:6b:1e",
            "net6": "4e:3f:fd:03:df:6c",
            "net7": "de:18:bf:93:6d:74",
            "net8": "d6:c8:df:61:4d:65",
            "net9": "d2:af:e6:40:59:90"
        },
        "leaf_1_0_16": {
            "net0": "06:7a:5c:bf:33:86",
            "net1": "3e:32:79:1f:89:9a",
            "net10": "a2:58:06:01:84:22",
            "net11": "32:1d:94:c2:19:20",
            "net12": "a6:53:c7:bd:8c:48",
            "net13": "e2:0b:e6:fb:4d:75",
            "net14": "5a:4d:5c:35:bb:7c",
            "net15": "06:66:9f:e9:3c:1f",
            "net16": "26:c4:16:40:68:57",
            "net2": "8e:d7:d1:45:25:2e",
            "net3": "f2:f1:61:05:4e:4c",
            "net4": "9a:07:ec:4d:25:8a",
            "net5": "5a:41:12:2d:1f:af",
            "net6": "7a:c8:56:ad:47:e4",
            "net7": "72:ce:2d:3f:ed:3c",
            "net8": "6a:91:26:0e:97:97",
            "net9": "c6:14:52:10:7b:0a"
        },
        "leaf_1_0_2": {
            "net0": "1e:62:d4:d4:51:e5",
            "net1": "3e:83:96:32:b1:62",
            "net10": "86:82:6e:50:bd:34",
            "net11": "4a:f3:3a:db:62:b4",
            "net12": "b6:3e:a6:6b:cb:0d",
            "net13": "ae:fd:c0:69:f6:b3",
            "net14": "ea:69:58:9b:b6:33",
            "net15": "ee:06:bd:d4:aa:09",
            "net16": "8e:c5:4c:49:37:d7",
            "net2": "16:fa:8b:3d:fe:67",
            "net3": "16:20:b9:44:0e:85",
            "net4": "62:95:2c:87:d6:bd",
            "net5": "9a:36:62:41:32:4e",
            "net6": "82:d1:b7:67:39:ae",
            "net7": "3a:8c:ff:6a:2a:7b",
            "net8": "b6:e7:47:ad:ce:5c",
            "net9": "16:54:21:67:65:92"
        },
        "leaf_1_0_3": {
            "net0": "2e:24:7b:dd:14:99",
            "net1": "de:68:43:a8:21:ac",
            "net10": "e2:41:3b:03:68:a0",
            "net11": "3e:85:13:31:66:f6",
            "net12": "da:68:be:2b:5d:ac",
            "net13": "86:4c:3b:dd:fa:ce",
            "net14": "06:1f:40:5b:1e:e9",
            "net15": "ba:eb:68:12:1b:7b",
            "net16": "ea:4a:15:8f:68:a3",
            "net2": "8a:e0:92:24:04:0b",
            "net3": "b6:1e:95:95:4b:39",
            "net4": "7e:6b:33:92:61:a9",
            "net5": "0e:ef:b3:84:a8:14",
            "net6": "a6:4d:e8:b1:02:3c",
            "net7": "da:be:29:26:6a:c0",
            "net8": "6a:8f:90:48:f2:47",
            "net9": "8e:f3:17:68:9c:b4"
        },
        "leaf_1_0_4": {
            "net0": "4a:4d:c5:e8:c1:63",
            "net1": "7a:88:e7:b6:c4:77",
            "net10": "42:aa:ee:14:cf:75",
            "net11": "e2:f1:59:b5:93:bc",
            "net12": "b6:89:98:95:6c:ae",
            "net13": "7e:ae:ee:31:9b:79",
            "net14": "92:ef:2d:59:0a:5b",
            "net15": "da:ad:9a:85:6d:12",
            "net16": "5e:dd:59:a7:b7:c7",
            "net2": "e2:b4:85:e1:cd:c3",
            "net3": "fa:a7:7c:66:c6:ea",
            "net4": "5e:53:4e:7c:57:94",
            "net5": "de:f2:50:6c:d8:14",
            "net6": "b2:df:f5:01:04:6e",
            "net7": "c2:46:d4:ff:8c:cd",
            "net8": "22:5a:ff:06:b0:3e",
            "net9": "16:a4:bc:aa:04:4a"
        },
        "leaf_1_0_5": {
            "net0": "ce:d0:cb:82:63:e0",
            "net1": "72:e8:3a:fa:9d:3c",
            "net10": "7a:ba:ca:0b:4e:c6",
            "net11": "f6:93:da:79:b2:27",
            "net12": "ba:a8:29:82:05:c4",
            "net13": "ee:b0:75:a5:f4:b4",
            "net14": "52:0d:31:62:17:71",
            "net15": "96:f2:7e:26:ad:1c",
            "net16": "8e:67:f8:ce:68:be",
            "net2": "32:6f:6a:e3:f4:68",
            "net3": "ca:75:e7:75:b0:fd",
            "net4": "9e:4a:5c:07:06:4d",
            "net5": "56:40:d3:ec:3e:89",
            "net6": "16:06:89:ac:40:de",
            "net7": "4e:ca:63:91:32:67",
            "net8": "66:12:f3:1f:4c:59",
            "net9": "aa:b8:59:3a:d4:c8"
        },
        "leaf_1_0_6": {
            "net0": "1a:78:55:1b:e8:2c",
            "net1": "66:34:f9:b3:0b:f2",
            "net10": "76:72:4e:61:78:86",
            "net11": "46:8c:c2:ff:94:a4",
            "net12": "5e:03:c1:c2:da:d5",
            "net13": "06:09:6d:a8:10:b2",
            "net14": "ce:cc:dc:d7:9b:51",
            "net15": "ae:ae:40:eb:95:54",
            "net16": "0a:50:d4:57:c9:e7",
            "net2": "ca:0c:ff:18:8e:4a",
            "net3": "ea:dc:c4:64:24:e0",
            "net4": "6a:f5:fb:6e:b1:a7",
            "net5": "7e:5c:32:21:ad:11",
            "net6": "fa:fb:4a:77:93:d9",
            "net7": "e6:2c:91:6c:02:5d",
            "net8": "e6:22:07:83:78:3b",
            "net9": "7e:bd:3b:ad:f1:a7"
        },
        "leaf_1_0_7": {
            "net0": "6a:af:3b:7f:47:62",
            "net1": "92:63:e3:95:00:2b",
            "net10": "66:7a:ea:ab:43:5e",
            "net11": "0a:91:ef:19:e3:6b",
            "net12": "26:79:a3:ed:1c:1a",
            "net13": "32:52:97:56:09:ee",
            "net14": "a6:79:29:5b:ca:d6",
            "net15": "1a:bf:e9:bd:29:9c",
            "net16": "42:3b:07:c9:7a:e1",
            "net2": "32:fa:30:3d:ca:17",
            "net3": "d6:89:28:cb:65:3f",
            "net4": "7e:f6:61:1b:c0:74",
            "net5": "06:7d:7a:a7:db:1b",
            "net6": "32:5e:74:c5:54:e7",
            "net7": "ba:ad:14:2f:74:1b",
            "net8": "da:92:97:55:a1:52",
            "net9": "2a:81:14:80:01:99"
        },
        "leaf_1_0_8": {
            "net0": "56:91:b1:63:fd:57",
            "net1": "ee:55:48:e1:36:fe",
            "net10": "d2:19:3a:b3:f9:e2",
            "net11": "12:1d:60:92:dd:1d",
            "net12": "b6:c6:ab:14:77:13",
            "net13": "06:bd:37:59:7c:ec",
            "net14": "8e:6a:89:fe:9d:bb",
            "net15": "4a:31:24:24:c3:eb",
            "net16": "3a:79:11:1e:57:fc",
            "net2": "62:2d:5b:f4:01:d2",
            "net3": "72:bb:c0:d1:2d:d0",
            "net4": "16:d9:30:85:99:14",
            "net5": "e6:45:6e:19:46:57",
            "net6": "e6:8e:c3:5d:6d:95",
            "net7": "0a:76:6c:4c:ab:02",
            "net8": "4e:fd:a6:bf:5d:a8",
            "net9": "fa:d7:57:89:9c:71"
        },
        "leaf_1_0_9": {
            "net0": "0e:01:24:d8:ff:16",
            "net1": "ae:6c:b1:f0:b4:06",
            "net10": "ba:bf:1e:b3:74:ef",
            "net11": "9a:9a:d3:a1:b1:a1",
            "net12": "2a:7e:e9:f5:68:92",
            "net13": "96:fa:a8:e8:6e:20",
            "net14": "56:f5:b0:87:5e:58",
            "net15": "22:7c:a8:dc:4b:8f",
            "net16": "be:33:67:cf:0d:0d",
            "net2": "f2:fd:fe:b4:b0:ea",
            "net3": "ee:51:9c:33:b1:dd",
            "net4": "86:22:5e:a9:9b:d9",
            "net5": "8e:7b:39:14:f4:8a",
            "net6": "da:62:47:0a:84:9b",
            "net7": "92:fc:df:ae:f0:25",
            "net8": "da:b7:5b:d4:97:5a",
            "net9": "62:8c:2a:06:60:e3"
        },
        "leaf_2_0_1": {
            "net0": "1e:e5:64:65:2f:3f",
            "net1": "be:69:ea:9f:f4:36",
            "net10": "f2:17:dd:1b:30:24",
            "net11": "96:4d:18:66:59:73",
            "net12": "8a:5d:33:90:b1:e5",
            "net13": "a2:01:61:bc:4b:66",
            "net14": "f2:8b:ac:45:81:e5",
            "net15": "a2:de:1a:8e:81:83",
            "net16": "fa:8b:3d:df:ac:97",
            "net2": "9e:87:1c:59:8c:d2",
            "net3": "d2:bf:ef:8e:a7:83",
            "net4": "ea:57:18:1c:85:f3",
            "net5": "b2:19:ea:29:02:1b",
            "net6": "fe:7b:9e:46:33:78",
            "net7": "3e:7c:46:e9:49:0b",
            "net8": "02:d2:92:9b:28:25",
            "net9": "1a:d5:19:f8:84:32"
        },
        "leaf_2_0_10": {
            "net0": "26:7f:97:a8:53:2e",
            "net1": "a2:45:28:78:4e:16",
            "net10": "4e:20:af:8e:ba:de",
            "net11": "1e:91:d5:aa:50:08",
            "net12": "fe:62:06:6a:69:ab",
            "net13": "22:5e:82:a2:a1:09",
            "net14": "da:a8:be:a4:a8:69",
            "net15": "b6:71:b8:79:58:c4",
            "net16": "e6:97:cc:51:c6:7d",
            "net2": "b2:b4:dc:27:da:f5",
            "net3": "ca:9f:10:2b:0c:f3",
            "net4": "42:20:62:2a:77:a4",
            "net5": "1a:75:a7:ba:cd:f1",
            "net6": "ce:37:a5:fc:c3:8c",
            "net7": "e6:2c:11:01:02:6a",
            "net8": "4a:37:a3:e6:15:00",
            "net9": "16:ae:dc:2c:fa:85"
        },
        "leaf_2_0_11": {
            "net0": "92:21:5b:b0:e1:60",
            "net1": "9a:8e:f4:8a:1f:83",
            "net10": "0e:af:4d:b4:0c:c8",
            "net11": "ea:e4:67:c9:a2:a9",
            "net12": "56:95:28:05:7b:6c",
            "net13": "86:dd:d1:e1:10:da",
            "net14": "7a:74:4f:56:a3:61",
            "net15": "26:1c:7c:e6:75:1d",
            "net16": "4a:7b:13:8a:d8:a2",
            "net2": "82:bc:29:0d:b5:d6",
            "net3": "fe:44:da:dc:08:dd",
            "net4": "a6:a5:67:1d:ad:8a",
            "net5": "0a:83:5e:6b:27:39",
            "net6": "86:78:f4:68:4f:a2",
            "net7": "5e:d6:62:9a:c5:a5",
            "net8": "5a:14:1b:f8:7f:fe",
            "net9": "fa:df:41:05:7f:65"
        },
        "leaf_2_0_12": {
            "net0": "12:91:49:76:8e:8d",
            "net1": "f2:6f:f4:49:c0:90",
            "net10": "8e:67:83:05:6b:5c",
            "net11": "b2:4b:58:7d:64:fe",
            "net12": "66:8a:c2:1e:78:d5",
            "net13": "e6:51:3b:3c:04:7a",
            "net14": "ce:c3:02:11:53:dc",
            "net15": "3e:f3:66:ee:9f:0b",
            "net16": "5a:a2:12:ef:cd:20",
            "net2": "da:29:ca:14:40:21",
            "net3": "7a:11:8a:42:e9:44",
            "net4": "22:09:b4:54:d6:ff",
            "net5": "ae:68:e7:37:78:62",
            "net6": "da:32:e5:c9:b0:a5",
            "net7": "9e:79:99:fb:51:4e",
            "net8": "4e:24:1b:78:3b:86",
            "net9": "72:32:89:eb:fc:ae"
        },
        "leaf_2_0_13": {
            "net0": "ce:eb:6b:3e:d8:a5",
            "net1": "d2:20:32:95:0d:14",
            "net10": "fe:ea:ce:97:4e:d9",
            "net11": "e6:64:9d:16:e4:fd",
            "net12": "12:31:9f:69:ce:b3",
            "net13": "8a:31:16:39:d1:59",
            "net14": "8a:b1:53:5c:e5:67",
            "net15": "4e:fa:c2:dd:c5:de",
            "net16": "de:d9:08:28:36:32",
            "net2": "3a:77:74:20:75:9c",
            "net3": "8e:e4:19:b0:b7:6d",
            "net4": "3e:59:bf:88:f4:cc",
            "net5": "76:91:bf:27:94:b5",
            "net6": "a2:76:a0:c9:ba:53",
            "net7": "1e:57:a4:98:38:10",
            "net8": "ee:e3:33:e8:d2:6b",
            "net9": "66:93:a6:a7:bb:a4"
        },
        "leaf_2_0_14": {
            "net0": "82:51:84:ea:2b:77",
            "net1": "16:52:d3:81:1d:47",
            "net10": "0e:27:e7:57:cb:12",
            "net11": "aa:da:6f:66:a5:df",
            "net12": "6a:80:31:7e:89:fa",
            "net13": "2a:90:85:62:57:f9",
            "net14": "56:59:8b:da:8e:7c",
            "net15": "16:ff:d0:ad:39:61",
            "net16": "82:d9:b2:1d:bb:71",
            "net2": "ee:9d:49:84:5d:91",
            "net3": "02:98:5f:44:b9:9e",
            "net4": "3e:d3:51:cc:51:a2",
            "net5": "3a:52:b7:69:27:61",
            "net6": "82:a6:7b:54:90:18",
            "net7": "8a:7c:21:4e:66:20",
            "net8": "3a:13:f1:20:a5:77",
            "net9": "8a:2b:94:aa:4e:0e"
        },
        "leaf_2_0_15": {
            "net0": "ca:83:b4:e9:de:12",
            "net1": "ea:f4:6d:77:2c:2d",
            "net10": "d2:7c:38:2c:0a:02",
            "net11": "e6:d6:b1:c9:f0:1d",
            "net12": "ea:43:d7:fb:f5:84",
            "net13": "da:90:26:4c:fa:a0",
            "net14": "fa:18:0d:f1:10:1e",
            "net15": "f2:13:4a:ab:b1:14",
            "net16": "5a:0e:15:f5:69:b5",
            "net2": "da:40:3a:a0:75:34",
            "net3": "d6:44:81:c1:7d:bb",
            "net4": "9a:0b:32:c1:90:5c",
            "net5": "52:eb:79:bd:7f:6f",
            "net6": "3a:73:af:23:0e:8d",
            "net7": "3a:af:9e:80:26:af",
            "net8": "ea:f8:aa:5a:36:04",
            "net9": "ee:9e:92:d3:ed:a9"
        },
        "leaf_2_0_16": {
            "net0": "e6:3d:4e:20:6d:c5",
            "net1": "56:97:c3:e9:39:86",
            "net10": "a2:32:34:4e:a3:f8",
            "net11": "8a:6d:8b:5b:1a:88",
            "net12": "5e:96:d1:cd:77:c5",
            "net13": "86:42:2e:9e:65:5e",
            "net14": "8a:99:e1:55:42:4b",
            "net15": "e2:08:78:70:a0:a8",
            "net16": "6e:f9:24:06:6a:d9",
            "net2": "fe:69:3b:25:cc:06",
            "net3": "02:b6:8b:77:7a:a2",
            "net4": "ba:d3:89:eb:bd:7f",
            "net5": "ba:0c:7b:26:74:c1",
            "net6": "06:bf:f9:21:91:75",
            "net7": "7e:22:86:db:f7:de",
            "net8": "ca:33:44:0a:09:7d",
            "net9": "6a:bf:22:e8:db:a0"
        },
        "leaf_2_0_2": {
            "net0": "22:c4:68:ff:9f:67",
            "net1": "de:0e:ad:e0:cc:3b",
            "net10": "fe:11:ef:54:6a:73",
            "net11": "0e:82:5a:98:ca:25",
            "net12": "12:af:fa:ba:50:e2",
            "net13": "6e:1b:50:1a:b4:a3",
            "net14": "56:b9:14:32:fd:bf",
            "net15": "32:5b:30:c9:c2:52",
            "net16": "6e:e2:c1:b7:fa:9f",
            "net2": "72:f3:ce:2b:f8:d4",
            "net3": "2e:f5:7f:21:04:f2",
            "net4": "1a:46:e2:fb:a3:d0",
            "net5": "32:12:f9:f9:8e:aa",
            "net6": "1a:55:24:4b:2c:ff",
            "net7": "c2:05:55:e1:63:a1",
            "net8": "7a:4f:9d:78:e4:4f",
            "net9": "fa:fa:5d:f4:36:4b"
        },
        "leaf_2_0_3": {
            "net0": "b6:27:68:08:da:47",
            "net1": "1a:5d:b5:6d:93:04",
            "net10": "7a:bd:8d:3e:af:32",
            "net11": "82:a3:e9:0c:1a:4b",
            "net12": "ca:0f:3c:5c:b9:71",
            "net13": "f2:4b:be:69:06:17",
            "net14": "b6:a5:64:16:95:49",
            "net15": "da:d7:6b:05:65:51",
            "net16": "12:42:c5:01:40:7b",
            "net2": "ae:d9:83:c7:57:d2",
            "net3": "8a:d7:0a:21:48:84",
            "net4": "3e:a8:36:00:85:84",
            "net5": "e6:71:78:7c:32:36",
            "net6": "82:5c:36:b9:d1:cd",
            "net7": "92:aa:d0:7d:16:30",
            "net8": "82:24:e2:11:8c:89",
            "net9": "a2:a3:93:ea:ea:82"
        },
        "leaf_2_0_4": {
            "net0": "d2:31:0a:29:b6:13",
            "net1": "02:0b:13:51:30:a7",
            "net10": "36:28:30:d6:59:7d",
            "net11": "9e:03:67:e5:e8:a7",
            "net12": "26:ab:85:e6:36:29",
            "net13": "5e:9f:37:38:2d:a4",
            "net14": "6a:7e:dc:69:61:88",
            "net15": "ce:4e:08:0a:74:08",
            "net16": "e2:b1:30:3d:7c:97",
            "net2": "be:b2:2c:1c:bd:70",
            "net3": "4e:56:4d:a1:0c:60",
            "net4": "da:4c:20:e0:a7:10",
            "net5": "ba:c5:ef:c4:e0:19",
            "net6": "de:aa:f0:43:42:91",
            "net7": "86:eb:79:ce:85:66",
            "net8": "5a:17:8a:8a:fc:d4",
            "net9": "7e:1a:35:9b:6f:e7"
        },
        "leaf_2_0_5": {
            "net0": "4e:b9:88:68:27:40",
            "net1": "ba:b4:48:b4:59:e8",
            "net10": "e6:1d:7f:9c:03:8d",
            "net11": "8e:c1:c4:6e:29:d9",
            "net12": "86:0f:63:24:2e:a8",
            "net13": "62:1e:e4:4c:d2:5b",
            "net14": "2a:89:e1:4b:33:3a",
            "net15": "a6:2e:60:4c:ee:93",
            "net16": "b2:2f:d7:dc:e3:f1",
            "net2": "e6:e9:5f:83:cc:dc",
            "net3": "5a:74:f8:c5:e8:7b",
            "net4": "3e:6c:f6:31:94:48",
            "net5": "66:9a:3b:3f:b1:76",
            "net6": "fe:c3:52:85:f7:17",
            "net7": "a6:92:e5:bf:47:af",
            "net8": "02:fb:7e:bf:06:d7",
            "net9": "ba:94:81:a7:34:88"
        },
        "leaf_2_0_6": {
            "net0": "b2:20:36:42:f8:54",
            "net1": "4a:3a:31:b5:e9:1f",
            "net10": "fe:52:cd:24:ad:f6",
            "net11": "2e:4a:75:59:d1:aa",
            "net12": "a6:28:d5:a9:86:dd",
            "net13": "fe:43:19:0c:c7:29",
            "net14": "c2:cd:a1:f1:54:eb",
            "net15": "66:97:76:7c:92:c8",
            "net16": "8e:a7:44:25:f8:57",
            "net2": "e2:c0:1a:64:3f:8b",
            "net3": "96:67:52:86:79:3f",
            "net4": "82:7a:54:bf:7e:1b",
            "net5": "9e:40:0f:75:93:61",
            "net6": "c2:d1:04:5a:b9:f3",
            "net7": "3e:64:99:e7:7b:c9",
            "net8": "f2:ef:d9:f7:b4:1d",
            "net9": "ba:8a:1f:55:00:a2"
        },
        "leaf_2_0_7": {
            "net0": "ae:27:20:51:db:28",
            "net1": "32:81:f4:69:58:19",
            "net10": "e2:f3:79:5a:bf:3a",
            "net11": "fa:a4:0c:ad:f0:b6",
            "net12": "76:f4:b4:39:de:9b",
            "net13": "52:2e:89:52:5c:a8",
            "net14": "9e:bd:35:d2:d8:75",
            "net15": "da:95:0b:9b:a7:d9",
            "net16": "6a:dd:4f:3c:50:db",
            "net2": "52:24:c5:3e:5e:07",
            "net3": "ae:1e:f5:48:31:63",
            "net4": "ba:47:03:df:ef:8c",
            "net5": "d6:36:63:df:c2:57",
            "net6": "ca:4b:b8:c1:e9:28",
            "net7": "fa:4f:be:72:cd:ae",
            "net8": "62:ec:52:db:41:16",
            "net9": "9a:d8:6d:f5:2a:3e"
        },
        "leaf_2_0_8": {
            "net0": "8e:8a:bd:2c:01:9d",
            "net1": "32:42:c0:ef:b6:d7",
            "net10": "9a:94:0a:63:38:de",
            "net11": "0e:27:c4:b1:6c:34",
            "net12": "02:52:b2:96:de:be",
            "net13": "4a:9f:a7:bb:87:d4",
            "net14": "ee:24:92:d6:dd:d9",
            "net15": "0e:3a:63:ff:7a:10",
            "net16": "92:7a:a9:fe:d4:23",
            "net2": "2a:41:ab:d5:ec:2c",
            "net3": "3a:9f:09:46:68:dd",
            "net4": "e6:b6:88:49:d6:f0",
            "net5": "92:8d:c8:ed:b1:02",
            "net6": "da:99:0a:0b:bf:4e",
            "net7": "d2:81:68:af:45:23",
            "net8": "86:29:5c:49:3e:25",
            "net9": "42:44:bf:de:37:13"
        },
        "leaf_2_0_9": {
            "net0": "b6:bb:94:9a:2a:bb",
            "net1": "1e:85:fc:45:0e:04",
            "net10": "d6:ee:3c:73:eb:9e",
            "net11": "d6:8d:fa:62:c1:52",
            "net12": "c2:72:ed:4c:f8:f4",
            "net13": "fe:b9:22:78:0c:8d",
            "net14": "de:05:b3:6d:31:bf",
            "net15": "de:56:a1:ff:05:0b",
            "net16": "96:7f:0a:2a:48:24",
            "net2": "7a:a1:d3:88:8d:99",
            "net3": "86:b0:f9:7c:7b:da",
            "net4": "da:4d:7b:46:fa:5b",
            "net5": "1a:43:ea:bb:83:0f",
            "net6": "ea:9b:4d:62:f4:eb",
            "net7": "72:a9:9a:3e:b2:37",
            "net8": "7a:5b:22:cc:9f:49",
            "net9": "1a:50:9f:87:59:90"
        },
        "spine_1_1_1": {
            "net0": "d2:eb:a8:67:71:a5",
            "net1": "0a:29:32:d1:91:2e",
            "net10": "e6:0c:d2:ac:7e:0a",
            "net11": "1a:e5:0c:f0:ad:7e",
            "net12": "26:c9:96:bd:0a:4b",
            "net13": "32:29:13:cd:35:76",
            "net14": "5a:db:46:09:aa:8a",
            "net15": "fe:b1:30:66:68:94",
            "net16": "a6:11:ac:4f:6b:a9",
            "net17": "8e:a3:30:13:dd:35",
            "net18": "ce:36:da:44:2e:d0",
            "net19": "ca:15:89:ef:0a:03",
            "net2": "ba:34:d2:cc:a9:31",
            "net20": "a6:a8:fd:01:48:6e",
            "net21": "ea:06:4d:ab:e8:40",
            "net22": "d2:fe:ac:11:e0:09",
            "net23": "32:03:ee:fe:9b:cd",
            "net24": "f6:9e:73:c9:a1:43",
            "net25": "56:51:bb:0b:38:aa",
            "net26": "2e:78:86:53:e7:2c",
            "net27": "92:dc:10:22:08:5d",
            "net28": "7a:ce:4a:57:04:ad",
            "net29": "3e:a0:e9:b4:62:9f",
            "net3": "ce:53:61:b4:e4:a0",
            "net30": "46:a3:41:23:e5:3c",
            "net31": "32:04:f3:79:24:e3",
            "net4": "ca:c0:08:38:57:70",
            "net5": "f2:67:39:b5:a8:53",
            "net6": "2a:07:bd:e0:c6:f7",
            "net7": "ba:6e:84:30:08:d4",
            "net8": "46:a2:2e:39:ac:73",
            "net9": "82:8a:cc:9f:42:49"
        },
        "spine_1_1_10": {
            "net0": "46:8e:d6:72:15:78",
            "net1": "4a:a7:04:4f:50:11",
            "net10": "fa:28:f2:31:74:46",
            "net11": "06:f6:86:9d:3f:fa",
            "net12": "9a:aa:14:fb:d6:aa",
            "net13": "4e:5d:a6:66:e7:55",
            "net14": "f6:69:56:f6:05:a3",
            "net15": "b6:76:c7:4b:c1:8e",
            "net16": "ee:dc:87:17:3a:52",
            "net17": "fe:c5:d9:7d:30:41",
            "net18": "96:d3:9e:c3:1e:11",
            "net19": "ce:76:4d:98:fe:e2",
            "net2": "2a:58:ea:69:cd:8f",
            "net20": "76:fd:13:36:2d:01",
            "net21": "12:8e:39:b6:92:be",
            "net22": "16:16:aa:5f:16:00",
            "net23": "9a:de:73:a1:cb:e5",
            "net24": "26:f9:28:80:96:8e",
            "net25": "22:40:af:51:14:f9",
            "net26": "a2:8f:01:a3:9a:94",
            "net27": "56:75:42:cc:71:5e",
            "net28": "3e:85:e4:a1:eb:8c",
            "net29": "4a:51:11:b9:ad:02",
            "net3": "fa:ef:b1:b7:fe:76",
            "net30": "0e:47:8a:60:bb:25",
            "net31": "86:98:77:f2:0b:d2",
            "net4": "d6:a0:65:72:ce:a3",
            "net5": "2a:8f:e7:5d:d9:dc",
            "net6": "5a:85:af:b4:5d:96",
            "net7": "62:0c:bc:fe:43:29",
            "net8": "5e:7f:0c:d4:de:b4",
            "net9": "46:9e:51:ed:03:57"
        },
        "spine_1_1_11": {
            "net0": "ea:bb:46:d3:83:8a",
            "net1": "d2:45:97:fb:8e:1c",
            "net10": "72:18:87:11:c8:01",
            "net11": "36:b2:c0:73:93:89",
            "net12": "8a:6b:e9:eb:7a:20",
            "net13": "da:0e:9f:7f:11:4a",
            "net14": "06:ef:20:c1:e8:8c",
            "net15": "ea:e9:34:01:be:11",
            "net16": "46:d7:6d:2c:66:71",
            "net17": "3e:4f:2e:01:9a:f8",
            "net18": "d6:f1:17:d4:55:5d",
            "net19": "4e:bf:7d:b5:1d:4d",
            "net2": "42:db:00:39:9c:5b",
            "net20": "9a:ed:28:c6:bf:8d",
            "net21": "36:52:78:e6:94:23",
            "net22": "b6:cf:a6:2c:7f:63",
            "net23": "b6:a9:36:0a:e9:d8",
            "net24": "72:27:ef:d6:0e:f2",
            "net25": "2a:87:4c:d8:80:8b",
            "net26": "26:ea:be:bd:9b:e6",
            "net27": "6e:7d:a4:2d:71:01",
            "net28": "ba:df:39:35:f9:72",
            "net29": "4a:26:30:b8:30:ba",
            "net3": "56:ab:5d:fa:a4:c0",
            "net30": "de:1c:5a:3c:ab:e0",
            "net31": "d6:9e:be:46:90:6d",
            "net4": "0a:c4:42:c2:08:a0",
            "net5": "36:67:1c:37:a7:1c",
            "net6": "ae:c4:3e:1d:04:10",
            "net7": "62:b8:b5:6f:43:86",
            "net8": "de:e2:d6:2f:07:db",
            "net9": "32:e6:25:0f:98:7a"
        },
        "spine_1_1_12": {
            "net0": "a6:03:c1:bf:f3:6b",
            "net1": "7e:34:7e:43:e1:11",
            "net10": "a6:1f:a1:c3:2a:1a",
            "net11": "4e:f9:8f:11:c8:80",
            "net12": "92:6b:bc:a3:67:8f",
            "net13": "0a:fc:18:a1:79:90",
            "net14": "12:1b:0e:fe:9e:af",
            "net15": "5e:10:f6:b7:a1:11",
            "net16": "96:63:20:0a:33:5f",
            "net17": "ce:8d:62:83:49:de",
            "net18": "d6:73:fa:ff:18:34",
            "net19": "d6:6e:96:8f:fd:bc",
            "net2": "a2:64:c2:5d:d0:f8",
            "net20": "da:5b:e5:2c:d0:13",
            "net21": "6e:6c:1c:a8:e5:69",
            "net22": "a6:1e:d1:93:f3:68",
            "net23": "52:22:d2:34:4d:05",
            "net24": "92:af:d1:54:cc:a0",
            "net25": "da:16:58:83:c3:04",
            "net26": "76:21:e4:c7:15:57",
            "net27": "36:50:27:e6:87:62",
            "net28": "7e:54:b0:19:8f:5e",
            "net29": "66:53:92:b2:35:e9",
            "net3": "fe:08:dd:5c:eb:c4",
            "net30": "86:f3:8f:d7:da:d2",
            "net31": "da:11:eb:1a:cf:1e",
            "net4": "32:04:75:0a:f4:24",
            "net5": "c2:58:09:15:38:cc",
            "net6": "be:87:fb:1f:56:cb",
            "net7": "8a:ae:56:56:4d:2d",
            "net8": "5e:29:7e:44:54:06",
            "net9": "96:d1:3f:9b:df:7d"
        },
        "spine_1_1_13": {
            "net0": "ca:5f:1f:dd:b4:ae",
            "net1": "fe:5a:2a:00:fa:60",
            "net10": "0e:42:a3:13:97:75",
            "net11": "72:52:ef:80:36:ad",
            "net12": "3a:76:22:78:35:54",
            "net13": "a6:d0:ea:4d:a6:91",
            "net14": "5e:03:d8:b0:6d:ea",
            "net15": "36:02:a7:1b:c0:e5",
            "net16": "c6:8c:83:32:15:d0",
            "net17": "ce:bc:61:9e:d0:22",
            "net18": "62:d9:c8:a9:77:05",
            "net19": "fe:b3:0e:9e:45:ce",
            "net2": "ee:8e:00:7a:1e:37",
            "net20": "3a:30:4e:0e:4a:a7",
            "net21": "7a:a6:64:0a:c9:e1",
            "net22": "06:b3:e7:ab:ed:1e",
            "net23": "6a:7e:02:03:9d:bc",
            "net24": "b6:a8:56:87:0e:24",
            "net25": "ee:c2:8c:59:fa:60",
            "net26": "b2:f7:ac:0a:70:32",
            "net27": "b2:82:0e:04:b2:2a",
            "net28": "02:dc:7e:f0:02:b5",
            "net29": "f6:6d:b2:1e:e3:a3",
            "net3": "16:6a:89:ce:15:7e",
            "net30": "62:08:58:e8:6f:cc",
            "net31": "9e:66:f5:42:b5:d8",
            "net4": "9e:bb:f7:ce:c9:df",
            "net5": "86:f1:8d:e3:79:ec",
            "net6": "86:5e:fc:b6:08:97",
            "net7": "66:92:dc:59:72:b2",
            "net8": "82:dc:ba:3c:73:6d",
            "net9": "66:3c:c2:b2:10:80"
        },
        "spine_1_1_14": {
            "net0": "f6:15:7c:25:b7:69",
            "net1": "56:14:d7:73:78:25",
            "net10": "62:f9:d4:6e:c2:85",
            "net11": "9e:5a:c0:de:d2:de",
            "net12": "d2:cb:1b:f5:2e:0d",
            "net13": "92:40:44:23:90:1b",
            "net14": "ee:0c:8f:ce:00:27",
            "net15": "b2:98:1b:d2:d2:61",
            "net16": "66:6b:8b:f4:1c:ce",
            "net17": "e2:2b:7a:f8:26:83",
            "net18": "2a:e4:c7:a1:d5:b5",
            "net19": "76:69:eb:de:3a:45",
            "net2": "1a:10:e3:9c:f9:25",
            "net20": "aa:87:b4:66:4e:78",
            "net21": "ce:e0:5e:ea:41:95",
            "net22": "42:95:d1:e1:d9:12",
            "net23": "ca:c9:09:fb:02:e0",
            "net24": "fa:74:cc:7f:ad:a2",
            "net25": "12:96:e5:ed:8f:71",
            "net26": "52:e2:2f:ac:8e:a6",
            "net27": "76:c9:42:4f:7d:d5",
            "net28": "22:4b:7d:39:33:36",
            "net29": "46:25:cc:78:3e:b2",
            "net3": "72:50:b4:c8:be:72",
            "net30": "4a:03:69:db:bc:0e",
            "net31": "d6:92:f9:ce:e1:96",
            "net4": "ae:89:e5:04:a7:aa",
            "net5": "02:ea:6f:c2:d6:fd",
            "net6": "f6:d1:5f:37:9d:96",
            "net7": "26:be:64:7f:ba:05",
            "net8": "06:a7:82:9f:32:3a",
            "net9": "2e:16:48:57:92:5b"
        },
        "spine_1_1_15": {
            "net0": "36:90:c7:84:78:af",
            "net1": "52:f1:34:36:91:e6",
            "net10": "a6:2a:01:67:ea:56",
            "net11": "6e:f2:e1:13:81:d1",
            "net12": "ee:3a:11:0f:95:5f",
            "net13": "9a:c9:20:c4:8f:6a",
            "net14": "5a:b3:e3:0b:70:0f",
            "net15": "b6:b3:32:41:cf:de",
            "net16": "c6:31:12:f3:f2:25",
            "net17": "62:06:53:f2:15:2e",
            "net18": "82:74:8e:38:70:ec",
            "net19": "4e:90:7e:cc:bb:9d",
            "net2": "02:b5:fd:c2:44:3e",
            "net20": "6a:27:d9:dc:b7:5d",
            "net21": "3e:df:40:dd:f4:a0",
            "net22": "4e:dd:d1:33:25:fa",
            "net23": "82:c1:47:75:62:d5",
            "net24": "9a:88:d2:6c:8a:c1",
            "net25": "fe:59:22:d2:c1:f6",
            "net26": "c6:be:5d:25:65:62",
            "net27": "56:98:75:10:43:bf",
            "net28": "22:5f:b0:99:c1:5a",
            "net29": "e2:d0:29:16:4a:05",
            "net3": "46:b1:7a:bb:b0:fd",
            "net30": "c6:ba:0a:75:19:0b",
            "net31": "1a:5b:d4:34:d5:3c",
            "net4": "c2:42:85:6f:b5:ea",
            "net5": "be:e3:84:2d:ed:ab",
            "net6": "aa:82:87:af:e3:ef",
            "net7": "1e:1d:17:33:b3:ea",
            "net8": "82:45:ca:42:53:99",
            "net9": "fa:a9:66:1d:0d:ad"
        },
        "spine_1_1_16": {
            "net0": "92:2f:ba:4e:08:07",
            "net1": "ea:ff:71:06:01:e9",
            "net10": "12:52:02:44:d6:fa",
            "net11": "42:83:6e:f1:1b:2f",
            "net12": "12:14:f7:01:ef:6d",
            "net13": "ea:e7:af:af:ca:86",
            "net14": "7a:6e:de:12:35:e3",
            "net15": "46:db:5d:b3:f1:6a",
            "net16": "f2:f3:4a:77:53:ca",
            "net17": "2a:db:3c:43:ef:96",
            "net18": "3e:8f:d1:17:ec:28",
            "net19": "5e:00:f1:6d:50:b9",
            "net2": "d6:79:8b:d9:cb:28",
            "net20": "82:dc:e3:78:7c:9f",
            "net21": "8e:50:e9:68:f1:32",
            "net22": "a2:57:6c:4e:18:c6",
            "net23": "7e:d4:6b:3c:ff:18",
            "net24": "5e:8f:3a:11:b4:6f",
            "net25": "ca:e8:98:51:93:26",
            "net26": "f6:fe:f5:d4:66:93",
            "net27": "da:3e:7d:db:e2:fd",
            "net28": "d2:fe:e7:b6:1e:cd",
            "net29": "06:4a:38:37:21:67",
            "net3": "8e:d2:3e:fb:39:df",
            "net30": "aa:58:d8:b6:2e:ab",
            "net31": "fe:32:c4:19:51:b1",
            "net4": "e2:b9:78:0c:24:62",
            "net5": "4e:f3:a9:cc:eb:7f",
            "net6": "d2:37:40:96:14:bc",
            "net7": "e6:5d:79:12:e2:4e",
            "net8": "d6:54:74:fb:18:56",
            "net9": "76:ce:42:08:94:71"
        },
        "spine_1_1_2": {
            "net0": "a6:ff:91:89:59:b2",
            "net1": "52:7e:ce:7f:b8:61",
            "net10": "92:00:84:a7:71:54",
            "net11": "ae:d7:dc:38:cd:a9",
            "net12": "fe:0a:9f:b8:3a:16",
            "net13": "0e:7f:9d:3c:90:46",
            "net14": "e6:02:a6:2e:f8:57",
            "net15": "e2:5d:92:ed:81:08",
            "net16": "22:7f:ff:03:13:28",
            "net17": "fe:45:52:fc:e8:42",
            "net18": "56:ac:e8:6d:f0:26",
            "net19": "ea:2f:ca:f3:db:4e",
            "net2": "1e:26:61:e5:41:ca",
            "net20": "46:f6:64:c8:8c:0d",
            "net21": "66:c7:ef:06:15:f2",
            "net22": "d2:10:aa:46:74:15",
            "net23": "86:4d:7a:18:5d:20",
            "net24": "06:ad:4f:10:71:e2",
            "net25": "8e:c9:60:8b:55:aa",
            "net26": "32:c5:82:98:f3:51",
            "net27": "1a:a3:81:67:4a:85",
            "net28": "72:8b:79:41:80:ae",
            "net29": "ca:0f:d8:89:09:cd",
            "net3": "7a:51:4a:24:7e:ca",
            "net30": "2e:c4:13:85:35:0b",
            "net31": "6a:30:e6:d0:1b:55",
            "net4": "aa:22:2c:6d:23:44",
            "net5": "ee:47:b7:1b:4e:cc",
            "net6": "1e:a9:ad:b7:75:1d",
            "net7": "1a:f4:7b:f4:cf:06",
            "net8": "0e:80:a0:98:a4:43",
            "net9": "0a:e5:c8:a0:0e:73"
        },
        "spine_1_1_3": {
            "net0": "ba:83:3f:05:11:5c",
            "net1": "2a:39:46:1b:5e:b6",
            "net10": "5e:0e:d3:57:9a:cd",
            "net11": "b6:95:75:c4:b6:a1",
            "net12": "f6:f9:b5:cf:fa:12",
            "net13": "ba:86:71:02:7c:8c",
            "net14": "3a:fd:70:f1:e9:19",
            "net15": "5e:2d:78:80:6d:f4",
            "net16": "ce:38:8c:43:9a:75",
            "net17": "86:d7:79:78:da:6f",
            "net18": "f2:0d:ff:a5:2d:0f",
            "net19": "36:c1:32:7f:b5:9a",
            "net2": "76:27:f0:67:b0:52",
            "net20": "62:6a:1e:28:8a:5d",
            "net21": "52:17:a9:b0:be:22",
            "net22": "8e:73:90:a3:87:6e",
            "net23": "7a:80:d6:8a:38:34",
            "net24": "56:84:a9:a3:a4:d2",
            "net25": "8a:34:f6:f7:64:af",
            "net26": "b6:bd:ff:83:55:b8",
            "net27": "1e:10:37:90:5b:e3",
            "net28": "5a:6c:8d:4a:cf:1c",
            "net29": "f2:0c:40:81:9f:4e",
            "net3": "26:ef:91:55:6b:3d",
            "net30": "8e:c3:17:fe:e4:6d",
            "net31": "4e:24:79:47:e4:e0",
            "net4": "12:d5:4f:09:2a:39",
            "net5": "ea:8e:77:d0:01:41",
            "net6": "de:b4:f0:f2:21:38",
            "net7": "72:5d:6b:ec:6e:23",
            "net8": "22:ec:54:a2:ad:94",
            "net9": "ea:31:c9:4f:f6:b8"
        },
        "spine_1_1_4": {
            "net0": "d2:b1:f3:70:dd:a7",
            "net1": "52:13:77:f8:f0:91",
            "net10": "0e:7e:0e:80:ed:ff",
            "net11": "0e:38:20:f3:26:cb",
            "net12": "ae:c3:16:83:9e:8e",
            "net13": "92:cf:c0:9d:7f:e2",
            "net14": "76:74:04:ac:5b:24",
            "net15": "2e:60:77:0b:85:5a",
            "net16": "72:75:99:fd:bd:6e",
            "net17": "52:5f:57:2c:92:e4",
            "net18": "3a:b1:67:35:64:43",
            "net19": "72:5c:15:3c:c5:96",
            "net2": "46:8d:32:25:b5:7d",
            "net20": "3a:a9:9c:eb:1d:5b",
            "net21": "76:1b:1d:46:d5:5d",
            "net22": "b6:f9:be:ac:49:26",
            "net23": "ce:05:22:4b:ca:7b",
            "net24": "ba:8f:f7:7b:99:04",
            "net25": "f2:ee:04:46:9f:a8",
            "net26": "96:9d:bb:fa:35:63",
            "net27": "62:ce:96:d7:7d:92",
            "net28": "fe:99:15:57:2a:d3",
            "net29": "62:c4:78:c1:3d:f4",
            "net3": "9e:fa:74:54:d6:ba",
            "net30": "b6:ba:df:a9:7f:3d",
            "net31": "76:93:a7:84:ff:31",
            "net4": "f2:50:aa:3b:0c:75",
            "net5": "9e:8c:ff:90:a1:1e",
            "net6": "e2:ca:21:3f:4c:f7",
            "net7": "ce:da:5c:ed:b2:ee",
            "net8": "da:98:b3:d6:a3:31",
            "net9": "66:b3:b2:af:36:e3"
        },
        "spine_1_1_5": {
            "net0": "0a:35:ac:47:05:95",
            "net1": "72:98:46:28:2e:6b",
            "net10": "1e:39:2f:07:c1:72",
            "net11": "ae:03:2b:09:e6:16",
            "net12": "16:3f:1b:3e:b9:d8",
            "net13": "22:9c:51:ca:6d:50",
            "net14": "62:36:77:09:f8:45",
            "net15": "d6:57:81:11:7b:93",
            "net16": "1a:28:52:a3:08:1a",
            "net17": "66:f5:13:6a:79:40",
            "net18": "3a:45:8a:08:d4:b2",
            "net19": "16:b3:e5:73:2e:8f",
            "net2": "02:2b:cf:d2:13:8f",
            "net20": "be:d8:77:a7:25:59",
            "net21": "66:98:86:db:97:64",
            "net22": "f2:cb:03:06:5c:3d",
            "net23": "be:6f:07:11:3f:6e",
            "net24": "66:9f:c1:bb:86:24",
            "net25": "46:ed:cd:c5:29:1d",
            "net26": "ce:5e:29:46:c4:a8",
            "net27": "0e:88:13:f0:4a:c0",
            "net28": "6a:3b:7a:c0:10:91",
            "net29": "ee:d5:86:fd:6a:14",
            "net3": "b2:b1:d2:55:00:69",
            "net30": "52:88:c7:c9:ca:08",
            "net31": "76:38:4b:da:03:9c",
            "net4": "ba:72:00:94:52:6a",
            "net5": "6a:03:55:37:90:17",
            "net6": "ce:ba:63:82:21:fe",
            "net7": "72:dd:43:83:39:56",
            "net8": "fa:e4:1d:80:d8:e5",
            "net9": "7a:b1:9d:6e:56:41"
        },
        "spine_1_1_6": {
            "net0": "6e:0b:a1:7b:7c:96",
            "net1": "5a:87:27:06:b4:4c",
            "net10": "2a:b2:14:2b:80:5f",
            "net11": "72:0a:f3:de:cb:d0",
            "net12": "1e:fa:c3:17:83:7f",
            "net13": "a6:22:8a:08:6d:98",
            "net14": "8a:ab:54:e0:82:8f",
            "net15": "52:4f:2d:78:2b:1d",
            "net16": "56:7e:0c:5f:4d:60",
            "net17": "4e:79:ec:55:bb:1c",
            "net18": "e6:b7:f4:f8:0d:ea",
            "net19": "aa:d2:3c:04:b5:46",
            "net2": "96:b6:18:ea:0e:78",
            "net20": "c2:7b:e5:44:58:2f",
            "net21": "ca:e1:79:34:6b:e2",
            "net22": "26:6f:8b:7b:66:54",
            "net23": "52:58:9b:d5:7a:ba",
            "net24": "0e:c6:44:70:fc:17",
            "net25": "76:8f:20:a3:94:2e",
            "net26": "2a:2a:b6:44:95:1d",
            "net27": "8a:7c:8e:6b:6f:3c",
            "net28": "b6:98:ae:d6:56:78",
            "net29": "1a:13:96:bd:34:a6",
            "net3": "6a:ea:e6:e2:61:fb",
            "net30": "3a:b3:40:c2:33:ec",
            "net31": "16:59:5f:02:74:3e",
            "net4": "e2:b9:f4:f1:5f:cc",
            "net5": "82:c6:98:ce:b4:3a",
            "net6": "a6:fd:3a:de:74:a0",
            "net7": "c2:a6:d6:27:e7:aa",
            "net8": "52:5a:90:41:89:bf",
            "net9": "1a:4c:d8:55:9b:f0"
        },
        "spine_1_1_7": {
            "net0": "b2:9a:fe:74:d0:53",
            "net1": "fa:62:24:fe:ba:9e",
            "net10": "0a:b3:41:9f:c6:0f",
            "net11": "de:6f:79:44:34:c4",
            "net12": "fe:1d:21:26:38:86",
            "net13": "ea:10:13:81:2e:be",
            "net14": "5e:1d:1c:d9:3e:b7",
            "net15": "6e:6e:d7:98:fd:ad",
            "net16": "2a:a2:44:80:4e:7d",
            "net17": "a6:71:e9:c5:f6:44",
            "net18": "ea:e9:cc:2a:f0:c3",
            "net19": "6e:37:b6:02:0c:00",
            "net2": "d6:3a:74:9c:08:14",
            "net20": "12:2f:e0:a5:a2:9f",
            "net21": "aa:fa:b8:26:16:50",
            "net22": "9a:a7:05:5f:0a:2f",
            "net23": "c6:eb:f3:7a:ae:b3",
            "net24": "32:f1:45:59:b7:86",
            "net25": "4e:5e:99:74:c0:50",
            "net26": "be:d7:6f:5d:04:2d",
            "net27": "ba:b1:00:31:ba:95",
            "net28": "2e:e3:d2:36:c8:98",
            "net29": "42:bc:cd:67:6b:60",
            "net3": "26:b4:a4:3f:39:e2",
            "net30": "82:49:c0:84:be:8f",
            "net31": "4e:ab:80:f3:c4:dc",
            "net4": "e6:5a:a6:38:31:5d",
            "net5": "2e:2c:26:ed:96:81",
            "net6": "9a:fc:70:9c:33:d6",
            "net7": "ca:98:7b:37:9a:c6",
            "net8": "72:8f:16:d9:99:87",
            "net9": "32:ee:7d:46:5e:61"
        },
        "spine_1_1_8": {
            "net0": "86:e7:9b:dc:b9:35",
            "net1": "ae:26:c2:cb:f8:87",
            "net10": "b2:25:08:4a:91:75",
            "net11": "be:fb:5a:0f:04:69",
            "net12": "82:d1:bc:46:79:70",
            "net13": "aa:5d:ba:e0:75:ac",
            "net14": "66:18:cc:2b:16:99",
            "net15": "f6:98:c0:96:d4:72",
            "net16": "42:83:8c:25:e0:02",
            "net17": "ce:dd:21:0e:02:17",
            "net18": "42:64:d0:6b:6d:09",
            "net19": "da:0a:c1:8c:d6:b1",
            "net2": "c6:2b:fb:7b:b8:23",
            "net20": "2a:06:26:ef:88:b8",
            "net21": "c6:60:89:a9:62:dc",
            "net22": "82:d8:8f:25:14:40",
            "net23": "16:83:59:36:aa:22",
            "net24": "f6:e0:db:a5:79:60",
            "net25": "46:61:9a:65:ab:74",
            "net26": "02:b6:d0:54:a8:7b",
            "net27": "3a:c5:32:cb:2a:84",
            "net28": "e2:29:a8:bb:b5:9b",
            "net29": "02:60:c5:f9:01:f5",
            "net3": "da:c5:76:db:62:b1",
            "net30": "d2:1e:05:fb:b4:8d",
            "net31": "6a:e5:1f:0c:3d:f8",
            "net4": "02:b8:05:52:5a:b3",
            "net5": "9a:ab:22:42:f2:42",
            "net6": "5a:53:42:56:f8:ae",
            "net7": "d6:f7:19:2c:4f:5d",
            "net8": "22:e8:ec:8c:0c:82",
            "net9": "4e:00:ba:93:16:a3"
        },
        "spine_1_1_9": {
            "net0": "7e:b7:a8:64:65:01",
            "net1": "4e:b4:32:b1:d6:d0",
            "net10": "a2:cc:96:72:11:28",
            "net11": "9e:cb:34:1e:33:69",
            "net12": "0a:f5:61:02:82:77",
            "net13": "9a:05:21:6c:8d:53",
            "net14": "12:71:16:6b:b3:3f",
            "net15": "f2:6b:c9:80:b3:61",
            "net16": "02:eb:f9:b8:05:b0",
            "net17": "72:97:c2:e5:25:67",
            "net18": "6a:25:96:8a:f3:94",
            "net19": "1a:e4:51:aa:56:ab",
            "net2": "3a:ad:ff:c1:c2:61",
            "net20": "ce:89:4c:44:35:4a",
            "net21": "26:14:a8:57:c5:9a",
            "net22": "fa:89:52:21:6c:a8",
            "net23": "7e:d6:4b:52:52:ce",
            "net24": "ce:52:ee:8c:40:46",
            "net25": "de:52:54:6e:57:80",
            "net26": "82:21:fc:b7:29:e8",
            "net27": "e2:eb:24:ef:64:6c",
            "net28": "da:f1:b5:9b:f7:6d",
            "net29": "62:db:6c:1d:31:22",
            "net3": "ae:dd:db:fe:fe:f5",
            "net30": "56:1f:ab:12:c1:f0",
            "net31": "86:06:e6:ec:6c:ee",
            "net4": "ee:1d:68:0d:a5:5f",
            "net5": "2e:97:39:b4:2a:8a",
            "net6": "36:4d:99:53:84:f6",
            "net7": "c6:c8:49:ac:03:8d",
            "net8": "86:88:ea:f4:48:6f",
            "net9": "a2:0c:08:52:8f:7f"
        },
        "spine_2_1_1": {
            "net0": "aa:36:8f:25:e4:3a",
            "net1": "2a:81:ad:42:83:9a",
            "net10": "1e:5e:18:ea:ec:cc",
            "net11": "0a:d7:82:99:88:08",
            "net12": "3a:7a:d2:94:cb:6c",
            "net13": "de:73:83:0c:1c:4d",
            "net14": "9a:04:96:f8:bb:6c",
            "net15": "16:10:3a:af:ba:b7",
            "net16": "66:01:56:bc:6d:63",
            "net17": "0a:c5:bf:37:14:26",
            "net18": "fa:ed:14:c5:e3:51",
            "net19": "96:d3:16:75:91:ea",
            "net2": "66:da:d8:49:50:83",
            "net20": "f2:c4:46:e4:d1:77",
            "net21": "da:fe:22:ba:b4:5a",
            "net22": "e2:4f:db:9a:30:83",
            "net23": "b2:83:85:df:ab:e7",
            "net24": "6e:3f:cb:bd:15:15",
            "net25": "12:52:1b:da:51:cd",
            "net26": "de:48:53:d0:02:76",
            "net27": "3e:36:bd:db:f2:eb",
            "net28": "e2:7a:47:b3:80:19",
            "net29": "4a:b7:fe:32:23:c1",
            "net3": "16:cd:36:d5:87:b3",
            "net30": "6a:e4:46:e4:d9:2b",
            "net31": "fa:5b:d7:5a:1f:26",
            "net4": "1e:8d:71:43:c3:bb",
            "net5": "de:6f:04:a3:30:2a",
            "net6": "0a:02:77:1d:30:34",
            "net7": "e2:9e:4c:35:12:09",
            "net8": "42:35:af:3c:f7:17",
            "net9": "4e:27:64:da:55:ac"
        },
        "spine_2_1_10": {
            "net0": "4a:65:c3:44:92:74",
            "net1": "e6:fa:cd:96:8e:a8",
            "net10": "6a:df:00:96:78:d6",
            "net11": "56:00:2d:5e:6b:3f",
            "net12": "76:57:be:2e:a0:70",
            "net13": "12:9f:f6:3a:af:60",
            "net14": "ba:d4:02:1e:1a:dc",
            "net15": "02:59:86:34:49:26",
            "net16": "36:75:90:92:81:56",
            "net17": "16:9b:81:f9:6d:74",
            "net18": "c2:a2:80:94:fc:d7",
            "net19": "6e:c8:ae:72:72:eb",
            "net2": "fe:1b:b7:cf:ae:da",
            "net20": "e6:a4:f2:b9:8d:ea",
            "net21": "36:e9:13:52:0b:8b",
            "net22": "36:0a:80:16:a4:b9",
            "net23": "be:c8:d4:8a:c5:4e",
            "net24": "c2:61:8d:49:ff:f8",
            "net25": "3a:7a:cc:5d:af:01",
            "net26": "8e:78:78:72:eb:cb",
            "net27": "92:19:20:1d:16:85",
            "net28": "9e:8e:52:79:68:f1",
            "net29": "9e:e0:15:76:c7:89",
            "net3": "4a:b4:2b:30:3c:4b",
            "net30": "de:90:46:98:99:89",
            "net31": "32:ed:d5:c6:88:56",
            "net4": "0e:58:73:9b:cb:11",
            "net5": "b6:f6:c9:5d:3a:51",
            "net6": "0e:5b:e2:43:f2:c3",
            "net7": "7a:37:cb:5f:63:0e",
            "net8": "c2:61:8a:3d:b3:6d",
            "net9": "fa:49:c9:e9:39:0c"
        },
        "spine_2_1_11": {
            "net0": "d6:3f:29:28:ca:03",
            "net1": "36:85:37:6a:ef:3b",
            "net10": "2e:83:b6:ca:c9:ca",
            "net11": "b6:8d:3d:b9:50:69",
            "net12": "56:bf:36:1b:ae:22",
            "net13": "36:ce:ca:7c:43:1a",
            "net14": "5a:27:c3:24:5b:56",
            "net15": "76:e7:4f:69:f2:a3",
            "net16": "ba:5e:5f:3d:90:51",
            "net17": "62:7f:d2:fd:9d:8b",
            "net18": "2e:57:73:4a:19:e2",
            "net19": "2e:cb:f0:30:be:a9",
            "net2": "8a:d7:b2:75:e8:69",
            "net20": "7a:37:86:85:ac:91",
            "net21": "6a:a3:23:64:7d:7e",
            "net22": "86:68:66:68:b3:42",
            "net23": "f6:fc:79:29:09:d5",
            "net24": "7e:9b:01:46:7f:42",
            "net25": "9a:9b:29:ac:b4:82",
            "net26": "ea:a7:e1:9f:79:b5",
            "net27": "b2:8a:49:66:b0:80",
            "net28": "46:55:33:b3:d0:d5",
            "net29": "a6:b1:f5:8b:7e:03",
            "net3": "16:3f:14:56:f1:d7",
            "net30": "8e:63:fa:1f:dc:fa",
            "net31": "f6:a5:56:c3:58:9b",
            "net4": "7a:55:81:d8:c4:67",
            "net5": "da:bd:47:50:38:f4",
            "net6": "8e:ca:f1:5c:a8:06",
            "net7": "5a:8c:fc:bd:6d:ba",
            "net8": "66:1a:40:00:68:a2",
            "net9": "4e:98:33:e5:31:dd"
        },
        "spine_2_1_12": {
            "net0": "6e:f4:f7:3a:76:63",
            "net1": "8e:79:c7:36:9c:5a",
            "net10": "9a:65:61:5f:e6:76",
            "net11": "1e:89:f2:41:85:3d",
            "net12": "d2:60:fa:fb:97:7a",
            "net13": "9e:26:74:ad:65:7f",
            "net14": "f2:3e:c7:f5:53:4a",
            "net15": "9a:a2:2a:90:c2:98",
            "net16": "d2:14:b4:bc:ae:bc",
            "net17": "9a:77:4b:4a:37:13",
            "net18": "16:86:0a:aa:c8:ff",
            "net19": "aa:8a:8b:56:64:00",
            "net2": "3a:0f:d7:5a:bc:d6",
            "net20": "8a:ff:12:7a:67:61",
            "net21": "16:68:42:c7:f2:50",
            "net22": "2e:36:8b:4d:9b:e5",
            "net23": "d2:28:fb:a2:2c:4d",
            "net24": "52:7a:88:c4:3f:f8",
            "net25": "e6:32:cf:21:92:1a",
            "net26": "3a:03:62:f0:fb:43",
            "net27": "36:b2:7b:df:13:d2",
            "net28": "0e:5f:c1:43:70:7d",
            "net29": "6e:8c:2c:ae:0c:c4",
            "net3": "2a:0c:77:90:88:aa",
            "net30": "9e:99:c9:b3:4a:25",
            "net31": "2e:15:e3:04:12:a4",
            "net4": "82:55:97:cb:6d:35",
            "net5": "3e:86:bb:cd:fe:53",
            "net6": "be:7e:ed:f8:f0:0c",
            "net7": "ca:8b:3b:a4:1b:d1",
            "net8": "5e:92:30:60:eb:fb",
            "net9": "ae:86:f2:a2:eb:5b"
        },
        "spine_2_1_13": {
            "net0": "82:31:aa:c7:80:c3",
            "net1": "d2:3c:0e:b7:06:65",
            "net10": "5e:0e:56:e8:16:e9",
            "net11": "1a:aa:86:40:df:6a",
            "net12": "c6:06:01:ac:ad:4e",
            "net13": "2a:af:7b:9b:7f:4e",
            "net14": "ca:51:2e:f0:e8:d9",
            "net15": "f6:da:56:f0:6a:91",
            "net16": "0e:59:55:e2:7b:94",
            "net17": "b2:ea:4a:21:2f:87",
            "net18": "66:a2:8b:48:fc:e8",
            "net19": "b6:0e:80:c1:10:81",
            "net2": "6e:d4:6a:a2:4c:80",
            "net20": "0a:7e:6f:11:c2:8b",
            "net21": "8e:80:17:e0:ff:55",
            "net22": "d6:3a:bc:1e:10:c6",
            "net23": "f2:5a:d6:5c:12:4e",
            "net24": "ca:a8:61:f6:b7:3e",
            "net25": "12:d3:f5:4f:e0:9a",
            "net26": "c6:6b:4a:48:ab:20",
            "net27": "f6:44:20:8b:aa:1d",
            "net28": "ce:8a:9a:69:69:58",
            "net29": "f2:1d:ca:33:50:b2",
            "net3": "b2:98:30:17:ed:1d",
            "net30": "ce:57:7f:9b:00:0f",
            "net31": "ca:ef:b3:94:72:2f",
            "net4": "ba:d0:56:9e:b4:b2",
            "net5": "ca:78:24:79:7f:ce",
            "net6": "4e:0e:49:d2:a0:04",
            "net7": "fa:04:2a:83:c5:34",
            "net8": "76:e9:5e:54:93:90",
            "net9": "fa:15:f5:8b:88:b9"
        },
        "spine_2_1_14": {
            "net0": "12:99:24:47:70:74",
            "net1": "c6:4f:21:c1:94:97",
            "net10": "ae:f5:9e:45:ea:7e",
            "net11": "72:df:8b:c5:10:54",
            "net12": "22:52:da:30:c9:08",
            "net13": "16:38:72:4e:38:60",
            "net14": "f6:b4:4c:55:f2:61",
            "net15": "f2:83:a1:8d:fb:39",
            "net16": "c6:65:b9:b7:c3:7d",
            "net17": "ba:fa:57:98:d9:5a",
            "net18": "92:fb:1a:dc:21:45",
            "net19": "22:91:25:cb:d9:47",
            "net2": "36:82:69:82:24:29",
            "net20": "ba:ed:9c:41:18:c7",
            "net21": "c6:64:28:67:d7:0d",
            "net22": "a2:ee:0f:bc:49:4a",
            "net23": "fe:e8:e7:bc:28:1f",
            "net24": "7e:37:33:13:10:3d",
            "net25": "2e:ab:ce:5d:0f:34",
            "net26": "52:55:0d:82:44:36",
            "net27": "52:ab:1e:e3:60:38",
            "net28": "f6:5e:14:ab:60:3a",
            "net29": "66:90:0e:9e:93:fb",
            "net3": "5e:b1:ed:48:6d:7d",
            "net30": "d2:c6:0c:1a:53:90",
            "net31": "1a:6e:05:b8:51:33",
            "net4": "8a:a6:78:9c:58:d2",
            "net5": "b6:0b:37:ba:81:20",
            "net6": "76:3c:05:22:66:82",
            "net7": "62:79:c1:3a:7c:a6",
            "net8": "0e:dd:c7:93:68:73",
            "net9": "de:39:2d:b4:2a:e7"
        },
        "spine_2_1_15": {
            "net0": "a6:ff:91:08:19:5b",
            "net1": "96:69:0c:31:2a:f2",
            "net10": "aa:ca:0b:16:10:6a",
            "net11": "ea:3c:42:45:86:03",
            "net12": "d2:b3:fd:44:36:43",
            "net13": "ae:0b:87:96:79:e3",
            "net14": "c6:40:9a:54:e2:0b",
            "net15": "06:2c:de:7d:09:fe",
            "net16": "62:4f:d6:6f:d1:93",
            "net17": "52:72:a0:1b:87:ff",
            "net18": "be:9d:c9:a8:3c:9d",
            "net19": "c6:89:cb:19:95:89",
            "net2": "4e:6d:48:60:ee:30",
            "net20": "9a:b4:59:85:fe:67",
            "net21": "8e:db:b8:13:7b:e4",
            "net22": "0e:a0:39:47:38:c3",
            "net23": "96:df:ce:27:64:58",
            "net24": "7e:6f:56:6f:bb:44",
            "net25": "5e:eb:f8:fd:e9:5b",
            "net26": "46:4c:8a:13:32:fd",
            "net27": "7e:03:a8:8b:b3:4a",
            "net28": "86:15:6c:30:6c:a0",
            "net29": "06:fd:4d:bd:c3:59",
            "net3": "5e:ec:3e:37:ce:d0",
            "net30": "2e:08:59:ec:dd:17",
            "net31": "ae:78:6f:97:c4:dc",
            "net4": "96:ad:ad:c1:c0:37",
            "net5": "2a:84:eb:a9:22:04",
            "net6": "ce:8e:b8:9b:32:2c",
            "net7": "4e:03:eb:ce:5b:bd",
            "net8": "ae:1e:81:2c:48:65",
            "net9": "ba:9f:2c:4b:b9:a2"
        },
        "spine_2_1_16": {
            "net0": "86:39:cd:b8:86:02",
            "net1": "4e:4a:e2:f1:7c:0d",
            "net10": "4a:af:87:34:92:7b",
            "net11": "32:12:87:5b:fb:4c",
            "net12": "92:67:d7:8b:76:ff",
            "net13": "8a:2c:c9:6a:25:a6",
            "net14": "66:f0:01:32:31:b0",
            "net15": "aa:29:44:cd:e8:e2",
            "net16": "1e:62:99:0c:7f:b2",
            "net17": "52:d3:5a:5e:52:56",
            "net18": "6a:09:22:cf:5e:cd",
            "net19": "9e:f5:0a:fa:c5:d8",
            "net2": "26:23:96:e5:c9:91",
            "net20": "8e:ad:1d:33:77:a2",
            "net21": "12:64:f4:3e:c6:ba",
            "net22": "62:61:31:9c:89:b5",
            "net23": "86:ec:2c:18:2d:da",
            "net24": "4e:b1:7c:bb:94:d3",
            "net25": "3e:bc:07:d7:cf:79",
            "net26": "12:1a:5a:8e:af:bb",
            "net27": "0e:fa:ae:99:bb:f8",
            "net28": "86:d7:aa:f7:c5:20",
            "net29": "8a:d9:20:6f:cb:8f",
            "net3": "32:c5:73:02:73:f1",
            "net30": "7a:39:f0:3b:ec:07",
            "net31": "2e:15:10:d9:ef:b2",
            "net4": "86:c9:4f:cd:35:ac",
            "net5": "aa:bc:ea:87:63:8b",
            "net6": "ae:a7:02:59:23:bc",
            "net7": "aa:a3:8e:97:f7:1f",
            "net8": "26:e1:fc:9c:3d:a9",
            "net9": "e2:da:49:25:18:a5"
        },
        "spine_2_1_2": {
            "net0": "32:cd:25:3f:6e:6c",
            "net1": "4e:4e:ef:0d:69:b0",
            "net10": "4e:46:99:6f:6f:75",
            "net11": "3e:2d:56:8a:8b:9f",
            "net12": "a2:ed:bb:ac:24:98",
            "net13": "42:98:08:e6:19:cb",
            "net14": "b6:c5:44:13:fe:ae",
            "net15": "aa:1c:d1:af:7a:82",
            "net16": "e6:b7:1b:93:82:9b",
            "net17": "8a:6d:b2:13:18:e2",
            "net18": "9a:16:48:be:2f:7b",
            "net19": "be:df:88:a9:0a:18",
            "net2": "e6:8e:cb:c0:96:5a",
            "net20": "ca:74:77:c5:6a:a6",
            "net21": "aa:72:7d:97:f5:0d",
            "net22": "a6:cd:19:7e:22:f3",
            "net23": "1e:40:09:fd:1a:f6",
            "net24": "7e:0e:8d:a7:ce:6b",
            "net25": "d6:f6:01:68:60:5f",
            "net26": "26:73:f3:6d:b3:23",
            "net27": "e6:e1:0b:ae:a6:0a",
            "net28": "8a:72:db:f3:77:77",
            "net29": "32:b5:d1:1b:b7:fd",
            "net3": "f2:bd:ff:f4:2b:dc",
            "net30": "02:ba:a8:1c:69:7b",
            "net31": "c2:a7:42:1a:8e:3c",
            "net4": "c6:ec:71:95:d1:73",
            "net5": "96:9f:94:b6:06:0f",
            "net6": "76:cd:51:36:58:60",
            "net7": "fa:72:c7:4f:c8:6e",
            "net8": "2e:cb:50:20:7c:6e",
            "net9": "e6:30:0d:38:3e:44"
        },
        "spine_2_1_3": {
            "net0": "f6:57:6d:27:45:ad",
            "net1": "ee:ff:30:c1:f4:9c",
            "net10": "9a:d4:39:a9:a4:05",
            "net11": "82:78:cf:51:34:99",
            "net12": "2e:68:85:9e:aa:e3",
            "net13": "26:c0:8c:ce:c7:15",
            "net14": "42:d4:de:5b:0f:c7",
            "net15": "fe:a0:76:d0:d0:61",
            "net16": "72:e5:1b:1e:96:08",
            "net17": "1e:f4:08:94:35:a3",
            "net18": "42:e8:43:2d:8a:a0",
            "net19": "12:0e:d4:1b:29:9d",
            "net2": "c2:21:5e:f4:93:c8",
            "net20": "76:3e:29:84:29:36",
            "net21": "3a:e9:1d:16:93:2e",
            "net22": "46:80:6e:13:d6:7c",
            "net23": "32:1f:ac:0a:6c:26",
            "net24": "2e:fe:cc:40:da:38",
            "net25": "3a:09:98:bb:a9:e3",
            "net26": "8a:80:2d:89:ac:b8",
            "net27": "66:c4:88:a3:3b:7f",
            "net28": "62:92:fa:4a:5c:9c",
            "net29": "5e:69:f9:87:21:d6",
            "net3": "6e:44:72:38:f8:6d",
            "net30": "be:21:9e:66:c0:c5",
            "net31": "66:83:ff:d5:c0:07",
            "net4": "12:a3:98:7f:15:7d",
            "net5": "92:ee:aa:53:4f:c8",
            "net6": "fa:aa:4c:ca:c8:9f",
            "net7": "2e:48:13:85:9b:9e",
            "net8": "5a:5a:6d:e3:52:28",
            "net9": "22:de:0f:7b:75:bb"
        },
        "spine_2_1_4": {
            "net0": "f2:cf:b5:02:84:2e",
            "net1": "ee:ea:26:b6:c0:39",
            "net10": "ea:74:ac:24:31:7a",
            "net11": "c2:ff:73:2e:01:30",
            "net12": "d2:a5:d1:db:2f:56",
            "net13": "92:f1:a2:f3:8a:93",
            "net14": "82:6f:b5:90:36:c7",
            "net15": "36:86:63:44:e4:13",
            "net16": "56:70:2d:3a:8f:10",
            "net17": "b6:01:66:5c:69:57",
            "net18": "b6:e3:86:45:28:8c",
            "net19": "1e:6c:8f:90:c9:b6",
            "net2": "22:a2:b2:37:cb:d3",
            "net20": "f2:16:9f:b4:9a:4d",
            "net21": "56:f9:89:9d:60:88",
            "net22": "f6:ed:b7:a0:51:97",
            "net23": "6a:f8:ab:81:d0:40",
            "net24": "82:5c:22:07:68:20",
            "net25": "8e:0f:cc:09:60:5e",
            "net26": "2e:e1:57:d5:be:04",
            "net27": "02:ec:49:f6:99:15",
            "net28": "2a:a0:50:a0:5a:73",
            "net29": "56:d1:83:14:e6:51",
            "net3": "5e:a4:ff:88:5a:bb",
            "net30": "b6:e6:5a:ff:da:ff",
            "net31": "2e:96:df:53:72:ce",
            "net4": "1e:a0:77:68:4b:9f",
            "net5": "f2:7a:8d:fc:23:db",
            "net6": "ba:f0:8e:82:08:14",
            "net7": "66:96:49:c6:c2:a3",
            "net8": "5e:1a:e9:5b:d4:8b",
            "net9": "5e:40:ef:a7:f6:ba"
        },
        "spine_2_1_5": {
            "net0": "a2:9f:fb:fc:f1:7e",
            "net1": "0e:ab:7f:bc:86:ea",
            "net10": "de:fc:87:aa:fd:95",
            "net11": "62:ad:60:ac:87:c7",
            "net12": "c2:1f:c9:77:53:8a",
            "net13": "fe:06:26:62:be:77",
            "net14": "96:80:ca:43:af:57",
            "net15": "9a:fd:4d:3c:24:02",
            "net16": "da:1e:7e:42:5b:28",
            "net17": "22:eb:79:d5:d6:9a",
            "net18": "ee:7d:c2:c0:b9:19",
            "net19": "da:91:45:49:e2:54",
            "net2": "4e:c4:39:a2:ef:87",
            "net20": "ee:93:b0:72:6b:d1",
            "net21": "fe:14:e8:8a:f8:93",
            "net22": "0a:49:f9:f9:d8:c2",
            "net23": "aa:c3:8c:a1:0f:ab",
            "net24": "26:e9:be:a5:48:74",
            "net25": "e2:00:b9:2e:db:52",
            "net26": "3e:33:fb:4d:41:10",
            "net27": "2e:38:9a:9b:75:ae",
            "net28": "4a:76:62:a1:ef:6e",
            "net29": "d6:c3:e4:6b:6e:a6",
            "net3": "92:7c:e4:8e:d3:11",
            "net30": "fe:9e:c0:0f:bf:11",
            "net31": "e2:ba:03:fc:3e:72",
            "net4": "fa:92:3e:f5:b2:53",
            "net5": "66:f7:5c:83:75:47",
            "net6": "be:0c:de:28:1f:5c",
            "net7": "de:76:2e:21:d5:45",
            "net8": "4e:7e:26:d6:f8:50",
            "net9": "96:f7:9c:c2:39:0f"
        },
        "spine_2_1_6": {
            "net0": "da:d4:58:b3:3f:61",
            "net1": "9a:cf:38:ea:89:0f",
            "net10": "5e:80:34:7d:16:35",
            "net11": "3a:05:a6:6f:bd:52",
            "net12": "aa:33:fd:98:79:7d",
            "net13": "6a:ba:50:cb:33:a4",
            "net14": "6a:61:2a:83:8b:c7",
            "net15": "66:7a:38:df:16:6e",
            "net16": "9e:68:30:75:46:40",
            "net17": "02:2f:ca:60:c4:7e",
            "net18": "9e:7b:66:af:4f:84",
            "net19": "42:1b:02:55:34:14",
            "net2": "8e:63:b8:9d:51:32",
            "net20": "12:b5:e7:40:e2:3d",
            "net21": "42:97:e2:9c:58:0c",
            "net22": "66:99:87:58:49:1b",
            "net23": "16:e0:7e:4a:fd:c2",
            "net24": "76:c5:25:ac:60:ff",
            "net25": "b2:a7:5f:60:1a:15",
            "net26": "0a:7d:1d:af:17:8a",
            "net27": "86:db:6f:31:69:91",
            "net28": "e6:8b:9c:33:b4:49",
            "net29": "36:70:9e:62:62:6a",
            "net3": "c2:db:30:97:f4:af",
            "net30": "fa:40:05:a3:2a:d0",
            "net31": "3a:53:3b:8e:ae:00",
            "net4": "ea:83:70:8c:b7:4a",
            "net5": "6e:5d:7f:41:51:95",
            "net6": "6a:51:08:9b:f2:20",
            "net7": "72:c5:6d:8d:f3:ce",
            "net8": "fe:49:4c:e4:15:9d",
            "net9": "92:3c:76:61:7a:ac"
        },
        "spine_2_1_7": {
            "net0": "66:d4:92:88:d5:c9",
            "net1": "5a:68:b1:04:83:67",
            "net10": "7e:47:94:a1:93:93",
            "net11": "8a:a2:49:0d:c9:17",
            "net12": "ca:9f:68:42:01:16",
            "net13": "7e:2b:c7:a9:4f:32",
            "net14": "72:dd:b2:53:eb:8d",
            "net15": "36:fc:54:b4:93:ea",
            "net16": "72:6c:02:f9:e8:58",
            "net17": "e6:ab:fd:b0:6e:fc",
            "net18": "c2:09:6b:a0:c7:25",
            "net19": "9a:2f:0a:be:8c:b8",
            "net2": "be:7c:1b:06:fc:68",
            "net20": "4e:86:a5:80:9e:10",
            "net21": "8e:03:8d:7f:81:6c",
            "net22": "26:25:5b:a7:1b:65",
            "net23": "2e:0b:8b:a0:4e:41",
            "net24": "92:41:da:8f:e3:0c",
            "net25": "36:fb:2c:3f:04:a7",
            "net26": "2a:ee:71:5f:b7:7c",
            "net27": "da:ed:15:1a:2c:cf",
            "net28": "ca:d9:85:16:9b:72",
            "net29": "0e:68:59:18:ce:b4",
            "net3": "0a:88:30:cc:2f:27",
            "net30": "4e:6a:57:4b:ee:6e",
            "net31": "0a:93:1e:f1:e2:4f",
            "net4": "8a:94:98:91:84:fe",
            "net5": "b2:d5:23:8c:d1:3c",
            "net6": "8e:fb:a4:20:be:17",
            "net7": "f2:62:91:bb:70:84",
            "net8": "72:62:b7:0d:4d:c1",
            "net9": "56:02:39:3a:0b:ae"
        },
        "spine_2_1_8": {
            "net0": "ce:ea:4f:47:08:fc",
            "net1": "7a:1d:54:39:54:50",
            "net10": "7a:a0:bd:7e:df:f7",
            "net11": "a2:d6:1e:1c:2c:8f",
            "net12": "a6:49:6a:56:0a:cd",
            "net13": "ae:d1:40:86:66:51",
            "net14": "a6:0c:51:37:a1:b4",
            "net15": "a6:83:27:31:d0:28",
            "net16": "76:3b:08:cf:dd:1b",
            "net17": "0a:7b:3d:06:da:48",
            "net18": "86:2d:4f:19:6e:8e",
            "net19": "ae:c7:af:19:78:21",
            "net2": "82:c5:a0:97:ce:5e",
            "net20": "66:10:ac:cb:5f:69",
            "net21": "5e:7b:e7:56:2e:c3",
            "net22": "2a:76:cc:0e:86:fd",
            "net23": "3e:11:3c:44:82:bf",
            "net24": "06:9d:b6:50:c7:28",
            "net25": "26:04:41:e6:b4:b5",
            "net26": "de:a4:a4:23:39:74",
            "net27": "16:b4:e9:93:d5:0a",
            "net28": "e6:8a:15:14:34:f6",
            "net29": "fe:2a:e3:a8:ad:e4",
            "net3": "2a:21:b7:69:3c:b5",
            "net30": "96:7f:82:88:2d:76",
            "net31": "f6:eb:d7:86:33:a0",
            "net4": "e6:fe:8c:eb:db:a5",
            "net5": "ca:59:a0:f9:45:c3",
            "net6": "62:5a:35:64:65:9d",
            "net7": "5a:1d:f0:bd:63:90",
            "net8": "e2:5d:c8:4e:79:87",
            "net9": "e6:26:f6:d2:67:13"
        },
        "spine_2_1_9": {
            "net0": "a2:b5:90:b1:5c:7b",
            "net1": "aa:05:2e:d0:64:ba",
            "net10": "8a:e3:28:2a:0a:6d",
            "net11": "26:f1:f4:f0:59:74",
            "net12": "8e:47:a7:a4:ca:95",
            "net13": "36:36:ff:48:62:ab",
            "net14": "ee:5a:a5:c7:ed:50",
            "net15": "3e:ae:da:16:0c:88",
            "net16": "36:7d:a2:90:51:d9",
            "net17": "ee:64:ce:bb:0e:55",
            "net18": "b2:37:14:f4:f3:b6",
            "net19": "ee:4c:e6:f4:fd:ef",
            "net2": "ce:fc:b4:5c:7b:c6",
            "net20": "ee:22:af:53:c2:da",
            "net21": "0e:9f:8b:4a:c0:0f",
            "net22": "b6:1d:e3:e6:44:ae",
            "net23": "6a:8c:a0:4b:89:50",
            "net24": "d6:46:ce:28:78:6c",
            "net25": "e2:00:40:5e:2e:48",
            "net26": "c2:c4:2b:a0:7e:6d",
            "net27": "de:97:10:41:29:51",
            "net28": "42:e5:29:a9:6a:4f",
            "net29": "be:2f:04:6e:fa:85",
            "net3": "3a:12:c5:05:d6:8a",
            "net30": "3e:e8:7d:61:73:72",
            "net31": "a2:54:ac:e3:28:50",
            "net4": "f6:18:db:7a:f9:e9",
            "net5": "ba:6b:0d:e6:c2:e4",
            "net6": "4a:59:5a:c6:a9:c2",
            "net7": "62:4f:c0:a0:93:55",
            "net8": "f2:99:2d:d9:22:8f",
            "net9": "26:8e:04:26:5e:a4"
        },
        "tof_1_2_1": {
            "net0": "da:3c:7e:6b:8c:8b",
            "net1": "66:57:9e:61:c0:9c",
            "net10": "12:d4:82:52:05:df",
            "net11": "22:28:36:a7:49:6e",
            "net12": "62:c3:16:e2:45:81",
            "net13": "82:aa:24:57:05:70",
            "net14": "e2:eb:5c:bd:93:7d",
            "net15": "f6:f2:0f:5c:ea:94",
            "net16": "92:bf:ec:19:34:91",
            "net17": "02:14:76:1d:87:ea",
            "net18": "c6:10:77:7d:b2:68",
            "net19": "1e:9e:66:39:7c:16",
            "net2": "ae:80:26:74:ff:d5",
            "net20": "aa:08:c1:37:43:95",
            "net21": "46:c5:41:ca:b0:db",
            "net22": "52:13:aa:bb:8f:3a",
            "net23": "42:57:04:71:a3:ac",
            "net24": "ae:0a:7e:9d:6f:4f",
            "net25": "9a:cd:af:af:fb:ab",
            "net26": "4e:66:fe:9e:c9:40",
            "net27": "52:86:e7:47:ff:d0",
            "net28": "52:6d:ff:ed:fe:2d",
            "net29": "a2:92:29:12:cd:fb",
            "net3": "56:34:80:96:33:dd",
            "net30": "e2:40:1b:5a:8b:7d",
            "net31": "b6:7d:69:bd:47:9a",
            "net4": "76:2e:01:ad:75:90",
            "net5": "c6:f4:ff:63:90:23",
            "net6": "22:63:84:1c:e8:2c",
            "net7": "2a:b9:cb:30:f1:17",
            "net8": "de:ab:d6:fb:95:bb",
            "net9": "76:80:01:3f:d7:8a"
        },
        "tof_1_2_10": {
            "net0": "1a:c2:d4:9e:e3:3f",
            "net1": "02:59:dc:c6:75:19",
            "net10": "1e:2f:b8:94:c8:a5",
            "net11": "9a:22:00:4d:57:c4",
            "net12": "d6:72:77:ea:9a:fe",
            "net13": "02:50:eb:d8:44:75",
            "net14": "7a:f6:26:56:4e:ea",
            "net15": "96:a4:2c:ce:7f:e8",
            "net16": "d2:ec:ae:c7:db:63",
            "net17": "c2:cf:16:7f:a8:a9",
            "net18": "6e:1b:54:ef:ee:dc",
            "net19": "06:13:c8:86:8e:ba",
            "net2": "0e:7e:84:cc:cf:ad",
            "net20": "ba:4e:aa:41:b9:5a",
            "net21": "aa:7d:b8:66:02:21",
            "net22": "ea:86:8e:af:c0:8b",
            "net23": "12:a9:60:d7:5f:2f",
            "net24": "2a:9c:e2:d9:86:58",
            "net25": "e6:2b:a3:f8:f5:15",
            "net26": "a2:b0:ae:56:80:bd",
            "net27": "f2:6b:68:2d:7d:24",
            "net28": "ee:99:7b:95:e5:de",
            "net29": "de:5d:f8:f4:34:cd",
            "net3": "3a:1c:c2:c9:85:6c",
            "net30": "e6:03:9d:8e:6f:f0",
            "net31": "b6:b5:22:33:d5:23",
            "net4": "d6:83:48:b8:ca:d8",
            "net5": "92:69:54:36:50:04",
            "net6": "b2:5d:1a:b5:32:99",
            "net7": "46:cb:80:85:b8:67",
            "net8": "5e:b1:9a:44:40:58",
            "net9": "22:aa:20:30:fc:3c"
        },
        "tof_1_2_11": {
            "net0": "96:ec:da:fe:f8:bc",
            "net1": "8a:07:c5:8b:88:f4",
            "net10": "f2:58:68:b4:c4:a7",
            "net11": "ba:55:04:e4:57:aa",
            "net12": "ea:fe:ab:ab:24:c1",
            "net13": "6a:78:43:72:4f:29",
            "net14": "ba:3c:b4:ae:94:25",
            "net15": "3a:0d:b0:0c:68:83",
            "net16": "f2:d0:75:da:60:4e",
            "net17": "5a:df:e9:21:16:26",
            "net18": "82:84:04:19:09:c3",
            "net19": "22:c4:d8:57:d1:cd",
            "net2": "7e:5f:b1:9e:78:f9",
            "net20": "7e:11:df:18:7b:98",
            "net21": "a2:56:9a:ff:72:00",
            "net22": "b6:5c:24:8a:a3:e1",
            "net23": "16:91:9b:2b:09:34",
            "net24": "1a:7e:a6:3e:51:12",
            "net25": "92:b0:dc:67:0f:aa",
            "net26": "06:f6:1c:95:3b:c5",
            "net27": "b2:7c:f6:3b:9c:2e",
            "net28": "82:a1:13:a6:3a:c3",
            "net29": "de:db:c4:90:0f:ab",
            "net3": "da:57:0a:16:81:11",
            "net30": "aa:9f:57:b4:c5:0b",
            "net31": "62:8b:16:ee:bd:54",
            "net4": "42:d8:6d:ed:d0:96",
            "net5": "c6:13:8a:f6:ab:72",
            "net6": "82:1f:6b:b4:65:a4",
            "net7": "32:e5:6a:16:8b:1c",
            "net8": "be:5a:da:35:55:24",
            "net9": "ce:a6:66:94:02:02"
        },
        "tof_1_2_12": {
            "net0": "32:e6:c6:56:2a:b3",
            "net1": "76:7d:4b:ba:25:cb",
            "net10": "da:94:a1:b9:f7:56",
            "net11": "92:9b:88:0f:f4:28",
            "net12": "36:45:78:f8:f4:bc",
            "net13": "62:25:15:3b:cc:24",
            "net14": "92:1d:ec:f1:7e:2f",
            "net15": "f2:79:4d:5a:d2:af",
            "net16": "02:48:99:5c:8b:d9",
            "net17": "b2:42:09:e2:3f:de",
            "net18": "06:18:b2:12:07:4d",
            "net19": "7a:3c:54:38:52:79",
            "net2": "8a:bc:3a:6b:59:09",
            "net20": "82:f0:06:b8:9d:ce",
            "net21": "ce:ed:fc:8e:a7:51",
            "net22": "f6:da:de:55:0e:ad",
            "net23": "6e:e4:db:e9:1e:01",
            "net24": "e6:24:0f:d8:c5:ce",
            "net25": "ee:85:05:48:57:8a",
            "net26": "e2:ad:94:ec:5a:51",
            "net27": "6a:ea:95:4b:32:ee",
            "net28": "62:69:09:51:72:e2",
            "net29": "ba:09:cb:b5:51:25",
            "net3": "32:29:6d:de:73:49",
            "net30": "be:71:7d:99:4c:a6",
            "net31": "32:7c:f1:f6:3f:cf",
            "net4": "46:6d:33:37:9a:9d",
            "net5": "d2:3e:bc:5a:fb:a4",
            "net6": "52:1a:fc:6a:45:8f",
            "net7": "06:03:59:f9:93:2c",
            "net8": "16:31:40:f6:14:a0",
            "net9": "5e:f2:87:f2:fd:46"
        },
        "tof_1_2_13": {
            "net0": "66:9a:bf:2a:83:9b",
            "net1": "8e:1d:0b:a8:fa:26",
            "net10": "f6:b3:2d:d2:44:9b",
            "net11": "8a:cc:80:72:c2:10",
            "net12": "86:de:48:e5:11:b5",
            "net13": "b2:e5:c7:e4:5e:bf",
            "net14": "de:79:6d:8e:20:fd",
            "net15": "e6:6a:a8:12:3e:91",
            "net16": "ee:cf:99:13:10:ce",
            "net17": "7a:b0:69:08:a8:27",
            "net18": "6e:43:3c:13:57:c2",
            "net19": "26:b5:3b:28:7e:d8",
            "net2": "f2:2b:02:4c:35:f4",
            "net20": "36:37:07:ae:9e:b6",
            "net21": "c6:02:30:c4:19:da",
            "net22": "92:bf:48:fd:4d:2f",
            "net23": "da:1a:a7:49:2a:d6",
            "net24": "12:90:d6:9a:d2:46",
            "net25": "46:99:40:0f:3d:f3",
            "net26": "b2:bd:98:8a:77:94",
            "net27": "ae:e7:4d:e9:82:66",
            "net28": "aa:a3:2d:8d:a0:98",
            "net29": "46:a7:7f:a0:57:41",
            "net3": "2e:f0:03:cd:47:95",
            "net30": "12:f7:9d:19:f1:71",
            "net31": "a2:25:ce:07:1d:9f",
            "net4": "b2:39:88:38:cc:c4",
            "net5": "7a:ff:5d:75:b8:e9",
            "net6": "de:29:1f:a4:37:b0",
            "net7": "82:f8:d0:15:57:f9",
            "net8": "9a:bf:8d:b8:e2:05",
            "net9": "da:33:46:a6:bd:63"
        },
        "tof_1_2_14": {
            "net0": "86:6e:ea:be:fc:8f",
            "net1": "9e:fc:1f:46:08:c9",
            "net10": "ca:03:dd:0a:81:3f",
            "net11": "4a:f5:c5:81:99:f5",
            "net12": "5a:1d:2a:8d:bf:8c",
            "net13": "1e:01:1d:bd:56:9d",
            "net14": "02:e8:3f:7f:3a:b9",
            "net15": "3a:a5:83:08:8a:6c",
            "net16": "ce:2e:13:87:32:d3",
            "net17": "5e:83:49:3b:34:57",
            "net18": "de:19:ca:53:f7:96",
            "net19": "fe:d5:1a:c6:45:c5",
            "net2": "3a:c7:6b:aa:ef:d6",
            "net20": "a2:b6:02:2f:23:81",
            "net21": "d6:65:8a:d4:4f:e7",
            "net22": "fa:60:d0:cb:49:9e",
            "net23": "da:81:c1:f3:15:80",
            "net24": "36:3b:a7:dc:f2:c1",
            "net25": "12:68:62:ff:d5:dc",
            "net26": "3e:b1:83:7c:5c:a0",
            "net27": "4a:12:49:ec:98:c3",
            "net28": "52:7b:a6:7c:6e:7f",
            "net29": "ce:2c:88:b1:c5:be",
            "net3": "de:b9:75:eb:76:bc",
            "net30": "e6:36:fe:38:6d:54",
            "net31": "ce:63:4f:de:09:b2",
            "net4": "22:a7:1b:22:bd:40",
            "net5": "4e:5c:55:27:18:1f",
            "net6": "06:78:c2:86:e6:0d",
            "net7": "46:d4:f0:e5:36:fe",
            "net8": "86:df:bd:ab:a8:76",
            "net9": "fe:ae:21:96:5b:f1"
        },
        "tof_1_2_15": {
            "net0": "e6:2f:a7:d3:c6:be",
            "net1": "12:62:19:cb:a9:d6",
            "net10": "6a:95:10:3a:cf:99",
            "net11": "7e:e0:fd:8e:5c:6b",
            "net12": "06:66:6e:99:0f:a1",
            "net13": "2a:96:41:69:6f:d2",
            "net14": "1a:b0:bf:8d:bd:93",
            "net15": "42:6c:98:d9:f3:63",
            "net16": "7e:4b:cb:93:02:c6",
            "net17": "ee:7f:2f:0a:ba:0d",
            "net18": "ea:1b:f2:49:a8:60",
            "net19": "c6:45:fe:25:7e:ed",
            "net2": "32:4a:e2:a1:f3:bb",
            "net20": "66:6d:12:23:a7:93",
            "net21": "06:2c:af:7f:9c:72",
            "net22": "d2:a9:50:02:f9:84",
            "net23": "9a:63:08:4e:e8:dc",
            "net24": "0e:25:36:53:ea:d4",
            "net25": "1e:d3:a5:fa:9f:6b",
            "net26": "12:1b:b6:c4:1f:52",
            "net27": "02:18:ee:fa:4d:30",
            "net28": "ee:73:f1:df:de:8e",
            "net29": "92:78:0b:7f:d5:2f",
            "net3": "fa:8a:5c:c0:05:6e",
            "net30": "82:b1:aa:b2:7a:60",
            "net31": "42:d0:b1:b1:80:38",
            "net4": "4e:bf:1e:ad:de:65",
            "net5": "ba:f4:85:32:e1:c4",
            "net6": "fe:b9:e5:17:37:f3",
            "net7": "6a:7d:cc:b0:cd:e8",
            "net8": "e2:8c:27:3b:be:47",
            "net9": "52:4f:8f:66:e4:42"
        },
        "tof_1_2_16": {
            "net0": "42:7b:76:d0:92:94",
            "net1": "de:00:5f:f8:a5:22",
            "net10": "62:f1:92:14:83:8b",
            "net11": "f6:d4:7b:05:b0:78",
            "net12": "0a:a2:00:3c:34:68",
            "net13": "ea:65:af:0f:ff:32",
            "net14": "92:38:36:46:98:4b",
            "net15": "2e:02:fa:aa:64:f6",
            "net16": "7a:ca:52:2b:a3:05",
            "net17": "02:06:1a:35:c3:03",
            "net18": "4a:f9:dd:30:fe:f6",
            "net19": "6a:49:50:9a:30:36",
            "net2": "4e:5b:9b:a4:fa:30",
            "net20": "a2:42:7b:95:dd:06",
            "net21": "da:57:86:eb:c6:20",
            "net22": "be:41:ac:96:a4:66",
            "net23": "46:d9:7c:35:f9:cd",
            "net24": "6a:43:c9:62:b0:74",
            "net25": "f6:b7:a1:31:04:04",
            "net26": "4a:3d:82:62:b5:ac",
            "net27": "fe:e5:d4:5e:91:eb",
            "net28": "aa:30:cc:d5:09:98",
            "net29": "ee:82:e5:7f:55:30",
            "net3": "8e:cc:7e:05:bd:a4",
            "net30": "d2:d3:91:3b:88:ab",
            "net31": "aa:9f:20:78:41:46",
            "net4": "fe:37:ae:cc:02:83",
            "net5": "0a:32:a0:91:8a:36",
            "net6": "be:be:c9:0e:ee:91",
            "net7": "46:f6:ab:f0:1a:61",
            "net8": "9e:48:d8:39:7e:80",
            "net9": "ca:16:e4:26:fe:7f"
        },
        "tof_1_2_2": {
            "net0": "fe:ff:18:3e:21:89",
            "net1": "ce:20:2f:0f:8d:cb",
            "net10": "76:b1:e8:fa:b9:07",
            "net11": "52:da:33:ed:ef:49",
            "net12": "66:e8:79:00:3b:d4",
            "net13": "76:3c:bb:84:39:4e",
            "net14": "96:df:e8:19:5c:fe",
            "net15": "46:aa:f2:62:14:15",
            "net16": "52:5b:7e:97:4a:e2",
            "net17": "a2:43:e5:b5:5a:dc",
            "net18": "8a:58:1f:98:f5:e4",
            "net19": "c6:78:b0:ca:df:09",
            "net2": "f2:b7:2e:86:a3:63",
            "net20": "b6:32:4d:33:2c:12",
            "net21": "1e:79:8f:50:7e:f7",
            "net22": "5a:72:b4:2a:d1:17",
            "net23": "ae:36:eb:f2:81:e3",
            "net24": "4a:9e:de:83:0a:b5",
            "net25": "c2:ca:44:97:14:ff",
            "net26": "8e:31:89:8b:76:80",
            "net27": "c6:8d:f8:db:4a:76",
            "net28": "7e:64:0f:15:67:67",
            "net29": "be:e8:2f:13:1f:5a",
            "net3": "0e:a9:ba:ef:7c:b3",
            "net30": "2a:70:5b:e5:9a:00",
            "net31": "a2:31:09:4b:a8:fd",
            "net4": "be:17:b7:ed:48:34",
            "net5": "22:cc:54:ae:70:a4",
            "net6": "c6:69:f3:54:c4:73",
            "net7": "7e:8e:21:5d:ae:89",
            "net8": "2a:22:bb:5b:28:cd",
            "net9": "66:21:3c:6d:b5:06"
        },
        "tof_1_2_3": {
            "net0": "16:99:54:e4:9c:20",
            "net1": "ee:4b:e9:05:37:40",
            "net10": "32:47:d9:0b:4c:bc",
            "net11": "82:c1:11:d2:61:9e",
            "net12": "ca:70:e7:54:a6:7c",
            "net13": "6a:30:54:b3:fe:7f",
            "net14": "da:14:3b:2f:db:30",
            "net15": "ce:89:09:ab:00:fd",
            "net16": "82:23:bd:0f:c8:54",
            "net17": "ae:3b:53:58:d2:16",
            "net18": "b6:f8:44:50:48:4b",
            "net19": "3e:05:63:37:40:70",
            "net2": "2e:52:e9:47:04:6c",
            "net20": "26:35:95:1b:1c:58",
            "net21": "72:a0:af:61:b7:2e",
            "net22": "3a:33:0b:bb:32:2a",
            "net23": "42:0a:00:d5:88:83",
            "net24": "f6:57:5e:31:40:53",
            "net25": "3e:6c:71:0f:18:93",
            "net26": "36:c3:d8:1a:2c:27",
            "net27": "5a:a9:af:35:44:38",
            "net28": "be:41:c9:2a:26:ac",
            "net29": "52:28:1e:79:c0:dc",
            "net3": "66:0a:ba:76:5b:a1",
            "net30": "56:1c:9a:64:71:66",
            "net31": "9a:c7:1d:fa:3a:8b",
            "net4": "ca:f2:02:be:4b:c4",
            "net5": "36:0b:ac:a2:9c:69",
            "net6": "da:ca:f6:f4:5b:0f",
            "net7": "26:ab:9e:b9:5f:fc",
            "net8": "b2:7e:02:32:6d:d4",
            "net9": "66:06:ba:2a:ad:9d"
        },
        "tof_1_2_4": {
            "net0": "36:ef:c6:82:8d:54",
            "net1": "32:d1:87:3d:a6:fb",
            "net10": "4a:a7:b3:0e:2d:96",
            "net11": "02:7f:18:7c:a1:80",
            "net12": "62:00:da:5c:90:cf",
            "net13": "be:3d:c4:42:a8:e4",
            "net14": "3e:c0:10:7c:f6:28",
            "net15": "c6:ff:11:d4:a8:f7",
            "net16": "5a:f6:29:36:7a:6c",
            "net17": "6e:69:82:28:95:b4",
            "net18": "96:6b:93:4f:64:88",
            "net19": "fa:88:ce:72:9f:03",
            "net2": "c2:b2:50:59:ee:99",
            "net20": "6a:8d:ae:57:fb:20",
            "net21": "2a:1f:a1:91:79:a9",
            "net22": "96:04:78:ef:d0:76",
            "net23": "06:4c:d9:ed:4b:e3",
            "net24": "da:82:a7:b0:5a:1d",
            "net25": "8e:02:6c:4a:4c:60",
            "net26": "2e:fe:b2:a6:d3:60",
            "net27": "6e:93:4a:98:b1:b1",
            "net28": "9a:cf:6f:0a:2b:55",
            "net29": "66:ac:07:79:9f:04",
            "net3": "ce:72:bf:30:d3:e4",
            "net30": "fe:6c:06:8e:b0:db",
            "net31": "ce:7a:2e:bb:4e:15",
            "net4": "56:83:50:02:a1:12",
            "net5": "0a:c7:a2:85:d1:87",
            "net6": "6a:1d:71:31:05:93",
            "net7": "2a:05:8e:bd:87:00",
            "net8": "0e:49:88:5f:c5:c9",
            "net9": "ee:49:68:4f:75:c9"
        },
        "tof_1_2_5": {
            "net0": "1e:78:fa:24:ae:05",
            "net1": "de:d2:ea:60:96:40",
            "net10": "22:ec:1f:71:d3:03",
            "net11": "32:b1:5f:3c:0d:9a",
            "net12": "62:79:64:7a:97:6a",
            "net13": "76:6d:d0:78:a7:c4",
            "net14": "92:b3:0d:c2:db:c0",
            "net15": "06:d1:44:5e:f6:87",
            "net16": "b6:95:32:de:f9:57",
            "net17": "0a:fa:a6:a8:cb:a7",
            "net18": "32:5b:4b:31:08:66",
            "net19": "2e:0c:f3:c9:6a:c3",
            "net2": "0a:63:f8:80:d6:64",
            "net20": "b6:e0:f8:ec:1a:70",
            "net21": "d2:68:0a:3a:d9:0d",
            "net22": "16:d2:16:68:44:e0",
            "net23": "b2:15:76:21:a6:18",
            "net24": "2a:05:75:f8:42:5c",
            "net25": "4e:5a:f2:b1:5f:2d",
            "net26": "0e:ba:70:3a:2c:1f",
            "net27": "c2:79:77:93:b3:65",
            "net28": "76:38:c7:c2:c8:de",
            "net29": "32:4a:79:6a:5c:00",
            "net3": "a6:21:cb:d4:46:a5",
            "net30": "ae:a1:96:6a:13:d4",
            "net31": "8e:01:98:88:c5:b9",
            "net4": "0e:4c:5c:cb:03:cc",
            "net5": "c2:dd:17:7b:91:a9",
            "net6": "82:f9:6f:02:f7:5d",
            "net7": "ca:88:38:a9:52:7a",
            "net8": "72:51:6f:bb:21:58",
            "net9": "2a:d2:9b:01:63:a5"
        },
        "tof_1_2_6": {
            "net0": "f2:b2:7a:2a:18:92",
            "net1": "e6:07:80:e2:b5:02",
            "net10": "ba:b5:43:dc:16:3a",
            "net11": "4a:19:54:0b:82:5a",
            "net12": "1e:9f:25:a3:d8:d6",
            "net13": "2e:a0:ee:4f:68:89",
            "net14": "16:24:a9:f6:63:8f",
            "net15": "ce:30:a8:59:fb:d3",
            "net16": "b2:47:f1:13:33:a7",
            "net17": "d6:19:eb:95:1b:26",
            "net18": "12:ab:50:0e:84:bd",
            "net19": "52:f8:de:72:84:ee",
            "net2": "ae:7f:fa:dd:60:3d",
            "net20": "36:66:04:3c:84:bb",
            "net21": "f2:13:d8:36:66:2b",
            "net22": "1a:6d:66:e6:64:2c",
            "net23": "76:70:c5:1e:e2:d3",
            "net24": "76:88:f3:f4:61:06",
            "net25": "26:b2:fe:20:c8:1a",
            "net26": "76:33:11:d4:cc:d9",
            "net27": "8a:83:af:8b:48:37",
            "net28": "7a:96:8b:0a:aa:18",
            "net29": "26:8d:61:a8:8d:94",
            "net3": "0a:d0:85:4c:f0:91",
            "net30": "fa:cf:b5:9c:89:86",
            "net31": "e6:3c:9c:36:d4:8d",
            "net4": "2e:b6:4b:b0:07:6a",
            "net5": "0a:e4:88:22:3d:00",
            "net6": "a2:19:ab:0b:04:ba",
            "net7": "aa:4c:e6:f2:ea:4b",
            "net8": "46:74:87:eb:71:2c",
            "net9": "2a:36:6c:d4:4f:7d"
        },
        "tof_1_2_7": {
            "net0": "d6:a3:5d:ba:98:bb",
            "net1": "0e:0b:eb:0e:22:8b",
            "net10": "76:f1:69:aa:fe:66",
            "net11": "66:96:76:c4:70:02",
            "net12": "06:63:b7:12:5c:7d",
            "net13": "02:f4:67:ef:c1:f5",
            "net14": "12:26:12:cd:47:42",
            "net15": "da:fb:36:90:6a:75",
            "net16": "06:bb:5f:d8:70:0c",
            "net17": "2a:df:60:0b:f7:13",
            "net18": "fa:b8:9c:48:e2:b7",
            "net19": "4a:40:a0:8c:d6:71",
            "net2": "62:70:92:6a:69:c7",
            "net20": "2e:f3:b4:4b:ab:51",
            "net21": "96:ba:10:f6:5c:2c",
            "net22": "d6:16:cb:22:86:fd",
            "net23": "a6:d9:d8:8f:84:69",
            "net24": "16:15:3f:bf:c2:21",
            "net25": "66:eb:56:4f:65:eb",
            "net26": "de:ef:4e:9d:0f:b3",
            "net27": "8a:b0:ca:db:a5:ff",
            "net28": "66:b9:7c:2b:8e:8d",
            "net29": "f6:c0:89:69:21:83",
            "net3": "4e:30:13:92:34:cb",
            "net30": "b2:4b:2b:5a:7a:00",
            "net31": "a6:b6:6a:50:84:e4",
            "net4": "9e:92:a9:cb:4c:96",
            "net5": "f6:55:e0:82:75:ce",
            "net6": "f2:03:dc:cb:13:29",
            "net7": "7e:34:e4:49:08:4e",
            "net8": "42:c7:d5:62:9a:66",
            "net9": "8e:a3:dc:fd:68:c2"
        },
        "tof_1_2_8": {
            "net0": "0e:79:5d:bb:b1:e1",
            "net1": "da:74:77:2e:41:4e",
            "net10": "7a:7c:f1:30:ce:f5",
            "net11": "92:6a:69:3f:8c:cd",
            "net12": "4e:36:52:e6:0d:0b",
            "net13": "4a:08:85:f1:0e:e6",
            "net14": "16:f9:5e:49:46:bc",
            "net15": "22:8c:37:ce:1d:6f",
            "net16": "0e:da:47:45:5c:39",
            "net17": "ea:3d:96:07:49:bb",
            "net18": "be:0d:e5:c7:3e:45",
            "net19": "e2:ab:31:54:49:28",
            "net2": "9e:61:ef:b9:bd:49",
            "net20": "12:35:0d:b1:ff:d4",
            "net21": "66:73:58:ee:8b:1b",
            "net22": "26:12:23:20:ff:d6",
            "net23": "c6:ec:b0:a8:56:27",
            "net24": "72:ae:cd:e6:45:65",
            "net25": "52:29:e8:08:9a:f4",
            "net26": "e2:20:1b:cb:a6:b0",
            "net27": "36:9a:59:ff:df:18",
            "net28": "5a:67:4a:29:89:1e",
            "net29": "46:ed:a5:70:08:76",
            "net3": "76:91:2a:8c:b0:96",
            "net30": "5a:42:10:13:d7:05",
            "net31": "c2:bc:4c:7a:ed:80",
            "net4": "5a:f8:05:74:bd:b0",
            "net5": "e6:a0:29:c2:31:8f",
            "net6": "d2:e6:20:d2:e6:eb",
            "net7": "fa:a0:b4:b0:a0:b3",
            "net8": "1a:7b:9a:7b:09:0d",
            "net9": "56:f9:d5:b5:56:63"
        },
        "tof_1_2_9": {
            "net0": "e2:61:5e:46:51:6d",
            "net1": "76:fe:6f:3e:4e:46",
            "net10": "ae:53:15:4c:b1:ad",
            "net11": "1a:3b:60:f4:a1:1d",
            "net12": "0e:f6:99:4a:36:b2",
            "net13": "26:de:6f:2e:6f:66",
            "net14": "4e:86:50:b7:e6:56",
            "net15": "86:ad:0c:75:fa:4f",
            "net16": "ca:55:68:63:dd:c7",
            "net17": "9e:95:02:55:6f:b0",
            "net18": "fe:69:b5:d0:b5:22",
            "net19": "ea:d0:da:01:a4:12",
            "net2": "c2:d2:10:d4:87:29",
            "net20": "82:9d:ee:d7:2c:47",
            "net21": "e6:cf:d7:43:2d:05",
            "net22": "46:7f:99:ef:97:ec",
            "net23": "c6:51:da:07:e3:3b",
            "net24": "ce:14:54:c6:8e:9a",
            "net25": "8a:7f:14:1b:41:5d",
            "net26": "f6:4a:70:57:8c:b8",
            "net27": "aa:df:4b:1f:78:fc",
            "net28": "2e:74:b9:40:fa:08",
            "net29": "ca:ea:27:70:2a:c2",
            "net3": "4a:c4:5f:c1:67:8b",
            "net30": "c2:68:a4:95:01:26",
            "net31": "8e:70:5f:12:03:6f",
            "net4": "26:5b:bb:25:17:f7",
            "net5": "c6:c4:ad:03:a8:cb",
            "net6": "b2:91:bd:20:81:92",
            "net7": "ca:13:ed:f6:53:13",
            "net8": "7e:00:32:cf:ef:bb",
            "net9": "3e:bc:68:fc:15:78"
        }
    },
    "failed_machine": "leaf_1_0_1",
    "failure_time": 1613189910.7071517
}