{
    "k_leaf": 2,
    "k_top": 2,
    "redundancy_factor": 1,
    "is_k8s": true,
    "machine_mac_addresses": {
        "leaf_1_0_1": {
            "net0": "ee:90:8d:dc:9f:36",
            "net1": "7a:2f:9a:ab:fb:06",
            "net2": "da:41:1b:51:4c:88"
        },
        "leaf_1_0_2": {
            "net0": "42:3b:5f:f8:8b:a7",
            "net1": "0e:91:b6:a9:c6:e0",
            "net2": "16:45:9d:3f:3a:91"
        },
        "leaf_2_0_1": {
            "net0": "76:90:59:82:7f:df",
            "net1": "12:77:a4:89:6c:55",
            "net2": "ce:b7:12:d9:90:2e"
        },
        "leaf_2_0_2": {
            "net0": "8e:b7:c0:d1:f7:a3",
            "net1": "3a:2b:fc:ff:84:c4",
            "net2": "ee:d6:25:89:43:e2"
        },
        "leaf_3_0_1": {
            "net0": "6e:9f:96:7e:0f:5f",
            "net1": "6a:cf:fc:c5:c2:2a",
            "net2": "c6:27:48:95:ef:90"
        },
        "leaf_3_0_2": {
            "net0": "c2:12:41:46:b9:94",
            "net1": "c6:ff:b8:be:32:de",
            "net2": "86:38:96:ae:a0:2a"
        },
        "leaf_4_0_1": {
            "net0": "b2:b5:05:d5:9c:ef",
            "net1": "c2:f5:88:e8:f8:ea",
            "net2": "4e:f2:a6:83:e3:73"
        },
        "leaf_4_0_2": {
            "net0": "d6:e7:3e:ff:d0:d6",
            "net1": "8e:5c:0f:fe:b7:b6",
            "net2": "e2:42:eb:bb:ef:9b"
        },
        "spine_1_1_1": {
            "net0": "f2:3d:4a:36:e4:fc",
            "net1": "8e:b1:20:cf:43:e9",
            "net2": "a6:fb:4f:81:83:23",
            "net3": "ca:87:fa:39:75:ac"
        },
        "spine_1_1_2": {
            "net0": "3e:00:85:a0:42:4b",
            "net1": "d6:f3:a1:6f:05:85",
            "net2": "36:1e:cc:32:44:e0",
            "net3": "da:e7:12:05:5e:03"
        },
        "spine_2_1_1": {
            "net0": "d6:16:30:37:b2:2e",
            "net1": "32:f2:40:fc:9d:de",
            "net2": "8a:57:c1:8f:5e:52",
            "net3": "b2:ad:0a:53:12:8a"
        },
        "spine_2_1_2": {
            "net0": "a2:41:0c:38:75:5a",
            "net1": "f6:4c:72:6b:d3:5e",
            "net2": "aa:ec:3c:2f:a2:46",
            "net3": "9a:4c:f6:33:a9:54"
        },
        "spine_3_1_1": {
            "net0": "da:a5:5f:2e:48:9d",
            "net1": "e2:06:0f:f4:44:00",
            "net2": "56:c2:cd:8d:f7:8f",
            "net3": "8a:22:1e:da:c6:8e"
        },
        "spine_3_1_2": {
            "net0": "8a:a2:c6:d7:bf:7a",
            "net1": "aa:ba:ae:3a:b1:7b",
            "net2": "02:e1:10:3b:4c:50",
            "net3": "fa:82:b6:05:5c:86"
        },
        "spine_4_1_1": {
            "net0": "2e:06:3d:51:a4:01",
            "net1": "5a:86:ad:3b:25:11",
            "net2": "52:6f:21:c3:bb:96",
            "net3": "8a:9a:64:91:8c:cc"
        },
        "spine_4_1_2": {
            "net0": "0e:fb:4b:52:d6:9c",
            "net1": "ce:37:dc:b6:ad:fe",
            "net2": "82:f3:54:cc:96:56",
            "net3": "7a:81:18:53:73:1c"
        },
        "tof_1_2_1": {
            "net0": "0e:15:ab:23:a7:50",
            "net1": "76:a9:a4:a9:f9:be",
            "net2": "1a:b4:59:a0:6b:c9",
            "net3": "d6:f9:f7:c1:93:38"
        },
        "tof_1_2_2": {
            "net0": "b2:c0:9c:aa:5b:1c",
            "net1": "82:56:79:e3:c8:ae",
            "net2": "1a:42:4c:e0:ed:b6",
            "net3": "3a:9c:e5:8e:db:e4"
        },
        "tof_2_2_1": {
            "net0": "b2:31:9e:73:c1:ca",
            "net1": "0a:89:e5:81:29:19",
            "net2": "0a:17:30:64:ed:33",
            "net3": "b2:9c:80:32:ba:64"
        },
        "tof_2_2_2": {
            "net0": "de:60:5c:81:b1:c8",
            "net1": "5e:43:18:8a:d9:bb",
            "net2": "36:f8:1d:f5:0c:e3",
            "net3": "be:bd:49:6d:1f:8b"
        }
    },
    "failed_machine": "leaf_1_0_1",
    "failure_time": {
        "leaf_1_0_1": 1622466667.2353806,
        "leaf_1_0_2": 1622466667.2443805,
        "leaf_2_0_1": 1622466667.2537286,
        "leaf_2_0_2": 1622466667.2368348,
        "leaf_3_0_1": 1622466667.246373,
        "leaf_3_0_2": 1622466667.2537057,
        "leaf_4_0_1": 1622466667.2608807,
        "leaf_4_0_2": 1622466667.2679293,
        "spine_1_1_1": 1622466667.2756853,
        "spine_1_1_2": 1622466667.2685032,
        "spine_2_1_1": 1622466667.2747114,
        "spine_2_1_2": 1622466667.2804627,
        "spine_3_1_1": 1622466667.2827678,
        "spine_3_1_2": 1622466667.2909503,
        "spine_4_1_1": 1622466667.299033,
        "spine_4_1_2": 1622466667.2875159,
        "tof_1_2_1": 1622466667.295285,
        "tof_1_2_2": 1622466667.3030121,
        "tof_2_2_1": 1622466667.308294,
        "tof_2_2_2": 1622466667.3155928
    }
}