{
    "k_leaf": 6,
    "k_top": 6,
    "redundancy_factor": 6,
    "is_k8s": true,
    "machine_mac_addresses": {
        "leaf_1_0_1": {
            "net0": "66:6a:f6:5a:b9:44",
            "net1": "02:af:47:7c:d4:87",
            "net2": "2e:84:ba:fe:7c:e6",
            "net3": "96:f9:93:82:7c:b2",
            "net4": "2e:72:58:60:87:e9",
            "net5": "02:d1:37:b9:d6:8d",
            "net6": "9a:d1:4c:d8:84:ab"
        },
        "leaf_1_0_2": {
            "net0": "e2:57:62:59:5d:2c",
            "net1": "f6:a5:d2:3f:8b:7b",
            "net2": "6e:9b:11:48:04:7e",
            "net3": "26:1f:de:c8:20:5c",
            "net4": "aa:28:f9:00:ae:5d",
            "net5": "56:cc:ed:e4:36:44",
            "net6": "9e:fe:62:d8:6c:6a"
        },
        "leaf_1_0_3": {
            "net0": "86:4c:6b:ce:19:ab",
            "net1": "0a:35:29:36:e1:89",
            "net2": "d6:5e:98:61:28:55",
            "net3": "f2:4a:29:aa:96:f9",
            "net4": "be:43:12:29:db:0c",
            "net5": "c6:8c:40:6c:a7:12",
            "net6": "f2:1f:00:19:4b:5b"
        },
        "leaf_1_0_4": {
            "net0": "6e:5a:da:5f:82:51",
            "net1": "5a:8e:6f:a5:df:fc",
            "net2": "22:85:27:0c:62:30",
            "net3": "2e:50:c4:1b:f1:ce",
            "net4": "76:a2:7e:36:30:4a",
            "net5": "e2:ca:5f:7e:e8:66",
            "net6": "6e:a8:2e:ed:d8:1b"
        },
        "leaf_1_0_5": {
            "net0": "6e:b3:cb:66:56:f5",
            "net1": "0a:85:0d:5a:28:5d",
            "net2": "1a:4d:04:81:73:47",
            "net3": "3e:3b:26:1c:6a:d6",
            "net4": "0a:e3:b4:b4:bf:f2",
            "net5": "6e:b5:76:46:12:e8",
            "net6": "aa:03:5f:e0:15:e6"
        },
        "leaf_1_0_6": {
            "net0": "26:79:e6:80:3e:78",
            "net1": "1a:80:19:21:9b:38",
            "net2": "da:a9:10:c1:9b:65",
            "net3": "8e:fa:96:23:b8:ab",
            "net4": "6e:f7:ec:6e:aa:8b",
            "net5": "fe:20:eb:f5:98:c5",
            "net6": "12:2c:ce:81:ed:47"
        },
        "leaf_2_0_1": {
            "net0": "72:c6:f2:ef:f5:16",
            "net1": "ea:a8:77:3f:6e:31",
            "net2": "96:8e:ab:24:86:6c",
            "net3": "b6:74:69:b9:e2:b8",
            "net4": "46:09:19:5f:d7:ab",
            "net5": "de:46:32:8e:22:e4",
            "net6": "4e:4a:81:c2:75:56"
        },
        "leaf_2_0_2": {
            "net0": "4e:9b:a5:7a:33:d4",
            "net1": "8e:a7:03:04:b5:0e",
            "net2": "fa:d8:51:7a:96:b1",
            "net3": "e6:26:8f:b9:e7:ec",
            "net4": "7a:a0:13:f0:21:7d",
            "net5": "e2:2b:08:e8:cb:17",
            "net6": "06:1f:c3:8e:1e:65"
        },
        "leaf_2_0_3": {
            "net0": "c6:4d:fc:09:a1:84",
            "net1": "6a:b0:91:d3:ac:c9",
            "net2": "42:88:1c:10:29:47",
            "net3": "1a:80:73:91:89:17",
            "net4": "96:6d:fa:eb:82:a7",
            "net5": "ca:29:db:b8:86:45",
            "net6": "7a:d0:bc:80:20:75"
        },
        "leaf_2_0_4": {
            "net0": "fa:7c:ef:ec:1d:a5",
            "net1": "3e:68:1f:70:ac:90",
            "net2": "c6:34:4d:08:13:59",
            "net3": "46:04:a9:b7:98:52",
            "net4": "c6:75:b6:38:f5:47",
            "net5": "d2:30:06:f0:a6:c7",
            "net6": "92:ce:ca:eb:68:1c"
        },
        "leaf_2_0_5": {
            "net0": "2e:f7:91:26:72:e3",
            "net1": "2a:20:29:bc:1f:c3",
            "net2": "de:7a:3e:7d:b8:66",
            "net3": "1a:cd:9a:3d:6e:b3",
            "net4": "3a:64:bb:34:c2:20",
            "net5": "0e:46:f3:1b:ae:0b",
            "net6": "5a:75:8a:67:d5:7d"
        },
        "leaf_2_0_6": {
            "net0": "96:ca:41:4e:6d:10",
            "net1": "8a:51:52:bd:43:fc",
            "net2": "a6:92:3a:0b:a0:e7",
            "net3": "42:61:98:f6:ce:a9",
            "net4": "3a:ae:53:9e:57:b2",
            "net5": "02:3e:ad:a9:e9:81",
            "net6": "f2:a0:dd:80:33:29"
        },
        "spine_1_1_1": {
            "net0": "0a:58:6e:8f:bb:e2",
            "net1": "72:9e:ec:a3:f9:9b",
            "net10": "4a:46:73:7e:03:af",
            "net11": "b6:2b:6c:69:e7:df",
            "net2": "16:ce:df:0a:43:36",
            "net3": "d6:dc:61:31:62:6d",
            "net4": "72:a9:37:af:c1:06",
            "net5": "3e:ed:e6:0c:87:d3",
            "net6": "16:a8:e3:73:41:2d",
            "net7": "c2:df:52:8e:06:b6",
            "net8": "02:6f:2c:46:3c:da",
            "net9": "e2:6d:f6:6f:1d:81"
        },
        "spine_1_1_2": {
            "net0": "36:50:c2:36:ae:1d",
            "net1": "42:6a:54:a3:9d:db",
            "net10": "1a:98:36:eb:d3:62",
            "net11": "76:97:94:dc:54:01",
            "net2": "f6:5b:b2:90:e9:b3",
            "net3": "0a:68:25:0e:49:22",
            "net4": "56:c0:ee:91:a4:3f",
            "net5": "2a:bb:48:1b:85:1f",
            "net6": "0a:d2:9d:4d:fa:56",
            "net7": "b6:1e:ba:e8:2f:df",
            "net8": "7a:7a:04:75:56:5e",
            "net9": "2e:d5:57:89:32:71"
        },
        "spine_1_1_3": {
            "net0": "5e:89:3f:a3:e6:50",
            "net1": "ce:fc:6c:60:1b:09",
            "net10": "be:ea:cb:28:69:a7",
            "net11": "e2:19:de:5a:a3:4a",
            "net2": "ea:a1:53:72:e4:07",
            "net3": "1e:73:7b:00:d0:e3",
            "net4": "62:2a:76:94:82:2e",
            "net5": "4a:a9:0d:8a:92:ae",
            "net6": "5a:36:2f:53:f3:99",
            "net7": "b2:bc:62:09:d8:be",
            "net8": "0a:6d:10:1b:a2:7e",
            "net9": "66:5c:53:36:3c:46"
        },
        "spine_1_1_4": {
            "net0": "26:30:d6:29:be:c4",
            "net1": "b2:5f:f8:54:5f:b1",
            "net10": "da:86:64:2f:e3:d7",
            "net11": "fe:d4:b9:95:cc:72",
            "net2": "62:87:1b:fa:02:d6",
            "net3": "ee:97:10:d1:82:1b",
            "net4": "5a:b8:60:9a:6b:9a",
            "net5": "3a:84:8d:10:73:87",
            "net6": "82:9b:ad:86:85:dc",
            "net7": "92:98:c1:12:45:1b",
            "net8": "92:6d:c4:79:92:41",
            "net9": "56:8e:8a:6c:d3:d3"
        },
        "spine_1_1_5": {
            "net0": "22:7f:22:1f:22:b5",
            "net1": "62:ea:cf:0a:ed:81",
            "net10": "22:37:5c:5b:6b:88",
            "net11": "4a:f2:1d:db:d8:66",
            "net2": "06:7c:31:79:04:fe",
            "net3": "22:5b:d3:64:b9:5c",
            "net4": "9a:07:09:ea:42:8c",
            "net5": "0e:59:d2:d3:d1:a0",
            "net6": "fe:b1:4f:c3:b6:3c",
            "net7": "6a:54:6c:d1:b7:26",
            "net8": "5a:e6:ae:e0:8c:10",
            "net9": "46:f8:94:89:fe:d0"
        },
        "spine_1_1_6": {
            "net0": "2e:8f:94:d6:2f:8c",
            "net1": "52:ee:14:08:b5:74",
            "net10": "72:f4:09:21:22:74",
            "net11": "66:03:ab:6c:52:76",
            "net2": "6a:2a:6a:c8:3f:63",
            "net3": "7a:ca:6e:7a:c6:35",
            "net4": "fa:89:10:12:c8:48",
            "net5": "92:b5:df:f7:0c:3e",
            "net6": "4a:aa:9d:cc:05:b2",
            "net7": "66:26:2f:10:04:97",
            "net8": "92:fc:a2:e8:c7:a6",
            "net9": "ca:dc:84:b4:17:ab"
        },
        "spine_2_1_1": {
            "net0": "b6:89:40:51:a1:9f",
            "net1": "c2:80:24:3c:14:8a",
            "net10": "be:18:90:14:14:f2",
            "net11": "c6:f7:af:03:0f:30",
            "net2": "7e:df:d8:5a:c1:f6",
            "net3": "4e:5c:98:ed:7d:6f",
            "net4": "ba:6b:61:12:53:49",
            "net5": "32:0b:d0:e1:47:59",
            "net6": "0e:dd:45:ed:34:10",
            "net7": "92:38:34:dd:dc:16",
            "net8": "7e:43:45:c4:8f:6c",
            "net9": "f2:3c:e6:e5:a4:ed"
        },
        "spine_2_1_2": {
            "net0": "22:6d:e3:72:69:c4",
            "net1": "b2:4d:d0:2e:a7:ec",
            "net10": "62:a3:68:f6:bf:31",
            "net11": "6e:b3:40:a5:b2:9b",
            "net2": "8a:d5:98:45:80:92",
            "net3": "ee:f7:91:51:1c:3b",
            "net4": "9e:cd:7d:97:9a:70",
            "net5": "6a:af:79:1d:97:37",
            "net6": "7e:f9:f0:12:1f:8e",
            "net7": "f6:d2:78:18:4d:b5",
            "net8": "8e:b6:e6:67:d0:74",
            "net9": "c2:b3:6b:31:6b:1d"
        },
        "spine_2_1_3": {
            "net0": "a6:a0:f7:e8:ee:dd",
            "net1": "72:71:7b:e2:2d:ee",
            "net10": "72:1f:0d:fa:fa:ec",
            "net11": "9e:a9:92:c4:d7:ba",
            "net2": "96:7f:bc:fd:66:69",
            "net3": "1a:b2:e6:0e:bd:e0",
            "net4": "72:93:54:f2:5d:06",
            "net5": "be:c9:26:3f:f0:43",
            "net6": "2e:07:d7:3d:36:76",
            "net7": "c6:60:62:21:68:54",
            "net8": "9e:d1:c6:b6:96:9f",
            "net9": "32:96:97:b2:1f:13"
        },
        "spine_2_1_4": {
            "net0": "fe:7c:d3:5e:d8:9b",
            "net1": "2a:ea:a9:ee:82:58",
            "net10": "32:e0:49:16:aa:41",
            "net11": "de:bc:ae:0d:64:81",
            "net2": "86:2b:88:da:16:66",
            "net3": "4e:2b:82:bf:31:ae",
            "net4": "12:eb:15:d8:4c:35",
            "net5": "7a:dd:40:d6:06:3c",
            "net6": "5e:40:d6:a5:49:8e",
            "net7": "9a:f6:eb:fa:88:74",
            "net8": "1e:13:c9:97:e0:38",
            "net9": "4a:27:12:ed:b8:7c"
        },
        "spine_2_1_5": {
            "net0": "ee:2b:48:44:bd:ed",
            "net1": "72:b5:bb:9d:7e:af",
            "net10": "46:09:43:6a:64:12",
            "net11": "3e:b9:0d:5d:21:e7",
            "net2": "8a:98:17:4d:24:c3",
            "net3": "7a:55:3d:e9:3d:ba",
            "net4": "5a:10:b9:ab:00:1d",
            "net5": "1e:2a:7f:11:02:78",
            "net6": "42:7a:90:26:66:52",
            "net7": "b2:a7:c1:0f:83:aa",
            "net8": "9a:65:09:70:6a:1a",
            "net9": "72:01:ce:b1:e4:85"
        },
        "spine_2_1_6": {
            "net0": "b6:59:af:3a:86:2b",
            "net1": "be:34:a7:d5:95:f2",
            "net10": "1e:60:72:cb:e0:b1",
            "net11": "7e:cf:2c:9a:d4:0d",
            "net2": "b6:19:ca:4d:7e:48",
            "net3": "e2:8e:b5:35:5d:eb",
            "net4": "6e:db:53:44:db:82",
            "net5": "16:27:34:11:96:3b",
            "net6": "c6:05:b1:47:d1:08",
            "net7": "ca:ce:5c:c8:5f:f3",
            "net8": "12:47:fd:b5:c8:4d",
            "net9": "92:bf:d0:37:a6:3c"
        },
        "tof_1_2_1": {
            "net0": "62:56:d6:1b:90:c8",
            "net1": "b2:c8:2d:64:3e:85",
            "net10": "1e:41:9c:63:9e:d6",
            "net11": "4e:60:5c:69:15:de",
            "net2": "52:e2:13:37:0a:e0",
            "net3": "2e:e0:d4:c7:08:35",
            "net4": "16:60:d5:97:8c:1d",
            "net5": "e6:42:5d:e4:dc:bc",
            "net6": "52:40:98:88:9d:bd",
            "net7": "ea:d4:92:90:39:a6",
            "net8": "36:5b:01:80:e3:77",
            "net9": "7e:52:cd:58:0b:5f"
        },
        "tof_1_2_2": {
            "net0": "0a:ea:68:c8:27:4f",
            "net1": "0e:e3:59:08:d6:89",
            "net10": "5a:b7:6a:f8:d1:3f",
            "net11": "82:3d:0f:1a:3b:50",
            "net2": "b2:7f:4c:47:40:50",
            "net3": "f2:d5:3f:7d:5b:a6",
            "net4": "6a:45:46:eb:c0:d2",
            "net5": "d6:ce:e8:09:87:af",
            "net6": "9a:64:54:79:e8:62",
            "net7": "2e:ce:ef:e0:96:84",
            "net8": "1e:6b:b5:26:3a:5a",
            "net9": "d6:e2:d1:6b:24:f9"
        },
        "tof_1_2_3": {
            "net0": "6a:d7:6b:5c:d7:c0",
            "net1": "2e:03:64:bd:86:14",
            "net10": "12:a9:31:26:dc:5e",
            "net11": "ea:a3:ab:e1:31:ce",
            "net2": "da:a5:e3:d3:90:20",
            "net3": "5a:4e:9c:eb:ae:59",
            "net4": "ba:28:13:9d:8f:e8",
            "net5": "02:75:34:48:46:c6",
            "net6": "02:3a:60:98:a7:f6",
            "net7": "ce:04:f0:9a:d5:d7",
            "net8": "6a:2e:05:84:b9:c6",
            "net9": "e6:66:00:c5:03:da"
        },
        "tof_1_2_4": {
            "net0": "36:38:52:42:33:e0",
            "net1": "b2:4e:80:22:9e:57",
            "net10": "66:7f:ea:43:e1:ec",
            "net11": "6e:22:06:64:6b:42",
            "net2": "02:35:c0:50:bf:1d",
            "net3": "ee:e3:6b:6f:55:8c",
            "net4": "96:bf:a4:dd:bd:fb",
            "net5": "6a:a3:6e:69:e0:d9",
            "net6": "7e:e7:00:de:90:e2",
            "net7": "a6:c8:f1:55:c2:57",
            "net8": "92:4c:fb:58:30:5b",
            "net9": "12:bf:b7:bf:ba:20"
        },
        "tof_1_2_5": {
            "net0": "ca:c6:92:41:4b:97",
            "net1": "be:3d:6d:16:45:ef",
            "net10": "ea:f6:a8:74:74:fd",
            "net11": "7a:9b:dd:5d:e6:9a",
            "net2": "92:58:2d:77:44:7b",
            "net3": "62:b9:08:e3:55:b9",
            "net4": "52:f0:81:9f:12:57",
            "net5": "ae:f4:8d:eb:21:af",
            "net6": "42:94:fd:7f:3f:e0",
            "net7": "e6:4b:9c:88:e7:5e",
            "net8": "ce:68:ed:b7:7c:5b",
            "net9": "22:43:80:32:cf:46"
        },
        "tof_1_2_6": {
            "net0": "3e:f6:f0:4a:c0:b3",
            "net1": "c6:86:e5:6b:58:cf",
            "net10": "26:e3:d3:ca:4c:82",
            "net11": "8a:ed:33:53:bf:16",
            "net2": "8e:79:3f:18:00:32",
            "net3": "9a:a7:91:7e:4e:14",
            "net4": "62:73:5d:7d:84:94",
            "net5": "9a:d6:22:fc:d8:7b",
            "net6": "ce:a9:10:77:40:27",
            "net7": "f2:68:56:1f:0b:a0",
            "net8": "36:1b:5b:fe:e6:86",
            "net9": "ea:54:e2:29:f0:44"
        }
    },
    "failed_machine": "leaf_1_0_1",
    "failure_time": {
        "leaf_1_0_1": 1622126132.128151,
        "leaf_1_0_2": 1622126132.1372774,
        "leaf_1_0_3": 1622126125.6767244,
        "leaf_1_0_4": 1622126125.6938994,
        "leaf_1_0_5": 1622126125.6802144,
        "leaf_1_0_6": 1622126132.1592348,
        "leaf_2_0_1": 1622126132.1326158,
        "leaf_2_0_2": 1622126132.1508226,
        "leaf_2_0_3": 1622126132.1545749,
        "leaf_2_0_4": 1622126132.1577678,
        "leaf_2_0_5": 1622126132.1566129,
        "leaf_2_0_6": 1622126132.1740756,
        "spine_1_1_1": 1622126125.7121854,
        "spine_1_1_2": 1622126125.7270002,
        "spine_1_1_3": 1622126132.1760957,
        "spine_1_1_4": 1622126132.1987424,
        "spine_1_1_5": 1622126132.176141,
        "spine_1_1_6": 1622126125.7418327,
        "spine_2_1_1": 1622126132.1828275,
        "spine_2_1_2": 1622126132.2020047,
        "spine_2_1_3": 1622126132.1956296,
        "spine_2_1_4": 1622126132.2079303,
        "spine_2_1_5": 1622126132.2081199,
        "spine_2_1_6": 1622126125.7646825,
        "tof_1_2_1": 1622126132.2129753,
        "tof_1_2_2": 1622126125.7703183,
        "tof_1_2_3": 1622126125.75951,
        "tof_1_2_4": 1622126125.7723534,
        "tof_1_2_5": 1622126125.7681308,
        "tof_1_2_6": 1622126125.776088
    }
}