{
    "k_leaf": 2,
    "k_top": 2,
    "redundancy_factor": 2,
    "is_k8s": true,
    "failed_machine": "leaf_1_0_1",
    "failure_time": {
        "leaf_1_0_1": 1621863371.9331508,
        "leaf_1_0_2": 1621863371.9465764,
        "leaf_2_0_1": 1621863371.9473915,
        "leaf_2_0_2": 1621863371.9536936,
        "spine_1_1_1": 1621863371.953455,
        "spine_1_1_2": 1621863371.9570084,
        "spine_2_1_1": 1621863371.9729962,
        "spine_2_1_2": 1621863371.9729812,
        "tof_1_2_1": 1621863371.975764,
        "tof_1_2_2": 1621863371.975622
    },
    "packet_count": {
        "total": [
            315,
            54175
        ],
        "leaf_1_0_2": {
            "total": [
                22,
                3580
            ],
            "net0": {
                "total": [
                    11,
                    1790
                ],
                "csnp": [
                    8,
                    1560
                ],
                "psnp": [
                    2,
                    70
                ],
                "lsp": [
                    1,
                    160
                ]
            },
            "net1": {
                "total": [
                    11,
                    1790
                ],
                "csnp": [
                    8,
                    1560
                ],
                "lsp": [
                    1,
                    160
                ],
                "psnp": [
                    2,
                    70
                ]
            }
        },
        "leaf_2_0_1": {
            "total": [
                21,
                3420
            ],
            "net0": {
                "total": [
                    11,
                    1790
                ],
                "csnp": [
                    8,
                    1560
                ],
                "psnp": [
                    2,
                    70
                ],
                "lsp": [
                    1,
                    160
                ]
            },
            "net1": {
                "total": [
                    10,
                    1630
                ],
                "csnp": [
                    8,
                    1560
                ],
                "psnp": [
                    2,
                    70
                ]
            }
        },
        "leaf_2_0_2": {
            "total": [
                21,
                3420
            ],
            "net0": {
                "total": [
                    11,
                    1790
                ],
                "csnp": [
                    8,
                    1560
                ],
                "psnp": [
                    2,
                    70
                ],
                "lsp": [
                    1,
                    160
                ]
            },
            "net1": {
                "total": [
                    10,
                    1630
                ],
                "csnp": [
                    8,
                    1560
                ],
                "psnp": [
                    2,
                    70
                ]
            }
        },
        "tof_1_2_1": {
            "total": [
                41,
                7305
            ],
            "net0": {
                "total": [
                    10,
                    1755
                ],
                "csnp": [
                    8,
                    1560
                ],
                "psnp": [
                    1,
                    35
                ],
                "lsp": [
                    1,
                    160
                ]
            },
            "net1": {
                "total": [
                    10,
                    1755
                ],
                "csnp": [
                    8,
                    1560
                ],
                "lsp": [
                    1,
                    160
                ],
                "psnp": [
                    1,
                    35
                ]
            },
            "net2": {
                "total": [
                    11,
                    1915
                ],
                "csnp": [
                    8,
                    1560
                ],
                "lsp": [
                    2,
                    320
                ],
                "psnp": [
                    1,
                    35
                ]
            },
            "net3": {
                "total": [
                    10,
                    1880
                ],
                "csnp": [
                    8,
                    1560
                ],
                "lsp": [
                    2,
                    320
                ]
            }
        },
        "spine_1_1_2": {
            "total": [
                41,
                7305
            ],
            "net0": {
                "total": [
                    9,
                    1720
                ],
                "csnp": [
                    8,
                    1560
                ],
                "lsp": [
                    1,
                    160
                ]
            },
            "net1": {
                "total": [
                    11,
                    1915
                ],
                "csnp": [
                    8,
                    1560
                ],
                "lsp": [
                    2,
                    320
                ],
                "psnp": [
                    1,
                    35
                ]
            },
            "net2": {
                "total": [
                    10,
                    1755
                ],
                "csnp": [
                    8,
                    1560
                ],
                "psnp": [
                    1,
                    35
                ],
                "lsp": [
                    1,
                    160
                ]
            },
            "net3": {
                "total": [
                    11,
                    1915
                ],
                "csnp": [
                    8,
                    1560
                ],
                "lsp": [
                    2,
                    320
                ],
                "psnp": [
                    1,
                    35
                ]
            }
        },
        "spine_2_1_2": {
            "total": [
                41,
                7180
            ],
            "net0": {
                "total": [
                    10,
                    1880
                ],
                "csnp": [
                    8,
                    1560
                ],
                "lsp": [
                    2,
                    320
                ]
            },
            "net1": {
                "total": [
                    10,
                    1880
                ],
                "csnp": [
                    8,
                    1560
                ],
                "lsp": [
                    2,
                    320
                ]
            },
            "net2": {
                "total": [
                    10,
                    1630
                ],
                "csnp": [
                    8,
                    1560
                ],
                "psnp": [
                    2,
                    70
                ]
            },
            "net3": {
                "total": [
                    11,
                    1790
                ],
                "csnp": [
                    8,
                    1560
                ],
                "lsp": [
                    1,
                    160
                ],
                "psnp": [
                    2,
                    70
                ]
            }
        },
        "tof_1_2_2": {
            "total": [
                44,
                7410
            ],
            "net0": {
                "total": [
                    11,
                    1790
                ],
                "csnp": [
                    8,
                    1560
                ],
                "psnp": [
                    2,
                    70
                ],
                "lsp": [
                    1,
                    160
                ]
            },
            "net1": {
                "total": [
                    11,
                    1790
                ],
                "csnp": [
                    8,
                    1560
                ],
                "lsp": [
                    1,
                    160
                ],
                "psnp": [
                    2,
                    70
                ]
            },
            "net2": {
                "total": [
                    11,
                    1915
                ],
                "csnp": [
                    8,
                    1560
                ],
                "lsp": [
                    2,
                    320
                ],
                "psnp": [
                    1,
                    35
                ]
            },
            "net3": {
                "total": [
                    11,
                    1915
                ],
                "csnp": [
                    8,
                    1560
                ],
                "lsp": [
                    2,
                    320
                ],
                "psnp": [
                    1,
                    35
                ]
            }
        },
        "spine_2_1_1": {
            "total": [
                44,
                7410
            ],
            "net0": {
                "total": [
                    11,
                    1915
                ],
                "csnp": [
                    8,
                    1560
                ],
                "lsp": [
                    2,
                    320
                ],
                "psnp": [
                    1,
                    35
                ]
            },
            "net1": {
                "total": [
                    11,
                    1915
                ],
                "csnp": [
                    8,
                    1560
                ],
                "lsp": [
                    2,
                    320
                ],
                "psnp": [
                    1,
                    35
                ]
            },
            "net2": {
                "total": [
                    11,
                    1790
                ],
                "csnp": [
                    8,
                    1560
                ],
                "psnp": [
                    2,
                    70
                ],
                "lsp": [
                    1,
                    160
                ]
            },
            "net3": {
                "total": [
                    11,
                    1790
                ],
                "csnp": [
                    8,
                    1560
                ],
                "lsp": [
                    1,
                    160
                ],
                "psnp": [
                    2,
                    70
                ]
            }
        },
        "spine_1_1_1": {
            "total": [
                40,
                7145
            ],
            "net0": {
                "total": [
                    8,
                    1560
                ],
                "csnp": [
                    8,
                    1560
                ]
            },
            "net1": {
                "total": [
                    11,
                    1915
                ],
                "csnp": [
                    8,
                    1560
                ],
                "lsp": [
                    2,
                    320
                ],
                "psnp": [
                    1,
                    35
                ]
            },
            "net2": {
                "total": [
                    10,
                    1755
                ],
                "csnp": [
                    8,
                    1560
                ],
                "lsp": [
                    1,
                    160
                ],
                "psnp": [
                    1,
                    35
                ]
            },
            "net3": {
                "total": [
                    11,
                    1915
                ],
                "csnp": [
                    8,
                    1560
                ],
                "lsp": [
                    2,
                    320
                ],
                "psnp": [
                    1,
                    35
                ]
            }
        }
    },
    "packets_by_collision_domain": {
        "AAAG": 2,
        "AAAI": 2,
        "AAAQ": 3,
        "AAAS": 2,
        "AAAH": 3,
        "AAAJ": 3,
        "AAAR": 3,
        "AAAT": 3,
        "AAAD": 3,
        "AAAE": 3,
        "AAAA": 0,
        "AAAB": 1,
        "AAAK": 3,
        "AAAL": 2,
        "AAAN": 3,
        "AAAO": 2
    },
    "blast_radius": {
        "by_collision_domain": {
            "AAAA": [
                0,
                0
            ],
            "AAAB": [
                0,
                1
            ],
            "AAAD": [
                1,
                3
            ],
            "AAAG": [
                1,
                2
            ],
            "AAAH": [
                1,
                3
            ],
            "AAAE": [
                1,
                3
            ],
            "AAAI": [
                1,
                2
            ],
            "AAAJ": [
                1,
                3
            ],
            "AAAQ": [
                2,
                3
            ],
            "AAAS": [
                2,
                2
            ],
            "AAAR": [
                2,
                3
            ],
            "AAAT": [
                2,
                3
            ],
            "AAAK": [
                3,
                3
            ],
            "AAAN": [
                3,
                3
            ],
            "AAAL": [
                3,
                2
            ],
            "AAAO": [
                3,
                2
            ]
        },
        "by_distance": {
            "0": 1,
            "1": 16,
            "2": 11,
            "3": 10
        }
    },
    "radius_graph": {
        "nodes": [
            {
                "id": "spine_1_1_1",
                "label": "spine_1_1_1"
            },
            {
                "id": "leaf_1_0_2",
                "label": "leaf_1_0_2"
            },
            {
                "id": "leaf_2_0_2",
                "label": "leaf_2_0_2"
            },
            {
                "id": "spine_2_1_1",
                "label": "spine_2_1_1"
            },
            {
                "id": "leaf_1_0_1",
                "label": "leaf_1_0_1"
            },
            {
                "id": "tof_1_2_1",
                "label": "tof_1_2_1"
            },
            {
                "id": "spine_2_1_2",
                "label": "spine_2_1_2"
            },
            {
                "id": "spine_1_1_2",
                "label": "spine_1_1_2"
            },
            {
                "id": "tof_1_2_2",
                "label": "tof_1_2_2"
            },
            {
                "id": "leaf_2_0_1",
                "label": "leaf_2_0_1"
            }
        ],
        "links": [
            {
                "source": "tof_1_2_1",
                "target": "spine_1_1_1",
                "value": 2,
                "label": "AAAG"
            },
            {
                "source": "tof_1_2_1",
                "target": "spine_1_1_2",
                "value": 2,
                "label": "AAAI"
            },
            {
                "source": "tof_1_2_1",
                "target": "spine_2_1_1",
                "value": 3,
                "label": "AAAQ"
            },
            {
                "source": "tof_1_2_1",
                "target": "spine_2_1_2",
                "value": 2,
                "label": "AAAS"
            },
            {
                "source": "tof_1_2_2",
                "target": "spine_1_1_1",
                "value": 3,
                "label": "AAAH"
            },
            {
                "source": "tof_1_2_2",
                "target": "spine_1_1_2",
                "value": 3,
                "label": "AAAJ"
            },
            {
                "source": "tof_1_2_2",
                "target": "spine_2_1_1",
                "value": 3,
                "label": "AAAR"
            },
            {
                "source": "tof_1_2_2",
                "target": "spine_2_1_2",
                "value": 3,
                "label": "AAAT"
            },
            {
                "source": "leaf_1_0_1",
                "target": "spine_1_1_1",
                "value": 0,
                "label": "AAAA"
            },
            {
                "source": "leaf_1_0_1",
                "target": "spine_1_1_2",
                "value": 1,
                "label": "AAAB"
            },
            {
                "source": "leaf_1_0_2",
                "target": "spine_1_1_1",
                "value": 3,
                "label": "AAAD"
            },
            {
                "source": "leaf_1_0_2",
                "target": "spine_1_1_2",
                "value": 3,
                "label": "AAAE"
            },
            {
                "source": "spine_1_1_1",
                "target": "leaf_1_0_1",
                "value": 0,
                "label": "AAAA"
            },
            {
                "source": "spine_1_1_1",
                "target": "leaf_1_0_2",
                "value": 3,
                "label": "AAAD"
            },
            {
                "source": "spine_1_1_1",
                "target": "tof_1_2_1",
                "value": 2,
                "label": "AAAG"
            },
            {
                "source": "spine_1_1_1",
                "target": "tof_1_2_2",
                "value": 3,
                "label": "AAAH"
            },
            {
                "source": "spine_1_1_2",
                "target": "leaf_1_0_1",
                "value": 1,
                "label": "AAAB"
            },
            {
                "source": "spine_1_1_2",
                "target": "leaf_1_0_2",
                "value": 3,
                "label": "AAAE"
            },
            {
                "source": "spine_1_1_2",
                "target": "tof_1_2_1",
                "value": 2,
                "label": "AAAI"
            },
            {
                "source": "spine_1_1_2",
                "target": "tof_1_2_2",
                "value": 3,
                "label": "AAAJ"
            },
            {
                "source": "leaf_2_0_1",
                "target": "spine_2_1_1",
                "value": 3,
                "label": "AAAK"
            },
            {
                "source": "leaf_2_0_1",
                "target": "spine_2_1_2",
                "value": 2,
                "label": "AAAL"
            },
            {
                "source": "leaf_2_0_2",
                "target": "spine_2_1_1",
                "value": 3,
                "label": "AAAN"
            },
            {
                "source": "leaf_2_0_2",
                "target": "spine_2_1_2",
                "value": 2,
                "label": "AAAO"
            },
            {
                "source": "spine_2_1_1",
                "target": "leaf_2_0_1",
                "value": 3,
                "label": "AAAK"
            },
            {
                "source": "spine_2_1_1",
                "target": "leaf_2_0_2",
                "value": 3,
                "label": "AAAN"
            },
            {
                "source": "spine_2_1_1",
                "target": "tof_1_2_1",
                "value": 3,
                "label": "AAAQ"
            },
            {
                "source": "spine_2_1_1",
                "target": "tof_1_2_2",
                "value": 3,
                "label": "AAAR"
            },
            {
                "source": "spine_2_1_2",
                "target": "leaf_2_0_1",
                "value": 2,
                "label": "AAAL"
            },
            {
                "source": "spine_2_1_2",
                "target": "leaf_2_0_2",
                "value": 2,
                "label": "AAAO"
            },
            {
                "source": "spine_2_1_2",
                "target": "tof_1_2_1",
                "value": 2,
                "label": "AAAS"
            },
            {
                "source": "spine_2_1_2",
                "target": "tof_1_2_2",
                "value": 3,
                "label": "AAAT"
            }
        ]
    },
    "max_number_of_rounds": 6,
    "packets_per_round": {
        "0": 0,
        "1": 3,
        "2": 7,
        "3": 12,
        "4": 7,
        "5": 7,
        "6": 2
    },
    "round_graph": {
        "nodes": [
            {
                "id": "spine_2_1_2-2",
                "label": "spine_2_1_2-2"
            },
            {
                "id": "spine_2_1_2-4",
                "label": "spine_2_1_2-4"
            },
            {
                "id": "tof_1_2_1-1",
                "label": "tof_1_2_1-1"
            },
            {
                "id": "leaf_1_0_2-5",
                "label": "leaf_1_0_2-5"
            },
            {
                "id": "spine_1_1_1-4",
                "label": "spine_1_1_1-4"
            },
            {
                "id": "leaf_1_0_2-1",
                "label": "leaf_1_0_2-1"
            },
            {
                "id": "leaf_2_0_2-3",
                "label": "leaf_2_0_2-3"
            },
            {
                "id": "tof_1_2_2-3",
                "label": "tof_1_2_2-3"
            },
            {
                "id": "leaf_1_0_1",
                "label": "leaf_1_0_1"
            },
            {
                "id": "leaf_2_0_2-5",
                "label": "leaf_2_0_2-5"
            },
            {
                "id": "tof_1_2_1-5",
                "label": "tof_1_2_1-5"
            },
            {
                "id": "spine_2_1_1-2",
                "label": "spine_2_1_1-2"
            },
            {
                "id": "spine_1_1_1-0",
                "label": "spine_1_1_1-0"
            },
            {
                "id": "spine_2_1_1-6",
                "label": "spine_2_1_1-6"
            },
            {
                "id": "leaf_2_0_1-5",
                "label": "leaf_2_0_1-5"
            },
            {
                "id": "leaf_1_0_1-3",
                "label": "leaf_1_0_1-3"
            },
            {
                "id": "tof_1_2_1-3",
                "label": "tof_1_2_1-3"
            },
            {
                "id": "leaf_2_0_1-3",
                "label": "leaf_2_0_1-3"
            },
            {
                "id": "spine_1_1_2-2",
                "label": "spine_1_1_2-2"
            },
            {
                "id": "tof_1_2_2-1",
                "label": "tof_1_2_2-1"
            },
            {
                "id": "spine_2_1_1-4",
                "label": "spine_2_1_1-4"
            },
            {
                "id": "tof_1_2_2-5",
                "label": "tof_1_2_2-5"
            },
            {
                "id": "leaf_1_0_2-3",
                "label": "leaf_1_0_2-3"
            }
        ],
        "links": [
            {
                "source": "leaf_1_0_1",
                "target": "spine_1_1_1-0",
                "value": 0
            },
            {
                "source": "spine_1_1_1-0",
                "target": "leaf_1_0_2-1",
                "value": 1,
                "label": [
                    {
                        "time": 1621863401.133934,
                        "type": "LSP",
                        "LSP ID": "0100.0000.0002.00-00",
                        "Seq.N": 4,
                        "Orig.": "kathara-spine-1-1-1-de87967a"
                    }
                ]
            },
            {
                "source": "spine_1_1_1-0",
                "target": "tof_1_2_1-1",
                "value": 1,
                "label": [
                    {
                        "time": 1621863401.134036,
                        "type": "LSP",
                        "LSP ID": "0100.0000.0002.00-00",
                        "Seq.N": 4,
                        "Orig.": "kathara-spine-1-1-1-de87967a"
                    }
                ]
            },
            {
                "source": "spine_1_1_1-0",
                "target": "tof_1_2_2-1",
                "value": 1,
                "label": [
                    {
                        "time": 1621863401.134136,
                        "type": "LSP",
                        "LSP ID": "0100.0000.0002.00-00",
                        "Seq.N": 4,
                        "Orig.": "kathara-spine-1-1-1-de87967a"
                    }
                ]
            },
            {
                "source": "leaf_1_0_2-1",
                "target": "spine_1_1_2-2",
                "value": 1,
                "label": [
                    {
                        "time": 1621863401.135106,
                        "type": "LSP",
                        "LSP ID": "0100.0000.0002.00-00",
                        "Seq.N": 4,
                        "Orig.": "kathara-spine-1-1-1-de87967a"
                    }
                ]
            },
            {
                "source": "tof_1_2_1-1",
                "target": "spine_1_1_2-2",
                "value": 1,
                "label": [
                    {
                        "time": 1621863401.134468,
                        "type": "LSP",
                        "LSP ID": "0100.0000.0002.00-00",
                        "Seq.N": 4,
                        "Orig.": "kathara-spine-1-1-1-de87967a"
                    }
                ]
            },
            {
                "source": "tof_1_2_1-1",
                "target": "spine_2_1_1-2",
                "value": 1,
                "label": [
                    {
                        "time": 1621863401.134539,
                        "type": "LSP",
                        "LSP ID": "0100.0000.0002.00-00",
                        "Seq.N": 4,
                        "Orig.": "kathara-spine-1-1-1-de87967a"
                    }
                ]
            },
            {
                "source": "tof_1_2_1-1",
                "target": "spine_2_1_2-2",
                "value": 1,
                "label": [
                    {
                        "time": 1621863401.134571,
                        "type": "LSP",
                        "LSP ID": "0100.0000.0002.00-00",
                        "Seq.N": 4,
                        "Orig.": "kathara-spine-1-1-1-de87967a"
                    }
                ]
            },
            {
                "source": "tof_1_2_2-1",
                "target": "spine_1_1_2-2",
                "value": 1,
                "label": [
                    {
                        "time": 1621863401.135258,
                        "type": "LSP",
                        "LSP ID": "0100.0000.0002.00-00",
                        "Seq.N": 4,
                        "Orig.": "kathara-spine-1-1-1-de87967a"
                    }
                ]
            },
            {
                "source": "tof_1_2_2-1",
                "target": "spine_2_1_1-2",
                "value": 1,
                "label": [
                    {
                        "time": 1621863401.135321,
                        "type": "LSP",
                        "LSP ID": "0100.0000.0002.00-00",
                        "Seq.N": 4,
                        "Orig.": "kathara-spine-1-1-1-de87967a"
                    }
                ]
            },
            {
                "source": "tof_1_2_2-1",
                "target": "spine_2_1_2-2",
                "value": 1,
                "label": [
                    {
                        "time": 1621863401.135352,
                        "type": "LSP",
                        "LSP ID": "0100.0000.0002.00-00",
                        "Seq.N": 4,
                        "Orig.": "kathara-spine-1-1-1-de87967a"
                    }
                ]
            },
            {
                "source": "spine_1_1_2-2",
                "target": "leaf_1_0_1-3",
                "value": 1,
                "label": [
                    {
                        "time": 1621863401.135494,
                        "type": "LSP",
                        "LSP ID": "0100.0000.0002.00-00",
                        "Seq.N": 4,
                        "Orig.": "kathara-spine-1-1-1-de87967a"
                    }
                ]
            },
            {
                "source": "spine_1_1_2-2",
                "target": "leaf_1_0_2-3",
                "value": 2,
                "label": [
                    {
                        "time": 1621863401.135531,
                        "type": "LSP",
                        "LSP ID": "0100.0000.0002.00-00",
                        "Seq.N": 4,
                        "Orig.": "kathara-spine-1-1-1-de87967a"
                    },
                    {
                        "time": 1621863402.40259,
                        "type": "LSP",
                        "LSP ID": "0100.0000.0006.00-00",
                        "Seq.N": 4,
                        "Orig.": "kathara-spine-1-1-2-8bea2587"
                    }
                ]
            },
            {
                "source": "spine_1_1_2-2",
                "target": "tof_1_2_2-3",
                "value": 2,
                "label": [
                    {
                        "time": 1621863401.135637,
                        "type": "LSP",
                        "LSP ID": "0100.0000.0002.00-00",
                        "Seq.N": 4,
                        "Orig.": "kathara-spine-1-1-1-de87967a"
                    },
                    {
                        "time": 1621863402.402758,
                        "type": "LSP",
                        "LSP ID": "0100.0000.0006.00-00",
                        "Seq.N": 4,
                        "Orig.": "kathara-spine-1-1-2-8bea2587"
                    }
                ]
            },
            {
                "source": "spine_1_1_2-2",
                "target": "tof_1_2_1-3",
                "value": 1,
                "label": [
                    {
                        "time": 1621863402.402708,
                        "type": "LSP",
                        "LSP ID": "0100.0000.0006.00-00",
                        "Seq.N": 4,
                        "Orig.": "kathara-spine-1-1-2-8bea2587"
                    }
                ]
            },
            {
                "source": "spine_2_1_1-2",
                "target": "leaf_2_0_1-3",
                "value": 1,
                "label": [
                    {
                        "time": 1621863401.135326,
                        "type": "LSP",
                        "LSP ID": "0100.0000.0002.00-00",
                        "Seq.N": 4,
                        "Orig.": "kathara-spine-1-1-1-de87967a"
                    }
                ]
            },
            {
                "source": "spine_2_1_1-2",
                "target": "leaf_2_0_2-3",
                "value": 1,
                "label": [
                    {
                        "time": 1621863401.135385,
                        "type": "LSP",
                        "LSP ID": "0100.0000.0002.00-00",
                        "Seq.N": 4,
                        "Orig.": "kathara-spine-1-1-1-de87967a"
                    }
                ]
            },
            {
                "source": "spine_2_1_1-2",
                "target": "tof_1_2_2-3",
                "value": 1,
                "label": [
                    {
                        "time": 1621863401.135416,
                        "type": "LSP",
                        "LSP ID": "0100.0000.0002.00-00",
                        "Seq.N": 4,
                        "Orig.": "kathara-spine-1-1-1-de87967a"
                    }
                ]
            },
            {
                "source": "spine_2_1_2-2",
                "target": "leaf_2_0_1-3",
                "value": 1,
                "label": [
                    {
                        "time": 1621863401.135412,
                        "type": "LSP",
                        "LSP ID": "0100.0000.0002.00-00",
                        "Seq.N": 4,
                        "Orig.": "kathara-spine-1-1-1-de87967a"
                    }
                ]
            },
            {
                "source": "spine_2_1_2-2",
                "target": "leaf_2_0_2-3",
                "value": 1,
                "label": [
                    {
                        "time": 1621863401.135473,
                        "type": "LSP",
                        "LSP ID": "0100.0000.0002.00-00",
                        "Seq.N": 4,
                        "Orig.": "kathara-spine-1-1-1-de87967a"
                    }
                ]
            },
            {
                "source": "spine_2_1_2-2",
                "target": "tof_1_2_2-3",
                "value": 1,
                "label": [
                    {
                        "time": 1621863401.135565,
                        "type": "LSP",
                        "LSP ID": "0100.0000.0002.00-00",
                        "Seq.N": 4,
                        "Orig.": "kathara-spine-1-1-1-de87967a"
                    }
                ]
            },
            {
                "source": "leaf_1_0_2-3",
                "target": "spine_1_1_1-4",
                "value": 1,
                "label": [
                    {
                        "time": 1621863402.403205,
                        "type": "LSP",
                        "LSP ID": "0100.0000.0006.00-00",
                        "Seq.N": 4,
                        "Orig.": "kathara-spine-1-1-2-8bea2587"
                    }
                ]
            },
            {
                "source": "tof_1_2_2-3",
                "target": "spine_1_1_1-4",
                "value": 1,
                "label": [
                    {
                        "time": 1621863402.403412,
                        "type": "LSP",
                        "LSP ID": "0100.0000.0006.00-00",
                        "Seq.N": 4,
                        "Orig.": "kathara-spine-1-1-2-8bea2587"
                    }
                ]
            },
            {
                "source": "tof_1_2_2-3",
                "target": "spine_2_1_1-4",
                "value": 1,
                "label": [
                    {
                        "time": 1621863402.403486,
                        "type": "LSP",
                        "LSP ID": "0100.0000.0006.00-00",
                        "Seq.N": 4,
                        "Orig.": "kathara-spine-1-1-2-8bea2587"
                    }
                ]
            },
            {
                "source": "tof_1_2_2-3",
                "target": "spine_2_1_2-4",
                "value": 1,
                "label": [
                    {
                        "time": 1621863402.403519,
                        "type": "LSP",
                        "LSP ID": "0100.0000.0006.00-00",
                        "Seq.N": 4,
                        "Orig.": "kathara-spine-1-1-2-8bea2587"
                    }
                ]
            },
            {
                "source": "tof_1_2_1-3",
                "target": "spine_1_1_1-4",
                "value": 1,
                "label": [
                    {
                        "time": 1621863402.402976,
                        "type": "LSP",
                        "LSP ID": "0100.0000.0006.00-00",
                        "Seq.N": 4,
                        "Orig.": "kathara-spine-1-1-2-8bea2587"
                    }
                ]
            },
            {
                "source": "tof_1_2_1-3",
                "target": "spine_2_1_1-4",
                "value": 1,
                "label": [
                    {
                        "time": 1621863402.40318,
                        "type": "LSP",
                        "LSP ID": "0100.0000.0006.00-00",
                        "Seq.N": 4,
                        "Orig.": "kathara-spine-1-1-2-8bea2587"
                    }
                ]
            },
            {
                "source": "tof_1_2_1-3",
                "target": "spine_2_1_2-4",
                "value": 1,
                "label": [
                    {
                        "time": 1621863402.403243,
                        "type": "LSP",
                        "LSP ID": "0100.0000.0006.00-00",
                        "Seq.N": 4,
                        "Orig.": "kathara-spine-1-1-2-8bea2587"
                    }
                ]
            },
            {
                "source": "spine_1_1_1-4",
                "target": "leaf_1_0_2-5",
                "value": 1,
                "label": [
                    {
                        "time": 1621863402.403541,
                        "type": "LSP",
                        "LSP ID": "0100.0000.0006.00-00",
                        "Seq.N": 4,
                        "Orig.": "kathara-spine-1-1-2-8bea2587"
                    }
                ]
            },
            {
                "source": "spine_1_1_1-4",
                "target": "tof_1_2_2-5",
                "value": 1,
                "label": [
                    {
                        "time": 1621863402.40359,
                        "type": "LSP",
                        "LSP ID": "0100.0000.0006.00-00",
                        "Seq.N": 4,
                        "Orig.": "kathara-spine-1-1-2-8bea2587"
                    }
                ]
            },
            {
                "source": "spine_2_1_1-4",
                "target": "leaf_2_0_1-5",
                "value": 1,
                "label": [
                    {
                        "time": 1621863402.404094,
                        "type": "LSP",
                        "LSP ID": "0100.0000.0006.00-00",
                        "Seq.N": 4,
                        "Orig.": "kathara-spine-1-1-2-8bea2587"
                    }
                ]
            },
            {
                "source": "spine_2_1_1-4",
                "target": "leaf_2_0_2-5",
                "value": 1,
                "label": [
                    {
                        "time": 1621863402.404112,
                        "type": "LSP",
                        "LSP ID": "0100.0000.0006.00-00",
                        "Seq.N": 4,
                        "Orig.": "kathara-spine-1-1-2-8bea2587"
                    }
                ]
            },
            {
                "source": "spine_2_1_1-4",
                "target": "tof_1_2_1-5",
                "value": 1,
                "label": [
                    {
                        "time": 1621863402.404128,
                        "type": "LSP",
                        "LSP ID": "0100.0000.0006.00-00",
                        "Seq.N": 4,
                        "Orig.": "kathara-spine-1-1-2-8bea2587"
                    }
                ]
            },
            {
                "source": "spine_2_1_2-4",
                "target": "leaf_2_0_1-5",
                "value": 1,
                "label": [
                    {
                        "time": 1621863402.404153,
                        "type": "LSP",
                        "LSP ID": "0100.0000.0006.00-00",
                        "Seq.N": 4,
                        "Orig.": "kathara-spine-1-1-2-8bea2587"
                    }
                ]
            },
            {
                "source": "spine_2_1_2-4",
                "target": "leaf_2_0_2-5",
                "value": 1,
                "label": [
                    {
                        "time": 1621863402.404219,
                        "type": "LSP",
                        "LSP ID": "0100.0000.0006.00-00",
                        "Seq.N": 4,
                        "Orig.": "kathara-spine-1-1-2-8bea2587"
                    }
                ]
            },
            {
                "source": "leaf_2_0_1-5",
                "target": "spine_2_1_1-6",
                "value": 1,
                "label": [
                    {
                        "time": 1621863402.404649,
                        "type": "LSP",
                        "LSP ID": "0100.0000.0006.00-00",
                        "Seq.N": 4,
                        "Orig.": "kathara-spine-1-1-2-8bea2587"
                    }
                ]
            },
            {
                "source": "leaf_2_0_2-5",
                "target": "spine_2_1_1-6",
                "value": 1,
                "label": [
                    {
                        "time": 1621863402.404853,
                        "type": "LSP",
                        "LSP ID": "0100.0000.0006.00-00",
                        "Seq.N": 4,
                        "Orig.": "kathara-spine-1-1-2-8bea2587"
                    }
                ]
            }
        ]
    },
    "logical_time_plot": {
        "points": {
            "spine_1_1_1": {
                "1": {
                    "time": 1621863401.133934,
                    "type": "LSP",
                    "LSP ID": "0100.0000.0002.00-00",
                    "Seq.N": 4,
                    "Orig.": "kathara-spine-1-1-1-de87967a",
                    "Logical Clock": 1
                },
                "2": {
                    "time": 1621863401.134036,
                    "type": "LSP",
                    "LSP ID": "0100.0000.0002.00-00",
                    "Seq.N": 4,
                    "Orig.": "kathara-spine-1-1-1-de87967a",
                    "Logical Clock": 2
                },
                "3": {
                    "time": 1621863401.134136,
                    "type": "LSP",
                    "LSP ID": "0100.0000.0002.00-00",
                    "Seq.N": 4,
                    "Orig.": "kathara-spine-1-1-1-de87967a",
                    "Logical Clock": 3
                },
                "13": {
                    "time": 1621863402.403366,
                    "type": "LSP",
                    "LSP ID": "0100.0000.0006.00-00",
                    "Seq.N": 4,
                    "Orig.": "kathara-spine-1-1-2-8bea2587",
                    "Logical Clock": 13
                },
                "17": {
                    "time": 1621863402.40337,
                    "type": "LSP",
                    "LSP ID": "0100.0000.0006.00-00",
                    "Seq.N": 4,
                    "Orig.": "kathara-spine-1-1-2-8bea2587",
                    "Logical Clock": 17
                },
                "18": {
                    "time": 1621863402.403144,
                    "type": "LSP",
                    "LSP ID": "0100.0000.0006.00-00",
                    "Seq.N": 4,
                    "Orig.": "kathara-spine-1-1-2-8bea2587",
                    "Logical Clock": 18
                },
                "19": {
                    "time": 1621863402.403541,
                    "type": "LSP",
                    "LSP ID": "0100.0000.0006.00-00",
                    "Seq.N": 4,
                    "Orig.": "kathara-spine-1-1-2-8bea2587",
                    "Logical Clock": 19
                },
                "20": {
                    "time": 1621863402.40359,
                    "type": "LSP",
                    "LSP ID": "0100.0000.0006.00-00",
                    "Seq.N": 4,
                    "Orig.": "kathara-spine-1-1-2-8bea2587",
                    "Logical Clock": 20
                }
            },
            "leaf_1_0_2": {
                "2": {
                    "time": 1621863401.134696,
                    "type": "LSP",
                    "LSP ID": "0100.0000.0002.00-00",
                    "Seq.N": 4,
                    "Orig.": "kathara-spine-1-1-1-de87967a",
                    "Logical Clock": 2
                },
                "3": {
                    "time": 1621863401.135106,
                    "type": "LSP",
                    "LSP ID": "0100.0000.0002.00-00",
                    "Seq.N": 4,
                    "Orig.": "kathara-spine-1-1-1-de87967a",
                    "Logical Clock": 3
                },
                "9": {
                    "time": 1621863401.135774,
                    "type": "LSP",
                    "LSP ID": "0100.0000.0002.00-00",
                    "Seq.N": 4,
                    "Orig.": "kathara-spine-1-1-1-de87967a",
                    "Logical Clock": 9
                },
                "11": {
                    "time": 1621863402.402832,
                    "type": "LSP",
                    "LSP ID": "0100.0000.0006.00-00",
                    "Seq.N": 4,
                    "Orig.": "kathara-spine-1-1-2-8bea2587",
                    "Logical Clock": 11
                },
                "12": {
                    "time": 1621863402.403205,
                    "type": "LSP",
                    "LSP ID": "0100.0000.0006.00-00",
                    "Seq.N": 4,
                    "Orig.": "kathara-spine-1-1-2-8bea2587",
                    "Logical Clock": 12
                },
                "20": {
                    "time": 1621863402.403972,
                    "type": "LSP",
                    "LSP ID": "0100.0000.0006.00-00",
                    "Seq.N": 4,
                    "Orig.": "kathara-spine-1-1-2-8bea2587",
                    "Logical Clock": 20
                }
            },
            "tof_1_2_1": {
                "3": {
                    "time": 1621863401.134111,
                    "type": "LSP",
                    "LSP ID": "0100.0000.0002.00-00",
                    "Seq.N": 4,
                    "Orig.": "kathara-spine-1-1-1-de87967a",
                    "Logical Clock": 3
                },
                "4": {
                    "time": 1621863401.134468,
                    "type": "LSP",
                    "LSP ID": "0100.0000.0002.00-00",
                    "Seq.N": 4,
                    "Orig.": "kathara-spine-1-1-1-de87967a",
                    "Logical Clock": 4
                },
                "5": {
                    "time": 1621863401.134539,
                    "type": "LSP",
                    "LSP ID": "0100.0000.0002.00-00",
                    "Seq.N": 4,
                    "Orig.": "kathara-spine-1-1-1-de87967a",
                    "Logical Clock": 5
                },
                "6": {
                    "time": 1621863401.134571,
                    "type": "LSP",
                    "LSP ID": "0100.0000.0002.00-00",
                    "Seq.N": 4,
                    "Orig.": "kathara-spine-1-1-1-de87967a",
                    "Logical Clock": 6
                },
                "12": {
                    "time": 1621863402.402664,
                    "type": "LSP",
                    "LSP ID": "0100.0000.0006.00-00",
                    "Seq.N": 4,
                    "Orig.": "kathara-spine-1-1-2-8bea2587",
                    "Logical Clock": 12
                },
                "13": {
                    "time": 1621863402.402976,
                    "type": "LSP",
                    "LSP ID": "0100.0000.0006.00-00",
                    "Seq.N": 4,
                    "Orig.": "kathara-spine-1-1-2-8bea2587",
                    "Logical Clock": 13
                },
                "14": {
                    "time": 1621863402.40318,
                    "type": "LSP",
                    "LSP ID": "0100.0000.0006.00-00",
                    "Seq.N": 4,
                    "Orig.": "kathara-spine-1-1-2-8bea2587",
                    "Logical Clock": 14
                },
                "15": {
                    "time": 1621863402.403243,
                    "type": "LSP",
                    "LSP ID": "0100.0000.0006.00-00",
                    "Seq.N": 4,
                    "Orig.": "kathara-spine-1-1-2-8bea2587",
                    "Logical Clock": 15
                },
                "23": {
                    "time": 1621863402.404572,
                    "type": "LSP",
                    "LSP ID": "0100.0000.0006.00-00",
                    "Seq.N": 4,
                    "Orig.": "kathara-spine-1-1-2-8bea2587",
                    "Logical Clock": 23
                }
            },
            "tof_1_2_2": {
                "4": {
                    "time": 1621863401.134895,
                    "type": "LSP",
                    "LSP ID": "0100.0000.0002.00-00",
                    "Seq.N": 4,
                    "Orig.": "kathara-spine-1-1-1-de87967a",
                    "Logical Clock": 4
                },
                "5": {
                    "time": 1621863401.135258,
                    "type": "LSP",
                    "LSP ID": "0100.0000.0002.00-00",
                    "Seq.N": 4,
                    "Orig.": "kathara-spine-1-1-1-de87967a",
                    "Logical Clock": 5
                },
                "6": {
                    "time": 1621863401.135321,
                    "type": "LSP",
                    "LSP ID": "0100.0000.0002.00-00",
                    "Seq.N": 4,
                    "Orig.": "kathara-spine-1-1-1-de87967a",
                    "Logical Clock": 6
                },
                "7": {
                    "time": 1621863401.135352,
                    "type": "LSP",
                    "LSP ID": "0100.0000.0002.00-00",
                    "Seq.N": 4,
                    "Orig.": "kathara-spine-1-1-1-de87967a",
                    "Logical Clock": 7
                },
                "10": {
                    "time": 1621863401.135914,
                    "type": "LSP",
                    "LSP ID": "0100.0000.0002.00-00",
                    "Seq.N": 4,
                    "Orig.": "kathara-spine-1-1-1-de87967a",
                    "Logical Clock": 10
                },
                "13": {
                    "time": 1621863402.403032,
                    "type": "LSP",
                    "LSP ID": "0100.0000.0006.00-00",
                    "Seq.N": 4,
                    "Orig.": "kathara-spine-1-1-2-8bea2587",
                    "Logical Clock": 13
                },
                "14": {
                    "time": 1621863401.135885,
                    "type": "LSP",
                    "LSP ID": "0100.0000.0002.00-00",
                    "Seq.N": 4,
                    "Orig.": "kathara-spine-1-1-1-de87967a",
                    "Logical Clock": 14
                },
                "15": {
                    "time": 1621863401.135897,
                    "type": "LSP",
                    "LSP ID": "0100.0000.0002.00-00",
                    "Seq.N": 4,
                    "Orig.": "kathara-spine-1-1-1-de87967a",
                    "Logical Clock": 15
                },
                "16": {
                    "time": 1621863402.403412,
                    "type": "LSP",
                    "LSP ID": "0100.0000.0006.00-00",
                    "Seq.N": 4,
                    "Orig.": "kathara-spine-1-1-2-8bea2587",
                    "Logical Clock": 16
                },
                "17": {
                    "time": 1621863402.403486,
                    "type": "LSP",
                    "LSP ID": "0100.0000.0006.00-00",
                    "Seq.N": 4,
                    "Orig.": "kathara-spine-1-1-2-8bea2587",
                    "Logical Clock": 17
                },
                "18": {
                    "time": 1621863402.403519,
                    "type": "LSP",
                    "LSP ID": "0100.0000.0006.00-00",
                    "Seq.N": 4,
                    "Orig.": "kathara-spine-1-1-2-8bea2587",
                    "Logical Clock": 18
                },
                "21": {
                    "time": 1621863402.40419,
                    "type": "LSP",
                    "LSP ID": "0100.0000.0006.00-00",
                    "Seq.N": 4,
                    "Orig.": "kathara-spine-1-1-2-8bea2587",
                    "Logical Clock": 21
                }
            },
            "spine_1_1_2": {
                "4": {
                    "time": 1621863401.135622,
                    "type": "LSP",
                    "LSP ID": "0100.0000.0002.00-00",
                    "Seq.N": 4,
                    "Orig.": "kathara-spine-1-1-1-de87967a",
                    "Logical Clock": 4
                },
                "5": {
                    "time": 1621863401.135114,
                    "type": "LSP",
                    "LSP ID": "0100.0000.0002.00-00",
                    "Seq.N": 4,
                    "Orig.": "kathara-spine-1-1-1-de87967a",
                    "Logical Clock": 5
                },
                "6": {
                    "time": 1621863401.135577,
                    "type": "LSP",
                    "LSP ID": "0100.0000.0002.00-00",
                    "Seq.N": 4,
                    "Orig.": "kathara-spine-1-1-1-de87967a",
                    "Logical Clock": 6
                },
                "7": {
                    "time": 1621863401.135494,
                    "type": "LSP",
                    "LSP ID": "0100.0000.0002.00-00",
                    "Seq.N": 4,
                    "Orig.": "kathara-spine-1-1-1-de87967a",
                    "Logical Clock": 7
                },
                "8": {
                    "time": 1621863401.135531,
                    "type": "LSP",
                    "LSP ID": "0100.0000.0002.00-00",
                    "Seq.N": 4,
                    "Orig.": "kathara-spine-1-1-1-de87967a",
                    "Logical Clock": 8
                },
                "9": {
                    "time": 1621863401.135637,
                    "type": "LSP",
                    "LSP ID": "0100.0000.0002.00-00",
                    "Seq.N": 4,
                    "Orig.": "kathara-spine-1-1-1-de87967a",
                    "Logical Clock": 9
                },
                "10": {
                    "time": 1621863402.40259,
                    "type": "LSP",
                    "LSP ID": "0100.0000.0006.00-00",
                    "Seq.N": 4,
                    "Orig.": "kathara-spine-1-1-2-8bea2587",
                    "Logical Clock": 10
                },
                "11": {
                    "time": 1621863402.402708,
                    "type": "LSP",
                    "LSP ID": "0100.0000.0006.00-00",
                    "Seq.N": 4,
                    "Orig.": "kathara-spine-1-1-2-8bea2587",
                    "Logical Clock": 11
                },
                "12": {
                    "time": 1621863402.402758,
                    "type": "LSP",
                    "LSP ID": "0100.0000.0006.00-00",
                    "Seq.N": 4,
                    "Orig.": "kathara-spine-1-1-2-8bea2587",
                    "Logical Clock": 12
                }
            },
            "spine_2_1_1": {
                "6": {
                    "time": 1621863401.135005,
                    "type": "LSP",
                    "LSP ID": "0100.0000.0002.00-00",
                    "Seq.N": 4,
                    "Orig.": "kathara-spine-1-1-1-de87967a",
                    "Logical Clock": 6
                },
                "7": {
                    "time": 1621863401.135512,
                    "type": "LSP",
                    "LSP ID": "0100.0000.0002.00-00",
                    "Seq.N": 4,
                    "Orig.": "kathara-spine-1-1-1-de87967a",
                    "Logical Clock": 7
                },
                "8": {
                    "time": 1621863401.135326,
                    "type": "LSP",
                    "LSP ID": "0100.0000.0002.00-00",
                    "Seq.N": 4,
                    "Orig.": "kathara-spine-1-1-1-de87967a",
                    "Logical Clock": 8
                },
                "9": {
                    "time": 1621863401.135385,
                    "type": "LSP",
                    "LSP ID": "0100.0000.0002.00-00",
                    "Seq.N": 4,
                    "Orig.": "kathara-spine-1-1-1-de87967a",
                    "Logical Clock": 9
                },
                "10": {
                    "time": 1621863401.135416,
                    "type": "LSP",
                    "LSP ID": "0100.0000.0002.00-00",
                    "Seq.N": 4,
                    "Orig.": "kathara-spine-1-1-1-de87967a",
                    "Logical Clock": 10
                },
                "18": {
                    "time": 1621863402.403617,
                    "type": "LSP",
                    "LSP ID": "0100.0000.0006.00-00",
                    "Seq.N": 4,
                    "Orig.": "kathara-spine-1-1-2-8bea2587",
                    "Logical Clock": 18
                },
                "19": {
                    "time": 1621863402.404505,
                    "type": "LSP",
                    "LSP ID": "0100.0000.0006.00-00",
                    "Seq.N": 4,
                    "Orig.": "kathara-spine-1-1-2-8bea2587",
                    "Logical Clock": 19
                },
                "20": {
                    "time": 1621863402.404094,
                    "type": "LSP",
                    "LSP ID": "0100.0000.0006.00-00",
                    "Seq.N": 4,
                    "Orig.": "kathara-spine-1-1-2-8bea2587",
                    "Logical Clock": 20
                },
                "21": {
                    "time": 1621863402.404112,
                    "type": "LSP",
                    "LSP ID": "0100.0000.0006.00-00",
                    "Seq.N": 4,
                    "Orig.": "kathara-spine-1-1-2-8bea2587",
                    "Logical Clock": 21
                },
                "22": {
                    "time": 1621863402.404128,
                    "type": "LSP",
                    "LSP ID": "0100.0000.0006.00-00",
                    "Seq.N": 4,
                    "Orig.": "kathara-spine-1-1-2-8bea2587",
                    "Logical Clock": 22
                },
                "24": {
                    "time": 1621863402.404771,
                    "type": "LSP",
                    "LSP ID": "0100.0000.0006.00-00",
                    "Seq.N": 4,
                    "Orig.": "kathara-spine-1-1-2-8bea2587",
                    "Logical Clock": 24
                },
                "25": {
                    "time": 1621863402.405164,
                    "type": "LSP",
                    "LSP ID": "0100.0000.0006.00-00",
                    "Seq.N": 4,
                    "Orig.": "kathara-spine-1-1-2-8bea2587",
                    "Logical Clock": 25
                }
            },
            "spine_2_1_2": {
                "7": {
                    "time": 1621863401.135115,
                    "type": "LSP",
                    "LSP ID": "0100.0000.0002.00-00",
                    "Seq.N": 4,
                    "Orig.": "kathara-spine-1-1-1-de87967a",
                    "Logical Clock": 7
                },
                "8": {
                    "time": 1621863401.135467,
                    "type": "LSP",
                    "LSP ID": "0100.0000.0002.00-00",
                    "Seq.N": 4,
                    "Orig.": "kathara-spine-1-1-1-de87967a",
                    "Logical Clock": 8
                },
                "9": {
                    "time": 1621863401.135412,
                    "type": "LSP",
                    "LSP ID": "0100.0000.0002.00-00",
                    "Seq.N": 4,
                    "Orig.": "kathara-spine-1-1-1-de87967a",
                    "Logical Clock": 9
                },
                "10": {
                    "time": 1621863401.135473,
                    "type": "LSP",
                    "LSP ID": "0100.0000.0002.00-00",
                    "Seq.N": 4,
                    "Orig.": "kathara-spine-1-1-1-de87967a",
                    "Logical Clock": 10
                },
                "11": {
                    "time": 1621863401.135565,
                    "type": "LSP",
                    "LSP ID": "0100.0000.0002.00-00",
                    "Seq.N": 4,
                    "Orig.": "kathara-spine-1-1-1-de87967a",
                    "Logical Clock": 11
                },
                "19": {
                    "time": 1621863402.40368,
                    "type": "LSP",
                    "LSP ID": "0100.0000.0006.00-00",
                    "Seq.N": 4,
                    "Orig.": "kathara-spine-1-1-2-8bea2587",
                    "Logical Clock": 19
                },
                "20": {
                    "time": 1621863402.403746,
                    "type": "LSP",
                    "LSP ID": "0100.0000.0006.00-00",
                    "Seq.N": 4,
                    "Orig.": "kathara-spine-1-1-2-8bea2587",
                    "Logical Clock": 20
                },
                "21": {
                    "time": 1621863402.404153,
                    "type": "LSP",
                    "LSP ID": "0100.0000.0006.00-00",
                    "Seq.N": 4,
                    "Orig.": "kathara-spine-1-1-2-8bea2587",
                    "Logical Clock": 21
                },
                "22": {
                    "time": 1621863402.404219,
                    "type": "LSP",
                    "LSP ID": "0100.0000.0006.00-00",
                    "Seq.N": 4,
                    "Orig.": "kathara-spine-1-1-2-8bea2587",
                    "Logical Clock": 22
                }
            },
            "leaf_2_0_1": {
                "9": {
                    "time": 1621863401.135825,
                    "type": "LSP",
                    "LSP ID": "0100.0000.0002.00-00",
                    "Seq.N": 4,
                    "Orig.": "kathara-spine-1-1-1-de87967a",
                    "Logical Clock": 9
                },
                "10": {
                    "time": 1621863401.135826,
                    "type": "LSP",
                    "LSP ID": "0100.0000.0002.00-00",
                    "Seq.N": 4,
                    "Orig.": "kathara-spine-1-1-1-de87967a",
                    "Logical Clock": 10
                },
                "21": {
                    "time": 1621863402.405058,
                    "type": "LSP",
                    "LSP ID": "0100.0000.0006.00-00",
                    "Seq.N": 4,
                    "Orig.": "kathara-spine-1-1-2-8bea2587",
                    "Logical Clock": 21
                },
                "22": {
                    "time": 1621863402.404514,
                    "type": "LSP",
                    "LSP ID": "0100.0000.0006.00-00",
                    "Seq.N": 4,
                    "Orig.": "kathara-spine-1-1-2-8bea2587",
                    "Logical Clock": 22
                },
                "23": {
                    "time": 1621863402.404649,
                    "type": "LSP",
                    "LSP ID": "0100.0000.0006.00-00",
                    "Seq.N": 4,
                    "Orig.": "kathara-spine-1-1-2-8bea2587",
                    "Logical Clock": 23
                }
            },
            "leaf_2_0_2": {
                "10": {
                    "time": 1621863401.135686,
                    "type": "LSP",
                    "LSP ID": "0100.0000.0002.00-00",
                    "Seq.N": 4,
                    "Orig.": "kathara-spine-1-1-1-de87967a",
                    "Logical Clock": 10
                },
                "11": {
                    "time": 1621863401.135703,
                    "type": "LSP",
                    "LSP ID": "0100.0000.0002.00-00",
                    "Seq.N": 4,
                    "Orig.": "kathara-spine-1-1-1-de87967a",
                    "Logical Clock": 11
                },
                "22": {
                    "time": 1621863402.404781,
                    "type": "LSP",
                    "LSP ID": "0100.0000.0006.00-00",
                    "Seq.N": 4,
                    "Orig.": "kathara-spine-1-1-2-8bea2587",
                    "Logical Clock": 22
                },
                "23": {
                    "time": 1621863402.404497,
                    "type": "LSP",
                    "LSP ID": "0100.0000.0006.00-00",
                    "Seq.N": 4,
                    "Orig.": "kathara-spine-1-1-2-8bea2587",
                    "Logical Clock": 23
                },
                "24": {
                    "time": 1621863402.404853,
                    "type": "LSP",
                    "LSP ID": "0100.0000.0006.00-00",
                    "Seq.N": 4,
                    "Orig.": "kathara-spine-1-1-2-8bea2587",
                    "Logical Clock": 24
                }
            }
        },
        "edges": [
            [
                [
                    "spine_1_1_1",
                    1
                ],
                [
                    "leaf_1_0_2",
                    2
                ]
            ],
            [
                [
                    "spine_1_1_1",
                    2
                ],
                [
                    "tof_1_2_1",
                    3
                ]
            ],
            [
                [
                    "spine_1_1_1",
                    3
                ],
                [
                    "tof_1_2_2",
                    4
                ]
            ],
            [
                [
                    "leaf_1_0_2",
                    3
                ],
                [
                    "spine_1_1_2",
                    4
                ]
            ],
            [
                [
                    "tof_1_2_1",
                    4
                ],
                [
                    "spine_1_1_2",
                    5
                ]
            ],
            [
                [
                    "tof_1_2_1",
                    5
                ],
                [
                    "spine_2_1_1",
                    6
                ]
            ],
            [
                [
                    "tof_1_2_1",
                    6
                ],
                [
                    "spine_2_1_2",
                    7
                ]
            ],
            [
                [
                    "tof_1_2_2",
                    5
                ],
                [
                    "spine_1_1_2",
                    6
                ]
            ],
            [
                [
                    "tof_1_2_2",
                    6
                ],
                [
                    "spine_2_1_1",
                    7
                ]
            ],
            [
                [
                    "tof_1_2_2",
                    7
                ],
                [
                    "spine_2_1_2",
                    8
                ]
            ],
            [
                [
                    "spine_1_1_2",
                    7
                ],
                [
                    "leaf_1_0_1",
                    null
                ]
            ],
            [
                [
                    "spine_1_1_2",
                    8
                ],
                [
                    "leaf_1_0_2",
                    9
                ]
            ],
            [
                [
                    "spine_1_1_2",
                    9
                ],
                [
                    "tof_1_2_2",
                    10
                ]
            ],
            [
                [
                    "spine_1_1_2",
                    10
                ],
                [
                    "leaf_1_0_2",
                    11
                ]
            ],
            [
                [
                    "spine_1_1_2",
                    11
                ],
                [
                    "tof_1_2_1",
                    12
                ]
            ],
            [
                [
                    "spine_1_1_2",
                    12
                ],
                [
                    "tof_1_2_2",
                    13
                ]
            ],
            [
                [
                    "spine_2_1_1",
                    8
                ],
                [
                    "leaf_2_0_1",
                    9
                ]
            ],
            [
                [
                    "spine_2_1_1",
                    9
                ],
                [
                    "leaf_2_0_2",
                    10
                ]
            ],
            [
                [
                    "spine_2_1_1",
                    10
                ],
                [
                    "tof_1_2_2",
                    14
                ]
            ],
            [
                [
                    "spine_2_1_2",
                    9
                ],
                [
                    "leaf_2_0_1",
                    10
                ]
            ],
            [
                [
                    "spine_2_1_2",
                    10
                ],
                [
                    "leaf_2_0_2",
                    11
                ]
            ],
            [
                [
                    "spine_2_1_2",
                    11
                ],
                [
                    "tof_1_2_2",
                    15
                ]
            ],
            [
                [
                    "leaf_1_0_2",
                    12
                ],
                [
                    "spine_1_1_1",
                    13
                ]
            ],
            [
                [
                    "tof_1_2_2",
                    16
                ],
                [
                    "spine_1_1_1",
                    17
                ]
            ],
            [
                [
                    "tof_1_2_2",
                    17
                ],
                [
                    "spine_2_1_1",
                    18
                ]
            ],
            [
                [
                    "tof_1_2_2",
                    18
                ],
                [
                    "spine_2_1_2",
                    19
                ]
            ],
            [
                [
                    "tof_1_2_1",
                    13
                ],
                [
                    "spine_1_1_1",
                    18
                ]
            ],
            [
                [
                    "tof_1_2_1",
                    14
                ],
                [
                    "spine_2_1_1",
                    19
                ]
            ],
            [
                [
                    "tof_1_2_1",
                    15
                ],
                [
                    "spine_2_1_2",
                    20
                ]
            ],
            [
                [
                    "spine_1_1_1",
                    19
                ],
                [
                    "leaf_1_0_2",
                    20
                ]
            ],
            [
                [
                    "spine_1_1_1",
                    20
                ],
                [
                    "tof_1_2_2",
                    21
                ]
            ],
            [
                [
                    "spine_2_1_1",
                    20
                ],
                [
                    "leaf_2_0_1",
                    21
                ]
            ],
            [
                [
                    "spine_2_1_1",
                    21
                ],
                [
                    "leaf_2_0_2",
                    22
                ]
            ],
            [
                [
                    "spine_2_1_1",
                    22
                ],
                [
                    "tof_1_2_1",
                    23
                ]
            ],
            [
                [
                    "spine_2_1_2",
                    21
                ],
                [
                    "leaf_2_0_1",
                    22
                ]
            ],
            [
                [
                    "spine_2_1_2",
                    22
                ],
                [
                    "leaf_2_0_2",
                    23
                ]
            ],
            [
                [
                    "leaf_2_0_1",
                    23
                ],
                [
                    "spine_2_1_1",
                    24
                ]
            ],
            [
                [
                    "leaf_2_0_2",
                    24
                ],
                [
                    "spine_2_1_1",
                    25
                ]
            ]
        ]
    },
    "max_scalar_clock": 25
}