{
    "description": "Scenario 5b: net12 link failure of spine_1_1_1 with BGP",
    "k_leaf": 12,
    "k_top": 12,
    "redundancy_factor": 12,
    "is_k8s": true,
    "machine_mac_addresses": {
        "leaf_1_0_1": {
            "net0": "76:a5:a5:70:16:cb",
            "net1": "8e:33:9f:17:9f:71",
            "net10": "92:e7:bd:c1:dd:89",
            "net11": "16:db:4c:4b:2f:12",
            "net12": "a2:3e:7b:0b:84:c1",
            "net2": "5e:ee:cf:a7:dd:49",
            "net3": "e6:49:24:02:ee:3c",
            "net4": "2e:6b:fc:54:62:0a",
            "net5": "6a:0d:cd:98:e5:ec",
            "net6": "0a:46:b6:61:c0:ef",
            "net7": "6a:0f:32:f9:5e:7c",
            "net8": "2a:42:2e:4f:44:42",
            "net9": "b6:1d:28:34:9f:6a"
        },
        "leaf_1_0_10": {
            "net0": "2a:88:85:8c:a1:f7",
            "net1": "ba:8d:c5:21:b1:6b",
            "net10": "1a:79:d8:f3:a5:4c",
            "net11": "fa:aa:c8:8d:88:c8",
            "net12": "1e:1e:ea:29:e4:73",
            "net2": "be:b1:5f:b0:a0:3c",
            "net3": "96:64:a6:1f:a8:ad",
            "net4": "02:16:d7:00:f8:96",
            "net5": "2e:7b:2e:35:fb:84",
            "net6": "42:05:df:c1:df:aa",
            "net7": "2a:66:61:9d:f8:49",
            "net8": "76:9e:4a:1b:79:e4",
            "net9": "0a:fd:a2:e3:12:09"
        },
        "leaf_1_0_11": {
            "net0": "5e:4c:c9:a0:bd:95",
            "net1": "da:9c:b6:08:df:47",
            "net10": "aa:d6:2d:78:25:96",
            "net11": "92:f1:1b:6b:2e:2a",
            "net12": "e6:1c:37:14:68:45",
            "net2": "ea:ad:e2:92:75:d4",
            "net3": "fa:7f:6a:8b:bf:5b",
            "net4": "de:19:e7:d9:97:80",
            "net5": "82:9a:f4:b1:d5:60",
            "net6": "22:d4:89:36:85:2d",
            "net7": "42:c7:5a:f9:d4:c8",
            "net8": "4e:bf:d7:32:60:47",
            "net9": "7a:dc:43:29:6f:ab"
        },
        "leaf_1_0_12": {
            "net0": "c2:1d:1d:88:93:59",
            "net1": "ba:72:68:ea:c3:6d",
            "net10": "96:32:63:97:a2:46",
            "net11": "1a:f9:ef:49:09:e1",
            "net12": "62:50:06:74:3f:f1",
            "net2": "ca:85:87:07:ab:0c",
            "net3": "02:b6:97:ac:e0:e0",
            "net4": "56:3f:e2:7c:c2:88",
            "net5": "26:40:44:0e:f4:77",
            "net6": "da:ce:1c:11:74:94",
            "net7": "be:eb:5c:11:5b:34",
            "net8": "96:0d:7a:f6:a0:2c",
            "net9": "56:99:c6:af:94:36"
        },
        "leaf_1_0_2": {
            "net0": "0a:d8:07:d3:73:59",
            "net1": "2a:fe:25:77:f5:0f",
            "net10": "06:b2:0d:0b:2e:38",
            "net11": "4a:43:3c:27:f0:fd",
            "net12": "2a:a0:5c:6f:b9:23",
            "net2": "02:07:e1:63:bf:7a",
            "net3": "be:92:b4:66:49:70",
            "net4": "f6:6d:27:5e:fc:22",
            "net5": "56:5c:5e:3e:52:a6",
            "net6": "8a:dc:5d:2b:60:db",
            "net7": "52:92:75:d1:0d:80",
            "net8": "a2:77:64:1a:c9:07",
            "net9": "f6:3b:56:78:b2:10"
        },
        "leaf_1_0_3": {
            "net0": "8e:03:b7:eb:4c:74",
            "net1": "be:c4:90:4f:7b:96",
            "net10": "4e:e5:c8:76:aa:4e",
            "net11": "82:d3:17:0e:c6:54",
            "net12": "7e:26:a4:09:9b:c0",
            "net2": "82:34:b9:ef:ce:1e",
            "net3": "ea:3d:7f:98:66:80",
            "net4": "a6:76:10:77:66:c5",
            "net5": "46:9f:c3:42:99:55",
            "net6": "26:6a:60:3c:e2:18",
            "net7": "d2:f3:9c:d4:25:ac",
            "net8": "ea:d5:ed:90:7d:93",
            "net9": "4a:28:3f:92:a2:da"
        },
        "leaf_1_0_4": {
            "net0": "7a:01:ac:a6:f5:3c",
            "net1": "d6:eb:0c:3e:4d:2d",
            "net10": "06:2e:53:f6:0b:8b",
            "net11": "d2:53:23:60:0a:ce",
            "net12": "b2:3a:65:f3:c9:1c",
            "net2": "ae:5d:c3:6d:99:a3",
            "net3": "fa:a4:88:bf:a9:ec",
            "net4": "9e:b2:f1:7b:36:49",
            "net5": "f2:da:49:9c:f7:42",
            "net6": "7a:99:54:29:4a:9b",
            "net7": "c6:da:d0:a2:86:1b",
            "net8": "72:a6:c6:16:16:4d",
            "net9": "56:eb:f5:57:a5:cc"
        },
        "leaf_1_0_5": {
            "net0": "86:16:1f:e2:f7:a5",
            "net1": "d6:1f:1f:8c:a9:bf",
            "net10": "82:9b:35:93:3e:99",
            "net11": "fa:7f:fa:90:8f:8f",
            "net12": "76:05:d1:e1:5d:2b",
            "net2": "ce:a3:eb:a3:3a:18",
            "net3": "22:5e:8d:e6:4b:c5",
            "net4": "6a:f1:2a:90:32:f3",
            "net5": "06:4e:f3:3e:a4:6e",
            "net6": "5e:07:75:39:9b:06",
            "net7": "0a:4e:47:d0:7c:8a",
            "net8": "7a:a6:7d:14:82:30",
            "net9": "8a:7e:35:b8:8d:73"
        },
        "leaf_1_0_6": {
            "net0": "92:ba:92:15:06:14",
            "net1": "e2:7b:5c:b0:79:07",
            "net10": "d2:12:48:f7:8d:6a",
            "net11": "ee:65:68:9e:be:12",
            "net12": "b2:d9:23:64:75:87",
            "net2": "76:bf:75:4c:0c:58",
            "net3": "02:a0:2b:e5:6c:b8",
            "net4": "1a:95:fe:72:ba:16",
            "net5": "a2:7d:e0:8a:cf:1b",
            "net6": "be:1c:48:02:cc:fd",
            "net7": "ba:a3:01:c0:e0:7e",
            "net8": "5a:90:e2:59:56:47",
            "net9": "aa:ae:35:b9:81:28"
        },
        "leaf_1_0_7": {
            "net0": "2e:81:ac:42:58:e6",
            "net1": "b6:f5:e7:87:a2:f7",
            "net10": "c6:f5:6f:6a:c4:50",
            "net11": "8a:1d:3e:3c:fb:f2",
            "net12": "26:5b:55:31:be:38",
            "net2": "3a:9b:65:2c:bb:ce",
            "net3": "56:8f:be:fe:a3:d8",
            "net4": "2a:4e:e2:32:ed:2b",
            "net5": "06:35:7c:46:10:c2",
            "net6": "ba:56:a6:4e:4c:b1",
            "net7": "82:18:8e:d3:fb:2b",
            "net8": "0e:62:3c:13:62:43",
            "net9": "7e:3e:22:38:eb:aa"
        },
        "leaf_1_0_8": {
            "net0": "e6:c6:59:85:8c:e4",
            "net1": "2e:65:41:d0:a6:1c",
            "net10": "66:db:a0:2f:18:1a",
            "net11": "c6:30:e4:3b:90:d1",
            "net12": "0a:82:06:11:a1:32",
            "net2": "12:7c:6c:23:19:f8",
            "net3": "3e:9e:90:c6:31:40",
            "net4": "8a:92:ab:fe:3a:62",
            "net5": "26:f7:93:d7:50:2c",
            "net6": "f2:fa:24:e5:0a:8c",
            "net7": "8e:f8:9d:a8:58:57",
            "net8": "c6:85:3a:94:03:8a",
            "net9": "7a:40:0d:e1:84:28"
        },
        "leaf_1_0_9": {
            "net0": "42:37:bc:7c:7e:0e",
            "net1": "6e:3b:ab:cc:5f:fc",
            "net10": "7e:3a:fd:85:c3:65",
            "net11": "0e:42:5a:ea:96:15",
            "net12": "be:62:37:1a:98:a4",
            "net2": "ce:3b:a4:c9:04:0b",
            "net3": "9e:84:36:a0:71:18",
            "net4": "9a:b7:65:94:77:7b",
            "net5": "f6:2e:71:a4:b2:0c",
            "net6": "62:6f:80:ab:a9:53",
            "net7": "36:87:04:a4:71:e6",
            "net8": "3e:b4:b6:69:9e:a5",
            "net9": "de:05:73:ea:7e:90"
        },
        "leaf_2_0_1": {
            "net0": "1a:64:73:57:bc:8d",
            "net1": "1e:11:63:37:51:eb",
            "net10": "16:14:8e:35:dc:96",
            "net11": "8e:f8:4f:ca:4c:74",
            "net12": "ae:bf:d8:e2:fa:78",
            "net2": "72:89:69:6c:50:c4",
            "net3": "c2:16:8c:0c:56:65",
            "net4": "6e:e1:54:60:90:90",
            "net5": "c6:22:e2:94:2f:97",
            "net6": "aa:c3:e1:30:73:25",
            "net7": "92:3b:9f:dc:f5:15",
            "net8": "52:df:b6:3e:fc:1c",
            "net9": "ca:4e:0b:8c:57:bb"
        },
        "leaf_2_0_10": {
            "net0": "22:43:78:86:0e:9f",
            "net1": "5e:1d:92:75:b7:1e",
            "net10": "42:7a:0c:e8:60:ab",
            "net11": "ea:38:40:c3:bc:57",
            "net12": "76:50:3d:f1:21:93",
            "net2": "ca:17:e3:f5:79:8a",
            "net3": "f6:7b:4f:a4:89:de",
            "net4": "2a:a5:c8:74:c7:b1",
            "net5": "5e:1e:be:ef:ad:53",
            "net6": "16:a3:6c:bd:61:c5",
            "net7": "82:34:f1:bf:29:92",
            "net8": "36:1a:65:85:22:06",
            "net9": "76:32:f9:a0:ec:c4"
        },
        "leaf_2_0_11": {
            "net0": "32:fc:d3:3c:e2:32",
            "net1": "7a:49:b3:46:35:87",
            "net10": "72:fb:36:df:d0:88",
            "net11": "5a:ab:9a:6c:02:3e",
            "net12": "06:73:e2:ae:88:9c",
            "net2": "e6:a5:85:d2:1f:7d",
            "net3": "26:d9:67:b3:d6:e9",
            "net4": "96:0f:11:0e:a2:5c",
            "net5": "52:f7:df:00:21:62",
            "net6": "ba:90:8d:85:2f:b5",
            "net7": "f6:c4:a3:bd:34:bd",
            "net8": "66:10:65:0f:dd:93",
            "net9": "5a:43:96:4a:81:5a"
        },
        "leaf_2_0_12": {
            "net0": "76:0f:ec:f4:d2:a9",
            "net1": "b2:ad:34:dc:c0:1e",
            "net10": "5e:81:c5:7a:d7:31",
            "net11": "62:1d:a5:b5:2d:5c",
            "net12": "9a:e8:3f:41:ba:11",
            "net2": "86:d1:9b:88:00:54",
            "net3": "82:ab:48:cc:a8:c4",
            "net4": "16:52:9d:84:86:1b",
            "net5": "b6:c9:03:69:77:f3",
            "net6": "8a:4b:3d:3f:44:5e",
            "net7": "46:06:db:9b:1f:63",
            "net8": "16:0f:95:7a:c4:b4",
            "net9": "ba:80:9b:4c:a6:67"
        },
        "leaf_2_0_2": {
            "net0": "de:62:dd:ca:fd:07",
            "net1": "d6:67:49:d1:63:ed",
            "net10": "be:0f:76:9b:db:fd",
            "net11": "7e:c9:24:7e:07:dd",
            "net12": "ba:1f:50:9d:c6:e9",
            "net2": "32:3c:5e:70:1b:02",
            "net3": "b2:97:38:00:8d:33",
            "net4": "42:00:6e:86:26:64",
            "net5": "2e:02:83:6c:7b:89",
            "net6": "62:c4:f6:61:36:b4",
            "net7": "26:98:c0:d3:9b:53",
            "net8": "de:5f:0e:18:5d:f7",
            "net9": "92:89:db:63:9f:c2"
        },
        "leaf_2_0_3": {
            "net0": "8a:c1:0e:e1:9c:15",
            "net1": "5e:67:78:97:7f:3d",
            "net10": "a6:92:cf:e4:aa:3c",
            "net11": "ca:27:0d:77:21:1e",
            "net12": "9e:1a:25:80:fc:b2",
            "net2": "92:57:85:a4:b1:05",
            "net3": "0e:0d:7c:0c:dc:56",
            "net4": "ce:e7:60:4f:a6:fb",
            "net5": "fa:90:94:be:b2:2b",
            "net6": "da:26:56:c2:2e:21",
            "net7": "12:10:22:9a:7d:4b",
            "net8": "56:3d:f0:97:37:fd",
            "net9": "fe:c2:4d:a6:b9:54"
        },
        "leaf_2_0_4": {
            "net0": "36:e4:e7:9b:fe:b7",
            "net1": "b2:07:1b:50:ca:e9",
            "net10": "ba:18:36:3d:70:0a",
            "net11": "8e:b3:df:88:29:b0",
            "net12": "6e:a8:a6:42:ec:d9",
            "net2": "16:36:9c:0a:b9:67",
            "net3": "be:f5:14:7f:6d:59",
            "net4": "06:b8:b6:58:71:ad",
            "net5": "6e:2c:d5:63:f1:8f",
            "net6": "ea:a9:1f:fd:55:25",
            "net7": "52:a6:a2:62:88:d6",
            "net8": "56:e6:bc:bd:c3:d5",
            "net9": "ce:db:68:a1:d4:e5"
        },
        "leaf_2_0_5": {
            "net0": "5a:0d:39:89:42:4a",
            "net1": "4e:60:10:be:2e:2e",
            "net10": "0e:cf:4b:a6:16:c5",
            "net11": "f2:89:93:3e:ed:ed",
            "net12": "6a:ec:8f:84:e9:dc",
            "net2": "22:56:8c:34:9a:05",
            "net3": "da:21:5e:93:92:75",
            "net4": "76:60:c0:73:9b:21",
            "net5": "ce:07:9c:04:93:88",
            "net6": "52:be:b3:c7:79:92",
            "net7": "b6:02:ad:a6:87:69",
            "net8": "ce:5c:8b:f5:22:94",
            "net9": "f6:45:6e:2d:d5:70"
        },
        "leaf_2_0_6": {
            "net0": "3e:59:a3:1c:8a:7c",
            "net1": "62:96:f6:1f:6b:a0",
            "net10": "22:4f:f6:54:a1:0e",
            "net11": "6a:ad:c0:92:bc:51",
            "net12": "6e:09:78:2a:3c:ec",
            "net2": "ea:e9:64:bd:eb:b4",
            "net3": "ee:d6:54:4e:63:21",
            "net4": "16:7e:b5:fd:96:4b",
            "net5": "b6:7d:a6:b1:6b:10",
            "net6": "36:9f:f3:14:aa:c1",
            "net7": "5e:6c:7e:39:82:e0",
            "net8": "8a:2c:02:2d:d5:30",
            "net9": "be:50:43:cb:52:54"
        },
        "leaf_2_0_7": {
            "net0": "aa:5f:56:e7:00:07",
            "net1": "b2:41:49:89:2b:57",
            "net10": "d6:a8:7a:c9:4c:65",
            "net11": "9a:69:c3:af:f6:94",
            "net12": "aa:75:fa:aa:cd:23",
            "net2": "6a:27:9f:ff:d7:00",
            "net3": "e6:f8:53:0b:a6:26",
            "net4": "86:fe:72:e0:91:55",
            "net5": "4a:c9:46:27:6d:47",
            "net6": "22:cd:a2:97:e9:d4",
            "net7": "da:59:6a:c4:d8:ce",
            "net8": "06:8d:da:be:c3:bd",
            "net9": "6e:94:f9:1e:1b:5f"
        },
        "leaf_2_0_8": {
            "net0": "4e:ec:73:19:85:1c",
            "net1": "72:e4:e3:c1:84:ea",
            "net10": "4a:d3:cf:8b:cb:bb",
            "net11": "0e:16:e1:fc:c1:96",
            "net12": "62:e4:d1:b4:8f:49",
            "net2": "e2:93:8e:7f:2c:bf",
            "net3": "5e:d3:08:b0:83:97",
            "net4": "0a:bb:d3:84:b4:3f",
            "net5": "96:90:46:e4:4f:a5",
            "net6": "12:47:cb:92:5e:43",
            "net7": "32:2e:4c:8f:a6:6a",
            "net8": "96:53:ec:6d:7a:82",
            "net9": "b2:cf:ba:d4:e0:ac"
        },
        "leaf_2_0_9": {
            "net0": "a2:7d:9e:4a:b4:f3",
            "net1": "fa:0e:3e:7c:85:ed",
            "net10": "32:83:b6:43:b9:87",
            "net11": "82:0b:42:cc:75:2a",
            "net12": "5e:c4:31:de:47:b7",
            "net2": "b6:dc:98:72:74:ab",
            "net3": "c2:15:1d:4d:b1:11",
            "net4": "c2:63:c7:67:7d:f4",
            "net5": "6a:bc:c2:16:75:b9",
            "net6": "42:c1:ac:68:6a:55",
            "net7": "e6:42:2f:a8:fd:df",
            "net8": "ee:4f:74:15:29:81",
            "net9": "72:7a:8d:d7:b8:f6"
        },
        "spine_1_1_1": {
            "net0": "fa:ca:cc:48:89:85",
            "net1": "56:d8:ad:03:c4:93",
            "net10": "6e:9f:73:b6:7b:ed",
            "net11": "02:94:6e:de:e9:de",
            "net12": "82:65:3b:79:77:db",
            "net13": "3e:72:c3:80:37:7c",
            "net14": "36:48:35:bd:74:8d",
            "net15": "ea:76:58:db:cd:2e",
            "net16": "02:1d:d8:e7:d8:68",
            "net17": "b2:80:93:ee:7d:ef",
            "net18": "8a:20:c0:f6:bb:7b",
            "net19": "3e:b9:2c:bf:b8:a8",
            "net2": "26:2f:3a:68:cc:93",
            "net20": "c2:61:02:6c:b9:0a",
            "net21": "e6:e1:5c:b0:eb:5c",
            "net22": "1e:de:c4:85:c3:24",
            "net23": "3e:4d:37:ea:96:79",
            "net3": "1a:5b:8d:94:da:e2",
            "net4": "82:bf:45:23:71:ac",
            "net5": "12:0d:71:d7:01:92",
            "net6": "fe:65:d4:00:44:42",
            "net7": "7e:b2:92:47:d6:53",
            "net8": "7e:c8:dc:3e:05:a7",
            "net9": "2a:2e:24:92:b9:c5"
        },
        "spine_1_1_10": {
            "net0": "ca:d3:cf:ea:1a:e3",
            "net1": "06:04:e1:d0:2f:a4",
            "net10": "2e:c4:0c:3f:d0:a9",
            "net11": "4e:f2:8c:bd:1f:90",
            "net12": "62:87:71:ae:e7:69",
            "net13": "fe:db:f7:f3:c9:f5",
            "net14": "3a:06:44:b0:45:d6",
            "net15": "aa:ec:10:60:eb:62",
            "net16": "a6:a7:d1:e7:8f:d5",
            "net17": "b2:99:9a:18:37:8b",
            "net18": "76:d9:5d:43:da:4e",
            "net19": "d2:27:92:b8:af:9f",
            "net2": "2a:d7:c9:31:69:7b",
            "net20": "72:a5:ff:78:cc:63",
            "net21": "8e:d2:fe:44:22:2d",
            "net22": "2e:70:77:06:ed:4d",
            "net23": "0e:5b:9e:1b:15:15",
            "net3": "5e:f3:4f:c2:e3:5f",
            "net4": "76:22:b7:3a:2c:78",
            "net5": "f2:9b:d3:3c:ea:d3",
            "net6": "ce:29:ba:2b:22:45",
            "net7": "5a:e8:87:79:01:ec",
            "net8": "6a:f3:f2:d8:74:17",
            "net9": "7a:36:f5:b7:a9:33"
        },
        "spine_1_1_11": {
            "net0": "de:f9:97:ad:48:56",
            "net1": "92:af:04:50:5b:37",
            "net10": "9a:89:6f:c0:05:17",
            "net11": "5e:e8:9f:76:be:5e",
            "net12": "d2:49:ef:64:eb:4c",
            "net13": "a6:54:bd:74:57:82",
            "net14": "fa:42:cc:a1:7f:c2",
            "net15": "5e:78:3d:27:45:db",
            "net16": "96:a2:a8:2f:1d:5d",
            "net17": "ce:38:1c:02:91:27",
            "net18": "de:97:66:f7:d8:1f",
            "net19": "82:2a:12:d2:79:13",
            "net2": "16:59:ac:7f:7b:a7",
            "net20": "c2:30:32:53:6c:0f",
            "net21": "16:eb:06:f3:6d:2c",
            "net22": "56:2f:f0:76:92:bd",
            "net23": "7a:ca:6f:02:cd:69",
            "net3": "1e:ad:89:02:f5:11",
            "net4": "d2:2e:48:e5:82:d0",
            "net5": "12:c4:ce:51:eb:cb",
            "net6": "fe:56:d0:47:7f:a3",
            "net7": "ae:42:fb:80:f0:36",
            "net8": "e2:74:5a:93:e8:9f",
            "net9": "fe:7e:7c:91:9f:a6"
        },
        "spine_1_1_12": {
            "net0": "22:b4:a1:4d:9d:b6",
            "net1": "aa:50:7b:07:58:f7",
            "net10": "02:4a:69:53:4e:33",
            "net11": "e6:e9:45:c0:be:90",
            "net12": "9e:76:aa:c2:19:5c",
            "net13": "36:67:6c:be:10:d9",
            "net14": "16:a2:6f:be:25:d1",
            "net15": "62:e0:d4:2c:07:2a",
            "net16": "f6:e0:83:09:07:78",
            "net17": "f6:1c:4c:22:8b:2b",
            "net18": "7a:93:91:8b:e5:ea",
            "net19": "f6:d3:43:10:d2:ac",
            "net2": "96:e4:e0:79:af:b2",
            "net20": "ca:8e:90:ae:1a:b4",
            "net21": "4a:74:07:07:d7:83",
            "net22": "fe:66:63:28:12:a5",
            "net23": "76:a2:e5:b0:f3:4e",
            "net3": "36:9e:71:26:23:a1",
            "net4": "72:a4:ff:60:85:86",
            "net5": "5e:00:95:b9:20:09",
            "net6": "ee:a8:3b:90:77:ca",
            "net7": "de:7f:7f:cc:ac:6b",
            "net8": "02:ae:f9:ad:f0:19",
            "net9": "1e:7d:84:d7:62:e7"
        },
        "spine_1_1_2": {
            "net0": "82:ef:c8:95:13:da",
            "net1": "7e:8c:2a:ca:8a:1c",
            "net10": "ce:93:62:0b:ac:33",
            "net11": "6a:8c:88:10:2d:e0",
            "net12": "aa:c5:43:5a:bd:5f",
            "net13": "52:7a:29:bd:26:be",
            "net14": "46:c6:46:a3:36:ab",
            "net15": "52:82:02:38:42:d4",
            "net16": "d6:97:1d:c7:ad:da",
            "net17": "da:0c:0a:f0:d9:e2",
            "net18": "a2:c7:32:a0:1e:9a",
            "net19": "a2:46:49:2c:9c:02",
            "net2": "9e:b9:f7:69:c2:37",
            "net20": "3e:42:b5:5a:6a:59",
            "net21": "82:60:f5:51:2b:56",
            "net22": "42:43:ea:ff:6e:6d",
            "net23": "1e:86:23:88:b6:36",
            "net3": "32:4f:9c:1b:01:34",
            "net4": "ca:dc:0d:c0:b5:4f",
            "net5": "a2:6e:97:74:af:4b",
            "net6": "8e:96:ae:5b:4f:44",
            "net7": "46:0a:1e:b0:87:ae",
            "net8": "a6:67:e2:50:56:62",
            "net9": "aa:83:1f:01:07:45"
        },
        "spine_1_1_3": {
            "net0": "52:fd:3a:03:3e:ee",
            "net1": "b6:37:a2:b6:f6:0e",
            "net10": "56:4e:e7:07:0a:00",
            "net11": "2a:4b:0e:03:c9:c1",
            "net12": "86:f7:f9:b8:fa:c0",
            "net13": "7e:9a:40:8d:0c:bb",
            "net14": "7a:2c:bb:d4:c9:28",
            "net15": "96:a4:76:74:8f:eb",
            "net16": "3e:48:a8:0e:02:a1",
            "net17": "62:f4:a1:46:a1:98",
            "net18": "66:ac:54:b3:85:41",
            "net19": "5e:79:5c:37:fd:18",
            "net2": "3a:8a:01:e6:57:20",
            "net20": "1e:3d:90:22:cd:cb",
            "net21": "76:1f:41:d4:f1:25",
            "net22": "9a:10:44:24:a1:56",
            "net23": "5a:29:b8:05:16:73",
            "net3": "66:4c:7b:12:d1:08",
            "net4": "52:c3:4c:a4:35:d5",
            "net5": "6e:d9:0c:fe:8e:b8",
            "net6": "ba:62:ee:7a:06:dd",
            "net7": "7a:25:5b:32:95:e0",
            "net8": "1e:20:b9:06:3b:d3",
            "net9": "de:78:5d:c8:e7:2d"
        },
        "spine_1_1_4": {
            "net0": "3e:f3:90:c1:21:cd",
            "net1": "2e:ec:a1:71:c2:6d",
            "net10": "be:48:d9:b8:ad:6e",
            "net11": "ee:e6:d8:38:6d:89",
            "net12": "7a:24:d5:4d:d4:bb",
            "net13": "ae:13:6b:ab:58:2e",
            "net14": "36:6f:1e:04:b6:3f",
            "net15": "7e:87:bf:3e:11:e3",
            "net16": "8e:ab:ad:f4:cd:f9",
            "net17": "7e:5a:75:6d:47:11",
            "net18": "b2:3f:83:f6:eb:41",
            "net19": "b6:46:fe:33:21:c0",
            "net2": "96:4b:b4:99:74:d5",
            "net20": "1a:28:4b:11:5f:d5",
            "net21": "86:a2:d2:7f:c5:e4",
            "net22": "be:3b:57:9d:2e:ef",
            "net23": "ce:c1:76:3a:45:0f",
            "net3": "7e:bf:45:12:50:ab",
            "net4": "c2:19:c9:44:d5:f5",
            "net5": "7e:0a:68:fc:a4:22",
            "net6": "f2:44:f2:cf:b8:de",
            "net7": "22:b3:86:9a:7e:e3",
            "net8": "42:9d:b2:3a:23:29",
            "net9": "5e:69:f5:df:0c:d5"
        },
        "spine_1_1_5": {
            "net0": "3a:f1:f9:4a:0b:36",
            "net1": "d2:87:ec:a9:26:fb",
            "net10": "ea:6c:ee:3e:43:1d",
            "net11": "d2:f5:9f:d4:72:cf",
            "net12": "ea:07:71:15:3d:30",
            "net13": "66:11:14:3b:2d:47",
            "net14": "c2:db:6a:bb:8a:33",
            "net15": "7a:e1:24:45:dc:78",
            "net16": "5e:9c:d0:7c:03:c1",
            "net17": "66:c1:17:72:af:fa",
            "net18": "a6:59:da:70:96:89",
            "net19": "32:57:f3:c9:5b:ab",
            "net2": "82:57:f9:87:a0:95",
            "net20": "f2:38:ea:8b:76:91",
            "net21": "8e:b9:08:6e:09:6c",
            "net22": "d2:01:af:ff:ea:0b",
            "net23": "3a:2c:38:9b:dd:2a",
            "net3": "3e:09:a7:e3:9d:ed",
            "net4": "a2:2b:54:22:74:60",
            "net5": "a6:70:b9:f7:f3:70",
            "net6": "f6:6f:f5:84:04:ca",
            "net7": "f2:9f:21:6e:d4:35",
            "net8": "96:70:ba:c9:6f:9a",
            "net9": "d6:4a:89:7e:68:8b"
        },
        "spine_1_1_6": {
            "net0": "16:28:86:46:32:b9",
            "net1": "8e:ff:d9:dc:ff:c9",
            "net10": "7e:a9:46:6f:f2:40",
            "net11": "c2:d1:5e:fd:94:0e",
            "net12": "92:37:94:6e:98:f6",
            "net13": "62:b7:bb:3b:c3:00",
            "net14": "62:a9:02:f3:0f:26",
            "net15": "8a:27:f9:f5:d2:9c",
            "net16": "76:39:5b:50:81:10",
            "net17": "8e:db:a5:f6:74:b9",
            "net18": "32:65:de:06:0e:63",
            "net19": "e2:03:37:1e:6e:fe",
            "net2": "06:d1:35:3e:d1:94",
            "net20": "f2:89:81:72:4e:f5",
            "net21": "82:e0:83:fb:0f:30",
            "net22": "7e:fe:f2:92:ac:2b",
            "net23": "7e:2d:98:50:f9:ae",
            "net3": "ea:38:49:3e:d0:3c",
            "net4": "ae:02:60:4e:7a:42",
            "net5": "ee:a2:e2:cb:b8:37",
            "net6": "0e:f3:80:2c:2c:3c",
            "net7": "a6:cc:3a:c3:91:cd",
            "net8": "c2:37:81:f2:fb:9f",
            "net9": "ba:56:76:ad:3a:5f"
        },
        "spine_1_1_7": {
            "net0": "b2:d7:6a:a6:66:d8",
            "net1": "b2:49:87:7c:00:ce",
            "net10": "f2:ac:b6:63:72:86",
            "net11": "d2:89:35:a1:a9:8a",
            "net12": "9e:ce:04:86:11:64",
            "net13": "ca:c9:e4:2c:48:41",
            "net14": "ce:f7:04:8b:d4:6a",
            "net15": "22:cf:fa:22:06:2a",
            "net16": "7e:41:eb:f6:43:df",
            "net17": "e2:28:d1:b1:bd:92",
            "net18": "12:e5:ab:c3:bb:80",
            "net19": "3e:8e:bf:51:ca:d6",
            "net2": "b2:5c:2e:24:c9:0b",
            "net20": "f2:93:40:25:e8:6c",
            "net21": "66:ec:44:fc:44:af",
            "net22": "fe:b2:52:78:06:17",
            "net23": "ca:7b:e5:86:89:7f",
            "net3": "96:e7:50:9c:f3:7a",
            "net4": "ee:c1:c7:54:26:19",
            "net5": "62:bf:79:7c:78:84",
            "net6": "4a:2a:59:51:a7:b0",
            "net7": "42:57:3e:7d:19:fe",
            "net8": "76:c3:bb:28:1f:4d",
            "net9": "0a:25:0a:99:76:b8"
        },
        "spine_1_1_8": {
            "net0": "7e:a1:c4:49:0e:cf",
            "net1": "1e:be:b3:c8:45:a2",
            "net10": "2a:b5:f3:97:39:e0",
            "net11": "ae:09:0c:a3:e4:b0",
            "net12": "82:08:79:c7:86:ee",
            "net13": "da:bb:d9:78:64:ae",
            "net14": "ba:4d:48:2f:5e:e5",
            "net15": "b2:12:40:32:9c:4f",
            "net16": "7a:cc:80:46:da:e5",
            "net17": "02:a5:79:fe:5d:7b",
            "net18": "a2:84:ab:76:7e:10",
            "net19": "16:0e:22:a2:a8:1d",
            "net2": "22:1e:1f:23:cc:47",
            "net20": "b2:a3:ec:17:10:2e",
            "net21": "46:fd:d3:aa:8b:8d",
            "net22": "ea:f3:b2:b7:f7:13",
            "net23": "d6:f0:75:20:62:f4",
            "net3": "3e:8b:e1:5a:ef:26",
            "net4": "de:ec:ca:4f:e3:14",
            "net5": "ce:e8:f3:1e:c7:6d",
            "net6": "1e:a0:1f:1c:8c:08",
            "net7": "9e:49:a9:ab:36:db",
            "net8": "96:14:34:4e:74:50",
            "net9": "be:1a:7c:83:ab:47"
        },
        "spine_1_1_9": {
            "net0": "e2:4d:9a:54:b9:f8",
            "net1": "0a:2d:b5:0d:2f:4d",
            "net10": "e6:d5:d7:73:86:1f",
            "net11": "8e:a4:ec:2f:45:ff",
            "net12": "0a:f0:61:be:ea:89",
            "net13": "b6:7b:32:c2:88:e0",
            "net14": "c2:4b:ed:da:62:18",
            "net15": "b2:9e:a6:08:67:eb",
            "net16": "86:f8:54:4f:25:12",
            "net17": "0e:14:8a:c6:2e:e1",
            "net18": "b2:f6:ea:b1:ab:5d",
            "net19": "26:b9:19:ca:92:d0",
            "net2": "a6:d3:e6:48:63:93",
            "net20": "52:9b:6f:c0:06:f4",
            "net21": "9a:bc:9f:0f:35:f2",
            "net22": "4a:cd:5e:33:25:71",
            "net23": "42:6f:3d:6d:77:4c",
            "net3": "92:ee:68:c0:e0:11",
            "net4": "d2:5c:61:44:13:16",
            "net5": "be:f5:b7:cc:28:9e",
            "net6": "aa:b8:13:d0:e4:56",
            "net7": "ee:e8:23:48:5f:d8",
            "net8": "ce:4e:5d:c6:fc:f8",
            "net9": "ae:10:64:e4:4e:71"
        },
        "spine_2_1_1": {
            "net0": "d2:fd:5a:23:80:83",
            "net1": "9a:ec:61:3f:14:e9",
            "net10": "3e:19:80:8d:b4:2a",
            "net11": "26:3e:a3:c0:20:30",
            "net12": "5a:dc:81:77:ce:aa",
            "net13": "32:ae:0a:b2:a7:0a",
            "net14": "96:69:77:63:32:20",
            "net15": "16:62:a4:cf:20:ca",
            "net16": "f2:fd:6a:a5:69:d2",
            "net17": "b6:47:49:28:4f:0f",
            "net18": "e2:0b:68:45:d5:d5",
            "net19": "46:5f:2d:13:02:a3",
            "net2": "5e:99:23:ad:98:88",
            "net20": "2e:36:45:44:27:a8",
            "net21": "12:4d:1e:c3:1c:1f",
            "net22": "3e:3b:70:ff:94:c4",
            "net23": "72:d5:ef:02:9f:c2",
            "net3": "7e:e2:50:a5:37:f6",
            "net4": "f6:c5:df:78:86:16",
            "net5": "ee:89:01:80:27:35",
            "net6": "5a:d1:5e:eb:5f:39",
            "net7": "ba:9e:66:e2:4c:dc",
            "net8": "d6:03:62:2a:ff:5d",
            "net9": "ca:42:96:00:fd:96"
        },
        "spine_2_1_10": {
            "net0": "42:be:81:9c:e6:eb",
            "net1": "fa:a4:e8:e8:ad:3b",
            "net10": "a6:ef:1d:eb:47:66",
            "net11": "2a:88:02:51:6b:12",
            "net12": "ce:e3:d6:00:12:e4",
            "net13": "1e:fd:fd:5d:02:a1",
            "net14": "8a:4a:33:d3:a2:0f",
            "net15": "ba:57:55:cb:98:1d",
            "net16": "8e:b3:e5:83:4b:9b",
            "net17": "fe:81:83:72:24:02",
            "net18": "e2:16:d6:a4:e5:fa",
            "net19": "3e:5a:3c:82:a6:50",
            "net2": "2e:f3:ae:5d:bd:c9",
            "net20": "b2:7e:17:7f:2f:db",
            "net21": "26:56:19:08:ed:5b",
            "net22": "3a:86:6d:f5:72:9e",
            "net23": "aa:1e:74:41:db:b1",
            "net3": "5e:bb:0e:96:52:92",
            "net4": "66:a1:28:e7:3c:89",
            "net5": "ce:55:16:21:12:23",
            "net6": "3e:2c:d6:8d:90:54",
            "net7": "42:19:12:58:01:a0",
            "net8": "fa:1c:ba:40:33:95",
            "net9": "02:a0:36:0b:d5:34"
        },
        "spine_2_1_11": {
            "net0": "fe:7c:6e:e4:d2:36",
            "net1": "1e:42:3e:05:5e:93",
            "net10": "f2:63:ab:91:87:33",
            "net11": "be:b7:8b:46:f1:eb",
            "net12": "be:a6:23:ff:fb:13",
            "net13": "aa:f7:1b:be:f7:da",
            "net14": "1e:9a:34:e2:44:66",
            "net15": "92:f3:e5:72:ad:d3",
            "net16": "be:d7:97:36:6f:f7",
            "net17": "86:19:08:6b:52:e1",
            "net18": "66:9a:67:0f:2d:8f",
            "net19": "0a:51:b9:cb:46:22",
            "net2": "ca:33:75:71:45:4d",
            "net20": "be:bd:7f:c4:e2:16",
            "net21": "1e:d2:1a:72:5d:55",
            "net22": "ea:53:39:84:31:4f",
            "net23": "c2:04:a7:11:f6:6a",
            "net3": "ce:53:a2:4d:75:15",
            "net4": "0e:12:ad:9f:01:05",
            "net5": "ea:8e:1b:d0:19:09",
            "net6": "e2:cb:da:09:33:65",
            "net7": "8e:a8:14:b9:64:c5",
            "net8": "3e:d5:4d:1f:43:15",
            "net9": "82:df:df:fa:43:c2"
        },
        "spine_2_1_12": {
            "net0": "f6:d9:bb:37:47:51",
            "net1": "02:c9:97:7c:31:cc",
            "net10": "86:2e:bd:55:b3:5c",
            "net11": "c2:60:94:48:b8:60",
            "net12": "b2:9c:1e:42:68:ca",
            "net13": "de:f7:b3:b9:06:43",
            "net14": "ae:75:1f:f1:62:58",
            "net15": "6a:7f:e7:98:3d:3e",
            "net16": "b6:67:36:9b:e5:0a",
            "net17": "66:24:c6:98:aa:35",
            "net18": "ca:01:eb:98:2e:1d",
            "net19": "8a:2b:93:4f:35:fc",
            "net2": "d2:1b:4c:af:62:84",
            "net20": "a2:10:90:c0:d1:62",
            "net21": "66:2a:5d:72:0f:74",
            "net22": "2e:e5:5f:28:ba:5b",
            "net23": "2e:9d:0a:a9:6e:dd",
            "net3": "66:a3:31:4a:54:b6",
            "net4": "2a:0d:31:1b:3b:74",
            "net5": "fa:27:e9:4b:7b:d0",
            "net6": "06:f0:64:b8:cb:b0",
            "net7": "ee:4c:6a:b0:f6:c9",
            "net8": "ba:fe:71:42:f4:99",
            "net9": "be:35:19:80:79:bc"
        },
        "spine_2_1_2": {
            "net0": "62:e0:40:a4:0b:c1",
            "net1": "02:3e:36:54:55:6b",
            "net10": "32:c6:1e:80:10:43",
            "net11": "96:22:7e:32:ac:95",
            "net12": "6a:ad:44:ef:25:3c",
            "net13": "3e:a2:39:fd:72:c9",
            "net14": "6a:2b:4b:35:d1:bc",
            "net15": "f6:5a:1a:6d:71:40",
            "net16": "d2:6f:05:71:54:45",
            "net17": "66:93:fa:bb:cc:8d",
            "net18": "d6:8a:76:43:98:05",
            "net19": "26:5d:48:c7:2f:33",
            "net2": "6e:d8:ac:42:3f:88",
            "net20": "86:e6:c5:67:ab:07",
            "net21": "f6:67:b5:8c:8b:07",
            "net22": "9e:6d:60:3e:f4:fc",
            "net23": "ba:0b:c2:b7:42:3e",
            "net3": "3a:6e:c1:d6:6b:1e",
            "net4": "66:7f:bc:9e:ac:c4",
            "net5": "b6:a5:e2:7c:16:df",
            "net6": "6a:be:0a:88:85:45",
            "net7": "9e:38:59:72:45:7e",
            "net8": "82:d7:1d:0d:7d:7c",
            "net9": "0e:b5:b8:e8:7d:64"
        },
        "spine_2_1_3": {
            "net0": "d2:3b:34:e1:5e:25",
            "net1": "aa:b6:6d:32:7f:87",
            "net10": "0a:79:02:5e:d4:1c",
            "net11": "3e:5a:ab:0b:de:cb",
            "net12": "1a:05:0d:1d:29:43",
            "net13": "86:11:b0:c9:c1:a3",
            "net14": "9e:65:3d:a3:13:94",
            "net15": "f6:5e:9e:c6:7d:0c",
            "net16": "8a:8c:21:62:e9:f0",
            "net17": "1a:f9:ef:3e:2e:76",
            "net18": "72:ec:ba:1c:b6:f9",
            "net19": "36:81:a8:5f:bd:29",
            "net2": "1e:1d:46:45:ad:1e",
            "net20": "92:a6:ec:cf:cb:6f",
            "net21": "62:6a:dc:ad:74:b9",
            "net22": "06:bd:ee:72:74:b5",
            "net23": "46:55:1f:86:2b:4f",
            "net3": "8e:d2:55:cb:22:bd",
            "net4": "12:72:fe:49:2e:0a",
            "net5": "d2:dc:2e:44:d3:f3",
            "net6": "76:fc:3f:54:fc:23",
            "net7": "8e:7e:15:b2:55:30",
            "net8": "52:0d:60:d2:4c:d0",
            "net9": "c6:90:d2:cd:5d:57"
        },
        "spine_2_1_4": {
            "net0": "ba:38:87:4e:d6:66",
            "net1": "2e:ee:e8:86:80:d5",
            "net10": "82:ae:d7:00:f6:17",
            "net11": "92:7e:21:af:f4:ba",
            "net12": "fe:fb:7a:15:3b:89",
            "net13": "3e:93:da:cb:10:b1",
            "net14": "f6:4d:01:b1:91:76",
            "net15": "0a:eb:57:f6:67:31",
            "net16": "5a:f3:00:a2:81:7b",
            "net17": "02:ba:c7:dd:55:0d",
            "net18": "86:b2:43:ff:0b:73",
            "net19": "16:4e:93:23:d2:3f",
            "net2": "5e:d3:62:91:1c:34",
            "net20": "aa:f2:e6:01:5c:fa",
            "net21": "f2:49:e8:85:07:d0",
            "net22": "92:f7:e4:7e:cd:eb",
            "net23": "aa:d4:e8:6c:65:88",
            "net3": "52:f6:a4:31:df:1b",
            "net4": "1e:28:96:20:07:54",
            "net5": "02:3b:46:e9:1a:cf",
            "net6": "02:49:c5:87:f2:43",
            "net7": "a2:5a:47:03:58:80",
            "net8": "ce:5a:56:d6:99:c2",
            "net9": "6e:3e:c3:27:54:24"
        },
        "spine_2_1_5": {
            "net0": "ae:17:63:0d:5a:b4",
            "net1": "1e:08:dc:0d:24:74",
            "net10": "06:55:98:2a:82:60",
            "net11": "66:ae:d7:d6:81:de",
            "net12": "7e:d6:8e:c0:66:46",
            "net13": "96:1c:6b:dc:71:38",
            "net14": "12:49:29:4f:8f:c6",
            "net15": "06:27:a1:f9:63:8f",
            "net16": "1a:86:cd:12:fa:32",
            "net17": "4e:91:41:c9:cc:eb",
            "net18": "76:88:d0:2d:6f:0d",
            "net19": "22:97:b7:17:8e:75",
            "net2": "6e:c2:d5:a9:7f:40",
            "net20": "72:9d:cb:83:03:b1",
            "net21": "36:09:d4:55:d1:fd",
            "net22": "ea:cb:32:08:1c:79",
            "net23": "0e:7a:9e:f3:59:60",
            "net3": "be:0d:ff:10:c3:ff",
            "net4": "f2:1b:36:cd:1b:03",
            "net5": "3a:71:8d:e2:bd:7b",
            "net6": "1e:d8:ef:2e:79:59",
            "net7": "3e:56:a7:bc:04:03",
            "net8": "22:73:09:e4:86:af",
            "net9": "36:8f:57:8d:2b:5e"
        },
        "spine_2_1_6": {
            "net0": "82:ca:84:c8:85:24",
            "net1": "5e:ad:cf:7b:16:e1",
            "net10": "46:6d:bb:fe:df:1c",
            "net11": "96:cb:66:56:58:d2",
            "net12": "42:2b:35:e4:f1:ed",
            "net13": "8a:bc:db:b5:8d:ae",
            "net14": "82:02:3d:13:1e:ed",
            "net15": "d6:d6:7d:79:22:09",
            "net16": "ee:a3:ac:0f:a5:11",
            "net17": "0a:ed:da:0c:65:3f",
            "net18": "4a:03:87:7e:17:9b",
            "net19": "c6:3e:e1:6b:f8:e4",
            "net2": "96:b5:51:10:bd:30",
            "net20": "f2:eb:33:80:22:6f",
            "net21": "72:c6:ae:00:88:9a",
            "net22": "1e:cc:be:e2:85:99",
            "net23": "8e:5c:0f:86:a4:26",
            "net3": "26:2d:ef:82:82:1a",
            "net4": "02:fe:ed:48:cc:91",
            "net5": "ae:f6:a4:51:af:24",
            "net6": "da:87:3e:66:4b:58",
            "net7": "6e:4c:1b:a8:39:53",
            "net8": "7a:2b:6b:db:95:3f",
            "net9": "7e:e0:96:68:b0:0a"
        },
        "spine_2_1_7": {
            "net0": "9a:ef:c3:5c:4e:bc",
            "net1": "1a:74:60:f3:cb:9a",
            "net10": "52:44:38:9a:18:74",
            "net11": "56:46:c0:9b:47:aa",
            "net12": "de:67:77:75:7a:3d",
            "net13": "1e:fd:36:eb:e4:b3",
            "net14": "ba:14:10:37:28:38",
            "net15": "aa:79:b4:ef:6a:4e",
            "net16": "ca:1a:c1:f8:a3:9d",
            "net17": "be:0f:45:f3:31:1a",
            "net18": "06:03:cc:53:7a:1c",
            "net19": "ee:de:92:7b:d1:28",
            "net2": "76:f2:15:43:29:52",
            "net20": "52:ac:92:dd:22:24",
            "net21": "42:c1:09:33:54:03",
            "net22": "2e:23:79:d3:86:ab",
            "net23": "26:10:5b:0d:55:02",
            "net3": "32:d1:6d:98:18:3c",
            "net4": "fe:90:93:8d:ba:37",
            "net5": "92:97:7f:c6:dd:63",
            "net6": "26:56:70:5f:c8:01",
            "net7": "92:61:43:a7:d0:67",
            "net8": "4e:27:72:e8:7f:c3",
            "net9": "d6:f0:59:20:86:62"
        },
        "spine_2_1_8": {
            "net0": "de:54:54:fe:08:f8",
            "net1": "8e:2e:f9:8c:76:24",
            "net10": "c2:a8:1c:2c:cd:0b",
            "net11": "9e:1e:67:3c:93:ce",
            "net12": "86:9e:62:5b:bd:ea",
            "net13": "1e:9d:ed:46:e4:15",
            "net14": "9e:c1:7e:3c:0b:99",
            "net15": "86:b5:c4:e8:1a:4a",
            "net16": "2a:f5:c2:27:a0:aa",
            "net17": "36:96:f3:08:2b:a8",
            "net18": "42:10:59:05:c8:65",
            "net19": "86:28:ff:b2:dd:4e",
            "net2": "ae:b7:15:0a:54:78",
            "net20": "e2:d4:cd:df:3f:19",
            "net21": "8e:54:f2:99:01:4d",
            "net22": "5e:ec:81:ba:36:46",
            "net23": "92:fa:56:f3:e8:b6",
            "net3": "f2:68:9b:60:07:ac",
            "net4": "e2:ed:69:80:f7:18",
            "net5": "16:d9:5d:15:66:e1",
            "net6": "52:53:ce:70:9b:8a",
            "net7": "62:d0:c6:fa:41:b6",
            "net8": "3a:85:f2:35:0f:b9",
            "net9": "fa:35:da:dd:78:e3"
        },
        "spine_2_1_9": {
            "net0": "be:f9:95:a1:7d:af",
            "net1": "ce:c2:f9:f0:a6:1d",
            "net10": "86:dd:3a:81:5c:3f",
            "net11": "ae:c7:cf:ed:3e:ca",
            "net12": "f6:e4:d1:f0:47:81",
            "net13": "4a:d5:89:30:97:64",
            "net14": "66:ce:a1:a9:b0:94",
            "net15": "fe:dd:e5:4c:61:5c",
            "net16": "42:06:90:76:d2:d3",
            "net17": "8e:a6:ad:ca:77:a8",
            "net18": "ee:ea:0a:0a:07:a4",
            "net19": "d6:73:75:c4:19:fa",
            "net2": "16:51:cd:ea:9c:44",
            "net20": "a2:47:33:99:96:c8",
            "net21": "3e:54:11:6a:59:04",
            "net22": "ea:2a:02:7d:64:97",
            "net23": "2a:5c:06:4b:bd:4f",
            "net3": "d6:d9:2b:b1:09:d6",
            "net4": "5a:e7:76:b5:94:0f",
            "net5": "1a:27:b3:d7:fe:89",
            "net6": "5a:85:c9:31:de:ef",
            "net7": "8a:3c:46:77:7e:6d",
            "net8": "1e:e5:94:02:8f:32",
            "net9": "a2:af:5a:67:bf:6f"
        },
        "tof_1_2_1": {
            "net0": "2a:a1:b6:2e:1f:05",
            "net1": "fe:5b:3f:63:a0:5d",
            "net10": "76:6d:ec:cf:54:48",
            "net11": "16:4e:19:5c:b1:72",
            "net12": "46:5b:27:03:18:43",
            "net13": "9e:66:97:1a:9b:67",
            "net14": "9a:b2:b5:53:68:2d",
            "net15": "7a:e8:52:23:fa:1a",
            "net16": "06:4f:60:c6:58:79",
            "net17": "3e:b4:41:63:70:1d",
            "net18": "16:7c:87:a9:4f:aa",
            "net19": "42:09:90:31:a3:37",
            "net2": "0a:e8:fd:f9:06:0b",
            "net20": "8a:bf:88:29:3e:6c",
            "net21": "da:09:d1:e4:d9:f2",
            "net22": "f6:43:c9:e7:79:88",
            "net23": "6e:cb:ba:27:44:bf",
            "net3": "4a:5f:be:38:37:0f",
            "net4": "fa:9c:3d:28:7b:2a",
            "net5": "56:21:6d:29:54:17",
            "net6": "42:21:88:66:7a:86",
            "net7": "82:7f:27:d1:d5:4d",
            "net8": "de:23:c2:a8:66:cc",
            "net9": "b6:9d:38:2b:f4:c3"
        },
        "tof_1_2_10": {
            "net0": "8a:d5:5c:5a:ff:84",
            "net1": "5e:93:13:1a:41:cd",
            "net10": "82:41:95:eb:54:ab",
            "net11": "d6:5b:b0:27:ae:98",
            "net12": "d6:e0:78:be:6d:28",
            "net13": "fa:c2:4f:4f:96:51",
            "net14": "b2:43:43:8c:88:9e",
            "net15": "c6:d2:69:cb:09:6b",
            "net16": "56:63:bc:42:37:a5",
            "net17": "72:31:51:13:a2:e5",
            "net18": "42:d9:fc:d3:fa:a8",
            "net19": "72:f8:14:2d:17:59",
            "net2": "92:ad:9e:43:a7:6c",
            "net20": "ae:91:02:4d:00:e6",
            "net21": "6e:37:dc:d6:2c:a0",
            "net22": "be:37:80:1f:5b:be",
            "net23": "3a:eb:48:e4:6d:fc",
            "net3": "02:37:18:15:79:67",
            "net4": "e2:ce:79:22:ed:1a",
            "net5": "82:9f:05:b8:4d:9f",
            "net6": "ce:cc:3d:06:2f:2e",
            "net7": "f6:76:b8:80:16:ef",
            "net8": "ba:00:7f:3b:db:a6",
            "net9": "8a:b3:e2:9c:51:e2"
        },
        "tof_1_2_11": {
            "net0": "de:da:4e:1f:a8:5f",
            "net1": "8a:6f:cf:d0:4a:a4",
            "net10": "ee:e7:69:c7:f0:dd",
            "net11": "ae:01:5c:aa:56:58",
            "net12": "b2:9f:34:ff:1d:80",
            "net13": "4a:05:9b:99:4f:76",
            "net14": "2e:cd:be:14:ba:af",
            "net15": "02:84:04:fb:35:e9",
            "net16": "6a:9e:62:ea:50:f3",
            "net17": "d2:80:b6:44:fe:95",
            "net18": "ba:54:5c:ca:2e:92",
            "net19": "7e:c3:1f:1d:5d:9d",
            "net2": "ca:85:b3:8d:78:ed",
            "net20": "c2:9c:64:72:47:9c",
            "net21": "4e:ad:43:15:c4:99",
            "net22": "ca:7b:ad:2b:05:c4",
            "net23": "a6:90:02:13:e0:7e",
            "net3": "ee:b6:f4:57:28:f6",
            "net4": "d2:83:61:d9:76:11",
            "net5": "aa:d5:6b:47:d9:97",
            "net6": "82:6d:01:f6:a7:15",
            "net7": "f6:31:62:0b:1e:4b",
            "net8": "56:69:21:91:c0:f6",
            "net9": "82:8d:75:25:d0:1c"
        },
        "tof_1_2_12": {
            "net0": "aa:4f:24:9c:4c:0f",
            "net1": "5a:7c:5c:e9:05:3e",
            "net10": "46:dd:84:0c:55:74",
            "net11": "7e:1c:01:97:a4:4e",
            "net12": "da:02:71:22:99:97",
            "net13": "ce:5e:a2:cc:a7:ce",
            "net14": "66:97:8b:e0:4a:45",
            "net15": "aa:17:2f:d2:be:20",
            "net16": "52:ef:7f:3c:0c:81",
            "net17": "6a:c5:b1:00:7f:0b",
            "net18": "62:22:15:7d:5f:6f",
            "net19": "52:46:e0:f7:f4:a5",
            "net2": "2a:5e:a8:6e:fd:6a",
            "net20": "4e:60:bb:ec:7f:6d",
            "net21": "26:2c:2d:62:0f:75",
            "net22": "96:eb:b8:6a:75:d2",
            "net23": "ae:e6:1e:30:aa:fb",
            "net3": "02:d8:e6:d6:8a:d9",
            "net4": "c6:e4:5c:e8:b6:9d",
            "net5": "52:c6:5e:3b:cc:01",
            "net6": "ba:3a:17:21:33:fe",
            "net7": "aa:43:65:0e:75:10",
            "net8": "7a:4b:25:e7:ff:bd",
            "net9": "52:89:26:9e:bf:98"
        },
        "tof_1_2_2": {
            "net0": "6a:a2:cd:2f:97:48",
            "net1": "7e:4f:86:2f:4f:dc",
            "net10": "3a:3c:46:cc:42:02",
            "net11": "3a:36:d1:99:7c:6f",
            "net12": "5a:96:74:1a:dc:df",
            "net13": "16:3c:30:11:62:25",
            "net14": "f6:bb:fc:61:76:c9",
            "net15": "9e:f3:27:99:87:d2",
            "net16": "1e:0e:64:af:88:55",
            "net17": "2a:88:37:9e:87:63",
            "net18": "9a:c3:62:91:69:50",
            "net19": "6e:35:23:c3:74:26",
            "net2": "ee:ed:f8:fe:a0:1c",
            "net20": "a2:50:00:d8:78:7a",
            "net21": "c2:a5:1f:f2:45:1c",
            "net22": "ca:59:43:33:79:b5",
            "net23": "d6:0c:a7:23:db:d9",
            "net3": "e6:e6:87:48:45:26",
            "net4": "4a:1c:b2:20:ae:c7",
            "net5": "6a:bf:26:d3:67:cd",
            "net6": "7e:0f:3c:61:2c:75",
            "net7": "6a:d3:39:62:02:85",
            "net8": "26:ab:4c:16:92:92",
            "net9": "d2:b1:60:8d:a9:03"
        },
        "tof_1_2_3": {
            "net0": "96:05:8d:26:b5:da",
            "net1": "d6:83:f1:1f:3d:85",
            "net10": "6a:d5:87:a0:be:88",
            "net11": "de:5a:30:bc:97:6f",
            "net12": "56:fc:13:91:b6:2f",
            "net13": "ae:3b:a4:34:86:a7",
            "net14": "26:42:b8:1a:79:0f",
            "net15": "b6:18:c5:f5:bc:54",
            "net16": "8a:b4:c8:e6:56:f8",
            "net17": "5e:e0:22:44:f5:4b",
            "net18": "62:6d:b2:66:a2:d2",
            "net19": "6e:21:71:4f:81:17",
            "net2": "36:0c:58:9d:11:50",
            "net20": "6e:86:57:d6:40:7e",
            "net21": "ea:43:d8:fb:83:77",
            "net22": "7a:a3:2b:7f:87:de",
            "net23": "d6:f3:30:c0:42:25",
            "net3": "76:f8:ed:ed:de:ae",
            "net4": "b6:c4:4a:30:7e:65",
            "net5": "b2:e8:f3:0e:60:d5",
            "net6": "3e:3d:c6:9b:c4:c4",
            "net7": "de:e9:d5:99:02:84",
            "net8": "da:22:ea:47:df:13",
            "net9": "4a:2a:b8:45:10:c1"
        },
        "tof_1_2_4": {
            "net0": "72:68:33:97:65:fe",
            "net1": "ea:12:f7:7c:95:60",
            "net10": "62:86:3c:16:89:b6",
            "net11": "d6:40:41:40:41:af",
            "net12": "8a:7f:95:f0:0d:c1",
            "net13": "56:09:34:5e:83:02",
            "net14": "4e:ec:ae:16:5f:7f",
            "net15": "9a:70:54:67:cf:52",
            "net16": "da:7b:dd:f5:01:a5",
            "net17": "9a:c3:f9:82:48:8e",
            "net18": "ea:be:b7:b9:4f:8a",
            "net19": "9e:f8:bf:25:b9:15",
            "net2": "92:08:f6:38:d2:66",
            "net20": "46:cf:0d:30:07:27",
            "net21": "2a:5b:81:9c:92:02",
            "net22": "5a:83:1b:d4:74:3e",
            "net23": "46:84:a0:99:63:ad",
            "net3": "2a:cc:66:ea:d9:1b",
            "net4": "0a:92:72:48:d7:77",
            "net5": "36:07:ef:61:f0:00",
            "net6": "36:e8:c4:d2:1d:be",
            "net7": "a6:9f:d6:f4:69:8e",
            "net8": "66:70:af:02:19:fb",
            "net9": "3a:cb:ba:e0:96:c5"
        },
        "tof_1_2_5": {
            "net0": "86:2b:96:c0:40:df",
            "net1": "c6:28:0e:36:e1:61",
            "net10": "8e:97:dc:48:64:64",
            "net11": "f6:3e:e8:97:ff:e4",
            "net12": "e6:62:b5:f9:f1:80",
            "net13": "3e:27:c4:a0:9c:03",
            "net14": "ea:1e:53:b2:f1:64",
            "net15": "d6:ae:64:9b:d9:c2",
            "net16": "d2:d2:8a:05:33:c0",
            "net17": "9a:4d:6f:5a:7c:20",
            "net18": "6a:b5:2e:15:32:78",
            "net19": "c2:6b:79:b8:4b:df",
            "net2": "4a:32:5c:fe:61:f9",
            "net20": "3e:a5:9c:7b:9a:b8",
            "net21": "c6:53:62:e7:b2:7c",
            "net22": "3e:db:ec:e9:bd:5c",
            "net23": "2e:7a:bf:80:8d:7f",
            "net3": "ae:a1:0d:35:16:d3",
            "net4": "ee:70:6a:60:b3:95",
            "net5": "be:cb:47:8c:d3:cc",
            "net6": "fa:99:f0:69:ae:1c",
            "net7": "ae:79:89:a9:a6:d5",
            "net8": "7a:65:a0:7a:73:88",
            "net9": "e6:62:69:0d:ec:ca"
        },
        "tof_1_2_6": {
            "net0": "ae:df:fd:33:79:56",
            "net1": "56:88:fd:dd:cd:a5",
            "net10": "de:0a:f3:92:47:23",
            "net11": "5a:4b:7c:ca:a2:ad",
            "net12": "7e:cf:55:92:78:58",
            "net13": "26:8d:89:87:bf:5f",
            "net14": "26:00:02:c5:98:64",
            "net15": "06:e1:1e:96:0f:a1",
            "net16": "aa:40:29:09:9e:f6",
            "net17": "22:8d:ac:01:c7:da",
            "net18": "fa:39:ae:cb:c0:9e",
            "net19": "5e:a2:b4:1f:bd:b7",
            "net2": "8a:7f:a4:d6:12:50",
            "net20": "06:8f:bb:a9:16:8b",
            "net21": "c6:c5:26:96:d3:ea",
            "net22": "76:d8:e0:a0:a7:88",
            "net23": "b6:a0:92:1f:2c:0b",
            "net3": "d6:9c:5f:c0:32:23",
            "net4": "c2:ee:51:f5:1b:f3",
            "net5": "c6:20:b2:5e:f2:a0",
            "net6": "3a:87:dd:c8:99:07",
            "net7": "de:0d:59:f0:b9:19",
            "net8": "9a:59:78:65:75:0a",
            "net9": "7a:22:66:65:d4:90"
        },
        "tof_1_2_7": {
            "net0": "0e:5b:58:6e:fe:d0",
            "net1": "0e:b8:3e:95:32:9c",
            "net10": "a2:9a:f6:af:d2:f9",
            "net11": "f6:e4:c3:8f:e5:f9",
            "net12": "86:f3:8b:71:b4:8f",
            "net13": "62:82:58:e0:53:30",
            "net14": "0e:c5:de:43:ab:aa",
            "net15": "12:12:77:e3:e6:1a",
            "net16": "ee:e6:c7:02:e1:2c",
            "net17": "ca:f0:75:4d:41:93",
            "net18": "46:77:d8:a6:db:ab",
            "net19": "6e:81:3c:ef:e8:8a",
            "net2": "f2:e2:a4:a0:80:26",
            "net20": "9e:b2:08:17:8a:72",
            "net21": "66:10:dd:5f:1e:3f",
            "net22": "0e:15:53:03:db:9a",
            "net23": "f6:ed:b3:95:ea:68",
            "net3": "36:ae:70:e8:7c:8b",
            "net4": "c6:4c:8d:86:d0:18",
            "net5": "6a:88:e2:b8:05:3b",
            "net6": "46:97:5b:f6:f2:0c",
            "net7": "b6:7f:ff:f3:19:93",
            "net8": "2e:7d:62:c4:70:4e",
            "net9": "9a:47:a0:aa:72:3b"
        },
        "tof_1_2_8": {
            "net0": "3e:67:bd:8a:67:09",
            "net1": "86:a8:e0:8e:8c:0c",
            "net10": "06:c9:c8:81:14:f8",
            "net11": "96:0a:9a:7f:a6:45",
            "net12": "92:0f:8d:76:f9:3c",
            "net13": "76:7f:1a:47:4c:37",
            "net14": "b2:e8:84:15:62:39",
            "net15": "56:5f:41:31:cb:7d",
            "net16": "36:d5:8d:7b:c7:9b",
            "net17": "c6:0d:f8:a4:8a:ac",
            "net18": "d2:8b:da:62:5e:85",
            "net19": "6a:22:55:1c:6f:3d",
            "net2": "d2:7d:75:8a:6a:2d",
            "net20": "8e:50:46:4c:59:53",
            "net21": "be:af:dc:2b:e0:6d",
            "net22": "a2:f7:97:8d:ef:08",
            "net23": "a2:a1:d0:54:51:50",
            "net3": "82:6d:e7:54:71:bd",
            "net4": "82:bc:52:b7:7c:bf",
            "net5": "9e:66:9b:9c:8f:be",
            "net6": "86:2a:02:10:47:0e",
            "net7": "b6:5f:52:fc:05:63",
            "net8": "c6:3f:21:44:73:14",
            "net9": "62:05:89:0a:8c:62"
        },
        "tof_1_2_9": {
            "net0": "ca:84:5c:91:1a:93",
            "net1": "62:ad:cb:62:4e:73",
            "net10": "c2:87:cb:11:06:df",
            "net11": "de:af:e2:ab:5e:b4",
            "net12": "a2:38:60:8d:8e:4c",
            "net13": "8a:ac:b6:e8:20:97",
            "net14": "ee:1f:8f:78:ce:ff",
            "net15": "12:5c:8e:e1:43:c7",
            "net16": "ea:38:00:7b:4e:19",
            "net17": "3a:1c:d0:88:88:c1",
            "net18": "ce:e3:18:d2:af:f0",
            "net19": "02:2f:06:82:86:b7",
            "net2": "b2:96:c1:10:6b:f7",
            "net20": "d6:57:9d:3b:d9:19",
            "net21": "b6:91:25:c7:7c:7b",
            "net22": "6a:85:57:6e:b6:d3",
            "net23": "22:3f:67:01:09:b2",
            "net3": "ca:08:c9:48:b9:f1",
            "net4": "32:b4:bd:60:2f:20",
            "net5": "16:50:76:c1:9c:63",
            "net6": "22:40:30:4c:7a:0a",
            "net7": "da:02:ac:e4:64:17",
            "net8": "06:1d:50:ba:bd:3d",
            "net9": "02:6f:95:49:9a:f7"
        }
    },
    "failed_machine": "spine_1_1_1",
    "failed_interfaces": [
        "net12"
    ],
    "failure_time": 1616364328.1165676
}