{
    "description": "Scenario 5a: net0 link failure of leaf_1_0_1 with BGP",
    "k_leaf": 12,
    "k_top": 12,
    "redundancy_factor": 12,
    "is_k8s": true,
    "machine_mac_addresses": {
        "leaf_1_0_1": {
            "net0": "9e:de:f1:b3:a5:f5",
            "net1": "96:a5:c6:19:39:32",
            "net10": "3a:2c:3e:fc:a3:79",
            "net11": "62:9b:e2:da:b1:63",
            "net12": "c2:5a:d2:c9:6f:b2",
            "net2": "1e:86:bc:f6:12:c9",
            "net3": "da:2c:8b:01:da:fd",
            "net4": "ca:00:54:b1:99:c8",
            "net5": "92:f0:d1:17:74:a4",
            "net6": "1e:31:29:7e:db:3a",
            "net7": "3e:ee:74:51:67:cb",
            "net8": "ee:e8:0a:f0:06:fb",
            "net9": "6a:b5:35:39:ce:23"
        },
        "leaf_1_0_10": {
            "net0": "2a:0d:57:12:e8:96",
            "net1": "ee:62:b4:4f:4f:02",
            "net10": "e2:dd:08:19:cb:20",
            "net11": "76:4a:26:74:28:29",
            "net12": "a2:79:45:d9:cd:d8",
            "net2": "ae:63:7a:0e:f5:f3",
            "net3": "b2:51:7d:76:d8:4d",
            "net4": "32:48:9e:b9:aa:8b",
            "net5": "66:4c:6b:bb:78:04",
            "net6": "0e:a8:7f:4f:c6:8f",
            "net7": "56:f8:7f:2c:51:9f",
            "net8": "46:15:ef:53:2e:88",
            "net9": "d6:f2:bd:33:33:56"
        },
        "leaf_1_0_11": {
            "net0": "8e:48:4f:82:b0:09",
            "net1": "92:39:48:8f:48:3a",
            "net10": "4a:7e:57:52:54:42",
            "net11": "9a:5e:96:f2:33:e5",
            "net12": "56:14:a0:0d:41:9e",
            "net2": "22:71:bb:c9:a3:37",
            "net3": "f6:a1:02:66:ea:bf",
            "net4": "d2:c6:43:53:3e:ec",
            "net5": "c2:74:c2:7d:53:40",
            "net6": "fa:ec:5e:d6:6c:4c",
            "net7": "9e:60:f8:63:32:9d",
            "net8": "f6:6d:78:a5:1e:f0",
            "net9": "c6:a6:82:7f:be:45"
        },
        "leaf_1_0_12": {
            "net0": "62:49:a9:a9:9f:85",
            "net1": "c2:76:72:04:3f:ff",
            "net10": "6e:fa:25:d3:c4:37",
            "net11": "66:62:ef:ba:ff:5c",
            "net12": "2a:62:e0:0a:bb:e6",
            "net2": "72:da:1d:b1:14:d5",
            "net3": "26:39:f1:e0:cb:49",
            "net4": "9e:62:33:f1:43:eb",
            "net5": "be:e4:81:65:a2:93",
            "net6": "ea:18:ce:a6:20:c9",
            "net7": "c2:34:68:5d:03:5e",
            "net8": "72:45:a4:01:e1:47",
            "net9": "5e:a1:fe:ed:35:b2"
        },
        "leaf_1_0_2": {
            "net0": "de:9f:12:9b:20:86",
            "net1": "36:1f:30:ea:7c:e2",
            "net10": "76:9b:b3:6a:27:fa",
            "net11": "aa:5e:c3:e3:55:bd",
            "net12": "76:c5:06:53:c0:8f",
            "net2": "96:e0:85:05:41:fe",
            "net3": "ce:97:8f:87:b0:01",
            "net4": "a2:b0:3a:ff:ee:a2",
            "net5": "8a:bb:b8:b0:ba:9c",
            "net6": "8e:bc:1f:af:bf:e5",
            "net7": "9e:6e:86:d1:45:f5",
            "net8": "12:57:7f:ef:d5:ea",
            "net9": "ea:85:3e:62:8d:b7"
        },
        "leaf_1_0_3": {
            "net0": "12:b5:7a:33:d3:03",
            "net1": "ea:1b:ba:41:17:a4",
            "net10": "aa:8a:fb:70:93:e0",
            "net11": "32:64:cf:59:25:23",
            "net12": "6e:2d:90:20:80:01",
            "net2": "ba:2a:c9:2f:2f:d2",
            "net3": "ba:c9:5e:1c:45:ad",
            "net4": "06:30:55:53:b7:ea",
            "net5": "a6:7a:ef:02:7b:80",
            "net6": "5e:2f:35:ab:81:6c",
            "net7": "16:67:cf:64:4c:d6",
            "net8": "fe:91:b9:0d:20:1a",
            "net9": "b2:72:98:da:cb:3c"
        },
        "leaf_1_0_4": {
            "net0": "f2:d7:14:4c:8f:1d",
            "net1": "62:3e:2b:a1:c7:9a",
            "net10": "7e:66:09:3e:e8:81",
            "net11": "5e:27:b0:71:82:1e",
            "net12": "7a:52:15:11:a5:0d",
            "net2": "d2:64:5d:f8:e7:f8",
            "net3": "66:a8:63:d9:50:ab",
            "net4": "76:0b:56:28:c5:59",
            "net5": "36:76:f6:52:99:56",
            "net6": "7e:77:9b:31:70:1a",
            "net7": "72:1a:08:38:59:3f",
            "net8": "f6:9d:8f:7d:0f:80",
            "net9": "02:9e:93:e5:52:01"
        },
        "leaf_1_0_5": {
            "net0": "5e:be:34:5a:3e:ea",
            "net1": "16:4e:4a:ae:c8:59",
            "net10": "fe:b3:f9:1e:c0:94",
            "net11": "86:53:f1:e9:44:dd",
            "net12": "76:2e:d6:fe:48:d6",
            "net2": "22:6d:e9:3d:cb:b3",
            "net3": "1a:47:01:9f:71:57",
            "net4": "32:0a:2a:89:6e:90",
            "net5": "4e:30:07:d5:ec:b3",
            "net6": "32:74:2e:2d:93:49",
            "net7": "da:4e:1b:2b:b6:4f",
            "net8": "16:c3:68:a0:26:9f",
            "net9": "f6:8e:a7:b4:b7:44"
        },
        "leaf_1_0_6": {
            "net0": "6a:a6:af:e9:e9:d4",
            "net1": "12:a4:d4:ae:65:8f",
            "net10": "d6:fb:01:31:60:ed",
            "net11": "2e:25:04:a8:c9:4b",
            "net12": "72:a5:9d:c6:53:b0",
            "net2": "4a:c2:cb:3c:5b:fa",
            "net3": "ba:d8:d1:9d:5a:63",
            "net4": "4e:c4:c5:e1:97:ed",
            "net5": "2e:b4:fb:77:f3:57",
            "net6": "b6:c5:88:66:5f:63",
            "net7": "06:28:99:38:5d:be",
            "net8": "5e:86:4e:91:f5:ce",
            "net9": "82:9e:64:98:d0:3d"
        },
        "leaf_1_0_7": {
            "net0": "5e:77:66:c3:5f:15",
            "net1": "de:5f:b0:b1:1c:65",
            "net10": "f2:04:a9:0b:56:ce",
            "net11": "7a:f0:9e:ab:2a:0e",
            "net12": "d2:b3:b3:b7:f2:c5",
            "net2": "66:3c:8f:81:de:26",
            "net3": "0e:4d:f8:96:8c:26",
            "net4": "42:87:26:49:ee:b9",
            "net5": "82:18:01:96:a7:7b",
            "net6": "72:08:87:ef:d6:8a",
            "net7": "2a:db:6f:9c:b1:64",
            "net8": "6a:2e:af:cf:4f:82",
            "net9": "8e:89:17:7d:88:f6"
        },
        "leaf_1_0_8": {
            "net0": "96:a2:5d:8e:98:e5",
            "net1": "6e:9c:a5:f2:23:aa",
            "net10": "0a:3c:ee:95:14:d8",
            "net11": "ea:cd:b5:dc:91:eb",
            "net12": "2e:67:1d:e0:45:94",
            "net2": "9e:f0:f6:70:40:f7",
            "net3": "16:dd:d2:e3:96:c0",
            "net4": "f2:b4:2d:6a:23:5e",
            "net5": "3e:0e:8d:00:13:7e",
            "net6": "3e:cf:c1:67:54:e2",
            "net7": "5a:7a:9b:fd:c8:2b",
            "net8": "fa:cd:e2:35:0a:6b",
            "net9": "9e:b1:96:9c:7a:51"
        },
        "leaf_1_0_9": {
            "net0": "be:1b:2c:18:0c:ca",
            "net1": "9a:68:99:a8:f3:3d",
            "net10": "da:c7:5d:ed:48:bc",
            "net11": "9a:e4:aa:ca:37:01",
            "net12": "5a:5a:8c:9a:08:76",
            "net2": "32:f7:31:50:bf:ff",
            "net3": "3e:de:16:43:46:56",
            "net4": "7e:56:a9:cc:3a:1a",
            "net5": "76:52:c7:5e:60:78",
            "net6": "2e:9f:b5:b8:51:69",
            "net7": "1a:1a:b8:25:bc:8a",
            "net8": "06:7f:9e:de:4d:52",
            "net9": "c6:25:cb:ac:50:b5"
        },
        "leaf_2_0_1": {
            "net0": "8a:26:96:ee:48:a0",
            "net1": "8e:7f:66:06:e5:7e",
            "net10": "ea:dc:ab:ad:31:f7",
            "net11": "c2:55:38:c4:dd:0c",
            "net12": "26:ac:ff:ac:2f:b1",
            "net2": "e6:91:1a:c0:9f:7d",
            "net3": "a2:c7:d9:78:50:27",
            "net4": "62:18:1f:4d:6e:2c",
            "net5": "3a:f7:55:0f:fc:f6",
            "net6": "c2:37:25:3e:75:c6",
            "net7": "36:4b:9e:82:4c:d0",
            "net8": "ba:9d:28:65:d3:8e",
            "net9": "86:31:cb:7f:3e:8b"
        },
        "leaf_2_0_10": {
            "net0": "72:26:2b:ea:95:37",
            "net1": "92:65:a1:cc:e9:02",
            "net10": "6e:30:a3:a1:3d:4a",
            "net11": "f6:a8:f4:d8:70:e4",
            "net12": "2e:1c:58:3c:2a:15",
            "net2": "be:b9:6b:a6:92:51",
            "net3": "a6:f9:d0:db:bb:48",
            "net4": "4a:92:f9:e8:a7:5b",
            "net5": "12:82:e3:b1:7f:9c",
            "net6": "da:0c:e6:5d:c9:e3",
            "net7": "f6:c9:74:b3:39:b8",
            "net8": "5e:c0:2c:b3:75:67",
            "net9": "92:b1:42:d1:68:19"
        },
        "leaf_2_0_11": {
            "net0": "8a:27:d8:fc:08:63",
            "net1": "62:2b:0e:9f:57:be",
            "net10": "c2:2d:a7:6e:43:41",
            "net11": "ba:77:bf:4c:8d:6b",
            "net12": "a6:b4:f8:98:5b:f3",
            "net2": "de:4d:c6:25:74:7b",
            "net3": "6a:54:a0:a8:3d:61",
            "net4": "2e:f9:16:a2:37:7a",
            "net5": "66:51:c9:d7:a6:28",
            "net6": "3a:c1:6b:b7:15:d2",
            "net7": "0e:45:5e:47:5f:88",
            "net8": "d6:ce:ec:a0:a5:c5",
            "net9": "7e:81:b1:6b:95:a6"
        },
        "leaf_2_0_12": {
            "net0": "5a:ee:09:cb:43:35",
            "net1": "56:3b:c7:e4:4a:6f",
            "net10": "76:c7:9b:3d:be:46",
            "net11": "e2:3c:3c:de:59:35",
            "net12": "b6:00:bf:aa:f0:52",
            "net2": "ea:13:04:2d:7e:fc",
            "net3": "a2:17:ce:c9:8d:a3",
            "net4": "d6:1e:6b:0c:04:bf",
            "net5": "62:99:0f:0e:83:2a",
            "net6": "2a:f4:b0:8c:75:8f",
            "net7": "fe:2b:78:7f:6f:6c",
            "net8": "ba:49:31:5e:ab:65",
            "net9": "6a:03:97:20:ca:8f"
        },
        "leaf_2_0_2": {
            "net0": "ea:9c:37:ae:e0:0f",
            "net1": "d2:a8:ba:4f:0a:83",
            "net10": "d6:54:1f:b1:64:5f",
            "net11": "a6:a8:9c:27:d4:58",
            "net12": "8a:f6:54:99:9e:39",
            "net2": "da:b2:1a:81:2b:2c",
            "net3": "a6:71:1e:38:84:70",
            "net4": "c6:c4:84:60:14:27",
            "net5": "46:19:a3:d0:c7:ee",
            "net6": "f6:d2:30:16:16:df",
            "net7": "ea:c2:43:19:db:8b",
            "net8": "e6:0b:7a:17:2c:38",
            "net9": "ca:16:b1:7a:0c:78"
        },
        "leaf_2_0_3": {
            "net0": "52:eb:6a:42:f2:4a",
            "net1": "52:35:6e:89:28:df",
            "net10": "9e:fb:65:60:3f:64",
            "net11": "1e:8e:68:6e:61:d0",
            "net12": "fa:f6:66:9e:0e:c7",
            "net2": "22:8b:32:76:b6:91",
            "net3": "16:8e:89:9a:f8:f4",
            "net4": "9e:3e:69:60:cc:27",
            "net5": "aa:ec:46:67:8f:d3",
            "net6": "ba:32:b1:86:36:19",
            "net7": "72:ff:b3:c0:37:7d",
            "net8": "46:c0:77:99:d9:0d",
            "net9": "5e:56:83:e4:94:f2"
        },
        "leaf_2_0_4": {
            "net0": "0e:b7:79:8e:16:b2",
            "net1": "e6:3f:65:9d:17:30",
            "net10": "2e:bf:6c:28:ec:54",
            "net11": "02:eb:0a:1a:10:70",
            "net12": "7e:a3:f3:ed:83:fa",
            "net2": "fa:8c:62:d8:e2:87",
            "net3": "2a:fc:7f:a6:3d:71",
            "net4": "5a:59:55:dc:98:b7",
            "net5": "ee:ae:35:62:dd:20",
            "net6": "96:ad:94:02:fa:b5",
            "net7": "92:4f:e0:c5:66:75",
            "net8": "86:9a:4a:0f:2a:85",
            "net9": "e6:59:ab:66:47:6b"
        },
        "leaf_2_0_5": {
            "net0": "1a:c1:1d:f8:87:42",
            "net1": "1e:cf:c5:8b:13:53",
            "net10": "2e:e3:73:60:dc:c9",
            "net11": "3e:2d:bb:4c:9a:43",
            "net12": "32:92:b6:30:a0:2d",
            "net2": "d2:a2:6e:96:33:73",
            "net3": "7e:0d:72:d4:b0:01",
            "net4": "26:59:4f:5d:a2:24",
            "net5": "d6:d7:42:7f:cd:dd",
            "net6": "c6:9f:2e:8f:c1:35",
            "net7": "5e:e7:32:e0:0f:3c",
            "net8": "56:80:25:44:c1:f8",
            "net9": "3e:ea:4a:88:e8:da"
        },
        "leaf_2_0_6": {
            "net0": "22:4c:b9:7f:ca:c9",
            "net1": "fe:7d:79:5c:64:7c",
            "net10": "b2:de:31:81:e2:b5",
            "net11": "56:dd:61:25:f1:46",
            "net12": "06:b2:00:36:8f:30",
            "net2": "26:7c:c8:2b:90:59",
            "net3": "b2:98:df:72:34:61",
            "net4": "c6:35:84:88:8d:8e",
            "net5": "02:17:fa:c3:fc:2c",
            "net6": "ca:67:09:ad:de:13",
            "net7": "1e:3d:d7:9e:14:25",
            "net8": "82:af:87:f1:c3:b5",
            "net9": "76:38:2c:de:8f:f1"
        },
        "leaf_2_0_7": {
            "net0": "0e:1a:dd:bb:32:24",
            "net1": "12:41:46:da:1b:db",
            "net10": "ca:60:75:e7:61:a6",
            "net11": "ea:8d:9b:f9:13:0c",
            "net12": "a6:70:aa:0f:cb:6c",
            "net2": "da:ff:23:d8:4c:71",
            "net3": "d2:3f:81:88:9a:26",
            "net4": "36:82:3a:b1:0b:f5",
            "net5": "62:b0:2d:fc:32:3a",
            "net6": "fe:b5:6d:6f:ce:d1",
            "net7": "12:7d:29:03:92:ef",
            "net8": "22:7a:6b:52:80:09",
            "net9": "c6:7b:ff:a5:3e:0a"
        },
        "leaf_2_0_8": {
            "net0": "62:c3:db:9a:25:04",
            "net1": "66:f6:b1:d1:55:22",
            "net10": "62:2b:a9:8f:4f:96",
            "net11": "aa:fd:2d:11:f9:6d",
            "net12": "42:a6:24:56:34:a4",
            "net2": "f2:be:85:d7:5a:31",
            "net3": "3e:d5:3b:c1:33:fc",
            "net4": "9a:cf:db:76:46:d7",
            "net5": "ca:17:81:1f:b9:7b",
            "net6": "26:24:5e:f3:f3:ec",
            "net7": "8e:7e:67:0f:9b:de",
            "net8": "76:cf:97:a0:d6:51",
            "net9": "16:c6:1b:e8:37:79"
        },
        "leaf_2_0_9": {
            "net0": "56:e5:48:5a:ec:4c",
            "net1": "ca:3f:ca:53:74:eb",
            "net10": "1a:8e:11:68:c5:70",
            "net11": "ee:27:0c:c8:f3:3e",
            "net12": "3a:ff:67:aa:81:c8",
            "net2": "7e:8d:27:4c:d7:93",
            "net3": "b2:20:95:9b:9e:3e",
            "net4": "72:e0:a5:0c:89:9d",
            "net5": "96:2e:aa:50:db:b1",
            "net6": "fe:55:e8:e6:5a:23",
            "net7": "aa:60:cd:9f:bb:85",
            "net8": "0a:b5:11:90:b8:ae",
            "net9": "f6:a8:41:b2:00:f1"
        },
        "spine_1_1_1": {
            "net0": "f2:c6:22:9e:53:6b",
            "net1": "92:7e:8d:da:87:9c",
            "net10": "36:a0:0c:6b:b5:46",
            "net11": "32:5c:3c:d9:0f:81",
            "net12": "02:be:f7:88:d6:1e",
            "net13": "de:d7:45:9c:e6:a6",
            "net14": "4e:a5:5c:79:18:f2",
            "net15": "2e:35:cb:21:0d:2a",
            "net16": "12:7b:96:30:86:ec",
            "net17": "92:9c:34:10:15:21",
            "net18": "2a:98:f1:8a:dd:21",
            "net19": "82:24:48:3d:39:e8",
            "net2": "6e:73:91:cc:22:ba",
            "net20": "7e:6a:09:a0:5a:8b",
            "net21": "fa:b8:90:f9:ab:68",
            "net22": "32:31:f1:33:fd:b5",
            "net23": "5e:75:22:27:a4:27",
            "net3": "c2:13:23:e5:f5:83",
            "net4": "86:15:eb:f8:4c:aa",
            "net5": "2e:60:69:08:a6:29",
            "net6": "d6:ef:60:84:20:0e",
            "net7": "a2:bf:83:7c:08:27",
            "net8": "a2:de:19:94:06:50",
            "net9": "02:0e:ee:6b:9a:b7"
        },
        "spine_1_1_10": {
            "net0": "6e:1c:2a:ab:25:41",
            "net1": "0a:d5:09:70:94:02",
            "net10": "52:8a:eb:c5:b4:1d",
            "net11": "26:fe:06:bd:ef:22",
            "net12": "ca:52:b8:20:e9:a2",
            "net13": "72:d3:3c:c3:f0:73",
            "net14": "06:e4:8c:a9:d3:e8",
            "net15": "be:ed:28:ad:07:c7",
            "net16": "f6:bb:46:1d:49:e8",
            "net17": "a2:d3:05:8c:86:db",
            "net18": "da:57:ac:a5:49:86",
            "net19": "5e:78:46:1f:db:11",
            "net2": "e2:25:a0:53:2a:c3",
            "net20": "ce:50:9c:6a:cb:bf",
            "net21": "72:25:39:76:22:de",
            "net22": "46:9e:35:94:ec:9c",
            "net23": "b6:f3:14:d1:e2:19",
            "net3": "26:5e:c7:e0:7f:0f",
            "net4": "aa:f8:74:dc:18:15",
            "net5": "76:8a:17:b1:22:69",
            "net6": "8a:65:64:d4:11:ed",
            "net7": "1e:0b:fd:29:b8:b2",
            "net8": "a2:44:7d:a7:ea:f7",
            "net9": "9a:b1:9f:b4:1b:72"
        },
        "spine_1_1_11": {
            "net0": "7e:34:d6:0b:67:01",
            "net1": "ea:eb:50:7f:ed:c2",
            "net10": "d2:bc:68:97:38:f1",
            "net11": "16:ec:43:af:04:3f",
            "net12": "52:53:a6:b0:55:42",
            "net13": "de:1e:b7:cd:dc:c1",
            "net14": "a6:3b:35:56:43:68",
            "net15": "d2:35:23:b9:a0:d2",
            "net16": "3e:08:b8:cc:fe:f1",
            "net17": "d2:e7:76:2b:f3:35",
            "net18": "8a:8f:14:ce:df:c5",
            "net19": "ee:3a:c4:bf:74:9e",
            "net2": "8a:81:d3:b9:4b:fe",
            "net20": "76:af:ad:b9:65:a8",
            "net21": "d2:5f:e5:9c:7f:61",
            "net22": "d6:e7:bc:3c:83:66",
            "net23": "f6:64:01:2e:7d:8d",
            "net3": "aa:b9:66:2f:34:af",
            "net4": "be:64:41:1c:d1:29",
            "net5": "c6:44:39:e8:44:10",
            "net6": "aa:a0:8c:64:ee:43",
            "net7": "fa:bf:99:8a:16:cc",
            "net8": "c6:f1:be:80:75:a7",
            "net9": "ba:5e:b4:52:65:b0"
        },
        "spine_1_1_12": {
            "net0": "f2:b5:be:69:b1:83",
            "net1": "62:21:33:1c:05:01",
            "net10": "c2:b9:a2:dd:76:8c",
            "net11": "f6:57:a0:d7:d3:92",
            "net12": "c2:df:88:62:7b:27",
            "net13": "36:16:ba:fe:9b:6b",
            "net14": "9e:c7:00:43:d4:84",
            "net15": "32:43:8e:91:62:d9",
            "net16": "ea:e4:a7:a6:5c:2e",
            "net17": "56:40:21:a7:e7:d3",
            "net18": "42:34:31:7e:50:ea",
            "net19": "16:8a:d3:40:55:cb",
            "net2": "12:45:93:3e:61:8a",
            "net20": "9e:bd:fd:e0:08:00",
            "net21": "ea:d8:98:ca:55:3b",
            "net22": "66:38:2f:8d:5b:53",
            "net23": "72:ab:b1:0a:d3:19",
            "net3": "2a:0f:f7:4f:3a:3a",
            "net4": "7e:17:6f:ee:01:66",
            "net5": "aa:04:a7:a0:ed:5f",
            "net6": "f2:24:13:79:9b:1b",
            "net7": "1e:d7:82:53:6c:ef",
            "net8": "66:b3:c1:b4:db:72",
            "net9": "06:72:a0:f4:b0:ba"
        },
        "spine_1_1_2": {
            "net0": "16:92:09:6a:ac:e0",
            "net1": "52:a5:82:37:fc:e3",
            "net10": "a6:3a:7a:21:0f:b3",
            "net11": "ba:41:48:2e:da:b3",
            "net12": "72:f4:55:92:fe:76",
            "net13": "ba:a5:60:e0:82:a9",
            "net14": "1e:6f:99:4a:7c:d4",
            "net15": "86:1e:8d:7e:ca:91",
            "net16": "8e:65:56:a9:7c:79",
            "net17": "7a:a4:b8:00:c8:11",
            "net18": "46:08:eb:b2:e5:58",
            "net19": "0e:04:82:49:c0:eb",
            "net2": "86:8d:a4:54:36:ef",
            "net20": "e2:22:09:f2:3b:d5",
            "net21": "f2:7d:00:6d:6f:73",
            "net22": "36:45:05:12:e7:a4",
            "net23": "ce:d7:09:70:35:5b",
            "net3": "da:df:c2:a2:6c:af",
            "net4": "f2:a8:5e:30:79:c0",
            "net5": "5a:0b:17:b3:fc:c2",
            "net6": "ca:4d:a1:28:17:69",
            "net7": "2a:f3:94:6d:3f:20",
            "net8": "ca:0f:6b:66:1d:77",
            "net9": "f2:23:9a:f0:31:a7"
        },
        "spine_1_1_3": {
            "net0": "5a:a6:05:bb:df:81",
            "net1": "52:6b:b2:ea:21:48",
            "net10": "c6:5f:49:94:53:43",
            "net11": "5e:1e:92:0e:4c:6a",
            "net12": "ea:86:de:81:bf:bb",
            "net13": "d2:27:88:d9:49:ea",
            "net14": "6e:c8:1e:b5:ec:17",
            "net15": "aa:60:bd:13:99:79",
            "net16": "52:5f:aa:67:50:0a",
            "net17": "42:3f:41:c1:59:d3",
            "net18": "ae:84:58:7d:03:0b",
            "net19": "16:68:11:86:f3:34",
            "net2": "aa:7a:43:51:a1:94",
            "net20": "de:0d:23:38:5a:51",
            "net21": "be:29:12:b5:b4:76",
            "net22": "32:6a:1f:69:ed:2a",
            "net23": "06:2b:a1:26:09:81",
            "net3": "e6:f9:37:2e:57:89",
            "net4": "ea:b7:1d:53:e3:b1",
            "net5": "6e:16:62:e5:ea:7b",
            "net6": "9a:85:5d:dc:b3:78",
            "net7": "a6:12:10:30:ec:32",
            "net8": "ea:23:3c:e8:9a:99",
            "net9": "8a:36:36:da:72:80"
        },
        "spine_1_1_4": {
            "net0": "3a:05:58:df:d3:85",
            "net1": "26:89:0e:b0:0d:f6",
            "net10": "82:33:93:cb:35:cc",
            "net11": "8a:32:a7:de:66:32",
            "net12": "4e:f4:0e:87:1b:4b",
            "net13": "66:42:59:08:37:c8",
            "net14": "da:8e:77:af:c5:42",
            "net15": "62:15:03:d4:e2:23",
            "net16": "9a:42:04:f3:48:dd",
            "net17": "9e:db:ea:1e:c7:ae",
            "net18": "52:4e:a9:e3:7a:ab",
            "net19": "3e:de:d5:43:a4:95",
            "net2": "36:70:ef:1a:77:60",
            "net20": "c6:f1:b4:30:78:20",
            "net21": "2e:aa:c0:89:d1:e8",
            "net22": "42:83:a8:7f:1f:d5",
            "net23": "7e:60:4e:51:3f:e6",
            "net3": "c6:e5:69:72:e2:b8",
            "net4": "32:80:93:2f:79:7c",
            "net5": "d2:6a:b7:df:9d:3d",
            "net6": "be:48:5d:e6:21:1a",
            "net7": "2e:18:ae:b6:27:2a",
            "net8": "da:1e:78:e6:39:d5",
            "net9": "c2:66:88:18:5a:ee"
        },
        "spine_1_1_5": {
            "net0": "da:25:1a:7d:76:55",
            "net1": "3a:8c:55:75:6c:ed",
            "net10": "22:c3:16:6d:ce:76",
            "net11": "46:5f:63:74:63:b5",
            "net12": "aa:64:4a:65:c0:8f",
            "net13": "86:40:dd:fe:fe:6c",
            "net14": "ba:f3:4f:90:c7:59",
            "net15": "9e:fc:06:06:1b:92",
            "net16": "da:06:5f:de:94:83",
            "net17": "f6:35:18:2b:24:b9",
            "net18": "32:fc:68:f0:4b:64",
            "net19": "76:ab:6f:93:67:74",
            "net2": "62:b0:0a:fc:0b:38",
            "net20": "2e:b2:15:7f:7b:fe",
            "net21": "2e:dd:1f:14:57:80",
            "net22": "16:6d:f1:3a:2e:52",
            "net23": "f2:bd:e4:c9:28:db",
            "net3": "6a:a8:5e:86:b3:ce",
            "net4": "4e:aa:e7:64:56:9a",
            "net5": "fe:9b:f2:20:d6:ce",
            "net6": "d6:15:e7:bc:55:7a",
            "net7": "3a:0b:2c:94:57:ff",
            "net8": "e6:c4:3d:f1:3e:b9",
            "net9": "42:ee:ec:20:82:41"
        },
        "spine_1_1_6": {
            "net0": "06:6c:b9:a0:b0:12",
            "net1": "5e:d2:78:aa:2d:24",
            "net10": "92:42:3c:fd:51:2a",
            "net11": "c6:77:93:5e:a4:e7",
            "net12": "c6:0b:e3:f7:95:e6",
            "net13": "16:57:b1:50:8f:82",
            "net14": "8e:f3:87:a8:4d:4e",
            "net15": "32:7d:b9:ab:60:53",
            "net16": "ae:ba:df:8d:e0:03",
            "net17": "62:b4:1b:e6:de:64",
            "net18": "8e:f2:e0:4f:d2:b8",
            "net19": "72:d5:8f:70:79:b8",
            "net2": "5e:de:91:a9:48:26",
            "net20": "a6:b4:b7:a4:cf:70",
            "net21": "3a:c9:68:2e:17:1f",
            "net22": "aa:e4:b3:3f:08:a2",
            "net23": "f2:e0:01:10:09:b6",
            "net3": "92:aa:23:3f:07:cd",
            "net4": "9a:93:b2:f5:cc:82",
            "net5": "2a:5d:d1:2a:0a:5f",
            "net6": "de:c9:b5:41:70:84",
            "net7": "e6:6c:f8:7f:a0:f5",
            "net8": "e6:1e:58:a3:f2:cd",
            "net9": "f2:46:2d:87:86:39"
        },
        "spine_1_1_7": {
            "net0": "06:27:85:5e:fa:fb",
            "net1": "6a:0a:04:b8:0e:27",
            "net10": "c6:b6:d8:a1:1e:d3",
            "net11": "36:e0:98:b8:b6:39",
            "net12": "96:b5:61:9b:28:25",
            "net13": "c6:c4:4f:b5:8e:d9",
            "net14": "7e:ad:31:8c:e5:93",
            "net15": "52:f1:b5:c0:50:85",
            "net16": "9a:97:5a:2b:5d:08",
            "net17": "da:84:0e:e5:1a:61",
            "net18": "36:a9:7e:7d:bf:3f",
            "net19": "52:b1:27:88:4e:9b",
            "net2": "0a:75:b9:43:d5:a2",
            "net20": "82:f6:3e:85:32:4f",
            "net21": "b2:3d:83:b6:0c:a7",
            "net22": "12:ba:33:f6:f5:8b",
            "net23": "4a:56:f8:71:c0:35",
            "net3": "7a:7b:af:ca:05:3d",
            "net4": "62:3d:46:14:62:84",
            "net5": "3a:6c:61:03:3e:91",
            "net6": "82:91:42:51:b5:6e",
            "net7": "be:fd:40:56:f6:d5",
            "net8": "ea:55:5a:c2:83:fc",
            "net9": "76:e7:5b:a8:5d:a4"
        },
        "spine_1_1_8": {
            "net0": "7a:5d:32:cd:76:0d",
            "net1": "c2:86:bc:b8:2a:6c",
            "net10": "4e:09:10:9b:b1:bf",
            "net11": "9a:01:78:70:c2:4d",
            "net12": "9e:b4:e6:e0:25:07",
            "net13": "c6:76:fc:25:e9:32",
            "net14": "6e:9f:a1:66:4a:5d",
            "net15": "96:66:5f:13:9d:a1",
            "net16": "ee:d4:d8:0a:37:51",
            "net17": "aa:a9:ea:07:44:4f",
            "net18": "3e:52:38:0d:9b:72",
            "net19": "8e:34:7b:50:03:1d",
            "net2": "0a:a5:f8:90:27:6e",
            "net20": "6a:dc:04:fb:35:f7",
            "net21": "0e:28:d0:0c:e1:8d",
            "net22": "be:4b:2a:9b:64:1f",
            "net23": "f2:b2:3a:96:72:23",
            "net3": "ea:09:bb:eb:b4:e6",
            "net4": "66:b2:97:62:c5:d3",
            "net5": "52:27:25:1f:91:cc",
            "net6": "1a:c1:a6:fb:4a:90",
            "net7": "02:c6:97:77:d6:9e",
            "net8": "86:87:d7:ef:9b:ae",
            "net9": "ea:88:24:18:15:0f"
        },
        "spine_1_1_9": {
            "net0": "06:8d:66:cc:20:6a",
            "net1": "36:31:9c:1d:cd:a1",
            "net10": "0e:dc:4c:17:05:0f",
            "net11": "2a:8a:c3:57:6e:08",
            "net12": "06:f8:d1:1e:43:a4",
            "net13": "6e:bc:ea:8e:f2:67",
            "net14": "2e:0b:06:b9:65:7a",
            "net15": "ae:fd:62:45:b2:be",
            "net16": "c2:b6:bf:ad:31:74",
            "net17": "02:19:27:54:f2:8b",
            "net18": "7e:3d:26:52:f8:ee",
            "net19": "be:10:74:6b:35:33",
            "net2": "56:89:12:cc:8d:85",
            "net20": "9e:80:5b:60:76:e3",
            "net21": "2e:af:f8:26:1e:81",
            "net22": "e6:57:af:4a:13:33",
            "net23": "5e:02:ad:af:75:e9",
            "net3": "d6:b8:68:b5:e4:4c",
            "net4": "36:0c:ac:16:b6:4b",
            "net5": "de:64:d8:6f:27:73",
            "net6": "f2:93:67:ea:e8:5a",
            "net7": "3e:00:0f:cf:10:8b",
            "net8": "16:83:93:b6:11:e3",
            "net9": "96:63:0a:27:82:d6"
        },
        "spine_2_1_1": {
            "net0": "06:a7:b4:33:b5:b3",
            "net1": "9a:b5:bd:c0:84:64",
            "net10": "5a:5e:1d:82:b4:22",
            "net11": "92:31:32:40:30:d9",
            "net12": "36:da:36:7b:e3:4d",
            "net13": "72:c2:c8:a9:c6:a2",
            "net14": "1a:76:b2:ea:80:e4",
            "net15": "ee:f6:f4:cc:c3:9d",
            "net16": "7a:07:b5:21:cc:1c",
            "net17": "02:9f:8d:0d:45:76",
            "net18": "d6:0a:ba:1a:eb:07",
            "net19": "82:1b:0e:10:39:3f",
            "net2": "a6:bb:80:5e:ae:06",
            "net20": "c2:34:1c:e1:77:24",
            "net21": "42:89:b5:f4:41:c5",
            "net22": "f2:3f:d0:4b:34:a5",
            "net23": "ce:72:56:4c:ff:29",
            "net3": "7e:f3:86:f1:49:ee",
            "net4": "8a:43:68:2b:75:af",
            "net5": "c2:be:d0:f6:3b:53",
            "net6": "9e:67:cf:84:12:29",
            "net7": "62:30:d7:6f:55:9d",
            "net8": "9e:7b:a3:bd:c7:fe",
            "net9": "e6:cd:90:c5:21:d7"
        },
        "spine_2_1_10": {
            "net0": "4a:ac:32:76:39:9a",
            "net1": "3a:c5:6c:bf:88:76",
            "net10": "6e:3b:24:0f:6e:71",
            "net11": "52:77:28:d5:05:2f",
            "net12": "26:c3:bd:6e:35:c3",
            "net13": "e2:36:c3:2d:a5:79",
            "net14": "4e:9c:40:3c:e4:db",
            "net15": "36:e7:a4:b0:37:6e",
            "net16": "3a:d9:e9:ff:bf:a7",
            "net17": "62:56:59:50:70:c7",
            "net18": "d6:56:9b:35:f3:cb",
            "net19": "c2:0e:f4:f3:47:e1",
            "net2": "96:81:36:e8:05:2a",
            "net20": "36:3e:df:3d:9e:a4",
            "net21": "da:71:0a:da:a0:d3",
            "net22": "92:34:1d:ce:1c:34",
            "net23": "62:e3:fc:ac:74:9c",
            "net3": "da:e0:e7:b4:51:fe",
            "net4": "de:7b:31:9a:76:94",
            "net5": "a2:e4:32:44:9b:5b",
            "net6": "ba:59:31:53:6c:71",
            "net7": "ca:6c:fe:5c:be:97",
            "net8": "f2:0f:ff:cf:fa:e5",
            "net9": "8a:5e:83:35:ce:17"
        },
        "spine_2_1_11": {
            "net0": "ba:e5:be:13:52:28",
            "net1": "be:a1:f2:1e:99:69",
            "net10": "d6:d0:1a:4b:92:97",
            "net11": "5e:e4:c9:e8:b6:36",
            "net12": "72:66:a2:02:cf:99",
            "net13": "12:67:19:8c:d6:08",
            "net14": "32:19:89:23:4a:d8",
            "net15": "d6:25:c5:e5:e2:f9",
            "net16": "86:7d:03:74:b6:40",
            "net17": "e6:e7:15:71:39:a9",
            "net18": "5e:d4:59:96:41:18",
            "net19": "82:0d:25:df:80:be",
            "net2": "6a:11:e6:95:83:e8",
            "net20": "8e:66:9b:de:16:2b",
            "net21": "96:a9:4f:24:d2:a9",
            "net22": "76:9f:b5:0a:04:6f",
            "net23": "fe:ce:d2:04:a5:f1",
            "net3": "ce:be:e6:30:fe:78",
            "net4": "9a:de:14:1e:9b:40",
            "net5": "4e:1a:2a:a3:24:00",
            "net6": "9e:b1:2f:a1:4c:aa",
            "net7": "46:8a:ec:0e:26:ea",
            "net8": "ae:5c:29:1f:45:ad",
            "net9": "36:b7:62:6b:c9:0c"
        },
        "spine_2_1_12": {
            "net0": "d6:46:c5:41:c0:32",
            "net1": "62:02:1e:e3:ee:36",
            "net10": "96:c1:fe:43:19:1d",
            "net11": "0e:a3:92:6c:8e:ab",
            "net12": "c2:d8:92:cc:d8:34",
            "net13": "3e:36:58:85:33:bd",
            "net14": "ca:1c:c3:50:1c:d6",
            "net15": "f2:9a:b5:47:98:35",
            "net16": "d6:9e:c1:24:c8:56",
            "net17": "de:10:c5:c4:af:58",
            "net18": "46:0b:9c:df:59:dd",
            "net19": "1e:9d:ba:36:be:39",
            "net2": "56:06:10:a3:7a:c0",
            "net20": "f2:ff:91:ae:a8:a4",
            "net21": "b2:10:d2:f1:3c:ff",
            "net22": "0a:9f:19:1b:f0:db",
            "net23": "f6:55:43:bd:5d:56",
            "net3": "6a:49:6b:e1:ae:13",
            "net4": "56:55:60:92:a2:e1",
            "net5": "26:e5:cf:ca:57:72",
            "net6": "2a:a3:60:2d:41:df",
            "net7": "1e:19:e1:6a:45:c4",
            "net8": "06:3b:3d:b2:4c:dc",
            "net9": "0a:92:0d:03:92:bf"
        },
        "spine_2_1_2": {
            "net0": "ce:70:79:6b:4b:c5",
            "net1": "2e:49:d1:bf:25:9a",
            "net10": "da:90:a8:95:46:2e",
            "net11": "46:2b:ab:b5:08:93",
            "net12": "2a:7d:df:2a:ff:79",
            "net13": "be:7d:68:25:28:8c",
            "net14": "ca:4d:ea:1d:31:73",
            "net15": "5e:a8:90:38:bc:45",
            "net16": "12:cc:2c:66:24:79",
            "net17": "22:72:ce:2b:b9:ba",
            "net18": "8e:f8:33:1f:df:bc",
            "net19": "9e:f0:12:f6:e3:c9",
            "net2": "a2:ee:6a:19:04:a2",
            "net20": "ee:f1:b1:eb:3b:61",
            "net21": "16:c6:90:4e:09:c5",
            "net22": "3a:b7:fc:15:0e:71",
            "net23": "2e:2d:9d:c2:07:43",
            "net3": "26:7b:d4:76:a0:2f",
            "net4": "92:98:c4:69:aa:b2",
            "net5": "d2:05:c1:2b:d5:2f",
            "net6": "26:f1:ce:77:16:b6",
            "net7": "7a:4a:63:59:9a:71",
            "net8": "3a:8a:32:47:2e:11",
            "net9": "0a:58:98:65:95:c6"
        },
        "spine_2_1_3": {
            "net0": "92:4b:f9:2a:ae:37",
            "net1": "72:28:ca:10:6b:70",
            "net10": "d6:a4:29:55:fa:03",
            "net11": "46:1f:02:dc:2d:2a",
            "net12": "c6:e0:2e:53:79:65",
            "net13": "4e:f6:a0:90:df:47",
            "net14": "c2:ef:b8:80:3d:15",
            "net15": "e2:fb:d9:22:19:79",
            "net16": "02:9f:24:3c:a0:fa",
            "net17": "a6:ea:39:03:e9:82",
            "net18": "a6:46:04:2f:60:08",
            "net19": "92:7a:dd:93:72:0f",
            "net2": "a6:cd:5e:a2:6a:ad",
            "net20": "a6:1b:13:bf:14:f4",
            "net21": "b2:d5:b1:06:c7:8f",
            "net22": "96:bd:8c:d9:af:dc",
            "net23": "fa:91:35:4d:1d:d1",
            "net3": "be:ce:de:71:65:3a",
            "net4": "4e:76:f2:ee:b4:54",
            "net5": "46:81:4c:17:83:d6",
            "net6": "12:a2:ed:3c:ac:0a",
            "net7": "ba:95:03:49:95:29",
            "net8": "72:0e:ca:6a:cc:77",
            "net9": "fa:f3:38:30:c0:8b"
        },
        "spine_2_1_4": {
            "net0": "02:e7:71:b8:b4:04",
            "net1": "ca:16:5e:d3:f4:c7",
            "net10": "42:e0:99:ec:3d:ac",
            "net11": "b6:fc:a5:39:8f:9b",
            "net12": "3e:14:8d:19:94:82",
            "net13": "9e:48:dc:61:a0:8a",
            "net14": "52:d4:60:db:36:9f",
            "net15": "5e:1e:47:c7:f0:03",
            "net16": "16:8d:a4:6d:06:5d",
            "net17": "ae:67:7d:41:83:dc",
            "net18": "82:e2:6b:2e:05:36",
            "net19": "7e:05:8f:59:e3:f9",
            "net2": "da:a6:2a:9d:69:61",
            "net20": "ce:8b:3d:8a:f4:6b",
            "net21": "8e:c5:5c:b0:0b:84",
            "net22": "fe:dc:ff:3f:3f:37",
            "net23": "76:2a:d2:c6:e8:99",
            "net3": "76:40:90:71:7c:03",
            "net4": "e6:fc:53:bf:5f:76",
            "net5": "2e:d4:97:b5:ec:3c",
            "net6": "46:64:8a:0f:09:d0",
            "net7": "8e:e0:17:e0:49:5f",
            "net8": "d6:02:c7:3e:da:3d",
            "net9": "66:a3:1a:f6:54:4d"
        },
        "spine_2_1_5": {
            "net0": "be:4e:45:21:85:9c",
            "net1": "5a:9f:fa:cf:c8:fe",
            "net10": "2a:f5:11:7b:56:cf",
            "net11": "4e:80:79:25:da:1d",
            "net12": "66:7a:e5:33:34:ae",
            "net13": "9a:a3:94:23:83:14",
            "net14": "6e:0c:8c:8d:35:25",
            "net15": "7e:c2:9a:34:f4:e4",
            "net16": "76:5c:96:22:92:4e",
            "net17": "be:79:e1:ac:c4:06",
            "net18": "96:0e:1e:7f:78:a5",
            "net19": "72:4d:1c:eb:82:ed",
            "net2": "ee:20:65:0b:e5:9f",
            "net20": "a2:64:7d:28:83:63",
            "net21": "5a:8e:ae:c9:d4:c6",
            "net22": "be:76:c6:1e:87:36",
            "net23": "f2:3a:12:c6:1a:58",
            "net3": "0e:32:14:1d:74:fa",
            "net4": "82:de:ae:ba:ec:20",
            "net5": "6a:9d:ca:fd:4f:49",
            "net6": "22:63:d2:5c:df:79",
            "net7": "b6:ed:c8:cc:b9:cd",
            "net8": "1e:f3:92:87:ee:55",
            "net9": "96:0e:b2:51:bb:72"
        },
        "spine_2_1_6": {
            "net0": "46:07:da:32:7f:b4",
            "net1": "62:b5:a9:c5:b6:a1",
            "net10": "ee:80:07:b4:37:eb",
            "net11": "1e:90:03:2a:43:be",
            "net12": "12:ca:2b:99:48:a2",
            "net13": "3a:18:2b:a2:2c:34",
            "net14": "16:50:9d:59:d3:e7",
            "net15": "de:64:6b:ec:63:cb",
            "net16": "32:0a:32:e6:c1:d4",
            "net17": "f2:76:31:05:bb:a5",
            "net18": "fa:ef:25:a2:c2:d2",
            "net19": "8a:e4:9d:2c:f4:90",
            "net2": "26:8d:e2:5c:89:20",
            "net20": "52:f3:30:aa:83:49",
            "net21": "0a:09:6d:f3:e4:e0",
            "net22": "1e:11:b7:d5:68:e0",
            "net23": "86:2d:e7:86:7e:a6",
            "net3": "46:2b:23:83:a0:2d",
            "net4": "1a:67:db:0f:f9:79",
            "net5": "66:12:99:cc:ae:f1",
            "net6": "f6:93:c6:4a:f1:49",
            "net7": "66:83:7e:ac:e5:69",
            "net8": "6a:c6:64:74:6c:6c",
            "net9": "06:c7:6c:f8:a2:a3"
        },
        "spine_2_1_7": {
            "net0": "3a:5c:aa:5a:ee:e3",
            "net1": "4e:f6:28:84:19:fb",
            "net10": "aa:be:31:5c:66:a8",
            "net11": "3e:fe:d4:84:92:d1",
            "net12": "be:cc:f3:5b:11:fa",
            "net13": "46:5f:40:4a:55:21",
            "net14": "be:f2:95:c6:41:fb",
            "net15": "fe:b8:52:15:ab:3a",
            "net16": "6a:22:4f:52:42:89",
            "net17": "76:3a:26:27:8f:82",
            "net18": "96:ef:b7:ae:a7:01",
            "net19": "0e:32:18:92:fe:f1",
            "net2": "3e:f4:6c:74:5a:be",
            "net20": "6a:bf:27:db:01:e6",
            "net21": "66:de:25:95:af:44",
            "net22": "ea:ae:61:ee:0a:c2",
            "net23": "3e:6f:d7:92:0f:a7",
            "net3": "a2:96:f3:19:fd:01",
            "net4": "76:41:38:09:cf:1e",
            "net5": "8a:fb:80:e6:7c:e1",
            "net6": "4e:d5:a6:e2:c1:c2",
            "net7": "16:39:c1:8c:4a:6b",
            "net8": "fe:72:46:12:ec:01",
            "net9": "d2:b1:d2:db:d0:c4"
        },
        "spine_2_1_8": {
            "net0": "7e:f9:43:46:9d:11",
            "net1": "62:ad:67:b6:ad:06",
            "net10": "0a:5a:47:d8:31:82",
            "net11": "ae:ed:8c:23:d6:87",
            "net12": "1a:16:6c:6b:2c:3f",
            "net13": "2a:e1:ab:d7:00:82",
            "net14": "fa:91:1a:7e:b3:17",
            "net15": "ae:09:b0:00:b1:ab",
            "net16": "62:9a:0c:99:35:01",
            "net17": "7a:f6:f2:2e:5f:48",
            "net18": "4a:07:8d:c3:70:e5",
            "net19": "5e:ef:f8:f2:10:10",
            "net2": "6e:c0:dd:a8:8d:2d",
            "net20": "0e:c8:f4:e4:83:c8",
            "net21": "ae:64:ad:75:02:26",
            "net22": "2e:d0:1e:3f:a2:d3",
            "net23": "aa:8b:ae:a3:cf:db",
            "net3": "1e:76:fd:b1:b7:d0",
            "net4": "86:1a:0d:b7:e5:f2",
            "net5": "a2:9b:a6:58:50:cd",
            "net6": "e2:44:f5:79:8b:97",
            "net7": "96:74:b6:95:a4:85",
            "net8": "1e:36:8d:4b:a6:e6",
            "net9": "6a:c7:a4:8e:04:0d"
        },
        "spine_2_1_9": {
            "net0": "aa:03:5a:75:ee:2d",
            "net1": "e6:e1:84:f1:0e:c7",
            "net10": "0a:59:f1:62:c2:da",
            "net11": "de:a5:1c:4d:e2:f8",
            "net12": "a6:a7:0c:e5:f9:12",
            "net13": "3e:0d:84:c2:98:ba",
            "net14": "6a:53:36:ac:16:73",
            "net15": "aa:bc:8a:e8:58:ef",
            "net16": "72:72:38:28:a4:dc",
            "net17": "8a:0c:24:48:c6:e9",
            "net18": "3e:e3:b7:01:1d:9e",
            "net19": "4a:fa:d2:ee:7b:10",
            "net2": "b2:ab:dd:08:af:79",
            "net20": "5a:8d:56:67:be:ab",
            "net21": "a6:b7:2f:e1:6d:04",
            "net22": "f2:c4:f3:cb:c1:0a",
            "net23": "0a:f5:27:82:4a:5b",
            "net3": "da:07:91:48:e5:63",
            "net4": "3a:01:4c:57:11:32",
            "net5": "72:96:62:b2:f3:3e",
            "net6": "0e:48:4e:25:83:1b",
            "net7": "da:da:5c:62:49:95",
            "net8": "1e:e7:13:90:54:78",
            "net9": "8a:21:f6:a9:7b:86"
        },
        "tof_1_2_1": {
            "net0": "4e:62:0c:0f:ba:e8",
            "net1": "0e:9d:88:a2:71:61",
            "net10": "e2:31:8e:88:07:dc",
            "net11": "d6:ea:18:ae:2c:29",
            "net12": "ca:47:49:34:7f:55",
            "net13": "42:80:bb:85:31:bd",
            "net14": "6e:99:b9:f5:16:72",
            "net15": "c2:bc:7d:42:6d:20",
            "net16": "d2:c8:ae:72:7a:17",
            "net17": "32:d7:87:67:f9:42",
            "net18": "1e:08:7e:d0:35:75",
            "net19": "de:7d:57:0e:d4:2e",
            "net2": "56:32:e9:a0:19:c2",
            "net20": "da:18:a6:b7:ef:a4",
            "net21": "3e:23:c9:5e:2d:43",
            "net22": "5a:4c:2d:d6:ba:7c",
            "net23": "3a:1b:a7:60:92:b2",
            "net3": "82:b0:a9:33:2c:99",
            "net4": "d2:c5:3a:e6:5b:58",
            "net5": "16:96:37:8b:76:d2",
            "net6": "3a:c9:9f:76:58:44",
            "net7": "ea:f6:3f:90:c9:01",
            "net8": "4e:16:92:58:aa:e0",
            "net9": "7a:74:bd:95:ca:02"
        },
        "tof_1_2_10": {
            "net0": "56:b3:f4:99:84:aa",
            "net1": "2a:8f:c5:c8:f8:25",
            "net10": "fa:7f:f0:73:46:c5",
            "net11": "52:24:36:cf:fa:b7",
            "net12": "fa:b4:9c:39:ed:dc",
            "net13": "ba:22:08:a8:8b:d3",
            "net14": "7e:77:85:18:2a:2b",
            "net15": "0a:24:c4:49:e2:e7",
            "net16": "02:f8:77:d1:fb:08",
            "net17": "6a:14:41:42:5e:a2",
            "net18": "c6:7f:06:99:5d:b2",
            "net19": "1a:77:d5:48:44:46",
            "net2": "b6:fc:97:1d:32:ad",
            "net20": "e2:d1:62:d9:b7:3e",
            "net21": "c2:14:f7:54:25:0b",
            "net22": "82:aa:9d:35:05:21",
            "net23": "26:5d:ff:d5:93:39",
            "net3": "42:b7:29:3d:02:85",
            "net4": "96:eb:07:12:16:18",
            "net5": "be:59:97:c5:e8:6e",
            "net6": "aa:46:0a:f2:63:7f",
            "net7": "ee:a4:d4:97:6b:af",
            "net8": "86:5d:56:1b:71:6f",
            "net9": "06:a8:eb:df:1f:71"
        },
        "tof_1_2_11": {
            "net0": "a2:c4:8a:63:2c:97",
            "net1": "c6:52:58:81:a2:7c",
            "net10": "ce:be:7d:56:e8:c6",
            "net11": "f2:11:ab:99:09:02",
            "net12": "86:d4:d0:e1:02:a3",
            "net13": "42:9e:69:cb:37:69",
            "net14": "ae:34:1c:ef:24:d7",
            "net15": "5e:21:28:f2:72:ae",
            "net16": "be:1b:2c:94:9e:29",
            "net17": "8a:0b:e5:b3:0b:29",
            "net18": "8e:86:04:ca:34:1d",
            "net19": "6a:81:84:a8:f1:96",
            "net2": "8e:84:3f:eb:e6:76",
            "net20": "2e:9c:89:12:26:79",
            "net21": "6a:fa:29:99:77:0a",
            "net22": "82:ee:3b:95:a1:79",
            "net23": "f6:d3:5b:b2:1d:01",
            "net3": "aa:70:48:e4:c8:a6",
            "net4": "76:c6:e2:a5:81:bf",
            "net5": "1e:5c:2c:10:ad:d4",
            "net6": "4a:f9:02:71:55:5e",
            "net7": "46:f7:ee:d7:10:03",
            "net8": "b2:0a:18:48:8e:c2",
            "net9": "0a:4c:6e:07:62:1e"
        },
        "tof_1_2_12": {
            "net0": "ea:4d:f1:9e:ed:8f",
            "net1": "ee:00:18:83:e1:0d",
            "net10": "8e:d0:14:68:f2:67",
            "net11": "ce:18:b0:f3:65:df",
            "net12": "1a:3e:89:b3:33:81",
            "net13": "46:68:5a:93:e0:a7",
            "net14": "ba:dc:5e:be:35:12",
            "net15": "fa:6a:0e:8f:e5:83",
            "net16": "3e:23:72:07:5e:46",
            "net17": "62:54:40:f9:76:95",
            "net18": "2e:4a:20:f9:fd:b7",
            "net19": "d2:8c:32:e2:9d:0f",
            "net2": "c6:89:8d:e9:35:35",
            "net20": "36:fb:a9:a7:99:12",
            "net21": "72:68:e7:dd:b2:f1",
            "net22": "42:cf:d1:a8:d3:7b",
            "net23": "86:b4:d0:af:be:6b",
            "net3": "4a:94:1c:a3:d9:38",
            "net4": "8e:f8:49:7d:cf:07",
            "net5": "56:a6:55:84:c2:ca",
            "net6": "96:1a:14:8b:6f:f2",
            "net7": "ca:c4:b9:88:4d:41",
            "net8": "b6:9b:e0:65:2d:76",
            "net9": "6a:eb:39:ef:d6:0f"
        },
        "tof_1_2_2": {
            "net0": "02:b4:40:66:fc:7e",
            "net1": "c2:be:5c:b1:91:e9",
            "net10": "2e:aa:eb:87:01:17",
            "net11": "42:e6:63:82:50:24",
            "net12": "2e:96:03:21:95:f6",
            "net13": "c2:16:00:69:79:20",
            "net14": "de:cb:1d:5e:d3:cc",
            "net15": "6e:f9:d9:40:8d:53",
            "net16": "ba:5c:3b:69:72:3e",
            "net17": "0e:34:33:b4:dc:4c",
            "net18": "a6:a5:42:41:b1:69",
            "net19": "22:58:2c:98:5d:dd",
            "net2": "c2:46:21:4c:85:63",
            "net20": "a2:31:f2:85:76:e3",
            "net21": "6e:59:ef:fa:13:43",
            "net22": "ee:6b:1d:ea:65:72",
            "net23": "d6:32:49:63:e6:5a",
            "net3": "4a:f2:29:81:35:23",
            "net4": "e2:1f:59:f5:4c:77",
            "net5": "fe:2a:c2:be:03:1f",
            "net6": "6a:cf:bf:6b:c6:35",
            "net7": "62:ab:52:ab:e5:93",
            "net8": "5a:e5:39:9d:75:25",
            "net9": "16:73:ea:4d:64:41"
        },
        "tof_1_2_3": {
            "net0": "be:aa:7a:07:93:1b",
            "net1": "26:5a:09:48:05:64",
            "net10": "ba:87:7a:d0:fb:47",
            "net11": "1a:63:58:9d:25:55",
            "net12": "7e:ac:d7:f5:3a:4f",
            "net13": "e2:59:f7:46:4c:f6",
            "net14": "ee:49:d6:a8:fb:a9",
            "net15": "3a:50:3a:29:03:be",
            "net16": "ca:e7:b5:47:ba:36",
            "net17": "4a:19:ca:e8:7e:e6",
            "net18": "06:9c:07:6b:a2:4d",
            "net19": "66:40:c2:13:72:af",
            "net2": "56:73:0b:07:11:c3",
            "net20": "22:44:36:ec:b9:94",
            "net21": "f6:b6:da:f2:25:56",
            "net22": "1a:c9:c5:3a:a7:d4",
            "net23": "62:f7:9a:a0:66:0b",
            "net3": "e2:b8:15:1a:de:19",
            "net4": "36:77:cb:69:a4:86",
            "net5": "72:92:4c:6b:85:2a",
            "net6": "c2:1d:f9:e0:1b:cc",
            "net7": "b6:2d:75:0f:5e:22",
            "net8": "ca:25:7c:b6:61:23",
            "net9": "ca:b0:40:40:23:9c"
        },
        "tof_1_2_4": {
            "net0": "a6:79:95:51:7b:f6",
            "net1": "da:1d:cc:4c:eb:c6",
            "net10": "16:78:4e:8b:db:54",
            "net11": "a2:55:67:28:7f:55",
            "net12": "06:82:dc:83:7c:fb",
            "net13": "66:68:4d:5f:67:46",
            "net14": "b2:7e:e9:b1:d9:b0",
            "net15": "d2:70:2b:af:c6:60",
            "net16": "06:91:1e:c5:0d:2b",
            "net17": "d6:8e:80:a6:50:5d",
            "net18": "de:ef:67:65:7a:84",
            "net19": "76:c2:1d:0a:79:08",
            "net2": "d2:75:ec:3c:98:d2",
            "net20": "66:1d:f2:e7:1e:ff",
            "net21": "d6:a4:57:30:fd:88",
            "net22": "16:fa:06:5e:5c:31",
            "net23": "aa:c1:ad:5b:50:97",
            "net3": "6a:38:69:7e:7b:56",
            "net4": "ee:8c:6e:84:ab:9d",
            "net5": "2a:fd:63:31:0f:7f",
            "net6": "9a:cc:22:a1:c3:5b",
            "net7": "ee:5d:41:0b:12:4d",
            "net8": "6e:b4:f2:f7:ac:0d",
            "net9": "16:37:24:91:84:de"
        },
        "tof_1_2_5": {
            "net0": "12:70:21:12:d2:5d",
            "net1": "4e:a5:8d:15:f3:9a",
            "net10": "c6:74:aa:f1:07:ae",
            "net11": "ca:b3:f6:a6:ac:ac",
            "net12": "aa:72:30:d7:05:f0",
            "net13": "ca:6d:57:ca:33:19",
            "net14": "d2:00:04:99:14:d9",
            "net15": "16:f7:3a:71:28:e8",
            "net16": "f2:4e:87:99:9c:e7",
            "net17": "22:08:b3:97:ca:18",
            "net18": "66:d7:3a:28:ce:d5",
            "net19": "1a:bf:6e:51:4c:2d",
            "net2": "6e:af:71:8b:6b:b5",
            "net20": "76:f9:23:88:e0:d4",
            "net21": "4a:6e:e3:3f:9c:e1",
            "net22": "92:e9:3f:b5:a3:c9",
            "net23": "62:c0:40:96:fd:56",
            "net3": "2e:07:77:ac:34:c1",
            "net4": "5e:8e:30:f8:00:0e",
            "net5": "36:cc:3e:40:51:ca",
            "net6": "ba:e9:de:d1:58:bd",
            "net7": "1e:1f:35:8a:45:88",
            "net8": "5e:55:52:85:86:0c",
            "net9": "ea:67:8e:a1:99:33"
        },
        "tof_1_2_6": {
            "net0": "0e:3f:1b:fe:05:43",
            "net1": "72:85:8a:ad:a8:b2",
            "net10": "52:52:88:cb:fb:c6",
            "net11": "66:f6:ec:8a:45:83",
            "net12": "fa:8a:b7:57:dc:a5",
            "net13": "56:9f:3f:72:10:2a",
            "net14": "26:84:95:b4:e4:8e",
            "net15": "ea:05:71:f7:ae:13",
            "net16": "d2:89:df:ec:e0:86",
            "net17": "5e:b3:f0:86:77:53",
            "net18": "42:fa:22:0a:77:fd",
            "net19": "9e:ee:b2:d2:3b:fb",
            "net2": "c6:b6:21:75:ea:75",
            "net20": "fa:fd:2d:b2:67:cb",
            "net21": "52:8b:3a:b9:cc:76",
            "net22": "4e:a8:69:a4:c2:4e",
            "net23": "92:e9:d6:45:65:a6",
            "net3": "2e:f2:bb:36:31:83",
            "net4": "22:47:f6:6a:63:f3",
            "net5": "fa:01:62:21:49:91",
            "net6": "6a:11:e3:5a:8d:6f",
            "net7": "02:e2:f6:97:88:e6",
            "net8": "3a:da:5a:ef:8f:72",
            "net9": "56:d2:d5:fe:b1:7a"
        },
        "tof_1_2_7": {
            "net0": "4e:4c:c8:d4:ec:22",
            "net1": "36:dc:56:ee:5c:2f",
            "net10": "de:fd:37:65:6c:01",
            "net11": "22:91:fe:e1:07:75",
            "net12": "9a:9e:bb:e2:92:ff",
            "net13": "1a:fc:75:f1:d4:83",
            "net14": "16:5a:28:7b:ea:9c",
            "net15": "2a:73:55:94:3e:ad",
            "net16": "26:84:08:81:f5:d1",
            "net17": "0e:94:1d:83:a1:60",
            "net18": "12:78:80:0e:2e:d4",
            "net19": "f6:61:b1:39:df:69",
            "net2": "0e:06:88:73:27:b7",
            "net20": "06:01:cf:df:80:b1",
            "net21": "42:df:bf:65:18:b4",
            "net22": "62:2a:d8:40:a9:52",
            "net23": "22:ae:d0:79:7e:bf",
            "net3": "0a:e3:d4:61:9e:1c",
            "net4": "12:de:28:f3:13:d6",
            "net5": "ee:32:9f:85:d4:a0",
            "net6": "f6:d1:92:5c:fb:ac",
            "net7": "8e:e1:cc:d3:54:ae",
            "net8": "72:d1:56:09:e3:d4",
            "net9": "42:78:24:b6:51:77"
        },
        "tof_1_2_8": {
            "net0": "d6:5d:60:69:8a:68",
            "net1": "92:40:3d:1c:40:d9",
            "net10": "86:09:53:28:2b:db",
            "net11": "3e:89:fa:10:b6:9c",
            "net12": "aa:cb:57:58:fb:dd",
            "net13": "aa:79:c7:dc:65:7d",
            "net14": "f6:b2:52:57:b3:8f",
            "net15": "c2:09:3e:4a:cd:e1",
            "net16": "92:10:06:cb:2f:bc",
            "net17": "de:01:9f:82:2a:fe",
            "net18": "26:5e:2e:59:ac:3a",
            "net19": "c2:5e:fa:45:e1:4a",
            "net2": "9e:71:37:c1:45:b5",
            "net20": "06:75:d6:80:99:59",
            "net21": "9a:2d:b4:7b:b7:ec",
            "net22": "7a:a8:8a:25:67:c1",
            "net23": "9a:2e:54:ec:9a:0a",
            "net3": "d6:72:3d:e4:38:d8",
            "net4": "8e:d7:60:6a:11:e4",
            "net5": "d2:71:96:49:e0:fe",
            "net6": "92:ff:ee:01:6c:c9",
            "net7": "a2:3d:5a:79:eb:47",
            "net8": "32:17:9d:43:b8:69",
            "net9": "ea:d5:de:eb:00:37"
        },
        "tof_1_2_9": {
            "net0": "0a:4a:67:88:81:7e",
            "net1": "42:ff:17:48:b0:38",
            "net10": "de:13:5b:9d:c3:d2",
            "net11": "d2:e8:c9:a7:1a:19",
            "net12": "ba:cd:bd:d4:0e:5b",
            "net13": "96:ea:a7:9b:cb:cb",
            "net14": "da:90:14:dc:b0:29",
            "net15": "a6:c1:0f:34:78:0d",
            "net16": "06:bf:f3:2d:a6:be",
            "net17": "46:85:72:48:5f:10",
            "net18": "3a:95:38:e8:99:0e",
            "net19": "22:45:a9:1c:bd:61",
            "net2": "8a:4b:0a:b2:e3:a9",
            "net20": "02:54:ea:af:52:60",
            "net21": "ee:e9:d3:ff:88:8c",
            "net22": "be:b0:70:75:84:59",
            "net23": "ee:9a:46:35:ad:0a",
            "net3": "c6:b3:21:a3:1d:93",
            "net4": "52:70:c7:5e:c1:3f",
            "net5": "c6:d0:cc:f4:b0:3d",
            "net6": "3a:75:75:92:91:02",
            "net7": "e6:cd:88:a1:e9:57",
            "net8": "9a:fb:a5:dd:e5:29",
            "net9": "56:d3:25:79:b1:06"
        }
    },
    "failed_machine": "leaf_1_0_1",
    "failed_interfaces": [
        "net0"
    ],
    "failure_time": 1616349080.2701554
}