{
    "k_leaf": 4,
    "k_top": 4,
    "redundancy_factor": 2,
    "is_k8s": true,
    "machine_mac_addresses": {
        "leaf_1_0_1": {
            "net0": "f6:41:a7:45:da:f5",
            "net1": "d6:41:1f:0a:ab:7b",
            "net2": "7a:16:d0:42:bf:e4",
            "net3": "5e:e3:7d:7c:64:bb",
            "net4": "aa:30:67:e1:b9:5a"
        },
        "leaf_1_0_2": {
            "net0": "82:4f:e5:25:27:7b",
            "net1": "72:25:1c:66:d2:28",
            "net2": "36:48:46:96:cf:55",
            "net3": "6e:98:af:94:4d:35",
            "net4": "86:64:03:75:e3:ab"
        },
        "leaf_1_0_3": {
            "net0": "ba:09:e6:8b:27:93",
            "net1": "e6:b2:01:e3:21:58",
            "net2": "86:92:17:0e:80:13",
            "net3": "c2:eb:81:21:b9:a3",
            "net4": "0a:e4:4f:d4:1c:e5"
        },
        "leaf_1_0_4": {
            "net0": "de:7e:04:e5:68:38",
            "net1": "3a:22:17:39:58:e1",
            "net2": "92:55:8b:ef:ca:47",
            "net3": "02:0d:7a:ab:ab:97",
            "net4": "5e:d9:bc:df:60:36"
        },
        "leaf_2_0_1": {
            "net0": "a2:c3:3b:2b:72:29",
            "net1": "9e:f9:e0:c5:28:40",
            "net2": "92:bf:50:9c:75:86",
            "net3": "3e:1e:0a:c2:11:84",
            "net4": "86:35:4c:35:2f:35"
        },
        "leaf_2_0_2": {
            "net0": "e2:4a:98:27:c7:16",
            "net1": "32:c2:47:4b:7d:fd",
            "net2": "b6:72:d7:a7:10:65",
            "net3": "0a:ee:eb:ee:07:0f",
            "net4": "3e:e9:96:32:a6:ff"
        },
        "leaf_2_0_3": {
            "net0": "9a:f4:ec:01:d5:2e",
            "net1": "56:c3:72:a1:1b:c8",
            "net2": "42:ce:4c:dd:e1:d7",
            "net3": "6a:5b:ae:32:1c:8d",
            "net4": "8a:25:09:cb:16:f8"
        },
        "leaf_2_0_4": {
            "net0": "16:46:74:fd:0e:a6",
            "net1": "72:49:c8:88:42:3a",
            "net2": "2e:c3:79:e8:15:ca",
            "net3": "d6:be:df:23:95:7c",
            "net4": "5a:54:9f:00:dd:b0"
        },
        "leaf_3_0_1": {
            "net0": "f2:10:49:3e:8c:45",
            "net1": "a6:b6:f3:8e:dc:6f",
            "net2": "52:70:c6:e6:33:d6",
            "net3": "d2:52:9d:84:86:97",
            "net4": "86:4e:f2:04:30:13"
        },
        "leaf_3_0_2": {
            "net0": "96:85:f6:02:82:17",
            "net1": "f2:6e:0f:e2:80:ad",
            "net2": "de:2d:4c:01:97:1c",
            "net3": "a6:4e:6b:d3:5a:3c",
            "net4": "16:fa:72:6d:a4:b4"
        },
        "leaf_3_0_3": {
            "net0": "3e:3b:aa:a5:2e:d1",
            "net1": "1a:8a:55:29:4e:8d",
            "net2": "ea:c0:10:a1:dd:67",
            "net3": "52:b2:13:15:df:0c",
            "net4": "b6:ee:a2:0c:b8:26"
        },
        "leaf_3_0_4": {
            "net0": "0a:44:d4:dd:2e:5d",
            "net1": "32:72:f6:61:b6:f6",
            "net2": "ce:a0:9d:4c:c1:77",
            "net3": "ba:f7:07:4c:bd:de",
            "net4": "3e:62:7a:ef:2d:a3"
        },
        "leaf_4_0_1": {
            "net0": "8a:b5:9a:fd:a7:76",
            "net1": "9a:ba:e5:58:4c:9d",
            "net2": "32:92:49:99:6f:5c",
            "net3": "7e:97:71:55:9a:a4",
            "net4": "2a:ca:67:cd:55:e8"
        },
        "leaf_4_0_2": {
            "net0": "8e:00:5b:a3:0d:65",
            "net1": "32:46:d2:3b:24:f7",
            "net2": "06:38:c0:11:e2:e3",
            "net3": "12:69:07:1a:85:b4",
            "net4": "d2:fc:46:ac:9c:82"
        },
        "leaf_4_0_3": {
            "net0": "0e:2b:24:28:5c:3d",
            "net1": "3e:5a:c7:3c:e2:36",
            "net2": "b2:3d:9a:c3:32:c7",
            "net3": "9a:71:21:e9:07:d9",
            "net4": "4a:f9:3b:6a:0a:6c"
        },
        "leaf_4_0_4": {
            "net0": "46:7b:a5:ab:d2:d7",
            "net1": "de:63:2f:e2:5a:62",
            "net2": "22:c5:11:b0:44:1c",
            "net3": "0e:ac:78:d5:34:27",
            "net4": "2a:ec:b3:de:0a:53"
        },
        "spine_1_1_1": {
            "net0": "32:1d:d9:5a:d6:9b",
            "net1": "76:6e:88:c9:e6:24",
            "net2": "9a:df:db:11:d7:a0",
            "net3": "0a:c5:eb:7d:21:3d",
            "net4": "e2:d0:49:07:58:ea",
            "net5": "8e:a7:c7:75:e2:3d",
            "net6": "92:67:5b:53:75:10",
            "net7": "56:57:52:30:11:7a"
        },
        "spine_1_1_2": {
            "net0": "06:f5:98:60:5b:44",
            "net1": "b6:da:f5:ed:e6:aa",
            "net2": "3e:cb:ef:3d:27:14",
            "net3": "62:bb:80:4f:f6:89",
            "net4": "0e:ee:d1:ea:67:38",
            "net5": "e2:d0:d0:3c:7f:8b",
            "net6": "1e:b5:7c:74:ae:13",
            "net7": "22:c5:63:ff:28:22"
        },
        "spine_1_1_3": {
            "net0": "76:e8:cf:d7:ea:54",
            "net1": "16:68:86:f2:93:a3",
            "net2": "02:d1:95:76:9e:59",
            "net3": "be:50:38:51:b2:f8",
            "net4": "3a:8d:ae:59:22:a4",
            "net5": "66:02:41:2d:bb:98",
            "net6": "36:57:13:91:a2:71",
            "net7": "f2:6d:e1:8f:af:d8"
        },
        "spine_1_1_4": {
            "net0": "0a:6f:73:53:bd:7f",
            "net1": "e6:5f:34:62:20:07",
            "net2": "16:ca:18:ba:92:eb",
            "net3": "fe:01:78:f9:6c:c2",
            "net4": "fe:f0:53:50:a9:f7",
            "net5": "ca:f0:08:40:f2:07",
            "net6": "2a:3f:7a:9c:00:f7",
            "net7": "76:12:f6:4a:4d:79"
        },
        "spine_2_1_1": {
            "net0": "96:75:30:5e:f4:2a",
            "net1": "16:50:57:79:14:ad",
            "net2": "3e:50:18:d5:db:02",
            "net3": "da:4b:94:d1:7b:75",
            "net4": "02:c0:78:8e:c2:9c",
            "net5": "36:c6:cb:2b:3b:06",
            "net6": "ce:b2:e1:7d:14:19",
            "net7": "f2:8e:e3:fe:17:8b"
        },
        "spine_2_1_2": {
            "net0": "86:87:89:c0:e5:88",
            "net1": "ee:ba:55:15:02:4a",
            "net2": "c6:49:58:2b:e7:e6",
            "net3": "36:2f:41:5b:1a:4a",
            "net4": "46:e9:65:61:30:56",
            "net5": "e6:6d:ca:85:15:b4",
            "net6": "a2:ea:dd:c4:81:b9",
            "net7": "de:96:23:e0:7a:6e"
        },
        "spine_2_1_3": {
            "net0": "8a:f7:80:75:f0:7c",
            "net1": "ca:7e:f7:9e:57:aa",
            "net2": "9e:24:7b:be:a1:d3",
            "net3": "a6:b5:aa:8c:77:b4",
            "net4": "86:90:a3:83:1b:93",
            "net5": "7e:98:47:c5:d3:73",
            "net6": "a2:e3:11:e8:1a:90",
            "net7": "a2:b4:62:e5:b7:13"
        },
        "spine_2_1_4": {
            "net0": "7e:03:12:38:ea:51",
            "net1": "2a:e3:60:12:0f:c9",
            "net2": "ca:78:ef:b3:45:c9",
            "net3": "9a:8d:8f:37:4a:63",
            "net4": "d2:89:29:cf:8f:06",
            "net5": "9e:19:ef:52:02:2e",
            "net6": "a2:de:2f:d6:51:02",
            "net7": "ea:0b:8e:77:fe:b6"
        },
        "spine_3_1_1": {
            "net0": "96:ed:c0:c7:a2:a2",
            "net1": "7a:52:58:dd:74:30",
            "net2": "4a:00:b6:7b:d5:eb",
            "net3": "e6:d0:c3:8a:da:ea",
            "net4": "5a:4a:44:b9:51:9a",
            "net5": "26:94:ba:30:a0:57",
            "net6": "52:0b:13:d4:5d:df",
            "net7": "ee:a1:d6:78:e4:ac"
        },
        "spine_3_1_2": {
            "net0": "d6:7c:9a:94:fa:eb",
            "net1": "d2:e4:9e:ef:49:16",
            "net2": "0e:ab:bd:52:f3:5e",
            "net3": "86:2c:ad:bb:88:1b",
            "net4": "7a:10:fb:27:64:d4",
            "net5": "ce:b9:9b:93:37:60",
            "net6": "b6:ce:c2:6b:1c:55",
            "net7": "b6:e5:fd:56:7e:41"
        },
        "spine_3_1_3": {
            "net0": "1a:d1:1f:a6:da:fb",
            "net1": "fa:05:f1:c9:e1:21",
            "net2": "ba:1e:6a:ab:1e:7f",
            "net3": "ea:a6:c6:c5:c3:c4",
            "net4": "7e:e1:58:5a:a8:b5",
            "net5": "26:33:80:f6:1e:a7",
            "net6": "aa:31:95:dc:b0:04",
            "net7": "76:e5:ae:c4:97:ca"
        },
        "spine_3_1_4": {
            "net0": "0a:35:a2:95:bb:68",
            "net1": "92:04:56:20:40:90",
            "net2": "ba:5f:45:9e:00:d0",
            "net3": "fe:07:94:b9:c3:95",
            "net4": "e6:b4:9e:04:55:9e",
            "net5": "f6:76:77:2b:ed:7b",
            "net6": "72:0e:e4:7f:55:f2",
            "net7": "5a:72:83:c4:72:40"
        },
        "spine_4_1_1": {
            "net0": "4e:84:bb:be:66:c0",
            "net1": "82:7a:50:f9:ac:73",
            "net2": "4e:0e:3e:a6:91:fe",
            "net3": "b2:41:7f:23:a4:57",
            "net4": "b6:ce:3f:40:1a:96",
            "net5": "26:03:6f:48:50:88",
            "net6": "b2:97:70:ad:67:a4",
            "net7": "7a:d4:00:d7:00:65"
        },
        "spine_4_1_2": {
            "net0": "1e:65:e9:1b:72:58",
            "net1": "ae:fd:ef:07:72:b4",
            "net2": "16:6f:e0:3c:cf:cc",
            "net3": "f2:41:8b:02:dd:2f",
            "net4": "f2:82:c1:f5:ef:40",
            "net5": "a2:b2:d9:a3:ea:f4",
            "net6": "12:4f:a3:21:f1:48",
            "net7": "7e:14:87:23:c8:07"
        },
        "spine_4_1_3": {
            "net0": "ba:e0:f4:88:1b:01",
            "net1": "02:46:ba:f3:ba:84",
            "net2": "66:19:ce:6b:fc:ff",
            "net3": "ae:76:ff:bf:4d:e8",
            "net4": "da:25:88:15:bb:e0",
            "net5": "8a:f3:5c:a8:b7:95",
            "net6": "ba:21:f3:fe:02:44",
            "net7": "56:04:fc:9a:e4:10"
        },
        "spine_4_1_4": {
            "net0": "8e:94:1c:28:8b:5a",
            "net1": "52:72:53:58:e9:45",
            "net2": "e2:b4:e0:26:f2:44",
            "net3": "5e:c2:b8:6c:20:91",
            "net4": "de:5a:ec:d7:cb:62",
            "net5": "3e:b9:ce:00:2d:5b",
            "net6": "7a:a8:2b:2d:9b:20",
            "net7": "32:b9:97:4b:24:b3"
        },
        "tof_1_2_1": {
            "net0": "c6:81:6e:00:36:6f",
            "net1": "0a:61:4c:93:4a:4e",
            "net2": "06:b1:ee:70:ca:37",
            "net3": "ba:7f:08:5a:ed:38",
            "net4": "0e:a1:11:d6:f3:33",
            "net5": "c6:25:1a:56:e7:bb",
            "net6": "0e:8e:08:2b:67:1b",
            "net7": "1a:ce:c3:2b:8e:db",
            "net8": "56:b7:10:1b:a5:7e"
        },
        "tof_1_2_2": {
            "net0": "46:00:91:25:28:5d",
            "net1": "62:a2:94:5f:04:9d",
            "net2": "b2:88:80:07:22:7c",
            "net3": "1e:fa:4e:11:83:67",
            "net4": "f6:54:a8:2b:b2:50",
            "net5": "ae:79:98:2d:ff:19",
            "net6": "26:ac:0f:82:4c:d0",
            "net7": "ea:f2:85:e4:8b:bb",
            "net8": "9e:0a:f5:41:24:a7"
        },
        "tof_1_2_3": {
            "net0": "92:66:b1:f6:ce:b1",
            "net1": "7e:81:ad:01:da:64",
            "net2": "26:9e:8c:e4:84:aa",
            "net3": "02:2c:46:1c:55:6e",
            "net4": "ee:08:e4:a0:86:7d",
            "net5": "a2:65:73:f5:44:01",
            "net6": "96:90:84:52:20:86",
            "net7": "f6:a1:41:8a:8a:a2",
            "net8": "c6:2d:7a:e3:96:51"
        },
        "tof_1_2_4": {
            "net0": "0a:52:9f:9a:63:43",
            "net1": "4e:72:ee:b2:41:7f",
            "net2": "26:55:c2:fe:0a:e6",
            "net3": "9e:df:6e:85:68:94",
            "net4": "3a:7e:ee:f7:5d:cd",
            "net5": "ce:dc:c3:d7:cd:ff",
            "net6": "36:01:0e:18:16:7b",
            "net7": "ce:12:ce:76:2d:7b",
            "net8": "2a:60:bb:52:b7:5e"
        },
        "tof_2_2_1": {
            "net0": "f2:3f:15:df:a2:ad",
            "net1": "02:66:c8:f9:5a:b6",
            "net2": "8e:4f:86:90:16:b9",
            "net3": "be:0d:e5:df:69:6e",
            "net4": "82:c0:70:53:e6:5a",
            "net5": "c2:dc:3a:e7:9b:a1",
            "net6": "72:21:ed:2f:10:f9",
            "net7": "d2:53:99:f2:9b:17",
            "net8": "02:94:4b:cd:5f:a9"
        },
        "tof_2_2_2": {
            "net0": "9e:72:f9:e4:78:21",
            "net1": "1e:b2:ac:1f:e2:d5",
            "net2": "fa:b8:cd:14:e6:f2",
            "net3": "36:5d:24:b8:1f:2e",
            "net4": "16:1c:c7:f6:98:b5",
            "net5": "56:cb:2a:c1:61:36",
            "net6": "be:5c:b0:78:03:b2",
            "net7": "da:80:85:29:66:8f",
            "net8": "f6:19:71:ab:f3:1f"
        },
        "tof_2_2_3": {
            "net0": "7a:75:a1:f8:0d:f8",
            "net1": "26:3c:5d:8b:77:c7",
            "net2": "fe:f0:10:7d:ab:14",
            "net3": "36:b7:1b:dd:40:f5",
            "net4": "0a:3e:04:ae:43:60",
            "net5": "d2:92:18:e3:13:ff",
            "net6": "8e:bb:a3:77:85:69",
            "net7": "b2:67:7b:84:64:e1",
            "net8": "ce:80:0b:62:47:9e"
        },
        "tof_2_2_4": {
            "net0": "c6:23:6c:0e:32:1e",
            "net1": "0a:1c:2d:cb:55:96",
            "net2": "16:1e:8d:3c:03:89",
            "net3": "e2:a0:57:b4:80:1c",
            "net4": "5a:b7:bc:7f:7f:09",
            "net5": "16:af:ac:7f:76:81",
            "net6": "b6:97:1a:59:77:0e",
            "net7": "52:53:b5:8c:71:6b",
            "net8": "fa:85:20:84:3b:52"
        }
    },
    "failed_machine": "leaf_1_0_1",
    "failure_time": {
        "leaf_1_0_1": 1622753662.2112052,
        "leaf_1_0_2": 1622753662.2182398,
        "leaf_1_0_3": 1622753662.2240129,
        "leaf_1_0_4": 1622753662.2325675,
        "leaf_2_0_1": 1622753662.2346027,
        "leaf_2_0_2": 1622753662.210416,
        "leaf_2_0_3": 1622753662.2208762,
        "leaf_2_0_4": 1622753662.2277772,
        "leaf_3_0_1": 1622753662.2380683,
        "leaf_3_0_2": 1622753662.245802,
        "leaf_3_0_3": 1622753662.2428372,
        "leaf_3_0_4": 1622753662.2502851,
        "leaf_4_0_1": 1622753662.2560325,
        "leaf_4_0_2": 1622753662.263672,
        "leaf_4_0_3": 1622753662.2686558,
        "leaf_4_0_4": 1622753662.248899,
        "spine_1_1_1": 1622753662.2543447,
        "spine_1_1_2": 1622753662.2591,
        "spine_1_1_3": 1622753662.2654312,
        "spine_1_1_4": 1622753662.271445,
        "spine_2_1_1": 1622753662.277174,
        "spine_2_1_2": 1622753662.2818656,
        "spine_2_1_3": 1622753662.2884018,
        "spine_2_1_4": 1622753662.2940876,
        "spine_3_1_1": 1622753662.3034976,
        "spine_3_1_2": 1622753662.2773468,
        "spine_3_1_3": 1622753662.2840226,
        "spine_3_1_4": 1622753662.2910318,
        "spine_4_1_1": 1622753662.297281,
        "spine_4_1_2": 1622753662.3034575,
        "spine_4_1_3": 1622753662.3084152,
        "spine_4_1_4": 1622753662.3234265,
        "tof_1_2_1": 1622753662.3324165,
        "tof_1_2_2": 1622753662.3418207,
        "tof_1_2_3": 1622753662.3507788,
        "tof_1_2_4": 1622753662.3140426,
        "tof_2_2_1": 1622753662.3204129,
        "tof_2_2_2": 1622753662.327178,
        "tof_2_2_3": 1622753662.3333147,
        "tof_2_2_4": 1622753662.3428473
    }
}