{
    "k_leaf": 4,
    "k_top": 4,
    "redundancy_factor": 2,
    "is_k8s": false,
    "machine_mac_addresses": {
        "leaf_1_0_1": {
            "eth0": "b2:82:fa:1e:7c:b7",
            "eth1": "86:fa:ea:aa:b1:cd",
            "eth2": "e6:fb:9f:9a:ec:25",
            "eth3": "8a:43:3a:c1:81:0a",
            "eth4": "c2:e3:fc:f3:27:a8"
        },
        "leaf_1_0_2": {
            "eth0": "96:99:26:0e:03:07",
            "eth1": "2e:40:09:96:8c:c9",
            "eth2": "76:d1:c4:b0:61:85",
            "eth3": "b2:7e:42:1f:ad:16",
            "eth4": "96:e6:a4:27:af:52"
        },
        "leaf_1_0_3": {
            "eth0": "b6:e7:6d:07:9e:93",
            "eth1": "ce:44:e9:4e:9a:3a",
            "eth2": "a6:16:c4:44:0b:7e",
            "eth3": "d2:31:10:03:55:41",
            "eth4": "e6:08:13:c9:32:5f"
        },
        "leaf_1_0_4": {
            "eth0": "96:f6:a8:e5:fc:77",
            "eth1": "ae:75:dc:50:db:f9",
            "eth2": "c6:65:ef:79:0b:1c",
            "eth3": "fa:ca:3f:90:39:91",
            "eth4": "de:54:d6:5d:82:de"
        },
        "leaf_2_0_1": {
            "eth0": "d6:d2:ee:b5:99:44",
            "eth1": "c6:40:c7:76:45:58",
            "eth2": "e6:1d:e9:a9:e8:8e",
            "eth3": "52:95:f9:10:01:84",
            "eth4": "0e:b4:20:63:00:23"
        },
        "leaf_2_0_2": {
            "eth0": "1e:05:fd:68:b5:1b",
            "eth1": "0e:24:23:21:16:c1",
            "eth2": "ea:5c:bf:8a:9a:77",
            "eth3": "92:3b:23:33:47:a5",
            "eth4": "a2:b0:6f:65:cf:ef"
        },
        "leaf_2_0_3": {
            "eth0": "56:6d:99:41:f2:6e",
            "eth1": "7e:e1:19:ac:7f:47",
            "eth2": "ba:03:2f:40:16:93",
            "eth3": "ca:a0:04:79:60:3b",
            "eth4": "6e:2f:0f:ff:a6:9e"
        },
        "leaf_2_0_4": {
            "eth0": "42:c4:0a:06:3e:d5",
            "eth1": "22:38:eb:ec:73:4b",
            "eth2": "7e:53:d9:45:13:74",
            "eth3": "6a:44:78:9c:9c:20",
            "eth4": "86:ca:6e:30:de:5c"
        },
        "leaf_3_0_1": {
            "eth0": "ea:ce:25:63:e1:f4",
            "eth1": "02:b6:55:98:1f:8f",
            "eth2": "26:63:5d:06:3f:e6",
            "eth3": "12:fa:8e:8e:82:7b",
            "eth4": "e6:c7:29:3c:b6:30"
        },
        "leaf_3_0_2": {
            "eth0": "c2:a3:1c:cc:28:df",
            "eth1": "76:70:93:5a:e8:a7",
            "eth2": "ca:16:68:ac:09:0d",
            "eth3": "1e:8d:4c:b0:24:42",
            "eth4": "7e:97:90:04:aa:d8"
        },
        "leaf_3_0_3": {
            "eth0": "f6:5b:f0:ef:bd:06",
            "eth1": "5a:59:a5:a2:aa:4b",
            "eth2": "5e:ae:53:f2:c1:94",
            "eth3": "36:6d:27:eb:24:17",
            "eth4": "aa:86:22:ec:40:8d"
        },
        "leaf_3_0_4": {
            "eth0": "c2:b7:76:f1:0b:a7",
            "eth1": "32:e7:15:ca:26:07",
            "eth2": "be:1c:90:2a:d4:30",
            "eth3": "02:1e:e8:0e:42:26",
            "eth4": "3e:3b:95:80:13:05"
        },
        "leaf_4_0_1": {
            "eth0": "ca:9c:31:c7:28:7a",
            "eth1": "4a:48:42:3d:8c:2a",
            "eth2": "0a:2f:1c:63:fe:21",
            "eth3": "be:eb:12:53:1f:b9",
            "eth4": "1a:99:13:5e:8d:53"
        },
        "leaf_4_0_2": {
            "eth0": "e6:b5:4c:70:76:3b",
            "eth1": "e6:32:e0:dd:50:f2",
            "eth2": "02:80:e1:8b:92:42",
            "eth3": "b2:13:66:c0:33:2b",
            "eth4": "9a:51:2b:c2:db:ed"
        },
        "leaf_4_0_3": {
            "eth0": "06:c1:e5:c6:64:cb",
            "eth1": "ae:c1:11:26:a9:71",
            "eth2": "4a:1a:27:76:ef:1c",
            "eth3": "8e:43:a6:16:2c:a6",
            "eth4": "e6:73:fa:99:99:c2"
        },
        "leaf_4_0_4": {
            "eth0": "da:ce:62:db:1b:b0",
            "eth1": "b6:15:65:8a:50:d4",
            "eth2": "7e:30:62:bb:f9:f6",
            "eth3": "7a:79:ed:92:38:e1",
            "eth4": "e2:40:a4:c8:0b:88"
        },
        "spine_1_1_1": {
            "eth0": "fa:3e:25:2e:44:2c",
            "eth1": "7a:9d:ce:f1:0c:3d",
            "eth2": "76:41:f8:9a:2c:76",
            "eth3": "12:4f:03:95:44:fb",
            "eth4": "4a:e2:5a:bf:ae:dd",
            "eth5": "22:ff:d9:ca:08:07",
            "eth6": "96:9d:9a:82:52:d2",
            "eth7": "72:55:6d:74:d9:a8"
        },
        "spine_1_1_2": {
            "eth0": "9a:e9:4b:1d:23:5c",
            "eth1": "4a:df:00:fa:ff:d1",
            "eth2": "46:0b:15:ed:aa:09",
            "eth3": "fa:17:36:72:cd:bd",
            "eth4": "62:10:d1:21:f9:c8",
            "eth5": "8e:90:e8:f6:fe:cb",
            "eth6": "a2:ea:54:26:35:98",
            "eth7": "5a:f9:2b:99:83:eb"
        },
        "spine_1_1_3": {
            "eth0": "da:e8:2b:80:e3:db",
            "eth1": "c2:33:5c:aa:d3:09",
            "eth2": "da:bc:a7:89:e6:f4",
            "eth3": "c2:77:ba:e9:a8:d2",
            "eth4": "6a:de:5e:64:f9:30",
            "eth5": "72:61:be:e8:e0:5d",
            "eth6": "be:50:e2:de:02:58",
            "eth7": "0a:e3:e7:cb:cc:b1"
        },
        "spine_1_1_4": {
            "eth0": "22:9f:0b:61:88:69",
            "eth1": "56:8b:56:51:24:b3",
            "eth2": "fa:e1:e0:fa:dd:05",
            "eth3": "ba:f5:01:7c:fe:84",
            "eth4": "a2:62:63:c6:08:bd",
            "eth5": "ae:53:f8:d8:d1:89",
            "eth6": "a2:a8:ae:2f:ff:78",
            "eth7": "4e:bb:49:31:fd:1e"
        },
        "spine_2_1_1": {
            "eth0": "86:0c:d7:b4:0f:49",
            "eth1": "52:20:21:b9:6e:4e",
            "eth2": "36:11:31:20:12:6c",
            "eth3": "f6:99:77:44:e6:09",
            "eth4": "7a:f1:6d:52:b8:4b",
            "eth5": "0a:f0:0d:8b:09:ca",
            "eth6": "6e:43:ec:e9:81:dd",
            "eth7": "42:56:9f:bf:03:70"
        },
        "spine_2_1_2": {
            "eth0": "5e:8b:9e:82:e9:34",
            "eth1": "62:79:66:c0:60:96",
            "eth2": "a2:06:5e:7e:7a:f4",
            "eth3": "b6:3a:3b:aa:7d:30",
            "eth4": "ba:04:8d:29:a4:2a",
            "eth5": "e2:87:65:79:c3:88",
            "eth6": "f6:9b:ef:7f:ac:c9",
            "eth7": "c6:e5:56:a9:ec:2f"
        },
        "spine_2_1_3": {
            "eth0": "ae:5d:f2:65:1e:f5",
            "eth1": "4e:54:2d:33:3b:76",
            "eth2": "0a:82:19:c3:37:46",
            "eth3": "2e:37:de:3a:f5:d5",
            "eth4": "5e:ca:8c:47:eb:bf",
            "eth5": "c2:d6:16:ee:c7:d9",
            "eth6": "de:13:20:ae:67:18",
            "eth7": "86:c8:0d:0f:27:22"
        },
        "spine_2_1_4": {
            "eth0": "56:8b:85:ea:03:4b",
            "eth1": "2e:06:14:03:d5:ac",
            "eth2": "ea:7c:5e:52:b8:d4",
            "eth3": "56:cf:19:ca:a1:2d",
            "eth4": "fa:86:fe:b2:ca:0e",
            "eth5": "da:cc:3c:ed:75:ac",
            "eth6": "0a:f0:94:5d:4e:3d",
            "eth7": "4a:50:52:11:bd:d7"
        },
        "spine_3_1_1": {
            "eth0": "6e:8c:ba:b6:53:7a",
            "eth1": "0a:7c:f3:11:86:67",
            "eth2": "6e:38:28:a0:17:be",
            "eth3": "02:97:cc:d6:27:5e",
            "eth4": "8e:1f:69:da:95:34",
            "eth5": "7e:72:85:8a:77:8f",
            "eth6": "22:65:8b:37:88:b0",
            "eth7": "52:7c:60:d8:13:7c"
        },
        "spine_3_1_2": {
            "eth0": "22:11:ef:52:ca:85",
            "eth1": "5e:f7:2f:46:e7:28",
            "eth2": "76:1e:e5:be:02:2c",
            "eth3": "b2:0a:bc:f3:0c:53",
            "eth4": "76:88:94:ac:ab:32",
            "eth5": "c6:2b:a6:42:6b:98",
            "eth6": "6e:20:7f:d7:3c:67",
            "eth7": "76:7c:89:98:4f:9f"
        },
        "spine_3_1_3": {
            "eth0": "ea:f3:6d:19:85:b2",
            "eth1": "5a:30:53:cf:a1:b8",
            "eth2": "f6:2b:86:4f:e3:f6",
            "eth3": "d2:64:e1:de:63:bf",
            "eth4": "2e:bb:7a:07:4c:55",
            "eth5": "42:25:2b:15:4a:eb",
            "eth6": "d6:de:fe:5b:52:d6",
            "eth7": "4e:b4:88:84:48:46"
        },
        "spine_3_1_4": {
            "eth0": "c6:68:94:18:30:cd",
            "eth1": "d2:e1:53:93:b2:c4",
            "eth2": "7a:08:88:7e:ba:39",
            "eth3": "66:9f:bc:f0:a8:6f",
            "eth4": "96:45:1a:55:ff:0d",
            "eth5": "26:65:bc:c7:00:ea",
            "eth6": "0a:ad:eb:36:2c:cd",
            "eth7": "4a:6e:81:01:fb:f0"
        },
        "spine_4_1_1": {
            "eth0": "aa:94:c9:3a:b9:34",
            "eth1": "7e:18:ea:0a:a5:a4",
            "eth2": "56:ef:df:58:5f:7a",
            "eth3": "2e:18:b6:38:04:b2",
            "eth4": "e2:45:c4:06:b8:5c",
            "eth5": "4a:e7:8d:98:bc:e9",
            "eth6": "f2:53:a8:fa:a1:9c",
            "eth7": "0a:d7:c7:2a:f6:dc"
        },
        "spine_4_1_2": {
            "eth0": "c2:d0:c1:b2:35:e0",
            "eth1": "9a:ef:c4:b3:9e:00",
            "eth2": "ae:f3:c1:7d:d4:59",
            "eth3": "36:ea:fa:8d:0d:7f",
            "eth4": "9a:a7:30:75:4f:01",
            "eth5": "26:01:ee:15:4c:e5",
            "eth6": "46:8d:9c:61:ba:99",
            "eth7": "66:cf:4c:cd:be:be"
        },
        "spine_4_1_3": {
            "eth0": "de:a9:98:e3:7d:94",
            "eth1": "a6:90:d4:9a:94:89",
            "eth2": "ee:a0:48:c1:17:47",
            "eth3": "76:38:84:3a:9b:e7",
            "eth4": "8a:f4:62:42:ab:36",
            "eth5": "22:8e:42:95:c5:e1",
            "eth6": "9a:7c:7b:44:52:57",
            "eth7": "f6:68:d6:24:cd:6f"
        },
        "spine_4_1_4": {
            "eth0": "9e:3e:0d:da:a8:0c",
            "eth1": "1e:79:ea:d0:2a:da",
            "eth2": "12:86:e5:bb:e1:79",
            "eth3": "2e:9a:75:91:9c:f2",
            "eth4": "42:de:6c:60:62:b0",
            "eth5": "12:12:19:0b:8c:f4",
            "eth6": "9a:b3:26:76:5a:4a",
            "eth7": "c2:ff:8d:a5:44:95"
        },
        "tof_1_2_1": {
            "eth0": "52:ba:37:d4:e8:24",
            "eth1": "c6:6f:df:56:86:58",
            "eth2": "96:56:d8:96:36:b4",
            "eth3": "d6:c8:94:5f:ff:81",
            "eth4": "26:00:1f:99:4c:6f",
            "eth5": "62:90:9d:c5:b2:21",
            "eth6": "76:04:75:87:54:25",
            "eth7": "1a:6e:4d:6d:0c:e1"
        },
        "tof_1_2_2": {
            "eth0": "d6:fe:a9:90:89:33",
            "eth1": "b2:c0:7b:6b:84:07",
            "eth2": "12:53:b4:d5:0c:f5",
            "eth3": "46:60:69:6e:34:ec",
            "eth4": "6a:62:9f:3f:93:ee",
            "eth5": "ce:a1:33:45:69:7c",
            "eth6": "8a:30:2e:42:c2:0d",
            "eth7": "ca:c6:8c:55:c2:64"
        },
        "tof_1_2_3": {
            "eth0": "0e:e0:60:ce:a0:df",
            "eth1": "9a:4e:b2:d6:a8:2e",
            "eth2": "d6:7e:f5:94:a3:17",
            "eth3": "62:74:94:e4:e2:46",
            "eth4": "1e:53:b9:0f:c4:40",
            "eth5": "de:ba:b7:28:3d:b9",
            "eth6": "e6:62:0c:59:4e:c7",
            "eth7": "da:27:3f:44:b0:8f"
        },
        "tof_1_2_4": {
            "eth0": "1a:79:c1:4e:36:33",
            "eth1": "ca:98:a4:f5:b4:03",
            "eth2": "c6:21:24:bd:f7:67",
            "eth3": "52:41:6a:32:af:8c",
            "eth4": "12:9d:0f:5d:b8:3f",
            "eth5": "4e:52:8b:10:03:3f",
            "eth6": "7a:26:91:b8:3b:4a",
            "eth7": "4a:2f:e2:99:79:a4"
        },
        "tof_2_2_1": {
            "eth0": "c6:44:6c:45:87:be",
            "eth1": "16:4e:ab:72:f4:b7",
            "eth2": "fa:28:86:34:f5:ac",
            "eth3": "42:cd:11:f6:d0:5c",
            "eth4": "e6:5c:75:78:b1:8f",
            "eth5": "02:74:f4:da:4c:5a",
            "eth6": "ea:8b:b9:03:79:1b",
            "eth7": "7a:72:87:53:fd:d4"
        },
        "tof_2_2_2": {
            "eth0": "ee:f4:af:75:e6:63",
            "eth1": "6e:67:48:c0:1e:5c",
            "eth2": "b2:3b:f6:56:11:e7",
            "eth3": "fa:0d:cb:5e:a8:8f",
            "eth4": "be:ba:be:e8:2e:50",
            "eth5": "fa:46:aa:4e:33:32",
            "eth6": "56:30:22:c0:ea:f7",
            "eth7": "f2:b9:ea:be:48:bd"
        },
        "tof_2_2_3": {
            "eth0": "6e:f9:f7:bf:60:0f",
            "eth1": "c2:b9:ab:f1:8f:8e",
            "eth2": "ba:d0:78:d9:1c:ee",
            "eth3": "ea:77:a0:cc:f2:9e",
            "eth4": "ba:59:c4:01:6b:2e",
            "eth5": "6a:e5:b7:87:a7:0e",
            "eth6": "fe:f3:ab:95:76:12",
            "eth7": "12:bb:0b:aa:50:6c"
        },
        "tof_2_2_4": {
            "eth0": "82:44:05:0d:7e:97",
            "eth1": "1a:97:6f:ca:85:58",
            "eth2": "76:bd:a4:f1:d6:03",
            "eth3": "ba:ed:3e:01:02:ce",
            "eth4": "9e:c3:61:8f:33:06",
            "eth5": "26:52:1c:95:d4:e8",
            "eth6": "12:1a:e6:79:f0:99",
            "eth7": "2a:13:ec:d9:c3:7e"
        }
    },
    "failed_machine": "leaf_1_0_1",
    "failure_time": {
        "leaf_1_0_1": 1622027439.504567,
        "leaf_1_0_2": 1622027439.5239367,
        "leaf_1_0_3": 1622027439.5395942,
        "leaf_1_0_4": 1622027439.504511,
        "leaf_2_0_1": 1622027439.512772,
        "leaf_2_0_2": 1622027439.527433,
        "leaf_2_0_3": 1622027439.5039937,
        "leaf_2_0_4": 1622027439.525784,
        "leaf_3_0_1": 1622027439.5473666,
        "leaf_3_0_2": 1622027439.504559,
        "leaf_3_0_3": 1622027439.5202217,
        "leaf_3_0_4": 1622027439.539001,
        "leaf_4_0_1": 1622027439.544334,
        "leaf_4_0_2": 1622027439.5603156,
        "leaf_4_0_3": 1622027439.5795975,
        "leaf_4_0_4": 1622027439.550298,
        "spine_1_1_1": 1622027439.5719402,
        "spine_1_1_2": 1622027439.584841,
        "spine_1_1_3": 1622027439.5556078,
        "spine_1_1_4": 1622027439.5748677,
        "spine_2_1_1": 1622027439.5864067,
        "spine_2_1_2": 1622027439.5673718,
        "spine_2_1_3": 1622027439.5862074,
        "spine_2_1_4": 1622027439.594387,
        "spine_3_1_1": 1622027439.6041,
        "spine_3_1_2": 1622027439.6237469,
        "spine_3_1_3": 1622027439.6393654,
        "spine_3_1_4": 1622027439.597111,
        "spine_4_1_1": 1622027439.6138792,
        "spine_4_1_2": 1622027439.6296098,
        "spine_4_1_3": 1622027439.6015673,
        "spine_4_1_4": 1622027439.6235058,
        "tof_1_2_1": 1622027439.6353655,
        "tof_1_2_2": 1622027439.6045196,
        "tof_1_2_3": 1622027439.619336,
        "tof_1_2_4": 1622027439.6437118,
        "tof_2_2_1": 1622027439.641317,
        "tof_2_2_2": 1622027439.6521058,
        "tof_2_2_3": 1622027439.656242,
        "tof_2_2_4": 1622027439.6457827
    }
}