{
    "description": "Scenario 6a: net0 link failure and recovery of leaf_1_0_1 with BGP",
    "k_leaf": 10,
    "k_top": 10,
    "redundancy_factor": 5,
    "is_k8s": true,
    "machine_mac_addresses": {
        "leaf_1_0_1": {
            "net0": "1a:38:bc:cf:6c:23",
            "net1": "c2:ff:7d:d2:ed:9e",
            "net10": "6e:a6:c6:6c:a6:c6",
            "net2": "16:a9:4b:e1:5d:47",
            "net3": "aa:8e:7b:89:97:84",
            "net4": "0a:f6:73:4b:0b:99",
            "net5": "16:b9:06:cd:94:30",
            "net6": "aa:1f:86:8c:89:bf",
            "net7": "ea:4c:da:18:66:ba",
            "net8": "be:15:f8:74:3b:50",
            "net9": "8e:9f:f0:61:b7:89"
        },
        "leaf_1_0_10": {
            "net0": "9e:c7:ed:9e:3c:99",
            "net1": "da:ad:f8:60:3f:30",
            "net10": "56:36:53:72:9f:4c",
            "net2": "e6:b8:7c:dd:ba:db",
            "net3": "7a:61:ab:9f:e8:25",
            "net4": "de:70:7a:37:41:17",
            "net5": "76:38:1a:89:5f:45",
            "net6": "b6:98:c1:a5:cd:9f",
            "net7": "6a:c5:1d:fb:e1:f7",
            "net8": "16:a6:99:60:59:f3",
            "net9": "ba:44:9d:90:88:9d"
        },
        "leaf_1_0_2": {
            "net0": "e6:fb:98:34:9b:fc",
            "net1": "2e:ea:b5:b6:89:e3",
            "net10": "d6:bc:a7:59:67:a8",
            "net2": "82:02:69:13:57:7c",
            "net3": "36:a8:69:e0:f0:dd",
            "net4": "da:e8:01:db:dc:07",
            "net5": "02:c6:42:bb:41:1f",
            "net6": "4e:7e:7d:d2:35:53",
            "net7": "da:c4:70:ad:33:1a",
            "net8": "e6:9d:27:0d:45:b8",
            "net9": "d6:80:06:ac:4f:2f"
        },
        "leaf_1_0_3": {
            "net0": "be:74:ab:30:9a:0a",
            "net1": "2a:89:1c:ad:75:b0",
            "net10": "22:ed:6c:83:36:c5",
            "net2": "c6:8e:bf:10:57:ac",
            "net3": "12:40:f7:5b:a1:d4",
            "net4": "0e:3a:ba:19:23:ee",
            "net5": "5a:f6:71:a1:f8:8a",
            "net6": "42:97:63:6d:c6:d0",
            "net7": "16:5f:0e:67:95:2c",
            "net8": "5e:63:04:0e:d9:cb",
            "net9": "4e:61:34:54:35:94"
        },
        "leaf_1_0_4": {
            "net0": "0a:31:dc:d6:50:76",
            "net1": "da:1a:4d:22:ce:4f",
            "net10": "7a:26:d9:44:37:e7",
            "net2": "7a:11:6f:32:e7:39",
            "net3": "5e:a7:e7:69:f7:20",
            "net4": "1a:b9:a3:c8:a4:e9",
            "net5": "b6:5d:fe:93:fe:55",
            "net6": "b6:ac:74:4a:36:51",
            "net7": "3e:0e:e3:e4:1b:fb",
            "net8": "96:5b:76:97:6b:32",
            "net9": "ca:59:89:ff:44:fb"
        },
        "leaf_1_0_5": {
            "net0": "82:95:21:b7:d1:fe",
            "net1": "e2:93:09:86:ab:ba",
            "net10": "9a:d1:b8:42:df:dc",
            "net2": "4a:d9:b5:d9:40:d4",
            "net3": "2e:ec:18:30:d7:aa",
            "net4": "52:8f:3c:6b:6c:21",
            "net5": "c6:31:6b:3f:d9:c2",
            "net6": "f6:8e:90:e1:31:c5",
            "net7": "62:eb:4d:15:89:33",
            "net8": "fa:9d:02:ee:b3:86",
            "net9": "b6:2f:1b:77:7d:38"
        },
        "leaf_1_0_6": {
            "net0": "ba:4c:2f:6d:8c:71",
            "net1": "26:8d:6f:49:e5:5c",
            "net10": "be:5c:9a:bd:08:41",
            "net2": "f6:f2:be:cb:94:b7",
            "net3": "da:b3:60:b3:8b:63",
            "net4": "8a:c3:5d:0f:3d:3b",
            "net5": "b6:ff:30:d2:13:6d",
            "net6": "0e:07:99:3f:65:5d",
            "net7": "c6:8e:4f:28:50:8a",
            "net8": "1a:1e:e7:60:9e:1a",
            "net9": "ee:39:59:62:bc:34"
        },
        "leaf_1_0_7": {
            "net0": "66:12:ea:4a:11:e5",
            "net1": "de:60:38:5a:79:5f",
            "net10": "1e:3e:2f:19:49:d7",
            "net2": "4a:d6:f9:d0:1d:d0",
            "net3": "06:c3:ed:6a:da:0d",
            "net4": "92:50:79:28:59:16",
            "net5": "b2:04:5b:2b:cf:6e",
            "net6": "8e:c5:b2:2d:9c:f0",
            "net7": "b6:30:16:9d:e8:4e",
            "net8": "76:70:b3:bb:12:ff",
            "net9": "22:28:a3:1e:9b:87"
        },
        "leaf_1_0_8": {
            "net0": "da:1f:97:6c:f9:14",
            "net1": "62:b0:e0:b9:b3:ad",
            "net10": "aa:7a:9e:30:f9:1c",
            "net2": "5e:ea:75:4e:99:24",
            "net3": "2e:dd:7e:ee:8d:ec",
            "net4": "a6:b3:be:6c:ee:aa",
            "net5": "46:f1:b1:f2:4a:ef",
            "net6": "2e:eb:fd:80:35:10",
            "net7": "22:44:e2:c9:dd:a7",
            "net8": "62:31:7e:69:7a:3f",
            "net9": "56:b1:52:5d:05:ff"
        },
        "leaf_1_0_9": {
            "net0": "2e:71:79:a4:ff:60",
            "net1": "9a:be:c8:d5:83:35",
            "net10": "3e:05:5b:6f:78:6b",
            "net2": "72:db:87:d6:74:06",
            "net3": "5a:88:43:7b:f4:50",
            "net4": "d6:1f:7e:59:ea:7b",
            "net5": "e2:92:af:57:96:68",
            "net6": "e6:55:a0:a1:5b:ce",
            "net7": "2e:5e:66:21:fa:22",
            "net8": "8e:a2:72:06:02:ea",
            "net9": "1e:fa:35:63:e6:8b"
        },
        "leaf_2_0_1": {
            "net0": "ba:b2:1e:2a:8d:9b",
            "net1": "c6:30:08:03:52:f5",
            "net10": "a2:5c:18:3d:ed:44",
            "net2": "22:cc:95:9b:ff:a4",
            "net3": "ee:40:84:33:d1:fd",
            "net4": "1a:bc:be:39:bc:b1",
            "net5": "ce:54:90:52:9f:90",
            "net6": "a2:e0:b7:f4:4d:a5",
            "net7": "3e:f2:59:ba:fe:7b",
            "net8": "be:d4:24:8e:b8:e4",
            "net9": "12:ae:7a:fd:0a:a3"
        },
        "leaf_2_0_10": {
            "net0": "16:7e:6f:a6:0b:20",
            "net1": "36:a8:9c:65:6d:65",
            "net10": "c2:cf:cb:5c:6e:e8",
            "net2": "fe:c2:65:81:5f:00",
            "net3": "fe:64:0c:75:c2:21",
            "net4": "de:86:6d:df:5c:a1",
            "net5": "d6:c8:64:52:be:12",
            "net6": "76:d1:ce:62:52:57",
            "net7": "26:72:4a:fd:25:39",
            "net8": "7a:2b:ec:df:2f:b3",
            "net9": "a2:7f:c7:be:89:50"
        },
        "leaf_2_0_2": {
            "net0": "52:19:00:31:bd:05",
            "net1": "e2:ac:91:9a:68:f4",
            "net10": "3e:fb:47:f2:99:1f",
            "net2": "c2:10:67:39:93:2d",
            "net3": "96:6b:03:6b:93:5b",
            "net4": "9a:0d:e2:8a:4e:e6",
            "net5": "7a:24:2f:86:9c:8c",
            "net6": "5e:21:1e:dd:18:c5",
            "net7": "d6:b8:22:52:03:f3",
            "net8": "da:e8:7f:f7:60:9a",
            "net9": "be:91:ae:26:5b:84"
        },
        "leaf_2_0_3": {
            "net0": "46:92:f3:2f:64:ef",
            "net1": "0a:25:5a:1c:0c:13",
            "net10": "8a:03:f1:74:80:1a",
            "net2": "ea:83:37:30:19:4e",
            "net3": "c2:b1:09:a2:7a:c2",
            "net4": "12:2b:2a:92:5d:20",
            "net5": "86:bf:d7:69:5f:34",
            "net6": "a6:08:c3:dd:8b:1d",
            "net7": "ba:06:c0:e0:56:b0",
            "net8": "ce:f2:3c:8c:dc:3a",
            "net9": "02:cb:35:4d:00:4d"
        },
        "leaf_2_0_4": {
            "net0": "f2:05:7a:03:c0:4a",
            "net1": "9a:38:d8:51:56:67",
            "net10": "5a:00:6c:8b:7a:f0",
            "net2": "72:08:a5:2a:35:59",
            "net3": "16:62:60:4c:f8:80",
            "net4": "62:16:db:a4:c5:71",
            "net5": "1e:b2:3a:6e:77:72",
            "net6": "36:ff:0e:86:f5:bc",
            "net7": "be:14:59:7f:ba:7f",
            "net8": "16:03:67:28:4b:ab",
            "net9": "a6:34:c5:7b:6a:31"
        },
        "leaf_2_0_5": {
            "net0": "2e:17:47:a9:67:6e",
            "net1": "ba:cc:83:ca:d0:27",
            "net10": "9e:4a:ba:42:9a:4c",
            "net2": "02:39:ec:de:db:62",
            "net3": "a6:08:0a:79:bb:a7",
            "net4": "92:3a:db:ff:04:18",
            "net5": "2a:47:72:9e:43:5e",
            "net6": "82:40:04:d5:9b:16",
            "net7": "ce:ab:fd:e4:e9:8c",
            "net8": "de:9c:f9:fe:0e:cd",
            "net9": "c2:a5:e9:b2:28:ab"
        },
        "leaf_2_0_6": {
            "net0": "a6:27:a8:17:d3:2e",
            "net1": "9e:da:19:66:84:49",
            "net10": "6a:66:87:46:1b:33",
            "net2": "86:a7:e1:9b:d6:5e",
            "net3": "9e:86:ae:bb:8f:62",
            "net4": "6a:c4:46:c3:aa:64",
            "net5": "56:76:30:51:6e:4c",
            "net6": "7e:d4:2c:ba:d4:42",
            "net7": "2e:d6:ca:23:68:32",
            "net8": "42:5f:3c:61:e2:f1",
            "net9": "6a:9b:50:e1:e3:8f"
        },
        "leaf_2_0_7": {
            "net0": "32:e9:28:6e:fa:87",
            "net1": "7a:23:7c:ed:6b:90",
            "net10": "6e:6b:1e:49:bc:75",
            "net2": "d6:15:96:0d:a1:77",
            "net3": "26:0b:0b:77:3e:17",
            "net4": "82:6c:e8:aa:e2:6d",
            "net5": "da:e5:ba:cc:67:36",
            "net6": "02:f8:cd:9d:2a:ff",
            "net7": "6a:5c:5a:59:ec:d2",
            "net8": "12:5e:e6:30:f2:71",
            "net9": "92:2c:ee:18:40:6e"
        },
        "leaf_2_0_8": {
            "net0": "3a:f3:71:5d:3a:88",
            "net1": "4e:f4:aa:ce:a7:4d",
            "net10": "06:db:b2:a3:64:11",
            "net2": "be:95:d9:a7:af:62",
            "net3": "b6:93:f7:db:11:0a",
            "net4": "de:c3:b5:eb:94:ec",
            "net5": "fa:66:11:9f:6b:22",
            "net6": "86:11:49:a1:61:17",
            "net7": "e6:83:08:c3:a5:e6",
            "net8": "02:13:99:ac:15:44",
            "net9": "e2:1d:45:41:69:c7"
        },
        "leaf_2_0_9": {
            "net0": "ae:ab:cc:81:26:5a",
            "net1": "be:a5:b8:18:df:49",
            "net10": "ee:97:ff:83:cb:65",
            "net2": "aa:a3:1e:b8:27:5f",
            "net3": "6e:8a:66:c8:f8:aa",
            "net4": "9e:13:56:41:03:89",
            "net5": "1e:fc:51:ca:a1:4b",
            "net6": "96:d5:78:a4:fc:f0",
            "net7": "b6:9d:35:3b:21:40",
            "net8": "56:21:09:b9:ae:a3",
            "net9": "02:e1:47:48:f2:79"
        },
        "leaf_3_0_1": {
            "net0": "ae:98:46:30:f9:a0",
            "net1": "d2:9a:b9:70:11:73",
            "net10": "82:47:4e:30:98:bb",
            "net2": "0a:75:da:da:db:34",
            "net3": "76:93:d4:9c:91:49",
            "net4": "be:cf:29:d3:0c:b3",
            "net5": "1e:8a:99:f0:a4:58",
            "net6": "5e:78:63:58:48:a7",
            "net7": "ea:02:e8:da:41:e3",
            "net8": "b2:d1:e8:cb:10:ff",
            "net9": "d6:2d:af:81:47:70"
        },
        "leaf_3_0_10": {
            "net0": "de:87:9e:62:5d:21",
            "net1": "de:c5:64:94:6d:50",
            "net10": "06:95:1a:b1:1a:08",
            "net2": "7a:3a:b4:c7:66:6d",
            "net3": "82:1c:8b:e2:24:14",
            "net4": "06:93:1d:4e:50:1a",
            "net5": "1a:fb:0a:cc:69:c9",
            "net6": "5a:74:e0:63:77:75",
            "net7": "c2:a3:fe:ba:61:c7",
            "net8": "b6:e4:5e:24:58:d9",
            "net9": "5e:5c:89:09:dc:18"
        },
        "leaf_3_0_2": {
            "net0": "e2:c8:81:83:92:d6",
            "net1": "66:26:b2:2e:55:52",
            "net10": "86:df:09:d5:29:2e",
            "net2": "62:15:ac:c2:7e:94",
            "net3": "0a:50:f7:ef:7e:93",
            "net4": "76:cf:5f:b2:47:ef",
            "net5": "fe:08:e2:d8:e7:d1",
            "net6": "92:73:23:e7:9b:ae",
            "net7": "5e:65:29:c3:f4:f7",
            "net8": "02:a5:75:da:8e:b9",
            "net9": "22:67:9d:75:07:62"
        },
        "leaf_3_0_3": {
            "net0": "6a:c0:64:1d:ac:e0",
            "net1": "82:f1:51:94:54:6d",
            "net10": "5a:9d:5f:17:81:ab",
            "net2": "ee:56:7f:90:1f:75",
            "net3": "aa:c4:74:26:3f:77",
            "net4": "52:10:05:fc:b5:f7",
            "net5": "ce:af:72:a0:d0:08",
            "net6": "8e:f3:e8:8f:8f:f9",
            "net7": "26:aa:15:88:11:ba",
            "net8": "ba:c9:14:95:7b:87",
            "net9": "62:8c:3e:86:68:02"
        },
        "leaf_3_0_4": {
            "net0": "fe:4f:1e:dc:b6:4f",
            "net1": "da:56:28:4b:96:80",
            "net10": "2e:41:10:b7:02:89",
            "net2": "ae:6f:11:64:aa:61",
            "net3": "12:a5:c2:27:ca:a6",
            "net4": "52:ad:db:8c:13:a9",
            "net5": "9e:58:6b:58:f3:e1",
            "net6": "fe:19:0a:c1:cd:f9",
            "net7": "c2:93:82:e0:27:60",
            "net8": "76:f2:69:d2:15:1b",
            "net9": "22:e9:5e:e2:e2:03"
        },
        "leaf_3_0_5": {
            "net0": "72:c6:e4:3a:0f:9c",
            "net1": "7e:f5:85:62:9d:9f",
            "net10": "ee:58:cb:c1:c5:e8",
            "net2": "a6:1b:7d:dd:c2:67",
            "net3": "e6:73:7f:6a:55:b4",
            "net4": "e2:3e:58:19:e2:dc",
            "net5": "f2:47:bd:55:47:06",
            "net6": "06:63:f9:da:ba:b8",
            "net7": "d2:28:b6:00:53:d0",
            "net8": "4a:d6:cb:45:e7:36",
            "net9": "32:20:0e:7d:0a:17"
        },
        "leaf_3_0_6": {
            "net0": "16:46:a8:8e:5d:46",
            "net1": "06:fd:73:9b:4e:2d",
            "net10": "22:1f:3b:bc:94:3b",
            "net2": "4e:13:75:86:80:cd",
            "net3": "de:c9:9d:5a:c6:cb",
            "net4": "0e:ed:9b:80:01:9c",
            "net5": "7e:5a:1e:23:29:e9",
            "net6": "7a:9a:0f:f4:5e:2b",
            "net7": "be:db:e8:cb:9f:ee",
            "net8": "2a:50:77:13:ae:c2",
            "net9": "a6:92:6a:82:20:49"
        },
        "leaf_3_0_7": {
            "net0": "da:e0:f7:fe:6c:2e",
            "net1": "2a:0f:62:2f:5b:49",
            "net10": "42:d1:48:2d:75:16",
            "net2": "0e:b6:66:b2:41:4a",
            "net3": "42:af:dd:e2:bd:df",
            "net4": "b6:c1:69:5e:20:f2",
            "net5": "16:c6:f2:8b:ca:97",
            "net6": "46:60:51:3d:25:f1",
            "net7": "1e:b6:28:4f:f9:8a",
            "net8": "42:ac:47:02:c9:6a",
            "net9": "06:b3:c1:6e:06:4a"
        },
        "leaf_3_0_8": {
            "net0": "6e:96:71:3a:1b:f6",
            "net1": "ee:eb:ed:6f:e5:0f",
            "net10": "f6:0b:5c:8d:ea:55",
            "net2": "9e:28:77:c9:65:a6",
            "net3": "4a:e2:12:f4:bc:c1",
            "net4": "d2:16:d7:45:74:3b",
            "net5": "fa:8c:c9:72:54:26",
            "net6": "46:84:b4:be:84:1d",
            "net7": "3a:d7:df:68:9f:5a",
            "net8": "de:ee:ab:c1:50:ac",
            "net9": "62:cc:f2:05:50:29"
        },
        "leaf_3_0_9": {
            "net0": "a6:b1:5c:6b:b5:ed",
            "net1": "72:ee:3b:38:db:a0",
            "net10": "8a:c7:c1:40:3c:6e",
            "net2": "ae:3a:1f:57:ff:42",
            "net3": "12:cc:14:9b:ce:2d",
            "net4": "2e:87:ed:5a:db:35",
            "net5": "5e:3a:4c:47:11:f8",
            "net6": "82:4f:be:8b:cd:4c",
            "net7": "5a:4d:31:a8:b7:80",
            "net8": "ae:ef:e0:7b:3a:e9",
            "net9": "ba:c7:7d:29:da:26"
        },
        "leaf_4_0_1": {
            "net0": "0a:d5:f6:10:5d:8f",
            "net1": "32:1c:01:1f:81:0e",
            "net10": "66:19:38:8a:25:1d",
            "net2": "ba:1a:61:6b:d3:3b",
            "net3": "0e:d3:6d:c5:e8:22",
            "net4": "12:f0:b3:e8:93:f2",
            "net5": "3e:1a:27:22:53:27",
            "net6": "fe:97:6a:50:eb:30",
            "net7": "a2:7e:4e:3d:8e:ed",
            "net8": "32:b0:62:22:df:7d",
            "net9": "3e:bf:f0:fa:68:27"
        },
        "leaf_4_0_10": {
            "net0": "7e:18:71:08:36:9a",
            "net1": "1a:10:4d:a8:ea:28",
            "net10": "5a:bc:bb:2b:9e:1c",
            "net2": "ba:35:d6:61:cd:42",
            "net3": "06:a1:4b:51:d2:3a",
            "net4": "ee:ae:0b:8e:a7:b4",
            "net5": "fe:95:20:32:c5:20",
            "net6": "96:a1:b0:78:dc:dc",
            "net7": "a6:f7:81:17:48:13",
            "net8": "9e:c0:e3:50:b6:47",
            "net9": "d2:ca:8c:05:9d:8c"
        },
        "leaf_4_0_2": {
            "net0": "fe:45:d5:6d:38:03",
            "net1": "72:39:d4:49:58:fc",
            "net10": "9a:86:aa:d0:c5:0c",
            "net2": "ee:31:54:e4:bb:5a",
            "net3": "92:9d:e0:50:89:fe",
            "net4": "de:69:34:ba:8a:bf",
            "net5": "72:81:74:a1:b5:1f",
            "net6": "72:de:96:f8:9d:b2",
            "net7": "e2:8f:87:a4:24:01",
            "net8": "36:5c:b3:20:36:4d",
            "net9": "16:8f:69:d9:c3:8a"
        },
        "leaf_4_0_3": {
            "net0": "ba:73:d4:27:61:0c",
            "net1": "4e:5a:d9:23:3e:f4",
            "net10": "86:a7:3b:ec:8c:dc",
            "net2": "26:84:66:07:0a:f5",
            "net3": "46:3e:6b:83:6b:7c",
            "net4": "0e:63:da:d9:3a:93",
            "net5": "92:7f:f2:ae:cb:31",
            "net6": "06:6e:86:b3:8e:64",
            "net7": "d6:aa:85:65:68:5a",
            "net8": "82:71:b3:60:6a:a1",
            "net9": "72:3f:5d:fe:f5:fb"
        },
        "leaf_4_0_4": {
            "net0": "e6:9b:4f:62:fa:e1",
            "net1": "96:88:a5:25:37:ac",
            "net10": "7a:34:c3:01:2c:b8",
            "net2": "46:da:ee:81:d2:17",
            "net3": "ee:e1:95:cd:8a:1d",
            "net4": "9a:ce:3c:9a:6d:53",
            "net5": "f6:4a:44:ba:46:6e",
            "net6": "ba:ad:cc:dd:b6:a2",
            "net7": "2e:c7:ea:67:69:54",
            "net8": "2a:52:da:30:69:94",
            "net9": "2e:35:74:80:b0:dd"
        },
        "leaf_4_0_5": {
            "net0": "16:5f:a6:e7:e9:77",
            "net1": "6a:d4:8a:65:7a:cb",
            "net10": "b2:01:fb:5a:63:c9",
            "net2": "c6:ae:00:34:3a:9d",
            "net3": "da:cb:69:bc:9f:36",
            "net4": "1a:2e:ca:62:64:bc",
            "net5": "f6:a1:40:28:89:95",
            "net6": "4e:6b:91:6e:e1:ea",
            "net7": "42:44:6e:57:ba:0e",
            "net8": "1e:c5:fb:a7:27:4b",
            "net9": "3a:b6:15:fb:76:0d"
        },
        "leaf_4_0_6": {
            "net0": "8a:e3:bc:ef:1d:22",
            "net1": "82:0b:dc:7e:eb:34",
            "net10": "ee:7f:16:15:87:ac",
            "net2": "c6:65:c1:1a:87:92",
            "net3": "7a:3e:8b:0c:62:62",
            "net4": "02:ff:cc:15:d2:30",
            "net5": "4a:d6:6a:3b:9f:b4",
            "net6": "9e:3e:44:99:85:a8",
            "net7": "9a:2d:7e:a0:10:0d",
            "net8": "ea:2a:9b:92:ef:b9",
            "net9": "d6:90:47:55:ad:0e"
        },
        "leaf_4_0_7": {
            "net0": "be:7a:61:20:97:78",
            "net1": "ce:08:e4:e5:b1:f0",
            "net10": "62:0a:f7:9b:62:e6",
            "net2": "f2:cf:44:b4:9a:8d",
            "net3": "0a:f4:3b:b5:30:96",
            "net4": "86:63:b2:45:14:ed",
            "net5": "36:87:d9:99:79:f1",
            "net6": "6a:a6:4f:14:8b:d0",
            "net7": "b6:69:72:a3:d0:48",
            "net8": "9a:9e:10:11:c2:6d",
            "net9": "4e:6f:94:59:8b:46"
        },
        "leaf_4_0_8": {
            "net0": "42:72:b9:93:03:44",
            "net1": "4a:3b:4f:07:5c:5e",
            "net10": "76:fb:93:bc:c3:e3",
            "net2": "1a:8d:30:ea:4e:88",
            "net3": "92:35:c7:72:a7:af",
            "net4": "6a:24:51:bd:be:4b",
            "net5": "c2:47:2e:79:55:36",
            "net6": "7a:f7:f4:a3:40:8d",
            "net7": "4a:dd:99:db:32:fb",
            "net8": "0e:a4:dd:23:e5:c3",
            "net9": "aa:3f:08:f6:98:0a"
        },
        "leaf_4_0_9": {
            "net0": "7e:9e:67:f3:95:0c",
            "net1": "d6:0e:34:be:e1:c6",
            "net10": "3a:41:c4:0a:dd:01",
            "net2": "62:57:8b:cc:b4:f2",
            "net3": "ee:f7:bb:7c:fd:3d",
            "net4": "6e:59:b1:dd:82:7c",
            "net5": "2e:aa:fe:5b:fd:c4",
            "net6": "36:70:67:42:54:02",
            "net7": "66:a7:6a:8a:c9:d1",
            "net8": "22:2d:77:63:68:31",
            "net9": "7a:bd:f7:70:84:38"
        },
        "spine_1_1_1": {
            "net0": "7e:92:0c:33:c5:ad",
            "net1": "2a:c0:ad:2f:8b:79",
            "net10": "b2:f5:96:53:91:50",
            "net11": "ce:92:a3:cf:8d:66",
            "net12": "aa:c5:35:37:6d:c0",
            "net13": "3e:41:71:ef:65:55",
            "net14": "2a:e6:a2:b4:1c:84",
            "net15": "02:02:b7:b6:26:0d",
            "net16": "e6:cf:c0:53:e6:fe",
            "net17": "ca:92:21:07:bb:3e",
            "net18": "66:aa:33:38:ae:87",
            "net19": "da:91:d9:72:71:64",
            "net2": "f6:96:93:5e:97:f4",
            "net3": "7e:30:3a:57:dd:3d",
            "net4": "ca:29:5b:c2:5c:a1",
            "net5": "aa:39:d7:48:1e:be",
            "net6": "7a:68:55:b5:a8:f9",
            "net7": "0e:a6:fb:0a:fa:a1",
            "net8": "f6:f5:84:ba:14:f0",
            "net9": "72:f0:d1:64:dd:66"
        },
        "spine_1_1_10": {
            "net0": "3a:16:66:f5:97:c4",
            "net1": "32:8b:bc:ad:38:ec",
            "net10": "f2:08:e4:20:fd:15",
            "net11": "8e:fd:a0:0c:d8:72",
            "net12": "1e:86:ac:9f:76:27",
            "net13": "da:d2:f9:e0:83:82",
            "net14": "06:fe:ca:17:28:0c",
            "net15": "62:32:d6:5d:26:aa",
            "net16": "de:83:c6:eb:0b:a7",
            "net17": "1a:c8:29:a0:ec:f1",
            "net18": "0a:09:ea:c5:11:ee",
            "net19": "4a:56:1a:8e:a8:4f",
            "net2": "2e:ab:03:12:5f:68",
            "net3": "3e:f7:91:17:18:80",
            "net4": "ce:ff:cd:60:2d:f0",
            "net5": "56:c9:79:09:38:59",
            "net6": "42:38:71:8e:ef:76",
            "net7": "32:24:b6:94:8c:7f",
            "net8": "1a:41:e7:4e:da:a1",
            "net9": "ee:07:4b:68:f2:fc"
        },
        "spine_1_1_2": {
            "net0": "02:1f:1d:13:b9:3f",
            "net1": "72:34:18:d0:fc:6d",
            "net10": "3a:75:01:63:dd:82",
            "net11": "be:55:4e:df:35:d7",
            "net12": "92:85:dd:ce:76:14",
            "net13": "e2:df:c4:a9:e0:6c",
            "net14": "b6:62:a1:c5:84:51",
            "net15": "3a:0e:9f:9f:a5:ed",
            "net16": "d2:58:d2:9c:7b:c4",
            "net17": "0a:68:c6:88:9b:50",
            "net18": "32:e6:f5:39:6b:1f",
            "net19": "4e:2a:36:2e:15:1c",
            "net2": "12:20:15:b7:95:f1",
            "net3": "f2:8d:fa:c4:b3:1a",
            "net4": "d2:c0:bf:0c:f2:d6",
            "net5": "96:02:a6:19:00:b3",
            "net6": "96:e9:c3:d2:df:8c",
            "net7": "ba:98:d4:3e:c6:38",
            "net8": "32:f3:85:eb:bc:1e",
            "net9": "4e:a5:5d:f5:1c:78"
        },
        "spine_1_1_3": {
            "net0": "1e:fa:92:39:68:b0",
            "net1": "6a:89:b9:62:12:81",
            "net10": "06:2a:72:8b:72:c6",
            "net11": "16:dd:90:48:89:80",
            "net12": "e6:bf:6e:5e:35:f5",
            "net13": "4e:be:c1:74:a6:25",
            "net14": "5a:16:4d:61:37:26",
            "net15": "8a:91:11:c0:4f:f1",
            "net16": "8a:3c:34:16:86:19",
            "net17": "02:d0:e3:c0:2a:c5",
            "net18": "f2:ef:45:1c:4c:55",
            "net19": "52:f0:01:cb:cc:d1",
            "net2": "72:bd:7f:5d:8a:17",
            "net3": "82:c3:65:a0:bc:ea",
            "net4": "26:41:8f:aa:85:b4",
            "net5": "86:84:c1:47:1b:e8",
            "net6": "d6:1c:84:d6:3a:ff",
            "net7": "56:27:09:66:94:89",
            "net8": "ea:e4:ac:ad:74:ed",
            "net9": "2e:03:27:a0:c2:0a"
        },
        "spine_1_1_4": {
            "net0": "2a:aa:e4:fb:ee:26",
            "net1": "66:6e:4a:4e:91:7e",
            "net10": "2a:47:9e:38:22:1d",
            "net11": "ce:03:ee:9f:ba:11",
            "net12": "96:18:c2:7c:c8:8e",
            "net13": "ca:dd:0e:f9:a8:23",
            "net14": "76:99:d5:51:a8:37",
            "net15": "4e:83:23:3f:43:61",
            "net16": "92:9d:61:ee:87:fa",
            "net17": "fa:c7:1f:a2:7a:c2",
            "net18": "2e:b8:83:f5:6c:76",
            "net19": "3e:f9:a5:fb:74:31",
            "net2": "9a:7b:7e:a7:5d:3c",
            "net3": "22:12:64:fc:22:03",
            "net4": "2a:68:f7:05:cd:cd",
            "net5": "3a:9d:ca:0d:99:37",
            "net6": "e2:e8:48:bb:e9:84",
            "net7": "e6:a1:c2:73:e9:d1",
            "net8": "2a:da:dd:0f:0a:b3",
            "net9": "8a:e6:36:7b:8a:b4"
        },
        "spine_1_1_5": {
            "net0": "02:61:a9:77:33:4c",
            "net1": "de:c1:65:01:87:78",
            "net10": "62:fa:87:fd:77:13",
            "net11": "4a:38:86:ac:1f:d8",
            "net12": "2a:64:5b:aa:a2:a7",
            "net13": "b2:78:d7:cc:cd:2e",
            "net14": "be:1d:45:e8:14:6a",
            "net15": "a6:04:a7:5a:ff:7f",
            "net16": "42:9a:f6:30:4d:47",
            "net17": "02:30:51:ea:63:99",
            "net18": "a2:5d:ba:5a:48:35",
            "net19": "32:df:55:cc:fd:22",
            "net2": "0e:4d:de:4c:b9:b0",
            "net3": "f6:09:95:75:9d:0c",
            "net4": "92:79:87:63:9c:65",
            "net5": "ca:b9:97:c2:6a:29",
            "net6": "be:14:2a:7f:83:0b",
            "net7": "82:8f:aa:ad:23:39",
            "net8": "5e:11:3d:ec:43:89",
            "net9": "2e:21:ab:2b:58:a6"
        },
        "spine_1_1_6": {
            "net0": "0a:74:e4:84:3b:b9",
            "net1": "12:6e:28:a6:6f:84",
            "net10": "2e:e0:0a:02:b6:1a",
            "net11": "a6:2f:94:b1:46:44",
            "net12": "fe:46:6e:0c:e1:49",
            "net13": "3a:55:29:f3:e3:b4",
            "net14": "96:3d:77:09:66:1e",
            "net15": "9e:fb:d6:5b:7f:61",
            "net16": "26:73:2b:39:3b:4d",
            "net17": "12:ad:d9:4c:1e:dc",
            "net18": "02:41:86:ac:70:0c",
            "net19": "6a:77:dc:86:c5:4d",
            "net2": "9e:e5:81:5b:0e:0f",
            "net3": "22:31:33:76:de:c5",
            "net4": "fa:6e:cd:ee:7e:fc",
            "net5": "d2:5a:87:95:bc:21",
            "net6": "86:aa:29:c4:92:87",
            "net7": "aa:12:a7:f9:06:9e",
            "net8": "56:7b:f1:d9:c1:b8",
            "net9": "12:c5:3f:f0:de:96"
        },
        "spine_1_1_7": {
            "net0": "96:3c:8c:d8:27:11",
            "net1": "de:eb:32:73:6a:10",
            "net10": "b6:56:19:9c:e5:21",
            "net11": "fa:91:43:89:c0:e4",
            "net12": "16:73:e4:d5:ec:b4",
            "net13": "9a:b9:09:a1:d4:64",
            "net14": "7e:94:be:59:09:d7",
            "net15": "a2:ac:49:03:04:b2",
            "net16": "72:bd:b7:e3:32:70",
            "net17": "ae:89:48:ec:b9:80",
            "net18": "92:0f:bc:56:c9:64",
            "net19": "2e:de:b1:35:99:67",
            "net2": "7a:22:e4:b8:10:79",
            "net3": "ce:ae:49:3d:09:c8",
            "net4": "8a:34:a0:7e:8f:27",
            "net5": "8a:7b:29:a5:ed:8f",
            "net6": "ee:7d:7e:f3:76:19",
            "net7": "e2:6c:12:40:5a:b5",
            "net8": "02:76:a5:0d:53:8d",
            "net9": "42:b6:d6:39:e2:81"
        },
        "spine_1_1_8": {
            "net0": "be:b1:01:8d:56:d3",
            "net1": "d6:21:22:f4:c8:63",
            "net10": "7a:8d:57:db:0e:3a",
            "net11": "8e:aa:0a:d6:bc:fa",
            "net12": "e6:09:c9:7d:b6:d1",
            "net13": "76:f8:36:d1:25:81",
            "net14": "de:32:99:6f:92:da",
            "net15": "56:d0:be:c4:74:b1",
            "net16": "02:dd:74:4f:79:b0",
            "net17": "4a:35:fc:af:18:99",
            "net18": "0a:2f:41:ba:d9:ad",
            "net19": "96:5e:45:79:aa:4d",
            "net2": "5e:f6:95:d1:e8:b0",
            "net3": "4a:60:89:b4:b3:1d",
            "net4": "fe:7d:38:8c:d1:14",
            "net5": "fe:9f:47:33:4f:52",
            "net6": "02:c5:99:c3:2b:43",
            "net7": "86:9a:fe:0f:0e:72",
            "net8": "f6:11:e2:61:80:e1",
            "net9": "fa:01:3a:c4:df:e9"
        },
        "spine_1_1_9": {
            "net0": "16:bb:ac:71:1c:97",
            "net1": "5a:94:53:4c:65:d1",
            "net10": "c2:4f:2f:4f:b1:04",
            "net11": "06:da:39:5c:19:21",
            "net12": "1e:c1:06:96:0e:33",
            "net13": "3a:5b:75:84:6a:ed",
            "net14": "e2:e6:16:6d:a3:e2",
            "net15": "ce:b7:ed:33:3e:bc",
            "net16": "8a:93:64:cc:45:4f",
            "net17": "02:a9:e2:b2:09:94",
            "net18": "96:8a:12:84:18:5f",
            "net19": "ca:51:ea:fd:26:9c",
            "net2": "36:93:f0:c4:07:fb",
            "net3": "c6:16:4e:62:4b:76",
            "net4": "42:86:4a:65:91:c0",
            "net5": "be:1e:27:98:52:a1",
            "net6": "b2:31:aa:f6:2e:66",
            "net7": "f6:fb:4a:2f:e9:92",
            "net8": "22:86:6e:48:80:c0",
            "net9": "fe:2e:11:53:07:b8"
        },
        "spine_2_1_1": {
            "net0": "92:c6:28:72:f4:62",
            "net1": "fe:2d:96:70:d2:68",
            "net10": "7e:53:4d:a0:01:42",
            "net11": "9e:2f:7b:da:1c:a4",
            "net12": "5a:3e:18:ec:30:38",
            "net13": "3e:a4:d6:a0:e2:f0",
            "net14": "c2:ef:e4:b9:9f:96",
            "net15": "76:22:55:22:db:e4",
            "net16": "ae:55:c3:af:46:ac",
            "net17": "4a:5a:95:98:77:a7",
            "net18": "fe:12:69:dc:ef:99",
            "net19": "ca:6a:04:45:b3:a0",
            "net2": "82:5f:70:cf:76:2a",
            "net3": "c6:90:10:23:7e:b4",
            "net4": "92:14:28:ef:c5:06",
            "net5": "e2:34:da:fd:fc:36",
            "net6": "a2:af:ed:e8:c0:59",
            "net7": "de:ed:18:bc:cc:a9",
            "net8": "1e:24:59:c8:de:19",
            "net9": "16:40:cc:c4:9b:d2"
        },
        "spine_2_1_10": {
            "net0": "16:b8:6c:20:e9:44",
            "net1": "02:97:cb:23:e0:15",
            "net10": "f6:d8:87:9b:52:96",
            "net11": "c2:51:4a:d3:a5:36",
            "net12": "46:49:4b:48:93:44",
            "net13": "ea:5e:06:8c:d0:d8",
            "net14": "6e:73:b5:f4:15:62",
            "net15": "26:22:79:90:24:0e",
            "net16": "22:b2:e6:ec:1c:00",
            "net17": "e2:ff:79:be:3a:c6",
            "net18": "b6:d3:b3:62:2c:b1",
            "net19": "8a:35:ac:55:dd:b3",
            "net2": "e6:47:bf:91:c9:50",
            "net3": "36:d9:45:f4:e5:bb",
            "net4": "3a:2a:d4:8e:35:09",
            "net5": "ee:05:e9:a1:db:bb",
            "net6": "a6:12:26:45:39:27",
            "net7": "c6:3e:6e:d6:b1:5d",
            "net8": "7e:74:5c:ad:2a:c5",
            "net9": "06:43:3a:ce:1e:a2"
        },
        "spine_2_1_2": {
            "net0": "42:ec:c8:94:7e:47",
            "net1": "22:78:d1:b3:5e:73",
            "net10": "22:95:ce:92:56:35",
            "net11": "5e:42:10:79:42:3a",
            "net12": "4e:e4:3c:fa:c9:4c",
            "net13": "76:03:ac:1e:c8:d2",
            "net14": "92:1a:dc:2e:7e:8b",
            "net15": "7a:e4:f6:9c:31:10",
            "net16": "36:ed:f8:94:e7:8c",
            "net17": "ae:b4:da:f1:a5:30",
            "net18": "ce:9f:38:ff:93:8f",
            "net19": "e2:ee:5d:b1:aa:27",
            "net2": "32:de:ae:45:67:95",
            "net3": "c6:29:62:3e:9f:7c",
            "net4": "96:26:96:cd:b6:c1",
            "net5": "6e:93:4f:52:35:c8",
            "net6": "a2:06:22:75:85:85",
            "net7": "86:a3:fc:1b:d6:20",
            "net8": "82:a9:5f:81:f3:83",
            "net9": "46:06:81:64:8e:1c"
        },
        "spine_2_1_3": {
            "net0": "ee:bd:e0:08:b7:36",
            "net1": "26:af:ec:a6:16:a0",
            "net10": "b6:cf:e4:2a:51:64",
            "net11": "1a:f3:54:89:06:94",
            "net12": "2e:18:4d:9e:00:db",
            "net13": "aa:d3:b3:20:e6:3d",
            "net14": "42:33:49:a9:84:23",
            "net15": "6e:d1:fa:cd:f9:9b",
            "net16": "d2:64:54:e0:08:f2",
            "net17": "7e:4e:7c:71:59:b8",
            "net18": "0a:ba:56:5e:a7:23",
            "net19": "d2:b8:85:ad:81:58",
            "net2": "d2:43:13:ce:67:ba",
            "net3": "22:0d:33:ce:f3:c4",
            "net4": "16:59:4e:ac:72:a0",
            "net5": "9a:a0:03:7a:a4:91",
            "net6": "7e:9c:7a:2a:52:a0",
            "net7": "26:9f:ac:ec:97:93",
            "net8": "12:fb:3c:8d:7a:b8",
            "net9": "ea:30:39:e7:47:fc"
        },
        "spine_2_1_4": {
            "net0": "f2:b0:fb:3f:3e:ef",
            "net1": "1e:73:e3:f1:64:38",
            "net10": "fa:6b:2a:ca:cf:d0",
            "net11": "86:c4:b6:d4:17:ad",
            "net12": "a2:06:8a:fe:81:a6",
            "net13": "6e:2a:72:7a:72:df",
            "net14": "a2:30:b9:06:b6:72",
            "net15": "5a:92:d6:d3:28:d5",
            "net16": "82:52:e6:e5:aa:e5",
            "net17": "12:7c:35:e7:1e:11",
            "net18": "46:1e:ec:c3:05:16",
            "net19": "46:7f:33:be:9e:39",
            "net2": "fe:e7:26:b7:fd:4d",
            "net3": "92:7b:6f:93:b6:4f",
            "net4": "e6:32:04:a9:dd:ce",
            "net5": "26:50:a8:28:3c:3c",
            "net6": "7a:c2:00:1f:23:35",
            "net7": "02:0d:28:5d:c0:ad",
            "net8": "c2:a5:be:ac:d8:36",
            "net9": "6a:0e:85:7a:42:11"
        },
        "spine_2_1_5": {
            "net0": "a2:97:e5:f0:c8:d3",
            "net1": "96:28:2e:18:68:64",
            "net10": "ae:93:12:31:2f:04",
            "net11": "ee:40:a9:44:e8:e9",
            "net12": "12:47:8e:ed:b1:e0",
            "net13": "0a:26:bb:06:0f:9c",
            "net14": "7a:2a:3e:dc:01:3d",
            "net15": "2e:e8:c7:fd:43:f0",
            "net16": "76:04:50:e1:c1:27",
            "net17": "36:f0:ca:29:7c:b3",
            "net18": "66:93:c2:0d:c6:8b",
            "net19": "b2:bd:5d:85:29:da",
            "net2": "4e:72:2d:88:61:b1",
            "net3": "fa:44:ab:24:2f:03",
            "net4": "de:29:20:e8:84:e4",
            "net5": "6a:fa:01:c7:c7:79",
            "net6": "66:91:ca:11:56:2e",
            "net7": "92:1a:ff:43:f3:0e",
            "net8": "f6:47:79:8e:43:61",
            "net9": "be:2f:7f:28:cd:aa"
        },
        "spine_2_1_6": {
            "net0": "fe:f6:8d:bd:08:d2",
            "net1": "1e:3e:3e:75:f0:41",
            "net10": "ea:63:6e:eb:68:a7",
            "net11": "2a:be:21:bf:e2:99",
            "net12": "4e:bd:d4:99:b3:f0",
            "net13": "82:38:f6:5d:1f:a8",
            "net14": "6a:4f:17:e5:69:6e",
            "net15": "ee:5b:cb:56:41:69",
            "net16": "2e:79:a6:3c:e0:2a",
            "net17": "56:3c:c2:e8:6d:b5",
            "net18": "da:50:25:62:3f:77",
            "net19": "1a:91:2a:ce:de:bc",
            "net2": "e2:61:45:a7:32:a8",
            "net3": "4e:d3:f6:52:1e:e1",
            "net4": "aa:12:d1:f8:56:f5",
            "net5": "c2:4d:53:5d:b3:f6",
            "net6": "1e:11:d0:b0:f4:6f",
            "net7": "32:01:50:d5:95:c0",
            "net8": "1e:9b:61:5e:69:c7",
            "net9": "36:7e:a2:d3:7d:42"
        },
        "spine_2_1_7": {
            "net0": "be:48:78:b4:f3:82",
            "net1": "22:7d:43:e0:14:e2",
            "net10": "5e:4b:6f:10:15:ad",
            "net11": "ae:bb:6f:dd:e4:4d",
            "net12": "fe:e8:4f:1e:42:95",
            "net13": "ee:5b:10:c2:72:77",
            "net14": "fe:49:4e:9b:a0:16",
            "net15": "e6:33:96:2e:02:6d",
            "net16": "46:27:7c:34:4a:66",
            "net17": "86:9c:e0:06:df:04",
            "net18": "c6:cc:db:f2:6d:44",
            "net19": "96:10:30:92:08:21",
            "net2": "3e:13:15:33:53:05",
            "net3": "1a:ef:67:96:ba:82",
            "net4": "e2:2b:ef:7a:ab:45",
            "net5": "f2:95:d4:01:5d:50",
            "net6": "7e:e0:49:e4:98:2f",
            "net7": "f2:d8:83:ad:5f:aa",
            "net8": "6e:66:f7:ee:35:20",
            "net9": "4a:bb:53:d5:55:ab"
        },
        "spine_2_1_8": {
            "net0": "1e:c4:7b:6f:c8:2f",
            "net1": "42:83:50:73:62:b8",
            "net10": "e6:67:db:72:bf:ba",
            "net11": "36:7e:42:24:87:79",
            "net12": "f6:34:d0:44:8b:02",
            "net13": "3e:3f:25:b1:58:3f",
            "net14": "6e:9e:30:2d:85:8b",
            "net15": "c6:f4:2e:aa:85:47",
            "net16": "be:f9:28:89:dc:e8",
            "net17": "1a:4d:32:41:c1:e5",
            "net18": "0a:e3:ee:42:3f:0e",
            "net19": "da:60:27:0f:26:15",
            "net2": "56:6b:fe:0e:e8:4e",
            "net3": "4e:f2:c5:3a:69:3a",
            "net4": "3a:69:a3:57:0c:be",
            "net5": "c6:c5:80:74:83:fb",
            "net6": "ce:a3:1b:01:24:c6",
            "net7": "ce:22:35:b9:7a:c2",
            "net8": "c6:86:75:94:63:ea",
            "net9": "2a:e4:aa:25:1c:b2"
        },
        "spine_2_1_9": {
            "net0": "26:06:4a:a1:4a:56",
            "net1": "2a:36:07:2a:b9:6b",
            "net10": "3a:40:1a:df:d6:99",
            "net11": "f2:aa:58:ad:a2:12",
            "net12": "c6:25:f0:84:c3:71",
            "net13": "36:f3:2b:11:73:66",
            "net14": "0a:a0:15:30:48:5b",
            "net15": "6a:92:e4:71:5d:a7",
            "net16": "2a:3e:9c:72:59:71",
            "net17": "d2:42:e7:91:91:4e",
            "net18": "de:d4:12:7e:ff:f3",
            "net19": "e6:30:9e:6f:8b:97",
            "net2": "56:c7:29:bc:c2:e8",
            "net3": "a2:b6:58:de:dc:83",
            "net4": "72:0d:b0:97:a5:03",
            "net5": "4a:8f:6d:84:0d:60",
            "net6": "fa:8b:6d:b1:a0:19",
            "net7": "be:86:74:ee:3f:17",
            "net8": "8a:b6:28:e8:87:5c",
            "net9": "d6:aa:da:28:6f:42"
        },
        "spine_3_1_1": {
            "net0": "a2:3d:dd:55:d2:7c",
            "net1": "1e:db:d3:19:93:41",
            "net10": "8e:60:c6:b6:8c:71",
            "net11": "9a:bb:b9:91:2a:f5",
            "net12": "42:23:ce:a6:40:f2",
            "net13": "62:95:9e:51:f4:34",
            "net14": "02:c5:f1:f4:3f:77",
            "net15": "ea:a7:dc:27:92:df",
            "net16": "4a:43:84:46:3d:df",
            "net17": "6a:6e:e9:0b:a1:73",
            "net18": "5e:89:ab:26:72:29",
            "net19": "86:4c:8f:18:fd:32",
            "net2": "06:3a:b0:2e:8a:72",
            "net3": "d6:2d:b2:3d:88:c2",
            "net4": "ca:a9:04:80:b6:8b",
            "net5": "fe:b0:49:39:16:70",
            "net6": "96:ae:a8:7c:fa:53",
            "net7": "a6:ca:8e:67:3c:46",
            "net8": "7e:7d:ff:9c:02:17",
            "net9": "72:c5:77:5c:e2:c8"
        },
        "spine_3_1_10": {
            "net0": "6e:d1:90:5d:63:98",
            "net1": "56:9e:38:77:f0:cd",
            "net10": "5e:5c:e4:26:ec:65",
            "net11": "ae:e4:1f:fd:fd:90",
            "net12": "1a:8f:a9:60:6f:53",
            "net13": "d6:fb:bf:ff:fe:22",
            "net14": "5a:d3:cb:f6:e4:a8",
            "net15": "e2:be:46:78:fa:2e",
            "net16": "c2:36:2f:f8:a3:ad",
            "net17": "ce:17:57:86:21:a5",
            "net18": "86:53:89:e2:29:c0",
            "net19": "da:28:50:ff:8f:98",
            "net2": "da:30:76:cb:6d:2c",
            "net3": "ea:75:e2:24:3b:0d",
            "net4": "12:8d:93:e5:4e:28",
            "net5": "f6:b2:19:a7:1f:9b",
            "net6": "0a:ae:46:a3:38:f7",
            "net7": "3e:28:d2:92:5a:43",
            "net8": "d2:35:6d:f8:5f:1c",
            "net9": "e6:ff:b6:6d:18:90"
        },
        "spine_3_1_2": {
            "net0": "2e:88:1b:fc:87:56",
            "net1": "b2:95:9e:87:e0:7c",
            "net10": "c2:73:4a:6d:b9:0d",
            "net11": "4a:be:07:01:b9:36",
            "net12": "46:ca:5e:04:81:c2",
            "net13": "82:8b:e1:65:1e:78",
            "net14": "1a:34:18:de:66:e1",
            "net15": "f6:1d:6d:60:64:49",
            "net16": "9a:3e:48:04:54:14",
            "net17": "3e:75:26:95:ea:ce",
            "net18": "a6:2f:46:f0:86:9e",
            "net19": "92:47:04:1a:ac:0a",
            "net2": "a2:6d:3c:2d:0b:ba",
            "net3": "3a:39:2a:43:f3:4d",
            "net4": "52:30:86:ba:fe:b7",
            "net5": "ae:b3:df:15:a6:26",
            "net6": "b2:96:0d:bb:c3:2d",
            "net7": "7a:55:d2:b4:99:35",
            "net8": "da:25:d4:82:6b:6c",
            "net9": "7a:a5:ba:58:f9:d5"
        },
        "spine_3_1_3": {
            "net0": "aa:9f:ae:fa:f4:8e",
            "net1": "9a:80:c1:ce:78:ae",
            "net10": "f2:6d:a3:3d:04:00",
            "net11": "d2:ed:4a:fc:4c:44",
            "net12": "4e:22:18:65:e6:49",
            "net13": "66:ce:de:f3:e0:5d",
            "net14": "2a:a3:31:0a:f6:29",
            "net15": "62:02:7c:9d:a0:53",
            "net16": "d2:8d:ae:48:c2:fc",
            "net17": "52:03:0f:ce:b5:1e",
            "net18": "be:4e:26:00:9c:f5",
            "net19": "0e:ac:19:f9:23:41",
            "net2": "16:ad:04:c7:43:b4",
            "net3": "5a:d5:1b:0d:a7:42",
            "net4": "02:3a:5b:cc:5c:c9",
            "net5": "92:34:a2:6a:3f:7b",
            "net6": "9e:ed:0f:4a:c2:c3",
            "net7": "66:01:a8:9f:7c:0f",
            "net8": "f2:63:88:56:e8:27",
            "net9": "d6:2e:b8:5f:c7:86"
        },
        "spine_3_1_4": {
            "net0": "e6:1e:7a:33:fa:46",
            "net1": "b2:7f:ee:b3:3a:1c",
            "net10": "22:34:25:2e:88:5f",
            "net11": "7a:22:b5:d7:a7:77",
            "net12": "1a:1e:48:1f:14:8a",
            "net13": "6e:3c:21:a6:2f:8e",
            "net14": "72:5c:01:0e:4a:bf",
            "net15": "5e:70:d3:71:df:9d",
            "net16": "da:e4:2b:98:6a:07",
            "net17": "9e:fe:67:9b:83:cf",
            "net18": "4a:3a:40:07:33:f4",
            "net19": "ea:04:b7:b8:cd:1e",
            "net2": "fe:b8:af:64:17:04",
            "net3": "b2:c2:5b:1f:62:4f",
            "net4": "76:cd:4c:ce:3b:79",
            "net5": "4e:23:68:df:cb:68",
            "net6": "3e:b4:87:8e:41:28",
            "net7": "16:17:24:93:8e:41",
            "net8": "b6:bc:d5:f5:07:b2",
            "net9": "36:ce:4e:26:5a:09"
        },
        "spine_3_1_5": {
            "net0": "36:04:7b:e8:93:a8",
            "net1": "d2:a2:3d:2d:7f:85",
            "net10": "32:b2:91:56:01:83",
            "net11": "c2:f2:64:7f:dd:0a",
            "net12": "3e:49:a8:c8:a1:95",
            "net13": "62:7c:f2:e5:99:be",
            "net14": "b6:1c:e4:02:38:d2",
            "net15": "76:32:eb:b2:ab:be",
            "net16": "1a:e2:ba:08:7a:bd",
            "net17": "0a:b8:e5:18:68:88",
            "net18": "b2:62:ca:a3:61:a0",
            "net19": "2e:25:b0:a2:dc:68",
            "net2": "2a:4e:20:63:75:d0",
            "net3": "96:42:29:bf:2d:ce",
            "net4": "7a:b0:ae:ea:e0:8d",
            "net5": "de:34:3c:17:f7:02",
            "net6": "16:12:5b:aa:f8:78",
            "net7": "26:96:50:e4:d8:5c",
            "net8": "9a:ff:18:73:b5:cc",
            "net9": "d6:6b:a4:ec:30:4e"
        },
        "spine_3_1_6": {
            "net0": "02:4c:91:d4:a8:78",
            "net1": "a6:40:87:92:0f:7b",
            "net10": "62:aa:1b:04:f2:69",
            "net11": "4e:04:bd:d3:c9:e3",
            "net12": "2a:bb:34:ea:ed:73",
            "net13": "52:4e:c6:ca:dd:a7",
            "net14": "16:33:66:4f:e7:b1",
            "net15": "26:29:68:64:f9:5e",
            "net16": "4a:cd:f2:a6:b0:10",
            "net17": "96:09:bd:54:7c:b8",
            "net18": "a6:30:13:e5:da:76",
            "net19": "7e:33:00:4c:f2:14",
            "net2": "4e:8b:aa:93:7c:f8",
            "net3": "76:af:13:23:0f:25",
            "net4": "26:77:84:db:0f:3d",
            "net5": "62:ea:47:1a:b2:ca",
            "net6": "52:32:8a:66:59:81",
            "net7": "3a:58:d1:a8:86:02",
            "net8": "e2:3c:c7:2d:fc:0e",
            "net9": "9e:b4:10:de:41:73"
        },
        "spine_3_1_7": {
            "net0": "ea:20:24:98:ef:a7",
            "net1": "2a:6c:0a:3f:24:1e",
            "net10": "8e:88:98:c3:4f:a9",
            "net11": "c2:9f:55:ae:e1:ab",
            "net12": "2a:5f:cc:17:ff:25",
            "net13": "5e:bd:2d:3a:5a:86",
            "net14": "5a:d9:b8:ab:0c:b2",
            "net15": "de:77:3a:04:8d:5f",
            "net16": "e6:f1:36:6e:2f:44",
            "net17": "3a:26:3a:8a:dd:35",
            "net18": "ea:64:2f:92:95:93",
            "net19": "32:62:d2:a1:97:aa",
            "net2": "56:6d:68:f1:37:98",
            "net3": "8a:30:a0:28:e5:3a",
            "net4": "8e:02:8e:19:c5:03",
            "net5": "06:69:e8:fb:32:47",
            "net6": "16:e0:c4:c6:3e:55",
            "net7": "32:ed:ca:6b:5d:5b",
            "net8": "2a:b4:ed:ea:a6:7d",
            "net9": "16:7f:38:d7:b8:8f"
        },
        "spine_3_1_8": {
            "net0": "82:ed:ba:1c:27:56",
            "net1": "72:d5:6b:ce:3c:a2",
            "net10": "6a:97:2a:c2:21:3e",
            "net11": "86:d9:c7:a2:61:84",
            "net12": "76:c3:78:98:e8:e1",
            "net13": "c2:52:e7:76:eb:19",
            "net14": "36:b1:2c:4a:cc:f0",
            "net15": "de:41:f9:0b:33:0d",
            "net16": "aa:bc:45:70:3b:12",
            "net17": "52:47:ff:bf:b1:1d",
            "net18": "56:2f:de:94:50:de",
            "net19": "be:3f:43:e4:d1:51",
            "net2": "36:ec:85:ee:7c:c5",
            "net3": "6a:5c:eb:26:95:2b",
            "net4": "5a:ae:76:81:37:f8",
            "net5": "3e:23:48:da:49:2d",
            "net6": "ca:b0:1e:04:99:39",
            "net7": "ee:8e:56:bc:6c:8a",
            "net8": "6e:c5:73:82:6c:f2",
            "net9": "7a:c0:9e:0f:c7:cd"
        },
        "spine_3_1_9": {
            "net0": "d6:f2:40:e5:10:d9",
            "net1": "8a:61:55:7d:83:fa",
            "net10": "26:17:63:c7:d7:c6",
            "net11": "be:24:aa:f1:47:4c",
            "net12": "92:22:13:77:a7:59",
            "net13": "8e:33:63:c4:2b:d3",
            "net14": "22:e2:51:73:a2:d4",
            "net15": "2e:1b:ea:e4:2d:ca",
            "net16": "ba:88:cd:3f:d3:fa",
            "net17": "0a:c7:7c:ed:17:09",
            "net18": "f2:7a:c9:71:29:be",
            "net19": "aa:2d:47:2e:0d:a2",
            "net2": "16:59:5e:5c:52:8d",
            "net3": "96:b9:ea:08:94:63",
            "net4": "96:a2:a2:98:fd:11",
            "net5": "92:8e:f0:fb:91:80",
            "net6": "fe:99:64:22:a1:43",
            "net7": "82:8b:f5:4e:93:2f",
            "net8": "fe:0d:ed:ef:78:0c",
            "net9": "f6:0d:30:2e:7f:d6"
        },
        "spine_4_1_1": {
            "net0": "3a:6c:a5:65:ff:30",
            "net1": "3a:b7:80:3b:13:c0",
            "net10": "9a:df:84:19:fe:26",
            "net11": "5e:65:92:54:8e:04",
            "net12": "02:45:79:d2:f0:df",
            "net13": "5e:31:bf:fb:8b:23",
            "net14": "c2:af:96:05:27:5b",
            "net15": "76:25:38:1a:73:ba",
            "net16": "d2:b1:37:a9:cf:5b",
            "net17": "02:74:98:26:eb:da",
            "net18": "aa:95:50:59:4a:7c",
            "net19": "ca:57:e1:75:ba:c9",
            "net2": "3e:59:76:a2:8e:53",
            "net3": "12:20:dd:54:97:16",
            "net4": "3e:1a:05:68:f9:97",
            "net5": "d2:3e:07:ae:24:1e",
            "net6": "d6:15:02:e0:97:e2",
            "net7": "8a:dc:b1:d5:3a:57",
            "net8": "ae:90:81:b1:e7:a3",
            "net9": "b2:d9:23:5d:0a:70"
        },
        "spine_4_1_10": {
            "net0": "9e:3a:df:4f:b3:b6",
            "net1": "96:c8:2e:d7:04:43",
            "net10": "b6:64:cd:00:35:43",
            "net11": "7e:a7:fa:29:a9:fd",
            "net12": "ce:8e:1e:42:8d:79",
            "net13": "66:c4:3e:3b:ee:7a",
            "net14": "7a:01:d5:1d:76:39",
            "net15": "62:6c:ee:20:4c:68",
            "net16": "36:21:fd:c1:97:e5",
            "net17": "ca:93:97:42:a7:85",
            "net18": "4e:65:50:1d:ef:5b",
            "net19": "3a:90:30:26:a2:01",
            "net2": "92:1e:4f:b6:e5:6e",
            "net3": "02:81:a1:95:de:01",
            "net4": "22:b2:6a:a1:1f:61",
            "net5": "ce:c2:8c:e7:a2:9e",
            "net6": "e6:4f:e0:ee:33:52",
            "net7": "ee:1c:36:0d:26:a6",
            "net8": "3e:59:80:bd:59:4d",
            "net9": "b2:35:ab:a6:76:9f"
        },
        "spine_4_1_2": {
            "net0": "22:4b:90:52:d9:d9",
            "net1": "5e:e6:48:a0:86:b9",
            "net10": "0a:ac:1d:95:b7:6b",
            "net11": "ce:b9:b0:9c:d4:d7",
            "net12": "22:cb:b8:b1:da:5f",
            "net13": "0e:a9:ce:16:15:25",
            "net14": "72:5b:f9:89:8b:72",
            "net15": "16:f7:96:2e:c0:fd",
            "net16": "a2:79:33:b6:69:06",
            "net17": "52:68:da:0e:e1:5e",
            "net18": "fe:ea:d4:6c:24:e5",
            "net19": "c6:9b:1b:43:6f:70",
            "net2": "92:e0:17:af:0a:0a",
            "net3": "62:c6:f3:65:ce:34",
            "net4": "82:bd:5b:f9:b8:03",
            "net5": "de:35:36:25:fa:0d",
            "net6": "5a:a3:8b:a5:7b:93",
            "net7": "c6:29:d8:1e:03:05",
            "net8": "02:ee:12:3d:07:f3",
            "net9": "aa:33:23:32:49:a4"
        },
        "spine_4_1_3": {
            "net0": "6a:bc:75:23:9a:80",
            "net1": "3a:50:c0:3a:d4:b0",
            "net10": "32:7c:cb:e1:ed:fb",
            "net11": "02:a7:40:74:7f:2a",
            "net12": "4a:a5:c4:21:0c:b0",
            "net13": "5e:1b:b1:32:a5:91",
            "net14": "a6:0d:f2:05:e8:4c",
            "net15": "42:5b:96:16:fc:34",
            "net16": "12:0b:eb:bd:93:48",
            "net17": "76:e4:8b:d7:5c:dc",
            "net18": "2e:59:c1:d7:f9:80",
            "net19": "2a:25:96:ea:65:d4",
            "net2": "ce:63:1d:41:0f:57",
            "net3": "4a:1a:e0:82:69:b4",
            "net4": "12:2f:05:d0:a2:9b",
            "net5": "e6:02:37:e6:c3:75",
            "net6": "b6:9f:a0:11:ab:10",
            "net7": "62:aa:3a:e0:78:20",
            "net8": "0a:36:56:3b:c3:f4",
            "net9": "42:a1:30:e5:48:2b"
        },
        "spine_4_1_4": {
            "net0": "12:9d:ac:31:39:10",
            "net1": "32:6a:cf:77:7d:0c",
            "net10": "32:91:1c:8a:30:f4",
            "net11": "ca:cc:5c:95:0f:ca",
            "net12": "5e:11:e7:21:a2:47",
            "net13": "4a:41:60:b7:c4:30",
            "net14": "5e:80:d3:62:9a:04",
            "net15": "e2:f9:a0:93:74:53",
            "net16": "0a:91:8a:88:ba:36",
            "net17": "56:c6:05:97:4c:28",
            "net18": "ea:3e:2e:17:70:87",
            "net19": "42:de:1e:62:67:8d",
            "net2": "2e:15:67:71:a5:a7",
            "net3": "96:48:ca:99:16:60",
            "net4": "22:5a:42:97:c1:8e",
            "net5": "46:7b:e6:4c:20:d6",
            "net6": "86:af:77:6e:42:49",
            "net7": "9e:71:25:da:e3:b6",
            "net8": "e6:b4:c3:84:3b:79",
            "net9": "16:59:23:12:81:10"
        },
        "spine_4_1_5": {
            "net0": "3a:2a:22:17:51:07",
            "net1": "da:78:d4:8f:81:ef",
            "net10": "26:93:d0:9f:84:30",
            "net11": "de:7f:51:59:87:ef",
            "net12": "66:ad:4c:93:06:29",
            "net13": "a2:4f:72:0b:2a:6b",
            "net14": "ee:82:67:97:b2:9a",
            "net15": "ea:68:3a:8a:af:69",
            "net16": "56:97:72:36:d8:3c",
            "net17": "66:52:15:16:12:84",
            "net18": "de:68:43:d5:2c:bb",
            "net19": "fa:c2:47:67:0e:2f",
            "net2": "f2:6e:9d:b2:7f:33",
            "net3": "4e:60:35:17:8b:3a",
            "net4": "ee:9e:4f:9f:97:92",
            "net5": "c6:4e:0d:a3:27:35",
            "net6": "4a:a4:33:19:dd:b4",
            "net7": "aa:1e:08:62:b0:fb",
            "net8": "86:ae:e0:2c:37:7f",
            "net9": "86:f5:01:d0:79:91"
        },
        "spine_4_1_6": {
            "net0": "d6:ff:3f:5b:d1:c5",
            "net1": "da:09:b1:a8:22:e4",
            "net10": "fa:aa:6a:ba:1d:0f",
            "net11": "aa:b2:86:ae:8d:bd",
            "net12": "76:18:1a:f6:69:a1",
            "net13": "56:4e:05:14:fb:12",
            "net14": "16:e4:15:f8:a0:8a",
            "net15": "82:e7:3a:97:00:05",
            "net16": "22:dc:c7:20:24:92",
            "net17": "2e:04:a4:60:ab:43",
            "net18": "da:c3:4a:7d:72:03",
            "net19": "86:91:fd:e3:6e:79",
            "net2": "06:be:d5:cc:f2:b3",
            "net3": "2e:dd:4a:10:3d:3c",
            "net4": "fe:8e:fb:5d:13:69",
            "net5": "0e:03:f9:93:b6:ef",
            "net6": "7e:40:11:f4:de:ce",
            "net7": "ee:2b:70:da:72:54",
            "net8": "86:ac:b9:90:63:80",
            "net9": "8a:39:51:61:07:d5"
        },
        "spine_4_1_7": {
            "net0": "12:3f:2c:ad:9f:51",
            "net1": "ee:90:22:d8:39:6a",
            "net10": "22:05:d6:52:63:1e",
            "net11": "8a:43:44:d0:91:64",
            "net12": "a6:fe:ef:cf:21:1e",
            "net13": "ca:cb:9d:c2:58:16",
            "net14": "5a:5c:40:dd:e7:ce",
            "net15": "4e:b6:5b:55:bd:af",
            "net16": "4a:0c:a1:f7:46:5c",
            "net17": "2a:b9:ed:13:55:53",
            "net18": "b2:72:50:1f:04:5a",
            "net19": "42:12:60:bc:20:44",
            "net2": "56:c7:5c:39:01:43",
            "net3": "9a:a8:05:d1:f4:89",
            "net4": "ba:9b:3f:6d:ef:3f",
            "net5": "7e:1f:2b:7e:1f:9c",
            "net6": "9e:2e:06:93:cf:ae",
            "net7": "e6:78:d7:d8:d1:d8",
            "net8": "ce:9d:e4:1a:ce:a7",
            "net9": "be:e3:9b:e3:dd:ec"
        },
        "spine_4_1_8": {
            "net0": "8e:2b:a1:2c:a2:d0",
            "net1": "ce:64:aa:18:ed:8b",
            "net10": "72:0c:82:8d:5a:43",
            "net11": "4e:52:06:52:93:71",
            "net12": "b6:74:74:a0:65:59",
            "net13": "26:6c:f8:42:40:f4",
            "net14": "3e:07:ec:ca:6b:79",
            "net15": "7e:79:5e:e1:6f:0e",
            "net16": "a2:d8:6b:1d:b5:88",
            "net17": "ae:82:ae:36:b3:64",
            "net18": "f2:70:bd:f4:c3:dd",
            "net19": "ba:ed:56:69:5f:5b",
            "net2": "2e:bf:93:ba:41:8a",
            "net3": "7a:89:af:24:c4:34",
            "net4": "7a:57:ac:d3:83:f3",
            "net5": "e6:b4:b4:4c:68:3f",
            "net6": "0a:71:f2:2f:31:9b",
            "net7": "3e:35:f7:d5:0b:52",
            "net8": "46:26:7f:a2:e9:df",
            "net9": "0a:cb:17:05:fb:b6"
        },
        "spine_4_1_9": {
            "net0": "1a:6b:6d:07:9d:d8",
            "net1": "7a:e0:48:61:21:46",
            "net10": "b2:0f:14:54:fe:62",
            "net11": "66:59:c3:72:57:62",
            "net12": "9a:e8:93:01:d4:59",
            "net13": "46:75:29:97:80:4e",
            "net14": "5e:63:19:08:0d:61",
            "net15": "4a:d4:20:4c:c4:83",
            "net16": "32:dd:a3:00:ed:2b",
            "net17": "06:95:b1:9f:0f:96",
            "net18": "5a:98:20:26:b8:dd",
            "net19": "b2:dc:76:96:a6:9b",
            "net2": "4e:a7:e8:81:26:66",
            "net3": "6a:93:55:d9:e8:e8",
            "net4": "8a:18:54:df:1e:87",
            "net5": "76:5c:6e:a8:fa:cd",
            "net6": "be:0a:11:d6:08:01",
            "net7": "a6:85:9c:04:23:f1",
            "net8": "12:10:31:6a:60:61",
            "net9": "ca:9b:b8:1c:08:33"
        },
        "tof_1_2_1": {
            "net0": "62:2e:12:74:8a:c5",
            "net1": "12:5c:1c:f6:9b:34",
            "net10": "46:6a:31:6c:54:b6",
            "net11": "0a:5f:60:1f:87:e3",
            "net12": "22:46:bb:de:02:cd",
            "net13": "5a:0e:e2:4a:e5:cc",
            "net14": "56:83:40:db:c1:2c",
            "net15": "6e:d3:15:68:0c:d4",
            "net16": "5a:a5:ce:fb:12:72",
            "net17": "92:9c:2a:8c:93:c4",
            "net18": "22:a2:6e:c8:0b:96",
            "net19": "de:95:a3:de:b3:14",
            "net2": "be:d6:ee:bc:66:53",
            "net3": "92:50:4c:17:5c:69",
            "net4": "be:23:8a:98:ef:2d",
            "net5": "ee:ce:63:98:92:15",
            "net6": "c6:da:d2:d0:8b:bc",
            "net7": "ce:ff:e4:ad:da:60",
            "net8": "4a:e9:4c:c1:fc:d0",
            "net9": "a6:0a:54:02:14:b1"
        },
        "tof_1_2_10": {
            "net0": "6a:02:54:89:cd:9e",
            "net1": "3a:f9:fc:1b:9e:82",
            "net10": "5a:96:62:4d:02:d7",
            "net11": "a6:7d:c5:5c:1c:8f",
            "net12": "1a:ff:7d:c5:95:55",
            "net13": "72:bf:7d:a6:a3:0b",
            "net14": "9e:9e:76:9c:a0:80",
            "net15": "ee:8b:7b:d6:3c:dd",
            "net16": "8e:71:d4:ba:b2:23",
            "net17": "c6:d0:10:65:0f:55",
            "net18": "1a:76:8e:d6:56:a1",
            "net19": "ba:d1:a4:02:c5:3c",
            "net2": "62:a6:ae:37:73:b1",
            "net3": "7a:db:fc:23:64:6e",
            "net4": "ba:17:d2:59:5e:7c",
            "net5": "9a:79:87:30:d2:14",
            "net6": "62:1f:0b:f8:cb:2d",
            "net7": "2a:40:52:5a:23:d6",
            "net8": "2e:db:09:53:14:b8",
            "net9": "5e:87:05:3f:a2:74"
        },
        "tof_1_2_2": {
            "net0": "62:2a:c9:fa:ff:6e",
            "net1": "4a:59:bb:fc:56:60",
            "net10": "de:a2:f1:64:19:63",
            "net11": "8e:ef:54:52:8a:5a",
            "net12": "86:ec:6e:bb:89:30",
            "net13": "ee:ad:bb:5b:d3:bc",
            "net14": "8e:6f:54:7f:0c:f5",
            "net15": "a2:91:f7:96:b8:e1",
            "net16": "d6:90:1c:2c:12:cd",
            "net17": "5a:f3:ef:5d:f2:40",
            "net18": "de:d1:cc:99:4f:65",
            "net19": "a6:12:97:5e:cd:99",
            "net2": "32:8e:cc:65:85:cc",
            "net3": "fa:1b:c5:bd:16:7e",
            "net4": "46:6a:78:9b:93:df",
            "net5": "0a:07:8f:ff:3f:c9",
            "net6": "fa:89:5f:d4:21:62",
            "net7": "2a:2a:82:08:c9:2a",
            "net8": "a6:e6:78:d1:2a:2a",
            "net9": "ba:7b:55:9f:b6:7d"
        },
        "tof_1_2_3": {
            "net0": "ca:d3:3f:49:dd:66",
            "net1": "52:33:05:a8:6d:1d",
            "net10": "62:a2:b3:c6:54:71",
            "net11": "36:74:2c:50:43:d3",
            "net12": "d6:e2:6b:e1:cc:5b",
            "net13": "32:8a:42:e3:f4:8e",
            "net14": "a6:dc:62:d9:fd:58",
            "net15": "06:2c:b6:19:02:ff",
            "net16": "62:93:74:bd:99:81",
            "net17": "4e:2e:49:7d:b0:71",
            "net18": "7a:e2:50:9c:00:f6",
            "net19": "96:13:ee:f7:98:10",
            "net2": "92:1c:50:31:0e:a0",
            "net3": "8a:98:e6:30:80:25",
            "net4": "22:37:cc:06:53:17",
            "net5": "f6:10:fb:c8:23:f0",
            "net6": "e2:03:5a:cd:72:ed",
            "net7": "46:61:44:81:be:bf",
            "net8": "76:1f:e8:bc:16:83",
            "net9": "5a:d9:bc:f5:4e:01"
        },
        "tof_1_2_4": {
            "net0": "82:c6:06:63:63:cf",
            "net1": "da:8e:db:de:39:52",
            "net10": "a2:52:80:fa:45:f0",
            "net11": "a6:0f:03:41:c9:0f",
            "net12": "52:e2:7e:fd:e7:78",
            "net13": "aa:db:11:0a:6a:b9",
            "net14": "a6:ff:2d:36:2a:3a",
            "net15": "1e:56:71:28:a1:a0",
            "net16": "f2:7e:62:72:83:94",
            "net17": "7a:80:64:1a:d7:70",
            "net18": "aa:ab:b3:f3:11:e5",
            "net19": "86:68:c6:32:3e:a2",
            "net2": "0e:5b:cc:de:93:72",
            "net3": "0e:32:8d:28:6d:04",
            "net4": "56:e8:d6:65:e9:9d",
            "net5": "62:b9:5e:b1:cd:93",
            "net6": "52:39:48:92:cc:ed",
            "net7": "3a:a9:15:d3:87:82",
            "net8": "7a:12:5f:9c:65:50",
            "net9": "22:44:89:f6:a7:3f"
        },
        "tof_1_2_5": {
            "net0": "6a:71:e3:44:08:2d",
            "net1": "06:9d:fe:55:b9:72",
            "net10": "4a:87:96:b6:21:ad",
            "net11": "76:e7:c9:9e:0c:ba",
            "net12": "9e:5a:a6:09:a4:c4",
            "net13": "f6:db:b5:81:ff:5d",
            "net14": "9e:1f:ce:13:e9:29",
            "net15": "ca:bf:ea:37:0b:b8",
            "net16": "22:8e:75:46:d5:b5",
            "net17": "9a:4f:8b:95:c9:7f",
            "net18": "5e:37:19:6a:d8:70",
            "net19": "26:56:11:04:50:29",
            "net2": "22:fc:de:bb:2e:14",
            "net3": "a6:b5:b8:79:64:4d",
            "net4": "9e:7e:87:44:04:ba",
            "net5": "52:03:45:c0:d2:d7",
            "net6": "e2:62:3f:99:75:73",
            "net7": "7a:f4:1f:cc:7b:15",
            "net8": "7a:45:35:0c:cc:4f",
            "net9": "12:60:aa:8a:68:b9"
        },
        "tof_1_2_6": {
            "net0": "12:43:b6:88:23:44",
            "net1": "0a:6c:c3:78:fa:84",
            "net10": "6a:88:49:b7:2f:a5",
            "net11": "3e:82:d5:11:62:2d",
            "net12": "36:81:9e:d8:f1:f3",
            "net13": "66:5a:c0:a2:17:ec",
            "net14": "1e:68:eb:79:1a:88",
            "net15": "b2:f3:7d:66:a0:24",
            "net16": "9e:9e:c8:b6:f0:0b",
            "net17": "e6:3a:c7:fb:bd:3a",
            "net18": "a6:f6:9a:33:c6:8d",
            "net19": "66:cc:fd:45:47:61",
            "net2": "f6:a2:9f:9e:cf:9b",
            "net3": "5a:d0:3c:85:63:d1",
            "net4": "fa:69:9a:65:0e:24",
            "net5": "0a:e3:74:ba:de:2e",
            "net6": "72:41:38:a8:5b:e9",
            "net7": "ca:b8:6e:a2:12:6c",
            "net8": "aa:51:30:da:db:3d",
            "net9": "92:b4:2b:48:55:6b"
        },
        "tof_1_2_7": {
            "net0": "ce:67:9d:db:72:1d",
            "net1": "4a:de:cf:d8:d4:b2",
            "net10": "c2:b3:d5:23:79:97",
            "net11": "62:ba:db:c4:b7:2c",
            "net12": "4e:88:04:8c:a6:b5",
            "net13": "1a:17:d5:5b:0e:d7",
            "net14": "ca:1d:6c:4c:e4:63",
            "net15": "32:90:da:84:e7:04",
            "net16": "6e:5a:91:7c:81:3d",
            "net17": "4a:28:cd:84:21:f9",
            "net18": "1a:d2:e5:67:d2:f6",
            "net19": "62:7f:bd:62:33:ca",
            "net2": "3e:1c:75:12:28:81",
            "net3": "96:7f:46:39:bf:46",
            "net4": "16:50:23:9a:4d:f3",
            "net5": "2e:3d:fa:fa:f9:46",
            "net6": "3e:d9:b3:51:e1:2b",
            "net7": "8e:88:2d:5e:fc:3e",
            "net8": "7e:f1:5c:47:c1:28",
            "net9": "7e:9c:a8:96:00:36"
        },
        "tof_1_2_8": {
            "net0": "f2:8d:2d:19:ba:c0",
            "net1": "8a:73:fa:3b:62:ae",
            "net10": "52:3d:ca:c6:0a:97",
            "net11": "9a:14:38:c3:6d:7a",
            "net12": "6a:3e:88:75:78:5b",
            "net13": "e6:4e:d3:ad:b8:19",
            "net14": "22:a5:ce:4b:3e:3f",
            "net15": "be:79:80:38:31:de",
            "net16": "4e:0d:6b:fd:ac:1f",
            "net17": "36:d9:20:92:96:fb",
            "net18": "0e:22:b7:fd:f4:d4",
            "net19": "1a:4e:87:18:71:fe",
            "net2": "42:fb:d1:4a:7e:e6",
            "net3": "be:be:7c:5f:d0:13",
            "net4": "0a:13:3d:2b:b8:16",
            "net5": "a6:33:6f:58:e3:7a",
            "net6": "6a:11:47:94:b8:59",
            "net7": "ee:35:00:87:20:c7",
            "net8": "82:34:f3:5b:42:57",
            "net9": "72:32:93:3f:dc:7b"
        },
        "tof_1_2_9": {
            "net0": "12:ea:45:3d:e8:8e",
            "net1": "fe:96:26:83:63:56",
            "net10": "ba:97:78:82:7e:0e",
            "net11": "1a:20:2e:5b:3c:0f",
            "net12": "4e:ce:70:b4:d3:6b",
            "net13": "b6:ca:e4:5a:a3:30",
            "net14": "66:b0:17:b1:79:32",
            "net15": "f6:f2:e1:f8:b3:2d",
            "net16": "ca:93:54:f6:15:3b",
            "net17": "fe:53:9a:8b:74:38",
            "net18": "82:6d:dd:60:a9:a5",
            "net19": "6a:77:2a:fa:53:0b",
            "net2": "ba:06:81:94:05:3c",
            "net3": "4e:c5:ff:64:5f:77",
            "net4": "f6:49:89:3a:6e:b8",
            "net5": "ee:b5:f0:89:3d:98",
            "net6": "16:b9:f5:1c:43:e8",
            "net7": "fa:da:07:c1:f9:0e",
            "net8": "a2:01:d1:fd:f9:f9",
            "net9": "3a:49:fd:c1:a8:85"
        },
        "tof_2_2_1": {
            "net0": "f2:b8:5b:43:02:fe",
            "net1": "f2:ef:10:8f:53:27",
            "net10": "ca:d3:ab:4e:ef:91",
            "net11": "86:63:7a:e1:2b:e2",
            "net12": "4e:54:f6:8a:b1:a2",
            "net13": "96:78:22:3b:9f:61",
            "net14": "6e:60:eb:5d:ce:71",
            "net15": "72:d9:91:de:88:c0",
            "net16": "aa:a2:e9:0d:7d:68",
            "net17": "e6:6c:13:70:96:d9",
            "net18": "26:b3:c2:c7:34:df",
            "net19": "32:34:61:56:21:df",
            "net2": "d6:48:0d:b9:5e:8b",
            "net3": "8a:49:14:b4:b5:01",
            "net4": "0a:a9:44:a6:2b:d8",
            "net5": "9a:16:b1:b9:0e:b5",
            "net6": "06:70:6b:c4:ec:de",
            "net7": "a6:56:2c:95:b9:6c",
            "net8": "86:bd:5a:33:d7:b7",
            "net9": "e6:fe:11:32:23:88"
        },
        "tof_2_2_10": {
            "net0": "8e:f0:b6:a5:06:14",
            "net1": "42:1f:32:e8:78:dd",
            "net10": "0a:0d:53:45:17:b9",
            "net11": "02:09:5d:84:24:3a",
            "net12": "2e:d8:99:26:20:78",
            "net13": "9a:27:d4:61:7f:e4",
            "net14": "8e:99:f1:93:c7:ec",
            "net15": "5a:65:74:38:b6:1b",
            "net16": "1e:ed:4a:93:85:45",
            "net17": "32:35:f4:45:24:96",
            "net18": "4a:f2:66:81:fa:a8",
            "net19": "fa:6e:fc:1c:d5:33",
            "net2": "ba:db:c9:9f:31:71",
            "net3": "3a:29:f0:77:f9:e8",
            "net4": "ae:11:b5:f5:32:6a",
            "net5": "22:78:8e:8f:96:7c",
            "net6": "0a:87:00:a0:48:9c",
            "net7": "62:6f:60:bb:a7:d1",
            "net8": "f2:d5:17:37:ab:91",
            "net9": "e6:23:5e:5f:5d:70"
        },
        "tof_2_2_2": {
            "net0": "ba:f5:11:70:0c:bc",
            "net1": "92:39:3e:6f:82:de",
            "net10": "f2:e5:03:91:bf:ca",
            "net11": "3e:5a:7e:10:9b:64",
            "net12": "b6:f0:a1:c5:20:3e",
            "net13": "7a:3c:49:38:db:e0",
            "net14": "be:d9:20:eb:7f:21",
            "net15": "7a:ac:40:e8:e9:68",
            "net16": "da:99:1a:7a:ad:ed",
            "net17": "de:03:e4:4c:54:a2",
            "net18": "3a:60:88:de:6d:1e",
            "net19": "0a:91:1b:c5:e5:89",
            "net2": "d2:4c:65:c4:8c:5b",
            "net3": "3a:62:8e:60:31:a3",
            "net4": "7e:f9:a1:11:dc:6a",
            "net5": "ce:3c:a8:3e:32:8f",
            "net6": "d6:74:14:de:3b:ff",
            "net7": "e2:16:a8:83:1e:32",
            "net8": "2a:54:94:01:ce:0b",
            "net9": "56:60:06:31:0b:20"
        },
        "tof_2_2_3": {
            "net0": "d6:7a:35:5c:ac:63",
            "net1": "d2:8b:8a:38:01:30",
            "net10": "1e:1e:aa:19:6e:9a",
            "net11": "56:2d:e5:5a:50:a2",
            "net12": "d6:f6:06:3e:10:c0",
            "net13": "02:a9:6f:aa:2c:e7",
            "net14": "56:9e:3a:93:70:52",
            "net15": "2a:a8:62:79:ab:eb",
            "net16": "66:8f:f5:4e:72:94",
            "net17": "fa:21:75:52:7d:70",
            "net18": "ea:9a:c5:fc:d1:a3",
            "net19": "d6:3e:85:7b:a1:ba",
            "net2": "92:1c:cb:f1:91:d9",
            "net3": "b6:84:63:9d:8a:b4",
            "net4": "46:e1:15:1d:e3:55",
            "net5": "c6:84:c4:f8:75:f1",
            "net6": "52:11:4b:a5:df:e9",
            "net7": "3a:f6:85:51:3b:96",
            "net8": "02:19:90:79:5a:1b",
            "net9": "a6:49:df:f9:f1:1b"
        },
        "tof_2_2_4": {
            "net0": "3e:39:45:67:b6:f4",
            "net1": "de:1e:4a:cb:4c:08",
            "net10": "42:7e:c7:d1:09:12",
            "net11": "da:44:4f:47:a3:b9",
            "net12": "32:30:60:3f:80:d3",
            "net13": "56:84:12:f5:6a:9d",
            "net14": "c2:29:00:b1:a0:9a",
            "net15": "42:46:ec:ad:9f:f4",
            "net16": "c6:28:9f:ce:2a:ad",
            "net17": "c2:c6:26:08:f9:34",
            "net18": "d6:d7:3a:a1:ef:7b",
            "net19": "1e:5b:ca:07:08:47",
            "net2": "fe:2d:32:9c:42:29",
            "net3": "a2:67:b9:20:3d:c8",
            "net4": "3e:09:d7:83:81:2a",
            "net5": "12:38:91:17:14:6a",
            "net6": "5a:13:55:86:ab:b7",
            "net7": "1a:cb:84:e3:dd:b9",
            "net8": "72:7e:cd:3b:6b:1a",
            "net9": "12:e6:30:6b:43:4f"
        },
        "tof_2_2_5": {
            "net0": "c6:fd:dd:02:de:c5",
            "net1": "42:d9:47:da:f1:e8",
            "net10": "02:21:dc:6b:4b:30",
            "net11": "4e:2d:af:8b:16:2e",
            "net12": "c6:6b:5f:9c:6d:bb",
            "net13": "d2:72:10:86:c0:01",
            "net14": "ca:38:17:72:85:b3",
            "net15": "66:b6:e1:cd:ef:fd",
            "net16": "ce:9c:75:87:dd:86",
            "net17": "86:ac:44:c4:ba:b2",
            "net18": "06:a6:cb:07:49:00",
            "net19": "a6:b0:b5:1b:f8:ab",
            "net2": "02:0f:db:6d:3d:39",
            "net3": "72:06:9a:09:41:f3",
            "net4": "46:ac:49:e9:f6:8d",
            "net5": "06:e1:0e:17:de:db",
            "net6": "16:05:6e:39:b5:34",
            "net7": "02:92:d6:35:db:ff",
            "net8": "22:27:2f:79:7c:55",
            "net9": "c2:ab:14:f5:a3:26"
        },
        "tof_2_2_6": {
            "net0": "b6:19:31:18:9d:9e",
            "net1": "4a:88:0a:78:1b:18",
            "net10": "ca:06:fe:07:cf:62",
            "net11": "fa:cc:66:67:6b:2c",
            "net12": "ee:81:2f:71:19:76",
            "net13": "8e:ff:25:77:d0:a9",
            "net14": "22:f2:a9:b1:26:b8",
            "net15": "8a:ec:06:fc:c7:4c",
            "net16": "66:dd:6f:c4:cf:bf",
            "net17": "7e:c7:92:08:04:81",
            "net18": "e6:50:ee:7e:37:f6",
            "net19": "aa:75:e6:6e:61:3f",
            "net2": "22:ac:26:a1:90:b9",
            "net3": "a6:d0:d6:6b:c8:38",
            "net4": "e6:ca:ff:df:4c:b3",
            "net5": "42:17:87:71:52:ec",
            "net6": "6a:07:0e:fd:26:c9",
            "net7": "ca:fe:8e:4e:dc:f9",
            "net8": "e2:b9:4c:c1:35:63",
            "net9": "7a:a1:9e:04:e9:3d"
        },
        "tof_2_2_7": {
            "net0": "8a:e0:eb:f4:2b:cf",
            "net1": "de:21:f1:d0:f7:ab",
            "net10": "56:f0:fe:ba:2a:d3",
            "net11": "6a:77:91:88:05:4c",
            "net12": "f6:9c:a6:17:ba:18",
            "net13": "0e:05:89:44:0c:ce",
            "net14": "72:c0:bf:d0:a8:49",
            "net15": "0a:db:8e:a1:9d:22",
            "net16": "96:f0:61:9c:7f:f0",
            "net17": "02:d7:9e:51:b3:1c",
            "net18": "c6:77:f7:73:8b:c8",
            "net19": "56:d6:71:72:a6:69",
            "net2": "82:31:1e:a0:5d:81",
            "net3": "72:83:26:64:71:cf",
            "net4": "f2:3d:db:1d:6d:c2",
            "net5": "6a:f8:14:26:08:f2",
            "net6": "fa:b9:7e:7b:94:99",
            "net7": "92:a4:3e:3a:f3:ae",
            "net8": "be:ce:90:8a:55:69",
            "net9": "fe:5c:d4:7f:bb:33"
        },
        "tof_2_2_8": {
            "net0": "4e:d0:c6:f9:5a:f4",
            "net1": "26:ff:90:65:da:a4",
            "net10": "ca:33:b5:db:df:1c",
            "net11": "d2:18:99:41:a6:c6",
            "net12": "ba:ce:e4:ee:30:84",
            "net13": "1a:05:0e:21:03:f3",
            "net14": "5a:f5:f8:84:dd:a3",
            "net15": "ea:42:a6:8a:41:e1",
            "net16": "fa:af:04:3e:ed:dc",
            "net17": "0a:bd:e3:d6:2b:a1",
            "net18": "b6:fa:0d:78:f1:3f",
            "net19": "aa:82:fb:b2:8e:cc",
            "net2": "92:f4:c7:82:07:41",
            "net3": "2a:5f:1c:be:ce:79",
            "net4": "c6:b0:e0:40:58:6a",
            "net5": "92:a0:c7:a2:33:d8",
            "net6": "0e:7b:c8:3d:b5:b0",
            "net7": "c6:1c:d0:ba:9d:04",
            "net8": "06:a1:e4:f2:73:ed",
            "net9": "0a:8b:ae:bf:33:af"
        },
        "tof_2_2_9": {
            "net0": "62:c6:11:4a:5b:c0",
            "net1": "12:2b:5b:1b:f0:fe",
            "net10": "f2:1b:3c:d8:9a:56",
            "net11": "0a:47:54:75:4f:b0",
            "net12": "ce:ba:ff:0b:e2:d1",
            "net13": "8e:d7:51:37:e6:bb",
            "net14": "9a:b8:b5:a3:99:31",
            "net15": "1e:b1:2b:fd:f0:cc",
            "net16": "56:bf:53:5f:5c:45",
            "net17": "f2:02:47:e2:ce:40",
            "net18": "e6:85:c8:32:13:6b",
            "net19": "86:6a:92:33:a5:1a",
            "net2": "8e:cc:35:e7:23:6d",
            "net3": "52:ea:c7:fd:46:84",
            "net4": "66:4e:4e:f1:65:f8",
            "net5": "62:ee:d1:47:9e:e9",
            "net6": "9e:cd:f2:81:b8:19",
            "net7": "1a:3d:ad:2e:d6:fd",
            "net8": "f2:ad:ea:bc:c3:80",
            "net9": "52:98:77:22:23:f7"
        }
    },
    "failed_machine": "leaf_1_0_1",
    "failed_interfaces": [
        "net0"
    ],
    "failure_time": 1614967506.6676302,
    "recover_time": 1614967747.6047003
}