{
    "description": "Scenario 3a: Leaf leaf_1_0_1 failure with BGP",
    "k_leaf": 10,
    "k_top": 10,
    "redundancy_factor": 5,
    "is_k8s": true,
    "machine_mac_addresses": {
        "leaf_1_0_1": {
            "net0": "ba:15:48:30:41:ec",
            "net1": "d2:ed:c5:04:8c:b9",
            "net10": "0e:b0:16:99:c6:21",
            "net2": "02:fd:ee:4c:e2:54",
            "net3": "86:af:14:02:9c:ac",
            "net4": "1a:19:d7:3f:2b:f4",
            "net5": "8a:58:14:67:69:4b",
            "net6": "22:f5:64:37:cf:bb",
            "net7": "be:9f:2d:79:26:24",
            "net8": "d6:4d:57:0d:25:a2",
            "net9": "fe:87:51:63:a8:ac"
        },
        "leaf_1_0_10": {
            "net0": "76:ec:27:de:01:a2",
            "net1": "16:24:e3:cb:bd:0c",
            "net10": "f2:0d:66:79:15:d6",
            "net2": "0a:2d:12:98:20:2f",
            "net3": "fe:f5:c6:86:df:3f",
            "net4": "7e:f3:bd:b6:19:75",
            "net5": "5a:16:34:8d:6d:7f",
            "net6": "16:2d:83:60:e7:26",
            "net7": "56:04:e2:f5:7a:9d",
            "net8": "a6:41:e1:05:bf:29",
            "net9": "c2:2c:aa:52:ec:80"
        },
        "leaf_1_0_2": {
            "net0": "52:9d:af:1e:9d:ee",
            "net1": "02:f0:3d:77:1c:72",
            "net10": "ae:e2:c7:32:44:6f",
            "net2": "52:ee:8d:cc:c4:13",
            "net3": "56:18:9f:09:6c:0e",
            "net4": "06:35:e5:4b:d0:00",
            "net5": "fe:c1:98:a2:87:bc",
            "net6": "56:53:f6:b3:e7:df",
            "net7": "da:08:4c:8b:f2:ad",
            "net8": "9e:91:8e:96:e1:6d",
            "net9": "66:0f:ea:55:46:bb"
        },
        "leaf_1_0_3": {
            "net0": "72:88:75:38:3e:5d",
            "net1": "16:1a:af:e7:8e:67",
            "net10": "92:92:a9:f7:32:ec",
            "net2": "62:34:a4:1b:ef:0f",
            "net3": "82:d8:03:53:af:de",
            "net4": "0a:41:5d:0a:eb:3c",
            "net5": "6a:0f:ad:ed:c2:b5",
            "net6": "a6:18:ea:0f:9c:c8",
            "net7": "32:9b:e9:3b:43:d8",
            "net8": "26:84:1c:29:a2:18",
            "net9": "b6:f6:aa:20:2c:80"
        },
        "leaf_1_0_4": {
            "net0": "12:91:e3:98:e9:b7",
            "net1": "9e:7a:4a:06:70:6f",
            "net10": "46:e0:e0:fc:64:23",
            "net2": "2a:9d:b5:ef:66:04",
            "net3": "b6:7a:7f:de:5d:aa",
            "net4": "2e:00:33:9b:e9:65",
            "net5": "22:ef:19:11:c8:c8",
            "net6": "b6:81:bb:92:f4:4a",
            "net7": "56:9c:2d:1c:ff:7a",
            "net8": "52:11:49:b0:fa:64",
            "net9": "6a:81:5f:2c:bf:33"
        },
        "leaf_1_0_5": {
            "net0": "1a:6e:ee:68:14:b9",
            "net1": "4e:38:a6:c8:55:f1",
            "net10": "22:13:97:9f:55:e8",
            "net2": "1e:77:c9:ad:ce:29",
            "net3": "2a:6d:8d:cb:30:50",
            "net4": "1a:8d:9a:83:de:60",
            "net5": "6e:7b:54:33:b5:a3",
            "net6": "fa:e8:88:1f:46:6f",
            "net7": "66:e9:59:1a:ed:9c",
            "net8": "ee:81:ba:67:fd:2a",
            "net9": "9e:71:42:49:0d:d6"
        },
        "leaf_1_0_6": {
            "net0": "32:71:b3:27:4a:c3",
            "net1": "a2:6a:4e:c3:55:39",
            "net10": "82:77:c1:87:70:7d",
            "net2": "ce:56:df:42:23:b0",
            "net3": "c2:21:82:29:5f:b9",
            "net4": "92:3d:1d:c2:41:38",
            "net5": "be:fc:a7:4a:b9:f6",
            "net6": "96:ac:5d:fc:47:b5",
            "net7": "ce:1e:65:25:c0:07",
            "net8": "be:c7:0b:32:04:a2",
            "net9": "1a:a8:b3:b8:f3:e1"
        },
        "leaf_1_0_7": {
            "net0": "02:cc:e2:6d:48:f1",
            "net1": "e2:6a:eb:eb:aa:e7",
            "net10": "ba:d6:29:3e:f0:7a",
            "net2": "66:20:fb:37:38:a9",
            "net3": "72:07:4f:94:c9:2d",
            "net4": "3a:33:d0:a5:c0:f9",
            "net5": "7e:0d:57:fa:82:46",
            "net6": "7a:0d:ca:38:72:7f",
            "net7": "da:d3:2c:67:eb:44",
            "net8": "5e:24:eb:3d:3a:3f",
            "net9": "36:4d:6a:60:13:82"
        },
        "leaf_1_0_8": {
            "net0": "a6:9f:9e:b5:ba:cc",
            "net1": "1e:34:72:3f:9c:17",
            "net10": "1e:9d:2d:0d:8d:0a",
            "net2": "e2:d5:8b:c6:12:9d",
            "net3": "56:4e:ae:72:49:b2",
            "net4": "f2:3c:31:c3:6b:1e",
            "net5": "ae:b6:bb:20:c8:a3",
            "net6": "36:7f:30:61:6c:d8",
            "net7": "9e:32:7d:1e:b9:18",
            "net8": "be:e4:9b:5e:df:fe",
            "net9": "36:f5:1a:dc:74:d0"
        },
        "leaf_1_0_9": {
            "net0": "e2:5c:ce:59:d5:0e",
            "net1": "36:39:14:19:92:1d",
            "net10": "3a:eb:16:80:e2:3e",
            "net2": "4a:35:bd:09:3a:af",
            "net3": "fe:c7:6c:47:41:d2",
            "net4": "32:91:ad:66:ba:7b",
            "net5": "b6:ea:47:6f:e6:54",
            "net6": "92:fe:60:92:d1:2f",
            "net7": "52:10:7d:81:d7:ce",
            "net8": "86:27:94:f2:a6:32",
            "net9": "a2:6f:a2:23:0e:d1"
        },
        "leaf_2_0_1": {
            "net0": "be:cc:f3:61:b6:ef",
            "net1": "32:1c:2a:5f:5c:9d",
            "net10": "f6:34:4e:52:cd:16",
            "net2": "0a:48:42:3e:3b:ab",
            "net3": "82:e1:cb:8d:e1:73",
            "net4": "ce:9f:cc:dc:bf:6e",
            "net5": "06:5c:97:43:42:70",
            "net6": "b6:cc:64:c5:7e:98",
            "net7": "7a:e9:3f:76:f5:61",
            "net8": "de:6c:a3:c9:e5:78",
            "net9": "7a:83:9d:a8:48:99"
        },
        "leaf_2_0_10": {
            "net0": "82:98:be:15:78:6b",
            "net1": "3a:a8:4b:88:c3:6e",
            "net10": "f6:5b:6a:7e:f8:d2",
            "net2": "62:10:37:30:dc:43",
            "net3": "16:1f:a3:0a:b4:b1",
            "net4": "5a:07:6f:9a:51:31",
            "net5": "4a:9d:34:26:5a:73",
            "net6": "56:03:73:09:be:65",
            "net7": "1a:fb:4a:75:fb:38",
            "net8": "2a:d6:c3:c3:01:d4",
            "net9": "de:13:f8:78:1a:d3"
        },
        "leaf_2_0_2": {
            "net0": "f6:b9:db:4f:72:87",
            "net1": "9a:b8:4b:94:b2:a5",
            "net10": "b6:c5:f7:42:33:ce",
            "net2": "1e:b6:36:df:93:23",
            "net3": "66:17:f6:63:00:53",
            "net4": "2e:b1:68:ea:f0:2f",
            "net5": "1e:51:b2:68:de:39",
            "net6": "de:8f:e0:72:64:29",
            "net7": "62:a2:bd:e2:62:1e",
            "net8": "be:f6:6f:73:94:4a",
            "net9": "ca:81:5f:02:a8:4e"
        },
        "leaf_2_0_3": {
            "net0": "86:45:8f:e6:4a:1f",
            "net1": "7e:91:00:fd:bc:ea",
            "net10": "da:07:73:62:e4:f6",
            "net2": "12:c5:a9:88:f0:3c",
            "net3": "ae:21:0a:36:bf:99",
            "net4": "ca:cb:d7:97:fc:9e",
            "net5": "aa:96:5d:9b:81:97",
            "net6": "12:48:bc:ca:8a:70",
            "net7": "16:ee:5b:ba:8c:98",
            "net8": "22:12:7d:ad:9b:a1",
            "net9": "d2:cd:6d:b8:96:12"
        },
        "leaf_2_0_4": {
            "net0": "ee:16:e7:d3:f9:87",
            "net1": "a6:10:98:85:65:23",
            "net10": "2a:b9:64:36:93:67",
            "net2": "12:45:52:79:41:84",
            "net3": "0e:c6:82:46:80:4a",
            "net4": "2e:5d:7d:ba:54:c8",
            "net5": "2e:41:10:f9:75:c4",
            "net6": "a6:6b:95:27:09:9a",
            "net7": "22:5a:7f:97:09:5a",
            "net8": "7a:1d:8d:48:b7:51",
            "net9": "26:63:b6:10:32:0f"
        },
        "leaf_2_0_5": {
            "net0": "aa:7e:4d:2e:85:ad",
            "net1": "f2:29:65:f7:10:33",
            "net10": "76:f0:31:64:40:22",
            "net2": "d6:f8:74:c4:46:73",
            "net3": "9a:5d:e4:b9:3d:26",
            "net4": "12:5a:ff:c5:a7:25",
            "net5": "06:58:47:de:3b:82",
            "net6": "32:41:4a:67:4d:24",
            "net7": "4e:3e:42:87:b0:0a",
            "net8": "c2:2b:a9:9f:2b:a5",
            "net9": "16:e0:39:3c:bd:52"
        },
        "leaf_2_0_6": {
            "net0": "46:99:af:66:87:f6",
            "net1": "5e:45:2b:a8:bc:66",
            "net10": "5e:e0:75:b5:36:e9",
            "net2": "b6:c2:1f:7d:fe:15",
            "net3": "ce:9f:f8:9d:f0:7f",
            "net4": "46:59:aa:2c:94:98",
            "net5": "16:f1:a9:c4:4d:0e",
            "net6": "c6:86:35:3b:66:da",
            "net7": "c6:ca:a0:61:39:05",
            "net8": "f6:bc:22:fc:49:4e",
            "net9": "3e:eb:90:15:c3:91"
        },
        "leaf_2_0_7": {
            "net0": "4a:b9:f6:ac:ec:93",
            "net1": "06:1e:c3:eb:35:57",
            "net10": "32:c0:c4:72:37:60",
            "net2": "0a:10:d5:bc:c3:cb",
            "net3": "f2:b0:7e:11:42:5d",
            "net4": "52:0d:bd:a9:c0:a1",
            "net5": "ae:bd:46:c0:34:82",
            "net6": "52:22:d8:ba:eb:41",
            "net7": "fa:a1:08:59:52:62",
            "net8": "7a:cd:15:8c:e6:a5",
            "net9": "02:2a:7b:c4:b4:2a"
        },
        "leaf_2_0_8": {
            "net0": "3e:25:58:2d:98:23",
            "net1": "ce:72:b8:92:98:d1",
            "net10": "4a:0f:60:b8:25:d8",
            "net2": "2a:2d:8d:7f:00:4e",
            "net3": "76:8e:b0:b1:f9:25",
            "net4": "96:cd:8a:24:3b:cc",
            "net5": "1a:59:0c:6b:2a:6d",
            "net6": "8e:f5:af:85:24:55",
            "net7": "c6:3e:2e:61:2b:d4",
            "net8": "7a:35:f7:f6:4d:6b",
            "net9": "f2:eb:f0:19:5f:92"
        },
        "leaf_2_0_9": {
            "net0": "56:3c:45:fd:a3:2b",
            "net1": "16:6b:dc:7e:39:ec",
            "net10": "b6:92:72:a4:2b:5c",
            "net2": "1a:1b:21:60:3c:81",
            "net3": "ea:87:dd:d9:9a:18",
            "net4": "ae:64:53:34:0c:e9",
            "net5": "52:20:f3:3e:37:d1",
            "net6": "32:4f:df:6a:e2:d6",
            "net7": "1a:2d:06:56:c0:de",
            "net8": "aa:b2:50:fc:38:c4",
            "net9": "9a:a9:67:5b:f4:e4"
        },
        "leaf_3_0_1": {
            "net0": "ea:18:6a:b6:12:0a",
            "net1": "86:53:fa:34:14:df",
            "net10": "1a:4d:b8:57:ff:d3",
            "net2": "1e:16:2b:ae:52:cc",
            "net3": "46:68:34:bd:2a:bd",
            "net4": "4a:13:af:6f:7c:a4",
            "net5": "22:39:30:77:17:5e",
            "net6": "66:6a:12:10:ba:b3",
            "net7": "46:e4:8c:f2:28:b8",
            "net8": "2e:c6:94:60:61:ab",
            "net9": "72:90:70:57:68:d4"
        },
        "leaf_3_0_10": {
            "net0": "4a:07:71:2a:91:54",
            "net1": "0a:82:9a:81:83:df",
            "net10": "5a:31:e1:ec:21:56",
            "net2": "e2:94:ee:47:9c:d2",
            "net3": "32:c8:d9:c4:26:e1",
            "net4": "fa:80:37:75:41:ab",
            "net5": "2a:f4:7e:30:e1:cb",
            "net6": "da:da:6e:b1:20:55",
            "net7": "7e:58:4b:59:ca:a0",
            "net8": "da:0f:45:d4:90:18",
            "net9": "62:7e:b9:3a:69:34"
        },
        "leaf_3_0_2": {
            "net0": "2e:57:0a:37:d6:f3",
            "net1": "66:e5:2e:1b:f3:f7",
            "net10": "7e:b7:b3:7c:dd:a6",
            "net2": "8e:25:5a:dd:6e:12",
            "net3": "06:24:00:8c:b7:fc",
            "net4": "fe:c4:74:ee:35:3c",
            "net5": "d2:1e:15:f0:1f:d9",
            "net6": "26:a1:51:b1:ca:ab",
            "net7": "d6:c3:e0:74:fc:71",
            "net8": "ba:4c:40:14:1a:66",
            "net9": "42:60:15:a6:d4:e8"
        },
        "leaf_3_0_3": {
            "net0": "4a:3c:9e:1d:24:23",
            "net1": "16:0c:3b:dd:01:0c",
            "net10": "52:bf:d3:79:28:d9",
            "net2": "82:a6:f5:d6:73:37",
            "net3": "aa:0f:66:f7:35:5b",
            "net4": "f6:55:6d:a1:12:6b",
            "net5": "52:9b:c3:56:a7:4e",
            "net6": "ce:ce:f5:27:81:ab",
            "net7": "ee:df:0d:27:6f:1b",
            "net8": "0a:5a:5e:38:99:61",
            "net9": "52:25:65:ab:cc:f9"
        },
        "leaf_3_0_4": {
            "net0": "62:bd:5c:ed:20:15",
            "net1": "aa:66:59:52:d5:2b",
            "net10": "a6:53:33:77:98:92",
            "net2": "c6:1c:d5:6e:1f:ea",
            "net3": "ae:97:d2:65:c5:a3",
            "net4": "de:35:6c:01:48:f8",
            "net5": "c6:17:8f:31:a1:d8",
            "net6": "92:84:ce:b7:13:71",
            "net7": "12:6b:e5:52:46:97",
            "net8": "b6:53:9b:11:93:e1",
            "net9": "ae:4e:e4:52:bd:ca"
        },
        "leaf_3_0_5": {
            "net0": "5e:94:0c:4b:05:27",
            "net1": "56:aa:00:2e:88:dd",
            "net10": "fe:03:f8:51:26:1f",
            "net2": "06:e9:62:32:8b:d7",
            "net3": "16:9f:c1:9d:c7:90",
            "net4": "de:35:76:1b:af:90",
            "net5": "be:86:2c:97:ee:18",
            "net6": "b2:12:fc:5f:0c:6d",
            "net7": "4a:38:b0:f6:15:0f",
            "net8": "26:1f:30:fa:b8:3b",
            "net9": "5a:85:12:81:3a:06"
        },
        "leaf_3_0_6": {
            "net0": "22:34:32:4d:0a:7d",
            "net1": "36:b2:c2:76:51:06",
            "net10": "9a:2c:c1:4c:e5:27",
            "net2": "66:5a:97:09:12:12",
            "net3": "5e:83:16:4d:bc:d6",
            "net4": "e2:55:89:ae:01:5e",
            "net5": "8a:20:63:6f:7c:1f",
            "net6": "3a:2a:f7:4a:18:4d",
            "net7": "32:7b:6a:9b:e9:50",
            "net8": "72:d3:e3:4f:3b:b8",
            "net9": "46:1e:71:a7:8f:62"
        },
        "leaf_3_0_7": {
            "net0": "46:fb:2e:f9:07:7e",
            "net1": "82:97:f3:22:f0:72",
            "net10": "2e:d8:be:d7:57:c0",
            "net2": "b2:7a:5e:3f:f6:63",
            "net3": "ca:dd:7c:90:70:3c",
            "net4": "9e:d2:45:ce:3f:ce",
            "net5": "b6:ff:7f:a3:76:fc",
            "net6": "f6:58:9e:9d:44:ec",
            "net7": "96:8b:6b:d7:4c:5f",
            "net8": "96:e5:95:60:47:db",
            "net9": "1e:b8:39:09:af:d7"
        },
        "leaf_3_0_8": {
            "net0": "86:d5:3a:9d:96:81",
            "net1": "e6:56:bd:c9:3b:97",
            "net10": "12:b5:a5:37:e3:e6",
            "net2": "ba:e9:c1:e3:5b:57",
            "net3": "d2:42:06:0d:b5:09",
            "net4": "c2:67:80:6e:58:29",
            "net5": "9a:86:98:b7:a4:43",
            "net6": "8a:fc:a9:e6:51:7e",
            "net7": "72:8a:35:46:27:46",
            "net8": "1e:8b:41:09:9a:c1",
            "net9": "52:3e:90:12:7d:c1"
        },
        "leaf_3_0_9": {
            "net0": "ce:ea:7c:8f:22:7b",
            "net1": "d6:d2:55:3c:bc:54",
            "net10": "ae:67:b3:de:a9:ca",
            "net2": "92:45:8b:07:d4:c5",
            "net3": "ba:47:4e:40:17:7b",
            "net4": "6a:d5:84:6a:02:89",
            "net5": "5e:ad:f1:8f:ae:04",
            "net6": "2e:3b:8f:aa:1a:a7",
            "net7": "36:24:f7:3f:61:18",
            "net8": "b6:86:f4:aa:d0:13",
            "net9": "8e:c1:a0:db:3f:d7"
        },
        "leaf_4_0_1": {
            "net0": "d2:28:53:23:66:d4",
            "net1": "6a:41:4e:d7:cd:bc",
            "net10": "a2:e4:39:b2:8a:08",
            "net2": "06:69:af:be:0c:7a",
            "net3": "76:89:a0:3f:d2:dd",
            "net4": "aa:b0:6e:8f:e1:6f",
            "net5": "9e:a8:b8:50:f5:e3",
            "net6": "9a:93:a6:4c:be:20",
            "net7": "4a:63:cb:23:80:7a",
            "net8": "2a:6e:3d:57:2a:e5",
            "net9": "76:07:c5:ce:01:f0"
        },
        "leaf_4_0_10": {
            "net0": "ae:9e:ca:74:ed:7b",
            "net1": "4e:94:ed:58:85:2f",
            "net10": "06:45:21:ad:0c:9b",
            "net2": "d2:1d:d8:d3:e8:ce",
            "net3": "06:4c:42:7b:a5:ee",
            "net4": "ce:d1:bf:0a:03:81",
            "net5": "52:50:2f:42:06:db",
            "net6": "3a:7d:5a:04:fb:1b",
            "net7": "f2:84:4c:a9:10:b0",
            "net8": "fa:eb:0f:e7:97:f1",
            "net9": "8e:e1:e9:54:9f:52"
        },
        "leaf_4_0_2": {
            "net0": "ce:63:18:33:96:ac",
            "net1": "56:46:1e:bb:09:8c",
            "net10": "d6:4d:26:1c:b1:fb",
            "net2": "76:6e:a6:9b:97:6d",
            "net3": "f2:90:fb:24:52:9e",
            "net4": "92:ae:69:be:ae:14",
            "net5": "66:a3:61:5b:cd:ae",
            "net6": "0e:21:ea:90:d5:aa",
            "net7": "1e:e2:bd:7d:82:76",
            "net8": "02:ad:48:95:53:03",
            "net9": "a6:be:1c:25:7d:14"
        },
        "leaf_4_0_3": {
            "net0": "ba:22:64:81:23:3e",
            "net1": "ea:e1:8b:06:06:db",
            "net10": "5a:92:41:c7:5e:1c",
            "net2": "f2:a5:f7:ab:9f:1a",
            "net3": "c6:f4:cd:a0:cb:42",
            "net4": "7e:7a:dd:9a:61:0d",
            "net5": "6e:5f:03:97:75:c9",
            "net6": "ee:38:0e:2f:43:95",
            "net7": "32:81:3e:b5:e7:7c",
            "net8": "42:cf:e6:d6:f1:02",
            "net9": "5e:8b:12:5a:eb:b1"
        },
        "leaf_4_0_4": {
            "net0": "1e:0c:7b:74:59:db",
            "net1": "56:9e:f2:38:ba:84",
            "net10": "1a:48:d2:90:32:d7",
            "net2": "d6:88:30:44:31:0e",
            "net3": "6e:e5:b0:14:61:69",
            "net4": "22:3c:0e:15:b4:ca",
            "net5": "d6:20:79:59:35:d6",
            "net6": "d6:9e:7d:8c:94:72",
            "net7": "3a:c9:5d:6c:42:f0",
            "net8": "e6:ba:d6:4b:0f:76",
            "net9": "12:43:8a:92:a6:42"
        },
        "leaf_4_0_5": {
            "net0": "fe:6a:4f:eb:71:59",
            "net1": "a6:80:cd:14:83:88",
            "net10": "da:ff:bd:3d:1b:36",
            "net2": "72:f7:e4:c5:99:69",
            "net3": "ee:c6:d1:92:85:cf",
            "net4": "fa:03:f5:7b:97:ac",
            "net5": "7e:c9:fe:0f:e2:7b",
            "net6": "36:de:2a:29:4e:43",
            "net7": "be:7e:57:ae:82:45",
            "net8": "de:2c:ff:8e:1c:13",
            "net9": "26:2e:12:ed:cf:c8"
        },
        "leaf_4_0_6": {
            "net0": "86:47:e3:7b:87:3a",
            "net1": "86:58:06:85:29:e4",
            "net10": "7a:e3:1f:c7:53:ac",
            "net2": "82:99:e7:30:29:1e",
            "net3": "ca:e5:77:81:b7:56",
            "net4": "e2:8d:f4:1d:b7:70",
            "net5": "6a:7b:4f:b1:0a:83",
            "net6": "76:3f:3b:d1:68:28",
            "net7": "8a:2f:a5:78:ca:a8",
            "net8": "7a:9e:48:ca:bb:7f",
            "net9": "fe:f9:cd:41:e6:1a"
        },
        "leaf_4_0_7": {
            "net0": "c6:4e:86:7a:ce:45",
            "net1": "72:2e:d7:8a:e4:31",
            "net10": "5a:6e:b2:c1:b0:5e",
            "net2": "7a:1b:58:0d:bb:dd",
            "net3": "92:7e:45:7e:a0:d2",
            "net4": "32:c9:cf:0a:59:b7",
            "net5": "12:64:6e:a9:ee:a7",
            "net6": "4a:9b:0c:f7:ed:1a",
            "net7": "56:50:fa:11:b2:41",
            "net8": "fa:3f:be:35:6b:28",
            "net9": "ca:27:a3:2f:9f:0a"
        },
        "leaf_4_0_8": {
            "net0": "f2:09:3c:e2:52:47",
            "net1": "32:70:d6:2e:47:51",
            "net10": "06:ce:d1:30:6a:4c",
            "net2": "d2:71:8f:87:a2:b2",
            "net3": "06:d4:98:a0:8c:bb",
            "net4": "4a:fe:eb:b6:9d:26",
            "net5": "52:b5:e5:2e:5a:01",
            "net6": "da:a4:1b:18:74:9f",
            "net7": "16:ba:d4:ec:33:4c",
            "net8": "1a:19:8c:b4:9f:fb",
            "net9": "ee:01:f3:bd:cf:89"
        },
        "leaf_4_0_9": {
            "net0": "e6:da:57:db:7a:dc",
            "net1": "6a:12:0a:10:64:6d",
            "net10": "ae:7a:33:4e:89:ba",
            "net2": "a2:25:ae:7c:e3:6a",
            "net3": "f2:74:9d:84:a0:95",
            "net4": "f2:a1:74:12:8c:20",
            "net5": "12:f7:36:eb:80:21",
            "net6": "9e:3e:02:52:dc:73",
            "net7": "d6:2b:2b:b8:72:d5",
            "net8": "e2:0a:df:6c:ef:1f",
            "net9": "1a:17:29:8b:8e:8b"
        },
        "spine_1_1_1": {
            "net0": "0e:bc:84:30:bb:4a",
            "net1": "42:17:6f:4b:b0:62",
            "net10": "e6:a5:31:4e:e3:92",
            "net11": "06:70:0f:68:72:c1",
            "net12": "de:fb:6d:01:9f:15",
            "net13": "d6:1a:f0:ee:54:6c",
            "net14": "ce:b6:2f:98:a2:3e",
            "net15": "0a:1e:67:9c:76:b1",
            "net16": "8e:06:fa:15:71:19",
            "net17": "e6:b8:3f:b4:76:d3",
            "net18": "d2:d7:90:98:34:67",
            "net19": "c6:e5:a6:72:34:9e",
            "net2": "12:fd:92:f4:42:2a",
            "net3": "76:08:22:7c:f5:14",
            "net4": "66:d9:44:8d:4b:3c",
            "net5": "42:02:73:a0:75:2e",
            "net6": "9a:bf:a3:06:6f:1f",
            "net7": "52:c6:f1:1c:c7:b4",
            "net8": "8e:7b:eb:c2:70:2d",
            "net9": "b2:ab:e4:ef:75:a6"
        },
        "spine_1_1_10": {
            "net0": "8e:19:bb:3a:84:2f",
            "net1": "ba:55:c9:c5:3a:4f",
            "net10": "be:f9:f8:f2:83:89",
            "net11": "de:4f:ce:5e:30:a6",
            "net12": "ea:98:44:7e:1c:02",
            "net13": "e6:a2:0b:2c:ed:43",
            "net14": "56:dd:46:bb:ed:6e",
            "net15": "e6:75:28:3f:dd:5d",
            "net16": "4a:b2:17:a5:4d:00",
            "net17": "3a:cd:db:f8:3b:1c",
            "net18": "b2:71:f3:a4:73:f9",
            "net19": "1e:54:84:44:91:89",
            "net2": "ae:d5:f0:fa:5b:d3",
            "net3": "32:00:96:da:f1:42",
            "net4": "ea:fa:57:04:f5:6f",
            "net5": "ba:58:d1:84:e4:58",
            "net6": "36:31:04:32:d4:29",
            "net7": "02:92:82:d3:0a:17",
            "net8": "a6:25:1d:72:39:c5",
            "net9": "26:0b:a1:20:ae:fd"
        },
        "spine_1_1_2": {
            "net0": "2e:51:0a:f9:bc:ee",
            "net1": "32:86:6c:e6:54:c5",
            "net10": "1a:68:69:a7:82:0b",
            "net11": "16:61:de:4a:b5:32",
            "net12": "d6:6f:78:43:79:25",
            "net13": "4a:bd:f8:e7:08:2c",
            "net14": "22:d4:4a:fd:0e:f3",
            "net15": "82:1b:45:35:cc:57",
            "net16": "8a:c2:8c:76:e1:46",
            "net17": "86:37:c2:0a:82:62",
            "net18": "b6:34:10:e5:ea:77",
            "net19": "36:9e:80:17:68:ce",
            "net2": "8a:1e:70:de:f6:05",
            "net3": "5a:bd:2b:c1:a5:f5",
            "net4": "46:a8:14:9f:91:b7",
            "net5": "ce:11:0f:6b:8a:4c",
            "net6": "c2:34:bf:7f:4e:0e",
            "net7": "46:fd:93:49:c3:79",
            "net8": "fa:e6:a8:bc:dc:86",
            "net9": "92:82:2a:0a:81:d2"
        },
        "spine_1_1_3": {
            "net0": "6a:ae:d4:a4:51:5c",
            "net1": "8e:38:60:97:8f:84",
            "net10": "6e:92:29:e5:10:13",
            "net11": "36:56:f4:84:af:14",
            "net12": "02:d1:56:e5:d3:92",
            "net13": "d2:cf:bd:a2:de:9d",
            "net14": "a6:dc:df:9b:06:6e",
            "net15": "ce:be:49:d8:79:34",
            "net16": "1a:55:90:63:b0:8b",
            "net17": "9a:5b:10:4b:68:44",
            "net18": "f2:83:70:24:e1:e3",
            "net19": "e2:a8:8f:cd:c9:37",
            "net2": "d6:ba:12:6b:fe:13",
            "net3": "e6:2c:f5:65:b9:10",
            "net4": "3e:a0:fc:ca:4a:b6",
            "net5": "7a:3b:92:42:a4:98",
            "net6": "ea:0f:d8:68:3c:9b",
            "net7": "b2:85:50:98:24:93",
            "net8": "f2:29:14:d6:9e:9e",
            "net9": "52:b7:bf:e1:6c:0b"
        },
        "spine_1_1_4": {
            "net0": "7a:cf:54:4d:07:86",
            "net1": "be:41:8c:be:63:68",
            "net10": "86:e9:05:40:76:b7",
            "net11": "0e:0f:9f:14:43:ff",
            "net12": "be:e5:ff:9c:da:fb",
            "net13": "5e:e1:7d:0a:32:50",
            "net14": "2a:ad:00:ae:ca:a6",
            "net15": "7e:04:a6:82:f9:f0",
            "net16": "aa:df:5d:84:ce:50",
            "net17": "ee:8f:6c:4b:24:a5",
            "net18": "3a:4f:84:a5:2c:f6",
            "net19": "36:d7:1e:29:bd:17",
            "net2": "02:5d:05:fe:57:f1",
            "net3": "96:75:43:af:99:3b",
            "net4": "a2:72:fd:2f:53:44",
            "net5": "46:ff:36:96:c6:c7",
            "net6": "7e:10:1f:fb:40:82",
            "net7": "46:27:51:a0:df:37",
            "net8": "52:cf:4f:ee:37:7c",
            "net9": "6e:84:1e:b4:c4:1b"
        },
        "spine_1_1_5": {
            "net0": "82:6e:7e:38:60:b2",
            "net1": "46:71:cc:37:ff:93",
            "net10": "8e:ac:80:d9:c5:8d",
            "net11": "5e:7a:87:07:9b:f6",
            "net12": "a2:96:43:e6:6e:2b",
            "net13": "c6:99:2a:c3:6f:6c",
            "net14": "86:bc:a7:a3:10:82",
            "net15": "36:e1:22:b4:8b:37",
            "net16": "22:02:6e:74:92:d3",
            "net17": "56:5d:2a:01:77:ef",
            "net18": "fa:93:14:80:2d:c3",
            "net19": "92:2e:1b:53:5c:d0",
            "net2": "66:41:ca:6a:a3:af",
            "net3": "ee:c1:9d:0e:2f:12",
            "net4": "96:df:a4:7e:6c:39",
            "net5": "e2:b2:04:5a:4e:e6",
            "net6": "52:ae:bb:e1:34:c0",
            "net7": "4a:cc:38:77:18:93",
            "net8": "e2:0a:f3:63:03:1e",
            "net9": "06:ab:7b:b7:89:10"
        },
        "spine_1_1_6": {
            "net0": "0e:3c:2a:69:e7:60",
            "net1": "ce:5d:4c:3b:f3:78",
            "net10": "82:ed:22:7a:6d:a9",
            "net11": "9e:83:e6:d1:79:05",
            "net12": "1e:6c:be:a0:13:ea",
            "net13": "fa:5b:1f:35:49:c2",
            "net14": "ee:a5:33:a5:2f:27",
            "net15": "36:b3:80:98:c7:69",
            "net16": "06:78:7f:77:80:5f",
            "net17": "0a:13:05:b7:60:45",
            "net18": "d2:3d:22:93:dc:26",
            "net19": "32:4f:0d:63:59:ef",
            "net2": "96:92:12:0f:c5:4e",
            "net3": "da:5e:7e:6a:a4:74",
            "net4": "be:06:e7:98:75:a4",
            "net5": "82:f6:64:b4:0d:22",
            "net6": "02:b6:65:73:99:03",
            "net7": "fe:61:22:37:fe:4b",
            "net8": "32:f2:fa:fa:9c:a1",
            "net9": "12:ed:5e:b9:16:78"
        },
        "spine_1_1_7": {
            "net0": "e6:cd:b6:5e:75:f7",
            "net1": "62:69:f3:d6:21:82",
            "net10": "ae:d8:3a:6f:2a:ea",
            "net11": "06:05:60:4a:04:03",
            "net12": "9a:fe:27:f6:15:82",
            "net13": "9a:a3:18:5d:dc:37",
            "net14": "ba:a9:1f:f7:92:6c",
            "net15": "ba:ae:96:bd:5d:ba",
            "net16": "b2:d3:26:9c:97:b4",
            "net17": "ae:f6:fd:19:88:ad",
            "net18": "b2:a3:4f:86:75:28",
            "net19": "de:5b:40:0e:3a:9b",
            "net2": "1e:c4:88:81:24:ce",
            "net3": "a2:72:07:d4:e5:d5",
            "net4": "1e:33:7a:c6:b8:77",
            "net5": "9a:b6:e3:a4:6e:a8",
            "net6": "e6:0b:e5:3f:4a:29",
            "net7": "da:21:d8:8f:4a:5a",
            "net8": "0a:1f:c0:a4:3c:7e",
            "net9": "22:ef:06:67:01:4d"
        },
        "spine_1_1_8": {
            "net0": "c2:6a:3e:a0:ef:91",
            "net1": "5e:39:0d:bc:86:5c",
            "net10": "b6:bc:b3:11:d7:32",
            "net11": "82:fb:69:c4:f9:66",
            "net12": "8a:b4:75:31:2b:1e",
            "net13": "fa:b5:50:73:f9:9b",
            "net14": "42:76:ee:c3:85:91",
            "net15": "06:b2:35:62:79:25",
            "net16": "ea:f0:e6:97:2e:f7",
            "net17": "8e:21:d4:38:d3:62",
            "net18": "f2:49:3c:09:64:8c",
            "net19": "7e:35:7a:15:5d:c8",
            "net2": "26:85:39:bc:f7:be",
            "net3": "be:56:54:da:35:76",
            "net4": "26:78:0b:df:73:77",
            "net5": "a2:64:32:c8:f5:b2",
            "net6": "da:92:a4:fb:9c:cd",
            "net7": "5a:c5:95:a8:eb:97",
            "net8": "8a:23:bf:18:91:7a",
            "net9": "fa:91:33:e1:75:c7"
        },
        "spine_1_1_9": {
            "net0": "8e:a4:b4:dd:95:aa",
            "net1": "36:4c:04:81:37:47",
            "net10": "62:89:eb:01:0f:55",
            "net11": "ee:3f:33:ce:60:13",
            "net12": "ca:38:99:b3:3f:b2",
            "net13": "2e:9b:6c:bc:3d:d8",
            "net14": "4e:e4:e4:62:45:98",
            "net15": "2e:d3:5d:09:be:94",
            "net16": "c6:6a:cd:dc:c9:58",
            "net17": "aa:3a:7b:0b:fb:36",
            "net18": "96:e6:a0:be:39:7c",
            "net19": "2a:ae:73:13:dc:c7",
            "net2": "c2:55:81:48:7c:45",
            "net3": "1e:1b:ca:fc:0c:5a",
            "net4": "da:37:b9:f5:12:22",
            "net5": "ca:20:6f:2c:ec:7d",
            "net6": "9e:83:cc:f1:f1:28",
            "net7": "16:8e:15:35:86:94",
            "net8": "c6:62:ec:a2:2b:27",
            "net9": "f2:c2:d9:80:8f:be"
        },
        "spine_2_1_1": {
            "net0": "3e:da:9c:21:b5:86",
            "net1": "1a:24:56:22:50:0c",
            "net10": "7a:5a:d4:0e:f2:c1",
            "net11": "96:d3:b2:55:0b:f7",
            "net12": "9a:01:71:93:28:7e",
            "net13": "e2:13:c5:35:cf:fe",
            "net14": "3a:51:59:de:26:0d",
            "net15": "ce:81:01:1b:8c:d6",
            "net16": "0a:88:63:a7:9b:fe",
            "net17": "76:cc:17:1c:d7:b9",
            "net18": "52:b8:55:03:4e:1e",
            "net19": "72:af:2f:5a:0c:84",
            "net2": "9e:90:e6:69:4f:23",
            "net3": "62:21:ab:2a:e9:0a",
            "net4": "2e:bf:b1:28:c8:ea",
            "net5": "a2:42:91:2b:b7:48",
            "net6": "0a:1b:30:aa:41:82",
            "net7": "ee:96:5d:d4:46:07",
            "net8": "8e:11:57:95:49:63",
            "net9": "c6:f0:e2:95:b7:5d"
        },
        "spine_2_1_10": {
            "net0": "5a:c7:a8:3c:f3:17",
            "net1": "ee:61:80:08:a9:b9",
            "net10": "f2:78:ab:d3:7f:ef",
            "net11": "32:c7:b5:55:c2:0f",
            "net12": "ce:84:de:fb:29:54",
            "net13": "f6:69:be:b4:cb:53",
            "net14": "ca:ec:24:16:e5:f4",
            "net15": "0e:e3:67:88:fc:da",
            "net16": "1e:36:16:2c:68:09",
            "net17": "92:52:35:72:5d:1f",
            "net18": "2e:ac:7a:7d:fe:4e",
            "net19": "26:44:4e:ea:95:ae",
            "net2": "96:dc:17:3e:88:f7",
            "net3": "46:b9:5b:f5:44:67",
            "net4": "42:c4:84:93:55:ee",
            "net5": "0e:4c:4d:5d:a9:37",
            "net6": "32:82:37:11:f2:e2",
            "net7": "ba:2b:00:52:ed:95",
            "net8": "86:6c:d6:c0:88:10",
            "net9": "c2:61:f3:47:d6:27"
        },
        "spine_2_1_2": {
            "net0": "8a:98:8e:8d:5d:07",
            "net1": "92:99:16:3c:3f:16",
            "net10": "92:e5:7f:97:1e:e4",
            "net11": "e6:ef:90:a4:0a:0d",
            "net12": "d6:14:f0:4d:de:11",
            "net13": "2e:00:f2:e1:04:5e",
            "net14": "8e:80:6d:5e:2b:76",
            "net15": "a2:57:d9:83:55:0c",
            "net16": "0e:9e:65:33:5b:8f",
            "net17": "62:c1:62:15:5d:37",
            "net18": "3e:94:25:ff:a3:77",
            "net19": "5a:bd:95:d2:98:32",
            "net2": "5e:a8:b9:e5:71:36",
            "net3": "32:6f:c6:3a:84:bc",
            "net4": "fa:e9:fa:c4:22:b0",
            "net5": "8a:06:63:13:cd:44",
            "net6": "be:9a:a8:d5:03:86",
            "net7": "ce:4c:2a:75:48:02",
            "net8": "92:f2:97:5b:d8:09",
            "net9": "62:52:e0:bb:a4:19"
        },
        "spine_2_1_3": {
            "net0": "ae:36:73:bf:c2:68",
            "net1": "4a:81:0c:f4:d7:ee",
            "net10": "42:bd:ae:20:57:51",
            "net11": "16:80:75:ed:d6:37",
            "net12": "a6:c6:c0:b6:8c:58",
            "net13": "7e:b3:6b:e3:0e:25",
            "net14": "c2:f7:6a:a0:80:de",
            "net15": "de:c3:eb:3a:33:90",
            "net16": "12:e7:29:a3:24:31",
            "net17": "62:d7:0b:18:b0:15",
            "net18": "76:cc:c3:1a:14:fc",
            "net19": "96:9a:40:59:f8:ae",
            "net2": "ea:bd:eb:8a:de:a0",
            "net3": "42:a0:76:32:12:e2",
            "net4": "6a:cd:a7:90:ad:fc",
            "net5": "a6:82:46:cc:50:7e",
            "net6": "62:62:da:d2:bc:80",
            "net7": "66:22:6a:7c:cf:89",
            "net8": "ce:db:b8:c6:ad:b4",
            "net9": "9a:91:6a:0b:b8:12"
        },
        "spine_2_1_4": {
            "net0": "9a:9b:4c:44:c0:b2",
            "net1": "6a:4e:bf:c4:2a:92",
            "net10": "62:79:c0:00:8a:1e",
            "net11": "f6:49:2c:fa:1e:b2",
            "net12": "6a:48:bf:b6:7a:18",
            "net13": "92:4e:e8:4b:66:a1",
            "net14": "3e:af:bf:97:c8:a4",
            "net15": "92:08:c4:20:c0:b4",
            "net16": "56:84:b1:0a:3c:72",
            "net17": "1e:c6:d7:a8:6c:63",
            "net18": "6e:2b:85:1c:bf:f7",
            "net19": "3e:cf:56:0e:3b:8c",
            "net2": "72:3c:c5:b1:4e:29",
            "net3": "f2:04:30:a3:78:fb",
            "net4": "c6:f2:37:ed:f9:cd",
            "net5": "52:70:21:ba:09:4c",
            "net6": "0e:4c:fe:98:0c:1c",
            "net7": "26:8d:e0:18:b5:b2",
            "net8": "aa:28:b6:d0:6e:1d",
            "net9": "c2:0a:ac:b4:61:8c"
        },
        "spine_2_1_5": {
            "net0": "56:97:f2:d6:3c:a5",
            "net1": "6a:32:d5:e7:d8:ed",
            "net10": "a2:a1:54:40:30:9e",
            "net11": "7e:78:fa:74:ec:f0",
            "net12": "22:00:23:cb:ea:5b",
            "net13": "1a:40:45:7b:ba:58",
            "net14": "06:48:5b:b0:9b:5d",
            "net15": "2a:ce:b2:b6:05:89",
            "net16": "f6:86:01:88:0b:55",
            "net17": "46:2b:ac:cb:4c:63",
            "net18": "8e:52:09:e9:eb:36",
            "net19": "7a:30:03:23:0a:ed",
            "net2": "2e:3f:64:7f:7c:b9",
            "net3": "52:73:07:f6:dc:51",
            "net4": "82:ae:c4:26:1b:d3",
            "net5": "3a:fd:88:d2:6a:a7",
            "net6": "5e:42:e4:5d:f1:7c",
            "net7": "76:9e:3d:73:53:c5",
            "net8": "ea:1c:d5:a1:f2:7f",
            "net9": "72:92:29:b0:10:6f"
        },
        "spine_2_1_6": {
            "net0": "82:8b:ed:d3:c3:9b",
            "net1": "5e:b7:b9:41:72:29",
            "net10": "de:0c:a5:cb:13:d0",
            "net11": "de:a7:59:95:a9:ea",
            "net12": "0e:42:e7:fb:8b:09",
            "net13": "e6:6d:e5:5b:9e:53",
            "net14": "02:d4:d5:1d:7e:9e",
            "net15": "3a:eb:41:1a:48:ff",
            "net16": "32:6f:26:26:29:12",
            "net17": "e2:e9:bd:5f:b8:60",
            "net18": "6e:ac:4b:f0:b7:ae",
            "net19": "12:5f:60:c9:df:61",
            "net2": "36:30:03:81:c1:81",
            "net3": "92:3e:84:39:dc:54",
            "net4": "82:79:3d:69:ab:4a",
            "net5": "de:cc:9c:27:4a:01",
            "net6": "1a:5f:56:36:36:78",
            "net7": "8a:10:30:c7:e0:0e",
            "net8": "ba:58:c6:56:f3:67",
            "net9": "72:c8:72:9d:5d:4c"
        },
        "spine_2_1_7": {
            "net0": "1a:04:e0:cf:ed:1f",
            "net1": "ee:a7:02:3c:6f:cb",
            "net10": "1a:8b:73:3d:d3:8e",
            "net11": "1a:48:dc:89:ba:e7",
            "net12": "7e:d5:bb:40:45:14",
            "net13": "86:3c:a1:33:b2:ca",
            "net14": "b6:73:98:4d:f2:7b",
            "net15": "1a:e8:82:4e:ab:50",
            "net16": "92:8b:82:4d:9f:3a",
            "net17": "fa:50:9d:16:93:fb",
            "net18": "3a:9a:c4:6d:97:7e",
            "net19": "72:c6:4c:f0:5a:ea",
            "net2": "9e:1b:c1:1e:e0:b4",
            "net3": "f6:ec:6b:b2:b5:00",
            "net4": "f2:9a:1e:52:f9:21",
            "net5": "ce:a2:89:70:24:3c",
            "net6": "86:60:b8:34:52:a1",
            "net7": "aa:ce:b7:55:cd:3a",
            "net8": "32:7b:38:c2:48:b5",
            "net9": "3a:82:2e:d8:91:d2"
        },
        "spine_2_1_8": {
            "net0": "b6:99:32:71:98:43",
            "net1": "6a:3b:0e:1b:ed:1c",
            "net10": "82:ba:ac:1f:31:4d",
            "net11": "46:a6:9b:9f:b4:97",
            "net12": "2a:2c:c2:29:98:cc",
            "net13": "ae:0e:5e:65:c0:95",
            "net14": "0a:01:fe:79:f7:ea",
            "net15": "5e:29:5b:df:9d:1e",
            "net16": "32:42:32:17:9e:fe",
            "net17": "5a:11:ef:d9:91:8d",
            "net18": "16:bb:ce:3d:11:57",
            "net19": "ae:e4:0e:23:4f:62",
            "net2": "c6:8a:c9:94:14:16",
            "net3": "0a:03:b8:d0:0b:46",
            "net4": "d2:6a:45:1b:f3:99",
            "net5": "8e:29:79:53:ed:ef",
            "net6": "1a:3a:e3:b0:73:db",
            "net7": "d2:ec:1c:76:37:54",
            "net8": "e6:ee:cf:45:ad:53",
            "net9": "0a:e8:71:50:43:e9"
        },
        "spine_2_1_9": {
            "net0": "4a:7a:e9:20:80:d2",
            "net1": "52:36:54:c6:00:1e",
            "net10": "ca:e9:ce:7c:ef:d8",
            "net11": "0e:ca:e8:05:8e:ac",
            "net12": "a6:f7:14:7b:3a:c2",
            "net13": "36:c6:91:9f:16:cd",
            "net14": "ce:47:4f:5c:16:cc",
            "net15": "ba:6f:30:4f:14:51",
            "net16": "82:e5:a1:d7:53:e5",
            "net17": "aa:99:76:53:a7:fa",
            "net18": "de:5f:79:ed:15:db",
            "net19": "c6:d9:b3:10:2e:0e",
            "net2": "9e:f8:91:db:aa:20",
            "net3": "7a:3f:36:6b:36:7b",
            "net4": "ba:1a:f8:e1:ca:37",
            "net5": "92:db:de:a5:67:72",
            "net6": "7a:d1:1f:ec:cd:df",
            "net7": "7e:82:db:0c:5f:08",
            "net8": "b6:51:13:f4:f6:20",
            "net9": "6e:52:11:f2:18:8b"
        },
        "spine_3_1_1": {
            "net0": "96:43:f6:86:71:a4",
            "net1": "1a:79:48:84:7a:3f",
            "net10": "f2:e9:71:9f:09:f0",
            "net11": "b2:ab:9e:24:94:0d",
            "net12": "9e:b9:00:0e:e4:d2",
            "net13": "6a:83:f8:a4:ed:2b",
            "net14": "3a:dd:a1:d3:ff:39",
            "net15": "7e:9c:e7:83:ea:57",
            "net16": "c2:87:6e:c6:d2:54",
            "net17": "86:12:04:3e:85:42",
            "net18": "56:03:d3:f8:6d:28",
            "net19": "f6:b9:f5:a1:d6:0e",
            "net2": "92:e9:36:ba:de:c2",
            "net3": "ce:c5:53:15:5c:08",
            "net4": "2a:4d:b0:c4:a6:8d",
            "net5": "72:26:d9:2d:af:64",
            "net6": "fa:4d:84:64:af:5f",
            "net7": "32:c2:a6:d3:a5:80",
            "net8": "3a:66:07:df:a0:61",
            "net9": "b6:40:0f:69:fd:e0"
        },
        "spine_3_1_10": {
            "net0": "6a:37:bf:97:30:37",
            "net1": "e6:75:c8:a9:bf:b3",
            "net10": "4e:b4:68:13:f1:ab",
            "net11": "3e:6f:56:40:e2:15",
            "net12": "ea:70:4b:03:9d:b8",
            "net13": "1e:5c:b1:7d:4b:11",
            "net14": "86:a3:93:2e:b1:a7",
            "net15": "ca:83:e1:bf:27:10",
            "net16": "86:97:d8:cd:14:93",
            "net17": "2e:3d:d5:37:da:4d",
            "net18": "8a:78:c0:be:eb:72",
            "net19": "3a:79:ac:84:2b:7f",
            "net2": "8a:d2:11:06:09:01",
            "net3": "8e:b5:7b:cd:c7:b5",
            "net4": "9a:06:6d:c6:55:c9",
            "net5": "86:0f:3d:fc:7e:b8",
            "net6": "0e:4a:a4:93:10:08",
            "net7": "26:a7:4e:84:6c:2e",
            "net8": "0e:8a:e6:0a:6e:be",
            "net9": "c6:85:09:c5:93:d8"
        },
        "spine_3_1_2": {
            "net0": "96:d8:5a:f8:89:0b",
            "net1": "0e:92:ab:f0:de:7f",
            "net10": "b6:10:74:12:ff:7a",
            "net11": "9a:c9:a6:8a:2f:0c",
            "net12": "de:ac:ea:a0:5c:4b",
            "net13": "ee:4d:c4:e3:1c:3f",
            "net14": "5a:0f:97:c5:17:24",
            "net15": "92:3a:a1:ac:d7:c1",
            "net16": "de:56:bd:e1:4c:d9",
            "net17": "12:c9:80:5d:30:e1",
            "net18": "fe:b0:d7:b0:35:d5",
            "net19": "c6:d3:ef:e0:23:c2",
            "net2": "86:00:78:fb:f8:b1",
            "net3": "7a:db:9c:2e:84:fd",
            "net4": "56:26:92:f7:69:31",
            "net5": "fe:b2:22:5a:84:2a",
            "net6": "ca:78:81:0f:73:da",
            "net7": "26:4d:b8:74:8f:96",
            "net8": "e2:55:44:c8:54:2f",
            "net9": "3e:b7:34:b9:d1:41"
        },
        "spine_3_1_3": {
            "net0": "1a:08:de:f9:8d:a1",
            "net1": "aa:9d:2f:54:9e:f4",
            "net10": "de:19:44:03:af:1b",
            "net11": "e2:bc:da:c1:8b:25",
            "net12": "0e:33:aa:84:51:20",
            "net13": "d6:e6:e7:3d:a9:2e",
            "net14": "12:31:ff:a4:06:74",
            "net15": "4a:bc:36:5b:87:62",
            "net16": "aa:87:8b:39:ee:2e",
            "net17": "3a:0b:83:55:ca:53",
            "net18": "4e:e5:e7:4b:47:19",
            "net19": "46:25:de:37:03:2a",
            "net2": "fe:f3:1f:f1:ab:53",
            "net3": "5e:ef:75:40:40:6c",
            "net4": "ae:53:51:df:a5:a4",
            "net5": "92:f1:b0:c7:fc:2b",
            "net6": "42:32:00:bb:18:0f",
            "net7": "3a:e7:11:64:aa:58",
            "net8": "86:90:5a:4e:07:ca",
            "net9": "0a:6e:f2:e4:66:a6"
        },
        "spine_3_1_4": {
            "net0": "42:40:18:cc:d2:83",
            "net1": "6e:7b:9b:d2:07:2d",
            "net10": "c6:04:2d:37:25:c2",
            "net11": "ae:43:15:57:66:6f",
            "net12": "a6:dd:f6:7f:45:b6",
            "net13": "1a:3d:b5:3d:c0:5b",
            "net14": "3a:f5:72:a5:16:20",
            "net15": "4e:58:68:2c:1e:69",
            "net16": "8e:c8:56:6f:00:37",
            "net17": "02:75:9d:f6:7c:6a",
            "net18": "62:25:6a:cc:ae:f6",
            "net19": "2e:88:91:fd:30:97",
            "net2": "16:83:48:74:1f:1c",
            "net3": "ce:93:24:86:89:4a",
            "net4": "26:3a:66:88:b3:ff",
            "net5": "da:92:de:8c:46:b6",
            "net6": "22:ea:1e:15:fa:fa",
            "net7": "1e:bb:ed:25:ef:e2",
            "net8": "36:5e:de:10:b8:c6",
            "net9": "12:8a:f4:7e:b4:19"
        },
        "spine_3_1_5": {
            "net0": "06:98:f2:c3:ee:43",
            "net1": "9a:88:2d:13:2a:95",
            "net10": "be:19:be:14:13:dc",
            "net11": "1e:b5:9d:2a:7c:e9",
            "net12": "12:85:e6:5c:1c:c3",
            "net13": "56:32:03:73:64:b8",
            "net14": "2a:a1:06:26:ae:4f",
            "net15": "9e:5a:2b:a5:fa:d8",
            "net16": "86:f8:d7:b7:6d:f0",
            "net17": "de:b5:bd:f3:fa:be",
            "net18": "b2:9b:a3:3c:c6:d0",
            "net19": "9a:e9:2c:49:50:15",
            "net2": "d6:e7:0e:9a:95:94",
            "net3": "86:1c:3b:6f:4d:6f",
            "net4": "e2:64:e0:2f:e0:06",
            "net5": "3a:c1:d8:a6:b8:e8",
            "net6": "da:19:f8:ac:e9:f6",
            "net7": "a2:ea:d3:5a:29:5a",
            "net8": "02:99:2d:9a:f4:12",
            "net9": "e2:24:cb:2f:89:aa"
        },
        "spine_3_1_6": {
            "net0": "06:61:3d:2c:e7:e1",
            "net1": "7e:0c:fd:e4:a2:cc",
            "net10": "02:ef:a5:79:2e:53",
            "net11": "1a:ac:af:11:8c:6e",
            "net12": "66:4e:aa:69:e1:8b",
            "net13": "4a:ec:bf:4b:58:6b",
            "net14": "da:6c:96:dc:4d:8b",
            "net15": "16:e3:b2:2b:b3:3e",
            "net16": "12:b5:f9:3d:b6:62",
            "net17": "a2:55:5b:9e:60:74",
            "net18": "1a:ce:fc:c3:2f:19",
            "net19": "9e:ea:92:b7:e2:25",
            "net2": "a6:99:9b:bc:12:8d",
            "net3": "6e:21:e1:d9:64:47",
            "net4": "5a:05:fd:3c:71:ad",
            "net5": "fa:ff:77:d5:02:f8",
            "net6": "72:f0:ba:77:79:d9",
            "net7": "32:77:a1:27:e4:02",
            "net8": "36:3e:99:23:81:a3",
            "net9": "fe:08:ad:1c:42:f8"
        },
        "spine_3_1_7": {
            "net0": "3a:8a:24:90:64:35",
            "net1": "b2:d0:fd:b9:bb:4a",
            "net10": "e6:9c:87:a1:b4:3b",
            "net11": "6e:12:54:5b:43:1f",
            "net12": "6a:04:c0:73:a2:af",
            "net13": "e2:27:8a:95:2f:46",
            "net14": "f2:18:c7:d2:97:06",
            "net15": "e2:ba:de:32:3a:81",
            "net16": "72:1e:40:fe:c2:d3",
            "net17": "e6:54:87:97:70:ca",
            "net18": "86:2e:31:c2:72:ce",
            "net19": "0a:b6:89:2a:9f:2e",
            "net2": "96:c1:53:51:ba:ed",
            "net3": "1e:92:3d:ce:b2:61",
            "net4": "de:ae:f0:10:65:c9",
            "net5": "b6:67:ef:b9:1a:30",
            "net6": "46:49:16:18:2d:6f",
            "net7": "6a:46:39:c7:32:d4",
            "net8": "86:21:65:cc:41:0e",
            "net9": "9e:8c:6f:e1:53:f6"
        },
        "spine_3_1_8": {
            "net0": "aa:05:fa:65:8b:a6",
            "net1": "d2:e9:78:f6:c9:c5",
            "net10": "2a:6e:ec:a4:a7:87",
            "net11": "c6:1e:56:fe:28:b6",
            "net12": "36:7e:33:1e:78:a3",
            "net13": "2a:b7:11:e5:ff:66",
            "net14": "12:20:0e:30:77:0b",
            "net15": "22:d0:1a:0b:59:27",
            "net16": "ea:81:37:fe:25:f8",
            "net17": "1a:c4:f6:78:fa:d7",
            "net18": "22:87:d1:4c:a6:ae",
            "net19": "2a:43:ee:3d:b3:ce",
            "net2": "9a:77:a4:89:c4:2e",
            "net3": "6e:6a:30:df:87:b8",
            "net4": "c6:d3:11:67:de:31",
            "net5": "da:1f:93:2d:ee:20",
            "net6": "7a:7e:5a:ad:b8:9a",
            "net7": "72:20:60:e7:70:88",
            "net8": "fa:3d:14:13:25:a6",
            "net9": "56:58:af:96:b2:63"
        },
        "spine_3_1_9": {
            "net0": "b2:59:b1:b4:42:2d",
            "net1": "8e:44:e8:42:d6:0e",
            "net10": "36:17:b9:d6:5c:59",
            "net11": "e6:ce:f9:35:81:6a",
            "net12": "7a:df:b5:8a:15:58",
            "net13": "ce:22:57:8d:7a:ff",
            "net14": "8a:0c:46:7f:5b:8c",
            "net15": "ae:e7:66:12:8b:19",
            "net16": "0a:06:5b:8c:d7:f8",
            "net17": "52:e8:94:10:11:0e",
            "net18": "82:57:b2:68:55:7c",
            "net19": "36:9a:23:c3:75:a8",
            "net2": "5a:26:c7:1d:b9:5f",
            "net3": "56:09:e7:28:18:05",
            "net4": "aa:f5:27:b7:d9:db",
            "net5": "52:d4:ce:e9:a8:63",
            "net6": "66:af:49:34:3f:ce",
            "net7": "2e:05:7d:fc:51:4a",
            "net8": "06:03:b5:3d:af:ed",
            "net9": "f6:4d:49:d2:1e:1f"
        },
        "spine_4_1_1": {
            "net0": "e6:28:1e:22:c4:92",
            "net1": "aa:84:e6:56:a1:33",
            "net10": "de:f7:a6:26:9a:07",
            "net11": "7e:db:1e:3f:bc:c5",
            "net12": "a2:34:c5:8c:44:d6",
            "net13": "c6:24:30:2e:97:cb",
            "net14": "b2:b8:60:6b:f4:32",
            "net15": "92:14:80:56:45:38",
            "net16": "5a:b9:b1:b5:b4:e2",
            "net17": "f6:96:4c:ae:38:d5",
            "net18": "96:6a:18:09:a9:f4",
            "net19": "3e:27:80:4b:cb:ae",
            "net2": "de:f0:fe:1f:f6:c0",
            "net3": "42:a5:55:9f:66:fd",
            "net4": "66:f6:ae:2e:fe:a5",
            "net5": "5a:f8:7d:63:08:d6",
            "net6": "ca:e8:c1:a4:c5:dc",
            "net7": "4a:30:c8:ba:c6:4d",
            "net8": "e2:f2:93:0a:8a:b0",
            "net9": "96:da:33:b1:e2:83"
        },
        "spine_4_1_10": {
            "net0": "26:29:85:ea:7b:41",
            "net1": "72:64:18:86:d0:c1",
            "net10": "d6:50:3b:46:0a:a4",
            "net11": "3a:5a:39:37:b0:5b",
            "net12": "c2:26:86:68:36:70",
            "net13": "c2:74:e9:e6:12:76",
            "net14": "92:48:15:ab:ff:3e",
            "net15": "f2:03:fc:30:f2:f4",
            "net16": "a6:3c:26:4d:4a:32",
            "net17": "4a:7e:a2:60:39:50",
            "net18": "f6:b9:1d:29:13:18",
            "net19": "ce:3f:db:e3:21:6b",
            "net2": "7a:96:d0:f2:7f:3b",
            "net3": "12:b7:df:0c:9c:3f",
            "net4": "fe:28:b4:5b:d5:1c",
            "net5": "16:7f:e8:9d:be:26",
            "net6": "d6:2a:91:33:f0:42",
            "net7": "12:68:0f:04:d8:b1",
            "net8": "66:d0:2b:88:12:0d",
            "net9": "4a:cb:a0:8e:5d:db"
        },
        "spine_4_1_2": {
            "net0": "5e:7a:96:83:01:22",
            "net1": "2a:f1:b3:91:eb:ec",
            "net10": "8e:d8:11:33:25:43",
            "net11": "aa:0d:59:9c:ae:f1",
            "net12": "be:df:72:7f:18:6c",
            "net13": "8a:c6:5f:76:97:49",
            "net14": "66:05:e5:aa:b3:21",
            "net15": "2a:91:b8:8d:c6:d4",
            "net16": "96:bc:83:32:4e:e3",
            "net17": "ee:17:06:8a:bf:45",
            "net18": "2a:58:be:88:98:02",
            "net19": "6a:a5:11:ba:de:d1",
            "net2": "1e:77:51:d1:8c:0f",
            "net3": "fa:c5:f0:08:23:22",
            "net4": "4e:2c:ab:94:c3:b5",
            "net5": "6e:ea:9f:cb:61:fb",
            "net6": "4a:9c:d5:41:ea:85",
            "net7": "d2:39:74:6f:e3:98",
            "net8": "9e:4b:4a:e5:4a:4f",
            "net9": "de:b6:7b:62:4c:4b"
        },
        "spine_4_1_3": {
            "net0": "4a:fe:e0:12:c7:94",
            "net1": "5e:57:ec:ee:df:8d",
            "net10": "1e:e5:10:48:89:97",
            "net11": "06:ac:34:b7:b0:16",
            "net12": "a6:f8:b1:22:44:85",
            "net13": "96:cb:48:4d:08:d7",
            "net14": "ee:c8:0f:bf:d5:f3",
            "net15": "2a:df:e4:c5:c8:9d",
            "net16": "3a:54:37:20:b1:da",
            "net17": "6e:2c:3f:3c:57:a9",
            "net18": "36:b9:b9:f6:b8:d1",
            "net19": "02:44:4b:cd:58:6c",
            "net2": "e2:c7:70:3d:76:d8",
            "net3": "42:19:cb:31:19:4e",
            "net4": "d2:74:4d:27:33:8c",
            "net5": "72:c3:3a:7a:a4:c6",
            "net6": "86:26:5a:f9:2e:e5",
            "net7": "ae:1d:90:6d:25:80",
            "net8": "52:a7:bb:df:e1:52",
            "net9": "7a:a0:bf:2c:86:2e"
        },
        "spine_4_1_4": {
            "net0": "f2:84:8c:c7:8e:a9",
            "net1": "a6:7d:13:6a:ee:b2",
            "net10": "ae:bf:18:fc:19:61",
            "net11": "2a:b1:7f:6f:9c:78",
            "net12": "5a:fd:cc:90:11:b7",
            "net13": "3a:73:c0:4d:09:59",
            "net14": "86:65:c6:1f:b8:64",
            "net15": "a2:6a:f6:70:08:10",
            "net16": "1a:45:2b:3e:f4:42",
            "net17": "5e:5b:43:16:33:a1",
            "net18": "ba:39:54:4a:4e:4b",
            "net19": "de:3c:6a:73:9d:5f",
            "net2": "f6:44:26:d6:38:e4",
            "net3": "56:b8:dc:f7:02:f2",
            "net4": "ba:7b:e7:b8:08:31",
            "net5": "a6:c3:4e:90:f7:83",
            "net6": "06:98:fb:2f:44:4b",
            "net7": "ca:69:d7:2b:db:e0",
            "net8": "ee:56:01:6b:64:a8",
            "net9": "1a:f2:42:9d:a0:61"
        },
        "spine_4_1_5": {
            "net0": "e2:6e:bd:7a:3d:4f",
            "net1": "8a:88:8f:9f:c5:f1",
            "net10": "22:17:95:4f:73:8a",
            "net11": "b2:11:85:22:19:88",
            "net12": "1e:58:ba:4d:b3:d5",
            "net13": "aa:07:2f:90:58:5c",
            "net14": "52:01:1e:a1:e8:2a",
            "net15": "e6:9c:c4:0c:82:cc",
            "net16": "86:31:fa:0a:d2:83",
            "net17": "3a:62:fc:2b:84:76",
            "net18": "1a:66:aa:78:33:5d",
            "net19": "46:a8:94:1f:b3:7d",
            "net2": "22:97:d8:e5:cd:12",
            "net3": "a6:42:a1:ca:31:e7",
            "net4": "f2:06:19:3f:a3:5f",
            "net5": "8e:46:c1:e1:92:bd",
            "net6": "2a:a5:88:d5:f4:4e",
            "net7": "92:18:21:d3:06:91",
            "net8": "22:31:1f:78:c2:ac",
            "net9": "fe:4d:5f:19:11:91"
        },
        "spine_4_1_6": {
            "net0": "9e:2c:77:6d:7f:6f",
            "net1": "7e:11:c5:08:ed:87",
            "net10": "8a:38:07:b8:70:ee",
            "net11": "76:dc:c4:5d:7d:fd",
            "net12": "76:26:3e:54:51:cd",
            "net13": "2e:48:42:b7:92:83",
            "net14": "1a:1e:c3:0c:a6:be",
            "net15": "1e:22:cc:23:33:2b",
            "net16": "a2:b2:4e:37:da:c9",
            "net17": "3e:99:4c:c0:9e:42",
            "net18": "fa:18:30:28:1e:29",
            "net19": "d6:23:b2:46:c6:06",
            "net2": "6a:93:a5:35:db:49",
            "net3": "4a:77:a3:db:55:db",
            "net4": "fe:0c:41:7f:24:aa",
            "net5": "26:d4:f1:6b:2b:63",
            "net6": "52:18:eb:1d:87:90",
            "net7": "1a:2e:d3:ce:3f:fb",
            "net8": "62:61:e8:7b:0c:aa",
            "net9": "92:1c:ad:5c:b0:fd"
        },
        "spine_4_1_7": {
            "net0": "3a:5f:8c:a6:68:32",
            "net1": "8e:c2:50:d0:1d:3d",
            "net10": "32:70:ee:2c:25:b6",
            "net11": "9e:a9:02:9c:0c:17",
            "net12": "5e:23:a8:ca:f0:d6",
            "net13": "1a:24:67:b4:2e:84",
            "net14": "9e:8b:f0:d1:98:35",
            "net15": "b6:d1:86:46:a6:9c",
            "net16": "5a:bd:75:9c:cc:ef",
            "net17": "ce:a8:64:5e:74:73",
            "net18": "76:33:33:de:31:a5",
            "net19": "7a:61:dd:44:86:b2",
            "net2": "46:11:1b:08:52:9b",
            "net3": "7e:6b:60:a4:f0:c9",
            "net4": "ba:b6:b8:4e:6d:a5",
            "net5": "12:e5:47:44:45:4c",
            "net6": "ea:2e:6d:4b:ef:cd",
            "net7": "26:47:79:06:98:ea",
            "net8": "1e:f8:71:27:ba:6a",
            "net9": "be:52:b0:7b:c0:f1"
        },
        "spine_4_1_8": {
            "net0": "a2:02:ee:33:65:11",
            "net1": "66:87:e1:6c:06:72",
            "net10": "06:00:4e:1a:3f:fc",
            "net11": "12:5c:74:90:90:fa",
            "net12": "5e:43:f1:fd:f3:da",
            "net13": "b6:fb:37:52:d2:75",
            "net14": "66:85:e3:05:45:e5",
            "net15": "72:c1:ac:40:69:47",
            "net16": "16:bb:14:9d:99:5d",
            "net17": "c6:ff:8c:c5:00:20",
            "net18": "22:1b:67:bb:8e:cf",
            "net19": "e6:8e:2c:b8:5d:aa",
            "net2": "26:28:13:aa:2d:5e",
            "net3": "a2:88:26:67:04:5c",
            "net4": "7e:d4:e7:5f:c5:2d",
            "net5": "82:ed:76:7a:de:2e",
            "net6": "ee:c9:31:8d:7d:5f",
            "net7": "e6:98:b1:ba:42:3a",
            "net8": "3a:66:80:44:c0:5d",
            "net9": "ba:5d:b1:d3:23:c0"
        },
        "spine_4_1_9": {
            "net0": "42:28:01:63:f5:06",
            "net1": "ae:db:e5:f1:03:ac",
            "net10": "f2:0c:50:7b:d3:48",
            "net11": "5a:5d:51:26:fb:9c",
            "net12": "82:2f:b4:11:67:9f",
            "net13": "72:17:f9:4f:d2:90",
            "net14": "ee:d2:83:b3:cc:ae",
            "net15": "72:43:dc:8f:ef:ee",
            "net16": "d6:0e:57:b8:eb:5a",
            "net17": "06:7d:58:89:3d:db",
            "net18": "b2:6c:34:b8:0d:72",
            "net19": "2e:89:da:df:1a:93",
            "net2": "5e:40:20:c4:86:ab",
            "net3": "86:0f:7f:fa:d6:ed",
            "net4": "0a:bd:dd:36:c5:67",
            "net5": "8a:c7:ed:93:b6:99",
            "net6": "56:c3:76:ae:04:fa",
            "net7": "9a:34:ee:0d:65:21",
            "net8": "be:9a:27:fd:57:a1",
            "net9": "7a:63:12:77:61:a1"
        },
        "tof_1_2_1": {
            "net0": "1e:05:60:ee:57:45",
            "net1": "96:bd:cd:a7:8e:cb",
            "net10": "4a:a5:33:55:f8:37",
            "net11": "7a:23:d0:b4:22:ae",
            "net12": "6a:9b:67:a8:09:41",
            "net13": "06:76:4e:81:bb:6b",
            "net14": "ca:c2:8f:62:ee:2b",
            "net15": "92:a6:c2:75:67:d7",
            "net16": "d6:73:bb:43:d2:ef",
            "net17": "ca:05:4a:70:2e:d0",
            "net18": "12:ce:85:6d:82:8e",
            "net19": "4a:1e:95:fc:06:c1",
            "net2": "52:a3:86:96:16:48",
            "net3": "b6:64:6e:ef:73:68",
            "net4": "ca:ba:95:24:a5:80",
            "net5": "c2:e2:f0:f2:80:a1",
            "net6": "2a:de:7e:ae:cb:21",
            "net7": "b6:c8:7b:f3:94:99",
            "net8": "2e:2c:9d:64:f1:bb",
            "net9": "16:7a:06:96:fa:6b"
        },
        "tof_1_2_10": {
            "net0": "82:ed:22:e6:63:90",
            "net1": "a2:d9:05:df:32:73",
            "net10": "8a:67:d3:92:7f:94",
            "net11": "4a:25:df:94:41:ed",
            "net12": "d6:80:35:33:3f:8f",
            "net13": "be:f4:cc:e3:99:38",
            "net14": "d6:61:ef:ce:99:7b",
            "net15": "02:2a:67:e0:33:65",
            "net16": "52:c3:54:07:2f:b5",
            "net17": "86:57:03:87:94:da",
            "net18": "4a:fb:1c:0e:f0:7a",
            "net19": "4e:b7:54:e0:e1:1f",
            "net2": "12:08:08:40:5e:6c",
            "net3": "7e:c1:ef:01:62:af",
            "net4": "2e:f3:04:5c:39:91",
            "net5": "56:20:c6:b1:4e:16",
            "net6": "fa:f8:4d:9e:e4:05",
            "net7": "c2:a4:98:90:d6:3c",
            "net8": "ea:68:d3:af:98:9a",
            "net9": "e2:fb:72:8a:8a:d2"
        },
        "tof_1_2_2": {
            "net0": "66:ea:e8:63:8c:a2",
            "net1": "76:0d:12:fc:2d:eb",
            "net10": "e2:d3:bb:f0:15:09",
            "net11": "ee:5b:35:89:49:f5",
            "net12": "de:ff:f2:d5:94:39",
            "net13": "ba:9d:9c:16:92:fa",
            "net14": "b2:98:a5:f1:f9:a0",
            "net15": "b2:20:52:1c:9a:1d",
            "net16": "1a:ce:b5:5e:ae:e5",
            "net17": "a6:3d:a3:90:13:cf",
            "net18": "3a:7d:bf:cb:94:20",
            "net19": "3e:f8:14:8d:15:d6",
            "net2": "ee:ce:d5:9a:9c:8d",
            "net3": "c6:3c:8f:2a:53:6f",
            "net4": "1e:64:54:21:18:42",
            "net5": "8a:24:67:46:89:f7",
            "net6": "e2:cc:eb:cb:db:3f",
            "net7": "8e:a3:51:40:96:8f",
            "net8": "a2:7b:3b:4e:12:3b",
            "net9": "ca:e3:71:12:a8:a5"
        },
        "tof_1_2_3": {
            "net0": "32:6a:80:47:7f:6f",
            "net1": "02:a1:ae:e4:a5:7b",
            "net10": "d6:a6:bc:ee:58:fe",
            "net11": "f6:c9:18:0c:bc:8b",
            "net12": "02:27:b4:de:af:6c",
            "net13": "4a:03:c3:36:9b:d1",
            "net14": "6a:2f:41:6f:e9:d4",
            "net15": "5a:8f:a1:c7:34:b4",
            "net16": "2e:ff:32:2e:45:6a",
            "net17": "4a:24:d8:19:43:ce",
            "net18": "b6:90:63:6e:f1:78",
            "net19": "2a:bb:af:df:2b:a3",
            "net2": "ea:46:39:0d:ee:2e",
            "net3": "5a:fe:89:cf:0e:dc",
            "net4": "26:33:cd:99:f5:87",
            "net5": "56:e3:23:a5:58:4d",
            "net6": "36:c7:bb:21:07:28",
            "net7": "f6:a2:c6:a4:27:3f",
            "net8": "9a:5d:46:d4:d7:48",
            "net9": "02:ce:bf:39:6c:85"
        },
        "tof_1_2_4": {
            "net0": "e6:c9:44:d3:99:6f",
            "net1": "e6:73:be:80:12:94",
            "net10": "82:fa:2c:8c:e2:2b",
            "net11": "ea:d2:c0:23:b4:b0",
            "net12": "82:f5:fa:3f:63:6c",
            "net13": "16:b5:0f:19:67:81",
            "net14": "7e:ba:53:c3:de:dd",
            "net15": "d6:b5:2f:5a:31:09",
            "net16": "be:72:ba:1e:17:29",
            "net17": "be:e2:34:de:d1:ba",
            "net18": "fa:6a:0e:48:7a:28",
            "net19": "2e:dc:ad:3d:ca:57",
            "net2": "1a:9a:fd:8b:c3:fa",
            "net3": "86:1b:f0:1f:8c:6e",
            "net4": "9a:5d:5a:72:35:b4",
            "net5": "76:da:7b:ed:50:3a",
            "net6": "9a:b6:89:8d:3a:88",
            "net7": "b6:ec:1d:78:5f:96",
            "net8": "16:e5:f8:5b:bf:f5",
            "net9": "32:e4:d2:ee:ce:d4"
        },
        "tof_1_2_5": {
            "net0": "3e:4a:90:f0:50:fb",
            "net1": "1a:ab:59:f4:b6:8e",
            "net10": "0e:1c:c1:9b:b4:e6",
            "net11": "62:c5:63:38:a3:d9",
            "net12": "4e:c6:67:62:71:40",
            "net13": "0e:e3:da:a4:03:f6",
            "net14": "ce:96:7c:4a:c5:25",
            "net15": "b2:75:2d:f3:04:ba",
            "net16": "0e:e6:a1:97:9d:ab",
            "net17": "06:da:04:ff:0b:f8",
            "net18": "46:4c:da:4d:8d:e4",
            "net19": "b2:c7:7f:5b:19:8e",
            "net2": "b2:cd:c3:f5:64:a1",
            "net3": "12:0a:64:63:04:09",
            "net4": "b6:3a:33:46:6c:ad",
            "net5": "f2:47:52:b6:70:26",
            "net6": "fa:a7:fe:0c:37:58",
            "net7": "fe:f4:16:d4:92:a2",
            "net8": "ce:e7:e8:ae:eb:b3",
            "net9": "3a:27:8c:fd:f0:e6"
        },
        "tof_1_2_6": {
            "net0": "2a:bc:5c:f5:f8:10",
            "net1": "1e:01:92:4f:a5:70",
            "net10": "ba:2f:6f:89:97:7b",
            "net11": "66:af:74:9c:39:af",
            "net12": "2a:07:e1:fe:df:e3",
            "net13": "46:50:df:35:2d:f6",
            "net14": "62:3d:d8:57:ca:3b",
            "net15": "de:f0:60:31:26:f7",
            "net16": "f6:17:15:82:69:ec",
            "net17": "c2:a0:22:66:62:51",
            "net18": "d2:cc:8d:a0:27:11",
            "net19": "02:1f:27:17:dc:27",
            "net2": "be:da:e5:61:83:26",
            "net3": "b6:f7:8f:c5:9d:7b",
            "net4": "16:3c:bd:89:05:62",
            "net5": "0a:47:f8:97:ac:59",
            "net6": "62:12:1e:3b:82:c0",
            "net7": "72:81:e5:f3:26:28",
            "net8": "ae:62:95:74:bc:90",
            "net9": "a2:6d:39:04:a1:4f"
        },
        "tof_1_2_7": {
            "net0": "62:da:7e:41:60:3a",
            "net1": "5a:63:7f:7a:43:ea",
            "net10": "8a:cc:e4:fe:8e:93",
            "net11": "42:1b:67:05:0c:a7",
            "net12": "76:26:fc:90:60:af",
            "net13": "5a:4a:7e:17:c3:46",
            "net14": "d2:34:73:c1:40:05",
            "net15": "a6:cd:8a:2d:5e:bf",
            "net16": "a6:8a:2d:5d:73:1c",
            "net17": "be:71:85:01:f5:2c",
            "net18": "b2:0b:3e:7d:ef:6f",
            "net19": "6e:38:2c:65:1c:98",
            "net2": "46:c9:b9:f3:1f:e9",
            "net3": "76:63:6f:f7:0b:98",
            "net4": "ba:c1:dc:6c:f1:d4",
            "net5": "2a:1a:29:a8:03:95",
            "net6": "b2:9f:2e:e9:43:60",
            "net7": "26:58:73:13:8c:05",
            "net8": "b2:65:e0:5d:9f:db",
            "net9": "1a:16:38:df:00:71"
        },
        "tof_1_2_8": {
            "net0": "7a:ea:69:33:9f:b1",
            "net1": "4e:1b:2b:9e:41:4b",
            "net10": "4e:4f:65:ea:f7:17",
            "net11": "42:35:93:02:21:ba",
            "net12": "1e:80:05:12:5d:9a",
            "net13": "b6:4a:b1:2b:3e:4f",
            "net14": "ae:18:b8:31:07:63",
            "net15": "8e:67:de:82:a1:67",
            "net16": "3a:27:53:c0:c3:f7",
            "net17": "32:cb:18:84:22:bf",
            "net18": "fe:14:e8:d8:61:ff",
            "net19": "9e:7f:ad:90:3d:b7",
            "net2": "da:f3:50:46:07:d4",
            "net3": "b6:a1:86:1e:95:84",
            "net4": "86:65:55:3b:83:ff",
            "net5": "52:f7:2b:bf:3f:23",
            "net6": "b2:f2:26:78:60:d1",
            "net7": "22:77:f1:de:d6:fd",
            "net8": "7a:5e:5a:64:50:b5",
            "net9": "fe:d1:b5:92:5e:8b"
        },
        "tof_1_2_9": {
            "net0": "e6:ea:02:4a:33:88",
            "net1": "22:75:56:ed:16:73",
            "net10": "e6:ff:bc:af:0a:c8",
            "net11": "52:e7:39:bc:8f:99",
            "net12": "26:07:b4:35:07:91",
            "net13": "62:24:44:9a:d3:17",
            "net14": "ca:bd:36:90:33:3a",
            "net15": "8e:d4:7d:db:e0:4d",
            "net16": "de:8a:b7:f8:e0:0f",
            "net17": "1a:3b:f1:7e:42:7f",
            "net18": "16:40:4e:97:4f:a4",
            "net19": "96:ea:23:4b:dc:40",
            "net2": "3e:51:59:bc:9b:2a",
            "net3": "0a:7b:bf:b7:ad:eb",
            "net4": "c6:90:e9:2f:2a:c1",
            "net5": "7e:ed:3a:4f:ae:e2",
            "net6": "be:63:1e:0c:c3:2d",
            "net7": "56:01:3a:4e:72:6d",
            "net8": "fa:1b:b2:a6:e3:53",
            "net9": "9e:8d:a8:12:f8:06"
        },
        "tof_2_2_1": {
            "net0": "a2:fa:a5:16:a3:cb",
            "net1": "4e:55:f4:7f:17:bd",
            "net10": "2a:8b:73:60:db:3b",
            "net11": "d2:3b:b6:ee:88:bf",
            "net12": "2e:47:14:90:f2:bd",
            "net13": "ae:28:1b:47:11:3b",
            "net14": "56:c9:61:d3:3b:1a",
            "net15": "ce:da:2a:e0:5c:56",
            "net16": "0a:20:58:b4:22:40",
            "net17": "2a:34:fc:33:1c:1c",
            "net18": "c6:b8:2b:2a:fd:63",
            "net19": "12:87:6f:79:f2:eb",
            "net2": "26:d0:a8:e1:78:57",
            "net3": "4a:d5:88:8e:82:39",
            "net4": "66:2e:15:d9:93:83",
            "net5": "fe:dc:15:bb:1b:1b",
            "net6": "5a:5d:bd:3a:11:db",
            "net7": "7e:cf:f8:5f:2c:e2",
            "net8": "22:3b:e4:32:94:98",
            "net9": "16:1e:49:bc:0d:ee"
        },
        "tof_2_2_10": {
            "net0": "b2:a1:f2:52:a1:16",
            "net1": "7a:80:fe:df:90:0d",
            "net10": "22:9a:d1:0e:8f:3d",
            "net11": "3e:0e:30:fb:ac:82",
            "net12": "d6:e9:b0:b8:bb:96",
            "net13": "fe:43:7f:7f:8e:5d",
            "net14": "5e:c3:01:8b:f9:80",
            "net15": "d2:09:38:3d:cb:4e",
            "net16": "b2:2d:9f:05:11:8b",
            "net17": "ce:04:da:b5:20:58",
            "net18": "da:d6:eb:8b:f2:4b",
            "net19": "36:ab:cd:de:a0:57",
            "net2": "8e:0e:09:73:84:4b",
            "net3": "76:b9:d1:06:f5:42",
            "net4": "a6:77:91:49:c1:3e",
            "net5": "fa:79:29:b1:55:e8",
            "net6": "6e:74:c6:55:25:57",
            "net7": "2a:33:40:0d:39:25",
            "net8": "d2:b6:4f:64:6c:9e",
            "net9": "f2:d6:b8:67:ba:02"
        },
        "tof_2_2_2": {
            "net0": "a2:2b:4a:d5:02:3d",
            "net1": "7e:cb:2e:48:d6:24",
            "net10": "92:b9:4b:bd:0f:11",
            "net11": "32:e4:2a:37:93:28",
            "net12": "02:b0:44:e0:54:78",
            "net13": "ca:89:a8:63:15:10",
            "net14": "a6:45:fe:15:f5:a2",
            "net15": "2e:a3:c8:31:a6:26",
            "net16": "8e:66:df:18:b2:4d",
            "net17": "76:04:b9:e4:82:ca",
            "net18": "be:6e:72:5d:91:2b",
            "net19": "ba:f5:4b:9e:86:c4",
            "net2": "fe:38:ed:f4:1a:10",
            "net3": "16:2d:27:db:50:dd",
            "net4": "0e:2f:9c:af:19:c2",
            "net5": "76:48:c8:74:1b:58",
            "net6": "c2:72:36:5f:8e:a6",
            "net7": "26:f1:1f:c2:f4:99",
            "net8": "06:ae:21:e3:b8:ff",
            "net9": "82:8a:9d:88:09:1b"
        },
        "tof_2_2_3": {
            "net0": "26:5d:e0:9f:1e:c9",
            "net1": "5e:d5:45:75:e4:af",
            "net10": "52:01:2b:07:cb:76",
            "net11": "5a:06:c3:21:12:fb",
            "net12": "32:44:50:5b:c0:e6",
            "net13": "2e:e2:d3:e8:2b:c3",
            "net14": "4a:72:5e:83:26:89",
            "net15": "fa:d1:e7:f3:07:54",
            "net16": "de:16:b6:b5:46:9a",
            "net17": "a6:40:f1:f4:4e:c0",
            "net18": "d2:16:b4:87:c1:8b",
            "net19": "56:af:36:68:14:6b",
            "net2": "c6:1f:0c:31:40:d3",
            "net3": "e6:0f:82:6c:fd:1a",
            "net4": "3a:4e:0a:3d:9e:2d",
            "net5": "9e:14:0d:8f:15:f2",
            "net6": "ce:6b:b4:87:92:46",
            "net7": "06:f8:84:da:54:83",
            "net8": "d6:14:65:3c:9b:85",
            "net9": "ba:9d:25:06:27:25"
        },
        "tof_2_2_4": {
            "net0": "46:f8:84:b1:c2:ce",
            "net1": "8e:c4:7c:e0:4a:b9",
            "net10": "1a:f2:b5:f7:e2:60",
            "net11": "8a:87:b2:14:42:62",
            "net12": "46:4e:45:ad:18:88",
            "net13": "9e:88:fb:aa:82:85",
            "net14": "42:64:27:ab:cf:3d",
            "net15": "d6:7c:07:29:79:3b",
            "net16": "76:85:9a:68:34:ea",
            "net17": "62:52:fa:ca:2c:fa",
            "net18": "32:24:fa:47:6c:0c",
            "net19": "36:f4:d9:15:11:5f",
            "net2": "66:af:c5:56:a4:97",
            "net3": "aa:93:8b:87:cc:0c",
            "net4": "4e:1e:1d:3d:80:b8",
            "net5": "c2:b2:28:77:aa:47",
            "net6": "6a:bd:17:a4:18:82",
            "net7": "3a:3c:e1:ba:cd:4e",
            "net8": "5a:b9:36:d4:ff:67",
            "net9": "e2:94:71:94:bb:81"
        },
        "tof_2_2_5": {
            "net0": "ea:77:27:49:71:07",
            "net1": "62:a8:13:a7:30:93",
            "net10": "ea:2e:bc:c5:97:bf",
            "net11": "2e:25:61:55:67:a4",
            "net12": "66:77:98:e8:79:81",
            "net13": "72:27:43:7b:d9:1c",
            "net14": "92:9f:e8:ae:b4:39",
            "net15": "66:49:d6:bf:2e:12",
            "net16": "b6:e5:39:07:00:96",
            "net17": "72:35:c0:69:3b:24",
            "net18": "be:d0:72:3b:82:34",
            "net19": "86:73:71:28:5e:b6",
            "net2": "ae:96:f8:b2:e1:98",
            "net3": "82:77:ac:aa:d6:d7",
            "net4": "b2:53:14:05:3c:96",
            "net5": "be:2f:91:72:4f:b4",
            "net6": "4a:0b:b6:94:aa:77",
            "net7": "ae:b4:10:b6:72:72",
            "net8": "12:19:2d:01:07:95",
            "net9": "9e:d7:24:15:e5:8f"
        },
        "tof_2_2_6": {
            "net0": "a2:92:49:28:a3:c8",
            "net1": "ca:b0:33:f0:d2:03",
            "net10": "82:42:7b:98:e4:5c",
            "net11": "ce:44:e2:d4:0b:f9",
            "net12": "ae:31:16:9e:42:5f",
            "net13": "b2:a9:e6:e9:5e:09",
            "net14": "56:21:0f:4f:7f:bd",
            "net15": "ca:97:c8:c6:1b:d2",
            "net16": "96:d5:59:32:07:cc",
            "net17": "86:f2:72:70:6d:84",
            "net18": "2a:74:ca:ed:d1:90",
            "net19": "02:b0:d0:a6:75:dc",
            "net2": "4a:cc:f8:2b:58:5b",
            "net3": "5a:e0:b3:10:84:cb",
            "net4": "c6:14:7b:42:e2:b8",
            "net5": "b6:2d:43:7f:93:aa",
            "net6": "be:b7:2c:ee:00:69",
            "net7": "3a:0a:70:79:25:aa",
            "net8": "3e:9c:1d:d9:0c:35",
            "net9": "da:88:68:49:bb:21"
        },
        "tof_2_2_7": {
            "net0": "ce:21:4b:9f:3a:2c",
            "net1": "da:ad:4a:0e:4c:69",
            "net10": "7e:c4:d5:76:d0:0d",
            "net11": "f2:a8:c3:68:08:05",
            "net12": "8e:2d:5c:9e:04:da",
            "net13": "4e:96:19:cc:43:98",
            "net14": "c2:89:d5:ce:a5:1d",
            "net15": "f6:90:55:3e:f4:a1",
            "net16": "22:84:57:48:fa:b4",
            "net17": "c2:a5:f7:94:d1:08",
            "net18": "d2:b4:0a:a1:96:24",
            "net19": "1e:35:78:04:55:02",
            "net2": "4a:00:d4:c3:2c:ec",
            "net3": "3a:a9:28:24:d6:83",
            "net4": "1e:6b:99:07:f1:b7",
            "net5": "92:e5:f7:c2:3a:ca",
            "net6": "36:4d:41:c9:60:e4",
            "net7": "6a:f0:93:a8:2e:04",
            "net8": "fe:f3:33:00:39:31",
            "net9": "ca:74:78:50:8d:5e"
        },
        "tof_2_2_8": {
            "net0": "9e:2e:1c:11:32:0e",
            "net1": "4e:78:3d:aa:45:e7",
            "net10": "fa:bd:a7:29:1a:26",
            "net11": "32:a4:94:bb:d8:7e",
            "net12": "ee:81:d8:08:8b:bb",
            "net13": "f6:4b:15:24:42:54",
            "net14": "36:88:d9:3a:b6:b3",
            "net15": "a6:c0:e6:af:e1:36",
            "net16": "e6:4e:9f:2a:ac:66",
            "net17": "a6:be:f0:26:2d:5e",
            "net18": "66:67:0b:ce:7a:64",
            "net19": "ae:57:15:3a:e6:94",
            "net2": "5a:c8:27:20:38:f7",
            "net3": "a2:f2:eb:98:71:b4",
            "net4": "6e:f0:3a:a2:31:65",
            "net5": "52:ab:bb:55:92:46",
            "net6": "fa:fe:f7:6c:ae:73",
            "net7": "a6:e9:96:36:2f:cd",
            "net8": "c2:e0:eb:09:26:4e",
            "net9": "52:46:ce:88:87:78"
        },
        "tof_2_2_9": {
            "net0": "a6:66:35:1c:ef:0e",
            "net1": "32:1e:2e:5d:84:a5",
            "net10": "a6:a5:e7:79:95:83",
            "net11": "8a:a1:13:e7:7e:ab",
            "net12": "a6:c6:2f:9b:01:55",
            "net13": "5e:1a:be:4b:46:8d",
            "net14": "56:7f:31:cc:4a:f4",
            "net15": "4a:c5:3d:4f:49:aa",
            "net16": "92:15:e1:d4:09:c1",
            "net17": "7e:a1:21:74:3c:41",
            "net18": "8a:ff:27:44:fd:ef",
            "net19": "ae:81:ab:6f:61:bd",
            "net2": "4e:aa:bf:57:d0:db",
            "net3": "de:39:12:e9:ae:67",
            "net4": "3a:da:1a:33:56:8f",
            "net5": "16:ca:b9:d7:98:d5",
            "net6": "16:8b:3f:d5:d3:0c",
            "net7": "56:08:06:df:89:c9",
            "net8": "5e:64:61:d6:1b:da",
            "net9": "72:38:21:57:9d:74"
        }
    },
    "failed_machine": "leaf_1_0_1",
    "failure_time": 1616239554.238262
}