{
    "k_leaf": 8,
    "k_top": 8,
    "redundancy_factor": 4,
    "is_k8s": true,
    "machine_mac_addresses": {
        "leaf_1_0_1": {
            "net0": "12:35:c3:fc:9f:9b",
            "net1": "ee:8d:35:4b:96:d2",
            "net2": "2e:bd:c2:51:c0:a8",
            "net3": "96:e5:44:25:74:1c",
            "net4": "62:25:ba:38:b8:cd",
            "net5": "72:21:5b:43:0c:0b",
            "net6": "a2:39:75:9b:5a:18",
            "net7": "e2:62:c4:5e:4d:5c",
            "net8": "06:14:0d:dd:69:d1"
        },
        "leaf_1_0_2": {
            "net0": "0e:3a:c3:c2:3a:e7",
            "net1": "12:06:ec:cf:f4:49",
            "net2": "a2:2e:f0:cf:5e:cb",
            "net3": "32:63:a7:25:c2:a5",
            "net4": "3a:06:d7:64:c4:eb",
            "net5": "7a:93:67:52:72:e9",
            "net6": "be:3f:bb:38:d1:31",
            "net7": "66:01:e6:cd:b3:a5",
            "net8": "72:17:36:b1:f8:7a"
        },
        "leaf_1_0_3": {
            "net0": "6a:84:d1:5b:23:d4",
            "net1": "02:6a:21:2e:a0:65",
            "net2": "42:24:90:61:c6:8e",
            "net3": "62:4e:55:34:98:97",
            "net4": "fa:92:bb:85:80:a0",
            "net5": "16:9d:9b:e7:a9:c6",
            "net6": "d2:68:3f:e5:bb:98",
            "net7": "3a:1a:9b:55:4f:f6",
            "net8": "7e:0d:50:ee:aa:7c"
        },
        "leaf_1_0_4": {
            "net0": "22:dd:43:38:d2:f4",
            "net1": "0a:a5:15:4a:d4:15",
            "net2": "1a:6a:1b:03:3d:bb",
            "net3": "b2:d3:e8:9c:97:28",
            "net4": "c6:44:ee:72:26:3b",
            "net5": "32:c5:56:e2:13:a7",
            "net6": "92:1a:b9:06:8d:2e",
            "net7": "42:4a:3f:d8:37:fd",
            "net8": "6a:05:f9:7f:71:5b"
        },
        "leaf_1_0_5": {
            "net0": "da:0a:e1:f6:d5:e2",
            "net1": "56:ad:75:10:6a:59",
            "net2": "2e:98:cd:06:0f:8f",
            "net3": "16:99:df:b6:09:19",
            "net4": "82:4d:03:95:01:7a",
            "net5": "be:5f:d5:7f:90:f4",
            "net6": "26:34:aa:05:8e:34",
            "net7": "1e:61:31:41:31:75",
            "net8": "a6:3d:d4:99:d1:bf"
        },
        "leaf_1_0_6": {
            "net0": "c2:cc:8b:67:34:42",
            "net1": "92:7c:9a:70:83:40",
            "net2": "aa:f6:55:6b:03:8a",
            "net3": "56:fd:e6:d5:fc:fd",
            "net4": "aa:85:46:09:6f:3c",
            "net5": "c6:5c:63:8b:71:94",
            "net6": "56:cd:3a:7e:12:7a",
            "net7": "66:ad:de:b9:22:bb",
            "net8": "66:b4:02:bd:97:db"
        },
        "leaf_1_0_7": {
            "net0": "52:a3:43:88:7e:08",
            "net1": "0a:af:f1:36:9b:a3",
            "net2": "92:2d:0e:cb:56:10",
            "net3": "4e:5f:ea:fd:6b:be",
            "net4": "06:35:22:29:c2:fa",
            "net5": "2e:2f:b1:54:15:b1",
            "net6": "3a:f7:3c:4f:ef:b6",
            "net7": "0a:5f:80:a8:e2:92",
            "net8": "52:dc:53:cb:65:da"
        },
        "leaf_1_0_8": {
            "net0": "1e:dc:23:42:2f:76",
            "net1": "16:11:7b:c8:bc:5d",
            "net2": "36:79:47:57:48:1b",
            "net3": "9e:91:df:c6:57:f7",
            "net4": "26:15:07:99:29:11",
            "net5": "9a:1e:bf:b8:4a:de",
            "net6": "12:b4:8e:ac:1a:2d",
            "net7": "9a:9c:95:d4:23:e0",
            "net8": "be:f0:10:8b:ca:95"
        },
        "leaf_2_0_1": {
            "net0": "0e:76:48:77:23:a1",
            "net1": "0a:6d:d4:2f:53:78",
            "net2": "ea:71:9c:8d:5b:70",
            "net3": "5a:ea:31:d2:8d:7c",
            "net4": "2e:4d:0a:9d:ce:bc",
            "net5": "56:4a:7e:3e:ae:78",
            "net6": "da:3f:e2:cd:42:f8",
            "net7": "ee:00:5b:fc:2a:f9",
            "net8": "a6:a7:15:99:89:a4"
        },
        "leaf_2_0_2": {
            "net0": "7e:4d:e8:85:53:9a",
            "net1": "e6:3b:2d:e0:6b:02",
            "net2": "c6:c1:32:4d:4c:c1",
            "net3": "0a:16:85:67:f0:50",
            "net4": "e6:85:39:b3:ab:d5",
            "net5": "3e:37:12:09:c2:4e",
            "net6": "aa:69:26:47:b5:4e",
            "net7": "d6:1d:9d:f7:07:d6",
            "net8": "7a:8c:9d:a6:b1:ed"
        },
        "leaf_2_0_3": {
            "net0": "da:5b:8e:5f:e0:89",
            "net1": "b2:97:86:1c:e7:61",
            "net2": "aa:a5:1b:5e:ae:7c",
            "net3": "82:a0:cb:20:76:16",
            "net4": "e6:35:ef:42:0e:17",
            "net5": "5a:29:b8:6d:e2:c8",
            "net6": "96:6b:5f:d8:72:a3",
            "net7": "12:4f:0a:52:13:a5",
            "net8": "c2:fe:1a:17:09:2c"
        },
        "leaf_2_0_4": {
            "net0": "86:20:e0:a4:a1:6c",
            "net1": "26:ea:c1:40:bd:9d",
            "net2": "72:af:81:c4:a6:ee",
            "net3": "a6:d5:14:af:0c:63",
            "net4": "b6:f3:61:a9:9c:98",
            "net5": "de:31:f7:d4:43:8b",
            "net6": "22:95:b8:fd:51:ec",
            "net7": "3e:19:1d:d9:86:b3",
            "net8": "52:d6:38:c8:6a:1c"
        },
        "leaf_2_0_5": {
            "net0": "c2:8f:b0:8a:70:5e",
            "net1": "5e:f5:e3:c1:12:6b",
            "net2": "aa:4e:6d:10:2a:0f",
            "net3": "32:63:02:b7:1e:c6",
            "net4": "fa:ed:9e:92:8d:30",
            "net5": "0e:5d:97:2e:4f:c6",
            "net6": "92:48:24:28:6a:d9",
            "net7": "ba:e9:7a:c5:25:ac",
            "net8": "d2:4e:94:8c:d2:58"
        },
        "leaf_2_0_6": {
            "net0": "ce:c1:1b:a5:f5:ff",
            "net1": "ca:3d:ef:84:a4:4a",
            "net2": "c2:03:92:c6:b7:e5",
            "net3": "7a:cf:f2:a2:b3:15",
            "net4": "92:34:b6:c7:db:41",
            "net5": "86:51:11:ea:ca:ca",
            "net6": "86:9b:91:a9:06:64",
            "net7": "c2:c3:80:78:be:f1",
            "net8": "ce:09:09:33:85:cc"
        },
        "leaf_2_0_7": {
            "net0": "22:2a:6b:8e:a4:63",
            "net1": "96:bb:65:74:d9:b0",
            "net2": "96:13:f8:f3:ad:16",
            "net3": "d6:3b:7a:c8:7a:2b",
            "net4": "ae:ee:2f:48:8c:b6",
            "net5": "aa:ea:ad:8a:9e:7a",
            "net6": "c2:63:4b:f6:28:ec",
            "net7": "7a:cc:5e:80:ed:4d",
            "net8": "b6:27:44:6d:04:c4"
        },
        "leaf_2_0_8": {
            "net0": "c6:aa:6e:67:2b:9a",
            "net1": "3a:df:fd:cd:46:35",
            "net2": "1a:7f:39:9d:56:cc",
            "net3": "9a:d5:65:47:6d:3a",
            "net4": "8e:35:32:db:87:6c",
            "net5": "2a:51:15:62:c5:5f",
            "net6": "c2:aa:26:94:1b:bc",
            "net7": "4a:55:a5:60:de:f8",
            "net8": "e6:83:01:da:17:ba"
        },
        "leaf_3_0_1": {
            "net0": "f6:95:b7:5e:f8:da",
            "net1": "5a:fe:67:64:ff:c9",
            "net2": "52:c3:64:28:64:a6",
            "net3": "76:a6:4b:57:0f:28",
            "net4": "da:7d:4e:28:85:29",
            "net5": "96:82:34:dd:da:41",
            "net6": "96:40:7e:95:59:c8",
            "net7": "32:42:c9:30:73:48",
            "net8": "12:bd:86:0e:56:ab"
        },
        "leaf_3_0_2": {
            "net0": "5a:2a:c1:16:a2:bb",
            "net1": "b2:ee:a4:a2:51:19",
            "net2": "a2:ce:eb:db:de:1e",
            "net3": "8a:9e:ec:67:37:ff",
            "net4": "7e:8c:97:5f:f1:ce",
            "net5": "46:cd:b6:45:49:b7",
            "net6": "0e:0e:fc:45:64:b1",
            "net7": "c6:f6:98:81:28:13",
            "net8": "ba:33:1f:93:3a:b1"
        },
        "leaf_3_0_3": {
            "net0": "ce:fe:17:69:81:45",
            "net1": "86:74:ec:72:ca:9c",
            "net2": "de:ca:0f:7d:cf:8d",
            "net3": "f2:b5:a3:1a:17:08",
            "net4": "ae:81:ad:1e:a8:33",
            "net5": "5e:82:2a:c5:eb:5c",
            "net6": "6e:a5:93:9f:c8:d3",
            "net7": "9e:59:30:66:61:58",
            "net8": "56:10:72:b2:e7:36"
        },
        "leaf_3_0_4": {
            "net0": "ce:03:62:9a:f2:c8",
            "net1": "e6:cc:e4:18:f9:1f",
            "net2": "2e:18:69:2a:e2:e8",
            "net3": "d6:95:fd:0d:d9:5e",
            "net4": "ea:44:35:01:c4:94",
            "net5": "5a:13:f8:de:46:59",
            "net6": "e6:32:13:5c:d1:40",
            "net7": "ae:75:51:35:54:29",
            "net8": "ea:a2:88:f7:37:a0"
        },
        "leaf_3_0_5": {
            "net0": "ee:10:db:8e:c4:f4",
            "net1": "0a:39:26:7f:df:98",
            "net2": "3a:17:a6:75:59:bb",
            "net3": "d2:5a:2e:ca:ad:0b",
            "net4": "6a:b1:f1:30:ef:b6",
            "net5": "7e:73:fe:78:08:42",
            "net6": "b2:31:2c:ae:b9:0b",
            "net7": "fe:f1:4f:f4:ac:d9",
            "net8": "52:ba:1b:50:bd:6d"
        },
        "leaf_3_0_6": {
            "net0": "3a:a3:62:9e:8d:23",
            "net1": "e2:4a:a6:32:a6:b3",
            "net2": "5e:bd:68:e4:f9:06",
            "net3": "a6:9d:5b:b0:2a:01",
            "net4": "d2:dc:65:87:92:92",
            "net5": "f2:64:54:2d:5f:d4",
            "net6": "56:c5:ec:75:db:9c",
            "net7": "d2:e6:8b:20:70:54",
            "net8": "c2:43:f5:5d:7b:b7"
        },
        "leaf_3_0_7": {
            "net0": "2a:3a:9d:4c:e4:46",
            "net1": "02:34:91:a3:44:76",
            "net2": "4e:79:70:99:6c:f9",
            "net3": "c2:22:49:79:23:28",
            "net4": "c2:d6:e7:e9:42:03",
            "net5": "22:a4:7d:1f:50:8b",
            "net6": "f6:9a:d8:84:c5:cc",
            "net7": "56:86:2b:8e:e7:50",
            "net8": "52:68:7e:7f:75:3f"
        },
        "leaf_3_0_8": {
            "net0": "4e:5a:6f:55:dc:d4",
            "net1": "02:01:1b:bd:47:d3",
            "net2": "ea:aa:37:65:64:fa",
            "net3": "8e:44:f9:56:24:bf",
            "net4": "ae:31:7b:55:55:a4",
            "net5": "2a:83:f9:a8:0b:d4",
            "net6": "ca:c2:70:a8:d7:85",
            "net7": "a6:df:d4:57:4a:0b",
            "net8": "7a:5e:39:73:b0:f5"
        },
        "leaf_4_0_1": {
            "net0": "ba:ef:f7:6c:80:dd",
            "net1": "82:bb:a2:3d:e8:39",
            "net2": "a6:3d:e6:72:cf:0a",
            "net3": "52:c5:d7:1a:1f:34",
            "net4": "8e:cc:e7:9b:04:be",
            "net5": "de:32:af:61:a6:d5",
            "net6": "16:73:0d:e8:27:6d",
            "net7": "ce:51:8e:24:b7:a1",
            "net8": "b6:c1:22:28:ff:37"
        },
        "leaf_4_0_2": {
            "net0": "fe:0c:7c:5b:bd:63",
            "net1": "16:c0:f1:57:6c:e4",
            "net2": "b2:c9:5b:bd:1d:5d",
            "net3": "16:4a:d7:bb:e0:21",
            "net4": "aa:aa:5f:49:b3:6d",
            "net5": "f2:ec:b6:b9:ad:a8",
            "net6": "ce:98:37:85:dd:ac",
            "net7": "16:c9:b7:d8:8b:9e",
            "net8": "8e:41:3d:e9:e2:ad"
        },
        "leaf_4_0_3": {
            "net0": "46:d4:c7:df:a2:d9",
            "net1": "de:f6:80:aa:2d:8c",
            "net2": "4e:8d:28:ff:7a:96",
            "net3": "ba:11:ae:67:5c:e2",
            "net4": "16:20:c2:18:29:4e",
            "net5": "32:f5:66:39:45:4c",
            "net6": "2e:93:e5:39:a0:dd",
            "net7": "9e:f1:49:c7:58:5c",
            "net8": "d2:07:b8:64:1e:95"
        },
        "leaf_4_0_4": {
            "net0": "96:50:06:73:78:d6",
            "net1": "ee:b0:1a:8a:48:cf",
            "net2": "32:64:95:61:a0:55",
            "net3": "de:21:f8:9e:ea:24",
            "net4": "d6:06:ec:87:ef:9e",
            "net5": "f2:dc:82:5e:51:c9",
            "net6": "ea:ac:2b:e2:7b:34",
            "net7": "d6:d7:e9:84:99:98",
            "net8": "d6:fa:11:32:df:a8"
        },
        "leaf_4_0_5": {
            "net0": "ee:bf:3b:a0:c3:7c",
            "net1": "02:5d:84:84:71:37",
            "net2": "62:62:7d:cc:30:ff",
            "net3": "8e:ce:97:b4:09:7c",
            "net4": "6e:eb:e8:08:9d:6f",
            "net5": "66:cf:82:c8:a4:99",
            "net6": "ca:80:08:6d:61:a6",
            "net7": "ea:69:cf:25:91:66",
            "net8": "6a:6c:c8:cb:36:a0"
        },
        "leaf_4_0_6": {
            "net0": "be:b5:7b:68:70:93",
            "net1": "26:78:77:50:0e:26",
            "net2": "16:e3:e8:60:a6:8e",
            "net3": "a6:84:a8:77:a8:66",
            "net4": "12:01:e6:20:b9:2e",
            "net5": "66:83:3e:2a:18:cc",
            "net6": "06:03:20:11:b8:cc",
            "net7": "a2:bc:ef:b2:45:ed",
            "net8": "42:b1:c8:f1:a1:39"
        },
        "leaf_4_0_7": {
            "net0": "6e:03:33:20:6e:fd",
            "net1": "76:18:e5:36:a2:b2",
            "net2": "be:a3:f8:89:bd:62",
            "net3": "b2:df:25:f1:82:a9",
            "net4": "ae:cf:5b:55:f9:b7",
            "net5": "de:96:15:d2:e9:11",
            "net6": "ba:94:19:04:f4:97",
            "net7": "ae:93:fb:47:ef:8c",
            "net8": "32:70:9c:5d:a0:a9"
        },
        "leaf_4_0_8": {
            "net0": "3e:96:21:9c:d5:5a",
            "net1": "06:08:1e:a6:8a:c6",
            "net2": "da:ff:f6:07:06:9f",
            "net3": "36:49:12:7e:75:9b",
            "net4": "3a:3c:58:14:90:f7",
            "net5": "5e:67:c2:c4:64:89",
            "net6": "8a:c5:47:08:7c:b0",
            "net7": "ba:c0:5b:48:f4:a5",
            "net8": "f2:88:84:f6:61:0f"
        },
        "spine_1_1_1": {
            "net0": "d2:79:16:b0:b2:30",
            "net1": "1a:c2:72:aa:07:88",
            "net10": "a2:52:7d:07:1c:e5",
            "net11": "ce:8a:da:46:81:24",
            "net12": "a6:ee:8c:b7:24:ba",
            "net13": "0a:69:57:39:11:ff",
            "net14": "b6:92:5a:7c:89:b0",
            "net15": "e2:7c:e9:c8:c5:fa",
            "net2": "76:1e:8c:36:60:d2",
            "net3": "52:94:f4:7e:96:73",
            "net4": "36:20:a4:e6:0e:44",
            "net5": "32:79:6e:5b:5a:9b",
            "net6": "fe:cd:04:a4:bd:81",
            "net7": "f6:93:ca:83:af:f5",
            "net8": "ce:b0:4e:f5:bd:01",
            "net9": "e6:72:33:c0:66:25"
        },
        "spine_1_1_2": {
            "net0": "4e:a0:f0:a0:ce:80",
            "net1": "fe:77:60:04:04:70",
            "net10": "2e:09:7b:75:44:7f",
            "net11": "ba:ae:d5:46:03:c1",
            "net12": "8a:a9:b7:fd:f4:81",
            "net13": "26:23:fd:3e:fa:3a",
            "net14": "92:20:47:b2:80:f3",
            "net15": "8a:fa:ba:7e:0e:81",
            "net2": "82:20:1a:56:c0:50",
            "net3": "3a:8f:a9:76:1e:e8",
            "net4": "62:39:55:c8:e3:2f",
            "net5": "46:a2:3a:3b:c0:7e",
            "net6": "5e:3d:4f:e7:76:8d",
            "net7": "be:3b:78:4e:6e:ab",
            "net8": "1a:a9:68:33:29:17",
            "net9": "6a:9c:5f:6a:56:4d"
        },
        "spine_1_1_3": {
            "net0": "ce:7a:19:b6:9b:28",
            "net1": "5e:20:43:33:b0:ba",
            "net10": "66:31:7a:99:8a:f2",
            "net11": "8a:16:42:fe:ef:4a",
            "net12": "aa:b2:ee:1b:83:43",
            "net13": "fa:4e:44:b4:4d:33",
            "net14": "86:71:df:3c:b4:93",
            "net15": "7a:08:e0:cb:e2:56",
            "net2": "d2:eb:e7:3d:19:91",
            "net3": "ee:71:98:2b:ca:b8",
            "net4": "fe:dc:34:d1:93:f9",
            "net5": "fe:ce:30:15:1a:0d",
            "net6": "6a:96:8e:1f:ab:57",
            "net7": "76:77:df:23:f8:30",
            "net8": "ee:83:43:70:b1:ba",
            "net9": "4a:a6:38:86:2b:2c"
        },
        "spine_1_1_4": {
            "net0": "42:19:b0:b0:a5:96",
            "net1": "e6:bb:8e:fb:47:01",
            "net10": "3e:08:a6:7a:28:a1",
            "net11": "62:7d:d9:09:d9:0c",
            "net12": "1e:f2:4a:2f:79:42",
            "net13": "76:32:ea:2f:5b:3a",
            "net14": "1e:6a:37:c1:ba:42",
            "net15": "ba:fb:f4:53:d3:72",
            "net2": "1a:df:4b:1e:31:55",
            "net3": "a6:c1:04:d9:b3:14",
            "net4": "7e:6e:68:7e:c8:5d",
            "net5": "96:10:eb:7b:65:0a",
            "net6": "1e:4f:40:46:d5:93",
            "net7": "0a:c8:c9:1e:01:17",
            "net8": "ae:07:36:2a:f7:95",
            "net9": "d6:f9:df:61:c9:7c"
        },
        "spine_1_1_5": {
            "net0": "e6:11:22:15:b1:9f",
            "net1": "32:5e:f0:95:9d:c6",
            "net10": "52:38:d2:97:b4:20",
            "net11": "ca:05:27:71:59:a4",
            "net12": "c2:1d:e1:66:c6:73",
            "net13": "d6:b7:ba:f4:07:84",
            "net14": "52:92:ca:38:de:3c",
            "net15": "ca:08:93:23:61:c9",
            "net2": "a6:6b:1c:5e:d1:2a",
            "net3": "b6:bd:65:e2:f1:32",
            "net4": "ae:5a:2d:d0:f2:c6",
            "net5": "6a:2c:09:ec:75:e3",
            "net6": "f2:5a:b8:70:85:46",
            "net7": "5e:e5:17:ec:05:51",
            "net8": "ea:8e:cf:59:8f:bb",
            "net9": "96:68:ef:d5:ea:02"
        },
        "spine_1_1_6": {
            "net0": "de:40:9c:36:e2:e9",
            "net1": "ba:fc:f2:08:88:56",
            "net10": "92:97:f2:e4:16:04",
            "net11": "8e:c1:c2:8b:e2:9e",
            "net12": "72:46:77:d2:90:06",
            "net13": "06:60:38:1e:a3:f3",
            "net14": "0e:49:32:17:c7:ac",
            "net15": "82:49:11:27:bf:5a",
            "net2": "3a:4a:f8:23:a9:0c",
            "net3": "0e:74:6a:5a:5d:1a",
            "net4": "7e:51:89:61:6f:fc",
            "net5": "d2:07:c8:16:5a:56",
            "net6": "ca:07:a5:4d:f1:1b",
            "net7": "fe:cf:74:4e:f8:55",
            "net8": "0a:9f:29:51:f9:06",
            "net9": "2a:5c:d5:8b:54:fb"
        },
        "spine_1_1_7": {
            "net0": "0e:45:79:86:06:e0",
            "net1": "3a:95:8a:27:09:41",
            "net10": "f2:0b:82:ce:0e:f6",
            "net11": "be:14:f5:b4:3c:ed",
            "net12": "ca:29:74:72:83:7a",
            "net13": "1a:61:3e:94:62:34",
            "net14": "32:7a:79:5e:6d:9d",
            "net15": "fa:d2:ed:0a:e4:54",
            "net2": "6a:28:4b:c1:52:4c",
            "net3": "4a:1d:8c:d6:bf:03",
            "net4": "4a:af:ae:b0:87:c9",
            "net5": "da:6e:2b:54:c2:e2",
            "net6": "a2:c9:4e:87:9f:27",
            "net7": "fa:f0:e0:cc:b1:24",
            "net8": "5a:79:f9:4f:e3:c3",
            "net9": "0e:e3:59:de:d2:2d"
        },
        "spine_1_1_8": {
            "net0": "92:5c:22:c1:9b:2e",
            "net1": "02:d3:e1:71:fa:05",
            "net10": "a6:85:95:67:0d:90",
            "net11": "16:8f:c8:90:65:87",
            "net12": "fe:f0:56:94:b5:21",
            "net13": "1e:88:9d:2a:68:fc",
            "net14": "2a:12:19:41:a7:71",
            "net15": "aa:c3:c4:88:51:12",
            "net2": "aa:eb:52:f9:fa:cc",
            "net3": "56:7a:70:8f:5e:29",
            "net4": "4a:db:39:37:31:60",
            "net5": "22:18:f3:9a:8a:44",
            "net6": "1e:10:49:72:c1:0f",
            "net7": "a6:97:60:87:aa:42",
            "net8": "6e:ff:05:59:b3:51",
            "net9": "3e:af:eb:30:d8:30"
        },
        "spine_2_1_1": {
            "net0": "32:01:0e:fa:f2:31",
            "net1": "5e:bc:78:74:8e:a5",
            "net10": "6e:f8:ee:27:b1:c8",
            "net11": "22:a2:8e:e2:79:0f",
            "net12": "e2:fb:94:e3:b9:02",
            "net13": "5a:26:87:ce:b7:f9",
            "net14": "5a:32:31:8f:a4:fc",
            "net15": "36:1a:89:bf:d5:fb",
            "net2": "ba:d3:d1:b1:66:24",
            "net3": "32:e8:36:21:99:95",
            "net4": "fe:73:14:db:8a:82",
            "net5": "f6:90:c3:2b:54:fe",
            "net6": "d6:e3:72:22:e2:b7",
            "net7": "0e:08:74:a5:fe:08",
            "net8": "fa:43:b4:15:0d:14",
            "net9": "12:ab:9f:da:7c:0b"
        },
        "spine_2_1_2": {
            "net0": "ca:e1:f9:73:8f:3c",
            "net1": "76:f4:5e:5d:fa:6e",
            "net10": "3e:8d:51:38:de:ae",
            "net11": "1e:bb:90:2d:59:52",
            "net12": "9e:06:4e:bf:15:f9",
            "net13": "f6:a4:5e:92:65:cf",
            "net14": "12:3b:5e:24:9c:0e",
            "net15": "06:37:62:2b:a1:25",
            "net2": "62:cb:61:a2:2e:7d",
            "net3": "c2:b2:52:b3:7a:05",
            "net4": "fe:f0:24:2a:12:7e",
            "net5": "0e:54:04:d7:a0:d1",
            "net6": "0e:31:2e:56:99:09",
            "net7": "52:9a:c9:c1:d8:d2",
            "net8": "8e:9f:a3:99:4a:dc",
            "net9": "8e:98:2d:9e:40:f1"
        },
        "spine_2_1_3": {
            "net0": "52:dd:c6:8b:1d:4a",
            "net1": "e6:67:4d:6a:dd:cc",
            "net10": "1e:76:6f:e4:4d:6d",
            "net11": "ba:e9:d3:53:5d:73",
            "net12": "9a:d4:9a:26:36:45",
            "net13": "fe:4d:06:0b:0e:3f",
            "net14": "46:ba:25:31:d0:06",
            "net15": "4e:16:58:f8:b1:2b",
            "net2": "9a:78:fd:c7:0a:7f",
            "net3": "0a:06:a0:c1:5e:2f",
            "net4": "e2:73:ed:8a:aa:34",
            "net5": "22:95:8f:5e:50:36",
            "net6": "22:d7:37:52:1f:dd",
            "net7": "da:0b:a2:8e:2b:a1",
            "net8": "a6:2d:d9:7f:15:14",
            "net9": "a2:e9:1b:52:c9:82"
        },
        "spine_2_1_4": {
            "net0": "5a:83:9c:67:08:b6",
            "net1": "b2:6f:9b:6e:88:18",
            "net10": "6a:a9:72:fd:a3:a7",
            "net11": "f2:3f:28:fc:89:51",
            "net12": "4e:7b:1f:9c:c6:49",
            "net13": "a6:19:1b:87:b3:50",
            "net14": "d2:20:a4:83:fe:d8",
            "net15": "8a:09:d7:83:5b:26",
            "net2": "f6:09:1c:f5:26:95",
            "net3": "fe:55:4d:e2:d0:92",
            "net4": "b6:51:49:cc:80:c9",
            "net5": "8a:50:68:2b:22:a8",
            "net6": "9a:1b:eb:1b:02:ba",
            "net7": "c2:ba:1d:f7:12:fe",
            "net8": "72:fe:c3:93:84:5e",
            "net9": "36:23:ed:1d:79:82"
        },
        "spine_2_1_5": {
            "net0": "32:41:ad:90:6e:34",
            "net1": "22:89:ba:5f:67:88",
            "net10": "ea:09:8d:3c:d6:75",
            "net11": "2e:f8:f3:8f:1a:5c",
            "net12": "aa:19:12:a2:a2:23",
            "net13": "5e:31:3f:ca:35:f8",
            "net14": "ca:e6:23:05:8d:1b",
            "net15": "6e:ea:b0:68:d0:c2",
            "net2": "de:ff:d9:78:0d:5c",
            "net3": "ce:4f:34:54:73:44",
            "net4": "be:67:11:4b:bd:3a",
            "net5": "ca:8d:6f:f6:3e:fc",
            "net6": "b6:c6:ef:e4:36:be",
            "net7": "f2:dc:ce:26:b4:50",
            "net8": "66:47:97:61:eb:fa",
            "net9": "d2:a0:27:96:be:f8"
        },
        "spine_2_1_6": {
            "net0": "7e:b9:42:53:75:64",
            "net1": "9e:ed:5c:79:5a:26",
            "net10": "a2:c8:ca:0e:30:c9",
            "net11": "1e:97:90:e7:65:e5",
            "net12": "da:93:2e:6c:ff:1a",
            "net13": "96:f9:f7:c8:4a:ee",
            "net14": "12:ad:e4:80:61:d8",
            "net15": "fe:9d:c9:59:ed:08",
            "net2": "a6:6e:b9:3e:1e:70",
            "net3": "92:4d:61:74:6a:72",
            "net4": "32:46:9d:15:2c:d0",
            "net5": "8e:e5:b1:ed:58:94",
            "net6": "b2:53:ca:10:97:a4",
            "net7": "92:54:ab:b2:f6:f9",
            "net8": "e2:e4:9a:6c:7a:13",
            "net9": "0e:b5:58:d6:df:be"
        },
        "spine_2_1_7": {
            "net0": "aa:c9:e6:f9:92:1b",
            "net1": "be:ea:f4:96:af:c4",
            "net10": "5a:d6:8a:13:f4:48",
            "net11": "be:d2:87:47:c8:74",
            "net12": "ba:1e:be:43:16:53",
            "net13": "6a:19:d9:17:17:e5",
            "net14": "9a:0a:62:e9:83:7b",
            "net15": "0a:bc:90:42:8b:22",
            "net2": "aa:cf:95:00:0e:95",
            "net3": "8a:9d:cf:a3:92:e5",
            "net4": "76:72:c4:fd:a5:cb",
            "net5": "12:d7:b3:48:00:ab",
            "net6": "4a:13:a4:9f:e4:09",
            "net7": "c2:21:b4:88:09:5a",
            "net8": "06:2c:e0:50:0b:5f",
            "net9": "5a:f9:ed:3c:58:d8"
        },
        "spine_2_1_8": {
            "net0": "a6:57:f9:4e:92:c0",
            "net1": "ea:5b:b2:e3:9f:2f",
            "net10": "de:d9:24:43:17:19",
            "net11": "06:78:71:c0:8c:4f",
            "net12": "9e:93:e6:7d:8c:33",
            "net13": "0e:24:07:5d:ef:f9",
            "net14": "a2:6b:61:78:f9:b8",
            "net15": "fe:8a:e3:3b:0a:eb",
            "net2": "0a:96:24:27:ce:0b",
            "net3": "5a:24:50:25:36:ae",
            "net4": "6a:9d:c4:1f:f9:a1",
            "net5": "ee:60:95:0b:e1:e8",
            "net6": "2a:52:e0:84:7c:44",
            "net7": "3a:39:2c:de:d6:aa",
            "net8": "de:79:f0:08:c0:4b",
            "net9": "4e:63:b2:fe:25:14"
        },
        "spine_3_1_1": {
            "net0": "f6:53:d7:c5:83:21",
            "net1": "da:bc:da:7c:f3:50",
            "net10": "6e:1f:5c:60:d8:ef",
            "net11": "c6:dd:39:fc:4d:55",
            "net12": "7a:ce:04:42:c1:2c",
            "net13": "02:d3:9e:df:80:ad",
            "net14": "ea:5e:e6:f3:91:14",
            "net15": "d6:77:63:29:4a:68",
            "net2": "ee:7e:e6:74:1a:9e",
            "net3": "a2:1b:81:c7:1a:8a",
            "net4": "1e:c9:89:bf:b6:1d",
            "net5": "fa:c3:fc:75:19:19",
            "net6": "be:99:6b:51:70:bb",
            "net7": "4a:de:97:ec:3a:ca",
            "net8": "ca:68:ca:00:34:af",
            "net9": "ca:b3:39:94:54:76"
        },
        "spine_3_1_2": {
            "net0": "1e:e4:e8:97:d2:4d",
            "net1": "a2:a9:c7:a7:9b:c8",
            "net10": "fa:06:44:4a:6f:3e",
            "net11": "d2:86:39:6e:52:26",
            "net12": "3a:f3:39:d1:37:92",
            "net13": "ea:fc:40:a4:c9:bc",
            "net14": "fa:34:60:28:82:fc",
            "net15": "7a:b2:b3:92:cd:2b",
            "net2": "56:dd:b7:1d:5c:51",
            "net3": "12:88:7c:57:8e:05",
            "net4": "ba:b2:58:07:73:86",
            "net5": "ea:cd:40:d5:e6:16",
            "net6": "52:05:34:61:6b:44",
            "net7": "6e:cd:af:b9:e9:85",
            "net8": "26:af:5a:9c:4a:56",
            "net9": "16:64:16:69:28:3e"
        },
        "spine_3_1_3": {
            "net0": "da:68:e8:31:ce:88",
            "net1": "7a:ca:ac:0c:e3:a5",
            "net10": "0a:c5:83:8d:eb:04",
            "net11": "da:64:e3:fa:27:d6",
            "net12": "32:fb:9c:b8:4e:71",
            "net13": "52:6d:69:d1:c8:a0",
            "net14": "f2:e6:f9:55:39:93",
            "net15": "36:79:68:3d:6a:9b",
            "net2": "be:54:32:14:7e:a2",
            "net3": "0e:44:92:9e:df:bc",
            "net4": "ba:5a:52:f0:93:d4",
            "net5": "16:e1:8f:7b:1d:c1",
            "net6": "1a:73:5d:21:d5:63",
            "net7": "96:7f:e6:d7:d8:59",
            "net8": "9e:5a:20:ce:21:e8",
            "net9": "be:b2:8f:16:ed:69"
        },
        "spine_3_1_4": {
            "net0": "4a:46:b5:8a:57:d1",
            "net1": "0e:e8:cc:b3:75:93",
            "net10": "76:c7:6c:8e:ee:8e",
            "net11": "b6:36:4e:6f:f0:85",
            "net12": "ea:50:91:f1:de:f4",
            "net13": "ce:91:c5:9e:c3:62",
            "net14": "9e:7b:a8:df:c2:bd",
            "net15": "06:a5:6c:ca:2f:67",
            "net2": "f2:b1:da:b3:13:25",
            "net3": "02:07:34:45:1e:b5",
            "net4": "ea:34:e5:e6:ec:80",
            "net5": "c2:71:3b:5e:6f:cc",
            "net6": "b2:c5:b8:f9:cd:f8",
            "net7": "7a:a9:fe:6d:ab:ae",
            "net8": "72:56:80:f5:b3:1a",
            "net9": "be:00:d8:4b:ce:f2"
        },
        "spine_3_1_5": {
            "net0": "ae:43:7c:f9:63:15",
            "net1": "12:c9:37:ab:c7:fb",
            "net10": "d6:89:11:03:41:70",
            "net11": "8e:26:67:a6:35:20",
            "net12": "f6:89:df:00:6f:5c",
            "net13": "86:64:c8:52:bc:4f",
            "net14": "6a:53:3d:ff:dc:ef",
            "net15": "3a:85:31:cd:b4:37",
            "net2": "5e:87:8d:28:ea:56",
            "net3": "9a:03:da:2d:11:1f",
            "net4": "72:c4:41:7e:cb:7a",
            "net5": "a6:6c:ca:bd:2d:74",
            "net6": "c6:cb:7e:fb:34:a8",
            "net7": "02:aa:38:cd:86:d4",
            "net8": "6a:c8:99:fb:94:45",
            "net9": "f2:f2:d2:4e:66:01"
        },
        "spine_3_1_6": {
            "net0": "2e:1f:7d:a1:64:b0",
            "net1": "5a:b2:df:a0:b5:f0",
            "net10": "ca:cc:1e:80:fe:48",
            "net11": "9a:11:b9:8e:87:69",
            "net12": "f2:6d:78:9b:e2:65",
            "net13": "fe:68:08:5b:6a:f4",
            "net14": "4a:fe:c7:f1:fa:b5",
            "net15": "02:e4:63:50:ec:44",
            "net2": "1e:b3:63:59:2b:11",
            "net3": "4a:b5:58:f7:b9:d8",
            "net4": "42:05:33:c9:56:95",
            "net5": "26:fc:f8:87:ff:91",
            "net6": "ee:bb:b8:68:56:b4",
            "net7": "4a:a1:70:d7:0e:20",
            "net8": "96:50:7f:2d:ef:2e",
            "net9": "2e:5b:00:c7:b7:37"
        },
        "spine_3_1_7": {
            "net0": "f2:d5:c3:65:79:34",
            "net1": "9e:a7:f7:58:7f:95",
            "net10": "82:40:d8:17:a3:23",
            "net11": "fe:19:be:5a:38:da",
            "net12": "c6:be:d2:be:e3:34",
            "net13": "ae:60:a3:fc:31:68",
            "net14": "3e:b9:29:33:29:d5",
            "net15": "52:be:5e:4c:6d:59",
            "net2": "da:3e:08:c3:49:b1",
            "net3": "a2:b0:10:63:ab:c1",
            "net4": "fe:bb:db:61:b9:4b",
            "net5": "2a:63:01:7a:ae:f2",
            "net6": "0e:d6:af:a8:e9:7d",
            "net7": "22:a1:98:83:4a:e4",
            "net8": "92:91:1e:89:d8:15",
            "net9": "ee:dc:ec:6d:e7:c0"
        },
        "spine_3_1_8": {
            "net0": "c6:7a:eb:17:01:ff",
            "net1": "7a:e4:a2:c8:2d:26",
            "net10": "6a:4a:84:c6:1e:bc",
            "net11": "da:f5:cb:8f:4a:a1",
            "net12": "be:ac:5d:da:fd:d1",
            "net13": "8e:41:d5:7b:ec:f5",
            "net14": "66:82:fb:79:d5:2b",
            "net15": "d2:ef:bb:8d:5c:e1",
            "net2": "32:9e:97:74:25:c3",
            "net3": "62:d1:5a:84:6e:01",
            "net4": "ce:47:ec:5a:e8:ae",
            "net5": "ba:2d:b3:ad:35:bb",
            "net6": "3e:1b:5f:88:68:8a",
            "net7": "2a:70:e9:78:cc:6a",
            "net8": "42:8b:ce:91:e7:76",
            "net9": "c2:e9:d1:3c:6e:2c"
        },
        "spine_4_1_1": {
            "net0": "7a:03:ac:c3:cc:1b",
            "net1": "6e:cc:42:28:61:4e",
            "net10": "d2:21:c7:32:ce:ec",
            "net11": "fe:37:5a:30:36:ec",
            "net12": "52:8a:be:9d:1e:42",
            "net13": "42:69:50:90:00:e3",
            "net14": "42:2d:d2:5f:f9:86",
            "net15": "8a:51:3f:3d:8e:4b",
            "net2": "66:df:a9:d3:9b:e3",
            "net3": "52:a5:7f:c9:cc:09",
            "net4": "ea:7f:f5:8c:38:2c",
            "net5": "36:00:51:af:5a:48",
            "net6": "a6:ca:36:f4:7b:95",
            "net7": "1a:49:3e:fa:f2:29",
            "net8": "ce:c7:7d:9f:5a:ea",
            "net9": "6a:47:81:d2:e2:7d"
        },
        "spine_4_1_2": {
            "net0": "ee:f5:1a:27:63:91",
            "net1": "4a:8f:92:b2:4d:85",
            "net10": "de:23:86:73:58:0b",
            "net11": "ea:c9:0a:45:26:86",
            "net12": "ea:76:c3:3b:aa:d1",
            "net13": "4a:6f:0f:d6:c5:b0",
            "net14": "e6:42:89:8c:09:4a",
            "net15": "c2:71:cc:84:3a:d1",
            "net2": "4e:2f:f2:b6:7a:50",
            "net3": "5e:9a:58:ec:38:ff",
            "net4": "42:77:c8:f6:31:08",
            "net5": "fa:7f:95:e1:c5:7c",
            "net6": "26:97:2a:1c:db:5f",
            "net7": "32:bf:07:39:8a:a6",
            "net8": "ce:4b:b7:e8:b3:e7",
            "net9": "56:8a:e2:5c:82:d9"
        },
        "spine_4_1_3": {
            "net0": "46:72:77:6e:c7:7d",
            "net1": "22:4a:b5:45:a5:78",
            "net10": "96:33:27:ba:f3:77",
            "net11": "56:68:29:62:89:09",
            "net12": "0e:82:44:c9:7a:77",
            "net13": "f2:f3:81:36:00:8d",
            "net14": "c6:77:a2:1a:99:6b",
            "net15": "26:71:ec:2f:11:96",
            "net2": "1e:77:b1:ca:48:af",
            "net3": "be:f9:f8:3f:34:d2",
            "net4": "ae:b6:49:7f:10:3a",
            "net5": "12:04:53:dd:39:32",
            "net6": "62:d4:a6:95:9b:b6",
            "net7": "fa:ad:24:1d:53:f9",
            "net8": "2a:21:4a:e4:09:ce",
            "net9": "f2:5a:e4:f5:63:7e"
        },
        "spine_4_1_4": {
            "net0": "7e:a1:5b:0f:8d:59",
            "net1": "a6:23:d5:db:62:9f",
            "net10": "62:a6:a7:4b:3c:f8",
            "net11": "02:15:46:87:f3:6f",
            "net12": "8e:be:1f:cf:63:1f",
            "net13": "66:d5:9f:ed:f1:5b",
            "net14": "b2:30:0d:8e:71:88",
            "net15": "36:f2:88:36:4a:40",
            "net2": "66:8b:f1:44:5e:64",
            "net3": "c2:cb:95:fe:79:7d",
            "net4": "0a:d3:05:44:21:21",
            "net5": "b6:40:6c:21:8a:dd",
            "net6": "8a:7b:20:47:4b:f6",
            "net7": "6a:86:4a:b0:64:fc",
            "net8": "56:61:fe:6d:ad:5b",
            "net9": "06:1a:2c:aa:c7:54"
        },
        "spine_4_1_5": {
            "net0": "12:03:69:4e:f1:36",
            "net1": "f2:2b:89:fc:38:3e",
            "net10": "42:a6:46:84:37:a8",
            "net11": "ce:be:6d:16:97:82",
            "net12": "26:79:41:5c:7f:44",
            "net13": "1a:c7:2e:f7:db:46",
            "net14": "ae:d2:f3:0f:84:3d",
            "net15": "62:fb:d8:e7:4b:f5",
            "net2": "82:a1:ca:93:33:c4",
            "net3": "7e:bf:db:6a:4b:10",
            "net4": "6e:ba:1f:82:ef:f1",
            "net5": "2a:8b:e5:13:0a:7d",
            "net6": "e6:5d:5f:54:57:84",
            "net7": "96:90:17:1e:e4:98",
            "net8": "ba:21:70:af:49:3f",
            "net9": "fa:52:a7:4d:c2:7b"
        },
        "spine_4_1_6": {
            "net0": "82:54:89:8f:63:ea",
            "net1": "3e:5d:0e:2e:20:af",
            "net10": "aa:0f:7a:b2:57:bf",
            "net11": "fa:01:58:ff:62:c6",
            "net12": "5e:d2:ba:e8:01:ce",
            "net13": "b6:8f:6f:d3:c4:07",
            "net14": "f6:04:fe:2c:43:2a",
            "net15": "56:9c:11:0d:33:1b",
            "net2": "e6:b5:97:dd:ab:b1",
            "net3": "5a:3a:79:05:04:58",
            "net4": "92:7c:ba:be:ed:9d",
            "net5": "62:cb:fd:5f:c3:36",
            "net6": "3e:1c:b9:5c:79:fb",
            "net7": "96:df:9a:3f:25:e2",
            "net8": "86:4d:6e:cf:05:7b",
            "net9": "aa:2e:9d:fd:0c:51"
        },
        "spine_4_1_7": {
            "net0": "4a:25:a7:60:8e:2d",
            "net1": "ca:3b:9b:45:4f:82",
            "net10": "9e:46:6b:d3:95:ee",
            "net11": "de:28:5c:9c:49:50",
            "net12": "0e:f2:d6:88:58:58",
            "net13": "de:0f:64:1c:43:f8",
            "net14": "1e:7a:36:7b:54:b8",
            "net15": "ce:2b:07:3d:72:61",
            "net2": "12:92:39:a5:c3:3e",
            "net3": "1e:77:4e:bd:cf:71",
            "net4": "6e:8b:8d:93:b6:ac",
            "net5": "3e:64:3e:8f:38:30",
            "net6": "92:e3:be:c9:dc:2a",
            "net7": "26:90:ca:3e:9c:ef",
            "net8": "3a:0c:86:e4:9c:da",
            "net9": "d2:e6:1f:c0:65:c7"
        },
        "spine_4_1_8": {
            "net0": "62:6c:ae:9f:0a:3d",
            "net1": "fa:e7:1d:27:28:84",
            "net10": "f2:cf:fd:83:b0:17",
            "net11": "d6:a6:b7:4e:31:31",
            "net12": "d2:f6:34:42:f5:6b",
            "net13": "82:51:47:f7:6e:48",
            "net14": "82:32:ea:1b:80:2f",
            "net15": "fe:74:7e:89:78:e3",
            "net2": "fa:b6:28:92:29:69",
            "net3": "6e:31:bd:58:36:45",
            "net4": "aa:ed:a1:08:4f:61",
            "net5": "12:dd:7a:fc:16:31",
            "net6": "2e:e4:40:e2:69:f5",
            "net7": "d6:e2:d2:3d:b5:a1",
            "net8": "c6:35:24:ec:64:fb",
            "net9": "ae:2c:94:30:9a:e6"
        },
        "tof_1_2_1": {
            "net0": "52:7b:99:96:d0:65",
            "net1": "3e:47:f8:d7:ed:8d",
            "net10": "66:64:17:cf:b9:17",
            "net11": "ae:4d:fa:51:4b:a7",
            "net12": "d2:f0:a0:a2:f2:ad",
            "net13": "ba:84:97:e6:b9:95",
            "net14": "46:ab:71:c7:4d:61",
            "net15": "fe:ca:5d:15:66:82",
            "net2": "22:10:88:a3:85:56",
            "net3": "ba:78:b3:dc:4b:be",
            "net4": "82:58:0b:19:57:1a",
            "net5": "f2:dd:25:8e:0b:00",
            "net6": "22:cf:ba:c1:0c:d3",
            "net7": "e6:d3:0b:69:6b:4c",
            "net8": "02:c1:cd:ca:bb:6e",
            "net9": "96:28:38:b8:8a:66"
        },
        "tof_1_2_2": {
            "net0": "1a:b5:13:a3:d7:cb",
            "net1": "5a:7e:8d:b0:d1:19",
            "net10": "62:3e:89:50:22:b9",
            "net11": "f2:8d:8a:fe:fc:a9",
            "net12": "5a:9b:73:d9:25:ae",
            "net13": "d6:9b:b1:50:78:3e",
            "net14": "0e:85:12:c9:70:13",
            "net15": "32:0f:36:b6:38:61",
            "net2": "c2:56:be:44:c6:1d",
            "net3": "9e:bc:10:0a:ea:03",
            "net4": "e2:06:7b:86:49:11",
            "net5": "e2:97:ac:b6:b6:f9",
            "net6": "2e:04:a0:44:66:5b",
            "net7": "9a:f4:bc:50:99:aa",
            "net8": "32:27:3c:ec:7f:a4",
            "net9": "16:47:82:a8:8b:7a"
        },
        "tof_1_2_3": {
            "net0": "46:c0:c7:3c:17:25",
            "net1": "62:7b:40:a7:d3:18",
            "net10": "8e:ab:da:3f:d7:a4",
            "net11": "46:d6:12:6e:99:8a",
            "net12": "da:95:eb:60:76:b8",
            "net13": "0a:f6:75:47:05:fa",
            "net14": "12:06:f2:ab:92:c7",
            "net15": "42:4c:7b:a7:41:3c",
            "net2": "72:d9:63:81:c8:73",
            "net3": "72:4d:4f:e1:ee:94",
            "net4": "52:4c:0e:e5:d8:dd",
            "net5": "fe:93:81:e8:98:ec",
            "net6": "aa:89:c3:3e:f9:d7",
            "net7": "0a:bb:f8:1c:c7:74",
            "net8": "ba:9a:e6:8d:0d:3b",
            "net9": "82:41:14:3e:6c:96"
        },
        "tof_1_2_4": {
            "net0": "aa:35:e8:47:b9:70",
            "net1": "76:48:31:b7:3b:af",
            "net10": "96:56:69:32:06:ce",
            "net11": "fe:ee:d2:53:98:20",
            "net12": "ce:ce:77:b9:09:4d",
            "net13": "fa:5b:ef:fa:c1:1e",
            "net14": "16:ed:ed:eb:b0:3f",
            "net15": "52:c5:28:fa:ae:69",
            "net2": "ca:75:0f:87:6a:ac",
            "net3": "0e:6b:59:01:bb:13",
            "net4": "e2:51:da:9c:b8:0c",
            "net5": "0a:e6:25:25:84:79",
            "net6": "1e:2f:23:cf:d5:27",
            "net7": "0e:0e:b5:db:43:ad",
            "net8": "62:39:cd:be:6c:b7",
            "net9": "f6:69:1b:9b:60:91"
        },
        "tof_1_2_5": {
            "net0": "56:05:40:3e:ad:5f",
            "net1": "86:fa:c7:99:94:2b",
            "net10": "ce:ab:46:b5:03:b4",
            "net11": "56:51:af:c4:90:85",
            "net12": "d2:05:e6:73:ce:b3",
            "net13": "7e:46:b9:cd:e8:8f",
            "net14": "ea:83:42:f9:69:ee",
            "net15": "12:0e:6e:98:28:eb",
            "net2": "42:93:81:58:e2:ec",
            "net3": "ba:43:98:50:e1:2e",
            "net4": "ce:fb:96:ed:03:69",
            "net5": "8e:6d:51:fe:50:bd",
            "net6": "7a:59:91:b8:2e:b3",
            "net7": "86:6a:1b:fd:61:a7",
            "net8": "a2:bd:66:17:f6:14",
            "net9": "42:96:f7:35:0e:00"
        },
        "tof_1_2_6": {
            "net0": "c6:80:fb:13:fe:6e",
            "net1": "a2:f0:56:1c:40:6a",
            "net10": "5a:ea:e5:26:ea:a3",
            "net11": "82:fc:49:aa:0e:da",
            "net12": "9e:6d:c8:6a:66:22",
            "net13": "fa:ae:24:14:96:4f",
            "net14": "16:e1:07:a4:36:8b",
            "net15": "ae:4a:a4:f9:39:89",
            "net2": "da:9f:ab:88:2e:ca",
            "net3": "e6:9b:90:0d:85:91",
            "net4": "a2:98:66:fb:00:3f",
            "net5": "12:78:3d:36:77:74",
            "net6": "f2:eb:7a:42:66:97",
            "net7": "02:e6:05:34:e3:4a",
            "net8": "4e:a2:fb:d7:00:1b",
            "net9": "e6:9f:17:53:e7:4e"
        },
        "tof_1_2_7": {
            "net0": "5e:18:1f:33:36:1a",
            "net1": "66:06:bd:95:0c:10",
            "net10": "b6:54:07:7f:65:f8",
            "net11": "c2:96:d4:1e:5a:40",
            "net12": "3a:94:ed:ca:50:08",
            "net13": "2e:62:dd:ea:31:f6",
            "net14": "16:6d:5d:59:2d:a0",
            "net15": "12:f0:b9:08:80:e4",
            "net2": "a6:71:1f:8b:cb:8f",
            "net3": "b2:dc:03:53:31:89",
            "net4": "b2:0a:36:81:f6:b4",
            "net5": "ca:04:c7:e2:da:1d",
            "net6": "76:55:67:10:c4:2c",
            "net7": "fa:e0:ba:44:b1:e9",
            "net8": "7e:7c:40:47:b2:46",
            "net9": "ce:76:c6:03:bf:9b"
        },
        "tof_1_2_8": {
            "net0": "92:44:78:c3:8f:12",
            "net1": "c6:7c:e4:60:ef:a2",
            "net10": "d6:5c:02:39:5e:89",
            "net11": "2a:5f:d4:83:03:8e",
            "net12": "4a:67:6a:4e:c0:99",
            "net13": "46:2e:bb:1e:76:82",
            "net14": "6a:f8:8d:ed:71:1a",
            "net15": "6a:6d:d0:63:85:66",
            "net2": "8e:1a:8e:c6:42:e9",
            "net3": "b2:bb:23:3d:85:50",
            "net4": "c6:dc:ad:bc:58:03",
            "net5": "f2:5c:b6:bb:11:12",
            "net6": "0a:a4:53:15:e1:a6",
            "net7": "ce:ce:01:2e:bc:9f",
            "net8": "02:a0:e7:78:b2:86",
            "net9": "26:3a:df:a3:de:40"
        },
        "tof_2_2_1": {
            "net0": "72:0f:f5:85:5b:4b",
            "net1": "1e:a8:89:34:79:8d",
            "net10": "a6:fc:3d:19:5a:af",
            "net11": "ea:0d:a6:42:70:78",
            "net12": "66:38:af:2e:1a:8c",
            "net13": "a2:af:5b:17:84:dd",
            "net14": "6e:68:1e:27:be:60",
            "net15": "ea:d5:9e:34:94:94",
            "net2": "fe:f4:c4:12:b1:7d",
            "net3": "8e:9a:1d:49:aa:0d",
            "net4": "f6:35:90:97:78:99",
            "net5": "5e:44:2f:05:fb:90",
            "net6": "5e:6d:d5:6c:de:18",
            "net7": "d2:59:99:2c:48:35",
            "net8": "0e:56:43:01:64:53",
            "net9": "26:23:10:30:02:cf"
        },
        "tof_2_2_2": {
            "net0": "1e:16:33:46:26:b4",
            "net1": "8e:3f:0e:a9:6e:55",
            "net10": "b6:72:9c:ff:a4:7a",
            "net11": "ca:f7:bc:97:88:e1",
            "net12": "06:ed:d4:ac:82:b4",
            "net13": "62:ad:24:9b:1a:8b",
            "net14": "7e:37:1a:b4:25:b4",
            "net15": "1e:39:24:15:18:34",
            "net2": "7a:68:b3:38:42:6c",
            "net3": "9a:b1:7a:98:bc:a0",
            "net4": "da:39:96:79:cc:ca",
            "net5": "36:95:39:92:3b:8c",
            "net6": "da:18:18:51:a4:95",
            "net7": "b6:a8:40:82:78:8b",
            "net8": "9e:21:08:61:52:02",
            "net9": "02:01:6d:5a:71:48"
        },
        "tof_2_2_3": {
            "net0": "72:f8:10:58:03:d1",
            "net1": "c2:04:02:f0:2b:6f",
            "net10": "7a:2a:7e:03:cb:50",
            "net11": "1a:f6:f4:7a:04:eb",
            "net12": "86:3d:09:f2:7e:98",
            "net13": "ce:fb:0a:d1:0a:8f",
            "net14": "ae:ce:2d:9e:3d:82",
            "net15": "26:d0:f4:58:44:8b",
            "net2": "ce:2f:5a:bd:2b:1e",
            "net3": "3a:94:28:03:0c:6b",
            "net4": "ea:dd:b2:a8:3c:d4",
            "net5": "36:99:f7:7d:f0:71",
            "net6": "02:c1:14:66:db:91",
            "net7": "8e:0a:d7:f1:2a:db",
            "net8": "ae:78:7d:6d:44:1d",
            "net9": "62:88:f5:74:4a:95"
        },
        "tof_2_2_4": {
            "net0": "36:99:8e:e2:7d:03",
            "net1": "42:46:bb:1d:b8:8c",
            "net10": "ee:7d:bd:f8:0f:ca",
            "net11": "02:de:7f:aa:73:4b",
            "net12": "f2:80:5b:58:67:0c",
            "net13": "4a:2d:d0:0f:2e:10",
            "net14": "e2:1b:8e:e7:b2:d7",
            "net15": "4e:c2:fb:c6:f7:ff",
            "net2": "a6:f9:49:ca:15:85",
            "net3": "2e:31:ac:ac:2c:c2",
            "net4": "76:c6:66:c1:9d:a8",
            "net5": "62:14:cb:8d:89:0c",
            "net6": "0e:9e:3e:ab:c7:3c",
            "net7": "72:64:37:59:c2:4e",
            "net8": "be:a2:fd:00:77:bd",
            "net9": "c6:5b:83:b8:c6:58"
        },
        "tof_2_2_5": {
            "net0": "f2:75:74:cf:2b:36",
            "net1": "4e:d7:88:ba:1a:3b",
            "net10": "56:a6:68:07:e9:a4",
            "net11": "22:f4:7a:77:40:64",
            "net12": "be:a2:b9:35:0b:1f",
            "net13": "3a:9b:8a:ab:85:bb",
            "net14": "be:ad:dd:6a:d7:30",
            "net15": "36:60:1f:0c:d9:96",
            "net2": "d6:92:6f:a0:87:28",
            "net3": "f6:c5:91:07:63:a5",
            "net4": "9a:20:b8:27:9f:08",
            "net5": "ca:d6:c6:a1:47:3c",
            "net6": "8a:23:c2:46:06:6a",
            "net7": "2e:c1:69:37:ce:ef",
            "net8": "0e:53:e6:c3:64:bc",
            "net9": "7e:72:31:2d:92:16"
        },
        "tof_2_2_6": {
            "net0": "0a:e1:ef:a1:11:eb",
            "net1": "b2:60:ab:7b:ce:0c",
            "net10": "fa:80:b3:ac:f1:ce",
            "net11": "72:6e:31:5e:32:de",
            "net12": "6e:1e:44:7b:9a:3d",
            "net13": "96:ad:0c:f3:a4:30",
            "net14": "de:d1:22:e3:45:06",
            "net15": "f6:4d:ae:ea:c1:21",
            "net2": "66:f5:43:1d:4b:fa",
            "net3": "56:ca:4c:0c:07:25",
            "net4": "fa:d5:8b:4b:8e:c3",
            "net5": "4e:fb:97:3b:11:9a",
            "net6": "1e:28:d2:bf:06:aa",
            "net7": "3a:9d:b4:c1:66:ef",
            "net8": "ea:da:a9:2a:40:67",
            "net9": "72:10:da:00:75:78"
        },
        "tof_2_2_7": {
            "net0": "5e:5e:cd:95:0e:39",
            "net1": "ee:6a:10:86:78:0e",
            "net10": "56:28:26:51:00:77",
            "net11": "d2:f0:7b:b5:eb:ac",
            "net12": "d2:3a:45:97:90:8b",
            "net13": "6a:fc:e5:ad:b2:a3",
            "net14": "fa:12:60:2c:28:16",
            "net15": "72:06:73:48:fc:e3",
            "net2": "1e:79:f8:b5:cc:98",
            "net3": "86:85:73:06:71:6e",
            "net4": "ce:81:37:b4:f8:51",
            "net5": "e2:d2:56:ff:dc:fb",
            "net6": "4e:04:d6:dc:64:b7",
            "net7": "86:35:48:34:86:e4",
            "net8": "fa:d4:a6:4d:08:99",
            "net9": "c6:f3:a5:4e:23:d4"
        },
        "tof_2_2_8": {
            "net0": "32:52:10:72:de:fe",
            "net1": "ca:91:74:3b:72:2d",
            "net10": "fa:08:c5:67:26:98",
            "net11": "da:d9:fa:24:f4:ac",
            "net12": "62:04:4e:ba:5c:f7",
            "net13": "4a:39:26:49:20:44",
            "net14": "ce:25:3c:1d:37:5e",
            "net15": "26:89:f1:e4:b1:44",
            "net2": "5e:b7:5a:3f:c3:36",
            "net3": "e2:c9:cc:b4:da:c0",
            "net4": "6e:6a:7a:11:a3:03",
            "net5": "8a:1c:b2:4e:79:be",
            "net6": "ae:9c:0f:35:e4:8a",
            "net7": "8a:25:09:da:d1:e8",
            "net8": "5a:64:a4:f9:ff:0d",
            "net9": "6a:5c:4d:86:32:22"
        }
    },
    "failed_machine": "leaf_1_0_1",
    "failure_time": {
        "leaf_1_0_1": 1621873418.2448983,
        "leaf_1_0_2": 1621873418.2637823,
        "leaf_1_0_3": 1621873418.2790477,
        "leaf_1_0_4": 1621873418.2926064,
        "leaf_1_0_5": 1621873418.3038435,
        "leaf_1_0_6": 1621873418.2461464,
        "leaf_1_0_7": 1621873418.2630606,
        "leaf_1_0_8": 1621873418.2766814,
        "leaf_2_0_1": 1621873418.2893589,
        "leaf_2_0_2": 1621873418.3046722,
        "leaf_2_0_3": 1621873418.245551,
        "leaf_2_0_4": 1621873418.2589355,
        "leaf_2_0_5": 1621873418.27277,
        "leaf_2_0_6": 1621873418.2829304,
        "leaf_2_0_7": 1621873418.2995386,
        "leaf_2_0_8": 1621873418.2495103,
        "leaf_3_0_1": 1621873418.2637548,
        "leaf_3_0_2": 1621873418.276519,
        "leaf_3_0_3": 1621873418.2893317,
        "leaf_3_0_4": 1621873418.2991223,
        "leaf_3_0_5": 1621873418.3086517,
        "leaf_3_0_6": 1621873418.3177328,
        "leaf_3_0_7": 1621873418.3251836,
        "leaf_3_0_8": 1621873418.3410304,
        "leaf_4_0_1": 1621873418.3496742,
        "leaf_4_0_2": 1621873418.3093584,
        "leaf_4_0_3": 1621873418.319542,
        "leaf_4_0_4": 1621873418.334006,
        "leaf_4_0_5": 1621873418.3448048,
        "leaf_4_0_6": 1621873418.355009,
        "leaf_4_0_7": 1621873418.3184922,
        "leaf_4_0_8": 1621873418.3333673,
        "spine_1_1_1": 1621873418.3454306,
        "spine_1_1_2": 1621873418.35782,
        "spine_1_1_3": 1621873418.3680997,
        "spine_1_1_4": 1621873418.3178604,
        "spine_1_1_5": 1621873418.3331153,
        "spine_1_1_6": 1621873418.341676,
        "spine_1_1_7": 1621873418.3504312,
        "spine_1_1_8": 1621873418.3623977,
        "spine_2_1_1": 1621873418.3604784,
        "spine_2_1_2": 1621873418.3721983,
        "spine_2_1_3": 1621873418.3812196,
        "spine_2_1_4": 1621873418.3947127,
        "spine_2_1_5": 1621873418.405331,
        "spine_2_1_6": 1621873418.367327,
        "spine_2_1_7": 1621873418.3761814,
        "spine_2_1_8": 1621873418.3888602,
        "spine_3_1_1": 1621873418.3993876,
        "spine_3_1_2": 1621873418.4129467,
        "spine_3_1_3": 1621873418.3741481,
        "spine_3_1_4": 1621873418.387285,
        "spine_3_1_5": 1621873418.3966925,
        "spine_3_1_6": 1621873418.4070613,
        "spine_3_1_7": 1621873418.4197335,
        "spine_3_1_8": 1621873418.3775907,
        "spine_4_1_1": 1621873418.3914502,
        "spine_4_1_2": 1621873418.405242,
        "spine_4_1_3": 1621873418.4199955,
        "spine_4_1_4": 1621873418.4323578,
        "spine_4_1_5": 1621873418.4179919,
        "spine_4_1_6": 1621873418.4247277,
        "spine_4_1_7": 1621873418.4340298,
        "spine_4_1_8": 1621873418.447708,
        "tof_1_2_1": 1621873418.4562511,
        "tof_1_2_2": 1621873418.4216661,
        "tof_1_2_3": 1621873418.4340792,
        "tof_1_2_4": 1621873418.4493043,
        "tof_1_2_5": 1621873418.4642072,
        "tof_1_2_6": 1621873418.4708278,
        "tof_1_2_7": 1621873418.427847,
        "tof_1_2_8": 1621873418.4374437,
        "tof_2_2_1": 1621873418.4612105,
        "tof_2_2_2": 1621873418.46772,
        "tof_2_2_3": 1621873418.473384,
        "tof_2_2_4": 1621873418.441243,
        "tof_2_2_5": 1621873418.4626226,
        "tof_2_2_6": 1621873418.4701095,
        "tof_2_2_7": 1621873418.480494,
        "tof_2_2_8": 1621873418.4874833
    }
}