{
    "k_leaf": 4,
    "k_top": 4,
    "redundancy_factor": 4,
    "is_k8s": true,
    "machine_mac_addresses": {
        "leaf_1_0_1": {
            "net0": "da:d0:12:bb:28:ee",
            "net1": "8e:c0:50:2e:7c:cc",
            "net2": "12:d4:7e:52:74:a8",
            "net3": "f2:3b:a3:8d:05:ed",
            "net4": "86:b7:e2:9e:86:6a"
        },
        "leaf_1_0_2": {
            "net0": "6a:20:ef:20:26:ea",
            "net1": "fe:57:a7:2a:51:36",
            "net2": "fe:47:2c:46:68:d9",
            "net3": "12:f8:4c:b8:82:87",
            "net4": "9a:3d:e6:1b:1a:1b"
        },
        "leaf_1_0_3": {
            "net0": "9e:da:0e:64:2f:32",
            "net1": "72:89:d5:34:12:28",
            "net2": "e6:54:c0:a3:61:dc",
            "net3": "2e:52:fd:71:28:49",
            "net4": "c6:3e:a8:df:eb:66"
        },
        "leaf_1_0_4": {
            "net0": "1e:78:7b:c5:c1:4e",
            "net1": "e6:47:60:cd:4d:c3",
            "net2": "32:e0:07:88:31:fb",
            "net3": "ae:37:82:ed:70:cf",
            "net4": "9a:fc:83:6e:09:5b"
        },
        "leaf_2_0_1": {
            "net0": "5a:50:0d:0f:2b:86",
            "net1": "1a:ad:d1:60:ac:03",
            "net2": "52:14:92:7d:41:09",
            "net3": "1e:38:e3:c4:18:c1",
            "net4": "e2:fe:f7:3c:e6:35"
        },
        "leaf_2_0_2": {
            "net0": "ee:4e:9b:36:88:8b",
            "net1": "92:4a:ce:77:34:09",
            "net2": "0a:69:08:39:d1:66",
            "net3": "ea:b8:bd:02:cb:ed",
            "net4": "7e:29:36:d8:db:92"
        },
        "leaf_2_0_3": {
            "net0": "c6:f5:55:82:d7:79",
            "net1": "d2:49:06:12:9f:0e",
            "net2": "fe:17:c3:26:53:04",
            "net3": "66:50:66:82:75:f8",
            "net4": "c6:2b:80:98:f0:90"
        },
        "leaf_2_0_4": {
            "net0": "ae:7e:05:80:f5:96",
            "net1": "e6:72:d8:be:d7:21",
            "net2": "4e:3e:80:de:d5:9a",
            "net3": "2a:41:1a:87:2a:d8",
            "net4": "8a:3f:05:bd:98:6b"
        },
        "spine_1_1_1": {
            "net0": "6e:d1:10:4e:0e:f4",
            "net1": "6a:d1:f9:d4:f3:ff",
            "net2": "66:80:51:5b:23:ca",
            "net3": "72:6f:83:b2:e6:de",
            "net4": "72:c6:c0:42:e7:56",
            "net5": "f6:81:ff:a3:30:e9",
            "net6": "96:cc:cc:dc:bb:34",
            "net7": "fa:2f:cf:3c:b3:1c"
        },
        "spine_1_1_2": {
            "net0": "1e:95:c1:ac:dc:6d",
            "net1": "36:ae:53:5c:11:67",
            "net2": "2e:ef:8d:56:d0:2c",
            "net3": "6e:e6:bd:eb:7c:c9",
            "net4": "8a:c8:a0:0b:3e:d6",
            "net5": "82:80:54:df:8c:5c",
            "net6": "92:81:bc:0b:47:37",
            "net7": "02:0c:19:06:c5:f6"
        },
        "spine_1_1_3": {
            "net0": "4e:53:af:83:26:91",
            "net1": "92:94:1a:ba:21:f1",
            "net2": "72:ad:9d:b0:19:55",
            "net3": "de:1c:23:c9:58:41",
            "net4": "96:c0:08:54:b0:95",
            "net5": "5e:4d:33:fb:3f:b1",
            "net6": "12:27:7d:52:b1:77",
            "net7": "8a:a6:07:52:40:8d"
        },
        "spine_1_1_4": {
            "net0": "3e:9d:fa:86:80:14",
            "net1": "ce:7c:42:42:52:10",
            "net2": "62:9b:ab:a1:e4:83",
            "net3": "6a:f8:75:ae:12:b7",
            "net4": "22:f4:0b:72:8e:7d",
            "net5": "1e:55:22:8f:40:04",
            "net6": "0a:bb:a2:ed:00:7c",
            "net7": "b6:f5:68:97:53:bc"
        },
        "spine_2_1_1": {
            "net0": "ee:b1:90:db:0a:6a",
            "net1": "7e:ab:71:bd:3a:ad",
            "net2": "a2:82:aa:85:58:ed",
            "net3": "da:44:84:79:54:2c",
            "net4": "42:57:86:75:f9:0e",
            "net5": "4e:39:5f:0f:fc:4c",
            "net6": "4a:04:0f:25:43:d2",
            "net7": "e2:2b:63:16:80:85"
        },
        "spine_2_1_2": {
            "net0": "1e:f5:0c:12:bf:89",
            "net1": "c6:25:75:e7:64:f4",
            "net2": "02:73:d6:fd:a0:f3",
            "net3": "16:3d:e2:d7:d6:c0",
            "net4": "f2:fb:4e:04:fb:20",
            "net5": "66:c2:d2:7d:f1:a2",
            "net6": "f6:3a:fb:3c:46:31",
            "net7": "5a:5b:38:dc:d5:c0"
        },
        "spine_2_1_3": {
            "net0": "e6:e2:c0:c3:5c:e0",
            "net1": "02:84:4f:2b:70:dc",
            "net2": "e2:2c:12:1c:27:a8",
            "net3": "aa:2b:cc:c8:ab:6a",
            "net4": "6a:5c:14:3a:0f:e5",
            "net5": "a2:05:63:81:a0:d9",
            "net6": "ea:54:2c:1b:e4:a7",
            "net7": "12:96:06:6d:89:15"
        },
        "spine_2_1_4": {
            "net0": "e6:80:b6:91:6a:ab",
            "net1": "5e:0f:29:b0:d2:12",
            "net2": "d6:ac:76:bc:03:0f",
            "net3": "76:00:6f:49:bc:4a",
            "net4": "2a:9c:f9:05:fd:31",
            "net5": "7e:39:42:3e:76:fb",
            "net6": "0e:04:61:dd:8d:d5",
            "net7": "c6:90:b7:6d:99:c6"
        },
        "tof_1_2_1": {
            "net0": "8a:23:70:a6:60:de",
            "net1": "e6:ba:0d:e0:0f:72",
            "net2": "92:b2:f9:9e:88:15",
            "net3": "0e:7f:57:12:da:f9",
            "net4": "0e:cc:db:51:b2:73",
            "net5": "5a:54:e0:c6:a0:bc",
            "net6": "02:a0:db:41:43:cb",
            "net7": "de:29:c7:26:20:ad"
        },
        "tof_1_2_2": {
            "net0": "e6:ac:75:fe:78:a0",
            "net1": "0a:68:62:39:b9:24",
            "net2": "8a:a8:73:d2:9d:87",
            "net3": "ee:77:89:1f:97:74",
            "net4": "a6:25:42:e5:5c:c8",
            "net5": "9a:fd:06:5a:ac:8f",
            "net6": "82:a9:b5:56:af:01",
            "net7": "ae:5d:e8:20:39:b2"
        },
        "tof_1_2_3": {
            "net0": "b6:43:2f:9e:a1:11",
            "net1": "2e:ee:f3:54:dd:b9",
            "net2": "52:fc:54:9f:3e:be",
            "net3": "2a:cb:d2:b9:fa:72",
            "net4": "1a:0f:fe:68:22:26",
            "net5": "22:33:f8:8d:6a:d4",
            "net6": "5e:6e:d1:50:8a:37",
            "net7": "ea:23:a0:65:da:26"
        },
        "tof_1_2_4": {
            "net0": "ce:19:f4:84:88:ea",
            "net1": "76:1b:60:99:ae:dc",
            "net2": "6a:55:b6:61:fd:12",
            "net3": "be:de:c4:51:a9:da",
            "net4": "fa:3a:60:ed:97:d7",
            "net5": "5a:c4:4b:bc:46:c5",
            "net6": "32:de:9d:09:10:cd",
            "net7": "ce:8d:bc:1c:64:9e"
        }
    },
    "failed_machine": "leaf_1_0_1",
    "failure_time": {
        "leaf_1_0_1": 1621865678.256178,
        "leaf_1_0_2": 1621865678.2644928,
        "leaf_1_0_3": 1621865678.259825,
        "leaf_1_0_4": 1621865678.2758975,
        "leaf_2_0_1": 1621865678.2602496,
        "leaf_2_0_2": 1621865678.2746708,
        "leaf_2_0_3": 1621865678.2622712,
        "leaf_2_0_4": 1621865678.2804925,
        "spine_1_1_1": 1621865678.2815788,
        "spine_1_1_2": 1621865678.298268,
        "spine_1_1_3": 1621865678.2891374,
        "spine_1_1_4": 1621865678.2996738,
        "spine_2_1_1": 1621865678.2923791,
        "spine_2_1_2": 1621865678.3016067,
        "spine_2_1_3": 1621865678.2951655,
        "spine_2_1_4": 1621865678.3047435,
        "tof_1_2_1": 1621865678.311031,
        "tof_1_2_2": 1621865678.323422,
        "tof_1_2_3": 1621865678.3128161,
        "tof_1_2_4": 1621865678.3258893
    }
}