{
    "k_leaf": 10,
    "k_top": 10,
    "redundancy_factor": 5,
    "is_k8s": true,
    "machine_mac_addresses": {
        "leaf_1_0_1": {
            "net0": "f2:1d:73:aa:76:e0",
            "net1": "82:e8:67:f1:86:a1",
            "net10": "8a:70:55:db:b7:8e",
            "net2": "1a:f2:ea:12:e0:36",
            "net3": "6e:af:50:2b:be:e6",
            "net4": "ca:96:77:b3:fd:1b",
            "net5": "4a:0f:c2:0b:8b:89",
            "net6": "4a:00:26:00:b8:7a",
            "net7": "da:77:66:c3:1f:69",
            "net8": "96:52:e0:4f:c0:e6",
            "net9": "82:7f:96:27:67:64"
        },
        "leaf_1_0_10": {
            "net0": "06:5a:6a:52:53:5c",
            "net1": "a2:17:3a:73:95:9a",
            "net10": "32:09:ed:1a:86:3f",
            "net2": "16:94:dd:ff:91:9f",
            "net3": "fa:ea:44:89:65:78",
            "net4": "66:c3:a4:5a:f7:9e",
            "net5": "9a:82:46:e5:75:23",
            "net6": "e2:3b:d4:7a:ea:7e",
            "net7": "d6:d9:13:9e:9f:29",
            "net8": "e6:87:ba:93:fe:31",
            "net9": "6e:f7:e8:6c:37:7f"
        },
        "leaf_1_0_2": {
            "net0": "ca:03:99:c2:b2:a3",
            "net1": "42:7e:51:b1:fc:b6",
            "net10": "fa:5d:9c:bb:1c:c1",
            "net2": "12:9f:a6:25:ae:8f",
            "net3": "de:e5:66:37:f2:62",
            "net4": "32:41:4a:26:0e:de",
            "net5": "86:f9:9b:65:aa:9e",
            "net6": "b2:f8:a5:79:40:17",
            "net7": "42:a7:cf:70:d9:d7",
            "net8": "e6:88:78:e1:22:c2",
            "net9": "ba:6b:7e:68:7f:dc"
        },
        "leaf_1_0_3": {
            "net0": "ce:62:07:77:b9:88",
            "net1": "36:f6:ef:6c:94:05",
            "net10": "8e:8b:57:85:f5:95",
            "net2": "22:fb:94:da:08:c0",
            "net3": "12:8d:29:a8:81:64",
            "net4": "4a:a5:f1:3a:c5:61",
            "net5": "52:f3:d8:cd:a7:17",
            "net6": "ae:55:64:41:d9:e0",
            "net7": "2e:33:65:33:77:aa",
            "net8": "a2:b0:1f:ff:12:5d",
            "net9": "ea:f4:e7:13:f1:8f"
        },
        "leaf_1_0_4": {
            "net0": "7e:48:a9:16:6a:ee",
            "net1": "56:82:a3:67:3a:f4",
            "net10": "7a:08:48:e1:b9:7d",
            "net2": "5e:2e:96:cd:83:e1",
            "net3": "5e:46:32:e3:1b:d6",
            "net4": "46:6f:0a:6b:3f:61",
            "net5": "d2:66:7f:57:d9:23",
            "net6": "ce:37:ab:b5:8f:63",
            "net7": "be:ad:a3:fb:c2:1c",
            "net8": "02:be:a3:e6:24:a0",
            "net9": "c6:d5:55:7c:f8:e5"
        },
        "leaf_1_0_5": {
            "net0": "62:0b:cd:20:26:a8",
            "net1": "d6:bb:38:8f:d4:a3",
            "net10": "ae:c0:2f:89:90:65",
            "net2": "ae:0a:26:38:cc:78",
            "net3": "82:0a:cd:0c:07:8b",
            "net4": "8e:5b:36:fc:47:a8",
            "net5": "2e:e3:ab:a9:dc:37",
            "net6": "72:ed:7b:fd:bc:4d",
            "net7": "fe:69:4f:8f:a8:0c",
            "net8": "9a:7b:13:93:c1:b5",
            "net9": "56:2e:9b:b7:79:69"
        },
        "leaf_1_0_6": {
            "net0": "02:ec:2b:9f:f9:5a",
            "net1": "a2:84:9c:3e:45:64",
            "net10": "4a:35:30:93:9a:69",
            "net2": "e2:91:39:e1:f3:ba",
            "net3": "b2:ee:70:74:dc:62",
            "net4": "ba:50:ec:ca:14:60",
            "net5": "de:36:ca:38:88:08",
            "net6": "3a:04:e8:f8:1b:0a",
            "net7": "06:3f:25:89:56:0e",
            "net8": "42:bd:d9:b0:77:6b",
            "net9": "02:0f:9a:62:52:4a"
        },
        "leaf_1_0_7": {
            "net0": "6a:28:17:b7:86:4a",
            "net1": "1e:9b:89:10:e2:30",
            "net10": "e2:cd:95:5a:d4:1f",
            "net2": "6e:f3:d4:c7:f2:48",
            "net3": "7a:f0:34:7f:3a:bc",
            "net4": "6e:27:d6:cc:28:33",
            "net5": "22:55:18:94:eb:97",
            "net6": "7a:b4:59:71:6c:7c",
            "net7": "16:5f:23:c2:05:db",
            "net8": "1e:56:6e:79:57:89",
            "net9": "66:d8:dc:bd:fa:e1"
        },
        "leaf_1_0_8": {
            "net0": "9e:0f:36:61:2e:de",
            "net1": "86:b2:5d:c3:2b:1d",
            "net10": "e2:e0:cc:22:f6:44",
            "net2": "56:78:57:b7:72:40",
            "net3": "2a:d4:94:f1:b3:e5",
            "net4": "7a:98:89:97:65:a1",
            "net5": "d2:69:c5:4d:1e:0d",
            "net6": "7e:c8:06:d6:a4:42",
            "net7": "d2:2a:19:e1:cb:52",
            "net8": "42:ed:e9:66:23:ee",
            "net9": "8e:47:23:c4:cd:07"
        },
        "leaf_1_0_9": {
            "net0": "fe:95:67:c2:d4:91",
            "net1": "fa:01:f9:e5:88:d1",
            "net10": "6e:c5:ae:ce:48:c1",
            "net2": "76:8a:6a:eb:fd:a2",
            "net3": "5e:71:cb:65:24:8e",
            "net4": "42:a2:f3:2c:47:31",
            "net5": "4a:0a:cb:2a:aa:79",
            "net6": "ca:70:6f:ff:ad:62",
            "net7": "3a:44:33:e1:fb:38",
            "net8": "be:69:e1:9e:e3:0a",
            "net9": "ee:a3:e3:c4:4f:34"
        },
        "leaf_2_0_1": {
            "net0": "c6:31:54:de:5a:91",
            "net1": "a6:94:d8:63:f8:03",
            "net10": "b2:67:e4:96:08:fb",
            "net2": "4e:83:38:a5:fd:68",
            "net3": "8a:7a:d5:b2:7a:ae",
            "net4": "1a:56:22:1f:eb:ae",
            "net5": "1e:dd:1a:6c:bf:8f",
            "net6": "f6:0f:8c:61:82:dd",
            "net7": "1a:f4:71:95:a8:96",
            "net8": "f6:5f:2d:01:90:4d",
            "net9": "aa:75:07:2e:2a:62"
        },
        "leaf_2_0_10": {
            "net0": "c2:2b:3a:81:b1:f1",
            "net1": "4e:94:69:0d:27:d5",
            "net10": "b2:c3:8f:fd:c4:b2",
            "net2": "36:dc:72:80:48:c2",
            "net3": "22:02:c4:4b:6e:44",
            "net4": "56:56:a9:b2:76:a8",
            "net5": "82:fc:b6:75:f3:d9",
            "net6": "8e:6b:ba:62:ec:fd",
            "net7": "e2:01:48:5c:b8:3f",
            "net8": "ce:5d:c3:b6:80:1f",
            "net9": "72:fa:91:e1:27:a5"
        },
        "leaf_2_0_2": {
            "net0": "ca:79:63:6e:ae:70",
            "net1": "22:4f:96:72:a6:e3",
            "net10": "9a:ce:e7:9a:91:38",
            "net2": "ba:b7:1a:05:96:95",
            "net3": "ea:3d:5b:06:f3:1f",
            "net4": "9a:3b:40:4a:a4:1e",
            "net5": "7e:99:3b:db:bc:6a",
            "net6": "02:ce:dd:27:b4:3a",
            "net7": "ca:44:d6:92:a1:c1",
            "net8": "f2:78:91:92:d8:6f",
            "net9": "e6:cd:99:e7:89:08"
        },
        "leaf_2_0_3": {
            "net0": "3e:61:68:ba:e7:e6",
            "net1": "26:4d:a9:df:72:36",
            "net10": "f2:db:b9:9e:63:26",
            "net2": "1a:08:cf:c8:70:b0",
            "net3": "16:31:f2:e0:5e:5d",
            "net4": "ee:03:7e:5b:c4:62",
            "net5": "2e:d3:dd:08:1c:3b",
            "net6": "8e:01:d7:c1:31:2a",
            "net7": "da:a3:99:75:eb:51",
            "net8": "fe:70:87:24:7c:7a",
            "net9": "46:4d:0e:f8:2a:6a"
        },
        "leaf_2_0_4": {
            "net0": "42:9a:7f:c7:3b:3c",
            "net1": "16:ea:f7:15:f7:8d",
            "net10": "32:7b:21:36:af:b6",
            "net2": "42:fb:69:10:1a:fc",
            "net3": "7a:73:79:4c:fd:28",
            "net4": "46:4e:c8:45:ce:02",
            "net5": "36:df:dc:0d:2d:4e",
            "net6": "12:4f:aa:99:2e:98",
            "net7": "66:b4:cb:e6:e5:ac",
            "net8": "ba:be:79:40:28:f5",
            "net9": "fe:89:bb:2d:03:77"
        },
        "leaf_2_0_5": {
            "net0": "ce:ce:2c:88:c1:3f",
            "net1": "fa:46:fe:a6:62:ed",
            "net10": "52:9c:9a:5f:a8:93",
            "net2": "ba:d4:79:d6:9f:7b",
            "net3": "06:32:2f:67:c9:8f",
            "net4": "0e:64:c2:0d:e9:cb",
            "net5": "16:1c:5c:ff:7a:3f",
            "net6": "46:59:45:b7:45:40",
            "net7": "fe:f6:25:60:3f:37",
            "net8": "76:01:03:7c:23:31",
            "net9": "56:24:fe:f9:cf:dd"
        },
        "leaf_2_0_6": {
            "net0": "9e:67:16:a7:7d:13",
            "net1": "ae:2b:87:a5:7d:2f",
            "net10": "1e:ec:61:aa:19:c7",
            "net2": "02:22:f1:e9:ca:2c",
            "net3": "96:25:32:ab:cc:12",
            "net4": "c6:bd:c2:a3:be:da",
            "net5": "aa:e6:11:bd:3e:3f",
            "net6": "a6:d9:09:38:c5:47",
            "net7": "7a:bf:90:34:18:a3",
            "net8": "f2:2e:a8:16:04:f7",
            "net9": "b6:e2:78:0b:b4:2f"
        },
        "leaf_2_0_7": {
            "net0": "5a:0f:c7:87:33:6a",
            "net1": "b6:d3:3e:b3:c9:a7",
            "net10": "9e:bc:5b:db:aa:16",
            "net2": "8e:b6:ad:b4:78:a6",
            "net3": "fe:25:cd:35:f5:25",
            "net4": "7e:c6:48:6e:5e:95",
            "net5": "b6:5f:69:b4:18:47",
            "net6": "8a:c9:88:0a:5a:81",
            "net7": "ea:3b:36:fc:9c:a2",
            "net8": "aa:81:41:55:85:a5",
            "net9": "32:09:40:04:f3:12"
        },
        "leaf_2_0_8": {
            "net0": "de:24:b1:95:83:c8",
            "net1": "02:43:56:57:43:37",
            "net10": "0a:d3:78:23:6f:17",
            "net2": "ea:5d:a7:09:5e:7b",
            "net3": "82:8b:c4:21:dc:ef",
            "net4": "2a:8c:31:2d:45:e6",
            "net5": "1e:e2:d5:bd:cd:c4",
            "net6": "82:71:fd:9d:25:70",
            "net7": "12:4a:0e:3e:c8:9f",
            "net8": "c2:49:dc:62:0e:81",
            "net9": "26:66:18:a0:f4:df"
        },
        "leaf_2_0_9": {
            "net0": "8a:3c:91:b8:5c:03",
            "net1": "be:d4:55:72:8c:aa",
            "net10": "42:96:21:aa:28:bf",
            "net2": "9e:17:06:7d:35:43",
            "net3": "7e:0f:fa:7b:0f:2e",
            "net4": "3a:2f:00:9e:ee:99",
            "net5": "9a:22:7d:82:16:33",
            "net6": "66:ca:19:48:8e:99",
            "net7": "46:3d:6c:fa:81:f9",
            "net8": "02:09:ec:93:39:25",
            "net9": "f6:cb:f4:9c:f3:1d"
        },
        "leaf_3_0_1": {
            "net0": "f2:77:ee:27:44:10",
            "net1": "12:b1:d7:5c:5c:65",
            "net10": "76:66:62:6c:f2:8c",
            "net2": "66:c5:4b:93:f9:65",
            "net3": "3a:70:24:3d:9c:f0",
            "net4": "ca:0c:04:db:be:81",
            "net5": "0a:28:51:d8:a3:65",
            "net6": "be:1f:7c:6e:30:70",
            "net7": "36:60:62:ec:1e:f3",
            "net8": "52:6f:43:b6:72:d8",
            "net9": "a2:78:7c:19:4b:8c"
        },
        "leaf_3_0_10": {
            "net0": "12:83:42:a3:3c:be",
            "net1": "4a:20:63:c6:c3:6d",
            "net10": "8e:11:96:a8:99:cc",
            "net2": "ca:22:c6:31:6c:34",
            "net3": "26:3a:57:d5:94:ca",
            "net4": "be:c0:74:e9:2c:c5",
            "net5": "c2:77:2f:22:dc:ae",
            "net6": "22:dd:98:70:20:a0",
            "net7": "e6:82:b8:dc:8c:62",
            "net8": "12:3d:7a:d7:e0:cb",
            "net9": "be:a1:1c:95:2d:bb"
        },
        "leaf_3_0_2": {
            "net0": "62:ba:b5:b4:24:cc",
            "net1": "b6:ba:05:9f:92:9c",
            "net10": "16:c5:7e:b3:b9:19",
            "net2": "4e:d7:68:df:89:db",
            "net3": "7e:5c:9a:92:a7:ac",
            "net4": "d2:75:3c:e8:f4:4a",
            "net5": "c6:06:ad:c1:7e:8d",
            "net6": "f6:c9:c3:05:46:3f",
            "net7": "86:31:77:27:59:98",
            "net8": "22:21:8e:69:ea:63",
            "net9": "f2:6e:45:1d:3a:86"
        },
        "leaf_3_0_3": {
            "net0": "c6:39:73:53:1d:0f",
            "net1": "1e:71:73:9b:58:a0",
            "net10": "6a:77:e7:97:e2:df",
            "net2": "e6:e1:34:15:9d:74",
            "net3": "86:44:d0:ba:04:99",
            "net4": "3a:90:6c:d5:6d:bd",
            "net5": "8a:f9:75:25:0e:97",
            "net6": "82:e0:b7:ab:ad:18",
            "net7": "ae:25:a5:e8:7d:1c",
            "net8": "1a:38:55:55:09:09",
            "net9": "32:8b:f5:0c:a9:18"
        },
        "leaf_3_0_4": {
            "net0": "ae:0f:39:e7:1c:b9",
            "net1": "ae:2a:99:98:d7:46",
            "net10": "ea:87:19:69:14:c0",
            "net2": "ba:ed:c4:cc:b6:af",
            "net3": "aa:26:79:65:4a:55",
            "net4": "92:b6:c5:34:ad:50",
            "net5": "c6:45:7e:2a:23:0e",
            "net6": "4e:38:e7:b3:ea:71",
            "net7": "32:eb:5a:14:8e:a8",
            "net8": "86:64:fd:b5:6d:4b",
            "net9": "2e:09:50:0b:35:8e"
        },
        "leaf_3_0_5": {
            "net0": "6e:b6:7a:9e:87:5f",
            "net1": "92:ea:48:96:9f:37",
            "net10": "ee:64:0b:70:17:bb",
            "net2": "a2:a0:3c:e8:b1:c1",
            "net3": "ae:df:c3:02:a7:60",
            "net4": "96:1b:c9:08:5a:ed",
            "net5": "42:57:64:c4:a6:c9",
            "net6": "3e:c3:5f:57:78:14",
            "net7": "96:f5:7e:b2:97:74",
            "net8": "ba:52:23:a5:5d:8b",
            "net9": "ba:25:74:06:e4:e4"
        },
        "leaf_3_0_6": {
            "net0": "52:5c:3b:19:c9:56",
            "net1": "da:3b:a2:89:60:a3",
            "net10": "32:48:c8:bc:f7:1d",
            "net2": "e6:32:0e:bf:26:57",
            "net3": "02:d9:24:07:e3:6e",
            "net4": "5e:4e:7b:2b:76:4e",
            "net5": "f6:70:bd:62:60:47",
            "net6": "1e:59:96:4d:2f:3b",
            "net7": "d6:5d:8e:86:bf:5d",
            "net8": "52:ff:68:9b:da:3c",
            "net9": "ae:3b:9d:b3:fc:e6"
        },
        "leaf_3_0_7": {
            "net0": "2a:fe:7a:d3:8b:73",
            "net1": "6a:ac:95:d2:0f:63",
            "net10": "ee:cf:0e:59:81:64",
            "net2": "12:09:92:e5:c4:a7",
            "net3": "32:f1:8c:4c:ce:95",
            "net4": "ea:58:92:f9:d2:e5",
            "net5": "0e:39:e0:2b:a5:25",
            "net6": "32:6b:0e:78:b3:77",
            "net7": "52:98:dc:6b:5b:53",
            "net8": "96:92:6d:3d:cf:52",
            "net9": "e6:04:68:a7:12:6f"
        },
        "leaf_3_0_8": {
            "net0": "66:11:6f:32:48:d4",
            "net1": "0e:da:d3:ee:f1:c7",
            "net10": "7a:89:25:e9:26:00",
            "net2": "96:1c:a2:93:1a:16",
            "net3": "e6:4d:ca:ab:7e:c9",
            "net4": "6a:46:b6:aa:53:9e",
            "net5": "c6:d7:c9:01:00:fc",
            "net6": "d6:7d:e5:37:96:0a",
            "net7": "6e:b3:b0:a2:36:b0",
            "net8": "ce:45:50:87:8e:09",
            "net9": "d2:aa:82:a5:b7:10"
        },
        "leaf_3_0_9": {
            "net0": "2e:bd:90:16:b2:f5",
            "net1": "a2:fd:31:9c:77:d9",
            "net10": "d6:bf:ba:ac:f0:13",
            "net2": "da:d7:c5:cc:4d:7f",
            "net3": "66:ca:4e:f3:29:42",
            "net4": "7e:9a:37:be:75:27",
            "net5": "c6:69:b1:6b:f1:69",
            "net6": "d6:fe:5f:87:4f:80",
            "net7": "26:e1:65:a0:43:81",
            "net8": "6e:b6:4b:07:bc:19",
            "net9": "b6:d9:92:ce:2b:9f"
        },
        "leaf_4_0_1": {
            "net0": "a6:1b:8e:ba:21:b7",
            "net1": "6a:60:88:0c:4f:3b",
            "net10": "2e:c7:72:d3:55:ba",
            "net2": "2a:96:4b:43:82:23",
            "net3": "de:9b:cc:bd:28:bf",
            "net4": "ce:e8:2f:3d:66:a1",
            "net5": "26:67:1c:73:a1:82",
            "net6": "c6:86:63:aa:e2:9b",
            "net7": "f2:52:31:91:51:af",
            "net8": "6a:b8:76:03:23:71",
            "net9": "62:79:b9:22:ed:64"
        },
        "leaf_4_0_10": {
            "net0": "8a:a4:01:fd:59:45",
            "net1": "e6:dc:e6:cd:b5:02",
            "net10": "1a:4b:aa:bb:e5:75",
            "net2": "56:2f:af:97:52:14",
            "net3": "c2:e3:8e:57:90:5f",
            "net4": "92:0b:84:3f:c8:d2",
            "net5": "7a:33:b3:9b:c2:74",
            "net6": "7a:2f:66:91:5d:44",
            "net7": "be:89:72:5b:c6:6b",
            "net8": "72:b7:3c:1c:52:b4",
            "net9": "d6:17:63:b2:75:3c"
        },
        "leaf_4_0_2": {
            "net0": "06:c1:fd:12:b7:a3",
            "net1": "16:c7:ad:8f:23:89",
            "net10": "e6:84:6e:28:0d:9c",
            "net2": "fe:fe:d7:b7:07:78",
            "net3": "8a:c2:81:9e:85:b7",
            "net4": "ae:97:f0:7b:fe:c2",
            "net5": "1a:6e:c1:19:10:f0",
            "net6": "da:fe:5c:57:56:d0",
            "net7": "b2:5b:fd:18:01:df",
            "net8": "e2:05:07:aa:2a:67",
            "net9": "02:ce:88:d1:b0:82"
        },
        "leaf_4_0_3": {
            "net0": "b2:16:e1:ac:16:3d",
            "net1": "42:c8:d2:60:46:38",
            "net10": "12:1e:4d:d6:db:7d",
            "net2": "aa:b2:1b:98:75:56",
            "net3": "0a:df:52:e1:13:93",
            "net4": "da:b6:5f:f8:31:c2",
            "net5": "2a:02:95:d8:a8:8c",
            "net6": "46:57:4e:aa:fc:cb",
            "net7": "7a:f6:b3:1e:95:4c",
            "net8": "6a:4f:c9:79:e5:3f",
            "net9": "d2:94:ac:db:69:b1"
        },
        "leaf_4_0_4": {
            "net0": "da:1a:ee:df:f8:7e",
            "net1": "92:67:3c:6c:e9:b3",
            "net10": "da:7a:77:a5:12:83",
            "net2": "6e:5c:b2:39:1f:8b",
            "net3": "06:71:db:e6:3c:0d",
            "net4": "92:d8:77:55:0b:b8",
            "net5": "e6:3a:c7:c9:f9:a2",
            "net6": "06:08:9b:6d:c0:54",
            "net7": "6e:17:05:a6:be:94",
            "net8": "e2:a4:eb:00:67:7c",
            "net9": "de:aa:46:bc:b4:43"
        },
        "leaf_4_0_5": {
            "net0": "b2:a4:a6:c9:b4:5a",
            "net1": "a6:94:8f:76:f5:0a",
            "net10": "7e:76:9b:1a:ed:5d",
            "net2": "72:49:97:71:ce:80",
            "net3": "fe:47:79:9a:6c:af",
            "net4": "52:74:86:45:18:e1",
            "net5": "0a:35:a2:77:b0:00",
            "net6": "92:25:84:f3:df:e7",
            "net7": "12:98:69:20:f6:32",
            "net8": "2e:ba:70:5e:ce:08",
            "net9": "42:67:a0:04:1b:b8"
        },
        "leaf_4_0_6": {
            "net0": "4a:5d:8f:94:29:c6",
            "net1": "a6:9d:d9:5e:e9:42",
            "net10": "1e:a1:1e:3c:10:83",
            "net2": "32:65:e0:be:ac:40",
            "net3": "b2:0c:9e:2b:0b:67",
            "net4": "6e:80:d6:5c:bf:58",
            "net5": "0e:f8:7a:11:7d:91",
            "net6": "e6:c8:cd:20:46:ac",
            "net7": "a6:df:e5:dd:fa:ed",
            "net8": "1a:d3:8d:bd:86:62",
            "net9": "fe:78:96:0b:ac:fd"
        },
        "leaf_4_0_7": {
            "net0": "aa:69:ff:d8:da:62",
            "net1": "2e:c1:38:e5:04:23",
            "net10": "06:54:ee:8e:89:6a",
            "net2": "86:67:6d:48:85:66",
            "net3": "c6:23:27:7a:6e:f4",
            "net4": "a6:a1:4c:56:27:7a",
            "net5": "5e:73:68:3a:69:46",
            "net6": "ce:2b:f1:88:1b:4c",
            "net7": "ae:72:4e:58:f7:b0",
            "net8": "56:83:59:a1:0a:c5",
            "net9": "f2:82:6e:fe:a5:67"
        },
        "leaf_4_0_8": {
            "net0": "ea:ce:36:b5:bd:4b",
            "net1": "8e:2a:a4:7e:a4:11",
            "net10": "c2:c1:aa:bb:6a:20",
            "net2": "6a:9c:cc:73:36:99",
            "net3": "a6:c2:92:bd:96:d3",
            "net4": "b6:41:51:f1:0b:0e",
            "net5": "9a:99:18:16:a1:1f",
            "net6": "ba:8a:85:64:58:cf",
            "net7": "b6:e9:01:50:0e:61",
            "net8": "1e:84:d5:21:a6:d9",
            "net9": "aa:59:1c:3b:43:43"
        },
        "leaf_4_0_9": {
            "net0": "1a:68:8e:28:ec:56",
            "net1": "42:0f:b7:e7:07:2b",
            "net10": "06:9e:1e:3c:07:28",
            "net2": "de:57:80:cf:a4:53",
            "net3": "8e:7f:72:d1:08:9b",
            "net4": "e2:1c:5f:ef:7b:d9",
            "net5": "be:7d:da:94:56:e7",
            "net6": "42:d5:7a:5c:88:0b",
            "net7": "5a:18:69:7c:fa:3a",
            "net8": "e2:e5:e8:95:ce:17",
            "net9": "f6:c5:f7:e5:d8:e8"
        },
        "spine_1_1_1": {
            "net0": "42:33:18:1e:ea:9e",
            "net1": "c6:b3:d9:ca:da:27",
            "net10": "2a:c9:67:0b:64:95",
            "net11": "ea:d4:37:0d:5f:ff",
            "net12": "22:c2:fa:00:90:a7",
            "net13": "22:19:83:d0:cb:f6",
            "net14": "be:86:d7:3d:7c:8a",
            "net15": "0e:85:91:dc:62:ad",
            "net16": "5e:da:19:b7:69:c2",
            "net17": "2e:f4:65:56:35:77",
            "net18": "aa:d1:44:40:2d:e0",
            "net19": "ce:f3:d0:71:2e:c0",
            "net2": "5a:3a:f4:c0:d5:70",
            "net3": "62:5e:37:65:b3:9a",
            "net4": "f2:29:7d:a2:bb:9f",
            "net5": "da:96:28:fb:b2:bd",
            "net6": "fa:21:ff:03:d9:1e",
            "net7": "06:f9:9e:d4:9a:17",
            "net8": "f6:3d:92:78:5c:97",
            "net9": "ba:da:5b:aa:9f:f8"
        },
        "spine_1_1_10": {
            "net0": "a6:61:46:8f:d4:ec",
            "net1": "ce:b7:23:0e:8e:e8",
            "net10": "9a:65:d3:93:ea:6c",
            "net11": "52:69:ae:64:06:ef",
            "net12": "56:8c:31:b6:c1:94",
            "net13": "c6:e3:f9:42:33:6a",
            "net14": "62:64:44:57:22:14",
            "net15": "5a:59:a5:5a:51:bc",
            "net16": "ee:8b:de:b0:c8:4d",
            "net17": "3e:16:57:3d:00:91",
            "net18": "36:f6:bc:b6:37:68",
            "net19": "de:98:d0:60:02:48",
            "net2": "1a:db:44:c7:7f:2d",
            "net3": "5e:11:8d:f5:7c:08",
            "net4": "ce:ff:b7:de:a4:6e",
            "net5": "ce:18:56:6b:75:9b",
            "net6": "be:83:d3:67:bf:88",
            "net7": "56:db:56:de:71:44",
            "net8": "9a:7c:29:24:77:e6",
            "net9": "56:f9:66:65:36:9e"
        },
        "spine_1_1_2": {
            "net0": "ba:07:ee:94:11:ff",
            "net1": "fe:08:a1:62:67:38",
            "net10": "a2:f8:73:7b:e9:a7",
            "net11": "d6:41:65:80:24:45",
            "net12": "6a:3d:dc:b8:c7:3f",
            "net13": "a2:16:ee:b9:f9:39",
            "net14": "46:ae:89:64:ec:80",
            "net15": "1e:c3:50:78:d8:c2",
            "net16": "7a:96:7e:1a:f6:87",
            "net17": "4a:25:04:31:2c:39",
            "net18": "52:fe:7e:b6:3b:f5",
            "net19": "5e:c7:38:f4:09:d9",
            "net2": "3a:b4:17:c6:91:e1",
            "net3": "02:51:6e:c7:88:1f",
            "net4": "be:20:64:37:39:59",
            "net5": "7e:a3:e6:2e:88:01",
            "net6": "06:11:4e:ba:6a:eb",
            "net7": "02:86:a2:61:7b:fe",
            "net8": "6a:fc:b2:39:e3:09",
            "net9": "82:02:fa:e6:bf:43"
        },
        "spine_1_1_3": {
            "net0": "42:a4:70:01:eb:12",
            "net1": "2e:d8:5e:ae:37:b4",
            "net10": "c6:77:fa:d5:c6:ad",
            "net11": "0a:e5:ff:bf:ba:dc",
            "net12": "6a:57:cf:79:31:e7",
            "net13": "62:db:c2:80:88:35",
            "net14": "42:da:fc:9b:bf:18",
            "net15": "2e:41:68:e1:c7:52",
            "net16": "22:b5:2a:b7:22:7e",
            "net17": "66:73:02:d9:a6:0b",
            "net18": "b2:86:7f:5b:14:f3",
            "net19": "6e:c3:55:95:7a:5f",
            "net2": "da:b3:09:2b:aa:39",
            "net3": "7e:4b:50:e9:ac:56",
            "net4": "5e:9d:eb:a5:50:c3",
            "net5": "96:b6:84:87:f3:2a",
            "net6": "ba:5c:fc:8f:ae:ce",
            "net7": "3e:2e:44:3e:61:76",
            "net8": "c6:c3:01:e8:f0:d9",
            "net9": "86:98:ed:16:b0:b9"
        },
        "spine_1_1_4": {
            "net0": "12:dc:c1:52:f6:e6",
            "net1": "f6:65:01:41:3f:f4",
            "net10": "9e:eb:d6:f7:f6:06",
            "net11": "4a:9c:55:e0:9b:52",
            "net12": "3a:e0:de:1f:34:c3",
            "net13": "12:7a:d8:6d:cf:c0",
            "net14": "2e:11:24:04:77:f4",
            "net15": "96:c9:96:39:b0:b2",
            "net16": "66:d2:c0:29:42:52",
            "net17": "1e:75:52:12:97:61",
            "net18": "d6:b1:1c:23:47:8f",
            "net19": "0e:91:81:86:e3:b4",
            "net2": "66:8e:f4:16:c8:dd",
            "net3": "8e:6b:68:0e:58:90",
            "net4": "0e:29:55:3b:fc:96",
            "net5": "4a:f4:88:e3:f9:c5",
            "net6": "e2:d8:0b:76:bd:32",
            "net7": "0e:bc:53:a6:a6:b1",
            "net8": "c6:e1:fe:c8:e7:ca",
            "net9": "7e:07:1f:34:73:1d"
        },
        "spine_1_1_5": {
            "net0": "2e:61:de:a6:f9:c9",
            "net1": "ca:ce:3d:91:c8:90",
            "net10": "92:4e:e2:8c:6f:98",
            "net11": "d2:b8:3c:72:1b:a3",
            "net12": "72:36:c0:30:78:8c",
            "net13": "92:bf:63:87:1d:3b",
            "net14": "be:49:26:99:09:06",
            "net15": "62:f6:90:cf:bc:8e",
            "net16": "b2:70:cb:90:51:7c",
            "net17": "be:50:ee:c3:fa:da",
            "net18": "b2:de:94:25:de:55",
            "net19": "ce:93:cb:b3:82:db",
            "net2": "66:f4:7a:0c:9f:53",
            "net3": "a6:ec:c5:47:c1:ee",
            "net4": "f2:de:52:7c:47:52",
            "net5": "7a:82:04:b3:1c:fd",
            "net6": "a2:74:09:fa:cb:26",
            "net7": "7e:f0:ea:bb:01:93",
            "net8": "ba:4e:ae:98:85:75",
            "net9": "7a:91:5c:b6:a5:bf"
        },
        "spine_1_1_6": {
            "net0": "fe:5a:39:8a:29:97",
            "net1": "26:fd:1a:5a:32:2a",
            "net10": "ce:44:cd:cf:51:af",
            "net11": "a6:29:5c:b9:90:ce",
            "net12": "f2:12:64:14:07:54",
            "net13": "aa:7f:78:93:48:c7",
            "net14": "ee:5a:4a:80:00:b5",
            "net15": "2a:07:fd:cf:3d:d8",
            "net16": "a2:89:2b:c9:3f:63",
            "net17": "5e:c2:23:cb:5a:79",
            "net18": "ba:85:4d:e5:3e:4a",
            "net19": "42:f7:0c:9f:da:04",
            "net2": "3e:13:30:df:f6:b0",
            "net3": "92:89:d8:de:b7:15",
            "net4": "fa:96:e4:df:db:5a",
            "net5": "f2:29:e8:ea:ad:b9",
            "net6": "2e:35:e0:18:d6:3e",
            "net7": "5a:9a:c2:e4:c5:d2",
            "net8": "ba:4e:8b:59:60:76",
            "net9": "fe:a3:45:70:d9:62"
        },
        "spine_1_1_7": {
            "net0": "72:7e:95:dc:7a:a9",
            "net1": "7a:06:0b:51:30:35",
            "net10": "ba:ef:58:c2:3e:49",
            "net11": "26:73:21:b6:c5:b3",
            "net12": "ee:2b:3a:d3:73:da",
            "net13": "32:f7:be:4e:fc:f9",
            "net14": "da:d4:51:2d:02:2a",
            "net15": "c6:f1:24:38:41:be",
            "net16": "e2:85:eb:a2:39:ca",
            "net17": "9e:57:4e:78:54:03",
            "net18": "1e:91:db:0b:c8:b6",
            "net19": "e6:49:aa:d5:1f:9c",
            "net2": "f2:bb:61:82:c9:08",
            "net3": "72:67:df:9b:f7:2c",
            "net4": "76:60:81:97:91:53",
            "net5": "6a:09:8a:1d:e4:1e",
            "net6": "ee:e8:d9:29:85:34",
            "net7": "c2:21:c5:3e:10:4c",
            "net8": "b6:d3:c8:05:93:dc",
            "net9": "0e:09:9e:ec:a9:f3"
        },
        "spine_1_1_8": {
            "net0": "3e:09:98:cd:a1:d8",
            "net1": "9e:da:9e:1c:a9:a4",
            "net10": "6a:7a:6b:a9:77:74",
            "net11": "36:7d:c2:30:4a:8c",
            "net12": "da:c8:a2:dd:57:95",
            "net13": "d2:03:0a:ef:ae:54",
            "net14": "aa:63:ae:56:66:6b",
            "net15": "e6:4f:1c:37:98:35",
            "net16": "66:39:01:b2:22:00",
            "net17": "be:da:0a:a4:f4:50",
            "net18": "62:88:a2:8e:e2:84",
            "net19": "96:6c:f6:91:64:a1",
            "net2": "52:26:f4:dc:69:5d",
            "net3": "02:b2:f0:91:03:bc",
            "net4": "e6:9b:87:b7:28:e1",
            "net5": "5a:a5:99:3d:b7:5d",
            "net6": "fe:d1:da:8d:e0:73",
            "net7": "c6:8f:66:4d:ce:6f",
            "net8": "2a:cc:2c:92:c7:d2",
            "net9": "42:1e:9d:b0:16:0e"
        },
        "spine_1_1_9": {
            "net0": "e2:36:d0:6c:78:44",
            "net1": "9a:2d:b1:c5:bb:42",
            "net10": "da:bc:b4:b8:f8:08",
            "net11": "82:cd:4f:b0:21:01",
            "net12": "62:56:92:7f:79:0d",
            "net13": "12:f0:e5:dd:c5:cb",
            "net14": "d6:5c:dc:25:68:97",
            "net15": "46:1f:34:c3:6e:ab",
            "net16": "d6:a7:4d:ab:8e:b5",
            "net17": "ae:9c:04:5d:14:10",
            "net18": "aa:3d:6d:63:04:8d",
            "net19": "fe:8e:98:0b:2b:d0",
            "net2": "9e:b5:b8:f7:36:21",
            "net3": "a2:d5:cf:81:27:b5",
            "net4": "2a:e9:9b:96:a0:9d",
            "net5": "5e:a4:3b:e4:f6:e7",
            "net6": "b2:32:85:14:e9:65",
            "net7": "32:92:db:cb:eb:51",
            "net8": "5a:f6:57:42:29:78",
            "net9": "46:c6:85:86:ed:1d"
        },
        "spine_2_1_1": {
            "net0": "6a:34:cc:48:a6:36",
            "net1": "9a:49:1e:5b:f4:c1",
            "net10": "72:d5:ed:8a:63:a2",
            "net11": "de:15:dc:6c:42:2d",
            "net12": "8a:99:a7:ef:ed:0a",
            "net13": "62:df:f5:5c:b6:6f",
            "net14": "1a:58:38:0a:b3:e0",
            "net15": "52:41:04:5f:97:15",
            "net16": "d2:ec:95:fd:24:55",
            "net17": "e2:2a:7c:62:2a:46",
            "net18": "7e:c4:4d:33:17:c4",
            "net19": "b2:63:bb:03:55:0a",
            "net2": "5e:5a:a7:20:f3:f0",
            "net3": "82:ab:c8:7f:ff:1d",
            "net4": "b6:75:a0:5e:80:94",
            "net5": "2a:e4:f6:e2:e0:a5",
            "net6": "76:bd:fd:8f:3d:76",
            "net7": "2a:73:de:87:2f:b7",
            "net8": "06:ea:ca:e2:de:89",
            "net9": "36:f9:92:3a:bc:0e"
        },
        "spine_2_1_10": {
            "net0": "8a:3d:b1:d1:43:c6",
            "net1": "12:f0:e5:b5:ff:4b",
            "net10": "ba:1c:fa:e6:23:4f",
            "net11": "e2:1f:73:45:a0:8f",
            "net12": "62:8a:00:ed:38:4f",
            "net13": "3e:ff:5a:37:3b:58",
            "net14": "56:1d:b8:4a:9b:c0",
            "net15": "1e:99:f1:a6:1a:82",
            "net16": "92:50:1a:19:3e:8d",
            "net17": "d2:bb:13:14:ea:6e",
            "net18": "f2:4d:bf:e3:4d:d1",
            "net19": "12:e4:73:0e:25:d3",
            "net2": "72:29:35:ab:b5:ef",
            "net3": "e6:2a:f9:43:aa:d9",
            "net4": "56:f8:c2:e0:c6:90",
            "net5": "fa:ec:2c:41:d4:db",
            "net6": "1e:38:8c:08:ff:f8",
            "net7": "c2:10:c4:ba:54:c7",
            "net8": "66:08:fe:a6:70:76",
            "net9": "02:4b:83:46:41:84"
        },
        "spine_2_1_2": {
            "net0": "f2:3a:3e:91:13:4d",
            "net1": "26:9d:f1:bf:1a:84",
            "net10": "ea:9b:c6:22:57:dc",
            "net11": "7a:be:9f:cd:b7:eb",
            "net12": "aa:bb:3e:8c:58:4a",
            "net13": "16:97:57:0d:e8:7e",
            "net14": "76:87:02:b4:80:03",
            "net15": "9a:c0:d2:94:99:c9",
            "net16": "8a:0d:a2:62:2d:53",
            "net17": "76:5f:1f:01:4a:56",
            "net18": "da:22:ed:f1:32:87",
            "net19": "2a:39:26:fe:e8:5c",
            "net2": "56:24:a4:c8:88:8e",
            "net3": "8a:cc:1c:7c:bc:e7",
            "net4": "de:b9:0b:93:03:12",
            "net5": "62:2f:6d:54:16:96",
            "net6": "da:7c:c1:df:21:be",
            "net7": "fa:2d:07:e7:0f:14",
            "net8": "6a:f7:6e:a4:5d:b0",
            "net9": "ae:e9:a5:d9:ba:41"
        },
        "spine_2_1_3": {
            "net0": "8e:6d:58:f1:b9:77",
            "net1": "1a:95:54:4c:07:1d",
            "net10": "7a:a2:a6:79:26:94",
            "net11": "ea:c1:a5:3a:6b:f8",
            "net12": "36:95:ab:11:73:28",
            "net13": "b2:f9:22:b9:72:18",
            "net14": "12:fc:fd:4d:c0:16",
            "net15": "42:31:fe:63:37:04",
            "net16": "0a:17:a0:41:cf:14",
            "net17": "f2:aa:a8:bb:7d:62",
            "net18": "ca:ba:6e:1b:50:61",
            "net19": "ea:ca:f1:75:8b:e9",
            "net2": "f2:41:a7:0f:dc:e6",
            "net3": "4a:ee:a3:11:36:bb",
            "net4": "de:3b:3c:33:a6:0d",
            "net5": "9e:7a:8f:2f:34:5c",
            "net6": "ba:d2:e7:6f:71:db",
            "net7": "de:c1:ea:e7:13:f0",
            "net8": "2a:ad:dc:de:66:08",
            "net9": "da:2f:f7:ce:eb:c2"
        },
        "spine_2_1_4": {
            "net0": "fe:57:35:bc:a6:90",
            "net1": "76:a9:12:75:06:34",
            "net10": "26:36:a2:d3:66:91",
            "net11": "ba:40:ee:4a:53:42",
            "net12": "5a:e1:c2:f3:a7:33",
            "net13": "c2:1e:73:6f:81:6e",
            "net14": "8e:32:f6:d2:21:34",
            "net15": "0e:f9:01:c5:5a:58",
            "net16": "1e:e9:76:1d:c0:ca",
            "net17": "1e:2b:cd:1c:6f:a0",
            "net18": "76:5a:9f:f9:07:92",
            "net19": "3e:f7:46:b0:b3:9a",
            "net2": "22:4a:b3:6e:a1:5c",
            "net3": "26:35:3b:41:43:34",
            "net4": "3a:ab:e8:d7:e3:b7",
            "net5": "2a:ee:0d:46:e8:e4",
            "net6": "da:c3:26:b9:d5:db",
            "net7": "be:ac:5e:02:d9:ca",
            "net8": "3a:5e:39:be:28:fe",
            "net9": "36:34:e2:f6:ba:6c"
        },
        "spine_2_1_5": {
            "net0": "92:04:61:fa:40:59",
            "net1": "3a:b3:fb:0a:0b:b5",
            "net10": "8a:26:2d:0e:de:27",
            "net11": "a6:58:50:30:dd:0f",
            "net12": "4a:33:95:fb:78:e2",
            "net13": "ba:83:4c:d0:07:ad",
            "net14": "2a:46:19:07:bd:e7",
            "net15": "56:d5:98:c6:35:7a",
            "net16": "66:20:63:95:70:3e",
            "net17": "f2:d2:b9:9f:87:a6",
            "net18": "da:a8:61:cc:de:7f",
            "net19": "82:7b:a4:48:47:43",
            "net2": "7e:03:9a:3d:9e:f7",
            "net3": "ae:3c:b6:09:9f:9a",
            "net4": "86:71:80:36:58:eb",
            "net5": "4e:a7:47:33:30:07",
            "net6": "b2:78:11:52:10:04",
            "net7": "ce:d8:89:27:f8:64",
            "net8": "9e:28:60:f4:62:f9",
            "net9": "fa:21:61:bd:13:8c"
        },
        "spine_2_1_6": {
            "net0": "12:6c:b7:c8:4f:a4",
            "net1": "32:cc:ce:6c:2c:bd",
            "net10": "4e:3a:0c:ce:1c:13",
            "net11": "52:61:86:ca:16:b6",
            "net12": "9a:7f:09:0d:55:b4",
            "net13": "b6:c8:cf:0b:95:a6",
            "net14": "4e:64:85:b3:37:4b",
            "net15": "4a:87:8a:6b:3d:7d",
            "net16": "1a:93:3a:ba:b2:f7",
            "net17": "56:d1:bb:10:3d:c8",
            "net18": "f6:9f:94:84:8f:4b",
            "net19": "ee:1d:ca:a3:02:66",
            "net2": "f2:5a:9a:c0:1c:48",
            "net3": "a2:bb:7a:17:1b:a3",
            "net4": "1e:f0:ac:af:d6:2e",
            "net5": "86:fb:08:17:90:ac",
            "net6": "9a:e7:a1:e3:56:2e",
            "net7": "6a:aa:db:6b:ee:ef",
            "net8": "ea:75:f0:3b:fe:b4",
            "net9": "d2:ad:fb:86:40:96"
        },
        "spine_2_1_7": {
            "net0": "0a:22:4e:15:e5:85",
            "net1": "3e:75:66:f9:c8:e9",
            "net10": "1e:9c:7b:76:73:a1",
            "net11": "c6:9b:4a:1f:0b:b1",
            "net12": "3a:21:fb:0e:e3:49",
            "net13": "5e:db:99:20:c5:a9",
            "net14": "8a:f6:d1:41:79:bd",
            "net15": "4a:f5:f6:91:99:49",
            "net16": "a2:ea:c7:6f:8c:6c",
            "net17": "6a:2c:0a:75:41:2c",
            "net18": "4a:fc:52:f2:26:b4",
            "net19": "56:0f:bf:53:b6:2c",
            "net2": "ce:c0:54:33:5f:2f",
            "net3": "da:6a:d3:ff:0a:11",
            "net4": "2e:24:1b:5d:21:54",
            "net5": "ce:fe:a6:b9:3a:2a",
            "net6": "c6:ab:80:65:17:63",
            "net7": "3e:e1:1e:d3:e7:91",
            "net8": "76:05:42:2d:57:29",
            "net9": "16:21:5b:d1:cf:0d"
        },
        "spine_2_1_8": {
            "net0": "b2:a5:c6:f4:36:c3",
            "net1": "36:c6:e4:bb:93:6c",
            "net10": "e2:cc:07:de:a9:cc",
            "net11": "f2:c1:8c:94:6e:99",
            "net12": "02:07:63:c3:a2:e8",
            "net13": "ae:74:c4:a5:26:68",
            "net14": "ca:4b:ad:91:02:06",
            "net15": "ca:cd:8f:3c:ad:37",
            "net16": "9a:81:df:83:29:d0",
            "net17": "5a:28:a3:cf:73:5b",
            "net18": "76:3c:16:76:a2:ba",
            "net19": "ca:81:cb:73:80:78",
            "net2": "32:49:d4:03:42:31",
            "net3": "8e:0e:28:d9:3f:02",
            "net4": "1a:84:02:94:e2:85",
            "net5": "de:da:be:3c:b8:98",
            "net6": "fa:64:7c:5e:3e:dc",
            "net7": "22:0d:5b:b6:89:39",
            "net8": "e6:80:8a:38:7e:aa",
            "net9": "ce:65:60:52:b3:f9"
        },
        "spine_2_1_9": {
            "net0": "96:87:09:29:0f:e2",
            "net1": "e6:0c:53:3c:e4:ec",
            "net10": "02:94:b7:08:d6:08",
            "net11": "06:83:e1:b4:88:df",
            "net12": "aa:35:65:3f:24:b7",
            "net13": "86:71:00:01:9e:c2",
            "net14": "ca:0b:2c:13:0f:ea",
            "net15": "26:73:51:3e:ad:db",
            "net16": "2e:f6:47:01:fd:9c",
            "net17": "0e:5f:9f:2c:00:7e",
            "net18": "02:f3:55:95:87:83",
            "net19": "76:66:9a:ea:75:ad",
            "net2": "66:56:28:45:fe:ad",
            "net3": "ca:df:5b:7d:12:02",
            "net4": "c2:27:49:8e:dd:30",
            "net5": "ea:b8:cd:55:94:d2",
            "net6": "02:4d:d4:cb:5e:15",
            "net7": "de:c7:55:e6:6b:69",
            "net8": "9e:70:53:71:b9:e3",
            "net9": "0a:84:86:97:4c:0b"
        },
        "spine_3_1_1": {
            "net0": "6e:44:de:6e:e1:8e",
            "net1": "8a:04:4e:35:58:53",
            "net10": "da:9c:c2:c3:db:6e",
            "net11": "b6:a0:36:33:56:a4",
            "net12": "8a:4d:a1:d3:3a:3b",
            "net13": "c6:ac:b4:03:c4:8c",
            "net14": "1a:19:cf:2b:ee:be",
            "net15": "3e:c0:3c:af:f9:7f",
            "net16": "d6:ae:bc:da:56:8b",
            "net17": "c2:3c:bd:50:0d:38",
            "net18": "92:0d:88:82:6f:5e",
            "net19": "d2:a6:e3:58:de:e9",
            "net2": "32:66:98:99:d5:ce",
            "net3": "2e:1f:6d:f6:69:09",
            "net4": "42:f4:da:d1:65:61",
            "net5": "c2:a1:8a:05:11:e3",
            "net6": "b6:0f:c9:77:dd:f5",
            "net7": "6e:a5:03:45:5f:d8",
            "net8": "e6:c8:fb:a1:3d:f6",
            "net9": "02:05:46:28:3f:d9"
        },
        "spine_3_1_10": {
            "net0": "ba:e7:23:f4:49:e7",
            "net1": "d2:59:48:13:a5:a8",
            "net10": "b6:ac:b6:0f:d6:b7",
            "net11": "42:75:f5:56:db:bb",
            "net12": "1e:dc:34:ae:e8:b6",
            "net13": "f2:8c:03:40:6d:a7",
            "net14": "ba:a0:1c:fe:01:f4",
            "net15": "5e:82:38:30:2b:39",
            "net16": "92:3a:30:5b:a9:e0",
            "net17": "02:53:d9:0c:f8:29",
            "net18": "2a:ce:19:f3:e7:e0",
            "net19": "b6:fd:cf:52:3f:2c",
            "net2": "ee:ae:a2:f0:67:c3",
            "net3": "92:58:7f:c6:7d:5a",
            "net4": "76:82:d4:46:79:a3",
            "net5": "8e:90:ca:59:10:39",
            "net6": "c6:0e:dc:fd:3b:09",
            "net7": "42:64:7a:b5:86:46",
            "net8": "a6:b5:eb:64:98:21",
            "net9": "96:12:d9:05:05:85"
        },
        "spine_3_1_2": {
            "net0": "4a:a1:82:e4:48:18",
            "net1": "06:c4:93:b9:2a:1b",
            "net10": "66:98:28:a0:fc:d9",
            "net11": "7a:8c:78:52:42:68",
            "net12": "32:a1:18:66:17:36",
            "net13": "b6:38:f5:3b:10:33",
            "net14": "7e:8f:a4:cb:fd:a5",
            "net15": "f2:92:3f:69:2c:08",
            "net16": "aa:50:a2:74:0d:53",
            "net17": "8a:2a:4b:9a:b8:b3",
            "net18": "92:41:c7:55:30:a0",
            "net19": "5a:dd:77:2e:c2:9e",
            "net2": "d6:e0:42:4b:19:4e",
            "net3": "ee:1a:8d:b6:6b:d7",
            "net4": "ae:22:7a:23:b1:df",
            "net5": "7e:78:ac:f7:26:c4",
            "net6": "16:21:8a:86:ab:3f",
            "net7": "2e:9f:e7:7b:79:bf",
            "net8": "de:45:0f:32:12:35",
            "net9": "42:8c:85:50:af:69"
        },
        "spine_3_1_3": {
            "net0": "02:8b:6e:7a:58:ee",
            "net1": "9e:fe:4f:35:0c:bd",
            "net10": "e6:d9:66:36:b7:b7",
            "net11": "8e:89:fe:2d:67:07",
            "net12": "e6:70:9b:d1:7c:2f",
            "net13": "c2:c6:78:d9:87:2a",
            "net14": "de:ed:49:a9:bc:d5",
            "net15": "c6:4c:38:57:2f:ca",
            "net16": "9e:84:94:7b:2f:d8",
            "net17": "a2:d7:ff:73:19:2a",
            "net18": "aa:99:8c:5c:e7:6d",
            "net19": "d6:4f:9a:36:35:fd",
            "net2": "b6:d2:92:bd:48:6b",
            "net3": "5e:f5:fb:a7:52:eb",
            "net4": "6a:5b:a5:8a:3d:f6",
            "net5": "2e:06:ef:ed:9f:20",
            "net6": "ae:ab:eb:53:65:71",
            "net7": "fa:71:ee:a1:0f:ff",
            "net8": "ce:3c:e1:cb:12:76",
            "net9": "1e:0f:fa:4a:4c:fc"
        },
        "spine_3_1_4": {
            "net0": "fa:5f:e6:0a:86:a7",
            "net1": "96:51:fe:90:43:98",
            "net10": "8e:79:eb:1f:a0:d1",
            "net11": "7a:e7:07:c9:3f:76",
            "net12": "0e:9c:d7:e3:95:60",
            "net13": "be:21:3c:b3:43:a2",
            "net14": "4e:73:02:8e:f3:1e",
            "net15": "26:bc:c8:79:0b:d3",
            "net16": "da:ca:b1:7e:6f:68",
            "net17": "86:05:26:0b:92:cb",
            "net18": "02:f4:87:a9:ee:68",
            "net19": "62:4c:56:18:8d:ad",
            "net2": "b6:af:36:e1:81:4a",
            "net3": "2e:87:dd:d8:80:68",
            "net4": "76:1d:65:66:b8:5f",
            "net5": "1e:ed:71:4c:9e:fb",
            "net6": "32:15:9b:c3:b7:ff",
            "net7": "9e:1c:9d:75:b0:5e",
            "net8": "ce:29:1c:69:44:16",
            "net9": "f2:10:9e:5d:8a:55"
        },
        "spine_3_1_5": {
            "net0": "1a:32:3d:5d:3c:e3",
            "net1": "46:d9:1a:c7:46:aa",
            "net10": "ee:74:65:87:2a:95",
            "net11": "6a:b1:f1:c2:2f:bd",
            "net12": "e6:5d:7a:c0:22:2b",
            "net13": "5a:7f:4d:a0:a4:27",
            "net14": "36:81:e4:cf:c3:8b",
            "net15": "f6:c5:e5:ef:c3:1f",
            "net16": "e2:be:30:04:95:4a",
            "net17": "c6:7b:49:64:31:e8",
            "net18": "16:e0:0d:2f:b8:c3",
            "net19": "5e:3e:ec:07:6d:2f",
            "net2": "26:a0:eb:e0:9d:3e",
            "net3": "aa:13:89:96:41:81",
            "net4": "1a:92:fd:de:77:ac",
            "net5": "fa:25:69:e0:58:55",
            "net6": "ae:c7:ab:c1:f7:1d",
            "net7": "c2:f8:b7:fb:1b:2f",
            "net8": "82:6f:f2:1b:1f:a8",
            "net9": "4e:b1:dd:d7:71:bc"
        },
        "spine_3_1_6": {
            "net0": "d6:8e:96:e7:02:4a",
            "net1": "52:72:5b:51:60:f7",
            "net10": "2a:3f:d0:6c:de:c5",
            "net11": "02:54:a0:60:4a:35",
            "net12": "6e:3b:e5:8d:25:84",
            "net13": "32:c8:f7:01:a8:79",
            "net14": "1e:13:ae:3d:73:8a",
            "net15": "f6:16:8d:3d:9a:4d",
            "net16": "7e:a0:03:2c:fa:91",
            "net17": "a6:44:34:cc:4f:fa",
            "net18": "1a:39:26:c5:3b:2d",
            "net19": "9e:15:05:e1:41:cb",
            "net2": "2e:21:70:87:a6:10",
            "net3": "fe:57:dc:0b:2a:df",
            "net4": "1a:0b:4d:2c:b5:bd",
            "net5": "96:49:54:51:aa:23",
            "net6": "22:4e:c3:c3:52:e0",
            "net7": "2a:30:f5:a9:60:01",
            "net8": "12:6c:b8:17:05:0b",
            "net9": "aa:b9:43:70:84:25"
        },
        "spine_3_1_7": {
            "net0": "2a:13:71:41:5c:6e",
            "net1": "7e:e1:7d:e2:cf:76",
            "net10": "fe:0c:7a:f9:31:61",
            "net11": "06:a6:e8:7f:d6:8b",
            "net12": "ea:29:66:bd:1d:d3",
            "net13": "ea:f3:62:96:38:41",
            "net14": "36:ee:9d:eb:bc:91",
            "net15": "c6:c1:eb:e0:d7:c3",
            "net16": "9e:2a:c0:01:2d:8d",
            "net17": "86:50:13:6c:d6:6e",
            "net18": "12:7a:39:d7:6f:de",
            "net19": "b6:c4:ca:8c:38:5e",
            "net2": "ce:eb:f8:0c:5a:84",
            "net3": "8e:0b:27:26:e7:d9",
            "net4": "72:cf:f7:46:0f:b2",
            "net5": "0a:0a:54:d1:36:af",
            "net6": "ae:6a:2f:58:14:ff",
            "net7": "72:39:92:12:15:08",
            "net8": "1e:db:73:58:f2:d8",
            "net9": "9a:d9:55:ad:a6:ed"
        },
        "spine_3_1_8": {
            "net0": "de:9c:bc:27:a0:d7",
            "net1": "62:a1:fa:89:a9:80",
            "net10": "9e:67:ac:00:37:db",
            "net11": "aa:be:d7:51:d8:a3",
            "net12": "1a:4e:be:a1:8d:a9",
            "net13": "9a:f6:a5:14:9a:1b",
            "net14": "4a:58:6d:32:b6:d3",
            "net15": "52:85:7f:b5:bb:4f",
            "net16": "56:56:cb:2e:c6:9e",
            "net17": "42:76:07:29:db:76",
            "net18": "be:a7:25:ae:71:af",
            "net19": "4e:89:83:a8:29:b3",
            "net2": "36:e0:b6:52:35:de",
            "net3": "9a:09:05:fd:23:04",
            "net4": "8e:80:71:1c:43:74",
            "net5": "2e:43:94:3a:8b:40",
            "net6": "a6:dc:0b:15:e7:9a",
            "net7": "4e:53:9c:01:16:f1",
            "net8": "8a:3a:ec:2b:be:8c",
            "net9": "9a:6a:79:68:90:08"
        },
        "spine_3_1_9": {
            "net0": "de:39:6f:3f:67:98",
            "net1": "1a:22:52:cf:ee:73",
            "net10": "2a:52:06:c5:c1:d8",
            "net11": "0e:ac:16:73:6b:c2",
            "net12": "b2:7d:a4:dc:92:d4",
            "net13": "3e:46:e2:48:a9:19",
            "net14": "c2:99:87:5e:f4:c9",
            "net15": "7e:35:d5:65:d5:ee",
            "net16": "46:0e:dc:ba:4b:f5",
            "net17": "5e:b4:31:c8:e9:ed",
            "net18": "aa:d9:b0:33:ab:6d",
            "net19": "16:db:b7:80:cb:fb",
            "net2": "8a:7a:82:3e:e0:cc",
            "net3": "6e:91:28:87:f9:7a",
            "net4": "0a:7b:d9:32:c2:7a",
            "net5": "7e:63:a9:be:da:a8",
            "net6": "ee:c4:0e:c0:b1:5c",
            "net7": "a6:62:4a:bf:dc:3c",
            "net8": "a6:27:03:45:85:91",
            "net9": "22:15:d8:c9:95:42"
        },
        "spine_4_1_1": {
            "net0": "36:a7:1b:ef:3b:43",
            "net1": "3a:d2:a2:1b:04:e2",
            "net10": "c2:2a:76:57:c5:cd",
            "net11": "7e:4c:cb:4e:f1:e9",
            "net12": "76:80:7f:3e:a3:22",
            "net13": "fa:37:c5:e2:cc:22",
            "net14": "16:e4:1a:07:bb:12",
            "net15": "7e:1e:e0:99:fb:8b",
            "net16": "d2:21:cc:ff:54:f5",
            "net17": "e2:7c:fe:b9:87:b8",
            "net18": "96:f8:a6:ef:fe:9f",
            "net19": "ee:ee:9c:d6:6a:18",
            "net2": "d2:59:78:b1:6b:e6",
            "net3": "06:a1:7b:af:0f:2e",
            "net4": "12:3d:b0:d5:80:a8",
            "net5": "46:01:12:86:e1:32",
            "net6": "72:84:df:5d:5c:14",
            "net7": "b2:50:2e:93:8a:4e",
            "net8": "06:47:10:f7:b8:a3",
            "net9": "02:5a:a8:bb:49:6a"
        },
        "spine_4_1_10": {
            "net0": "be:e4:6b:91:a2:bd",
            "net1": "42:c8:48:e6:9e:0d",
            "net10": "f6:d9:ac:e3:8c:dc",
            "net11": "b6:96:e0:ab:a9:07",
            "net12": "1a:22:b3:3a:e2:a2",
            "net13": "9e:c0:d8:4f:84:93",
            "net14": "66:d9:a1:89:c6:d4",
            "net15": "96:48:00:13:13:66",
            "net16": "de:35:12:cc:d2:ca",
            "net17": "2e:39:63:a9:a6:65",
            "net18": "b6:44:7b:59:e0:45",
            "net19": "82:31:da:a6:c0:b8",
            "net2": "ae:e3:ef:d7:e2:d5",
            "net3": "0a:83:7a:f8:72:a9",
            "net4": "72:83:01:6e:b4:cf",
            "net5": "d2:d4:f8:bf:10:80",
            "net6": "6e:b6:2a:31:4c:63",
            "net7": "6a:2c:81:f2:55:07",
            "net8": "3a:ec:cd:8b:ff:0e",
            "net9": "ae:06:b9:31:7f:1b"
        },
        "spine_4_1_2": {
            "net0": "d2:92:18:e8:8a:90",
            "net1": "42:36:86:a5:2e:12",
            "net10": "1a:9e:7e:b4:e0:82",
            "net11": "c6:0c:40:41:8c:e0",
            "net12": "62:db:ea:f3:23:9f",
            "net13": "1e:b2:51:b9:35:ea",
            "net14": "4a:da:54:2f:a6:46",
            "net15": "ee:7a:ca:e4:4e:14",
            "net16": "22:6e:14:10:0d:88",
            "net17": "ca:7f:e1:78:2c:98",
            "net18": "ae:66:a8:d6:ce:3b",
            "net19": "aa:e7:c8:06:7f:54",
            "net2": "1e:bc:bb:7d:7c:53",
            "net3": "b2:2a:72:6d:a7:92",
            "net4": "4e:c6:fa:86:b5:2b",
            "net5": "d2:fb:07:79:51:54",
            "net6": "b2:f6:07:56:18:d9",
            "net7": "0e:05:0e:43:39:58",
            "net8": "be:e3:c3:65:fa:d8",
            "net9": "a6:e7:23:67:22:4c"
        },
        "spine_4_1_3": {
            "net0": "aa:1f:de:a0:68:d9",
            "net1": "96:72:36:1a:f3:5c",
            "net10": "7e:84:ec:db:29:b2",
            "net11": "f2:f5:97:e5:10:ed",
            "net12": "0a:4b:7b:3d:dd:5e",
            "net13": "d6:e4:b6:89:2d:02",
            "net14": "32:00:40:ec:71:23",
            "net15": "ce:4a:d4:ef:d4:03",
            "net16": "12:06:9f:b5:e7:57",
            "net17": "0e:4a:08:31:02:fd",
            "net18": "0e:9a:a9:46:bc:19",
            "net19": "3a:33:05:9f:54:f2",
            "net2": "f2:c2:dd:9e:40:00",
            "net3": "3a:75:eb:50:ff:e7",
            "net4": "6a:55:20:75:cf:14",
            "net5": "12:a3:b9:6a:94:0c",
            "net6": "d6:06:fc:3e:95:6b",
            "net7": "32:29:40:05:a7:31",
            "net8": "ae:e4:bd:51:b1:bb",
            "net9": "72:db:f0:5e:fe:43"
        },
        "spine_4_1_4": {
            "net0": "da:20:1d:cb:1a:12",
            "net1": "96:45:8e:53:e4:91",
            "net10": "6a:bd:a6:24:e1:77",
            "net11": "be:b5:7a:ce:a1:aa",
            "net12": "da:29:60:73:52:d0",
            "net13": "5a:52:c7:9e:ff:57",
            "net14": "2e:2f:8f:ac:95:1b",
            "net15": "86:2e:12:5e:d9:10",
            "net16": "f6:eb:db:5d:7c:a4",
            "net17": "d6:2f:9d:3f:36:d3",
            "net18": "56:9d:81:b5:4e:49",
            "net19": "36:0a:17:1a:4d:cc",
            "net2": "b6:5e:26:c6:52:1f",
            "net3": "5a:03:57:19:3a:65",
            "net4": "86:e0:03:c0:95:e8",
            "net5": "02:9b:30:ec:f8:a3",
            "net6": "da:eb:f1:ef:65:3c",
            "net7": "de:ee:aa:5e:35:17",
            "net8": "6e:29:7b:e4:1f:c7",
            "net9": "46:0c:53:ca:02:40"
        },
        "spine_4_1_5": {
            "net0": "e2:3e:58:e5:f4:e8",
            "net1": "7e:be:6a:4d:94:6c",
            "net10": "b6:fa:31:7d:2b:8d",
            "net11": "1e:30:41:ae:f9:93",
            "net12": "3e:eb:a4:c8:f4:d8",
            "net13": "96:87:ca:46:db:35",
            "net14": "4e:de:82:6f:36:0f",
            "net15": "72:e1:3c:21:84:12",
            "net16": "c6:14:51:53:b2:b3",
            "net17": "72:e5:25:d5:95:c1",
            "net18": "96:a0:5e:1e:41:75",
            "net19": "d2:5b:42:16:e2:b7",
            "net2": "c6:77:89:e6:51:30",
            "net3": "0a:1d:28:f8:93:48",
            "net4": "8a:de:19:0f:38:7e",
            "net5": "ae:b4:a0:6e:de:6b",
            "net6": "3a:e9:b5:58:d0:6e",
            "net7": "d2:97:c1:1f:45:c9",
            "net8": "2e:41:ad:c9:62:8f",
            "net9": "8e:e7:8f:b3:9e:19"
        },
        "spine_4_1_6": {
            "net0": "ea:3b:0e:39:8e:51",
            "net1": "5e:ab:2d:1c:5d:19",
            "net10": "c6:a4:d4:b5:1b:b2",
            "net11": "ba:60:d2:1a:56:6e",
            "net12": "ba:69:17:8d:85:b2",
            "net13": "26:32:97:65:a9:6c",
            "net14": "da:a3:df:c1:0d:10",
            "net15": "ce:2a:89:5d:de:31",
            "net16": "de:5c:02:da:1e:1b",
            "net17": "4a:53:1e:c4:d7:41",
            "net18": "be:53:c0:c3:89:ac",
            "net19": "42:14:16:43:24:c3",
            "net2": "5a:48:24:05:3c:e9",
            "net3": "4e:ae:b2:70:30:57",
            "net4": "a6:09:91:41:8d:dc",
            "net5": "76:36:35:a0:45:8f",
            "net6": "22:24:fc:29:43:84",
            "net7": "16:24:c6:21:8c:16",
            "net8": "e2:a2:29:71:7a:01",
            "net9": "56:38:3c:ed:47:ce"
        },
        "spine_4_1_7": {
            "net0": "6a:a1:66:11:bb:a2",
            "net1": "22:70:68:eb:5b:c8",
            "net10": "fe:06:07:9e:63:43",
            "net11": "42:aa:67:ff:69:94",
            "net12": "e2:ea:72:3e:e7:8c",
            "net13": "16:7a:a0:f6:72:75",
            "net14": "76:b3:a1:82:ec:5c",
            "net15": "ba:ac:77:71:e6:c7",
            "net16": "f2:95:48:de:d4:74",
            "net17": "2e:0b:c3:88:50:f2",
            "net18": "1e:04:7a:67:57:8e",
            "net19": "42:c0:08:22:f8:4f",
            "net2": "f2:59:7a:b1:27:58",
            "net3": "c6:64:cd:d5:01:0b",
            "net4": "26:60:55:41:77:1d",
            "net5": "46:7b:9e:36:ec:0e",
            "net6": "c2:da:65:40:e8:bc",
            "net7": "be:42:46:3c:5c:06",
            "net8": "a2:ce:27:4c:36:c5",
            "net9": "fe:15:c0:94:58:cb"
        },
        "spine_4_1_8": {
            "net0": "5a:fc:df:55:71:b1",
            "net1": "fa:4c:7f:53:23:13",
            "net10": "56:b1:e2:7b:a6:4c",
            "net11": "ea:84:f8:a8:fa:88",
            "net12": "c6:8d:4d:b3:23:fa",
            "net13": "36:48:3d:b3:4e:5d",
            "net14": "aa:1e:2b:72:9c:3e",
            "net15": "9a:92:4c:24:e8:c8",
            "net16": "da:60:32:21:24:36",
            "net17": "be:07:a8:97:02:85",
            "net18": "6a:1f:17:03:32:14",
            "net19": "de:ca:ab:78:67:e1",
            "net2": "d6:83:22:6e:0d:0f",
            "net3": "b2:77:2c:92:09:63",
            "net4": "02:ff:be:83:bb:02",
            "net5": "d6:21:cd:d2:d5:54",
            "net6": "76:8c:ea:a1:0c:0d",
            "net7": "06:97:4a:dc:e6:3b",
            "net8": "de:2a:c8:37:05:a4",
            "net9": "3e:e2:59:42:63:55"
        },
        "spine_4_1_9": {
            "net0": "4a:a0:38:48:a9:1b",
            "net1": "4e:b5:c8:32:f9:33",
            "net10": "7a:01:58:81:9b:6e",
            "net11": "7e:57:c8:10:09:51",
            "net12": "26:6a:20:df:29:f3",
            "net13": "2e:8e:95:6c:a2:7c",
            "net14": "1e:ed:e0:b5:27:b5",
            "net15": "62:e9:cb:9d:16:8c",
            "net16": "3a:e7:21:c4:28:b4",
            "net17": "02:b0:21:b7:5d:6e",
            "net18": "e2:39:33:59:38:fd",
            "net19": "ae:24:5b:e1:08:06",
            "net2": "b2:c1:e0:65:4a:95",
            "net3": "6a:fa:1b:ca:06:77",
            "net4": "02:d3:55:ab:e8:f2",
            "net5": "9e:6b:52:0a:d4:c3",
            "net6": "da:dd:f8:46:ac:41",
            "net7": "d2:b3:ee:c2:64:64",
            "net8": "22:a4:77:37:5b:78",
            "net9": "1e:64:41:82:46:05"
        },
        "tof_1_2_1": {
            "net0": "0a:64:15:3e:b2:1d",
            "net1": "8e:83:72:86:97:55",
            "net10": "02:fc:b9:12:e4:ca",
            "net11": "aa:02:d6:0c:af:49",
            "net12": "26:77:ce:16:6f:86",
            "net13": "46:64:69:e9:d4:08",
            "net14": "62:da:9b:99:a2:ec",
            "net15": "5a:73:63:b3:e3:d6",
            "net16": "0a:8a:90:56:86:5d",
            "net17": "4a:33:b9:b1:18:f0",
            "net18": "72:1b:f4:39:6c:18",
            "net19": "fa:c1:51:3b:c3:9e",
            "net2": "26:7b:6f:d9:5b:ff",
            "net3": "c6:44:2a:04:ac:60",
            "net4": "2e:04:82:73:28:b0",
            "net5": "9e:f1:6e:88:34:c2",
            "net6": "72:eb:a0:41:1e:83",
            "net7": "82:83:06:83:62:d7",
            "net8": "4e:b5:e7:e2:84:dc",
            "net9": "ce:99:1d:b4:fe:ee"
        },
        "tof_1_2_10": {
            "net0": "26:c7:c8:c1:1e:5b",
            "net1": "d2:2d:e8:c1:3d:27",
            "net10": "3a:12:93:19:af:04",
            "net11": "3e:43:64:ea:d5:3a",
            "net12": "4a:ed:e1:42:d1:01",
            "net13": "ca:8d:91:bf:56:c1",
            "net14": "da:b7:29:e2:50:7a",
            "net15": "16:40:94:ff:4c:99",
            "net16": "1e:d0:cf:c0:36:d9",
            "net17": "6e:74:45:46:23:9e",
            "net18": "ae:f9:7e:00:0f:5a",
            "net19": "36:92:cd:61:5f:73",
            "net2": "ce:3d:09:33:77:f0",
            "net3": "8a:05:cc:f1:4f:a8",
            "net4": "2a:3b:74:83:22:f5",
            "net5": "46:19:57:da:7a:7e",
            "net6": "6e:fd:64:8f:11:7a",
            "net7": "3a:35:45:45:da:ab",
            "net8": "0e:20:bd:5b:c4:9d",
            "net9": "ae:f1:9b:8b:14:bc"
        },
        "tof_1_2_2": {
            "net0": "fa:64:99:38:c6:7c",
            "net1": "ea:05:d4:51:4c:2a",
            "net10": "ca:12:55:49:93:6a",
            "net11": "3a:28:ef:f9:9d:e4",
            "net12": "ee:70:68:b6:a4:bb",
            "net13": "32:97:44:74:7e:27",
            "net14": "86:1f:81:b8:d4:26",
            "net15": "2a:fa:6d:fd:8b:1b",
            "net16": "36:aa:cd:f8:cd:c6",
            "net17": "42:8e:b6:5d:1b:a7",
            "net18": "6a:14:13:3f:b4:2d",
            "net19": "86:4f:f7:4a:3b:d6",
            "net2": "2e:07:7e:e8:4d:3c",
            "net3": "9e:2b:ed:db:65:0b",
            "net4": "1e:c6:07:6e:c3:ba",
            "net5": "ce:3b:0a:cd:75:a5",
            "net6": "f6:18:b2:44:16:5a",
            "net7": "ce:af:7f:df:ce:5d",
            "net8": "f2:0b:d6:40:9f:8d",
            "net9": "9a:95:23:82:41:47"
        },
        "tof_1_2_3": {
            "net0": "1a:c9:64:4d:5c:ef",
            "net1": "5e:8c:d7:14:36:35",
            "net10": "52:34:18:b8:45:2a",
            "net11": "96:63:66:93:f6:b5",
            "net12": "56:a0:4a:17:52:f8",
            "net13": "e2:c9:d3:e0:64:83",
            "net14": "92:57:97:9c:9a:f0",
            "net15": "ae:89:50:d2:18:e6",
            "net16": "22:4a:21:67:0b:29",
            "net17": "de:a3:34:50:02:ed",
            "net18": "8e:9d:29:f9:b5:7e",
            "net19": "a6:7c:dc:83:a9:67",
            "net2": "0e:04:db:cd:ba:5f",
            "net3": "5e:24:5b:16:96:44",
            "net4": "ee:52:01:51:3c:d3",
            "net5": "8e:af:51:e7:11:cf",
            "net6": "be:bd:ec:54:c8:30",
            "net7": "a2:7d:ba:c6:ac:7d",
            "net8": "a2:04:1e:22:49:c6",
            "net9": "e2:a5:16:7a:78:40"
        },
        "tof_1_2_4": {
            "net0": "fa:88:cb:d8:ec:04",
            "net1": "6e:a7:cd:f3:5c:df",
            "net10": "d2:7a:8a:97:00:04",
            "net11": "ca:ff:92:5a:9a:fa",
            "net12": "de:c4:bc:67:75:2b",
            "net13": "ba:36:62:f2:6f:92",
            "net14": "d2:d8:ba:de:8e:2f",
            "net15": "0e:60:7d:2b:aa:11",
            "net16": "5a:22:f5:1b:1d:bb",
            "net17": "ae:f7:64:43:a9:c7",
            "net18": "5e:b1:86:14:25:64",
            "net19": "86:16:ab:9d:65:be",
            "net2": "6a:b7:14:fa:02:c0",
            "net3": "da:e2:bb:b8:6d:5d",
            "net4": "86:20:76:90:2b:a2",
            "net5": "46:bb:5c:26:ed:d3",
            "net6": "be:f6:0b:6e:c0:97",
            "net7": "be:16:22:58:95:f3",
            "net8": "d2:78:c8:51:47:4d",
            "net9": "82:dc:5f:08:a9:26"
        },
        "tof_1_2_5": {
            "net0": "76:79:d8:58:6b:61",
            "net1": "d2:a5:b6:6a:cc:81",
            "net10": "1e:35:b4:57:1b:28",
            "net11": "66:42:d7:94:0e:71",
            "net12": "0a:16:14:52:ff:0a",
            "net13": "86:0d:fd:a3:b9:df",
            "net14": "4a:0a:58:44:38:5d",
            "net15": "fa:9c:31:de:cb:d3",
            "net16": "16:83:43:24:aa:9e",
            "net17": "b6:77:50:81:3b:1d",
            "net18": "ba:8a:61:4e:8b:f4",
            "net19": "d2:a0:fa:75:9f:5c",
            "net2": "12:45:d8:15:3d:de",
            "net3": "4e:60:7c:48:9f:8e",
            "net4": "86:46:b3:bb:ce:0d",
            "net5": "0e:3b:15:e0:6e:57",
            "net6": "de:91:6c:95:0d:ef",
            "net7": "a2:e4:20:63:e2:56",
            "net8": "96:77:ee:01:74:c6",
            "net9": "0a:df:4f:9b:76:93"
        },
        "tof_1_2_6": {
            "net0": "6e:dc:c5:3b:07:d9",
            "net1": "92:ae:27:c4:bb:53",
            "net10": "e2:98:1d:ee:4b:96",
            "net11": "66:1d:d8:07:d6:1a",
            "net12": "02:95:a5:06:20:c6",
            "net13": "16:42:c1:8a:75:87",
            "net14": "b6:3c:ad:16:b8:d1",
            "net15": "96:6a:70:21:c1:a4",
            "net16": "a6:fa:98:6b:b4:5d",
            "net17": "b2:73:02:5b:89:a5",
            "net18": "62:0c:26:1a:ec:9d",
            "net19": "b6:e9:86:f6:b2:e2",
            "net2": "e6:7c:45:c1:1c:50",
            "net3": "62:30:05:68:64:83",
            "net4": "de:5c:06:0a:91:61",
            "net5": "1a:ef:f2:ae:13:d1",
            "net6": "86:06:af:29:f3:27",
            "net7": "02:15:b9:6d:d4:0f",
            "net8": "6e:53:33:93:20:e9",
            "net9": "ca:56:95:fd:36:2f"
        },
        "tof_1_2_7": {
            "net0": "3a:a9:b7:37:73:5c",
            "net1": "a6:3d:0f:08:c8:d4",
            "net10": "62:20:d5:65:31:a8",
            "net11": "1a:8e:de:0f:ea:da",
            "net12": "c6:a1:72:f3:aa:cd",
            "net13": "16:fe:af:c0:4b:81",
            "net14": "b2:f8:df:82:4d:16",
            "net15": "26:0b:12:a7:71:0d",
            "net16": "32:8c:0c:a4:5d:38",
            "net17": "22:97:0c:01:b6:37",
            "net18": "de:5f:96:e5:8a:59",
            "net19": "b2:99:36:d5:99:65",
            "net2": "9e:cc:d6:6d:a6:fa",
            "net3": "1a:4f:b2:9e:a9:e9",
            "net4": "b6:eb:d0:c6:00:7a",
            "net5": "5e:df:d2:31:24:01",
            "net6": "12:d9:17:f9:93:23",
            "net7": "92:e0:9e:40:d5:5d",
            "net8": "e6:56:0c:c0:2a:37",
            "net9": "f2:2e:25:d9:a3:33"
        },
        "tof_1_2_8": {
            "net0": "ee:53:96:de:e1:d8",
            "net1": "86:94:19:9e:97:f8",
            "net10": "de:b2:15:cb:3c:fb",
            "net11": "fe:ad:f1:ff:75:c9",
            "net12": "ea:ca:a2:e8:79:7d",
            "net13": "5a:87:be:9d:7f:e4",
            "net14": "6e:14:e2:a5:86:64",
            "net15": "3e:e3:56:1a:2a:35",
            "net16": "96:a6:b5:66:11:3c",
            "net17": "f6:05:8e:53:1f:25",
            "net18": "92:11:46:5e:43:20",
            "net19": "e2:23:cf:02:da:b8",
            "net2": "ba:b1:d0:58:77:b0",
            "net3": "22:7a:32:32:83:63",
            "net4": "6e:ac:c1:b7:2a:a2",
            "net5": "92:8b:49:dd:2a:87",
            "net6": "d6:0e:24:14:2a:8c",
            "net7": "0a:d6:9d:6a:0b:6a",
            "net8": "d6:63:48:2b:62:ae",
            "net9": "82:60:4c:3f:66:0c"
        },
        "tof_1_2_9": {
            "net0": "ae:46:8e:74:d4:f5",
            "net1": "2a:6c:14:ea:d4:ff",
            "net10": "7e:05:c9:6c:ae:e0",
            "net11": "ba:8d:1c:27:b3:16",
            "net12": "26:be:37:8d:83:f0",
            "net13": "3a:75:f9:d6:44:b8",
            "net14": "9e:b6:44:bc:33:e8",
            "net15": "86:b4:34:fb:38:b5",
            "net16": "d2:cc:0a:b3:fa:20",
            "net17": "52:e4:02:fb:77:94",
            "net18": "ee:0f:38:62:17:76",
            "net19": "e6:e2:b7:25:42:cf",
            "net2": "b2:3a:77:cd:0d:9e",
            "net3": "72:11:d3:a7:0d:6f",
            "net4": "1e:6c:bb:e1:fd:cb",
            "net5": "c2:f6:2e:74:71:4e",
            "net6": "9a:f9:dc:77:fb:3d",
            "net7": "a2:c5:09:63:88:fa",
            "net8": "aa:18:1a:64:22:68",
            "net9": "22:d6:4d:d3:e9:84"
        },
        "tof_2_2_1": {
            "net0": "02:3c:72:94:6e:c3",
            "net1": "22:e1:4e:75:b7:0f",
            "net10": "9a:f4:ea:fd:5e:23",
            "net11": "46:65:00:ed:1d:eb",
            "net12": "e6:e2:94:73:4b:ce",
            "net13": "7a:58:0a:82:47:27",
            "net14": "ce:2e:12:3f:56:61",
            "net15": "7a:3d:b9:42:f0:71",
            "net16": "f2:2a:09:67:33:76",
            "net17": "26:81:6c:8f:fe:a8",
            "net18": "62:67:e8:f3:22:e9",
            "net19": "46:f3:6e:95:55:fc",
            "net2": "ee:7e:f9:9a:db:51",
            "net3": "f2:f2:2a:f8:11:51",
            "net4": "ce:36:ec:df:18:6c",
            "net5": "aa:40:2a:e9:5c:3c",
            "net6": "36:8c:7a:c6:dd:a6",
            "net7": "7a:c9:97:73:81:d1",
            "net8": "f6:0c:54:a9:40:99",
            "net9": "82:c2:02:71:e1:7f"
        },
        "tof_2_2_10": {
            "net0": "42:65:e4:73:9e:5c",
            "net1": "6a:57:15:63:69:bb",
            "net10": "82:38:2f:e4:e2:e3",
            "net11": "42:35:c8:b7:25:71",
            "net12": "ca:bc:3b:2d:8c:83",
            "net13": "62:ad:7d:82:72:50",
            "net14": "be:ab:21:9b:97:cd",
            "net15": "8e:79:23:8d:74:33",
            "net16": "2a:40:64:0d:98:d7",
            "net17": "ee:fc:b3:72:e2:2e",
            "net18": "ea:89:72:4a:92:03",
            "net19": "ae:8f:5f:24:ef:bb",
            "net2": "0a:84:74:59:5e:c2",
            "net3": "66:b1:93:ea:d8:82",
            "net4": "ba:f9:54:6e:7e:63",
            "net5": "9e:25:b9:8f:0d:e0",
            "net6": "56:8d:9a:37:78:e4",
            "net7": "d2:01:89:01:87:b6",
            "net8": "92:96:37:c9:27:53",
            "net9": "72:4d:bd:c8:a5:57"
        },
        "tof_2_2_2": {
            "net0": "0a:8d:f1:66:d1:9e",
            "net1": "36:6a:71:c7:36:3d",
            "net10": "ce:75:5f:ee:2c:38",
            "net11": "9e:96:29:7d:14:e5",
            "net12": "86:2f:df:4f:3c:44",
            "net13": "5a:5b:b8:26:1c:6e",
            "net14": "96:ee:54:1e:1d:62",
            "net15": "e6:5c:9e:c9:48:eb",
            "net16": "0a:a8:17:25:c1:99",
            "net17": "8a:14:dd:4d:23:e4",
            "net18": "4a:e4:2f:c8:9b:c3",
            "net19": "12:a9:f4:b3:55:d4",
            "net2": "8a:97:fc:65:5f:0e",
            "net3": "46:d4:6a:71:9b:f3",
            "net4": "b6:da:63:69:63:ac",
            "net5": "2e:f6:32:d8:f1:6b",
            "net6": "fa:71:2e:cf:44:b7",
            "net7": "12:ae:3d:11:68:14",
            "net8": "42:8b:da:cf:b7:40",
            "net9": "26:14:f4:1e:9a:8b"
        },
        "tof_2_2_3": {
            "net0": "06:75:76:ea:a6:b5",
            "net1": "ba:0a:30:6c:dc:61",
            "net10": "8e:35:73:29:22:ec",
            "net11": "32:bd:7c:fa:fb:c8",
            "net12": "42:ee:5f:11:0b:fb",
            "net13": "f6:13:81:40:54:cc",
            "net14": "a6:5d:e5:03:70:a9",
            "net15": "66:75:79:e0:08:b8",
            "net16": "46:4d:59:d7:3e:38",
            "net17": "06:0b:0c:37:46:4d",
            "net18": "3e:76:0e:c6:4c:7a",
            "net19": "5a:67:ce:8f:02:73",
            "net2": "de:ba:30:93:1f:25",
            "net3": "3a:b5:53:8f:0c:0c",
            "net4": "36:49:77:35:bc:f4",
            "net5": "9a:65:2b:97:0e:a8",
            "net6": "d6:87:b2:1b:a8:d0",
            "net7": "be:58:06:d3:6f:11",
            "net8": "42:80:36:9d:3a:70",
            "net9": "e2:d2:14:d1:38:40"
        },
        "tof_2_2_4": {
            "net0": "2a:e5:9c:e4:4a:87",
            "net1": "3a:a5:90:d3:0d:d8",
            "net10": "36:70:45:8b:5b:06",
            "net11": "6a:8b:0b:6b:0f:b0",
            "net12": "aa:0a:4a:da:05:6a",
            "net13": "2e:08:7a:66:da:84",
            "net14": "3e:d3:9f:92:92:06",
            "net15": "46:6e:f5:7d:ed:79",
            "net16": "4a:11:89:89:62:82",
            "net17": "c6:50:0e:75:72:7e",
            "net18": "16:ab:99:ad:8f:a9",
            "net19": "5e:da:e7:53:92:3e",
            "net2": "5e:b7:b5:4b:be:87",
            "net3": "2a:46:a9:2b:84:19",
            "net4": "2e:a3:36:d5:54:b5",
            "net5": "d2:9a:b8:ca:9f:27",
            "net6": "e6:8f:c3:87:d1:6e",
            "net7": "4a:ac:e7:a5:05:cd",
            "net8": "fa:84:0c:cb:22:e3",
            "net9": "2e:2c:6e:7a:5f:23"
        },
        "tof_2_2_5": {
            "net0": "3a:52:36:9a:0b:b6",
            "net1": "fa:a6:ff:18:fe:c9",
            "net10": "96:a0:2b:fe:93:4f",
            "net11": "9a:7a:d5:09:c7:53",
            "net12": "ae:37:1d:03:11:ff",
            "net13": "d6:75:38:8f:e6:01",
            "net14": "66:d3:47:24:43:05",
            "net15": "26:8c:95:f1:16:72",
            "net16": "02:ed:4a:c2:64:3f",
            "net17": "de:b9:43:5e:ea:78",
            "net18": "ee:8b:24:a3:80:4e",
            "net19": "06:c5:b2:a4:8d:c8",
            "net2": "6a:b1:3e:f7:26:29",
            "net3": "2a:18:68:52:ad:7f",
            "net4": "4e:25:da:af:29:e9",
            "net5": "aa:da:4b:96:64:5d",
            "net6": "ba:cb:ae:19:d8:3d",
            "net7": "32:63:03:25:b3:91",
            "net8": "aa:92:cb:7d:59:e0",
            "net9": "92:2e:f6:76:35:ea"
        },
        "tof_2_2_6": {
            "net0": "7e:97:40:3c:50:7f",
            "net1": "5e:63:eb:a7:49:b2",
            "net10": "c6:1c:be:2d:b5:1c",
            "net11": "6a:c9:0c:ae:7e:57",
            "net12": "2e:0f:40:53:c4:2a",
            "net13": "b6:8b:d7:71:2e:f7",
            "net14": "ba:d4:eb:6a:7c:da",
            "net15": "fe:8d:a0:bc:54:10",
            "net16": "a6:ac:f5:74:c3:8e",
            "net17": "aa:57:05:6f:15:7f",
            "net18": "be:81:2a:9e:9c:ff",
            "net19": "d6:22:2a:4c:ff:69",
            "net2": "7e:1e:06:fb:37:96",
            "net3": "06:e4:37:93:9b:af",
            "net4": "76:97:d5:1b:fb:85",
            "net5": "22:da:c0:73:58:5f",
            "net6": "c2:22:d5:80:31:a2",
            "net7": "66:8a:d9:fb:7c:d5",
            "net8": "52:14:c3:d1:63:32",
            "net9": "ae:eb:42:7e:da:c8"
        },
        "tof_2_2_7": {
            "net0": "62:1d:7d:6a:68:af",
            "net1": "c6:9a:ef:60:b6:5c",
            "net10": "e6:e2:e4:47:21:ca",
            "net11": "2e:d2:f4:63:9a:99",
            "net12": "86:a0:33:00:fc:ef",
            "net13": "5e:17:09:77:ef:e6",
            "net14": "32:e5:62:99:d8:5c",
            "net15": "a2:3e:bb:2c:3e:92",
            "net16": "b6:5b:fd:b3:a5:fb",
            "net17": "f6:e7:f2:31:58:4c",
            "net18": "ca:be:31:13:cb:f7",
            "net19": "56:62:7b:40:e6:7c",
            "net2": "2a:b7:9c:51:eb:52",
            "net3": "ca:54:09:04:3f:27",
            "net4": "32:7b:d3:3c:cb:c8",
            "net5": "f6:e9:14:58:2e:73",
            "net6": "66:48:64:d4:18:8a",
            "net7": "fe:2c:44:95:e7:5b",
            "net8": "52:a3:47:fd:33:23",
            "net9": "f6:39:8a:6d:df:0a"
        },
        "tof_2_2_8": {
            "net0": "9e:e3:53:53:c7:f6",
            "net1": "72:d2:99:51:54:67",
            "net10": "02:13:ba:39:ed:b5",
            "net11": "fa:da:71:c2:45:de",
            "net12": "ea:50:84:4b:7c:7c",
            "net13": "06:b5:36:fc:cd:95",
            "net14": "ba:42:86:2e:37:d8",
            "net15": "6e:f7:4b:e0:d3:2f",
            "net16": "0e:f4:dd:8f:11:93",
            "net17": "56:f5:3c:36:1c:cb",
            "net18": "96:14:66:c2:79:89",
            "net19": "ae:b6:91:96:ea:ef",
            "net2": "72:48:20:ac:1a:3e",
            "net3": "a2:40:85:49:02:2b",
            "net4": "0a:af:52:1e:0e:eb",
            "net5": "26:1b:5c:ae:ca:df",
            "net6": "16:8a:74:41:90:97",
            "net7": "9a:c3:2f:2f:00:2c",
            "net8": "6e:9b:72:79:e0:e0",
            "net9": "1a:d1:c6:fa:51:ec"
        },
        "tof_2_2_9": {
            "net0": "5e:ca:bb:9c:48:b4",
            "net1": "b2:ef:ba:d4:ca:48",
            "net10": "ae:b0:d1:0e:3b:ea",
            "net11": "ce:69:a4:18:f2:90",
            "net12": "8e:77:b5:ca:17:57",
            "net13": "d2:87:24:31:2f:f7",
            "net14": "be:50:e3:1e:86:f8",
            "net15": "92:f7:3a:19:39:26",
            "net16": "2a:f7:84:b4:a0:08",
            "net17": "7e:62:5e:e0:ad:3b",
            "net18": "ae:58:a4:98:79:58",
            "net19": "0a:5d:bb:39:66:49",
            "net2": "62:43:7a:d7:5e:a7",
            "net3": "a2:3d:63:b7:dc:f2",
            "net4": "fe:61:bb:2c:b9:87",
            "net5": "02:15:d8:87:d8:d9",
            "net6": "4a:e9:74:87:4a:d3",
            "net7": "7e:30:79:1e:42:35",
            "net8": "16:8a:19:f8:db:cc",
            "net9": "26:0e:c5:fc:9e:22"
        }
    },
    "failed_machine": "spine_1_1_1",
    "failure_time": {
        "leaf_1_0_1": 1634918456.601908,
        "leaf_1_0_10": 1634918455.459875,
        "leaf_1_0_2": 1634918455.4722133,
        "leaf_1_0_3": 1634918455.484534,
        "leaf_1_0_4": 1634918455.4895954,
        "leaf_1_0_5": 1634918455.4959543,
        "leaf_1_0_6": 1634918455.503931,
        "leaf_1_0_7": 1634918455.5153358,
        "leaf_1_0_8": 1634918455.5254233,
        "leaf_1_0_9": 1634918455.5336967,
        "leaf_2_0_1": 1634918455.5552769,
        "leaf_2_0_10": 1634918455.5656462,
        "leaf_2_0_2": 1634918456.7354677,
        "leaf_2_0_3": 1634918455.4479308,
        "leaf_2_0_4": 1634918456.6160758,
        "leaf_2_0_5": 1634918455.4702342,
        "leaf_2_0_6": 1634918455.4887545,
        "leaf_2_0_7": 1634918455.494674,
        "leaf_2_0_8": 1634918455.5029278,
        "leaf_2_0_9": 1634918456.6734366,
        "leaf_3_0_1": 1634918455.523442,
        "leaf_3_0_10": 1634918455.5319605,
        "leaf_3_0_2": 1634918455.5521777,
        "leaf_3_0_3": 1634918455.5673811,
        "leaf_3_0_4": 1634918455.5828195,
        "leaf_3_0_5": 1634918455.5966237,
        "leaf_3_0_6": 1634918455.5892375,
        "leaf_3_0_7": 1634918455.599264,
        "leaf_3_0_8": 1634918455.6060839,
        "leaf_3_0_9": 1634918455.613912,
        "leaf_4_0_1": 1634918455.6252036,
        "leaf_4_0_10": 1634918456.7935326,
        "leaf_4_0_2": 1634918456.8034568,
        "leaf_4_0_3": 1634918455.659851,
        "leaf_4_0_4": 1634918455.667586,
        "leaf_4_0_5": 1634918455.6775968,
        "leaf_4_0_6": 1634918455.6891356,
        "leaf_4_0_7": 1634918455.6974595,
        "leaf_4_0_8": 1634918455.7055902,
        "leaf_4_0_9": 1634918455.6052365,
        "spine_1_1_1": 1634918455.6111789,
        "spine_1_1_10": 1634918455.6183896,
        "spine_1_1_2": 1634918455.6303198,
        "spine_1_1_3": 1634918455.6383512,
        "spine_1_1_4": 1634918455.653315,
        "spine_1_1_5": 1634918455.6632552,
        "spine_1_1_6": 1634918456.8277276,
        "spine_1_1_7": 1634918455.6804874,
        "spine_1_1_8": 1634918455.6891935,
        "spine_1_1_9": 1634918455.7011755,
        "spine_2_1_1": 1634918455.7088537,
        "spine_2_1_10": 1634918456.8771484,
        "spine_2_1_2": 1634918455.7225363,
        "spine_2_1_3": 1634918455.7322881,
        "spine_2_1_4": 1634918455.7386172,
        "spine_2_1_5": 1634918455.7521088,
        "spine_2_1_6": 1634918455.7649176,
        "spine_2_1_7": 1634918455.770346,
        "spine_2_1_8": 1634918455.7886734,
        "spine_2_1_9": 1634918455.8077588,
        "spine_3_1_1": 1634918455.8137493,
        "spine_3_1_10": 1634918455.8244705,
        "spine_3_1_2": 1634918455.838012,
        "spine_3_1_3": 1634918457.0066137,
        "spine_3_1_4": 1634918455.8583944,
        "spine_3_1_5": 1634918455.7297347,
        "spine_3_1_6": 1634918455.7411084,
        "spine_3_1_7": 1634918455.7576044,
        "spine_3_1_8": 1634918455.7710574,
        "spine_3_1_9": 1634918455.7879236,
        "spine_4_1_1": 1634918455.8046181,
        "spine_4_1_10": 1634918455.8148568,
        "spine_4_1_2": 1634918455.8253813,
        "spine_4_1_3": 1634918455.8399374,
        "spine_4_1_4": 1634918455.8498397,
        "spine_4_1_5": 1634918455.859828,
        "spine_4_1_6": 1634918455.872544,
        "spine_4_1_7": 1634918455.882903,
        "spine_4_1_8": 1634918455.8715777,
        "spine_4_1_9": 1634918455.882092,
        "tof_1_2_1": 1634918455.8875434,
        "tof_1_2_10": 1634918455.8935585,
        "tof_1_2_2": 1634918455.9080262,
        "tof_1_2_3": 1634918455.91885,
        "tof_1_2_4": 1634918455.927829,
        "tof_1_2_5": 1634918455.9388895,
        "tof_1_2_6": 1634918455.9486213,
        "tof_1_2_7": 1634918455.953436,
        "tof_1_2_8": 1634918455.9646554,
        "tof_1_2_9": 1634918457.1354997,
        "tof_2_2_1": 1634918455.9889753,
        "tof_2_2_10": 1634918455.889871,
        "tof_2_2_2": 1634918455.906081,
        "tof_2_2_3": 1634918455.915105,
        "tof_2_2_4": 1634918457.085052,
        "tof_2_2_5": 1634918455.9438066,
        "tof_2_2_6": 1634918455.9510562,
        "tof_2_2_7": 1634918455.9588184,
        "tof_2_2_8": 1634918455.9713001,
        "tof_2_2_9": 1634918457.139603
    }
}