{
    "description": "Scenario 3a: Leaf leaf_1_0_1 failure with BGP",
    "k_leaf": 6,
    "k_top": 6,
    "redundancy_factor": 6,
    "is_k8s": true,
    "machine_mac_addresses": {
        "leaf_1_0_1": {
            "net0": "66:39:bf:d9:d5:45",
            "net1": "32:2f:09:07:43:bf",
            "net2": "ca:a3:6c:95:e3:a7",
            "net3": "72:30:fc:4e:c9:00",
            "net4": "62:c8:83:a2:ae:1e",
            "net5": "ae:7e:0f:d7:88:9d",
            "net6": "5a:f2:fe:b0:33:00"
        },
        "leaf_1_0_2": {
            "net0": "fa:28:ee:c2:91:18",
            "net1": "a2:8d:6c:ad:48:cb",
            "net2": "5e:da:a0:1e:12:7e",
            "net3": "ce:89:3d:51:55:ce",
            "net4": "26:94:f9:fe:aa:a8",
            "net5": "ba:e3:0a:04:fa:af",
            "net6": "72:e4:f6:d6:c5:b6"
        },
        "leaf_1_0_3": {
            "net0": "d6:eb:cf:ba:b5:8b",
            "net1": "da:fa:11:2b:b1:da",
            "net2": "ca:8b:93:b9:a1:a1",
            "net3": "46:94:f7:0e:2e:da",
            "net4": "56:52:13:7a:7a:df",
            "net5": "ba:05:1a:db:0f:61",
            "net6": "a6:24:f7:63:f9:ec"
        },
        "leaf_1_0_4": {
            "net0": "ae:41:ca:51:e8:61",
            "net1": "ce:0f:c7:28:18:6b",
            "net2": "7e:95:1b:a9:ad:bc",
            "net3": "46:e1:86:60:80:63",
            "net4": "86:22:6b:08:64:96",
            "net5": "52:f2:8d:47:dc:96",
            "net6": "6e:74:03:ba:7a:e2"
        },
        "leaf_1_0_5": {
            "net0": "0e:a0:fc:4d:91:4c",
            "net1": "8a:6f:2f:cc:ee:94",
            "net2": "42:d5:fb:2b:1e:bd",
            "net3": "5a:db:8a:a8:02:d1",
            "net4": "f6:35:57:31:2b:3d",
            "net5": "0a:c3:3a:00:67:25",
            "net6": "82:bf:38:6c:29:ff"
        },
        "leaf_1_0_6": {
            "net0": "16:de:df:ed:ca:67",
            "net1": "2e:c5:85:20:67:9e",
            "net2": "62:52:37:e6:90:0a",
            "net3": "5e:cd:11:4c:13:0c",
            "net4": "5a:40:11:e7:ce:56",
            "net5": "e6:08:0d:d6:f2:fb",
            "net6": "d2:a1:e1:80:d3:d1"
        },
        "leaf_2_0_1": {
            "net0": "92:25:70:ec:1f:e6",
            "net1": "8e:2f:c5:f1:a1:8a",
            "net2": "f6:5a:2b:0e:aa:f7",
            "net3": "4a:57:59:8c:c8:9b",
            "net4": "8e:6a:a2:c7:8a:9b",
            "net5": "ea:bc:7e:bb:e4:97",
            "net6": "1a:0f:f9:c5:19:f1"
        },
        "leaf_2_0_2": {
            "net0": "e2:59:0d:60:e0:b2",
            "net1": "fa:33:ab:a0:3a:25",
            "net2": "82:6e:27:ef:e9:f8",
            "net3": "0e:13:8e:54:1e:bd",
            "net4": "0e:92:e6:6b:83:be",
            "net5": "b2:35:16:42:a8:8f",
            "net6": "76:34:ee:b3:19:2a"
        },
        "leaf_2_0_3": {
            "net0": "b2:4b:f2:bf:d0:52",
            "net1": "b6:14:d6:00:ff:6b",
            "net2": "5a:c1:1f:88:5b:72",
            "net3": "1a:f9:9a:2e:41:60",
            "net4": "b2:2c:a0:6e:22:f7",
            "net5": "d6:d9:d0:eb:b5:4d",
            "net6": "46:e0:2d:08:8e:77"
        },
        "leaf_2_0_4": {
            "net0": "d2:c5:f9:54:9e:34",
            "net1": "ce:26:b5:88:e2:29",
            "net2": "3e:9c:d4:bb:b6:d2",
            "net3": "5a:80:3a:ad:80:d2",
            "net4": "96:60:78:8a:56:0d",
            "net5": "16:ef:7e:f1:31:81",
            "net6": "f6:d1:36:65:72:54"
        },
        "leaf_2_0_5": {
            "net0": "96:5b:ec:e2:c1:f8",
            "net1": "aa:a4:2a:5e:b4:4c",
            "net2": "7e:f7:f3:02:f6:5b",
            "net3": "22:b3:db:b2:47:7e",
            "net4": "1a:f8:6c:12:fb:69",
            "net5": "96:45:ad:79:af:52",
            "net6": "2a:fc:0d:0d:2b:44"
        },
        "leaf_2_0_6": {
            "net0": "1a:22:35:a6:18:d1",
            "net1": "46:94:c2:5e:ef:dc",
            "net2": "7e:25:0e:7f:ea:f9",
            "net3": "5a:fe:a0:30:66:6f",
            "net4": "4a:93:09:ca:7b:5e",
            "net5": "22:f8:42:58:3b:ba",
            "net6": "da:71:74:f3:7d:ad"
        },
        "spine_1_1_1": {
            "net0": "d2:10:64:87:2b:59",
            "net1": "7a:ea:a6:dd:a2:9c",
            "net10": "7e:ca:71:f6:7d:8a",
            "net11": "1a:33:bc:d2:13:4f",
            "net2": "6e:5f:c2:72:64:f2",
            "net3": "ae:7f:34:ca:56:6b",
            "net4": "3a:2d:c1:e5:08:c1",
            "net5": "6e:96:5a:9e:79:02",
            "net6": "fe:38:3d:ca:62:fa",
            "net7": "f6:f5:4a:9b:d1:d5",
            "net8": "76:50:f8:b7:a9:53",
            "net9": "ba:c3:72:f3:01:0a"
        },
        "spine_1_1_2": {
            "net0": "42:11:76:72:c2:be",
            "net1": "ae:4f:1c:ef:39:b9",
            "net10": "9a:06:71:af:79:c1",
            "net11": "ae:94:3a:dd:dc:dd",
            "net2": "52:f9:5b:8d:53:65",
            "net3": "be:4c:90:8f:45:1c",
            "net4": "be:61:49:c9:9c:f4",
            "net5": "5a:bd:1d:0f:48:4d",
            "net6": "1a:23:7f:00:22:5e",
            "net7": "de:7b:8b:0e:83:76",
            "net8": "f6:6c:bb:ae:2d:33",
            "net9": "6e:f8:8f:31:46:b9"
        },
        "spine_1_1_3": {
            "net0": "72:a2:6e:4f:cb:9d",
            "net1": "da:34:d2:27:6c:a0",
            "net10": "f6:52:fe:66:52:79",
            "net11": "06:09:4f:11:fb:6b",
            "net2": "7e:2f:5a:35:49:fe",
            "net3": "aa:65:a6:47:55:da",
            "net4": "8e:30:a7:c1:88:6b",
            "net5": "a2:bf:29:60:7f:3b",
            "net6": "ba:08:b6:53:af:9c",
            "net7": "7a:2a:d3:5f:2d:dc",
            "net8": "ca:28:7a:e3:0b:b8",
            "net9": "fa:4b:9f:cd:de:4b"
        },
        "spine_1_1_4": {
            "net0": "82:20:b2:8e:99:18",
            "net1": "92:c5:4d:f5:43:71",
            "net10": "aa:17:be:b6:59:95",
            "net11": "4a:2e:b5:b5:28:ad",
            "net2": "fe:27:25:a6:3a:73",
            "net3": "1e:81:42:d7:24:3c",
            "net4": "12:8a:9b:43:51:4d",
            "net5": "aa:21:3c:27:38:3c",
            "net6": "12:26:b5:62:d4:33",
            "net7": "96:7e:f4:4d:e0:bf",
            "net8": "b6:6c:b7:58:e6:f0",
            "net9": "a6:67:44:9f:fb:a2"
        },
        "spine_1_1_5": {
            "net0": "56:c6:e5:06:2a:59",
            "net1": "3e:90:a7:af:03:b4",
            "net10": "52:89:fc:c9:57:59",
            "net11": "da:c4:b8:e5:ec:e8",
            "net2": "7e:49:a6:6f:03:bc",
            "net3": "ce:88:42:c8:d8:12",
            "net4": "d2:ef:4a:d9:0e:50",
            "net5": "7e:43:14:51:a8:17",
            "net6": "86:07:10:7a:b5:b6",
            "net7": "ba:16:ec:40:45:f3",
            "net8": "ca:f1:ee:e5:c6:9e",
            "net9": "ba:53:68:51:1d:a5"
        },
        "spine_1_1_6": {
            "net0": "9a:ef:c2:51:53:aa",
            "net1": "0a:ec:03:d6:85:ff",
            "net10": "06:8e:f6:40:bb:7d",
            "net11": "62:f1:59:ac:73:68",
            "net2": "92:32:c7:69:b5:99",
            "net3": "96:dc:71:18:54:a5",
            "net4": "9e:44:7b:45:14:cb",
            "net5": "1e:8b:52:87:a0:7a",
            "net6": "26:13:fe:72:6c:a2",
            "net7": "fa:9c:c8:24:cc:49",
            "net8": "f2:77:39:27:0e:e8",
            "net9": "be:04:46:99:8a:d4"
        },
        "spine_2_1_1": {
            "net0": "ee:75:e9:34:11:58",
            "net1": "0e:ef:2f:dd:83:5b",
            "net10": "7a:35:ac:d2:af:f8",
            "net11": "0e:ab:08:04:5c:f9",
            "net2": "86:5b:39:bd:a3:b5",
            "net3": "5e:16:c3:44:05:7a",
            "net4": "12:4d:e9:2f:3e:aa",
            "net5": "ae:ba:4a:88:e7:54",
            "net6": "96:dd:7a:05:c8:5f",
            "net7": "ce:45:25:e8:2e:93",
            "net8": "ee:78:71:9e:4d:dd",
            "net9": "42:c6:1f:66:a6:e2"
        },
        "spine_2_1_2": {
            "net0": "aa:3a:76:e6:d5:b8",
            "net1": "fa:6e:41:25:58:71",
            "net10": "26:dc:f1:16:4c:24",
            "net11": "32:53:40:12:9b:b6",
            "net2": "ea:f3:db:6f:05:3f",
            "net3": "2e:97:e4:f4:62:cd",
            "net4": "ca:c9:00:f0:63:23",
            "net5": "82:45:92:d7:ee:ab",
            "net6": "42:d9:5c:bb:65:15",
            "net7": "2a:a2:4f:64:27:a0",
            "net8": "8e:8b:10:8c:48:15",
            "net9": "fe:00:6b:34:2a:7c"
        },
        "spine_2_1_3": {
            "net0": "ae:32:d0:c8:f2:9b",
            "net1": "66:45:d1:b5:57:2c",
            "net10": "fa:5b:e7:d2:f9:26",
            "net11": "ce:41:39:f0:2d:1f",
            "net2": "26:a7:e0:90:9a:1a",
            "net3": "8e:34:ab:02:f4:f7",
            "net4": "ca:ff:46:83:74:a3",
            "net5": "2e:f8:4b:e5:cc:65",
            "net6": "9a:9f:bf:63:07:f7",
            "net7": "d2:eb:72:da:93:8e",
            "net8": "82:6d:2f:6d:22:27",
            "net9": "ba:a3:6f:7e:c9:54"
        },
        "spine_2_1_4": {
            "net0": "1e:85:cf:dd:2a:3b",
            "net1": "da:22:18:56:de:11",
            "net10": "b2:eb:89:31:26:c2",
            "net11": "ea:2f:34:bd:a3:fb",
            "net2": "1e:55:8d:08:02:da",
            "net3": "5a:6f:2c:3a:82:ed",
            "net4": "5a:be:18:03:82:69",
            "net5": "16:4e:27:94:da:c7",
            "net6": "5e:2f:71:ff:62:d9",
            "net7": "3e:14:d9:ec:8e:57",
            "net8": "da:93:d0:e0:16:84",
            "net9": "5e:e3:a8:0a:48:f2"
        },
        "spine_2_1_5": {
            "net0": "b6:7f:21:5f:38:f6",
            "net1": "96:89:79:ee:1e:2e",
            "net10": "96:ab:e6:c4:64:76",
            "net11": "1a:69:ef:96:17:05",
            "net2": "ae:69:2d:72:2f:b0",
            "net3": "2e:03:22:26:51:85",
            "net4": "2a:89:f5:f0:97:f3",
            "net5": "76:a0:d0:da:40:43",
            "net6": "8e:ff:42:49:43:03",
            "net7": "ba:be:e3:bf:75:6c",
            "net8": "1a:be:dd:91:02:38",
            "net9": "fe:00:37:ce:a1:39"
        },
        "spine_2_1_6": {
            "net0": "16:3f:c9:3a:21:c1",
            "net1": "0a:0c:aa:d4:24:8d",
            "net10": "da:fe:f6:92:02:8a",
            "net11": "7e:65:fa:d5:22:16",
            "net2": "c2:77:76:9b:50:c4",
            "net3": "1a:45:0f:6c:35:aa",
            "net4": "02:e0:cc:85:28:bc",
            "net5": "e6:50:77:03:63:ca",
            "net6": "0e:dd:8c:99:89:f5",
            "net7": "86:13:c7:75:d6:fc",
            "net8": "0e:92:fa:67:58:85",
            "net9": "5a:94:ba:5f:56:70"
        },
        "tof_1_2_1": {
            "net0": "92:82:cf:28:91:04",
            "net1": "42:bf:6b:ab:49:bc",
            "net10": "22:2b:fa:53:2f:10",
            "net11": "a6:5d:88:a2:87:68",
            "net2": "42:9a:f2:67:d0:72",
            "net3": "86:0c:65:a8:af:e5",
            "net4": "92:ab:76:8e:ff:9c",
            "net5": "0e:51:99:8b:c0:20",
            "net6": "3e:08:a7:75:6b:0c",
            "net7": "2a:cc:d8:32:81:89",
            "net8": "a6:e4:ea:17:20:73",
            "net9": "4a:f8:0f:dd:c6:d8"
        },
        "tof_1_2_2": {
            "net0": "12:9d:12:39:ce:85",
            "net1": "ca:fd:3c:29:4b:b0",
            "net10": "be:f7:1f:b6:7d:0d",
            "net11": "12:db:76:5d:df:27",
            "net2": "4a:ff:cf:60:d6:d6",
            "net3": "aa:93:f7:2e:5f:f5",
            "net4": "3e:d0:fe:8e:d9:ef",
            "net5": "a6:ae:a8:f9:52:e6",
            "net6": "76:c5:ab:85:78:9f",
            "net7": "b2:d8:d6:c0:48:78",
            "net8": "f6:8d:75:6d:32:78",
            "net9": "02:16:e4:d4:09:e9"
        },
        "tof_1_2_3": {
            "net0": "1e:4b:8b:b6:42:0e",
            "net1": "8e:f9:2f:9d:28:ef",
            "net10": "4a:98:83:f5:7c:f2",
            "net11": "f6:ac:7e:ed:16:9a",
            "net2": "ae:6e:6a:92:33:79",
            "net3": "6a:21:c2:a4:7b:63",
            "net4": "52:5f:11:94:04:32",
            "net5": "8a:e1:92:a6:12:7f",
            "net6": "12:05:57:65:b8:78",
            "net7": "be:84:aa:9f:e1:1f",
            "net8": "ea:66:ec:fc:58:b2",
            "net9": "9e:2e:5a:02:05:ad"
        },
        "tof_1_2_4": {
            "net0": "56:1e:f9:86:af:81",
            "net1": "7e:52:1f:98:de:57",
            "net10": "d6:b6:63:e8:93:7b",
            "net11": "9e:94:9a:65:98:27",
            "net2": "72:10:97:94:7e:ab",
            "net3": "22:31:1a:1b:c3:a1",
            "net4": "ba:ea:1c:84:ff:60",
            "net5": "9e:e1:76:1e:ab:f3",
            "net6": "ca:2a:17:8b:93:ba",
            "net7": "36:23:12:42:5c:7d",
            "net8": "8e:a5:1a:08:9e:51",
            "net9": "a2:b0:89:e9:e9:28"
        },
        "tof_1_2_5": {
            "net0": "ce:db:30:75:f2:3b",
            "net1": "b2:12:47:fb:b1:c5",
            "net10": "0e:4f:d7:ec:a0:b8",
            "net11": "46:9c:d4:f8:78:d3",
            "net2": "52:57:f8:62:52:42",
            "net3": "5a:d8:58:3d:3a:2a",
            "net4": "9e:0c:24:31:4b:e0",
            "net5": "16:3a:fc:5c:a9:10",
            "net6": "1e:8f:05:46:be:fd",
            "net7": "42:6d:56:29:0a:10",
            "net8": "ca:13:06:da:28:6f",
            "net9": "4a:f5:47:f9:12:91"
        },
        "tof_1_2_6": {
            "net0": "a6:bd:68:20:8e:7b",
            "net1": "5a:a0:c6:3a:67:ac",
            "net10": "96:34:ca:a3:cb:c4",
            "net11": "0e:6a:f5:31:9c:7a",
            "net2": "fe:e0:8e:6a:ec:dc",
            "net3": "e2:3c:18:a9:bc:7c",
            "net4": "26:e8:e0:35:d7:8c",
            "net5": "2e:11:35:d6:20:78",
            "net6": "96:96:a8:22:79:90",
            "net7": "86:aa:6c:91:4c:be",
            "net8": "ba:4d:0e:c5:50:28",
            "net9": "f2:07:b1:74:ed:93"
        }
    },
    "failed_machine": "leaf_1_0_1",
    "failure_time": 1613147411.8451297
}