{
    "description": "Scenario 3c: ToF tof_1_2_1 failure with BGP",
    "k_leaf": 6,
    "k_top": 6,
    "redundancy_factor": 2,
    "is_k8s": true,
    "machine_mac_addresses": {
        "leaf_1_0_1": {
            "net0": "2a:90:61:1c:79:d4",
            "net1": "a2:22:b9:9a:5f:5d",
            "net2": "56:18:20:c9:44:93",
            "net3": "b6:6d:e9:44:f7:dd",
            "net4": "3e:67:5d:68:9a:ae",
            "net5": "c6:03:3b:50:76:bf",
            "net6": "3a:b3:a0:f5:88:4e"
        },
        "leaf_1_0_2": {
            "net0": "2e:48:a7:85:71:59",
            "net1": "56:34:3d:1d:47:2e",
            "net2": "12:35:74:aa:9f:ba",
            "net3": "0a:dc:0d:88:b8:1b",
            "net4": "fe:39:25:3a:bc:8c",
            "net5": "c2:c9:9f:02:45:de",
            "net6": "da:8c:9a:60:5a:33"
        },
        "leaf_1_0_3": {
            "net0": "e2:45:2e:f4:f7:a3",
            "net1": "12:56:b6:cf:a7:60",
            "net2": "e6:ed:8f:c4:26:e9",
            "net3": "da:fa:10:79:d8:15",
            "net4": "fe:3c:61:50:e2:5f",
            "net5": "22:8c:2b:d1:6f:93",
            "net6": "86:cc:b6:87:42:a3"
        },
        "leaf_1_0_4": {
            "net0": "fe:95:8f:cb:cf:cd",
            "net1": "32:69:6a:b8:3d:c8",
            "net2": "be:71:01:46:a6:30",
            "net3": "1a:4d:9e:98:29:30",
            "net4": "8e:ce:a2:5d:7f:c3",
            "net5": "3e:b3:3a:ed:d2:7b",
            "net6": "6e:4a:45:0b:4c:4d"
        },
        "leaf_1_0_5": {
            "net0": "86:68:41:59:73:ed",
            "net1": "b6:3a:f2:33:cf:b7",
            "net2": "32:60:ca:bd:a4:bb",
            "net3": "4a:1b:2b:2c:cb:49",
            "net4": "12:de:53:ca:2d:77",
            "net5": "f2:f1:f9:f3:e3:df",
            "net6": "1e:81:db:30:8d:0b"
        },
        "leaf_1_0_6": {
            "net0": "1a:0c:ec:0c:ae:a0",
            "net1": "f6:f9:6a:c0:83:ee",
            "net2": "ce:24:76:ad:31:0d",
            "net3": "2a:29:c2:41:67:25",
            "net4": "a6:e2:4d:58:b9:17",
            "net5": "2a:02:d4:d0:59:25",
            "net6": "5e:86:bc:91:04:f7"
        },
        "leaf_2_0_1": {
            "net0": "0a:2a:4b:19:9d:09",
            "net1": "92:43:24:26:6d:1d",
            "net2": "7e:0f:fc:68:26:53",
            "net3": "66:7a:f1:a1:c1:cb",
            "net4": "be:a6:35:19:1a:26",
            "net5": "f6:7f:ec:d4:97:63",
            "net6": "5e:6d:4d:46:d7:94"
        },
        "leaf_2_0_2": {
            "net0": "66:02:b6:2f:92:05",
            "net1": "56:4c:4b:a9:cf:d7",
            "net2": "7e:c9:48:08:02:c6",
            "net3": "92:a7:69:6b:d0:67",
            "net4": "de:23:b6:aa:91:7d",
            "net5": "92:bf:4c:cf:e3:11",
            "net6": "26:b4:45:fb:81:32"
        },
        "leaf_2_0_3": {
            "net0": "da:dc:90:e0:4d:e9",
            "net1": "46:6a:40:03:fd:98",
            "net2": "12:0d:af:7a:41:00",
            "net3": "7e:99:2e:f6:0b:85",
            "net4": "6e:ac:55:8a:0a:95",
            "net5": "5a:d8:29:a9:41:e8",
            "net6": "26:1e:06:73:23:7e"
        },
        "leaf_2_0_4": {
            "net0": "a2:50:34:31:dc:e0",
            "net1": "5e:89:25:ae:16:82",
            "net2": "12:20:01:5a:b9:97",
            "net3": "8a:15:87:f9:13:dc",
            "net4": "82:05:ad:3b:fc:7f",
            "net5": "2a:89:31:5f:99:97",
            "net6": "fe:75:2d:77:5f:e4"
        },
        "leaf_2_0_5": {
            "net0": "36:0f:9f:98:c1:27",
            "net1": "ea:5a:62:a2:cf:48",
            "net2": "c6:5c:7d:ec:97:08",
            "net3": "be:58:d1:bd:fb:98",
            "net4": "86:12:9a:96:f6:21",
            "net5": "82:7a:c2:4a:2c:4d",
            "net6": "26:8c:c8:ce:36:e8"
        },
        "leaf_2_0_6": {
            "net0": "4a:5d:ec:5a:0e:8b",
            "net1": "32:5b:64:ac:d4:41",
            "net2": "5e:36:6f:c9:17:4a",
            "net3": "f6:27:94:20:31:51",
            "net4": "ce:b0:02:9f:ee:6c",
            "net5": "2a:ce:4b:e8:9f:ce",
            "net6": "ae:ab:5e:fd:de:31"
        },
        "leaf_3_0_1": {
            "net0": "ea:4f:8a:53:47:bc",
            "net1": "ca:79:99:12:07:6c",
            "net2": "12:63:64:bd:ce:8d",
            "net3": "92:47:c7:85:72:3c",
            "net4": "8a:e5:2c:4f:f6:85",
            "net5": "3e:0d:3e:1a:a7:eb",
            "net6": "ce:cc:43:08:90:fd"
        },
        "leaf_3_0_2": {
            "net0": "ca:c1:67:ed:c0:4b",
            "net1": "a6:2c:fd:c2:bc:d0",
            "net2": "ca:61:d2:71:6c:01",
            "net3": "5e:dc:6e:e2:78:e0",
            "net4": "9a:14:84:e9:ec:ed",
            "net5": "c2:67:e4:41:a6:af",
            "net6": "b6:ae:61:fc:08:e5"
        },
        "leaf_3_0_3": {
            "net0": "3e:6d:16:4d:7d:0f",
            "net1": "66:7e:78:62:d8:4a",
            "net2": "72:62:2c:02:a8:5f",
            "net3": "8e:b1:fe:8d:42:a6",
            "net4": "ea:8e:b2:52:c8:a2",
            "net5": "a6:39:ef:5e:d5:07",
            "net6": "7e:17:93:ff:7e:23"
        },
        "leaf_3_0_4": {
            "net0": "de:8c:df:a0:b2:6f",
            "net1": "e6:27:85:a8:46:d4",
            "net2": "f6:36:23:0c:ee:14",
            "net3": "b2:68:7c:c7:f0:c7",
            "net4": "1a:31:32:b9:d0:c6",
            "net5": "8a:75:c3:9d:1d:e1",
            "net6": "82:93:e7:d3:5f:cc"
        },
        "leaf_3_0_5": {
            "net0": "1a:af:11:e8:7c:6b",
            "net1": "ce:e8:c3:5a:9c:ec",
            "net2": "da:84:f4:f5:cc:bf",
            "net3": "0e:80:98:19:cb:2a",
            "net4": "0e:7c:2f:1d:47:7f",
            "net5": "d2:27:00:ff:f7:f0",
            "net6": "5e:2c:79:dd:35:35"
        },
        "leaf_3_0_6": {
            "net0": "06:4f:f6:69:9b:b2",
            "net1": "ba:9f:cd:92:55:a8",
            "net2": "c6:e4:0f:b2:2f:8a",
            "net3": "9e:e0:72:be:06:5f",
            "net4": "d6:88:26:80:6e:26",
            "net5": "d2:3b:37:81:f2:9e",
            "net6": "4e:52:9c:85:87:cb"
        },
        "leaf_4_0_1": {
            "net0": "32:8b:04:3b:c6:1b",
            "net1": "da:a3:1d:08:8a:20",
            "net2": "0e:34:dd:9b:3a:3f",
            "net3": "e6:69:2e:3d:60:b3",
            "net4": "8a:aa:da:1f:cd:c0",
            "net5": "be:31:12:a5:fa:9b",
            "net6": "ce:48:e4:ee:23:31"
        },
        "leaf_4_0_2": {
            "net0": "92:95:45:8b:ab:01",
            "net1": "66:74:9b:36:e8:48",
            "net2": "0e:2d:69:60:ac:77",
            "net3": "1e:90:e3:d1:ee:b7",
            "net4": "56:b9:35:1c:04:6f",
            "net5": "5a:29:4e:27:27:8a",
            "net6": "d2:28:9a:f5:eb:03"
        },
        "leaf_4_0_3": {
            "net0": "8a:01:f7:08:6e:98",
            "net1": "56:cf:a9:5e:c7:f0",
            "net2": "36:ab:da:81:44:34",
            "net3": "da:5c:08:4f:23:d5",
            "net4": "8e:ec:dd:63:aa:c2",
            "net5": "22:d0:bf:d6:e9:06",
            "net6": "4a:76:86:01:7d:9f"
        },
        "leaf_4_0_4": {
            "net0": "42:e6:3f:f3:bf:f1",
            "net1": "3a:0a:43:2f:32:85",
            "net2": "62:ba:9c:80:94:6b",
            "net3": "3a:bd:e3:81:8e:d0",
            "net4": "6a:66:71:e5:af:3e",
            "net5": "d2:22:bc:bc:30:8f",
            "net6": "66:a2:94:78:8d:9e"
        },
        "leaf_4_0_5": {
            "net0": "06:59:5d:42:78:83",
            "net1": "02:a6:a2:94:21:88",
            "net2": "72:2a:ec:d5:74:ec",
            "net3": "c6:d1:3f:c8:76:99",
            "net4": "de:4f:a3:25:77:22",
            "net5": "02:b0:b1:5b:6d:ca",
            "net6": "ba:3c:ff:e2:de:81"
        },
        "leaf_4_0_6": {
            "net0": "7a:c1:56:e0:11:c0",
            "net1": "aa:8c:d8:8d:77:6b",
            "net2": "96:09:4d:52:3d:9a",
            "net3": "ca:1f:fe:21:b3:df",
            "net4": "92:e2:21:d6:f6:e2",
            "net5": "aa:48:06:f4:16:f6",
            "net6": "6a:6d:1a:c2:03:71"
        },
        "leaf_5_0_1": {
            "net0": "3e:0c:f5:7c:99:53",
            "net1": "46:a0:47:c2:8b:e4",
            "net2": "3e:15:51:0f:96:e7",
            "net3": "92:97:2a:81:17:23",
            "net4": "52:71:7e:2c:39:5e",
            "net5": "ce:90:f8:25:69:21",
            "net6": "be:49:65:3c:39:83"
        },
        "leaf_5_0_2": {
            "net0": "1a:af:c9:31:91:c8",
            "net1": "de:c1:95:63:eb:d0",
            "net2": "ee:e3:2b:b0:c4:3a",
            "net3": "32:9b:6b:b7:dc:4a",
            "net4": "8a:f7:c7:64:67:fd",
            "net5": "26:98:16:e9:5e:17",
            "net6": "0e:c9:70:90:4b:cc"
        },
        "leaf_5_0_3": {
            "net0": "d6:0d:2d:1e:a6:b0",
            "net1": "0e:b7:3f:46:23:e6",
            "net2": "4a:3e:fd:9b:79:ad",
            "net3": "76:08:2f:8f:a8:e9",
            "net4": "f6:70:57:51:89:e8",
            "net5": "72:79:9f:46:35:a5",
            "net6": "f6:b4:9d:52:e8:10"
        },
        "leaf_5_0_4": {
            "net0": "72:e5:04:ab:c0:48",
            "net1": "06:85:35:40:c8:f9",
            "net2": "a2:db:b9:9a:7a:bd",
            "net3": "8a:c4:ae:3c:9c:01",
            "net4": "4a:e3:a0:b8:19:63",
            "net5": "4a:79:33:63:1c:1e",
            "net6": "06:c3:f6:0e:12:b9"
        },
        "leaf_5_0_5": {
            "net0": "be:7d:6a:6b:7a:b5",
            "net1": "ce:48:6c:17:cf:1a",
            "net2": "42:75:fc:4a:71:4a",
            "net3": "e6:eb:94:70:9c:76",
            "net4": "56:71:73:98:3e:5f",
            "net5": "aa:b5:2c:0d:3b:ec",
            "net6": "7a:9c:9d:d6:3a:57"
        },
        "leaf_5_0_6": {
            "net0": "72:3a:45:9f:d0:19",
            "net1": "12:de:59:f1:5f:90",
            "net2": "ce:2b:f4:6f:d0:42",
            "net3": "f2:4e:e5:9c:39:79",
            "net4": "2a:b5:b7:ff:f7:bf",
            "net5": "ce:7e:22:e4:78:b7",
            "net6": "be:74:57:bd:1d:64"
        },
        "leaf_6_0_1": {
            "net0": "72:49:90:90:61:be",
            "net1": "32:87:aa:0e:c4:11",
            "net2": "de:a7:a7:55:7b:45",
            "net3": "0a:cf:1c:f9:f6:9c",
            "net4": "32:76:8c:b6:e3:8f",
            "net5": "2a:3a:09:21:fe:67",
            "net6": "ea:53:ba:2d:a7:38"
        },
        "leaf_6_0_2": {
            "net0": "1e:05:b7:60:d4:eb",
            "net1": "46:71:d6:96:c3:04",
            "net2": "26:39:5a:3d:9e:0d",
            "net3": "7e:52:e5:14:2e:28",
            "net4": "a6:51:e9:78:00:26",
            "net5": "72:f9:fc:27:71:7f",
            "net6": "16:b4:6d:7a:3e:6f"
        },
        "leaf_6_0_3": {
            "net0": "3e:ce:32:7c:1c:4d",
            "net1": "32:0e:57:46:47:d8",
            "net2": "ea:38:66:50:11:55",
            "net3": "02:1a:12:46:7b:84",
            "net4": "02:0a:57:bc:b2:46",
            "net5": "76:69:55:ca:9a:7c",
            "net6": "92:f7:9d:20:37:44"
        },
        "leaf_6_0_4": {
            "net0": "5e:0f:e8:60:42:31",
            "net1": "8a:74:8c:64:c1:01",
            "net2": "f6:7b:0b:40:93:51",
            "net3": "e6:e3:c6:ad:c3:4a",
            "net4": "6a:b2:26:d4:5a:bc",
            "net5": "da:e6:81:24:07:5a",
            "net6": "f2:5d:9b:e7:0d:ab"
        },
        "leaf_6_0_5": {
            "net0": "7a:4d:b5:33:2f:41",
            "net1": "da:16:d9:36:81:b4",
            "net2": "0a:39:c7:a9:94:46",
            "net3": "ee:db:4a:5f:02:d3",
            "net4": "ee:ad:70:c5:85:60",
            "net5": "96:50:8f:3b:b2:bb",
            "net6": "0a:0c:f5:b0:ec:7e"
        },
        "leaf_6_0_6": {
            "net0": "f6:3b:29:49:02:d9",
            "net1": "1a:cb:4b:53:08:60",
            "net2": "56:e2:44:ef:cb:9b",
            "net3": "fa:a1:b0:93:cf:f5",
            "net4": "16:e6:d7:c5:91:7a",
            "net5": "c2:e8:ab:cc:48:16",
            "net6": "ae:4f:00:eb:73:79"
        },
        "spine_1_1_1": {
            "net0": "9e:82:50:c1:e0:5a",
            "net1": "36:2d:0f:13:1e:94",
            "net10": "3a:89:39:84:cc:3a",
            "net11": "4a:fc:81:00:e2:ac",
            "net2": "fa:96:37:95:76:31",
            "net3": "5a:bc:b5:33:0e:a4",
            "net4": "4e:b3:f4:6f:f2:c6",
            "net5": "72:bd:5a:5c:d5:f9",
            "net6": "02:a8:9d:a0:a0:cd",
            "net7": "02:21:af:51:94:7b",
            "net8": "f2:ca:72:4c:c4:4c",
            "net9": "4e:80:8a:b1:4a:43"
        },
        "spine_1_1_2": {
            "net0": "6a:1c:2e:8d:4c:05",
            "net1": "82:bb:2c:f5:85:2f",
            "net10": "3e:fb:e1:fa:7b:3a",
            "net11": "0e:0b:c6:49:a1:a8",
            "net2": "9e:68:15:18:ca:1b",
            "net3": "3a:5a:bb:4a:8e:df",
            "net4": "e6:b3:70:e2:5b:8b",
            "net5": "1e:ca:8f:2c:0e:c3",
            "net6": "d6:6a:83:20:0c:79",
            "net7": "6e:25:21:c4:10:94",
            "net8": "a2:85:ee:f5:01:51",
            "net9": "9e:b4:f8:3a:2e:34"
        },
        "spine_1_1_3": {
            "net0": "3a:3c:e9:6c:18:2b",
            "net1": "86:07:f1:42:d6:1e",
            "net10": "be:c5:5c:bf:63:7c",
            "net11": "06:20:ff:8e:f3:65",
            "net2": "a6:89:bb:dd:3e:a2",
            "net3": "76:75:b3:b2:cb:26",
            "net4": "ae:1b:db:5d:28:ac",
            "net5": "5a:b1:08:79:dc:58",
            "net6": "f6:35:c7:e7:e4:7a",
            "net7": "b2:3f:e5:2d:71:77",
            "net8": "1e:9c:17:bf:e1:72",
            "net9": "9e:ef:0d:51:02:13"
        },
        "spine_1_1_4": {
            "net0": "46:66:32:c2:1d:2f",
            "net1": "ca:9c:69:ea:fa:96",
            "net10": "22:c5:46:69:6e:73",
            "net11": "96:e4:7a:3f:47:1f",
            "net2": "82:6b:19:41:e9:9e",
            "net3": "82:7e:56:04:ce:9a",
            "net4": "e2:05:d4:0b:1b:a6",
            "net5": "ce:d9:af:22:d1:c1",
            "net6": "4a:da:01:2e:9d:f5",
            "net7": "8e:bb:0f:59:0d:1f",
            "net8": "e6:68:17:14:29:a4",
            "net9": "06:ec:79:ec:29:85"
        },
        "spine_1_1_5": {
            "net0": "92:21:c9:99:a8:58",
            "net1": "72:e5:6f:f2:57:4a",
            "net10": "e2:4c:1b:f8:5d:30",
            "net11": "86:83:17:fa:09:a0",
            "net2": "be:ef:33:0b:35:a8",
            "net3": "f2:77:ab:37:d3:5b",
            "net4": "d6:e3:ce:57:38:62",
            "net5": "82:90:1c:64:1b:05",
            "net6": "e6:25:dc:f0:ca:88",
            "net7": "9e:b9:91:cb:c3:65",
            "net8": "d2:ff:de:d9:03:47",
            "net9": "ee:be:1b:d9:fe:18"
        },
        "spine_1_1_6": {
            "net0": "aa:f1:10:cc:39:ef",
            "net1": "56:9c:81:4b:a8:aa",
            "net10": "be:d4:db:cb:b4:5f",
            "net11": "32:e5:d3:67:12:df",
            "net2": "0e:0f:df:53:92:20",
            "net3": "e2:d2:fc:69:81:a3",
            "net4": "c6:a1:2e:73:14:6e",
            "net5": "e6:80:2c:bc:d2:ad",
            "net6": "da:a4:4b:bb:b4:2c",
            "net7": "e2:96:bc:73:a6:54",
            "net8": "fe:8d:4c:7b:6e:5b",
            "net9": "de:22:d9:dc:e7:df"
        },
        "spine_2_1_1": {
            "net0": "0a:6b:5f:57:ee:11",
            "net1": "aa:ce:5d:38:51:2e",
            "net10": "5e:31:87:f2:fd:29",
            "net11": "02:ed:67:38:d8:62",
            "net2": "9a:7b:57:fe:f4:25",
            "net3": "de:90:44:8f:6e:14",
            "net4": "26:98:42:6c:cb:75",
            "net5": "4a:be:b4:e2:d3:d6",
            "net6": "da:89:80:33:83:e4",
            "net7": "42:27:2e:a3:93:ac",
            "net8": "02:27:68:4c:48:c4",
            "net9": "12:3d:58:36:71:78"
        },
        "spine_2_1_2": {
            "net0": "ba:a4:59:d7:b1:e2",
            "net1": "7a:b6:60:a8:5a:21",
            "net10": "f2:77:38:76:07:f7",
            "net11": "3e:b7:9c:5d:bb:6d",
            "net2": "a6:72:eb:62:d8:06",
            "net3": "9a:80:52:ac:74:35",
            "net4": "1e:3c:70:b1:98:b8",
            "net5": "fa:f0:71:97:9e:a4",
            "net6": "06:85:7b:a6:93:39",
            "net7": "ae:c3:d5:7b:d9:b3",
            "net8": "de:71:51:46:7c:2d",
            "net9": "9e:d4:bb:b3:ad:1e"
        },
        "spine_2_1_3": {
            "net0": "a6:a0:65:4d:47:0f",
            "net1": "96:da:4a:4e:87:91",
            "net10": "36:4f:24:59:ba:5a",
            "net11": "f6:b1:45:78:29:5e",
            "net2": "6a:1d:99:1f:c2:fe",
            "net3": "62:80:91:08:f3:ea",
            "net4": "16:47:da:06:56:d2",
            "net5": "5e:17:68:24:c6:8f",
            "net6": "3a:fb:87:29:ac:a1",
            "net7": "16:db:3d:1a:a7:81",
            "net8": "ca:c2:76:4e:65:2f",
            "net9": "1a:ea:58:c3:2c:59"
        },
        "spine_2_1_4": {
            "net0": "fe:ca:7d:41:0c:d0",
            "net1": "12:cb:d3:43:5e:6f",
            "net10": "de:0e:fa:f8:46:17",
            "net11": "b6:8b:56:ef:80:7f",
            "net2": "d6:a8:37:a6:84:71",
            "net3": "02:4b:b8:3d:2a:43",
            "net4": "d6:49:58:84:57:4b",
            "net5": "92:8e:b7:18:66:d2",
            "net6": "36:63:a8:af:48:8b",
            "net7": "56:f4:47:67:7e:be",
            "net8": "f6:7d:a8:19:c1:10",
            "net9": "82:26:6e:34:68:03"
        },
        "spine_2_1_5": {
            "net0": "f6:43:d0:ba:61:41",
            "net1": "66:e5:27:6c:98:63",
            "net10": "e2:87:96:e8:59:0b",
            "net11": "52:5d:75:b2:73:0b",
            "net2": "b6:d3:7d:60:f7:ec",
            "net3": "32:64:dc:58:c2:9e",
            "net4": "06:57:de:08:de:33",
            "net5": "82:27:aa:54:0c:2b",
            "net6": "46:44:80:53:db:e0",
            "net7": "f6:a5:09:76:9d:32",
            "net8": "42:f9:4b:ae:bc:df",
            "net9": "9e:72:01:ee:5e:dc"
        },
        "spine_2_1_6": {
            "net0": "42:fd:6f:c2:c2:7a",
            "net1": "b6:70:1c:94:15:07",
            "net10": "92:a8:96:3a:19:7c",
            "net11": "d6:d4:27:e0:96:38",
            "net2": "7a:f1:c9:52:01:bb",
            "net3": "7e:9a:16:68:93:1f",
            "net4": "7e:94:5a:14:45:8d",
            "net5": "b2:2e:f2:1a:54:d1",
            "net6": "6e:70:00:ec:ba:f2",
            "net7": "f2:4f:8d:84:af:82",
            "net8": "6a:c5:01:ab:fb:b4",
            "net9": "8a:d2:b1:65:bc:f4"
        },
        "spine_3_1_1": {
            "net0": "72:73:c3:f9:97:95",
            "net1": "96:3e:af:d8:f2:ac",
            "net10": "26:7d:a5:eb:2a:54",
            "net11": "02:53:b6:d5:e9:99",
            "net2": "72:ba:96:ed:9b:3f",
            "net3": "f6:07:4e:2c:b7:21",
            "net4": "ca:9a:62:33:66:b8",
            "net5": "fe:2e:f8:60:85:dc",
            "net6": "a2:9e:46:95:e9:3b",
            "net7": "52:ed:97:53:a7:e4",
            "net8": "d6:e2:6c:d3:e9:a4",
            "net9": "ca:7b:09:d2:67:1e"
        },
        "spine_3_1_2": {
            "net0": "4a:15:da:58:db:c1",
            "net1": "22:1a:39:73:e2:d2",
            "net10": "6a:c5:29:d8:34:6a",
            "net11": "1a:66:ae:ba:4f:65",
            "net2": "ea:53:5b:12:62:46",
            "net3": "3e:4a:96:5c:15:9f",
            "net4": "66:5f:f5:a6:db:2b",
            "net5": "8e:2f:d3:9d:83:a9",
            "net6": "fa:bd:0e:0d:c3:b3",
            "net7": "4a:76:03:dd:81:17",
            "net8": "c6:09:6f:92:f5:24",
            "net9": "4a:b5:26:74:d9:3d"
        },
        "spine_3_1_3": {
            "net0": "e6:df:8c:d4:9a:d9",
            "net1": "52:d5:d8:77:5f:05",
            "net10": "8e:70:96:b8:50:99",
            "net11": "8a:2d:b0:47:03:bb",
            "net2": "96:4f:f0:c9:d7:d2",
            "net3": "32:53:11:99:98:08",
            "net4": "92:99:d0:f3:1f:b4",
            "net5": "5a:99:e1:0b:2a:5f",
            "net6": "d6:20:20:1b:29:56",
            "net7": "02:b1:d5:a9:24:57",
            "net8": "82:d0:fa:7c:96:c3",
            "net9": "ba:69:0e:36:a2:74"
        },
        "spine_3_1_4": {
            "net0": "e6:d9:07:e6:e7:c9",
            "net1": "06:6d:77:db:b3:98",
            "net10": "32:b9:27:59:98:5c",
            "net11": "d2:b1:ff:c2:e8:4a",
            "net2": "da:22:d6:f5:4f:a0",
            "net3": "f2:27:35:18:90:98",
            "net4": "02:e1:c5:a2:f0:1d",
            "net5": "c6:13:41:90:3f:39",
            "net6": "ea:ca:77:27:e0:68",
            "net7": "ca:22:b4:61:43:cf",
            "net8": "06:dc:b0:f8:2f:d4",
            "net9": "1a:14:d4:c4:10:9c"
        },
        "spine_3_1_5": {
            "net0": "c6:c6:75:c1:cd:ba",
            "net1": "c6:74:38:83:38:83",
            "net10": "e2:60:b1:d4:de:3f",
            "net11": "e6:54:56:f6:4f:42",
            "net2": "42:0e:fa:79:e5:76",
            "net3": "66:3f:c7:c4:70:2e",
            "net4": "22:70:23:c3:c5:39",
            "net5": "1a:ab:68:3d:ea:5b",
            "net6": "f2:73:56:4b:95:7e",
            "net7": "a2:38:b6:06:e1:e7",
            "net8": "d2:8e:e3:4e:69:e7",
            "net9": "f6:c9:e2:3a:ef:22"
        },
        "spine_3_1_6": {
            "net0": "f6:27:39:97:75:4f",
            "net1": "be:30:50:71:be:c8",
            "net10": "ea:ac:47:10:1f:3e",
            "net11": "6a:2a:2f:9a:b3:67",
            "net2": "7e:15:a4:3d:48:66",
            "net3": "f2:68:cb:bb:54:3d",
            "net4": "1e:3e:08:56:71:d0",
            "net5": "b6:ed:22:b0:1d:bc",
            "net6": "d2:6f:90:34:66:d9",
            "net7": "e2:77:68:4a:1a:d5",
            "net8": "fe:88:fe:b2:7f:2a",
            "net9": "e2:a1:66:fc:b7:6e"
        },
        "spine_4_1_1": {
            "net0": "8e:7c:73:81:0e:34",
            "net1": "d6:5c:9f:7a:fe:a2",
            "net10": "fa:46:2b:1f:0f:40",
            "net11": "42:6b:2c:d2:b0:33",
            "net2": "2a:fe:8b:4b:0b:18",
            "net3": "b2:54:87:04:9c:d5",
            "net4": "7a:11:e2:81:2b:68",
            "net5": "4e:38:fd:e0:fb:26",
            "net6": "9a:5b:a2:34:f0:9e",
            "net7": "7a:3a:e2:5f:6d:71",
            "net8": "b6:36:31:54:c6:7a",
            "net9": "ca:32:59:a8:c6:66"
        },
        "spine_4_1_2": {
            "net0": "32:83:06:b4:8c:ff",
            "net1": "36:4f:8d:30:a1:e7",
            "net10": "ce:3e:5b:7d:99:b5",
            "net11": "02:28:3c:06:12:fe",
            "net2": "52:44:cb:79:2c:06",
            "net3": "5a:1e:08:67:dd:41",
            "net4": "c2:7b:d2:1f:c2:b8",
            "net5": "be:b4:db:96:3c:27",
            "net6": "16:be:37:4e:26:de",
            "net7": "de:34:52:bc:d5:b8",
            "net8": "06:75:aa:95:e9:29",
            "net9": "6e:bb:84:cb:9b:47"
        },
        "spine_4_1_3": {
            "net0": "1e:1e:e7:9f:15:b1",
            "net1": "6e:3c:12:a0:71:ae",
            "net10": "3e:24:f4:c0:a8:3b",
            "net11": "ea:3c:26:31:20:16",
            "net2": "aa:0c:d8:ba:77:e9",
            "net3": "66:46:e6:57:20:6f",
            "net4": "c2:04:ba:db:76:06",
            "net5": "6a:88:40:06:25:73",
            "net6": "96:2b:24:94:f5:ca",
            "net7": "42:d8:4a:b2:28:bc",
            "net8": "02:62:e5:31:15:b2",
            "net9": "4a:8f:d5:66:ad:08"
        },
        "spine_4_1_4": {
            "net0": "b6:21:ef:6d:07:7c",
            "net1": "56:2e:d0:3e:48:4a",
            "net10": "ce:fd:10:e9:d2:0e",
            "net11": "be:cd:4d:d8:42:c7",
            "net2": "7a:f6:c3:77:8d:1a",
            "net3": "72:5b:14:65:3a:08",
            "net4": "3e:4d:64:9c:14:d9",
            "net5": "3a:b4:ca:22:41:8d",
            "net6": "36:4b:ff:3d:1d:e3",
            "net7": "16:d7:81:6a:c7:0c",
            "net8": "8e:e2:99:02:4f:d3",
            "net9": "7e:57:19:09:7a:98"
        },
        "spine_4_1_5": {
            "net0": "2a:6b:34:98:8c:1b",
            "net1": "06:ae:2e:47:92:af",
            "net10": "56:e4:68:3a:5d:06",
            "net11": "56:3c:d6:df:2a:2d",
            "net2": "9e:5a:d2:48:18:64",
            "net3": "be:99:e0:20:a7:de",
            "net4": "1e:be:8e:3b:a7:82",
            "net5": "e6:97:57:3a:aa:b7",
            "net6": "c6:cb:29:79:11:43",
            "net7": "5e:7a:96:02:3f:3d",
            "net8": "16:ae:8c:34:08:7f",
            "net9": "7e:df:06:41:1f:13"
        },
        "spine_4_1_6": {
            "net0": "52:c9:c2:74:70:e1",
            "net1": "b6:c9:11:97:7f:ac",
            "net10": "b2:ac:2f:26:28:a6",
            "net11": "c2:31:2a:e6:9d:60",
            "net2": "da:83:f6:2d:b9:77",
            "net3": "3a:3d:bb:df:dd:d7",
            "net4": "9a:da:ac:b0:54:3c",
            "net5": "a2:ab:ff:80:66:72",
            "net6": "ba:35:77:b6:32:6a",
            "net7": "62:4f:17:81:1f:45",
            "net8": "ee:29:0b:63:34:a0",
            "net9": "3a:e2:98:a9:11:99"
        },
        "spine_5_1_1": {
            "net0": "2e:f2:41:12:84:58",
            "net1": "6a:a1:b9:b3:9f:f7",
            "net10": "be:e5:2b:ce:db:cb",
            "net11": "92:e3:9d:5c:f2:53",
            "net2": "c6:69:55:52:71:49",
            "net3": "06:6e:1c:f8:4d:8e",
            "net4": "1e:8d:2c:1f:43:2a",
            "net5": "52:fb:bc:98:35:1d",
            "net6": "de:fb:a6:f6:f3:11",
            "net7": "22:58:cc:9c:24:f9",
            "net8": "0a:ca:f6:1a:02:1e",
            "net9": "d2:dc:5f:fb:45:b5"
        },
        "spine_5_1_2": {
            "net0": "86:41:88:46:8f:bb",
            "net1": "4a:b4:ca:4d:a6:d7",
            "net10": "1a:9d:8b:72:00:02",
            "net11": "1e:d5:90:fa:8b:9f",
            "net2": "1a:94:d5:32:48:57",
            "net3": "fe:67:20:b3:0a:2a",
            "net4": "6e:9c:f9:a3:d9:d1",
            "net5": "ce:3f:3d:a9:36:e6",
            "net6": "6e:f6:9d:04:d5:20",
            "net7": "92:14:d3:1b:2d:d1",
            "net8": "3e:7b:55:30:18:6d",
            "net9": "be:0d:a5:db:e3:f9"
        },
        "spine_5_1_3": {
            "net0": "ee:3e:22:7d:b1:da",
            "net1": "36:ae:2c:ea:8a:92",
            "net10": "d2:e5:b4:06:d5:10",
            "net11": "a6:49:03:28:af:7d",
            "net2": "1a:49:cf:d0:7f:61",
            "net3": "9e:3b:19:3c:02:3d",
            "net4": "fa:0f:93:56:c2:74",
            "net5": "5e:b9:c7:c4:7e:4a",
            "net6": "06:60:e9:a9:51:91",
            "net7": "a6:3a:4a:4e:67:e2",
            "net8": "b2:92:06:01:d4:5b",
            "net9": "6a:d2:f7:2a:3d:f9"
        },
        "spine_5_1_4": {
            "net0": "a2:a1:fb:95:a8:c2",
            "net1": "1a:2f:ff:ca:94:6d",
            "net10": "4a:c6:6f:3d:1d:67",
            "net11": "22:5b:b9:af:44:30",
            "net2": "52:2c:12:71:e4:d5",
            "net3": "16:4b:d3:4d:2b:28",
            "net4": "ba:ac:cc:81:8e:ee",
            "net5": "6e:67:fa:13:49:e2",
            "net6": "3a:2c:1a:c4:77:58",
            "net7": "9a:35:99:6c:e7:83",
            "net8": "e2:40:ed:a9:9a:a0",
            "net9": "72:53:1b:3c:fb:6b"
        },
        "spine_5_1_5": {
            "net0": "72:b4:5d:54:85:c3",
            "net1": "d6:dc:3f:3d:ab:2b",
            "net10": "e6:b0:d4:10:93:74",
            "net11": "c2:81:6b:d0:a7:0d",
            "net2": "b2:65:86:14:85:32",
            "net3": "4a:43:24:c4:a8:a8",
            "net4": "9e:c1:76:02:0b:17",
            "net5": "f6:00:8e:8b:84:45",
            "net6": "76:18:76:52:b8:ea",
            "net7": "1e:99:0e:e7:e9:be",
            "net8": "5e:71:5c:47:b4:3f",
            "net9": "46:b8:4a:32:60:f4"
        },
        "spine_5_1_6": {
            "net0": "d2:15:79:26:9c:f8",
            "net1": "e2:76:d6:3b:49:73",
            "net10": "9e:ca:02:d5:fe:f1",
            "net11": "da:a0:e8:c3:8b:b6",
            "net2": "72:df:40:5c:70:75",
            "net3": "c6:7a:cd:59:2a:45",
            "net4": "92:d9:4e:0e:db:8f",
            "net5": "8a:32:55:4b:bb:49",
            "net6": "ce:25:7d:21:cc:c7",
            "net7": "8e:0c:a8:c7:8d:81",
            "net8": "22:89:3b:fb:a8:3d",
            "net9": "e2:33:5c:5c:9b:3e"
        },
        "spine_6_1_1": {
            "net0": "da:e1:29:9e:30:d1",
            "net1": "e2:01:83:a3:71:31",
            "net10": "92:45:e9:53:f3:3b",
            "net11": "0e:06:66:ec:32:29",
            "net2": "fe:3f:f4:f4:cb:e3",
            "net3": "1e:ab:96:73:2f:9f",
            "net4": "42:36:7a:2b:1f:a2",
            "net5": "7e:05:b3:c8:2f:70",
            "net6": "96:63:1f:dc:3f:44",
            "net7": "a6:5d:ef:fc:b0:83",
            "net8": "9e:2e:8a:7a:d5:5a",
            "net9": "26:01:17:10:4d:93"
        },
        "spine_6_1_2": {
            "net0": "da:92:a8:cf:75:30",
            "net1": "22:31:e4:ae:24:32",
            "net10": "de:81:72:7e:5f:8a",
            "net11": "f2:e8:31:77:f0:6a",
            "net2": "46:74:4e:90:e3:48",
            "net3": "1a:4d:61:3a:e7:98",
            "net4": "76:b1:76:12:0e:44",
            "net5": "26:3f:4b:21:5f:6f",
            "net6": "1a:50:44:e2:20:62",
            "net7": "3e:d4:33:be:35:1d",
            "net8": "ee:ef:12:3b:36:65",
            "net9": "e6:2c:a1:24:db:6e"
        },
        "spine_6_1_3": {
            "net0": "76:11:9e:01:ef:af",
            "net1": "16:d4:ea:c1:27:d7",
            "net10": "0e:ed:3e:d0:31:3e",
            "net11": "f2:34:47:94:d7:c2",
            "net2": "fe:3f:6f:27:b2:7a",
            "net3": "16:a8:aa:a9:3c:e0",
            "net4": "f6:e9:22:0d:fd:18",
            "net5": "1a:da:a3:c6:98:bf",
            "net6": "32:d7:bb:4a:38:d3",
            "net7": "8a:56:9a:96:71:7b",
            "net8": "5a:42:b9:9c:8e:1d",
            "net9": "0e:95:8e:f6:45:4d"
        },
        "spine_6_1_4": {
            "net0": "7e:da:b7:b5:9f:be",
            "net1": "b2:5e:81:ae:e4:81",
            "net10": "2e:c1:c4:24:f7:c9",
            "net11": "32:34:1e:40:08:d3",
            "net2": "fa:ba:cc:d8:43:1a",
            "net3": "da:bc:57:7e:34:af",
            "net4": "a2:6d:5d:f1:5d:95",
            "net5": "ae:88:1a:79:84:0b",
            "net6": "72:b0:83:e8:05:2d",
            "net7": "86:fb:bc:c3:9f:ab",
            "net8": "8e:52:f5:ca:c5:f2",
            "net9": "ea:76:3c:68:c7:e0"
        },
        "spine_6_1_5": {
            "net0": "62:40:83:66:a9:ed",
            "net1": "36:bb:6e:00:16:7f",
            "net10": "12:28:15:7f:b0:d9",
            "net11": "de:6a:73:c5:f3:d4",
            "net2": "b2:38:52:b4:ec:0d",
            "net3": "0a:fd:31:f0:d8:f7",
            "net4": "a2:82:fc:e9:26:94",
            "net5": "3e:c9:04:af:82:3a",
            "net6": "4a:4c:39:e3:28:25",
            "net7": "16:22:16:91:18:d6",
            "net8": "b2:61:11:3b:86:f3",
            "net9": "b6:13:45:60:11:df"
        },
        "spine_6_1_6": {
            "net0": "5e:22:57:fc:c8:b6",
            "net1": "46:32:c7:0b:66:8a",
            "net10": "86:c0:c7:a2:4b:6a",
            "net11": "fe:e6:88:cf:7f:b6",
            "net2": "32:63:b6:75:ac:c9",
            "net3": "be:7c:52:18:d3:28",
            "net4": "9e:f3:53:77:69:f2",
            "net5": "76:78:7b:5e:be:50",
            "net6": "d6:92:6f:27:bb:ba",
            "net7": "ee:2f:2f:b8:ea:83",
            "net8": "12:cc:96:1c:c2:21",
            "net9": "1a:56:74:19:e0:eb"
        },
        "tof_1_2_1": {
            "net0": "6a:73:b4:b3:11:c1",
            "net1": "6a:56:f6:33:44:30",
            "net10": "6e:ba:4f:a6:02:c3",
            "net11": "f6:31:82:0f:32:84",
            "net2": "12:12:e9:6c:c6:7b",
            "net3": "a6:55:d3:42:cc:5e",
            "net4": "ee:c5:a9:28:c0:49",
            "net5": "86:df:5b:44:a5:9d",
            "net6": "ce:f3:f6:08:c8:2a",
            "net7": "ea:a9:13:3c:c9:93",
            "net8": "a2:52:12:87:07:f4",
            "net9": "aa:3b:50:d5:d9:37"
        },
        "tof_1_2_2": {
            "net0": "f2:72:f3:65:00:08",
            "net1": "3e:ab:c9:5d:72:a4",
            "net10": "8e:52:f5:f6:c1:95",
            "net11": "a6:82:44:e7:a8:da",
            "net2": "d6:0d:34:9b:c2:00",
            "net3": "ca:16:73:73:3d:e1",
            "net4": "7e:b8:c7:28:05:43",
            "net5": "5a:a4:6a:75:54:74",
            "net6": "86:33:e1:1d:74:0f",
            "net7": "76:2a:72:09:09:48",
            "net8": "76:f2:5a:27:20:7a",
            "net9": "6e:2a:02:c5:26:56"
        },
        "tof_1_2_3": {
            "net0": "2a:4e:92:a1:9f:c5",
            "net1": "96:a8:b1:f7:af:8f",
            "net10": "f2:04:ca:d0:e0:44",
            "net11": "aa:bf:3b:94:12:8c",
            "net2": "ea:57:ee:b2:77:da",
            "net3": "be:11:23:c4:22:89",
            "net4": "96:df:d0:23:1c:f6",
            "net5": "8a:0c:4c:e6:4f:d7",
            "net6": "92:8e:17:a9:12:3a",
            "net7": "72:4c:c7:65:12:ca",
            "net8": "fe:bc:67:89:3a:4e",
            "net9": "12:3a:71:d7:e9:d2"
        },
        "tof_1_2_4": {
            "net0": "de:f1:9d:dd:2f:93",
            "net1": "8e:10:96:c6:f8:a0",
            "net10": "42:4e:31:b0:3b:ce",
            "net11": "be:29:7f:7c:14:94",
            "net2": "9a:f7:e4:3f:06:26",
            "net3": "e6:d2:77:3d:3d:12",
            "net4": "32:06:8d:d7:aa:c7",
            "net5": "0a:ea:0e:0e:d9:d9",
            "net6": "d2:00:db:eb:46:fe",
            "net7": "36:26:33:9c:4a:b8",
            "net8": "1a:da:cf:70:df:3e",
            "net9": "3e:b4:bb:f2:ff:1c"
        },
        "tof_1_2_5": {
            "net0": "ea:e4:15:0a:67:74",
            "net1": "ea:fc:4e:02:be:01",
            "net10": "fe:e8:86:8a:be:52",
            "net11": "be:1d:ab:ab:9e:56",
            "net2": "1e:65:60:12:ef:cd",
            "net3": "ee:fb:33:67:57:89",
            "net4": "ea:81:16:5a:8e:6d",
            "net5": "2a:6d:da:c0:19:9e",
            "net6": "da:18:46:83:4d:23",
            "net7": "fe:5d:b5:55:91:be",
            "net8": "f6:f6:ba:88:17:99",
            "net9": "9a:d4:59:6c:58:c7"
        },
        "tof_1_2_6": {
            "net0": "fe:4a:42:0e:61:37",
            "net1": "02:a6:85:9e:d4:27",
            "net10": "02:4f:fb:55:55:d3",
            "net11": "02:af:13:c0:1c:a4",
            "net2": "c6:34:71:d8:73:97",
            "net3": "b2:2b:e3:48:8b:04",
            "net4": "a6:3d:93:79:bb:8c",
            "net5": "c2:d8:67:5d:ee:f6",
            "net6": "d2:04:db:80:f0:07",
            "net7": "8a:84:33:47:15:1d",
            "net8": "5e:34:20:91:3f:40",
            "net9": "5e:a4:fd:98:9a:ab"
        },
        "tof_2_2_1": {
            "net0": "5e:1d:31:56:a1:32",
            "net1": "a6:87:5e:bf:3d:e7",
            "net10": "26:48:c3:9d:fa:37",
            "net11": "fe:08:c8:b4:a8:c6",
            "net2": "5a:a3:ad:17:fb:dd",
            "net3": "8a:ac:11:b7:94:d2",
            "net4": "0e:9d:7e:49:5d:a5",
            "net5": "16:2a:14:50:29:a4",
            "net6": "d6:8b:93:43:31:01",
            "net7": "32:de:b8:33:05:72",
            "net8": "c2:f3:c5:c5:c0:a8",
            "net9": "4a:7b:32:b6:bb:e7"
        },
        "tof_2_2_2": {
            "net0": "f2:1d:2f:85:9d:2f",
            "net1": "ce:c7:71:f5:fd:d6",
            "net10": "3a:74:df:1e:92:0e",
            "net11": "52:32:b8:81:00:14",
            "net2": "ca:fd:1b:6d:52:a6",
            "net3": "9e:7a:15:56:f1:ad",
            "net4": "7e:09:a2:4b:ed:4e",
            "net5": "66:aa:fc:3b:9c:91",
            "net6": "b2:1e:e8:f4:31:a7",
            "net7": "0e:10:03:cd:a4:a5",
            "net8": "d2:1f:6b:22:1d:44",
            "net9": "2e:bf:86:76:9b:87"
        },
        "tof_2_2_3": {
            "net0": "66:b5:c0:fb:93:9b",
            "net1": "72:d1:35:64:ed:a8",
            "net10": "4a:59:27:46:cc:ae",
            "net11": "c6:f2:d8:15:0d:e1",
            "net2": "4a:22:0a:72:b1:ce",
            "net3": "3e:47:6e:ae:e2:5d",
            "net4": "f6:7f:03:03:68:a6",
            "net5": "7e:69:ef:e9:93:01",
            "net6": "b2:be:ce:b2:0d:6f",
            "net7": "d2:2b:8f:e8:c6:ad",
            "net8": "16:6f:7c:67:46:f6",
            "net9": "66:9c:4a:c5:2b:4a"
        },
        "tof_2_2_4": {
            "net0": "9e:1a:0e:6e:99:0b",
            "net1": "26:9a:28:ad:33:84",
            "net10": "1e:55:34:60:fc:18",
            "net11": "f2:fa:91:1c:79:79",
            "net2": "fa:aa:4b:61:d6:7f",
            "net3": "9e:1e:db:1a:32:a8",
            "net4": "22:86:84:b7:5f:7a",
            "net5": "02:76:e5:fb:61:f9",
            "net6": "0e:f0:06:fd:70:ee",
            "net7": "82:d6:bb:86:50:e5",
            "net8": "76:43:39:eb:89:36",
            "net9": "e6:1b:71:99:59:73"
        },
        "tof_2_2_5": {
            "net0": "72:0a:8a:25:3a:51",
            "net1": "12:34:71:cb:3c:11",
            "net10": "a2:0a:6e:db:05:1a",
            "net11": "f6:37:9a:ab:a4:ad",
            "net2": "26:22:4d:8e:fd:fc",
            "net3": "2a:c3:4c:35:40:0e",
            "net4": "3e:bc:c0:1c:0f:97",
            "net5": "fe:20:d4:7f:48:7b",
            "net6": "96:a8:fe:9e:75:25",
            "net7": "6a:c4:c3:f7:38:20",
            "net8": "22:80:c1:98:0f:6b",
            "net9": "fe:c0:f9:97:d3:ce"
        },
        "tof_2_2_6": {
            "net0": "6a:04:53:51:d6:24",
            "net1": "0e:0f:b1:da:4a:38",
            "net10": "16:58:ea:21:85:a2",
            "net11": "0a:5c:a6:31:49:f0",
            "net2": "c6:d4:f3:bc:a9:34",
            "net3": "6a:73:25:7a:dc:b7",
            "net4": "6e:81:76:12:cc:6c",
            "net5": "76:7f:9e:23:79:18",
            "net6": "d2:e1:23:cf:1a:b6",
            "net7": "4e:02:6f:d8:9c:b5",
            "net8": "8e:7d:21:78:69:90",
            "net9": "66:d9:40:bb:64:ba"
        },
        "tof_3_2_1": {
            "net0": "c6:07:07:b6:bf:94",
            "net1": "be:58:9e:0c:62:51",
            "net10": "4a:72:a1:3c:0c:0b",
            "net11": "ae:7f:c8:a5:f4:63",
            "net2": "12:82:ff:87:d3:3e",
            "net3": "e2:8c:f9:93:2c:f8",
            "net4": "3e:86:c3:01:1a:22",
            "net5": "7a:53:50:0e:76:95",
            "net6": "7e:a5:28:53:01:d4",
            "net7": "4a:55:28:76:38:29",
            "net8": "ce:fb:18:f4:e5:69",
            "net9": "56:70:87:db:4d:69"
        },
        "tof_3_2_2": {
            "net0": "ea:8d:c6:cd:1c:7c",
            "net1": "ea:00:be:92:85:23",
            "net10": "4a:79:ca:16:87:46",
            "net11": "22:d7:63:d3:21:74",
            "net2": "c2:1f:09:b5:6c:b2",
            "net3": "6e:d3:d9:ae:db:c7",
            "net4": "02:0d:62:61:78:3a",
            "net5": "ba:3c:d0:aa:38:58",
            "net6": "e2:a3:a2:b6:bc:a4",
            "net7": "fa:2b:99:00:d2:f6",
            "net8": "26:8b:2b:05:cd:f5",
            "net9": "12:d0:7c:57:23:99"
        },
        "tof_3_2_3": {
            "net0": "26:8f:d6:e0:7f:b8",
            "net1": "ee:21:00:20:7b:1b",
            "net10": "6a:0a:7e:3f:f2:e3",
            "net11": "46:1c:8e:7c:8a:3f",
            "net2": "66:5d:97:40:d8:6a",
            "net3": "f2:f1:ac:5f:56:77",
            "net4": "12:aa:aa:3a:b1:90",
            "net5": "a6:17:f3:c8:04:ed",
            "net6": "0a:7c:bb:8d:ff:93",
            "net7": "32:1c:68:0a:3d:a9",
            "net8": "86:7b:6e:87:94:ed",
            "net9": "a2:5b:d3:d0:1d:ba"
        },
        "tof_3_2_4": {
            "net0": "7e:35:45:30:c0:b8",
            "net1": "46:f1:88:67:fa:b2",
            "net10": "62:47:79:52:08:a1",
            "net11": "da:09:b4:ea:76:59",
            "net2": "d2:8c:e9:a6:97:7c",
            "net3": "32:d5:24:f7:a8:84",
            "net4": "fa:97:00:77:7e:9d",
            "net5": "ea:e4:41:c8:f3:52",
            "net6": "ea:b0:c4:54:e0:1f",
            "net7": "c2:66:60:3b:0b:68",
            "net8": "de:4d:c2:f7:79:2f",
            "net9": "4e:7f:8d:06:d0:cd"
        },
        "tof_3_2_5": {
            "net0": "ee:ff:b0:f4:11:ce",
            "net1": "ea:cd:3f:77:be:a6",
            "net10": "ee:23:56:78:59:de",
            "net11": "16:9a:cd:6e:cf:75",
            "net2": "ca:e1:1d:9c:28:2d",
            "net3": "fe:ee:a0:01:fc:06",
            "net4": "16:50:03:fb:58:34",
            "net5": "a6:2b:28:d5:d1:3e",
            "net6": "ce:19:01:f3:06:60",
            "net7": "3e:d7:ad:8a:50:5b",
            "net8": "aa:6e:9c:56:7a:de",
            "net9": "5a:47:a0:35:3f:d5"
        },
        "tof_3_2_6": {
            "net0": "b2:4b:17:6f:1f:23",
            "net1": "66:12:a3:1a:eb:2e",
            "net10": "36:9e:24:b0:ca:e4",
            "net11": "36:e2:53:52:2f:7f",
            "net2": "5e:89:96:94:c6:f7",
            "net3": "96:b5:ab:99:85:d8",
            "net4": "42:57:5b:89:ab:8d",
            "net5": "7a:93:2e:bf:07:bd",
            "net6": "c6:42:90:ac:dc:59",
            "net7": "66:48:95:8d:95:87",
            "net8": "3e:bc:59:ae:6a:33",
            "net9": "e2:0b:8d:7a:57:7d"
        }
    },
    "failed_machine": "tof_1_2_1",
    "failure_time": 1613250462.8763413
}