{
    "description": "Scenario 4a: Leaf leaf_1_0_1 failure and recovery with BGP",
    "k_leaf": 6,
    "k_top": 6,
    "redundancy_factor": 1,
    "is_k8s": true,
    "machine_mac_addresses": {
        "leaf_10_0_1": {
            "net0": "9e:6f:8e:4b:c2:92",
            "net1": "6a:ec:a7:fa:85:5a",
            "net2": "72:83:a2:45:fe:a5",
            "net3": "9a:35:93:ef:19:23",
            "net4": "c2:6f:98:20:f1:24",
            "net5": "2e:ca:9a:c5:8f:9f",
            "net6": "2e:cd:e4:dd:9b:a2"
        },
        "leaf_10_0_2": {
            "net0": "96:61:c6:ab:95:00",
            "net1": "5a:68:4f:b6:1d:42",
            "net2": "66:33:b6:92:57:aa",
            "net3": "ea:7b:35:d6:69:44",
            "net4": "2e:07:1f:50:34:3c",
            "net5": "9a:95:26:03:1e:af",
            "net6": "12:fb:bb:db:2e:18"
        },
        "leaf_10_0_3": {
            "net0": "1e:f7:72:48:7f:d5",
            "net1": "2a:ee:7a:66:d9:aa",
            "net2": "52:cb:1f:ea:9f:a7",
            "net3": "1a:7a:6d:fa:f4:3b",
            "net4": "8a:24:25:de:e0:fd",
            "net5": "22:98:8b:7f:9e:a9",
            "net6": "76:ff:52:6d:5e:42"
        },
        "leaf_10_0_4": {
            "net0": "96:cb:49:d4:79:04",
            "net1": "42:d1:b4:ec:72:27",
            "net2": "4a:76:11:60:b1:51",
            "net3": "f6:a0:cd:61:6c:02",
            "net4": "ea:99:c4:97:c7:29",
            "net5": "62:f3:67:5f:ba:f8",
            "net6": "52:a4:13:06:12:04"
        },
        "leaf_10_0_5": {
            "net0": "be:7f:0d:93:ca:86",
            "net1": "8e:81:8d:62:8c:4a",
            "net2": "06:e7:e7:c7:0d:21",
            "net3": "a6:34:6e:42:38:ad",
            "net4": "ae:69:b6:df:70:41",
            "net5": "6a:41:a8:9c:66:5e",
            "net6": "7a:72:f6:db:c6:75"
        },
        "leaf_10_0_6": {
            "net0": "92:72:8c:f7:3d:ea",
            "net1": "7e:9d:31:84:17:44",
            "net2": "56:ff:2d:5a:01:a0",
            "net3": "ee:da:9a:8c:fc:b8",
            "net4": "76:16:e2:64:d8:44",
            "net5": "1e:39:ff:0c:6d:d1",
            "net6": "f2:f1:35:04:cb:14"
        },
        "leaf_11_0_1": {
            "net0": "82:44:42:28:69:b9",
            "net1": "f2:72:57:42:a0:22",
            "net2": "0e:b6:cd:f3:8e:7b",
            "net3": "2a:c2:e9:f4:ca:0d",
            "net4": "52:70:e9:da:15:3a",
            "net5": "5e:b9:5b:91:06:e0",
            "net6": "ea:b1:c3:1e:d4:db"
        },
        "leaf_11_0_2": {
            "net0": "a6:84:d5:c4:91:40",
            "net1": "22:b9:c9:f5:7b:a1",
            "net2": "c6:d5:df:36:4f:c2",
            "net3": "ba:3a:c9:3a:ec:11",
            "net4": "06:af:89:a2:b0:8c",
            "net5": "ce:bd:93:9f:1c:33",
            "net6": "9a:fb:7f:b5:76:3d"
        },
        "leaf_11_0_3": {
            "net0": "4e:c9:72:66:5d:8b",
            "net1": "66:c8:a4:b8:76:19",
            "net2": "3e:b3:6b:3d:fa:75",
            "net3": "92:f7:95:1d:37:ed",
            "net4": "1e:eb:83:34:42:46",
            "net5": "1a:88:19:0d:e9:8b",
            "net6": "ba:c1:4d:7c:48:93"
        },
        "leaf_11_0_4": {
            "net0": "6a:35:de:f6:d0:ce",
            "net1": "62:ea:90:cb:08:3c",
            "net2": "ca:8a:49:57:58:fe",
            "net3": "36:77:30:f7:e6:e4",
            "net4": "1a:9c:a1:07:e3:1f",
            "net5": "b6:ea:dd:ce:4a:91",
            "net6": "ee:26:12:01:f6:81"
        },
        "leaf_11_0_5": {
            "net0": "ce:ca:6f:06:f7:8a",
            "net1": "2a:3f:d4:9c:42:c4",
            "net2": "7e:85:66:b8:71:d3",
            "net3": "fe:dc:94:4c:5e:3c",
            "net4": "ea:ba:db:13:8e:96",
            "net5": "5a:42:df:89:c6:6c",
            "net6": "5a:0a:a4:6d:68:0d"
        },
        "leaf_11_0_6": {
            "net0": "de:fc:35:3c:d2:19",
            "net1": "92:19:4a:f2:a0:f8",
            "net2": "e2:b8:6d:a2:cb:a0",
            "net3": "f2:5f:9f:cf:2c:46",
            "net4": "d2:37:5f:bd:c7:a0",
            "net5": "42:25:6f:94:a3:07",
            "net6": "ce:6b:be:d3:05:6b"
        },
        "leaf_12_0_1": {
            "net0": "c6:37:81:c3:9c:4d",
            "net1": "86:bf:70:bc:54:cc",
            "net2": "6a:58:39:e1:9a:f5",
            "net3": "c6:ea:2d:02:eb:72",
            "net4": "e2:6a:82:7f:de:53",
            "net5": "8e:5b:26:c9:d2:ad",
            "net6": "5e:5e:ef:99:29:b2"
        },
        "leaf_12_0_2": {
            "net0": "3e:88:ce:71:ee:57",
            "net1": "b2:51:c1:df:2d:6f",
            "net2": "82:cd:f7:ea:6c:69",
            "net3": "ca:d8:ec:29:35:5b",
            "net4": "8a:c0:20:7c:16:6b",
            "net5": "5e:36:d0:eb:f6:1d",
            "net6": "06:c0:c7:64:03:cb"
        },
        "leaf_12_0_3": {
            "net0": "3e:12:39:0b:e0:f6",
            "net1": "f6:be:a2:3c:87:6c",
            "net2": "5e:07:d8:64:0a:59",
            "net3": "62:8f:ff:26:f0:3e",
            "net4": "3a:29:7a:8b:20:a8",
            "net5": "7e:46:5e:e4:fc:3e",
            "net6": "8e:27:49:f1:67:d3"
        },
        "leaf_12_0_4": {
            "net0": "42:19:88:53:9f:c5",
            "net1": "ce:88:0e:b9:76:af",
            "net2": "4e:e8:b9:1f:15:5f",
            "net3": "0e:76:a8:c0:00:e3",
            "net4": "36:4a:22:c1:5a:3f",
            "net5": "fe:73:50:19:fa:f8",
            "net6": "ce:e7:9c:13:3f:68"
        },
        "leaf_12_0_5": {
            "net0": "6e:e5:0b:6d:68:5d",
            "net1": "92:15:f3:4b:87:03",
            "net2": "c6:3e:65:a9:80:09",
            "net3": "fa:1b:11:05:51:ba",
            "net4": "d2:ff:87:7a:f3:98",
            "net5": "46:99:cd:e2:f5:d0",
            "net6": "5e:9b:d5:c3:d2:2e"
        },
        "leaf_12_0_6": {
            "net0": "7a:ba:a0:75:d1:28",
            "net1": "ba:1b:d5:f3:4e:92",
            "net2": "3e:b7:04:56:ac:f7",
            "net3": "3e:80:46:b6:c8:6a",
            "net4": "d2:15:7c:cc:90:75",
            "net5": "06:ed:61:cf:24:01",
            "net6": "b6:f6:7e:cd:b6:37"
        },
        "leaf_1_0_1": {
            "net0": "5e:d6:14:c8:77:3c",
            "net1": "3e:dd:8c:02:55:44",
            "net2": "fa:9d:21:04:6b:5a",
            "net3": "fa:d9:c9:2f:18:8b",
            "net4": "ae:81:b0:d7:2c:c4",
            "net5": "6a:fb:4d:fb:ee:ed",
            "net6": "8e:76:dd:bd:f5:8a"
        },
        "leaf_1_0_2": {
            "net0": "8a:f6:53:66:ac:6b",
            "net1": "6e:7e:e7:ae:ef:6b",
            "net2": "32:bf:ae:46:20:37",
            "net3": "8e:50:bc:99:c7:af",
            "net4": "6e:8f:8e:39:a2:76",
            "net5": "7e:1f:77:f8:22:27",
            "net6": "d2:a5:4f:24:32:38"
        },
        "leaf_1_0_3": {
            "net0": "ee:ba:36:7a:7c:fa",
            "net1": "2a:51:c5:84:79:3b",
            "net2": "6e:ed:12:d8:18:69",
            "net3": "96:9d:b3:f2:e1:f4",
            "net4": "9a:2e:16:e8:7b:0f",
            "net5": "c6:d3:b1:6a:d3:01",
            "net6": "a6:ac:8c:39:09:0d"
        },
        "leaf_1_0_4": {
            "net0": "8e:4d:34:53:1c:8a",
            "net1": "76:ab:a7:6c:92:5b",
            "net2": "2e:6b:5b:97:d4:77",
            "net3": "5e:62:7a:bc:3c:40",
            "net4": "16:00:e6:05:11:22",
            "net5": "5e:e5:1f:18:84:c0",
            "net6": "3a:49:f8:f9:84:d2"
        },
        "leaf_1_0_5": {
            "net0": "ba:81:f5:2c:7b:c9",
            "net1": "b6:89:c4:13:d2:8a",
            "net2": "9a:18:a0:2b:03:4d",
            "net3": "b6:73:bc:52:63:06",
            "net4": "da:ba:68:07:8e:7b",
            "net5": "de:37:3d:01:79:46",
            "net6": "0e:87:24:56:89:94"
        },
        "leaf_1_0_6": {
            "net0": "ba:04:e0:d9:4f:92",
            "net1": "fe:89:63:4d:44:c4",
            "net2": "1e:a6:98:60:9a:c1",
            "net3": "d2:c5:4c:71:ae:87",
            "net4": "be:2d:fe:f4:83:df",
            "net5": "da:62:e5:d9:96:f6",
            "net6": "2a:5b:12:f8:ab:ea"
        },
        "leaf_2_0_1": {
            "net0": "8e:43:82:86:9a:c5",
            "net1": "2a:2d:98:a2:74:ce",
            "net2": "3e:73:c9:9b:3c:fc",
            "net3": "3a:d6:1a:a7:8b:f6",
            "net4": "9a:2c:b9:f2:99:a1",
            "net5": "76:03:a4:01:21:a8",
            "net6": "c6:a0:6d:66:51:7b"
        },
        "leaf_2_0_2": {
            "net0": "c6:a3:96:66:9c:69",
            "net1": "a6:4d:2c:98:81:70",
            "net2": "e2:3b:c0:ab:ea:7f",
            "net3": "36:52:dd:71:bd:db",
            "net4": "b6:89:27:83:dc:d5",
            "net5": "02:19:01:1a:69:b5",
            "net6": "26:47:8c:58:00:18"
        },
        "leaf_2_0_3": {
            "net0": "fe:be:d8:50:b5:54",
            "net1": "be:8b:56:cc:e9:29",
            "net2": "a2:72:a6:cf:ea:06",
            "net3": "da:93:15:33:c8:ee",
            "net4": "9e:6b:cf:4b:8e:17",
            "net5": "b6:62:6b:aa:04:e3",
            "net6": "a2:ff:3e:29:4f:fb"
        },
        "leaf_2_0_4": {
            "net0": "26:97:9a:02:98:bc",
            "net1": "5a:65:b2:f9:66:56",
            "net2": "f6:5b:38:a4:49:06",
            "net3": "6a:1e:32:78:c9:55",
            "net4": "fa:7f:88:e1:09:c6",
            "net5": "b2:04:83:85:7d:46",
            "net6": "9e:9b:1e:96:c4:20"
        },
        "leaf_2_0_5": {
            "net0": "ca:40:14:6d:91:48",
            "net1": "da:46:0f:68:40:cb",
            "net2": "fe:20:b5:ae:71:d0",
            "net3": "42:61:90:35:47:e5",
            "net4": "8a:a4:b9:2b:ed:ce",
            "net5": "5a:20:e8:fb:17:53",
            "net6": "ce:67:8f:c1:80:17"
        },
        "leaf_2_0_6": {
            "net0": "da:9d:a2:30:1c:99",
            "net1": "0e:ee:2c:74:49:0e",
            "net2": "9a:08:b2:e1:52:aa",
            "net3": "6a:8d:51:43:49:6f",
            "net4": "62:85:77:bc:b7:2d",
            "net5": "0e:5f:82:bf:65:3e",
            "net6": "2e:0c:40:e5:22:2a"
        },
        "leaf_3_0_1": {
            "net0": "ea:73:1a:c2:c0:e0",
            "net1": "fe:44:c3:b8:f0:86",
            "net2": "e6:20:c6:01:3c:f1",
            "net3": "ae:b0:8f:fc:fc:d5",
            "net4": "56:bb:70:0b:21:40",
            "net5": "5e:a3:b9:b0:87:de",
            "net6": "02:e5:5f:36:50:6a"
        },
        "leaf_3_0_2": {
            "net0": "f2:02:23:26:0c:7f",
            "net1": "e6:8b:86:e4:32:81",
            "net2": "12:59:f2:06:9e:ce",
            "net3": "52:25:84:be:47:80",
            "net4": "de:f8:b5:56:d7:86",
            "net5": "3a:17:1c:a4:ba:0d",
            "net6": "b2:90:61:0c:40:33"
        },
        "leaf_3_0_3": {
            "net0": "42:24:19:e5:80:11",
            "net1": "16:1d:2d:98:0d:83",
            "net2": "62:01:9a:e5:65:0a",
            "net3": "22:fb:32:c2:ef:be",
            "net4": "ca:60:f7:be:2f:d1",
            "net5": "f2:f8:15:74:06:38",
            "net6": "32:e2:1f:eb:c6:ac"
        },
        "leaf_3_0_4": {
            "net0": "8e:2a:c7:2a:4b:01",
            "net1": "3e:1a:73:39:b3:eb",
            "net2": "2e:bf:90:57:65:f0",
            "net3": "2e:c1:f6:ec:98:34",
            "net4": "06:8b:2e:4f:44:c6",
            "net5": "5e:7f:0c:ff:cb:44",
            "net6": "3a:5d:15:6b:25:1d"
        },
        "leaf_3_0_5": {
            "net0": "9a:9e:8a:26:27:b8",
            "net1": "f6:02:66:62:d6:1d",
            "net2": "4e:a2:97:d0:63:fb",
            "net3": "1e:39:87:cc:36:b9",
            "net4": "a6:ab:04:e9:22:06",
            "net5": "42:30:3b:51:97:74",
            "net6": "3e:bb:43:03:88:a4"
        },
        "leaf_3_0_6": {
            "net0": "56:63:35:e0:55:17",
            "net1": "ee:19:41:98:e2:b9",
            "net2": "f6:70:b2:20:d2:09",
            "net3": "f2:5f:80:8d:fc:04",
            "net4": "e2:88:a3:75:2f:b9",
            "net5": "02:3e:53:86:db:22",
            "net6": "ae:3e:c7:ac:e6:7f"
        },
        "leaf_4_0_1": {
            "net0": "1e:8f:89:42:5d:2f",
            "net1": "be:66:81:61:3f:17",
            "net2": "ee:83:9a:4e:b0:48",
            "net3": "de:45:4d:61:13:71",
            "net4": "86:8b:9f:3d:a2:0b",
            "net5": "46:17:97:95:de:17",
            "net6": "1a:a3:15:00:32:44"
        },
        "leaf_4_0_2": {
            "net0": "1a:51:94:97:29:81",
            "net1": "0a:fe:9e:ca:f5:d8",
            "net2": "4e:ce:ec:a0:c3:07",
            "net3": "d2:2c:f2:05:5c:09",
            "net4": "ae:c9:44:a7:74:66",
            "net5": "42:8b:a2:40:dd:12",
            "net6": "4a:a5:fc:93:b1:8b"
        },
        "leaf_4_0_3": {
            "net0": "4a:0f:87:c5:9f:8f",
            "net1": "4a:50:bd:c1:e1:bb",
            "net2": "d6:f8:06:f4:47:e4",
            "net3": "52:41:8d:48:3a:e7",
            "net4": "be:14:61:ce:4d:db",
            "net5": "76:d0:55:a4:93:84",
            "net6": "36:af:82:84:69:c5"
        },
        "leaf_4_0_4": {
            "net0": "7e:ba:1c:d4:e7:88",
            "net1": "ca:b0:66:d7:57:48",
            "net2": "e6:74:f3:0b:47:e6",
            "net3": "96:f5:e3:e1:59:3d",
            "net4": "0e:0f:89:5b:b4:72",
            "net5": "0e:25:2d:a6:53:83",
            "net6": "e2:67:47:f9:62:f4"
        },
        "leaf_4_0_5": {
            "net0": "66:9e:70:b5:53:7b",
            "net1": "fe:28:2c:3a:6a:9f",
            "net2": "6a:25:2e:79:f0:2d",
            "net3": "0e:9d:b5:a2:8b:01",
            "net4": "02:ef:e6:ef:95:f9",
            "net5": "a6:6e:20:cc:03:3a",
            "net6": "56:10:c3:77:26:85"
        },
        "leaf_4_0_6": {
            "net0": "b2:ec:22:68:99:c0",
            "net1": "5e:1f:0f:6e:36:4a",
            "net2": "62:f2:00:6f:52:dc",
            "net3": "2e:03:ec:5e:0b:1a",
            "net4": "ba:ef:89:cb:10:fc",
            "net5": "5a:fa:e4:1a:10:88",
            "net6": "8e:ec:7b:29:ff:0c"
        },
        "leaf_5_0_1": {
            "net0": "da:3f:a0:bb:bb:63",
            "net1": "2a:f2:b5:29:ed:fe",
            "net2": "be:c7:99:12:04:bf",
            "net3": "32:70:88:47:03:50",
            "net4": "ce:d3:62:29:d5:c6",
            "net5": "f2:5f:6c:d6:ae:0f",
            "net6": "5a:6e:4c:46:5e:d7"
        },
        "leaf_5_0_2": {
            "net0": "7e:a1:d3:1f:f3:4a",
            "net1": "3a:ca:94:72:91:27",
            "net2": "02:62:32:6f:eb:ce",
            "net3": "5a:90:25:09:14:ca",
            "net4": "12:eb:3d:fe:a0:91",
            "net5": "3e:da:85:49:78:4d",
            "net6": "f2:c3:c5:17:6a:00"
        },
        "leaf_5_0_3": {
            "net0": "d2:1a:08:b8:c3:61",
            "net1": "96:f0:81:12:f6:bd",
            "net2": "9a:b6:d1:b5:29:9f",
            "net3": "ae:f9:30:79:dc:e9",
            "net4": "4a:7e:f4:f3:2c:e8",
            "net5": "5e:08:85:95:06:0a",
            "net6": "42:4d:03:06:1a:92"
        },
        "leaf_5_0_4": {
            "net0": "b6:90:11:b1:c5:7f",
            "net1": "86:a9:eb:8b:d4:ae",
            "net2": "5a:3e:58:40:bd:95",
            "net3": "3a:b2:45:1b:fd:08",
            "net4": "56:f6:9b:dc:94:44",
            "net5": "ae:8e:56:f9:88:9a",
            "net6": "0e:6e:88:ed:54:a4"
        },
        "leaf_5_0_5": {
            "net0": "fa:a0:8a:1b:82:a7",
            "net1": "92:db:79:15:70:3e",
            "net2": "4a:1a:e9:7d:96:2e",
            "net3": "f6:d4:bf:1b:9a:de",
            "net4": "d6:dc:61:eb:cf:8f",
            "net5": "8e:da:de:9e:7d:31",
            "net6": "76:db:07:1b:76:1a"
        },
        "leaf_5_0_6": {
            "net0": "8e:8d:17:9b:90:d9",
            "net1": "da:35:5a:40:ff:1d",
            "net2": "92:9f:e4:c1:91:5b",
            "net3": "26:56:bf:43:d2:cf",
            "net4": "2e:e2:82:86:80:7b",
            "net5": "9a:71:b2:94:2a:bf",
            "net6": "62:a0:cb:53:13:12"
        },
        "leaf_6_0_1": {
            "net0": "de:0b:de:d7:7a:4b",
            "net1": "7e:9e:48:6d:3a:db",
            "net2": "6e:c8:99:41:15:1f",
            "net3": "fe:4c:82:95:5c:88",
            "net4": "02:9c:50:f2:44:2b",
            "net5": "3e:5f:37:e7:29:7f",
            "net6": "7e:72:ea:4c:67:3d"
        },
        "leaf_6_0_2": {
            "net0": "8a:2e:5e:f5:81:f6",
            "net1": "4a:de:58:0f:a3:f8",
            "net2": "4a:b7:e2:d8:f3:ed",
            "net3": "e6:a4:61:8d:be:44",
            "net4": "c6:24:99:0e:6a:9c",
            "net5": "5e:2f:35:3e:2d:3d",
            "net6": "2a:fb:da:9d:f8:ed"
        },
        "leaf_6_0_3": {
            "net0": "de:4a:ab:03:68:b1",
            "net1": "7a:c1:43:b4:a1:90",
            "net2": "b6:47:83:e4:c6:d8",
            "net3": "a2:66:62:f9:e1:48",
            "net4": "16:68:65:ba:4d:98",
            "net5": "0e:4e:16:3a:23:02",
            "net6": "f6:fa:4b:f0:3d:50"
        },
        "leaf_6_0_4": {
            "net0": "9e:1a:32:8d:2e:1c",
            "net1": "36:ab:7a:6b:c0:6e",
            "net2": "6e:e6:ed:8b:60:52",
            "net3": "46:c7:63:9e:17:9d",
            "net4": "ba:c2:4f:24:1b:a0",
            "net5": "de:9d:bd:e1:17:01",
            "net6": "8a:9a:b7:3e:34:3a"
        },
        "leaf_6_0_5": {
            "net0": "ba:69:fc:89:58:2d",
            "net1": "a6:be:8b:f8:0a:cd",
            "net2": "ea:1f:99:f3:8e:59",
            "net3": "92:cf:cf:4f:13:86",
            "net4": "06:62:b1:86:c3:36",
            "net5": "22:95:df:94:74:36",
            "net6": "5a:52:ea:db:84:6e"
        },
        "leaf_6_0_6": {
            "net0": "be:55:0f:8a:3a:ae",
            "net1": "f6:61:1e:03:f1:2c",
            "net2": "4e:6a:b3:98:f3:78",
            "net3": "4e:97:93:a3:ce:ee",
            "net4": "ce:3a:7c:9b:95:a1",
            "net5": "7e:ac:55:0b:75:13",
            "net6": "02:46:e9:9d:09:43"
        },
        "leaf_7_0_1": {
            "net0": "9e:aa:e7:ab:10:9b",
            "net1": "12:5d:e8:ec:11:23",
            "net2": "4a:f6:94:0c:cd:a1",
            "net3": "72:ad:16:ba:61:91",
            "net4": "06:4f:1d:28:a3:ca",
            "net5": "36:54:dc:2c:71:19",
            "net6": "0a:a4:71:fd:67:a9"
        },
        "leaf_7_0_2": {
            "net0": "72:37:3b:43:3c:6d",
            "net1": "be:f0:44:40:6e:67",
            "net2": "d6:67:58:2c:95:15",
            "net3": "7a:70:ac:90:fb:c2",
            "net4": "12:a1:02:bf:95:98",
            "net5": "ce:2b:fc:88:66:6d",
            "net6": "5e:e3:44:e0:66:c6"
        },
        "leaf_7_0_3": {
            "net0": "9e:af:eb:bd:b2:68",
            "net1": "fa:b1:f0:4e:8a:34",
            "net2": "36:76:47:34:b1:cd",
            "net3": "a6:c7:3c:a6:bb:2b",
            "net4": "b6:f3:8a:c6:28:73",
            "net5": "ba:cf:a6:45:12:ef",
            "net6": "e2:68:34:69:58:e2"
        },
        "leaf_7_0_4": {
            "net0": "a2:05:99:fb:1f:09",
            "net1": "b2:9a:22:9e:5a:c3",
            "net2": "be:b9:cc:dd:3c:dc",
            "net3": "0e:69:9a:a2:95:49",
            "net4": "fa:5e:3b:76:80:7a",
            "net5": "2a:29:c4:c7:40:09",
            "net6": "92:a5:3a:35:bd:7b"
        },
        "leaf_7_0_5": {
            "net0": "be:cb:27:de:df:56",
            "net1": "96:b6:79:f7:50:77",
            "net2": "12:31:47:0c:32:ba",
            "net3": "f6:86:10:4a:ca:fc",
            "net4": "b6:23:88:f4:e5:43",
            "net5": "ae:b1:ac:35:28:4f",
            "net6": "d6:f1:a5:ba:87:bb"
        },
        "leaf_7_0_6": {
            "net0": "fa:d4:fb:ff:37:71",
            "net1": "16:f8:df:b5:96:a6",
            "net2": "3e:38:5d:47:ca:da",
            "net3": "52:e1:09:db:ac:62",
            "net4": "b6:2d:3b:85:f1:f3",
            "net5": "5e:c1:fa:0f:0d:de",
            "net6": "ce:3a:e8:6d:b3:81"
        },
        "leaf_8_0_1": {
            "net0": "6a:67:f4:c4:f3:cc",
            "net1": "26:b4:0a:7e:68:ba",
            "net2": "3e:ad:80:55:50:fe",
            "net3": "5a:0c:3d:c0:34:cc",
            "net4": "6e:c9:85:8d:b9:37",
            "net5": "3a:66:32:af:ef:ad",
            "net6": "be:6e:a2:ce:d1:18"
        },
        "leaf_8_0_2": {
            "net0": "a6:c4:71:c1:a5:84",
            "net1": "96:b6:f1:90:90:63",
            "net2": "c2:13:cb:73:f6:c4",
            "net3": "d2:3e:b7:ac:3e:ae",
            "net4": "72:97:24:ec:dd:f9",
            "net5": "f2:90:09:06:a8:95",
            "net6": "b2:f1:f4:d2:7b:d4"
        },
        "leaf_8_0_3": {
            "net0": "72:87:a5:d6:bf:bc",
            "net1": "be:a2:d4:41:05:f2",
            "net2": "9e:c6:0d:17:e6:fd",
            "net3": "ea:8f:a3:4c:c5:e2",
            "net4": "3e:92:76:df:3e:7a",
            "net5": "6e:fa:ff:a2:97:b4",
            "net6": "be:02:54:5e:61:68"
        },
        "leaf_8_0_4": {
            "net0": "7a:d5:e4:cb:82:8b",
            "net1": "4a:58:2e:b3:64:90",
            "net2": "36:ee:4b:68:cb:ff",
            "net3": "7e:6e:ef:a1:62:5f",
            "net4": "de:bc:e3:b1:60:c4",
            "net5": "aa:ac:36:5e:3e:02",
            "net6": "aa:08:2f:c7:d1:aa"
        },
        "leaf_8_0_5": {
            "net0": "9e:9a:f0:ea:65:75",
            "net1": "4a:a8:06:e5:5a:33",
            "net2": "d2:1c:16:4f:9f:e2",
            "net3": "ea:c9:42:7f:d0:e5",
            "net4": "7a:34:a4:fd:19:9d",
            "net5": "7e:d6:61:44:dd:93",
            "net6": "4a:8e:75:ac:53:d6"
        },
        "leaf_8_0_6": {
            "net0": "8e:96:dc:fa:ad:0d",
            "net1": "ea:11:a5:46:5d:2e",
            "net2": "b6:6a:df:47:d2:24",
            "net3": "9a:ef:c8:c0:63:7d",
            "net4": "5e:b9:fb:20:1d:50",
            "net5": "82:71:d2:fa:1b:a3",
            "net6": "26:a0:ea:f7:6e:d0"
        },
        "leaf_9_0_1": {
            "net0": "76:2f:27:97:95:6e",
            "net1": "4a:4f:a0:1e:05:0d",
            "net2": "ba:5a:51:26:66:21",
            "net3": "7a:fd:93:9a:a4:79",
            "net4": "5a:0d:3d:a6:84:21",
            "net5": "aa:0f:08:35:ba:26",
            "net6": "fe:62:9a:11:07:0e"
        },
        "leaf_9_0_2": {
            "net0": "76:c1:b8:ed:72:16",
            "net1": "ba:0b:f5:9d:4c:9f",
            "net2": "e2:8f:30:63:d3:58",
            "net3": "aa:19:0b:dd:f9:0c",
            "net4": "12:a4:03:1c:30:2f",
            "net5": "1a:75:5b:a9:2f:28",
            "net6": "6e:6d:6f:8b:2c:03"
        },
        "leaf_9_0_3": {
            "net0": "9e:e5:c1:dc:c9:4a",
            "net1": "2a:1f:6a:7b:47:44",
            "net2": "82:8f:cb:1b:4e:47",
            "net3": "ae:b8:be:10:b9:02",
            "net4": "3e:7c:f1:c0:63:91",
            "net5": "6e:ab:28:c4:99:70",
            "net6": "1a:94:8e:83:84:4a"
        },
        "leaf_9_0_4": {
            "net0": "32:6f:0c:8c:c9:e2",
            "net1": "7e:f7:b9:29:4c:80",
            "net2": "ce:c4:2b:14:ea:d0",
            "net3": "a2:4c:20:12:0b:fb",
            "net4": "fa:7f:26:7d:73:c3",
            "net5": "8a:ba:a4:d1:dc:99",
            "net6": "ca:41:0f:96:79:cd"
        },
        "leaf_9_0_5": {
            "net0": "d2:a8:89:2a:6b:e2",
            "net1": "1e:79:b0:53:42:0f",
            "net2": "9e:a3:11:56:43:87",
            "net3": "ca:ac:a9:e4:7a:d5",
            "net4": "2a:63:85:9e:99:36",
            "net5": "4e:7b:ca:29:19:10",
            "net6": "ea:50:54:7f:fc:e4"
        },
        "leaf_9_0_6": {
            "net0": "e6:d2:aa:44:be:48",
            "net1": "be:ca:44:f8:9c:8a",
            "net2": "b2:40:90:1e:49:25",
            "net3": "32:4c:fd:73:a8:b3",
            "net4": "8a:ff:61:85:d9:90",
            "net5": "6e:d7:43:30:ff:50",
            "net6": "d2:59:18:90:3f:42"
        },
        "spine_10_1_1": {
            "net0": "1e:f4:3c:c6:02:0a",
            "net1": "d6:9c:6f:bd:c2:4b",
            "net10": "76:cc:5c:c3:50:fc",
            "net11": "fe:52:dd:9e:47:d6",
            "net2": "a6:b7:c1:64:92:14",
            "net3": "1e:28:f4:c3:92:07",
            "net4": "fa:e5:f9:a2:13:1b",
            "net5": "86:b9:a2:30:da:03",
            "net6": "42:6c:03:9e:33:12",
            "net7": "46:2c:eb:46:a5:e1",
            "net8": "6a:b4:84:ec:b7:17",
            "net9": "0e:cc:9e:66:d4:85"
        },
        "spine_10_1_2": {
            "net0": "fe:ad:3c:1e:07:cf",
            "net1": "26:08:b5:c6:08:4e",
            "net10": "5a:de:dd:37:20:12",
            "net11": "52:15:86:bc:d4:3f",
            "net2": "02:14:87:9f:f2:66",
            "net3": "06:89:5e:17:0d:87",
            "net4": "52:fb:27:39:4f:a4",
            "net5": "ca:0d:19:09:7f:10",
            "net6": "ee:68:31:bb:46:02",
            "net7": "9a:23:fd:17:26:b1",
            "net8": "16:6c:dc:42:cc:f2",
            "net9": "ae:34:6d:4a:9b:37"
        },
        "spine_10_1_3": {
            "net0": "a6:82:b2:44:bb:19",
            "net1": "12:fc:5c:0d:d9:fb",
            "net10": "5a:4a:c8:d6:16:2f",
            "net11": "4a:25:25:dd:12:6e",
            "net2": "f2:5a:1e:ab:b5:af",
            "net3": "4a:d6:83:2a:c1:ce",
            "net4": "96:24:6e:b6:bd:bb",
            "net5": "ba:cb:e2:5e:22:e1",
            "net6": "2a:bd:25:f3:5f:f1",
            "net7": "be:03:a9:af:83:52",
            "net8": "82:78:4f:90:37:58",
            "net9": "0a:a3:68:8b:b2:48"
        },
        "spine_10_1_4": {
            "net0": "2e:dd:3b:ae:b6:b1",
            "net1": "2a:1a:ed:52:a4:26",
            "net10": "a2:d8:1d:c9:37:c3",
            "net11": "62:50:85:8b:b9:db",
            "net2": "c6:f5:1e:67:e1:dd",
            "net3": "b2:11:99:18:1d:00",
            "net4": "6a:c5:f7:e3:3a:92",
            "net5": "1e:cd:7d:aa:5f:50",
            "net6": "96:14:56:b6:10:e2",
            "net7": "be:6b:19:0a:d4:3b",
            "net8": "a6:05:3e:ab:52:37",
            "net9": "52:03:81:f2:0f:5f"
        },
        "spine_10_1_5": {
            "net0": "da:f2:0b:05:fb:68",
            "net1": "f6:8d:4e:ae:18:e5",
            "net10": "a2:a0:a4:dd:a7:37",
            "net11": "0e:9e:46:a6:27:2f",
            "net2": "da:21:67:3a:6f:84",
            "net3": "6a:19:79:1a:be:6a",
            "net4": "be:d2:45:b1:83:0a",
            "net5": "06:a1:b7:66:85:43",
            "net6": "e2:9c:ba:e9:b5:ec",
            "net7": "b6:cd:38:87:37:ef",
            "net8": "ea:04:f4:c8:ae:47",
            "net9": "6e:41:4f:4f:f1:62"
        },
        "spine_10_1_6": {
            "net0": "6a:77:56:84:12:d8",
            "net1": "a6:2f:71:ba:78:8f",
            "net10": "5e:60:6c:01:0d:94",
            "net11": "b2:d3:db:06:31:9b",
            "net2": "5a:0e:c8:c4:2b:b2",
            "net3": "ca:c2:c0:39:21:bc",
            "net4": "fa:87:41:de:0d:5d",
            "net5": "4e:75:af:85:d8:4a",
            "net6": "96:5e:8f:95:0a:88",
            "net7": "96:77:58:df:e0:63",
            "net8": "be:3e:b9:36:d1:22",
            "net9": "72:95:82:03:39:96"
        },
        "spine_11_1_1": {
            "net0": "5e:37:e1:cb:e3:e8",
            "net1": "a2:28:78:fa:3f:ab",
            "net10": "9a:47:00:9c:fb:e1",
            "net11": "f2:3b:35:17:1d:0f",
            "net2": "ea:bc:09:a3:08:17",
            "net3": "32:ae:cd:55:17:a0",
            "net4": "2e:2b:0e:62:cf:b7",
            "net5": "8a:89:f9:e3:24:c5",
            "net6": "96:65:9f:5b:54:67",
            "net7": "ba:e8:00:cd:1c:bb",
            "net8": "36:66:ab:f0:3e:e5",
            "net9": "8a:77:73:b5:bf:8c"
        },
        "spine_11_1_2": {
            "net0": "76:a1:60:3b:45:d0",
            "net1": "c2:d1:38:0f:35:95",
            "net10": "06:b6:83:0f:03:f6",
            "net11": "1a:1b:8a:73:8d:cb",
            "net2": "56:4e:34:b3:0e:c6",
            "net3": "2a:30:e0:7a:91:93",
            "net4": "ee:b7:b4:e5:60:ef",
            "net5": "b6:11:13:1c:5b:c7",
            "net6": "52:e4:8d:7b:fc:f2",
            "net7": "46:48:24:d1:6e:75",
            "net8": "82:9c:23:7f:23:44",
            "net9": "a2:50:21:b6:3d:26"
        },
        "spine_11_1_3": {
            "net0": "4a:91:da:2c:1d:96",
            "net1": "7e:88:d7:ca:6d:5c",
            "net10": "5a:d0:52:8e:a8:49",
            "net11": "56:00:97:1b:7f:c3",
            "net2": "aa:d7:91:22:af:26",
            "net3": "b6:f1:31:47:ca:0b",
            "net4": "3a:04:79:79:4e:c7",
            "net5": "9a:a0:43:e3:62:0b",
            "net6": "ea:29:41:b1:9c:08",
            "net7": "fa:55:a0:d4:76:e4",
            "net8": "ea:68:9d:c0:66:68",
            "net9": "ee:81:47:b6:c4:4d"
        },
        "spine_11_1_4": {
            "net0": "66:75:b4:56:42:50",
            "net1": "46:7e:8d:4b:cf:70",
            "net10": "9e:7b:47:27:43:2d",
            "net11": "7a:1d:a0:8f:5e:c7",
            "net2": "82:fe:2b:d0:15:8b",
            "net3": "12:df:54:32:80:4b",
            "net4": "d6:62:44:74:0b:a7",
            "net5": "2a:20:34:e3:90:a7",
            "net6": "be:ed:b8:93:3a:e0",
            "net7": "6a:ff:21:8d:b1:61",
            "net8": "aa:ba:7d:66:d3:b2",
            "net9": "be:04:74:f8:b2:c5"
        },
        "spine_11_1_5": {
            "net0": "62:88:82:cf:bd:50",
            "net1": "f2:ad:82:6e:a7:b2",
            "net10": "3a:b6:f1:5a:3c:21",
            "net11": "a2:c2:9f:bd:fa:f0",
            "net2": "b6:af:0c:37:ca:b0",
            "net3": "26:f7:f1:81:24:5c",
            "net4": "a6:53:96:48:45:18",
            "net5": "06:dc:09:27:56:09",
            "net6": "8a:ee:8b:10:a2:54",
            "net7": "a6:9d:3d:10:b7:23",
            "net8": "4e:a9:03:4a:87:23",
            "net9": "c6:d5:28:95:22:39"
        },
        "spine_11_1_6": {
            "net0": "8a:ab:05:88:26:56",
            "net1": "ce:a6:7c:67:76:b5",
            "net10": "a2:d1:27:cd:89:b7",
            "net11": "9a:ed:44:a8:76:67",
            "net2": "e6:7b:5d:52:e8:e2",
            "net3": "56:03:84:28:83:d8",
            "net4": "da:33:c9:0d:27:d1",
            "net5": "92:f2:48:4b:52:38",
            "net6": "a2:a4:31:2c:08:7d",
            "net7": "b2:72:fc:9f:8e:ff",
            "net8": "ce:0b:03:f4:46:a2",
            "net9": "46:40:ba:a6:eb:7b"
        },
        "spine_12_1_1": {
            "net0": "ee:f3:e9:ef:bb:ce",
            "net1": "52:24:5e:22:1c:95",
            "net10": "ee:86:a1:79:58:08",
            "net11": "52:2b:cf:cf:e2:d0",
            "net2": "aa:a1:a4:8e:4c:39",
            "net3": "32:2e:4b:b5:03:d2",
            "net4": "6a:1e:22:2f:5b:4e",
            "net5": "c6:ee:b0:36:e4:52",
            "net6": "ee:fe:a2:52:b0:b5",
            "net7": "6a:34:6d:79:a6:86",
            "net8": "5e:b9:14:97:4d:4a",
            "net9": "ee:4b:93:f5:3a:62"
        },
        "spine_12_1_2": {
            "net0": "72:4a:4f:5a:86:0d",
            "net1": "66:cd:77:56:93:07",
            "net10": "2a:6e:0f:93:dc:7d",
            "net11": "6a:30:90:68:08:36",
            "net2": "c2:ff:0e:20:57:10",
            "net3": "e6:14:c1:5a:60:1a",
            "net4": "1e:40:18:44:53:20",
            "net5": "02:a5:32:af:19:bd",
            "net6": "0e:7b:25:cc:d5:1a",
            "net7": "72:0b:8d:3f:c5:ec",
            "net8": "82:9d:f6:85:b0:10",
            "net9": "0e:47:f5:f6:c5:56"
        },
        "spine_12_1_3": {
            "net0": "3a:85:b2:d7:88:33",
            "net1": "ce:78:4c:24:0c:91",
            "net10": "3e:89:5b:ed:88:df",
            "net11": "b2:aa:83:88:75:98",
            "net2": "7a:fc:a1:63:c8:02",
            "net3": "2a:35:c5:9b:3d:ec",
            "net4": "d6:34:79:c3:06:3a",
            "net5": "c6:29:47:78:dd:cb",
            "net6": "a6:f7:d8:df:1d:78",
            "net7": "36:9c:df:3f:43:56",
            "net8": "ea:17:69:25:b6:88",
            "net9": "f2:88:9e:24:ed:e5"
        },
        "spine_12_1_4": {
            "net0": "f6:8d:dc:c9:4a:80",
            "net1": "3a:d6:f5:ca:e3:83",
            "net10": "ce:12:72:16:26:2f",
            "net11": "d6:97:98:ae:24:84",
            "net2": "de:9b:5f:b2:9e:f7",
            "net3": "e6:a5:2a:e9:cf:72",
            "net4": "aa:4f:eb:4c:47:28",
            "net5": "72:7a:0f:f6:7c:22",
            "net6": "ae:12:2a:2d:4c:d6",
            "net7": "3a:86:cb:57:06:a8",
            "net8": "fe:2c:c0:d3:33:57",
            "net9": "42:0d:e1:7e:be:57"
        },
        "spine_12_1_5": {
            "net0": "62:c8:46:3b:a8:86",
            "net1": "02:de:a8:4f:94:c7",
            "net10": "62:7f:84:ad:c9:f6",
            "net11": "ca:a2:b0:4c:a1:f7",
            "net2": "52:13:39:a8:24:94",
            "net3": "6e:08:17:59:f7:b7",
            "net4": "02:e5:e6:93:d5:40",
            "net5": "12:80:78:f8:62:ea",
            "net6": "da:83:ea:c0:02:5c",
            "net7": "22:ed:8d:a5:64:17",
            "net8": "b2:34:c2:6d:8f:84",
            "net9": "7a:f7:c1:34:ba:9c"
        },
        "spine_12_1_6": {
            "net0": "62:18:79:c8:35:81",
            "net1": "32:ac:33:9c:a8:77",
            "net10": "b2:f7:0b:01:1d:3a",
            "net11": "ee:d6:6c:24:84:9d",
            "net2": "7e:2f:be:35:68:ae",
            "net3": "4a:41:a0:d3:58:08",
            "net4": "a2:25:49:f9:1c:83",
            "net5": "26:15:a2:2e:ae:8d",
            "net6": "62:ba:31:87:1f:70",
            "net7": "7e:ff:37:9b:bc:99",
            "net8": "1a:04:cc:22:57:9c",
            "net9": "12:90:ad:ea:47:46"
        },
        "spine_1_1_1": {
            "net0": "02:a0:70:9d:50:57",
            "net1": "4e:b2:c6:8b:fe:3f",
            "net10": "0e:26:90:74:53:b2",
            "net11": "66:4e:a3:bb:66:dd",
            "net2": "5a:92:9d:2c:ed:a7",
            "net3": "9a:b5:c1:33:0f:c4",
            "net4": "72:37:4a:36:92:c6",
            "net5": "de:da:8a:53:8a:c9",
            "net6": "8a:a7:3c:4c:bb:6e",
            "net7": "62:63:d2:f6:30:a7",
            "net8": "ae:52:54:2e:1a:f6",
            "net9": "c2:78:bc:05:f7:00"
        },
        "spine_1_1_2": {
            "net0": "52:ba:1f:10:37:e5",
            "net1": "ba:83:10:a5:c9:22",
            "net10": "8a:e8:6d:12:d7:51",
            "net11": "76:e1:c4:8c:92:bd",
            "net2": "8e:ee:a9:4b:e7:a8",
            "net3": "a6:86:37:32:3a:ed",
            "net4": "f2:8c:ad:cb:74:05",
            "net5": "de:c5:3e:4e:13:58",
            "net6": "1a:ee:fc:02:37:07",
            "net7": "8a:3a:0f:37:72:8d",
            "net8": "66:e8:4b:4e:b6:d9",
            "net9": "7e:f0:b7:67:b4:87"
        },
        "spine_1_1_3": {
            "net0": "22:fd:37:0e:95:aa",
            "net1": "92:10:df:2a:2e:28",
            "net10": "f6:4d:d3:c8:b0:fe",
            "net11": "fe:f9:5a:b4:eb:5a",
            "net2": "a2:7b:9e:59:ff:cd",
            "net3": "c2:94:a6:26:ef:5a",
            "net4": "6a:bd:ad:58:20:68",
            "net5": "4a:24:90:0c:d3:2d",
            "net6": "ca:22:3d:1b:22:d2",
            "net7": "7e:9e:44:37:6c:8e",
            "net8": "ca:de:42:4a:4e:d2",
            "net9": "62:de:f8:92:84:7b"
        },
        "spine_1_1_4": {
            "net0": "96:bf:6c:3f:f5:d9",
            "net1": "62:63:33:ae:4b:27",
            "net10": "0e:f1:c2:24:69:8d",
            "net11": "fe:89:12:0b:01:8b",
            "net2": "2e:99:d5:97:cf:71",
            "net3": "26:33:35:f8:61:36",
            "net4": "ce:68:77:1d:d5:02",
            "net5": "9e:22:32:11:1d:23",
            "net6": "2a:5a:b4:3c:d7:51",
            "net7": "b2:68:39:cc:78:d7",
            "net8": "de:18:38:0b:fc:85",
            "net9": "5e:91:64:b6:b7:5c"
        },
        "spine_1_1_5": {
            "net0": "c2:f6:31:2e:b5:de",
            "net1": "0e:ae:f8:97:80:eb",
            "net10": "26:27:bd:e2:86:bd",
            "net11": "32:28:b1:19:7e:6e",
            "net2": "d6:3f:f9:15:11:d7",
            "net3": "9a:98:b7:2f:9c:6f",
            "net4": "52:a5:6e:f7:d7:db",
            "net5": "fa:97:db:c1:82:04",
            "net6": "12:10:6f:1a:6f:ea",
            "net7": "3e:f8:e2:00:9a:43",
            "net8": "22:55:81:2b:13:13",
            "net9": "86:48:29:de:f6:86"
        },
        "spine_1_1_6": {
            "net0": "ba:6d:ed:d6:2c:0d",
            "net1": "42:66:fa:59:a0:78",
            "net10": "5a:b6:75:84:42:ea",
            "net11": "de:ee:b1:e3:3b:e5",
            "net2": "2e:57:4d:b0:8d:49",
            "net3": "d2:95:ef:a1:a2:5b",
            "net4": "6e:f5:41:fc:58:8a",
            "net5": "3e:ff:7b:a8:8e:8d",
            "net6": "3a:fe:45:b7:b1:7d",
            "net7": "ba:43:0e:dd:ba:34",
            "net8": "fa:a1:2e:4c:86:0f",
            "net9": "2e:d8:8a:06:38:69"
        },
        "spine_2_1_1": {
            "net0": "a2:c0:69:8f:e2:c4",
            "net1": "1e:a0:a9:c9:a5:d5",
            "net10": "5e:36:79:4c:59:3f",
            "net11": "e6:f2:50:92:a0:08",
            "net2": "6e:b1:91:7b:fb:32",
            "net3": "6e:5c:68:e6:41:c7",
            "net4": "aa:9e:bd:dd:bc:99",
            "net5": "72:ed:28:1b:7d:79",
            "net6": "8e:90:6c:bb:84:83",
            "net7": "ba:a9:eb:b8:ac:d0",
            "net8": "96:e0:6a:c6:62:ce",
            "net9": "c2:3e:9c:c8:87:4b"
        },
        "spine_2_1_2": {
            "net0": "d6:91:95:97:72:5d",
            "net1": "be:79:0e:bc:db:05",
            "net10": "da:22:62:eb:72:5b",
            "net11": "4e:e3:b7:f5:f8:09",
            "net2": "ce:03:2b:c5:46:ec",
            "net3": "1a:eb:18:b1:43:0e",
            "net4": "be:d4:a4:cb:93:21",
            "net5": "3a:70:c3:e5:7b:04",
            "net6": "96:ec:d2:ca:d0:14",
            "net7": "da:8e:1f:5f:b9:a8",
            "net8": "0e:6b:49:92:19:49",
            "net9": "66:8f:5c:4e:2f:e7"
        },
        "spine_2_1_3": {
            "net0": "1e:ce:a7:72:d2:24",
            "net1": "c6:d5:2c:0d:c3:ec",
            "net10": "7e:d8:4c:3b:68:4d",
            "net11": "86:a3:19:b0:66:3d",
            "net2": "f6:d3:44:61:c1:3f",
            "net3": "82:97:76:68:17:76",
            "net4": "6e:5c:df:d5:a5:f7",
            "net5": "66:69:73:e0:75:95",
            "net6": "46:97:fd:6c:fa:38",
            "net7": "62:1c:7f:bd:ce:17",
            "net8": "22:cf:79:71:5d:04",
            "net9": "52:ae:da:a9:c6:ec"
        },
        "spine_2_1_4": {
            "net0": "8e:d8:7c:17:c8:5b",
            "net1": "fa:9b:ea:c8:89:84",
            "net10": "8e:8c:75:96:93:f9",
            "net11": "a6:fb:69:a8:4d:c9",
            "net2": "02:50:95:3d:df:bb",
            "net3": "e6:96:cf:65:b6:69",
            "net4": "62:e6:24:46:32:87",
            "net5": "a2:8b:63:d4:bc:88",
            "net6": "d2:f3:3a:d6:e9:e7",
            "net7": "3a:ea:6f:98:18:cb",
            "net8": "5a:f3:ea:1e:09:be",
            "net9": "16:b1:ce:1c:11:7f"
        },
        "spine_2_1_5": {
            "net0": "fe:ba:4a:c2:13:29",
            "net1": "7a:b8:48:cc:72:16",
            "net10": "9a:6a:83:8b:8c:53",
            "net11": "5e:4a:53:36:96:f2",
            "net2": "2e:7e:d3:b6:3b:24",
            "net3": "9a:81:d7:2c:9a:68",
            "net4": "72:53:b9:99:5a:e1",
            "net5": "62:ca:5c:26:ac:a2",
            "net6": "86:44:e7:4f:eb:88",
            "net7": "82:80:9e:ae:2b:4e",
            "net8": "06:fb:8b:1b:66:f0",
            "net9": "f2:c8:6b:89:6d:32"
        },
        "spine_2_1_6": {
            "net0": "12:20:c2:b3:7a:2d",
            "net1": "12:ca:72:c7:68:8c",
            "net10": "12:bd:ee:a3:9e:da",
            "net11": "da:81:92:94:25:fe",
            "net2": "f6:3a:f3:1e:ac:f7",
            "net3": "ae:8f:6f:3a:86:c7",
            "net4": "52:52:e5:2f:fc:eb",
            "net5": "1e:d6:1b:0b:ad:35",
            "net6": "66:01:6f:8f:d2:40",
            "net7": "d6:01:06:f9:0c:c4",
            "net8": "16:1e:e6:38:dc:e7",
            "net9": "da:58:b7:8b:77:f4"
        },
        "spine_3_1_1": {
            "net0": "8a:b4:d4:ed:a2:43",
            "net1": "9e:09:32:66:8c:32",
            "net10": "d6:ee:ed:fd:cd:c6",
            "net11": "3e:2a:01:c3:53:6f",
            "net2": "ee:d7:1d:69:76:e6",
            "net3": "6e:f3:b3:60:9f:13",
            "net4": "fe:e4:64:b7:df:cf",
            "net5": "6a:db:c2:29:29:4e",
            "net6": "5e:ad:a3:40:7e:83",
            "net7": "2a:56:10:30:64:05",
            "net8": "d2:77:0d:cc:4f:2f",
            "net9": "0a:1f:0e:59:ff:e5"
        },
        "spine_3_1_2": {
            "net0": "c2:14:40:30:0e:8d",
            "net1": "a6:0e:50:3b:fd:03",
            "net10": "3a:21:40:bf:02:01",
            "net11": "c2:2d:d2:8a:49:d0",
            "net2": "ba:70:58:60:e3:6f",
            "net3": "1a:88:d8:ca:13:cf",
            "net4": "be:2a:9b:9a:05:5a",
            "net5": "0e:5e:48:1e:48:96",
            "net6": "ce:34:c6:c7:95:f1",
            "net7": "c2:5f:62:76:d4:1a",
            "net8": "b6:71:d7:32:af:94",
            "net9": "96:2c:fd:94:2e:45"
        },
        "spine_3_1_3": {
            "net0": "06:77:69:9a:1d:97",
            "net1": "76:0f:a3:0e:9a:97",
            "net10": "52:52:e1:05:5e:56",
            "net11": "2e:2f:0f:0f:d4:1f",
            "net2": "56:c8:13:02:57:84",
            "net3": "52:63:ff:15:91:95",
            "net4": "b6:74:ca:64:37:a2",
            "net5": "9e:2d:31:71:1b:3d",
            "net6": "86:08:62:2d:ad:79",
            "net7": "ee:76:1c:24:37:9e",
            "net8": "0a:e5:42:1d:bf:b2",
            "net9": "8a:51:5f:1c:dd:6b"
        },
        "spine_3_1_4": {
            "net0": "da:51:57:47:75:76",
            "net1": "46:10:cc:dc:64:31",
            "net10": "c6:a7:f9:46:fa:8c",
            "net11": "42:48:46:59:38:19",
            "net2": "fa:0d:55:50:6d:14",
            "net3": "0a:6d:3b:1f:8a:41",
            "net4": "a2:da:9b:06:89:e2",
            "net5": "32:5b:7f:71:e7:b9",
            "net6": "ca:73:7c:31:87:f7",
            "net7": "4e:1b:1d:bb:be:06",
            "net8": "8e:b0:5c:aa:84:c3",
            "net9": "96:9b:54:0f:e3:39"
        },
        "spine_3_1_5": {
            "net0": "96:97:90:eb:19:12",
            "net1": "ce:e2:e6:c7:01:06",
            "net10": "5e:62:de:41:93:33",
            "net11": "4a:8c:d7:60:b0:0d",
            "net2": "3e:2c:d4:27:c9:b5",
            "net3": "ce:e1:60:81:9b:33",
            "net4": "da:80:b0:38:08:2f",
            "net5": "92:84:6c:d6:a5:14",
            "net6": "fa:be:86:87:22:12",
            "net7": "22:30:be:69:48:34",
            "net8": "0a:ed:7a:1d:b2:f9",
            "net9": "82:2e:0b:b5:65:30"
        },
        "spine_3_1_6": {
            "net0": "4a:31:72:58:4c:8a",
            "net1": "f2:f5:ed:17:cb:cd",
            "net10": "16:7f:97:5c:37:fa",
            "net11": "4e:3e:bc:23:69:33",
            "net2": "3a:3a:88:7f:3b:99",
            "net3": "26:9e:e3:85:6a:0a",
            "net4": "92:49:e3:0c:b7:4b",
            "net5": "5e:22:9e:a7:d3:80",
            "net6": "32:cd:81:f2:4b:af",
            "net7": "82:03:04:8d:f1:71",
            "net8": "46:48:29:85:91:3c",
            "net9": "9a:17:65:31:78:8b"
        },
        "spine_4_1_1": {
            "net0": "d6:bb:50:b6:0c:e4",
            "net1": "56:3a:04:cd:25:b6",
            "net10": "96:e1:4a:a0:3f:14",
            "net11": "0e:59:5b:db:b2:e8",
            "net2": "a2:69:e7:7f:c8:05",
            "net3": "ca:f8:35:38:40:94",
            "net4": "6e:ac:64:a2:94:8b",
            "net5": "f6:84:ec:81:3d:88",
            "net6": "56:b3:b2:05:3f:97",
            "net7": "be:01:97:d6:03:55",
            "net8": "f6:f4:f2:84:52:bc",
            "net9": "46:4b:17:a5:ae:ed"
        },
        "spine_4_1_2": {
            "net0": "12:f7:ab:bd:bc:bf",
            "net1": "96:1f:2e:d0:95:9b",
            "net10": "7a:1c:38:30:b8:76",
            "net11": "b2:90:6a:34:34:cd",
            "net2": "b2:0b:34:e4:1d:af",
            "net3": "f6:2a:1a:70:bb:44",
            "net4": "fa:df:2e:e5:38:94",
            "net5": "be:f3:f1:9d:5d:e8",
            "net6": "c6:82:90:a8:db:f5",
            "net7": "36:9c:b3:75:8d:3a",
            "net8": "b6:62:bb:11:20:76",
            "net9": "52:a5:02:d5:42:55"
        },
        "spine_4_1_3": {
            "net0": "e6:fd:80:a9:78:f8",
            "net1": "ae:d3:1d:89:c6:55",
            "net10": "4a:af:4f:36:75:b6",
            "net11": "4e:69:04:d7:f0:4a",
            "net2": "da:6a:ad:17:07:25",
            "net3": "9a:1d:b9:eb:5a:92",
            "net4": "96:49:33:9b:32:67",
            "net5": "b6:b1:5c:c0:f4:e9",
            "net6": "c2:67:4f:05:72:d0",
            "net7": "6a:b0:ba:08:9b:a2",
            "net8": "f6:11:f3:55:3f:9a",
            "net9": "2e:28:56:5a:cd:9b"
        },
        "spine_4_1_4": {
            "net0": "f2:fb:0a:77:78:cc",
            "net1": "5a:ac:21:1a:53:62",
            "net10": "9a:f1:4f:b3:c6:53",
            "net11": "d2:4e:45:cb:7e:b9",
            "net2": "36:cd:26:c3:16:a0",
            "net3": "1e:8b:a1:ab:5e:3f",
            "net4": "16:18:4b:55:03:2e",
            "net5": "2a:4c:88:7e:4f:84",
            "net6": "8e:78:c3:f6:18:42",
            "net7": "3a:8c:b2:17:54:c7",
            "net8": "46:ba:43:6f:a2:08",
            "net9": "ae:5e:03:f4:6b:63"
        },
        "spine_4_1_5": {
            "net0": "fe:d0:68:a6:ba:cb",
            "net1": "56:27:71:bf:d9:9f",
            "net10": "16:c6:70:05:57:85",
            "net11": "46:5f:fd:26:ed:78",
            "net2": "86:b5:ea:6a:2b:9c",
            "net3": "f6:3f:8c:27:3f:a5",
            "net4": "ae:25:cb:50:ea:78",
            "net5": "4e:d9:07:09:26:28",
            "net6": "ce:2f:1e:02:3c:1a",
            "net7": "5e:25:72:11:77:e0",
            "net8": "5e:8d:ce:62:ba:8d",
            "net9": "d6:e7:b5:6a:1e:34"
        },
        "spine_4_1_6": {
            "net0": "fe:6c:3f:e1:7b:3f",
            "net1": "82:62:ad:b4:b1:39",
            "net10": "ca:17:71:bb:91:8e",
            "net11": "96:c9:93:45:f1:ed",
            "net2": "aa:5e:99:f1:1a:ab",
            "net3": "ee:d9:ea:d3:17:d3",
            "net4": "9e:fe:84:31:79:f9",
            "net5": "b2:6a:c8:14:5e:90",
            "net6": "16:fc:56:58:92:af",
            "net7": "32:30:44:a9:c1:77",
            "net8": "a2:7f:67:fa:e2:0d",
            "net9": "da:de:c4:01:ae:91"
        },
        "spine_5_1_1": {
            "net0": "5e:f8:66:a8:57:ed",
            "net1": "12:d5:b6:cf:af:a6",
            "net10": "0e:5f:a3:99:0a:d7",
            "net11": "1a:e0:87:d9:15:55",
            "net2": "0a:54:f6:52:44:bc",
            "net3": "aa:8d:11:f6:43:1b",
            "net4": "f2:2f:c0:a8:6e:f7",
            "net5": "52:19:30:24:00:b4",
            "net6": "06:17:eb:f3:d4:e4",
            "net7": "b6:d1:e0:70:de:5a",
            "net8": "52:12:13:42:d2:44",
            "net9": "5a:d1:42:83:cb:39"
        },
        "spine_5_1_2": {
            "net0": "02:3d:1d:9d:e9:f0",
            "net1": "26:21:20:69:cf:2b",
            "net10": "16:9b:4d:fa:1d:85",
            "net11": "b2:cd:37:1e:22:b0",
            "net2": "f2:ba:4d:a9:86:58",
            "net3": "16:02:c7:20:1e:c3",
            "net4": "32:44:bd:48:8a:ce",
            "net5": "36:95:af:15:4d:3a",
            "net6": "6e:a6:a9:ad:c0:b2",
            "net7": "c2:ba:6b:1f:be:a2",
            "net8": "d6:8d:7f:49:5f:e7",
            "net9": "fa:9c:79:1a:67:ea"
        },
        "spine_5_1_3": {
            "net0": "0a:ba:43:0f:c1:76",
            "net1": "92:8c:96:c8:c2:c9",
            "net10": "82:47:db:43:4e:b0",
            "net11": "32:49:a7:00:df:c7",
            "net2": "82:0b:8d:69:38:9a",
            "net3": "82:85:77:0e:95:98",
            "net4": "de:51:74:6e:21:c3",
            "net5": "e2:6a:09:1a:52:1e",
            "net6": "0a:2f:3a:aa:0a:55",
            "net7": "ca:b0:d5:53:ea:61",
            "net8": "e2:d3:2d:02:ed:6b",
            "net9": "aa:2c:06:b6:5b:92"
        },
        "spine_5_1_4": {
            "net0": "a2:fb:6a:32:92:1e",
            "net1": "1a:a1:f3:cb:46:57",
            "net10": "de:00:2c:36:ce:af",
            "net11": "e2:6b:c3:8d:fa:84",
            "net2": "9e:18:7b:be:17:89",
            "net3": "06:f1:78:bc:74:bd",
            "net4": "16:9a:29:19:d1:29",
            "net5": "ee:04:9d:eb:87:33",
            "net6": "be:b1:5c:75:48:f7",
            "net7": "ea:cf:b2:5d:f0:ca",
            "net8": "2e:a1:71:19:a5:44",
            "net9": "7e:a0:19:ab:b0:ef"
        },
        "spine_5_1_5": {
            "net0": "fe:29:2a:bd:79:ec",
            "net1": "0a:67:21:ea:a0:24",
            "net10": "66:f5:46:7a:c4:d9",
            "net11": "0a:2d:9b:69:b5:01",
            "net2": "b6:ff:35:5a:79:05",
            "net3": "6a:bc:00:c8:aa:6a",
            "net4": "fe:f7:6c:c2:14:e8",
            "net5": "8a:9c:95:7b:7e:b2",
            "net6": "3a:c7:f8:a0:53:ab",
            "net7": "b6:4d:90:52:3a:6b",
            "net8": "fa:07:bf:bd:85:d8",
            "net9": "2e:6e:b8:a6:8e:3a"
        },
        "spine_5_1_6": {
            "net0": "9a:b8:68:40:25:5c",
            "net1": "9a:32:21:24:41:2c",
            "net10": "e6:e6:12:6a:d6:dd",
            "net11": "52:cf:53:2b:ac:3a",
            "net2": "26:62:9e:1d:0c:e1",
            "net3": "4e:7d:c8:86:0e:73",
            "net4": "76:db:5c:11:c9:5f",
            "net5": "06:e2:43:0c:5b:46",
            "net6": "32:47:a8:8c:6c:71",
            "net7": "16:78:23:be:97:f8",
            "net8": "b2:26:24:c3:f9:b5",
            "net9": "7e:f9:86:45:7b:eb"
        },
        "spine_6_1_1": {
            "net0": "26:d1:94:b5:20:62",
            "net1": "ae:bf:3d:e9:2a:0f",
            "net10": "26:76:fb:a2:6e:17",
            "net11": "02:a5:81:72:d0:21",
            "net2": "76:e2:8d:a2:06:5f",
            "net3": "02:55:61:fa:db:28",
            "net4": "7a:be:75:09:11:7d",
            "net5": "a6:ec:b5:65:11:85",
            "net6": "a2:ce:6d:3a:f1:1b",
            "net7": "f6:78:3f:32:59:76",
            "net8": "3a:e9:1e:33:f8:07",
            "net9": "32:a3:e2:86:49:ab"
        },
        "spine_6_1_2": {
            "net0": "02:6f:d1:4f:12:6c",
            "net1": "16:87:0a:f8:8f:7e",
            "net10": "be:ac:4c:0d:a7:be",
            "net11": "e2:a2:e5:a8:50:ed",
            "net2": "a6:95:3c:dc:29:3b",
            "net3": "32:bf:13:d4:61:cf",
            "net4": "e2:97:e7:11:f6:06",
            "net5": "52:5f:44:e6:8d:ce",
            "net6": "56:01:41:a5:8f:84",
            "net7": "4e:54:44:0b:74:90",
            "net8": "ee:1d:94:f0:eb:81",
            "net9": "8a:d8:2f:d0:be:2c"
        },
        "spine_6_1_3": {
            "net0": "ba:3e:b1:4b:8f:c8",
            "net1": "2a:1d:fe:31:7c:a9",
            "net10": "f6:45:46:48:d1:14",
            "net11": "be:dc:fd:55:69:10",
            "net2": "26:51:a9:c6:61:7a",
            "net3": "0a:65:f3:bb:81:ee",
            "net4": "a2:5a:dc:e4:00:82",
            "net5": "46:55:6b:67:52:57",
            "net6": "06:b2:da:e5:81:cd",
            "net7": "b6:39:1c:88:f1:da",
            "net8": "e6:bb:24:da:86:52",
            "net9": "56:f5:f8:71:a0:e8"
        },
        "spine_6_1_4": {
            "net0": "f2:a1:d6:2e:f9:5a",
            "net1": "c2:21:97:c9:f7:13",
            "net10": "16:ec:ee:ea:18:1d",
            "net11": "4e:e5:ec:63:bb:e5",
            "net2": "3a:c5:f7:f9:fc:6e",
            "net3": "1a:c5:56:63:bd:6f",
            "net4": "7a:ea:f4:6b:94:f8",
            "net5": "4e:ae:70:52:aa:58",
            "net6": "f2:1d:36:66:46:f5",
            "net7": "ca:c1:60:0b:e9:80",
            "net8": "4e:f3:9d:d8:74:32",
            "net9": "fa:23:71:77:c3:75"
        },
        "spine_6_1_5": {
            "net0": "b6:3b:85:44:e1:82",
            "net1": "da:7d:01:88:0c:4b",
            "net10": "92:b0:02:16:5b:4d",
            "net11": "d6:ff:6a:43:cf:d1",
            "net2": "0a:fe:e2:34:2e:65",
            "net3": "3e:eb:51:54:d3:f3",
            "net4": "4e:3b:db:d6:28:81",
            "net5": "0a:50:23:81:ad:c3",
            "net6": "9a:6a:98:a8:d7:91",
            "net7": "96:1e:cf:50:0d:81",
            "net8": "7e:5f:5e:b8:52:63",
            "net9": "0a:e1:8e:1c:ba:6a"
        },
        "spine_6_1_6": {
            "net0": "92:ea:40:c4:72:2a",
            "net1": "aa:dd:29:eb:c6:d9",
            "net10": "be:75:b8:1a:24:bf",
            "net11": "1a:62:c1:27:86:a1",
            "net2": "52:80:cc:36:11:e0",
            "net3": "ea:ad:fa:5d:df:3d",
            "net4": "b6:5b:24:aa:c5:9d",
            "net5": "0e:b1:0c:99:2c:b0",
            "net6": "86:5a:b0:17:bc:00",
            "net7": "ee:f5:73:f5:e4:23",
            "net8": "ca:99:e4:4b:97:47",
            "net9": "22:27:ce:fe:79:74"
        },
        "spine_7_1_1": {
            "net0": "ca:0d:6f:1f:fc:3b",
            "net1": "ba:63:2e:b2:28:93",
            "net10": "0e:4e:dd:6e:c5:00",
            "net11": "ae:f0:3d:37:9a:12",
            "net2": "2a:da:af:bc:ac:f6",
            "net3": "5e:1c:7b:7a:70:e1",
            "net4": "fa:3e:f0:9d:44:75",
            "net5": "0e:8e:5c:ba:b9:d7",
            "net6": "1a:d6:70:21:6b:38",
            "net7": "96:1e:bc:1e:1b:12",
            "net8": "f2:e0:b1:55:e8:87",
            "net9": "b6:69:2a:a8:45:6e"
        },
        "spine_7_1_2": {
            "net0": "d2:11:7a:9a:db:f5",
            "net1": "9a:36:05:8c:d4:54",
            "net10": "6e:23:91:52:54:1b",
            "net11": "02:a0:64:cb:80:94",
            "net2": "66:2c:30:67:6e:90",
            "net3": "da:9e:e1:4a:32:50",
            "net4": "a2:53:ef:33:5b:98",
            "net5": "7e:1a:f1:3f:5d:77",
            "net6": "92:2a:81:b4:2f:97",
            "net7": "ba:d6:0e:86:e7:59",
            "net8": "fe:d3:e0:49:e3:97",
            "net9": "8a:5b:d1:6c:2d:99"
        },
        "spine_7_1_3": {
            "net0": "5e:e3:61:1d:31:bc",
            "net1": "96:18:cb:bb:50:17",
            "net10": "06:b7:46:41:17:0f",
            "net11": "52:fa:7d:a0:1a:46",
            "net2": "be:64:45:ad:a5:6f",
            "net3": "fa:50:a2:f7:61:9f",
            "net4": "a6:19:7e:b3:48:63",
            "net5": "ae:c9:0a:c7:8e:23",
            "net6": "96:a6:a5:32:ab:79",
            "net7": "ae:c5:77:79:eb:e2",
            "net8": "82:6f:58:c3:af:73",
            "net9": "aa:02:1a:fd:5e:73"
        },
        "spine_7_1_4": {
            "net0": "06:f5:9f:ff:3e:58",
            "net1": "8a:f5:f0:dd:e4:25",
            "net10": "06:cf:a1:04:9b:9d",
            "net11": "b6:ef:06:6c:ac:0e",
            "net2": "1a:6c:28:af:b0:d6",
            "net3": "6a:55:76:86:8f:13",
            "net4": "76:f4:53:37:f6:fd",
            "net5": "ee:62:3c:79:bc:86",
            "net6": "2e:0a:86:36:9c:54",
            "net7": "8a:de:65:89:c4:0e",
            "net8": "62:9d:b2:1e:03:7d",
            "net9": "82:e0:f5:b3:b8:d3"
        },
        "spine_7_1_5": {
            "net0": "4e:2c:ce:f7:5a:32",
            "net1": "da:f2:55:99:49:63",
            "net10": "96:2e:8e:d2:36:b4",
            "net11": "ba:36:34:64:34:40",
            "net2": "f6:08:84:c2:58:cf",
            "net3": "56:de:eb:7d:93:69",
            "net4": "a6:27:ef:b0:23:48",
            "net5": "f2:93:bf:b4:95:1b",
            "net6": "a2:47:d4:e1:ac:f8",
            "net7": "5a:bf:dd:74:ce:09",
            "net8": "42:4c:bd:2b:d7:0b",
            "net9": "26:b3:ff:5f:90:7d"
        },
        "spine_7_1_6": {
            "net0": "9e:cf:8c:4b:89:66",
            "net1": "6a:4e:a0:de:3d:0c",
            "net10": "7a:8e:b4:ad:2a:e0",
            "net11": "da:8e:f2:6c:4d:3c",
            "net2": "36:c9:68:97:d5:1a",
            "net3": "82:1f:61:44:ba:d8",
            "net4": "4e:7d:ae:b4:28:03",
            "net5": "76:4b:38:24:03:00",
            "net6": "52:f1:2b:7f:8f:c7",
            "net7": "4e:59:2d:a2:16:ee",
            "net8": "0a:1f:dd:d5:37:51",
            "net9": "8e:06:8e:37:10:a7"
        },
        "spine_8_1_1": {
            "net0": "96:b3:cf:fa:4d:a7",
            "net1": "46:3b:8e:61:22:f5",
            "net10": "fa:81:7f:70:35:ef",
            "net11": "aa:4b:6c:8e:d2:14",
            "net2": "ea:5d:2e:b9:6c:7d",
            "net3": "5a:14:d7:b6:58:a0",
            "net4": "86:35:80:2e:85:2e",
            "net5": "3a:08:55:1d:cc:0e",
            "net6": "8e:a1:31:39:09:ef",
            "net7": "c6:64:72:f6:8c:9c",
            "net8": "be:c9:f4:ad:80:9a",
            "net9": "7a:68:17:48:46:25"
        },
        "spine_8_1_2": {
            "net0": "9e:b4:d4:80:a9:ef",
            "net1": "6a:e3:49:07:1e:9a",
            "net10": "ea:71:6c:09:79:64",
            "net11": "5a:27:da:e6:77:db",
            "net2": "b6:0c:bb:27:37:af",
            "net3": "a6:6f:54:fe:ba:b2",
            "net4": "5a:a9:d7:ec:0d:f8",
            "net5": "ea:ed:0f:b3:31:71",
            "net6": "2e:0e:11:a3:bd:41",
            "net7": "ee:c4:b2:c4:d4:f9",
            "net8": "e6:b6:db:9d:5d:29",
            "net9": "02:2d:d5:15:96:1d"
        },
        "spine_8_1_3": {
            "net0": "66:9d:38:3b:36:59",
            "net1": "7e:2f:20:e9:16:c5",
            "net10": "72:ab:48:45:bb:87",
            "net11": "1a:62:2b:98:88:37",
            "net2": "96:db:19:31:74:b9",
            "net3": "a2:e1:34:e3:ee:a3",
            "net4": "5a:12:fb:6c:3a:69",
            "net5": "7a:0f:01:41:d9:4d",
            "net6": "12:17:eb:88:1d:ca",
            "net7": "3a:ec:0a:7a:1b:62",
            "net8": "ae:8b:8c:34:ca:fa",
            "net9": "56:2e:72:50:72:ae"
        },
        "spine_8_1_4": {
            "net0": "8a:63:9c:ea:3d:bb",
            "net1": "b2:77:3f:d6:14:53",
            "net10": "c2:99:bc:5e:44:97",
            "net11": "de:4a:2c:85:44:6c",
            "net2": "3e:b5:f5:d7:24:5e",
            "net3": "fa:9d:aa:cd:a7:8a",
            "net4": "52:48:8a:a8:cd:99",
            "net5": "1a:76:a5:68:18:ac",
            "net6": "9e:4b:1b:86:87:3a",
            "net7": "1e:5a:29:7a:45:ae",
            "net8": "4a:c0:85:35:43:55",
            "net9": "0e:36:c1:c2:68:7a"
        },
        "spine_8_1_5": {
            "net0": "ba:45:10:68:ba:31",
            "net1": "86:e4:7a:1d:3f:04",
            "net10": "22:d3:b6:35:70:64",
            "net11": "ae:6a:d4:0d:12:4d",
            "net2": "32:46:f2:2c:64:82",
            "net3": "0e:0f:d6:24:62:44",
            "net4": "72:34:f8:b5:bc:98",
            "net5": "32:73:5f:07:fc:76",
            "net6": "92:46:8a:89:98:68",
            "net7": "de:57:dc:5f:fe:6a",
            "net8": "4e:ed:61:a7:4b:e4",
            "net9": "16:6d:1c:73:80:1d"
        },
        "spine_8_1_6": {
            "net0": "6a:46:db:02:0d:d0",
            "net1": "7a:bf:9a:7c:bf:5e",
            "net10": "46:8d:7e:f7:7f:4b",
            "net11": "aa:ea:8e:ce:fa:ae",
            "net2": "12:4e:af:1f:63:e4",
            "net3": "ce:11:6f:a9:41:67",
            "net4": "da:be:66:81:c3:b5",
            "net5": "6e:b0:b4:a9:f5:ad",
            "net6": "fa:09:96:88:ec:19",
            "net7": "d6:d4:4c:20:b0:73",
            "net8": "da:3e:13:df:36:df",
            "net9": "d2:24:6f:c9:38:4b"
        },
        "spine_9_1_1": {
            "net0": "86:0d:d0:57:9e:fb",
            "net1": "a6:25:30:6c:5e:bd",
            "net10": "fe:36:07:91:3b:f3",
            "net11": "4a:8e:99:27:b7:0d",
            "net2": "5a:06:dc:bb:23:56",
            "net3": "3a:b5:66:3d:39:43",
            "net4": "b2:c9:3c:66:a8:96",
            "net5": "66:ea:a1:0e:b8:c4",
            "net6": "9a:e7:37:a0:8e:46",
            "net7": "9a:e4:1c:be:33:fd",
            "net8": "0e:e6:23:50:96:9f",
            "net9": "ce:ef:aa:ab:62:b7"
        },
        "spine_9_1_2": {
            "net0": "e2:84:f7:8e:10:8c",
            "net1": "ca:ef:eb:36:13:88",
            "net10": "e6:1a:a3:83:b1:d2",
            "net11": "9e:35:27:3d:5b:d6",
            "net2": "06:5a:b1:6e:f8:55",
            "net3": "16:23:cf:27:15:81",
            "net4": "f6:ba:90:30:a2:d1",
            "net5": "a2:fc:fa:57:35:9c",
            "net6": "d6:6d:ff:13:b2:04",
            "net7": "ce:40:5b:b6:29:1b",
            "net8": "ae:a7:a3:46:92:14",
            "net9": "52:97:20:68:5a:27"
        },
        "spine_9_1_3": {
            "net0": "a2:93:77:a4:d8:94",
            "net1": "52:4b:fa:af:90:cc",
            "net10": "72:ff:76:8d:31:3a",
            "net11": "52:44:46:1a:25:57",
            "net2": "c6:90:d5:d2:39:94",
            "net3": "ee:58:c7:a7:18:0f",
            "net4": "22:58:49:ab:49:77",
            "net5": "0e:b6:21:9c:d6:f3",
            "net6": "36:3e:61:bd:a2:1f",
            "net7": "d2:65:aa:50:85:33",
            "net8": "ea:b9:00:c3:ec:f6",
            "net9": "86:9e:52:67:81:fa"
        },
        "spine_9_1_4": {
            "net0": "de:53:5c:82:df:c8",
            "net1": "be:d7:39:f1:3f:a1",
            "net10": "8a:09:05:92:cb:dc",
            "net11": "92:de:d7:a6:b6:26",
            "net2": "2a:12:98:19:f7:e6",
            "net3": "42:96:ec:27:5e:be",
            "net4": "06:2b:85:8e:2c:ed",
            "net5": "da:df:af:0a:e1:82",
            "net6": "ea:59:81:6f:64:f1",
            "net7": "7e:95:d9:76:1d:e7",
            "net8": "4a:e4:1e:36:39:d6",
            "net9": "c2:b7:b2:92:49:af"
        },
        "spine_9_1_5": {
            "net0": "a6:04:bf:f0:73:a2",
            "net1": "e2:45:01:a4:1d:ba",
            "net10": "1e:a3:ce:a6:ef:ca",
            "net11": "36:c2:c7:e9:90:e2",
            "net2": "62:ac:50:e4:e3:49",
            "net3": "c2:3a:9b:f8:98:4d",
            "net4": "fa:9c:f6:6a:26:2f",
            "net5": "da:bb:31:07:ac:79",
            "net6": "b6:38:cf:81:94:dd",
            "net7": "56:0f:92:8e:7c:94",
            "net8": "ee:c1:ed:63:b7:93",
            "net9": "be:e2:8a:58:22:a7"
        },
        "spine_9_1_6": {
            "net0": "66:43:6b:8b:8d:86",
            "net1": "4a:04:fd:7c:e6:df",
            "net10": "ee:ae:c6:53:67:2f",
            "net11": "66:f1:f6:cc:ed:9a",
            "net2": "52:9e:a4:ef:81:03",
            "net3": "0a:f9:b9:9f:47:b2",
            "net4": "02:d4:c3:1c:03:ec",
            "net5": "de:45:34:0d:6a:b3",
            "net6": "ca:a8:e2:3b:e7:ec",
            "net7": "9a:32:10:80:ba:a5",
            "net8": "96:ae:98:8b:7e:0e",
            "net9": "82:66:66:b8:24:3e"
        },
        "tof_1_2_1": {
            "net0": "02:12:56:1f:d3:fe",
            "net1": "f6:0c:5a:28:f3:5f",
            "net10": "fe:96:10:c9:f8:42",
            "net11": "a6:02:de:c7:42:ab",
            "net2": "b2:e8:16:9a:4c:66",
            "net3": "de:3e:76:5b:c6:e8",
            "net4": "b2:de:2f:73:49:20",
            "net5": "ae:c0:a8:6e:a1:81",
            "net6": "16:d1:07:fc:3a:47",
            "net7": "ea:ea:61:30:42:ff",
            "net8": "7a:f1:ca:a6:34:e7",
            "net9": "ae:b6:12:14:8a:a1"
        },
        "tof_1_2_2": {
            "net0": "66:cf:2a:2e:92:38",
            "net1": "5e:42:bc:d3:a3:f6",
            "net10": "56:d8:0e:af:ac:9d",
            "net11": "be:ad:1a:fa:21:8c",
            "net2": "76:d0:61:cf:34:07",
            "net3": "6e:b3:63:30:b6:84",
            "net4": "02:a9:8b:97:a6:17",
            "net5": "06:4e:ab:ef:00:5e",
            "net6": "66:1f:76:35:36:32",
            "net7": "e2:94:76:ae:c3:51",
            "net8": "62:db:d8:70:cf:d8",
            "net9": "02:91:18:e7:02:9c"
        },
        "tof_1_2_3": {
            "net0": "4a:34:7f:45:56:2c",
            "net1": "ca:d6:ac:99:55:a1",
            "net10": "ca:96:c8:cb:8b:da",
            "net11": "0e:3f:f2:c7:0e:bb",
            "net2": "e6:74:58:6e:51:d5",
            "net3": "9a:28:f7:7f:47:76",
            "net4": "3e:c5:50:6c:9d:ff",
            "net5": "a2:16:07:47:78:19",
            "net6": "4a:dd:b2:18:13:42",
            "net7": "72:7b:e4:95:39:09",
            "net8": "2a:05:d2:0a:e6:9c",
            "net9": "0a:33:19:7f:c9:56"
        },
        "tof_1_2_4": {
            "net0": "32:d6:a6:68:9a:64",
            "net1": "76:55:bf:84:7e:91",
            "net10": "06:48:e4:ed:f0:c1",
            "net11": "a2:de:55:0f:99:9c",
            "net2": "32:42:87:c9:86:e6",
            "net3": "42:7d:3b:23:16:49",
            "net4": "8e:44:2a:a2:37:78",
            "net5": "ea:41:d2:85:2f:bf",
            "net6": "4e:e7:7b:c1:c8:d8",
            "net7": "a2:d0:0d:18:34:81",
            "net8": "ce:6b:b0:00:61:8d",
            "net9": "66:b5:08:44:a3:ea"
        },
        "tof_1_2_5": {
            "net0": "4a:dd:e5:85:4c:0f",
            "net1": "3a:bf:db:36:a6:40",
            "net10": "66:e1:b3:e3:ff:99",
            "net11": "4a:cf:d7:40:9f:f4",
            "net2": "46:fa:27:b3:0b:c3",
            "net3": "b6:e2:54:9f:6e:d3",
            "net4": "36:d2:12:d3:c2:30",
            "net5": "9a:5c:b6:5d:9d:a8",
            "net6": "9a:20:31:0b:1f:46",
            "net7": "b2:0b:9a:18:02:31",
            "net8": "36:7e:f8:fd:58:cc",
            "net9": "96:ee:2a:45:4f:72"
        },
        "tof_1_2_6": {
            "net0": "ae:30:f5:3e:2b:49",
            "net1": "66:bd:97:6a:a4:3c",
            "net10": "02:f5:d2:eb:b3:db",
            "net11": "e6:45:42:1c:e5:0c",
            "net2": "9e:ee:6a:9a:39:65",
            "net3": "ea:a5:34:d6:5a:c9",
            "net4": "a6:48:fb:24:cc:9f",
            "net5": "7e:f3:3b:2f:dd:86",
            "net6": "82:f8:10:c6:bb:0d",
            "net7": "9e:dd:12:a4:20:64",
            "net8": "52:2f:68:48:5d:1b",
            "net9": "fe:8e:c3:b6:bb:86"
        },
        "tof_2_2_1": {
            "net0": "3a:f9:ab:d9:23:06",
            "net1": "e2:99:c8:14:b7:42",
            "net10": "aa:33:07:e7:7f:ff",
            "net11": "b6:7f:e0:71:b6:a6",
            "net2": "ba:50:0b:fb:93:11",
            "net3": "ea:ed:a4:07:29:c0",
            "net4": "f6:d5:db:81:c6:bb",
            "net5": "72:c5:cc:f2:ee:81",
            "net6": "72:5a:a9:1a:45:bc",
            "net7": "6e:80:85:4c:45:74",
            "net8": "3e:0e:f5:50:bd:b5",
            "net9": "b2:5a:49:a9:c4:a8"
        },
        "tof_2_2_2": {
            "net0": "9e:96:cd:cd:09:3f",
            "net1": "ea:86:0e:80:5f:04",
            "net10": "4a:19:51:b0:7e:ac",
            "net11": "92:9a:64:b9:a0:4d",
            "net2": "aa:13:d5:75:8e:0b",
            "net3": "9e:b2:97:f1:35:e6",
            "net4": "02:75:9d:41:cd:0c",
            "net5": "2a:4d:95:df:bc:13",
            "net6": "0a:be:b9:45:17:d3",
            "net7": "3a:65:ba:59:5c:be",
            "net8": "c2:01:d5:4a:1d:8e",
            "net9": "36:93:97:c7:1f:f5"
        },
        "tof_2_2_3": {
            "net0": "ce:b8:d8:3d:67:cd",
            "net1": "b2:d1:b6:4f:5f:9f",
            "net10": "aa:f4:86:79:54:84",
            "net11": "ae:dc:b9:2e:af:cb",
            "net2": "3a:b9:7b:fc:0d:48",
            "net3": "da:58:2a:ae:88:04",
            "net4": "62:d3:40:6a:49:f5",
            "net5": "fa:13:aa:83:42:f8",
            "net6": "62:a4:02:b9:94:4d",
            "net7": "1e:41:1a:01:38:85",
            "net8": "02:66:af:c2:04:7f",
            "net9": "8e:af:5a:83:d6:04"
        },
        "tof_2_2_4": {
            "net0": "5a:4a:09:e4:fe:5e",
            "net1": "c6:28:3a:6c:fe:56",
            "net10": "b6:bc:ff:6a:08:60",
            "net11": "66:c5:44:5a:84:22",
            "net2": "ea:ca:4e:31:3f:79",
            "net3": "66:18:2d:ed:e2:fa",
            "net4": "1e:93:88:81:2c:c2",
            "net5": "5e:da:1b:3c:13:82",
            "net6": "0a:8f:6b:76:5b:79",
            "net7": "82:72:21:5a:ab:63",
            "net8": "ea:ef:34:e0:5e:13",
            "net9": "76:d3:e4:f4:33:f4"
        },
        "tof_2_2_5": {
            "net0": "e2:50:32:df:e4:69",
            "net1": "32:33:ad:e6:50:eb",
            "net10": "7e:af:53:82:40:0d",
            "net11": "32:71:6f:0b:5a:6c",
            "net2": "7e:0e:4c:1e:ab:9f",
            "net3": "42:4a:70:e1:3c:69",
            "net4": "4a:2c:08:b7:e0:67",
            "net5": "82:63:71:da:06:e5",
            "net6": "8e:56:31:c3:0e:b4",
            "net7": "da:52:8e:c6:e5:3a",
            "net8": "a6:16:e5:cb:cd:85",
            "net9": "02:d3:28:00:f9:7c"
        },
        "tof_2_2_6": {
            "net0": "3e:bb:6f:86:3c:bd",
            "net1": "a2:bd:84:42:3a:ca",
            "net10": "c6:6a:44:ec:ed:45",
            "net11": "da:b9:26:9e:32:aa",
            "net2": "e6:8d:a6:de:cc:45",
            "net3": "06:0b:c7:2b:7c:12",
            "net4": "de:3a:74:9f:47:68",
            "net5": "d6:de:82:72:1a:e3",
            "net6": "4a:0d:36:78:fc:88",
            "net7": "da:6a:e3:03:a7:d5",
            "net8": "02:2d:fb:0f:45:95",
            "net9": "e6:61:72:2e:88:40"
        },
        "tof_3_2_1": {
            "net0": "06:a8:db:1d:64:f2",
            "net1": "ba:0e:0a:06:8b:bb",
            "net10": "ce:7d:4f:20:25:77",
            "net11": "7e:ca:b4:3d:aa:05",
            "net2": "fe:79:d5:a0:d5:d9",
            "net3": "ee:49:86:29:1f:7d",
            "net4": "2a:40:4b:9f:e6:82",
            "net5": "1a:d8:7a:25:db:75",
            "net6": "0e:67:13:e8:8f:50",
            "net7": "1e:ae:c4:62:54:ac",
            "net8": "66:48:79:57:88:4a",
            "net9": "56:a7:31:26:e7:5f"
        },
        "tof_3_2_2": {
            "net0": "7e:99:63:ed:2e:12",
            "net1": "9a:49:ae:37:3c:aa",
            "net10": "d6:94:38:b0:44:30",
            "net11": "36:08:c9:d8:f5:94",
            "net2": "3a:ab:5e:b0:a5:f1",
            "net3": "86:56:bd:de:32:ef",
            "net4": "c6:bd:a4:54:ac:5b",
            "net5": "f2:d6:1d:1a:c4:6b",
            "net6": "b6:d7:b4:86:d2:10",
            "net7": "42:52:b3:5c:aa:ba",
            "net8": "d2:d5:25:c6:f5:3a",
            "net9": "36:b5:5c:05:65:2f"
        },
        "tof_3_2_3": {
            "net0": "52:70:11:96:88:8c",
            "net1": "8e:83:57:73:89:e0",
            "net10": "e6:67:19:d5:b8:d9",
            "net11": "9e:dd:76:e1:22:5b",
            "net2": "de:e0:23:71:cf:99",
            "net3": "b2:fc:89:0f:89:39",
            "net4": "ce:20:e5:53:24:b9",
            "net5": "be:39:3c:6d:69:37",
            "net6": "d6:7c:4e:cd:2e:5d",
            "net7": "8e:f8:c5:ce:aa:4f",
            "net8": "6a:65:7b:68:21:19",
            "net9": "ca:c1:c1:7c:33:34"
        },
        "tof_3_2_4": {
            "net0": "b2:86:66:7d:b5:08",
            "net1": "7e:94:4d:73:57:31",
            "net10": "fa:ac:ef:a5:0f:e1",
            "net11": "f2:b0:ff:ed:ea:10",
            "net2": "f2:9b:f9:cf:e0:48",
            "net3": "8e:ac:eb:b4:a2:64",
            "net4": "f6:65:e3:e8:df:4d",
            "net5": "6a:75:ab:56:4d:b5",
            "net6": "da:b3:92:b0:ee:7c",
            "net7": "9e:3a:30:87:19:9a",
            "net8": "fa:59:ab:3c:e6:69",
            "net9": "da:e1:d3:5c:04:fb"
        },
        "tof_3_2_5": {
            "net0": "7e:af:6f:87:5c:ed",
            "net1": "e2:95:39:fd:c9:47",
            "net10": "96:1c:37:da:7a:15",
            "net11": "2a:28:b1:89:de:79",
            "net2": "86:7c:f0:82:a8:61",
            "net3": "3e:d7:22:f8:4c:b9",
            "net4": "6a:4c:e9:09:d1:e6",
            "net5": "b6:4b:cc:47:ae:b5",
            "net6": "8e:c8:26:38:a1:ec",
            "net7": "2e:fe:09:d4:5c:43",
            "net8": "96:3d:7c:7d:e4:bb",
            "net9": "0e:12:30:f2:a0:ac"
        },
        "tof_3_2_6": {
            "net0": "6e:47:02:d1:8f:50",
            "net1": "0e:20:89:15:69:5d",
            "net10": "22:2d:3a:22:a4:d8",
            "net11": "32:9e:ea:1a:04:40",
            "net2": "b2:c9:31:0a:a4:e4",
            "net3": "26:7f:49:0e:44:f4",
            "net4": "b2:9e:97:67:00:ed",
            "net5": "b2:2a:99:c4:0b:7a",
            "net6": "1e:be:f4:38:a7:92",
            "net7": "ae:cc:bb:de:fa:7e",
            "net8": "82:fd:73:f2:35:5b",
            "net9": "0a:ff:d9:d1:52:01"
        },
        "tof_4_2_1": {
            "net0": "86:5e:db:e6:bf:22",
            "net1": "62:63:ea:f4:56:8e",
            "net10": "7e:9c:52:a1:df:25",
            "net11": "0e:9b:87:50:06:ce",
            "net2": "5e:94:af:7c:12:d5",
            "net3": "5a:9e:1b:26:f5:78",
            "net4": "06:2a:4b:b2:35:7c",
            "net5": "92:ed:4d:49:9d:65",
            "net6": "e2:a9:f0:ce:7b:a8",
            "net7": "3e:f6:6e:b5:b9:d7",
            "net8": "72:d4:a6:ba:5c:31",
            "net9": "46:c1:76:75:b2:1a"
        },
        "tof_4_2_2": {
            "net0": "12:79:c5:5f:03:5e",
            "net1": "82:cd:5a:e9:77:b0",
            "net10": "36:de:5e:a8:1f:f8",
            "net11": "9e:ae:b0:4a:a1:5b",
            "net2": "46:f9:72:68:5b:a0",
            "net3": "86:cb:7f:9f:98:b7",
            "net4": "c6:0f:52:82:cd:de",
            "net5": "72:64:65:c1:55:d7",
            "net6": "6e:77:c6:c1:88:5a",
            "net7": "82:52:88:bf:a7:a0",
            "net8": "32:f3:60:88:94:ff",
            "net9": "76:61:1c:ba:78:04"
        },
        "tof_4_2_3": {
            "net0": "3e:d8:06:8c:70:b8",
            "net1": "b6:3c:17:ed:37:c1",
            "net10": "36:5d:26:ed:68:e5",
            "net11": "2e:9a:18:85:8a:55",
            "net2": "ce:26:0b:d5:26:9c",
            "net3": "d6:36:77:a9:c6:64",
            "net4": "52:fc:51:70:f6:c1",
            "net5": "72:67:d2:7d:a1:c5",
            "net6": "ea:d9:bf:16:ff:45",
            "net7": "7e:03:85:8e:a1:fd",
            "net8": "ee:a7:6c:c5:d3:25",
            "net9": "ca:30:9f:aa:e9:4d"
        },
        "tof_4_2_4": {
            "net0": "be:01:70:49:20:9d",
            "net1": "f6:21:bf:76:e5:a3",
            "net10": "4a:46:19:cf:9c:48",
            "net11": "c2:ff:ce:30:25:64",
            "net2": "f2:c5:c5:31:20:fc",
            "net3": "02:a0:be:85:b0:fe",
            "net4": "3a:bc:66:73:a2:44",
            "net5": "4a:bc:de:0d:2a:73",
            "net6": "16:bc:93:df:1d:5f",
            "net7": "96:e0:f3:bc:a4:e0",
            "net8": "1e:0c:7d:67:2f:60",
            "net9": "7a:79:26:8e:52:67"
        },
        "tof_4_2_5": {
            "net0": "16:60:25:27:d0:bf",
            "net1": "02:6d:a7:e0:87:b3",
            "net10": "b6:17:55:41:21:a1",
            "net11": "5a:79:18:ea:39:d3",
            "net2": "7e:18:fd:89:b3:0b",
            "net3": "be:45:aa:aa:60:05",
            "net4": "9e:8f:fa:4a:84:93",
            "net5": "ca:33:42:e5:4e:52",
            "net6": "3a:5a:32:ed:a0:d4",
            "net7": "b6:0b:9a:15:fd:fd",
            "net8": "82:62:19:73:da:69",
            "net9": "ea:24:3f:a6:f3:9a"
        },
        "tof_4_2_6": {
            "net0": "5a:4b:2e:01:77:88",
            "net1": "a6:1f:7f:18:77:b5",
            "net10": "1e:8b:39:c4:ab:a8",
            "net11": "f2:29:6c:e7:1c:0d",
            "net2": "d6:98:8e:2b:26:c9",
            "net3": "de:5d:3c:f8:a2:af",
            "net4": "96:6c:7b:b8:07:cf",
            "net5": "2e:20:73:9c:c6:27",
            "net6": "fa:17:46:b8:a9:32",
            "net7": "66:ca:85:44:4e:3e",
            "net8": "ba:a0:6a:ae:81:3f",
            "net9": "36:d7:94:72:7a:b6"
        },
        "tof_5_2_1": {
            "net0": "f2:5c:8b:29:b3:8f",
            "net1": "1e:be:47:1f:ef:79",
            "net10": "ba:a0:be:b1:01:8f",
            "net11": "66:b7:91:11:34:5c",
            "net2": "ee:09:04:da:2a:c4",
            "net3": "52:34:4e:69:f5:b5",
            "net4": "fe:8b:35:13:6f:8f",
            "net5": "92:86:39:c5:9e:65",
            "net6": "7a:ca:7a:eb:12:8d",
            "net7": "5a:67:12:a5:9b:3d",
            "net8": "8a:81:40:35:af:86",
            "net9": "46:e9:41:56:2f:3d"
        },
        "tof_5_2_2": {
            "net0": "c6:64:cd:8b:71:a1",
            "net1": "92:cc:4c:03:5f:e4",
            "net10": "8a:d0:33:e4:26:33",
            "net11": "2e:04:4c:d7:33:5f",
            "net2": "4e:f5:3f:a0:91:e4",
            "net3": "c2:d7:f7:51:9b:3a",
            "net4": "c6:4c:c8:5e:ce:2e",
            "net5": "5e:47:6c:c6:91:90",
            "net6": "86:4b:a6:2a:20:2b",
            "net7": "26:69:df:85:6f:87",
            "net8": "b6:33:dc:b9:29:49",
            "net9": "86:e1:7a:c1:f2:9f"
        },
        "tof_5_2_3": {
            "net0": "de:aa:b0:aa:f7:40",
            "net1": "5e:b4:ea:fc:6a:2c",
            "net10": "0a:05:a5:65:fc:14",
            "net11": "0e:23:4f:1b:0f:8c",
            "net2": "a2:ae:0b:c7:e4:8f",
            "net3": "12:b4:c9:cd:fa:af",
            "net4": "3e:1f:10:88:aa:c8",
            "net5": "ae:52:d2:0d:b0:d9",
            "net6": "d2:b7:f0:d1:76:15",
            "net7": "52:b4:fa:a3:06:7e",
            "net8": "9e:84:c9:2c:3c:ee",
            "net9": "46:84:e1:ca:25:5e"
        },
        "tof_5_2_4": {
            "net0": "26:9f:ed:72:b9:2c",
            "net1": "12:e8:9e:27:c0:65",
            "net10": "f2:2e:6f:54:cb:35",
            "net11": "3a:11:1b:6a:83:93",
            "net2": "96:41:2b:83:c4:5d",
            "net3": "82:d8:4c:80:be:6d",
            "net4": "f6:be:e0:1e:9f:c1",
            "net5": "5e:fc:fa:0d:da:37",
            "net6": "1e:17:fb:50:f5:05",
            "net7": "ba:b4:c6:9f:00:b7",
            "net8": "ee:b6:77:d5:a9:a0",
            "net9": "de:ff:b7:39:49:35"
        },
        "tof_5_2_5": {
            "net0": "e2:f7:38:bf:1a:55",
            "net1": "e6:ed:75:ea:fb:7d",
            "net10": "06:bc:15:79:0a:c0",
            "net11": "2a:e2:21:0a:db:28",
            "net2": "96:b6:4e:5c:51:0e",
            "net3": "b2:78:bf:81:67:a8",
            "net4": "5a:a5:fd:93:b3:21",
            "net5": "92:f4:de:ad:d3:15",
            "net6": "76:9d:a5:ba:1b:45",
            "net7": "ae:cf:3a:d7:e1:d2",
            "net8": "be:b5:db:a5:c7:77",
            "net9": "2a:93:2e:db:5b:83"
        },
        "tof_5_2_6": {
            "net0": "ca:22:0f:f1:ed:76",
            "net1": "fa:9a:84:99:59:d9",
            "net10": "a6:0f:0f:77:d0:3d",
            "net11": "52:f8:b7:92:e0:dc",
            "net2": "16:48:b1:55:db:56",
            "net3": "26:5c:50:37:35:12",
            "net4": "f2:a0:40:ea:7d:8e",
            "net5": "22:89:83:48:a4:17",
            "net6": "6e:2a:a7:fc:4b:c4",
            "net7": "1e:44:ac:28:ac:36",
            "net8": "06:3e:95:69:7e:13",
            "net9": "e2:4c:d6:37:00:a7"
        },
        "tof_6_2_1": {
            "net0": "56:81:50:25:6c:d9",
            "net1": "be:e4:48:0c:e4:35",
            "net10": "66:b3:15:c4:b7:ed",
            "net11": "1a:b2:d2:f9:df:19",
            "net2": "9e:d2:41:ed:4f:3e",
            "net3": "4e:2b:3b:2d:a7:9a",
            "net4": "5e:1f:2d:54:e6:e7",
            "net5": "e2:de:68:e2:2e:4d",
            "net6": "aa:15:68:e4:0a:72",
            "net7": "5a:a5:39:ee:98:15",
            "net8": "52:c2:fb:8d:a2:14",
            "net9": "5a:87:ea:5c:54:7f"
        },
        "tof_6_2_2": {
            "net0": "8a:d5:eb:99:cb:33",
            "net1": "72:a2:4c:36:83:72",
            "net10": "6a:ea:13:45:19:94",
            "net11": "52:d5:02:e5:f4:f1",
            "net2": "06:c6:84:cd:12:3d",
            "net3": "22:33:cd:ce:a9:a3",
            "net4": "32:7a:10:59:43:4b",
            "net5": "92:d0:9b:74:96:c7",
            "net6": "86:aa:9a:66:26:6a",
            "net7": "de:9e:04:02:3b:d1",
            "net8": "ae:a4:a2:27:c7:c2",
            "net9": "26:9b:da:ca:98:7f"
        },
        "tof_6_2_3": {
            "net0": "7e:5b:9b:93:58:69",
            "net1": "e6:a0:18:3b:f1:5d",
            "net10": "46:6f:e1:7c:7c:e0",
            "net11": "52:f1:8b:29:d7:43",
            "net2": "fe:8a:80:80:30:54",
            "net3": "ea:b2:74:b6:b4:0f",
            "net4": "ea:43:26:07:af:51",
            "net5": "52:75:54:f4:ff:d3",
            "net6": "96:47:fd:c6:27:59",
            "net7": "4a:a6:ae:ac:95:8e",
            "net8": "7a:f7:9b:88:9b:6a",
            "net9": "da:11:38:2a:36:b8"
        },
        "tof_6_2_4": {
            "net0": "26:47:3a:e4:16:4b",
            "net1": "ca:e0:8c:6b:36:70",
            "net10": "86:64:65:dc:99:f0",
            "net11": "7a:db:aa:57:65:3e",
            "net2": "ca:d0:aa:df:6d:35",
            "net3": "ee:fa:dc:88:0c:f6",
            "net4": "16:24:03:dc:28:44",
            "net5": "ea:4a:6f:af:8b:1c",
            "net6": "3a:ac:33:81:aa:74",
            "net7": "42:8c:e3:35:0e:51",
            "net8": "be:b7:c9:3e:37:e1",
            "net9": "ee:a3:db:c3:08:45"
        },
        "tof_6_2_5": {
            "net0": "5e:51:18:0b:2e:c0",
            "net1": "5a:40:73:78:d9:06",
            "net10": "16:18:25:9f:20:b7",
            "net11": "22:33:52:2a:aa:e5",
            "net2": "aa:ed:f3:89:e5:5b",
            "net3": "5a:8c:69:2e:0f:da",
            "net4": "36:dd:6d:97:14:ff",
            "net5": "4a:ad:dd:4c:a6:72",
            "net6": "0e:de:2e:d3:4f:92",
            "net7": "06:50:1d:ce:ee:f3",
            "net8": "16:0b:6a:82:00:57",
            "net9": "8a:d4:d1:49:b8:67"
        },
        "tof_6_2_6": {
            "net0": "42:3d:5f:02:e2:db",
            "net1": "82:fe:3d:54:ff:f4",
            "net10": "1a:55:a8:76:ec:90",
            "net11": "de:f3:8b:d0:26:2d",
            "net2": "9e:28:8f:1e:76:72",
            "net3": "9a:5d:6f:d6:8a:99",
            "net4": "b6:4f:52:23:fd:f8",
            "net5": "ce:dc:9b:20:be:67",
            "net6": "62:9e:f8:44:a6:cc",
            "net7": "02:aa:29:25:df:5f",
            "net8": "06:58:b2:13:9e:bf",
            "net9": "36:70:a4:72:47:f9"
        }
    },
    "failed_machine": "leaf_1_0_1",
    "failure_time": 1616293019.5880525,
    "recover_time": 1616293104.8379135
}