{
    "k_leaf": 4,
    "k_top": 4,
    "redundancy_factor": 1,
    "is_k8s": true,
    "machine_mac_addresses": {
        "leaf_1_0_1": {
            "net0": "e6:c8:3f:b5:a8:4f",
            "net1": "16:fd:09:0b:45:b7",
            "net2": "ce:62:51:97:49:2d",
            "net3": "f2:cc:65:9c:8d:2d",
            "net4": "86:2c:63:4c:9f:ca"
        },
        "leaf_1_0_2": {
            "net0": "42:61:d1:18:dc:86",
            "net1": "f6:43:18:50:43:2e",
            "net2": "d6:3f:89:7a:dc:9a",
            "net3": "f6:ed:b6:e9:a2:8d",
            "net4": "ce:82:7e:2d:29:19"
        },
        "leaf_1_0_3": {
            "net0": "e2:65:b9:b5:14:78",
            "net1": "fe:7b:4f:31:34:aa",
            "net2": "22:9c:7a:bf:62:43",
            "net3": "1e:bf:e5:f8:48:30",
            "net4": "c2:e0:1f:a3:e6:38"
        },
        "leaf_1_0_4": {
            "net0": "da:ad:0e:10:68:2a",
            "net1": "5e:71:48:51:a0:89",
            "net2": "e2:b7:4a:0a:73:bd",
            "net3": "62:f7:fe:52:49:68",
            "net4": "76:c3:e1:d1:9a:fb"
        },
        "leaf_2_0_1": {
            "net0": "ee:af:bb:6a:21:ba",
            "net1": "ee:3c:f6:08:67:19",
            "net2": "12:52:a8:0d:c9:cd",
            "net3": "ca:54:cd:9f:24:8b",
            "net4": "0e:73:68:9c:7c:1e"
        },
        "leaf_2_0_2": {
            "net0": "56:5a:13:31:f8:00",
            "net1": "ca:1d:ed:d6:60:c7",
            "net2": "16:a3:21:a1:2a:71",
            "net3": "ae:58:c2:38:ce:f4",
            "net4": "e6:2a:21:e2:45:e2"
        },
        "leaf_2_0_3": {
            "net0": "0a:55:0a:89:81:48",
            "net1": "52:4d:48:22:43:44",
            "net2": "f2:26:59:21:83:bc",
            "net3": "46:e6:f1:42:9e:99",
            "net4": "0a:03:76:88:ca:a3"
        },
        "leaf_2_0_4": {
            "net0": "06:d7:08:80:b7:00",
            "net1": "ca:e9:d4:8a:06:9e",
            "net2": "1a:c5:6c:a1:12:71",
            "net3": "56:40:b1:70:95:ce",
            "net4": "c2:5e:7c:a8:42:f5"
        },
        "leaf_3_0_1": {
            "net0": "ea:e6:e0:0e:ce:4c",
            "net1": "ea:d2:d7:0f:03:55",
            "net2": "4e:28:65:ea:5c:32",
            "net3": "de:fe:c8:b7:c3:17",
            "net4": "c6:5f:fd:35:3a:0d"
        },
        "leaf_3_0_2": {
            "net0": "ee:cc:fb:99:eb:8a",
            "net1": "a6:16:4d:db:17:68",
            "net2": "82:ee:d2:8b:e9:8c",
            "net3": "fa:8a:64:dd:cf:db",
            "net4": "ee:38:cd:b5:fe:c5"
        },
        "leaf_3_0_3": {
            "net0": "ba:ee:b4:8a:e6:6a",
            "net1": "a2:1a:e5:d2:05:77",
            "net2": "7e:3b:ab:f8:51:98",
            "net3": "22:c3:cb:76:de:ff",
            "net4": "5e:33:74:62:7d:1d"
        },
        "leaf_3_0_4": {
            "net0": "86:13:39:9a:25:26",
            "net1": "3e:63:48:39:93:39",
            "net2": "0a:a0:b2:06:13:66",
            "net3": "ae:85:0b:d5:3b:24",
            "net4": "86:7e:02:a3:b7:2a"
        },
        "leaf_4_0_1": {
            "net0": "f2:28:13:e7:1c:50",
            "net1": "32:14:43:82:44:86",
            "net2": "62:23:2b:7b:5b:c3",
            "net3": "de:ef:58:69:01:62",
            "net4": "7e:e7:b7:db:5c:d1"
        },
        "leaf_4_0_2": {
            "net0": "46:98:ec:28:52:5d",
            "net1": "36:df:38:a5:99:b9",
            "net2": "ee:f7:6a:3b:59:df",
            "net3": "62:03:93:4a:6e:b5",
            "net4": "d6:8a:68:8d:d3:b2"
        },
        "leaf_4_0_3": {
            "net0": "42:6b:dc:20:c6:64",
            "net1": "ca:58:ac:c0:9a:52",
            "net2": "1e:33:d9:02:86:68",
            "net3": "3e:11:fc:a2:8c:c7",
            "net4": "6e:b9:4d:a7:4b:3c"
        },
        "leaf_4_0_4": {
            "net0": "ba:9e:3b:50:d0:c8",
            "net1": "22:24:13:20:94:59",
            "net2": "c6:d8:8c:35:48:6b",
            "net3": "e2:af:1f:50:58:f1",
            "net4": "ea:07:89:13:54:c1"
        },
        "leaf_5_0_1": {
            "net0": "12:4e:45:ef:28:41",
            "net1": "86:6e:6d:13:e4:a9",
            "net2": "fe:3a:25:be:43:86",
            "net3": "66:fc:05:20:ec:b5",
            "net4": "f6:53:01:dd:85:bb"
        },
        "leaf_5_0_2": {
            "net0": "76:16:04:0f:dc:86",
            "net1": "f6:39:37:af:73:cb",
            "net2": "42:85:6e:42:35:c4",
            "net3": "42:51:94:28:a8:11",
            "net4": "12:7c:ba:ec:44:f9"
        },
        "leaf_5_0_3": {
            "net0": "5e:3f:33:9c:4e:aa",
            "net1": "2e:4e:4c:1e:24:a5",
            "net2": "8a:6b:69:ae:4c:ad",
            "net3": "86:f1:95:70:f6:61",
            "net4": "fe:13:94:a6:68:ca"
        },
        "leaf_5_0_4": {
            "net0": "c2:15:a7:8b:68:43",
            "net1": "26:be:08:1e:eb:b6",
            "net2": "8a:71:09:8a:f5:16",
            "net3": "1a:2b:22:2d:81:b9",
            "net4": "8a:75:24:42:6c:66"
        },
        "leaf_6_0_1": {
            "net0": "7a:1a:25:cb:3b:03",
            "net1": "7a:75:d5:50:a4:b2",
            "net2": "56:f7:0b:5a:78:70",
            "net3": "72:12:61:07:67:de",
            "net4": "06:4b:66:e2:56:44"
        },
        "leaf_6_0_2": {
            "net0": "52:d3:d8:96:51:08",
            "net1": "8e:93:d6:b5:42:38",
            "net2": "56:16:63:bb:0e:13",
            "net3": "da:ff:b1:ec:68:19",
            "net4": "e6:bb:df:24:d4:4a"
        },
        "leaf_6_0_3": {
            "net0": "92:d9:3f:bf:7c:43",
            "net1": "66:82:37:83:c8:db",
            "net2": "42:26:6f:81:c2:3c",
            "net3": "9a:8f:ed:98:6e:58",
            "net4": "ce:a6:49:b6:eb:3a"
        },
        "leaf_6_0_4": {
            "net0": "0e:60:1d:74:76:0a",
            "net1": "3a:08:0e:b9:88:56",
            "net2": "7e:cb:b3:10:56:0e",
            "net3": "e2:ef:3d:80:cb:d1",
            "net4": "5e:bb:95:5b:4a:d7"
        },
        "leaf_7_0_1": {
            "net0": "ba:57:e6:02:ff:d1",
            "net1": "86:42:32:0b:2c:da",
            "net2": "4a:5d:b8:0b:3e:44",
            "net3": "72:49:28:80:fc:15",
            "net4": "ba:83:40:01:a8:92"
        },
        "leaf_7_0_2": {
            "net0": "82:2b:39:16:b1:cc",
            "net1": "72:cc:fb:56:55:66",
            "net2": "fa:bd:77:a4:6e:9d",
            "net3": "62:fb:70:40:29:b9",
            "net4": "ea:e2:a8:e5:f7:cd"
        },
        "leaf_7_0_3": {
            "net0": "ba:31:74:f2:66:7a",
            "net1": "46:5c:fb:22:f9:fb",
            "net2": "32:f8:17:e4:80:ab",
            "net3": "c2:25:d3:3a:2c:13",
            "net4": "7e:7f:7b:5a:95:d3"
        },
        "leaf_7_0_4": {
            "net0": "a2:9d:30:02:68:c6",
            "net1": "1a:4c:be:06:9b:84",
            "net2": "56:37:8a:d4:28:a8",
            "net3": "e6:be:1a:58:58:fc",
            "net4": "76:80:a1:92:33:90"
        },
        "leaf_8_0_1": {
            "net0": "a2:d1:45:26:a1:b9",
            "net1": "12:95:bb:d4:08:ff",
            "net2": "6e:6b:52:9a:51:63",
            "net3": "de:1f:f1:78:74:3b",
            "net4": "2e:56:df:04:5a:e4"
        },
        "leaf_8_0_2": {
            "net0": "1e:13:c5:83:c5:36",
            "net1": "d2:b6:b9:93:65:23",
            "net2": "8e:0d:71:7b:b9:12",
            "net3": "c2:dc:b5:d6:4c:ca",
            "net4": "c2:ae:7c:b5:0f:8e"
        },
        "leaf_8_0_3": {
            "net0": "2a:ad:36:8b:e6:55",
            "net1": "e6:9e:29:06:f6:12",
            "net2": "02:8f:10:4c:6a:a2",
            "net3": "e6:9f:9b:71:3b:9c",
            "net4": "66:01:56:00:b6:70"
        },
        "leaf_8_0_4": {
            "net0": "de:4c:40:09:43:9b",
            "net1": "8a:8a:9f:83:74:6d",
            "net2": "d6:e7:cd:57:c4:9d",
            "net3": "26:ab:03:18:64:08",
            "net4": "9a:53:50:8d:e8:c8"
        },
        "spine_1_1_1": {
            "net0": "06:4b:e5:56:78:74",
            "net1": "3a:02:39:39:3f:d3",
            "net2": "e6:4a:da:5e:58:80",
            "net3": "1a:e2:16:e6:19:ed",
            "net4": "26:ff:dc:4b:65:05",
            "net5": "ca:c4:79:0d:81:9a",
            "net6": "46:d3:08:c3:7c:3a",
            "net7": "c2:16:02:40:b5:b9"
        },
        "spine_1_1_2": {
            "net0": "9e:ba:ba:ed:67:a8",
            "net1": "be:67:8f:c4:66:f6",
            "net2": "42:bf:be:13:0e:c1",
            "net3": "ee:8f:e3:af:03:df",
            "net4": "02:c4:1c:ab:3d:f3",
            "net5": "02:7d:05:fc:60:13",
            "net6": "ba:47:5d:66:20:8d",
            "net7": "5a:c7:7f:59:d3:f0"
        },
        "spine_1_1_3": {
            "net0": "4a:20:21:9c:f3:fa",
            "net1": "c6:b1:db:67:a8:87",
            "net2": "f2:d0:af:6e:09:bf",
            "net3": "f2:bf:48:f3:89:ca",
            "net4": "32:4c:98:ed:5a:fe",
            "net5": "06:24:f7:51:d2:7f",
            "net6": "16:b7:be:83:10:ea",
            "net7": "0a:9c:10:11:d3:5a"
        },
        "spine_1_1_4": {
            "net0": "a6:83:9c:1d:49:12",
            "net1": "c2:b1:c4:c5:e0:2b",
            "net2": "66:de:65:e3:85:20",
            "net3": "9e:1a:71:01:96:27",
            "net4": "b2:dd:b5:65:14:22",
            "net5": "72:3e:02:28:c7:0e",
            "net6": "42:ad:d4:bc:4e:36",
            "net7": "b6:75:2a:83:9c:89"
        },
        "spine_2_1_1": {
            "net0": "2a:fc:d6:95:60:aa",
            "net1": "96:26:6d:d6:ca:2d",
            "net2": "de:14:36:3e:19:5e",
            "net3": "a6:fa:25:fc:18:b4",
            "net4": "0a:9f:48:7e:cd:3e",
            "net5": "c6:a7:3c:f1:73:70",
            "net6": "96:31:7a:a4:90:c5",
            "net7": "8a:57:fc:f4:c6:0b"
        },
        "spine_2_1_2": {
            "net0": "2e:05:2c:d7:f2:ff",
            "net1": "e2:68:ed:16:c1:23",
            "net2": "c6:05:df:90:d7:ab",
            "net3": "6a:d7:98:92:ac:7a",
            "net4": "4e:9b:3e:1c:d1:91",
            "net5": "ea:7a:75:2c:13:d7",
            "net6": "96:a8:11:9f:3f:68",
            "net7": "c6:ae:24:a5:29:78"
        },
        "spine_2_1_3": {
            "net0": "8e:d8:2a:76:07:a2",
            "net1": "0a:c8:4b:db:55:22",
            "net2": "32:13:9e:5a:c2:84",
            "net3": "ce:55:73:56:51:05",
            "net4": "96:fb:97:8d:4e:ae",
            "net5": "26:26:83:23:69:75",
            "net6": "7e:8d:53:c1:e9:8d",
            "net7": "c6:7e:73:15:bd:a9"
        },
        "spine_2_1_4": {
            "net0": "32:d0:4b:78:cb:dd",
            "net1": "26:e0:1b:c0:12:60",
            "net2": "de:22:1d:0e:95:58",
            "net3": "32:fe:f8:6d:52:c5",
            "net4": "f2:83:bd:36:0c:b0",
            "net5": "3e:f1:f8:49:1c:f4",
            "net6": "16:c8:db:b4:bb:94",
            "net7": "4e:5b:86:07:d6:aa"
        },
        "spine_3_1_1": {
            "net0": "b2:a6:5a:d1:b5:c3",
            "net1": "12:d7:21:11:8c:d0",
            "net2": "3a:6b:9a:6d:74:90",
            "net3": "aa:79:6f:46:b7:e4",
            "net4": "0e:bb:97:7b:cd:ed",
            "net5": "b6:8f:97:c4:f4:4b",
            "net6": "32:6e:50:e5:33:dd",
            "net7": "ae:c7:5d:fc:5e:e2"
        },
        "spine_3_1_2": {
            "net0": "36:2a:cb:43:12:e3",
            "net1": "1e:6b:6f:ad:f1:cc",
            "net2": "56:a4:38:bf:b2:3d",
            "net3": "0e:46:85:42:6d:02",
            "net4": "86:20:21:f8:74:e7",
            "net5": "fe:44:b6:4c:e8:c4",
            "net6": "8a:6d:4f:db:18:d1",
            "net7": "76:52:06:33:58:98"
        },
        "spine_3_1_3": {
            "net0": "0e:d8:76:e9:ae:0d",
            "net1": "c2:e3:f4:71:83:98",
            "net2": "ce:91:86:fa:bb:2c",
            "net3": "6a:4f:3e:59:e9:a4",
            "net4": "02:1a:7b:5d:81:0f",
            "net5": "e2:61:2e:6b:26:39",
            "net6": "d2:da:42:c7:15:e8",
            "net7": "12:46:7c:8d:78:e3"
        },
        "spine_3_1_4": {
            "net0": "9e:61:42:b5:04:3b",
            "net1": "7e:f1:67:30:61:fd",
            "net2": "22:ef:66:51:d7:7c",
            "net3": "ee:71:6e:88:a6:00",
            "net4": "0a:bc:2f:3b:ac:80",
            "net5": "ba:6b:3e:76:2a:70",
            "net6": "1a:dc:f4:f8:c6:3c",
            "net7": "3a:64:73:87:c2:8c"
        },
        "spine_4_1_1": {
            "net0": "f2:74:04:55:09:f0",
            "net1": "0a:c5:4a:2c:46:57",
            "net2": "5a:a0:fd:4b:04:df",
            "net3": "9e:a4:f3:87:c0:45",
            "net4": "06:27:38:e3:d9:a2",
            "net5": "6a:17:c5:b4:b5:52",
            "net6": "32:6c:e7:c7:8c:90",
            "net7": "d6:29:ea:9b:a1:91"
        },
        "spine_4_1_2": {
            "net0": "82:8b:6e:21:ff:e8",
            "net1": "de:b8:9e:30:a4:8c",
            "net2": "be:fc:7e:a4:2a:9a",
            "net3": "1e:10:ce:b9:20:13",
            "net4": "f2:23:af:ef:62:59",
            "net5": "0e:1e:bb:57:6c:af",
            "net6": "32:eb:cf:f4:d4:99",
            "net7": "96:8a:0c:d2:e0:c6"
        },
        "spine_4_1_3": {
            "net0": "fa:d5:fb:21:54:d6",
            "net1": "c2:ae:64:e6:59:42",
            "net2": "d2:cd:d3:6a:05:1c",
            "net3": "b6:9e:53:cd:12:c0",
            "net4": "aa:f1:4d:71:a1:6b",
            "net5": "d2:76:24:2f:d4:cd",
            "net6": "36:89:e7:86:e8:68",
            "net7": "52:93:cc:f9:eb:9c"
        },
        "spine_4_1_4": {
            "net0": "ba:ab:9c:c2:a2:a2",
            "net1": "ae:70:51:72:80:d2",
            "net2": "0a:d1:3f:63:9a:c8",
            "net3": "16:50:f0:c5:ae:2a",
            "net4": "26:f1:2b:81:d9:3e",
            "net5": "82:7b:19:54:15:f2",
            "net6": "2a:f1:86:43:17:e7",
            "net7": "ce:83:42:c1:42:2d"
        },
        "spine_5_1_1": {
            "net0": "46:2c:8e:1d:56:4b",
            "net1": "4e:62:f9:ea:50:f0",
            "net2": "e6:f2:ef:5e:58:bb",
            "net3": "3a:71:68:e8:49:0e",
            "net4": "f2:c9:42:92:86:b2",
            "net5": "fe:a7:cf:94:8d:1e",
            "net6": "9a:8e:43:b9:26:ba",
            "net7": "b2:71:8c:7e:ef:39"
        },
        "spine_5_1_2": {
            "net0": "76:d8:d7:38:2d:6e",
            "net1": "ca:14:5a:15:54:a6",
            "net2": "3a:9a:d6:e2:55:b8",
            "net3": "ea:8d:08:c8:da:6f",
            "net4": "de:03:2b:f5:06:6f",
            "net5": "6a:e8:0f:a7:d1:83",
            "net6": "a6:fc:7f:d9:0a:81",
            "net7": "42:66:7d:ba:9f:4d"
        },
        "spine_5_1_3": {
            "net0": "56:08:4a:75:2a:80",
            "net1": "56:9e:fb:2b:e4:bb",
            "net2": "82:17:9c:66:17:3d",
            "net3": "a2:20:8a:4a:6e:cd",
            "net4": "82:6c:e3:ea:08:60",
            "net5": "ee:a7:50:47:0f:73",
            "net6": "a2:3f:43:fc:15:dd",
            "net7": "b6:28:bc:9b:51:e3"
        },
        "spine_5_1_4": {
            "net0": "6a:16:7e:1b:28:d9",
            "net1": "ba:ec:0b:10:d9:e1",
            "net2": "3a:2f:43:c5:8c:3e",
            "net3": "42:a9:c2:57:33:f4",
            "net4": "4e:b2:96:11:ce:78",
            "net5": "26:dc:99:b5:70:2f",
            "net6": "52:9d:9f:bb:ca:22",
            "net7": "7e:72:25:3d:81:2a"
        },
        "spine_6_1_1": {
            "net0": "02:8e:d2:67:84:b5",
            "net1": "36:4a:ed:ff:12:55",
            "net2": "6e:8b:03:5f:25:16",
            "net3": "0a:b9:c2:c8:a2:87",
            "net4": "d2:92:b4:e3:4b:1a",
            "net5": "96:01:c4:87:33:0f",
            "net6": "3e:62:ea:72:eb:0d",
            "net7": "7e:26:c3:f2:7f:8c"
        },
        "spine_6_1_2": {
            "net0": "a2:95:d7:3f:97:ae",
            "net1": "ce:06:18:8c:99:cf",
            "net2": "e6:06:e8:69:37:b0",
            "net3": "f6:9d:79:98:dd:b5",
            "net4": "9a:a8:76:92:3b:18",
            "net5": "02:98:cd:ad:ea:37",
            "net6": "ae:93:97:90:93:fb",
            "net7": "72:ae:70:75:3e:ef"
        },
        "spine_6_1_3": {
            "net0": "9a:91:76:95:70:7a",
            "net1": "7e:63:c1:2c:e2:ab",
            "net2": "fa:2d:9e:b6:92:86",
            "net3": "ba:6e:e4:c6:92:83",
            "net4": "5e:92:b2:aa:c5:09",
            "net5": "be:96:84:85:5b:27",
            "net6": "ba:96:3c:ea:01:ce",
            "net7": "d6:a6:c8:2f:29:29"
        },
        "spine_6_1_4": {
            "net0": "26:56:86:25:d5:37",
            "net1": "b6:0f:b8:46:87:74",
            "net2": "5e:db:10:45:f6:0b",
            "net3": "e2:df:7a:1b:e7:4e",
            "net4": "c2:90:3a:4a:26:b7",
            "net5": "7a:4a:68:15:ce:64",
            "net6": "62:58:db:71:d3:a5",
            "net7": "2e:5f:53:3c:2c:cd"
        },
        "spine_7_1_1": {
            "net0": "46:00:b0:34:1f:2a",
            "net1": "82:0e:08:9b:f6:f3",
            "net2": "7a:05:c0:9c:4d:8b",
            "net3": "56:48:e6:19:ec:91",
            "net4": "6e:86:bf:da:7a:6e",
            "net5": "5a:9b:26:29:7e:b0",
            "net6": "42:a8:b4:a9:37:d9",
            "net7": "46:c7:5a:f3:d1:75"
        },
        "spine_7_1_2": {
            "net0": "ae:d9:24:03:65:a7",
            "net1": "ce:45:30:11:d2:e5",
            "net2": "5a:d8:e5:9b:d4:cc",
            "net3": "32:8f:b2:8f:30:b6",
            "net4": "f2:98:d5:f0:da:e2",
            "net5": "42:0c:51:cd:9a:2b",
            "net6": "c2:ce:ab:b9:b3:1c",
            "net7": "be:c0:60:a8:2d:85"
        },
        "spine_7_1_3": {
            "net0": "36:d9:80:58:da:ee",
            "net1": "9a:d1:29:6c:56:72",
            "net2": "32:16:6a:b6:2f:98",
            "net3": "0a:01:c5:dc:9b:e7",
            "net4": "86:1c:ab:42:75:4b",
            "net5": "66:b9:84:7a:73:d3",
            "net6": "fe:05:6f:0c:20:3d",
            "net7": "1e:6d:36:36:1f:50"
        },
        "spine_7_1_4": {
            "net0": "c2:16:50:36:7b:3f",
            "net1": "06:4e:15:48:01:29",
            "net2": "36:6d:d6:cb:55:ca",
            "net3": "ea:f3:8b:65:31:e8",
            "net4": "96:08:59:44:f3:0c",
            "net5": "0a:9d:a1:3d:e8:af",
            "net6": "aa:43:fd:ef:ba:59",
            "net7": "66:5b:07:28:ea:9d"
        },
        "spine_8_1_1": {
            "net0": "0a:22:84:fd:db:5e",
            "net1": "16:30:57:e1:61:0b",
            "net2": "da:1a:33:2a:6c:88",
            "net3": "16:ee:2b:c1:b3:fe",
            "net4": "ba:73:28:e7:76:f8",
            "net5": "0e:dd:5c:5a:af:f8",
            "net6": "e6:bf:47:bc:a4:cd",
            "net7": "16:2a:9f:e2:a2:67"
        },
        "spine_8_1_2": {
            "net0": "ee:2e:17:3d:c3:29",
            "net1": "b2:8f:64:c4:ce:32",
            "net2": "46:83:77:58:a1:fa",
            "net3": "e2:9b:d5:a6:d9:65",
            "net4": "1e:9f:30:31:0b:61",
            "net5": "7e:f2:4e:5d:e1:31",
            "net6": "e2:04:78:7e:11:d7",
            "net7": "5e:fa:7a:0c:ef:d4"
        },
        "spine_8_1_3": {
            "net0": "4a:19:78:48:1c:ca",
            "net1": "b2:e6:a4:c9:d0:86",
            "net2": "d2:24:9d:24:3f:1e",
            "net3": "1e:3d:72:26:77:bb",
            "net4": "06:e7:b4:28:2e:3d",
            "net5": "82:84:f7:86:c1:01",
            "net6": "76:b6:e9:84:b8:cd",
            "net7": "02:a7:d0:bf:2b:6e"
        },
        "spine_8_1_4": {
            "net0": "fa:e5:49:02:06:30",
            "net1": "0e:3d:bf:67:ca:c9",
            "net2": "ae:47:32:d8:f2:e0",
            "net3": "42:a0:c2:f1:01:9a",
            "net4": "42:9b:ef:e7:4f:3c",
            "net5": "46:47:d4:01:ef:ce",
            "net6": "d2:a7:0d:db:da:28",
            "net7": "76:85:1c:60:6a:af"
        },
        "tof_1_2_1": {
            "net0": "4e:d5:e1:51:d3:0f",
            "net1": "9e:e6:86:46:31:16",
            "net2": "be:cd:00:4f:0f:db",
            "net3": "8a:b4:e5:f1:a7:01",
            "net4": "56:8a:03:6a:9b:5d",
            "net5": "aa:38:1f:7e:4d:15",
            "net6": "4e:e7:d4:3c:57:d0",
            "net7": "aa:17:2c:dc:1c:aa"
        },
        "tof_1_2_2": {
            "net0": "da:57:15:17:ec:79",
            "net1": "1e:f9:5e:a4:97:69",
            "net2": "36:1b:3b:58:a1:b6",
            "net3": "fa:60:3d:f5:51:1d",
            "net4": "32:62:cd:d7:5a:5d",
            "net5": "aa:fb:14:b6:56:ca",
            "net6": "4a:a0:4a:68:eb:17",
            "net7": "b2:a5:aa:aa:44:93"
        },
        "tof_1_2_3": {
            "net0": "7a:69:8a:71:cb:cf",
            "net1": "56:2e:23:5d:63:f4",
            "net2": "a6:c7:5e:8d:bd:ea",
            "net3": "06:75:6e:53:ec:85",
            "net4": "86:2a:63:fa:06:b0",
            "net5": "e6:3b:00:75:f1:2d",
            "net6": "fe:18:46:a1:52:7f",
            "net7": "f6:36:c7:7c:a1:46"
        },
        "tof_1_2_4": {
            "net0": "c2:77:46:89:3e:77",
            "net1": "5a:dd:fc:da:a4:34",
            "net2": "56:bf:45:b5:92:a0",
            "net3": "06:ca:b2:7a:26:19",
            "net4": "c6:5c:fe:c7:51:58",
            "net5": "fa:99:ca:a9:db:ef",
            "net6": "02:a0:7d:a6:57:d3",
            "net7": "d2:3d:d2:37:22:2c"
        },
        "tof_2_2_1": {
            "net0": "46:04:02:02:4e:42",
            "net1": "ee:91:f6:a9:5a:6d",
            "net2": "de:fc:18:4d:45:4b",
            "net3": "a2:8e:d4:e9:5d:ae",
            "net4": "0a:04:52:b0:a5:4d",
            "net5": "ba:2d:30:ac:25:6b",
            "net6": "96:fe:89:3f:e0:26",
            "net7": "6e:66:2b:f0:ce:ba"
        },
        "tof_2_2_2": {
            "net0": "3e:b1:37:34:00:9e",
            "net1": "16:e0:80:c6:2a:16",
            "net2": "4e:21:0d:c0:c8:8b",
            "net3": "32:1b:51:81:aa:ee",
            "net4": "06:9b:9c:6e:a2:33",
            "net5": "fa:aa:62:41:24:6c",
            "net6": "f6:10:e3:71:3f:cc",
            "net7": "0a:9f:a3:d6:25:f1"
        },
        "tof_2_2_3": {
            "net0": "12:a6:de:35:33:8f",
            "net1": "76:3e:1d:84:57:1f",
            "net2": "ca:48:f9:b8:b8:10",
            "net3": "ce:28:df:5b:e5:a5",
            "net4": "96:ff:13:8c:cc:86",
            "net5": "56:3c:2b:75:c1:d1",
            "net6": "7e:d0:e7:5d:3b:04",
            "net7": "e2:44:32:7a:ab:bd"
        },
        "tof_2_2_4": {
            "net0": "d2:f1:c4:61:d6:7d",
            "net1": "72:9c:a1:ac:ca:8e",
            "net2": "36:ee:d4:36:ec:bd",
            "net3": "aa:2b:d6:8c:89:20",
            "net4": "2e:16:3b:de:18:1d",
            "net5": "26:fb:f4:43:78:d2",
            "net6": "ce:1f:6f:70:2d:ac",
            "net7": "ae:05:fd:b6:99:23"
        },
        "tof_3_2_1": {
            "net0": "6e:ef:ab:4c:e8:43",
            "net1": "6e:81:8c:d2:52:bf",
            "net2": "8e:65:82:9e:81:12",
            "net3": "e2:ba:e7:3e:de:a9",
            "net4": "82:b5:4e:d0:2d:e2",
            "net5": "ae:89:b6:a0:24:40",
            "net6": "9a:80:03:64:f7:42",
            "net7": "c2:f3:53:73:76:39"
        },
        "tof_3_2_2": {
            "net0": "d2:6a:13:56:a3:5f",
            "net1": "fe:d4:34:0b:fa:e2",
            "net2": "f6:05:85:cb:5f:ac",
            "net3": "0e:23:86:49:2b:24",
            "net4": "ba:4c:58:35:7c:eb",
            "net5": "16:0d:d5:98:a4:d4",
            "net6": "26:09:5f:54:55:d3",
            "net7": "26:b9:ac:11:5b:db"
        },
        "tof_3_2_3": {
            "net0": "42:50:cb:f2:40:1c",
            "net1": "be:02:ff:e2:bd:86",
            "net2": "c2:e0:db:22:b5:7f",
            "net3": "ce:40:a7:a1:8d:f9",
            "net4": "fe:1b:ea:10:04:10",
            "net5": "ae:56:a2:c6:82:d3",
            "net6": "4a:75:7f:15:1c:2d",
            "net7": "b2:a1:34:81:aa:68"
        },
        "tof_3_2_4": {
            "net0": "12:c8:79:49:dc:92",
            "net1": "c2:13:7b:bd:f5:e0",
            "net2": "4e:6d:75:5a:7e:70",
            "net3": "12:ae:02:c3:e5:d3",
            "net4": "7e:6a:c6:6f:29:b9",
            "net5": "fa:20:d6:55:a6:ad",
            "net6": "d2:54:2c:73:9b:f7",
            "net7": "e2:2d:28:03:52:44"
        },
        "tof_4_2_1": {
            "net0": "ae:4d:18:fa:76:6e",
            "net1": "92:51:61:4f:91:b3",
            "net2": "a2:de:f8:88:aa:c8",
            "net3": "d2:05:44:57:3a:bd",
            "net4": "c2:52:e2:67:f8:a5",
            "net5": "be:85:43:b6:80:4d",
            "net6": "26:62:73:5a:db:1c",
            "net7": "c6:22:59:0f:86:c1"
        },
        "tof_4_2_2": {
            "net0": "a2:40:f5:d7:f6:1a",
            "net1": "d2:35:82:ee:0d:b9",
            "net2": "ea:f9:67:f7:3c:a0",
            "net3": "66:b3:98:2f:62:69",
            "net4": "0a:ec:40:ab:3b:87",
            "net5": "32:f2:81:9e:35:85",
            "net6": "06:4e:a0:4c:b4:9a",
            "net7": "86:ce:20:74:ac:4c"
        },
        "tof_4_2_3": {
            "net0": "06:f2:9e:a1:d1:9c",
            "net1": "2a:df:49:1e:1c:0e",
            "net2": "e6:ae:c5:99:93:0d",
            "net3": "c2:67:39:73:25:5b",
            "net4": "86:62:3a:47:9f:fa",
            "net5": "26:44:37:2c:42:34",
            "net6": "7a:eb:1b:bc:71:1e",
            "net7": "1a:8a:1c:84:d2:57"
        },
        "tof_4_2_4": {
            "net0": "66:0f:f6:48:21:3b",
            "net1": "ba:f0:67:d3:18:96",
            "net2": "02:84:c7:b6:6d:bd",
            "net3": "66:21:5b:93:4c:a8",
            "net4": "5e:37:88:33:0b:1d",
            "net5": "a2:16:5e:ad:c1:b5",
            "net6": "02:ff:90:6e:8a:ca",
            "net7": "86:d0:b3:12:8b:c7"
        }
    },
    "failed_machine": "leaf_1_0_1",
    "failure_time": {
        "leaf_1_0_1": 1622471591.8553252,
        "leaf_1_0_2": 1622471591.8662796,
        "leaf_1_0_3": 1622471591.8764253,
        "leaf_1_0_4": 1622471591.880726,
        "leaf_2_0_1": 1622471591.883592,
        "leaf_2_0_2": 1622471591.890365,
        "leaf_2_0_3": 1622471591.8974996,
        "leaf_2_0_4": 1622471591.901422,
        "leaf_3_0_1": 1622471591.9097776,
        "leaf_3_0_2": 1622471591.9155204,
        "leaf_3_0_3": 1622471591.8585145,
        "leaf_3_0_4": 1622471591.866433,
        "leaf_4_0_1": 1622471591.878178,
        "leaf_4_0_2": 1622471591.8839378,
        "leaf_4_0_3": 1622471591.8903852,
        "leaf_4_0_4": 1622471591.8968427,
        "leaf_5_0_1": 1622471591.8987849,
        "leaf_5_0_2": 1622471591.9078481,
        "leaf_5_0_3": 1622471591.9117336,
        "leaf_5_0_4": 1622471591.9177344,
        "leaf_6_0_1": 1622471591.9231508,
        "leaf_6_0_2": 1622471591.9289267,
        "leaf_6_0_3": 1622471591.9365487,
        "leaf_6_0_4": 1622471591.9446816,
        "leaf_7_0_1": 1622471591.9530838,
        "leaf_7_0_2": 1622471591.9596007,
        "leaf_7_0_3": 1622471591.9651847,
        "leaf_7_0_4": 1622471591.9695592,
        "leaf_8_0_1": 1622471591.979136,
        "leaf_8_0_2": 1622471591.9846623,
        "leaf_8_0_3": 1622471591.9223986,
        "leaf_8_0_4": 1622471591.929167,
        "spine_1_1_1": 1622471591.9369705,
        "spine_1_1_2": 1622471591.9452338,
        "spine_1_1_3": 1622471591.9527159,
        "spine_1_1_4": 1622471591.9595826,
        "spine_2_1_1": 1622471591.9620109,
        "spine_2_1_2": 1622471591.969094,
        "spine_2_1_3": 1622471591.976811,
        "spine_2_1_4": 1622471591.9849513,
        "spine_3_1_1": 1622471591.9929748,
        "spine_3_1_2": 1622471591.9992888,
        "spine_3_1_3": 1622471592.004664,
        "spine_3_1_4": 1622471592.0132947,
        "spine_4_1_1": 1622471592.0204804,
        "spine_4_1_2": 1622471592.0240376,
        "spine_4_1_3": 1622471592.0301504,
        "spine_4_1_4": 1622471592.0358486,
        "spine_5_1_1": 1622471592.0389335,
        "spine_5_1_2": 1622471592.0478952,
        "spine_5_1_3": 1622471591.9964094,
        "spine_5_1_4": 1622471592.0008197,
        "spine_6_1_1": 1622471592.0061092,
        "spine_6_1_2": 1622471592.0110245,
        "spine_6_1_3": 1622471592.0177572,
        "spine_6_1_4": 1622471592.02146,
        "spine_7_1_1": 1622471592.030832,
        "spine_7_1_2": 1622471592.034667,
        "spine_7_1_3": 1622471592.0412245,
        "spine_7_1_4": 1622471592.0464745,
        "spine_8_1_1": 1622471592.0499575,
        "spine_8_1_2": 1622471592.0604227,
        "spine_8_1_3": 1622471592.0640297,
        "spine_8_1_4": 1622471592.0668046,
        "tof_1_2_1": 1622471592.0763152,
        "tof_1_2_2": 1622471592.0792878,
        "tof_1_2_3": 1622471592.0867112,
        "tof_1_2_4": 1622471592.0941138,
        "tof_2_2_1": 1622471592.1009037,
        "tof_2_2_2": 1622471592.1117902,
        "tof_2_2_3": 1622471592.0521445,
        "tof_2_2_4": 1622471592.0612326,
        "tof_3_2_1": 1622471592.0667903,
        "tof_3_2_2": 1622471592.0718627,
        "tof_3_2_3": 1622471592.0791967,
        "tof_3_2_4": 1622471592.0873535,
        "tof_4_2_1": 1622471592.0952156,
        "tof_4_2_2": 1622471592.101893,
        "tof_4_2_3": 1622471592.1068745,
        "tof_4_2_4": 1622471592.1155307
    }
}