{
    "k_leaf": 10,
    "k_top": 10,
    "redundancy_factor": 10,
    "is_k8s": true,
    "machine_mac_addresses": {
        "leaf_1_0_1": {
            "net0": "ee:db:ae:cc:e8:b6",
            "net1": "22:20:84:3d:d9:21",
            "net10": "9e:3a:e3:5e:fa:be",
            "net2": "9a:d4:74:2c:7c:dc",
            "net3": "4e:79:7d:e2:bc:1f",
            "net4": "ee:38:71:b0:20:8d",
            "net5": "4a:4c:ee:4a:3d:9f",
            "net6": "ea:0d:cc:38:69:9f",
            "net7": "9e:1f:fd:52:00:f9",
            "net8": "42:e2:4d:3d:32:f5",
            "net9": "6e:0c:85:a6:f7:80"
        },
        "leaf_1_0_10": {
            "net0": "ce:71:b0:05:63:71",
            "net1": "5a:7b:4c:72:47:6f",
            "net10": "36:e7:54:e0:1a:6d",
            "net2": "de:f5:98:df:0a:c2",
            "net3": "9e:28:8b:8b:e6:72",
            "net4": "2a:b5:9f:8b:3a:73",
            "net5": "86:06:5f:a5:fe:f9",
            "net6": "2e:77:1e:07:e3:25",
            "net7": "7e:1a:1e:de:df:de",
            "net8": "a2:1b:7b:04:fe:cf",
            "net9": "86:57:42:4f:6c:02"
        },
        "leaf_1_0_2": {
            "net0": "3e:78:ef:8b:2c:c7",
            "net1": "e2:41:28:96:e5:a6",
            "net10": "ba:2f:5c:e8:dc:6c",
            "net2": "7a:fb:e3:6e:a9:58",
            "net3": "ea:22:c9:c7:1c:ce",
            "net4": "ea:5f:9e:21:61:cc",
            "net5": "3e:15:68:8a:d5:ea",
            "net6": "da:ab:c2:03:c8:82",
            "net7": "8a:0a:a1:c9:7d:9d",
            "net8": "1e:36:a4:bf:8b:5f",
            "net9": "1e:18:07:44:5a:10"
        },
        "leaf_1_0_3": {
            "net0": "2e:48:65:28:4a:49",
            "net1": "46:c8:50:3b:a0:ac",
            "net10": "86:3c:4d:56:dc:f2",
            "net2": "1a:5d:7f:64:88:b6",
            "net3": "62:7a:b5:b6:28:dc",
            "net4": "7a:24:12:eb:22:94",
            "net5": "36:d4:65:a4:0a:02",
            "net6": "de:30:12:ab:9a:93",
            "net7": "66:a7:d6:ec:81:76",
            "net8": "0a:8c:84:d6:57:31",
            "net9": "fe:71:73:fd:6e:78"
        },
        "leaf_1_0_4": {
            "net0": "66:06:05:f8:4d:83",
            "net1": "5a:85:7b:66:22:44",
            "net10": "82:b8:4b:e7:94:98",
            "net2": "fe:fc:2d:68:17:5d",
            "net3": "5e:15:a3:44:da:51",
            "net4": "4a:3a:7e:5a:71:c9",
            "net5": "da:83:76:fa:6e:f6",
            "net6": "a2:53:6b:b3:8a:24",
            "net7": "9e:d7:22:10:82:36",
            "net8": "f2:d2:6d:a0:1b:94",
            "net9": "ea:39:05:c4:93:9d"
        },
        "leaf_1_0_5": {
            "net0": "4e:66:4a:f8:04:1d",
            "net1": "0e:6f:14:6c:ae:ac",
            "net10": "da:ee:39:f2:cb:9b",
            "net2": "b2:c5:94:bc:a8:ad",
            "net3": "06:c6:d0:0d:fa:af",
            "net4": "6e:14:6f:09:e0:64",
            "net5": "6e:eb:94:69:a0:92",
            "net6": "ea:77:b6:e9:58:90",
            "net7": "ae:f3:0a:95:f2:1d",
            "net8": "72:4a:03:2e:e4:64",
            "net9": "d6:20:a2:48:fa:9d"
        },
        "leaf_1_0_6": {
            "net0": "46:1c:f8:ce:dc:85",
            "net1": "e2:8b:8e:23:58:59",
            "net10": "2a:28:54:18:95:65",
            "net2": "de:ff:dc:2c:8b:a1",
            "net3": "62:07:6b:d9:4f:2b",
            "net4": "8a:28:be:ff:64:80",
            "net5": "72:bb:d0:60:91:f5",
            "net6": "1e:06:21:02:81:d6",
            "net7": "fe:63:b4:73:84:a1",
            "net8": "de:47:dc:f5:d3:20",
            "net9": "c6:9e:b5:81:d3:bc"
        },
        "leaf_1_0_7": {
            "net0": "ae:91:fc:f4:90:d5",
            "net1": "02:e4:5c:20:1d:14",
            "net10": "2a:f4:29:8c:d3:53",
            "net2": "72:34:3b:07:4a:6a",
            "net3": "22:2c:35:a1:16:90",
            "net4": "32:a4:fa:38:8a:27",
            "net5": "2e:81:ce:3e:d2:7f",
            "net6": "1a:52:58:b3:c1:b4",
            "net7": "b2:9a:8b:cf:77:24",
            "net8": "96:69:09:99:8e:ae",
            "net9": "36:b6:6c:15:26:1b"
        },
        "leaf_1_0_8": {
            "net0": "9a:90:14:d1:a6:eb",
            "net1": "22:df:aa:95:d3:26",
            "net10": "d6:d0:65:12:12:43",
            "net2": "76:4f:21:db:aa:e7",
            "net3": "42:50:0e:35:6b:60",
            "net4": "ca:ca:75:55:66:13",
            "net5": "3e:ed:87:7f:da:87",
            "net6": "c2:93:fb:86:16:11",
            "net7": "06:4b:a5:41:74:56",
            "net8": "62:3b:1c:b8:38:ad",
            "net9": "46:34:0d:ec:2f:42"
        },
        "leaf_1_0_9": {
            "net0": "16:47:28:e1:e1:ee",
            "net1": "52:0c:49:70:fd:2a",
            "net10": "6e:36:77:9d:74:0f",
            "net2": "e6:36:58:1b:41:10",
            "net3": "ce:54:7a:e2:18:b2",
            "net4": "26:54:da:01:b1:81",
            "net5": "36:a3:a7:51:d0:06",
            "net6": "1a:c2:a7:0a:d6:09",
            "net7": "76:22:65:44:f1:9e",
            "net8": "26:d1:16:29:6e:1d",
            "net9": "8a:4f:d9:36:99:f4"
        },
        "leaf_2_0_1": {
            "net0": "02:5a:fc:77:b1:c2",
            "net1": "66:f1:3f:f6:d9:8c",
            "net10": "82:81:59:6b:2a:80",
            "net2": "1a:c6:f6:cc:9f:6e",
            "net3": "aa:99:70:9e:1c:95",
            "net4": "6a:cd:9d:a4:86:54",
            "net5": "62:ac:73:75:38:c9",
            "net6": "62:90:5a:d2:67:b2",
            "net7": "0a:3c:3b:4a:e4:56",
            "net8": "1e:84:b6:9b:29:0a",
            "net9": "e2:cb:1c:bb:db:e6"
        },
        "leaf_2_0_10": {
            "net0": "aa:b8:d5:95:a3:77",
            "net1": "06:3f:02:60:83:1e",
            "net10": "32:1b:b2:a0:85:89",
            "net2": "a2:52:de:de:9b:ff",
            "net3": "ba:7b:81:49:36:58",
            "net4": "be:68:fe:38:ff:de",
            "net5": "6a:38:16:c3:a5:68",
            "net6": "0a:85:c5:48:9c:27",
            "net7": "96:4c:31:0e:d5:57",
            "net8": "fe:23:45:78:a6:07",
            "net9": "96:1c:dc:64:e9:8d"
        },
        "leaf_2_0_2": {
            "net0": "1e:5c:5b:a0:0c:f7",
            "net1": "ae:74:48:ef:6d:f0",
            "net10": "26:4a:1c:bb:8c:e2",
            "net2": "3a:d6:da:05:35:d0",
            "net3": "de:c5:3f:b3:79:b1",
            "net4": "26:fb:b2:ab:49:1f",
            "net5": "c2:c7:29:06:95:bc",
            "net6": "ba:c0:5f:d1:7c:4b",
            "net7": "12:03:f2:c1:d1:0b",
            "net8": "1a:62:6e:8d:38:cc",
            "net9": "be:6c:e4:61:94:8f"
        },
        "leaf_2_0_3": {
            "net0": "ba:bf:7a:c1:02:d9",
            "net1": "3e:e5:13:6b:00:97",
            "net10": "c2:94:18:14:d1:72",
            "net2": "0e:a4:53:89:b7:70",
            "net3": "72:b7:e5:a0:ed:3b",
            "net4": "3a:99:10:54:d0:08",
            "net5": "ce:7f:2f:e8:5b:89",
            "net6": "e2:0a:be:b9:e1:ac",
            "net7": "42:78:00:2d:aa:9e",
            "net8": "ee:df:a1:5b:c0:d1",
            "net9": "9e:e1:a5:bf:37:ba"
        },
        "leaf_2_0_4": {
            "net0": "f2:f4:d2:6c:5a:3d",
            "net1": "42:28:0f:c5:41:2a",
            "net10": "da:1d:92:ee:44:7a",
            "net2": "92:3b:a2:4a:77:c9",
            "net3": "f6:76:7b:d1:0c:1e",
            "net4": "2e:b6:52:82:ce:7e",
            "net5": "c6:34:37:f7:ad:6e",
            "net6": "66:8e:be:12:85:12",
            "net7": "36:0e:b2:32:d8:bc",
            "net8": "1e:86:cd:02:f3:88",
            "net9": "ba:25:0e:da:52:1b"
        },
        "leaf_2_0_5": {
            "net0": "a2:5c:9a:bc:48:13",
            "net1": "8e:dc:64:cf:f6:2e",
            "net10": "06:39:54:a9:9f:0b",
            "net2": "ee:5d:46:56:11:a0",
            "net3": "ba:51:3a:12:60:9c",
            "net4": "a6:ce:65:3d:7d:5f",
            "net5": "46:34:fa:cf:6b:3a",
            "net6": "9a:70:d9:04:4c:a7",
            "net7": "22:c6:6c:bf:0d:fa",
            "net8": "e6:d1:e1:c4:1e:aa",
            "net9": "ee:79:02:6a:a3:82"
        },
        "leaf_2_0_6": {
            "net0": "7a:ea:9b:e7:1b:be",
            "net1": "5e:62:f0:65:3c:d1",
            "net10": "16:18:21:1c:0d:4d",
            "net2": "b6:06:13:f2:5e:c4",
            "net3": "e2:e3:fc:6e:11:44",
            "net4": "96:ce:f9:c6:68:d4",
            "net5": "9e:91:1f:55:1b:77",
            "net6": "22:53:14:cf:8e:d1",
            "net7": "8e:49:7c:11:7a:78",
            "net8": "56:1a:03:b4:c1:24",
            "net9": "8e:1c:73:6c:1e:53"
        },
        "leaf_2_0_7": {
            "net0": "ce:4e:e5:af:6e:eb",
            "net1": "e2:ef:dc:37:6b:ea",
            "net10": "be:1c:1e:59:f5:24",
            "net2": "26:48:4b:81:cc:4c",
            "net3": "92:5f:9b:92:20:83",
            "net4": "ca:36:b4:7b:de:26",
            "net5": "0a:18:d6:18:ae:51",
            "net6": "da:11:30:48:8e:ec",
            "net7": "d6:c0:2b:b2:d7:40",
            "net8": "3a:0a:2a:42:f6:61",
            "net9": "b2:ef:aa:12:17:29"
        },
        "leaf_2_0_8": {
            "net0": "c2:17:c5:c3:6c:62",
            "net1": "ea:36:15:33:22:1d",
            "net10": "5e:e8:9a:f1:d5:42",
            "net2": "a6:b0:c3:6c:4e:ed",
            "net3": "86:39:7b:e3:5b:fa",
            "net4": "9e:58:87:00:8e:63",
            "net5": "a6:3d:b1:b4:60:af",
            "net6": "ca:9f:01:cd:75:66",
            "net7": "ee:5b:56:ca:e9:b8",
            "net8": "4a:8a:cb:2c:54:fb",
            "net9": "2a:90:31:c9:b1:e0"
        },
        "leaf_2_0_9": {
            "net0": "92:1f:88:ad:2e:5c",
            "net1": "f2:6c:c2:a3:a7:0c",
            "net10": "82:0f:5e:b6:cd:27",
            "net2": "a6:58:e2:63:2d:14",
            "net3": "02:2b:e4:b5:95:05",
            "net4": "6a:b6:5a:70:c9:51",
            "net5": "c6:52:e1:04:55:5f",
            "net6": "5a:e2:2e:e0:09:48",
            "net7": "76:a6:cc:e2:af:79",
            "net8": "8e:68:b2:b1:31:eb",
            "net9": "72:12:85:ab:60:e0"
        },
        "spine_1_1_1": {
            "net0": "36:69:a7:83:a3:02",
            "net1": "a6:32:ff:43:fa:9d",
            "net10": "66:9d:a3:d3:8e:44",
            "net11": "de:1f:4c:50:c4:50",
            "net12": "72:fb:a9:25:7a:0f",
            "net13": "ce:e3:80:3f:41:25",
            "net14": "f2:5e:56:c0:64:bb",
            "net15": "3a:b4:59:8e:1f:7c",
            "net16": "de:b3:62:80:a1:90",
            "net17": "d2:a3:77:8d:5d:98",
            "net18": "32:c6:b0:21:99:39",
            "net19": "b6:a4:ac:06:59:6c",
            "net2": "32:7e:c6:79:9b:07",
            "net3": "96:4b:3f:ee:bc:67",
            "net4": "b6:d8:45:9b:e6:4b",
            "net5": "ee:ba:7e:29:bd:99",
            "net6": "62:18:cd:0e:3b:8a",
            "net7": "9e:9a:b2:2b:28:06",
            "net8": "32:16:75:1e:09:ee",
            "net9": "62:18:0d:28:23:7c"
        },
        "spine_1_1_10": {
            "net0": "3e:6a:be:58:bc:7c",
            "net1": "32:72:bb:f3:25:71",
            "net10": "ce:3b:90:2b:ca:8c",
            "net11": "9a:1e:87:3c:cf:fb",
            "net12": "ca:f5:2a:63:49:67",
            "net13": "5a:ca:7e:6f:c5:2f",
            "net14": "72:40:2c:c5:73:be",
            "net15": "1e:09:19:7a:a6:a4",
            "net16": "42:9e:0f:31:00:3f",
            "net17": "ee:8c:f4:03:51:96",
            "net18": "f2:f4:9d:62:0f:75",
            "net19": "56:36:27:6b:79:83",
            "net2": "5e:54:90:5f:59:d8",
            "net3": "d6:e5:49:0d:96:03",
            "net4": "a6:e8:26:a1:c9:cf",
            "net5": "ce:a7:dd:ec:cb:34",
            "net6": "86:88:82:18:9a:f9",
            "net7": "22:5e:65:eb:32:48",
            "net8": "ee:20:be:98:39:f3",
            "net9": "2a:48:62:15:4f:9c"
        },
        "spine_1_1_2": {
            "net0": "36:8c:78:54:83:fc",
            "net1": "96:81:f9:a9:9a:89",
            "net10": "f2:32:ac:3b:c2:64",
            "net11": "4e:bc:6f:32:4c:48",
            "net12": "8e:a8:b6:15:f7:f5",
            "net13": "ee:d4:6a:b1:8b:2a",
            "net14": "8e:33:b5:f1:ed:50",
            "net15": "42:b5:d6:1a:a1:f3",
            "net16": "32:20:b0:85:5d:7b",
            "net17": "3e:5b:81:73:5c:95",
            "net18": "c6:16:fb:e5:e7:8b",
            "net19": "86:a1:58:d5:57:be",
            "net2": "4a:b2:d7:8d:04:58",
            "net3": "66:43:4f:fc:1d:c6",
            "net4": "6a:a8:f4:c9:a2:e7",
            "net5": "62:f9:96:58:bf:82",
            "net6": "2a:f1:dd:27:3c:a6",
            "net7": "de:b1:8e:57:65:6a",
            "net8": "a6:30:bb:1d:18:f6",
            "net9": "b6:24:af:a9:6f:90"
        },
        "spine_1_1_3": {
            "net0": "66:ce:29:9e:d4:b9",
            "net1": "0e:29:2c:c1:00:0a",
            "net10": "56:65:54:e7:f9:4a",
            "net11": "32:c0:76:98:f9:bb",
            "net12": "16:1a:df:18:e1:6f",
            "net13": "56:e8:6a:d0:20:e0",
            "net14": "3e:f8:19:30:f4:b9",
            "net15": "9a:07:0c:37:e0:14",
            "net16": "96:2e:d7:c6:64:77",
            "net17": "fe:51:1d:64:2f:b7",
            "net18": "1a:e1:3e:cd:06:2c",
            "net19": "9e:bf:2b:a4:f9:d4",
            "net2": "6e:04:a9:06:89:f2",
            "net3": "56:50:31:d5:8a:04",
            "net4": "56:ba:db:57:42:c6",
            "net5": "ea:03:0e:1f:dd:d6",
            "net6": "9e:94:4f:34:d5:55",
            "net7": "da:bf:5b:40:58:c6",
            "net8": "56:ee:e9:a2:81:cc",
            "net9": "42:e7:19:9e:1f:80"
        },
        "spine_1_1_4": {
            "net0": "5a:d9:6a:ed:67:4e",
            "net1": "2a:9d:e2:7e:cf:fd",
            "net10": "3e:95:f8:f2:7b:d7",
            "net11": "12:6f:d3:44:2e:e8",
            "net12": "e2:72:e9:80:a0:9a",
            "net13": "76:70:5a:ab:84:db",
            "net14": "ea:59:22:38:de:d8",
            "net15": "02:e1:29:df:44:13",
            "net16": "96:cc:0e:64:10:4b",
            "net17": "f6:53:8f:a6:d6:a5",
            "net18": "5e:93:9c:d6:13:82",
            "net19": "76:d4:54:95:b1:31",
            "net2": "6a:24:4c:66:6f:3d",
            "net3": "a6:91:f2:0d:82:db",
            "net4": "be:56:7b:ff:77:ae",
            "net5": "42:17:26:ce:9a:8a",
            "net6": "86:eb:94:67:e5:4f",
            "net7": "4e:31:40:29:d3:59",
            "net8": "0e:20:61:90:b0:0e",
            "net9": "06:79:6b:80:c1:f0"
        },
        "spine_1_1_5": {
            "net0": "de:09:50:b9:8a:25",
            "net1": "52:f1:7d:9a:48:82",
            "net10": "42:dd:8d:c8:93:8e",
            "net11": "2a:7a:1d:be:7c:cf",
            "net12": "56:9b:df:75:2e:a8",
            "net13": "8e:5a:8e:63:8c:2c",
            "net14": "5e:04:9e:b7:c3:2d",
            "net15": "b2:7a:04:c9:47:3e",
            "net16": "2e:bf:c6:e9:7f:44",
            "net17": "e2:f3:39:45:d3:55",
            "net18": "5e:cf:e8:ca:c3:3e",
            "net19": "ce:13:34:21:51:02",
            "net2": "ca:ce:b4:16:bc:ba",
            "net3": "3e:3f:5c:dd:a7:8e",
            "net4": "7e:90:08:75:0c:c4",
            "net5": "8a:95:57:4f:b2:ad",
            "net6": "4a:69:26:41:b7:6e",
            "net7": "d2:db:fc:2d:64:a6",
            "net8": "9a:2a:f8:dc:ad:42",
            "net9": "52:5c:9c:e3:33:5d"
        },
        "spine_1_1_6": {
            "net0": "0a:88:d4:1d:c0:31",
            "net1": "06:d7:ec:c0:1d:57",
            "net10": "fa:93:3f:16:c8:c8",
            "net11": "46:92:a3:e4:83:15",
            "net12": "66:53:df:7b:9c:fe",
            "net13": "4e:2a:cd:af:f3:bb",
            "net14": "a6:6e:da:b4:24:a0",
            "net15": "fe:ce:77:d6:7f:54",
            "net16": "42:98:a9:f6:62:b5",
            "net17": "ea:fa:79:cf:de:f4",
            "net18": "da:04:bb:2b:55:7d",
            "net19": "86:f6:21:23:e3:5a",
            "net2": "0e:08:15:ad:e6:c9",
            "net3": "42:4d:fc:f6:0f:c8",
            "net4": "de:a6:29:0b:f4:2d",
            "net5": "02:80:f0:b7:d3:4a",
            "net6": "d2:4e:b6:55:11:7e",
            "net7": "4e:05:17:4c:ef:98",
            "net8": "7e:d7:00:aa:33:ae",
            "net9": "fa:5b:d3:ab:2b:44"
        },
        "spine_1_1_7": {
            "net0": "ee:a0:8d:3f:19:ea",
            "net1": "ca:a9:81:f1:d6:c8",
            "net10": "e2:7e:73:4c:8c:62",
            "net11": "2a:7c:31:e5:62:51",
            "net12": "e2:46:eb:f0:f5:ca",
            "net13": "5a:98:8c:d1:10:77",
            "net14": "82:e1:cb:dd:68:90",
            "net15": "16:a2:79:28:0a:b2",
            "net16": "da:cb:61:0f:3e:e7",
            "net17": "de:4d:2a:85:2c:cb",
            "net18": "32:09:45:84:74:ca",
            "net19": "da:a6:b3:fc:8a:94",
            "net2": "e6:74:4a:27:3b:b7",
            "net3": "3a:1a:03:e2:21:a4",
            "net4": "06:ce:04:fe:54:85",
            "net5": "02:db:61:0b:d9:ed",
            "net6": "4e:bd:32:a5:08:41",
            "net7": "4e:ca:2b:0d:e6:c0",
            "net8": "1e:9f:79:75:8d:79",
            "net9": "4e:98:14:16:ea:57"
        },
        "spine_1_1_8": {
            "net0": "6e:7c:4a:60:5e:87",
            "net1": "6e:d1:06:22:92:0a",
            "net10": "9a:9e:61:82:ef:40",
            "net11": "8e:90:2b:70:69:f1",
            "net12": "5e:01:2d:d8:b4:a8",
            "net13": "4e:cb:0b:33:d7:16",
            "net14": "8a:c5:2f:83:9d:b3",
            "net15": "a2:55:92:8c:3b:96",
            "net16": "aa:9c:10:87:e8:bf",
            "net17": "a6:63:1a:1b:2c:1f",
            "net18": "fe:f5:32:83:17:de",
            "net19": "9a:bf:fb:49:c7:f8",
            "net2": "8a:8f:00:65:db:38",
            "net3": "2e:ba:c4:6f:0d:52",
            "net4": "3a:c1:be:1b:2f:a0",
            "net5": "fe:d4:31:a8:41:80",
            "net6": "32:ca:24:5c:9f:30",
            "net7": "f2:0b:d2:17:a8:fc",
            "net8": "3e:c1:1d:2a:e2:72",
            "net9": "32:66:b0:6c:8b:1e"
        },
        "spine_1_1_9": {
            "net0": "be:51:33:61:26:35",
            "net1": "46:d7:5d:57:86:9a",
            "net10": "4a:31:ea:87:ee:b5",
            "net11": "d2:3f:2b:27:32:3f",
            "net12": "8a:a7:ad:20:6a:d6",
            "net13": "8e:90:5c:27:92:32",
            "net14": "16:26:3b:75:3b:23",
            "net15": "1a:5e:55:fc:2c:4d",
            "net16": "9e:45:6e:45:b8:7f",
            "net17": "8a:2f:cf:75:9a:13",
            "net18": "2e:aa:51:7a:d2:03",
            "net19": "06:96:e2:05:bc:29",
            "net2": "52:c8:f8:fb:45:b9",
            "net3": "6a:1e:b5:b8:33:f1",
            "net4": "86:b1:0f:8f:72:dc",
            "net5": "b2:0f:a6:42:9a:da",
            "net6": "92:f4:7d:38:e6:07",
            "net7": "ba:21:62:da:65:4d",
            "net8": "de:99:eb:f9:34:a0",
            "net9": "62:66:57:b5:b8:dd"
        },
        "spine_2_1_1": {
            "net0": "46:0a:7b:98:50:fe",
            "net1": "c2:94:84:86:d4:40",
            "net10": "a6:97:10:6f:52:04",
            "net11": "a6:37:7b:f7:06:4a",
            "net12": "56:a6:bf:d7:69:af",
            "net13": "e2:d0:6e:5f:70:76",
            "net14": "1e:34:f6:1d:55:11",
            "net15": "e2:82:64:4a:b9:76",
            "net16": "f2:7a:f6:19:1b:e0",
            "net17": "1a:0f:1c:ce:5d:67",
            "net18": "92:ba:74:4f:1a:c1",
            "net19": "2e:ac:bd:f1:20:62",
            "net2": "02:f0:dd:2d:fa:db",
            "net3": "f6:0d:62:82:d5:07",
            "net4": "aa:f2:5a:d7:93:c2",
            "net5": "66:35:98:4f:55:d3",
            "net6": "86:74:e1:a1:34:79",
            "net7": "5e:53:cc:3f:b0:2c",
            "net8": "de:0e:50:11:a9:5f",
            "net9": "2e:9f:31:7f:9a:44"
        },
        "spine_2_1_10": {
            "net0": "4e:af:c7:df:e6:26",
            "net1": "42:f8:f9:78:0a:52",
            "net10": "1e:d0:eb:94:f3:10",
            "net11": "e2:da:c0:ba:ae:22",
            "net12": "c2:46:fa:a4:e1:59",
            "net13": "4a:fa:3c:ea:54:54",
            "net14": "2e:ff:ff:36:b0:d3",
            "net15": "1a:26:e6:6b:e1:a5",
            "net16": "52:6a:88:e4:cd:4c",
            "net17": "8e:ad:46:f2:5e:6a",
            "net18": "e6:26:5f:c0:30:f9",
            "net19": "86:13:4e:6d:04:e1",
            "net2": "de:34:b7:5c:3f:f5",
            "net3": "92:86:f0:b2:c2:32",
            "net4": "36:91:37:4e:de:dd",
            "net5": "b6:1c:b8:4c:eb:a3",
            "net6": "4e:e0:8a:a7:c3:fa",
            "net7": "b2:9f:57:d7:bf:a5",
            "net8": "ee:f3:03:32:39:b3",
            "net9": "8a:b2:56:bb:9e:54"
        },
        "spine_2_1_2": {
            "net0": "f2:eb:69:3f:cf:78",
            "net1": "22:96:e3:15:ee:15",
            "net10": "02:72:ee:3a:63:cc",
            "net11": "1e:c9:bd:3a:70:73",
            "net12": "fe:dd:87:b7:bb:ed",
            "net13": "46:d5:3a:28:65:f1",
            "net14": "4a:39:8c:8c:c6:30",
            "net15": "ea:8b:41:bd:6a:a8",
            "net16": "0a:41:72:15:bf:21",
            "net17": "2a:ae:26:55:11:f8",
            "net18": "66:d1:69:b8:f8:4e",
            "net19": "92:47:ad:e4:af:78",
            "net2": "6e:78:71:8b:42:c1",
            "net3": "56:1b:65:d5:3a:71",
            "net4": "be:21:a2:a5:9b:b9",
            "net5": "52:a2:aa:15:f7:7f",
            "net6": "ea:da:45:b1:35:2f",
            "net7": "de:db:21:78:4b:3e",
            "net8": "26:58:95:b4:9b:09",
            "net9": "26:1b:bc:73:a7:b7"
        },
        "spine_2_1_3": {
            "net0": "02:f5:66:21:7f:10",
            "net1": "fa:1f:36:8b:5f:1d",
            "net10": "ce:12:7d:13:c0:a0",
            "net11": "fa:b8:70:63:d7:0b",
            "net12": "c2:3b:22:d7:86:f6",
            "net13": "0e:48:4f:9e:84:15",
            "net14": "fe:c3:50:cb:40:ae",
            "net15": "4a:5e:e7:5c:f2:ce",
            "net16": "0e:d3:60:38:83:94",
            "net17": "2a:48:00:42:80:33",
            "net18": "22:e2:77:2d:34:1e",
            "net19": "76:43:f9:6f:d8:5b",
            "net2": "22:a1:13:dd:53:35",
            "net3": "42:67:52:73:27:07",
            "net4": "a6:f2:73:19:c9:67",
            "net5": "1a:db:04:32:0b:4e",
            "net6": "3a:d2:4e:12:37:d3",
            "net7": "ce:fa:3b:22:8c:6d",
            "net8": "ae:e3:15:9b:16:0f",
            "net9": "de:8c:60:87:18:8a"
        },
        "spine_2_1_4": {
            "net0": "ba:a7:f3:81:98:71",
            "net1": "a6:ca:34:c9:5c:57",
            "net10": "e2:ba:35:3d:5b:49",
            "net11": "ce:af:0e:b7:ac:55",
            "net12": "3e:17:23:83:e3:df",
            "net13": "fa:9f:2a:69:1f:70",
            "net14": "16:37:de:ad:9d:3a",
            "net15": "42:98:40:a4:79:0b",
            "net16": "d2:ee:10:18:03:22",
            "net17": "7a:bc:5e:06:8f:e1",
            "net18": "be:00:7e:86:84:63",
            "net19": "6e:1d:bf:a1:46:9d",
            "net2": "e2:b7:90:c0:4f:a3",
            "net3": "2e:d7:a0:97:f6:c2",
            "net4": "7e:45:39:b2:4c:7e",
            "net5": "d6:06:b2:26:58:ea",
            "net6": "ba:58:b7:50:88:27",
            "net7": "32:2c:9d:ee:3a:96",
            "net8": "22:4f:5e:fa:67:d7",
            "net9": "0a:27:09:b5:69:29"
        },
        "spine_2_1_5": {
            "net0": "ca:0c:70:3f:f6:60",
            "net1": "22:7d:21:e1:a3:df",
            "net10": "fa:70:f7:66:e7:24",
            "net11": "1a:e5:04:a9:1e:f8",
            "net12": "de:4c:92:32:2b:49",
            "net13": "be:a2:2b:df:e3:69",
            "net14": "ee:c8:c8:9b:b3:00",
            "net15": "6e:aa:f5:b9:36:29",
            "net16": "8e:e4:28:40:92:e2",
            "net17": "7e:7f:e5:03:84:43",
            "net18": "06:0e:49:51:4d:fb",
            "net19": "5a:fd:9f:89:0c:3f",
            "net2": "de:de:c8:b1:4d:18",
            "net3": "42:cf:19:49:0c:ca",
            "net4": "7a:55:ec:f8:ec:6b",
            "net5": "da:43:9b:b9:98:1a",
            "net6": "7e:cc:18:8f:2c:61",
            "net7": "8a:f9:8f:d0:d5:cd",
            "net8": "5e:fd:74:8c:88:9f",
            "net9": "9a:eb:e3:f2:cc:20"
        },
        "spine_2_1_6": {
            "net0": "2a:9e:dd:68:99:66",
            "net1": "1e:3e:ad:9b:98:d5",
            "net10": "72:54:d1:a2:6f:27",
            "net11": "c2:09:3e:73:9b:66",
            "net12": "52:b5:04:da:d8:67",
            "net13": "26:f3:89:30:89:15",
            "net14": "1a:a9:5a:40:bb:0e",
            "net15": "86:98:35:69:92:c8",
            "net16": "1a:05:0b:cd:27:23",
            "net17": "e6:8c:68:2f:fe:b9",
            "net18": "32:0b:46:e9:8b:82",
            "net19": "62:f9:10:aa:42:ba",
            "net2": "46:5a:a4:70:fa:36",
            "net3": "d6:ff:fb:da:8d:da",
            "net4": "42:89:db:82:28:1e",
            "net5": "36:d4:d1:1f:79:d0",
            "net6": "ba:38:5d:55:6f:ab",
            "net7": "32:d5:7b:61:ff:43",
            "net8": "72:e9:4d:0c:cd:77",
            "net9": "f6:79:45:8d:9e:a9"
        },
        "spine_2_1_7": {
            "net0": "9a:41:a8:12:07:a9",
            "net1": "b2:83:bc:03:b5:09",
            "net10": "46:2d:d4:16:64:a4",
            "net11": "42:4f:04:b5:59:f9",
            "net12": "5e:84:5b:94:cb:de",
            "net13": "52:9d:94:0f:18:9d",
            "net14": "d6:65:50:a8:e6:a4",
            "net15": "aa:0d:fa:34:68:78",
            "net16": "22:64:cd:7a:0f:ee",
            "net17": "c6:0c:cc:d3:af:f1",
            "net18": "a2:b0:ca:6c:0b:4f",
            "net19": "c2:ab:ed:51:b0:b2",
            "net2": "c2:1c:f5:ab:42:a8",
            "net3": "36:99:88:ab:5d:f3",
            "net4": "92:06:8d:18:74:42",
            "net5": "d2:fc:1a:66:2d:bf",
            "net6": "86:7a:7d:a5:86:7f",
            "net7": "b6:da:6a:74:55:17",
            "net8": "06:4e:b2:f7:c5:bf",
            "net9": "3e:49:13:28:07:b5"
        },
        "spine_2_1_8": {
            "net0": "6a:65:c8:fc:9a:05",
            "net1": "ee:15:c3:d5:bb:6f",
            "net10": "ce:2e:15:49:ec:f3",
            "net11": "52:1d:40:72:4d:5a",
            "net12": "d6:a7:3e:0c:d9:1a",
            "net13": "92:60:84:ac:51:03",
            "net14": "d6:89:8d:5d:47:b5",
            "net15": "62:64:64:f1:7c:e9",
            "net16": "36:0a:aa:2c:7f:17",
            "net17": "0e:8b:17:22:bf:02",
            "net18": "66:c2:37:34:47:72",
            "net19": "46:e1:1d:be:fa:5a",
            "net2": "62:ca:e1:d7:92:9c",
            "net3": "12:4b:f1:a5:f0:c4",
            "net4": "66:24:66:7b:f2:49",
            "net5": "ca:1f:51:56:52:95",
            "net6": "b6:25:4a:73:89:ed",
            "net7": "12:4d:62:c6:a8:60",
            "net8": "6a:d9:f9:c1:e7:74",
            "net9": "06:35:e5:ca:bc:8f"
        },
        "spine_2_1_9": {
            "net0": "92:32:ae:ce:1f:8b",
            "net1": "aa:8f:6a:3f:b3:49",
            "net10": "72:c9:42:2e:30:74",
            "net11": "a2:88:74:4c:73:db",
            "net12": "d6:c7:ed:d2:c8:39",
            "net13": "9a:fb:5f:a0:c1:af",
            "net14": "26:25:ca:ab:8e:2c",
            "net15": "2e:15:07:9d:a9:3f",
            "net16": "9e:06:b4:01:27:09",
            "net17": "06:75:6b:d2:70:0f",
            "net18": "ce:3e:16:ff:c1:c7",
            "net19": "46:55:58:31:4e:98",
            "net2": "c2:19:72:70:5b:28",
            "net3": "9e:8e:48:41:31:12",
            "net4": "02:d5:0b:3e:9c:c8",
            "net5": "a2:3f:b5:a4:b5:e4",
            "net6": "d6:97:db:96:f0:07",
            "net7": "f6:7b:9a:10:c0:02",
            "net8": "66:c6:29:ed:dc:80",
            "net9": "5e:b1:e3:6d:f4:39"
        },
        "tof_1_2_1": {
            "net0": "ba:9e:90:d5:23:64",
            "net1": "1e:a0:b9:34:10:eb",
            "net10": "2e:e9:d5:65:9a:63",
            "net11": "3a:d9:57:2b:9d:3c",
            "net12": "d2:8c:e2:47:b4:c6",
            "net13": "12:c3:d3:0f:70:d3",
            "net14": "e2:3c:ec:64:55:51",
            "net15": "72:0b:37:af:0d:db",
            "net16": "da:7c:b2:a1:9b:88",
            "net17": "42:8f:7a:c2:b2:4a",
            "net18": "ee:fc:76:2c:7d:0e",
            "net19": "d6:4c:fd:36:04:28",
            "net2": "9a:1a:6d:ef:e3:f0",
            "net3": "6a:dc:92:21:41:7f",
            "net4": "52:e8:77:25:0c:35",
            "net5": "ee:89:e3:89:dd:03",
            "net6": "5a:e2:44:ab:c0:ba",
            "net7": "c6:da:66:69:8e:b4",
            "net8": "7a:1f:aa:1d:dd:b0",
            "net9": "0a:13:b9:f9:0d:fd"
        },
        "tof_1_2_10": {
            "net0": "46:88:17:b1:b2:c2",
            "net1": "66:40:77:df:5c:b5",
            "net10": "5a:c5:3b:c1:ad:89",
            "net11": "ba:f6:18:b4:da:ae",
            "net12": "5e:db:d4:f6:45:16",
            "net13": "16:c5:95:2d:16:94",
            "net14": "42:0d:b5:b1:99:2b",
            "net15": "5e:a1:cf:2a:1e:4c",
            "net16": "16:3b:59:4f:95:fa",
            "net17": "de:df:fe:78:ac:c1",
            "net18": "72:ba:eb:0d:6a:1a",
            "net19": "b6:73:0a:ff:4c:32",
            "net2": "76:30:1c:d0:c6:df",
            "net3": "fa:7f:ca:85:77:2a",
            "net4": "72:8a:02:9c:1a:15",
            "net5": "76:4e:f2:95:5b:91",
            "net6": "e2:5c:a3:0e:55:0b",
            "net7": "d6:06:f7:9c:92:de",
            "net8": "92:34:9e:35:8b:78",
            "net9": "52:80:bc:77:99:38"
        },
        "tof_1_2_2": {
            "net0": "d2:c2:63:d2:31:6a",
            "net1": "06:64:25:59:8c:fe",
            "net10": "d6:95:0d:33:6b:18",
            "net11": "36:b9:ba:48:50:5b",
            "net12": "82:00:3a:03:69:62",
            "net13": "7e:47:46:9b:23:7a",
            "net14": "46:a2:e7:51:64:2c",
            "net15": "06:c3:cc:ea:91:22",
            "net16": "02:f6:2d:3c:8c:88",
            "net17": "12:7d:24:aa:88:b4",
            "net18": "f2:21:3b:00:83:da",
            "net19": "32:3c:e0:18:cc:1d",
            "net2": "c2:c8:6b:21:1c:ae",
            "net3": "32:01:e8:88:7f:24",
            "net4": "be:1a:cd:69:17:40",
            "net5": "ee:b4:95:24:09:90",
            "net6": "5a:99:5a:da:8d:5a",
            "net7": "de:a5:5c:4d:aa:19",
            "net8": "fe:46:12:cc:82:74",
            "net9": "66:eb:01:63:6d:2f"
        },
        "tof_1_2_3": {
            "net0": "3a:0a:35:ac:9a:7d",
            "net1": "b6:2c:46:35:a3:42",
            "net10": "36:7c:58:97:d6:e5",
            "net11": "62:df:d1:4d:a7:e2",
            "net12": "12:5e:4f:9f:4f:6c",
            "net13": "82:b6:cb:a0:ab:43",
            "net14": "76:fc:e3:aa:1f:84",
            "net15": "92:3c:bc:62:68:e7",
            "net16": "26:bb:f8:0b:fa:f8",
            "net17": "66:0a:82:b2:0f:09",
            "net18": "22:20:84:37:89:53",
            "net19": "16:f4:6f:bf:96:a3",
            "net2": "9a:9a:4c:c0:74:34",
            "net3": "36:46:63:49:94:cf",
            "net4": "72:81:61:e5:7d:72",
            "net5": "a6:e0:ee:0b:ae:04",
            "net6": "96:2b:9d:27:07:83",
            "net7": "82:9c:cf:a4:cb:02",
            "net8": "22:62:ed:2b:b8:25",
            "net9": "02:8c:8a:d5:18:e7"
        },
        "tof_1_2_4": {
            "net0": "32:6e:0e:30:d8:f5",
            "net1": "c6:7f:ce:4b:8f:d3",
            "net10": "6a:f9:71:4c:42:4b",
            "net11": "c6:e6:92:67:27:84",
            "net12": "22:a0:53:ce:41:fe",
            "net13": "72:2f:5d:d3:9e:18",
            "net14": "3e:11:6a:0f:6d:87",
            "net15": "0a:a5:97:96:84:d4",
            "net16": "22:6d:c0:3d:18:b0",
            "net17": "66:63:31:2d:82:04",
            "net18": "de:62:f9:f1:25:fb",
            "net19": "da:1c:67:62:e1:2c",
            "net2": "02:c0:97:f9:7d:d8",
            "net3": "a6:1e:d8:90:8a:bf",
            "net4": "12:4a:5a:4b:f7:65",
            "net5": "32:9b:31:b3:af:40",
            "net6": "be:38:7e:48:ad:d9",
            "net7": "b6:35:27:62:29:28",
            "net8": "9a:82:6f:6d:6e:86",
            "net9": "26:1f:3c:9e:c2:b3"
        },
        "tof_1_2_5": {
            "net0": "3e:7a:76:b6:6b:bd",
            "net1": "e6:69:1e:20:61:ae",
            "net10": "a6:91:48:56:cd:5e",
            "net11": "c6:5c:0c:d2:99:a6",
            "net12": "ba:27:a7:55:76:68",
            "net13": "c2:3e:d3:df:7e:9e",
            "net14": "86:3f:e5:7c:37:e5",
            "net15": "8e:e4:da:3f:73:77",
            "net16": "8a:e9:73:ac:b2:d6",
            "net17": "46:db:3a:46:8b:0d",
            "net18": "36:14:04:45:47:35",
            "net19": "aa:a0:7d:9f:0c:d1",
            "net2": "42:aa:bf:f8:72:e7",
            "net3": "fa:f6:0b:ed:40:5c",
            "net4": "5e:c2:b3:53:6e:0b",
            "net5": "22:37:0f:96:22:ea",
            "net6": "6a:e6:49:b9:76:94",
            "net7": "96:8c:73:9e:d4:5d",
            "net8": "32:8b:97:e5:12:f8",
            "net9": "b6:a7:00:c4:07:c0"
        },
        "tof_1_2_6": {
            "net0": "f2:5d:14:de:a3:ce",
            "net1": "16:18:9a:eb:f8:03",
            "net10": "da:16:0d:51:d9:64",
            "net11": "ca:9d:21:8e:26:2e",
            "net12": "a6:ad:f3:ca:7a:af",
            "net13": "aa:2b:14:b3:2c:5a",
            "net14": "ae:21:89:bb:8c:a3",
            "net15": "aa:34:ca:7b:28:9e",
            "net16": "62:df:df:90:79:93",
            "net17": "5e:98:f3:91:86:fd",
            "net18": "72:b8:29:e3:4c:18",
            "net19": "fa:6f:e0:42:14:ab",
            "net2": "6a:e7:b7:3b:41:74",
            "net3": "1a:b2:4a:f7:5a:90",
            "net4": "de:bf:fa:92:c7:34",
            "net5": "2a:cf:22:b4:77:5d",
            "net6": "82:3e:e5:98:21:65",
            "net7": "9e:e2:21:d0:00:b7",
            "net8": "26:ae:6a:0a:f9:9a",
            "net9": "ba:f7:34:f2:70:26"
        },
        "tof_1_2_7": {
            "net0": "2e:89:5d:5d:c4:0e",
            "net1": "ea:7d:ec:bb:c7:ea",
            "net10": "5e:fa:f3:e0:14:1d",
            "net11": "ea:87:d2:3c:70:79",
            "net12": "8e:10:cb:1b:38:77",
            "net13": "06:6a:d9:3c:05:e1",
            "net14": "86:1f:e0:8f:81:bd",
            "net15": "06:52:79:16:68:62",
            "net16": "96:76:0f:6e:16:95",
            "net17": "ee:50:2b:79:b1:31",
            "net18": "d6:7b:25:0d:d2:36",
            "net19": "52:cb:d7:0e:a8:80",
            "net2": "d6:f2:03:43:29:17",
            "net3": "26:6c:7d:47:3d:1d",
            "net4": "da:93:cd:ef:c4:4e",
            "net5": "e2:1e:30:d7:0f:29",
            "net6": "32:27:47:59:ce:e7",
            "net7": "9e:37:83:f9:d1:5e",
            "net8": "96:ba:f1:04:d7:c9",
            "net9": "0a:5e:45:2c:a8:89"
        },
        "tof_1_2_8": {
            "net0": "2a:18:81:af:61:59",
            "net1": "46:b7:52:c8:91:72",
            "net10": "ce:0f:6f:0f:5d:70",
            "net11": "36:fe:34:b9:b6:22",
            "net12": "86:5e:ea:ab:a0:70",
            "net13": "62:e2:d2:8b:be:44",
            "net14": "be:e6:94:41:08:3d",
            "net15": "fa:57:04:74:99:8c",
            "net16": "4a:be:ed:2c:63:d7",
            "net17": "d2:c7:5b:4c:68:e1",
            "net18": "d6:a2:b1:34:f3:71",
            "net19": "82:17:42:1c:77:e7",
            "net2": "7e:0b:e2:4e:44:ea",
            "net3": "06:18:15:1e:79:96",
            "net4": "8a:7d:34:c8:00:0a",
            "net5": "5e:4d:45:e3:db:7d",
            "net6": "26:70:4f:e0:e4:85",
            "net7": "32:4e:cd:84:97:b2",
            "net8": "9a:c3:36:84:6b:e3",
            "net9": "f2:1d:1e:bc:5a:be"
        },
        "tof_1_2_9": {
            "net0": "f6:37:a6:ac:0c:43",
            "net1": "2a:ac:c2:12:5b:40",
            "net10": "9e:7a:52:19:21:f5",
            "net11": "fe:e1:11:e3:10:6d",
            "net12": "96:d3:21:d7:65:75",
            "net13": "a6:96:7c:c4:ba:3c",
            "net14": "22:a9:3e:19:18:bf",
            "net15": "02:a9:56:63:42:eb",
            "net16": "be:14:34:81:38:1b",
            "net17": "4e:7b:02:80:ae:3c",
            "net18": "0a:67:87:0b:a6:c7",
            "net19": "9a:20:b4:14:fd:15",
            "net2": "86:a4:50:30:df:5a",
            "net3": "56:6d:49:18:7e:4a",
            "net4": "32:e7:ca:e2:6a:31",
            "net5": "32:87:01:36:44:35",
            "net6": "06:c6:04:a9:94:82",
            "net7": "12:ef:9d:8a:a5:13",
            "net8": "ea:a1:7e:13:bd:98",
            "net9": "7a:13:f8:44:9d:59"
        }
    },
    "failed_machine": "spine_1_1_1",
    "failure_time": {
        "leaf_1_0_1": 1636195458.6731808,
        "leaf_1_0_10": 1636195458.719635,
        "leaf_1_0_2": 1636195458.732561,
        "leaf_1_0_3": 1636195458.7099454,
        "leaf_1_0_4": 1636195458.7580676,
        "leaf_1_0_5": 1636195458.7718828,
        "leaf_1_0_6": 1636195458.7829118,
        "leaf_1_0_7": 1636195458.6719964,
        "leaf_1_0_8": 1636195458.7179968,
        "leaf_1_0_9": 1636195458.7328606,
        "leaf_2_0_1": 1636195458.7439148,
        "leaf_2_0_10": 1636195458.7599099,
        "leaf_2_0_2": 1636195458.7439444,
        "leaf_2_0_3": 1636195458.7553334,
        "leaf_2_0_4": 1636195458.7673492,
        "leaf_2_0_5": 1636195458.8057268,
        "leaf_2_0_6": 1636195458.8190541,
        "leaf_2_0_7": 1636195458.8260093,
        "leaf_2_0_8": 1636195458.834842,
        "leaf_2_0_9": 1636195458.8099105,
        "spine_1_1_1": 1636195458.8166447,
        "spine_1_1_10": 1636195458.800104,
        "spine_1_1_2": 1636195458.7733798,
        "spine_1_1_3": 1636195458.8200903,
        "spine_1_1_4": 1636195458.8271484,
        "spine_1_1_5": 1636195458.8079472,
        "spine_1_1_6": 1636195458.8477287,
        "spine_1_1_7": 1636195458.823499,
        "spine_1_1_8": 1636195458.8578634,
        "spine_1_1_9": 1636195458.8687813,
        "spine_2_1_1": 1636195458.882022,
        "spine_2_1_10": 1636195458.8591075,
        "spine_2_1_2": 1636195458.8689923,
        "spine_2_1_3": 1636195458.9140947,
        "spine_2_1_4": 1636195458.9226124,
        "spine_2_1_5": 1636195458.8652546,
        "spine_2_1_6": 1636195458.8731341,
        "spine_2_1_7": 1636195458.8835862,
        "spine_2_1_8": 1636195458.898904,
        "spine_2_1_9": 1636195458.8800879,
        "tof_1_2_1": 1636195458.9230907,
        "tof_1_2_10": 1636195458.9345803,
        "tof_1_2_2": 1636195458.8972025,
        "tof_1_2_3": 1636195458.944394,
        "tof_1_2_4": 1636195458.9209938,
        "tof_1_2_5": 1636195458.9654696,
        "tof_1_2_6": 1636195458.9765384,
        "tof_1_2_7": 1636195458.9874403,
        "tof_1_2_8": 1636195458.9996138,
        "tof_1_2_9": 1636195458.9137228
    }
}