{
    "k_leaf": 6,
    "k_top": 6,
    "redundancy_factor": 3,
    "is_k8s": true,
    "machine_mac_addresses": {
        "leaf_1_0_1": {
            "net0": "9a:17:55:48:3c:7f",
            "net1": "12:cd:1e:c2:e5:80",
            "net2": "3e:fe:23:1a:3d:29",
            "net3": "fa:5d:2c:7b:cf:9b",
            "net4": "a2:85:1e:6e:63:17",
            "net5": "96:aa:0f:5a:26:68",
            "net6": "76:16:b7:35:ab:01"
        },
        "leaf_1_0_2": {
            "net0": "72:cf:ff:65:a7:e6",
            "net1": "0e:87:1e:e1:87:9a",
            "net2": "be:6d:63:ea:36:fe",
            "net3": "0e:99:50:42:af:4f",
            "net4": "82:73:43:a1:0b:20",
            "net5": "8e:12:37:3f:60:40",
            "net6": "12:d7:ff:3f:b5:0a"
        },
        "leaf_1_0_3": {
            "net0": "f6:0c:f5:ea:46:52",
            "net1": "1e:9f:38:84:2b:9f",
            "net2": "fe:c3:b4:9b:14:7e",
            "net3": "c2:6c:23:94:b3:63",
            "net4": "1a:10:ef:50:8d:af",
            "net5": "86:a6:2e:ce:50:4b",
            "net6": "2e:63:4a:29:d5:42"
        },
        "leaf_1_0_4": {
            "net0": "e6:01:df:89:0a:ad",
            "net1": "a6:47:b4:89:7a:55",
            "net2": "0e:13:5f:52:f7:01",
            "net3": "6e:0a:3a:67:b5:cb",
            "net4": "46:5a:8f:03:d6:64",
            "net5": "8e:fb:a1:e5:b5:34",
            "net6": "6e:a8:5b:57:bf:0c"
        },
        "leaf_1_0_5": {
            "net0": "a6:d7:42:8c:f1:98",
            "net1": "92:ea:37:95:ba:a3",
            "net2": "3e:89:4d:3c:cf:d5",
            "net3": "8e:4b:a3:ca:8c:46",
            "net4": "f6:4f:b9:f3:a9:ab",
            "net5": "da:eb:a9:b2:b5:22",
            "net6": "8e:b5:de:17:ea:a9"
        },
        "leaf_1_0_6": {
            "net0": "2e:7a:ce:d5:7c:bd",
            "net1": "ae:fe:98:4b:18:36",
            "net2": "8e:b3:07:00:69:1f",
            "net3": "3e:cf:43:0c:b6:b9",
            "net4": "d2:dd:c5:b7:2a:5a",
            "net5": "66:b2:86:76:e5:01",
            "net6": "12:cf:ce:66:fe:99"
        },
        "leaf_2_0_1": {
            "net0": "4a:c8:aa:2b:7b:47",
            "net1": "36:3d:53:65:04:36",
            "net2": "e2:9d:d9:ca:a4:55",
            "net3": "22:7e:49:49:cc:81",
            "net4": "ee:54:47:c0:f0:90",
            "net5": "96:d4:5b:3c:47:0c",
            "net6": "6e:91:8f:48:27:dc"
        },
        "leaf_2_0_2": {
            "net0": "c2:13:a2:e7:7c:27",
            "net1": "72:50:54:67:93:2a",
            "net2": "62:7b:c9:ef:82:ed",
            "net3": "c6:a1:d5:ac:88:5f",
            "net4": "7e:1b:40:58:64:8c",
            "net5": "7a:51:74:c4:58:ec",
            "net6": "26:2b:8b:00:ff:53"
        },
        "leaf_2_0_3": {
            "net0": "f6:d3:eb:8f:3f:51",
            "net1": "ee:55:e8:90:45:9a",
            "net2": "2a:5f:9c:65:d3:16",
            "net3": "0e:0b:68:6a:74:51",
            "net4": "16:fa:c8:6b:2e:18",
            "net5": "56:7b:1b:b1:9c:2b",
            "net6": "a6:47:f0:78:52:c6"
        },
        "leaf_2_0_4": {
            "net0": "d6:6c:3b:d1:91:9d",
            "net1": "7e:3b:ef:f8:3a:cb",
            "net2": "32:58:83:17:47:c3",
            "net3": "7e:22:b9:a7:95:3c",
            "net4": "8a:cb:34:5a:46:a4",
            "net5": "3a:26:2b:70:08:c5",
            "net6": "92:98:ce:60:fc:78"
        },
        "leaf_2_0_5": {
            "net0": "36:dc:4b:fe:1d:4a",
            "net1": "ee:03:3d:9e:59:35",
            "net2": "66:84:0f:62:e6:60",
            "net3": "8a:ee:f6:98:2e:5f",
            "net4": "92:e6:d2:59:cb:8e",
            "net5": "e6:5e:2c:89:99:74",
            "net6": "1e:39:51:85:46:01"
        },
        "leaf_2_0_6": {
            "net0": "0a:63:7a:81:2b:6a",
            "net1": "a6:ec:5d:26:d9:ea",
            "net2": "ee:e1:d2:e0:9c:4c",
            "net3": "72:75:de:3b:8e:22",
            "net4": "fa:ef:b3:e4:82:9f",
            "net5": "e6:b7:22:d8:91:46",
            "net6": "ca:75:48:68:21:d8"
        },
        "leaf_3_0_1": {
            "net0": "36:03:53:3b:e8:07",
            "net1": "aa:7a:3a:98:52:da",
            "net2": "72:3e:1a:80:1c:e4",
            "net3": "ee:0c:00:3e:87:66",
            "net4": "36:4d:4e:b4:47:ae",
            "net5": "f2:eb:f6:26:b4:15",
            "net6": "de:2c:78:79:89:69"
        },
        "leaf_3_0_2": {
            "net0": "6e:0f:b4:69:cb:04",
            "net1": "c2:71:2a:0c:da:d1",
            "net2": "d2:cc:41:df:d1:0b",
            "net3": "fe:78:e3:0f:96:7e",
            "net4": "06:65:03:c6:b9:ef",
            "net5": "86:a0:d5:41:65:6c",
            "net6": "ca:88:06:de:fa:96"
        },
        "leaf_3_0_3": {
            "net0": "76:3e:ed:f2:dd:3b",
            "net1": "6a:5d:89:f9:ff:50",
            "net2": "52:8b:c0:31:aa:95",
            "net3": "5e:7f:3b:ed:2a:76",
            "net4": "6e:48:e7:c2:67:fd",
            "net5": "7a:a3:fe:af:93:f0",
            "net6": "c2:eb:ab:c9:39:85"
        },
        "leaf_3_0_4": {
            "net0": "2e:9f:ec:af:02:20",
            "net1": "de:be:df:c3:f1:e2",
            "net2": "ee:75:8b:cf:ba:62",
            "net3": "be:3a:ba:7d:3a:ef",
            "net4": "ae:95:4a:fc:35:b4",
            "net5": "a2:34:e5:92:2b:ff",
            "net6": "e2:fc:f8:f1:83:ba"
        },
        "leaf_3_0_5": {
            "net0": "f6:58:ea:cb:2e:10",
            "net1": "96:d4:87:04:50:0d",
            "net2": "a2:c4:59:6b:9d:28",
            "net3": "06:6f:c7:c3:ae:54",
            "net4": "aa:e4:37:a7:15:77",
            "net5": "22:55:6d:da:d0:ea",
            "net6": "b6:d0:a8:17:8d:98"
        },
        "leaf_3_0_6": {
            "net0": "4e:62:1d:08:c6:21",
            "net1": "b2:77:55:3b:67:01",
            "net2": "7e:39:c8:1e:bc:f8",
            "net3": "7e:7d:5e:f3:c0:36",
            "net4": "a6:33:73:72:1b:c4",
            "net5": "e2:29:81:54:e6:ed",
            "net6": "aa:cc:0a:dc:c3:8d"
        },
        "leaf_4_0_1": {
            "net0": "16:6f:a1:f7:87:b7",
            "net1": "6a:84:b7:a5:cd:32",
            "net2": "ce:c2:36:26:70:58",
            "net3": "86:36:fd:46:90:41",
            "net4": "6e:08:0c:2b:4e:14",
            "net5": "4a:66:bc:94:18:61",
            "net6": "22:a1:fe:ed:8d:18"
        },
        "leaf_4_0_2": {
            "net0": "42:9b:41:2b:55:47",
            "net1": "f2:21:fd:2c:73:bb",
            "net2": "96:b9:33:ea:2d:0b",
            "net3": "de:af:dd:e8:b2:79",
            "net4": "1a:26:c8:20:7e:08",
            "net5": "c6:59:c2:a4:a5:d3",
            "net6": "aa:46:7a:56:81:ba"
        },
        "leaf_4_0_3": {
            "net0": "86:70:e3:9b:bf:9b",
            "net1": "62:2d:d6:50:69:ad",
            "net2": "ba:55:fd:b6:4c:cd",
            "net3": "f6:a4:5e:1e:c3:81",
            "net4": "2a:d5:f8:79:63:b0",
            "net5": "66:b6:4e:4b:21:bb",
            "net6": "ba:63:34:1a:7e:51"
        },
        "leaf_4_0_4": {
            "net0": "96:e4:d7:d9:47:48",
            "net1": "3e:99:c7:54:d4:f9",
            "net2": "da:12:cd:e4:c2:2f",
            "net3": "be:ad:ba:ee:bd:7b",
            "net4": "82:e7:9a:5e:9c:04",
            "net5": "c2:48:9f:b1:47:a1",
            "net6": "ae:0f:2d:53:43:77"
        },
        "leaf_4_0_5": {
            "net0": "ae:5c:b8:13:e5:61",
            "net1": "9e:41:2d:63:7c:c9",
            "net2": "82:37:fa:95:2f:4c",
            "net3": "76:e1:8e:25:9a:b9",
            "net4": "7a:83:4c:24:47:ea",
            "net5": "ea:65:42:d5:95:2f",
            "net6": "22:87:cf:8e:9c:10"
        },
        "leaf_4_0_6": {
            "net0": "ee:66:8f:5d:01:94",
            "net1": "1a:1d:7c:79:81:92",
            "net2": "22:af:9c:7a:3c:2f",
            "net3": "e6:02:4b:ff:2a:b4",
            "net4": "8e:b2:85:f8:e8:e2",
            "net5": "22:99:2c:b9:b2:19",
            "net6": "36:6d:74:90:79:5b"
        },
        "spine_1_1_1": {
            "net0": "86:74:25:31:24:41",
            "net1": "d2:a4:a9:b8:df:a7",
            "net10": "5a:0f:fa:a1:6d:6d",
            "net11": "9a:5d:7d:ff:40:dc",
            "net2": "ea:a4:57:d1:3c:d5",
            "net3": "7a:fe:86:7c:7e:99",
            "net4": "46:5e:27:3f:32:6f",
            "net5": "7e:f7:48:ee:2d:2c",
            "net6": "12:ec:08:21:ce:4b",
            "net7": "4e:db:cc:eb:3d:e3",
            "net8": "12:36:a7:70:fa:a4",
            "net9": "da:de:af:95:29:a8"
        },
        "spine_1_1_2": {
            "net0": "d2:5f:2f:d9:3a:7d",
            "net1": "be:59:d3:04:6e:e9",
            "net10": "1a:12:78:8a:2e:c0",
            "net11": "ca:80:c7:3a:72:52",
            "net2": "ba:7b:aa:9d:40:dc",
            "net3": "92:19:a1:88:ef:ab",
            "net4": "fa:7d:2f:0b:a5:71",
            "net5": "aa:01:41:f2:2b:aa",
            "net6": "32:93:74:0e:f7:db",
            "net7": "ae:d0:ec:6a:97:24",
            "net8": "92:66:1b:b8:43:4a",
            "net9": "8e:d8:99:90:a1:57"
        },
        "spine_1_1_3": {
            "net0": "0e:db:49:f8:2e:cc",
            "net1": "26:5e:75:3f:27:7c",
            "net10": "86:9d:a5:e6:db:a2",
            "net11": "b2:41:af:f5:82:57",
            "net2": "a2:77:a5:df:ae:b7",
            "net3": "82:3f:76:f6:30:34",
            "net4": "d2:2f:81:0a:89:be",
            "net5": "ea:17:4e:a2:d2:15",
            "net6": "72:7b:f7:b7:3a:03",
            "net7": "b2:0b:43:f5:d3:bd",
            "net8": "5a:40:87:46:f8:70",
            "net9": "0a:ee:24:77:ce:ac"
        },
        "spine_1_1_4": {
            "net0": "3a:bd:90:cd:9f:3b",
            "net1": "66:63:87:f6:6d:2e",
            "net10": "6e:67:5e:cc:53:4b",
            "net11": "3a:5e:50:5a:08:bb",
            "net2": "76:20:da:86:cb:2d",
            "net3": "9a:da:84:14:62:3e",
            "net4": "06:20:20:af:6a:8b",
            "net5": "c6:76:85:00:28:11",
            "net6": "d2:51:84:01:01:b5",
            "net7": "82:22:63:ca:63:6b",
            "net8": "72:6e:f2:96:ce:d2",
            "net9": "06:52:8f:bb:45:28"
        },
        "spine_1_1_5": {
            "net0": "c6:41:7c:46:7d:87",
            "net1": "92:d2:e5:83:28:77",
            "net10": "ea:36:4d:ca:2c:69",
            "net11": "26:03:f9:2f:30:70",
            "net2": "8e:5d:74:f0:f4:c2",
            "net3": "46:fe:95:1d:a6:22",
            "net4": "de:ac:7d:b6:fb:7d",
            "net5": "3e:d6:29:16:1b:09",
            "net6": "7e:60:17:85:6b:24",
            "net7": "72:4b:55:29:45:ec",
            "net8": "5a:6f:7b:10:f3:fb",
            "net9": "6e:c1:e9:2d:00:95"
        },
        "spine_1_1_6": {
            "net0": "c2:bf:2b:47:24:2f",
            "net1": "06:33:26:0f:6f:ed",
            "net10": "ce:44:94:e5:c5:e7",
            "net11": "ce:cc:4b:c7:42:8f",
            "net2": "ee:ec:50:26:22:c9",
            "net3": "ce:13:1c:59:88:6d",
            "net4": "ae:e0:e6:0e:ba:a4",
            "net5": "12:85:bf:52:c0:37",
            "net6": "7a:41:99:08:2c:b8",
            "net7": "f2:4a:20:68:c6:98",
            "net8": "96:8c:53:91:7d:ab",
            "net9": "ea:d5:f2:20:3b:e3"
        },
        "spine_2_1_1": {
            "net0": "c6:5b:89:14:82:02",
            "net1": "82:1a:b5:35:b0:5b",
            "net10": "4a:06:ca:21:f4:3c",
            "net11": "3e:a0:c4:e9:3e:94",
            "net2": "ee:e9:c7:98:5b:35",
            "net3": "ca:f1:ce:56:d8:88",
            "net4": "d2:8f:71:e3:bf:1d",
            "net5": "06:7e:54:0b:6f:54",
            "net6": "a2:e4:bb:8d:18:78",
            "net7": "e2:67:30:87:58:1e",
            "net8": "9e:52:e4:9d:05:f9",
            "net9": "a6:b1:b4:0a:bb:d0"
        },
        "spine_2_1_2": {
            "net0": "a6:02:be:e9:c0:3a",
            "net1": "7a:64:59:d9:8b:30",
            "net10": "12:fe:e6:2a:1f:c1",
            "net11": "ba:4a:ae:8b:74:51",
            "net2": "02:66:07:89:d8:58",
            "net3": "26:f3:62:ba:75:3b",
            "net4": "ea:e4:4a:75:d1:41",
            "net5": "46:58:b0:df:23:75",
            "net6": "76:57:c0:2b:47:e5",
            "net7": "b2:b7:88:f0:ff:fd",
            "net8": "3e:e5:a7:54:19:ce",
            "net9": "ca:f4:e7:43:7b:5d"
        },
        "spine_2_1_3": {
            "net0": "ca:4a:62:90:f7:aa",
            "net1": "42:62:96:02:e1:10",
            "net10": "1e:40:73:81:fa:7f",
            "net11": "3a:47:c0:06:ff:a3",
            "net2": "ee:e1:64:32:e8:47",
            "net3": "0a:29:7e:c7:12:28",
            "net4": "06:c4:8d:dd:ae:6b",
            "net5": "9e:9a:2f:7a:45:02",
            "net6": "12:f6:25:50:8d:ab",
            "net7": "2e:28:bd:93:43:dc",
            "net8": "6a:7d:7b:44:67:70",
            "net9": "72:ca:87:f3:d4:c5"
        },
        "spine_2_1_4": {
            "net0": "2a:f8:81:3f:aa:f6",
            "net1": "72:93:4c:d9:74:f8",
            "net10": "ba:69:d1:85:a7:4e",
            "net11": "2e:17:7c:10:59:8a",
            "net2": "be:4b:06:9e:34:68",
            "net3": "a2:86:af:11:9a:b9",
            "net4": "32:3a:48:9e:81:8d",
            "net5": "36:c8:66:60:df:dd",
            "net6": "aa:a4:ec:5e:91:02",
            "net7": "7a:0a:f9:a8:f4:dc",
            "net8": "4a:b6:66:fe:e5:bc",
            "net9": "b6:0d:a3:ee:cb:19"
        },
        "spine_2_1_5": {
            "net0": "8e:a0:fa:04:c0:30",
            "net1": "ce:d5:c5:0b:9f:bf",
            "net10": "16:18:0f:b4:46:f6",
            "net11": "52:00:1a:71:c8:3a",
            "net2": "ce:25:02:b0:c4:71",
            "net3": "8a:7c:f5:0e:93:94",
            "net4": "d2:51:2d:cd:dd:06",
            "net5": "96:05:d9:9f:6e:89",
            "net6": "9a:51:58:71:74:3d",
            "net7": "da:d7:61:7f:e9:75",
            "net8": "ee:4c:1d:23:11:22",
            "net9": "62:ed:3b:d7:2c:0d"
        },
        "spine_2_1_6": {
            "net0": "a2:9f:8b:27:97:10",
            "net1": "6e:80:73:3c:3d:ef",
            "net10": "ee:8a:fa:22:a1:ca",
            "net11": "76:48:63:e2:ff:70",
            "net2": "ee:63:21:95:2c:15",
            "net3": "ca:75:a6:1b:86:6a",
            "net4": "72:66:df:0b:be:80",
            "net5": "5e:04:9a:01:95:69",
            "net6": "72:cd:34:bb:b1:00",
            "net7": "22:ac:05:79:a7:af",
            "net8": "92:92:0a:ae:2f:a9",
            "net9": "c6:a9:c9:fc:58:7d"
        },
        "spine_3_1_1": {
            "net0": "de:75:3a:a3:a2:59",
            "net1": "b6:62:bd:41:87:82",
            "net10": "72:97:7e:7b:aa:ba",
            "net11": "46:d2:a1:44:80:8c",
            "net2": "0a:ff:ef:e6:4c:f3",
            "net3": "b2:45:83:84:e0:67",
            "net4": "8a:4e:6c:b1:56:aa",
            "net5": "2a:99:60:09:5e:ff",
            "net6": "42:59:70:a8:f4:d3",
            "net7": "4a:c9:1b:97:8d:2c",
            "net8": "86:85:1b:c4:39:78",
            "net9": "da:c1:fc:f9:ee:4d"
        },
        "spine_3_1_2": {
            "net0": "ba:60:ed:2b:20:bb",
            "net1": "7e:4d:e5:e5:75:8c",
            "net10": "86:4f:32:f5:e5:93",
            "net11": "de:56:7d:2f:56:dc",
            "net2": "26:1e:43:89:cd:71",
            "net3": "52:6b:29:a9:3a:d4",
            "net4": "92:ae:55:05:f6:18",
            "net5": "e6:29:c2:a4:65:f0",
            "net6": "b2:38:8e:cd:63:eb",
            "net7": "8e:99:08:c3:56:af",
            "net8": "36:34:ba:5f:bb:ac",
            "net9": "4e:92:a3:50:af:9a"
        },
        "spine_3_1_3": {
            "net0": "86:ad:92:33:79:63",
            "net1": "ba:8f:f5:cc:0d:af",
            "net10": "a6:18:a8:dc:9a:7b",
            "net11": "ee:0c:be:92:68:9f",
            "net2": "9e:1f:74:1f:5d:8d",
            "net3": "ae:7f:92:4d:88:5b",
            "net4": "12:1f:cb:1a:5e:86",
            "net5": "f6:e3:9b:02:8d:a4",
            "net6": "06:9f:2f:17:45:7a",
            "net7": "0a:99:d9:06:94:66",
            "net8": "06:7f:a9:ad:c1:f5",
            "net9": "16:33:0e:5a:22:b5"
        },
        "spine_3_1_4": {
            "net0": "96:de:9b:6a:97:aa",
            "net1": "7e:c1:6a:60:83:d8",
            "net10": "1e:a5:76:69:14:d1",
            "net11": "2a:cb:43:cf:79:a7",
            "net2": "2e:1d:b8:db:c4:78",
            "net3": "e2:dd:53:61:16:9d",
            "net4": "da:bc:a5:52:75:dd",
            "net5": "7a:87:64:a2:30:c5",
            "net6": "be:f6:7f:57:20:93",
            "net7": "06:94:b2:96:cf:34",
            "net8": "fe:1d:ab:3f:fd:00",
            "net9": "d2:f3:1b:c1:d6:4d"
        },
        "spine_3_1_5": {
            "net0": "6a:62:63:4d:4f:4f",
            "net1": "5a:3d:9e:e1:1c:f8",
            "net10": "46:ea:fb:76:45:11",
            "net11": "b2:9b:33:48:d1:e6",
            "net2": "f2:9d:0c:30:04:34",
            "net3": "36:ec:47:a1:16:ba",
            "net4": "5e:72:6e:30:5f:f3",
            "net5": "c2:c5:4f:b4:1d:e9",
            "net6": "c2:fb:5b:e6:b4:42",
            "net7": "5e:29:cd:72:9b:39",
            "net8": "9a:43:52:cb:7e:1a",
            "net9": "9e:28:de:80:23:db"
        },
        "spine_3_1_6": {
            "net0": "22:0c:72:d3:43:38",
            "net1": "02:f0:51:62:e1:95",
            "net10": "4e:f3:1a:ca:31:56",
            "net11": "ae:99:47:9a:fa:34",
            "net2": "7a:fd:94:c9:77:8c",
            "net3": "e2:b9:8f:11:6e:39",
            "net4": "1e:ca:ed:0e:9f:cf",
            "net5": "ee:a9:3a:57:30:96",
            "net6": "ba:1d:60:cc:7a:26",
            "net7": "ca:45:1b:4a:b5:47",
            "net8": "46:fa:5f:91:f3:52",
            "net9": "96:68:30:3c:ea:3e"
        },
        "spine_4_1_1": {
            "net0": "fa:b6:b1:90:73:08",
            "net1": "5a:4c:07:55:a9:3f",
            "net10": "62:66:ae:5b:2f:34",
            "net11": "72:a7:72:01:a8:04",
            "net2": "c2:7a:89:d5:b9:6d",
            "net3": "b6:93:94:a6:59:7c",
            "net4": "12:51:2a:df:1d:9d",
            "net5": "ba:1a:5e:fd:a0:5e",
            "net6": "8a:12:64:f6:c9:e6",
            "net7": "8a:1b:6e:a8:68:f4",
            "net8": "b6:31:a4:aa:b4:7c",
            "net9": "92:24:4f:31:c8:95"
        },
        "spine_4_1_2": {
            "net0": "f2:ef:e7:18:61:2d",
            "net1": "a2:d4:29:7b:13:fd",
            "net10": "f6:af:cd:4e:36:42",
            "net11": "12:12:d6:e2:c8:c2",
            "net2": "2e:1a:f0:8d:62:8b",
            "net3": "4a:d8:84:29:c0:cd",
            "net4": "8a:84:8f:9b:92:9a",
            "net5": "c2:5c:f1:d8:ff:a1",
            "net6": "e6:32:e7:2d:42:39",
            "net7": "ba:d6:59:ab:64:81",
            "net8": "42:db:75:07:93:81",
            "net9": "b2:bc:e6:da:33:f6"
        },
        "spine_4_1_3": {
            "net0": "7e:2c:cf:98:0d:98",
            "net1": "f2:94:0c:92:db:64",
            "net10": "aa:7a:3e:75:ac:ee",
            "net11": "12:57:db:f7:aa:d6",
            "net2": "66:b1:04:77:b9:ca",
            "net3": "42:95:2f:3b:bf:8b",
            "net4": "f2:a0:23:1f:31:4b",
            "net5": "52:b2:54:13:3e:5e",
            "net6": "66:b2:b3:96:90:bf",
            "net7": "52:e5:86:ad:30:d8",
            "net8": "6a:96:8f:db:1c:3c",
            "net9": "b6:68:68:8a:db:8c"
        },
        "spine_4_1_4": {
            "net0": "42:b9:fd:d3:d2:fd",
            "net1": "0a:52:91:b4:71:69",
            "net10": "3e:7d:be:1b:77:ad",
            "net11": "d6:c6:40:df:07:49",
            "net2": "82:6f:94:6f:4a:a4",
            "net3": "a2:1a:d3:39:70:7c",
            "net4": "ce:76:70:c5:09:03",
            "net5": "6a:2a:fb:04:32:d0",
            "net6": "12:bb:a6:bd:b5:7c",
            "net7": "a2:b2:10:5e:68:f2",
            "net8": "72:62:f5:70:c4:d4",
            "net9": "5e:14:2d:57:33:d4"
        },
        "spine_4_1_5": {
            "net0": "da:18:11:87:e5:c9",
            "net1": "7a:56:58:9e:e0:66",
            "net10": "6a:7e:f2:bd:13:aa",
            "net11": "7e:ca:09:3c:9e:29",
            "net2": "5e:9c:98:66:21:fd",
            "net3": "aa:65:23:d6:fd:c2",
            "net4": "82:66:0c:88:11:97",
            "net5": "26:f4:73:98:50:bf",
            "net6": "46:26:ea:c2:53:6d",
            "net7": "82:b2:84:1a:c8:1b",
            "net8": "5e:17:95:d4:90:63",
            "net9": "52:da:fa:61:db:80"
        },
        "spine_4_1_6": {
            "net0": "0e:3b:fa:cf:f0:30",
            "net1": "32:24:ea:3b:e5:42",
            "net10": "0e:7e:0f:b0:26:28",
            "net11": "42:24:01:0e:06:f5",
            "net2": "8a:ab:dd:02:2d:4d",
            "net3": "ca:ac:ea:b1:18:4f",
            "net4": "8a:12:79:e7:b8:63",
            "net5": "c6:a0:bb:e0:fe:f8",
            "net6": "ce:90:aa:c6:ed:a6",
            "net7": "e6:65:32:fd:c2:17",
            "net8": "4e:14:a6:43:0c:58",
            "net9": "46:3a:a5:fb:e8:ff"
        },
        "tof_1_2_1": {
            "net0": "62:16:17:97:ce:20",
            "net1": "7e:eb:ea:94:c7:61",
            "net10": "a2:d2:c3:e3:79:be",
            "net11": "de:f5:f6:e1:d1:40",
            "net2": "b6:b7:7b:c5:74:41",
            "net3": "6e:13:e7:73:93:91",
            "net4": "ce:6d:ff:d8:1b:83",
            "net5": "b6:ed:1e:7b:dc:57",
            "net6": "0a:30:17:35:d1:fa",
            "net7": "fe:00:fb:c7:1b:5c",
            "net8": "12:c1:21:2a:a3:5f",
            "net9": "ae:2d:e7:46:4f:d4"
        },
        "tof_1_2_2": {
            "net0": "e6:4a:43:b9:d6:0a",
            "net1": "12:5d:a5:cf:06:c3",
            "net10": "fe:70:9b:8c:6a:56",
            "net11": "aa:14:36:08:a4:9e",
            "net2": "72:0e:68:34:60:0e",
            "net3": "7e:e3:7d:df:82:50",
            "net4": "fe:df:db:6c:f3:46",
            "net5": "4e:53:6a:31:c0:dc",
            "net6": "5e:46:26:03:ae:38",
            "net7": "ba:5c:93:00:bc:d6",
            "net8": "4a:48:00:79:ba:4d",
            "net9": "46:43:a7:cb:05:4d"
        },
        "tof_1_2_3": {
            "net0": "2e:98:4d:48:f4:6e",
            "net1": "46:3b:35:d4:fb:66",
            "net10": "da:d6:52:6d:4d:7f",
            "net11": "92:30:5a:6c:8e:70",
            "net2": "f2:cb:f0:52:cf:91",
            "net3": "96:f8:9b:bb:a0:4f",
            "net4": "72:f8:6a:78:89:9f",
            "net5": "2a:c7:c9:9f:f7:f3",
            "net6": "e6:12:f7:52:d5:af",
            "net7": "7e:35:f7:7e:0c:68",
            "net8": "e6:ba:f5:eb:0c:c6",
            "net9": "a2:a9:07:78:62:d4"
        },
        "tof_1_2_4": {
            "net0": "ca:80:65:81:2e:b4",
            "net1": "2a:ef:c0:b0:a6:6c",
            "net10": "da:1b:52:30:1c:f1",
            "net11": "2a:aa:d1:86:4d:3e",
            "net2": "c2:96:7b:1e:f2:69",
            "net3": "9e:15:cc:19:b4:c8",
            "net4": "aa:fd:11:b4:43:cd",
            "net5": "2e:4e:49:20:ab:43",
            "net6": "b2:c7:73:7b:7a:3f",
            "net7": "aa:fa:f3:6d:c3:0f",
            "net8": "3a:c0:7a:32:73:4f",
            "net9": "6e:4d:f7:f7:a7:1a"
        },
        "tof_1_2_5": {
            "net0": "f6:0d:d1:da:df:94",
            "net1": "fe:3f:c0:58:0e:d6",
            "net10": "92:ed:b2:32:12:a4",
            "net11": "2a:65:24:ac:a0:02",
            "net2": "0a:b9:fa:e9:99:0c",
            "net3": "86:58:fb:22:5d:c0",
            "net4": "0a:66:1b:23:f4:ef",
            "net5": "32:83:51:8d:b1:1a",
            "net6": "9e:bc:c4:34:f7:d9",
            "net7": "ea:62:71:9f:2d:a7",
            "net8": "d2:ac:f5:a3:37:58",
            "net9": "7e:d0:14:76:d0:6f"
        },
        "tof_1_2_6": {
            "net0": "6e:35:cd:08:bb:dd",
            "net1": "6a:48:a0:0c:97:99",
            "net10": "0a:d4:61:c2:f2:98",
            "net11": "b6:97:d6:90:cb:03",
            "net2": "d2:a8:93:a8:d8:9d",
            "net3": "ca:94:e5:66:76:57",
            "net4": "da:43:0f:05:e8:35",
            "net5": "4a:99:b5:b8:23:11",
            "net6": "9a:14:18:27:2d:cf",
            "net7": "9a:29:a3:17:33:fc",
            "net8": "1e:49:93:de:bc:4a",
            "net9": "7a:9f:21:c0:bd:ac"
        },
        "tof_2_2_1": {
            "net0": "3e:e9:af:bd:67:76",
            "net1": "9a:09:3c:91:34:00",
            "net10": "b6:79:bc:50:98:d0",
            "net11": "ca:1b:d0:ad:3b:49",
            "net2": "f6:f9:9f:b3:09:4d",
            "net3": "e2:da:5b:0f:44:f3",
            "net4": "96:da:b4:b9:1d:12",
            "net5": "9e:20:c5:46:f0:41",
            "net6": "26:99:e4:08:37:9a",
            "net7": "0e:e8:af:5a:2a:f4",
            "net8": "c6:f4:8c:e2:dc:8b",
            "net9": "e2:f9:f0:35:1a:71"
        },
        "tof_2_2_2": {
            "net0": "e2:f7:f8:c2:df:7c",
            "net1": "5a:08:dc:98:c9:74",
            "net10": "6e:3a:33:70:64:2a",
            "net11": "12:de:5e:93:23:da",
            "net2": "2a:94:50:83:1b:90",
            "net3": "7a:d8:85:1e:98:bc",
            "net4": "ea:05:26:4a:ab:65",
            "net5": "32:e9:b6:aa:8b:70",
            "net6": "9a:45:5d:f3:20:f5",
            "net7": "06:be:8d:94:fc:c0",
            "net8": "1a:59:26:4b:2d:33",
            "net9": "ca:4c:4c:bd:d9:a8"
        },
        "tof_2_2_3": {
            "net0": "ca:bc:2b:a1:08:5e",
            "net1": "72:eb:b1:f6:6d:40",
            "net10": "be:e2:9f:fe:72:c9",
            "net11": "d2:06:df:1a:7b:7b",
            "net2": "4e:79:4f:a1:20:28",
            "net3": "0e:0a:02:76:11:1e",
            "net4": "62:6d:c3:ef:c7:1f",
            "net5": "1a:61:20:0f:ea:2a",
            "net6": "46:2a:14:3f:a5:7b",
            "net7": "2e:99:9c:aa:06:37",
            "net8": "ae:96:93:c4:3c:2b",
            "net9": "0e:3b:0b:8d:9f:fe"
        },
        "tof_2_2_4": {
            "net0": "52:95:d1:22:96:d6",
            "net1": "42:f5:15:28:d7:d8",
            "net10": "ea:e6:4e:c5:a0:ae",
            "net11": "1a:0b:77:fa:57:6e",
            "net2": "de:8c:3d:b3:ae:c7",
            "net3": "1a:23:0c:17:ac:50",
            "net4": "3e:b4:8c:9b:31:57",
            "net5": "b6:68:94:97:e4:5c",
            "net6": "5a:2c:71:43:4d:96",
            "net7": "22:3f:1d:fd:79:0f",
            "net8": "5a:35:e6:be:8d:2a",
            "net9": "ce:4e:b3:ee:fb:ae"
        },
        "tof_2_2_5": {
            "net0": "46:44:ee:df:68:4a",
            "net1": "f2:4e:c5:6c:87:46",
            "net10": "1a:0e:82:7d:22:d5",
            "net11": "e6:64:ef:27:1e:fe",
            "net2": "6e:cc:6a:ce:7d:67",
            "net3": "8a:a0:e1:0a:b7:e3",
            "net4": "86:dd:8c:48:7d:2a",
            "net5": "36:7b:3e:7c:92:8b",
            "net6": "f6:18:29:dc:c2:d3",
            "net7": "c6:05:c5:50:c9:a3",
            "net8": "66:e0:66:82:f9:db",
            "net9": "26:84:70:eb:7f:74"
        },
        "tof_2_2_6": {
            "net0": "4a:c7:6a:45:d4:5f",
            "net1": "e6:f8:08:f1:c1:2b",
            "net10": "6a:c9:d1:4d:e8:03",
            "net11": "76:8c:37:e7:0a:ae",
            "net2": "46:97:ef:70:b8:80",
            "net3": "26:ec:6d:95:8d:dc",
            "net4": "6e:7a:ab:2f:64:25",
            "net5": "aa:bb:bc:7a:ab:0f",
            "net6": "56:c0:74:ea:0c:46",
            "net7": "8a:65:31:16:8b:4d",
            "net8": "d2:ba:bd:70:df:f2",
            "net9": "ea:35:bd:d8:d3:5d"
        }
    },
    "failed_machine": "spine_1_1_1",
    "failure_time": {
        "leaf_1_0_1": 1636068438.3648832,
        "leaf_1_0_2": 1636068437.8671873,
        "leaf_1_0_3": 1636068437.8773582,
        "leaf_1_0_4": 1636068437.8905165,
        "leaf_1_0_5": 1636068437.8995686,
        "leaf_1_0_6": 1636068437.9105484,
        "leaf_2_0_1": 1636068437.9184937,
        "leaf_2_0_2": 1636068438.4356632,
        "leaf_2_0_3": 1636068437.8550644,
        "leaf_2_0_4": 1636068437.8633575,
        "leaf_2_0_5": 1636068437.8751168,
        "leaf_2_0_6": 1636068437.8825152,
        "leaf_3_0_1": 1636068437.89152,
        "leaf_3_0_2": 1636068437.9044967,
        "leaf_3_0_3": 1636068437.9212382,
        "leaf_3_0_4": 1636068437.9359288,
        "leaf_3_0_5": 1636068437.9366567,
        "leaf_3_0_6": 1636068437.9531612,
        "leaf_4_0_1": 1636068437.9644732,
        "leaf_4_0_2": 1636068437.9752507,
        "leaf_4_0_3": 1636068437.9876044,
        "leaf_4_0_4": 1636068437.995384,
        "leaf_4_0_5": 1636068438.0036037,
        "leaf_4_0_6": 1636068438.010676,
        "spine_1_1_1": 1636068437.9500039,
        "spine_1_1_2": 1636068437.9617345,
        "spine_1_1_3": 1636068438.4783313,
        "spine_1_1_4": 1636068437.981705,
        "spine_1_1_5": 1636068437.9914773,
        "spine_1_1_6": 1636068438.0007272,
        "spine_2_1_1": 1636068438.008778,
        "spine_2_1_2": 1636068438.029161,
        "spine_2_1_3": 1636068438.021,
        "spine_2_1_4": 1636068438.0325193,
        "spine_2_1_5": 1636068438.5553317,
        "spine_2_1_6": 1636068438.5666726,
        "spine_3_1_1": 1636068438.0722408,
        "spine_3_1_2": 1636068438.5910351,
        "spine_3_1_3": 1636068438.0930445,
        "spine_3_1_4": 1636068438.1024055,
        "spine_3_1_5": 1636068438.0448594,
        "spine_3_1_6": 1636068438.0649557,
        "spine_4_1_1": 1636068438.074883,
        "spine_4_1_2": 1636068438.0854704,
        "spine_4_1_3": 1636068438.0954773,
        "spine_4_1_4": 1636068438.1081767,
        "spine_4_1_5": 1636068438.1173117,
        "spine_4_1_6": 1636068438.1285098,
        "tof_1_2_1": 1636068438.1125135,
        "tof_1_2_2": 1636068438.6280794,
        "tof_1_2_3": 1636068438.135561,
        "tof_1_2_4": 1636068438.1402342,
        "tof_1_2_5": 1636068438.1493049,
        "tof_1_2_6": 1636068438.6679397,
        "tof_2_2_1": 1636068438.7015176,
        "tof_2_2_2": 1636068438.2070599,
        "tof_2_2_3": 1636068438.1359656,
        "tof_2_2_4": 1636068438.1456583,
        "tof_2_2_5": 1636068438.1578856,
        "tof_2_2_6": 1636068438.1663835
    }
}