{
    "description": "Scenario 5a: net0 link failure of leaf_1_0_1 with BGP",
    "k_leaf": 6,
    "k_top": 6,
    "redundancy_factor": 2,
    "is_k8s": true,
    "machine_mac_addresses": {
        "leaf_1_0_1": {
            "net0": "56:bc:ef:3d:65:e7",
            "net1": "6a:3e:fb:a4:18:37",
            "net2": "6e:af:b5:d9:28:3f",
            "net3": "42:ce:88:cc:61:cb",
            "net4": "6e:ad:db:a4:7e:d7",
            "net5": "4a:da:a0:4d:ab:9b",
            "net6": "16:af:80:1a:91:ca"
        },
        "leaf_1_0_2": {
            "net0": "06:0d:fc:39:40:c6",
            "net1": "76:f3:3d:6d:53:5b",
            "net2": "16:4e:73:30:e8:09",
            "net3": "82:49:0c:96:29:ed",
            "net4": "1a:a9:32:8e:c0:9a",
            "net5": "ca:31:47:e9:46:e5",
            "net6": "52:70:2c:a9:49:05"
        },
        "leaf_1_0_3": {
            "net0": "8e:48:44:01:8c:90",
            "net1": "22:01:ad:58:b8:15",
            "net2": "7e:7c:ff:1e:8c:4a",
            "net3": "ba:29:0b:f6:58:51",
            "net4": "ba:02:aa:d9:f2:b5",
            "net5": "aa:45:da:d0:5d:ab",
            "net6": "c6:d7:5b:64:0a:df"
        },
        "leaf_1_0_4": {
            "net0": "ae:ad:e9:13:81:01",
            "net1": "d2:e5:e9:ea:cd:68",
            "net2": "36:75:9b:f5:f2:74",
            "net3": "be:b3:9a:aa:2b:ec",
            "net4": "a2:c9:28:f8:b6:26",
            "net5": "d6:51:dd:c5:c2:61",
            "net6": "3e:dc:7b:bd:74:c6"
        },
        "leaf_1_0_5": {
            "net0": "aa:07:41:81:1f:e1",
            "net1": "0e:1e:90:b6:82:05",
            "net2": "62:2d:fd:ba:73:9d",
            "net3": "ce:da:e1:9e:0d:31",
            "net4": "7e:99:03:19:1e:bc",
            "net5": "1a:b3:3e:16:75:dc",
            "net6": "72:83:83:70:11:6d"
        },
        "leaf_1_0_6": {
            "net0": "c2:b3:8b:68:bd:43",
            "net1": "0a:c6:bb:f1:5b:ee",
            "net2": "0a:4f:fd:3e:9a:bb",
            "net3": "1e:27:55:43:3c:96",
            "net4": "e2:06:32:8a:17:a0",
            "net5": "a6:0a:38:dd:5e:84",
            "net6": "4e:29:31:f4:95:4d"
        },
        "leaf_2_0_1": {
            "net0": "96:b6:d5:d1:79:bc",
            "net1": "aa:21:e1:f7:28:3d",
            "net2": "fa:9c:6d:74:56:80",
            "net3": "16:d3:aa:8a:b5:5e",
            "net4": "32:e2:6c:50:c1:64",
            "net5": "16:19:58:24:10:38",
            "net6": "86:07:0e:89:49:15"
        },
        "leaf_2_0_2": {
            "net0": "0e:8b:b7:0e:44:f1",
            "net1": "46:4e:7b:c6:62:85",
            "net2": "22:ce:e4:15:52:a2",
            "net3": "fa:3d:9a:54:51:15",
            "net4": "ae:ce:c2:15:a4:16",
            "net5": "26:85:c0:9d:c3:52",
            "net6": "d6:4e:8c:c9:ea:76"
        },
        "leaf_2_0_3": {
            "net0": "42:69:41:38:66:95",
            "net1": "a6:11:ec:8f:64:d5",
            "net2": "4e:ef:95:79:63:be",
            "net3": "62:5d:ef:53:ba:65",
            "net4": "9a:81:d9:da:a0:fb",
            "net5": "c2:a8:cf:86:26:e9",
            "net6": "32:b6:78:d6:46:5d"
        },
        "leaf_2_0_4": {
            "net0": "22:34:58:9b:67:69",
            "net1": "72:7f:cd:a6:44:83",
            "net2": "8e:99:ce:f0:d1:fe",
            "net3": "76:26:94:99:2c:7a",
            "net4": "fa:62:e2:d2:d1:16",
            "net5": "86:79:8c:4e:e7:1f",
            "net6": "2e:91:b8:f8:42:1c"
        },
        "leaf_2_0_5": {
            "net0": "6e:93:29:55:f9:6f",
            "net1": "7a:6a:70:df:4d:45",
            "net2": "96:42:1d:a9:49:66",
            "net3": "86:7e:fb:00:d6:73",
            "net4": "5e:82:08:84:30:ae",
            "net5": "ea:eb:fb:12:9d:94",
            "net6": "62:04:22:e2:ed:c1"
        },
        "leaf_2_0_6": {
            "net0": "42:64:43:dc:38:94",
            "net1": "1a:f0:71:1f:d9:12",
            "net2": "02:20:75:f7:68:29",
            "net3": "7a:9f:a9:d3:e6:4c",
            "net4": "16:f4:30:6f:f2:b5",
            "net5": "72:23:ed:6c:7f:a3",
            "net6": "a6:f2:ad:58:a0:a4"
        },
        "leaf_3_0_1": {
            "net0": "de:55:f2:4c:cc:e2",
            "net1": "da:38:c3:45:0a:b0",
            "net2": "5a:19:20:0e:8b:45",
            "net3": "be:51:c1:ee:2c:9d",
            "net4": "6e:8c:58:29:7a:72",
            "net5": "fe:76:4a:99:67:81",
            "net6": "16:1e:fe:09:bb:9c"
        },
        "leaf_3_0_2": {
            "net0": "56:6e:43:65:8a:7f",
            "net1": "36:6d:9f:3d:2c:1b",
            "net2": "6a:a6:be:50:5a:ad",
            "net3": "e2:ae:71:8a:24:49",
            "net4": "b2:69:ca:32:89:22",
            "net5": "5e:06:ac:49:c0:3d",
            "net6": "7e:bc:78:48:e6:e0"
        },
        "leaf_3_0_3": {
            "net0": "2e:35:06:32:ad:83",
            "net1": "36:ee:1f:1f:2a:8e",
            "net2": "5e:ef:43:8c:49:42",
            "net3": "be:8b:9f:3a:f4:e6",
            "net4": "26:a2:1a:63:74:16",
            "net5": "5e:c8:e9:56:7c:9d",
            "net6": "2e:41:e6:29:be:93"
        },
        "leaf_3_0_4": {
            "net0": "ea:83:ee:c8:74:af",
            "net1": "3e:dc:b5:4f:f5:cc",
            "net2": "e6:5c:1c:5a:b5:4b",
            "net3": "a6:0d:ac:a4:f1:94",
            "net4": "fa:92:3b:e0:e2:5f",
            "net5": "62:2d:f9:6e:80:ba",
            "net6": "02:b4:ff:97:1a:8b"
        },
        "leaf_3_0_5": {
            "net0": "a6:78:61:5d:11:ed",
            "net1": "ca:1b:ee:ab:72:7d",
            "net2": "ca:2f:da:a7:a8:25",
            "net3": "3a:b2:d8:01:18:36",
            "net4": "c2:28:90:40:5a:7c",
            "net5": "a6:1f:de:36:bb:c1",
            "net6": "52:36:53:5a:c9:3f"
        },
        "leaf_3_0_6": {
            "net0": "fe:c3:fd:26:bb:9a",
            "net1": "92:6e:56:e3:15:56",
            "net2": "d6:cd:c7:b9:e1:29",
            "net3": "aa:4c:9f:76:df:0c",
            "net4": "8a:c9:80:26:70:6a",
            "net5": "7a:f7:bc:df:f9:94",
            "net6": "ce:f5:0c:40:dd:3f"
        },
        "leaf_4_0_1": {
            "net0": "b6:98:98:7f:1a:68",
            "net1": "52:3e:da:14:21:44",
            "net2": "a2:13:5f:47:61:12",
            "net3": "a2:c2:fd:95:df:fb",
            "net4": "36:bc:51:54:ad:48",
            "net5": "a6:39:cd:b1:4b:86",
            "net6": "6a:38:bb:85:fb:e2"
        },
        "leaf_4_0_2": {
            "net0": "de:fe:60:19:2f:80",
            "net1": "5a:0c:75:27:57:5a",
            "net2": "5a:45:5e:9c:a3:cd",
            "net3": "6a:11:75:df:bd:f5",
            "net4": "82:98:13:4d:5e:09",
            "net5": "9a:cb:1a:9d:56:b2",
            "net6": "c6:79:75:f7:76:c5"
        },
        "leaf_4_0_3": {
            "net0": "a2:54:43:a9:32:9d",
            "net1": "42:9f:a2:ce:99:43",
            "net2": "f2:9a:e9:a9:82:26",
            "net3": "de:20:1d:d9:95:1f",
            "net4": "de:fb:d5:0b:14:03",
            "net5": "32:1e:8b:90:7d:c2",
            "net6": "e6:7b:01:a2:b7:02"
        },
        "leaf_4_0_4": {
            "net0": "a6:eb:c9:d6:41:8d",
            "net1": "4e:fd:91:bf:23:9c",
            "net2": "4a:82:2e:57:ae:8c",
            "net3": "42:3e:61:b2:7c:e9",
            "net4": "8e:39:25:8b:13:8d",
            "net5": "4a:92:be:7f:e5:ad",
            "net6": "06:3d:91:be:97:5f"
        },
        "leaf_4_0_5": {
            "net0": "aa:ab:4a:f3:70:1d",
            "net1": "b2:5b:1e:58:cd:e8",
            "net2": "2a:b9:3a:df:f9:ed",
            "net3": "16:80:be:6a:e0:de",
            "net4": "f2:ca:c4:84:1d:90",
            "net5": "a6:58:4e:57:bf:46",
            "net6": "fa:f9:2a:bd:57:1c"
        },
        "leaf_4_0_6": {
            "net0": "46:f6:6f:75:34:b1",
            "net1": "fa:08:d0:f4:27:24",
            "net2": "ba:bf:73:2a:17:b3",
            "net3": "f2:f7:42:09:06:d1",
            "net4": "fa:ad:c2:5b:28:43",
            "net5": "8a:44:34:fe:85:dc",
            "net6": "fa:aa:47:61:a3:b9"
        },
        "leaf_5_0_1": {
            "net0": "c2:36:4a:0e:79:49",
            "net1": "3a:08:92:62:86:34",
            "net2": "26:a6:c2:6e:c6:a5",
            "net3": "f2:15:eb:46:20:37",
            "net4": "fa:23:f6:1f:47:18",
            "net5": "be:5d:b6:4c:db:f3",
            "net6": "1e:f0:4d:5a:6d:d6"
        },
        "leaf_5_0_2": {
            "net0": "32:c6:8c:a9:6a:4d",
            "net1": "66:1d:34:68:55:17",
            "net2": "6a:e4:fe:cc:45:a4",
            "net3": "f6:58:92:96:83:1c",
            "net4": "aa:88:81:1d:00:9e",
            "net5": "f2:3f:ea:33:f8:6a",
            "net6": "22:7a:13:94:65:a3"
        },
        "leaf_5_0_3": {
            "net0": "da:3e:a8:87:64:62",
            "net1": "5e:5b:ef:1c:d6:56",
            "net2": "7a:a6:eb:f4:63:e3",
            "net3": "ee:4f:bc:ae:4b:bf",
            "net4": "66:0c:4a:8c:e2:50",
            "net5": "ca:e3:8b:12:6d:78",
            "net6": "ae:75:7d:5e:33:9a"
        },
        "leaf_5_0_4": {
            "net0": "32:14:91:46:3e:b8",
            "net1": "ee:05:90:58:7f:99",
            "net2": "26:df:bb:47:ea:8b",
            "net3": "6e:6c:56:bf:a2:6e",
            "net4": "1e:4f:fa:06:f3:12",
            "net5": "9a:2b:81:2e:69:45",
            "net6": "26:35:43:7f:33:59"
        },
        "leaf_5_0_5": {
            "net0": "96:2a:3f:78:ef:5c",
            "net1": "3e:16:f8:6d:7d:24",
            "net2": "26:9b:83:1b:99:67",
            "net3": "56:8f:3d:d7:c5:a6",
            "net4": "ee:65:d6:2b:c7:9e",
            "net5": "62:40:43:e8:d1:2c",
            "net6": "62:00:b0:6b:e3:14"
        },
        "leaf_5_0_6": {
            "net0": "5a:57:a1:e4:cb:9d",
            "net1": "2a:7e:99:1e:42:39",
            "net2": "06:e9:e5:ac:5a:55",
            "net3": "9a:5c:5f:1e:c0:5a",
            "net4": "d6:f1:f6:81:6e:e5",
            "net5": "7a:4f:bf:cf:d1:70",
            "net6": "86:8b:e6:44:d9:49"
        },
        "leaf_6_0_1": {
            "net0": "46:35:bf:ff:0b:9d",
            "net1": "2e:7b:10:3b:b5:03",
            "net2": "56:6f:0c:6a:c2:19",
            "net3": "ce:7e:fd:40:9a:78",
            "net4": "7e:d2:12:e2:3d:bc",
            "net5": "0a:19:37:cb:53:9b",
            "net6": "92:24:e3:18:d7:29"
        },
        "leaf_6_0_2": {
            "net0": "52:6e:16:c3:00:46",
            "net1": "7a:e6:35:be:b0:e8",
            "net2": "a2:cb:48:98:be:cd",
            "net3": "ee:29:11:b1:df:eb",
            "net4": "06:28:39:a1:e8:1e",
            "net5": "9e:e9:62:7d:fe:55",
            "net6": "fe:15:19:2b:51:7e"
        },
        "leaf_6_0_3": {
            "net0": "0a:ea:7c:fc:f3:ef",
            "net1": "c2:3e:3b:5f:76:86",
            "net2": "1a:85:6b:68:97:f5",
            "net3": "6e:98:ef:48:ec:f3",
            "net4": "f2:e7:0a:c3:e6:90",
            "net5": "de:2c:15:01:50:aa",
            "net6": "42:2e:05:d6:4c:5e"
        },
        "leaf_6_0_4": {
            "net0": "56:e2:4b:36:31:3e",
            "net1": "fe:c0:10:f5:f0:ba",
            "net2": "d6:d0:96:6d:76:2d",
            "net3": "2e:4e:4a:1a:62:07",
            "net4": "5a:42:eb:2e:6d:f7",
            "net5": "b6:08:5b:25:4d:c4",
            "net6": "2e:92:64:ad:8c:ec"
        },
        "leaf_6_0_5": {
            "net0": "b6:ca:d1:b9:73:a1",
            "net1": "1a:94:af:f1:0e:e8",
            "net2": "62:2b:75:e5:17:6f",
            "net3": "6a:a5:3f:b2:e8:b1",
            "net4": "8e:9f:66:4b:2a:9d",
            "net5": "06:1e:80:ae:81:07",
            "net6": "c6:21:20:b8:ec:af"
        },
        "leaf_6_0_6": {
            "net0": "b2:28:64:48:26:09",
            "net1": "4e:7c:f1:a3:03:88",
            "net2": "3a:09:d0:d1:5c:5b",
            "net3": "32:40:3c:5f:a9:99",
            "net4": "86:82:1c:9c:1a:f9",
            "net5": "66:0f:dc:b5:7c:1e",
            "net6": "7a:c7:ed:17:72:43"
        },
        "spine_1_1_1": {
            "net0": "a2:a2:cd:0e:6c:ce",
            "net1": "b2:59:bb:3a:33:50",
            "net10": "1a:11:c4:53:30:d3",
            "net11": "5e:26:7e:cb:51:60",
            "net2": "96:b3:34:f8:39:46",
            "net3": "3e:62:81:95:a6:09",
            "net4": "86:84:ba:b2:ce:0e",
            "net5": "76:d7:b2:d2:7c:5f",
            "net6": "66:b6:84:7e:fb:f4",
            "net7": "02:39:06:02:a4:86",
            "net8": "16:dc:08:82:da:96",
            "net9": "0e:7b:08:cd:7a:d3"
        },
        "spine_1_1_2": {
            "net0": "8e:c5:30:3b:af:80",
            "net1": "8a:8c:e3:5d:b2:c9",
            "net10": "16:c9:40:bd:e6:66",
            "net11": "de:35:e7:c7:74:2d",
            "net2": "52:44:88:b0:a7:3d",
            "net3": "16:20:e2:c5:92:f7",
            "net4": "22:ab:cb:f4:4c:4c",
            "net5": "e6:e9:49:a1:6f:82",
            "net6": "22:ec:c6:64:db:d5",
            "net7": "72:1b:31:b5:e8:d0",
            "net8": "b2:a9:09:94:e2:f2",
            "net9": "96:35:36:3f:5f:87"
        },
        "spine_1_1_3": {
            "net0": "8e:80:2a:18:cb:30",
            "net1": "02:a7:4d:13:4d:15",
            "net10": "ce:08:9f:69:35:e8",
            "net11": "de:a7:ba:92:19:fc",
            "net2": "12:e2:bb:f0:ff:af",
            "net3": "b6:72:b1:30:2d:e9",
            "net4": "c6:3e:fb:fe:60:50",
            "net5": "6a:bc:fb:a0:47:91",
            "net6": "a2:4b:7a:90:3b:96",
            "net7": "b2:e1:83:85:20:12",
            "net8": "fa:4a:d4:6f:f0:a2",
            "net9": "1a:66:8c:9b:49:bc"
        },
        "spine_1_1_4": {
            "net0": "96:0c:df:d7:cc:e7",
            "net1": "96:25:ac:13:d7:42",
            "net10": "86:91:4f:1b:51:41",
            "net11": "be:d1:64:8e:80:18",
            "net2": "fe:e1:33:c4:30:7d",
            "net3": "d2:6a:76:11:6e:47",
            "net4": "ea:39:43:e0:05:7d",
            "net5": "6e:e6:e5:cf:47:e7",
            "net6": "02:08:f8:d9:ce:02",
            "net7": "72:ab:d5:69:46:77",
            "net8": "fa:0a:24:9b:61:13",
            "net9": "a6:4c:66:9c:87:a0"
        },
        "spine_1_1_5": {
            "net0": "76:9a:62:98:db:11",
            "net1": "de:07:5b:a1:d8:46",
            "net10": "da:5e:08:99:95:9e",
            "net11": "ce:2f:9b:ae:04:00",
            "net2": "f6:51:5f:09:21:85",
            "net3": "f6:d0:f2:22:c9:ff",
            "net4": "c6:85:eb:6b:f6:d1",
            "net5": "5e:54:9e:93:83:5f",
            "net6": "0e:5f:39:d7:78:23",
            "net7": "76:f9:dd:e5:fe:6a",
            "net8": "6e:5b:1c:14:61:6a",
            "net9": "6a:39:8e:2f:8d:e0"
        },
        "spine_1_1_6": {
            "net0": "16:9e:88:a7:9d:4b",
            "net1": "82:89:72:be:ab:82",
            "net10": "62:d3:38:02:1b:be",
            "net11": "06:df:5f:2c:3d:58",
            "net2": "c2:60:ab:b1:43:08",
            "net3": "52:48:86:7e:fc:09",
            "net4": "16:18:d2:a4:a6:e1",
            "net5": "8e:cd:11:76:e0:d8",
            "net6": "0e:61:24:fd:0c:13",
            "net7": "c6:62:68:bb:88:00",
            "net8": "12:d7:1d:d4:92:ce",
            "net9": "22:c7:be:ce:45:05"
        },
        "spine_2_1_1": {
            "net0": "fe:4f:ef:fa:d6:df",
            "net1": "06:29:76:b3:cc:e5",
            "net10": "ce:52:16:8e:50:01",
            "net11": "32:41:06:92:be:b8",
            "net2": "82:86:86:27:15:c1",
            "net3": "ca:3d:5f:21:ff:3d",
            "net4": "ae:90:66:74:c5:35",
            "net5": "4e:15:de:a2:6d:1a",
            "net6": "96:f8:b1:0d:97:8c",
            "net7": "0e:92:3d:99:d4:f4",
            "net8": "9e:e8:f7:f9:37:5d",
            "net9": "da:a8:00:f9:13:a0"
        },
        "spine_2_1_2": {
            "net0": "ce:d0:bc:e7:e8:4c",
            "net1": "de:bd:ae:4c:35:2c",
            "net10": "c2:cd:a0:c3:64:c7",
            "net11": "72:b7:fb:85:a4:7c",
            "net2": "02:5c:e3:ce:c4:65",
            "net3": "62:19:69:4a:54:e4",
            "net4": "2a:00:c7:78:74:18",
            "net5": "be:34:55:55:ca:03",
            "net6": "16:5a:e9:83:32:b5",
            "net7": "0e:bf:eb:05:8f:90",
            "net8": "46:00:14:1a:8f:91",
            "net9": "a2:53:29:2f:e6:6e"
        },
        "spine_2_1_3": {
            "net0": "f6:0d:67:a1:3c:68",
            "net1": "c6:8a:a9:5b:7d:bf",
            "net10": "e2:58:20:47:ad:9b",
            "net11": "8e:c1:ef:3a:8f:a4",
            "net2": "b6:20:d4:e1:e1:e2",
            "net3": "52:fa:ea:1a:ff:d9",
            "net4": "ba:79:4e:e0:38:4b",
            "net5": "12:81:e3:7a:77:40",
            "net6": "26:0e:43:06:a2:97",
            "net7": "32:1d:2d:fa:40:05",
            "net8": "96:5c:9e:63:71:5e",
            "net9": "26:89:b0:7a:b3:c1"
        },
        "spine_2_1_4": {
            "net0": "96:11:a3:e4:51:76",
            "net1": "b2:54:d0:b2:80:70",
            "net10": "82:17:6a:b0:cb:8d",
            "net11": "9a:94:fb:b9:12:ea",
            "net2": "8a:a6:25:fb:a9:e7",
            "net3": "f2:14:0a:77:66:bc",
            "net4": "d6:e6:2f:a4:ce:b1",
            "net5": "c2:ec:c2:96:dd:de",
            "net6": "a2:32:a5:42:80:0d",
            "net7": "26:66:28:0b:39:38",
            "net8": "e6:d7:d9:3d:79:2e",
            "net9": "ea:b5:f0:1a:6d:f8"
        },
        "spine_2_1_5": {
            "net0": "66:73:b5:50:33:b0",
            "net1": "12:46:20:fc:bc:b0",
            "net10": "56:a6:d5:50:60:52",
            "net11": "f2:04:0e:8c:8b:80",
            "net2": "92:aa:94:40:0d:9f",
            "net3": "f6:a3:6d:b5:7d:1b",
            "net4": "ea:16:b4:26:bc:97",
            "net5": "12:fc:76:62:34:29",
            "net6": "22:9f:d6:d2:a7:ce",
            "net7": "5a:81:a0:91:0d:18",
            "net8": "9e:75:a8:7c:a8:37",
            "net9": "ce:16:6d:23:83:1e"
        },
        "spine_2_1_6": {
            "net0": "36:db:a2:db:c3:20",
            "net1": "d2:4c:a4:a2:0b:9d",
            "net10": "b6:21:1a:2b:67:14",
            "net11": "76:f4:ff:6b:24:05",
            "net2": "76:a6:b1:a1:9d:fa",
            "net3": "32:9b:2b:dd:40:b7",
            "net4": "76:57:37:8b:4a:2e",
            "net5": "36:df:dc:7d:d5:ab",
            "net6": "e2:68:9e:c8:c9:2e",
            "net7": "f6:d7:f7:51:1d:3b",
            "net8": "62:87:bf:18:36:2e",
            "net9": "fa:41:81:58:1e:d6"
        },
        "spine_3_1_1": {
            "net0": "22:a2:be:ea:d1:94",
            "net1": "8e:a3:6a:f3:10:c7",
            "net10": "6a:6f:ec:b8:e5:b0",
            "net11": "5a:33:db:9f:3f:98",
            "net2": "a6:42:20:bf:92:34",
            "net3": "22:8e:09:13:21:06",
            "net4": "9a:7f:8d:0b:52:39",
            "net5": "7e:77:b7:64:c9:4e",
            "net6": "72:42:9b:b7:6b:11",
            "net7": "e2:54:e2:75:3d:38",
            "net8": "b2:4b:e8:30:31:53",
            "net9": "ca:92:c7:d9:67:0f"
        },
        "spine_3_1_2": {
            "net0": "c6:f3:60:f9:ca:33",
            "net1": "36:46:0e:7e:1e:ac",
            "net10": "42:95:f7:e3:8d:b7",
            "net11": "02:61:67:db:3d:36",
            "net2": "12:6c:e0:ec:26:dc",
            "net3": "d2:a6:ce:12:3e:c5",
            "net4": "4e:0f:90:6c:6b:8d",
            "net5": "82:5e:ca:a2:fb:95",
            "net6": "f2:d3:96:1c:ec:65",
            "net7": "e6:8b:9b:95:74:e3",
            "net8": "b6:38:38:53:f6:92",
            "net9": "a6:69:2e:77:c2:a0"
        },
        "spine_3_1_3": {
            "net0": "02:43:c6:86:c1:a3",
            "net1": "5a:a6:08:0f:fd:cf",
            "net10": "c6:26:39:0d:99:fe",
            "net11": "d2:f0:da:d1:15:8c",
            "net2": "52:5f:f5:f1:dc:2d",
            "net3": "62:98:74:b9:50:a6",
            "net4": "5e:6c:55:63:92:a9",
            "net5": "5a:d4:6d:7f:c8:4f",
            "net6": "ba:1b:ba:a4:b6:00",
            "net7": "ce:85:ba:8b:94:c2",
            "net8": "8a:77:0d:8f:9b:da",
            "net9": "36:12:90:9b:37:da"
        },
        "spine_3_1_4": {
            "net0": "06:53:eb:e6:58:15",
            "net1": "82:31:d8:68:45:bc",
            "net10": "46:47:db:7c:50:e4",
            "net11": "ee:59:b1:47:bb:a1",
            "net2": "5a:45:d1:f9:99:ed",
            "net3": "aa:0b:c8:7b:02:b1",
            "net4": "36:db:be:8a:1c:51",
            "net5": "7a:a0:a7:a6:10:22",
            "net6": "3e:f3:bf:18:6a:ab",
            "net7": "3a:9a:fc:3c:02:6d",
            "net8": "e6:2d:00:1e:80:5a",
            "net9": "06:71:a5:5c:34:71"
        },
        "spine_3_1_5": {
            "net0": "0a:16:75:61:53:a3",
            "net1": "a2:8c:62:28:c4:7e",
            "net10": "fa:76:ab:65:47:da",
            "net11": "be:31:b2:70:7b:e4",
            "net2": "7a:03:2a:9e:bd:83",
            "net3": "76:f5:e1:4f:92:83",
            "net4": "d6:5d:b4:dd:70:ce",
            "net5": "0e:a8:85:03:c3:94",
            "net6": "96:d2:9f:39:44:84",
            "net7": "26:01:f8:0c:88:0a",
            "net8": "16:19:47:df:48:39",
            "net9": "86:91:bf:a8:f4:44"
        },
        "spine_3_1_6": {
            "net0": "2a:49:91:7d:10:16",
            "net1": "2a:84:fa:1d:3b:01",
            "net10": "96:37:e7:0b:e0:49",
            "net11": "ba:01:d8:c1:3a:ca",
            "net2": "9e:ac:a3:75:41:b8",
            "net3": "46:da:02:c3:4f:87",
            "net4": "6e:af:04:d8:59:0f",
            "net5": "be:5c:f5:3d:39:4a",
            "net6": "36:44:ac:c2:3d:ae",
            "net7": "c2:9f:e3:bd:08:6b",
            "net8": "ae:c5:af:6c:73:98",
            "net9": "26:f8:45:ca:80:36"
        },
        "spine_4_1_1": {
            "net0": "26:7c:a2:0c:6b:96",
            "net1": "7a:5a:4a:67:80:bb",
            "net10": "4a:5e:24:a8:60:88",
            "net11": "8a:d3:ca:d5:b2:51",
            "net2": "ba:e0:2a:64:5c:83",
            "net3": "86:08:a7:c5:9c:95",
            "net4": "6e:54:a0:a2:20:bb",
            "net5": "02:26:ee:08:f3:bf",
            "net6": "ca:72:91:4e:4a:2d",
            "net7": "d2:b3:c8:a9:cc:1f",
            "net8": "9e:8e:c9:f3:ba:b5",
            "net9": "3a:31:7d:3c:a1:b9"
        },
        "spine_4_1_2": {
            "net0": "26:b7:fc:9e:0b:15",
            "net1": "62:7b:f1:08:db:05",
            "net10": "06:51:a1:78:9c:e9",
            "net11": "fa:bd:89:01:e6:95",
            "net2": "1a:8d:72:44:2d:ee",
            "net3": "e2:d3:51:2f:fb:ef",
            "net4": "9a:07:af:0f:2b:10",
            "net5": "aa:ef:1b:7a:b9:5f",
            "net6": "7a:11:c1:ff:1c:22",
            "net7": "86:61:a8:9d:35:d2",
            "net8": "ba:2f:90:7c:73:5f",
            "net9": "22:b2:fa:92:b1:28"
        },
        "spine_4_1_3": {
            "net0": "ae:9e:06:fe:c0:9a",
            "net1": "aa:82:41:ae:e5:38",
            "net10": "6a:a1:17:b5:6b:36",
            "net11": "b6:18:92:3d:f8:24",
            "net2": "6e:23:fd:57:39:ec",
            "net3": "3a:75:33:70:d2:6f",
            "net4": "16:df:94:a6:cd:71",
            "net5": "e6:67:c9:02:9a:2d",
            "net6": "6a:7d:7d:c1:7b:ee",
            "net7": "0a:be:d1:e5:c5:c3",
            "net8": "22:12:2d:e7:05:bc",
            "net9": "4e:be:db:1f:69:a2"
        },
        "spine_4_1_4": {
            "net0": "b2:82:be:ea:37:af",
            "net1": "da:80:59:b9:21:68",
            "net10": "4e:75:c1:de:ca:52",
            "net11": "5e:03:43:7f:e2:0c",
            "net2": "de:93:b7:94:6a:79",
            "net3": "b2:92:17:e3:0c:00",
            "net4": "e2:2a:78:c7:40:8a",
            "net5": "b2:89:1e:a3:57:61",
            "net6": "12:a4:37:eb:90:f8",
            "net7": "be:ba:24:d0:63:37",
            "net8": "3a:f4:71:0a:81:c6",
            "net9": "1a:b5:91:41:69:d0"
        },
        "spine_4_1_5": {
            "net0": "d6:09:df:ca:5c:e4",
            "net1": "92:1e:8a:fa:7e:12",
            "net10": "3e:aa:23:5c:29:53",
            "net11": "5e:8a:82:75:a6:8c",
            "net2": "b6:fe:ac:56:96:6e",
            "net3": "ca:69:2a:a0:d0:00",
            "net4": "0e:ee:cf:c5:e3:26",
            "net5": "be:30:1b:38:f3:6c",
            "net6": "3a:69:95:21:9f:54",
            "net7": "c6:cd:4f:d8:93:e8",
            "net8": "6a:2b:7e:9a:2d:70",
            "net9": "52:7d:fc:de:a4:14"
        },
        "spine_4_1_6": {
            "net0": "1a:e4:67:37:5f:d6",
            "net1": "3e:db:5a:02:ae:7f",
            "net10": "ca:4d:a6:10:c6:58",
            "net11": "96:88:d6:56:f5:04",
            "net2": "b2:4f:1d:20:8a:6f",
            "net3": "a6:a8:e0:e4:d8:7a",
            "net4": "16:72:a8:17:5f:80",
            "net5": "66:6b:5c:5b:28:db",
            "net6": "6e:06:08:fa:40:86",
            "net7": "46:4c:a5:42:e4:e3",
            "net8": "8e:c9:9a:b4:2b:1f",
            "net9": "d2:bd:54:9c:05:aa"
        },
        "spine_5_1_1": {
            "net0": "2a:1d:c2:d3:80:0c",
            "net1": "16:f6:34:1a:ce:ee",
            "net10": "56:28:cb:69:cb:52",
            "net11": "a6:5f:f0:7f:c4:05",
            "net2": "82:0a:cb:2f:5d:f2",
            "net3": "02:f5:f3:b8:4d:9d",
            "net4": "d6:c0:b8:3e:8b:18",
            "net5": "2a:c9:6e:d4:67:91",
            "net6": "ca:04:b7:7b:ae:20",
            "net7": "a6:75:33:fa:bc:cd",
            "net8": "2a:43:0d:c6:c3:9d",
            "net9": "6e:47:3e:87:cb:41"
        },
        "spine_5_1_2": {
            "net0": "3a:bc:72:da:25:f2",
            "net1": "a2:b2:ac:46:03:83",
            "net10": "7e:55:fd:87:24:60",
            "net11": "2a:ae:f7:2a:60:fa",
            "net2": "3e:00:cc:aa:11:97",
            "net3": "6a:db:28:17:0a:c7",
            "net4": "3e:a9:66:f1:5d:c1",
            "net5": "6a:68:3e:d5:2a:c4",
            "net6": "06:be:12:58:10:7b",
            "net7": "aa:19:2c:ec:85:55",
            "net8": "2a:df:db:16:28:9a",
            "net9": "a6:e9:3d:c1:de:fc"
        },
        "spine_5_1_3": {
            "net0": "3a:14:e2:f1:86:66",
            "net1": "e6:a4:cb:2d:bd:30",
            "net10": "56:f4:42:07:5c:3d",
            "net11": "c6:d6:b1:0e:1f:41",
            "net2": "0a:1f:e6:01:65:39",
            "net3": "5e:e1:1a:c8:9d:93",
            "net4": "12:5f:1e:aa:33:f0",
            "net5": "da:6c:63:15:bd:00",
            "net6": "36:8d:54:8a:65:e8",
            "net7": "9e:ce:2d:98:90:e3",
            "net8": "a2:6d:72:f6:4d:6c",
            "net9": "0a:99:2d:d0:49:26"
        },
        "spine_5_1_4": {
            "net0": "4e:c5:64:57:1f:1c",
            "net1": "fe:6e:73:ed:b3:c7",
            "net10": "2a:0e:49:0a:17:c7",
            "net11": "fe:0f:c1:96:99:80",
            "net2": "0e:0a:ad:11:71:3b",
            "net3": "0a:8a:3c:4b:a6:66",
            "net4": "32:91:b5:59:0d:62",
            "net5": "32:c2:70:d7:ec:a1",
            "net6": "ae:20:14:e3:f6:a1",
            "net7": "fa:e8:09:69:11:47",
            "net8": "42:4c:41:64:37:fc",
            "net9": "56:4b:59:72:ff:4b"
        },
        "spine_5_1_5": {
            "net0": "8a:ca:24:11:d2:7a",
            "net1": "72:d6:71:5a:4c:bc",
            "net10": "6e:59:57:3b:1c:d4",
            "net11": "02:83:80:51:0f:55",
            "net2": "7e:93:bb:4a:fc:6c",
            "net3": "96:7c:75:fe:7a:55",
            "net4": "1e:52:48:55:2c:5a",
            "net5": "22:19:b2:16:4e:98",
            "net6": "6e:e5:03:2b:82:8c",
            "net7": "8a:89:2b:18:76:28",
            "net8": "0a:95:64:7f:b4:8f",
            "net9": "e6:07:d0:28:23:8e"
        },
        "spine_5_1_6": {
            "net0": "66:09:4c:61:f5:f3",
            "net1": "e6:fe:31:99:ca:2a",
            "net10": "0e:29:d1:90:c5:21",
            "net11": "6e:4a:f2:64:65:e5",
            "net2": "f6:69:7c:8f:6f:00",
            "net3": "ae:1b:a0:69:fb:50",
            "net4": "fe:96:d5:78:a3:0c",
            "net5": "12:e4:fb:e1:06:d5",
            "net6": "26:14:29:54:cf:9c",
            "net7": "7a:71:d4:a6:50:bb",
            "net8": "4e:cd:c5:e2:83:54",
            "net9": "96:7a:07:bf:55:0b"
        },
        "spine_6_1_1": {
            "net0": "ee:0e:a0:f4:8c:87",
            "net1": "0e:8c:3b:72:42:9e",
            "net10": "02:b1:45:b7:2b:89",
            "net11": "6a:13:10:a2:70:a6",
            "net2": "32:43:4b:d1:55:45",
            "net3": "8a:69:9d:eb:45:47",
            "net4": "8e:97:17:e3:26:29",
            "net5": "ea:72:c0:e5:da:0d",
            "net6": "d2:5a:d0:62:43:d7",
            "net7": "56:96:ac:c3:8e:fa",
            "net8": "82:aa:48:77:14:0c",
            "net9": "4a:08:bb:09:cd:fb"
        },
        "spine_6_1_2": {
            "net0": "02:c7:d1:82:b0:2c",
            "net1": "12:ff:3b:60:44:e6",
            "net10": "b2:6a:f2:a0:53:04",
            "net11": "a6:27:a6:cc:4a:73",
            "net2": "76:6b:5b:53:13:3c",
            "net3": "a2:f5:e4:e6:9a:f3",
            "net4": "72:29:2a:b1:d1:8d",
            "net5": "d6:32:5a:ea:b1:80",
            "net6": "7e:ed:c1:d8:4f:10",
            "net7": "ea:5a:af:9b:5d:f6",
            "net8": "1a:17:69:69:55:3f",
            "net9": "b2:0c:94:72:78:f7"
        },
        "spine_6_1_3": {
            "net0": "b2:63:51:e9:01:7a",
            "net1": "de:be:5b:05:a6:0e",
            "net10": "5e:c0:67:2c:f9:e2",
            "net11": "7e:a4:d1:e1:c2:6f",
            "net2": "b6:3b:31:84:33:ff",
            "net3": "f6:5e:70:fe:48:c7",
            "net4": "96:19:20:4a:c4:52",
            "net5": "3e:8e:24:a7:73:f8",
            "net6": "12:4e:8c:83:97:d9",
            "net7": "66:3a:b9:8e:4b:6b",
            "net8": "0e:67:c5:30:07:b5",
            "net9": "f2:74:a0:29:35:5f"
        },
        "spine_6_1_4": {
            "net0": "42:47:06:8b:a9:14",
            "net1": "02:3f:6d:c8:b5:79",
            "net10": "d6:27:0c:20:02:db",
            "net11": "9a:2b:e1:80:36:de",
            "net2": "de:e1:a8:1d:ef:a3",
            "net3": "32:a8:d6:de:08:82",
            "net4": "8a:24:82:61:dd:14",
            "net5": "e2:25:4c:9d:ed:2c",
            "net6": "86:22:27:3d:ba:57",
            "net7": "26:b7:bf:ba:65:8f",
            "net8": "c6:7a:f4:a4:f3:26",
            "net9": "32:c2:7a:e2:bd:ea"
        },
        "spine_6_1_5": {
            "net0": "46:47:c3:ce:04:d7",
            "net1": "f2:3d:d1:10:dd:5b",
            "net10": "86:69:c8:82:d0:0b",
            "net11": "c6:85:60:e7:40:59",
            "net2": "1a:e7:65:7f:39:f4",
            "net3": "06:18:0a:b1:74:b5",
            "net4": "26:c7:ce:0c:75:36",
            "net5": "6a:0a:19:dd:66:c6",
            "net6": "a2:86:a4:e8:9a:06",
            "net7": "d6:12:a6:01:8e:9c",
            "net8": "1e:78:9d:bd:96:a6",
            "net9": "aa:2d:81:1f:a7:6f"
        },
        "spine_6_1_6": {
            "net0": "e6:c5:50:03:bf:cb",
            "net1": "b6:d0:55:bc:43:4e",
            "net10": "c6:64:73:b6:0a:86",
            "net11": "fa:63:41:64:0d:d6",
            "net2": "92:9e:c2:2f:3a:ba",
            "net3": "76:16:bd:9e:ca:b0",
            "net4": "86:7b:93:d1:c6:c1",
            "net5": "de:2c:18:b8:74:08",
            "net6": "9e:ef:17:8f:7d:5a",
            "net7": "e6:30:47:8d:ad:6f",
            "net8": "da:52:d3:2b:54:d9",
            "net9": "16:c5:97:0a:8f:a1"
        },
        "tof_1_2_1": {
            "net0": "02:0b:99:e0:cf:60",
            "net1": "6e:9b:87:13:d0:c0",
            "net10": "76:f8:62:7f:51:67",
            "net11": "66:2d:01:62:36:9b",
            "net2": "d6:e5:57:1c:5a:82",
            "net3": "ce:37:3d:52:8c:a0",
            "net4": "ba:50:e1:f0:8e:b4",
            "net5": "36:5e:a3:fe:b8:c6",
            "net6": "ea:4a:ef:f5:8e:1d",
            "net7": "aa:78:f4:44:bb:60",
            "net8": "ee:af:ff:1a:ed:1b",
            "net9": "96:d1:6f:90:80:25"
        },
        "tof_1_2_2": {
            "net0": "b6:52:4b:65:89:98",
            "net1": "e6:f9:fc:cb:e1:38",
            "net10": "3e:8a:1d:3b:96:59",
            "net11": "ba:4a:aa:85:9e:f5",
            "net2": "7a:d0:c4:17:ad:53",
            "net3": "6e:5e:95:4d:83:da",
            "net4": "ae:e1:7c:f1:75:fa",
            "net5": "de:e5:81:d6:d7:a8",
            "net6": "22:6c:1b:12:79:31",
            "net7": "aa:3c:bc:01:43:65",
            "net8": "2e:15:4c:cd:2a:1a",
            "net9": "da:be:c4:7f:16:77"
        },
        "tof_1_2_3": {
            "net0": "66:21:b0:44:7b:41",
            "net1": "26:05:13:8d:93:0e",
            "net10": "92:f2:ed:b8:7e:f6",
            "net11": "ce:01:ae:04:77:e7",
            "net2": "22:32:e7:1d:b6:8c",
            "net3": "0e:62:2e:97:ad:d0",
            "net4": "2e:18:e3:fc:a4:ef",
            "net5": "d2:f8:3f:f7:44:96",
            "net6": "52:21:2e:74:03:e6",
            "net7": "8a:b3:48:15:5a:fd",
            "net8": "1a:a3:55:22:7c:2e",
            "net9": "b2:7e:10:73:73:2d"
        },
        "tof_1_2_4": {
            "net0": "56:05:26:ce:6f:94",
            "net1": "8e:a1:bc:0d:b3:c0",
            "net10": "6e:11:ae:67:07:0a",
            "net11": "5a:54:dd:88:4b:30",
            "net2": "2a:ac:7e:10:5c:3f",
            "net3": "02:f1:20:d2:f5:84",
            "net4": "4a:70:a2:e6:03:64",
            "net5": "7e:36:22:14:62:b4",
            "net6": "fe:4a:23:b0:b4:b5",
            "net7": "2e:3b:86:73:d0:be",
            "net8": "ee:f5:33:27:30:8e",
            "net9": "86:e5:4c:3c:4f:28"
        },
        "tof_1_2_5": {
            "net0": "be:22:dd:cf:03:87",
            "net1": "f6:1e:b0:3b:08:9b",
            "net10": "52:81:7a:8a:58:4d",
            "net11": "6a:de:57:65:9a:c5",
            "net2": "5e:22:2d:42:b9:a8",
            "net3": "5e:3e:21:11:05:98",
            "net4": "a2:d0:c8:9c:23:9a",
            "net5": "0e:20:bb:38:e7:6a",
            "net6": "6e:f4:95:68:d5:c9",
            "net7": "ea:61:0a:6c:4a:1d",
            "net8": "06:49:10:8c:0c:66",
            "net9": "2a:9f:0a:58:cf:56"
        },
        "tof_1_2_6": {
            "net0": "ee:6e:be:83:cb:c7",
            "net1": "96:17:f5:27:0e:aa",
            "net10": "a2:04:46:b4:22:7f",
            "net11": "92:48:df:3a:18:a4",
            "net2": "06:e3:8c:36:0e:16",
            "net3": "da:19:95:36:b5:bc",
            "net4": "ba:ce:7e:86:cc:38",
            "net5": "d2:2b:22:56:29:48",
            "net6": "6a:d3:6b:60:17:95",
            "net7": "6e:80:8c:b4:1f:11",
            "net8": "72:1b:40:32:95:54",
            "net9": "8a:6e:23:ac:4d:08"
        },
        "tof_2_2_1": {
            "net0": "52:ef:85:38:36:83",
            "net1": "4a:31:74:bb:c6:a7",
            "net10": "1e:ae:a6:52:dd:8e",
            "net11": "a2:c2:cd:37:43:1a",
            "net2": "66:a1:1f:ce:9c:0f",
            "net3": "f2:56:38:a9:10:df",
            "net4": "36:e5:f6:ec:05:1e",
            "net5": "9e:1e:49:c0:02:fd",
            "net6": "f2:fb:7a:2b:5b:3c",
            "net7": "be:ca:c3:b8:c1:ce",
            "net8": "96:7c:ab:96:41:26",
            "net9": "2a:5b:dc:4f:92:97"
        },
        "tof_2_2_2": {
            "net0": "ce:65:11:cd:d4:e5",
            "net1": "d6:e0:d4:d6:a6:43",
            "net10": "8a:40:97:93:19:f0",
            "net11": "ce:5f:ba:b0:d1:67",
            "net2": "c6:8a:c1:11:cd:54",
            "net3": "42:79:3b:99:01:33",
            "net4": "9a:54:fd:4c:83:80",
            "net5": "72:e0:b3:0f:7d:f8",
            "net6": "1a:84:4e:e2:bf:57",
            "net7": "02:82:d9:32:17:6f",
            "net8": "1a:3d:f2:a2:ce:c5",
            "net9": "56:dd:bc:72:64:58"
        },
        "tof_2_2_3": {
            "net0": "be:b6:f0:a0:b1:4e",
            "net1": "52:79:15:7e:1f:a8",
            "net10": "92:5e:53:d8:93:f9",
            "net11": "8e:4c:d0:e1:51:7a",
            "net2": "0e:59:71:4c:ff:7a",
            "net3": "92:98:a3:4e:02:5b",
            "net4": "72:52:2c:53:f4:f6",
            "net5": "4a:1f:ac:f5:82:13",
            "net6": "aa:d3:13:d7:23:3f",
            "net7": "a6:5d:a7:14:d4:cc",
            "net8": "a6:70:ad:1a:e5:68",
            "net9": "2a:51:c7:d9:83:6f"
        },
        "tof_2_2_4": {
            "net0": "66:4e:fa:66:ac:5d",
            "net1": "42:b8:47:c1:a5:a0",
            "net10": "42:0c:6c:de:db:c0",
            "net11": "42:47:d2:31:59:fd",
            "net2": "96:6c:fc:6d:14:66",
            "net3": "ca:d9:bd:56:fd:de",
            "net4": "46:19:3b:70:f1:99",
            "net5": "26:e5:5f:1c:5e:ed",
            "net6": "1a:89:88:4e:c9:57",
            "net7": "ae:af:35:41:e5:6d",
            "net8": "be:59:c4:41:fe:97",
            "net9": "92:f1:0c:a0:d5:2f"
        },
        "tof_2_2_5": {
            "net0": "4e:a7:37:1c:93:de",
            "net1": "0a:fe:ad:dd:73:40",
            "net10": "4a:d1:fd:a3:7b:0a",
            "net11": "c6:c0:24:83:77:6f",
            "net2": "7a:24:bb:af:28:bf",
            "net3": "7e:7f:10:5d:54:b9",
            "net4": "1e:27:1d:9a:f5:75",
            "net5": "7a:76:ef:aa:eb:e9",
            "net6": "2a:bb:bb:2e:9d:4e",
            "net7": "5e:ae:08:63:3c:ec",
            "net8": "46:93:22:12:f3:d7",
            "net9": "7e:b3:90:fe:07:22"
        },
        "tof_2_2_6": {
            "net0": "fa:f2:7f:fc:19:a8",
            "net1": "b6:1f:61:13:7d:1b",
            "net10": "76:eb:5c:b9:17:cf",
            "net11": "76:39:71:a0:a1:ae",
            "net2": "0a:76:ed:d7:60:b9",
            "net3": "7a:08:06:17:e8:c3",
            "net4": "b6:97:be:24:63:63",
            "net5": "ba:6b:88:fa:3e:d5",
            "net6": "7a:97:78:2e:92:32",
            "net7": "6a:63:48:b9:cc:ca",
            "net8": "ca:ae:39:7c:47:b6",
            "net9": "ca:c1:13:15:5b:7e"
        },
        "tof_3_2_1": {
            "net0": "fe:fc:0e:f0:c9:66",
            "net1": "0e:db:59:99:6c:8e",
            "net10": "ee:1c:42:f7:9f:ac",
            "net11": "82:7b:3d:1b:1f:81",
            "net2": "ee:44:c4:2f:6b:b2",
            "net3": "56:cc:b7:50:52:88",
            "net4": "fe:5c:36:34:47:30",
            "net5": "26:dd:5c:ff:08:2c",
            "net6": "46:d0:f3:f9:42:81",
            "net7": "ea:c0:b7:2c:b4:85",
            "net8": "ba:91:3c:91:8b:b8",
            "net9": "c2:12:7f:48:e0:c0"
        },
        "tof_3_2_2": {
            "net0": "66:df:fa:dd:f9:8c",
            "net1": "c2:c6:12:49:1c:eb",
            "net10": "36:5e:93:92:a0:af",
            "net11": "76:4e:4f:58:83:b0",
            "net2": "76:29:83:ac:c2:f6",
            "net3": "82:00:0c:d1:d0:f9",
            "net4": "c6:80:46:59:64:8c",
            "net5": "a6:af:dd:25:1b:1e",
            "net6": "16:b8:44:c5:9c:8e",
            "net7": "2e:29:ba:1c:57:51",
            "net8": "7e:26:34:a2:9a:3f",
            "net9": "e2:05:c0:1f:b5:6c"
        },
        "tof_3_2_3": {
            "net0": "f2:41:5f:9b:59:dc",
            "net1": "26:06:bb:b8:14:10",
            "net10": "36:a2:ac:61:af:1c",
            "net11": "aa:5a:04:d1:54:f0",
            "net2": "52:2a:b9:f2:23:38",
            "net3": "06:3a:76:78:6b:02",
            "net4": "a2:c1:5b:3b:9f:ce",
            "net5": "56:79:53:80:44:2e",
            "net6": "a2:67:a7:19:c6:16",
            "net7": "26:9c:1c:67:9c:dd",
            "net8": "0e:88:45:61:9c:d5",
            "net9": "b6:34:83:93:89:34"
        },
        "tof_3_2_4": {
            "net0": "42:45:8c:73:92:94",
            "net1": "36:4e:b6:ff:1c:cc",
            "net10": "76:2b:5a:2c:b0:04",
            "net11": "fe:97:f4:b4:bc:91",
            "net2": "26:b8:3f:d8:36:47",
            "net3": "c6:e9:f0:b4:9e:ad",
            "net4": "46:59:6e:89:8e:f3",
            "net5": "c6:d5:58:c9:05:6b",
            "net6": "32:94:8e:09:ac:8b",
            "net7": "4a:fa:d1:5b:55:d2",
            "net8": "be:a1:f9:1b:07:02",
            "net9": "d2:fe:95:d1:7d:0f"
        },
        "tof_3_2_5": {
            "net0": "9e:ca:14:94:2c:f8",
            "net1": "8e:ab:01:21:ee:6a",
            "net10": "7a:c9:c9:2a:af:68",
            "net11": "1e:53:46:7c:de:58",
            "net2": "7e:68:50:13:db:02",
            "net3": "ce:75:91:e1:a9:e7",
            "net4": "1e:c0:77:17:c2:ee",
            "net5": "fe:4f:fd:c2:c8:b7",
            "net6": "ee:90:68:24:bc:1d",
            "net7": "c6:cc:bd:92:0d:8e",
            "net8": "1e:d7:c2:1c:32:02",
            "net9": "aa:30:4c:fe:81:c3"
        },
        "tof_3_2_6": {
            "net0": "16:6c:92:ee:8c:29",
            "net1": "f2:95:d7:d9:86:b2",
            "net10": "46:02:80:94:29:d3",
            "net11": "da:c1:31:44:1c:5a",
            "net2": "ee:5b:60:75:a4:42",
            "net3": "aa:71:38:89:70:cb",
            "net4": "3e:ad:b4:9f:fd:de",
            "net5": "26:ac:41:b4:b8:54",
            "net6": "92:3e:93:07:b1:97",
            "net7": "e2:14:02:f2:dd:b6",
            "net8": "8a:9d:08:41:6d:a5",
            "net9": "e6:ae:39:f9:50:9e"
        }
    },
    "failed_machine": "leaf_1_0_1",
    "failed_interfaces": [
        "net0"
    ],
    "failure_time": 1613558227.3435738
}