{
    "k_leaf": 8,
    "k_top": 8,
    "redundancy_factor": 4,
    "is_k8s": true,
    "machine_mac_addresses": {
        "leaf_1_0_1": {
            "net0": "52:97:f5:9a:3b:86",
            "net1": "76:37:65:7a:9c:80",
            "net2": "de:aa:27:ec:0f:48",
            "net3": "0a:a6:0b:fd:35:a9",
            "net4": "42:8a:89:3c:f5:21",
            "net5": "aa:55:35:16:23:96",
            "net6": "b6:52:7d:36:dd:9d",
            "net7": "6a:36:8e:3e:28:03",
            "net8": "6a:cd:bc:6e:ef:8a"
        },
        "leaf_1_0_2": {
            "net0": "e6:86:d3:ef:1a:92",
            "net1": "46:50:b8:b0:b5:77",
            "net2": "02:1c:b3:cc:ac:d2",
            "net3": "22:4f:b5:cb:ba:7a",
            "net4": "aa:28:15:69:e6:26",
            "net5": "72:5b:87:a6:fe:0d",
            "net6": "92:c3:11:29:af:cb",
            "net7": "16:22:19:0c:25:50",
            "net8": "c2:be:b5:67:00:68"
        },
        "leaf_1_0_3": {
            "net0": "5e:f9:53:2a:56:6c",
            "net1": "f6:46:5c:71:81:66",
            "net2": "f6:cd:6b:9a:51:08",
            "net3": "9e:56:40:57:64:d0",
            "net4": "4e:ab:c5:08:90:3f",
            "net5": "86:e2:dc:73:9e:25",
            "net6": "6a:1f:84:60:35:07",
            "net7": "16:13:c2:67:67:e8",
            "net8": "fe:59:14:bb:b4:a5"
        },
        "leaf_1_0_4": {
            "net0": "d6:47:52:dc:37:b0",
            "net1": "16:77:64:ae:0a:f7",
            "net2": "da:2b:7f:c6:25:45",
            "net3": "62:0d:61:15:54:2e",
            "net4": "72:68:0b:61:9b:58",
            "net5": "1e:b9:10:f3:87:0a",
            "net6": "52:5f:9a:30:55:96",
            "net7": "d2:db:70:cb:57:79",
            "net8": "4a:41:3f:80:78:eb"
        },
        "leaf_1_0_5": {
            "net0": "16:3a:cb:b0:57:0c",
            "net1": "7a:13:ad:98:45:31",
            "net2": "56:02:86:ff:c4:c6",
            "net3": "e2:f4:f9:95:8e:17",
            "net4": "86:9f:5e:7a:ce:14",
            "net5": "72:4b:39:d0:98:1d",
            "net6": "4a:73:a7:38:e9:57",
            "net7": "32:fb:12:31:c6:95",
            "net8": "aa:09:d4:f8:94:78"
        },
        "leaf_1_0_6": {
            "net0": "22:28:9f:83:5e:b4",
            "net1": "b6:33:90:b5:26:33",
            "net2": "0e:10:4e:32:f9:67",
            "net3": "d2:bf:29:7c:12:ab",
            "net4": "b2:ec:9d:4c:3a:63",
            "net5": "2a:54:c4:fd:15:23",
            "net6": "ae:8d:af:4c:83:72",
            "net7": "ee:4e:df:87:12:58",
            "net8": "b6:3f:e8:6a:cd:29"
        },
        "leaf_1_0_7": {
            "net0": "9e:7a:70:62:65:41",
            "net1": "aa:27:a4:c0:e0:58",
            "net2": "12:d5:54:d2:cb:cf",
            "net3": "f6:5b:98:ac:c8:a1",
            "net4": "ea:cf:2e:f5:5a:31",
            "net5": "52:bd:56:9e:fa:22",
            "net6": "06:54:df:44:d9:1b",
            "net7": "0e:3b:4f:3c:45:b0",
            "net8": "56:df:9e:ff:c3:a1"
        },
        "leaf_1_0_8": {
            "net0": "0e:13:6a:e5:21:1a",
            "net1": "0e:ef:50:36:90:cf",
            "net2": "8a:ce:a7:82:fe:a0",
            "net3": "fe:67:1a:90:d2:b2",
            "net4": "9a:8d:e9:b2:fb:e7",
            "net5": "82:0b:68:41:a3:23",
            "net6": "ae:e9:8c:7c:48:60",
            "net7": "ca:96:21:77:b2:7f",
            "net8": "22:f2:50:94:7f:6c"
        },
        "leaf_2_0_1": {
            "net0": "8e:69:71:1d:61:fe",
            "net1": "de:89:a2:a3:66:3a",
            "net2": "ca:61:dd:e4:a3:bd",
            "net3": "2e:c1:4d:fd:92:ee",
            "net4": "36:9f:a5:49:1e:84",
            "net5": "52:18:ed:c1:47:4e",
            "net6": "9e:ef:4a:db:ea:1b",
            "net7": "42:b0:f1:1d:dc:eb",
            "net8": "0a:25:9e:30:96:7d"
        },
        "leaf_2_0_2": {
            "net0": "a2:15:3c:f4:26:59",
            "net1": "2a:6f:71:e6:0f:1d",
            "net2": "5e:c5:06:00:ae:9f",
            "net3": "62:cf:81:87:fe:55",
            "net4": "2a:8c:d8:40:5e:a2",
            "net5": "32:5d:8d:c6:b2:99",
            "net6": "46:05:6a:9e:fa:d8",
            "net7": "ea:f3:c5:fb:50:ac",
            "net8": "0e:87:db:c5:b3:fc"
        },
        "leaf_2_0_3": {
            "net0": "ba:fc:72:d6:00:1e",
            "net1": "ee:ee:4d:57:da:19",
            "net2": "92:a2:6d:5b:8f:e9",
            "net3": "e2:2a:41:46:87:4f",
            "net4": "96:c4:58:10:53:50",
            "net5": "82:7e:8a:16:b1:2f",
            "net6": "6e:c8:34:c3:e1:99",
            "net7": "8e:7b:dc:a2:81:b5",
            "net8": "7a:4e:e8:fc:7a:78"
        },
        "leaf_2_0_4": {
            "net0": "2e:ba:b7:32:a7:1d",
            "net1": "2e:52:63:ce:d9:8c",
            "net2": "d2:2d:45:ad:79:81",
            "net3": "3a:a8:6b:81:6e:d9",
            "net4": "fe:75:07:e0:a9:8f",
            "net5": "66:a2:c5:ab:0b:e8",
            "net6": "da:9e:e5:d1:60:09",
            "net7": "6a:27:b5:f1:c6:af",
            "net8": "b6:7a:6e:4e:39:0f"
        },
        "leaf_2_0_5": {
            "net0": "46:78:07:a6:0f:aa",
            "net1": "a2:85:04:14:8b:39",
            "net2": "5a:71:59:45:6c:f9",
            "net3": "5e:75:36:8a:6d:9d",
            "net4": "5a:f9:f2:46:5c:81",
            "net5": "ae:33:fc:ed:33:84",
            "net6": "2a:d6:61:72:36:34",
            "net7": "26:d5:ac:c1:68:e8",
            "net8": "8e:43:7f:2a:a6:ef"
        },
        "leaf_2_0_6": {
            "net0": "7e:e5:02:04:08:17",
            "net1": "92:cb:0b:6f:16:85",
            "net2": "c2:d7:7a:85:79:d5",
            "net3": "56:46:74:ca:32:78",
            "net4": "36:53:d0:ae:01:39",
            "net5": "6a:b9:75:22:2d:66",
            "net6": "4e:b5:7c:ba:db:8b",
            "net7": "82:8a:40:08:54:b6",
            "net8": "52:4b:24:3f:1e:bb"
        },
        "leaf_2_0_7": {
            "net0": "1e:67:a2:c2:e3:2d",
            "net1": "d6:b0:39:a1:48:ae",
            "net2": "7a:03:77:32:a6:49",
            "net3": "6a:1e:b9:cd:3e:6f",
            "net4": "c2:bc:43:4f:91:2d",
            "net5": "de:1b:40:81:7e:b5",
            "net6": "ea:fb:78:5f:89:b9",
            "net7": "66:70:61:16:64:10",
            "net8": "e2:f4:ea:ab:24:23"
        },
        "leaf_2_0_8": {
            "net0": "8a:79:fb:8e:57:1c",
            "net1": "46:e2:37:aa:03:ad",
            "net2": "26:dd:cf:8f:7f:07",
            "net3": "56:4a:8f:42:52:92",
            "net4": "16:fb:8b:ec:4a:05",
            "net5": "4a:ef:f5:0f:10:9c",
            "net6": "66:2c:dc:71:35:bd",
            "net7": "be:f5:77:0b:f9:e2",
            "net8": "0e:67:f5:24:49:c2"
        },
        "leaf_3_0_1": {
            "net0": "ca:23:9b:3e:f4:9d",
            "net1": "42:8a:77:46:ae:72",
            "net2": "86:7f:97:5d:7b:30",
            "net3": "2e:89:d1:5b:df:8a",
            "net4": "56:58:e8:d9:6c:83",
            "net5": "8e:8f:7c:6b:11:d8",
            "net6": "26:98:57:77:6d:05",
            "net7": "b2:e8:5c:74:1e:e5",
            "net8": "62:45:31:12:02:a5"
        },
        "leaf_3_0_2": {
            "net0": "0e:e9:ec:e9:96:35",
            "net1": "c2:2f:0b:eb:4d:df",
            "net2": "c6:cf:79:d2:db:e6",
            "net3": "0a:85:24:7d:d5:93",
            "net4": "72:73:46:1c:2f:68",
            "net5": "d6:21:d2:76:c6:a3",
            "net6": "be:22:10:fd:d1:7d",
            "net7": "d2:b0:f9:a1:e3:13",
            "net8": "62:fa:0f:8b:c8:53"
        },
        "leaf_3_0_3": {
            "net0": "fa:68:9f:78:8a:27",
            "net1": "66:8a:f6:77:6b:8b",
            "net2": "36:52:c0:fc:ec:f7",
            "net3": "3e:13:92:c4:65:25",
            "net4": "a6:d9:96:19:4b:7a",
            "net5": "e2:26:18:47:83:55",
            "net6": "2a:01:fc:de:a4:9e",
            "net7": "b2:2a:7e:a7:a1:3e",
            "net8": "c6:2f:90:24:cc:11"
        },
        "leaf_3_0_4": {
            "net0": "52:ec:cd:03:7e:7f",
            "net1": "ce:51:fa:d5:8b:fe",
            "net2": "ba:e7:39:04:26:fd",
            "net3": "52:05:9c:b4:0e:e1",
            "net4": "de:5d:cd:35:3e:0a",
            "net5": "ca:ba:2f:2b:b9:59",
            "net6": "ae:3e:71:3a:f7:0b",
            "net7": "9a:af:a0:38:b9:cc",
            "net8": "06:0d:00:d0:b2:48"
        },
        "leaf_3_0_5": {
            "net0": "56:91:22:c5:f5:48",
            "net1": "62:91:49:17:24:05",
            "net2": "42:8c:c2:d2:3b:0c",
            "net3": "ea:64:10:fb:e5:1a",
            "net4": "ca:8d:05:ef:50:4b",
            "net5": "c2:0d:87:9f:db:58",
            "net6": "3a:fb:15:33:7a:8e",
            "net7": "ce:aa:19:aa:d1:29",
            "net8": "1a:a3:0a:bc:63:3f"
        },
        "leaf_3_0_6": {
            "net0": "42:3d:88:e0:ca:6c",
            "net1": "2a:fa:04:f9:41:e8",
            "net2": "5e:c9:ce:a6:7f:bd",
            "net3": "fa:cf:0a:af:3b:22",
            "net4": "e6:3b:4c:52:e1:53",
            "net5": "16:4d:58:e1:89:97",
            "net6": "da:46:b5:e2:c4:a9",
            "net7": "42:13:05:7c:39:59",
            "net8": "5a:2e:77:a6:13:8e"
        },
        "leaf_3_0_7": {
            "net0": "02:0c:ba:32:72:d8",
            "net1": "06:79:9b:ed:60:15",
            "net2": "82:1e:b7:0c:36:3a",
            "net3": "0e:32:63:e1:5b:59",
            "net4": "9e:03:35:1e:68:a2",
            "net5": "ea:ad:af:92:5e:8d",
            "net6": "72:d1:a8:c4:7c:aa",
            "net7": "02:e4:ad:f5:c4:cc",
            "net8": "46:5d:49:d8:51:00"
        },
        "leaf_3_0_8": {
            "net0": "8a:d0:4e:15:72:71",
            "net1": "7e:e8:3d:64:6c:73",
            "net2": "4a:b1:e4:bb:44:4a",
            "net3": "c2:a8:0d:19:46:a5",
            "net4": "0a:2a:ef:aa:6a:38",
            "net5": "6a:5e:3f:09:06:cc",
            "net6": "06:72:a7:13:84:e1",
            "net7": "82:ba:cc:19:b1:f9",
            "net8": "32:fb:b4:97:70:9c"
        },
        "leaf_4_0_1": {
            "net0": "9a:d8:75:5e:01:7f",
            "net1": "9a:6a:32:b5:77:49",
            "net2": "86:a8:63:6b:3f:ea",
            "net3": "92:74:4e:bf:a1:d9",
            "net4": "0a:8e:34:b0:3e:36",
            "net5": "f2:c4:a9:e8:b5:f3",
            "net6": "aa:a5:93:23:ac:de",
            "net7": "f2:fb:7b:5c:a5:65",
            "net8": "ea:86:71:71:2d:a7"
        },
        "leaf_4_0_2": {
            "net0": "82:b7:ab:ff:2d:0c",
            "net1": "e2:ca:74:e6:d1:29",
            "net2": "52:e7:4f:e9:0b:87",
            "net3": "82:d4:df:c6:26:e4",
            "net4": "46:a1:0e:4f:71:d0",
            "net5": "6a:25:59:ff:79:f7",
            "net6": "8a:1b:90:49:82:05",
            "net7": "fe:91:54:a0:aa:4a",
            "net8": "0e:00:ea:a7:81:a8"
        },
        "leaf_4_0_3": {
            "net0": "da:20:0e:84:29:c3",
            "net1": "ae:ba:5c:1c:02:78",
            "net2": "32:42:ac:62:ef:a4",
            "net3": "66:e9:9f:54:15:37",
            "net4": "a6:b8:b3:47:70:ec",
            "net5": "fe:b5:3c:9e:95:84",
            "net6": "0e:20:29:e3:fb:5f",
            "net7": "3e:36:50:b4:41:1f",
            "net8": "36:f5:e7:4a:77:8d"
        },
        "leaf_4_0_4": {
            "net0": "ce:8c:74:4b:4c:d5",
            "net1": "e6:d5:f6:44:da:4d",
            "net2": "56:3b:69:3d:3b:de",
            "net3": "da:86:b0:b0:f2:d5",
            "net4": "06:44:f1:c1:fb:d0",
            "net5": "be:6f:34:34:0b:80",
            "net6": "ee:86:df:84:ec:9f",
            "net7": "5e:8f:9c:91:c6:0f",
            "net8": "8e:5f:2a:1b:61:22"
        },
        "leaf_4_0_5": {
            "net0": "42:2b:7b:78:9b:e1",
            "net1": "ce:ee:e2:94:80:d2",
            "net2": "8e:16:0e:7a:ec:40",
            "net3": "aa:40:6b:31:8a:1a",
            "net4": "46:77:39:33:e1:0b",
            "net5": "a6:8f:8d:cf:ba:31",
            "net6": "9a:31:90:9e:14:b5",
            "net7": "86:f2:9b:ca:71:af",
            "net8": "16:bb:99:f1:f0:a3"
        },
        "leaf_4_0_6": {
            "net0": "ee:ee:68:53:87:f3",
            "net1": "b2:a7:5a:99:5b:b0",
            "net2": "ee:79:5e:0e:3e:b7",
            "net3": "06:ce:0f:cc:98:0f",
            "net4": "52:df:6e:e2:8f:48",
            "net5": "6a:fb:64:d8:47:19",
            "net6": "b2:51:7a:22:11:f7",
            "net7": "e2:fe:5e:c4:48:8f",
            "net8": "7a:cc:5f:b6:55:91"
        },
        "leaf_4_0_7": {
            "net0": "2a:2b:d0:79:09:6d",
            "net1": "7a:b9:89:48:38:39",
            "net2": "5a:ac:d3:40:ed:25",
            "net3": "8e:06:0b:8f:09:a7",
            "net4": "9e:4b:ce:e5:f8:63",
            "net5": "a6:57:da:93:5b:5f",
            "net6": "f2:37:bf:b0:0f:8a",
            "net7": "9a:1f:af:46:b8:a8",
            "net8": "aa:3a:51:a7:10:53"
        },
        "leaf_4_0_8": {
            "net0": "e2:e6:fb:af:72:de",
            "net1": "1a:8e:4a:cb:e9:86",
            "net2": "6e:1e:c1:f1:93:12",
            "net3": "aa:14:a3:35:30:ad",
            "net4": "36:da:73:55:73:96",
            "net5": "3e:d3:92:2b:e4:f6",
            "net6": "ce:7a:c1:84:0f:9c",
            "net7": "d6:ac:8e:8c:aa:78",
            "net8": "b2:be:f7:9f:1f:90"
        },
        "spine_1_1_1": {
            "net0": "06:6f:b8:a6:91:e2",
            "net1": "ce:7a:dc:5c:7a:66",
            "net10": "4a:8c:9d:27:0b:e8",
            "net11": "fe:ce:64:60:70:88",
            "net12": "de:d7:f1:bb:fd:20",
            "net13": "46:e7:32:d5:66:82",
            "net14": "ae:f8:54:29:1d:ae",
            "net15": "12:2a:37:60:b8:ed",
            "net2": "be:f4:4e:c9:af:79",
            "net3": "7a:47:63:e9:08:a5",
            "net4": "52:ac:33:27:21:b2",
            "net5": "6a:ff:25:0c:80:14",
            "net6": "1a:51:77:d2:c0:7c",
            "net7": "c6:c2:a0:ea:27:72",
            "net8": "6a:63:27:23:17:b9",
            "net9": "9a:64:4b:21:ba:1c"
        },
        "spine_1_1_2": {
            "net0": "d2:6f:a0:72:6d:3f",
            "net1": "d6:66:87:1f:ed:e0",
            "net10": "5e:1a:8a:70:72:ae",
            "net11": "36:7b:d8:ea:e3:46",
            "net12": "4e:a7:27:e9:c3:29",
            "net13": "be:05:cc:f6:6f:35",
            "net14": "36:8b:ea:a8:26:eb",
            "net15": "02:3d:a8:53:e1:d7",
            "net2": "fe:75:8a:27:ad:12",
            "net3": "6a:69:19:b9:97:8e",
            "net4": "62:db:98:04:b7:bd",
            "net5": "6a:70:cb:a1:c2:0d",
            "net6": "c6:50:73:88:e5:fc",
            "net7": "9e:54:36:e3:26:3f",
            "net8": "fe:b0:7e:a8:f4:2a",
            "net9": "a6:3a:30:cf:b2:a8"
        },
        "spine_1_1_3": {
            "net0": "4a:9f:bd:69:2d:9d",
            "net1": "42:cd:df:12:39:e7",
            "net10": "ae:fb:ae:ee:d7:2b",
            "net11": "be:c8:bc:eb:fa:96",
            "net12": "66:5d:a8:5c:9e:41",
            "net13": "62:8f:2d:48:d3:d2",
            "net14": "2e:c6:6e:06:b1:74",
            "net15": "1e:25:5d:44:a6:83",
            "net2": "a2:75:88:b2:75:09",
            "net3": "7a:3c:7a:3b:e8:db",
            "net4": "0e:55:58:ca:69:79",
            "net5": "e6:d6:84:8a:fb:a7",
            "net6": "9a:8d:bb:b6:c6:27",
            "net7": "d6:da:9b:15:2e:c2",
            "net8": "e6:25:e5:a5:fe:4e",
            "net9": "86:da:2a:c5:bd:0d"
        },
        "spine_1_1_4": {
            "net0": "aa:f7:60:be:12:7d",
            "net1": "d2:de:aa:d5:81:65",
            "net10": "46:a6:1d:a4:a5:f4",
            "net11": "86:c4:a9:8e:1b:ed",
            "net12": "9e:1c:7d:0b:bc:42",
            "net13": "fa:45:8f:ae:3d:74",
            "net14": "b2:59:86:56:31:1e",
            "net15": "2a:fb:93:f8:04:8e",
            "net2": "0e:65:7c:55:bc:b7",
            "net3": "5e:ab:cd:d3:6a:d9",
            "net4": "f6:9a:d6:0b:a5:11",
            "net5": "56:21:46:cb:69:b5",
            "net6": "26:2a:1c:29:b6:c9",
            "net7": "42:35:45:b0:85:98",
            "net8": "7e:db:b9:ed:ee:c2",
            "net9": "d2:6f:0e:72:ac:15"
        },
        "spine_1_1_5": {
            "net0": "f6:e1:4f:4e:1f:b1",
            "net1": "fa:90:26:b5:b8:15",
            "net10": "26:de:d8:b6:67:28",
            "net11": "2e:37:40:bf:6e:f1",
            "net12": "62:c1:c1:48:9f:68",
            "net13": "c6:01:19:cd:9c:bb",
            "net14": "72:90:90:df:97:4a",
            "net15": "ee:7b:78:5c:fa:c2",
            "net2": "56:30:c3:8a:43:36",
            "net3": "56:f8:8a:95:e0:28",
            "net4": "2a:8c:db:e1:3d:32",
            "net5": "8e:f7:3d:a9:4a:63",
            "net6": "42:0a:cc:7a:aa:65",
            "net7": "56:92:6f:6a:b7:92",
            "net8": "0a:d3:4b:20:77:28",
            "net9": "ce:b0:14:4b:79:c8"
        },
        "spine_1_1_6": {
            "net0": "52:d6:a3:cf:73:eb",
            "net1": "de:a8:a9:3e:38:b9",
            "net10": "0e:53:f4:02:3a:72",
            "net11": "a2:15:47:4d:51:5b",
            "net12": "a2:4a:ce:54:7f:a1",
            "net13": "6e:18:ab:68:9a:0b",
            "net14": "ca:dc:a8:72:73:f4",
            "net15": "0a:c8:80:ff:49:73",
            "net2": "fa:33:b7:be:56:0c",
            "net3": "0a:05:07:90:0d:97",
            "net4": "26:dc:b2:7b:54:fc",
            "net5": "42:ef:c9:5a:93:ea",
            "net6": "f6:79:05:39:da:74",
            "net7": "a2:40:6e:35:f9:1c",
            "net8": "92:b8:80:2d:9d:7c",
            "net9": "ca:d3:5f:53:a7:9c"
        },
        "spine_1_1_7": {
            "net0": "52:35:82:d2:ae:ed",
            "net1": "f6:a4:27:3f:83:8f",
            "net10": "1a:15:4d:a5:94:58",
            "net11": "c2:7c:f8:e6:d0:70",
            "net12": "66:34:8e:8a:e1:3a",
            "net13": "e2:e0:b1:29:7c:d4",
            "net14": "ba:b9:cc:9c:79:86",
            "net15": "3a:a5:89:14:09:05",
            "net2": "e2:96:04:f1:a9:10",
            "net3": "c2:2a:2b:2f:aa:9a",
            "net4": "7a:af:18:04:1d:07",
            "net5": "fa:2a:1c:36:e1:68",
            "net6": "3e:99:4f:75:18:7e",
            "net7": "16:11:db:6e:95:fe",
            "net8": "c6:4f:c9:e1:ad:98",
            "net9": "72:0a:3b:5e:69:51"
        },
        "spine_1_1_8": {
            "net0": "aa:03:72:22:cb:e6",
            "net1": "22:e2:13:41:1a:0d",
            "net10": "f2:a8:29:5b:74:9a",
            "net11": "e2:bc:58:90:1d:ca",
            "net12": "ba:ee:52:a2:3b:38",
            "net13": "52:49:7f:45:81:1b",
            "net14": "0a:40:2f:92:a0:0a",
            "net15": "a2:aa:0e:29:c0:c5",
            "net2": "52:3b:61:58:15:20",
            "net3": "be:4b:3a:84:b1:61",
            "net4": "7a:56:74:cc:ad:81",
            "net5": "1a:1f:e8:71:e4:f5",
            "net6": "9e:81:22:e1:32:3e",
            "net7": "5e:10:0a:cb:dd:29",
            "net8": "f2:a6:a3:cc:51:10",
            "net9": "9a:34:2b:af:a3:ab"
        },
        "spine_2_1_1": {
            "net0": "b2:33:eb:e6:6d:21",
            "net1": "d6:bd:fb:dc:5c:16",
            "net10": "4a:17:7b:87:f4:47",
            "net11": "f6:83:94:3d:e5:fc",
            "net12": "62:34:86:50:a1:34",
            "net13": "9a:e4:aa:14:b4:17",
            "net14": "a2:42:6f:36:97:bf",
            "net15": "c2:85:fa:2e:5b:e9",
            "net2": "1e:29:71:57:a4:5e",
            "net3": "16:71:4c:8e:67:e0",
            "net4": "5a:6e:f3:75:32:18",
            "net5": "c2:e0:0f:a7:8e:01",
            "net6": "b6:2e:65:f6:ba:43",
            "net7": "e2:81:6c:53:db:35",
            "net8": "42:2d:5a:9a:fb:33",
            "net9": "da:15:05:23:dc:2e"
        },
        "spine_2_1_2": {
            "net0": "9a:d1:c1:ed:04:23",
            "net1": "62:ef:16:66:c8:aa",
            "net10": "92:39:8d:80:2b:3a",
            "net11": "b6:a2:4d:21:b3:3b",
            "net12": "aa:80:93:72:d8:c7",
            "net13": "72:b8:04:6c:44:37",
            "net14": "32:23:8a:bf:1c:c8",
            "net15": "f6:e1:df:5e:4f:05",
            "net2": "6e:cc:65:17:9b:32",
            "net3": "26:fc:80:9c:36:48",
            "net4": "ba:49:7a:42:fb:90",
            "net5": "ba:70:18:71:01:0f",
            "net6": "2a:90:9a:5d:25:26",
            "net7": "32:6c:e0:c5:af:7e",
            "net8": "8a:7b:96:2b:7b:d8",
            "net9": "16:59:9e:8e:05:03"
        },
        "spine_2_1_3": {
            "net0": "6a:bf:86:41:b8:9f",
            "net1": "6a:b5:5a:9a:f1:30",
            "net10": "7a:10:5a:8d:8e:9c",
            "net11": "5a:19:67:38:0c:25",
            "net12": "52:a8:0a:4f:6e:90",
            "net13": "7a:5e:61:92:f7:29",
            "net14": "2e:71:8d:2b:46:b9",
            "net15": "42:84:ea:63:70:16",
            "net2": "d2:a5:f9:a4:1a:a8",
            "net3": "fa:b3:4b:fc:72:76",
            "net4": "06:e1:28:cc:bc:a9",
            "net5": "ee:91:36:91:a8:36",
            "net6": "f6:32:e3:6a:6b:f2",
            "net7": "8a:02:1f:c4:6c:fc",
            "net8": "1a:7b:fe:2c:60:39",
            "net9": "06:20:be:03:c4:fd"
        },
        "spine_2_1_4": {
            "net0": "fe:1c:69:a0:71:2b",
            "net1": "e2:42:2e:65:9d:36",
            "net10": "1a:0d:c9:1c:b7:25",
            "net11": "82:6c:34:a0:1f:23",
            "net12": "c2:35:7a:f5:50:a5",
            "net13": "fe:5b:09:b3:6d:bb",
            "net14": "ba:3d:24:02:a5:58",
            "net15": "9e:a8:7d:d9:65:c1",
            "net2": "4a:b8:81:f8:87:06",
            "net3": "de:cd:a7:f3:21:61",
            "net4": "6e:9a:65:24:97:dd",
            "net5": "d2:54:5c:32:08:5e",
            "net6": "da:dd:c7:24:69:6c",
            "net7": "ae:6f:b5:a0:9a:23",
            "net8": "d6:5e:06:9a:d6:b5",
            "net9": "36:79:03:55:fe:67"
        },
        "spine_2_1_5": {
            "net0": "6e:d7:e5:ab:e6:52",
            "net1": "9a:b0:75:1c:59:a2",
            "net10": "82:73:10:f6:56:ad",
            "net11": "2a:71:9c:72:f6:03",
            "net12": "2e:92:26:3e:2d:6a",
            "net13": "ae:96:8c:20:ce:14",
            "net14": "1e:4c:c9:5f:2a:c4",
            "net15": "1e:3a:54:f2:f5:f1",
            "net2": "16:f0:99:c8:b3:e8",
            "net3": "5e:c3:be:49:be:2a",
            "net4": "96:7e:03:7f:af:34",
            "net5": "d6:9b:79:bb:09:7d",
            "net6": "7a:0e:66:18:20:64",
            "net7": "3a:a3:aa:d1:64:e1",
            "net8": "9e:93:41:23:49:da",
            "net9": "2e:b7:01:0b:51:9d"
        },
        "spine_2_1_6": {
            "net0": "66:8e:8c:3c:91:37",
            "net1": "ae:1f:3f:cf:2e:23",
            "net10": "e2:ce:f3:0f:e4:64",
            "net11": "2a:76:10:10:c8:9c",
            "net12": "b6:fd:b8:4f:a4:03",
            "net13": "1a:d3:ba:5f:fc:19",
            "net14": "ae:2f:00:7d:55:55",
            "net15": "1e:63:73:7e:d5:a1",
            "net2": "32:e3:c6:9e:32:f1",
            "net3": "ea:94:05:aa:fa:40",
            "net4": "5e:13:83:bd:01:5f",
            "net5": "6a:72:65:43:c2:f2",
            "net6": "32:7d:f2:c9:44:a0",
            "net7": "ea:ec:1c:9f:3f:84",
            "net8": "9a:c0:b0:75:2f:32",
            "net9": "62:3d:eb:6b:95:b1"
        },
        "spine_2_1_7": {
            "net0": "c6:ae:8e:a9:58:71",
            "net1": "42:14:5e:28:a4:d2",
            "net10": "8e:a3:09:8e:fb:54",
            "net11": "3e:65:ff:2e:cc:17",
            "net12": "a2:a8:95:ec:cc:14",
            "net13": "96:6e:41:00:bf:ab",
            "net14": "66:cc:45:b3:5f:49",
            "net15": "de:5e:ec:32:7c:f7",
            "net2": "16:93:5b:17:c4:06",
            "net3": "92:de:39:b2:d8:2e",
            "net4": "82:95:73:3d:a9:35",
            "net5": "be:a0:83:1d:f8:18",
            "net6": "0a:5d:74:c8:62:6d",
            "net7": "b6:0d:e1:f9:83:6e",
            "net8": "e2:ef:e1:f9:87:97",
            "net9": "4e:6b:9f:c9:7d:66"
        },
        "spine_2_1_8": {
            "net0": "7e:2a:2c:49:f6:bf",
            "net1": "fa:70:f0:07:b0:4d",
            "net10": "4a:4b:2b:e7:51:92",
            "net11": "42:cc:03:e7:41:40",
            "net12": "f2:2e:ce:07:32:2c",
            "net13": "96:52:05:5b:45:50",
            "net14": "e2:f0:dd:5c:26:4c",
            "net15": "4a:bf:4c:e0:d6:98",
            "net2": "f6:46:e5:a4:02:f2",
            "net3": "8a:37:3f:70:c5:95",
            "net4": "ee:30:02:db:46:5a",
            "net5": "62:0c:7f:aa:59:dd",
            "net6": "0a:87:f4:45:b3:0d",
            "net7": "ae:be:60:00:49:77",
            "net8": "3a:21:ea:e2:09:64",
            "net9": "fe:d3:77:44:cc:06"
        },
        "spine_3_1_1": {
            "net0": "5a:99:f0:96:aa:24",
            "net1": "c6:a1:c4:69:ea:41",
            "net10": "66:30:ea:f6:a3:e7",
            "net11": "a6:3f:5f:6c:6f:d9",
            "net12": "2e:04:61:8a:fb:0f",
            "net13": "9a:1e:9a:50:08:cc",
            "net14": "02:1f:80:b9:8b:a0",
            "net15": "ea:90:fa:7a:b4:5f",
            "net2": "e6:5f:6a:30:b0:3c",
            "net3": "d6:bd:7e:fd:30:76",
            "net4": "ee:7b:01:ed:da:cf",
            "net5": "56:03:7f:4f:7e:f6",
            "net6": "ae:7b:d9:e0:88:6f",
            "net7": "5a:70:8c:ea:7e:a6",
            "net8": "9e:2a:4b:45:29:5d",
            "net9": "f6:ef:99:d4:e2:5e"
        },
        "spine_3_1_2": {
            "net0": "ee:f4:41:f4:35:15",
            "net1": "72:5e:53:32:05:7e",
            "net10": "e2:05:54:13:81:cc",
            "net11": "b2:69:6c:d0:da:62",
            "net12": "0e:9f:57:7d:d0:81",
            "net13": "ce:37:dc:e8:02:c1",
            "net14": "ba:95:cb:b0:85:1c",
            "net15": "12:bf:03:15:da:61",
            "net2": "3a:25:00:f7:31:9c",
            "net3": "f2:9b:c4:35:7f:75",
            "net4": "92:a3:27:f3:43:50",
            "net5": "42:55:8c:83:56:a0",
            "net6": "1a:a6:96:16:95:4f",
            "net7": "8e:ae:1b:56:1b:8c",
            "net8": "36:8d:d0:06:f0:62",
            "net9": "16:30:e0:7c:00:f7"
        },
        "spine_3_1_3": {
            "net0": "4a:37:f3:5b:e2:c7",
            "net1": "4a:7b:ae:2b:0c:a2",
            "net10": "96:a1:89:20:91:cd",
            "net11": "4e:bf:39:94:e6:fb",
            "net12": "d2:58:b9:c0:f6:d1",
            "net13": "da:ab:7c:f4:32:4e",
            "net14": "aa:f7:57:dc:01:16",
            "net15": "72:0e:5e:e9:c1:91",
            "net2": "2e:15:88:9d:e3:6b",
            "net3": "8e:2b:21:83:ef:8d",
            "net4": "b2:0b:13:5a:eb:05",
            "net5": "f6:79:7e:77:e2:25",
            "net6": "22:95:13:39:41:97",
            "net7": "52:d2:aa:31:75:9f",
            "net8": "8a:13:29:65:37:20",
            "net9": "96:a9:cb:20:7c:a5"
        },
        "spine_3_1_4": {
            "net0": "6a:31:41:6d:c2:a5",
            "net1": "66:d0:1c:64:42:c0",
            "net10": "ae:77:1b:23:b3:e1",
            "net11": "be:a1:50:fc:02:86",
            "net12": "b2:8a:31:bb:35:c0",
            "net13": "26:5b:d5:40:0e:8a",
            "net14": "5a:72:38:88:0f:61",
            "net15": "8a:11:0a:21:71:f2",
            "net2": "ca:d2:76:5d:f0:6c",
            "net3": "86:73:75:0e:e6:5e",
            "net4": "f6:4b:32:8a:76:12",
            "net5": "ea:12:ae:88:55:df",
            "net6": "c2:2d:43:3c:bb:4b",
            "net7": "4e:2a:f5:53:96:2a",
            "net8": "9a:21:f3:09:a5:a3",
            "net9": "3e:1f:98:20:91:57"
        },
        "spine_3_1_5": {
            "net0": "fe:02:4f:28:48:11",
            "net1": "9a:81:9c:54:2f:22",
            "net10": "fa:95:3a:a1:65:3a",
            "net11": "ee:8c:44:85:25:92",
            "net12": "86:e0:77:20:98:53",
            "net13": "9a:e0:ce:e1:4c:3d",
            "net14": "42:d0:fd:99:36:2b",
            "net15": "62:01:4d:db:24:28",
            "net2": "1e:3d:ec:97:5b:7f",
            "net3": "4e:b7:ec:a9:1b:82",
            "net4": "8a:55:74:62:e5:be",
            "net5": "2e:00:f4:85:ae:06",
            "net6": "6e:fb:ec:a6:6d:ac",
            "net7": "9e:74:56:b3:d8:59",
            "net8": "be:fa:e9:92:1f:18",
            "net9": "0e:31:f0:b0:69:4e"
        },
        "spine_3_1_6": {
            "net0": "2e:56:62:2b:c2:f2",
            "net1": "7e:92:a8:63:ad:5f",
            "net10": "a6:a1:85:17:bf:80",
            "net11": "ce:cc:e0:bd:ec:2b",
            "net12": "1e:f9:70:5f:3d:9c",
            "net13": "56:97:cf:78:be:d8",
            "net14": "82:7c:3d:f6:78:53",
            "net15": "02:12:48:88:a1:38",
            "net2": "ee:17:2a:3e:d2:d1",
            "net3": "d6:b4:80:4b:a7:55",
            "net4": "36:e7:77:4d:b3:eb",
            "net5": "16:f9:b6:d5:d4:ac",
            "net6": "0a:27:40:5a:36:b4",
            "net7": "1a:fc:b8:f3:fd:e5",
            "net8": "22:81:72:4a:71:4a",
            "net9": "7a:84:52:6c:3c:50"
        },
        "spine_3_1_7": {
            "net0": "42:f4:f2:c4:c3:45",
            "net1": "56:e6:f6:62:5c:23",
            "net10": "7a:ff:88:ae:41:b4",
            "net11": "26:33:b8:7e:06:77",
            "net12": "12:40:cf:13:13:dd",
            "net13": "6a:ff:99:3d:97:d3",
            "net14": "ea:2c:d5:c3:e9:4b",
            "net15": "06:2d:9b:73:de:a7",
            "net2": "da:ea:46:f9:78:07",
            "net3": "de:5d:87:9c:32:5c",
            "net4": "42:c7:f4:5b:d5:32",
            "net5": "7a:7d:0b:6d:61:b9",
            "net6": "c6:a8:6e:3b:80:66",
            "net7": "06:77:19:27:56:9e",
            "net8": "72:a7:ed:e9:0a:ef",
            "net9": "ea:07:bf:77:e6:1a"
        },
        "spine_3_1_8": {
            "net0": "32:bd:44:03:a5:94",
            "net1": "82:b7:e3:1a:59:57",
            "net10": "ee:89:45:d2:bc:d4",
            "net11": "7a:0a:91:16:86:29",
            "net12": "f2:9e:21:9b:41:98",
            "net13": "52:b6:bd:c6:12:7e",
            "net14": "16:98:4e:15:d7:88",
            "net15": "66:21:aa:e3:65:4c",
            "net2": "fe:ac:f2:b1:67:53",
            "net3": "52:87:32:48:06:17",
            "net4": "8e:30:0f:6b:1a:77",
            "net5": "9a:11:a3:75:79:7a",
            "net6": "4a:d5:84:ed:33:c2",
            "net7": "0a:68:fb:fd:c2:7a",
            "net8": "ee:fe:7a:e0:f1:7d",
            "net9": "c2:8a:cb:a1:13:d2"
        },
        "spine_4_1_1": {
            "net0": "ba:17:42:7d:cb:36",
            "net1": "aa:19:c7:61:69:d3",
            "net10": "16:f3:f2:5e:75:8e",
            "net11": "4e:a6:c7:94:41:39",
            "net12": "ee:62:eb:9c:f0:7b",
            "net13": "e6:a9:d7:e9:ca:4e",
            "net14": "5a:0f:b3:e9:50:f2",
            "net15": "46:49:c9:00:68:96",
            "net2": "c6:9d:cc:fc:d0:aa",
            "net3": "56:18:0b:32:42:50",
            "net4": "1a:b9:d2:3b:d0:b8",
            "net5": "3a:38:ef:27:08:32",
            "net6": "3e:b9:16:fe:4c:17",
            "net7": "22:96:ab:a0:3a:6c",
            "net8": "e6:05:1a:95:1b:ce",
            "net9": "e2:5d:1c:26:89:e7"
        },
        "spine_4_1_2": {
            "net0": "aa:9d:e5:b3:c9:e1",
            "net1": "0a:95:f2:f2:91:65",
            "net10": "2e:d8:b7:29:a7:78",
            "net11": "f2:fc:a5:77:89:52",
            "net12": "b6:d6:df:82:4a:f3",
            "net13": "9a:0e:26:33:da:7c",
            "net14": "5a:f3:7c:c1:22:40",
            "net15": "d2:97:6b:2d:a4:3e",
            "net2": "b6:63:c8:3b:05:6e",
            "net3": "ce:f4:39:57:c7:72",
            "net4": "ca:f8:fe:fa:78:23",
            "net5": "e6:f4:3e:17:be:e4",
            "net6": "3e:4b:72:c4:17:4c",
            "net7": "5a:b9:cc:df:24:8a",
            "net8": "f2:f4:27:56:08:06",
            "net9": "42:98:9f:3b:84:c5"
        },
        "spine_4_1_3": {
            "net0": "8e:f9:5d:63:6d:ff",
            "net1": "12:99:22:5c:9d:48",
            "net10": "ae:97:1d:5a:6f:8f",
            "net11": "be:e0:9b:7a:5a:65",
            "net12": "72:14:5e:2e:ef:23",
            "net13": "72:81:d4:53:ff:35",
            "net14": "ce:f6:87:d7:3d:30",
            "net15": "32:73:f7:7b:cd:70",
            "net2": "9e:f5:96:51:8f:ef",
            "net3": "6a:48:6c:02:80:1c",
            "net4": "fe:76:85:7b:72:6e",
            "net5": "da:bd:e1:7a:28:f3",
            "net6": "be:f8:3e:ab:4f:b1",
            "net7": "ae:25:94:93:5c:a4",
            "net8": "e2:3e:f3:54:d9:61",
            "net9": "ee:19:a9:b6:ba:51"
        },
        "spine_4_1_4": {
            "net0": "d2:72:f8:ad:97:a4",
            "net1": "02:92:17:8c:65:ac",
            "net10": "9a:68:f7:d1:60:01",
            "net11": "ce:93:61:6d:53:09",
            "net12": "86:48:f9:7f:7e:49",
            "net13": "66:42:6d:20:c2:7b",
            "net14": "a6:ac:d2:7e:4b:da",
            "net15": "82:92:77:ae:0d:60",
            "net2": "ee:8b:18:77:de:f2",
            "net3": "82:7b:90:b5:e2:ef",
            "net4": "66:97:6a:91:8e:27",
            "net5": "c2:d0:b6:d8:75:86",
            "net6": "aa:9b:54:b5:fa:4b",
            "net7": "56:3c:d3:21:c4:de",
            "net8": "5a:a7:e2:8d:f3:23",
            "net9": "7a:1d:13:31:56:63"
        },
        "spine_4_1_5": {
            "net0": "fe:ec:05:31:b5:3b",
            "net1": "86:a2:cb:60:2b:35",
            "net10": "9e:55:ef:14:2f:c3",
            "net11": "be:66:6f:99:8f:24",
            "net12": "5e:22:e5:7f:97:8e",
            "net13": "fa:87:e5:86:e9:7a",
            "net14": "5e:c2:b8:b3:da:62",
            "net15": "96:6a:71:eb:a2:d2",
            "net2": "96:3c:59:4e:c9:d9",
            "net3": "aa:bb:80:24:f7:33",
            "net4": "7a:af:df:20:98:a3",
            "net5": "5a:de:dc:3e:e9:c2",
            "net6": "ea:b6:f8:75:e9:43",
            "net7": "f6:5d:93:5e:ac:40",
            "net8": "02:2e:b2:d0:2a:e7",
            "net9": "96:55:e0:7a:db:f5"
        },
        "spine_4_1_6": {
            "net0": "16:4e:f0:a5:bf:35",
            "net1": "be:f5:43:e3:ae:49",
            "net10": "4a:83:fb:30:67:97",
            "net11": "f6:31:e8:db:4c:c8",
            "net12": "9e:92:de:c9:ed:3e",
            "net13": "26:01:49:fc:cd:ba",
            "net14": "ce:27:8f:48:02:a7",
            "net15": "62:40:d1:5f:8a:fe",
            "net2": "fe:02:7c:64:92:65",
            "net3": "8a:a4:ed:f0:b3:38",
            "net4": "1e:b4:e6:6e:97:c2",
            "net5": "ba:da:ec:42:ed:78",
            "net6": "42:bf:97:24:b2:92",
            "net7": "aa:0b:9d:78:c4:74",
            "net8": "7a:00:12:dd:54:41",
            "net9": "b6:12:b4:a2:cd:d1"
        },
        "spine_4_1_7": {
            "net0": "b2:1b:36:45:76:15",
            "net1": "2e:77:5c:61:44:9a",
            "net10": "62:ec:18:c7:aa:45",
            "net11": "9e:e3:5a:ef:b7:6d",
            "net12": "56:1d:f3:72:88:c0",
            "net13": "82:fb:6d:f2:e4:e0",
            "net14": "8e:22:5f:5d:a4:e3",
            "net15": "92:0c:9f:35:2e:17",
            "net2": "fe:10:dc:c0:26:29",
            "net3": "46:ee:bb:a3:0d:14",
            "net4": "6e:c8:38:ac:1b:2f",
            "net5": "b2:8a:c9:f4:3b:b8",
            "net6": "56:47:2d:d8:04:aa",
            "net7": "fa:b1:ff:80:4b:a9",
            "net8": "d2:4f:d7:ab:a1:df",
            "net9": "22:37:0b:8b:54:42"
        },
        "spine_4_1_8": {
            "net0": "fe:74:8d:86:ce:fa",
            "net1": "4e:06:ee:23:a5:24",
            "net10": "be:83:30:62:9a:bd",
            "net11": "f2:63:6c:83:1a:d7",
            "net12": "22:3a:83:0c:dc:29",
            "net13": "26:ff:88:f0:4c:13",
            "net14": "66:ac:d8:1b:39:5a",
            "net15": "b2:a1:46:63:cb:9a",
            "net2": "de:a1:64:a4:07:46",
            "net3": "1a:5f:33:e9:7f:64",
            "net4": "e6:2a:7d:d6:13:82",
            "net5": "52:4b:c5:e0:00:14",
            "net6": "9e:a8:ad:cd:a3:f0",
            "net7": "6e:de:b9:fc:ad:34",
            "net8": "8e:af:7b:2a:31:f2",
            "net9": "e2:f2:1a:12:b5:44"
        },
        "tof_1_2_1": {
            "net0": "56:f2:05:31:6d:40",
            "net1": "c2:70:2c:33:72:8e",
            "net10": "02:33:d8:72:33:f4",
            "net11": "9e:e5:40:ca:7f:6d",
            "net12": "0e:e2:64:44:f6:00",
            "net13": "aa:d5:81:c6:c0:05",
            "net14": "92:9a:4c:a3:99:41",
            "net15": "8e:df:18:e8:da:ae",
            "net2": "42:dc:ed:77:e1:e7",
            "net3": "3a:48:79:6b:31:53",
            "net4": "86:45:d5:39:bb:fa",
            "net5": "4a:6a:c0:7d:67:aa",
            "net6": "26:c7:6d:4a:a9:84",
            "net7": "0a:b5:a9:80:ee:3e",
            "net8": "3a:a3:c9:3c:a4:a9",
            "net9": "f2:96:cb:f4:22:6b"
        },
        "tof_1_2_2": {
            "net0": "02:90:d3:ea:53:a2",
            "net1": "12:5c:f5:82:ce:2c",
            "net10": "ea:b3:03:25:a4:ea",
            "net11": "26:24:3c:d8:50:f5",
            "net12": "12:86:ff:95:ed:37",
            "net13": "2e:7b:34:a5:99:49",
            "net14": "02:90:d0:23:22:4a",
            "net15": "72:3d:e0:f0:0a:e7",
            "net2": "d6:cf:61:d4:e7:e9",
            "net3": "72:fc:6a:fd:66:c1",
            "net4": "de:26:2d:56:e2:ea",
            "net5": "6a:12:b7:37:56:1e",
            "net6": "5e:59:7a:b9:69:e4",
            "net7": "b6:9a:28:f4:6c:3b",
            "net8": "06:87:f2:da:42:3c",
            "net9": "7a:37:05:ac:56:4e"
        },
        "tof_1_2_3": {
            "net0": "66:bf:21:46:c1:93",
            "net1": "6a:d3:1b:6e:6b:61",
            "net10": "b2:22:0f:48:bd:e2",
            "net11": "72:eb:b1:83:75:12",
            "net12": "9e:cb:9a:fd:23:a4",
            "net13": "b6:9f:d5:52:e9:68",
            "net14": "ea:17:da:49:ff:dd",
            "net15": "46:a3:00:3e:6a:21",
            "net2": "52:26:68:f4:da:06",
            "net3": "a6:8a:02:f8:10:89",
            "net4": "c2:25:3a:d9:15:c3",
            "net5": "d2:99:74:a5:d1:b6",
            "net6": "e2:97:52:af:47:95",
            "net7": "32:82:d5:1d:5a:ff",
            "net8": "92:13:34:49:01:49",
            "net9": "62:c3:0a:15:7f:87"
        },
        "tof_1_2_4": {
            "net0": "fe:8c:94:fa:12:50",
            "net1": "46:d5:a0:16:59:14",
            "net10": "a2:ec:05:c5:ad:9c",
            "net11": "0e:13:56:55:d7:23",
            "net12": "8a:9c:71:7d:f1:29",
            "net13": "22:af:a5:72:6c:70",
            "net14": "de:08:0b:1f:09:01",
            "net15": "4e:5c:27:ec:96:09",
            "net2": "36:fd:d5:fd:dd:53",
            "net3": "7a:4b:02:ab:18:53",
            "net4": "b6:73:2b:05:45:15",
            "net5": "d2:d4:73:2c:09:7a",
            "net6": "e2:0b:de:b6:b5:09",
            "net7": "da:9a:be:83:76:6e",
            "net8": "7a:39:c5:95:d9:09",
            "net9": "6a:ee:8e:07:23:b0"
        },
        "tof_1_2_5": {
            "net0": "b2:06:87:aa:00:6e",
            "net1": "fa:1d:86:5c:25:38",
            "net10": "3e:fd:15:03:2e:ba",
            "net11": "ea:26:72:6c:dc:c7",
            "net12": "be:f8:a7:96:fc:13",
            "net13": "e6:95:42:f3:88:a3",
            "net14": "e6:92:dc:06:ea:86",
            "net15": "9e:59:58:3c:f1:c5",
            "net2": "16:19:d9:81:62:25",
            "net3": "6e:55:8e:63:df:d9",
            "net4": "aa:df:07:ae:c2:6c",
            "net5": "1e:cd:d5:99:76:ac",
            "net6": "5e:3e:5d:9b:41:33",
            "net7": "42:3f:63:8f:7f:a9",
            "net8": "5a:71:16:94:ea:ff",
            "net9": "3e:f9:ac:3a:97:4e"
        },
        "tof_1_2_6": {
            "net0": "56:67:da:05:52:98",
            "net1": "e2:fd:ec:f6:3c:2c",
            "net10": "f2:e3:0f:c0:08:79",
            "net11": "32:01:5a:cc:2b:3b",
            "net12": "92:ef:d8:43:ab:58",
            "net13": "de:3a:ae:bf:d8:83",
            "net14": "7a:88:c6:6d:dc:0b",
            "net15": "ee:d9:90:86:97:70",
            "net2": "e2:16:29:c5:e1:2f",
            "net3": "c2:9e:17:b3:a1:3f",
            "net4": "b2:e1:a5:99:20:62",
            "net5": "de:5a:b4:c2:73:21",
            "net6": "ba:24:dc:e7:77:8f",
            "net7": "02:e8:42:67:74:ab",
            "net8": "02:25:61:e6:52:6f",
            "net9": "f2:21:90:fc:d9:2f"
        },
        "tof_1_2_7": {
            "net0": "aa:b8:4d:71:d6:ea",
            "net1": "36:66:c0:de:8d:ab",
            "net10": "9a:31:51:c7:fb:a4",
            "net11": "c2:b2:ee:fd:96:c8",
            "net12": "be:2b:2d:14:ef:39",
            "net13": "1a:44:db:55:e6:ff",
            "net14": "52:b3:6b:30:6b:63",
            "net15": "fe:68:79:28:8a:8a",
            "net2": "f6:75:28:7f:9f:1b",
            "net3": "16:2c:b2:af:42:82",
            "net4": "b2:f0:a2:7c:4e:fd",
            "net5": "7a:78:ca:c4:c0:44",
            "net6": "de:b2:0a:03:1e:f1",
            "net7": "0a:6e:2b:fb:07:66",
            "net8": "3e:7a:23:51:93:40",
            "net9": "26:57:5f:61:76:c0"
        },
        "tof_1_2_8": {
            "net0": "ce:ee:dc:c3:fa:c9",
            "net1": "ba:78:dd:f7:d2:1e",
            "net10": "c6:74:8e:97:74:2a",
            "net11": "1a:19:36:f5:91:1a",
            "net12": "86:38:55:25:e0:83",
            "net13": "72:e3:c3:f6:f5:57",
            "net14": "4a:39:28:48:ad:c1",
            "net15": "d2:ea:04:31:0c:89",
            "net2": "0a:66:13:41:8f:da",
            "net3": "76:49:4f:0a:bc:51",
            "net4": "92:0d:d1:31:b1:28",
            "net5": "6a:8e:36:b9:08:aa",
            "net6": "e2:89:62:b2:80:c7",
            "net7": "56:b0:49:da:f5:9b",
            "net8": "82:6a:fc:7e:07:6c",
            "net9": "ae:d8:b6:f2:96:f4"
        },
        "tof_2_2_1": {
            "net0": "42:01:37:47:6f:d6",
            "net1": "6e:49:fb:57:c5:6e",
            "net10": "fa:5c:48:85:af:6a",
            "net11": "32:18:b0:bf:a4:dd",
            "net12": "6a:8b:7c:79:6a:8f",
            "net13": "62:27:7d:9b:4e:6f",
            "net14": "86:29:e8:92:56:b8",
            "net15": "b2:f3:20:0b:b8:cb",
            "net2": "02:d0:f8:28:6f:ed",
            "net3": "de:69:b7:27:1b:68",
            "net4": "e2:c2:c3:29:8a:2e",
            "net5": "e6:ab:a6:18:d7:c7",
            "net6": "7a:ee:57:84:c5:a6",
            "net7": "ae:09:dc:07:93:18",
            "net8": "fa:90:a1:a7:a6:37",
            "net9": "56:cd:fe:a2:73:4e"
        },
        "tof_2_2_2": {
            "net0": "d6:cc:d7:90:85:05",
            "net1": "8a:05:94:c5:80:be",
            "net10": "de:6c:d5:61:56:31",
            "net11": "56:59:01:81:7d:f3",
            "net12": "ae:60:9c:ca:10:ee",
            "net13": "6a:4f:8d:e7:3b:f2",
            "net14": "6a:86:80:21:89:a8",
            "net15": "9e:2e:fe:cd:c4:1b",
            "net2": "aa:f5:a8:b4:ad:2d",
            "net3": "a6:50:ad:f5:43:dd",
            "net4": "a6:14:d4:00:6c:ba",
            "net5": "fa:5d:1b:4e:e7:9f",
            "net6": "2a:dc:ef:da:66:ee",
            "net7": "42:b1:f3:33:1f:52",
            "net8": "92:8a:45:73:98:e1",
            "net9": "06:93:75:cf:90:29"
        },
        "tof_2_2_3": {
            "net0": "ea:0e:5e:be:78:95",
            "net1": "ca:de:d2:55:ca:62",
            "net10": "8e:9b:ca:87:ef:d0",
            "net11": "aa:50:00:d0:25:5f",
            "net12": "e2:8c:8f:f7:fb:af",
            "net13": "22:70:d8:b9:45:e0",
            "net14": "ea:14:4c:e5:33:f8",
            "net15": "06:b6:b2:88:01:1c",
            "net2": "8e:ac:7c:07:02:ad",
            "net3": "86:76:de:c9:b4:55",
            "net4": "8e:d3:f1:58:69:a5",
            "net5": "9e:f4:7e:88:90:95",
            "net6": "f2:91:32:5e:5b:2f",
            "net7": "6e:ef:e0:3d:16:af",
            "net8": "36:f0:1e:d5:34:2f",
            "net9": "12:07:38:e5:27:7f"
        },
        "tof_2_2_4": {
            "net0": "16:65:42:65:9f:2e",
            "net1": "c2:31:b1:e1:df:10",
            "net10": "ee:a3:db:e2:20:cd",
            "net11": "7a:21:e3:17:c8:73",
            "net12": "9e:a2:e0:38:c7:2e",
            "net13": "06:5f:57:b3:e1:19",
            "net14": "ca:c5:7e:df:48:59",
            "net15": "7a:49:ae:a2:94:f0",
            "net2": "2a:68:c2:fd:06:47",
            "net3": "86:76:c8:6a:29:c0",
            "net4": "fa:59:0d:65:41:09",
            "net5": "3e:d7:f5:f3:02:be",
            "net6": "56:de:bb:81:2f:88",
            "net7": "ea:94:50:94:49:0d",
            "net8": "3a:90:c4:f9:94:0a",
            "net9": "9e:0d:e5:69:59:a1"
        },
        "tof_2_2_5": {
            "net0": "f6:9b:63:5e:23:d5",
            "net1": "82:d0:4e:b9:9b:a3",
            "net10": "da:d6:64:0c:a2:45",
            "net11": "86:9c:a4:0d:92:8a",
            "net12": "be:50:4e:aa:c3:31",
            "net13": "12:41:25:0b:0e:cf",
            "net14": "62:f3:d8:9d:e1:41",
            "net15": "12:49:4f:07:cc:27",
            "net2": "3e:42:97:36:b7:c1",
            "net3": "1e:24:19:30:21:e9",
            "net4": "26:c4:c2:4e:83:d9",
            "net5": "ee:c8:7e:41:eb:6f",
            "net6": "ba:ef:5c:5a:c4:9d",
            "net7": "ce:7a:da:2a:cb:4f",
            "net8": "9a:ec:42:3e:06:2c",
            "net9": "3a:d7:57:d7:35:9b"
        },
        "tof_2_2_6": {
            "net0": "86:6e:32:53:08:5f",
            "net1": "92:05:00:00:a0:59",
            "net10": "f2:dd:ab:1f:38:b5",
            "net11": "b6:da:03:01:4e:67",
            "net12": "b2:f9:d2:b7:c2:62",
            "net13": "a2:65:28:bc:00:60",
            "net14": "e6:bc:05:8e:7c:74",
            "net15": "0a:21:8f:35:50:8a",
            "net2": "2a:1f:90:12:2a:73",
            "net3": "86:5c:b2:c9:05:3a",
            "net4": "6e:9c:47:ad:3a:b8",
            "net5": "ea:e0:96:a9:3d:60",
            "net6": "ea:8a:e4:bd:b2:b0",
            "net7": "f2:9d:76:05:4a:92",
            "net8": "36:a6:ee:86:18:d1",
            "net9": "4a:5e:ed:30:6d:c3"
        },
        "tof_2_2_7": {
            "net0": "d6:4f:fd:26:60:94",
            "net1": "ea:67:8a:2b:d5:77",
            "net10": "9a:6a:71:88:38:87",
            "net11": "a2:93:c9:f6:dd:47",
            "net12": "c2:f7:5f:05:4f:86",
            "net13": "5e:cf:41:3c:c6:9b",
            "net14": "e2:39:5c:c8:a3:c1",
            "net15": "a2:0c:51:3c:f4:73",
            "net2": "e2:9a:9b:88:54:ee",
            "net3": "fa:a4:6b:4a:e4:7c",
            "net4": "7e:56:a8:44:92:45",
            "net5": "22:a4:a0:83:70:af",
            "net6": "42:5a:ff:4d:49:68",
            "net7": "52:2d:d7:5e:d4:fe",
            "net8": "d6:4a:9a:12:7a:79",
            "net9": "0a:6d:99:65:3a:7e"
        },
        "tof_2_2_8": {
            "net0": "2a:b4:6e:de:64:b5",
            "net1": "6e:a4:23:d4:fd:40",
            "net10": "e2:1b:c0:99:0d:02",
            "net11": "2e:6d:18:a0:ef:b6",
            "net12": "fe:86:d1:75:7b:c1",
            "net13": "0e:40:49:93:5f:08",
            "net14": "32:d3:58:21:00:01",
            "net15": "32:61:0e:3e:f8:d2",
            "net2": "86:4c:50:e4:b1:2b",
            "net3": "26:47:f7:b8:cf:bd",
            "net4": "32:a4:80:dd:fb:95",
            "net5": "b2:64:67:cf:cb:f2",
            "net6": "2a:6c:55:bb:60:6a",
            "net7": "46:71:60:df:f9:ef",
            "net8": "2a:85:eb:14:7b:87",
            "net9": "62:91:37:54:91:4d"
        }
    },
    "failed_machine": "spine_1_1_1",
    "failed_interfaces": [
        "net8"
    ],
    "failure_time": {
        "leaf_1_0_1": 1635549808.1697524,
        "leaf_1_0_2": 1635549808.1815424,
        "leaf_1_0_3": 1635549808.191542,
        "leaf_1_0_4": 1635549808.7120583,
        "leaf_1_0_5": 1635549808.210963,
        "leaf_1_0_6": 1635549808.2190335,
        "leaf_1_0_7": 1635549808.2335262,
        "leaf_1_0_8": 1635549808.2569187,
        "leaf_2_0_1": 1635549808.2647192,
        "leaf_2_0_2": 1635549808.2744653,
        "leaf_2_0_3": 1635549808.1695254,
        "leaf_2_0_4": 1635549808.1753042,
        "leaf_2_0_5": 1635549808.1841183,
        "leaf_2_0_6": 1635549808.1938498,
        "leaf_2_0_7": 1635549808.203877,
        "leaf_2_0_8": 1635549808.7230797,
        "leaf_3_0_1": 1635549808.2247045,
        "leaf_3_0_2": 1635549808.2346153,
        "leaf_3_0_3": 1635549808.2470732,
        "leaf_3_0_4": 1635549808.2639897,
        "leaf_3_0_5": 1635549808.2709873,
        "leaf_3_0_6": 1635549808.2824376,
        "leaf_3_0_7": 1635549808.8060853,
        "leaf_3_0_8": 1635549808.3093913,
        "leaf_4_0_1": 1635549808.3183532,
        "leaf_4_0_2": 1635549808.3295245,
        "leaf_4_0_3": 1635549808.3439922,
        "leaf_4_0_4": 1635549808.3520718,
        "leaf_4_0_5": 1635549808.3651092,
        "leaf_4_0_6": 1635549808.3718321,
        "leaf_4_0_7": 1635549808.283198,
        "leaf_4_0_8": 1635549808.295173,
        "spine_1_1_1": 1635549808.817333,
        "spine_1_1_2": 1635549808.3182712,
        "spine_1_1_3": 1635549808.3281248,
        "spine_1_1_4": 1635549808.3388765,
        "spine_1_1_5": 1635549808.8585913,
        "spine_1_1_6": 1635549808.8673458,
        "spine_1_1_7": 1635549808.3711302,
        "spine_1_1_8": 1635549808.3801713,
        "spine_2_1_1": 1635549808.3821392,
        "spine_2_1_2": 1635549808.3921342,
        "spine_2_1_3": 1635549808.405018,
        "spine_2_1_4": 1635549808.4142838,
        "spine_2_1_5": 1635549808.4282353,
        "spine_2_1_6": 1635549808.4416516,
        "spine_2_1_7": 1635549808.4506109,
        "spine_2_1_8": 1635549808.468523,
        "spine_3_1_1": 1635549808.4751093,
        "spine_3_1_2": 1635549808.4848378,
        "spine_3_1_3": 1635549808.3885505,
        "spine_3_1_4": 1635549808.399836,
        "spine_3_1_5": 1635549808.4088755,
        "spine_3_1_6": 1635549808.4253528,
        "spine_3_1_7": 1635549808.439709,
        "spine_3_1_8": 1635549808.4483457,
        "spine_4_1_1": 1635549808.4616842,
        "spine_4_1_2": 1635549808.4716058,
        "spine_4_1_3": 1635549808.4816356,
        "spine_4_1_4": 1635549808.4892693,
        "spine_4_1_5": 1635549808.4929156,
        "spine_4_1_6": 1635549809.0098383,
        "spine_4_1_7": 1635549808.5104065,
        "spine_4_1_8": 1635549808.5235064,
        "tof_1_2_1": 1635549808.5419374,
        "tof_1_2_2": 1635549809.0713115,
        "tof_1_2_3": 1635549808.5731328,
        "tof_1_2_4": 1635549808.580934,
        "tof_1_2_5": 1635549809.0978916,
        "tof_1_2_6": 1635549808.600837,
        "tof_1_2_7": 1635549808.4985356,
        "tof_1_2_8": 1635549808.5109813,
        "tof_2_2_1": 1635549808.5234687,
        "tof_2_2_2": 1635549808.5404112,
        "tof_2_2_3": 1635549809.071845,
        "tof_2_2_4": 1635549808.575048,
        "tof_2_2_5": 1635549808.581398,
        "tof_2_2_6": 1635549808.5900671,
        "tof_2_2_7": 1635549808.6021519,
        "tof_2_2_8": 1635549808.6109061
    }
}