{
    "description": "Scenario 5a: net0 link failure of leaf_1_0_1 with BGP",
    "k_leaf": 8,
    "k_top": 8,
    "redundancy_factor": 4,
    "is_k8s": true,
    "machine_mac_addresses": {
        "leaf_1_0_1": {
            "net0": "be:c3:9b:9f:c0:65",
            "net1": "ce:ec:60:37:88:bf",
            "net2": "3e:c7:b7:ac:89:89",
            "net3": "22:90:a5:62:3e:d2",
            "net4": "f2:ab:67:91:2c:66",
            "net5": "fe:cb:57:5b:21:d8",
            "net6": "16:ab:44:6d:8d:5c",
            "net7": "be:15:f6:64:95:85",
            "net8": "b2:78:72:dc:0f:6a"
        },
        "leaf_1_0_2": {
            "net0": "22:f8:e6:2f:e2:47",
            "net1": "3e:b2:73:66:01:6d",
            "net2": "de:95:ee:77:41:34",
            "net3": "be:e4:45:bb:28:ae",
            "net4": "ae:c4:3a:80:57:f6",
            "net5": "4a:f8:d9:33:a5:2c",
            "net6": "be:36:8f:51:22:d6",
            "net7": "06:ec:0f:23:62:6d",
            "net8": "6a:aa:2f:db:4e:68"
        },
        "leaf_1_0_3": {
            "net0": "ca:27:c8:bc:2a:c9",
            "net1": "be:9c:f7:33:fa:03",
            "net2": "fa:63:e5:13:88:38",
            "net3": "56:c4:b3:b0:fe:e0",
            "net4": "1e:dc:a9:55:22:7d",
            "net5": "f2:e6:e3:bf:fe:ea",
            "net6": "1e:dc:d5:90:cd:58",
            "net7": "46:70:ab:81:16:04",
            "net8": "1e:6c:02:9e:3b:a7"
        },
        "leaf_1_0_4": {
            "net0": "02:f6:3e:e2:fe:33",
            "net1": "5e:d2:b5:bb:07:3e",
            "net2": "a6:85:6b:ba:0a:16",
            "net3": "0e:66:18:51:89:be",
            "net4": "ea:d5:d6:8f:97:8a",
            "net5": "4e:3b:24:63:91:77",
            "net6": "12:f6:d8:fa:c6:cf",
            "net7": "66:df:b0:f8:9f:f0",
            "net8": "ce:cf:ca:65:97:e3"
        },
        "leaf_1_0_5": {
            "net0": "4e:84:1e:68:7f:b2",
            "net1": "2a:82:ac:42:0b:b3",
            "net2": "6a:02:41:5b:8d:14",
            "net3": "16:1d:16:3e:ef:fc",
            "net4": "e6:32:48:6e:32:c2",
            "net5": "e2:8d:40:67:f5:dd",
            "net6": "f6:a4:35:c5:61:0e",
            "net7": "2e:ed:05:c8:4f:39",
            "net8": "fe:62:5d:87:2c:cc"
        },
        "leaf_1_0_6": {
            "net0": "22:52:42:67:d4:ea",
            "net1": "92:dc:bf:bc:97:90",
            "net2": "72:34:29:ce:da:e8",
            "net3": "16:99:06:f0:87:d4",
            "net4": "aa:f6:c5:b3:ad:9f",
            "net5": "9a:e2:c4:5b:fa:3a",
            "net6": "1a:a8:4f:4b:14:36",
            "net7": "6e:26:7e:eb:7c:fa",
            "net8": "82:81:56:42:3a:ba"
        },
        "leaf_1_0_7": {
            "net0": "72:fc:c1:65:6c:1f",
            "net1": "da:87:da:6f:3f:95",
            "net2": "1a:07:31:16:0c:67",
            "net3": "5e:18:16:b3:1e:d2",
            "net4": "7e:62:cb:27:15:8e",
            "net5": "b2:e7:b1:b0:85:cc",
            "net6": "16:41:5d:27:7d:b9",
            "net7": "ee:47:b5:ee:88:41",
            "net8": "4a:f1:3a:54:f2:98"
        },
        "leaf_1_0_8": {
            "net0": "9e:ac:86:35:35:2f",
            "net1": "c6:54:4f:64:12:8a",
            "net2": "7a:ed:4d:f3:9d:44",
            "net3": "fa:88:17:1c:f8:0d",
            "net4": "f6:5c:42:55:d8:49",
            "net5": "26:c8:42:b1:7f:74",
            "net6": "42:1d:dc:7a:e4:40",
            "net7": "76:48:bc:b2:55:2c",
            "net8": "52:b8:2b:8d:50:42"
        },
        "leaf_2_0_1": {
            "net0": "c6:7a:82:12:20:c6",
            "net1": "b6:e1:da:26:a5:89",
            "net2": "c2:86:0d:05:a7:4c",
            "net3": "aa:c3:e7:a1:00:cb",
            "net4": "4a:f0:13:5b:35:38",
            "net5": "52:28:93:30:ef:ae",
            "net6": "9e:67:aa:81:00:6d",
            "net7": "2e:0d:5c:79:73:3d",
            "net8": "ca:dd:b0:1e:82:8c"
        },
        "leaf_2_0_2": {
            "net0": "1a:86:10:a1:ac:4d",
            "net1": "02:80:fd:10:ed:97",
            "net2": "7e:c5:24:f8:cc:ab",
            "net3": "76:a1:de:0a:84:21",
            "net4": "a2:96:82:7b:3b:e9",
            "net5": "ee:dd:77:a5:83:a1",
            "net6": "de:54:6a:43:48:c7",
            "net7": "9a:be:03:61:72:ff",
            "net8": "ce:65:b5:fd:24:27"
        },
        "leaf_2_0_3": {
            "net0": "b6:3a:3c:b7:3b:43",
            "net1": "06:36:96:e9:c1:80",
            "net2": "e2:ea:a3:f5:0b:3e",
            "net3": "96:78:a9:05:ef:fd",
            "net4": "76:51:26:b5:86:61",
            "net5": "ae:b4:04:a7:a4:af",
            "net6": "1a:dd:5b:c5:38:f6",
            "net7": "8e:11:87:44:61:01",
            "net8": "1a:2f:e4:ba:5b:51"
        },
        "leaf_2_0_4": {
            "net0": "4a:89:a2:be:32:31",
            "net1": "42:e4:f2:af:a1:ca",
            "net2": "4e:9a:3b:31:5c:3b",
            "net3": "32:3a:f6:be:cb:e8",
            "net4": "6e:8b:06:78:94:86",
            "net5": "b2:db:e5:a2:d0:24",
            "net6": "f6:15:e7:10:d0:c1",
            "net7": "e6:18:96:59:c5:3a",
            "net8": "b6:e8:ea:a2:66:89"
        },
        "leaf_2_0_5": {
            "net0": "82:08:0b:1e:e4:c2",
            "net1": "02:ba:1a:b4:c3:3e",
            "net2": "b6:bc:d9:44:4e:dc",
            "net3": "de:75:4b:e5:5d:d4",
            "net4": "d6:23:c8:39:f3:70",
            "net5": "1a:de:14:31:46:9a",
            "net6": "a6:90:72:eb:95:75",
            "net7": "fa:f4:9f:c1:f9:7d",
            "net8": "56:5d:6a:2c:a5:3f"
        },
        "leaf_2_0_6": {
            "net0": "12:30:31:25:48:ac",
            "net1": "a2:ec:be:5a:ae:5e",
            "net2": "0a:b5:bd:f4:10:2d",
            "net3": "a6:a3:9e:22:ef:2b",
            "net4": "96:0a:7a:ca:60:90",
            "net5": "de:6c:a2:06:ec:d6",
            "net6": "f2:e9:f1:10:43:71",
            "net7": "3a:5b:fd:e3:42:56",
            "net8": "ba:d1:02:97:6b:92"
        },
        "leaf_2_0_7": {
            "net0": "ae:ce:20:02:a6:ab",
            "net1": "42:d9:fb:21:95:19",
            "net2": "76:6c:56:df:63:3b",
            "net3": "4e:41:5a:73:ed:f6",
            "net4": "e2:70:fc:f8:b5:5f",
            "net5": "ba:c4:15:83:c5:15",
            "net6": "fa:25:dd:7e:f1:b4",
            "net7": "c6:01:a3:db:8a:b3",
            "net8": "1e:59:3a:3f:b0:1f"
        },
        "leaf_2_0_8": {
            "net0": "a2:a0:6b:f5:60:b4",
            "net1": "f2:30:c9:69:4e:c0",
            "net2": "92:5f:f4:5d:d3:f4",
            "net3": "ea:13:60:d6:93:f6",
            "net4": "aa:60:9f:bd:c2:8d",
            "net5": "16:c4:b1:f2:3e:87",
            "net6": "82:64:14:a8:cb:7b",
            "net7": "0a:f1:db:8a:e3:86",
            "net8": "4e:be:8d:b1:2e:0c"
        },
        "leaf_3_0_1": {
            "net0": "86:c6:59:e5:e4:fb",
            "net1": "8a:80:ee:64:46:61",
            "net2": "f2:98:38:4a:58:99",
            "net3": "5e:8e:1b:6f:b9:02",
            "net4": "a6:99:91:0f:20:18",
            "net5": "f6:d7:7b:f5:c6:7a",
            "net6": "b2:0c:54:14:07:ec",
            "net7": "fa:08:64:0e:81:c8",
            "net8": "7e:57:79:b0:97:3e"
        },
        "leaf_3_0_2": {
            "net0": "e2:a9:59:97:52:62",
            "net1": "f6:e8:67:bd:ac:07",
            "net2": "9a:61:93:58:95:a4",
            "net3": "e2:bb:99:47:b9:e9",
            "net4": "0e:89:99:61:4e:c8",
            "net5": "b2:48:7b:c3:e7:e5",
            "net6": "d6:11:de:47:61:7c",
            "net7": "6a:86:7a:8e:ae:9d",
            "net8": "b6:58:16:92:83:38"
        },
        "leaf_3_0_3": {
            "net0": "8e:f8:c6:9b:3c:06",
            "net1": "de:54:ff:dc:c3:b6",
            "net2": "b6:36:53:24:24:b9",
            "net3": "de:77:8a:c0:f9:b9",
            "net4": "2a:6b:4b:79:ef:66",
            "net5": "1a:54:63:80:69:14",
            "net6": "92:33:6d:52:c6:81",
            "net7": "86:a2:91:41:01:1f",
            "net8": "52:dd:aa:df:bb:88"
        },
        "leaf_3_0_4": {
            "net0": "8a:91:54:c5:df:fd",
            "net1": "12:52:7d:d3:34:90",
            "net2": "ce:7b:e4:f2:8d:b8",
            "net3": "fa:0a:eb:ad:0f:29",
            "net4": "a2:d0:4f:d4:0a:b3",
            "net5": "5a:56:f2:6e:48:fb",
            "net6": "3e:f2:59:69:93:42",
            "net7": "12:0a:2f:7b:7c:17",
            "net8": "e2:fd:ec:4e:76:91"
        },
        "leaf_3_0_5": {
            "net0": "f6:fb:e7:37:54:c6",
            "net1": "fa:87:ca:9a:8d:75",
            "net2": "6a:a4:7a:aa:5f:df",
            "net3": "12:87:de:7e:42:f0",
            "net4": "ee:86:15:79:69:ea",
            "net5": "c6:4a:30:fa:2d:5d",
            "net6": "36:45:a3:ee:93:fd",
            "net7": "02:de:d8:e6:03:38",
            "net8": "8e:39:d8:2a:57:1b"
        },
        "leaf_3_0_6": {
            "net0": "36:07:e4:91:e2:04",
            "net1": "2a:4d:f9:99:d7:cb",
            "net2": "ee:31:d1:17:77:fd",
            "net3": "26:59:61:52:a8:05",
            "net4": "72:06:bf:10:1f:15",
            "net5": "96:0e:f4:73:f1:8c",
            "net6": "ca:25:43:fa:84:f9",
            "net7": "a6:e3:fb:d9:86:c2",
            "net8": "4e:58:e2:f9:00:5e"
        },
        "leaf_3_0_7": {
            "net0": "f2:5e:18:14:ce:31",
            "net1": "6a:30:7c:68:1f:36",
            "net2": "9e:57:4c:cc:20:79",
            "net3": "82:c2:05:8b:46:75",
            "net4": "da:e6:5b:a9:35:6c",
            "net5": "ee:cf:6f:72:95:67",
            "net6": "fa:b0:fb:f6:e2:46",
            "net7": "0a:df:cf:81:b3:c0",
            "net8": "06:49:e1:a2:fd:fe"
        },
        "leaf_3_0_8": {
            "net0": "a6:ed:b5:25:00:ad",
            "net1": "76:bc:40:88:1b:2c",
            "net2": "42:0c:18:71:eb:83",
            "net3": "82:d6:a2:75:80:3c",
            "net4": "26:92:16:4b:1e:6d",
            "net5": "ca:6e:65:be:3a:96",
            "net6": "7e:1d:47:f1:7d:fc",
            "net7": "1a:ef:67:f6:ef:15",
            "net8": "5e:1a:96:d4:14:a7"
        },
        "leaf_4_0_1": {
            "net0": "9a:fa:db:71:0b:19",
            "net1": "62:2e:1f:01:7f:c7",
            "net2": "2e:4e:33:4d:e2:b9",
            "net3": "72:99:ce:78:8e:7b",
            "net4": "5e:d3:84:d5:88:e1",
            "net5": "6e:5a:d6:0c:6a:46",
            "net6": "9a:1f:5f:af:06:9d",
            "net7": "f2:ae:6e:9f:8a:15",
            "net8": "02:9a:5d:09:d4:4c"
        },
        "leaf_4_0_2": {
            "net0": "a6:39:1b:f4:8e:4d",
            "net1": "92:71:36:ae:29:50",
            "net2": "fa:70:cc:8e:19:e7",
            "net3": "da:45:5a:a9:c1:f9",
            "net4": "ae:4b:db:c0:da:11",
            "net5": "06:0c:33:75:3a:95",
            "net6": "da:f8:f6:b5:70:95",
            "net7": "f6:bc:b1:b8:de:00",
            "net8": "3e:7a:93:f0:8c:8d"
        },
        "leaf_4_0_3": {
            "net0": "f6:a8:ae:22:b3:bd",
            "net1": "0a:9c:db:0a:26:90",
            "net2": "ae:54:6c:02:24:a9",
            "net3": "d6:79:aa:da:dc:34",
            "net4": "4e:92:3d:27:ed:9e",
            "net5": "0a:b5:ea:03:c1:2e",
            "net6": "3e:83:c0:27:3c:92",
            "net7": "ee:8d:01:ff:89:e1",
            "net8": "5e:42:d8:bb:de:64"
        },
        "leaf_4_0_4": {
            "net0": "56:4f:eb:28:3e:a1",
            "net1": "ba:7b:ea:7f:18:6c",
            "net2": "3a:9e:18:65:23:6b",
            "net3": "f6:f2:10:c8:3a:98",
            "net4": "32:f6:50:76:a8:8c",
            "net5": "3e:74:59:24:fd:95",
            "net6": "6e:84:41:a7:7f:20",
            "net7": "de:2d:e0:de:2d:38",
            "net8": "36:63:04:6e:fa:9e"
        },
        "leaf_4_0_5": {
            "net0": "9a:dd:66:df:6f:09",
            "net1": "1e:5d:2a:30:3c:ea",
            "net2": "82:cd:2b:1a:6d:50",
            "net3": "1e:67:97:39:83:da",
            "net4": "9e:8c:29:e3:92:ee",
            "net5": "22:a6:c8:1f:3c:a5",
            "net6": "e6:60:81:c9:24:cd",
            "net7": "da:cf:41:04:be:d9",
            "net8": "d6:05:38:aa:02:ec"
        },
        "leaf_4_0_6": {
            "net0": "a2:d5:b0:ce:85:89",
            "net1": "66:ca:53:c5:7e:3a",
            "net2": "b2:fe:81:11:2f:0e",
            "net3": "26:1e:fe:a1:7a:c7",
            "net4": "fe:ee:26:2e:f9:02",
            "net5": "a6:1a:24:cf:f0:cb",
            "net6": "f2:27:4c:06:71:a7",
            "net7": "9e:f7:b9:c0:77:c2",
            "net8": "1a:16:1e:46:4e:fe"
        },
        "leaf_4_0_7": {
            "net0": "76:0b:83:31:77:5f",
            "net1": "02:b7:f2:12:7a:66",
            "net2": "6e:3d:68:11:e5:e5",
            "net3": "6e:8c:54:84:95:f5",
            "net4": "96:0f:d7:b9:7b:17",
            "net5": "46:c8:74:6a:db:5d",
            "net6": "b2:95:7b:14:cf:ba",
            "net7": "72:0f:09:ab:73:dd",
            "net8": "7e:75:6f:53:ea:9b"
        },
        "leaf_4_0_8": {
            "net0": "86:45:93:65:ea:38",
            "net1": "fe:48:2a:5c:ba:5b",
            "net2": "2a:1c:27:ea:71:00",
            "net3": "82:17:37:fb:60:1a",
            "net4": "be:e8:69:e9:0e:75",
            "net5": "52:69:7a:7e:cb:51",
            "net6": "26:f9:0c:cd:7c:64",
            "net7": "2a:e9:7d:25:ea:92",
            "net8": "f2:b7:3c:d7:61:64"
        },
        "spine_1_1_1": {
            "net0": "7a:d1:ff:ae:27:f9",
            "net1": "d6:e7:d5:19:80:2f",
            "net10": "72:db:cd:04:a3:82",
            "net11": "e2:8d:56:37:3c:d4",
            "net12": "e2:67:0f:7a:0b:8b",
            "net13": "8e:69:09:e2:c5:50",
            "net14": "a2:92:33:8a:9f:c1",
            "net15": "2e:e3:ac:68:94:fe",
            "net2": "5e:42:16:a0:cd:67",
            "net3": "e6:21:d1:2f:b2:2c",
            "net4": "8a:3d:91:85:c3:00",
            "net5": "66:90:42:5d:3e:e9",
            "net6": "c6:25:05:85:09:e6",
            "net7": "4e:02:40:5a:00:25",
            "net8": "62:a5:3a:68:3b:37",
            "net9": "76:0d:be:2d:8f:8a"
        },
        "spine_1_1_2": {
            "net0": "06:cd:3c:38:50:64",
            "net1": "e6:45:24:5b:f8:08",
            "net10": "7a:a0:78:ad:c8:2d",
            "net11": "e2:25:07:95:90:f3",
            "net12": "06:81:da:9b:f2:f1",
            "net13": "c6:d0:51:36:cb:06",
            "net14": "02:5c:25:a8:5b:1e",
            "net15": "5e:47:c6:5a:e1:52",
            "net2": "96:31:0e:7e:2d:db",
            "net3": "de:c8:07:00:b4:94",
            "net4": "26:68:1b:76:98:46",
            "net5": "0a:6a:15:ed:c9:20",
            "net6": "2a:41:af:36:7e:9d",
            "net7": "fe:ec:71:08:ad:18",
            "net8": "e2:bf:e9:dd:7a:0e",
            "net9": "ae:07:72:dd:b4:31"
        },
        "spine_1_1_3": {
            "net0": "6e:21:73:81:ff:11",
            "net1": "5e:26:e3:87:6f:86",
            "net10": "06:cc:17:d4:cb:6a",
            "net11": "3e:f0:36:63:ea:43",
            "net12": "5e:58:5c:65:c9:92",
            "net13": "8a:fb:da:4d:5b:76",
            "net14": "da:f2:38:ba:25:fc",
            "net15": "86:ce:a4:db:db:27",
            "net2": "86:e6:9d:17:b2:e2",
            "net3": "6a:c2:7f:1a:32:60",
            "net4": "ee:c8:88:f8:f4:57",
            "net5": "aa:74:07:d0:ee:1c",
            "net6": "2e:52:74:dd:28:c0",
            "net7": "52:b2:78:48:8c:4a",
            "net8": "22:72:ba:17:af:15",
            "net9": "5e:36:0f:37:0d:24"
        },
        "spine_1_1_4": {
            "net0": "a2:5d:5c:a1:01:7d",
            "net1": "82:03:2c:7b:0a:c6",
            "net10": "32:6c:2f:9c:19:65",
            "net11": "9a:2f:e4:3f:26:54",
            "net12": "22:53:cc:0a:87:96",
            "net13": "9e:fc:e2:03:f3:90",
            "net14": "4a:36:fb:7a:4e:38",
            "net15": "d2:28:da:14:c0:35",
            "net2": "c6:b3:c2:a1:90:b8",
            "net3": "9a:2e:ac:dd:60:8d",
            "net4": "fe:a6:98:fe:be:30",
            "net5": "d2:00:29:58:6d:e8",
            "net6": "52:af:82:2f:5b:90",
            "net7": "1a:a1:b6:9c:3e:49",
            "net8": "5e:50:0e:e0:69:92",
            "net9": "02:29:7c:34:fe:dc"
        },
        "spine_1_1_5": {
            "net0": "62:4b:f9:df:43:5b",
            "net1": "aa:49:19:35:be:ef",
            "net10": "e2:3c:55:7b:1e:9c",
            "net11": "b6:d9:49:51:fa:3f",
            "net12": "72:52:f8:13:5d:77",
            "net13": "5e:dd:7d:12:ce:c7",
            "net14": "42:9b:62:8f:ec:56",
            "net15": "62:d4:0a:b7:7b:b1",
            "net2": "86:1d:67:64:eb:42",
            "net3": "da:87:6b:4e:d4:5e",
            "net4": "c6:f1:a0:0f:f4:fe",
            "net5": "ca:7f:fa:00:01:78",
            "net6": "96:e1:0c:f6:df:f2",
            "net7": "76:8a:74:73:89:cc",
            "net8": "0a:c4:5c:2a:8f:1c",
            "net9": "02:e9:44:e6:c9:14"
        },
        "spine_1_1_6": {
            "net0": "36:68:f6:c6:4e:a6",
            "net1": "a2:06:02:75:37:b7",
            "net10": "e2:e6:30:42:39:54",
            "net11": "92:8f:fe:a9:e3:33",
            "net12": "5e:93:62:1a:25:aa",
            "net13": "fa:cf:83:9f:80:27",
            "net14": "8a:47:d4:a2:99:2b",
            "net15": "42:41:58:95:8d:70",
            "net2": "0a:af:f5:2d:7b:8d",
            "net3": "12:fe:df:a4:6c:30",
            "net4": "7e:70:9d:4d:b0:f6",
            "net5": "ce:1b:33:f1:24:d4",
            "net6": "da:27:7a:8d:e5:30",
            "net7": "b2:70:dd:41:13:29",
            "net8": "d2:b8:9e:d5:53:17",
            "net9": "0a:26:64:a0:21:71"
        },
        "spine_1_1_7": {
            "net0": "7e:07:b1:b1:c1:ba",
            "net1": "d2:35:ce:3b:3e:1c",
            "net10": "22:70:db:d8:2e:d6",
            "net11": "e2:93:50:09:aa:95",
            "net12": "a2:6d:8a:8e:7c:ae",
            "net13": "c6:6d:83:3a:9a:4b",
            "net14": "da:7e:17:9e:8d:12",
            "net15": "02:0f:45:fa:50:34",
            "net2": "46:8e:4e:a3:ef:3e",
            "net3": "e2:34:ab:e8:69:ec",
            "net4": "9e:a6:9d:63:65:45",
            "net5": "f6:ee:74:f1:94:2d",
            "net6": "9a:b4:82:ae:27:ec",
            "net7": "6e:cd:01:e9:d5:3d",
            "net8": "92:d4:8d:be:4b:07",
            "net9": "3e:e3:c3:62:e0:ff"
        },
        "spine_1_1_8": {
            "net0": "ee:58:32:be:48:a0",
            "net1": "12:ad:43:b3:b6:7e",
            "net10": "72:65:d9:b8:14:4e",
            "net11": "ba:f2:19:b5:84:e7",
            "net12": "ee:69:f5:00:af:c7",
            "net13": "ce:1e:fd:79:ba:cd",
            "net14": "92:bd:58:9e:11:a2",
            "net15": "56:a3:85:4b:32:06",
            "net2": "ce:51:2a:29:a2:0d",
            "net3": "5a:cb:0a:5d:6b:16",
            "net4": "aa:c0:6b:59:40:9c",
            "net5": "16:61:c5:1a:e8:38",
            "net6": "0e:38:4c:fa:5b:c4",
            "net7": "e6:6d:51:39:8b:cc",
            "net8": "3a:c0:2f:e1:91:c6",
            "net9": "f2:5b:dd:df:81:57"
        },
        "spine_2_1_1": {
            "net0": "a2:17:2d:5c:90:d2",
            "net1": "fe:aa:22:1d:d9:c3",
            "net10": "ce:6a:36:81:e5:e4",
            "net11": "2e:fb:65:db:19:34",
            "net12": "86:38:8b:73:7b:87",
            "net13": "b6:cb:39:19:a6:0f",
            "net14": "46:ac:77:5b:28:22",
            "net15": "42:94:31:1a:e0:44",
            "net2": "b6:1f:a5:4a:aa:d3",
            "net3": "2e:57:fb:20:6b:15",
            "net4": "9a:91:fa:e5:c6:de",
            "net5": "52:78:ed:75:46:b7",
            "net6": "ba:9b:8d:9a:23:ec",
            "net7": "aa:cf:b1:97:e5:4c",
            "net8": "ea:bd:05:b1:a0:af",
            "net9": "76:62:28:c4:68:cb"
        },
        "spine_2_1_2": {
            "net0": "7a:6e:e8:15:6a:87",
            "net1": "ba:fe:e7:45:b6:1d",
            "net10": "6e:c9:79:15:e0:6f",
            "net11": "fe:51:5f:03:ab:aa",
            "net12": "62:04:45:b3:70:3c",
            "net13": "42:bd:59:73:2e:07",
            "net14": "ae:20:11:64:55:84",
            "net15": "42:32:17:43:0a:8f",
            "net2": "6a:57:b7:37:1e:e8",
            "net3": "aa:8f:b3:a9:a3:fe",
            "net4": "fe:d6:c4:36:0c:ce",
            "net5": "1a:6b:57:51:15:4c",
            "net6": "12:23:d6:5a:6b:01",
            "net7": "66:8b:c0:16:8a:11",
            "net8": "06:04:41:fd:7f:36",
            "net9": "0a:72:24:74:22:fe"
        },
        "spine_2_1_3": {
            "net0": "52:e0:d4:54:93:ff",
            "net1": "1e:ca:c2:54:ac:bd",
            "net10": "fa:74:5a:fe:ff:27",
            "net11": "f6:fb:e0:58:dd:87",
            "net12": "2e:97:fa:cd:dd:c6",
            "net13": "5a:73:24:44:91:78",
            "net14": "c2:92:e9:16:b3:ce",
            "net15": "62:3a:09:b6:0d:29",
            "net2": "62:91:50:53:56:57",
            "net3": "52:1d:1e:37:7e:da",
            "net4": "2e:9b:df:3d:41:2c",
            "net5": "16:24:d2:7d:e5:0e",
            "net6": "c2:1d:ad:93:b5:f8",
            "net7": "ca:db:58:e8:1c:5c",
            "net8": "56:0d:85:47:b4:db",
            "net9": "fe:ea:7a:7e:34:58"
        },
        "spine_2_1_4": {
            "net0": "ae:1f:bd:1c:b8:9f",
            "net1": "0e:30:6b:77:aa:f2",
            "net10": "66:b9:ee:26:72:08",
            "net11": "c6:28:02:a8:ce:0a",
            "net12": "f2:38:0d:42:d7:ba",
            "net13": "d6:84:54:fc:0d:e2",
            "net14": "96:24:30:97:68:ab",
            "net15": "2a:ff:1d:f0:b7:9d",
            "net2": "ca:dd:bd:85:c9:f2",
            "net3": "1e:15:18:b4:92:2e",
            "net4": "ae:bf:71:38:a0:92",
            "net5": "ea:48:3a:f8:ad:78",
            "net6": "82:e5:4d:66:a7:b2",
            "net7": "02:f7:b2:34:b3:25",
            "net8": "b6:6f:36:ae:9a:db",
            "net9": "6a:dc:f0:04:ce:4d"
        },
        "spine_2_1_5": {
            "net0": "52:47:90:d3:3a:82",
            "net1": "a2:a4:5a:a2:e7:af",
            "net10": "b2:57:f6:b3:ca:3e",
            "net11": "52:d7:c5:2e:a5:44",
            "net12": "6e:bb:12:5d:57:5a",
            "net13": "52:9d:ac:01:59:23",
            "net14": "36:a1:3a:44:e9:23",
            "net15": "2e:99:52:2b:47:12",
            "net2": "66:d3:4e:70:a5:aa",
            "net3": "16:6a:df:81:6c:c0",
            "net4": "ae:8d:23:c5:87:bf",
            "net5": "d6:3c:5c:2c:34:fe",
            "net6": "8a:72:69:4d:54:d4",
            "net7": "76:76:40:19:55:c2",
            "net8": "be:a4:d4:1a:9b:16",
            "net9": "ae:dc:a4:fa:b6:90"
        },
        "spine_2_1_6": {
            "net0": "06:35:c7:ce:f9:17",
            "net1": "ba:d5:a9:cb:cc:0c",
            "net10": "26:a8:c7:f3:d1:76",
            "net11": "3e:1b:5e:b6:fd:79",
            "net12": "4e:37:24:b4:74:1f",
            "net13": "f6:29:99:f7:70:57",
            "net14": "42:eb:59:3e:c1:a3",
            "net15": "26:41:c8:3b:53:9d",
            "net2": "d6:ac:6f:5d:0d:51",
            "net3": "6e:e3:88:e4:24:36",
            "net4": "de:6d:0b:4d:b6:31",
            "net5": "12:88:4e:70:8f:79",
            "net6": "a2:27:01:38:96:c3",
            "net7": "e6:36:19:43:39:8b",
            "net8": "8a:3a:31:bc:a2:a5",
            "net9": "06:45:d1:33:96:7f"
        },
        "spine_2_1_7": {
            "net0": "82:a3:71:a7:72:95",
            "net1": "2e:cb:7b:bd:52:cf",
            "net10": "72:d3:f5:fd:10:3b",
            "net11": "2e:b8:09:0b:ac:3b",
            "net12": "b2:77:1c:e8:d4:fb",
            "net13": "1a:e0:cd:58:4c:d9",
            "net14": "8e:1c:07:df:92:68",
            "net15": "ea:96:5d:f6:87:32",
            "net2": "86:17:ea:7a:8a:dd",
            "net3": "0a:3a:12:28:56:d0",
            "net4": "66:1c:0b:3d:6e:28",
            "net5": "7a:b8:6b:ac:0f:8c",
            "net6": "92:c7:e6:61:63:47",
            "net7": "26:a7:5b:33:8c:6e",
            "net8": "1a:e0:38:3a:35:54",
            "net9": "32:79:ff:27:3c:e5"
        },
        "spine_2_1_8": {
            "net0": "5a:93:98:4b:96:09",
            "net1": "da:8a:b8:74:6e:0e",
            "net10": "16:0a:42:80:70:b2",
            "net11": "ee:39:10:28:ee:a0",
            "net12": "b2:3a:d1:08:f1:21",
            "net13": "62:31:79:11:a7:f9",
            "net14": "fa:e8:0d:f8:11:ed",
            "net15": "d2:ce:d3:38:13:83",
            "net2": "02:d7:2e:d0:87:69",
            "net3": "a6:2e:41:c7:ed:4e",
            "net4": "3a:d5:0f:bb:6d:8a",
            "net5": "fa:b9:ac:28:07:f9",
            "net6": "0e:43:e5:f0:df:57",
            "net7": "b2:b0:d2:5c:4b:2e",
            "net8": "26:29:fd:1f:88:6a",
            "net9": "42:24:99:f1:77:a7"
        },
        "spine_3_1_1": {
            "net0": "82:78:d5:56:86:5d",
            "net1": "3a:eb:af:57:fa:de",
            "net10": "de:09:6b:99:e3:0b",
            "net11": "d2:08:a4:83:53:eb",
            "net12": "c2:a0:4a:34:e0:1f",
            "net13": "de:77:f4:40:33:4a",
            "net14": "8a:c1:b1:f6:79:91",
            "net15": "1a:ca:d3:12:7f:ca",
            "net2": "ae:a6:0a:76:0a:e7",
            "net3": "ba:2e:df:4f:2f:6b",
            "net4": "82:95:8e:fd:d9:67",
            "net5": "0e:2f:91:17:3a:81",
            "net6": "6e:46:f5:7b:50:f8",
            "net7": "3a:27:89:be:c8:ab",
            "net8": "02:96:94:5f:71:44",
            "net9": "92:5b:ea:9f:4d:66"
        },
        "spine_3_1_2": {
            "net0": "9a:5c:33:45:ad:67",
            "net1": "2e:c4:c9:3e:a4:49",
            "net10": "12:c5:d8:6f:ec:30",
            "net11": "8e:81:ff:39:58:0a",
            "net12": "6a:e9:63:4c:e5:0a",
            "net13": "da:a9:92:49:f8:56",
            "net14": "d6:5e:8a:ba:00:af",
            "net15": "62:51:e2:5a:e3:86",
            "net2": "fa:8a:c2:c9:da:04",
            "net3": "9a:62:6d:a1:42:a5",
            "net4": "8e:df:cf:15:7e:a6",
            "net5": "3a:35:f6:48:32:f2",
            "net6": "f2:b2:27:ba:fa:73",
            "net7": "2e:a8:de:b7:ed:b0",
            "net8": "be:68:63:4b:4e:c4",
            "net9": "ae:c2:5c:0a:02:ac"
        },
        "spine_3_1_3": {
            "net0": "9e:5b:62:c2:62:f4",
            "net1": "22:2c:58:e4:e7:8d",
            "net10": "8a:35:51:1c:fc:c2",
            "net11": "2e:3e:39:7d:36:c6",
            "net12": "76:66:bb:19:87:da",
            "net13": "4a:0a:75:f9:19:d7",
            "net14": "2a:1d:6b:cb:78:d4",
            "net15": "ca:c2:10:37:e6:a7",
            "net2": "ea:0d:78:b2:00:71",
            "net3": "ca:96:fb:8b:17:72",
            "net4": "c6:e6:7f:5e:5a:2c",
            "net5": "c6:33:59:4a:7d:69",
            "net6": "e2:b0:c1:e3:15:6b",
            "net7": "66:90:f8:66:97:81",
            "net8": "52:68:99:20:e9:80",
            "net9": "12:8d:db:f7:b5:dc"
        },
        "spine_3_1_4": {
            "net0": "ca:b2:6d:20:91:e2",
            "net1": "1e:04:6d:5c:97:17",
            "net10": "f6:08:f6:fd:76:3a",
            "net11": "0a:9d:31:e0:63:e3",
            "net12": "7a:f1:2f:77:77:a4",
            "net13": "82:f9:d8:1e:0d:4c",
            "net14": "6e:00:52:66:d6:60",
            "net15": "5e:3d:d2:cc:9c:34",
            "net2": "9a:a5:86:1e:7c:f1",
            "net3": "96:a1:fc:e9:d9:27",
            "net4": "16:d3:31:45:7b:06",
            "net5": "76:0c:2a:1b:ae:18",
            "net6": "02:17:15:ca:f6:b2",
            "net7": "ca:c6:23:2f:3f:ef",
            "net8": "62:00:81:9e:8b:0b",
            "net9": "d2:2e:54:51:33:0f"
        },
        "spine_3_1_5": {
            "net0": "ea:35:99:d0:5b:54",
            "net1": "e6:91:ff:61:63:5a",
            "net10": "36:a0:3d:e2:8d:f8",
            "net11": "ca:6c:bb:c3:8c:7a",
            "net12": "ea:30:f3:fa:e7:3a",
            "net13": "4e:2f:36:2f:21:fe",
            "net14": "82:39:f5:27:89:f9",
            "net15": "fe:c1:61:ee:13:02",
            "net2": "3e:c2:f5:26:1f:c4",
            "net3": "2e:76:75:05:d6:83",
            "net4": "de:df:d0:d0:a0:fe",
            "net5": "42:ae:90:02:03:4a",
            "net6": "8e:de:55:5f:34:7d",
            "net7": "7a:bb:77:7d:f4:d5",
            "net8": "66:12:5b:23:12:4b",
            "net9": "a6:0c:60:28:6b:d2"
        },
        "spine_3_1_6": {
            "net0": "d2:b9:a2:61:7f:ef",
            "net1": "46:ad:27:85:88:68",
            "net10": "ce:96:27:ae:cb:5b",
            "net11": "46:0e:07:91:67:a1",
            "net12": "62:24:5b:a3:08:c9",
            "net13": "b6:0b:42:8e:6e:06",
            "net14": "e6:51:37:81:11:86",
            "net15": "72:e6:36:06:ee:b5",
            "net2": "e2:fb:55:93:5f:80",
            "net3": "1e:32:9e:fc:e3:81",
            "net4": "4e:b5:85:3d:8b:b2",
            "net5": "7a:7f:f5:43:d1:2d",
            "net6": "d6:94:c2:d9:1f:d1",
            "net7": "5e:a8:3e:84:4c:1a",
            "net8": "92:a8:0b:e6:bb:40",
            "net9": "2e:d5:0e:2f:3f:e0"
        },
        "spine_3_1_7": {
            "net0": "26:d8:b0:a3:14:dd",
            "net1": "92:99:01:90:cb:54",
            "net10": "3e:23:66:78:90:4a",
            "net11": "52:a4:e8:6a:d5:53",
            "net12": "32:3e:aa:ac:ce:48",
            "net13": "56:7c:f6:37:a8:ad",
            "net14": "5a:79:0f:c3:c7:f0",
            "net15": "9a:f1:88:25:03:36",
            "net2": "06:4d:d9:b5:83:dd",
            "net3": "aa:a8:60:db:a7:ef",
            "net4": "22:76:26:19:94:dc",
            "net5": "02:ce:40:77:34:18",
            "net6": "7e:28:2c:42:1d:ce",
            "net7": "9a:30:40:bd:69:a8",
            "net8": "be:cd:97:3a:2e:f1",
            "net9": "ae:9b:84:e6:f4:ec"
        },
        "spine_3_1_8": {
            "net0": "e6:e1:03:9d:1d:47",
            "net1": "72:01:50:78:46:06",
            "net10": "be:07:12:ee:2b:c9",
            "net11": "aa:4a:52:2c:59:d7",
            "net12": "d6:9d:7b:66:04:0f",
            "net13": "d2:3a:4c:6e:f3:63",
            "net14": "2e:56:6f:d4:2e:31",
            "net15": "1a:5a:84:3a:42:75",
            "net2": "96:cf:52:e0:88:88",
            "net3": "a6:45:51:f4:c7:21",
            "net4": "ae:6f:5e:c4:99:cc",
            "net5": "f2:82:7d:06:76:b1",
            "net6": "9a:6d:52:97:56:3d",
            "net7": "9e:b5:34:f0:fe:d3",
            "net8": "be:14:2c:31:cd:f3",
            "net9": "d6:a0:3e:76:c5:b8"
        },
        "spine_4_1_1": {
            "net0": "76:f5:d2:bb:08:7b",
            "net1": "0e:34:4b:e2:4a:dd",
            "net10": "d6:d6:8c:19:93:6b",
            "net11": "56:51:64:2d:e4:56",
            "net12": "a2:60:9b:00:20:8a",
            "net13": "0e:d3:c2:ef:64:1f",
            "net14": "6a:f0:75:00:04:c7",
            "net15": "ba:36:47:ec:9c:0f",
            "net2": "3e:96:ef:b9:88:1e",
            "net3": "9a:4a:2c:6c:cd:18",
            "net4": "7e:b6:f2:39:cf:ac",
            "net5": "de:74:21:97:11:d1",
            "net6": "3a:e4:2a:a0:2a:5f",
            "net7": "66:05:26:d8:a0:41",
            "net8": "86:c1:14:f4:5b:29",
            "net9": "1a:a5:4c:81:b0:88"
        },
        "spine_4_1_2": {
            "net0": "46:9e:14:8c:5f:03",
            "net1": "22:33:6f:78:2d:2c",
            "net10": "22:08:78:23:7c:41",
            "net11": "0e:d9:cf:4b:46:97",
            "net12": "32:97:56:74:1e:2c",
            "net13": "ce:42:1a:3b:b6:f9",
            "net14": "4a:1f:28:8f:8b:da",
            "net15": "4a:14:97:3b:a6:59",
            "net2": "12:e3:60:4a:e8:97",
            "net3": "92:81:30:e1:df:c0",
            "net4": "d6:ae:c2:dc:09:4f",
            "net5": "72:90:6e:0c:d2:9e",
            "net6": "c6:d9:77:8a:39:d0",
            "net7": "36:82:32:c4:ca:28",
            "net8": "8a:7d:3b:25:d1:d7",
            "net9": "d6:e7:4f:34:2f:d2"
        },
        "spine_4_1_3": {
            "net0": "42:fe:14:42:55:3e",
            "net1": "c6:eb:b7:f9:5e:3f",
            "net10": "86:9b:ba:8b:4a:f7",
            "net11": "e2:c1:9d:57:11:a9",
            "net12": "42:ce:3d:0e:ee:73",
            "net13": "1a:b7:7e:ef:e0:2a",
            "net14": "4a:ed:f8:24:fc:e9",
            "net15": "2a:1b:78:a6:5a:f9",
            "net2": "ca:ff:0d:29:d8:55",
            "net3": "2a:8d:23:12:8e:d9",
            "net4": "0a:90:de:ea:26:4d",
            "net5": "6e:f8:54:4b:31:56",
            "net6": "e2:94:15:16:02:fa",
            "net7": "f2:8c:06:4f:0b:8a",
            "net8": "06:8b:b8:06:ef:8e",
            "net9": "6e:b0:27:84:bc:60"
        },
        "spine_4_1_4": {
            "net0": "aa:fd:c0:7c:82:bd",
            "net1": "b2:72:9f:89:95:52",
            "net10": "fa:8c:ee:c5:ea:fe",
            "net11": "92:b6:6b:43:bb:c3",
            "net12": "2e:c5:36:2e:fd:a7",
            "net13": "fa:3a:53:15:a7:4b",
            "net14": "6a:bb:75:61:b4:1e",
            "net15": "c6:bc:2f:99:91:7c",
            "net2": "c2:32:06:cf:32:6e",
            "net3": "ea:9b:6c:40:10:76",
            "net4": "32:40:3d:d1:98:41",
            "net5": "22:10:e9:00:0a:ef",
            "net6": "e2:e8:93:4b:23:92",
            "net7": "ba:28:4e:f8:7f:2c",
            "net8": "4e:66:a1:ab:bf:05",
            "net9": "0e:c3:00:be:50:e2"
        },
        "spine_4_1_5": {
            "net0": "02:34:0f:40:d7:3f",
            "net1": "82:55:56:5e:3b:0b",
            "net10": "b6:66:e4:74:50:cc",
            "net11": "d6:65:eb:8d:75:ea",
            "net12": "da:af:b4:e8:b2:68",
            "net13": "fe:64:18:ef:14:d2",
            "net14": "1e:90:ca:56:1d:e7",
            "net15": "96:23:29:8c:5f:2d",
            "net2": "3a:87:56:9a:12:3d",
            "net3": "4e:69:c4:d0:dd:ab",
            "net4": "3e:70:71:5b:4e:01",
            "net5": "de:d2:5f:ee:f5:45",
            "net6": "92:89:46:52:50:40",
            "net7": "fa:83:0e:29:72:6f",
            "net8": "0e:d5:7f:7f:8b:02",
            "net9": "9e:78:4c:1f:99:48"
        },
        "spine_4_1_6": {
            "net0": "5a:6d:fd:6e:a4:51",
            "net1": "16:f4:32:c9:17:36",
            "net10": "8a:de:17:c2:d5:2d",
            "net11": "b2:2e:77:e4:8f:78",
            "net12": "36:50:7d:29:ca:11",
            "net13": "02:63:a5:b3:33:cd",
            "net14": "4e:9b:0c:75:c2:ef",
            "net15": "e2:36:70:f0:e5:d0",
            "net2": "2a:0e:cc:8e:db:75",
            "net3": "96:73:44:8f:e0:a3",
            "net4": "82:15:ec:ec:9a:f4",
            "net5": "82:f3:93:11:fa:04",
            "net6": "42:e6:5e:4c:40:4e",
            "net7": "c6:73:df:69:7d:23",
            "net8": "8a:af:cc:ff:fa:ac",
            "net9": "d6:d2:21:5d:dc:65"
        },
        "spine_4_1_7": {
            "net0": "1a:22:68:f7:83:6a",
            "net1": "da:63:b9:9b:0e:4f",
            "net10": "ba:8d:5d:fa:7b:cd",
            "net11": "c2:b0:e5:57:e3:f8",
            "net12": "46:2b:96:81:3e:a4",
            "net13": "0a:1a:a9:fe:62:5d",
            "net14": "e6:9a:21:9e:34:db",
            "net15": "ba:71:8e:78:d6:83",
            "net2": "22:80:b8:1e:44:1a",
            "net3": "96:af:13:bb:a6:a3",
            "net4": "96:58:14:8a:48:82",
            "net5": "82:dd:60:70:09:ed",
            "net6": "5a:2c:b2:d7:23:b3",
            "net7": "8a:94:6f:38:99:a1",
            "net8": "ea:3c:4b:11:76:c9",
            "net9": "1a:4e:d8:08:8f:2a"
        },
        "spine_4_1_8": {
            "net0": "92:6c:02:6c:22:e1",
            "net1": "c6:18:a1:39:f1:b9",
            "net10": "fa:2f:2a:7d:e8:70",
            "net11": "3a:d9:59:5e:e3:65",
            "net12": "1e:d5:eb:88:bb:ed",
            "net13": "86:43:cf:53:47:86",
            "net14": "2e:90:5e:6a:29:2a",
            "net15": "06:3a:82:03:bf:cd",
            "net2": "92:b4:f9:72:0c:2a",
            "net3": "92:19:7b:46:d0:8a",
            "net4": "ea:d0:3b:be:d5:1e",
            "net5": "72:8f:15:56:ea:d2",
            "net6": "62:ac:04:dd:50:7a",
            "net7": "0a:92:58:51:f7:1d",
            "net8": "12:2f:89:15:3e:9d",
            "net9": "ea:c1:52:db:88:6d"
        },
        "tof_1_2_1": {
            "net0": "96:00:6e:0e:9e:89",
            "net1": "1e:f9:29:f1:33:0e",
            "net10": "ca:aa:0e:ed:bb:43",
            "net11": "0a:0b:44:3c:35:53",
            "net12": "36:1c:75:db:8a:15",
            "net13": "42:59:45:74:a0:27",
            "net14": "7e:01:24:6a:f8:f9",
            "net15": "52:c3:ca:86:b8:72",
            "net2": "42:34:b6:67:40:ee",
            "net3": "5a:25:da:be:fa:59",
            "net4": "42:0f:7a:c9:c7:ed",
            "net5": "0a:2a:4f:9f:64:af",
            "net6": "da:3f:06:e7:0d:cb",
            "net7": "ce:13:a7:9f:61:4f",
            "net8": "a2:8c:eb:94:5d:68",
            "net9": "56:32:12:24:6e:8c"
        },
        "tof_1_2_2": {
            "net0": "f2:ca:26:b7:2e:fd",
            "net1": "32:11:d6:79:05:01",
            "net10": "0e:4b:5a:38:ce:23",
            "net11": "b2:14:c0:8e:c4:ed",
            "net12": "b2:89:47:d6:9b:fa",
            "net13": "0e:4c:04:9e:25:fd",
            "net14": "32:e6:55:b9:51:03",
            "net15": "be:f6:4b:5b:9d:f7",
            "net2": "3a:ce:19:87:fd:7c",
            "net3": "c6:27:35:d4:60:a3",
            "net4": "b2:0e:ed:90:7d:a0",
            "net5": "72:42:cd:af:cb:5e",
            "net6": "7e:ae:9d:37:c7:08",
            "net7": "ca:fe:24:03:b1:9d",
            "net8": "c2:af:6d:71:e8:8a",
            "net9": "ce:44:b3:1f:8d:c6"
        },
        "tof_1_2_3": {
            "net0": "de:d6:46:11:7d:58",
            "net1": "ae:90:c0:b9:71:c0",
            "net10": "a2:8a:bb:05:97:0a",
            "net11": "02:45:24:fc:1e:6b",
            "net12": "d2:f2:b5:ae:73:4d",
            "net13": "12:85:7f:ec:45:ee",
            "net14": "de:c6:b9:c8:fe:22",
            "net15": "ce:0e:7f:ad:5a:56",
            "net2": "46:92:e1:f1:40:03",
            "net3": "0e:86:61:ab:ae:7b",
            "net4": "36:e5:1c:b9:10:47",
            "net5": "f2:e5:83:ff:ff:7a",
            "net6": "46:a7:f8:d5:74:06",
            "net7": "c6:82:54:1f:2d:5c",
            "net8": "12:64:fd:bc:37:b7",
            "net9": "86:a9:50:f4:dc:80"
        },
        "tof_1_2_4": {
            "net0": "3a:f0:d9:aa:42:47",
            "net1": "f6:4f:cc:e3:e7:68",
            "net10": "e2:82:72:c5:ce:8e",
            "net11": "82:50:ba:a1:b5:7e",
            "net12": "e6:52:bb:7b:0e:06",
            "net13": "ae:07:95:84:6a:7a",
            "net14": "b2:00:fd:92:6b:cc",
            "net15": "96:51:b1:90:1d:14",
            "net2": "fe:f4:12:86:3d:27",
            "net3": "66:f7:ce:2b:bc:3a",
            "net4": "f6:23:0e:67:bd:15",
            "net5": "76:87:de:cb:b2:b9",
            "net6": "86:14:be:d1:78:ce",
            "net7": "a2:e2:0e:12:a5:1f",
            "net8": "56:02:92:2c:01:28",
            "net9": "5a:0e:69:5b:11:6f"
        },
        "tof_1_2_5": {
            "net0": "da:df:09:ff:66:33",
            "net1": "a6:17:70:ec:da:40",
            "net10": "62:8b:4b:f3:8f:99",
            "net11": "f2:45:e9:1c:ba:36",
            "net12": "6a:dd:4a:39:28:4b",
            "net13": "f6:55:48:ef:d3:ec",
            "net14": "c2:23:5e:2e:ee:f3",
            "net15": "6e:10:7d:c3:d0:5e",
            "net2": "d2:6c:86:62:9e:56",
            "net3": "72:51:62:15:6d:de",
            "net4": "42:80:8d:f7:e7:b9",
            "net5": "9a:70:9d:6a:34:24",
            "net6": "aa:1a:e3:f9:94:dc",
            "net7": "26:50:81:93:2a:42",
            "net8": "a6:b0:88:84:14:b1",
            "net9": "66:f9:1b:2d:42:59"
        },
        "tof_1_2_6": {
            "net0": "d2:74:89:c8:59:ed",
            "net1": "c2:5e:fa:13:b8:76",
            "net10": "fa:22:a9:3a:c3:f7",
            "net11": "ce:1e:87:50:d9:b2",
            "net12": "ae:55:b9:6b:ec:e3",
            "net13": "ae:c1:f8:5e:01:c1",
            "net14": "22:1d:38:b5:a8:67",
            "net15": "6e:f1:bc:28:f6:91",
            "net2": "12:f9:d1:c7:e8:b5",
            "net3": "2a:e6:32:1a:68:85",
            "net4": "da:16:7d:ba:a2:f0",
            "net5": "62:6c:9b:23:f5:d0",
            "net6": "62:45:63:e2:1f:2f",
            "net7": "6e:12:eb:46:8f:20",
            "net8": "82:a3:99:71:65:d5",
            "net9": "d6:d1:d2:dd:eb:d5"
        },
        "tof_1_2_7": {
            "net0": "42:a2:65:f4:bf:17",
            "net1": "4a:7b:ae:9f:4c:ab",
            "net10": "72:f1:1d:4d:59:50",
            "net11": "7e:22:ab:b2:1d:7d",
            "net12": "66:02:ee:a5:c3:4c",
            "net13": "62:18:90:2b:10:ce",
            "net14": "e2:b3:d7:7d:62:31",
            "net15": "4e:e9:91:05:7a:fd",
            "net2": "82:61:60:ab:c2:36",
            "net3": "9a:9c:07:b6:ad:2d",
            "net4": "ae:f7:98:2e:49:ac",
            "net5": "1a:68:a2:76:a5:d5",
            "net6": "ce:e6:1d:f2:3f:33",
            "net7": "aa:01:2d:56:48:36",
            "net8": "26:a4:f0:a7:4e:71",
            "net9": "86:75:31:ec:12:ca"
        },
        "tof_1_2_8": {
            "net0": "26:5f:ea:27:e9:f6",
            "net1": "e2:80:9c:0d:d1:91",
            "net10": "ba:a3:a3:69:c2:76",
            "net11": "d2:ee:27:25:f8:b3",
            "net12": "92:12:86:7f:2b:21",
            "net13": "8e:af:27:be:fe:71",
            "net14": "b2:10:b8:f7:5a:ff",
            "net15": "ee:38:14:94:d3:49",
            "net2": "ae:41:6a:8e:60:4c",
            "net3": "4e:d1:6d:53:39:bb",
            "net4": "2e:b1:84:57:b4:bc",
            "net5": "ca:65:fb:7c:1e:c1",
            "net6": "12:04:b2:dc:c7:49",
            "net7": "42:5e:b1:1c:52:27",
            "net8": "0e:49:8f:5b:39:91",
            "net9": "0e:64:70:42:84:70"
        },
        "tof_2_2_1": {
            "net0": "02:c0:31:07:bb:4b",
            "net1": "fe:f7:0a:36:39:3a",
            "net10": "ae:59:38:89:18:ce",
            "net11": "f2:9c:37:7b:a7:e2",
            "net12": "5e:8f:e3:fc:ee:eb",
            "net13": "be:81:30:ee:15:d7",
            "net14": "ae:ed:19:33:42:bf",
            "net15": "66:33:88:c6:cd:45",
            "net2": "b2:da:57:28:f3:bd",
            "net3": "2a:94:8f:20:29:e1",
            "net4": "fa:4e:4a:46:60:f9",
            "net5": "aa:3c:1f:0d:36:36",
            "net6": "f2:2d:57:eb:1f:44",
            "net7": "6e:7f:a2:db:05:68",
            "net8": "3a:5e:ec:09:47:42",
            "net9": "5a:82:11:58:40:b8"
        },
        "tof_2_2_2": {
            "net0": "9a:6d:1e:03:53:b1",
            "net1": "9a:9b:cd:30:ea:de",
            "net10": "ba:ce:5e:b3:be:a5",
            "net11": "9e:85:04:a1:8c:a5",
            "net12": "9e:8b:d4:fb:cf:92",
            "net13": "82:63:7c:e0:1b:64",
            "net14": "a6:7b:12:01:2a:d0",
            "net15": "3a:e5:14:36:84:17",
            "net2": "5e:36:a3:05:63:46",
            "net3": "9a:cf:02:a5:f2:1c",
            "net4": "f6:ec:00:39:b9:2b",
            "net5": "92:75:08:af:87:3b",
            "net6": "96:33:4c:1f:26:ff",
            "net7": "7e:ba:d1:81:9b:28",
            "net8": "ee:4f:73:43:32:7d",
            "net9": "96:07:6e:4e:ab:86"
        },
        "tof_2_2_3": {
            "net0": "ce:a8:37:99:f0:b7",
            "net1": "0a:16:f0:59:e8:a3",
            "net10": "4e:6a:27:2c:5c:84",
            "net11": "66:45:e4:cf:91:02",
            "net12": "ce:55:a5:82:d2:97",
            "net13": "0a:f9:9a:52:e3:44",
            "net14": "0e:c4:d1:c0:2f:75",
            "net15": "7e:c9:37:a0:96:87",
            "net2": "1e:8f:c2:71:41:5a",
            "net3": "5a:92:0c:fb:00:29",
            "net4": "6e:39:cb:30:58:f2",
            "net5": "ba:d3:70:e8:f3:76",
            "net6": "76:26:6f:d7:81:e2",
            "net7": "5a:93:07:e1:3f:cd",
            "net8": "62:a6:bd:07:c8:39",
            "net9": "36:e6:27:e1:47:6c"
        },
        "tof_2_2_4": {
            "net0": "ca:b8:37:79:99:8f",
            "net1": "9a:f6:80:54:97:60",
            "net10": "ae:70:0b:63:d3:eb",
            "net11": "5e:91:2f:7e:a2:cb",
            "net12": "da:7b:c8:11:9f:6b",
            "net13": "36:86:69:df:15:da",
            "net14": "4a:d4:de:14:bc:cc",
            "net15": "32:03:55:62:02:8a",
            "net2": "c2:96:72:26:67:e3",
            "net3": "72:50:d1:9d:6a:f6",
            "net4": "86:13:c9:ed:5a:8a",
            "net5": "92:14:f4:1e:52:7f",
            "net6": "42:95:8a:9c:fa:f2",
            "net7": "1e:34:b6:d2:99:a2",
            "net8": "2a:80:34:6d:bc:70",
            "net9": "42:46:24:7e:84:ac"
        },
        "tof_2_2_5": {
            "net0": "06:25:f7:95:0c:7b",
            "net1": "e6:47:ea:d9:d6:a0",
            "net10": "16:d1:e3:7f:0c:79",
            "net11": "42:96:f9:41:98:ed",
            "net12": "0a:0b:7a:1f:05:61",
            "net13": "ce:43:44:27:f6:91",
            "net14": "ea:71:d3:4d:c4:78",
            "net15": "06:6c:55:fe:0c:4c",
            "net2": "a2:4c:73:3e:5f:7c",
            "net3": "06:54:b0:c8:4b:2a",
            "net4": "f6:b3:99:50:5a:c2",
            "net5": "06:fb:02:78:1a:fc",
            "net6": "52:c3:95:24:21:52",
            "net7": "56:01:8e:ed:d8:41",
            "net8": "de:46:2f:09:18:aa",
            "net9": "2e:5a:c3:90:0f:ea"
        },
        "tof_2_2_6": {
            "net0": "02:c9:15:37:3f:66",
            "net1": "5e:46:55:30:4d:16",
            "net10": "c6:4c:0a:e5:5e:52",
            "net11": "4a:4c:0f:fd:af:02",
            "net12": "b2:ea:7d:2b:c7:7c",
            "net13": "f6:2e:5e:e1:65:48",
            "net14": "ce:b5:11:10:8a:c8",
            "net15": "7e:e5:1d:f3:ec:d3",
            "net2": "b2:34:42:2c:ec:8a",
            "net3": "6e:02:2c:ed:8f:0e",
            "net4": "b6:b1:2c:04:3c:3e",
            "net5": "8e:ce:38:68:bb:81",
            "net6": "c6:93:09:dc:1f:2c",
            "net7": "b2:8a:3b:9e:08:d4",
            "net8": "7e:18:e4:91:23:0a",
            "net9": "e6:59:70:2b:fb:4d"
        },
        "tof_2_2_7": {
            "net0": "5e:a4:49:69:70:f8",
            "net1": "12:da:10:16:d6:da",
            "net10": "8e:42:29:ca:cf:fd",
            "net11": "c6:e1:2f:36:25:8b",
            "net12": "d6:3d:19:c9:93:a4",
            "net13": "fa:92:6b:f9:9c:b0",
            "net14": "8e:97:d1:eb:4c:79",
            "net15": "6e:ea:b2:39:63:d0",
            "net2": "fe:84:df:8b:dd:4a",
            "net3": "0e:11:cf:d4:68:30",
            "net4": "62:42:4d:a3:26:dd",
            "net5": "da:ba:f8:ee:48:b2",
            "net6": "9e:90:8a:9e:78:de",
            "net7": "ae:7d:0a:cc:7e:88",
            "net8": "22:24:08:25:1d:b9",
            "net9": "16:db:58:5c:0a:ba"
        },
        "tof_2_2_8": {
            "net0": "06:cd:72:e7:7e:42",
            "net1": "a2:87:de:08:70:e0",
            "net10": "ce:29:b1:8b:64:08",
            "net11": "5a:04:0c:92:62:a9",
            "net12": "4e:6d:b1:72:cb:4f",
            "net13": "ba:f9:34:0c:ae:4e",
            "net14": "a6:cd:2f:eb:33:24",
            "net15": "8a:03:bd:17:84:e8",
            "net2": "4e:21:56:3b:da:ce",
            "net3": "f2:3f:bc:71:c3:00",
            "net4": "b6:ba:79:44:46:99",
            "net5": "b2:e0:f6:b1:90:e8",
            "net6": "72:3a:50:57:b3:3a",
            "net7": "ea:5f:2d:9a:13:91",
            "net8": "1e:3d:e6:f9:ec:c3",
            "net9": "22:76:d7:aa:5d:a3"
        }
    },
    "failed_machine": "leaf_1_0_1",
    "failed_interfaces": [
        "net0"
    ],
    "failure_time": 1613560373.3431473
}