{
    "k_leaf": 8,
    "k_top": 8,
    "redundancy_factor": 4,
    "is_k8s": true,
    "machine_mac_addresses": {
        "leaf_1_0_1": {
            "net0": "26:c6:b8:bc:11:a0",
            "net1": "56:76:55:d5:5a:1d",
            "net2": "6a:ee:c2:65:5d:e3",
            "net3": "1e:b3:16:73:f6:65",
            "net4": "4e:d6:51:56:6d:94",
            "net5": "ce:39:02:d8:b1:12",
            "net6": "72:56:2a:68:66:42",
            "net7": "2e:67:db:8a:91:83",
            "net8": "8e:7e:07:92:fe:50"
        },
        "leaf_1_0_2": {
            "net0": "d2:06:dd:62:36:d2",
            "net1": "36:db:fd:8e:bf:8f",
            "net2": "a2:e6:c5:47:b0:79",
            "net3": "b2:37:1f:5c:fa:81",
            "net4": "9e:5d:c3:f0:20:10",
            "net5": "8a:55:05:6d:20:f8",
            "net6": "66:96:c0:c2:06:22",
            "net7": "42:20:c1:6a:54:6b",
            "net8": "22:06:20:3d:5d:4b"
        },
        "leaf_1_0_3": {
            "net0": "72:be:ee:75:44:26",
            "net1": "0e:bb:0e:fb:4f:8a",
            "net2": "32:69:18:a3:07:e8",
            "net3": "96:c5:1c:f3:01:c4",
            "net4": "46:b1:18:df:8f:ba",
            "net5": "6e:e4:7d:ae:9d:8a",
            "net6": "ae:cc:a2:d6:f1:81",
            "net7": "6e:9b:a6:be:16:9f",
            "net8": "6e:ae:2a:5a:3f:01"
        },
        "leaf_1_0_4": {
            "net0": "56:66:a4:1e:98:15",
            "net1": "c2:95:0d:18:c6:6a",
            "net2": "72:6d:17:e7:3e:9f",
            "net3": "86:dc:f5:da:7a:14",
            "net4": "f2:40:b2:02:ef:0f",
            "net5": "ee:69:b2:c8:8f:69",
            "net6": "1a:5f:64:6e:6b:6c",
            "net7": "ea:49:2f:ef:ff:82",
            "net8": "d6:b2:71:b8:90:95"
        },
        "leaf_1_0_5": {
            "net0": "fe:36:e9:3f:5e:17",
            "net1": "0a:c8:aa:b8:8e:f4",
            "net2": "22:fc:47:3c:96:06",
            "net3": "b2:fb:73:09:dd:b1",
            "net4": "f6:a0:2c:9c:43:8a",
            "net5": "32:14:6a:ed:38:ec",
            "net6": "06:20:10:25:a8:5e",
            "net7": "16:23:cb:57:44:fd",
            "net8": "16:79:b1:fc:c3:48"
        },
        "leaf_1_0_6": {
            "net0": "f6:77:b4:4c:6d:13",
            "net1": "32:a2:a7:19:79:3f",
            "net2": "ae:61:25:50:8a:16",
            "net3": "f6:ab:90:c1:ab:eb",
            "net4": "c2:cc:7e:20:6c:8f",
            "net5": "fe:b2:8d:54:03:88",
            "net6": "16:0d:94:d8:5b:0a",
            "net7": "5a:e0:3b:c8:88:06",
            "net8": "76:32:c4:71:8b:42"
        },
        "leaf_1_0_7": {
            "net0": "0a:b1:ac:23:73:e2",
            "net1": "ba:54:b6:22:bb:94",
            "net2": "f2:2a:44:c6:db:65",
            "net3": "02:da:40:f0:28:0d",
            "net4": "7e:2b:bf:9f:05:3b",
            "net5": "fa:32:c6:e7:6a:cb",
            "net6": "82:68:a2:7a:40:3d",
            "net7": "ae:86:de:79:ea:f2",
            "net8": "76:4c:06:31:1c:f0"
        },
        "leaf_1_0_8": {
            "net0": "b2:dd:71:6a:2c:79",
            "net1": "7e:3d:d8:aa:1f:49",
            "net2": "a2:08:3b:0e:34:af",
            "net3": "4a:48:7f:6d:59:3a",
            "net4": "5a:95:82:62:29:41",
            "net5": "be:8f:3b:59:eb:66",
            "net6": "fa:2b:23:7f:34:4e",
            "net7": "3a:21:80:84:e4:e9",
            "net8": "8e:52:b8:a9:9e:13"
        },
        "leaf_2_0_1": {
            "net0": "de:fa:40:63:dc:93",
            "net1": "3e:61:fc:03:fc:49",
            "net2": "0e:33:c9:54:fd:9d",
            "net3": "ba:21:63:f0:0f:ce",
            "net4": "36:fc:7d:cc:37:b5",
            "net5": "36:04:3a:f2:10:64",
            "net6": "0a:33:9e:e0:ba:ba",
            "net7": "1a:7e:ee:fa:04:39",
            "net8": "8a:f0:df:9f:87:6b"
        },
        "leaf_2_0_2": {
            "net0": "f2:b5:0e:d2:56:eb",
            "net1": "ee:2b:38:15:e6:0f",
            "net2": "4a:6a:3a:34:e2:3c",
            "net3": "de:66:00:06:84:38",
            "net4": "6a:27:a6:48:68:d3",
            "net5": "8e:bf:88:08:c2:67",
            "net6": "2e:00:eb:ec:c8:c5",
            "net7": "c2:e6:aa:7d:11:8a",
            "net8": "a6:f8:c8:50:34:ee"
        },
        "leaf_2_0_3": {
            "net0": "d6:51:46:87:b9:b5",
            "net1": "f2:b9:8d:d1:0c:4d",
            "net2": "7e:f3:d9:8e:7d:d3",
            "net3": "52:df:f9:0b:53:5f",
            "net4": "e6:bb:1d:eb:cd:c2",
            "net5": "aa:f0:8a:08:00:0d",
            "net6": "ee:d8:fd:63:b8:5b",
            "net7": "42:46:7f:4f:af:08",
            "net8": "66:5e:c1:85:91:ab"
        },
        "leaf_2_0_4": {
            "net0": "6e:5e:58:1b:16:cb",
            "net1": "5e:ff:0d:85:39:b1",
            "net2": "1a:30:4d:19:85:1a",
            "net3": "82:52:7c:63:1a:89",
            "net4": "b2:fc:1e:a7:f0:47",
            "net5": "d2:f9:b1:fc:20:63",
            "net6": "76:5d:cf:74:2a:5b",
            "net7": "72:a4:df:f1:a5:2c",
            "net8": "7e:57:e4:e4:07:a1"
        },
        "leaf_2_0_5": {
            "net0": "02:a2:c1:19:01:fe",
            "net1": "3a:6d:52:d8:99:10",
            "net2": "56:7d:dc:95:1d:00",
            "net3": "4e:b9:f5:e5:73:8b",
            "net4": "6e:10:d9:11:a4:3d",
            "net5": "4e:6a:5b:b8:7c:80",
            "net6": "82:12:de:5d:a4:f0",
            "net7": "ae:c4:67:4e:c6:bc",
            "net8": "be:a4:04:a6:13:0f"
        },
        "leaf_2_0_6": {
            "net0": "36:1b:cd:17:e1:37",
            "net1": "86:ae:89:b8:36:47",
            "net2": "1e:2f:0a:af:92:7c",
            "net3": "06:e0:69:86:9b:5f",
            "net4": "32:9b:24:fc:00:9c",
            "net5": "92:32:2f:c8:35:96",
            "net6": "c6:35:72:5d:1a:cb",
            "net7": "8a:ef:f2:c7:80:21",
            "net8": "ee:4e:34:31:69:07"
        },
        "leaf_2_0_7": {
            "net0": "82:52:d2:28:1d:12",
            "net1": "7e:08:da:b8:9f:dc",
            "net2": "72:41:fa:62:0a:2b",
            "net3": "f6:2a:78:c7:fd:3b",
            "net4": "32:3c:cc:cd:6b:b2",
            "net5": "aa:19:95:6b:23:21",
            "net6": "1e:09:1c:c4:76:d1",
            "net7": "1e:01:e3:67:26:48",
            "net8": "82:fe:3e:8c:2f:a3"
        },
        "leaf_2_0_8": {
            "net0": "aa:c9:e8:b4:9b:d2",
            "net1": "ee:ef:cf:6c:8c:f4",
            "net2": "a2:61:7a:84:f3:4c",
            "net3": "e2:43:6c:4f:5a:42",
            "net4": "1e:c0:8c:32:21:84",
            "net5": "92:4c:9c:01:3a:a9",
            "net6": "de:fa:2f:48:b4:22",
            "net7": "92:e1:a2:f2:06:8f",
            "net8": "8e:3a:84:18:31:64"
        },
        "leaf_3_0_1": {
            "net0": "9a:59:fe:59:25:f7",
            "net1": "da:13:35:ef:3b:e3",
            "net2": "ba:43:3f:ae:9f:37",
            "net3": "c6:6c:e4:58:59:8b",
            "net4": "06:6f:0b:90:e0:10",
            "net5": "4e:d1:58:eb:c8:13",
            "net6": "3a:19:93:d2:32:ad",
            "net7": "d6:ca:56:34:fe:99",
            "net8": "16:86:4c:e0:03:42"
        },
        "leaf_3_0_2": {
            "net0": "62:15:cc:25:82:3f",
            "net1": "16:10:94:ad:a5:4b",
            "net2": "b6:58:6c:a2:26:d8",
            "net3": "ee:cd:47:e7:44:d4",
            "net4": "9a:7f:46:a4:ba:4c",
            "net5": "fa:98:18:e2:15:da",
            "net6": "3e:b0:f2:67:ab:70",
            "net7": "3e:91:86:84:61:d5",
            "net8": "ba:b9:66:8a:04:e7"
        },
        "leaf_3_0_3": {
            "net0": "fe:1e:4d:87:78:d1",
            "net1": "6a:c0:51:38:75:f5",
            "net2": "72:42:a6:6f:d1:fc",
            "net3": "06:d7:f4:60:74:1a",
            "net4": "9a:73:d3:26:86:6e",
            "net5": "ae:98:4e:c1:d3:50",
            "net6": "d2:26:e5:96:1e:2d",
            "net7": "62:6c:0d:03:ab:90",
            "net8": "86:f7:18:8b:3d:50"
        },
        "leaf_3_0_4": {
            "net0": "82:53:09:32:bc:b6",
            "net1": "e6:08:d9:1d:c7:f1",
            "net2": "ca:09:8a:78:6c:3e",
            "net3": "12:63:5d:80:64:3a",
            "net4": "ea:3e:51:60:b1:f1",
            "net5": "1e:d1:f5:74:a7:d5",
            "net6": "72:4a:5a:64:cc:57",
            "net7": "f2:4f:8d:09:82:ae",
            "net8": "62:bc:b6:ce:09:af"
        },
        "leaf_3_0_5": {
            "net0": "7a:2e:16:1d:48:00",
            "net1": "5a:28:f1:03:b3:a2",
            "net2": "96:62:b6:e0:7b:a7",
            "net3": "f2:ff:f4:d3:70:da",
            "net4": "42:03:68:7a:52:f1",
            "net5": "66:4c:0a:fc:67:27",
            "net6": "5e:db:b7:44:43:e0",
            "net7": "2a:a7:46:65:41:2f",
            "net8": "8e:f9:65:f5:9a:ab"
        },
        "leaf_3_0_6": {
            "net0": "7e:b2:f5:ba:f6:5c",
            "net1": "66:61:2b:cf:78:4f",
            "net2": "fa:c2:5c:59:d7:b1",
            "net3": "fe:03:73:68:1b:69",
            "net4": "86:fb:0c:82:33:0d",
            "net5": "32:ed:20:7b:83:15",
            "net6": "3e:b5:63:f2:11:d2",
            "net7": "3e:0a:4a:07:96:e8",
            "net8": "ca:b6:ee:fa:ea:a9"
        },
        "leaf_3_0_7": {
            "net0": "7a:0c:46:6e:bf:19",
            "net1": "72:f6:67:39:50:fd",
            "net2": "ee:6f:8c:fd:77:c6",
            "net3": "a2:7f:12:27:5c:12",
            "net4": "9a:24:9f:16:d4:6d",
            "net5": "ca:c3:01:cd:38:38",
            "net6": "92:b4:05:40:3e:5b",
            "net7": "66:d9:94:40:bb:fe",
            "net8": "42:ad:85:da:64:0b"
        },
        "leaf_3_0_8": {
            "net0": "be:93:6c:d5:be:98",
            "net1": "3a:c2:97:9b:27:d7",
            "net2": "3a:2b:1d:cd:cd:64",
            "net3": "52:bd:6d:15:c6:57",
            "net4": "e2:c2:62:b2:fb:92",
            "net5": "62:00:a2:5f:59:ab",
            "net6": "76:86:c1:16:22:e3",
            "net7": "7e:d2:74:12:c5:db",
            "net8": "82:28:29:73:b9:71"
        },
        "leaf_4_0_1": {
            "net0": "6a:5d:99:d8:7b:2c",
            "net1": "d2:ee:2d:51:71:42",
            "net2": "b2:0a:1f:fc:9e:da",
            "net3": "aa:11:70:b9:14:fd",
            "net4": "2e:49:5d:bd:09:62",
            "net5": "5a:29:27:94:26:b6",
            "net6": "8e:a0:1c:17:32:f1",
            "net7": "8e:bd:25:af:a3:cb",
            "net8": "82:b8:89:44:cf:c9"
        },
        "leaf_4_0_2": {
            "net0": "8a:c2:29:14:c5:3f",
            "net1": "5a:05:84:2a:55:0f",
            "net2": "ae:ea:b6:4a:38:ae",
            "net3": "12:50:15:7d:3d:87",
            "net4": "fe:16:a7:4e:dc:b3",
            "net5": "06:97:6a:3f:ac:19",
            "net6": "8e:f1:dc:0a:1e:6c",
            "net7": "be:24:85:68:ab:8b",
            "net8": "de:51:f0:91:ca:62"
        },
        "leaf_4_0_3": {
            "net0": "32:ee:87:f9:16:ff",
            "net1": "62:e1:f8:15:72:11",
            "net2": "b2:70:bb:ab:7d:12",
            "net3": "fe:d5:bc:04:e3:9a",
            "net4": "de:f0:11:c3:44:43",
            "net5": "76:31:4d:8f:f4:55",
            "net6": "4e:4e:c0:67:f5:ec",
            "net7": "86:96:f6:4d:87:5a",
            "net8": "36:cf:ce:38:77:2e"
        },
        "leaf_4_0_4": {
            "net0": "76:cb:2c:bf:44:4e",
            "net1": "da:d4:53:09:15:16",
            "net2": "fa:7e:0f:bf:86:c4",
            "net3": "ba:58:4c:d6:5d:5e",
            "net4": "5e:e5:14:e5:05:51",
            "net5": "6e:28:5e:be:1f:48",
            "net6": "5a:a8:1f:de:8d:4e",
            "net7": "2e:c0:de:59:24:85",
            "net8": "f2:f9:40:3c:5c:c3"
        },
        "leaf_4_0_5": {
            "net0": "d2:d3:e9:f2:df:2a",
            "net1": "42:b0:1b:08:7e:d3",
            "net2": "3e:27:bc:6e:87:84",
            "net3": "96:1a:3e:d2:8c:f4",
            "net4": "5e:ce:b8:c7:6b:72",
            "net5": "66:2d:1d:2b:24:cb",
            "net6": "da:da:42:87:d6:08",
            "net7": "b2:58:f7:69:04:e1",
            "net8": "c2:18:d5:df:a7:a1"
        },
        "leaf_4_0_6": {
            "net0": "aa:ba:3a:7c:de:c0",
            "net1": "ee:4e:f7:fb:88:0d",
            "net2": "f2:6d:6a:b3:f5:ca",
            "net3": "1a:a9:57:50:c9:e7",
            "net4": "2e:6e:78:8f:b1:ca",
            "net5": "6a:c5:66:3b:eb:26",
            "net6": "aa:ee:c7:7a:08:78",
            "net7": "ca:25:7a:3e:83:4b",
            "net8": "ce:7d:bb:32:fd:09"
        },
        "leaf_4_0_7": {
            "net0": "32:04:1d:0c:89:6f",
            "net1": "72:5f:b8:bc:a2:fb",
            "net2": "96:84:f7:1e:64:a0",
            "net3": "92:1d:7f:39:24:c7",
            "net4": "3e:93:1d:3a:d5:4d",
            "net5": "a2:1a:59:87:d8:e8",
            "net6": "a6:3c:df:fb:15:d9",
            "net7": "4a:ae:66:b9:aa:9f",
            "net8": "26:5c:0b:9d:fd:17"
        },
        "leaf_4_0_8": {
            "net0": "16:b2:4d:0e:b8:75",
            "net1": "5a:c3:12:d6:6d:5c",
            "net2": "1a:15:3e:0e:ae:8f",
            "net3": "36:39:35:cf:c8:d7",
            "net4": "66:23:30:96:46:12",
            "net5": "fa:f0:d0:78:ad:bf",
            "net6": "4e:d8:e4:75:a6:7a",
            "net7": "3e:78:7e:b3:3d:48",
            "net8": "06:b4:f4:4b:4f:02"
        },
        "spine_1_1_1": {
            "net0": "de:3f:0a:51:fb:68",
            "net1": "46:4c:cf:39:06:3f",
            "net10": "9e:e1:7b:c1:df:1b",
            "net11": "1e:0b:5e:b2:d7:bc",
            "net12": "fa:f2:eb:38:e1:5b",
            "net13": "72:99:03:dd:4f:da",
            "net14": "12:18:ec:ec:94:db",
            "net15": "f2:74:c9:e9:0f:f2",
            "net2": "8e:05:6b:c7:d9:17",
            "net3": "3a:4b:67:4b:0d:21",
            "net4": "26:e3:75:26:9a:8a",
            "net5": "76:a0:31:79:20:09",
            "net6": "16:68:b5:e5:72:95",
            "net7": "96:c3:62:a3:4f:02",
            "net8": "46:c2:45:b8:f2:9a",
            "net9": "1a:a5:05:3a:cb:10"
        },
        "spine_1_1_2": {
            "net0": "32:ba:ed:89:c4:a1",
            "net1": "1e:2a:2f:3b:66:e2",
            "net10": "1e:ac:52:48:3b:d4",
            "net11": "5e:a0:f0:cf:c5:11",
            "net12": "56:85:a1:4d:73:07",
            "net13": "5a:0e:d4:81:d9:3b",
            "net14": "42:a9:74:9b:97:b6",
            "net15": "a6:33:a0:4e:ef:87",
            "net2": "7a:ee:ef:99:08:13",
            "net3": "06:cd:03:aa:80:80",
            "net4": "92:f4:36:d1:7e:c3",
            "net5": "86:75:df:ba:32:9e",
            "net6": "9e:21:2e:86:20:05",
            "net7": "8a:35:9d:cb:dc:0c",
            "net8": "ee:55:6d:ce:2f:fc",
            "net9": "32:48:61:f9:5b:b9"
        },
        "spine_1_1_3": {
            "net0": "e6:2e:b3:57:ed:a9",
            "net1": "3a:27:e8:42:0b:3e",
            "net10": "d2:bf:bc:9a:09:32",
            "net11": "0e:d1:b0:e6:8d:2a",
            "net12": "36:13:f1:04:b9:d3",
            "net13": "aa:3d:6e:f6:27:08",
            "net14": "6e:99:8a:bd:d1:9e",
            "net15": "32:7e:57:de:d7:de",
            "net2": "06:87:d0:e0:16:ee",
            "net3": "2a:25:a7:5f:9e:74",
            "net4": "3a:e2:33:73:2c:2c",
            "net5": "da:c3:95:25:5f:57",
            "net6": "fa:c4:ad:0a:c9:5b",
            "net7": "b6:a8:93:8c:01:07",
            "net8": "62:2c:49:78:68:a1",
            "net9": "a6:f1:3a:90:3d:07"
        },
        "spine_1_1_4": {
            "net0": "e2:d7:a7:05:78:b4",
            "net1": "a2:64:35:8c:3c:9d",
            "net10": "a2:6e:88:40:2d:38",
            "net11": "fe:af:44:c7:15:c5",
            "net12": "7a:db:91:30:e1:48",
            "net13": "9a:7a:11:c3:e6:70",
            "net14": "6a:33:b2:39:b2:92",
            "net15": "ae:16:c1:7b:b9:96",
            "net2": "1e:79:ba:d1:c3:0a",
            "net3": "26:e1:d2:9f:13:01",
            "net4": "da:1e:a5:14:8f:a6",
            "net5": "aa:86:13:43:61:45",
            "net6": "62:1a:dc:2a:46:5b",
            "net7": "62:c3:ca:3a:d0:c7",
            "net8": "26:7c:de:6d:46:7d",
            "net9": "ba:05:3c:4a:05:bd"
        },
        "spine_1_1_5": {
            "net0": "7e:ed:26:75:b8:69",
            "net1": "26:b4:f4:ce:f4:5a",
            "net10": "3a:d4:d6:33:97:db",
            "net11": "8a:f0:e1:4e:be:3f",
            "net12": "b2:c7:46:40:e8:21",
            "net13": "1e:9d:94:8f:53:2a",
            "net14": "5a:70:9a:7a:f1:a1",
            "net15": "02:2e:33:38:ff:53",
            "net2": "3a:11:96:4e:13:78",
            "net3": "1e:30:bd:78:4c:8a",
            "net4": "22:7a:4d:62:01:74",
            "net5": "b2:d2:1b:68:9b:74",
            "net6": "8e:eb:56:3c:6c:af",
            "net7": "3e:36:99:54:dc:ce",
            "net8": "1e:10:09:15:e8:a7",
            "net9": "ee:e4:24:b8:30:3d"
        },
        "spine_1_1_6": {
            "net0": "96:3f:b9:b7:e5:2e",
            "net1": "8e:a8:86:6a:8d:6e",
            "net10": "fa:bd:4b:d3:ab:5c",
            "net11": "5a:49:cb:12:cf:e4",
            "net12": "ce:62:1d:c4:33:79",
            "net13": "02:3b:62:e2:34:50",
            "net14": "ce:71:7f:8a:ff:16",
            "net15": "f6:f8:03:81:36:ab",
            "net2": "c2:84:2f:02:6f:b1",
            "net3": "4e:96:09:3f:4b:7a",
            "net4": "e6:51:bc:fa:ae:68",
            "net5": "ee:6f:e7:63:7a:b7",
            "net6": "4a:f5:76:78:92:f1",
            "net7": "6a:ab:63:9d:9d:a5",
            "net8": "c6:24:ae:80:99:8c",
            "net9": "c2:c9:4f:e7:bf:08"
        },
        "spine_1_1_7": {
            "net0": "06:92:9e:ff:56:ed",
            "net1": "8a:e4:1e:12:e5:fd",
            "net10": "72:97:fc:e1:9e:71",
            "net11": "d6:8a:7b:28:88:07",
            "net12": "aa:bf:c7:4b:f5:9d",
            "net13": "ba:d9:4d:66:6c:2c",
            "net14": "42:bc:15:aa:f4:5b",
            "net15": "3e:ea:2e:94:a6:64",
            "net2": "02:eb:62:e5:95:b3",
            "net3": "8e:25:23:b4:29:14",
            "net4": "42:9f:22:29:be:7c",
            "net5": "66:cb:73:f2:b4:59",
            "net6": "d2:9f:e6:da:c6:09",
            "net7": "06:3c:37:c9:ff:26",
            "net8": "52:82:9f:3f:2d:66",
            "net9": "c6:5d:d7:96:b0:95"
        },
        "spine_1_1_8": {
            "net0": "d6:83:09:27:e6:34",
            "net1": "7a:8d:df:af:be:38",
            "net10": "12:cd:3e:2f:b3:60",
            "net11": "56:4d:f7:c8:80:88",
            "net12": "9a:0b:9f:16:24:4a",
            "net13": "12:b3:33:b4:17:5e",
            "net14": "9a:0e:03:a8:15:5e",
            "net15": "f6:3f:6e:f3:8c:4d",
            "net2": "f6:bb:dc:dd:d1:82",
            "net3": "6e:50:1e:eb:08:f4",
            "net4": "1a:f5:f3:9f:af:c7",
            "net5": "9e:66:41:6c:01:07",
            "net6": "5a:b6:cc:aa:8b:98",
            "net7": "2e:08:06:05:5b:46",
            "net8": "92:28:81:29:52:73",
            "net9": "ea:9f:cf:c7:15:08"
        },
        "spine_2_1_1": {
            "net0": "de:45:33:48:b0:51",
            "net1": "2e:ea:06:45:9c:65",
            "net10": "8e:6d:98:a8:1c:87",
            "net11": "76:ee:3c:2b:f7:fd",
            "net12": "b6:1f:f2:af:a0:8a",
            "net13": "fe:df:07:34:4c:5d",
            "net14": "12:fc:49:5c:00:f4",
            "net15": "66:d4:fc:42:23:d3",
            "net2": "86:5f:49:6b:cb:a3",
            "net3": "7e:e6:3c:78:da:ef",
            "net4": "9a:51:16:24:85:65",
            "net5": "66:05:9e:e2:8b:99",
            "net6": "c6:88:5e:5c:22:fc",
            "net7": "96:11:b7:f7:5d:ec",
            "net8": "4e:18:d2:81:8b:02",
            "net9": "4e:53:5a:aa:24:1d"
        },
        "spine_2_1_2": {
            "net0": "32:b9:e6:0c:4b:06",
            "net1": "4a:a8:06:b3:fc:38",
            "net10": "72:97:87:5f:34:8c",
            "net11": "ee:31:86:e7:a6:03",
            "net12": "66:d7:80:11:30:52",
            "net13": "1a:7e:56:06:46:3c",
            "net14": "b6:45:b8:60:65:cb",
            "net15": "ca:27:c8:7d:b2:63",
            "net2": "a6:9d:fd:e1:43:dc",
            "net3": "12:49:76:54:e0:4b",
            "net4": "f2:80:c8:99:ae:23",
            "net5": "96:dc:20:0d:57:a4",
            "net6": "92:82:d8:b9:d8:37",
            "net7": "7e:15:59:8a:8d:75",
            "net8": "76:b5:71:bf:6e:fe",
            "net9": "6e:f8:d4:ac:6b:4e"
        },
        "spine_2_1_3": {
            "net0": "a6:96:28:a7:d8:de",
            "net1": "ea:54:de:11:09:b4",
            "net10": "6e:fe:10:34:20:46",
            "net11": "3e:70:0a:9f:b9:09",
            "net12": "9a:c0:cf:25:aa:0a",
            "net13": "9a:8e:ef:6a:20:1e",
            "net14": "22:7f:01:0b:1d:2e",
            "net15": "aa:53:06:92:49:ca",
            "net2": "96:28:93:64:cb:8d",
            "net3": "aa:14:fd:a4:3c:f4",
            "net4": "86:81:12:f0:82:4a",
            "net5": "ca:ed:16:a7:9a:c1",
            "net6": "fe:7d:d4:df:06:96",
            "net7": "52:48:f6:a4:ca:8c",
            "net8": "c2:3d:f4:11:c3:74",
            "net9": "42:bd:26:e9:67:9f"
        },
        "spine_2_1_4": {
            "net0": "5a:d8:18:20:58:c2",
            "net1": "a6:b1:f6:d1:8b:47",
            "net10": "d2:aa:10:38:b2:27",
            "net11": "96:07:f7:ea:62:d7",
            "net12": "fe:fc:1f:34:17:f5",
            "net13": "16:7e:97:70:8a:b9",
            "net14": "5e:6d:a2:0a:3f:23",
            "net15": "82:9f:6a:bc:48:9f",
            "net2": "62:64:9e:73:da:9f",
            "net3": "7a:83:2e:16:8c:52",
            "net4": "6e:16:e9:b5:48:67",
            "net5": "e2:f4:7a:67:b0:77",
            "net6": "62:6c:23:df:4b:50",
            "net7": "0a:c8:de:a4:22:23",
            "net8": "f2:c1:f7:58:ed:94",
            "net9": "e6:0e:05:60:05:fb"
        },
        "spine_2_1_5": {
            "net0": "c6:7d:50:e2:c3:30",
            "net1": "1e:0d:9e:ab:ce:eb",
            "net10": "4a:e1:ea:4a:bc:19",
            "net11": "ea:7e:90:ce:58:35",
            "net12": "8e:db:b3:7f:3c:26",
            "net13": "36:4c:62:15:1e:bb",
            "net14": "46:9b:8d:a2:73:92",
            "net15": "9e:6a:bf:89:96:35",
            "net2": "26:c6:8f:5b:e1:ee",
            "net3": "ca:28:2c:be:49:72",
            "net4": "ca:98:0b:65:68:34",
            "net5": "6a:e7:90:b3:7c:c2",
            "net6": "3e:10:9e:c2:7e:36",
            "net7": "f2:1e:92:00:6f:9e",
            "net8": "26:a9:0c:b1:75:11",
            "net9": "e6:47:c9:35:78:f6"
        },
        "spine_2_1_6": {
            "net0": "b6:23:ce:6a:84:66",
            "net1": "7a:43:64:d5:1a:8b",
            "net10": "b2:ee:a8:73:e6:b0",
            "net11": "1e:f5:63:86:49:16",
            "net12": "3a:b4:85:29:f3:ae",
            "net13": "f6:eb:53:92:29:2a",
            "net14": "92:f8:cb:c9:7c:f4",
            "net15": "4a:c6:b8:45:94:6b",
            "net2": "22:e9:05:d7:73:1a",
            "net3": "5e:21:9e:78:8d:f8",
            "net4": "4a:c7:17:ba:63:b1",
            "net5": "b6:ff:fb:e0:78:c6",
            "net6": "0a:49:e0:dd:36:e7",
            "net7": "ca:11:af:5b:91:6b",
            "net8": "e6:33:f3:8b:30:c5",
            "net9": "92:58:dc:db:9b:42"
        },
        "spine_2_1_7": {
            "net0": "b2:10:19:6f:2b:fb",
            "net1": "0a:1b:85:ec:61:87",
            "net10": "b6:4b:51:04:92:de",
            "net11": "ca:b8:8d:08:27:39",
            "net12": "de:34:43:f7:05:55",
            "net13": "56:94:f3:60:44:ae",
            "net14": "06:e4:0c:54:4b:7d",
            "net15": "7e:74:2a:0a:a5:74",
            "net2": "02:52:57:03:da:8b",
            "net3": "16:f9:63:82:71:52",
            "net4": "a2:02:02:f6:0e:2d",
            "net5": "8e:de:ba:48:e5:da",
            "net6": "7e:76:94:cc:b0:a9",
            "net7": "86:e3:48:f2:4d:71",
            "net8": "12:36:44:13:df:fa",
            "net9": "ba:b3:40:19:65:51"
        },
        "spine_2_1_8": {
            "net0": "06:94:a5:1c:7d:92",
            "net1": "fe:af:b2:4f:cc:c0",
            "net10": "42:27:ca:b2:c7:55",
            "net11": "1a:12:f6:e2:cc:80",
            "net12": "c2:22:b7:f4:83:df",
            "net13": "ae:e9:68:86:99:ad",
            "net14": "be:6e:ba:c3:30:c0",
            "net15": "1a:c6:d3:95:25:21",
            "net2": "1e:d2:08:ff:f6:02",
            "net3": "0e:b4:11:76:e0:a4",
            "net4": "a2:7f:3d:83:2b:a9",
            "net5": "62:fa:4b:27:08:e2",
            "net6": "a2:e4:a5:7e:38:22",
            "net7": "5a:1c:34:5f:c5:4f",
            "net8": "c2:6a:32:3d:67:c0",
            "net9": "f6:f2:5e:f9:73:b8"
        },
        "spine_3_1_1": {
            "net0": "4a:68:52:0b:98:08",
            "net1": "6e:5a:ff:c5:1e:e5",
            "net10": "7e:c0:03:37:45:ed",
            "net11": "ba:f3:41:de:8e:ee",
            "net12": "82:8c:53:5d:87:3a",
            "net13": "b2:aa:b0:90:36:fe",
            "net14": "12:f2:24:5a:d3:9a",
            "net15": "e2:c8:22:4a:cf:83",
            "net2": "8e:4a:4e:e8:63:b4",
            "net3": "1a:b3:68:4f:2a:af",
            "net4": "ce:23:78:a6:cd:18",
            "net5": "7a:cd:cb:50:34:b1",
            "net6": "6a:f8:7c:5c:dd:1b",
            "net7": "ae:e8:c9:14:84:2b",
            "net8": "1e:6b:e0:4b:34:5f",
            "net9": "ee:10:36:a6:d6:36"
        },
        "spine_3_1_2": {
            "net0": "d2:05:4e:7d:61:01",
            "net1": "d6:5f:21:21:21:63",
            "net10": "6a:24:02:8f:fd:62",
            "net11": "16:1e:9a:41:94:26",
            "net12": "8a:2e:4b:34:07:7e",
            "net13": "62:b2:77:e5:a3:34",
            "net14": "8a:15:29:df:c7:c6",
            "net15": "7e:3a:f6:5f:c5:f7",
            "net2": "1a:62:62:06:e5:9d",
            "net3": "02:8a:99:ee:51:b0",
            "net4": "a2:41:8f:5f:d4:44",
            "net5": "b6:19:c7:75:2a:f9",
            "net6": "b2:c7:6e:19:be:55",
            "net7": "2a:9d:46:5b:f1:5f",
            "net8": "4a:31:32:2f:9c:da",
            "net9": "36:48:dc:cf:e6:de"
        },
        "spine_3_1_3": {
            "net0": "36:ab:65:ed:47:8d",
            "net1": "a6:83:67:8f:cf:60",
            "net10": "fe:99:90:00:78:62",
            "net11": "de:99:da:b0:e9:b3",
            "net12": "ca:60:49:3b:7f:12",
            "net13": "a2:f8:58:d8:2f:03",
            "net14": "82:b8:ca:8c:f4:b7",
            "net15": "3a:b9:d4:08:aa:a0",
            "net2": "56:cf:45:23:29:22",
            "net3": "8a:8e:9f:5d:a7:e0",
            "net4": "2a:66:57:e8:29:9e",
            "net5": "d2:12:3e:25:04:bf",
            "net6": "c6:2f:eb:53:55:58",
            "net7": "f2:7c:b7:66:3a:c8",
            "net8": "96:d4:5e:8d:51:77",
            "net9": "6e:a6:53:38:39:33"
        },
        "spine_3_1_4": {
            "net0": "66:e1:19:15:4b:f1",
            "net1": "f2:85:88:2e:30:65",
            "net10": "22:56:67:cb:ae:8b",
            "net11": "56:08:8f:2a:90:43",
            "net12": "a2:99:1f:cd:bc:88",
            "net13": "32:45:99:6b:bd:b3",
            "net14": "0a:e6:9e:bf:4e:5d",
            "net15": "2a:23:c6:48:f5:6c",
            "net2": "4a:c3:d1:21:7d:2e",
            "net3": "9a:f0:e6:da:64:c5",
            "net4": "16:e8:62:8d:46:8e",
            "net5": "9a:22:65:1d:0e:60",
            "net6": "de:f3:82:71:8f:57",
            "net7": "5a:21:71:05:45:2b",
            "net8": "12:67:b1:db:05:a7",
            "net9": "e6:6f:42:9b:7b:cc"
        },
        "spine_3_1_5": {
            "net0": "c2:0e:a4:69:c3:8a",
            "net1": "0a:b7:55:16:71:20",
            "net10": "02:af:31:79:78:6a",
            "net11": "8e:d7:54:84:38:95",
            "net12": "ea:9f:2d:c3:3b:dd",
            "net13": "12:76:26:dc:1e:b4",
            "net14": "92:bc:63:ca:47:eb",
            "net15": "aa:b0:38:66:84:d3",
            "net2": "1e:40:a3:04:b4:0b",
            "net3": "46:14:0e:13:43:9f",
            "net4": "b6:b6:c2:87:4b:b6",
            "net5": "2a:f2:a9:e0:41:37",
            "net6": "ca:61:c1:7e:d4:0b",
            "net7": "66:18:14:2e:6a:94",
            "net8": "86:e1:b1:d9:83:0a",
            "net9": "da:48:1b:c1:5a:94"
        },
        "spine_3_1_6": {
            "net0": "b6:c8:01:41:80:20",
            "net1": "82:24:77:6e:67:4d",
            "net10": "42:ed:f6:a1:83:f6",
            "net11": "f2:7b:9c:80:fe:cc",
            "net12": "f2:9f:02:c0:ba:26",
            "net13": "be:a4:20:6a:a5:97",
            "net14": "de:5b:65:a7:2b:17",
            "net15": "ca:35:18:21:cb:be",
            "net2": "76:96:7a:5f:2f:e9",
            "net3": "e6:70:2f:6a:a8:db",
            "net4": "12:81:11:13:7a:e8",
            "net5": "e2:fa:0c:38:4c:45",
            "net6": "0e:3e:f2:cc:1d:a3",
            "net7": "aa:68:c9:92:02:5b",
            "net8": "fa:8f:db:e9:73:5d",
            "net9": "46:0b:36:dd:89:ec"
        },
        "spine_3_1_7": {
            "net0": "f6:d9:0a:4b:d0:8c",
            "net1": "5e:e1:a5:e1:86:f7",
            "net10": "26:a4:ab:87:74:67",
            "net11": "ba:a5:41:78:e1:5e",
            "net12": "56:ef:7e:47:33:6f",
            "net13": "6a:f8:2e:4b:be:5d",
            "net14": "66:da:b0:b4:0d:74",
            "net15": "b6:18:c5:bd:53:18",
            "net2": "ce:a1:f3:7a:b2:ab",
            "net3": "de:21:a1:d8:43:60",
            "net4": "be:b5:90:6e:1b:e9",
            "net5": "7a:7f:23:0c:c5:9c",
            "net6": "c2:a7:35:d3:a2:02",
            "net7": "f2:17:07:6f:c8:93",
            "net8": "76:7f:b3:88:65:10",
            "net9": "4a:c5:c5:ff:2a:6c"
        },
        "spine_3_1_8": {
            "net0": "9a:42:5f:a5:f9:0d",
            "net1": "ea:53:a0:3e:b3:a7",
            "net10": "12:48:1d:07:97:91",
            "net11": "32:24:0c:85:04:d7",
            "net12": "4a:27:88:ba:21:21",
            "net13": "ca:55:1d:08:f1:74",
            "net14": "6a:be:bd:97:c6:fc",
            "net15": "9e:8c:09:6b:95:86",
            "net2": "82:61:bf:01:2a:63",
            "net3": "9e:81:20:f5:d1:29",
            "net4": "3a:78:34:d7:36:36",
            "net5": "e2:a6:89:7a:4e:f0",
            "net6": "ae:05:3d:0c:7c:dc",
            "net7": "b6:71:f1:95:9d:d2",
            "net8": "62:51:21:cb:61:a5",
            "net9": "ee:c2:54:4f:7c:1d"
        },
        "spine_4_1_1": {
            "net0": "6a:34:fe:66:32:55",
            "net1": "c2:e9:63:f1:03:f2",
            "net10": "ea:b5:c0:36:b4:81",
            "net11": "36:1d:a5:4d:fa:f0",
            "net12": "ea:63:4f:09:c2:bb",
            "net13": "46:a5:92:b2:bf:72",
            "net14": "56:7f:24:e9:94:08",
            "net15": "86:a1:0c:3a:0e:0e",
            "net2": "56:40:cf:3d:0a:ed",
            "net3": "5a:15:ab:21:70:ca",
            "net4": "5e:00:ad:54:54:5f",
            "net5": "1e:cc:aa:c5:d9:8e",
            "net6": "26:91:96:e3:2f:fc",
            "net7": "a6:cc:ae:c5:94:2b",
            "net8": "62:4d:fc:aa:d1:b5",
            "net9": "6a:6c:97:78:a3:48"
        },
        "spine_4_1_2": {
            "net0": "82:cc:8a:f8:6f:0b",
            "net1": "0e:f8:ea:a9:58:f0",
            "net10": "5a:49:a8:19:d3:67",
            "net11": "aa:78:ac:0e:c7:29",
            "net12": "36:72:10:85:97:95",
            "net13": "ee:67:d5:84:05:11",
            "net14": "9e:7e:f3:2f:5a:de",
            "net15": "86:66:3f:ad:fe:9e",
            "net2": "b2:37:0d:b8:64:f5",
            "net3": "ae:00:35:1b:b3:d0",
            "net4": "2a:e3:7a:a0:3a:78",
            "net5": "6a:f4:42:ab:60:44",
            "net6": "da:d5:05:79:63:5a",
            "net7": "36:b9:14:43:f9:5f",
            "net8": "86:4e:5d:53:03:8d",
            "net9": "86:b6:33:a6:9f:f0"
        },
        "spine_4_1_3": {
            "net0": "32:d5:0b:5e:6b:d2",
            "net1": "a2:06:df:ec:ce:e9",
            "net10": "6e:32:98:d9:0a:9c",
            "net11": "fa:a0:70:46:2f:d3",
            "net12": "62:7e:e9:9d:60:a3",
            "net13": "26:f8:3f:78:3c:94",
            "net14": "de:d5:b7:ac:d5:db",
            "net15": "3a:d5:b4:13:22:a6",
            "net2": "b2:3d:2c:7b:d9:6b",
            "net3": "b6:83:6d:e5:a0:13",
            "net4": "46:8d:a3:15:95:07",
            "net5": "fa:4f:84:4b:0d:c5",
            "net6": "1e:a2:46:1e:69:31",
            "net7": "3e:89:2d:f1:46:c4",
            "net8": "6a:ab:74:98:9f:40",
            "net9": "32:3e:0e:16:40:09"
        },
        "spine_4_1_4": {
            "net0": "ae:9c:4a:1a:c4:80",
            "net1": "72:6c:ef:48:c5:be",
            "net10": "4a:39:5c:66:39:a6",
            "net11": "16:08:4b:02:23:06",
            "net12": "96:24:3b:5c:f6:81",
            "net13": "c6:5a:4e:d4:62:bb",
            "net14": "ba:59:75:d6:c6:b0",
            "net15": "da:d4:99:ba:7f:ab",
            "net2": "76:c9:64:20:fd:85",
            "net3": "ee:1d:8a:53:ba:84",
            "net4": "c2:83:20:ac:82:43",
            "net5": "3a:6a:f9:44:70:ad",
            "net6": "62:86:4f:6e:d6:35",
            "net7": "2a:f9:ab:b4:79:ba",
            "net8": "6a:d8:19:00:71:88",
            "net9": "da:19:09:c5:d6:0d"
        },
        "spine_4_1_5": {
            "net0": "46:a9:57:be:16:b5",
            "net1": "be:f1:cf:74:c9:a2",
            "net10": "1a:c1:16:08:04:b3",
            "net11": "be:d5:99:95:5f:e5",
            "net12": "ce:8e:7f:d8:d2:12",
            "net13": "f6:1f:f3:00:05:12",
            "net14": "7a:d6:06:b4:dc:b7",
            "net15": "6a:00:87:5f:56:e2",
            "net2": "7a:f8:cb:19:c5:f8",
            "net3": "0a:34:58:11:7d:3c",
            "net4": "06:f8:9e:69:bf:48",
            "net5": "2e:ec:49:13:c3:0a",
            "net6": "9a:85:dd:c0:ea:1f",
            "net7": "1e:04:7a:27:95:83",
            "net8": "8e:30:5f:98:91:84",
            "net9": "0e:a7:f2:a2:33:4f"
        },
        "spine_4_1_6": {
            "net0": "82:b6:4f:da:f4:af",
            "net1": "a2:80:44:63:20:5f",
            "net10": "6e:cd:b3:75:64:5f",
            "net11": "ba:da:80:66:d6:00",
            "net12": "5e:8c:8a:d1:be:ec",
            "net13": "ce:b5:90:77:15:6d",
            "net14": "6a:f3:54:30:09:3b",
            "net15": "a6:c6:21:8b:71:09",
            "net2": "c6:11:c6:76:88:6b",
            "net3": "92:fb:49:4f:f1:04",
            "net4": "5a:ac:04:75:32:06",
            "net5": "9e:ea:fa:45:48:fa",
            "net6": "16:f9:81:7e:d6:6f",
            "net7": "e6:4b:87:bc:08:11",
            "net8": "72:07:90:1e:14:0d",
            "net9": "86:5e:96:6e:30:ce"
        },
        "spine_4_1_7": {
            "net0": "be:12:0f:c5:88:41",
            "net1": "6a:25:92:d8:d5:a3",
            "net10": "96:48:8e:c3:6e:29",
            "net11": "c6:03:16:bb:59:80",
            "net12": "da:3e:c8:74:5b:12",
            "net13": "d6:6d:ba:9d:f0:62",
            "net14": "8e:fd:e5:8b:ca:de",
            "net15": "52:01:1e:0b:77:a4",
            "net2": "66:c4:40:f4:05:9d",
            "net3": "96:aa:02:fd:8c:ad",
            "net4": "a2:11:59:a4:ff:28",
            "net5": "5e:92:56:9d:9f:7e",
            "net6": "66:b9:38:b0:06:e9",
            "net7": "62:7c:2a:ef:fe:be",
            "net8": "f6:97:e4:79:47:f0",
            "net9": "9e:6c:e3:f3:b1:a9"
        },
        "spine_4_1_8": {
            "net0": "d6:7c:7d:f5:dc:b2",
            "net1": "de:0b:fa:e8:91:2f",
            "net10": "5e:fc:89:f5:75:a7",
            "net11": "d2:87:47:de:c3:a4",
            "net12": "3a:db:c6:2e:54:77",
            "net13": "2a:91:9c:49:7f:af",
            "net14": "a2:bf:77:3d:a1:51",
            "net15": "1e:81:38:35:d0:3e",
            "net2": "d6:6c:9f:b6:38:2d",
            "net3": "6e:14:90:2e:3c:8d",
            "net4": "fe:8a:e2:48:a7:37",
            "net5": "ba:e4:bb:db:01:6d",
            "net6": "d6:2e:e2:84:f7:c0",
            "net7": "fe:77:25:9f:59:b7",
            "net8": "de:88:20:ed:96:87",
            "net9": "22:85:4f:29:6c:b5"
        },
        "tof_1_2_1": {
            "net0": "4a:01:b9:fe:fa:90",
            "net1": "72:58:12:75:73:da",
            "net10": "9a:1e:ef:1f:81:b9",
            "net11": "1a:8f:ed:af:e1:d0",
            "net12": "b2:f7:62:0a:c4:e7",
            "net13": "66:11:53:83:8e:cc",
            "net14": "16:67:e2:bd:3d:11",
            "net15": "d6:3a:ce:f5:1e:f7",
            "net2": "56:55:a7:b8:f8:a2",
            "net3": "e2:35:e3:6c:40:47",
            "net4": "b2:c4:6b:03:ea:34",
            "net5": "2e:53:aa:a7:75:7a",
            "net6": "16:de:07:17:50:b4",
            "net7": "12:a4:07:77:0b:ea",
            "net8": "c6:7a:79:bb:00:38",
            "net9": "06:dd:39:5e:75:21"
        },
        "tof_1_2_2": {
            "net0": "9a:03:d2:44:b5:48",
            "net1": "aa:b0:2c:ed:19:1f",
            "net10": "c6:23:b3:b6:41:78",
            "net11": "1e:a1:4f:00:e7:bc",
            "net12": "aa:42:ef:bf:ac:8f",
            "net13": "c6:d8:99:50:92:58",
            "net14": "72:5b:f4:80:59:b2",
            "net15": "66:90:31:ff:ab:4b",
            "net2": "ce:6a:5e:c1:26:79",
            "net3": "6e:e3:19:77:00:af",
            "net4": "22:1a:c8:d7:8d:11",
            "net5": "62:46:64:20:6e:c3",
            "net6": "06:9d:b7:cf:62:97",
            "net7": "86:21:5e:24:26:3e",
            "net8": "2e:2d:68:ab:0b:c4",
            "net9": "fe:d1:e9:5b:b6:4b"
        },
        "tof_1_2_3": {
            "net0": "66:1e:26:49:30:cc",
            "net1": "32:63:1e:54:99:59",
            "net10": "c2:b1:b8:39:88:9f",
            "net11": "62:a4:fa:3d:c2:ac",
            "net12": "4a:b5:6c:78:20:a5",
            "net13": "76:f4:b3:a1:b3:d8",
            "net14": "c2:5a:08:b5:55:d5",
            "net15": "4a:6c:67:85:20:1e",
            "net2": "de:5b:87:a6:7c:d8",
            "net3": "2a:ed:0e:cc:d6:4b",
            "net4": "a6:62:10:a5:50:a9",
            "net5": "02:6e:49:f3:35:13",
            "net6": "aa:c7:66:fc:a4:15",
            "net7": "7e:49:48:33:e6:3e",
            "net8": "26:3b:d6:90:3f:37",
            "net9": "36:6b:3a:b6:29:8a"
        },
        "tof_1_2_4": {
            "net0": "5a:37:22:a6:ff:01",
            "net1": "ce:7b:59:fe:6d:f9",
            "net10": "92:4f:b0:67:22:2b",
            "net11": "92:b7:6b:e6:f5:0b",
            "net12": "ea:48:81:e4:35:03",
            "net13": "32:2d:bb:54:99:ed",
            "net14": "26:8f:8a:96:6a:ce",
            "net15": "2e:c8:9e:95:79:fb",
            "net2": "42:bc:8a:97:fe:3b",
            "net3": "16:ec:c2:51:25:7f",
            "net4": "fe:46:5c:cf:ce:96",
            "net5": "9e:56:b6:46:6b:5c",
            "net6": "76:66:1c:b3:bc:b0",
            "net7": "e2:6b:0f:35:3b:88",
            "net8": "aa:f3:8e:96:19:e1",
            "net9": "be:0d:dd:2c:99:74"
        },
        "tof_1_2_5": {
            "net0": "0a:97:7e:89:5b:98",
            "net1": "be:61:6e:df:36:85",
            "net10": "72:2e:c9:7b:d0:04",
            "net11": "c6:38:6a:c9:52:d0",
            "net12": "0e:55:51:3e:66:a8",
            "net13": "8a:91:23:cc:4e:32",
            "net14": "be:a7:60:72:7f:a7",
            "net15": "ea:96:26:7c:18:31",
            "net2": "f2:52:0e:d2:f4:5e",
            "net3": "7e:73:f9:0f:0c:f6",
            "net4": "8a:ee:13:ee:74:d2",
            "net5": "86:7e:81:f0:ea:6d",
            "net6": "66:4a:ba:0f:c0:4e",
            "net7": "fe:11:fb:c9:2e:a0",
            "net8": "46:a8:ec:57:ac:01",
            "net9": "0e:50:7a:f3:1b:f2"
        },
        "tof_1_2_6": {
            "net0": "3a:c4:43:58:2a:13",
            "net1": "ea:d5:b8:d7:0c:11",
            "net10": "a2:5c:fb:f2:23:f4",
            "net11": "b6:c1:a6:fb:2e:17",
            "net12": "3e:e0:3e:47:6f:6a",
            "net13": "e6:a9:a5:dc:87:01",
            "net14": "42:b4:90:bb:50:04",
            "net15": "66:98:de:95:b3:c6",
            "net2": "f6:a8:bd:c3:0d:de",
            "net3": "02:d1:8f:8e:0c:41",
            "net4": "96:e1:76:49:95:cb",
            "net5": "12:8a:c5:4e:d7:a4",
            "net6": "0e:66:ea:6f:5d:8b",
            "net7": "32:30:2a:6e:6c:1f",
            "net8": "fa:f9:47:24:91:eb",
            "net9": "aa:e5:93:ea:97:18"
        },
        "tof_1_2_7": {
            "net0": "9e:10:88:1d:2f:7f",
            "net1": "fa:90:f0:d4:8b:a3",
            "net10": "be:79:25:a1:29:62",
            "net11": "da:dc:00:da:d5:b7",
            "net12": "d2:c4:30:66:2d:99",
            "net13": "1e:28:17:e9:f5:9d",
            "net14": "c2:b8:fe:72:b9:e7",
            "net15": "92:34:cc:42:98:63",
            "net2": "4a:8e:ab:43:9a:67",
            "net3": "36:44:9f:b8:f5:a9",
            "net4": "fe:0d:15:2b:6d:3e",
            "net5": "46:89:82:a6:7e:93",
            "net6": "26:c0:97:c6:3b:ae",
            "net7": "fe:31:d9:43:52:f3",
            "net8": "26:39:80:dc:7a:e5",
            "net9": "16:9e:a2:df:c4:51"
        },
        "tof_1_2_8": {
            "net0": "6e:e6:45:eb:01:b2",
            "net1": "36:b7:f1:93:0e:43",
            "net10": "c2:87:5a:0b:9b:63",
            "net11": "82:e3:ed:51:f5:23",
            "net12": "16:67:ed:7d:80:fa",
            "net13": "9e:56:75:7d:37:fc",
            "net14": "96:75:16:c2:ef:b6",
            "net15": "a6:2a:6f:c0:dc:69",
            "net2": "3a:fc:ca:00:c6:d6",
            "net3": "de:97:c7:15:89:d4",
            "net4": "26:f8:48:e0:50:f9",
            "net5": "ca:39:c5:c4:29:41",
            "net6": "ce:d9:ae:a1:fd:c3",
            "net7": "32:10:46:1d:25:ff",
            "net8": "9a:0e:da:25:a8:aa",
            "net9": "46:74:4d:e5:10:07"
        },
        "tof_2_2_1": {
            "net0": "de:7c:8f:8d:2e:99",
            "net1": "5a:60:6f:29:ef:8b",
            "net10": "f2:b0:60:54:84:29",
            "net11": "fe:35:20:62:3f:83",
            "net12": "4a:84:9a:4a:f8:c5",
            "net13": "fa:8e:c8:94:26:63",
            "net14": "ca:db:84:2f:e2:af",
            "net15": "8e:c8:af:8b:85:28",
            "net2": "52:79:0f:9d:64:be",
            "net3": "16:7c:83:cb:e8:32",
            "net4": "3e:c5:10:bd:99:b8",
            "net5": "92:ec:f4:71:3b:71",
            "net6": "7e:5d:c9:e2:e2:29",
            "net7": "42:d9:82:6a:a8:4c",
            "net8": "56:12:ec:58:dc:10",
            "net9": "4e:f6:7c:17:43:63"
        },
        "tof_2_2_2": {
            "net0": "82:98:ff:59:eb:58",
            "net1": "86:76:c9:cb:53:80",
            "net10": "da:a4:42:18:a1:ab",
            "net11": "4a:50:e3:0e:b0:fa",
            "net12": "66:39:df:49:b3:30",
            "net13": "d6:8e:3e:b4:1e:3b",
            "net14": "ea:6a:93:97:f7:88",
            "net15": "86:c8:e2:0f:77:0c",
            "net2": "1e:7b:76:6c:dc:57",
            "net3": "0e:38:70:07:05:4a",
            "net4": "36:19:4f:67:c4:df",
            "net5": "ea:97:ca:70:6a:4f",
            "net6": "22:59:e0:00:a0:e3",
            "net7": "ba:31:97:18:68:2d",
            "net8": "32:46:7d:26:f7:b6",
            "net9": "e2:b8:c2:04:78:d7"
        },
        "tof_2_2_3": {
            "net0": "a2:3b:f8:34:ef:22",
            "net1": "9a:6d:c7:05:8d:43",
            "net10": "de:5f:88:83:6f:a4",
            "net11": "d2:46:ec:85:14:c1",
            "net12": "8e:53:15:0a:24:08",
            "net13": "2a:2f:fb:1f:9a:30",
            "net14": "32:be:75:2e:fd:42",
            "net15": "6a:d9:92:86:8a:98",
            "net2": "fa:6f:1f:23:5e:5e",
            "net3": "66:97:52:44:2c:92",
            "net4": "3a:9e:a4:6f:f8:2f",
            "net5": "82:4e:d5:a1:d0:b8",
            "net6": "aa:7a:02:c5:ee:32",
            "net7": "5e:ba:d3:68:08:04",
            "net8": "76:87:00:4a:49:d4",
            "net9": "b6:cd:9e:27:cd:d4"
        },
        "tof_2_2_4": {
            "net0": "a2:8e:f8:9d:c7:bf",
            "net1": "f6:c8:76:fe:0e:c7",
            "net10": "1e:d0:8a:90:1e:1a",
            "net11": "2a:06:69:87:32:d5",
            "net12": "82:14:30:35:3b:9f",
            "net13": "b6:98:84:65:1b:f4",
            "net14": "ce:67:fc:4a:62:18",
            "net15": "36:5c:8e:7d:c8:e1",
            "net2": "26:31:6a:d4:fe:59",
            "net3": "1e:6f:d3:bc:95:9a",
            "net4": "3e:e5:06:11:25:45",
            "net5": "72:c3:d6:9c:11:39",
            "net6": "2a:d6:1b:3d:da:40",
            "net7": "de:75:10:f6:19:d5",
            "net8": "6e:a5:2f:48:2a:52",
            "net9": "3e:a0:1b:23:2f:3a"
        },
        "tof_2_2_5": {
            "net0": "be:56:9e:6a:42:c2",
            "net1": "9e:48:e6:44:eb:37",
            "net10": "5e:e7:67:2b:bb:48",
            "net11": "9a:27:d4:04:c0:f1",
            "net12": "ee:9b:e7:a3:8b:49",
            "net13": "f2:b5:99:c4:0d:aa",
            "net14": "3e:b0:13:7d:2d:b2",
            "net15": "62:06:b0:6a:70:af",
            "net2": "4e:b9:e2:12:67:a9",
            "net3": "f2:56:d1:53:ea:9d",
            "net4": "26:1f:fe:65:c3:53",
            "net5": "a6:50:d9:e9:8c:ff",
            "net6": "9e:9a:c3:ec:0a:66",
            "net7": "ae:a4:11:c5:93:7c",
            "net8": "56:76:e5:b4:84:4c",
            "net9": "22:fa:78:d2:78:f2"
        },
        "tof_2_2_6": {
            "net0": "9e:1c:86:cd:5a:9f",
            "net1": "ea:18:e2:29:8a:d6",
            "net10": "0e:37:ad:e5:e7:e5",
            "net11": "0a:b6:4a:d5:6b:91",
            "net12": "62:fd:19:6d:45:d4",
            "net13": "42:dd:86:85:08:22",
            "net14": "d2:2d:65:74:c9:5a",
            "net15": "c2:b2:2f:81:96:8e",
            "net2": "32:83:91:cd:ff:c5",
            "net3": "ae:3e:8c:d5:dd:cc",
            "net4": "b6:1c:13:52:61:12",
            "net5": "82:61:46:6b:4b:64",
            "net6": "a6:14:5f:5b:75:19",
            "net7": "4a:de:bc:c9:51:31",
            "net8": "c2:15:c4:24:75:fd",
            "net9": "d6:6c:3a:96:93:22"
        },
        "tof_2_2_7": {
            "net0": "be:59:b9:63:f1:74",
            "net1": "36:91:fb:e2:e1:35",
            "net10": "52:56:ae:8c:bc:08",
            "net11": "1a:ff:4c:37:7e:45",
            "net12": "f2:c1:e6:d6:27:26",
            "net13": "c6:fa:e8:c0:23:97",
            "net14": "b6:f2:82:38:8e:ab",
            "net15": "b6:57:1e:cd:c4:1e",
            "net2": "26:03:3f:a0:66:f0",
            "net3": "12:a2:8b:ba:ef:68",
            "net4": "36:fa:91:d6:62:4d",
            "net5": "ea:7c:e5:78:cf:15",
            "net6": "fe:0c:06:2b:e5:6c",
            "net7": "12:17:9c:a7:ad:09",
            "net8": "12:2a:fa:a1:e0:85",
            "net9": "72:d9:9b:2d:f4:3f"
        },
        "tof_2_2_8": {
            "net0": "ea:ec:bd:be:a2:e8",
            "net1": "56:3f:3a:f5:2b:23",
            "net10": "a6:87:c4:3d:0f:f6",
            "net11": "82:80:ac:8c:e8:02",
            "net12": "0e:e8:b4:17:43:b4",
            "net13": "92:26:d6:f3:b0:58",
            "net14": "0a:5f:8a:42:30:ae",
            "net15": "8a:62:f3:46:d3:8b",
            "net2": "12:ca:16:5d:6a:b9",
            "net3": "f6:74:94:e3:2b:a4",
            "net4": "ea:15:91:ff:40:6c",
            "net5": "fe:b2:3e:56:3c:e0",
            "net6": "7e:36:d5:3e:9d:8a",
            "net7": "be:46:d9:aa:8b:be",
            "net8": "02:d0:ae:d7:a7:b6",
            "net9": "9e:58:c1:5e:92:2c"
        }
    },
    "failed_machine": "tof_1_2_1",
    "failure_time": {
        "leaf_1_0_1": 1636470035.709262,
        "leaf_1_0_2": 1636470034.6456292,
        "leaf_1_0_3": 1636470034.6670008,
        "leaf_1_0_4": 1636470034.6951518,
        "leaf_1_0_5": 1636470034.7090118,
        "leaf_1_0_6": 1636470034.7189367,
        "leaf_1_0_7": 1636470034.7508042,
        "leaf_1_0_8": 1636470034.8231232,
        "leaf_2_0_1": 1636470034.8349478,
        "leaf_2_0_2": 1636470035.9452844,
        "leaf_2_0_3": 1636470034.6224358,
        "leaf_2_0_4": 1636470034.6358945,
        "leaf_2_0_5": 1636470034.6659813,
        "leaf_2_0_6": 1636470034.694143,
        "leaf_2_0_7": 1636470034.7103798,
        "leaf_2_0_8": 1636470034.7192523,
        "leaf_3_0_1": 1636470035.8277628,
        "leaf_3_0_2": 1636470034.7725286,
        "leaf_3_0_3": 1636470034.8282416,
        "leaf_3_0_4": 1636470034.8368466,
        "leaf_3_0_5": 1636470034.8594189,
        "leaf_3_0_6": 1636470034.8680327,
        "leaf_3_0_7": 1636470034.880172,
        "leaf_3_0_8": 1636470034.8916013,
        "leaf_4_0_1": 1636470034.8995712,
        "leaf_4_0_2": 1636470034.9264796,
        "leaf_4_0_3": 1636470034.9344583,
        "leaf_4_0_4": 1636470034.959805,
        "leaf_4_0_5": 1636470034.9696393,
        "leaf_4_0_6": 1636470034.9921856,
        "leaf_4_0_7": 1636470034.866926,
        "leaf_4_0_8": 1636470034.879073,
        "spine_1_1_1": 1636470034.889741,
        "spine_1_1_2": 1636470034.8951678,
        "spine_1_1_3": 1636470035.9915,
        "spine_1_1_4": 1636470034.9300075,
        "spine_1_1_5": 1636470034.9397266,
        "spine_1_1_6": 1636470034.9518106,
        "spine_1_1_7": 1636470036.0908792,
        "spine_1_1_8": 1636470035.034467,
        "spine_2_1_1": 1636470035.0069923,
        "spine_2_1_2": 1636470035.0383894,
        "spine_2_1_3": 1636470035.0593083,
        "spine_2_1_4": 1636470035.0783238,
        "spine_2_1_5": 1636470035.098906,
        "spine_2_1_6": 1636470035.1143894,
        "spine_2_1_7": 1636470036.2155752,
        "spine_2_1_8": 1636470035.1369884,
        "spine_3_1_1": 1636470035.2023196,
        "spine_3_1_2": 1636470035.216263,
        "spine_3_1_3": 1636470035.0476534,
        "spine_3_1_4": 1636470035.0686545,
        "spine_3_1_5": 1636470035.0807528,
        "spine_3_1_6": 1636470035.1038961,
        "spine_3_1_7": 1636470036.2086651,
        "spine_3_1_8": 1636470035.1482399,
        "spine_4_1_1": 1636470035.1760652,
        "spine_4_1_2": 1636470035.1999786,
        "spine_4_1_3": 1636470036.3235962,
        "spine_4_1_4": 1636470035.247719,
        "spine_4_1_5": 1636470035.2420433,
        "spine_4_1_6": 1636470036.3471947,
        "spine_4_1_7": 1636470036.3711774,
        "spine_4_1_8": 1636470035.2950265,
        "tof_1_2_1": 1636470035.3225577,
        "tof_1_2_2": 1636470035.3378139,
        "tof_1_2_3": 1636470035.356193,
        "tof_1_2_4": 1636470036.457423,
        "tof_1_2_5": 1636470035.3943503,
        "tof_1_2_6": 1636470035.453584,
        "tof_1_2_7": 1636470035.280126,
        "tof_1_2_8": 1636470035.2869465,
        "tof_2_2_1": 1636470036.4017417,
        "tof_2_2_2": 1636470035.3355615,
        "tof_2_2_3": 1636470035.347056,
        "tof_2_2_4": 1636470035.35861,
        "tof_2_2_5": 1636470035.3705869,
        "tof_2_2_6": 1636470035.4141793,
        "tof_2_2_7": 1636470035.439467,
        "tof_2_2_8": 1636470035.450568
    },
    "recover_time": {
        "leaf_1_0_1": 1636470093.80297,
        "leaf_1_0_2": 1636470092.7374017,
        "leaf_1_0_3": 1636470092.754932,
        "leaf_1_0_4": 1636470092.7669005,
        "leaf_1_0_5": 1636470092.782854,
        "leaf_1_0_6": 1636470092.791699,
        "leaf_1_0_7": 1636470092.829259,
        "leaf_1_0_8": 1636470092.8546546,
        "leaf_2_0_1": 1636470092.8969612,
        "leaf_2_0_2": 1636470094.0037472,
        "leaf_2_0_3": 1636470092.7306209,
        "leaf_2_0_4": 1636470092.7420175,
        "leaf_2_0_5": 1636470092.7573168,
        "leaf_2_0_6": 1636470092.7684846,
        "leaf_2_0_7": 1636470092.7856445,
        "leaf_2_0_8": 1636470092.821454,
        "leaf_3_0_1": 1636470093.9455333,
        "leaf_3_0_2": 1636470092.872636,
        "leaf_3_0_3": 1636470092.90341,
        "leaf_3_0_4": 1636470092.9187438,
        "leaf_3_0_5": 1636470092.9497054,
        "leaf_3_0_6": 1636470092.9716506,
        "leaf_3_0_7": 1636470092.979145,
        "leaf_3_0_8": 1636470093.039544,
        "leaf_4_0_1": 1636470093.0716894,
        "leaf_4_0_2": 1636470093.096332,
        "leaf_4_0_3": 1636470093.129128,
        "leaf_4_0_4": 1636470093.1624374,
        "leaf_4_0_5": 1636470093.1733353,
        "leaf_4_0_6": 1636470093.1854007,
        "leaf_4_0_7": 1636470092.9483287,
        "leaf_4_0_8": 1636470092.977932,
        "spine_1_1_1": 1636470093.026487,
        "spine_1_1_2": 1636470093.0480802,
        "spine_1_1_3": 1636470094.1576319,
        "spine_1_1_4": 1636470093.0836408,
        "spine_1_1_5": 1636470093.095475,
        "spine_1_1_6": 1636470093.1051202,
        "spine_1_1_7": 1636470094.2234766,
        "spine_1_1_8": 1636470093.1494057,
        "spine_2_1_1": 1636470093.1610563,
        "spine_2_1_2": 1636470093.1737275,
        "spine_2_1_3": 1636470093.1882522,
        "spine_2_1_4": 1636470093.2010303,
        "spine_2_1_5": 1636470093.2079957,
        "spine_2_1_6": 1636470093.2425718,
        "spine_2_1_7": 1636470094.3593879,
        "spine_2_1_8": 1636470093.2815347,
        "spine_3_1_1": 1636470093.2919037,
        "spine_3_1_2": 1636470093.3071682,
        "spine_3_1_3": 1636470093.1988678,
        "spine_3_1_4": 1636470093.204847,
        "spine_3_1_5": 1636470093.231696,
        "spine_3_1_6": 1636470093.256533,
        "spine_3_1_7": 1636470094.3629327,
        "spine_3_1_8": 1636470093.2831538,
        "spine_4_1_1": 1636470093.2945688,
        "spine_4_1_2": 1636470093.3058097,
        "spine_4_1_3": 1636470094.4029253,
        "spine_4_1_4": 1636470093.3420327,
        "spine_4_1_5": 1636470093.3403704,
        "spine_4_1_6": 1636470094.4370492,
        "spine_4_1_7": 1636470094.4640555,
        "spine_4_1_8": 1636470093.3948352,
        "tof_1_2_2": 1636470093.417014,
        "tof_1_2_3": 1636470093.4325657,
        "tof_1_2_4": 1636470094.5474818,
        "tof_1_2_5": 1636470093.482905,
        "tof_1_2_6": 1636470093.4999273,
        "tof_1_2_7": 1636470093.515543,
        "tof_1_2_8": 1636470093.3713799,
        "tof_2_2_1": 1636470094.4748478,
        "tof_2_2_2": 1636470093.4030762,
        "tof_2_2_3": 1636470093.4142618,
        "tof_2_2_4": 1636470093.4269361,
        "tof_2_2_5": 1636470093.4622915,
        "tof_2_2_6": 1636470093.4830644,
        "tof_2_2_7": 1636470093.5100663,
        "tof_2_2_8": 1636470093.5437136,
        "tof_1_2_1": 1636470111.56249
    }
}