{
    "k_leaf": 2,
    "k_top": 2,
    "redundancy_factor": 2,
    "is_k8s": true,
    "failed_machine": "leaf_1_0_1",
    "failure_time": {
        "leaf_1_0_1": 1622465374.1297991,
        "leaf_1_0_2": 1622465374.1399195,
        "leaf_2_0_1": 1622465374.1293387,
        "leaf_2_0_2": 1622465374.1365728,
        "spine_1_1_1": 1622465374.1444516,
        "spine_1_1_2": 1622465374.150647,
        "spine_2_1_1": 1622465374.1479423,
        "spine_2_1_2": 1622465374.1546075,
        "tof_1_2_1": 1622465374.1587262,
        "tof_1_2_2": 1622465374.1686778
    },
    "packet_count": {
        "total": [
            28,
            756
        ],
        "leaf_2_0_2": {
            "total": [
                2,
                54
            ],
            "net0": {
                "total": [
                    1,
                    27
                ],
                "withdrawn": [
                    1,
                    27
                ]
            },
            "net1": {
                "total": [
                    1,
                    27
                ],
                "withdrawn": [
                    1,
                    27
                ]
            }
        },
        "leaf_2_0_1": {
            "total": [
                2,
                54
            ],
            "net0": {
                "total": [
                    1,
                    27
                ],
                "withdrawn": [
                    1,
                    27
                ]
            },
            "net1": {
                "total": [
                    1,
                    27
                ],
                "withdrawn": [
                    1,
                    27
                ]
            }
        },
        "tof_1_2_1": {
            "total": [
                4,
                108
            ],
            "net0": {
                "total": [
                    1,
                    27
                ],
                "withdrawn": [
                    1,
                    27
                ]
            },
            "net1": {
                "total": [
                    1,
                    27
                ],
                "withdrawn": [
                    1,
                    27
                ]
            },
            "net2": {
                "total": [
                    1,
                    27
                ],
                "withdrawn": [
                    1,
                    27
                ]
            },
            "net3": {
                "total": [
                    1,
                    27
                ],
                "withdrawn": [
                    1,
                    27
                ]
            }
        },
        "tof_1_2_2": {
            "total": [
                4,
                108
            ],
            "net0": {
                "total": [
                    1,
                    27
                ],
                "withdrawn": [
                    1,
                    27
                ]
            },
            "net1": {
                "total": [
                    1,
                    27
                ],
                "withdrawn": [
                    1,
                    27
                ]
            },
            "net2": {
                "total": [
                    1,
                    27
                ],
                "withdrawn": [
                    1,
                    27
                ]
            },
            "net3": {
                "total": [
                    1,
                    27
                ],
                "withdrawn": [
                    1,
                    27
                ]
            }
        },
        "leaf_1_0_2": {
            "total": [
                2,
                54
            ],
            "net0": {
                "total": [
                    1,
                    27
                ],
                "withdrawn": [
                    1,
                    27
                ]
            },
            "net1": {
                "total": [
                    1,
                    27
                ],
                "withdrawn": [
                    1,
                    27
                ]
            }
        },
        "spine_2_1_2": {
            "total": [
                4,
                108
            ],
            "net0": {
                "total": [
                    1,
                    27
                ],
                "withdrawn": [
                    1,
                    27
                ]
            },
            "net1": {
                "total": [
                    1,
                    27
                ],
                "withdrawn": [
                    1,
                    27
                ]
            },
            "net2": {
                "total": [
                    1,
                    27
                ],
                "withdrawn": [
                    1,
                    27
                ]
            },
            "net3": {
                "total": [
                    1,
                    27
                ],
                "withdrawn": [
                    1,
                    27
                ]
            }
        },
        "spine_1_1_2": {
            "total": [
                3,
                81
            ],
            "net1": {
                "total": [
                    1,
                    27
                ],
                "withdrawn": [
                    1,
                    27
                ]
            },
            "net2": {
                "total": [
                    1,
                    27
                ],
                "withdrawn": [
                    1,
                    27
                ]
            },
            "net3": {
                "total": [
                    1,
                    27
                ],
                "withdrawn": [
                    1,
                    27
                ]
            }
        },
        "spine_1_1_1": {
            "total": [
                3,
                81
            ],
            "net1": {
                "total": [
                    1,
                    27
                ],
                "withdrawn": [
                    1,
                    27
                ]
            },
            "net2": {
                "total": [
                    1,
                    27
                ],
                "withdrawn": [
                    1,
                    27
                ]
            },
            "net3": {
                "total": [
                    1,
                    27
                ],
                "withdrawn": [
                    1,
                    27
                ]
            }
        },
        "spine_2_1_1": {
            "total": [
                4,
                108
            ],
            "net0": {
                "total": [
                    1,
                    27
                ],
                "withdrawn": [
                    1,
                    27
                ]
            },
            "net1": {
                "total": [
                    1,
                    27
                ],
                "withdrawn": [
                    1,
                    27
                ]
            },
            "net2": {
                "total": [
                    1,
                    27
                ],
                "withdrawn": [
                    1,
                    27
                ]
            },
            "net3": {
                "total": [
                    1,
                    27
                ],
                "withdrawn": [
                    1,
                    27
                ]
            }
        }
    },
    "packets_by_collision_domain": {
        "AAAG": 2,
        "AAAI": 2,
        "AAAQ": 2,
        "AAAS": 2,
        "AAAH": 2,
        "AAAJ": 2,
        "AAAR": 2,
        "AAAT": 2,
        "AAAD": 2,
        "AAAE": 2,
        "AAAK": 2,
        "AAAL": 2,
        "AAAN": 2,
        "AAAO": 2
    },
    "blast_radius": {
        "by_collision_domain": {
            "AAAE": [
                1,
                2
            ],
            "AAAI": [
                1,
                2
            ],
            "AAAJ": [
                1,
                2
            ],
            "AAAD": [
                1,
                2
            ],
            "AAAG": [
                1,
                2
            ],
            "AAAH": [
                1,
                2
            ],
            "AAAR": [
                2,
                2
            ],
            "AAAT": [
                2,
                2
            ],
            "AAAQ": [
                2,
                2
            ],
            "AAAS": [
                2,
                2
            ],
            "AAAK": [
                3,
                2
            ],
            "AAAN": [
                3,
                2
            ],
            "AAAL": [
                3,
                2
            ],
            "AAAO": [
                3,
                2
            ]
        },
        "by_distance": {
            "1": 12,
            "2": 8,
            "3": 8
        }
    },
    "radius_graph": {
        "nodes": [
            {
                "id": "leaf_1_0_1",
                "label": "leaf_1_0_1"
            },
            {
                "id": "leaf_2_0_1",
                "label": "leaf_2_0_1"
            },
            {
                "id": "tof_1_2_2",
                "label": "tof_1_2_2"
            },
            {
                "id": "tof_1_2_1",
                "label": "tof_1_2_1"
            },
            {
                "id": "spine_2_1_1",
                "label": "spine_2_1_1"
            },
            {
                "id": "spine_1_1_2",
                "label": "spine_1_1_2"
            },
            {
                "id": "leaf_2_0_2",
                "label": "leaf_2_0_2"
            },
            {
                "id": "spine_2_1_2",
                "label": "spine_2_1_2"
            },
            {
                "id": "leaf_1_0_2",
                "label": "leaf_1_0_2"
            },
            {
                "id": "spine_1_1_1",
                "label": "spine_1_1_1"
            }
        ],
        "links": [
            {
                "source": "tof_1_2_1",
                "target": "spine_1_1_1",
                "value": 2,
                "label": "AAAG"
            },
            {
                "source": "tof_1_2_1",
                "target": "spine_1_1_2",
                "value": 2,
                "label": "AAAI"
            },
            {
                "source": "tof_1_2_1",
                "target": "spine_2_1_1",
                "value": 2,
                "label": "AAAQ"
            },
            {
                "source": "tof_1_2_1",
                "target": "spine_2_1_2",
                "value": 2,
                "label": "AAAS"
            },
            {
                "source": "tof_1_2_2",
                "target": "spine_1_1_1",
                "value": 2,
                "label": "AAAH"
            },
            {
                "source": "tof_1_2_2",
                "target": "spine_1_1_2",
                "value": 2,
                "label": "AAAJ"
            },
            {
                "source": "tof_1_2_2",
                "target": "spine_2_1_1",
                "value": 2,
                "label": "AAAR"
            },
            {
                "source": "tof_1_2_2",
                "target": "spine_2_1_2",
                "value": 2,
                "label": "AAAT"
            },
            {
                "source": "leaf_1_0_1",
                "target": "spine_1_1_1",
                "value": 0,
                "label": "AAAA"
            },
            {
                "source": "leaf_1_0_1",
                "target": "spine_1_1_2",
                "value": 0,
                "label": "AAAB"
            },
            {
                "source": "leaf_1_0_2",
                "target": "spine_1_1_1",
                "value": 2,
                "label": "AAAD"
            },
            {
                "source": "leaf_1_0_2",
                "target": "spine_1_1_2",
                "value": 2,
                "label": "AAAE"
            },
            {
                "source": "spine_1_1_1",
                "target": "leaf_1_0_1",
                "value": 0,
                "label": "AAAA"
            },
            {
                "source": "spine_1_1_1",
                "target": "leaf_1_0_2",
                "value": 2,
                "label": "AAAD"
            },
            {
                "source": "spine_1_1_1",
                "target": "tof_1_2_1",
                "value": 2,
                "label": "AAAG"
            },
            {
                "source": "spine_1_1_1",
                "target": "tof_1_2_2",
                "value": 2,
                "label": "AAAH"
            },
            {
                "source": "spine_1_1_2",
                "target": "leaf_1_0_1",
                "value": 0,
                "label": "AAAB"
            },
            {
                "source": "spine_1_1_2",
                "target": "leaf_1_0_2",
                "value": 2,
                "label": "AAAE"
            },
            {
                "source": "spine_1_1_2",
                "target": "tof_1_2_1",
                "value": 2,
                "label": "AAAI"
            },
            {
                "source": "spine_1_1_2",
                "target": "tof_1_2_2",
                "value": 2,
                "label": "AAAJ"
            },
            {
                "source": "leaf_2_0_1",
                "target": "spine_2_1_1",
                "value": 2,
                "label": "AAAK"
            },
            {
                "source": "leaf_2_0_1",
                "target": "spine_2_1_2",
                "value": 2,
                "label": "AAAL"
            },
            {
                "source": "leaf_2_0_2",
                "target": "spine_2_1_1",
                "value": 2,
                "label": "AAAN"
            },
            {
                "source": "leaf_2_0_2",
                "target": "spine_2_1_2",
                "value": 2,
                "label": "AAAO"
            },
            {
                "source": "spine_2_1_1",
                "target": "leaf_2_0_1",
                "value": 2,
                "label": "AAAK"
            },
            {
                "source": "spine_2_1_1",
                "target": "leaf_2_0_2",
                "value": 2,
                "label": "AAAN"
            },
            {
                "source": "spine_2_1_1",
                "target": "tof_1_2_1",
                "value": 2,
                "label": "AAAQ"
            },
            {
                "source": "spine_2_1_1",
                "target": "tof_1_2_2",
                "value": 2,
                "label": "AAAR"
            },
            {
                "source": "spine_2_1_2",
                "target": "leaf_2_0_1",
                "value": 2,
                "label": "AAAL"
            },
            {
                "source": "spine_2_1_2",
                "target": "leaf_2_0_2",
                "value": 2,
                "label": "AAAO"
            },
            {
                "source": "spine_2_1_2",
                "target": "tof_1_2_1",
                "value": 2,
                "label": "AAAS"
            },
            {
                "source": "spine_2_1_2",
                "target": "tof_1_2_2",
                "value": 2,
                "label": "AAAT"
            }
        ]
    },
    "max_number_of_rounds": 4,
    "packets_per_round": {
        "0": 0,
        "1": 6,
        "2": 10,
        "3": 8,
        "4": 4
    },
    "round_graph": {
        "nodes": [
            {
                "id": "leaf_1_0_1",
                "label": "leaf_1_0_1"
            },
            {
                "id": "spine_1_1_1-2",
                "label": "spine_1_1_1-2"
            },
            {
                "id": "tof_1_2_1-1",
                "label": "tof_1_2_1-1"
            },
            {
                "id": "leaf_2_0_1-3",
                "label": "leaf_2_0_1-3"
            },
            {
                "id": "spine_2_1_1-2",
                "label": "spine_2_1_1-2"
            },
            {
                "id": "spine_1_1_2-2",
                "label": "spine_1_1_2-2"
            },
            {
                "id": "spine_2_1_2-4",
                "label": "spine_2_1_2-4"
            },
            {
                "id": "spine_2_1_1-4",
                "label": "spine_2_1_1-4"
            },
            {
                "id": "spine_1_1_1-0",
                "label": "spine_1_1_1-0"
            },
            {
                "id": "spine_2_1_2-2",
                "label": "spine_2_1_2-2"
            },
            {
                "id": "tof_1_2_2-1",
                "label": "tof_1_2_2-1"
            },
            {
                "id": "spine_1_1_2-0",
                "label": "spine_1_1_2-0"
            },
            {
                "id": "leaf_1_0_2-1",
                "label": "leaf_1_0_2-1"
            },
            {
                "id": "tof_1_2_2-3",
                "label": "tof_1_2_2-3"
            },
            {
                "id": "leaf_2_0_2-3",
                "label": "leaf_2_0_2-3"
            },
            {
                "id": "tof_1_2_1-3",
                "label": "tof_1_2_1-3"
            }
        ],
        "links": [
            {
                "source": "leaf_1_0_1",
                "target": "spine_1_1_2-0",
                "value": 0
            },
            {
                "source": "leaf_1_0_1",
                "target": "spine_1_1_1-0",
                "value": 0
            },
            {
                "source": "spine_1_1_2-0",
                "target": "leaf_1_0_2-1",
                "value": 1,
                "label": [
                    {
                        "time": 1622465375.691507,
                        "type": "Update (WD)",
                        "WD Routes": "200.0.0.0/24"
                    }
                ]
            },
            {
                "source": "spine_1_1_2-0",
                "target": "tof_1_2_1-1",
                "value": 1,
                "label": [
                    {
                        "time": 1622465375.691636,
                        "type": "Update (WD)",
                        "WD Routes": "200.0.0.0/24"
                    }
                ]
            },
            {
                "source": "spine_1_1_2-0",
                "target": "tof_1_2_2-1",
                "value": 1,
                "label": [
                    {
                        "time": 1622465375.691775,
                        "type": "Update (WD)",
                        "WD Routes": "200.0.0.0/24"
                    }
                ]
            },
            {
                "source": "spine_1_1_1-0",
                "target": "leaf_1_0_2-1",
                "value": 1,
                "label": [
                    {
                        "time": 1622465375.692126,
                        "type": "Update (WD)",
                        "WD Routes": "200.0.0.0/24"
                    }
                ]
            },
            {
                "source": "spine_1_1_1-0",
                "target": "tof_1_2_1-1",
                "value": 1,
                "label": [
                    {
                        "time": 1622465375.692292,
                        "type": "Update (WD)",
                        "WD Routes": "200.0.0.0/24"
                    }
                ]
            },
            {
                "source": "spine_1_1_1-0",
                "target": "tof_1_2_2-1",
                "value": 1,
                "label": [
                    {
                        "time": 1622465375.692344,
                        "type": "Update (WD)",
                        "WD Routes": "200.0.0.0/24"
                    }
                ]
            },
            {
                "source": "leaf_1_0_2-1",
                "target": "spine_1_1_1-2",
                "value": 1,
                "label": [
                    {
                        "time": 1622465375.742317,
                        "type": "Update (WD)",
                        "WD Routes": "200.0.0.0/24"
                    }
                ]
            },
            {
                "source": "leaf_1_0_2-1",
                "target": "spine_1_1_2-2",
                "value": 1,
                "label": [
                    {
                        "time": 1622465375.742362,
                        "type": "Update (WD)",
                        "WD Routes": "200.0.0.0/24"
                    }
                ]
            },
            {
                "source": "tof_1_2_1-1",
                "target": "spine_1_1_1-2",
                "value": 1,
                "label": [
                    {
                        "time": 1622465375.743222,
                        "type": "Update (WD)",
                        "WD Routes": "200.0.0.0/24"
                    }
                ]
            },
            {
                "source": "tof_1_2_1-1",
                "target": "spine_1_1_2-2",
                "value": 1,
                "label": [
                    {
                        "time": 1622465375.74338,
                        "type": "Update (WD)",
                        "WD Routes": "200.0.0.0/24"
                    }
                ]
            },
            {
                "source": "tof_1_2_1-1",
                "target": "spine_2_1_1-2",
                "value": 1,
                "label": [
                    {
                        "time": 1622465375.74343,
                        "type": "Update (WD)",
                        "WD Routes": "200.0.0.0/24"
                    }
                ]
            },
            {
                "source": "tof_1_2_1-1",
                "target": "spine_2_1_2-2",
                "value": 1,
                "label": [
                    {
                        "time": 1622465375.743468,
                        "type": "Update (WD)",
                        "WD Routes": "200.0.0.0/24"
                    }
                ]
            },
            {
                "source": "tof_1_2_2-1",
                "target": "spine_1_1_1-2",
                "value": 1,
                "label": [
                    {
                        "time": 1622465375.74282,
                        "type": "Update (WD)",
                        "WD Routes": "200.0.0.0/24"
                    }
                ]
            },
            {
                "source": "tof_1_2_2-1",
                "target": "spine_1_1_2-2",
                "value": 1,
                "label": [
                    {
                        "time": 1622465375.742974,
                        "type": "Update (WD)",
                        "WD Routes": "200.0.0.0/24"
                    }
                ]
            },
            {
                "source": "tof_1_2_2-1",
                "target": "spine_2_1_1-2",
                "value": 1,
                "label": [
                    {
                        "time": 1622465375.743044,
                        "type": "Update (WD)",
                        "WD Routes": "200.0.0.0/24"
                    }
                ]
            },
            {
                "source": "tof_1_2_2-1",
                "target": "spine_2_1_2-2",
                "value": 1,
                "label": [
                    {
                        "time": 1622465375.743102,
                        "type": "Update (WD)",
                        "WD Routes": "200.0.0.0/24"
                    }
                ]
            },
            {
                "source": "spine_2_1_1-2",
                "target": "leaf_2_0_1-3",
                "value": 1,
                "label": [
                    {
                        "time": 1622465375.793635,
                        "type": "Update (WD)",
                        "WD Routes": "200.0.0.0/24"
                    }
                ]
            },
            {
                "source": "spine_2_1_1-2",
                "target": "leaf_2_0_2-3",
                "value": 1,
                "label": [
                    {
                        "time": 1622465375.793705,
                        "type": "Update (WD)",
                        "WD Routes": "200.0.0.0/24"
                    }
                ]
            },
            {
                "source": "spine_2_1_1-2",
                "target": "tof_1_2_1-3",
                "value": 1,
                "label": [
                    {
                        "time": 1622465375.793728,
                        "type": "Update (WD)",
                        "WD Routes": "200.0.0.0/24"
                    }
                ]
            },
            {
                "source": "spine_2_1_1-2",
                "target": "tof_1_2_2-3",
                "value": 1,
                "label": [
                    {
                        "time": 1622465375.793748,
                        "type": "Update (WD)",
                        "WD Routes": "200.0.0.0/24"
                    }
                ]
            },
            {
                "source": "spine_2_1_2-2",
                "target": "leaf_2_0_2-3",
                "value": 1,
                "label": [
                    {
                        "time": 1622465375.79363,
                        "type": "Update (WD)",
                        "WD Routes": "200.0.0.0/24"
                    }
                ]
            },
            {
                "source": "spine_2_1_2-2",
                "target": "leaf_2_0_1-3",
                "value": 1,
                "label": [
                    {
                        "time": 1622465375.793771,
                        "type": "Update (WD)",
                        "WD Routes": "200.0.0.0/24"
                    }
                ]
            },
            {
                "source": "spine_2_1_2-2",
                "target": "tof_1_2_1-3",
                "value": 1,
                "label": [
                    {
                        "time": 1622465375.79382,
                        "type": "Update (WD)",
                        "WD Routes": "200.0.0.0/24"
                    }
                ]
            },
            {
                "source": "spine_2_1_2-2",
                "target": "tof_1_2_2-3",
                "value": 1,
                "label": [
                    {
                        "time": 1622465375.793854,
                        "type": "Update (WD)",
                        "WD Routes": "200.0.0.0/24"
                    }
                ]
            },
            {
                "source": "leaf_2_0_1-3",
                "target": "spine_2_1_1-4",
                "value": 1,
                "label": [
                    {
                        "time": 1622465375.844558,
                        "type": "Update (WD)",
                        "WD Routes": "200.0.0.0/24"
                    }
                ]
            },
            {
                "source": "leaf_2_0_1-3",
                "target": "spine_2_1_2-4",
                "value": 1,
                "label": [
                    {
                        "time": 1622465375.844634,
                        "type": "Update (WD)",
                        "WD Routes": "200.0.0.0/24"
                    }
                ]
            },
            {
                "source": "leaf_2_0_2-3",
                "target": "spine_2_1_1-4",
                "value": 1,
                "label": [
                    {
                        "time": 1622465375.844574,
                        "type": "Update (WD)",
                        "WD Routes": "200.0.0.0/24"
                    }
                ]
            },
            {
                "source": "leaf_2_0_2-3",
                "target": "spine_2_1_2-4",
                "value": 1,
                "label": [
                    {
                        "time": 1622465375.844687,
                        "type": "Update (WD)",
                        "WD Routes": "200.0.0.0/24"
                    }
                ]
            }
        ]
    },
    "logical_time_plot": {
        "points": {
            "spine_1_1_2": {
                "1": {
                    "time": 1622465375.691507,
                    "type": "Update (WD)",
                    "WD Routes": "200.0.0.0/24",
                    "Logical Clock": 1
                },
                "2": {
                    "time": 1622465375.691636,
                    "type": "Update (WD)",
                    "WD Routes": "200.0.0.0/24",
                    "Logical Clock": 2
                },
                "3": {
                    "time": 1622465375.691775,
                    "type": "Update (WD)",
                    "WD Routes": "200.0.0.0/24",
                    "Logical Clock": 3
                },
                "6": {
                    "time": 1622465375.742795,
                    "type": "Update (WD)",
                    "WD Routes": "200.0.0.0/24",
                    "Logical Clock": 6
                },
                "7": {
                    "time": 1622465375.743262,
                    "type": "Update (WD)",
                    "WD Routes": "200.0.0.0/24",
                    "Logical Clock": 7
                },
                "8": {
                    "time": 1622465375.743273,
                    "type": "Update (WD)",
                    "WD Routes": "200.0.0.0/24",
                    "Logical Clock": 8
                }
            },
            "leaf_1_0_2": {
                "2": {
                    "time": 1622465375.691925,
                    "type": "Update (WD)",
                    "WD Routes": "200.0.0.0/24",
                    "Logical Clock": 2
                },
                "3": {
                    "time": 1622465375.692027,
                    "type": "Update (WD)",
                    "WD Routes": "200.0.0.0/24",
                    "Logical Clock": 3
                },
                "4": {
                    "time": 1622465375.742317,
                    "type": "Update (WD)",
                    "WD Routes": "200.0.0.0/24",
                    "Logical Clock": 4
                },
                "5": {
                    "time": 1622465375.742362,
                    "type": "Update (WD)",
                    "WD Routes": "200.0.0.0/24",
                    "Logical Clock": 5
                }
            },
            "tof_1_2_1": {
                "3": {
                    "time": 1622465375.692428,
                    "type": "Update (WD)",
                    "WD Routes": "200.0.0.0/24",
                    "Logical Clock": 3
                },
                "4": {
                    "time": 1622465375.692547,
                    "type": "Update (WD)",
                    "WD Routes": "200.0.0.0/24",
                    "Logical Clock": 4
                },
                "5": {
                    "time": 1622465375.743222,
                    "type": "Update (WD)",
                    "WD Routes": "200.0.0.0/24",
                    "Logical Clock": 5
                },
                "6": {
                    "time": 1622465375.74338,
                    "type": "Update (WD)",
                    "WD Routes": "200.0.0.0/24",
                    "Logical Clock": 6
                },
                "7": {
                    "time": 1622465375.74343,
                    "type": "Update (WD)",
                    "WD Routes": "200.0.0.0/24",
                    "Logical Clock": 7
                },
                "8": {
                    "time": 1622465375.743468,
                    "type": "Update (WD)",
                    "WD Routes": "200.0.0.0/24",
                    "Logical Clock": 8
                },
                "13": {
                    "time": 1622465375.794494,
                    "type": "Update (WD)",
                    "WD Routes": "200.0.0.0/24",
                    "Logical Clock": 13
                },
                "14": {
                    "time": 1622465375.79463,
                    "type": "Update (WD)",
                    "WD Routes": "200.0.0.0/24",
                    "Logical Clock": 14
                }
            },
            "tof_1_2_2": {
                "4": {
                    "time": 1622465375.692107,
                    "type": "Update (WD)",
                    "WD Routes": "200.0.0.0/24",
                    "Logical Clock": 4
                },
                "5": {
                    "time": 1622465375.692194,
                    "type": "Update (WD)",
                    "WD Routes": "200.0.0.0/24",
                    "Logical Clock": 5
                },
                "6": {
                    "time": 1622465375.74282,
                    "type": "Update (WD)",
                    "WD Routes": "200.0.0.0/24",
                    "Logical Clock": 6
                },
                "7": {
                    "time": 1622465375.742974,
                    "type": "Update (WD)",
                    "WD Routes": "200.0.0.0/24",
                    "Logical Clock": 7
                },
                "8": {
                    "time": 1622465375.743044,
                    "type": "Update (WD)",
                    "WD Routes": "200.0.0.0/24",
                    "Logical Clock": 8
                },
                "9": {
                    "time": 1622465375.743102,
                    "type": "Update (WD)",
                    "WD Routes": "200.0.0.0/24",
                    "Logical Clock": 9
                },
                "14": {
                    "time": 1622465375.794087,
                    "type": "Update (WD)",
                    "WD Routes": "200.0.0.0/24",
                    "Logical Clock": 14
                },
                "15": {
                    "time": 1622465375.79424,
                    "type": "Update (WD)",
                    "WD Routes": "200.0.0.0/24",
                    "Logical Clock": 15
                }
            },
            "spine_1_1_1": {
                "1": {
                    "time": 1622465375.692126,
                    "type": "Update (WD)",
                    "WD Routes": "200.0.0.0/24",
                    "Logical Clock": 1
                },
                "2": {
                    "time": 1622465375.692292,
                    "type": "Update (WD)",
                    "WD Routes": "200.0.0.0/24",
                    "Logical Clock": 2
                },
                "3": {
                    "time": 1622465375.692344,
                    "type": "Update (WD)",
                    "WD Routes": "200.0.0.0/24",
                    "Logical Clock": 3
                },
                "5": {
                    "time": 1622465375.743095,
                    "type": "Update (WD)",
                    "WD Routes": "200.0.0.0/24",
                    "Logical Clock": 5
                },
                "6": {
                    "time": 1622465375.743599,
                    "type": "Update (WD)",
                    "WD Routes": "200.0.0.0/24",
                    "Logical Clock": 6
                },
                "7": {
                    "time": 1622465375.743528,
                    "type": "Update (WD)",
                    "WD Routes": "200.0.0.0/24",
                    "Logical Clock": 7
                }
            },
            "spine_2_1_1": {
                "8": {
                    "time": 1622465375.743196,
                    "type": "Update (WD)",
                    "WD Routes": "200.0.0.0/24",
                    "Logical Clock": 8
                },
                "9": {
                    "time": 1622465375.743223,
                    "type": "Update (WD)",
                    "WD Routes": "200.0.0.0/24",
                    "Logical Clock": 9
                },
                "10": {
                    "time": 1622465375.793635,
                    "type": "Update (WD)",
                    "WD Routes": "200.0.0.0/24",
                    "Logical Clock": 10
                },
                "11": {
                    "time": 1622465375.793705,
                    "type": "Update (WD)",
                    "WD Routes": "200.0.0.0/24",
                    "Logical Clock": 11
                },
                "12": {
                    "time": 1622465375.793728,
                    "type": "Update (WD)",
                    "WD Routes": "200.0.0.0/24",
                    "Logical Clock": 12
                },
                "13": {
                    "time": 1622465375.793748,
                    "type": "Update (WD)",
                    "WD Routes": "200.0.0.0/24",
                    "Logical Clock": 13
                },
                "15": {
                    "time": 1622465375.844773,
                    "type": "Update (WD)",
                    "WD Routes": "200.0.0.0/24",
                    "Logical Clock": 15
                },
                "16": {
                    "time": 1622465375.844888,
                    "type": "Update (WD)",
                    "WD Routes": "200.0.0.0/24",
                    "Logical Clock": 16
                }
            },
            "spine_2_1_2": {
                "9": {
                    "time": 1622465375.7431,
                    "type": "Update (WD)",
                    "WD Routes": "200.0.0.0/24",
                    "Logical Clock": 9
                },
                "10": {
                    "time": 1622465375.743119,
                    "type": "Update (WD)",
                    "WD Routes": "200.0.0.0/24",
                    "Logical Clock": 10
                },
                "11": {
                    "time": 1622465375.79363,
                    "type": "Update (WD)",
                    "WD Routes": "200.0.0.0/24",
                    "Logical Clock": 11
                },
                "12": {
                    "time": 1622465375.793771,
                    "type": "Update (WD)",
                    "WD Routes": "200.0.0.0/24",
                    "Logical Clock": 12
                },
                "13": {
                    "time": 1622465375.79382,
                    "type": "Update (WD)",
                    "WD Routes": "200.0.0.0/24",
                    "Logical Clock": 13
                },
                "14": {
                    "time": 1622465375.793854,
                    "type": "Update (WD)",
                    "WD Routes": "200.0.0.0/24",
                    "Logical Clock": 14
                },
                "16": {
                    "time": 1622465375.844811,
                    "type": "Update (WD)",
                    "WD Routes": "200.0.0.0/24",
                    "Logical Clock": 16
                },
                "17": {
                    "time": 1622465375.844836,
                    "type": "Update (WD)",
                    "WD Routes": "200.0.0.0/24",
                    "Logical Clock": 17
                }
            },
            "leaf_2_0_1": {
                "11": {
                    "time": 1622465375.794014,
                    "type": "Update (WD)",
                    "WD Routes": "200.0.0.0/24",
                    "Logical Clock": 11
                },
                "13": {
                    "time": 1622465375.794062,
                    "type": "Update (WD)",
                    "WD Routes": "200.0.0.0/24",
                    "Logical Clock": 13
                },
                "14": {
                    "time": 1622465375.844558,
                    "type": "Update (WD)",
                    "WD Routes": "200.0.0.0/24",
                    "Logical Clock": 14
                },
                "15": {
                    "time": 1622465375.844634,
                    "type": "Update (WD)",
                    "WD Routes": "200.0.0.0/24",
                    "Logical Clock": 15
                }
            },
            "leaf_2_0_2": {
                "12": {
                    "time": 1622465375.793904,
                    "type": "Update (WD)",
                    "WD Routes": "200.0.0.0/24",
                    "Logical Clock": 12
                },
                "13": {
                    "time": 1622465375.793951,
                    "type": "Update (WD)",
                    "WD Routes": "200.0.0.0/24",
                    "Logical Clock": 13
                },
                "14": {
                    "time": 1622465375.844574,
                    "type": "Update (WD)",
                    "WD Routes": "200.0.0.0/24",
                    "Logical Clock": 14
                },
                "15": {
                    "time": 1622465375.844687,
                    "type": "Update (WD)",
                    "WD Routes": "200.0.0.0/24",
                    "Logical Clock": 15
                }
            }
        },
        "edges": [
            [
                [
                    "spine_1_1_2",
                    1
                ],
                [
                    "leaf_1_0_2",
                    2
                ]
            ],
            [
                [
                    "spine_1_1_2",
                    2
                ],
                [
                    "tof_1_2_1",
                    3
                ]
            ],
            [
                [
                    "spine_1_1_2",
                    3
                ],
                [
                    "tof_1_2_2",
                    4
                ]
            ],
            [
                [
                    "spine_1_1_1",
                    1
                ],
                [
                    "leaf_1_0_2",
                    3
                ]
            ],
            [
                [
                    "spine_1_1_1",
                    2
                ],
                [
                    "tof_1_2_1",
                    4
                ]
            ],
            [
                [
                    "spine_1_1_1",
                    3
                ],
                [
                    "tof_1_2_2",
                    5
                ]
            ],
            [
                [
                    "leaf_1_0_2",
                    4
                ],
                [
                    "spine_1_1_1",
                    5
                ]
            ],
            [
                [
                    "leaf_1_0_2",
                    5
                ],
                [
                    "spine_1_1_2",
                    6
                ]
            ],
            [
                [
                    "tof_1_2_1",
                    5
                ],
                [
                    "spine_1_1_1",
                    6
                ]
            ],
            [
                [
                    "tof_1_2_1",
                    6
                ],
                [
                    "spine_1_1_2",
                    7
                ]
            ],
            [
                [
                    "tof_1_2_1",
                    7
                ],
                [
                    "spine_2_1_1",
                    8
                ]
            ],
            [
                [
                    "tof_1_2_1",
                    8
                ],
                [
                    "spine_2_1_2",
                    9
                ]
            ],
            [
                [
                    "tof_1_2_2",
                    6
                ],
                [
                    "spine_1_1_1",
                    7
                ]
            ],
            [
                [
                    "tof_1_2_2",
                    7
                ],
                [
                    "spine_1_1_2",
                    8
                ]
            ],
            [
                [
                    "tof_1_2_2",
                    8
                ],
                [
                    "spine_2_1_1",
                    9
                ]
            ],
            [
                [
                    "tof_1_2_2",
                    9
                ],
                [
                    "spine_2_1_2",
                    10
                ]
            ],
            [
                [
                    "spine_2_1_1",
                    10
                ],
                [
                    "leaf_2_0_1",
                    11
                ]
            ],
            [
                [
                    "spine_2_1_1",
                    11
                ],
                [
                    "leaf_2_0_2",
                    12
                ]
            ],
            [
                [
                    "spine_2_1_1",
                    12
                ],
                [
                    "tof_1_2_1",
                    13
                ]
            ],
            [
                [
                    "spine_2_1_1",
                    13
                ],
                [
                    "tof_1_2_2",
                    14
                ]
            ],
            [
                [
                    "spine_2_1_2",
                    11
                ],
                [
                    "leaf_2_0_2",
                    13
                ]
            ],
            [
                [
                    "spine_2_1_2",
                    12
                ],
                [
                    "leaf_2_0_1",
                    13
                ]
            ],
            [
                [
                    "spine_2_1_2",
                    13
                ],
                [
                    "tof_1_2_1",
                    14
                ]
            ],
            [
                [
                    "spine_2_1_2",
                    14
                ],
                [
                    "tof_1_2_2",
                    15
                ]
            ],
            [
                [
                    "leaf_2_0_1",
                    14
                ],
                [
                    "spine_2_1_1",
                    15
                ]
            ],
            [
                [
                    "leaf_2_0_1",
                    15
                ],
                [
                    "spine_2_1_2",
                    16
                ]
            ],
            [
                [
                    "leaf_2_0_2",
                    14
                ],
                [
                    "spine_2_1_1",
                    16
                ]
            ],
            [
                [
                    "leaf_2_0_2",
                    15
                ],
                [
                    "spine_2_1_2",
                    17
                ]
            ]
        ]
    },
    "max_scalar_clock": 17
}