{
    "k_leaf": 4,
    "k_top": 4,
    "redundancy_factor": 4,
    "is_k8s": false,
    "machine_mac_addresses": {
        "leaf_1_0_1": {
            "eth0": "2e:ab:93:2e:ff:ef",
            "eth1": "26:53:59:ac:13:d1",
            "eth2": "0a:cd:46:26:8f:a1",
            "eth3": "de:25:7e:9e:21:08",
            "eth4": "e2:e0:29:44:2e:3a"
        },
        "leaf_1_0_2": {
            "eth0": "56:1a:c0:54:7d:27",
            "eth1": "1a:17:b6:61:ab:dd",
            "eth2": "6a:14:a4:2e:2f:e4",
            "eth3": "22:ef:5a:c0:df:fc",
            "eth4": "72:d0:bd:a4:4e:6b"
        },
        "leaf_1_0_3": {
            "eth0": "1e:db:8f:a6:44:5e",
            "eth1": "d6:01:ba:50:2f:fd",
            "eth2": "a6:45:5e:7d:5f:ce",
            "eth3": "c6:20:19:54:3d:53",
            "eth4": "3a:ef:a9:52:2f:b3"
        },
        "leaf_1_0_4": {
            "eth0": "ce:1f:c6:61:8a:f4",
            "eth1": "ba:ba:44:2d:e4:3b",
            "eth2": "6e:bd:97:5f:4c:47",
            "eth3": "5a:67:63:55:d0:f7",
            "eth4": "6a:b6:ba:7e:06:d8"
        },
        "leaf_2_0_1": {
            "eth0": "92:88:48:fd:1b:4a",
            "eth1": "3a:b4:c4:13:30:7c",
            "eth2": "f6:f4:c7:94:95:96",
            "eth3": "b6:db:55:73:ee:43",
            "eth4": "32:73:ec:00:52:89"
        },
        "leaf_2_0_2": {
            "eth0": "fa:20:55:95:98:04",
            "eth1": "0e:28:fd:72:3e:36",
            "eth2": "1a:73:04:6c:89:c8",
            "eth3": "92:3e:db:6d:34:95",
            "eth4": "06:a3:32:7c:78:0b"
        },
        "leaf_2_0_3": {
            "eth0": "7e:ec:66:34:2e:44",
            "eth1": "ba:fa:9e:a2:38:a8",
            "eth2": "de:cc:a1:28:15:d9",
            "eth3": "8e:a0:ec:fc:21:96",
            "eth4": "4a:0f:49:1b:c2:1c"
        },
        "leaf_2_0_4": {
            "eth0": "66:f2:14:8e:f0:06",
            "eth1": "a6:1e:32:db:d2:dc",
            "eth2": "c6:76:f8:d2:49:5f",
            "eth3": "ee:c2:3c:4f:fc:18",
            "eth4": "ea:90:df:43:e0:0b"
        },
        "spine_1_1_1": {
            "eth0": "2e:34:48:3e:e4:11",
            "eth1": "8e:25:0c:f6:6f:88",
            "eth2": "0e:6d:81:5a:e5:44",
            "eth3": "4e:6c:b8:95:27:9e",
            "eth4": "e6:d6:42:ce:39:5b",
            "eth5": "2e:51:25:7a:b7:a1",
            "eth6": "56:1f:7f:3b:12:3c",
            "eth7": "22:6c:0c:16:25:47"
        },
        "spine_1_1_2": {
            "eth0": "be:2d:a4:27:fc:f4",
            "eth1": "fa:95:5a:a0:13:8c",
            "eth2": "1e:00:e5:66:75:d7",
            "eth3": "8a:f8:ca:c2:ba:cb",
            "eth4": "a2:4f:5f:c7:77:fd",
            "eth5": "d6:b9:19:72:16:10",
            "eth6": "2a:cf:3a:1a:72:0e",
            "eth7": "4a:35:5b:d1:46:5a"
        },
        "spine_1_1_3": {
            "eth0": "32:d9:a5:98:ba:5c",
            "eth1": "e6:4a:59:6a:f5:9f",
            "eth2": "a2:5a:63:b4:80:fa",
            "eth3": "76:a8:fc:21:7f:d3",
            "eth4": "4a:b7:a5:f5:34:52",
            "eth5": "42:f9:e1:3e:82:9e",
            "eth6": "b2:6c:f0:a2:cb:df",
            "eth7": "fa:6a:8f:17:75:bf"
        },
        "spine_1_1_4": {
            "eth0": "72:25:f9:c3:10:2a",
            "eth1": "9e:95:c4:e7:d7:1f",
            "eth2": "e2:d3:56:1e:d0:5b",
            "eth3": "6a:18:f6:30:09:b1",
            "eth4": "c2:c2:6c:57:32:52",
            "eth5": "d2:1c:c7:5d:83:e1",
            "eth6": "e6:c9:99:4e:f0:fd",
            "eth7": "e2:15:96:b6:d3:bb"
        },
        "spine_2_1_1": {
            "eth0": "4a:39:89:03:02:6b",
            "eth1": "5e:98:6a:15:7b:a3",
            "eth2": "8e:c9:b6:3a:28:62",
            "eth3": "26:68:bc:a8:0b:a2",
            "eth4": "02:c5:e9:c5:c1:69",
            "eth5": "92:31:ed:dc:e4:17",
            "eth6": "ee:01:be:3c:77:19",
            "eth7": "7a:25:45:c2:21:1e"
        },
        "spine_2_1_2": {
            "eth0": "be:db:a4:9a:fd:ed",
            "eth1": "b6:b5:05:2e:22:5c",
            "eth2": "62:0b:39:1c:62:f6",
            "eth3": "12:e9:f0:0f:16:e0",
            "eth4": "62:68:46:08:d4:02",
            "eth5": "12:05:31:7f:56:9d",
            "eth6": "b6:68:d8:37:76:86",
            "eth7": "92:33:87:2d:4e:d6"
        },
        "spine_2_1_3": {
            "eth0": "12:9c:40:d0:5e:71",
            "eth1": "36:a9:f6:48:f6:c9",
            "eth2": "12:7a:b1:f0:7f:6e",
            "eth3": "42:1b:c9:9d:38:1c",
            "eth4": "7a:26:96:95:7e:47",
            "eth5": "a6:31:f9:fe:d2:32",
            "eth6": "5e:14:80:be:90:34",
            "eth7": "02:5f:10:4a:50:00"
        },
        "spine_2_1_4": {
            "eth0": "be:f4:68:e6:2b:29",
            "eth1": "ea:43:e5:37:83:d6",
            "eth2": "26:b7:1e:2d:8e:cc",
            "eth3": "d2:7e:38:5f:5f:38",
            "eth4": "22:28:4b:8c:fc:6a",
            "eth5": "42:30:17:aa:9d:e6",
            "eth6": "2a:74:ed:e6:62:8d",
            "eth7": "ce:55:3c:55:b9:0b"
        },
        "tof_1_2_1": {
            "eth0": "3a:a7:80:4b:7c:ab",
            "eth1": "86:67:56:2e:eb:68",
            "eth2": "62:b9:f5:e7:a5:69",
            "eth3": "96:4d:7b:41:80:9f",
            "eth4": "f2:28:51:c8:d3:22",
            "eth5": "0e:c0:07:85:69:e0",
            "eth6": "4e:79:29:30:d1:84",
            "eth7": "66:83:30:5c:98:fc"
        },
        "tof_1_2_2": {
            "eth0": "06:71:b6:58:4b:7c",
            "eth1": "ba:40:f2:2b:dc:13",
            "eth2": "82:06:53:7e:f6:c5",
            "eth3": "ca:66:99:82:5d:52",
            "eth4": "66:b5:44:bf:c5:af",
            "eth5": "12:a3:b1:29:53:da",
            "eth6": "d6:a6:1b:a1:e5:cf",
            "eth7": "f6:09:7d:48:bf:d2"
        },
        "tof_1_2_3": {
            "eth0": "f2:b5:78:a4:60:1b",
            "eth1": "66:8e:c9:d3:9b:2a",
            "eth2": "02:94:90:e8:b2:9e",
            "eth3": "0a:de:fd:48:ec:c6",
            "eth4": "c2:12:48:f6:b1:b5",
            "eth5": "a6:99:e0:70:1d:91",
            "eth6": "1e:c5:f6:b3:e0:57",
            "eth7": "ee:f3:52:c1:e4:41"
        },
        "tof_1_2_4": {
            "eth0": "36:30:95:02:45:9e",
            "eth1": "9e:62:aa:58:a0:ff",
            "eth2": "02:c1:64:13:22:14",
            "eth3": "f2:d0:fe:bc:70:96",
            "eth4": "a6:2a:ea:c1:81:a0",
            "eth5": "36:fd:ec:2e:3d:23",
            "eth6": "06:a4:63:c4:b0:c2",
            "eth7": "22:2f:4f:77:d2:ef"
        }
    },
    "failed_machine": "leaf_1_0_1",
    "failure_time": {
        "leaf_1_0_1": 1622026310.004139,
        "leaf_1_0_2": 1622026310.0168676,
        "leaf_1_0_3": 1622026310.0120108,
        "leaf_1_0_4": 1622026310.022603,
        "leaf_2_0_1": 1622026310.009473,
        "leaf_2_0_2": 1622026310.0251746,
        "leaf_2_0_3": 1622026310.0173104,
        "leaf_2_0_4": 1622026310.0290835,
        "spine_1_1_1": 1622026310.0355928,
        "spine_1_1_2": 1622026310.0487137,
        "spine_1_1_3": 1622026310.0380027,
        "spine_1_1_4": 1622026310.0522826,
        "spine_2_1_1": 1622026310.0485976,
        "spine_2_1_2": 1622026310.0644114,
        "spine_2_1_3": 1622026310.0439022,
        "spine_2_1_4": 1622026310.0597024,
        "tof_1_2_1": 1622026310.0629308,
        "tof_1_2_2": 1622026310.0732703,
        "tof_1_2_3": 1622026310.0662644,
        "tof_1_2_4": 1622026310.0742836
    }
}