{
    "k_leaf": 8,
    "k_top": 8,
    "redundancy_factor": 2,
    "is_k8s": true,
    "machine_mac_addresses": {
        "leaf_1_0_1": {
            "net0": "9a:94:1b:88:b2:c7",
            "net1": "be:b1:61:17:cb:01",
            "net2": "62:53:b9:59:b5:fc",
            "net3": "f6:ab:d5:06:67:0b",
            "net4": "fa:7d:e0:20:76:05",
            "net5": "aa:b1:04:e1:56:cb",
            "net6": "52:a4:94:95:f8:7f",
            "net7": "c6:9d:3a:61:f8:17",
            "net8": "36:27:29:24:d1:ca"
        },
        "leaf_1_0_2": {
            "net0": "0e:16:3a:a5:1e:89",
            "net1": "16:6e:8c:4b:ae:49",
            "net2": "be:f6:8f:31:a4:18",
            "net3": "d2:42:85:e9:c1:03",
            "net4": "92:e2:6c:89:0a:9b",
            "net5": "4e:a1:b0:01:97:45",
            "net6": "86:e7:16:a8:8e:03",
            "net7": "ca:b3:fa:f0:ca:3c",
            "net8": "ba:78:b0:97:d0:fb"
        },
        "leaf_1_0_3": {
            "net0": "a2:e1:74:7d:96:d8",
            "net1": "ca:93:a2:c8:41:2e",
            "net2": "ee:19:59:89:06:d4",
            "net3": "6e:92:f5:8d:c5:54",
            "net4": "8a:14:c3:d4:3a:b4",
            "net5": "12:7f:92:46:fa:63",
            "net6": "ba:3e:e7:6c:17:56",
            "net7": "86:a4:d9:61:cf:51",
            "net8": "be:23:13:31:21:09"
        },
        "leaf_1_0_4": {
            "net0": "9a:3f:ce:3d:1e:2a",
            "net1": "e2:85:f5:64:17:e0",
            "net2": "52:c8:72:eb:25:d7",
            "net3": "ea:50:e0:80:cd:7f",
            "net4": "e6:4c:de:c2:b5:59",
            "net5": "62:96:05:fc:69:dd",
            "net6": "96:43:be:c7:73:4e",
            "net7": "0a:93:3b:7d:56:bc",
            "net8": "42:b9:89:21:57:94"
        },
        "leaf_1_0_5": {
            "net0": "8e:8a:b7:06:69:9a",
            "net1": "7e:b1:3b:d9:01:aa",
            "net2": "06:53:ef:24:90:98",
            "net3": "5a:f3:2c:c7:e8:fd",
            "net4": "be:95:32:48:99:c5",
            "net5": "76:eb:2b:85:d3:95",
            "net6": "6e:0c:b6:66:0d:88",
            "net7": "d2:27:45:6b:e3:bf",
            "net8": "4e:77:a0:7f:db:c5"
        },
        "leaf_1_0_6": {
            "net0": "1a:70:b4:3f:7c:39",
            "net1": "46:49:b0:f8:48:7f",
            "net2": "06:e7:f6:b3:db:19",
            "net3": "9e:7c:8f:f7:0b:de",
            "net4": "1a:4b:b4:27:6c:b0",
            "net5": "3e:63:cc:5e:8a:f9",
            "net6": "42:23:65:9d:c2:4b",
            "net7": "9e:dd:d2:0f:3f:3e",
            "net8": "9e:01:83:5b:ba:8f"
        },
        "leaf_1_0_7": {
            "net0": "42:15:bd:bd:02:7a",
            "net1": "1e:fc:6e:c1:33:09",
            "net2": "e6:f3:61:4b:7c:77",
            "net3": "fe:75:16:eb:74:32",
            "net4": "fa:ea:1f:c7:56:f7",
            "net5": "72:42:c3:bf:92:2c",
            "net6": "de:49:98:43:78:eb",
            "net7": "aa:a5:5a:6a:81:22",
            "net8": "b2:ad:71:45:3e:55"
        },
        "leaf_1_0_8": {
            "net0": "52:0d:0e:fe:cd:e7",
            "net1": "4e:72:ed:50:fe:94",
            "net2": "42:96:03:f8:fa:4c",
            "net3": "36:fb:44:c5:1d:85",
            "net4": "42:f2:d9:26:39:ec",
            "net5": "46:37:3a:bc:d7:20",
            "net6": "e6:20:0a:ed:c1:1f",
            "net7": "c2:7a:8b:f1:8d:4f",
            "net8": "5a:75:af:82:13:ab"
        },
        "leaf_2_0_1": {
            "net0": "c2:b4:07:39:a3:d6",
            "net1": "e2:dd:2f:93:3f:49",
            "net2": "5a:85:9a:80:75:3e",
            "net3": "c2:2f:2e:89:4c:e3",
            "net4": "a6:13:07:cc:be:80",
            "net5": "f6:23:7d:7c:e8:80",
            "net6": "c6:45:f2:c4:81:68",
            "net7": "c6:36:52:27:91:fa",
            "net8": "d6:14:f9:94:0f:64"
        },
        "leaf_2_0_2": {
            "net0": "26:7c:76:16:6c:4f",
            "net1": "d6:e9:3a:13:6a:a5",
            "net2": "36:c3:75:51:69:71",
            "net3": "3e:47:8a:fe:c6:44",
            "net4": "c2:46:01:f0:df:77",
            "net5": "7e:49:58:75:06:b5",
            "net6": "32:51:1c:80:3e:2c",
            "net7": "82:b1:82:70:4d:2e",
            "net8": "1a:6a:27:0f:41:17"
        },
        "leaf_2_0_3": {
            "net0": "9e:d6:7c:c7:e7:67",
            "net1": "6e:51:aa:80:b8:1e",
            "net2": "ce:b3:12:6a:95:74",
            "net3": "86:40:03:ab:2a:9a",
            "net4": "62:0a:fb:91:81:f5",
            "net5": "b2:24:da:74:c9:32",
            "net6": "d6:20:60:cb:33:e7",
            "net7": "e6:a4:59:a2:a4:a3",
            "net8": "4e:4a:d3:b5:53:0e"
        },
        "leaf_2_0_4": {
            "net0": "fe:aa:54:88:33:f4",
            "net1": "f6:d1:b2:74:29:03",
            "net2": "6a:fb:d6:d4:bc:71",
            "net3": "a2:64:6b:23:47:ec",
            "net4": "1a:b6:8c:16:87:89",
            "net5": "42:a0:2a:1e:db:15",
            "net6": "3e:08:82:26:a3:29",
            "net7": "06:8a:76:f9:d7:a8",
            "net8": "ae:d9:c1:64:7f:3e"
        },
        "leaf_2_0_5": {
            "net0": "62:a3:32:12:c6:2f",
            "net1": "fe:39:ff:70:a0:81",
            "net2": "52:84:06:59:1a:54",
            "net3": "9a:ef:8f:d9:0f:e7",
            "net4": "8a:de:a6:94:d9:e5",
            "net5": "aa:98:7a:13:eb:d5",
            "net6": "ae:cb:b6:6d:98:e0",
            "net7": "92:17:fa:fd:e0:24",
            "net8": "82:b2:57:8f:fd:5a"
        },
        "leaf_2_0_6": {
            "net0": "9a:ca:86:03:bf:2f",
            "net1": "42:3a:82:9c:34:87",
            "net2": "3a:fd:09:4a:b2:0e",
            "net3": "9a:63:a3:64:54:d7",
            "net4": "b2:dc:ea:94:97:64",
            "net5": "be:27:90:d1:ef:ed",
            "net6": "de:9a:d3:87:70:d3",
            "net7": "3e:ea:de:a1:53:3f",
            "net8": "52:1f:bf:db:4a:d0"
        },
        "leaf_2_0_7": {
            "net0": "6a:bd:4f:3b:51:29",
            "net1": "8e:1b:24:f4:f7:97",
            "net2": "9a:e8:f1:32:89:27",
            "net3": "06:ee:4c:40:b8:ab",
            "net4": "5a:22:10:77:dc:2b",
            "net5": "c2:39:6b:56:bc:bf",
            "net6": "de:6c:2a:e5:d9:ae",
            "net7": "be:9d:a3:37:e2:62",
            "net8": "ca:0b:11:24:de:81"
        },
        "leaf_2_0_8": {
            "net0": "3a:c8:75:dd:68:b9",
            "net1": "02:5d:6f:e7:58:23",
            "net2": "92:22:e5:f4:fb:97",
            "net3": "82:13:64:cc:8b:7e",
            "net4": "c2:8b:a9:08:c8:6a",
            "net5": "86:0c:ee:2f:1a:f7",
            "net6": "ee:f6:ca:76:f6:fa",
            "net7": "62:4d:02:70:72:7c",
            "net8": "2e:87:35:95:10:dc"
        },
        "leaf_3_0_1": {
            "net0": "6e:c3:c9:0b:fc:26",
            "net1": "2a:37:68:c6:5e:46",
            "net2": "3a:a2:70:b2:60:2a",
            "net3": "0e:78:95:dd:60:90",
            "net4": "f2:69:6a:28:01:fd",
            "net5": "06:82:ad:87:af:7c",
            "net6": "16:8a:39:97:45:9e",
            "net7": "92:90:5a:03:26:eb",
            "net8": "0e:df:87:77:8a:57"
        },
        "leaf_3_0_2": {
            "net0": "4a:f2:cb:63:37:0c",
            "net1": "22:fe:e7:05:8b:68",
            "net2": "26:c5:99:9b:4c:d6",
            "net3": "fe:50:c8:eb:6f:05",
            "net4": "d6:67:b4:0c:8a:7e",
            "net5": "d2:24:ba:98:da:b0",
            "net6": "8a:7b:61:b8:4b:3e",
            "net7": "46:44:4c:c9:a7:ce",
            "net8": "62:6c:e7:0b:93:bb"
        },
        "leaf_3_0_3": {
            "net0": "c6:6b:1f:7d:2c:58",
            "net1": "32:49:9c:5b:d3:c2",
            "net2": "5a:2a:eb:e9:12:32",
            "net3": "02:c2:5a:3e:fe:52",
            "net4": "12:a5:87:67:74:a0",
            "net5": "b6:30:ab:08:1f:17",
            "net6": "be:56:a3:58:2c:1d",
            "net7": "66:ac:44:16:f7:f9",
            "net8": "5e:ec:73:e0:c3:f7"
        },
        "leaf_3_0_4": {
            "net0": "a6:32:d7:ac:d5:8f",
            "net1": "c2:34:86:8d:3d:38",
            "net2": "f2:cb:3e:31:1d:8a",
            "net3": "4e:b6:94:78:6f:8c",
            "net4": "82:64:c6:28:dd:30",
            "net5": "da:1d:42:fc:35:77",
            "net6": "a6:6d:b3:37:5e:e7",
            "net7": "ca:93:d4:5c:2e:4f",
            "net8": "be:05:d0:f7:87:83"
        },
        "leaf_3_0_5": {
            "net0": "6a:2a:01:da:ca:e3",
            "net1": "52:65:a1:61:c9:19",
            "net2": "ee:d2:a9:75:50:21",
            "net3": "c6:e0:cd:00:9e:52",
            "net4": "4e:d9:9d:3a:04:cb",
            "net5": "76:9f:b7:3b:3f:fd",
            "net6": "ea:41:97:1f:f0:ca",
            "net7": "ce:06:30:22:fd:99",
            "net8": "f6:d1:10:da:0e:2c"
        },
        "leaf_3_0_6": {
            "net0": "3e:f3:8b:10:98:26",
            "net1": "de:a5:b3:a9:e2:75",
            "net2": "fe:62:56:93:9d:87",
            "net3": "da:8e:61:d5:6c:58",
            "net4": "c6:a4:1c:a9:f4:d1",
            "net5": "d2:72:d1:5f:f7:00",
            "net6": "e2:4e:81:32:c2:0c",
            "net7": "32:9f:69:92:2c:8a",
            "net8": "82:89:e6:e7:ea:12"
        },
        "leaf_3_0_7": {
            "net0": "ee:07:b0:df:63:0c",
            "net1": "72:96:e4:8e:6e:58",
            "net2": "2e:a1:b8:7e:45:7e",
            "net3": "e6:9d:55:54:54:c2",
            "net4": "36:b0:c5:00:4b:f1",
            "net5": "9e:05:2c:05:7e:8d",
            "net6": "12:1b:5d:f5:bf:3e",
            "net7": "4a:75:5a:c5:e6:41",
            "net8": "36:55:87:8e:09:55"
        },
        "leaf_3_0_8": {
            "net0": "86:ea:2a:22:a2:dc",
            "net1": "ae:99:fe:da:7d:1f",
            "net2": "1a:a6:c2:dd:36:13",
            "net3": "92:7e:65:ee:e4:81",
            "net4": "ea:72:8d:c0:e7:93",
            "net5": "be:7b:71:86:9d:d1",
            "net6": "86:07:c2:1e:f4:f3",
            "net7": "a2:e3:93:63:02:2d",
            "net8": "8a:e1:98:be:c9:45"
        },
        "leaf_4_0_1": {
            "net0": "d6:48:04:e8:e0:ee",
            "net1": "9a:71:f9:49:a1:e9",
            "net2": "86:5f:7c:50:bd:6f",
            "net3": "12:1c:19:c8:9d:4c",
            "net4": "b2:17:eb:2f:06:91",
            "net5": "96:89:c2:79:c7:c1",
            "net6": "da:d8:1f:58:f3:cb",
            "net7": "e2:d4:1e:8a:20:78",
            "net8": "76:64:77:69:f3:09"
        },
        "leaf_4_0_2": {
            "net0": "b6:cf:1a:fb:2c:aa",
            "net1": "06:1a:eb:e2:0e:fd",
            "net2": "26:9a:d3:3c:72:20",
            "net3": "fa:2d:f0:45:91:c3",
            "net4": "fe:3f:bf:18:6a:28",
            "net5": "7a:25:0d:36:41:c5",
            "net6": "c6:cc:7d:56:d7:66",
            "net7": "86:7a:b1:ac:ef:ed",
            "net8": "62:fc:95:f3:fe:79"
        },
        "leaf_4_0_3": {
            "net0": "0e:57:12:dd:14:79",
            "net1": "16:00:bc:a0:63:f1",
            "net2": "de:0a:6b:b2:c6:0d",
            "net3": "62:05:ee:d0:bb:c2",
            "net4": "8e:67:63:59:ff:13",
            "net5": "a2:d7:7b:e7:3c:6f",
            "net6": "2e:56:06:2c:bd:4b",
            "net7": "be:60:e8:c5:31:ec",
            "net8": "06:2f:1e:36:6a:2d"
        },
        "leaf_4_0_4": {
            "net0": "3a:10:60:3c:66:04",
            "net1": "fa:7e:ff:e6:20:e7",
            "net2": "42:d0:95:4d:e0:90",
            "net3": "9a:1e:11:6e:d3:4e",
            "net4": "06:a2:16:40:61:07",
            "net5": "aa:78:d3:49:df:05",
            "net6": "56:0a:a5:e0:fc:e5",
            "net7": "a6:50:a6:31:30:11",
            "net8": "e6:19:41:34:97:0a"
        },
        "leaf_4_0_5": {
            "net0": "ce:ee:71:f4:52:3f",
            "net1": "ba:8b:dd:bd:a6:09",
            "net2": "9e:62:2d:2c:a2:68",
            "net3": "f6:0e:d0:0a:95:02",
            "net4": "ba:03:14:ae:39:b4",
            "net5": "4a:03:9f:a3:3e:04",
            "net6": "16:84:b7:8e:d9:ae",
            "net7": "56:b2:d8:bb:77:9a",
            "net8": "52:3f:81:4e:00:83"
        },
        "leaf_4_0_6": {
            "net0": "a2:41:6b:e5:06:2d",
            "net1": "ce:3d:9f:ae:19:ef",
            "net2": "32:3d:c1:be:2e:28",
            "net3": "4a:ad:a3:83:1d:5f",
            "net4": "16:e7:35:53:79:46",
            "net5": "36:ac:62:64:e1:e3",
            "net6": "ba:f3:27:ed:3c:d5",
            "net7": "ae:38:23:db:e2:1a",
            "net8": "2a:02:17:ed:a4:de"
        },
        "leaf_4_0_7": {
            "net0": "c2:c0:da:66:63:d5",
            "net1": "6a:19:ec:67:3c:f4",
            "net2": "6a:0f:3d:39:f6:5a",
            "net3": "1a:54:c3:55:6f:fd",
            "net4": "e2:25:c6:f4:60:f7",
            "net5": "6e:2a:4a:c6:22:28",
            "net6": "3a:cf:54:c1:78:91",
            "net7": "02:33:97:6f:01:3c",
            "net8": "86:64:b7:c5:81:e9"
        },
        "leaf_4_0_8": {
            "net0": "7a:4a:b2:e5:59:10",
            "net1": "1a:01:be:1a:fd:c1",
            "net2": "1e:99:06:2f:1d:02",
            "net3": "22:a8:46:92:c5:05",
            "net4": "0a:6b:b1:ee:6f:7d",
            "net5": "ae:33:60:a7:ec:95",
            "net6": "ee:e4:62:a0:58:6e",
            "net7": "12:dc:11:cd:df:e9",
            "net8": "32:d0:d1:49:07:63"
        },
        "leaf_5_0_1": {
            "net0": "86:22:95:72:2a:f7",
            "net1": "5a:c2:d8:e1:c9:0d",
            "net2": "82:08:f4:97:03:70",
            "net3": "9a:4f:25:a2:5b:cc",
            "net4": "ea:8a:96:01:a6:3c",
            "net5": "36:cd:fb:a8:59:0f",
            "net6": "96:eb:a3:d1:99:92",
            "net7": "ae:8d:ee:03:07:3a",
            "net8": "4e:84:5c:71:38:cc"
        },
        "leaf_5_0_2": {
            "net0": "26:5c:95:1a:84:89",
            "net1": "7a:6e:c1:2a:8a:fb",
            "net2": "22:73:ae:ce:7d:cd",
            "net3": "02:0b:74:83:4c:d9",
            "net4": "56:f9:12:fd:c4:ea",
            "net5": "02:c2:6a:af:f9:ff",
            "net6": "56:46:24:24:de:7c",
            "net7": "b6:80:ff:f1:68:82",
            "net8": "92:c7:6d:09:90:ca"
        },
        "leaf_5_0_3": {
            "net0": "86:58:cf:ae:43:79",
            "net1": "fe:81:b5:91:d5:e8",
            "net2": "de:4a:a0:97:d9:26",
            "net3": "b6:2c:62:65:36:cd",
            "net4": "62:07:b4:f1:0d:ac",
            "net5": "72:7b:0a:7d:b0:a6",
            "net6": "52:95:68:19:37:11",
            "net7": "0a:5e:d0:89:f2:5f",
            "net8": "da:9f:5c:c1:34:67"
        },
        "leaf_5_0_4": {
            "net0": "32:3e:18:39:67:66",
            "net1": "3e:77:28:18:cf:3e",
            "net2": "e2:fc:08:7d:09:89",
            "net3": "f2:60:f0:46:a1:2f",
            "net4": "fa:2c:09:73:06:6b",
            "net5": "ae:71:a1:63:39:a2",
            "net6": "36:e4:ae:f8:96:34",
            "net7": "0e:7b:55:f2:da:63",
            "net8": "52:8f:11:74:ea:1f"
        },
        "leaf_5_0_5": {
            "net0": "c6:50:3f:ce:9a:0b",
            "net1": "6a:d1:76:99:e3:37",
            "net2": "86:57:f7:03:71:ef",
            "net3": "6a:06:a0:85:76:0c",
            "net4": "86:9a:d5:21:a2:ba",
            "net5": "a2:f6:da:04:7a:49",
            "net6": "56:24:dd:33:9e:b7",
            "net7": "be:ef:4d:85:80:ac",
            "net8": "de:46:15:33:59:00"
        },
        "leaf_5_0_6": {
            "net0": "8a:74:e3:ac:bd:f2",
            "net1": "ca:c8:e7:21:aa:5e",
            "net2": "52:6e:a8:dd:41:87",
            "net3": "7a:1f:b8:ea:cf:fd",
            "net4": "ce:78:67:5c:0e:38",
            "net5": "1e:23:fb:a6:18:ae",
            "net6": "a2:e4:40:bf:77:5c",
            "net7": "4e:44:c0:ab:96:70",
            "net8": "1e:c8:fc:00:a4:01"
        },
        "leaf_5_0_7": {
            "net0": "86:1c:94:69:b3:61",
            "net1": "32:3b:8b:03:4c:bc",
            "net2": "f6:49:6a:ec:05:48",
            "net3": "0a:ab:ba:33:bf:c7",
            "net4": "e2:e5:ca:7e:0d:24",
            "net5": "be:de:ca:29:bb:69",
            "net6": "fa:68:89:63:bf:ef",
            "net7": "5a:18:47:a2:91:dd",
            "net8": "de:0a:4d:ab:c8:08"
        },
        "leaf_5_0_8": {
            "net0": "e2:a8:d0:c3:b5:33",
            "net1": "ae:15:82:54:ea:e4",
            "net2": "56:b4:6c:81:be:6c",
            "net3": "96:1e:43:69:f9:bb",
            "net4": "22:f5:48:16:c2:9a",
            "net5": "42:9c:fa:65:c9:1e",
            "net6": "ea:f9:ba:26:7b:e4",
            "net7": "36:52:6f:a1:b8:01",
            "net8": "6a:76:3f:90:7f:15"
        },
        "leaf_6_0_1": {
            "net0": "06:99:b3:ea:45:1f",
            "net1": "72:b9:68:38:0c:47",
            "net2": "fa:bb:d5:24:a7:4b",
            "net3": "be:55:c0:00:6b:02",
            "net4": "66:2d:e6:ee:23:2e",
            "net5": "e6:4b:be:d1:3f:6f",
            "net6": "d6:b6:70:d8:2a:b0",
            "net7": "4a:a6:72:db:b7:9b",
            "net8": "4a:03:da:d6:5f:94"
        },
        "leaf_6_0_2": {
            "net0": "1a:88:c7:b6:c5:c1",
            "net1": "be:64:84:d9:a7:18",
            "net2": "1a:84:59:85:1b:6a",
            "net3": "7e:6f:32:b5:a9:06",
            "net4": "a2:b4:69:53:44:37",
            "net5": "9e:e7:20:16:73:e4",
            "net6": "3e:b1:aa:25:9e:6a",
            "net7": "5a:21:2c:29:d8:9a",
            "net8": "da:80:1d:25:27:21"
        },
        "leaf_6_0_3": {
            "net0": "66:c2:dd:e5:e8:4c",
            "net1": "2a:cb:e5:4e:49:4e",
            "net2": "7a:1b:40:2a:50:08",
            "net3": "52:36:1a:03:a6:01",
            "net4": "96:4c:5a:c0:8f:21",
            "net5": "0e:99:46:45:51:7b",
            "net6": "6a:8d:7a:ac:58:8a",
            "net7": "5a:d3:f4:35:e5:31",
            "net8": "52:c3:51:32:9b:50"
        },
        "leaf_6_0_4": {
            "net0": "4a:5f:4a:01:a8:5e",
            "net1": "7e:6e:38:d2:37:37",
            "net2": "ca:67:fa:1d:c8:a0",
            "net3": "d2:27:c7:65:85:46",
            "net4": "5e:dd:35:e8:0c:31",
            "net5": "36:08:60:19:3d:5a",
            "net6": "06:e2:7e:6c:b9:21",
            "net7": "9e:74:85:0c:dd:48",
            "net8": "3e:b2:95:55:74:43"
        },
        "leaf_6_0_5": {
            "net0": "e2:86:38:8d:9b:af",
            "net1": "ca:8d:8a:82:a0:c2",
            "net2": "de:84:fd:4f:de:cc",
            "net3": "fe:59:77:f0:48:b5",
            "net4": "d2:08:be:f3:e9:5c",
            "net5": "9e:5a:3a:ab:d0:1d",
            "net6": "9e:51:78:2f:d9:2c",
            "net7": "8a:3e:1f:2d:fc:eb",
            "net8": "ca:51:62:8e:0b:4c"
        },
        "leaf_6_0_6": {
            "net0": "02:bc:14:21:de:a9",
            "net1": "0a:ee:10:68:62:fe",
            "net2": "32:74:31:dc:7c:66",
            "net3": "62:90:c5:ea:a7:43",
            "net4": "0a:35:f2:cd:eb:3c",
            "net5": "b2:98:09:2c:20:57",
            "net6": "76:f1:c1:61:86:0c",
            "net7": "12:0d:09:70:73:e3",
            "net8": "da:f8:6e:40:29:ff"
        },
        "leaf_6_0_7": {
            "net0": "ca:eb:e7:58:47:40",
            "net1": "a6:c6:7b:b9:99:90",
            "net2": "ce:fb:72:38:21:d5",
            "net3": "ba:f7:57:52:f2:07",
            "net4": "d6:9f:c1:22:3b:81",
            "net5": "0e:db:5d:32:e2:ad",
            "net6": "02:9f:6f:8d:fe:1a",
            "net7": "ae:70:5b:1e:92:2f",
            "net8": "72:34:75:59:0c:af"
        },
        "leaf_6_0_8": {
            "net0": "b6:c3:25:3b:cd:8c",
            "net1": "4a:c3:0c:98:6a:e8",
            "net2": "86:de:7c:a9:65:29",
            "net3": "b6:79:5f:3e:83:d7",
            "net4": "5a:d6:a3:d9:ba:db",
            "net5": "22:1f:b4:17:a6:ed",
            "net6": "8e:1f:c3:79:1f:eb",
            "net7": "92:b0:e5:c5:42:86",
            "net8": "7a:7a:c9:c6:da:37"
        },
        "leaf_7_0_1": {
            "net0": "a6:05:8f:2f:ad:b0",
            "net1": "d2:e6:f3:cf:54:4a",
            "net2": "fe:5f:13:a4:74:5f",
            "net3": "3a:20:51:c5:90:20",
            "net4": "0e:c0:cb:b1:31:6c",
            "net5": "9a:52:23:7e:f2:94",
            "net6": "f2:15:92:ac:97:92",
            "net7": "36:b1:7c:7e:53:65",
            "net8": "46:49:dd:92:de:5d"
        },
        "leaf_7_0_2": {
            "net0": "ae:76:69:03:dd:b0",
            "net1": "6a:e1:71:ca:4f:a3",
            "net2": "0a:17:30:25:55:db",
            "net3": "e2:5c:c1:73:62:9e",
            "net4": "66:26:c7:bb:48:28",
            "net5": "7e:f5:59:d1:ae:94",
            "net6": "0a:3a:98:a0:65:46",
            "net7": "6e:b7:a6:2c:c3:15",
            "net8": "6a:a3:c3:98:7e:e7"
        },
        "leaf_7_0_3": {
            "net0": "96:1e:67:a9:12:17",
            "net1": "0e:ef:57:d4:e3:a1",
            "net2": "72:c0:fd:a5:40:58",
            "net3": "02:e4:2a:e6:6a:a0",
            "net4": "52:3a:26:0b:67:e8",
            "net5": "42:b8:10:9f:df:31",
            "net6": "2a:e8:eb:bc:7f:45",
            "net7": "f6:d3:12:37:eb:c2",
            "net8": "2e:04:11:11:2c:80"
        },
        "leaf_7_0_4": {
            "net0": "8e:9b:7f:f1:1b:e2",
            "net1": "ae:45:1a:56:b3:60",
            "net2": "f6:c0:7f:23:cd:33",
            "net3": "aa:23:bc:f4:86:5b",
            "net4": "36:81:f3:b3:b6:99",
            "net5": "0a:38:7c:5c:cd:f8",
            "net6": "e2:ad:0a:c4:1f:29",
            "net7": "a6:81:12:63:49:3a",
            "net8": "1a:af:de:dd:f5:b6"
        },
        "leaf_7_0_5": {
            "net0": "66:47:60:e5:06:07",
            "net1": "76:1a:99:fc:25:87",
            "net2": "0a:b0:dd:f6:c7:3e",
            "net3": "2a:4e:fa:ea:58:53",
            "net4": "ce:ff:9a:73:38:b5",
            "net5": "92:ef:ad:6f:4b:59",
            "net6": "02:d3:60:df:9f:0d",
            "net7": "be:13:25:73:21:b5",
            "net8": "42:3c:30:56:ab:39"
        },
        "leaf_7_0_6": {
            "net0": "d2:57:8a:66:ca:22",
            "net1": "6a:06:c6:ee:4b:c7",
            "net2": "de:dc:64:4c:3d:2b",
            "net3": "4e:9b:a7:d7:17:1d",
            "net4": "3a:67:fb:70:c6:d0",
            "net5": "5e:4b:bd:02:e9:7c",
            "net6": "8a:45:91:b1:73:03",
            "net7": "e6:e6:c2:9d:12:a4",
            "net8": "fe:23:fb:a4:98:fe"
        },
        "leaf_7_0_7": {
            "net0": "06:34:32:e6:41:8f",
            "net1": "ce:7f:a2:eb:5e:f3",
            "net2": "e6:d7:6e:1c:3d:93",
            "net3": "16:6a:b3:d8:f9:72",
            "net4": "1e:a2:5b:29:59:52",
            "net5": "7a:e1:23:63:f9:b4",
            "net6": "62:fd:7e:0d:ec:af",
            "net7": "86:39:fd:a1:1e:38",
            "net8": "6e:5c:d2:61:f0:4d"
        },
        "leaf_7_0_8": {
            "net0": "4a:ae:ac:8d:2d:b7",
            "net1": "8e:e5:f5:cd:73:22",
            "net2": "ba:c3:d4:08:f7:93",
            "net3": "9e:30:c6:f8:97:1a",
            "net4": "2a:e2:4b:37:10:e6",
            "net5": "62:00:4c:11:43:af",
            "net6": "ca:06:23:ac:51:ce",
            "net7": "ba:30:42:35:cd:f4",
            "net8": "2a:51:64:67:2d:4a"
        },
        "leaf_8_0_1": {
            "net0": "f2:fb:c1:d6:9f:e5",
            "net1": "b2:24:40:53:da:2b",
            "net2": "02:87:14:6c:6f:05",
            "net3": "42:51:53:0b:57:64",
            "net4": "fe:3d:6c:ff:c4:ba",
            "net5": "56:4c:84:d0:dc:4e",
            "net6": "0a:4a:32:f4:26:63",
            "net7": "d6:7e:86:34:28:f5",
            "net8": "4e:c1:de:9d:a3:2b"
        },
        "leaf_8_0_2": {
            "net0": "22:34:24:40:54:b9",
            "net1": "0e:10:5a:8b:42:b1",
            "net2": "d2:09:d0:df:2e:a8",
            "net3": "46:0b:22:56:b2:ca",
            "net4": "06:cd:ca:78:17:cd",
            "net5": "62:19:e1:89:7d:df",
            "net6": "66:59:66:00:1e:83",
            "net7": "82:a8:3c:5f:1b:64",
            "net8": "fa:46:79:4d:e1:c8"
        },
        "leaf_8_0_3": {
            "net0": "16:5c:c0:d7:18:50",
            "net1": "7a:43:be:a3:5a:2f",
            "net2": "ee:7d:cc:c1:29:38",
            "net3": "7e:1c:af:f4:ac:0e",
            "net4": "02:f3:3d:af:80:87",
            "net5": "6e:c9:22:0a:0c:f4",
            "net6": "7a:16:7c:5a:75:91",
            "net7": "a6:5e:9d:cb:e6:a9",
            "net8": "b6:d4:2a:2d:9b:bb"
        },
        "leaf_8_0_4": {
            "net0": "f2:59:b6:cb:ce:db",
            "net1": "1e:6e:fb:a9:f2:e3",
            "net2": "8e:50:b7:d9:31:63",
            "net3": "f2:2b:c8:51:4a:6d",
            "net4": "f6:6f:20:d2:1a:26",
            "net5": "02:b9:1c:54:02:53",
            "net6": "c6:bf:ae:44:b8:ff",
            "net7": "a2:ab:8e:55:0e:9c",
            "net8": "1e:92:32:21:ca:49"
        },
        "leaf_8_0_5": {
            "net0": "4a:d0:fc:55:2b:e2",
            "net1": "aa:01:79:e8:c0:b6",
            "net2": "2e:9c:b1:92:80:07",
            "net3": "3e:62:3a:b2:70:e6",
            "net4": "ee:80:e0:ab:12:55",
            "net5": "7e:9d:ae:af:71:29",
            "net6": "16:5d:87:96:01:69",
            "net7": "fe:dd:c2:b1:55:c6",
            "net8": "ee:1a:32:53:c6:c1"
        },
        "leaf_8_0_6": {
            "net0": "02:fc:95:38:1f:41",
            "net1": "36:16:55:71:90:6b",
            "net2": "0a:5c:43:18:3a:b0",
            "net3": "b6:db:d7:aa:f4:8b",
            "net4": "72:a2:d5:67:fe:8a",
            "net5": "4a:3a:9f:c9:6a:c0",
            "net6": "d2:04:97:6a:ff:30",
            "net7": "62:cd:26:ef:40:28",
            "net8": "a2:00:36:e1:b2:a4"
        },
        "leaf_8_0_7": {
            "net0": "a6:dd:c2:50:6e:d0",
            "net1": "8e:22:8d:9f:43:11",
            "net2": "32:78:16:86:df:a6",
            "net3": "7e:1f:61:f2:c0:c9",
            "net4": "fe:7c:92:08:2b:d3",
            "net5": "52:97:08:f6:d5:83",
            "net6": "96:00:a6:9b:bf:1b",
            "net7": "96:26:02:73:69:c0",
            "net8": "3e:fa:b2:e8:a3:32"
        },
        "leaf_8_0_8": {
            "net0": "a2:ce:54:5d:38:e7",
            "net1": "6e:01:38:72:65:eb",
            "net2": "86:6a:aa:a7:eb:4e",
            "net3": "0a:2d:7d:aa:da:79",
            "net4": "3a:6e:be:45:bb:b8",
            "net5": "42:17:0f:f9:03:db",
            "net6": "ce:de:68:b9:c2:70",
            "net7": "36:47:36:86:d2:5c",
            "net8": "ce:54:df:77:a0:ea"
        },
        "spine_1_1_1": {
            "net0": "46:63:ed:e9:bb:d8",
            "net1": "52:6f:68:6d:6c:0a",
            "net10": "ee:e0:f8:81:e6:40",
            "net11": "f2:12:98:f9:29:21",
            "net12": "32:3b:4c:de:61:28",
            "net13": "52:cd:2d:d3:7e:47",
            "net14": "4a:0e:23:2a:38:8d",
            "net15": "52:64:c1:45:56:0c",
            "net2": "f6:a5:cf:ed:f7:1f",
            "net3": "02:62:66:ce:37:11",
            "net4": "6a:f7:62:30:35:06",
            "net5": "1a:30:cc:37:1e:1f",
            "net6": "8a:40:0a:95:8d:a3",
            "net7": "12:1e:6d:30:a0:21",
            "net8": "c6:05:7c:00:ac:42",
            "net9": "9e:f7:1d:3c:a2:f8"
        },
        "spine_1_1_2": {
            "net0": "da:94:4a:a5:2f:fe",
            "net1": "7e:31:9e:bf:1a:18",
            "net10": "be:d6:b9:96:ce:e3",
            "net11": "ce:7a:74:e1:ef:96",
            "net12": "b2:24:98:3e:92:16",
            "net13": "46:66:d8:96:f7:19",
            "net14": "4e:39:45:99:49:85",
            "net15": "d2:be:12:1a:58:20",
            "net2": "02:a2:b1:32:78:97",
            "net3": "56:e8:f0:15:94:c1",
            "net4": "fe:c9:90:51:fe:c6",
            "net5": "6e:49:42:8d:83:e8",
            "net6": "a2:3c:d5:52:85:50",
            "net7": "ae:40:ce:45:02:0b",
            "net8": "12:bc:f9:60:7b:b7",
            "net9": "26:f7:19:3a:e5:4f"
        },
        "spine_1_1_3": {
            "net0": "8e:b9:14:ed:e7:a9",
            "net1": "0e:cf:a7:9f:0c:21",
            "net10": "6e:2f:4d:8c:2e:47",
            "net11": "e2:04:fa:6a:f1:2c",
            "net12": "aa:1e:5c:12:a2:83",
            "net13": "d2:de:4f:95:96:fe",
            "net14": "82:ad:db:e3:49:83",
            "net15": "5a:c1:5f:62:57:a6",
            "net2": "d2:3b:58:ac:56:a4",
            "net3": "2a:96:19:e0:87:be",
            "net4": "4a:8d:b5:5a:03:64",
            "net5": "96:9d:79:a9:24:f0",
            "net6": "ba:ff:22:eb:3f:66",
            "net7": "c2:57:db:58:bc:17",
            "net8": "a2:e3:1b:cd:f4:36",
            "net9": "f2:62:46:44:f4:22"
        },
        "spine_1_1_4": {
            "net0": "da:c8:3b:37:55:88",
            "net1": "d6:a2:dc:dc:e7:13",
            "net10": "42:3b:a0:7e:b8:4d",
            "net11": "f2:3d:58:c9:f8:ee",
            "net12": "8e:b6:d7:1a:f9:a0",
            "net13": "3a:b8:0d:0e:71:f5",
            "net14": "9e:3a:58:2c:db:b3",
            "net15": "1e:f5:50:3c:a9:5b",
            "net2": "1a:12:f8:3e:02:78",
            "net3": "b2:8e:6f:23:fa:b2",
            "net4": "d6:d7:34:cf:07:ce",
            "net5": "0e:2b:76:8d:bd:ec",
            "net6": "12:5d:89:0e:8e:bb",
            "net7": "4e:87:ad:2b:bf:a0",
            "net8": "56:f1:3c:9d:79:4a",
            "net9": "f2:35:04:98:35:34"
        },
        "spine_1_1_5": {
            "net0": "62:11:4b:70:2c:dd",
            "net1": "aa:4a:17:ea:e8:15",
            "net10": "d6:0f:51:8f:b4:d2",
            "net11": "12:d6:f8:39:e9:f5",
            "net12": "ea:0d:78:d7:04:78",
            "net13": "86:77:9c:2e:1c:ff",
            "net14": "fa:44:88:1b:d3:32",
            "net15": "da:ba:b9:89:ac:3a",
            "net2": "56:47:dd:f8:5f:2e",
            "net3": "22:db:1a:48:7f:a9",
            "net4": "5a:28:a7:2e:1b:2c",
            "net5": "66:d4:ca:95:78:4b",
            "net6": "fa:5b:05:b0:44:25",
            "net7": "4a:27:cb:e1:9c:57",
            "net8": "4a:80:7c:b0:32:b8",
            "net9": "0e:13:76:5d:a4:04"
        },
        "spine_1_1_6": {
            "net0": "02:ac:13:8d:8e:db",
            "net1": "76:63:65:96:02:2c",
            "net10": "3e:f4:e8:ab:b3:c2",
            "net11": "f2:93:f7:43:ed:02",
            "net12": "fa:ab:00:11:cb:f1",
            "net13": "02:6a:c0:b6:cf:07",
            "net14": "96:b2:4a:4f:ec:a6",
            "net15": "66:24:c9:41:62:2e",
            "net2": "82:ac:be:6d:6b:ad",
            "net3": "5e:a1:76:dc:3d:df",
            "net4": "1a:d1:72:5e:95:e7",
            "net5": "f2:09:1a:49:90:18",
            "net6": "d2:d1:60:9b:6d:8c",
            "net7": "12:c7:75:4f:40:a5",
            "net8": "16:fa:d2:d7:68:a3",
            "net9": "5a:51:30:c9:a8:0e"
        },
        "spine_1_1_7": {
            "net0": "4a:b0:f6:fc:83:be",
            "net1": "fa:8a:eb:2e:d0:72",
            "net10": "72:32:a7:de:67:f3",
            "net11": "92:9a:f1:e2:5b:cc",
            "net12": "82:15:1e:e2:18:ee",
            "net13": "82:ee:3a:82:44:6c",
            "net14": "a6:06:df:7f:af:e1",
            "net15": "c6:ee:af:e2:69:65",
            "net2": "e6:82:75:99:0a:3f",
            "net3": "86:e9:5a:d3:3b:65",
            "net4": "86:d2:18:4e:fc:fd",
            "net5": "e6:0b:e3:9b:5c:fe",
            "net6": "26:bb:43:c8:66:11",
            "net7": "42:95:b8:4f:5c:b9",
            "net8": "1e:2b:ef:f6:74:7a",
            "net9": "52:69:89:62:57:2b"
        },
        "spine_1_1_8": {
            "net0": "fa:d0:d1:f5:82:cc",
            "net1": "f6:e6:97:7c:f9:c4",
            "net10": "62:fe:59:ec:43:bc",
            "net11": "52:b0:e3:a2:47:34",
            "net12": "d6:5b:a4:2f:ef:ac",
            "net13": "2a:c7:df:5e:9a:28",
            "net14": "82:28:30:7c:cf:e3",
            "net15": "22:33:1f:fc:92:42",
            "net2": "4e:3a:8c:00:52:12",
            "net3": "3e:dc:b7:0b:b3:f9",
            "net4": "36:89:1f:98:bd:a2",
            "net5": "86:c2:81:cf:69:e7",
            "net6": "6e:2f:76:bf:e2:16",
            "net7": "de:10:ec:a6:5d:fc",
            "net8": "2a:11:84:c3:bd:4d",
            "net9": "22:5c:a5:45:73:d0"
        },
        "spine_2_1_1": {
            "net0": "b2:82:d7:95:90:c9",
            "net1": "92:fc:2d:dd:ea:a1",
            "net10": "8e:ae:ae:d1:5c:6a",
            "net11": "1a:ce:7d:85:05:88",
            "net12": "12:3c:21:45:b1:fb",
            "net13": "56:e4:26:8e:d5:ba",
            "net14": "8a:bb:91:6b:51:3f",
            "net15": "0e:b3:a2:5c:b4:f4",
            "net2": "76:c5:46:32:97:f9",
            "net3": "de:87:23:7a:90:88",
            "net4": "0e:55:e7:de:8f:d6",
            "net5": "52:53:65:09:4a:92",
            "net6": "c2:6f:90:8a:ae:d3",
            "net7": "16:9b:55:6b:f3:13",
            "net8": "42:3e:a6:3b:21:3f",
            "net9": "9a:b5:e4:88:0c:f7"
        },
        "spine_2_1_2": {
            "net0": "4a:5c:70:8e:93:da",
            "net1": "1e:0c:2d:88:2a:2d",
            "net10": "02:fe:f4:db:f0:b6",
            "net11": "12:7c:ac:fe:08:b8",
            "net12": "ea:ba:92:4d:14:44",
            "net13": "aa:80:08:4b:fa:ce",
            "net14": "96:93:e5:2a:b2:5b",
            "net15": "26:68:00:88:cd:32",
            "net2": "9e:2b:bc:d5:e0:5f",
            "net3": "7e:bf:d1:52:7a:05",
            "net4": "7a:ed:c8:9f:29:8b",
            "net5": "ba:19:ee:bb:ec:72",
            "net6": "26:61:37:80:57:e3",
            "net7": "de:56:f5:9e:ae:97",
            "net8": "d6:89:e9:65:1a:78",
            "net9": "1a:b3:e5:aa:67:81"
        },
        "spine_2_1_3": {
            "net0": "a6:e6:f2:81:76:ca",
            "net1": "1a:46:ff:9a:04:4f",
            "net10": "5a:f7:b5:89:2e:c7",
            "net11": "b6:ba:5e:97:05:24",
            "net12": "62:b4:b0:38:f3:28",
            "net13": "66:49:0e:5f:eb:ac",
            "net14": "86:cb:c1:68:ea:d3",
            "net15": "d6:2b:b6:09:4e:56",
            "net2": "a2:2e:bd:fa:55:36",
            "net3": "9a:7a:fc:a5:b3:f8",
            "net4": "42:1b:3c:0e:a6:62",
            "net5": "46:93:69:b6:7e:80",
            "net6": "2a:14:c0:92:d1:6d",
            "net7": "62:33:98:fc:9a:bc",
            "net8": "ca:90:74:f8:92:e9",
            "net9": "22:16:c9:c3:64:e0"
        },
        "spine_2_1_4": {
            "net0": "42:19:24:04:2d:e6",
            "net1": "9e:3f:ef:ef:39:e1",
            "net10": "d2:7a:44:a5:00:ff",
            "net11": "e2:e5:20:7e:c4:22",
            "net12": "9e:af:93:ed:d7:33",
            "net13": "ca:07:3e:96:74:54",
            "net14": "fe:68:76:b6:f4:18",
            "net15": "f6:98:c8:8b:c6:bc",
            "net2": "d6:a5:2e:20:5f:c4",
            "net3": "a2:08:8d:e8:e0:a5",
            "net4": "2a:9d:c2:d2:e7:89",
            "net5": "ce:64:19:c9:db:8f",
            "net6": "02:77:0b:09:64:93",
            "net7": "92:80:69:ff:c1:9f",
            "net8": "3a:f7:6a:9b:ce:9a",
            "net9": "de:ff:86:ad:ab:65"
        },
        "spine_2_1_5": {
            "net0": "26:fb:81:79:17:29",
            "net1": "86:a1:79:70:bc:f2",
            "net10": "52:37:d3:4d:b0:14",
            "net11": "8e:e6:49:f3:e5:de",
            "net12": "96:7c:83:ea:62:c8",
            "net13": "72:55:9d:28:9d:d5",
            "net14": "2a:2f:ac:12:13:91",
            "net15": "26:f5:5f:5c:b6:68",
            "net2": "a2:5d:89:b8:c8:e5",
            "net3": "76:6f:bd:ea:75:04",
            "net4": "12:88:0e:34:8a:4c",
            "net5": "22:3f:8d:e5:90:f0",
            "net6": "aa:de:fc:f4:63:91",
            "net7": "2e:e1:fc:bd:dd:ef",
            "net8": "16:3e:3d:cb:04:4a",
            "net9": "ce:a4:f3:c4:e5:ae"
        },
        "spine_2_1_6": {
            "net0": "8a:6b:8a:ad:76:e0",
            "net1": "8e:71:d7:8e:7e:40",
            "net10": "8e:71:21:8d:85:9a",
            "net11": "4a:29:3b:e8:03:d1",
            "net12": "a2:7e:20:af:2f:e8",
            "net13": "46:20:7b:6e:69:a7",
            "net14": "c6:9d:e9:b8:28:1e",
            "net15": "fe:47:39:39:aa:e6",
            "net2": "b2:4f:d3:d2:e7:b2",
            "net3": "26:9d:e3:ec:3e:c7",
            "net4": "52:6e:cf:f9:88:c6",
            "net5": "86:1c:7a:f1:cd:ad",
            "net6": "aa:f8:3b:dc:98:52",
            "net7": "aa:53:a9:6e:89:76",
            "net8": "f6:c9:34:4a:d8:b5",
            "net9": "92:71:27:97:85:e3"
        },
        "spine_2_1_7": {
            "net0": "ea:e4:c5:6f:ec:da",
            "net1": "52:88:ab:57:80:43",
            "net10": "02:84:98:04:f1:1b",
            "net11": "52:7c:67:80:b0:2c",
            "net12": "da:1b:cb:44:c3:2f",
            "net13": "0a:91:21:54:23:4c",
            "net14": "16:c6:f3:9f:59:ad",
            "net15": "ea:6f:c6:ed:f0:5c",
            "net2": "6a:cf:d9:b8:1d:7c",
            "net3": "a2:52:62:42:29:92",
            "net4": "12:79:d4:36:8c:5c",
            "net5": "ca:1c:d8:57:e9:41",
            "net6": "26:0f:84:91:ca:e8",
            "net7": "aa:5a:eb:ae:00:55",
            "net8": "02:aa:ae:b4:b5:71",
            "net9": "66:51:2a:21:8e:1f"
        },
        "spine_2_1_8": {
            "net0": "4e:a2:cb:67:9f:9e",
            "net1": "2e:f6:9e:3a:91:05",
            "net10": "0e:cc:39:91:98:d0",
            "net11": "e6:8c:ea:77:3f:08",
            "net12": "4e:1a:15:14:7b:df",
            "net13": "5a:55:a8:84:df:1c",
            "net14": "de:aa:d1:09:73:6f",
            "net15": "36:ed:f5:65:98:70",
            "net2": "c6:73:4d:d2:aa:b7",
            "net3": "32:de:50:60:2b:10",
            "net4": "de:24:bb:53:32:e2",
            "net5": "b6:48:e0:af:61:d5",
            "net6": "2a:08:7d:4e:65:31",
            "net7": "96:06:d4:b1:a5:ec",
            "net8": "56:73:e4:4c:74:95",
            "net9": "ea:e2:90:ec:9b:0b"
        },
        "spine_3_1_1": {
            "net0": "6e:e9:2b:47:6d:87",
            "net1": "96:b9:93:11:29:95",
            "net10": "72:98:b8:f0:8a:46",
            "net11": "da:ff:de:e5:b4:2f",
            "net12": "3e:fc:f1:61:0d:37",
            "net13": "da:cc:68:8f:12:6c",
            "net14": "6a:fd:d8:19:be:eb",
            "net15": "ce:f8:93:0b:16:1d",
            "net2": "2e:e8:bc:05:d3:42",
            "net3": "86:b0:58:2c:68:d6",
            "net4": "de:35:bc:ab:55:be",
            "net5": "b2:08:70:e0:b6:fa",
            "net6": "66:17:e0:97:33:26",
            "net7": "ba:94:29:ab:b9:50",
            "net8": "de:78:0c:e2:68:71",
            "net9": "ea:cd:96:5e:f3:d3"
        },
        "spine_3_1_2": {
            "net0": "be:c4:ae:5a:76:b6",
            "net1": "22:c1:4f:e2:74:58",
            "net10": "56:29:ff:e1:a3:90",
            "net11": "86:1a:dd:28:58:15",
            "net12": "16:9e:3c:70:cd:55",
            "net13": "06:20:ef:81:e8:1a",
            "net14": "92:69:59:43:db:db",
            "net15": "9e:9c:40:d4:20:cb",
            "net2": "7a:14:c5:cf:1f:c0",
            "net3": "5e:21:00:61:40:96",
            "net4": "42:87:0a:ad:79:a0",
            "net5": "8a:4a:5e:27:58:91",
            "net6": "b2:c4:07:c3:2b:59",
            "net7": "86:1c:1a:66:9f:d7",
            "net8": "ee:f7:60:c1:3b:9f",
            "net9": "b2:ec:29:92:cf:6d"
        },
        "spine_3_1_3": {
            "net0": "06:4c:1a:97:a2:96",
            "net1": "46:a3:f3:a8:37:1d",
            "net10": "3a:16:6d:bd:fe:ef",
            "net11": "c6:ce:ec:ef:ae:59",
            "net12": "7e:05:68:41:f1:21",
            "net13": "ae:b7:b2:dc:9f:53",
            "net14": "3a:bf:85:18:17:0f",
            "net15": "a2:40:26:b2:8d:98",
            "net2": "2a:1c:2f:fb:89:bf",
            "net3": "f6:98:56:1d:39:60",
            "net4": "0a:56:2a:5d:62:41",
            "net5": "72:14:ac:f6:34:3b",
            "net6": "32:8c:48:b3:50:69",
            "net7": "7e:53:33:47:fa:49",
            "net8": "be:be:30:88:ca:89",
            "net9": "b2:6d:91:eb:eb:45"
        },
        "spine_3_1_4": {
            "net0": "8a:68:51:c7:6e:18",
            "net1": "12:4c:f4:d8:de:e5",
            "net10": "ce:c8:98:bc:75:18",
            "net11": "de:41:96:d6:51:45",
            "net12": "fa:45:70:9c:d4:f1",
            "net13": "f2:de:f3:d6:4b:15",
            "net14": "5a:0d:51:1c:21:70",
            "net15": "a2:62:27:1a:04:7d",
            "net2": "e6:8e:be:c8:a9:8d",
            "net3": "2e:ec:7f:a0:54:bf",
            "net4": "8a:17:ee:7b:a3:57",
            "net5": "1a:23:26:97:90:18",
            "net6": "16:ba:8e:bd:37:30",
            "net7": "1a:1a:f9:d6:9b:af",
            "net8": "12:de:40:3b:85:85",
            "net9": "7a:81:0e:31:f1:42"
        },
        "spine_3_1_5": {
            "net0": "a6:c3:5c:92:dc:a1",
            "net1": "ee:a8:68:4a:46:80",
            "net10": "ca:f5:69:62:62:07",
            "net11": "e6:5f:07:5f:95:78",
            "net12": "ee:1b:15:83:13:0d",
            "net13": "16:fd:83:a4:1a:da",
            "net14": "ee:52:00:c0:4b:f2",
            "net15": "aa:77:91:08:c1:82",
            "net2": "56:08:d6:26:0b:61",
            "net3": "32:4f:4e:77:39:2e",
            "net4": "92:eb:68:94:43:2c",
            "net5": "7a:ff:b3:b6:5f:9c",
            "net6": "9e:d0:28:a9:60:a3",
            "net7": "62:25:fc:77:e7:89",
            "net8": "5a:ba:98:df:e2:dc",
            "net9": "7e:91:8f:7c:ef:f8"
        },
        "spine_3_1_6": {
            "net0": "3a:06:d9:a6:0b:26",
            "net1": "26:a6:3d:83:ef:a9",
            "net10": "ee:b7:b6:0f:a3:08",
            "net11": "5a:77:4b:32:94:0d",
            "net12": "7a:a2:57:68:be:44",
            "net13": "56:98:c0:a2:ae:9a",
            "net14": "76:8e:ea:5d:71:2c",
            "net15": "9a:27:8d:61:af:60",
            "net2": "66:95:97:75:a8:45",
            "net3": "ea:f3:d7:ec:6d:f9",
            "net4": "ae:bf:68:b2:2e:98",
            "net5": "be:b7:ca:a9:0f:38",
            "net6": "e6:45:4a:d0:54:5a",
            "net7": "a2:c4:69:bb:35:17",
            "net8": "c2:30:48:ec:08:ae",
            "net9": "6e:6f:ee:88:7d:9c"
        },
        "spine_3_1_7": {
            "net0": "4e:84:62:b7:75:90",
            "net1": "ea:82:c6:83:62:04",
            "net10": "26:1b:3a:f3:e1:24",
            "net11": "86:d9:18:73:a3:c6",
            "net12": "ce:1a:d3:35:14:cc",
            "net13": "46:b9:a2:e7:3e:c8",
            "net14": "be:61:92:2c:4d:87",
            "net15": "9a:97:02:d3:1e:dd",
            "net2": "26:57:f9:75:25:67",
            "net3": "76:45:ca:d0:b8:0e",
            "net4": "96:cb:87:ec:4a:93",
            "net5": "9a:b3:4e:8c:e9:52",
            "net6": "ae:18:cd:d0:34:37",
            "net7": "a6:3d:2f:c7:ad:c0",
            "net8": "66:fa:e6:bb:bb:01",
            "net9": "4e:a6:df:70:e6:ce"
        },
        "spine_3_1_8": {
            "net0": "5a:00:04:33:37:70",
            "net1": "7a:45:48:0c:0f:6b",
            "net10": "e6:e9:6d:e6:48:fb",
            "net11": "6a:3b:8a:ce:e8:69",
            "net12": "2a:e6:4d:70:e6:5b",
            "net13": "22:8c:c1:91:3b:63",
            "net14": "7a:e2:56:d8:57:2b",
            "net15": "c2:47:fc:dd:b1:18",
            "net2": "46:ff:44:ca:89:58",
            "net3": "c6:b9:bd:8a:82:40",
            "net4": "2e:5d:d4:37:a6:58",
            "net5": "52:a8:ce:e9:cb:57",
            "net6": "d6:d3:63:7e:b8:81",
            "net7": "be:28:a1:43:b5:12",
            "net8": "c6:92:1e:59:e8:72",
            "net9": "66:2e:95:ac:54:71"
        },
        "spine_4_1_1": {
            "net0": "72:b4:ae:91:cb:52",
            "net1": "aa:a9:d6:03:a0:32",
            "net10": "96:9e:8d:0a:81:71",
            "net11": "e6:e5:df:0d:b3:7b",
            "net12": "a2:4b:a3:ab:a2:26",
            "net13": "82:45:00:5a:b0:49",
            "net14": "c2:13:74:0c:4d:e3",
            "net15": "ae:82:99:b6:0a:da",
            "net2": "86:5a:5c:4c:9c:7c",
            "net3": "02:04:39:7f:c1:80",
            "net4": "36:1c:06:03:c9:43",
            "net5": "42:e5:fd:37:3a:fb",
            "net6": "c6:71:c5:02:92:e7",
            "net7": "02:df:0b:f1:11:42",
            "net8": "f6:f3:d6:21:9f:cf",
            "net9": "42:96:37:a4:f4:1b"
        },
        "spine_4_1_2": {
            "net0": "26:1c:c8:a0:fd:1c",
            "net1": "8a:21:49:b5:96:d1",
            "net10": "86:f0:29:8b:cc:5e",
            "net11": "26:83:f2:36:15:d3",
            "net12": "0a:27:d6:72:31:ac",
            "net13": "2e:a1:bc:8a:f4:ec",
            "net14": "c2:34:86:8e:7c:61",
            "net15": "76:c2:f3:4a:c3:95",
            "net2": "12:93:e7:e5:19:bf",
            "net3": "7a:59:61:61:7b:4c",
            "net4": "aa:78:2b:fe:fe:ae",
            "net5": "d2:f1:7e:46:02:b5",
            "net6": "c2:2f:60:3c:1b:b0",
            "net7": "56:33:df:4d:72:44",
            "net8": "e6:a6:58:2a:32:ac",
            "net9": "06:87:53:11:66:36"
        },
        "spine_4_1_3": {
            "net0": "ae:2e:60:77:98:f7",
            "net1": "92:6a:84:4d:e9:2d",
            "net10": "22:e5:54:b7:9f:dc",
            "net11": "26:e7:3b:c4:b1:ac",
            "net12": "3a:a3:31:9b:67:82",
            "net13": "26:70:35:6e:3a:7f",
            "net14": "46:f9:a9:1e:ad:c6",
            "net15": "32:6a:c9:fd:c9:4e",
            "net2": "56:c7:a1:cd:3f:79",
            "net3": "2a:fc:cf:01:f6:88",
            "net4": "f6:3e:33:5b:52:ec",
            "net5": "f2:62:20:07:ef:93",
            "net6": "12:7d:70:77:8c:4b",
            "net7": "66:e2:b8:3e:67:35",
            "net8": "e6:0a:e4:ff:ac:e5",
            "net9": "f2:ae:40:07:ad:fb"
        },
        "spine_4_1_4": {
            "net0": "82:d8:f0:30:9f:21",
            "net1": "52:6f:f4:93:7a:4d",
            "net10": "4a:57:36:dc:1c:2a",
            "net11": "02:35:79:c9:a5:ba",
            "net12": "a2:94:60:6d:52:08",
            "net13": "1a:67:b1:98:bd:0c",
            "net14": "a6:c9:a0:9e:da:57",
            "net15": "3e:ad:04:0a:78:48",
            "net2": "b2:51:ca:2b:7f:cb",
            "net3": "1a:5c:04:72:35:5d",
            "net4": "76:e7:36:a5:5e:9f",
            "net5": "9a:d0:c1:5f:78:a5",
            "net6": "be:c0:ba:f9:54:0c",
            "net7": "36:ef:d9:a6:b9:11",
            "net8": "b2:d1:d8:9c:fb:22",
            "net9": "56:67:1a:26:5e:34"
        },
        "spine_4_1_5": {
            "net0": "32:1b:5e:13:01:1d",
            "net1": "0e:00:07:0a:b6:b7",
            "net10": "d2:3c:8e:58:f1:af",
            "net11": "66:93:82:dd:cd:54",
            "net12": "7e:f7:37:78:c2:73",
            "net13": "ee:e9:51:d7:4d:c5",
            "net14": "06:f6:44:57:8c:89",
            "net15": "7e:b7:fb:80:3f:5d",
            "net2": "16:68:70:6c:92:29",
            "net3": "72:5c:6c:3f:c8:3e",
            "net4": "1a:fa:67:92:6c:1b",
            "net5": "d6:eb:c0:68:d3:6e",
            "net6": "5a:a8:1c:c8:ea:4b",
            "net7": "22:c6:3b:fd:27:d2",
            "net8": "7e:41:eb:6e:99:00",
            "net9": "e6:08:5e:63:73:2f"
        },
        "spine_4_1_6": {
            "net0": "3e:83:3d:08:1f:c2",
            "net1": "a6:78:60:7c:50:ea",
            "net10": "9a:c9:71:aa:40:73",
            "net11": "d6:f4:17:20:8e:c0",
            "net12": "0e:c2:2c:5e:26:4f",
            "net13": "76:9a:1f:1f:56:c8",
            "net14": "72:91:d9:63:8c:a6",
            "net15": "de:74:d3:cf:34:79",
            "net2": "d2:43:25:71:38:0c",
            "net3": "02:5d:35:c7:3a:c0",
            "net4": "d6:e8:37:b5:02:c0",
            "net5": "b6:9a:53:56:9e:e4",
            "net6": "32:de:84:01:67:0f",
            "net7": "5a:74:38:40:0f:8e",
            "net8": "b6:d9:90:ed:a2:a8",
            "net9": "2e:5f:a9:36:bf:87"
        },
        "spine_4_1_7": {
            "net0": "26:b3:6b:73:51:3d",
            "net1": "0e:aa:1f:7a:56:9a",
            "net10": "da:03:c9:3d:20:47",
            "net11": "de:3d:17:f2:9a:32",
            "net12": "6e:3a:7d:4e:e7:03",
            "net13": "2a:e2:f7:d4:0b:2a",
            "net14": "a2:ba:97:2a:30:ef",
            "net15": "fe:cd:97:5a:9c:a6",
            "net2": "66:79:76:0f:c3:d9",
            "net3": "ba:eb:87:b0:2c:f1",
            "net4": "6e:58:58:4e:05:82",
            "net5": "ba:c5:e7:3b:ab:05",
            "net6": "fa:66:04:ba:7b:96",
            "net7": "66:db:ae:f1:82:7d",
            "net8": "ae:04:85:8c:da:f5",
            "net9": "36:15:27:60:0e:45"
        },
        "spine_4_1_8": {
            "net0": "22:dc:aa:cc:8e:73",
            "net1": "9e:b9:2d:b4:20:4c",
            "net10": "72:77:e8:35:fd:f8",
            "net11": "66:bc:34:5a:ac:a6",
            "net12": "c2:2e:5a:07:28:f0",
            "net13": "f2:ad:96:95:a3:17",
            "net14": "fa:05:ad:d7:26:af",
            "net15": "2a:92:a2:bc:a4:66",
            "net2": "f6:eb:44:4d:77:2b",
            "net3": "32:f7:91:59:a7:1d",
            "net4": "ea:1e:26:f3:eb:5a",
            "net5": "26:29:04:ea:da:8f",
            "net6": "76:08:34:33:43:d1",
            "net7": "8a:18:54:7e:eb:df",
            "net8": "8e:ac:6a:a7:6a:86",
            "net9": "7a:d8:31:26:bf:f5"
        },
        "spine_5_1_1": {
            "net0": "96:4b:c4:1d:55:20",
            "net1": "02:d3:64:cd:a9:14",
            "net10": "6a:44:7c:99:d2:d3",
            "net11": "22:14:1a:aa:70:c5",
            "net12": "1e:78:fd:cf:1d:11",
            "net13": "ba:18:dd:64:84:cc",
            "net14": "0e:9a:13:b0:9a:2a",
            "net15": "82:d9:46:23:b1:7b",
            "net2": "62:35:9e:87:e1:d0",
            "net3": "f2:b8:2d:c0:f2:5d",
            "net4": "42:81:05:89:9d:a2",
            "net5": "c2:4b:d5:49:08:6d",
            "net6": "f2:96:16:79:8f:cd",
            "net7": "1a:13:c2:50:e1:91",
            "net8": "4e:43:11:6c:7a:a0",
            "net9": "66:fc:6d:08:7c:b2"
        },
        "spine_5_1_2": {
            "net0": "5e:68:28:9d:84:59",
            "net1": "8e:64:ec:46:a8:99",
            "net10": "6e:33:af:9e:7b:08",
            "net11": "c2:70:75:e4:62:bf",
            "net12": "f2:c6:cf:81:59:7f",
            "net13": "12:4d:13:d0:34:b2",
            "net14": "22:8e:c3:18:25:c3",
            "net15": "de:84:1e:55:c0:2d",
            "net2": "9a:0b:5d:3e:1f:69",
            "net3": "4a:db:ea:16:b0:34",
            "net4": "e6:d8:6f:56:35:c7",
            "net5": "fe:f2:83:e2:09:b6",
            "net6": "ee:04:08:48:7e:a8",
            "net7": "12:08:ee:15:8c:c6",
            "net8": "d2:c3:15:89:eb:d4",
            "net9": "3e:cd:10:e5:c2:ed"
        },
        "spine_5_1_3": {
            "net0": "6e:67:8e:93:c1:5c",
            "net1": "92:b6:3f:f4:16:76",
            "net10": "1a:f8:ac:b9:39:2a",
            "net11": "f6:4c:75:72:93:ef",
            "net12": "e2:ba:b9:76:b6:a9",
            "net13": "3a:37:01:c0:d7:33",
            "net14": "56:fd:2b:37:66:71",
            "net15": "96:37:96:36:27:75",
            "net2": "62:2c:5f:94:77:2a",
            "net3": "72:34:fb:79:09:cb",
            "net4": "72:d7:ac:03:52:9e",
            "net5": "36:33:7d:62:a4:47",
            "net6": "a2:33:20:48:79:03",
            "net7": "46:70:4c:9f:ad:ba",
            "net8": "8a:17:22:a2:90:3a",
            "net9": "d6:24:b8:fc:a9:59"
        },
        "spine_5_1_4": {
            "net0": "c6:9a:38:e2:73:c9",
            "net1": "5e:a3:d1:e7:a8:f4",
            "net10": "6e:05:0a:f2:b6:27",
            "net11": "c2:7c:66:01:24:75",
            "net12": "ae:c8:34:5e:f5:f8",
            "net13": "1a:43:e4:f0:f8:6d",
            "net14": "f2:9c:c8:dc:b6:8f",
            "net15": "72:1d:3c:15:b8:62",
            "net2": "d2:89:04:93:98:5c",
            "net3": "1e:ef:31:6e:ea:a0",
            "net4": "5a:14:5e:bf:57:08",
            "net5": "e6:fc:75:ae:87:5f",
            "net6": "4a:82:d5:78:e8:f1",
            "net7": "e2:c2:c8:05:bd:d7",
            "net8": "0e:0c:7a:d5:e7:23",
            "net9": "46:39:0d:ce:08:58"
        },
        "spine_5_1_5": {
            "net0": "0e:38:2e:84:39:d7",
            "net1": "c6:5c:bc:71:f6:c8",
            "net10": "16:71:e9:be:1e:95",
            "net11": "36:ce:02:47:e2:80",
            "net12": "0a:6f:14:aa:e5:70",
            "net13": "46:b8:2b:17:b0:63",
            "net14": "02:4d:e2:f4:3b:9f",
            "net15": "de:99:0e:f1:ae:ca",
            "net2": "ba:4b:50:f7:20:51",
            "net3": "ce:6a:14:e9:fd:75",
            "net4": "76:bb:a1:55:b0:4f",
            "net5": "9a:64:bc:22:64:a4",
            "net6": "6a:bb:9b:1b:91:bc",
            "net7": "3a:a5:1c:14:0a:14",
            "net8": "2e:85:a5:d9:24:98",
            "net9": "4e:bd:30:d6:8b:f1"
        },
        "spine_5_1_6": {
            "net0": "b2:23:a9:c4:ae:2f",
            "net1": "d2:ab:99:05:ed:f9",
            "net10": "1e:ea:43:d0:d3:02",
            "net11": "76:52:ae:d0:9c:d5",
            "net12": "c2:ff:f4:fe:61:4c",
            "net13": "ba:8b:c0:8e:7c:b0",
            "net14": "2e:df:88:c2:e9:a5",
            "net15": "7a:95:0a:73:e6:8d",
            "net2": "a6:be:64:22:cf:27",
            "net3": "52:ef:28:75:2c:61",
            "net4": "7e:b3:c9:66:2f:94",
            "net5": "da:09:66:01:02:4c",
            "net6": "1e:a9:1e:8d:5b:0b",
            "net7": "4a:c8:4d:46:60:13",
            "net8": "62:f3:12:8a:13:48",
            "net9": "82:e2:e1:6b:fc:94"
        },
        "spine_5_1_7": {
            "net0": "d6:1c:21:eb:c9:46",
            "net1": "aa:f3:e3:9a:0b:78",
            "net10": "e6:fa:11:b2:fe:68",
            "net11": "82:bf:6b:5f:e3:99",
            "net12": "12:9e:34:d0:ad:6d",
            "net13": "1a:5b:20:51:78:e1",
            "net14": "1a:0b:94:b4:5c:f0",
            "net15": "4e:0a:81:90:a1:f0",
            "net2": "06:45:7b:e5:8a:6f",
            "net3": "76:93:fc:ae:f7:58",
            "net4": "ee:5e:72:31:27:76",
            "net5": "5e:8f:a4:1f:d8:5b",
            "net6": "0a:2f:f6:2f:c6:5a",
            "net7": "be:14:56:58:d1:91",
            "net8": "2e:c8:29:9c:0e:6c",
            "net9": "b6:66:75:8c:c4:eb"
        },
        "spine_5_1_8": {
            "net0": "ee:e8:f1:b6:bb:e0",
            "net1": "26:4f:06:cc:65:f3",
            "net10": "7e:d9:db:e6:99:26",
            "net11": "d2:9a:06:7e:38:82",
            "net12": "9e:e5:a8:46:f7:2f",
            "net13": "ae:f1:21:cb:5f:d8",
            "net14": "b2:c3:9c:62:e3:f0",
            "net15": "d2:c8:1c:82:51:eb",
            "net2": "16:cc:b1:0b:cd:cb",
            "net3": "0e:15:54:8c:7a:0f",
            "net4": "da:8b:57:b3:f5:ac",
            "net5": "fa:f8:88:34:8d:c2",
            "net6": "6a:21:4c:f4:b3:74",
            "net7": "12:6e:32:52:55:91",
            "net8": "36:04:1e:9b:79:81",
            "net9": "de:81:c7:bc:bc:94"
        },
        "spine_6_1_1": {
            "net0": "1e:fd:66:a9:c6:f3",
            "net1": "ba:d0:3b:c2:df:be",
            "net10": "2e:2c:d2:d7:d3:79",
            "net11": "2e:74:32:d3:1f:2f",
            "net12": "42:c0:49:83:b4:07",
            "net13": "36:dc:a6:29:1f:77",
            "net14": "e2:68:c2:28:b8:6d",
            "net15": "de:61:5a:f6:83:ed",
            "net2": "a2:21:06:f3:5b:62",
            "net3": "3a:c9:5d:ac:24:3a",
            "net4": "f6:6e:38:5e:62:d6",
            "net5": "82:11:ba:c4:28:84",
            "net6": "a6:c5:c6:ff:df:04",
            "net7": "9e:55:dc:70:8c:51",
            "net8": "1a:75:ec:08:d9:be",
            "net9": "5a:d8:0a:d5:a3:57"
        },
        "spine_6_1_2": {
            "net0": "02:a1:b2:a2:56:cc",
            "net1": "76:47:9c:a8:d3:97",
            "net10": "d6:30:c5:c8:37:ef",
            "net11": "5a:db:cf:9b:8f:5e",
            "net12": "16:a7:ad:94:f8:16",
            "net13": "86:81:e3:97:20:08",
            "net14": "d6:97:cd:e4:bb:73",
            "net15": "6a:54:e8:64:d1:75",
            "net2": "3e:fb:34:8d:12:c7",
            "net3": "9a:05:12:b8:e6:a3",
            "net4": "02:f7:86:85:f7:70",
            "net5": "da:98:eb:5e:6d:56",
            "net6": "da:50:a3:26:1e:23",
            "net7": "ce:7f:84:69:6f:ad",
            "net8": "be:a3:cc:20:6c:98",
            "net9": "92:0b:d0:67:a9:86"
        },
        "spine_6_1_3": {
            "net0": "42:3b:e7:66:fd:a7",
            "net1": "22:0d:fc:f3:be:56",
            "net10": "3e:a8:58:2b:f8:2f",
            "net11": "2a:f2:89:54:ca:12",
            "net12": "62:4a:4e:77:01:90",
            "net13": "ea:f1:af:fd:8d:29",
            "net14": "9a:4f:b8:70:ed:2e",
            "net15": "0a:ae:c8:c3:18:fc",
            "net2": "b2:01:e9:07:ba:a9",
            "net3": "6a:1f:ab:2d:71:be",
            "net4": "ea:6a:94:0c:95:e5",
            "net5": "5a:5b:0a:1e:0f:a8",
            "net6": "52:eb:33:5d:a7:34",
            "net7": "66:c5:f9:0b:12:c0",
            "net8": "f6:92:97:2a:36:0e",
            "net9": "6a:63:d3:5d:a2:1b"
        },
        "spine_6_1_4": {
            "net0": "8a:dd:82:79:53:3a",
            "net1": "be:00:6f:29:2d:d0",
            "net10": "2a:e8:4f:71:05:a1",
            "net11": "d2:22:a8:59:d9:5c",
            "net12": "7e:19:2e:56:9e:3c",
            "net13": "d6:d9:37:7d:30:84",
            "net14": "d2:e5:58:5c:6b:4d",
            "net15": "92:b7:a4:e0:1d:dc",
            "net2": "5e:b9:d2:bf:4d:6e",
            "net3": "36:a4:4e:52:b9:13",
            "net4": "aa:89:40:17:f9:4b",
            "net5": "56:fd:93:fe:6f:ee",
            "net6": "42:bb:e2:4b:22:18",
            "net7": "ee:07:4c:61:40:65",
            "net8": "92:02:99:32:12:2e",
            "net9": "5e:33:2f:18:1e:05"
        },
        "spine_6_1_5": {
            "net0": "36:da:05:d8:30:17",
            "net1": "ee:8f:3c:55:0d:25",
            "net10": "ee:1d:a8:90:a7:cf",
            "net11": "8e:7c:14:7c:69:c6",
            "net12": "12:ef:24:3e:65:bb",
            "net13": "a6:e2:44:bb:aa:c9",
            "net14": "a2:bf:75:8b:32:21",
            "net15": "32:8f:10:78:0f:dd",
            "net2": "3a:2c:fb:54:0e:f3",
            "net3": "e2:f4:37:f0:e3:c6",
            "net4": "96:ce:1a:75:93:c0",
            "net5": "e2:34:2f:df:55:2e",
            "net6": "36:73:27:66:08:75",
            "net7": "46:02:0b:61:23:2c",
            "net8": "ae:20:4d:89:fe:b6",
            "net9": "6e:92:f1:c3:37:de"
        },
        "spine_6_1_6": {
            "net0": "ee:9c:75:bc:fc:d4",
            "net1": "9e:e6:ec:5c:54:f4",
            "net10": "f6:0d:26:93:17:43",
            "net11": "1e:16:0d:77:b8:76",
            "net12": "26:7b:67:73:a3:f6",
            "net13": "e6:39:af:d2:9e:0e",
            "net14": "62:54:7c:8d:45:f0",
            "net15": "36:2f:0e:97:44:6f",
            "net2": "8e:c9:f7:20:79:4a",
            "net3": "a2:5c:b6:67:7f:f1",
            "net4": "b6:b4:39:39:33:b3",
            "net5": "b6:13:a4:be:6f:22",
            "net6": "66:09:7e:ce:5e:bf",
            "net7": "7e:63:f9:1a:bb:c3",
            "net8": "16:d8:7e:ee:d3:f8",
            "net9": "1a:5b:e8:fa:63:4f"
        },
        "spine_6_1_7": {
            "net0": "ae:b6:6d:0b:60:f0",
            "net1": "f6:4d:e6:69:6d:1d",
            "net10": "7a:32:76:e8:6f:0a",
            "net11": "42:e1:b6:8a:cd:5e",
            "net12": "4a:a2:43:e8:34:17",
            "net13": "1e:5e:22:28:7f:ce",
            "net14": "22:7d:5c:fd:21:db",
            "net15": "b6:77:fd:a7:ff:ab",
            "net2": "0a:ee:8c:4a:7c:92",
            "net3": "1e:2e:90:f8:7c:e5",
            "net4": "16:f3:c0:9b:6a:b1",
            "net5": "2a:5f:d1:98:16:58",
            "net6": "96:5d:c9:5a:8e:96",
            "net7": "ee:af:59:a8:35:07",
            "net8": "ae:ef:ab:7d:8c:f7",
            "net9": "ea:6c:12:8d:62:e1"
        },
        "spine_6_1_8": {
            "net0": "12:9b:4e:0a:b4:f7",
            "net1": "fe:95:17:90:b3:9c",
            "net10": "b2:b2:1c:2c:22:73",
            "net11": "26:e3:7a:f7:8a:83",
            "net12": "36:a2:76:30:10:e2",
            "net13": "02:22:f0:6c:b6:df",
            "net14": "ea:10:a3:4e:62:f4",
            "net15": "96:c6:bd:e2:53:7b",
            "net2": "be:a8:b3:6e:b4:a5",
            "net3": "1e:ec:c4:3d:aa:24",
            "net4": "c2:76:5c:97:96:43",
            "net5": "76:de:5b:74:36:6a",
            "net6": "72:ce:b8:15:17:cb",
            "net7": "9e:56:0d:5f:53:94",
            "net8": "56:1b:a4:3a:0b:fd",
            "net9": "ae:4d:af:08:27:7b"
        },
        "spine_7_1_1": {
            "net0": "0e:51:fd:a9:4b:c4",
            "net1": "26:83:cd:b6:5b:62",
            "net10": "de:0e:55:12:e9:99",
            "net11": "e2:ad:90:f8:9e:bf",
            "net12": "12:f9:9f:68:a0:70",
            "net13": "be:02:f6:f0:3f:40",
            "net14": "72:23:fd:4c:29:f6",
            "net15": "c2:83:ff:d1:74:9a",
            "net2": "ea:7a:60:f8:d4:d1",
            "net3": "ce:7e:55:d9:a5:b9",
            "net4": "8e:96:8e:54:3b:04",
            "net5": "6e:4a:22:f1:c8:f9",
            "net6": "da:28:2e:cc:5f:6c",
            "net7": "7e:51:cb:2d:91:a5",
            "net8": "ca:8d:a6:2f:fa:1e",
            "net9": "12:d9:e7:4d:eb:6a"
        },
        "spine_7_1_2": {
            "net0": "d6:0c:ec:8c:b8:ad",
            "net1": "e6:4b:f3:72:5f:49",
            "net10": "86:8c:de:d4:f4:17",
            "net11": "66:33:1c:a6:82:3b",
            "net12": "8a:4f:ea:0d:c0:d7",
            "net13": "4a:d9:a1:9b:31:b5",
            "net14": "de:da:24:d6:c9:2e",
            "net15": "f2:a3:03:81:14:5c",
            "net2": "16:f1:87:78:84:8c",
            "net3": "8e:d1:b5:92:dd:ae",
            "net4": "ee:ef:3d:de:f5:2b",
            "net5": "4e:25:bc:49:ed:8b",
            "net6": "4a:91:c3:13:da:41",
            "net7": "42:99:b5:2a:2c:15",
            "net8": "06:da:fe:f5:f1:6e",
            "net9": "ba:d3:7a:bf:4f:05"
        },
        "spine_7_1_3": {
            "net0": "1e:21:a0:b5:4e:6b",
            "net1": "02:73:06:65:1c:10",
            "net10": "62:fe:84:17:48:d8",
            "net11": "e2:21:2e:14:f4:f2",
            "net12": "7e:b6:95:95:3a:22",
            "net13": "c6:ae:13:c7:e6:50",
            "net14": "c6:4a:97:89:78:d3",
            "net15": "82:7f:9d:f7:3c:4c",
            "net2": "0a:ba:4d:4c:81:cb",
            "net3": "c2:f3:05:24:27:fa",
            "net4": "02:88:93:36:9e:71",
            "net5": "d6:65:f8:83:b4:64",
            "net6": "56:d8:4d:8e:86:92",
            "net7": "62:5b:a6:9b:fc:88",
            "net8": "52:19:55:a2:fa:a1",
            "net9": "42:8a:66:42:2e:28"
        },
        "spine_7_1_4": {
            "net0": "aa:c5:fc:49:65:6c",
            "net1": "26:eb:96:60:cb:1f",
            "net10": "42:17:d5:de:19:0e",
            "net11": "92:9a:74:4a:90:8f",
            "net12": "da:7f:a4:d9:78:4c",
            "net13": "4a:7c:b9:a6:e6:31",
            "net14": "fe:1d:dc:5b:63:70",
            "net15": "6a:f1:95:13:74:c4",
            "net2": "8e:75:56:b4:03:b1",
            "net3": "d6:61:3f:99:d8:ad",
            "net4": "3a:8e:56:b3:2e:be",
            "net5": "2e:7e:dd:15:77:32",
            "net6": "62:da:02:41:6f:e9",
            "net7": "e6:4e:33:7c:a8:03",
            "net8": "36:63:c0:fb:d5:8e",
            "net9": "16:87:89:b3:f3:2a"
        },
        "spine_7_1_5": {
            "net0": "16:81:e3:3a:cf:e5",
            "net1": "66:79:95:f0:b5:84",
            "net10": "ba:fa:3e:49:d9:5d",
            "net11": "46:17:c7:43:d1:35",
            "net12": "86:b9:2d:46:f2:43",
            "net13": "0e:38:30:05:79:92",
            "net14": "b2:ac:d1:1b:48:c8",
            "net15": "fe:a5:79:ab:1a:ac",
            "net2": "4a:0c:af:c2:3d:6d",
            "net3": "16:99:15:fe:35:90",
            "net4": "22:98:8c:10:2a:f4",
            "net5": "2a:72:06:03:8f:5c",
            "net6": "ca:1f:fb:58:3b:a0",
            "net7": "f6:0b:2a:19:90:51",
            "net8": "0a:68:6d:9f:c7:fe",
            "net9": "16:e6:d1:b8:21:8b"
        },
        "spine_7_1_6": {
            "net0": "42:1c:a1:9f:9e:a7",
            "net1": "36:d9:f4:8c:68:c3",
            "net10": "0a:a0:3d:a2:64:3b",
            "net11": "ce:e9:87:59:9e:14",
            "net12": "a6:e3:a9:d4:67:9e",
            "net13": "8a:05:da:ab:b9:ff",
            "net14": "ee:af:ae:bc:f7:6c",
            "net15": "3a:53:50:0a:b5:75",
            "net2": "3e:0f:7d:fb:73:49",
            "net3": "96:0b:c9:ad:cc:99",
            "net4": "8a:b6:42:45:3d:b4",
            "net5": "22:3e:44:5a:91:aa",
            "net6": "0e:af:74:af:00:1c",
            "net7": "6a:2f:ea:c9:4a:14",
            "net8": "96:fb:cd:8d:74:69",
            "net9": "16:aa:8a:c8:51:da"
        },
        "spine_7_1_7": {
            "net0": "fa:02:00:cf:ac:fc",
            "net1": "2e:61:6c:7d:b4:33",
            "net10": "16:5d:2e:ff:ae:8b",
            "net11": "16:40:5a:cb:d5:cf",
            "net12": "4e:af:7f:ac:00:58",
            "net13": "ba:93:86:ba:e6:61",
            "net14": "52:b2:c1:37:ba:a6",
            "net15": "46:28:2e:5f:cb:04",
            "net2": "a2:89:6e:e8:7e:b1",
            "net3": "52:d2:4d:1a:41:34",
            "net4": "ae:2b:63:f5:68:7c",
            "net5": "f2:6c:98:51:03:5a",
            "net6": "36:76:9a:21:b1:14",
            "net7": "0e:75:47:44:47:97",
            "net8": "c6:20:8c:4d:a3:5a",
            "net9": "96:13:8a:b5:c1:98"
        },
        "spine_7_1_8": {
            "net0": "62:0d:07:f8:c0:82",
            "net1": "c2:1a:e8:67:83:24",
            "net10": "9a:c8:8c:25:7d:18",
            "net11": "c2:42:84:5b:e7:4d",
            "net12": "32:b8:8f:ac:bb:54",
            "net13": "3a:7b:54:13:50:13",
            "net14": "1e:6a:63:0e:d2:23",
            "net15": "d2:19:8e:1e:7f:ba",
            "net2": "b2:0f:8f:25:19:45",
            "net3": "3a:e0:9c:3e:d5:d5",
            "net4": "c6:7e:ed:6d:38:9b",
            "net5": "02:83:65:f3:e5:10",
            "net6": "f6:da:e8:0b:8b:c1",
            "net7": "0e:60:4d:b4:43:b2",
            "net8": "ca:23:fd:98:28:90",
            "net9": "9e:39:2b:ba:bf:7c"
        },
        "spine_8_1_1": {
            "net0": "6a:1d:8c:bf:51:1f",
            "net1": "36:59:ff:9b:75:83",
            "net10": "e6:64:30:38:c5:fd",
            "net11": "6a:15:90:2c:b0:de",
            "net12": "26:ee:c8:fd:6b:11",
            "net13": "52:6e:8c:ea:98:20",
            "net14": "ea:cb:3f:33:2d:66",
            "net15": "ee:e1:98:dd:b0:7c",
            "net2": "1e:34:36:91:57:95",
            "net3": "16:54:e4:c5:f6:37",
            "net4": "42:a6:39:f9:e8:91",
            "net5": "ba:38:eb:db:fa:b7",
            "net6": "76:c9:eb:58:42:c1",
            "net7": "3a:19:74:15:7c:61",
            "net8": "36:23:6f:2b:b5:9c",
            "net9": "92:f6:f4:69:7f:a4"
        },
        "spine_8_1_2": {
            "net0": "7e:87:80:bf:e5:64",
            "net1": "6a:fc:d6:92:95:a8",
            "net10": "ca:82:71:6e:47:75",
            "net11": "da:1d:21:65:5d:4c",
            "net12": "aa:24:2d:24:3e:f1",
            "net13": "86:54:3d:60:d8:0c",
            "net14": "ca:66:72:a8:94:4c",
            "net15": "1a:a2:29:4a:41:7f",
            "net2": "ee:60:43:73:66:28",
            "net3": "52:29:d2:e5:90:cb",
            "net4": "92:29:3a:dd:7a:fe",
            "net5": "8e:10:55:08:5a:cf",
            "net6": "82:ae:b4:34:13:47",
            "net7": "02:a2:bd:07:86:c3",
            "net8": "ca:03:2c:37:4b:c2",
            "net9": "e6:4c:4f:95:ee:9b"
        },
        "spine_8_1_3": {
            "net0": "ce:74:33:e1:c9:b8",
            "net1": "8a:5e:36:b7:f2:ba",
            "net10": "1e:ac:b5:50:52:63",
            "net11": "3a:63:ba:84:95:79",
            "net12": "3a:06:be:97:a4:77",
            "net13": "56:14:bf:9d:dc:ef",
            "net14": "6a:35:5d:12:cc:32",
            "net15": "4a:cb:d1:91:a8:3f",
            "net2": "b2:a2:45:7c:5d:7c",
            "net3": "2e:78:eb:3d:de:96",
            "net4": "9a:b9:f5:72:3c:c8",
            "net5": "3e:39:77:9a:ba:0d",
            "net6": "e6:b0:1d:d8:71:46",
            "net7": "f6:77:83:b7:16:ba",
            "net8": "b2:5a:d6:da:40:d4",
            "net9": "5e:74:97:38:b1:cb"
        },
        "spine_8_1_4": {
            "net0": "f2:56:6d:22:46:f8",
            "net1": "52:c5:3b:44:b9:13",
            "net10": "e2:ab:83:c5:17:48",
            "net11": "6e:24:44:ce:cc:ba",
            "net12": "7e:a8:3d:d5:44:69",
            "net13": "32:dc:fa:29:49:51",
            "net14": "76:5c:c8:73:80:e0",
            "net15": "de:65:c8:94:3e:6f",
            "net2": "82:7a:aa:04:3b:02",
            "net3": "9e:be:f0:24:34:de",
            "net4": "3e:2c:79:bf:4b:57",
            "net5": "3e:8a:b1:bd:c7:dc",
            "net6": "3e:03:d7:ef:f3:6c",
            "net7": "42:21:74:16:3b:f4",
            "net8": "3a:72:eb:75:b5:89",
            "net9": "ba:84:a4:07:74:c4"
        },
        "spine_8_1_5": {
            "net0": "52:3d:0e:0a:1e:71",
            "net1": "72:b0:5c:0f:80:58",
            "net10": "86:f3:93:20:2c:59",
            "net11": "62:d1:4e:e3:7d:b1",
            "net12": "62:7f:e1:f6:7e:d7",
            "net13": "12:dc:a2:f7:10:4f",
            "net14": "52:b6:2f:55:bf:82",
            "net15": "72:39:9c:4a:c6:a4",
            "net2": "0e:85:5c:f2:f5:67",
            "net3": "8a:d6:53:16:54:aa",
            "net4": "fa:37:fe:d8:14:be",
            "net5": "0a:84:b0:34:35:78",
            "net6": "66:e6:d9:06:03:0f",
            "net7": "36:72:90:30:a1:71",
            "net8": "16:8a:ea:88:e3:f2",
            "net9": "0e:7b:9b:af:d5:c8"
        },
        "spine_8_1_6": {
            "net0": "5e:d4:31:00:cf:d3",
            "net1": "1a:31:65:2d:76:5d",
            "net10": "3e:cf:52:8d:19:bb",
            "net11": "ce:16:9b:7e:ab:88",
            "net12": "2e:fe:8a:90:cc:ac",
            "net13": "8e:34:70:13:c0:1c",
            "net14": "8a:8f:d8:69:10:83",
            "net15": "aa:0a:70:89:06:14",
            "net2": "0e:50:1e:b5:34:1e",
            "net3": "86:a0:02:0f:38:40",
            "net4": "66:19:3a:61:d3:16",
            "net5": "56:c8:a5:f2:4a:2c",
            "net6": "06:71:d8:b4:37:16",
            "net7": "12:22:6b:81:aa:58",
            "net8": "32:9e:40:d9:8d:e9",
            "net9": "a6:ac:f5:3e:14:5c"
        },
        "spine_8_1_7": {
            "net0": "5e:33:e5:ba:50:3c",
            "net1": "e6:f1:c0:28:51:28",
            "net10": "e2:8f:d5:8b:74:9a",
            "net11": "26:b4:9c:a4:01:0b",
            "net12": "6a:21:d6:74:0d:af",
            "net13": "f2:6d:66:14:76:81",
            "net14": "2a:60:ef:ed:f8:c0",
            "net15": "3a:3c:82:f3:ea:f6",
            "net2": "d6:b6:ef:31:e7:7b",
            "net3": "7e:af:6a:9b:94:d2",
            "net4": "f6:e3:f7:7f:fd:20",
            "net5": "5a:01:83:04:fc:04",
            "net6": "f6:2c:c1:36:83:fb",
            "net7": "aa:21:a3:7b:d2:8a",
            "net8": "ce:c5:35:15:7c:fc",
            "net9": "52:03:e9:af:4b:e2"
        },
        "spine_8_1_8": {
            "net0": "d2:eb:5d:5e:ce:9f",
            "net1": "16:2c:55:00:67:02",
            "net10": "46:91:69:68:1d:23",
            "net11": "ca:94:ff:7b:13:10",
            "net12": "02:88:a6:76:e9:5f",
            "net13": "5e:4a:24:de:59:45",
            "net14": "9e:7a:6c:8f:62:42",
            "net15": "62:a8:91:1b:1f:7b",
            "net2": "32:8c:c3:5e:fb:4a",
            "net3": "66:3e:fd:9f:f8:2e",
            "net4": "46:84:f1:8e:d2:70",
            "net5": "f2:6e:80:0c:a6:c7",
            "net6": "da:6c:e0:9a:7e:07",
            "net7": "3e:ba:4e:37:8a:e3",
            "net8": "5e:e2:88:49:d0:ab",
            "net9": "c2:b7:e7:c7:29:2e"
        },
        "tof_1_2_1": {
            "net0": "76:28:50:35:09:ca",
            "net1": "82:0f:6c:03:e8:d1",
            "net10": "ea:2b:67:94:87:1b",
            "net11": "52:fb:f7:fb:93:66",
            "net12": "32:cd:ad:38:07:c8",
            "net13": "3a:99:8b:97:3d:a7",
            "net14": "42:4f:55:f1:76:27",
            "net15": "02:ab:44:ac:01:54",
            "net2": "56:89:c4:41:68:fc",
            "net3": "62:39:15:0a:6b:29",
            "net4": "d2:5b:d5:72:c3:fb",
            "net5": "92:1e:ad:ea:1a:c8",
            "net6": "12:c9:f1:3d:91:ee",
            "net7": "22:ad:e6:4f:8b:f3",
            "net8": "4e:14:5b:9a:7e:eb",
            "net9": "36:f3:41:36:e8:30"
        },
        "tof_1_2_2": {
            "net0": "de:d3:49:9c:2f:16",
            "net1": "32:a0:b4:3b:cc:02",
            "net10": "1e:1a:78:08:ef:3f",
            "net11": "f2:1e:08:28:8b:9c",
            "net12": "b6:21:9a:98:48:fc",
            "net13": "a6:bf:16:a5:17:d8",
            "net14": "fe:d1:4c:fb:0f:6e",
            "net15": "9a:7b:cb:63:80:ea",
            "net2": "22:b4:a6:d6:a0:a2",
            "net3": "e2:5a:bf:5b:79:7f",
            "net4": "da:0c:36:93:5b:a9",
            "net5": "1a:ab:f2:11:c4:66",
            "net6": "5a:fa:d6:06:cb:6d",
            "net7": "92:ee:11:0e:6f:05",
            "net8": "12:94:4e:a2:9f:ab",
            "net9": "96:fd:03:f5:be:b1"
        },
        "tof_1_2_3": {
            "net0": "82:94:4d:67:76:3b",
            "net1": "ba:e0:0b:e2:a9:d8",
            "net10": "7e:63:25:bc:fb:f9",
            "net11": "c6:0f:1d:49:fd:ed",
            "net12": "2a:3c:e8:25:18:44",
            "net13": "de:14:fd:0d:9e:04",
            "net14": "9e:6d:a5:27:b4:fa",
            "net15": "3a:33:9b:0c:c4:1e",
            "net2": "9e:0d:88:9d:10:9e",
            "net3": "aa:a0:51:46:65:ea",
            "net4": "de:e4:b0:cb:82:e6",
            "net5": "56:41:3e:8d:ba:50",
            "net6": "ea:e4:60:fd:c9:c1",
            "net7": "be:d3:b3:cf:57:3f",
            "net8": "4a:55:b3:c2:e4:1d",
            "net9": "be:7e:ac:71:9f:07"
        },
        "tof_1_2_4": {
            "net0": "6e:b0:1e:61:57:a7",
            "net1": "32:0a:39:c9:55:4f",
            "net10": "7a:25:d3:a0:83:d9",
            "net11": "ce:2a:ad:ad:16:64",
            "net12": "5a:be:5b:c1:f5:ab",
            "net13": "42:c5:7d:7d:56:10",
            "net14": "e2:cc:cb:47:9a:35",
            "net15": "92:cc:a9:f0:10:49",
            "net2": "ee:33:3d:c4:cd:0c",
            "net3": "d6:43:cf:7e:45:5d",
            "net4": "de:9d:b8:d1:e2:80",
            "net5": "ea:0b:1f:78:40:d3",
            "net6": "26:18:e9:78:38:fc",
            "net7": "12:2e:7a:db:35:88",
            "net8": "76:56:65:35:87:de",
            "net9": "b6:96:69:c1:e2:09"
        },
        "tof_1_2_5": {
            "net0": "7a:71:e1:a2:11:40",
            "net1": "0a:4c:89:c9:fc:ea",
            "net10": "2e:38:8b:98:d4:02",
            "net11": "8a:4b:7c:d3:3f:ee",
            "net12": "fe:2e:d6:38:e1:e5",
            "net13": "3a:12:81:d3:90:c6",
            "net14": "12:62:fe:fc:9b:61",
            "net15": "ea:0a:39:e3:0b:58",
            "net2": "9e:42:1f:0f:a7:b1",
            "net3": "42:8b:d0:3b:98:d2",
            "net4": "b6:09:4c:0b:a0:47",
            "net5": "d2:c5:07:ab:82:27",
            "net6": "46:4e:94:de:64:09",
            "net7": "aa:27:cd:23:ee:b9",
            "net8": "ea:e7:80:07:70:c8",
            "net9": "12:6e:a5:8d:e1:c6"
        },
        "tof_1_2_6": {
            "net0": "46:89:d2:c5:39:6b",
            "net1": "d2:34:8a:05:44:24",
            "net10": "ea:62:29:79:7c:2f",
            "net11": "5e:c2:19:c9:2e:9b",
            "net12": "4a:02:20:68:55:53",
            "net13": "5a:54:e1:be:b5:ca",
            "net14": "0a:82:21:4a:72:7e",
            "net15": "46:11:74:61:9d:74",
            "net2": "aa:76:17:ca:3a:48",
            "net3": "e6:71:c8:55:3b:fe",
            "net4": "ce:a0:76:6f:04:1e",
            "net5": "fe:b1:1e:63:6a:6f",
            "net6": "d2:b3:78:ed:ea:2e",
            "net7": "3a:58:00:5a:93:df",
            "net8": "72:88:9a:69:21:fd",
            "net9": "6e:b5:69:9d:e6:61"
        },
        "tof_1_2_7": {
            "net0": "6e:72:75:c0:bb:d6",
            "net1": "a2:88:c6:10:1e:09",
            "net10": "e6:86:8f:32:1a:59",
            "net11": "be:0e:99:ff:a9:9f",
            "net12": "3a:30:0c:31:3b:e7",
            "net13": "16:4c:3c:0b:57:41",
            "net14": "da:7e:aa:54:c6:1b",
            "net15": "56:1d:f0:91:45:af",
            "net2": "a2:75:24:21:39:da",
            "net3": "ca:38:54:88:86:0d",
            "net4": "2e:b4:5d:49:1d:0e",
            "net5": "86:8b:3a:40:dc:42",
            "net6": "da:77:35:89:2b:f8",
            "net7": "b6:a5:52:cf:bf:e1",
            "net8": "fe:7a:d7:02:ef:57",
            "net9": "d2:ad:34:b7:c5:19"
        },
        "tof_1_2_8": {
            "net0": "96:f1:46:98:fa:29",
            "net1": "9a:6d:4e:53:5b:5a",
            "net10": "c6:a3:67:25:6b:f7",
            "net11": "72:5e:39:58:f6:91",
            "net12": "92:2c:75:00:15:be",
            "net13": "0e:6d:aa:63:41:ae",
            "net14": "5e:7e:25:df:67:83",
            "net15": "7e:e8:81:3a:2b:c1",
            "net2": "fe:3f:f4:98:6f:50",
            "net3": "ae:e6:4d:07:ea:c5",
            "net4": "ba:59:f4:d8:f8:0c",
            "net5": "0a:6a:db:31:18:80",
            "net6": "b2:c1:5a:27:56:0f",
            "net7": "86:62:21:1d:cf:36",
            "net8": "ea:cb:ff:b9:59:a3",
            "net9": "ee:20:e2:c9:07:c3"
        },
        "tof_2_2_1": {
            "net0": "d2:26:20:f8:67:14",
            "net1": "82:a9:5e:96:85:8b",
            "net10": "02:8b:2a:b0:4e:12",
            "net11": "c2:1d:71:08:b8:c1",
            "net12": "b6:b5:ed:5f:1b:71",
            "net13": "be:ff:f1:dc:ff:0c",
            "net14": "ae:c2:71:18:ec:77",
            "net15": "22:8e:f7:ad:e1:73",
            "net2": "ee:52:ae:f7:87:61",
            "net3": "5a:0e:13:25:10:e2",
            "net4": "a6:27:5a:4d:5d:6b",
            "net5": "b6:8f:81:7e:58:eb",
            "net6": "6e:0d:e0:dc:78:3b",
            "net7": "3e:24:1b:10:bc:97",
            "net8": "72:d9:f8:f6:dd:71",
            "net9": "4a:75:48:61:42:89"
        },
        "tof_2_2_2": {
            "net0": "b2:3d:f2:08:7b:16",
            "net1": "aa:c3:70:e1:1f:cc",
            "net10": "c6:34:20:0d:23:42",
            "net11": "de:cb:ee:3b:1b:c3",
            "net12": "9e:d2:b0:45:3f:b1",
            "net13": "7e:b0:68:09:a3:82",
            "net14": "7a:34:dc:9b:3b:18",
            "net15": "16:b4:ba:3d:45:ac",
            "net2": "ee:27:22:ab:c7:75",
            "net3": "86:ea:46:44:37:b4",
            "net4": "36:b9:c4:f4:6a:79",
            "net5": "ae:12:2c:ad:e0:b3",
            "net6": "86:da:64:05:db:df",
            "net7": "26:fc:09:ba:6b:67",
            "net8": "56:f1:c4:39:e4:b4",
            "net9": "8e:43:69:f7:a6:76"
        },
        "tof_2_2_3": {
            "net0": "1a:32:7a:72:98:fe",
            "net1": "2a:52:6f:bb:85:ae",
            "net10": "d2:dd:aa:8d:22:f8",
            "net11": "e2:b2:93:1c:6d:62",
            "net12": "16:69:d1:65:af:b5",
            "net13": "aa:49:d6:38:65:03",
            "net14": "62:ef:fe:02:2a:a7",
            "net15": "0a:72:86:c9:e7:e0",
            "net2": "96:56:f5:ce:69:66",
            "net3": "72:73:4e:d4:ab:4f",
            "net4": "d6:ac:ad:b7:7a:38",
            "net5": "f2:ac:52:5f:12:5e",
            "net6": "3e:27:4b:20:7d:fa",
            "net7": "46:b6:a9:c9:2d:b2",
            "net8": "fe:46:62:4f:17:e0",
            "net9": "5a:8d:3c:bd:62:71"
        },
        "tof_2_2_4": {
            "net0": "86:4f:9b:25:fd:d0",
            "net1": "06:72:4c:79:a6:4c",
            "net10": "72:c1:5f:a5:05:33",
            "net11": "22:db:c5:95:dd:2f",
            "net12": "7a:10:1e:50:27:e2",
            "net13": "a6:11:7b:53:db:cb",
            "net14": "26:85:f5:6f:50:22",
            "net15": "ba:7e:a8:6f:39:5a",
            "net2": "76:88:aa:0b:3b:61",
            "net3": "82:ba:cb:4d:3d:7d",
            "net4": "6e:34:1c:d1:f1:3f",
            "net5": "72:e8:d9:bc:30:66",
            "net6": "6e:58:c4:5d:e3:97",
            "net7": "b2:1e:18:d0:a0:7e",
            "net8": "52:f7:4a:36:22:87",
            "net9": "3e:14:03:88:b1:e6"
        },
        "tof_2_2_5": {
            "net0": "f6:6a:90:fd:e5:a8",
            "net1": "ee:a0:be:23:78:f6",
            "net10": "4a:78:f5:16:56:4d",
            "net11": "a2:fb:68:8e:3a:13",
            "net12": "e2:0d:99:00:22:b7",
            "net13": "ee:9e:c7:dd:99:17",
            "net14": "ee:e4:d0:0f:fc:c5",
            "net15": "ba:cf:07:d9:6e:74",
            "net2": "9a:1c:3c:21:5f:01",
            "net3": "ae:6e:8a:2c:7f:3d",
            "net4": "e6:34:9b:86:80:7a",
            "net5": "b2:80:83:3d:ce:80",
            "net6": "aa:c5:75:d9:63:e3",
            "net7": "1e:72:0e:1b:e2:ca",
            "net8": "16:53:0c:c0:70:1e",
            "net9": "62:31:eb:0f:c7:25"
        },
        "tof_2_2_6": {
            "net0": "4e:bc:39:7d:1e:8d",
            "net1": "1a:67:91:1d:53:fb",
            "net10": "42:41:43:bc:fc:5b",
            "net11": "0e:a7:ee:21:ca:31",
            "net12": "72:6c:c0:63:35:6f",
            "net13": "3a:11:d4:e4:7c:bb",
            "net14": "82:54:de:1f:57:2f",
            "net15": "46:e7:c1:60:a3:f0",
            "net2": "72:27:97:72:1d:d7",
            "net3": "ca:b3:dc:de:cb:23",
            "net4": "f6:e4:f3:e7:94:54",
            "net5": "92:84:64:42:13:00",
            "net6": "f2:f0:da:0b:63:38",
            "net7": "32:8e:00:ec:71:df",
            "net8": "5a:f5:36:c1:12:e1",
            "net9": "c2:ec:95:fb:01:11"
        },
        "tof_2_2_7": {
            "net0": "4e:22:30:8a:01:e1",
            "net1": "de:0c:8c:54:45:df",
            "net10": "76:a0:91:c3:4f:8c",
            "net11": "82:31:bc:14:f5:35",
            "net12": "22:a0:3b:f8:95:e3",
            "net13": "b6:6a:2c:9c:ff:8a",
            "net14": "3e:2c:84:a6:27:36",
            "net15": "4a:9f:77:a1:42:99",
            "net2": "96:77:ab:43:eb:53",
            "net3": "32:f8:6c:bb:d6:a1",
            "net4": "b6:8d:be:55:5a:c3",
            "net5": "e2:d3:0e:5a:9d:94",
            "net6": "12:11:52:3e:49:e6",
            "net7": "2a:47:5d:72:52:67",
            "net8": "5e:42:cd:78:ad:50",
            "net9": "ae:b5:ea:81:34:d1"
        },
        "tof_2_2_8": {
            "net0": "5e:de:06:3d:ce:b6",
            "net1": "da:c5:ba:29:b6:8b",
            "net10": "7e:64:30:b5:9a:40",
            "net11": "46:8a:6c:2e:f5:88",
            "net12": "2a:57:06:da:c9:fd",
            "net13": "9e:15:31:55:66:77",
            "net14": "b2:62:d8:dd:94:30",
            "net15": "fa:65:44:82:e9:93",
            "net2": "6a:56:b6:03:33:7e",
            "net3": "c2:fe:99:bf:73:10",
            "net4": "9a:98:e0:02:fb:b5",
            "net5": "d6:e8:3c:ba:84:85",
            "net6": "b2:f3:ba:a1:a5:d2",
            "net7": "be:64:f3:54:f7:5f",
            "net8": "ce:3f:23:c9:86:dd",
            "net9": "2e:d2:a9:23:10:ac"
        },
        "tof_3_2_1": {
            "net0": "62:e2:c1:85:43:08",
            "net1": "0e:48:4f:64:99:59",
            "net10": "26:3c:2f:8a:d0:f1",
            "net11": "fe:c3:eb:d8:6e:e7",
            "net12": "ce:5e:0a:3e:ff:6a",
            "net13": "5e:ee:01:5e:b5:0c",
            "net14": "3e:47:bf:6e:f5:b8",
            "net15": "7a:81:6e:b6:50:59",
            "net2": "2a:8d:c8:77:d1:14",
            "net3": "2a:3f:0b:33:f7:d2",
            "net4": "7a:43:b2:1a:3f:03",
            "net5": "9a:b1:64:21:22:38",
            "net6": "96:10:bf:f5:5f:dc",
            "net7": "66:ab:3b:22:2b:3a",
            "net8": "ba:80:b0:dd:f2:2e",
            "net9": "a2:0e:21:69:7b:05"
        },
        "tof_3_2_2": {
            "net0": "1e:d3:22:0e:9e:39",
            "net1": "a6:41:bd:90:76:a9",
            "net10": "ba:49:65:38:f4:b4",
            "net11": "3a:2e:cf:4f:40:fb",
            "net12": "be:29:ea:91:94:30",
            "net13": "ba:9e:83:68:90:4e",
            "net14": "9a:aa:05:a8:ad:cd",
            "net15": "86:c5:71:e4:31:8b",
            "net2": "92:b5:52:c1:f9:f6",
            "net3": "16:70:7c:4d:e7:27",
            "net4": "ca:48:0e:aa:aa:c7",
            "net5": "aa:67:16:bd:83:8f",
            "net6": "56:98:0e:ce:c7:5e",
            "net7": "2a:8b:45:6b:9a:c6",
            "net8": "7a:8a:0a:66:7a:0c",
            "net9": "0e:f6:a8:04:63:ff"
        },
        "tof_3_2_3": {
            "net0": "1e:17:c1:60:b1:43",
            "net1": "86:39:c8:a5:8f:85",
            "net10": "9e:c1:8e:e4:58:e0",
            "net11": "7e:d5:5d:48:7f:95",
            "net12": "fa:97:02:ef:c5:9f",
            "net13": "42:b1:a6:6c:e8:51",
            "net14": "e2:21:06:cd:38:5f",
            "net15": "ce:7a:64:52:21:ba",
            "net2": "be:e4:38:1c:25:1c",
            "net3": "92:bb:f8:f1:04:d5",
            "net4": "da:74:2d:2c:87:d1",
            "net5": "de:dd:83:6d:e3:7a",
            "net6": "da:81:93:d7:61:c7",
            "net7": "82:e2:4f:13:50:74",
            "net8": "ba:bb:75:11:7d:29",
            "net9": "2a:92:48:b0:23:3e"
        },
        "tof_3_2_4": {
            "net0": "42:4f:51:8c:70:02",
            "net1": "5a:30:af:87:80:27",
            "net10": "92:37:24:0a:21:74",
            "net11": "de:d6:ad:25:59:3e",
            "net12": "ca:4b:cd:72:37:1d",
            "net13": "96:9a:bd:e5:35:1f",
            "net14": "92:6a:60:74:b1:85",
            "net15": "3e:83:15:6c:39:b2",
            "net2": "ca:29:de:7f:c2:8a",
            "net3": "1a:70:f9:2b:d1:87",
            "net4": "56:18:d1:04:49:f6",
            "net5": "d6:d1:0d:57:39:8c",
            "net6": "c6:f5:a9:9e:34:20",
            "net7": "ae:69:f1:0c:44:4c",
            "net8": "62:0d:7e:7f:25:ea",
            "net9": "96:dd:b5:52:d2:53"
        },
        "tof_3_2_5": {
            "net0": "12:92:f4:94:96:6e",
            "net1": "e6:cf:93:a7:2a:08",
            "net10": "96:17:8b:d6:fe:c3",
            "net11": "1e:13:7a:16:88:7b",
            "net12": "ea:c7:50:69:e6:d5",
            "net13": "42:5a:29:b8:e4:80",
            "net14": "86:90:65:72:e8:2b",
            "net15": "ca:90:1e:77:b4:fc",
            "net2": "b6:c8:a7:2f:28:97",
            "net3": "56:a1:69:b7:f5:b4",
            "net4": "7e:47:3b:c4:ec:bd",
            "net5": "b2:13:82:6d:19:e6",
            "net6": "e2:48:53:0a:89:76",
            "net7": "8e:3c:51:fb:a4:fa",
            "net8": "be:7a:09:06:70:7f",
            "net9": "be:e1:69:58:02:93"
        },
        "tof_3_2_6": {
            "net0": "7a:04:69:11:b7:cc",
            "net1": "52:f4:b9:06:7e:22",
            "net10": "2e:f2:c5:59:49:6b",
            "net11": "ea:85:b8:a6:8d:06",
            "net12": "9e:fd:bb:3e:a7:9e",
            "net13": "f6:cc:d7:9b:de:85",
            "net14": "22:ee:de:2c:92:cd",
            "net15": "fa:04:fc:df:b9:67",
            "net2": "72:fa:8d:e2:74:44",
            "net3": "6e:ab:13:76:0b:a6",
            "net4": "d6:56:5b:00:71:db",
            "net5": "aa:d9:7d:10:ea:31",
            "net6": "1e:5e:12:d7:82:8d",
            "net7": "a2:78:c4:31:e5:38",
            "net8": "da:17:23:50:00:87",
            "net9": "16:90:2c:0c:51:42"
        },
        "tof_3_2_7": {
            "net0": "e6:fd:31:59:fe:a8",
            "net1": "9a:22:1d:c5:4b:a8",
            "net10": "52:5d:79:9b:c9:68",
            "net11": "a6:4a:f2:0b:db:61",
            "net12": "72:fe:79:e2:c2:d3",
            "net13": "1a:12:40:f6:6f:1e",
            "net14": "b2:00:78:13:ff:67",
            "net15": "5a:e0:80:aa:6a:fc",
            "net2": "42:9a:e8:f1:55:b9",
            "net3": "02:57:d8:3e:b3:28",
            "net4": "fe:68:e3:26:6c:d1",
            "net5": "72:34:c7:80:f0:1a",
            "net6": "02:09:cc:36:10:d5",
            "net7": "9e:62:40:bb:94:af",
            "net8": "26:7d:a6:d6:2b:6f",
            "net9": "5e:1c:4e:c1:76:04"
        },
        "tof_3_2_8": {
            "net0": "6e:12:b8:a1:cb:14",
            "net1": "0e:89:84:53:31:46",
            "net10": "d6:16:21:4e:87:75",
            "net11": "72:01:c2:72:c2:c5",
            "net12": "6e:1f:24:b8:0a:36",
            "net13": "8a:12:e4:7f:a5:12",
            "net14": "12:b8:ac:62:de:a1",
            "net15": "02:35:10:2a:12:f0",
            "net2": "12:72:de:f6:c8:38",
            "net3": "8e:8a:a1:23:d7:f5",
            "net4": "1a:36:0e:5f:3d:78",
            "net5": "fe:8e:32:5c:36:b4",
            "net6": "ae:77:d1:08:51:35",
            "net7": "de:78:98:fa:30:cf",
            "net8": "da:22:57:7c:82:a5",
            "net9": "ce:85:f5:3a:3f:67"
        },
        "tof_4_2_1": {
            "net0": "ce:63:79:44:06:bc",
            "net1": "e2:c8:44:3d:c4:bb",
            "net10": "7e:b8:13:8c:6f:a0",
            "net11": "0e:a3:f2:2a:6f:74",
            "net12": "76:d4:24:af:4f:2c",
            "net13": "5e:1d:ba:c2:80:13",
            "net14": "ae:e5:5c:73:b0:44",
            "net15": "f2:67:5d:fb:bd:1a",
            "net2": "f6:ea:c8:9e:40:1e",
            "net3": "8e:99:36:1e:6e:af",
            "net4": "6a:40:0e:df:e5:c9",
            "net5": "0e:c1:50:f6:0d:f6",
            "net6": "3e:77:44:c7:9e:d9",
            "net7": "ae:79:c2:4b:32:28",
            "net8": "76:08:f4:bd:38:36",
            "net9": "8e:21:b5:03:60:e8"
        },
        "tof_4_2_2": {
            "net0": "ce:f7:87:83:3d:03",
            "net1": "3e:64:6a:ef:6f:b8",
            "net10": "7a:4c:92:3a:38:a6",
            "net11": "a6:61:7d:6f:c6:b1",
            "net12": "9a:a4:74:db:78:90",
            "net13": "2e:94:70:10:4e:5b",
            "net14": "a6:c0:5d:46:ae:a8",
            "net15": "52:e8:21:e9:ad:ba",
            "net2": "22:04:84:cc:27:8d",
            "net3": "82:cc:43:69:fe:fa",
            "net4": "5e:e4:6e:11:7e:49",
            "net5": "9a:cb:54:5a:8a:63",
            "net6": "82:b1:f6:81:50:41",
            "net7": "02:df:1e:c4:2a:e1",
            "net8": "8e:8a:f0:9e:f1:a3",
            "net9": "b6:dd:75:cf:39:88"
        },
        "tof_4_2_3": {
            "net0": "c6:b6:19:d6:8d:b0",
            "net1": "4e:56:7e:d5:e5:51",
            "net10": "82:11:52:f8:18:9f",
            "net11": "56:b4:13:2d:67:67",
            "net12": "56:e9:d7:61:86:e0",
            "net13": "5e:cd:87:59:f9:1b",
            "net14": "3e:9d:dc:14:0a:84",
            "net15": "4a:96:9d:02:66:72",
            "net2": "4e:7b:ef:3c:65:b1",
            "net3": "ee:32:eb:46:19:57",
            "net4": "fa:85:e2:a0:7b:c6",
            "net5": "62:72:b4:db:66:36",
            "net6": "ea:23:68:7a:b8:ef",
            "net7": "ca:d2:7d:a8:da:5e",
            "net8": "c6:ee:5b:01:4e:a9",
            "net9": "56:9f:65:69:c0:fc"
        },
        "tof_4_2_4": {
            "net0": "ee:19:e3:4d:eb:86",
            "net1": "62:9f:5b:48:1f:44",
            "net10": "92:84:d0:e7:71:31",
            "net11": "9a:44:22:c0:66:23",
            "net12": "86:49:73:1f:58:2a",
            "net13": "32:79:14:cb:1e:b2",
            "net14": "72:64:bb:4f:70:bb",
            "net15": "ce:91:af:29:33:a6",
            "net2": "92:75:ec:e0:4a:f6",
            "net3": "52:8b:70:a7:f8:6c",
            "net4": "92:29:12:d6:3f:cd",
            "net5": "e6:a2:05:2f:f8:9d",
            "net6": "da:16:b0:72:59:72",
            "net7": "72:1d:f5:8c:c9:f9",
            "net8": "ae:74:47:27:3b:1c",
            "net9": "9e:8d:e3:7f:6c:75"
        },
        "tof_4_2_5": {
            "net0": "32:2e:d7:e5:f4:e6",
            "net1": "9e:a1:f9:85:99:ee",
            "net10": "32:5b:66:59:4b:d6",
            "net11": "4a:24:f8:6f:af:88",
            "net12": "66:aa:a1:af:7f:e4",
            "net13": "76:a1:da:62:27:24",
            "net14": "be:a4:32:89:8f:6d",
            "net15": "c2:da:a0:b2:41:4f",
            "net2": "aa:c9:35:51:f4:3c",
            "net3": "d6:b2:d3:78:30:2d",
            "net4": "5a:87:53:45:0c:f2",
            "net5": "62:63:23:7b:ab:1a",
            "net6": "46:a2:80:17:d8:7f",
            "net7": "16:c1:d7:10:3c:ab",
            "net8": "2a:b1:d2:75:d9:28",
            "net9": "16:bc:d2:3e:bc:b7"
        },
        "tof_4_2_6": {
            "net0": "06:15:c8:3c:e1:59",
            "net1": "26:ad:94:55:ba:46",
            "net10": "0e:09:fc:24:9a:e0",
            "net11": "3a:16:ba:e5:f6:af",
            "net12": "72:c5:5b:b2:56:6f",
            "net13": "12:57:e9:fd:99:90",
            "net14": "2e:0d:e4:0e:ba:81",
            "net15": "8a:c5:3d:d7:31:77",
            "net2": "52:d1:7e:75:3d:11",
            "net3": "ea:ab:92:c4:44:61",
            "net4": "32:fe:b9:ec:24:1b",
            "net5": "ea:98:d2:3c:2f:bf",
            "net6": "c6:88:97:55:80:32",
            "net7": "b2:74:d4:9a:e8:e9",
            "net8": "9a:b4:07:29:03:ad",
            "net9": "f6:a2:9a:e4:58:80"
        },
        "tof_4_2_7": {
            "net0": "76:3f:85:15:13:fc",
            "net1": "ae:60:87:34:44:2e",
            "net10": "e6:a0:ea:eb:19:e5",
            "net11": "3a:77:b4:d8:ce:36",
            "net12": "66:f6:c9:ec:a1:28",
            "net13": "3e:20:14:c3:bc:4c",
            "net14": "0a:ed:53:a3:a2:c3",
            "net15": "4a:87:d2:f5:93:a2",
            "net2": "1a:30:83:2a:a8:5a",
            "net3": "aa:c9:ae:58:1f:46",
            "net4": "fe:f5:13:01:55:fb",
            "net5": "fa:36:70:31:ca:b7",
            "net6": "3e:a8:33:4c:fb:a2",
            "net7": "ba:e7:89:f8:90:fe",
            "net8": "76:66:a3:3b:1e:27",
            "net9": "fa:4a:4c:fb:41:ba"
        },
        "tof_4_2_8": {
            "net0": "da:de:40:a6:48:cc",
            "net1": "62:8b:68:43:95:91",
            "net10": "16:e9:ae:b1:4f:01",
            "net11": "2a:0a:8d:01:be:55",
            "net12": "7e:79:3b:fd:57:e1",
            "net13": "72:f7:9a:6b:cb:a4",
            "net14": "ae:18:b6:3b:29:bc",
            "net15": "9a:a7:06:2d:75:f9",
            "net2": "7e:1f:e5:a8:91:1b",
            "net3": "c6:90:d5:80:fd:b8",
            "net4": "a2:5d:ee:69:cb:ca",
            "net5": "06:f9:3c:30:2c:f8",
            "net6": "b6:fe:d1:4f:de:b5",
            "net7": "4a:54:14:82:d4:a0",
            "net8": "f2:2c:de:bc:9c:54",
            "net9": "ee:90:41:c9:02:bf"
        }
    },
    "failed_machine": "leaf_1_0_1",
    "failure_time": {
        "leaf_1_0_1": 1622481723.5744548,
        "leaf_1_0_2": 1622481723.5830889,
        "leaf_1_0_3": 1622481723.5924706,
        "leaf_1_0_4": 1622481723.6047478,
        "leaf_1_0_5": 1622481723.6137407,
        "leaf_1_0_6": 1622481723.6248777,
        "leaf_1_0_7": 1622481723.6364717,
        "leaf_1_0_8": 1622481723.643569,
        "leaf_2_0_1": 1622481723.6517599,
        "leaf_2_0_2": 1622481723.6572955,
        "leaf_2_0_3": 1622481723.663969,
        "leaf_2_0_4": 1622481723.6720066,
        "leaf_2_0_5": 1622481723.678124,
        "leaf_2_0_6": 1622481723.6903212,
        "leaf_2_0_7": 1622481723.6978889,
        "leaf_2_0_8": 1622481723.7047997,
        "leaf_3_0_1": 1622481723.7134087,
        "leaf_3_0_2": 1622481723.7259147,
        "leaf_3_0_3": 1622481723.738032,
        "leaf_3_0_4": 1622481723.7507954,
        "leaf_3_0_5": 1622481723.576872,
        "leaf_3_0_6": 1622481723.5887103,
        "leaf_3_0_7": 1622481723.5986729,
        "leaf_3_0_8": 1622481723.610538,
        "leaf_4_0_1": 1622481723.6194336,
        "leaf_4_0_2": 1622481723.627234,
        "leaf_4_0_3": 1622481723.6364524,
        "leaf_4_0_4": 1622481723.644824,
        "leaf_4_0_5": 1622481723.652758,
        "leaf_4_0_6": 1622481723.6639674,
        "leaf_4_0_7": 1622481723.6770344,
        "leaf_4_0_8": 1622481723.6826804,
        "leaf_5_0_1": 1622481723.6961675,
        "leaf_5_0_2": 1622481723.7030144,
        "leaf_5_0_3": 1622481723.7109272,
        "leaf_5_0_4": 1622481723.7205222,
        "leaf_5_0_5": 1622481723.732861,
        "leaf_5_0_6": 1622481723.7453623,
        "leaf_5_0_7": 1622481723.7530246,
        "leaf_5_0_8": 1622481723.762568,
        "leaf_6_0_1": 1622481723.7578578,
        "leaf_6_0_2": 1622481723.766625,
        "leaf_6_0_3": 1622481723.7783697,
        "leaf_6_0_4": 1622481723.787825,
        "leaf_6_0_5": 1622481723.7969928,
        "leaf_6_0_6": 1622481723.8102384,
        "leaf_6_0_7": 1622481723.8215082,
        "leaf_6_0_8": 1622481723.831307,
        "leaf_7_0_1": 1622481723.8386905,
        "leaf_7_0_2": 1622481723.8494008,
        "leaf_7_0_3": 1622481723.8576078,
        "leaf_7_0_4": 1622481723.8643086,
        "leaf_7_0_5": 1622481723.8716884,
        "leaf_7_0_6": 1622481723.878344,
        "leaf_7_0_7": 1622481723.8889234,
        "leaf_7_0_8": 1622481723.8973577,
        "leaf_8_0_1": 1622481723.9112537,
        "leaf_8_0_2": 1622481723.9177,
        "leaf_8_0_3": 1622481723.9301746,
        "leaf_8_0_4": 1622481723.937886,
        "leaf_8_0_5": 1622481723.7798588,
        "leaf_8_0_6": 1622481723.791748,
        "leaf_8_0_7": 1622481723.7982876,
        "leaf_8_0_8": 1622481723.8117404,
        "spine_1_1_1": 1622481723.828734,
        "spine_1_1_2": 1622481723.8365932,
        "spine_1_1_3": 1622481723.8456807,
        "spine_1_1_4": 1622481723.8575532,
        "spine_1_1_5": 1622481723.8619113,
        "spine_1_1_6": 1622481723.8674054,
        "spine_1_1_7": 1622481723.8738034,
        "spine_1_1_8": 1622481723.8797078,
        "spine_2_1_1": 1622481723.888966,
        "spine_2_1_2": 1622481723.9003127,
        "spine_2_1_3": 1622481723.9075942,
        "spine_2_1_4": 1622481723.9183652,
        "spine_2_1_5": 1622481723.9288962,
        "spine_2_1_6": 1622481723.9353218,
        "spine_2_1_7": 1622481723.9431646,
        "spine_2_1_8": 1622481723.9527812,
        "spine_3_1_1": 1622481723.9440727,
        "spine_3_1_2": 1622481723.957671,
        "spine_3_1_3": 1622481723.9683156,
        "spine_3_1_4": 1622481723.9793599,
        "spine_3_1_5": 1622481723.989558,
        "spine_3_1_6": 1622481723.997793,
        "spine_3_1_7": 1622481724.0138512,
        "spine_3_1_8": 1622481724.0233395,
        "spine_4_1_1": 1622481724.0319965,
        "spine_4_1_2": 1622481724.0417066,
        "spine_4_1_3": 1622481724.0498383,
        "spine_4_1_4": 1622481724.0561223,
        "spine_4_1_5": 1622481724.0674434,
        "spine_4_1_6": 1622481724.074307,
        "spine_4_1_7": 1622481724.0792313,
        "spine_4_1_8": 1622481724.0914583,
        "spine_5_1_1": 1622481724.1037743,
        "spine_5_1_2": 1622481724.1088893,
        "spine_5_1_3": 1622481724.1220682,
        "spine_5_1_4": 1622481724.1279671,
        "spine_5_1_5": 1622481723.960669,
        "spine_5_1_6": 1622481723.9691505,
        "spine_5_1_7": 1622481723.9810362,
        "spine_5_1_8": 1622481723.9980004,
        "spine_6_1_1": 1622481724.007441,
        "spine_6_1_2": 1622481724.0199146,
        "spine_6_1_3": 1622481724.0311801,
        "spine_6_1_4": 1622481724.0379155,
        "spine_6_1_5": 1622481724.050504,
        "spine_6_1_6": 1622481724.0614443,
        "spine_6_1_7": 1622481724.071499,
        "spine_6_1_8": 1622481724.0784214,
        "spine_7_1_1": 1622481724.08452,
        "spine_7_1_2": 1622481724.0929327,
        "spine_7_1_3": 1622481724.1018243,
        "spine_7_1_4": 1622481724.1078894,
        "spine_7_1_5": 1622481724.1218116,
        "spine_7_1_6": 1622481724.131607,
        "spine_7_1_7": 1622481724.1433134,
        "spine_7_1_8": 1622481724.1529725,
        "spine_8_1_1": 1622481724.1401882,
        "spine_8_1_2": 1622481724.1543179,
        "spine_8_1_3": 1622481724.1655614,
        "spine_8_1_4": 1622481724.1833036,
        "spine_8_1_5": 1622481724.188169,
        "spine_8_1_6": 1622481724.199325,
        "spine_8_1_7": 1622481724.2145584,
        "spine_8_1_8": 1622481724.2272856,
        "tof_1_2_1": 1622481724.2396858,
        "tof_1_2_2": 1622481724.2539535,
        "tof_1_2_3": 1622481724.263822,
        "tof_1_2_4": 1622481724.275203,
        "tof_1_2_5": 1622481724.2866592,
        "tof_1_2_6": 1622481724.2963533,
        "tof_1_2_7": 1622481724.306928,
        "tof_1_2_8": 1622481724.3231432,
        "tof_2_2_1": 1622481724.3326418,
        "tof_2_2_2": 1622481724.3428495,
        "tof_2_2_3": 1622481724.360559,
        "tof_2_2_4": 1622481724.3720033,
        "tof_2_2_5": 1622481724.163113,
        "tof_2_2_6": 1622481724.1710305,
        "tof_2_2_7": 1622481724.1823392,
        "tof_2_2_8": 1622481724.1889338,
        "tof_3_2_1": 1622481724.2034047,
        "tof_3_2_2": 1622481724.2182136,
        "tof_3_2_3": 1622481724.2296817,
        "tof_3_2_4": 1622481724.2397277,
        "tof_3_2_5": 1622481724.2559466,
        "tof_3_2_6": 1622481724.265338,
        "tof_3_2_7": 1622481724.2777853,
        "tof_3_2_8": 1622481724.2896328,
        "tof_4_2_1": 1622481724.298932,
        "tof_4_2_2": 1622481724.3077328,
        "tof_4_2_3": 1622481724.3217456,
        "tof_4_2_4": 1622481724.3355289,
        "tof_4_2_5": 1622481724.3419979,
        "tof_4_2_6": 1622481724.3617992,
        "tof_4_2_7": 1622481724.377238,
        "tof_4_2_8": 1622481724.3852544
    }
}