{
    "k_leaf": 2,
    "k_top": 2,
    "redundancy_factor": 1,
    "is_k8s": true,
    "machine_mac_addresses": {
        "leaf_1_0_1": {
            "net0": "c6:c6:f9:97:c5:34",
            "net1": "0a:b7:04:69:24:59",
            "net2": "82:3b:63:68:4c:d9"
        },
        "leaf_1_0_2": {
            "net0": "7a:2c:9a:65:12:18",
            "net1": "ee:27:7f:ba:4e:a1",
            "net2": "f2:f8:29:94:3d:a5"
        },
        "leaf_2_0_1": {
            "net0": "0e:0a:91:cf:a5:ff",
            "net1": "a6:55:e6:ce:fd:53",
            "net2": "5a:05:8d:bf:b0:bc"
        },
        "leaf_2_0_2": {
            "net0": "1e:70:5d:1c:d0:11",
            "net1": "5a:59:c1:98:d1:0d",
            "net2": "8a:84:fa:23:38:88"
        },
        "leaf_3_0_1": {
            "net0": "e2:42:c0:5d:be:b7",
            "net1": "de:2f:5d:41:94:fa",
            "net2": "ee:bc:e3:94:b6:49"
        },
        "leaf_3_0_2": {
            "net0": "8a:b2:2b:78:0a:b2",
            "net1": "4e:34:82:87:56:40",
            "net2": "7e:27:64:22:87:f5"
        },
        "leaf_4_0_1": {
            "net0": "3a:ea:aa:59:9a:27",
            "net1": "b6:56:8b:9f:d1:b6",
            "net2": "42:a1:87:92:1d:e5"
        },
        "leaf_4_0_2": {
            "net0": "f6:42:96:9b:7c:7e",
            "net1": "2e:c9:ed:91:5e:6c",
            "net2": "b2:ad:c2:1a:70:06"
        },
        "spine_1_1_1": {
            "net0": "02:a3:c9:64:41:76",
            "net1": "1e:55:4c:d5:9b:c7",
            "net2": "72:e9:9d:bf:80:81",
            "net3": "02:e5:cb:50:be:7e"
        },
        "spine_1_1_2": {
            "net0": "b2:10:01:55:10:23",
            "net1": "8a:3e:af:4e:1e:f6",
            "net2": "2a:d8:1f:44:64:e7",
            "net3": "b6:1a:02:b9:65:67"
        },
        "spine_2_1_1": {
            "net0": "ba:80:aa:96:c2:af",
            "net1": "92:e2:31:c3:7a:16",
            "net2": "c6:4c:7d:d8:63:0b",
            "net3": "76:79:ba:89:82:b1"
        },
        "spine_2_1_2": {
            "net0": "2a:82:6f:6f:d4:9a",
            "net1": "1a:19:8e:6e:f3:6f",
            "net2": "3a:f1:b1:41:3d:44",
            "net3": "5e:b9:cf:12:0a:84"
        },
        "spine_3_1_1": {
            "net0": "be:cd:ed:0d:1a:cf",
            "net1": "ca:bd:89:cc:a7:3e",
            "net2": "6a:76:99:b0:da:90",
            "net3": "2a:9b:77:19:46:5c"
        },
        "spine_3_1_2": {
            "net0": "82:89:9c:65:dc:f8",
            "net1": "06:5a:2c:9b:6d:fb",
            "net2": "3e:ac:06:8e:af:2d",
            "net3": "0e:44:56:60:3a:6d"
        },
        "spine_4_1_1": {
            "net0": "62:22:c3:30:bb:73",
            "net1": "46:c9:4a:47:e7:b4",
            "net2": "ce:16:a8:3c:d1:8c",
            "net3": "1a:9f:0e:36:ad:a1"
        },
        "spine_4_1_2": {
            "net0": "62:cc:42:e3:99:3a",
            "net1": "c2:7c:92:72:0f:b5",
            "net2": "16:27:d9:b8:c7:a5",
            "net3": "1a:55:02:a2:eb:f1"
        },
        "tof_1_2_1": {
            "net0": "fe:74:1e:8c:57:2c",
            "net1": "6e:e7:e8:50:80:af",
            "net2": "2e:27:99:f7:63:9f",
            "net3": "b2:43:de:bb:93:7d"
        },
        "tof_1_2_2": {
            "net0": "76:a0:27:68:06:d5",
            "net1": "de:92:f9:46:1e:b2",
            "net2": "0a:d7:db:f2:59:2a",
            "net3": "4a:c0:bb:7b:32:71"
        },
        "tof_2_2_1": {
            "net0": "36:a4:e4:9f:47:b2",
            "net1": "86:ea:10:05:77:c8",
            "net2": "d6:d2:8a:0f:97:db",
            "net3": "fe:fb:e2:c3:ab:e2"
        },
        "tof_2_2_2": {
            "net0": "4e:33:c3:91:70:f8",
            "net1": "72:3d:75:82:74:f4",
            "net2": "2a:3f:56:c7:99:86",
            "net3": "62:5d:7b:63:30:da"
        }
    },
    "failed_machine": "spine_1_1_1",
    "failure_time": {
        "leaf_1_0_1": 1634474719.1113822,
        "leaf_1_0_2": 1634474719.124176,
        "leaf_2_0_1": 1634474719.1323445,
        "leaf_2_0_2": 1634474719.1112783,
        "leaf_3_0_1": 1634474719.1250305,
        "leaf_3_0_2": 1634474719.134111,
        "leaf_4_0_1": 1634474719.140474,
        "leaf_4_0_2": 1634474719.1486146,
        "spine_1_1_1": 1634474719.1552415,
        "spine_1_1_2": 1634474719.1425014,
        "spine_2_1_1": 1634474719.1493745,
        "spine_2_1_2": 1634474719.1579401,
        "spine_3_1_1": 1634474719.1654115,
        "spine_3_1_2": 1634474719.1743398,
        "spine_4_1_1": 1634474719.183578,
        "spine_4_1_2": 1634474719.1669555,
        "tof_1_2_1": 1634474719.182451,
        "tof_1_2_2": 1634474719.1909726,
        "tof_2_2_1": 1634474719.1935701,
        "tof_2_2_2": 1634474719.2046127
    },
    "recover_time": {
        "leaf_1_0_1": 1634474773.2613513,
        "leaf_1_0_2": 1634474773.2730901,
        "leaf_2_0_1": 1634474773.2813084,
        "leaf_2_0_2": 1634474773.263402,
        "leaf_3_0_1": 1634474773.273827,
        "leaf_3_0_2": 1634474773.2871716,
        "leaf_4_0_1": 1634474773.2883265,
        "leaf_4_0_2": 1634474773.2996876,
        "spine_1_1_2": 1634474773.308472,
        "spine_2_1_1": 1634474773.2953637,
        "spine_2_1_2": 1634474773.3018246,
        "spine_3_1_1": 1634474773.3107522,
        "spine_3_1_2": 1634474773.317711,
        "spine_4_1_1": 1634474773.3247545,
        "spine_4_1_2": 1634474773.3320398,
        "tof_1_2_1": 1634474773.3197577,
        "tof_1_2_2": 1634474773.3287177,
        "tof_2_2_1": 1634474773.3362586,
        "tof_2_2_2": 1634474773.3451014,
        "spine_1_1_1": 1634474790.2044966
    }
}