{
    "k_leaf": 6,
    "k_top": 6,
    "redundancy_factor": 3,
    "is_k8s": true,
    "machine_mac_addresses": {
        "leaf_1_0_1": {
            "net0": "d2:a8:5c:80:38:3e",
            "net1": "a6:2f:30:3f:08:c8",
            "net2": "de:c1:c3:1a:c7:7e",
            "net3": "3a:76:eb:c6:14:f5",
            "net4": "42:16:2d:78:53:b0",
            "net5": "b2:0a:71:d9:3b:3a",
            "net6": "46:fb:ff:e9:8d:00"
        },
        "leaf_1_0_2": {
            "net0": "5e:5e:03:c6:ba:2c",
            "net1": "a6:8d:ec:08:41:93",
            "net2": "ba:6d:58:8f:28:79",
            "net3": "ee:1a:37:7e:f5:72",
            "net4": "4a:66:d2:e8:fd:20",
            "net5": "c2:07:1f:4e:c1:2e",
            "net6": "0e:f0:0f:99:e7:0a"
        },
        "leaf_1_0_3": {
            "net0": "3a:d7:35:f4:90:2b",
            "net1": "52:35:55:99:fe:d5",
            "net2": "e2:be:99:61:b4:fe",
            "net3": "0e:11:13:12:b9:0f",
            "net4": "a6:51:f1:18:92:bb",
            "net5": "0a:5a:ee:cd:ad:ee",
            "net6": "ea:6a:af:51:b1:e3"
        },
        "leaf_1_0_4": {
            "net0": "42:9e:bf:49:bf:6d",
            "net1": "fe:c4:ca:98:f7:2e",
            "net2": "ce:5c:2e:f5:56:58",
            "net3": "5e:57:c4:19:8b:0a",
            "net4": "86:f5:ad:43:94:91",
            "net5": "be:a4:9e:1e:53:79",
            "net6": "da:82:8d:32:d9:a6"
        },
        "leaf_1_0_5": {
            "net0": "ce:73:d0:a6:67:5c",
            "net1": "86:b8:f6:7f:63:df",
            "net2": "d2:cb:ef:20:68:a6",
            "net3": "4a:46:c0:7b:7e:77",
            "net4": "e2:6e:e0:1d:a9:ae",
            "net5": "b6:dc:f8:c4:ab:c1",
            "net6": "da:69:45:58:a8:79"
        },
        "leaf_1_0_6": {
            "net0": "ba:b9:63:6c:32:a4",
            "net1": "1a:50:e2:4b:02:b8",
            "net2": "5a:2c:4b:c0:5c:1f",
            "net3": "72:64:4d:68:25:6d",
            "net4": "c2:45:52:20:d6:74",
            "net5": "e6:3f:08:8e:7d:7e",
            "net6": "4e:f9:f8:da:04:04"
        },
        "leaf_2_0_1": {
            "net0": "2e:66:ca:44:37:69",
            "net1": "fa:69:bf:71:af:70",
            "net2": "e6:e3:b8:ac:82:2e",
            "net3": "22:98:e6:b3:62:d3",
            "net4": "aa:7a:00:c3:26:3a",
            "net5": "4a:aa:a9:10:e1:97",
            "net6": "22:29:0f:24:8f:3a"
        },
        "leaf_2_0_2": {
            "net0": "06:aa:bf:d4:6f:4d",
            "net1": "a2:7e:5b:38:ca:58",
            "net2": "26:d9:91:9e:64:76",
            "net3": "ce:31:9b:12:0f:b5",
            "net4": "12:5f:c9:39:8b:4b",
            "net5": "3a:28:82:a7:d5:22",
            "net6": "ae:74:a8:c2:34:47"
        },
        "leaf_2_0_3": {
            "net0": "fe:89:09:38:74:2e",
            "net1": "8a:33:e8:85:e7:ac",
            "net2": "e2:4c:e2:17:df:b0",
            "net3": "1e:3e:8c:70:bc:09",
            "net4": "56:5d:29:a3:fd:20",
            "net5": "4a:53:44:2f:5d:fd",
            "net6": "d6:04:e2:a6:d2:4f"
        },
        "leaf_2_0_4": {
            "net0": "ce:2b:74:d1:92:1e",
            "net1": "2a:28:7a:69:54:6e",
            "net2": "ee:1b:50:2c:a3:0d",
            "net3": "36:41:32:92:62:32",
            "net4": "22:dd:2f:ea:e2:ee",
            "net5": "7a:72:98:d2:1d:7f",
            "net6": "a2:3a:f3:8a:a5:01"
        },
        "leaf_2_0_5": {
            "net0": "9e:b3:c1:5e:c3:bf",
            "net1": "c6:3e:e2:62:bc:b9",
            "net2": "0e:01:08:f8:66:85",
            "net3": "6a:7b:a1:7b:77:8f",
            "net4": "26:7d:89:8e:fa:15",
            "net5": "6a:37:5f:ab:4f:6b",
            "net6": "ba:65:20:88:2e:ac"
        },
        "leaf_2_0_6": {
            "net0": "c2:90:30:96:f4:23",
            "net1": "16:77:de:52:2b:df",
            "net2": "4a:0b:07:d8:09:6b",
            "net3": "1a:dc:f9:15:bd:c6",
            "net4": "fa:dd:bd:da:a7:ab",
            "net5": "6e:40:ce:33:d0:ad",
            "net6": "9e:8e:af:bf:b8:c7"
        },
        "leaf_3_0_1": {
            "net0": "de:71:d6:42:c4:1c",
            "net1": "f2:24:1f:b6:05:27",
            "net2": "5e:82:a3:18:7e:15",
            "net3": "aa:00:58:11:f1:1d",
            "net4": "8a:19:0f:c3:80:d0",
            "net5": "72:db:f4:ac:a4:0f",
            "net6": "16:d0:31:dd:2f:e9"
        },
        "leaf_3_0_2": {
            "net0": "76:4a:1c:21:01:48",
            "net1": "9a:92:32:f0:55:c4",
            "net2": "82:e0:0c:68:b3:2c",
            "net3": "4a:b1:d7:61:f9:14",
            "net4": "4a:6a:b9:2c:35:8e",
            "net5": "d2:29:d8:47:fd:29",
            "net6": "02:dc:92:0d:73:2e"
        },
        "leaf_3_0_3": {
            "net0": "92:9f:e1:01:7c:c5",
            "net1": "6e:a7:64:9d:de:19",
            "net2": "c2:d0:09:24:8a:7b",
            "net3": "42:bc:33:34:3e:65",
            "net4": "fe:55:54:69:8b:2b",
            "net5": "e6:84:e5:5f:16:d1",
            "net6": "de:99:2d:84:21:eb"
        },
        "leaf_3_0_4": {
            "net0": "d2:31:4a:dc:55:1c",
            "net1": "12:e7:68:7d:17:9d",
            "net2": "fe:cf:70:07:89:d9",
            "net3": "9e:90:07:23:3f:6e",
            "net4": "4e:b7:81:46:f6:95",
            "net5": "fa:b7:29:0b:f2:3f",
            "net6": "8e:37:64:2c:b2:a0"
        },
        "leaf_3_0_5": {
            "net0": "3a:6b:37:c0:4e:41",
            "net1": "96:68:cb:f8:9b:80",
            "net2": "92:ec:0e:1e:48:47",
            "net3": "a6:15:be:b4:17:21",
            "net4": "ca:a8:cf:36:2c:2e",
            "net5": "e6:4f:40:3d:d0:21",
            "net6": "96:f4:b3:5e:e5:83"
        },
        "leaf_3_0_6": {
            "net0": "e2:e0:b1:e9:17:91",
            "net1": "56:1f:00:bc:cb:65",
            "net2": "c6:c1:7e:e6:d0:62",
            "net3": "42:59:92:8d:13:f1",
            "net4": "12:3e:da:68:16:1d",
            "net5": "96:13:62:d8:d4:ee",
            "net6": "76:f9:0f:a8:f1:f1"
        },
        "leaf_4_0_1": {
            "net0": "5a:a3:67:89:1b:7d",
            "net1": "c2:74:ba:66:b4:49",
            "net2": "4e:2f:be:cb:45:8c",
            "net3": "6a:ce:af:bf:d6:5a",
            "net4": "0a:2b:71:43:aa:bc",
            "net5": "16:a2:78:61:2e:80",
            "net6": "8a:20:63:0e:d9:e1"
        },
        "leaf_4_0_2": {
            "net0": "b6:6b:7b:89:be:c5",
            "net1": "ca:f5:ef:d6:c2:9e",
            "net2": "9e:8e:00:1d:d8:7d",
            "net3": "b2:df:42:8e:e2:72",
            "net4": "4e:08:ed:57:42:8e",
            "net5": "fa:81:fa:51:cd:01",
            "net6": "4a:6d:41:20:1c:9b"
        },
        "leaf_4_0_3": {
            "net0": "3e:95:66:b3:cc:c0",
            "net1": "4a:2e:f3:3d:03:61",
            "net2": "de:94:75:21:6c:cd",
            "net3": "36:a8:2c:c4:63:33",
            "net4": "12:3d:bd:35:5f:1e",
            "net5": "8e:16:64:a5:5c:64",
            "net6": "f2:35:96:78:1f:dc"
        },
        "leaf_4_0_4": {
            "net0": "b6:3e:3c:89:8b:6f",
            "net1": "b6:8e:43:2f:e0:45",
            "net2": "0a:86:25:6a:d1:68",
            "net3": "9e:bf:b5:23:d1:31",
            "net4": "f6:78:77:89:3a:6e",
            "net5": "32:98:d8:16:65:ec",
            "net6": "6e:f6:86:b9:01:a1"
        },
        "leaf_4_0_5": {
            "net0": "fe:e5:07:e9:c5:1a",
            "net1": "02:43:f1:ff:bc:46",
            "net2": "8e:a8:d0:34:88:9d",
            "net3": "8a:6e:a3:e9:d5:57",
            "net4": "26:c7:e6:4e:86:a7",
            "net5": "0e:2b:a8:76:d4:70",
            "net6": "ae:4d:6a:0c:18:36"
        },
        "leaf_4_0_6": {
            "net0": "ea:2e:95:a7:85:f0",
            "net1": "26:41:00:b8:c1:b5",
            "net2": "56:98:9d:6b:bf:0c",
            "net3": "16:1a:9c:64:b5:7c",
            "net4": "8e:49:8d:ed:2e:6a",
            "net5": "02:1c:be:ec:c7:cb",
            "net6": "0e:b4:2a:02:58:58"
        },
        "spine_1_1_1": {
            "net0": "4e:e6:8c:68:b3:ed",
            "net1": "c6:56:1f:b1:61:53",
            "net10": "ca:b2:35:36:4d:a2",
            "net11": "b6:02:26:d6:cc:78",
            "net2": "52:47:31:55:5b:69",
            "net3": "fa:a6:39:fd:87:70",
            "net4": "96:2f:e9:58:2c:b3",
            "net5": "96:c1:0c:5d:fe:f3",
            "net6": "f6:d5:54:e0:be:ee",
            "net7": "06:af:39:4a:ca:91",
            "net8": "26:7b:59:72:9a:4b",
            "net9": "be:25:65:59:46:ea"
        },
        "spine_1_1_2": {
            "net0": "76:8a:db:19:c3:4f",
            "net1": "f2:2f:43:60:fa:73",
            "net10": "22:ea:3b:d2:b0:b6",
            "net11": "ba:e0:ba:b2:44:42",
            "net2": "be:72:6b:0c:96:ca",
            "net3": "36:70:56:ed:9a:51",
            "net4": "5e:e3:db:2f:86:6c",
            "net5": "9e:57:b2:71:0d:ac",
            "net6": "fa:4c:a8:4d:d4:3d",
            "net7": "66:ca:9b:31:fe:5e",
            "net8": "3e:53:52:75:f7:59",
            "net9": "f2:c2:bf:5d:a8:5c"
        },
        "spine_1_1_3": {
            "net0": "8a:57:fd:a1:6a:7e",
            "net1": "ba:d7:9b:0d:a5:ea",
            "net10": "02:3c:f4:c6:bf:19",
            "net11": "8a:20:5f:5c:f9:3e",
            "net2": "56:e2:fd:38:23:78",
            "net3": "e6:67:69:cf:a7:93",
            "net4": "9e:89:b0:7e:94:c9",
            "net5": "36:81:01:46:1f:ce",
            "net6": "de:0e:10:41:16:68",
            "net7": "96:24:3c:04:2e:54",
            "net8": "fe:89:48:71:bf:43",
            "net9": "e6:8c:74:01:ad:77"
        },
        "spine_1_1_4": {
            "net0": "ae:33:b9:8a:69:71",
            "net1": "7a:81:9b:a5:35:e4",
            "net10": "f2:55:dd:9e:ce:5e",
            "net11": "6a:3a:2d:8f:09:75",
            "net2": "0a:73:cf:c2:8f:fc",
            "net3": "92:83:e6:a3:4c:1d",
            "net4": "a2:55:cd:d6:a0:33",
            "net5": "a6:c1:8d:2b:58:19",
            "net6": "aa:eb:31:9c:b9:43",
            "net7": "06:7d:9d:80:5f:c3",
            "net8": "3e:47:ee:97:38:80",
            "net9": "02:33:3b:08:7e:5b"
        },
        "spine_1_1_5": {
            "net0": "5a:89:f4:2a:15:2f",
            "net1": "d6:e7:7c:55:3d:40",
            "net10": "76:ed:96:6d:be:ef",
            "net11": "46:3f:8c:f9:fc:0f",
            "net2": "ba:77:3c:c5:0b:e7",
            "net3": "3a:33:69:4e:35:c3",
            "net4": "36:3f:09:aa:ba:f6",
            "net5": "6e:a0:cc:b7:91:28",
            "net6": "a6:3e:a4:76:a1:77",
            "net7": "7e:2f:59:13:34:25",
            "net8": "1e:94:c1:0a:1c:d4",
            "net9": "7a:e2:20:58:1c:17"
        },
        "spine_1_1_6": {
            "net0": "52:75:83:ec:8b:62",
            "net1": "66:01:9f:62:7a:a7",
            "net10": "d6:ff:03:ac:2c:e5",
            "net11": "26:eb:df:46:be:8e",
            "net2": "3a:29:9e:1f:8f:1d",
            "net3": "46:e4:7b:a4:b1:2b",
            "net4": "5a:a9:b9:07:67:a6",
            "net5": "26:43:37:09:b3:05",
            "net6": "ee:d8:bb:2d:1c:2d",
            "net7": "3e:47:a7:c9:69:37",
            "net8": "96:33:fe:2e:ef:99",
            "net9": "56:06:30:44:b9:92"
        },
        "spine_2_1_1": {
            "net0": "ba:a9:84:08:6e:9c",
            "net1": "e2:a7:b0:da:35:dc",
            "net10": "f2:9e:cb:f2:0a:16",
            "net11": "4e:ea:4b:62:6b:76",
            "net2": "92:70:53:c1:49:e5",
            "net3": "f2:ff:7e:d6:88:ac",
            "net4": "be:13:e7:ad:b1:38",
            "net5": "9a:35:d5:71:a9:e7",
            "net6": "5a:7c:72:0d:0b:25",
            "net7": "ae:11:8f:e1:cb:18",
            "net8": "e6:11:81:fb:0a:ad",
            "net9": "ca:93:b2:aa:c3:4b"
        },
        "spine_2_1_2": {
            "net0": "a6:d2:ce:5e:6a:24",
            "net1": "32:ef:68:2e:3a:b8",
            "net10": "82:b0:2e:55:91:cf",
            "net11": "12:4d:99:a2:91:e5",
            "net2": "ba:78:9c:29:02:6a",
            "net3": "86:84:b0:d3:19:f5",
            "net4": "22:8a:38:68:c2:20",
            "net5": "2a:f8:13:bb:14:3f",
            "net6": "3e:2b:92:46:4e:d5",
            "net7": "96:e2:0e:bb:84:0f",
            "net8": "ee:93:f6:cd:a5:13",
            "net9": "de:8e:9c:34:1a:b8"
        },
        "spine_2_1_3": {
            "net0": "6e:a9:14:50:8e:7c",
            "net1": "da:80:91:a6:df:00",
            "net10": "ce:a9:a8:8f:8c:bb",
            "net11": "56:fe:71:80:0c:38",
            "net2": "aa:5a:6f:3e:67:55",
            "net3": "2a:6a:11:37:a8:b9",
            "net4": "de:2c:2d:bb:a3:b2",
            "net5": "3e:94:75:c3:49:32",
            "net6": "9a:36:5b:5f:7e:27",
            "net7": "6e:96:28:f7:2b:6f",
            "net8": "ae:07:0a:6d:31:35",
            "net9": "4a:4f:f5:f8:3a:d1"
        },
        "spine_2_1_4": {
            "net0": "2a:3d:9d:64:60:ab",
            "net1": "8a:ed:6a:ac:45:61",
            "net10": "1a:e0:4c:8d:6d:31",
            "net11": "9e:45:65:8d:af:b9",
            "net2": "d2:15:a4:5f:aa:4f",
            "net3": "6a:95:e6:b3:cb:b9",
            "net4": "0e:12:3d:fe:01:bc",
            "net5": "4a:27:ab:87:9f:1d",
            "net6": "96:11:cf:8a:af:b2",
            "net7": "3e:96:80:0f:24:d0",
            "net8": "7e:ea:56:09:77:08",
            "net9": "9a:3d:65:78:87:0e"
        },
        "spine_2_1_5": {
            "net0": "46:41:15:34:eb:c0",
            "net1": "9e:fc:9f:8e:6a:8d",
            "net10": "5a:97:ad:0a:ff:26",
            "net11": "26:49:18:5a:a8:c0",
            "net2": "3a:dc:a3:ad:91:90",
            "net3": "8e:f9:cf:af:eb:a1",
            "net4": "0e:19:8b:9d:bd:2d",
            "net5": "52:1d:85:1b:8f:bf",
            "net6": "02:5d:eb:17:10:80",
            "net7": "22:77:21:55:44:d7",
            "net8": "9e:64:98:07:56:70",
            "net9": "c2:91:30:a5:8f:b9"
        },
        "spine_2_1_6": {
            "net0": "6a:5e:ec:38:0f:d4",
            "net1": "aa:d3:79:42:56:86",
            "net10": "56:0e:58:f7:b8:34",
            "net11": "ce:8b:d3:77:89:46",
            "net2": "c2:ab:f7:6b:22:91",
            "net3": "d6:cd:22:90:6f:f6",
            "net4": "06:2d:d1:1a:da:c3",
            "net5": "d6:e1:06:81:11:88",
            "net6": "ca:eb:00:58:ba:16",
            "net7": "52:94:37:c9:49:b8",
            "net8": "4e:3c:dd:05:3a:b0",
            "net9": "de:92:b0:0f:05:e5"
        },
        "spine_3_1_1": {
            "net0": "9e:e5:1f:0d:b6:3e",
            "net1": "ba:8a:c3:f0:df:fd",
            "net10": "4e:2e:f0:a9:67:70",
            "net11": "ce:24:a4:a5:7a:42",
            "net2": "86:0a:dc:4b:5a:18",
            "net3": "3a:11:64:ec:37:fd",
            "net4": "26:8c:f6:3b:1a:90",
            "net5": "a2:0a:e3:da:31:21",
            "net6": "0a:4b:9d:7a:63:47",
            "net7": "ea:ab:3b:b7:0b:1c",
            "net8": "e6:5e:e4:51:85:1f",
            "net9": "f2:29:7a:89:46:df"
        },
        "spine_3_1_2": {
            "net0": "ce:44:56:1b:ac:e2",
            "net1": "1a:9b:c1:9e:bf:df",
            "net10": "96:77:64:2b:23:73",
            "net11": "86:1f:96:55:46:22",
            "net2": "2a:37:d3:19:87:df",
            "net3": "e6:c4:15:c5:45:b0",
            "net4": "3e:ec:6d:85:75:8f",
            "net5": "26:b5:cc:7a:79:fd",
            "net6": "6a:87:d1:4d:b2:2d",
            "net7": "fe:89:f1:bb:f6:58",
            "net8": "d2:e5:bb:e5:fe:fc",
            "net9": "76:6b:1a:7b:a1:c6"
        },
        "spine_3_1_3": {
            "net0": "92:91:ec:e6:0c:3b",
            "net1": "ae:48:68:f2:7f:46",
            "net10": "4a:f5:53:aa:59:51",
            "net11": "22:e0:54:a1:a3:14",
            "net2": "8a:c7:55:8e:67:a6",
            "net3": "fa:d7:2d:2c:07:20",
            "net4": "36:2e:3a:63:8b:95",
            "net5": "e2:39:04:92:ed:27",
            "net6": "8e:98:cc:0d:9c:d3",
            "net7": "26:96:43:d4:b5:9e",
            "net8": "2e:cc:41:c4:2f:4b",
            "net9": "d2:56:e2:63:e4:ac"
        },
        "spine_3_1_4": {
            "net0": "6a:5e:ab:96:73:09",
            "net1": "6a:4f:31:66:e5:f3",
            "net10": "0a:ed:48:94:65:66",
            "net11": "f6:f5:41:6e:ea:95",
            "net2": "66:a9:78:34:c7:27",
            "net3": "d2:64:3d:11:7d:28",
            "net4": "b2:30:85:3a:64:4c",
            "net5": "0e:45:03:78:ad:4d",
            "net6": "66:67:d9:7a:03:ce",
            "net7": "5a:a7:63:34:58:a8",
            "net8": "f2:b3:54:cf:ad:68",
            "net9": "da:8e:6c:1a:28:1f"
        },
        "spine_3_1_5": {
            "net0": "9e:43:c9:7e:ff:03",
            "net1": "e2:88:49:d5:aa:af",
            "net10": "06:ac:9f:de:fc:49",
            "net11": "12:60:85:c2:79:5f",
            "net2": "ce:f8:0d:7a:50:dc",
            "net3": "0e:dd:cd:21:7e:d5",
            "net4": "86:84:e1:48:48:e0",
            "net5": "fa:f1:c5:9d:6b:22",
            "net6": "4a:b8:73:69:68:f0",
            "net7": "f2:22:c6:82:6b:e7",
            "net8": "8a:9d:21:a7:ce:f2",
            "net9": "22:2d:78:e0:86:0a"
        },
        "spine_3_1_6": {
            "net0": "56:ed:f1:02:ea:72",
            "net1": "92:a3:84:55:ed:a7",
            "net10": "4e:f3:30:61:74:b1",
            "net11": "82:7d:b6:de:88:42",
            "net2": "42:f2:b2:cf:a1:86",
            "net3": "82:57:04:d5:24:ad",
            "net4": "86:c6:30:26:50:73",
            "net5": "ba:1e:1c:56:e1:74",
            "net6": "0e:1f:a4:8a:b0:b3",
            "net7": "5e:52:d1:b2:28:6e",
            "net8": "32:94:a5:be:fc:34",
            "net9": "16:95:5e:2c:f1:24"
        },
        "spine_4_1_1": {
            "net0": "26:7c:1e:b1:55:4c",
            "net1": "6a:e7:7b:78:23:56",
            "net10": "92:a8:2a:f8:26:b7",
            "net11": "26:31:f1:d9:1c:25",
            "net2": "9e:48:9b:dc:1a:7b",
            "net3": "fa:ce:50:d5:a7:4c",
            "net4": "72:4d:8e:ae:f9:92",
            "net5": "9e:3d:ef:35:34:d5",
            "net6": "2a:8b:7e:35:17:d0",
            "net7": "42:fa:f4:07:c3:32",
            "net8": "5e:53:8d:40:5d:43",
            "net9": "16:0b:d7:0b:5a:c4"
        },
        "spine_4_1_2": {
            "net0": "ae:cf:c3:ae:aa:75",
            "net1": "f2:f4:f4:f0:f1:2a",
            "net10": "7e:6a:dd:4f:76:79",
            "net11": "7a:7d:21:42:d4:c0",
            "net2": "d2:a6:6d:41:32:e3",
            "net3": "72:d4:87:de:f7:65",
            "net4": "46:0f:ce:b0:bd:0b",
            "net5": "82:75:ad:cc:b8:9c",
            "net6": "b6:87:37:67:37:2c",
            "net7": "ca:dc:68:a3:98:26",
            "net8": "7e:70:8e:87:34:2a",
            "net9": "f6:f4:f1:95:e1:01"
        },
        "spine_4_1_3": {
            "net0": "ce:1e:8d:6d:ac:f5",
            "net1": "76:ac:e6:14:31:a0",
            "net10": "fa:2b:e0:71:91:4b",
            "net11": "3e:76:a4:cd:e0:37",
            "net2": "86:79:75:8a:da:92",
            "net3": "a2:b7:eb:13:3f:5f",
            "net4": "ea:08:25:d1:bd:be",
            "net5": "32:72:7f:5d:94:79",
            "net6": "8a:4f:b6:23:f9:0e",
            "net7": "3a:b2:d9:96:d0:e1",
            "net8": "c6:67:af:3f:26:a8",
            "net9": "72:f7:3f:fb:63:a8"
        },
        "spine_4_1_4": {
            "net0": "e2:20:1b:55:25:98",
            "net1": "26:e9:29:6d:c6:1d",
            "net10": "7e:7e:3b:d3:c6:f5",
            "net11": "3e:c4:91:89:89:bf",
            "net2": "d6:cd:5a:e6:ed:1a",
            "net3": "0a:d5:f0:45:6b:7c",
            "net4": "e2:42:83:e8:0e:8c",
            "net5": "3e:48:80:ed:1e:ca",
            "net6": "5e:6f:0d:68:2c:32",
            "net7": "12:c6:74:75:41:40",
            "net8": "2e:00:f1:60:4a:49",
            "net9": "ae:0c:40:ad:95:33"
        },
        "spine_4_1_5": {
            "net0": "12:7e:ca:9a:97:0e",
            "net1": "da:bc:8e:d1:96:2e",
            "net10": "2a:c3:a7:bb:89:48",
            "net11": "e2:01:a3:ce:8f:a2",
            "net2": "a6:98:55:d4:86:d0",
            "net3": "76:50:b1:08:8d:1a",
            "net4": "fa:d2:59:17:c8:be",
            "net5": "52:82:d5:45:77:25",
            "net6": "02:c8:cb:07:4e:15",
            "net7": "1e:e0:af:7e:06:50",
            "net8": "da:af:5f:c4:9a:7c",
            "net9": "7a:b2:da:b8:27:83"
        },
        "spine_4_1_6": {
            "net0": "3e:26:0e:6a:b9:af",
            "net1": "3e:57:bb:e3:99:47",
            "net10": "52:d5:39:75:82:79",
            "net11": "9e:92:cf:5a:52:5c",
            "net2": "9e:22:0b:38:b5:dc",
            "net3": "be:d6:77:8e:61:4f",
            "net4": "56:49:01:15:14:66",
            "net5": "e2:18:92:6c:1f:10",
            "net6": "ba:92:7c:83:29:2b",
            "net7": "1e:49:51:e0:d9:58",
            "net8": "06:ff:e9:e1:bf:6d",
            "net9": "5e:e9:8e:2b:c8:b8"
        },
        "tof_1_2_1": {
            "net0": "c6:2b:43:c6:d7:4d",
            "net1": "c2:a7:27:fb:89:c8",
            "net10": "da:a6:d7:c1:30:76",
            "net11": "46:95:9f:2f:65:f6",
            "net2": "a2:76:d4:53:9f:dc",
            "net3": "f2:cb:35:d2:f6:82",
            "net4": "32:e3:89:23:54:3a",
            "net5": "ba:0f:e7:c4:99:85",
            "net6": "e2:25:a5:66:9d:87",
            "net7": "c2:f9:d2:05:a7:98",
            "net8": "2e:2e:3c:40:74:2c",
            "net9": "1a:88:f1:2e:25:4d"
        },
        "tof_1_2_2": {
            "net0": "9e:54:46:fd:93:ac",
            "net1": "c2:71:76:ec:f0:b2",
            "net10": "0e:90:27:25:a5:cf",
            "net11": "26:e2:ec:12:ff:4d",
            "net2": "46:c4:f7:42:ee:64",
            "net3": "f6:37:d8:16:4f:b7",
            "net4": "a6:ce:68:44:7d:61",
            "net5": "a6:d8:67:69:35:0d",
            "net6": "ae:91:05:d1:b0:2e",
            "net7": "5e:22:cb:ff:de:71",
            "net8": "5a:3c:a7:52:d0:82",
            "net9": "3e:a9:a8:db:7b:1c"
        },
        "tof_1_2_3": {
            "net0": "0e:41:20:d8:41:19",
            "net1": "d6:22:8d:cb:5e:38",
            "net10": "3a:1c:a9:a6:4f:ed",
            "net11": "32:07:44:6b:56:35",
            "net2": "6e:db:31:cf:72:b9",
            "net3": "32:02:99:23:55:52",
            "net4": "0e:62:f4:58:d6:82",
            "net5": "be:49:7c:6d:bd:95",
            "net6": "46:2a:4f:0e:07:4c",
            "net7": "b6:23:6b:5e:f2:4f",
            "net8": "2e:c9:80:99:82:13",
            "net9": "5a:0a:7d:02:29:7e"
        },
        "tof_1_2_4": {
            "net0": "26:7c:9e:ad:ae:8d",
            "net1": "be:70:2e:20:c9:0b",
            "net10": "fa:78:d9:63:a9:0b",
            "net11": "02:13:9f:c6:0b:14",
            "net2": "2e:84:15:70:5c:5a",
            "net3": "d6:2d:4e:f7:79:1c",
            "net4": "a6:27:76:73:e9:df",
            "net5": "72:ff:8c:9a:12:65",
            "net6": "52:cb:9b:c9:c3:db",
            "net7": "92:35:6a:ee:1c:78",
            "net8": "46:7b:b8:fb:22:2b",
            "net9": "ee:3c:3c:7c:eb:03"
        },
        "tof_1_2_5": {
            "net0": "0e:6e:b3:8d:0c:65",
            "net1": "ca:61:bb:63:61:60",
            "net10": "5a:0a:f5:e7:e2:da",
            "net11": "96:fa:9a:81:f4:0d",
            "net2": "ba:f8:8b:59:d0:5b",
            "net3": "2a:cc:fb:54:06:93",
            "net4": "3a:41:65:cc:1b:21",
            "net5": "f2:ee:08:a8:e0:a7",
            "net6": "46:ee:cc:43:07:82",
            "net7": "76:76:4f:5e:2d:1e",
            "net8": "d2:3b:9b:f5:cd:53",
            "net9": "42:e5:79:ff:3e:ff"
        },
        "tof_1_2_6": {
            "net0": "2a:7b:aa:79:9e:a4",
            "net1": "9a:df:17:c3:34:a3",
            "net10": "a6:2b:2a:32:b9:e0",
            "net11": "be:04:ae:cd:36:cc",
            "net2": "8e:19:a2:ea:99:22",
            "net3": "a2:e0:f1:f2:0f:f2",
            "net4": "a2:c5:8c:ae:62:d2",
            "net5": "92:f8:0e:03:ce:c2",
            "net6": "ea:a6:9f:91:9f:62",
            "net7": "86:61:cb:14:c3:b7",
            "net8": "2e:2c:f9:13:de:3c",
            "net9": "4a:45:0a:ec:0c:9e"
        },
        "tof_2_2_1": {
            "net0": "b2:f9:d6:a7:84:55",
            "net1": "ee:ad:a0:ce:fd:21",
            "net10": "6e:11:7a:74:ee:f2",
            "net11": "4a:95:1c:1b:76:ea",
            "net2": "a6:6f:e7:a4:a4:12",
            "net3": "ae:c7:2d:96:55:ca",
            "net4": "4e:e8:79:b4:fc:06",
            "net5": "b2:07:56:74:1c:9b",
            "net6": "d6:33:c5:dd:d4:e8",
            "net7": "c6:ce:12:be:63:d0",
            "net8": "3e:2a:e3:31:74:24",
            "net9": "22:80:2f:86:ec:e0"
        },
        "tof_2_2_2": {
            "net0": "7a:27:cc:e5:a4:81",
            "net1": "62:0c:86:5a:0d:75",
            "net10": "fe:c6:01:94:d6:db",
            "net11": "36:cc:9d:26:0f:34",
            "net2": "da:91:7f:4e:7e:54",
            "net3": "96:27:1c:4e:f5:d2",
            "net4": "ca:ca:37:58:08:8f",
            "net5": "e2:db:db:b3:08:38",
            "net6": "06:1c:bc:4d:01:2c",
            "net7": "2e:ce:8a:4c:75:20",
            "net8": "a6:4a:1f:7d:ec:41",
            "net9": "42:03:a1:be:3c:be"
        },
        "tof_2_2_3": {
            "net0": "06:18:48:77:7b:fd",
            "net1": "b6:41:9c:e3:8b:3f",
            "net10": "2a:dd:28:c9:d5:1d",
            "net11": "1e:de:bc:6b:28:9b",
            "net2": "b6:b8:ad:67:69:aa",
            "net3": "be:bf:39:ed:5e:ad",
            "net4": "4a:78:3b:a8:2a:8c",
            "net5": "92:6b:2a:4a:97:53",
            "net6": "4a:a6:54:d6:7a:77",
            "net7": "c6:a4:4c:5c:22:03",
            "net8": "fa:a3:d4:ee:4f:7d",
            "net9": "1a:7c:b7:6a:d6:9f"
        },
        "tof_2_2_4": {
            "net0": "f2:c6:12:33:6c:bb",
            "net1": "a6:17:da:6c:b2:83",
            "net10": "3a:7f:81:ab:9e:d6",
            "net11": "c6:00:e7:0f:1d:99",
            "net2": "c2:19:6a:b1:86:f8",
            "net3": "4e:f2:89:e2:7a:fc",
            "net4": "02:cc:69:43:f0:79",
            "net5": "46:58:0f:15:96:8b",
            "net6": "12:a8:0d:a2:2e:c3",
            "net7": "6e:b2:a6:a4:af:77",
            "net8": "96:13:c2:49:23:7a",
            "net9": "22:e5:56:6d:a6:44"
        },
        "tof_2_2_5": {
            "net0": "82:37:0f:e5:7a:f7",
            "net1": "9a:02:77:1a:7d:c2",
            "net10": "92:b9:1a:60:e4:4e",
            "net11": "fe:40:71:ff:e1:ee",
            "net2": "36:8d:ac:22:3a:1e",
            "net3": "46:a2:09:7a:54:80",
            "net4": "da:19:4b:25:a3:18",
            "net5": "72:c1:a5:36:22:dd",
            "net6": "26:f2:75:89:c4:09",
            "net7": "62:f8:a6:d2:26:da",
            "net8": "ee:a2:42:22:0c:ef",
            "net9": "ea:d9:47:90:ac:76"
        },
        "tof_2_2_6": {
            "net0": "a6:c6:97:1a:50:89",
            "net1": "1e:60:6b:50:40:09",
            "net10": "66:43:c4:fe:99:2c",
            "net11": "c6:de:ea:4d:2e:a4",
            "net2": "ae:2e:c8:84:7a:d4",
            "net3": "66:ff:4f:c6:c8:99",
            "net4": "ba:a2:98:39:fa:c8",
            "net5": "82:eb:ae:93:69:11",
            "net6": "a2:8d:8a:d3:57:79",
            "net7": "1a:98:a2:3d:ac:98",
            "net8": "4a:55:b5:dc:b0:ba",
            "net9": "b6:c3:70:db:c6:a1"
        }
    },
    "failed_machine": "tof_1_2_1",
    "failure_time": {
        "leaf_1_0_1": 1636465654.545647,
        "leaf_1_0_2": 1636465654.5714915,
        "leaf_1_0_3": 1636465654.5799696,
        "leaf_1_0_4": 1636465654.5918324,
        "leaf_1_0_5": 1636465655.645002,
        "leaf_1_0_6": 1636465654.614859,
        "leaf_2_0_1": 1636465654.6212704,
        "leaf_2_0_2": 1636465654.6302671,
        "leaf_2_0_3": 1636465654.5415983,
        "leaf_2_0_4": 1636465654.5499566,
        "leaf_2_0_5": 1636465654.5696204,
        "leaf_2_0_6": 1636465655.6174397,
        "leaf_3_0_1": 1636465654.5933836,
        "leaf_3_0_2": 1636465655.6480167,
        "leaf_3_0_3": 1636465654.6167579,
        "leaf_3_0_4": 1636465654.6312206,
        "leaf_3_0_5": 1636465654.6399999,
        "leaf_3_0_6": 1636465654.6521904,
        "leaf_4_0_1": 1636465654.6613863,
        "leaf_4_0_2": 1636465654.677445,
        "leaf_4_0_3": 1636465654.685523,
        "leaf_4_0_4": 1636465654.695837,
        "leaf_4_0_5": 1636465655.746445,
        "leaf_4_0_6": 1636465654.7146287,
        "spine_1_1_1": 1636465654.6406512,
        "spine_1_1_2": 1636465654.652237,
        "spine_1_1_3": 1636465655.701731,
        "spine_1_1_4": 1636465654.6707833,
        "spine_1_1_5": 1636465654.6826086,
        "spine_1_1_6": 1636465654.6896276,
        "spine_2_1_1": 1636465654.698257,
        "spine_2_1_2": 1636465654.7085795,
        "spine_2_1_3": 1636465654.718597,
        "spine_2_1_4": 1636465654.737835,
        "spine_2_1_5": 1636465654.7465513,
        "spine_2_1_6": 1636465654.7551348,
        "spine_3_1_1": 1636465655.8039641,
        "spine_3_1_2": 1636465654.7702048,
        "spine_3_1_3": 1636465654.779612,
        "spine_3_1_4": 1636465655.8291159,
        "spine_3_1_5": 1636465654.7258775,
        "spine_3_1_6": 1636465654.741738,
        "spine_4_1_1": 1636465655.7894113,
        "spine_4_1_2": 1636465654.759066,
        "spine_4_1_3": 1636465654.7664587,
        "spine_4_1_4": 1636465654.7803285,
        "spine_4_1_5": 1636465654.7870214,
        "spine_4_1_6": 1636465654.793815,
        "tof_1_2_1": 1636465654.7954745,
        "tof_1_2_2": 1636465654.8062105,
        "tof_1_2_3": 1636465655.8652968,
        "tof_1_2_4": 1636465654.8329997,
        "tof_1_2_5": 1636465654.8457007,
        "tof_1_2_6": 1636465654.8545198,
        "tof_2_2_1": 1636465654.862865,
        "tof_2_2_2": 1636465654.8715212,
        "tof_2_2_3": 1636465654.8072152,
        "tof_2_2_4": 1636465654.8257992,
        "tof_2_2_5": 1636465655.873451,
        "tof_2_2_6": 1636465654.847079
    },
    "recover_time": {
        "leaf_1_0_1": 1636465711.8247197,
        "leaf_1_0_2": 1636465711.8384068,
        "leaf_1_0_3": 1636465711.867257,
        "leaf_1_0_4": 1636465711.8822544,
        "leaf_1_0_5": 1636465712.9309716,
        "leaf_1_0_6": 1636465711.9095693,
        "leaf_2_0_1": 1636465711.923121,
        "leaf_2_0_2": 1636465711.9384365,
        "leaf_2_0_3": 1636465711.8166094,
        "leaf_2_0_4": 1636465711.835662,
        "leaf_2_0_5": 1636465711.8547466,
        "leaf_2_0_6": 1636465712.9085186,
        "leaf_3_0_1": 1636465711.8839304,
        "leaf_3_0_2": 1636465712.9475315,
        "leaf_3_0_3": 1636465711.9220862,
        "leaf_3_0_4": 1636465711.9308558,
        "leaf_3_0_5": 1636465711.9432657,
        "leaf_3_0_6": 1636465711.9532719,
        "leaf_4_0_1": 1636465711.9740727,
        "leaf_4_0_2": 1636465711.9884787,
        "leaf_4_0_3": 1636465712.023013,
        "leaf_4_0_4": 1636465712.049259,
        "leaf_4_0_5": 1636465713.1051462,
        "leaf_4_0_6": 1636465712.092202,
        "spine_1_1_1": 1636465711.9481993,
        "spine_1_1_2": 1636465711.966753,
        "spine_1_1_3": 1636465713.0282173,
        "spine_1_1_4": 1636465711.9993303,
        "spine_1_1_5": 1636465712.0295715,
        "spine_1_1_6": 1636465712.0489988,
        "spine_2_1_1": 1636465712.0640018,
        "spine_2_1_2": 1636465712.0774744,
        "spine_2_1_3": 1636465712.0894337,
        "spine_2_1_4": 1636465712.0967305,
        "spine_2_1_5": 1636465712.1473083,
        "spine_2_1_6": 1636465712.1692004,
        "spine_3_1_1": 1636465713.2270195,
        "spine_3_1_2": 1636465712.1970341,
        "spine_3_1_3": 1636465712.2194629,
        "spine_3_1_4": 1636465713.27009,
        "spine_3_1_5": 1636465712.1072319,
        "spine_3_1_6": 1636465712.126113,
        "spine_4_1_1": 1636465713.1879144,
        "spine_4_1_2": 1636465712.1677783,
        "spine_4_1_3": 1636465712.18441,
        "spine_4_1_4": 1636465712.1993682,
        "spine_4_1_5": 1636465712.2124171,
        "spine_4_1_6": 1636465712.2219722,
        "tof_1_2_2": 1636465712.234476,
        "tof_1_2_3": 1636465713.3037233,
        "tof_1_2_4": 1636465712.273493,
        "tof_1_2_5": 1636465712.2876225,
        "tof_1_2_6": 1636465712.2961583,
        "tof_2_2_1": 1636465712.3051343,
        "tof_2_2_2": 1636465712.31453,
        "tof_2_2_3": 1636465712.3880532,
        "tof_2_2_4": 1636465712.265398,
        "tof_2_2_5": 1636465713.320022,
        "tof_2_2_6": 1636465712.2884047,
        "tof_1_2_1": 1636465730.8894053
    }
}