{
    "description": "Scenario 4a: Leaf leaf_1_0_1 failure and recovery with BGP",
    "k_leaf": 12,
    "k_top": 12,
    "redundancy_factor": 12,
    "is_k8s": true,
    "machine_mac_addresses": {
        "leaf_1_0_1": {
            "net0": "16:00:f8:74:e0:39",
            "net1": "5e:bd:48:08:2f:c7",
            "net10": "aa:50:e7:f3:6f:1f",
            "net11": "f6:1c:e4:12:73:e7",
            "net12": "a6:e7:36:fb:33:2c",
            "net2": "76:e1:69:94:e4:9d",
            "net3": "b6:30:86:20:b8:98",
            "net4": "e2:ff:24:f1:cd:68",
            "net5": "ca:cc:45:e7:34:47",
            "net6": "46:02:bc:82:10:18",
            "net7": "ca:09:f6:03:22:a1",
            "net8": "7e:45:e6:eb:bf:e1",
            "net9": "ce:fd:27:ce:89:a4"
        },
        "leaf_1_0_10": {
            "net0": "f6:75:a6:56:aa:f8",
            "net1": "b2:ff:8d:c7:a0:8d",
            "net10": "72:87:f8:e1:35:84",
            "net11": "7a:3d:04:63:51:1f",
            "net12": "be:01:94:62:4b:bc",
            "net2": "2a:4a:4a:6b:0e:ab",
            "net3": "e2:27:13:b9:6e:20",
            "net4": "e2:ed:63:bb:07:da",
            "net5": "7e:45:b2:56:15:13",
            "net6": "46:e9:9e:94:61:bb",
            "net7": "a2:96:46:11:c7:79",
            "net8": "c2:06:13:38:94:8c",
            "net9": "a6:a4:f0:29:38:2e"
        },
        "leaf_1_0_11": {
            "net0": "c6:78:4f:f8:f3:1d",
            "net1": "96:1c:90:c4:03:8f",
            "net10": "7e:50:8d:f5:39:23",
            "net11": "2a:0c:e0:34:1c:a4",
            "net12": "22:ec:ff:ae:ac:6c",
            "net2": "da:00:d1:08:5f:ee",
            "net3": "be:93:b3:b8:e0:9f",
            "net4": "8a:41:74:a9:6a:e3",
            "net5": "12:fc:78:37:5a:d2",
            "net6": "02:d5:16:5e:ef:fe",
            "net7": "5e:27:20:e4:a9:18",
            "net8": "86:a4:33:a3:ca:68",
            "net9": "3e:70:24:bc:d8:9f"
        },
        "leaf_1_0_12": {
            "net0": "3e:f6:72:70:89:be",
            "net1": "2e:fb:fa:c9:40:7e",
            "net10": "fa:b3:85:7d:23:c7",
            "net11": "76:9d:d5:2d:77:42",
            "net12": "5e:1c:20:2c:fb:94",
            "net2": "fa:14:57:e1:85:6d",
            "net3": "6a:fd:66:ca:16:55",
            "net4": "3a:0a:2d:76:f3:fd",
            "net5": "22:64:1e:41:85:7b",
            "net6": "aa:69:34:d1:c8:2c",
            "net7": "e6:13:e0:9f:55:43",
            "net8": "12:7a:5c:eb:3d:d6",
            "net9": "66:66:e5:a2:77:bf"
        },
        "leaf_1_0_2": {
            "net0": "c6:21:e3:32:f7:a6",
            "net1": "82:22:cb:d3:bf:c3",
            "net10": "f6:50:57:79:f0:64",
            "net11": "f2:8f:2c:7d:60:0c",
            "net12": "82:d9:64:63:38:51",
            "net2": "9e:77:2f:ba:91:65",
            "net3": "a6:8f:a1:d2:4e:55",
            "net4": "26:33:22:95:de:43",
            "net5": "c6:e8:cd:51:f3:8a",
            "net6": "8e:58:50:29:d3:35",
            "net7": "66:ba:bb:30:5f:ec",
            "net8": "6a:99:29:2b:a3:f8",
            "net9": "de:4e:50:81:d2:2c"
        },
        "leaf_1_0_3": {
            "net0": "9e:5c:bf:9a:13:b6",
            "net1": "f6:94:01:d6:54:cc",
            "net10": "be:0f:e3:f3:1e:4e",
            "net11": "d6:00:67:1a:56:0c",
            "net12": "36:d1:c8:ba:fd:d7",
            "net2": "36:0e:d2:4e:2a:94",
            "net3": "76:23:21:83:b2:52",
            "net4": "ee:cc:c5:e4:09:bc",
            "net5": "02:42:ac:19:41:df",
            "net6": "6e:8c:35:28:8f:42",
            "net7": "aa:05:13:33:cd:59",
            "net8": "62:b7:1d:ff:e8:b9",
            "net9": "2e:91:21:91:26:65"
        },
        "leaf_1_0_4": {
            "net0": "8a:70:bf:32:84:cc",
            "net1": "2e:52:eb:30:14:82",
            "net10": "da:26:48:3f:60:4e",
            "net11": "c2:94:d5:4c:02:20",
            "net12": "26:99:1e:36:b0:22",
            "net2": "9e:94:af:28:04:ca",
            "net3": "a2:1e:ad:8d:12:b6",
            "net4": "9a:72:13:27:b3:e6",
            "net5": "f2:df:dc:59:bf:4f",
            "net6": "4a:48:e7:ee:b3:4d",
            "net7": "f6:a1:82:5f:6a:08",
            "net8": "3e:98:7e:d9:1c:40",
            "net9": "da:9f:bc:3a:59:c9"
        },
        "leaf_1_0_5": {
            "net0": "62:b6:28:29:0a:67",
            "net1": "2a:ca:de:a7:92:1c",
            "net10": "06:e8:58:4f:47:be",
            "net11": "3e:ca:18:c8:b9:18",
            "net12": "2a:9f:10:c8:0c:aa",
            "net2": "0a:db:14:d5:ef:eb",
            "net3": "ba:7c:7d:a3:03:17",
            "net4": "82:cb:aa:ec:01:90",
            "net5": "12:55:df:70:fe:55",
            "net6": "2a:e1:d8:96:c2:67",
            "net7": "0e:de:6a:9e:8f:a4",
            "net8": "6e:d6:df:92:8f:d2",
            "net9": "b6:62:f0:bc:fa:dd"
        },
        "leaf_1_0_6": {
            "net0": "82:4c:14:ed:3a:16",
            "net1": "f6:25:a2:95:dd:2f",
            "net10": "8e:ab:51:86:66:fd",
            "net11": "2e:a2:bb:17:ad:f5",
            "net12": "82:d6:c1:be:b6:d4",
            "net2": "e2:3b:8c:62:02:46",
            "net3": "96:7d:ad:d0:52:9c",
            "net4": "1a:96:df:71:a7:07",
            "net5": "66:d8:1e:7b:7f:01",
            "net6": "62:cd:81:24:b8:8a",
            "net7": "0a:e9:62:0b:06:15",
            "net8": "16:13:ac:5f:6a:d6",
            "net9": "6a:d7:c5:a7:e2:3c"
        },
        "leaf_1_0_7": {
            "net0": "ce:53:66:66:b5:04",
            "net1": "22:26:8d:11:eb:52",
            "net10": "2e:f5:c3:d8:30:67",
            "net11": "f2:fa:dc:be:55:9b",
            "net12": "c2:84:42:c7:61:d2",
            "net2": "06:6c:fe:bf:86:b9",
            "net3": "9e:e2:32:cf:7c:26",
            "net4": "3e:01:e7:b7:14:cc",
            "net5": "86:c7:05:8b:f4:12",
            "net6": "b2:49:42:2d:e9:28",
            "net7": "96:f3:fd:fe:e6:bb",
            "net8": "d2:ed:d7:8f:0f:0c",
            "net9": "66:88:87:b2:ff:1d"
        },
        "leaf_1_0_8": {
            "net0": "92:39:79:e3:8a:aa",
            "net1": "66:d5:f1:3a:2b:0a",
            "net10": "02:ef:3e:e8:21:12",
            "net11": "36:e9:0a:46:2a:7a",
            "net12": "4e:20:b9:5f:54:59",
            "net2": "42:dd:e4:5e:dc:38",
            "net3": "de:1e:66:40:cc:49",
            "net4": "72:b6:05:21:3d:a4",
            "net5": "52:c5:5a:01:c5:16",
            "net6": "22:60:d1:fd:af:c9",
            "net7": "26:d9:bd:b0:af:a7",
            "net8": "f6:ad:ef:da:26:d3",
            "net9": "a6:cb:ce:ff:e2:bb"
        },
        "leaf_1_0_9": {
            "net0": "02:5d:00:bb:3b:2c",
            "net1": "26:1a:b8:a1:92:91",
            "net10": "9e:9d:61:09:ba:ca",
            "net11": "e2:32:21:f8:35:42",
            "net12": "5e:4e:c8:ac:40:66",
            "net2": "92:f9:99:8b:7d:ac",
            "net3": "de:47:32:46:47:d0",
            "net4": "6a:9e:4e:f9:d3:fa",
            "net5": "62:f4:0b:29:9e:b4",
            "net6": "6a:3a:05:fb:0f:a1",
            "net7": "b6:21:2b:62:0b:50",
            "net8": "c2:70:42:c1:00:c3",
            "net9": "de:48:84:ab:98:fd"
        },
        "leaf_2_0_1": {
            "net0": "4e:0d:79:e8:35:62",
            "net1": "f6:79:9f:1c:95:3a",
            "net10": "46:9a:54:7d:ab:aa",
            "net11": "ba:68:6f:65:48:54",
            "net12": "d6:d9:16:91:ba:5c",
            "net2": "1a:db:d8:36:38:6a",
            "net3": "da:04:bf:a4:76:b5",
            "net4": "a2:58:7b:86:0c:ea",
            "net5": "76:70:70:ed:d6:50",
            "net6": "ca:a3:29:c9:63:0b",
            "net7": "c6:00:6f:29:d7:e0",
            "net8": "62:36:ca:2f:53:4e",
            "net9": "e2:82:5a:3d:ee:74"
        },
        "leaf_2_0_10": {
            "net0": "d6:73:76:38:77:45",
            "net1": "0a:3d:79:4a:cb:28",
            "net10": "c2:75:dd:f8:e7:8b",
            "net11": "06:22:37:76:ba:fb",
            "net12": "96:93:3d:f7:42:e8",
            "net2": "2e:3e:e6:59:f6:e1",
            "net3": "9a:bf:0b:f3:0c:5d",
            "net4": "66:79:d6:13:cf:b9",
            "net5": "e2:30:32:59:41:b3",
            "net6": "36:5e:b1:9c:79:17",
            "net7": "46:a4:ed:d6:29:e7",
            "net8": "ba:a8:e1:fb:53:9e",
            "net9": "02:ea:54:8b:51:4c"
        },
        "leaf_2_0_11": {
            "net0": "fa:a7:06:34:10:0d",
            "net1": "ea:5a:8d:0f:72:2c",
            "net10": "4e:d7:0b:cb:9f:26",
            "net11": "de:3f:aa:d6:06:f9",
            "net12": "52:32:10:79:a1:d0",
            "net2": "76:00:bc:55:b5:fb",
            "net3": "82:e7:17:58:9b:0d",
            "net4": "32:5c:8f:32:ad:89",
            "net5": "46:76:e3:e4:e1:c3",
            "net6": "da:62:c9:5a:b6:9d",
            "net7": "d2:57:df:9c:5c:9f",
            "net8": "4e:d0:fe:be:69:e5",
            "net9": "26:6f:51:78:5a:bf"
        },
        "leaf_2_0_12": {
            "net0": "96:32:1f:65:af:52",
            "net1": "2a:aa:51:0b:a7:a4",
            "net10": "fe:34:ef:99:4c:ef",
            "net11": "7a:43:0a:1b:ef:db",
            "net12": "8e:3b:ab:4a:f4:e4",
            "net2": "e6:84:22:d0:51:79",
            "net3": "5a:06:d1:0b:67:6c",
            "net4": "d6:b8:3b:db:92:14",
            "net5": "2a:2e:7e:da:ac:d8",
            "net6": "02:96:77:00:0a:98",
            "net7": "6a:26:f4:43:e7:59",
            "net8": "06:df:f3:cc:8c:b9",
            "net9": "0e:36:56:06:2c:9b"
        },
        "leaf_2_0_2": {
            "net0": "4a:38:2e:ba:e7:f6",
            "net1": "3a:79:34:59:e1:02",
            "net10": "62:f0:d4:94:29:12",
            "net11": "06:4b:2f:eb:61:9b",
            "net12": "fa:d1:40:0e:ca:c4",
            "net2": "6a:7c:18:13:4e:ab",
            "net3": "76:72:c1:2f:0d:ca",
            "net4": "02:dc:0a:cc:98:e4",
            "net5": "3a:90:52:5e:c5:96",
            "net6": "ea:de:a8:37:a9:55",
            "net7": "22:ad:87:f8:c8:df",
            "net8": "02:ae:5a:9d:89:e5",
            "net9": "86:62:90:f1:91:6a"
        },
        "leaf_2_0_3": {
            "net0": "d2:02:3e:2d:33:ab",
            "net1": "aa:56:44:cc:51:7a",
            "net10": "e2:94:1a:cd:e2:55",
            "net11": "8a:54:e9:0e:12:a5",
            "net12": "1a:3c:8d:3d:df:4c",
            "net2": "8e:88:6f:75:4a:91",
            "net3": "aa:49:2e:f1:90:10",
            "net4": "52:96:29:a3:12:68",
            "net5": "ae:2e:c5:ce:f0:3c",
            "net6": "42:52:81:0f:f8:f4",
            "net7": "d2:e5:d9:95:14:84",
            "net8": "96:0e:bd:58:63:12",
            "net9": "62:de:dd:11:9f:11"
        },
        "leaf_2_0_4": {
            "net0": "7e:4b:f8:ee:12:13",
            "net1": "da:43:df:24:db:90",
            "net10": "66:7c:f7:a2:52:fe",
            "net11": "52:6d:a9:7a:e7:db",
            "net12": "42:de:90:0a:3f:31",
            "net2": "ca:6b:d2:4e:9d:34",
            "net3": "12:00:cf:a7:ef:2a",
            "net4": "d6:ee:47:02:50:a4",
            "net5": "9e:8b:c9:08:26:51",
            "net6": "56:17:52:bd:31:43",
            "net7": "6a:0f:18:3b:0d:81",
            "net8": "d2:e6:64:47:c7:70",
            "net9": "1e:e9:74:68:84:54"
        },
        "leaf_2_0_5": {
            "net0": "f6:09:ea:2d:c9:22",
            "net1": "de:0a:b5:b4:ac:f3",
            "net10": "fe:57:5b:a1:bf:86",
            "net11": "66:3b:85:19:3e:d6",
            "net12": "3a:dd:3a:4a:db:2d",
            "net2": "5e:8e:05:7a:81:2b",
            "net3": "7e:92:d9:d3:6c:7c",
            "net4": "b6:d1:9e:bc:cb:6d",
            "net5": "ba:9d:59:77:29:28",
            "net6": "be:59:57:a1:de:0a",
            "net7": "46:83:f7:90:9c:59",
            "net8": "b6:0d:fd:b8:f8:bf",
            "net9": "72:e5:75:e9:c4:b0"
        },
        "leaf_2_0_6": {
            "net0": "4e:9a:44:6c:3a:c4",
            "net1": "f6:90:21:ef:8b:44",
            "net10": "12:03:28:ad:77:e6",
            "net11": "32:1a:f1:c0:1e:46",
            "net12": "0e:8d:f3:de:a3:c7",
            "net2": "8e:28:11:1c:1f:38",
            "net3": "3a:14:60:fa:b7:16",
            "net4": "22:a6:de:56:cf:ee",
            "net5": "fa:0e:4c:aa:d6:72",
            "net6": "32:73:4c:a8:19:12",
            "net7": "de:f7:3d:77:61:78",
            "net8": "fe:0c:36:26:63:93",
            "net9": "d2:52:30:3f:60:30"
        },
        "leaf_2_0_7": {
            "net0": "22:27:9f:b5:2b:cd",
            "net1": "f2:e1:4e:11:2a:13",
            "net10": "9e:1e:38:cf:fb:03",
            "net11": "ea:e5:27:06:c5:6a",
            "net12": "0e:39:84:37:d7:f8",
            "net2": "4e:3b:bb:e6:8d:63",
            "net3": "c2:24:36:be:22:fa",
            "net4": "4e:76:5a:ff:09:f4",
            "net5": "16:ea:3c:c1:14:ce",
            "net6": "ea:aa:12:70:f1:09",
            "net7": "5e:e1:e2:69:d7:42",
            "net8": "6a:7e:04:b4:4d:7b",
            "net9": "f2:06:0f:fa:9f:48"
        },
        "leaf_2_0_8": {
            "net0": "66:2a:e2:3e:a4:96",
            "net1": "82:a3:c8:a7:b7:3e",
            "net10": "fa:24:91:e5:b9:5f",
            "net11": "aa:4a:30:c4:44:bc",
            "net12": "2a:14:a6:0e:61:07",
            "net2": "a2:8c:4d:db:5c:f5",
            "net3": "3e:0b:94:f7:1a:31",
            "net4": "e2:d8:25:8f:b0:b2",
            "net5": "ce:52:45:1e:4c:0f",
            "net6": "8e:12:03:1c:3c:b3",
            "net7": "22:50:c6:d0:7c:32",
            "net8": "82:c9:e7:06:2c:62",
            "net9": "a6:c0:f8:81:57:f7"
        },
        "leaf_2_0_9": {
            "net0": "86:0d:0b:95:8a:b3",
            "net1": "ba:5e:c6:17:92:60",
            "net10": "4a:91:db:5d:61:e4",
            "net11": "b6:8d:d1:28:1f:44",
            "net12": "da:88:5c:0c:b6:1b",
            "net2": "ae:2a:d1:81:93:a9",
            "net3": "ae:0a:0a:8d:0d:77",
            "net4": "6e:bf:4c:35:84:92",
            "net5": "7e:17:6e:8f:d3:d5",
            "net6": "d2:e7:46:59:80:39",
            "net7": "aa:09:aa:ee:8a:0e",
            "net8": "be:ea:84:32:2f:9a",
            "net9": "7a:bb:a0:1a:23:65"
        },
        "spine_1_1_1": {
            "net0": "4a:2c:56:43:7e:2b",
            "net1": "92:0b:4b:05:2a:57",
            "net10": "fe:a7:89:0c:9b:5a",
            "net11": "0a:f2:3c:fb:0f:97",
            "net12": "0e:3f:c3:75:a1:f5",
            "net13": "c2:3f:ea:ef:01:fa",
            "net14": "2e:b9:00:c1:18:b2",
            "net15": "c6:ee:f0:13:dc:4c",
            "net16": "12:19:fb:5e:e7:f6",
            "net17": "a2:55:49:f2:3a:0b",
            "net18": "5e:7e:3c:a0:73:b4",
            "net19": "4a:1d:23:3b:82:2f",
            "net2": "3a:4d:26:16:45:e5",
            "net20": "4a:56:f5:9c:0e:d6",
            "net21": "6a:7d:31:33:62:06",
            "net22": "5a:7d:fa:68:23:cb",
            "net23": "96:4c:eb:cf:fe:00",
            "net3": "1e:5e:43:9d:cd:fc",
            "net4": "d2:16:90:10:40:d1",
            "net5": "e6:4f:ee:48:f8:8b",
            "net6": "fe:e9:f3:39:3e:c3",
            "net7": "aa:f0:fb:47:a0:fd",
            "net8": "ee:f4:15:bb:09:b2",
            "net9": "b6:6d:9f:79:8a:63"
        },
        "spine_1_1_10": {
            "net0": "1e:99:88:13:63:03",
            "net1": "5e:90:69:58:9d:37",
            "net10": "1e:85:da:92:98:4e",
            "net11": "c2:e5:be:4a:96:28",
            "net12": "f6:7d:b7:ac:d8:55",
            "net13": "0e:fa:cb:4a:b1:6d",
            "net14": "8e:9f:51:b2:ec:4b",
            "net15": "3a:02:14:b8:02:13",
            "net16": "f2:c2:c4:07:80:99",
            "net17": "5e:6b:d8:d5:5c:26",
            "net18": "de:7f:b5:50:cb:cf",
            "net19": "d6:8d:e2:be:2c:5d",
            "net2": "ae:26:d8:ac:a6:54",
            "net20": "06:f4:26:1a:4e:d4",
            "net21": "a6:c0:10:ba:c3:79",
            "net22": "76:14:cd:1c:b0:55",
            "net23": "2a:9b:08:a8:9d:98",
            "net3": "ca:23:6a:1a:f6:86",
            "net4": "f2:77:11:a6:8c:ae",
            "net5": "2e:1c:05:1e:65:05",
            "net6": "ca:42:5f:ec:82:4d",
            "net7": "4e:66:11:fa:c4:b5",
            "net8": "5e:a1:6f:9a:51:14",
            "net9": "de:81:71:75:d4:bb"
        },
        "spine_1_1_11": {
            "net0": "0e:35:55:50:e2:4f",
            "net1": "e6:77:a6:6e:3d:47",
            "net10": "3e:55:03:6f:13:e5",
            "net11": "0e:e7:08:42:29:f7",
            "net12": "2a:21:22:75:6c:10",
            "net13": "b2:07:60:80:03:68",
            "net14": "be:9d:18:6e:2f:01",
            "net15": "be:57:8a:4b:80:f1",
            "net16": "d2:9f:34:e1:79:a7",
            "net17": "82:78:b0:42:d0:9b",
            "net18": "c2:fb:37:5d:b2:7d",
            "net19": "c6:fa:90:95:72:20",
            "net2": "26:09:44:c2:f7:cd",
            "net20": "0a:31:c9:48:17:d0",
            "net21": "36:d4:b9:f2:64:f0",
            "net22": "1e:c8:99:bc:8c:8f",
            "net23": "e2:ef:18:47:1d:88",
            "net3": "c6:c1:5e:12:fb:ef",
            "net4": "c6:69:97:27:39:05",
            "net5": "a6:ed:6a:f7:77:e5",
            "net6": "92:f4:72:66:c7:fc",
            "net7": "9e:98:3c:cd:82:26",
            "net8": "f6:8a:19:d7:c6:36",
            "net9": "36:03:b4:aa:4f:8b"
        },
        "spine_1_1_12": {
            "net0": "3e:2a:25:2a:70:ef",
            "net1": "fa:8e:c3:f6:6d:51",
            "net10": "02:05:88:6a:cd:cb",
            "net11": "62:97:08:dd:cd:ee",
            "net12": "fe:c9:82:2c:e4:2c",
            "net13": "0a:6d:11:28:f1:0d",
            "net14": "b2:cc:11:9e:94:f3",
            "net15": "c2:2e:11:78:94:49",
            "net16": "8e:7c:ec:14:19:ea",
            "net17": "d2:ce:91:33:79:0f",
            "net18": "e6:8e:42:1d:de:c9",
            "net19": "96:b1:1a:11:e2:c6",
            "net2": "ee:dd:f6:e5:b1:59",
            "net20": "22:54:b3:ae:0c:b9",
            "net21": "ce:71:06:2c:64:c1",
            "net22": "8a:43:13:69:91:78",
            "net23": "72:95:63:9e:09:fc",
            "net3": "ea:02:12:fe:47:e9",
            "net4": "ca:68:5c:c8:15:71",
            "net5": "de:ee:b9:28:9e:c8",
            "net6": "22:20:ab:d6:eb:cf",
            "net7": "86:58:24:9f:7c:e1",
            "net8": "86:d5:86:0e:bb:5f",
            "net9": "36:d4:03:ba:8d:70"
        },
        "spine_1_1_2": {
            "net0": "4e:67:8b:b2:ea:0b",
            "net1": "32:3f:5f:cb:8c:2f",
            "net10": "e2:31:9f:b4:ff:b3",
            "net11": "fa:c9:18:da:1d:06",
            "net12": "0e:e6:0c:e6:44:21",
            "net13": "0a:e2:86:26:3a:a6",
            "net14": "66:3b:a9:85:58:40",
            "net15": "d6:90:2b:5c:65:a8",
            "net16": "5e:8b:34:15:6e:4d",
            "net17": "a2:d0:2c:aa:98:41",
            "net18": "0a:08:18:79:1d:68",
            "net19": "16:02:da:df:81:1a",
            "net2": "36:52:70:ab:81:f3",
            "net20": "8a:63:cb:16:4c:f8",
            "net21": "a6:43:0c:d6:80:ca",
            "net22": "be:74:3d:3e:e4:8b",
            "net23": "32:0a:c3:76:8d:a9",
            "net3": "96:d6:7a:e9:fe:33",
            "net4": "56:d3:fb:d4:73:dc",
            "net5": "9a:72:16:dc:fb:66",
            "net6": "6e:4b:89:1c:1b:40",
            "net7": "ea:df:95:00:0b:76",
            "net8": "5e:be:91:7a:77:86",
            "net9": "c6:d7:9c:ed:13:b4"
        },
        "spine_1_1_3": {
            "net0": "1e:4a:35:be:bc:c5",
            "net1": "ce:80:9f:38:4a:53",
            "net10": "fa:42:f4:54:6c:fd",
            "net11": "ee:4b:5d:3f:e0:2c",
            "net12": "52:e0:28:0e:b1:42",
            "net13": "ea:a1:2a:06:22:bd",
            "net14": "62:d4:c9:e9:ed:75",
            "net15": "0e:5c:b1:18:6a:20",
            "net16": "ba:d9:31:62:fc:6d",
            "net17": "0e:5b:96:ce:b3:bd",
            "net18": "b2:5e:3d:cf:54:5f",
            "net19": "e2:58:03:c0:29:ce",
            "net2": "16:75:eb:f0:7e:39",
            "net20": "da:b0:da:17:56:23",
            "net21": "0e:01:2e:52:3d:af",
            "net22": "f2:5b:fd:53:d8:11",
            "net23": "9a:c7:46:00:df:2e",
            "net3": "4a:eb:99:d5:b1:e7",
            "net4": "86:52:10:c5:45:14",
            "net5": "1e:f9:f4:e2:70:be",
            "net6": "6a:f8:8b:46:64:8f",
            "net7": "d6:4e:64:0b:dc:5a",
            "net8": "0e:f2:ac:ff:87:74",
            "net9": "be:c1:94:08:6c:ac"
        },
        "spine_1_1_4": {
            "net0": "46:ef:31:f8:ae:ec",
            "net1": "f6:f2:5d:bc:73:37",
            "net10": "fe:38:ba:34:f5:36",
            "net11": "82:ad:d4:29:5f:72",
            "net12": "62:5e:45:7a:87:6b",
            "net13": "02:5e:60:3f:6d:01",
            "net14": "ca:2b:b2:3c:3d:17",
            "net15": "a2:7a:e3:dc:4a:0c",
            "net16": "a6:a1:97:47:6e:bd",
            "net17": "be:54:d1:78:30:a9",
            "net18": "92:b5:09:9d:cc:6e",
            "net19": "ee:ba:7a:dd:77:cb",
            "net2": "a6:11:b6:c5:bf:61",
            "net20": "2a:5e:c6:a6:e7:70",
            "net21": "ae:fa:08:d0:48:bd",
            "net22": "ae:96:24:3a:ae:c9",
            "net23": "56:03:0e:06:67:5b",
            "net3": "e6:65:b7:9d:dd:aa",
            "net4": "ba:d2:17:63:56:d1",
            "net5": "2a:a1:b7:dd:3d:84",
            "net6": "9a:24:6e:b0:6c:d1",
            "net7": "fe:20:c6:5f:ef:66",
            "net8": "36:fd:ce:71:73:3a",
            "net9": "3e:35:f8:f1:13:59"
        },
        "spine_1_1_5": {
            "net0": "c6:72:30:95:84:21",
            "net1": "66:d6:33:b0:d1:51",
            "net10": "1e:a7:3e:91:d4:36",
            "net11": "5e:f0:e8:b2:a0:2f",
            "net12": "a2:a6:1b:f7:9b:d6",
            "net13": "7a:e3:81:95:ca:98",
            "net14": "fa:73:a4:62:6f:fc",
            "net15": "8e:1d:e3:55:fe:60",
            "net16": "06:5a:74:99:f8:3c",
            "net17": "46:10:69:fe:54:60",
            "net18": "8a:97:96:59:0c:d0",
            "net19": "62:65:01:5f:64:2b",
            "net2": "d2:eb:64:64:25:36",
            "net20": "52:4f:ef:94:18:37",
            "net21": "02:13:39:44:7e:b2",
            "net22": "6a:bf:51:e8:51:c9",
            "net23": "16:11:22:3e:e1:bb",
            "net3": "ea:e4:21:5a:bc:ed",
            "net4": "2a:9b:16:83:2d:a5",
            "net5": "36:30:18:a8:f7:f4",
            "net6": "8e:a5:2a:cb:0d:38",
            "net7": "e2:f6:6a:ab:a3:84",
            "net8": "86:c9:c8:db:da:68",
            "net9": "22:7f:9a:9f:0c:91"
        },
        "spine_1_1_6": {
            "net0": "ca:c4:4b:a2:db:cb",
            "net1": "76:c7:f6:23:b8:93",
            "net10": "16:9e:bd:c4:17:70",
            "net11": "da:15:89:dd:2a:b8",
            "net12": "9a:5d:db:f0:6d:81",
            "net13": "e2:89:30:18:19:86",
            "net14": "46:a8:85:be:87:ca",
            "net15": "fe:95:fc:71:f1:b2",
            "net16": "ce:3b:bd:e6:60:ff",
            "net17": "9a:da:5a:52:7c:c2",
            "net18": "2e:a4:78:d7:5b:1d",
            "net19": "2a:a1:6d:ed:9d:ff",
            "net2": "06:51:68:77:1b:a3",
            "net20": "c6:c7:68:42:41:3e",
            "net21": "ae:01:0f:a9:e1:1b",
            "net22": "a6:a2:61:3f:1a:d0",
            "net23": "3a:5a:43:b9:73:77",
            "net3": "d6:e7:11:64:7c:6b",
            "net4": "b6:88:93:fc:f3:09",
            "net5": "f2:c7:5a:6a:24:4b",
            "net6": "9a:c6:01:00:5e:84",
            "net7": "3e:f1:e8:e9:ca:c5",
            "net8": "32:7d:f2:26:08:8e",
            "net9": "3e:f3:a6:db:e3:60"
        },
        "spine_1_1_7": {
            "net0": "26:2b:4f:de:c6:7d",
            "net1": "fa:be:d5:4e:fb:68",
            "net10": "a6:b1:98:45:97:e5",
            "net11": "82:29:b8:ec:96:d3",
            "net12": "a2:bc:19:05:19:0b",
            "net13": "5e:64:84:68:04:24",
            "net14": "7a:45:00:83:9f:bf",
            "net15": "8e:1a:e4:3c:ed:f5",
            "net16": "da:c7:71:c7:11:50",
            "net17": "7a:d3:cc:3c:5a:8b",
            "net18": "f2:ee:86:d3:d7:99",
            "net19": "2a:aa:ef:20:78:e5",
            "net2": "0e:9f:29:7d:3b:f9",
            "net20": "96:57:f1:ad:5e:64",
            "net21": "36:94:29:df:46:22",
            "net22": "da:68:4c:c4:8a:70",
            "net23": "a2:22:2a:82:a8:a3",
            "net3": "f6:2a:47:a7:08:4c",
            "net4": "fe:a8:8e:3a:ed:95",
            "net5": "96:95:62:07:39:be",
            "net6": "ca:5f:7e:a6:b8:26",
            "net7": "26:1a:36:41:04:c1",
            "net8": "06:fa:89:04:cb:a1",
            "net9": "52:64:ef:0d:71:2b"
        },
        "spine_1_1_8": {
            "net0": "9a:fa:b1:43:01:2d",
            "net1": "9e:bf:79:2a:61:0a",
            "net10": "a2:3b:d5:40:c8:8f",
            "net11": "3a:37:c7:28:58:4c",
            "net12": "2e:fc:1d:3b:ee:2a",
            "net13": "ea:5e:d6:af:50:6d",
            "net14": "4e:94:f7:e5:b9:94",
            "net15": "6a:ea:e2:61:dc:f8",
            "net16": "a6:42:a3:48:47:b1",
            "net17": "56:2b:e9:4b:41:fe",
            "net18": "06:9c:9d:e4:33:28",
            "net19": "f6:7a:d9:4a:d8:70",
            "net2": "4e:5c:25:9b:34:d3",
            "net20": "aa:17:db:a9:fa:17",
            "net21": "92:98:e1:a7:ec:12",
            "net22": "da:df:61:40:cc:c1",
            "net23": "1a:00:05:67:62:40",
            "net3": "76:12:d3:e7:09:67",
            "net4": "9e:9a:be:3b:7a:e7",
            "net5": "b6:44:ac:55:5c:29",
            "net6": "fe:fa:af:44:83:a8",
            "net7": "aa:00:2b:ed:ec:16",
            "net8": "f6:01:7f:62:03:da",
            "net9": "f6:5b:34:2c:77:65"
        },
        "spine_1_1_9": {
            "net0": "0e:42:7b:f1:a7:26",
            "net1": "2a:7c:0d:b5:45:1f",
            "net10": "5e:7a:e7:65:ac:51",
            "net11": "b2:2c:00:42:69:b0",
            "net12": "2a:e7:ed:f4:00:72",
            "net13": "ee:b9:21:4e:b9:72",
            "net14": "aa:59:ce:ab:27:66",
            "net15": "5a:57:d6:d3:5d:5e",
            "net16": "32:57:88:e0:ed:54",
            "net17": "2a:dc:67:32:1c:c0",
            "net18": "fe:d1:0d:e8:01:01",
            "net19": "3e:f3:f5:ac:b9:a1",
            "net2": "e6:f8:05:f3:f7:c9",
            "net20": "b6:c5:c4:cc:89:a9",
            "net21": "0e:bc:e9:29:ef:82",
            "net22": "3a:11:02:7b:70:78",
            "net23": "3e:3f:ee:09:8e:a6",
            "net3": "e2:5d:50:16:92:9e",
            "net4": "7a:53:ec:87:88:39",
            "net5": "42:29:70:05:a6:08",
            "net6": "e6:5b:5c:34:fb:5b",
            "net7": "f2:59:01:9e:61:46",
            "net8": "de:54:ad:a8:43:d7",
            "net9": "96:fa:40:6e:0c:2e"
        },
        "spine_2_1_1": {
            "net0": "d6:2f:0e:ba:45:72",
            "net1": "da:12:9f:77:83:12",
            "net10": "72:d0:fa:11:17:e5",
            "net11": "f6:9c:89:48:88:46",
            "net12": "72:53:97:a1:be:d0",
            "net13": "d6:c1:47:7a:c1:da",
            "net14": "86:77:54:76:50:f0",
            "net15": "b6:f1:fd:3c:2a:cc",
            "net16": "66:f3:e1:4e:62:b8",
            "net17": "26:56:79:4f:30:84",
            "net18": "76:3f:cc:ad:f4:38",
            "net19": "0e:f2:a7:a0:a7:d9",
            "net2": "4e:59:ab:1c:43:fc",
            "net20": "0e:cf:22:18:83:0b",
            "net21": "62:4c:01:21:ec:8e",
            "net22": "66:f9:64:3b:58:44",
            "net23": "26:55:4c:ab:37:e7",
            "net3": "62:d8:11:19:f6:b1",
            "net4": "b6:6c:34:dd:4c:ee",
            "net5": "9e:5f:96:85:3f:27",
            "net6": "92:1e:f2:41:59:fb",
            "net7": "8e:f8:08:74:4c:b1",
            "net8": "76:8f:dd:1e:be:c1",
            "net9": "5a:fb:70:5f:ae:ef"
        },
        "spine_2_1_10": {
            "net0": "1e:e0:2a:34:ed:0c",
            "net1": "a2:01:fa:65:5c:ca",
            "net10": "e2:46:79:48:41:cf",
            "net11": "ce:b3:1a:43:97:48",
            "net12": "ba:6d:a6:99:12:cd",
            "net13": "1e:50:5c:da:17:d0",
            "net14": "76:3b:05:61:2f:df",
            "net15": "ea:fe:20:7d:6c:75",
            "net16": "b6:b6:0c:d8:a2:79",
            "net17": "8a:f1:79:1a:ea:a9",
            "net18": "92:9c:a4:70:25:ec",
            "net19": "9e:f5:2c:9f:73:0b",
            "net2": "42:29:2e:bf:c4:4a",
            "net20": "86:5d:6d:08:c1:d3",
            "net21": "5e:52:25:46:23:aa",
            "net22": "fa:aa:4d:ff:c8:6a",
            "net23": "9a:8e:fe:b5:68:c7",
            "net3": "fa:8e:ee:d0:a0:22",
            "net4": "a6:23:40:ee:a6:aa",
            "net5": "72:38:17:a8:33:47",
            "net6": "b2:0b:25:94:19:24",
            "net7": "a6:df:b1:b7:34:66",
            "net8": "ca:49:d2:15:0b:d9",
            "net9": "0a:45:31:b5:17:5f"
        },
        "spine_2_1_11": {
            "net0": "7e:53:d1:39:16:59",
            "net1": "b2:2d:ff:89:16:6c",
            "net10": "f6:90:6f:68:14:ae",
            "net11": "e2:fb:0d:90:14:e1",
            "net12": "26:fc:22:c7:0a:9c",
            "net13": "ce:b4:c9:78:41:64",
            "net14": "4e:76:cc:b5:05:06",
            "net15": "42:49:a8:5c:e9:22",
            "net16": "b6:80:cd:25:24:f5",
            "net17": "82:1d:1c:ea:93:3a",
            "net18": "a6:a0:0f:27:c5:38",
            "net19": "ae:68:64:e5:95:c8",
            "net2": "76:84:b0:db:b4:ad",
            "net20": "96:ca:55:08:f3:2e",
            "net21": "12:37:e8:26:c0:da",
            "net22": "62:65:56:54:5e:96",
            "net23": "c6:15:c5:81:e6:48",
            "net3": "52:7a:47:c8:76:3f",
            "net4": "ca:6b:05:ad:4b:16",
            "net5": "c6:60:97:00:59:20",
            "net6": "b2:1a:d2:ad:ab:00",
            "net7": "1e:7f:3d:90:6a:80",
            "net8": "2a:b8:a3:ad:78:18",
            "net9": "56:fd:2e:c2:77:9a"
        },
        "spine_2_1_12": {
            "net0": "a2:76:9e:0d:15:14",
            "net1": "76:f4:92:d5:a9:13",
            "net10": "12:3c:ad:87:b6:1e",
            "net11": "76:ac:e7:23:8a:c1",
            "net12": "26:9e:28:ab:9f:03",
            "net13": "0e:f0:17:36:6c:c6",
            "net14": "52:e1:e8:55:af:fb",
            "net15": "96:41:84:28:e6:51",
            "net16": "72:12:de:89:f3:a7",
            "net17": "46:69:8d:02:e0:2c",
            "net18": "f6:a2:f1:b6:0e:f8",
            "net19": "26:ed:0c:48:d5:2a",
            "net2": "1e:e4:bc:54:47:53",
            "net20": "4a:18:bd:97:a8:2f",
            "net21": "26:b5:e6:b1:48:63",
            "net22": "62:93:d0:ba:f9:d3",
            "net23": "6a:a6:43:54:0b:36",
            "net3": "4e:90:11:cb:fc:ea",
            "net4": "3e:3f:39:16:f2:58",
            "net5": "92:06:71:66:af:d5",
            "net6": "7e:65:a8:63:1d:08",
            "net7": "5a:02:e3:e7:98:38",
            "net8": "82:5b:dc:2b:65:0e",
            "net9": "5a:35:80:50:79:5a"
        },
        "spine_2_1_2": {
            "net0": "d2:5e:71:4e:cd:e4",
            "net1": "fa:63:4b:ad:00:f0",
            "net10": "8e:89:5d:ce:fa:f0",
            "net11": "ce:9e:ec:ec:64:0b",
            "net12": "22:a4:55:45:a4:40",
            "net13": "4e:0f:d9:28:e5:4a",
            "net14": "f6:cd:7a:aa:7d:28",
            "net15": "86:50:e4:14:d6:04",
            "net16": "86:6f:b8:3f:79:33",
            "net17": "82:4b:3e:28:56:5c",
            "net18": "ca:6b:be:aa:5a:30",
            "net19": "fa:3d:03:ab:c1:2c",
            "net2": "c2:17:c6:c2:27:59",
            "net20": "36:30:e9:82:bd:3d",
            "net21": "72:a4:51:bb:26:9b",
            "net22": "3e:17:0f:37:96:a0",
            "net23": "ae:c6:47:8b:9e:7a",
            "net3": "b6:b7:25:48:27:84",
            "net4": "26:f7:bc:e6:91:a4",
            "net5": "8a:ae:df:e6:09:5b",
            "net6": "ae:77:0f:e4:e9:56",
            "net7": "ce:50:cc:09:da:28",
            "net8": "46:ca:64:08:33:7e",
            "net9": "c2:f2:69:e7:e1:b1"
        },
        "spine_2_1_3": {
            "net0": "2a:c2:66:eb:06:39",
            "net1": "26:c7:77:f6:fc:f8",
            "net10": "52:bd:89:3d:d4:ea",
            "net11": "c6:b8:35:28:29:3e",
            "net12": "0e:18:10:2a:ec:04",
            "net13": "f2:82:ef:aa:73:a2",
            "net14": "76:dc:33:57:8c:1d",
            "net15": "1a:5e:2e:08:e5:df",
            "net16": "7e:31:ae:69:0f:eb",
            "net17": "8e:b1:a0:42:90:c3",
            "net18": "82:7c:38:01:a1:9c",
            "net19": "12:3e:b0:07:b5:36",
            "net2": "da:d6:86:88:c7:64",
            "net20": "ba:b8:71:14:f3:e7",
            "net21": "f2:d4:9c:a5:a9:ed",
            "net22": "26:ec:1d:31:f6:42",
            "net23": "52:c3:89:e0:10:7d",
            "net3": "0e:88:74:82:ea:7f",
            "net4": "46:54:22:d1:c7:7e",
            "net5": "9a:7c:7d:19:00:46",
            "net6": "2e:d8:b9:90:e6:dc",
            "net7": "8a:ef:a6:bb:aa:44",
            "net8": "92:ca:5b:43:2a:f4",
            "net9": "d6:44:f1:bd:70:be"
        },
        "spine_2_1_4": {
            "net0": "62:b7:45:36:49:f2",
            "net1": "22:af:db:80:e4:a9",
            "net10": "8a:51:4e:2f:94:d6",
            "net11": "0e:b6:ac:87:41:31",
            "net12": "76:1f:41:03:f6:5b",
            "net13": "c2:70:7c:75:8e:0d",
            "net14": "6e:a5:97:74:33:b1",
            "net15": "6a:a5:66:94:5f:be",
            "net16": "22:fc:c5:45:bd:21",
            "net17": "ee:bc:66:ee:b6:39",
            "net18": "d6:a1:9a:6f:9f:9f",
            "net19": "86:04:6f:76:a6:bd",
            "net2": "52:d1:82:ef:e3:a3",
            "net20": "ba:65:9a:dc:c1:6c",
            "net21": "56:2e:03:19:d8:30",
            "net22": "1e:c0:49:05:08:d6",
            "net23": "fe:a3:62:2e:df:cb",
            "net3": "fa:46:0e:21:cd:ea",
            "net4": "ca:cf:65:95:d6:af",
            "net5": "36:26:52:5c:d6:cd",
            "net6": "3a:86:c9:fc:92:a9",
            "net7": "42:42:bc:0d:5b:cb",
            "net8": "16:c3:5d:da:c3:0c",
            "net9": "e2:fb:85:43:37:85"
        },
        "spine_2_1_5": {
            "net0": "72:cd:b9:51:22:db",
            "net1": "c6:ed:05:9a:33:05",
            "net10": "3a:ab:8c:81:fe:5e",
            "net11": "8a:cb:92:06:93:f3",
            "net12": "6a:96:78:6b:7e:5c",
            "net13": "5a:d6:4c:46:0b:87",
            "net14": "36:1b:3c:40:54:87",
            "net15": "02:e2:3e:60:48:01",
            "net16": "8e:85:df:2f:5f:40",
            "net17": "5e:17:d4:6d:12:f8",
            "net18": "6e:5d:c1:cd:a0:0a",
            "net19": "6a:01:e2:f7:76:7c",
            "net2": "da:0d:5e:b8:e2:56",
            "net20": "76:f8:44:88:d3:f3",
            "net21": "3e:57:5a:57:fb:3f",
            "net22": "ce:3b:41:19:2c:ca",
            "net23": "36:58:a3:53:3d:c0",
            "net3": "52:8f:bc:36:d3:20",
            "net4": "ea:0e:89:25:a7:db",
            "net5": "0e:cd:5a:4d:2d:a4",
            "net6": "26:71:da:4c:53:35",
            "net7": "06:4d:cf:90:4d:46",
            "net8": "6a:57:7a:b1:23:d4",
            "net9": "0e:f3:ea:87:ee:b5"
        },
        "spine_2_1_6": {
            "net0": "7a:53:78:74:7c:e3",
            "net1": "f6:90:1b:c5:9f:4c",
            "net10": "0e:1d:dc:25:26:67",
            "net11": "96:e9:21:ec:e8:a1",
            "net12": "46:71:ab:53:9a:be",
            "net13": "ce:92:84:ef:ba:48",
            "net14": "6e:65:4b:03:7f:37",
            "net15": "ee:81:14:7a:2c:17",
            "net16": "ca:e8:f2:f3:c9:53",
            "net17": "92:9b:06:9d:17:68",
            "net18": "12:55:68:4f:6b:92",
            "net19": "4a:57:8f:c9:40:06",
            "net2": "f6:e4:17:af:6c:59",
            "net20": "32:70:e8:55:ab:0a",
            "net21": "9e:59:58:f6:43:57",
            "net22": "de:66:80:da:31:78",
            "net23": "5a:92:fc:ae:53:66",
            "net3": "4a:f0:e8:67:d2:b1",
            "net4": "0a:47:59:2f:da:08",
            "net5": "da:52:cf:44:ff:b2",
            "net6": "6a:ff:2b:44:88:06",
            "net7": "da:04:10:23:45:72",
            "net8": "7e:8d:39:dc:94:bd",
            "net9": "8a:96:76:1f:3e:62"
        },
        "spine_2_1_7": {
            "net0": "9a:ef:7d:a9:28:36",
            "net1": "b2:6d:b8:fd:be:e3",
            "net10": "36:ba:2f:6a:b9:44",
            "net11": "fe:50:82:68:84:34",
            "net12": "36:d7:eb:8c:02:08",
            "net13": "0a:32:8d:05:43:2b",
            "net14": "76:09:dd:00:70:e1",
            "net15": "42:db:1d:7d:91:7c",
            "net16": "e2:93:40:f8:2c:d4",
            "net17": "f2:2d:f2:c0:b1:94",
            "net18": "f2:78:c1:8b:42:4f",
            "net19": "d2:6c:20:6a:23:65",
            "net2": "6e:8c:68:3c:7d:d2",
            "net20": "86:71:63:49:d7:6f",
            "net21": "32:4a:27:c0:e9:66",
            "net22": "0e:df:1d:ce:57:b8",
            "net23": "26:05:8e:a2:0a:0a",
            "net3": "ee:e9:1e:ec:83:6f",
            "net4": "42:b3:95:69:44:7d",
            "net5": "66:b5:b7:62:42:13",
            "net6": "ce:9a:c9:67:b6:47",
            "net7": "da:17:f5:0c:df:51",
            "net8": "ee:b8:1e:4d:ad:c9",
            "net9": "86:73:e7:7e:03:34"
        },
        "spine_2_1_8": {
            "net0": "06:05:78:e4:0a:cf",
            "net1": "5a:7c:b9:bc:92:74",
            "net10": "a6:92:55:34:22:04",
            "net11": "76:74:01:78:5a:15",
            "net12": "82:70:60:7d:67:93",
            "net13": "e6:13:53:6f:78:17",
            "net14": "c2:f3:60:b8:dd:99",
            "net15": "7a:0e:bd:71:22:10",
            "net16": "ca:18:04:67:fc:ab",
            "net17": "a2:82:e7:8f:57:23",
            "net18": "8a:e0:78:03:fd:3e",
            "net19": "b6:7c:c8:71:d7:b1",
            "net2": "fa:99:72:8a:80:94",
            "net20": "8e:1b:6c:ea:54:7b",
            "net21": "ca:95:73:85:c0:b2",
            "net22": "86:5a:1d:e2:43:b3",
            "net23": "06:00:2f:da:0b:64",
            "net3": "fa:f1:f5:38:1d:1d",
            "net4": "de:7c:d7:56:a1:95",
            "net5": "4a:b0:1b:50:50:43",
            "net6": "96:aa:9b:7a:4f:e9",
            "net7": "0e:33:0a:40:08:86",
            "net8": "7a:50:70:e6:91:4f",
            "net9": "2e:dd:82:c9:25:7b"
        },
        "spine_2_1_9": {
            "net0": "9e:d0:8d:cb:4d:8a",
            "net1": "fe:7c:70:43:c4:1d",
            "net10": "9a:2f:e6:3e:c5:f1",
            "net11": "66:08:71:60:dc:bf",
            "net12": "2e:07:0e:63:37:b6",
            "net13": "8e:ac:7a:80:9d:68",
            "net14": "8e:6b:8e:db:d4:85",
            "net15": "f2:c1:bd:7f:b9:19",
            "net16": "06:7b:bd:58:6b:8b",
            "net17": "9a:cc:27:a3:52:0e",
            "net18": "ba:a7:3e:97:b4:c0",
            "net19": "7e:5a:14:88:64:e3",
            "net2": "d2:cd:63:00:f9:13",
            "net20": "82:a0:98:c6:34:1f",
            "net21": "b6:7d:27:08:b2:37",
            "net22": "2e:da:ca:28:61:fb",
            "net23": "2a:34:70:26:6a:ea",
            "net3": "7e:77:39:08:43:12",
            "net4": "5a:30:b8:19:58:9b",
            "net5": "7e:f4:ac:5e:48:f1",
            "net6": "ce:37:9a:97:9b:c3",
            "net7": "8e:e0:a7:29:4c:62",
            "net8": "4a:dd:61:19:eb:6a",
            "net9": "16:ff:36:ec:19:58"
        },
        "tof_1_2_1": {
            "net0": "9e:1b:15:ba:34:5c",
            "net1": "c2:a3:9c:74:37:00",
            "net10": "56:f4:a0:5d:10:02",
            "net11": "9a:c0:c8:5c:45:ac",
            "net12": "8e:67:4c:fd:78:5a",
            "net13": "56:88:1c:9b:c6:8f",
            "net14": "7a:f7:ea:5e:7b:ba",
            "net15": "e2:95:9c:c7:7e:c7",
            "net16": "26:32:75:8f:cb:4a",
            "net17": "32:f9:4d:64:7a:39",
            "net18": "62:37:1c:c6:d9:a2",
            "net19": "da:88:a2:23:ab:7a",
            "net2": "a2:53:35:f6:7d:05",
            "net20": "6e:36:bf:63:8b:e4",
            "net21": "fe:06:5d:97:0a:4c",
            "net22": "66:56:a3:71:82:96",
            "net23": "b2:76:3c:30:7a:cc",
            "net3": "d2:75:d2:b4:b0:6b",
            "net4": "ae:d0:2c:f2:b8:ed",
            "net5": "a6:c0:7a:63:dd:b9",
            "net6": "76:55:9b:6a:69:e9",
            "net7": "ba:01:93:77:6a:8d",
            "net8": "3a:50:01:16:6c:4f",
            "net9": "96:2b:a2:d9:22:1a"
        },
        "tof_1_2_10": {
            "net0": "5e:21:23:27:0d:3c",
            "net1": "7e:00:5c:de:d5:37",
            "net10": "22:31:98:88:b2:cf",
            "net11": "62:18:5f:22:5d:6e",
            "net12": "1a:b4:aa:4d:16:91",
            "net13": "5e:30:2c:b1:bf:6e",
            "net14": "e6:c6:2c:06:79:d2",
            "net15": "06:e3:fc:3f:37:18",
            "net16": "86:5d:ea:28:e7:15",
            "net17": "7e:4d:8d:58:b0:af",
            "net18": "a2:de:b1:1e:4c:fa",
            "net19": "de:0d:7e:74:5a:95",
            "net2": "32:25:ff:90:3f:92",
            "net20": "ce:b2:98:87:b8:e8",
            "net21": "d2:ac:6a:a3:9c:f4",
            "net22": "b6:5c:35:34:c1:a4",
            "net23": "4e:ba:e1:08:38:9f",
            "net3": "e6:f6:10:95:94:4e",
            "net4": "ea:fe:b0:c7:3f:85",
            "net5": "36:0d:b5:83:b6:03",
            "net6": "5e:43:4f:82:57:56",
            "net7": "ba:6f:fb:25:a1:62",
            "net8": "76:e7:a3:2a:c5:3b",
            "net9": "8e:4d:ae:4d:f2:95"
        },
        "tof_1_2_11": {
            "net0": "4e:7c:4d:d3:cc:e1",
            "net1": "16:f0:16:c6:ec:90",
            "net10": "ca:f4:ac:4d:22:23",
            "net11": "f6:78:ad:21:8d:58",
            "net12": "72:f2:aa:5c:a8:c2",
            "net13": "8e:d2:03:86:e5:d6",
            "net14": "72:94:6c:78:78:a2",
            "net15": "e2:99:08:b6:97:04",
            "net16": "16:02:0b:24:5c:93",
            "net17": "66:d8:9f:42:ab:7a",
            "net18": "4a:67:1e:88:77:bf",
            "net19": "6a:de:66:e3:b5:c2",
            "net2": "36:a3:ef:92:da:8a",
            "net20": "2a:ac:ed:f1:f6:41",
            "net21": "6e:f3:c9:6f:e3:7e",
            "net22": "4e:22:f5:db:07:3a",
            "net23": "82:88:e1:8d:d9:c6",
            "net3": "82:4e:eb:c0:72:43",
            "net4": "ce:f4:d1:36:20:ef",
            "net5": "ca:59:1a:ec:82:12",
            "net6": "92:16:57:83:e8:76",
            "net7": "56:b0:91:f9:63:ff",
            "net8": "0a:ca:41:04:b9:f1",
            "net9": "c6:4c:56:39:26:3c"
        },
        "tof_1_2_12": {
            "net0": "1a:36:8a:f6:79:85",
            "net1": "4a:dc:73:24:ba:0f",
            "net10": "5a:3a:31:03:ed:dd",
            "net11": "5e:9f:ca:2e:a8:88",
            "net12": "d6:fc:63:56:38:38",
            "net13": "82:1d:78:ad:8c:93",
            "net14": "1a:ee:a8:54:63:24",
            "net15": "be:b4:19:c4:e3:4d",
            "net16": "7e:d7:62:d2:f4:a8",
            "net17": "42:23:89:cc:ea:90",
            "net18": "0a:48:dd:de:67:ce",
            "net19": "62:e7:89:30:fe:2a",
            "net2": "22:ae:a9:19:ac:b1",
            "net20": "32:8c:19:0c:13:59",
            "net21": "66:83:e8:38:7c:9f",
            "net22": "aa:57:08:e3:07:31",
            "net23": "ba:7f:f8:b5:46:8b",
            "net3": "6e:b0:18:4d:30:a7",
            "net4": "56:eb:40:7d:b3:d3",
            "net5": "86:43:f8:9b:27:45",
            "net6": "ae:98:46:34:5f:12",
            "net7": "0e:b7:1b:50:f2:fb",
            "net8": "f6:05:69:9a:f6:1a",
            "net9": "2e:32:ca:93:7d:be"
        },
        "tof_1_2_2": {
            "net0": "aa:01:c6:79:f5:48",
            "net1": "2e:5b:91:1c:28:a9",
            "net10": "9a:b5:18:b8:63:bf",
            "net11": "5e:fd:fa:f1:73:e5",
            "net12": "f2:35:a2:34:86:b3",
            "net13": "7e:57:a8:41:53:3b",
            "net14": "b2:01:fb:09:0d:c9",
            "net15": "16:ff:1d:fa:d7:6a",
            "net16": "2a:b7:e1:09:57:64",
            "net17": "0a:e3:23:aa:ce:21",
            "net18": "c6:0d:5e:6e:49:29",
            "net19": "3a:56:47:0d:a1:41",
            "net2": "ce:97:50:b2:34:f6",
            "net20": "92:9e:65:53:56:18",
            "net21": "4a:1b:07:bb:22:70",
            "net22": "96:60:66:d3:e1:da",
            "net23": "f6:0a:32:5c:e1:c2",
            "net3": "06:97:87:e7:74:36",
            "net4": "02:e8:64:95:86:c2",
            "net5": "6a:5f:d4:d4:2a:fc",
            "net6": "6e:62:dd:c4:28:fc",
            "net7": "6e:bf:19:cf:7c:0a",
            "net8": "c6:07:44:67:9d:36",
            "net9": "22:4c:5a:f3:dd:73"
        },
        "tof_1_2_3": {
            "net0": "ca:21:ef:30:73:0b",
            "net1": "56:ab:4c:68:64:ae",
            "net10": "3e:dd:b8:68:85:15",
            "net11": "3e:3d:53:54:bc:ba",
            "net12": "32:47:b1:06:b4:58",
            "net13": "42:5d:ec:eb:01:b7",
            "net14": "56:30:0e:c3:54:b6",
            "net15": "6a:5f:3d:d6:55:e2",
            "net16": "c2:c6:6c:9d:8f:c2",
            "net17": "fe:5b:8c:1c:8a:a2",
            "net18": "12:6f:5b:83:f6:af",
            "net19": "5a:62:72:47:0a:8a",
            "net2": "22:b9:bf:68:17:97",
            "net20": "b2:45:76:73:09:ac",
            "net21": "7a:c5:58:c9:46:a5",
            "net22": "d6:48:de:4f:9a:c2",
            "net23": "4e:f4:18:80:91:7f",
            "net3": "ee:6b:b9:1d:91:83",
            "net4": "f6:1b:fc:db:24:ff",
            "net5": "b6:a0:4d:42:a7:dc",
            "net6": "96:5d:82:fd:1a:da",
            "net7": "32:88:23:c1:ee:66",
            "net8": "16:d1:37:3a:89:ef",
            "net9": "ce:e1:a2:5c:fc:fb"
        },
        "tof_1_2_4": {
            "net0": "ea:f7:20:9e:d7:d4",
            "net1": "e6:66:12:f3:2c:fe",
            "net10": "9a:95:6a:e5:d0:66",
            "net11": "66:ab:9d:bf:3a:be",
            "net12": "86:ce:4f:19:10:fd",
            "net13": "0a:09:6a:81:35:4c",
            "net14": "02:bb:42:b9:56:ce",
            "net15": "6a:61:78:b6:51:f0",
            "net16": "66:3c:6c:76:78:0d",
            "net17": "76:d1:2a:c1:9c:e1",
            "net18": "1e:d3:ed:59:5a:ad",
            "net19": "4a:46:1c:5d:94:6b",
            "net2": "fa:1b:2b:c0:4c:b9",
            "net20": "6e:3a:9d:95:da:22",
            "net21": "e2:f1:a9:dd:1c:56",
            "net22": "06:78:c5:39:6b:9c",
            "net23": "8e:2b:c5:8a:72:1e",
            "net3": "c6:1a:1a:2d:0c:c4",
            "net4": "d6:13:99:ec:05:5a",
            "net5": "ea:44:1b:05:c1:c0",
            "net6": "42:27:6c:f8:53:6c",
            "net7": "ba:64:20:05:59:ae",
            "net8": "8a:5f:dc:34:68:0f",
            "net9": "ba:72:37:97:2e:ec"
        },
        "tof_1_2_5": {
            "net0": "e2:e3:0a:00:c7:b7",
            "net1": "42:a5:d7:c3:7c:72",
            "net10": "32:78:fd:47:81:2b",
            "net11": "26:7e:58:a1:ef:24",
            "net12": "f6:23:9b:9f:fd:96",
            "net13": "ca:42:05:00:aa:38",
            "net14": "9e:46:d9:c3:00:e1",
            "net15": "46:b9:a2:48:cd:e2",
            "net16": "1e:82:73:76:84:e7",
            "net17": "36:52:d1:39:0f:13",
            "net18": "d2:12:87:cd:0c:ed",
            "net19": "36:54:3c:9b:9f:66",
            "net2": "72:a8:61:bb:a1:30",
            "net20": "1a:23:1f:e7:8f:04",
            "net21": "12:2b:b2:11:03:79",
            "net22": "ce:00:16:6a:25:bb",
            "net23": "d6:2f:fc:6f:24:ae",
            "net3": "da:70:8f:b0:20:2a",
            "net4": "5a:3d:10:5f:ac:99",
            "net5": "06:c3:31:86:6e:eb",
            "net6": "fa:88:be:15:d0:b9",
            "net7": "b2:27:a1:4e:ff:89",
            "net8": "0e:78:47:32:ec:dd",
            "net9": "5a:15:31:38:ff:44"
        },
        "tof_1_2_6": {
            "net0": "16:df:75:c7:6a:8c",
            "net1": "f2:3d:32:e9:3c:30",
            "net10": "ea:a5:b3:8c:be:8e",
            "net11": "1e:95:59:21:e3:7e",
            "net12": "56:51:b1:93:51:c9",
            "net13": "92:87:23:ee:67:66",
            "net14": "fe:9c:75:b1:16:01",
            "net15": "8e:c5:21:cb:67:29",
            "net16": "56:54:1e:f1:7e:fd",
            "net17": "9e:8e:27:fa:1c:2f",
            "net18": "6a:ab:03:e6:97:20",
            "net19": "ce:6d:b9:26:0c:b9",
            "net2": "d6:de:b7:cb:52:a4",
            "net20": "ae:5d:d4:94:a1:39",
            "net21": "ca:e8:c0:8c:a7:70",
            "net22": "4e:fc:cc:42:ca:45",
            "net23": "aa:30:49:f7:5f:a6",
            "net3": "4e:34:9c:fb:b2:f6",
            "net4": "1a:00:de:bd:fd:9c",
            "net5": "72:dd:db:81:1a:01",
            "net6": "d6:d9:23:70:3a:0b",
            "net7": "66:cc:1a:7a:97:55",
            "net8": "aa:0f:06:02:0d:4e",
            "net9": "be:9f:0c:3f:c7:b0"
        },
        "tof_1_2_7": {
            "net0": "0e:33:77:ff:84:96",
            "net1": "4a:7d:ba:55:59:be",
            "net10": "86:a9:09:6e:27:e0",
            "net11": "2a:7e:84:82:e0:af",
            "net12": "aa:05:33:91:f4:12",
            "net13": "7e:d4:ae:8c:60:fd",
            "net14": "16:f2:9c:f7:44:bf",
            "net15": "52:cf:8d:10:2c:4a",
            "net16": "82:66:7e:fb:2e:56",
            "net17": "4e:87:36:da:61:23",
            "net18": "ba:8c:c8:68:4e:78",
            "net19": "be:c4:47:de:8a:1e",
            "net2": "4a:a7:c9:e8:1e:31",
            "net20": "ba:5a:dc:b0:d6:cd",
            "net21": "aa:91:07:11:73:50",
            "net22": "16:7e:f7:f3:c6:1e",
            "net23": "0a:3a:53:16:1f:18",
            "net3": "da:5b:ec:f0:80:c6",
            "net4": "fe:e0:2c:12:87:66",
            "net5": "5e:13:11:ae:d1:f5",
            "net6": "4a:db:b5:ec:ac:3a",
            "net7": "c2:aa:06:1d:ca:fe",
            "net8": "d2:03:af:fd:53:8d",
            "net9": "8e:92:3f:f5:69:02"
        },
        "tof_1_2_8": {
            "net0": "ca:df:37:a9:1d:bb",
            "net1": "ce:da:c7:69:53:6c",
            "net10": "16:bf:b9:ae:3c:d8",
            "net11": "d2:9f:8b:f9:00:36",
            "net12": "02:41:ad:4c:2b:47",
            "net13": "f6:86:d5:b8:fb:57",
            "net14": "16:c8:1e:a8:4e:80",
            "net15": "e2:3d:99:b2:63:92",
            "net16": "46:89:d0:61:ca:b6",
            "net17": "8a:47:68:a1:c2:c3",
            "net18": "22:7f:76:a2:3f:b5",
            "net19": "fe:df:83:75:57:ab",
            "net2": "36:80:1e:aa:1e:d0",
            "net20": "9e:8d:6e:7a:a3:4e",
            "net21": "ca:94:01:46:d3:75",
            "net22": "0e:35:75:7b:3e:bc",
            "net23": "52:19:c3:63:4d:2d",
            "net3": "be:ab:ee:c3:0c:6b",
            "net4": "62:2f:41:0e:0c:8f",
            "net5": "f6:31:42:9f:14:20",
            "net6": "72:f3:34:f3:4a:08",
            "net7": "a2:50:54:06:70:df",
            "net8": "0a:d9:dc:bd:b1:56",
            "net9": "12:18:72:0b:ad:75"
        },
        "tof_1_2_9": {
            "net0": "a6:d2:57:05:75:ac",
            "net1": "ca:bf:06:95:24:e4",
            "net10": "f6:74:f5:65:26:c9",
            "net11": "26:0c:92:af:90:5d",
            "net12": "ae:ef:42:e7:cf:71",
            "net13": "62:ab:b4:3e:e6:5d",
            "net14": "fe:fc:8f:b2:07:41",
            "net15": "12:96:18:69:fe:88",
            "net16": "5e:a4:9d:66:25:61",
            "net17": "96:17:ff:45:96:9d",
            "net18": "36:34:29:69:48:a1",
            "net19": "62:45:77:13:9a:92",
            "net2": "aa:e2:6a:bf:77:5c",
            "net20": "3e:87:32:e5:fb:83",
            "net21": "42:c6:39:5d:29:61",
            "net22": "16:a0:55:9f:e5:11",
            "net23": "3a:04:eb:36:1b:37",
            "net3": "12:4c:e6:5a:fd:5b",
            "net4": "92:f5:b9:50:89:2f",
            "net5": "f6:3c:fc:00:23:29",
            "net6": "fa:01:5c:46:a3:49",
            "net7": "82:c6:c0:1f:4e:1c",
            "net8": "92:b2:52:0d:bb:aa",
            "net9": "ba:b2:49:ef:5b:43"
        }
    },
    "failed_machine": "leaf_1_0_1",
    "failure_time": 1616299633.5548272,
    "recover_time": 1616299733.8259392
}