{
    "description": "Scenario 4a: Leaf leaf_1_0_1 failure and recovery with BGP",
    "k_leaf": 6,
    "k_top": 6,
    "redundancy_factor": 3,
    "is_k8s": true,
    "machine_mac_addresses": {
        "leaf_1_0_1": {
            "net0": "66:ce:77:c1:65:6f",
            "net1": "0a:0e:7d:f1:d9:33",
            "net2": "ce:d7:12:da:0a:73",
            "net3": "ce:98:0f:1c:55:90",
            "net4": "ca:9f:9a:af:d2:cc",
            "net5": "42:75:e5:69:81:66",
            "net6": "42:e4:33:39:5c:d6"
        },
        "leaf_1_0_2": {
            "net0": "36:4e:b2:90:7a:28",
            "net1": "26:33:46:e8:83:08",
            "net2": "66:bc:04:a1:f2:02",
            "net3": "6e:9f:56:ee:d7:fe",
            "net4": "be:e8:5f:56:bf:62",
            "net5": "76:fe:35:ef:77:77",
            "net6": "ca:b8:6b:11:e3:40"
        },
        "leaf_1_0_3": {
            "net0": "fe:0e:d0:8b:ff:4e",
            "net1": "8e:03:ae:46:0f:02",
            "net2": "c2:0c:1f:72:f6:54",
            "net3": "86:14:5b:ce:24:3d",
            "net4": "3e:3d:28:73:e5:ab",
            "net5": "62:2a:a4:4e:7d:ba",
            "net6": "46:28:cf:85:1e:3d"
        },
        "leaf_1_0_4": {
            "net0": "2e:7e:2e:a4:1c:00",
            "net1": "ba:b8:1b:67:47:56",
            "net2": "c6:e8:9a:23:54:58",
            "net3": "2e:63:cc:5a:e3:cc",
            "net4": "c6:29:a7:f3:ad:8c",
            "net5": "8e:bd:59:f4:e9:c5",
            "net6": "da:9b:78:b6:96:76"
        },
        "leaf_1_0_5": {
            "net0": "d2:f8:bc:cc:f7:f0",
            "net1": "86:9a:3f:67:c1:bd",
            "net2": "5a:23:8e:61:f7:1c",
            "net3": "7a:21:49:6f:6f:b6",
            "net4": "de:ff:ea:2d:68:d9",
            "net5": "7e:13:15:b4:f1:98",
            "net6": "ea:55:c7:0b:83:b9"
        },
        "leaf_1_0_6": {
            "net0": "f6:7a:26:fc:97:48",
            "net1": "3a:5b:ad:1e:30:1a",
            "net2": "a2:2b:10:19:0a:71",
            "net3": "e6:14:16:09:17:6c",
            "net4": "b6:5f:ba:88:1e:14",
            "net5": "76:e8:7c:e2:ef:92",
            "net6": "ee:fc:b6:76:00:21"
        },
        "leaf_2_0_1": {
            "net0": "c2:73:6c:21:ca:b1",
            "net1": "0a:06:a8:4d:e9:8f",
            "net2": "1e:23:81:55:d7:ed",
            "net3": "5a:30:c4:76:d1:37",
            "net4": "66:d2:20:b4:f1:ba",
            "net5": "36:3b:af:16:17:e0",
            "net6": "fa:9c:e6:0c:7c:23"
        },
        "leaf_2_0_2": {
            "net0": "ee:09:9f:1b:5c:66",
            "net1": "2a:a2:7c:0e:1a:f3",
            "net2": "ca:b2:70:bf:e7:45",
            "net3": "06:0b:59:cf:f1:f4",
            "net4": "fe:66:39:e2:54:ce",
            "net5": "c2:b4:5c:e3:23:3c",
            "net6": "1a:62:26:7d:db:dc"
        },
        "leaf_2_0_3": {
            "net0": "82:76:9b:99:a6:45",
            "net1": "ce:1c:a8:77:a5:76",
            "net2": "62:d6:b2:b5:9f:52",
            "net3": "aa:4a:11:1a:8f:98",
            "net4": "2a:1c:eb:0f:f9:ff",
            "net5": "b6:90:3f:e4:0e:26",
            "net6": "e2:6b:75:fb:08:3f"
        },
        "leaf_2_0_4": {
            "net0": "f2:c9:92:aa:0d:02",
            "net1": "76:a2:a0:e0:f6:76",
            "net2": "32:3e:ab:89:a2:f4",
            "net3": "26:bd:4f:f4:79:32",
            "net4": "de:02:a4:af:71:35",
            "net5": "da:17:24:c3:47:c7",
            "net6": "7e:14:cf:2a:69:63"
        },
        "leaf_2_0_5": {
            "net0": "0e:b4:ab:4e:2e:48",
            "net1": "52:89:11:2a:d6:b1",
            "net2": "86:a6:f2:e0:b1:f3",
            "net3": "6a:d5:e6:c0:92:b4",
            "net4": "a6:44:4e:1f:63:d6",
            "net5": "8a:a7:4c:33:7e:d3",
            "net6": "56:6d:ee:37:8b:58"
        },
        "leaf_2_0_6": {
            "net0": "0a:d7:f5:83:36:60",
            "net1": "1a:61:53:f9:4f:c7",
            "net2": "3e:53:67:3c:98:26",
            "net3": "1e:dc:85:7a:87:9a",
            "net4": "66:4b:8b:33:69:af",
            "net5": "1e:e3:58:ae:47:08",
            "net6": "72:79:c0:c3:d9:d9"
        },
        "leaf_3_0_1": {
            "net0": "86:40:50:2a:fb:fb",
            "net1": "8a:f1:7f:df:95:82",
            "net2": "5a:a8:31:1f:86:aa",
            "net3": "66:28:5f:e3:87:ab",
            "net4": "6a:08:cd:66:36:2f",
            "net5": "4e:03:e9:35:a2:6e",
            "net6": "e2:10:dc:bf:81:09"
        },
        "leaf_3_0_2": {
            "net0": "62:7e:3e:d7:e0:12",
            "net1": "f2:43:45:d1:b2:c8",
            "net2": "fe:46:86:5b:d1:65",
            "net3": "16:74:71:59:07:ba",
            "net4": "8a:13:71:1f:22:1d",
            "net5": "72:18:e8:a3:8b:22",
            "net6": "d2:41:29:c2:e0:56"
        },
        "leaf_3_0_3": {
            "net0": "0a:4a:d5:45:96:dd",
            "net1": "e2:d3:d6:9a:02:f8",
            "net2": "b6:33:17:a2:86:e7",
            "net3": "06:33:af:e9:a2:f4",
            "net4": "b6:ef:14:13:20:19",
            "net5": "2a:8e:65:0f:65:91",
            "net6": "f2:51:0f:52:7f:ae"
        },
        "leaf_3_0_4": {
            "net0": "26:06:2f:70:12:85",
            "net1": "0e:35:be:a4:be:c6",
            "net2": "56:c5:78:d3:34:36",
            "net3": "8e:90:d6:65:ad:da",
            "net4": "1a:6f:f6:5b:0e:94",
            "net5": "4a:3c:1a:76:08:d9",
            "net6": "76:77:17:38:cd:b1"
        },
        "leaf_3_0_5": {
            "net0": "5e:02:7b:d3:10:44",
            "net1": "da:3a:58:a5:6b:5f",
            "net2": "ee:9c:c0:25:43:e5",
            "net3": "f2:d9:87:a3:49:43",
            "net4": "ce:6c:14:f9:cb:da",
            "net5": "7a:a2:c5:e4:1c:a1",
            "net6": "72:6a:6f:f7:4f:41"
        },
        "leaf_3_0_6": {
            "net0": "4e:47:59:6d:4b:7a",
            "net1": "86:c8:e1:5c:b9:e1",
            "net2": "be:94:4d:f2:5a:01",
            "net3": "c6:72:23:25:5c:d4",
            "net4": "fe:49:79:67:3d:1d",
            "net5": "32:e5:e4:a1:15:28",
            "net6": "42:a5:43:d8:14:0b"
        },
        "leaf_4_0_1": {
            "net0": "7e:45:f1:54:ac:f5",
            "net1": "06:4c:df:aa:45:73",
            "net2": "02:b3:48:ef:10:10",
            "net3": "3e:3c:64:d5:46:55",
            "net4": "36:f8:62:f0:20:02",
            "net5": "1e:c0:67:9d:0d:b3",
            "net6": "7a:ad:d1:0f:f6:5e"
        },
        "leaf_4_0_2": {
            "net0": "6a:2f:9a:08:7b:39",
            "net1": "06:b3:64:5e:89:06",
            "net2": "32:db:36:03:bc:9e",
            "net3": "02:d1:e5:16:16:f5",
            "net4": "86:8f:ba:82:4d:6f",
            "net5": "ba:09:a2:bf:aa:8a",
            "net6": "a6:9d:e3:ad:98:c6"
        },
        "leaf_4_0_3": {
            "net0": "0a:50:cf:c5:cd:b6",
            "net1": "de:f5:41:ff:8f:70",
            "net2": "32:e0:7b:44:ea:59",
            "net3": "ae:a8:3e:ec:24:5f",
            "net4": "e6:22:4a:7c:5d:c1",
            "net5": "62:db:da:26:c2:11",
            "net6": "5e:22:30:5a:bb:1a"
        },
        "leaf_4_0_4": {
            "net0": "4e:b6:b4:09:d1:2d",
            "net1": "86:fc:a9:31:82:ff",
            "net2": "b2:bc:19:4a:95:05",
            "net3": "76:e1:c2:44:1f:2e",
            "net4": "f6:30:c9:01:ca:4f",
            "net5": "46:1b:03:6a:65:72",
            "net6": "ee:3e:2f:24:c9:3d"
        },
        "leaf_4_0_5": {
            "net0": "ce:80:0d:38:39:8e",
            "net1": "aa:dc:cf:ef:60:9e",
            "net2": "46:d7:c0:6a:b9:e8",
            "net3": "32:71:8f:95:b1:a6",
            "net4": "ce:b2:8d:75:a6:7d",
            "net5": "1e:33:67:d1:99:e3",
            "net6": "a2:04:0e:15:55:1c"
        },
        "leaf_4_0_6": {
            "net0": "66:1a:6d:4c:67:cb",
            "net1": "f2:a7:5e:fe:30:93",
            "net2": "fe:90:9b:85:b4:31",
            "net3": "d2:d9:03:fb:4a:0d",
            "net4": "b2:85:98:6d:e1:17",
            "net5": "c2:48:c5:de:de:f6",
            "net6": "02:0d:9d:87:b4:b1"
        },
        "spine_1_1_1": {
            "net0": "16:1d:72:5d:95:8d",
            "net1": "7a:0a:62:d6:86:2b",
            "net10": "46:1c:62:84:02:11",
            "net11": "ee:7d:43:d3:c3:cd",
            "net2": "de:49:02:a7:a4:47",
            "net3": "de:19:0c:56:87:21",
            "net4": "86:4c:81:1f:d4:59",
            "net5": "4a:00:de:6a:2b:73",
            "net6": "ce:4c:b9:45:6b:ae",
            "net7": "f2:d2:47:82:0a:cf",
            "net8": "3a:72:73:b1:25:89",
            "net9": "de:4d:bd:e5:f0:4b"
        },
        "spine_1_1_2": {
            "net0": "5e:49:26:c1:f5:6b",
            "net1": "2e:af:2a:38:8d:c2",
            "net10": "a2:fe:ea:5d:75:b1",
            "net11": "f2:6a:e0:4d:6e:2f",
            "net2": "ba:93:eb:cd:67:98",
            "net3": "f6:c2:18:ae:6e:27",
            "net4": "0a:d4:2e:91:96:c3",
            "net5": "6e:97:15:17:a0:59",
            "net6": "ee:15:eb:40:7d:f2",
            "net7": "ea:1d:f2:b1:38:57",
            "net8": "de:ad:bd:4b:2d:78",
            "net9": "c2:fb:15:4f:c2:fd"
        },
        "spine_1_1_3": {
            "net0": "ea:8b:f7:6b:4b:7d",
            "net1": "2e:27:6c:37:03:80",
            "net10": "0e:3a:27:44:94:53",
            "net11": "b6:33:f3:2e:8f:88",
            "net2": "02:52:33:7a:b8:89",
            "net3": "4e:c9:8a:81:6f:71",
            "net4": "76:af:03:04:24:53",
            "net5": "a6:25:84:e3:4b:ed",
            "net6": "4a:26:a6:4d:53:3f",
            "net7": "36:6e:3c:4a:6b:cc",
            "net8": "b6:1d:e6:f2:6b:89",
            "net9": "06:f4:66:75:b4:96"
        },
        "spine_1_1_4": {
            "net0": "c2:b3:a1:9a:43:2e",
            "net1": "f2:e0:c0:7c:6e:9d",
            "net10": "be:50:e5:cb:65:f4",
            "net11": "e6:2e:96:91:5c:1d",
            "net2": "26:8c:25:86:09:d4",
            "net3": "66:2f:79:f2:e7:34",
            "net4": "7e:5b:e7:57:fe:8a",
            "net5": "da:16:5e:e7:f7:45",
            "net6": "b2:fd:b4:1e:c2:6f",
            "net7": "52:2b:f6:53:d6:d8",
            "net8": "1a:a3:09:7d:12:06",
            "net9": "12:ca:58:8d:b2:ff"
        },
        "spine_1_1_5": {
            "net0": "f2:4d:56:fa:84:8a",
            "net1": "06:30:0e:c1:58:52",
            "net10": "2e:da:c5:92:05:38",
            "net11": "9a:c3:66:f9:a8:6f",
            "net2": "2a:4d:16:36:e7:1f",
            "net3": "96:c8:99:9f:77:4a",
            "net4": "92:de:99:78:96:3c",
            "net5": "26:e8:f9:ba:2e:f8",
            "net6": "ce:8f:c1:e3:47:74",
            "net7": "3a:1e:8b:31:22:a2",
            "net8": "2a:00:ce:20:a0:b5",
            "net9": "e6:8f:45:4a:c6:05"
        },
        "spine_1_1_6": {
            "net0": "2a:39:fc:c1:12:60",
            "net1": "6a:97:9f:30:2f:a1",
            "net10": "02:0e:1e:25:4c:2c",
            "net11": "f6:dc:11:be:05:af",
            "net2": "9a:0f:26:6c:61:18",
            "net3": "92:26:90:93:c3:57",
            "net4": "16:70:12:fd:ea:42",
            "net5": "e6:85:c9:2d:1a:a9",
            "net6": "9e:67:ec:62:b4:85",
            "net7": "ba:35:08:1b:c3:69",
            "net8": "02:de:de:bd:81:91",
            "net9": "ba:ed:72:9d:87:b6"
        },
        "spine_2_1_1": {
            "net0": "66:08:c5:dd:82:77",
            "net1": "fa:51:48:fb:f0:c7",
            "net10": "3a:52:90:ea:81:a9",
            "net11": "9e:ff:cc:7c:91:8d",
            "net2": "c2:ba:4a:65:8c:a4",
            "net3": "c6:ca:d2:3d:e3:d1",
            "net4": "96:14:35:a7:e4:15",
            "net5": "1e:0b:5c:c9:7b:18",
            "net6": "66:91:5c:52:1c:de",
            "net7": "86:84:f6:23:2b:af",
            "net8": "ee:9c:95:f0:5c:d4",
            "net9": "42:15:3d:3c:f9:2f"
        },
        "spine_2_1_2": {
            "net0": "8a:c1:5a:a6:8f:99",
            "net1": "e2:4e:d7:71:db:d4",
            "net10": "96:87:85:0d:13:a0",
            "net11": "0a:4b:a1:2f:ed:b9",
            "net2": "ee:0b:16:32:14:dc",
            "net3": "1a:51:93:e7:72:55",
            "net4": "5a:5d:fe:b9:b2:58",
            "net5": "be:da:b0:e0:33:8b",
            "net6": "86:e2:ef:df:11:f1",
            "net7": "ea:28:c6:63:74:d5",
            "net8": "96:41:b0:d1:a3:2b",
            "net9": "e6:c4:62:b2:14:22"
        },
        "spine_2_1_3": {
            "net0": "da:6e:3f:3f:69:ec",
            "net1": "22:35:de:a0:1d:45",
            "net10": "46:2b:bb:5a:1f:4c",
            "net11": "a2:b7:2c:ba:4a:61",
            "net2": "ae:60:04:97:47:25",
            "net3": "16:16:82:3a:ac:72",
            "net4": "5a:d6:20:f1:56:4a",
            "net5": "f6:8f:e7:56:c6:15",
            "net6": "22:3f:53:a8:57:13",
            "net7": "32:79:bb:cc:15:30",
            "net8": "42:3b:e3:89:a5:93",
            "net9": "96:e6:7d:34:55:e5"
        },
        "spine_2_1_4": {
            "net0": "9e:b8:8b:2c:ec:40",
            "net1": "7a:54:5d:1c:a5:81",
            "net10": "2a:70:6a:13:b7:c2",
            "net11": "ea:97:7c:16:9d:25",
            "net2": "46:35:0f:12:3e:0d",
            "net3": "46:56:25:f0:a1:2a",
            "net4": "c6:b2:46:3a:36:29",
            "net5": "a2:30:99:e1:00:65",
            "net6": "2a:1e:f8:d9:bc:7f",
            "net7": "52:f7:77:05:a1:59",
            "net8": "b2:bc:c0:61:b9:06",
            "net9": "1e:6e:1f:21:d9:84"
        },
        "spine_2_1_5": {
            "net0": "26:44:ac:c8:87:0a",
            "net1": "8a:e0:d8:59:f1:89",
            "net10": "6e:76:54:96:38:4c",
            "net11": "36:13:01:c4:2f:ad",
            "net2": "8e:ee:95:b0:b4:e0",
            "net3": "da:c3:6a:60:89:c4",
            "net4": "aa:7d:53:3d:08:ae",
            "net5": "6e:e9:3f:e7:b9:f1",
            "net6": "fa:70:79:60:e3:52",
            "net7": "a2:0a:5c:ed:18:33",
            "net8": "f6:15:36:13:ac:ba",
            "net9": "4e:4a:8f:6b:43:ba"
        },
        "spine_2_1_6": {
            "net0": "e6:bc:8a:af:a7:ef",
            "net1": "b2:ce:c0:c7:32:be",
            "net10": "d6:dc:ef:cd:ad:b9",
            "net11": "02:8b:38:08:4d:93",
            "net2": "8a:16:1d:6b:c6:1d",
            "net3": "fa:fe:73:35:48:0b",
            "net4": "7e:e4:6c:83:bb:35",
            "net5": "fa:1d:34:49:cc:02",
            "net6": "12:81:35:be:8d:64",
            "net7": "8a:43:94:6f:9e:1e",
            "net8": "62:15:4c:c3:4c:84",
            "net9": "8a:02:f8:81:3e:b4"
        },
        "spine_3_1_1": {
            "net0": "ee:77:44:52:4b:b8",
            "net1": "4a:8e:38:c9:78:4e",
            "net10": "fe:93:0b:33:f5:6a",
            "net11": "32:83:30:b5:1e:3f",
            "net2": "66:8b:69:a7:ee:83",
            "net3": "2a:c5:88:a9:a8:7b",
            "net4": "d2:89:14:f0:d3:9a",
            "net5": "b2:9c:52:af:5b:f9",
            "net6": "0a:7b:6d:4a:d8:ab",
            "net7": "2e:27:16:a6:f6:dd",
            "net8": "72:6c:fa:f2:19:df",
            "net9": "22:3c:2a:65:16:0f"
        },
        "spine_3_1_2": {
            "net0": "02:b3:83:4b:2a:09",
            "net1": "fe:bb:75:80:47:f8",
            "net10": "c2:40:b1:6d:f0:46",
            "net11": "ba:93:5c:f4:40:4f",
            "net2": "12:ba:14:87:c8:3f",
            "net3": "6a:bb:df:85:44:9f",
            "net4": "fe:76:6d:93:dd:36",
            "net5": "9e:cb:29:26:f7:09",
            "net6": "06:98:c4:64:17:aa",
            "net7": "ce:46:44:c3:82:6f",
            "net8": "1a:16:7c:df:97:94",
            "net9": "4a:87:e9:5c:dc:3d"
        },
        "spine_3_1_3": {
            "net0": "26:d5:89:cb:82:ca",
            "net1": "3a:c0:74:70:2c:0e",
            "net10": "6e:f7:29:8a:dc:1f",
            "net11": "ca:dc:ad:95:48:b7",
            "net2": "4e:c4:de:6b:8f:8d",
            "net3": "96:d4:ce:fd:33:03",
            "net4": "76:63:bf:eb:92:ae",
            "net5": "be:28:68:18:e0:0b",
            "net6": "0a:bd:82:eb:17:33",
            "net7": "be:84:88:a6:95:0a",
            "net8": "f6:52:be:99:0b:a0",
            "net9": "22:e3:ab:2c:21:2b"
        },
        "spine_3_1_4": {
            "net0": "5a:e3:17:0c:b0:68",
            "net1": "6a:d8:87:52:a6:70",
            "net10": "9e:9e:b1:d5:8c:12",
            "net11": "b6:7f:fd:07:b2:c5",
            "net2": "6a:2f:50:13:b0:db",
            "net3": "72:af:cb:a7:87:71",
            "net4": "ea:fa:0f:7b:d1:a9",
            "net5": "ee:5d:b7:fa:3e:f6",
            "net6": "0e:97:20:e3:4c:71",
            "net7": "0e:47:13:f6:a5:30",
            "net8": "1a:26:20:ec:54:6f",
            "net9": "1a:0f:45:78:a5:b2"
        },
        "spine_3_1_5": {
            "net0": "26:69:ff:f0:a4:25",
            "net1": "76:f8:ea:5a:13:bc",
            "net10": "e2:55:a4:c3:1f:4a",
            "net11": "52:cb:97:fa:88:79",
            "net2": "3a:94:77:65:d6:86",
            "net3": "fa:cd:65:97:ae:7c",
            "net4": "0e:59:3d:30:70:d8",
            "net5": "3a:54:c6:18:9d:46",
            "net6": "06:4c:7d:11:4f:52",
            "net7": "86:ed:bc:f0:65:c1",
            "net8": "62:55:0b:4c:9e:e4",
            "net9": "32:04:20:e4:7a:ab"
        },
        "spine_3_1_6": {
            "net0": "22:8d:4a:f3:76:84",
            "net1": "4e:ab:51:1a:b9:24",
            "net10": "2a:5a:6e:cb:dc:52",
            "net11": "92:36:14:46:9d:66",
            "net2": "52:e1:67:1b:db:ce",
            "net3": "86:24:4a:c9:c1:5d",
            "net4": "6a:6a:bf:f6:5a:44",
            "net5": "26:72:a4:76:f0:75",
            "net6": "82:c8:55:10:77:9b",
            "net7": "92:13:96:42:e6:aa",
            "net8": "3e:f9:00:ad:eb:12",
            "net9": "96:a5:df:99:bc:63"
        },
        "spine_4_1_1": {
            "net0": "b2:03:cc:7c:38:ea",
            "net1": "c2:90:db:9e:93:9a",
            "net10": "9e:02:3a:37:ae:05",
            "net11": "4e:58:38:a8:de:c2",
            "net2": "62:c1:9f:5b:9d:3a",
            "net3": "7a:84:5a:78:b2:ff",
            "net4": "22:90:5a:81:18:8c",
            "net5": "e2:22:0a:90:8e:b6",
            "net6": "3a:5e:58:38:dc:0c",
            "net7": "d6:bd:08:d6:4b:27",
            "net8": "3e:96:d4:43:f9:59",
            "net9": "42:da:9e:68:52:41"
        },
        "spine_4_1_2": {
            "net0": "26:f8:15:f0:16:0b",
            "net1": "be:99:a1:88:4a:99",
            "net10": "fe:5e:87:f5:b6:b8",
            "net11": "aa:09:a3:ac:92:e6",
            "net2": "da:13:dd:66:23:4b",
            "net3": "62:f3:eb:9b:08:9c",
            "net4": "96:30:70:1d:1d:62",
            "net5": "16:91:ae:33:98:3c",
            "net6": "c6:99:59:e6:1e:41",
            "net7": "0e:5a:b1:f4:83:e3",
            "net8": "b2:f4:aa:34:67:c8",
            "net9": "ba:35:09:2d:8e:50"
        },
        "spine_4_1_3": {
            "net0": "9a:e8:79:9e:72:aa",
            "net1": "be:15:13:c0:5a:5a",
            "net10": "b2:ba:cf:c5:67:d1",
            "net11": "6e:11:f4:88:2c:35",
            "net2": "5a:68:78:49:df:64",
            "net3": "fe:bf:49:66:db:e7",
            "net4": "b6:37:ee:0a:14:b0",
            "net5": "fe:15:6e:35:7d:8a",
            "net6": "ca:41:39:f2:d2:f2",
            "net7": "62:a5:46:0b:58:2d",
            "net8": "e6:0d:c7:43:fc:0f",
            "net9": "de:c6:20:af:b2:64"
        },
        "spine_4_1_4": {
            "net0": "82:db:d5:45:82:44",
            "net1": "22:ec:9c:88:a2:c0",
            "net10": "ba:d0:51:1f:30:05",
            "net11": "6e:03:df:13:52:e1",
            "net2": "7e:00:45:39:93:4a",
            "net3": "ce:18:e0:e2:3c:06",
            "net4": "9a:11:b2:23:cb:82",
            "net5": "f2:c9:4e:70:a8:03",
            "net6": "2a:ce:03:4a:2f:c7",
            "net7": "5a:ae:2b:40:ec:8b",
            "net8": "a6:a9:b4:37:dd:af",
            "net9": "d6:c5:8e:d0:19:6f"
        },
        "spine_4_1_5": {
            "net0": "56:52:08:96:bb:2f",
            "net1": "7e:67:f1:26:13:90",
            "net10": "9e:08:68:68:4b:a7",
            "net11": "1e:2c:e4:73:2e:37",
            "net2": "c2:1c:06:35:d7:be",
            "net3": "32:6d:66:e7:09:3d",
            "net4": "da:78:eb:ac:93:e4",
            "net5": "9e:3d:9b:32:56:8a",
            "net6": "b6:ea:96:5c:bd:81",
            "net7": "3e:4c:dc:4d:34:57",
            "net8": "0e:e9:e0:de:34:c7",
            "net9": "9a:7c:8c:e5:2f:4f"
        },
        "spine_4_1_6": {
            "net0": "1e:4b:d7:7a:0b:db",
            "net1": "f2:c7:70:df:79:04",
            "net10": "f6:84:28:06:96:7a",
            "net11": "f6:ba:80:7d:1b:49",
            "net2": "5e:c7:eb:c8:ab:fe",
            "net3": "12:90:9f:a8:30:9a",
            "net4": "7e:4a:0c:88:20:5d",
            "net5": "ce:f3:7b:5e:09:5b",
            "net6": "26:2a:2d:93:3d:b8",
            "net7": "56:27:32:20:b6:2e",
            "net8": "9a:0b:95:78:11:71",
            "net9": "2e:08:52:26:8c:6d"
        },
        "tof_1_2_1": {
            "net0": "46:a0:67:6f:9f:9f",
            "net1": "ea:6c:99:af:1a:98",
            "net10": "8a:5f:39:ef:24:e5",
            "net11": "da:8e:63:95:07:f7",
            "net2": "22:b0:4f:22:8b:f0",
            "net3": "22:a7:10:7f:35:84",
            "net4": "92:c7:38:bb:47:44",
            "net5": "ea:1b:c8:9d:17:8e",
            "net6": "52:6f:f8:8d:8a:22",
            "net7": "fa:14:5f:f6:91:56",
            "net8": "42:56:55:2b:80:b3",
            "net9": "9a:86:e4:cf:c1:0e"
        },
        "tof_1_2_2": {
            "net0": "7a:9b:1b:f5:fe:1f",
            "net1": "8a:c3:88:5b:6c:60",
            "net10": "d6:7f:58:44:58:6c",
            "net11": "fa:92:f6:70:1b:de",
            "net2": "ca:9b:cd:be:4b:7b",
            "net3": "16:a0:39:ef:68:c9",
            "net4": "ae:a7:ba:85:2f:d7",
            "net5": "7e:94:ca:7d:78:a1",
            "net6": "e6:d4:0b:4b:ad:39",
            "net7": "ee:5d:d1:e9:80:d2",
            "net8": "72:bb:e8:5b:86:e5",
            "net9": "46:f7:e1:6d:11:38"
        },
        "tof_1_2_3": {
            "net0": "a6:d9:f9:e0:76:d7",
            "net1": "c2:52:b7:c3:5f:20",
            "net10": "8e:66:67:4a:ce:86",
            "net11": "1e:47:f5:b2:75:72",
            "net2": "fa:75:75:c0:44:b9",
            "net3": "fe:c9:74:98:37:2f",
            "net4": "6a:74:4f:78:64:b7",
            "net5": "fa:dd:b0:87:4a:fb",
            "net6": "82:68:0d:f8:cd:31",
            "net7": "de:df:9b:02:31:03",
            "net8": "46:a8:57:3c:a3:f7",
            "net9": "ee:95:2c:b0:3a:89"
        },
        "tof_1_2_4": {
            "net0": "b2:4b:d0:f9:54:df",
            "net1": "86:76:e3:68:9f:59",
            "net10": "ee:63:07:8e:80:68",
            "net11": "a6:65:46:42:9a:4c",
            "net2": "1e:2c:17:f8:ec:1c",
            "net3": "de:a7:f8:b8:6e:9c",
            "net4": "12:e6:11:fc:6f:62",
            "net5": "2a:f2:78:66:ed:b8",
            "net6": "1a:ef:90:1a:6d:be",
            "net7": "ee:42:4a:b0:4b:7f",
            "net8": "4e:65:18:34:a5:6e",
            "net9": "6e:08:15:de:0f:18"
        },
        "tof_1_2_5": {
            "net0": "3a:f3:90:d0:6d:38",
            "net1": "ae:24:a4:cf:59:56",
            "net10": "42:4c:99:d5:8b:9d",
            "net11": "32:1e:25:19:93:bc",
            "net2": "de:f8:d0:5d:fb:aa",
            "net3": "3a:a4:b5:57:e8:58",
            "net4": "c2:52:bc:2c:6f:c6",
            "net5": "6e:86:0d:47:c7:45",
            "net6": "ee:25:20:f4:05:90",
            "net7": "be:ce:64:a4:4d:7d",
            "net8": "26:28:9f:2b:44:e7",
            "net9": "5a:b4:06:16:1d:77"
        },
        "tof_1_2_6": {
            "net0": "5e:d8:80:df:3e:75",
            "net1": "aa:b9:e7:3d:5b:76",
            "net10": "7a:3f:f1:d6:fe:17",
            "net11": "3a:bf:b4:f6:62:5e",
            "net2": "6a:56:66:16:c7:b8",
            "net3": "2a:30:9f:84:0e:c7",
            "net4": "b2:56:ad:c1:58:97",
            "net5": "3a:9f:57:31:66:af",
            "net6": "0e:d7:4b:4f:3c:c6",
            "net7": "1a:7b:1f:00:0f:d5",
            "net8": "ea:10:39:cf:67:27",
            "net9": "42:cd:f2:fe:76:d6"
        },
        "tof_2_2_1": {
            "net0": "46:76:e9:56:1a:b2",
            "net1": "a6:60:33:e4:e4:d1",
            "net10": "a6:a6:5f:77:01:b8",
            "net11": "12:bc:cd:70:e5:ed",
            "net2": "62:d7:82:6c:af:6b",
            "net3": "a2:c4:93:43:dd:5d",
            "net4": "d6:75:5d:9c:d9:bf",
            "net5": "62:07:a0:fd:98:20",
            "net6": "2a:28:d8:ba:c7:8f",
            "net7": "46:1d:af:3d:f0:a7",
            "net8": "da:72:ec:35:a4:28",
            "net9": "4e:44:15:7a:20:99"
        },
        "tof_2_2_2": {
            "net0": "f6:b4:16:a1:a1:8c",
            "net1": "22:e7:2b:34:96:0d",
            "net10": "62:ed:2f:d7:cc:d2",
            "net11": "9a:14:7f:6e:3e:02",
            "net2": "52:fd:14:69:4b:31",
            "net3": "66:56:13:83:38:bd",
            "net4": "c2:48:4b:f1:a4:63",
            "net5": "42:c4:77:51:70:c6",
            "net6": "da:24:65:fd:10:15",
            "net7": "7a:93:76:be:00:a6",
            "net8": "32:97:4c:68:9d:31",
            "net9": "26:f9:d5:20:f2:35"
        },
        "tof_2_2_3": {
            "net0": "ea:bf:a7:a0:37:1c",
            "net1": "46:cd:33:a4:8b:02",
            "net10": "2a:1b:ab:d9:1e:53",
            "net11": "fe:65:77:02:6d:ec",
            "net2": "66:4d:3b:66:82:19",
            "net3": "7a:f0:d1:9c:43:50",
            "net4": "22:6c:21:65:80:4b",
            "net5": "02:40:44:e2:47:2c",
            "net6": "da:1b:92:d5:eb:b4",
            "net7": "d2:7e:5d:71:0a:e8",
            "net8": "fa:d4:31:6d:aa:36",
            "net9": "7e:d8:e1:6f:4a:bc"
        },
        "tof_2_2_4": {
            "net0": "22:5b:a7:1c:c5:2f",
            "net1": "f6:11:53:73:ad:fd",
            "net10": "aa:88:2a:7a:0b:00",
            "net11": "1e:fe:7b:19:c3:0c",
            "net2": "ea:8e:a7:f6:a4:3f",
            "net3": "16:c5:8a:c4:6f:54",
            "net4": "e2:d4:3a:b6:03:8f",
            "net5": "36:08:fd:86:79:4a",
            "net6": "4e:65:c3:1a:c8:4c",
            "net7": "52:51:58:7f:6d:62",
            "net8": "22:55:36:32:bb:58",
            "net9": "c2:e9:4b:3d:15:ef"
        },
        "tof_2_2_5": {
            "net0": "e6:ed:68:6f:46:d4",
            "net1": "4a:1f:3a:5a:99:5f",
            "net10": "7e:f2:98:00:1b:95",
            "net11": "a2:f5:1c:3c:ee:73",
            "net2": "22:71:32:1e:6d:01",
            "net3": "e6:f6:f4:af:a6:ef",
            "net4": "de:4b:21:5a:89:57",
            "net5": "22:58:e2:1a:35:cd",
            "net6": "62:e5:47:cf:c8:1e",
            "net7": "a2:e5:55:79:49:70",
            "net8": "0e:e0:a9:10:90:f9",
            "net9": "ce:43:d9:0c:bc:2e"
        },
        "tof_2_2_6": {
            "net0": "52:ec:44:bb:cf:94",
            "net1": "da:ad:a7:c1:37:1d",
            "net10": "e6:1f:16:b7:58:28",
            "net11": "96:7c:27:bc:75:43",
            "net2": "62:ba:b9:ac:de:c3",
            "net3": "3a:0b:c2:e4:a5:28",
            "net4": "da:1d:7c:dd:77:3f",
            "net5": "42:f6:89:00:31:ce",
            "net6": "fa:d0:8f:a0:30:b1",
            "net7": "0e:0d:20:5c:e2:f5",
            "net8": "92:75:67:13:12:08",
            "net9": "92:dd:22:9c:c2:3d"
        }
    },
    "failed_machine": "leaf_1_0_1",
    "failure_time": 1616291913.3920052,
    "recover_time": 1616291995.5560136
}