{
    "k_leaf": 2,
    "k_top": 2,
    "redundancy_factor": 1,
    "is_k8s": true,
    "machine_mac_addresses": {
        "leaf_1_0_1": {
            "net0": "72:97:19:f2:d7:be",
            "net1": "0a:fb:8e:f0:e2:f8",
            "net2": "ca:c4:99:52:95:46"
        },
        "leaf_1_0_2": {
            "net0": "4e:7e:07:bd:84:d3",
            "net1": "fa:fd:8b:55:72:cc",
            "net2": "2a:92:08:f1:1f:8c"
        },
        "leaf_2_0_1": {
            "net0": "ba:e3:fa:a2:56:f3",
            "net1": "06:ef:7b:e8:5a:a4",
            "net2": "36:2a:3e:0a:6c:3d"
        },
        "leaf_2_0_2": {
            "net0": "e2:a2:a2:cb:a8:2f",
            "net1": "ea:ab:e3:74:f7:56",
            "net2": "d2:7a:c1:83:9d:1a"
        },
        "leaf_3_0_1": {
            "net0": "1e:5b:05:bb:1c:c6",
            "net1": "e6:73:d3:3a:2e:8c",
            "net2": "4e:e3:2f:44:b2:45"
        },
        "leaf_3_0_2": {
            "net0": "72:14:04:6f:e6:99",
            "net1": "3e:55:02:48:81:dc",
            "net2": "92:ea:50:7a:1f:77"
        },
        "leaf_4_0_1": {
            "net0": "ba:68:10:13:d4:b0",
            "net1": "ce:d8:c6:35:8a:98",
            "net2": "f6:d1:eb:3d:94:8c"
        },
        "leaf_4_0_2": {
            "net0": "86:13:c4:43:67:02",
            "net1": "32:32:74:10:1f:47",
            "net2": "fe:42:c2:7f:cf:2d"
        },
        "spine_1_1_1": {
            "net0": "ea:64:50:55:bd:a2",
            "net1": "5a:c3:75:40:d5:c7",
            "net2": "82:6f:bd:8d:2f:fb",
            "net3": "ea:aa:23:df:7d:21"
        },
        "spine_1_1_2": {
            "net0": "5a:cf:45:51:79:35",
            "net1": "22:37:88:f7:3e:3a",
            "net2": "06:c4:25:c1:8d:ff",
            "net3": "c6:96:b9:6b:d7:62"
        },
        "spine_2_1_1": {
            "net0": "be:9a:bb:d2:f7:0a",
            "net1": "76:b6:71:e7:32:63",
            "net2": "0e:24:93:5c:0d:fc",
            "net3": "ea:e5:11:2d:3f:0b"
        },
        "spine_2_1_2": {
            "net0": "8e:f2:30:3b:e3:31",
            "net1": "46:29:48:6e:90:b9",
            "net2": "f6:fb:06:2a:5f:e5",
            "net3": "ee:5a:34:0f:a0:57"
        },
        "spine_3_1_1": {
            "net0": "8e:a4:f5:f5:fc:24",
            "net1": "d2:ed:8c:c7:07:39",
            "net2": "3a:f9:01:80:c4:53",
            "net3": "de:96:8a:b2:dd:7a"
        },
        "spine_3_1_2": {
            "net0": "6e:36:ee:d9:72:50",
            "net1": "12:2b:a8:2f:a4:59",
            "net2": "52:b7:a4:66:35:35",
            "net3": "ce:ce:16:2e:36:0c"
        },
        "spine_4_1_1": {
            "net0": "2e:00:53:39:96:ba",
            "net1": "9e:04:ab:dc:3d:0d",
            "net2": "9e:f6:1b:2c:ab:ca",
            "net3": "c6:c6:21:87:4f:ab"
        },
        "spine_4_1_2": {
            "net0": "36:07:4a:2f:44:8c",
            "net1": "7a:db:a8:10:64:85",
            "net2": "7a:5a:ae:b9:c1:95",
            "net3": "5e:66:60:5a:8f:53"
        },
        "tof_1_2_1": {
            "net0": "ea:0b:57:68:9e:b4",
            "net1": "16:01:7e:44:d3:ec",
            "net2": "3a:f8:9c:11:98:01",
            "net3": "1a:25:53:6c:76:2a"
        },
        "tof_1_2_2": {
            "net0": "36:32:9f:32:e2:82",
            "net1": "0e:ea:86:f1:2a:5a",
            "net2": "e6:1c:06:02:8a:87",
            "net3": "de:b9:14:10:72:13"
        },
        "tof_2_2_1": {
            "net0": "5e:f5:4e:8a:aa:0d",
            "net1": "f6:c5:b8:eb:9d:a2",
            "net2": "46:61:89:a0:34:a9",
            "net3": "6a:a4:d4:f4:49:c0"
        },
        "tof_2_2_2": {
            "net0": "3a:24:7c:37:e5:02",
            "net1": "82:84:cb:e5:2a:ea",
            "net2": "ca:ca:25:aa:0a:6d",
            "net3": "82:d7:83:69:92:7b"
        }
    },
    "failed_machine": "leaf_1_0_1",
    "failure_time": {
        "leaf_1_0_1": 1621332171.7861676,
        "leaf_1_0_2": 1621332171.7985594,
        "leaf_2_0_1": 1621332171.7901442,
        "leaf_2_0_2": 1621332171.8070617,
        "leaf_3_0_1": 1621332171.7891445,
        "leaf_3_0_2": 1621332171.8068678,
        "leaf_4_0_1": 1621332171.7870665,
        "leaf_4_0_2": 1621332171.8081868,
        "spine_1_1_1": 1621332171.8114586,
        "spine_1_1_2": 1621332171.829422,
        "spine_2_1_1": 1621332171.8215215,
        "spine_2_1_2": 1621332171.8311858,
        "spine_3_1_1": 1621332171.8278117,
        "spine_3_1_2": 1621332171.8468604,
        "spine_4_1_1": 1621332171.8296633,
        "spine_4_1_2": 1621332171.8478835,
        "tof_1_2_1": 1621332171.8471787,
        "tof_1_2_2": 1621332171.8665524,
        "tof_2_2_1": 1621332171.8507493,
        "tof_2_2_2": 1621332171.8670127
    }
}