{
    "description": "Scenario 5b: net12 link failure of spine_1_1_1 with BGP",
    "k_leaf": 12,
    "k_top": 12,
    "redundancy_factor": 12,
    "is_k8s": true,
    "machine_mac_addresses": {
        "leaf_1_0_1": {
            "net0": "22:70:f9:80:05:3f",
            "net1": "1e:67:b6:97:56:1f",
            "net10": "3e:bc:24:1c:ef:17",
            "net11": "1a:fc:e8:5e:89:d1",
            "net12": "32:bf:87:40:15:81",
            "net2": "da:2a:16:a4:f5:85",
            "net3": "3a:a9:ea:61:54:e2",
            "net4": "2e:fc:3d:3c:34:dd",
            "net5": "8e:af:a8:84:9a:65",
            "net6": "92:c6:ab:4b:74:97",
            "net7": "26:96:f6:c4:85:6f",
            "net8": "5e:59:09:7f:36:33",
            "net9": "c2:8e:ff:14:7f:63"
        },
        "leaf_1_0_10": {
            "net0": "76:62:33:c8:db:9c",
            "net1": "8e:f7:08:1b:0b:a2",
            "net10": "96:56:40:94:32:2e",
            "net11": "9e:70:26:02:af:13",
            "net12": "7e:bc:e3:03:b4:97",
            "net2": "22:d7:bd:17:9b:8e",
            "net3": "42:ed:54:7b:55:51",
            "net4": "76:d4:ec:14:5a:39",
            "net5": "de:19:e8:e7:12:e6",
            "net6": "ee:33:0f:49:af:dd",
            "net7": "ba:47:b5:9b:b8:33",
            "net8": "ea:5c:60:18:fe:fa",
            "net9": "0a:43:7a:f2:0c:50"
        },
        "leaf_1_0_11": {
            "net0": "22:a9:c6:29:9f:8b",
            "net1": "5e:0d:0c:d5:0d:9c",
            "net10": "ae:04:c2:ee:cc:4f",
            "net11": "56:57:09:00:57:48",
            "net12": "c2:01:5f:41:dd:42",
            "net2": "b6:75:84:33:68:22",
            "net3": "ee:00:f6:4f:34:16",
            "net4": "0e:c7:e7:dc:1f:a4",
            "net5": "96:f7:74:2a:12:5c",
            "net6": "f2:9f:8c:f3:2e:7c",
            "net7": "86:7b:e1:8f:b9:4d",
            "net8": "56:46:81:cc:8d:5f",
            "net9": "ce:f2:1f:f7:9f:1f"
        },
        "leaf_1_0_12": {
            "net0": "6a:e8:2c:39:ea:78",
            "net1": "ca:b3:e3:39:c3:58",
            "net10": "9a:54:55:46:b7:38",
            "net11": "36:22:6f:4a:48:68",
            "net12": "5a:ee:7c:60:35:94",
            "net2": "3e:3f:e1:43:54:10",
            "net3": "aa:a3:93:6b:c5:d4",
            "net4": "ba:cd:98:06:6e:fb",
            "net5": "06:81:cd:e5:2c:b5",
            "net6": "ce:e3:65:4f:21:28",
            "net7": "e2:35:53:c1:89:df",
            "net8": "a2:a4:17:44:c1:9d",
            "net9": "22:4a:ab:1d:bb:8a"
        },
        "leaf_1_0_2": {
            "net0": "52:e3:2e:a8:85:6d",
            "net1": "0e:16:55:bf:9f:37",
            "net10": "f2:6c:ac:a7:0f:83",
            "net11": "86:af:a8:60:9f:56",
            "net12": "56:a2:58:c3:c5:dc",
            "net2": "46:6b:13:17:11:20",
            "net3": "3a:fc:6f:5a:ec:14",
            "net4": "8e:e4:45:14:73:83",
            "net5": "6a:e5:21:39:97:64",
            "net6": "a2:61:ed:a5:a7:d3",
            "net7": "5e:ac:cb:16:5f:a6",
            "net8": "5a:17:af:b1:d5:6c",
            "net9": "6e:b5:bb:19:3b:74"
        },
        "leaf_1_0_3": {
            "net0": "a2:d3:53:03:0b:c7",
            "net1": "ae:17:e4:bc:af:4a",
            "net10": "ca:58:27:ca:b6:fb",
            "net11": "12:fc:70:7b:44:49",
            "net12": "ce:98:5d:44:c9:a2",
            "net2": "02:98:d1:6d:6a:42",
            "net3": "6e:3a:5f:4e:b2:12",
            "net4": "72:ef:44:61:a0:f8",
            "net5": "7e:bf:8c:bc:2e:b7",
            "net6": "be:d0:4d:20:a2:b7",
            "net7": "0e:df:34:f9:ce:5c",
            "net8": "fa:f7:32:7c:b1:ca",
            "net9": "f2:54:29:78:67:b9"
        },
        "leaf_1_0_4": {
            "net0": "92:99:3b:55:30:56",
            "net1": "ee:5c:cb:28:d1:66",
            "net10": "56:53:0d:2b:7e:45",
            "net11": "e2:f2:f9:85:dc:67",
            "net12": "8a:34:64:48:4a:ca",
            "net2": "32:b9:60:c9:5a:c8",
            "net3": "2e:7e:62:8e:2e:d0",
            "net4": "ca:b0:dd:a2:be:a1",
            "net5": "f6:58:f0:0f:b6:9f",
            "net6": "9e:92:0b:b9:5a:5e",
            "net7": "3a:1e:2f:1c:3b:a3",
            "net8": "a6:af:92:74:e3:7c",
            "net9": "22:c0:78:ba:f0:a3"
        },
        "leaf_1_0_5": {
            "net0": "de:52:d9:64:20:61",
            "net1": "7a:59:71:59:95:4e",
            "net10": "2a:da:02:f8:f7:aa",
            "net11": "f6:ac:b1:03:90:12",
            "net12": "36:20:4d:c2:90:93",
            "net2": "22:9b:28:6e:1a:4e",
            "net3": "8a:e8:69:e5:5e:39",
            "net4": "76:74:0d:e5:e0:35",
            "net5": "6e:12:75:79:25:0d",
            "net6": "66:3a:b6:be:56:69",
            "net7": "7e:b7:b8:de:5f:2f",
            "net8": "ae:89:fc:4d:12:f8",
            "net9": "22:fc:93:83:b5:a7"
        },
        "leaf_1_0_6": {
            "net0": "ce:ea:11:5f:6f:39",
            "net1": "36:ef:f6:96:c7:30",
            "net10": "7e:92:6f:ee:fa:b8",
            "net11": "b2:60:d3:d7:76:cc",
            "net12": "8e:7f:a5:58:f7:57",
            "net2": "c6:3c:88:0b:ec:2f",
            "net3": "1e:67:d4:8e:a4:93",
            "net4": "12:43:1c:6a:86:69",
            "net5": "da:84:19:1b:e4:c4",
            "net6": "06:49:c3:d0:34:63",
            "net7": "2a:2b:e7:de:d5:6b",
            "net8": "6a:aa:f1:34:2c:68",
            "net9": "86:19:56:6c:05:87"
        },
        "leaf_1_0_7": {
            "net0": "ae:f6:60:6f:d3:f0",
            "net1": "ce:f4:d8:14:44:ec",
            "net10": "a2:40:6f:39:e0:69",
            "net11": "02:0b:d8:9e:9d:dc",
            "net12": "a6:77:89:76:b4:6e",
            "net2": "da:1d:37:e6:55:b2",
            "net3": "5e:a0:f8:63:7f:d2",
            "net4": "4e:2f:f2:6f:f8:0f",
            "net5": "3e:5d:65:c1:13:e1",
            "net6": "0a:6a:7e:38:b6:bc",
            "net7": "42:98:5a:6f:8b:ae",
            "net8": "ce:4f:56:78:91:47",
            "net9": "06:93:d5:50:90:14"
        },
        "leaf_1_0_8": {
            "net0": "32:9e:c5:5a:35:d1",
            "net1": "fa:11:3a:5e:ba:14",
            "net10": "42:08:70:8b:e2:e4",
            "net11": "c6:43:9f:27:17:23",
            "net12": "e2:b0:2a:e6:ce:9b",
            "net2": "52:cd:fc:a1:21:e9",
            "net3": "fe:3a:f7:fe:df:b1",
            "net4": "6e:f2:73:45:4f:db",
            "net5": "4e:6d:4d:77:28:c5",
            "net6": "2e:e6:19:53:2c:b3",
            "net7": "a2:db:6b:5d:31:4d",
            "net8": "d2:7e:f8:49:d2:7c",
            "net9": "1a:9d:e8:25:4d:52"
        },
        "leaf_1_0_9": {
            "net0": "26:a9:6f:9a:af:d8",
            "net1": "c6:ce:55:19:cd:90",
            "net10": "6a:b3:04:da:46:e6",
            "net11": "c2:df:55:19:bb:c2",
            "net12": "ba:d0:58:6e:05:b3",
            "net2": "aa:5d:3c:a2:44:47",
            "net3": "ee:85:a8:9e:24:bf",
            "net4": "46:59:3f:17:99:83",
            "net5": "5e:ab:7f:ec:8f:61",
            "net6": "46:a2:d6:2c:f7:be",
            "net7": "4e:59:eb:59:88:f2",
            "net8": "ca:b4:c2:37:a8:a7",
            "net9": "86:34:b9:ea:15:c3"
        },
        "leaf_2_0_1": {
            "net0": "9a:ee:29:dc:81:87",
            "net1": "66:01:1d:50:e5:61",
            "net10": "4a:ba:2e:af:ba:7c",
            "net11": "d6:0e:fa:18:4b:a8",
            "net12": "16:44:88:56:9b:c0",
            "net2": "a2:97:f4:e5:88:69",
            "net3": "06:71:a6:b5:03:cf",
            "net4": "7e:52:6c:7d:8d:71",
            "net5": "6a:4f:05:6e:a9:7b",
            "net6": "ca:4b:18:a2:3a:2e",
            "net7": "76:79:42:41:f9:25",
            "net8": "06:93:13:2e:a9:b7",
            "net9": "8e:74:c2:fc:ce:3b"
        },
        "leaf_2_0_10": {
            "net0": "32:14:50:8d:97:86",
            "net1": "86:f7:de:7e:e5:c8",
            "net10": "de:2c:67:2f:fb:ee",
            "net11": "26:66:ee:18:85:4b",
            "net12": "5e:02:f0:6a:92:cb",
            "net2": "1a:71:1e:a9:ad:9a",
            "net3": "9a:45:15:9f:da:02",
            "net4": "ae:01:b7:6c:c5:40",
            "net5": "5a:a3:7e:d4:fa:d2",
            "net6": "86:d2:dd:d6:82:d6",
            "net7": "66:8e:f5:13:fa:0a",
            "net8": "a6:36:4b:9f:28:25",
            "net9": "f2:2a:a6:49:6b:f7"
        },
        "leaf_2_0_11": {
            "net0": "26:09:37:76:a2:df",
            "net1": "42:cc:f3:1c:89:f4",
            "net10": "7a:35:8b:45:4b:ae",
            "net11": "66:13:90:e9:3a:91",
            "net12": "4e:db:aa:ec:b3:aa",
            "net2": "fe:ee:17:ab:fa:5f",
            "net3": "96:93:8f:37:29:91",
            "net4": "de:03:5f:80:71:26",
            "net5": "72:ef:e0:5a:af:4e",
            "net6": "76:a1:e3:bc:fe:b4",
            "net7": "12:82:af:23:63:54",
            "net8": "d6:69:cc:d1:a5:d2",
            "net9": "72:bb:3a:2f:72:1c"
        },
        "leaf_2_0_12": {
            "net0": "86:b9:49:8f:dd:5d",
            "net1": "62:54:58:ca:2b:35",
            "net10": "6e:e6:3a:63:37:0c",
            "net11": "66:07:5f:7a:ca:b9",
            "net12": "5e:23:cc:22:e3:53",
            "net2": "96:80:ae:ac:0c:6e",
            "net3": "ca:a0:7d:63:e9:f4",
            "net4": "26:61:c8:bf:c8:bf",
            "net5": "b6:4b:94:aa:55:ab",
            "net6": "d2:ba:c1:dd:5c:ee",
            "net7": "76:77:74:0f:75:0e",
            "net8": "06:c0:f8:48:e5:d9",
            "net9": "1e:f5:a5:de:42:d0"
        },
        "leaf_2_0_2": {
            "net0": "3e:8c:92:a9:de:d9",
            "net1": "7a:1f:64:3e:1a:4b",
            "net10": "aa:ec:5f:ec:ad:ab",
            "net11": "82:09:41:b5:b2:8d",
            "net12": "ea:81:cf:33:6b:08",
            "net2": "d6:0b:65:e1:7f:0a",
            "net3": "96:fd:59:45:1b:df",
            "net4": "ae:8d:40:f4:46:fd",
            "net5": "16:8b:d0:8b:13:97",
            "net6": "9e:64:e2:8b:c3:59",
            "net7": "86:f8:d5:76:b1:9e",
            "net8": "02:e1:51:51:74:00",
            "net9": "56:24:60:01:99:a8"
        },
        "leaf_2_0_3": {
            "net0": "1e:a9:65:44:1a:6d",
            "net1": "9a:2b:3a:6b:69:57",
            "net10": "92:8c:57:cf:42:8d",
            "net11": "4e:da:82:30:4f:c5",
            "net12": "1a:fa:90:4e:ca:fd",
            "net2": "82:d9:43:71:b7:6d",
            "net3": "36:df:4f:b2:a5:b5",
            "net4": "ea:cf:b2:8f:fa:a9",
            "net5": "86:33:85:10:d6:2b",
            "net6": "ba:90:45:e5:51:94",
            "net7": "26:1c:06:59:c2:36",
            "net8": "0a:42:b7:7a:9c:71",
            "net9": "9a:74:1c:0b:cb:0b"
        },
        "leaf_2_0_4": {
            "net0": "b2:b1:85:2f:b0:26",
            "net1": "ba:5b:47:e2:47:c8",
            "net10": "32:cd:f3:0c:ed:87",
            "net11": "82:5c:05:8b:58:b9",
            "net12": "e2:74:58:f6:b3:1a",
            "net2": "86:7f:e6:ff:5d:d8",
            "net3": "16:65:b1:83:31:b0",
            "net4": "ba:46:45:ab:fd:68",
            "net5": "e6:ff:b7:7f:61:b4",
            "net6": "36:16:85:aa:32:f2",
            "net7": "f2:40:5b:c0:57:7e",
            "net8": "a6:ac:1f:1c:ea:36",
            "net9": "aa:e8:45:2f:f8:1d"
        },
        "leaf_2_0_5": {
            "net0": "ce:ce:43:59:f6:c9",
            "net1": "8e:0d:17:f6:97:41",
            "net10": "6a:c2:77:41:4b:04",
            "net11": "52:92:d9:08:31:67",
            "net12": "fe:8d:b6:0e:dd:7b",
            "net2": "36:8b:f5:11:47:5c",
            "net3": "66:44:50:f5:1f:bb",
            "net4": "02:ab:03:95:ed:62",
            "net5": "b6:60:4e:05:be:fe",
            "net6": "22:92:2f:0c:05:16",
            "net7": "7a:d8:64:b2:ce:67",
            "net8": "6e:d4:35:7b:1a:c5",
            "net9": "fa:a0:07:a9:bb:2a"
        },
        "leaf_2_0_6": {
            "net0": "c2:0d:a3:06:ab:2b",
            "net1": "66:df:7c:eb:f6:18",
            "net10": "92:7e:18:32:d7:31",
            "net11": "46:9c:ac:40:61:3e",
            "net12": "7a:0e:6f:87:a3:0c",
            "net2": "7e:73:ac:17:a1:50",
            "net3": "ca:1d:31:b0:c4:45",
            "net4": "82:71:fb:10:30:b9",
            "net5": "66:a3:a4:7b:8c:01",
            "net6": "32:07:8a:f3:a6:4b",
            "net7": "46:35:ab:6d:da:eb",
            "net8": "d2:d2:bb:73:58:19",
            "net9": "3a:d1:97:94:d2:a5"
        },
        "leaf_2_0_7": {
            "net0": "42:d2:cb:2f:aa:71",
            "net1": "a6:27:10:58:62:d5",
            "net10": "be:60:fc:24:af:52",
            "net11": "5e:08:ce:1d:e5:6f",
            "net12": "62:64:54:e4:08:5b",
            "net2": "aa:8f:a0:f6:9d:d0",
            "net3": "7a:a6:f3:74:5b:18",
            "net4": "b6:fb:66:bb:16:53",
            "net5": "86:6a:21:c2:86:73",
            "net6": "52:d4:b8:71:0b:b3",
            "net7": "6a:93:89:ee:14:f6",
            "net8": "62:64:56:7a:c3:2f",
            "net9": "4a:9e:f0:ed:e1:c3"
        },
        "leaf_2_0_8": {
            "net0": "a2:6e:54:3d:57:77",
            "net1": "82:e6:d3:00:69:8c",
            "net10": "02:d6:e8:2d:43:56",
            "net11": "2a:49:5f:eb:2f:8c",
            "net12": "6a:99:c6:84:a8:8e",
            "net2": "ce:e8:8e:61:d6:2f",
            "net3": "16:22:79:f9:a2:3a",
            "net4": "06:13:4c:4d:f4:6e",
            "net5": "02:d1:7a:c6:41:80",
            "net6": "02:28:de:5b:94:0f",
            "net7": "16:d7:a3:02:ff:a6",
            "net8": "ce:6c:13:5a:f6:08",
            "net9": "8e:a0:62:55:e5:a6"
        },
        "leaf_2_0_9": {
            "net0": "5a:55:33:2b:6c:38",
            "net1": "42:4b:d4:61:e5:e0",
            "net10": "36:33:f1:75:a5:f8",
            "net11": "62:e1:89:8d:86:a3",
            "net12": "8a:49:06:1e:c8:41",
            "net2": "aa:92:d7:b5:e4:74",
            "net3": "aa:0a:87:20:2c:a8",
            "net4": "1e:2f:6f:4b:32:f5",
            "net5": "36:6a:3c:dd:a4:13",
            "net6": "c2:ed:ae:85:de:b4",
            "net7": "5a:49:3a:23:a0:a5",
            "net8": "6a:bd:5f:6b:d2:69",
            "net9": "a2:d1:d9:c1:b3:1a"
        },
        "spine_1_1_1": {
            "net0": "06:eb:38:13:cf:85",
            "net1": "2a:9f:8f:ef:d6:24",
            "net10": "56:4c:3e:ad:c1:4a",
            "net11": "e6:6e:9e:50:8d:1c",
            "net12": "f2:6a:f4:2b:2f:d0",
            "net13": "1a:f7:d8:c4:1d:5b",
            "net14": "c2:7e:54:88:dc:6c",
            "net15": "66:e9:32:bf:23:74",
            "net16": "62:0e:c4:72:25:28",
            "net17": "46:72:29:6c:c9:87",
            "net18": "22:51:bd:d2:f8:62",
            "net19": "a2:8c:7b:42:79:4c",
            "net2": "52:d1:7e:88:e8:1c",
            "net20": "ba:3f:d9:56:34:88",
            "net21": "56:56:64:50:03:e4",
            "net22": "5e:08:6e:4d:14:6b",
            "net23": "02:36:4f:7e:46:68",
            "net3": "ce:a9:82:28:79:c0",
            "net4": "8a:08:ae:60:d2:5f",
            "net5": "c6:de:46:51:f2:4b",
            "net6": "4e:50:34:3d:64:bd",
            "net7": "d2:97:1d:5e:d8:75",
            "net8": "5a:a1:d4:ec:00:20",
            "net9": "72:07:f2:b7:ad:55"
        },
        "spine_1_1_10": {
            "net0": "6a:36:b8:d0:e0:14",
            "net1": "22:ff:57:ee:b7:f7",
            "net10": "02:a9:de:85:dc:df",
            "net11": "52:37:ac:11:1c:db",
            "net12": "d2:61:7b:c0:01:66",
            "net13": "a2:c1:52:40:4c:07",
            "net14": "b2:34:da:99:26:74",
            "net15": "ee:58:25:ba:f0:67",
            "net16": "3e:16:3c:23:b2:b9",
            "net17": "2a:1f:2a:d6:81:90",
            "net18": "3e:3f:ea:1b:0f:67",
            "net19": "42:af:4e:1e:fe:70",
            "net2": "36:4b:b7:f5:49:a6",
            "net20": "c2:09:9c:80:b8:19",
            "net21": "9e:0d:ed:75:b0:67",
            "net22": "e2:25:ac:66:21:9d",
            "net23": "e6:b0:c3:eb:4c:93",
            "net3": "86:ac:86:c3:e2:6b",
            "net4": "52:09:29:e8:66:03",
            "net5": "26:0c:ea:9b:9e:58",
            "net6": "fa:d7:2b:8f:2d:96",
            "net7": "aa:b0:69:34:fb:ea",
            "net8": "3a:76:48:08:e1:51",
            "net9": "72:c9:59:1d:9a:ff"
        },
        "spine_1_1_11": {
            "net0": "e2:d3:8e:b6:a3:4f",
            "net1": "96:f5:7f:20:eb:bd",
            "net10": "82:32:1b:f9:31:ec",
            "net11": "e2:fe:0b:82:2f:23",
            "net12": "7e:b8:26:59:48:b6",
            "net13": "46:13:16:df:ac:56",
            "net14": "96:d6:84:5e:f1:b3",
            "net15": "12:20:12:6d:f7:1a",
            "net16": "7e:7e:08:02:e8:bc",
            "net17": "b6:ed:3c:24:e9:4c",
            "net18": "12:1d:a1:c0:79:67",
            "net19": "5e:17:d2:ff:99:a4",
            "net2": "8a:fe:ca:31:5e:f1",
            "net20": "aa:4e:20:dd:e4:0c",
            "net21": "f2:3d:11:ce:b9:5d",
            "net22": "76:0d:c7:aa:62:0c",
            "net23": "4a:f9:f1:74:55:77",
            "net3": "b6:03:76:21:2c:95",
            "net4": "2a:2d:89:f1:4c:6b",
            "net5": "2a:a6:d3:6d:aa:1b",
            "net6": "82:db:b0:ec:ca:79",
            "net7": "16:c4:09:00:71:b1",
            "net8": "72:38:eb:f1:89:43",
            "net9": "2e:bd:5b:fe:78:3a"
        },
        "spine_1_1_12": {
            "net0": "5a:48:5f:b9:da:5d",
            "net1": "da:76:4f:c0:da:9f",
            "net10": "0a:ee:24:c1:12:33",
            "net11": "9a:26:98:d2:0d:84",
            "net12": "42:bb:ac:cf:4a:69",
            "net13": "2a:92:e1:8f:7b:dd",
            "net14": "46:63:25:81:85:c1",
            "net15": "1e:77:8d:f5:48:ec",
            "net16": "3a:d9:fb:50:28:b6",
            "net17": "ae:d4:d3:ff:33:da",
            "net18": "a6:41:03:54:71:60",
            "net19": "da:2e:75:db:58:37",
            "net2": "32:fb:d7:4b:0d:01",
            "net20": "2e:d4:76:92:99:17",
            "net21": "ca:a8:9f:7a:29:44",
            "net22": "4a:56:51:4e:5f:62",
            "net23": "e6:11:8a:07:25:76",
            "net3": "ea:4f:d6:0a:e0:d4",
            "net4": "1a:e7:7c:3d:20:97",
            "net5": "06:d9:89:fb:9f:3c",
            "net6": "e2:aa:54:2e:05:d7",
            "net7": "92:88:39:0b:f5:e7",
            "net8": "3e:a9:5a:43:e2:e7",
            "net9": "ae:a6:38:ab:97:1e"
        },
        "spine_1_1_2": {
            "net0": "3e:78:1d:7a:6a:6e",
            "net1": "7a:f5:06:92:9b:ea",
            "net10": "5a:dd:e9:5d:98:4c",
            "net11": "5e:aa:2c:ac:43:8f",
            "net12": "d6:b6:ff:b4:de:90",
            "net13": "3e:eb:cf:9f:48:73",
            "net14": "66:cc:7f:71:47:60",
            "net15": "8a:04:1f:7b:48:70",
            "net16": "a6:23:e8:5a:ff:4e",
            "net17": "7a:f6:97:28:ab:40",
            "net18": "d6:b6:9b:73:fc:5c",
            "net19": "d2:96:af:7b:bd:c1",
            "net2": "a2:a3:2b:57:96:b2",
            "net20": "96:a4:28:8e:5e:5b",
            "net21": "a2:84:7d:cf:d6:aa",
            "net22": "b2:ce:1e:41:94:96",
            "net23": "1e:79:eb:48:36:3d",
            "net3": "ce:8d:56:bf:cc:b5",
            "net4": "12:b2:7b:94:21:22",
            "net5": "8e:5f:34:28:93:63",
            "net6": "ea:1b:1f:8a:1d:14",
            "net7": "8e:1e:db:98:8d:9d",
            "net8": "d2:60:15:32:24:1f",
            "net9": "92:1d:44:b2:6b:c1"
        },
        "spine_1_1_3": {
            "net0": "3e:f3:4a:7d:c4:a2",
            "net1": "3a:85:3f:6d:3c:c7",
            "net10": "32:0a:4c:67:61:63",
            "net11": "66:f1:ab:46:ec:0e",
            "net12": "f2:0c:db:1f:85:15",
            "net13": "06:e6:36:44:b2:23",
            "net14": "1e:c0:8a:13:b8:fa",
            "net15": "92:68:4d:de:d5:f8",
            "net16": "7e:ac:60:57:f5:b6",
            "net17": "aa:01:54:a1:fc:3b",
            "net18": "de:bf:91:d8:25:aa",
            "net19": "4a:98:09:ea:a0:a9",
            "net2": "d2:5a:3d:f8:08:1c",
            "net20": "42:46:6c:06:a5:76",
            "net21": "aa:ef:c6:06:4d:f5",
            "net22": "4a:05:4e:62:ad:80",
            "net23": "6a:ee:9d:1d:b9:c4",
            "net3": "b6:e7:5f:59:bf:e1",
            "net4": "16:c3:6f:f8:aa:fd",
            "net5": "e6:9b:49:2f:09:03",
            "net6": "e2:a8:07:52:3b:17",
            "net7": "12:fd:5f:bd:7d:26",
            "net8": "da:e5:d0:e8:5a:78",
            "net9": "b6:b3:d6:18:c3:ca"
        },
        "spine_1_1_4": {
            "net0": "2a:c6:98:f5:f6:be",
            "net1": "96:84:15:76:72:ac",
            "net10": "56:01:87:f6:4f:bc",
            "net11": "66:13:40:d8:28:14",
            "net12": "e6:46:09:44:7a:5f",
            "net13": "56:f2:1f:56:d7:67",
            "net14": "3a:49:d9:83:db:03",
            "net15": "66:c1:a2:30:8c:1c",
            "net16": "06:c4:3d:d7:e8:75",
            "net17": "76:bb:6a:0f:bb:fd",
            "net18": "22:6f:27:c1:13:dd",
            "net19": "ae:d2:b2:c0:a0:94",
            "net2": "5a:62:7e:09:6a:3c",
            "net20": "76:8b:22:93:84:23",
            "net21": "82:cd:ce:e5:77:8b",
            "net22": "22:a1:27:80:48:40",
            "net23": "f2:3c:b9:84:77:0f",
            "net3": "8a:08:60:f4:bd:d4",
            "net4": "da:81:db:50:a9:40",
            "net5": "52:c0:7f:31:3b:e2",
            "net6": "be:a3:be:a4:46:69",
            "net7": "aa:9d:c9:4e:42:9b",
            "net8": "26:65:4c:97:2c:be",
            "net9": "de:cb:37:6f:c6:68"
        },
        "spine_1_1_5": {
            "net0": "9e:be:37:68:9d:50",
            "net1": "b6:90:1f:a3:20:a7",
            "net10": "72:66:b8:74:9c:42",
            "net11": "7e:53:5b:f9:1f:19",
            "net12": "12:39:3e:e2:6a:59",
            "net13": "fe:e6:d4:6b:0a:5c",
            "net14": "aa:cf:25:35:e9:d8",
            "net15": "fa:6d:b2:c5:7f:1e",
            "net16": "82:93:56:bd:d1:49",
            "net17": "c6:d1:74:a7:69:28",
            "net18": "d6:29:61:3f:74:e0",
            "net19": "8a:60:ad:a7:a2:bb",
            "net2": "3a:e5:0d:d3:68:ba",
            "net20": "66:fb:e6:20:84:c6",
            "net21": "0a:6b:7c:50:d4:a6",
            "net22": "0a:63:10:31:03:4b",
            "net23": "52:b1:d4:e5:a2:2c",
            "net3": "5a:f8:7f:43:94:28",
            "net4": "12:36:1d:3f:47:8c",
            "net5": "e6:14:89:c5:de:12",
            "net6": "6e:0d:73:7c:d4:26",
            "net7": "2e:47:98:b3:1b:63",
            "net8": "42:de:50:1b:6e:cf",
            "net9": "86:78:74:87:e9:e1"
        },
        "spine_1_1_6": {
            "net0": "e2:94:ca:11:6b:93",
            "net1": "e6:59:a6:ca:96:d6",
            "net10": "72:b9:b5:12:ed:c5",
            "net11": "ca:98:e5:aa:f0:e3",
            "net12": "6e:13:f4:cc:38:36",
            "net13": "b6:58:4b:54:2e:67",
            "net14": "2e:cb:b6:ce:de:81",
            "net15": "5a:01:5a:b9:dc:63",
            "net16": "4e:f3:79:db:03:53",
            "net17": "56:39:e9:fa:cb:93",
            "net18": "fa:52:b3:4f:27:18",
            "net19": "8e:a2:f8:c9:8a:55",
            "net2": "d6:e3:c4:cf:07:e4",
            "net20": "ce:02:8d:d1:9d:43",
            "net21": "2e:24:9a:c8:7e:07",
            "net22": "12:36:cb:a2:06:c1",
            "net23": "66:16:ea:02:3e:06",
            "net3": "a6:25:a0:c7:e7:71",
            "net4": "9a:06:b4:f5:79:3c",
            "net5": "aa:de:73:a2:a3:da",
            "net6": "0e:66:35:ba:9b:95",
            "net7": "aa:a7:8b:0e:12:8e",
            "net8": "06:37:1f:54:f4:8e",
            "net9": "f6:9f:c0:70:46:f0"
        },
        "spine_1_1_7": {
            "net0": "e2:9e:2d:9d:a2:53",
            "net1": "5e:d9:19:a6:4a:e7",
            "net10": "36:ac:8c:0e:e3:d0",
            "net11": "46:83:bc:09:9a:19",
            "net12": "7e:26:ea:86:9d:9d",
            "net13": "a6:e3:b0:e5:9e:7e",
            "net14": "5e:63:2e:2f:40:d2",
            "net15": "ba:bf:0b:c1:3d:9e",
            "net16": "62:1b:5a:bd:6c:1a",
            "net17": "4a:13:b3:1f:89:c5",
            "net18": "aa:fa:4e:13:aa:ee",
            "net19": "5a:3a:69:92:38:d6",
            "net2": "e6:cf:97:78:76:2e",
            "net20": "f6:88:df:54:43:bc",
            "net21": "62:4a:13:32:33:ba",
            "net22": "96:95:b1:cc:e4:41",
            "net23": "6a:1b:9c:cb:de:6b",
            "net3": "f2:22:4f:79:8a:31",
            "net4": "4a:06:e6:24:4a:39",
            "net5": "f6:94:d6:72:ef:fc",
            "net6": "96:c7:10:56:04:0f",
            "net7": "66:55:2d:34:c9:0f",
            "net8": "52:05:73:18:ca:e1",
            "net9": "f2:1b:32:d9:dc:81"
        },
        "spine_1_1_8": {
            "net0": "ca:90:36:e3:93:bd",
            "net1": "2a:e7:38:be:df:77",
            "net10": "b6:8f:94:fb:d1:b4",
            "net11": "b2:70:85:ec:85:78",
            "net12": "c2:94:9b:51:47:4b",
            "net13": "4a:48:e7:aa:3e:13",
            "net14": "e2:c3:27:5d:a0:4a",
            "net15": "4e:60:e1:42:ee:3b",
            "net16": "6e:3f:68:55:f5:08",
            "net17": "32:3f:b4:c0:2e:6c",
            "net18": "5a:72:0e:41:98:f5",
            "net19": "22:3e:e4:e4:5c:34",
            "net2": "8a:04:d2:12:ee:93",
            "net20": "0a:b9:fc:3b:1b:97",
            "net21": "32:49:b6:55:fa:b0",
            "net22": "1e:12:56:1a:e5:0c",
            "net23": "ce:36:04:e8:fc:12",
            "net3": "6a:d1:af:23:4d:f5",
            "net4": "7a:67:36:68:04:1e",
            "net5": "be:e7:ca:b1:99:27",
            "net6": "22:d9:10:d0:da:4f",
            "net7": "c2:89:46:ee:73:30",
            "net8": "46:ca:ce:c1:1b:45",
            "net9": "8e:ef:1e:46:07:a7"
        },
        "spine_1_1_9": {
            "net0": "36:2a:6e:ca:0d:3b",
            "net1": "d6:c8:64:71:73:1c",
            "net10": "82:9d:cd:af:cf:98",
            "net11": "6a:72:13:fa:95:39",
            "net12": "36:e1:95:c6:a4:9c",
            "net13": "96:11:f1:bb:70:3b",
            "net14": "fa:30:70:e5:47:42",
            "net15": "fa:1c:43:63:75:2b",
            "net16": "3a:59:a4:88:06:9b",
            "net17": "62:8a:b6:3e:2b:29",
            "net18": "2e:49:41:78:b4:d8",
            "net19": "56:dd:ce:1a:c3:cb",
            "net2": "b6:c7:fb:af:87:45",
            "net20": "42:32:0e:59:1e:f6",
            "net21": "16:d2:bc:db:99:3a",
            "net22": "e6:b4:f9:a2:88:6f",
            "net23": "1a:44:af:f9:b6:ef",
            "net3": "62:51:05:4f:b9:fe",
            "net4": "f6:51:df:5a:fd:5c",
            "net5": "5e:1e:c9:eb:da:ca",
            "net6": "ca:3b:af:8f:83:2c",
            "net7": "92:6c:5e:4b:7d:88",
            "net8": "a6:e6:a8:28:64:68",
            "net9": "12:48:a7:11:4a:8b"
        },
        "spine_2_1_1": {
            "net0": "aa:39:05:bb:32:1e",
            "net1": "ea:a3:85:f9:ba:98",
            "net10": "be:c8:00:c7:7d:63",
            "net11": "1a:0c:a3:34:31:b6",
            "net12": "7a:a9:67:61:74:ac",
            "net13": "36:06:7e:50:6d:e4",
            "net14": "b2:af:4d:50:ef:6b",
            "net15": "d2:8f:16:c4:20:a7",
            "net16": "2e:2f:45:23:66:2a",
            "net17": "6e:e7:e8:66:37:6a",
            "net18": "2e:2e:24:52:3f:16",
            "net19": "2e:2e:0e:a7:bc:fd",
            "net2": "ee:3e:78:10:f7:aa",
            "net20": "46:df:f7:e0:ea:08",
            "net21": "d6:5e:24:68:c9:94",
            "net22": "a2:a9:c7:35:a8:7b",
            "net23": "32:df:cc:24:39:7c",
            "net3": "2a:7e:4c:b0:ec:b8",
            "net4": "92:08:7f:88:8a:6a",
            "net5": "9a:d7:6b:c7:ef:2f",
            "net6": "a6:66:62:cf:2b:da",
            "net7": "0e:fc:38:77:ed:0e",
            "net8": "1a:44:5b:3c:40:7a",
            "net9": "8a:06:32:d5:55:a2"
        },
        "spine_2_1_10": {
            "net0": "22:25:0f:a6:84:fa",
            "net1": "ba:bd:c8:b2:a8:c8",
            "net10": "06:96:94:70:92:fc",
            "net11": "0a:e0:2d:cc:b8:6d",
            "net12": "ae:14:c0:6c:1b:2f",
            "net13": "5e:36:29:4e:32:7d",
            "net14": "d6:d2:2a:95:c3:bd",
            "net15": "7e:c1:99:86:a1:ff",
            "net16": "32:2a:4e:53:56:94",
            "net17": "22:fe:6d:61:d9:1b",
            "net18": "e6:32:51:46:ea:59",
            "net19": "fe:39:2b:df:4a:02",
            "net2": "ae:0b:20:b8:79:0a",
            "net20": "8e:44:6c:25:68:c4",
            "net21": "62:ad:03:fa:d3:20",
            "net22": "0a:94:bb:38:d9:75",
            "net23": "2e:05:d4:c2:33:1c",
            "net3": "52:89:c3:03:6a:9b",
            "net4": "22:63:9e:a0:cc:c4",
            "net5": "be:c1:cf:4a:91:8e",
            "net6": "aa:b6:df:a3:1d:6a",
            "net7": "32:c4:68:95:21:75",
            "net8": "b6:5d:3c:14:6b:56",
            "net9": "c6:31:bf:d3:55:02"
        },
        "spine_2_1_11": {
            "net0": "d6:c4:88:2c:34:f3",
            "net1": "02:22:b3:d0:0a:b3",
            "net10": "ce:d1:85:7c:aa:28",
            "net11": "22:a7:cc:51:4a:ca",
            "net12": "42:79:5d:c6:02:b1",
            "net13": "8a:4e:40:4c:e7:cb",
            "net14": "4e:c0:3b:ef:5e:40",
            "net15": "c2:70:f5:c2:5b:de",
            "net16": "ea:c0:d1:a1:47:b0",
            "net17": "12:d7:a7:74:3b:d8",
            "net18": "96:1a:68:fe:88:bb",
            "net19": "12:a8:4a:93:c0:b8",
            "net2": "0a:d1:2d:6d:3a:c4",
            "net20": "e2:9a:23:5e:84:a2",
            "net21": "3a:fb:e4:3e:04:19",
            "net22": "ee:9f:94:1f:3c:5e",
            "net23": "52:eb:8e:3e:a7:b9",
            "net3": "9a:39:56:c0:5d:89",
            "net4": "12:eb:bb:f8:7c:88",
            "net5": "ce:0f:02:69:ad:1d",
            "net6": "4e:40:38:f0:03:f0",
            "net7": "42:f3:14:52:be:21",
            "net8": "4a:3a:75:b3:8b:f0",
            "net9": "1a:0f:e7:09:bb:61"
        },
        "spine_2_1_12": {
            "net0": "0e:0a:5d:1d:8a:83",
            "net1": "56:50:8a:25:f8:48",
            "net10": "8a:bf:31:5b:21:ef",
            "net11": "12:aa:8f:51:67:f7",
            "net12": "02:18:1d:f3:06:57",
            "net13": "b2:f4:1e:b1:cb:71",
            "net14": "8e:ed:b1:64:12:8c",
            "net15": "e6:75:f7:71:9a:40",
            "net16": "e6:ee:d9:c7:58:0e",
            "net17": "9a:11:43:7b:ba:9e",
            "net18": "02:91:6c:66:fb:a6",
            "net19": "4e:57:bc:f9:1c:38",
            "net2": "62:78:6b:00:ad:cf",
            "net20": "ea:cf:a6:d6:31:8c",
            "net21": "e6:ba:fe:63:8e:51",
            "net22": "4a:f9:00:43:af:9d",
            "net23": "22:98:16:07:cb:1e",
            "net3": "d2:40:3f:b9:79:76",
            "net4": "86:91:2a:f7:18:b3",
            "net5": "5e:e7:87:b2:84:94",
            "net6": "3e:61:23:2a:94:b0",
            "net7": "56:d4:72:26:16:f5",
            "net8": "e6:b7:eb:be:95:1d",
            "net9": "02:55:a2:dc:8e:e4"
        },
        "spine_2_1_2": {
            "net0": "ee:a9:69:67:89:8a",
            "net1": "02:1d:91:bf:7d:20",
            "net10": "36:d3:70:34:7c:88",
            "net11": "5e:f6:95:fe:22:9b",
            "net12": "22:35:52:45:48:65",
            "net13": "e6:0f:7a:39:d3:e8",
            "net14": "32:04:5a:3e:e9:90",
            "net15": "12:0f:fa:a5:7a:38",
            "net16": "d6:39:76:f7:ec:7e",
            "net17": "ea:22:64:b2:bf:91",
            "net18": "f2:f2:20:6b:3c:e9",
            "net19": "86:04:23:ed:65:34",
            "net2": "7e:07:76:e0:6e:7b",
            "net20": "16:d7:2e:a5:72:69",
            "net21": "3a:7a:7f:d9:f6:47",
            "net22": "2a:86:0a:58:9c:1e",
            "net23": "4a:27:76:be:2d:f5",
            "net3": "8a:31:bf:47:df:a7",
            "net4": "92:12:d1:a7:52:5f",
            "net5": "16:b5:13:83:2a:46",
            "net6": "ae:0f:85:1e:2b:1b",
            "net7": "6a:3d:f4:cd:e1:08",
            "net8": "6a:53:97:22:bc:25",
            "net9": "9e:e8:f4:89:79:fc"
        },
        "spine_2_1_3": {
            "net0": "8a:a6:49:16:8f:a0",
            "net1": "2a:84:03:24:77:85",
            "net10": "6a:9b:89:6b:84:1a",
            "net11": "c6:f8:b1:7b:6d:04",
            "net12": "e2:80:6b:f9:68:1d",
            "net13": "e6:f8:08:8a:07:5d",
            "net14": "32:86:73:4d:f8:3b",
            "net15": "32:18:07:21:3d:3a",
            "net16": "9e:28:35:01:46:95",
            "net17": "16:d9:53:3b:30:9a",
            "net18": "02:4a:a5:7e:c6:5a",
            "net19": "92:4d:ff:de:35:7a",
            "net2": "12:74:45:4b:ba:09",
            "net20": "7e:88:c3:2d:7a:5e",
            "net21": "72:7f:5f:64:00:52",
            "net22": "4e:a0:1f:57:b0:55",
            "net23": "3a:1f:4b:8d:24:c6",
            "net3": "5a:e0:7d:89:58:24",
            "net4": "aa:dd:18:8a:29:51",
            "net5": "12:c3:91:0b:5d:86",
            "net6": "4a:5d:1b:53:59:ce",
            "net7": "1e:a0:85:9a:5e:0c",
            "net8": "3a:e8:b7:c1:b6:67",
            "net9": "f6:57:03:43:cc:eb"
        },
        "spine_2_1_4": {
            "net0": "ce:2e:8c:98:8e:59",
            "net1": "82:78:90:e3:f7:61",
            "net10": "8a:eb:62:ca:92:81",
            "net11": "f6:d2:0b:d4:bd:f3",
            "net12": "e2:52:28:80:b7:2b",
            "net13": "56:a5:e8:01:5f:fc",
            "net14": "e2:cd:e4:93:d5:c2",
            "net15": "ce:52:17:80:db:8c",
            "net16": "26:f0:c5:c2:bf:a5",
            "net17": "e2:7f:a9:3a:b9:c5",
            "net18": "6a:5d:c8:36:6d:23",
            "net19": "2a:16:6a:5e:36:9f",
            "net2": "8e:19:82:8b:c9:47",
            "net20": "da:4f:87:fa:59:2f",
            "net21": "a6:a1:c4:dc:78:25",
            "net22": "2e:33:98:d9:00:56",
            "net23": "62:9e:16:08:74:bb",
            "net3": "c2:3a:13:4e:95:2d",
            "net4": "8e:ec:ea:f1:98:c3",
            "net5": "fa:e5:36:95:f2:aa",
            "net6": "66:70:ff:22:7b:45",
            "net7": "42:d7:fe:09:7b:51",
            "net8": "8e:97:59:bb:73:e0",
            "net9": "fe:62:08:2d:08:f5"
        },
        "spine_2_1_5": {
            "net0": "66:22:87:5f:82:52",
            "net1": "1a:69:28:74:f0:d6",
            "net10": "36:4d:3b:64:7f:b4",
            "net11": "96:5e:e5:ad:b5:15",
            "net12": "42:83:5e:d1:c5:59",
            "net13": "f6:31:4e:59:21:e3",
            "net14": "6a:ec:85:78:4a:8a",
            "net15": "6a:1e:04:74:9b:2c",
            "net16": "2a:5b:ec:30:05:0f",
            "net17": "ca:00:a0:e2:ac:3c",
            "net18": "9a:76:9f:ad:8a:fd",
            "net19": "12:ef:c2:5a:27:4c",
            "net2": "4a:05:f5:7e:39:d5",
            "net20": "2e:81:a6:91:a2:48",
            "net21": "d6:e1:79:83:be:fe",
            "net22": "b6:26:ea:70:0e:ae",
            "net23": "fa:a7:ca:bf:1c:9a",
            "net3": "96:41:07:95:69:2c",
            "net4": "fa:4e:d7:ef:51:61",
            "net5": "0a:d8:af:6c:1a:d0",
            "net6": "f6:7c:b9:db:bf:4e",
            "net7": "ba:7c:20:47:6b:45",
            "net8": "c6:18:78:bc:a8:99",
            "net9": "56:1e:de:c5:57:47"
        },
        "spine_2_1_6": {
            "net0": "9a:4a:7d:5d:68:02",
            "net1": "fa:35:e9:cb:1c:c3",
            "net10": "0a:21:6e:86:02:84",
            "net11": "96:e0:8d:d1:8b:3c",
            "net12": "16:35:64:29:59:f1",
            "net13": "7a:3b:5b:6e:98:78",
            "net14": "0a:00:14:9d:a6:24",
            "net15": "fa:d5:92:61:69:4c",
            "net16": "62:ca:95:00:52:22",
            "net17": "12:a1:d0:28:be:0f",
            "net18": "a2:88:a8:6d:0d:76",
            "net19": "1a:67:04:88:2b:b8",
            "net2": "02:03:0b:18:ea:b8",
            "net20": "de:92:05:88:da:87",
            "net21": "56:18:66:79:58:23",
            "net22": "6a:e6:c3:ca:ba:e5",
            "net23": "ea:07:f6:11:4d:7a",
            "net3": "fa:53:51:a8:f9:60",
            "net4": "7a:1e:f4:ac:96:0c",
            "net5": "da:9d:99:c1:83:9a",
            "net6": "d2:de:f2:e9:c3:12",
            "net7": "9a:a6:d2:2f:50:54",
            "net8": "56:7e:09:98:2d:8f",
            "net9": "4e:ff:f1:08:e7:05"
        },
        "spine_2_1_7": {
            "net0": "2e:9e:fd:31:aa:c3",
            "net1": "5e:3f:dd:79:6f:f2",
            "net10": "fe:89:a3:c7:45:4c",
            "net11": "a6:79:7a:29:ed:b6",
            "net12": "ce:40:eb:09:9d:f6",
            "net13": "a6:ba:5b:68:3d:fc",
            "net14": "a6:0e:1d:03:a2:af",
            "net15": "8e:25:b2:35:9f:d3",
            "net16": "b2:0f:c2:ae:ea:fa",
            "net17": "6a:99:88:63:e9:6b",
            "net18": "d6:cc:4b:5f:05:50",
            "net19": "9e:57:e6:34:61:11",
            "net2": "62:6a:c2:5d:67:57",
            "net20": "de:86:ce:49:ab:cc",
            "net21": "62:c8:ea:34:13:a8",
            "net22": "82:2c:8c:b6:35:07",
            "net23": "02:02:82:f2:7e:d7",
            "net3": "6a:02:2a:01:24:ec",
            "net4": "06:95:16:f9:67:97",
            "net5": "1e:29:d8:b0:bb:98",
            "net6": "ea:9d:23:3e:55:4b",
            "net7": "fa:25:50:ab:de:43",
            "net8": "36:e3:b0:d2:ae:16",
            "net9": "76:de:3b:a5:d2:f9"
        },
        "spine_2_1_8": {
            "net0": "16:39:f8:02:92:df",
            "net1": "d2:c7:a0:52:5a:77",
            "net10": "aa:f1:d5:b2:14:69",
            "net11": "f6:5b:67:8f:41:ba",
            "net12": "02:2b:81:88:3a:ed",
            "net13": "fe:a7:35:8d:df:ad",
            "net14": "f2:cf:9b:98:1e:e3",
            "net15": "c2:8b:d3:73:0c:e1",
            "net16": "9a:4d:61:d7:a1:e5",
            "net17": "ee:6c:32:de:ec:99",
            "net18": "3a:62:69:9a:36:22",
            "net19": "2e:f0:e4:5c:7f:37",
            "net2": "96:f7:58:cf:28:e8",
            "net20": "d6:e3:19:5e:39:56",
            "net21": "8a:08:91:f3:ac:4f",
            "net22": "ea:a3:21:05:8c:e2",
            "net23": "02:23:d4:3a:51:22",
            "net3": "0e:58:f1:b6:c5:59",
            "net4": "4a:38:f4:7f:9c:8a",
            "net5": "6a:91:de:31:cd:a5",
            "net6": "f2:e5:00:f6:90:2f",
            "net7": "96:bc:fc:ad:52:50",
            "net8": "ea:9d:33:c9:06:d5",
            "net9": "12:4f:c9:06:18:0e"
        },
        "spine_2_1_9": {
            "net0": "d2:40:b5:a5:ac:3f",
            "net1": "ea:7b:b3:ae:6a:f0",
            "net10": "72:72:bd:53:75:93",
            "net11": "0e:7d:71:96:c7:7f",
            "net12": "76:00:7a:42:17:e1",
            "net13": "ee:f4:41:db:4f:95",
            "net14": "4a:16:66:15:b5:e3",
            "net15": "32:11:18:33:dc:41",
            "net16": "32:4e:98:1d:64:ed",
            "net17": "56:e6:b1:cb:3e:78",
            "net18": "36:aa:fd:e7:e8:21",
            "net19": "9a:55:4f:96:31:8b",
            "net2": "62:75:5c:dd:0e:ba",
            "net20": "46:d3:19:a1:7f:62",
            "net21": "e2:f0:d1:f3:12:08",
            "net22": "5e:00:4b:a5:1b:b7",
            "net23": "fe:87:6e:c4:d3:90",
            "net3": "92:76:fe:85:b7:71",
            "net4": "8a:ff:3e:b3:86:7a",
            "net5": "8e:4b:fd:5d:b7:aa",
            "net6": "0a:ee:98:58:e5:cb",
            "net7": "22:07:58:40:ea:0b",
            "net8": "c6:81:c7:17:21:67",
            "net9": "76:c7:47:61:55:3c"
        },
        "tof_1_2_1": {
            "net0": "ae:74:d4:b4:57:59",
            "net1": "36:79:90:d5:5f:16",
            "net10": "8e:96:30:71:7d:06",
            "net11": "5e:bd:d3:7e:f2:ce",
            "net12": "0e:c4:76:21:a3:e7",
            "net13": "62:d4:c5:b8:bc:34",
            "net14": "fa:b3:c0:7c:f8:bc",
            "net15": "3a:6c:a5:56:4a:75",
            "net16": "6e:7e:ad:16:d2:25",
            "net17": "e2:eb:f0:c8:9e:26",
            "net18": "06:a3:2c:7f:5e:09",
            "net19": "f6:74:98:18:41:67",
            "net2": "8a:8e:76:a4:b2:3c",
            "net20": "56:f3:a3:45:8d:7b",
            "net21": "c6:ca:e6:21:b4:4b",
            "net22": "96:ab:34:9f:67:b7",
            "net23": "82:0d:ac:d2:32:61",
            "net3": "b2:4c:bb:57:80:03",
            "net4": "32:34:dd:c2:d1:1c",
            "net5": "62:56:17:5b:51:a2",
            "net6": "4a:88:9a:cd:23:81",
            "net7": "02:52:00:26:d3:c0",
            "net8": "82:27:a0:e4:d8:74",
            "net9": "5a:12:2b:7b:9a:ee"
        },
        "tof_1_2_10": {
            "net0": "f2:d7:7a:df:4c:3f",
            "net1": "d2:55:01:c0:cd:45",
            "net10": "92:dd:9c:91:c5:2d",
            "net11": "0a:b7:f1:a9:7b:6d",
            "net12": "e6:99:0a:a5:9d:a0",
            "net13": "46:d6:9f:9c:8f:b4",
            "net14": "12:81:a4:b4:41:46",
            "net15": "86:93:e5:1f:c6:e5",
            "net16": "82:26:d3:c6:58:53",
            "net17": "06:2a:9b:44:e2:98",
            "net18": "1e:4f:fb:22:8b:04",
            "net19": "86:39:67:0c:19:ac",
            "net2": "6a:b8:2f:45:11:18",
            "net20": "96:f1:03:04:24:29",
            "net21": "42:2c:ef:ac:57:43",
            "net22": "e6:83:47:04:8c:b1",
            "net23": "2e:81:7c:60:74:a5",
            "net3": "e2:75:3a:d1:54:99",
            "net4": "92:e1:39:9f:c9:c6",
            "net5": "62:b4:ff:50:39:01",
            "net6": "a6:0e:59:99:ae:9f",
            "net7": "be:80:b9:f7:d9:83",
            "net8": "46:8d:8d:98:d2:2e",
            "net9": "a2:64:66:87:3e:1d"
        },
        "tof_1_2_11": {
            "net0": "0a:b7:82:2e:39:28",
            "net1": "2e:b2:78:33:24:c2",
            "net10": "0a:21:e3:b4:40:cc",
            "net11": "62:c4:5d:7f:60:2e",
            "net12": "56:7d:b3:6a:ae:f1",
            "net13": "5e:e4:a9:20:79:c5",
            "net14": "c6:5d:bc:4f:21:70",
            "net15": "ea:98:09:a4:fd:24",
            "net16": "72:3e:c7:26:98:5f",
            "net17": "0e:e5:87:e2:bb:63",
            "net18": "66:57:94:47:3a:f2",
            "net19": "46:ca:20:ed:30:6a",
            "net2": "6a:90:0f:61:83:ce",
            "net20": "de:55:19:8b:c5:d9",
            "net21": "56:af:9b:18:00:18",
            "net22": "de:62:35:a7:a6:d1",
            "net23": "e6:40:10:a4:e1:24",
            "net3": "fa:cf:91:66:29:b7",
            "net4": "3e:d8:f5:f7:d0:d6",
            "net5": "12:27:e9:61:e8:b1",
            "net6": "32:ea:ef:f3:b3:94",
            "net7": "6e:46:f4:05:ec:7a",
            "net8": "86:b9:dd:9e:e4:4b",
            "net9": "9a:09:be:e8:be:2f"
        },
        "tof_1_2_12": {
            "net0": "82:b4:73:5f:6e:12",
            "net1": "fa:d8:36:99:88:4f",
            "net10": "02:7a:77:1c:44:8a",
            "net11": "6a:13:8d:c0:8c:3d",
            "net12": "62:e8:70:e8:ec:56",
            "net13": "9e:5e:f2:0d:89:ae",
            "net14": "a2:e2:4f:f2:4a:c8",
            "net15": "72:29:9d:3f:ac:dd",
            "net16": "6a:ee:a7:30:51:d4",
            "net17": "72:62:93:43:f7:7e",
            "net18": "de:ea:84:b4:ab:33",
            "net19": "d2:ec:a0:1c:7a:a8",
            "net2": "12:63:51:bb:9a:ad",
            "net20": "2e:45:2d:09:a5:65",
            "net21": "36:1f:8a:ef:9f:c4",
            "net22": "e2:7c:c1:2f:03:04",
            "net23": "36:03:df:1f:e7:33",
            "net3": "aa:cc:49:a9:9f:17",
            "net4": "46:48:54:ef:63:b6",
            "net5": "46:f7:84:72:b9:24",
            "net6": "3a:1b:6d:8e:b9:ac",
            "net7": "6a:a5:7b:82:f4:8e",
            "net8": "aa:79:08:d7:5b:e3",
            "net9": "ce:c8:83:41:98:9d"
        },
        "tof_1_2_2": {
            "net0": "22:ef:bd:75:67:ca",
            "net1": "96:3d:ab:f6:4a:00",
            "net10": "62:3e:93:f5:7f:b8",
            "net11": "46:40:b8:49:ae:b0",
            "net12": "92:bd:8d:b4:de:81",
            "net13": "ea:53:46:05:33:f1",
            "net14": "3a:de:84:3a:0e:d4",
            "net15": "a2:91:d0:bf:ed:9d",
            "net16": "f2:20:ac:c4:34:d2",
            "net17": "02:af:06:a8:9d:58",
            "net18": "8e:4b:67:c1:17:be",
            "net19": "aa:a9:68:df:a2:b3",
            "net2": "ce:55:7c:ad:43:81",
            "net20": "ae:2a:78:d1:ad:45",
            "net21": "9a:dd:0e:48:3e:03",
            "net22": "1a:27:8a:00:7e:b9",
            "net23": "a6:3f:e4:c0:6c:ba",
            "net3": "1a:7e:11:7c:3b:2f",
            "net4": "a2:4b:95:57:e2:01",
            "net5": "62:28:c5:b9:37:f0",
            "net6": "e6:70:47:2c:ef:8c",
            "net7": "3e:7d:3b:8b:09:32",
            "net8": "7a:b9:77:33:43:9a",
            "net9": "42:bd:44:8b:9c:c0"
        },
        "tof_1_2_3": {
            "net0": "9a:0d:49:e0:cf:61",
            "net1": "5e:22:9b:c7:cb:06",
            "net10": "96:a3:31:95:1f:d3",
            "net11": "6a:f1:44:aa:8e:67",
            "net12": "9e:56:07:93:6f:fe",
            "net13": "26:26:33:35:d0:2e",
            "net14": "f2:03:51:92:0c:34",
            "net15": "12:fb:84:65:57:b7",
            "net16": "0e:9b:19:f7:d6:24",
            "net17": "f6:c6:17:81:c1:c8",
            "net18": "82:fc:db:ce:23:f6",
            "net19": "62:c6:61:5c:d7:37",
            "net2": "62:cf:ed:9d:f5:84",
            "net20": "f6:20:9d:ac:ad:63",
            "net21": "3a:e7:ef:69:03:45",
            "net22": "06:08:b2:f1:a3:7f",
            "net23": "c6:d3:ef:4d:53:99",
            "net3": "66:f9:33:7d:68:fd",
            "net4": "5a:d3:76:51:c4:a5",
            "net5": "02:44:c2:35:0d:b5",
            "net6": "b2:ea:b0:b9:09:4f",
            "net7": "f2:90:1c:5a:2a:a1",
            "net8": "72:c7:32:bc:30:74",
            "net9": "4e:7b:87:8a:0b:bf"
        },
        "tof_1_2_4": {
            "net0": "fa:25:2e:3a:bf:ee",
            "net1": "2a:7c:ba:81:9d:70",
            "net10": "52:01:e4:fe:f7:0e",
            "net11": "a2:6c:8f:66:dd:79",
            "net12": "96:05:2c:d6:c0:a1",
            "net13": "2a:b7:67:2e:ad:4f",
            "net14": "c6:dc:58:46:58:bb",
            "net15": "6e:73:3a:70:92:aa",
            "net16": "1e:0c:2c:da:ae:9d",
            "net17": "ee:f8:9e:0a:ee:41",
            "net18": "8a:81:e4:77:1c:bb",
            "net19": "32:86:d3:eb:27:4f",
            "net2": "16:1d:4a:0e:dc:b8",
            "net20": "2e:15:07:20:d4:d7",
            "net21": "56:63:d1:a9:1d:f4",
            "net22": "e2:61:6f:a0:9b:2f",
            "net23": "de:0a:bd:dc:d4:e3",
            "net3": "26:73:61:ad:36:58",
            "net4": "7e:ba:12:5d:b8:32",
            "net5": "de:43:be:62:b7:90",
            "net6": "b2:d3:4e:c5:95:ec",
            "net7": "f2:ce:07:d1:ba:3c",
            "net8": "52:bd:c7:24:68:88",
            "net9": "02:1a:91:f1:ee:16"
        },
        "tof_1_2_5": {
            "net0": "7e:83:13:f0:eb:7e",
            "net1": "aa:2d:4e:60:f6:aa",
            "net10": "16:ed:e9:4f:fa:51",
            "net11": "16:0e:2a:54:0a:db",
            "net12": "86:67:8c:2d:e2:a2",
            "net13": "12:95:af:6a:01:56",
            "net14": "02:fc:2d:01:dc:33",
            "net15": "0e:54:04:20:6b:cb",
            "net16": "46:26:b9:21:84:9c",
            "net17": "22:c6:bd:ff:d5:2e",
            "net18": "be:89:d8:c1:b0:ba",
            "net19": "92:4a:cf:ff:56:fa",
            "net2": "b6:8a:fb:1e:d4:ce",
            "net20": "32:0d:a2:5c:0b:d1",
            "net21": "3a:78:6a:da:bb:12",
            "net22": "1a:fd:08:4f:0a:f4",
            "net23": "c6:3c:ef:51:c5:59",
            "net3": "96:7f:42:40:b9:3a",
            "net4": "92:9a:3d:60:00:f4",
            "net5": "56:49:a8:55:26:b1",
            "net6": "aa:dc:cc:03:3a:e5",
            "net7": "8e:74:15:92:52:9d",
            "net8": "e2:09:70:1f:c1:ed",
            "net9": "6a:5d:52:97:c2:c6"
        },
        "tof_1_2_6": {
            "net0": "4e:59:b0:ea:a6:df",
            "net1": "4e:b5:0c:47:2b:7c",
            "net10": "36:cc:1c:e8:62:0a",
            "net11": "ee:99:fa:69:ab:e4",
            "net12": "8e:e3:07:8f:85:0c",
            "net13": "66:90:21:98:2c:ca",
            "net14": "2e:67:3b:0f:27:c6",
            "net15": "1a:01:4f:01:cf:3b",
            "net16": "ea:5f:c7:4a:0c:01",
            "net17": "c6:db:62:45:20:f6",
            "net18": "b2:4b:9b:fa:37:16",
            "net19": "2e:76:11:5b:30:56",
            "net2": "8a:89:87:20:38:00",
            "net20": "06:a7:44:a1:7a:07",
            "net21": "8e:0e:82:9e:08:23",
            "net22": "7a:f7:b3:f5:0c:36",
            "net23": "ae:8e:e9:32:f0:9f",
            "net3": "d6:5c:5a:f3:63:eb",
            "net4": "c2:2c:49:d5:50:08",
            "net5": "96:fc:93:a5:02:c5",
            "net6": "62:78:4f:84:7d:4f",
            "net7": "46:61:4f:aa:16:66",
            "net8": "52:2f:0d:ac:2a:31",
            "net9": "0e:2c:af:6b:cf:0a"
        },
        "tof_1_2_7": {
            "net0": "56:c8:5b:9b:8a:aa",
            "net1": "06:ab:b4:6b:9e:b1",
            "net10": "b6:a4:80:44:ef:7a",
            "net11": "0a:08:31:19:d0:41",
            "net12": "0e:70:05:84:86:6c",
            "net13": "e6:4c:86:24:91:65",
            "net14": "b6:36:8b:d2:32:ce",
            "net15": "2a:90:68:45:f7:47",
            "net16": "26:e6:6e:b9:0f:35",
            "net17": "2a:36:64:9c:2e:d9",
            "net18": "5a:51:c1:41:fe:81",
            "net19": "aa:df:e2:5c:e6:62",
            "net2": "46:cd:47:4c:dc:46",
            "net20": "b2:2e:b6:c8:0f:04",
            "net21": "06:a4:26:ab:21:a9",
            "net22": "a2:86:d6:23:59:25",
            "net23": "36:e3:ec:9f:15:a0",
            "net3": "3a:cf:07:a3:f6:13",
            "net4": "a6:fd:a0:90:0f:be",
            "net5": "1a:11:5c:1f:65:1d",
            "net6": "6e:f4:ca:11:c7:d5",
            "net7": "36:7f:e4:e6:4c:dc",
            "net8": "e6:4a:17:26:d2:39",
            "net9": "12:ad:9f:42:16:ff"
        },
        "tof_1_2_8": {
            "net0": "c6:18:1d:13:96:33",
            "net1": "a6:dc:c1:7f:6a:0b",
            "net10": "d6:26:f0:cc:ca:d3",
            "net11": "8a:86:a7:90:7b:13",
            "net12": "ae:16:d0:0b:d3:16",
            "net13": "3a:22:13:9b:2c:b9",
            "net14": "42:00:d0:b6:5c:d4",
            "net15": "8a:4a:85:c0:b0:34",
            "net16": "06:99:71:40:bf:19",
            "net17": "ba:c3:74:f4:2a:24",
            "net18": "c2:e7:16:d4:e3:80",
            "net19": "da:c0:df:d3:26:40",
            "net2": "fa:8f:39:54:e6:e7",
            "net20": "82:f5:7c:ba:cd:3e",
            "net21": "e2:35:ed:a5:3f:27",
            "net22": "5e:ec:f8:9f:1e:4b",
            "net23": "0a:52:45:ee:34:bb",
            "net3": "4a:9f:23:6a:b7:88",
            "net4": "22:e7:8d:52:ff:c4",
            "net5": "fe:6b:bd:c8:8e:93",
            "net6": "96:72:a0:fa:e4:43",
            "net7": "0a:f9:31:f6:e0:f1",
            "net8": "8a:f8:da:87:92:fd",
            "net9": "02:20:6e:24:d6:1f"
        },
        "tof_1_2_9": {
            "net0": "72:40:63:39:30:de",
            "net1": "d6:e3:20:ee:73:63",
            "net10": "da:65:46:07:31:ac",
            "net11": "9e:45:02:db:3d:fa",
            "net12": "12:5c:59:03:f0:e9",
            "net13": "26:d5:42:d4:a8:56",
            "net14": "4a:03:dd:92:3f:95",
            "net15": "e2:ac:be:50:87:f5",
            "net16": "da:a9:33:22:77:c9",
            "net17": "7a:ef:50:3c:a8:fa",
            "net18": "f2:99:e1:e1:a0:10",
            "net19": "ba:7d:4f:89:28:50",
            "net2": "3a:1a:ea:45:2d:65",
            "net20": "de:13:12:cc:be:35",
            "net21": "02:5f:17:87:e5:f0",
            "net22": "6a:95:03:39:38:3c",
            "net23": "d2:dc:7d:b8:22:50",
            "net3": "c2:fd:7a:72:21:99",
            "net4": "e6:14:8a:5a:6c:ac",
            "net5": "12:60:f9:1b:e2:c0",
            "net6": "a6:93:79:8b:ea:83",
            "net7": "6a:fc:f4:66:27:b8",
            "net8": "ae:8f:7a:7e:30:60",
            "net9": "56:5f:d3:35:aa:53"
        }
    },
    "failed_machine": "spine_1_1_1",
    "failed_interfaces": [
        "net12"
    ],
    "failure_time": 1614040675.3374171
}