{
    "k_leaf": 2,
    "k_top": 2,
    "redundancy_factor": 2,
    "is_k8s": true,
    "failed_machine": "leaf_1_0_1",
    "failure_time": {
        "leaf_1_0_1": 1621862536.5994384,
        "leaf_1_0_2": 1621862536.6063588,
        "leaf_2_0_1": 1621862536.6053977,
        "leaf_2_0_2": 1621862536.6120124,
        "spine_1_1_1": 1621862536.6143808,
        "spine_1_1_2": 1621862536.6176002,
        "spine_2_1_1": 1621862536.6251025,
        "spine_2_1_2": 1621862536.632114,
        "tof_1_2_1": 1621862536.6340787,
        "tof_1_2_2": 1621862536.6367276
    },
    "packet_count": {
        "total": [
            310,
            54056
        ],
        "leaf_2_0_1": {
            "total": [
                20,
                3401
            ],
            "net0": {
                "total": [
                    9,
                    1611
                ],
                "csnp": [
                    8,
                    1560
                ],
                "psnp": [
                    1,
                    51
                ]
            },
            "net1": {
                "total": [
                    11,
                    1790
                ],
                "csnp": [
                    8,
                    1560
                ],
                "psnp": [
                    2,
                    70
                ],
                "lsp": [
                    1,
                    160
                ]
            }
        },
        "leaf_2_0_2": {
            "total": [
                22,
                3587
            ],
            "net0": {
                "total": [
                    11,
                    1797
                ],
                "csnp": [
                    8,
                    1560
                ],
                "lsp": [
                    1,
                    167
                ],
                "psnp": [
                    2,
                    70
                ]
            },
            "net1": {
                "total": [
                    11,
                    1790
                ],
                "csnp": [
                    8,
                    1560
                ],
                "psnp": [
                    2,
                    70
                ],
                "lsp": [
                    1,
                    160
                ]
            }
        },
        "leaf_1_0_2": {
            "total": [
                21,
                3552
            ],
            "net0": {
                "total": [
                    11,
                    1790
                ],
                "csnp": [
                    8,
                    1560
                ],
                "psnp": [
                    2,
                    70
                ],
                "lsp": [
                    1,
                    160
                ]
            },
            "net1": {
                "total": [
                    10,
                    1762
                ],
                "csnp": [
                    8,
                    1560
                ],
                "lsp": [
                    1,
                    167
                ],
                "psnp": [
                    1,
                    35
                ]
            }
        },
        "spine_1_1_2": {
            "total": [
                40,
                7159
            ],
            "net0": {
                "total": [
                    9,
                    1727
                ],
                "csnp": [
                    8,
                    1560
                ],
                "lsp": [
                    1,
                    167
                ]
            },
            "net1": {
                "total": [
                    10,
                    1755
                ],
                "csnp": [
                    8,
                    1560
                ],
                "psnp": [
                    1,
                    35
                ],
                "lsp": [
                    1,
                    160
                ]
            },
            "net2": {
                "total": [
                    10,
                    1755
                ],
                "csnp": [
                    8,
                    1560
                ],
                "psnp": [
                    1,
                    35
                ],
                "lsp": [
                    1,
                    160
                ]
            },
            "net3": {
                "total": [
                    11,
                    1922
                ],
                "csnp": [
                    8,
                    1560
                ],
                "lsp": [
                    2,
                    327
                ],
                "psnp": [
                    1,
                    35
                ]
            }
        },
        "tof_1_2_2": {
            "total": [
                42,
                7393
            ],
            "net0": {
                "total": [
                    10,
                    1771
                ],
                "csnp": [
                    8,
                    1560
                ],
                "lsp": [
                    1,
                    160
                ],
                "psnp": [
                    1,
                    51
                ]
            },
            "net1": {
                "total": [
                    10,
                    1778
                ],
                "csnp": [
                    8,
                    1560
                ],
                "lsp": [
                    1,
                    167
                ],
                "psnp": [
                    1,
                    51
                ]
            },
            "net2": {
                "total": [
                    11,
                    1922
                ],
                "csnp": [
                    8,
                    1560
                ],
                "lsp": [
                    2,
                    327
                ],
                "psnp": [
                    1,
                    35
                ]
            },
            "net3": {
                "total": [
                    11,
                    1922
                ],
                "csnp": [
                    8,
                    1560
                ],
                "lsp": [
                    2,
                    327
                ],
                "psnp": [
                    1,
                    35
                ]
            }
        },
        "tof_1_2_1": {
            "total": [
                40,
                7291
            ],
            "net0": {
                "total": [
                    10,
                    1755
                ],
                "csnp": [
                    8,
                    1560
                ],
                "lsp": [
                    1,
                    160
                ],
                "psnp": [
                    1,
                    35
                ]
            },
            "net1": {
                "total": [
                    10,
                    1762
                ],
                "csnp": [
                    8,
                    1560
                ],
                "lsp": [
                    1,
                    167
                ],
                "psnp": [
                    1,
                    35
                ]
            },
            "net2": {
                "total": [
                    10,
                    1887
                ],
                "csnp": [
                    8,
                    1560
                ],
                "lsp": [
                    2,
                    327
                ]
            },
            "net3": {
                "total": [
                    10,
                    1887
                ],
                "csnp": [
                    8,
                    1560
                ],
                "lsp": [
                    2,
                    327
                ]
            }
        },
        "spine_2_1_2": {
            "total": [
                43,
                7271
            ],
            "net0": {
                "total": [
                    11,
                    1922
                ],
                "csnp": [
                    8,
                    1560
                ],
                "lsp": [
                    2,
                    327
                ],
                "psnp": [
                    1,
                    35
                ]
            },
            "net1": {
                "total": [
                    11,
                    1922
                ],
                "csnp": [
                    8,
                    1560
                ],
                "lsp": [
                    2,
                    327
                ],
                "psnp": [
                    1,
                    35
                ]
            },
            "net2": {
                "total": [
                    10,
                    1630
                ],
                "csnp": [
                    8,
                    1560
                ],
                "psnp": [
                    2,
                    70
                ]
            },
            "net3": {
                "total": [
                    11,
                    1797
                ],
                "csnp": [
                    8,
                    1560
                ],
                "lsp": [
                    1,
                    167
                ],
                "psnp": [
                    2,
                    70
                ]
            }
        },
        "spine_2_1_1": {
            "total": [
                42,
                7236
            ],
            "net0": {
                "total": [
                    10,
                    1887
                ],
                "csnp": [
                    8,
                    1560
                ],
                "lsp": [
                    2,
                    327
                ]
            },
            "net1": {
                "total": [
                    11,
                    1922
                ],
                "csnp": [
                    8,
                    1560
                ],
                "lsp": [
                    2,
                    327
                ],
                "psnp": [
                    1,
                    35
                ]
            },
            "net2": {
                "total": [
                    10,
                    1630
                ],
                "csnp": [
                    8,
                    1560
                ],
                "psnp": [
                    2,
                    70
                ]
            },
            "net3": {
                "total": [
                    11,
                    1797
                ],
                "csnp": [
                    8,
                    1560
                ],
                "lsp": [
                    1,
                    167
                ],
                "psnp": [
                    2,
                    70
                ]
            }
        },
        "spine_1_1_1": {
            "total": [
                40,
                7166
            ],
            "net0": {
                "total": [
                    8,
                    1560
                ],
                "csnp": [
                    8,
                    1560
                ]
            },
            "net1": {
                "total": [
                    11,
                    1922
                ],
                "csnp": [
                    8,
                    1560
                ],
                "lsp": [
                    2,
                    327
                ],
                "psnp": [
                    1,
                    35
                ]
            },
            "net2": {
                "total": [
                    10,
                    1762
                ],
                "csnp": [
                    8,
                    1560
                ],
                "lsp": [
                    1,
                    167
                ],
                "psnp": [
                    1,
                    35
                ]
            },
            "net3": {
                "total": [
                    11,
                    1922
                ],
                "csnp": [
                    8,
                    1560
                ],
                "lsp": [
                    2,
                    327
                ],
                "psnp": [
                    1,
                    35
                ]
            }
        }
    },
    "packets_by_collision_domain": {
        "AAAG": 2,
        "AAAI": 2,
        "AAAQ": 2,
        "AAAS": 2,
        "AAAH": 3,
        "AAAJ": 3,
        "AAAR": 3,
        "AAAT": 3,
        "AAAD": 3,
        "AAAE": 2,
        "AAAA": 0,
        "AAAB": 1,
        "AAAK": 2,
        "AAAL": 3,
        "AAAN": 3,
        "AAAO": 3
    },
    "blast_radius": {
        "by_collision_domain": {
            "AAAA": [
                0,
                0
            ],
            "AAAB": [
                0,
                1
            ],
            "AAAD": [
                1,
                3
            ],
            "AAAG": [
                1,
                2
            ],
            "AAAH": [
                1,
                3
            ],
            "AAAE": [
                1,
                2
            ],
            "AAAI": [
                1,
                2
            ],
            "AAAJ": [
                1,
                3
            ],
            "AAAQ": [
                2,
                2
            ],
            "AAAS": [
                2,
                2
            ],
            "AAAR": [
                2,
                3
            ],
            "AAAT": [
                2,
                3
            ],
            "AAAK": [
                3,
                2
            ],
            "AAAN": [
                3,
                3
            ],
            "AAAL": [
                3,
                3
            ],
            "AAAO": [
                3,
                3
            ]
        },
        "by_distance": {
            "0": 1,
            "1": 15,
            "2": 10,
            "3": 11
        }
    },
    "radius_graph": {
        "nodes": [
            {
                "id": "spine_1_1_1",
                "label": "spine_1_1_1"
            },
            {
                "id": "leaf_1_0_2",
                "label": "leaf_1_0_2"
            },
            {
                "id": "leaf_2_0_2",
                "label": "leaf_2_0_2"
            },
            {
                "id": "spine_2_1_1",
                "label": "spine_2_1_1"
            },
            {
                "id": "leaf_1_0_1",
                "label": "leaf_1_0_1"
            },
            {
                "id": "tof_1_2_1",
                "label": "tof_1_2_1"
            },
            {
                "id": "spine_2_1_2",
                "label": "spine_2_1_2"
            },
            {
                "id": "spine_1_1_2",
                "label": "spine_1_1_2"
            },
            {
                "id": "tof_1_2_2",
                "label": "tof_1_2_2"
            },
            {
                "id": "leaf_2_0_1",
                "label": "leaf_2_0_1"
            }
        ],
        "links": [
            {
                "source": "tof_1_2_1",
                "target": "spine_1_1_1",
                "value": 2,
                "label": "AAAG"
            },
            {
                "source": "tof_1_2_1",
                "target": "spine_1_1_2",
                "value": 2,
                "label": "AAAI"
            },
            {
                "source": "tof_1_2_1",
                "target": "spine_2_1_1",
                "value": 2,
                "label": "AAAQ"
            },
            {
                "source": "tof_1_2_1",
                "target": "spine_2_1_2",
                "value": 2,
                "label": "AAAS"
            },
            {
                "source": "tof_1_2_2",
                "target": "spine_1_1_1",
                "value": 3,
                "label": "AAAH"
            },
            {
                "source": "tof_1_2_2",
                "target": "spine_1_1_2",
                "value": 3,
                "label": "AAAJ"
            },
            {
                "source": "tof_1_2_2",
                "target": "spine_2_1_1",
                "value": 3,
                "label": "AAAR"
            },
            {
                "source": "tof_1_2_2",
                "target": "spine_2_1_2",
                "value": 3,
                "label": "AAAT"
            },
            {
                "source": "leaf_1_0_1",
                "target": "spine_1_1_1",
                "value": 0,
                "label": "AAAA"
            },
            {
                "source": "leaf_1_0_1",
                "target": "spine_1_1_2",
                "value": 1,
                "label": "AAAB"
            },
            {
                "source": "leaf_1_0_2",
                "target": "spine_1_1_1",
                "value": 3,
                "label": "AAAD"
            },
            {
                "source": "leaf_1_0_2",
                "target": "spine_1_1_2",
                "value": 2,
                "label": "AAAE"
            },
            {
                "source": "spine_1_1_1",
                "target": "leaf_1_0_1",
                "value": 0,
                "label": "AAAA"
            },
            {
                "source": "spine_1_1_1",
                "target": "leaf_1_0_2",
                "value": 3,
                "label": "AAAD"
            },
            {
                "source": "spine_1_1_1",
                "target": "tof_1_2_1",
                "value": 2,
                "label": "AAAG"
            },
            {
                "source": "spine_1_1_1",
                "target": "tof_1_2_2",
                "value": 3,
                "label": "AAAH"
            },
            {
                "source": "spine_1_1_2",
                "target": "leaf_1_0_1",
                "value": 1,
                "label": "AAAB"
            },
            {
                "source": "spine_1_1_2",
                "target": "leaf_1_0_2",
                "value": 2,
                "label": "AAAE"
            },
            {
                "source": "spine_1_1_2",
                "target": "tof_1_2_1",
                "value": 2,
                "label": "AAAI"
            },
            {
                "source": "spine_1_1_2",
                "target": "tof_1_2_2",
                "value": 3,
                "label": "AAAJ"
            },
            {
                "source": "leaf_2_0_1",
                "target": "spine_2_1_1",
                "value": 2,
                "label": "AAAK"
            },
            {
                "source": "leaf_2_0_1",
                "target": "spine_2_1_2",
                "value": 3,
                "label": "AAAL"
            },
            {
                "source": "leaf_2_0_2",
                "target": "spine_2_1_1",
                "value": 3,
                "label": "AAAN"
            },
            {
                "source": "leaf_2_0_2",
                "target": "spine_2_1_2",
                "value": 3,
                "label": "AAAO"
            },
            {
                "source": "spine_2_1_1",
                "target": "leaf_2_0_1",
                "value": 2,
                "label": "AAAK"
            },
            {
                "source": "spine_2_1_1",
                "target": "leaf_2_0_2",
                "value": 3,
                "label": "AAAN"
            },
            {
                "source": "spine_2_1_1",
                "target": "tof_1_2_1",
                "value": 2,
                "label": "AAAQ"
            },
            {
                "source": "spine_2_1_1",
                "target": "tof_1_2_2",
                "value": 3,
                "label": "AAAR"
            },
            {
                "source": "spine_2_1_2",
                "target": "leaf_2_0_1",
                "value": 3,
                "label": "AAAL"
            },
            {
                "source": "spine_2_1_2",
                "target": "leaf_2_0_2",
                "value": 3,
                "label": "AAAO"
            },
            {
                "source": "spine_2_1_2",
                "target": "tof_1_2_1",
                "value": 2,
                "label": "AAAS"
            },
            {
                "source": "spine_2_1_2",
                "target": "tof_1_2_2",
                "value": 3,
                "label": "AAAT"
            }
        ]
    },
    "max_number_of_rounds": 6,
    "packets_per_round": {
        "0": 0,
        "1": 3,
        "2": 7,
        "3": 11,
        "4": 8,
        "5": 6,
        "6": 2
    },
    "round_graph": {
        "nodes": [
            {
                "id": "spine_2_1_2-2",
                "label": "spine_2_1_2-2"
            },
            {
                "id": "spine_2_1_2-4",
                "label": "spine_2_1_2-4"
            },
            {
                "id": "tof_1_2_1-1",
                "label": "tof_1_2_1-1"
            },
            {
                "id": "leaf_1_0_2-5",
                "label": "leaf_1_0_2-5"
            },
            {
                "id": "spine_1_1_1-4",
                "label": "spine_1_1_1-4"
            },
            {
                "id": "leaf_1_0_2-1",
                "label": "leaf_1_0_2-1"
            },
            {
                "id": "leaf_2_0_2-3",
                "label": "leaf_2_0_2-3"
            },
            {
                "id": "tof_1_2_2-3",
                "label": "tof_1_2_2-3"
            },
            {
                "id": "leaf_1_0_1",
                "label": "leaf_1_0_1"
            },
            {
                "id": "leaf_2_0_2-5",
                "label": "leaf_2_0_2-5"
            },
            {
                "id": "spine_2_1_2-6",
                "label": "spine_2_1_2-6"
            },
            {
                "id": "spine_2_1_1-2",
                "label": "spine_2_1_1-2"
            },
            {
                "id": "spine_1_1_1-0",
                "label": "spine_1_1_1-0"
            },
            {
                "id": "leaf_2_0_1-5",
                "label": "leaf_2_0_1-5"
            },
            {
                "id": "leaf_1_0_1-3",
                "label": "leaf_1_0_1-3"
            },
            {
                "id": "tof_1_2_1-3",
                "label": "tof_1_2_1-3"
            },
            {
                "id": "leaf_2_0_1-3",
                "label": "leaf_2_0_1-3"
            },
            {
                "id": "spine_1_1_2-2",
                "label": "spine_1_1_2-2"
            },
            {
                "id": "tof_1_2_2-1",
                "label": "tof_1_2_2-1"
            },
            {
                "id": "spine_2_1_1-4",
                "label": "spine_2_1_1-4"
            },
            {
                "id": "tof_1_2_2-5",
                "label": "tof_1_2_2-5"
            },
            {
                "id": "leaf_1_0_2-3",
                "label": "leaf_1_0_2-3"
            }
        ],
        "links": [
            {
                "source": "leaf_1_0_1",
                "target": "spine_1_1_1-0",
                "value": 0
            },
            {
                "source": "spine_1_1_1-0",
                "target": "leaf_1_0_2-1",
                "value": 1,
                "label": [
                    {
                        "time": 1621862567.218045,
                        "type": "LSP",
                        "LSP ID": "0100.0000.0002.00-00",
                        "Seq.N": 4,
                        "Orig.": "kathara-spine-1-1-1-de87967a"
                    }
                ]
            },
            {
                "source": "spine_1_1_1-0",
                "target": "tof_1_2_1-1",
                "value": 1,
                "label": [
                    {
                        "time": 1621862567.218086,
                        "type": "LSP",
                        "LSP ID": "0100.0000.0002.00-00",
                        "Seq.N": 4,
                        "Orig.": "kathara-spine-1-1-1-de87967a"
                    }
                ]
            },
            {
                "source": "spine_1_1_1-0",
                "target": "tof_1_2_2-1",
                "value": 1,
                "label": [
                    {
                        "time": 1621862567.218127,
                        "type": "LSP",
                        "LSP ID": "0100.0000.0002.00-00",
                        "Seq.N": 4,
                        "Orig.": "kathara-spine-1-1-1-de87967a"
                    }
                ]
            },
            {
                "source": "leaf_1_0_2-1",
                "target": "spine_1_1_2-2",
                "value": 1,
                "label": [
                    {
                        "time": 1621862567.218516,
                        "type": "LSP",
                        "LSP ID": "0100.0000.0002.00-00",
                        "Seq.N": 4,
                        "Orig.": "kathara-spine-1-1-1-de87967a"
                    }
                ]
            },
            {
                "source": "tof_1_2_1-1",
                "target": "spine_1_1_2-2",
                "value": 1,
                "label": [
                    {
                        "time": 1621862567.218567,
                        "type": "LSP",
                        "LSP ID": "0100.0000.0002.00-00",
                        "Seq.N": 4,
                        "Orig.": "kathara-spine-1-1-1-de87967a"
                    }
                ]
            },
            {
                "source": "tof_1_2_1-1",
                "target": "spine_2_1_1-2",
                "value": 1,
                "label": [
                    {
                        "time": 1621862567.21863,
                        "type": "LSP",
                        "LSP ID": "0100.0000.0002.00-00",
                        "Seq.N": 4,
                        "Orig.": "kathara-spine-1-1-1-de87967a"
                    }
                ]
            },
            {
                "source": "tof_1_2_1-1",
                "target": "spine_2_1_2-2",
                "value": 1,
                "label": [
                    {
                        "time": 1621862567.218661,
                        "type": "LSP",
                        "LSP ID": "0100.0000.0002.00-00",
                        "Seq.N": 4,
                        "Orig.": "kathara-spine-1-1-1-de87967a"
                    }
                ]
            },
            {
                "source": "tof_1_2_2-1",
                "target": "spine_1_1_2-2",
                "value": 1,
                "label": [
                    {
                        "time": 1621862567.218959,
                        "type": "LSP",
                        "LSP ID": "0100.0000.0002.00-00",
                        "Seq.N": 4,
                        "Orig.": "kathara-spine-1-1-1-de87967a"
                    }
                ]
            },
            {
                "source": "tof_1_2_2-1",
                "target": "spine_2_1_1-2",
                "value": 1,
                "label": [
                    {
                        "time": 1621862567.219029,
                        "type": "LSP",
                        "LSP ID": "0100.0000.0002.00-00",
                        "Seq.N": 4,
                        "Orig.": "kathara-spine-1-1-1-de87967a"
                    }
                ]
            },
            {
                "source": "tof_1_2_2-1",
                "target": "spine_2_1_2-2",
                "value": 1,
                "label": [
                    {
                        "time": 1621862567.219063,
                        "type": "LSP",
                        "LSP ID": "0100.0000.0002.00-00",
                        "Seq.N": 4,
                        "Orig.": "kathara-spine-1-1-1-de87967a"
                    }
                ]
            },
            {
                "source": "spine_1_1_2-2",
                "target": "leaf_1_0_1-3",
                "value": 1,
                "label": [
                    {
                        "time": 1621862567.219383,
                        "type": "LSP",
                        "LSP ID": "0100.0000.0002.00-00",
                        "Seq.N": 4,
                        "Orig.": "kathara-spine-1-1-1-de87967a"
                    }
                ]
            },
            {
                "source": "spine_1_1_2-2",
                "target": "tof_1_2_2-3",
                "value": 2,
                "label": [
                    {
                        "time": 1621862567.219411,
                        "type": "LSP",
                        "LSP ID": "0100.0000.0002.00-00",
                        "Seq.N": 4,
                        "Orig.": "kathara-spine-1-1-1-de87967a"
                    },
                    {
                        "time": 1621862567.496661,
                        "type": "LSP",
                        "LSP ID": "0100.0000.0006.00-00",
                        "Seq.N": 4,
                        "Orig.": "kathara-spine-1-1-2-8bea2587"
                    }
                ]
            },
            {
                "source": "spine_1_1_2-2",
                "target": "leaf_1_0_2-3",
                "value": 1,
                "label": [
                    {
                        "time": 1621862567.496559,
                        "type": "LSP",
                        "LSP ID": "0100.0000.0006.00-00",
                        "Seq.N": 4,
                        "Orig.": "kathara-spine-1-1-2-8bea2587"
                    }
                ]
            },
            {
                "source": "spine_1_1_2-2",
                "target": "tof_1_2_1-3",
                "value": 1,
                "label": [
                    {
                        "time": 1621862567.496631,
                        "type": "LSP",
                        "LSP ID": "0100.0000.0006.00-00",
                        "Seq.N": 4,
                        "Orig.": "kathara-spine-1-1-2-8bea2587"
                    }
                ]
            },
            {
                "source": "spine_2_1_1-2",
                "target": "leaf_2_0_1-3",
                "value": 1,
                "label": [
                    {
                        "time": 1621862567.21905,
                        "type": "LSP",
                        "LSP ID": "0100.0000.0002.00-00",
                        "Seq.N": 4,
                        "Orig.": "kathara-spine-1-1-1-de87967a"
                    }
                ]
            },
            {
                "source": "spine_2_1_1-2",
                "target": "leaf_2_0_2-3",
                "value": 1,
                "label": [
                    {
                        "time": 1621862567.219113,
                        "type": "LSP",
                        "LSP ID": "0100.0000.0002.00-00",
                        "Seq.N": 4,
                        "Orig.": "kathara-spine-1-1-1-de87967a"
                    }
                ]
            },
            {
                "source": "spine_2_1_1-2",
                "target": "tof_1_2_2-3",
                "value": 1,
                "label": [
                    {
                        "time": 1621862567.219143,
                        "type": "LSP",
                        "LSP ID": "0100.0000.0002.00-00",
                        "Seq.N": 4,
                        "Orig.": "kathara-spine-1-1-1-de87967a"
                    }
                ]
            },
            {
                "source": "spine_2_1_2-2",
                "target": "leaf_2_0_1-3",
                "value": 1,
                "label": [
                    {
                        "time": 1621862567.219179,
                        "type": "LSP",
                        "LSP ID": "0100.0000.0002.00-00",
                        "Seq.N": 4,
                        "Orig.": "kathara-spine-1-1-1-de87967a"
                    }
                ]
            },
            {
                "source": "spine_2_1_2-2",
                "target": "leaf_2_0_2-3",
                "value": 1,
                "label": [
                    {
                        "time": 1621862567.219218,
                        "type": "LSP",
                        "LSP ID": "0100.0000.0002.00-00",
                        "Seq.N": 4,
                        "Orig.": "kathara-spine-1-1-1-de87967a"
                    }
                ]
            },
            {
                "source": "spine_2_1_2-2",
                "target": "tof_1_2_2-3",
                "value": 1,
                "label": [
                    {
                        "time": 1621862567.219238,
                        "type": "LSP",
                        "LSP ID": "0100.0000.0002.00-00",
                        "Seq.N": 4,
                        "Orig.": "kathara-spine-1-1-1-de87967a"
                    }
                ]
            },
            {
                "source": "tof_1_2_2-3",
                "target": "spine_1_1_1-4",
                "value": 1,
                "label": [
                    {
                        "time": 1621862567.497299,
                        "type": "LSP",
                        "LSP ID": "0100.0000.0006.00-00",
                        "Seq.N": 4,
                        "Orig.": "kathara-spine-1-1-2-8bea2587"
                    }
                ]
            },
            {
                "source": "tof_1_2_2-3",
                "target": "spine_2_1_1-4",
                "value": 1,
                "label": [
                    {
                        "time": 1621862567.49735,
                        "type": "LSP",
                        "LSP ID": "0100.0000.0006.00-00",
                        "Seq.N": 4,
                        "Orig.": "kathara-spine-1-1-2-8bea2587"
                    }
                ]
            },
            {
                "source": "tof_1_2_2-3",
                "target": "spine_2_1_2-4",
                "value": 1,
                "label": [
                    {
                        "time": 1621862567.497367,
                        "type": "LSP",
                        "LSP ID": "0100.0000.0006.00-00",
                        "Seq.N": 4,
                        "Orig.": "kathara-spine-1-1-2-8bea2587"
                    }
                ]
            },
            {
                "source": "leaf_1_0_2-3",
                "target": "spine_1_1_1-4",
                "value": 1,
                "label": [
                    {
                        "time": 1621862567.497098,
                        "type": "LSP",
                        "LSP ID": "0100.0000.0006.00-00",
                        "Seq.N": 4,
                        "Orig.": "kathara-spine-1-1-2-8bea2587"
                    }
                ]
            },
            {
                "source": "tof_1_2_1-3",
                "target": "spine_1_1_1-4",
                "value": 1,
                "label": [
                    {
                        "time": 1621862567.497056,
                        "type": "LSP",
                        "LSP ID": "0100.0000.0006.00-00",
                        "Seq.N": 4,
                        "Orig.": "kathara-spine-1-1-2-8bea2587"
                    }
                ]
            },
            {
                "source": "tof_1_2_1-3",
                "target": "spine_2_1_1-4",
                "value": 1,
                "label": [
                    {
                        "time": 1621862567.497107,
                        "type": "LSP",
                        "LSP ID": "0100.0000.0006.00-00",
                        "Seq.N": 4,
                        "Orig.": "kathara-spine-1-1-2-8bea2587"
                    }
                ]
            },
            {
                "source": "tof_1_2_1-3",
                "target": "spine_2_1_2-4",
                "value": 1,
                "label": [
                    {
                        "time": 1621862567.497138,
                        "type": "LSP",
                        "LSP ID": "0100.0000.0006.00-00",
                        "Seq.N": 4,
                        "Orig.": "kathara-spine-1-1-2-8bea2587"
                    }
                ]
            },
            {
                "source": "leaf_2_0_2-3",
                "target": "spine_2_1_1-4",
                "value": 1,
                "label": [
                    {
                        "time": 1621862567.219787,
                        "type": "LSP",
                        "LSP ID": "0100.0000.0002.00-00",
                        "Seq.N": 4,
                        "Orig.": "kathara-spine-1-1-1-de87967a"
                    }
                ]
            },
            {
                "source": "spine_1_1_1-4",
                "target": "leaf_1_0_2-5",
                "value": 1,
                "label": [
                    {
                        "time": 1621862567.497508,
                        "type": "LSP",
                        "LSP ID": "0100.0000.0006.00-00",
                        "Seq.N": 4,
                        "Orig.": "kathara-spine-1-1-2-8bea2587"
                    }
                ]
            },
            {
                "source": "spine_1_1_1-4",
                "target": "tof_1_2_2-5",
                "value": 1,
                "label": [
                    {
                        "time": 1621862567.497566,
                        "type": "LSP",
                        "LSP ID": "0100.0000.0006.00-00",
                        "Seq.N": 4,
                        "Orig.": "kathara-spine-1-1-2-8bea2587"
                    }
                ]
            },
            {
                "source": "spine_2_1_1-4",
                "target": "leaf_2_0_1-5",
                "value": 1,
                "label": [
                    {
                        "time": 1621862567.497351,
                        "type": "LSP",
                        "LSP ID": "0100.0000.0006.00-00",
                        "Seq.N": 4,
                        "Orig.": "kathara-spine-1-1-2-8bea2587"
                    }
                ]
            },
            {
                "source": "spine_2_1_1-4",
                "target": "leaf_2_0_2-5",
                "value": 1,
                "label": [
                    {
                        "time": 1621862567.49738,
                        "type": "LSP",
                        "LSP ID": "0100.0000.0006.00-00",
                        "Seq.N": 4,
                        "Orig.": "kathara-spine-1-1-2-8bea2587"
                    }
                ]
            },
            {
                "source": "spine_2_1_2-4",
                "target": "leaf_2_0_1-5",
                "value": 1,
                "label": [
                    {
                        "time": 1621862567.497969,
                        "type": "LSP",
                        "LSP ID": "0100.0000.0006.00-00",
                        "Seq.N": 4,
                        "Orig.": "kathara-spine-1-1-2-8bea2587"
                    }
                ]
            },
            {
                "source": "spine_2_1_2-4",
                "target": "leaf_2_0_2-5",
                "value": 1,
                "label": [
                    {
                        "time": 1621862567.498032,
                        "type": "LSP",
                        "LSP ID": "0100.0000.0006.00-00",
                        "Seq.N": 4,
                        "Orig.": "kathara-spine-1-1-2-8bea2587"
                    }
                ]
            },
            {
                "source": "leaf_2_0_1-5",
                "target": "spine_2_1_2-6",
                "value": 1,
                "label": [
                    {
                        "time": 1621862567.498351,
                        "type": "LSP",
                        "LSP ID": "0100.0000.0006.00-00",
                        "Seq.N": 4,
                        "Orig.": "kathara-spine-1-1-2-8bea2587"
                    }
                ]
            },
            {
                "source": "leaf_2_0_2-5",
                "target": "spine_2_1_2-6",
                "value": 1,
                "label": [
                    {
                        "time": 1621862567.498041,
                        "type": "LSP",
                        "LSP ID": "0100.0000.0006.00-00",
                        "Seq.N": 4,
                        "Orig.": "kathara-spine-1-1-2-8bea2587"
                    }
                ]
            }
        ]
    },
    "logical_time_plot": {
        "points": {
            "spine_1_1_1": {
                "1": {
                    "time": 1621862567.218045,
                    "type": "LSP",
                    "LSP ID": "0100.0000.0002.00-00",
                    "Seq.N": 4,
                    "Orig.": "kathara-spine-1-1-1-de87967a",
                    "Logical Clock": 1
                },
                "2": {
                    "time": 1621862567.218086,
                    "type": "LSP",
                    "LSP ID": "0100.0000.0002.00-00",
                    "Seq.N": 4,
                    "Orig.": "kathara-spine-1-1-1-de87967a",
                    "Logical Clock": 2
                },
                "3": {
                    "time": 1621862567.218127,
                    "type": "LSP",
                    "LSP ID": "0100.0000.0002.00-00",
                    "Seq.N": 4,
                    "Orig.": "kathara-spine-1-1-1-de87967a",
                    "Logical Clock": 3
                },
                "16": {
                    "time": 1621862567.497311,
                    "type": "LSP",
                    "LSP ID": "0100.0000.0006.00-00",
                    "Seq.N": 4,
                    "Orig.": "kathara-spine-1-1-2-8bea2587",
                    "Logical Clock": 16
                },
                "17": {
                    "time": 1621862567.497416,
                    "type": "LSP",
                    "LSP ID": "0100.0000.0006.00-00",
                    "Seq.N": 4,
                    "Orig.": "kathara-spine-1-1-2-8bea2587",
                    "Logical Clock": 17
                },
                "18": {
                    "time": 1621862567.497065,
                    "type": "LSP",
                    "LSP ID": "0100.0000.0006.00-00",
                    "Seq.N": 4,
                    "Orig.": "kathara-spine-1-1-2-8bea2587",
                    "Logical Clock": 18
                },
                "19": {
                    "time": 1621862567.497508,
                    "type": "LSP",
                    "LSP ID": "0100.0000.0006.00-00",
                    "Seq.N": 4,
                    "Orig.": "kathara-spine-1-1-2-8bea2587",
                    "Logical Clock": 19
                },
                "20": {
                    "time": 1621862567.497566,
                    "type": "LSP",
                    "LSP ID": "0100.0000.0006.00-00",
                    "Seq.N": 4,
                    "Orig.": "kathara-spine-1-1-2-8bea2587",
                    "Logical Clock": 20
                }
            },
            "leaf_1_0_2": {
                "2": {
                    "time": 1621862567.218177,
                    "type": "LSP",
                    "LSP ID": "0100.0000.0002.00-00",
                    "Seq.N": 4,
                    "Orig.": "kathara-spine-1-1-1-de87967a",
                    "Logical Clock": 2
                },
                "3": {
                    "time": 1621862567.218516,
                    "type": "LSP",
                    "LSP ID": "0100.0000.0002.00-00",
                    "Seq.N": 4,
                    "Orig.": "kathara-spine-1-1-1-de87967a",
                    "Logical Clock": 3
                },
                "10": {
                    "time": 1621862567.496772,
                    "type": "LSP",
                    "LSP ID": "0100.0000.0006.00-00",
                    "Seq.N": 4,
                    "Orig.": "kathara-spine-1-1-2-8bea2587",
                    "Logical Clock": 10
                },
                "11": {
                    "time": 1621862567.497098,
                    "type": "LSP",
                    "LSP ID": "0100.0000.0006.00-00",
                    "Seq.N": 4,
                    "Orig.": "kathara-spine-1-1-2-8bea2587",
                    "Logical Clock": 11
                },
                "20": {
                    "time": 1621862567.497587,
                    "type": "LSP",
                    "LSP ID": "0100.0000.0006.00-00",
                    "Seq.N": 4,
                    "Orig.": "kathara-spine-1-1-2-8bea2587",
                    "Logical Clock": 20
                }
            },
            "tof_1_2_1": {
                "3": {
                    "time": 1621862567.218091,
                    "type": "LSP",
                    "LSP ID": "0100.0000.0002.00-00",
                    "Seq.N": 4,
                    "Orig.": "kathara-spine-1-1-1-de87967a",
                    "Logical Clock": 3
                },
                "4": {
                    "time": 1621862567.218567,
                    "type": "LSP",
                    "LSP ID": "0100.0000.0002.00-00",
                    "Seq.N": 4,
                    "Orig.": "kathara-spine-1-1-1-de87967a",
                    "Logical Clock": 4
                },
                "5": {
                    "time": 1621862567.21863,
                    "type": "LSP",
                    "LSP ID": "0100.0000.0002.00-00",
                    "Seq.N": 4,
                    "Orig.": "kathara-spine-1-1-1-de87967a",
                    "Logical Clock": 5
                },
                "6": {
                    "time": 1621862567.218661,
                    "type": "LSP",
                    "LSP ID": "0100.0000.0002.00-00",
                    "Seq.N": 4,
                    "Orig.": "kathara-spine-1-1-1-de87967a",
                    "Logical Clock": 6
                },
                "11": {
                    "time": 1621862567.496851,
                    "type": "LSP",
                    "LSP ID": "0100.0000.0006.00-00",
                    "Seq.N": 4,
                    "Orig.": "kathara-spine-1-1-2-8bea2587",
                    "Logical Clock": 11
                },
                "12": {
                    "time": 1621862567.497056,
                    "type": "LSP",
                    "LSP ID": "0100.0000.0006.00-00",
                    "Seq.N": 4,
                    "Orig.": "kathara-spine-1-1-2-8bea2587",
                    "Logical Clock": 12
                },
                "13": {
                    "time": 1621862567.497107,
                    "type": "LSP",
                    "LSP ID": "0100.0000.0006.00-00",
                    "Seq.N": 4,
                    "Orig.": "kathara-spine-1-1-2-8bea2587",
                    "Logical Clock": 13
                },
                "14": {
                    "time": 1621862567.497138,
                    "type": "LSP",
                    "LSP ID": "0100.0000.0006.00-00",
                    "Seq.N": 4,
                    "Orig.": "kathara-spine-1-1-2-8bea2587",
                    "Logical Clock": 14
                }
            },
            "tof_1_2_2": {
                "4": {
                    "time": 1621862567.218529,
                    "type": "LSP",
                    "LSP ID": "0100.0000.0002.00-00",
                    "Seq.N": 4,
                    "Orig.": "kathara-spine-1-1-1-de87967a",
                    "Logical Clock": 4
                },
                "5": {
                    "time": 1621862567.218959,
                    "type": "LSP",
                    "LSP ID": "0100.0000.0002.00-00",
                    "Seq.N": 4,
                    "Orig.": "kathara-spine-1-1-1-de87967a",
                    "Logical Clock": 5
                },
                "6": {
                    "time": 1621862567.219029,
                    "type": "LSP",
                    "LSP ID": "0100.0000.0002.00-00",
                    "Seq.N": 4,
                    "Orig.": "kathara-spine-1-1-1-de87967a",
                    "Logical Clock": 6
                },
                "7": {
                    "time": 1621862567.219063,
                    "type": "LSP",
                    "LSP ID": "0100.0000.0002.00-00",
                    "Seq.N": 4,
                    "Orig.": "kathara-spine-1-1-1-de87967a",
                    "Logical Clock": 7
                },
                "9": {
                    "time": 1621862567.21977,
                    "type": "LSP",
                    "LSP ID": "0100.0000.0002.00-00",
                    "Seq.N": 4,
                    "Orig.": "kathara-spine-1-1-1-de87967a",
                    "Logical Clock": 9
                },
                "12": {
                    "time": 1621862567.4971,
                    "type": "LSP",
                    "LSP ID": "0100.0000.0006.00-00",
                    "Seq.N": 4,
                    "Orig.": "kathara-spine-1-1-2-8bea2587",
                    "Logical Clock": 12
                },
                "13": {
                    "time": 1621862567.219767,
                    "type": "LSP",
                    "LSP ID": "0100.0000.0002.00-00",
                    "Seq.N": 4,
                    "Orig.": "kathara-spine-1-1-1-de87967a",
                    "Logical Clock": 13
                },
                "14": {
                    "time": 1621862567.219666,
                    "type": "LSP",
                    "LSP ID": "0100.0000.0002.00-00",
                    "Seq.N": 4,
                    "Orig.": "kathara-spine-1-1-1-de87967a",
                    "Logical Clock": 14
                },
                "15": {
                    "time": 1621862567.497299,
                    "type": "LSP",
                    "LSP ID": "0100.0000.0006.00-00",
                    "Seq.N": 4,
                    "Orig.": "kathara-spine-1-1-2-8bea2587",
                    "Logical Clock": 15
                },
                "16": {
                    "time": 1621862567.49735,
                    "type": "LSP",
                    "LSP ID": "0100.0000.0006.00-00",
                    "Seq.N": 4,
                    "Orig.": "kathara-spine-1-1-2-8bea2587",
                    "Logical Clock": 16
                },
                "17": {
                    "time": 1621862567.497367,
                    "type": "LSP",
                    "LSP ID": "0100.0000.0006.00-00",
                    "Seq.N": 4,
                    "Orig.": "kathara-spine-1-1-2-8bea2587",
                    "Logical Clock": 17
                },
                "21": {
                    "time": 1621862567.497894,
                    "type": "LSP",
                    "LSP ID": "0100.0000.0006.00-00",
                    "Seq.N": 4,
                    "Orig.": "kathara-spine-1-1-2-8bea2587",
                    "Logical Clock": 21
                }
            },
            "spine_1_1_2": {
                "4": {
                    "time": 1621862567.218971,
                    "type": "LSP",
                    "LSP ID": "0100.0000.0002.00-00",
                    "Seq.N": 4,
                    "Orig.": "kathara-spine-1-1-1-de87967a",
                    "Logical Clock": 4
                },
                "5": {
                    "time": 1621862567.218911,
                    "type": "LSP",
                    "LSP ID": "0100.0000.0002.00-00",
                    "Seq.N": 4,
                    "Orig.": "kathara-spine-1-1-1-de87967a",
                    "Logical Clock": 5
                },
                "6": {
                    "time": 1621862567.219128,
                    "type": "LSP",
                    "LSP ID": "0100.0000.0002.00-00",
                    "Seq.N": 4,
                    "Orig.": "kathara-spine-1-1-1-de87967a",
                    "Logical Clock": 6
                },
                "7": {
                    "time": 1621862567.219383,
                    "type": "LSP",
                    "LSP ID": "0100.0000.0002.00-00",
                    "Seq.N": 4,
                    "Orig.": "kathara-spine-1-1-1-de87967a",
                    "Logical Clock": 7
                },
                "8": {
                    "time": 1621862567.219411,
                    "type": "LSP",
                    "LSP ID": "0100.0000.0002.00-00",
                    "Seq.N": 4,
                    "Orig.": "kathara-spine-1-1-1-de87967a",
                    "Logical Clock": 8
                },
                "9": {
                    "time": 1621862567.496559,
                    "type": "LSP",
                    "LSP ID": "0100.0000.0006.00-00",
                    "Seq.N": 4,
                    "Orig.": "kathara-spine-1-1-2-8bea2587",
                    "Logical Clock": 9
                },
                "10": {
                    "time": 1621862567.496631,
                    "type": "LSP",
                    "LSP ID": "0100.0000.0006.00-00",
                    "Seq.N": 4,
                    "Orig.": "kathara-spine-1-1-2-8bea2587",
                    "Logical Clock": 10
                },
                "11": {
                    "time": 1621862567.496661,
                    "type": "LSP",
                    "LSP ID": "0100.0000.0006.00-00",
                    "Seq.N": 4,
                    "Orig.": "kathara-spine-1-1-2-8bea2587",
                    "Logical Clock": 11
                }
            },
            "spine_2_1_1": {
                "6": {
                    "time": 1621862567.218721,
                    "type": "LSP",
                    "LSP ID": "0100.0000.0002.00-00",
                    "Seq.N": 4,
                    "Orig.": "kathara-spine-1-1-1-de87967a",
                    "Logical Clock": 6
                },
                "7": {
                    "time": 1621862567.218907,
                    "type": "LSP",
                    "LSP ID": "0100.0000.0002.00-00",
                    "Seq.N": 4,
                    "Orig.": "kathara-spine-1-1-1-de87967a",
                    "Logical Clock": 7
                },
                "8": {
                    "time": 1621862567.21905,
                    "type": "LSP",
                    "LSP ID": "0100.0000.0002.00-00",
                    "Seq.N": 4,
                    "Orig.": "kathara-spine-1-1-1-de87967a",
                    "Logical Clock": 8
                },
                "9": {
                    "time": 1621862567.219113,
                    "type": "LSP",
                    "LSP ID": "0100.0000.0002.00-00",
                    "Seq.N": 4,
                    "Orig.": "kathara-spine-1-1-1-de87967a",
                    "Logical Clock": 9
                },
                "10": {
                    "time": 1621862567.219143,
                    "type": "LSP",
                    "LSP ID": "0100.0000.0002.00-00",
                    "Seq.N": 4,
                    "Orig.": "kathara-spine-1-1-1-de87967a",
                    "Logical Clock": 10
                },
                "17": {
                    "time": 1621862567.497147,
                    "type": "LSP",
                    "LSP ID": "0100.0000.0006.00-00",
                    "Seq.N": 4,
                    "Orig.": "kathara-spine-1-1-2-8bea2587",
                    "Logical Clock": 17
                },
                "18": {
                    "time": 1621862567.497144,
                    "type": "LSP",
                    "LSP ID": "0100.0000.0006.00-00",
                    "Seq.N": 4,
                    "Orig.": "kathara-spine-1-1-2-8bea2587",
                    "Logical Clock": 18
                },
                "19": {
                    "time": 1621862567.220349,
                    "type": "LSP",
                    "LSP ID": "0100.0000.0002.00-00",
                    "Seq.N": 4,
                    "Orig.": "kathara-spine-1-1-1-de87967a",
                    "Logical Clock": 19
                },
                "20": {
                    "time": 1621862567.497351,
                    "type": "LSP",
                    "LSP ID": "0100.0000.0006.00-00",
                    "Seq.N": 4,
                    "Orig.": "kathara-spine-1-1-2-8bea2587",
                    "Logical Clock": 20
                },
                "21": {
                    "time": 1621862567.49738,
                    "type": "LSP",
                    "LSP ID": "0100.0000.0006.00-00",
                    "Seq.N": 4,
                    "Orig.": "kathara-spine-1-1-2-8bea2587",
                    "Logical Clock": 21
                }
            },
            "spine_2_1_2": {
                "7": {
                    "time": 1621862567.21891,
                    "type": "LSP",
                    "LSP ID": "0100.0000.0002.00-00",
                    "Seq.N": 4,
                    "Orig.": "kathara-spine-1-1-1-de87967a",
                    "Logical Clock": 7
                },
                "8": {
                    "time": 1621862567.219057,
                    "type": "LSP",
                    "LSP ID": "0100.0000.0002.00-00",
                    "Seq.N": 4,
                    "Orig.": "kathara-spine-1-1-1-de87967a",
                    "Logical Clock": 8
                },
                "9": {
                    "time": 1621862567.219179,
                    "type": "LSP",
                    "LSP ID": "0100.0000.0002.00-00",
                    "Seq.N": 4,
                    "Orig.": "kathara-spine-1-1-1-de87967a",
                    "Logical Clock": 9
                },
                "10": {
                    "time": 1621862567.219218,
                    "type": "LSP",
                    "LSP ID": "0100.0000.0002.00-00",
                    "Seq.N": 4,
                    "Orig.": "kathara-spine-1-1-1-de87967a",
                    "Logical Clock": 10
                },
                "11": {
                    "time": 1621862567.219238,
                    "type": "LSP",
                    "LSP ID": "0100.0000.0002.00-00",
                    "Seq.N": 4,
                    "Orig.": "kathara-spine-1-1-1-de87967a",
                    "Logical Clock": 11
                },
                "18": {
                    "time": 1621862567.497513,
                    "type": "LSP",
                    "LSP ID": "0100.0000.0006.00-00",
                    "Seq.N": 4,
                    "Orig.": "kathara-spine-1-1-2-8bea2587",
                    "Logical Clock": 18
                },
                "19": {
                    "time": 1621862567.497505,
                    "type": "LSP",
                    "LSP ID": "0100.0000.0006.00-00",
                    "Seq.N": 4,
                    "Orig.": "kathara-spine-1-1-2-8bea2587",
                    "Logical Clock": 19
                },
                "20": {
                    "time": 1621862567.497969,
                    "type": "LSP",
                    "LSP ID": "0100.0000.0006.00-00",
                    "Seq.N": 4,
                    "Orig.": "kathara-spine-1-1-2-8bea2587",
                    "Logical Clock": 20
                },
                "21": {
                    "time": 1621862567.498032,
                    "type": "LSP",
                    "LSP ID": "0100.0000.0006.00-00",
                    "Seq.N": 4,
                    "Orig.": "kathara-spine-1-1-2-8bea2587",
                    "Logical Clock": 21
                },
                "24": {
                    "time": 1621862567.498451,
                    "type": "LSP",
                    "LSP ID": "0100.0000.0006.00-00",
                    "Seq.N": 4,
                    "Orig.": "kathara-spine-1-1-2-8bea2587",
                    "Logical Clock": 24
                },
                "25": {
                    "time": 1621862567.498343,
                    "type": "LSP",
                    "LSP ID": "0100.0000.0006.00-00",
                    "Seq.N": 4,
                    "Orig.": "kathara-spine-1-1-2-8bea2587",
                    "Logical Clock": 25
                }
            },
            "leaf_2_0_1": {
                "9": {
                    "time": 1621862567.219648,
                    "type": "LSP",
                    "LSP ID": "0100.0000.0002.00-00",
                    "Seq.N": 4,
                    "Orig.": "kathara-spine-1-1-1-de87967a",
                    "Logical Clock": 9
                },
                "10": {
                    "time": 1621862567.219622,
                    "type": "LSP",
                    "LSP ID": "0100.0000.0002.00-00",
                    "Seq.N": 4,
                    "Orig.": "kathara-spine-1-1-1-de87967a",
                    "Logical Clock": 10
                },
                "21": {
                    "time": 1621862567.497872,
                    "type": "LSP",
                    "LSP ID": "0100.0000.0006.00-00",
                    "Seq.N": 4,
                    "Orig.": "kathara-spine-1-1-2-8bea2587",
                    "Logical Clock": 21
                },
                "22": {
                    "time": 1621862567.498251,
                    "type": "LSP",
                    "LSP ID": "0100.0000.0006.00-00",
                    "Seq.N": 4,
                    "Orig.": "kathara-spine-1-1-2-8bea2587",
                    "Logical Clock": 22
                },
                "23": {
                    "time": 1621862567.498351,
                    "type": "LSP",
                    "LSP ID": "0100.0000.0006.00-00",
                    "Seq.N": 4,
                    "Orig.": "kathara-spine-1-1-2-8bea2587",
                    "Logical Clock": 23
                }
            },
            "leaf_2_0_2": {
                "10": {
                    "time": 1621862567.219501,
                    "type": "LSP",
                    "LSP ID": "0100.0000.0002.00-00",
                    "Seq.N": 4,
                    "Orig.": "kathara-spine-1-1-1-de87967a",
                    "Logical Clock": 10
                },
                "11": {
                    "time": 1621862567.219469,
                    "type": "LSP",
                    "LSP ID": "0100.0000.0002.00-00",
                    "Seq.N": 4,
                    "Orig.": "kathara-spine-1-1-1-de87967a",
                    "Logical Clock": 11
                },
                "12": {
                    "time": 1621862567.219787,
                    "type": "LSP",
                    "LSP ID": "0100.0000.0002.00-00",
                    "Seq.N": 4,
                    "Orig.": "kathara-spine-1-1-1-de87967a",
                    "Logical Clock": 12
                },
                "22": {
                    "time": 1621862567.497745,
                    "type": "LSP",
                    "LSP ID": "0100.0000.0006.00-00",
                    "Seq.N": 4,
                    "Orig.": "kathara-spine-1-1-2-8bea2587",
                    "Logical Clock": 22
                },
                "23": {
                    "time": 1621862567.498164,
                    "type": "LSP",
                    "LSP ID": "0100.0000.0006.00-00",
                    "Seq.N": 4,
                    "Orig.": "kathara-spine-1-1-2-8bea2587",
                    "Logical Clock": 23
                },
                "24": {
                    "time": 1621862567.498041,
                    "type": "LSP",
                    "LSP ID": "0100.0000.0006.00-00",
                    "Seq.N": 4,
                    "Orig.": "kathara-spine-1-1-2-8bea2587",
                    "Logical Clock": 24
                }
            }
        },
        "edges": [
            [
                [
                    "spine_1_1_1",
                    1
                ],
                [
                    "leaf_1_0_2",
                    2
                ]
            ],
            [
                [
                    "spine_1_1_1",
                    2
                ],
                [
                    "tof_1_2_1",
                    3
                ]
            ],
            [
                [
                    "spine_1_1_1",
                    3
                ],
                [
                    "tof_1_2_2",
                    4
                ]
            ],
            [
                [
                    "leaf_1_0_2",
                    3
                ],
                [
                    "spine_1_1_2",
                    4
                ]
            ],
            [
                [
                    "tof_1_2_1",
                    4
                ],
                [
                    "spine_1_1_2",
                    5
                ]
            ],
            [
                [
                    "tof_1_2_1",
                    5
                ],
                [
                    "spine_2_1_1",
                    6
                ]
            ],
            [
                [
                    "tof_1_2_1",
                    6
                ],
                [
                    "spine_2_1_2",
                    7
                ]
            ],
            [
                [
                    "tof_1_2_2",
                    5
                ],
                [
                    "spine_1_1_2",
                    6
                ]
            ],
            [
                [
                    "tof_1_2_2",
                    6
                ],
                [
                    "spine_2_1_1",
                    7
                ]
            ],
            [
                [
                    "tof_1_2_2",
                    7
                ],
                [
                    "spine_2_1_2",
                    8
                ]
            ],
            [
                [
                    "spine_1_1_2",
                    7
                ],
                [
                    "leaf_1_0_1",
                    null
                ]
            ],
            [
                [
                    "spine_1_1_2",
                    8
                ],
                [
                    "tof_1_2_2",
                    9
                ]
            ],
            [
                [
                    "spine_1_1_2",
                    9
                ],
                [
                    "leaf_1_0_2",
                    10
                ]
            ],
            [
                [
                    "spine_1_1_2",
                    10
                ],
                [
                    "tof_1_2_1",
                    11
                ]
            ],
            [
                [
                    "spine_1_1_2",
                    11
                ],
                [
                    "tof_1_2_2",
                    12
                ]
            ],
            [
                [
                    "spine_2_1_1",
                    8
                ],
                [
                    "leaf_2_0_1",
                    9
                ]
            ],
            [
                [
                    "spine_2_1_1",
                    9
                ],
                [
                    "leaf_2_0_2",
                    10
                ]
            ],
            [
                [
                    "spine_2_1_1",
                    10
                ],
                [
                    "tof_1_2_2",
                    13
                ]
            ],
            [
                [
                    "spine_2_1_2",
                    9
                ],
                [
                    "leaf_2_0_1",
                    10
                ]
            ],
            [
                [
                    "spine_2_1_2",
                    10
                ],
                [
                    "leaf_2_0_2",
                    11
                ]
            ],
            [
                [
                    "spine_2_1_2",
                    11
                ],
                [
                    "tof_1_2_2",
                    14
                ]
            ],
            [
                [
                    "tof_1_2_2",
                    15
                ],
                [
                    "spine_1_1_1",
                    16
                ]
            ],
            [
                [
                    "tof_1_2_2",
                    16
                ],
                [
                    "spine_2_1_1",
                    17
                ]
            ],
            [
                [
                    "tof_1_2_2",
                    17
                ],
                [
                    "spine_2_1_2",
                    18
                ]
            ],
            [
                [
                    "leaf_1_0_2",
                    11
                ],
                [
                    "spine_1_1_1",
                    17
                ]
            ],
            [
                [
                    "tof_1_2_1",
                    12
                ],
                [
                    "spine_1_1_1",
                    18
                ]
            ],
            [
                [
                    "tof_1_2_1",
                    13
                ],
                [
                    "spine_2_1_1",
                    18
                ]
            ],
            [
                [
                    "tof_1_2_1",
                    14
                ],
                [
                    "spine_2_1_2",
                    19
                ]
            ],
            [
                [
                    "leaf_2_0_2",
                    12
                ],
                [
                    "spine_2_1_1",
                    19
                ]
            ],
            [
                [
                    "spine_1_1_1",
                    19
                ],
                [
                    "leaf_1_0_2",
                    20
                ]
            ],
            [
                [
                    "spine_1_1_1",
                    20
                ],
                [
                    "tof_1_2_2",
                    21
                ]
            ],
            [
                [
                    "spine_2_1_1",
                    20
                ],
                [
                    "leaf_2_0_1",
                    21
                ]
            ],
            [
                [
                    "spine_2_1_1",
                    21
                ],
                [
                    "leaf_2_0_2",
                    22
                ]
            ],
            [
                [
                    "spine_2_1_2",
                    20
                ],
                [
                    "leaf_2_0_1",
                    22
                ]
            ],
            [
                [
                    "spine_2_1_2",
                    21
                ],
                [
                    "leaf_2_0_2",
                    23
                ]
            ],
            [
                [
                    "leaf_2_0_1",
                    23
                ],
                [
                    "spine_2_1_2",
                    24
                ]
            ],
            [
                [
                    "leaf_2_0_2",
                    24
                ],
                [
                    "spine_2_1_2",
                    25
                ]
            ]
        ]
    },
    "max_scalar_clock": 25
}