{
    "k_leaf": 10,
    "k_top": 10,
    "redundancy_factor": 10,
    "is_k8s": true,
    "machine_mac_addresses": {
        "leaf_1_0_1": {
            "net0": "d2:0b:05:67:97:8c",
            "net1": "ee:b7:9b:4e:15:2f",
            "net10": "d2:d9:ef:1a:5c:c6",
            "net2": "a6:af:0e:8c:23:3a",
            "net3": "5a:45:73:49:b4:81",
            "net4": "5e:e3:44:b6:c1:e4",
            "net5": "96:fa:e3:79:b2:c3",
            "net6": "da:c0:fd:4c:41:40",
            "net7": "62:1a:17:84:13:86",
            "net8": "ea:3e:8c:1e:e7:e5",
            "net9": "d2:5c:c4:25:fb:13"
        },
        "leaf_1_0_10": {
            "net0": "0e:7f:e3:5b:a3:72",
            "net1": "36:7c:70:0b:f5:60",
            "net10": "5e:75:91:6e:9e:04",
            "net2": "e2:4a:a3:2f:3b:c2",
            "net3": "fe:d0:07:c2:1c:df",
            "net4": "e2:b7:c2:77:e8:1f",
            "net5": "96:00:8c:a6:75:be",
            "net6": "e2:00:89:21:a2:c4",
            "net7": "f6:32:77:8d:92:00",
            "net8": "86:4a:f7:a5:3c:4a",
            "net9": "c6:a4:09:36:bc:cf"
        },
        "leaf_1_0_2": {
            "net0": "4a:ff:63:e6:ca:b6",
            "net1": "fe:7a:a6:0b:6b:c3",
            "net10": "8a:47:a8:e5:23:ee",
            "net2": "3e:b3:84:d0:cd:80",
            "net3": "6e:87:3b:3a:87:7c",
            "net4": "c6:f3:36:fb:ce:de",
            "net5": "da:55:2c:e6:9f:d9",
            "net6": "ea:0d:ba:97:e4:af",
            "net7": "de:34:fc:62:f4:aa",
            "net8": "f6:34:5e:e3:b9:b7",
            "net9": "4a:d2:32:50:6e:f9"
        },
        "leaf_1_0_3": {
            "net0": "82:a6:98:a9:1d:51",
            "net1": "7a:51:bb:4b:e6:80",
            "net10": "b2:64:95:8d:7f:59",
            "net2": "22:a9:4c:05:b1:de",
            "net3": "56:49:79:4e:de:2a",
            "net4": "4e:f6:e7:40:eb:4f",
            "net5": "42:1f:a6:66:86:1f",
            "net6": "c2:95:7a:b9:e8:f9",
            "net7": "de:a6:58:61:a2:8c",
            "net8": "12:db:b9:de:a3:2b",
            "net9": "7e:2b:13:37:3a:a9"
        },
        "leaf_1_0_4": {
            "net0": "fa:f3:f6:85:7e:39",
            "net1": "2e:00:93:18:19:89",
            "net10": "ce:05:db:9d:5e:02",
            "net2": "ea:5f:b8:ef:5e:81",
            "net3": "46:db:70:6a:0a:f7",
            "net4": "66:97:b3:07:cb:79",
            "net5": "b2:1e:13:65:bb:c8",
            "net6": "2e:5a:ad:86:7d:e2",
            "net7": "86:b4:7d:90:74:8f",
            "net8": "3a:ae:87:fb:7a:29",
            "net9": "c2:0c:20:99:43:19"
        },
        "leaf_1_0_5": {
            "net0": "16:67:c0:ae:a8:ab",
            "net1": "da:26:37:19:12:83",
            "net10": "1e:6d:56:a2:00:38",
            "net2": "72:ea:06:8a:00:0d",
            "net3": "2a:ad:f5:9b:bc:28",
            "net4": "c2:26:53:bb:22:3f",
            "net5": "a2:a4:ee:5e:7b:0b",
            "net6": "be:48:31:53:c6:00",
            "net7": "de:51:36:62:30:f6",
            "net8": "f2:1e:20:3c:82:58",
            "net9": "16:65:bf:c5:85:cd"
        },
        "leaf_1_0_6": {
            "net0": "56:8c:a7:4c:43:c6",
            "net1": "d6:27:33:ea:da:e5",
            "net10": "ae:d6:53:92:bb:ab",
            "net2": "ae:53:f4:fc:b7:a5",
            "net3": "66:49:e7:08:ac:55",
            "net4": "c2:9c:5e:48:df:08",
            "net5": "62:2d:19:ec:ba:54",
            "net6": "42:4b:6d:d2:84:23",
            "net7": "fa:4b:69:b8:42:f2",
            "net8": "d2:d3:3e:a5:03:f5",
            "net9": "2e:00:b8:61:49:86"
        },
        "leaf_1_0_7": {
            "net0": "8a:d8:6e:7e:82:01",
            "net1": "f6:d3:93:80:88:44",
            "net10": "ce:4c:b3:0f:f3:c6",
            "net2": "fa:22:8e:9e:56:5d",
            "net3": "1e:0d:8d:c9:a5:89",
            "net4": "fe:16:61:9d:19:53",
            "net5": "7e:5c:75:48:7f:3c",
            "net6": "22:e6:e5:08:7c:70",
            "net7": "da:87:c0:7e:d3:53",
            "net8": "e6:1d:e6:d9:81:df",
            "net9": "e6:02:a7:68:71:a5"
        },
        "leaf_1_0_8": {
            "net0": "1e:39:90:48:a1:4c",
            "net1": "36:fb:e4:af:1b:c4",
            "net10": "02:c4:ea:9f:46:95",
            "net2": "b6:30:a3:a4:62:a7",
            "net3": "9a:36:9f:61:5c:6b",
            "net4": "76:66:f7:ea:58:84",
            "net5": "16:eb:82:e0:74:85",
            "net6": "06:04:2f:ef:98:b0",
            "net7": "72:c4:73:1c:11:20",
            "net8": "82:3f:3b:ac:99:38",
            "net9": "86:92:96:4f:1b:86"
        },
        "leaf_1_0_9": {
            "net0": "9a:d7:a5:d1:89:e8",
            "net1": "ba:e2:ff:57:ce:ad",
            "net10": "1e:14:a3:77:27:43",
            "net2": "76:94:49:91:79:9c",
            "net3": "7a:8a:74:c7:85:81",
            "net4": "4a:e8:b8:bd:21:76",
            "net5": "2a:46:cd:47:44:d9",
            "net6": "16:dd:0e:b4:3e:c3",
            "net7": "06:d7:60:c1:2f:77",
            "net8": "ea:e4:99:44:f2:9f",
            "net9": "96:1c:aa:f5:40:6a"
        },
        "leaf_2_0_1": {
            "net0": "72:52:f3:e3:34:05",
            "net1": "72:7b:a1:ef:97:5e",
            "net10": "6e:a3:7c:24:52:2c",
            "net2": "0a:b0:9b:56:fb:08",
            "net3": "16:0f:95:82:1f:7e",
            "net4": "e2:0a:0b:2b:6d:5b",
            "net5": "1a:82:d8:58:09:b0",
            "net6": "5e:05:e8:12:fb:ff",
            "net7": "f6:a5:f0:51:11:3c",
            "net8": "1a:4d:0e:15:65:87",
            "net9": "c6:66:7d:33:46:e8"
        },
        "leaf_2_0_10": {
            "net0": "6a:1d:d4:c5:d3:e2",
            "net1": "96:b4:74:0e:6e:74",
            "net10": "72:75:17:c8:b4:fe",
            "net2": "2a:f9:0a:85:da:39",
            "net3": "d2:59:b6:3d:2b:40",
            "net4": "76:db:4b:77:f0:73",
            "net5": "3a:6a:65:74:62:44",
            "net6": "9a:f9:1e:fb:7c:60",
            "net7": "16:ee:36:49:f6:5c",
            "net8": "ba:12:37:47:01:aa",
            "net9": "22:52:0c:33:9c:23"
        },
        "leaf_2_0_2": {
            "net0": "9e:c2:f5:ea:57:11",
            "net1": "fe:fd:e5:ff:43:e0",
            "net10": "0a:5f:76:79:ff:31",
            "net2": "6a:f6:86:c3:17:c5",
            "net3": "d6:36:77:db:00:bd",
            "net4": "e2:e4:65:15:51:d8",
            "net5": "62:15:d3:66:f9:f6",
            "net6": "32:9b:b4:88:28:a7",
            "net7": "06:ac:2f:b6:7f:45",
            "net8": "ee:f1:33:c2:b4:91",
            "net9": "8a:93:58:38:e4:6d"
        },
        "leaf_2_0_3": {
            "net0": "4a:53:59:6c:d9:f6",
            "net1": "32:be:13:6f:9f:7e",
            "net10": "3e:f5:aa:55:54:14",
            "net2": "ca:bb:93:f4:b8:7a",
            "net3": "0e:39:08:d2:8c:e2",
            "net4": "96:1e:c5:bc:4a:dd",
            "net5": "1e:b6:b9:9e:2b:3d",
            "net6": "e2:b1:2a:1e:d2:11",
            "net7": "9a:2a:59:06:f7:b4",
            "net8": "9e:55:d1:16:e1:57",
            "net9": "1e:9b:c7:46:d6:9b"
        },
        "leaf_2_0_4": {
            "net0": "1e:24:01:b4:b0:b1",
            "net1": "26:d6:22:1b:82:52",
            "net10": "2e:7e:d8:81:69:33",
            "net2": "3e:45:b0:f0:70:c7",
            "net3": "8e:d2:09:6a:a0:33",
            "net4": "52:27:34:6c:64:0e",
            "net5": "3a:5c:d7:aa:c3:30",
            "net6": "c6:bc:8a:cb:e8:fc",
            "net7": "92:b3:a2:99:d1:9d",
            "net8": "06:72:a8:14:99:bc",
            "net9": "36:a0:05:21:69:56"
        },
        "leaf_2_0_5": {
            "net0": "8a:d0:52:5c:19:c0",
            "net1": "92:f5:76:49:b1:2c",
            "net10": "f6:54:9e:ae:1e:a6",
            "net2": "42:37:0d:4e:dc:26",
            "net3": "12:ae:e3:c4:f5:0d",
            "net4": "8e:fe:d6:b9:0e:ed",
            "net5": "56:60:e5:44:68:b5",
            "net6": "76:36:5f:a5:43:4a",
            "net7": "6a:ee:eb:41:61:36",
            "net8": "12:da:87:d7:77:6b",
            "net9": "e6:68:e2:14:5a:ed"
        },
        "leaf_2_0_6": {
            "net0": "52:a1:b3:e9:af:40",
            "net1": "ca:ac:1c:1d:e4:56",
            "net10": "ca:12:4a:61:48:0e",
            "net2": "7a:1b:de:cd:30:f1",
            "net3": "42:88:09:e4:1e:b3",
            "net4": "6e:a2:60:8a:1c:94",
            "net5": "7a:f4:3e:1c:74:7f",
            "net6": "5e:ff:66:9d:a2:76",
            "net7": "6a:4b:fa:a8:8a:d1",
            "net8": "36:28:cf:6d:2f:00",
            "net9": "e2:bb:52:a9:cf:ef"
        },
        "leaf_2_0_7": {
            "net0": "06:ed:c3:43:37:65",
            "net1": "16:0c:f9:92:ad:aa",
            "net10": "c2:c8:7c:ae:e1:98",
            "net2": "2a:a1:1e:14:7b:e5",
            "net3": "be:5d:80:a4:a1:12",
            "net4": "aa:19:ab:7f:d2:61",
            "net5": "26:80:72:0c:d8:db",
            "net6": "e6:33:ee:0c:42:78",
            "net7": "22:09:b6:4d:73:13",
            "net8": "a6:16:e6:4e:bc:d1",
            "net9": "fa:cd:e4:67:6e:28"
        },
        "leaf_2_0_8": {
            "net0": "b6:6d:f5:f9:41:1c",
            "net1": "8a:43:54:a0:12:f0",
            "net10": "12:9d:4c:d6:7d:6b",
            "net2": "6e:21:4a:06:97:b5",
            "net3": "da:6b:f6:b7:63:87",
            "net4": "72:f0:a2:6c:73:ce",
            "net5": "6a:96:62:ae:b2:7f",
            "net6": "e6:98:ab:a5:cf:37",
            "net7": "5e:07:4c:cb:0a:3b",
            "net8": "36:d9:f8:a5:95:64",
            "net9": "82:ea:37:3c:52:0f"
        },
        "leaf_2_0_9": {
            "net0": "32:74:91:8b:30:6b",
            "net1": "12:87:f5:6a:43:dc",
            "net10": "0a:08:9f:47:a8:ca",
            "net2": "02:80:29:83:2e:71",
            "net3": "8a:5a:73:ab:fc:db",
            "net4": "ae:e8:98:c8:f8:bc",
            "net5": "a6:b4:ef:14:69:28",
            "net6": "ae:eb:4a:a4:24:8f",
            "net7": "62:85:0f:5d:d0:4a",
            "net8": "be:30:84:89:5f:44",
            "net9": "3e:95:79:9e:08:88"
        },
        "spine_1_1_1": {
            "net0": "f2:9e:b9:e3:0c:ff",
            "net1": "52:42:89:33:69:c4",
            "net10": "c2:99:85:3f:44:86",
            "net11": "da:21:32:57:e7:66",
            "net12": "7a:cd:90:c6:c4:8e",
            "net13": "1e:c8:36:e3:ba:4d",
            "net14": "4e:18:63:47:c9:a2",
            "net15": "ea:0a:09:bc:3f:e4",
            "net16": "1e:31:2f:5d:54:f2",
            "net17": "9a:ea:04:a1:b3:cd",
            "net18": "c6:0b:0f:ed:b2:ac",
            "net19": "92:1f:be:eb:eb:fc",
            "net2": "c2:63:c5:b3:5f:53",
            "net3": "e2:e1:df:3e:71:a1",
            "net4": "f6:8e:bf:9c:77:92",
            "net5": "06:15:06:ea:c9:86",
            "net6": "b6:a3:1f:9f:e9:b8",
            "net7": "c6:c0:95:eb:26:82",
            "net8": "aa:10:42:0b:c4:b6",
            "net9": "12:81:0b:3c:19:54"
        },
        "spine_1_1_10": {
            "net0": "8e:bf:de:a6:7e:88",
            "net1": "aa:70:ae:ea:bf:8e",
            "net10": "de:b4:59:d7:41:80",
            "net11": "ae:29:b6:4c:54:4a",
            "net12": "aa:7f:a0:f5:ba:fe",
            "net13": "32:ee:6a:aa:94:ac",
            "net14": "fe:37:c4:18:08:2b",
            "net15": "ee:6b:99:65:2d:60",
            "net16": "ba:9d:e1:67:ca:70",
            "net17": "06:91:86:36:5c:8f",
            "net18": "7a:36:63:87:23:e9",
            "net19": "e6:6d:1e:8b:36:71",
            "net2": "ae:ff:79:f6:06:ed",
            "net3": "e6:58:0a:de:70:bc",
            "net4": "1e:55:f2:70:ef:eb",
            "net5": "36:83:80:21:04:7d",
            "net6": "56:cd:9f:72:dc:89",
            "net7": "3e:ba:8a:ba:b0:84",
            "net8": "a2:1d:68:62:30:28",
            "net9": "1e:8c:f3:41:25:61"
        },
        "spine_1_1_2": {
            "net0": "ee:25:3e:ad:45:d3",
            "net1": "5a:7d:ff:3d:9a:cc",
            "net10": "fe:67:b5:38:40:90",
            "net11": "62:f1:ac:3d:4a:fc",
            "net12": "ea:5d:1e:aa:90:ee",
            "net13": "22:86:47:97:06:3c",
            "net14": "12:dd:e7:13:0c:ff",
            "net15": "ea:42:77:ef:56:5b",
            "net16": "b6:1e:1c:d6:b9:90",
            "net17": "ae:3d:f4:70:61:59",
            "net18": "7e:12:86:a3:f1:69",
            "net19": "76:3f:d7:32:24:b8",
            "net2": "8a:ec:fc:29:d5:e3",
            "net3": "12:14:d6:6a:d4:41",
            "net4": "ce:be:b9:5f:e4:b6",
            "net5": "fa:86:b5:7c:19:3e",
            "net6": "36:b2:8f:06:0e:e8",
            "net7": "06:95:a5:48:f1:83",
            "net8": "52:05:d7:c3:05:7f",
            "net9": "9e:b9:d3:9e:a8:25"
        },
        "spine_1_1_3": {
            "net0": "7e:1c:8e:60:05:e0",
            "net1": "ca:dc:2c:34:08:df",
            "net10": "8a:20:b0:c8:55:b1",
            "net11": "ba:2e:bf:f8:e4:33",
            "net12": "02:32:26:ac:45:23",
            "net13": "d6:02:f7:bd:0b:25",
            "net14": "12:8e:31:10:ec:5d",
            "net15": "c2:40:94:bf:fb:69",
            "net16": "d6:eb:fa:5d:10:93",
            "net17": "46:47:32:1c:30:b7",
            "net18": "fe:97:3a:b0:c3:8a",
            "net19": "9e:5e:91:5c:e5:ab",
            "net2": "f2:73:4e:35:04:a4",
            "net3": "32:6e:64:41:22:1c",
            "net4": "2a:64:5d:c9:5f:be",
            "net5": "aa:15:ce:f5:24:b5",
            "net6": "8e:bf:4e:ad:28:3e",
            "net7": "26:cf:91:f8:54:2e",
            "net8": "a2:5f:33:e9:b1:2a",
            "net9": "96:47:55:22:aa:41"
        },
        "spine_1_1_4": {
            "net0": "56:80:8d:29:ef:01",
            "net1": "b2:1d:5d:2e:3a:57",
            "net10": "ba:91:81:82:88:1a",
            "net11": "16:1e:a8:aa:e0:4e",
            "net12": "ca:af:5e:b6:fd:d6",
            "net13": "2a:cb:78:6d:3c:ca",
            "net14": "02:d7:e6:a6:f3:0d",
            "net15": "c2:f9:b1:2c:7b:18",
            "net16": "1a:fb:21:10:93:93",
            "net17": "66:df:45:8d:77:12",
            "net18": "52:70:c0:e6:35:28",
            "net19": "be:04:6a:ff:b4:74",
            "net2": "b2:28:5a:12:38:ef",
            "net3": "92:b2:ff:c7:25:14",
            "net4": "e6:9a:be:10:9d:c0",
            "net5": "36:bd:29:6a:61:f5",
            "net6": "86:d9:d3:1d:bc:47",
            "net7": "4a:cd:46:34:83:6e",
            "net8": "5a:9d:7d:fb:4c:01",
            "net9": "42:33:f0:08:3c:6d"
        },
        "spine_1_1_5": {
            "net0": "a6:ab:ea:e8:82:2c",
            "net1": "b6:33:2e:8e:65:9c",
            "net10": "c6:ea:59:b9:65:44",
            "net11": "42:3f:0c:c1:64:e4",
            "net12": "22:42:3a:a9:fa:f1",
            "net13": "02:39:c1:17:36:50",
            "net14": "16:50:bc:0e:a2:57",
            "net15": "0e:6e:a3:23:4a:fb",
            "net16": "86:e3:a6:18:7d:43",
            "net17": "42:cc:dc:49:b5:1c",
            "net18": "b6:ac:c1:69:0a:f1",
            "net19": "56:d4:56:6f:a3:1c",
            "net2": "1e:cb:d2:79:88:b3",
            "net3": "26:c7:04:79:3b:1e",
            "net4": "32:09:e6:7e:85:d5",
            "net5": "2e:e7:bc:23:e5:70",
            "net6": "52:b3:96:18:63:2a",
            "net7": "c2:60:d9:d0:16:d3",
            "net8": "aa:28:31:6a:cc:aa",
            "net9": "9e:38:11:5d:c0:e6"
        },
        "spine_1_1_6": {
            "net0": "aa:01:0d:37:41:bb",
            "net1": "96:1f:bc:f5:e3:0b",
            "net10": "16:eb:39:f8:fb:8a",
            "net11": "e2:91:7d:ce:39:7b",
            "net12": "f2:51:ad:30:d8:0a",
            "net13": "16:90:6f:05:2d:10",
            "net14": "d6:9b:57:d6:3d:ca",
            "net15": "b6:ee:68:cb:44:21",
            "net16": "ea:e3:b2:e7:b2:3f",
            "net17": "ca:22:4f:f7:3f:8d",
            "net18": "a6:36:8d:3d:f6:81",
            "net19": "c2:8d:65:37:26:76",
            "net2": "e6:a7:ff:a1:f7:22",
            "net3": "c6:44:67:9b:34:bd",
            "net4": "3e:79:11:ea:ca:bb",
            "net5": "9e:70:e1:8b:33:e8",
            "net6": "66:36:af:bc:d1:1c",
            "net7": "c2:a9:9e:6b:29:31",
            "net8": "c2:20:ba:4f:2f:49",
            "net9": "82:95:45:0b:a4:d3"
        },
        "spine_1_1_7": {
            "net0": "aa:3f:2d:6a:e5:dd",
            "net1": "2a:be:cf:9b:8a:30",
            "net10": "e2:4e:94:06:4b:ed",
            "net11": "ae:2e:58:0b:17:f3",
            "net12": "de:57:90:65:46:b2",
            "net13": "c2:94:ed:51:68:37",
            "net14": "6e:eb:a5:0d:c7:cc",
            "net15": "ae:d8:ea:63:7a:cd",
            "net16": "fe:e6:e7:d6:f3:aa",
            "net17": "72:4f:c1:fd:55:b5",
            "net18": "ba:8d:93:50:fd:fb",
            "net19": "72:a3:24:b2:c9:1c",
            "net2": "46:26:d3:90:ad:97",
            "net3": "4e:9d:13:36:76:20",
            "net4": "d2:de:05:a1:ec:d2",
            "net5": "5e:48:51:dc:f7:86",
            "net6": "62:74:85:a2:bf:60",
            "net7": "26:89:95:3d:ee:d5",
            "net8": "ba:7d:ae:1e:bf:6d",
            "net9": "fa:47:74:b7:a1:af"
        },
        "spine_1_1_8": {
            "net0": "32:0b:42:9b:3d:2a",
            "net1": "be:6a:62:e0:87:99",
            "net10": "5a:94:1b:ae:0e:82",
            "net11": "4e:c7:1e:cf:03:97",
            "net12": "86:4b:e6:b7:f8:70",
            "net13": "8e:e1:34:bc:4d:5e",
            "net14": "ee:92:c7:4f:d5:4c",
            "net15": "c6:4a:9d:0f:0e:59",
            "net16": "86:23:15:b3:a8:92",
            "net17": "9a:e6:10:0e:5a:34",
            "net18": "9e:bb:23:24:06:03",
            "net19": "0e:30:eb:af:1c:90",
            "net2": "6a:f0:33:a5:0d:48",
            "net3": "9e:76:e8:f5:f4:fc",
            "net4": "9e:cc:34:e4:05:b1",
            "net5": "f6:23:cf:0d:3d:c3",
            "net6": "ee:40:08:c5:30:fb",
            "net7": "6e:23:df:cf:a3:30",
            "net8": "6a:7b:18:22:ff:42",
            "net9": "fe:3c:06:e6:0f:f6"
        },
        "spine_1_1_9": {
            "net0": "96:ea:3d:c8:59:1f",
            "net1": "d6:aa:8d:ad:73:9e",
            "net10": "6e:63:5d:ca:be:76",
            "net11": "56:b5:bd:8e:d4:34",
            "net12": "1e:61:0b:fa:5a:ea",
            "net13": "a6:91:70:2f:be:0c",
            "net14": "0e:b5:68:89:f7:9b",
            "net15": "ce:d4:f1:22:c4:68",
            "net16": "72:b1:c2:ce:8c:58",
            "net17": "72:c7:44:14:99:5a",
            "net18": "6a:be:3f:a1:3f:27",
            "net19": "2a:bd:a6:e3:ef:99",
            "net2": "ce:e9:f1:88:62:5d",
            "net3": "be:40:46:47:40:11",
            "net4": "4a:55:79:3d:3a:fc",
            "net5": "3e:f6:02:b3:81:29",
            "net6": "42:f6:b0:8c:8b:8d",
            "net7": "c6:90:82:ab:36:5a",
            "net8": "e6:92:84:8f:5f:d1",
            "net9": "6e:51:43:64:aa:57"
        },
        "spine_2_1_1": {
            "net0": "fe:87:82:7b:ad:26",
            "net1": "8a:a7:cc:6a:56:dc",
            "net10": "b2:30:6c:93:04:15",
            "net11": "e2:21:b0:9f:05:e3",
            "net12": "f6:31:56:c1:81:62",
            "net13": "c6:fe:15:0e:53:e0",
            "net14": "e6:50:c2:96:92:8a",
            "net15": "06:97:fa:a9:4d:35",
            "net16": "8e:fa:7d:2a:36:68",
            "net17": "02:16:1c:4c:db:90",
            "net18": "f2:dd:da:be:f4:10",
            "net19": "f6:95:59:f9:55:a9",
            "net2": "6e:7f:10:7b:7b:ea",
            "net3": "b6:95:94:33:f2:5e",
            "net4": "e2:f6:6b:c9:a1:46",
            "net5": "52:8c:5b:de:47:74",
            "net6": "9e:bf:cf:e4:86:07",
            "net7": "4a:0b:b6:f5:be:72",
            "net8": "8a:05:96:01:c3:84",
            "net9": "8a:31:2c:8a:f9:11"
        },
        "spine_2_1_10": {
            "net0": "9e:98:cb:4d:b0:c1",
            "net1": "d2:29:d4:67:36:9f",
            "net10": "fe:b7:64:72:93:09",
            "net11": "26:bc:01:0d:b5:ab",
            "net12": "1a:f4:1d:23:34:94",
            "net13": "5e:dd:16:cb:ff:08",
            "net14": "f2:95:46:84:20:47",
            "net15": "b6:f4:0e:89:1d:e2",
            "net16": "b2:ee:c2:b3:c1:b8",
            "net17": "b6:be:11:6e:5f:23",
            "net18": "b6:ac:fc:d6:28:e0",
            "net19": "32:79:8e:5e:f1:17",
            "net2": "d2:38:21:0e:d2:9d",
            "net3": "12:fa:17:cc:01:08",
            "net4": "82:7a:6f:bc:02:06",
            "net5": "7e:f9:f2:f3:f9:83",
            "net6": "1a:13:36:dc:be:f6",
            "net7": "d2:d4:e5:e5:5d:61",
            "net8": "22:f8:14:a2:26:42",
            "net9": "36:75:bb:cd:ab:50"
        },
        "spine_2_1_2": {
            "net0": "a2:9d:ea:d4:f2:90",
            "net1": "3a:a9:c5:a5:13:02",
            "net10": "ae:6c:30:57:0c:58",
            "net11": "8a:a6:5a:ec:0c:ac",
            "net12": "12:45:d0:73:c8:3f",
            "net13": "4e:82:3e:20:9c:ea",
            "net14": "2e:79:e6:65:fb:48",
            "net15": "ba:65:75:88:5e:49",
            "net16": "0a:ed:e6:65:6f:ca",
            "net17": "56:28:ee:3c:b2:74",
            "net18": "82:10:3d:a7:96:79",
            "net19": "76:25:c8:8d:bd:8d",
            "net2": "86:92:4a:43:1b:61",
            "net3": "46:e4:b0:1e:de:b6",
            "net4": "e6:21:5f:84:bb:1c",
            "net5": "9e:8a:8f:8b:4c:4b",
            "net6": "56:29:4c:73:62:a4",
            "net7": "66:13:58:98:b2:b7",
            "net8": "16:9c:1f:e3:b9:03",
            "net9": "a2:c9:a0:27:7a:4e"
        },
        "spine_2_1_3": {
            "net0": "12:37:01:d5:18:13",
            "net1": "6e:a2:2d:78:36:27",
            "net10": "6e:4f:cb:26:f8:a9",
            "net11": "3a:c8:a7:74:20:e0",
            "net12": "12:da:75:7c:90:0f",
            "net13": "e2:27:f3:7a:59:aa",
            "net14": "e2:18:91:da:49:4b",
            "net15": "5a:39:db:79:81:da",
            "net16": "da:82:2b:18:e6:f1",
            "net17": "06:38:50:c7:5c:ea",
            "net18": "d2:f5:ce:da:3c:b8",
            "net19": "46:9e:3a:1f:0e:78",
            "net2": "92:82:ef:14:b9:ee",
            "net3": "ee:f9:fc:d8:37:bb",
            "net4": "e2:8a:82:46:69:14",
            "net5": "a2:8d:c9:de:8e:14",
            "net6": "2a:a1:8d:04:5e:b6",
            "net7": "ee:0d:67:39:38:ff",
            "net8": "06:7e:7d:a1:dc:8e",
            "net9": "3e:5f:d0:dc:fb:b2"
        },
        "spine_2_1_4": {
            "net0": "c2:59:87:3f:c7:4c",
            "net1": "22:23:32:10:c8:86",
            "net10": "d2:79:23:cf:ff:21",
            "net11": "66:f9:b2:ba:00:93",
            "net12": "96:1f:e1:d6:e1:6a",
            "net13": "96:79:94:8c:5d:1e",
            "net14": "46:2f:d5:53:02:bc",
            "net15": "fa:2d:da:b8:14:db",
            "net16": "06:28:a7:df:53:44",
            "net17": "8a:9e:ca:41:08:72",
            "net18": "8e:dc:18:7c:0c:44",
            "net19": "de:1e:1d:c6:0c:f8",
            "net2": "5e:8b:4d:23:c0:e9",
            "net3": "66:60:d6:97:2a:d9",
            "net4": "e2:8b:20:b3:80:13",
            "net5": "f2:55:54:eb:61:e8",
            "net6": "2a:98:aa:1f:5c:8c",
            "net7": "36:74:ea:f6:7e:21",
            "net8": "fe:03:97:64:fc:c5",
            "net9": "8e:cb:3c:1c:81:87"
        },
        "spine_2_1_5": {
            "net0": "e6:c7:42:e3:68:6c",
            "net1": "46:91:a3:81:9a:e4",
            "net10": "1a:bb:14:94:f8:f3",
            "net11": "b2:fe:d7:b4:66:8b",
            "net12": "1e:23:c7:de:3a:98",
            "net13": "ee:72:5a:c7:d2:a7",
            "net14": "56:fd:00:f9:b9:2d",
            "net15": "1a:fd:08:cd:6a:ae",
            "net16": "f2:7e:cf:85:11:43",
            "net17": "76:7c:45:05:e7:eb",
            "net18": "22:7d:04:ca:78:25",
            "net19": "76:26:93:5d:4f:a5",
            "net2": "e2:2e:10:9c:41:9a",
            "net3": "5a:0e:a6:c0:b8:db",
            "net4": "f6:5d:eb:9e:42:b4",
            "net5": "ea:d7:ab:79:53:20",
            "net6": "aa:1b:72:50:c4:ae",
            "net7": "26:73:6e:9f:1b:1e",
            "net8": "d6:b3:60:b8:11:8c",
            "net9": "be:af:57:3a:3a:59"
        },
        "spine_2_1_6": {
            "net0": "ba:ea:02:f6:ae:0f",
            "net1": "ae:8c:be:ef:19:99",
            "net10": "fe:b1:13:98:f4:39",
            "net11": "a2:60:5d:80:ec:5e",
            "net12": "56:5a:e7:7d:47:ad",
            "net13": "76:98:0a:ea:41:2a",
            "net14": "2e:ef:24:4a:5d:b5",
            "net15": "5e:26:37:01:f3:d6",
            "net16": "5e:e5:4a:70:f4:ac",
            "net17": "ce:95:da:66:74:49",
            "net18": "0a:77:45:5c:73:ed",
            "net19": "26:c1:8d:ad:ce:25",
            "net2": "f6:b2:61:b9:20:ec",
            "net3": "9e:2f:cb:64:55:06",
            "net4": "a2:5c:01:73:e0:4d",
            "net5": "aa:61:b4:dd:d7:ce",
            "net6": "c2:5c:05:27:3a:ec",
            "net7": "6a:64:de:81:db:6a",
            "net8": "9e:a8:92:17:fb:4f",
            "net9": "16:aa:b0:27:1a:63"
        },
        "spine_2_1_7": {
            "net0": "7e:85:62:48:de:02",
            "net1": "16:84:0f:36:fc:66",
            "net10": "a6:f2:d1:f1:03:16",
            "net11": "ea:0b:00:b0:6a:be",
            "net12": "d2:dd:3f:67:a4:ec",
            "net13": "4a:37:9f:f1:89:22",
            "net14": "ae:52:f9:bc:ca:23",
            "net15": "e6:40:db:4c:3c:0d",
            "net16": "4e:26:db:09:ab:d5",
            "net17": "2a:f4:62:46:31:2f",
            "net18": "52:71:a7:22:1a:0b",
            "net19": "46:98:2c:3b:fe:2f",
            "net2": "9a:39:b4:ae:bf:8e",
            "net3": "96:3d:7f:5b:e5:d2",
            "net4": "66:20:b4:7e:fe:1e",
            "net5": "4e:fb:9e:79:51:cc",
            "net6": "de:6c:c0:2b:ae:8a",
            "net7": "ba:ca:2e:3f:09:ea",
            "net8": "8a:4b:fa:85:8d:e9",
            "net9": "86:09:1f:14:a2:e1"
        },
        "spine_2_1_8": {
            "net0": "ca:94:7c:fd:d6:f4",
            "net1": "9a:de:64:0a:da:d5",
            "net10": "ea:24:ba:7c:34:32",
            "net11": "ce:c4:41:17:0f:ab",
            "net12": "e2:4a:bb:a5:01:a3",
            "net13": "2e:a7:42:79:01:32",
            "net14": "12:81:79:5e:54:c0",
            "net15": "f6:0f:4a:ca:f5:6f",
            "net16": "3e:2f:2e:53:60:45",
            "net17": "ce:b9:5e:84:98:39",
            "net18": "d2:e0:3e:61:39:17",
            "net19": "2a:c9:e8:4f:df:0b",
            "net2": "6e:86:a0:b6:19:11",
            "net3": "96:bc:70:85:70:d2",
            "net4": "ea:92:29:6b:8d:ef",
            "net5": "36:d0:10:93:e3:ec",
            "net6": "3a:f2:36:7a:bd:96",
            "net7": "26:fd:60:c2:49:b8",
            "net8": "9e:c9:a8:f2:3b:da",
            "net9": "6e:b9:2d:74:38:d6"
        },
        "spine_2_1_9": {
            "net0": "02:7e:e3:69:66:55",
            "net1": "7e:ec:3d:7d:8d:8a",
            "net10": "f6:ef:8d:3f:ba:c2",
            "net11": "a2:ec:50:65:ea:dc",
            "net12": "a6:0f:03:35:5a:9e",
            "net13": "1a:cd:f2:40:a4:0e",
            "net14": "92:e9:ee:10:8b:a1",
            "net15": "e2:28:47:01:41:7a",
            "net16": "7e:5e:f7:c2:9a:ad",
            "net17": "4a:3f:8f:2c:06:a6",
            "net18": "be:b8:1c:83:03:b9",
            "net19": "be:65:9d:86:4e:46",
            "net2": "d2:61:ed:f2:b0:0e",
            "net3": "92:2b:df:34:87:17",
            "net4": "a6:7d:8f:25:35:b1",
            "net5": "62:20:7f:c1:3d:87",
            "net6": "42:1c:da:28:93:7b",
            "net7": "da:05:3c:f5:0d:35",
            "net8": "d6:7a:28:0d:bf:fc",
            "net9": "82:28:38:c8:c9:0c"
        },
        "tof_1_2_1": {
            "net0": "be:26:4f:df:45:30",
            "net1": "a2:53:07:4a:4d:47",
            "net10": "0a:aa:e7:b4:6c:9e",
            "net11": "02:9d:8d:13:3f:84",
            "net12": "0e:d9:f4:eb:07:80",
            "net13": "2e:16:b2:09:f0:05",
            "net14": "22:44:76:72:fa:35",
            "net15": "e2:04:79:4c:be:b8",
            "net16": "e2:eb:50:f8:80:d8",
            "net17": "5a:4b:37:db:3f:91",
            "net18": "be:99:e1:ca:ea:68",
            "net19": "42:dd:81:a6:4a:0e",
            "net2": "ba:fa:d8:d8:3e:ae",
            "net3": "9e:bf:bc:fc:69:1e",
            "net4": "da:5c:a2:d5:4e:4b",
            "net5": "f2:c2:9a:3d:b7:45",
            "net6": "72:21:d4:d0:20:98",
            "net7": "c2:8f:9e:38:50:2c",
            "net8": "fa:8a:49:18:c5:7a",
            "net9": "42:8b:c0:b0:f6:b9"
        },
        "tof_1_2_10": {
            "net0": "7a:d5:89:f5:1a:4b",
            "net1": "3e:bb:ac:25:b4:14",
            "net10": "2a:e8:9d:97:29:e4",
            "net11": "86:18:a9:8a:37:be",
            "net12": "e2:51:0d:37:6d:14",
            "net13": "d6:7a:70:00:61:cb",
            "net14": "1a:f7:b7:f9:ca:d9",
            "net15": "4a:ee:39:54:90:5d",
            "net16": "52:d0:67:f2:dc:ae",
            "net17": "d2:d7:39:43:cf:ea",
            "net18": "a6:0a:82:f9:c5:aa",
            "net19": "b6:8f:2e:eb:78:a0",
            "net2": "ba:93:a6:1f:48:3b",
            "net3": "aa:83:51:86:b7:47",
            "net4": "d2:f5:23:d6:57:4d",
            "net5": "36:14:86:de:3a:60",
            "net6": "76:8c:91:5d:88:26",
            "net7": "8e:77:c9:a6:b9:69",
            "net8": "ca:af:4c:d0:d3:da",
            "net9": "aa:8a:0d:7a:a4:ff"
        },
        "tof_1_2_2": {
            "net0": "7e:84:c4:13:0d:42",
            "net1": "de:4b:a6:2b:94:52",
            "net10": "ca:15:8d:51:c4:ac",
            "net11": "f6:bd:99:7e:72:80",
            "net12": "96:00:7c:c0:77:8d",
            "net13": "d6:79:7b:06:f3:bc",
            "net14": "f2:63:ac:1c:9e:be",
            "net15": "92:66:15:2d:67:99",
            "net16": "72:98:e6:12:d0:18",
            "net17": "fe:29:b4:19:3d:4c",
            "net18": "fe:8e:e0:e4:fa:bf",
            "net19": "0a:e0:fd:7e:94:c9",
            "net2": "e2:34:73:2a:e6:f9",
            "net3": "12:7d:0a:69:4a:00",
            "net4": "52:b2:d6:d5:01:dc",
            "net5": "2a:93:b7:ca:b9:3b",
            "net6": "66:44:97:56:ed:0d",
            "net7": "62:0d:04:ae:77:62",
            "net8": "86:7c:15:11:0f:4c",
            "net9": "7e:bf:9d:e0:9f:ea"
        },
        "tof_1_2_3": {
            "net0": "7e:35:3b:39:9c:6e",
            "net1": "42:5d:48:29:5d:5b",
            "net10": "2a:43:56:47:62:e8",
            "net11": "1a:eb:ce:dd:1b:0f",
            "net12": "32:e7:b4:e2:75:d6",
            "net13": "f2:c4:5e:41:83:b1",
            "net14": "3e:5f:9a:7f:1d:6e",
            "net15": "52:fe:c9:d2:10:58",
            "net16": "5e:8e:a8:22:48:ed",
            "net17": "02:a3:fb:08:59:0a",
            "net18": "ee:51:15:b2:96:85",
            "net19": "06:cb:4c:e5:ff:0b",
            "net2": "ae:64:bc:ff:db:50",
            "net3": "42:5d:dc:00:10:e9",
            "net4": "aa:09:1b:f0:a0:32",
            "net5": "9a:67:27:7e:1e:00",
            "net6": "26:b1:02:10:59:7c",
            "net7": "1a:04:e2:ad:09:17",
            "net8": "fe:40:c0:78:da:c0",
            "net9": "ca:4d:b4:e3:93:58"
        },
        "tof_1_2_4": {
            "net0": "f6:88:1c:3f:f5:6c",
            "net1": "a6:ce:18:f2:32:0e",
            "net10": "62:cc:f0:88:e7:2f",
            "net11": "16:e1:17:8a:5d:e6",
            "net12": "52:32:c3:de:d6:7a",
            "net13": "e6:f4:bb:39:ee:dd",
            "net14": "1e:68:e4:38:71:bd",
            "net15": "4a:e5:43:f3:02:b0",
            "net16": "be:b0:97:3b:84:93",
            "net17": "8a:5c:0b:56:9c:a8",
            "net18": "da:f4:67:bf:55:10",
            "net19": "16:76:22:90:a2:50",
            "net2": "52:6b:ec:58:ab:fa",
            "net3": "1e:40:cd:b1:f9:6c",
            "net4": "c6:5c:38:a1:0f:c8",
            "net5": "ca:d6:b7:1d:09:79",
            "net6": "96:5d:f2:b3:b2:35",
            "net7": "ee:a1:3d:8d:df:71",
            "net8": "ce:b5:9d:2b:b4:9e",
            "net9": "06:69:b5:36:bc:eb"
        },
        "tof_1_2_5": {
            "net0": "02:44:b0:bb:ff:cb",
            "net1": "1e:e6:08:4d:02:59",
            "net10": "66:41:03:b9:4b:99",
            "net11": "62:e0:b2:87:eb:f0",
            "net12": "92:fa:11:0a:c4:44",
            "net13": "4e:e3:45:7a:eb:48",
            "net14": "be:20:5f:f6:0a:d8",
            "net15": "b6:7d:7b:ad:d3:ae",
            "net16": "da:ef:c0:39:bc:a2",
            "net17": "0a:f4:ab:15:87:55",
            "net18": "96:30:4d:90:0a:97",
            "net19": "92:be:69:b6:ec:6b",
            "net2": "02:82:74:d7:a0:78",
            "net3": "8a:08:4d:c3:85:a3",
            "net4": "22:41:f4:5e:e1:a7",
            "net5": "32:6a:93:3e:84:fe",
            "net6": "5e:ac:41:8a:eb:5a",
            "net7": "da:75:70:3d:4b:ea",
            "net8": "3e:e9:50:c9:c7:8b",
            "net9": "d2:19:08:80:14:de"
        },
        "tof_1_2_6": {
            "net0": "5a:8c:ee:52:cd:2e",
            "net1": "b6:cc:0c:7b:2e:40",
            "net10": "a2:ac:a2:4a:f5:57",
            "net11": "76:4a:a1:e9:8d:2b",
            "net12": "3e:a3:29:5b:bc:88",
            "net13": "ea:2b:8d:d8:ca:47",
            "net14": "d2:43:15:aa:21:fc",
            "net15": "a2:38:d8:d7:5a:7c",
            "net16": "9e:12:ea:43:ee:d9",
            "net17": "f6:cb:68:ef:88:50",
            "net18": "52:76:d0:a8:72:03",
            "net19": "fe:38:fb:74:2c:99",
            "net2": "12:52:31:45:16:a9",
            "net3": "4a:13:1c:48:19:89",
            "net4": "be:fe:de:ba:62:c9",
            "net5": "62:f6:50:6f:36:d9",
            "net6": "8e:0e:3b:35:1a:7b",
            "net7": "86:17:00:53:a0:80",
            "net8": "86:fd:ff:05:10:6a",
            "net9": "ba:ea:eb:89:f4:77"
        },
        "tof_1_2_7": {
            "net0": "42:80:0d:60:3c:2f",
            "net1": "92:ac:c0:cc:e8:79",
            "net10": "32:a8:89:d7:56:07",
            "net11": "7a:2c:56:9b:2d:8d",
            "net12": "8e:b6:32:46:c0:c0",
            "net13": "de:84:d5:96:65:55",
            "net14": "aa:c6:cc:2c:1c:83",
            "net15": "ca:b1:b0:97:3f:0c",
            "net16": "ba:f4:20:02:75:4a",
            "net17": "fe:a0:e7:6d:2f:9a",
            "net18": "fe:4c:a7:59:f2:97",
            "net19": "fa:85:9e:4f:7f:91",
            "net2": "f2:1b:6a:22:9d:3c",
            "net3": "7a:08:9b:d8:41:62",
            "net4": "c2:5a:f1:f6:f3:92",
            "net5": "de:c2:9b:60:26:8e",
            "net6": "4a:bb:e8:b7:ac:4e",
            "net7": "46:0d:77:f1:ea:a1",
            "net8": "82:3e:8f:4b:1d:b5",
            "net9": "9a:5d:70:eb:4b:5e"
        },
        "tof_1_2_8": {
            "net0": "6e:ce:ba:86:c8:08",
            "net1": "62:a6:34:7e:42:36",
            "net10": "1e:ad:b5:4f:f9:f1",
            "net11": "ee:0f:21:4b:04:85",
            "net12": "3e:de:07:00:00:ac",
            "net13": "ce:c9:30:ec:44:53",
            "net14": "fa:44:55:37:cb:ea",
            "net15": "c2:7a:0b:d8:42:58",
            "net16": "9e:b6:fe:99:f1:94",
            "net17": "4e:c4:fd:2b:ee:b3",
            "net18": "e6:f2:48:06:fb:c0",
            "net19": "86:2d:73:89:65:59",
            "net2": "b6:05:4e:0d:8d:71",
            "net3": "3a:72:32:9e:d9:19",
            "net4": "ce:6f:ce:e8:7d:df",
            "net5": "a2:0e:0e:3c:b5:6d",
            "net6": "56:33:96:61:ee:e8",
            "net7": "ca:9f:b8:3b:18:09",
            "net8": "7a:e0:97:7d:c5:c6",
            "net9": "0e:c4:75:78:41:0c"
        },
        "tof_1_2_9": {
            "net0": "a2:69:a3:12:69:d3",
            "net1": "ba:5a:33:0e:a0:3b",
            "net10": "fe:87:13:bf:1e:f4",
            "net11": "82:9e:d9:37:0e:b5",
            "net12": "46:16:e0:0b:64:73",
            "net13": "e6:aa:c2:c1:3e:23",
            "net14": "2e:58:44:94:e4:32",
            "net15": "82:9b:ae:96:45:e9",
            "net16": "6a:6f:ec:d1:64:44",
            "net17": "5a:19:5b:af:84:26",
            "net18": "8e:ad:1e:e9:41:69",
            "net19": "0a:de:51:2e:f8:01",
            "net2": "46:b2:50:b9:af:4c",
            "net3": "92:08:45:22:13:05",
            "net4": "e2:b9:9b:2a:6b:1c",
            "net5": "b6:9f:4e:d4:8b:db",
            "net6": "ea:6b:70:2c:73:36",
            "net7": "8e:8a:94:a7:8a:c8",
            "net8": "d2:74:84:af:07:a0",
            "net9": "d6:0b:07:b0:85:83"
        }
    },
    "failed_machine": "spine_1_1_1",
    "failed_interfaces": [
        "net10"
    ],
    "failure_time": {
        "leaf_1_0_1": 1635551771.6145222,
        "leaf_1_0_10": 1635551771.6279898,
        "leaf_1_0_2": 1635551772.165784,
        "leaf_1_0_3": 1635551771.6514149,
        "leaf_1_0_4": 1635551772.197553,
        "leaf_1_0_5": 1635551771.6791039,
        "leaf_1_0_6": 1635551771.687428,
        "leaf_1_0_7": 1635551771.6139019,
        "leaf_1_0_8": 1635551771.6262953,
        "leaf_1_0_9": 1635551771.6504211,
        "leaf_2_0_1": 1635551771.6683087,
        "leaf_2_0_10": 1635551771.6803973,
        "leaf_2_0_2": 1635551771.688487,
        "leaf_2_0_3": 1635551771.705337,
        "leaf_2_0_4": 1635551771.700207,
        "leaf_2_0_5": 1635551771.7108765,
        "leaf_2_0_6": 1635551772.2625785,
        "leaf_2_0_7": 1635551771.7443361,
        "leaf_2_0_8": 1635551771.7559605,
        "leaf_2_0_9": 1635551771.7712934,
        "spine_1_1_1": 1635551771.7785633,
        "spine_1_1_10": 1635551771.7183385,
        "spine_1_1_2": 1635551771.7314422,
        "spine_1_1_3": 1635551771.740065,
        "spine_1_1_4": 1635551771.7519095,
        "spine_1_1_5": 1635551771.7643063,
        "spine_1_1_6": 1635551771.7746325,
        "spine_1_1_7": 1635551771.781508,
        "spine_1_1_8": 1635551771.79023,
        "spine_1_1_9": 1635551771.800415,
        "spine_2_1_1": 1635551771.8153589,
        "spine_2_1_10": 1635551771.8239524,
        "spine_2_1_2": 1635551771.840519,
        "spine_2_1_3": 1635551771.8520665,
        "spine_2_1_4": 1635551772.3952355,
        "spine_2_1_5": 1635551771.7910054,
        "spine_2_1_6": 1635551771.801481,
        "spine_2_1_7": 1635551771.8162365,
        "spine_2_1_8": 1635551771.8238077,
        "spine_2_1_9": 1635551771.8386946,
        "tof_1_2_1": 1635551771.8482413,
        "tof_1_2_10": 1635551771.860435,
        "tof_1_2_2": 1635551771.870732,
        "tof_1_2_3": 1635551771.8788493,
        "tof_1_2_4": 1635551772.4234755,
        "tof_1_2_5": 1635551771.9046152,
        "tof_1_2_6": 1635551771.9158325,
        "tof_1_2_7": 1635551771.9239964,
        "tof_1_2_8": 1635551771.9330986,
        "tof_1_2_9": 1635551771.8744261
    }
}