{
    "description": "Scenario 3a: Leaf leaf_1_0_1 failure with BGP",
    "k_leaf": 14,
    "k_top": 14,
    "redundancy_factor": 14,
    "is_k8s": true,
    "machine_mac_addresses": {
        "leaf_1_0_1": {
            "net0": "9e:4a:5f:1b:7b:59",
            "net1": "b2:c5:65:68:c5:82",
            "net10": "3a:e1:9a:40:0d:92",
            "net11": "72:17:3d:4b:de:ff",
            "net12": "32:5d:2f:78:81:01",
            "net13": "ce:cd:e2:1e:64:7b",
            "net14": "32:fa:5d:75:2b:84",
            "net2": "4e:f7:72:b0:ea:a1",
            "net3": "d2:52:af:07:e5:38",
            "net4": "4a:07:db:6f:7d:9f",
            "net5": "62:6c:9f:1a:76:a2",
            "net6": "9e:b1:b0:17:96:1a",
            "net7": "92:00:fe:18:53:eb",
            "net8": "de:86:db:84:dd:1c",
            "net9": "0e:6c:4c:af:3f:36"
        },
        "leaf_1_0_10": {
            "net0": "66:a9:7c:fc:6e:75",
            "net1": "ee:0a:4b:6a:fd:78",
            "net10": "06:24:0d:62:50:23",
            "net11": "8e:aa:36:88:ea:5a",
            "net12": "da:f9:95:d3:db:4f",
            "net13": "12:bf:f0:e9:75:42",
            "net14": "16:c1:b8:ef:02:5c",
            "net2": "96:bf:90:67:eb:9c",
            "net3": "92:67:e4:09:bc:2c",
            "net4": "7a:67:69:28:42:79",
            "net5": "aa:cb:bd:e0:c6:32",
            "net6": "0a:12:28:f9:2e:c7",
            "net7": "c6:3f:4f:f9:c7:26",
            "net8": "ea:1b:f0:3d:22:a9",
            "net9": "be:97:a0:10:30:64"
        },
        "leaf_1_0_11": {
            "net0": "62:af:c1:66:f1:e1",
            "net1": "52:b9:68:da:10:f1",
            "net10": "0a:98:ee:fa:4d:c8",
            "net11": "ca:49:86:14:b2:f0",
            "net12": "c2:4c:a3:c4:6d:de",
            "net13": "26:b0:cc:d8:cd:9d",
            "net14": "3a:d0:e6:27:7c:74",
            "net2": "46:e9:b6:75:b0:70",
            "net3": "d2:02:d8:6d:bc:5d",
            "net4": "22:4c:c2:6f:ad:31",
            "net5": "1a:ff:4d:40:d1:10",
            "net6": "12:92:66:23:bd:6b",
            "net7": "52:e7:43:da:b7:a3",
            "net8": "9a:6b:cd:1d:15:b4",
            "net9": "ba:50:54:53:fd:f7"
        },
        "leaf_1_0_12": {
            "net0": "5e:2e:7f:6d:62:ea",
            "net1": "32:af:6d:05:60:4e",
            "net10": "42:d7:6f:2b:fa:aa",
            "net11": "fe:a1:0a:4a:fc:73",
            "net12": "6a:b1:55:7e:0c:23",
            "net13": "de:5b:23:89:81:ce",
            "net14": "3e:8b:3d:01:9c:18",
            "net2": "3e:8c:69:e4:78:1f",
            "net3": "7a:46:5d:90:4f:f9",
            "net4": "a6:fb:db:93:da:85",
            "net5": "86:92:78:c6:71:47",
            "net6": "96:ef:7a:f1:1c:0b",
            "net7": "b6:85:7d:10:02:f0",
            "net8": "1e:51:c1:e1:0b:3f",
            "net9": "ea:32:7c:e7:e2:95"
        },
        "leaf_1_0_13": {
            "net0": "96:3e:f7:b4:d2:2c",
            "net1": "22:fa:ae:d2:c7:99",
            "net10": "52:18:8c:de:a2:04",
            "net11": "3a:c6:cc:ea:1d:3c",
            "net12": "4a:1e:89:74:ca:20",
            "net13": "b6:3c:e1:09:b0:35",
            "net14": "46:54:a3:db:04:60",
            "net2": "9e:c9:23:17:e8:44",
            "net3": "02:f1:1e:0d:df:a5",
            "net4": "8e:fd:d8:94:81:7c",
            "net5": "8e:b7:34:8d:0a:ce",
            "net6": "8a:fd:a0:e1:48:4f",
            "net7": "0a:0f:9a:bc:87:59",
            "net8": "ea:4f:b5:28:96:a6",
            "net9": "7a:d8:34:08:d5:30"
        },
        "leaf_1_0_14": {
            "net0": "b6:32:c8:e4:5c:8e",
            "net1": "4e:92:77:ec:fb:25",
            "net10": "66:d7:50:ca:59:02",
            "net11": "4e:f4:79:24:e9:f7",
            "net12": "e2:73:87:e1:6c:43",
            "net13": "f2:09:d8:ba:fe:c1",
            "net14": "fa:24:3f:76:a1:d4",
            "net2": "fa:5f:e2:9c:76:3c",
            "net3": "42:55:4d:22:9e:e7",
            "net4": "4a:1d:1e:d9:e7:f2",
            "net5": "4a:62:cc:30:2f:83",
            "net6": "82:32:19:b0:2e:3e",
            "net7": "36:fe:7d:6c:4f:41",
            "net8": "92:6a:ba:0f:91:95",
            "net9": "0a:e3:c1:72:cf:bd"
        },
        "leaf_1_0_2": {
            "net0": "2e:4e:68:14:1f:8c",
            "net1": "ce:dd:e9:a8:48:20",
            "net10": "b2:59:55:e2:b4:df",
            "net11": "9a:35:6c:1f:e2:bd",
            "net12": "ca:cf:11:2b:1a:af",
            "net13": "e2:b3:25:e0:67:b6",
            "net14": "22:b6:a9:ed:16:16",
            "net2": "7a:e0:97:89:0c:10",
            "net3": "5a:5f:bc:00:bf:16",
            "net4": "62:7f:e5:84:e3:b0",
            "net5": "4e:6e:f6:48:e1:ec",
            "net6": "c2:a5:6c:28:78:4e",
            "net7": "a6:1a:f1:05:b9:f3",
            "net8": "ca:e7:16:6c:de:21",
            "net9": "86:1c:3d:b3:71:da"
        },
        "leaf_1_0_3": {
            "net0": "ee:14:d4:80:a3:00",
            "net1": "4e:a0:cf:6a:bf:0a",
            "net10": "16:1a:2c:51:e2:25",
            "net11": "f6:c9:eb:31:9a:7e",
            "net12": "8a:ed:f4:9c:a3:95",
            "net13": "66:31:d9:e8:bd:79",
            "net14": "46:7d:73:a7:f6:24",
            "net2": "4e:8d:0c:19:e0:c1",
            "net3": "3e:72:96:7b:2d:4a",
            "net4": "36:1a:5d:95:64:1c",
            "net5": "e6:1c:bc:82:0d:11",
            "net6": "e6:c8:c2:c7:19:bc",
            "net7": "ce:31:12:ba:88:80",
            "net8": "f6:c5:81:d6:cc:44",
            "net9": "7a:b0:1f:9f:12:bb"
        },
        "leaf_1_0_4": {
            "net0": "96:01:73:b4:b7:b6",
            "net1": "62:47:3a:25:dd:ea",
            "net10": "66:1b:47:1f:d8:57",
            "net11": "02:5a:d4:5e:98:35",
            "net12": "1e:d3:d1:65:29:94",
            "net13": "82:9b:94:b8:a8:33",
            "net14": "0e:b4:02:c4:4c:23",
            "net2": "1a:41:13:d4:48:96",
            "net3": "12:15:a0:98:99:00",
            "net4": "fa:6b:bb:bf:3a:63",
            "net5": "3e:87:dc:d9:29:b4",
            "net6": "0a:82:7f:63:e2:ba",
            "net7": "a6:76:dc:72:9a:e2",
            "net8": "66:16:9f:6c:35:3f",
            "net9": "56:5a:37:a7:d2:44"
        },
        "leaf_1_0_5": {
            "net0": "4e:bc:af:6e:a5:60",
            "net1": "aa:36:eb:67:c3:24",
            "net10": "e2:10:e3:83:93:be",
            "net11": "4a:7e:a5:e8:cc:4f",
            "net12": "6e:35:64:4b:b5:5e",
            "net13": "7e:e5:5f:8a:aa:82",
            "net14": "b6:a3:ed:ea:1e:d8",
            "net2": "aa:0c:e5:ff:72:1f",
            "net3": "7e:1d:a2:43:f6:ce",
            "net4": "06:50:bd:c4:bb:a0",
            "net5": "86:03:5c:d3:fb:cf",
            "net6": "3e:b9:e8:48:b3:3b",
            "net7": "d2:e1:5c:cf:68:b0",
            "net8": "a2:c1:09:88:d0:bc",
            "net9": "f6:14:1a:14:32:b1"
        },
        "leaf_1_0_6": {
            "net0": "e6:e5:c2:42:37:05",
            "net1": "aa:43:95:76:2d:74",
            "net10": "9e:70:54:81:6c:d8",
            "net11": "5e:1d:39:e9:ec:dc",
            "net12": "f2:94:3c:e5:ce:96",
            "net13": "f6:d5:b0:15:cc:d7",
            "net14": "9a:75:e8:c6:87:ea",
            "net2": "f6:d5:cd:49:da:71",
            "net3": "da:32:83:2d:e4:bf",
            "net4": "56:30:c5:98:53:1c",
            "net5": "32:bf:55:fc:05:f0",
            "net6": "46:ae:20:33:43:a4",
            "net7": "6a:5f:4c:89:1a:09",
            "net8": "aa:44:92:a5:22:f6",
            "net9": "86:66:fb:ab:6e:20"
        },
        "leaf_1_0_7": {
            "net0": "e2:5c:4b:92:56:2a",
            "net1": "a6:88:05:cc:18:fe",
            "net10": "fa:d0:e3:f7:0f:70",
            "net11": "f6:7c:4b:fc:58:98",
            "net12": "8a:9a:ff:92:67:7e",
            "net13": "06:7c:15:84:64:56",
            "net14": "da:ee:51:12:df:c1",
            "net2": "0a:c1:2c:02:cc:fe",
            "net3": "7e:14:71:2d:48:d2",
            "net4": "a2:35:7c:72:82:e0",
            "net5": "b2:12:f9:bd:1c:09",
            "net6": "0e:78:c1:ae:0f:48",
            "net7": "ce:65:8c:f5:7f:3a",
            "net8": "b6:5f:61:6c:08:8b",
            "net9": "ba:a3:ab:8d:6f:3b"
        },
        "leaf_1_0_8": {
            "net0": "f6:b4:ec:ca:5e:6f",
            "net1": "8e:e8:cb:4d:eb:45",
            "net10": "ce:fd:9a:b3:9f:de",
            "net11": "5a:b8:93:fa:97:ec",
            "net12": "56:0d:47:a4:d3:63",
            "net13": "be:72:35:f5:7b:10",
            "net14": "3e:db:75:48:28:f3",
            "net2": "72:44:a9:c3:55:60",
            "net3": "5e:17:e5:8d:fc:e1",
            "net4": "ea:81:aa:6c:a5:ff",
            "net5": "fe:07:73:e7:05:d4",
            "net6": "42:3c:08:34:f6:09",
            "net7": "42:b2:73:b4:17:c1",
            "net8": "5e:de:91:5c:3a:c8",
            "net9": "8a:18:c8:4d:4d:14"
        },
        "leaf_1_0_9": {
            "net0": "ae:95:69:0a:d5:b6",
            "net1": "06:50:67:30:b9:a7",
            "net10": "36:43:70:cc:cf:5a",
            "net11": "0a:7a:4d:d4:ad:cb",
            "net12": "aa:a2:3c:b5:f2:9d",
            "net13": "72:2d:37:f6:79:7a",
            "net14": "76:9c:cd:ec:ba:71",
            "net2": "2a:6f:e9:02:18:f3",
            "net3": "1a:04:74:de:58:82",
            "net4": "e2:78:dc:35:c9:11",
            "net5": "ca:da:66:e8:1c:96",
            "net6": "f2:f7:fd:c1:95:00",
            "net7": "96:c6:22:1d:db:13",
            "net8": "a6:63:85:34:c7:54",
            "net9": "7a:f4:61:09:aa:ea"
        },
        "leaf_2_0_1": {
            "net0": "52:46:57:04:5b:e4",
            "net1": "a2:e8:2f:ae:1b:08",
            "net10": "1a:86:47:f3:4a:ce",
            "net11": "5a:01:0a:39:5c:47",
            "net12": "1e:e1:a9:85:22:71",
            "net13": "0e:41:51:74:0c:fe",
            "net14": "b6:a0:4f:cb:36:a3",
            "net2": "ce:c0:07:4c:9e:45",
            "net3": "f2:16:68:5d:bd:02",
            "net4": "22:3f:35:0f:2b:01",
            "net5": "32:06:c5:e0:8b:1e",
            "net6": "2a:a1:d9:62:e9:2e",
            "net7": "1a:54:40:15:64:e8",
            "net8": "82:2b:39:ce:77:f1",
            "net9": "a2:e8:cb:9d:db:6f"
        },
        "leaf_2_0_10": {
            "net0": "b6:3d:d1:f4:56:ba",
            "net1": "1a:34:8e:b8:cd:7c",
            "net10": "82:6a:c7:b8:d7:65",
            "net11": "8a:1c:c4:88:3e:c4",
            "net12": "72:64:6a:a1:dd:27",
            "net13": "96:45:38:04:17:97",
            "net14": "0e:75:af:be:e9:4c",
            "net2": "4e:be:26:37:6b:a8",
            "net3": "3a:af:b3:05:fe:5b",
            "net4": "f2:98:9e:1d:38:d7",
            "net5": "1e:d1:68:3a:5f:45",
            "net6": "16:9c:10:68:8d:15",
            "net7": "9a:c7:7d:9c:00:51",
            "net8": "d2:f0:6e:e3:e3:e7",
            "net9": "4e:71:21:ba:1c:58"
        },
        "leaf_2_0_11": {
            "net0": "26:0f:29:51:23:99",
            "net1": "36:1c:9d:df:57:7a",
            "net10": "aa:2f:ee:9b:a7:95",
            "net11": "8a:63:19:9d:42:64",
            "net12": "ae:88:ba:30:8d:5c",
            "net13": "46:94:c7:ea:1e:c3",
            "net14": "82:65:da:a3:b1:84",
            "net2": "da:f3:d8:60:f4:6b",
            "net3": "9a:29:1f:38:c5:76",
            "net4": "86:7a:1c:23:15:82",
            "net5": "ba:62:8c:40:76:10",
            "net6": "72:80:d3:ea:88:1e",
            "net7": "3a:f1:7e:ea:40:dd",
            "net8": "7a:4a:39:ee:71:97",
            "net9": "5e:d7:aa:03:7f:14"
        },
        "leaf_2_0_12": {
            "net0": "76:05:1f:0f:8e:b7",
            "net1": "72:be:63:da:fc:05",
            "net10": "ae:61:c4:56:8b:6e",
            "net11": "d6:19:7c:22:10:8c",
            "net12": "ca:e3:1a:d0:a7:ee",
            "net13": "ae:12:eb:9e:9c:3e",
            "net14": "ae:07:d6:03:3c:90",
            "net2": "1e:16:41:f6:69:fe",
            "net3": "6e:bf:e0:e3:db:37",
            "net4": "fa:e8:ec:24:f9:db",
            "net5": "1a:2b:9d:3d:ff:19",
            "net6": "ae:e2:b8:d3:06:86",
            "net7": "86:f0:9a:50:86:d2",
            "net8": "ce:7e:1c:aa:84:72",
            "net9": "c6:18:8b:50:61:9c"
        },
        "leaf_2_0_13": {
            "net0": "fa:44:40:4c:03:25",
            "net1": "72:ec:4e:ff:8a:35",
            "net10": "aa:63:74:21:80:09",
            "net11": "b6:f7:df:84:70:f0",
            "net12": "b2:89:2d:e1:d8:7a",
            "net13": "22:c5:08:2c:10:41",
            "net14": "e2:de:93:47:ee:5f",
            "net2": "e6:09:60:7e:45:72",
            "net3": "d2:0a:51:62:f8:50",
            "net4": "e2:b9:1c:d9:39:b7",
            "net5": "d6:c8:5e:8c:0f:b1",
            "net6": "da:51:04:69:42:06",
            "net7": "9e:d3:3e:4a:19:b9",
            "net8": "82:d1:5a:93:0c:f7",
            "net9": "a6:66:8c:90:4b:c3"
        },
        "leaf_2_0_14": {
            "net0": "fa:2b:6f:33:1f:48",
            "net1": "4a:82:85:54:9c:d6",
            "net10": "ca:90:39:53:20:69",
            "net11": "92:c8:e4:8a:13:6e",
            "net12": "8a:d6:ba:fc:76:cb",
            "net13": "5e:d1:90:23:f2:fc",
            "net14": "d6:6c:0e:d1:a4:af",
            "net2": "42:3d:be:f3:d2:b4",
            "net3": "c6:a5:05:6c:76:55",
            "net4": "72:d1:db:08:cc:1b",
            "net5": "ce:67:6e:09:e7:0d",
            "net6": "f6:72:d1:b7:03:cf",
            "net7": "7a:e7:f9:ff:cc:a9",
            "net8": "d2:a2:87:f8:00:91",
            "net9": "6e:8b:06:6e:01:40"
        },
        "leaf_2_0_2": {
            "net0": "82:2f:fd:3b:e1:93",
            "net1": "92:36:84:2d:df:31",
            "net10": "be:2c:63:33:ad:dc",
            "net11": "fe:7c:4f:a4:39:f2",
            "net12": "b2:a7:f0:0f:f0:62",
            "net13": "92:e6:53:35:57:75",
            "net14": "56:02:77:52:a2:82",
            "net2": "82:94:a8:10:d5:83",
            "net3": "16:6c:c9:69:05:19",
            "net4": "7a:5c:da:b7:89:cf",
            "net5": "92:67:21:e7:d4:fa",
            "net6": "02:c3:91:0d:19:6c",
            "net7": "26:45:a2:af:ac:75",
            "net8": "46:3d:6d:dc:4e:a8",
            "net9": "16:a1:43:86:66:85"
        },
        "leaf_2_0_3": {
            "net0": "72:33:3a:a7:d4:c3",
            "net1": "32:f9:8d:ed:7c:40",
            "net10": "d6:07:a1:e4:78:03",
            "net11": "6a:43:aa:f2:37:83",
            "net12": "ce:51:c3:c2:80:bc",
            "net13": "52:5b:7e:b1:1c:ad",
            "net14": "06:68:55:3d:52:c9",
            "net2": "76:ab:b1:fa:c5:7a",
            "net3": "42:cf:63:fe:48:91",
            "net4": "3e:03:cc:47:c5:ed",
            "net5": "5a:74:76:4c:b8:b6",
            "net6": "f2:a1:3b:a5:df:70",
            "net7": "0a:8f:f0:9b:51:b6",
            "net8": "ea:1c:36:86:4d:73",
            "net9": "36:39:b8:d9:9e:ad"
        },
        "leaf_2_0_4": {
            "net0": "ca:3e:e9:ed:f5:11",
            "net1": "82:9f:24:5e:3a:72",
            "net10": "be:5f:8d:ba:92:d5",
            "net11": "8e:ba:83:43:a9:13",
            "net12": "c6:81:5f:51:fd:1d",
            "net13": "f2:df:e6:28:b6:a6",
            "net14": "da:7f:09:e2:9c:44",
            "net2": "96:6d:61:67:aa:5e",
            "net3": "7a:9a:bd:43:95:a0",
            "net4": "4e:9a:5f:8c:51:62",
            "net5": "46:21:d5:3c:68:b1",
            "net6": "5a:a2:32:4f:4f:a0",
            "net7": "22:93:47:b9:73:55",
            "net8": "5a:11:6f:9c:73:70",
            "net9": "0a:67:82:ce:fb:79"
        },
        "leaf_2_0_5": {
            "net0": "6a:06:8d:7b:9a:a1",
            "net1": "e6:b9:14:82:6c:e7",
            "net10": "62:98:17:27:af:a8",
            "net11": "ee:48:24:34:36:61",
            "net12": "9a:06:f7:bb:a6:74",
            "net13": "2a:e3:ff:66:bb:cd",
            "net14": "fe:d5:4a:16:f6:fc",
            "net2": "9a:a3:81:3b:37:0e",
            "net3": "02:e9:06:e4:3e:c6",
            "net4": "02:a9:d0:03:a7:7e",
            "net5": "fe:b3:95:81:4f:39",
            "net6": "e2:8c:69:cd:3f:16",
            "net7": "3a:94:ac:9d:18:7d",
            "net8": "66:d5:e5:42:4c:e7",
            "net9": "b2:08:8a:c2:e6:42"
        },
        "leaf_2_0_6": {
            "net0": "aa:5e:71:29:36:ae",
            "net1": "62:f9:cc:0f:7c:bd",
            "net10": "ea:c4:a8:ac:7b:51",
            "net11": "46:78:56:32:39:d7",
            "net12": "5a:a9:56:59:f7:df",
            "net13": "d6:62:bf:17:67:23",
            "net14": "7e:cb:ba:84:c5:32",
            "net2": "92:31:98:26:1b:d6",
            "net3": "4e:f2:dd:0f:95:5a",
            "net4": "22:b2:cf:44:9c:bc",
            "net5": "be:49:00:39:04:4a",
            "net6": "86:f1:bd:50:89:35",
            "net7": "66:a0:d5:92:a6:7c",
            "net8": "6e:b0:01:55:06:b1",
            "net9": "3e:df:db:c5:30:36"
        },
        "leaf_2_0_7": {
            "net0": "fa:c2:8d:91:69:72",
            "net1": "86:94:cb:2e:a4:87",
            "net10": "4e:7f:13:6d:da:2c",
            "net11": "22:74:b9:5c:8e:01",
            "net12": "a6:1a:d5:c6:08:3c",
            "net13": "2a:b4:e5:f1:58:64",
            "net14": "0a:cd:c2:b6:bf:80",
            "net2": "ea:6c:27:c7:fe:4b",
            "net3": "ba:2d:ce:d7:aa:b8",
            "net4": "da:4a:60:9a:06:e8",
            "net5": "42:f7:81:b5:65:22",
            "net6": "1e:fe:e8:ea:16:79",
            "net7": "76:11:dc:eb:42:1f",
            "net8": "b2:19:e6:38:31:b6",
            "net9": "86:44:f0:3d:99:31"
        },
        "leaf_2_0_8": {
            "net0": "42:b2:3b:c5:9f:b3",
            "net1": "2a:31:d5:e0:72:87",
            "net10": "ca:b1:d2:7a:9a:7d",
            "net11": "3a:cf:a9:80:5e:bd",
            "net12": "da:5e:3a:4b:b4:80",
            "net13": "3a:26:97:d2:2b:cb",
            "net14": "6e:18:a8:c8:8b:a5",
            "net2": "3e:1b:e5:eb:50:20",
            "net3": "fe:ba:f6:cc:9d:32",
            "net4": "5e:b3:39:ca:5d:9f",
            "net5": "6e:bc:a9:d5:82:3e",
            "net6": "4a:10:2c:1d:86:c0",
            "net7": "fa:99:9f:e9:83:06",
            "net8": "0e:a6:66:b8:1a:f1",
            "net9": "1a:93:a8:22:18:f4"
        },
        "leaf_2_0_9": {
            "net0": "1e:52:f5:9e:ce:e9",
            "net1": "ce:c4:f9:10:1e:6f",
            "net10": "fe:d8:0d:4b:5f:ff",
            "net11": "5a:6d:53:79:33:0e",
            "net12": "ae:b0:47:ea:ba:98",
            "net13": "32:ab:8d:e1:41:7e",
            "net14": "ae:b9:d2:7f:06:bc",
            "net2": "82:c9:fc:96:1d:1e",
            "net3": "ba:9f:62:14:55:ac",
            "net4": "62:6b:13:52:ad:9b",
            "net5": "1a:d4:71:c0:a8:cf",
            "net6": "6a:23:a8:98:aa:e6",
            "net7": "e6:a5:b3:38:af:b0",
            "net8": "ae:6f:f3:73:b9:4e",
            "net9": "ce:aa:03:0d:2f:07"
        },
        "spine_1_1_1": {
            "net0": "a2:af:ac:cc:ac:67",
            "net1": "ba:6d:09:89:20:80",
            "net10": "6a:12:69:4e:d2:b2",
            "net11": "12:08:f0:06:5e:bd",
            "net12": "16:70:a4:22:be:12",
            "net13": "b2:b3:1c:38:c1:ad",
            "net14": "be:93:4e:d8:2a:87",
            "net15": "02:2e:0e:6f:dd:07",
            "net16": "a6:bb:6a:c1:7c:e1",
            "net17": "52:6a:7d:5f:52:c4",
            "net18": "da:15:2b:5e:25:0a",
            "net19": "82:5a:b3:68:76:38",
            "net2": "7a:1b:1e:4d:79:d7",
            "net20": "2e:ab:71:17:c9:fc",
            "net21": "7e:fe:da:0c:0b:e1",
            "net22": "02:46:39:e5:99:a3",
            "net23": "6a:e1:a0:6e:22:72",
            "net24": "f2:17:5c:94:31:bf",
            "net25": "b6:b9:1e:f1:7b:1d",
            "net26": "0a:25:84:a6:04:03",
            "net27": "72:b6:5d:0a:56:65",
            "net3": "ce:b8:8b:9a:db:97",
            "net4": "92:2c:2f:e0:78:d3",
            "net5": "0e:c8:f3:6e:72:c0",
            "net6": "fa:a8:c2:1f:72:04",
            "net7": "c6:36:f3:c1:13:d4",
            "net8": "ce:52:56:bd:de:c1",
            "net9": "66:68:a2:bf:c9:1a"
        },
        "spine_1_1_10": {
            "net0": "5e:2b:13:58:1a:ad",
            "net1": "32:8d:34:81:0f:f0",
            "net10": "ee:7a:fc:b7:41:cb",
            "net11": "22:70:8b:17:22:48",
            "net12": "16:24:e5:6b:c9:16",
            "net13": "ca:73:ce:63:85:f3",
            "net14": "06:24:9f:a4:54:dc",
            "net15": "de:ea:3b:57:ad:2c",
            "net16": "76:48:e4:d6:1b:d3",
            "net17": "9a:99:c9:df:4c:2e",
            "net18": "3e:c1:27:03:05:eb",
            "net19": "f2:d8:68:83:f2:9a",
            "net2": "9a:57:45:fd:af:40",
            "net20": "be:72:ee:ff:b0:6a",
            "net21": "82:8e:5e:26:0a:40",
            "net22": "32:c2:01:64:4c:73",
            "net23": "26:bd:89:80:e0:1d",
            "net24": "fa:24:a0:6d:36:90",
            "net25": "22:a7:1c:ca:08:f7",
            "net26": "2e:b8:ac:d0:15:ee",
            "net27": "aa:ad:96:d2:9a:68",
            "net3": "0a:0a:31:be:fd:f7",
            "net4": "42:02:56:49:fe:e2",
            "net5": "86:d3:8a:4d:35:dc",
            "net6": "a2:cb:d4:b3:a1:21",
            "net7": "2e:25:b5:1d:a2:d3",
            "net8": "ae:a0:6f:06:5d:02",
            "net9": "56:8a:ff:21:47:45"
        },
        "spine_1_1_11": {
            "net0": "da:45:03:0a:63:84",
            "net1": "be:71:b7:04:3f:ad",
            "net10": "8e:25:5c:96:f9:f8",
            "net11": "3a:74:8f:da:a5:09",
            "net12": "fe:ac:bb:c2:02:90",
            "net13": "b2:72:df:5b:57:90",
            "net14": "2e:ba:66:8a:1e:4a",
            "net15": "d6:ac:0f:ea:9b:b6",
            "net16": "ca:02:c3:1f:15:89",
            "net17": "2a:64:c5:0c:b1:9f",
            "net18": "c6:ed:67:e7:0f:ef",
            "net19": "32:cc:be:38:fe:b5",
            "net2": "22:a4:f0:9e:0d:cd",
            "net20": "7e:c1:ad:7d:89:b3",
            "net21": "9a:55:5f:3f:ef:6a",
            "net22": "36:60:aa:9e:f1:6f",
            "net23": "06:b3:61:ad:9c:2c",
            "net24": "9a:0d:14:82:0c:57",
            "net25": "fe:54:af:5d:b4:fd",
            "net26": "5e:88:35:72:56:e6",
            "net27": "1a:a7:ee:f2:5e:4e",
            "net3": "ee:35:e6:6a:f1:f8",
            "net4": "6e:34:63:a5:d6:9e",
            "net5": "3a:a8:fd:1b:71:9e",
            "net6": "8a:3e:f2:79:ab:cf",
            "net7": "fa:0b:fe:51:78:24",
            "net8": "1a:41:cd:f7:b2:12",
            "net9": "22:06:de:83:50:1c"
        },
        "spine_1_1_12": {
            "net0": "7a:f0:57:c0:b6:9e",
            "net1": "02:43:42:7f:5e:43",
            "net10": "ae:44:0b:81:fc:17",
            "net11": "1a:59:b1:02:64:f2",
            "net12": "72:fa:05:0f:ad:1e",
            "net13": "96:b8:cd:7f:9c:63",
            "net14": "f6:f4:34:96:58:e9",
            "net15": "36:58:ce:fd:9c:8c",
            "net16": "8e:a7:92:d3:10:00",
            "net17": "4e:d0:e6:8e:2d:ce",
            "net18": "1a:35:5a:5a:e3:6f",
            "net19": "ae:fc:aa:12:3c:98",
            "net2": "16:97:e0:f3:bf:7f",
            "net20": "36:52:13:fd:b5:d1",
            "net21": "62:71:bb:2f:03:1c",
            "net22": "b6:12:2e:66:69:ca",
            "net23": "6a:c5:d0:47:61:fc",
            "net24": "72:08:85:46:fc:3c",
            "net25": "ae:27:ea:24:bd:e2",
            "net26": "0a:26:2c:3c:1a:83",
            "net27": "ea:52:5b:1f:94:7b",
            "net3": "02:6f:8d:3f:25:06",
            "net4": "12:d4:0b:c1:8b:82",
            "net5": "46:b9:cf:9e:84:63",
            "net6": "06:64:c7:86:6c:03",
            "net7": "92:0a:fc:0a:b9:4e",
            "net8": "2e:53:71:0c:eb:de",
            "net9": "26:13:3c:1d:59:b3"
        },
        "spine_1_1_13": {
            "net0": "7e:b6:b0:55:44:eb",
            "net1": "fa:ce:01:b4:db:2f",
            "net10": "12:92:3b:e0:4f:ef",
            "net11": "7e:e3:bd:4d:c1:50",
            "net12": "f2:c1:f7:23:d9:74",
            "net13": "2e:38:95:e1:6e:0b",
            "net14": "b2:fd:89:8f:c4:af",
            "net15": "12:5f:5d:3c:b0:f2",
            "net16": "e2:e3:a7:6b:57:4f",
            "net17": "7a:9d:28:99:16:be",
            "net18": "96:29:07:bf:18:91",
            "net19": "b6:69:6e:a6:ad:00",
            "net2": "96:b5:00:86:61:ca",
            "net20": "a2:22:d5:3f:20:7c",
            "net21": "2a:dd:1e:63:0a:38",
            "net22": "5a:aa:f5:97:ec:2a",
            "net23": "2e:c8:30:1d:2d:a1",
            "net24": "0e:e8:4a:0a:63:20",
            "net25": "42:0e:53:82:39:55",
            "net26": "3a:8d:c9:a6:5e:1a",
            "net27": "66:bf:c6:99:24:09",
            "net3": "5a:41:01:5a:2e:f4",
            "net4": "e6:cf:de:7b:57:a7",
            "net5": "d6:d4:91:03:64:80",
            "net6": "9a:a0:b4:7f:da:d3",
            "net7": "3a:81:8b:2e:f9:ee",
            "net8": "a2:dd:16:69:ae:db",
            "net9": "9e:6b:dd:11:01:dd"
        },
        "spine_1_1_14": {
            "net0": "ea:be:83:32:9f:46",
            "net1": "46:53:8b:62:a5:fd",
            "net10": "8e:07:ea:62:d2:84",
            "net11": "0e:31:d2:3a:3f:1b",
            "net12": "8e:69:8b:b3:fc:c3",
            "net13": "ea:44:8e:c5:32:1a",
            "net14": "fa:bf:97:9d:5d:e4",
            "net15": "7a:17:ee:64:36:25",
            "net16": "1e:d0:53:f8:46:b6",
            "net17": "2e:c4:d7:42:9a:db",
            "net18": "e6:e4:a2:f3:5f:52",
            "net19": "a2:8c:4b:9f:ae:1c",
            "net2": "92:dc:86:04:2c:87",
            "net20": "da:7b:29:b1:64:2c",
            "net21": "46:8d:14:a5:0c:9f",
            "net22": "8e:73:44:fe:3b:ce",
            "net23": "d6:f7:bf:c2:0f:83",
            "net24": "42:4e:a2:15:b3:f1",
            "net25": "52:33:f3:e5:3b:23",
            "net26": "ce:6c:f2:87:62:2f",
            "net27": "42:09:57:22:2d:6a",
            "net3": "82:49:95:dd:48:93",
            "net4": "02:53:a5:bc:4c:82",
            "net5": "d2:53:b9:4c:61:7b",
            "net6": "be:91:65:c6:d6:d1",
            "net7": "ae:24:61:84:7a:71",
            "net8": "ca:1c:d1:9d:1f:91",
            "net9": "12:ae:7b:96:9f:1d"
        },
        "spine_1_1_2": {
            "net0": "16:ec:e9:b1:13:6f",
            "net1": "52:63:56:2f:53:75",
            "net10": "92:8a:ec:38:ea:51",
            "net11": "6a:98:53:12:bc:ad",
            "net12": "ca:05:be:ed:c9:cf",
            "net13": "5a:19:7f:9f:ed:da",
            "net14": "9a:79:99:52:e4:7e",
            "net15": "06:96:c9:3b:e0:f6",
            "net16": "d6:5f:82:37:de:f1",
            "net17": "62:6e:c3:df:c7:93",
            "net18": "fe:36:65:8c:54:54",
            "net19": "a6:d3:1f:78:da:77",
            "net2": "ba:a3:bf:8f:b8:a6",
            "net20": "02:bd:3d:a2:e8:40",
            "net21": "26:f0:b1:0e:d4:61",
            "net22": "2a:97:79:36:29:ef",
            "net23": "f2:42:4b:20:72:82",
            "net24": "6e:99:d5:59:79:6d",
            "net25": "b2:a8:c1:bf:ad:be",
            "net26": "2a:c2:2f:e3:6b:b7",
            "net27": "86:d4:5a:3c:3a:85",
            "net3": "4e:fc:32:a7:97:2d",
            "net4": "9a:31:87:4c:59:b1",
            "net5": "06:fd:d8:17:18:49",
            "net6": "e2:47:a9:67:9f:a8",
            "net7": "56:13:dd:40:be:43",
            "net8": "b2:12:25:3f:bd:a5",
            "net9": "9a:88:13:67:d1:57"
        },
        "spine_1_1_3": {
            "net0": "9a:66:64:97:a9:cc",
            "net1": "b6:61:36:1b:39:44",
            "net10": "36:e7:eb:88:18:02",
            "net11": "72:20:90:ee:a0:bf",
            "net12": "8a:96:1b:ab:06:b8",
            "net13": "da:e9:5c:13:e4:e3",
            "net14": "0a:0c:f9:16:ed:3a",
            "net15": "92:57:d9:1b:97:2c",
            "net16": "6a:17:71:87:92:76",
            "net17": "26:85:d9:ea:07:42",
            "net18": "66:80:10:67:f7:f6",
            "net19": "aa:13:e9:c4:74:f6",
            "net2": "72:e6:48:27:ef:65",
            "net20": "6a:4c:9d:02:d1:db",
            "net21": "52:f2:e1:16:da:b5",
            "net22": "12:b4:47:11:b5:24",
            "net23": "9a:2b:e0:98:9f:43",
            "net24": "ca:20:0b:63:d2:56",
            "net25": "c6:a3:f1:bd:a4:e5",
            "net26": "de:5f:36:63:ed:3b",
            "net27": "22:fc:ec:27:75:ff",
            "net3": "76:64:43:c4:17:0f",
            "net4": "66:6f:c2:5a:9e:46",
            "net5": "d6:34:dc:8b:c7:3c",
            "net6": "a2:b2:1f:ef:dc:26",
            "net7": "fe:36:b9:38:ac:d1",
            "net8": "e6:65:2c:c0:a1:e1",
            "net9": "b2:c0:10:67:ee:b4"
        },
        "spine_1_1_4": {
            "net0": "aa:48:0d:4e:a2:6a",
            "net1": "52:3c:88:7d:cc:82",
            "net10": "0e:29:51:0c:b5:3d",
            "net11": "5e:25:92:a0:37:62",
            "net12": "36:6a:70:fa:c0:6e",
            "net13": "4a:cc:f7:2b:ce:c0",
            "net14": "1e:f5:b2:eb:e6:f3",
            "net15": "da:4c:e3:34:b3:e3",
            "net16": "ea:a2:91:fd:ea:dd",
            "net17": "62:24:32:f9:28:44",
            "net18": "3a:d5:ee:43:d6:c7",
            "net19": "8a:81:42:da:6d:5d",
            "net2": "8e:bb:72:ba:a4:ba",
            "net20": "a6:a8:5e:8d:fc:a1",
            "net21": "82:39:3f:f9:ba:cd",
            "net22": "36:9c:ef:48:80:0f",
            "net23": "02:05:d3:bd:fb:ee",
            "net24": "ea:ae:3c:6d:d3:8d",
            "net25": "0a:79:5d:88:06:b9",
            "net26": "f2:3b:be:1a:4e:72",
            "net27": "d2:60:d1:05:12:30",
            "net3": "02:74:92:1b:e7:71",
            "net4": "fe:e2:4e:51:3a:ad",
            "net5": "fe:75:93:e7:5c:d4",
            "net6": "1e:ce:b0:e6:cc:d9",
            "net7": "c2:68:f6:18:17:9a",
            "net8": "9e:50:ce:15:69:9b",
            "net9": "da:ab:0d:45:c5:ba"
        },
        "spine_1_1_5": {
            "net0": "92:45:76:ff:22:be",
            "net1": "2e:2c:be:9e:99:e9",
            "net10": "5e:35:4b:cb:fc:2f",
            "net11": "7e:76:f3:d4:be:0c",
            "net12": "4e:e0:95:7a:20:bf",
            "net13": "9e:14:d6:11:60:86",
            "net14": "ba:59:62:8e:9a:22",
            "net15": "02:f1:2e:60:03:c6",
            "net16": "6a:c9:07:dd:40:a9",
            "net17": "5a:60:a4:5b:57:03",
            "net18": "0a:12:73:44:07:9c",
            "net19": "06:0e:ef:11:4f:0b",
            "net2": "7e:90:9a:7a:b1:18",
            "net20": "32:f6:d6:d3:61:4b",
            "net21": "42:26:bb:2a:ad:d7",
            "net22": "ae:fd:57:d0:d7:63",
            "net23": "fe:0a:b8:ee:c6:c3",
            "net24": "0e:d2:a6:69:96:e8",
            "net25": "fa:16:c9:05:10:90",
            "net26": "ea:05:51:00:3a:52",
            "net27": "be:c1:c9:34:7c:66",
            "net3": "16:eb:09:fa:d3:fa",
            "net4": "a2:0a:d6:e3:1b:06",
            "net5": "16:e7:4f:30:40:5a",
            "net6": "ae:8f:13:68:85:45",
            "net7": "5a:10:77:1d:ba:5b",
            "net8": "e2:3a:f4:14:c4:97",
            "net9": "b6:9b:16:83:89:2f"
        },
        "spine_1_1_6": {
            "net0": "4e:0f:19:c4:a0:58",
            "net1": "62:e6:0b:24:b2:5e",
            "net10": "6e:f1:57:17:10:f4",
            "net11": "4e:6a:22:d1:46:61",
            "net12": "a2:99:f2:4a:c0:c0",
            "net13": "86:19:48:d7:60:4c",
            "net14": "fa:33:fe:31:06:47",
            "net15": "ca:8a:79:70:f7:ef",
            "net16": "9a:a2:23:fe:0c:0a",
            "net17": "1a:90:3a:f6:e2:e2",
            "net18": "52:55:ae:66:47:93",
            "net19": "2a:29:c2:01:4f:90",
            "net2": "12:ae:ca:a9:75:62",
            "net20": "92:58:4b:3e:7e:1f",
            "net21": "b2:00:65:17:0f:e6",
            "net22": "9a:48:9b:29:31:ab",
            "net23": "ee:a3:40:f8:8d:8e",
            "net24": "1e:f4:d2:74:78:dc",
            "net25": "d6:dd:51:d4:ab:fa",
            "net26": "e2:a5:18:f5:d1:5c",
            "net27": "d6:1e:8c:ba:6e:a0",
            "net3": "32:65:8b:47:c9:b0",
            "net4": "46:70:23:8c:45:b5",
            "net5": "ae:13:56:e3:ad:32",
            "net6": "4e:23:c8:2a:0f:3c",
            "net7": "8e:22:c1:a6:82:31",
            "net8": "8e:7b:0b:6e:2a:67",
            "net9": "fa:06:18:f9:d4:34"
        },
        "spine_1_1_7": {
            "net0": "0e:80:d8:39:f5:6f",
            "net1": "52:5b:9d:be:a0:b7",
            "net10": "a2:9d:73:94:b7:94",
            "net11": "56:ef:5a:98:33:a7",
            "net12": "7e:b3:be:74:77:80",
            "net13": "36:8b:00:d2:29:db",
            "net14": "3a:90:9f:f1:97:81",
            "net15": "56:07:67:49:f7:fc",
            "net16": "7e:a3:54:cf:a9:ba",
            "net17": "4e:f5:9d:fd:7b:d8",
            "net18": "de:32:7a:ac:35:66",
            "net19": "72:3a:a0:25:df:cc",
            "net2": "96:a1:3d:dd:6a:1c",
            "net20": "96:f7:ba:ff:85:af",
            "net21": "96:17:e2:a0:d4:c4",
            "net22": "ae:ef:7c:df:0d:6b",
            "net23": "8a:e2:2f:a5:72:ab",
            "net24": "fe:22:c8:58:ad:df",
            "net25": "52:b6:76:4e:61:40",
            "net26": "a2:47:ad:85:9b:f8",
            "net27": "d6:c6:59:26:ab:82",
            "net3": "86:b1:38:b6:76:57",
            "net4": "c2:0a:1e:08:ba:cb",
            "net5": "26:06:2a:e6:de:2b",
            "net6": "62:37:64:81:46:80",
            "net7": "56:b9:9b:bf:7f:0f",
            "net8": "ae:4d:f8:17:ac:0e",
            "net9": "2e:6a:e7:98:92:b1"
        },
        "spine_1_1_8": {
            "net0": "ae:dd:4b:18:e2:0a",
            "net1": "1e:50:38:90:fe:6b",
            "net10": "f2:81:ec:95:9a:03",
            "net11": "3a:89:4a:0d:2d:6e",
            "net12": "76:c5:25:cc:da:08",
            "net13": "ea:ad:91:7d:97:5c",
            "net14": "fe:28:cb:47:99:c4",
            "net15": "92:13:8c:73:07:a0",
            "net16": "de:0b:9f:f2:1d:2d",
            "net17": "b6:2f:63:ff:3d:5c",
            "net18": "ee:c1:d3:13:9a:c6",
            "net19": "12:6d:00:cf:0a:d4",
            "net2": "ae:8f:98:ca:25:c5",
            "net20": "4a:61:32:87:90:0e",
            "net21": "d2:d9:26:c7:b5:a8",
            "net22": "a6:67:f3:35:fc:db",
            "net23": "aa:2d:1e:5b:a6:31",
            "net24": "0a:77:1e:bc:15:f9",
            "net25": "3e:5b:7e:5a:20:84",
            "net26": "ea:4b:32:83:e7:f6",
            "net27": "42:4b:e3:45:2e:f8",
            "net3": "ae:ed:6f:3b:28:d7",
            "net4": "1e:25:a3:0c:fd:30",
            "net5": "9a:28:6f:11:27:9b",
            "net6": "4a:8a:ee:06:72:5a",
            "net7": "86:a0:7a:7f:ed:45",
            "net8": "7a:66:0b:7b:19:4c",
            "net9": "0e:e0:92:5f:3f:71"
        },
        "spine_1_1_9": {
            "net0": "aa:9b:6f:60:89:c3",
            "net1": "b6:4a:01:db:70:ae",
            "net10": "de:dc:27:f1:09:a6",
            "net11": "fe:e1:6c:b7:04:c3",
            "net12": "5e:f2:79:5a:1b:83",
            "net13": "9a:a2:16:f4:5c:e8",
            "net14": "4a:c9:4d:25:0f:69",
            "net15": "ae:b6:f9:69:0c:4e",
            "net16": "8e:40:62:42:c5:8f",
            "net17": "8a:36:5f:49:7a:03",
            "net18": "8a:7e:3a:ee:11:91",
            "net19": "46:13:0b:c9:a1:e4",
            "net2": "52:bd:77:67:d6:65",
            "net20": "46:f5:3e:2c:8e:fb",
            "net21": "3a:1b:9a:62:77:bc",
            "net22": "42:f5:ad:85:88:ad",
            "net23": "a2:7b:f3:34:a8:2b",
            "net24": "52:07:8b:62:10:eb",
            "net25": "0a:9e:7c:cb:f1:de",
            "net26": "ba:bd:7e:a7:90:78",
            "net27": "82:f8:c6:b5:76:0d",
            "net3": "56:85:fb:2b:57:5c",
            "net4": "f6:f0:66:ca:25:3c",
            "net5": "ea:2d:d8:1c:29:c8",
            "net6": "ea:06:f6:24:5f:b6",
            "net7": "2e:1e:95:c1:6e:d4",
            "net8": "7e:60:a2:eb:59:2c",
            "net9": "06:4f:07:65:6d:c8"
        },
        "spine_2_1_1": {
            "net0": "22:e3:be:c9:23:87",
            "net1": "de:2c:ce:60:60:ec",
            "net10": "92:02:dc:28:b9:5e",
            "net11": "fe:6c:18:de:6a:cd",
            "net12": "e6:05:aa:66:a8:d2",
            "net13": "2e:00:ad:32:85:5b",
            "net14": "d2:fd:f3:8c:e4:0f",
            "net15": "4a:ad:6e:e8:89:19",
            "net16": "da:aa:d3:b1:cf:be",
            "net17": "16:8e:17:dc:13:43",
            "net18": "e2:6b:fb:46:93:cf",
            "net19": "46:8b:88:1f:6e:dd",
            "net2": "92:8e:3b:7f:fa:2a",
            "net20": "06:0f:8d:02:bb:c1",
            "net21": "06:e6:cc:da:6b:af",
            "net22": "6a:86:0c:9c:c5:5c",
            "net23": "5e:8e:5d:f0:ef:27",
            "net24": "16:8a:26:69:e8:dc",
            "net25": "5a:9c:77:c1:6d:83",
            "net26": "a6:3f:d2:ab:e8:e1",
            "net27": "2e:b5:c3:99:30:11",
            "net3": "66:48:95:1a:d0:58",
            "net4": "c6:1d:19:fc:a5:fa",
            "net5": "06:ee:88:21:4a:37",
            "net6": "02:cc:8a:b6:47:ef",
            "net7": "02:d3:8e:e5:44:06",
            "net8": "be:d3:c4:69:e9:63",
            "net9": "7a:a8:3d:20:e9:f7"
        },
        "spine_2_1_10": {
            "net0": "aa:59:a4:11:fb:57",
            "net1": "6e:66:ef:ac:9a:ca",
            "net10": "f6:87:ef:56:cd:68",
            "net11": "92:9c:43:aa:58:1e",
            "net12": "ba:1a:13:ad:d4:3b",
            "net13": "b2:3e:c9:7d:cb:00",
            "net14": "fe:e0:d4:34:df:87",
            "net15": "e2:6f:79:02:31:1e",
            "net16": "ae:ea:d3:9c:bd:ad",
            "net17": "fe:5f:72:b2:a1:bc",
            "net18": "12:4e:b0:b0:1a:b7",
            "net19": "56:57:cd:f6:ce:30",
            "net2": "5a:44:78:34:72:92",
            "net20": "aa:d5:c7:ae:2f:e5",
            "net21": "ee:03:4b:43:fd:ae",
            "net22": "76:3a:44:78:3d:58",
            "net23": "56:ce:33:e0:02:d4",
            "net24": "fe:4c:0f:fc:14:3c",
            "net25": "66:21:01:cc:96:e3",
            "net26": "de:9f:de:fa:b0:d8",
            "net27": "8a:46:70:81:0f:ed",
            "net3": "6e:ff:7e:d4:7b:a0",
            "net4": "b2:12:45:aa:6e:50",
            "net5": "be:66:ac:a9:35:d7",
            "net6": "32:b7:6e:0d:c1:89",
            "net7": "de:e6:a3:d5:4e:77",
            "net8": "2a:9e:a7:74:0c:fe",
            "net9": "ce:26:4a:4b:7f:90"
        },
        "spine_2_1_11": {
            "net0": "92:65:0e:27:05:5b",
            "net1": "ee:2f:51:10:4a:c5",
            "net10": "ea:bd:59:86:19:36",
            "net11": "da:ca:c6:16:31:02",
            "net12": "1a:b5:d3:7b:cd:ba",
            "net13": "ba:4a:60:5b:42:c6",
            "net14": "de:6a:3d:22:22:e5",
            "net15": "26:c4:da:3d:70:9d",
            "net16": "6a:2c:e0:45:b2:20",
            "net17": "5e:95:5e:4b:c9:8f",
            "net18": "aa:e8:69:a2:1b:be",
            "net19": "ae:a7:17:e9:5c:79",
            "net2": "ba:83:df:58:17:cf",
            "net20": "e2:ee:e7:72:62:eb",
            "net21": "76:e9:08:3e:7a:90",
            "net22": "c6:dd:7e:20:10:0b",
            "net23": "d6:69:3b:a3:55:ad",
            "net24": "d6:65:14:fa:a4:a5",
            "net25": "f6:bc:72:00:67:a8",
            "net26": "f6:5f:7f:d6:9e:67",
            "net27": "de:9f:7b:3b:89:e2",
            "net3": "ce:b9:5d:04:cc:c8",
            "net4": "a2:f0:a2:c8:9a:d3",
            "net5": "4a:46:c5:5f:b9:f3",
            "net6": "8a:15:a9:b1:ee:47",
            "net7": "b2:55:42:79:71:43",
            "net8": "a2:3f:e9:95:f6:28",
            "net9": "1a:92:5e:de:23:2c"
        },
        "spine_2_1_12": {
            "net0": "6e:41:e5:a3:51:4f",
            "net1": "1a:68:64:8b:35:ac",
            "net10": "de:c5:e2:3f:a3:a1",
            "net11": "8e:99:95:24:f5:1f",
            "net12": "26:cb:75:41:e4:21",
            "net13": "6e:c8:d2:47:f3:80",
            "net14": "6a:f7:95:b1:18:9b",
            "net15": "b2:50:a3:e8:69:bd",
            "net16": "92:49:1c:e0:35:49",
            "net17": "5a:30:05:d8:bd:51",
            "net18": "6e:0f:43:a9:5e:18",
            "net19": "0a:0d:29:9c:3e:d6",
            "net2": "16:da:4b:ec:fb:aa",
            "net20": "96:23:22:60:5a:9a",
            "net21": "2a:ee:ac:24:9e:0a",
            "net22": "a6:4f:28:b9:d3:bb",
            "net23": "3a:62:b0:cc:7c:76",
            "net24": "92:61:06:a4:3c:0e",
            "net25": "da:94:85:87:2e:79",
            "net26": "26:02:7f:4a:17:0d",
            "net27": "f2:59:5e:dc:68:a2",
            "net3": "5a:cf:71:d5:0a:43",
            "net4": "5a:fa:2b:05:84:1e",
            "net5": "5e:a1:05:cb:60:b2",
            "net6": "ca:c9:ab:fb:5b:b3",
            "net7": "a6:64:c0:ef:35:57",
            "net8": "5e:fa:db:e5:14:38",
            "net9": "0a:7c:63:fe:a3:e3"
        },
        "spine_2_1_13": {
            "net0": "06:78:5c:5a:f3:b4",
            "net1": "da:23:63:65:4a:1d",
            "net10": "22:a5:0b:a0:12:4a",
            "net11": "66:54:8f:27:f7:e0",
            "net12": "6e:56:d7:33:f5:87",
            "net13": "2e:da:34:23:76:78",
            "net14": "06:a9:66:7f:23:69",
            "net15": "ee:c8:25:2b:5d:b4",
            "net16": "9a:97:b2:6c:70:18",
            "net17": "ca:23:0c:82:75:76",
            "net18": "aa:1f:de:ed:a6:1d",
            "net19": "fe:cc:f4:40:94:2e",
            "net2": "7a:43:45:40:e9:f6",
            "net20": "fa:5e:29:e9:93:16",
            "net21": "b6:fe:31:d3:e8:84",
            "net22": "7a:55:a3:f6:cc:4a",
            "net23": "9a:60:70:9b:fe:36",
            "net24": "d6:b1:3f:83:ef:32",
            "net25": "56:73:de:f1:fd:7c",
            "net26": "4a:86:21:fc:fc:b1",
            "net27": "4a:dd:ce:8a:b4:7d",
            "net3": "46:45:06:ed:9a:c1",
            "net4": "76:45:47:2d:d1:c9",
            "net5": "6e:cc:a6:f3:42:ee",
            "net6": "b6:a5:4d:a5:3b:e8",
            "net7": "7e:81:b4:77:43:9b",
            "net8": "de:67:d0:03:8f:0e",
            "net9": "96:75:cb:51:3f:32"
        },
        "spine_2_1_14": {
            "net0": "72:27:53:c0:13:c7",
            "net1": "0a:bb:2d:0f:1d:3c",
            "net10": "e2:df:ae:f9:8c:43",
            "net11": "02:92:a7:ae:42:e2",
            "net12": "66:ae:8f:74:61:c9",
            "net13": "a6:15:78:9e:57:7e",
            "net14": "9a:2d:60:62:4e:bc",
            "net15": "5a:92:fe:86:65:21",
            "net16": "b2:ba:dd:69:db:de",
            "net17": "72:c9:f7:3d:9e:f2",
            "net18": "e2:7d:30:d0:28:d3",
            "net19": "ea:f8:c2:29:5b:3e",
            "net2": "ae:c5:40:1e:71:bd",
            "net20": "2a:75:d3:d2:43:f2",
            "net21": "e6:8f:6d:a0:4a:a2",
            "net22": "6a:3d:e6:5c:fd:d9",
            "net23": "4e:02:75:91:95:95",
            "net24": "b6:12:7b:12:b5:af",
            "net25": "02:33:bb:f7:b7:37",
            "net26": "e2:08:62:cd:f8:73",
            "net27": "9e:d7:45:41:14:20",
            "net3": "d2:c5:14:bd:0c:45",
            "net4": "0e:9c:ca:84:3e:18",
            "net5": "36:6c:24:e3:c9:15",
            "net6": "76:47:98:13:98:62",
            "net7": "0e:8b:8f:a6:f4:17",
            "net8": "4e:86:13:e2:89:96",
            "net9": "26:85:f5:eb:a7:f3"
        },
        "spine_2_1_2": {
            "net0": "0a:98:e0:c7:bc:32",
            "net1": "16:ba:88:5d:fa:bf",
            "net10": "ae:17:e2:45:d0:1b",
            "net11": "1e:42:91:8a:d7:f1",
            "net12": "16:44:96:d2:38:cd",
            "net13": "be:72:57:a6:8c:e4",
            "net14": "82:cd:5f:c6:42:92",
            "net15": "16:2f:0e:eb:1e:17",
            "net16": "62:74:51:59:1b:9a",
            "net17": "1e:b3:a7:25:8f:b4",
            "net18": "76:d0:c2:8e:38:8b",
            "net19": "62:84:a9:ed:18:25",
            "net2": "fa:bf:2a:20:70:4a",
            "net20": "32:df:67:f5:58:9f",
            "net21": "72:ab:05:12:0a:fe",
            "net22": "ca:9d:b9:8b:a4:21",
            "net23": "c6:fc:d3:5a:c2:0f",
            "net24": "0e:d9:49:04:4e:69",
            "net25": "c2:be:da:c1:df:b1",
            "net26": "5a:17:e6:51:40:9d",
            "net27": "06:64:02:d3:55:04",
            "net3": "c2:98:3e:b2:7e:4c",
            "net4": "8e:c6:80:f6:01:b0",
            "net5": "22:9c:73:d0:79:52",
            "net6": "f6:51:3b:60:39:95",
            "net7": "9e:ce:43:b6:57:85",
            "net8": "66:da:ec:25:8d:b8",
            "net9": "0a:60:48:73:2a:bc"
        },
        "spine_2_1_3": {
            "net0": "e2:ea:bd:fb:db:cb",
            "net1": "b2:63:7b:ab:8b:45",
            "net10": "ae:22:0e:f8:a3:b7",
            "net11": "fa:6a:7e:5f:3e:a3",
            "net12": "ce:7c:5d:a5:23:89",
            "net13": "ee:1d:34:6c:87:9f",
            "net14": "16:cd:7e:ef:15:b4",
            "net15": "62:c6:59:cc:43:81",
            "net16": "3e:91:c6:0e:2c:f3",
            "net17": "2e:68:3c:bc:81:3b",
            "net18": "da:44:0f:32:b0:29",
            "net19": "6a:23:f1:c6:c6:e9",
            "net2": "ea:1d:c1:19:68:10",
            "net20": "7e:38:f9:9a:80:8d",
            "net21": "ba:ec:a9:d8:aa:93",
            "net22": "fe:87:4e:1f:ca:75",
            "net23": "36:92:5b:5e:77:f9",
            "net24": "16:b6:7e:ca:63:31",
            "net25": "96:ce:80:09:d7:c8",
            "net26": "06:44:69:d6:5f:ee",
            "net27": "92:dd:fc:ea:bc:5a",
            "net3": "06:21:94:0f:c3:33",
            "net4": "d6:b9:1a:d8:db:33",
            "net5": "da:51:ec:f8:5d:af",
            "net6": "0e:c1:c6:0a:58:bf",
            "net7": "ba:5c:27:02:f2:44",
            "net8": "02:c3:3a:4d:01:a4",
            "net9": "86:00:1d:8a:25:d4"
        },
        "spine_2_1_4": {
            "net0": "5e:6f:f1:b0:c1:59",
            "net1": "72:4c:26:ce:2d:1d",
            "net10": "8e:44:7f:e1:c5:da",
            "net11": "fa:2c:52:6e:a1:f6",
            "net12": "a6:ab:24:27:8d:61",
            "net13": "f6:ee:02:c8:ec:c4",
            "net14": "5a:cc:56:e6:68:d9",
            "net15": "9e:2b:b7:eb:3a:be",
            "net16": "a6:c4:85:fb:52:f3",
            "net17": "46:24:f6:5d:69:29",
            "net18": "fa:45:dc:41:0e:72",
            "net19": "ae:8c:cc:a7:7b:dd",
            "net2": "0e:4f:e6:bd:c4:7a",
            "net20": "ae:7f:12:14:c5:55",
            "net21": "b6:81:e3:86:14:d6",
            "net22": "ea:d0:6e:78:53:ad",
            "net23": "5a:09:53:40:4e:be",
            "net24": "a6:34:e0:76:91:34",
            "net25": "56:7e:fd:39:3b:7c",
            "net26": "12:85:ac:71:0a:08",
            "net27": "e2:1e:cc:66:44:35",
            "net3": "56:05:b9:fb:7d:2f",
            "net4": "72:ad:a0:3f:11:05",
            "net5": "d6:41:96:4c:05:5d",
            "net6": "02:61:05:67:76:97",
            "net7": "12:d7:75:b5:02:e7",
            "net8": "ce:2c:eb:a8:c5:75",
            "net9": "72:2c:36:a1:f5:f6"
        },
        "spine_2_1_5": {
            "net0": "a2:07:e7:12:c7:ff",
            "net1": "3e:47:46:fa:86:c8",
            "net10": "3a:1a:68:64:38:c3",
            "net11": "32:29:88:07:43:35",
            "net12": "fe:dc:3b:ab:bd:36",
            "net13": "0e:66:b1:bc:5c:46",
            "net14": "72:00:80:cf:92:fa",
            "net15": "2e:fd:03:9e:40:cb",
            "net16": "42:78:58:ed:e8:9c",
            "net17": "3a:da:7d:0d:a3:f4",
            "net18": "e2:d1:f2:bf:90:fb",
            "net19": "a6:11:52:1e:50:29",
            "net2": "ca:af:5a:ef:ce:9c",
            "net20": "be:d5:bc:ce:ed:cd",
            "net21": "a2:f7:7f:b6:07:af",
            "net22": "4a:4e:99:64:a6:98",
            "net23": "56:fb:26:b5:e3:83",
            "net24": "5a:66:8a:99:46:a0",
            "net25": "66:63:54:2b:67:f6",
            "net26": "a6:8f:06:11:b3:c6",
            "net27": "ae:b8:53:62:d7:67",
            "net3": "de:a4:85:fa:9a:8f",
            "net4": "ea:08:71:b7:05:11",
            "net5": "76:50:9f:4a:15:2b",
            "net6": "56:7c:2f:dc:d5:a5",
            "net7": "66:a6:8f:b0:b6:b5",
            "net8": "96:93:63:d4:f8:3d",
            "net9": "22:2d:fa:11:38:0f"
        },
        "spine_2_1_6": {
            "net0": "9a:cc:f9:77:b7:71",
            "net1": "92:0f:59:ee:7a:62",
            "net10": "ae:e1:91:f8:45:e5",
            "net11": "2a:94:fc:d0:05:3c",
            "net12": "2e:75:38:2c:15:25",
            "net13": "16:88:b2:82:49:7e",
            "net14": "96:a4:6f:82:35:06",
            "net15": "ae:c4:1f:c7:50:99",
            "net16": "de:1c:6e:27:16:74",
            "net17": "76:d6:7f:ea:01:d6",
            "net18": "56:51:b6:ac:a5:11",
            "net19": "a6:d7:96:9f:4f:e1",
            "net2": "aa:22:e4:7a:0a:6e",
            "net20": "06:e9:49:d6:49:76",
            "net21": "22:46:df:c6:39:05",
            "net22": "aa:64:43:4d:db:54",
            "net23": "86:a5:79:e0:af:c0",
            "net24": "52:f4:bd:46:b3:9f",
            "net25": "9a:19:ac:c5:f2:09",
            "net26": "1a:b9:3a:95:ca:91",
            "net27": "e2:cd:8d:bc:23:32",
            "net3": "62:df:9a:23:f9:73",
            "net4": "66:7c:01:99:d4:c4",
            "net5": "36:81:1e:e2:88:c3",
            "net6": "12:3a:df:34:ee:dd",
            "net7": "ba:2f:25:04:30:81",
            "net8": "f6:ab:ec:f9:f7:45",
            "net9": "8a:62:58:0f:71:3b"
        },
        "spine_2_1_7": {
            "net0": "42:28:fb:2a:b6:19",
            "net1": "da:f8:cd:6d:0c:b4",
            "net10": "26:95:00:24:b9:51",
            "net11": "de:e9:ab:b2:5a:19",
            "net12": "32:7e:f5:06:dd:54",
            "net13": "e6:e7:07:4d:2e:cb",
            "net14": "be:e7:54:21:6e:4f",
            "net15": "7a:58:93:4d:36:4c",
            "net16": "0a:c9:da:33:a6:9c",
            "net17": "b2:4e:b1:85:50:d1",
            "net18": "c2:e1:f9:65:66:83",
            "net19": "46:92:b8:e2:62:9c",
            "net2": "0a:84:c1:a3:51:ac",
            "net20": "4a:bf:df:c6:85:9c",
            "net21": "e2:db:8b:30:fb:59",
            "net22": "f6:e2:cc:7e:f4:db",
            "net23": "8e:34:0b:c2:f2:e9",
            "net24": "fa:5c:fb:a3:3e:8d",
            "net25": "1e:a0:aa:16:3c:6e",
            "net26": "e6:2f:56:70:2a:4f",
            "net27": "3a:1d:19:cf:b9:2c",
            "net3": "f2:cb:31:df:07:ac",
            "net4": "2e:3b:c0:e0:67:72",
            "net5": "62:cf:57:60:0c:39",
            "net6": "26:d7:b7:02:70:3b",
            "net7": "be:08:6f:50:32:21",
            "net8": "66:13:2c:50:49:8b",
            "net9": "02:06:4e:42:76:36"
        },
        "spine_2_1_8": {
            "net0": "ae:b3:8e:7a:34:92",
            "net1": "b2:77:d2:8a:3a:29",
            "net10": "ce:39:fd:8d:d8:30",
            "net11": "9e:05:29:02:c9:d5",
            "net12": "9e:a3:6a:dd:cc:57",
            "net13": "f6:01:36:69:6b:00",
            "net14": "4e:a7:fc:70:08:13",
            "net15": "06:1f:fb:59:fb:7b",
            "net16": "f6:e1:a3:43:4b:78",
            "net17": "3a:9a:f6:3d:3b:5b",
            "net18": "22:a7:bd:66:10:f7",
            "net19": "6a:35:17:ef:cf:b3",
            "net2": "12:b6:f4:b6:70:7f",
            "net20": "c6:e7:60:3a:f5:09",
            "net21": "1e:ab:6a:58:37:9f",
            "net22": "ba:54:c7:7d:a7:90",
            "net23": "0a:85:62:ab:ab:14",
            "net24": "0a:f6:46:dc:53:80",
            "net25": "06:91:4a:7b:23:ae",
            "net26": "96:da:90:40:8c:81",
            "net27": "ba:ff:ac:f0:b7:de",
            "net3": "ca:5b:f9:ef:99:bb",
            "net4": "ea:97:c6:c5:81:26",
            "net5": "a6:9c:48:41:9c:18",
            "net6": "02:55:8d:a0:b4:14",
            "net7": "72:75:fd:22:cd:4f",
            "net8": "8a:c1:53:02:64:70",
            "net9": "26:79:b2:96:b8:f2"
        },
        "spine_2_1_9": {
            "net0": "4a:03:61:04:f0:b6",
            "net1": "d2:8e:70:af:ca:c7",
            "net10": "3e:1b:6f:df:58:c2",
            "net11": "52:27:da:0b:ad:30",
            "net12": "8e:1a:b7:a7:bc:ba",
            "net13": "3a:c1:6c:07:07:5a",
            "net14": "3e:0e:a1:30:ac:6f",
            "net15": "02:e9:91:70:40:e8",
            "net16": "42:b4:e7:09:1c:78",
            "net17": "82:ef:ab:ce:0b:b8",
            "net18": "5a:f8:01:e2:e3:0c",
            "net19": "22:c6:f2:07:9f:f0",
            "net2": "de:9e:a3:ee:2f:79",
            "net20": "e6:00:2b:68:a1:a8",
            "net21": "da:39:3d:e9:85:30",
            "net22": "fa:9b:97:81:14:12",
            "net23": "c6:98:e1:a4:88:dd",
            "net24": "6a:c2:01:e8:17:ef",
            "net25": "6a:16:ac:07:3f:e7",
            "net26": "5e:f3:b6:8f:7e:bf",
            "net27": "e2:39:71:1e:92:96",
            "net3": "06:01:1c:d9:7e:62",
            "net4": "06:88:9d:cd:dc:0b",
            "net5": "8a:77:58:f1:96:8b",
            "net6": "c6:06:09:4f:b5:eb",
            "net7": "1a:84:ac:d0:76:af",
            "net8": "c6:9f:9e:6a:1c:cd",
            "net9": "36:33:34:2f:1b:1b"
        },
        "tof_1_2_1": {
            "net0": "16:67:1a:a1:84:a8",
            "net1": "a2:fa:77:6d:c7:08",
            "net10": "72:29:57:b3:63:dd",
            "net11": "ee:b4:32:1a:4a:2c",
            "net12": "62:66:54:6b:9a:84",
            "net13": "46:6f:61:c2:89:53",
            "net14": "72:92:87:7e:84:46",
            "net15": "a2:88:42:84:34:45",
            "net16": "be:7d:49:e8:7c:c2",
            "net17": "8e:2a:c3:34:95:e3",
            "net18": "5e:7e:66:34:83:eb",
            "net19": "1a:3f:a1:ba:ff:5c",
            "net2": "0e:45:8d:53:1f:12",
            "net20": "9a:ba:44:ca:9e:31",
            "net21": "f6:4b:50:48:d4:7e",
            "net22": "42:4a:07:d0:b6:56",
            "net23": "46:8a:b4:fe:f8:02",
            "net24": "c6:05:72:79:2b:3a",
            "net25": "6a:f0:d8:0e:31:b6",
            "net26": "a6:c5:80:59:1b:b3",
            "net27": "5a:c5:6a:58:9b:f3",
            "net3": "0e:1a:f2:dd:86:82",
            "net4": "5a:af:e1:8a:94:9f",
            "net5": "5a:03:8d:5a:58:88",
            "net6": "92:a0:2a:84:5c:65",
            "net7": "ba:32:41:c6:25:19",
            "net8": "06:c3:ca:90:6c:35",
            "net9": "0a:90:ac:11:70:85"
        },
        "tof_1_2_10": {
            "net0": "c2:4b:09:7e:d2:d4",
            "net1": "7a:d3:59:0e:9b:59",
            "net10": "2a:76:28:e4:87:fe",
            "net11": "92:51:67:80:ee:69",
            "net12": "86:ba:ad:4c:d0:42",
            "net13": "de:fc:11:58:9a:41",
            "net14": "16:76:98:b7:bf:ad",
            "net15": "1a:52:6d:48:40:43",
            "net16": "7a:71:17:38:cc:c8",
            "net17": "56:0d:14:cc:ab:5a",
            "net18": "12:05:c0:1c:1f:54",
            "net19": "32:fb:c5:b3:fe:f5",
            "net2": "96:79:09:3d:75:39",
            "net20": "ae:9f:04:ed:17:3c",
            "net21": "8e:fc:b4:9f:8c:cd",
            "net22": "1e:26:04:39:c4:d9",
            "net23": "46:88:76:3e:5a:d4",
            "net24": "72:7c:36:3b:cd:06",
            "net25": "e6:3a:ee:7d:9c:d8",
            "net26": "2a:b8:6e:eb:32:31",
            "net27": "16:4a:b4:eb:24:69",
            "net3": "5a:c0:31:6a:86:73",
            "net4": "be:c1:83:75:c3:00",
            "net5": "ae:3f:cc:67:01:77",
            "net6": "b6:e6:20:a1:98:ce",
            "net7": "a2:b8:48:96:56:00",
            "net8": "6e:41:30:f7:3e:62",
            "net9": "ba:37:45:99:05:85"
        },
        "tof_1_2_11": {
            "net0": "fe:d0:82:60:6f:81",
            "net1": "6e:87:0f:b9:c9:0b",
            "net10": "aa:00:d0:42:7c:5b",
            "net11": "1e:b1:d5:09:18:05",
            "net12": "b6:dd:4b:31:9d:5c",
            "net13": "06:93:91:5a:cc:f6",
            "net14": "2a:a8:16:69:07:f5",
            "net15": "aa:29:c3:3d:66:f1",
            "net16": "66:47:6b:56:12:79",
            "net17": "76:fd:9d:86:b0:47",
            "net18": "ea:e9:1b:e5:ad:86",
            "net19": "6a:d5:5d:11:3b:c7",
            "net2": "86:43:01:de:e0:f2",
            "net20": "92:c7:c4:87:18:8a",
            "net21": "06:ec:ff:18:56:16",
            "net22": "e6:14:00:8d:e1:ff",
            "net23": "2e:d2:ed:52:78:8e",
            "net24": "12:4b:a8:e3:e4:84",
            "net25": "16:66:e1:ec:a3:86",
            "net26": "e6:c2:8f:7c:c4:d6",
            "net27": "6e:96:35:69:24:ec",
            "net3": "86:90:fa:39:78:9d",
            "net4": "52:35:60:3b:d9:4f",
            "net5": "d2:33:ff:1d:d8:1b",
            "net6": "f2:64:3e:4a:5b:1d",
            "net7": "fe:89:1b:06:b2:69",
            "net8": "0a:fb:f8:3c:77:6a",
            "net9": "2a:7d:bb:85:33:cd"
        },
        "tof_1_2_12": {
            "net0": "16:62:40:f7:9d:55",
            "net1": "6a:a2:cf:97:4e:5d",
            "net10": "1a:b6:e1:dd:89:83",
            "net11": "f6:8a:6c:82:81:75",
            "net12": "76:13:83:31:ef:b8",
            "net13": "6e:7a:a6:5e:7e:7c",
            "net14": "d6:04:e2:80:f8:7f",
            "net15": "32:3b:75:d0:a4:95",
            "net16": "6a:25:fd:9f:bd:3c",
            "net17": "2a:b5:dd:19:86:ee",
            "net18": "26:8b:1c:ad:d1:fc",
            "net19": "86:cf:f7:a2:16:ea",
            "net2": "4a:a6:8a:0b:d7:1a",
            "net20": "c6:a3:25:cd:ce:10",
            "net21": "02:a6:2c:5f:ad:9a",
            "net22": "5a:0a:4c:00:5c:e7",
            "net23": "6e:10:7a:d1:90:3b",
            "net24": "52:7f:1e:c8:ad:58",
            "net25": "e2:f3:7a:69:e4:ce",
            "net26": "7a:94:37:f1:f3:33",
            "net27": "9e:a9:d3:d5:17:d4",
            "net3": "b2:b6:1d:95:64:ea",
            "net4": "36:0e:1d:8b:b1:6c",
            "net5": "42:53:36:a8:57:9b",
            "net6": "66:9f:a8:6e:f2:79",
            "net7": "3e:c3:63:69:db:8e",
            "net8": "86:e1:93:70:03:86",
            "net9": "6a:75:6b:f1:3e:5b"
        },
        "tof_1_2_13": {
            "net0": "66:db:f4:80:e5:94",
            "net1": "ea:d4:77:01:f3:34",
            "net10": "5e:c1:3e:29:cf:89",
            "net11": "4e:cc:78:f9:a8:eb",
            "net12": "de:20:5d:e8:e5:0c",
            "net13": "86:68:45:e0:d2:3e",
            "net14": "aa:30:87:28:43:3a",
            "net15": "9e:79:dc:22:21:bb",
            "net16": "36:1b:45:2c:c4:0d",
            "net17": "c6:0c:f0:f9:4f:f4",
            "net18": "fe:88:6a:52:bf:56",
            "net19": "da:6c:88:27:c6:e0",
            "net2": "42:a6:f3:77:be:15",
            "net20": "26:d9:f9:4e:22:03",
            "net21": "e2:c5:6c:16:17:01",
            "net22": "de:b7:99:26:e0:bc",
            "net23": "5e:8b:13:02:62:a4",
            "net24": "2a:6d:40:05:0c:cf",
            "net25": "42:e5:2b:9b:8e:73",
            "net26": "9a:1b:ef:3f:5a:02",
            "net27": "3e:01:b6:ca:82:29",
            "net3": "9a:dd:c2:ac:cd:8f",
            "net4": "72:c2:05:2b:f0:4c",
            "net5": "ea:9c:d9:ab:51:2a",
            "net6": "c6:7f:4a:37:01:9a",
            "net7": "a6:df:ed:17:c2:38",
            "net8": "12:50:0e:8c:6c:c8",
            "net9": "2e:b5:1b:db:1b:49"
        },
        "tof_1_2_14": {
            "net0": "4a:a0:15:d6:c4:09",
            "net1": "be:ce:ea:a6:ca:58",
            "net10": "ae:7d:bb:2e:0d:99",
            "net11": "d2:be:ce:36:0b:50",
            "net12": "a6:fb:14:7e:2e:39",
            "net13": "02:82:de:18:56:d0",
            "net14": "5e:72:06:c7:d7:6d",
            "net15": "06:31:00:c0:ea:6e",
            "net16": "e6:ac:83:0e:1c:4b",
            "net17": "02:92:1e:ce:46:05",
            "net18": "1e:13:90:ec:de:fb",
            "net19": "1a:0f:47:71:cd:7c",
            "net2": "ba:b3:2f:01:7f:98",
            "net20": "46:63:e8:d0:b6:f2",
            "net21": "aa:d2:7d:63:2f:c3",
            "net22": "42:2b:48:f0:25:76",
            "net23": "12:bc:3a:3f:78:5e",
            "net24": "1a:ed:ff:92:df:fd",
            "net25": "72:4f:b1:b8:db:2e",
            "net26": "26:4a:2e:b5:36:e9",
            "net27": "8a:0b:a5:43:96:1b",
            "net3": "5e:1b:44:c9:a0:bc",
            "net4": "de:3b:0c:48:98:cf",
            "net5": "aa:b3:ac:55:60:d2",
            "net6": "26:a2:99:f6:54:1e",
            "net7": "16:ba:0a:c8:fd:28",
            "net8": "c6:86:5a:46:fd:1c",
            "net9": "ee:1f:86:3d:5c:d1"
        },
        "tof_1_2_2": {
            "net0": "da:51:9d:71:61:e8",
            "net1": "86:7e:c8:91:b8:42",
            "net10": "de:c5:30:ed:70:cd",
            "net11": "16:0c:a3:43:6b:fb",
            "net12": "ee:48:f2:6a:a5:fb",
            "net13": "e2:9f:23:42:cb:c8",
            "net14": "3e:b8:0f:42:db:1c",
            "net15": "86:7c:49:d0:58:ad",
            "net16": "0a:6a:21:da:31:b2",
            "net17": "52:a1:8a:4e:68:85",
            "net18": "f6:e6:e3:55:78:41",
            "net19": "86:51:07:5f:3f:76",
            "net2": "2a:a4:b1:57:bc:2d",
            "net20": "d6:4b:92:65:94:b7",
            "net21": "32:b6:09:a4:a6:aa",
            "net22": "c2:9f:82:be:53:25",
            "net23": "ea:58:a9:05:56:ab",
            "net24": "16:86:af:75:ba:1e",
            "net25": "1e:da:7d:da:c0:40",
            "net26": "f2:b7:17:26:e1:ba",
            "net27": "be:35:58:79:ea:78",
            "net3": "9e:97:e1:f0:ef:97",
            "net4": "72:80:33:19:25:07",
            "net5": "9e:57:d6:91:ce:e3",
            "net6": "0e:a3:90:dc:5b:d2",
            "net7": "b6:52:69:64:46:97",
            "net8": "ca:4e:d9:a0:2c:ed",
            "net9": "aa:3b:a5:0c:08:0c"
        },
        "tof_1_2_3": {
            "net0": "fa:20:4c:2d:b8:68",
            "net1": "d2:21:f4:f1:0c:c7",
            "net10": "76:b8:28:3f:59:c9",
            "net11": "d6:0f:fb:d9:9f:ec",
            "net12": "72:7e:0a:71:1b:09",
            "net13": "e6:ae:be:ac:03:a1",
            "net14": "9a:5d:10:8f:88:dc",
            "net15": "26:4c:c0:a4:5b:48",
            "net16": "d2:c9:a8:cf:6b:93",
            "net17": "fe:fe:f6:a1:d6:3c",
            "net18": "fe:c8:f2:40:f1:1b",
            "net19": "82:71:eb:91:51:9f",
            "net2": "6a:b4:94:3c:ef:32",
            "net20": "fe:26:32:c0:7b:22",
            "net21": "2e:8f:a3:45:2f:a8",
            "net22": "0a:26:1c:2a:90:7b",
            "net23": "6e:3f:92:74:e7:9d",
            "net24": "fa:b1:6c:57:d8:c6",
            "net25": "7e:80:b9:70:ac:fc",
            "net26": "6a:bd:42:3b:f0:71",
            "net27": "e6:52:3c:6a:4a:a8",
            "net3": "d6:d7:56:12:a6:29",
            "net4": "ca:ee:3c:57:31:71",
            "net5": "ce:fa:34:7a:99:9c",
            "net6": "1e:ce:85:f6:52:bc",
            "net7": "be:32:1a:da:36:c0",
            "net8": "32:a1:d6:01:85:4a",
            "net9": "4e:64:b3:8f:c8:52"
        },
        "tof_1_2_4": {
            "net0": "9a:a5:ae:bb:de:1f",
            "net1": "b2:f7:24:7c:14:db",
            "net10": "ae:85:80:71:88:ce",
            "net11": "aa:40:ff:ff:82:5f",
            "net12": "16:bd:56:55:7d:88",
            "net13": "76:1a:20:5c:6e:19",
            "net14": "3a:86:c3:ce:af:c9",
            "net15": "a2:9c:46:95:23:60",
            "net16": "26:6c:4f:f3:9d:46",
            "net17": "9a:f9:e2:b4:35:e0",
            "net18": "a2:41:3c:ad:64:29",
            "net19": "16:32:54:1e:04:ef",
            "net2": "aa:48:f8:87:37:ef",
            "net20": "2e:3a:8a:d5:b3:1a",
            "net21": "9a:85:7e:49:0c:5a",
            "net22": "ea:54:c4:41:65:5d",
            "net23": "ea:b2:e2:4e:a6:67",
            "net24": "d2:c6:0b:7e:d6:50",
            "net25": "82:b3:7c:cd:9f:a9",
            "net26": "9a:7f:56:cc:01:9f",
            "net27": "ea:2a:dd:ee:2e:db",
            "net3": "b2:eb:8c:ad:58:7d",
            "net4": "46:f6:1d:c8:0b:9b",
            "net5": "ca:f8:a5:ae:58:f0",
            "net6": "66:80:98:1d:d0:74",
            "net7": "2a:83:e1:9c:64:5e",
            "net8": "a6:ee:97:21:7b:b0",
            "net9": "9a:5c:99:12:65:dd"
        },
        "tof_1_2_5": {
            "net0": "6e:40:13:a1:34:39",
            "net1": "b2:50:01:c8:b2:31",
            "net10": "d2:51:86:76:0a:f7",
            "net11": "be:e4:ef:8a:5f:d8",
            "net12": "12:88:25:c5:1c:98",
            "net13": "6a:95:22:bf:29:54",
            "net14": "4e:3e:68:40:d0:a8",
            "net15": "fe:fe:1c:3b:89:e8",
            "net16": "a2:42:fe:4a:e4:12",
            "net17": "6a:17:b0:cc:1f:ba",
            "net18": "7e:15:4e:cc:2d:34",
            "net19": "86:75:76:d1:88:4d",
            "net2": "f6:eb:05:a3:8f:e2",
            "net20": "8e:4c:a9:d8:88:8f",
            "net21": "62:60:a4:f4:39:df",
            "net22": "3a:c8:3d:4b:f5:85",
            "net23": "7e:01:fa:1d:38:2f",
            "net24": "8a:d6:87:f1:27:b9",
            "net25": "9a:93:b3:90:48:89",
            "net26": "ce:f1:f4:6e:22:c0",
            "net27": "2a:c3:2e:d9:9d:59",
            "net3": "ea:b7:dc:ab:de:bb",
            "net4": "46:5b:06:71:18:6c",
            "net5": "42:76:3c:6c:20:1a",
            "net6": "5e:7b:a6:db:4b:fd",
            "net7": "86:b6:2c:2e:a5:fd",
            "net8": "4e:cb:7e:f6:99:07",
            "net9": "92:47:52:7c:18:69"
        },
        "tof_1_2_6": {
            "net0": "1e:81:84:56:14:dd",
            "net1": "8a:7a:d7:54:8b:00",
            "net10": "06:36:8f:85:26:ce",
            "net11": "86:8b:df:3a:fc:0f",
            "net12": "ae:21:39:16:67:ee",
            "net13": "06:5d:eb:65:d6:99",
            "net14": "a2:88:09:f7:26:43",
            "net15": "02:ea:5c:e4:79:e3",
            "net16": "fa:4d:c5:43:25:69",
            "net17": "da:03:16:ac:5a:01",
            "net18": "32:08:96:60:29:b6",
            "net19": "96:15:a7:7f:3c:ac",
            "net2": "b6:c9:e5:2b:b0:58",
            "net20": "a2:0e:7a:12:f4:62",
            "net21": "2a:10:8e:64:f2:7b",
            "net22": "22:11:3f:68:bc:d8",
            "net23": "da:66:27:54:50:74",
            "net24": "7a:4e:59:74:cd:b6",
            "net25": "42:4e:ab:2d:0a:00",
            "net26": "a6:65:e0:ae:93:99",
            "net27": "7e:08:1c:ec:39:04",
            "net3": "ae:86:a8:5c:11:e3",
            "net4": "82:96:2c:29:d2:26",
            "net5": "82:95:27:53:3a:c2",
            "net6": "02:d1:be:84:c5:31",
            "net7": "36:5b:a1:71:46:2b",
            "net8": "4e:2a:9f:ae:b7:32",
            "net9": "7a:31:e7:97:a4:fc"
        },
        "tof_1_2_7": {
            "net0": "0a:8b:bf:c7:3b:5f",
            "net1": "12:09:99:52:32:3c",
            "net10": "2e:ed:58:5f:d2:90",
            "net11": "62:e7:2a:11:22:1c",
            "net12": "ea:02:f6:d4:b5:19",
            "net13": "c2:7f:bf:c2:e6:58",
            "net14": "5e:30:d6:1d:96:61",
            "net15": "aa:cb:0b:92:32:19",
            "net16": "e2:c6:d7:ef:00:b3",
            "net17": "d6:79:83:19:a6:cd",
            "net18": "4e:bb:b0:64:52:cb",
            "net19": "f2:1c:9b:e0:6d:37",
            "net2": "f2:91:ba:be:ee:6d",
            "net20": "4e:be:9a:9f:1e:84",
            "net21": "f6:16:f9:fd:be:62",
            "net22": "8e:38:81:23:77:bf",
            "net23": "36:e9:1f:51:60:75",
            "net24": "aa:fb:41:f2:71:c6",
            "net25": "aa:25:4a:fc:e2:76",
            "net26": "62:70:64:12:e4:5f",
            "net27": "72:4b:86:8d:9b:3f",
            "net3": "de:fd:c1:f7:17:fb",
            "net4": "aa:c4:ff:25:cc:04",
            "net5": "3e:fa:9a:73:cd:c5",
            "net6": "0a:0e:dc:1b:e2:07",
            "net7": "6e:18:77:67:4a:4b",
            "net8": "6e:df:b1:30:b6:ae",
            "net9": "b6:01:f7:0e:be:5a"
        },
        "tof_1_2_8": {
            "net0": "a6:0b:60:38:e9:cf",
            "net1": "1a:b3:7c:87:49:32",
            "net10": "42:60:c4:04:cb:e6",
            "net11": "4a:52:a8:8c:f7:20",
            "net12": "6e:e5:83:80:bc:77",
            "net13": "ae:d3:0e:be:7f:86",
            "net14": "16:98:c6:75:b3:6c",
            "net15": "ee:39:72:0c:fe:64",
            "net16": "36:ad:13:04:e0:f5",
            "net17": "22:6e:8f:b7:6d:0d",
            "net18": "da:05:b0:8f:69:19",
            "net19": "ea:55:97:83:d3:55",
            "net2": "e2:f9:61:24:5d:bc",
            "net20": "1e:63:94:e4:ed:f2",
            "net21": "9e:9e:2c:c5:a3:90",
            "net22": "76:e5:52:1c:f8:85",
            "net23": "2a:79:b5:a7:d4:ee",
            "net24": "52:32:a4:ad:89:5f",
            "net25": "ea:34:03:bf:58:83",
            "net26": "36:3c:21:c8:de:f4",
            "net27": "9e:1d:b9:46:89:61",
            "net3": "f6:e3:54:6e:9d:26",
            "net4": "46:45:f0:65:13:e3",
            "net5": "96:10:e4:b5:ab:35",
            "net6": "9e:2d:90:07:9a:33",
            "net7": "0a:fd:06:93:f6:8a",
            "net8": "92:ef:50:94:e9:04",
            "net9": "96:61:bc:cc:07:12"
        },
        "tof_1_2_9": {
            "net0": "6e:bb:d8:18:e9:74",
            "net1": "ca:42:08:c4:f1:12",
            "net10": "a6:c4:7b:ee:45:e5",
            "net11": "12:cb:1a:be:75:b8",
            "net12": "82:3f:b5:4a:33:93",
            "net13": "b2:0a:4f:31:65:ad",
            "net14": "8e:75:5c:d0:e1:b2",
            "net15": "9e:78:a2:ae:05:32",
            "net16": "76:0d:de:c1:92:b5",
            "net17": "76:26:73:95:08:bb",
            "net18": "b6:34:14:4a:21:b6",
            "net19": "d6:d6:5f:f6:78:87",
            "net2": "fe:29:4e:ec:6f:6d",
            "net20": "aa:bb:41:18:f3:1b",
            "net21": "1a:45:9b:2e:0d:c7",
            "net22": "de:dd:e5:79:2c:19",
            "net23": "42:5b:70:1d:a3:76",
            "net24": "12:26:9a:57:d0:19",
            "net25": "fe:e1:db:94:2c:13",
            "net26": "d6:d6:c8:4f:2c:da",
            "net27": "02:e5:94:99:a3:4a",
            "net3": "7a:aa:51:80:28:17",
            "net4": "9a:79:d8:4c:6b:68",
            "net5": "c6:aa:ac:03:9c:f8",
            "net6": "d6:4b:80:44:ab:bf",
            "net7": "46:8d:39:c0:59:fb",
            "net8": "f6:82:d8:28:2b:28",
            "net9": "d2:48:f1:c7:55:f3"
        }
    },
    "failed_machine": "leaf_1_0_1",
    "failure_time": 1613184879.5486794
}