{
    "k_leaf": 10,
    "k_top": 10,
    "redundancy_factor": 5,
    "is_k8s": true,
    "machine_mac_addresses": {
        "leaf_1_0_1": {
            "net0": "aa:7a:1a:97:c6:d2",
            "net1": "06:05:55:bf:15:28",
            "net10": "3e:42:cb:00:8c:96",
            "net2": "ce:fe:07:9c:99:24",
            "net3": "26:2f:36:80:c3:18",
            "net4": "f6:4c:00:de:52:52",
            "net5": "ae:c9:c8:14:bb:7b",
            "net6": "0e:db:06:9c:23:b5",
            "net7": "a6:86:fe:a0:e3:5f",
            "net8": "3a:8d:5f:cc:91:ca",
            "net9": "86:59:56:30:30:88"
        },
        "leaf_1_0_10": {
            "net0": "ba:48:be:53:3d:ec",
            "net1": "26:a7:3f:d9:57:8f",
            "net10": "9a:75:a2:f1:3f:e2",
            "net2": "2e:db:f0:7e:53:a2",
            "net3": "7e:69:c6:a1:3f:5d",
            "net4": "b6:d9:bc:ba:03:94",
            "net5": "d2:df:bf:e0:f0:f4",
            "net6": "e2:9d:87:db:d2:f0",
            "net7": "f2:50:ac:bd:9e:36",
            "net8": "ba:05:86:b4:93:1f",
            "net9": "a6:5c:b7:cb:72:cc"
        },
        "leaf_1_0_2": {
            "net0": "02:47:92:85:77:ec",
            "net1": "8a:ba:49:77:eb:0e",
            "net10": "5e:14:a6:d6:5c:7c",
            "net2": "8a:61:4a:d1:f7:c0",
            "net3": "6a:c7:27:9f:65:f7",
            "net4": "2a:4f:ac:41:84:a4",
            "net5": "96:64:26:0a:82:5c",
            "net6": "3a:ec:30:86:ae:36",
            "net7": "2e:12:ae:05:bc:d8",
            "net8": "c2:67:ec:db:83:d2",
            "net9": "12:63:bc:fc:2a:40"
        },
        "leaf_1_0_3": {
            "net0": "a2:f3:2b:16:17:d7",
            "net1": "6a:ec:cf:ab:1b:97",
            "net10": "ae:28:08:7e:c5:0e",
            "net2": "fe:17:74:e2:91:54",
            "net3": "f6:7b:45:d8:b8:2a",
            "net4": "06:53:df:34:ec:d0",
            "net5": "1e:3d:3a:3f:ed:00",
            "net6": "92:30:2f:d5:69:40",
            "net7": "22:31:76:f5:92:78",
            "net8": "a2:4a:6f:7f:e3:99",
            "net9": "06:2a:2f:d8:d0:0b"
        },
        "leaf_1_0_4": {
            "net0": "de:62:13:d5:9f:58",
            "net1": "0e:9d:2e:48:02:bb",
            "net10": "8e:8d:1c:31:2f:8e",
            "net2": "fe:04:f0:1f:89:da",
            "net3": "26:62:be:b7:c1:53",
            "net4": "42:95:5d:75:c0:f0",
            "net5": "52:d4:48:d5:f9:45",
            "net6": "02:b2:57:83:5b:ad",
            "net7": "5a:8b:af:72:15:ba",
            "net8": "56:34:75:29:e2:7e",
            "net9": "a2:51:3f:67:fd:ee"
        },
        "leaf_1_0_5": {
            "net0": "0a:c4:8c:db:cc:2b",
            "net1": "4e:6e:64:53:1b:00",
            "net10": "de:c3:47:1e:d1:00",
            "net2": "12:ba:44:8e:2f:d4",
            "net3": "aa:7b:b5:ad:df:9e",
            "net4": "42:e6:b6:25:63:10",
            "net5": "0a:aa:69:1a:64:24",
            "net6": "56:d2:eb:64:c9:b4",
            "net7": "4e:42:38:57:52:e6",
            "net8": "9a:04:5d:d3:06:e4",
            "net9": "ca:de:ab:aa:f1:9d"
        },
        "leaf_1_0_6": {
            "net0": "72:53:12:41:65:3a",
            "net1": "4e:0e:12:16:fb:c1",
            "net10": "fa:e1:26:a3:cd:43",
            "net2": "e6:e1:d8:d6:19:8c",
            "net3": "06:8c:a6:0f:c8:6f",
            "net4": "02:b2:da:bd:86:96",
            "net5": "ea:44:0c:4d:50:48",
            "net6": "ce:73:d3:9a:d7:02",
            "net7": "f6:c1:93:1f:81:a4",
            "net8": "f2:26:ae:8c:91:1d",
            "net9": "d2:25:e0:8d:7a:79"
        },
        "leaf_1_0_7": {
            "net0": "76:01:41:74:57:1c",
            "net1": "6a:cb:1a:f7:44:f1",
            "net10": "3a:b1:66:19:31:16",
            "net2": "82:9a:4f:d3:5b:7a",
            "net3": "72:83:bf:e8:ad:44",
            "net4": "a2:53:4f:35:10:e0",
            "net5": "9a:b3:2f:c6:3c:fa",
            "net6": "2e:86:06:f3:0b:ae",
            "net7": "ae:db:4b:e8:0d:9f",
            "net8": "be:e6:a5:72:33:e6",
            "net9": "da:fa:90:25:d5:a6"
        },
        "leaf_1_0_8": {
            "net0": "ea:02:f9:0d:63:44",
            "net1": "3e:cd:4f:b6:76:4c",
            "net10": "0a:42:98:38:ef:72",
            "net2": "f2:8b:c6:a7:b8:59",
            "net3": "3a:e6:06:4a:2b:5e",
            "net4": "fa:ec:79:7f:32:3c",
            "net5": "4e:be:c4:8a:ad:31",
            "net6": "62:5b:d1:c2:c0:c2",
            "net7": "ea:09:e2:38:7d:45",
            "net8": "46:a1:10:84:99:8e",
            "net9": "ae:6f:67:08:15:cf"
        },
        "leaf_1_0_9": {
            "net0": "2e:02:5c:db:96:23",
            "net1": "5e:bc:4d:61:a5:cc",
            "net10": "36:17:db:1b:ec:55",
            "net2": "5a:6e:61:0b:e0:8d",
            "net3": "16:3e:ab:82:52:78",
            "net4": "f6:cc:6b:06:d1:f2",
            "net5": "5a:c3:03:f0:62:af",
            "net6": "b6:72:9e:1e:1d:98",
            "net7": "0a:91:4e:03:9b:46",
            "net8": "7e:bd:70:6f:61:5d",
            "net9": "ca:7c:de:38:1a:63"
        },
        "leaf_2_0_1": {
            "net0": "56:55:83:b4:ae:b7",
            "net1": "ce:16:9c:ae:3f:16",
            "net10": "0e:6c:4e:40:bf:38",
            "net2": "c2:4b:83:bd:f1:90",
            "net3": "c2:78:42:98:b5:60",
            "net4": "ba:aa:17:1a:25:70",
            "net5": "72:4c:21:c9:fe:75",
            "net6": "c6:5d:80:0e:d1:76",
            "net7": "62:18:b7:bf:f3:cc",
            "net8": "8a:5a:a1:1b:84:95",
            "net9": "06:30:f6:86:05:2d"
        },
        "leaf_2_0_10": {
            "net0": "8e:5b:6a:24:bf:28",
            "net1": "aa:a2:bc:60:26:1a",
            "net10": "c2:80:f1:0a:88:03",
            "net2": "f6:85:a9:c7:60:72",
            "net3": "fa:d9:8d:b7:67:02",
            "net4": "46:7e:50:95:c1:5b",
            "net5": "42:06:d0:2f:94:04",
            "net6": "2a:42:fd:44:41:02",
            "net7": "f2:9a:41:a9:46:24",
            "net8": "a2:eb:c1:83:f9:b8",
            "net9": "16:c2:51:3c:aa:ab"
        },
        "leaf_2_0_2": {
            "net0": "46:36:da:a7:53:83",
            "net1": "f6:bc:79:52:27:6a",
            "net10": "86:75:37:14:e9:8b",
            "net2": "52:17:88:b2:4c:c5",
            "net3": "2e:e5:ee:c2:5b:76",
            "net4": "5e:df:13:94:d6:cd",
            "net5": "46:a5:f0:0f:7a:f1",
            "net6": "2a:35:be:10:8a:90",
            "net7": "ea:02:dc:05:82:0b",
            "net8": "8e:83:9d:d3:df:d8",
            "net9": "3a:5b:ea:3e:63:e3"
        },
        "leaf_2_0_3": {
            "net0": "6e:98:7c:e9:6e:f2",
            "net1": "16:6e:fe:ad:2a:98",
            "net10": "b2:97:8e:b2:52:dd",
            "net2": "aa:23:63:13:82:cc",
            "net3": "d6:21:dd:c9:2a:54",
            "net4": "56:ee:bd:05:b0:8e",
            "net5": "96:95:f6:17:59:b0",
            "net6": "16:1f:11:42:c3:22",
            "net7": "c2:9b:ba:ef:4a:08",
            "net8": "ae:93:7b:2f:b4:31",
            "net9": "72:c1:1f:a6:d2:3a"
        },
        "leaf_2_0_4": {
            "net0": "ba:13:67:f8:dc:92",
            "net1": "12:5f:12:e9:1d:87",
            "net10": "2a:6a:f8:39:01:41",
            "net2": "16:05:dd:f8:63:18",
            "net3": "1a:af:bd:55:1f:82",
            "net4": "f2:c9:48:91:74:fc",
            "net5": "76:0f:f8:30:9b:f2",
            "net6": "ae:7f:86:4b:9b:62",
            "net7": "e6:0a:6e:86:bd:f9",
            "net8": "be:2b:04:c9:e3:6a",
            "net9": "7a:bd:d4:17:0c:08"
        },
        "leaf_2_0_5": {
            "net0": "b6:79:a4:a6:a2:f1",
            "net1": "66:97:f6:aa:b2:97",
            "net10": "de:82:dd:9a:f2:da",
            "net2": "b6:1a:e4:d5:03:4f",
            "net3": "72:a9:63:d3:12:f8",
            "net4": "de:82:ae:aa:75:7c",
            "net5": "d2:1e:18:43:90:23",
            "net6": "7a:ba:31:43:a7:26",
            "net7": "4e:8f:4d:a0:78:e3",
            "net8": "aa:70:6f:02:27:c5",
            "net9": "ee:59:66:66:ad:96"
        },
        "leaf_2_0_6": {
            "net0": "6e:54:1d:ee:d3:43",
            "net1": "fa:c1:c1:b1:47:0b",
            "net10": "32:c4:89:8d:6a:dd",
            "net2": "9e:48:21:2d:0a:20",
            "net3": "d6:af:61:59:a4:09",
            "net4": "36:c0:8c:d7:00:bc",
            "net5": "22:84:7f:ff:1d:85",
            "net6": "4e:7c:ef:9f:18:69",
            "net7": "4e:4e:99:db:18:fa",
            "net8": "c6:d5:72:4c:40:18",
            "net9": "fe:e2:d0:ab:a3:aa"
        },
        "leaf_2_0_7": {
            "net0": "02:56:5e:6f:87:f3",
            "net1": "42:a5:a8:c1:8e:45",
            "net10": "8a:aa:0a:7a:ba:e8",
            "net2": "16:6c:64:47:b0:d5",
            "net3": "16:9e:56:4c:d6:11",
            "net4": "8e:2b:10:6f:5f:13",
            "net5": "9e:8e:d5:75:5b:3a",
            "net6": "46:5d:15:58:6b:47",
            "net7": "2e:be:d6:c8:36:ba",
            "net8": "ee:01:7d:b3:c0:b3",
            "net9": "0a:64:f6:3e:64:16"
        },
        "leaf_2_0_8": {
            "net0": "a2:44:27:81:07:0b",
            "net1": "32:51:3a:f9:10:69",
            "net10": "52:f8:ac:8f:b4:e8",
            "net2": "52:23:04:0a:b0:a8",
            "net3": "6e:60:11:a9:25:39",
            "net4": "62:cc:56:14:d3:f8",
            "net5": "e6:af:77:98:0f:e2",
            "net6": "32:9b:d1:20:44:39",
            "net7": "26:22:f7:eb:09:39",
            "net8": "36:d8:50:4e:05:12",
            "net9": "5a:33:13:dc:5f:0e"
        },
        "leaf_2_0_9": {
            "net0": "62:a5:18:00:e2:ef",
            "net1": "4e:6b:76:4a:92:69",
            "net10": "46:5e:10:61:bb:0f",
            "net2": "5e:d1:eb:5e:14:c3",
            "net3": "2e:26:bc:c0:b2:0f",
            "net4": "a6:a7:2b:11:b2:ac",
            "net5": "06:36:f2:bc:f4:b7",
            "net6": "de:36:6c:72:a2:d1",
            "net7": "2a:18:ab:67:df:5b",
            "net8": "3e:eb:c4:5a:b6:3a",
            "net9": "8a:94:0a:9f:6f:08"
        },
        "leaf_3_0_1": {
            "net0": "66:a2:e2:25:ff:86",
            "net1": "7e:94:99:9b:b7:b6",
            "net10": "ba:a8:87:f2:aa:bb",
            "net2": "62:f5:c8:90:e7:28",
            "net3": "72:37:8f:a6:32:ac",
            "net4": "66:27:2d:43:7f:17",
            "net5": "ea:12:c9:17:9d:0b",
            "net6": "72:8a:fa:3e:59:2b",
            "net7": "86:c7:cd:f2:0d:1c",
            "net8": "6a:d1:8a:4e:5d:2c",
            "net9": "6a:af:97:3d:35:66"
        },
        "leaf_3_0_10": {
            "net0": "a2:11:bb:76:5e:18",
            "net1": "02:76:33:ac:fd:25",
            "net10": "e2:84:55:3c:53:b0",
            "net2": "82:e0:a2:da:be:49",
            "net3": "de:a8:fb:09:ee:4a",
            "net4": "f2:05:de:1c:43:5b",
            "net5": "e6:db:5d:39:8f:60",
            "net6": "3e:ac:bb:47:46:5a",
            "net7": "8e:d0:6b:6c:ff:f0",
            "net8": "4a:ea:da:e1:50:96",
            "net9": "ea:c7:d1:63:f5:bc"
        },
        "leaf_3_0_2": {
            "net0": "ea:53:90:36:8d:14",
            "net1": "52:0e:96:57:ed:4b",
            "net10": "0e:46:4d:12:92:ec",
            "net2": "52:64:98:d6:98:01",
            "net3": "92:41:fb:a1:48:e3",
            "net4": "3a:00:a4:ca:c3:c1",
            "net5": "e2:d6:85:91:bb:af",
            "net6": "4e:31:de:cd:f6:fd",
            "net7": "4e:2e:90:db:b4:2f",
            "net8": "9a:78:e7:40:ae:41",
            "net9": "0e:ed:34:9e:7c:44"
        },
        "leaf_3_0_3": {
            "net0": "e2:e7:1a:be:a6:09",
            "net1": "26:b0:ce:87:bc:05",
            "net10": "92:7a:b7:e1:ee:36",
            "net2": "12:8a:c1:01:3b:90",
            "net3": "f2:f0:09:82:ac:b9",
            "net4": "4a:4e:ad:0f:ef:d4",
            "net5": "6e:6f:de:40:46:ec",
            "net6": "02:70:c7:2c:32:2c",
            "net7": "f6:e4:d3:47:b7:20",
            "net8": "52:65:97:c5:23:55",
            "net9": "26:e5:d6:3a:41:cc"
        },
        "leaf_3_0_4": {
            "net0": "1e:62:bd:d5:28:10",
            "net1": "d6:3c:1e:3e:e3:01",
            "net10": "12:17:95:c2:a8:27",
            "net2": "f2:30:d1:4a:4d:b3",
            "net3": "26:f0:f6:b3:7e:38",
            "net4": "e2:72:4c:89:b0:d2",
            "net5": "6a:ba:0a:be:df:56",
            "net6": "4a:52:8e:42:c0:27",
            "net7": "7e:a4:1d:81:7b:2b",
            "net8": "76:b7:78:64:b7:3b",
            "net9": "d2:8a:45:f4:a8:5f"
        },
        "leaf_3_0_5": {
            "net0": "42:06:51:1b:bb:9b",
            "net1": "f6:71:fb:bd:86:25",
            "net10": "ba:83:0d:97:5f:34",
            "net2": "ee:9a:9b:1e:00:3e",
            "net3": "e6:73:62:a1:88:ab",
            "net4": "6a:c1:81:ca:4a:c4",
            "net5": "de:1d:df:94:84:fe",
            "net6": "36:43:de:55:5f:1d",
            "net7": "86:8d:1d:cc:99:ac",
            "net8": "0e:2a:42:77:cd:bf",
            "net9": "8e:47:29:55:52:28"
        },
        "leaf_3_0_6": {
            "net0": "f2:5f:36:c1:54:9b",
            "net1": "a2:80:6b:80:85:33",
            "net10": "a2:6e:02:b1:66:d5",
            "net2": "72:51:4e:52:bd:e8",
            "net3": "36:72:fe:5e:29:32",
            "net4": "26:92:09:94:44:17",
            "net5": "6a:dc:37:ad:f3:3f",
            "net6": "aa:86:e2:3c:45:3c",
            "net7": "6e:da:b8:21:69:7f",
            "net8": "3a:a8:69:cf:9c:f8",
            "net9": "4a:07:df:bf:fa:fc"
        },
        "leaf_3_0_7": {
            "net0": "fa:49:93:0f:3a:ce",
            "net1": "02:f0:90:4c:a3:f8",
            "net10": "b2:7e:d3:0c:d0:b5",
            "net2": "f2:e5:b9:8f:cc:ed",
            "net3": "9e:9b:2e:3e:fe:e3",
            "net4": "22:c8:f9:49:2b:ed",
            "net5": "4e:a7:2d:16:10:d8",
            "net6": "c6:00:42:51:b0:97",
            "net7": "16:8d:3a:99:6b:6f",
            "net8": "fa:a0:b4:b8:09:60",
            "net9": "ee:da:d2:e7:f5:2a"
        },
        "leaf_3_0_8": {
            "net0": "1a:ae:d2:51:43:d1",
            "net1": "7e:9b:3d:19:4d:f7",
            "net10": "f6:1f:2c:52:25:4d",
            "net2": "06:53:2a:b1:e4:8e",
            "net3": "be:4b:c4:91:39:7c",
            "net4": "ce:71:17:e5:a8:3f",
            "net5": "06:c8:64:30:51:8e",
            "net6": "8a:a4:80:65:c0:3c",
            "net7": "32:7c:8c:fb:7a:93",
            "net8": "e6:bd:0d:4f:cf:e8",
            "net9": "ae:6e:7e:50:e6:64"
        },
        "leaf_3_0_9": {
            "net0": "02:c6:a6:c0:8a:fe",
            "net1": "2e:9f:d2:a3:33:8a",
            "net10": "f2:c9:f5:d7:51:34",
            "net2": "a2:ad:03:d5:f9:71",
            "net3": "ce:b5:75:9e:4b:83",
            "net4": "92:95:bd:10:e8:da",
            "net5": "ce:db:47:98:48:56",
            "net6": "1a:65:d2:00:47:56",
            "net7": "0a:fc:c9:70:39:cb",
            "net8": "86:16:59:90:41:d0",
            "net9": "ca:1c:08:a0:ba:c3"
        },
        "leaf_4_0_1": {
            "net0": "d2:76:0e:4c:c9:e3",
            "net1": "ee:ca:ae:ce:29:c8",
            "net10": "a2:7f:55:c4:95:7d",
            "net2": "c6:1d:26:11:1d:24",
            "net3": "2e:b7:dc:05:e4:c5",
            "net4": "3e:2a:21:0d:d3:16",
            "net5": "a6:d6:5c:d9:3b:64",
            "net6": "62:d2:4a:4b:01:92",
            "net7": "f6:f9:db:15:30:bb",
            "net8": "0e:69:e3:2f:94:b6",
            "net9": "36:6f:3d:b3:7d:9d"
        },
        "leaf_4_0_10": {
            "net0": "92:66:50:3d:1e:64",
            "net1": "82:4b:53:99:6a:44",
            "net10": "1e:00:cb:dc:77:03",
            "net2": "ce:6b:a4:b9:e8:d1",
            "net3": "36:19:de:d2:de:bf",
            "net4": "5e:29:57:cb:2a:32",
            "net5": "b6:68:c8:98:b7:52",
            "net6": "8a:9a:38:51:aa:28",
            "net7": "22:19:42:82:a2:6c",
            "net8": "16:84:f5:9b:e4:7a",
            "net9": "9a:bb:5c:63:27:da"
        },
        "leaf_4_0_2": {
            "net0": "82:c0:75:64:0f:50",
            "net1": "a6:39:ad:7a:9c:4a",
            "net10": "4a:3b:e7:55:9d:5d",
            "net2": "36:7f:68:7e:36:6a",
            "net3": "fe:2f:54:25:9a:b0",
            "net4": "6e:c7:51:44:d8:b8",
            "net5": "26:cb:c6:35:0d:3b",
            "net6": "0e:f3:b3:d0:3f:b1",
            "net7": "b2:c7:3c:b2:86:15",
            "net8": "42:be:4a:c5:7a:93",
            "net9": "32:cb:75:c7:b2:94"
        },
        "leaf_4_0_3": {
            "net0": "4a:28:7c:df:c8:7b",
            "net1": "66:6f:18:f1:30:76",
            "net10": "72:9c:32:ab:3c:43",
            "net2": "9e:dd:0f:9e:ae:77",
            "net3": "76:a4:26:f3:4e:86",
            "net4": "c6:1e:ac:ea:35:1a",
            "net5": "56:02:83:eb:1e:97",
            "net6": "82:e4:51:2b:46:62",
            "net7": "b6:3e:c1:e5:49:ce",
            "net8": "16:77:07:ae:b2:69",
            "net9": "22:47:99:c5:e3:f6"
        },
        "leaf_4_0_4": {
            "net0": "ee:12:4c:f4:02:75",
            "net1": "fa:64:80:48:72:a4",
            "net10": "4a:c4:b2:a5:fa:46",
            "net2": "62:71:be:d0:56:fd",
            "net3": "b6:a0:6b:c3:f8:9d",
            "net4": "52:eb:f7:85:20:c8",
            "net5": "b2:66:d9:b2:ab:a8",
            "net6": "c6:6b:a1:5c:f4:7a",
            "net7": "72:bd:f7:bb:20:c8",
            "net8": "96:a1:ff:cb:97:cf",
            "net9": "12:d5:0b:90:73:37"
        },
        "leaf_4_0_5": {
            "net0": "7a:03:82:47:8d:19",
            "net1": "76:ea:f2:2b:80:53",
            "net10": "da:22:62:7a:af:7b",
            "net2": "56:e0:42:55:ed:ec",
            "net3": "1e:8b:fe:ea:50:84",
            "net4": "ce:59:5f:d7:77:ae",
            "net5": "da:37:96:df:2f:f6",
            "net6": "7a:be:60:f6:94:ae",
            "net7": "82:67:54:08:e3:90",
            "net8": "b2:e1:3d:cf:34:74",
            "net9": "be:79:50:b3:18:fb"
        },
        "leaf_4_0_6": {
            "net0": "36:9e:b5:53:f1:5d",
            "net1": "12:4a:dd:38:31:ea",
            "net10": "aa:48:d2:7f:f9:65",
            "net2": "b6:5a:a4:13:85:a1",
            "net3": "c6:f4:c8:6e:d6:c2",
            "net4": "fe:c7:ff:b7:9d:1a",
            "net5": "5e:d9:c9:62:5a:d0",
            "net6": "aa:8e:22:86:28:fa",
            "net7": "16:ed:cc:13:1f:b0",
            "net8": "76:9d:ea:55:aa:40",
            "net9": "de:69:6c:64:30:a3"
        },
        "leaf_4_0_7": {
            "net0": "32:94:8a:d0:a3:de",
            "net1": "22:da:5e:e2:d1:f3",
            "net10": "be:a2:d1:61:dc:02",
            "net2": "be:49:7b:f4:42:94",
            "net3": "da:03:b0:7e:41:b4",
            "net4": "c6:e8:32:7f:b8:c2",
            "net5": "02:02:ed:54:8f:76",
            "net6": "72:18:72:e0:8f:e7",
            "net7": "06:9c:be:d9:12:5e",
            "net8": "c2:6c:b3:fd:76:08",
            "net9": "ca:82:01:ec:0b:54"
        },
        "leaf_4_0_8": {
            "net0": "56:8f:b7:33:cc:33",
            "net1": "9e:97:b3:b6:1a:bd",
            "net10": "22:1b:8c:00:70:d1",
            "net2": "36:51:71:c3:4e:50",
            "net3": "42:40:d9:ec:bd:85",
            "net4": "62:79:2b:bf:02:a3",
            "net5": "ca:a3:9a:c0:2c:80",
            "net6": "86:69:5e:e3:50:1b",
            "net7": "96:50:d1:66:20:1f",
            "net8": "2e:bb:28:67:bb:3f",
            "net9": "02:c8:7c:31:10:f9"
        },
        "leaf_4_0_9": {
            "net0": "2a:6b:f2:07:df:c6",
            "net1": "76:fd:e6:87:f8:c9",
            "net10": "0e:be:a4:27:01:de",
            "net2": "de:b6:06:40:eb:33",
            "net3": "2a:86:a6:fc:b3:e2",
            "net4": "e6:f7:9e:0b:14:56",
            "net5": "32:d9:d5:a0:63:a9",
            "net6": "2a:0c:67:88:bc:57",
            "net7": "86:8b:03:dd:93:cd",
            "net8": "86:5e:ff:db:bf:b9",
            "net9": "06:49:52:b4:2f:35"
        },
        "spine_1_1_1": {
            "net0": "86:0d:69:8c:50:e9",
            "net1": "0e:d1:75:2f:82:5b",
            "net10": "6e:31:e7:3b:78:34",
            "net11": "7a:f3:b3:20:53:8f",
            "net12": "06:37:2f:ff:f8:f7",
            "net13": "22:68:b6:1a:f5:22",
            "net14": "32:11:06:20:9b:a1",
            "net15": "4a:6c:f8:1b:43:47",
            "net16": "ae:a0:68:99:26:10",
            "net17": "f6:57:82:54:a6:4e",
            "net18": "aa:e2:f2:f8:9a:96",
            "net19": "b2:ba:a7:7e:16:4d",
            "net2": "5e:bd:ea:00:e4:fc",
            "net3": "7e:4e:77:5d:62:61",
            "net4": "7e:13:62:1e:eb:ba",
            "net5": "e2:41:97:23:ed:29",
            "net6": "4e:93:25:18:61:a3",
            "net7": "ea:8f:1a:dc:9f:86",
            "net8": "ee:12:9a:e5:43:85",
            "net9": "72:9f:d3:87:aa:7d"
        },
        "spine_1_1_10": {
            "net0": "ba:59:ee:1d:fc:16",
            "net1": "da:82:8f:21:ff:60",
            "net10": "fe:3c:9c:62:e3:dd",
            "net11": "ca:4a:ba:f6:8d:d5",
            "net12": "e6:42:43:2e:15:fb",
            "net13": "62:6a:0a:be:14:36",
            "net14": "ae:be:2d:bf:1f:be",
            "net15": "26:e8:06:db:10:6b",
            "net16": "6e:16:10:0b:a8:55",
            "net17": "62:02:b3:b2:5f:88",
            "net18": "ce:e6:3b:8e:de:a1",
            "net19": "a6:fc:94:10:f9:d3",
            "net2": "c6:a3:32:90:2c:32",
            "net3": "8a:29:a3:1f:6b:e4",
            "net4": "62:96:73:22:d0:65",
            "net5": "ce:bc:55:ee:86:f6",
            "net6": "82:65:e6:e5:b5:10",
            "net7": "8e:e6:38:f2:2f:59",
            "net8": "da:3a:df:ba:d2:08",
            "net9": "b2:01:8b:40:52:64"
        },
        "spine_1_1_2": {
            "net0": "92:c6:b1:65:15:cf",
            "net1": "26:3c:28:1b:01:44",
            "net10": "9e:cb:83:ad:e6:c0",
            "net11": "0a:a4:e5:7e:c3:09",
            "net12": "5e:a4:d0:e5:8b:f3",
            "net13": "c6:84:2a:7b:d1:77",
            "net14": "d2:db:77:db:26:48",
            "net15": "8a:8a:48:0e:c7:85",
            "net16": "1e:94:5a:66:9a:3f",
            "net17": "1e:54:a2:87:43:e3",
            "net18": "e6:61:b5:6f:d8:d6",
            "net19": "a2:46:a6:57:5f:22",
            "net2": "46:b9:39:cc:d5:19",
            "net3": "2a:0d:13:a2:68:35",
            "net4": "82:62:c0:c3:1a:97",
            "net5": "26:f1:69:cc:ec:89",
            "net6": "7a:39:c0:1e:2b:9e",
            "net7": "5e:90:ef:39:98:2c",
            "net8": "86:28:ea:8b:f5:8c",
            "net9": "d2:9a:dc:40:2f:fc"
        },
        "spine_1_1_3": {
            "net0": "ae:9e:1e:d4:32:f6",
            "net1": "52:fc:4b:7d:da:29",
            "net10": "2a:71:e2:7c:77:99",
            "net11": "da:48:d6:3f:63:34",
            "net12": "86:3d:8e:16:44:db",
            "net13": "56:ca:21:b5:30:3c",
            "net14": "8a:28:7a:a5:eb:64",
            "net15": "3a:40:c5:5e:9e:0b",
            "net16": "0a:de:34:b3:57:ba",
            "net17": "92:20:2f:1d:92:f8",
            "net18": "7e:2d:e7:5f:1f:6e",
            "net19": "e6:9a:31:6f:8e:38",
            "net2": "1e:ee:25:3c:84:5e",
            "net3": "b6:ee:39:9b:90:a4",
            "net4": "b2:cd:d4:f6:18:8f",
            "net5": "7a:1d:12:ce:d8:e8",
            "net6": "b2:bd:71:24:29:6c",
            "net7": "ca:ca:85:3a:6e:2e",
            "net8": "a2:c8:d7:bc:d0:ba",
            "net9": "5e:9c:15:69:23:cf"
        },
        "spine_1_1_4": {
            "net0": "aa:5c:91:e5:ce:ef",
            "net1": "d2:0f:07:a2:58:76",
            "net10": "12:be:c1:44:07:4d",
            "net11": "d6:3d:11:53:89:dc",
            "net12": "76:6f:d8:e0:0f:6a",
            "net13": "6a:e3:04:0a:bf:d2",
            "net14": "de:d5:70:59:39:06",
            "net15": "8e:c0:49:df:5a:ad",
            "net16": "52:5b:ce:13:66:73",
            "net17": "ce:01:b6:82:f4:b9",
            "net18": "86:8c:86:d3:83:06",
            "net19": "9e:b3:22:55:ad:71",
            "net2": "9a:32:a3:6c:6f:b9",
            "net3": "c2:55:9c:12:d9:f3",
            "net4": "f2:b1:04:b2:b4:7a",
            "net5": "f2:0d:5b:6f:16:da",
            "net6": "5a:a1:cd:fe:93:bf",
            "net7": "2a:c5:5f:6a:3e:11",
            "net8": "f6:4a:53:fb:b9:75",
            "net9": "5a:9e:7f:1c:e3:cd"
        },
        "spine_1_1_5": {
            "net0": "6a:ed:a3:d5:9a:75",
            "net1": "d2:e1:cb:15:f6:8c",
            "net10": "0e:92:4f:c7:aa:ee",
            "net11": "52:45:e6:37:8e:ed",
            "net12": "26:7c:98:80:31:cd",
            "net13": "f6:a8:59:4a:5a:61",
            "net14": "fe:cd:d8:47:73:c3",
            "net15": "9a:91:de:9f:34:47",
            "net16": "46:e5:97:80:24:0b",
            "net17": "5e:49:4e:43:6c:14",
            "net18": "2a:2d:8e:8b:46:5c",
            "net19": "ca:95:53:ba:0d:9d",
            "net2": "a2:44:f1:f3:0e:ab",
            "net3": "a2:a5:82:3a:29:e7",
            "net4": "da:87:e7:c4:97:f4",
            "net5": "9a:4b:93:6b:ca:7a",
            "net6": "7e:db:fc:94:85:83",
            "net7": "86:bc:fb:a1:60:78",
            "net8": "82:5f:40:05:49:15",
            "net9": "56:30:5d:db:bc:25"
        },
        "spine_1_1_6": {
            "net0": "ce:c2:54:d1:87:43",
            "net1": "8e:24:8b:96:76:58",
            "net10": "56:f7:98:3c:9a:69",
            "net11": "1e:fd:7d:e2:49:31",
            "net12": "ee:29:8e:fd:ea:06",
            "net13": "32:20:c9:d4:3e:96",
            "net14": "2e:98:32:49:c9:76",
            "net15": "a6:3a:f5:91:a4:a2",
            "net16": "76:ba:13:2f:37:e7",
            "net17": "3e:12:e0:9f:b4:b2",
            "net18": "9e:8a:28:7d:1a:a1",
            "net19": "66:00:de:ff:27:f8",
            "net2": "be:b1:c5:5e:18:60",
            "net3": "06:b8:f7:62:be:b7",
            "net4": "02:58:cf:b2:f4:b5",
            "net5": "26:fa:1e:59:70:28",
            "net6": "fe:7e:ea:10:a5:65",
            "net7": "5e:2d:67:fe:5a:d6",
            "net8": "d2:7a:67:c2:cf:4a",
            "net9": "6e:4b:cf:86:7e:84"
        },
        "spine_1_1_7": {
            "net0": "5e:86:7f:1c:49:87",
            "net1": "5e:29:f8:4a:2a:f7",
            "net10": "fa:2f:b6:0e:8f:27",
            "net11": "46:b4:1d:99:1f:92",
            "net12": "0e:93:76:9a:29:77",
            "net13": "ce:64:4e:a4:fb:19",
            "net14": "36:18:aa:1c:52:2c",
            "net15": "42:3a:87:29:9d:ff",
            "net16": "a2:82:ec:88:aa:6b",
            "net17": "32:b5:1a:d7:22:a8",
            "net18": "4a:98:ca:b5:fa:a1",
            "net19": "ba:d5:25:41:dc:ff",
            "net2": "fa:a6:79:d3:9b:ed",
            "net3": "5a:04:ea:71:1d:6e",
            "net4": "da:13:34:ce:13:34",
            "net5": "76:c3:e3:b3:58:45",
            "net6": "22:8c:d8:00:74:35",
            "net7": "46:df:a7:60:7e:69",
            "net8": "e2:31:32:3e:a9:fc",
            "net9": "b2:d3:83:f1:38:86"
        },
        "spine_1_1_8": {
            "net0": "de:af:eb:4f:30:4e",
            "net1": "4e:36:fd:a5:d3:07",
            "net10": "b6:5b:5e:0b:e4:2c",
            "net11": "ca:30:d0:bf:5b:ae",
            "net12": "52:a6:32:20:5d:9f",
            "net13": "3a:09:95:84:f3:dd",
            "net14": "56:01:06:4d:81:12",
            "net15": "96:58:76:84:bc:e5",
            "net16": "a2:3b:21:0a:e0:dc",
            "net17": "02:df:2e:37:05:e5",
            "net18": "4a:74:c6:9f:d6:0e",
            "net19": "96:fe:ed:0a:2f:6a",
            "net2": "96:2b:28:a0:dd:af",
            "net3": "9a:80:65:0d:4d:ef",
            "net4": "ca:e2:c2:35:7d:bb",
            "net5": "22:e8:92:63:f6:24",
            "net6": "fe:d7:19:64:7c:90",
            "net7": "12:f4:6e:c5:f1:ec",
            "net8": "be:2b:9c:39:5d:39",
            "net9": "3a:7c:03:3e:7d:77"
        },
        "spine_1_1_9": {
            "net0": "1a:1c:01:5e:6a:45",
            "net1": "ee:20:02:77:9b:32",
            "net10": "5a:cd:29:02:07:e5",
            "net11": "d6:34:d5:55:a0:a2",
            "net12": "26:dc:b5:a7:31:3f",
            "net13": "d2:d3:85:b8:b5:5a",
            "net14": "ee:1c:fe:d5:b0:74",
            "net15": "fa:cc:c0:79:b4:5b",
            "net16": "aa:47:53:9d:6f:a8",
            "net17": "e6:43:13:bb:d4:77",
            "net18": "fe:84:7f:78:63:09",
            "net19": "ee:fb:c8:bb:b5:b8",
            "net2": "8e:ea:3a:1f:e2:e0",
            "net3": "4a:80:e2:73:b3:1d",
            "net4": "b2:cc:a4:fb:a0:60",
            "net5": "62:96:03:fc:dc:22",
            "net6": "1a:21:f4:da:df:25",
            "net7": "ce:41:67:8e:78:ff",
            "net8": "0a:6e:b7:cd:4e:d6",
            "net9": "d6:0f:de:51:29:30"
        },
        "spine_2_1_1": {
            "net0": "ea:b1:65:d7:5f:ae",
            "net1": "da:e5:7f:27:6d:5b",
            "net10": "ee:14:be:79:4c:28",
            "net11": "5e:a2:0a:5d:6c:36",
            "net12": "46:d6:9a:76:5f:0f",
            "net13": "5e:40:7c:43:c4:40",
            "net14": "7e:ff:4f:5b:10:60",
            "net15": "02:d1:e9:46:63:6b",
            "net16": "26:37:4e:f0:fe:8b",
            "net17": "5e:1c:1a:57:ba:7f",
            "net18": "ba:5b:51:b0:22:97",
            "net19": "e2:6e:f6:6e:59:d7",
            "net2": "ce:f7:08:2f:2b:84",
            "net3": "1a:03:e0:2e:d6:9e",
            "net4": "7a:4d:de:27:d3:b0",
            "net5": "8e:88:b0:f5:c8:31",
            "net6": "32:2c:42:5d:fc:e6",
            "net7": "c2:26:a6:d1:97:9c",
            "net8": "7e:8f:b5:cb:8d:7f",
            "net9": "72:f4:f4:97:9c:03"
        },
        "spine_2_1_10": {
            "net0": "f2:62:9d:e1:1a:87",
            "net1": "26:c5:ca:e5:cf:f6",
            "net10": "6e:b0:b5:39:15:cf",
            "net11": "9a:2a:f3:24:ac:76",
            "net12": "2e:fb:59:f8:b2:b1",
            "net13": "82:fe:45:be:b0:10",
            "net14": "ce:f3:84:93:b8:f0",
            "net15": "d2:d6:da:dd:2b:1d",
            "net16": "62:26:89:e7:93:ce",
            "net17": "2e:11:bc:e7:6a:19",
            "net18": "2a:cd:d0:c4:3c:71",
            "net19": "5e:99:56:ef:7d:2f",
            "net2": "96:c9:ae:24:8c:db",
            "net3": "3e:de:7f:61:fb:d7",
            "net4": "8a:9e:8a:d7:e3:90",
            "net5": "9a:50:a5:22:bf:68",
            "net6": "22:7b:2a:c3:d1:f2",
            "net7": "fa:af:1f:57:35:e7",
            "net8": "8a:1d:8f:31:d2:ae",
            "net9": "0e:ea:3d:c0:6a:08"
        },
        "spine_2_1_2": {
            "net0": "f6:35:20:62:14:d6",
            "net1": "fe:d4:9e:af:b5:25",
            "net10": "9a:7e:c2:dd:08:69",
            "net11": "8a:58:4f:d1:c8:3f",
            "net12": "12:e6:17:10:d3:30",
            "net13": "4e:c6:47:41:70:0d",
            "net14": "8e:d0:07:b6:fe:14",
            "net15": "ae:54:6e:da:e0:63",
            "net16": "12:a0:2e:b7:40:ec",
            "net17": "66:a0:b7:65:1c:cd",
            "net18": "ce:29:9a:1f:af:6c",
            "net19": "0e:93:59:d7:9b:84",
            "net2": "02:09:7b:e2:22:8a",
            "net3": "1e:0e:d0:d3:77:fb",
            "net4": "9e:2f:a5:d7:a4:e0",
            "net5": "f6:46:30:42:e8:24",
            "net6": "9e:ae:1c:28:82:9b",
            "net7": "72:10:03:d9:f1:ad",
            "net8": "6a:b3:2f:bf:1f:df",
            "net9": "8a:cc:4b:ac:f6:fb"
        },
        "spine_2_1_3": {
            "net0": "fa:01:0b:d8:f7:83",
            "net1": "7a:55:3d:6d:3f:38",
            "net10": "22:32:67:cf:27:b2",
            "net11": "16:05:da:85:ae:88",
            "net12": "72:6e:dd:33:2f:94",
            "net13": "be:fc:aa:12:f0:b5",
            "net14": "ae:77:83:87:69:b0",
            "net15": "82:2a:6b:f2:63:b4",
            "net16": "be:c6:32:aa:4e:a6",
            "net17": "fa:58:ec:d4:eb:3e",
            "net18": "d2:09:d7:55:31:38",
            "net19": "06:bc:28:e1:4f:8c",
            "net2": "0e:43:08:35:93:ff",
            "net3": "ce:8c:a4:38:40:e8",
            "net4": "f2:12:ea:03:0b:c8",
            "net5": "86:84:16:96:e5:de",
            "net6": "3e:eb:92:65:47:65",
            "net7": "96:fd:48:76:6d:a0",
            "net8": "2a:06:56:e4:4d:2a",
            "net9": "56:4b:67:95:f1:b6"
        },
        "spine_2_1_4": {
            "net0": "a2:e3:9b:83:5c:64",
            "net1": "5e:5f:c7:07:31:46",
            "net10": "a6:70:fa:8a:9b:df",
            "net11": "52:6c:e6:76:2f:32",
            "net12": "42:2c:c0:d9:db:f2",
            "net13": "2a:a0:48:fe:6c:a7",
            "net14": "72:e2:c6:76:08:f6",
            "net15": "da:fd:1f:f4:c1:14",
            "net16": "ba:84:c3:aa:1c:e4",
            "net17": "42:a6:ba:07:e6:9f",
            "net18": "e6:a6:5a:f7:5a:50",
            "net19": "3e:12:a3:83:7b:50",
            "net2": "f2:df:9b:cf:82:72",
            "net3": "0e:72:66:41:f7:11",
            "net4": "82:5c:c9:11:51:d8",
            "net5": "1e:e9:00:6d:8b:b2",
            "net6": "22:96:50:b4:4c:0a",
            "net7": "32:36:8c:94:3b:85",
            "net8": "d2:5b:39:86:ff:43",
            "net9": "4e:f7:96:fb:47:fb"
        },
        "spine_2_1_5": {
            "net0": "86:8b:ac:44:ac:40",
            "net1": "2e:b5:65:f0:5f:d2",
            "net10": "72:27:72:b3:fe:eb",
            "net11": "ba:c4:17:0f:58:2f",
            "net12": "42:22:c9:ed:4e:e9",
            "net13": "9e:bc:f1:91:96:02",
            "net14": "fe:fc:22:bb:80:a3",
            "net15": "86:0e:40:5f:23:87",
            "net16": "a2:59:cc:7b:e9:68",
            "net17": "6a:41:cc:66:d2:e1",
            "net18": "9a:c5:ba:95:da:68",
            "net19": "7a:29:bc:ec:f4:f7",
            "net2": "3e:04:65:9f:50:8f",
            "net3": "72:c7:d0:06:88:85",
            "net4": "42:35:63:05:df:71",
            "net5": "8a:c3:71:ea:8b:c7",
            "net6": "be:92:3e:52:92:b9",
            "net7": "3a:c7:7f:06:50:d2",
            "net8": "72:3d:03:e1:cb:a4",
            "net9": "ce:06:e2:a1:3e:af"
        },
        "spine_2_1_6": {
            "net0": "42:dd:aa:28:69:c5",
            "net1": "e6:29:87:a5:78:27",
            "net10": "52:a9:08:81:83:53",
            "net11": "12:25:5b:f3:5f:57",
            "net12": "52:89:ab:90:20:81",
            "net13": "b6:30:0c:a1:86:84",
            "net14": "c2:80:1f:d3:90:bf",
            "net15": "3a:4c:1d:e3:39:09",
            "net16": "1e:f6:7c:3b:cc:83",
            "net17": "b6:a2:ee:fe:9d:21",
            "net18": "be:eb:2f:04:ca:21",
            "net19": "c6:b5:28:a4:b8:c1",
            "net2": "46:d9:bc:e8:67:ee",
            "net3": "9a:6b:a3:15:d2:8f",
            "net4": "3a:91:3f:72:ab:66",
            "net5": "72:9e:b7:ab:70:68",
            "net6": "ca:83:bb:3c:9e:21",
            "net7": "f6:84:cf:58:54:f1",
            "net8": "56:5d:36:c3:60:37",
            "net9": "fe:a9:04:6c:44:29"
        },
        "spine_2_1_7": {
            "net0": "22:e7:cd:d7:48:d9",
            "net1": "32:f4:db:6e:5b:d3",
            "net10": "a6:41:93:79:4a:cc",
            "net11": "86:6d:f1:69:14:bf",
            "net12": "9e:61:80:25:3e:6c",
            "net13": "de:1c:64:a9:93:5a",
            "net14": "96:18:7b:d5:13:7f",
            "net15": "de:53:c8:93:86:ca",
            "net16": "8e:f9:83:78:42:a3",
            "net17": "f6:c9:b8:dc:56:bb",
            "net18": "32:0a:41:67:01:ce",
            "net19": "8a:f6:ee:52:b8:ad",
            "net2": "f2:40:20:b5:2d:7c",
            "net3": "ee:42:c9:b1:59:6f",
            "net4": "fe:48:c7:55:3f:82",
            "net5": "ea:f2:29:fd:b7:13",
            "net6": "fe:64:c0:b0:f7:90",
            "net7": "42:be:2e:a9:8e:9c",
            "net8": "fa:dd:00:c3:ef:78",
            "net9": "56:6b:8d:47:48:57"
        },
        "spine_2_1_8": {
            "net0": "be:df:c0:55:47:a1",
            "net1": "8a:a0:a3:16:3a:02",
            "net10": "ce:7f:8c:7f:1b:02",
            "net11": "6e:37:4a:a3:9e:fb",
            "net12": "da:92:86:d1:e0:33",
            "net13": "12:26:d8:52:23:2f",
            "net14": "d6:72:b1:fb:1e:8c",
            "net15": "22:45:40:89:65:3d",
            "net16": "8e:f8:4d:03:53:f9",
            "net17": "a6:f9:7d:e3:eb:65",
            "net18": "ea:ff:86:c8:9b:f2",
            "net19": "1e:99:fb:7c:92:ed",
            "net2": "ee:a9:c2:d0:0f:9d",
            "net3": "fa:dd:e5:db:7a:3e",
            "net4": "52:17:ee:04:e6:90",
            "net5": "c2:7c:98:79:16:8e",
            "net6": "aa:18:f5:11:24:61",
            "net7": "3e:17:ba:6a:ff:f2",
            "net8": "06:ba:55:b5:fb:72",
            "net9": "be:d7:59:a7:1a:65"
        },
        "spine_2_1_9": {
            "net0": "4a:9d:16:7b:f3:25",
            "net1": "82:e1:f4:aa:d6:b0",
            "net10": "16:5c:bb:7c:53:92",
            "net11": "96:6a:99:6c:48:b5",
            "net12": "22:87:a2:d3:0d:d0",
            "net13": "4a:9a:88:a1:92:89",
            "net14": "5a:8e:46:b7:de:b0",
            "net15": "de:d6:a5:f2:ea:78",
            "net16": "7a:68:82:7c:4e:e2",
            "net17": "7e:fb:3d:8c:ad:9c",
            "net18": "96:84:64:ec:50:9a",
            "net19": "c6:d3:16:ee:47:bb",
            "net2": "fe:25:4e:63:17:33",
            "net3": "d6:08:e7:cd:a5:66",
            "net4": "d6:db:2c:06:13:d9",
            "net5": "c6:36:19:c4:b9:4e",
            "net6": "f6:da:20:34:ed:84",
            "net7": "d2:1e:a4:b0:f5:2f",
            "net8": "ba:5d:c0:58:fd:87",
            "net9": "d2:5b:a9:0e:f6:51"
        },
        "spine_3_1_1": {
            "net0": "ca:7b:f5:20:91:04",
            "net1": "06:c2:08:3e:5b:05",
            "net10": "d6:4d:5a:06:6a:e3",
            "net11": "9e:f6:5a:6b:4a:04",
            "net12": "6e:7c:20:1f:06:c9",
            "net13": "3a:ae:da:ce:33:0d",
            "net14": "92:95:fd:a0:0c:0c",
            "net15": "66:d5:0f:39:9b:1a",
            "net16": "b6:98:c6:35:69:cc",
            "net17": "0e:67:68:85:4e:2a",
            "net18": "1a:26:1d:6b:0f:ac",
            "net19": "4e:93:17:2f:89:77",
            "net2": "82:51:38:18:4f:89",
            "net3": "ee:6c:92:12:04:35",
            "net4": "0a:98:6a:26:0a:dd",
            "net5": "12:8f:e5:10:45:90",
            "net6": "ce:1d:6f:51:18:a7",
            "net7": "66:db:cd:0d:43:3a",
            "net8": "42:42:2a:1b:bf:10",
            "net9": "0a:e8:31:d0:5a:38"
        },
        "spine_3_1_10": {
            "net0": "82:23:51:76:de:ae",
            "net1": "92:1d:ff:c4:5e:5c",
            "net10": "3a:29:56:94:9d:1b",
            "net11": "16:c5:ae:d6:f3:c0",
            "net12": "36:c0:29:f5:29:fa",
            "net13": "42:16:44:db:72:07",
            "net14": "de:84:7d:3a:01:55",
            "net15": "06:14:12:a2:cc:80",
            "net16": "32:6c:65:2d:af:e0",
            "net17": "9e:29:d7:d7:3e:4b",
            "net18": "c6:62:08:fd:2c:e9",
            "net19": "d2:58:a5:dd:77:69",
            "net2": "ea:b0:cb:fa:48:e1",
            "net3": "0e:03:b3:f0:ac:3d",
            "net4": "5a:a7:ae:ed:87:60",
            "net5": "46:32:01:ed:f4:0f",
            "net6": "da:ff:87:a5:fe:82",
            "net7": "8e:48:c5:b3:9b:72",
            "net8": "9a:92:74:2b:47:2e",
            "net9": "ee:8f:7a:e0:e9:ec"
        },
        "spine_3_1_2": {
            "net0": "ea:1c:81:3c:2a:b7",
            "net1": "aa:50:86:40:49:64",
            "net10": "1e:4b:12:aa:c3:ba",
            "net11": "9a:3c:ed:6a:42:c3",
            "net12": "da:b5:7e:a3:68:09",
            "net13": "9e:97:e7:34:43:38",
            "net14": "2e:8d:89:14:97:37",
            "net15": "6e:2d:38:9f:86:58",
            "net16": "ba:9a:2d:08:2b:44",
            "net17": "de:7d:9f:4f:20:48",
            "net18": "7a:4f:40:72:c7:d5",
            "net19": "32:ae:4a:cf:0c:72",
            "net2": "56:ec:3f:86:3e:5a",
            "net3": "d2:48:fd:cd:ab:d4",
            "net4": "06:9c:7e:9a:4f:69",
            "net5": "e2:89:7b:f5:03:1c",
            "net6": "be:af:7e:2a:e2:d2",
            "net7": "52:4a:72:b8:cb:59",
            "net8": "9a:ed:36:ba:9e:8c",
            "net9": "5e:c7:6c:fc:a9:c3"
        },
        "spine_3_1_3": {
            "net0": "82:42:b8:d0:42:1e",
            "net1": "42:35:45:ff:69:2a",
            "net10": "9e:f6:3f:01:0e:f5",
            "net11": "96:63:3b:06:b4:58",
            "net12": "fa:02:09:21:9a:8c",
            "net13": "ce:79:9c:cf:97:6b",
            "net14": "ae:4a:c1:a0:82:75",
            "net15": "b2:3d:64:5c:2e:ad",
            "net16": "fe:ef:8e:34:0f:2a",
            "net17": "ea:5f:8a:7b:68:e9",
            "net18": "aa:2d:41:31:94:de",
            "net19": "a6:bc:bf:3c:25:b1",
            "net2": "1a:b7:26:be:28:2f",
            "net3": "e6:55:10:30:02:ac",
            "net4": "d2:c6:44:ef:38:47",
            "net5": "16:0b:38:7d:db:e2",
            "net6": "fa:2e:6e:fb:b5:5e",
            "net7": "ce:e5:5a:7a:a7:01",
            "net8": "16:2f:a3:68:9c:86",
            "net9": "86:c9:3a:ab:7f:4a"
        },
        "spine_3_1_4": {
            "net0": "ae:1e:51:48:d0:a0",
            "net1": "32:40:aa:bf:bb:05",
            "net10": "62:10:e9:15:99:44",
            "net11": "fa:a7:6a:cd:0d:2b",
            "net12": "da:8e:57:0a:7a:2f",
            "net13": "8e:79:5f:d8:dc:c4",
            "net14": "1a:4d:a8:73:ae:b6",
            "net15": "0e:01:25:3a:f0:4f",
            "net16": "86:df:70:1d:d4:a7",
            "net17": "da:7d:fc:c6:cd:29",
            "net18": "22:78:8e:cc:38:1f",
            "net19": "2e:90:aa:0d:51:75",
            "net2": "22:57:90:fb:d9:30",
            "net3": "36:30:68:10:f3:5f",
            "net4": "c2:a2:3c:42:3e:32",
            "net5": "f2:be:2a:e8:0c:eb",
            "net6": "3a:14:df:7f:e6:60",
            "net7": "86:7d:48:46:25:fa",
            "net8": "b6:06:e3:83:4e:3c",
            "net9": "4a:7e:1a:31:15:2f"
        },
        "spine_3_1_5": {
            "net0": "8e:7a:ff:60:e9:25",
            "net1": "d6:04:ca:7f:b9:97",
            "net10": "82:93:9d:03:be:53",
            "net11": "ee:27:bc:9d:b7:57",
            "net12": "fa:2d:ff:ca:1d:a0",
            "net13": "0a:d1:65:7d:42:a2",
            "net14": "86:e6:10:a2:32:77",
            "net15": "f6:8e:62:aa:a2:c2",
            "net16": "3a:40:8f:1a:c3:1b",
            "net17": "96:0f:07:b5:b8:7c",
            "net18": "ea:31:8d:13:d4:1c",
            "net19": "7e:30:14:cc:b8:ba",
            "net2": "76:6e:21:23:03:13",
            "net3": "aa:00:b6:8d:6e:42",
            "net4": "06:56:1e:50:d0:35",
            "net5": "26:e5:a1:90:f8:52",
            "net6": "ce:b3:3b:2a:4a:c2",
            "net7": "96:c2:e3:2f:8e:1e",
            "net8": "ba:dc:7a:40:9e:da",
            "net9": "fa:a9:c5:8f:f9:c6"
        },
        "spine_3_1_6": {
            "net0": "b6:a7:80:3c:7a:92",
            "net1": "ca:c5:9f:8b:41:eb",
            "net10": "6e:7c:45:79:16:c0",
            "net11": "ba:94:88:1c:ff:79",
            "net12": "2a:8f:ef:18:e7:48",
            "net13": "82:00:51:ad:ba:68",
            "net14": "62:58:98:59:a1:23",
            "net15": "86:f1:4d:5e:84:dc",
            "net16": "32:29:fa:77:ae:93",
            "net17": "ce:1d:a2:cc:09:ae",
            "net18": "ba:80:1d:2d:6f:85",
            "net19": "7a:53:28:04:b9:66",
            "net2": "2e:62:37:86:ac:63",
            "net3": "62:4e:34:69:e3:87",
            "net4": "62:e7:41:68:ed:f2",
            "net5": "f2:33:8c:ac:fd:9d",
            "net6": "7a:ee:7a:12:fc:00",
            "net7": "c6:b4:6d:d8:ef:15",
            "net8": "22:7a:17:31:cf:86",
            "net9": "42:31:da:8b:5f:cd"
        },
        "spine_3_1_7": {
            "net0": "c2:75:ae:c2:7d:b1",
            "net1": "0e:c1:42:4a:a2:4c",
            "net10": "1a:d8:9f:30:72:06",
            "net11": "9a:80:71:ac:28:02",
            "net12": "82:a6:28:6a:d1:da",
            "net13": "82:3c:6d:4e:b2:6d",
            "net14": "9e:ae:1e:68:54:f7",
            "net15": "e2:a0:a6:32:3b:83",
            "net16": "ee:0d:59:e6:05:7b",
            "net17": "66:e3:9f:c4:a6:99",
            "net18": "d2:90:f5:2e:78:d4",
            "net19": "7a:41:f6:12:dd:76",
            "net2": "ba:6d:3c:36:53:fe",
            "net3": "ae:9b:6c:eb:91:bd",
            "net4": "1a:ae:55:ad:c0:c4",
            "net5": "26:e7:f4:9a:bd:2a",
            "net6": "d6:34:ce:1f:31:10",
            "net7": "66:b5:da:29:08:67",
            "net8": "0a:ec:84:d3:c3:1c",
            "net9": "32:12:c5:fa:6d:32"
        },
        "spine_3_1_8": {
            "net0": "2a:cc:5b:f4:15:fa",
            "net1": "36:ff:59:a4:2d:b7",
            "net10": "ea:46:ca:e9:52:0f",
            "net11": "2a:6a:5a:ae:76:4c",
            "net12": "16:49:8c:70:bf:d5",
            "net13": "0e:47:c3:fa:c0:6f",
            "net14": "82:73:6a:c1:5b:cc",
            "net15": "4e:fb:a7:ce:2c:53",
            "net16": "da:38:67:94:51:98",
            "net17": "fa:5e:81:ad:97:25",
            "net18": "c2:c3:d3:24:4b:61",
            "net19": "a6:90:64:4b:3b:b9",
            "net2": "0e:49:ec:71:83:ba",
            "net3": "46:70:78:b4:20:39",
            "net4": "6e:5a:50:cc:95:40",
            "net5": "72:e5:75:6c:be:b7",
            "net6": "86:ab:d5:93:30:a4",
            "net7": "b6:0c:8c:3b:3b:ff",
            "net8": "96:e1:09:40:d3:0b",
            "net9": "d2:c2:a2:30:70:53"
        },
        "spine_3_1_9": {
            "net0": "a2:90:b3:f6:d7:a2",
            "net1": "12:49:58:7f:48:b6",
            "net10": "aa:39:d7:29:dd:49",
            "net11": "f2:8a:99:ac:8c:c3",
            "net12": "5e:f9:2e:0e:1e:d9",
            "net13": "f6:a4:68:9a:ae:eb",
            "net14": "3e:14:de:91:e0:5c",
            "net15": "76:6f:55:e1:ea:77",
            "net16": "32:e0:ca:53:fb:e0",
            "net17": "92:17:ac:eb:85:ec",
            "net18": "62:db:61:fd:c6:1c",
            "net19": "f2:3a:16:ea:79:1b",
            "net2": "da:38:f6:5e:c4:b8",
            "net3": "4e:fa:d8:8b:9a:ae",
            "net4": "ae:c6:55:00:bf:60",
            "net5": "36:87:83:0f:0b:7d",
            "net6": "e2:54:70:b1:80:6b",
            "net7": "ba:7a:5f:06:29:5f",
            "net8": "72:c5:93:07:2f:50",
            "net9": "12:dc:2d:19:04:44"
        },
        "spine_4_1_1": {
            "net0": "0a:74:95:7d:ee:33",
            "net1": "1a:1d:e7:0c:15:a7",
            "net10": "36:b6:7f:4f:f0:41",
            "net11": "fa:02:25:32:b2:1b",
            "net12": "a2:6d:ea:0e:46:7e",
            "net13": "aa:b0:85:88:e9:19",
            "net14": "0e:43:c5:7f:d6:88",
            "net15": "3e:a0:45:21:25:95",
            "net16": "ee:68:5f:b1:58:9d",
            "net17": "62:fd:dc:35:35:39",
            "net18": "6e:2e:73:e0:87:21",
            "net19": "96:93:c8:1c:32:ec",
            "net2": "6a:39:6a:24:6d:b3",
            "net3": "ba:6b:c7:23:a3:5e",
            "net4": "7e:8a:d9:ad:50:f0",
            "net5": "5e:1d:1c:1b:1e:f8",
            "net6": "36:14:fb:7b:fe:89",
            "net7": "6e:31:8b:ba:32:4a",
            "net8": "da:5d:d9:61:83:f7",
            "net9": "b6:4b:04:20:90:16"
        },
        "spine_4_1_10": {
            "net0": "92:19:81:dd:d6:14",
            "net1": "6e:ed:7a:12:31:9b",
            "net10": "7e:43:fd:fa:f7:50",
            "net11": "02:e0:15:53:af:a5",
            "net12": "16:d7:16:3b:46:08",
            "net13": "a6:c3:fa:5b:5f:40",
            "net14": "52:11:5c:b4:de:57",
            "net15": "ce:c9:d8:59:3c:11",
            "net16": "ae:6c:f3:64:2f:e9",
            "net17": "fe:83:4e:69:8b:20",
            "net18": "1a:e8:a0:87:ec:29",
            "net19": "6a:6b:a1:e7:07:d1",
            "net2": "e2:2d:26:17:02:48",
            "net3": "b2:83:08:12:33:7a",
            "net4": "4e:f8:a2:a3:36:5e",
            "net5": "0a:73:d0:87:aa:fb",
            "net6": "a6:7d:8b:94:00:3a",
            "net7": "ae:48:90:bc:c5:48",
            "net8": "0a:b4:66:4d:d3:49",
            "net9": "2a:66:93:2a:5e:62"
        },
        "spine_4_1_2": {
            "net0": "52:e7:3d:8f:ef:63",
            "net1": "16:3e:65:96:3a:f5",
            "net10": "22:cf:e6:39:f4:07",
            "net11": "c2:f5:87:f2:93:cc",
            "net12": "f6:f9:b0:1a:dd:ba",
            "net13": "b2:a3:9d:ae:eb:4a",
            "net14": "a6:ee:5e:04:f6:89",
            "net15": "9a:00:3d:a8:89:90",
            "net16": "8e:68:36:11:b8:4e",
            "net17": "42:a2:c9:a6:02:36",
            "net18": "6a:46:45:43:6a:29",
            "net19": "ca:ee:8a:bd:e5:83",
            "net2": "2a:86:55:36:8d:32",
            "net3": "02:94:41:e2:9c:5a",
            "net4": "e6:63:95:98:e9:b0",
            "net5": "b2:3c:4f:98:d6:e9",
            "net6": "1a:b5:dc:07:ea:39",
            "net7": "e2:68:bf:32:8e:f4",
            "net8": "ee:72:9c:84:21:39",
            "net9": "ee:be:25:dc:17:c7"
        },
        "spine_4_1_3": {
            "net0": "ee:d0:f7:08:9a:35",
            "net1": "aa:25:8a:2f:cc:7b",
            "net10": "86:1f:73:59:1a:ff",
            "net11": "ba:f7:45:61:9a:dd",
            "net12": "aa:cd:4d:b3:38:d4",
            "net13": "72:9b:fc:b7:0d:fc",
            "net14": "76:7d:5a:73:b0:02",
            "net15": "d6:c8:b4:28:5f:66",
            "net16": "62:1d:d6:b3:8d:ce",
            "net17": "d6:f8:f0:21:bb:b0",
            "net18": "62:d2:37:fc:1c:73",
            "net19": "62:4c:df:46:3e:14",
            "net2": "22:79:71:fa:21:79",
            "net3": "96:cc:09:48:4b:ee",
            "net4": "fa:88:5f:c4:a3:a3",
            "net5": "fe:7c:d1:2d:05:41",
            "net6": "d6:38:a3:36:d7:a5",
            "net7": "de:4e:dc:4d:fa:e7",
            "net8": "9a:76:5a:3d:02:f2",
            "net9": "5e:f8:f1:c3:75:8c"
        },
        "spine_4_1_4": {
            "net0": "4e:73:bd:a8:52:a0",
            "net1": "aa:27:59:f3:1c:e7",
            "net10": "e2:27:07:2d:f2:72",
            "net11": "8e:61:2c:f8:a0:f2",
            "net12": "66:71:f3:e9:ad:cd",
            "net13": "02:76:4f:4b:65:1b",
            "net14": "16:d9:b6:15:95:99",
            "net15": "66:d5:35:aa:d6:b7",
            "net16": "32:b6:4b:61:09:47",
            "net17": "ea:02:51:cc:3e:65",
            "net18": "52:cb:fc:5c:08:51",
            "net19": "06:b5:8c:95:b6:e1",
            "net2": "12:89:41:fa:ee:0d",
            "net3": "5a:62:0a:57:50:9a",
            "net4": "b2:90:ea:61:dc:2a",
            "net5": "1e:e0:a8:1a:e5:00",
            "net6": "da:13:9d:bf:d7:9f",
            "net7": "8a:b8:f6:7b:bd:b0",
            "net8": "be:18:cc:82:51:f4",
            "net9": "06:c4:0f:4b:2e:38"
        },
        "spine_4_1_5": {
            "net0": "ea:cf:10:f5:c6:1f",
            "net1": "66:22:ea:0e:9c:75",
            "net10": "6e:a3:01:52:a5:01",
            "net11": "96:54:46:26:d0:1e",
            "net12": "16:c3:d1:3c:48:ba",
            "net13": "ea:37:3f:ec:03:1d",
            "net14": "e2:94:ea:1e:f0:82",
            "net15": "4e:8b:c1:a0:5c:e3",
            "net16": "56:e9:76:c2:a1:fb",
            "net17": "d2:48:0e:85:f4:1a",
            "net18": "c6:7a:95:5e:7a:66",
            "net19": "7e:ef:f1:0d:ac:57",
            "net2": "ea:2b:6c:12:a5:ee",
            "net3": "c6:c7:5d:5a:12:e5",
            "net4": "ea:8c:b4:4d:01:05",
            "net5": "76:fe:08:8d:bc:2f",
            "net6": "62:4d:c1:9b:9f:46",
            "net7": "0e:d2:b2:31:1c:34",
            "net8": "b2:84:38:c5:a9:e7",
            "net9": "be:a1:e2:f3:6d:8e"
        },
        "spine_4_1_6": {
            "net0": "12:b1:d9:47:5b:d9",
            "net1": "3a:48:1b:f9:5a:ab",
            "net10": "e6:7e:5d:c3:15:55",
            "net11": "42:c4:12:96:de:6b",
            "net12": "76:1a:1c:f5:b3:cc",
            "net13": "92:b6:92:17:7b:22",
            "net14": "52:7c:87:ac:02:ea",
            "net15": "76:da:33:84:d5:29",
            "net16": "0a:d7:96:bc:a2:a7",
            "net17": "ee:30:62:06:a5:d4",
            "net18": "2a:c4:13:95:29:e3",
            "net19": "0a:30:51:22:52:ba",
            "net2": "6a:04:fc:d1:84:8d",
            "net3": "5e:6a:d9:49:23:dc",
            "net4": "22:eb:06:0a:b5:7c",
            "net5": "ae:5f:cb:00:1b:d6",
            "net6": "56:24:66:53:06:96",
            "net7": "be:44:7f:9f:aa:2e",
            "net8": "e6:9f:10:d7:bb:c7",
            "net9": "76:c5:a4:8b:47:59"
        },
        "spine_4_1_7": {
            "net0": "3a:18:58:83:6d:ca",
            "net1": "86:67:57:92:13:d1",
            "net10": "5e:57:5d:19:57:fc",
            "net11": "26:66:7b:c2:a7:03",
            "net12": "ba:8e:b4:af:5f:6b",
            "net13": "62:14:dd:f1:f0:4a",
            "net14": "72:95:a3:e7:8d:5d",
            "net15": "0a:44:8c:e9:72:b1",
            "net16": "4e:75:40:cc:71:04",
            "net17": "ce:ad:de:b9:07:32",
            "net18": "1e:39:cf:4f:f3:4a",
            "net19": "a2:c6:90:ce:b0:2b",
            "net2": "56:16:30:d8:cd:8f",
            "net3": "2e:d9:fc:39:d5:40",
            "net4": "06:b6:67:e3:c4:12",
            "net5": "de:59:27:cd:80:8d",
            "net6": "6e:96:04:49:cc:0a",
            "net7": "7a:35:f7:7d:00:79",
            "net8": "42:9f:72:76:f1:7c",
            "net9": "d2:4d:9b:f1:f4:b2"
        },
        "spine_4_1_8": {
            "net0": "0e:ab:0c:a8:5b:44",
            "net1": "8a:96:11:bc:af:64",
            "net10": "6a:36:36:ea:8b:57",
            "net11": "ce:74:5f:bd:d6:7a",
            "net12": "8a:ba:4b:52:5f:09",
            "net13": "66:42:c6:bb:85:65",
            "net14": "52:b1:7d:17:52:c0",
            "net15": "52:de:86:5d:cd:2b",
            "net16": "a2:68:64:76:17:60",
            "net17": "5a:f7:93:d9:91:a8",
            "net18": "7e:c5:cf:27:a9:ba",
            "net19": "fa:b7:34:0f:38:56",
            "net2": "6e:87:02:2b:65:67",
            "net3": "06:8d:ab:08:e8:b2",
            "net4": "fa:8c:85:25:ea:a6",
            "net5": "7a:6f:1b:2f:79:89",
            "net6": "be:f1:6f:43:3d:e9",
            "net7": "16:76:54:8f:64:d5",
            "net8": "8e:d8:9a:51:1d:3c",
            "net9": "02:f2:22:c4:6f:e1"
        },
        "spine_4_1_9": {
            "net0": "3e:f8:e6:12:26:d2",
            "net1": "ca:39:7f:fa:31:eb",
            "net10": "fe:af:e7:a7:40:20",
            "net11": "2a:7c:60:64:61:3a",
            "net12": "06:23:3b:58:be:2b",
            "net13": "2a:7a:e5:82:22:6a",
            "net14": "02:e6:00:22:69:2c",
            "net15": "82:d2:16:76:98:4d",
            "net16": "02:54:e0:cc:94:db",
            "net17": "8e:37:7f:59:14:c5",
            "net18": "6e:2f:34:92:3f:c7",
            "net19": "f2:74:00:a0:40:f7",
            "net2": "2a:2f:1e:93:61:61",
            "net3": "c6:a7:6e:cc:07:e8",
            "net4": "12:2f:aa:2a:82:29",
            "net5": "d2:dc:69:7e:34:6f",
            "net6": "42:93:fe:17:f9:45",
            "net7": "66:0a:24:49:1b:35",
            "net8": "d2:4f:bc:ec:62:01",
            "net9": "96:b6:b4:ef:09:3a"
        },
        "tof_1_2_1": {
            "net0": "5a:f2:16:32:7f:6b",
            "net1": "6a:0f:61:be:58:3e",
            "net10": "b6:e8:c3:cb:28:f3",
            "net11": "76:3e:77:15:01:8b",
            "net12": "de:fe:b3:c0:58:f8",
            "net13": "6e:f0:82:4d:70:bb",
            "net14": "26:37:97:76:86:01",
            "net15": "8a:74:75:90:ac:c8",
            "net16": "66:86:be:2b:06:61",
            "net17": "52:db:70:55:ff:1c",
            "net18": "ee:25:87:15:7e:31",
            "net19": "16:c2:31:7e:c5:fa",
            "net2": "ee:26:fa:13:93:f3",
            "net3": "b6:26:b1:4a:30:a2",
            "net4": "26:12:91:13:b5:c6",
            "net5": "aa:fe:be:63:8f:1f",
            "net6": "ce:7f:76:2b:cb:bc",
            "net7": "1e:14:73:8c:54:7f",
            "net8": "da:2a:d2:98:89:8a",
            "net9": "86:3d:aa:30:33:83"
        },
        "tof_1_2_10": {
            "net0": "4a:be:28:9e:db:d7",
            "net1": "f6:c0:6e:3f:ca:14",
            "net10": "ea:75:fd:53:58:16",
            "net11": "ae:35:d3:37:52:fa",
            "net12": "ee:6c:fd:3f:df:4f",
            "net13": "be:16:78:00:64:2a",
            "net14": "06:41:ce:44:ec:98",
            "net15": "c6:66:e5:a1:9e:27",
            "net16": "ba:17:48:a9:ea:93",
            "net17": "22:a7:c7:a7:17:73",
            "net18": "7e:0a:17:6d:44:e2",
            "net19": "36:9e:b9:7a:67:84",
            "net2": "2a:bc:6c:57:53:12",
            "net3": "ae:b5:c5:58:d7:9f",
            "net4": "22:4e:5f:c4:dd:df",
            "net5": "36:bc:ed:8a:a5:14",
            "net6": "5e:d5:11:99:dd:ae",
            "net7": "22:d8:43:49:68:d7",
            "net8": "22:b8:8d:76:3e:c4",
            "net9": "e2:e3:e9:2a:e1:79"
        },
        "tof_1_2_2": {
            "net0": "7a:b8:ca:84:21:72",
            "net1": "26:f2:96:5d:25:5d",
            "net10": "5e:73:aa:00:7f:fa",
            "net11": "02:91:13:57:50:d6",
            "net12": "3e:b5:23:97:88:fc",
            "net13": "86:f4:e4:c7:b1:c7",
            "net14": "32:72:41:bf:e7:70",
            "net15": "16:4d:af:68:dd:f4",
            "net16": "2a:5f:36:45:43:ad",
            "net17": "c2:4b:a3:16:a3:e3",
            "net18": "8e:1b:c5:c5:b9:f0",
            "net19": "66:68:69:ef:d1:c7",
            "net2": "16:c1:34:37:cf:f1",
            "net3": "b6:f8:57:37:58:7d",
            "net4": "8e:3a:af:6c:85:d3",
            "net5": "2a:65:22:44:51:a5",
            "net6": "ae:41:41:58:4d:ca",
            "net7": "0a:1f:ce:a7:3a:17",
            "net8": "d2:c7:99:32:5d:f1",
            "net9": "42:d0:9b:4b:8f:b3"
        },
        "tof_1_2_3": {
            "net0": "66:63:d7:12:bb:2d",
            "net1": "be:ae:60:94:d0:1f",
            "net10": "06:dd:3b:87:45:c0",
            "net11": "a2:70:92:bb:ea:d1",
            "net12": "4a:50:d9:f2:cb:fc",
            "net13": "5a:3f:9e:c0:75:cc",
            "net14": "72:59:7b:bf:62:d8",
            "net15": "26:98:b0:a4:34:69",
            "net16": "e6:3d:72:04:39:8a",
            "net17": "b6:ac:10:34:33:65",
            "net18": "da:30:20:22:b7:3a",
            "net19": "e2:f1:dd:82:bd:67",
            "net2": "f2:e3:12:3c:62:a6",
            "net3": "0e:9f:95:e9:47:46",
            "net4": "4a:bd:ef:36:9c:f4",
            "net5": "92:1d:80:24:be:1c",
            "net6": "46:f6:25:9d:7b:5c",
            "net7": "a2:99:6d:c3:4c:4a",
            "net8": "86:94:c4:52:6f:3d",
            "net9": "72:a1:aa:d4:0f:98"
        },
        "tof_1_2_4": {
            "net0": "2e:4e:0c:6e:4d:f2",
            "net1": "f2:9b:f0:64:f9:b7",
            "net10": "ee:28:5e:92:ce:c3",
            "net11": "f6:15:fb:86:06:81",
            "net12": "fa:23:af:f6:47:2b",
            "net13": "fe:d1:01:17:03:64",
            "net14": "6e:ff:1a:41:2c:46",
            "net15": "ce:c1:81:aa:dd:ba",
            "net16": "c2:cb:ce:b6:70:e5",
            "net17": "56:d7:24:b9:e3:92",
            "net18": "62:7f:ba:32:dc:0b",
            "net19": "ba:0d:16:51:6b:81",
            "net2": "56:3d:fc:1e:2b:51",
            "net3": "02:05:6e:0e:b7:77",
            "net4": "a6:78:bf:1b:53:55",
            "net5": "e6:d8:e2:5f:91:20",
            "net6": "5a:dc:2e:a4:56:cb",
            "net7": "2e:30:69:86:b3:89",
            "net8": "2a:fa:6a:d3:36:b0",
            "net9": "fe:df:1e:25:86:24"
        },
        "tof_1_2_5": {
            "net0": "72:6d:b2:d4:fa:4d",
            "net1": "6a:bf:55:8d:0e:53",
            "net10": "e6:cb:4b:ab:49:1b",
            "net11": "f6:34:c8:ce:6f:61",
            "net12": "82:c7:c6:34:a1:ee",
            "net13": "7a:c7:4e:30:61:bd",
            "net14": "7e:f8:d3:f0:ce:eb",
            "net15": "ae:57:3f:c9:31:06",
            "net16": "4a:16:33:4d:75:93",
            "net17": "a2:59:29:e3:d3:0f",
            "net18": "9e:de:de:59:16:4a",
            "net19": "fa:5a:90:04:1e:e8",
            "net2": "8e:57:5c:a6:41:82",
            "net3": "0a:bf:21:ea:31:d8",
            "net4": "16:9b:60:8b:31:6c",
            "net5": "ba:9b:79:7b:f7:db",
            "net6": "6a:c2:e6:1f:3a:9c",
            "net7": "62:e6:38:57:3c:ad",
            "net8": "be:c8:ec:30:c1:b5",
            "net9": "fa:70:df:d7:ce:4e"
        },
        "tof_1_2_6": {
            "net0": "4a:da:89:5d:88:80",
            "net1": "7e:52:30:ba:32:3d",
            "net10": "b6:61:7a:b0:6e:c8",
            "net11": "aa:3d:91:2a:45:37",
            "net12": "be:ac:1d:7d:41:f4",
            "net13": "32:6b:a2:a3:c5:34",
            "net14": "82:3b:98:38:9a:a8",
            "net15": "a6:20:f3:37:66:23",
            "net16": "62:37:aa:66:34:73",
            "net17": "aa:90:84:75:4c:5b",
            "net18": "ce:c5:52:0d:a2:cd",
            "net19": "82:b0:f7:cf:15:33",
            "net2": "b6:e8:df:f9:1b:e7",
            "net3": "06:bf:d5:8b:4a:02",
            "net4": "f6:57:3d:17:71:59",
            "net5": "46:c9:2a:4d:b1:cb",
            "net6": "be:6e:61:e3:b7:5d",
            "net7": "ca:55:9f:13:05:af",
            "net8": "da:20:4a:3b:78:64",
            "net9": "82:10:b1:46:43:5d"
        },
        "tof_1_2_7": {
            "net0": "ee:22:da:38:76:ec",
            "net1": "96:24:3c:0d:12:71",
            "net10": "f2:ce:68:5f:22:f7",
            "net11": "5e:1f:cf:3d:3f:ae",
            "net12": "52:ba:b4:eb:b0:f2",
            "net13": "de:8c:34:28:62:38",
            "net14": "f6:a4:ac:3b:aa:a8",
            "net15": "a6:60:c0:78:95:f5",
            "net16": "7e:36:3e:aa:ee:8d",
            "net17": "22:be:03:ea:da:db",
            "net18": "3a:04:c6:a3:6a:7b",
            "net19": "ca:21:58:3b:37:20",
            "net2": "26:4b:dd:fb:c2:61",
            "net3": "3a:ef:4c:f7:92:11",
            "net4": "86:a6:1d:c3:50:f2",
            "net5": "66:df:49:df:52:51",
            "net6": "72:c5:9f:12:ac:fe",
            "net7": "7e:13:8c:35:65:93",
            "net8": "32:1a:59:b4:a1:31",
            "net9": "22:ca:8c:83:b8:22"
        },
        "tof_1_2_8": {
            "net0": "ee:db:23:fc:fb:1c",
            "net1": "c2:5a:2b:82:74:7d",
            "net10": "b2:18:bd:8b:25:60",
            "net11": "7e:fc:a1:ed:b7:8a",
            "net12": "ce:ba:96:72:6a:46",
            "net13": "86:4d:04:e0:1c:6d",
            "net14": "52:f1:a3:8f:a7:c1",
            "net15": "a2:3a:a3:05:09:d1",
            "net16": "aa:0b:8e:47:09:87",
            "net17": "e2:97:33:dc:a2:70",
            "net18": "b6:22:d7:b2:f7:9a",
            "net19": "72:82:c8:18:58:dc",
            "net2": "52:df:fd:9e:28:2d",
            "net3": "9a:93:f7:23:63:b7",
            "net4": "1e:f0:01:ba:24:fb",
            "net5": "ee:7f:e2:3a:f9:82",
            "net6": "e2:b0:10:1c:c7:e9",
            "net7": "2e:cf:33:e9:1f:4d",
            "net8": "ee:61:09:ec:02:42",
            "net9": "7e:e3:b8:48:ce:74"
        },
        "tof_1_2_9": {
            "net0": "7a:a5:ce:2f:6d:78",
            "net1": "e2:37:71:e5:23:1c",
            "net10": "0e:64:5d:aa:02:53",
            "net11": "8e:72:d8:fd:c6:de",
            "net12": "9e:b0:df:0f:54:5e",
            "net13": "96:61:9e:e2:60:d5",
            "net14": "8e:63:90:bb:29:93",
            "net15": "6a:32:7e:f5:ba:0b",
            "net16": "b2:0a:cf:74:6f:53",
            "net17": "16:24:2f:a8:d2:6c",
            "net18": "32:45:55:8f:f2:fe",
            "net19": "22:1e:4d:53:b6:14",
            "net2": "42:16:bd:4c:3e:42",
            "net3": "fe:cb:80:47:f2:a2",
            "net4": "f2:31:46:b6:6f:a8",
            "net5": "b2:bf:73:31:e6:33",
            "net6": "7e:ae:1d:df:e7:7c",
            "net7": "9a:ea:c6:44:58:67",
            "net8": "2a:29:41:53:07:d0",
            "net9": "12:cc:40:25:8d:92"
        },
        "tof_2_2_1": {
            "net0": "76:4c:de:38:18:df",
            "net1": "26:12:4e:26:32:6d",
            "net10": "1e:92:ae:8f:5d:24",
            "net11": "26:a7:0c:cd:fe:65",
            "net12": "92:c4:d1:23:c3:ec",
            "net13": "a2:a0:c9:a8:57:19",
            "net14": "8e:57:39:8a:bb:b7",
            "net15": "1a:98:05:63:ce:04",
            "net16": "be:18:aa:32:d0:2a",
            "net17": "be:65:6c:41:53:81",
            "net18": "0a:bb:2f:64:49:7a",
            "net19": "b6:3c:6b:f5:c6:4c",
            "net2": "3a:5f:ff:df:69:0c",
            "net3": "ca:e9:e3:5c:b4:3a",
            "net4": "4a:c2:75:91:92:dd",
            "net5": "52:b7:3e:87:ff:ac",
            "net6": "66:46:08:cd:8f:e3",
            "net7": "12:e0:65:9b:08:b3",
            "net8": "a6:c8:7f:0c:85:28",
            "net9": "0e:f7:ba:cc:70:29"
        },
        "tof_2_2_10": {
            "net0": "06:29:b5:f2:e6:2c",
            "net1": "96:be:76:d8:54:00",
            "net10": "fe:15:96:e8:e2:c6",
            "net11": "96:5a:e6:60:ce:4d",
            "net12": "9a:38:26:e7:c2:2a",
            "net13": "66:65:23:24:1f:35",
            "net14": "52:1c:80:28:bf:9d",
            "net15": "8e:a2:6b:ce:22:6b",
            "net16": "72:a3:e9:e7:3d:70",
            "net17": "9a:c5:99:0f:1f:cb",
            "net18": "f6:2f:d2:16:3f:b2",
            "net19": "ce:2f:e2:9a:ec:40",
            "net2": "56:5f:56:99:5e:c4",
            "net3": "d2:9b:cf:8f:42:62",
            "net4": "aa:fe:ab:d1:42:7f",
            "net5": "92:f3:88:fd:24:21",
            "net6": "76:7b:c0:fb:cb:62",
            "net7": "7e:8c:3c:44:9a:fd",
            "net8": "e2:c3:7f:05:f9:1f",
            "net9": "56:4b:ee:91:1c:96"
        },
        "tof_2_2_2": {
            "net0": "66:48:30:dc:b1:ea",
            "net1": "96:a2:af:8f:bd:b1",
            "net10": "62:14:27:c0:80:8d",
            "net11": "9a:64:2e:c4:99:82",
            "net12": "46:cf:bb:62:88:12",
            "net13": "ae:ce:bf:d6:53:96",
            "net14": "42:1f:7f:8c:3d:46",
            "net15": "e6:b0:9b:ec:4b:0c",
            "net16": "0e:4b:39:93:14:42",
            "net17": "c2:c8:90:96:fd:ad",
            "net18": "a6:d4:88:ab:ed:05",
            "net19": "7a:15:83:7f:70:94",
            "net2": "62:21:39:c9:6c:6d",
            "net3": "6a:26:b1:15:98:c7",
            "net4": "ce:c3:a1:d9:bc:8b",
            "net5": "46:d9:0b:30:92:59",
            "net6": "3a:95:7a:2b:94:7b",
            "net7": "2e:f7:27:7f:44:04",
            "net8": "c2:44:67:67:5a:a2",
            "net9": "52:12:95:33:f0:c1"
        },
        "tof_2_2_3": {
            "net0": "8e:86:b1:c8:cf:c3",
            "net1": "2e:27:d8:41:07:33",
            "net10": "4a:dc:78:56:c6:6c",
            "net11": "2a:29:74:09:8f:4b",
            "net12": "de:a0:b1:7e:bf:00",
            "net13": "46:b8:49:35:8c:05",
            "net14": "22:5c:57:89:a3:94",
            "net15": "5e:b7:e6:25:fc:82",
            "net16": "6a:94:01:6d:85:db",
            "net17": "9a:7e:a6:92:07:84",
            "net18": "82:ae:48:62:9d:ad",
            "net19": "ba:db:f6:e7:dd:de",
            "net2": "fe:9f:b6:c6:c4:2c",
            "net3": "c2:35:35:c7:14:1f",
            "net4": "f6:a2:a3:a1:92:5a",
            "net5": "9a:20:fc:2e:23:dd",
            "net6": "be:97:e8:e9:26:db",
            "net7": "ba:ae:da:9a:36:b3",
            "net8": "52:23:9d:0d:d8:a0",
            "net9": "22:44:5a:45:a0:22"
        },
        "tof_2_2_4": {
            "net0": "72:4a:db:d2:42:82",
            "net1": "5e:cb:a2:6e:8f:99",
            "net10": "0e:8e:db:b7:88:bc",
            "net11": "1e:2d:cb:7c:5b:88",
            "net12": "b6:ef:e9:48:75:27",
            "net13": "7e:d4:64:4d:ce:57",
            "net14": "c6:9b:f1:62:40:29",
            "net15": "ea:5c:36:27:d8:14",
            "net16": "62:3e:f1:b4:bd:e6",
            "net17": "3e:54:a5:16:71:26",
            "net18": "a2:e3:fc:73:50:f9",
            "net19": "02:b9:5a:9e:92:9e",
            "net2": "b2:ec:c8:a8:63:bc",
            "net3": "ea:e3:6b:4a:92:98",
            "net4": "f2:a2:fe:3a:10:86",
            "net5": "1e:e4:67:b0:41:ea",
            "net6": "62:35:92:3c:a7:2f",
            "net7": "d6:2b:b1:9e:0f:ed",
            "net8": "52:d7:6b:e3:d9:9a",
            "net9": "76:45:88:02:d2:b8"
        },
        "tof_2_2_5": {
            "net0": "6a:ad:e3:04:23:08",
            "net1": "92:77:37:ac:76:83",
            "net10": "26:de:af:01:be:e8",
            "net11": "9e:3a:ee:7e:7c:94",
            "net12": "1e:6f:f1:e8:cd:cb",
            "net13": "76:bc:2b:1e:c3:6f",
            "net14": "32:47:f8:e3:72:b1",
            "net15": "72:c0:d7:95:09:a4",
            "net16": "6e:df:8d:7b:f3:6d",
            "net17": "da:50:33:b5:aa:e3",
            "net18": "72:af:99:d3:8c:5d",
            "net19": "2e:0d:48:30:1f:c1",
            "net2": "0e:2b:0e:5b:0e:eb",
            "net3": "86:6e:9e:cc:f5:a0",
            "net4": "6e:43:66:45:77:3a",
            "net5": "c2:6e:4e:5b:38:c7",
            "net6": "26:7d:bf:35:66:4e",
            "net7": "c6:e4:e1:c8:46:8f",
            "net8": "a2:48:5f:c9:56:74",
            "net9": "7a:30:e0:44:b5:53"
        },
        "tof_2_2_6": {
            "net0": "12:3c:11:92:7f:4e",
            "net1": "ca:25:12:fb:f7:55",
            "net10": "62:4a:41:cd:9b:33",
            "net11": "aa:3b:18:50:ee:63",
            "net12": "06:e1:b4:4a:1f:6e",
            "net13": "ca:c9:b9:62:b2:77",
            "net14": "2a:bf:1d:e5:b9:e1",
            "net15": "ae:dd:0f:da:70:c1",
            "net16": "be:a4:a4:0b:50:e2",
            "net17": "3e:fa:f6:92:34:c8",
            "net18": "32:bb:3d:22:d5:6d",
            "net19": "f6:fc:1d:8f:15:17",
            "net2": "6e:99:9c:d8:40:b1",
            "net3": "2e:fb:65:12:33:51",
            "net4": "fa:98:06:b2:3d:14",
            "net5": "92:f2:0b:20:4a:77",
            "net6": "be:18:af:ff:22:f6",
            "net7": "ee:84:d9:fb:5e:c8",
            "net8": "a6:96:7f:17:10:e6",
            "net9": "86:af:88:56:55:65"
        },
        "tof_2_2_7": {
            "net0": "da:6b:fb:77:5e:bf",
            "net1": "da:bc:28:c7:77:f2",
            "net10": "92:f2:dd:00:05:3c",
            "net11": "d2:f9:6f:64:b7:2f",
            "net12": "f6:af:ea:01:eb:51",
            "net13": "62:41:45:64:a8:b1",
            "net14": "72:8b:61:63:ba:9f",
            "net15": "0e:b2:6a:29:87:de",
            "net16": "02:8f:c5:58:e3:90",
            "net17": "b2:af:3d:78:51:77",
            "net18": "26:1d:49:51:90:3f",
            "net19": "46:71:4e:0e:27:33",
            "net2": "e6:28:54:ee:c5:88",
            "net3": "02:fd:ff:ee:8e:02",
            "net4": "66:cd:b4:9f:4d:4b",
            "net5": "9a:ed:ed:0b:c4:60",
            "net6": "56:86:cc:cb:35:8c",
            "net7": "c2:18:72:07:7b:f9",
            "net8": "56:ff:31:a9:ba:b2",
            "net9": "ee:63:13:9c:3c:8b"
        },
        "tof_2_2_8": {
            "net0": "fe:7e:60:ee:a5:1a",
            "net1": "76:4a:68:11:c3:b6",
            "net10": "3a:4c:97:b1:f8:e8",
            "net11": "de:c4:32:b8:d7:a3",
            "net12": "3e:40:31:58:b4:f9",
            "net13": "46:7d:4d:1e:29:32",
            "net14": "7e:f3:45:70:1f:19",
            "net15": "e6:36:97:dd:64:d9",
            "net16": "fe:01:ea:66:03:74",
            "net17": "22:8e:f0:50:82:ea",
            "net18": "72:c9:90:76:c0:5d",
            "net19": "8e:c6:24:09:fa:f6",
            "net2": "e6:41:07:8f:1e:6e",
            "net3": "1e:e4:9c:cc:09:1d",
            "net4": "1e:62:e0:b0:95:90",
            "net5": "3e:94:06:79:c2:ee",
            "net6": "8a:0d:eb:b3:34:41",
            "net7": "5e:b5:44:81:f8:b6",
            "net8": "1a:37:23:a7:3c:44",
            "net9": "12:2e:1d:e5:bc:42"
        },
        "tof_2_2_9": {
            "net0": "12:16:87:53:a2:3e",
            "net1": "ca:cb:a8:31:b5:17",
            "net10": "1e:93:f3:31:47:a5",
            "net11": "ee:0b:da:49:a9:7c",
            "net12": "4a:fd:c6:d3:88:f2",
            "net13": "e6:4d:78:01:83:91",
            "net14": "7e:00:18:9b:d8:b0",
            "net15": "f2:5e:31:36:d6:fe",
            "net16": "ea:ec:80:84:1b:31",
            "net17": "be:ef:98:78:c5:f4",
            "net18": "be:27:70:28:60:88",
            "net19": "fa:cf:0c:37:2e:20",
            "net2": "32:ec:33:c8:c9:fa",
            "net3": "6e:2e:31:bb:4b:06",
            "net4": "ea:45:16:9a:82:89",
            "net5": "ba:1c:26:65:a7:7e",
            "net6": "86:b4:ee:be:d8:09",
            "net7": "c6:41:38:e3:92:73",
            "net8": "9a:6a:cc:b3:9a:52",
            "net9": "86:9f:2a:71:8d:e2"
        }
    },
    "failed_machine": "leaf_1_0_1",
    "failure_time": {
        "leaf_1_0_1": 1622489855.4757316,
        "leaf_1_0_10": 1622489855.4888794,
        "leaf_1_0_2": 1622489855.4986022,
        "leaf_1_0_3": 1622489855.5054145,
        "leaf_1_0_4": 1622489855.5076003,
        "leaf_1_0_5": 1622489855.517224,
        "leaf_1_0_6": 1622489855.5288706,
        "leaf_1_0_7": 1622489855.5366309,
        "leaf_1_0_8": 1622489855.5438733,
        "leaf_1_0_9": 1622489855.5549583,
        "leaf_2_0_1": 1622489855.56198,
        "leaf_2_0_10": 1622489855.5733082,
        "leaf_2_0_2": 1622489855.5825143,
        "leaf_2_0_3": 1622489855.474902,
        "leaf_2_0_4": 1622489855.4906187,
        "leaf_2_0_5": 1622489855.4997594,
        "leaf_2_0_6": 1622489855.5064914,
        "leaf_2_0_7": 1622489855.511521,
        "leaf_2_0_8": 1622489855.5203042,
        "leaf_2_0_9": 1622489855.524713,
        "leaf_3_0_1": 1622489855.5347433,
        "leaf_3_0_10": 1622489855.5454285,
        "leaf_3_0_2": 1622489855.5564802,
        "leaf_3_0_3": 1622489855.566845,
        "leaf_3_0_4": 1622489855.5803459,
        "leaf_3_0_5": 1622489855.586725,
        "leaf_3_0_6": 1622489855.5925658,
        "leaf_3_0_7": 1622489855.5983915,
        "leaf_3_0_8": 1622489855.6054063,
        "leaf_3_0_9": 1622489855.6124022,
        "leaf_4_0_1": 1622489855.6192288,
        "leaf_4_0_10": 1622489855.6285596,
        "leaf_4_0_2": 1622489855.638063,
        "leaf_4_0_3": 1622489855.6440344,
        "leaf_4_0_4": 1622489855.6509333,
        "leaf_4_0_5": 1622489855.6599884,
        "leaf_4_0_6": 1622489855.6696682,
        "leaf_4_0_7": 1622489855.6792006,
        "leaf_4_0_8": 1622489855.6861098,
        "leaf_4_0_9": 1622489855.5964174,
        "spine_1_1_1": 1622489855.6003666,
        "spine_1_1_10": 1622489855.6102593,
        "spine_1_1_2": 1622489855.616015,
        "spine_1_1_3": 1622489855.6209686,
        "spine_1_1_4": 1622489855.6298952,
        "spine_1_1_5": 1622489855.640367,
        "spine_1_1_6": 1622489855.6515663,
        "spine_1_1_7": 1622489855.662658,
        "spine_1_1_8": 1622489855.6779056,
        "spine_1_1_9": 1622489855.6846278,
        "spine_2_1_1": 1622489855.6973388,
        "spine_2_1_10": 1622489855.7050247,
        "spine_2_1_2": 1622489855.6953087,
        "spine_2_1_3": 1622489855.7030516,
        "spine_2_1_4": 1622489855.7151933,
        "spine_2_1_5": 1622489855.7260716,
        "spine_2_1_6": 1622489855.7370553,
        "spine_2_1_7": 1622489855.7405264,
        "spine_2_1_8": 1622489855.7480798,
        "spine_2_1_9": 1622489855.7554862,
        "spine_3_1_1": 1622489855.7656252,
        "spine_3_1_10": 1622489855.7791972,
        "spine_3_1_2": 1622489855.787885,
        "spine_3_1_3": 1622489855.794526,
        "spine_3_1_4": 1622489855.8023105,
        "spine_3_1_5": 1622489855.7180066,
        "spine_3_1_6": 1622489855.72831,
        "spine_3_1_7": 1622489855.739643,
        "spine_3_1_8": 1622489855.7504,
        "spine_3_1_9": 1622489855.7575529,
        "spine_4_1_1": 1622489855.7680209,
        "spine_4_1_10": 1622489855.7774773,
        "spine_4_1_2": 1622489855.7837439,
        "spine_4_1_3": 1622489855.7927103,
        "spine_4_1_4": 1622489855.801078,
        "spine_4_1_5": 1622489855.8094535,
        "spine_4_1_6": 1622489855.8176153,
        "spine_4_1_7": 1622489855.8318846,
        "spine_4_1_8": 1622489855.811654,
        "spine_4_1_9": 1622489855.8190367,
        "tof_1_2_1": 1622489855.832741,
        "tof_1_2_10": 1622489855.8376617,
        "tof_1_2_2": 1622489855.8508832,
        "tof_1_2_3": 1622489855.8621268,
        "tof_1_2_4": 1622489855.877254,
        "tof_1_2_5": 1622489855.8816245,
        "tof_1_2_6": 1622489855.8930676,
        "tof_1_2_7": 1622489855.9013128,
        "tof_1_2_8": 1622489855.906595,
        "tof_1_2_9": 1622489855.911576,
        "tof_2_2_1": 1622489855.9170444,
        "tof_2_2_10": 1622489855.8417983,
        "tof_2_2_2": 1622489855.851019,
        "tof_2_2_3": 1622489855.8586721,
        "tof_2_2_4": 1622489855.862193,
        "tof_2_2_5": 1622489855.8809197,
        "tof_2_2_6": 1622489855.889416,
        "tof_2_2_7": 1622489855.8952448,
        "tof_2_2_8": 1622489855.905158,
        "tof_2_2_9": 1622489855.9121432
    }
}