{
    "description": "Scenario 6a: net0 link failure and recovery of leaf_1_0_1 with BGP",
    "k_leaf": 6,
    "k_top": 6,
    "redundancy_factor": 3,
    "is_k8s": true,
    "machine_mac_addresses": {
        "leaf_1_0_1": {
            "net0": "0a:5a:ab:b1:cd:7b",
            "net1": "c2:66:2c:ed:d9:43",
            "net2": "ca:8a:3c:24:ae:5f",
            "net3": "5e:5e:92:9e:c3:2c",
            "net4": "22:47:ef:c9:80:8c",
            "net5": "52:65:3b:eb:1c:81",
            "net6": "fe:6b:9c:65:3e:bf"
        },
        "leaf_1_0_2": {
            "net0": "9a:48:1c:0f:b8:ec",
            "net1": "9e:3f:c3:9f:4d:26",
            "net2": "ca:c0:f2:11:8c:18",
            "net3": "fe:8e:8a:a3:3d:70",
            "net4": "b6:12:9a:2f:a5:76",
            "net5": "ba:da:aa:87:54:56",
            "net6": "be:a7:49:8e:bc:9b"
        },
        "leaf_1_0_3": {
            "net0": "b6:00:5c:a8:80:1b",
            "net1": "fe:21:c4:55:71:a7",
            "net2": "ce:5e:f2:04:5a:14",
            "net3": "b6:7a:90:54:4f:f9",
            "net4": "b2:00:62:79:d0:fd",
            "net5": "da:67:cc:4a:36:22",
            "net6": "a6:6c:b9:22:40:86"
        },
        "leaf_1_0_4": {
            "net0": "36:07:3d:e9:ae:d9",
            "net1": "4e:7e:44:3f:be:99",
            "net2": "d6:06:82:76:7b:83",
            "net3": "66:8d:31:f0:2d:18",
            "net4": "ae:14:ad:1d:04:16",
            "net5": "92:0e:bc:32:04:41",
            "net6": "06:be:7b:75:e5:94"
        },
        "leaf_1_0_5": {
            "net0": "c6:c5:4e:23:48:8a",
            "net1": "3e:bd:11:96:60:f2",
            "net2": "be:df:ff:54:48:d1",
            "net3": "ba:2f:6f:07:19:16",
            "net4": "be:58:69:a7:1b:c4",
            "net5": "be:c5:57:9d:fb:83",
            "net6": "26:3c:d0:09:85:3d"
        },
        "leaf_1_0_6": {
            "net0": "36:95:6d:ea:43:1a",
            "net1": "fa:41:98:dc:1f:fa",
            "net2": "e2:89:9c:a1:42:a4",
            "net3": "46:39:88:e8:a8:42",
            "net4": "9e:44:81:c3:7a:50",
            "net5": "be:20:61:3a:25:24",
            "net6": "92:e9:6d:30:ca:3a"
        },
        "leaf_2_0_1": {
            "net0": "f6:07:f6:62:83:b7",
            "net1": "82:4d:6c:6d:9d:a4",
            "net2": "5e:f9:e0:c2:28:14",
            "net3": "b6:b8:48:30:87:92",
            "net4": "3e:c1:28:8d:5f:d9",
            "net5": "0e:4d:d8:9b:12:0d",
            "net6": "92:8a:f5:4a:56:4a"
        },
        "leaf_2_0_2": {
            "net0": "be:ca:49:95:f9:d3",
            "net1": "d2:3a:2d:f9:1b:86",
            "net2": "96:ee:14:bb:9c:e8",
            "net3": "32:d4:8b:c6:c1:74",
            "net4": "7e:d3:d4:22:16:38",
            "net5": "56:4c:bc:c2:2d:68",
            "net6": "da:a7:9a:43:03:d0"
        },
        "leaf_2_0_3": {
            "net0": "f2:29:88:2a:bb:9a",
            "net1": "2e:b4:8c:53:79:06",
            "net2": "56:c3:9d:42:1a:5b",
            "net3": "c6:60:02:39:ec:77",
            "net4": "12:1e:e9:46:23:10",
            "net5": "f2:10:bd:f0:89:74",
            "net6": "2e:f1:42:07:ec:e9"
        },
        "leaf_2_0_4": {
            "net0": "52:b5:02:37:96:ef",
            "net1": "3a:29:29:b1:bf:32",
            "net2": "5e:4f:10:23:06:5f",
            "net3": "3e:61:7c:74:31:7a",
            "net4": "0a:f8:1e:ff:d7:ee",
            "net5": "b2:95:42:be:ec:1a",
            "net6": "a6:f9:3f:07:47:30"
        },
        "leaf_2_0_5": {
            "net0": "2a:6b:ca:d1:3e:ed",
            "net1": "ba:8f:43:13:a5:8a",
            "net2": "be:d3:92:d8:fd:32",
            "net3": "06:a3:b4:0a:e6:a8",
            "net4": "be:d6:50:f5:68:05",
            "net5": "62:3e:36:0c:7e:fa",
            "net6": "92:ff:82:13:ef:c8"
        },
        "leaf_2_0_6": {
            "net0": "36:66:f5:57:9d:6b",
            "net1": "22:b5:ab:04:9e:5b",
            "net2": "4e:0c:0e:fc:6f:c4",
            "net3": "f6:98:46:fa:52:37",
            "net4": "ba:35:39:b2:9f:e7",
            "net5": "ce:b9:82:8d:d0:59",
            "net6": "9e:93:6c:66:8f:6e"
        },
        "leaf_3_0_1": {
            "net0": "02:1e:05:0f:13:08",
            "net1": "22:74:43:94:fe:3a",
            "net2": "ce:ca:dc:ee:9a:12",
            "net3": "fa:00:a3:b0:da:49",
            "net4": "46:26:17:23:1e:50",
            "net5": "92:8e:83:03:45:6d",
            "net6": "8a:a0:de:23:70:7a"
        },
        "leaf_3_0_2": {
            "net0": "9e:e3:f8:a1:0e:f4",
            "net1": "f2:d7:5e:56:a2:5d",
            "net2": "92:71:6c:b7:07:bd",
            "net3": "aa:85:3a:ce:05:cc",
            "net4": "fa:20:e3:d8:24:c9",
            "net5": "42:d4:ac:35:46:ea",
            "net6": "a2:32:3e:45:98:2a"
        },
        "leaf_3_0_3": {
            "net0": "32:a9:59:38:67:3b",
            "net1": "aa:aa:b9:62:54:89",
            "net2": "ee:cd:be:87:f3:41",
            "net3": "e6:b2:39:8b:42:72",
            "net4": "6e:3e:da:b7:41:49",
            "net5": "0a:5b:4f:45:25:95",
            "net6": "aa:22:01:b7:92:53"
        },
        "leaf_3_0_4": {
            "net0": "e2:33:1e:93:bc:68",
            "net1": "c2:5a:d7:01:53:71",
            "net2": "a6:7f:f0:5c:31:f8",
            "net3": "5a:72:2a:a3:74:09",
            "net4": "5e:6e:40:82:43:e9",
            "net5": "3e:ed:b5:da:1b:f9",
            "net6": "52:f0:06:7f:09:e3"
        },
        "leaf_3_0_5": {
            "net0": "02:b3:12:87:93:10",
            "net1": "96:cf:64:ec:1f:78",
            "net2": "4e:d3:ab:b9:00:2b",
            "net3": "7a:16:26:16:b9:77",
            "net4": "ee:56:82:7b:c3:ec",
            "net5": "8e:b6:93:09:0f:5f",
            "net6": "06:77:7b:02:50:5a"
        },
        "leaf_3_0_6": {
            "net0": "22:e8:b1:df:65:cf",
            "net1": "5e:f3:bf:a0:ea:fe",
            "net2": "4e:51:f0:7a:3b:db",
            "net3": "e6:44:1a:3e:80:00",
            "net4": "92:67:97:10:e5:d0",
            "net5": "9a:d8:39:86:21:3e",
            "net6": "2e:92:15:07:16:a4"
        },
        "leaf_4_0_1": {
            "net0": "46:e9:13:16:26:98",
            "net1": "0a:70:6c:08:0a:53",
            "net2": "86:59:9c:a4:c5:1b",
            "net3": "02:f8:2b:2d:44:cc",
            "net4": "26:f0:34:75:2b:f2",
            "net5": "ea:19:ff:ad:72:36",
            "net6": "ee:24:4c:38:63:8e"
        },
        "leaf_4_0_2": {
            "net0": "7a:0b:30:29:75:18",
            "net1": "4a:8b:5c:b6:e2:1e",
            "net2": "d6:14:52:50:9c:d8",
            "net3": "22:28:41:6d:2a:33",
            "net4": "86:55:69:21:09:c3",
            "net5": "8e:d1:b2:fe:5b:94",
            "net6": "ae:d8:3b:bd:71:4f"
        },
        "leaf_4_0_3": {
            "net0": "4e:af:7d:63:30:d3",
            "net1": "7a:1c:91:d7:79:16",
            "net2": "12:54:cf:a7:f4:99",
            "net3": "d6:46:a4:08:c6:8e",
            "net4": "72:7e:c8:d5:70:bc",
            "net5": "7e:b6:bc:7c:97:e2",
            "net6": "de:21:ac:26:ce:70"
        },
        "leaf_4_0_4": {
            "net0": "3a:34:28:29:80:f3",
            "net1": "e6:b7:6e:ef:57:b0",
            "net2": "12:1f:da:c7:bd:43",
            "net3": "ea:07:31:bc:21:3d",
            "net4": "8a:2e:d9:f8:34:3c",
            "net5": "f6:9d:1a:f1:77:a3",
            "net6": "0a:64:55:43:69:13"
        },
        "leaf_4_0_5": {
            "net0": "d2:7e:89:6b:b0:4f",
            "net1": "06:a3:c6:47:32:f3",
            "net2": "12:b6:f5:ef:28:c3",
            "net3": "de:6a:24:9f:8f:a9",
            "net4": "92:8f:31:c8:85:97",
            "net5": "4a:6e:d2:ef:94:c5",
            "net6": "3a:a8:80:d4:d8:af"
        },
        "leaf_4_0_6": {
            "net0": "6a:f6:d6:b6:af:7a",
            "net1": "6a:68:df:cf:08:4a",
            "net2": "42:7c:88:d5:8d:01",
            "net3": "3a:79:c0:4c:33:11",
            "net4": "8e:f4:4d:ad:4f:0d",
            "net5": "f6:bd:80:93:7b:a2",
            "net6": "2a:43:f3:fb:a0:c8"
        },
        "spine_1_1_1": {
            "net0": "42:01:07:47:0b:ce",
            "net1": "66:39:fb:d2:44:96",
            "net10": "9a:38:02:40:77:94",
            "net11": "5e:1f:fc:47:95:01",
            "net2": "26:94:ad:d8:5d:7d",
            "net3": "9a:df:67:8e:17:8b",
            "net4": "7e:a4:a4:43:0f:a1",
            "net5": "ee:fb:e0:59:c5:e1",
            "net6": "32:6b:5b:91:d6:c6",
            "net7": "f6:1d:3c:ce:e2:f1",
            "net8": "4e:b7:cf:76:77:48",
            "net9": "c6:a9:7f:69:4b:c6"
        },
        "spine_1_1_2": {
            "net0": "3a:ae:3f:76:04:d9",
            "net1": "76:80:fb:58:2f:22",
            "net10": "3a:bb:f3:1b:dd:01",
            "net11": "02:bb:27:1a:d0:ec",
            "net2": "aa:86:84:8a:b5:26",
            "net3": "4a:92:5e:b3:6d:b5",
            "net4": "76:33:a2:84:16:8f",
            "net5": "2a:1e:ac:78:38:5b",
            "net6": "86:ab:ce:86:66:dd",
            "net7": "96:bf:12:5e:3a:24",
            "net8": "82:c0:c9:1a:97:08",
            "net9": "d6:7f:1b:30:f5:17"
        },
        "spine_1_1_3": {
            "net0": "ea:87:5e:24:f7:e6",
            "net1": "da:13:63:e5:8e:8b",
            "net10": "de:54:1b:57:ab:bb",
            "net11": "6e:6d:4a:6f:bc:6b",
            "net2": "d6:3a:5a:ca:d4:5c",
            "net3": "a2:21:e7:69:83:54",
            "net4": "7a:38:6a:97:b8:07",
            "net5": "26:ef:cc:f7:27:ec",
            "net6": "6a:a2:33:e3:af:b6",
            "net7": "c2:53:0a:0a:bb:6f",
            "net8": "86:01:58:59:d3:8b",
            "net9": "96:c6:b3:98:e2:24"
        },
        "spine_1_1_4": {
            "net0": "8a:9c:17:d0:d9:3e",
            "net1": "f6:8a:11:7a:52:17",
            "net10": "1a:1b:c1:aa:ff:a0",
            "net11": "fe:06:32:06:c7:be",
            "net2": "26:39:3c:31:70:a0",
            "net3": "f6:0e:98:6a:cd:26",
            "net4": "ee:3d:43:d7:b6:85",
            "net5": "4e:0f:a2:7f:51:fb",
            "net6": "6e:42:85:a5:cc:b8",
            "net7": "32:c7:41:20:07:3d",
            "net8": "02:cd:c1:ac:54:f9",
            "net9": "02:42:a3:9e:f2:26"
        },
        "spine_1_1_5": {
            "net0": "5e:6a:fa:79:71:e9",
            "net1": "3e:2f:70:6f:81:e1",
            "net10": "d2:14:c4:32:22:58",
            "net11": "1e:c0:cb:99:4f:00",
            "net2": "aa:f6:ba:43:30:be",
            "net3": "f2:2d:ac:00:33:83",
            "net4": "f2:fd:37:05:c6:6a",
            "net5": "a2:32:b5:90:3b:9c",
            "net6": "b6:8b:0a:84:a3:4f",
            "net7": "be:3d:d1:4e:3b:90",
            "net8": "1a:ad:fe:78:9d:e1",
            "net9": "fa:db:92:ad:9e:e4"
        },
        "spine_1_1_6": {
            "net0": "e2:f6:d5:85:90:a9",
            "net1": "8a:8c:1f:1e:0f:12",
            "net10": "02:5a:07:69:97:a2",
            "net11": "6a:84:9c:9e:a8:be",
            "net2": "9e:37:69:b1:16:a1",
            "net3": "ea:e1:ee:1a:4f:4e",
            "net4": "32:3b:6d:c8:2b:9f",
            "net5": "aa:96:f7:0b:e5:34",
            "net6": "b6:bf:fb:e6:ee:92",
            "net7": "26:98:c9:2f:dc:fc",
            "net8": "3e:18:09:1c:54:d4",
            "net9": "02:2d:ea:d3:1b:24"
        },
        "spine_2_1_1": {
            "net0": "ca:6e:a9:0c:d3:82",
            "net1": "2e:89:3e:7b:37:6f",
            "net10": "2e:0d:05:35:86:ac",
            "net11": "be:8f:9c:81:50:ad",
            "net2": "76:c9:e4:d7:f6:08",
            "net3": "5a:3c:6c:4b:33:96",
            "net4": "12:87:0f:3a:1f:3e",
            "net5": "42:f5:e8:85:42:9e",
            "net6": "a2:b0:23:c3:62:52",
            "net7": "6e:94:f3:3c:2e:dc",
            "net8": "d6:26:9a:60:e5:32",
            "net9": "d2:85:67:04:ad:41"
        },
        "spine_2_1_2": {
            "net0": "4a:c9:57:d0:38:18",
            "net1": "2e:7e:82:90:c7:08",
            "net10": "3e:83:db:80:1f:4a",
            "net11": "8a:53:62:e3:ea:95",
            "net2": "aa:f6:03:4c:c8:1b",
            "net3": "7e:38:3d:8d:67:dd",
            "net4": "f6:0d:b1:e5:cb:ce",
            "net5": "52:51:2f:03:3f:22",
            "net6": "c2:5c:1a:41:8a:4f",
            "net7": "1e:70:f1:ea:28:76",
            "net8": "76:79:14:5a:71:eb",
            "net9": "36:4a:2c:fd:8e:bb"
        },
        "spine_2_1_3": {
            "net0": "ca:fd:18:00:ff:78",
            "net1": "96:88:1e:ff:cd:f4",
            "net10": "8e:d5:f6:d6:0b:ec",
            "net11": "6e:3c:5a:75:d8:86",
            "net2": "46:ac:14:79:54:66",
            "net3": "42:5e:ef:69:e6:79",
            "net4": "22:09:cf:83:af:cf",
            "net5": "26:26:39:c2:15:4a",
            "net6": "b6:b0:4a:14:47:b8",
            "net7": "96:5b:d4:05:e7:73",
            "net8": "ce:92:ba:d0:16:1a",
            "net9": "56:ea:d8:90:64:fd"
        },
        "spine_2_1_4": {
            "net0": "22:96:4d:26:1b:89",
            "net1": "a2:54:30:09:88:b3",
            "net10": "d6:67:cb:56:ad:24",
            "net11": "ae:87:4f:75:0a:8f",
            "net2": "de:a0:85:64:43:03",
            "net3": "5a:53:e1:8e:36:24",
            "net4": "56:49:89:3b:e5:46",
            "net5": "22:08:b0:ce:a2:b1",
            "net6": "e6:40:c9:b5:aa:40",
            "net7": "1a:10:0d:80:99:df",
            "net8": "02:72:46:6d:3b:3e",
            "net9": "26:d8:cc:c7:f0:99"
        },
        "spine_2_1_5": {
            "net0": "4a:6f:a2:5e:f7:8d",
            "net1": "5a:f1:fb:c4:cc:12",
            "net10": "aa:72:70:c7:6c:3b",
            "net11": "c2:a0:ad:bb:b5:db",
            "net2": "3e:dc:84:cf:54:48",
            "net3": "e6:5b:a1:79:97:df",
            "net4": "06:b2:dd:3e:cd:f7",
            "net5": "ea:95:e6:66:6a:a6",
            "net6": "0a:39:fe:94:9f:fb",
            "net7": "ee:05:5b:99:a9:a5",
            "net8": "6e:7f:a0:8d:ca:e5",
            "net9": "5e:88:19:a6:8e:a7"
        },
        "spine_2_1_6": {
            "net0": "4e:26:66:b3:26:5e",
            "net1": "1e:af:53:d9:33:ff",
            "net10": "96:bf:98:0d:50:26",
            "net11": "3e:bf:fb:b0:7a:4b",
            "net2": "7e:5e:28:b5:e5:2e",
            "net3": "6a:29:f9:e9:cf:1a",
            "net4": "a2:22:a6:bd:1d:f9",
            "net5": "a2:1a:ec:df:4d:9e",
            "net6": "a2:4a:25:58:91:5d",
            "net7": "2e:22:47:71:72:cb",
            "net8": "f6:b8:1b:68:6d:4c",
            "net9": "6e:c1:06:8f:41:5b"
        },
        "spine_3_1_1": {
            "net0": "8e:49:0b:38:e0:e0",
            "net1": "a6:0b:a9:24:b7:32",
            "net10": "16:17:c0:4c:02:15",
            "net11": "02:2d:f5:5f:4d:2b",
            "net2": "0e:2f:f7:9a:4a:3e",
            "net3": "ba:03:88:2a:40:1b",
            "net4": "0e:fe:72:92:f5:12",
            "net5": "aa:3d:65:ed:fc:b2",
            "net6": "76:99:27:ca:66:e6",
            "net7": "12:48:f5:5b:ae:c4",
            "net8": "da:18:1f:3b:45:6f",
            "net9": "e6:84:b3:ec:29:f0"
        },
        "spine_3_1_2": {
            "net0": "fa:ab:84:f4:10:ca",
            "net1": "fe:ea:79:9c:b2:46",
            "net10": "d6:a1:37:eb:65:2e",
            "net11": "52:40:d9:14:40:ca",
            "net2": "8a:38:0d:2a:99:ba",
            "net3": "6a:9d:58:03:e3:24",
            "net4": "66:b7:5a:c6:0e:8d",
            "net5": "4e:c4:d6:61:da:86",
            "net6": "7a:1f:25:03:22:5d",
            "net7": "26:cb:5f:ed:4b:6c",
            "net8": "96:b6:0d:3d:a2:5e",
            "net9": "72:1a:4c:36:d2:d3"
        },
        "spine_3_1_3": {
            "net0": "86:52:f2:0d:d8:da",
            "net1": "e2:63:25:93:98:86",
            "net10": "ca:1b:8b:44:ca:c8",
            "net11": "4e:0d:70:9a:5a:14",
            "net2": "a6:16:09:e3:b5:37",
            "net3": "2e:96:94:4e:3f:61",
            "net4": "4e:18:b2:15:65:b6",
            "net5": "52:3a:eb:99:d1:12",
            "net6": "0e:46:bb:15:4c:a8",
            "net7": "32:f3:bc:12:93:57",
            "net8": "ca:7c:24:25:8b:97",
            "net9": "e2:4e:d4:0a:48:a9"
        },
        "spine_3_1_4": {
            "net0": "4e:ff:03:c9:50:17",
            "net1": "2e:a4:2c:68:2c:11",
            "net10": "5a:54:cf:87:6a:38",
            "net11": "3e:5a:09:9a:0d:35",
            "net2": "fe:5f:c2:ee:48:64",
            "net3": "46:2d:be:07:36:9d",
            "net4": "b2:23:f7:d6:93:b9",
            "net5": "76:ec:d4:38:fc:62",
            "net6": "6a:99:53:f7:33:bc",
            "net7": "be:02:a3:49:12:bb",
            "net8": "46:bc:26:1d:c2:50",
            "net9": "ee:65:17:3e:25:b9"
        },
        "spine_3_1_5": {
            "net0": "9a:b1:ca:27:24:03",
            "net1": "c2:28:6f:ef:80:29",
            "net10": "c2:41:1b:e0:5d:ec",
            "net11": "3e:ae:1c:91:69:c8",
            "net2": "d2:68:17:51:57:18",
            "net3": "06:2f:cf:95:5b:2f",
            "net4": "d6:2e:6e:26:a2:ed",
            "net5": "06:a1:4a:1c:f1:be",
            "net6": "2a:9c:26:e8:ab:91",
            "net7": "fa:7d:5a:78:38:4a",
            "net8": "ea:59:5d:ea:ce:12",
            "net9": "56:eb:d8:d1:d6:b8"
        },
        "spine_3_1_6": {
            "net0": "de:b2:82:61:99:9d",
            "net1": "fa:5a:01:af:78:d3",
            "net10": "2a:8c:f7:27:92:5b",
            "net11": "9e:ee:b2:f1:77:77",
            "net2": "be:a5:de:c2:ea:9d",
            "net3": "02:27:70:5a:42:88",
            "net4": "a6:11:c4:f8:8b:69",
            "net5": "5e:e4:c6:58:2f:fd",
            "net6": "6a:fe:a8:64:6b:17",
            "net7": "5e:6d:af:26:11:97",
            "net8": "42:10:74:82:1b:88",
            "net9": "52:7e:87:04:5d:92"
        },
        "spine_4_1_1": {
            "net0": "5a:4f:c2:09:f3:7d",
            "net1": "ae:bb:25:67:a5:e7",
            "net10": "e2:db:7c:3a:50:6b",
            "net11": "e6:53:f8:ab:8a:95",
            "net2": "2a:c5:a6:84:17:03",
            "net3": "2e:46:43:7c:fd:77",
            "net4": "82:34:8c:85:23:51",
            "net5": "d6:34:3f:49:58:cd",
            "net6": "0a:36:fc:46:21:b6",
            "net7": "8e:b8:83:b8:6d:25",
            "net8": "fe:f0:a0:12:e3:c9",
            "net9": "ce:39:01:6c:1d:3e"
        },
        "spine_4_1_2": {
            "net0": "aa:55:39:7e:8e:82",
            "net1": "de:b5:6e:92:54:cc",
            "net10": "a2:b8:45:fe:f0:d4",
            "net11": "a6:82:a8:d5:89:0a",
            "net2": "82:13:27:00:8d:8b",
            "net3": "42:3d:a0:2f:32:0d",
            "net4": "76:6f:19:a2:f2:7d",
            "net5": "c6:7f:5a:12:db:1c",
            "net6": "b6:e7:c2:ac:11:1c",
            "net7": "9a:68:61:db:ff:5b",
            "net8": "aa:bd:ef:2f:8d:54",
            "net9": "42:65:48:e8:35:6e"
        },
        "spine_4_1_3": {
            "net0": "9a:98:7d:a5:90:33",
            "net1": "22:7a:59:1c:66:44",
            "net10": "4a:da:d7:1b:cb:10",
            "net11": "3e:a2:47:55:07:5f",
            "net2": "96:1b:67:23:3b:42",
            "net3": "a6:03:5a:01:c8:10",
            "net4": "a6:7a:01:94:60:f0",
            "net5": "56:9f:ab:9c:f1:4f",
            "net6": "5e:be:7f:0c:b4:4c",
            "net7": "36:a8:c9:22:a9:c6",
            "net8": "92:e7:46:8a:6c:12",
            "net9": "1a:18:85:35:42:2e"
        },
        "spine_4_1_4": {
            "net0": "a6:4f:d2:8a:4a:00",
            "net1": "1a:07:04:43:0f:3e",
            "net10": "2a:85:42:0f:c8:cb",
            "net11": "9e:c6:da:00:86:29",
            "net2": "ea:ea:75:ac:01:57",
            "net3": "5a:c8:f8:cc:bf:43",
            "net4": "26:87:2c:a8:0b:21",
            "net5": "46:b1:e4:15:20:5a",
            "net6": "66:82:7b:ac:a1:77",
            "net7": "3a:f3:32:43:28:54",
            "net8": "ee:e8:f4:c3:fd:cc",
            "net9": "d2:a5:4e:2e:55:77"
        },
        "spine_4_1_5": {
            "net0": "d2:d9:f4:d3:53:60",
            "net1": "e6:82:66:87:fb:14",
            "net10": "5a:a7:48:c3:1e:6a",
            "net11": "82:80:9f:cb:bf:a5",
            "net2": "2a:24:b6:29:e2:c0",
            "net3": "3e:41:90:ff:0d:71",
            "net4": "76:b8:77:cf:95:bc",
            "net5": "e2:aa:03:8c:10:05",
            "net6": "4e:49:3e:15:f8:84",
            "net7": "9e:1d:cd:70:80:c8",
            "net8": "32:bf:80:4d:2f:0e",
            "net9": "9e:55:f7:d7:73:98"
        },
        "spine_4_1_6": {
            "net0": "d2:c2:da:68:69:2e",
            "net1": "56:b2:ea:34:07:26",
            "net10": "a6:8e:16:3e:b4:cb",
            "net11": "c2:9c:d2:91:ca:36",
            "net2": "fe:d4:72:db:dc:69",
            "net3": "7a:9c:f7:68:f4:f1",
            "net4": "36:b0:e3:81:a6:cf",
            "net5": "52:b6:01:49:16:63",
            "net6": "2e:d3:4b:ee:e2:d7",
            "net7": "72:1e:2c:c1:29:86",
            "net8": "fe:3a:90:eb:75:f2",
            "net9": "06:07:43:ff:93:91"
        },
        "tof_1_2_1": {
            "net0": "fa:20:ab:f7:eb:d7",
            "net1": "9a:fe:a4:d2:34:08",
            "net10": "d2:6f:79:42:d3:99",
            "net11": "86:8f:f5:e8:05:9b",
            "net2": "7a:ff:1d:5a:8e:8f",
            "net3": "22:65:c5:33:53:55",
            "net4": "e6:50:ab:09:52:2c",
            "net5": "7e:2f:00:92:5f:ec",
            "net6": "8a:70:a5:8f:e9:91",
            "net7": "e6:45:39:91:a5:c7",
            "net8": "a2:4c:6e:b7:c2:af",
            "net9": "ee:4a:56:aa:ce:fb"
        },
        "tof_1_2_2": {
            "net0": "02:1b:a6:e7:e9:13",
            "net1": "9a:6f:0b:18:2a:fe",
            "net10": "f2:8e:55:1f:93:55",
            "net11": "aa:52:a0:00:8f:23",
            "net2": "42:1a:7f:28:c0:e1",
            "net3": "02:e9:60:b8:c6:d7",
            "net4": "22:5c:1d:e2:2b:d2",
            "net5": "6a:b7:8b:3d:a3:45",
            "net6": "c2:01:05:29:3b:a4",
            "net7": "e2:26:2c:69:98:9e",
            "net8": "4e:26:60:de:d9:b6",
            "net9": "ae:39:90:a6:5f:fa"
        },
        "tof_1_2_3": {
            "net0": "0a:cb:49:56:8e:4d",
            "net1": "82:dd:51:73:7e:6d",
            "net10": "4a:90:99:c4:a4:ff",
            "net11": "d2:10:a4:30:9d:fd",
            "net2": "fe:71:88:30:87:7c",
            "net3": "66:77:b5:40:51:de",
            "net4": "b2:da:6a:2f:fc:67",
            "net5": "de:f3:c9:4b:97:b0",
            "net6": "6a:34:be:08:4f:e6",
            "net7": "0a:32:de:7e:ed:dd",
            "net8": "ea:c4:3a:d5:80:2b",
            "net9": "0a:da:75:49:07:e0"
        },
        "tof_1_2_4": {
            "net0": "12:31:92:f2:26:42",
            "net1": "1a:93:bf:83:61:7d",
            "net10": "aa:5d:5a:46:10:d9",
            "net11": "b6:d7:78:b3:44:ea",
            "net2": "42:5b:4a:af:91:35",
            "net3": "4a:f9:20:fb:3f:62",
            "net4": "4e:b9:e4:94:b5:78",
            "net5": "1e:8c:6e:ba:d3:f1",
            "net6": "b2:39:93:7a:d0:16",
            "net7": "1a:3e:c8:1d:e8:e4",
            "net8": "76:51:04:04:e1:e5",
            "net9": "4e:63:b8:ba:95:0e"
        },
        "tof_1_2_5": {
            "net0": "ae:3d:65:ca:85:6d",
            "net1": "aa:d1:98:32:b3:b2",
            "net10": "ee:da:68:aa:76:bc",
            "net11": "0a:4b:2b:34:c1:9c",
            "net2": "4a:5e:5a:05:74:05",
            "net3": "76:86:4b:c7:a7:d7",
            "net4": "a2:47:47:cf:52:26",
            "net5": "2a:71:fd:c1:06:dc",
            "net6": "be:f7:85:3e:dd:e3",
            "net7": "1a:69:d8:11:82:0e",
            "net8": "1a:db:70:27:62:27",
            "net9": "e2:85:59:65:44:29"
        },
        "tof_1_2_6": {
            "net0": "de:a8:31:9b:77:ab",
            "net1": "42:0d:85:ba:8b:64",
            "net10": "de:f5:e6:85:74:23",
            "net11": "a2:3d:e0:a1:eb:2c",
            "net2": "76:d9:38:5d:0f:21",
            "net3": "66:7d:45:fe:7b:bc",
            "net4": "d6:e2:d7:3c:0b:e7",
            "net5": "a6:c8:fb:00:23:be",
            "net6": "8e:c3:04:fd:03:d6",
            "net7": "ea:a9:76:3b:a1:9e",
            "net8": "42:74:d5:db:bb:5f",
            "net9": "ba:43:64:be:9f:29"
        },
        "tof_2_2_1": {
            "net0": "b6:1b:cb:b1:7f:e4",
            "net1": "c6:ee:97:81:a2:99",
            "net10": "ee:bf:e4:85:7b:7d",
            "net11": "aa:9c:91:44:d7:c2",
            "net2": "f6:da:43:80:b1:f1",
            "net3": "be:bc:41:01:8e:cf",
            "net4": "9a:64:11:53:18:68",
            "net5": "96:32:79:73:f0:65",
            "net6": "ca:f1:08:a6:de:44",
            "net7": "fa:b0:60:c5:7a:92",
            "net8": "ea:80:78:1a:3a:3f",
            "net9": "f6:0b:2f:48:11:c1"
        },
        "tof_2_2_2": {
            "net0": "2a:4d:90:65:52:f3",
            "net1": "82:71:43:fe:53:91",
            "net10": "c2:36:af:7f:cf:9d",
            "net11": "b2:01:19:7b:8c:9d",
            "net2": "62:bf:de:8a:6d:f5",
            "net3": "6e:06:a4:49:e8:a8",
            "net4": "12:2f:32:4a:ba:34",
            "net5": "02:37:6f:88:32:08",
            "net6": "36:25:6b:50:83:8d",
            "net7": "c6:69:7b:9c:5e:02",
            "net8": "a6:5b:c9:a0:22:c5",
            "net9": "1a:7e:5f:0f:f7:91"
        },
        "tof_2_2_3": {
            "net0": "26:ff:2f:a9:7e:1b",
            "net1": "06:00:9f:5b:52:c1",
            "net10": "66:0e:8c:cc:e2:06",
            "net11": "76:23:94:bb:d5:be",
            "net2": "d2:5d:a7:ae:8b:aa",
            "net3": "ae:fa:45:66:01:15",
            "net4": "d2:dd:f2:be:88:12",
            "net5": "72:83:77:95:75:59",
            "net6": "de:cd:04:58:55:0b",
            "net7": "fa:74:6d:ee:44:9b",
            "net8": "da:6c:14:ec:34:28",
            "net9": "7e:42:f8:3d:f5:62"
        },
        "tof_2_2_4": {
            "net0": "42:bf:18:89:df:1b",
            "net1": "26:b3:70:7f:68:50",
            "net10": "fe:a8:96:57:60:bc",
            "net11": "3a:a6:21:77:bc:fc",
            "net2": "42:0f:eb:ef:88:21",
            "net3": "3a:e6:7f:fe:f3:59",
            "net4": "5e:74:70:a8:b4:32",
            "net5": "2e:36:62:0f:32:24",
            "net6": "92:47:0f:77:d4:83",
            "net7": "2a:37:d8:99:d0:6a",
            "net8": "72:0a:c9:20:d2:72",
            "net9": "66:0f:4a:e5:36:88"
        },
        "tof_2_2_5": {
            "net0": "2e:3d:28:c2:d4:ec",
            "net1": "b2:6a:7a:80:b1:82",
            "net10": "06:d2:12:24:74:79",
            "net11": "ae:81:c0:c7:9d:4c",
            "net2": "56:97:10:18:70:67",
            "net3": "16:44:f2:2d:0a:2e",
            "net4": "26:59:02:44:a8:ab",
            "net5": "d2:7a:8b:35:01:ad",
            "net6": "5e:a8:4e:35:23:2e",
            "net7": "1e:5b:40:fb:cc:5c",
            "net8": "ee:f5:15:18:38:62",
            "net9": "e6:25:87:f2:8e:f8"
        },
        "tof_2_2_6": {
            "net0": "92:45:45:64:13:dd",
            "net1": "36:4e:df:2e:66:eb",
            "net10": "1e:02:e7:be:ee:59",
            "net11": "2a:4b:e0:16:a4:01",
            "net2": "56:c7:0e:c7:f5:11",
            "net3": "72:6e:07:0f:ee:c6",
            "net4": "b6:d6:cf:e9:d4:80",
            "net5": "fa:d2:06:47:63:10",
            "net6": "12:38:f0:56:d8:f0",
            "net7": "aa:4f:49:92:67:e6",
            "net8": "56:17:9c:92:65:2a",
            "net9": "5e:7e:3b:ce:2f:02"
        }
    },
    "failed_machine": "leaf_1_0_1",
    "failed_interfaces": [
        "net0"
    ],
    "failure_time": 1614958041.3873892,
    "recover_time": 1614958281.8101237
}