{
    "k_leaf": 6,
    "k_top": 6,
    "redundancy_factor": 3,
    "is_k8s": true,
    "machine_mac_addresses": {
        "leaf_1_0_1": {
            "net0": "be:56:62:21:79:e3",
            "net1": "62:c1:05:d5:77:c1",
            "net2": "ee:f8:91:f1:0a:65",
            "net3": "52:c8:f0:56:24:f0",
            "net4": "de:ba:36:cb:ef:59",
            "net5": "66:81:a2:4a:49:bb",
            "net6": "b2:45:7c:3e:ec:c0"
        },
        "leaf_1_0_2": {
            "net0": "4e:ba:b7:28:cf:2c",
            "net1": "4e:3a:c4:c8:c8:6b",
            "net2": "fe:14:b7:c7:28:49",
            "net3": "4e:9f:34:06:f2:09",
            "net4": "56:1d:c3:e9:e6:0b",
            "net5": "8e:f5:3c:a1:3e:6c",
            "net6": "7a:dc:4b:b5:d9:68"
        },
        "leaf_1_0_3": {
            "net0": "a2:88:d2:52:5b:f8",
            "net1": "06:fa:f6:4d:92:a8",
            "net2": "96:db:39:c3:eb:59",
            "net3": "d6:b8:08:31:50:98",
            "net4": "f6:68:6f:56:0e:a8",
            "net5": "92:96:e1:a3:ad:9f",
            "net6": "9e:72:c0:13:82:a2"
        },
        "leaf_1_0_4": {
            "net0": "3e:82:89:4b:c7:82",
            "net1": "b6:3a:f4:61:3f:a0",
            "net2": "a6:28:d3:0d:50:3e",
            "net3": "be:f3:05:49:ee:fb",
            "net4": "fe:58:7f:4e:cb:82",
            "net5": "22:4e:bd:9e:c6:92",
            "net6": "b2:0e:ea:8d:e5:52"
        },
        "leaf_1_0_5": {
            "net0": "26:75:69:78:01:8d",
            "net1": "a6:7c:c7:21:c7:a1",
            "net2": "52:60:74:5c:8f:f3",
            "net3": "72:c1:0e:55:9e:5b",
            "net4": "b6:0c:8a:7e:15:37",
            "net5": "46:e3:6b:07:8d:d7",
            "net6": "6e:34:a4:5f:d6:1b"
        },
        "leaf_1_0_6": {
            "net0": "b2:10:80:4f:f6:5a",
            "net1": "de:72:40:b1:fb:0f",
            "net2": "3e:29:a9:ef:e7:86",
            "net3": "1e:e4:7a:eb:aa:39",
            "net4": "16:ab:13:82:9e:aa",
            "net5": "46:09:e8:34:91:87",
            "net6": "12:4c:d3:63:6d:a3"
        },
        "leaf_2_0_1": {
            "net0": "ea:9a:3b:04:30:db",
            "net1": "ce:dd:ca:6a:d6:ff",
            "net2": "e6:3f:f4:9a:2d:12",
            "net3": "f6:2e:ad:c7:13:54",
            "net4": "f6:1d:c6:95:e9:4a",
            "net5": "26:d6:ee:9c:61:b1",
            "net6": "ea:a2:ec:59:f9:d8"
        },
        "leaf_2_0_2": {
            "net0": "4e:7f:c9:5a:78:d9",
            "net1": "86:09:c6:cc:50:80",
            "net2": "76:72:d6:f6:37:d7",
            "net3": "c6:5f:0f:4b:7a:34",
            "net4": "ae:b5:53:e6:8a:0b",
            "net5": "42:5f:ae:cd:e3:a8",
            "net6": "0a:b2:de:c2:63:97"
        },
        "leaf_2_0_3": {
            "net0": "0a:48:f9:8d:04:9c",
            "net1": "f2:0b:f8:f1:26:dc",
            "net2": "62:4d:43:f1:da:2a",
            "net3": "e6:77:04:b6:4e:62",
            "net4": "42:43:3f:5c:fe:f0",
            "net5": "46:3e:ab:15:1c:e3",
            "net6": "26:49:f5:d6:87:f7"
        },
        "leaf_2_0_4": {
            "net0": "26:5a:09:25:a0:78",
            "net1": "16:09:54:7f:f2:56",
            "net2": "ea:d4:c0:72:68:67",
            "net3": "72:4b:a6:66:a5:d6",
            "net4": "f6:7a:45:bf:fd:7b",
            "net5": "b2:ac:90:3b:27:e6",
            "net6": "d6:4e:2c:40:ba:71"
        },
        "leaf_2_0_5": {
            "net0": "16:17:af:06:64:60",
            "net1": "1e:3f:f4:c2:6d:c8",
            "net2": "12:dc:33:7b:22:e9",
            "net3": "76:39:0e:5e:ae:30",
            "net4": "02:8d:38:c2:33:c4",
            "net5": "2e:2c:6f:d4:2d:78",
            "net6": "a6:80:b8:59:84:8b"
        },
        "leaf_2_0_6": {
            "net0": "ee:9f:20:05:bf:12",
            "net1": "6a:67:d8:f3:0f:bc",
            "net2": "36:e2:bb:c5:be:e7",
            "net3": "ee:f5:7a:88:b5:56",
            "net4": "0e:3f:6a:21:bf:96",
            "net5": "ce:8f:7c:fa:bf:19",
            "net6": "f6:67:0b:79:2d:1b"
        },
        "leaf_3_0_1": {
            "net0": "de:18:e2:e1:53:b5",
            "net1": "f6:07:c0:df:fb:7f",
            "net2": "1a:c7:88:3a:22:fc",
            "net3": "02:de:6f:f9:d5:bb",
            "net4": "ce:a7:d4:63:8f:98",
            "net5": "9e:9e:44:85:e0:1e",
            "net6": "4e:1d:c5:ed:8a:71"
        },
        "leaf_3_0_2": {
            "net0": "8e:b3:d1:7e:b9:eb",
            "net1": "6a:b9:8f:d2:26:c3",
            "net2": "2e:cd:79:df:43:ae",
            "net3": "8e:6a:f1:c2:a7:c0",
            "net4": "6e:46:1b:0f:c4:87",
            "net5": "12:03:d5:34:7e:50",
            "net6": "16:92:e5:77:9f:51"
        },
        "leaf_3_0_3": {
            "net0": "da:2b:57:da:b4:af",
            "net1": "16:b8:43:ae:36:71",
            "net2": "8a:82:43:17:88:61",
            "net3": "3e:51:bf:06:85:57",
            "net4": "b2:ea:ab:6e:ce:74",
            "net5": "ae:64:0d:c2:15:29",
            "net6": "ae:8d:81:75:08:8a"
        },
        "leaf_3_0_4": {
            "net0": "ee:d7:9a:06:6e:9d",
            "net1": "7a:7f:c1:7e:df:77",
            "net2": "ae:be:ff:3d:e4:3f",
            "net3": "5e:fc:da:be:8a:e3",
            "net4": "ca:bb:38:66:b8:0b",
            "net5": "6a:a9:af:5a:4e:71",
            "net6": "5a:b5:68:b5:c4:74"
        },
        "leaf_3_0_5": {
            "net0": "e6:a5:a2:fd:51:41",
            "net1": "1a:03:a3:70:27:7b",
            "net2": "ce:1b:bf:be:50:ff",
            "net3": "a6:16:f0:be:6d:59",
            "net4": "9e:14:ea:6d:1a:dc",
            "net5": "aa:3a:47:1c:78:5a",
            "net6": "12:9c:02:b3:53:9d"
        },
        "leaf_3_0_6": {
            "net0": "e2:99:2c:e3:7d:18",
            "net1": "5a:df:fd:28:27:ef",
            "net2": "f2:68:d0:b5:5a:e6",
            "net3": "d2:7d:bf:de:73:f3",
            "net4": "22:89:2d:d2:37:a3",
            "net5": "2a:61:fc:26:f8:85",
            "net6": "12:29:c0:5b:4c:cc"
        },
        "leaf_4_0_1": {
            "net0": "be:94:44:00:c3:92",
            "net1": "ee:40:72:a0:49:b9",
            "net2": "ae:94:66:f2:05:aa",
            "net3": "2a:1e:b1:ef:2d:3b",
            "net4": "76:ac:16:47:bf:7d",
            "net5": "d6:55:6a:29:b5:f2",
            "net6": "ae:86:2c:0b:9e:d0"
        },
        "leaf_4_0_2": {
            "net0": "ba:83:ed:6b:e2:fb",
            "net1": "4e:6b:11:7e:f6:51",
            "net2": "da:43:d9:2e:11:1e",
            "net3": "72:37:d2:89:1e:40",
            "net4": "ba:58:3d:23:2f:9e",
            "net5": "b6:1f:7c:3e:68:60",
            "net6": "92:da:22:fb:29:3e"
        },
        "leaf_4_0_3": {
            "net0": "02:ba:31:c2:89:30",
            "net1": "aa:14:c3:68:aa:b7",
            "net2": "da:a1:3f:99:70:f9",
            "net3": "fa:a2:7d:7f:6d:54",
            "net4": "8a:d0:47:95:76:81",
            "net5": "be:c0:e5:63:11:21",
            "net6": "42:88:14:ad:37:40"
        },
        "leaf_4_0_4": {
            "net0": "da:71:1e:46:b6:8e",
            "net1": "2e:4a:f3:18:a8:6d",
            "net2": "2e:7b:af:da:53:6c",
            "net3": "c6:23:7c:50:f3:30",
            "net4": "1e:85:27:82:27:03",
            "net5": "b2:ec:cc:ee:70:63",
            "net6": "72:28:e3:3f:7e:ac"
        },
        "leaf_4_0_5": {
            "net0": "e6:5f:ec:7f:31:ad",
            "net1": "66:b6:73:56:a0:c1",
            "net2": "a2:06:4a:42:0f:a0",
            "net3": "be:e0:ac:15:a3:df",
            "net4": "0a:b0:d9:e7:45:73",
            "net5": "52:f6:eb:0d:69:e0",
            "net6": "d6:34:11:8b:26:4e"
        },
        "leaf_4_0_6": {
            "net0": "16:07:54:43:c1:61",
            "net1": "be:3b:1b:4a:49:41",
            "net2": "e2:06:5a:5f:88:49",
            "net3": "fa:be:c0:77:f4:f9",
            "net4": "02:49:1d:43:65:e0",
            "net5": "5a:52:7a:7b:f1:4e",
            "net6": "76:b4:88:9e:8a:84"
        },
        "spine_1_1_1": {
            "net0": "62:9f:50:28:e9:ed",
            "net1": "9e:d3:97:29:ed:65",
            "net10": "82:40:d3:98:4e:97",
            "net11": "72:da:f6:1c:8f:6d",
            "net2": "c2:49:86:c7:ae:a6",
            "net3": "06:fd:e6:b3:bd:ce",
            "net4": "26:76:6b:02:69:bc",
            "net5": "76:d8:28:35:cb:ae",
            "net6": "ba:00:e7:ca:78:51",
            "net7": "0a:e8:6c:0d:56:e8",
            "net8": "ca:32:95:96:eb:94",
            "net9": "7e:cb:f6:73:b5:6d"
        },
        "spine_1_1_2": {
            "net0": "02:0f:e6:96:f4:cd",
            "net1": "ae:17:52:49:a1:37",
            "net10": "de:f2:a7:44:a7:30",
            "net11": "3e:49:63:48:7b:4c",
            "net2": "b2:81:60:64:14:d6",
            "net3": "da:4d:f8:a2:6f:8f",
            "net4": "22:ef:11:f5:16:fe",
            "net5": "96:42:c5:34:ba:1f",
            "net6": "ea:05:0d:87:e1:53",
            "net7": "c6:00:18:f1:d2:56",
            "net8": "0e:3e:fd:1b:4c:dd",
            "net9": "6a:42:aa:c2:22:b5"
        },
        "spine_1_1_3": {
            "net0": "62:e7:f0:82:85:42",
            "net1": "f2:c7:d6:d3:e1:47",
            "net10": "ba:74:e7:c2:59:24",
            "net11": "76:d2:56:e6:78:b6",
            "net2": "ae:33:73:29:4e:b4",
            "net3": "8a:8b:8b:a7:5b:3d",
            "net4": "1a:aa:1e:c5:6b:d8",
            "net5": "a6:cb:93:72:8d:87",
            "net6": "fa:9e:36:42:9e:4e",
            "net7": "1a:0b:19:73:fd:cc",
            "net8": "4a:1c:3f:cf:a7:f8",
            "net9": "ca:a9:0b:89:7a:90"
        },
        "spine_1_1_4": {
            "net0": "5a:a5:5a:6f:b5:87",
            "net1": "32:ad:6a:cd:9a:a7",
            "net10": "9e:f1:ac:1f:00:34",
            "net11": "8a:d3:70:db:f9:ea",
            "net2": "66:41:6b:b6:4b:67",
            "net3": "7e:a7:1e:3a:2b:3a",
            "net4": "be:56:48:fe:da:d3",
            "net5": "e2:34:54:37:53:c9",
            "net6": "7e:34:23:e4:77:ae",
            "net7": "82:34:3e:fb:42:76",
            "net8": "7a:c9:79:9a:b0:60",
            "net9": "4a:64:c1:89:d5:96"
        },
        "spine_1_1_5": {
            "net0": "c2:70:d3:02:09:cf",
            "net1": "3a:3e:ea:21:a9:48",
            "net10": "4e:c9:4c:60:70:a3",
            "net11": "96:16:71:42:8e:16",
            "net2": "ba:58:df:6c:4f:47",
            "net3": "d6:20:6d:90:93:94",
            "net4": "fa:de:dc:8e:89:cf",
            "net5": "5e:71:5d:72:ed:89",
            "net6": "22:b5:64:1a:86:cd",
            "net7": "fa:63:76:5c:42:a7",
            "net8": "ca:e8:dc:cc:ec:b3",
            "net9": "2a:3b:b8:23:7d:77"
        },
        "spine_1_1_6": {
            "net0": "da:d4:d0:86:2a:cb",
            "net1": "16:91:4e:4a:8d:f8",
            "net10": "b2:f1:cd:7b:28:7c",
            "net11": "b6:9f:c3:db:b8:21",
            "net2": "62:78:c1:7c:e5:71",
            "net3": "b2:a7:ab:82:fc:66",
            "net4": "ae:af:63:69:b0:2c",
            "net5": "1e:32:42:de:09:47",
            "net6": "2a:cb:1a:87:fd:bf",
            "net7": "76:69:89:20:d8:06",
            "net8": "3e:61:12:ea:db:2c",
            "net9": "1a:1e:57:6a:63:97"
        },
        "spine_2_1_1": {
            "net0": "4a:a7:6a:1e:d1:08",
            "net1": "3e:9d:83:4c:66:cf",
            "net10": "56:b2:0a:47:0f:10",
            "net11": "e2:14:aa:4e:02:0c",
            "net2": "f6:f0:9c:15:bc:1f",
            "net3": "82:00:78:fb:d3:b7",
            "net4": "96:63:08:d6:61:4b",
            "net5": "12:15:b3:1e:4a:42",
            "net6": "fe:b5:55:6b:fb:13",
            "net7": "ae:44:ec:df:e8:31",
            "net8": "96:d9:ca:77:50:d8",
            "net9": "5a:01:b0:2f:ce:37"
        },
        "spine_2_1_2": {
            "net0": "26:26:23:1d:82:09",
            "net1": "56:24:be:13:00:11",
            "net10": "b6:ef:cb:3e:4d:cc",
            "net11": "fe:86:38:9c:17:0c",
            "net2": "82:ec:e0:7e:6a:49",
            "net3": "3a:af:00:e2:12:1b",
            "net4": "aa:60:17:03:9a:22",
            "net5": "ba:d6:3a:92:a2:aa",
            "net6": "ba:c1:2f:6e:45:0c",
            "net7": "52:16:78:9c:09:4e",
            "net8": "56:d0:c4:52:1f:2b",
            "net9": "8a:46:35:50:07:4a"
        },
        "spine_2_1_3": {
            "net0": "22:cb:79:cd:68:e6",
            "net1": "fa:7e:96:f9:3f:91",
            "net10": "da:e3:fa:a6:bd:a9",
            "net11": "d2:63:91:a2:c1:69",
            "net2": "be:36:f1:cd:b8:b8",
            "net3": "92:0e:5e:4b:35:12",
            "net4": "52:81:c6:8b:06:b2",
            "net5": "7e:96:cc:c1:52:ba",
            "net6": "76:d1:15:b3:f0:47",
            "net7": "42:93:bc:7e:ab:d6",
            "net8": "a6:23:42:21:db:68",
            "net9": "7e:23:51:28:77:ce"
        },
        "spine_2_1_4": {
            "net0": "ea:95:39:63:75:85",
            "net1": "b2:d6:9f:77:fe:46",
            "net10": "a2:d3:6b:b8:f5:be",
            "net11": "76:6f:1b:a3:0d:39",
            "net2": "aa:87:af:7a:cf:33",
            "net3": "ba:5d:27:30:d7:b8",
            "net4": "de:93:d3:81:d0:01",
            "net5": "d6:d6:7d:3c:f6:39",
            "net6": "b2:ed:fc:9d:1a:00",
            "net7": "16:a3:33:a7:c7:45",
            "net8": "86:53:62:9c:b0:e8",
            "net9": "de:71:f3:c2:8a:27"
        },
        "spine_2_1_5": {
            "net0": "3a:78:a4:f7:0b:4d",
            "net1": "1e:4a:81:d6:ba:47",
            "net10": "f2:07:42:07:11:0e",
            "net11": "2a:cf:d5:28:b7:7f",
            "net2": "56:08:37:36:7e:4b",
            "net3": "c6:8e:19:a7:cd:83",
            "net4": "9a:3e:73:3f:e4:fd",
            "net5": "ee:b5:64:68:0e:06",
            "net6": "e2:70:79:48:bf:ea",
            "net7": "ae:bd:a4:9e:37:7e",
            "net8": "b2:2c:01:33:4b:89",
            "net9": "62:52:4b:b1:e6:33"
        },
        "spine_2_1_6": {
            "net0": "1e:60:58:24:3e:a6",
            "net1": "ba:59:01:b9:cd:01",
            "net10": "be:cc:72:59:72:0c",
            "net11": "8e:6c:3c:ff:01:c4",
            "net2": "56:9d:82:4e:c9:89",
            "net3": "72:cb:43:a9:68:1d",
            "net4": "86:22:3d:7b:49:e3",
            "net5": "ca:14:51:cf:64:82",
            "net6": "12:6d:24:80:e4:4d",
            "net7": "fe:64:8e:d5:84:cc",
            "net8": "9e:e7:a4:e5:4c:93",
            "net9": "da:0c:8f:2f:b6:cb"
        },
        "spine_3_1_1": {
            "net0": "0e:3c:9b:13:53:5d",
            "net1": "fe:6f:62:37:86:2c",
            "net10": "a6:f5:1e:d9:87:11",
            "net11": "96:ea:e7:ef:cd:75",
            "net2": "ae:c3:cb:31:b9:bb",
            "net3": "16:27:a1:2a:8c:74",
            "net4": "8a:48:64:f9:c4:c8",
            "net5": "82:c8:ca:6a:c8:fe",
            "net6": "22:9e:a8:74:25:87",
            "net7": "82:de:81:5e:8e:7d",
            "net8": "ae:e6:c3:fa:04:44",
            "net9": "36:59:46:c7:b4:4e"
        },
        "spine_3_1_2": {
            "net0": "9e:f3:c6:8b:48:4a",
            "net1": "4e:0a:66:13:23:10",
            "net10": "3a:0f:da:81:f3:21",
            "net11": "da:07:29:57:bb:3c",
            "net2": "76:d0:99:2a:9f:7f",
            "net3": "ea:d5:fd:3c:2e:53",
            "net4": "6e:d2:c4:26:3e:50",
            "net5": "e2:b9:24:e6:28:a7",
            "net6": "1e:4e:34:7b:fc:7d",
            "net7": "3a:6f:d1:66:5c:2b",
            "net8": "7a:ef:39:6a:ad:af",
            "net9": "22:6f:eb:05:cb:d9"
        },
        "spine_3_1_3": {
            "net0": "6a:dc:38:b5:39:93",
            "net1": "ae:f6:4b:f0:02:6c",
            "net10": "7a:74:cc:49:03:0b",
            "net11": "16:b9:f6:42:05:ed",
            "net2": "e6:48:0b:19:5a:e1",
            "net3": "02:8e:89:de:f6:66",
            "net4": "0a:a5:01:46:06:98",
            "net5": "ca:f0:cf:1d:e7:0f",
            "net6": "22:69:e3:26:20:21",
            "net7": "66:a9:dd:ac:57:ac",
            "net8": "56:8f:dd:ea:d1:59",
            "net9": "2a:67:3d:d2:63:9b"
        },
        "spine_3_1_4": {
            "net0": "6a:7b:5b:07:0f:37",
            "net1": "82:2d:2c:20:8b:91",
            "net10": "6a:8c:5e:47:48:2e",
            "net11": "96:c6:a1:72:32:c4",
            "net2": "b6:47:2d:90:c1:a7",
            "net3": "56:2b:30:f6:2f:b4",
            "net4": "de:70:1e:e3:67:9c",
            "net5": "9a:57:10:27:11:12",
            "net6": "26:1d:6c:95:ed:8a",
            "net7": "2a:1e:b9:7e:1d:bc",
            "net8": "c2:a9:22:dc:f2:65",
            "net9": "6e:ca:4f:b0:2b:2c"
        },
        "spine_3_1_5": {
            "net0": "9e:f8:4b:36:6c:22",
            "net1": "ea:fe:96:15:67:8e",
            "net10": "2e:e8:3c:ea:56:77",
            "net11": "ea:bb:6d:86:1c:d3",
            "net2": "a6:6e:cf:a6:46:c5",
            "net3": "76:24:2b:52:07:f9",
            "net4": "f6:a3:74:da:75:19",
            "net5": "3e:fd:6a:b9:be:a7",
            "net6": "9e:ab:e8:50:97:eb",
            "net7": "7e:e4:db:45:ad:b7",
            "net8": "02:2e:c8:0b:e5:1e",
            "net9": "de:27:cb:00:ab:f4"
        },
        "spine_3_1_6": {
            "net0": "8e:ee:4b:ae:66:21",
            "net1": "46:0e:38:cd:4f:df",
            "net10": "36:3b:f1:52:e9:67",
            "net11": "aa:2c:6d:f9:04:8f",
            "net2": "ca:c6:fc:a6:92:4f",
            "net3": "32:1f:4c:d3:52:7a",
            "net4": "1e:63:d5:5f:94:f0",
            "net5": "26:62:04:c2:8a:d9",
            "net6": "9a:57:4d:9f:13:0e",
            "net7": "76:7e:8e:b6:a0:c9",
            "net8": "66:91:40:83:fd:f4",
            "net9": "76:0f:15:0d:9d:cf"
        },
        "spine_4_1_1": {
            "net0": "e6:cd:b3:22:48:72",
            "net1": "fe:32:4c:5e:df:f8",
            "net10": "3e:a6:93:9f:34:25",
            "net11": "fe:ec:f9:e8:c8:13",
            "net2": "8e:8e:2f:ae:dd:0f",
            "net3": "4a:ad:c8:b8:a3:5b",
            "net4": "9a:76:06:c9:a3:ef",
            "net5": "1a:71:28:41:d5:7a",
            "net6": "a2:79:a1:29:64:89",
            "net7": "7e:c0:d6:7c:b2:a9",
            "net8": "3e:0f:11:28:28:60",
            "net9": "9e:f0:fc:95:1a:26"
        },
        "spine_4_1_2": {
            "net0": "96:a7:2e:2d:f9:41",
            "net1": "c2:93:73:3d:a1:c4",
            "net10": "c6:fb:6b:db:39:54",
            "net11": "a2:08:e0:a5:d4:1c",
            "net2": "2e:f5:bb:26:de:5b",
            "net3": "96:1c:ef:7e:fa:17",
            "net4": "0a:74:93:6e:36:6e",
            "net5": "f2:b0:31:71:5c:04",
            "net6": "ae:03:5c:85:5f:c6",
            "net7": "3a:d4:84:cd:af:3a",
            "net8": "ba:c6:ff:85:7a:2e",
            "net9": "82:96:ec:1d:a0:70"
        },
        "spine_4_1_3": {
            "net0": "b2:5b:13:4a:b8:c6",
            "net1": "2a:61:73:53:86:0c",
            "net10": "76:5e:78:76:ce:06",
            "net11": "ba:62:c3:14:6a:ab",
            "net2": "16:e1:63:23:b5:bf",
            "net3": "b2:22:19:59:a6:80",
            "net4": "22:df:05:f0:08:5d",
            "net5": "36:38:df:be:37:94",
            "net6": "2e:c7:a0:22:e8:85",
            "net7": "92:9b:bf:5f:1f:eb",
            "net8": "42:16:ca:50:9d:8d",
            "net9": "12:38:d7:2d:94:f8"
        },
        "spine_4_1_4": {
            "net0": "02:5a:85:e1:32:27",
            "net1": "b6:d4:70:93:9f:10",
            "net10": "56:59:a9:3a:8e:8a",
            "net11": "12:95:56:7d:97:6d",
            "net2": "c2:e2:c3:e7:07:2e",
            "net3": "02:7b:f7:c5:53:67",
            "net4": "2e:e4:e2:6b:8e:35",
            "net5": "0a:26:1a:c5:1f:9a",
            "net6": "0e:22:22:b7:73:32",
            "net7": "26:68:a9:b8:69:40",
            "net8": "72:d5:a1:f2:b0:db",
            "net9": "66:a8:52:1b:ed:72"
        },
        "spine_4_1_5": {
            "net0": "de:8a:5d:47:4f:ae",
            "net1": "ca:cd:b9:9b:8c:62",
            "net10": "36:6a:ef:80:22:d4",
            "net11": "ae:8c:86:e1:6c:dc",
            "net2": "de:d0:50:93:fe:40",
            "net3": "c6:fe:50:52:ff:f6",
            "net4": "ae:6d:4c:f2:d0:94",
            "net5": "7e:91:e3:6b:93:34",
            "net6": "da:af:02:ee:ee:70",
            "net7": "0e:de:e6:12:1b:30",
            "net8": "ea:cb:96:e2:8e:a4",
            "net9": "46:cf:53:2a:73:32"
        },
        "spine_4_1_6": {
            "net0": "e2:43:51:da:98:1e",
            "net1": "ce:ec:ed:e4:65:d7",
            "net10": "e6:01:0c:11:32:00",
            "net11": "0e:53:ea:e0:32:55",
            "net2": "96:30:bb:45:99:07",
            "net3": "86:26:43:45:53:8f",
            "net4": "3a:0f:53:7a:b0:7e",
            "net5": "56:3d:bc:7c:a0:3a",
            "net6": "d6:47:10:a3:cf:35",
            "net7": "1a:df:8b:b6:4c:20",
            "net8": "8a:f4:45:dc:95:92",
            "net9": "36:6a:ed:fe:77:88"
        },
        "tof_1_2_1": {
            "net0": "5e:18:57:7f:88:29",
            "net1": "0a:d8:10:63:38:24",
            "net10": "96:48:3a:0d:98:3e",
            "net11": "66:35:b1:1c:a4:27",
            "net2": "fe:63:62:a4:b9:0a",
            "net3": "d6:a5:41:db:e4:73",
            "net4": "ce:d2:91:db:d6:23",
            "net5": "c6:bd:5e:05:9e:cd",
            "net6": "fe:f6:59:d0:49:82",
            "net7": "52:94:3c:f4:73:6b",
            "net8": "02:2c:c5:d6:95:5a",
            "net9": "5a:51:40:23:49:c0"
        },
        "tof_1_2_2": {
            "net0": "ba:e2:0d:95:54:18",
            "net1": "ca:a6:22:3b:f9:df",
            "net10": "d6:e5:87:c5:53:2e",
            "net11": "d2:0e:5c:e7:88:f7",
            "net2": "7a:a6:b8:b2:8d:f9",
            "net3": "72:d8:41:64:53:5f",
            "net4": "ee:0a:d3:6a:7b:c3",
            "net5": "66:9a:54:ab:24:1a",
            "net6": "46:8a:a8:4b:22:09",
            "net7": "16:b7:3f:08:17:66",
            "net8": "ea:b2:79:85:d3:25",
            "net9": "d2:cd:54:42:a1:ec"
        },
        "tof_1_2_3": {
            "net0": "76:59:09:1a:fc:93",
            "net1": "aa:2b:2f:85:b6:46",
            "net10": "de:4a:b6:04:c2:ea",
            "net11": "96:d0:d3:da:f9:ae",
            "net2": "1a:cc:8f:b6:17:85",
            "net3": "4a:e7:b4:ff:e4:e7",
            "net4": "1a:74:02:92:5a:ed",
            "net5": "ee:07:af:04:b7:8e",
            "net6": "ca:87:f1:b8:74:e8",
            "net7": "8e:57:5d:60:c8:fc",
            "net8": "ba:2e:26:9b:d9:28",
            "net9": "a2:e7:cf:28:53:1b"
        },
        "tof_1_2_4": {
            "net0": "fa:32:78:22:25:88",
            "net1": "c6:08:97:93:b6:e7",
            "net10": "fe:fc:7f:ad:7b:21",
            "net11": "b6:ac:31:39:bd:24",
            "net2": "22:73:13:2b:9a:02",
            "net3": "7e:3b:4f:42:61:98",
            "net4": "02:49:9d:92:dc:f6",
            "net5": "4a:6a:6a:fa:a8:c9",
            "net6": "ee:c9:48:a2:4d:82",
            "net7": "f6:e9:92:ea:99:21",
            "net8": "be:11:61:fe:46:f8",
            "net9": "6e:52:57:f5:72:08"
        },
        "tof_1_2_5": {
            "net0": "7a:50:13:8a:c6:bc",
            "net1": "1e:57:cc:32:4b:7c",
            "net10": "fe:63:51:1e:bf:36",
            "net11": "86:87:7c:01:b6:36",
            "net2": "9e:32:8f:df:80:76",
            "net3": "02:8c:97:f7:14:dd",
            "net4": "36:b2:88:7c:cc:43",
            "net5": "56:8f:69:1b:30:4d",
            "net6": "92:ad:f7:fb:40:86",
            "net7": "b2:3a:f0:ac:2a:43",
            "net8": "7a:b6:0a:c3:1b:67",
            "net9": "7a:96:4b:5f:a9:ab"
        },
        "tof_1_2_6": {
            "net0": "9a:38:dc:49:bb:08",
            "net1": "72:0a:62:b1:db:2f",
            "net10": "6a:a8:ce:6d:e9:8f",
            "net11": "16:c3:9e:b3:d5:7c",
            "net2": "e6:36:20:ab:5a:fd",
            "net3": "ca:5e:da:d4:85:8a",
            "net4": "2a:ce:2d:cb:f1:93",
            "net5": "46:51:15:89:d9:62",
            "net6": "ca:16:29:5b:c8:6b",
            "net7": "0e:60:af:97:50:78",
            "net8": "1e:a7:29:44:47:ce",
            "net9": "12:dd:77:bb:45:bf"
        },
        "tof_2_2_1": {
            "net0": "06:55:64:0b:44:b1",
            "net1": "f2:ef:c6:aa:d3:5b",
            "net10": "e6:1c:b4:9d:7c:6a",
            "net11": "e2:4d:b1:e0:87:0d",
            "net2": "f6:fd:23:e2:39:c6",
            "net3": "42:83:5f:5f:43:00",
            "net4": "16:4c:90:10:e4:0e",
            "net5": "ee:a5:5e:39:77:8e",
            "net6": "da:b2:e5:8f:36:4d",
            "net7": "62:20:2b:6f:a0:b8",
            "net8": "ba:28:ac:40:da:99",
            "net9": "02:5b:3d:23:eb:e8"
        },
        "tof_2_2_2": {
            "net0": "a6:7b:df:6a:9a:1d",
            "net1": "56:09:46:c0:34:2b",
            "net10": "82:83:94:05:fc:94",
            "net11": "f6:28:c8:a4:7d:0a",
            "net2": "a6:1f:d0:4d:35:f0",
            "net3": "2e:90:4e:28:56:54",
            "net4": "e2:38:0a:56:94:d3",
            "net5": "ae:f6:b5:1d:87:8a",
            "net6": "ea:48:0a:20:a3:9a",
            "net7": "4e:9d:5a:a4:cb:34",
            "net8": "e2:c9:56:ee:64:74",
            "net9": "2e:98:e9:a2:a0:ca"
        },
        "tof_2_2_3": {
            "net0": "0a:5f:ee:9c:29:d2",
            "net1": "02:1d:b2:2a:aa:0a",
            "net10": "4e:06:4c:81:be:fe",
            "net11": "1a:69:f6:8a:2d:41",
            "net2": "4e:1d:df:5f:d3:83",
            "net3": "52:bf:f0:0c:4e:99",
            "net4": "a2:11:30:7e:f4:e2",
            "net5": "d2:b1:ad:b4:fc:bc",
            "net6": "f2:c7:d9:86:44:7f",
            "net7": "4a:1a:94:e2:fe:ca",
            "net8": "4a:db:e7:dd:2a:1b",
            "net9": "92:21:7c:f6:cf:e2"
        },
        "tof_2_2_4": {
            "net0": "32:fc:20:70:65:7b",
            "net1": "66:19:48:0e:d4:66",
            "net10": "3e:1c:e9:e0:ac:b6",
            "net11": "de:84:ef:45:18:23",
            "net2": "ee:9c:37:f0:c0:6e",
            "net3": "1a:73:b7:29:86:43",
            "net4": "f6:bc:8d:90:14:5a",
            "net5": "0a:83:13:63:48:14",
            "net6": "b2:75:a2:a2:b6:b0",
            "net7": "fa:67:32:b0:00:d1",
            "net8": "2e:39:f3:40:45:04",
            "net9": "7a:fa:ee:98:83:7a"
        },
        "tof_2_2_5": {
            "net0": "1e:d4:ed:72:80:4a",
            "net1": "7e:a2:d4:37:ba:8f",
            "net10": "de:52:41:51:e9:55",
            "net11": "fe:b2:63:c2:f3:9b",
            "net2": "0e:78:39:f1:61:a9",
            "net3": "22:8c:68:e6:8d:d7",
            "net4": "1a:10:da:b1:e8:ba",
            "net5": "0e:13:a4:04:be:22",
            "net6": "56:16:7f:3f:4a:61",
            "net7": "7e:45:05:24:8f:13",
            "net8": "3a:95:b2:e0:8d:d7",
            "net9": "8e:d7:8c:fe:44:17"
        },
        "tof_2_2_6": {
            "net0": "7a:93:73:d7:9b:9b",
            "net1": "fe:9c:7e:84:71:7b",
            "net10": "fa:cf:24:26:e6:79",
            "net11": "96:ce:35:c6:21:87",
            "net2": "8e:30:be:c1:64:9f",
            "net3": "96:4b:38:6c:d5:de",
            "net4": "6a:18:37:fa:c6:36",
            "net5": "42:45:5e:8f:87:b2",
            "net6": "fe:64:a5:39:a7:3a",
            "net7": "5a:bc:75:e8:59:45",
            "net8": "6e:47:a4:b3:21:49",
            "net9": "2e:b5:c0:e9:84:45"
        }
    },
    "failed_machine": "leaf_1_0_1",
    "failure_time": {
        "leaf_1_0_1": 1622551576.139908,
        "leaf_1_0_2": 1622551576.1546946,
        "leaf_1_0_3": 1622551576.163948,
        "leaf_1_0_4": 1622551576.1704152,
        "leaf_1_0_5": 1622551576.1805322,
        "leaf_1_0_6": 1622551576.1937208,
        "leaf_2_0_1": 1622551576.2014158,
        "leaf_2_0_2": 1622551576.2114582,
        "leaf_2_0_3": 1622551576.144695,
        "leaf_2_0_4": 1622551576.157537,
        "leaf_2_0_5": 1622551576.1712947,
        "leaf_2_0_6": 1622551576.1798203,
        "leaf_3_0_1": 1622551576.1872034,
        "leaf_3_0_2": 1622551576.196494,
        "leaf_3_0_3": 1622551576.2033958,
        "leaf_3_0_4": 1622551576.2117627,
        "leaf_3_0_5": 1622551576.2235746,
        "leaf_3_0_6": 1622551576.2376254,
        "leaf_4_0_1": 1622551576.2502658,
        "leaf_4_0_2": 1622551576.265146,
        "leaf_4_0_3": 1622551576.2767756,
        "leaf_4_0_4": 1622551576.2856402,
        "leaf_4_0_5": 1622551576.296561,
        "leaf_4_0_6": 1622551576.3114476,
        "spine_1_1_1": 1622551576.2234561,
        "spine_1_1_2": 1622551576.23371,
        "spine_1_1_3": 1622551576.2514465,
        "spine_1_1_4": 1622551576.2666898,
        "spine_1_1_5": 1622551576.2782638,
        "spine_1_1_6": 1622551576.289286,
        "spine_2_1_1": 1622551576.2987049,
        "spine_2_1_2": 1622551576.3116217,
        "spine_2_1_3": 1622551576.3214555,
        "spine_2_1_4": 1622551576.3279393,
        "spine_2_1_5": 1622551576.336959,
        "spine_2_1_6": 1622551576.3447983,
        "spine_3_1_1": 1622551576.3534164,
        "spine_3_1_2": 1622551576.3632607,
        "spine_3_1_3": 1622551576.3736145,
        "spine_3_1_4": 1622551576.3867474,
        "spine_3_1_5": 1622551576.3237696,
        "spine_3_1_6": 1622551576.330433,
        "spine_4_1_1": 1622551576.339882,
        "spine_4_1_2": 1622551576.3458385,
        "spine_4_1_3": 1622551576.3542461,
        "spine_4_1_4": 1622551576.365265,
        "spine_4_1_5": 1622551576.37631,
        "spine_4_1_6": 1622551576.3867211,
        "tof_1_2_1": 1622551576.397311,
        "tof_1_2_2": 1622551576.4099422,
        "tof_1_2_3": 1622551576.417153,
        "tof_1_2_4": 1622551576.4269607,
        "tof_1_2_5": 1622551576.4337182,
        "tof_1_2_6": 1622551576.443055,
        "tof_2_2_1": 1622551576.4535499,
        "tof_2_2_2": 1622551576.464148,
        "tof_2_2_3": 1622551576.4019701,
        "tof_2_2_4": 1622551576.4137034,
        "tof_2_2_5": 1622551576.4207053,
        "tof_2_2_6": 1622551576.4316282
    }
}