{
    "k_leaf": 2,
    "k_top": 2,
    "redundancy_factor": 1,
    "is_k8s": true,
    "machine_mac_addresses": {
        "leaf_1_0_1": {
            "net0": "82:1c:8b:5c:a3:7e",
            "net1": "6a:ca:0f:6f:63:be",
            "net2": "c6:20:8f:cc:17:32"
        },
        "leaf_1_0_2": {
            "net0": "0e:82:58:56:e2:6e",
            "net1": "12:9c:68:0d:78:15",
            "net2": "02:79:c8:1d:e5:ff"
        },
        "leaf_2_0_1": {
            "net0": "4a:0c:54:e1:1a:b8",
            "net1": "76:f0:9d:e9:b9:86",
            "net2": "12:c6:0e:a8:f2:52"
        },
        "leaf_2_0_2": {
            "net0": "62:5b:5f:b0:b9:2a",
            "net1": "e2:3b:59:22:7d:d6",
            "net2": "22:67:ce:38:d2:8d"
        },
        "leaf_3_0_1": {
            "net0": "5e:26:3f:8a:b6:31",
            "net1": "a6:ca:93:cb:6b:9c",
            "net2": "de:be:6a:3e:d0:26"
        },
        "leaf_3_0_2": {
            "net0": "aa:32:b0:70:da:fe",
            "net1": "b2:3d:d0:99:c1:19",
            "net2": "52:3b:38:35:d6:a1"
        },
        "leaf_4_0_1": {
            "net0": "36:45:9c:40:bb:77",
            "net1": "de:ba:6d:78:be:cd",
            "net2": "de:b7:0c:3d:2e:d8"
        },
        "leaf_4_0_2": {
            "net0": "aa:c0:83:39:bd:2d",
            "net1": "b2:d7:16:a8:00:9a",
            "net2": "7e:30:7a:ea:d4:9a"
        },
        "spine_1_1_1": {
            "net0": "be:3c:ca:87:5e:57",
            "net1": "12:94:a6:8c:d0:f0",
            "net2": "ca:c6:ce:5b:9c:15",
            "net3": "7e:b7:8d:95:76:5a"
        },
        "spine_1_1_2": {
            "net0": "46:0b:29:35:63:a1",
            "net1": "7a:e3:ab:e9:16:72",
            "net2": "d2:d7:48:a1:e6:57",
            "net3": "32:0b:b6:92:a1:48"
        },
        "spine_2_1_1": {
            "net0": "d6:0f:15:54:34:6d",
            "net1": "ea:b6:92:fc:ec:33",
            "net2": "9e:e0:58:9e:63:5f",
            "net3": "c2:14:94:3e:da:03"
        },
        "spine_2_1_2": {
            "net0": "ea:1a:a2:b1:d5:69",
            "net1": "ba:d1:59:ad:5e:59",
            "net2": "ba:3d:74:4e:32:3e",
            "net3": "8a:41:66:c1:b3:92"
        },
        "spine_3_1_1": {
            "net0": "4a:ac:cd:06:7f:79",
            "net1": "42:9e:73:a4:09:a9",
            "net2": "f6:90:17:66:0e:65",
            "net3": "22:ca:db:10:49:86"
        },
        "spine_3_1_2": {
            "net0": "22:89:bc:5c:f6:57",
            "net1": "9a:28:d2:3b:9f:ad",
            "net2": "ba:ee:d7:eb:5b:b4",
            "net3": "9e:eb:4c:25:1d:05"
        },
        "spine_4_1_1": {
            "net0": "26:82:13:28:32:a3",
            "net1": "26:1a:26:d2:ab:e9",
            "net2": "ca:c7:1f:48:59:48",
            "net3": "66:83:f5:29:35:99"
        },
        "spine_4_1_2": {
            "net0": "e2:35:dc:02:ff:77",
            "net1": "32:72:83:a2:a1:b3",
            "net2": "b2:05:11:aa:a4:6c",
            "net3": "c6:20:dd:cc:93:9c"
        },
        "tof_1_2_1": {
            "net0": "a2:ef:2f:0e:9b:6c",
            "net1": "d6:34:c7:98:01:ba",
            "net2": "ae:80:04:5b:7a:21",
            "net3": "be:68:fc:97:0c:b5"
        },
        "tof_1_2_2": {
            "net0": "be:c3:69:c3:06:b3",
            "net1": "fe:5f:49:ea:df:ec",
            "net2": "36:b0:bf:5a:e0:6a",
            "net3": "72:af:e9:cc:49:a3"
        },
        "tof_2_2_1": {
            "net0": "2e:87:ab:94:e9:ce",
            "net1": "ee:7e:d5:65:e3:8e",
            "net2": "ca:8f:46:f0:e7:f9",
            "net3": "e6:6e:05:cd:71:2b"
        },
        "tof_2_2_2": {
            "net0": "56:4b:89:31:e3:f6",
            "net1": "4a:12:17:19:56:b7",
            "net2": "2a:77:a7:70:21:84",
            "net3": "96:85:ec:c3:35:a1"
        }
    },
    "failed_machine": "tof_1_2_1",
    "failed_interfaces": [
        "net0"
    ],
    "failure_time": {
        "leaf_1_0_1": 1634598245.091688,
        "leaf_1_0_2": 1634598245.097601,
        "leaf_2_0_1": 1634598245.1191285,
        "leaf_2_0_2": 1634598245.1005466,
        "leaf_3_0_1": 1634598245.3447654,
        "leaf_3_0_2": 1634598245.3541477,
        "leaf_4_0_1": 1634598245.1739728,
        "leaf_4_0_2": 1634598245.2627184,
        "spine_1_1_1": 1634598245.3325067,
        "spine_1_1_2": 1634598245.5070186,
        "spine_2_1_1": 1634598245.6832092,
        "spine_2_1_2": 1634598245.6947615,
        "spine_3_1_1": 1634598245.66259,
        "spine_3_1_2": 1634598245.669025,
        "spine_4_1_1": 1634598245.6811283,
        "spine_4_1_2": 1634598245.6927502,
        "tof_1_2_1": 1634598245.704348,
        "tof_1_2_2": 1634598245.7252464,
        "tof_2_2_1": 1634598245.7054958,
        "tof_2_2_2": 1634598245.7912767
    },
    "recover_time": {
        "leaf_1_0_1": 1634598313.6914642,
        "leaf_1_0_2": 1634598313.9379976,
        "leaf_2_0_1": 1634598317.279041,
        "leaf_2_0_2": 1634598313.6899054,
        "leaf_3_0_1": 1634598313.7414212,
        "leaf_3_0_2": 1634598317.2347994,
        "leaf_4_0_1": 1634598319.2808638,
        "leaf_4_0_2": 1634598319.6383917,
        "spine_1_1_1": 1634598319.8394666,
        "spine_1_1_2": 1634598319.2742555,
        "spine_2_1_1": 1634598319.6394742,
        "spine_2_1_2": 1634598321.1288788,
        "spine_3_1_1": 1634598321.5904365,
        "spine_3_1_2": 1634598322.1944838,
        "spine_4_1_1": 1634598322.8450918,
        "spine_4_1_2": 1634598322.1924303,
        "tof_1_2_1": 1634598322.4198048,
        "tof_1_2_2": 1634598322.8452299,
        "tof_2_2_1": 1634598323.2024798,
        "tof_2_2_2": 1634598325.2901082
    }
}