{
    "description": "Scenario 4c: ToF tof_1_2_1 failure and recovery with BGP",
    "k_leaf": 10,
    "k_top": 10,
    "redundancy_factor": 5,
    "is_k8s": true,
    "machine_mac_addresses": {
        "leaf_1_0_1": {
            "net0": "12:ec:7c:8d:75:4d",
            "net1": "3a:c7:33:50:72:78",
            "net10": "8e:c8:d2:dd:19:46",
            "net2": "a6:f0:24:a2:ab:42",
            "net3": "6a:fb:bc:e0:d5:3f",
            "net4": "fe:15:4f:69:76:13",
            "net5": "6e:27:4d:30:9d:de",
            "net6": "36:b5:49:a5:a4:2e",
            "net7": "76:e2:9d:21:4d:57",
            "net8": "72:ec:9b:73:8c:0e",
            "net9": "96:80:49:a2:c3:1d"
        },
        "leaf_1_0_10": {
            "net0": "be:a7:39:38:54:dc",
            "net1": "92:73:dc:49:01:67",
            "net10": "1e:d9:e2:30:ca:c4",
            "net2": "26:c2:de:7a:f9:da",
            "net3": "62:b5:5c:22:eb:93",
            "net4": "c6:2f:e4:c3:00:7d",
            "net5": "5a:6a:af:19:67:1e",
            "net6": "1e:1e:d9:9e:d8:db",
            "net7": "96:80:7c:ee:2a:29",
            "net8": "ee:01:fc:fc:d9:83",
            "net9": "1e:34:fe:32:c9:6e"
        },
        "leaf_1_0_2": {
            "net0": "02:26:1d:ff:fa:b7",
            "net1": "4a:bc:86:92:07:85",
            "net10": "46:0a:78:4c:a0:3b",
            "net2": "9a:09:53:0c:11:41",
            "net3": "66:c8:cf:1e:b6:c9",
            "net4": "1e:3c:d8:32:db:9f",
            "net5": "4a:f8:b5:b6:31:ca",
            "net6": "7e:0f:9b:a9:8b:25",
            "net7": "5a:bf:3d:dd:1f:70",
            "net8": "ee:5d:8e:14:42:57",
            "net9": "1e:bc:f0:7f:66:a7"
        },
        "leaf_1_0_3": {
            "net0": "5a:81:77:e4:f7:b3",
            "net1": "f6:b0:08:e5:11:91",
            "net10": "86:fd:a7:ad:94:35",
            "net2": "1a:98:94:ba:44:8f",
            "net3": "66:cc:ba:12:e5:d0",
            "net4": "7a:f1:aa:0d:57:14",
            "net5": "b6:b3:49:b6:65:8c",
            "net6": "6e:dd:6f:01:01:96",
            "net7": "c2:f5:44:4e:b9:12",
            "net8": "92:a2:15:ab:d7:d3",
            "net9": "de:a9:b5:2b:aa:c3"
        },
        "leaf_1_0_4": {
            "net0": "56:5a:b7:b1:83:37",
            "net1": "a6:ad:0e:ae:b3:1f",
            "net10": "26:25:4b:7e:18:19",
            "net2": "b2:fa:e8:ee:0f:66",
            "net3": "c6:75:b1:88:cc:fb",
            "net4": "ee:e7:59:ae:86:77",
            "net5": "a2:74:20:da:2f:30",
            "net6": "7e:b6:8f:7e:c6:9d",
            "net7": "ae:f9:a7:ed:47:9a",
            "net8": "ba:09:87:29:83:84",
            "net9": "ea:31:e4:ff:53:a0"
        },
        "leaf_1_0_5": {
            "net0": "be:3c:8d:08:e8:2f",
            "net1": "b6:e7:8e:94:4e:2c",
            "net10": "e6:a4:3f:7b:0b:78",
            "net2": "1a:9d:37:ab:3e:40",
            "net3": "d6:cd:4e:5f:52:13",
            "net4": "d2:5d:64:ac:84:21",
            "net5": "b6:0e:54:c9:0f:e6",
            "net6": "5a:74:df:c0:ca:bd",
            "net7": "ce:36:d4:14:4f:49",
            "net8": "da:36:4f:83:f4:00",
            "net9": "fa:33:ec:57:2e:d1"
        },
        "leaf_1_0_6": {
            "net0": "be:e7:7a:cf:5a:54",
            "net1": "02:32:d3:9b:be:10",
            "net10": "fa:30:cd:8d:fc:76",
            "net2": "aa:52:bc:f9:d2:90",
            "net3": "3a:85:e3:db:29:f6",
            "net4": "d6:0d:41:be:36:09",
            "net5": "a2:36:96:ef:4f:5d",
            "net6": "fe:a3:e1:b9:87:cc",
            "net7": "8e:68:bf:a1:70:20",
            "net8": "9e:4d:6e:d9:20:df",
            "net9": "9e:9e:7d:69:3b:9a"
        },
        "leaf_1_0_7": {
            "net0": "da:d1:df:44:55:f2",
            "net1": "b6:fe:50:c6:fd:4c",
            "net10": "ce:af:ed:1b:81:35",
            "net2": "76:ef:de:73:f1:62",
            "net3": "26:2b:9f:b3:f8:6f",
            "net4": "5e:69:b0:31:01:36",
            "net5": "52:24:c5:84:37:0a",
            "net6": "be:15:ab:ca:70:1a",
            "net7": "26:15:98:4d:87:b9",
            "net8": "ae:7e:06:94:70:91",
            "net9": "ba:f7:a0:9d:68:7f"
        },
        "leaf_1_0_8": {
            "net0": "4e:6a:31:04:81:7c",
            "net1": "ba:6b:5c:a5:a9:72",
            "net10": "9e:9a:1d:1c:ce:b7",
            "net2": "b2:51:05:fe:9b:4a",
            "net3": "22:75:44:fa:75:0c",
            "net4": "ee:81:1d:dc:9a:c3",
            "net5": "b6:2b:63:51:e7:c8",
            "net6": "ea:8c:b0:a6:81:23",
            "net7": "3e:bc:e3:9a:11:9b",
            "net8": "a2:d9:26:b2:eb:8e",
            "net9": "72:ad:96:d7:14:c0"
        },
        "leaf_1_0_9": {
            "net0": "e2:7f:1f:e8:15:0f",
            "net1": "3a:60:4d:35:57:ef",
            "net10": "6a:b3:5d:9b:a4:ce",
            "net2": "ee:e4:21:92:a4:c5",
            "net3": "06:6d:84:32:80:fd",
            "net4": "1e:d0:29:0a:07:98",
            "net5": "7e:d6:29:83:a7:a8",
            "net6": "46:8b:76:da:f8:66",
            "net7": "7e:69:b2:83:c1:61",
            "net8": "46:28:e8:a0:6e:92",
            "net9": "e2:5e:41:ab:a5:81"
        },
        "leaf_2_0_1": {
            "net0": "de:1f:60:34:62:5e",
            "net1": "5a:bc:be:17:ad:8a",
            "net10": "42:bb:7c:bd:a3:1a",
            "net2": "66:25:9d:5a:3f:ce",
            "net3": "56:95:65:fa:ab:89",
            "net4": "a2:10:9e:4b:6e:f5",
            "net5": "12:49:44:94:b9:9e",
            "net6": "52:75:d5:c5:24:2b",
            "net7": "e2:c3:54:45:be:ab",
            "net8": "da:20:40:a9:fb:5f",
            "net9": "0e:2d:1e:fa:d7:70"
        },
        "leaf_2_0_10": {
            "net0": "fa:9f:06:ab:2f:71",
            "net1": "86:83:84:03:f6:b3",
            "net10": "6e:ef:d7:2b:7a:db",
            "net2": "12:4e:eb:f6:a4:f4",
            "net3": "2e:29:90:42:91:13",
            "net4": "22:76:17:34:34:5a",
            "net5": "52:22:39:ff:7b:1e",
            "net6": "6e:58:ba:65:d4:7e",
            "net7": "3a:71:21:c1:00:f9",
            "net8": "b6:c9:35:9b:4d:05",
            "net9": "16:65:e8:16:9f:81"
        },
        "leaf_2_0_2": {
            "net0": "72:f0:9d:7a:37:2b",
            "net1": "b2:5c:c9:e7:5c:3a",
            "net10": "d6:38:b9:e4:7d:2c",
            "net2": "46:83:67:39:80:a1",
            "net3": "0a:31:81:db:c2:96",
            "net4": "fe:ab:5e:4c:73:94",
            "net5": "d6:b6:c5:78:13:7f",
            "net6": "26:38:97:b2:c1:da",
            "net7": "f6:ea:80:c7:94:b5",
            "net8": "16:71:b6:e7:1b:41",
            "net9": "82:8e:9e:42:d2:be"
        },
        "leaf_2_0_3": {
            "net0": "32:a9:99:3f:eb:87",
            "net1": "a2:21:2f:ce:26:ee",
            "net10": "42:75:5d:74:c2:ec",
            "net2": "d2:96:0d:d2:04:82",
            "net3": "62:47:77:c5:a6:f0",
            "net4": "5a:5d:5e:33:fa:3c",
            "net5": "56:ab:1f:a2:1b:7b",
            "net6": "02:7d:33:37:c2:84",
            "net7": "de:dd:24:37:8d:06",
            "net8": "3e:a0:e8:09:28:4d",
            "net9": "66:64:22:da:b1:13"
        },
        "leaf_2_0_4": {
            "net0": "06:ab:84:8d:7a:92",
            "net1": "a2:16:52:da:53:a5",
            "net10": "1e:e0:9c:1d:21:1c",
            "net2": "36:86:26:ec:9b:d4",
            "net3": "7a:b3:51:47:79:a7",
            "net4": "d2:cf:2b:de:29:cc",
            "net5": "b6:87:f6:6c:86:61",
            "net6": "82:2c:ab:1f:17:53",
            "net7": "72:0f:29:be:78:56",
            "net8": "c2:50:c4:83:be:25",
            "net9": "6a:65:b6:79:b0:68"
        },
        "leaf_2_0_5": {
            "net0": "9a:fd:08:cb:6a:fc",
            "net1": "2a:50:01:ec:cd:e9",
            "net10": "62:b6:57:e1:3e:e3",
            "net2": "6e:7f:76:09:b2:61",
            "net3": "6e:e0:58:30:de:90",
            "net4": "ca:6e:30:3b:a3:16",
            "net5": "56:18:26:1e:92:7f",
            "net6": "2e:31:9f:c0:de:f6",
            "net7": "ba:4c:3d:70:23:99",
            "net8": "ee:eb:95:ea:6a:79",
            "net9": "72:36:c9:9a:9d:d2"
        },
        "leaf_2_0_6": {
            "net0": "fa:eb:a5:31:36:47",
            "net1": "9a:ad:a1:e5:c3:3b",
            "net10": "ea:29:c5:c2:37:49",
            "net2": "36:d6:8e:5a:00:c9",
            "net3": "62:76:73:b8:ca:ee",
            "net4": "6a:2b:6f:69:1a:d9",
            "net5": "46:a9:65:a5:aa:ec",
            "net6": "86:46:86:d6:2e:84",
            "net7": "ea:91:2f:c8:8f:e8",
            "net8": "52:d2:a5:83:2a:48",
            "net9": "62:a1:ad:b5:6a:53"
        },
        "leaf_2_0_7": {
            "net0": "e2:4f:30:e8:94:e2",
            "net1": "76:8a:13:96:76:17",
            "net10": "6e:b5:dc:3a:59:7a",
            "net2": "ae:5d:44:62:3c:ca",
            "net3": "36:41:57:d7:77:59",
            "net4": "d2:55:45:75:a3:2d",
            "net5": "62:74:05:eb:b5:56",
            "net6": "46:4c:4d:0c:02:94",
            "net7": "d6:89:21:e4:74:f5",
            "net8": "f2:07:53:85:df:9e",
            "net9": "56:8a:5c:01:3c:ef"
        },
        "leaf_2_0_8": {
            "net0": "16:a5:fd:01:61:b5",
            "net1": "a6:16:00:18:5a:ba",
            "net10": "c6:fa:1d:46:56:41",
            "net2": "76:dd:5f:53:cc:e4",
            "net3": "2a:42:38:d7:f0:9b",
            "net4": "62:4e:51:ca:c7:8b",
            "net5": "ea:a0:d9:bf:ec:b2",
            "net6": "a2:15:30:7c:de:c4",
            "net7": "d2:1e:0a:33:a9:a4",
            "net8": "9e:70:35:10:f6:e2",
            "net9": "1a:c2:2a:c4:bd:e4"
        },
        "leaf_2_0_9": {
            "net0": "fa:ec:22:63:0f:cd",
            "net1": "72:cb:e8:a5:25:66",
            "net10": "da:82:ed:eb:16:43",
            "net2": "aa:70:3e:5e:34:d6",
            "net3": "26:5f:b1:25:0c:7a",
            "net4": "26:1b:57:d2:61:c5",
            "net5": "12:93:20:a3:f1:81",
            "net6": "a2:5b:c3:c1:fb:d5",
            "net7": "fe:99:1b:ee:70:9d",
            "net8": "e6:6d:00:d6:48:c7",
            "net9": "46:15:8d:e3:cf:78"
        },
        "leaf_3_0_1": {
            "net0": "62:3a:93:5f:05:84",
            "net1": "6a:ad:7a:70:9b:86",
            "net10": "ea:68:b4:87:f7:88",
            "net2": "c6:76:ae:34:4d:7b",
            "net3": "9e:39:b0:73:f6:3b",
            "net4": "9a:00:85:1c:fd:ac",
            "net5": "26:81:68:13:dd:2e",
            "net6": "0e:31:80:11:45:e0",
            "net7": "4e:1c:a0:d9:82:12",
            "net8": "4e:db:60:6e:f2:55",
            "net9": "5e:a5:fc:fd:fb:36"
        },
        "leaf_3_0_10": {
            "net0": "6a:8b:55:3b:fe:5a",
            "net1": "c6:e4:d1:be:c5:a3",
            "net10": "e6:31:de:d5:f3:ce",
            "net2": "aa:ea:43:a8:63:28",
            "net3": "86:7b:ac:2b:2c:66",
            "net4": "82:c3:e4:85:25:09",
            "net5": "d6:c4:29:23:3a:23",
            "net6": "aa:32:55:e5:b4:86",
            "net7": "0e:55:56:26:52:91",
            "net8": "a6:48:c4:fc:d9:4c",
            "net9": "9e:17:72:6f:f4:f4"
        },
        "leaf_3_0_2": {
            "net0": "2a:f4:48:75:00:21",
            "net1": "36:7f:65:0b:84:63",
            "net10": "fa:98:b9:b6:ba:82",
            "net2": "7a:22:17:e1:7c:38",
            "net3": "4e:ba:6d:8f:ee:26",
            "net4": "02:4b:b7:38:00:de",
            "net5": "de:1b:a1:cb:e6:63",
            "net6": "da:34:0a:85:3f:e9",
            "net7": "26:18:ed:ce:3c:f7",
            "net8": "42:77:f6:a6:ef:9f",
            "net9": "0a:d4:ec:6b:57:26"
        },
        "leaf_3_0_3": {
            "net0": "4a:de:6e:d0:37:f0",
            "net1": "12:52:c2:2f:29:24",
            "net10": "92:a9:fd:f8:30:58",
            "net2": "82:28:2a:5d:9d:a8",
            "net3": "32:78:a1:ee:86:a9",
            "net4": "8a:50:f3:17:66:93",
            "net5": "e2:5d:09:e5:56:f1",
            "net6": "ce:47:bd:8b:9c:a1",
            "net7": "ce:40:75:23:de:bb",
            "net8": "4a:c1:29:3c:48:0b",
            "net9": "aa:4f:3b:06:74:45"
        },
        "leaf_3_0_4": {
            "net0": "22:cb:0f:ed:e1:ef",
            "net1": "3a:f5:08:4b:c7:30",
            "net10": "da:b6:28:38:5b:5d",
            "net2": "de:9c:a9:bf:d0:69",
            "net3": "56:a7:72:b3:7b:32",
            "net4": "9e:c8:64:2e:8d:b0",
            "net5": "9a:e3:e3:f8:72:1b",
            "net6": "d2:1d:79:70:37:6a",
            "net7": "7e:87:f6:64:83:f3",
            "net8": "c2:30:30:df:55:49",
            "net9": "b6:53:97:7a:7a:14"
        },
        "leaf_3_0_5": {
            "net0": "02:38:c8:ac:a0:3c",
            "net1": "3e:2e:a5:c6:c7:f5",
            "net10": "be:ba:3b:15:36:86",
            "net2": "06:22:7e:c0:3f:68",
            "net3": "42:b3:48:9f:d3:9c",
            "net4": "66:82:d9:b0:00:6e",
            "net5": "a6:3f:97:95:f1:2c",
            "net6": "ca:c7:b4:65:0c:7c",
            "net7": "32:06:ce:b1:3b:59",
            "net8": "8a:81:29:cd:41:b1",
            "net9": "4a:ba:a7:6d:33:42"
        },
        "leaf_3_0_6": {
            "net0": "8e:ce:07:80:eb:10",
            "net1": "4e:0d:a8:1a:d6:84",
            "net10": "12:3d:ed:66:36:d8",
            "net2": "76:ed:d4:1f:83:7e",
            "net3": "56:64:dd:56:11:d0",
            "net4": "ca:20:14:0c:11:8c",
            "net5": "0e:00:56:2a:03:86",
            "net6": "32:f7:1b:73:08:ed",
            "net7": "26:9a:92:ae:c5:ef",
            "net8": "92:57:09:dc:61:33",
            "net9": "4a:e0:9c:68:89:ee"
        },
        "leaf_3_0_7": {
            "net0": "0a:f0:9d:05:6b:da",
            "net1": "b6:63:01:e5:2f:e8",
            "net10": "2a:19:fa:5e:af:1c",
            "net2": "82:5b:95:c7:43:5c",
            "net3": "ce:5a:73:8c:27:1a",
            "net4": "aa:55:cd:67:23:b5",
            "net5": "d2:5b:00:29:88:db",
            "net6": "a2:98:f5:12:4a:31",
            "net7": "6a:27:06:58:6d:fd",
            "net8": "9a:83:ce:9a:e1:6f",
            "net9": "3e:1c:80:60:2e:c2"
        },
        "leaf_3_0_8": {
            "net0": "3e:d8:c9:bd:d8:ce",
            "net1": "5a:93:ac:69:ff:6c",
            "net10": "62:ea:63:f8:c9:cc",
            "net2": "42:16:aa:63:ff:99",
            "net3": "e2:1d:e0:b7:c3:ea",
            "net4": "6a:c8:c4:84:6c:7b",
            "net5": "ca:af:78:e9:f8:71",
            "net6": "2e:80:1f:8f:ad:76",
            "net7": "52:5e:cc:3b:d5:6c",
            "net8": "e2:9f:72:16:de:ba",
            "net9": "da:5c:a5:30:05:13"
        },
        "leaf_3_0_9": {
            "net0": "6e:c4:e0:d1:88:76",
            "net1": "2e:d0:6f:12:05:3f",
            "net10": "2e:31:46:9b:70:2c",
            "net2": "6e:cc:39:49:a8:39",
            "net3": "9a:77:ab:dc:4c:3d",
            "net4": "f2:3b:41:c5:2d:ad",
            "net5": "8a:ee:e5:be:7a:77",
            "net6": "96:9e:8d:1a:f5:9d",
            "net7": "de:1d:e2:48:4f:6b",
            "net8": "a2:35:a8:f9:0d:8d",
            "net9": "8a:24:3e:83:21:2a"
        },
        "leaf_4_0_1": {
            "net0": "1a:57:f0:df:37:53",
            "net1": "ce:90:c1:58:45:e9",
            "net10": "42:d1:f2:a2:a1:1b",
            "net2": "de:4b:be:13:1b:55",
            "net3": "0e:04:c3:f7:0d:5a",
            "net4": "86:1c:f6:ae:63:ff",
            "net5": "ae:7b:d8:dc:80:46",
            "net6": "6a:04:03:35:ee:b8",
            "net7": "de:98:6b:d7:02:f4",
            "net8": "76:7f:e0:1b:d2:75",
            "net9": "06:d0:14:c1:47:3e"
        },
        "leaf_4_0_10": {
            "net0": "76:a4:4a:bb:de:55",
            "net1": "c2:2b:6d:af:1c:44",
            "net10": "02:e0:6a:5d:23:c6",
            "net2": "4a:29:78:a0:d2:d4",
            "net3": "36:20:3c:0f:ad:fb",
            "net4": "f6:9b:91:b4:2a:15",
            "net5": "0a:9c:6b:fb:be:9f",
            "net6": "aa:ee:1d:b1:44:48",
            "net7": "3a:52:87:47:ed:18",
            "net8": "0e:36:55:b1:db:e7",
            "net9": "62:98:de:88:47:92"
        },
        "leaf_4_0_2": {
            "net0": "46:5e:fb:42:18:1b",
            "net1": "76:61:97:3b:50:14",
            "net10": "66:5e:17:f6:6f:2f",
            "net2": "1a:fe:97:8c:0f:3a",
            "net3": "9a:6a:4b:b4:f0:27",
            "net4": "aa:67:c7:bf:ff:50",
            "net5": "d6:a7:6e:b6:0a:0a",
            "net6": "ba:09:99:2b:8f:76",
            "net7": "3a:88:d1:eb:7b:7a",
            "net8": "9e:41:46:ea:0d:b8",
            "net9": "da:50:c4:be:68:98"
        },
        "leaf_4_0_3": {
            "net0": "5a:de:de:4c:01:66",
            "net1": "42:54:66:97:11:e3",
            "net10": "5a:a9:24:f9:ca:71",
            "net2": "ba:0a:fe:44:a3:66",
            "net3": "f2:dc:4f:13:08:78",
            "net4": "b2:d8:d4:c6:e2:b2",
            "net5": "6e:c9:67:ca:42:20",
            "net6": "62:63:aa:a2:53:df",
            "net7": "da:60:5b:6b:3b:86",
            "net8": "e2:80:c1:41:cc:05",
            "net9": "8a:ca:15:d2:ef:36"
        },
        "leaf_4_0_4": {
            "net0": "76:b9:c3:af:87:fb",
            "net1": "16:b2:98:3f:a4:a5",
            "net10": "ee:f3:49:50:64:ab",
            "net2": "2a:bd:d2:f1:c0:e4",
            "net3": "de:ef:c9:2e:e5:b7",
            "net4": "56:44:62:71:c2:5b",
            "net5": "76:a1:b3:c8:98:d1",
            "net6": "4a:dc:4c:4a:bb:1e",
            "net7": "06:dd:14:af:b6:a9",
            "net8": "02:28:7a:df:53:ac",
            "net9": "6e:be:a9:63:3c:7a"
        },
        "leaf_4_0_5": {
            "net0": "a2:2d:9b:23:4c:c2",
            "net1": "ca:81:40:cd:dc:c9",
            "net10": "56:31:26:84:ac:78",
            "net2": "ba:d4:0e:7b:fd:a0",
            "net3": "4a:f9:94:98:71:7e",
            "net4": "26:a1:d9:8b:fa:51",
            "net5": "ce:8a:83:ae:83:f1",
            "net6": "c2:f5:14:35:8a:55",
            "net7": "be:d6:53:87:04:1e",
            "net8": "ce:c8:80:c0:dd:42",
            "net9": "0e:c9:62:d4:00:ae"
        },
        "leaf_4_0_6": {
            "net0": "e6:43:c5:69:9c:a8",
            "net1": "76:c3:3c:23:40:c4",
            "net10": "6e:2c:62:87:2a:b1",
            "net2": "22:2c:cb:4d:36:9a",
            "net3": "be:5b:23:4b:8d:ab",
            "net4": "7e:21:59:c5:14:8e",
            "net5": "4e:db:cc:31:a8:29",
            "net6": "c2:c1:6f:3f:dc:2d",
            "net7": "f6:c4:6e:30:60:4a",
            "net8": "2e:b4:3a:ee:c1:a7",
            "net9": "fa:3d:8c:f0:09:c2"
        },
        "leaf_4_0_7": {
            "net0": "66:bc:d0:ae:f7:87",
            "net1": "a6:cb:2b:7b:8d:c1",
            "net10": "be:96:70:68:39:6a",
            "net2": "76:6f:e7:3d:b5:d5",
            "net3": "da:ec:86:b3:02:ea",
            "net4": "ae:f1:59:4d:f7:4c",
            "net5": "6a:8c:0e:d3:65:46",
            "net6": "da:5b:8e:a9:a0:ce",
            "net7": "f2:d6:a4:9a:48:93",
            "net8": "c2:86:6c:63:82:93",
            "net9": "76:a0:c9:0a:a1:c8"
        },
        "leaf_4_0_8": {
            "net0": "92:1a:fb:2c:b8:82",
            "net1": "32:1d:5a:4f:46:bb",
            "net10": "36:76:70:81:1d:f3",
            "net2": "be:83:e7:13:68:ab",
            "net3": "2a:70:d8:6a:e5:a0",
            "net4": "a2:cc:d0:62:a0:13",
            "net5": "ca:2d:84:e6:9c:8d",
            "net6": "b6:fb:bf:a1:99:b0",
            "net7": "f6:5e:9a:6e:b9:b3",
            "net8": "2a:60:15:d5:04:f3",
            "net9": "62:cf:8e:f1:4a:15"
        },
        "leaf_4_0_9": {
            "net0": "2a:c7:2f:e8:b4:85",
            "net1": "b6:f4:16:57:69:12",
            "net10": "8a:1e:e6:04:d2:b6",
            "net2": "5a:6e:a6:72:78:b5",
            "net3": "7e:e8:8d:ac:fa:30",
            "net4": "aa:ab:40:c9:b7:03",
            "net5": "96:d3:de:a5:f6:b0",
            "net6": "aa:4d:5a:ce:96:e7",
            "net7": "56:af:51:46:0c:cb",
            "net8": "42:bf:17:64:93:1a",
            "net9": "6a:4e:f9:f8:a0:1d"
        },
        "spine_1_1_1": {
            "net0": "32:f6:d4:2e:a1:0a",
            "net1": "a6:95:37:45:b2:6d",
            "net10": "e2:35:0b:19:11:20",
            "net11": "86:13:86:65:46:d7",
            "net12": "c2:bb:e5:b6:9c:26",
            "net13": "d2:d9:0f:19:74:9a",
            "net14": "aa:2a:78:37:32:c0",
            "net15": "ca:61:09:a5:68:36",
            "net16": "d2:81:be:b0:f4:62",
            "net17": "a6:8f:f2:aa:d4:34",
            "net18": "76:da:21:a6:15:e7",
            "net19": "82:8c:54:6d:aa:d3",
            "net2": "be:52:ec:a8:f9:91",
            "net3": "42:03:aa:e1:8a:87",
            "net4": "72:40:28:8e:96:c8",
            "net5": "6a:b4:45:46:b6:45",
            "net6": "16:22:fb:cd:68:9a",
            "net7": "7a:9a:a1:13:3c:21",
            "net8": "1e:e9:3a:5d:42:c4",
            "net9": "b2:6b:e0:72:e8:81"
        },
        "spine_1_1_10": {
            "net0": "d6:31:4e:12:34:6c",
            "net1": "8a:cb:e9:f2:86:c8",
            "net10": "62:12:62:52:b1:83",
            "net11": "56:e1:9d:29:a1:a6",
            "net12": "d6:8b:21:5c:b4:54",
            "net13": "5e:12:a9:98:b5:47",
            "net14": "4e:2e:cf:27:2b:de",
            "net15": "42:59:df:fd:ec:8d",
            "net16": "36:1a:98:69:3a:fd",
            "net17": "ba:04:60:f8:f2:19",
            "net18": "1e:5c:d1:62:5a:fe",
            "net19": "4e:db:46:3f:50:f9",
            "net2": "ca:d9:57:0e:83:af",
            "net3": "96:bc:57:7f:be:e0",
            "net4": "7a:55:28:a9:d5:14",
            "net5": "66:58:23:ca:37:a8",
            "net6": "4e:7c:49:6a:00:f5",
            "net7": "5e:f4:e2:37:a9:2d",
            "net8": "ae:d6:66:3b:11:e4",
            "net9": "8e:4b:cd:cc:f6:4c"
        },
        "spine_1_1_2": {
            "net0": "2a:04:c6:8d:71:43",
            "net1": "1e:29:a1:9a:3d:d8",
            "net10": "06:cf:ae:a5:8e:af",
            "net11": "8e:db:31:d5:2b:55",
            "net12": "7e:0a:3c:f4:d8:14",
            "net13": "96:38:08:89:fd:4c",
            "net14": "da:c8:d4:16:84:89",
            "net15": "e2:45:e9:35:91:36",
            "net16": "e2:5e:e0:3a:15:82",
            "net17": "d2:25:60:44:35:91",
            "net18": "da:35:c9:95:cc:38",
            "net19": "16:91:93:c7:3f:4b",
            "net2": "3a:c7:87:7b:ed:35",
            "net3": "02:39:f5:b2:cd:b9",
            "net4": "52:b6:bc:d8:75:8e",
            "net5": "aa:1e:31:8a:3e:c9",
            "net6": "56:11:53:84:79:91",
            "net7": "4e:37:ad:3d:b7:19",
            "net8": "42:7e:07:c3:5c:ca",
            "net9": "12:57:cd:43:9c:29"
        },
        "spine_1_1_3": {
            "net0": "9a:c0:47:79:29:91",
            "net1": "2a:9a:77:08:a1:eb",
            "net10": "72:a5:cc:7f:62:a2",
            "net11": "c6:a3:b1:4e:71:3e",
            "net12": "02:57:b7:11:a3:10",
            "net13": "ca:73:8c:18:b0:62",
            "net14": "26:5b:cf:30:b0:bf",
            "net15": "1a:9c:e7:ad:fe:f8",
            "net16": "8a:61:53:65:e9:4d",
            "net17": "d2:9e:57:82:4e:ba",
            "net18": "3a:e6:9e:8b:86:29",
            "net19": "56:3c:e3:8f:d8:09",
            "net2": "46:58:be:7c:63:19",
            "net3": "d2:fb:30:6c:4c:f6",
            "net4": "f2:24:8b:44:ae:cd",
            "net5": "9a:d5:d8:8f:03:88",
            "net6": "f6:84:67:d9:f3:ce",
            "net7": "b2:df:8b:fa:91:75",
            "net8": "aa:d9:91:0d:33:f7",
            "net9": "8e:38:a6:8d:62:8e"
        },
        "spine_1_1_4": {
            "net0": "1e:3c:39:b7:b8:92",
            "net1": "0a:91:4b:c5:69:5c",
            "net10": "b2:40:b8:69:72:f1",
            "net11": "02:eb:ea:5b:7b:32",
            "net12": "ce:8b:74:c8:c5:2e",
            "net13": "c2:89:49:a3:45:91",
            "net14": "aa:40:bc:fd:66:5d",
            "net15": "0e:9f:94:0f:a7:70",
            "net16": "ce:6b:84:26:18:5c",
            "net17": "b2:7f:ca:93:a3:be",
            "net18": "12:0b:e2:c3:ba:63",
            "net19": "7a:c4:a7:57:69:5c",
            "net2": "da:6a:e1:4e:1b:9e",
            "net3": "0e:c7:63:c4:b9:e4",
            "net4": "d2:70:b1:d5:74:71",
            "net5": "76:8e:89:ce:ee:e7",
            "net6": "ee:34:e0:b5:27:27",
            "net7": "7e:56:8c:5a:42:a1",
            "net8": "a6:86:12:f7:cf:5e",
            "net9": "46:b2:70:c8:46:2c"
        },
        "spine_1_1_5": {
            "net0": "de:70:f2:c2:75:14",
            "net1": "ca:bf:a2:23:78:34",
            "net10": "32:eb:bb:36:1f:5e",
            "net11": "f2:48:30:0e:92:21",
            "net12": "ee:44:ff:84:8e:78",
            "net13": "3a:11:b1:0a:75:9a",
            "net14": "86:69:4a:7b:cc:e6",
            "net15": "e6:b4:ba:d5:29:4c",
            "net16": "6e:a0:f5:21:63:9e",
            "net17": "26:d9:dc:2f:f1:a0",
            "net18": "92:dc:34:75:75:ed",
            "net19": "a6:b5:e2:c7:2c:82",
            "net2": "76:63:32:59:c9:e8",
            "net3": "f2:45:6f:b0:6f:57",
            "net4": "0a:b2:20:01:ae:6e",
            "net5": "1e:b9:50:ba:83:11",
            "net6": "46:f0:53:fd:91:c9",
            "net7": "b6:f2:4b:b6:88:a0",
            "net8": "0a:02:27:70:df:09",
            "net9": "12:61:9b:5a:ef:49"
        },
        "spine_1_1_6": {
            "net0": "a2:31:1a:25:68:3a",
            "net1": "9e:0a:80:72:3f:7b",
            "net10": "fe:11:15:d4:62:c1",
            "net11": "a2:1f:00:e9:19:99",
            "net12": "ba:23:ca:3d:9b:c7",
            "net13": "9e:0c:86:31:23:00",
            "net14": "4e:10:ab:e0:ea:f1",
            "net15": "e2:ba:54:f2:f8:89",
            "net16": "2e:72:df:7a:c6:e1",
            "net17": "02:b3:3f:38:dd:e6",
            "net18": "52:87:72:c6:ed:d7",
            "net19": "06:0e:b9:6c:9a:0d",
            "net2": "b2:74:69:4b:5c:1f",
            "net3": "22:fa:b9:28:c6:4f",
            "net4": "2a:1a:e9:5f:1b:94",
            "net5": "1e:7d:b0:95:c6:4b",
            "net6": "92:1d:7a:c8:28:b5",
            "net7": "36:8d:5d:2b:6a:57",
            "net8": "ee:98:f5:3f:83:0e",
            "net9": "ee:44:92:5e:85:b0"
        },
        "spine_1_1_7": {
            "net0": "16:f4:7e:95:a2:2d",
            "net1": "5a:3d:49:b6:92:50",
            "net10": "b6:ab:8b:32:15:4e",
            "net11": "56:7c:1d:6b:1f:dd",
            "net12": "32:f4:a2:58:dc:14",
            "net13": "1a:31:31:52:0a:44",
            "net14": "06:20:eb:9b:87:46",
            "net15": "1e:75:af:82:ed:1e",
            "net16": "66:01:3e:c9:09:4e",
            "net17": "92:84:c6:14:48:66",
            "net18": "62:76:64:5f:60:99",
            "net19": "2e:5d:4d:bd:3a:99",
            "net2": "8e:81:59:1f:4c:74",
            "net3": "3e:90:ae:f1:10:ec",
            "net4": "72:62:d8:88:55:ef",
            "net5": "ae:2b:bd:59:c9:c0",
            "net6": "9e:7d:72:23:6c:91",
            "net7": "5a:63:b0:ef:5d:c2",
            "net8": "96:35:00:1f:0e:f3",
            "net9": "e6:de:dc:1b:62:e5"
        },
        "spine_1_1_8": {
            "net0": "8e:48:29:a0:c8:14",
            "net1": "8e:b5:e8:19:00:bb",
            "net10": "66:1a:7e:40:21:20",
            "net11": "b6:41:7f:ba:e7:c2",
            "net12": "a2:d3:2d:80:44:5b",
            "net13": "62:96:da:18:5a:7f",
            "net14": "86:bf:3f:37:75:98",
            "net15": "c6:2f:fb:db:45:76",
            "net16": "de:53:d9:a2:24:c3",
            "net17": "22:7e:aa:af:a1:4d",
            "net18": "d2:21:de:a5:8f:13",
            "net19": "06:0f:53:47:f0:8a",
            "net2": "12:32:dc:fc:05:82",
            "net3": "e2:5b:ce:38:f6:b8",
            "net4": "ca:aa:56:69:f0:66",
            "net5": "a6:00:23:39:10:2a",
            "net6": "82:49:8f:a5:79:4a",
            "net7": "ee:5e:db:4a:24:de",
            "net8": "7a:da:4b:66:0e:7a",
            "net9": "42:2b:64:92:f5:4a"
        },
        "spine_1_1_9": {
            "net0": "1a:3a:ec:ef:bb:4e",
            "net1": "ce:1c:5d:a8:ef:3e",
            "net10": "86:b8:fe:4b:22:a8",
            "net11": "fa:fa:80:5d:fc:0b",
            "net12": "2a:79:f2:39:a9:77",
            "net13": "5e:74:7d:af:66:b1",
            "net14": "1a:a1:b2:e1:a6:49",
            "net15": "d2:22:8c:4b:a1:5e",
            "net16": "8e:ee:1e:4b:a9:ce",
            "net17": "b6:44:55:34:ba:09",
            "net18": "8a:eb:25:eb:93:fc",
            "net19": "42:7d:de:14:1a:3a",
            "net2": "3a:88:b7:7e:95:71",
            "net3": "d2:73:31:29:f6:6c",
            "net4": "1a:9a:76:46:c9:cc",
            "net5": "96:b6:73:43:ff:d9",
            "net6": "3e:1f:25:3a:ba:43",
            "net7": "be:e0:82:cf:f8:4a",
            "net8": "4e:22:c0:80:7c:37",
            "net9": "06:ee:50:45:fa:4b"
        },
        "spine_2_1_1": {
            "net0": "3a:5b:cf:25:4a:30",
            "net1": "fa:09:09:d3:48:e6",
            "net10": "ca:93:af:40:c6:7e",
            "net11": "a6:41:8a:ad:d2:07",
            "net12": "b6:9d:35:dd:1d:e6",
            "net13": "1e:a0:ec:9f:ec:4d",
            "net14": "8e:29:5c:4b:09:0c",
            "net15": "ee:bd:d3:a0:0f:92",
            "net16": "62:e1:ac:2e:f9:c9",
            "net17": "36:aa:37:34:10:bb",
            "net18": "4a:3c:b7:fc:26:57",
            "net19": "42:1e:bc:aa:40:53",
            "net2": "4e:88:bc:9e:39:61",
            "net3": "72:e2:4a:ee:82:76",
            "net4": "b2:38:95:90:97:45",
            "net5": "9e:9b:4d:10:bb:06",
            "net6": "02:ce:26:c8:3a:73",
            "net7": "aa:e8:1e:fd:cd:dd",
            "net8": "b6:a8:59:81:8b:36",
            "net9": "02:69:b7:42:b1:20"
        },
        "spine_2_1_10": {
            "net0": "8e:98:19:d5:f8:a1",
            "net1": "7a:01:52:66:e4:e2",
            "net10": "b6:98:f1:85:86:f8",
            "net11": "1e:2c:05:e7:fa:52",
            "net12": "7e:2e:b6:76:54:33",
            "net13": "8a:e1:9e:81:83:fa",
            "net14": "e2:36:6d:c0:e5:ea",
            "net15": "fe:f7:7b:7f:3b:68",
            "net16": "66:e6:b3:17:88:32",
            "net17": "6a:9c:d1:fa:62:75",
            "net18": "12:8b:9a:b0:7c:c8",
            "net19": "22:f1:ed:66:97:64",
            "net2": "d6:6f:3c:e8:d7:e1",
            "net3": "12:38:b8:cc:ae:a3",
            "net4": "c2:fc:5f:64:59:7e",
            "net5": "e6:ce:cc:28:68:81",
            "net6": "46:dc:88:00:8f:3c",
            "net7": "96:a9:14:ae:ac:5a",
            "net8": "46:f0:11:44:b0:d1",
            "net9": "0a:84:0a:4a:c9:3a"
        },
        "spine_2_1_2": {
            "net0": "5e:c6:ba:9e:1d:1f",
            "net1": "fe:3f:d1:8c:3e:a2",
            "net10": "56:a4:cc:50:6a:65",
            "net11": "1a:d6:22:28:fb:0f",
            "net12": "f6:2d:2f:6c:4c:cb",
            "net13": "1a:ec:da:28:36:06",
            "net14": "f2:06:f0:bb:50:ac",
            "net15": "16:4c:a3:b5:e9:4c",
            "net16": "52:ff:02:74:52:a3",
            "net17": "26:a2:aa:39:0d:a6",
            "net18": "7e:09:68:38:98:0d",
            "net19": "ce:85:e0:39:2d:c7",
            "net2": "4a:fa:ed:b8:87:31",
            "net3": "82:05:8d:50:c3:97",
            "net4": "ce:f7:26:90:a0:b6",
            "net5": "6e:5c:0a:71:9b:f7",
            "net6": "fa:e6:82:56:73:50",
            "net7": "fa:ec:79:79:58:16",
            "net8": "ee:e7:2c:b5:90:60",
            "net9": "9e:0c:84:79:3b:67"
        },
        "spine_2_1_3": {
            "net0": "82:ca:fa:99:c6:13",
            "net1": "6a:32:b8:bd:fb:59",
            "net10": "1a:60:68:b3:e0:d5",
            "net11": "ba:21:e2:d5:b4:66",
            "net12": "6a:a7:f9:b0:d2:ae",
            "net13": "f6:ff:b9:2c:51:6e",
            "net14": "aa:cf:10:15:58:14",
            "net15": "96:db:03:b1:a2:8d",
            "net16": "e2:7f:37:89:8e:59",
            "net17": "96:82:d0:0f:dc:2f",
            "net18": "ba:3f:61:90:c3:c7",
            "net19": "d2:f4:a0:e3:6d:ca",
            "net2": "ea:df:d8:42:0a:0b",
            "net3": "5a:cc:a9:6c:d1:60",
            "net4": "b2:05:61:64:48:df",
            "net5": "c6:62:58:a2:63:7b",
            "net6": "fe:bd:36:0f:e9:35",
            "net7": "82:ee:af:b7:8e:fa",
            "net8": "0a:52:71:43:ae:b0",
            "net9": "fa:49:16:ae:50:0f"
        },
        "spine_2_1_4": {
            "net0": "62:b2:a8:bc:d8:f8",
            "net1": "42:96:4f:1c:ec:e8",
            "net10": "ba:6a:9b:56:fa:b2",
            "net11": "a2:cd:54:b1:73:4d",
            "net12": "76:cb:5d:17:2d:29",
            "net13": "6e:41:70:81:4a:3c",
            "net14": "72:f5:8f:23:73:c7",
            "net15": "c2:c2:57:1f:3c:1a",
            "net16": "7a:9f:b3:98:c4:25",
            "net17": "9e:bc:17:2a:eb:c8",
            "net18": "ae:b9:1b:5a:15:cf",
            "net19": "82:12:4e:12:85:64",
            "net2": "46:ee:98:00:43:54",
            "net3": "be:b8:7b:75:f9:1c",
            "net4": "7a:85:c0:f3:e1:59",
            "net5": "e6:d4:e4:70:52:46",
            "net6": "0a:21:ea:0a:22:c8",
            "net7": "02:c4:f8:3b:73:47",
            "net8": "72:0e:00:d9:9b:e7",
            "net9": "ca:7b:07:c6:7d:9b"
        },
        "spine_2_1_5": {
            "net0": "b6:ef:a6:7d:d5:22",
            "net1": "02:bb:97:48:fe:37",
            "net10": "7e:54:42:0b:9d:aa",
            "net11": "46:8d:23:6e:31:53",
            "net12": "2a:5f:ba:69:c4:58",
            "net13": "fa:11:67:7a:e6:7b",
            "net14": "8a:c4:ce:2e:b0:c4",
            "net15": "46:da:22:95:b3:67",
            "net16": "66:97:9b:7c:74:7e",
            "net17": "fe:4b:14:f2:ab:32",
            "net18": "22:4f:64:01:c3:2c",
            "net19": "66:76:28:65:91:e8",
            "net2": "6e:54:f6:2c:0d:84",
            "net3": "96:1d:e8:55:b5:5f",
            "net4": "96:f1:93:69:f1:b0",
            "net5": "8a:44:af:5d:e3:b7",
            "net6": "92:93:4e:69:e6:15",
            "net7": "62:3c:49:9a:f4:86",
            "net8": "46:32:41:81:dc:89",
            "net9": "b2:66:4a:23:1a:ba"
        },
        "spine_2_1_6": {
            "net0": "aa:74:49:80:e5:75",
            "net1": "02:70:ef:b6:46:81",
            "net10": "c2:d2:6e:ee:10:0b",
            "net11": "8e:af:ec:a6:a0:ba",
            "net12": "86:55:42:47:28:64",
            "net13": "26:e2:da:f0:6f:7b",
            "net14": "7e:9d:15:29:74:68",
            "net15": "ae:3f:b0:03:b1:a1",
            "net16": "e2:e0:b9:31:c8:29",
            "net17": "4e:32:06:fe:2b:c4",
            "net18": "e2:4e:ae:e6:f0:85",
            "net19": "d6:90:73:67:e1:30",
            "net2": "86:0a:b9:cf:33:94",
            "net3": "ce:40:91:0a:c1:22",
            "net4": "e2:dd:3c:ac:bb:33",
            "net5": "3a:4b:c4:dd:42:1a",
            "net6": "56:cc:8a:5c:47:b0",
            "net7": "0e:cd:a5:59:4b:08",
            "net8": "fe:b5:a9:80:7c:a2",
            "net9": "b6:10:cf:92:cd:1d"
        },
        "spine_2_1_7": {
            "net0": "7a:9a:0e:dd:f6:f0",
            "net1": "ce:e0:dc:bd:ab:6d",
            "net10": "e2:d7:52:b8:94:ec",
            "net11": "6e:29:2e:5d:93:5d",
            "net12": "92:ea:3c:de:8f:eb",
            "net13": "2e:de:33:dd:04:01",
            "net14": "5a:b4:e4:9d:a3:89",
            "net15": "be:81:8a:98:f8:4e",
            "net16": "8e:00:c4:78:2e:90",
            "net17": "be:24:b1:a2:eb:c3",
            "net18": "d6:a0:9f:f2:f8:9b",
            "net19": "b2:2c:34:5f:c7:36",
            "net2": "2e:37:79:98:6f:13",
            "net3": "f2:d7:8b:5f:66:9b",
            "net4": "12:5e:4a:44:a6:fd",
            "net5": "a6:d2:ac:f2:d6:bb",
            "net6": "3a:cb:89:a0:b3:ac",
            "net7": "46:8d:89:e4:48:1b",
            "net8": "ee:2e:da:17:61:f2",
            "net9": "6e:06:41:f1:06:4b"
        },
        "spine_2_1_8": {
            "net0": "66:e8:4f:7a:63:26",
            "net1": "ce:68:e4:5a:fa:83",
            "net10": "2e:94:a7:cb:ff:32",
            "net11": "ea:48:9e:f3:52:5c",
            "net12": "7a:cc:58:4e:76:93",
            "net13": "f2:04:07:fe:c1:9b",
            "net14": "6e:f9:c1:37:ea:e5",
            "net15": "76:bd:de:cd:99:36",
            "net16": "ce:cf:06:4e:5e:9e",
            "net17": "52:1a:f1:4f:35:12",
            "net18": "0e:93:71:8e:d1:f0",
            "net19": "ea:26:ef:6f:37:03",
            "net2": "0a:dd:fc:7c:b4:72",
            "net3": "92:91:8e:c5:78:13",
            "net4": "42:cb:5a:e0:fd:ca",
            "net5": "3a:93:32:93:b8:10",
            "net6": "42:be:58:5d:78:4d",
            "net7": "e2:0f:91:de:9a:fc",
            "net8": "ea:b6:33:29:fa:31",
            "net9": "5a:0e:67:46:0f:c4"
        },
        "spine_2_1_9": {
            "net0": "f2:81:a7:0f:5f:be",
            "net1": "46:e4:d1:5f:85:91",
            "net10": "b2:be:02:aa:83:a0",
            "net11": "c6:94:0d:48:41:56",
            "net12": "6e:80:b8:dc:c3:9e",
            "net13": "02:7c:97:e0:f2:d3",
            "net14": "b2:06:63:6f:2d:b4",
            "net15": "56:80:71:1f:f4:1e",
            "net16": "fe:69:64:3a:94:be",
            "net17": "1e:e9:f1:b1:05:93",
            "net18": "b6:78:d7:6e:7f:89",
            "net19": "4a:5d:36:a0:dd:9b",
            "net2": "2a:71:bb:15:2b:10",
            "net3": "f6:8c:ae:3c:4f:ea",
            "net4": "a2:cf:a2:f2:29:16",
            "net5": "e2:88:d9:72:68:5a",
            "net6": "ca:b8:81:69:16:00",
            "net7": "76:db:15:ef:d4:c9",
            "net8": "e2:d1:57:d8:24:e7",
            "net9": "12:31:3b:03:de:be"
        },
        "spine_3_1_1": {
            "net0": "96:41:a6:f0:dc:56",
            "net1": "a2:b1:81:58:af:ac",
            "net10": "92:89:ee:49:7b:b1",
            "net11": "fe:4a:a1:62:96:e4",
            "net12": "6a:54:a7:64:bd:9e",
            "net13": "ba:cc:ef:1a:4b:3a",
            "net14": "2a:0f:a4:5b:fe:28",
            "net15": "e2:77:d7:a1:ea:c8",
            "net16": "ce:d2:8e:20:cb:18",
            "net17": "2a:c0:80:55:28:f4",
            "net18": "0e:9c:03:62:a4:4f",
            "net19": "be:9d:bb:aa:4d:f3",
            "net2": "4a:66:b5:52:d2:1e",
            "net3": "ba:e7:20:23:f9:cd",
            "net4": "32:d4:79:f7:e7:e8",
            "net5": "32:e9:55:8e:8a:6e",
            "net6": "86:35:3e:5a:1e:09",
            "net7": "a2:2f:fd:1b:c4:a0",
            "net8": "f2:00:f5:a4:71:b2",
            "net9": "1a:2c:a1:69:fa:8b"
        },
        "spine_3_1_10": {
            "net0": "4a:3a:33:70:62:1a",
            "net1": "2e:f0:21:0b:be:25",
            "net10": "1e:1d:76:82:4e:00",
            "net11": "2a:7a:54:08:79:20",
            "net12": "9a:4a:dc:d1:4f:1c",
            "net13": "ca:55:3f:0a:a7:ad",
            "net14": "e2:15:37:b8:29:22",
            "net15": "ea:3b:68:d8:9b:6f",
            "net16": "ee:2d:a5:a9:dd:5f",
            "net17": "7a:31:3b:9c:b6:0b",
            "net18": "7e:fb:0e:9c:42:df",
            "net19": "6e:c3:ed:39:5e:e5",
            "net2": "22:41:ec:b5:6f:a7",
            "net3": "1a:ef:f3:9a:aa:03",
            "net4": "22:a2:47:1e:15:c1",
            "net5": "86:f4:35:7c:d0:f2",
            "net6": "32:25:4b:42:01:a6",
            "net7": "7a:f5:bc:ec:71:88",
            "net8": "ae:59:65:d6:0c:63",
            "net9": "fa:cb:d6:c1:57:d1"
        },
        "spine_3_1_2": {
            "net0": "fe:2e:31:dd:c6:94",
            "net1": "1a:8c:ca:d2:00:ea",
            "net10": "ce:75:ff:e0:5a:3c",
            "net11": "0e:f6:b1:c2:9c:5b",
            "net12": "ba:9d:a9:7c:fe:7e",
            "net13": "aa:97:b2:5d:97:89",
            "net14": "f2:fb:2a:41:ec:08",
            "net15": "0a:95:5a:ed:70:52",
            "net16": "b2:b8:ca:3c:22:34",
            "net17": "22:3f:81:86:a5:4d",
            "net18": "32:b2:69:39:89:b4",
            "net19": "06:b9:4b:7f:a1:f1",
            "net2": "e6:6d:2e:f9:8a:a8",
            "net3": "5e:1e:fb:aa:ce:ff",
            "net4": "06:3a:53:bd:22:75",
            "net5": "e2:69:93:16:1b:2e",
            "net6": "4e:33:22:d9:19:b4",
            "net7": "16:d0:00:96:68:75",
            "net8": "b6:9c:d6:6d:12:18",
            "net9": "2a:e1:24:f1:9e:68"
        },
        "spine_3_1_3": {
            "net0": "76:1a:b4:4d:e3:20",
            "net1": "ca:dd:43:97:c1:cc",
            "net10": "9e:69:0a:de:8a:6a",
            "net11": "92:d2:16:c4:7c:54",
            "net12": "72:83:98:49:b6:d8",
            "net13": "62:36:3e:d9:e8:b3",
            "net14": "c2:7e:0a:9f:89:af",
            "net15": "f2:0f:71:f7:52:29",
            "net16": "52:51:88:7d:15:97",
            "net17": "e6:37:b7:99:6d:64",
            "net18": "4a:19:c3:9b:f2:3a",
            "net19": "e2:5d:ff:61:6e:63",
            "net2": "a2:5d:7f:44:f3:a7",
            "net3": "c6:99:42:71:dd:7c",
            "net4": "46:1a:6b:ab:5f:cd",
            "net5": "2a:ff:e9:39:d5:d4",
            "net6": "0e:45:45:96:7e:3f",
            "net7": "be:18:4f:42:fb:38",
            "net8": "b2:80:23:8a:cb:4a",
            "net9": "0a:d2:ec:28:11:c7"
        },
        "spine_3_1_4": {
            "net0": "9a:3b:8e:5a:b0:27",
            "net1": "d6:7f:b4:84:f9:49",
            "net10": "d2:5f:05:44:0b:7e",
            "net11": "9a:48:1a:ff:77:69",
            "net12": "9e:c4:d5:d7:43:20",
            "net13": "12:fb:7c:71:b7:b7",
            "net14": "32:11:e3:78:6f:3b",
            "net15": "5e:d6:b2:27:ab:de",
            "net16": "ca:8a:c5:a4:c1:5f",
            "net17": "2a:90:f9:aa:b2:a9",
            "net18": "32:f4:07:46:28:7b",
            "net19": "8e:37:54:a4:7a:37",
            "net2": "e6:4c:04:eb:56:85",
            "net3": "1e:8e:33:07:a7:0b",
            "net4": "4e:80:40:fc:c8:fc",
            "net5": "fa:02:f7:0a:5d:68",
            "net6": "d2:d8:2a:e8:29:88",
            "net7": "aa:53:7b:aa:d8:93",
            "net8": "6e:74:6c:0e:c5:2e",
            "net9": "e6:b4:79:62:29:f5"
        },
        "spine_3_1_5": {
            "net0": "a6:d3:68:57:c6:4b",
            "net1": "8a:5f:a8:9d:03:c6",
            "net10": "a6:e1:52:ce:ef:c6",
            "net11": "86:68:79:72:52:de",
            "net12": "92:09:df:1f:ad:ae",
            "net13": "fa:46:fe:a7:a5:84",
            "net14": "0a:ad:0f:12:8b:e4",
            "net15": "de:8d:07:81:6f:82",
            "net16": "0a:79:45:9d:a6:21",
            "net17": "8a:b1:f5:80:6d:60",
            "net18": "ea:25:07:3a:39:2e",
            "net19": "82:cc:d6:88:46:6c",
            "net2": "4a:b6:9d:be:48:6e",
            "net3": "62:6f:6c:c8:41:81",
            "net4": "3a:07:d8:dc:11:65",
            "net5": "c2:16:6a:ba:29:6a",
            "net6": "46:95:6e:a1:48:bc",
            "net7": "ba:8e:94:c8:91:e6",
            "net8": "12:bc:d8:2f:dd:1a",
            "net9": "8a:b8:17:01:43:47"
        },
        "spine_3_1_6": {
            "net0": "d2:0e:84:8b:f6:de",
            "net1": "86:a8:7e:2b:63:96",
            "net10": "5e:d7:c1:36:a7:f3",
            "net11": "ae:fa:01:03:15:dc",
            "net12": "7a:83:25:3c:c1:bd",
            "net13": "ee:f0:2a:f5:43:19",
            "net14": "42:c3:67:e5:36:bd",
            "net15": "be:e1:0c:fe:38:13",
            "net16": "82:d3:4d:c3:a3:33",
            "net17": "1a:cd:cd:18:0e:88",
            "net18": "ee:82:a5:8f:f9:6e",
            "net19": "fa:a2:82:dd:63:a8",
            "net2": "02:ba:ed:e1:09:43",
            "net3": "0e:57:c8:30:2e:aa",
            "net4": "be:47:9c:3b:91:88",
            "net5": "7a:98:5f:0c:14:22",
            "net6": "ae:7c:fa:d3:67:de",
            "net7": "02:15:3b:ef:0a:11",
            "net8": "f6:60:4d:b9:2d:21",
            "net9": "e2:8d:68:41:e9:55"
        },
        "spine_3_1_7": {
            "net0": "56:0f:fb:65:31:b0",
            "net1": "8a:e4:2b:79:b2:13",
            "net10": "d2:79:1a:1e:07:2e",
            "net11": "fe:eb:cf:f4:7e:c0",
            "net12": "52:8a:4d:93:40:c3",
            "net13": "0e:9b:c2:3f:fc:57",
            "net14": "52:0b:d1:96:19:c7",
            "net15": "66:39:f2:42:ee:5d",
            "net16": "fe:fa:6c:92:31:fa",
            "net17": "5e:cc:43:ac:62:68",
            "net18": "1e:c4:ff:8d:57:a9",
            "net19": "de:19:56:d8:6a:6f",
            "net2": "72:b2:42:3c:40:6c",
            "net3": "5a:98:eb:c8:5d:24",
            "net4": "92:8d:b9:8b:da:b9",
            "net5": "4a:e8:b8:63:46:6a",
            "net6": "ea:72:03:3c:96:4c",
            "net7": "ba:00:1f:2c:68:68",
            "net8": "42:ab:1c:2c:21:a1",
            "net9": "42:b0:ae:f4:52:ad"
        },
        "spine_3_1_8": {
            "net0": "c2:bd:78:d5:ba:f4",
            "net1": "2e:a6:eb:6f:d6:11",
            "net10": "f6:aa:2c:f5:9b:23",
            "net11": "9a:6c:d3:e4:bf:d8",
            "net12": "96:e3:dc:e1:b1:ed",
            "net13": "0e:85:8c:22:6a:a1",
            "net14": "12:5c:58:2e:bf:a4",
            "net15": "de:23:25:1b:ae:be",
            "net16": "62:c4:50:f5:ed:1b",
            "net17": "72:d9:1d:d9:a9:f6",
            "net18": "56:cb:12:e4:e7:aa",
            "net19": "ee:9c:ed:eb:79:4c",
            "net2": "f2:84:43:3a:3f:01",
            "net3": "9e:3f:77:b0:38:21",
            "net4": "0a:63:9e:83:93:fe",
            "net5": "02:8f:db:56:b4:43",
            "net6": "5a:84:55:ee:5d:84",
            "net7": "ba:53:eb:ae:89:89",
            "net8": "82:30:a8:26:d9:d3",
            "net9": "56:e0:d8:0b:96:ba"
        },
        "spine_3_1_9": {
            "net0": "ca:3c:09:02:9a:ca",
            "net1": "96:41:06:2e:8d:e8",
            "net10": "1e:57:08:78:75:32",
            "net11": "02:ec:60:e8:22:5d",
            "net12": "ee:aa:57:44:24:7f",
            "net13": "ca:be:61:66:8f:cf",
            "net14": "0a:12:3a:2b:3d:0f",
            "net15": "b2:e8:b6:dc:3f:50",
            "net16": "ba:1c:57:fc:a4:7c",
            "net17": "ca:e6:af:0f:62:d7",
            "net18": "52:70:d3:e6:95:11",
            "net19": "ba:ca:f1:e9:65:bd",
            "net2": "ba:7e:e7:30:c7:2e",
            "net3": "26:45:41:fc:6f:09",
            "net4": "ca:f7:33:b8:b4:5a",
            "net5": "aa:9a:d3:c0:cc:cb",
            "net6": "ba:4f:1d:5a:5a:f7",
            "net7": "92:13:df:a7:51:96",
            "net8": "92:6f:54:67:50:5a",
            "net9": "aa:ed:8f:01:71:57"
        },
        "spine_4_1_1": {
            "net0": "e6:cf:73:e9:51:a4",
            "net1": "7e:bf:51:ac:69:c7",
            "net10": "ae:79:19:cf:4a:5d",
            "net11": "e6:2d:37:55:36:d3",
            "net12": "ae:c9:fe:aa:c4:28",
            "net13": "e2:d5:58:47:5e:06",
            "net14": "4a:37:e3:f4:0c:0f",
            "net15": "b6:a8:d5:80:0e:e0",
            "net16": "92:05:03:18:bb:ab",
            "net17": "ee:08:29:ac:73:ff",
            "net18": "ea:57:53:70:fa:6f",
            "net19": "22:34:49:f8:24:a9",
            "net2": "e6:36:17:8d:78:76",
            "net3": "ee:33:d4:6d:df:b0",
            "net4": "e2:58:4a:64:a5:f6",
            "net5": "7a:0c:8d:ea:5d:02",
            "net6": "12:74:e9:f8:1a:5e",
            "net7": "de:0b:07:c9:ab:b7",
            "net8": "ae:08:0f:50:8f:88",
            "net9": "6e:11:a4:85:29:25"
        },
        "spine_4_1_10": {
            "net0": "8a:1b:97:19:00:63",
            "net1": "da:ca:8c:bf:7b:fa",
            "net10": "66:21:6c:ba:49:b1",
            "net11": "fe:0c:88:7d:b4:ac",
            "net12": "de:86:00:34:9b:28",
            "net13": "ca:89:7e:b2:51:95",
            "net14": "ae:5f:95:5e:26:76",
            "net15": "fe:d2:2d:ab:9f:bb",
            "net16": "c6:fd:22:88:f6:b2",
            "net17": "46:e8:12:00:90:40",
            "net18": "f6:81:bc:d4:24:8d",
            "net19": "d6:da:21:cf:b1:95",
            "net2": "f6:c3:b6:70:08:a6",
            "net3": "42:3e:d8:30:49:63",
            "net4": "4e:dc:25:c9:a9:f4",
            "net5": "02:f5:77:20:53:59",
            "net6": "b2:42:9f:2a:0a:30",
            "net7": "9a:9c:45:db:2a:3a",
            "net8": "a2:8c:39:f3:69:93",
            "net9": "ce:3e:66:92:c9:2c"
        },
        "spine_4_1_2": {
            "net0": "a2:27:ef:29:dc:6f",
            "net1": "ba:bf:04:99:0a:92",
            "net10": "c6:19:09:06:5a:4b",
            "net11": "9e:80:01:cc:e9:e9",
            "net12": "ea:c4:87:3b:40:37",
            "net13": "c6:60:8d:d5:b9:d2",
            "net14": "a2:af:d1:0b:b1:8a",
            "net15": "1a:24:78:98:25:78",
            "net16": "92:36:4a:5f:26:71",
            "net17": "4a:a1:b1:20:91:25",
            "net18": "2a:70:e6:ef:dc:d1",
            "net19": "de:c2:3d:2f:27:fc",
            "net2": "f6:26:d4:60:3f:cf",
            "net3": "66:a4:5c:b6:2b:3d",
            "net4": "12:89:ac:5f:8c:69",
            "net5": "c2:cb:18:df:fc:f4",
            "net6": "4e:e2:60:6e:a7:79",
            "net7": "4e:6d:0e:da:2f:da",
            "net8": "46:c4:a1:f0:d3:a7",
            "net9": "9a:44:61:93:f9:b5"
        },
        "spine_4_1_3": {
            "net0": "8a:01:30:75:6d:be",
            "net1": "12:3b:15:54:fc:f3",
            "net10": "36:38:8c:b6:fc:19",
            "net11": "52:30:9e:4b:6c:19",
            "net12": "ca:8b:c6:ac:a1:dd",
            "net13": "9a:64:34:4a:b5:9f",
            "net14": "32:58:c7:2d:12:88",
            "net15": "f2:bd:62:b7:17:56",
            "net16": "12:99:d7:dc:17:e9",
            "net17": "2a:6a:c3:18:eb:ce",
            "net18": "56:97:26:99:cc:d7",
            "net19": "5e:09:c5:62:6b:32",
            "net2": "12:cf:93:c5:a8:fc",
            "net3": "76:83:1d:fb:14:f5",
            "net4": "76:1b:46:40:f1:8f",
            "net5": "96:c9:ca:77:cc:ed",
            "net6": "0a:9e:36:cd:d0:26",
            "net7": "66:58:7d:78:59:27",
            "net8": "fa:72:c0:89:46:e3",
            "net9": "16:9f:1c:58:db:fd"
        },
        "spine_4_1_4": {
            "net0": "ce:30:47:be:12:12",
            "net1": "8a:1b:b0:ff:54:be",
            "net10": "2e:70:59:2a:3b:a0",
            "net11": "8e:c3:d1:76:c2:30",
            "net12": "f6:c2:fe:d6:01:d4",
            "net13": "c6:9c:b4:f9:57:c8",
            "net14": "12:ad:18:2c:f6:a6",
            "net15": "9a:a7:ad:5c:eb:e2",
            "net16": "6a:e3:6c:86:40:5c",
            "net17": "da:8a:3c:ad:06:17",
            "net18": "ee:62:9c:49:b5:48",
            "net19": "a6:86:80:82:98:cf",
            "net2": "ca:c2:ec:4f:8c:b3",
            "net3": "ce:14:78:83:7d:75",
            "net4": "fa:26:63:e8:55:65",
            "net5": "0a:7f:12:32:47:25",
            "net6": "52:ce:41:8f:89:57",
            "net7": "f2:6d:70:25:bf:50",
            "net8": "6a:28:7e:e9:0b:51",
            "net9": "8a:1b:98:50:09:be"
        },
        "spine_4_1_5": {
            "net0": "d2:aa:c9:2a:7f:80",
            "net1": "3e:e8:59:2f:08:2e",
            "net10": "3e:31:16:0c:8a:c0",
            "net11": "5e:cf:9d:11:ad:41",
            "net12": "aa:33:0c:6a:58:ab",
            "net13": "d2:c5:04:c4:17:97",
            "net14": "d6:f6:95:bf:61:26",
            "net15": "ae:20:35:a9:e5:93",
            "net16": "1a:a2:8c:3f:60:5d",
            "net17": "16:f2:e9:33:df:96",
            "net18": "4e:21:b6:44:0a:5a",
            "net19": "d6:d7:5b:bb:93:a1",
            "net2": "f2:a6:88:06:ff:a9",
            "net3": "8a:29:8b:94:ac:d3",
            "net4": "7e:de:f0:bd:e5:04",
            "net5": "82:13:e6:2d:bb:84",
            "net6": "b6:ee:03:e8:c5:3d",
            "net7": "f2:f8:4f:57:af:d5",
            "net8": "1e:7b:0a:4f:6c:11",
            "net9": "b6:a2:04:fa:5d:fe"
        },
        "spine_4_1_6": {
            "net0": "ea:fc:85:70:53:b5",
            "net1": "32:cc:c0:7c:cb:8f",
            "net10": "d6:4f:38:0a:71:d0",
            "net11": "52:ca:88:f0:cf:ab",
            "net12": "2e:6b:b5:bd:7b:db",
            "net13": "16:53:f4:b9:e2:8f",
            "net14": "36:f1:23:a8:43:51",
            "net15": "1e:ae:55:4a:cb:d7",
            "net16": "c2:99:7d:9a:56:e6",
            "net17": "96:50:c8:4f:90:7c",
            "net18": "82:15:9d:e6:57:43",
            "net19": "ae:b1:9e:71:f2:db",
            "net2": "be:40:28:07:28:e3",
            "net3": "8a:fb:dd:32:5c:72",
            "net4": "3a:c8:00:33:0a:94",
            "net5": "96:01:20:e2:fc:17",
            "net6": "96:3b:a9:49:0a:4c",
            "net7": "4a:3d:43:1c:85:e5",
            "net8": "3a:5e:b8:16:77:a0",
            "net9": "92:88:b4:52:50:a3"
        },
        "spine_4_1_7": {
            "net0": "7e:e7:f0:be:48:ba",
            "net1": "a6:07:72:c3:2a:72",
            "net10": "1a:e9:9b:b7:59:58",
            "net11": "1a:60:c9:a7:d4:87",
            "net12": "22:d0:43:67:8b:5e",
            "net13": "82:82:b5:5e:30:a1",
            "net14": "2a:c3:d3:11:5e:fd",
            "net15": "d2:e4:6c:d0:3e:2e",
            "net16": "c6:e8:e1:e0:48:5d",
            "net17": "d6:d3:c3:06:6f:ad",
            "net18": "ee:08:35:10:49:f7",
            "net19": "de:7a:72:27:3b:49",
            "net2": "62:20:65:a2:17:36",
            "net3": "62:37:82:56:6f:a7",
            "net4": "3a:70:69:d9:09:e0",
            "net5": "b6:4b:1b:b7:48:37",
            "net6": "12:d4:cc:70:c2:19",
            "net7": "aa:2b:c4:81:2b:33",
            "net8": "36:fe:d3:b6:da:eb",
            "net9": "de:f6:ce:48:a7:b9"
        },
        "spine_4_1_8": {
            "net0": "ee:08:a6:9e:00:2a",
            "net1": "62:d7:c9:74:8e:5a",
            "net10": "12:9f:87:16:56:98",
            "net11": "42:1d:28:b4:c5:65",
            "net12": "fa:23:8d:d4:bf:16",
            "net13": "de:9c:c3:73:df:67",
            "net14": "3a:b8:55:b9:f0:1b",
            "net15": "62:f5:ce:c8:f8:23",
            "net16": "ae:65:bc:85:58:67",
            "net17": "ea:25:a9:59:84:f0",
            "net18": "36:a2:b2:fd:30:50",
            "net19": "aa:9c:04:55:a6:21",
            "net2": "5e:aa:3e:05:d3:82",
            "net3": "66:de:12:d0:b6:28",
            "net4": "42:12:89:51:bf:cf",
            "net5": "1a:80:d4:05:49:74",
            "net6": "72:94:38:f8:65:82",
            "net7": "f2:ca:63:0a:bc:80",
            "net8": "c6:c6:00:0b:8b:7e",
            "net9": "92:85:53:c9:50:43"
        },
        "spine_4_1_9": {
            "net0": "4a:63:2a:66:12:03",
            "net1": "12:4d:34:da:f3:e6",
            "net10": "06:5b:c3:0d:64:bd",
            "net11": "56:91:51:2a:4c:e6",
            "net12": "b2:15:b3:03:12:f1",
            "net13": "22:65:b3:01:bc:f1",
            "net14": "7a:2a:8e:d7:1a:4e",
            "net15": "c2:9a:d7:42:7f:bc",
            "net16": "c2:f4:eb:5d:3c:42",
            "net17": "62:66:ef:ee:a9:cd",
            "net18": "1e:76:59:d8:bd:66",
            "net19": "62:45:5c:ba:18:17",
            "net2": "c6:e9:de:c8:0b:a5",
            "net3": "5a:aa:96:28:fa:a7",
            "net4": "32:9a:c2:d4:50:04",
            "net5": "8e:1d:9d:f9:66:30",
            "net6": "b2:b4:d6:9a:29:d9",
            "net7": "6e:2c:ab:65:4a:23",
            "net8": "fa:63:a6:ac:21:e4",
            "net9": "ce:a6:fa:e9:bc:76"
        },
        "tof_1_2_1": {
            "net0": "d6:76:81:02:c1:0f",
            "net1": "52:af:4c:8e:7a:5d",
            "net10": "7e:7b:df:b4:aa:31",
            "net11": "0e:f0:5c:1c:db:79",
            "net12": "7e:66:83:06:5e:0d",
            "net13": "da:fd:f7:4e:be:42",
            "net14": "fa:ef:f3:20:9b:33",
            "net15": "26:b5:04:d6:c3:45",
            "net16": "02:ae:99:f6:66:a2",
            "net17": "8a:6a:c2:13:59:cc",
            "net18": "8a:da:48:c0:ab:c2",
            "net19": "e6:e3:29:2f:aa:6e",
            "net2": "d6:0c:5a:53:8f:08",
            "net3": "66:77:7a:73:38:0d",
            "net4": "36:60:24:7e:7d:73",
            "net5": "9e:a9:51:da:85:39",
            "net6": "0a:10:a0:25:de:1b",
            "net7": "7a:30:c4:30:33:73",
            "net8": "5a:5a:f2:0e:bf:5b",
            "net9": "ba:ec:13:25:f0:d7"
        },
        "tof_1_2_10": {
            "net0": "96:f2:d3:1f:f7:c9",
            "net1": "6a:ab:6d:5b:a7:b9",
            "net10": "7a:5f:0a:ad:67:25",
            "net11": "36:e6:29:e0:69:26",
            "net12": "4e:49:dc:de:41:15",
            "net13": "8e:6e:d9:e6:b2:69",
            "net14": "ea:6c:db:c0:fe:aa",
            "net15": "5a:a7:ce:ae:12:41",
            "net16": "f2:53:cc:68:21:5e",
            "net17": "96:1e:80:c8:96:a1",
            "net18": "16:9d:03:ec:17:96",
            "net19": "d6:9a:dd:6b:a1:89",
            "net2": "66:54:7b:d2:bb:8d",
            "net3": "4a:02:4d:cc:96:5c",
            "net4": "f6:cd:6d:0d:04:dd",
            "net5": "62:54:b9:c2:17:6f",
            "net6": "c6:96:9e:68:2a:e0",
            "net7": "fa:00:02:ec:1f:99",
            "net8": "9e:8e:61:c6:37:10",
            "net9": "36:2c:5f:b0:8a:77"
        },
        "tof_1_2_2": {
            "net0": "e2:c8:e0:3e:b1:87",
            "net1": "96:eb:2c:0a:c4:d4",
            "net10": "fe:01:e4:21:9e:d1",
            "net11": "ce:52:d2:24:9e:01",
            "net12": "6a:d5:60:7c:5e:dd",
            "net13": "0e:f8:dd:72:e2:f1",
            "net14": "6a:bb:63:d3:f3:26",
            "net15": "8e:7e:c0:84:22:2b",
            "net16": "c6:34:9e:45:4d:17",
            "net17": "a2:e0:3b:cc:d4:83",
            "net18": "a2:a0:54:2d:a5:57",
            "net19": "3a:2a:61:0f:6a:c4",
            "net2": "c6:09:34:ca:d1:33",
            "net3": "3a:fa:7c:49:f6:4c",
            "net4": "f6:47:14:20:51:ec",
            "net5": "6e:2f:34:99:51:bd",
            "net6": "f6:00:fb:8a:09:82",
            "net7": "7a:8a:3e:87:1e:f9",
            "net8": "c6:7c:61:b2:e5:ba",
            "net9": "ca:e5:97:c6:8c:3b"
        },
        "tof_1_2_3": {
            "net0": "e2:49:16:c6:dd:28",
            "net1": "86:d1:0f:1f:59:2c",
            "net10": "0e:f1:3d:6f:d8:bf",
            "net11": "d2:7a:05:07:73:4a",
            "net12": "36:26:ac:24:e1:47",
            "net13": "9a:00:58:79:fd:c5",
            "net14": "b2:49:67:bb:42:2a",
            "net15": "02:0f:11:ca:17:79",
            "net16": "e2:2a:53:99:32:dc",
            "net17": "26:1a:98:ad:f9:d1",
            "net18": "ba:fb:d4:db:33:06",
            "net19": "fa:61:6b:da:be:82",
            "net2": "96:4f:a2:f6:d6:cf",
            "net3": "1e:d5:54:c2:b2:fa",
            "net4": "32:fd:32:b8:6d:88",
            "net5": "22:36:ac:d2:15:f4",
            "net6": "aa:dc:5f:7a:d1:fc",
            "net7": "6a:6f:94:35:0c:08",
            "net8": "c6:f8:6a:9f:c6:40",
            "net9": "0a:17:84:5f:9d:0f"
        },
        "tof_1_2_4": {
            "net0": "56:53:f3:f6:cc:c5",
            "net1": "1a:0f:cf:37:08:71",
            "net10": "26:06:87:4c:a9:48",
            "net11": "42:4b:f7:1a:32:21",
            "net12": "62:fa:57:be:13:29",
            "net13": "12:f9:61:a9:ba:55",
            "net14": "d6:55:a9:f8:d8:dd",
            "net15": "f6:6d:ae:5e:51:ed",
            "net16": "be:a8:1a:70:c2:c0",
            "net17": "ce:42:2d:43:64:56",
            "net18": "7a:60:03:29:55:9a",
            "net19": "26:02:0f:22:88:41",
            "net2": "f2:71:39:a9:fc:40",
            "net3": "06:3e:12:a5:e7:98",
            "net4": "7a:2e:9b:45:cb:39",
            "net5": "52:d5:59:d0:a4:90",
            "net6": "de:f9:0d:af:1b:e1",
            "net7": "e6:d3:c2:ca:5b:5d",
            "net8": "d2:d1:93:17:fc:e9",
            "net9": "be:a9:e3:29:83:bb"
        },
        "tof_1_2_5": {
            "net0": "e2:c9:db:46:d7:3b",
            "net1": "de:5f:13:3e:00:6c",
            "net10": "d2:62:53:e2:fa:e3",
            "net11": "2a:9e:f7:a8:ac:09",
            "net12": "82:a9:e7:60:3e:1a",
            "net13": "2a:06:6e:11:09:18",
            "net14": "0e:b0:d0:0c:8b:2b",
            "net15": "4e:47:15:ad:2c:9e",
            "net16": "4a:33:dc:63:b6:34",
            "net17": "9a:9b:fe:2c:c6:e2",
            "net18": "42:f0:e1:04:a6:9a",
            "net19": "42:7c:c0:c7:5a:2b",
            "net2": "ee:f6:c0:03:b1:77",
            "net3": "56:91:e1:51:ff:76",
            "net4": "9e:e5:2a:53:02:eb",
            "net5": "ca:71:14:3c:92:6f",
            "net6": "3a:3a:44:49:08:41",
            "net7": "52:7e:26:19:de:df",
            "net8": "fe:ff:ba:72:84:4b",
            "net9": "26:db:72:e5:78:c9"
        },
        "tof_1_2_6": {
            "net0": "9a:e8:25:34:76:5b",
            "net1": "ce:00:d9:80:d4:89",
            "net10": "76:f8:7b:ed:5b:39",
            "net11": "e6:c7:df:68:a2:b9",
            "net12": "d2:2f:49:8c:88:03",
            "net13": "86:52:77:d6:c8:70",
            "net14": "86:44:a5:95:74:8c",
            "net15": "82:56:2f:a9:f8:2b",
            "net16": "0e:43:91:20:8e:7d",
            "net17": "56:8f:93:b3:de:01",
            "net18": "6a:42:03:84:f7:ba",
            "net19": "6e:25:0a:66:97:e6",
            "net2": "56:29:45:4e:b2:92",
            "net3": "0a:8e:18:0a:7d:03",
            "net4": "ca:6b:f1:89:2d:75",
            "net5": "62:cb:6c:53:0d:6a",
            "net6": "ca:c2:68:f6:d9:16",
            "net7": "1e:9f:1a:9a:b8:82",
            "net8": "4e:1d:60:b9:d2:bb",
            "net9": "2e:64:0c:e6:58:48"
        },
        "tof_1_2_7": {
            "net0": "9e:2a:e0:4c:54:70",
            "net1": "52:2a:57:8d:6a:83",
            "net10": "da:0b:e6:82:03:a1",
            "net11": "3a:2b:57:07:08:4d",
            "net12": "a2:89:38:3a:1e:2e",
            "net13": "46:ec:16:08:96:eb",
            "net14": "2e:2d:3c:2e:5c:63",
            "net15": "ba:6f:36:ab:b6:6e",
            "net16": "9e:10:ee:a8:50:71",
            "net17": "f2:3f:9a:c0:98:79",
            "net18": "d2:7d:f9:c2:56:c9",
            "net19": "de:c8:a9:db:aa:52",
            "net2": "26:e3:3f:ab:9e:5e",
            "net3": "96:f2:b4:23:d6:69",
            "net4": "02:1b:4f:db:3f:1a",
            "net5": "a6:6a:bd:75:9a:83",
            "net6": "86:9b:6f:93:72:42",
            "net7": "a2:c6:3a:2e:03:02",
            "net8": "fa:e5:57:27:24:ba",
            "net9": "fa:02:3f:65:5f:55"
        },
        "tof_1_2_8": {
            "net0": "32:d1:06:82:51:41",
            "net1": "5a:ed:90:24:57:27",
            "net10": "72:04:8a:eb:2d:f6",
            "net11": "2e:cd:aa:f3:63:f6",
            "net12": "f6:5d:a8:0d:62:09",
            "net13": "96:5a:7e:e7:3a:47",
            "net14": "4e:e3:68:b7:31:24",
            "net15": "a6:f2:6b:df:ed:c6",
            "net16": "46:93:34:ba:55:8c",
            "net17": "ca:d6:fd:5f:e4:3c",
            "net18": "f2:0a:f6:c7:89:f2",
            "net19": "9a:ce:c0:2f:2c:fd",
            "net2": "62:ac:ec:70:50:14",
            "net3": "92:41:38:45:e0:ea",
            "net4": "62:4b:ea:dd:5c:a2",
            "net5": "da:b9:cc:a2:d3:16",
            "net6": "a6:d6:40:79:5d:26",
            "net7": "c6:d1:49:02:f5:35",
            "net8": "0e:70:70:d5:07:12",
            "net9": "96:4d:5d:e1:9e:44"
        },
        "tof_1_2_9": {
            "net0": "b2:d0:30:5d:e2:70",
            "net1": "3a:03:bd:c3:2a:ae",
            "net10": "ca:4c:ec:e2:cc:ec",
            "net11": "32:ce:e0:ed:a5:5f",
            "net12": "7a:3c:63:8c:f0:90",
            "net13": "d2:bb:a2:af:7e:26",
            "net14": "be:52:c4:f3:e7:78",
            "net15": "c2:6d:e3:b5:4a:ce",
            "net16": "c6:e0:30:ea:06:5a",
            "net17": "a2:c1:e7:e5:5b:83",
            "net18": "3e:02:73:22:d8:c1",
            "net19": "4a:d3:3d:73:d3:c4",
            "net2": "c6:7f:3b:98:c5:3b",
            "net3": "2a:7b:00:9d:92:a6",
            "net4": "2a:dc:72:7a:52:27",
            "net5": "1a:3e:6d:2e:28:9c",
            "net6": "72:f1:72:b5:f2:89",
            "net7": "8e:cc:f7:0d:0e:30",
            "net8": "d6:e7:b9:d1:8a:18",
            "net9": "e6:34:38:7c:ec:34"
        },
        "tof_2_2_1": {
            "net0": "f6:ea:57:0a:97:c3",
            "net1": "6a:89:9e:14:56:91",
            "net10": "aa:17:92:8f:58:57",
            "net11": "5e:e7:2a:38:c8:5c",
            "net12": "2e:d7:86:4a:52:15",
            "net13": "ca:a8:20:af:55:cf",
            "net14": "e2:10:56:0b:d0:db",
            "net15": "fe:ec:71:0b:b0:fc",
            "net16": "56:0d:6c:40:53:b4",
            "net17": "66:ca:5f:82:3d:29",
            "net18": "da:0e:34:5e:68:cc",
            "net19": "26:04:69:d3:68:b6",
            "net2": "2a:a2:eb:b5:50:bd",
            "net3": "be:78:d4:f9:54:db",
            "net4": "46:70:da:ce:41:a6",
            "net5": "4e:a7:a4:de:f4:cc",
            "net6": "5e:8a:50:ad:5d:46",
            "net7": "e2:45:35:9d:0b:b9",
            "net8": "96:46:f9:34:c9:59",
            "net9": "6a:f2:f9:2f:27:d2"
        },
        "tof_2_2_10": {
            "net0": "a6:b8:4c:1a:34:c3",
            "net1": "c6:d8:52:5c:3b:e3",
            "net10": "fa:10:42:19:5a:5a",
            "net11": "9e:bb:04:7b:9f:e4",
            "net12": "42:43:d2:0e:a3:5a",
            "net13": "76:7d:fd:4c:13:1a",
            "net14": "76:6e:24:41:46:6d",
            "net15": "6e:07:cb:b3:ec:10",
            "net16": "ea:2b:9d:f0:27:59",
            "net17": "26:49:13:08:6d:63",
            "net18": "2a:d6:9a:47:e2:7e",
            "net19": "2e:28:c6:a2:dc:4d",
            "net2": "32:01:66:0a:e2:2f",
            "net3": "b2:5f:53:83:4c:03",
            "net4": "e6:b3:b7:03:6d:68",
            "net5": "42:bb:f7:53:c3:d0",
            "net6": "82:80:ad:7d:52:05",
            "net7": "0a:50:9d:a8:6c:44",
            "net8": "8a:06:81:d5:19:9c",
            "net9": "56:08:3b:b1:d3:3b"
        },
        "tof_2_2_2": {
            "net0": "9e:b2:ef:d6:83:cb",
            "net1": "be:6a:c4:eb:9c:24",
            "net10": "72:b8:16:bd:f6:0a",
            "net11": "4a:b3:4c:9e:7f:25",
            "net12": "76:37:05:c6:cf:d5",
            "net13": "36:3a:83:70:04:0a",
            "net14": "76:42:f0:09:22:de",
            "net15": "b6:ad:4f:47:d1:76",
            "net16": "0a:01:64:2a:de:f9",
            "net17": "42:87:00:ec:58:72",
            "net18": "4a:c4:25:5a:9c:fb",
            "net19": "4a:71:f0:ae:0b:de",
            "net2": "56:dd:52:5d:f4:15",
            "net3": "aa:5c:66:8e:9a:91",
            "net4": "e6:0a:01:16:b5:e7",
            "net5": "ae:9d:5d:88:ac:c8",
            "net6": "72:8d:d8:b5:ea:2a",
            "net7": "fe:2e:72:63:f0:38",
            "net8": "6a:b6:f1:ed:24:43",
            "net9": "b2:06:fe:96:ac:4a"
        },
        "tof_2_2_3": {
            "net0": "92:ac:3a:38:e9:5a",
            "net1": "d2:ff:52:af:d0:3e",
            "net10": "2e:e5:a9:c9:da:e9",
            "net11": "2e:64:32:5f:d2:c6",
            "net12": "66:02:d0:43:df:1e",
            "net13": "7a:e4:1c:1b:de:eb",
            "net14": "da:af:c2:ac:88:b9",
            "net15": "72:d5:86:22:b3:7a",
            "net16": "92:82:9a:c5:17:90",
            "net17": "0e:b3:09:2f:81:5b",
            "net18": "b6:34:95:e9:2b:f6",
            "net19": "36:70:d8:7a:71:6a",
            "net2": "06:9a:4e:39:98:5c",
            "net3": "1a:50:de:1a:fa:15",
            "net4": "32:a7:d7:78:e2:5a",
            "net5": "0a:47:43:a4:5b:11",
            "net6": "62:af:aa:52:c6:55",
            "net7": "02:04:ef:cd:ad:a1",
            "net8": "12:92:36:af:9f:f8",
            "net9": "ba:fe:e4:2b:a2:61"
        },
        "tof_2_2_4": {
            "net0": "06:2e:f1:42:d5:67",
            "net1": "06:6c:9b:50:17:a6",
            "net10": "ae:85:2d:64:3d:b8",
            "net11": "e6:52:11:a8:3c:b7",
            "net12": "2a:da:4e:4f:f1:19",
            "net13": "ee:95:fb:3e:65:84",
            "net14": "32:1b:02:d3:b4:5f",
            "net15": "52:a8:c2:5b:83:e8",
            "net16": "92:29:33:fa:a1:9d",
            "net17": "ee:ec:19:2d:f9:06",
            "net18": "66:1e:04:82:2c:6e",
            "net19": "a2:34:d3:44:75:87",
            "net2": "96:4b:9c:6f:78:03",
            "net3": "e6:75:97:bf:e3:e5",
            "net4": "06:d2:2f:1b:ca:6f",
            "net5": "16:4f:25:2c:ea:bb",
            "net6": "86:6c:d6:6e:a5:aa",
            "net7": "ca:b5:1a:fe:aa:73",
            "net8": "0e:4e:99:ca:a9:2c",
            "net9": "12:6f:02:4d:90:2e"
        },
        "tof_2_2_5": {
            "net0": "c6:1b:58:a5:8a:54",
            "net1": "de:ff:16:a2:fa:93",
            "net10": "da:a8:76:6b:4b:82",
            "net11": "4e:ea:23:16:04:85",
            "net12": "26:62:7f:89:85:71",
            "net13": "aa:8e:60:e7:89:4f",
            "net14": "2a:fc:75:c5:59:1f",
            "net15": "5e:d4:da:7f:11:9b",
            "net16": "f6:8c:0a:d9:e8:92",
            "net17": "22:f5:c5:7e:53:be",
            "net18": "46:38:8d:fc:e0:67",
            "net19": "26:22:f3:c9:72:4c",
            "net2": "e2:81:95:77:af:48",
            "net3": "42:8d:7f:d4:0b:71",
            "net4": "a6:47:df:bb:17:2b",
            "net5": "22:f0:f5:cf:0b:89",
            "net6": "4a:09:45:53:e7:3a",
            "net7": "9a:58:a7:f0:11:4b",
            "net8": "b2:3e:f8:79:65:66",
            "net9": "5e:0c:13:d0:b0:be"
        },
        "tof_2_2_6": {
            "net0": "82:1f:9b:51:51:d4",
            "net1": "12:b1:8d:79:40:a8",
            "net10": "86:70:05:29:5d:94",
            "net11": "f2:f5:64:52:d0:fa",
            "net12": "76:93:a5:b0:84:4c",
            "net13": "46:05:f0:2e:c3:36",
            "net14": "f2:8a:cd:64:29:7b",
            "net15": "2a:7e:61:bc:c7:e9",
            "net16": "e2:6b:a5:a8:c8:45",
            "net17": "06:91:09:19:20:78",
            "net18": "de:c0:b0:08:69:65",
            "net19": "b6:d4:4c:06:5f:c1",
            "net2": "b6:ea:14:33:c8:c9",
            "net3": "ba:b2:7c:fc:71:cb",
            "net4": "2e:78:9c:2d:b5:5b",
            "net5": "f6:69:17:30:73:c0",
            "net6": "ca:46:2c:63:c7:c2",
            "net7": "4a:fb:0b:e2:5f:dd",
            "net8": "e6:c6:41:2d:4c:a7",
            "net9": "06:47:14:7e:04:21"
        },
        "tof_2_2_7": {
            "net0": "c2:0e:c8:07:84:72",
            "net1": "3e:ef:22:c8:73:0d",
            "net10": "2a:94:27:bc:3c:ba",
            "net11": "16:fa:66:79:ff:93",
            "net12": "ba:06:3b:f6:49:52",
            "net13": "e6:0e:23:fb:69:81",
            "net14": "26:35:d3:a2:e0:85",
            "net15": "36:ff:86:0e:1d:e4",
            "net16": "42:52:48:65:29:57",
            "net17": "ba:f4:62:ce:af:74",
            "net18": "b6:5e:9d:35:62:79",
            "net19": "fa:3d:a5:ce:28:83",
            "net2": "ca:e1:53:85:c8:77",
            "net3": "62:ec:6f:64:ce:dc",
            "net4": "36:19:d5:41:62:74",
            "net5": "96:79:9d:e4:e4:6b",
            "net6": "b6:b6:80:2a:97:ee",
            "net7": "0a:92:fd:72:1a:a0",
            "net8": "8e:f0:42:1f:74:fb",
            "net9": "62:e7:bb:2e:ee:4e"
        },
        "tof_2_2_8": {
            "net0": "d6:f6:d6:46:72:25",
            "net1": "62:9d:89:10:da:ca",
            "net10": "3a:4d:0e:58:b8:91",
            "net11": "62:f1:4d:bb:c6:c2",
            "net12": "aa:98:f3:7a:e8:72",
            "net13": "da:02:92:f8:3f:0c",
            "net14": "76:88:5a:50:d5:47",
            "net15": "7e:d2:21:bc:e9:9b",
            "net16": "5a:20:eb:24:e1:69",
            "net17": "e6:31:ec:27:cf:0c",
            "net18": "d6:81:af:81:08:9c",
            "net19": "e2:41:1e:99:7d:63",
            "net2": "8e:96:db:17:c5:df",
            "net3": "06:a0:4b:65:8a:d4",
            "net4": "42:f6:8e:c1:e9:3c",
            "net5": "9a:dd:5a:d8:d4:ea",
            "net6": "1a:b8:8a:bc:0b:88",
            "net7": "82:60:ec:aa:65:20",
            "net8": "8a:d2:3d:91:01:51",
            "net9": "62:17:65:71:22:b0"
        },
        "tof_2_2_9": {
            "net0": "ea:93:1f:08:9a:ae",
            "net1": "66:5e:cc:30:8d:30",
            "net10": "a6:69:4f:7d:3a:df",
            "net11": "da:3c:de:05:ec:cc",
            "net12": "b6:25:e1:41:e5:bc",
            "net13": "0a:2e:a1:0f:8a:80",
            "net14": "c2:e3:12:3b:c2:a4",
            "net15": "16:28:1f:8a:8e:45",
            "net16": "fe:fa:ec:d9:df:df",
            "net17": "02:b6:73:0d:1d:86",
            "net18": "5e:8a:e8:46:f5:6b",
            "net19": "9a:cf:35:1c:d7:95",
            "net2": "32:1a:53:4e:ff:ce",
            "net3": "8a:e2:10:23:17:cf",
            "net4": "d6:c0:03:55:b6:29",
            "net5": "6e:0e:0c:a5:a2:47",
            "net6": "6a:18:13:d5:1a:7d",
            "net7": "36:c1:fe:d3:2d:d6",
            "net8": "12:89:10:3b:e0:f6",
            "net9": "9a:be:69:b9:17:aa"
        }
    },
    "failed_machine": "tof_1_2_1",
    "failure_time": 1616330683.558125,
    "recover_time": 1616330795.2652347
}