{
    "k_leaf": 4,
    "k_top": 4,
    "redundancy_factor": 2,
    "is_k8s": true,
    "machine_mac_addresses": {
        "leaf_1_0_1": {
            "net0": "2e:32:36:a7:e7:c5",
            "net1": "26:08:6a:6e:9d:5f",
            "net2": "f2:93:93:15:ad:d9",
            "net3": "fe:c8:da:00:e2:2c",
            "net4": "be:c8:66:e4:9d:db"
        },
        "leaf_1_0_2": {
            "net0": "62:18:01:3e:0a:c6",
            "net1": "4e:11:a8:cb:9d:ce",
            "net2": "4a:ad:88:6d:76:3a",
            "net3": "fa:b8:d4:0b:14:ea",
            "net4": "ea:d5:33:66:53:36"
        },
        "leaf_1_0_3": {
            "net0": "1e:95:6e:5d:b6:02",
            "net1": "1e:9e:64:76:23:9a",
            "net2": "02:09:d6:81:f9:8f",
            "net3": "5e:44:49:a6:a9:81",
            "net4": "92:74:11:1c:fa:44"
        },
        "leaf_1_0_4": {
            "net0": "c6:23:8e:e0:52:64",
            "net1": "fa:ac:91:b4:d2:c6",
            "net2": "96:9c:ae:3f:c0:3f",
            "net3": "d6:df:12:97:98:3f",
            "net4": "26:f4:ad:de:14:19"
        },
        "leaf_2_0_1": {
            "net0": "b2:c3:75:42:5a:e9",
            "net1": "46:7c:1e:b3:6e:fa",
            "net2": "4e:65:eb:ef:fd:b1",
            "net3": "d2:91:cc:79:67:d1",
            "net4": "42:f6:d8:ae:97:c9"
        },
        "leaf_2_0_2": {
            "net0": "72:26:8f:aa:f0:a5",
            "net1": "fa:af:27:c7:98:14",
            "net2": "62:54:3d:d5:ea:cc",
            "net3": "56:c0:01:62:18:b5",
            "net4": "ce:49:db:14:15:2d"
        },
        "leaf_2_0_3": {
            "net0": "16:f8:1e:59:c9:fb",
            "net1": "62:cf:d2:98:f5:f1",
            "net2": "26:c4:bd:bb:a9:05",
            "net3": "16:de:7e:18:9b:bc",
            "net4": "d2:26:29:bb:11:e5"
        },
        "leaf_2_0_4": {
            "net0": "fa:38:16:61:f1:f1",
            "net1": "8e:4a:e6:37:32:b8",
            "net2": "56:95:0e:f2:24:e4",
            "net3": "ee:bb:95:91:4b:19",
            "net4": "12:70:de:7c:3c:08"
        },
        "leaf_3_0_1": {
            "net0": "1a:35:68:6f:b2:4f",
            "net1": "06:82:21:b7:19:6e",
            "net2": "8e:56:1a:a8:50:90",
            "net3": "36:52:17:9c:24:ab",
            "net4": "46:5c:c6:8b:1a:9c"
        },
        "leaf_3_0_2": {
            "net0": "aa:6a:a7:ba:94:d2",
            "net1": "4e:b8:c0:24:ae:f0",
            "net2": "2a:f6:3f:1c:b7:79",
            "net3": "96:10:c3:c2:d0:62",
            "net4": "9a:b2:1e:01:33:bb"
        },
        "leaf_3_0_3": {
            "net0": "6e:0c:78:94:a8:db",
            "net1": "a6:64:2e:04:f3:e8",
            "net2": "86:26:71:d6:4f:37",
            "net3": "da:ae:24:b8:88:53",
            "net4": "52:2a:4e:d0:5e:3d"
        },
        "leaf_3_0_4": {
            "net0": "42:d6:cd:49:80:20",
            "net1": "86:c3:5b:7e:5a:fe",
            "net2": "d2:84:69:00:57:7b",
            "net3": "52:3b:51:78:6e:b5",
            "net4": "a6:14:ca:54:04:8f"
        },
        "leaf_4_0_1": {
            "net0": "fa:8e:1b:cd:d9:6d",
            "net1": "66:8f:b1:d0:b6:18",
            "net2": "ae:3c:15:13:92:29",
            "net3": "42:9a:44:8a:54:71",
            "net4": "3a:33:27:39:0f:9c"
        },
        "leaf_4_0_2": {
            "net0": "2e:69:82:bd:d4:8d",
            "net1": "5e:c1:3a:e7:1c:92",
            "net2": "d6:14:ac:14:8c:f8",
            "net3": "72:f8:f5:73:f6:46",
            "net4": "9e:02:8f:33:6b:b0"
        },
        "leaf_4_0_3": {
            "net0": "b6:e2:ba:7d:f6:2c",
            "net1": "36:e1:cc:67:00:eb",
            "net2": "4e:86:f1:2b:ab:76",
            "net3": "96:a8:6c:00:a8:79",
            "net4": "fa:e6:a4:fb:15:73"
        },
        "leaf_4_0_4": {
            "net0": "be:47:d7:7d:4c:da",
            "net1": "0a:69:db:b0:98:5a",
            "net2": "56:6b:f1:71:a4:e2",
            "net3": "76:6e:10:95:97:18",
            "net4": "4e:49:53:0b:af:b0"
        },
        "spine_1_1_1": {
            "net0": "42:ec:ac:b1:3a:29",
            "net1": "f6:a2:e3:96:c0:71",
            "net2": "a6:46:8c:77:5d:72",
            "net3": "e6:c9:cc:f2:19:3f",
            "net4": "7a:d3:59:0d:16:d2",
            "net5": "ae:9d:33:52:e6:b9",
            "net6": "a6:61:0c:cf:4a:fd",
            "net7": "de:3b:93:6a:18:02"
        },
        "spine_1_1_2": {
            "net0": "b2:b2:0f:1a:62:9d",
            "net1": "76:c6:6f:40:8f:bd",
            "net2": "ae:80:f4:63:37:ae",
            "net3": "1a:8e:99:d1:70:59",
            "net4": "72:f3:5e:48:03:46",
            "net5": "8a:35:2c:7e:32:c3",
            "net6": "2a:ff:d1:a2:e3:44",
            "net7": "b2:7f:78:bf:f3:26"
        },
        "spine_1_1_3": {
            "net0": "d2:68:44:4e:f9:59",
            "net1": "8e:78:67:69:31:23",
            "net2": "ba:58:5c:ae:10:4e",
            "net3": "02:25:08:6b:2d:41",
            "net4": "26:34:fc:ac:7e:32",
            "net5": "d6:7c:2f:7e:1d:ef",
            "net6": "7a:91:b2:dc:41:4a",
            "net7": "ea:f9:f9:12:ce:74"
        },
        "spine_1_1_4": {
            "net0": "7a:13:c5:78:4d:2b",
            "net1": "62:8b:02:50:53:92",
            "net2": "aa:a1:f4:23:04:52",
            "net3": "96:ca:c6:d5:73:03",
            "net4": "a2:81:e9:3a:08:6e",
            "net5": "d6:bd:e2:6c:af:e8",
            "net6": "fe:ff:29:3f:39:f3",
            "net7": "8e:a4:30:fa:73:22"
        },
        "spine_2_1_1": {
            "net0": "9a:35:0d:7b:f9:b2",
            "net1": "7e:5b:d6:91:ee:d5",
            "net2": "ce:b4:d2:b7:bd:1d",
            "net3": "b2:44:71:66:17:e8",
            "net4": "da:cd:99:33:61:81",
            "net5": "46:3c:a5:c9:f6:7f",
            "net6": "92:b1:78:ba:b5:15",
            "net7": "5a:bc:ed:f9:f7:89"
        },
        "spine_2_1_2": {
            "net0": "1a:9b:4d:0f:d9:4b",
            "net1": "a6:53:a2:e0:51:2e",
            "net2": "a6:6e:8a:6f:3d:a7",
            "net3": "6a:c4:72:f0:fa:53",
            "net4": "9e:2f:ea:b1:59:55",
            "net5": "c6:f8:ea:d7:49:e4",
            "net6": "fe:fb:e8:91:98:cb",
            "net7": "3a:06:01:21:5d:9c"
        },
        "spine_2_1_3": {
            "net0": "2e:a1:b3:1f:ce:37",
            "net1": "16:8b:d0:82:bf:40",
            "net2": "7a:4e:37:d4:d4:bf",
            "net3": "d2:9d:20:e4:3a:b0",
            "net4": "d2:06:02:f9:47:9b",
            "net5": "16:b6:16:d5:b3:dd",
            "net6": "76:8e:b7:74:f1:b3",
            "net7": "de:aa:97:28:8a:87"
        },
        "spine_2_1_4": {
            "net0": "c6:22:7c:29:34:bd",
            "net1": "8a:59:17:92:4e:04",
            "net2": "36:c3:27:d3:99:6a",
            "net3": "fa:1c:51:a4:a3:22",
            "net4": "26:a4:d9:47:6b:1f",
            "net5": "ca:ec:b7:54:9f:bc",
            "net6": "d6:40:c3:b2:9d:c2",
            "net7": "2e:14:22:2d:b2:0b"
        },
        "spine_3_1_1": {
            "net0": "2a:c3:11:20:0b:38",
            "net1": "52:55:1f:9c:7e:db",
            "net2": "ce:eb:86:40:f1:46",
            "net3": "de:3d:ec:c1:6c:1b",
            "net4": "f2:4b:51:bf:37:bc",
            "net5": "ae:e4:b1:8b:ce:ba",
            "net6": "ae:d3:b0:f5:6c:d9",
            "net7": "e2:01:b7:6e:89:27"
        },
        "spine_3_1_2": {
            "net0": "b2:b1:57:2e:4b:77",
            "net1": "66:fd:1a:c8:a5:cc",
            "net2": "8e:58:4c:37:36:48",
            "net3": "8e:de:c3:e5:53:8d",
            "net4": "62:f1:ac:b9:18:07",
            "net5": "ea:84:af:35:4f:0f",
            "net6": "3a:4a:cf:21:b4:f6",
            "net7": "8a:d0:ee:ca:a9:21"
        },
        "spine_3_1_3": {
            "net0": "f2:2f:fa:fb:47:a4",
            "net1": "82:00:5c:f8:c5:40",
            "net2": "de:85:2d:b4:f6:ae",
            "net3": "36:46:25:e7:77:92",
            "net4": "0a:1b:b3:65:03:32",
            "net5": "b6:62:54:79:4c:e0",
            "net6": "ca:ff:cb:b9:5a:c3",
            "net7": "c2:7c:75:e1:14:ea"
        },
        "spine_3_1_4": {
            "net0": "52:f3:6f:36:10:b7",
            "net1": "ce:b0:77:f6:6a:f8",
            "net2": "a6:ef:aa:2d:66:64",
            "net3": "d6:0b:e1:3b:d0:6b",
            "net4": "ee:21:1e:c4:49:b0",
            "net5": "ea:53:9a:79:ab:bc",
            "net6": "5a:43:8d:7a:08:2b",
            "net7": "7e:d7:0a:fc:bc:a1"
        },
        "spine_4_1_1": {
            "net0": "6e:cb:bf:e2:24:69",
            "net1": "16:41:a6:78:72:e5",
            "net2": "62:77:85:85:2b:2b",
            "net3": "96:c5:bf:2f:10:2a",
            "net4": "06:ef:38:9c:09:c1",
            "net5": "0a:fb:b8:95:80:a4",
            "net6": "fa:92:28:ed:07:66",
            "net7": "62:bd:c8:cf:25:1f"
        },
        "spine_4_1_2": {
            "net0": "3a:5a:e0:8b:57:44",
            "net1": "56:52:91:a0:f9:53",
            "net2": "e6:fa:f1:c2:85:38",
            "net3": "5e:c5:dc:26:43:fd",
            "net4": "86:cf:ea:4c:5c:4e",
            "net5": "66:a3:9e:04:12:ee",
            "net6": "9e:44:1b:a6:f4:60",
            "net7": "8a:78:39:77:39:91"
        },
        "spine_4_1_3": {
            "net0": "ba:2f:ca:2c:5d:a2",
            "net1": "a6:ca:36:ab:a7:2e",
            "net2": "72:c2:bf:44:0d:06",
            "net3": "d6:38:71:ed:3a:76",
            "net4": "0e:0a:30:7f:c3:f6",
            "net5": "e6:f1:8d:14:49:99",
            "net6": "9e:11:49:70:f5:60",
            "net7": "7a:b4:be:f5:9e:6e"
        },
        "spine_4_1_4": {
            "net0": "52:e3:2e:dc:af:6e",
            "net1": "7a:51:b8:49:3a:d2",
            "net2": "8e:30:68:03:d0:65",
            "net3": "56:9b:a9:61:e9:72",
            "net4": "2e:e3:5a:1c:b5:e0",
            "net5": "0a:d9:18:65:ac:af",
            "net6": "62:fc:66:fd:79:29",
            "net7": "92:c7:f5:b4:9c:9d"
        },
        "tof_1_2_1": {
            "net0": "12:d7:cb:f6:9d:ed",
            "net1": "ce:4d:8e:6f:e3:79",
            "net2": "a6:12:42:b1:23:fd",
            "net3": "4a:5b:37:e4:36:8d",
            "net4": "5e:17:fa:8c:de:c3",
            "net5": "72:27:76:e4:fe:47",
            "net6": "72:17:6a:55:a8:3c",
            "net7": "3e:dd:48:86:96:24"
        },
        "tof_1_2_2": {
            "net0": "ae:80:ca:14:e1:67",
            "net1": "1a:7c:5c:39:b3:db",
            "net2": "9a:de:a9:f5:ff:a2",
            "net3": "16:52:d4:f1:fd:3a",
            "net4": "22:fb:55:9d:50:f0",
            "net5": "16:77:2f:52:dc:2e",
            "net6": "8e:c8:c9:04:54:1f",
            "net7": "ee:ca:98:fb:be:d6"
        },
        "tof_1_2_3": {
            "net0": "96:b6:c6:34:3f:4b",
            "net1": "4e:e6:7c:61:32:17",
            "net2": "e2:0b:87:97:6a:f6",
            "net3": "7a:de:64:c0:dc:15",
            "net4": "c6:5e:86:3c:2a:a9",
            "net5": "c6:39:6a:2a:8d:72",
            "net6": "9a:e2:16:1d:9c:e6",
            "net7": "62:32:c3:8b:75:55"
        },
        "tof_1_2_4": {
            "net0": "0e:1e:19:26:f9:8c",
            "net1": "1e:76:23:9f:c6:09",
            "net2": "6a:7d:fe:89:a2:f3",
            "net3": "da:08:e9:6f:77:e4",
            "net4": "76:09:57:7c:be:e0",
            "net5": "fa:89:75:ef:33:32",
            "net6": "2a:5b:7f:85:48:47",
            "net7": "e6:d6:79:4f:e5:a0"
        },
        "tof_2_2_1": {
            "net0": "b6:54:ff:fe:55:ed",
            "net1": "7e:d2:91:1a:07:05",
            "net2": "ea:63:60:6f:ab:61",
            "net3": "8e:c2:95:7e:6f:08",
            "net4": "5e:5d:40:19:41:08",
            "net5": "fa:13:d9:6e:09:9b",
            "net6": "52:f9:fe:a8:40:bc",
            "net7": "0a:3b:a4:eb:1e:be"
        },
        "tof_2_2_2": {
            "net0": "76:25:c4:ac:7e:9b",
            "net1": "72:26:22:f3:22:85",
            "net2": "1e:a8:bc:d6:77:42",
            "net3": "ce:f5:79:11:13:e4",
            "net4": "6a:a8:10:41:d3:67",
            "net5": "0e:18:db:ae:ab:84",
            "net6": "ba:3a:77:55:a2:27",
            "net7": "3a:68:c8:1a:4e:85"
        },
        "tof_2_2_3": {
            "net0": "de:1a:df:c6:da:0e",
            "net1": "46:6e:80:eb:d2:06",
            "net2": "a2:af:f3:f6:e8:c6",
            "net3": "1a:6f:9f:22:9f:42",
            "net4": "5e:4e:02:51:88:92",
            "net5": "72:cf:cc:7b:de:e3",
            "net6": "82:10:31:b6:07:2b",
            "net7": "fa:ee:5d:7c:e3:d8"
        },
        "tof_2_2_4": {
            "net0": "9a:8e:d2:89:79:b2",
            "net1": "3e:61:9d:b3:63:b3",
            "net2": "f6:a0:f7:95:0e:1f",
            "net3": "56:f9:c1:a8:9a:30",
            "net4": "d6:34:ee:49:1d:14",
            "net5": "4a:0d:1c:16:f8:9e",
            "net6": "92:75:48:d9:1b:bc",
            "net7": "16:be:97:ca:ec:72"
        }
    },
    "failed_machine": "leaf_1_0_1",
    "failure_time": {
        "leaf_1_0_1": 1621993100.6515136,
        "leaf_1_0_2": 1621993100.6726236,
        "leaf_1_0_3": 1621993100.7075415,
        "leaf_1_0_4": 1621993091.031473,
        "leaf_2_0_1": 1621993100.7043023,
        "leaf_2_0_2": 1621993100.7484906,
        "leaf_2_0_3": 1621993100.658803,
        "leaf_2_0_4": 1621993100.6916876,
        "leaf_3_0_1": 1621993100.7654393,
        "leaf_3_0_2": 1621993100.6656103,
        "leaf_3_0_3": 1621993100.7016883,
        "leaf_3_0_4": 1621993091.1393309,
        "leaf_4_0_1": 1621993100.765724,
        "leaf_4_0_2": 1621993100.7962604,
        "leaf_4_0_3": 1621993100.8265777,
        "leaf_4_0_4": 1621993100.769754,
        "spine_1_1_1": 1621993100.810088,
        "spine_1_1_2": 1621993100.8479006,
        "spine_1_1_3": 1621993100.7950253,
        "spine_1_1_4": 1621993091.1856866,
        "spine_2_1_1": 1621993100.8444939,
        "spine_2_1_2": 1621993100.8096683,
        "spine_2_1_3": 1621993100.8356607,
        "spine_2_1_4": 1621993100.873144,
        "spine_3_1_1": 1621993100.8517232,
        "spine_3_1_2": 1621993100.8775558,
        "spine_3_1_3": 1621993091.289042,
        "spine_3_1_4": 1621993100.874144,
        "spine_4_1_1": 1621993100.9154027,
        "spine_4_1_2": 1621993100.949066,
        "spine_4_1_3": 1621993100.8754258,
        "spine_4_1_4": 1621993100.908279,
        "tof_1_2_1": 1621993100.9519904,
        "tof_1_2_2": 1621993100.8837056,
        "tof_1_2_3": 1621993100.9279668,
        "tof_1_2_4": 1621993100.9620578,
        "tof_2_2_1": 1621993091.3246803,
        "tof_2_2_2": 1621993100.9779205,
        "tof_2_2_3": 1621993100.9860215,
        "tof_2_2_4": 1621993100.9763765
    }
}