{
    "k_leaf": 4,
    "k_top": 4,
    "redundancy_factor": 2,
    "is_k8s": true,
    "machine_mac_addresses": {
        "leaf_1_0_1": {
            "net0": "06:4b:37:87:14:c2",
            "net1": "02:0b:2b:c6:fe:11",
            "net2": "c6:dc:c2:9c:74:a0",
            "net3": "26:67:a8:fb:53:5a",
            "net4": "7e:02:33:36:b4:8a"
        },
        "leaf_1_0_2": {
            "net0": "f2:df:86:ea:b5:ef",
            "net1": "d6:b2:80:3e:40:87",
            "net2": "92:b1:4c:31:1c:7a",
            "net3": "3e:c3:01:bf:42:56",
            "net4": "4e:44:07:d5:be:51"
        },
        "leaf_1_0_3": {
            "net0": "86:7f:b3:62:95:66",
            "net1": "d2:4a:ed:5a:a0:c1",
            "net2": "8a:5a:b1:76:04:e5",
            "net3": "c6:cd:1d:a5:36:0c",
            "net4": "72:d1:86:04:63:8c"
        },
        "leaf_1_0_4": {
            "net0": "2a:96:07:64:d3:a3",
            "net1": "be:eb:06:a3:a7:0b",
            "net2": "aa:db:9d:c2:c4:70",
            "net3": "fe:81:1f:cc:80:1a",
            "net4": "42:0b:32:af:bf:1f"
        },
        "leaf_2_0_1": {
            "net0": "52:bd:c2:42:55:ed",
            "net1": "c2:77:57:a0:76:8b",
            "net2": "0e:73:b6:61:05:c8",
            "net3": "1a:02:88:1f:b4:0b",
            "net4": "4e:61:15:08:61:c3"
        },
        "leaf_2_0_2": {
            "net0": "86:0d:64:6c:bd:e6",
            "net1": "ae:0d:de:97:6e:ec",
            "net2": "06:48:75:a9:df:59",
            "net3": "22:06:53:72:8f:cb",
            "net4": "36:ff:e2:3e:4a:ec"
        },
        "leaf_2_0_3": {
            "net0": "2a:74:96:c0:26:4a",
            "net1": "7e:69:38:4b:8b:ec",
            "net2": "52:52:52:4e:34:4f",
            "net3": "4a:3a:37:b8:cf:24",
            "net4": "d2:90:a5:28:70:de"
        },
        "leaf_2_0_4": {
            "net0": "e6:ba:b6:ae:7d:7f",
            "net1": "3a:5c:39:22:99:77",
            "net2": "ce:49:5b:b5:84:d7",
            "net3": "2e:63:e6:cd:a1:5c",
            "net4": "aa:7d:8b:ed:c0:18"
        },
        "leaf_3_0_1": {
            "net0": "2e:bc:c4:16:b7:40",
            "net1": "8e:d2:31:01:5d:a7",
            "net2": "0e:7b:f7:7e:a8:42",
            "net3": "32:a2:12:c6:60:df",
            "net4": "ea:d5:01:77:e5:c8"
        },
        "leaf_3_0_2": {
            "net0": "be:bd:c3:ad:1f:be",
            "net1": "da:9e:9a:02:36:f6",
            "net2": "42:b3:93:93:f6:43",
            "net3": "46:c1:3c:30:d6:ac",
            "net4": "2a:51:e3:28:be:b3"
        },
        "leaf_3_0_3": {
            "net0": "26:3c:31:43:29:67",
            "net1": "62:a8:f5:6e:1e:ed",
            "net2": "12:d6:f3:fe:38:c5",
            "net3": "86:06:ba:c4:af:03",
            "net4": "5a:06:b1:59:bf:1b"
        },
        "leaf_3_0_4": {
            "net0": "4a:c1:fb:9c:cd:ef",
            "net1": "fe:80:ed:05:6d:a4",
            "net2": "22:ac:f4:03:48:19",
            "net3": "02:1c:11:37:70:9f",
            "net4": "12:d6:66:51:42:24"
        },
        "leaf_4_0_1": {
            "net0": "f6:b8:a8:91:61:b6",
            "net1": "1e:88:3d:12:0e:a9",
            "net2": "82:7c:89:6c:c3:b0",
            "net3": "0a:c1:f4:77:71:b3",
            "net4": "66:fd:26:37:47:f9"
        },
        "leaf_4_0_2": {
            "net0": "2a:41:72:e5:32:4f",
            "net1": "d2:c0:85:37:29:02",
            "net2": "9a:57:12:20:d3:9e",
            "net3": "c2:90:e8:5e:c7:3d",
            "net4": "4e:7b:8c:09:97:eb"
        },
        "leaf_4_0_3": {
            "net0": "6a:dc:57:2a:26:a7",
            "net1": "0a:95:3e:98:ef:d6",
            "net2": "fe:7e:00:49:79:5e",
            "net3": "9a:e9:3a:9d:48:3d",
            "net4": "f2:69:b7:22:e0:60"
        },
        "leaf_4_0_4": {
            "net0": "5a:cf:3b:69:c8:bf",
            "net1": "2a:99:0b:a9:c6:12",
            "net2": "a6:b8:28:64:88:76",
            "net3": "36:84:b8:4a:37:75",
            "net4": "0a:f6:a3:c3:90:6e"
        },
        "spine_1_1_1": {
            "net0": "42:35:f4:8b:18:35",
            "net1": "3e:86:45:0e:a0:d2",
            "net2": "ba:06:0e:65:75:99",
            "net3": "5e:32:21:1a:e0:bf",
            "net4": "a2:63:b8:1f:7b:61",
            "net5": "4e:c0:04:a1:e7:7b",
            "net6": "9a:a1:bd:00:11:2a",
            "net7": "86:c6:a9:dc:e8:ec"
        },
        "spine_1_1_2": {
            "net0": "86:04:c3:66:81:58",
            "net1": "42:c4:2a:c2:ac:51",
            "net2": "82:88:bf:98:b3:0a",
            "net3": "72:07:39:d8:ab:ad",
            "net4": "06:e8:4d:f7:d7:51",
            "net5": "42:2a:29:07:f1:ce",
            "net6": "8a:66:46:21:c4:69",
            "net7": "e6:ad:be:c1:2b:fc"
        },
        "spine_1_1_3": {
            "net0": "06:34:98:a1:e2:12",
            "net1": "66:89:5e:11:f6:48",
            "net2": "f2:4e:ea:97:10:c6",
            "net3": "6e:ae:12:ed:79:07",
            "net4": "06:7f:fb:b0:ca:1e",
            "net5": "ae:08:20:e4:b8:a1",
            "net6": "0a:d5:fb:46:ff:1a",
            "net7": "fe:78:ae:b9:93:d1"
        },
        "spine_1_1_4": {
            "net0": "1a:88:07:b5:c5:4f",
            "net1": "1e:ce:c1:93:03:ba",
            "net2": "f2:bf:11:38:34:c8",
            "net3": "3a:55:85:34:4a:5d",
            "net4": "d6:b5:eb:5b:cb:9f",
            "net5": "8e:cd:ce:1d:3c:bb",
            "net6": "1e:f8:21:00:f3:81",
            "net7": "d2:2a:28:12:3c:ee"
        },
        "spine_2_1_1": {
            "net0": "72:44:2f:48:1d:62",
            "net1": "e6:f6:5f:51:29:b5",
            "net2": "da:3a:4d:6b:25:e1",
            "net3": "f6:cb:3f:4a:66:13",
            "net4": "8e:59:9e:fe:3e:42",
            "net5": "96:68:08:ae:77:97",
            "net6": "f6:5b:94:bd:3b:aa",
            "net7": "be:b6:e7:ad:21:10"
        },
        "spine_2_1_2": {
            "net0": "c6:4a:57:df:f7:07",
            "net1": "7a:32:3e:be:bc:66",
            "net2": "9e:77:9e:49:79:7e",
            "net3": "ea:bd:67:94:ff:0f",
            "net4": "a2:cc:8d:03:3d:bf",
            "net5": "d2:05:6a:a4:04:9e",
            "net6": "e2:e6:9c:ae:ec:fb",
            "net7": "1a:2f:04:47:28:29"
        },
        "spine_2_1_3": {
            "net0": "3a:4a:cf:1e:1b:c9",
            "net1": "ae:7a:ea:6a:72:6a",
            "net2": "3e:c4:d1:6a:68:2f",
            "net3": "f6:e8:6b:bd:a5:1f",
            "net4": "3e:c8:9b:45:e7:4f",
            "net5": "f2:ea:09:14:df:9d",
            "net6": "3e:11:9d:b1:a1:2b",
            "net7": "ce:cb:ff:aa:a5:36"
        },
        "spine_2_1_4": {
            "net0": "ee:53:86:1f:4c:fe",
            "net1": "66:9f:58:27:55:fc",
            "net2": "4e:ae:f4:42:63:d0",
            "net3": "f2:0d:de:30:5f:34",
            "net4": "5e:fb:d1:9f:51:1c",
            "net5": "a6:a8:fb:af:04:61",
            "net6": "36:ee:6a:e3:f8:86",
            "net7": "da:7a:3d:16:5e:10"
        },
        "spine_3_1_1": {
            "net0": "2a:97:82:00:7e:e1",
            "net1": "d6:f4:50:9e:3a:b1",
            "net2": "5e:e8:20:70:f0:be",
            "net3": "0e:9b:60:dd:05:d7",
            "net4": "72:94:ef:07:2e:9c",
            "net5": "12:5e:8d:b4:a7:0f",
            "net6": "56:9a:48:2f:51:84",
            "net7": "12:1b:69:a7:6e:be"
        },
        "spine_3_1_2": {
            "net0": "02:28:95:37:e4:79",
            "net1": "3a:dc:ce:a0:0c:58",
            "net2": "d2:84:a4:fa:0b:37",
            "net3": "1a:aa:38:36:95:a8",
            "net4": "02:13:f6:ed:7a:cf",
            "net5": "86:72:f7:ca:71:65",
            "net6": "72:16:41:94:2d:46",
            "net7": "ce:ff:09:85:1b:0b"
        },
        "spine_3_1_3": {
            "net0": "16:22:9b:5d:49:35",
            "net1": "ba:0a:74:8c:f8:da",
            "net2": "9e:74:bd:02:5d:06",
            "net3": "fa:9b:e3:a3:1a:90",
            "net4": "a6:a4:fe:5b:1e:60",
            "net5": "4a:3d:6a:9b:f3:4c",
            "net6": "aa:a2:26:99:0b:0b",
            "net7": "ea:82:32:b0:b2:c9"
        },
        "spine_3_1_4": {
            "net0": "f6:46:cb:c6:77:59",
            "net1": "9a:19:e0:e3:59:0e",
            "net2": "32:cb:38:bd:7b:b5",
            "net3": "4e:ca:54:84:77:aa",
            "net4": "9e:ea:b8:16:b6:cc",
            "net5": "16:aa:b4:9b:0c:de",
            "net6": "6e:3c:d3:d0:54:57",
            "net7": "ca:3b:bd:a9:70:d8"
        },
        "spine_4_1_1": {
            "net0": "12:fc:30:2f:eb:cf",
            "net1": "a6:1f:8b:14:a8:76",
            "net2": "aa:1e:52:94:14:eb",
            "net3": "46:88:06:14:cb:5e",
            "net4": "16:57:29:e7:3f:e4",
            "net5": "d2:a0:51:2b:a0:59",
            "net6": "32:c7:10:0b:c5:37",
            "net7": "3a:33:99:20:c8:5e"
        },
        "spine_4_1_2": {
            "net0": "fa:8c:9c:d6:ab:92",
            "net1": "c6:1d:81:34:49:9d",
            "net2": "8e:97:e1:16:b8:2b",
            "net3": "a2:83:e3:8c:f5:21",
            "net4": "4a:26:e4:9d:ba:fe",
            "net5": "1e:1d:dc:36:b9:f9",
            "net6": "d2:d4:cd:fb:d6:55",
            "net7": "d2:68:0b:cf:f5:4d"
        },
        "spine_4_1_3": {
            "net0": "a2:69:25:32:92:2b",
            "net1": "7a:12:89:b9:22:01",
            "net2": "fa:b6:b6:3f:ed:51",
            "net3": "b6:f3:ac:70:b8:b4",
            "net4": "12:86:b0:13:d0:4c",
            "net5": "12:22:a2:54:fc:16",
            "net6": "5a:ad:42:33:0d:51",
            "net7": "66:10:2c:77:11:e9"
        },
        "spine_4_1_4": {
            "net0": "66:96:d1:ef:34:9b",
            "net1": "06:18:00:19:53:96",
            "net2": "fa:2d:8b:67:dc:1c",
            "net3": "5a:fa:11:8b:81:32",
            "net4": "02:9b:65:02:b8:2e",
            "net5": "0e:ec:34:25:bb:d3",
            "net6": "b6:cb:ac:05:7a:19",
            "net7": "a6:0a:f7:9f:5b:7c"
        },
        "tof_1_2_1": {
            "net0": "7a:2f:9f:38:a7:0f",
            "net1": "6a:33:de:3f:e3:55",
            "net2": "0a:c1:53:e4:03:21",
            "net3": "5e:8f:d4:a9:b9:46",
            "net4": "42:6c:04:9d:82:ce",
            "net5": "86:d6:1c:ab:97:91",
            "net6": "4a:29:56:0e:49:b3",
            "net7": "1e:2d:5e:d7:56:0c",
            "net8": "f2:90:62:49:e8:02"
        },
        "tof_1_2_2": {
            "net0": "f2:c6:43:7a:8a:b8",
            "net1": "02:7e:54:00:f8:54",
            "net2": "ca:c4:70:ff:bc:d8",
            "net3": "62:2f:f1:d6:2d:35",
            "net4": "52:7b:4a:8f:de:74",
            "net5": "6e:cb:23:41:23:21",
            "net6": "7a:0e:4f:7d:0f:11",
            "net7": "2e:71:ab:e1:39:d0",
            "net8": "4e:a2:7e:94:43:b3"
        },
        "tof_1_2_3": {
            "net0": "d6:b2:09:2b:75:9c",
            "net1": "6a:b4:8a:96:48:b2",
            "net2": "32:8b:91:00:7f:65",
            "net3": "9a:6a:a3:ff:f4:77",
            "net4": "ba:e2:e3:14:0e:e9",
            "net5": "3a:d5:ff:89:ae:ed",
            "net6": "b2:08:d1:60:5b:16",
            "net7": "16:4f:c8:12:a6:c3",
            "net8": "ce:01:2e:91:29:14"
        },
        "tof_1_2_4": {
            "net0": "4a:6c:6d:d9:02:ea",
            "net1": "16:1c:1d:92:7c:03",
            "net2": "c6:5a:d0:91:2e:03",
            "net3": "be:8d:12:15:c3:e3",
            "net4": "7a:56:d7:17:33:4f",
            "net5": "66:36:0f:e6:1a:c9",
            "net6": "de:d6:44:56:cc:1a",
            "net7": "ba:0d:ac:3e:39:3a",
            "net8": "fe:3d:41:80:4a:f5"
        },
        "tof_2_2_1": {
            "net0": "0e:b1:c2:a0:f3:f0",
            "net1": "6a:de:a6:62:df:c9",
            "net2": "56:66:55:9d:0a:35",
            "net3": "ee:9b:30:9f:a2:c2",
            "net4": "d2:fa:e9:de:7d:dd",
            "net5": "8e:0b:26:23:a3:6b",
            "net6": "62:a8:14:41:6e:3e",
            "net7": "02:2c:42:8f:64:83",
            "net8": "e2:44:5a:2b:96:21"
        },
        "tof_2_2_2": {
            "net0": "e2:00:35:22:8c:6a",
            "net1": "e6:1b:09:e3:be:b8",
            "net2": "b2:87:2c:ec:12:82",
            "net3": "b2:45:7c:f0:f8:dc",
            "net4": "fa:57:ac:a3:df:68",
            "net5": "62:92:a2:c1:1e:c4",
            "net6": "0a:bd:83:f4:a3:60",
            "net7": "82:dc:3f:6d:9c:5d",
            "net8": "72:27:f6:8f:c3:15"
        },
        "tof_2_2_3": {
            "net0": "4e:62:3c:3f:ff:89",
            "net1": "06:d7:21:c9:3c:88",
            "net2": "92:7a:e4:fb:c8:71",
            "net3": "42:fd:65:a1:15:46",
            "net4": "d6:38:67:e5:b1:7c",
            "net5": "92:39:f0:55:b7:fb",
            "net6": "7e:2e:51:7d:d9:dd",
            "net7": "8a:03:a8:a4:0a:23",
            "net8": "52:bc:61:ff:eb:6e"
        },
        "tof_2_2_4": {
            "net0": "22:44:bc:28:f2:c3",
            "net1": "f6:10:58:8f:2a:dd",
            "net2": "f6:8b:d0:0a:97:d9",
            "net3": "86:6c:c4:35:c9:58",
            "net4": "7a:4d:d1:87:34:b8",
            "net5": "ae:b8:25:ec:b2:ed",
            "net6": "42:1e:82:c3:2e:e3",
            "net7": "9a:28:f4:d0:8c:3e",
            "net8": "6e:56:25:94:75:9c"
        }
    },
    "failed_machine": "leaf_1_0_1",
    "failure_time": {
        "leaf_1_0_1": 1622753380.824428,
        "leaf_1_0_2": 1622753380.8335469,
        "leaf_1_0_3": 1622753380.8399646,
        "leaf_1_0_4": 1622753380.85299,
        "leaf_2_0_1": 1622753380.8579452,
        "leaf_2_0_2": 1622753380.824106,
        "leaf_2_0_3": 1622753380.832827,
        "leaf_2_0_4": 1622753380.8406925,
        "leaf_3_0_1": 1622753380.8550792,
        "leaf_3_0_2": 1622753380.8656192,
        "leaf_3_0_3": 1622753380.8685822,
        "leaf_3_0_4": 1622753380.8786075,
        "leaf_4_0_1": 1622753380.8840635,
        "leaf_4_0_2": 1622753380.8907392,
        "leaf_4_0_3": 1622753380.8976755,
        "leaf_4_0_4": 1622753380.8718913,
        "spine_1_1_1": 1622753380.876319,
        "spine_1_1_2": 1622753380.8829048,
        "spine_1_1_3": 1622753380.8879676,
        "spine_1_1_4": 1622753380.893366,
        "spine_2_1_1": 1622753380.899756,
        "spine_2_1_2": 1622753380.912576,
        "spine_2_1_3": 1622753380.918159,
        "spine_2_1_4": 1622753380.9226072,
        "spine_3_1_1": 1622753380.9340725,
        "spine_3_1_2": 1622753380.9043458,
        "spine_3_1_3": 1622753380.908844,
        "spine_3_1_4": 1622753380.917258,
        "spine_4_1_1": 1622753380.9204166,
        "spine_4_1_2": 1622753380.9270592,
        "spine_4_1_3": 1622753380.9366894,
        "spine_4_1_4": 1622753380.9456062,
        "tof_1_2_1": 1622753380.95389,
        "tof_1_2_2": 1622753380.9644601,
        "tof_1_2_3": 1622753380.976259,
        "tof_1_2_4": 1622753380.9459245,
        "tof_2_2_1": 1622753380.9529276,
        "tof_2_2_2": 1622753380.9624362,
        "tof_2_2_3": 1622753380.9712746,
        "tof_2_2_4": 1622753380.9774575
    }
}