{
    "k_leaf": 12,
    "k_top": 12,
    "redundancy_factor": 12,
    "is_k8s": true,
    "machine_mac_addresses": {
        "leaf_1_0_1": {
            "net0": "ba:91:8f:44:f9:03",
            "net1": "e6:48:c9:6f:3d:61",
            "net10": "92:03:51:dd:03:08",
            "net11": "0a:e3:b7:08:a7:6a",
            "net12": "9e:15:d8:aa:f7:06",
            "net2": "1a:eb:06:e5:dc:30",
            "net3": "d6:fc:be:a7:8d:da",
            "net4": "52:b3:29:ec:3e:8f",
            "net5": "82:51:a2:6c:06:3d",
            "net6": "8a:5e:84:bd:a5:20",
            "net7": "e6:1a:23:68:38:50",
            "net8": "e2:80:68:4a:d6:4a",
            "net9": "ae:9e:3c:2a:2d:8d"
        },
        "leaf_1_0_10": {
            "net0": "fa:05:a4:3b:b3:8d",
            "net1": "fa:fc:5f:19:d9:18",
            "net10": "4a:58:d2:0f:cc:ad",
            "net11": "76:42:be:4e:12:f5",
            "net12": "46:10:66:0c:32:f7",
            "net2": "f2:7f:e2:45:2f:ec",
            "net3": "02:50:17:ed:38:ca",
            "net4": "42:6b:27:d3:ab:f7",
            "net5": "fe:c8:13:d4:21:0b",
            "net6": "22:04:1e:0b:92:7d",
            "net7": "9a:08:ba:c2:b2:0b",
            "net8": "32:e1:7c:da:73:80",
            "net9": "8e:a1:95:18:28:9a"
        },
        "leaf_1_0_11": {
            "net0": "fe:8e:e5:21:f2:71",
            "net1": "46:c4:d5:67:cc:fa",
            "net10": "ae:2d:27:54:7b:2a",
            "net11": "56:3b:ed:8c:cb:b8",
            "net12": "a6:0e:58:a5:45:31",
            "net2": "ca:10:d3:d9:3b:39",
            "net3": "6e:1e:9f:31:27:cb",
            "net4": "92:66:92:9c:75:7d",
            "net5": "72:aa:30:46:88:a2",
            "net6": "22:0b:1f:0c:8c:96",
            "net7": "96:5c:8c:16:a7:5e",
            "net8": "ca:90:dc:c1:4b:c3",
            "net9": "aa:4f:45:30:19:7b"
        },
        "leaf_1_0_12": {
            "net0": "0e:1e:83:b1:0f:0f",
            "net1": "22:21:b0:dd:3d:4b",
            "net10": "be:42:df:5a:9f:99",
            "net11": "ce:5f:a5:2f:ce:d5",
            "net12": "ee:7c:28:5c:fe:ca",
            "net2": "ee:a3:76:38:37:d9",
            "net3": "02:af:31:8b:85:70",
            "net4": "9e:58:17:71:5d:99",
            "net5": "92:b8:9f:20:14:52",
            "net6": "be:2a:13:e5:3b:9f",
            "net7": "0e:b3:87:70:30:4d",
            "net8": "76:99:8d:64:c3:f1",
            "net9": "56:cd:a7:5f:27:b6"
        },
        "leaf_1_0_2": {
            "net0": "4a:9c:bd:9a:f4:ba",
            "net1": "0a:71:a6:d7:e6:22",
            "net10": "9e:d3:27:7d:92:b1",
            "net11": "9a:a5:17:11:b7:16",
            "net12": "5a:f7:7d:c1:75:19",
            "net2": "8a:fd:fc:0d:e3:6f",
            "net3": "32:40:4a:21:b7:78",
            "net4": "62:f6:0c:76:8c:8d",
            "net5": "5a:47:6e:d5:86:46",
            "net6": "aa:d2:f7:0b:b6:f9",
            "net7": "de:da:d9:3e:9a:76",
            "net8": "56:3c:18:0a:d7:d4",
            "net9": "3e:10:50:7d:e0:57"
        },
        "leaf_1_0_3": {
            "net0": "1e:dd:4e:52:4b:f2",
            "net1": "12:f8:0a:15:9e:8a",
            "net10": "d6:f0:8b:bc:81:09",
            "net11": "b6:0a:6c:5d:98:12",
            "net12": "3e:5e:66:ee:4d:1f",
            "net2": "0e:77:9a:a2:76:e8",
            "net3": "aa:0c:bc:0a:fa:58",
            "net4": "9e:8d:e6:7a:5c:22",
            "net5": "fe:68:de:a4:51:65",
            "net6": "ba:62:0a:b3:df:b1",
            "net7": "4a:f2:3e:1b:a9:9c",
            "net8": "c2:23:96:4b:2c:08",
            "net9": "d2:c0:1f:e9:69:ae"
        },
        "leaf_1_0_4": {
            "net0": "fe:65:0a:98:3f:70",
            "net1": "02:3c:b3:14:93:12",
            "net10": "22:6b:87:01:2c:c1",
            "net11": "ce:9b:48:cb:f8:9b",
            "net12": "52:4d:2b:5b:78:cd",
            "net2": "7a:67:f6:3f:54:4e",
            "net3": "3a:e5:47:9f:9d:ec",
            "net4": "16:b5:0b:dd:a2:33",
            "net5": "f6:93:9a:04:54:c5",
            "net6": "fa:21:48:68:e6:55",
            "net7": "e6:60:48:1d:d5:89",
            "net8": "5a:77:cf:44:69:17",
            "net9": "56:83:bc:75:f6:67"
        },
        "leaf_1_0_5": {
            "net0": "52:41:42:0a:de:a7",
            "net1": "76:91:d2:8f:c0:c7",
            "net10": "ce:a2:0b:51:5e:fc",
            "net11": "a6:dd:27:cb:25:15",
            "net12": "7a:96:2f:4d:6d:27",
            "net2": "4e:32:01:92:4c:ac",
            "net3": "86:db:fc:1d:fd:e9",
            "net4": "c2:35:c7:19:92:d9",
            "net5": "36:7d:7c:4e:b0:1a",
            "net6": "e6:e2:25:2a:e9:39",
            "net7": "b2:1b:2f:b5:29:dc",
            "net8": "5a:92:7c:71:35:e5",
            "net9": "ea:42:54:0c:c0:e2"
        },
        "leaf_1_0_6": {
            "net0": "a6:fb:d9:ce:09:c4",
            "net1": "76:8c:33:19:dc:96",
            "net10": "76:34:fe:6f:48:17",
            "net11": "e6:85:d6:cf:59:d0",
            "net12": "ba:36:d2:80:54:73",
            "net2": "ea:2d:58:cd:d2:97",
            "net3": "d2:51:2f:d4:22:fa",
            "net4": "e2:6c:19:d4:2e:f9",
            "net5": "2e:f5:47:f9:ab:2d",
            "net6": "ce:1e:f1:4a:a7:21",
            "net7": "fa:cd:2c:39:0c:17",
            "net8": "5a:be:29:9c:15:5f",
            "net9": "32:03:d2:16:33:9a"
        },
        "leaf_1_0_7": {
            "net0": "6e:4f:7b:a3:19:42",
            "net1": "46:df:24:f5:ab:bc",
            "net10": "e6:f7:57:4b:f8:8f",
            "net11": "be:a1:03:50:3e:48",
            "net12": "5a:ed:9c:a9:bc:9f",
            "net2": "a6:0e:1a:00:f7:d9",
            "net3": "56:70:16:00:44:3e",
            "net4": "2e:3a:0f:d3:5f:06",
            "net5": "c2:0a:bf:76:43:a8",
            "net6": "e6:e5:a6:93:38:0c",
            "net7": "e6:73:67:94:ec:61",
            "net8": "fe:74:e2:41:1c:a5",
            "net9": "7a:35:43:f8:d0:1b"
        },
        "leaf_1_0_8": {
            "net0": "96:04:a4:63:39:32",
            "net1": "4e:d5:4c:bc:28:b9",
            "net10": "82:46:f2:1d:c5:85",
            "net11": "ae:b8:ee:ef:54:5f",
            "net12": "b6:23:50:9a:95:bd",
            "net2": "ca:ed:b0:d2:a3:e0",
            "net3": "de:69:79:03:d2:2c",
            "net4": "36:ce:c0:58:12:bc",
            "net5": "72:26:c3:d7:ea:8b",
            "net6": "52:06:39:f7:a7:6f",
            "net7": "86:e4:29:ac:9c:b2",
            "net8": "46:ae:0c:86:ba:76",
            "net9": "2a:63:2c:23:31:4e"
        },
        "leaf_1_0_9": {
            "net0": "1e:b0:0c:42:2a:9b",
            "net1": "c6:ba:c7:41:e1:01",
            "net10": "ba:0e:08:1f:1b:29",
            "net11": "aa:a8:82:76:53:bb",
            "net12": "d2:01:71:37:92:5e",
            "net2": "b6:b3:20:2c:4a:47",
            "net3": "42:1b:15:80:15:21",
            "net4": "b6:e2:56:76:d5:40",
            "net5": "8a:5d:a2:87:7b:12",
            "net6": "c2:d5:2c:87:4e:4a",
            "net7": "62:1e:45:ef:ed:5d",
            "net8": "5e:29:2f:ae:39:0f",
            "net9": "2e:b5:bd:78:e8:23"
        },
        "leaf_2_0_1": {
            "net0": "a2:82:5f:17:a0:81",
            "net1": "7a:65:72:00:9d:b4",
            "net10": "7a:19:dc:7c:b6:7e",
            "net11": "66:1d:30:d0:8c:3b",
            "net12": "46:cc:65:03:63:be",
            "net2": "ae:ca:df:cd:a8:92",
            "net3": "2e:e7:a6:4e:00:2c",
            "net4": "de:75:c6:b0:87:c1",
            "net5": "26:1b:7b:bc:f0:2f",
            "net6": "3e:dd:3b:98:a2:43",
            "net7": "ee:e7:7c:a9:c5:46",
            "net8": "82:1e:ec:9d:d9:19",
            "net9": "fa:d0:71:55:9a:82"
        },
        "leaf_2_0_10": {
            "net0": "96:40:94:9e:7e:38",
            "net1": "fe:98:24:5a:c8:e3",
            "net10": "a6:24:b7:cd:dc:4a",
            "net11": "52:b7:04:ec:3f:29",
            "net12": "96:90:63:eb:52:80",
            "net2": "4a:71:b8:ef:3c:16",
            "net3": "62:f5:bd:66:70:05",
            "net4": "12:b3:ee:7e:86:09",
            "net5": "8a:4a:5c:95:04:b8",
            "net6": "a2:5e:96:a5:6e:b7",
            "net7": "5a:15:94:8b:a1:2a",
            "net8": "36:61:16:9a:be:54",
            "net9": "66:5b:82:08:2d:35"
        },
        "leaf_2_0_11": {
            "net0": "16:d6:43:48:86:77",
            "net1": "d6:81:e1:b9:15:c3",
            "net10": "26:24:3a:21:6d:aa",
            "net11": "5e:1f:5f:2a:47:1e",
            "net12": "e2:1d:41:a5:cc:ad",
            "net2": "66:78:22:16:62:84",
            "net3": "4e:b2:67:2e:7b:22",
            "net4": "5a:51:2f:3a:dc:c9",
            "net5": "16:86:c2:61:7e:dc",
            "net6": "c2:35:16:bb:31:97",
            "net7": "8e:c0:af:14:0b:ba",
            "net8": "ea:05:1a:72:e6:b5",
            "net9": "8a:6f:9e:60:c9:63"
        },
        "leaf_2_0_12": {
            "net0": "5a:6c:de:0b:10:ea",
            "net1": "d2:72:ab:bb:09:75",
            "net10": "56:e8:da:e5:27:b5",
            "net11": "72:3b:f6:41:41:0d",
            "net12": "e2:90:00:a3:d6:b9",
            "net2": "92:17:87:8a:66:0b",
            "net3": "36:e1:60:fd:3d:d9",
            "net4": "6e:25:92:ef:3a:9a",
            "net5": "26:6f:f0:25:8a:75",
            "net6": "c2:0f:73:a4:1c:7d",
            "net7": "de:87:9d:83:4c:60",
            "net8": "fe:1d:e5:d1:bc:34",
            "net9": "0e:fa:05:28:a1:b2"
        },
        "leaf_2_0_2": {
            "net0": "66:18:5c:b1:fb:b8",
            "net1": "42:10:2b:b4:4e:4f",
            "net10": "b6:f6:ed:52:b3:b8",
            "net11": "1a:85:d2:9d:6d:04",
            "net12": "42:74:a2:5d:99:66",
            "net2": "b2:60:c6:41:2e:82",
            "net3": "22:a2:ba:1f:61:a4",
            "net4": "c2:a4:1e:69:99:09",
            "net5": "ca:bd:66:d6:f1:d4",
            "net6": "3a:76:67:bd:11:3e",
            "net7": "ea:17:17:4c:23:e2",
            "net8": "ee:d0:c3:f1:d1:15",
            "net9": "2e:d7:ee:7f:df:14"
        },
        "leaf_2_0_3": {
            "net0": "be:6b:36:de:53:83",
            "net1": "f2:db:4f:c7:b0:5b",
            "net10": "22:b4:05:4d:d0:92",
            "net11": "be:7e:ec:7b:43:8c",
            "net12": "3e:63:61:9b:0a:c3",
            "net2": "f2:06:de:1f:8b:88",
            "net3": "e2:e9:89:b7:fc:23",
            "net4": "aa:3c:01:b4:f9:a1",
            "net5": "22:7e:fe:ab:53:fe",
            "net6": "86:41:d3:fe:8d:f2",
            "net7": "5a:78:86:a0:9b:4b",
            "net8": "ae:0d:f5:e4:e0:36",
            "net9": "3a:50:ac:1f:9b:7e"
        },
        "leaf_2_0_4": {
            "net0": "16:01:20:a7:2f:da",
            "net1": "1e:3a:93:b8:8b:e4",
            "net10": "c6:3e:a9:21:96:c4",
            "net11": "62:85:ed:68:76:70",
            "net12": "32:58:b9:39:3f:a4",
            "net2": "7e:10:85:3f:60:ad",
            "net3": "02:e6:b7:46:c5:ac",
            "net4": "96:1c:a9:53:3b:c3",
            "net5": "52:b9:09:79:0b:92",
            "net6": "76:e0:bb:3b:ea:1d",
            "net7": "32:bf:15:a3:6f:3d",
            "net8": "a6:b3:ad:7b:31:5f",
            "net9": "1e:b6:3c:b3:63:4d"
        },
        "leaf_2_0_5": {
            "net0": "26:c0:5a:86:16:83",
            "net1": "a6:c7:55:fd:bd:ce",
            "net10": "3e:b0:d5:2b:f8:c6",
            "net11": "66:e0:af:58:ed:26",
            "net12": "16:34:49:97:06:7c",
            "net2": "7e:3f:b7:ec:50:91",
            "net3": "7e:8a:35:b6:ae:8b",
            "net4": "5a:32:01:28:74:f5",
            "net5": "c2:a0:a2:b5:66:f8",
            "net6": "8a:ba:36:a4:0b:4e",
            "net7": "5e:6d:68:99:56:ab",
            "net8": "8e:20:59:b2:a6:71",
            "net9": "22:c2:ab:5f:31:13"
        },
        "leaf_2_0_6": {
            "net0": "c2:70:1d:08:bd:ab",
            "net1": "26:c5:fa:8f:48:7a",
            "net10": "0e:95:7e:e6:b8:67",
            "net11": "ca:d6:06:c8:5d:78",
            "net12": "be:09:cf:50:17:84",
            "net2": "b6:a0:6b:fb:f8:a5",
            "net3": "56:04:e1:40:93:f4",
            "net4": "f2:5e:c9:4a:3b:49",
            "net5": "f6:51:35:9d:11:f6",
            "net6": "e2:c2:4a:18:ce:8c",
            "net7": "ee:39:03:b4:39:11",
            "net8": "2a:28:7d:bf:ab:23",
            "net9": "6a:33:bb:9c:c3:ff"
        },
        "leaf_2_0_7": {
            "net0": "82:c5:56:c4:24:a5",
            "net1": "46:3a:cb:d7:95:9a",
            "net10": "be:85:70:72:f2:62",
            "net11": "d6:2a:d3:44:db:a5",
            "net12": "ca:70:ec:26:a2:0c",
            "net2": "ce:a7:2c:4b:5a:bf",
            "net3": "86:3a:6c:5f:bc:2b",
            "net4": "0e:a1:cc:61:5c:11",
            "net5": "6e:50:c8:73:8b:5a",
            "net6": "ee:c7:6f:d8:c9:2f",
            "net7": "f2:fa:c1:49:e3:2a",
            "net8": "12:ec:3f:a4:e0:5e",
            "net9": "e2:40:2b:7f:48:ca"
        },
        "leaf_2_0_8": {
            "net0": "1e:6a:24:e1:f6:d2",
            "net1": "82:64:0f:55:0d:78",
            "net10": "1a:2e:64:ef:3e:6a",
            "net11": "6e:00:8a:16:9a:81",
            "net12": "c6:b5:47:85:77:b6",
            "net2": "6e:6a:3f:b5:4e:0e",
            "net3": "5e:4b:37:32:d3:73",
            "net4": "c6:86:67:fe:4a:31",
            "net5": "5a:7c:95:e7:87:96",
            "net6": "4e:e8:33:b3:a0:4b",
            "net7": "be:29:cf:98:7d:bb",
            "net8": "ca:56:ff:90:b9:a4",
            "net9": "5a:70:5a:30:16:43"
        },
        "leaf_2_0_9": {
            "net0": "42:ae:54:6f:d0:30",
            "net1": "4e:a5:aa:42:f4:1b",
            "net10": "ca:19:e8:7b:b2:7e",
            "net11": "a2:55:60:29:e9:2b",
            "net12": "7e:d0:9a:6a:ca:89",
            "net2": "b6:2f:c3:e3:f9:0e",
            "net3": "2e:ea:89:57:b9:59",
            "net4": "ae:83:b0:81:d5:62",
            "net5": "c2:fb:d4:fa:bf:b5",
            "net6": "02:7e:3b:c2:08:c3",
            "net7": "9e:29:db:0b:9a:84",
            "net8": "32:a5:27:62:78:ec",
            "net9": "46:7f:6c:59:6d:c5"
        },
        "spine_1_1_1": {
            "net0": "46:8f:d9:3b:e0:32",
            "net1": "ea:2a:06:0e:b9:b6",
            "net10": "36:0c:ce:23:ee:9d",
            "net11": "2a:82:70:3b:ac:f9",
            "net12": "36:e1:69:e9:d7:4d",
            "net13": "62:eb:94:d0:6d:97",
            "net14": "9e:ed:c4:fb:8a:69",
            "net15": "0e:ce:b9:bd:68:eb",
            "net16": "c2:05:1b:4e:2e:c7",
            "net17": "da:f6:86:84:32:3c",
            "net18": "36:d6:a6:38:d3:1c",
            "net19": "12:d7:3c:c4:6a:61",
            "net2": "ee:5b:58:59:d0:da",
            "net20": "72:80:11:71:88:14",
            "net21": "76:0f:50:26:06:46",
            "net22": "ea:4d:44:5f:1c:34",
            "net23": "32:a1:ad:74:06:1e",
            "net3": "16:95:af:6f:91:52",
            "net4": "aa:0a:28:12:b7:06",
            "net5": "9a:a4:86:50:13:51",
            "net6": "fa:3f:01:3d:35:11",
            "net7": "d2:e4:1a:fd:99:61",
            "net8": "6a:01:a2:ea:88:99",
            "net9": "ce:6c:43:0d:2c:b5"
        },
        "spine_1_1_10": {
            "net0": "d6:43:bb:db:1c:f4",
            "net1": "ae:c7:ee:0d:05:9a",
            "net10": "4a:5f:fb:d0:37:b4",
            "net11": "9a:90:18:a4:e9:fa",
            "net12": "0a:c8:4f:37:e6:ae",
            "net13": "86:81:ef:cf:92:e6",
            "net14": "0a:a6:ba:14:ad:e3",
            "net15": "ea:f7:c8:16:b7:a1",
            "net16": "0e:c5:5d:e1:c5:27",
            "net17": "da:b8:41:81:ed:79",
            "net18": "32:9d:22:64:34:fa",
            "net19": "62:18:ba:46:e6:6e",
            "net2": "2e:0c:a0:ba:53:86",
            "net20": "e2:b0:2c:d3:91:4a",
            "net21": "36:91:d1:a9:50:73",
            "net22": "3a:b8:72:6c:3e:5f",
            "net23": "ae:d3:80:3c:c2:21",
            "net3": "d2:a4:95:17:64:77",
            "net4": "a6:bb:7a:fd:d7:de",
            "net5": "7e:09:13:9e:dc:3e",
            "net6": "c2:58:b7:96:63:46",
            "net7": "06:26:19:97:a5:74",
            "net8": "02:09:0e:ef:cd:86",
            "net9": "b6:2f:81:0a:e4:34"
        },
        "spine_1_1_11": {
            "net0": "72:74:17:93:48:b0",
            "net1": "72:30:f4:39:b8:9a",
            "net10": "26:4c:9b:e9:f5:22",
            "net11": "02:df:90:72:1b:f9",
            "net12": "a2:73:5f:09:07:2a",
            "net13": "46:7d:90:d1:d1:cb",
            "net14": "f6:7a:10:88:66:49",
            "net15": "56:b4:fe:f5:ff:c5",
            "net16": "ee:f8:dc:f7:b7:9e",
            "net17": "76:39:d1:66:78:49",
            "net18": "12:dd:45:07:5e:f7",
            "net19": "46:8a:34:f5:e4:0c",
            "net2": "6e:8a:cd:f2:7a:4d",
            "net20": "fa:30:8e:51:f2:4a",
            "net21": "92:cd:de:b0:47:f4",
            "net22": "66:e8:0c:30:4d:a5",
            "net23": "be:5b:6e:aa:92:21",
            "net3": "1a:06:ba:74:77:fc",
            "net4": "0e:fe:69:fa:5f:01",
            "net5": "76:20:8a:a6:ae:0d",
            "net6": "32:41:30:04:24:ac",
            "net7": "e2:e8:12:00:8e:ec",
            "net8": "66:1c:6f:69:6c:65",
            "net9": "66:ba:55:bc:9f:04"
        },
        "spine_1_1_12": {
            "net0": "3e:32:d9:30:57:05",
            "net1": "ce:3c:5d:90:e0:9f",
            "net10": "ce:b7:28:d9:d9:c9",
            "net11": "76:7c:cb:1f:34:54",
            "net12": "fe:a9:bc:f9:f0:1a",
            "net13": "32:9e:e2:44:bc:fd",
            "net14": "3a:be:56:73:00:d1",
            "net15": "fa:ea:c8:65:e1:0b",
            "net16": "3e:56:df:52:70:e0",
            "net17": "6e:b9:33:0f:11:52",
            "net18": "ba:77:d6:42:d9:e1",
            "net19": "4e:5f:ec:47:5e:30",
            "net2": "7e:f8:fc:f3:c5:d2",
            "net20": "3a:42:43:00:1b:4f",
            "net21": "d2:81:02:2f:33:46",
            "net22": "56:8d:08:bc:ad:5d",
            "net23": "e2:3b:da:91:75:83",
            "net3": "e2:6e:f6:d1:90:b2",
            "net4": "46:4f:f3:b1:b9:62",
            "net5": "3e:a7:02:37:a8:f6",
            "net6": "82:87:60:a7:76:49",
            "net7": "ea:b4:65:a1:d9:fd",
            "net8": "82:a7:4d:48:9f:08",
            "net9": "0e:9a:9a:9a:a7:ee"
        },
        "spine_1_1_2": {
            "net0": "0a:41:9d:cc:46:48",
            "net1": "fa:ef:d6:b9:03:2d",
            "net10": "f6:97:93:c6:7a:09",
            "net11": "a6:95:46:98:9e:36",
            "net12": "4a:cf:42:3f:da:3c",
            "net13": "b2:21:85:a8:f0:28",
            "net14": "f6:b1:b7:a5:9b:64",
            "net15": "aa:db:68:dd:5d:86",
            "net16": "46:a4:67:bc:a8:9e",
            "net17": "ee:b6:7c:ed:bc:8b",
            "net18": "ca:a0:ea:e5:2b:ef",
            "net19": "3a:57:fb:68:16:ef",
            "net2": "d6:10:a0:31:f3:01",
            "net20": "c2:5d:43:2e:6d:bf",
            "net21": "62:4b:fe:dd:39:8c",
            "net22": "92:53:42:4c:c7:25",
            "net23": "0e:0c:2b:f3:85:7a",
            "net3": "4a:ca:25:15:10:6f",
            "net4": "2a:ae:8f:f7:a5:07",
            "net5": "0e:49:a0:e2:71:50",
            "net6": "b6:03:54:5d:b9:b8",
            "net7": "42:7c:b8:34:ab:c4",
            "net8": "ae:72:07:34:81:72",
            "net9": "62:7c:c7:82:1a:e5"
        },
        "spine_1_1_3": {
            "net0": "7a:f9:fd:52:52:fc",
            "net1": "72:d2:1b:4e:9d:09",
            "net10": "1a:00:78:85:d0:d8",
            "net11": "e2:27:59:a3:1d:34",
            "net12": "2e:e7:c0:32:17:9b",
            "net13": "86:0b:95:10:4f:9c",
            "net14": "c6:c1:c5:5e:1c:3f",
            "net15": "1e:bc:27:d4:c4:79",
            "net16": "3e:17:2f:01:9f:7b",
            "net17": "36:94:46:ce:6f:03",
            "net18": "0a:b2:81:18:b9:68",
            "net19": "72:83:d5:26:c2:dc",
            "net2": "66:33:15:60:9e:7b",
            "net20": "82:c1:92:20:c3:ad",
            "net21": "d2:0c:50:b5:f1:6e",
            "net22": "0a:ff:21:fa:53:f3",
            "net23": "22:ca:09:59:02:74",
            "net3": "d2:0a:29:46:bd:66",
            "net4": "ee:2c:c3:8b:34:c0",
            "net5": "06:56:51:5b:83:2c",
            "net6": "0e:94:1e:1c:d0:33",
            "net7": "16:3e:c5:36:db:35",
            "net8": "aa:40:6b:fc:95:cc",
            "net9": "6e:5b:bf:57:56:f7"
        },
        "spine_1_1_4": {
            "net0": "3a:a6:cb:9c:db:7f",
            "net1": "32:82:5a:9d:b8:32",
            "net10": "02:6f:26:60:94:77",
            "net11": "ae:34:5a:d7:39:42",
            "net12": "82:41:04:e1:ba:79",
            "net13": "f6:d9:40:03:49:8b",
            "net14": "82:14:34:57:4d:69",
            "net15": "56:91:dd:d5:ad:c5",
            "net16": "9a:3c:05:ab:bd:23",
            "net17": "42:88:51:02:8b:ea",
            "net18": "0a:4f:ad:57:7b:99",
            "net19": "12:33:65:f2:c0:5e",
            "net2": "b6:be:e1:6e:28:fe",
            "net20": "16:2f:2c:2b:16:52",
            "net21": "16:51:c8:7d:d0:9d",
            "net22": "de:bc:ab:2f:e4:e5",
            "net23": "72:35:73:64:88:55",
            "net3": "ae:56:3e:b6:b8:5a",
            "net4": "de:aa:0e:9e:4a:f7",
            "net5": "c6:e0:d7:ac:d4:20",
            "net6": "b2:9a:a5:d0:4c:17",
            "net7": "5e:6b:22:46:b1:0d",
            "net8": "a2:10:45:c8:ea:a5",
            "net9": "9e:10:c4:67:35:3f"
        },
        "spine_1_1_5": {
            "net0": "56:54:79:4a:77:fa",
            "net1": "6e:e7:3a:1c:d0:0d",
            "net10": "ae:86:a0:e5:07:8c",
            "net11": "56:09:9b:fb:e1:d2",
            "net12": "0a:b5:70:b9:25:32",
            "net13": "62:8e:b4:3c:67:00",
            "net14": "12:91:0d:4a:2b:c5",
            "net15": "be:09:97:6a:6a:98",
            "net16": "12:12:4f:10:eb:3e",
            "net17": "2e:bc:c1:b1:4d:09",
            "net18": "c6:d6:7b:d1:c6:2f",
            "net19": "ce:e3:6b:a8:94:3f",
            "net2": "a2:e7:0e:68:09:c9",
            "net20": "f2:4b:94:8f:67:a0",
            "net21": "b2:b9:26:be:f2:e0",
            "net22": "6a:94:dc:e7:af:c4",
            "net23": "6a:a3:f2:61:14:56",
            "net3": "ba:32:bb:2a:8c:04",
            "net4": "36:29:0a:f3:b2:84",
            "net5": "f6:87:01:07:3a:ee",
            "net6": "1a:6b:e1:fe:26:be",
            "net7": "86:62:0c:34:f9:70",
            "net8": "66:45:d1:8b:30:06",
            "net9": "be:e8:0b:9b:71:8e"
        },
        "spine_1_1_6": {
            "net0": "2a:02:28:23:59:00",
            "net1": "c6:43:33:19:80:14",
            "net10": "1e:b9:e3:02:21:72",
            "net11": "f2:a6:eb:e2:67:e4",
            "net12": "a2:27:1c:cf:19:b5",
            "net13": "7e:cf:b5:9c:74:73",
            "net14": "16:1e:cc:c6:40:32",
            "net15": "36:d8:68:dc:5a:2a",
            "net16": "4a:c4:24:ef:14:4e",
            "net17": "16:88:8c:33:62:a5",
            "net18": "42:b4:e6:ac:ff:90",
            "net19": "f2:aa:64:c4:35:d6",
            "net2": "a2:d8:f9:6a:d3:2c",
            "net20": "da:82:5c:9d:c2:29",
            "net21": "52:67:b7:f5:fe:9e",
            "net22": "66:a1:64:2b:c6:d4",
            "net23": "22:30:39:4f:3c:da",
            "net3": "0a:4c:1f:d9:08:1a",
            "net4": "56:00:9d:4f:15:1c",
            "net5": "2a:e4:ad:78:f6:d3",
            "net6": "0e:fa:7c:cf:4b:c7",
            "net7": "36:7f:d4:02:00:73",
            "net8": "2a:ea:86:5b:18:be",
            "net9": "2a:e3:e4:9e:46:5f"
        },
        "spine_1_1_7": {
            "net0": "a2:09:15:c7:69:48",
            "net1": "36:ae:69:70:2b:7e",
            "net10": "de:e0:7f:73:19:fc",
            "net11": "ce:26:c4:80:c6:d6",
            "net12": "d6:bb:37:54:f0:d6",
            "net13": "22:77:cd:34:35:96",
            "net14": "ca:c6:1c:d1:0c:47",
            "net15": "fe:00:1e:8f:bf:68",
            "net16": "66:13:63:d3:9d:38",
            "net17": "0a:02:5b:08:08:4b",
            "net18": "9e:80:0f:fc:fb:93",
            "net19": "e6:64:b1:33:1e:62",
            "net2": "ee:5c:b5:9e:a6:a1",
            "net20": "9a:77:98:b8:15:ed",
            "net21": "06:0a:f5:bf:a7:f7",
            "net22": "4a:8e:ed:38:54:c7",
            "net23": "c2:bf:6c:a1:31:6c",
            "net3": "46:bb:fa:6a:bf:d3",
            "net4": "5e:ff:25:a0:be:65",
            "net5": "1a:d9:0f:50:3a:dc",
            "net6": "ba:30:c4:89:1d:47",
            "net7": "9e:95:d4:ca:bd:fc",
            "net8": "06:13:1b:c5:d6:be",
            "net9": "c2:45:bb:f8:df:6f"
        },
        "spine_1_1_8": {
            "net0": "76:d5:87:84:17:a6",
            "net1": "72:e8:65:23:10:75",
            "net10": "2e:0a:e1:74:b5:40",
            "net11": "32:e0:43:2f:a8:3e",
            "net12": "56:07:5b:73:df:9b",
            "net13": "8e:f2:83:ac:97:90",
            "net14": "32:c9:e1:22:24:25",
            "net15": "8a:a0:65:5f:e9:87",
            "net16": "2e:e6:54:62:97:3d",
            "net17": "9e:be:64:da:ef:45",
            "net18": "5a:fd:99:90:42:a0",
            "net19": "62:26:15:27:b5:a6",
            "net2": "5e:c3:6a:e3:6b:cd",
            "net20": "56:1e:7b:75:13:db",
            "net21": "ea:6a:84:3f:6b:6d",
            "net22": "1e:a4:f0:04:86:75",
            "net23": "52:15:16:94:1b:0c",
            "net3": "a2:03:5d:3d:6c:16",
            "net4": "b2:74:b1:c1:d7:30",
            "net5": "22:10:23:02:f1:e2",
            "net6": "d6:c5:71:11:c6:a3",
            "net7": "3a:4c:99:e3:d1:23",
            "net8": "fa:42:15:89:d8:94",
            "net9": "ce:5e:fa:8f:12:73"
        },
        "spine_1_1_9": {
            "net0": "b2:65:b1:68:76:fe",
            "net1": "02:b4:a9:1a:79:97",
            "net10": "36:8a:c4:e7:3d:28",
            "net11": "42:cc:6f:2f:d6:e6",
            "net12": "e2:60:bd:5d:cd:33",
            "net13": "22:d8:b5:32:22:79",
            "net14": "06:30:a6:29:bb:ac",
            "net15": "92:b5:86:12:c5:76",
            "net16": "d6:ea:b7:a4:b8:da",
            "net17": "92:3e:36:43:79:c3",
            "net18": "6e:0a:00:c4:f0:fc",
            "net19": "fa:9f:e6:de:99:22",
            "net2": "0a:fd:d2:02:e2:2d",
            "net20": "72:73:da:9a:bf:fb",
            "net21": "f2:67:1b:ac:4f:7a",
            "net22": "12:47:4b:ed:91:40",
            "net23": "4a:32:84:de:ee:a2",
            "net3": "0a:21:0f:61:6e:c9",
            "net4": "62:c5:f6:18:29:4b",
            "net5": "a6:c9:b2:8c:4c:b0",
            "net6": "ce:4d:4d:e6:42:a3",
            "net7": "a2:a4:02:70:05:90",
            "net8": "e6:82:72:12:f3:8c",
            "net9": "6e:5b:f8:5e:9c:9b"
        },
        "spine_2_1_1": {
            "net0": "42:05:de:1f:3b:90",
            "net1": "ca:3a:84:3f:38:b9",
            "net10": "92:24:8c:2c:fc:51",
            "net11": "aa:99:29:4c:ae:5e",
            "net12": "12:06:1b:7b:2a:74",
            "net13": "ba:b1:b8:60:6a:cc",
            "net14": "0e:43:6e:ac:19:c2",
            "net15": "66:de:bb:94:a1:1d",
            "net16": "9e:0e:23:7e:95:d5",
            "net17": "fe:f4:8a:b2:ad:cf",
            "net18": "1e:1c:98:db:98:e5",
            "net19": "0e:9d:1f:2c:9e:62",
            "net2": "b2:e9:5f:29:cf:fb",
            "net20": "66:83:da:44:47:26",
            "net21": "2e:ea:d0:28:a3:f7",
            "net22": "1e:51:62:d6:43:b8",
            "net23": "46:17:6d:39:33:99",
            "net3": "da:72:da:65:2f:bf",
            "net4": "06:d3:b4:23:f2:0d",
            "net5": "0e:cf:f5:88:d4:ab",
            "net6": "6e:08:e4:59:66:07",
            "net7": "76:0a:ba:cf:f8:96",
            "net8": "ea:15:f9:19:5d:98",
            "net9": "7e:ae:bd:95:30:4d"
        },
        "spine_2_1_10": {
            "net0": "a2:03:8e:40:95:b6",
            "net1": "12:ae:da:4b:73:8d",
            "net10": "02:dd:80:b2:80:2f",
            "net11": "d6:e9:87:0d:14:c4",
            "net12": "32:3d:91:3f:d2:8f",
            "net13": "ae:68:fb:31:7f:b2",
            "net14": "ea:42:8a:f6:30:00",
            "net15": "fe:20:b1:93:f4:5f",
            "net16": "f2:4b:c6:90:3a:98",
            "net17": "be:83:d0:a7:df:29",
            "net18": "d2:f8:40:f4:67:10",
            "net19": "4a:84:f0:17:2a:ff",
            "net2": "9a:b3:83:ee:57:c6",
            "net20": "66:1c:fc:3d:7d:a8",
            "net21": "72:ac:85:4b:45:f5",
            "net22": "9a:d7:09:31:1a:5f",
            "net23": "3a:b9:0c:f7:6c:eb",
            "net3": "e6:67:93:c4:a8:e1",
            "net4": "e2:1e:29:45:9a:7d",
            "net5": "ca:37:26:ea:5b:02",
            "net6": "66:be:d6:93:0b:42",
            "net7": "76:6c:d0:0c:dd:0b",
            "net8": "6a:ef:1b:73:c4:f6",
            "net9": "76:72:dd:45:60:43"
        },
        "spine_2_1_11": {
            "net0": "2e:2f:87:40:0f:f2",
            "net1": "46:4d:5f:69:86:43",
            "net10": "7e:9e:4c:b8:6b:10",
            "net11": "2a:df:7c:f5:c2:17",
            "net12": "da:e7:53:29:e4:a8",
            "net13": "56:07:26:ad:76:e2",
            "net14": "16:4d:73:1d:ef:36",
            "net15": "96:0b:f7:a1:7c:1e",
            "net16": "8a:f5:08:37:e2:d5",
            "net17": "ce:18:8b:3b:03:7d",
            "net18": "ce:a3:a9:a7:8e:80",
            "net19": "4e:5a:f2:1d:36:a7",
            "net2": "ea:65:48:bf:5b:76",
            "net20": "46:ac:1a:7c:77:7a",
            "net21": "da:7a:fa:d1:29:98",
            "net22": "82:78:2f:a7:1d:8b",
            "net23": "2a:d6:4b:dd:c5:09",
            "net3": "12:60:84:82:8d:9d",
            "net4": "fe:08:7d:f3:b8:37",
            "net5": "52:07:e1:23:bc:8d",
            "net6": "e2:67:23:fe:52:82",
            "net7": "06:56:c4:f3:3a:dd",
            "net8": "7e:44:48:cc:a5:93",
            "net9": "1e:44:c5:c1:28:73"
        },
        "spine_2_1_12": {
            "net0": "66:44:02:1d:44:d2",
            "net1": "02:3c:e0:9e:c6:36",
            "net10": "86:66:9d:e4:81:37",
            "net11": "da:f6:42:d1:4c:98",
            "net12": "9e:99:fa:ac:69:62",
            "net13": "f2:39:e1:64:16:33",
            "net14": "a2:43:0c:75:9b:1f",
            "net15": "5a:9e:c0:b5:e2:d6",
            "net16": "da:5d:2d:a0:b1:63",
            "net17": "d2:df:7c:54:ca:7d",
            "net18": "3e:48:a7:76:5e:c3",
            "net19": "2a:55:38:4f:33:e9",
            "net2": "62:5e:e8:a5:d6:6a",
            "net20": "d6:d6:b4:01:71:e6",
            "net21": "5a:3b:3e:40:2f:2b",
            "net22": "c6:a8:29:cb:74:b1",
            "net23": "ea:40:af:2a:d4:6d",
            "net3": "32:20:98:6e:32:bb",
            "net4": "da:19:7f:8e:8e:f1",
            "net5": "a6:13:c0:9b:e2:83",
            "net6": "9e:21:e2:c2:0c:9b",
            "net7": "7e:be:e0:3c:a5:3a",
            "net8": "d2:27:d2:9b:e9:62",
            "net9": "9a:e6:5b:d5:d5:69"
        },
        "spine_2_1_2": {
            "net0": "ce:a8:2f:2b:be:24",
            "net1": "1e:be:09:c5:c2:80",
            "net10": "a6:c4:f0:c1:0f:e2",
            "net11": "da:c0:72:5e:23:c5",
            "net12": "a6:50:16:ea:a7:36",
            "net13": "a6:f3:9c:43:5e:8f",
            "net14": "7a:c1:8f:52:43:c0",
            "net15": "62:a0:05:ec:5d:2c",
            "net16": "52:98:f5:4f:ef:48",
            "net17": "56:e8:6e:cb:e7:17",
            "net18": "da:a4:17:32:21:67",
            "net19": "3a:ec:4e:9d:ca:e7",
            "net2": "0a:32:ce:43:cb:c6",
            "net20": "16:ec:d9:b8:4f:28",
            "net21": "1a:62:30:e1:ca:d6",
            "net22": "f6:05:45:81:a3:05",
            "net23": "b2:93:02:8b:3b:c0",
            "net3": "46:b3:52:c2:02:50",
            "net4": "26:92:f6:ac:f7:9e",
            "net5": "b2:2d:cf:c7:27:09",
            "net6": "5e:25:68:fe:3c:cb",
            "net7": "0a:00:94:a6:92:78",
            "net8": "ca:16:f7:9e:73:10",
            "net9": "a2:64:dc:05:ac:7b"
        },
        "spine_2_1_3": {
            "net0": "06:e0:49:d9:5e:34",
            "net1": "22:cf:82:6e:7c:fd",
            "net10": "6a:53:ad:23:2f:1c",
            "net11": "72:ac:ee:9c:63:96",
            "net12": "ee:9b:24:0b:3f:79",
            "net13": "ca:9e:02:2a:91:f6",
            "net14": "22:65:dd:75:6d:17",
            "net15": "32:44:06:a0:2c:33",
            "net16": "d6:00:f0:67:0a:07",
            "net17": "d2:f3:0a:5f:5f:8e",
            "net18": "fe:1a:a1:68:27:ec",
            "net19": "96:bd:e8:c9:32:f3",
            "net2": "fa:ee:80:b4:8e:68",
            "net20": "12:04:a8:db:1d:8c",
            "net21": "fa:65:63:6d:79:c4",
            "net22": "76:89:b3:9a:fe:92",
            "net23": "b6:dd:6b:4e:5e:0e",
            "net3": "52:cd:e4:37:d8:95",
            "net4": "da:4d:d7:73:b8:56",
            "net5": "42:a8:f9:3f:f5:74",
            "net6": "02:de:77:0a:dc:70",
            "net7": "b2:86:f7:a0:ec:68",
            "net8": "6e:85:39:fd:2b:21",
            "net9": "46:f5:7b:ea:90:b3"
        },
        "spine_2_1_4": {
            "net0": "66:95:a5:41:73:ea",
            "net1": "92:88:94:28:6b:c2",
            "net10": "52:06:93:ba:7b:b1",
            "net11": "f6:fb:c9:be:11:d4",
            "net12": "e2:1c:a7:87:3c:ef",
            "net13": "de:e8:04:6e:f3:9a",
            "net14": "8a:3f:29:a2:c7:d2",
            "net15": "9a:cd:51:da:66:00",
            "net16": "a2:42:61:24:25:a8",
            "net17": "fe:98:5b:d9:9d:16",
            "net18": "f2:3a:6e:40:a1:ce",
            "net19": "d6:1f:f5:ef:11:a6",
            "net2": "3a:19:7c:14:84:fd",
            "net20": "3a:14:a3:91:4a:95",
            "net21": "92:55:a4:0e:23:3c",
            "net22": "06:36:94:95:50:30",
            "net23": "ee:b4:a5:c3:b6:1b",
            "net3": "fe:91:9d:eb:e8:5f",
            "net4": "f2:9b:c4:2d:f5:92",
            "net5": "6a:bd:44:06:76:3d",
            "net6": "32:8e:16:09:8a:23",
            "net7": "fa:64:ef:c6:b9:3a",
            "net8": "7a:63:66:93:ab:92",
            "net9": "0a:3a:dd:ef:c5:84"
        },
        "spine_2_1_5": {
            "net0": "ce:c1:2b:d1:86:dd",
            "net1": "fe:cf:8a:07:55:0e",
            "net10": "e6:29:2b:d9:26:00",
            "net11": "f6:88:fb:87:ad:59",
            "net12": "de:b3:c7:13:55:f3",
            "net13": "b2:5d:ae:21:88:72",
            "net14": "ae:a0:a2:7e:59:38",
            "net15": "7a:c5:50:09:c3:80",
            "net16": "5e:9c:3f:07:b3:d4",
            "net17": "9e:3a:00:79:72:11",
            "net18": "0e:b7:c3:16:38:03",
            "net19": "ee:e8:6b:a4:12:3c",
            "net2": "16:c2:c2:38:52:55",
            "net20": "b6:7e:ab:d0:24:24",
            "net21": "86:35:a3:25:a3:6b",
            "net22": "96:a7:7d:72:f2:5e",
            "net23": "06:ff:e6:82:de:8a",
            "net3": "b2:75:8a:fa:5c:f3",
            "net4": "42:68:00:0e:ba:a2",
            "net5": "da:28:aa:e5:4f:e4",
            "net6": "46:16:ad:8c:ae:bf",
            "net7": "72:0d:a6:31:e2:65",
            "net8": "66:01:76:92:aa:38",
            "net9": "52:d1:7c:7f:a2:60"
        },
        "spine_2_1_6": {
            "net0": "7e:55:fc:e7:3b:a8",
            "net1": "ea:1a:c9:55:89:c3",
            "net10": "ca:33:73:a0:fc:b6",
            "net11": "32:64:eb:99:29:7e",
            "net12": "4a:ef:e2:a3:7e:a9",
            "net13": "d2:c5:b8:76:13:da",
            "net14": "46:6d:52:b4:17:56",
            "net15": "9a:1e:20:da:23:0f",
            "net16": "fa:bb:48:86:4b:c2",
            "net17": "3a:aa:53:10:6f:a5",
            "net18": "2e:12:5b:84:eb:dc",
            "net19": "be:74:7f:67:f3:87",
            "net2": "32:1a:d8:57:74:4c",
            "net20": "ba:dc:bd:6f:48:b6",
            "net21": "92:3f:92:e4:d0:78",
            "net22": "3e:7f:8e:5d:42:02",
            "net23": "fa:be:91:43:4d:92",
            "net3": "a6:ad:09:47:e9:20",
            "net4": "b2:ce:8f:cf:28:17",
            "net5": "ca:8b:27:2f:96:79",
            "net6": "66:81:62:f8:37:dd",
            "net7": "66:bd:f9:cb:ac:65",
            "net8": "6a:32:bf:0a:46:8b",
            "net9": "8a:17:83:fc:d2:70"
        },
        "spine_2_1_7": {
            "net0": "c2:24:ea:68:eb:15",
            "net1": "42:31:9b:d6:73:60",
            "net10": "4e:f1:c1:ab:ee:1e",
            "net11": "be:83:3d:d9:b4:08",
            "net12": "8e:25:29:83:77:42",
            "net13": "0a:5f:75:1d:21:00",
            "net14": "b2:4c:c4:7c:03:4d",
            "net15": "02:da:cf:c6:05:67",
            "net16": "4e:93:2d:8d:84:78",
            "net17": "ee:d0:02:f5:d6:92",
            "net18": "7e:97:cd:f4:37:7b",
            "net19": "c6:ce:b3:c2:4e:3f",
            "net2": "46:08:64:ce:ea:90",
            "net20": "ce:ea:cd:65:99:0a",
            "net21": "ee:22:bf:d4:b0:d6",
            "net22": "d6:0f:88:dd:30:18",
            "net23": "26:b9:c3:c3:69:97",
            "net3": "42:f8:24:d5:d1:5c",
            "net4": "22:85:70:92:2f:a1",
            "net5": "56:09:81:04:b3:92",
            "net6": "c2:c2:55:0c:02:0d",
            "net7": "26:d4:c1:ef:e8:7c",
            "net8": "8e:7d:16:52:47:61",
            "net9": "9e:40:1f:c0:7c:2e"
        },
        "spine_2_1_8": {
            "net0": "2e:26:f9:8f:f0:79",
            "net1": "2a:9a:26:4d:a1:f7",
            "net10": "66:ed:96:5a:1b:2d",
            "net11": "82:c2:7d:c3:ba:1f",
            "net12": "86:3a:b4:de:26:86",
            "net13": "7a:50:8c:8b:55:2e",
            "net14": "e2:03:a9:2f:8f:05",
            "net15": "4e:a6:63:88:f3:ed",
            "net16": "5e:8f:0b:14:dd:a5",
            "net17": "aa:ec:78:17:96:07",
            "net18": "5a:75:62:77:18:7b",
            "net19": "de:86:a5:fd:08:d3",
            "net2": "c6:19:e8:c4:cc:6a",
            "net20": "42:e7:df:54:3b:5c",
            "net21": "a2:7c:d2:fb:4a:2e",
            "net22": "ba:3f:9f:e5:f1:65",
            "net23": "02:55:fd:a3:45:84",
            "net3": "a6:4b:7e:7c:42:e6",
            "net4": "9a:1d:8e:75:e8:f4",
            "net5": "d6:79:da:41:66:24",
            "net6": "06:c2:6e:b6:15:bb",
            "net7": "12:42:1b:75:a1:52",
            "net8": "9a:76:90:40:63:e6",
            "net9": "ea:76:c4:63:d7:f5"
        },
        "spine_2_1_9": {
            "net0": "a6:39:6f:01:1e:aa",
            "net1": "1a:40:cd:c2:ff:46",
            "net10": "f2:77:e1:f2:4d:8d",
            "net11": "1e:93:9a:0a:0d:77",
            "net12": "86:8e:f4:40:9b:a5",
            "net13": "be:bf:02:1c:7b:9f",
            "net14": "2a:4a:78:86:78:5a",
            "net15": "8e:ae:23:49:de:e7",
            "net16": "2e:df:3d:98:2d:2b",
            "net17": "16:26:78:47:25:4d",
            "net18": "92:44:7f:99:57:9d",
            "net19": "26:12:8a:2c:9f:65",
            "net2": "8e:c1:bf:8a:b1:8b",
            "net20": "76:5f:2f:53:6b:7f",
            "net21": "8e:22:76:e1:56:78",
            "net22": "96:97:5b:34:68:ec",
            "net23": "f2:e2:2d:85:81:9e",
            "net3": "ba:17:4e:74:fb:83",
            "net4": "ee:4e:6c:4f:2b:df",
            "net5": "d2:88:56:9e:37:5a",
            "net6": "52:cc:d9:86:24:e1",
            "net7": "b6:aa:cc:bd:f6:da",
            "net8": "3e:3d:75:ab:54:03",
            "net9": "22:6a:9d:8f:f1:ab"
        },
        "tof_1_2_1": {
            "net0": "ce:4a:d0:a7:c0:41",
            "net1": "b2:2c:ee:51:ea:79",
            "net10": "42:70:64:32:56:ea",
            "net11": "a2:d1:2e:0c:70:73",
            "net12": "ea:db:6c:fa:df:dd",
            "net13": "4e:d9:69:a7:07:99",
            "net14": "5e:0f:b5:7a:a5:c0",
            "net15": "02:db:4d:b0:cf:ed",
            "net16": "8a:a7:26:b6:3c:f0",
            "net17": "8a:60:4c:cb:95:ea",
            "net18": "c6:f2:49:13:59:12",
            "net19": "ba:b0:0a:f5:3b:2c",
            "net2": "32:0f:d3:e4:09:da",
            "net20": "ea:25:58:52:d7:47",
            "net21": "f2:8e:f2:bc:1d:80",
            "net22": "aa:4f:1f:53:29:9b",
            "net23": "b6:9e:3b:50:a8:e7",
            "net3": "96:67:14:66:6a:af",
            "net4": "02:41:70:43:66:87",
            "net5": "d2:ae:94:e1:26:82",
            "net6": "22:8b:45:96:38:b0",
            "net7": "66:6a:d3:bb:4e:c1",
            "net8": "e6:0d:27:2d:9e:0a",
            "net9": "8a:9d:b7:86:e4:93"
        },
        "tof_1_2_10": {
            "net0": "c2:03:64:1c:11:70",
            "net1": "6e:0d:64:47:14:e9",
            "net10": "c6:d5:f4:67:eb:78",
            "net11": "36:80:3c:65:a9:6c",
            "net12": "0e:91:54:00:fb:db",
            "net13": "1e:b6:c7:ad:95:24",
            "net14": "66:fb:8d:8c:45:c2",
            "net15": "5a:51:72:09:fd:ec",
            "net16": "3e:cf:5a:3d:18:e1",
            "net17": "ba:77:44:92:e7:4c",
            "net18": "b2:91:1f:cb:75:12",
            "net19": "c2:a0:45:7f:25:cf",
            "net2": "ca:5a:36:84:6f:5f",
            "net20": "4a:80:c9:6c:88:91",
            "net21": "62:45:a0:38:27:83",
            "net22": "ee:de:7c:6d:74:f0",
            "net23": "ce:57:de:2d:c5:73",
            "net3": "ba:e4:13:34:2e:1f",
            "net4": "06:22:c8:27:4d:ba",
            "net5": "4a:81:d1:a5:02:05",
            "net6": "f2:24:53:45:bb:7a",
            "net7": "06:ed:7d:67:67:4e",
            "net8": "de:ba:7f:71:a6:bd",
            "net9": "1a:55:50:8a:25:fd"
        },
        "tof_1_2_11": {
            "net0": "ae:48:ae:7d:17:3f",
            "net1": "c6:e0:89:30:08:6b",
            "net10": "3e:1e:32:b6:64:78",
            "net11": "52:29:bf:43:c7:b6",
            "net12": "de:ec:d9:41:55:3e",
            "net13": "36:7d:9a:dd:40:4f",
            "net14": "a6:71:77:5c:81:e3",
            "net15": "6e:31:1b:d1:f5:c2",
            "net16": "96:0e:8c:5a:27:32",
            "net17": "7a:03:7f:ea:46:90",
            "net18": "c2:34:00:05:c4:f2",
            "net19": "12:3b:d3:07:13:3f",
            "net2": "82:6f:d9:5f:14:79",
            "net20": "36:a5:b8:59:f9:3d",
            "net21": "de:e2:3f:0f:1f:ad",
            "net22": "1a:0e:a7:5c:a1:8c",
            "net23": "6e:d0:ae:91:ac:ad",
            "net3": "3a:0a:ad:61:e4:58",
            "net4": "8a:d8:6d:da:d7:f4",
            "net5": "32:1a:32:62:4f:86",
            "net6": "c6:2e:62:a8:eb:99",
            "net7": "2e:59:1b:0e:23:b3",
            "net8": "72:00:30:7a:8e:bf",
            "net9": "8e:f6:ff:5c:6f:84"
        },
        "tof_1_2_12": {
            "net0": "c6:c7:43:7f:81:da",
            "net1": "66:49:e4:ac:49:39",
            "net10": "26:74:81:b7:3d:f2",
            "net11": "52:ff:6e:41:fd:fa",
            "net12": "12:8d:25:b1:46:92",
            "net13": "6a:cb:2e:66:31:8c",
            "net14": "2a:0a:f0:37:a8:89",
            "net15": "0e:e0:4c:75:41:32",
            "net16": "26:5d:13:fc:cd:ce",
            "net17": "d6:ab:3f:9b:dd:79",
            "net18": "12:14:d5:1d:74:3b",
            "net19": "52:df:72:7a:b9:50",
            "net2": "02:87:eb:c9:b6:e9",
            "net20": "f6:90:a4:b4:7f:79",
            "net21": "e6:6a:d4:4e:de:e2",
            "net22": "8e:e0:ae:10:7f:10",
            "net23": "be:5e:7f:a6:ec:36",
            "net3": "5a:3c:e9:c3:ac:92",
            "net4": "5a:b4:53:d6:43:7f",
            "net5": "02:a3:ca:6c:06:47",
            "net6": "9a:89:1d:15:79:16",
            "net7": "42:dc:31:36:b6:52",
            "net8": "82:ff:63:78:e7:71",
            "net9": "1a:3d:23:6d:81:4c"
        },
        "tof_1_2_2": {
            "net0": "9a:0e:39:79:4d:34",
            "net1": "1e:ab:40:0e:e0:13",
            "net10": "5a:0c:8c:ee:a7:b1",
            "net11": "ee:83:ed:9b:16:e4",
            "net12": "26:c5:03:a3:54:8e",
            "net13": "5a:d1:70:b7:20:11",
            "net14": "1e:aa:7b:90:3e:d6",
            "net15": "16:f9:d2:76:b9:08",
            "net16": "e2:75:9b:9b:90:61",
            "net17": "5e:27:76:97:2a:d7",
            "net18": "ca:42:8f:ab:3a:53",
            "net19": "da:b2:e1:8e:96:8b",
            "net2": "46:a7:89:58:9e:bc",
            "net20": "52:d7:19:97:cc:1d",
            "net21": "96:47:c5:80:3d:bd",
            "net22": "b2:9b:48:b2:df:94",
            "net23": "2a:7c:55:cd:c0:2e",
            "net3": "52:64:4e:0f:f7:01",
            "net4": "12:6b:e4:73:41:57",
            "net5": "36:92:8d:52:95:c4",
            "net6": "f2:89:14:14:60:61",
            "net7": "e6:1e:1d:c7:88:11",
            "net8": "3e:9c:92:31:96:22",
            "net9": "ae:59:7a:23:64:af"
        },
        "tof_1_2_3": {
            "net0": "26:43:bb:7a:4f:9b",
            "net1": "3e:30:85:fc:a1:48",
            "net10": "6a:94:4c:e4:82:d5",
            "net11": "4e:52:d0:78:04:dd",
            "net12": "6e:c2:df:22:a4:4f",
            "net13": "1a:d9:d3:7a:71:b9",
            "net14": "2e:aa:10:f1:58:47",
            "net15": "76:ea:62:13:4a:78",
            "net16": "c6:30:d9:34:f4:a0",
            "net17": "6e:cf:dd:ba:30:8e",
            "net18": "1e:eb:ec:6d:d6:f2",
            "net19": "82:69:47:bb:f3:01",
            "net2": "16:9e:03:80:dd:1c",
            "net20": "0a:e6:ea:47:68:52",
            "net21": "da:7b:76:10:eb:16",
            "net22": "8a:11:c3:76:66:c1",
            "net23": "4e:73:e2:ac:27:2e",
            "net3": "d6:c9:f4:bc:a8:34",
            "net4": "f2:6c:78:c3:cc:9c",
            "net5": "1a:38:88:b1:64:89",
            "net6": "e6:19:16:41:1b:40",
            "net7": "c2:26:d0:ac:2c:aa",
            "net8": "8a:d9:be:43:c7:de",
            "net9": "4a:f0:5b:84:c6:ef"
        },
        "tof_1_2_4": {
            "net0": "1a:44:b8:c7:c1:ad",
            "net1": "76:86:fd:48:3b:81",
            "net10": "92:56:5b:1d:89:76",
            "net11": "3a:b5:f0:c4:3b:eb",
            "net12": "0e:8b:10:58:ce:6d",
            "net13": "06:42:9d:71:2e:e2",
            "net14": "02:28:90:27:6c:d9",
            "net15": "86:44:df:2b:6b:4d",
            "net16": "76:83:df:32:9e:22",
            "net17": "6a:89:51:f5:07:c8",
            "net18": "6e:85:45:bf:23:a7",
            "net19": "6e:a9:88:00:6d:eb",
            "net2": "b6:91:5d:d6:9c:b3",
            "net20": "92:24:98:3a:96:1f",
            "net21": "de:5e:5f:fc:d4:83",
            "net22": "82:47:cd:90:49:75",
            "net23": "fa:13:f6:f4:42:33",
            "net3": "7a:ba:72:f3:04:96",
            "net4": "1e:da:42:19:c4:9b",
            "net5": "16:1f:07:10:bf:b4",
            "net6": "ba:98:1e:00:75:f5",
            "net7": "c2:28:b3:9a:55:90",
            "net8": "4a:05:3a:f3:9c:c2",
            "net9": "b6:80:86:cc:1c:d1"
        },
        "tof_1_2_5": {
            "net0": "02:0a:23:50:63:3e",
            "net1": "5a:95:b4:85:24:81",
            "net10": "1a:11:07:90:ba:a7",
            "net11": "76:b4:2a:9a:88:f8",
            "net12": "aa:ad:da:7c:57:6b",
            "net13": "ba:6a:d0:78:08:46",
            "net14": "ca:e1:1e:f7:fd:d2",
            "net15": "a2:0d:26:9c:64:6b",
            "net16": "56:24:f6:b2:7f:57",
            "net17": "d2:3b:f5:f6:94:63",
            "net18": "4a:f8:8d:a5:f1:a0",
            "net19": "8a:a7:aa:8a:0b:12",
            "net2": "16:9a:74:f2:44:87",
            "net20": "d2:88:3e:de:62:e8",
            "net21": "86:30:d9:cb:23:54",
            "net22": "56:df:13:f2:8b:b3",
            "net23": "f2:08:d1:14:9f:22",
            "net3": "aa:2d:b3:d6:9b:c1",
            "net4": "06:fd:65:8e:1f:4b",
            "net5": "a6:7e:11:71:27:59",
            "net6": "0e:12:57:17:8c:3f",
            "net7": "5a:da:f3:3f:df:6c",
            "net8": "be:b3:86:d6:cf:01",
            "net9": "fe:f6:c7:59:17:e2"
        },
        "tof_1_2_6": {
            "net0": "0e:bd:90:5b:46:10",
            "net1": "d2:2c:31:7f:c6:fd",
            "net10": "4e:fa:08:57:7f:2d",
            "net11": "76:18:1d:5b:24:f8",
            "net12": "06:4c:1f:23:b5:cd",
            "net13": "be:71:c9:44:c2:5f",
            "net14": "3a:1f:db:7d:6a:ae",
            "net15": "ea:7d:06:32:97:39",
            "net16": "ee:b8:13:b9:d1:84",
            "net17": "de:42:35:78:00:da",
            "net18": "02:1f:d7:86:50:17",
            "net19": "a2:d2:26:3a:f1:e0",
            "net2": "de:15:9b:8d:8a:00",
            "net20": "de:96:0e:1e:6e:ea",
            "net21": "5a:10:14:3a:6c:74",
            "net22": "2e:15:b9:20:0f:89",
            "net23": "aa:a7:3e:ec:3c:42",
            "net3": "62:3b:fa:16:65:78",
            "net4": "46:c0:3b:f2:36:18",
            "net5": "96:c6:da:cf:dd:85",
            "net6": "5a:3a:d4:86:76:63",
            "net7": "fa:ff:e2:9a:c1:e3",
            "net8": "fe:3c:86:1c:7b:b1",
            "net9": "92:21:d2:79:67:d3"
        },
        "tof_1_2_7": {
            "net0": "2a:74:df:0c:0e:07",
            "net1": "96:3a:b6:48:e3:6c",
            "net10": "be:9e:6e:e7:62:53",
            "net11": "62:35:e3:96:ca:eb",
            "net12": "12:3d:95:b0:88:0a",
            "net13": "fe:ff:ab:d7:e2:ee",
            "net14": "da:20:2f:83:7d:f8",
            "net15": "06:8c:be:64:c3:84",
            "net16": "2e:42:45:82:59:5d",
            "net17": "12:13:2b:ec:4b:b7",
            "net18": "a2:a1:24:02:0a:fb",
            "net19": "9a:12:bf:05:a3:ad",
            "net2": "4e:e0:d9:30:16:06",
            "net20": "72:0a:84:9c:b0:8c",
            "net21": "96:c8:6f:18:20:79",
            "net22": "a2:40:30:29:1f:77",
            "net23": "2a:99:e7:a5:87:80",
            "net3": "56:00:e7:a8:0c:96",
            "net4": "6e:03:26:c1:10:7c",
            "net5": "72:b5:d7:be:04:bc",
            "net6": "66:54:f4:22:b0:19",
            "net7": "5a:bd:e4:05:64:2d",
            "net8": "4e:12:56:18:3d:d8",
            "net9": "72:79:87:7f:e2:81"
        },
        "tof_1_2_8": {
            "net0": "96:a9:7f:bf:98:51",
            "net1": "52:08:71:7c:fb:b3",
            "net10": "56:91:75:21:62:b2",
            "net11": "4e:0b:75:c4:20:b9",
            "net12": "72:39:0e:3f:68:63",
            "net13": "66:cd:42:ab:ea:33",
            "net14": "aa:76:4f:58:42:56",
            "net15": "e6:2b:bc:0f:38:59",
            "net16": "6a:d5:eb:63:29:dc",
            "net17": "ae:19:b6:68:62:e8",
            "net18": "86:40:05:d4:95:bc",
            "net19": "f6:92:09:39:80:f8",
            "net2": "12:db:6c:36:e5:5b",
            "net20": "be:9c:bc:f0:36:ab",
            "net21": "66:a8:28:c5:28:c0",
            "net22": "72:69:22:36:74:e8",
            "net23": "46:49:d0:f0:23:7a",
            "net3": "92:77:0c:45:45:01",
            "net4": "c6:48:28:dd:8c:7e",
            "net5": "be:79:e7:04:46:b7",
            "net6": "2e:bd:33:17:a9:2b",
            "net7": "66:6a:83:be:7d:f9",
            "net8": "92:ad:12:d1:31:d4",
            "net9": "26:04:30:e8:1e:e3"
        },
        "tof_1_2_9": {
            "net0": "3e:89:61:2f:c8:3c",
            "net1": "96:29:ed:2b:af:c4",
            "net10": "f2:69:63:75:74:c3",
            "net11": "da:b8:db:23:d7:e5",
            "net12": "ce:46:52:73:48:96",
            "net13": "0e:8a:ca:1d:df:0a",
            "net14": "2a:d9:50:3d:8f:5c",
            "net15": "7a:3b:50:8b:04:7e",
            "net16": "c2:a8:6e:39:ad:a5",
            "net17": "06:d5:58:b3:5f:02",
            "net18": "ee:11:06:e2:9b:98",
            "net19": "1e:1a:b3:89:7f:e8",
            "net2": "a6:40:54:29:22:b5",
            "net20": "36:64:fb:53:7c:6e",
            "net21": "f2:6d:72:16:de:6a",
            "net22": "aa:30:ae:65:9d:54",
            "net23": "ee:b1:7a:05:3f:e0",
            "net3": "ee:80:90:e4:64:eb",
            "net4": "3e:0d:7c:cf:b0:d3",
            "net5": "a2:b7:5f:cf:54:19",
            "net6": "42:b0:e6:66:90:10",
            "net7": "9e:c0:1d:d1:ab:90",
            "net8": "02:fd:2e:91:bc:46",
            "net9": "8e:af:02:a8:2d:29"
        }
    },
    "failed_machine": "leaf_1_0_1",
    "failure_time": {
        "leaf_1_0_1": 1622136811.4515026,
        "leaf_1_0_10": 1622136811.546937,
        "leaf_1_0_11": 1622136811.7667165,
        "leaf_1_0_12": 1622136811.8019118,
        "leaf_1_0_2": 1622136811.4573126,
        "leaf_1_0_3": 1622136811.7464724,
        "leaf_1_0_4": 1622136811.7711105,
        "leaf_1_0_5": 1622136811.7976751,
        "leaf_1_0_6": 1622136811.4580116,
        "leaf_1_0_7": 1622136811.7233171,
        "leaf_1_0_8": 1622136811.7696805,
        "leaf_1_0_9": 1622136811.8006845,
        "leaf_2_0_1": 1622136811.4602466,
        "leaf_2_0_10": 1622136811.762952,
        "leaf_2_0_11": 1622136811.7774556,
        "leaf_2_0_12": 1622136811.7985795,
        "leaf_2_0_2": 1622136811.8945282,
        "leaf_2_0_3": 1622136812.0444033,
        "leaf_2_0_4": 1622136812.059856,
        "leaf_2_0_5": 1622136812.114394,
        "leaf_2_0_6": 1622136811.8964145,
        "leaf_2_0_7": 1622136812.0784953,
        "leaf_2_0_8": 1622136812.1953602,
        "leaf_2_0_9": 1622136812.2303717,
        "spine_1_1_1": 1622136811.8996017,
        "spine_1_1_10": 1622136812.0494173,
        "spine_1_1_11": 1622136812.079178,
        "spine_1_1_12": 1622136812.1655376,
        "spine_1_1_2": 1622136811.9064472,
        "spine_1_1_3": 1622136812.0481818,
        "spine_1_1_4": 1622136812.0818553,
        "spine_1_1_5": 1622136812.191226,
        "spine_1_1_6": 1622136812.2017894,
        "spine_1_1_7": 1622136812.2877872,
        "spine_1_1_8": 1622136812.3629956,
        "spine_1_1_9": 1622136812.4816685,
        "spine_2_1_1": 1622136812.2025263,
        "spine_2_1_10": 1622136812.3081534,
        "spine_2_1_11": 1622136812.4454434,
        "spine_2_1_12": 1622136812.4858932,
        "spine_2_1_2": 1622136812.274945,
        "spine_2_1_3": 1622136812.484131,
        "spine_2_1_4": 1622136812.5021975,
        "spine_2_1_5": 1622136812.5150926,
        "spine_2_1_6": 1622136812.2920747,
        "spine_2_1_7": 1622136812.3202848,
        "spine_2_1_8": 1622136812.4852514,
        "spine_2_1_9": 1622136812.5110347,
        "tof_1_2_1": 1622136812.5033937,
        "tof_1_2_10": 1622136812.6150343,
        "tof_1_2_11": 1622136812.6798167,
        "tof_1_2_12": 1622136812.9011142,
        "tof_1_2_2": 1622136812.5141256,
        "tof_1_2_3": 1622136812.61506,
        "tof_1_2_4": 1622136812.7047098,
        "tof_1_2_5": 1622136812.7533028,
        "tof_1_2_6": 1622136812.5828853,
        "tof_1_2_7": 1622136812.6754968,
        "tof_1_2_8": 1622136812.7102363,
        "tof_1_2_9": 1622136812.8994288
    }
}