{
    "k_leaf": 8,
    "k_top": 8,
    "redundancy_factor": 8,
    "is_k8s": true,
    "machine_mac_addresses": {
        "leaf_1_0_1": {
            "net0": "56:aa:db:98:f1:f9",
            "net1": "4e:37:31:02:49:f1",
            "net2": "e6:e9:50:30:54:f2",
            "net3": "c2:38:44:44:0c:4e",
            "net4": "6e:a4:12:9a:7b:62",
            "net5": "82:ac:5a:56:0e:02",
            "net6": "5e:78:e0:4f:59:ca",
            "net7": "1e:09:53:c5:49:dc",
            "net8": "aa:be:cf:c8:66:6d"
        },
        "leaf_1_0_2": {
            "net0": "26:ec:aa:58:32:71",
            "net1": "ea:cc:be:07:65:d5",
            "net2": "3e:64:35:e5:4b:73",
            "net3": "a6:96:7e:ae:dd:fc",
            "net4": "22:33:cb:f9:64:d7",
            "net5": "2e:22:f4:2c:c3:21",
            "net6": "42:13:e4:85:9a:9d",
            "net7": "ba:37:12:a5:0e:d8",
            "net8": "76:e5:56:7c:08:62"
        },
        "leaf_1_0_3": {
            "net0": "be:1b:9a:91:d3:b1",
            "net1": "3e:6b:c4:23:54:56",
            "net2": "0e:31:19:d0:b0:77",
            "net3": "fa:69:12:c6:dd:66",
            "net4": "12:5c:7d:82:86:65",
            "net5": "86:01:1e:96:82:7d",
            "net6": "6e:9b:97:84:15:2d",
            "net7": "1a:55:09:63:36:dd",
            "net8": "f2:ea:56:d3:43:84"
        },
        "leaf_1_0_4": {
            "net0": "b6:6b:2a:ac:19:4a",
            "net1": "ca:c3:59:e9:e3:0c",
            "net2": "22:a9:10:85:08:23",
            "net3": "aa:1c:fc:33:b0:f8",
            "net4": "9a:a8:06:68:60:c4",
            "net5": "82:9c:f2:ac:5e:89",
            "net6": "fa:b4:fc:87:42:f6",
            "net7": "d2:c4:4d:dc:19:c7",
            "net8": "5a:6f:11:88:3f:bf"
        },
        "leaf_1_0_5": {
            "net0": "1a:bb:d1:30:0d:43",
            "net1": "42:0a:d5:f4:e4:21",
            "net2": "46:d8:a5:87:4f:30",
            "net3": "1e:8f:16:45:08:6a",
            "net4": "76:47:d6:a8:e7:77",
            "net5": "a6:98:25:68:ad:bb",
            "net6": "ba:ad:e7:d7:b7:63",
            "net7": "ba:ec:c1:ed:c9:3f",
            "net8": "e2:f8:a5:f8:f0:db"
        },
        "leaf_1_0_6": {
            "net0": "56:b7:fd:e7:33:02",
            "net1": "26:d0:e7:4d:b5:6a",
            "net2": "9a:ae:ec:c7:bc:99",
            "net3": "2e:d0:bf:d0:f4:5f",
            "net4": "46:15:8a:e1:28:4d",
            "net5": "c6:2e:a6:f1:04:88",
            "net6": "32:6c:fe:69:52:3c",
            "net7": "ee:07:85:d8:a3:c8",
            "net8": "c6:9d:59:25:53:10"
        },
        "leaf_1_0_7": {
            "net0": "1e:93:2e:42:0a:f3",
            "net1": "6e:1a:b6:62:11:e9",
            "net2": "7e:50:30:7c:93:b7",
            "net3": "2e:94:eb:8a:54:56",
            "net4": "22:69:0f:ad:54:f3",
            "net5": "66:c5:f6:62:74:15",
            "net6": "e2:fe:06:1c:d7:dd",
            "net7": "ba:35:a0:71:c5:19",
            "net8": "5a:24:dd:aa:cb:b2"
        },
        "leaf_1_0_8": {
            "net0": "2e:4e:c2:1c:fe:61",
            "net1": "ca:3d:34:54:2f:dc",
            "net2": "42:b2:da:24:6e:36",
            "net3": "a2:28:85:a3:00:2a",
            "net4": "3a:c4:54:b8:fb:a7",
            "net5": "ba:fc:4b:f8:24:09",
            "net6": "0a:43:51:a9:3e:89",
            "net7": "be:f1:8a:7b:f0:0d",
            "net8": "9e:74:6a:31:c2:d5"
        },
        "leaf_2_0_1": {
            "net0": "c6:51:80:bb:10:af",
            "net1": "66:bf:da:f9:50:d2",
            "net2": "f2:60:6b:37:e8:ce",
            "net3": "5e:f1:f2:78:34:8a",
            "net4": "86:dd:fe:eb:4d:7f",
            "net5": "5e:8a:1a:4e:99:c0",
            "net6": "4a:d8:cc:d7:d3:4a",
            "net7": "4e:58:3c:a7:96:03",
            "net8": "22:8e:4d:7a:84:6a"
        },
        "leaf_2_0_2": {
            "net0": "5e:a5:37:c9:73:6c",
            "net1": "36:d9:f6:59:1d:bf",
            "net2": "9a:59:4f:7d:bd:16",
            "net3": "c6:e4:7d:d5:0b:8c",
            "net4": "ae:52:bd:36:5e:40",
            "net5": "fe:56:4a:ff:66:25",
            "net6": "ce:1e:48:fd:f3:f8",
            "net7": "3a:3d:40:15:a9:7a",
            "net8": "ea:37:8c:b4:08:2c"
        },
        "leaf_2_0_3": {
            "net0": "4e:6a:92:fd:7a:b4",
            "net1": "02:e6:6e:71:84:75",
            "net2": "5a:bd:a3:4d:13:c2",
            "net3": "66:7c:41:4a:37:99",
            "net4": "06:c2:89:04:33:67",
            "net5": "86:97:da:b5:64:89",
            "net6": "b6:73:48:2e:b4:fb",
            "net7": "62:bb:9f:47:0b:b6",
            "net8": "ee:16:42:5e:b2:e6"
        },
        "leaf_2_0_4": {
            "net0": "42:89:81:88:d4:33",
            "net1": "a6:e6:06:a5:87:a2",
            "net2": "e6:9e:15:67:25:40",
            "net3": "e2:6a:36:ae:30:3e",
            "net4": "86:8d:38:ce:65:60",
            "net5": "ca:d1:ee:6b:90:b7",
            "net6": "02:5c:bc:fa:da:c9",
            "net7": "66:21:8c:8d:a1:7e",
            "net8": "2a:8d:ec:71:c3:4d"
        },
        "leaf_2_0_5": {
            "net0": "3e:e8:0a:fc:11:bc",
            "net1": "76:09:05:c7:a2:f6",
            "net2": "a6:02:da:55:21:2b",
            "net3": "aa:4c:81:14:b7:2b",
            "net4": "fe:f3:e3:9a:e1:96",
            "net5": "a2:e7:59:00:97:2d",
            "net6": "be:80:4d:20:3b:da",
            "net7": "ce:1b:df:86:0a:8d",
            "net8": "e6:7e:a2:ec:ca:55"
        },
        "leaf_2_0_6": {
            "net0": "4a:24:4d:35:09:d0",
            "net1": "ee:99:69:f8:22:56",
            "net2": "ae:4b:1f:d6:b7:08",
            "net3": "c2:1f:9e:d5:5a:64",
            "net4": "16:da:69:e1:5c:79",
            "net5": "ee:31:89:62:76:81",
            "net6": "ce:63:a3:2d:ac:5c",
            "net7": "0a:98:1e:e6:cf:bf",
            "net8": "ca:51:33:65:21:c0"
        },
        "leaf_2_0_7": {
            "net0": "6a:5f:09:ab:da:0f",
            "net1": "76:09:1c:4a:3a:c9",
            "net2": "82:16:d2:87:b2:f1",
            "net3": "8e:18:0a:74:af:e5",
            "net4": "92:d3:87:7d:9c:c2",
            "net5": "02:48:e1:41:d4:18",
            "net6": "52:af:a9:56:db:de",
            "net7": "46:2c:e7:7c:ae:7c",
            "net8": "fa:99:55:15:e0:ba"
        },
        "leaf_2_0_8": {
            "net0": "4e:ea:52:c9:f7:ac",
            "net1": "e6:2e:cb:9e:97:58",
            "net2": "9e:5b:06:45:99:3b",
            "net3": "b2:28:09:72:c6:f1",
            "net4": "7a:6c:55:2b:50:77",
            "net5": "f2:c4:04:c6:05:40",
            "net6": "7a:c1:ba:33:96:17",
            "net7": "12:b3:e2:00:53:2a",
            "net8": "be:be:13:fc:b3:57"
        },
        "spine_1_1_1": {
            "net0": "02:63:d7:58:a2:9c",
            "net1": "5e:fc:fe:a4:4c:64",
            "net10": "9a:26:32:b9:bd:78",
            "net11": "4e:63:9e:7a:60:f0",
            "net12": "6e:eb:54:45:f9:b5",
            "net13": "f6:37:6c:0b:f2:54",
            "net14": "ca:f1:7d:52:6f:25",
            "net15": "62:a2:57:fa:67:2b",
            "net2": "2e:b0:86:98:e7:83",
            "net3": "0a:d3:8e:ef:25:22",
            "net4": "8e:a5:67:a4:17:aa",
            "net5": "7e:93:a8:c5:a0:01",
            "net6": "22:2d:0a:16:f6:17",
            "net7": "9e:6c:7d:21:70:6c",
            "net8": "f6:d8:6f:90:c4:bf",
            "net9": "de:41:e6:82:7d:4b"
        },
        "spine_1_1_2": {
            "net0": "de:bb:a8:18:ec:05",
            "net1": "be:65:b6:63:eb:b9",
            "net10": "aa:e9:34:79:64:e8",
            "net11": "ea:1a:19:0d:e1:8f",
            "net12": "b6:5d:4b:6e:d3:e4",
            "net13": "fe:53:b8:43:26:76",
            "net14": "e2:2e:a3:ff:8f:f3",
            "net15": "d6:ca:85:36:33:35",
            "net2": "4e:b0:41:9f:12:34",
            "net3": "5a:1c:b4:71:e8:24",
            "net4": "16:3f:05:9f:8e:4c",
            "net5": "a6:6c:ef:ae:bc:ed",
            "net6": "ca:08:d1:97:e4:0e",
            "net7": "a6:35:ac:fa:53:85",
            "net8": "8a:f3:01:8f:3b:0a",
            "net9": "26:7f:f0:e2:a9:a7"
        },
        "spine_1_1_3": {
            "net0": "8a:16:07:5f:da:ac",
            "net1": "66:09:66:b1:99:cc",
            "net10": "7a:85:7c:fe:42:b9",
            "net11": "46:99:e4:e1:26:94",
            "net12": "7e:ca:66:d8:dc:85",
            "net13": "52:38:d5:ab:d1:ac",
            "net14": "02:e2:02:ee:01:1d",
            "net15": "52:ce:36:ab:b9:e2",
            "net2": "52:9b:46:45:97:9d",
            "net3": "5e:e2:cf:04:01:49",
            "net4": "ca:07:de:ef:57:ba",
            "net5": "6a:fa:0b:0a:a4:6b",
            "net6": "56:07:04:7d:30:9d",
            "net7": "6a:2b:38:4f:be:bd",
            "net8": "2e:14:4e:38:6e:91",
            "net9": "7e:f8:43:4a:58:b3"
        },
        "spine_1_1_4": {
            "net0": "f6:e2:f5:ef:ea:94",
            "net1": "a6:db:30:49:32:64",
            "net10": "ee:af:2d:4c:33:39",
            "net11": "2e:a0:2b:f6:a8:52",
            "net12": "d2:76:06:44:d2:a7",
            "net13": "66:2c:8a:55:62:69",
            "net14": "0e:1a:22:b8:79:21",
            "net15": "9e:59:5c:07:f2:38",
            "net2": "ca:28:3f:ec:ae:95",
            "net3": "aa:92:4b:90:e5:ce",
            "net4": "ca:91:9a:fe:f7:b4",
            "net5": "42:6f:35:1e:02:e1",
            "net6": "0a:fa:60:8d:83:6c",
            "net7": "7e:2e:07:cd:aa:07",
            "net8": "0e:a1:7d:b5:79:3d",
            "net9": "a6:75:92:31:97:f0"
        },
        "spine_1_1_5": {
            "net0": "96:c4:8b:5f:36:5f",
            "net1": "e6:98:9f:9f:32:fd",
            "net10": "e6:1b:6c:d2:8d:21",
            "net11": "9a:c7:db:ea:e1:19",
            "net12": "2a:19:4f:4b:5a:34",
            "net13": "46:8a:cf:2a:eb:fb",
            "net14": "2a:29:50:95:1a:e2",
            "net15": "82:e0:45:29:da:c3",
            "net2": "56:c6:74:3e:b4:78",
            "net3": "ee:e0:81:03:ed:63",
            "net4": "fe:f9:21:66:b9:07",
            "net5": "de:da:96:66:ad:89",
            "net6": "82:0a:b2:27:2d:29",
            "net7": "fe:40:63:4d:fe:9d",
            "net8": "92:85:b5:2c:1d:08",
            "net9": "82:d2:f4:72:10:63"
        },
        "spine_1_1_6": {
            "net0": "4a:37:3b:a9:9a:c5",
            "net1": "5e:d6:bc:4c:b5:b4",
            "net10": "02:96:f6:84:59:9d",
            "net11": "76:37:1a:d0:4e:d6",
            "net12": "4a:7a:30:53:2b:55",
            "net13": "b2:a1:60:8a:1a:94",
            "net14": "1e:b0:b6:ac:a1:33",
            "net15": "02:fc:dc:bb:27:67",
            "net2": "82:19:93:49:b8:b6",
            "net3": "62:fd:fa:e8:33:d5",
            "net4": "b6:1d:c8:1c:77:42",
            "net5": "ca:0f:d5:41:f4:40",
            "net6": "56:f8:0e:e1:a9:01",
            "net7": "26:7d:c9:d4:32:0b",
            "net8": "46:68:bd:62:3b:c8",
            "net9": "36:8a:d9:7a:51:75"
        },
        "spine_1_1_7": {
            "net0": "96:c8:1c:05:30:11",
            "net1": "b2:3e:ed:35:3b:16",
            "net10": "6e:90:8a:71:97:e2",
            "net11": "56:3d:6c:30:62:a9",
            "net12": "c2:6d:9d:29:c0:ce",
            "net13": "aa:7a:24:15:9a:0f",
            "net14": "c2:c8:6f:8f:d2:e9",
            "net15": "fe:41:77:f8:29:7a",
            "net2": "52:05:22:6c:16:15",
            "net3": "0a:5d:c7:f7:a4:23",
            "net4": "5e:9f:35:e6:27:aa",
            "net5": "f2:1b:ee:18:66:ca",
            "net6": "76:d5:a4:7b:dc:5a",
            "net7": "06:28:20:97:bd:1a",
            "net8": "e2:4b:cc:18:0d:c0",
            "net9": "a6:fa:b8:8d:bd:d0"
        },
        "spine_1_1_8": {
            "net0": "52:35:e5:f7:c1:83",
            "net1": "56:89:02:f7:41:b1",
            "net10": "e2:50:ee:f0:46:d5",
            "net11": "c2:34:42:39:0c:b9",
            "net12": "8e:fe:24:2b:32:9c",
            "net13": "7e:dc:98:e5:ae:ea",
            "net14": "de:69:7e:e5:97:98",
            "net15": "b2:c2:b5:85:1d:80",
            "net2": "b2:ce:85:aa:d0:04",
            "net3": "66:93:89:46:1d:77",
            "net4": "3e:e3:b8:77:f9:9f",
            "net5": "4a:22:18:00:59:5e",
            "net6": "e2:f8:8a:33:25:8a",
            "net7": "3e:92:6f:4b:3e:bd",
            "net8": "32:cf:f6:d1:8f:39",
            "net9": "de:7c:9c:45:6d:15"
        },
        "spine_2_1_1": {
            "net0": "6e:94:7c:c9:5c:20",
            "net1": "7a:ae:54:66:12:9b",
            "net10": "de:41:ae:04:9f:67",
            "net11": "4e:12:1c:a3:9d:db",
            "net12": "8e:3f:82:28:c7:a6",
            "net13": "ae:0e:79:ae:4c:dc",
            "net14": "2a:4c:ab:51:a9:5e",
            "net15": "3e:0c:38:19:60:10",
            "net2": "a2:9d:31:47:43:98",
            "net3": "42:47:57:c2:df:0f",
            "net4": "0a:5a:8d:99:73:aa",
            "net5": "f2:cb:ec:14:2a:1b",
            "net6": "22:63:2e:e1:ec:d3",
            "net7": "2e:95:45:5e:86:b7",
            "net8": "36:59:75:0f:6d:66",
            "net9": "22:1f:d2:dc:9f:db"
        },
        "spine_2_1_2": {
            "net0": "ee:7f:c3:43:4c:94",
            "net1": "ae:35:fa:12:1e:1b",
            "net10": "46:aa:8b:23:b6:80",
            "net11": "66:b2:5f:5e:ac:16",
            "net12": "02:ed:a5:be:94:e9",
            "net13": "26:de:a9:94:22:0a",
            "net14": "ce:f8:19:d4:69:f5",
            "net15": "2e:c9:3c:78:75:e6",
            "net2": "5e:88:9f:2a:1d:41",
            "net3": "96:3c:5c:8f:92:22",
            "net4": "c6:c0:d3:63:02:f1",
            "net5": "62:2e:0f:2d:f8:30",
            "net6": "2e:2d:8a:cd:6a:1b",
            "net7": "e6:ce:12:78:82:ae",
            "net8": "52:43:42:57:58:cf",
            "net9": "5e:cb:07:2d:b6:3a"
        },
        "spine_2_1_3": {
            "net0": "06:8c:3d:8f:22:c2",
            "net1": "f6:45:ae:43:3f:67",
            "net10": "82:cc:4f:f3:3c:fd",
            "net11": "0e:51:86:49:4f:52",
            "net12": "ee:c7:e6:45:86:52",
            "net13": "86:9e:c0:b8:29:db",
            "net14": "36:e1:38:c5:e9:05",
            "net15": "5a:66:ef:02:8d:cc",
            "net2": "c6:da:fc:85:4f:f2",
            "net3": "4e:88:be:c8:27:57",
            "net4": "9a:ac:a6:a7:28:84",
            "net5": "8a:63:5f:6c:8d:64",
            "net6": "7e:83:e5:30:3b:82",
            "net7": "ee:e3:f2:75:43:46",
            "net8": "d2:6e:e7:89:7e:78",
            "net9": "fa:2f:fe:cb:a0:69"
        },
        "spine_2_1_4": {
            "net0": "fa:fc:06:3b:bf:2a",
            "net1": "06:6b:a0:de:3c:f6",
            "net10": "d6:11:43:79:26:17",
            "net11": "16:c6:d4:50:21:57",
            "net12": "0e:b3:3a:c6:d9:59",
            "net13": "0a:73:83:26:b4:c2",
            "net14": "8a:16:b1:0d:c0:a7",
            "net15": "c6:b6:95:fc:03:c7",
            "net2": "76:83:b4:dc:a9:48",
            "net3": "b6:24:e9:e7:44:e9",
            "net4": "82:bd:99:5d:5b:a5",
            "net5": "fa:01:b1:be:78:3f",
            "net6": "0a:fe:d1:48:a8:6b",
            "net7": "ca:7a:c9:30:04:e7",
            "net8": "1a:9b:2d:41:15:67",
            "net9": "8a:0f:be:49:5a:4a"
        },
        "spine_2_1_5": {
            "net0": "e2:24:e0:bd:db:a4",
            "net1": "2e:42:8b:b9:bf:f1",
            "net10": "6a:98:39:c9:56:08",
            "net11": "1e:5c:3d:31:c9:26",
            "net12": "6e:6d:a0:56:0c:42",
            "net13": "0a:64:55:49:22:38",
            "net14": "ee:bc:06:2c:d7:a5",
            "net15": "4e:15:27:83:62:61",
            "net2": "7a:da:ac:b0:12:07",
            "net3": "c2:9e:12:0a:b7:2d",
            "net4": "aa:5e:e1:64:55:d9",
            "net5": "0e:92:50:f3:28:00",
            "net6": "16:49:ad:dd:ba:d5",
            "net7": "82:2d:ea:eb:a6:1b",
            "net8": "b2:f8:06:bb:a6:07",
            "net9": "b6:92:55:89:b9:d0"
        },
        "spine_2_1_6": {
            "net0": "2e:ab:52:31:8a:42",
            "net1": "9e:30:53:c8:ba:1c",
            "net10": "aa:c9:1a:9a:86:7b",
            "net11": "ea:d3:2d:6b:2f:75",
            "net12": "2a:0c:0c:94:e5:05",
            "net13": "da:fa:76:78:35:7e",
            "net14": "e2:fc:e0:07:2b:f9",
            "net15": "1e:f0:e0:2f:39:9e",
            "net2": "32:02:74:60:5a:3a",
            "net3": "ce:05:24:ce:6d:af",
            "net4": "f6:cd:cc:39:c6:ab",
            "net5": "da:91:38:9c:1e:58",
            "net6": "8e:01:bb:89:58:a0",
            "net7": "12:4b:50:3a:9a:ca",
            "net8": "6a:7c:49:d5:f1:8a",
            "net9": "32:3a:e4:07:1c:d9"
        },
        "spine_2_1_7": {
            "net0": "4e:56:f8:de:93:7e",
            "net1": "5a:58:48:f3:ae:e1",
            "net10": "d6:7b:b3:09:ae:87",
            "net11": "66:db:e2:69:23:9f",
            "net12": "86:7a:20:91:ed:35",
            "net13": "56:a1:cb:30:5f:df",
            "net14": "d6:9c:80:da:86:47",
            "net15": "62:08:b3:37:7f:c2",
            "net2": "5a:72:d3:f4:e0:17",
            "net3": "5a:5d:4e:2f:9a:3c",
            "net4": "9a:f7:97:23:02:70",
            "net5": "b6:d8:23:49:69:f8",
            "net6": "e2:71:57:f0:ee:ed",
            "net7": "22:be:6b:80:08:46",
            "net8": "7e:f1:f6:0f:52:56",
            "net9": "ea:13:d8:9a:5f:f4"
        },
        "spine_2_1_8": {
            "net0": "5e:4b:14:68:45:b1",
            "net1": "46:bb:ad:17:9c:2f",
            "net10": "0a:aa:4c:60:6e:9d",
            "net11": "da:18:f8:40:fc:0f",
            "net12": "02:79:f7:98:64:2f",
            "net13": "86:d0:2e:da:32:72",
            "net14": "ea:30:0c:a5:22:b1",
            "net15": "1a:d7:f6:69:b6:20",
            "net2": "76:9d:81:1d:97:88",
            "net3": "3e:f6:d7:81:19:bc",
            "net4": "8e:8c:bd:6f:19:aa",
            "net5": "16:86:8e:2e:3c:39",
            "net6": "5e:be:5d:ed:45:e1",
            "net7": "f2:fc:db:85:66:de",
            "net8": "0a:2e:03:e7:d5:08",
            "net9": "ca:a9:56:b3:04:81"
        },
        "tof_1_2_1": {
            "net0": "ae:c8:8e:68:b7:5d",
            "net1": "52:86:d0:fd:7b:39",
            "net10": "0e:bf:f5:f5:cb:33",
            "net11": "5a:34:a1:7e:46:2c",
            "net12": "9a:4a:63:92:23:2f",
            "net13": "5a:0f:58:09:1f:fe",
            "net14": "be:3c:2d:0c:12:a2",
            "net15": "da:5c:0d:c0:51:9b",
            "net2": "f2:27:6e:60:93:8e",
            "net3": "e2:c8:8e:ac:f8:7e",
            "net4": "d2:45:a4:06:93:29",
            "net5": "b6:a6:29:af:f6:7e",
            "net6": "62:2c:bc:c1:9d:c6",
            "net7": "1a:f4:82:61:fb:48",
            "net8": "da:6f:cb:41:71:81",
            "net9": "6e:8e:4d:1a:db:ee"
        },
        "tof_1_2_2": {
            "net0": "de:fa:af:2f:3a:db",
            "net1": "7e:fd:b5:b7:82:4b",
            "net10": "fa:e8:bd:05:ef:28",
            "net11": "ba:61:f0:cb:03:11",
            "net12": "ba:5d:6d:c9:d1:6d",
            "net13": "82:9b:74:dc:ff:fc",
            "net14": "f6:e8:f6:b8:f7:d0",
            "net15": "da:00:3a:28:12:08",
            "net2": "02:4f:85:88:5a:11",
            "net3": "e6:39:bd:a7:8f:48",
            "net4": "b6:8c:d0:5b:f3:63",
            "net5": "72:8e:b5:84:df:ab",
            "net6": "6e:b3:62:7c:5c:8f",
            "net7": "2e:eb:60:5f:e4:84",
            "net8": "7e:cd:14:42:e8:ab",
            "net9": "96:7d:82:38:d2:93"
        },
        "tof_1_2_3": {
            "net0": "e6:42:f2:d4:c3:25",
            "net1": "56:8a:b0:dd:1c:07",
            "net10": "c6:1f:4f:7e:16:4c",
            "net11": "ae:44:0c:ec:4b:84",
            "net12": "0a:9c:43:cc:e8:3c",
            "net13": "4a:a0:a7:54:18:82",
            "net14": "0a:68:c5:f5:76:3a",
            "net15": "36:26:da:6c:83:42",
            "net2": "1e:4a:b8:94:7d:c7",
            "net3": "5e:2a:59:9f:3b:32",
            "net4": "d6:88:fd:30:5f:a5",
            "net5": "fa:62:bb:0d:39:9e",
            "net6": "e6:eb:14:4a:39:13",
            "net7": "86:2e:33:ee:a0:3e",
            "net8": "0a:a4:00:af:83:8e",
            "net9": "4a:72:10:1b:2d:95"
        },
        "tof_1_2_4": {
            "net0": "86:ad:5e:5c:48:37",
            "net1": "b2:25:02:9b:cf:c1",
            "net10": "96:a0:c8:a3:d5:98",
            "net11": "a6:38:01:c3:45:1d",
            "net12": "0e:b9:b0:ea:1b:34",
            "net13": "26:71:fb:e9:41:f3",
            "net14": "f2:45:bb:e5:17:b9",
            "net15": "d6:02:03:1f:5e:4c",
            "net2": "9e:79:7e:53:d1:50",
            "net3": "5a:bc:6d:e0:a0:b4",
            "net4": "fa:81:d9:f7:95:db",
            "net5": "32:b2:ae:f2:5f:94",
            "net6": "d2:b5:11:f4:1a:e8",
            "net7": "d6:4b:2c:fb:9f:13",
            "net8": "f2:00:36:7c:c3:07",
            "net9": "ae:5a:96:ec:7e:cf"
        },
        "tof_1_2_5": {
            "net0": "4e:46:0e:d0:6a:45",
            "net1": "aa:30:aa:b4:63:6e",
            "net10": "1a:83:43:85:cd:fc",
            "net11": "36:4b:9a:88:28:e5",
            "net12": "62:4b:4c:c9:1c:c3",
            "net13": "6e:8a:8b:7c:1f:87",
            "net14": "ca:1e:92:49:4c:8b",
            "net15": "0a:38:5e:e5:41:74",
            "net2": "66:37:9c:94:1f:99",
            "net3": "3e:67:fd:93:2f:88",
            "net4": "9a:3a:68:85:04:c7",
            "net5": "d2:4f:e1:44:f7:e7",
            "net6": "f2:3c:31:2d:48:e6",
            "net7": "86:b9:f6:0e:4a:cf",
            "net8": "aa:81:72:89:93:ba",
            "net9": "6a:91:2c:d2:91:fc"
        },
        "tof_1_2_6": {
            "net0": "8a:52:a2:64:8e:f2",
            "net1": "fe:ec:fe:a2:0b:bf",
            "net10": "62:b0:f1:5a:75:72",
            "net11": "16:b6:08:61:ff:6a",
            "net12": "2e:bf:b1:a3:8b:d8",
            "net13": "c2:56:b2:d1:02:49",
            "net14": "0a:f9:8c:4d:e6:4c",
            "net15": "5a:8f:de:63:a2:69",
            "net2": "52:4d:99:e3:87:75",
            "net3": "da:12:d3:05:1d:ed",
            "net4": "f2:7c:0b:a6:40:0e",
            "net5": "62:76:03:f3:5c:93",
            "net6": "d6:8f:38:cd:6f:cb",
            "net7": "4a:45:7c:24:97:d7",
            "net8": "02:12:15:13:d6:7e",
            "net9": "0a:be:c3:cf:83:52"
        },
        "tof_1_2_7": {
            "net0": "ce:82:5c:71:0e:aa",
            "net1": "8e:34:a8:e9:23:a5",
            "net10": "62:26:ff:38:5f:1c",
            "net11": "b2:92:a3:a4:0d:92",
            "net12": "aa:b1:66:66:af:36",
            "net13": "be:b4:5c:26:30:85",
            "net14": "f2:71:77:e2:e3:f3",
            "net15": "22:a7:31:0b:a8:79",
            "net2": "d2:a8:44:79:28:71",
            "net3": "02:75:b5:eb:eb:00",
            "net4": "12:98:b5:b5:c3:23",
            "net5": "36:1a:e3:ee:54:ae",
            "net6": "86:5a:a9:f7:7d:58",
            "net7": "6e:5d:3f:09:01:03",
            "net8": "be:fb:01:be:51:95",
            "net9": "56:cc:3e:4c:fa:ae"
        },
        "tof_1_2_8": {
            "net0": "92:fb:b2:c3:64:81",
            "net1": "5a:fa:9a:a2:ad:f8",
            "net10": "a6:7f:2f:7d:e3:10",
            "net11": "8e:76:34:ba:21:ce",
            "net12": "2e:82:2c:0d:fc:df",
            "net13": "ee:69:1d:c9:9c:87",
            "net14": "ee:e5:e7:83:85:c9",
            "net15": "46:1f:41:54:b8:a7",
            "net2": "7e:db:65:86:f2:da",
            "net3": "4a:11:6d:ee:9c:38",
            "net4": "f2:0a:7c:41:41:ce",
            "net5": "72:f7:b4:88:cf:ff",
            "net6": "aa:7b:54:f7:85:8f",
            "net7": "6e:76:88:4d:dc:c1",
            "net8": "e2:39:12:cf:df:81",
            "net9": "be:74:3c:27:6c:e4"
        }
    },
    "failed_machine": "leaf_1_0_1",
    "failure_time": {
        "leaf_1_0_1": 1622128579.0185373,
        "leaf_1_0_2": 1622128579.045234,
        "leaf_1_0_3": 1622128579.0576344,
        "leaf_1_0_4": 1622128579.0290844,
        "leaf_1_0_5": 1622128579.0459569,
        "leaf_1_0_6": 1622128579.0618863,
        "leaf_1_0_7": 1622128579.0389533,
        "leaf_1_0_8": 1622128579.0552292,
        "leaf_2_0_1": 1622128579.0739489,
        "leaf_2_0_2": 1622128579.038768,
        "leaf_2_0_3": 1622128579.0503223,
        "leaf_2_0_4": 1622128579.0681736,
        "leaf_2_0_5": 1622128579.071701,
        "leaf_2_0_6": 1622128579.0902543,
        "leaf_2_0_7": 1622128579.1156223,
        "leaf_2_0_8": 1622128579.078868,
        "spine_1_1_1": 1622128579.1011417,
        "spine_1_1_2": 1622128579.1259892,
        "spine_1_1_3": 1622128579.088466,
        "spine_1_1_4": 1622128579.1118126,
        "spine_1_1_5": 1622128579.138628,
        "spine_1_1_6": 1622128579.0974164,
        "spine_1_1_7": 1622128579.1246645,
        "spine_1_1_8": 1622128579.1418433,
        "spine_2_1_1": 1622128579.1346815,
        "spine_2_1_2": 1622128579.1433995,
        "spine_2_1_3": 1622128579.1546633,
        "spine_2_1_4": 1622128579.1438575,
        "spine_2_1_5": 1622128579.1552145,
        "spine_2_1_6": 1622128579.167861,
        "spine_2_1_7": 1622128579.1470928,
        "spine_2_1_8": 1622128579.1603923,
        "tof_1_2_1": 1622128579.171658,
        "tof_1_2_2": 1622128579.1509705,
        "tof_1_2_3": 1622128579.1593409,
        "tof_1_2_4": 1622128579.1722972,
        "tof_1_2_5": 1622128579.1697056,
        "tof_1_2_6": 1622128579.1762996,
        "tof_1_2_7": 1622128579.1857305,
        "tof_1_2_8": 1622128579.1755445
    }
}