{
    "k_leaf": 6,
    "k_top": 6,
    "redundancy_factor": 6,
    "is_k8s": true,
    "machine_mac_addresses": {
        "leaf_1_0_1": {
            "net0": "12:c2:1c:37:a3:0a",
            "net1": "82:8b:f8:70:ca:14",
            "net2": "66:19:47:87:c9:53",
            "net3": "8a:98:91:ca:98:e0",
            "net4": "62:fd:b4:8b:43:35",
            "net5": "6e:4f:f7:4e:83:5e",
            "net6": "5a:64:70:c1:f0:8f"
        },
        "leaf_1_0_2": {
            "net0": "3a:b3:58:dd:19:f7",
            "net1": "2e:0b:55:0e:2d:c3",
            "net2": "3e:62:ec:97:33:16",
            "net3": "42:57:49:5f:2b:e1",
            "net4": "f2:62:8d:48:41:d0",
            "net5": "ea:fb:d7:27:df:b3",
            "net6": "96:40:9f:38:0e:89"
        },
        "leaf_1_0_3": {
            "net0": "32:ff:43:d9:c1:f6",
            "net1": "7e:48:dd:9a:29:5d",
            "net2": "c2:94:44:ef:e0:81",
            "net3": "aa:f1:c5:7d:1d:a2",
            "net4": "12:af:d6:9f:2f:6b",
            "net5": "82:87:f7:dc:7c:af",
            "net6": "be:ac:dc:eb:ba:c2"
        },
        "leaf_1_0_4": {
            "net0": "26:c0:30:a1:70:61",
            "net1": "5e:f9:b2:59:52:09",
            "net2": "fe:ef:13:8f:1b:b3",
            "net3": "ca:ee:6a:42:26:4f",
            "net4": "52:0e:d1:4b:a0:7b",
            "net5": "62:ce:d0:55:d6:64",
            "net6": "12:82:8e:46:ea:03"
        },
        "leaf_1_0_5": {
            "net0": "86:ef:f0:05:77:09",
            "net1": "9a:a4:28:bd:33:79",
            "net2": "2a:1c:ba:52:c0:50",
            "net3": "76:c7:68:55:df:99",
            "net4": "06:fa:83:d1:cd:6f",
            "net5": "ea:98:c7:a0:1f:72",
            "net6": "ca:0d:4e:1d:10:98"
        },
        "leaf_1_0_6": {
            "net0": "aa:02:47:0b:d5:94",
            "net1": "46:52:84:52:2f:b9",
            "net2": "1a:55:a0:ca:1b:c1",
            "net3": "ca:51:2a:c1:8c:d9",
            "net4": "ea:17:47:96:56:a5",
            "net5": "ba:52:74:69:ee:26",
            "net6": "22:fe:02:55:78:51"
        },
        "leaf_2_0_1": {
            "net0": "f2:92:75:32:dc:14",
            "net1": "d2:06:c2:cc:1b:b6",
            "net2": "6a:5e:2c:9a:6c:f6",
            "net3": "7a:fb:f1:4d:b4:39",
            "net4": "de:fc:5b:a7:0d:81",
            "net5": "86:88:f3:fa:b6:49",
            "net6": "ca:ea:6d:ab:ba:08"
        },
        "leaf_2_0_2": {
            "net0": "ee:18:6e:ed:12:b4",
            "net1": "56:d7:35:02:32:99",
            "net2": "92:6d:c2:ae:af:38",
            "net3": "ae:8f:57:da:f8:bc",
            "net4": "0e:7c:72:b8:32:99",
            "net5": "12:bb:4b:3b:f7:e5",
            "net6": "d6:7a:b6:c2:fe:ca"
        },
        "leaf_2_0_3": {
            "net0": "f2:6d:9f:71:17:03",
            "net1": "9a:9d:21:29:53:de",
            "net2": "96:d5:e0:41:e5:f1",
            "net3": "76:7f:68:f0:c9:c3",
            "net4": "12:f6:40:09:f2:6c",
            "net5": "16:7e:af:f6:a4:67",
            "net6": "72:5f:78:65:41:a5"
        },
        "leaf_2_0_4": {
            "net0": "9a:6d:50:38:84:15",
            "net1": "52:3d:00:57:79:d6",
            "net2": "a6:58:45:c5:f1:bf",
            "net3": "3a:92:7b:33:f6:2a",
            "net4": "2e:2d:c6:d6:a2:e9",
            "net5": "b6:4c:dc:46:63:05",
            "net6": "9a:65:05:7d:45:c7"
        },
        "leaf_2_0_5": {
            "net0": "0a:f2:63:20:2f:7e",
            "net1": "7e:61:b0:ce:a9:f4",
            "net2": "c6:2e:3c:9e:6e:73",
            "net3": "36:ef:da:d6:29:ff",
            "net4": "62:0b:97:af:d9:db",
            "net5": "aa:78:26:12:9a:d2",
            "net6": "ce:4b:7c:4b:fb:eb"
        },
        "leaf_2_0_6": {
            "net0": "36:da:30:1e:24:62",
            "net1": "26:72:31:0f:0f:fc",
            "net2": "f2:73:0c:8c:f5:32",
            "net3": "a6:2f:21:cb:98:d4",
            "net4": "8a:48:6a:38:8c:dc",
            "net5": "ce:fe:83:da:88:76",
            "net6": "3a:57:86:b9:0a:e5"
        },
        "spine_1_1_1": {
            "net0": "8a:f6:f9:48:70:46",
            "net1": "6e:21:df:5a:25:9a",
            "net10": "e2:32:cb:81:36:64",
            "net11": "02:00:4f:36:e3:ce",
            "net2": "ea:65:69:72:88:fe",
            "net3": "fa:4e:cd:c2:9e:89",
            "net4": "6a:d8:46:1a:be:61",
            "net5": "a6:95:32:32:2b:b0",
            "net6": "6e:be:76:0c:4e:02",
            "net7": "e6:22:a7:89:7f:7b",
            "net8": "3a:6b:96:cd:9b:0d",
            "net9": "d6:3e:41:91:d0:c1"
        },
        "spine_1_1_2": {
            "net0": "0a:1c:d3:75:92:34",
            "net1": "0e:a6:bc:96:04:1a",
            "net10": "d2:40:30:b2:fc:99",
            "net11": "62:31:d9:84:1a:f9",
            "net2": "d2:76:a1:54:93:35",
            "net3": "6e:1e:e6:31:9b:d7",
            "net4": "52:fa:6e:af:ce:b1",
            "net5": "4a:8a:15:3a:81:66",
            "net6": "46:0a:4e:51:dc:93",
            "net7": "d2:26:bc:3f:d0:75",
            "net8": "aa:01:33:17:67:71",
            "net9": "e6:73:a4:3e:4a:a0"
        },
        "spine_1_1_3": {
            "net0": "86:89:1f:16:2f:79",
            "net1": "32:c8:8b:40:66:1a",
            "net10": "32:39:e4:b2:0e:75",
            "net11": "02:49:dd:6b:9b:44",
            "net2": "02:a5:c6:57:6b:7a",
            "net3": "6e:95:b5:49:9d:21",
            "net4": "fe:25:b1:30:be:ff",
            "net5": "0a:b2:45:68:cf:ae",
            "net6": "d2:56:16:01:49:a8",
            "net7": "22:b0:37:47:7f:99",
            "net8": "d6:4e:a8:be:43:48",
            "net9": "62:65:af:50:3f:8a"
        },
        "spine_1_1_4": {
            "net0": "3a:3c:ed:bf:db:19",
            "net1": "b6:f2:66:c8:05:c3",
            "net10": "a2:cc:4f:3b:e9:69",
            "net11": "e6:75:23:60:94:f3",
            "net2": "46:54:70:63:92:3f",
            "net3": "e6:a9:ef:90:43:0d",
            "net4": "fe:fb:37:ee:18:89",
            "net5": "3e:a9:11:ed:82:70",
            "net6": "36:10:e7:53:e8:5b",
            "net7": "72:d2:24:1c:b6:7d",
            "net8": "1a:cd:30:e5:c3:3a",
            "net9": "52:00:9d:3f:07:e9"
        },
        "spine_1_1_5": {
            "net0": "c2:43:94:63:44:9f",
            "net1": "ae:af:09:eb:30:71",
            "net10": "5a:17:95:3a:3f:81",
            "net11": "2e:7c:5a:a4:c5:9b",
            "net2": "26:30:40:9a:31:de",
            "net3": "aa:67:85:b6:5f:98",
            "net4": "a6:25:3c:39:f9:1d",
            "net5": "66:81:c7:7f:15:94",
            "net6": "72:59:a3:90:b0:dc",
            "net7": "72:10:dc:ed:3a:59",
            "net8": "ea:7e:83:ab:e1:3d",
            "net9": "2e:82:f5:54:15:2f"
        },
        "spine_1_1_6": {
            "net0": "b2:d8:66:98:99:07",
            "net1": "b2:de:75:af:ae:7b",
            "net10": "9a:3b:30:de:c8:3a",
            "net11": "52:75:41:8e:92:c6",
            "net2": "32:0e:bd:07:5d:ee",
            "net3": "ee:6a:10:f0:84:f6",
            "net4": "62:5b:97:0b:6a:4d",
            "net5": "c6:fa:64:66:e9:50",
            "net6": "d2:60:21:1e:1a:f9",
            "net7": "b2:f8:02:a2:63:a3",
            "net8": "9e:99:4c:26:2f:dd",
            "net9": "06:fe:b4:58:a9:3b"
        },
        "spine_2_1_1": {
            "net0": "66:81:71:4a:6a:ec",
            "net1": "2a:62:70:92:a1:63",
            "net10": "d2:68:08:d8:09:7d",
            "net11": "3e:25:e6:a6:ef:4a",
            "net2": "1e:0f:94:af:71:0a",
            "net3": "42:bd:d2:b3:69:ff",
            "net4": "9a:73:f5:34:b6:89",
            "net5": "62:fa:07:0c:cf:f6",
            "net6": "4e:57:5a:cc:e4:a7",
            "net7": "76:9b:c3:69:f1:71",
            "net8": "4a:c1:59:be:07:84",
            "net9": "56:be:31:1b:b1:27"
        },
        "spine_2_1_2": {
            "net0": "da:10:d2:fd:d9:67",
            "net1": "a2:a2:cd:b7:f8:dd",
            "net10": "ca:21:8e:15:22:1b",
            "net11": "7a:98:6f:f0:a6:23",
            "net2": "16:de:d1:e2:ab:63",
            "net3": "aa:04:db:64:57:5b",
            "net4": "7e:eb:a5:58:6a:df",
            "net5": "4a:17:a2:a4:a8:af",
            "net6": "3e:54:d9:c8:18:07",
            "net7": "b6:79:ed:f1:b9:1c",
            "net8": "7a:8d:8e:43:73:db",
            "net9": "9a:3f:69:98:c8:95"
        },
        "spine_2_1_3": {
            "net0": "4a:e0:dd:57:6e:51",
            "net1": "b6:5a:05:35:83:9d",
            "net10": "ee:e3:b2:9d:14:d8",
            "net11": "a6:11:e3:69:6c:c0",
            "net2": "e2:9c:37:b0:9a:92",
            "net3": "d2:0b:6f:63:99:47",
            "net4": "2e:50:1c:e2:a0:18",
            "net5": "7a:b2:70:55:a2:47",
            "net6": "5e:91:59:1c:6e:1f",
            "net7": "f2:7e:cd:c1:c2:49",
            "net8": "a2:a7:9c:bb:50:67",
            "net9": "fe:db:a6:84:f6:64"
        },
        "spine_2_1_4": {
            "net0": "76:03:71:4c:30:fd",
            "net1": "2a:2b:c9:58:b5:ea",
            "net10": "36:27:1d:6e:a9:8a",
            "net11": "ae:e7:d3:c1:16:00",
            "net2": "4e:3a:5a:a9:f6:94",
            "net3": "26:aa:20:ad:6f:0a",
            "net4": "82:ec:f3:d7:1d:b0",
            "net5": "e6:05:5c:e4:41:23",
            "net6": "9a:fb:fa:21:06:69",
            "net7": "4a:1b:d8:b2:d3:44",
            "net8": "4e:d7:37:82:00:4a",
            "net9": "62:c1:3e:3f:81:3a"
        },
        "spine_2_1_5": {
            "net0": "62:46:7c:be:db:2b",
            "net1": "72:78:e7:03:2f:bc",
            "net10": "76:1e:f2:c1:78:8b",
            "net11": "ca:d7:0f:56:8f:ed",
            "net2": "ea:26:7e:cf:56:60",
            "net3": "ee:4b:13:98:7b:90",
            "net4": "56:23:86:81:64:fa",
            "net5": "fe:e1:31:f6:ca:5d",
            "net6": "72:cc:07:a7:b5:b5",
            "net7": "e2:66:84:81:d3:b3",
            "net8": "56:9e:8c:9c:ee:3d",
            "net9": "7e:17:00:65:44:73"
        },
        "spine_2_1_6": {
            "net0": "7a:e0:5c:b2:cf:c3",
            "net1": "d2:4f:6b:59:69:88",
            "net10": "fa:45:cc:62:45:a7",
            "net11": "f6:34:3b:a9:eb:29",
            "net2": "6e:bb:c4:41:c4:76",
            "net3": "02:52:d8:9e:20:4d",
            "net4": "82:74:4f:fa:b8:e1",
            "net5": "e2:96:c2:59:d2:d1",
            "net6": "d6:fb:73:e8:90:87",
            "net7": "56:10:a8:f5:d9:8f",
            "net8": "ea:be:4d:67:6b:f6",
            "net9": "c2:be:a8:86:8d:e3"
        },
        "tof_1_2_1": {
            "net0": "2a:57:19:a4:90:b3",
            "net1": "aa:62:d9:5c:1d:aa",
            "net10": "16:ed:9a:62:1f:4c",
            "net11": "7a:57:ea:23:f4:30",
            "net2": "02:f0:79:9b:f3:dc",
            "net3": "32:d5:66:ef:0e:65",
            "net4": "1e:fc:69:a5:ba:97",
            "net5": "ce:97:90:8a:f0:a7",
            "net6": "ae:8f:a4:45:19:2c",
            "net7": "8e:ba:10:64:b5:d9",
            "net8": "96:1e:41:f9:2c:a7",
            "net9": "d6:30:3b:60:f4:64"
        },
        "tof_1_2_2": {
            "net0": "62:95:2e:e3:c2:74",
            "net1": "46:9d:af:f8:e5:cb",
            "net10": "9e:c7:94:3f:3f:08",
            "net11": "4a:96:5a:11:7c:fe",
            "net2": "8e:82:6d:c0:63:0d",
            "net3": "12:e1:49:46:c5:fa",
            "net4": "ea:4d:84:58:c5:10",
            "net5": "f2:cf:97:de:bb:92",
            "net6": "42:44:e7:c3:f0:34",
            "net7": "ee:35:82:a4:b2:96",
            "net8": "c2:0f:e5:93:50:25",
            "net9": "d2:c9:23:27:dd:bf"
        },
        "tof_1_2_3": {
            "net0": "c6:4a:03:f9:11:c8",
            "net1": "ca:57:2b:e7:49:3a",
            "net10": "2e:4d:c9:9e:2f:66",
            "net11": "e6:ff:d5:25:84:7c",
            "net2": "ee:91:75:27:6e:a4",
            "net3": "a6:49:ba:04:0e:7e",
            "net4": "9a:13:df:ba:b8:74",
            "net5": "de:1e:2f:1a:97:0e",
            "net6": "9a:78:1f:a3:61:91",
            "net7": "72:65:49:f1:3f:8a",
            "net8": "7e:e9:1b:5c:ab:ef",
            "net9": "76:87:58:a6:fd:fe"
        },
        "tof_1_2_4": {
            "net0": "0a:b7:91:35:e7:00",
            "net1": "42:de:d2:43:c4:1e",
            "net10": "4a:d9:9a:94:b8:39",
            "net11": "72:62:1a:e7:99:c8",
            "net2": "fa:99:00:bf:92:b6",
            "net3": "32:67:fc:93:3c:1e",
            "net4": "4a:0a:5d:55:35:a5",
            "net5": "6a:99:e3:1f:f0:03",
            "net6": "ea:c8:1e:eb:15:96",
            "net7": "5e:e6:6e:b1:52:9e",
            "net8": "9a:fc:0f:99:57:68",
            "net9": "aa:12:79:4c:50:61"
        },
        "tof_1_2_5": {
            "net0": "ca:1d:66:0d:4e:34",
            "net1": "ca:d6:fe:ab:27:9c",
            "net10": "d2:25:6d:f2:e5:cc",
            "net11": "22:ea:45:ce:0a:f4",
            "net2": "f2:f9:55:d7:ca:fb",
            "net3": "1e:7f:8d:21:88:2a",
            "net4": "72:e1:6e:44:8e:93",
            "net5": "5e:65:31:86:f4:36",
            "net6": "3a:51:58:ae:29:1f",
            "net7": "5e:ea:10:11:e6:ec",
            "net8": "6e:ca:31:78:f1:cc",
            "net9": "16:4d:b3:78:39:ac"
        },
        "tof_1_2_6": {
            "net0": "02:ec:9d:1e:36:71",
            "net1": "82:23:b3:59:6e:9b",
            "net10": "ba:72:6a:e5:e7:c1",
            "net11": "e6:28:dc:6f:5e:dd",
            "net2": "32:20:3d:1a:6c:ad",
            "net3": "66:f7:2e:78:75:34",
            "net4": "aa:ea:d2:ab:e1:42",
            "net5": "1a:a1:fb:8d:f8:a2",
            "net6": "aa:68:37:0d:2a:d5",
            "net7": "c2:66:81:09:25:81",
            "net8": "ca:0a:3d:c4:93:f3",
            "net9": "12:be:84:4b:b4:f2"
        }
    },
    "failed_machine": "leaf_1_0_1",
    "failure_time": {
        "leaf_1_0_1": 1622127173.9397738,
        "leaf_1_0_2": 1622127173.9554005,
        "leaf_1_0_3": 1622127173.9537945,
        "leaf_1_0_4": 1622127173.9687817,
        "leaf_1_0_5": 1622127173.951649,
        "leaf_1_0_6": 1622127173.9603841,
        "leaf_2_0_1": 1622127173.9574335,
        "leaf_2_0_2": 1622127173.9738479,
        "leaf_2_0_3": 1622127173.9739428,
        "leaf_2_0_4": 1622127173.9838636,
        "leaf_2_0_5": 1622127173.9737732,
        "leaf_2_0_6": 1622127173.9802883,
        "spine_1_1_1": 1622127173.9787145,
        "spine_1_1_2": 1622127173.9983191,
        "spine_1_1_3": 1622127173.9886005,
        "spine_1_1_4": 1622127174.0016005,
        "spine_1_1_5": 1622127173.997309,
        "spine_1_1_6": 1622127174.0073216,
        "spine_2_1_1": 1622127174.0009482,
        "spine_2_1_2": 1622127174.0185974,
        "spine_2_1_3": 1622127174.0130827,
        "spine_2_1_4": 1622127174.0227997,
        "spine_2_1_5": 1622127174.0169623,
        "spine_2_1_6": 1622127174.03605,
        "tof_1_2_1": 1622127174.0219965,
        "tof_1_2_2": 1622127174.0382786,
        "tof_1_2_3": 1622127174.0368917,
        "tof_1_2_4": 1622127174.0514057,
        "tof_1_2_5": 1622127174.0411003,
        "tof_1_2_6": 1622127174.0560443
    }
}