{
    "k_leaf": 2,
    "k_top": 2,
    "redundancy_factor": 1,
    "is_k8s": true,
    "machine_mac_addresses": {
        "leaf_1_0_1": {
            "net0": "7e:89:9d:bc:fd:a6",
            "net1": "8a:a1:35:82:3b:81",
            "net2": "3e:f1:69:74:7f:ea"
        },
        "leaf_1_0_2": {
            "net0": "52:f7:9d:51:e0:f8",
            "net1": "2e:61:fe:51:d7:a9",
            "net2": "66:c7:80:45:cf:e2"
        },
        "leaf_2_0_1": {
            "net0": "f6:aa:b3:a2:50:cc",
            "net1": "36:28:e2:8f:65:05",
            "net2": "7a:f6:1f:33:a5:53"
        },
        "leaf_2_0_2": {
            "net0": "66:c2:b6:2f:9c:fd",
            "net1": "36:87:91:76:cd:21",
            "net2": "b2:ee:b9:e3:d7:82"
        },
        "leaf_3_0_1": {
            "net0": "b2:e7:26:d0:f9:5b",
            "net1": "1a:52:92:17:21:4d",
            "net2": "a2:13:56:41:7f:99"
        },
        "leaf_3_0_2": {
            "net0": "22:61:8b:47:83:15",
            "net1": "1a:40:b9:cc:9b:e8",
            "net2": "16:fd:26:df:a5:19"
        },
        "leaf_4_0_1": {
            "net0": "f6:24:d3:38:9b:cc",
            "net1": "d2:fe:95:c2:8e:f9",
            "net2": "ae:aa:87:27:d8:ef"
        },
        "leaf_4_0_2": {
            "net0": "c6:2f:42:cd:65:19",
            "net1": "fa:4b:75:68:4d:12",
            "net2": "66:a0:87:e7:a3:c6"
        },
        "spine_1_1_1": {
            "net0": "72:77:b5:52:1a:af",
            "net1": "52:6f:8d:42:66:af",
            "net2": "e2:a9:3f:5e:10:54",
            "net3": "ee:8b:d0:88:66:52"
        },
        "spine_1_1_2": {
            "net0": "ee:3f:f6:96:36:91",
            "net1": "32:2b:33:97:8b:8f",
            "net2": "36:84:64:5b:36:fa",
            "net3": "de:be:9b:0b:50:c8"
        },
        "spine_2_1_1": {
            "net0": "5e:33:c3:4f:9e:2d",
            "net1": "e6:40:a2:32:18:a7",
            "net2": "72:bb:7f:9f:b1:d8",
            "net3": "be:95:16:42:bc:84"
        },
        "spine_2_1_2": {
            "net0": "9a:5a:e4:33:3f:0e",
            "net1": "ca:21:a5:e0:66:35",
            "net2": "b6:1c:5c:6f:3d:d7",
            "net3": "86:3c:fb:8f:16:eb"
        },
        "spine_3_1_1": {
            "net0": "62:41:96:60:48:51",
            "net1": "46:fb:38:db:16:8c",
            "net2": "ee:a1:8b:a3:aa:dd",
            "net3": "4a:86:55:cf:55:fd"
        },
        "spine_3_1_2": {
            "net0": "fa:f8:ae:79:1f:0b",
            "net1": "2a:cc:1a:9b:a3:dc",
            "net2": "92:42:25:62:4b:75",
            "net3": "3a:16:4d:a8:5d:9a"
        },
        "spine_4_1_1": {
            "net0": "5a:ae:3d:ce:84:34",
            "net1": "2e:69:a7:23:2d:47",
            "net2": "a6:50:ca:f7:c5:d4",
            "net3": "1e:bd:76:21:86:02"
        },
        "spine_4_1_2": {
            "net0": "12:6d:0f:e5:b8:7c",
            "net1": "2a:c8:f7:56:9b:8a",
            "net2": "3e:63:44:34:77:21",
            "net3": "8e:f3:e1:5c:4a:62"
        },
        "tof_1_2_1": {
            "net0": "56:7e:01:18:9c:5c",
            "net1": "0a:23:9a:55:53:90",
            "net2": "8e:1a:ab:1a:d0:53",
            "net3": "96:e0:58:30:a8:6b",
            "net4": "16:52:a6:b1:6b:82"
        },
        "tof_1_2_2": {
            "net0": "12:f5:b7:d3:bb:72",
            "net1": "2e:b9:38:3b:65:c1",
            "net2": "e6:cf:ff:a6:64:1b",
            "net3": "fa:e6:26:73:6c:a6",
            "net4": "4e:71:b2:4c:77:93"
        },
        "tof_2_2_1": {
            "net0": "1e:e3:a4:31:58:5f",
            "net1": "d6:30:2a:f7:ce:ba",
            "net2": "ae:66:4f:b4:4b:cb",
            "net3": "82:5d:34:91:96:77",
            "net4": "d2:66:94:11:8c:5e"
        },
        "tof_2_2_2": {
            "net0": "92:22:1f:14:b3:81",
            "net1": "72:fc:96:5e:86:28",
            "net2": "2e:7d:92:ca:89:0e",
            "net3": "c6:a8:40:7e:8d:0e",
            "net4": "c6:3c:56:3a:1c:3c"
        }
    },
    "failed_machine": "leaf_1_0_1",
    "failure_time": {
        "leaf_1_0_1": 1622750432.2402406,
        "leaf_1_0_2": 1622750432.2481635,
        "leaf_2_0_1": 1622750432.252094,
        "leaf_2_0_2": 1622750432.2404342,
        "leaf_3_0_1": 1622750432.2486758,
        "leaf_3_0_2": 1622750431.68932,
        "leaf_4_0_1": 1622750432.2588441,
        "leaf_4_0_2": 1622750432.2647276,
        "spine_1_1_1": 1622750432.2703583,
        "spine_1_1_2": 1622750432.2605736,
        "spine_2_1_1": 1622750431.7014096,
        "spine_2_1_2": 1622750432.2714906,
        "spine_3_1_1": 1622750432.274325,
        "spine_3_1_2": 1622750432.2794032,
        "spine_4_1_1": 1622750432.2841928,
        "spine_4_1_2": 1622750432.276819,
        "tof_1_2_1": 1622750432.2842233,
        "tof_1_2_2": 1622750432.2866948,
        "tof_2_2_1": 1622750432.2897258,
        "tof_2_2_2": 1622750432.2945364
    }
}