{
    "k_leaf": 4,
    "k_top": 4,
    "redundancy_factor": 4,
    "is_k8s": true,
    "machine_mac_addresses": {
        "leaf_1_0_1": {
            "net0": "16:a8:dd:98:2c:54",
            "net1": "ca:70:9b:85:48:82",
            "net2": "2a:4d:59:d1:15:68",
            "net3": "82:97:4c:a4:fc:89",
            "net4": "7a:32:fc:e8:01:81"
        },
        "leaf_1_0_2": {
            "net0": "6e:41:b2:90:bb:d5",
            "net1": "36:95:b9:ec:43:a6",
            "net2": "12:18:1a:17:b5:92",
            "net3": "06:07:1f:ce:d1:ae",
            "net4": "52:90:2b:be:2f:38"
        },
        "leaf_1_0_3": {
            "net0": "8a:c4:d0:d9:1d:4c",
            "net1": "92:2d:98:2f:8a:29",
            "net2": "96:63:c1:10:40:76",
            "net3": "0e:83:68:39:db:d8",
            "net4": "36:b2:05:94:75:11"
        },
        "leaf_1_0_4": {
            "net0": "e6:15:f0:3a:40:cd",
            "net1": "a6:32:42:98:68:c1",
            "net2": "06:cf:e9:0a:4f:a2",
            "net3": "52:c6:71:36:90:34",
            "net4": "76:1a:46:17:42:cf"
        },
        "leaf_2_0_1": {
            "net0": "3a:a9:b9:d2:ed:bb",
            "net1": "b2:08:ce:45:9b:65",
            "net2": "ee:0b:f0:0f:8f:7d",
            "net3": "c6:37:0a:7d:3d:88",
            "net4": "aa:2a:98:e0:6e:ca"
        },
        "leaf_2_0_2": {
            "net0": "b6:0a:5c:62:e7:f9",
            "net1": "42:b5:d5:a7:7e:5e",
            "net2": "e2:e2:ba:24:a8:af",
            "net3": "a2:74:7d:eb:7c:83",
            "net4": "56:e8:7f:09:47:47"
        },
        "leaf_2_0_3": {
            "net0": "ae:24:00:80:bc:25",
            "net1": "c6:08:9b:73:fb:39",
            "net2": "52:d7:fc:23:84:41",
            "net3": "ce:bb:f0:fc:53:c4",
            "net4": "6e:f3:c3:e4:63:e8"
        },
        "leaf_2_0_4": {
            "net0": "ea:ca:9b:83:10:5f",
            "net1": "d2:63:72:96:15:c3",
            "net2": "ae:b2:95:a7:88:bd",
            "net3": "9e:d5:01:69:d6:37",
            "net4": "6a:fc:87:18:fb:12"
        },
        "spine_1_1_1": {
            "net0": "66:ac:54:0b:91:2e",
            "net1": "1e:66:eb:20:49:11",
            "net2": "b6:df:55:ac:9f:ef",
            "net3": "a6:f4:bb:6f:eb:74",
            "net4": "c2:b1:76:01:50:73",
            "net5": "a6:57:0e:2f:00:17",
            "net6": "4e:d8:9c:fc:1c:8d",
            "net7": "ce:60:ba:91:16:b5"
        },
        "spine_1_1_2": {
            "net0": "be:4d:10:fb:dc:51",
            "net1": "ce:f2:50:25:06:7e",
            "net2": "02:95:52:4b:3b:35",
            "net3": "d2:9e:59:9b:f9:4a",
            "net4": "1e:24:ea:d6:ed:5e",
            "net5": "66:b6:13:93:77:4b",
            "net6": "3e:65:8e:e8:3e:8b",
            "net7": "be:b0:65:b3:c4:1e"
        },
        "spine_1_1_3": {
            "net0": "36:5f:b9:64:0c:b5",
            "net1": "c6:4d:a9:3d:e4:aa",
            "net2": "5e:1e:4e:1d:2b:b4",
            "net3": "62:44:9c:68:fb:8c",
            "net4": "76:08:b9:9d:18:7b",
            "net5": "6a:b5:09:39:51:22",
            "net6": "5a:8a:7f:29:0b:0d",
            "net7": "8e:3f:45:09:f8:ee"
        },
        "spine_1_1_4": {
            "net0": "a2:97:25:a4:58:8f",
            "net1": "ca:1d:a2:d6:28:48",
            "net2": "fa:ac:14:c5:5c:c9",
            "net3": "da:cd:4d:67:bc:28",
            "net4": "b2:1f:b5:4b:7d:2d",
            "net5": "c6:61:a9:be:78:7b",
            "net6": "7a:26:07:b2:cc:70",
            "net7": "f6:5e:8b:e3:b8:27"
        },
        "spine_2_1_1": {
            "net0": "7a:66:c1:e5:38:e6",
            "net1": "1e:1b:07:b6:6f:75",
            "net2": "e6:e1:9b:6d:e8:48",
            "net3": "3e:99:9f:7c:35:8a",
            "net4": "a6:12:75:43:95:0f",
            "net5": "7a:24:6a:83:93:61",
            "net6": "62:12:66:22:07:ff",
            "net7": "9e:0c:86:30:6e:eb"
        },
        "spine_2_1_2": {
            "net0": "de:33:c8:92:71:e3",
            "net1": "c2:13:6a:a0:40:ea",
            "net2": "5e:fb:ff:79:41:69",
            "net3": "8e:c0:17:c6:fb:26",
            "net4": "62:b3:14:36:a7:64",
            "net5": "de:2f:be:45:27:1c",
            "net6": "5e:92:ea:c3:04:af",
            "net7": "56:93:ec:86:a0:71"
        },
        "spine_2_1_3": {
            "net0": "ca:4b:78:55:52:85",
            "net1": "9a:64:61:c6:32:e6",
            "net2": "e2:4a:08:96:98:ab",
            "net3": "b2:36:2e:d0:6e:d8",
            "net4": "c2:12:5b:08:5b:c9",
            "net5": "ee:4b:e1:75:ab:c9",
            "net6": "7e:be:e3:4b:16:30",
            "net7": "1e:95:84:f8:12:66"
        },
        "spine_2_1_4": {
            "net0": "96:3f:98:a0:e6:38",
            "net1": "2e:58:c4:dd:50:c9",
            "net2": "ca:0b:d1:4e:e6:f5",
            "net3": "16:33:6a:9c:99:69",
            "net4": "aa:05:e2:d0:1c:b4",
            "net5": "4a:71:64:e8:08:fa",
            "net6": "f6:3f:5d:7d:f3:9b",
            "net7": "42:dd:0c:54:06:8f"
        },
        "tof_1_2_1": {
            "net0": "fe:8d:61:1a:63:60",
            "net1": "3e:24:09:7b:d9:a8",
            "net2": "ee:0d:22:71:a1:c9",
            "net3": "7a:50:ac:ba:99:24",
            "net4": "76:98:55:81:2c:a9",
            "net5": "96:ea:bd:41:8c:cb",
            "net6": "ea:83:50:0f:50:a1",
            "net7": "a2:7c:ff:64:b2:22"
        },
        "tof_1_2_2": {
            "net0": "72:2c:a8:fa:2d:8b",
            "net1": "8e:a2:4e:a3:98:90",
            "net2": "ae:c9:87:d2:00:6a",
            "net3": "22:17:7a:0b:15:53",
            "net4": "e6:2b:5f:7a:51:83",
            "net5": "42:fb:89:d2:ba:47",
            "net6": "4e:44:45:ae:12:8b",
            "net7": "1e:dc:6c:51:22:d3"
        },
        "tof_1_2_3": {
            "net0": "96:6e:ae:b2:ea:0c",
            "net1": "4a:c2:a5:68:3d:b1",
            "net2": "2a:22:4d:3e:de:2f",
            "net3": "b2:60:2f:a3:5e:61",
            "net4": "66:9f:fb:24:fe:ef",
            "net5": "52:7c:6c:11:98:a9",
            "net6": "ba:c1:f2:73:e9:4b",
            "net7": "ce:4c:b1:27:ca:87"
        },
        "tof_1_2_4": {
            "net0": "b6:58:41:72:5d:70",
            "net1": "6a:4d:42:60:b3:a3",
            "net2": "fe:8e:09:b6:31:42",
            "net3": "9a:f8:36:79:32:e3",
            "net4": "9a:3f:93:81:8e:04",
            "net5": "9e:10:4d:75:d8:d4",
            "net6": "be:84:7f:38:ef:43",
            "net7": "8e:0c:f2:30:a0:7a"
        }
    },
    "failed_machine": "leaf_1_0_1",
    "failure_time": {
        "leaf_1_0_1": 1622550786.4517498,
        "leaf_1_0_2": 1622550786.462599,
        "leaf_1_0_3": 1622550786.4697,
        "leaf_1_0_4": 1622550786.453715,
        "leaf_2_0_1": 1622550786.466812,
        "leaf_2_0_2": 1622550786.474995,
        "leaf_2_0_3": 1622550786.4783428,
        "leaf_2_0_4": 1622550786.4865217,
        "spine_1_1_1": 1622550786.498468,
        "spine_1_1_2": 1622550786.4811442,
        "spine_1_1_3": 1622550786.4882782,
        "spine_1_1_4": 1622550786.4979367,
        "spine_2_1_1": 1622550786.5073073,
        "spine_2_1_2": 1622550786.514902,
        "spine_2_1_3": 1622550786.5230517,
        "spine_2_1_4": 1622550786.5128334,
        "tof_1_2_1": 1622550786.5177073,
        "tof_1_2_2": 1622550786.5268881,
        "tof_1_2_3": 1622550786.5314262,
        "tof_1_2_4": 1622550786.5386217
    }
}