{
    "description": "Scenario 6b: net12 link failure and recovery of spine_1_1_1 with BGP",
    "k_leaf": 12,
    "k_top": 12,
    "redundancy_factor": 12,
    "is_k8s": true,
    "machine_mac_addresses": {
        "leaf_1_0_1": {
            "net0": "2a:ab:19:43:6e:97",
            "net1": "86:ab:3d:28:ed:74",
            "net10": "9a:bb:bc:89:ca:3c",
            "net11": "fa:68:cc:71:15:19",
            "net12": "d6:f8:66:e2:6e:0a",
            "net2": "b2:52:18:dc:09:ed",
            "net3": "ce:c3:c5:96:3d:5c",
            "net4": "06:24:1a:45:5f:99",
            "net5": "c2:a1:ad:24:38:87",
            "net6": "c2:74:77:65:4f:d5",
            "net7": "7a:6a:74:06:92:65",
            "net8": "e6:38:d0:26:61:c1",
            "net9": "56:4e:37:62:1a:6b"
        },
        "leaf_1_0_10": {
            "net0": "0e:a2:98:17:4f:8d",
            "net1": "12:2b:51:cd:8a:2c",
            "net10": "7e:07:8b:a4:17:d9",
            "net11": "1e:ed:7f:ba:9a:89",
            "net12": "ea:d4:be:7b:65:91",
            "net2": "22:cc:c5:6b:59:dd",
            "net3": "32:bc:98:cb:65:76",
            "net4": "3e:1f:24:42:93:be",
            "net5": "d6:fb:ec:57:5e:d7",
            "net6": "d6:be:a8:ab:70:72",
            "net7": "3e:5f:65:a3:4f:23",
            "net8": "d2:93:3e:26:c7:77",
            "net9": "62:fe:4f:6e:4a:f3"
        },
        "leaf_1_0_11": {
            "net0": "d2:68:e6:0e:bf:bd",
            "net1": "ca:ee:be:db:24:42",
            "net10": "8a:57:04:98:a7:09",
            "net11": "86:71:5c:c6:f3:67",
            "net12": "a2:71:ef:8f:e3:90",
            "net2": "76:27:e0:9c:ed:ca",
            "net3": "4a:49:01:bf:94:d1",
            "net4": "26:4f:f3:6f:b6:58",
            "net5": "4a:d6:de:97:48:66",
            "net6": "7e:7e:07:7d:bf:89",
            "net7": "1a:8b:c6:0c:33:7e",
            "net8": "7a:09:66:3b:7e:b9",
            "net9": "e2:59:cf:12:a0:cf"
        },
        "leaf_1_0_12": {
            "net0": "06:5c:11:ec:37:6a",
            "net1": "2a:d6:d3:33:15:b6",
            "net10": "1a:d4:55:9f:e4:8d",
            "net11": "0a:fd:64:95:f3:d0",
            "net12": "6e:ff:ab:4a:3e:22",
            "net2": "2e:72:d4:23:38:7f",
            "net3": "1e:84:ab:b7:53:a5",
            "net4": "86:16:4b:1d:e4:7a",
            "net5": "e2:36:e5:e4:13:2e",
            "net6": "9e:57:36:f8:a1:1a",
            "net7": "2a:c4:dc:0f:7a:6f",
            "net8": "96:fc:e0:23:d4:ca",
            "net9": "b2:f4:c0:b3:ba:8f"
        },
        "leaf_1_0_2": {
            "net0": "72:ca:1d:58:41:82",
            "net1": "9e:d3:2d:e4:eb:a6",
            "net10": "22:2d:c1:a6:9a:41",
            "net11": "82:02:57:4b:c1:41",
            "net12": "3e:3c:62:09:04:76",
            "net2": "32:26:95:23:71:c9",
            "net3": "66:65:fa:32:d7:76",
            "net4": "5a:35:37:b5:d3:c3",
            "net5": "72:1d:d3:98:ce:48",
            "net6": "66:e5:ed:79:39:ff",
            "net7": "82:64:e6:2f:fc:d8",
            "net8": "9a:2d:9a:6d:23:18",
            "net9": "5a:cc:3d:55:bb:92"
        },
        "leaf_1_0_3": {
            "net0": "3e:89:b7:b7:1b:ec",
            "net1": "06:d2:ef:01:7d:46",
            "net10": "52:f9:ec:1f:e5:14",
            "net11": "1a:8a:ac:7d:e0:ad",
            "net12": "5a:ab:d6:59:c3:98",
            "net2": "26:f8:ba:9b:f6:82",
            "net3": "ea:21:93:45:1b:39",
            "net4": "5e:c9:79:59:df:cc",
            "net5": "92:1a:59:de:5c:2d",
            "net6": "36:84:21:8e:67:e6",
            "net7": "ba:fa:14:3e:8e:bd",
            "net8": "1e:62:96:70:d6:03",
            "net9": "c2:56:77:26:03:3d"
        },
        "leaf_1_0_4": {
            "net0": "e6:80:04:40:15:7c",
            "net1": "56:c1:d8:dd:38:54",
            "net10": "2a:c3:92:97:36:06",
            "net11": "7e:06:46:1b:5e:50",
            "net12": "76:ef:c4:50:69:5e",
            "net2": "ba:0b:fc:50:47:37",
            "net3": "f6:4b:58:8b:74:18",
            "net4": "96:fc:a0:58:7a:b8",
            "net5": "96:c1:b0:b8:6c:b4",
            "net6": "9a:a6:6a:b2:12:c3",
            "net7": "56:dc:43:45:12:73",
            "net8": "ca:c8:01:d6:3b:4c",
            "net9": "a6:17:91:24:ee:ae"
        },
        "leaf_1_0_5": {
            "net0": "16:a8:ce:f2:39:7e",
            "net1": "16:ac:8b:a8:d0:8a",
            "net10": "26:6f:20:1a:28:2b",
            "net11": "aa:ab:f2:51:53:d1",
            "net12": "3e:d4:27:43:64:d9",
            "net2": "86:ba:59:11:1d:6e",
            "net3": "ee:e6:7f:54:73:36",
            "net4": "26:ad:f1:75:c4:ce",
            "net5": "7a:1a:2c:88:23:99",
            "net6": "5e:d1:49:1b:43:ca",
            "net7": "be:be:aa:6d:2d:27",
            "net8": "ce:e0:e0:be:c4:01",
            "net9": "c6:39:e6:b3:70:da"
        },
        "leaf_1_0_6": {
            "net0": "5a:d5:ff:2a:f9:75",
            "net1": "7a:ef:c6:5f:f1:91",
            "net10": "22:de:91:c9:c2:e0",
            "net11": "e2:f0:28:b2:3e:f9",
            "net12": "aa:c5:c1:f1:0e:e3",
            "net2": "06:a7:2c:56:43:6f",
            "net3": "6e:2b:67:72:f3:2d",
            "net4": "e6:cf:9d:1d:ad:c1",
            "net5": "ba:3a:6d:5d:a4:bd",
            "net6": "52:ed:2d:d7:de:ff",
            "net7": "5e:64:dc:0b:a3:c5",
            "net8": "3e:3c:28:b7:76:69",
            "net9": "aa:67:7c:b2:b7:cf"
        },
        "leaf_1_0_7": {
            "net0": "42:e1:fa:27:c8:2a",
            "net1": "ca:b0:3b:8b:fe:fd",
            "net10": "66:d6:dd:39:ab:64",
            "net11": "4e:18:ce:80:01:12",
            "net12": "b6:fc:5e:a4:d1:89",
            "net2": "ce:2a:df:aa:9a:49",
            "net3": "62:d3:11:2a:31:18",
            "net4": "9a:c3:4c:46:46:87",
            "net5": "4a:61:33:53:67:b1",
            "net6": "32:03:94:f4:70:58",
            "net7": "7e:57:22:15:3c:54",
            "net8": "0e:07:57:ea:c5:bf",
            "net9": "ea:68:4b:d6:59:b7"
        },
        "leaf_1_0_8": {
            "net0": "ba:39:2a:77:56:8b",
            "net1": "2a:b1:5d:e4:f3:8f",
            "net10": "06:41:15:b1:65:1f",
            "net11": "7a:a1:6a:f6:9b:b9",
            "net12": "9e:31:b8:d1:07:80",
            "net2": "da:5f:70:7b:2c:33",
            "net3": "9a:81:d5:e5:a4:ba",
            "net4": "5e:40:30:51:49:f2",
            "net5": "fe:75:0a:60:11:df",
            "net6": "c2:12:7e:15:12:9e",
            "net7": "9a:29:8c:5c:b3:19",
            "net8": "6a:63:ed:7a:18:7c",
            "net9": "16:a5:94:32:17:92"
        },
        "leaf_1_0_9": {
            "net0": "8e:b8:32:76:66:f6",
            "net1": "02:5b:0e:dd:87:13",
            "net10": "6a:b2:0b:76:8a:12",
            "net11": "4e:27:20:44:9f:50",
            "net12": "16:23:90:77:6a:64",
            "net2": "82:6f:4b:11:83:7b",
            "net3": "96:f1:50:71:f6:fd",
            "net4": "2a:8c:98:1b:b9:10",
            "net5": "1e:69:6e:bd:97:8e",
            "net6": "2e:5d:89:a3:d8:df",
            "net7": "22:85:41:55:e5:57",
            "net8": "56:11:81:7c:b7:d8",
            "net9": "46:c9:94:2b:71:cb"
        },
        "leaf_2_0_1": {
            "net0": "56:e2:4c:ff:5b:d2",
            "net1": "6e:c8:a1:e8:70:94",
            "net10": "62:64:c4:b8:65:f5",
            "net11": "a2:77:6e:fe:0d:c7",
            "net12": "ea:c9:ba:82:c5:29",
            "net2": "f6:fd:87:22:d5:ec",
            "net3": "56:16:7b:4a:a1:08",
            "net4": "96:86:64:ee:a8:76",
            "net5": "e2:ff:e0:c3:3d:c2",
            "net6": "d6:35:73:80:7e:88",
            "net7": "ea:c2:50:01:82:3b",
            "net8": "22:02:31:04:dc:cd",
            "net9": "9a:f6:ff:64:5c:ca"
        },
        "leaf_2_0_10": {
            "net0": "c6:f5:65:be:5b:d1",
            "net1": "6a:d5:77:33:a3:82",
            "net10": "3e:17:ec:66:73:33",
            "net11": "1e:6f:62:63:39:26",
            "net12": "96:68:ca:46:40:b3",
            "net2": "de:4c:b3:f5:b2:48",
            "net3": "86:5b:68:5f:3f:af",
            "net4": "96:4a:f6:39:a7:87",
            "net5": "82:2c:aa:bf:96:50",
            "net6": "0e:32:9b:77:b8:bf",
            "net7": "ee:df:de:49:5a:16",
            "net8": "b2:8b:77:06:5a:4c",
            "net9": "ea:64:c7:16:06:45"
        },
        "leaf_2_0_11": {
            "net0": "56:6e:7c:04:c3:20",
            "net1": "8e:aa:9f:4b:81:68",
            "net10": "0a:91:7f:ec:fe:3c",
            "net11": "3e:bd:f4:0e:d5:86",
            "net12": "0a:8e:61:d9:84:00",
            "net2": "2e:a2:4e:a8:d0:da",
            "net3": "a2:d4:5d:da:42:68",
            "net4": "02:87:36:5f:fd:35",
            "net5": "d6:77:1e:2d:dc:0e",
            "net6": "da:95:48:2f:3f:64",
            "net7": "12:e9:dc:77:11:15",
            "net8": "62:a2:de:5b:46:c6",
            "net9": "22:ec:a5:b2:6a:61"
        },
        "leaf_2_0_12": {
            "net0": "56:f8:64:de:ee:40",
            "net1": "da:84:19:52:48:4f",
            "net10": "a6:f0:49:a8:39:4e",
            "net11": "d2:37:8a:1c:54:fc",
            "net12": "22:63:20:92:0c:d1",
            "net2": "8a:ac:b6:89:77:b9",
            "net3": "0a:22:f5:ac:23:a0",
            "net4": "6a:09:b7:9f:6a:c4",
            "net5": "fe:3b:5b:23:b6:d8",
            "net6": "4a:55:aa:fa:89:4e",
            "net7": "46:8d:4b:50:64:c7",
            "net8": "ba:b8:68:e9:0c:fc",
            "net9": "f6:be:0a:8d:bc:e6"
        },
        "leaf_2_0_2": {
            "net0": "56:2c:60:6f:ba:ae",
            "net1": "ca:5a:e4:a1:0c:95",
            "net10": "ce:1f:c1:a5:b4:01",
            "net11": "82:08:aa:a8:a3:9a",
            "net12": "be:a2:01:f7:68:32",
            "net2": "4a:97:f3:19:84:ba",
            "net3": "a2:6b:5b:ee:55:ee",
            "net4": "fe:19:10:8d:d1:f8",
            "net5": "3e:31:5d:ad:b4:3b",
            "net6": "86:1e:01:cd:f8:ee",
            "net7": "fa:a8:58:c1:46:e1",
            "net8": "42:6d:bb:00:3b:79",
            "net9": "8a:7d:79:ed:42:de"
        },
        "leaf_2_0_3": {
            "net0": "0a:6b:c3:d6:7c:5e",
            "net1": "4e:83:c1:f0:75:2a",
            "net10": "4a:d8:0b:53:5a:e8",
            "net11": "72:3c:a0:14:63:88",
            "net12": "4a:2e:43:0c:6c:42",
            "net2": "6e:3c:19:4a:92:0f",
            "net3": "06:a2:d0:75:ed:a6",
            "net4": "d6:e0:bc:12:35:60",
            "net5": "02:e7:e9:71:b7:14",
            "net6": "42:fe:9e:17:31:6b",
            "net7": "96:8f:ac:b3:f8:69",
            "net8": "12:f3:cb:47:5c:53",
            "net9": "aa:fc:ee:65:7d:f7"
        },
        "leaf_2_0_4": {
            "net0": "66:7b:57:de:f6:6b",
            "net1": "1e:48:5d:a1:1a:18",
            "net10": "ba:f0:b0:6f:58:c4",
            "net11": "2e:ad:34:9a:73:60",
            "net12": "96:1e:bc:10:38:c5",
            "net2": "26:6e:0f:60:78:3e",
            "net3": "c2:76:c3:9d:46:a3",
            "net4": "02:25:10:a1:ab:5c",
            "net5": "5e:9f:14:96:07:e6",
            "net6": "0a:80:94:3c:af:75",
            "net7": "fa:e4:c3:cc:40:8d",
            "net8": "be:0f:32:28:1c:2d",
            "net9": "a6:73:b8:7d:81:9f"
        },
        "leaf_2_0_5": {
            "net0": "ce:46:a6:80:b7:52",
            "net1": "32:d4:4d:3b:1d:5e",
            "net10": "4e:3a:cb:14:4b:68",
            "net11": "4e:b9:87:29:5c:18",
            "net12": "22:8c:b9:a6:c4:d5",
            "net2": "16:ed:02:af:2f:64",
            "net3": "2a:51:4c:cd:ab:91",
            "net4": "7a:38:3e:83:0e:10",
            "net5": "86:72:ef:2d:01:14",
            "net6": "6a:42:39:1d:db:63",
            "net7": "2a:e2:8a:fd:a2:5b",
            "net8": "da:ad:5c:0d:2d:bd",
            "net9": "3a:2c:5c:a8:bf:83"
        },
        "leaf_2_0_6": {
            "net0": "72:59:6d:b1:e9:8c",
            "net1": "2e:2d:80:f6:cc:e6",
            "net10": "22:e2:76:59:29:3c",
            "net11": "1e:8e:06:35:f7:02",
            "net12": "96:a6:95:49:79:1a",
            "net2": "62:c0:98:5d:b9:5b",
            "net3": "7a:1f:a1:10:f9:df",
            "net4": "32:6a:69:05:a2:c3",
            "net5": "4e:52:bf:b3:1b:f6",
            "net6": "de:ba:a3:c2:d6:12",
            "net7": "fe:b6:85:7e:eb:8f",
            "net8": "ea:09:21:66:e9:08",
            "net9": "b2:02:bc:50:15:33"
        },
        "leaf_2_0_7": {
            "net0": "4a:16:69:5e:75:1a",
            "net1": "0e:cd:19:3e:77:82",
            "net10": "ba:c7:4f:6e:f0:b4",
            "net11": "e2:1b:78:dd:fd:8f",
            "net12": "62:83:f6:28:da:0d",
            "net2": "d2:9a:b9:ec:62:d8",
            "net3": "8e:9d:f1:9d:65:6b",
            "net4": "5e:92:9c:2a:49:4e",
            "net5": "ba:d3:3e:4d:9e:99",
            "net6": "0a:85:48:37:de:14",
            "net7": "6e:64:81:31:76:e0",
            "net8": "5a:65:94:bf:0e:8c",
            "net9": "0a:0a:69:2b:f2:5c"
        },
        "leaf_2_0_8": {
            "net0": "16:db:5a:13:3a:43",
            "net1": "16:d8:1c:0e:db:5e",
            "net10": "76:22:06:35:14:14",
            "net11": "b2:71:4c:77:e2:3c",
            "net12": "1e:21:13:d4:ac:39",
            "net2": "d6:92:0a:9e:f7:96",
            "net3": "a2:57:60:a1:5b:89",
            "net4": "4e:65:05:5d:e8:fe",
            "net5": "06:c7:95:3b:05:bd",
            "net6": "52:b1:e4:61:50:8d",
            "net7": "fe:e1:03:14:93:ee",
            "net8": "f6:07:57:ee:73:50",
            "net9": "e2:65:82:51:a7:a4"
        },
        "leaf_2_0_9": {
            "net0": "2a:c4:69:8c:67:f0",
            "net1": "a6:c5:9f:e2:6d:f8",
            "net10": "1a:f2:12:33:cd:e5",
            "net11": "f2:ef:06:6a:af:66",
            "net12": "8e:ab:2a:8d:cc:c4",
            "net2": "e2:b6:54:f6:dd:53",
            "net3": "a2:7e:84:38:9c:22",
            "net4": "8e:d0:df:c2:b0:a3",
            "net5": "32:be:9d:39:5e:8a",
            "net6": "5a:00:49:4d:83:46",
            "net7": "8a:00:83:84:b2:0e",
            "net8": "46:84:fe:8e:49:97",
            "net9": "12:6a:ba:46:58:2e"
        },
        "spine_1_1_1": {
            "net0": "3a:ec:63:e7:4a:b2",
            "net1": "4a:1c:1f:7c:2a:ab",
            "net10": "fe:7c:78:9c:6d:ac",
            "net11": "fe:bb:4e:34:80:98",
            "net12": "8e:2b:0f:c7:ba:29",
            "net13": "d2:c7:7d:3b:fb:8b",
            "net14": "ea:91:71:03:ed:fa",
            "net15": "b2:ec:b2:e6:54:ad",
            "net16": "ee:e2:7b:c2:ea:fd",
            "net17": "8a:e8:ce:30:f5:2d",
            "net18": "06:b3:95:41:48:f2",
            "net19": "d6:e3:7d:aa:55:e1",
            "net2": "c2:d0:da:8a:f4:29",
            "net20": "d6:58:cc:0f:5a:bf",
            "net21": "56:50:24:ff:16:90",
            "net22": "3a:b2:94:d3:6c:fe",
            "net23": "9e:2e:21:e2:f0:7e",
            "net3": "82:6e:04:bc:e2:f1",
            "net4": "c2:63:fd:67:07:7e",
            "net5": "72:36:8b:d1:93:e7",
            "net6": "5e:d7:48:57:e7:71",
            "net7": "c2:63:71:30:5f:89",
            "net8": "7a:f0:09:7e:5e:78",
            "net9": "0e:0f:08:42:55:03"
        },
        "spine_1_1_10": {
            "net0": "42:e9:41:23:66:32",
            "net1": "ce:da:f3:48:ab:0d",
            "net10": "d2:5e:67:d5:79:f3",
            "net11": "86:b8:51:c4:85:dc",
            "net12": "da:f2:20:a8:fd:2a",
            "net13": "9e:c4:c1:12:a9:03",
            "net14": "d2:49:43:29:1d:9c",
            "net15": "b6:6f:74:40:f1:20",
            "net16": "c2:f6:bc:61:f8:0f",
            "net17": "7a:7b:22:87:89:54",
            "net18": "82:30:81:e7:9e:75",
            "net19": "82:6f:7e:f4:fd:ad",
            "net2": "12:ea:c0:30:e4:da",
            "net20": "6e:83:be:bb:fb:2d",
            "net21": "5e:55:e3:3c:93:d8",
            "net22": "be:5a:77:1d:0a:fb",
            "net23": "2e:54:09:37:2e:7c",
            "net3": "2a:4c:61:0b:f7:c7",
            "net4": "e2:e4:bb:9d:9f:6d",
            "net5": "5e:92:21:34:93:0b",
            "net6": "2e:56:83:37:13:63",
            "net7": "c2:45:bc:16:37:f4",
            "net8": "fa:a2:c5:0a:fe:f4",
            "net9": "22:d1:6b:e1:e1:6e"
        },
        "spine_1_1_11": {
            "net0": "7a:ee:ce:27:7d:e0",
            "net1": "9e:37:18:a7:7d:9b",
            "net10": "2a:a5:b7:af:1d:0a",
            "net11": "46:14:6d:74:16:67",
            "net12": "ea:32:31:ad:b1:fe",
            "net13": "d2:4c:f3:35:66:e0",
            "net14": "1a:16:fa:44:ce:b0",
            "net15": "aa:0e:c1:5f:56:21",
            "net16": "86:40:aa:04:69:6c",
            "net17": "0e:7f:a9:ae:00:f0",
            "net18": "ca:9d:11:83:55:d7",
            "net19": "c2:43:49:8a:68:9d",
            "net2": "0e:31:ff:8d:b2:e2",
            "net20": "0e:f8:0f:e5:f9:b7",
            "net21": "ce:1e:d0:05:8d:64",
            "net22": "1e:5e:3d:24:c0:87",
            "net23": "6e:24:66:5b:2a:4b",
            "net3": "42:64:8e:08:ac:f7",
            "net4": "d2:6f:4e:4f:ee:f4",
            "net5": "d2:ee:37:c0:c8:f1",
            "net6": "42:c8:be:83:42:8a",
            "net7": "02:e4:d2:46:c4:77",
            "net8": "be:c7:0d:03:a0:f9",
            "net9": "06:ba:19:bc:aa:0a"
        },
        "spine_1_1_12": {
            "net0": "c6:0c:11:f2:40:20",
            "net1": "d2:7a:06:1b:db:4c",
            "net10": "76:53:6a:51:e0:b5",
            "net11": "e6:70:7f:98:d9:08",
            "net12": "1e:7b:a1:88:f0:ab",
            "net13": "86:ed:b9:e2:f4:4b",
            "net14": "fe:d3:53:00:41:ee",
            "net15": "e2:ea:e5:a5:ea:85",
            "net16": "96:63:6d:7a:20:b7",
            "net17": "6a:b0:71:fc:5e:3d",
            "net18": "12:6f:af:2d:84:17",
            "net19": "42:bd:6e:8d:8d:4a",
            "net2": "66:c2:bd:1f:06:31",
            "net20": "12:42:73:cd:05:31",
            "net21": "aa:54:60:8e:0e:be",
            "net22": "ae:12:ba:91:9f:e3",
            "net23": "fa:ca:10:5d:85:7c",
            "net3": "fa:cf:9c:60:be:7b",
            "net4": "a2:0e:dc:fc:eb:ce",
            "net5": "c6:5a:7a:a3:5d:7e",
            "net6": "d2:6f:41:89:01:f5",
            "net7": "82:95:e9:67:af:88",
            "net8": "7a:c7:a5:c4:a9:bc",
            "net9": "be:e8:18:d8:2f:d9"
        },
        "spine_1_1_2": {
            "net0": "4a:cc:2c:23:13:e6",
            "net1": "ba:8b:e1:b3:4a:30",
            "net10": "4a:d8:19:76:31:f7",
            "net11": "f2:31:23:dc:70:85",
            "net12": "52:4c:d1:49:6e:38",
            "net13": "8e:ca:03:90:93:40",
            "net14": "96:3f:ca:1d:b2:fc",
            "net15": "46:2f:c1:40:1c:d7",
            "net16": "62:35:06:46:1a:98",
            "net17": "56:32:7b:6d:71:64",
            "net18": "62:1c:ed:c1:87:a2",
            "net19": "aa:30:3b:d9:de:ae",
            "net2": "5e:cb:c2:0e:3d:86",
            "net20": "d6:6f:dd:11:94:95",
            "net21": "7e:e8:01:d6:ce:b7",
            "net22": "fa:37:25:b3:fe:1c",
            "net23": "9a:0f:b7:02:db:bc",
            "net3": "8e:7f:c3:af:e6:b8",
            "net4": "a6:6c:9b:f9:e9:fd",
            "net5": "86:da:a2:aa:88:26",
            "net6": "0a:b7:71:8b:f3:41",
            "net7": "22:12:8f:d8:4c:51",
            "net8": "16:ac:be:f2:23:31",
            "net9": "02:40:74:23:fd:4a"
        },
        "spine_1_1_3": {
            "net0": "c6:e1:48:ab:92:c0",
            "net1": "52:5a:b7:73:3f:87",
            "net10": "12:73:b1:df:a7:4a",
            "net11": "2a:16:b6:3a:78:13",
            "net12": "c6:aa:b1:85:0c:9d",
            "net13": "3a:dc:f7:46:e3:68",
            "net14": "96:09:4e:cc:a7:f1",
            "net15": "da:a3:82:62:a6:e2",
            "net16": "5e:35:00:57:ca:f5",
            "net17": "da:11:3a:48:e6:e9",
            "net18": "86:e7:de:c5:88:0f",
            "net19": "8a:b3:d5:4b:e8:2e",
            "net2": "2e:52:4d:5f:94:ec",
            "net20": "fa:ab:16:d9:7b:a5",
            "net21": "de:22:87:a9:94:e5",
            "net22": "36:1b:39:a3:8e:a5",
            "net23": "0e:93:4a:43:b3:68",
            "net3": "56:b3:aa:c7:0f:ad",
            "net4": "4e:2a:48:7f:32:b2",
            "net5": "46:70:94:92:5b:60",
            "net6": "b6:af:d4:20:fc:ce",
            "net7": "0a:08:65:24:64:22",
            "net8": "82:6b:f3:a6:05:1a",
            "net9": "72:17:cb:6c:6a:d6"
        },
        "spine_1_1_4": {
            "net0": "66:0e:d1:ac:71:4e",
            "net1": "32:d3:39:c0:65:36",
            "net10": "7e:ca:10:52:32:2f",
            "net11": "de:47:66:e8:c1:42",
            "net12": "fe:b3:18:1f:52:84",
            "net13": "fe:f7:58:2d:65:5b",
            "net14": "66:4e:3c:12:94:df",
            "net15": "02:83:a7:ab:b4:aa",
            "net16": "ba:6e:82:23:65:06",
            "net17": "b2:8f:0c:28:b1:4c",
            "net18": "36:ba:15:a1:50:b2",
            "net19": "da:ad:dc:42:3c:2a",
            "net2": "d2:af:e3:b1:7a:02",
            "net20": "ca:00:46:3d:e7:da",
            "net21": "76:2f:13:52:97:cd",
            "net22": "3a:c7:d7:d8:f4:4c",
            "net23": "f6:6b:66:c1:03:eb",
            "net3": "ee:35:3a:b2:7a:a2",
            "net4": "a6:d9:d5:81:53:75",
            "net5": "ba:17:67:57:94:0f",
            "net6": "be:4a:1f:54:e5:54",
            "net7": "e2:89:11:e6:61:ee",
            "net8": "ae:b1:f7:1c:51:0f",
            "net9": "fe:8a:6b:86:8d:4c"
        },
        "spine_1_1_5": {
            "net0": "6e:11:d3:80:6b:8f",
            "net1": "4e:83:b1:63:08:c5",
            "net10": "52:78:38:a7:09:d9",
            "net11": "6e:d7:9e:92:49:48",
            "net12": "06:69:5f:24:b4:45",
            "net13": "3a:3b:6b:8a:47:11",
            "net14": "e6:fa:62:81:db:1a",
            "net15": "46:76:59:d6:8f:78",
            "net16": "fa:17:6d:63:92:d4",
            "net17": "9a:bc:e2:05:24:85",
            "net18": "6a:78:d8:ae:c6:43",
            "net19": "6a:40:8c:7c:50:56",
            "net2": "da:0e:31:f7:d3:d4",
            "net20": "2a:f5:c7:27:b0:b2",
            "net21": "1a:91:6c:a1:0a:2d",
            "net22": "5a:64:e6:3a:0c:ae",
            "net23": "06:06:20:f1:4f:e9",
            "net3": "e6:b0:bc:0f:ba:4f",
            "net4": "76:af:be:e2:d0:15",
            "net5": "ca:30:62:c6:7a:28",
            "net6": "4e:f4:22:f7:c8:1b",
            "net7": "5a:0d:87:62:bc:a2",
            "net8": "06:4b:5d:94:4d:b6",
            "net9": "1e:5a:23:af:d1:cf"
        },
        "spine_1_1_6": {
            "net0": "f6:6b:5c:6c:7d:a9",
            "net1": "de:e7:6e:21:69:36",
            "net10": "8e:ef:68:88:b4:0f",
            "net11": "b6:4e:2b:cc:ec:1a",
            "net12": "d6:e1:1d:3a:8e:52",
            "net13": "c2:30:ff:15:95:7d",
            "net14": "3e:a1:97:21:87:b0",
            "net15": "2a:a4:1e:66:f1:6b",
            "net16": "ae:b6:6b:e1:a0:70",
            "net17": "06:d7:eb:56:8d:86",
            "net18": "5e:8d:31:02:72:93",
            "net19": "aa:ac:30:1a:70:40",
            "net2": "7e:4a:af:25:c1:91",
            "net20": "86:0e:3d:53:cc:c6",
            "net21": "a2:56:a0:dc:87:31",
            "net22": "92:41:aa:bc:4c:b2",
            "net23": "32:14:20:e2:0c:d9",
            "net3": "c2:67:01:95:a3:f2",
            "net4": "de:ee:93:63:78:8f",
            "net5": "aa:c9:c1:50:cd:5f",
            "net6": "82:43:6f:72:91:de",
            "net7": "02:4b:8e:00:a4:8f",
            "net8": "a6:6b:77:d7:dd:88",
            "net9": "1a:f8:95:cc:5b:23"
        },
        "spine_1_1_7": {
            "net0": "7a:49:7f:ac:94:80",
            "net1": "52:59:e7:cf:3b:f1",
            "net10": "d2:32:3e:b1:93:cc",
            "net11": "b6:eb:25:78:27:57",
            "net12": "be:09:59:7c:69:ae",
            "net13": "8a:20:9b:1f:93:f3",
            "net14": "a6:e1:75:b9:80:be",
            "net15": "96:5d:cd:0a:bd:f4",
            "net16": "d2:bd:a6:bb:09:f4",
            "net17": "ba:a4:1d:cc:22:33",
            "net18": "16:62:1c:8f:41:ea",
            "net19": "56:1d:65:bf:f1:82",
            "net2": "da:06:80:b6:22:8b",
            "net20": "be:85:e5:73:3b:46",
            "net21": "be:3c:bb:d6:e1:46",
            "net22": "fe:5b:81:62:4f:d8",
            "net23": "6e:4c:be:c3:6a:73",
            "net3": "4a:cd:5a:ea:e2:6e",
            "net4": "ae:78:02:9d:39:82",
            "net5": "9a:89:0b:c5:96:9b",
            "net6": "f6:96:81:99:21:39",
            "net7": "fa:aa:2c:d2:5c:6a",
            "net8": "d2:db:e6:09:8c:fa",
            "net9": "ce:3c:52:46:61:cc"
        },
        "spine_1_1_8": {
            "net0": "e2:85:68:48:c3:c9",
            "net1": "ce:0d:a3:20:cc:21",
            "net10": "8e:c1:50:8d:64:08",
            "net11": "aa:b8:81:2d:9c:b3",
            "net12": "4e:83:ac:87:83:3e",
            "net13": "9a:ce:07:5c:7e:d1",
            "net14": "76:8b:29:25:dd:f4",
            "net15": "6e:d4:0a:59:be:bc",
            "net16": "2e:48:45:e6:0a:aa",
            "net17": "06:10:8f:6f:f7:4f",
            "net18": "7a:52:bd:86:89:16",
            "net19": "a2:72:6e:50:2e:dd",
            "net2": "1e:67:b9:04:ef:14",
            "net20": "22:b5:73:84:fb:1c",
            "net21": "8a:67:cc:a9:40:f3",
            "net22": "d2:0c:1f:d1:57:89",
            "net23": "02:24:94:1c:1f:c7",
            "net3": "a2:13:da:16:f0:be",
            "net4": "82:43:c2:5c:70:9b",
            "net5": "1e:a2:b6:2c:22:7e",
            "net6": "a6:6d:8a:9e:dd:35",
            "net7": "06:bb:ce:d6:b0:78",
            "net8": "4e:84:0c:5a:46:29",
            "net9": "7e:7e:a7:73:4c:df"
        },
        "spine_1_1_9": {
            "net0": "0e:22:8b:64:90:dd",
            "net1": "2a:04:4b:27:d4:5f",
            "net10": "82:d1:0c:cd:04:62",
            "net11": "a2:da:de:bf:40:24",
            "net12": "62:49:49:42:88:0c",
            "net13": "fa:7a:d5:0a:cc:5f",
            "net14": "66:9f:db:8f:e3:a1",
            "net15": "f6:f9:b2:73:43:53",
            "net16": "5e:17:d0:a2:cc:56",
            "net17": "76:6f:55:62:42:33",
            "net18": "42:25:78:0f:c8:84",
            "net19": "72:ab:57:e1:11:e9",
            "net2": "06:8c:e6:0c:72:50",
            "net20": "2a:5e:b5:65:05:3f",
            "net21": "9e:56:69:c4:2c:b1",
            "net22": "22:e6:a3:2a:bd:cd",
            "net23": "16:cb:43:d9:60:36",
            "net3": "be:4f:10:b5:a7:7e",
            "net4": "a2:18:2d:83:e6:ea",
            "net5": "7a:56:39:87:c4:1c",
            "net6": "ca:9e:a3:5b:47:d1",
            "net7": "be:38:dc:aa:cc:7a",
            "net8": "c6:34:58:c9:e2:54",
            "net9": "ea:21:7c:f1:d2:83"
        },
        "spine_2_1_1": {
            "net0": "d2:ca:63:2a:ec:0c",
            "net1": "ca:b0:44:10:bc:b6",
            "net10": "ea:d4:a9:4c:2b:3e",
            "net11": "5e:09:ae:c5:97:19",
            "net12": "86:37:39:8e:14:5c",
            "net13": "3e:9d:e3:6f:a5:72",
            "net14": "5e:08:91:18:f6:77",
            "net15": "3a:d8:b2:84:ba:87",
            "net16": "d6:7a:3c:59:fc:9f",
            "net17": "8a:31:0d:5d:7f:60",
            "net18": "42:a3:3d:6d:be:9b",
            "net19": "6e:95:94:90:9b:ab",
            "net2": "c6:c7:c0:d0:6b:14",
            "net20": "52:7b:90:f8:71:82",
            "net21": "96:1c:79:e2:9f:c6",
            "net22": "e6:94:36:8d:cb:de",
            "net23": "da:9f:0e:e1:e0:9e",
            "net3": "ae:f0:0b:2a:00:78",
            "net4": "12:79:f5:6c:80:9f",
            "net5": "d2:5c:23:a7:13:71",
            "net6": "de:3c:08:f2:2b:90",
            "net7": "6e:42:a8:42:f6:91",
            "net8": "4a:1e:47:3c:80:e9",
            "net9": "7a:ea:6e:d6:be:0d"
        },
        "spine_2_1_10": {
            "net0": "c6:99:16:c5:7b:ab",
            "net1": "fa:89:1f:45:81:ed",
            "net10": "46:4a:34:9c:32:77",
            "net11": "c2:d5:8d:8c:f8:49",
            "net12": "aa:1f:1e:5c:d9:66",
            "net13": "0e:93:ec:05:c2:bb",
            "net14": "1e:a8:86:eb:6f:6d",
            "net15": "12:7d:88:8a:cf:9a",
            "net16": "1e:8d:70:c5:ed:fa",
            "net17": "be:68:20:a7:56:d8",
            "net18": "a2:8f:84:d3:0b:78",
            "net19": "66:ea:df:1d:72:f3",
            "net2": "2a:f0:d9:66:46:ff",
            "net20": "d6:1e:6a:83:b7:b9",
            "net21": "3a:ad:c6:ca:67:1b",
            "net22": "aa:c2:42:2c:45:fb",
            "net23": "42:cf:e6:7d:90:63",
            "net3": "6e:3d:79:27:7b:88",
            "net4": "06:c1:29:de:96:f5",
            "net5": "d2:58:bc:2d:04:fd",
            "net6": "42:16:31:ff:96:66",
            "net7": "fa:8b:8c:30:90:7d",
            "net8": "66:89:82:77:24:4f",
            "net9": "b2:05:f8:2f:98:08"
        },
        "spine_2_1_11": {
            "net0": "36:3b:77:4f:2c:74",
            "net1": "4a:56:8c:96:7e:78",
            "net10": "22:3d:06:6c:97:53",
            "net11": "be:a4:d0:4b:ab:e2",
            "net12": "06:ba:f7:18:5e:53",
            "net13": "ae:41:9f:bc:5e:02",
            "net14": "f6:cf:01:52:e7:cc",
            "net15": "6a:ee:d6:e1:c8:c3",
            "net16": "e6:dd:60:89:d6:42",
            "net17": "c6:e5:eb:df:af:25",
            "net18": "3a:c5:97:6f:2c:7b",
            "net19": "66:eb:4c:b8:cc:09",
            "net2": "3a:22:9e:34:d0:24",
            "net20": "7a:fd:d4:cf:67:a6",
            "net21": "a6:ab:42:da:bb:62",
            "net22": "3a:af:cb:d9:7d:82",
            "net23": "76:b5:f9:2d:95:36",
            "net3": "4a:8f:06:04:31:7a",
            "net4": "be:56:f5:f3:10:37",
            "net5": "5e:8b:aa:60:0c:a5",
            "net6": "5a:38:87:8f:d0:47",
            "net7": "b2:7b:23:c5:e4:cc",
            "net8": "a2:e9:c3:ea:0b:98",
            "net9": "2e:85:81:f3:46:dd"
        },
        "spine_2_1_12": {
            "net0": "92:1f:d7:62:ca:ef",
            "net1": "7a:87:36:4e:53:91",
            "net10": "3e:79:8c:de:34:e1",
            "net11": "6a:70:b1:11:57:70",
            "net12": "fe:85:99:d7:84:9a",
            "net13": "5a:ea:bc:b2:c1:ec",
            "net14": "c2:cb:d9:82:00:85",
            "net15": "66:d8:05:a1:ff:b5",
            "net16": "f6:88:62:9d:9a:97",
            "net17": "72:0e:8d:37:73:6f",
            "net18": "ce:3c:90:6c:85:d3",
            "net19": "76:87:8b:4b:be:cb",
            "net2": "9e:89:56:ff:5d:c0",
            "net20": "8a:32:69:2d:01:a0",
            "net21": "da:1c:20:dc:19:5c",
            "net22": "6a:e1:9a:2e:83:82",
            "net23": "22:c2:42:8a:9c:7b",
            "net3": "66:97:f8:bc:ad:6d",
            "net4": "22:a4:56:7e:33:36",
            "net5": "12:0c:18:b9:14:75",
            "net6": "be:8b:fc:de:ba:45",
            "net7": "a2:5a:0d:cb:aa:d6",
            "net8": "86:17:66:44:38:f1",
            "net9": "02:aa:69:4a:97:3d"
        },
        "spine_2_1_2": {
            "net0": "ea:e0:80:eb:54:ff",
            "net1": "4e:1c:91:9f:a3:0b",
            "net10": "c6:4c:80:36:1c:a2",
            "net11": "46:36:cf:14:91:36",
            "net12": "76:a6:e0:6d:69:48",
            "net13": "56:34:9e:13:a3:1d",
            "net14": "0a:87:96:24:d5:93",
            "net15": "8e:62:84:c4:62:88",
            "net16": "52:20:c4:d5:f6:59",
            "net17": "76:24:a0:f4:42:99",
            "net18": "d2:50:85:a2:a9:61",
            "net19": "8e:14:02:c1:a7:a9",
            "net2": "3e:bc:56:37:1a:08",
            "net20": "a6:dd:ec:2c:da:fe",
            "net21": "62:31:4c:5c:a7:1b",
            "net22": "06:d7:fe:e8:e1:14",
            "net23": "ce:7c:9e:0f:59:2b",
            "net3": "ca:df:9b:e8:4f:63",
            "net4": "82:5c:87:ed:4a:8a",
            "net5": "aa:4f:9a:fe:f1:a1",
            "net6": "f2:51:43:4f:28:ee",
            "net7": "e6:2b:bb:a5:b9:0f",
            "net8": "82:cb:28:21:51:bf",
            "net9": "a6:39:33:d8:ba:5f"
        },
        "spine_2_1_3": {
            "net0": "ae:93:46:d6:a3:be",
            "net1": "2a:30:03:c7:2d:3f",
            "net10": "6e:f6:26:47:62:32",
            "net11": "8e:ec:b1:45:13:59",
            "net12": "16:81:85:d7:39:5f",
            "net13": "da:50:0f:3d:bc:ba",
            "net14": "9a:02:fc:72:87:cd",
            "net15": "26:6a:f6:3a:a0:a7",
            "net16": "d2:ba:76:b6:8c:de",
            "net17": "32:fc:ec:97:18:53",
            "net18": "c6:20:27:bd:e8:31",
            "net19": "96:07:20:b2:90:d2",
            "net2": "ba:ac:2d:b5:62:fc",
            "net20": "6e:f3:fc:d0:c6:aa",
            "net21": "5a:c0:13:93:b2:9b",
            "net22": "9a:cb:0f:9d:b8:06",
            "net23": "1a:40:17:29:a6:88",
            "net3": "16:2d:97:09:89:bb",
            "net4": "0e:68:f2:97:52:0c",
            "net5": "02:91:e1:9e:c1:6a",
            "net6": "3e:f4:05:db:63:b3",
            "net7": "76:37:47:16:36:74",
            "net8": "6e:3b:5f:7f:84:fc",
            "net9": "9e:a1:ca:15:22:ce"
        },
        "spine_2_1_4": {
            "net0": "26:b7:2e:06:f4:61",
            "net1": "f2:1a:f6:e8:0c:8b",
            "net10": "32:74:2f:7d:3b:d1",
            "net11": "0e:1a:cc:58:3b:f9",
            "net12": "6e:ea:45:55:35:da",
            "net13": "96:d6:33:17:54:1a",
            "net14": "1a:f2:63:09:f5:ee",
            "net15": "5e:2d:83:96:c4:b8",
            "net16": "8a:51:f4:75:db:2c",
            "net17": "5e:51:52:c0:48:2a",
            "net18": "2a:bc:b8:f0:08:89",
            "net19": "c6:a9:85:64:37:0a",
            "net2": "2a:5f:9d:f9:4a:14",
            "net20": "4e:5b:12:b9:1c:e4",
            "net21": "aa:79:f8:a6:de:07",
            "net22": "ea:09:20:aa:24:66",
            "net23": "ba:e9:1a:09:82:93",
            "net3": "7a:59:a2:79:31:cf",
            "net4": "22:03:70:dc:31:6d",
            "net5": "a2:a2:d0:c5:4a:52",
            "net6": "fe:84:ac:63:3c:7a",
            "net7": "b6:a0:fd:bc:27:32",
            "net8": "8e:05:fc:fa:b7:b7",
            "net9": "d2:d0:82:25:13:75"
        },
        "spine_2_1_5": {
            "net0": "ca:66:a0:0a:e7:f2",
            "net1": "ba:1a:a9:1a:cf:b1",
            "net10": "66:a5:f4:b0:25:49",
            "net11": "2e:73:a3:52:cd:d7",
            "net12": "d2:cb:e4:13:5c:c1",
            "net13": "de:3b:d3:87:0b:53",
            "net14": "12:66:ed:03:49:94",
            "net15": "c6:e9:e7:c4:29:8a",
            "net16": "e2:32:00:37:56:c1",
            "net17": "52:cb:fd:1f:30:f6",
            "net18": "f2:29:2a:e3:42:61",
            "net19": "ae:0a:38:06:2a:28",
            "net2": "be:57:fa:1f:17:b6",
            "net20": "ea:3b:91:1a:c5:04",
            "net21": "ea:85:3c:44:60:8b",
            "net22": "ce:af:59:02:1a:22",
            "net23": "82:f6:e5:5c:d4:81",
            "net3": "4e:28:14:0b:89:9e",
            "net4": "2a:86:46:ee:77:c0",
            "net5": "46:f9:93:42:60:0c",
            "net6": "32:f9:01:31:b9:cb",
            "net7": "1e:0a:fd:8f:49:b8",
            "net8": "5e:fe:89:aa:79:56",
            "net9": "d2:74:12:4f:7d:60"
        },
        "spine_2_1_6": {
            "net0": "86:3d:bc:23:16:7c",
            "net1": "4a:8c:49:42:ef:b7",
            "net10": "36:bd:f0:1d:51:4d",
            "net11": "86:50:35:7a:47:29",
            "net12": "b6:90:32:92:7c:80",
            "net13": "42:4a:69:b0:88:0b",
            "net14": "c6:db:b9:b4:dc:33",
            "net15": "ca:ce:da:fb:2f:2c",
            "net16": "3e:e1:75:2a:58:ee",
            "net17": "22:fe:42:d5:f5:2a",
            "net18": "0e:05:96:69:76:2b",
            "net19": "e6:22:91:c7:a4:9a",
            "net2": "a6:b6:7f:c4:7d:4a",
            "net20": "9e:31:88:e3:69:bd",
            "net21": "5a:a9:b5:40:38:97",
            "net22": "16:05:db:d9:06:9e",
            "net23": "76:32:a3:34:d2:e5",
            "net3": "2a:fd:14:99:8f:fb",
            "net4": "ee:44:51:21:1d:0c",
            "net5": "0e:75:27:bb:63:74",
            "net6": "66:ed:8c:7a:46:55",
            "net7": "ca:bc:50:57:3b:2e",
            "net8": "46:de:46:2c:73:6d",
            "net9": "8e:c2:80:4d:6c:0e"
        },
        "spine_2_1_7": {
            "net0": "42:0f:07:58:c9:a8",
            "net1": "86:11:b1:44:ef:ee",
            "net10": "ce:7b:97:11:d2:50",
            "net11": "2e:80:2a:47:f6:a3",
            "net12": "82:d5:38:64:db:5c",
            "net13": "0a:54:6e:27:42:cf",
            "net14": "a6:f5:29:fd:56:43",
            "net15": "6a:f4:de:52:f3:5d",
            "net16": "8a:13:de:a6:9b:88",
            "net17": "12:58:cf:24:5c:63",
            "net18": "1e:41:65:05:eb:f5",
            "net19": "c2:53:c4:6a:a7:67",
            "net2": "4a:7b:bd:b6:44:40",
            "net20": "86:aa:87:aa:1b:c9",
            "net21": "46:63:9f:18:55:95",
            "net22": "f2:5c:be:40:81:62",
            "net23": "b6:29:b8:0f:c3:af",
            "net3": "d6:3f:d7:e0:ba:67",
            "net4": "ee:c2:f8:73:16:15",
            "net5": "f2:ba:96:ed:b8:0f",
            "net6": "b2:ee:ee:ed:1e:c7",
            "net7": "82:3d:e8:d7:64:66",
            "net8": "6a:c8:4c:3f:50:27",
            "net9": "12:f0:ce:75:de:93"
        },
        "spine_2_1_8": {
            "net0": "fa:14:e9:6d:ba:99",
            "net1": "0e:cd:a9:8b:26:1a",
            "net10": "76:48:f5:36:7a:b2",
            "net11": "32:2b:b3:eb:85:6a",
            "net12": "ca:2b:8f:70:d0:22",
            "net13": "c2:6e:07:ec:2c:ff",
            "net14": "2a:89:b7:26:7c:90",
            "net15": "76:0d:4a:9e:8f:bf",
            "net16": "82:b7:6e:00:b5:88",
            "net17": "9e:e8:19:78:3d:d4",
            "net18": "d2:9e:cb:e6:e5:ef",
            "net19": "5e:7d:1d:16:57:11",
            "net2": "da:87:45:cc:91:90",
            "net20": "ea:11:c5:20:99:4b",
            "net21": "32:eb:f7:3a:87:2f",
            "net22": "f2:c1:d8:8f:bb:b9",
            "net23": "22:0b:64:09:f9:c3",
            "net3": "46:79:4b:95:bc:b0",
            "net4": "e6:c6:9a:57:6b:f7",
            "net5": "7a:31:44:9a:3d:32",
            "net6": "be:cf:1a:33:8e:1c",
            "net7": "6a:2a:14:10:c2:ff",
            "net8": "96:de:b5:65:f5:f0",
            "net9": "0a:1f:d1:b9:e4:40"
        },
        "spine_2_1_9": {
            "net0": "4e:11:79:1c:1f:f3",
            "net1": "6a:1b:a6:b5:e0:97",
            "net10": "a2:b4:fb:47:e5:62",
            "net11": "6a:55:34:13:14:42",
            "net12": "de:33:f2:7a:7f:6e",
            "net13": "b2:3c:5e:5c:3c:dc",
            "net14": "e6:73:66:e4:b0:a5",
            "net15": "3e:5c:01:82:b4:fc",
            "net16": "8e:a7:8e:c9:52:ed",
            "net17": "56:b8:45:42:ff:1b",
            "net18": "4e:21:d8:8b:3f:9e",
            "net19": "66:b0:38:59:a3:43",
            "net2": "66:6c:e7:f8:43:1c",
            "net20": "ce:79:94:f1:85:5b",
            "net21": "8a:2d:9a:6e:fb:51",
            "net22": "52:b7:0a:2f:21:ca",
            "net23": "8e:50:1f:e8:27:34",
            "net3": "72:b8:9b:bd:e6:06",
            "net4": "aa:8b:14:73:d4:38",
            "net5": "a2:33:35:fd:69:31",
            "net6": "82:e3:cd:67:de:0f",
            "net7": "9e:6c:98:65:35:a4",
            "net8": "2a:51:4e:8c:80:b2",
            "net9": "32:b7:5a:0d:57:7d"
        },
        "tof_1_2_1": {
            "net0": "e6:d9:78:73:c0:5b",
            "net1": "de:c1:f3:c2:8e:37",
            "net10": "aa:0e:4a:ae:92:73",
            "net11": "76:66:77:ee:c5:fd",
            "net12": "22:38:0f:57:09:84",
            "net13": "0a:8e:c9:31:26:15",
            "net14": "8a:f7:5a:93:26:d0",
            "net15": "76:ae:34:2d:b8:db",
            "net16": "e2:24:e9:e4:7a:63",
            "net17": "22:92:7b:aa:4c:11",
            "net18": "0e:c4:dc:b2:fd:5a",
            "net19": "06:28:90:16:ff:d3",
            "net2": "26:65:fb:5d:3c:1f",
            "net20": "7e:46:19:84:ea:57",
            "net21": "06:72:e2:ee:30:13",
            "net22": "52:1c:01:30:8e:88",
            "net23": "b2:84:90:9c:ac:b1",
            "net3": "52:22:9b:db:ef:52",
            "net4": "9e:42:db:e2:e6:cf",
            "net5": "ae:73:c6:8e:a0:c2",
            "net6": "72:d6:52:71:94:93",
            "net7": "c6:3a:fc:b1:ed:0f",
            "net8": "52:22:20:0e:72:27",
            "net9": "06:9b:8b:81:51:31"
        },
        "tof_1_2_10": {
            "net0": "d2:a5:77:71:10:99",
            "net1": "ba:c9:7b:58:56:42",
            "net10": "ca:32:1b:7c:b0:e5",
            "net11": "aa:03:ee:c1:94:d9",
            "net12": "4e:a1:de:8b:5e:24",
            "net13": "96:09:ed:d1:57:08",
            "net14": "62:2d:35:70:3c:68",
            "net15": "02:d3:e2:0c:49:ae",
            "net16": "b2:f7:c2:91:e4:c0",
            "net17": "9e:f7:20:0b:5e:fa",
            "net18": "2a:b1:fc:55:12:d5",
            "net19": "a6:1b:df:f9:d0:62",
            "net2": "c6:f5:7f:5b:fa:43",
            "net20": "3e:42:09:61:30:48",
            "net21": "5e:51:0c:5c:09:41",
            "net22": "a2:36:f3:02:50:82",
            "net23": "2e:c0:d4:64:8b:54",
            "net3": "ae:0d:73:96:82:12",
            "net4": "66:3e:93:e2:97:dc",
            "net5": "2a:d7:49:1e:86:5a",
            "net6": "86:1e:c4:e4:0f:ab",
            "net7": "52:9b:54:e6:5f:5b",
            "net8": "9e:f1:bc:53:e6:c2",
            "net9": "72:bf:b9:16:ba:87"
        },
        "tof_1_2_11": {
            "net0": "12:03:a3:d9:a7:03",
            "net1": "96:e1:b5:f0:f5:b8",
            "net10": "4e:4e:61:74:35:70",
            "net11": "52:0b:d0:f0:07:87",
            "net12": "ce:8d:8f:c4:60:bd",
            "net13": "86:cb:8d:f3:6e:ec",
            "net14": "82:9d:88:78:65:27",
            "net15": "fe:34:47:ea:86:4c",
            "net16": "2a:f3:97:c9:f0:db",
            "net17": "c6:d0:f5:23:82:ae",
            "net18": "82:83:96:64:5e:fb",
            "net19": "4a:f6:d0:51:28:cc",
            "net2": "8a:c2:92:39:f3:01",
            "net20": "da:8b:ac:f4:8a:fb",
            "net21": "d6:57:90:75:58:ef",
            "net22": "be:e9:19:f1:40:c6",
            "net23": "36:73:52:dc:c6:34",
            "net3": "1e:97:ae:dd:11:25",
            "net4": "5a:e9:5a:7d:c7:a7",
            "net5": "fa:19:dd:29:b0:1a",
            "net6": "7e:89:92:95:63:01",
            "net7": "4e:1b:e7:e6:06:05",
            "net8": "3e:eb:ca:a2:06:f4",
            "net9": "92:88:30:96:bd:5f"
        },
        "tof_1_2_12": {
            "net0": "2e:14:c8:cc:0e:90",
            "net1": "ea:b9:da:53:88:c3",
            "net10": "b6:a4:b3:ee:71:6d",
            "net11": "ae:84:eb:d2:9b:5b",
            "net12": "7e:11:9f:75:a3:e0",
            "net13": "1a:56:7d:bc:8f:21",
            "net14": "d2:c3:bb:be:d2:2d",
            "net15": "9e:e4:4e:cf:a2:ff",
            "net16": "fe:64:63:5d:06:78",
            "net17": "b6:95:e7:87:49:64",
            "net18": "4a:1b:9c:7d:1f:98",
            "net19": "c6:62:65:f2:ab:97",
            "net2": "4a:33:9e:79:e8:4d",
            "net20": "aa:14:8f:f8:d6:b9",
            "net21": "72:fc:a6:1d:98:61",
            "net22": "66:c4:57:7d:37:41",
            "net23": "9a:c1:07:ab:13:90",
            "net3": "72:70:25:78:4a:29",
            "net4": "82:c2:e6:d9:80:5d",
            "net5": "8e:63:6a:c4:00:a0",
            "net6": "56:d7:21:38:e6:ac",
            "net7": "7e:cb:8f:1a:32:d7",
            "net8": "2a:96:51:f5:2a:e3",
            "net9": "82:48:09:58:df:23"
        },
        "tof_1_2_2": {
            "net0": "7a:c9:51:a6:b4:69",
            "net1": "ba:5c:cc:24:2c:00",
            "net10": "12:2e:7d:94:01:48",
            "net11": "ce:4b:2e:a2:ce:46",
            "net12": "f6:cb:0c:47:32:11",
            "net13": "26:96:83:46:62:1d",
            "net14": "3e:16:c4:3c:50:1d",
            "net15": "62:72:17:e6:10:68",
            "net16": "06:77:de:e1:2c:e8",
            "net17": "aa:c4:4d:b0:6a:aa",
            "net18": "16:c1:56:37:8f:a7",
            "net19": "b6:e1:20:ce:07:a1",
            "net2": "ee:f0:ec:c9:78:72",
            "net20": "d6:bb:39:d0:f4:e8",
            "net21": "1e:54:5f:30:75:30",
            "net22": "9a:6d:47:ea:7a:5c",
            "net23": "f6:06:ad:7e:22:49",
            "net3": "e6:fd:85:37:dd:d2",
            "net4": "f6:b3:0c:10:b6:1f",
            "net5": "e6:f1:30:31:04:a7",
            "net6": "1e:34:aa:8b:6f:56",
            "net7": "0e:fc:0c:a9:6e:31",
            "net8": "0a:a0:cc:89:19:d2",
            "net9": "2e:24:5d:f9:54:59"
        },
        "tof_1_2_3": {
            "net0": "aa:e5:2b:90:4b:70",
            "net1": "82:27:2d:89:67:b0",
            "net10": "3e:51:25:86:08:10",
            "net11": "66:e4:0b:9f:3c:78",
            "net12": "ae:14:36:db:a8:56",
            "net13": "6a:a8:d1:36:3a:9f",
            "net14": "ea:7d:cf:0d:fc:bd",
            "net15": "02:1b:f8:8a:49:38",
            "net16": "5a:43:f7:ac:54:f7",
            "net17": "d6:de:a2:e3:aa:8f",
            "net18": "16:75:fd:e7:f0:56",
            "net19": "5e:d4:ef:ec:cf:8b",
            "net2": "36:9d:5e:6d:e5:57",
            "net20": "1a:b0:48:4c:80:26",
            "net21": "36:54:e9:0e:c3:e9",
            "net22": "fa:ad:50:9f:67:69",
            "net23": "ce:84:90:d2:9e:42",
            "net3": "06:51:4c:ad:26:a5",
            "net4": "46:c3:71:58:00:16",
            "net5": "fa:d4:3b:84:0f:29",
            "net6": "82:67:87:3b:89:a6",
            "net7": "ea:7d:cb:ba:43:af",
            "net8": "e6:c3:7a:88:7b:12",
            "net9": "ee:26:5d:d2:55:01"
        },
        "tof_1_2_4": {
            "net0": "7e:ac:d1:8a:2d:de",
            "net1": "2a:5a:dc:d5:2e:e2",
            "net10": "2a:ed:00:a2:ea:1f",
            "net11": "ce:b7:93:5c:68:3f",
            "net12": "ca:fb:3c:d8:ca:1b",
            "net13": "36:5c:5d:78:88:36",
            "net14": "b2:e1:7d:2a:57:44",
            "net15": "fe:59:e0:be:06:b7",
            "net16": "a2:de:29:98:21:d2",
            "net17": "d2:b2:57:21:e4:cf",
            "net18": "2a:0f:d7:b1:92:e6",
            "net19": "02:dc:74:e1:d6:7c",
            "net2": "02:a6:7b:94:ab:51",
            "net20": "6a:6f:fa:56:04:aa",
            "net21": "1a:17:1b:88:2c:df",
            "net22": "ca:39:7d:16:76:17",
            "net23": "de:51:e2:73:ec:dd",
            "net3": "26:9e:62:b5:0a:5e",
            "net4": "66:00:ff:de:dd:0d",
            "net5": "fa:5b:21:fa:22:8b",
            "net6": "a6:10:01:9e:86:2d",
            "net7": "22:5f:df:cd:71:01",
            "net8": "4e:6a:99:30:07:28",
            "net9": "56:84:b1:6d:37:21"
        },
        "tof_1_2_5": {
            "net0": "9a:57:6b:bc:3c:b6",
            "net1": "16:88:9b:4f:08:dc",
            "net10": "02:a9:5a:5d:15:98",
            "net11": "c2:b2:e0:62:09:be",
            "net12": "4a:a4:13:b8:62:af",
            "net13": "92:4c:0c:c8:02:07",
            "net14": "c6:da:33:20:2a:03",
            "net15": "2a:f7:0f:19:7a:5f",
            "net16": "d6:b8:4a:1e:fc:fa",
            "net17": "36:1b:61:69:ae:5d",
            "net18": "12:ca:8f:58:3e:35",
            "net19": "56:05:b1:36:f8:4c",
            "net2": "b2:00:f4:4e:ac:46",
            "net20": "2a:7a:a5:ab:8e:fa",
            "net21": "d6:cf:c6:ec:ab:ff",
            "net22": "06:66:83:e2:a4:88",
            "net23": "b6:03:b4:29:7d:e3",
            "net3": "3e:ae:df:7f:c6:06",
            "net4": "36:92:8a:ea:75:1c",
            "net5": "4e:82:57:29:bd:87",
            "net6": "96:61:22:e0:dc:02",
            "net7": "02:a3:f7:7f:c1:eb",
            "net8": "ba:ef:e5:bc:61:bf",
            "net9": "ce:2b:28:37:ce:ec"
        },
        "tof_1_2_6": {
            "net0": "e6:74:b3:b9:3f:9c",
            "net1": "52:4a:04:66:a6:df",
            "net10": "8e:6e:64:99:df:4d",
            "net11": "5e:78:6c:e8:bb:05",
            "net12": "52:a9:60:f4:04:fa",
            "net13": "a2:85:03:a1:3f:bd",
            "net14": "76:6d:d9:c1:06:b7",
            "net15": "b2:4c:e3:57:69:96",
            "net16": "86:0a:ca:e1:54:85",
            "net17": "5e:3a:ee:26:c5:db",
            "net18": "5e:59:7f:ad:18:0c",
            "net19": "1a:d6:30:4e:52:26",
            "net2": "ce:18:8c:33:0d:87",
            "net20": "e2:6d:bf:80:65:a4",
            "net21": "8e:69:c9:e9:24:ed",
            "net22": "62:0e:2e:b9:84:15",
            "net23": "6e:85:1e:da:c9:32",
            "net3": "7e:54:69:5c:52:0c",
            "net4": "2e:cd:6d:1e:2d:1b",
            "net5": "aa:45:15:ef:ae:08",
            "net6": "12:99:f4:7f:11:7c",
            "net7": "1e:fb:0c:7f:80:e7",
            "net8": "66:0f:c0:f9:de:18",
            "net9": "b2:16:8d:5e:b3:a5"
        },
        "tof_1_2_7": {
            "net0": "52:68:6e:51:b2:3e",
            "net1": "0a:39:5c:90:16:41",
            "net10": "6e:5d:66:03:37:2e",
            "net11": "7e:82:c0:b4:d2:5f",
            "net12": "86:19:b1:5b:3a:a2",
            "net13": "32:90:1a:36:22:9e",
            "net14": "1a:0d:5b:3b:ab:69",
            "net15": "06:6c:ab:8c:e1:e1",
            "net16": "86:7d:cb:9a:49:f3",
            "net17": "76:b1:18:76:74:a2",
            "net18": "3e:e7:25:e3:80:f6",
            "net19": "8e:4a:a0:f7:97:d2",
            "net2": "82:9f:0f:95:e4:a2",
            "net20": "36:af:ed:50:b6:00",
            "net21": "12:22:5a:e2:a7:6d",
            "net22": "86:8d:38:e7:a0:17",
            "net23": "22:1b:c2:fe:59:ee",
            "net3": "ea:0c:c8:ca:33:b1",
            "net4": "26:e9:30:7f:a1:e1",
            "net5": "36:70:50:56:e4:cb",
            "net6": "ce:07:3e:7a:35:08",
            "net7": "aa:64:dd:34:69:b3",
            "net8": "82:af:f0:85:04:b8",
            "net9": "0e:79:53:b5:36:09"
        },
        "tof_1_2_8": {
            "net0": "e2:f1:e3:23:63:3e",
            "net1": "7a:75:c2:10:69:f2",
            "net10": "4a:a3:b7:06:44:41",
            "net11": "a2:46:a3:8e:9b:d0",
            "net12": "e2:74:ed:bf:97:51",
            "net13": "42:65:7a:e4:ed:13",
            "net14": "56:e3:ad:ef:b0:02",
            "net15": "72:f8:29:8e:76:97",
            "net16": "52:8e:1b:ee:0e:de",
            "net17": "8e:7b:0b:00:95:ff",
            "net18": "02:72:fa:95:09:ed",
            "net19": "d6:79:99:1e:0e:6b",
            "net2": "12:22:9f:10:32:64",
            "net20": "a6:cd:ed:cb:66:e8",
            "net21": "66:1f:6d:6e:7e:50",
            "net22": "c2:a3:3c:b5:6d:a8",
            "net23": "ee:51:24:15:9f:aa",
            "net3": "d6:c7:b9:2e:25:e2",
            "net4": "fe:c8:d4:42:87:90",
            "net5": "4e:dc:4c:03:b9:a3",
            "net6": "8e:d1:57:2c:24:08",
            "net7": "46:a6:2c:7b:78:ea",
            "net8": "6a:71:40:af:be:b4",
            "net9": "56:fa:ec:9b:b7:e8"
        },
        "tof_1_2_9": {
            "net0": "5a:9d:0a:58:de:ae",
            "net1": "fa:ed:b8:d1:7d:80",
            "net10": "ca:4f:16:af:13:a8",
            "net11": "46:54:aa:c7:54:28",
            "net12": "8e:b7:f2:1e:6b:af",
            "net13": "6a:56:6a:7f:21:41",
            "net14": "42:5d:3d:6a:7d:e2",
            "net15": "0a:8a:9f:dc:9d:62",
            "net16": "06:6b:5b:bc:c1:d6",
            "net17": "4a:5f:49:35:46:09",
            "net18": "7e:5f:47:78:a2:99",
            "net19": "3a:71:cd:5c:e4:cd",
            "net2": "d6:de:75:9c:c4:62",
            "net20": "16:8f:f0:c6:20:21",
            "net21": "4e:61:a6:19:a0:05",
            "net22": "26:fa:04:dc:e5:43",
            "net23": "3e:d4:9a:13:e1:dc",
            "net3": "f6:8a:30:c4:80:8d",
            "net4": "d6:4d:95:cd:b4:b8",
            "net5": "ea:dd:e6:d3:11:71",
            "net6": "6e:ce:bd:8d:09:41",
            "net7": "4e:42:8c:a3:4b:79",
            "net8": "b2:de:69:8c:21:36",
            "net9": "e2:b2:41:66:fc:a9"
        }
    },
    "failed_machine": "spine_1_1_1",
    "failed_interfaces": [
        "net12"
    ],
    "failure_time": 1614996180.764602,
    "recover_time": 1614996421.5290766
}