{
    "k_leaf": 2,
    "k_top": 2,
    "redundancy_factor": 2,
    "is_k8s": true,
    "machine_mac_addresses": {
        "leaf_1_0_1": {
            "net0": "d2:05:69:ca:e7:4d",
            "net1": "e2:de:36:8f:ec:5f",
            "net2": "da:fd:f6:a3:c6:7e"
        },
        "leaf_1_0_2": {
            "net0": "36:1a:dd:1d:ab:4b",
            "net1": "4a:42:bb:bf:86:a0",
            "net2": "8e:03:95:0a:28:f4"
        },
        "leaf_2_0_1": {
            "net0": "e6:96:f8:e4:75:57",
            "net1": "d6:05:ce:7a:97:9f",
            "net2": "82:a8:5e:74:8b:82"
        },
        "leaf_2_0_2": {
            "net0": "12:67:8e:0c:fe:3d",
            "net1": "9e:84:60:35:78:9f",
            "net2": "82:4d:9e:86:47:0b"
        },
        "spine_1_1_1": {
            "net0": "3e:5a:e1:f9:c3:1e",
            "net1": "3a:da:2f:39:b9:da",
            "net2": "aa:68:e8:8f:a6:5a",
            "net3": "5e:fd:2c:a4:78:03"
        },
        "spine_1_1_2": {
            "net0": "02:01:8f:de:11:d2",
            "net1": "32:bc:1e:36:e6:98",
            "net2": "c2:d3:38:d3:ec:bf",
            "net3": "9a:3e:8e:fe:69:ab"
        },
        "spine_2_1_1": {
            "net0": "a6:7b:c1:45:25:33",
            "net1": "a2:6d:87:5b:a8:fb",
            "net2": "e2:fc:a3:3b:b3:d0",
            "net3": "b6:43:d6:37:cd:7d"
        },
        "spine_2_1_2": {
            "net0": "0a:9c:8c:7a:06:ff",
            "net1": "a2:ed:c0:81:47:91",
            "net2": "52:50:4c:1a:fe:aa",
            "net3": "6a:6a:30:a3:5d:b2"
        },
        "tof_1_2_1": {
            "net0": "0a:df:29:8b:90:3e",
            "net1": "5a:9c:01:01:65:c0",
            "net2": "fe:00:37:12:ca:c7",
            "net3": "ca:76:b9:8b:8e:0d"
        },
        "tof_1_2_2": {
            "net0": "96:00:82:3f:a4:e1",
            "net1": "b6:95:6a:42:0d:d9",
            "net2": "32:c8:0b:f9:8b:0f",
            "net3": "7a:d4:7f:26:be:3f"
        }
    },
    "failed_machine": "leaf_1_0_1",
    "failure_time": {
        "leaf_1_0_1": 1621862819.605777,
        "leaf_1_0_2": 1621862819.6096492,
        "leaf_2_0_1": 1621862819.6110015,
        "leaf_2_0_2": 1621862819.612043,
        "spine_1_1_1": 1621862819.6267138,
        "spine_1_1_2": 1621862819.6291065,
        "spine_2_1_1": 1621862819.6298165,
        "spine_2_1_2": 1621862819.6340847,
        "tof_1_2_1": 1621862819.6345663,
        "tof_1_2_2": 1621862819.6402133
    }
}