{
    "k_leaf": 16,
    "k_top": 16,
    "redundancy_factor": 16,
    "is_k8s": true,
    "machine_mac_addresses": {
        "leaf_1_0_1": {
            "net0": "da:18:af:b2:39:69",
            "net1": "c6:81:37:10:b3:e0",
            "net10": "f6:ca:e5:ae:55:ec",
            "net11": "aa:ec:fd:34:9e:4f",
            "net12": "0a:a4:6b:53:0f:ad",
            "net13": "22:13:0b:11:31:11",
            "net14": "22:2f:9d:05:dd:2c",
            "net15": "36:1f:dc:0a:73:db",
            "net16": "4e:88:ae:69:16:2b",
            "net2": "62:80:2d:28:d9:91",
            "net3": "96:3f:db:9a:79:2e",
            "net4": "32:b1:33:ad:26:70",
            "net5": "b6:dd:e7:33:cb:2b",
            "net6": "96:55:c6:b9:40:85",
            "net7": "1a:cc:72:64:82:21",
            "net8": "1a:8c:0a:f3:d1:48",
            "net9": "a2:57:06:37:8e:af"
        },
        "leaf_1_0_10": {
            "net0": "b2:8a:a9:7c:95:88",
            "net1": "46:fb:a7:8b:4f:4d",
            "net10": "fa:e5:85:8e:5a:9a",
            "net11": "36:51:0f:b3:f0:e7",
            "net12": "86:ef:d2:dd:70:70",
            "net13": "5a:2f:77:7c:c6:3e",
            "net14": "62:87:bb:70:3d:cc",
            "net15": "2a:ea:fb:b4:f0:e7",
            "net16": "d6:84:86:8b:87:aa",
            "net2": "52:3f:96:85:37:5d",
            "net3": "26:22:25:f0:2f:87",
            "net4": "0a:d6:48:e0:1f:34",
            "net5": "d6:fc:b0:95:08:6d",
            "net6": "f6:57:c1:dc:f3:91",
            "net7": "86:6f:42:f5:63:4c",
            "net8": "c2:cf:1d:dd:eb:de",
            "net9": "4e:45:07:2e:92:33"
        },
        "leaf_1_0_11": {
            "net0": "b6:fb:23:ee:f6:64",
            "net1": "be:5a:bb:50:85:2f",
            "net10": "de:2d:a2:c5:74:19",
            "net11": "86:ed:3d:67:a8:33",
            "net12": "16:e0:bd:7b:7a:0b",
            "net13": "0e:0b:eb:b4:2d:64",
            "net14": "9a:30:5e:eb:62:c8",
            "net15": "02:07:2a:00:20:3b",
            "net16": "1e:73:f4:c3:2c:7a",
            "net2": "e6:e6:04:19:5f:e9",
            "net3": "8e:ee:a2:7c:9b:27",
            "net4": "e6:ec:6c:56:bf:89",
            "net5": "be:05:4e:6c:7c:f6",
            "net6": "4a:e1:6d:8f:6c:95",
            "net7": "92:b5:0d:38:48:8b",
            "net8": "4e:de:0b:16:af:19",
            "net9": "32:01:fc:cc:8d:96"
        },
        "leaf_1_0_12": {
            "net0": "22:32:54:ee:f0:56",
            "net1": "02:17:ec:6b:7e:04",
            "net10": "f2:b9:6a:27:73:69",
            "net11": "7a:d3:53:4d:bd:1a",
            "net12": "76:58:9d:1c:1d:52",
            "net13": "c2:02:9a:42:22:2c",
            "net14": "9e:41:c5:9a:8e:88",
            "net15": "26:10:49:2e:8e:c5",
            "net16": "86:bd:ba:a2:15:3f",
            "net2": "66:1f:fc:25:53:53",
            "net3": "1a:b2:fb:0c:93:19",
            "net4": "22:a5:ec:3c:7c:f9",
            "net5": "f6:b0:84:14:28:18",
            "net6": "5a:03:89:e6:35:02",
            "net7": "8e:6c:46:30:ca:0d",
            "net8": "8a:9d:c8:d1:7d:a8",
            "net9": "c2:ab:56:e8:ee:b6"
        },
        "leaf_1_0_13": {
            "net0": "3a:64:6f:2b:ee:96",
            "net1": "4a:50:59:7d:a9:4a",
            "net10": "c6:33:c9:6d:c2:a2",
            "net11": "96:f0:61:87:45:ca",
            "net12": "6a:42:f4:32:f5:e7",
            "net13": "66:81:dd:1c:e8:73",
            "net14": "f6:9d:f7:56:d2:5a",
            "net15": "e2:16:a4:5f:9d:f6",
            "net16": "aa:62:08:94:07:96",
            "net2": "da:db:2e:ea:4e:cd",
            "net3": "ca:6a:3c:98:04:44",
            "net4": "46:3b:04:94:cf:38",
            "net5": "fe:05:aa:fc:dc:4e",
            "net6": "a6:f7:b1:f6:6b:2d",
            "net7": "2a:c0:ca:a8:41:c4",
            "net8": "de:74:57:3b:f0:0a",
            "net9": "f2:67:92:71:6f:76"
        },
        "leaf_1_0_14": {
            "net0": "4a:bb:3c:56:04:e1",
            "net1": "fa:6e:6e:0c:68:34",
            "net10": "06:ad:c6:46:ab:72",
            "net11": "d6:c6:91:a3:f3:40",
            "net12": "ae:87:8f:a1:d9:96",
            "net13": "e6:69:ce:e1:c6:81",
            "net14": "32:e3:83:54:0a:d8",
            "net15": "36:2d:0f:3a:eb:4e",
            "net16": "ae:ef:3c:9a:e3:37",
            "net2": "b6:72:18:c2:da:44",
            "net3": "9a:c1:e9:e4:5b:f8",
            "net4": "7a:fe:63:43:61:b2",
            "net5": "22:de:3b:fd:d7:5c",
            "net6": "fe:96:5e:48:85:4b",
            "net7": "12:fe:5b:89:ce:53",
            "net8": "16:71:0b:12:f7:01",
            "net9": "26:95:b3:91:2b:60"
        },
        "leaf_1_0_15": {
            "net0": "52:f7:22:6f:dc:2c",
            "net1": "42:5c:ef:6d:a8:d4",
            "net10": "fe:d7:a4:ae:3e:16",
            "net11": "3a:33:0a:c9:6e:f9",
            "net12": "be:c4:a8:ca:d2:58",
            "net13": "96:3e:01:c0:ff:12",
            "net14": "22:f9:86:47:74:55",
            "net15": "ce:e8:1e:45:92:aa",
            "net16": "6e:fd:e4:b9:ab:13",
            "net2": "5e:22:8d:ba:a3:c1",
            "net3": "56:d5:e7:61:e5:9d",
            "net4": "62:98:75:3e:b3:e3",
            "net5": "d6:94:97:d5:b9:d5",
            "net6": "fe:cb:31:db:2a:e7",
            "net7": "4a:46:2b:04:4d:d4",
            "net8": "de:c0:35:0a:8f:fc",
            "net9": "be:c5:35:55:91:51"
        },
        "leaf_1_0_16": {
            "net0": "a2:7d:6c:24:34:55",
            "net1": "ea:6c:f5:69:1a:16",
            "net10": "1a:59:54:5c:02:81",
            "net11": "1e:a9:d4:c3:0a:bf",
            "net12": "5a:e7:5d:f3:22:81",
            "net13": "ca:a9:d7:90:12:d0",
            "net14": "32:ac:c1:b3:f3:46",
            "net15": "3a:c2:4e:08:cd:31",
            "net16": "4e:7e:a6:74:58:05",
            "net2": "66:d0:f5:d7:ab:7a",
            "net3": "32:71:01:83:05:1a",
            "net4": "e2:ba:85:b7:6c:a2",
            "net5": "76:68:43:19:8f:44",
            "net6": "76:e4:70:1c:fb:6c",
            "net7": "56:fb:31:e6:2a:d9",
            "net8": "3a:db:bb:9e:d8:03",
            "net9": "3e:bc:8d:be:62:b1"
        },
        "leaf_1_0_2": {
            "net0": "be:e6:57:c8:b6:d4",
            "net1": "e2:7a:96:0c:c2:0b",
            "net10": "a6:2d:0d:f1:90:0d",
            "net11": "9e:a2:6c:97:35:2d",
            "net12": "da:cb:d5:a6:22:5d",
            "net13": "82:c0:1c:b2:71:3c",
            "net14": "2e:d2:58:5b:15:3c",
            "net15": "22:12:cd:1b:aa:70",
            "net16": "da:8d:7e:75:10:1d",
            "net2": "ae:1d:42:da:c8:42",
            "net3": "3e:52:1e:37:b4:8b",
            "net4": "fe:54:bc:fc:eb:7a",
            "net5": "7e:21:aa:86:bd:4b",
            "net6": "c6:e5:c1:a4:7c:da",
            "net7": "3e:62:35:81:82:0a",
            "net8": "e6:35:f3:37:8e:3c",
            "net9": "26:5a:3e:6a:36:de"
        },
        "leaf_1_0_3": {
            "net0": "9a:52:15:12:80:af",
            "net1": "82:86:0a:0d:d6:75",
            "net10": "1a:59:53:a6:23:78",
            "net11": "2a:47:99:6b:2b:5d",
            "net12": "5e:09:8c:28:bd:9d",
            "net13": "1a:53:c2:d2:81:4e",
            "net14": "b6:09:21:b1:db:04",
            "net15": "42:b7:1d:b8:44:1d",
            "net16": "8e:c4:97:e0:56:7b",
            "net2": "42:d4:f6:5b:6e:74",
            "net3": "ee:ce:3f:fa:ea:21",
            "net4": "02:5f:a9:f8:22:00",
            "net5": "fa:e5:b0:e8:8d:36",
            "net6": "f6:da:42:79:b6:7b",
            "net7": "66:54:96:eb:c5:80",
            "net8": "e6:61:1f:20:a6:fd",
            "net9": "8e:55:19:31:8d:91"
        },
        "leaf_1_0_4": {
            "net0": "82:ed:d9:61:8f:2d",
            "net1": "aa:c6:cf:b8:6f:04",
            "net10": "3a:62:10:ef:af:2b",
            "net11": "5e:a1:19:7c:66:99",
            "net12": "fa:e5:30:29:6f:c6",
            "net13": "fa:2f:39:2d:01:6c",
            "net14": "36:1a:fa:f3:9b:ac",
            "net15": "22:98:4e:67:76:b7",
            "net16": "3e:ab:94:a1:d0:db",
            "net2": "2a:c1:26:6b:d9:b1",
            "net3": "66:92:af:ed:c1:f6",
            "net4": "c2:3c:70:ad:db:3d",
            "net5": "d6:1e:6a:c0:2b:19",
            "net6": "62:cf:7a:6e:f0:b8",
            "net7": "ae:ad:d2:b9:7e:81",
            "net8": "1a:31:c5:f6:b5:03",
            "net9": "46:78:c9:68:2d:cf"
        },
        "leaf_1_0_5": {
            "net0": "4e:69:d7:3a:43:0f",
            "net1": "9e:bc:ea:86:b2:8b",
            "net10": "4e:6c:0e:8a:73:15",
            "net11": "1a:84:f2:6e:b0:08",
            "net12": "5e:3e:21:97:90:df",
            "net13": "fe:bc:84:1f:20:07",
            "net14": "16:8d:e2:7d:37:8d",
            "net15": "be:25:fb:f2:db:29",
            "net16": "d2:ca:ae:05:4b:0c",
            "net2": "f6:52:8f:86:9d:b4",
            "net3": "3e:74:e9:88:15:6a",
            "net4": "da:2a:4c:d8:d9:99",
            "net5": "4e:d7:bd:43:a2:e2",
            "net6": "ea:44:09:3b:32:0f",
            "net7": "4e:be:b0:61:ef:a1",
            "net8": "02:eb:99:b5:b8:dd",
            "net9": "2e:a5:50:71:fa:af"
        },
        "leaf_1_0_6": {
            "net0": "36:da:e4:80:f6:52",
            "net1": "f2:e3:1b:81:7d:41",
            "net10": "0e:12:64:e2:6d:e4",
            "net11": "e2:44:58:ec:bc:7c",
            "net12": "e2:de:aa:a5:4c:0c",
            "net13": "8a:22:05:e4:0d:97",
            "net14": "c6:28:a4:7b:44:4d",
            "net15": "02:9d:52:a8:c0:93",
            "net16": "5e:e7:31:a4:9c:86",
            "net2": "66:ce:27:bd:fd:38",
            "net3": "52:38:08:7a:c1:38",
            "net4": "56:82:0b:d8:b0:7c",
            "net5": "76:08:25:c9:28:55",
            "net6": "2a:b0:b5:5a:b7:2a",
            "net7": "76:72:b7:bd:9a:bc",
            "net8": "fe:0b:25:f2:5c:b6",
            "net9": "72:e5:51:b6:e9:9a"
        },
        "leaf_1_0_7": {
            "net0": "32:bd:35:ec:e7:ec",
            "net1": "22:1c:eb:4a:be:1a",
            "net10": "d2:32:48:38:68:1a",
            "net11": "de:90:e0:ed:f8:ee",
            "net12": "72:8c:7f:37:2d:2f",
            "net13": "f6:32:32:47:25:f6",
            "net14": "ba:9e:30:42:bf:23",
            "net15": "5e:73:4f:57:bf:9d",
            "net16": "1a:80:f1:19:8f:7c",
            "net2": "c2:13:00:f1:d6:66",
            "net3": "ea:f6:d3:0a:3a:91",
            "net4": "7a:64:5f:93:bb:20",
            "net5": "e2:a2:1b:29:a2:df",
            "net6": "62:33:72:59:79:55",
            "net7": "42:e4:2d:ca:6e:6e",
            "net8": "f2:f7:55:99:48:04",
            "net9": "02:34:d0:cd:fb:55"
        },
        "leaf_1_0_8": {
            "net0": "22:fc:60:e9:34:73",
            "net1": "e6:a2:d9:cb:af:b7",
            "net10": "52:9a:dd:52:c7:a0",
            "net11": "ce:8b:b1:1a:6c:22",
            "net12": "9e:09:d8:a6:05:00",
            "net13": "f6:6a:64:d7:ac:05",
            "net14": "7e:e2:a9:95:e0:d1",
            "net15": "12:a1:6e:05:23:79",
            "net16": "02:17:69:2c:81:b3",
            "net2": "82:a3:3f:2c:95:db",
            "net3": "fa:03:2a:86:63:49",
            "net4": "8a:17:fe:97:ff:37",
            "net5": "3a:06:12:85:72:04",
            "net6": "36:19:7c:c3:d4:63",
            "net7": "26:34:5c:57:e8:aa",
            "net8": "fa:8e:af:df:60:09",
            "net9": "9a:53:8d:02:d7:ee"
        },
        "leaf_1_0_9": {
            "net0": "1a:f8:b6:78:a4:6b",
            "net1": "92:d1:26:80:fe:9f",
            "net10": "56:5d:27:23:60:e5",
            "net11": "a6:1b:71:15:77:d1",
            "net12": "2a:f9:82:ae:59:d7",
            "net13": "76:88:ea:b7:f6:a0",
            "net14": "56:e2:46:0c:63:e5",
            "net15": "c6:42:a2:8d:1e:3b",
            "net16": "be:50:ba:dd:c9:b1",
            "net2": "8a:cc:c8:3c:cb:19",
            "net3": "06:ff:dc:26:3c:80",
            "net4": "c6:8a:91:f1:6a:25",
            "net5": "6e:36:d2:71:c0:4b",
            "net6": "a6:29:03:3d:29:8e",
            "net7": "b2:d6:5d:0c:8b:0e",
            "net8": "32:c9:95:f8:4d:5f",
            "net9": "22:95:c0:91:57:54"
        },
        "leaf_2_0_1": {
            "net0": "76:88:ef:cd:04:95",
            "net1": "56:27:63:99:90:ec",
            "net10": "02:56:87:89:ef:c1",
            "net11": "5a:ec:d1:a4:c3:0b",
            "net12": "e2:68:e8:8b:c5:49",
            "net13": "86:e5:cb:9d:94:4a",
            "net14": "8e:ec:56:9f:87:4b",
            "net15": "fa:8b:c0:e4:59:41",
            "net16": "ba:3b:ba:27:b1:21",
            "net2": "fa:bb:be:f6:3b:d3",
            "net3": "f6:7a:30:dd:55:bc",
            "net4": "22:42:6d:e2:49:97",
            "net5": "9e:09:9a:fb:0f:24",
            "net6": "26:f5:da:56:41:66",
            "net7": "ae:bc:f3:ab:24:32",
            "net8": "a6:ac:69:02:0e:18",
            "net9": "a6:e7:e2:6b:8f:a2"
        },
        "leaf_2_0_10": {
            "net0": "ce:53:f2:86:f7:dc",
            "net1": "86:78:df:67:bd:d0",
            "net10": "ca:83:fb:76:56:40",
            "net11": "aa:65:48:a7:8c:bf",
            "net12": "5e:5d:b3:df:7f:6a",
            "net13": "5a:8f:b1:07:86:19",
            "net14": "6e:cb:84:ce:89:d6",
            "net15": "72:43:5a:2b:ac:07",
            "net16": "8e:ba:d4:65:97:42",
            "net2": "06:ff:1c:55:84:1e",
            "net3": "d6:83:48:e2:d6:e4",
            "net4": "d6:2c:de:81:61:75",
            "net5": "f2:c9:39:b6:fa:62",
            "net6": "3a:03:bc:27:87:3d",
            "net7": "62:91:d6:d1:d1:a8",
            "net8": "aa:5b:56:08:e8:72",
            "net9": "36:b1:da:e4:0e:e5"
        },
        "leaf_2_0_11": {
            "net0": "02:bb:8d:54:df:3e",
            "net1": "f6:49:c8:69:fc:0d",
            "net10": "d6:18:b6:25:9e:28",
            "net11": "32:66:9b:ec:05:d8",
            "net12": "7a:6a:84:19:b5:15",
            "net13": "12:a8:02:63:83:1a",
            "net14": "16:53:b5:16:b2:33",
            "net15": "02:f4:09:de:45:a2",
            "net16": "12:cc:c7:dd:b0:c0",
            "net2": "72:c6:aa:82:95:bb",
            "net3": "92:1b:1b:14:41:5b",
            "net4": "9a:e6:bd:e5:1e:42",
            "net5": "aa:b5:c4:39:8b:81",
            "net6": "d2:d1:35:21:ec:69",
            "net7": "ea:12:7e:eb:8a:d9",
            "net8": "2e:84:ee:0b:4b:84",
            "net9": "ae:2d:e6:07:0b:43"
        },
        "leaf_2_0_12": {
            "net0": "12:c8:5e:4f:2a:d6",
            "net1": "12:59:57:02:0f:87",
            "net10": "3e:48:3b:81:3b:ee",
            "net11": "0a:08:eb:87:33:d2",
            "net12": "ce:51:df:c8:3c:5c",
            "net13": "aa:73:e2:65:3f:b3",
            "net14": "ae:b2:92:9b:8d:e0",
            "net15": "ea:6a:7d:4c:d7:c9",
            "net16": "7a:e6:52:bf:a0:c9",
            "net2": "7a:bc:e4:7f:7c:e9",
            "net3": "06:ba:fe:2e:a9:a6",
            "net4": "a2:10:33:24:00:e6",
            "net5": "0a:ca:d5:9e:8b:5c",
            "net6": "fa:b4:86:28:5d:e8",
            "net7": "d2:a2:bd:96:aa:cf",
            "net8": "ea:a8:22:63:04:68",
            "net9": "2a:1b:f3:3f:75:53"
        },
        "leaf_2_0_13": {
            "net0": "1e:32:5a:3e:04:9d",
            "net1": "5a:b8:c7:6a:79:26",
            "net10": "9e:f9:a1:20:8c:7d",
            "net11": "26:82:c7:e0:4e:50",
            "net12": "82:26:fa:dc:1f:90",
            "net13": "72:00:ab:21:62:f4",
            "net14": "a6:1d:f8:e4:b5:ee",
            "net15": "26:4a:15:a1:20:62",
            "net16": "92:28:5f:1c:b1:4b",
            "net2": "ba:9a:71:34:57:6b",
            "net3": "8a:a7:9e:21:31:3b",
            "net4": "ce:a0:be:e3:d8:52",
            "net5": "52:6a:56:a5:88:69",
            "net6": "82:09:32:9f:d4:04",
            "net7": "26:54:f5:03:40:03",
            "net8": "b2:ab:48:f5:bb:56",
            "net9": "9a:50:db:94:69:69"
        },
        "leaf_2_0_14": {
            "net0": "16:fd:8d:6e:a8:95",
            "net1": "06:84:26:0c:de:f4",
            "net10": "7a:b1:fc:3a:40:5e",
            "net11": "d2:bf:de:e8:30:68",
            "net12": "76:a4:32:02:9e:a3",
            "net13": "8e:f4:d2:81:22:8c",
            "net14": "a2:31:cd:68:da:04",
            "net15": "ba:d1:2b:95:66:eb",
            "net16": "da:cf:f4:d1:60:6d",
            "net2": "ae:3b:9f:0a:1c:fe",
            "net3": "92:f5:53:4e:ef:2d",
            "net4": "12:91:13:6a:b4:5a",
            "net5": "be:fc:e3:ee:a2:03",
            "net6": "d2:85:b3:8b:ba:f9",
            "net7": "c2:e4:be:25:07:56",
            "net8": "d6:07:1f:4f:e9:b3",
            "net9": "0a:b1:73:9b:21:de"
        },
        "leaf_2_0_15": {
            "net0": "de:dd:b2:34:c5:52",
            "net1": "7e:46:e5:d4:77:a8",
            "net10": "22:e0:e1:c3:83:61",
            "net11": "f2:e1:4c:b8:8b:64",
            "net12": "be:bb:26:6f:82:e7",
            "net13": "a6:4f:72:9d:7a:a1",
            "net14": "e2:37:bc:d6:5d:f5",
            "net15": "2e:40:26:de:61:e4",
            "net16": "3a:6f:3f:cf:bb:4f",
            "net2": "be:e5:75:b3:15:e2",
            "net3": "a6:9d:32:9f:63:fc",
            "net4": "12:5b:43:98:ae:14",
            "net5": "02:b3:4b:d6:dc:62",
            "net6": "3a:23:27:63:ed:18",
            "net7": "2e:34:41:3d:43:40",
            "net8": "06:b7:be:79:86:87",
            "net9": "e2:fd:db:84:25:ae"
        },
        "leaf_2_0_16": {
            "net0": "06:95:a3:32:53:f7",
            "net1": "9a:c9:2c:1e:95:c1",
            "net10": "96:d5:c6:c6:40:18",
            "net11": "12:b5:f0:cc:2e:b5",
            "net12": "8e:7a:6d:c3:66:29",
            "net13": "46:88:0b:0b:82:a4",
            "net14": "16:57:ed:03:0b:1d",
            "net15": "aa:3b:17:7e:d5:fb",
            "net16": "c6:71:20:12:79:52",
            "net2": "ce:ad:29:f4:f9:62",
            "net3": "a2:3a:53:d1:7a:49",
            "net4": "0a:2f:9f:94:ea:95",
            "net5": "fe:70:08:ba:05:e4",
            "net6": "9e:d5:c6:dd:e2:a6",
            "net7": "ce:47:ca:6b:28:4b",
            "net8": "62:2c:3b:03:aa:43",
            "net9": "26:ad:be:d3:91:7a"
        },
        "leaf_2_0_2": {
            "net0": "16:27:17:a0:dc:37",
            "net1": "4e:29:9b:11:25:9c",
            "net10": "1e:cd:64:21:d5:38",
            "net11": "a6:40:7c:ca:ad:a8",
            "net12": "7e:fe:55:d9:af:c1",
            "net13": "36:45:9f:bc:ed:b8",
            "net14": "0a:95:5b:a8:67:a5",
            "net15": "a2:4d:3d:1f:82:a8",
            "net16": "02:90:9f:d6:05:a3",
            "net2": "7e:dc:b2:2a:b6:f4",
            "net3": "ea:6a:11:26:aa:a6",
            "net4": "6a:dc:99:11:a1:82",
            "net5": "ca:c1:e5:c1:2a:4d",
            "net6": "2e:80:f9:1f:9f:09",
            "net7": "7a:70:6c:d9:f9:74",
            "net8": "02:93:fb:db:b7:c0",
            "net9": "f2:77:0d:43:24:f7"
        },
        "leaf_2_0_3": {
            "net0": "46:67:89:4d:74:bb",
            "net1": "46:4b:62:57:15:ed",
            "net10": "7a:37:f0:42:d4:c6",
            "net11": "96:b6:5b:5c:9a:0c",
            "net12": "da:08:75:b2:d4:a5",
            "net13": "ba:0a:1a:23:6f:f7",
            "net14": "9e:40:c6:9d:ec:70",
            "net15": "22:77:45:9f:ce:f9",
            "net16": "6e:f7:6b:a9:46:c4",
            "net2": "d2:e1:78:43:80:43",
            "net3": "d2:f8:bd:cb:bf:cd",
            "net4": "7a:9d:64:1b:ac:02",
            "net5": "7a:1e:76:1b:66:c6",
            "net6": "16:89:e1:8b:bc:d3",
            "net7": "22:c5:84:bc:50:32",
            "net8": "4a:d1:7f:31:24:90",
            "net9": "0a:f0:dd:32:1b:0c"
        },
        "leaf_2_0_4": {
            "net0": "da:d1:2b:64:56:5f",
            "net1": "62:ce:4b:31:81:86",
            "net10": "82:b3:6f:d8:71:f2",
            "net11": "32:c0:80:5e:92:cc",
            "net12": "7e:5d:b4:c0:e3:23",
            "net13": "a6:54:d2:23:fc:a5",
            "net14": "be:b0:2d:07:e8:34",
            "net15": "12:12:dc:b2:58:38",
            "net16": "b6:81:9e:29:98:be",
            "net2": "de:6b:1a:4b:aa:32",
            "net3": "0a:d5:31:03:c2:52",
            "net4": "2a:8d:17:d4:ae:4d",
            "net5": "ee:f7:34:dc:83:3a",
            "net6": "d6:c3:c2:88:5c:06",
            "net7": "b2:68:8c:4f:77:ea",
            "net8": "ae:1b:ba:9c:d8:03",
            "net9": "06:9b:ec:03:bb:f5"
        },
        "leaf_2_0_5": {
            "net0": "da:a3:8f:a2:e1:66",
            "net1": "ba:5c:6f:e8:71:eb",
            "net10": "e6:43:1a:fe:a3:47",
            "net11": "d2:9d:f4:a5:a6:46",
            "net12": "c6:68:d9:e0:67:ac",
            "net13": "a6:d9:df:6f:c8:18",
            "net14": "7e:6f:b4:c4:37:c1",
            "net15": "9a:22:85:d7:10:28",
            "net16": "b6:72:5e:86:b8:d2",
            "net2": "f2:4c:ca:42:d3:60",
            "net3": "d2:c3:ed:3e:4f:5d",
            "net4": "6e:a7:a8:23:71:c4",
            "net5": "46:f0:df:79:26:e3",
            "net6": "fe:14:e3:f5:46:a4",
            "net7": "aa:4f:b6:da:f2:33",
            "net8": "9a:88:4c:13:3b:a5",
            "net9": "46:4f:68:89:87:13"
        },
        "leaf_2_0_6": {
            "net0": "2e:ff:15:04:f3:58",
            "net1": "42:55:68:4d:b1:aa",
            "net10": "5a:7b:89:36:15:f0",
            "net11": "f2:40:02:a8:a9:80",
            "net12": "16:b0:e7:a9:c5:0a",
            "net13": "52:06:36:ff:0f:1a",
            "net14": "66:77:a5:3b:aa:a4",
            "net15": "16:57:8c:9f:27:30",
            "net16": "0a:a7:74:38:a9:ba",
            "net2": "92:f7:db:77:b3:a4",
            "net3": "a2:45:df:e5:d1:dd",
            "net4": "c6:ec:94:45:ad:53",
            "net5": "36:f5:b9:c3:e4:e1",
            "net6": "ca:eb:fc:fc:40:dd",
            "net7": "1e:20:5b:d8:60:1d",
            "net8": "6a:8f:59:d2:f1:80",
            "net9": "66:2c:e6:b2:b7:f2"
        },
        "leaf_2_0_7": {
            "net0": "36:21:b1:7b:d7:07",
            "net1": "52:b7:f5:fe:eb:43",
            "net10": "6e:d3:93:61:c0:c3",
            "net11": "9e:07:4b:b0:7b:96",
            "net12": "c6:3d:56:53:ca:ae",
            "net13": "82:de:e8:ea:5e:58",
            "net14": "26:25:00:d5:35:ef",
            "net15": "ba:03:76:f4:ad:e6",
            "net16": "fe:f5:ae:8b:79:a5",
            "net2": "e6:f8:4f:19:37:01",
            "net3": "ce:aa:50:ad:ef:34",
            "net4": "46:07:16:b5:af:e7",
            "net5": "8a:3f:11:2f:0e:8b",
            "net6": "d2:09:20:5b:40:5a",
            "net7": "46:bc:6d:cc:ae:18",
            "net8": "7e:f7:51:00:a9:7a",
            "net9": "5e:18:8d:d2:1c:e9"
        },
        "leaf_2_0_8": {
            "net0": "6a:80:2c:ff:96:32",
            "net1": "42:e0:42:d6:14:b7",
            "net10": "a6:0e:47:e4:80:23",
            "net11": "f2:82:39:36:51:08",
            "net12": "1e:e2:f3:5d:0a:4b",
            "net13": "86:7c:b1:51:5f:07",
            "net14": "ca:f7:fd:5d:51:91",
            "net15": "b6:47:c6:2d:a9:c4",
            "net16": "ee:dd:ce:4f:b5:7e",
            "net2": "7e:67:df:0c:11:a9",
            "net3": "76:31:d7:8c:c6:0b",
            "net4": "22:b7:5c:e5:69:c1",
            "net5": "6e:4c:19:25:c4:48",
            "net6": "26:61:56:0d:cf:ce",
            "net7": "3a:38:9a:45:7f:a7",
            "net8": "82:14:75:ba:b5:17",
            "net9": "ae:89:9e:87:59:0a"
        },
        "leaf_2_0_9": {
            "net0": "1e:b8:99:63:1d:9a",
            "net1": "42:eb:98:b0:18:ba",
            "net10": "ea:2c:fc:9f:c6:fa",
            "net11": "4a:74:5e:44:0d:0c",
            "net12": "0e:13:52:32:a7:1d",
            "net13": "a6:cd:a9:14:47:9d",
            "net14": "96:21:f0:34:e1:8d",
            "net15": "22:31:93:9b:3a:cb",
            "net16": "2e:d9:c2:a5:bf:01",
            "net2": "8a:62:52:41:22:2d",
            "net3": "32:4a:86:f3:9e:23",
            "net4": "da:1b:17:2d:dc:fb",
            "net5": "a6:96:df:ae:0d:fc",
            "net6": "ae:55:d6:cd:36:34",
            "net7": "ce:12:ac:b8:b3:68",
            "net8": "aa:4d:57:b7:8b:bb",
            "net9": "36:e1:1e:f6:1a:f5"
        },
        "spine_1_1_1": {
            "net0": "fe:76:bd:51:ee:74",
            "net1": "86:b2:5c:a9:84:a3",
            "net10": "7a:b6:59:cf:30:57",
            "net11": "1e:43:bc:23:18:6b",
            "net12": "1a:ce:cd:75:81:a8",
            "net13": "fa:dc:52:7f:04:1e",
            "net14": "72:d6:78:80:25:3e",
            "net15": "6e:ad:77:de:2e:62",
            "net16": "4a:68:05:29:d3:5e",
            "net17": "b6:e7:f6:74:f0:b6",
            "net18": "36:3b:4c:55:e7:5f",
            "net19": "96:4a:69:a7:e6:14",
            "net2": "1a:c2:cf:01:4c:ec",
            "net20": "7e:85:d5:07:3c:76",
            "net21": "ee:b1:03:b4:48:55",
            "net22": "6e:fe:0d:1d:d1:12",
            "net23": "f2:c4:b6:8b:eb:44",
            "net24": "b6:24:a2:f0:c1:36",
            "net25": "1e:43:f1:9a:b1:57",
            "net26": "ca:76:87:d1:65:94",
            "net27": "4e:5f:52:e0:f5:b1",
            "net28": "9a:9f:e8:82:87:7b",
            "net29": "0e:65:bd:53:f4:95",
            "net3": "5a:c5:7f:0a:ea:7e",
            "net30": "aa:30:e7:c1:0c:a6",
            "net31": "0a:5c:bb:eb:dd:58",
            "net4": "36:70:6d:00:c1:94",
            "net5": "f2:fa:7b:e6:2b:47",
            "net6": "7a:be:c7:5b:f8:da",
            "net7": "ce:1e:64:1f:bc:48",
            "net8": "ee:ce:36:32:61:51",
            "net9": "e6:13:30:b0:28:b2"
        },
        "spine_1_1_10": {
            "net0": "6a:5f:bc:8e:21:54",
            "net1": "d6:68:24:f7:14:8a",
            "net10": "22:59:c2:18:77:6b",
            "net11": "fe:88:e2:ae:59:1a",
            "net12": "52:8c:d0:85:82:b9",
            "net13": "c6:b0:db:bf:06:c8",
            "net14": "66:84:8d:77:86:87",
            "net15": "fa:c0:de:ef:d7:2d",
            "net16": "ce:0b:54:8b:36:5a",
            "net17": "0a:56:08:e0:4f:7e",
            "net18": "b6:30:0c:d3:66:ac",
            "net19": "32:d6:d9:3c:3d:30",
            "net2": "26:dd:b0:35:7a:3c",
            "net20": "8e:07:4f:3e:a7:0f",
            "net21": "a6:8d:f3:db:d9:89",
            "net22": "fe:0e:e3:3b:04:cb",
            "net23": "ba:6b:91:d3:51:4c",
            "net24": "02:c7:84:c9:a2:88",
            "net25": "b2:5e:ab:6f:a0:a3",
            "net26": "8e:9f:b0:65:65:e4",
            "net27": "2a:ae:cc:12:ca:12",
            "net28": "3a:08:97:26:7f:d7",
            "net29": "1e:4a:46:c4:c4:02",
            "net3": "6e:15:92:e3:43:da",
            "net30": "9a:3f:73:3f:58:d0",
            "net31": "b6:a4:cd:33:ae:ba",
            "net4": "da:11:e3:d9:5f:4f",
            "net5": "aa:a0:bd:3b:85:91",
            "net6": "7a:ec:d7:ca:93:9e",
            "net7": "ce:f9:f6:07:ac:44",
            "net8": "52:e3:d8:d2:ce:a0",
            "net9": "8a:29:2c:95:97:3a"
        },
        "spine_1_1_11": {
            "net0": "52:df:dc:40:64:10",
            "net1": "4e:3c:8f:0b:fb:e2",
            "net10": "5e:81:63:da:ce:51",
            "net11": "56:81:61:e5:a2:7d",
            "net12": "aa:22:42:08:19:a8",
            "net13": "e6:a9:ce:da:5d:78",
            "net14": "16:c6:c6:b4:1e:d6",
            "net15": "2e:17:ea:88:02:cb",
            "net16": "4e:c2:d9:19:15:6a",
            "net17": "c6:f1:6d:0b:89:bf",
            "net18": "72:67:fd:8f:fe:8d",
            "net19": "4a:82:a4:a0:16:24",
            "net2": "d2:10:2e:fb:21:7f",
            "net20": "5e:31:7e:35:61:34",
            "net21": "5a:fb:f6:65:6e:b8",
            "net22": "0e:69:e2:7b:a3:ad",
            "net23": "9e:d6:0c:19:ec:e7",
            "net24": "ce:5a:a3:bd:da:fd",
            "net25": "8a:73:62:c7:35:4a",
            "net26": "e2:b3:b7:e6:aa:e7",
            "net27": "fa:43:eb:02:19:5b",
            "net28": "1a:72:cf:32:90:38",
            "net29": "82:73:73:1b:5e:6d",
            "net3": "ce:e6:50:7e:22:d8",
            "net30": "ce:38:f6:cd:1d:91",
            "net31": "f2:3b:ea:4d:1b:df",
            "net4": "f2:66:0f:ad:ce:cd",
            "net5": "62:99:8d:e3:08:34",
            "net6": "62:b4:6d:56:02:4a",
            "net7": "ca:96:d7:e7:0b:00",
            "net8": "ba:eb:38:57:66:24",
            "net9": "9a:ad:59:0f:8d:f8"
        },
        "spine_1_1_12": {
            "net0": "ea:9b:4d:7a:52:b3",
            "net1": "3e:7d:de:92:a5:02",
            "net10": "fe:cf:c0:d9:08:35",
            "net11": "06:17:0b:06:40:3f",
            "net12": "42:57:91:46:56:ce",
            "net13": "26:f4:8c:ab:53:89",
            "net14": "0a:0b:be:47:8b:05",
            "net15": "1e:a1:20:fb:20:5b",
            "net16": "7a:c9:d0:88:17:3b",
            "net17": "02:2e:80:df:53:c9",
            "net18": "ce:66:5d:ba:75:50",
            "net19": "36:3a:ce:bf:f2:8a",
            "net2": "2a:c4:a6:f6:e0:cd",
            "net20": "72:9c:c0:96:cb:e0",
            "net21": "42:ff:46:35:f7:78",
            "net22": "a6:4f:91:e5:c4:15",
            "net23": "2e:e5:10:8d:c0:dd",
            "net24": "12:ab:dd:bb:c7:f3",
            "net25": "de:22:53:7f:d4:40",
            "net26": "9a:60:18:07:87:2a",
            "net27": "96:73:74:75:f1:df",
            "net28": "9e:52:81:32:01:79",
            "net29": "46:20:3d:d2:f1:40",
            "net3": "5e:52:c4:92:77:dc",
            "net30": "92:f5:6a:3c:f4:b8",
            "net31": "ea:cc:f3:83:08:f1",
            "net4": "ce:76:39:5e:46:82",
            "net5": "ae:17:b0:e8:f1:59",
            "net6": "8a:02:37:58:f7:56",
            "net7": "86:d8:23:3a:f3:fb",
            "net8": "3a:0f:2e:08:0e:e3",
            "net9": "fe:a5:30:40:76:ba"
        },
        "spine_1_1_13": {
            "net0": "5a:5e:56:ff:2c:c1",
            "net1": "ae:2c:ea:34:56:92",
            "net10": "5a:df:c7:ad:7b:e5",
            "net11": "12:39:f7:16:08:c5",
            "net12": "16:d8:51:2f:f5:57",
            "net13": "b6:03:2d:98:62:62",
            "net14": "96:ee:2a:9b:e9:3d",
            "net15": "a2:1d:ad:01:c9:76",
            "net16": "06:4f:f6:a5:bd:f9",
            "net17": "da:39:93:a9:ef:99",
            "net18": "82:73:28:66:9e:e7",
            "net19": "9e:da:05:fc:08:3d",
            "net2": "ba:d7:fb:af:0c:a8",
            "net20": "9e:eb:b9:8c:14:74",
            "net21": "fe:57:ac:b0:ef:00",
            "net22": "0a:76:c9:1c:44:66",
            "net23": "7e:a5:0b:af:2e:4f",
            "net24": "f2:c7:55:58:e2:af",
            "net25": "2e:5b:ec:c6:58:a2",
            "net26": "62:15:23:50:5a:63",
            "net27": "aa:0a:ff:a9:9b:ef",
            "net28": "96:d0:5f:01:ac:ff",
            "net29": "9e:91:ea:ba:a8:64",
            "net3": "1a:bc:22:1c:1f:79",
            "net30": "8a:4c:a7:10:71:9c",
            "net31": "22:f4:56:a5:93:f4",
            "net4": "7a:9f:28:4b:28:15",
            "net5": "72:5e:b2:12:40:b5",
            "net6": "52:55:c3:91:57:01",
            "net7": "5e:7d:56:65:b0:a6",
            "net8": "7e:d1:55:71:de:e6",
            "net9": "8e:ff:a0:5a:91:04"
        },
        "spine_1_1_14": {
            "net0": "ca:8c:8e:09:67:d3",
            "net1": "06:95:86:1f:3a:13",
            "net10": "da:5a:c8:a7:b4:41",
            "net11": "3a:07:25:6f:7d:c6",
            "net12": "12:3f:28:3b:dc:81",
            "net13": "0e:82:db:44:2e:3d",
            "net14": "0e:04:77:ba:53:ca",
            "net15": "86:5a:2a:61:86:c4",
            "net16": "ca:49:e7:0e:b5:5e",
            "net17": "aa:a1:2d:a5:75:8c",
            "net18": "0e:e2:26:51:27:e0",
            "net19": "72:d3:d9:c5:ba:91",
            "net2": "e6:32:6c:8c:b9:9c",
            "net20": "82:3c:12:a5:67:23",
            "net21": "16:7d:f2:26:ff:8d",
            "net22": "02:8d:f4:3e:cf:e5",
            "net23": "36:b9:5d:cf:6d:10",
            "net24": "0a:9f:cb:fa:2b:1b",
            "net25": "e6:17:d2:1c:82:ac",
            "net26": "92:b9:f2:8d:41:eb",
            "net27": "6a:b1:d6:cd:7f:c7",
            "net28": "66:21:d5:94:fd:72",
            "net29": "b2:78:18:8c:ba:1e",
            "net3": "8e:b5:2d:74:e0:b8",
            "net30": "ee:42:24:15:5f:93",
            "net31": "0e:17:7a:31:6a:ae",
            "net4": "96:c2:51:62:fc:ac",
            "net5": "1a:e6:32:47:e7:43",
            "net6": "82:40:a0:5d:a4:ca",
            "net7": "72:e2:4d:b3:e6:18",
            "net8": "1a:4d:e2:4f:b6:fe",
            "net9": "52:59:a3:e1:d9:7a"
        },
        "spine_1_1_15": {
            "net0": "76:c8:33:f7:2a:2f",
            "net1": "ca:7e:98:66:b0:88",
            "net10": "c6:ce:88:0e:54:76",
            "net11": "3e:76:bd:20:08:b5",
            "net12": "9a:48:13:8e:7a:c2",
            "net13": "7e:ae:8e:cc:aa:28",
            "net14": "1a:a3:c4:4b:b2:3e",
            "net15": "0e:07:36:68:ce:36",
            "net16": "ba:35:4c:c2:e4:a0",
            "net17": "aa:03:ed:30:cd:4a",
            "net18": "b6:f6:43:30:2c:06",
            "net19": "fa:f2:d5:28:dd:5d",
            "net2": "fe:a4:34:58:96:5c",
            "net20": "9a:7b:da:32:12:d7",
            "net21": "86:3a:4d:03:77:71",
            "net22": "d6:1b:86:00:67:80",
            "net23": "42:2b:5c:94:12:2d",
            "net24": "6e:68:76:b2:02:77",
            "net25": "aa:e4:fe:00:13:46",
            "net26": "2a:a1:32:75:d7:7c",
            "net27": "f6:57:eb:1d:37:8d",
            "net28": "72:09:1a:0f:1f:bd",
            "net29": "52:18:05:f4:9a:e0",
            "net3": "ba:bc:9a:65:8c:3c",
            "net30": "7a:0d:c3:e6:e5:3c",
            "net31": "1e:5e:2d:d3:89:30",
            "net4": "1e:9a:03:04:ac:3a",
            "net5": "0a:af:d2:e8:a5:6a",
            "net6": "e2:5b:26:34:d8:24",
            "net7": "32:ad:f0:ae:a9:e2",
            "net8": "62:43:8b:e9:ee:c0",
            "net9": "2a:22:60:26:a2:84"
        },
        "spine_1_1_16": {
            "net0": "06:92:cb:c3:7d:a9",
            "net1": "6a:3b:65:ca:6c:60",
            "net10": "ea:73:74:10:b1:61",
            "net11": "7e:8f:9c:33:4f:51",
            "net12": "ca:e4:a0:05:e6:3b",
            "net13": "ba:c3:33:e4:38:5c",
            "net14": "a6:42:55:de:21:eb",
            "net15": "7e:42:fb:06:ca:f8",
            "net16": "6e:71:8c:05:3d:f4",
            "net17": "46:07:13:68:c0:81",
            "net18": "2e:bf:20:6f:3e:96",
            "net19": "9e:17:67:66:2a:c9",
            "net2": "46:8b:5c:ef:39:5f",
            "net20": "5a:ea:e1:63:08:4f",
            "net21": "62:c9:30:cb:b5:79",
            "net22": "f6:bc:12:92:99:4a",
            "net23": "d6:f7:98:b1:35:db",
            "net24": "d2:b8:dc:76:2f:37",
            "net25": "0e:4a:01:1b:8e:65",
            "net26": "62:e9:0f:e2:7c:42",
            "net27": "92:f9:b9:68:dc:5d",
            "net28": "3e:fa:16:61:b3:b9",
            "net29": "a2:18:f2:61:e5:e1",
            "net3": "fe:75:fb:c4:8b:b1",
            "net30": "b6:23:a4:32:4d:fd",
            "net31": "0e:08:ad:40:b4:a2",
            "net4": "2a:29:8f:0e:61:61",
            "net5": "c2:a4:68:34:be:d0",
            "net6": "96:58:54:4b:4d:97",
            "net7": "96:5c:e8:02:47:d7",
            "net8": "02:c9:b2:7a:26:d5",
            "net9": "ea:a3:da:ab:fa:6d"
        },
        "spine_1_1_2": {
            "net0": "72:d9:25:09:78:67",
            "net1": "1e:98:4e:39:d4:9a",
            "net10": "92:c9:20:8d:3c:af",
            "net11": "8e:79:b4:cf:7a:d4",
            "net12": "82:e6:88:55:95:5e",
            "net13": "1a:14:77:71:11:84",
            "net14": "42:82:f0:b5:b6:92",
            "net15": "d6:10:6b:6e:90:65",
            "net16": "02:e4:28:05:24:2f",
            "net17": "32:eb:d5:43:7a:6b",
            "net18": "ee:e7:68:40:21:db",
            "net19": "82:09:39:ea:e1:cd",
            "net2": "86:87:da:eb:77:49",
            "net20": "8e:76:6d:b6:53:65",
            "net21": "ca:1f:12:c7:1a:80",
            "net22": "a2:05:cd:a8:ae:94",
            "net23": "92:1f:10:45:4d:e0",
            "net24": "2e:df:a9:7f:9b:2d",
            "net25": "b6:08:8b:ee:62:a2",
            "net26": "0e:af:c2:88:e1:5c",
            "net27": "86:39:16:b2:23:a2",
            "net28": "9e:ae:d5:56:3c:62",
            "net29": "be:95:f4:01:85:9c",
            "net3": "2a:3c:04:cc:94:c2",
            "net30": "1a:46:53:6a:f8:dd",
            "net31": "ea:9b:c4:ea:9e:3e",
            "net4": "96:5c:90:32:05:98",
            "net5": "56:15:52:f6:fb:3e",
            "net6": "26:92:94:ab:87:8f",
            "net7": "ae:61:77:86:64:20",
            "net8": "c2:b1:09:e4:8a:a7",
            "net9": "06:89:cd:03:1e:a4"
        },
        "spine_1_1_3": {
            "net0": "0e:43:0f:bd:83:23",
            "net1": "4e:54:53:ba:98:c7",
            "net10": "f2:b0:8c:4b:c6:f1",
            "net11": "62:ae:4d:86:cf:73",
            "net12": "72:82:a6:55:32:9d",
            "net13": "a6:c6:97:da:84:23",
            "net14": "aa:60:40:40:8e:69",
            "net15": "fa:87:81:52:18:8a",
            "net16": "2e:c3:6c:d5:39:51",
            "net17": "ba:4b:ab:e5:20:d8",
            "net18": "ce:43:e4:42:9f:82",
            "net19": "d6:24:fa:77:49:8c",
            "net2": "aa:c0:12:ba:c7:a9",
            "net20": "b2:45:9b:b9:be:a3",
            "net21": "4a:18:16:69:0f:c4",
            "net22": "fa:bc:d4:08:60:db",
            "net23": "ce:90:15:a6:41:94",
            "net24": "aa:79:09:76:59:b8",
            "net25": "96:9e:0c:bc:e4:8e",
            "net26": "56:45:93:3a:f2:04",
            "net27": "c2:87:88:8c:45:b7",
            "net28": "46:4f:6c:4f:81:c2",
            "net29": "92:d0:a4:fe:37:b2",
            "net3": "d6:2b:21:96:22:08",
            "net30": "e2:23:95:1e:75:c8",
            "net31": "66:e8:58:f0:74:a1",
            "net4": "4a:bd:18:c2:a2:34",
            "net5": "02:1b:01:75:58:52",
            "net6": "66:4f:e8:44:7e:d8",
            "net7": "3e:09:08:80:16:1c",
            "net8": "82:e5:2e:d8:63:a2",
            "net9": "8e:02:df:fb:ba:67"
        },
        "spine_1_1_4": {
            "net0": "ce:7d:5a:0f:f7:be",
            "net1": "de:2a:1c:22:4e:94",
            "net10": "3e:b4:65:9b:3f:6d",
            "net11": "7a:8e:4b:86:b8:3c",
            "net12": "e2:2a:9c:52:89:90",
            "net13": "32:34:a0:ad:a7:28",
            "net14": "e2:36:1d:59:ed:b7",
            "net15": "62:24:60:63:45:ee",
            "net16": "26:1e:3d:a4:5b:21",
            "net17": "aa:dd:c4:10:67:80",
            "net18": "ba:b6:91:3e:bb:9c",
            "net19": "de:5f:89:bb:32:2b",
            "net2": "26:bd:f0:34:1a:b6",
            "net20": "32:a3:b6:cc:88:d4",
            "net21": "5a:f2:c0:ab:39:2e",
            "net22": "3a:92:a5:19:8a:a0",
            "net23": "1e:dd:f2:a4:31:bf",
            "net24": "f6:cb:be:26:51:80",
            "net25": "46:16:a5:20:84:5f",
            "net26": "32:df:7c:dd:99:16",
            "net27": "ea:4b:67:6b:c7:64",
            "net28": "5a:1d:14:38:1d:84",
            "net29": "6a:60:62:cd:99:21",
            "net3": "46:fa:79:c3:29:0b",
            "net30": "c6:2f:96:dc:38:91",
            "net31": "6e:80:fa:16:00:bd",
            "net4": "4e:61:0e:7a:78:4f",
            "net5": "e2:1f:6f:c8:97:fe",
            "net6": "9a:58:66:b4:48:94",
            "net7": "1a:4e:8d:27:8b:f5",
            "net8": "ca:bf:ff:c2:62:5e",
            "net9": "42:13:67:f9:ff:af"
        },
        "spine_1_1_5": {
            "net0": "92:ce:fd:a5:2a:d2",
            "net1": "e2:9f:a7:0b:8d:d0",
            "net10": "2a:ae:e6:07:32:dc",
            "net11": "86:8b:0c:d8:83:de",
            "net12": "b6:07:fa:9e:fb:28",
            "net13": "02:77:de:7a:35:f8",
            "net14": "fa:ab:54:84:d8:f8",
            "net15": "d2:49:b8:4e:95:7e",
            "net16": "16:93:84:35:cc:da",
            "net17": "9e:1b:01:c5:71:62",
            "net18": "a2:f6:38:7e:1d:15",
            "net19": "62:9a:a2:d9:8e:32",
            "net2": "ae:c7:2c:f9:7e:f1",
            "net20": "da:7b:f6:d5:55:1b",
            "net21": "96:a0:99:cc:3b:2f",
            "net22": "8a:f9:d4:4c:16:96",
            "net23": "b6:84:f3:02:5d:29",
            "net24": "0a:80:c0:e2:eb:f7",
            "net25": "7a:60:e7:8a:c7:7f",
            "net26": "ea:bd:af:91:1e:cf",
            "net27": "ca:f8:0b:a6:ed:d7",
            "net28": "16:b4:be:0a:6f:b2",
            "net29": "ce:d5:85:f6:78:31",
            "net3": "b6:47:ee:2e:e5:2b",
            "net30": "4a:5b:58:03:44:96",
            "net31": "32:18:2b:c4:b8:f7",
            "net4": "ae:b3:45:09:1e:90",
            "net5": "36:31:9e:0a:3b:d0",
            "net6": "52:3c:f3:c4:65:63",
            "net7": "fe:e4:1b:06:ad:58",
            "net8": "f2:75:52:2f:5d:fc",
            "net9": "02:98:e2:d4:09:59"
        },
        "spine_1_1_6": {
            "net0": "ca:1b:80:40:43:95",
            "net1": "8e:8e:51:db:5b:4d",
            "net10": "8e:3d:0c:57:c5:eb",
            "net11": "96:e4:00:e4:6f:67",
            "net12": "d6:66:48:bf:85:05",
            "net13": "92:22:91:18:83:33",
            "net14": "7e:ee:96:2c:ae:81",
            "net15": "52:5a:a7:8e:2a:75",
            "net16": "82:e2:f8:14:fd:5a",
            "net17": "92:e2:f5:7f:8a:9e",
            "net18": "5e:b8:b1:48:14:2a",
            "net19": "66:7d:a0:a1:0f:b7",
            "net2": "c2:0e:1b:2f:de:f8",
            "net20": "4e:2b:c6:bc:8e:28",
            "net21": "ea:71:6c:a9:db:a5",
            "net22": "c2:e4:b5:ff:40:82",
            "net23": "46:7b:ea:d3:dc:97",
            "net24": "ee:b3:61:39:f7:3f",
            "net25": "2e:25:63:c0:a7:65",
            "net26": "4e:58:e1:51:6f:ef",
            "net27": "e6:ff:e4:30:81:e8",
            "net28": "56:03:7c:41:25:07",
            "net29": "62:06:da:13:1e:3c",
            "net3": "86:86:82:83:4a:ba",
            "net30": "82:19:33:24:7c:a5",
            "net31": "7a:45:33:fe:9a:66",
            "net4": "d6:e0:e8:b0:be:dd",
            "net5": "2a:0f:17:b2:e7:b9",
            "net6": "46:c7:62:47:56:1f",
            "net7": "a6:be:1d:1b:3e:0f",
            "net8": "92:66:83:a0:01:55",
            "net9": "62:b4:41:ff:30:94"
        },
        "spine_1_1_7": {
            "net0": "46:b8:46:0f:dd:8a",
            "net1": "0a:2d:25:95:b0:cb",
            "net10": "16:fd:27:d5:c2:94",
            "net11": "22:65:1c:ba:a6:84",
            "net12": "d6:57:db:37:f9:6f",
            "net13": "1a:c2:2e:cb:55:80",
            "net14": "36:45:1c:e0:72:b5",
            "net15": "8a:fb:38:32:94:1d",
            "net16": "e2:b7:90:69:50:81",
            "net17": "fe:b8:fe:e7:22:8c",
            "net18": "aa:de:ff:27:a0:e3",
            "net19": "ca:e2:68:c5:ca:61",
            "net2": "c6:5f:9a:c5:7f:e1",
            "net20": "5a:2b:0b:1e:99:1e",
            "net21": "8a:79:e4:fe:94:77",
            "net22": "56:cb:d4:3a:8c:ab",
            "net23": "ae:ce:fd:8b:b6:37",
            "net24": "3e:0c:16:85:fd:63",
            "net25": "7a:e8:7a:2a:e2:55",
            "net26": "c2:b7:f6:56:55:d9",
            "net27": "fe:50:ca:90:cf:e1",
            "net28": "1a:ac:b9:e3:b7:51",
            "net29": "86:52:4f:15:1f:43",
            "net3": "0a:7f:12:d5:22:3a",
            "net30": "8e:c1:0e:f4:a1:1f",
            "net31": "56:6a:0d:ec:4e:6c",
            "net4": "8a:4f:6b:0e:7c:75",
            "net5": "ae:1c:f1:5a:21:b5",
            "net6": "d2:e9:bb:4b:7e:4a",
            "net7": "8a:7e:8a:ad:17:94",
            "net8": "f2:18:af:c7:13:d4",
            "net9": "52:f8:f0:7f:39:ab"
        },
        "spine_1_1_8": {
            "net0": "2a:ca:07:09:87:e3",
            "net1": "5e:68:c9:10:3e:c1",
            "net10": "02:6a:60:4f:84:0a",
            "net11": "3a:a0:e6:8b:24:35",
            "net12": "7e:53:7e:4f:f3:1d",
            "net13": "66:cc:f5:b1:76:16",
            "net14": "6a:20:0f:2b:62:6d",
            "net15": "e2:62:c8:77:3c:72",
            "net16": "02:e2:c0:3f:d8:cc",
            "net17": "fe:b9:32:cb:95:f0",
            "net18": "4e:bf:ad:ec:69:a6",
            "net19": "c2:5f:5b:97:3c:3a",
            "net2": "8a:1c:53:f5:54:39",
            "net20": "ea:0e:6d:a5:fa:a8",
            "net21": "42:67:39:04:65:ad",
            "net22": "3e:2e:50:c4:b9:0b",
            "net23": "be:e6:d0:fc:bf:cb",
            "net24": "8e:93:74:7a:8b:4b",
            "net25": "0a:15:5d:72:5d:c7",
            "net26": "12:84:16:79:d6:ff",
            "net27": "1a:df:a1:68:cd:a3",
            "net28": "6e:76:8f:a7:3e:02",
            "net29": "5a:af:08:e5:fe:15",
            "net3": "c6:85:fc:78:9d:27",
            "net30": "f6:d1:61:9b:4b:86",
            "net31": "06:13:a3:9c:ab:da",
            "net4": "d2:c7:f5:3a:a6:05",
            "net5": "06:14:9d:c1:dc:5a",
            "net6": "7a:4e:c9:79:62:ee",
            "net7": "ee:db:fa:11:c6:dd",
            "net8": "7e:49:76:b5:79:94",
            "net9": "fa:28:93:77:20:b4"
        },
        "spine_1_1_9": {
            "net0": "f6:db:0d:7c:b5:8e",
            "net1": "92:eb:e0:42:0b:f7",
            "net10": "5e:c4:2f:a4:14:0e",
            "net11": "7a:b7:ec:c3:58:85",
            "net12": "86:d9:25:c3:cd:aa",
            "net13": "9e:75:ad:eb:2a:f2",
            "net14": "c6:3c:f6:95:c1:1b",
            "net15": "ea:a4:48:3e:7c:7c",
            "net16": "6a:b7:f9:72:b4:ca",
            "net17": "22:5a:04:a3:d7:d8",
            "net18": "d6:bd:07:70:57:78",
            "net19": "3a:4f:b3:78:98:fb",
            "net2": "3e:ed:56:48:76:7c",
            "net20": "02:09:cd:33:a6:32",
            "net21": "d6:fb:ed:b3:17:6f",
            "net22": "06:84:98:d5:5f:0a",
            "net23": "be:20:5d:8b:05:b9",
            "net24": "36:b8:2a:09:d1:e7",
            "net25": "92:2d:e1:7e:53:0d",
            "net26": "8a:8f:64:48:dc:ca",
            "net27": "56:14:c1:89:af:1d",
            "net28": "ae:d9:4e:0c:29:0a",
            "net29": "06:51:73:35:6b:93",
            "net3": "d2:c8:17:36:9f:18",
            "net30": "92:e4:2e:ac:f6:2f",
            "net31": "02:1a:82:df:ae:9d",
            "net4": "3e:1a:39:f6:42:ae",
            "net5": "52:92:7c:2d:af:3b",
            "net6": "ca:4f:ac:dd:c8:07",
            "net7": "72:a5:53:61:3c:a8",
            "net8": "2e:db:7e:1b:97:ef",
            "net9": "e6:c3:a8:09:79:61"
        },
        "spine_2_1_1": {
            "net0": "ee:cf:fb:75:89:cd",
            "net1": "ba:95:ad:6d:4a:8b",
            "net10": "32:1b:df:f3:4e:89",
            "net11": "76:62:76:30:a9:f5",
            "net12": "8e:f3:b1:62:95:72",
            "net13": "6e:39:38:a5:56:02",
            "net14": "c2:9e:74:b3:5c:1f",
            "net15": "56:e7:69:d1:b8:c2",
            "net16": "8a:57:f5:ff:f8:ce",
            "net17": "c6:ed:be:50:dd:89",
            "net18": "42:25:d7:eb:84:bb",
            "net19": "36:5d:01:a5:95:c3",
            "net2": "3a:2a:fc:4c:bb:5a",
            "net20": "f2:02:55:f9:31:df",
            "net21": "ce:9c:f5:4f:31:82",
            "net22": "5e:24:32:93:69:06",
            "net23": "26:5f:ae:ae:18:a5",
            "net24": "62:1f:cb:31:4d:71",
            "net25": "7a:89:44:fa:78:84",
            "net26": "ba:ff:72:02:da:79",
            "net27": "b2:1c:fc:53:37:b7",
            "net28": "aa:72:fd:e3:f8:04",
            "net29": "86:d1:f9:45:11:12",
            "net3": "fe:38:d9:0a:8f:8e",
            "net30": "52:61:23:68:35:ea",
            "net31": "d2:93:c0:89:12:58",
            "net4": "9a:5b:95:6c:17:a4",
            "net5": "9a:10:4f:fe:44:b7",
            "net6": "aa:d0:08:0d:d2:97",
            "net7": "4e:73:0d:d8:99:c6",
            "net8": "66:f2:14:88:2e:1b",
            "net9": "8e:e6:7e:30:55:2c"
        },
        "spine_2_1_10": {
            "net0": "76:15:b6:83:dc:eb",
            "net1": "c2:f3:b2:13:e8:fd",
            "net10": "7e:6f:e6:f8:06:fe",
            "net11": "3a:d3:6b:8b:12:bd",
            "net12": "ba:e1:57:a7:aa:bc",
            "net13": "4e:fc:66:af:49:51",
            "net14": "ca:21:9c:80:01:55",
            "net15": "46:2b:33:a1:1e:ea",
            "net16": "ce:94:06:95:37:73",
            "net17": "96:88:78:d6:a2:e0",
            "net18": "66:40:a3:eb:f9:b9",
            "net19": "3e:cf:e4:01:1a:8e",
            "net2": "ce:8a:93:1e:82:e7",
            "net20": "a6:35:3a:19:4c:e1",
            "net21": "8a:9c:18:bf:22:b2",
            "net22": "22:12:40:8f:14:ad",
            "net23": "ae:c2:f3:b3:7b:5b",
            "net24": "12:bb:c6:8b:d6:06",
            "net25": "c2:1a:48:81:b2:fe",
            "net26": "be:b1:4e:28:bc:51",
            "net27": "6e:ff:03:7d:c2:5e",
            "net28": "de:d9:93:e2:0b:a1",
            "net29": "1e:77:86:b2:c5:64",
            "net3": "22:8c:ec:71:94:a0",
            "net30": "1e:fd:fa:f6:48:6d",
            "net31": "7a:d0:67:4e:98:b8",
            "net4": "c6:69:83:43:53:1c",
            "net5": "66:24:eb:28:f9:f2",
            "net6": "3e:68:e2:1c:bd:fe",
            "net7": "5a:65:54:51:c1:55",
            "net8": "b2:bd:34:d1:2c:52",
            "net9": "26:87:4d:c4:8b:e6"
        },
        "spine_2_1_11": {
            "net0": "b2:d7:d7:e7:4c:b0",
            "net1": "66:f4:38:e3:57:7f",
            "net10": "3e:ab:32:5c:ee:c4",
            "net11": "2e:97:bc:3d:f0:d3",
            "net12": "2a:c7:6b:3d:f4:98",
            "net13": "02:71:c7:6c:8c:92",
            "net14": "6e:3a:49:52:3b:1a",
            "net15": "16:97:a8:94:12:fc",
            "net16": "b6:cf:e5:7b:16:86",
            "net17": "06:27:66:a9:11:4a",
            "net18": "b2:c6:66:4a:4d:d4",
            "net19": "c6:05:74:a1:18:13",
            "net2": "7e:78:f0:93:bd:5f",
            "net20": "b2:c9:79:d0:a9:b9",
            "net21": "32:46:c2:6b:74:2e",
            "net22": "06:c3:1a:bd:c0:d8",
            "net23": "da:19:de:c3:3f:df",
            "net24": "8a:77:c4:ea:ca:d1",
            "net25": "e2:fb:b7:e8:a2:2a",
            "net26": "d6:23:45:69:10:d7",
            "net27": "d6:80:fd:ea:a4:f2",
            "net28": "ee:54:8c:82:58:e0",
            "net29": "2e:bf:c7:bf:ab:9c",
            "net3": "2a:67:cb:e2:ac:56",
            "net30": "7a:6b:68:00:28:b8",
            "net31": "8a:58:32:7a:8f:b2",
            "net4": "4e:91:95:7c:17:37",
            "net5": "ae:b8:9b:c2:8e:fd",
            "net6": "ae:85:a4:1e:06:f5",
            "net7": "e2:5b:f8:a1:8d:62",
            "net8": "a2:d3:bc:35:27:1a",
            "net9": "66:5e:d4:3a:d5:f2"
        },
        "spine_2_1_12": {
            "net0": "aa:72:94:00:02:9b",
            "net1": "ea:36:dc:69:33:98",
            "net10": "32:a5:92:22:de:69",
            "net11": "76:7f:c4:fc:a3:f3",
            "net12": "26:07:c8:fe:66:e2",
            "net13": "ca:93:93:26:d5:ba",
            "net14": "e2:dc:32:d8:07:de",
            "net15": "3e:22:0d:76:78:0c",
            "net16": "4a:2a:78:3c:76:ee",
            "net17": "e6:e0:66:28:6e:78",
            "net18": "da:b4:7f:6e:4c:69",
            "net19": "3e:86:b5:42:ed:22",
            "net2": "7e:a0:89:e4:2f:7e",
            "net20": "9a:4a:46:e6:c4:6d",
            "net21": "46:a4:9a:13:b8:19",
            "net22": "a2:c6:da:a4:5f:0e",
            "net23": "12:f2:b5:a2:f0:72",
            "net24": "ee:25:65:f0:1d:66",
            "net25": "fa:0b:d9:62:67:79",
            "net26": "2e:f6:3d:d6:ea:73",
            "net27": "96:e4:0e:c7:fa:ea",
            "net28": "e6:b5:9d:f4:ef:cd",
            "net29": "be:a9:17:67:d8:23",
            "net3": "46:83:cb:5b:62:f5",
            "net30": "62:5d:26:73:b7:bf",
            "net31": "26:82:42:32:0c:e0",
            "net4": "9e:31:ed:ff:96:b3",
            "net5": "12:c7:5b:8e:5f:f1",
            "net6": "3a:10:69:34:f7:56",
            "net7": "ee:e8:b4:c6:f1:61",
            "net8": "22:d2:5d:75:52:ad",
            "net9": "06:50:05:f7:6c:9c"
        },
        "spine_2_1_13": {
            "net0": "a6:66:56:58:b0:1f",
            "net1": "a2:71:4c:20:18:26",
            "net10": "c2:74:05:56:22:7f",
            "net11": "1a:80:6e:a5:a6:b7",
            "net12": "ae:bb:c3:da:02:0d",
            "net13": "be:ca:88:5f:16:96",
            "net14": "16:75:14:0d:41:a1",
            "net15": "d2:b1:78:a1:14:f8",
            "net16": "6e:8b:de:d6:05:35",
            "net17": "72:b9:79:61:55:7c",
            "net18": "7e:31:ba:87:67:ae",
            "net19": "3a:1e:13:d0:ac:f6",
            "net2": "de:91:d8:aa:ae:06",
            "net20": "d6:d9:57:d1:b1:34",
            "net21": "f2:86:ca:f9:dc:d5",
            "net22": "5a:4c:0a:c3:e9:2c",
            "net23": "5e:8c:f4:06:d8:48",
            "net24": "fa:fa:bb:e9:c5:4e",
            "net25": "ea:da:dd:0d:8a:ba",
            "net26": "4e:75:a3:d9:ba:14",
            "net27": "3a:50:10:9e:b4:64",
            "net28": "42:cc:76:c5:1f:ad",
            "net29": "26:5a:30:1a:b4:cd",
            "net3": "4a:10:c6:79:0c:a6",
            "net30": "1e:0e:45:41:4a:86",
            "net31": "6e:50:24:3d:4d:a2",
            "net4": "b6:64:13:54:34:7c",
            "net5": "12:ec:63:05:a9:87",
            "net6": "6e:d0:60:52:44:5b",
            "net7": "5a:b3:9b:52:24:e8",
            "net8": "2a:35:fd:37:f9:d3",
            "net9": "b2:56:35:a5:ea:af"
        },
        "spine_2_1_14": {
            "net0": "46:7c:9e:61:b9:4e",
            "net1": "ee:9b:7d:28:32:43",
            "net10": "9a:9a:b6:46:6a:69",
            "net11": "6a:6e:04:b1:12:cd",
            "net12": "5a:9b:7b:93:14:83",
            "net13": "6e:76:6f:fc:06:b3",
            "net14": "46:45:fa:c6:4a:f6",
            "net15": "f2:44:f3:0f:40:96",
            "net16": "62:70:31:f8:1c:27",
            "net17": "72:e4:f4:b6:06:fc",
            "net18": "a6:17:42:86:71:18",
            "net19": "1a:33:b3:ba:9d:ba",
            "net2": "c2:d4:1d:75:54:e5",
            "net20": "46:73:82:f5:a5:57",
            "net21": "82:5a:09:92:7e:48",
            "net22": "52:09:2e:63:97:a7",
            "net23": "66:f8:64:ba:94:5e",
            "net24": "d6:5a:b2:27:97:33",
            "net25": "c2:7a:bb:34:ce:fc",
            "net26": "de:1b:d6:b1:7f:4f",
            "net27": "b2:12:18:3d:77:ac",
            "net28": "d6:21:06:7d:42:48",
            "net29": "3e:61:0b:bd:73:e6",
            "net3": "b2:06:d3:be:49:4d",
            "net30": "aa:c2:30:5f:a8:31",
            "net31": "9e:bd:d4:b8:20:7d",
            "net4": "96:5c:b7:67:12:53",
            "net5": "de:fc:59:94:e5:0b",
            "net6": "ae:18:d9:01:5c:e1",
            "net7": "e2:1e:f1:9a:45:42",
            "net8": "f2:42:d9:e1:17:45",
            "net9": "de:56:53:e6:65:a1"
        },
        "spine_2_1_15": {
            "net0": "c6:97:33:e7:f7:cc",
            "net1": "06:dd:3f:69:fd:a1",
            "net10": "52:ee:02:d1:68:b1",
            "net11": "3e:73:72:1c:66:3e",
            "net12": "fa:dd:fc:77:f7:80",
            "net13": "c2:4a:c0:85:4e:b0",
            "net14": "fe:5f:2c:26:04:9c",
            "net15": "0e:a5:f8:58:33:e6",
            "net16": "2e:fc:1c:0a:52:bc",
            "net17": "fa:3a:48:c5:bf:30",
            "net18": "d2:d7:dd:43:67:b9",
            "net19": "da:e6:ec:cd:46:15",
            "net2": "7e:77:75:d8:60:38",
            "net20": "66:dd:55:58:06:c6",
            "net21": "e2:fd:c3:db:9c:b2",
            "net22": "be:f8:ca:56:27:cd",
            "net23": "ae:b2:d0:be:da:02",
            "net24": "1a:af:7d:b2:ec:5b",
            "net25": "56:c8:43:08:8c:71",
            "net26": "c2:e8:2e:0a:82:02",
            "net27": "7e:6f:c6:09:53:07",
            "net28": "36:13:cd:1f:9b:5d",
            "net29": "06:ef:67:b3:7a:b4",
            "net3": "da:cd:5e:82:12:d6",
            "net30": "aa:14:f5:bd:12:4c",
            "net31": "56:8e:18:f7:fc:f9",
            "net4": "12:f6:f4:a9:98:3b",
            "net5": "0e:65:4e:7d:f8:7b",
            "net6": "5e:82:48:b6:e3:77",
            "net7": "26:69:ab:b9:36:d6",
            "net8": "ba:5f:7f:3d:08:e0",
            "net9": "16:d7:f9:83:55:e4"
        },
        "spine_2_1_16": {
            "net0": "8e:62:ce:14:86:ce",
            "net1": "ce:e8:dd:ff:4f:01",
            "net10": "da:4a:0f:5e:de:33",
            "net11": "ce:d0:94:6f:45:54",
            "net12": "a6:b0:d0:83:b6:5b",
            "net13": "0a:d6:4a:3b:04:a9",
            "net14": "8e:69:86:77:9d:cb",
            "net15": "4a:67:e7:28:17:30",
            "net16": "26:f7:ac:74:ae:41",
            "net17": "fa:d8:d3:fd:f2:06",
            "net18": "d2:49:1b:28:93:7d",
            "net19": "4a:d5:d0:de:44:9a",
            "net2": "2a:88:1f:d0:20:97",
            "net20": "a6:f1:98:dd:66:42",
            "net21": "46:9e:2e:46:06:b7",
            "net22": "a6:f7:13:c7:cb:b5",
            "net23": "ae:f9:0a:a9:5d:23",
            "net24": "3a:84:fc:14:df:8b",
            "net25": "6e:06:f6:40:d3:34",
            "net26": "82:1b:c7:04:9f:44",
            "net27": "a6:16:00:1f:e0:40",
            "net28": "4e:f7:28:d0:2f:48",
            "net29": "5e:65:1e:d9:f3:6b",
            "net3": "ae:9c:63:e3:cf:19",
            "net30": "36:f4:52:2d:0d:d9",
            "net31": "2e:fa:6c:07:01:89",
            "net4": "66:67:b3:7a:32:3f",
            "net5": "be:30:db:5a:60:50",
            "net6": "aa:4e:b0:b3:da:f0",
            "net7": "da:8c:87:61:c9:ba",
            "net8": "a2:ad:cd:cf:93:35",
            "net9": "9a:77:0d:c4:30:e0"
        },
        "spine_2_1_2": {
            "net0": "c2:3e:6c:80:ee:8e",
            "net1": "7e:e2:42:0d:aa:55",
            "net10": "ae:0d:b4:9b:77:01",
            "net11": "76:f6:a8:7f:f2:24",
            "net12": "2a:2e:bf:92:b8:5d",
            "net13": "c2:f0:03:00:71:8c",
            "net14": "1e:90:dc:2f:29:5c",
            "net15": "ee:c0:71:08:e1:01",
            "net16": "ba:9a:a2:d3:9f:ad",
            "net17": "4a:b4:d2:13:11:fa",
            "net18": "de:d4:76:b2:a4:03",
            "net19": "1e:4e:5f:db:68:26",
            "net2": "da:63:07:a2:70:f7",
            "net20": "9a:96:2d:4f:27:91",
            "net21": "46:e2:eb:2d:02:d9",
            "net22": "ee:05:01:9e:f8:fc",
            "net23": "8e:06:00:e0:8a:61",
            "net24": "da:98:a3:73:f0:6b",
            "net25": "d6:e3:05:30:59:0c",
            "net26": "aa:71:6e:83:3b:58",
            "net27": "8e:d1:81:f7:1c:6a",
            "net28": "96:c2:ac:ce:fb:01",
            "net29": "de:61:4f:ad:9d:88",
            "net3": "36:aa:fe:0d:f1:88",
            "net30": "b6:ae:0a:68:f9:34",
            "net31": "fe:16:59:25:80:95",
            "net4": "f2:47:a8:17:a1:f3",
            "net5": "96:22:91:74:18:06",
            "net6": "16:d9:79:68:ca:fd",
            "net7": "26:22:56:42:64:e1",
            "net8": "ba:35:35:a6:eb:3f",
            "net9": "c6:6d:03:13:f7:b1"
        },
        "spine_2_1_3": {
            "net0": "12:9b:55:f9:32:0f",
            "net1": "be:d6:c0:8c:15:77",
            "net10": "76:dd:87:cd:a7:cb",
            "net11": "62:bd:9d:4d:c2:4e",
            "net12": "a6:ff:04:b9:f5:3b",
            "net13": "ea:51:4b:e6:83:35",
            "net14": "ca:a6:7e:b3:2d:9b",
            "net15": "06:4a:a1:c4:82:ca",
            "net16": "92:c3:e0:b9:4a:8f",
            "net17": "7a:61:bb:46:8d:f1",
            "net18": "ee:f4:8a:73:2d:f6",
            "net19": "2a:4d:84:31:53:c8",
            "net2": "1a:a9:2b:1f:1c:88",
            "net20": "0a:5b:72:15:83:67",
            "net21": "de:86:13:ab:78:1b",
            "net22": "96:fe:1f:9c:8e:90",
            "net23": "f2:02:dd:8c:04:c4",
            "net24": "6a:95:08:b6:41:ae",
            "net25": "b2:ab:61:0f:8d:85",
            "net26": "fe:e1:77:90:6b:9c",
            "net27": "8a:d9:a0:43:fb:70",
            "net28": "8a:82:f9:44:11:b6",
            "net29": "8a:93:77:6f:d5:81",
            "net3": "e6:a2:58:50:db:f0",
            "net30": "3a:a7:c1:91:47:f8",
            "net31": "ba:7b:bc:22:48:54",
            "net4": "3a:5b:77:86:a5:3e",
            "net5": "aa:a6:09:8b:1a:39",
            "net6": "22:2c:8e:81:9e:a2",
            "net7": "0a:4f:42:b6:dc:27",
            "net8": "96:c1:32:c9:19:32",
            "net9": "c2:2b:36:4a:98:cb"
        },
        "spine_2_1_4": {
            "net0": "9e:f5:51:da:44:15",
            "net1": "6e:49:d7:be:04:2e",
            "net10": "8a:3e:f5:56:ba:af",
            "net11": "26:d4:16:50:29:23",
            "net12": "06:8e:6a:cc:56:5c",
            "net13": "8e:dd:91:2f:68:3e",
            "net14": "42:d5:a4:8c:2d:6a",
            "net15": "8e:0e:eb:51:45:29",
            "net16": "4e:94:1b:91:2a:93",
            "net17": "52:30:3d:62:85:a7",
            "net18": "b2:28:57:dd:fc:2d",
            "net19": "92:b3:e5:fa:3a:9d",
            "net2": "62:61:53:31:d3:c2",
            "net20": "96:6e:37:a9:a4:6c",
            "net21": "da:4e:3a:31:8d:3d",
            "net22": "96:8d:6c:44:c9:d6",
            "net23": "2e:e2:a6:5a:37:62",
            "net24": "e2:d4:69:d5:b4:65",
            "net25": "c6:98:f8:c1:af:8b",
            "net26": "de:3a:30:23:76:2c",
            "net27": "9e:f8:59:df:b1:97",
            "net28": "3a:44:92:6a:77:a8",
            "net29": "8e:20:56:12:68:59",
            "net3": "ee:8d:3f:18:d0:2e",
            "net30": "42:1f:cc:39:e5:5a",
            "net31": "62:d6:03:4f:6b:9a",
            "net4": "86:27:a1:4f:26:33",
            "net5": "2a:60:72:34:64:9e",
            "net6": "86:d0:d8:85:c5:25",
            "net7": "b2:83:4d:e8:64:37",
            "net8": "ee:90:83:c2:16:6d",
            "net9": "26:2d:aa:e7:49:79"
        },
        "spine_2_1_5": {
            "net0": "82:b1:ed:7e:0d:41",
            "net1": "3e:3b:b1:14:63:a0",
            "net10": "66:99:53:51:14:af",
            "net11": "4a:a3:39:e9:f2:e9",
            "net12": "3e:81:7e:1b:22:89",
            "net13": "a2:10:80:36:a9:b6",
            "net14": "c6:1b:24:89:53:34",
            "net15": "4a:fd:86:fa:e2:16",
            "net16": "d6:d4:51:5d:fc:5c",
            "net17": "72:e3:47:28:9b:e7",
            "net18": "e2:77:79:f9:c5:04",
            "net19": "ce:e4:e2:e0:ee:b6",
            "net2": "06:89:71:8c:10:41",
            "net20": "fa:02:7c:c2:77:6e",
            "net21": "36:48:21:6e:70:f8",
            "net22": "a6:3a:89:4f:8c:7b",
            "net23": "02:41:ad:3c:c8:0f",
            "net24": "7a:cc:03:66:d6:3b",
            "net25": "72:78:53:bd:88:55",
            "net26": "de:32:56:9f:86:fb",
            "net27": "62:ee:16:36:bd:3e",
            "net28": "b2:03:79:9a:27:55",
            "net29": "be:05:cb:e5:0b:6a",
            "net3": "ce:db:b4:25:20:d6",
            "net30": "7a:bc:75:c8:c0:50",
            "net31": "1a:24:a3:9d:72:05",
            "net4": "be:d9:09:68:d6:18",
            "net5": "82:d2:43:68:db:8a",
            "net6": "0a:af:7f:a7:57:1b",
            "net7": "b2:c0:cb:f6:90:a5",
            "net8": "d2:be:74:73:a6:ca",
            "net9": "72:64:fd:08:5e:48"
        },
        "spine_2_1_6": {
            "net0": "4a:cf:39:59:67:8d",
            "net1": "d2:45:dd:e5:dc:cf",
            "net10": "7e:7e:ba:e9:38:16",
            "net11": "e2:36:06:0a:23:c8",
            "net12": "c2:73:cc:76:47:0a",
            "net13": "0e:41:7b:62:a2:cc",
            "net14": "9e:38:1e:51:9c:8b",
            "net15": "c2:75:d0:11:41:f4",
            "net16": "ba:de:06:a7:34:c0",
            "net17": "22:41:67:66:15:95",
            "net18": "aa:8b:0a:d2:e3:aa",
            "net19": "6a:ee:44:91:6f:2e",
            "net2": "ba:0d:7e:ef:dd:dd",
            "net20": "4a:b8:ab:13:20:97",
            "net21": "b2:9e:7c:fa:67:89",
            "net22": "3a:e0:c9:64:74:90",
            "net23": "5e:a5:d4:e1:9d:d3",
            "net24": "86:58:57:d1:3f:b9",
            "net25": "4a:db:78:4c:4a:d0",
            "net26": "5e:e9:bb:5d:12:dc",
            "net27": "e6:fe:7d:be:88:21",
            "net28": "2a:17:52:93:e1:78",
            "net29": "b6:32:d1:25:89:9e",
            "net3": "3e:e4:c5:df:19:8b",
            "net30": "9e:30:b8:57:c0:8f",
            "net31": "9e:4f:a1:c4:d0:b8",
            "net4": "62:41:7c:b0:cc:75",
            "net5": "46:bf:0b:f5:cd:38",
            "net6": "e6:82:35:37:5d:39",
            "net7": "3a:1e:7a:6f:d7:76",
            "net8": "c2:d0:ca:8f:d7:22",
            "net9": "c6:f6:da:3b:47:ea"
        },
        "spine_2_1_7": {
            "net0": "82:b1:e7:60:ad:9e",
            "net1": "76:8b:2a:94:4e:de",
            "net10": "a6:0b:13:b4:78:b1",
            "net11": "56:a9:7d:18:af:af",
            "net12": "0a:ec:5c:47:e7:c4",
            "net13": "16:d7:d0:8f:87:90",
            "net14": "16:bb:61:0a:ff:4a",
            "net15": "6a:96:c8:5b:25:92",
            "net16": "e2:c1:ba:05:d4:43",
            "net17": "d6:f3:d0:b5:41:7e",
            "net18": "e6:3a:28:b6:c3:d1",
            "net19": "4e:96:0f:d8:3d:21",
            "net2": "be:44:61:1c:14:eb",
            "net20": "c2:a9:e2:22:c2:70",
            "net21": "e2:50:13:24:9d:83",
            "net22": "26:7c:fe:90:29:96",
            "net23": "f6:e2:ea:97:60:92",
            "net24": "3a:0f:d5:3c:a7:58",
            "net25": "7e:f1:d7:ee:04:9a",
            "net26": "56:83:c7:12:7d:9d",
            "net27": "ba:e1:5a:c6:e0:a4",
            "net28": "5e:46:ab:3d:df:e2",
            "net29": "16:e9:34:ef:59:99",
            "net3": "e6:3b:40:f2:cd:d3",
            "net30": "a6:c9:76:52:0b:e6",
            "net31": "f6:fd:aa:56:f8:dd",
            "net4": "ea:eb:dd:1c:a6:4e",
            "net5": "3e:86:b2:0c:d1:c2",
            "net6": "96:1b:b8:7e:91:ea",
            "net7": "ce:3a:68:88:62:df",
            "net8": "92:49:34:70:3e:54",
            "net9": "46:61:bc:b0:19:a2"
        },
        "spine_2_1_8": {
            "net0": "3e:6c:50:40:de:0a",
            "net1": "86:f4:a5:e1:19:5e",
            "net10": "fa:f0:df:77:b2:cc",
            "net11": "66:c8:2f:85:af:2b",
            "net12": "2e:a0:e9:52:99:32",
            "net13": "76:5a:2c:f6:df:f3",
            "net14": "42:f8:e9:2a:2e:e4",
            "net15": "ba:d9:a9:cb:b3:c8",
            "net16": "8e:5b:b0:08:42:e8",
            "net17": "56:03:05:9a:ed:a0",
            "net18": "c2:5a:aa:45:28:f1",
            "net19": "de:8c:58:58:67:c7",
            "net2": "06:2d:b3:b7:02:2b",
            "net20": "46:3e:99:fa:cb:4f",
            "net21": "12:71:6a:11:a3:f4",
            "net22": "92:09:a7:0a:51:b3",
            "net23": "a6:2a:43:fc:fe:0e",
            "net24": "3a:37:81:d7:9b:7d",
            "net25": "86:fe:db:36:a8:bd",
            "net26": "d2:7a:d9:21:49:64",
            "net27": "ea:67:0c:9c:dd:3b",
            "net28": "5a:07:3a:1b:95:0c",
            "net29": "c6:17:35:68:71:02",
            "net3": "66:2e:8b:07:3f:c7",
            "net30": "72:20:5b:b8:5c:2f",
            "net31": "06:01:1c:76:37:e0",
            "net4": "a6:a1:80:2e:2c:c5",
            "net5": "5a:2c:ef:64:a3:44",
            "net6": "d2:7c:bd:95:8b:05",
            "net7": "4e:49:1d:c3:18:68",
            "net8": "da:58:5f:8b:cb:ee",
            "net9": "ae:9c:f9:f6:d1:3b"
        },
        "spine_2_1_9": {
            "net0": "96:e0:fd:80:7f:20",
            "net1": "46:28:9a:05:c8:13",
            "net10": "8a:b9:40:c1:c8:b7",
            "net11": "b6:9d:a7:e8:bd:b2",
            "net12": "82:ed:2e:d7:54:1e",
            "net13": "d2:5c:0e:50:b9:84",
            "net14": "42:82:52:08:fc:7b",
            "net15": "66:0d:5c:36:92:c4",
            "net16": "92:f7:1c:76:32:a7",
            "net17": "5a:ae:f7:43:7f:3b",
            "net18": "ae:89:7b:94:01:de",
            "net19": "62:eb:30:18:c9:be",
            "net2": "46:e1:cc:a9:ee:8a",
            "net20": "5e:94:83:11:06:ad",
            "net21": "26:0a:a7:c3:97:f1",
            "net22": "96:8d:a7:8b:a6:d9",
            "net23": "ee:d5:7a:ba:14:4b",
            "net24": "ce:67:bc:e4:ce:09",
            "net25": "66:d4:8e:71:81:a0",
            "net26": "ca:00:df:94:68:1b",
            "net27": "86:61:bf:8c:47:5a",
            "net28": "d2:3f:a4:1d:86:43",
            "net29": "92:fb:ee:ad:52:d5",
            "net3": "1e:b9:c9:fc:5d:e0",
            "net30": "82:30:2f:81:9c:89",
            "net31": "72:b6:01:d2:ea:f2",
            "net4": "a2:01:8c:c0:fd:5a",
            "net5": "1a:8c:2c:c0:07:0b",
            "net6": "0e:8c:00:84:a2:fc",
            "net7": "d6:2f:07:f4:49:ba",
            "net8": "d6:22:0f:89:c1:ba",
            "net9": "ce:6a:97:d5:7f:c4"
        },
        "tof_1_2_1": {
            "net0": "52:14:ea:c5:b9:79",
            "net1": "ae:bf:ef:eb:01:26",
            "net10": "aa:24:23:6d:30:a8",
            "net11": "ae:b4:42:0f:b0:7c",
            "net12": "3a:e7:3b:4a:32:1c",
            "net13": "96:fc:75:3c:c2:10",
            "net14": "22:fc:3d:c3:25:19",
            "net15": "76:a8:3d:8a:ac:87",
            "net16": "66:8c:f9:d5:df:10",
            "net17": "92:fc:d2:01:c9:4f",
            "net18": "66:e2:c8:d7:0a:92",
            "net19": "16:84:e4:33:6a:71",
            "net2": "da:39:f0:4f:1f:a2",
            "net20": "ea:03:46:07:48:4d",
            "net21": "2e:87:d1:a6:97:e3",
            "net22": "be:ce:ea:3b:1d:1b",
            "net23": "fa:f3:91:df:3a:d2",
            "net24": "5e:c8:aa:95:27:cf",
            "net25": "f6:43:39:34:4c:bd",
            "net26": "46:45:f5:d1:cf:da",
            "net27": "2e:ef:0f:43:54:90",
            "net28": "7e:a4:9a:a2:b4:23",
            "net29": "c2:31:36:76:0b:7f",
            "net3": "a6:28:95:5c:dd:1b",
            "net30": "6e:b7:c8:72:67:60",
            "net31": "76:bc:2e:e6:a2:62",
            "net4": "fa:5a:ed:d4:ad:b7",
            "net5": "96:2b:1a:b3:3e:9e",
            "net6": "22:b8:25:62:20:27",
            "net7": "92:07:46:6b:e0:c0",
            "net8": "8e:59:af:9c:18:70",
            "net9": "0e:e1:8a:6b:55:58"
        },
        "tof_1_2_10": {
            "net0": "ba:c0:51:da:47:c6",
            "net1": "0a:01:3b:db:6e:61",
            "net10": "ae:02:43:0d:25:40",
            "net11": "7e:14:55:7e:25:1a",
            "net12": "66:fb:92:53:c8:3b",
            "net13": "4e:52:c2:d6:68:5d",
            "net14": "d2:b8:1f:7a:8c:31",
            "net15": "de:d1:db:da:08:93",
            "net16": "72:55:88:41:be:2e",
            "net17": "ca:5d:2a:da:f1:cb",
            "net18": "4a:25:b5:66:35:da",
            "net19": "3a:54:5a:17:bd:ed",
            "net2": "3e:92:90:92:28:ac",
            "net20": "b2:93:d7:49:46:3a",
            "net21": "0a:de:e2:7c:f5:5e",
            "net22": "42:94:6f:e3:9e:71",
            "net23": "ba:29:4d:7e:d2:7d",
            "net24": "26:ba:14:3e:c4:d4",
            "net25": "0e:a9:d0:a1:f3:1f",
            "net26": "b2:f3:dd:fb:a9:82",
            "net27": "26:c3:66:14:12:1f",
            "net28": "72:5a:6c:07:f5:59",
            "net29": "c6:bd:a4:54:50:27",
            "net3": "ca:3a:e3:6d:61:ff",
            "net30": "16:29:af:e8:5e:65",
            "net31": "9e:62:10:6d:20:bf",
            "net4": "1a:72:62:21:d8:ff",
            "net5": "ae:04:fa:39:ea:7e",
            "net6": "6a:ca:00:6e:72:0e",
            "net7": "fa:2c:a7:8d:7a:64",
            "net8": "96:4a:24:96:6b:0e",
            "net9": "4e:0d:eb:f4:53:82"
        },
        "tof_1_2_11": {
            "net0": "a2:dd:99:25:ea:a6",
            "net1": "a2:95:9d:6c:ad:c9",
            "net10": "6e:d5:f9:4d:66:9d",
            "net11": "02:55:fb:d0:f7:20",
            "net12": "0a:e4:89:a5:8c:22",
            "net13": "e6:ef:9a:60:ae:7e",
            "net14": "f2:24:04:7e:f6:f3",
            "net15": "6a:d2:bd:ee:a6:6e",
            "net16": "66:9b:75:23:9d:7e",
            "net17": "66:b1:5e:74:e1:d5",
            "net18": "a2:dc:dc:be:e8:46",
            "net19": "72:5f:ad:3b:d2:da",
            "net2": "16:ff:6d:6e:cb:ec",
            "net20": "8a:fc:e4:a1:a9:90",
            "net21": "0e:d4:4c:7a:bf:23",
            "net22": "ba:dc:e4:76:06:aa",
            "net23": "72:df:81:17:96:03",
            "net24": "be:51:66:47:d2:e3",
            "net25": "ea:ad:f1:e2:c0:17",
            "net26": "fe:96:da:36:8a:a7",
            "net27": "2a:e9:7e:e5:4d:3a",
            "net28": "8a:af:dd:11:f8:f7",
            "net29": "6e:28:cd:2f:a2:8e",
            "net3": "a2:2f:b7:cd:31:1e",
            "net30": "26:7f:99:18:7a:a0",
            "net31": "12:04:ad:9d:70:99",
            "net4": "6a:bc:fa:b8:58:f4",
            "net5": "56:2a:36:02:c0:b4",
            "net6": "c6:b9:e3:f4:09:a6",
            "net7": "26:d5:91:0d:ae:f9",
            "net8": "36:68:72:51:57:fd",
            "net9": "42:1a:c0:04:b9:28"
        },
        "tof_1_2_12": {
            "net0": "ae:96:e4:f0:91:58",
            "net1": "ea:36:4f:23:59:50",
            "net10": "62:e9:cd:af:e7:96",
            "net11": "6a:d0:1c:72:ed:91",
            "net12": "1e:c8:e8:ac:13:5b",
            "net13": "3a:ca:fe:ec:0c:8f",
            "net14": "ae:93:5a:b8:d5:2e",
            "net15": "3e:72:0d:1a:ac:db",
            "net16": "1e:37:02:78:96:d5",
            "net17": "2e:73:21:52:63:e3",
            "net18": "ee:92:b0:7d:1c:52",
            "net19": "9e:1a:0b:d4:17:d4",
            "net2": "32:ff:87:ef:62:86",
            "net20": "ea:6f:42:14:ee:f9",
            "net21": "2a:9c:20:f6:a0:7e",
            "net22": "4a:86:6f:54:8b:4e",
            "net23": "ce:53:f0:22:df:e1",
            "net24": "f2:61:76:c8:74:fe",
            "net25": "26:02:6d:bf:0b:78",
            "net26": "a2:6b:91:5e:57:d5",
            "net27": "ce:2d:8b:d9:61:43",
            "net28": "ea:43:50:9a:96:1e",
            "net29": "66:a3:06:f6:5c:25",
            "net3": "9a:19:8f:eb:9c:08",
            "net30": "c6:c7:c9:99:4e:7d",
            "net31": "ce:6c:c5:df:7f:18",
            "net4": "82:1b:b0:d9:45:bc",
            "net5": "66:01:45:37:1c:ac",
            "net6": "fa:ae:1b:dd:62:a8",
            "net7": "4a:1e:94:c1:6b:44",
            "net8": "aa:a1:8a:a4:c2:72",
            "net9": "2e:be:f0:fe:00:cd"
        },
        "tof_1_2_13": {
            "net0": "ee:43:8b:ce:9e:70",
            "net1": "76:6c:84:69:2a:fd",
            "net10": "3a:f7:86:15:8d:11",
            "net11": "be:b6:ad:6b:a3:6f",
            "net12": "56:77:19:41:8b:ce",
            "net13": "82:a2:3d:46:72:60",
            "net14": "12:97:55:3d:22:98",
            "net15": "9e:fd:c4:1a:22:bb",
            "net16": "da:e9:d7:dc:16:99",
            "net17": "36:e7:de:a9:8a:2b",
            "net18": "7a:6f:57:2d:e2:4e",
            "net19": "c2:b4:41:d6:3e:ed",
            "net2": "92:ba:0d:f8:0e:8c",
            "net20": "5a:df:74:02:47:d7",
            "net21": "a2:8b:3e:85:43:88",
            "net22": "aa:eb:05:69:76:6d",
            "net23": "86:f9:83:95:29:8a",
            "net24": "0a:77:0f:8c:9e:4c",
            "net25": "de:4e:3a:a3:ba:0d",
            "net26": "8a:79:51:42:7f:56",
            "net27": "62:e0:00:9f:0c:84",
            "net28": "ea:f5:35:01:be:8a",
            "net29": "02:d6:ab:eb:35:9f",
            "net3": "42:a1:9b:db:c7:11",
            "net30": "2a:88:e0:c1:93:fb",
            "net31": "1e:5b:93:1b:02:1c",
            "net4": "e2:67:8e:e8:1a:69",
            "net5": "be:c5:8d:c8:08:cc",
            "net6": "c2:70:39:26:6b:e6",
            "net7": "0e:34:e6:32:69:49",
            "net8": "32:95:62:0b:ba:5d",
            "net9": "92:6d:8f:c1:29:45"
        },
        "tof_1_2_14": {
            "net0": "86:a6:85:fa:47:9c",
            "net1": "36:bb:eb:fe:2b:5f",
            "net10": "32:1b:62:b5:99:12",
            "net11": "b2:e2:50:fb:30:ff",
            "net12": "32:6d:3c:3b:6a:17",
            "net13": "8e:22:7f:9c:46:8d",
            "net14": "be:5e:4a:7c:b6:37",
            "net15": "52:98:b0:24:f8:0d",
            "net16": "0e:29:95:47:a3:06",
            "net17": "92:67:6b:b3:f4:04",
            "net18": "ca:f9:82:12:e4:ef",
            "net19": "02:6d:73:63:76:b4",
            "net2": "6e:1d:4c:16:78:97",
            "net20": "2e:60:b4:da:e3:1f",
            "net21": "ca:cd:30:58:04:ce",
            "net22": "62:a3:7e:b3:e9:11",
            "net23": "d2:6c:b8:e6:f6:3e",
            "net24": "92:f6:6e:71:e8:8a",
            "net25": "ce:e0:eb:0f:41:65",
            "net26": "0a:94:ec:96:b2:de",
            "net27": "0e:c9:b1:29:4a:24",
            "net28": "8e:93:37:a0:5f:b0",
            "net29": "52:70:31:c7:4a:87",
            "net3": "3e:09:2b:2b:8f:6d",
            "net30": "ae:1c:26:23:24:0e",
            "net31": "fa:c7:f3:30:3f:2e",
            "net4": "d2:21:e1:6e:a5:f8",
            "net5": "92:86:04:bc:22:ae",
            "net6": "3e:60:b1:94:e2:f3",
            "net7": "b2:a3:35:87:c3:34",
            "net8": "06:ea:97:56:ce:0f",
            "net9": "0e:eb:30:d9:de:66"
        },
        "tof_1_2_15": {
            "net0": "82:de:13:0a:4e:48",
            "net1": "ca:01:39:60:4b:e2",
            "net10": "86:ee:44:df:9e:30",
            "net11": "ba:ca:84:d6:7e:e7",
            "net12": "76:f9:8e:73:97:53",
            "net13": "ee:1d:cf:3f:ef:31",
            "net14": "ce:4d:2a:55:23:02",
            "net15": "6a:7d:a4:a3:3c:cf",
            "net16": "6a:4c:3a:f7:b0:36",
            "net17": "ae:90:56:69:9f:4a",
            "net18": "a2:21:6c:98:90:08",
            "net19": "ba:9e:fc:ad:c5:14",
            "net2": "86:3f:c7:f7:9e:3b",
            "net20": "e6:a6:2f:e5:f3:6e",
            "net21": "02:62:e0:2d:21:44",
            "net22": "02:b4:ef:a5:cc:97",
            "net23": "a2:a3:a4:13:bc:ae",
            "net24": "52:88:0d:fb:40:0c",
            "net25": "ae:94:1c:c2:b7:06",
            "net26": "de:d3:f2:bb:56:1d",
            "net27": "0e:f5:e5:e6:ad:6f",
            "net28": "66:73:e4:0c:f6:60",
            "net29": "5a:dc:b7:0b:7d:71",
            "net3": "2e:e1:41:a1:f1:f8",
            "net30": "82:48:12:04:f4:06",
            "net31": "3e:bf:40:57:6d:46",
            "net4": "02:41:9a:07:8d:26",
            "net5": "12:df:91:ca:cb:bb",
            "net6": "42:f7:e1:24:3b:3c",
            "net7": "c2:a5:77:d5:10:47",
            "net8": "32:87:15:02:ed:6a",
            "net9": "0e:d6:a6:cd:9e:d7"
        },
        "tof_1_2_16": {
            "net0": "92:e1:25:87:46:92",
            "net1": "ae:d3:6b:7d:cd:96",
            "net10": "42:ee:68:72:e8:ae",
            "net11": "c2:7f:e4:a7:d9:62",
            "net12": "fa:86:0c:bf:db:8f",
            "net13": "c6:d0:19:21:4b:07",
            "net14": "6a:b4:ae:bd:e4:bf",
            "net15": "c2:cc:a3:2d:7e:14",
            "net16": "72:95:0c:6d:e2:ca",
            "net17": "de:31:52:80:de:cb",
            "net18": "36:ce:ed:b7:a0:d6",
            "net19": "6a:ef:a4:28:ea:07",
            "net2": "a2:db:be:15:38:fb",
            "net20": "ee:42:15:19:b3:c8",
            "net21": "e6:69:e7:4b:24:6c",
            "net22": "12:7f:86:23:f8:67",
            "net23": "82:cc:fc:9d:6e:da",
            "net24": "be:7b:19:bc:a0:78",
            "net25": "66:6b:f7:d4:cb:6b",
            "net26": "e6:28:d7:cc:3b:36",
            "net27": "da:46:17:6c:fd:21",
            "net28": "26:e1:53:36:56:98",
            "net29": "ae:be:2f:b9:61:30",
            "net3": "1a:59:6b:8a:81:5c",
            "net30": "76:ee:15:35:40:18",
            "net31": "9a:d5:9a:7c:cb:3f",
            "net4": "7a:b4:1c:3d:bc:6c",
            "net5": "6a:62:7c:e2:65:0a",
            "net6": "da:8f:2a:b5:1e:86",
            "net7": "22:ac:4e:1c:14:6f",
            "net8": "8e:d3:2c:2a:b8:da",
            "net9": "42:6b:54:8a:38:fd"
        },
        "tof_1_2_2": {
            "net0": "b2:f0:b3:cf:68:e7",
            "net1": "72:13:ee:c5:37:f1",
            "net10": "ae:26:47:75:7d:91",
            "net11": "82:15:4d:0c:bc:72",
            "net12": "a6:fa:6c:51:0b:e3",
            "net13": "1a:3d:7c:09:ef:bc",
            "net14": "86:99:9a:e5:43:50",
            "net15": "42:7b:c6:78:2b:18",
            "net16": "ea:23:6d:cb:89:c6",
            "net17": "f6:20:73:39:37:42",
            "net18": "1e:75:0e:c3:8b:e5",
            "net19": "66:78:61:e0:81:e6",
            "net2": "2e:0c:98:4e:d6:3b",
            "net20": "36:a4:67:87:7b:2f",
            "net21": "46:44:4a:92:25:b2",
            "net22": "92:e0:f9:24:f6:1c",
            "net23": "fe:86:c4:ab:db:87",
            "net24": "4e:63:bf:44:73:1d",
            "net25": "de:e5:e5:86:bd:f5",
            "net26": "3a:e6:fa:52:a7:cd",
            "net27": "e6:a8:31:28:3f:ec",
            "net28": "22:ee:2a:c8:07:8f",
            "net29": "2a:15:48:47:8a:3e",
            "net3": "ee:dc:2e:c2:84:ca",
            "net30": "0e:60:71:70:d3:e0",
            "net31": "be:2f:25:a8:be:cb",
            "net4": "2e:e6:33:3a:d6:09",
            "net5": "ba:31:1e:be:38:1a",
            "net6": "7e:32:05:f5:2d:87",
            "net7": "5a:e0:9d:80:89:8b",
            "net8": "92:31:2a:40:56:f0",
            "net9": "7e:f9:46:d5:fc:2f"
        },
        "tof_1_2_3": {
            "net0": "32:a8:c3:e9:eb:1b",
            "net1": "22:f7:aa:6e:eb:58",
            "net10": "6a:c7:13:ff:27:b6",
            "net11": "4e:9a:63:f7:94:4b",
            "net12": "2e:6e:7a:a8:b2:6c",
            "net13": "66:2e:c9:09:64:93",
            "net14": "02:a4:48:76:a3:3e",
            "net15": "26:97:56:13:ea:b6",
            "net16": "52:0e:93:5c:95:0f",
            "net17": "d2:11:75:fc:1d:f7",
            "net18": "f2:b2:6d:c0:9b:c2",
            "net19": "be:12:0c:aa:1c:25",
            "net2": "6e:b1:be:66:28:a7",
            "net20": "ba:a4:70:04:17:f1",
            "net21": "12:64:98:78:9e:f3",
            "net22": "d2:54:eb:20:c2:7a",
            "net23": "92:84:d2:d2:6c:f8",
            "net24": "82:e2:30:33:c4:6b",
            "net25": "5a:51:f6:5f:de:21",
            "net26": "8a:a4:f2:ee:25:d9",
            "net27": "e2:c0:c8:68:1c:3f",
            "net28": "5e:93:dc:a3:56:37",
            "net29": "06:78:4b:18:83:23",
            "net3": "aa:36:4d:2e:75:b6",
            "net30": "36:85:9e:59:b4:ab",
            "net31": "62:e0:b9:9b:dd:27",
            "net4": "02:58:31:8b:82:82",
            "net5": "16:7e:1b:50:8c:7f",
            "net6": "52:d4:22:de:0b:84",
            "net7": "3e:fb:45:fc:db:9b",
            "net8": "6e:6a:7b:c7:a0:06",
            "net9": "fe:1f:9f:40:7e:9e"
        },
        "tof_1_2_4": {
            "net0": "c6:82:b2:a3:b9:55",
            "net1": "de:d0:cd:47:df:3b",
            "net10": "3a:03:04:14:7d:ad",
            "net11": "a6:aa:a3:19:5b:c2",
            "net12": "2e:25:d8:06:e5:b1",
            "net13": "0a:08:3f:8d:56:1b",
            "net14": "f6:fd:70:f6:8f:58",
            "net15": "ca:1a:d5:a0:0e:f2",
            "net16": "22:2b:6d:3a:9e:16",
            "net17": "fe:83:01:df:d5:20",
            "net18": "f2:65:d2:c6:2a:71",
            "net19": "ce:3a:aa:e7:18:ad",
            "net2": "26:85:bd:02:27:cc",
            "net20": "12:55:51:d0:f5:31",
            "net21": "3e:3b:8e:9e:b7:80",
            "net22": "ba:02:67:27:6a:90",
            "net23": "26:7c:ad:44:09:4d",
            "net24": "0a:14:41:2f:97:8e",
            "net25": "a2:b2:e5:bd:ce:16",
            "net26": "82:05:05:90:ef:35",
            "net27": "12:da:87:a5:07:82",
            "net28": "6a:d5:94:5b:1d:b2",
            "net29": "fa:4a:02:2b:b0:0a",
            "net3": "1e:6e:ec:61:a0:24",
            "net30": "9a:5c:13:a9:4b:00",
            "net31": "1e:b6:c6:c8:70:1c",
            "net4": "ce:be:dc:13:f3:f7",
            "net5": "12:69:f8:89:c3:31",
            "net6": "26:dd:66:8d:17:e7",
            "net7": "76:1e:51:ed:76:fc",
            "net8": "86:2e:c7:90:4d:db",
            "net9": "0e:82:03:c6:4e:74"
        },
        "tof_1_2_5": {
            "net0": "22:ec:9d:92:fc:bf",
            "net1": "7e:49:31:38:3a:74",
            "net10": "0e:01:83:2a:8c:98",
            "net11": "3e:c1:8c:89:b2:8f",
            "net12": "0e:32:b0:74:c9:15",
            "net13": "a6:af:64:36:8b:72",
            "net14": "66:79:c0:2c:f9:c6",
            "net15": "26:e3:86:9c:7c:8b",
            "net16": "56:81:13:dc:be:0c",
            "net17": "62:ee:84:63:58:58",
            "net18": "4e:49:5d:a9:35:bb",
            "net19": "a6:04:37:06:f3:0a",
            "net2": "36:dd:b1:8c:08:4e",
            "net20": "be:d4:db:41:18:bb",
            "net21": "de:e0:d5:46:94:73",
            "net22": "7a:00:2e:4b:cf:4b",
            "net23": "8a:5c:93:a2:0a:2f",
            "net24": "42:2e:fa:e9:3f:01",
            "net25": "a2:c2:5f:bc:00:fc",
            "net26": "c2:5a:85:37:43:75",
            "net27": "ca:4d:40:6e:8b:f7",
            "net28": "1a:be:c7:4e:3d:b9",
            "net29": "56:f7:28:cb:18:3e",
            "net3": "ce:8c:75:f7:b6:46",
            "net30": "86:42:85:6e:67:62",
            "net31": "d6:db:58:91:5d:32",
            "net4": "62:bc:3b:fc:c8:7c",
            "net5": "2e:64:e8:1d:65:84",
            "net6": "12:c7:74:29:b1:ce",
            "net7": "76:cd:d6:04:72:25",
            "net8": "6e:35:c3:2f:77:df",
            "net9": "0a:ba:0f:b8:60:c7"
        },
        "tof_1_2_6": {
            "net0": "6e:72:c6:86:bb:fc",
            "net1": "e2:ac:80:69:a7:dd",
            "net10": "5a:23:f2:a8:24:0e",
            "net11": "76:ed:62:12:ed:6a",
            "net12": "5a:a3:0f:03:40:80",
            "net13": "76:f2:60:24:35:57",
            "net14": "ba:4c:d0:5f:02:9a",
            "net15": "ca:c2:a5:77:39:8e",
            "net16": "8e:28:7e:4b:ff:47",
            "net17": "56:59:04:d4:e0:ee",
            "net18": "f6:60:36:b5:0d:32",
            "net19": "8e:be:0a:b5:4b:ca",
            "net2": "7e:33:9e:ca:bb:ff",
            "net20": "1a:20:a0:01:4e:20",
            "net21": "5a:9e:af:17:38:0b",
            "net22": "12:0c:5d:b0:cd:37",
            "net23": "b2:55:83:3e:8c:e5",
            "net24": "82:8d:24:a4:88:7c",
            "net25": "3a:c8:2d:d6:6d:b5",
            "net26": "92:da:c6:f4:ec:0b",
            "net27": "2e:e3:7d:87:4d:7c",
            "net28": "f6:f2:03:d6:85:8b",
            "net29": "ca:ec:f3:96:d0:90",
            "net3": "0a:d6:1c:ba:80:c2",
            "net30": "6e:58:e5:cf:c8:c7",
            "net31": "b6:8b:38:31:bd:c2",
            "net4": "c2:d0:bd:2a:fc:5c",
            "net5": "d2:57:10:20:2f:d9",
            "net6": "2e:58:e5:00:ce:f4",
            "net7": "be:92:d8:c2:0b:7b",
            "net8": "d6:dd:44:1b:8b:2e",
            "net9": "1a:87:61:ea:57:0a"
        },
        "tof_1_2_7": {
            "net0": "3e:d9:4d:20:a7:bc",
            "net1": "66:29:d7:f2:ec:71",
            "net10": "a6:80:05:b7:a8:d9",
            "net11": "ae:86:c8:66:98:21",
            "net12": "0a:49:31:9d:6b:f8",
            "net13": "16:40:bc:6b:31:d1",
            "net14": "ae:00:42:ef:b8:23",
            "net15": "8e:ab:1d:13:f7:3f",
            "net16": "12:45:57:62:29:31",
            "net17": "a2:9b:1d:61:4d:b3",
            "net18": "b6:c4:bd:ad:5b:a2",
            "net19": "06:e5:a7:68:03:28",
            "net2": "32:5b:08:2b:44:61",
            "net20": "1e:cf:b6:b4:b5:5b",
            "net21": "fe:d8:aa:82:f1:6c",
            "net22": "c2:48:a5:92:c0:5d",
            "net23": "12:5d:3b:78:35:0f",
            "net24": "c2:4f:88:93:be:3e",
            "net25": "4a:4c:72:03:77:b1",
            "net26": "f6:ad:bf:84:16:e1",
            "net27": "c6:15:55:ec:92:45",
            "net28": "be:0e:f6:7b:4e:ba",
            "net29": "f2:ec:ca:eb:e1:12",
            "net3": "0e:f7:73:36:11:26",
            "net30": "4a:d5:4c:01:18:2b",
            "net31": "1e:5a:36:ef:13:d1",
            "net4": "ae:34:08:7c:36:c0",
            "net5": "c6:b4:ef:d4:d1:2e",
            "net6": "86:81:76:64:34:b2",
            "net7": "aa:48:fa:cc:65:90",
            "net8": "02:c2:3c:53:62:d2",
            "net9": "62:44:6b:7f:68:0e"
        },
        "tof_1_2_8": {
            "net0": "66:01:80:b1:70:b0",
            "net1": "96:4a:9f:04:df:36",
            "net10": "f2:68:5e:74:82:ec",
            "net11": "1e:45:fb:27:e2:ab",
            "net12": "ea:8f:8d:30:ca:6e",
            "net13": "0a:21:ef:34:e5:4e",
            "net14": "ae:53:97:99:49:b7",
            "net15": "8e:14:82:c8:9f:e5",
            "net16": "9a:24:2f:1b:68:6c",
            "net17": "8a:80:0c:d7:0e:55",
            "net18": "12:0f:a1:48:ce:bf",
            "net19": "36:27:a1:b5:5e:cd",
            "net2": "9e:cb:00:e5:54:88",
            "net20": "a2:5f:3b:fd:57:a0",
            "net21": "42:3b:8d:53:7e:a9",
            "net22": "3e:89:5a:fd:63:b6",
            "net23": "ce:32:b4:1a:8a:0a",
            "net24": "7a:28:e7:6f:99:2b",
            "net25": "fa:c5:48:fd:cd:0d",
            "net26": "02:ab:ad:4a:db:3f",
            "net27": "ca:f7:2d:45:90:49",
            "net28": "1a:12:e5:da:c3:df",
            "net29": "aa:71:36:e4:84:37",
            "net3": "16:4e:40:e3:9c:f8",
            "net30": "ae:be:60:d2:fc:db",
            "net31": "22:ca:0d:dc:97:41",
            "net4": "32:7a:7a:d4:50:f4",
            "net5": "7a:c8:34:8e:8b:bf",
            "net6": "66:f3:ec:ff:b3:1c",
            "net7": "1e:24:0b:2b:fd:46",
            "net8": "66:cc:44:28:cf:5a",
            "net9": "ee:a0:6d:4b:29:00"
        },
        "tof_1_2_9": {
            "net0": "ee:d1:da:36:57:2f",
            "net1": "4a:c2:07:fd:d6:e0",
            "net10": "06:4b:26:4a:47:1d",
            "net11": "32:5e:5c:cc:f7:02",
            "net12": "a2:b6:28:f8:f4:14",
            "net13": "26:99:20:ed:2a:2d",
            "net14": "22:24:86:0b:6a:7f",
            "net15": "4e:68:63:13:ad:1a",
            "net16": "9e:e6:92:d5:d7:23",
            "net17": "8a:ac:d8:cd:16:d9",
            "net18": "f6:44:8d:6b:ca:52",
            "net19": "16:01:59:1b:eb:3c",
            "net2": "52:37:f2:9d:1d:96",
            "net20": "66:ae:8e:4a:dc:74",
            "net21": "36:10:c3:3f:14:5c",
            "net22": "4e:76:98:ae:b3:68",
            "net23": "46:02:e4:f6:8a:9b",
            "net24": "66:12:76:96:0b:e6",
            "net25": "1e:28:b9:97:32:b9",
            "net26": "9e:2c:83:70:59:12",
            "net27": "ca:8b:6c:18:bc:fc",
            "net28": "de:3e:3e:aa:15:e2",
            "net29": "62:71:69:a4:ba:19",
            "net3": "ae:84:1f:92:2c:5e",
            "net30": "96:4a:58:03:7d:e2",
            "net31": "7a:4b:46:f0:d3:1f",
            "net4": "a2:b5:a0:04:4e:d5",
            "net5": "16:e1:f2:95:c3:e0",
            "net6": "be:49:34:48:b5:fa",
            "net7": "1a:5a:65:9c:0b:7a",
            "net8": "a6:d1:ba:13:29:2b",
            "net9": "56:a3:07:bd:32:70"
        }
    },
    "failed_machine": "leaf_1_0_1",
    "failure_time": {
        "leaf_1_0_1": 1620862878.002563,
        "leaf_1_0_10": 1620862878.0151577,
        "leaf_1_0_11": 1620862878.0261564,
        "leaf_1_0_12": 1620862878.0390782,
        "leaf_1_0_13": 1620862878.0574305,
        "leaf_1_0_14": 1620862878.0015528,
        "leaf_1_0_15": 1620862878.006082,
        "leaf_1_0_16": 1620862878.0232718,
        "leaf_1_0_2": 1620862878.0409734,
        "leaf_1_0_3": 1620862878.0480218,
        "leaf_1_0_4": 1620862878.001344,
        "leaf_1_0_5": 1620862878.018069,
        "leaf_1_0_6": 1620862878.032437,
        "leaf_1_0_7": 1620862878.042493,
        "leaf_1_0_8": 1620862878.054628,
        "leaf_1_0_9": 1620862878.0029757,
        "leaf_2_0_1": 1620862878.0190349,
        "leaf_2_0_10": 1620862878.040243,
        "leaf_2_0_11": 1620862878.0489912,
        "leaf_2_0_12": 1620862878.060293,
        "leaf_2_0_13": 1620862878.063365,
        "leaf_2_0_14": 1620862878.0788198,
        "leaf_2_0_15": 1620862878.098374,
        "leaf_2_0_16": 1620862878.1105902,
        "leaf_2_0_2": 1620862878.1234741,
        "leaf_2_0_3": 1620862878.0672703,
        "leaf_2_0_4": 1620862878.085269,
        "leaf_2_0_5": 1620862878.0978625,
        "leaf_2_0_6": 1620862878.1049747,
        "leaf_2_0_7": 1620862878.116519,
        "leaf_2_0_8": 1620862878.0753055,
        "leaf_2_0_9": 1620862878.0917723,
        "spine_1_1_1": 1620862878.0979388,
        "spine_1_1_10": 1620862878.1150959,
        "spine_1_1_11": 1620862878.1285431,
        "spine_1_1_12": 1620862878.0721223,
        "spine_1_1_13": 1620862878.0914676,
        "spine_1_1_14": 1620862878.1097996,
        "spine_1_1_15": 1620862878.1262686,
        "spine_1_1_16": 1620862878.1370084,
        "spine_1_1_2": 1620862878.1317763,
        "spine_1_1_3": 1620862878.143365,
        "spine_1_1_4": 1620862878.1524174,
        "spine_1_1_5": 1620862878.1635613,
        "spine_1_1_6": 1620862878.174939,
        "spine_1_1_7": 1620862878.134154,
        "spine_1_1_8": 1620862878.1458805,
        "spine_1_1_9": 1620862878.1566556,
        "spine_2_1_1": 1620862878.1720877,
        "spine_2_1_10": 1620862878.1970494,
        "spine_2_1_11": 1620862878.1442573,
        "spine_2_1_12": 1620862878.1553974,
        "spine_2_1_13": 1620862878.1700366,
        "spine_2_1_14": 1620862878.1905842,
        "spine_2_1_15": 1620862878.1983335,
        "spine_2_1_16": 1620862878.1462615,
        "spine_2_1_2": 1620862878.164865,
        "spine_2_1_3": 1620862878.1788838,
        "spine_2_1_4": 1620862878.1966233,
        "spine_2_1_5": 1620862878.208029,
        "spine_2_1_6": 1620862878.1983542,
        "spine_2_1_7": 1620862878.210339,
        "spine_2_1_8": 1620862878.225361,
        "spine_2_1_9": 1620862878.2370856,
        "tof_1_2_1": 1620862878.2513134,
        "tof_1_2_10": 1620862878.2119334,
        "tof_1_2_11": 1620862878.2208214,
        "tof_1_2_12": 1620862878.2379029,
        "tof_1_2_13": 1620862878.2492645,
        "tof_1_2_14": 1620862878.2582827,
        "tof_1_2_15": 1620862878.2133222,
        "tof_1_2_16": 1620862878.226173,
        "tof_1_2_2": 1620862878.2393022,
        "tof_1_2_3": 1620862878.250752,
        "tof_1_2_4": 1620862878.261179,
        "tof_1_2_5": 1620862878.2152274,
        "tof_1_2_6": 1620862878.2373693,
        "tof_1_2_7": 1620862878.247423,
        "tof_1_2_8": 1620862878.256326,
        "tof_1_2_9": 1620862878.2623284
    }
}