{
    "k_leaf": 2,
    "k_top": 2,
    "redundancy_factor": 2,
    "is_k8s": true,
    "machine_mac_addresses": {
        "leaf_1_0_1": {
            "net0": "26:d0:ff:d9:9d:31",
            "net1": "3e:f1:0a:87:28:5b",
            "net2": "1e:05:aa:3a:99:59"
        },
        "leaf_1_0_2": {
            "net0": "ce:7c:a1:4e:53:60",
            "net1": "2e:7c:f0:48:a6:97",
            "net2": "02:00:7d:fc:72:10"
        },
        "leaf_2_0_1": {
            "net0": "ba:d5:91:59:84:5f",
            "net1": "ba:35:cc:28:2b:10",
            "net2": "b2:77:84:ad:d5:5d"
        },
        "leaf_2_0_2": {
            "net0": "2e:ae:e5:b8:dd:75",
            "net1": "e2:cd:6b:3d:46:fd",
            "net2": "aa:5c:8b:f6:3a:5a"
        },
        "spine_1_1_1": {
            "net0": "a6:c0:77:8a:c3:ab",
            "net1": "c2:73:21:6d:20:90",
            "net2": "06:fd:f8:9f:f1:69",
            "net3": "b6:69:d6:3e:26:fe"
        },
        "spine_1_1_2": {
            "net0": "0a:0a:ac:ce:b5:c1",
            "net1": "5e:de:20:7b:d4:4e",
            "net2": "36:9f:dc:f8:29:17",
            "net3": "7e:49:fa:e5:40:b2"
        },
        "spine_2_1_1": {
            "net0": "5e:15:e6:1f:c3:02",
            "net1": "fe:f5:bb:0f:a2:80",
            "net2": "b6:cb:3c:49:80:43",
            "net3": "3e:aa:05:4e:ec:e8"
        },
        "spine_2_1_2": {
            "net0": "f2:08:30:4f:74:df",
            "net1": "1e:d1:55:1e:95:df",
            "net2": "ca:43:8b:f3:9e:4f",
            "net3": "1a:57:c9:75:ee:3c"
        },
        "tof_1_2_1": {
            "net0": "7e:a2:a4:49:23:c9",
            "net1": "76:54:f0:0f:99:cd",
            "net2": "b6:4c:1e:12:9c:46",
            "net3": "ee:af:8d:22:5d:f9"
        },
        "tof_1_2_2": {
            "net0": "3e:32:51:e4:42:3f",
            "net1": "92:af:15:92:75:53",
            "net2": "ca:5d:5e:b4:9a:56",
            "net3": "1e:5a:75:df:4e:21"
        }
    },
    "failed_machine": "leaf_1_0_1",
    "failed_interfaces": [
        "net0"
    ],
    "failure_time": {
        "leaf_1_0_1": 1634557826.1994276,
        "leaf_1_0_2": 1634557826.209852,
        "leaf_2_0_1": 1634557826.2005856,
        "leaf_2_0_2": 1634557826.212757,
        "spine_1_1_1": 1634557826.2182994,
        "spine_1_1_2": 1634557826.231767,
        "spine_2_1_1": 1634557826.2215426,
        "spine_2_1_2": 1634557826.2342806,
        "tof_1_2_1": 1634557826.2391438,
        "tof_1_2_2": 1634557826.2520964
    }
}