{
    "k_leaf": 4,
    "k_top": 4,
    "redundancy_factor": 2,
    "is_k8s": false,
    "machine_mac_addresses": {
        "leaf_1_0_1": {
            "eth0": "8e:1d:f3:f7:04:bb",
            "eth1": "ce:7f:48:e9:7e:6a",
            "eth2": "06:c4:81:d5:b0:a2",
            "eth3": "fe:b6:33:07:5f:dc",
            "eth4": "5a:c6:0f:dc:7d:23"
        },
        "leaf_1_0_2": {
            "eth0": "fa:d3:47:5d:8b:c7",
            "eth1": "56:fe:a3:89:4d:b3",
            "eth2": "8e:c8:1b:0f:a3:ee",
            "eth3": "fe:db:e5:42:bf:ae",
            "eth4": "02:13:fa:16:5d:a2"
        },
        "leaf_1_0_3": {
            "eth0": "d2:1e:0a:7d:eb:a4",
            "eth1": "e6:18:c9:79:c5:60",
            "eth2": "32:48:4e:14:0a:89",
            "eth3": "0a:ea:21:f2:f1:68",
            "eth4": "4a:81:c5:61:09:4a"
        },
        "leaf_1_0_4": {
            "eth0": "8e:38:33:fc:79:11",
            "eth1": "ba:cc:1a:dd:a4:e7",
            "eth2": "0a:21:57:eb:9a:8f",
            "eth3": "7e:b2:05:9b:cb:eb",
            "eth4": "ca:a4:65:6e:92:5c"
        },
        "leaf_2_0_1": {
            "eth0": "72:bf:d8:d7:41:ed",
            "eth1": "9e:3d:d2:be:82:72",
            "eth2": "d6:69:33:86:47:e1",
            "eth3": "86:16:c0:50:a2:42",
            "eth4": "16:11:d5:f9:24:c2"
        },
        "leaf_2_0_2": {
            "eth0": "ca:1c:71:42:79:ea",
            "eth1": "2a:7a:1d:f6:c4:73",
            "eth2": "4a:33:87:19:4c:be",
            "eth3": "42:17:a5:5c:4c:32",
            "eth4": "86:da:18:34:03:7e"
        },
        "leaf_2_0_3": {
            "eth0": "ba:15:a7:13:23:95",
            "eth1": "1e:21:3a:be:f6:0d",
            "eth2": "d2:a0:7c:97:43:9f",
            "eth3": "12:c5:fd:55:2a:ba",
            "eth4": "ae:13:b7:4a:d2:a9"
        },
        "leaf_2_0_4": {
            "eth0": "ce:5d:1f:fc:39:ce",
            "eth1": "52:c3:69:2b:08:f2",
            "eth2": "4e:e0:f6:23:12:b3",
            "eth3": "aa:17:d3:05:65:f1",
            "eth4": "da:bc:20:45:29:98"
        },
        "leaf_3_0_1": {
            "eth0": "ba:10:1c:22:60:49",
            "eth1": "e2:aa:71:91:dd:42",
            "eth2": "b6:09:f2:79:9f:38",
            "eth3": "b6:39:ae:e4:76:28",
            "eth4": "d2:81:c3:49:a5:93"
        },
        "leaf_3_0_2": {
            "eth0": "ba:bd:48:92:81:73",
            "eth1": "52:8b:ae:98:b4:49",
            "eth2": "fe:26:9d:9d:43:25",
            "eth3": "52:31:25:fb:1b:d0",
            "eth4": "1e:2f:b5:ca:99:98"
        },
        "leaf_3_0_3": {
            "eth0": "22:47:c8:3f:fb:89",
            "eth1": "0a:ad:01:be:cf:92",
            "eth2": "be:40:1f:f8:c0:9f",
            "eth3": "2e:48:d6:4f:17:54",
            "eth4": "42:e0:0c:c6:82:71"
        },
        "leaf_3_0_4": {
            "eth0": "3a:14:a1:07:2b:99",
            "eth1": "2a:cc:0f:2c:2f:9c",
            "eth2": "5e:64:83:1f:a3:f0",
            "eth3": "a2:45:c5:f2:53:d8",
            "eth4": "d2:f0:18:9f:09:d3"
        },
        "leaf_4_0_1": {
            "eth0": "3a:e8:39:03:45:7e",
            "eth1": "6e:c0:31:b4:8b:d1",
            "eth2": "5a:e0:84:15:13:1d",
            "eth3": "a2:21:3b:fe:4f:94",
            "eth4": "2a:9f:d7:94:b8:61"
        },
        "leaf_4_0_2": {
            "eth0": "0a:e1:53:08:17:b1",
            "eth1": "f2:3d:96:e2:a2:af",
            "eth2": "c2:22:e5:cd:50:28",
            "eth3": "92:f8:dc:fd:22:ed",
            "eth4": "5e:3a:2d:bd:9d:43"
        },
        "leaf_4_0_3": {
            "eth0": "3e:6b:ed:88:33:0c",
            "eth1": "fa:42:8b:14:f0:69",
            "eth2": "12:a0:bc:d0:a5:a7",
            "eth3": "8a:83:fe:67:b4:c6",
            "eth4": "9a:78:13:ca:95:cc"
        },
        "leaf_4_0_4": {
            "eth0": "76:4e:78:5d:6f:6a",
            "eth1": "82:b1:d4:bf:70:eb",
            "eth2": "1e:a4:07:74:d0:9b",
            "eth3": "c6:06:14:3a:a5:f0",
            "eth4": "7e:75:f4:09:07:81"
        },
        "spine_1_1_1": {
            "eth0": "36:26:7f:03:46:eb",
            "eth1": "52:36:d8:55:be:0f",
            "eth2": "66:ad:a7:3e:b7:ba",
            "eth3": "ee:68:54:e7:74:49",
            "eth4": "66:3b:dd:52:ca:77",
            "eth5": "8e:5e:b8:b1:25:40",
            "eth6": "c6:d4:2d:38:54:cf",
            "eth7": "a6:2b:34:40:5c:f5"
        },
        "spine_1_1_2": {
            "eth0": "ee:86:4b:9e:dc:dc",
            "eth1": "12:fb:e4:d0:e4:6e",
            "eth2": "a2:d6:3b:51:fb:07",
            "eth3": "12:bb:74:e3:01:7c",
            "eth4": "aa:79:92:96:ff:42",
            "eth5": "52:d4:98:21:bd:7c",
            "eth6": "a6:3b:94:7e:3b:59",
            "eth7": "32:ca:c9:47:4f:f9"
        },
        "spine_1_1_3": {
            "eth0": "9e:e8:dc:ed:ac:32",
            "eth1": "f6:13:a1:d0:cb:96",
            "eth2": "fa:8d:2b:df:5a:d3",
            "eth3": "9a:d7:d6:50:ca:1e",
            "eth4": "96:35:58:d7:4c:6a",
            "eth5": "8a:c8:f4:f0:67:f1",
            "eth6": "5a:b0:68:18:bf:9f",
            "eth7": "06:a0:69:35:6f:6c"
        },
        "spine_1_1_4": {
            "eth0": "c6:db:dd:79:9e:62",
            "eth1": "12:63:c1:70:c7:37",
            "eth2": "fa:57:fe:6c:d1:71",
            "eth3": "42:a5:5d:24:9d:fd",
            "eth4": "0e:b0:b5:cd:5d:e7",
            "eth5": "a6:fa:a6:26:10:e4",
            "eth6": "7a:5a:43:c4:83:39",
            "eth7": "7e:72:78:24:60:85"
        },
        "spine_2_1_1": {
            "eth0": "7e:49:ec:7c:1e:09",
            "eth1": "9e:da:fa:4f:10:98",
            "eth2": "1a:45:7a:86:c1:08",
            "eth3": "de:13:99:83:c6:cc",
            "eth4": "da:d3:68:62:1c:7d",
            "eth5": "ca:b8:d1:53:5e:8e",
            "eth6": "be:87:27:03:e0:3f",
            "eth7": "1e:df:0f:67:9e:60"
        },
        "spine_2_1_2": {
            "eth0": "d6:98:ab:50:fe:99",
            "eth1": "e6:b7:ed:10:78:e1",
            "eth2": "82:1d:81:48:ca:cd",
            "eth3": "ea:11:c7:10:8f:43",
            "eth4": "22:4d:4e:0d:92:f0",
            "eth5": "ee:4d:0a:6e:72:c7",
            "eth6": "c2:f9:7e:e7:3f:ab",
            "eth7": "4e:90:e3:d0:83:a5"
        },
        "spine_2_1_3": {
            "eth0": "c6:b6:b7:5c:ca:0e",
            "eth1": "12:69:b9:ff:89:87",
            "eth2": "66:25:69:01:e7:95",
            "eth3": "4a:de:b6:70:a0:77",
            "eth4": "1a:d6:f8:e6:33:1d",
            "eth5": "66:37:5e:85:7b:8e",
            "eth6": "ce:36:af:93:f8:99",
            "eth7": "fa:1c:08:1e:13:9b"
        },
        "spine_2_1_4": {
            "eth0": "1a:c4:69:9b:8a:00",
            "eth1": "ae:84:67:ad:ad:31",
            "eth2": "86:74:1c:db:45:e9",
            "eth3": "e6:f7:ee:1a:a8:17",
            "eth4": "2e:d8:b1:da:87:e2",
            "eth5": "b6:7c:00:ea:d3:eb",
            "eth6": "ee:c9:21:a0:be:1d",
            "eth7": "3a:5b:48:e7:9c:50"
        },
        "spine_3_1_1": {
            "eth0": "be:9b:31:fd:ba:21",
            "eth1": "2a:a8:a7:1e:79:ed",
            "eth2": "b2:00:4b:ab:91:97",
            "eth3": "76:df:78:94:96:a0",
            "eth4": "72:92:a5:0d:32:eb",
            "eth5": "2e:a6:95:22:a0:1c",
            "eth6": "36:e9:55:58:d4:f9",
            "eth7": "d2:c3:ed:4d:a0:34"
        },
        "spine_3_1_2": {
            "eth0": "36:0c:2f:92:84:3d",
            "eth1": "26:a3:c0:26:6d:2c",
            "eth2": "4a:f9:6f:bd:c4:76",
            "eth3": "06:0c:de:c4:72:12",
            "eth4": "2e:32:0f:6d:86:6f",
            "eth5": "ae:ae:ec:39:7f:5e",
            "eth6": "6e:38:c7:07:0d:01",
            "eth7": "4a:e8:9a:16:3d:89"
        },
        "spine_3_1_3": {
            "eth0": "de:61:32:5b:dc:50",
            "eth1": "92:90:9f:66:17:62",
            "eth2": "2a:b4:a4:f0:a1:b7",
            "eth3": "f6:78:7f:8c:b8:68",
            "eth4": "ce:74:c7:91:58:25",
            "eth5": "ea:96:3b:20:f7:9e",
            "eth6": "86:c1:ca:2f:8c:1b",
            "eth7": "fa:b3:01:eb:77:1a"
        },
        "spine_3_1_4": {
            "eth0": "fa:0b:78:00:32:05",
            "eth1": "a2:22:c0:94:ae:27",
            "eth2": "ba:fa:85:70:c1:9d",
            "eth3": "6a:27:09:a0:3a:f7",
            "eth4": "d2:48:cc:89:9c:4d",
            "eth5": "2a:1b:39:48:68:0e",
            "eth6": "66:47:02:a1:cf:1c",
            "eth7": "9e:0a:9c:88:07:86"
        },
        "spine_4_1_1": {
            "eth0": "56:b9:98:91:eb:81",
            "eth1": "86:8f:05:ac:ce:50",
            "eth2": "fa:16:6e:75:c6:b5",
            "eth3": "a2:4d:a6:0b:01:2f",
            "eth4": "32:57:05:27:33:6b",
            "eth5": "f2:64:41:57:a0:39",
            "eth6": "6a:44:bc:61:0d:3d",
            "eth7": "ce:8b:b9:96:83:86"
        },
        "spine_4_1_2": {
            "eth0": "96:b5:42:20:e4:66",
            "eth1": "b2:67:6c:ac:a7:b9",
            "eth2": "ae:47:4d:70:e8:f0",
            "eth3": "76:0d:08:d0:3d:49",
            "eth4": "3a:e1:3e:aa:e3:41",
            "eth5": "16:e5:05:fe:84:e4",
            "eth6": "c2:47:f8:b3:c9:b7",
            "eth7": "12:01:d7:0a:a1:f3"
        },
        "spine_4_1_3": {
            "eth0": "0e:9f:0a:f3:0f:06",
            "eth1": "92:d8:2c:c4:73:35",
            "eth2": "86:23:44:7f:24:91",
            "eth3": "f2:9c:93:64:af:fc",
            "eth4": "c6:b7:ec:fb:59:dd",
            "eth5": "f2:3b:e9:77:90:46",
            "eth6": "de:83:09:18:34:07",
            "eth7": "5a:a2:6e:07:94:d8"
        },
        "spine_4_1_4": {
            "eth0": "c2:41:b1:b6:cb:98",
            "eth1": "1e:14:c1:2a:dd:5f",
            "eth2": "ae:ab:5a:d8:1d:99",
            "eth3": "fa:a8:34:c8:06:55",
            "eth4": "e6:dc:2c:c1:6f:dd",
            "eth5": "4a:ee:2a:d0:ba:b6",
            "eth6": "46:41:16:73:df:74",
            "eth7": "1a:86:3c:29:d9:02"
        },
        "tof_1_2_1": {
            "eth0": "6e:37:6c:1f:08:c6",
            "eth1": "36:2b:3d:20:81:40",
            "eth2": "d2:6a:ee:e1:32:a7",
            "eth3": "76:ef:b3:1e:8f:91",
            "eth4": "be:52:06:51:6a:a2",
            "eth5": "02:bb:53:a7:7f:11",
            "eth6": "a6:04:1c:44:ed:52",
            "eth7": "2a:03:f8:c9:57:51"
        },
        "tof_1_2_2": {
            "eth0": "5e:60:16:21:5f:10",
            "eth1": "a6:fe:ea:c4:f0:76",
            "eth2": "76:7c:ae:63:96:61",
            "eth3": "ba:df:be:f5:ba:6d",
            "eth4": "ce:20:6f:89:20:42",
            "eth5": "a2:27:92:be:da:84",
            "eth6": "56:a7:30:5f:16:d4",
            "eth7": "86:59:c8:43:87:38"
        },
        "tof_1_2_3": {
            "eth0": "82:4c:94:a1:49:79",
            "eth1": "a6:42:6c:37:23:c1",
            "eth2": "5e:49:2d:00:a9:d2",
            "eth3": "7a:4a:a8:25:08:73",
            "eth4": "4a:60:c2:d3:16:d3",
            "eth5": "72:eb:ae:10:92:5f",
            "eth6": "0e:f4:ee:0c:cc:59",
            "eth7": "a2:b4:85:d2:bb:f5"
        },
        "tof_1_2_4": {
            "eth0": "06:79:5d:ff:e9:5d",
            "eth1": "26:67:1d:b0:9b:7c",
            "eth2": "6a:66:ef:6d:c9:4e",
            "eth3": "06:e3:84:51:fd:16",
            "eth4": "8a:c2:b8:24:bc:0b",
            "eth5": "96:aa:e1:2f:62:df",
            "eth6": "a6:c9:c3:d0:66:d8",
            "eth7": "56:4f:f5:4b:21:1a"
        },
        "tof_2_2_1": {
            "eth0": "82:ff:80:23:c6:da",
            "eth1": "86:d1:02:bd:f0:08",
            "eth2": "0a:23:25:ec:73:c1",
            "eth3": "2a:90:6f:4a:90:34",
            "eth4": "16:ac:84:0d:da:70",
            "eth5": "66:40:82:aa:05:64",
            "eth6": "a6:5e:b1:e0:18:4c",
            "eth7": "16:3a:52:cb:1c:09"
        },
        "tof_2_2_2": {
            "eth0": "26:58:7c:ed:8c:0c",
            "eth1": "c6:77:8c:fb:eb:5e",
            "eth2": "de:f9:5f:29:62:93",
            "eth3": "86:28:3b:a3:24:0f",
            "eth4": "de:90:a8:5f:72:80",
            "eth5": "9e:f9:4e:cf:75:ce",
            "eth6": "ae:48:e0:26:48:f3",
            "eth7": "36:1a:e6:c5:d4:34"
        },
        "tof_2_2_3": {
            "eth0": "1a:41:9e:76:32:e2",
            "eth1": "4e:f6:03:2a:ae:aa",
            "eth2": "5e:50:d2:a6:19:cb",
            "eth3": "8a:a1:05:d8:74:b7",
            "eth4": "4a:03:41:54:a5:63",
            "eth5": "f2:1d:fe:b6:d5:59",
            "eth6": "0a:fc:d0:6c:6e:58",
            "eth7": "f6:78:91:45:8c:af"
        },
        "tof_2_2_4": {
            "eth0": "fa:aa:2a:21:14:94",
            "eth1": "6e:9b:a3:01:51:e5",
            "eth2": "b2:48:c4:72:75:1f",
            "eth3": "72:d8:7f:f1:07:8d",
            "eth4": "66:19:8e:e3:87:44",
            "eth5": "36:d5:1e:21:f6:7f",
            "eth6": "be:df:6b:36:4e:7f",
            "eth7": "ea:00:64:51:ef:a4"
        }
    },
    "failed_machine": "leaf_1_0_1",
    "failure_time": {
        "leaf_1_0_1": 1622028000.1159232,
        "leaf_1_0_2": 1622028000.1285255,
        "leaf_1_0_3": 1622028000.1471193,
        "leaf_1_0_4": 1622028000.1152587,
        "leaf_2_0_1": 1622028000.124214,
        "leaf_2_0_2": 1622028000.1412175,
        "leaf_2_0_3": 1622028000.1170304,
        "leaf_2_0_4": 1622028000.129042,
        "leaf_3_0_1": 1622028000.1578572,
        "leaf_3_0_2": 1622028000.1192582,
        "leaf_3_0_3": 1622028000.1341202,
        "leaf_3_0_4": 1622028000.1519992,
        "leaf_4_0_1": 1622028000.1499958,
        "leaf_4_0_2": 1622028000.164145,
        "leaf_4_0_3": 1622028000.180973,
        "leaf_4_0_4": 1622028000.1651704,
        "spine_1_1_1": 1622028000.1751425,
        "spine_1_1_2": 1622028000.18786,
        "spine_1_1_3": 1622028000.1662362,
        "spine_1_1_4": 1622028000.184803,
        "spine_2_1_1": 1622028000.1925747,
        "spine_2_1_2": 1622028000.178138,
        "spine_2_1_3": 1622028000.1897392,
        "spine_2_1_4": 1622028000.209021,
        "spine_3_1_1": 1622028000.201737,
        "spine_3_1_2": 1622028000.209033,
        "spine_3_1_3": 1622028000.2239203,
        "spine_3_1_4": 1622028000.208524,
        "spine_4_1_1": 1622028000.2175503,
        "spine_4_1_2": 1622028000.2314303,
        "spine_4_1_3": 1622028000.2193444,
        "spine_4_1_4": 1622028000.2460957,
        "tof_1_2_1": 1622028000.2632847,
        "tof_1_2_2": 1622028000.216524,
        "tof_1_2_3": 1622028000.2339802,
        "tof_1_2_4": 1622028000.2550263,
        "tof_2_2_1": 1622028000.2471144,
        "tof_2_2_2": 1622028000.260957,
        "tof_2_2_3": 1622028000.268957,
        "tof_2_2_4": 1622028000.2449982
    }
}