{
    "description": "Scenario 4b: Spine spine_1_1_1 failure and recovery with BGP",
    "k_leaf": 6,
    "k_top": 6,
    "redundancy_factor": 3,
    "is_k8s": true,
    "machine_mac_addresses": {
        "leaf_1_0_1": {
            "net0": "7e:94:b9:9a:bf:9f",
            "net1": "2e:1b:1b:1d:ff:87",
            "net2": "0e:ee:c4:61:20:63",
            "net3": "56:57:2c:89:2f:94",
            "net4": "ee:9f:da:67:76:5c",
            "net5": "8a:62:71:aa:b7:80",
            "net6": "6e:1c:eb:16:c4:bb"
        },
        "leaf_1_0_2": {
            "net0": "62:e6:49:50:e7:51",
            "net1": "36:35:64:d3:e7:94",
            "net2": "36:24:8d:46:e9:70",
            "net3": "e2:36:ec:cc:5c:e9",
            "net4": "1e:c2:3f:28:4f:53",
            "net5": "4e:7c:a6:38:59:e7",
            "net6": "56:df:6e:5d:f0:d6"
        },
        "leaf_1_0_3": {
            "net0": "6a:76:75:de:bd:b2",
            "net1": "e6:db:36:7e:53:66",
            "net2": "f2:b2:46:9d:9e:98",
            "net3": "c2:af:f9:00:99:3c",
            "net4": "66:7d:ff:a1:f5:6c",
            "net5": "1e:e7:b8:c9:c8:8c",
            "net6": "52:da:60:76:b8:af"
        },
        "leaf_1_0_4": {
            "net0": "76:3c:d5:4a:2f:8a",
            "net1": "52:f6:1a:a9:8e:3f",
            "net2": "56:1e:09:57:5a:6d",
            "net3": "d2:a5:9f:13:37:58",
            "net4": "a6:9c:29:14:9e:2a",
            "net5": "32:7b:5e:d5:41:5c",
            "net6": "7a:3d:2b:82:98:a0"
        },
        "leaf_1_0_5": {
            "net0": "86:90:88:c8:97:52",
            "net1": "fa:df:1e:91:ff:2c",
            "net2": "3a:19:c9:86:5f:9a",
            "net3": "ce:f0:08:e7:68:87",
            "net4": "d2:16:31:be:22:7a",
            "net5": "e6:e6:45:0d:5d:21",
            "net6": "66:5e:0c:4d:1f:d1"
        },
        "leaf_1_0_6": {
            "net0": "5e:a2:b2:cf:88:90",
            "net1": "de:1d:67:ee:b2:b3",
            "net2": "7e:78:22:97:b2:e8",
            "net3": "f2:7f:35:c0:9c:06",
            "net4": "c6:68:ec:39:c2:af",
            "net5": "de:62:d4:8a:d8:c7",
            "net6": "f2:ea:10:94:cd:ea"
        },
        "leaf_2_0_1": {
            "net0": "fa:e7:7b:1a:c4:1e",
            "net1": "da:ce:36:fb:58:fa",
            "net2": "e2:3d:a6:8e:b1:ee",
            "net3": "ae:33:13:a7:51:b1",
            "net4": "0a:e0:c6:69:61:e0",
            "net5": "0e:28:da:16:ef:18",
            "net6": "4a:2d:fc:6b:ef:65"
        },
        "leaf_2_0_2": {
            "net0": "7a:92:89:dc:86:a0",
            "net1": "aa:8b:e1:13:c9:a9",
            "net2": "36:24:57:da:48:32",
            "net3": "a6:93:8b:4f:11:24",
            "net4": "42:60:a7:05:cf:af",
            "net5": "b2:b2:c7:88:b9:04",
            "net6": "d2:ce:90:ed:c7:6a"
        },
        "leaf_2_0_3": {
            "net0": "c6:e6:17:f0:e2:8c",
            "net1": "96:ec:21:0c:0e:c6",
            "net2": "da:a8:22:6d:8d:6f",
            "net3": "de:c8:35:6e:63:3c",
            "net4": "3e:0d:31:e8:9b:89",
            "net5": "92:0c:10:27:a7:ff",
            "net6": "be:a6:98:b0:d2:6e"
        },
        "leaf_2_0_4": {
            "net0": "ca:64:f1:d1:6b:84",
            "net1": "be:5d:74:75:a9:94",
            "net2": "6a:85:dc:b2:c2:ae",
            "net3": "8a:7d:68:30:b8:50",
            "net4": "7a:6b:e7:c1:9c:35",
            "net5": "2a:fc:39:db:3b:25",
            "net6": "7e:79:23:78:59:0a"
        },
        "leaf_2_0_5": {
            "net0": "0e:ec:f8:b1:c3:a8",
            "net1": "32:ef:2b:5f:e5:e3",
            "net2": "26:f7:9e:37:e0:b8",
            "net3": "ee:09:6c:62:22:94",
            "net4": "ba:a1:ce:43:cd:e9",
            "net5": "36:c0:74:e0:c7:2c",
            "net6": "9e:27:94:7e:0f:a2"
        },
        "leaf_2_0_6": {
            "net0": "5a:f0:22:c3:d9:c2",
            "net1": "66:ca:73:78:a5:cb",
            "net2": "c2:28:78:4a:3f:84",
            "net3": "0e:a6:0c:2a:ef:eb",
            "net4": "5a:34:9c:91:af:b7",
            "net5": "72:fe:84:e9:9a:10",
            "net6": "7e:b6:6e:c9:67:fb"
        },
        "leaf_3_0_1": {
            "net0": "16:e0:18:01:32:d8",
            "net1": "22:5c:30:da:5f:78",
            "net2": "3a:38:e7:7e:0f:12",
            "net3": "06:87:b9:45:aa:cb",
            "net4": "02:94:1e:75:c9:da",
            "net5": "56:80:19:31:dc:a8",
            "net6": "b6:96:9f:9f:7f:57"
        },
        "leaf_3_0_2": {
            "net0": "16:83:91:47:c1:8d",
            "net1": "1a:63:c3:ba:b6:bc",
            "net2": "c2:4c:75:1a:62:c1",
            "net3": "5e:ad:98:31:9f:aa",
            "net4": "c6:c0:ca:f4:e3:98",
            "net5": "b6:96:d7:d4:7f:d4",
            "net6": "4e:76:e3:10:40:9e"
        },
        "leaf_3_0_3": {
            "net0": "22:02:18:e7:85:b6",
            "net1": "e6:18:be:0b:1b:7d",
            "net2": "52:30:2b:8f:10:a4",
            "net3": "46:74:2e:23:41:65",
            "net4": "4a:3a:45:75:2f:9d",
            "net5": "3e:59:70:8d:8f:06",
            "net6": "ba:be:b5:82:f2:c2"
        },
        "leaf_3_0_4": {
            "net0": "ee:b7:ed:06:d6:2d",
            "net1": "aa:ca:5c:52:e9:b8",
            "net2": "82:84:5c:56:0f:53",
            "net3": "ae:5f:28:d1:90:fd",
            "net4": "d6:33:ce:17:37:25",
            "net5": "c2:af:8f:a5:65:f0",
            "net6": "7a:0d:1b:48:e7:1a"
        },
        "leaf_3_0_5": {
            "net0": "c2:5c:94:e0:59:b5",
            "net1": "02:bf:13:40:79:95",
            "net2": "7a:bf:65:57:64:c1",
            "net3": "b2:3a:6b:d0:62:e5",
            "net4": "ae:17:55:3e:be:71",
            "net5": "da:a0:4c:0a:3c:83",
            "net6": "06:12:c4:a0:57:ea"
        },
        "leaf_3_0_6": {
            "net0": "92:12:b1:3d:52:d1",
            "net1": "e6:c6:cb:0a:ee:40",
            "net2": "1a:0a:8e:ab:97:f7",
            "net3": "66:df:1b:72:d6:31",
            "net4": "be:42:3b:b3:f7:fe",
            "net5": "d2:32:8a:b2:c3:9c",
            "net6": "42:45:28:69:ed:50"
        },
        "leaf_4_0_1": {
            "net0": "b6:ff:ea:8c:5f:72",
            "net1": "86:9d:b0:02:4d:17",
            "net2": "02:8e:93:9f:d8:d7",
            "net3": "8e:22:fb:93:6a:8a",
            "net4": "26:fd:e3:72:d8:b1",
            "net5": "66:09:84:4a:c6:fb",
            "net6": "42:f2:93:81:86:97"
        },
        "leaf_4_0_2": {
            "net0": "a2:19:f8:12:f1:1e",
            "net1": "ea:69:07:e7:59:6f",
            "net2": "c6:23:44:e1:86:1a",
            "net3": "4a:48:41:dc:94:c2",
            "net4": "2a:c4:96:87:ae:5b",
            "net5": "06:21:e5:f3:cb:c2",
            "net6": "ce:2e:3b:6d:02:93"
        },
        "leaf_4_0_3": {
            "net0": "e2:f0:1f:3d:25:f4",
            "net1": "1a:d1:4d:59:0d:aa",
            "net2": "ae:e5:8f:a7:2a:a2",
            "net3": "5a:e4:c8:9c:b6:e2",
            "net4": "7a:5e:2a:8e:e2:ed",
            "net5": "d2:64:c0:7b:33:2a",
            "net6": "da:3e:0d:f3:01:f6"
        },
        "leaf_4_0_4": {
            "net0": "c2:36:e3:47:e5:f4",
            "net1": "fa:94:f1:79:d7:ba",
            "net2": "46:bc:36:d1:8a:c0",
            "net3": "0e:df:be:57:c4:e7",
            "net4": "aa:b3:c3:05:69:ab",
            "net5": "0a:5b:44:34:0c:8a",
            "net6": "ce:c4:d8:a9:e9:b0"
        },
        "leaf_4_0_5": {
            "net0": "a2:79:7c:9e:89:45",
            "net1": "b6:85:ec:e0:69:fd",
            "net2": "12:23:7f:12:d3:b9",
            "net3": "9e:f6:88:e1:dd:87",
            "net4": "e6:3c:e1:90:36:85",
            "net5": "22:2b:5d:0e:c7:d6",
            "net6": "52:0a:a1:17:40:3d"
        },
        "leaf_4_0_6": {
            "net0": "82:14:e1:75:e5:81",
            "net1": "7a:f8:70:38:a8:98",
            "net2": "9e:77:25:75:ef:97",
            "net3": "72:f0:58:05:f8:be",
            "net4": "be:56:89:f0:82:2b",
            "net5": "e6:25:a1:90:6b:b9",
            "net6": "aa:40:da:90:3e:e7"
        },
        "spine_1_1_1": {
            "net0": "4e:22:cd:8d:29:26",
            "net1": "ea:b2:32:de:bd:f6",
            "net10": "86:04:10:4f:ce:f5",
            "net11": "8e:cb:1a:d3:67:23",
            "net2": "96:6b:4f:ab:09:6e",
            "net3": "86:ab:b4:f4:49:49",
            "net4": "7e:92:60:cb:02:cc",
            "net5": "fa:13:90:bf:a1:df",
            "net6": "3a:32:2c:87:08:23",
            "net7": "42:77:3c:cd:de:0f",
            "net8": "9a:54:59:fa:d8:fc",
            "net9": "1a:8c:60:a5:24:51"
        },
        "spine_1_1_2": {
            "net0": "26:3b:37:c3:0d:b1",
            "net1": "c6:23:cc:97:47:4f",
            "net10": "f2:77:b5:56:5a:97",
            "net11": "d2:61:ce:7b:f7:64",
            "net2": "ce:9e:22:7d:c9:41",
            "net3": "c2:b7:73:a8:6d:fd",
            "net4": "66:d4:4a:2d:45:e1",
            "net5": "16:97:ac:42:05:68",
            "net6": "0e:bb:35:aa:cb:ca",
            "net7": "0a:0f:08:ee:99:65",
            "net8": "e6:7b:d5:77:a8:c6",
            "net9": "ee:ea:9c:07:69:fa"
        },
        "spine_1_1_3": {
            "net0": "4e:e6:56:3b:29:08",
            "net1": "c2:36:3d:b4:bc:b6",
            "net10": "2a:98:f7:d1:9f:8c",
            "net11": "8e:7f:91:2d:c2:1b",
            "net2": "ca:f4:8c:8f:c1:9a",
            "net3": "b2:80:6b:2f:b1:b7",
            "net4": "1a:2c:83:c1:49:89",
            "net5": "9e:7d:c8:89:a5:13",
            "net6": "32:f3:c3:ea:61:02",
            "net7": "4a:c6:97:7e:70:4b",
            "net8": "c2:e0:98:d0:fa:2f",
            "net9": "7e:71:53:6a:a0:44"
        },
        "spine_1_1_4": {
            "net0": "9a:ad:bf:82:d4:b0",
            "net1": "6a:d6:dc:34:69:39",
            "net10": "56:79:e8:63:ab:ba",
            "net11": "4e:2c:53:5f:28:37",
            "net2": "6e:65:70:22:62:16",
            "net3": "42:d8:b8:81:4f:c4",
            "net4": "06:87:ed:a3:91:2d",
            "net5": "fe:fd:5e:c3:d0:ff",
            "net6": "2a:36:6f:e5:2e:42",
            "net7": "b2:26:5f:15:bc:a8",
            "net8": "62:08:3c:cf:8f:ce",
            "net9": "a6:b6:8f:d9:19:47"
        },
        "spine_1_1_5": {
            "net0": "82:40:42:fc:2a:b3",
            "net1": "5e:6d:44:72:b1:bd",
            "net10": "e2:ad:d9:f0:e0:9d",
            "net11": "6a:d8:75:f4:4b:e9",
            "net2": "26:98:ff:e5:bf:b7",
            "net3": "72:f5:4b:f2:45:ab",
            "net4": "4e:d8:b2:1c:9d:1d",
            "net5": "ee:7d:51:08:fc:b4",
            "net6": "c2:38:66:f4:9b:e0",
            "net7": "ee:98:30:17:58:24",
            "net8": "ee:a2:d4:18:b1:90",
            "net9": "96:1c:ae:16:10:c0"
        },
        "spine_1_1_6": {
            "net0": "a6:69:e6:25:7d:5e",
            "net1": "f2:b9:f5:f2:2b:75",
            "net10": "3a:b8:0d:54:23:22",
            "net11": "42:bb:56:2c:4a:8b",
            "net2": "92:cf:52:60:30:51",
            "net3": "a2:b6:8d:06:c6:02",
            "net4": "ba:52:43:d7:a5:90",
            "net5": "92:c4:57:f7:c3:26",
            "net6": "42:35:fe:7e:7e:64",
            "net7": "0e:6c:a6:9d:d3:57",
            "net8": "a2:93:0e:a2:f7:46",
            "net9": "72:eb:ef:39:d0:c5"
        },
        "spine_2_1_1": {
            "net0": "22:d2:c9:42:4d:c1",
            "net1": "ca:a5:cd:e6:5d:f1",
            "net10": "8a:c9:34:2e:52:1c",
            "net11": "ba:f5:e9:be:77:5d",
            "net2": "1e:da:d7:20:cb:ac",
            "net3": "9e:e1:cb:4e:c0:2a",
            "net4": "d2:87:a6:46:e2:67",
            "net5": "02:8e:d3:ca:b4:61",
            "net6": "d6:a8:f3:d3:b6:9a",
            "net7": "9a:7b:b0:1e:ba:0b",
            "net8": "22:79:56:2f:cc:39",
            "net9": "2e:49:85:b8:9b:bd"
        },
        "spine_2_1_2": {
            "net0": "82:d6:03:d9:e0:69",
            "net1": "12:af:4c:6b:89:9b",
            "net10": "7e:45:cf:d3:26:42",
            "net11": "86:35:1f:8c:a8:0c",
            "net2": "fe:46:f1:f2:57:3b",
            "net3": "d2:e7:2b:b6:d0:2c",
            "net4": "46:cc:fb:d1:dd:05",
            "net5": "56:52:9e:cb:d7:e6",
            "net6": "ea:e8:63:a8:cc:1f",
            "net7": "02:73:9e:81:c6:54",
            "net8": "7a:87:a6:3c:53:16",
            "net9": "46:27:5c:7c:39:7b"
        },
        "spine_2_1_3": {
            "net0": "76:3b:8a:ed:3c:84",
            "net1": "52:dc:3b:cb:2e:ff",
            "net10": "b2:43:dd:41:aa:c4",
            "net11": "92:d2:cd:3e:19:95",
            "net2": "96:1e:a7:d0:91:30",
            "net3": "7a:f4:b6:ff:f3:b3",
            "net4": "da:42:22:4a:14:4b",
            "net5": "ae:75:82:f9:4e:72",
            "net6": "8a:90:37:e5:44:8e",
            "net7": "4e:f5:ab:38:b4:2f",
            "net8": "46:e7:04:6a:dd:95",
            "net9": "66:29:ab:3f:11:90"
        },
        "spine_2_1_4": {
            "net0": "8a:3a:47:61:f8:24",
            "net1": "72:58:13:cb:b3:69",
            "net10": "8a:42:ee:4d:6e:2b",
            "net11": "96:42:29:82:2e:e9",
            "net2": "de:07:39:51:27:69",
            "net3": "06:35:ae:8f:26:6e",
            "net4": "a6:7f:da:1f:bf:07",
            "net5": "3a:a4:7d:1e:9a:56",
            "net6": "e2:13:ae:77:a9:89",
            "net7": "a6:a5:30:44:87:f7",
            "net8": "d6:5f:1a:20:8d:fa",
            "net9": "ea:78:0b:f5:9c:6b"
        },
        "spine_2_1_5": {
            "net0": "ee:d2:3e:30:2e:d7",
            "net1": "72:09:42:60:2b:b2",
            "net10": "06:87:00:86:12:45",
            "net11": "1a:88:c8:20:c2:da",
            "net2": "da:0f:50:53:95:0d",
            "net3": "92:a4:b5:25:96:c8",
            "net4": "02:d3:12:d5:ce:c5",
            "net5": "46:12:af:ce:91:3c",
            "net6": "b2:8c:1a:ec:7d:43",
            "net7": "62:da:af:d2:4d:d4",
            "net8": "2a:b8:ea:0c:dd:10",
            "net9": "aa:75:82:65:84:59"
        },
        "spine_2_1_6": {
            "net0": "b2:6b:b0:48:52:f4",
            "net1": "62:19:95:3d:86:90",
            "net10": "9a:00:92:d1:30:62",
            "net11": "de:55:e3:e0:c6:16",
            "net2": "42:8c:4c:93:2b:93",
            "net3": "3a:ad:40:1d:2c:79",
            "net4": "72:2c:df:99:fa:af",
            "net5": "16:98:7e:a1:7f:aa",
            "net6": "d6:45:03:fc:b7:5d",
            "net7": "7a:94:12:9a:ba:62",
            "net8": "f2:69:79:72:16:b5",
            "net9": "d2:47:a1:6f:6d:a2"
        },
        "spine_3_1_1": {
            "net0": "12:64:2b:fc:66:ea",
            "net1": "fa:42:f1:4f:fb:37",
            "net10": "f2:12:2a:34:5c:1b",
            "net11": "c2:a3:b0:8b:52:06",
            "net2": "2e:2e:2e:8b:b5:5a",
            "net3": "b2:0d:7d:ea:39:ce",
            "net4": "da:15:50:58:eb:9e",
            "net5": "0a:58:a5:09:0c:1a",
            "net6": "72:47:d9:ff:62:a8",
            "net7": "0a:f4:2a:12:06:00",
            "net8": "ba:88:77:62:52:bf",
            "net9": "6e:14:bc:f8:6e:3e"
        },
        "spine_3_1_2": {
            "net0": "b2:b4:d8:41:d1:f0",
            "net1": "ae:b1:53:27:7b:1e",
            "net10": "9a:73:29:aa:1e:84",
            "net11": "3a:03:1d:04:ad:24",
            "net2": "a6:ab:18:02:0e:fc",
            "net3": "56:00:8c:95:68:cc",
            "net4": "66:4d:56:bc:f0:24",
            "net5": "66:9b:a9:54:be:85",
            "net6": "e2:48:cc:68:7d:e7",
            "net7": "e6:a5:23:cf:ad:75",
            "net8": "92:d9:9a:3d:00:8e",
            "net9": "d2:90:72:9e:f3:27"
        },
        "spine_3_1_3": {
            "net0": "fa:78:7b:63:72:1d",
            "net1": "0e:18:d4:83:9f:08",
            "net10": "46:3e:89:b7:58:e4",
            "net11": "86:96:fe:fa:69:92",
            "net2": "fe:b7:44:91:f9:06",
            "net3": "ce:56:bb:64:08:dd",
            "net4": "82:6c:54:c8:31:6c",
            "net5": "2e:a3:f1:66:cc:72",
            "net6": "c6:c3:fc:8e:67:1e",
            "net7": "f2:c3:fd:34:45:41",
            "net8": "72:45:3a:28:dd:ce",
            "net9": "d2:37:1d:5e:81:f8"
        },
        "spine_3_1_4": {
            "net0": "4e:a9:e3:72:61:f8",
            "net1": "f2:70:65:c8:b1:e5",
            "net10": "2a:2a:24:a7:26:33",
            "net11": "72:16:75:64:ea:94",
            "net2": "fe:34:2b:3d:2a:46",
            "net3": "06:b5:e9:12:6e:fe",
            "net4": "f2:33:8d:cb:f1:10",
            "net5": "ae:a9:74:9e:ae:a1",
            "net6": "9a:f5:1d:7a:bc:af",
            "net7": "ae:e6:2a:55:51:f8",
            "net8": "fe:be:6f:8d:f2:1c",
            "net9": "8a:35:50:a2:c4:df"
        },
        "spine_3_1_5": {
            "net0": "b6:78:5e:35:85:a0",
            "net1": "16:9c:e2:bc:6f:93",
            "net10": "46:7f:25:d7:bd:e8",
            "net11": "4a:e6:70:2f:fc:59",
            "net2": "2e:33:09:1a:a1:47",
            "net3": "d2:f8:72:a6:2c:9c",
            "net4": "fa:62:1e:a1:bf:0a",
            "net5": "a2:96:cb:ab:3c:03",
            "net6": "0a:2e:da:2e:ca:53",
            "net7": "c6:ab:28:0d:4d:02",
            "net8": "46:06:07:ce:62:26",
            "net9": "2e:12:47:3c:dc:b0"
        },
        "spine_3_1_6": {
            "net0": "5a:ff:e3:68:84:7e",
            "net1": "06:8a:ab:64:da:7d",
            "net10": "52:98:09:03:d4:e2",
            "net11": "d6:4c:da:27:70:0f",
            "net2": "56:75:bd:1e:e6:37",
            "net3": "8a:de:8b:de:04:b2",
            "net4": "aa:33:0e:ce:b1:43",
            "net5": "ca:c8:1b:54:eb:08",
            "net6": "52:3b:9f:ba:fd:d8",
            "net7": "f2:b2:d1:ad:f9:b1",
            "net8": "32:48:ef:29:d2:da",
            "net9": "fe:e8:00:d9:6a:8c"
        },
        "spine_4_1_1": {
            "net0": "76:5e:20:5c:cf:6a",
            "net1": "12:dd:35:4d:6c:87",
            "net10": "fe:ef:e2:92:1e:1d",
            "net11": "0a:4d:b0:c6:0c:f3",
            "net2": "ee:a1:d4:f0:f4:e3",
            "net3": "be:48:9c:36:88:32",
            "net4": "52:4c:0f:de:93:b2",
            "net5": "76:fa:22:4b:1a:09",
            "net6": "72:1b:a4:ef:c1:5b",
            "net7": "5e:f1:41:bb:7b:5c",
            "net8": "02:5d:c8:41:61:db",
            "net9": "8e:f9:d6:6c:4f:c3"
        },
        "spine_4_1_2": {
            "net0": "36:24:e7:5b:79:52",
            "net1": "5e:04:d6:5e:35:5a",
            "net10": "12:b4:05:9f:25:4a",
            "net11": "ae:ef:c4:00:eb:c8",
            "net2": "ea:a3:ac:d9:6b:50",
            "net3": "ae:94:e5:3c:d9:22",
            "net4": "ba:fe:8b:25:e4:d7",
            "net5": "c2:bd:ef:9e:24:b1",
            "net6": "6e:44:99:3a:c3:0f",
            "net7": "56:a9:6c:e7:cd:e7",
            "net8": "c6:a3:86:03:dd:a3",
            "net9": "62:df:cc:80:7e:db"
        },
        "spine_4_1_3": {
            "net0": "3e:c7:8a:22:03:b7",
            "net1": "3a:d0:31:41:38:7e",
            "net10": "76:1e:51:ab:d1:71",
            "net11": "a2:49:94:ff:3e:40",
            "net2": "b2:11:22:86:e4:e7",
            "net3": "f2:ad:2c:cb:58:8f",
            "net4": "fe:88:93:71:e7:ee",
            "net5": "ee:56:e1:de:58:fd",
            "net6": "36:c6:59:79:ba:c8",
            "net7": "92:de:0c:3f:c9:b5",
            "net8": "ee:de:eb:1a:eb:2d",
            "net9": "4e:1d:83:af:2e:7c"
        },
        "spine_4_1_4": {
            "net0": "4e:0c:e5:f6:55:86",
            "net1": "6e:03:1d:0b:21:31",
            "net10": "ce:9d:b5:c9:e2:1c",
            "net11": "6a:aa:2b:bc:76:98",
            "net2": "9e:d7:e4:1d:f2:96",
            "net3": "5e:2e:a8:e2:c2:15",
            "net4": "e6:52:6d:5f:da:d7",
            "net5": "ca:3f:aa:87:44:37",
            "net6": "5e:3d:b6:f4:3a:26",
            "net7": "06:81:0b:90:22:3d",
            "net8": "3e:17:dc:19:83:4d",
            "net9": "ae:59:3c:bb:5b:76"
        },
        "spine_4_1_5": {
            "net0": "16:ab:d5:c9:2d:11",
            "net1": "c2:89:a2:b5:93:d6",
            "net10": "da:4c:eb:3b:ae:e7",
            "net11": "3a:fd:71:9f:e1:22",
            "net2": "96:c7:14:77:e7:b3",
            "net3": "92:00:88:b0:be:22",
            "net4": "1a:fd:85:7d:e9:fb",
            "net5": "46:c7:d0:c8:d9:f5",
            "net6": "0e:58:fc:3d:83:e1",
            "net7": "c2:0b:f6:0c:28:d6",
            "net8": "5a:76:64:74:cb:8c",
            "net9": "fe:f4:fc:40:be:f4"
        },
        "spine_4_1_6": {
            "net0": "d2:9e:b7:66:26:82",
            "net1": "32:28:be:01:9e:03",
            "net10": "66:51:f6:f5:ea:5c",
            "net11": "ba:68:56:06:40:a5",
            "net2": "ee:4b:1a:f4:ee:e7",
            "net3": "4e:5e:ba:36:7a:ce",
            "net4": "4e:53:45:05:d0:bc",
            "net5": "82:9d:22:7b:17:a5",
            "net6": "8a:1a:e4:6a:8a:8c",
            "net7": "ea:5d:e6:91:10:98",
            "net8": "22:cd:bc:64:a6:82",
            "net9": "86:f9:28:56:66:49"
        },
        "tof_1_2_1": {
            "net0": "0e:67:72:a5:4c:72",
            "net1": "06:82:d5:fb:74:91",
            "net10": "46:ac:f6:63:8e:3d",
            "net11": "3a:ea:4e:83:3a:30",
            "net2": "72:3c:92:19:fc:03",
            "net3": "1e:76:6c:5a:f6:c3",
            "net4": "3a:e0:9e:82:c4:0a",
            "net5": "c6:2f:db:37:34:09",
            "net6": "62:4a:a7:50:97:9b",
            "net7": "f6:d3:e8:b0:7f:9d",
            "net8": "be:c9:a1:b0:6e:34",
            "net9": "c2:07:0c:6b:e3:aa"
        },
        "tof_1_2_2": {
            "net0": "ca:b0:85:c0:5a:6e",
            "net1": "c2:29:92:f4:13:af",
            "net10": "22:d3:5e:73:c6:a3",
            "net11": "aa:e2:40:19:34:12",
            "net2": "ea:18:2b:fa:c0:7f",
            "net3": "ba:23:8c:3c:71:c5",
            "net4": "e6:dd:46:c0:6a:eb",
            "net5": "7a:21:b6:67:a5:d9",
            "net6": "d6:8c:94:20:4f:17",
            "net7": "4a:99:47:8f:dc:9e",
            "net8": "3a:95:6c:5a:2a:9d",
            "net9": "de:e6:9d:d7:30:63"
        },
        "tof_1_2_3": {
            "net0": "9e:f3:79:56:9f:d0",
            "net1": "5a:44:4a:b9:23:50",
            "net10": "56:ac:3b:d3:30:96",
            "net11": "76:ed:b2:b9:50:da",
            "net2": "ba:b2:46:8e:61:72",
            "net3": "82:97:b4:d5:fa:d7",
            "net4": "02:12:30:e2:0e:c6",
            "net5": "0e:3d:da:55:7c:b5",
            "net6": "ee:9c:64:e2:67:57",
            "net7": "ae:e6:61:b2:42:d1",
            "net8": "c6:ee:26:66:71:06",
            "net9": "82:cc:b3:f7:28:e7"
        },
        "tof_1_2_4": {
            "net0": "4a:a3:76:4e:44:11",
            "net1": "86:16:03:86:57:df",
            "net10": "a6:e5:84:c5:93:c3",
            "net11": "62:43:7f:8d:d5:75",
            "net2": "46:21:e9:52:cd:b7",
            "net3": "22:a4:bc:e0:6f:90",
            "net4": "ae:2a:96:d1:98:36",
            "net5": "6a:9a:6a:e3:41:11",
            "net6": "ce:b6:84:39:b4:fc",
            "net7": "76:0a:36:25:2f:6a",
            "net8": "9e:2b:f9:96:91:5f",
            "net9": "16:ee:5f:c7:4e:0b"
        },
        "tof_1_2_5": {
            "net0": "6e:67:fa:ca:d3:65",
            "net1": "ae:36:28:c2:df:8e",
            "net10": "16:66:ea:8c:9c:27",
            "net11": "7a:cb:ac:4d:ac:a2",
            "net2": "96:ef:2d:ba:6c:5a",
            "net3": "da:4e:a3:58:f7:92",
            "net4": "92:c3:49:40:33:19",
            "net5": "3a:d9:0b:cc:71:a9",
            "net6": "ae:6f:f9:ba:01:22",
            "net7": "22:ae:10:dd:d2:fc",
            "net8": "ba:21:f1:c4:14:f8",
            "net9": "52:1e:74:82:07:cf"
        },
        "tof_1_2_6": {
            "net0": "12:50:84:d7:44:bc",
            "net1": "c2:54:d3:5e:50:8f",
            "net10": "9e:0c:a6:12:6e:ac",
            "net11": "1a:bd:a9:07:b2:ff",
            "net2": "e6:9e:a1:02:e3:fd",
            "net3": "be:1b:b7:96:c5:fe",
            "net4": "f6:76:a3:ae:f3:b7",
            "net5": "36:e0:0a:a8:6e:6b",
            "net6": "da:d6:62:d8:ac:88",
            "net7": "1e:e6:b6:d8:b3:41",
            "net8": "7a:c3:2d:34:97:a1",
            "net9": "7a:88:fc:63:be:0f"
        },
        "tof_2_2_1": {
            "net0": "12:7d:88:da:c9:a7",
            "net1": "6e:dc:eb:48:a7:8e",
            "net10": "22:e1:e7:58:71:54",
            "net11": "0a:09:44:c2:7c:6d",
            "net2": "da:26:e6:f5:5f:4f",
            "net3": "ce:4c:5a:8d:2e:c7",
            "net4": "8e:44:fc:b6:3e:fa",
            "net5": "0a:78:a1:2e:a2:50",
            "net6": "1a:c3:3b:cf:8e:5a",
            "net7": "ee:c0:26:7f:30:07",
            "net8": "06:c4:c3:a5:c3:d2",
            "net9": "4e:58:18:a5:ac:2a"
        },
        "tof_2_2_2": {
            "net0": "56:73:49:3c:5c:00",
            "net1": "b6:7b:d9:6c:50:6e",
            "net10": "1e:fd:3c:4b:3b:02",
            "net11": "fe:14:ff:42:da:ed",
            "net2": "7a:c2:a0:50:5d:39",
            "net3": "6e:ff:d1:c0:80:3c",
            "net4": "76:3b:50:b4:eb:92",
            "net5": "6a:05:7f:18:43:28",
            "net6": "b6:f3:aa:20:c6:0f",
            "net7": "2e:39:18:f0:a2:cc",
            "net8": "a2:fa:50:94:bd:6e",
            "net9": "52:3f:7c:48:40:c6"
        },
        "tof_2_2_3": {
            "net0": "86:d6:cb:15:8b:4b",
            "net1": "72:d9:80:c5:d3:c8",
            "net10": "2a:ca:1d:eb:32:39",
            "net11": "06:bb:ea:a5:8b:07",
            "net2": "0a:08:42:93:b7:2d",
            "net3": "c2:f8:b7:90:e0:12",
            "net4": "5a:48:2c:2b:38:9d",
            "net5": "96:d7:68:37:87:a6",
            "net6": "e6:6e:a3:1b:97:e4",
            "net7": "f6:40:3f:30:d6:ac",
            "net8": "ce:08:3b:92:38:62",
            "net9": "ca:2e:6f:cf:59:2d"
        },
        "tof_2_2_4": {
            "net0": "d2:f5:33:0a:92:0c",
            "net1": "f6:92:2c:d8:ee:c3",
            "net10": "86:b7:16:6c:bb:e9",
            "net11": "6a:86:1a:cd:9a:44",
            "net2": "fe:65:61:43:4e:63",
            "net3": "f2:be:b2:f8:11:df",
            "net4": "16:42:66:3f:b8:2d",
            "net5": "ae:e8:b8:f4:47:97",
            "net6": "3a:72:d1:4e:a9:5a",
            "net7": "aa:28:81:55:f7:c4",
            "net8": "26:40:9e:8d:6b:e9",
            "net9": "72:08:72:fc:b0:84"
        },
        "tof_2_2_5": {
            "net0": "e6:2c:17:22:53:3d",
            "net1": "aa:d7:fd:5a:8a:fd",
            "net10": "6e:5b:b9:bf:2e:ce",
            "net11": "9e:3f:a5:80:7a:99",
            "net2": "02:3b:0a:ed:96:ef",
            "net3": "26:5f:4f:3d:e9:a0",
            "net4": "9e:06:9d:22:c3:fa",
            "net5": "0a:2e:53:9e:6d:b0",
            "net6": "9e:69:b8:29:55:e1",
            "net7": "0e:52:cf:57:ff:06",
            "net8": "0a:d9:74:71:d3:60",
            "net9": "42:cd:9e:01:7c:cf"
        },
        "tof_2_2_6": {
            "net0": "c6:7b:8b:54:41:a4",
            "net1": "26:ad:f8:11:a4:b8",
            "net10": "fe:75:d2:05:3c:ba",
            "net11": "66:79:c4:02:e2:ba",
            "net2": "82:90:30:10:04:94",
            "net3": "66:77:3a:67:cf:e2",
            "net4": "b2:26:b4:25:42:c0",
            "net5": "d2:cf:c1:b6:fa:37",
            "net6": "ae:b6:bc:0f:0d:a6",
            "net7": "ee:e7:5f:bc:7b:ee",
            "net8": "86:12:e2:2a:44:ee",
            "net9": "56:49:3d:64:c6:cb"
        }
    },
    "failed_machine": "spine_1_1_1",
    "failure_time": 1616308316.2759705,
    "recover_time": 1616308410.513199
}