{
    "description": "Scenario 3a: Leaf leaf_1_0_1 failure with BGP",
    "k_leaf": 8,
    "k_top": 8,
    "redundancy_factor": 4,
    "is_k8s": true,
    "machine_mac_addresses": {
        "leaf_1_0_1": {
            "net0": "ce:2d:8a:ab:f0:61",
            "net1": "7e:76:6f:45:44:e0",
            "net2": "02:ed:61:28:c1:0d",
            "net3": "aa:dd:a6:ee:36:66",
            "net4": "0a:f4:48:80:1b:f0",
            "net5": "26:5e:c7:d4:f9:26",
            "net6": "86:05:f8:07:fe:5f",
            "net7": "2a:1a:f4:7d:d2:e0",
            "net8": "92:44:ee:54:19:45"
        },
        "leaf_1_0_2": {
            "net0": "26:25:40:68:a1:13",
            "net1": "7a:3e:fd:e1:75:b4",
            "net2": "d6:80:cd:6f:26:3e",
            "net3": "96:b9:b6:78:13:7c",
            "net4": "3a:fe:24:c0:5f:d1",
            "net5": "ee:d4:50:c8:f7:73",
            "net6": "46:66:c8:6e:4d:d5",
            "net7": "42:49:f1:a1:4c:31",
            "net8": "46:b0:cd:e6:0a:dd"
        },
        "leaf_1_0_3": {
            "net0": "a2:f9:f2:ca:cf:68",
            "net1": "ae:e8:0c:6e:e0:67",
            "net2": "76:73:1a:0a:5e:3a",
            "net3": "2e:68:db:14:e2:cb",
            "net4": "da:3d:f8:5c:eb:4e",
            "net5": "16:69:88:ff:8b:b3",
            "net6": "46:2d:c6:ce:b7:8e",
            "net7": "4a:42:ee:39:02:93",
            "net8": "66:ad:21:15:eb:0a"
        },
        "leaf_1_0_4": {
            "net0": "52:bf:bc:7d:78:8f",
            "net1": "6e:a4:47:f7:15:d2",
            "net2": "1a:79:55:29:c9:f5",
            "net3": "52:ea:a8:6d:3f:22",
            "net4": "ba:87:ab:57:5f:4a",
            "net5": "42:01:71:a3:29:96",
            "net6": "d2:94:27:b9:75:ca",
            "net7": "3a:d8:de:d0:ff:b2",
            "net8": "82:99:da:0b:a6:22"
        },
        "leaf_1_0_5": {
            "net0": "e6:79:ae:45:c8:4e",
            "net1": "22:70:e5:cc:ae:b2",
            "net2": "1e:1a:b7:de:42:52",
            "net3": "aa:fc:e9:2d:5b:98",
            "net4": "f2:a8:13:24:5f:55",
            "net5": "86:da:0e:f7:ad:12",
            "net6": "96:e8:1e:95:b9:a4",
            "net7": "1a:ec:be:cd:5b:19",
            "net8": "b6:d2:a3:f6:4c:58"
        },
        "leaf_1_0_6": {
            "net0": "0a:cf:51:ff:b5:d7",
            "net1": "56:f2:98:26:c9:3e",
            "net2": "02:03:89:42:51:b4",
            "net3": "5e:eb:6b:93:4b:2d",
            "net4": "0e:8c:3f:64:8c:e6",
            "net5": "42:73:93:7c:cd:e6",
            "net6": "3e:d8:bf:41:1d:28",
            "net7": "e6:06:a6:75:c7:fd",
            "net8": "6a:ca:4d:92:9b:1a"
        },
        "leaf_1_0_7": {
            "net0": "1a:c7:8a:53:95:41",
            "net1": "c2:a6:74:71:7f:e5",
            "net2": "7a:0d:3d:90:2c:82",
            "net3": "c6:6e:17:12:e6:c1",
            "net4": "c2:64:ac:fe:aa:0b",
            "net5": "62:91:c2:85:c1:5a",
            "net6": "f2:41:6c:b5:64:ed",
            "net7": "1a:a0:72:3a:98:0a",
            "net8": "1a:a7:6b:09:e7:9b"
        },
        "leaf_1_0_8": {
            "net0": "4e:eb:a7:00:7d:0d",
            "net1": "ea:9d:ab:04:8e:3f",
            "net2": "4e:1f:d2:a3:3b:eb",
            "net3": "62:2d:ed:da:1a:b9",
            "net4": "2e:10:71:0e:e3:93",
            "net5": "52:68:89:90:0b:06",
            "net6": "0a:77:c7:2d:5b:9a",
            "net7": "12:22:50:2b:2c:9b",
            "net8": "06:35:29:31:e2:60"
        },
        "leaf_2_0_1": {
            "net0": "c6:66:44:f2:e3:84",
            "net1": "c6:c3:8c:05:d0:c1",
            "net2": "9e:de:1c:a6:76:ff",
            "net3": "0a:b5:16:51:82:90",
            "net4": "36:4d:c7:d0:dc:74",
            "net5": "8a:49:ec:8f:29:ac",
            "net6": "72:35:62:3b:69:48",
            "net7": "9a:1d:a7:50:0d:23",
            "net8": "d6:dc:3f:e7:ae:68"
        },
        "leaf_2_0_2": {
            "net0": "ce:c8:dc:db:04:62",
            "net1": "de:17:88:1d:2e:06",
            "net2": "5a:98:94:01:99:48",
            "net3": "9e:cc:35:66:34:45",
            "net4": "2e:1a:be:ce:5e:08",
            "net5": "22:b9:01:fe:d0:f8",
            "net6": "5a:19:de:49:62:9b",
            "net7": "1a:f1:10:8b:23:d3",
            "net8": "da:0a:40:64:62:00"
        },
        "leaf_2_0_3": {
            "net0": "e2:da:97:6b:98:a2",
            "net1": "ba:e0:63:ba:38:74",
            "net2": "12:fe:b6:76:3f:a4",
            "net3": "46:fc:a9:8f:52:ba",
            "net4": "32:49:85:56:67:95",
            "net5": "22:59:3b:ca:8a:43",
            "net6": "ba:c3:f2:5c:a3:b6",
            "net7": "da:5b:f4:4e:a7:17",
            "net8": "26:89:90:fa:8b:3f"
        },
        "leaf_2_0_4": {
            "net0": "6a:94:43:56:d9:59",
            "net1": "4a:16:a1:59:4f:02",
            "net2": "82:35:c1:08:5f:32",
            "net3": "96:75:33:7e:fd:35",
            "net4": "06:24:b1:97:7b:60",
            "net5": "52:18:54:6d:45:f3",
            "net6": "82:49:e0:df:ee:ed",
            "net7": "26:19:7c:eb:b4:d4",
            "net8": "7e:a8:b7:9e:86:ea"
        },
        "leaf_2_0_5": {
            "net0": "4a:f3:20:9a:0a:ea",
            "net1": "ce:77:c6:80:da:5c",
            "net2": "72:cb:9a:8e:86:a2",
            "net3": "6a:57:40:89:59:42",
            "net4": "b2:64:3e:59:51:e0",
            "net5": "46:d4:1e:97:a9:78",
            "net6": "f2:82:88:b9:d9:03",
            "net7": "d6:ae:81:85:0b:2d",
            "net8": "0a:a0:85:e1:5e:e7"
        },
        "leaf_2_0_6": {
            "net0": "f2:16:95:3d:cf:0f",
            "net1": "3a:bf:9c:10:6c:d8",
            "net2": "1a:9e:b3:5d:f2:4c",
            "net3": "96:3b:e1:e2:68:77",
            "net4": "d6:75:ca:46:f2:dc",
            "net5": "82:51:e9:2b:90:e6",
            "net6": "aa:fc:57:aa:82:fb",
            "net7": "5e:be:80:79:b8:5c",
            "net8": "3e:28:83:46:81:d2"
        },
        "leaf_2_0_7": {
            "net0": "ce:54:a8:13:97:ce",
            "net1": "2a:4d:fc:c5:06:55",
            "net2": "76:73:d3:b4:2b:40",
            "net3": "6e:98:13:0e:cc:cf",
            "net4": "7e:2b:12:4d:01:25",
            "net5": "1e:fa:26:6d:06:05",
            "net6": "4a:98:31:53:75:0f",
            "net7": "f2:82:ef:06:88:66",
            "net8": "4e:92:71:79:8d:e6"
        },
        "leaf_2_0_8": {
            "net0": "5e:ee:f5:5c:34:38",
            "net1": "12:ad:ae:54:f5:74",
            "net2": "f2:d4:2e:5b:1d:8e",
            "net3": "f6:47:e1:91:99:b3",
            "net4": "d6:f4:9a:70:93:1c",
            "net5": "ae:9f:28:8b:7d:d3",
            "net6": "aa:a1:01:f5:7f:b2",
            "net7": "ee:63:a1:fe:9b:7c",
            "net8": "ee:4c:f9:84:6e:02"
        },
        "leaf_3_0_1": {
            "net0": "8e:75:c0:24:30:2c",
            "net1": "1e:d2:8c:7b:53:f7",
            "net2": "16:94:f3:f0:e9:3b",
            "net3": "c2:72:13:fd:a1:4d",
            "net4": "42:c9:a0:d2:56:c4",
            "net5": "12:a0:b9:62:21:5b",
            "net6": "ba:5f:0d:6b:79:97",
            "net7": "ae:3b:4c:d8:be:81",
            "net8": "0e:ac:f3:4c:33:f8"
        },
        "leaf_3_0_2": {
            "net0": "62:45:8b:77:9b:6a",
            "net1": "8e:df:18:e2:96:e5",
            "net2": "9e:e9:ff:6b:f0:d7",
            "net3": "3e:10:91:f4:12:56",
            "net4": "f6:6e:c3:0d:4d:bc",
            "net5": "4e:3c:73:a7:a5:27",
            "net6": "72:cf:b0:1b:0d:47",
            "net7": "16:f5:b2:7b:af:dd",
            "net8": "1a:ae:e1:c0:1d:79"
        },
        "leaf_3_0_3": {
            "net0": "b2:a5:5e:da:03:7a",
            "net1": "72:dd:58:ca:76:55",
            "net2": "ca:7a:ff:29:09:4f",
            "net3": "d6:b5:3f:7f:f6:ff",
            "net4": "a6:60:61:08:d5:5e",
            "net5": "b6:57:89:e2:6c:db",
            "net6": "1a:56:27:50:73:8a",
            "net7": "a2:f3:18:9f:27:2e",
            "net8": "42:36:80:ef:44:25"
        },
        "leaf_3_0_4": {
            "net0": "3a:29:a5:c7:5b:1f",
            "net1": "82:e4:a7:65:a8:27",
            "net2": "b6:6e:6e:18:7b:a6",
            "net3": "76:10:3c:27:38:4b",
            "net4": "9a:b8:e0:b4:6e:4f",
            "net5": "22:4f:c4:cb:36:a7",
            "net6": "ca:2a:5b:df:f5:59",
            "net7": "1e:a4:75:ec:fc:19",
            "net8": "2a:ac:41:63:c9:9b"
        },
        "leaf_3_0_5": {
            "net0": "d6:8e:b9:23:96:7c",
            "net1": "06:7e:10:2f:c5:d7",
            "net2": "02:25:0a:88:b1:9c",
            "net3": "72:b9:7b:c0:85:ab",
            "net4": "66:4b:a0:42:cd:4c",
            "net5": "5e:99:84:b1:c2:8f",
            "net6": "a2:2c:26:1c:1d:61",
            "net7": "9a:4d:92:30:d3:9d",
            "net8": "4a:b4:33:e3:2d:d6"
        },
        "leaf_3_0_6": {
            "net0": "9a:ce:4e:ed:d5:76",
            "net1": "ce:90:63:f7:9b:5f",
            "net2": "62:2b:15:21:7d:65",
            "net3": "16:5e:ee:2c:80:33",
            "net4": "16:74:0e:99:23:0b",
            "net5": "6e:b8:e6:74:8e:f4",
            "net6": "c2:28:6b:0f:c8:44",
            "net7": "3a:62:4f:3f:9a:bd",
            "net8": "8a:e7:cc:84:0d:25"
        },
        "leaf_3_0_7": {
            "net0": "96:f8:91:c2:75:71",
            "net1": "fe:84:cc:7a:46:68",
            "net2": "82:a3:d8:cf:c9:d5",
            "net3": "46:5b:26:d3:93:44",
            "net4": "7a:f6:cd:c8:90:b1",
            "net5": "62:9b:f9:09:e9:38",
            "net6": "46:9d:61:c5:62:bc",
            "net7": "fa:18:19:a4:84:6c",
            "net8": "ae:65:76:18:7b:3e"
        },
        "leaf_3_0_8": {
            "net0": "7e:c6:98:06:2a:23",
            "net1": "b6:ac:24:a3:15:71",
            "net2": "ea:d7:42:80:36:8b",
            "net3": "56:53:7e:96:3d:ba",
            "net4": "2e:c0:f0:45:11:69",
            "net5": "d2:a0:27:83:47:eb",
            "net6": "02:34:54:06:dc:9a",
            "net7": "f6:f1:b2:aa:25:25",
            "net8": "16:33:91:f7:1b:5d"
        },
        "leaf_4_0_1": {
            "net0": "8a:d4:9e:95:55:39",
            "net1": "6e:1c:10:d6:fa:93",
            "net2": "f2:0d:2c:b2:52:91",
            "net3": "fa:d7:59:31:94:2d",
            "net4": "5e:03:a2:18:70:bb",
            "net5": "62:83:25:20:48:68",
            "net6": "7a:75:65:0e:b5:f4",
            "net7": "2a:2c:8b:20:5a:98",
            "net8": "ea:f3:05:96:33:92"
        },
        "leaf_4_0_2": {
            "net0": "f6:a2:94:77:cd:1f",
            "net1": "fa:a2:b6:b1:28:f4",
            "net2": "ae:9d:ed:99:15:21",
            "net3": "72:a5:e0:ea:d7:30",
            "net4": "d2:6c:62:2a:33:dc",
            "net5": "5e:19:ec:ce:d0:cb",
            "net6": "92:ae:ea:2a:c0:b0",
            "net7": "ce:a3:9d:d6:76:15",
            "net8": "fa:03:9d:f9:39:4b"
        },
        "leaf_4_0_3": {
            "net0": "ca:3e:67:64:47:57",
            "net1": "92:1e:5d:5a:44:80",
            "net2": "f6:c5:62:3d:1e:e0",
            "net3": "9e:c4:18:f2:3e:4c",
            "net4": "5e:f0:eb:3d:d3:64",
            "net5": "9a:75:98:c0:66:54",
            "net6": "8e:43:4c:e0:4b:72",
            "net7": "8a:72:02:5d:ba:7d",
            "net8": "ea:0f:54:d1:82:84"
        },
        "leaf_4_0_4": {
            "net0": "22:28:0f:fc:f8:a4",
            "net1": "3a:25:cb:16:75:e9",
            "net2": "e6:43:03:72:31:a5",
            "net3": "5a:21:7e:6b:f2:bc",
            "net4": "82:77:bf:73:89:a6",
            "net5": "da:43:08:08:e3:c1",
            "net6": "1e:2d:a8:aa:c7:d7",
            "net7": "b6:36:71:c7:82:bf",
            "net8": "02:f0:fe:de:ac:b6"
        },
        "leaf_4_0_5": {
            "net0": "6e:27:75:46:07:99",
            "net1": "6a:29:ed:1c:dd:5b",
            "net2": "1a:84:0e:c3:21:a8",
            "net3": "96:38:8c:1f:3a:e2",
            "net4": "02:5f:a9:e9:88:de",
            "net5": "5e:00:9c:4d:f0:0b",
            "net6": "76:64:91:08:dc:9a",
            "net7": "fe:6b:07:82:cd:c9",
            "net8": "46:ca:01:f5:77:e1"
        },
        "leaf_4_0_6": {
            "net0": "e6:48:26:7c:f6:75",
            "net1": "fa:15:46:63:1a:be",
            "net2": "5e:53:a4:42:fd:dd",
            "net3": "a6:ac:5f:c0:0d:27",
            "net4": "e2:0f:4f:41:03:8f",
            "net5": "36:3a:87:e3:70:a3",
            "net6": "3e:8a:81:72:8b:1d",
            "net7": "7a:ec:2b:d2:87:79",
            "net8": "d6:80:2e:58:3e:d5"
        },
        "leaf_4_0_7": {
            "net0": "7e:a4:fd:e0:24:99",
            "net1": "c2:cc:d6:76:3b:bb",
            "net2": "7a:31:0a:23:49:2a",
            "net3": "16:7f:77:12:92:50",
            "net4": "f6:31:f8:c1:6a:3f",
            "net5": "56:90:c0:e8:8b:c5",
            "net6": "2a:ef:3f:79:66:45",
            "net7": "0a:71:9a:7e:fe:3f",
            "net8": "ae:c9:3f:e8:b1:5e"
        },
        "leaf_4_0_8": {
            "net0": "ae:b4:f3:c5:7c:2b",
            "net1": "4a:b3:d7:ef:32:dc",
            "net2": "b2:2f:d6:83:fc:32",
            "net3": "ee:30:74:1f:98:98",
            "net4": "2e:d3:fe:4e:83:e9",
            "net5": "82:01:6c:36:b8:f3",
            "net6": "1a:42:4b:0e:17:51",
            "net7": "62:0f:36:23:f7:88",
            "net8": "86:a8:83:63:b1:3c"
        },
        "spine_1_1_1": {
            "net0": "f2:97:ec:12:d1:67",
            "net1": "e6:88:3b:11:33:d3",
            "net10": "92:58:06:20:00:67",
            "net11": "96:66:a5:9a:cd:34",
            "net12": "1e:19:c2:b7:a7:8f",
            "net13": "76:6c:9f:b2:1a:6c",
            "net14": "e2:a2:09:a9:97:3d",
            "net15": "e6:b2:74:e1:a6:aa",
            "net2": "76:c1:bd:07:0c:71",
            "net3": "ae:a8:fd:16:8b:76",
            "net4": "de:9f:18:8f:b0:d3",
            "net5": "ba:e8:6c:07:b1:58",
            "net6": "66:0e:00:52:5a:38",
            "net7": "5a:3e:5d:69:9c:3d",
            "net8": "3a:a6:9e:36:2e:a2",
            "net9": "7e:c5:1d:cb:60:89"
        },
        "spine_1_1_2": {
            "net0": "b2:80:6a:66:b1:14",
            "net1": "7e:3c:5c:f3:c7:e8",
            "net10": "ce:f8:76:e1:c0:90",
            "net11": "6e:01:61:1a:0d:1b",
            "net12": "ee:28:cc:32:fa:8d",
            "net13": "b2:52:e2:87:14:c3",
            "net14": "16:92:64:07:a7:34",
            "net15": "22:54:33:d2:de:f9",
            "net2": "de:57:ed:8b:d4:ba",
            "net3": "ea:9a:fc:1c:c9:44",
            "net4": "26:7c:ee:22:9e:2d",
            "net5": "6e:74:6d:7a:85:fb",
            "net6": "26:e0:07:63:a0:ba",
            "net7": "e2:94:3a:0d:c6:9d",
            "net8": "6e:d3:e9:2e:52:74",
            "net9": "9e:8d:70:ad:1d:6b"
        },
        "spine_1_1_3": {
            "net0": "62:b6:9a:01:aa:dc",
            "net1": "2e:ea:e0:0f:54:16",
            "net10": "b2:aa:4d:0c:d3:c4",
            "net11": "22:9c:87:82:97:54",
            "net12": "5a:75:0a:6e:44:cc",
            "net13": "4a:a0:58:f5:14:a0",
            "net14": "72:d1:45:6f:bf:95",
            "net15": "76:4a:8c:32:19:23",
            "net2": "da:6b:ab:bf:5e:05",
            "net3": "1a:bc:20:81:d5:93",
            "net4": "46:25:b0:4d:f4:e9",
            "net5": "b6:a0:ba:8c:ee:83",
            "net6": "8a:68:2c:d0:53:89",
            "net7": "2e:fc:37:74:0b:a6",
            "net8": "76:36:61:3a:ea:b3",
            "net9": "02:e1:96:a5:8c:78"
        },
        "spine_1_1_4": {
            "net0": "d6:76:63:57:bd:35",
            "net1": "ae:7e:8f:83:1a:f3",
            "net10": "7e:86:19:5a:c2:b5",
            "net11": "5a:52:fa:d9:c1:06",
            "net12": "86:8b:de:46:94:08",
            "net13": "fa:d7:7d:6d:42:a7",
            "net14": "3a:6c:31:7d:ca:2a",
            "net15": "3a:85:bf:ad:5a:48",
            "net2": "c6:75:5b:03:0d:41",
            "net3": "0e:b2:07:5a:64:37",
            "net4": "96:08:f7:a0:a8:56",
            "net5": "32:2e:54:ef:23:4a",
            "net6": "52:9c:23:a2:4d:a2",
            "net7": "ba:d2:af:8e:d1:8a",
            "net8": "5a:a6:69:43:e0:bd",
            "net9": "9a:7c:d0:e9:cc:0f"
        },
        "spine_1_1_5": {
            "net0": "be:0f:83:94:54:8c",
            "net1": "be:55:d0:33:63:90",
            "net10": "aa:81:55:5d:9d:5c",
            "net11": "f6:52:10:b8:44:3f",
            "net12": "2a:81:2e:a4:95:28",
            "net13": "a6:26:c8:56:2d:93",
            "net14": "a2:3c:d7:27:1a:37",
            "net15": "42:ce:a3:0d:43:3a",
            "net2": "5a:ae:75:d3:e3:2b",
            "net3": "7a:20:5e:c0:b1:7b",
            "net4": "02:68:dc:f8:c2:85",
            "net5": "12:d1:6d:b5:bd:21",
            "net6": "b6:53:b1:35:96:82",
            "net7": "9a:a8:2a:b6:20:93",
            "net8": "ee:ef:43:70:cc:40",
            "net9": "a6:8e:d2:c7:a0:7c"
        },
        "spine_1_1_6": {
            "net0": "76:0b:a8:d9:b0:97",
            "net1": "06:3d:b3:af:45:a0",
            "net10": "8a:d2:3a:79:be:30",
            "net11": "a2:2f:31:84:07:be",
            "net12": "3e:b2:7f:1d:ed:e4",
            "net13": "be:77:cf:4c:c8:7b",
            "net14": "c2:64:42:9a:c7:22",
            "net15": "12:be:2c:3e:fa:6d",
            "net2": "86:51:47:1a:37:3d",
            "net3": "d6:64:4d:17:21:23",
            "net4": "d6:76:29:00:4e:88",
            "net5": "f2:df:4e:10:b5:fa",
            "net6": "36:c0:ca:0b:04:bc",
            "net7": "92:13:46:b8:40:6a",
            "net8": "f6:ab:b0:d9:52:2c",
            "net9": "52:94:2d:f3:37:06"
        },
        "spine_1_1_7": {
            "net0": "36:e8:9a:8d:72:f0",
            "net1": "ea:7d:94:99:02:9f",
            "net10": "32:ea:09:48:76:22",
            "net11": "c6:47:e5:12:be:0f",
            "net12": "72:88:a3:1f:c0:1b",
            "net13": "92:4e:09:77:96:01",
            "net14": "32:60:93:ef:fb:41",
            "net15": "5a:30:e6:21:8b:9f",
            "net2": "26:81:4a:97:3c:74",
            "net3": "b2:9e:31:9e:ca:39",
            "net4": "d6:69:cf:17:42:e3",
            "net5": "56:af:f8:6e:f4:9e",
            "net6": "36:46:3d:1a:eb:c8",
            "net7": "8a:47:4b:73:85:37",
            "net8": "8a:c1:78:42:fb:12",
            "net9": "ae:4a:d4:4b:38:1b"
        },
        "spine_1_1_8": {
            "net0": "9a:11:5a:fc:91:59",
            "net1": "fe:82:04:35:79:02",
            "net10": "a6:1c:47:e9:ed:68",
            "net11": "6e:51:40:aa:f0:ec",
            "net12": "1e:97:d0:80:24:d1",
            "net13": "32:1f:a3:49:e8:36",
            "net14": "8e:69:bc:1d:bb:e1",
            "net15": "92:7c:67:89:de:45",
            "net2": "6a:98:f0:c6:96:6c",
            "net3": "fa:c6:b1:67:e3:e4",
            "net4": "26:3b:8f:31:b2:ec",
            "net5": "aa:dc:48:4e:59:68",
            "net6": "36:61:92:44:1f:48",
            "net7": "6a:8f:9d:1a:e6:46",
            "net8": "72:7e:f3:0a:b6:96",
            "net9": "02:ea:c3:6e:af:02"
        },
        "spine_2_1_1": {
            "net0": "2a:bb:0f:71:01:dc",
            "net1": "8a:54:d9:ed:8a:81",
            "net10": "16:59:32:4b:07:06",
            "net11": "a2:df:d6:96:94:bd",
            "net12": "da:cd:dc:11:c6:c1",
            "net13": "2e:78:d9:bd:d0:f7",
            "net14": "1a:50:6e:84:11:dc",
            "net15": "6e:b4:f8:10:72:60",
            "net2": "fe:7a:19:be:ca:4d",
            "net3": "e6:62:0b:a2:8d:7c",
            "net4": "3e:f3:14:1f:11:83",
            "net5": "d6:b6:3f:85:23:97",
            "net6": "16:8e:4d:45:58:cf",
            "net7": "46:a0:f1:b4:d4:71",
            "net8": "2e:cf:cf:20:53:76",
            "net9": "1a:43:48:a4:91:67"
        },
        "spine_2_1_2": {
            "net0": "5e:76:39:75:ae:f3",
            "net1": "1a:4e:f7:c5:c3:e6",
            "net10": "6e:ed:9a:85:54:36",
            "net11": "6a:67:08:ad:9e:70",
            "net12": "fe:80:b7:ed:7d:db",
            "net13": "3e:60:ab:d9:e4:7e",
            "net14": "86:94:22:61:1e:2e",
            "net15": "c2:7d:13:9d:b2:94",
            "net2": "32:76:2d:2b:89:44",
            "net3": "de:97:7d:65:48:12",
            "net4": "c2:87:60:40:8f:ba",
            "net5": "fa:8e:e4:ef:a4:1f",
            "net6": "ca:6c:7f:2b:d1:c3",
            "net7": "62:f1:9e:71:15:75",
            "net8": "ce:37:0a:19:25:d6",
            "net9": "c6:49:97:f8:3f:e8"
        },
        "spine_2_1_3": {
            "net0": "aa:22:6a:8a:48:a5",
            "net1": "42:b6:6f:fa:5a:f2",
            "net10": "e6:9b:73:45:e8:0c",
            "net11": "42:ba:b1:56:99:55",
            "net12": "a6:54:e8:a2:54:04",
            "net13": "6e:44:eb:49:58:d0",
            "net14": "32:ff:67:91:02:e2",
            "net15": "a6:f8:5c:5a:8f:62",
            "net2": "5e:1f:f8:67:cc:6c",
            "net3": "de:79:99:56:c0:9c",
            "net4": "f6:48:bb:b8:12:37",
            "net5": "7a:1e:70:e2:1b:32",
            "net6": "4a:95:e1:3d:67:d3",
            "net7": "9a:32:52:1d:13:27",
            "net8": "ae:26:07:48:ea:c5",
            "net9": "96:fd:8d:ce:da:fd"
        },
        "spine_2_1_4": {
            "net0": "da:4f:d7:a5:72:ce",
            "net1": "42:d6:89:b1:9e:64",
            "net10": "be:8e:9c:1b:c9:44",
            "net11": "3a:04:aa:27:97:7c",
            "net12": "46:e1:d7:8d:a7:e8",
            "net13": "46:77:2e:9d:40:f7",
            "net14": "32:af:95:be:58:a0",
            "net15": "e6:af:75:a1:74:17",
            "net2": "9e:d8:6c:49:57:0a",
            "net3": "3a:8f:40:f2:ae:b7",
            "net4": "a6:89:90:ff:4d:2f",
            "net5": "0a:12:05:93:ac:19",
            "net6": "12:d5:2d:2d:6c:5f",
            "net7": "fe:b2:12:13:c1:bf",
            "net8": "9a:16:25:9a:ca:93",
            "net9": "3a:5b:c6:2d:50:b4"
        },
        "spine_2_1_5": {
            "net0": "de:23:2f:01:3f:e1",
            "net1": "86:36:63:5f:93:d1",
            "net10": "02:a7:d5:14:0b:8b",
            "net11": "d2:69:5c:6b:1c:20",
            "net12": "4a:8f:d4:81:87:23",
            "net13": "c6:d2:a0:a5:80:95",
            "net14": "36:12:08:21:59:15",
            "net15": "c2:1e:70:80:37:42",
            "net2": "1a:cc:2f:c8:0e:69",
            "net3": "76:2d:73:cd:7c:ee",
            "net4": "82:7b:72:b1:ba:f1",
            "net5": "92:0a:68:c0:a3:d9",
            "net6": "f6:dc:1b:65:58:77",
            "net7": "b2:98:d8:cd:3b:e7",
            "net8": "da:59:a3:5f:97:1e",
            "net9": "c2:b1:36:77:59:d6"
        },
        "spine_2_1_6": {
            "net0": "ca:ef:56:bb:9e:8b",
            "net1": "92:22:5b:d4:fe:1b",
            "net10": "5a:68:08:89:48:3d",
            "net11": "26:c7:c6:45:3b:a8",
            "net12": "b6:2e:b9:a1:56:d4",
            "net13": "a6:fc:31:d7:a6:e6",
            "net14": "1a:fc:c6:43:14:e9",
            "net15": "6e:b8:44:5d:20:3d",
            "net2": "22:34:c6:34:dc:b5",
            "net3": "ca:a3:39:bc:65:5a",
            "net4": "12:cf:bc:cb:a8:70",
            "net5": "aa:11:69:39:d3:92",
            "net6": "66:85:32:e5:77:a3",
            "net7": "3e:8b:58:7b:a9:16",
            "net8": "be:a1:5f:cd:f8:56",
            "net9": "12:01:d0:4b:44:b2"
        },
        "spine_2_1_7": {
            "net0": "fe:a7:d4:65:7f:4c",
            "net1": "92:f6:05:37:bc:a0",
            "net10": "d6:4e:58:a7:10:69",
            "net11": "36:61:09:6f:51:da",
            "net12": "4a:a4:7b:4a:c9:fb",
            "net13": "9a:25:dc:36:0d:d0",
            "net14": "f6:2e:fb:67:c1:d9",
            "net15": "fe:a8:5c:33:8d:32",
            "net2": "0a:86:ba:3a:b7:90",
            "net3": "8e:18:66:35:28:6c",
            "net4": "4e:c0:9c:60:c3:53",
            "net5": "8e:66:23:9c:c3:5e",
            "net6": "62:5b:e6:e3:63:3f",
            "net7": "62:0e:ae:37:88:91",
            "net8": "0a:00:42:f4:4b:fb",
            "net9": "8e:73:dd:9f:0d:a3"
        },
        "spine_2_1_8": {
            "net0": "ce:07:31:21:28:b7",
            "net1": "aa:ee:70:11:8f:37",
            "net10": "5e:f5:e7:83:be:4a",
            "net11": "12:51:4f:84:78:65",
            "net12": "e2:9b:70:96:05:e5",
            "net13": "f2:d3:0f:43:87:86",
            "net14": "d6:de:e3:de:40:6e",
            "net15": "46:9f:48:b5:ab:8d",
            "net2": "4e:a9:6c:02:0d:99",
            "net3": "5e:ad:93:af:07:45",
            "net4": "8a:53:f3:43:e6:a6",
            "net5": "36:5b:c9:71:f1:cf",
            "net6": "72:16:cf:65:d7:2b",
            "net7": "92:b5:26:c7:a5:35",
            "net8": "c2:d6:43:cb:79:0d",
            "net9": "82:68:17:16:23:a1"
        },
        "spine_3_1_1": {
            "net0": "12:33:bc:73:c5:43",
            "net1": "52:d8:6f:76:5f:0a",
            "net10": "2a:b7:d4:60:3a:17",
            "net11": "62:47:5c:2b:33:7e",
            "net12": "de:30:4c:54:4b:03",
            "net13": "66:d8:14:b4:4e:7d",
            "net14": "0e:27:77:07:96:8c",
            "net15": "4e:7f:70:0c:e5:fc",
            "net2": "62:a8:34:23:2a:77",
            "net3": "c6:d1:d1:cc:2b:b6",
            "net4": "6a:60:fe:88:d7:b1",
            "net5": "da:ad:6a:66:62:2d",
            "net6": "fe:43:6a:f0:ce:c4",
            "net7": "ea:cd:d0:e8:0c:39",
            "net8": "62:60:f7:54:0b:d2",
            "net9": "b2:e8:d2:cc:eb:97"
        },
        "spine_3_1_2": {
            "net0": "fe:fd:65:60:6c:e1",
            "net1": "fa:42:d5:8c:0d:c9",
            "net10": "82:44:7c:29:d9:ee",
            "net11": "06:6c:c9:4d:43:94",
            "net12": "9e:e1:3c:9a:5a:69",
            "net13": "9a:35:4e:ef:7b:06",
            "net14": "42:71:6f:4e:b7:81",
            "net15": "fa:8b:9b:4c:c4:65",
            "net2": "2a:3f:b8:71:79:e6",
            "net3": "02:65:9b:56:b2:69",
            "net4": "2a:18:ef:1d:af:1d",
            "net5": "c6:3f:0a:14:24:3d",
            "net6": "32:54:e8:e6:5c:ca",
            "net7": "6e:0d:72:46:8e:ee",
            "net8": "b2:28:11:1b:3f:43",
            "net9": "0a:5f:6e:4d:f6:e9"
        },
        "spine_3_1_3": {
            "net0": "4a:35:2f:9f:b3:4c",
            "net1": "56:17:6c:3d:72:26",
            "net10": "12:4f:95:2b:c9:ba",
            "net11": "5a:33:a0:11:3a:84",
            "net12": "72:83:45:fd:6d:d3",
            "net13": "d6:a0:4a:40:f1:32",
            "net14": "0e:ab:92:37:10:6a",
            "net15": "be:29:3a:45:00:88",
            "net2": "8e:42:75:f1:63:a9",
            "net3": "aa:41:2b:61:31:0e",
            "net4": "be:00:49:77:60:b2",
            "net5": "ce:f4:71:32:58:3b",
            "net6": "b2:a4:0a:05:55:aa",
            "net7": "12:66:39:67:19:cb",
            "net8": "1e:70:eb:a1:56:ad",
            "net9": "6a:e7:40:37:6d:61"
        },
        "spine_3_1_4": {
            "net0": "3e:fc:0e:f2:df:16",
            "net1": "e2:e2:3c:1a:f1:c2",
            "net10": "06:f1:23:5b:2d:de",
            "net11": "0e:a1:e2:f6:83:36",
            "net12": "ba:36:a9:15:86:a4",
            "net13": "5a:b2:3f:48:10:87",
            "net14": "ae:a2:1b:68:11:30",
            "net15": "7a:46:43:29:89:20",
            "net2": "ba:c7:90:66:9b:d7",
            "net3": "56:c1:5c:f5:a3:36",
            "net4": "b6:c8:bf:9b:a2:47",
            "net5": "0a:d8:5f:7f:44:06",
            "net6": "ca:26:c2:b2:ed:fd",
            "net7": "b2:e2:50:2c:31:6c",
            "net8": "42:43:4c:4e:c5:ec",
            "net9": "ca:0f:85:da:8b:95"
        },
        "spine_3_1_5": {
            "net0": "aa:48:25:52:f2:03",
            "net1": "aa:f4:bc:e9:2e:ec",
            "net10": "4a:c4:4e:0d:28:2a",
            "net11": "a2:c9:0f:98:a1:22",
            "net12": "26:e7:76:18:c3:30",
            "net13": "22:90:64:5d:94:24",
            "net14": "82:2c:85:f0:52:18",
            "net15": "1a:99:da:bc:07:05",
            "net2": "4a:e1:c2:db:50:fd",
            "net3": "22:45:aa:cf:49:ac",
            "net4": "b6:45:ba:bf:e2:ad",
            "net5": "da:4c:86:3f:a6:f9",
            "net6": "0a:29:a9:16:33:97",
            "net7": "da:cd:5c:0d:79:ed",
            "net8": "32:eb:bc:fe:de:cb",
            "net9": "82:00:7a:ad:c3:bb"
        },
        "spine_3_1_6": {
            "net0": "72:dd:14:1a:9a:3c",
            "net1": "3a:d3:5e:17:ce:44",
            "net10": "26:d2:9b:67:1a:47",
            "net11": "d2:d2:ca:30:ae:88",
            "net12": "12:64:64:93:96:c3",
            "net13": "de:49:5a:35:1f:8e",
            "net14": "56:3e:0c:b6:e8:66",
            "net15": "0e:9b:9a:6f:d6:3d",
            "net2": "e2:b4:60:59:30:25",
            "net3": "b6:de:ef:cf:a7:9d",
            "net4": "62:d8:c8:c6:01:72",
            "net5": "3a:8a:f7:94:23:5e",
            "net6": "de:0b:15:d8:db:36",
            "net7": "a2:37:da:00:34:30",
            "net8": "8e:e1:9a:59:ae:27",
            "net9": "ae:6f:10:76:08:db"
        },
        "spine_3_1_7": {
            "net0": "86:ad:1d:20:a6:94",
            "net1": "2a:5c:28:d5:51:d5",
            "net10": "0a:aa:29:bf:93:14",
            "net11": "3e:cd:93:fe:bc:06",
            "net12": "b6:fa:4c:5d:a1:cb",
            "net13": "f2:c0:94:93:9a:8e",
            "net14": "ae:04:cb:44:3b:3a",
            "net15": "a2:04:e6:63:4c:fa",
            "net2": "ce:b4:05:ec:32:cb",
            "net3": "e2:d1:f2:4e:d2:ad",
            "net4": "ba:85:29:12:e7:47",
            "net5": "c6:89:46:0f:72:b9",
            "net6": "72:15:06:0e:29:df",
            "net7": "02:fc:8e:26:0c:ea",
            "net8": "5e:2c:85:d7:67:e4",
            "net9": "8a:81:b1:65:18:ac"
        },
        "spine_3_1_8": {
            "net0": "c2:01:35:72:7f:e2",
            "net1": "c6:6f:9c:cd:1e:44",
            "net10": "4e:03:cb:88:05:4b",
            "net11": "a2:e0:1e:f6:7f:a9",
            "net12": "16:87:8f:6a:bb:56",
            "net13": "ce:ce:db:a6:0d:39",
            "net14": "1a:72:56:60:b9:b7",
            "net15": "02:87:a7:c7:5c:2a",
            "net2": "ba:8d:af:51:05:7d",
            "net3": "86:58:bf:97:20:73",
            "net4": "3e:9c:fe:f5:a5:6c",
            "net5": "4e:02:62:95:38:91",
            "net6": "02:09:00:0b:54:9c",
            "net7": "ca:85:19:db:c2:6a",
            "net8": "fe:cd:f4:0b:3b:9c",
            "net9": "b6:16:e4:44:19:ca"
        },
        "spine_4_1_1": {
            "net0": "12:e5:80:10:2a:ab",
            "net1": "56:55:5b:c7:ba:79",
            "net10": "de:47:c2:6e:84:11",
            "net11": "b2:3e:cc:9d:81:ff",
            "net12": "66:26:20:72:2d:b4",
            "net13": "0e:7c:d3:db:cd:f9",
            "net14": "da:f7:ab:b0:5c:15",
            "net15": "d2:57:5c:2c:e5:d7",
            "net2": "c6:74:3a:3b:69:66",
            "net3": "8a:cd:0a:9b:9f:1f",
            "net4": "7e:0f:67:b9:08:09",
            "net5": "8e:4e:b6:36:f0:77",
            "net6": "0e:98:8c:ef:39:b1",
            "net7": "c6:2c:4f:fe:36:9a",
            "net8": "ee:bd:73:78:c3:ef",
            "net9": "96:36:b9:5e:59:b9"
        },
        "spine_4_1_2": {
            "net0": "f6:2c:ee:d9:2b:58",
            "net1": "de:d0:47:81:d9:ca",
            "net10": "ee:19:ed:4d:85:ad",
            "net11": "22:11:63:b7:d8:84",
            "net12": "ce:3c:74:ad:81:02",
            "net13": "ca:fa:9a:18:0c:bb",
            "net14": "16:66:9c:4f:43:c3",
            "net15": "0e:f1:d2:56:56:4f",
            "net2": "9e:ed:51:1e:78:b4",
            "net3": "16:13:a1:61:d4:38",
            "net4": "ba:f3:a9:42:cb:5d",
            "net5": "ee:85:9c:1f:59:ce",
            "net6": "1a:ad:8f:f4:83:f6",
            "net7": "0e:7d:de:15:c4:9c",
            "net8": "86:00:c3:20:2f:89",
            "net9": "de:c8:b3:59:7b:6f"
        },
        "spine_4_1_3": {
            "net0": "66:ff:75:8f:23:81",
            "net1": "1a:0d:31:f7:99:db",
            "net10": "56:56:17:b2:81:92",
            "net11": "fa:85:aa:f1:32:79",
            "net12": "5a:04:b3:23:6a:21",
            "net13": "8a:a1:ad:43:b5:0a",
            "net14": "c2:ec:68:39:02:00",
            "net15": "5a:1e:54:f9:06:4d",
            "net2": "2e:12:9e:c7:32:66",
            "net3": "82:98:cc:65:c8:a3",
            "net4": "3a:c8:09:5e:90:f0",
            "net5": "06:25:6e:79:a6:6c",
            "net6": "3e:14:e7:15:8d:12",
            "net7": "5a:6b:eb:94:be:b0",
            "net8": "62:0b:31:91:f8:ed",
            "net9": "b6:57:f1:22:f8:05"
        },
        "spine_4_1_4": {
            "net0": "0a:d5:d5:95:99:f5",
            "net1": "8e:2b:54:44:48:29",
            "net10": "12:40:72:4b:79:16",
            "net11": "72:db:05:ee:95:e4",
            "net12": "d2:15:93:ec:ea:bd",
            "net13": "be:50:cd:f0:99:da",
            "net14": "da:c7:11:1f:9c:a4",
            "net15": "b2:cd:2e:25:f7:1f",
            "net2": "0e:0b:b5:96:7b:87",
            "net3": "72:ff:31:f4:7f:5a",
            "net4": "66:b8:a8:66:ee:cd",
            "net5": "ba:ed:bd:bb:86:cb",
            "net6": "9a:01:c6:87:47:7f",
            "net7": "f2:58:79:ce:ef:36",
            "net8": "06:04:2b:c1:ab:9d",
            "net9": "e6:26:b1:e5:1b:15"
        },
        "spine_4_1_5": {
            "net0": "ae:eb:4a:69:a6:c1",
            "net1": "8e:52:74:94:0b:d0",
            "net10": "82:2e:4d:9b:3e:5d",
            "net11": "06:7c:10:5a:6f:1b",
            "net12": "d6:5d:5c:d6:ce:92",
            "net13": "de:7f:84:16:64:34",
            "net14": "e6:70:79:93:bb:70",
            "net15": "de:a0:62:88:e7:c6",
            "net2": "0a:c4:62:60:fd:de",
            "net3": "86:76:16:9a:1d:6f",
            "net4": "12:11:69:85:2f:46",
            "net5": "ee:09:99:75:f3:ae",
            "net6": "0e:e2:7a:25:65:1a",
            "net7": "3e:59:45:dd:79:fb",
            "net8": "3e:8a:63:dc:9d:50",
            "net9": "8a:a5:d2:41:42:de"
        },
        "spine_4_1_6": {
            "net0": "8a:3a:5e:b8:64:9a",
            "net1": "e6:d3:a5:20:34:67",
            "net10": "d6:af:47:0e:15:7c",
            "net11": "52:5d:ca:68:fb:4d",
            "net12": "16:fc:94:d0:76:92",
            "net13": "ba:0b:b3:ce:d8:a3",
            "net14": "ce:86:bd:4d:47:10",
            "net15": "06:71:d5:cf:22:31",
            "net2": "fa:fa:6b:26:a6:00",
            "net3": "56:fa:d6:79:4f:55",
            "net4": "7a:60:f0:f6:40:e3",
            "net5": "ee:95:42:a3:e7:98",
            "net6": "46:9d:8c:bf:36:aa",
            "net7": "aa:ff:8d:1e:dc:15",
            "net8": "32:1c:f2:3e:30:18",
            "net9": "1a:b6:88:fa:a6:a2"
        },
        "spine_4_1_7": {
            "net0": "16:a8:d7:ac:22:0a",
            "net1": "52:eb:18:4e:73:fc",
            "net10": "82:ea:1d:9e:fb:fb",
            "net11": "c2:9d:4c:c4:ff:0b",
            "net12": "72:fb:06:e3:5a:c2",
            "net13": "a6:8b:84:10:b5:6c",
            "net14": "0e:3f:37:a5:f2:b3",
            "net15": "5a:34:32:57:94:77",
            "net2": "26:41:96:6d:e9:4f",
            "net3": "46:20:04:55:0a:ef",
            "net4": "d6:d8:0a:d1:5d:4d",
            "net5": "e2:7c:78:24:36:ab",
            "net6": "06:01:d5:30:08:d3",
            "net7": "fa:49:38:cf:d0:a3",
            "net8": "c2:81:67:18:c6:1d",
            "net9": "4a:d6:dc:4f:fa:45"
        },
        "spine_4_1_8": {
            "net0": "82:40:e6:93:d3:b5",
            "net1": "42:fc:56:9a:ce:c2",
            "net10": "3a:d7:f2:ad:b4:76",
            "net11": "d6:5a:8d:02:5b:35",
            "net12": "36:0f:7e:a5:02:34",
            "net13": "62:57:0c:55:21:5d",
            "net14": "62:77:a6:48:f2:8f",
            "net15": "e2:66:6c:9c:4e:3f",
            "net2": "ee:76:ae:e6:a5:b9",
            "net3": "1e:2b:22:ea:59:cb",
            "net4": "42:c8:ed:41:97:5a",
            "net5": "be:de:66:6d:98:79",
            "net6": "4a:8c:73:e6:1e:6f",
            "net7": "8a:74:16:d8:72:99",
            "net8": "a6:e2:74:0a:37:81",
            "net9": "02:ed:18:0b:ff:3c"
        },
        "tof_1_2_1": {
            "net0": "6e:22:b1:0a:05:d4",
            "net1": "22:27:25:2e:67:29",
            "net10": "8e:b7:01:b6:0b:f5",
            "net11": "d2:1c:54:b9:ab:3a",
            "net12": "ea:a3:09:70:77:ba",
            "net13": "9a:0a:9a:fd:60:b9",
            "net14": "e2:ce:3b:af:50:37",
            "net15": "aa:b0:63:db:59:bf",
            "net2": "ee:e1:d4:03:5e:fb",
            "net3": "12:63:15:01:7e:6a",
            "net4": "ee:91:02:3b:6a:c0",
            "net5": "5e:f3:68:08:97:fd",
            "net6": "52:a6:ca:b5:3a:e9",
            "net7": "2a:55:68:f9:75:0e",
            "net8": "e6:15:b6:b0:bc:aa",
            "net9": "fe:95:bc:b4:45:8f"
        },
        "tof_1_2_2": {
            "net0": "76:0e:78:ac:00:d0",
            "net1": "9a:a1:26:2b:f3:26",
            "net10": "7a:52:64:ff:54:3a",
            "net11": "4a:ca:27:fc:6a:b1",
            "net12": "d6:c9:00:0c:cf:56",
            "net13": "de:99:2e:ef:96:45",
            "net14": "26:12:2e:25:1e:6c",
            "net15": "7a:55:35:11:54:8c",
            "net2": "22:ca:68:07:28:e6",
            "net3": "e2:cb:d5:79:44:c3",
            "net4": "9e:5f:cb:ed:71:54",
            "net5": "82:b4:ac:cb:67:1b",
            "net6": "96:ab:4f:78:dd:a8",
            "net7": "66:19:ea:03:3e:bc",
            "net8": "12:42:66:84:5a:6a",
            "net9": "22:5e:85:c1:d3:d9"
        },
        "tof_1_2_3": {
            "net0": "46:6d:e3:c4:28:d2",
            "net1": "e2:bb:42:1c:14:84",
            "net10": "ce:f2:66:a7:09:84",
            "net11": "02:82:c1:31:bf:d3",
            "net12": "12:26:e3:d7:63:96",
            "net13": "b6:17:cc:75:cb:95",
            "net14": "3e:1e:04:54:55:16",
            "net15": "d2:89:0c:c7:4d:0e",
            "net2": "32:a5:ef:90:40:92",
            "net3": "e6:40:5a:5c:bf:2b",
            "net4": "d6:3e:3e:1d:4b:7a",
            "net5": "66:c2:d5:5f:eb:39",
            "net6": "3e:4b:74:e0:df:ee",
            "net7": "8a:f7:e1:71:ed:0a",
            "net8": "ca:dc:9a:73:f3:91",
            "net9": "46:f4:45:3d:5a:ce"
        },
        "tof_1_2_4": {
            "net0": "2e:2c:6b:d1:79:34",
            "net1": "c6:71:c6:51:5e:ba",
            "net10": "62:a9:03:b7:03:26",
            "net11": "1e:af:f8:db:de:3c",
            "net12": "fe:87:b0:6d:6f:a9",
            "net13": "e6:a2:4a:99:31:8a",
            "net14": "fa:34:40:b8:7f:82",
            "net15": "72:e1:6d:09:12:b0",
            "net2": "ea:55:d8:77:f4:b8",
            "net3": "5a:e8:bd:76:71:1c",
            "net4": "36:76:b7:2d:d5:40",
            "net5": "9a:d5:08:ce:3f:ee",
            "net6": "46:f2:42:29:0f:5d",
            "net7": "32:b1:01:b0:77:02",
            "net8": "d6:eb:3a:ce:64:69",
            "net9": "6a:a9:dc:7e:22:8d"
        },
        "tof_1_2_5": {
            "net0": "d2:b8:56:e8:8e:ff",
            "net1": "b6:63:70:66:7f:1f",
            "net10": "aa:a7:9c:91:5a:61",
            "net11": "3a:8d:0b:48:ac:bc",
            "net12": "92:ac:14:1b:20:40",
            "net13": "ca:53:5d:fa:55:43",
            "net14": "82:ab:b8:7a:24:bc",
            "net15": "76:0c:99:7d:0f:7d",
            "net2": "b2:20:93:a7:5e:69",
            "net3": "32:7e:06:00:06:38",
            "net4": "12:b3:30:b3:f4:b0",
            "net5": "0a:a4:ae:95:0d:89",
            "net6": "12:08:ec:07:08:7f",
            "net7": "7a:ad:98:b5:62:77",
            "net8": "be:c3:5c:7c:19:a5",
            "net9": "66:72:66:75:21:b7"
        },
        "tof_1_2_6": {
            "net0": "f6:84:ad:e4:ad:ae",
            "net1": "42:6c:4a:6e:3d:a2",
            "net10": "ea:fc:dd:f1:23:5d",
            "net11": "02:af:f3:f7:24:91",
            "net12": "16:d9:c5:cf:7b:d6",
            "net13": "6e:f2:a3:f7:63:b7",
            "net14": "aa:45:fc:b4:57:51",
            "net15": "fa:8a:3e:5d:e6:0e",
            "net2": "a2:6f:28:bf:74:2e",
            "net3": "be:bd:14:27:8d:75",
            "net4": "f6:a7:31:1e:ba:bd",
            "net5": "b6:60:b2:97:94:48",
            "net6": "c2:13:80:c3:0a:0c",
            "net7": "de:01:02:6e:f3:04",
            "net8": "56:c0:14:37:4a:cb",
            "net9": "46:4e:dc:3f:bf:94"
        },
        "tof_1_2_7": {
            "net0": "3e:4d:e9:68:79:78",
            "net1": "9e:84:5b:87:d5:49",
            "net10": "7e:3b:27:06:73:2a",
            "net11": "16:7f:64:48:75:07",
            "net12": "0e:52:ba:e1:e9:4c",
            "net13": "72:07:7d:eb:19:3f",
            "net14": "82:1d:f0:8b:a5:57",
            "net15": "f6:98:dd:68:8a:ed",
            "net2": "8e:4b:1b:72:01:c8",
            "net3": "62:5c:fd:9e:8a:bf",
            "net4": "5e:30:07:3f:ec:29",
            "net5": "46:59:76:d4:35:33",
            "net6": "be:1b:3c:51:24:52",
            "net7": "92:39:d4:1e:12:cb",
            "net8": "be:2d:c2:4d:b6:59",
            "net9": "9a:e7:7e:20:25:cb"
        },
        "tof_1_2_8": {
            "net0": "02:e2:7d:4e:83:55",
            "net1": "0e:50:19:a3:ca:55",
            "net10": "c6:aa:15:5b:e8:07",
            "net11": "6a:32:d8:7b:cb:14",
            "net12": "5e:dd:77:60:10:60",
            "net13": "d2:1c:ba:5e:7b:22",
            "net14": "9a:b6:cb:a9:4f:52",
            "net15": "96:1c:1c:74:6b:d4",
            "net2": "7e:bf:11:13:d9:ee",
            "net3": "2e:1f:22:ce:15:68",
            "net4": "5e:67:6d:4c:ab:c1",
            "net5": "16:8b:b1:cf:c6:58",
            "net6": "1e:ad:58:30:30:7b",
            "net7": "2a:73:5a:e9:62:10",
            "net8": "0a:92:1a:e2:33:64",
            "net9": "ca:11:36:4b:bb:1a"
        },
        "tof_2_2_1": {
            "net0": "86:5f:9a:17:ba:a0",
            "net1": "5a:b1:2f:f9:e4:f7",
            "net10": "22:61:04:c0:36:49",
            "net11": "42:92:ff:a6:5e:99",
            "net12": "de:de:94:d3:4b:9c",
            "net13": "26:0d:81:50:14:dc",
            "net14": "8e:bf:e4:43:dc:f2",
            "net15": "b6:0d:1d:2a:ca:9c",
            "net2": "06:5a:cc:5a:b9:a2",
            "net3": "ba:bc:d1:11:6d:7f",
            "net4": "f2:83:73:ec:b0:46",
            "net5": "2a:70:6a:b1:75:05",
            "net6": "de:9c:d6:7d:e5:32",
            "net7": "56:b0:6a:d0:ce:f6",
            "net8": "56:72:e2:62:1e:72",
            "net9": "f2:18:4f:be:d6:77"
        },
        "tof_2_2_2": {
            "net0": "fa:23:56:13:56:e8",
            "net1": "7e:0e:b7:e8:7b:ae",
            "net10": "d6:a9:20:77:47:71",
            "net11": "2e:5a:04:df:1d:f3",
            "net12": "9e:52:d7:a4:17:89",
            "net13": "1a:46:03:24:c6:9f",
            "net14": "72:95:12:4f:e2:cd",
            "net15": "a2:6d:8d:22:9f:73",
            "net2": "7e:02:bf:bb:ce:ea",
            "net3": "72:b7:a9:2c:2f:e8",
            "net4": "ba:bf:6a:38:34:11",
            "net5": "1a:25:d2:60:bf:ce",
            "net6": "4a:fe:33:4d:36:1e",
            "net7": "4e:48:7d:d3:c6:ea",
            "net8": "ce:bf:a2:f4:0b:d4",
            "net9": "0e:98:f7:76:b4:57"
        },
        "tof_2_2_3": {
            "net0": "f2:48:6b:1e:7e:bd",
            "net1": "be:01:d9:2a:45:ab",
            "net10": "72:6c:29:eb:c1:72",
            "net11": "22:0b:b5:fc:e1:bb",
            "net12": "4a:d9:26:cc:8b:24",
            "net13": "aa:1a:26:c7:a7:96",
            "net14": "5a:d1:26:85:66:9d",
            "net15": "26:06:ee:a5:64:c5",
            "net2": "7a:70:26:a1:20:3c",
            "net3": "d2:91:c8:f4:7b:e2",
            "net4": "7e:f8:81:1a:31:dd",
            "net5": "ce:ba:4b:04:fa:d4",
            "net6": "9a:54:00:66:b2:9b",
            "net7": "76:13:02:ac:bf:96",
            "net8": "26:e9:8c:01:47:3a",
            "net9": "a2:0c:54:25:ca:1b"
        },
        "tof_2_2_4": {
            "net0": "ea:57:1c:fc:70:2c",
            "net1": "e2:f0:5e:ed:4a:3d",
            "net10": "16:6d:bf:0b:13:ad",
            "net11": "f2:74:87:49:d9:0a",
            "net12": "f2:d5:69:ca:11:a8",
            "net13": "b6:d0:b5:d8:bc:c0",
            "net14": "3e:b1:8c:91:cf:8a",
            "net15": "36:5b:8b:21:26:d4",
            "net2": "e6:d9:08:c5:e1:05",
            "net3": "be:58:c5:3c:97:bd",
            "net4": "0a:bd:11:ee:69:88",
            "net5": "d6:96:3c:00:cb:a1",
            "net6": "3a:be:c2:92:ce:0c",
            "net7": "2a:c1:13:7f:b3:cf",
            "net8": "b2:bc:49:9e:e1:57",
            "net9": "b6:bc:db:f2:7a:ec"
        },
        "tof_2_2_5": {
            "net0": "e2:65:8a:a0:3e:87",
            "net1": "9e:a7:6c:ed:b6:c8",
            "net10": "b6:16:3d:ab:4b:43",
            "net11": "e6:9e:10:b6:c8:a6",
            "net12": "0e:03:d8:bf:42:c1",
            "net13": "1a:b0:7a:52:38:fc",
            "net14": "72:56:9d:75:13:97",
            "net15": "9e:54:bc:34:dc:a4",
            "net2": "82:bc:43:4f:b1:9b",
            "net3": "1e:7f:7f:c1:2b:82",
            "net4": "6a:6f:6e:e4:ff:78",
            "net5": "56:eb:08:61:39:e0",
            "net6": "d2:0b:5d:63:fe:88",
            "net7": "62:e0:ec:86:c5:62",
            "net8": "2a:0e:b1:53:ad:60",
            "net9": "aa:a8:d7:96:09:e0"
        },
        "tof_2_2_6": {
            "net0": "5e:21:da:bf:ce:c2",
            "net1": "46:e9:a9:85:fc:01",
            "net10": "12:9e:55:74:d4:88",
            "net11": "ce:68:37:d0:7c:a2",
            "net12": "ba:67:c8:5e:6a:b4",
            "net13": "f6:48:a3:11:7f:3b",
            "net14": "de:4e:b7:11:d3:d3",
            "net15": "fa:41:7d:78:ef:29",
            "net2": "ca:84:f4:a2:55:8e",
            "net3": "12:af:c5:2e:7a:19",
            "net4": "36:8c:6e:1c:74:1e",
            "net5": "72:27:e0:e6:dd:33",
            "net6": "ba:30:8e:0f:e6:36",
            "net7": "56:69:3e:05:b9:db",
            "net8": "66:76:9e:26:d7:b1",
            "net9": "86:79:7f:db:6c:f3"
        },
        "tof_2_2_7": {
            "net0": "9a:10:db:f1:af:72",
            "net1": "e2:5e:94:bf:dd:dd",
            "net10": "1a:ff:8f:45:51:54",
            "net11": "ca:8e:72:8a:cd:0e",
            "net12": "6a:c4:a2:8e:73:7f",
            "net13": "2a:a9:d0:69:dd:40",
            "net14": "ba:06:01:2e:9e:60",
            "net15": "66:d7:7c:82:eb:c8",
            "net2": "56:4c:da:da:f0:0a",
            "net3": "be:82:ef:fd:2a:bc",
            "net4": "36:41:92:ad:37:fc",
            "net5": "76:29:91:82:78:d1",
            "net6": "8a:c6:61:88:a2:96",
            "net7": "9a:11:d0:d9:e5:a4",
            "net8": "be:b6:25:4a:fe:c8",
            "net9": "a2:ce:0f:43:58:12"
        },
        "tof_2_2_8": {
            "net0": "3a:ac:e8:56:e4:88",
            "net1": "ee:22:23:26:6d:59",
            "net10": "e6:13:93:69:d2:6c",
            "net11": "b6:56:15:85:cf:37",
            "net12": "76:19:28:b3:f5:06",
            "net13": "42:97:52:1d:ec:c5",
            "net14": "e6:97:17:ee:11:6b",
            "net15": "9a:62:b4:a6:69:3f",
            "net2": "56:72:dc:ab:50:d1",
            "net3": "72:50:e4:3a:9c:91",
            "net4": "be:75:f5:1b:35:1a",
            "net5": "1e:28:2c:1a:62:40",
            "net6": "2e:69:1b:32:d7:44",
            "net7": "d2:40:25:b8:99:27",
            "net8": "e2:29:62:2a:8e:26",
            "net9": "a6:dc:3a:9a:70:07"
        }
    },
    "failed_machine": "leaf_1_0_1",
    "failure_time": 1616236723.3116117
}