{
    "description": "Scenario 6a: net0 link failure and recovery of leaf_1_0_1 with BGP",
    "k_leaf": 6,
    "k_top": 6,
    "redundancy_factor": 1,
    "is_k8s": true,
    "machine_mac_addresses": {
        "leaf_10_0_1": {
            "net0": "d6:ed:56:f3:3a:50",
            "net1": "b2:38:dd:70:81:47",
            "net2": "6e:07:de:89:57:aa",
            "net3": "c6:76:1d:e4:4f:bd",
            "net4": "9a:0f:49:b1:9d:62",
            "net5": "3e:a8:81:ed:a6:d0",
            "net6": "5e:62:15:14:1b:d3"
        },
        "leaf_10_0_2": {
            "net0": "06:10:cc:99:de:92",
            "net1": "fe:28:2e:40:2a:15",
            "net2": "56:2c:1a:df:0c:d5",
            "net3": "2e:48:55:e9:0a:35",
            "net4": "62:40:ab:26:b7:20",
            "net5": "26:40:f8:17:2c:c5",
            "net6": "e2:49:8e:09:26:2b"
        },
        "leaf_10_0_3": {
            "net0": "56:04:0f:6b:42:5f",
            "net1": "3e:3c:c5:5d:83:66",
            "net2": "b2:bc:d7:5b:e6:da",
            "net3": "52:48:c9:93:f4:6e",
            "net4": "ee:87:98:c9:08:72",
            "net5": "6e:62:15:d7:0b:80",
            "net6": "1a:f7:24:0f:40:ea"
        },
        "leaf_10_0_4": {
            "net0": "ba:fa:62:23:d8:e5",
            "net1": "6a:f3:c3:1e:61:b9",
            "net2": "be:33:85:ef:f5:23",
            "net3": "72:26:30:83:f7:15",
            "net4": "06:a8:6d:0f:9c:16",
            "net5": "a6:a4:22:e3:cb:37",
            "net6": "1e:2b:79:d9:ad:47"
        },
        "leaf_10_0_5": {
            "net0": "46:02:fe:80:69:15",
            "net1": "0a:03:7f:86:e5:92",
            "net2": "62:59:27:77:7f:d2",
            "net3": "52:ba:92:b8:2e:24",
            "net4": "7e:5b:62:c7:92:cc",
            "net5": "f2:99:2e:62:65:64",
            "net6": "22:38:ab:37:db:2a"
        },
        "leaf_10_0_6": {
            "net0": "32:8e:28:0a:38:68",
            "net1": "ae:71:30:e9:ce:d5",
            "net2": "ca:f0:33:f9:e1:d2",
            "net3": "5a:9b:f8:cf:de:c3",
            "net4": "ae:67:eb:81:1e:43",
            "net5": "ce:7a:a8:b8:c8:0d",
            "net6": "ee:25:a5:18:85:f8"
        },
        "leaf_11_0_1": {
            "net0": "1e:88:e3:ce:64:06",
            "net1": "42:9c:67:2c:aa:cf",
            "net2": "0a:e6:cf:f7:b6:16",
            "net3": "0a:1f:5f:1e:b6:af",
            "net4": "7a:5d:5e:dd:3d:13",
            "net5": "92:8b:dc:ba:38:c8",
            "net6": "ba:e4:b4:e4:b7:77"
        },
        "leaf_11_0_2": {
            "net0": "de:50:e1:66:c9:7c",
            "net1": "22:6b:87:94:cc:fb",
            "net2": "f6:76:59:a0:d6:0f",
            "net3": "ae:f1:e2:e5:fb:b9",
            "net4": "f2:3d:7b:f4:21:b9",
            "net5": "d6:d1:10:d6:49:d5",
            "net6": "1a:4f:7d:85:71:ad"
        },
        "leaf_11_0_3": {
            "net0": "9e:0c:04:9b:87:31",
            "net1": "a6:36:6d:d6:b2:89",
            "net2": "76:47:b8:71:9a:f1",
            "net3": "fe:91:ae:5d:35:01",
            "net4": "6a:b8:58:bb:aa:95",
            "net5": "32:86:fb:b4:10:dd",
            "net6": "0a:76:7b:81:7d:0f"
        },
        "leaf_11_0_4": {
            "net0": "6e:1a:a2:b5:45:62",
            "net1": "d2:ea:3c:e5:83:5a",
            "net2": "f2:ef:7d:fe:05:e5",
            "net3": "4e:8d:98:40:4e:51",
            "net4": "1a:d6:60:d4:ae:5e",
            "net5": "aa:3a:b9:b4:73:c6",
            "net6": "66:0b:0b:a9:38:a8"
        },
        "leaf_11_0_5": {
            "net0": "72:31:93:a4:eb:b0",
            "net1": "92:5c:c1:69:49:57",
            "net2": "9e:72:75:00:ff:f3",
            "net3": "6e:c5:15:96:0b:15",
            "net4": "02:ad:9e:bb:6b:4c",
            "net5": "3a:69:8f:4b:a9:2f",
            "net6": "e6:27:b0:e3:42:30"
        },
        "leaf_11_0_6": {
            "net0": "5a:af:56:b6:7a:f6",
            "net1": "a6:99:c4:b4:20:70",
            "net2": "b6:bd:d3:c8:7b:60",
            "net3": "f6:8a:82:0a:9d:1c",
            "net4": "82:38:eb:73:3f:dd",
            "net5": "12:d0:3c:a0:5c:0d",
            "net6": "62:8a:13:fc:60:b6"
        },
        "leaf_12_0_1": {
            "net0": "ee:78:dd:11:fc:4b",
            "net1": "06:ad:d8:9a:7d:49",
            "net2": "7e:18:c7:ed:a3:bb",
            "net3": "d6:cb:13:38:25:70",
            "net4": "16:dc:de:0b:6f:41",
            "net5": "86:94:9a:09:3e:ae",
            "net6": "b2:b4:40:ac:9d:6d"
        },
        "leaf_12_0_2": {
            "net0": "d6:13:96:51:2b:ea",
            "net1": "f2:33:10:b8:f2:61",
            "net2": "82:b1:a4:75:07:f4",
            "net3": "fe:8b:17:f8:74:88",
            "net4": "42:35:6b:55:ec:1f",
            "net5": "16:3b:2b:96:58:3f",
            "net6": "5e:8b:f7:2f:5a:5a"
        },
        "leaf_12_0_3": {
            "net0": "06:6d:d9:13:9e:9b",
            "net1": "7a:5a:94:21:b9:a7",
            "net2": "2a:be:0a:f8:68:f7",
            "net3": "76:2b:ae:ec:cf:fc",
            "net4": "ca:fe:23:df:b9:d5",
            "net5": "26:90:07:8b:e2:cb",
            "net6": "de:38:ab:a7:32:fc"
        },
        "leaf_12_0_4": {
            "net0": "52:45:d9:9a:15:f0",
            "net1": "b6:28:07:2e:10:7d",
            "net2": "7e:2e:28:b2:4f:cd",
            "net3": "6a:a7:f4:ee:1c:a7",
            "net4": "16:2e:0e:05:50:dd",
            "net5": "1e:ab:8d:fc:0f:4a",
            "net6": "36:09:78:60:4c:dd"
        },
        "leaf_12_0_5": {
            "net0": "ba:fd:81:e9:a9:fd",
            "net1": "aa:7f:90:b6:1f:ea",
            "net2": "6e:d7:94:d8:9b:c6",
            "net3": "02:bc:72:79:dd:26",
            "net4": "a6:ea:f8:77:44:21",
            "net5": "6a:c3:f1:7f:f6:40",
            "net6": "ba:9e:8b:28:63:12"
        },
        "leaf_12_0_6": {
            "net0": "16:4b:a6:6e:57:8b",
            "net1": "4e:28:0b:03:85:00",
            "net2": "ee:23:ba:63:69:6e",
            "net3": "7a:8d:2d:9d:be:47",
            "net4": "9a:4f:d2:b4:57:38",
            "net5": "aa:62:76:74:7d:03",
            "net6": "7e:0d:8a:b5:de:5a"
        },
        "leaf_1_0_1": {
            "net0": "96:e9:17:f2:91:10",
            "net1": "8a:b4:54:6e:cb:eb",
            "net2": "e6:ae:4a:c5:23:8c",
            "net3": "7e:d7:d9:85:1e:f1",
            "net4": "a2:94:46:07:08:fd",
            "net5": "4e:e0:72:7a:2b:f5",
            "net6": "0a:b4:d1:36:7f:7a"
        },
        "leaf_1_0_2": {
            "net0": "c6:c9:24:72:c3:42",
            "net1": "3e:11:6a:79:7e:a4",
            "net2": "ca:cc:9b:48:55:d4",
            "net3": "82:4f:9a:45:1c:cf",
            "net4": "76:f7:5d:fa:77:76",
            "net5": "6e:51:93:0f:62:32",
            "net6": "ea:49:97:c0:60:97"
        },
        "leaf_1_0_3": {
            "net0": "62:95:f0:70:93:a4",
            "net1": "0e:15:34:40:3e:53",
            "net2": "32:a1:fc:ea:ae:60",
            "net3": "6e:d2:ed:a3:66:7f",
            "net4": "8e:61:94:5c:70:e0",
            "net5": "9e:26:63:ee:7c:26",
            "net6": "7e:cd:34:07:4d:ca"
        },
        "leaf_1_0_4": {
            "net0": "22:a5:75:18:56:b5",
            "net1": "0e:06:e9:cc:74:53",
            "net2": "3a:5b:54:a4:2b:51",
            "net3": "06:93:ad:e5:7d:11",
            "net4": "32:60:bc:9d:c0:b1",
            "net5": "aa:8c:df:f7:51:46",
            "net6": "02:0a:14:c2:12:ab"
        },
        "leaf_1_0_5": {
            "net0": "8a:c4:58:21:b2:e9",
            "net1": "ae:00:de:ed:78:55",
            "net2": "fe:ff:be:9f:1b:25",
            "net3": "96:06:c4:a7:6e:10",
            "net4": "be:51:16:ff:a6:b6",
            "net5": "82:39:d4:6c:fa:74",
            "net6": "4a:1b:be:dc:3d:a3"
        },
        "leaf_1_0_6": {
            "net0": "9a:f2:2e:98:b3:81",
            "net1": "3e:b0:fa:21:8f:ae",
            "net2": "5a:ca:d9:79:22:8e",
            "net3": "1a:5a:e9:cf:32:e1",
            "net4": "9a:84:3e:50:c7:fe",
            "net5": "76:e8:15:34:ba:8c",
            "net6": "f2:8c:f0:f5:3a:56"
        },
        "leaf_2_0_1": {
            "net0": "92:b4:1c:83:40:71",
            "net1": "66:b8:d6:37:8e:19",
            "net2": "72:5b:5b:e0:61:bc",
            "net3": "de:db:ec:f0:2c:7f",
            "net4": "32:3a:3a:c7:c4:92",
            "net5": "9e:7f:06:32:ec:dd",
            "net6": "56:2a:3b:07:b2:fd"
        },
        "leaf_2_0_2": {
            "net0": "32:d1:75:83:81:ec",
            "net1": "9e:79:7c:2c:12:96",
            "net2": "f2:e2:0d:16:50:0f",
            "net3": "72:00:70:6b:13:ab",
            "net4": "66:0d:ab:98:a8:88",
            "net5": "82:f0:98:c8:3a:0b",
            "net6": "aa:6b:b1:dc:76:26"
        },
        "leaf_2_0_3": {
            "net0": "6e:54:d6:61:42:42",
            "net1": "76:76:c7:f6:16:b6",
            "net2": "12:66:b3:fa:55:37",
            "net3": "46:56:e6:33:c2:9b",
            "net4": "b2:e2:76:0f:75:87",
            "net5": "e6:d2:2f:fc:49:40",
            "net6": "f2:2a:ba:11:6d:bf"
        },
        "leaf_2_0_4": {
            "net0": "fa:d5:7a:87:9f:cd",
            "net1": "7e:0f:f4:b2:c4:25",
            "net2": "96:54:34:1c:e3:5d",
            "net3": "ce:ba:63:04:43:3e",
            "net4": "0a:37:b0:11:03:fb",
            "net5": "52:0d:0b:20:22:e0",
            "net6": "22:6f:6e:d1:d0:25"
        },
        "leaf_2_0_5": {
            "net0": "9e:79:c6:f2:20:d2",
            "net1": "6e:85:e0:90:b4:2a",
            "net2": "de:d3:53:a3:a0:05",
            "net3": "4a:47:80:a5:a9:1e",
            "net4": "8a:3e:35:2d:c0:b3",
            "net5": "96:af:35:ea:f1:32",
            "net6": "66:51:20:2c:c8:7f"
        },
        "leaf_2_0_6": {
            "net0": "ea:e7:04:3b:61:30",
            "net1": "4a:95:e2:29:4b:15",
            "net2": "fa:5d:7c:b7:68:bc",
            "net3": "e6:29:c0:df:8b:79",
            "net4": "ae:f1:88:4a:e3:d2",
            "net5": "d6:31:d8:eb:d3:fd",
            "net6": "62:1c:be:84:a8:56"
        },
        "leaf_3_0_1": {
            "net0": "2a:95:99:b2:59:64",
            "net1": "86:20:8d:24:a6:3c",
            "net2": "c2:2f:18:0a:bb:4f",
            "net3": "36:45:88:c8:61:84",
            "net4": "62:ff:9b:0e:83:9d",
            "net5": "6a:a8:ac:fb:e2:1d",
            "net6": "5e:4c:3c:da:a2:4f"
        },
        "leaf_3_0_2": {
            "net0": "86:89:81:53:c7:13",
            "net1": "ee:32:41:c4:b2:da",
            "net2": "9a:95:f4:e6:40:e6",
            "net3": "de:22:40:fb:35:cd",
            "net4": "6a:f6:8a:a9:cd:38",
            "net5": "66:e4:2a:86:61:be",
            "net6": "6e:61:0e:6d:8a:63"
        },
        "leaf_3_0_3": {
            "net0": "6a:8e:96:ba:9c:33",
            "net1": "32:3d:ff:0d:64:f0",
            "net2": "fa:3b:53:77:c8:a6",
            "net3": "9a:d4:62:e8:bc:32",
            "net4": "a2:cb:c2:7a:0e:0a",
            "net5": "a6:5a:f6:cd:51:79",
            "net6": "06:62:f1:13:17:03"
        },
        "leaf_3_0_4": {
            "net0": "be:51:9c:02:30:f0",
            "net1": "fa:6d:ac:d1:f4:7e",
            "net2": "c6:90:1f:74:c8:0a",
            "net3": "d6:30:54:4d:1e:19",
            "net4": "4a:ca:e9:6d:67:64",
            "net5": "86:e0:57:1a:f9:34",
            "net6": "4e:76:bd:36:02:20"
        },
        "leaf_3_0_5": {
            "net0": "8e:5d:12:33:1a:40",
            "net1": "96:27:9b:61:aa:2f",
            "net2": "6a:76:c1:ea:86:89",
            "net3": "1a:f7:f1:b1:a6:6a",
            "net4": "5a:89:63:50:35:d1",
            "net5": "fa:7b:bd:a0:25:8f",
            "net6": "56:08:12:5d:41:8b"
        },
        "leaf_3_0_6": {
            "net0": "6e:26:e2:8a:77:5e",
            "net1": "36:72:df:11:45:93",
            "net2": "7e:09:db:70:74:76",
            "net3": "22:a4:7a:09:07:72",
            "net4": "82:fb:0b:24:16:35",
            "net5": "da:6d:c7:89:9d:8a",
            "net6": "de:52:9d:4f:56:cc"
        },
        "leaf_4_0_1": {
            "net0": "fa:5c:da:e5:1b:c3",
            "net1": "1e:ef:5a:e3:1d:9e",
            "net2": "ea:3c:13:4a:18:bc",
            "net3": "d6:27:28:7c:9a:ba",
            "net4": "86:24:ed:9c:1c:ea",
            "net5": "7e:d1:f1:13:d9:07",
            "net6": "96:7e:5a:38:a0:89"
        },
        "leaf_4_0_2": {
            "net0": "92:46:4c:55:87:68",
            "net1": "2a:6c:2c:8a:ef:d4",
            "net2": "52:21:ed:08:f8:b3",
            "net3": "4e:d0:84:a2:65:3c",
            "net4": "92:5f:32:f6:32:0c",
            "net5": "4a:00:ee:e9:8f:ec",
            "net6": "f2:4c:ad:04:50:cc"
        },
        "leaf_4_0_3": {
            "net0": "72:84:19:52:13:78",
            "net1": "86:c0:40:b6:ad:16",
            "net2": "4e:7b:a2:0c:47:57",
            "net3": "b6:fc:1e:e1:ad:d7",
            "net4": "fa:03:52:53:7a:e2",
            "net5": "7a:53:75:84:be:14",
            "net6": "0a:68:03:e8:85:e0"
        },
        "leaf_4_0_4": {
            "net0": "a2:f7:19:ce:73:3d",
            "net1": "7a:3e:df:b3:90:1c",
            "net2": "a6:35:22:97:c4:7c",
            "net3": "da:ff:34:7f:b0:b9",
            "net4": "72:f0:23:10:fd:06",
            "net5": "7e:41:0c:f6:11:86",
            "net6": "22:65:82:b5:f7:0f"
        },
        "leaf_4_0_5": {
            "net0": "32:cd:11:0d:aa:ac",
            "net1": "ae:16:32:49:fe:7f",
            "net2": "f6:f4:03:89:0b:c1",
            "net3": "46:f2:de:b1:b7:60",
            "net4": "1e:d5:99:8f:50:00",
            "net5": "86:a6:00:2d:a0:67",
            "net6": "aa:c0:36:ea:26:9b"
        },
        "leaf_4_0_6": {
            "net0": "26:d8:c3:ab:a4:58",
            "net1": "4a:02:05:10:26:c8",
            "net2": "7a:f5:47:b3:88:b2",
            "net3": "0e:d3:7a:4d:05:76",
            "net4": "8a:4f:04:e8:51:88",
            "net5": "46:a4:78:29:34:ec",
            "net6": "76:f5:5f:8b:fb:88"
        },
        "leaf_5_0_1": {
            "net0": "8a:48:33:17:22:7c",
            "net1": "16:c0:07:22:58:8c",
            "net2": "a2:51:d8:dc:11:2e",
            "net3": "9e:ca:54:f7:da:75",
            "net4": "7e:ab:cf:02:bf:4f",
            "net5": "22:78:fc:b2:7d:c0",
            "net6": "5a:72:f5:50:c7:82"
        },
        "leaf_5_0_2": {
            "net0": "6a:c4:c4:48:7a:f8",
            "net1": "e2:20:e5:60:cb:fc",
            "net2": "da:2b:f3:27:2e:f3",
            "net3": "be:77:6a:1b:ef:5a",
            "net4": "ea:25:d7:6d:41:a2",
            "net5": "86:91:60:9d:68:56",
            "net6": "1a:af:01:9e:e1:10"
        },
        "leaf_5_0_3": {
            "net0": "2a:43:12:da:73:56",
            "net1": "d6:84:52:89:24:ad",
            "net2": "3e:ba:be:bd:e6:c2",
            "net3": "6e:e5:31:17:2f:09",
            "net4": "c6:13:e7:c1:76:27",
            "net5": "d6:e3:b9:8b:0d:74",
            "net6": "86:99:e4:d3:5f:d2"
        },
        "leaf_5_0_4": {
            "net0": "16:b2:38:58:da:0f",
            "net1": "1a:af:2a:3a:3f:c4",
            "net2": "ee:fe:1a:a0:a5:60",
            "net3": "66:c9:27:65:56:c5",
            "net4": "62:c4:f6:c6:64:68",
            "net5": "ee:bb:53:8d:09:12",
            "net6": "5e:90:21:5a:73:6c"
        },
        "leaf_5_0_5": {
            "net0": "b2:26:a4:a9:c9:d3",
            "net1": "6e:83:1d:ca:cd:04",
            "net2": "66:a2:87:5e:0c:6c",
            "net3": "9e:91:02:92:8d:bc",
            "net4": "1a:1c:7b:5d:d1:3a",
            "net5": "76:42:69:5e:28:66",
            "net6": "16:d1:e1:1a:23:f1"
        },
        "leaf_5_0_6": {
            "net0": "4e:bd:cf:3d:5c:eb",
            "net1": "9a:ba:dc:59:1a:a9",
            "net2": "fe:8f:71:1c:ae:98",
            "net3": "ae:43:fa:85:8c:ad",
            "net4": "96:4d:5c:62:7c:7b",
            "net5": "e2:fd:a8:85:c0:23",
            "net6": "46:e4:f4:ff:ba:af"
        },
        "leaf_6_0_1": {
            "net0": "76:f8:af:0e:64:0d",
            "net1": "8e:8a:4f:23:7f:70",
            "net2": "6a:ae:64:e4:02:f2",
            "net3": "0a:4c:57:5b:43:60",
            "net4": "ea:e1:6b:de:38:2c",
            "net5": "1e:9d:2d:4a:be:f1",
            "net6": "a2:5e:a3:b6:ea:38"
        },
        "leaf_6_0_2": {
            "net0": "b6:ac:9e:83:02:cf",
            "net1": "da:f0:f1:79:49:d1",
            "net2": "5e:05:cc:1f:50:9e",
            "net3": "ce:f1:93:1d:73:b1",
            "net4": "12:01:57:d7:d8:a7",
            "net5": "86:f8:96:a0:69:82",
            "net6": "4a:a2:64:8a:15:81"
        },
        "leaf_6_0_3": {
            "net0": "12:2f:e1:d5:7f:de",
            "net1": "fa:b2:95:d7:df:df",
            "net2": "d6:94:11:e8:b4:cb",
            "net3": "a2:a6:d2:3d:f1:9f",
            "net4": "b2:79:a0:77:61:a0",
            "net5": "ce:e8:75:4c:a6:0d",
            "net6": "c6:9f:31:73:09:f5"
        },
        "leaf_6_0_4": {
            "net0": "3a:5b:d4:32:9d:d8",
            "net1": "b6:87:29:d9:02:28",
            "net2": "2a:e3:75:2c:05:b4",
            "net3": "5a:32:4e:98:8a:77",
            "net4": "8a:86:f4:c8:68:14",
            "net5": "22:8d:ec:72:9b:ba",
            "net6": "ba:7a:36:7a:03:02"
        },
        "leaf_6_0_5": {
            "net0": "5a:08:ad:b6:48:af",
            "net1": "72:36:ce:e1:2e:65",
            "net2": "be:0a:5f:7a:7d:26",
            "net3": "96:62:24:18:43:1e",
            "net4": "d2:03:a0:22:e9:92",
            "net5": "7e:b9:4c:80:2a:31",
            "net6": "26:e6:3a:61:58:03"
        },
        "leaf_6_0_6": {
            "net0": "5e:bc:6c:e3:20:3e",
            "net1": "4e:45:7f:19:2e:d2",
            "net2": "2a:18:20:3d:64:d4",
            "net3": "4a:ad:da:09:fc:df",
            "net4": "6e:7b:89:3d:c9:94",
            "net5": "c6:a2:22:46:89:b5",
            "net6": "6e:12:54:fb:32:de"
        },
        "leaf_7_0_1": {
            "net0": "72:c8:97:0e:2f:05",
            "net1": "f6:94:f6:ae:6b:21",
            "net2": "c6:e9:b6:8b:61:0a",
            "net3": "86:ee:e5:3c:3e:7b",
            "net4": "96:36:d3:48:07:4c",
            "net5": "9a:63:04:48:59:0d",
            "net6": "aa:62:3f:51:d5:2a"
        },
        "leaf_7_0_2": {
            "net0": "c2:2d:97:28:7a:4d",
            "net1": "5e:cc:9c:46:2a:99",
            "net2": "a6:d3:74:d8:47:0c",
            "net3": "22:f2:cb:71:c7:60",
            "net4": "d2:2a:ae:b1:64:23",
            "net5": "72:6b:09:db:d6:3a",
            "net6": "92:d1:15:40:6e:ef"
        },
        "leaf_7_0_3": {
            "net0": "8a:0c:50:d7:a8:bf",
            "net1": "3e:06:71:e7:c6:fe",
            "net2": "d6:d5:0f:71:41:b1",
            "net3": "9e:47:f7:29:9b:9d",
            "net4": "0a:8f:c9:ff:3d:6f",
            "net5": "6a:d1:08:e1:59:7a",
            "net6": "d6:73:a4:c2:b7:10"
        },
        "leaf_7_0_4": {
            "net0": "4e:d5:c9:03:27:10",
            "net1": "c6:95:a9:79:40:db",
            "net2": "e2:dd:c0:e9:85:31",
            "net3": "22:c4:c7:c7:ae:8c",
            "net4": "26:0a:54:4c:ad:df",
            "net5": "82:52:12:f9:b5:fb",
            "net6": "ee:47:16:61:ce:e5"
        },
        "leaf_7_0_5": {
            "net0": "7e:81:57:8e:4d:e1",
            "net1": "c2:75:cf:97:ae:8c",
            "net2": "b6:b6:d7:6e:35:6a",
            "net3": "7a:a5:d3:37:6e:8a",
            "net4": "fe:6d:6a:de:6a:85",
            "net5": "ba:0b:73:21:88:5b",
            "net6": "c2:ba:a4:a8:8a:96"
        },
        "leaf_7_0_6": {
            "net0": "4e:c2:b6:c4:84:82",
            "net1": "6e:06:9c:6e:60:a8",
            "net2": "62:83:5e:cc:fc:8e",
            "net3": "5a:2c:b0:23:1d:e2",
            "net4": "a6:7d:15:4f:9e:d6",
            "net5": "4e:4a:dc:4b:d0:74",
            "net6": "d2:2d:08:ee:30:e9"
        },
        "leaf_8_0_1": {
            "net0": "fe:db:85:e0:4d:fe",
            "net1": "ce:c1:c4:3a:e7:5f",
            "net2": "e2:d7:84:72:67:68",
            "net3": "86:8d:5f:d1:a6:10",
            "net4": "2a:49:8d:51:b9:a4",
            "net5": "aa:ad:cb:0b:d2:5c",
            "net6": "4a:d8:bb:a3:ee:2a"
        },
        "leaf_8_0_2": {
            "net0": "a2:5b:76:d8:05:70",
            "net1": "de:67:18:7b:2d:31",
            "net2": "72:87:b3:52:16:cb",
            "net3": "92:5b:1a:de:d8:5f",
            "net4": "52:58:ca:fd:fb:3e",
            "net5": "7e:99:c2:3b:12:e0",
            "net6": "fa:8e:26:cc:8d:95"
        },
        "leaf_8_0_3": {
            "net0": "56:ba:4e:70:a5:fe",
            "net1": "9a:2e:34:9b:0d:87",
            "net2": "06:41:d7:5b:1c:cb",
            "net3": "4a:79:9c:d3:c2:36",
            "net4": "52:e5:b7:9c:44:ad",
            "net5": "66:be:3f:16:58:3f",
            "net6": "7e:96:92:7c:1f:a6"
        },
        "leaf_8_0_4": {
            "net0": "b6:c9:9b:23:26:72",
            "net1": "c2:a3:66:c9:24:17",
            "net2": "d2:bc:fa:5d:5d:64",
            "net3": "b6:47:26:02:99:2a",
            "net4": "42:52:0a:72:9a:9a",
            "net5": "de:5e:1f:0c:28:28",
            "net6": "36:dd:21:19:5d:25"
        },
        "leaf_8_0_5": {
            "net0": "96:5c:1c:25:8f:39",
            "net1": "c2:3d:8a:5b:fd:f0",
            "net2": "5a:49:18:d6:d9:1b",
            "net3": "02:00:2a:b8:c3:0f",
            "net4": "fa:bd:ad:86:10:30",
            "net5": "e6:01:66:84:9f:53",
            "net6": "a6:55:6a:2b:aa:f3"
        },
        "leaf_8_0_6": {
            "net0": "fe:5a:7d:ba:65:b0",
            "net1": "02:fb:49:33:25:61",
            "net2": "5a:02:17:62:91:94",
            "net3": "2a:3d:6b:59:ff:6a",
            "net4": "3e:3c:48:d6:e3:51",
            "net5": "2a:de:a4:e4:e4:8a",
            "net6": "da:fa:1b:00:23:46"
        },
        "leaf_9_0_1": {
            "net0": "5e:f6:5c:1a:c6:5a",
            "net1": "82:ab:57:15:2f:32",
            "net2": "4e:c8:15:52:da:a8",
            "net3": "8e:2b:da:35:ba:f8",
            "net4": "ae:ee:65:d1:bc:ff",
            "net5": "0a:8e:b3:56:91:0c",
            "net6": "0a:02:44:88:ca:5b"
        },
        "leaf_9_0_2": {
            "net0": "4e:50:a5:d0:33:76",
            "net1": "3e:8f:2b:1c:8b:94",
            "net2": "46:49:9b:08:ac:72",
            "net3": "a6:9f:f3:2f:dd:88",
            "net4": "ba:5a:10:7c:2a:b6",
            "net5": "3e:47:49:7a:96:29",
            "net6": "76:9d:01:90:8d:b2"
        },
        "leaf_9_0_3": {
            "net0": "ce:25:24:6a:b5:86",
            "net1": "ce:ca:ce:70:db:56",
            "net2": "5a:e5:90:e4:81:2f",
            "net3": "3a:76:a3:b3:7c:f1",
            "net4": "86:13:f2:07:d1:27",
            "net5": "92:59:8f:3c:82:26",
            "net6": "b6:b6:bd:1a:dd:11"
        },
        "leaf_9_0_4": {
            "net0": "1e:7d:c0:66:cd:e9",
            "net1": "c2:f0:14:7e:2e:17",
            "net2": "9a:f5:12:d5:01:b9",
            "net3": "6e:48:74:b9:ae:1b",
            "net4": "1e:66:a1:cc:1d:ac",
            "net5": "32:19:dd:75:aa:9a",
            "net6": "9a:93:17:e0:39:db"
        },
        "leaf_9_0_5": {
            "net0": "9e:aa:c8:ab:51:0f",
            "net1": "2a:04:c6:d2:4c:fd",
            "net2": "a2:f4:fe:5b:d9:b9",
            "net3": "4e:eb:01:43:c5:86",
            "net4": "de:ea:f3:43:b0:cd",
            "net5": "c2:54:31:04:e5:a0",
            "net6": "22:35:aa:cb:1f:fd"
        },
        "leaf_9_0_6": {
            "net0": "de:f1:d6:1e:25:17",
            "net1": "0a:70:f2:cc:b9:4f",
            "net2": "8e:0e:8c:c1:28:f4",
            "net3": "d2:fd:f4:ad:e1:dc",
            "net4": "3e:1a:3b:7e:29:cb",
            "net5": "16:93:77:06:b6:f8",
            "net6": "6a:87:8f:6a:80:6f"
        },
        "spine_10_1_1": {
            "net0": "06:40:3c:9c:25:0e",
            "net1": "7a:24:e2:e8:dc:dd",
            "net10": "12:b9:54:e1:5c:e9",
            "net11": "c6:d6:be:7b:70:23",
            "net2": "f2:23:0d:57:24:43",
            "net3": "d2:75:4e:db:ab:75",
            "net4": "12:62:8c:71:45:5b",
            "net5": "3e:58:57:47:80:82",
            "net6": "76:aa:73:f9:1d:f6",
            "net7": "4a:11:6a:a5:8e:36",
            "net8": "3e:a9:31:99:ed:73",
            "net9": "56:4f:50:95:77:0e"
        },
        "spine_10_1_2": {
            "net0": "8a:3c:25:07:81:5f",
            "net1": "8a:e5:c7:90:0c:12",
            "net10": "fa:fd:e4:b1:2b:9c",
            "net11": "e6:aa:29:12:e6:ef",
            "net2": "be:52:73:36:32:cf",
            "net3": "2e:b5:68:5c:20:75",
            "net4": "52:ff:fc:5d:15:5d",
            "net5": "5a:8b:ed:93:f8:ba",
            "net6": "e2:15:ab:de:31:d0",
            "net7": "72:7d:16:37:c1:be",
            "net8": "62:fd:97:25:48:79",
            "net9": "ea:74:8f:a4:aa:bb"
        },
        "spine_10_1_3": {
            "net0": "b2:28:1b:ef:b0:c7",
            "net1": "7a:52:65:69:2b:31",
            "net10": "46:9a:66:50:56:e3",
            "net11": "86:d8:5e:b7:31:01",
            "net2": "be:44:c2:c1:15:4c",
            "net3": "8a:79:13:91:be:2b",
            "net4": "fa:39:08:24:78:ce",
            "net5": "66:aa:42:f0:53:1f",
            "net6": "8a:b7:2e:7b:7e:9d",
            "net7": "3a:7f:c2:d1:87:af",
            "net8": "5e:35:d5:8b:fa:2b",
            "net9": "9a:71:58:e3:4c:f9"
        },
        "spine_10_1_4": {
            "net0": "5e:bb:b5:93:53:1d",
            "net1": "d2:30:57:f0:d6:f3",
            "net10": "ae:5f:0b:bc:3f:54",
            "net11": "7e:8e:e1:bf:93:22",
            "net2": "7e:62:1e:fd:84:fd",
            "net3": "e6:4a:ae:b1:97:5f",
            "net4": "fa:74:dd:31:0e:a0",
            "net5": "8a:66:79:fc:33:94",
            "net6": "12:95:a3:cd:ea:a8",
            "net7": "0a:06:92:8b:e4:aa",
            "net8": "2e:4c:76:6c:8f:e6",
            "net9": "92:fa:7d:a3:73:b8"
        },
        "spine_10_1_5": {
            "net0": "7e:a0:fc:10:0e:4c",
            "net1": "b6:fc:8b:2d:c6:e9",
            "net10": "aa:70:52:56:ff:26",
            "net11": "42:96:74:7f:50:ff",
            "net2": "da:d8:00:54:21:34",
            "net3": "0a:05:7e:5e:03:e4",
            "net4": "b2:56:00:8f:5a:e9",
            "net5": "da:ef:97:ac:f1:ff",
            "net6": "56:46:8d:7c:06:08",
            "net7": "0e:49:ed:25:97:87",
            "net8": "fa:61:d2:1c:0f:94",
            "net9": "82:31:1d:28:fa:fc"
        },
        "spine_10_1_6": {
            "net0": "86:35:10:b3:54:25",
            "net1": "be:de:eb:66:04:de",
            "net10": "0a:6d:3d:d3:e4:31",
            "net11": "da:aa:ea:da:49:f2",
            "net2": "5a:3e:56:06:f9:fd",
            "net3": "52:9b:71:ec:10:dc",
            "net4": "66:b2:06:f0:78:df",
            "net5": "8a:8b:63:e9:08:2b",
            "net6": "ee:46:52:2a:80:95",
            "net7": "82:28:46:5b:03:db",
            "net8": "3a:af:fc:45:83:1a",
            "net9": "32:9f:c1:a1:08:16"
        },
        "spine_11_1_1": {
            "net0": "3a:ba:e6:bc:a2:e9",
            "net1": "5a:06:c1:92:ad:38",
            "net10": "22:91:92:f3:6c:e5",
            "net11": "42:07:23:60:86:2c",
            "net2": "e6:f2:b2:a0:bf:b8",
            "net3": "d6:12:0d:8d:98:87",
            "net4": "86:3f:07:78:e0:ec",
            "net5": "72:e6:d9:1c:d6:cc",
            "net6": "32:b4:20:71:09:8f",
            "net7": "c2:a7:70:f5:90:d0",
            "net8": "4a:fe:6d:33:bd:2e",
            "net9": "66:2d:db:53:b9:2d"
        },
        "spine_11_1_2": {
            "net0": "1a:17:8a:29:00:06",
            "net1": "3e:a9:a7:e8:11:f8",
            "net10": "7a:4d:84:f0:04:57",
            "net11": "52:4e:09:da:4f:f4",
            "net2": "62:06:d2:fa:9f:e0",
            "net3": "22:7c:e4:65:fb:3e",
            "net4": "aa:be:f2:de:4c:52",
            "net5": "5a:be:5a:33:3d:15",
            "net6": "22:2a:53:98:b6:a1",
            "net7": "6a:46:6e:95:f7:1e",
            "net8": "3a:07:e9:40:e5:27",
            "net9": "72:ea:a3:26:60:38"
        },
        "spine_11_1_3": {
            "net0": "da:b1:f7:55:68:31",
            "net1": "12:51:ee:b4:02:4b",
            "net10": "26:eb:ae:8d:0d:35",
            "net11": "7a:7b:b0:cf:72:f9",
            "net2": "0a:eb:db:f9:0d:5e",
            "net3": "26:9c:a2:7e:5f:01",
            "net4": "86:ee:35:88:a2:08",
            "net5": "06:a4:af:a0:48:fe",
            "net6": "8a:27:43:9e:d0:ce",
            "net7": "ae:3e:a1:80:d0:db",
            "net8": "aa:76:8d:0c:c5:0b",
            "net9": "5a:61:1b:a3:d3:ea"
        },
        "spine_11_1_4": {
            "net0": "6e:3c:0e:ad:47:90",
            "net1": "7e:98:53:29:ca:c8",
            "net10": "ca:0e:af:09:7c:28",
            "net11": "3e:9e:6b:fd:b6:45",
            "net2": "76:3f:ac:f3:cc:4d",
            "net3": "ba:4a:7f:c1:91:26",
            "net4": "3e:63:b3:dc:39:2c",
            "net5": "96:5f:81:91:e7:5b",
            "net6": "6e:fd:d2:a2:98:ca",
            "net7": "5a:e7:30:1d:db:e4",
            "net8": "ae:fd:ee:00:16:c7",
            "net9": "62:e8:21:06:6d:5d"
        },
        "spine_11_1_5": {
            "net0": "ea:3d:af:f0:87:b9",
            "net1": "c2:1c:75:ca:97:96",
            "net10": "b6:af:6d:6b:79:0d",
            "net11": "72:d7:2c:20:8f:ba",
            "net2": "5a:0f:fb:b6:02:d3",
            "net3": "ba:33:89:18:1d:08",
            "net4": "de:02:5f:08:b4:36",
            "net5": "6a:34:68:d0:25:76",
            "net6": "42:e8:6f:70:b3:f9",
            "net7": "ca:ce:6a:bd:a0:8b",
            "net8": "2e:2c:37:ed:67:70",
            "net9": "06:35:50:30:35:7b"
        },
        "spine_11_1_6": {
            "net0": "16:f8:1e:fb:8d:bf",
            "net1": "ea:10:91:4a:86:c8",
            "net10": "16:49:28:2f:a9:71",
            "net11": "26:fa:b9:00:ff:60",
            "net2": "b2:53:47:7b:56:a7",
            "net3": "9a:90:74:67:dc:0f",
            "net4": "8a:0b:71:1c:3b:ab",
            "net5": "6e:1b:9c:03:4a:4d",
            "net6": "12:ee:c8:ae:da:97",
            "net7": "8e:f0:fd:6a:aa:51",
            "net8": "d6:6e:c0:60:ba:0f",
            "net9": "4e:6c:a0:67:4b:43"
        },
        "spine_12_1_1": {
            "net0": "96:64:cd:3b:6d:15",
            "net1": "3a:54:cd:58:64:4a",
            "net10": "12:a0:32:5e:6f:ec",
            "net11": "7e:3a:fa:08:69:c0",
            "net2": "9a:26:d0:7b:ff:a4",
            "net3": "aa:3c:18:9a:72:ad",
            "net4": "22:98:bc:20:8d:37",
            "net5": "5a:8d:64:09:2d:6c",
            "net6": "ea:07:24:a4:63:af",
            "net7": "f2:4c:e9:54:9c:1e",
            "net8": "46:f3:ad:f5:ef:43",
            "net9": "ce:b0:16:20:8c:cc"
        },
        "spine_12_1_2": {
            "net0": "1a:74:b3:9d:40:6d",
            "net1": "6e:d4:b3:e8:4d:f2",
            "net10": "aa:e2:7d:5b:5f:2c",
            "net11": "7e:76:45:60:76:58",
            "net2": "fe:c3:be:f1:e7:ae",
            "net3": "4e:93:b5:2f:22:35",
            "net4": "2e:61:96:d3:82:9b",
            "net5": "62:30:00:fd:e2:d4",
            "net6": "ca:3e:77:4c:e1:eb",
            "net7": "d2:7d:84:aa:e8:c8",
            "net8": "ca:92:88:53:92:94",
            "net9": "1e:f1:45:42:75:b6"
        },
        "spine_12_1_3": {
            "net0": "2e:38:42:2e:f5:94",
            "net1": "6e:d7:32:00:d9:fe",
            "net10": "46:cf:dc:bc:1e:e7",
            "net11": "8a:6e:eb:89:ee:0c",
            "net2": "f2:4c:bb:fa:1a:41",
            "net3": "da:d7:76:df:97:5a",
            "net4": "9e:93:67:f4:e8:df",
            "net5": "06:c7:56:ec:f1:15",
            "net6": "4e:99:b6:58:29:fa",
            "net7": "a2:41:cd:76:59:10",
            "net8": "fe:c2:ef:00:f2:16",
            "net9": "26:ac:10:68:13:7e"
        },
        "spine_12_1_4": {
            "net0": "4e:84:92:f2:b3:f3",
            "net1": "e6:5e:26:a4:55:69",
            "net10": "ea:5c:37:40:a1:3b",
            "net11": "22:62:37:80:a1:7d",
            "net2": "0a:f9:da:47:d4:7c",
            "net3": "e2:b9:4c:8a:99:fa",
            "net4": "42:f7:8e:ef:97:11",
            "net5": "c2:61:f9:6b:0f:43",
            "net6": "fa:cf:f1:30:7d:0a",
            "net7": "5a:1e:ed:8c:ef:f0",
            "net8": "96:c6:fe:ba:e4:35",
            "net9": "76:20:22:22:8c:ac"
        },
        "spine_12_1_5": {
            "net0": "0e:fc:23:49:5e:fa",
            "net1": "fa:e0:00:96:37:7d",
            "net10": "de:7d:50:08:be:73",
            "net11": "12:ce:c7:b9:b9:88",
            "net2": "0a:2e:aa:72:d3:be",
            "net3": "56:a2:47:b8:14:81",
            "net4": "7a:b6:20:ca:d3:9c",
            "net5": "ee:d1:bf:7a:d2:91",
            "net6": "e6:f4:af:e8:06:ae",
            "net7": "76:dc:db:a5:db:72",
            "net8": "4e:d6:60:97:9b:1e",
            "net9": "16:7c:6b:60:68:69"
        },
        "spine_12_1_6": {
            "net0": "ae:cd:21:c1:28:8e",
            "net1": "c6:ce:7b:6a:ed:46",
            "net10": "4e:d0:ed:ae:27:03",
            "net11": "ea:15:91:2d:d7:fb",
            "net2": "5e:78:6a:f6:58:2c",
            "net3": "32:47:21:43:c6:99",
            "net4": "da:26:07:61:16:7b",
            "net5": "f6:5d:b2:5e:70:35",
            "net6": "ea:31:c3:0f:58:98",
            "net7": "92:06:48:b3:4e:52",
            "net8": "4a:86:e3:a8:e2:30",
            "net9": "86:cc:da:13:09:27"
        },
        "spine_1_1_1": {
            "net0": "72:3e:3d:74:d6:49",
            "net1": "0a:12:a4:f1:5f:4c",
            "net10": "76:3b:4c:d9:38:c7",
            "net11": "3e:6b:42:85:d5:38",
            "net2": "36:e7:c0:a3:03:fd",
            "net3": "e6:79:ed:98:f4:0a",
            "net4": "aa:22:37:65:21:50",
            "net5": "f6:20:11:d1:39:86",
            "net6": "ae:d6:9a:16:0a:a3",
            "net7": "5a:1f:7c:f0:82:66",
            "net8": "0e:f6:f6:9b:bc:f1",
            "net9": "5a:43:1e:70:2a:2f"
        },
        "spine_1_1_2": {
            "net0": "4a:c8:75:dc:72:68",
            "net1": "a2:78:47:20:30:bb",
            "net10": "fe:f8:be:17:42:b9",
            "net11": "7a:8c:f6:df:5b:b5",
            "net2": "fe:ff:72:e3:b7:3f",
            "net3": "7a:3a:2a:fb:44:77",
            "net4": "ee:f8:f6:65:17:77",
            "net5": "66:f7:b5:51:cf:9f",
            "net6": "22:7b:d4:19:36:c2",
            "net7": "ba:9c:53:92:0b:8b",
            "net8": "7e:48:c1:f6:48:2c",
            "net9": "0a:80:24:06:27:f1"
        },
        "spine_1_1_3": {
            "net0": "1e:e3:b1:7c:a6:ca",
            "net1": "ca:0d:b6:a3:0a:c9",
            "net10": "66:46:23:9d:ca:e7",
            "net11": "2a:23:66:fb:9c:80",
            "net2": "02:b1:31:e3:00:8e",
            "net3": "76:c8:91:d2:b3:86",
            "net4": "7a:83:d6:ac:cd:dd",
            "net5": "de:2b:58:08:90:dc",
            "net6": "a6:c0:77:0d:99:93",
            "net7": "86:a6:4e:ee:1c:0d",
            "net8": "42:39:7d:df:c3:b0",
            "net9": "82:5f:20:56:6a:ce"
        },
        "spine_1_1_4": {
            "net0": "12:f4:a4:e3:10:4c",
            "net1": "7a:e6:1c:db:57:a6",
            "net10": "46:e1:2c:1a:d0:35",
            "net11": "8a:b4:37:1f:57:f5",
            "net2": "4e:6e:fd:bc:27:e1",
            "net3": "fa:52:ae:d4:02:93",
            "net4": "c2:f1:a0:f1:b6:93",
            "net5": "1a:87:d2:e4:5b:da",
            "net6": "82:47:05:89:f4:76",
            "net7": "6e:e1:2f:99:91:41",
            "net8": "0a:63:40:7a:c6:a7",
            "net9": "26:8c:05:23:62:02"
        },
        "spine_1_1_5": {
            "net0": "52:72:70:bf:db:99",
            "net1": "62:6d:ca:87:43:dd",
            "net10": "92:d7:7c:ac:c6:30",
            "net11": "16:90:54:28:55:93",
            "net2": "c6:80:f1:31:ea:2e",
            "net3": "7a:97:ef:0d:7b:41",
            "net4": "7a:90:2b:a0:f2:07",
            "net5": "3a:51:96:d0:48:34",
            "net6": "d6:4b:08:96:d3:af",
            "net7": "36:71:c2:70:c8:f1",
            "net8": "c2:af:a1:c8:30:e1",
            "net9": "fa:45:8a:5c:dc:07"
        },
        "spine_1_1_6": {
            "net0": "ca:14:ba:4d:0e:cb",
            "net1": "0e:7a:7a:49:62:a1",
            "net10": "96:14:47:24:c2:d9",
            "net11": "d2:7b:dc:0a:3c:74",
            "net2": "fa:9d:78:f3:21:f1",
            "net3": "56:9e:66:84:6e:da",
            "net4": "2a:3a:04:7c:ec:77",
            "net5": "0e:07:fd:72:c7:04",
            "net6": "26:82:45:36:68:5a",
            "net7": "e6:97:2d:5f:93:42",
            "net8": "a2:af:1b:e4:78:74",
            "net9": "36:eb:39:29:67:fd"
        },
        "spine_2_1_1": {
            "net0": "92:fa:75:29:bd:05",
            "net1": "5e:e1:d1:ec:ef:65",
            "net10": "5e:87:da:e6:a1:20",
            "net11": "de:f0:7c:f0:b6:8d",
            "net2": "4e:31:ea:de:39:b2",
            "net3": "ca:1f:da:ab:c7:fd",
            "net4": "02:3a:3f:e5:7c:fd",
            "net5": "fa:0d:8e:00:96:78",
            "net6": "da:85:5b:8e:48:a9",
            "net7": "aa:e0:6a:f1:0d:6b",
            "net8": "52:a4:9b:64:29:f4",
            "net9": "b6:0d:a8:c8:72:cb"
        },
        "spine_2_1_2": {
            "net0": "92:e5:3d:01:c6:40",
            "net1": "3e:61:27:06:78:52",
            "net10": "1e:22:93:b0:71:30",
            "net11": "ba:c5:0a:b3:c9:51",
            "net2": "aa:e4:34:12:27:26",
            "net3": "2e:85:73:87:79:58",
            "net4": "6a:3e:58:61:f3:b1",
            "net5": "2a:fa:a1:db:f5:86",
            "net6": "c2:b1:5e:c0:2f:85",
            "net7": "7e:5d:1b:1a:cb:a4",
            "net8": "ca:a1:67:87:09:c1",
            "net9": "52:fb:f8:b7:1f:ba"
        },
        "spine_2_1_3": {
            "net0": "5e:73:f6:6f:5c:5c",
            "net1": "42:78:b9:b6:a0:af",
            "net10": "f2:2a:1e:7e:44:73",
            "net11": "2a:37:01:e7:55:9a",
            "net2": "0a:71:65:c4:3c:59",
            "net3": "aa:94:fd:67:b7:15",
            "net4": "76:c6:8f:b1:df:7a",
            "net5": "76:09:f3:c5:ed:02",
            "net6": "16:e9:9f:39:bc:94",
            "net7": "ce:0e:84:44:b0:b0",
            "net8": "5a:98:22:8f:59:de",
            "net9": "72:a2:cb:ec:47:1e"
        },
        "spine_2_1_4": {
            "net0": "0a:2b:18:f8:5b:4b",
            "net1": "b6:7d:d5:a5:6a:de",
            "net10": "e6:25:2b:70:7c:3d",
            "net11": "9e:f6:25:dc:90:3a",
            "net2": "56:29:0b:9d:c2:94",
            "net3": "aa:e4:02:4d:92:ad",
            "net4": "c2:26:e9:de:ae:17",
            "net5": "86:ee:18:b0:b5:9e",
            "net6": "56:6e:84:a2:ea:19",
            "net7": "b2:4e:b7:f0:6b:f2",
            "net8": "86:27:4b:eb:0e:ca",
            "net9": "56:7d:a5:32:44:90"
        },
        "spine_2_1_5": {
            "net0": "ca:a6:28:03:53:70",
            "net1": "4e:8f:a8:d2:97:f3",
            "net10": "d2:cf:10:cd:cc:50",
            "net11": "7a:7f:08:d8:d5:d3",
            "net2": "c6:eb:0b:e2:61:d1",
            "net3": "c6:64:6c:ed:9e:28",
            "net4": "02:70:ba:83:61:b5",
            "net5": "32:36:f6:4f:2f:c6",
            "net6": "42:60:6c:ff:2b:2d",
            "net7": "96:aa:db:0b:6f:2f",
            "net8": "52:39:0d:2e:eb:5b",
            "net9": "46:3d:31:47:f1:da"
        },
        "spine_2_1_6": {
            "net0": "6e:f7:e4:16:f7:77",
            "net1": "62:43:76:8d:15:e5",
            "net10": "da:1d:ad:e9:9b:16",
            "net11": "56:69:b5:92:da:bd",
            "net2": "ca:3d:35:fb:43:e9",
            "net3": "2e:64:71:98:54:67",
            "net4": "a2:e0:0e:8e:45:4f",
            "net5": "ce:10:20:7e:48:a4",
            "net6": "5a:f8:72:db:cb:a4",
            "net7": "42:fa:38:96:1c:d4",
            "net8": "6e:6f:3c:16:0d:48",
            "net9": "56:4f:63:c0:98:33"
        },
        "spine_3_1_1": {
            "net0": "2e:86:c8:64:5c:07",
            "net1": "5a:19:44:0c:5b:99",
            "net10": "56:44:d1:c0:1b:12",
            "net11": "22:66:42:08:cd:f3",
            "net2": "66:c9:0d:51:ce:fb",
            "net3": "42:03:69:82:7e:fd",
            "net4": "1a:2a:68:80:14:6f",
            "net5": "e6:fd:ea:c9:32:f7",
            "net6": "22:f7:2b:4b:48:73",
            "net7": "66:6f:8f:68:c5:b0",
            "net8": "ea:9d:0c:d8:c8:7c",
            "net9": "be:00:35:ad:1a:98"
        },
        "spine_3_1_2": {
            "net0": "fe:9d:a9:bb:5c:fc",
            "net1": "62:e0:4c:47:52:2e",
            "net10": "ea:43:15:ba:59:f6",
            "net11": "56:f0:13:0b:cf:e1",
            "net2": "b2:64:37:ad:3a:97",
            "net3": "9e:8b:0c:02:c5:fb",
            "net4": "de:5f:e2:c6:7e:c4",
            "net5": "de:11:8c:5c:6b:ed",
            "net6": "c6:df:e7:3f:a9:f2",
            "net7": "c6:80:d9:fa:4b:07",
            "net8": "56:a0:eb:66:35:1f",
            "net9": "1a:a0:2d:4d:96:86"
        },
        "spine_3_1_3": {
            "net0": "62:b1:f6:44:2d:0b",
            "net1": "76:8b:0d:76:a4:ed",
            "net10": "d6:c9:30:cf:52:98",
            "net11": "f6:c0:b0:fe:65:26",
            "net2": "0e:c9:57:17:fb:02",
            "net3": "86:4e:4a:be:b1:bf",
            "net4": "2e:ea:33:11:e7:5c",
            "net5": "fa:8a:65:83:66:c4",
            "net6": "86:52:cc:06:d1:53",
            "net7": "1a:df:2f:be:4e:19",
            "net8": "36:d4:fc:95:67:3f",
            "net9": "c6:d7:1e:99:41:36"
        },
        "spine_3_1_4": {
            "net0": "ae:bb:4e:cc:54:19",
            "net1": "9a:b3:55:55:28:6e",
            "net10": "ee:4c:8e:17:8b:80",
            "net11": "1a:94:20:28:cb:8c",
            "net2": "42:28:10:8f:6a:ba",
            "net3": "9e:3d:97:8d:d2:99",
            "net4": "d6:a7:03:24:a0:b1",
            "net5": "3a:3a:d5:f6:c0:18",
            "net6": "d2:15:9f:75:77:70",
            "net7": "5e:50:0a:a6:8f:38",
            "net8": "82:3d:c4:65:e1:0a",
            "net9": "da:44:bf:7d:44:2e"
        },
        "spine_3_1_5": {
            "net0": "96:1e:8c:a3:b2:39",
            "net1": "f2:66:3c:f4:f6:43",
            "net10": "62:56:95:f8:b9:73",
            "net11": "8e:47:df:9f:86:b9",
            "net2": "ba:2c:80:55:51:aa",
            "net3": "a2:36:94:8e:66:74",
            "net4": "5a:a1:90:fd:65:65",
            "net5": "3e:db:69:f7:7f:f0",
            "net6": "fe:fa:65:02:e7:5e",
            "net7": "ba:8c:ce:41:d9:87",
            "net8": "2a:37:12:6b:b3:b0",
            "net9": "fe:04:84:6e:4b:7e"
        },
        "spine_3_1_6": {
            "net0": "62:da:27:6a:9a:de",
            "net1": "ca:03:1c:e1:4d:43",
            "net10": "ae:9e:57:ca:cc:ac",
            "net11": "b6:34:94:8f:da:77",
            "net2": "ea:a7:18:e2:6c:35",
            "net3": "da:ef:ed:04:28:37",
            "net4": "d6:58:e1:7a:5e:ae",
            "net5": "8a:af:5d:01:23:1d",
            "net6": "a2:1e:af:53:af:37",
            "net7": "f6:b1:f3:b3:74:fd",
            "net8": "0a:29:84:4e:73:77",
            "net9": "46:6f:c3:eb:96:f4"
        },
        "spine_4_1_1": {
            "net0": "9a:65:b2:26:d1:53",
            "net1": "6e:71:9d:f6:f7:3f",
            "net10": "96:25:b0:1f:ef:27",
            "net11": "0a:bc:13:4e:78:7f",
            "net2": "9a:a3:94:5d:c7:b4",
            "net3": "8a:4c:5d:36:0d:47",
            "net4": "9e:bf:c9:0e:fc:d9",
            "net5": "ca:3d:98:d0:e6:b9",
            "net6": "1a:14:7e:d2:56:13",
            "net7": "da:cf:4f:8b:38:27",
            "net8": "42:2b:63:62:e7:a9",
            "net9": "0a:26:f6:46:b5:e4"
        },
        "spine_4_1_2": {
            "net0": "02:62:07:ee:bb:34",
            "net1": "0a:12:9e:89:57:15",
            "net10": "12:2e:5d:1e:85:90",
            "net11": "fa:c9:f6:d1:96:01",
            "net2": "0e:20:56:57:ee:d1",
            "net3": "da:20:f3:be:fa:0d",
            "net4": "86:f4:82:33:53:a5",
            "net5": "5e:f9:d8:b6:81:cc",
            "net6": "2e:39:54:13:c9:30",
            "net7": "9a:67:e8:e6:c4:97",
            "net8": "2e:bc:36:36:5d:94",
            "net9": "ae:58:9d:36:0e:98"
        },
        "spine_4_1_3": {
            "net0": "76:2d:0d:bf:6e:e2",
            "net1": "46:81:1d:1d:d9:97",
            "net10": "aa:dd:cf:0a:00:7a",
            "net11": "ba:f6:1d:fa:ac:61",
            "net2": "1a:08:e3:3e:a7:f3",
            "net3": "ba:65:40:04:70:51",
            "net4": "9e:e5:5f:22:ce:6c",
            "net5": "8e:0f:4e:2b:77:63",
            "net6": "72:82:26:aa:40:2e",
            "net7": "6a:cf:32:38:6c:36",
            "net8": "9a:1a:72:3a:10:4e",
            "net9": "4a:5a:38:25:3e:a1"
        },
        "spine_4_1_4": {
            "net0": "26:8a:de:c1:2f:4b",
            "net1": "8e:d7:99:60:02:76",
            "net10": "c6:cc:74:2b:df:e3",
            "net11": "8a:d3:f1:cd:eb:bc",
            "net2": "8a:84:ca:23:76:eb",
            "net3": "06:dd:38:23:2a:b7",
            "net4": "de:b7:04:5a:aa:6f",
            "net5": "da:ae:b7:d4:78:f7",
            "net6": "5e:d8:16:96:14:cb",
            "net7": "e6:9d:5e:b1:ff:64",
            "net8": "4a:0f:88:e0:6a:0c",
            "net9": "f2:b4:83:d5:d2:60"
        },
        "spine_4_1_5": {
            "net0": "ae:69:55:3c:e6:d5",
            "net1": "d6:ff:cb:4f:08:f7",
            "net10": "52:f8:7e:df:98:bd",
            "net11": "2a:f9:37:36:1d:9e",
            "net2": "76:c1:d4:9d:b7:ff",
            "net3": "86:02:8c:02:d6:ef",
            "net4": "8e:82:db:e4:bd:be",
            "net5": "36:0b:dc:c4:07:fb",
            "net6": "d6:01:e2:85:2f:2a",
            "net7": "0e:8a:9f:30:ab:ef",
            "net8": "82:ac:37:df:e8:ae",
            "net9": "f6:6d:9b:19:43:75"
        },
        "spine_4_1_6": {
            "net0": "4e:4a:8a:29:0d:a7",
            "net1": "4a:10:42:b1:29:68",
            "net10": "7e:f5:e8:37:ce:18",
            "net11": "56:3d:b8:5a:14:a0",
            "net2": "4e:2d:67:3f:b9:6c",
            "net3": "9a:64:d2:88:e3:55",
            "net4": "5e:0d:00:f3:10:23",
            "net5": "12:e7:fa:a2:66:0f",
            "net6": "ca:b2:20:15:fa:2e",
            "net7": "82:6a:df:2e:a8:ad",
            "net8": "36:03:e3:ae:b4:df",
            "net9": "fa:69:1d:4e:c0:c3"
        },
        "spine_5_1_1": {
            "net0": "76:d0:03:84:51:7e",
            "net1": "72:ee:ae:0c:af:59",
            "net10": "5e:0c:08:ce:82:1d",
            "net11": "de:f7:58:28:fb:07",
            "net2": "6e:40:78:9a:d0:fe",
            "net3": "46:9f:4e:07:8a:a9",
            "net4": "76:12:fa:e1:34:22",
            "net5": "9a:07:dc:1d:ef:d4",
            "net6": "96:d9:b7:f6:50:08",
            "net7": "ca:d6:55:ac:d5:b1",
            "net8": "ba:7d:45:0e:2f:2f",
            "net9": "b6:10:2c:50:36:65"
        },
        "spine_5_1_2": {
            "net0": "3a:4f:da:ab:e9:3a",
            "net1": "ee:84:ed:36:f3:20",
            "net10": "5e:12:65:16:95:e2",
            "net11": "8a:6a:82:fe:30:0c",
            "net2": "a6:87:67:cc:b1:6b",
            "net3": "8e:f1:39:c1:32:2c",
            "net4": "1a:0b:dd:00:65:8f",
            "net5": "fe:05:4d:04:36:55",
            "net6": "ae:c7:8f:af:59:a6",
            "net7": "9a:48:17:33:9e:63",
            "net8": "06:c1:97:7f:c7:a9",
            "net9": "6a:1e:60:c1:09:d3"
        },
        "spine_5_1_3": {
            "net0": "9a:86:7c:8f:10:93",
            "net1": "4a:e3:1b:9d:4b:f1",
            "net10": "2e:4b:c4:e3:43:2b",
            "net11": "ce:71:be:ca:2e:0e",
            "net2": "4a:59:3a:11:b1:a0",
            "net3": "c6:f0:6f:da:aa:c1",
            "net4": "92:1e:94:48:e3:44",
            "net5": "92:4f:36:36:f9:e0",
            "net6": "ca:a3:f4:78:34:14",
            "net7": "a6:e4:2f:2b:f0:59",
            "net8": "12:32:a1:61:88:65",
            "net9": "9e:30:21:ec:cf:9a"
        },
        "spine_5_1_4": {
            "net0": "ea:c6:95:0d:51:fa",
            "net1": "2e:f2:b8:2b:33:f5",
            "net10": "e6:40:8d:11:f8:e4",
            "net11": "fe:b7:72:99:1d:42",
            "net2": "72:49:39:27:91:ea",
            "net3": "1a:ca:4a:e4:63:aa",
            "net4": "ba:85:cb:98:d0:d8",
            "net5": "a2:ce:e7:bc:24:bb",
            "net6": "06:a4:08:b4:7a:b3",
            "net7": "b2:c5:5c:30:95:c8",
            "net8": "16:00:02:e6:40:2e",
            "net9": "2e:cb:3c:6a:35:81"
        },
        "spine_5_1_5": {
            "net0": "5a:06:7f:4e:ea:d0",
            "net1": "c6:dc:15:af:cb:4b",
            "net10": "a6:88:f9:ec:bc:ce",
            "net11": "9e:cf:0a:c0:5c:52",
            "net2": "ce:6a:0e:75:ca:b4",
            "net3": "ce:48:91:f7:bb:67",
            "net4": "1a:80:ab:94:72:79",
            "net5": "16:19:a3:23:4f:a3",
            "net6": "06:00:5e:ba:e2:3f",
            "net7": "56:a0:aa:ae:f4:02",
            "net8": "76:1d:f9:45:29:7a",
            "net9": "46:49:50:79:de:14"
        },
        "spine_5_1_6": {
            "net0": "ee:48:aa:54:ce:4d",
            "net1": "9a:50:cf:ca:e2:ef",
            "net10": "9a:04:42:47:92:57",
            "net11": "a6:0e:90:a2:5b:89",
            "net2": "7a:22:dc:a7:63:95",
            "net3": "82:b9:51:72:81:18",
            "net4": "fe:21:b5:0c:eb:53",
            "net5": "5e:1c:a2:0c:31:74",
            "net6": "5e:33:eb:56:c2:f7",
            "net7": "fe:8f:4c:18:ff:46",
            "net8": "2e:c4:37:df:86:95",
            "net9": "3e:0c:3c:2a:a7:c2"
        },
        "spine_6_1_1": {
            "net0": "a6:39:98:e2:1a:d7",
            "net1": "86:0b:21:ad:f5:92",
            "net10": "ae:f0:11:86:9b:00",
            "net11": "12:2a:c1:79:e2:8d",
            "net2": "d2:61:a1:34:4b:d3",
            "net3": "b6:97:a4:43:ba:0c",
            "net4": "a6:5e:74:1b:14:3c",
            "net5": "4a:73:7d:80:f6:2b",
            "net6": "f2:3f:54:18:cd:8d",
            "net7": "36:c6:9f:68:d6:93",
            "net8": "a6:1b:29:40:dd:4e",
            "net9": "ae:32:e9:9b:6c:7b"
        },
        "spine_6_1_2": {
            "net0": "2a:cb:90:0e:04:93",
            "net1": "a2:7e:52:dd:58:8a",
            "net10": "46:ca:c2:4f:01:31",
            "net11": "42:7b:8f:5b:cc:24",
            "net2": "6a:d4:1c:fb:0c:ed",
            "net3": "86:f1:95:65:a3:d4",
            "net4": "d2:5d:bf:5e:da:ee",
            "net5": "fe:3c:6d:72:b9:9b",
            "net6": "92:26:4b:8d:16:74",
            "net7": "76:05:62:6a:0c:70",
            "net8": "fe:fe:ee:6c:49:46",
            "net9": "a6:80:38:39:70:b0"
        },
        "spine_6_1_3": {
            "net0": "96:cc:89:09:c4:ee",
            "net1": "26:98:8f:c4:06:91",
            "net10": "e6:bf:ef:71:37:11",
            "net11": "3a:0e:41:9e:10:2c",
            "net2": "5a:75:3e:62:49:75",
            "net3": "22:13:b9:4a:b9:9f",
            "net4": "ee:da:39:cd:05:7d",
            "net5": "c2:89:dd:a0:a4:ff",
            "net6": "62:c3:d5:db:19:26",
            "net7": "1e:cf:53:b9:a2:19",
            "net8": "de:07:9d:c7:b4:74",
            "net9": "9e:d7:20:2e:20:dc"
        },
        "spine_6_1_4": {
            "net0": "06:e8:cb:f1:94:07",
            "net1": "1a:71:26:47:76:15",
            "net10": "96:50:f0:74:56:ee",
            "net11": "8a:08:f5:50:f6:67",
            "net2": "0a:2e:7f:01:58:a9",
            "net3": "4e:ad:a7:32:21:cd",
            "net4": "12:da:b6:2b:26:dc",
            "net5": "fa:6a:8f:b7:3f:e3",
            "net6": "e2:91:d4:21:34:04",
            "net7": "ae:40:3d:1c:60:b4",
            "net8": "b6:0a:14:78:f1:b0",
            "net9": "fa:d1:f1:89:0a:0e"
        },
        "spine_6_1_5": {
            "net0": "d6:51:98:17:db:53",
            "net1": "b6:17:8d:79:f6:54",
            "net10": "22:17:d9:4f:e7:c0",
            "net11": "4e:09:6f:a9:97:0b",
            "net2": "a2:92:18:b4:c2:3e",
            "net3": "7a:ca:86:b3:0c:cf",
            "net4": "0e:48:95:4b:94:1c",
            "net5": "ae:9d:ba:9b:bc:ec",
            "net6": "be:9c:dd:80:04:39",
            "net7": "4a:54:22:73:a1:97",
            "net8": "72:60:d8:d8:01:0e",
            "net9": "8a:8d:11:03:4d:d8"
        },
        "spine_6_1_6": {
            "net0": "c6:7d:95:0c:e6:c6",
            "net1": "d2:cc:b3:ba:ab:dd",
            "net10": "ae:a6:fe:9d:7c:bc",
            "net11": "e6:e9:4a:fe:db:57",
            "net2": "f6:14:73:c0:e3:96",
            "net3": "52:eb:be:f0:c9:c4",
            "net4": "6a:ce:16:24:c6:fd",
            "net5": "7e:f9:46:34:a2:47",
            "net6": "e6:59:a7:82:32:ef",
            "net7": "0e:3b:72:80:7f:e1",
            "net8": "82:ec:86:ce:dc:ad",
            "net9": "0a:8e:e4:d9:b6:db"
        },
        "spine_7_1_1": {
            "net0": "1a:70:88:37:0d:e0",
            "net1": "aa:1f:b8:a0:b2:0e",
            "net10": "c6:a6:cf:fa:f7:1e",
            "net11": "2a:16:6b:15:9c:a1",
            "net2": "76:b3:21:5b:ad:c6",
            "net3": "be:14:e3:da:c1:7e",
            "net4": "76:e4:12:81:9e:ad",
            "net5": "4a:68:7d:ba:ee:a8",
            "net6": "be:37:55:ca:7d:37",
            "net7": "66:9d:c4:bd:4b:06",
            "net8": "ae:62:bd:01:29:e6",
            "net9": "42:16:13:9a:b1:d8"
        },
        "spine_7_1_2": {
            "net0": "d2:39:a5:38:1d:c3",
            "net1": "5a:19:c0:a5:3e:d4",
            "net10": "56:2c:ac:fb:3a:44",
            "net11": "fa:f2:2e:05:55:de",
            "net2": "5e:63:83:cc:9e:7d",
            "net3": "8e:39:7f:cd:69:bc",
            "net4": "f2:05:3f:14:82:fc",
            "net5": "be:76:1d:bb:11:3a",
            "net6": "62:ca:bb:63:94:6b",
            "net7": "22:e4:12:97:9b:7b",
            "net8": "fe:09:55:d0:9f:32",
            "net9": "c6:be:c2:0b:7f:db"
        },
        "spine_7_1_3": {
            "net0": "ca:47:1a:b4:36:4c",
            "net1": "46:d8:ea:24:2a:df",
            "net10": "ba:8a:22:e8:38:bc",
            "net11": "0a:f8:f4:de:ed:5c",
            "net2": "ce:e4:6b:10:68:00",
            "net3": "92:e7:a8:dd:7a:18",
            "net4": "be:79:83:d6:52:ef",
            "net5": "d2:7e:56:3e:c5:5c",
            "net6": "32:82:06:2a:3c:05",
            "net7": "3a:b2:fc:af:37:14",
            "net8": "22:5c:a9:cf:f1:8e",
            "net9": "a2:d3:b8:83:f5:96"
        },
        "spine_7_1_4": {
            "net0": "a2:04:58:47:46:c5",
            "net1": "ee:bd:f0:d4:db:72",
            "net10": "de:93:67:f3:d9:47",
            "net11": "32:7b:fa:55:e9:b1",
            "net2": "36:2f:0b:4b:07:12",
            "net3": "3e:c5:83:4f:01:b1",
            "net4": "e2:53:bd:da:8e:83",
            "net5": "0e:39:62:ad:96:93",
            "net6": "1a:17:5d:c7:10:be",
            "net7": "82:a9:d2:e9:0c:95",
            "net8": "fe:01:d4:05:ed:bc",
            "net9": "7e:f1:73:27:a2:a1"
        },
        "spine_7_1_5": {
            "net0": "3a:ea:2c:4f:4a:6e",
            "net1": "46:91:4d:86:7e:89",
            "net10": "16:1c:20:6a:44:e4",
            "net11": "5a:73:97:04:8c:6d",
            "net2": "92:63:51:bd:12:91",
            "net3": "72:f5:fb:81:f7:72",
            "net4": "d2:3e:07:77:23:be",
            "net5": "d2:28:89:c5:d4:42",
            "net6": "c6:1e:a0:f6:5c:a4",
            "net7": "f2:2d:56:c7:08:79",
            "net8": "b2:a2:4a:79:9d:2d",
            "net9": "aa:13:f5:5d:9f:83"
        },
        "spine_7_1_6": {
            "net0": "6a:90:fe:f8:1b:5c",
            "net1": "96:c2:a3:74:cb:9f",
            "net10": "92:36:59:f7:71:16",
            "net11": "fa:ad:b0:de:40:51",
            "net2": "76:5d:10:37:9d:eb",
            "net3": "12:79:a3:f7:94:b5",
            "net4": "de:b2:2d:58:bb:c5",
            "net5": "86:d5:79:7f:3b:27",
            "net6": "0e:3c:35:90:3c:66",
            "net7": "6e:6b:4a:a5:b7:53",
            "net8": "b2:54:b7:9f:b3:a8",
            "net9": "3e:02:39:24:22:52"
        },
        "spine_8_1_1": {
            "net0": "fa:19:7a:20:a0:20",
            "net1": "16:b4:9e:a3:02:a2",
            "net10": "32:b9:af:e0:30:b3",
            "net11": "96:90:c0:a9:ee:3c",
            "net2": "f6:76:40:45:9d:db",
            "net3": "8a:30:eb:c7:5d:02",
            "net4": "96:a1:60:c0:d9:ef",
            "net5": "4e:6e:68:4f:21:e3",
            "net6": "92:f7:2a:df:cc:7a",
            "net7": "ae:4d:54:54:cd:7c",
            "net8": "4a:9b:6e:86:73:9d",
            "net9": "e6:7a:f4:72:5f:08"
        },
        "spine_8_1_2": {
            "net0": "ba:23:6b:2a:37:42",
            "net1": "5a:28:c8:79:53:44",
            "net10": "5e:e9:c0:09:34:c4",
            "net11": "6e:af:07:85:f6:01",
            "net2": "52:42:3e:19:de:d3",
            "net3": "92:d3:82:cf:a6:18",
            "net4": "1e:87:e3:2a:99:e6",
            "net5": "32:68:12:e2:81:61",
            "net6": "72:45:a8:f8:b7:3d",
            "net7": "a2:c3:0a:58:0d:b5",
            "net8": "fa:42:5f:9b:96:05",
            "net9": "b2:fa:9c:7a:bd:62"
        },
        "spine_8_1_3": {
            "net0": "06:9e:bc:38:21:14",
            "net1": "d2:66:17:bb:9d:c9",
            "net10": "5e:a3:af:a0:84:43",
            "net11": "ae:5d:31:2a:5b:66",
            "net2": "4a:59:09:b2:cd:fb",
            "net3": "9e:a3:f2:75:42:87",
            "net4": "a6:6c:8d:2d:db:b1",
            "net5": "2a:f2:32:75:ad:57",
            "net6": "82:a6:4a:b5:35:99",
            "net7": "c2:8b:e9:df:73:bc",
            "net8": "82:04:1f:1f:63:19",
            "net9": "22:0e:2d:3f:b5:46"
        },
        "spine_8_1_4": {
            "net0": "8a:18:3b:05:67:e9",
            "net1": "e2:32:b8:d3:64:0d",
            "net10": "16:8d:07:ac:80:a7",
            "net11": "8a:0c:6f:1c:ac:b2",
            "net2": "52:8c:34:f7:9c:e9",
            "net3": "02:00:2a:d5:31:6a",
            "net4": "c6:2d:08:bf:91:ce",
            "net5": "82:6d:89:11:89:68",
            "net6": "be:67:d8:59:7f:ca",
            "net7": "0a:55:7c:e2:22:5b",
            "net8": "56:68:42:57:d6:7b",
            "net9": "72:d2:05:42:2f:e0"
        },
        "spine_8_1_5": {
            "net0": "0e:8d:2d:e2:5f:da",
            "net1": "da:ef:e7:a2:31:ea",
            "net10": "9a:d5:32:94:d2:22",
            "net11": "4e:7c:27:5b:ba:cb",
            "net2": "fa:39:b8:56:b3:6d",
            "net3": "da:42:7a:03:d8:fc",
            "net4": "9e:28:74:01:ce:f8",
            "net5": "96:ec:54:c6:2a:0a",
            "net6": "be:ed:93:01:24:e1",
            "net7": "d6:30:7c:c1:47:9b",
            "net8": "a2:1a:c6:53:a5:d8",
            "net9": "56:19:30:78:5c:92"
        },
        "spine_8_1_6": {
            "net0": "6a:c6:f7:47:a6:07",
            "net1": "26:1d:9b:43:63:97",
            "net10": "ba:f9:b4:e4:f6:bb",
            "net11": "f2:5d:03:ca:c7:1a",
            "net2": "9e:3e:18:ee:a2:2e",
            "net3": "8e:a9:7f:96:2c:b4",
            "net4": "ae:90:3b:1b:ae:d3",
            "net5": "76:5f:4a:b1:91:e5",
            "net6": "aa:b6:56:ca:c6:93",
            "net7": "ea:75:c6:40:57:01",
            "net8": "9e:5a:46:71:8e:1c",
            "net9": "0a:e4:58:4c:89:56"
        },
        "spine_9_1_1": {
            "net0": "ee:ed:3a:44:20:4c",
            "net1": "ce:77:05:0e:61:ca",
            "net10": "5a:c4:82:bb:9f:55",
            "net11": "36:37:e7:7f:8c:fb",
            "net2": "b2:cb:ff:1f:48:68",
            "net3": "e6:86:57:dd:36:a3",
            "net4": "02:58:a9:e9:a6:a2",
            "net5": "ee:36:4a:b4:4c:e3",
            "net6": "aa:63:ae:4f:be:ac",
            "net7": "56:e5:57:0f:2c:f6",
            "net8": "16:48:82:75:5e:c5",
            "net9": "b6:77:e2:11:fc:2f"
        },
        "spine_9_1_2": {
            "net0": "b6:8e:ff:91:50:f6",
            "net1": "76:68:38:29:60:8d",
            "net10": "2e:6b:00:70:2c:34",
            "net11": "5e:1f:b9:a4:ea:57",
            "net2": "56:79:62:39:0e:dc",
            "net3": "46:55:67:aa:cf:8a",
            "net4": "e6:a5:02:9c:8b:91",
            "net5": "9e:74:b4:8a:d2:a3",
            "net6": "16:d2:d2:ea:78:49",
            "net7": "32:4f:11:86:be:5d",
            "net8": "fe:8d:cd:05:8f:34",
            "net9": "c2:c5:24:24:2b:f7"
        },
        "spine_9_1_3": {
            "net0": "ce:7d:d0:32:fb:cb",
            "net1": "16:2e:a0:98:82:fe",
            "net10": "ba:07:f5:65:9f:30",
            "net11": "1a:6a:f1:d2:1a:ce",
            "net2": "12:5c:de:26:02:72",
            "net3": "f6:ec:df:e3:7e:77",
            "net4": "32:9d:c6:74:29:96",
            "net5": "12:e0:e7:ac:a4:49",
            "net6": "fe:a3:8a:ce:11:02",
            "net7": "36:d6:16:3b:04:e4",
            "net8": "5a:35:9c:af:ca:75",
            "net9": "9e:24:4e:04:2d:c7"
        },
        "spine_9_1_4": {
            "net0": "ee:18:49:c0:e9:cb",
            "net1": "a6:9c:4f:61:52:6c",
            "net10": "e2:74:9c:a8:ea:fd",
            "net11": "d6:ff:70:a9:c4:78",
            "net2": "6a:17:79:f0:76:31",
            "net3": "de:82:fa:99:36:73",
            "net4": "0a:b1:60:78:31:7c",
            "net5": "3e:e3:d8:88:4d:a0",
            "net6": "26:8b:02:25:a3:fd",
            "net7": "d2:96:eb:54:40:ab",
            "net8": "46:89:f5:20:6a:99",
            "net9": "fe:40:f2:7a:60:8a"
        },
        "spine_9_1_5": {
            "net0": "b6:89:0f:ad:d5:1d",
            "net1": "b2:7b:e2:69:9f:bb",
            "net10": "72:3c:79:46:75:67",
            "net11": "96:78:5d:f8:f3:16",
            "net2": "8e:6b:3f:02:f0:a1",
            "net3": "6a:3b:10:ba:6c:a2",
            "net4": "ca:17:05:48:ee:0b",
            "net5": "ca:58:cb:a1:0d:05",
            "net6": "76:a3:ed:de:0b:7c",
            "net7": "72:50:19:79:8c:a8",
            "net8": "6e:49:ec:42:f3:e7",
            "net9": "b2:f8:b1:06:dc:99"
        },
        "spine_9_1_6": {
            "net0": "2e:1c:e6:f3:a2:2f",
            "net1": "ea:91:7d:cb:e1:cc",
            "net10": "5a:71:61:af:16:2e",
            "net11": "62:81:cf:46:c5:d0",
            "net2": "16:7c:2f:aa:da:a3",
            "net3": "46:6b:92:6c:2e:7f",
            "net4": "fa:53:7f:e3:2d:3a",
            "net5": "de:c3:32:16:96:a1",
            "net6": "16:8f:ea:7d:14:cd",
            "net7": "ee:f7:1d:0d:26:d3",
            "net8": "aa:7e:ec:2c:30:7b",
            "net9": "4a:b0:b9:9e:ff:2f"
        },
        "tof_1_2_1": {
            "net0": "62:e7:58:73:2a:a2",
            "net1": "ba:6a:03:2c:3e:94",
            "net10": "be:f6:48:2c:13:56",
            "net11": "d6:46:72:4c:0b:95",
            "net2": "e2:59:95:ea:27:a3",
            "net3": "6a:f5:fe:66:23:c5",
            "net4": "b2:ec:31:ab:38:cb",
            "net5": "9a:ff:22:52:66:95",
            "net6": "ee:d7:83:b6:65:a7",
            "net7": "b2:ac:82:9f:0c:79",
            "net8": "4a:b3:01:2c:b8:a5",
            "net9": "96:c9:04:53:f4:4a"
        },
        "tof_1_2_2": {
            "net0": "f6:0e:08:45:8d:86",
            "net1": "0e:2d:bf:f7:2f:23",
            "net10": "46:5d:3e:62:51:10",
            "net11": "aa:ef:03:04:b1:df",
            "net2": "66:0b:b3:9b:95:9d",
            "net3": "42:22:3f:2f:73:34",
            "net4": "1a:70:4e:b6:27:ff",
            "net5": "b2:13:17:83:94:59",
            "net6": "5a:64:39:f6:56:5a",
            "net7": "6e:33:38:9c:c1:0a",
            "net8": "ea:e0:30:14:0a:56",
            "net9": "26:84:ab:d7:a5:b0"
        },
        "tof_1_2_3": {
            "net0": "96:6e:13:b3:70:f9",
            "net1": "d2:3b:d1:06:13:1f",
            "net10": "56:6a:4d:b7:78:a1",
            "net11": "9e:e9:dc:7a:2f:56",
            "net2": "6e:6f:5e:71:85:c8",
            "net3": "3e:7d:f9:eb:dc:99",
            "net4": "ee:f1:91:a6:c7:25",
            "net5": "d6:91:2e:a7:a6:ac",
            "net6": "72:76:36:cc:e5:cb",
            "net7": "ae:0c:75:50:f5:9e",
            "net8": "ee:0b:1d:7c:d1:36",
            "net9": "9a:44:56:6c:d8:85"
        },
        "tof_1_2_4": {
            "net0": "96:cd:92:78:19:55",
            "net1": "ba:d6:04:85:15:e9",
            "net10": "fe:df:88:3a:ee:29",
            "net11": "9a:22:5c:69:3d:ef",
            "net2": "92:a4:23:af:ad:c4",
            "net3": "7a:70:05:8a:32:52",
            "net4": "6a:ba:d6:e2:b2:be",
            "net5": "ca:57:dc:5a:9a:36",
            "net6": "7e:3c:94:83:ba:cb",
            "net7": "22:cb:57:a4:87:c0",
            "net8": "e6:41:2a:d2:4f:b1",
            "net9": "c2:eb:03:c9:16:c8"
        },
        "tof_1_2_5": {
            "net0": "e2:40:36:ea:82:6e",
            "net1": "4e:eb:da:3a:8e:0d",
            "net10": "92:d6:66:5d:8f:15",
            "net11": "6e:0a:0c:42:d2:21",
            "net2": "ce:75:78:ea:42:92",
            "net3": "c2:f1:cb:12:7b:d0",
            "net4": "26:8e:73:1b:a5:dd",
            "net5": "52:b9:87:f5:f5:95",
            "net6": "86:ff:18:10:f0:96",
            "net7": "56:27:8c:25:97:c8",
            "net8": "fa:79:85:2d:88:f9",
            "net9": "42:c5:f7:2b:f4:05"
        },
        "tof_1_2_6": {
            "net0": "12:2d:91:d3:37:ff",
            "net1": "5e:fc:c5:4e:8b:59",
            "net10": "62:4b:d8:22:4e:2c",
            "net11": "26:38:aa:5b:28:8e",
            "net2": "66:da:50:ed:db:fd",
            "net3": "4e:09:96:24:af:a1",
            "net4": "56:db:e1:30:e4:9f",
            "net5": "42:ce:0c:16:1c:16",
            "net6": "12:a2:9f:c5:87:ea",
            "net7": "26:ab:03:e9:7a:78",
            "net8": "a2:ba:82:cf:54:d2",
            "net9": "2e:d1:7e:74:80:35"
        },
        "tof_2_2_1": {
            "net0": "ea:47:ac:f9:f4:83",
            "net1": "3a:c2:fd:73:6c:9b",
            "net10": "ae:0f:c2:02:a5:86",
            "net11": "96:b6:1d:b3:a1:da",
            "net2": "fa:8d:57:b2:fa:9f",
            "net3": "3e:fc:f7:41:82:0d",
            "net4": "3e:5e:10:b7:13:78",
            "net5": "76:f9:e7:bb:b3:7b",
            "net6": "82:dc:3a:e2:99:d5",
            "net7": "16:bf:11:21:e0:9c",
            "net8": "ce:b5:eb:6f:9d:8a",
            "net9": "46:b9:04:b6:49:80"
        },
        "tof_2_2_2": {
            "net0": "3a:93:ae:50:8a:06",
            "net1": "de:c8:47:41:03:78",
            "net10": "5e:f3:14:99:a0:9b",
            "net11": "0a:a4:58:cc:36:3b",
            "net2": "16:3a:39:5f:26:e7",
            "net3": "82:77:a5:51:df:2f",
            "net4": "d2:6b:e1:81:97:25",
            "net5": "42:6b:7b:3b:35:cb",
            "net6": "a2:61:ee:2e:28:c4",
            "net7": "46:a1:17:8a:05:cf",
            "net8": "26:7c:64:d5:cc:97",
            "net9": "3e:12:e7:c1:75:70"
        },
        "tof_2_2_3": {
            "net0": "26:ce:6e:a7:c6:a0",
            "net1": "e6:25:95:45:6b:5a",
            "net10": "f6:eb:a9:f6:bd:a4",
            "net11": "4a:00:a9:be:3b:a1",
            "net2": "72:8c:95:c4:77:17",
            "net3": "76:b5:6e:c1:70:77",
            "net4": "72:47:01:68:42:ba",
            "net5": "62:ef:b9:1a:8c:45",
            "net6": "b2:95:9e:13:de:26",
            "net7": "be:0f:f7:54:eb:00",
            "net8": "96:4b:46:a1:3d:3f",
            "net9": "72:40:b2:71:52:a3"
        },
        "tof_2_2_4": {
            "net0": "e6:2c:9a:7b:f3:51",
            "net1": "32:b5:11:1a:2d:9f",
            "net10": "86:00:2b:ef:68:91",
            "net11": "0e:b4:3f:6e:d7:9b",
            "net2": "3e:fe:d6:0a:ce:82",
            "net3": "3e:e2:ef:c9:f1:9a",
            "net4": "8e:03:ce:5f:91:42",
            "net5": "22:0e:55:59:44:eb",
            "net6": "12:19:01:25:dd:e7",
            "net7": "b6:ad:f5:4d:3b:95",
            "net8": "d6:e9:15:92:7e:59",
            "net9": "9e:9d:79:49:96:ad"
        },
        "tof_2_2_5": {
            "net0": "f6:01:38:f5:34:1d",
            "net1": "7a:fa:d5:f2:ef:3d",
            "net10": "ba:3c:1a:d1:1f:58",
            "net11": "96:9f:c9:08:9a:43",
            "net2": "f6:89:b5:db:91:cb",
            "net3": "4e:cb:da:fc:94:1b",
            "net4": "be:61:e9:99:d6:37",
            "net5": "1a:17:b0:1d:ac:ec",
            "net6": "56:5e:2b:74:e4:71",
            "net7": "7a:1e:55:ad:3b:6a",
            "net8": "ea:99:a7:db:07:ff",
            "net9": "0e:b9:ad:4d:3c:b6"
        },
        "tof_2_2_6": {
            "net0": "02:90:8b:f0:f5:55",
            "net1": "da:cf:b3:f7:d6:6a",
            "net10": "72:fb:4b:7f:19:75",
            "net11": "66:83:ad:aa:db:d7",
            "net2": "ca:7b:b5:6e:90:ab",
            "net3": "72:f5:b8:ba:ba:42",
            "net4": "02:39:5e:b2:07:47",
            "net5": "1a:0f:4b:06:ef:27",
            "net6": "d2:7a:0b:38:d7:47",
            "net7": "a6:69:1e:5a:c4:e7",
            "net8": "b6:af:d6:94:46:1a",
            "net9": "72:90:59:1f:0c:d2"
        },
        "tof_3_2_1": {
            "net0": "42:38:19:ed:5f:2e",
            "net1": "f2:dd:c0:fb:dc:c7",
            "net10": "96:32:98:dc:29:1f",
            "net11": "fe:fb:a3:ee:2c:81",
            "net2": "82:27:74:1a:7f:d0",
            "net3": "5e:34:94:a1:23:35",
            "net4": "c6:fb:a8:0a:0b:df",
            "net5": "ba:b1:f7:84:77:67",
            "net6": "72:50:e4:b4:1d:43",
            "net7": "7a:49:e0:52:f1:84",
            "net8": "5e:e1:71:88:d6:38",
            "net9": "72:47:c7:05:76:97"
        },
        "tof_3_2_2": {
            "net0": "de:0e:4d:26:29:f1",
            "net1": "c2:ed:46:a4:56:d8",
            "net10": "82:f5:64:a5:2e:da",
            "net11": "5e:b6:37:d7:41:19",
            "net2": "aa:e0:5e:3c:28:ff",
            "net3": "6a:83:7f:13:84:65",
            "net4": "62:9d:24:91:55:ff",
            "net5": "16:c3:28:77:f9:96",
            "net6": "3a:dc:d9:5f:76:e2",
            "net7": "62:49:82:62:61:0a",
            "net8": "da:ce:e4:df:bd:dc",
            "net9": "d2:d5:74:96:97:dc"
        },
        "tof_3_2_3": {
            "net0": "c2:ea:ab:5f:11:af",
            "net1": "82:a2:f9:55:1b:66",
            "net10": "2a:6c:37:38:5d:bf",
            "net11": "f2:29:58:7d:e6:8e",
            "net2": "2a:e9:8d:c9:37:49",
            "net3": "66:42:02:ba:92:a5",
            "net4": "a2:35:76:91:32:3a",
            "net5": "42:55:5a:85:3f:6f",
            "net6": "ea:62:e1:ba:84:28",
            "net7": "16:f5:e7:ab:e6:c3",
            "net8": "2a:db:66:d9:8c:54",
            "net9": "22:7b:4f:4a:66:c9"
        },
        "tof_3_2_4": {
            "net0": "42:cb:aa:fb:e9:c0",
            "net1": "1e:86:e0:9b:6d:2b",
            "net10": "fa:bd:ee:08:cc:d0",
            "net11": "e6:2e:89:78:15:4b",
            "net2": "d2:7e:15:50:82:62",
            "net3": "42:19:fa:8e:35:42",
            "net4": "ce:a1:53:6c:d0:c6",
            "net5": "66:59:b5:92:e9:8f",
            "net6": "ee:ae:76:94:22:9e",
            "net7": "c6:32:e6:84:41:5b",
            "net8": "f6:fc:ee:80:c5:f1",
            "net9": "5e:dc:d7:b4:aa:71"
        },
        "tof_3_2_5": {
            "net0": "2e:06:85:f7:34:fa",
            "net1": "ae:ca:2c:f5:c1:c4",
            "net10": "92:88:19:d7:16:c8",
            "net11": "56:56:44:8e:97:60",
            "net2": "12:1b:a7:5d:44:e2",
            "net3": "aa:76:60:3e:14:be",
            "net4": "8a:0c:89:da:1c:f5",
            "net5": "8a:ef:fd:47:6f:7f",
            "net6": "42:2a:74:c5:66:d2",
            "net7": "66:62:eb:42:2e:81",
            "net8": "62:8d:6c:a4:86:4f",
            "net9": "56:23:94:45:db:d4"
        },
        "tof_3_2_6": {
            "net0": "ce:23:aa:f2:3e:20",
            "net1": "12:06:b5:26:28:27",
            "net10": "b2:13:ae:95:f4:10",
            "net11": "da:5c:f0:3f:cb:04",
            "net2": "de:be:eb:26:cb:23",
            "net3": "fe:e4:a4:7d:6d:77",
            "net4": "ce:91:c4:7c:8b:f6",
            "net5": "de:00:f3:e7:ba:0e",
            "net6": "6e:ca:89:4f:e0:f4",
            "net7": "6a:b1:3a:42:a4:b9",
            "net8": "b6:dc:50:90:93:b6",
            "net9": "5e:37:ff:33:56:c4"
        },
        "tof_4_2_1": {
            "net0": "de:02:5c:15:c1:d3",
            "net1": "ca:e7:db:59:60:58",
            "net10": "de:d2:01:83:18:e0",
            "net11": "72:3f:6e:46:d0:9d",
            "net2": "4e:e3:ea:31:dc:4d",
            "net3": "b6:34:57:0b:7a:f2",
            "net4": "0e:f6:6d:b8:0d:a3",
            "net5": "7a:ee:23:ab:bd:e9",
            "net6": "3e:d3:af:97:7d:fd",
            "net7": "56:61:41:ef:bc:67",
            "net8": "72:da:57:e0:1c:e5",
            "net9": "ea:fb:55:84:91:31"
        },
        "tof_4_2_2": {
            "net0": "06:be:05:f0:74:c5",
            "net1": "f6:79:c9:b3:4c:35",
            "net10": "1a:fc:24:f2:17:d6",
            "net11": "42:f0:2b:7e:e2:c7",
            "net2": "3e:82:3a:68:06:d5",
            "net3": "72:96:3b:95:88:5c",
            "net4": "de:de:d5:81:82:22",
            "net5": "86:83:e0:69:71:be",
            "net6": "be:36:a2:99:d6:e4",
            "net7": "72:95:50:bd:2b:0a",
            "net8": "9a:51:9c:7f:93:0a",
            "net9": "36:11:9f:7d:13:ff"
        },
        "tof_4_2_3": {
            "net0": "c6:d6:db:42:3b:6f",
            "net1": "4a:b6:4b:60:2f:16",
            "net10": "ca:28:4e:25:c5:83",
            "net11": "e6:47:2a:9f:96:af",
            "net2": "1e:0d:e2:2f:af:a8",
            "net3": "3e:fb:14:73:68:14",
            "net4": "0a:94:43:37:c7:7d",
            "net5": "5a:e5:87:ce:ed:0a",
            "net6": "52:38:ce:4f:dd:20",
            "net7": "ca:4a:c5:ee:14:24",
            "net8": "5e:a1:f0:d1:62:9a",
            "net9": "52:09:96:a7:ca:32"
        },
        "tof_4_2_4": {
            "net0": "66:b2:43:57:4e:d3",
            "net1": "a2:bb:e6:30:aa:07",
            "net10": "da:ff:82:52:92:a1",
            "net11": "c2:be:a4:d1:9c:11",
            "net2": "16:bf:df:9b:f3:61",
            "net3": "3a:35:5a:57:a5:1a",
            "net4": "82:7e:d3:af:36:e2",
            "net5": "9a:5d:a7:1b:50:e3",
            "net6": "72:76:06:02:28:d0",
            "net7": "12:80:c0:18:a4:04",
            "net8": "06:94:fe:39:46:19",
            "net9": "02:c8:b6:51:e5:5a"
        },
        "tof_4_2_5": {
            "net0": "6e:43:57:95:dd:c7",
            "net1": "16:65:8b:72:7c:5b",
            "net10": "12:5a:2d:9b:26:df",
            "net11": "16:07:1a:cf:de:cc",
            "net2": "0e:09:ba:56:16:31",
            "net3": "ee:92:52:47:9a:63",
            "net4": "3a:68:70:08:d8:e4",
            "net5": "02:d9:1f:be:bc:d8",
            "net6": "a6:55:7c:63:b6:1b",
            "net7": "0e:b9:44:2c:0f:aa",
            "net8": "92:04:79:de:28:fd",
            "net9": "a2:fd:e7:8c:b4:2a"
        },
        "tof_4_2_6": {
            "net0": "36:fe:62:94:07:31",
            "net1": "5a:37:d5:c5:c2:b9",
            "net10": "ee:aa:23:04:bd:d2",
            "net11": "d6:c4:58:14:ca:e7",
            "net2": "16:27:c9:36:6a:45",
            "net3": "de:be:14:c8:23:59",
            "net4": "e2:b6:71:93:13:0e",
            "net5": "52:67:0e:a3:e4:c3",
            "net6": "82:3c:a4:51:0b:f4",
            "net7": "82:a0:a2:b8:01:2a",
            "net8": "62:8b:ac:05:a4:05",
            "net9": "02:32:eb:3e:ac:bb"
        },
        "tof_5_2_1": {
            "net0": "8e:35:cf:24:75:2e",
            "net1": "aa:8a:a6:86:13:28",
            "net10": "6a:25:af:ac:c4:e6",
            "net11": "8e:63:c3:0d:ad:74",
            "net2": "5a:ff:12:6f:7f:82",
            "net3": "36:56:e6:bb:93:eb",
            "net4": "5e:ba:93:74:00:70",
            "net5": "46:84:a3:88:56:d2",
            "net6": "66:5c:d9:9a:31:0c",
            "net7": "ce:5c:f2:3b:1c:1d",
            "net8": "32:2d:57:72:a7:b9",
            "net9": "06:f7:5b:20:9d:6f"
        },
        "tof_5_2_2": {
            "net0": "e2:ff:26:43:20:45",
            "net1": "8e:e2:63:9e:69:46",
            "net10": "3e:f5:b7:1a:f7:ea",
            "net11": "82:34:5e:4d:ed:40",
            "net2": "9a:af:16:75:c7:de",
            "net3": "e6:21:3c:80:c0:42",
            "net4": "ea:bc:79:73:0f:2c",
            "net5": "d6:ed:55:c8:09:57",
            "net6": "8e:80:5c:d5:be:f6",
            "net7": "2e:20:51:ce:cc:af",
            "net8": "da:ee:9c:c4:34:18",
            "net9": "72:ea:b5:bd:f5:38"
        },
        "tof_5_2_3": {
            "net0": "ee:89:d6:6c:f9:fb",
            "net1": "5e:0e:d0:78:0f:e2",
            "net10": "52:8c:17:ce:1e:c7",
            "net11": "82:cd:73:6e:38:be",
            "net2": "1a:79:a5:12:78:f2",
            "net3": "4e:7e:aa:2f:21:93",
            "net4": "b6:df:38:cd:27:b5",
            "net5": "b2:5b:fd:97:4e:10",
            "net6": "de:ab:9f:55:d0:29",
            "net7": "66:64:32:15:ca:5e",
            "net8": "46:f2:6b:30:db:ed",
            "net9": "b2:fe:a4:0a:ab:98"
        },
        "tof_5_2_4": {
            "net0": "06:9a:a3:51:21:71",
            "net1": "6e:1d:d1:64:de:4f",
            "net10": "ba:7b:f6:18:1d:11",
            "net11": "42:fd:26:6d:4f:2e",
            "net2": "7a:f8:f8:0d:95:80",
            "net3": "12:ad:68:15:81:b3",
            "net4": "0e:1c:3b:43:96:cb",
            "net5": "7a:3f:1d:65:99:18",
            "net6": "7e:cf:25:1e:24:e3",
            "net7": "32:56:3a:02:d7:af",
            "net8": "7a:76:51:76:cb:12",
            "net9": "8e:55:52:06:3f:64"
        },
        "tof_5_2_5": {
            "net0": "f6:4d:08:1f:89:c8",
            "net1": "32:62:a9:4b:be:4c",
            "net10": "62:47:8e:54:e8:5d",
            "net11": "7a:25:fe:09:31:0a",
            "net2": "4e:da:17:6b:b2:17",
            "net3": "ae:6f:cf:e4:ba:58",
            "net4": "3a:ac:fd:65:05:4f",
            "net5": "4e:fb:ea:8a:1a:1e",
            "net6": "9e:ac:ef:46:99:76",
            "net7": "ae:c6:78:4d:be:84",
            "net8": "96:00:04:25:1d:0d",
            "net9": "aa:89:f8:91:2a:9d"
        },
        "tof_5_2_6": {
            "net0": "1e:df:65:5b:fa:1a",
            "net1": "c2:8d:94:f5:e7:ce",
            "net10": "1e:4f:a5:c9:98:a0",
            "net11": "fa:b1:48:86:a2:9c",
            "net2": "36:d8:4d:5a:85:4f",
            "net3": "72:74:58:71:b8:40",
            "net4": "0a:04:c6:d8:86:4f",
            "net5": "46:13:7d:e5:78:2d",
            "net6": "8a:76:5b:01:15:fe",
            "net7": "82:4f:4d:9b:a2:2b",
            "net8": "e2:57:4d:6b:71:b2",
            "net9": "fa:ec:1b:77:e1:6c"
        },
        "tof_6_2_1": {
            "net0": "1a:e1:30:4c:94:be",
            "net1": "9a:6c:1e:3b:68:e2",
            "net10": "fe:a6:85:8b:f9:a5",
            "net11": "32:09:64:15:01:f5",
            "net2": "46:3a:ff:b1:87:86",
            "net3": "52:c2:81:90:fe:20",
            "net4": "52:e2:c6:bd:59:3a",
            "net5": "2e:70:60:9b:f9:1b",
            "net6": "8e:65:84:3e:6b:ae",
            "net7": "3a:af:c6:48:c9:43",
            "net8": "76:44:3b:05:01:cc",
            "net9": "22:d9:43:95:cd:4a"
        },
        "tof_6_2_2": {
            "net0": "ca:81:ce:28:d5:1e",
            "net1": "f6:69:70:35:13:b3",
            "net10": "02:27:46:03:fd:fc",
            "net11": "7e:30:24:76:d7:16",
            "net2": "8a:f9:62:c5:a4:40",
            "net3": "32:45:6f:3a:15:fe",
            "net4": "5a:f5:7b:b3:d9:4f",
            "net5": "b2:5c:9c:24:90:4f",
            "net6": "92:7d:66:15:04:27",
            "net7": "c2:d8:f1:c8:44:97",
            "net8": "92:45:ae:c6:d1:5e",
            "net9": "8e:f5:05:0e:c0:7f"
        },
        "tof_6_2_3": {
            "net0": "66:e7:34:a2:ca:c9",
            "net1": "d6:48:85:da:1d:7c",
            "net10": "1e:9e:47:1a:92:0e",
            "net11": "e6:ed:48:52:60:fc",
            "net2": "5a:d3:c1:0f:e5:15",
            "net3": "d6:33:ef:b5:ba:a4",
            "net4": "2a:af:a2:59:6d:39",
            "net5": "5a:5e:0a:b1:a5:7f",
            "net6": "1e:9e:91:50:c7:ca",
            "net7": "e2:78:80:55:f7:4c",
            "net8": "f6:43:2b:df:4d:7e",
            "net9": "8a:e8:13:e6:f9:5d"
        },
        "tof_6_2_4": {
            "net0": "7a:65:fd:12:04:e4",
            "net1": "42:09:48:03:2f:ff",
            "net10": "b2:3a:19:27:98:0d",
            "net11": "ce:64:21:c7:3b:0f",
            "net2": "62:7c:3b:8f:34:bf",
            "net3": "da:36:8f:b7:0d:1f",
            "net4": "2e:30:90:4e:e2:fe",
            "net5": "7a:37:c5:77:09:9d",
            "net6": "26:ec:c7:6e:c2:13",
            "net7": "6e:45:4d:81:70:d1",
            "net8": "ce:86:8a:fd:39:d5",
            "net9": "8a:1a:2e:fe:cf:47"
        },
        "tof_6_2_5": {
            "net0": "4a:0f:0f:e2:3b:56",
            "net1": "ee:60:dd:7c:05:71",
            "net10": "96:c2:0a:52:42:80",
            "net11": "2e:27:28:ee:92:7d",
            "net2": "ce:dc:c2:52:d2:61",
            "net3": "ce:c6:1d:e3:1b:71",
            "net4": "5e:7b:20:3e:aa:26",
            "net5": "ae:81:25:a6:03:ed",
            "net6": "f2:58:c5:6c:7b:64",
            "net7": "b6:0b:83:97:a3:ba",
            "net8": "de:0f:bb:20:0f:57",
            "net9": "da:e2:af:7f:02:c0"
        },
        "tof_6_2_6": {
            "net0": "fe:25:4b:4a:b7:53",
            "net1": "32:2e:cc:fa:75:31",
            "net10": "66:0b:9a:b0:84:99",
            "net11": "6e:7d:e4:3c:d9:d6",
            "net2": "ca:12:42:d5:8b:5f",
            "net3": "02:8c:61:6a:2f:03",
            "net4": "fa:48:ee:32:69:f1",
            "net5": "82:e3:4f:67:a7:54",
            "net6": "a2:d8:6c:eb:01:0e",
            "net7": "da:79:54:7a:ac:98",
            "net8": "4e:b6:21:f8:ab:bd",
            "net9": "c2:28:71:e1:1c:17"
        }
    },
    "failed_machine": "leaf_1_0_1",
    "failed_interfaces": [
        "net0"
    ],
    "failure_time": 1616374013.1280036,
    "recover_time": 1616374092.151559
}