{
    "description": "Scenario 3b: Spine spine_1_1_1 failure with BGP",
    "k_leaf": 6,
    "k_top": 6,
    "redundancy_factor": 3,
    "is_k8s": true,
    "machine_mac_addresses": {
        "leaf_1_0_1": {
            "net0": "1e:73:17:36:7a:40",
            "net1": "aa:87:07:12:b7:c8",
            "net2": "be:8c:16:ef:70:37",
            "net3": "62:63:9b:8a:ee:44",
            "net4": "96:6d:9f:a7:43:06",
            "net5": "66:ae:8b:aa:8d:4c",
            "net6": "b6:df:00:d3:24:05"
        },
        "leaf_1_0_2": {
            "net0": "da:5b:8b:50:b6:a4",
            "net1": "7a:77:3b:e5:60:d9",
            "net2": "66:35:51:fd:89:a9",
            "net3": "fe:df:4a:5d:11:6f",
            "net4": "96:6e:2f:4e:30:a1",
            "net5": "46:a8:82:51:83:5e",
            "net6": "d6:58:91:8c:3c:e3"
        },
        "leaf_1_0_3": {
            "net0": "5e:cc:c4:4a:d7:54",
            "net1": "be:59:34:44:ea:f9",
            "net2": "92:e3:ff:d0:dd:4c",
            "net3": "ce:2c:e2:2b:ee:cb",
            "net4": "9e:a3:69:e6:f7:7d",
            "net5": "96:44:1c:ab:24:91",
            "net6": "f6:a2:4d:0a:59:82"
        },
        "leaf_1_0_4": {
            "net0": "b2:93:d4:5a:75:aa",
            "net1": "da:3e:5e:36:a4:8d",
            "net2": "06:2d:91:0a:69:17",
            "net3": "6a:03:fd:e0:b2:e2",
            "net4": "0e:69:81:c9:2b:bf",
            "net5": "a6:42:d1:d8:e3:4f",
            "net6": "3a:a6:46:1d:47:83"
        },
        "leaf_1_0_5": {
            "net0": "36:09:c1:0b:f6:df",
            "net1": "96:56:0e:ca:1a:5b",
            "net2": "46:f1:33:a4:c2:d3",
            "net3": "e6:f3:40:64:ad:81",
            "net4": "f6:19:ef:12:18:fa",
            "net5": "66:df:56:1f:97:a4",
            "net6": "16:65:0f:bb:03:44"
        },
        "leaf_1_0_6": {
            "net0": "56:48:64:65:5d:0b",
            "net1": "b6:ee:58:ff:d9:cb",
            "net2": "22:8a:21:0e:1b:ed",
            "net3": "fa:bc:37:0d:aa:54",
            "net4": "2a:50:0d:6d:9c:6d",
            "net5": "32:3f:01:33:8f:25",
            "net6": "86:57:38:65:98:a4"
        },
        "leaf_2_0_1": {
            "net0": "ce:db:29:2c:a8:97",
            "net1": "0a:c4:69:35:6b:4b",
            "net2": "8a:15:ea:f6:85:b2",
            "net3": "32:86:19:85:a0:4c",
            "net4": "6a:4a:bf:90:d9:9e",
            "net5": "fa:c7:d8:dd:9f:44",
            "net6": "1e:87:9d:2d:d9:e0"
        },
        "leaf_2_0_2": {
            "net0": "22:eb:58:27:cf:aa",
            "net1": "e2:96:33:fd:5b:35",
            "net2": "8a:70:b3:0b:27:77",
            "net3": "72:e2:88:4e:c9:d1",
            "net4": "8e:15:a7:df:d6:03",
            "net5": "5a:e2:66:83:fe:76",
            "net6": "da:d0:2f:45:e3:f3"
        },
        "leaf_2_0_3": {
            "net0": "9e:a9:70:b0:7a:10",
            "net1": "62:a0:af:ea:a9:05",
            "net2": "ea:bb:3f:fa:26:67",
            "net3": "0a:c9:15:6c:89:aa",
            "net4": "b2:ad:42:53:d5:f9",
            "net5": "3a:0f:4c:c8:79:16",
            "net6": "76:5b:7a:19:7a:c7"
        },
        "leaf_2_0_4": {
            "net0": "3e:c1:ce:73:3c:d6",
            "net1": "66:6f:ba:91:c6:82",
            "net2": "de:3d:32:69:85:aa",
            "net3": "ea:41:51:40:71:39",
            "net4": "06:85:58:4e:39:ce",
            "net5": "f2:eb:2e:9c:64:6f",
            "net6": "72:60:f7:a2:d7:7a"
        },
        "leaf_2_0_5": {
            "net0": "c2:bb:ea:81:4a:53",
            "net1": "3e:4d:13:8a:21:2d",
            "net2": "02:50:78:97:27:0b",
            "net3": "52:05:fa:1a:d2:66",
            "net4": "36:07:15:9d:a3:e4",
            "net5": "4a:cd:00:1a:a5:92",
            "net6": "c2:b1:2e:6b:64:a4"
        },
        "leaf_2_0_6": {
            "net0": "aa:fe:82:2c:c7:c7",
            "net1": "5a:4d:ab:b7:37:8c",
            "net2": "8a:63:4d:2b:b9:76",
            "net3": "9e:ff:14:0c:d8:cf",
            "net4": "b6:0b:65:08:d3:08",
            "net5": "82:a9:e8:14:35:b9",
            "net6": "b6:b2:97:00:24:fd"
        },
        "leaf_3_0_1": {
            "net0": "56:ff:e8:67:27:ff",
            "net1": "a2:7f:be:5f:8c:33",
            "net2": "da:1e:b0:c8:54:9d",
            "net3": "e2:dd:71:2f:f8:5d",
            "net4": "b6:50:51:9c:11:46",
            "net5": "6e:e7:7e:7b:b8:1d",
            "net6": "9a:78:c1:a7:8a:8b"
        },
        "leaf_3_0_2": {
            "net0": "c6:cb:d4:6a:c8:2b",
            "net1": "6a:d9:ae:a5:05:91",
            "net2": "f2:0b:c3:c2:74:59",
            "net3": "5e:38:6a:63:b7:b7",
            "net4": "62:c2:9a:91:31:71",
            "net5": "56:c0:04:9b:94:a8",
            "net6": "7e:64:db:92:de:c3"
        },
        "leaf_3_0_3": {
            "net0": "6a:a7:52:be:3e:d1",
            "net1": "e6:bf:42:79:41:8c",
            "net2": "0a:ff:d1:85:58:66",
            "net3": "3e:95:f8:60:96:cd",
            "net4": "26:19:f4:ad:4f:d0",
            "net5": "3e:33:87:a1:80:2d",
            "net6": "52:71:9a:4f:17:67"
        },
        "leaf_3_0_4": {
            "net0": "a6:92:23:b2:6d:48",
            "net1": "3a:de:4b:c5:89:b3",
            "net2": "82:b4:5b:e3:2f:f2",
            "net3": "0e:db:2f:6c:7e:24",
            "net4": "6a:58:fb:b9:41:90",
            "net5": "be:c1:22:f0:7f:7c",
            "net6": "12:7f:06:65:1d:ac"
        },
        "leaf_3_0_5": {
            "net0": "aa:f7:d5:7c:56:8a",
            "net1": "7a:12:d6:75:e8:1f",
            "net2": "d2:22:3b:1e:0b:d6",
            "net3": "ae:a0:55:f1:63:1a",
            "net4": "62:b6:00:e1:fa:94",
            "net5": "a6:d4:0d:66:66:54",
            "net6": "be:69:48:da:13:01"
        },
        "leaf_3_0_6": {
            "net0": "aa:3a:d0:05:07:b5",
            "net1": "da:f4:27:2d:4a:4e",
            "net2": "be:f7:e7:9b:36:68",
            "net3": "1e:35:53:d6:df:36",
            "net4": "76:b9:60:cc:04:85",
            "net5": "4e:62:df:05:9f:a8",
            "net6": "6e:cc:97:84:91:b3"
        },
        "leaf_4_0_1": {
            "net0": "02:6c:07:b2:d4:07",
            "net1": "1a:db:52:06:78:cf",
            "net2": "f6:e4:ad:2f:20:5f",
            "net3": "6a:e0:cc:21:63:93",
            "net4": "1e:9a:a8:d2:54:b7",
            "net5": "e2:cd:5d:ed:a7:79",
            "net6": "e6:e7:12:66:81:09"
        },
        "leaf_4_0_2": {
            "net0": "82:7a:cc:5f:e0:1f",
            "net1": "02:c6:72:de:c9:76",
            "net2": "06:0a:3b:fb:32:46",
            "net3": "82:2a:f5:c5:f4:c0",
            "net4": "7a:cc:6f:79:12:c1",
            "net5": "c2:dd:92:b3:4f:cd",
            "net6": "22:73:29:00:c8:9e"
        },
        "leaf_4_0_3": {
            "net0": "e6:52:71:9f:14:41",
            "net1": "7e:d7:64:de:28:91",
            "net2": "16:10:a5:5f:05:33",
            "net3": "da:e0:4d:72:b1:54",
            "net4": "2e:06:c7:2a:0d:37",
            "net5": "8e:5d:57:86:db:db",
            "net6": "ea:f3:41:9c:53:20"
        },
        "leaf_4_0_4": {
            "net0": "ee:75:e9:14:8c:be",
            "net1": "3a:86:f3:37:61:f2",
            "net2": "ce:b0:53:e7:0b:a0",
            "net3": "42:48:18:7a:32:e5",
            "net4": "62:f0:a5:fd:b2:25",
            "net5": "3a:e1:72:88:ab:20",
            "net6": "be:79:59:7b:00:f8"
        },
        "leaf_4_0_5": {
            "net0": "36:af:12:18:3f:a0",
            "net1": "12:45:99:f5:a6:5e",
            "net2": "fa:50:b1:2b:2f:87",
            "net3": "3a:5f:25:60:d2:12",
            "net4": "7a:73:69:db:a9:6c",
            "net5": "66:fe:61:d8:2b:cc",
            "net6": "3a:77:ec:bf:51:e8"
        },
        "leaf_4_0_6": {
            "net0": "16:73:36:26:90:13",
            "net1": "c2:55:83:0b:1d:10",
            "net2": "b6:b9:b7:44:af:68",
            "net3": "c2:92:af:5b:fd:ca",
            "net4": "ba:67:99:71:70:93",
            "net5": "32:61:ef:c9:75:cf",
            "net6": "4e:89:fc:4d:ce:7f"
        },
        "spine_1_1_1": {
            "net0": "7e:30:28:16:69:b4",
            "net1": "ea:4a:76:8e:99:dc",
            "net10": "e6:4f:96:b7:30:b9",
            "net11": "16:f7:13:cf:50:7c",
            "net2": "1e:cf:12:c0:8f:04",
            "net3": "26:8b:cf:47:ae:f4",
            "net4": "ae:48:bd:d2:8c:c9",
            "net5": "22:fc:62:b4:7a:ee",
            "net6": "ce:4a:fe:a3:b8:64",
            "net7": "86:a6:08:69:35:87",
            "net8": "46:86:88:2a:05:03",
            "net9": "fe:b8:8c:d9:e8:de"
        },
        "spine_1_1_2": {
            "net0": "e2:ef:8f:21:d3:dd",
            "net1": "aa:65:a2:10:eb:fb",
            "net10": "da:f3:e3:b9:1b:02",
            "net11": "66:89:ca:4c:91:5a",
            "net2": "fe:03:0a:65:41:36",
            "net3": "f6:b7:95:32:1c:52",
            "net4": "26:dd:f7:25:ca:35",
            "net5": "1a:3c:75:77:94:b0",
            "net6": "ae:d3:2c:c1:ca:fc",
            "net7": "12:d4:74:e0:b2:73",
            "net8": "46:00:38:01:8a:cf",
            "net9": "52:48:36:a6:e3:a1"
        },
        "spine_1_1_3": {
            "net0": "ba:74:c5:eb:e9:80",
            "net1": "06:73:51:98:58:73",
            "net10": "b2:47:1c:3e:4e:a8",
            "net11": "5e:93:b4:b5:5b:c1",
            "net2": "a2:22:54:1f:32:ca",
            "net3": "8a:d8:e8:c0:03:f4",
            "net4": "36:e3:dc:ec:12:29",
            "net5": "da:82:cd:64:7f:f4",
            "net6": "52:a6:5a:f1:85:5d",
            "net7": "1e:dc:a2:b0:83:8e",
            "net8": "c2:5a:69:c8:2d:23",
            "net9": "1e:02:ba:a8:7f:60"
        },
        "spine_1_1_4": {
            "net0": "b2:4b:38:44:a4:c8",
            "net1": "ea:e0:ba:7d:f1:66",
            "net10": "3a:88:15:8f:c1:60",
            "net11": "b2:da:bb:18:ac:79",
            "net2": "2a:ae:a0:86:73:49",
            "net3": "de:0f:fd:8c:4d:32",
            "net4": "86:40:ab:45:de:6f",
            "net5": "f2:a9:18:78:1f:06",
            "net6": "66:e4:a0:0d:eb:6f",
            "net7": "1a:20:a5:b3:94:2c",
            "net8": "da:d0:6b:06:ac:3f",
            "net9": "aa:49:d1:9a:9a:2b"
        },
        "spine_1_1_5": {
            "net0": "32:54:1d:0c:f9:2e",
            "net1": "42:b2:ec:6d:eb:38",
            "net10": "de:89:03:ea:94:9b",
            "net11": "16:d3:d7:28:31:6b",
            "net2": "02:4c:82:22:d9:e3",
            "net3": "6e:dc:bd:4a:7a:66",
            "net4": "de:e2:ee:f1:c9:85",
            "net5": "4e:ec:5d:9a:a3:78",
            "net6": "3e:5f:0f:85:e3:32",
            "net7": "2a:c0:37:46:8c:e0",
            "net8": "3e:83:be:0b:50:91",
            "net9": "82:90:2a:a0:91:6c"
        },
        "spine_1_1_6": {
            "net0": "8e:3e:ee:d9:ef:00",
            "net1": "2e:3c:8d:8b:be:85",
            "net10": "e2:34:cf:b0:f4:2a",
            "net11": "ee:ea:89:36:2f:04",
            "net2": "8e:7d:20:18:9c:21",
            "net3": "26:d5:77:bf:74:e1",
            "net4": "fe:07:22:a8:6d:36",
            "net5": "36:e0:8c:67:94:2a",
            "net6": "fe:54:8b:fc:ec:db",
            "net7": "1e:1e:28:a2:56:47",
            "net8": "0a:92:2c:c4:3a:2c",
            "net9": "32:66:3c:0b:0e:64"
        },
        "spine_2_1_1": {
            "net0": "46:cc:82:38:cf:ae",
            "net1": "fa:5c:c7:5d:c0:d8",
            "net10": "7a:47:3f:ba:e0:1f",
            "net11": "c6:e8:fa:68:9e:8d",
            "net2": "b2:a9:9b:08:8a:b5",
            "net3": "56:a0:82:1c:af:cd",
            "net4": "12:42:9b:bb:d6:0b",
            "net5": "b2:54:bc:25:0e:83",
            "net6": "d2:98:9b:a1:f4:03",
            "net7": "66:7f:0a:6a:ba:f4",
            "net8": "72:d7:91:bf:cd:0e",
            "net9": "6e:98:3d:f7:9b:90"
        },
        "spine_2_1_2": {
            "net0": "5a:5c:66:07:05:4f",
            "net1": "86:04:68:2f:9a:81",
            "net10": "c2:9d:e9:57:83:23",
            "net11": "5a:5b:3f:3b:df:82",
            "net2": "5a:16:a4:b8:87:e8",
            "net3": "ca:2e:34:62:1a:bf",
            "net4": "96:e6:e6:11:75:b8",
            "net5": "9a:42:39:0b:ad:d6",
            "net6": "ee:5a:56:2a:e7:08",
            "net7": "7a:f6:f9:03:16:a1",
            "net8": "5e:0f:93:22:e1:86",
            "net9": "c6:7e:b0:85:57:41"
        },
        "spine_2_1_3": {
            "net0": "96:b5:2b:12:76:7e",
            "net1": "62:f6:91:bf:fc:74",
            "net10": "6e:97:3d:d2:6c:76",
            "net11": "92:de:b7:76:5e:ed",
            "net2": "8e:05:57:d8:e8:87",
            "net3": "56:d5:30:11:2f:11",
            "net4": "7a:02:9a:35:7c:b0",
            "net5": "be:6b:3d:90:a2:9d",
            "net6": "12:c4:27:bd:6e:6d",
            "net7": "36:45:6e:b9:40:63",
            "net8": "e2:96:c9:e0:92:65",
            "net9": "8a:8f:20:da:3d:ec"
        },
        "spine_2_1_4": {
            "net0": "f6:70:64:22:89:4b",
            "net1": "5e:70:77:aa:4a:0e",
            "net10": "ba:48:c5:1d:44:bd",
            "net11": "e6:be:3d:02:e7:0d",
            "net2": "3a:f4:60:7f:fa:49",
            "net3": "32:33:56:0a:77:59",
            "net4": "22:28:18:21:79:3b",
            "net5": "d2:cf:f3:d9:fc:50",
            "net6": "0a:d9:7f:d3:10:e5",
            "net7": "72:b4:8a:6f:b4:41",
            "net8": "ba:44:22:13:77:61",
            "net9": "5a:98:86:f8:d9:96"
        },
        "spine_2_1_5": {
            "net0": "4e:a9:fd:8e:1b:98",
            "net1": "da:c4:7d:32:31:dc",
            "net10": "82:7f:bc:92:d5:33",
            "net11": "6e:e2:89:f5:3f:86",
            "net2": "9e:be:96:82:fa:e1",
            "net3": "8e:90:0d:d3:29:a6",
            "net4": "52:12:2b:87:04:43",
            "net5": "4e:53:f3:1b:9e:e3",
            "net6": "ba:9d:5c:4a:2c:63",
            "net7": "2e:08:39:38:d2:56",
            "net8": "ae:09:25:a1:fa:6c",
            "net9": "26:27:dd:9f:27:dc"
        },
        "spine_2_1_6": {
            "net0": "d6:7f:57:34:3e:f4",
            "net1": "ee:97:e2:8a:ce:84",
            "net10": "be:9d:c2:86:16:b6",
            "net11": "5a:73:70:45:d1:ef",
            "net2": "b6:2e:8d:e9:65:4a",
            "net3": "6e:b9:2f:96:a7:ab",
            "net4": "06:d7:c2:91:a4:a7",
            "net5": "be:2b:93:33:35:f0",
            "net6": "3a:f9:f0:72:cd:5e",
            "net7": "ae:01:e3:c5:14:d2",
            "net8": "52:c8:ce:10:3f:98",
            "net9": "5a:49:14:3c:98:36"
        },
        "spine_3_1_1": {
            "net0": "12:40:1c:57:61:ed",
            "net1": "7e:6d:36:40:34:d4",
            "net10": "2e:ae:82:53:4f:32",
            "net11": "b2:1e:64:b2:d4:e5",
            "net2": "d6:fd:0e:7c:59:d5",
            "net3": "6e:86:a4:25:60:52",
            "net4": "e6:e1:f0:6a:28:50",
            "net5": "12:74:85:9f:fb:fa",
            "net6": "46:56:5b:86:97:fe",
            "net7": "1a:9c:12:21:91:99",
            "net8": "16:e9:e3:26:f5:27",
            "net9": "e6:24:e0:81:bf:78"
        },
        "spine_3_1_2": {
            "net0": "c6:51:62:fa:bd:c9",
            "net1": "46:19:98:e1:65:bf",
            "net10": "1a:ce:dd:d0:28:4e",
            "net11": "4e:ce:f5:19:f7:c9",
            "net2": "2e:d4:92:c5:d2:bb",
            "net3": "be:9d:f3:08:40:3f",
            "net4": "7a:4b:98:bd:5d:c4",
            "net5": "42:7a:65:f2:17:b7",
            "net6": "62:ac:6d:28:11:46",
            "net7": "26:1f:34:51:fb:01",
            "net8": "e2:3a:c0:53:7c:92",
            "net9": "c2:cc:dc:c1:19:fc"
        },
        "spine_3_1_3": {
            "net0": "4e:01:5d:23:9d:4d",
            "net1": "76:ff:b8:c9:67:a2",
            "net10": "06:b6:99:26:d8:08",
            "net11": "fa:27:c7:34:e0:df",
            "net2": "72:94:1d:e2:96:3d",
            "net3": "c6:9a:ca:4c:9d:b2",
            "net4": "72:67:f7:5b:ee:b1",
            "net5": "9a:80:47:bf:a0:39",
            "net6": "52:f4:65:04:2f:8e",
            "net7": "aa:4b:30:6e:c6:81",
            "net8": "66:ee:7c:8b:8a:f3",
            "net9": "c2:c5:b6:06:2f:06"
        },
        "spine_3_1_4": {
            "net0": "32:63:c0:35:76:f9",
            "net1": "a2:72:5d:a6:b5:8d",
            "net10": "1a:49:e6:d3:ea:f3",
            "net11": "1e:57:5f:3c:b5:dc",
            "net2": "82:00:23:de:4b:6c",
            "net3": "8a:d1:2a:7c:1a:1c",
            "net4": "36:a3:fa:b1:76:ff",
            "net5": "e2:19:af:4f:a8:03",
            "net6": "02:f1:d3:67:4d:54",
            "net7": "0a:0f:5f:21:59:b6",
            "net8": "d2:62:d6:a2:6a:b3",
            "net9": "76:31:d3:a9:90:7b"
        },
        "spine_3_1_5": {
            "net0": "6e:22:4d:fd:ac:79",
            "net1": "62:33:ba:45:24:06",
            "net10": "22:b2:cd:c2:b7:b7",
            "net11": "da:c1:8a:f8:ee:cc",
            "net2": "72:1f:cc:2b:88:85",
            "net3": "f2:c8:90:cd:92:ae",
            "net4": "ae:cb:e5:9e:6e:d5",
            "net5": "66:bb:5b:4f:43:4d",
            "net6": "de:4e:32:05:fb:d9",
            "net7": "2a:cd:f3:b6:28:36",
            "net8": "26:20:37:88:31:bb",
            "net9": "56:3b:9c:46:8e:e2"
        },
        "spine_3_1_6": {
            "net0": "6e:b2:93:93:a9:ec",
            "net1": "be:ba:39:40:42:f5",
            "net10": "3a:7d:4f:ba:9a:97",
            "net11": "2e:ec:25:aa:b9:2b",
            "net2": "8a:1d:ca:53:62:73",
            "net3": "2e:88:1b:68:b3:5a",
            "net4": "8e:3e:15:da:7b:da",
            "net5": "0a:80:99:88:e7:ee",
            "net6": "be:9a:93:4f:36:e5",
            "net7": "c2:34:3a:b4:7f:bb",
            "net8": "9a:8c:f9:73:21:d2",
            "net9": "56:49:23:bf:e9:f6"
        },
        "spine_4_1_1": {
            "net0": "5a:77:7b:56:0b:8b",
            "net1": "76:b1:59:a1:6a:a5",
            "net10": "a6:9e:6d:2d:67:2f",
            "net11": "3e:0e:1e:2a:42:4b",
            "net2": "4e:45:89:98:c8:4a",
            "net3": "76:5e:ac:e0:b7:ba",
            "net4": "6e:97:e5:88:e9:c1",
            "net5": "2e:74:c3:70:80:b3",
            "net6": "ca:7f:42:33:6f:04",
            "net7": "5a:96:5b:03:86:bc",
            "net8": "12:c4:7f:3b:4e:40",
            "net9": "1a:0b:f1:78:fb:15"
        },
        "spine_4_1_2": {
            "net0": "02:cc:e6:4c:05:7f",
            "net1": "de:5b:3e:36:92:df",
            "net10": "56:62:60:a9:0f:48",
            "net11": "32:8f:29:a7:a0:bd",
            "net2": "d2:d0:cd:68:b5:42",
            "net3": "2e:ea:eb:1f:69:5f",
            "net4": "7a:cc:be:50:43:eb",
            "net5": "1a:e0:74:49:62:b5",
            "net6": "06:cd:81:04:ed:16",
            "net7": "06:51:7e:17:40:6d",
            "net8": "7e:4d:49:40:22:97",
            "net9": "de:8b:04:77:e1:50"
        },
        "spine_4_1_3": {
            "net0": "7e:99:d6:05:9d:6b",
            "net1": "c2:27:75:3b:78:ee",
            "net10": "32:e0:4a:0d:44:b5",
            "net11": "96:1f:fa:dd:49:e2",
            "net2": "fe:f0:d1:03:5c:5f",
            "net3": "26:6e:95:d0:3e:09",
            "net4": "1e:07:c5:52:d7:fc",
            "net5": "92:f0:98:e5:73:37",
            "net6": "e2:33:4d:6d:95:dc",
            "net7": "ae:78:97:93:ca:f7",
            "net8": "ea:38:1a:61:4b:db",
            "net9": "8e:64:e3:1c:4e:67"
        },
        "spine_4_1_4": {
            "net0": "d2:e4:2f:31:f6:9e",
            "net1": "ee:0c:d0:af:aa:60",
            "net10": "3a:32:82:36:33:35",
            "net11": "da:35:8e:b5:2e:93",
            "net2": "fe:1e:54:20:ea:3c",
            "net3": "3e:17:01:f8:05:33",
            "net4": "5e:f2:87:95:e4:4d",
            "net5": "52:8d:2d:e9:aa:f2",
            "net6": "f6:53:8e:41:e9:4e",
            "net7": "76:35:a0:21:03:6b",
            "net8": "1e:fe:b5:54:98:80",
            "net9": "da:49:61:a4:96:a9"
        },
        "spine_4_1_5": {
            "net0": "e2:7a:c4:b5:41:1e",
            "net1": "3a:ca:99:85:ad:56",
            "net10": "3a:f1:9d:44:55:56",
            "net11": "f6:75:fa:8f:17:dd",
            "net2": "da:4c:f9:40:75:b3",
            "net3": "ee:20:47:0c:5e:96",
            "net4": "e6:89:38:bb:16:4e",
            "net5": "56:a7:a7:6d:19:b4",
            "net6": "8a:15:f6:9b:55:b3",
            "net7": "2a:7e:e3:b5:89:d6",
            "net8": "16:a2:50:3d:38:f9",
            "net9": "a2:b8:51:a6:0b:92"
        },
        "spine_4_1_6": {
            "net0": "7a:8c:72:72:10:40",
            "net1": "ea:4a:dc:c4:9a:3c",
            "net10": "a2:64:3c:00:73:6d",
            "net11": "de:79:f5:dd:3d:2f",
            "net2": "3e:88:24:02:d7:b1",
            "net3": "f2:d6:65:18:9b:3e",
            "net4": "f6:0e:86:b1:d8:96",
            "net5": "5a:9a:cf:91:b5:c6",
            "net6": "ee:e7:9e:70:24:fc",
            "net7": "ae:6c:5b:eb:08:d8",
            "net8": "ee:31:04:4e:f6:39",
            "net9": "02:86:64:03:d0:97"
        },
        "tof_1_2_1": {
            "net0": "b6:5e:25:4e:2a:96",
            "net1": "6a:17:a7:95:57:6f",
            "net10": "46:dd:91:30:35:a0",
            "net11": "0e:70:c5:5d:cd:81",
            "net2": "ea:72:23:c7:87:d6",
            "net3": "c6:6e:fa:6a:bb:95",
            "net4": "e2:85:f8:67:af:29",
            "net5": "ea:30:eb:a2:73:de",
            "net6": "6e:9d:e9:6f:d3:11",
            "net7": "aa:29:96:3f:ca:2b",
            "net8": "62:37:c9:a8:37:a4",
            "net9": "0e:3b:16:3a:65:51"
        },
        "tof_1_2_2": {
            "net0": "fa:1c:35:b2:30:92",
            "net1": "a6:02:c1:86:86:ac",
            "net10": "b6:51:31:3f:2e:d5",
            "net11": "ea:0a:3d:3a:e7:1d",
            "net2": "72:1c:a5:f4:63:6a",
            "net3": "6a:71:3d:70:a8:d3",
            "net4": "3a:ac:7b:71:89:0c",
            "net5": "7e:e9:14:15:c7:c2",
            "net6": "9a:0d:8a:ca:8d:3c",
            "net7": "4e:f8:1a:11:b9:21",
            "net8": "9a:69:bc:fb:56:1a",
            "net9": "de:62:4c:c4:55:51"
        },
        "tof_1_2_3": {
            "net0": "76:92:41:7a:ff:b3",
            "net1": "72:c7:d9:55:93:a2",
            "net10": "fa:59:8a:8b:a6:16",
            "net11": "56:1b:9e:28:55:10",
            "net2": "4a:70:30:1e:01:32",
            "net3": "b2:3f:c2:36:68:06",
            "net4": "62:5b:ae:d8:fc:ca",
            "net5": "1e:17:ff:cd:48:58",
            "net6": "06:51:a6:58:a7:d7",
            "net7": "ae:36:0e:5a:47:53",
            "net8": "e2:78:3a:99:be:91",
            "net9": "9e:5a:62:aa:ce:62"
        },
        "tof_1_2_4": {
            "net0": "1e:af:da:aa:e4:f1",
            "net1": "a6:59:ac:75:ae:08",
            "net10": "32:14:fd:a3:47:f6",
            "net11": "ca:69:b7:93:ac:0a",
            "net2": "ce:f6:bb:ce:12:3b",
            "net3": "da:d0:50:03:f6:35",
            "net4": "6a:80:25:29:d3:ec",
            "net5": "2a:c6:61:59:02:ee",
            "net6": "8a:3c:76:f7:c7:2a",
            "net7": "ee:06:13:ec:2c:6d",
            "net8": "82:77:d7:b9:ee:87",
            "net9": "7a:a4:b5:07:61:64"
        },
        "tof_1_2_5": {
            "net0": "b2:92:0f:63:42:69",
            "net1": "72:80:fb:d9:01:d3",
            "net10": "02:29:8f:96:24:64",
            "net11": "de:f6:d9:d8:bb:14",
            "net2": "72:ad:a9:5e:99:e3",
            "net3": "0e:8b:c0:23:47:23",
            "net4": "02:a6:88:f0:f5:fb",
            "net5": "a6:ac:78:15:81:5b",
            "net6": "42:27:1f:27:99:78",
            "net7": "36:eb:db:00:7e:40",
            "net8": "82:59:fb:34:82:27",
            "net9": "8e:9e:39:db:20:6b"
        },
        "tof_1_2_6": {
            "net0": "66:c2:b0:f2:c3:49",
            "net1": "3e:3d:6e:06:92:be",
            "net10": "ba:53:63:cb:de:47",
            "net11": "42:0b:56:2a:15:6d",
            "net2": "e6:ee:26:ec:51:39",
            "net3": "12:0c:ab:5f:72:32",
            "net4": "76:92:e2:39:a3:45",
            "net5": "3a:ef:ad:51:12:f5",
            "net6": "92:f6:a5:bf:1a:76",
            "net7": "1e:26:52:3b:16:66",
            "net8": "b2:40:17:7e:f9:3d",
            "net9": "9e:d8:d2:ba:04:40"
        },
        "tof_2_2_1": {
            "net0": "12:98:7e:8d:be:ca",
            "net1": "8e:56:cc:15:99:d1",
            "net10": "46:7b:6a:67:03:2c",
            "net11": "06:4f:fc:c3:5c:7e",
            "net2": "aa:3c:37:07:21:ee",
            "net3": "3e:eb:d1:de:22:03",
            "net4": "ca:32:a1:ab:3b:77",
            "net5": "32:45:64:78:5c:03",
            "net6": "72:12:13:ff:37:94",
            "net7": "2e:d0:0e:f2:27:bf",
            "net8": "66:51:23:c0:82:5c",
            "net9": "2e:ac:63:af:b2:7f"
        },
        "tof_2_2_2": {
            "net0": "5a:31:20:dc:06:71",
            "net1": "42:b8:af:a9:dc:db",
            "net10": "a6:f7:34:07:5a:2d",
            "net11": "82:c6:e3:01:c4:68",
            "net2": "4e:a5:22:ad:d9:46",
            "net3": "5e:86:ac:29:dc:92",
            "net4": "c6:67:7e:56:50:d9",
            "net5": "1e:ec:c8:e0:26:76",
            "net6": "fe:56:4e:dc:64:67",
            "net7": "22:54:c1:ea:f1:e8",
            "net8": "aa:39:38:01:f5:c1",
            "net9": "2e:de:1f:91:91:eb"
        },
        "tof_2_2_3": {
            "net0": "02:19:cf:36:0c:22",
            "net1": "4a:b2:44:a5:01:1e",
            "net10": "f6:a4:6c:ef:96:83",
            "net11": "fe:e0:53:03:7e:6e",
            "net2": "b2:49:d4:ee:b4:4a",
            "net3": "2e:3b:cf:d2:44:79",
            "net4": "76:92:b6:d8:d4:e1",
            "net5": "62:c8:70:90:d5:3e",
            "net6": "4e:ff:72:17:ba:bb",
            "net7": "8a:b1:a0:8a:cc:dc",
            "net8": "f6:33:d8:97:ec:4b",
            "net9": "c6:b0:49:42:eb:96"
        },
        "tof_2_2_4": {
            "net0": "9e:f2:c8:f3:a6:11",
            "net1": "6a:b3:2b:d9:51:20",
            "net10": "12:2c:58:79:69:01",
            "net11": "7e:20:ea:48:0e:55",
            "net2": "5e:35:2a:6b:95:74",
            "net3": "3a:d2:53:6d:b7:d5",
            "net4": "c6:fb:9d:d1:e6:a5",
            "net5": "1e:bb:d6:04:d4:a2",
            "net6": "9a:3c:9b:9d:d4:71",
            "net7": "de:ca:1a:75:bb:a3",
            "net8": "62:33:e6:37:9b:bc",
            "net9": "f6:a7:7d:13:a2:ad"
        },
        "tof_2_2_5": {
            "net0": "8e:89:06:00:4d:e5",
            "net1": "2a:f0:90:ca:91:11",
            "net10": "2a:e6:12:a1:8e:74",
            "net11": "c2:ed:6c:44:ce:d7",
            "net2": "9e:4b:65:67:2c:19",
            "net3": "56:a0:62:7e:6e:e3",
            "net4": "a6:6c:0b:29:56:24",
            "net5": "36:c9:cb:c5:27:77",
            "net6": "6e:a6:75:94:d1:00",
            "net7": "7e:78:28:bd:4d:56",
            "net8": "52:2a:73:24:57:84",
            "net9": "a6:bf:0a:42:33:26"
        },
        "tof_2_2_6": {
            "net0": "d2:a4:f8:11:89:09",
            "net1": "da:3f:1a:61:01:bc",
            "net10": "a2:0c:be:c9:f4:1a",
            "net11": "06:8f:4e:9f:cf:dc",
            "net2": "de:89:38:2c:30:ad",
            "net3": "da:b4:21:e8:ef:28",
            "net4": "da:81:de:f1:23:7c",
            "net5": "9e:8f:3c:83:59:a8",
            "net6": "5e:67:d3:ab:71:4a",
            "net7": "6e:3a:eb:67:24:06",
            "net8": "6e:f7:37:87:f4:1e",
            "net9": "3a:bf:ce:c1:1b:9a"
        }
    },
    "failed_machine": "spine_1_1_1",
    "failure_time": 1616249183.4737017
}