{
    "k_leaf": 8,
    "k_top": 8,
    "redundancy_factor": 4,
    "is_k8s": true,
    "machine_mac_addresses": {
        "leaf_1_0_1": {
            "net0": "9e:3f:ff:8a:8d:48",
            "net1": "06:b8:35:5a:5a:c8",
            "net2": "52:07:61:4e:d4:89",
            "net3": "06:da:00:89:4d:d8",
            "net4": "0e:61:33:38:b5:82",
            "net5": "62:eb:5f:e4:2d:81",
            "net6": "a2:1f:10:9b:5b:6b",
            "net7": "96:88:36:62:62:ce",
            "net8": "8a:f4:a7:a7:49:4c"
        },
        "leaf_1_0_2": {
            "net0": "76:fa:a6:11:7f:25",
            "net1": "8a:43:bf:2e:7c:a7",
            "net2": "5a:fa:41:a2:fa:f0",
            "net3": "2a:b7:9f:73:fe:cf",
            "net4": "3e:e1:f1:d8:63:74",
            "net5": "c6:21:cb:17:82:07",
            "net6": "ea:18:fa:a5:a5:ad",
            "net7": "16:c3:df:10:d3:01",
            "net8": "1a:90:f9:d2:ba:06"
        },
        "leaf_1_0_3": {
            "net0": "1a:40:cf:58:55:a5",
            "net1": "22:b4:21:32:d9:97",
            "net2": "06:be:82:8c:a6:de",
            "net3": "0e:8d:00:bb:2f:a0",
            "net4": "ea:f6:50:db:76:d2",
            "net5": "be:7f:83:11:63:73",
            "net6": "3e:a1:44:ba:5c:f9",
            "net7": "7e:26:9e:04:ad:29",
            "net8": "6e:d5:aa:c5:2a:89"
        },
        "leaf_1_0_4": {
            "net0": "de:c9:98:60:2a:74",
            "net1": "72:ae:a3:22:fd:91",
            "net2": "ba:e8:28:05:49:f3",
            "net3": "46:6f:9d:c5:bd:24",
            "net4": "6e:12:61:80:72:b6",
            "net5": "ba:a7:b9:93:aa:2e",
            "net6": "22:ca:e0:63:35:37",
            "net7": "d6:13:72:0d:f4:e5",
            "net8": "2e:12:98:7d:0c:6c"
        },
        "leaf_1_0_5": {
            "net0": "4e:f6:53:c8:86:b5",
            "net1": "7a:9a:33:56:d5:3b",
            "net2": "8a:2f:d9:9e:a1:1f",
            "net3": "5a:3c:06:a1:41:16",
            "net4": "6e:71:63:79:44:8c",
            "net5": "b2:4a:ec:bb:e0:81",
            "net6": "06:74:37:9c:39:93",
            "net7": "6a:48:d3:3b:09:c3",
            "net8": "f2:fc:6d:7f:49:a6"
        },
        "leaf_1_0_6": {
            "net0": "46:04:5d:39:cb:85",
            "net1": "5a:51:e4:f1:0c:86",
            "net2": "36:82:32:fb:21:b6",
            "net3": "8e:77:8c:c8:9e:3c",
            "net4": "6e:4f:a3:ee:3d:24",
            "net5": "aa:4a:10:5d:86:e2",
            "net6": "86:7c:90:e0:24:77",
            "net7": "3a:56:48:f8:7e:95",
            "net8": "3a:39:6e:80:a8:8f"
        },
        "leaf_1_0_7": {
            "net0": "2e:b5:4d:14:58:22",
            "net1": "d2:cb:8e:61:f5:97",
            "net2": "52:c4:65:77:f3:4c",
            "net3": "7a:bb:3d:2f:a5:82",
            "net4": "62:b7:2e:6a:7e:ff",
            "net5": "8e:c3:89:59:6e:87",
            "net6": "26:45:cd:c8:57:2f",
            "net7": "ea:9c:75:8b:bb:f9",
            "net8": "fa:af:30:6b:20:59"
        },
        "leaf_1_0_8": {
            "net0": "22:b7:ea:d4:85:c2",
            "net1": "1a:89:0c:9f:3b:e4",
            "net2": "4e:bc:12:13:72:5d",
            "net3": "3e:fa:d6:a7:19:c1",
            "net4": "fa:7d:b3:b3:28:5d",
            "net5": "5a:26:41:8b:83:b5",
            "net6": "4a:f7:a2:bf:f6:d1",
            "net7": "96:ec:71:99:39:75",
            "net8": "62:2b:c0:83:16:94"
        },
        "leaf_2_0_1": {
            "net0": "d2:ae:72:6c:91:70",
            "net1": "6e:bb:d2:f6:ab:9f",
            "net2": "0e:78:e9:d5:51:3f",
            "net3": "ce:d5:12:2f:75:53",
            "net4": "c6:62:d3:c9:76:0e",
            "net5": "c2:92:52:96:d7:be",
            "net6": "36:5a:1e:07:33:ac",
            "net7": "7e:ea:83:cc:ca:9c",
            "net8": "ee:be:09:d3:4e:24"
        },
        "leaf_2_0_2": {
            "net0": "ee:f9:03:b7:91:9e",
            "net1": "2a:0c:26:f2:2b:be",
            "net2": "32:28:95:ca:fa:2a",
            "net3": "a6:47:c6:d5:ec:5c",
            "net4": "62:e7:5a:e8:6c:73",
            "net5": "22:a5:7a:c3:aa:37",
            "net6": "46:83:00:aa:a1:61",
            "net7": "c2:44:dc:c3:d6:55",
            "net8": "2a:f4:5b:8d:a1:2e"
        },
        "leaf_2_0_3": {
            "net0": "ee:97:14:45:e4:e2",
            "net1": "ba:c0:63:23:c5:bc",
            "net2": "12:2e:66:1d:9d:c3",
            "net3": "a2:e3:f5:4b:6d:c3",
            "net4": "d2:40:5e:66:25:25",
            "net5": "9e:5e:92:4c:e3:97",
            "net6": "86:94:a7:6c:d3:08",
            "net7": "b2:39:52:f8:0c:2c",
            "net8": "42:80:22:ad:90:b8"
        },
        "leaf_2_0_4": {
            "net0": "be:de:82:d8:80:3c",
            "net1": "a6:78:53:a3:4d:10",
            "net2": "a6:a0:22:40:3b:21",
            "net3": "ca:4c:be:af:c7:8c",
            "net4": "1a:8b:ec:32:e6:67",
            "net5": "0e:13:a5:f3:43:3e",
            "net6": "aa:42:79:c6:8b:8b",
            "net7": "02:91:21:6f:22:7b",
            "net8": "62:92:b9:23:70:6e"
        },
        "leaf_2_0_5": {
            "net0": "d2:86:5a:93:4f:40",
            "net1": "de:10:9d:e0:ac:8e",
            "net2": "72:78:86:3a:41:90",
            "net3": "96:b3:60:e2:1b:bb",
            "net4": "22:87:fe:7c:64:ff",
            "net5": "c2:3e:99:1f:da:f3",
            "net6": "7e:c9:1b:af:d5:dd",
            "net7": "86:41:59:29:fa:61",
            "net8": "7a:dc:f7:76:6d:1f"
        },
        "leaf_2_0_6": {
            "net0": "ee:12:90:85:40:67",
            "net1": "b6:2a:de:6a:b0:84",
            "net2": "5a:75:4b:b8:ac:73",
            "net3": "9e:6b:b9:99:9b:8a",
            "net4": "6e:e8:3a:ed:a3:e8",
            "net5": "06:3f:9f:f1:ba:ad",
            "net6": "e6:be:5b:bb:b4:45",
            "net7": "ea:71:49:46:b9:99",
            "net8": "d2:30:60:24:d4:02"
        },
        "leaf_2_0_7": {
            "net0": "6e:67:d4:60:81:a8",
            "net1": "1a:e0:29:c7:c4:29",
            "net2": "aa:f8:4d:42:e7:fd",
            "net3": "e2:49:4b:1b:be:01",
            "net4": "ea:4c:4a:8a:0f:a3",
            "net5": "26:28:08:eb:55:05",
            "net6": "26:65:6b:0e:2b:63",
            "net7": "4a:1a:d9:4f:b4:62",
            "net8": "6a:3f:76:83:60:97"
        },
        "leaf_2_0_8": {
            "net0": "1e:75:41:40:bf:1c",
            "net1": "8a:32:cd:95:d0:c3",
            "net2": "9a:3c:ed:ea:78:78",
            "net3": "6e:24:53:b4:32:d5",
            "net4": "4a:c9:6a:4b:c5:7a",
            "net5": "3e:2f:12:ce:c7:1f",
            "net6": "ce:33:09:5c:8f:f4",
            "net7": "82:0a:4b:0c:27:8c",
            "net8": "52:de:98:89:07:5a"
        },
        "leaf_3_0_1": {
            "net0": "4a:b6:07:89:81:aa",
            "net1": "f6:e7:53:bf:6c:38",
            "net2": "be:3f:ad:24:62:e5",
            "net3": "16:3d:34:f1:ec:2b",
            "net4": "d6:f3:8b:74:04:62",
            "net5": "8e:41:a8:9d:ac:13",
            "net6": "1e:69:1a:75:39:41",
            "net7": "62:00:6a:fe:90:14",
            "net8": "3a:2a:12:21:28:5e"
        },
        "leaf_3_0_2": {
            "net0": "3e:bc:a8:87:c6:e1",
            "net1": "1a:d3:92:87:3f:ad",
            "net2": "8a:cb:0c:60:21:b6",
            "net3": "06:28:10:91:07:20",
            "net4": "82:19:2a:37:e6:0d",
            "net5": "7a:36:31:88:c9:12",
            "net6": "22:dd:bd:c4:07:3c",
            "net7": "2a:39:aa:81:ac:55",
            "net8": "5a:dc:6c:79:23:2e"
        },
        "leaf_3_0_3": {
            "net0": "8e:5f:74:aa:95:72",
            "net1": "fa:97:d1:d8:bc:c7",
            "net2": "3e:67:4a:d2:8c:05",
            "net3": "12:48:1f:4f:9f:31",
            "net4": "66:9a:70:a0:af:62",
            "net5": "be:d7:8e:d5:11:e0",
            "net6": "c2:f1:8d:07:9e:c3",
            "net7": "4a:01:ae:6b:1d:b8",
            "net8": "fe:f8:7d:57:65:7d"
        },
        "leaf_3_0_4": {
            "net0": "0e:2e:65:c1:60:ef",
            "net1": "a6:6d:d1:10:14:5d",
            "net2": "32:04:35:42:74:78",
            "net3": "c6:56:82:e7:bc:3f",
            "net4": "be:64:88:2c:a3:95",
            "net5": "f2:a9:f8:5a:e7:2f",
            "net6": "ce:f0:1e:d9:57:a1",
            "net7": "7a:d3:1b:2c:05:da",
            "net8": "16:0c:4b:1e:a0:da"
        },
        "leaf_3_0_5": {
            "net0": "16:27:4c:3a:aa:c2",
            "net1": "7a:df:cb:07:c8:9d",
            "net2": "a2:e1:e3:04:f5:4e",
            "net3": "ea:d0:ea:a5:9c:6b",
            "net4": "02:2d:7b:58:24:7f",
            "net5": "7e:e5:20:00:d9:a5",
            "net6": "ca:aa:fe:76:9b:8a",
            "net7": "da:eb:64:fd:11:0f",
            "net8": "da:e6:ec:99:45:8e"
        },
        "leaf_3_0_6": {
            "net0": "c6:f3:39:10:8c:65",
            "net1": "4a:33:18:48:cd:f2",
            "net2": "36:f5:fe:de:84:77",
            "net3": "52:84:41:a1:47:d2",
            "net4": "22:da:60:f9:48:6e",
            "net5": "7e:5c:35:5b:06:40",
            "net6": "96:be:56:79:1b:26",
            "net7": "4e:7f:49:de:a2:01",
            "net8": "4a:28:3c:95:40:42"
        },
        "leaf_3_0_7": {
            "net0": "7e:0a:ad:a1:f9:d8",
            "net1": "7e:8e:94:f8:f1:94",
            "net2": "82:46:38:36:92:e9",
            "net3": "8a:d2:f6:1e:83:f8",
            "net4": "1e:29:7d:de:37:a7",
            "net5": "aa:12:45:b1:dd:dc",
            "net6": "6a:16:18:ea:14:5e",
            "net7": "3e:fd:46:4b:b4:ad",
            "net8": "72:25:ce:ff:d5:20"
        },
        "leaf_3_0_8": {
            "net0": "e2:33:13:3e:33:65",
            "net1": "52:f2:81:9c:c2:19",
            "net2": "96:3a:a8:c5:d9:f8",
            "net3": "1a:fc:0e:1d:8d:8b",
            "net4": "2a:91:ff:ab:84:c1",
            "net5": "da:59:a1:d6:7a:4d",
            "net6": "72:56:13:9c:d1:c6",
            "net7": "ca:22:a2:b4:ec:79",
            "net8": "ca:c7:d6:80:d6:56"
        },
        "leaf_4_0_1": {
            "net0": "7e:f1:77:2d:d0:54",
            "net1": "4a:f9:76:d9:47:a3",
            "net2": "ca:c7:cd:80:99:58",
            "net3": "92:f9:97:ba:4e:11",
            "net4": "b6:61:9b:78:c1:48",
            "net5": "3a:2b:9f:94:68:74",
            "net6": "22:06:2a:24:62:5d",
            "net7": "76:3a:16:bb:71:2d",
            "net8": "06:fd:fe:7f:d7:2f"
        },
        "leaf_4_0_2": {
            "net0": "26:9a:3f:1e:57:ee",
            "net1": "ce:d8:3d:2a:b7:a3",
            "net2": "46:ec:ad:11:f3:66",
            "net3": "5a:42:c3:cc:a0:75",
            "net4": "5e:70:79:c6:c1:46",
            "net5": "7e:eb:41:d9:98:be",
            "net6": "1e:a5:e5:9e:99:a6",
            "net7": "f6:18:0a:3a:b4:41",
            "net8": "7e:f6:14:cd:2d:3a"
        },
        "leaf_4_0_3": {
            "net0": "56:34:5b:4e:2c:22",
            "net1": "f6:70:24:8a:f7:c4",
            "net2": "ae:b2:e4:f8:e3:96",
            "net3": "d6:67:76:01:d3:3a",
            "net4": "1e:7f:bd:7f:e1:41",
            "net5": "fa:43:f6:c2:cb:f5",
            "net6": "f2:9b:61:6b:8e:5c",
            "net7": "62:94:19:07:1f:d5",
            "net8": "4e:96:69:65:4f:65"
        },
        "leaf_4_0_4": {
            "net0": "62:b6:77:0d:7c:ad",
            "net1": "56:23:d6:39:5d:1e",
            "net2": "96:31:40:94:ef:ba",
            "net3": "e6:b7:f3:bc:e2:5e",
            "net4": "12:75:41:d8:94:ad",
            "net5": "b2:ab:7d:c4:7f:73",
            "net6": "be:46:18:70:b7:c0",
            "net7": "f6:8d:ca:06:4a:83",
            "net8": "22:7a:d4:2c:c2:32"
        },
        "leaf_4_0_5": {
            "net0": "3e:ec:30:4a:31:2e",
            "net1": "72:0a:01:6d:0d:48",
            "net2": "ba:ac:3a:3e:c2:11",
            "net3": "b2:aa:2b:1f:2e:a1",
            "net4": "82:9f:83:e5:4b:7f",
            "net5": "c6:c0:3e:92:26:68",
            "net6": "22:1a:14:78:0e:5e",
            "net7": "3e:bc:2c:00:2f:0e",
            "net8": "f2:21:c9:b9:72:a0"
        },
        "leaf_4_0_6": {
            "net0": "3e:df:67:ac:a5:14",
            "net1": "c6:51:b7:0c:59:05",
            "net2": "7e:d3:9c:fd:8d:84",
            "net3": "82:a5:53:f2:04:50",
            "net4": "fa:29:48:e8:9a:64",
            "net5": "2e:ca:a5:a0:45:65",
            "net6": "8a:70:13:dc:1c:a7",
            "net7": "96:44:36:e0:19:05",
            "net8": "ee:5d:47:21:5f:be"
        },
        "leaf_4_0_7": {
            "net0": "76:0a:9d:0d:ff:c4",
            "net1": "d2:c7:7f:da:df:d5",
            "net2": "0a:67:66:66:c7:a3",
            "net3": "f6:db:d6:51:f2:f9",
            "net4": "ca:1d:f2:b1:5a:2c",
            "net5": "b2:20:09:8c:9f:34",
            "net6": "36:a9:94:59:7b:17",
            "net7": "ea:8f:8c:0a:f4:4a",
            "net8": "5e:d7:72:0e:8b:d5"
        },
        "leaf_4_0_8": {
            "net0": "2a:e3:94:da:84:11",
            "net1": "52:d8:91:a5:ff:e6",
            "net2": "ce:ba:81:94:1e:78",
            "net3": "ea:82:21:f8:cb:38",
            "net4": "52:8a:45:59:eb:cf",
            "net5": "16:eb:c2:26:b7:e1",
            "net6": "62:64:b2:3d:6e:c6",
            "net7": "ba:45:ea:16:e3:0d",
            "net8": "5e:81:ba:a9:3e:4d"
        },
        "spine_1_1_1": {
            "net0": "56:f3:21:e8:ea:ac",
            "net1": "8a:95:1f:dd:72:77",
            "net10": "7e:2e:05:12:29:d1",
            "net11": "aa:b1:37:30:4a:83",
            "net12": "56:83:1d:12:b8:14",
            "net13": "9a:0f:43:3c:34:38",
            "net14": "16:ac:8c:08:51:31",
            "net15": "ca:46:c3:06:c1:a3",
            "net2": "ea:90:4d:6a:a6:7f",
            "net3": "a2:17:f9:50:47:64",
            "net4": "4a:55:62:78:43:5f",
            "net5": "f2:66:66:f9:93:b9",
            "net6": "06:4d:68:e8:f7:fc",
            "net7": "86:7d:e3:9b:7c:3b",
            "net8": "f2:4d:51:5d:78:e2",
            "net9": "52:10:fe:8c:f9:4a"
        },
        "spine_1_1_2": {
            "net0": "6e:fd:fd:6c:f2:fd",
            "net1": "c2:4c:5f:95:58:a4",
            "net10": "e6:74:ad:6f:08:38",
            "net11": "02:88:ce:b6:35:31",
            "net12": "8e:a1:0e:9b:dc:2c",
            "net13": "3a:bb:28:e8:60:ad",
            "net14": "5e:fb:85:da:fd:02",
            "net15": "6a:75:a8:ca:0e:64",
            "net2": "26:d9:70:9b:b7:43",
            "net3": "ba:88:c1:42:1f:dc",
            "net4": "0a:70:ec:d2:48:4a",
            "net5": "d6:a0:0f:a8:7a:0c",
            "net6": "5a:a1:59:1d:2e:79",
            "net7": "5e:96:4a:97:4f:0c",
            "net8": "0a:aa:b5:3a:8c:22",
            "net9": "be:f1:9e:20:f3:07"
        },
        "spine_1_1_3": {
            "net0": "c6:c6:15:3a:f5:46",
            "net1": "be:c3:08:ea:1c:8c",
            "net10": "9e:e2:53:ea:18:6b",
            "net11": "66:8a:48:26:ac:08",
            "net12": "96:66:82:ce:ed:e5",
            "net13": "76:3e:d3:6d:be:33",
            "net14": "ca:10:cd:41:9d:cb",
            "net15": "f2:4a:65:45:7b:28",
            "net2": "8a:d4:7e:24:a8:dd",
            "net3": "aa:46:bb:40:9c:b2",
            "net4": "c6:76:3a:64:41:48",
            "net5": "c2:10:e6:c2:43:ca",
            "net6": "c6:28:4c:54:93:2e",
            "net7": "96:76:b1:dc:55:c1",
            "net8": "86:a7:36:24:a3:4b",
            "net9": "62:50:3e:6a:17:b0"
        },
        "spine_1_1_4": {
            "net0": "5e:bd:db:fb:9f:d1",
            "net1": "56:31:ca:72:a5:f9",
            "net10": "56:45:0d:55:7f:e8",
            "net11": "3a:85:84:26:39:66",
            "net12": "ca:94:cc:4b:c0:a9",
            "net13": "4a:38:30:d3:b0:99",
            "net14": "02:7c:04:c7:f5:4a",
            "net15": "9a:af:8e:8e:b6:76",
            "net2": "a2:cd:11:73:a9:03",
            "net3": "f6:a6:e9:53:e3:5e",
            "net4": "ea:68:ad:93:02:81",
            "net5": "56:26:43:8e:8c:0b",
            "net6": "ee:f8:0d:b1:4c:b5",
            "net7": "52:1d:be:d8:1f:4f",
            "net8": "9e:d8:48:c6:cc:68",
            "net9": "76:84:4a:40:5f:80"
        },
        "spine_1_1_5": {
            "net0": "66:6e:92:78:e4:23",
            "net1": "be:2d:77:35:07:61",
            "net10": "ae:f4:ee:26:ab:01",
            "net11": "5a:27:33:26:88:ab",
            "net12": "ce:07:44:c6:da:c3",
            "net13": "fa:17:4a:cd:00:9a",
            "net14": "ee:f2:c7:e4:c3:d9",
            "net15": "5a:13:c3:d8:02:13",
            "net2": "b2:7e:36:a5:35:07",
            "net3": "46:b7:40:86:61:43",
            "net4": "16:03:6e:ca:27:a9",
            "net5": "06:c4:ed:12:7d:8d",
            "net6": "4e:2b:43:fb:2c:75",
            "net7": "aa:2d:62:b1:7d:b0",
            "net8": "d2:37:72:92:0c:e2",
            "net9": "72:f9:e9:ab:2e:a9"
        },
        "spine_1_1_6": {
            "net0": "4a:17:eb:4e:46:a3",
            "net1": "46:c3:e0:a5:9e:87",
            "net10": "6a:2c:e4:f4:15:8b",
            "net11": "42:78:40:f6:d4:5c",
            "net12": "4e:2a:c3:3e:e4:ee",
            "net13": "62:f6:78:29:bf:b4",
            "net14": "12:46:b0:e1:b8:12",
            "net15": "e2:99:ea:fa:48:c6",
            "net2": "06:7b:b5:c1:f1:a5",
            "net3": "d6:7e:d2:51:d4:b5",
            "net4": "da:bb:18:cb:70:c6",
            "net5": "fa:f0:ce:f2:16:c4",
            "net6": "1e:87:da:ad:54:2e",
            "net7": "2e:1c:a6:4f:50:05",
            "net8": "3a:bb:ee:7e:ac:48",
            "net9": "ca:b2:85:15:7e:98"
        },
        "spine_1_1_7": {
            "net0": "fa:94:df:f5:9b:89",
            "net1": "c2:5f:b0:fe:39:5a",
            "net10": "ee:a7:9c:1c:b1:9f",
            "net11": "06:bf:8a:8b:17:a8",
            "net12": "be:d0:cf:4f:48:61",
            "net13": "fe:9a:6d:09:05:99",
            "net14": "1a:81:da:f2:17:5f",
            "net15": "be:5c:0f:c8:7e:c2",
            "net2": "4a:a1:54:f0:08:8b",
            "net3": "56:60:56:cb:3c:d7",
            "net4": "0e:32:86:f3:97:81",
            "net5": "9a:70:88:61:2f:21",
            "net6": "0a:8b:23:cc:50:c6",
            "net7": "6e:c2:fe:c9:3a:89",
            "net8": "ba:4c:9e:ae:bd:fb",
            "net9": "f6:1d:8b:d0:74:c4"
        },
        "spine_1_1_8": {
            "net0": "32:2c:5e:06:19:ec",
            "net1": "2e:dc:78:2c:ed:ca",
            "net10": "ee:cb:32:cb:5e:e7",
            "net11": "9e:76:65:09:5a:79",
            "net12": "b6:36:b7:d3:88:8c",
            "net13": "e6:e8:8c:ba:75:f5",
            "net14": "1e:89:9e:9a:27:8b",
            "net15": "7e:a0:60:70:42:69",
            "net2": "42:db:1f:a5:b8:6a",
            "net3": "52:f4:23:c6:59:3a",
            "net4": "b2:ff:d7:22:89:3e",
            "net5": "16:1a:8d:d2:8c:01",
            "net6": "b6:09:e6:63:19:ff",
            "net7": "86:0f:d6:93:90:e5",
            "net8": "4a:d8:67:ed:91:e1",
            "net9": "be:25:eb:33:99:0f"
        },
        "spine_2_1_1": {
            "net0": "a2:e8:bc:60:3e:47",
            "net1": "4e:db:d4:84:06:32",
            "net10": "0e:0c:fe:91:33:1f",
            "net11": "4e:08:8f:f6:1c:37",
            "net12": "8a:cc:06:e4:e5:34",
            "net13": "46:c6:63:30:ad:b3",
            "net14": "7a:48:82:43:22:ea",
            "net15": "92:03:99:a8:34:3e",
            "net2": "76:cc:75:d0:be:9c",
            "net3": "d6:1a:9c:88:08:09",
            "net4": "0a:5e:ec:78:7b:8d",
            "net5": "1e:23:23:95:b8:d3",
            "net6": "8e:9c:53:5a:df:1c",
            "net7": "3a:8d:67:b4:cf:df",
            "net8": "96:eb:74:61:1a:2e",
            "net9": "0e:2c:f8:89:99:e4"
        },
        "spine_2_1_2": {
            "net0": "26:c7:40:41:53:9a",
            "net1": "b2:df:54:75:84:2c",
            "net10": "ee:bd:df:78:92:68",
            "net11": "7e:a1:ab:a5:4e:e4",
            "net12": "ae:7e:33:1d:bc:1a",
            "net13": "9e:12:30:a1:a0:56",
            "net14": "aa:45:8c:a5:d6:7a",
            "net15": "1a:3e:82:a8:da:e0",
            "net2": "0e:0f:07:3c:4a:aa",
            "net3": "5a:3c:a6:61:5b:50",
            "net4": "8a:13:ce:d3:c5:a1",
            "net5": "66:93:46:b7:95:21",
            "net6": "ce:36:51:a7:e4:d3",
            "net7": "be:dc:a2:1c:4f:ae",
            "net8": "56:1a:a1:fe:c1:a1",
            "net9": "32:71:00:f7:f1:17"
        },
        "spine_2_1_3": {
            "net0": "8e:ab:9e:85:f4:ee",
            "net1": "7a:71:c4:50:74:c6",
            "net10": "82:9a:3f:b0:57:8b",
            "net11": "a6:af:0d:43:a6:d2",
            "net12": "de:f6:94:96:05:f0",
            "net13": "ea:c2:98:03:35:a2",
            "net14": "c6:b4:8a:2f:b0:ad",
            "net15": "36:b1:aa:7e:2d:7f",
            "net2": "3a:a3:be:18:f6:3d",
            "net3": "46:7a:2c:12:97:c0",
            "net4": "c2:30:2b:11:46:fc",
            "net5": "5e:d6:0e:67:85:1f",
            "net6": "06:5a:a2:58:c7:a0",
            "net7": "f6:e9:e3:b3:6a:f4",
            "net8": "52:6a:12:f9:9f:2b",
            "net9": "8e:80:57:5e:df:44"
        },
        "spine_2_1_4": {
            "net0": "b6:c7:32:ac:c2:ac",
            "net1": "f6:97:44:cf:bb:7f",
            "net10": "1e:77:20:9c:09:61",
            "net11": "8e:f7:c1:9f:43:75",
            "net12": "4a:cd:ab:71:a7:7c",
            "net13": "0e:b1:20:c3:84:9f",
            "net14": "5a:a0:8c:44:b7:4d",
            "net15": "f6:60:cb:53:94:fa",
            "net2": "02:1f:08:97:7f:63",
            "net3": "ce:6f:a8:44:58:9e",
            "net4": "72:18:e5:4f:38:85",
            "net5": "3e:b5:da:4d:78:44",
            "net6": "6e:f7:d7:1c:bf:e3",
            "net7": "7a:b1:cb:b9:27:bd",
            "net8": "ce:e6:3c:13:13:92",
            "net9": "a6:d1:49:d9:97:80"
        },
        "spine_2_1_5": {
            "net0": "36:49:55:fd:33:f5",
            "net1": "aa:26:a2:07:65:02",
            "net10": "ca:fa:6a:03:cd:8d",
            "net11": "72:c4:ab:0f:c2:a3",
            "net12": "a2:e6:89:f5:44:30",
            "net13": "1a:94:6b:c0:39:62",
            "net14": "4a:ea:84:4a:25:e6",
            "net15": "f2:25:01:35:e4:a2",
            "net2": "aa:73:bd:00:c5:dd",
            "net3": "de:19:88:eb:25:16",
            "net4": "3a:6e:21:af:68:3d",
            "net5": "22:cf:18:f4:52:6b",
            "net6": "52:09:e7:c7:64:ce",
            "net7": "56:88:09:2a:51:7f",
            "net8": "02:f1:9c:dc:e4:c7",
            "net9": "72:e4:a6:30:c5:b7"
        },
        "spine_2_1_6": {
            "net0": "5e:7d:06:b3:a7:9a",
            "net1": "0a:51:be:f2:62:5c",
            "net10": "66:90:c8:4b:b6:90",
            "net11": "7a:19:a3:b3:80:ac",
            "net12": "ca:a3:f7:ee:00:e7",
            "net13": "1e:a7:16:93:82:1d",
            "net14": "66:9d:70:d2:c5:c7",
            "net15": "22:84:91:9f:14:b2",
            "net2": "16:44:b2:a8:f2:1a",
            "net3": "4e:de:f2:4e:7b:72",
            "net4": "8a:0d:ea:ee:50:eb",
            "net5": "6a:39:f9:8e:e3:d3",
            "net6": "b6:3b:01:7a:3a:bd",
            "net7": "da:d6:8e:01:8e:0a",
            "net8": "42:2a:eb:3e:20:5b",
            "net9": "6e:ed:f3:fa:ae:a0"
        },
        "spine_2_1_7": {
            "net0": "7e:e8:72:b9:cf:e3",
            "net1": "52:5a:93:dc:11:3b",
            "net10": "96:08:c7:a7:2b:91",
            "net11": "9a:cd:1c:8f:40:bb",
            "net12": "3e:12:42:a5:b3:fe",
            "net13": "ce:aa:9d:4b:14:e4",
            "net14": "76:1f:35:d8:28:d6",
            "net15": "3a:9e:82:b9:aa:85",
            "net2": "02:54:f0:01:94:55",
            "net3": "de:72:eb:db:ad:8c",
            "net4": "0e:c7:ca:75:b9:c9",
            "net5": "82:1a:f6:4e:0d:42",
            "net6": "2e:8d:27:a5:f5:0a",
            "net7": "5e:8a:ae:cc:f8:9d",
            "net8": "7a:a1:4b:cb:3a:77",
            "net9": "d2:4c:aa:bb:41:9b"
        },
        "spine_2_1_8": {
            "net0": "2a:c6:d1:56:52:41",
            "net1": "c6:25:41:54:fd:62",
            "net10": "42:bc:73:f0:da:68",
            "net11": "f2:70:62:3c:81:f6",
            "net12": "96:aa:eb:0e:7d:6b",
            "net13": "96:fc:46:d7:eb:f0",
            "net14": "da:33:8d:fe:e7:d3",
            "net15": "36:8e:df:75:fa:b8",
            "net2": "f2:d4:40:4c:e4:80",
            "net3": "06:cc:c3:09:82:0c",
            "net4": "26:50:2c:f6:4a:e5",
            "net5": "ca:0b:5b:c3:d1:52",
            "net6": "a2:62:8d:b3:fa:f1",
            "net7": "0a:b3:80:00:eb:4b",
            "net8": "ce:eb:d9:df:c3:5d",
            "net9": "66:5f:16:a3:1c:09"
        },
        "spine_3_1_1": {
            "net0": "8a:0f:b4:bc:c1:1a",
            "net1": "7a:86:f0:97:5a:b9",
            "net10": "96:96:86:6e:37:db",
            "net11": "36:a5:56:8d:44:db",
            "net12": "06:7d:69:7c:66:62",
            "net13": "06:54:85:fb:8e:69",
            "net14": "f6:c0:41:39:18:93",
            "net15": "b6:ea:d8:f4:7c:63",
            "net2": "e6:55:6b:05:5b:bb",
            "net3": "92:c6:e8:dd:e6:49",
            "net4": "22:c6:85:90:00:92",
            "net5": "2a:6c:c0:22:16:25",
            "net6": "82:cc:3a:bf:45:27",
            "net7": "8a:36:36:dd:2e:75",
            "net8": "92:12:09:26:79:c0",
            "net9": "86:52:ce:40:75:63"
        },
        "spine_3_1_2": {
            "net0": "c2:b2:28:8c:85:e1",
            "net1": "c2:a0:45:fa:bb:e9",
            "net10": "de:f5:c7:e8:01:e6",
            "net11": "5a:fe:88:88:1f:16",
            "net12": "92:04:ae:62:e5:50",
            "net13": "aa:98:2b:a5:ad:62",
            "net14": "d6:de:72:07:8b:be",
            "net15": "2e:47:cf:53:7a:7a",
            "net2": "7a:fb:39:fa:7a:c7",
            "net3": "32:43:aa:cf:06:4a",
            "net4": "06:2f:f3:1f:b4:d3",
            "net5": "c6:a8:58:00:b3:8a",
            "net6": "d2:0d:fa:7e:1d:66",
            "net7": "52:b6:17:9c:56:51",
            "net8": "76:a2:f4:6d:18:21",
            "net9": "ce:1f:ec:93:bd:6c"
        },
        "spine_3_1_3": {
            "net0": "3e:fe:be:65:51:5f",
            "net1": "32:d8:19:24:02:c0",
            "net10": "1a:76:4d:07:62:9d",
            "net11": "62:7d:e9:f4:e3:50",
            "net12": "3e:ac:50:77:4e:9f",
            "net13": "ee:9c:53:4e:62:2c",
            "net14": "9a:3b:18:07:29:85",
            "net15": "ca:8b:e6:a2:af:09",
            "net2": "22:fe:ba:19:d7:67",
            "net3": "fa:18:b3:f8:4d:be",
            "net4": "06:be:5f:7b:d1:0b",
            "net5": "ba:37:52:45:23:ca",
            "net6": "d2:7b:98:f2:52:0f",
            "net7": "2e:a7:e8:22:13:34",
            "net8": "9a:e3:2b:06:6a:df",
            "net9": "52:35:46:56:84:95"
        },
        "spine_3_1_4": {
            "net0": "ca:b2:9c:64:bc:60",
            "net1": "32:8a:9e:a3:58:8e",
            "net10": "ba:dd:62:bf:bc:66",
            "net11": "8e:e1:e2:48:d9:94",
            "net12": "36:06:20:fa:aa:72",
            "net13": "ae:54:fd:1b:93:af",
            "net14": "36:1c:b4:40:27:f8",
            "net15": "46:39:3f:cd:d3:fb",
            "net2": "76:3d:79:a8:f3:e8",
            "net3": "96:8f:6c:61:56:18",
            "net4": "be:0c:9b:3b:79:f6",
            "net5": "ce:a3:a1:7d:41:2e",
            "net6": "aa:e3:4a:a8:e1:5f",
            "net7": "16:a5:47:83:a0:65",
            "net8": "76:55:81:75:04:c1",
            "net9": "52:6a:07:0b:8b:16"
        },
        "spine_3_1_5": {
            "net0": "66:26:ce:00:45:bc",
            "net1": "22:15:da:fd:20:ba",
            "net10": "aa:36:a9:bc:11:13",
            "net11": "fa:2c:57:3b:c6:5a",
            "net12": "e2:f9:e9:5f:98:c5",
            "net13": "8e:12:51:a4:a1:68",
            "net14": "82:23:40:fa:b2:32",
            "net15": "b2:23:95:90:02:99",
            "net2": "32:4d:bd:dc:11:2b",
            "net3": "fa:0c:c6:05:88:52",
            "net4": "06:0b:43:bf:80:44",
            "net5": "96:38:e0:cd:9c:82",
            "net6": "fe:23:67:ec:34:ac",
            "net7": "06:12:6e:ae:68:4e",
            "net8": "d2:53:6a:bc:dd:e4",
            "net9": "fa:c2:0d:ce:60:3b"
        },
        "spine_3_1_6": {
            "net0": "5a:ca:66:f5:d0:f1",
            "net1": "92:e8:24:9f:54:ff",
            "net10": "9e:7e:85:a8:82:5f",
            "net11": "f6:ba:17:26:5e:82",
            "net12": "9a:22:f0:31:fd:38",
            "net13": "e6:29:54:38:d6:d0",
            "net14": "de:9d:fd:61:28:c3",
            "net15": "66:cc:c7:ae:df:f9",
            "net2": "96:72:b9:c6:db:eb",
            "net3": "a6:25:e2:e1:b1:7d",
            "net4": "6e:77:e7:b7:08:5c",
            "net5": "86:7b:63:8a:f6:3f",
            "net6": "ca:d3:ed:2f:8e:2c",
            "net7": "46:74:3f:06:eb:6f",
            "net8": "52:ed:3e:7f:da:f0",
            "net9": "3a:81:a5:f0:7d:de"
        },
        "spine_3_1_7": {
            "net0": "f6:dc:15:5c:da:73",
            "net1": "2e:40:50:fc:2d:84",
            "net10": "b2:23:89:d3:5a:33",
            "net11": "36:f8:72:dd:e0:32",
            "net12": "9a:16:69:12:34:f4",
            "net13": "1a:f5:dd:35:03:99",
            "net14": "0e:54:15:c5:92:a1",
            "net15": "f6:87:0c:76:d4:52",
            "net2": "a6:44:c3:fe:56:b7",
            "net3": "6a:33:23:ea:1b:0b",
            "net4": "92:ce:e9:6e:72:0c",
            "net5": "ee:53:c8:a7:19:53",
            "net6": "56:c9:28:7a:95:00",
            "net7": "f2:cd:94:36:50:54",
            "net8": "f6:16:e1:a3:df:a3",
            "net9": "7a:8c:5b:d1:23:01"
        },
        "spine_3_1_8": {
            "net0": "ae:54:5e:04:bd:d9",
            "net1": "46:93:d7:ac:f1:b5",
            "net10": "9e:db:ce:9b:a9:51",
            "net11": "02:c8:1f:ca:56:96",
            "net12": "c6:4c:5b:9c:0d:38",
            "net13": "1a:6d:b4:e6:18:c2",
            "net14": "62:13:35:b2:16:70",
            "net15": "3a:4b:dc:5d:29:20",
            "net2": "b2:c3:23:97:e0:7a",
            "net3": "e2:05:72:e7:10:59",
            "net4": "76:b6:70:2e:04:0d",
            "net5": "42:fd:57:27:f0:14",
            "net6": "1e:29:7b:1e:63:48",
            "net7": "ba:a0:66:eb:c8:14",
            "net8": "ca:22:1f:7b:3c:68",
            "net9": "32:15:37:0b:2d:c4"
        },
        "spine_4_1_1": {
            "net0": "52:30:c4:80:1f:2c",
            "net1": "82:2c:2a:b2:d4:5e",
            "net10": "9e:69:94:88:b4:a8",
            "net11": "92:8e:bb:99:e8:b2",
            "net12": "86:ef:8b:fc:d1:df",
            "net13": "9a:8b:0e:8c:e7:c6",
            "net14": "8a:da:f0:69:a1:ed",
            "net15": "b2:06:8d:da:a1:30",
            "net2": "62:70:01:9c:e5:d9",
            "net3": "26:cc:98:0a:fe:70",
            "net4": "3e:0e:14:d4:67:cf",
            "net5": "fa:99:84:ed:3a:4e",
            "net6": "56:77:da:45:b4:8d",
            "net7": "5a:0e:aa:5b:f9:21",
            "net8": "8e:b8:c6:a6:71:ea",
            "net9": "62:34:1d:5f:03:fd"
        },
        "spine_4_1_2": {
            "net0": "5a:7f:8b:96:b4:ab",
            "net1": "ce:eb:0c:14:09:26",
            "net10": "4a:29:51:e8:a1:f7",
            "net11": "36:0f:3f:a8:8c:fd",
            "net12": "b2:a3:7a:51:f0:e3",
            "net13": "3e:f2:07:ef:43:ee",
            "net14": "3a:66:24:1c:ad:5a",
            "net15": "de:00:43:ce:1a:b5",
            "net2": "da:dc:7b:55:0f:6d",
            "net3": "8e:6f:07:9b:c4:e5",
            "net4": "5e:a8:2e:f4:59:6f",
            "net5": "8a:0b:45:40:07:a8",
            "net6": "b6:46:eb:15:a8:ec",
            "net7": "52:c9:57:7a:eb:9c",
            "net8": "c6:32:33:a4:02:bf",
            "net9": "1a:e2:e0:e7:5a:65"
        },
        "spine_4_1_3": {
            "net0": "0a:98:d9:c5:4f:a8",
            "net1": "62:02:5b:9b:0b:9a",
            "net10": "ca:b1:9d:43:32:da",
            "net11": "9a:90:b9:a7:ed:08",
            "net12": "ba:a0:a6:f3:de:59",
            "net13": "9a:38:47:f7:af:6a",
            "net14": "72:9c:21:61:98:2f",
            "net15": "3e:9c:c6:e0:b8:03",
            "net2": "9a:7e:b8:76:05:33",
            "net3": "2a:9c:49:5b:96:b3",
            "net4": "de:2f:6e:77:21:e1",
            "net5": "ea:9f:76:93:e7:e6",
            "net6": "36:1b:5c:2c:54:f3",
            "net7": "d2:7d:a1:b3:6c:b2",
            "net8": "82:b9:bb:39:e9:65",
            "net9": "5e:63:63:1a:8e:82"
        },
        "spine_4_1_4": {
            "net0": "02:2d:82:1f:bc:b5",
            "net1": "e2:cc:03:65:6f:9e",
            "net10": "06:4e:97:87:26:b0",
            "net11": "6a:b3:a5:01:ec:96",
            "net12": "aa:42:fe:ed:d7:db",
            "net13": "96:9b:17:73:5e:88",
            "net14": "46:97:80:ba:8a:1e",
            "net15": "c6:9a:9d:e8:f8:35",
            "net2": "66:3e:67:6a:f0:fc",
            "net3": "ca:e4:28:3b:be:7b",
            "net4": "16:47:4f:cf:2d:f5",
            "net5": "1e:36:91:18:f4:19",
            "net6": "e6:69:26:eb:a5:f1",
            "net7": "ce:2d:b2:04:ad:50",
            "net8": "26:c0:1b:3f:19:4b",
            "net9": "82:be:7f:2b:4a:cb"
        },
        "spine_4_1_5": {
            "net0": "0a:2e:ed:29:ae:ab",
            "net1": "a6:4d:f0:3a:d8:91",
            "net10": "0a:e6:3e:a7:35:d0",
            "net11": "42:0f:96:6c:01:ce",
            "net12": "6a:be:2f:0f:60:3d",
            "net13": "46:6c:21:48:04:fb",
            "net14": "a2:94:a0:0c:10:8a",
            "net15": "d2:46:50:6d:29:21",
            "net2": "aa:88:a2:88:88:64",
            "net3": "66:ef:03:ba:9b:31",
            "net4": "46:b4:1a:b7:57:90",
            "net5": "c6:5b:d1:56:cb:3a",
            "net6": "c6:89:48:75:ba:71",
            "net7": "16:f0:74:04:53:bc",
            "net8": "8e:fc:e7:fe:2a:84",
            "net9": "fa:f5:14:d8:5b:0f"
        },
        "spine_4_1_6": {
            "net0": "6e:4c:60:b6:05:34",
            "net1": "8e:a4:d6:22:f2:63",
            "net10": "e2:73:f1:92:a2:82",
            "net11": "ba:60:19:8d:98:d7",
            "net12": "82:39:9a:f9:c4:7a",
            "net13": "7e:ea:cc:4e:44:05",
            "net14": "c6:cd:1d:35:ba:d2",
            "net15": "5e:aa:cf:aa:01:22",
            "net2": "9e:2e:c0:2f:29:14",
            "net3": "02:13:ad:da:7c:0f",
            "net4": "fa:e8:92:d2:e4:b1",
            "net5": "12:29:70:9c:4a:e1",
            "net6": "22:59:d0:14:39:f5",
            "net7": "8a:ed:0f:51:ee:15",
            "net8": "ca:04:d8:f5:09:1b",
            "net9": "42:ff:ca:39:54:4f"
        },
        "spine_4_1_7": {
            "net0": "d6:82:91:4a:7f:56",
            "net1": "8e:c7:84:f3:61:fc",
            "net10": "f6:58:6d:e8:a3:95",
            "net11": "9a:bc:ad:6c:5e:55",
            "net12": "da:f0:b6:b2:23:41",
            "net13": "26:13:81:da:e0:d3",
            "net14": "4a:ba:0e:b2:36:fe",
            "net15": "c6:1f:29:1b:10:82",
            "net2": "d6:92:2a:cb:c0:4d",
            "net3": "aa:bc:09:ba:61:03",
            "net4": "1e:06:e7:3f:42:c2",
            "net5": "72:ae:2e:8a:f9:ae",
            "net6": "36:c0:4b:f1:2b:a4",
            "net7": "92:e4:cc:9d:37:8d",
            "net8": "ba:5b:98:2d:77:6f",
            "net9": "9a:32:ea:07:1f:bb"
        },
        "spine_4_1_8": {
            "net0": "8e:13:88:5f:8f:dc",
            "net1": "da:f7:61:48:86:1c",
            "net10": "76:5e:7a:88:6c:ab",
            "net11": "c2:5d:0f:6b:d3:fb",
            "net12": "46:6a:96:c2:e6:1e",
            "net13": "56:16:85:72:96:49",
            "net14": "52:79:c7:16:cb:45",
            "net15": "1a:f9:dc:f6:eb:1c",
            "net2": "ae:2c:02:2b:71:f0",
            "net3": "5a:4a:0f:0c:be:88",
            "net4": "56:b9:7d:3c:e3:ff",
            "net5": "ce:0a:db:fb:bd:ad",
            "net6": "66:a8:fc:74:02:de",
            "net7": "6a:2c:fc:68:32:fa",
            "net8": "e2:de:0b:c3:34:ca",
            "net9": "46:ee:7b:9d:4c:3c"
        },
        "tof_1_2_1": {
            "net0": "12:37:c9:73:61:c4",
            "net1": "86:10:14:c7:85:06",
            "net10": "12:46:cd:45:7e:e4",
            "net11": "a6:20:91:6b:91:d0",
            "net12": "ba:6e:c3:ae:cf:b6",
            "net13": "d2:c6:de:91:eb:88",
            "net14": "e6:18:9a:74:4a:8d",
            "net15": "ee:0d:d1:77:01:2c",
            "net2": "12:5c:be:7a:07:88",
            "net3": "de:d5:30:9f:ef:59",
            "net4": "b6:d3:20:b3:e7:60",
            "net5": "ce:58:d3:c9:01:52",
            "net6": "aa:b4:27:14:a6:fb",
            "net7": "ca:15:b2:cb:7f:10",
            "net8": "4e:7c:37:4d:e3:80",
            "net9": "36:c5:68:67:0a:f2"
        },
        "tof_1_2_2": {
            "net0": "22:2d:a8:a1:67:d5",
            "net1": "22:ee:9b:cf:ff:73",
            "net10": "6a:54:14:12:89:f3",
            "net11": "8e:08:fe:b7:3e:cb",
            "net12": "f6:a7:88:b2:84:e3",
            "net13": "2a:be:f6:a8:32:55",
            "net14": "36:a9:d4:f4:3b:09",
            "net15": "ba:23:95:ec:e7:86",
            "net2": "4a:4f:fc:d3:e1:9f",
            "net3": "6e:c6:a2:77:a5:c3",
            "net4": "9e:da:6f:32:5f:a5",
            "net5": "ae:d2:9d:8d:ca:e0",
            "net6": "92:ea:75:51:02:b1",
            "net7": "9a:4d:99:d3:38:1f",
            "net8": "06:8b:88:0f:d2:f7",
            "net9": "ba:00:8a:5b:7b:f5"
        },
        "tof_1_2_3": {
            "net0": "9e:ab:06:2c:d7:dc",
            "net1": "36:21:80:55:8e:3f",
            "net10": "ae:bd:16:c6:dc:8e",
            "net11": "ce:02:d7:af:4e:a3",
            "net12": "82:dc:8c:6a:be:d1",
            "net13": "82:38:a7:07:f1:b6",
            "net14": "2a:a7:b4:27:38:de",
            "net15": "e2:3f:78:1b:f8:f1",
            "net2": "2a:1d:dd:17:ae:ed",
            "net3": "aa:9c:1a:7b:2d:f3",
            "net4": "f2:90:0d:54:10:3d",
            "net5": "ba:f2:af:88:32:64",
            "net6": "fe:1e:6e:c6:29:4b",
            "net7": "0e:0a:f6:0a:40:51",
            "net8": "b6:79:be:d9:a5:d7",
            "net9": "06:a1:4d:d9:37:06"
        },
        "tof_1_2_4": {
            "net0": "d6:99:a4:df:e5:38",
            "net1": "5e:be:19:d6:53:11",
            "net10": "ca:af:16:79:68:2e",
            "net11": "3e:f3:d5:5b:91:9e",
            "net12": "fa:35:0c:ef:a6:c6",
            "net13": "5e:6d:b3:66:a9:a0",
            "net14": "5e:45:0d:87:9e:fb",
            "net15": "6a:69:c1:83:fd:63",
            "net2": "ae:44:18:1a:1a:f5",
            "net3": "ba:10:db:b3:cb:21",
            "net4": "e6:5f:02:88:8d:5d",
            "net5": "32:4b:77:a1:d9:2a",
            "net6": "aa:8a:f3:a1:c6:3e",
            "net7": "2a:3c:f0:30:76:dc",
            "net8": "4e:9c:5a:5d:d4:a7",
            "net9": "ca:a4:ce:a3:9f:11"
        },
        "tof_1_2_5": {
            "net0": "0e:e3:aa:ae:fd:f6",
            "net1": "26:87:e8:56:1a:17",
            "net10": "5e:13:4e:8b:71:ea",
            "net11": "92:40:2e:17:2f:31",
            "net12": "da:8c:d1:4a:f3:1f",
            "net13": "be:0e:2b:3e:2c:9e",
            "net14": "76:41:3c:58:75:87",
            "net15": "22:47:1c:7b:91:a0",
            "net2": "42:85:5a:89:4f:1d",
            "net3": "b2:12:25:3b:85:ec",
            "net4": "22:75:6c:53:44:21",
            "net5": "82:75:41:a7:bb:5f",
            "net6": "36:ca:d0:00:f4:b8",
            "net7": "a2:5c:e8:ce:46:99",
            "net8": "6e:62:0d:dc:13:58",
            "net9": "92:ed:73:2c:e1:bb"
        },
        "tof_1_2_6": {
            "net0": "06:88:3f:59:b9:9a",
            "net1": "6e:04:92:1c:b1:e0",
            "net10": "86:e5:8f:8a:88:a0",
            "net11": "06:4d:70:7c:79:9e",
            "net12": "46:62:94:c6:b6:6a",
            "net13": "2a:23:32:8a:d2:fb",
            "net14": "ea:24:dd:d4:7c:c9",
            "net15": "ce:25:16:eb:2a:cf",
            "net2": "b2:f0:b9:4e:99:96",
            "net3": "72:d0:fb:a2:47:f9",
            "net4": "a6:7c:7c:f1:74:c7",
            "net5": "1a:bf:24:93:4a:1b",
            "net6": "e6:96:70:0f:58:b3",
            "net7": "8e:7e:b0:3c:45:61",
            "net8": "f6:ba:da:28:ad:d5",
            "net9": "e6:c2:f1:51:ae:24"
        },
        "tof_1_2_7": {
            "net0": "0e:ee:7b:33:e6:56",
            "net1": "2a:8e:59:69:03:13",
            "net10": "06:b7:09:84:4c:d5",
            "net11": "e6:4c:22:53:e2:c0",
            "net12": "2a:fc:b7:07:09:a0",
            "net13": "ae:6b:1c:93:29:fc",
            "net14": "be:6c:55:49:33:55",
            "net15": "2e:85:e0:97:57:d5",
            "net2": "96:09:f6:f8:a4:56",
            "net3": "de:6e:7e:29:24:38",
            "net4": "ae:49:ab:93:46:35",
            "net5": "52:17:07:0a:03:d5",
            "net6": "92:c4:e3:9b:9b:f3",
            "net7": "16:14:2f:e0:fd:23",
            "net8": "9a:a1:12:53:28:cb",
            "net9": "96:92:62:49:97:86"
        },
        "tof_1_2_8": {
            "net0": "ee:f2:98:e2:54:4f",
            "net1": "16:66:dd:22:93:c7",
            "net10": "d6:e0:f9:a4:75:3b",
            "net11": "c2:58:df:93:6d:13",
            "net12": "32:dd:75:c7:34:a0",
            "net13": "2a:ed:16:9c:18:3b",
            "net14": "a2:e8:e9:e1:8e:7b",
            "net15": "66:a7:bb:98:a0:5b",
            "net2": "7e:b7:22:56:33:1b",
            "net3": "ee:df:07:42:bf:8a",
            "net4": "42:89:35:30:de:81",
            "net5": "52:e9:93:bd:1d:77",
            "net6": "72:08:0b:ce:08:6c",
            "net7": "f2:1d:ec:d5:5b:93",
            "net8": "2e:28:22:66:60:9c",
            "net9": "1e:79:eb:44:b3:59"
        },
        "tof_2_2_1": {
            "net0": "4e:cc:6e:42:86:91",
            "net1": "9e:fd:0e:4a:c6:b4",
            "net10": "c2:09:86:01:eb:38",
            "net11": "42:01:1a:ba:f2:6e",
            "net12": "fa:10:0e:f6:93:26",
            "net13": "ea:76:d9:c7:57:e6",
            "net14": "a2:84:dd:ab:0f:a7",
            "net15": "9e:6b:6b:2c:f1:88",
            "net2": "a6:a4:48:19:b9:ba",
            "net3": "a2:46:68:56:40:3d",
            "net4": "52:90:8f:fb:99:e2",
            "net5": "0a:c2:aa:9b:c4:7e",
            "net6": "2a:e0:ea:e2:ee:92",
            "net7": "9e:e0:9d:14:d2:f3",
            "net8": "c6:d3:55:10:1b:2b",
            "net9": "8e:c3:1e:0b:6a:5d"
        },
        "tof_2_2_2": {
            "net0": "ca:c7:c2:c6:7c:12",
            "net1": "22:b9:11:5c:26:98",
            "net10": "ea:79:43:a7:1d:36",
            "net11": "d2:7b:de:b2:fe:62",
            "net12": "fa:1a:16:f0:3a:20",
            "net13": "4e:00:19:59:fa:d0",
            "net14": "4e:51:9f:12:d9:3e",
            "net15": "06:a3:ef:8a:5e:42",
            "net2": "fe:38:02:7c:84:c7",
            "net3": "c6:f7:5e:45:3b:7a",
            "net4": "2a:7b:8b:d5:6c:9b",
            "net5": "76:43:d2:e6:1c:ce",
            "net6": "42:cc:b9:ed:ae:fd",
            "net7": "e2:0a:a7:e0:a0:1c",
            "net8": "be:c3:72:26:43:f7",
            "net9": "76:26:0a:93:32:f5"
        },
        "tof_2_2_3": {
            "net0": "6a:df:f6:64:12:85",
            "net1": "d6:40:67:32:98:f9",
            "net10": "5e:46:3e:73:71:3d",
            "net11": "12:fa:2c:32:df:4f",
            "net12": "b2:25:36:85:8c:72",
            "net13": "a2:fd:7b:a0:ee:ea",
            "net14": "36:3c:23:7e:43:ea",
            "net15": "e6:c8:7b:0e:a5:10",
            "net2": "02:c2:2e:fb:ac:ec",
            "net3": "d6:c7:42:61:ff:5b",
            "net4": "96:5b:06:c5:cd:9b",
            "net5": "0a:00:ee:40:a0:6b",
            "net6": "ca:3e:ad:d4:d4:5a",
            "net7": "ee:20:92:3a:4a:bd",
            "net8": "0e:1d:26:0c:05:53",
            "net9": "9a:bc:01:70:31:94"
        },
        "tof_2_2_4": {
            "net0": "0e:8b:34:00:7c:d7",
            "net1": "4e:ff:1a:12:60:57",
            "net10": "6a:eb:14:ba:e0:23",
            "net11": "0e:ef:d7:bd:d8:66",
            "net12": "52:a9:7a:33:ba:b6",
            "net13": "92:8d:5b:e7:be:40",
            "net14": "3a:f8:01:94:8e:6c",
            "net15": "c2:d1:b6:f1:57:e2",
            "net2": "36:4d:af:eb:df:68",
            "net3": "82:64:14:9c:04:4d",
            "net4": "2e:d4:85:12:be:c9",
            "net5": "96:3b:50:d2:9e:a2",
            "net6": "2e:ee:16:88:ed:de",
            "net7": "4e:15:5a:ff:73:94",
            "net8": "3e:14:b5:59:1b:fa",
            "net9": "da:55:f7:a4:1b:6d"
        },
        "tof_2_2_5": {
            "net0": "26:f8:60:33:d8:eb",
            "net1": "de:7b:49:f0:3f:09",
            "net10": "ae:8f:12:ad:20:b7",
            "net11": "8e:d9:93:80:b0:06",
            "net12": "92:fd:99:20:76:18",
            "net13": "2a:cf:26:07:1a:80",
            "net14": "3a:62:d0:51:86:60",
            "net15": "82:a4:fd:74:3f:a3",
            "net2": "76:62:f8:d3:28:f7",
            "net3": "b6:df:a7:fd:97:72",
            "net4": "9e:6c:43:ca:80:66",
            "net5": "16:15:2c:a2:15:ba",
            "net6": "92:c5:ee:a1:12:85",
            "net7": "4e:30:50:c9:82:01",
            "net8": "1e:e5:39:11:3f:eb",
            "net9": "8e:06:a6:99:55:e0"
        },
        "tof_2_2_6": {
            "net0": "42:d6:f1:ed:e2:36",
            "net1": "26:13:49:34:0c:fb",
            "net10": "aa:17:6d:d8:9d:1d",
            "net11": "0e:6a:4c:56:88:f4",
            "net12": "da:16:8a:a0:09:92",
            "net13": "ca:4a:9f:94:51:c3",
            "net14": "16:fc:3a:5c:30:b7",
            "net15": "7a:32:8f:a8:f3:81",
            "net2": "26:65:ee:d7:35:b6",
            "net3": "ae:90:ca:7e:3b:c8",
            "net4": "12:37:87:64:91:15",
            "net5": "f6:19:83:1a:42:79",
            "net6": "42:26:62:84:5e:a6",
            "net7": "a2:29:6e:a9:43:27",
            "net8": "1e:0a:96:93:2d:7e",
            "net9": "1e:7c:61:a0:47:41"
        },
        "tof_2_2_7": {
            "net0": "9e:38:b0:24:94:8e",
            "net1": "06:b1:24:b4:10:7f",
            "net10": "0e:ec:0a:e1:9c:54",
            "net11": "fe:76:66:af:70:59",
            "net12": "46:0f:e1:14:68:1d",
            "net13": "86:15:70:d9:5b:ad",
            "net14": "ea:e6:48:a9:b6:e2",
            "net15": "f2:3a:0f:c4:7f:14",
            "net2": "ae:7b:aa:1a:8b:99",
            "net3": "46:7c:7a:72:ed:15",
            "net4": "4a:49:0e:d2:ce:46",
            "net5": "8a:51:4d:69:ed:09",
            "net6": "4a:29:62:bc:2b:0b",
            "net7": "46:d2:3b:b0:cb:ba",
            "net8": "d2:18:ae:c5:32:95",
            "net9": "02:f7:b8:34:de:be"
        },
        "tof_2_2_8": {
            "net0": "9a:e8:77:bc:4c:88",
            "net1": "46:72:f4:b8:d7:0d",
            "net10": "c6:73:5e:71:44:5d",
            "net11": "4e:27:dc:53:b5:4d",
            "net12": "9e:c5:d7:4d:3f:2d",
            "net13": "ce:54:2b:f0:c4:fc",
            "net14": "fe:51:63:dc:60:de",
            "net15": "6e:dd:7f:c8:24:be",
            "net2": "8a:c5:19:3c:35:86",
            "net3": "36:dd:a4:5a:2e:76",
            "net4": "ae:cd:f3:23:b9:61",
            "net5": "de:11:34:74:cc:24",
            "net6": "e2:e2:dc:0c:f5:94",
            "net7": "22:9b:ea:5c:17:29",
            "net8": "2e:3e:ff:c2:63:59",
            "net9": "d6:83:6e:b7:10:3d"
        }
    },
    "failed_machine": "leaf_1_0_1",
    "failure_time": {
        "leaf_1_0_1": 1621947166.3292916,
        "leaf_1_0_2": 1621947160.6357083,
        "leaf_1_0_3": 1621947166.3424783,
        "leaf_1_0_4": 1621947166.3592963,
        "leaf_1_0_5": 1621947166.3767173,
        "leaf_1_0_6": 1621947166.3305597,
        "leaf_1_0_7": 1621947166.3459437,
        "leaf_1_0_8": 1621947166.35417,
        "leaf_2_0_1": 1621947166.3649993,
        "leaf_2_0_2": 1621947166.3798666,
        "leaf_2_0_3": 1621947166.3323264,
        "leaf_2_0_4": 1621947166.3416348,
        "leaf_2_0_5": 1621947166.3517215,
        "leaf_2_0_6": 1621947166.356885,
        "leaf_2_0_7": 1621947166.369434,
        "leaf_2_0_8": 1621947166.3319724,
        "leaf_3_0_1": 1621947166.3369935,
        "leaf_3_0_2": 1621947166.3486013,
        "leaf_3_0_3": 1621947166.3595707,
        "leaf_3_0_4": 1621947160.67158,
        "leaf_3_0_5": 1621947166.3870459,
        "leaf_3_0_6": 1621947166.3989081,
        "leaf_3_0_7": 1621947166.4277644,
        "leaf_3_0_8": 1621947166.4429219,
        "leaf_4_0_1": 1621947166.4535928,
        "leaf_4_0_2": 1621947166.389816,
        "leaf_4_0_3": 1621947166.4105644,
        "leaf_4_0_4": 1621947166.42985,
        "leaf_4_0_5": 1621947166.4401164,
        "leaf_4_0_6": 1621947160.7542958,
        "leaf_4_0_7": 1621947166.3932674,
        "leaf_4_0_8": 1621947166.4196286,
        "spine_1_1_1": 1621947166.442172,
        "spine_1_1_2": 1621947160.752128,
        "spine_1_1_3": 1621947166.4614537,
        "spine_1_1_4": 1621947166.3921273,
        "spine_1_1_5": 1621947166.4213808,
        "spine_1_1_6": 1621947166.4412258,
        "spine_1_1_7": 1621947166.45752,
        "spine_1_1_8": 1621947166.4651272,
        "spine_2_1_1": 1621947160.7605836,
        "spine_2_1_2": 1621947166.4716125,
        "spine_2_1_3": 1621947160.7867322,
        "spine_2_1_4": 1621947166.5089784,
        "spine_2_1_5": 1621947160.8326335,
        "spine_2_1_6": 1621947166.4703033,
        "spine_2_1_7": 1621947166.485634,
        "spine_2_1_8": 1621947166.5079932,
        "spine_3_1_1": 1621947166.526963,
        "spine_3_1_2": 1621947166.5370915,
        "spine_3_1_3": 1621947160.7708569,
        "spine_3_1_4": 1621947166.485329,
        "spine_3_1_5": 1621947166.4999807,
        "spine_3_1_6": 1621947166.5166445,
        "spine_3_1_7": 1621947166.5338025,
        "spine_3_1_8": 1621947166.4777136,
        "spine_4_1_1": 1621947166.4871435,
        "spine_4_1_2": 1621947166.511623,
        "spine_4_1_3": 1621947166.5231836,
        "spine_4_1_4": 1621947166.5397074,
        "spine_4_1_5": 1621947166.5441065,
        "spine_4_1_6": 1621947166.550556,
        "spine_4_1_7": 1621947166.5632954,
        "spine_4_1_8": 1621947166.5790207,
        "tof_1_2_1": 1621947166.598809,
        "tof_1_2_2": 1621947166.5488634,
        "tof_1_2_3": 1621947166.5601418,
        "tof_1_2_4": 1621947160.877261,
        "tof_1_2_5": 1621947166.5941677,
        "tof_1_2_6": 1621947166.6176426,
        "tof_1_2_7": 1621947160.8470743,
        "tof_1_2_8": 1621947166.5590105,
        "tof_2_2_1": 1621947166.5701163,
        "tof_2_2_2": 1621947166.5798779,
        "tof_2_2_3": 1621947166.598163,
        "tof_2_2_4": 1621947166.5492988,
        "tof_2_2_5": 1621947166.5625782,
        "tof_2_2_6": 1621947160.8768315,
        "tof_2_2_7": 1621947166.5949938,
        "tof_2_2_8": 1621947166.6055205
    }
}