{
    "k_leaf": 2,
    "k_top": 2,
    "redundancy_factor": 1,
    "is_k8s": false,
    "machine_mac_addresses": {
        "leaf_1_0_1": {
            "eth0": "12:d3:e3:d0:e8:6c",
            "eth1": "92:9c:d8:1a:29:19",
            "eth2": "0e:0d:67:fb:41:a6"
        },
        "leaf_1_0_2": {
            "eth0": "0a:3f:b4:a9:f8:cb",
            "eth1": "fa:91:2b:db:1c:82",
            "eth2": "e6:6b:df:8f:79:d0"
        },
        "leaf_2_0_1": {
            "eth0": "66:8e:45:80:50:37",
            "eth1": "f2:a1:e1:7d:ce:6c",
            "eth2": "5a:12:32:5b:b8:4e"
        },
        "leaf_2_0_2": {
            "eth0": "02:4a:ed:ff:64:55",
            "eth1": "1a:ed:50:cb:21:e4",
            "eth2": "f2:c7:65:06:56:58"
        },
        "leaf_3_0_1": {
            "eth0": "c6:58:e9:51:dd:7a",
            "eth1": "8a:14:92:93:3b:7f",
            "eth2": "5a:82:43:9a:f4:84"
        },
        "leaf_3_0_2": {
            "eth0": "62:30:5b:2a:d0:75",
            "eth1": "ca:a9:27:cf:e5:d7",
            "eth2": "1a:f5:31:96:ab:c0"
        },
        "leaf_4_0_1": {
            "eth0": "46:e1:a1:aa:b9:cf",
            "eth1": "7e:30:5f:bf:bd:28",
            "eth2": "36:18:62:a0:96:b2"
        },
        "leaf_4_0_2": {
            "eth0": "9a:34:1b:9b:ea:71",
            "eth1": "92:dc:a9:79:4a:aa",
            "eth2": "66:5f:5d:89:62:97"
        },
        "spine_1_1_1": {
            "eth0": "6a:09:7e:ec:47:13",
            "eth1": "d6:9c:ac:54:a0:61",
            "eth2": "2e:a1:d2:59:00:89",
            "eth3": "26:6d:0f:ff:cf:ec"
        },
        "spine_1_1_2": {
            "eth0": "ce:9f:ba:56:05:c8",
            "eth1": "26:86:8a:d8:36:de",
            "eth2": "aa:6f:3e:a4:51:4f",
            "eth3": "d6:b5:b8:d0:ce:04"
        },
        "spine_2_1_1": {
            "eth0": "62:1f:c9:78:08:f6",
            "eth1": "42:37:10:16:15:a9",
            "eth2": "72:14:85:88:f0:d3",
            "eth3": "a2:1e:6a:c6:90:92"
        },
        "spine_2_1_2": {
            "eth0": "4a:cd:88:be:3e:10",
            "eth1": "4e:dd:ef:3f:dc:93",
            "eth2": "26:af:1f:22:70:31",
            "eth3": "02:9e:93:05:7a:96"
        },
        "spine_3_1_1": {
            "eth0": "9e:60:97:0d:25:43",
            "eth1": "2e:0b:2f:5b:d7:49",
            "eth2": "62:35:94:47:ab:3e",
            "eth3": "7a:41:36:78:d5:af"
        },
        "spine_3_1_2": {
            "eth0": "e6:60:8d:98:9c:ce",
            "eth1": "46:4c:3e:3e:af:65",
            "eth2": "5a:48:58:6c:13:d6",
            "eth3": "7e:df:5a:c9:ad:21"
        },
        "spine_4_1_1": {
            "eth0": "aa:b9:b3:84:2a:43",
            "eth1": "3a:af:50:cb:f1:8e",
            "eth2": "12:f5:ad:c6:02:ae",
            "eth3": "72:cf:9d:07:ed:14"
        },
        "spine_4_1_2": {
            "eth0": "a6:1b:6e:a9:af:cf",
            "eth1": "ca:79:ed:46:29:65",
            "eth2": "1a:a6:f1:5b:f5:b0",
            "eth3": "a2:52:7b:7e:a2:ec"
        },
        "tof_1_2_1": {
            "eth0": "a6:dd:f9:6f:d3:d3",
            "eth1": "ea:bd:1c:63:eb:e3",
            "eth2": "7e:28:f3:c7:01:b5",
            "eth3": "e6:95:c2:1e:a0:9f"
        },
        "tof_1_2_2": {
            "eth0": "8a:48:b1:64:8e:b5",
            "eth1": "4e:99:fe:87:f7:6d",
            "eth2": "72:f7:32:64:6d:61",
            "eth3": "5a:73:d6:a1:6c:93"
        },
        "tof_2_2_1": {
            "eth0": "ea:14:4c:e2:a5:57",
            "eth1": "d6:22:05:99:7b:d1",
            "eth2": "a6:a0:74:45:20:8f",
            "eth3": "56:f6:df:ff:92:d9"
        },
        "tof_2_2_2": {
            "eth0": "e6:3c:f1:60:dc:32",
            "eth1": "c2:a0:c8:6b:d1:69",
            "eth2": "2e:fb:e0:5e:7e:4b",
            "eth3": "22:36:06:fd:4b:d8"
        }
    },
    "failed_machine": "leaf_1_0_1",
    "failure_time": {
        "leaf_1_0_1": 1622025918.707186,
        "leaf_1_0_2": 1622025918.7181437,
        "leaf_2_0_1": 1622025918.708205,
        "leaf_2_0_2": 1622025918.7164998,
        "leaf_3_0_1": 1622025918.7087479,
        "leaf_3_0_2": 1622025918.719207,
        "leaf_4_0_1": 1622025918.7171874,
        "leaf_4_0_2": 1622025918.7273312,
        "spine_1_1_1": 1622025918.731946,
        "spine_1_1_2": 1622025918.7473142,
        "spine_2_1_1": 1622025918.735151,
        "spine_2_1_2": 1622025918.7523272,
        "spine_3_1_1": 1622025918.7418346,
        "spine_3_1_2": 1622025918.7543483,
        "spine_4_1_1": 1622025918.7421176,
        "spine_4_1_2": 1622025918.7660298,
        "tof_1_2_1": 1622025918.7645218,
        "tof_1_2_2": 1622025918.7762508,
        "tof_2_2_1": 1622025918.7629397,
        "tof_2_2_2": 1622025918.7760866
    }
}