{
    "description": "Scenario 3a: Leaf leaf_1_0_1 failure with BGP",
    "k_leaf": 10,
    "k_top": 10,
    "redundancy_factor": 10,
    "is_k8s": true,
    "machine_mac_addresses": {
        "leaf_1_0_1": {
            "net0": "2a:22:a3:ba:d1:24",
            "net1": "6a:4f:8d:84:70:d5",
            "net10": "ea:7b:98:fb:36:9f",
            "net2": "d6:0d:13:81:70:9f",
            "net3": "a2:9c:bb:4b:a1:0f",
            "net4": "aa:29:c1:da:67:88",
            "net5": "7e:1a:42:3b:c3:d7",
            "net6": "d2:b5:ec:d9:af:9b",
            "net7": "ea:86:06:de:6a:88",
            "net8": "be:6c:4f:1c:38:c6",
            "net9": "82:2a:d1:e8:11:35"
        },
        "leaf_1_0_10": {
            "net0": "5e:da:7d:eb:3f:44",
            "net1": "9e:4f:6f:37:86:f9",
            "net10": "a6:76:15:a6:37:95",
            "net2": "6a:28:9a:2a:a9:9f",
            "net3": "66:c2:b9:0d:b0:62",
            "net4": "4a:c7:bf:2e:7c:b4",
            "net5": "36:eb:2d:75:20:8d",
            "net6": "f2:64:04:95:08:1e",
            "net7": "a2:40:a4:60:76:10",
            "net8": "92:d1:24:a5:f2:bd",
            "net9": "a6:57:70:ce:f6:f2"
        },
        "leaf_1_0_2": {
            "net0": "3a:68:28:60:71:3b",
            "net1": "8e:27:e3:cf:7c:c0",
            "net10": "e2:94:90:1d:ee:2c",
            "net2": "32:b9:92:9a:13:3c",
            "net3": "f6:75:4c:ff:84:85",
            "net4": "2a:a1:20:c9:b5:95",
            "net5": "b2:84:60:7b:76:48",
            "net6": "62:10:1b:28:ea:6d",
            "net7": "2a:d2:fe:e6:67:87",
            "net8": "96:c9:48:24:65:ef",
            "net9": "7a:87:dd:5f:41:10"
        },
        "leaf_1_0_3": {
            "net0": "8a:69:62:e4:2f:58",
            "net1": "72:e2:d7:bb:63:4a",
            "net10": "46:38:76:24:3b:ed",
            "net2": "ba:b8:ff:f9:0e:56",
            "net3": "7e:a2:ed:b4:7e:46",
            "net4": "5a:00:c6:37:8a:b3",
            "net5": "8a:b5:f4:e2:69:e1",
            "net6": "52:9d:ea:7b:47:68",
            "net7": "92:af:13:18:33:e7",
            "net8": "5a:5b:fe:4c:11:3d",
            "net9": "16:27:24:f4:57:10"
        },
        "leaf_1_0_4": {
            "net0": "ee:8b:c5:5f:49:d7",
            "net1": "b6:49:d4:d3:a6:b7",
            "net10": "0a:49:0b:1b:6e:cc",
            "net2": "c6:10:76:53:da:07",
            "net3": "66:b9:95:c9:50:3f",
            "net4": "56:d1:d4:4a:44:99",
            "net5": "b2:a4:16:a9:12:46",
            "net6": "22:29:fb:89:40:57",
            "net7": "ee:28:6f:1e:65:7a",
            "net8": "fe:4a:50:3a:16:49",
            "net9": "42:ef:96:17:59:5c"
        },
        "leaf_1_0_5": {
            "net0": "96:fe:34:69:1b:79",
            "net1": "9a:b9:35:70:f0:8c",
            "net10": "32:8c:8d:e0:2e:62",
            "net2": "be:e7:af:71:63:24",
            "net3": "ca:fb:88:c9:23:13",
            "net4": "ca:57:3f:04:7d:67",
            "net5": "6a:fa:93:f3:c1:9e",
            "net6": "06:47:f4:84:f8:7b",
            "net7": "12:4a:dd:c0:ce:e2",
            "net8": "c6:84:cb:fd:e6:c3",
            "net9": "9a:fe:f5:48:74:19"
        },
        "leaf_1_0_6": {
            "net0": "0e:3e:50:81:5c:5f",
            "net1": "6a:5a:86:de:ad:ec",
            "net10": "da:81:54:cb:12:3b",
            "net2": "62:a4:5d:91:6e:ce",
            "net3": "82:bc:1b:7e:21:d5",
            "net4": "c6:17:dd:c8:e2:6d",
            "net5": "5a:35:a5:c1:72:d9",
            "net6": "ba:7a:02:53:52:34",
            "net7": "de:31:0d:4f:1e:ea",
            "net8": "c6:1e:d7:b8:7b:2d",
            "net9": "ba:fd:81:7f:29:f1"
        },
        "leaf_1_0_7": {
            "net0": "d2:6f:30:27:41:5f",
            "net1": "9e:6b:44:3a:16:08",
            "net10": "ae:61:cb:95:a6:70",
            "net2": "d6:dc:62:2b:c0:86",
            "net3": "46:54:c9:7e:a8:d5",
            "net4": "86:67:c5:2e:60:27",
            "net5": "46:97:4d:64:99:9e",
            "net6": "a2:3b:48:09:c3:c8",
            "net7": "6a:52:e3:30:5e:a4",
            "net8": "4a:15:42:36:6b:15",
            "net9": "32:d1:0b:f7:ce:36"
        },
        "leaf_1_0_8": {
            "net0": "92:01:ea:4f:ea:fd",
            "net1": "d6:4a:98:54:c0:0f",
            "net10": "a2:e7:ca:72:cd:fb",
            "net2": "e2:72:4e:2b:8e:3a",
            "net3": "42:26:05:e2:36:14",
            "net4": "e2:77:1c:aa:e1:dd",
            "net5": "be:9f:e0:4d:ba:14",
            "net6": "7a:a8:5d:20:a6:37",
            "net7": "4a:15:69:aa:4a:a7",
            "net8": "46:a3:05:0e:01:73",
            "net9": "de:fa:d5:90:94:4c"
        },
        "leaf_1_0_9": {
            "net0": "5a:22:96:2c:c0:52",
            "net1": "66:2c:e4:8a:85:0a",
            "net10": "32:20:13:76:c5:f1",
            "net2": "7e:50:c8:10:4e:55",
            "net3": "3a:bb:fe:8f:55:19",
            "net4": "fe:2e:b6:02:17:e0",
            "net5": "86:be:dd:85:de:b9",
            "net6": "36:73:8e:1f:f2:7f",
            "net7": "ee:80:0d:66:ed:21",
            "net8": "f6:29:39:4e:a4:6c",
            "net9": "76:34:90:15:f2:d1"
        },
        "leaf_2_0_1": {
            "net0": "a6:c0:14:83:67:d8",
            "net1": "72:e2:ad:91:b5:d5",
            "net10": "3e:ff:41:3d:73:7e",
            "net2": "66:38:3c:62:16:9a",
            "net3": "a2:3c:37:98:61:01",
            "net4": "5e:42:a7:03:4b:58",
            "net5": "32:5d:51:3c:79:8a",
            "net6": "16:0a:2f:7e:d7:67",
            "net7": "ee:84:de:41:ae:fe",
            "net8": "2e:dd:1c:10:0b:37",
            "net9": "8e:d1:e8:2a:30:5c"
        },
        "leaf_2_0_10": {
            "net0": "7a:dc:7c:2d:09:5a",
            "net1": "32:c3:f6:a4:85:d6",
            "net10": "1e:75:7f:1f:c0:25",
            "net2": "ca:93:c7:8e:15:cf",
            "net3": "6e:65:a5:88:62:be",
            "net4": "2a:28:9d:ed:68:19",
            "net5": "32:c4:51:72:76:1d",
            "net6": "5e:f0:9f:7f:d9:e4",
            "net7": "ae:86:0c:ef:07:06",
            "net8": "42:eb:61:a5:9d:0c",
            "net9": "ba:ce:6d:05:47:67"
        },
        "leaf_2_0_2": {
            "net0": "ea:df:92:67:21:20",
            "net1": "42:08:f1:02:18:be",
            "net10": "8e:37:25:82:60:e5",
            "net2": "ee:8a:8a:4c:64:19",
            "net3": "be:1a:eb:24:39:1f",
            "net4": "22:dc:f8:3f:b4:3a",
            "net5": "ba:c1:18:e7:88:a0",
            "net6": "82:92:1b:95:40:5e",
            "net7": "a6:93:b1:da:ac:f1",
            "net8": "8a:3d:f6:e9:e2:cc",
            "net9": "2a:57:72:e1:4c:8d"
        },
        "leaf_2_0_3": {
            "net0": "76:49:5a:e2:98:c6",
            "net1": "e6:07:3c:51:a6:55",
            "net10": "ee:40:86:28:0f:e2",
            "net2": "26:ca:26:ab:fd:3f",
            "net3": "4a:05:97:87:be:20",
            "net4": "32:f6:69:71:a4:e0",
            "net5": "32:70:05:4e:65:3a",
            "net6": "8a:e5:13:30:1e:5c",
            "net7": "ba:89:23:2c:60:ed",
            "net8": "3e:1d:85:38:89:a8",
            "net9": "7e:48:c1:89:6f:d1"
        },
        "leaf_2_0_4": {
            "net0": "62:5d:4b:e4:73:0e",
            "net1": "7e:62:0d:30:05:71",
            "net10": "9e:e1:a9:47:69:37",
            "net2": "f2:97:16:0f:2b:cb",
            "net3": "5a:30:01:d1:b2:46",
            "net4": "5e:11:65:a2:c2:40",
            "net5": "e6:0a:15:f1:72:ae",
            "net6": "42:15:dc:a9:c8:4f",
            "net7": "b2:77:59:19:55:c9",
            "net8": "52:9e:b3:07:11:f0",
            "net9": "12:b7:08:cc:a9:bb"
        },
        "leaf_2_0_5": {
            "net0": "9a:fd:99:94:ae:7c",
            "net1": "36:2a:c1:8d:e6:72",
            "net10": "66:94:c1:18:3b:8b",
            "net2": "2e:f9:a3:61:b9:d1",
            "net3": "26:a1:ef:a3:25:70",
            "net4": "92:da:a5:c2:35:56",
            "net5": "1a:1a:a3:f3:0a:fb",
            "net6": "6a:8c:9c:9f:61:c6",
            "net7": "2a:d2:76:c3:9f:5e",
            "net8": "82:88:63:82:db:64",
            "net9": "ba:6d:aa:d7:1a:83"
        },
        "leaf_2_0_6": {
            "net0": "b2:ff:02:e5:84:f6",
            "net1": "b2:e3:16:b0:12:b1",
            "net10": "7e:5e:e0:68:6e:34",
            "net2": "7e:3a:a1:79:8c:8a",
            "net3": "3a:80:d9:4c:2f:29",
            "net4": "52:7f:c7:3c:9e:3c",
            "net5": "16:8f:04:cf:6d:2a",
            "net6": "ae:ed:87:15:11:50",
            "net7": "8a:35:6b:84:e6:df",
            "net8": "ae:bb:62:af:bb:4c",
            "net9": "86:3d:e5:03:ba:07"
        },
        "leaf_2_0_7": {
            "net0": "ee:b6:02:d3:8e:4e",
            "net1": "fa:b3:02:ef:36:e4",
            "net10": "7a:3a:6c:50:ba:79",
            "net2": "8e:54:d4:ec:24:eb",
            "net3": "1e:9b:f1:3f:36:7c",
            "net4": "36:4e:05:38:01:72",
            "net5": "ca:4f:2c:e2:71:3e",
            "net6": "0e:1f:5c:fc:66:30",
            "net7": "4a:1d:f2:a7:14:03",
            "net8": "b2:05:62:b0:69:46",
            "net9": "46:f0:be:7d:30:84"
        },
        "leaf_2_0_8": {
            "net0": "2e:2c:9b:f4:2d:cf",
            "net1": "86:f1:41:96:d0:c0",
            "net10": "fe:d6:c3:dd:9d:d7",
            "net2": "56:d3:bb:e8:d2:01",
            "net3": "9a:42:95:38:e4:b8",
            "net4": "a6:62:62:41:b4:e9",
            "net5": "8e:ef:8c:e4:e3:68",
            "net6": "5e:1e:a3:6b:24:f1",
            "net7": "4e:65:51:f3:48:7f",
            "net8": "4e:b9:c5:90:af:8c",
            "net9": "fa:d0:f6:69:c3:ef"
        },
        "leaf_2_0_9": {
            "net0": "86:64:1d:56:9a:5f",
            "net1": "6e:23:f1:be:ac:e5",
            "net10": "66:f5:c8:79:82:d4",
            "net2": "aa:31:9d:38:a4:70",
            "net3": "f2:9f:24:ec:18:04",
            "net4": "1a:af:61:f6:38:df",
            "net5": "2a:ca:01:0e:b9:ee",
            "net6": "ca:4c:22:ec:c2:36",
            "net7": "e6:56:43:10:7a:ad",
            "net8": "fe:6c:7d:ee:9b:76",
            "net9": "f6:cd:53:80:fb:80"
        },
        "spine_1_1_1": {
            "net0": "c2:d0:1f:8f:78:0e",
            "net1": "32:17:92:49:97:18",
            "net10": "42:11:ea:7e:d4:44",
            "net11": "c2:fe:1e:b3:6d:ce",
            "net12": "c2:7c:f8:4d:bf:b9",
            "net13": "42:9c:09:60:a6:54",
            "net14": "22:a8:a7:0a:6e:b3",
            "net15": "56:57:2a:f6:5b:00",
            "net16": "b6:53:11:c1:71:eb",
            "net17": "ba:21:a1:1b:63:3b",
            "net18": "92:64:c2:7b:01:35",
            "net19": "c6:f1:19:aa:4e:fa",
            "net2": "22:44:e1:cb:63:bd",
            "net3": "c6:75:73:c7:a4:fd",
            "net4": "8e:d1:42:57:5f:5f",
            "net5": "b2:90:76:00:f7:5f",
            "net6": "0e:07:1c:10:fd:72",
            "net7": "2a:66:af:e8:8d:37",
            "net8": "f2:f9:5f:c3:b9:b0",
            "net9": "ee:b0:93:27:e0:15"
        },
        "spine_1_1_10": {
            "net0": "02:30:11:17:5b:8c",
            "net1": "7e:b9:ca:cf:36:57",
            "net10": "0a:fe:8d:17:2e:cb",
            "net11": "7e:aa:3f:c7:45:3b",
            "net12": "26:a7:d8:a8:07:90",
            "net13": "be:58:f8:b8:6a:50",
            "net14": "76:54:c3:fa:c2:21",
            "net15": "86:25:f4:d6:af:9f",
            "net16": "fa:1a:a9:cd:3c:13",
            "net17": "d2:10:e2:c3:6d:0e",
            "net18": "8a:6a:4a:41:dd:0b",
            "net19": "aa:5b:93:e7:7e:7c",
            "net2": "7a:18:16:d9:c8:1c",
            "net3": "3e:f9:ec:4b:cb:03",
            "net4": "da:3c:92:d9:6c:11",
            "net5": "86:31:fa:3d:ab:b9",
            "net6": "1a:96:28:aa:6d:a8",
            "net7": "16:ca:1c:56:6d:97",
            "net8": "b6:0c:c8:88:e2:87",
            "net9": "c6:40:1f:da:d7:0d"
        },
        "spine_1_1_2": {
            "net0": "aa:13:99:6f:05:eb",
            "net1": "3a:98:23:4f:90:49",
            "net10": "46:89:f5:d2:53:42",
            "net11": "4a:10:82:18:b0:59",
            "net12": "86:04:8b:a5:de:ba",
            "net13": "3a:01:9f:3a:47:16",
            "net14": "6a:00:3a:6e:e5:66",
            "net15": "b2:d6:6e:16:b7:0f",
            "net16": "ea:13:d0:ac:95:96",
            "net17": "b2:60:aa:a0:d9:a6",
            "net18": "ae:87:21:2c:57:b5",
            "net19": "42:f2:35:29:f4:34",
            "net2": "3e:c7:b9:73:6c:65",
            "net3": "72:7c:2e:6c:19:68",
            "net4": "a2:9f:c4:e2:5c:04",
            "net5": "72:21:d5:73:96:79",
            "net6": "02:2c:74:a3:50:84",
            "net7": "8a:6d:3d:ee:8a:48",
            "net8": "12:f9:a7:a6:8d:2b",
            "net9": "a6:df:63:29:f8:73"
        },
        "spine_1_1_3": {
            "net0": "ba:18:a9:08:30:6e",
            "net1": "22:e2:ee:8e:f4:18",
            "net10": "9a:9c:92:9e:ca:cb",
            "net11": "6a:74:45:2a:ae:29",
            "net12": "42:de:c0:d3:28:bf",
            "net13": "9a:5b:6f:63:1c:6e",
            "net14": "da:01:21:9f:2f:87",
            "net15": "f6:a6:01:b4:db:a0",
            "net16": "8a:e2:0e:04:5d:aa",
            "net17": "3a:41:6b:d8:38:59",
            "net18": "da:c4:85:aa:23:18",
            "net19": "8e:93:45:f6:71:68",
            "net2": "da:50:40:49:a9:cd",
            "net3": "fa:47:2e:3d:3a:3d",
            "net4": "92:64:b0:aa:63:a6",
            "net5": "5e:63:76:6b:68:cd",
            "net6": "0a:2a:da:46:69:15",
            "net7": "ae:60:c7:22:27:48",
            "net8": "36:0f:cc:41:f3:db",
            "net9": "c2:e9:02:a6:c1:5c"
        },
        "spine_1_1_4": {
            "net0": "9a:7a:08:65:af:c7",
            "net1": "a6:5e:17:97:22:6d",
            "net10": "56:5a:79:1f:a2:ca",
            "net11": "aa:5e:11:c1:8f:5d",
            "net12": "22:63:79:1d:22:72",
            "net13": "02:13:24:95:3b:e3",
            "net14": "c2:e9:77:b2:2f:00",
            "net15": "52:55:ad:14:17:11",
            "net16": "f6:82:8b:7f:dd:d4",
            "net17": "ba:31:e2:7d:7f:c5",
            "net18": "4a:f2:a7:5d:6f:a0",
            "net19": "ce:3f:3b:6d:06:47",
            "net2": "ba:3d:24:4a:43:a2",
            "net3": "b2:39:62:17:86:f9",
            "net4": "36:29:a8:13:d7:20",
            "net5": "d6:56:2d:a3:0f:c5",
            "net6": "9a:cc:95:41:8c:33",
            "net7": "b6:d5:5b:14:01:da",
            "net8": "fe:8b:6e:70:a6:f3",
            "net9": "7a:04:5d:72:78:a5"
        },
        "spine_1_1_5": {
            "net0": "da:63:3a:7c:b1:a3",
            "net1": "06:aa:8e:c0:bd:7b",
            "net10": "fa:82:cb:d1:ad:ca",
            "net11": "66:1e:0d:43:a9:fd",
            "net12": "06:cb:ac:c6:ca:ed",
            "net13": "f6:b7:80:66:75:62",
            "net14": "e6:b4:6e:67:ec:b6",
            "net15": "ce:d1:df:70:e4:59",
            "net16": "3e:2a:38:df:c2:29",
            "net17": "9a:fb:09:33:8c:17",
            "net18": "02:b6:40:b6:cc:b5",
            "net19": "42:d7:6f:f3:2b:65",
            "net2": "36:55:5a:3a:d1:4e",
            "net3": "92:d9:a8:1c:bd:2e",
            "net4": "ba:c4:f6:ff:81:e6",
            "net5": "ca:49:bb:32:ce:79",
            "net6": "62:a7:77:1d:9e:95",
            "net7": "2a:01:39:1c:76:ec",
            "net8": "1a:3e:56:12:78:92",
            "net9": "1a:5d:40:e3:bf:62"
        },
        "spine_1_1_6": {
            "net0": "92:16:96:65:3d:61",
            "net1": "52:de:10:5c:f1:11",
            "net10": "5e:25:ff:a1:5f:6f",
            "net11": "be:c6:a0:f6:63:e4",
            "net12": "12:1c:ea:7b:a6:9e",
            "net13": "de:8d:5b:66:95:35",
            "net14": "8a:46:23:0d:b0:81",
            "net15": "06:88:ca:ce:58:9f",
            "net16": "36:5f:14:d1:34:8b",
            "net17": "02:6f:46:74:89:37",
            "net18": "6e:ec:ff:b1:27:49",
            "net19": "ea:cd:36:ac:9d:92",
            "net2": "92:a3:1e:d2:93:e0",
            "net3": "0e:c9:83:ce:80:c0",
            "net4": "5e:22:ca:cc:57:35",
            "net5": "fa:90:8b:6f:eb:5d",
            "net6": "b6:5b:ad:cc:0b:a1",
            "net7": "92:08:20:c2:f6:8a",
            "net8": "46:83:4c:1f:96:ba",
            "net9": "b2:8c:c6:e5:f9:9c"
        },
        "spine_1_1_7": {
            "net0": "ee:f6:0e:7e:85:10",
            "net1": "0e:9c:e2:97:2b:e8",
            "net10": "9a:1d:52:71:a7:80",
            "net11": "d2:ea:bb:a0:5f:59",
            "net12": "b2:af:c1:d7:22:d6",
            "net13": "4a:ee:67:96:35:a3",
            "net14": "7a:73:00:30:af:fa",
            "net15": "72:90:b8:c8:fe:22",
            "net16": "ba:48:31:d1:54:79",
            "net17": "4a:ce:52:47:35:c0",
            "net18": "3e:ac:f7:7f:1d:f8",
            "net19": "0a:9f:be:e1:fc:84",
            "net2": "da:b5:1e:16:01:f3",
            "net3": "36:e2:0c:e9:bf:0e",
            "net4": "f2:2c:fa:ed:de:65",
            "net5": "72:95:6a:d9:7b:fc",
            "net6": "c6:27:f9:b1:fa:6a",
            "net7": "7a:04:0e:77:ab:c7",
            "net8": "aa:a1:bb:2c:be:15",
            "net9": "96:96:3a:da:da:82"
        },
        "spine_1_1_8": {
            "net0": "06:2b:ee:7b:ad:15",
            "net1": "62:33:88:bf:1e:23",
            "net10": "8a:02:9d:7a:29:34",
            "net11": "f6:50:0f:92:74:0f",
            "net12": "32:4a:a2:22:6d:e8",
            "net13": "ee:3e:33:8c:39:f6",
            "net14": "92:1a:3a:ec:2a:60",
            "net15": "d2:02:bb:00:ee:26",
            "net16": "2a:83:a1:93:d4:50",
            "net17": "3a:9c:6a:d7:1c:b4",
            "net18": "42:f4:2a:68:ab:54",
            "net19": "62:01:93:bd:65:45",
            "net2": "4a:17:38:43:25:1a",
            "net3": "ee:9d:66:4f:94:d4",
            "net4": "6a:51:f7:0f:f3:9a",
            "net5": "be:be:75:4b:05:42",
            "net6": "3a:eb:fa:59:9f:74",
            "net7": "52:54:ac:f3:a2:a6",
            "net8": "5e:f7:0d:dc:11:c3",
            "net9": "b6:60:9d:bc:35:dd"
        },
        "spine_1_1_9": {
            "net0": "1e:85:6c:99:45:1f",
            "net1": "ca:4c:38:35:b6:3e",
            "net10": "02:52:b3:60:18:eb",
            "net11": "0e:7a:37:ce:6b:d0",
            "net12": "ee:1b:ee:3e:76:68",
            "net13": "3a:4b:56:38:01:b6",
            "net14": "6a:cd:e1:08:71:ba",
            "net15": "7a:b0:89:a7:76:db",
            "net16": "02:48:25:2e:32:e4",
            "net17": "b2:35:bd:90:37:aa",
            "net18": "6a:77:a5:6d:3d:3d",
            "net19": "b2:8e:86:47:3b:97",
            "net2": "36:a0:c0:d2:68:72",
            "net3": "c2:72:0c:94:4c:3f",
            "net4": "8e:db:82:6a:d7:f3",
            "net5": "66:8f:4b:d5:fb:fe",
            "net6": "4e:8b:cc:4c:67:03",
            "net7": "d6:2b:40:f2:00:65",
            "net8": "16:46:ce:3b:e3:8b",
            "net9": "be:49:2f:3a:46:65"
        },
        "spine_2_1_1": {
            "net0": "76:ba:9b:f6:b0:39",
            "net1": "16:81:8c:57:37:f5",
            "net10": "06:d6:2f:6c:48:f4",
            "net11": "12:46:ca:34:dc:8d",
            "net12": "e2:bb:d5:b0:fe:8d",
            "net13": "1a:df:91:1e:97:d3",
            "net14": "7a:5b:15:55:04:fb",
            "net15": "ba:a5:d9:3d:7f:13",
            "net16": "72:3d:39:08:81:1a",
            "net17": "c6:2f:05:d4:a6:c6",
            "net18": "c2:e7:75:c7:38:30",
            "net19": "92:ce:36:9a:c7:c5",
            "net2": "ba:40:7d:1b:f7:6d",
            "net3": "c6:19:91:9f:78:a0",
            "net4": "e2:ba:b8:1d:b2:33",
            "net5": "82:55:20:00:2f:e0",
            "net6": "8e:28:b0:f9:7c:67",
            "net7": "5e:74:9f:06:9e:15",
            "net8": "2a:09:64:6c:2e:b2",
            "net9": "ce:d6:87:31:1f:c0"
        },
        "spine_2_1_10": {
            "net0": "22:de:8d:cc:ca:22",
            "net1": "da:b2:12:91:6e:32",
            "net10": "2e:3a:01:9f:1e:29",
            "net11": "ce:47:f4:cb:03:24",
            "net12": "9e:60:49:8d:30:ca",
            "net13": "86:39:ac:58:2c:da",
            "net14": "76:41:f8:4a:e4:53",
            "net15": "4e:80:96:2f:da:14",
            "net16": "e6:d6:ab:4f:b1:7b",
            "net17": "56:f3:a5:8c:6b:6c",
            "net18": "b6:c1:60:06:c4:ec",
            "net19": "da:91:97:24:02:ed",
            "net2": "32:e4:f4:0f:55:f1",
            "net3": "e2:0d:a6:ae:b9:08",
            "net4": "3e:be:fb:fb:af:52",
            "net5": "32:81:c0:47:10:fa",
            "net6": "06:47:6d:66:42:b3",
            "net7": "5a:4d:ad:7a:59:de",
            "net8": "e6:c3:1a:f6:64:c3",
            "net9": "52:a3:30:d2:2d:f2"
        },
        "spine_2_1_2": {
            "net0": "ea:ab:21:3f:aa:96",
            "net1": "9e:35:0c:ac:b6:1f",
            "net10": "12:72:59:cb:01:86",
            "net11": "9a:66:13:e5:be:64",
            "net12": "c2:a5:9c:69:84:cc",
            "net13": "26:e1:7f:a7:5a:33",
            "net14": "76:11:80:6b:5d:a5",
            "net15": "86:07:9d:26:b0:ed",
            "net16": "aa:99:24:8a:84:a8",
            "net17": "26:54:70:09:ca:60",
            "net18": "da:15:58:68:0b:58",
            "net19": "5e:59:1d:0a:f3:94",
            "net2": "26:17:91:60:a4:5d",
            "net3": "ce:5c:b8:bd:28:08",
            "net4": "4e:88:a7:30:f4:68",
            "net5": "ee:0f:b0:86:e9:46",
            "net6": "e6:17:d3:6c:ce:f7",
            "net7": "76:82:ea:fb:a4:54",
            "net8": "5a:04:70:ac:ff:e2",
            "net9": "ca:e6:d3:c7:e3:94"
        },
        "spine_2_1_3": {
            "net0": "fa:b4:06:f0:0e:98",
            "net1": "9a:c8:d3:74:08:ac",
            "net10": "0e:23:f9:37:23:d1",
            "net11": "aa:e7:17:73:49:8f",
            "net12": "12:c7:02:26:18:24",
            "net13": "5a:f5:f7:ea:fa:ae",
            "net14": "2a:0c:3a:8a:d8:be",
            "net15": "e2:40:7e:ae:a3:35",
            "net16": "26:c5:94:f3:31:de",
            "net17": "26:d1:a0:bd:df:35",
            "net18": "02:5c:39:ff:0f:2c",
            "net19": "92:3e:8b:a4:b3:e4",
            "net2": "c6:64:df:a7:12:d1",
            "net3": "2e:c4:9a:21:13:b2",
            "net4": "6e:3e:51:68:90:87",
            "net5": "16:70:d6:f5:b7:c8",
            "net6": "ce:74:50:e9:24:3a",
            "net7": "ea:19:4e:e0:b5:b7",
            "net8": "7a:4c:0c:05:dc:f6",
            "net9": "4e:32:e5:f0:58:1f"
        },
        "spine_2_1_4": {
            "net0": "de:1a:d4:1d:9b:4f",
            "net1": "e6:42:27:00:7c:3d",
            "net10": "0a:52:0f:78:09:0b",
            "net11": "32:88:d0:85:84:6f",
            "net12": "fe:42:e3:b4:60:5b",
            "net13": "ba:06:76:38:f9:ef",
            "net14": "46:7e:cc:f5:3c:27",
            "net15": "16:86:8d:04:ff:6c",
            "net16": "92:14:2b:b1:10:69",
            "net17": "de:d2:de:6e:d1:1c",
            "net18": "02:47:ff:62:79:d4",
            "net19": "f2:94:90:f4:ca:07",
            "net2": "26:9a:3c:eb:1f:98",
            "net3": "ae:f4:dc:8e:0e:34",
            "net4": "1a:e0:4f:3a:b4:24",
            "net5": "b2:1e:40:85:b6:2b",
            "net6": "f6:e9:42:ec:27:23",
            "net7": "2a:56:dc:c0:4b:58",
            "net8": "2e:d5:80:bb:68:a9",
            "net9": "56:5a:51:7f:ed:11"
        },
        "spine_2_1_5": {
            "net0": "46:e6:61:c0:f5:b7",
            "net1": "9e:89:51:a4:cf:37",
            "net10": "9e:17:ce:85:1f:ef",
            "net11": "02:1f:6f:8c:e6:d7",
            "net12": "3a:c3:5b:c9:b8:ca",
            "net13": "46:d4:22:f4:c3:02",
            "net14": "5a:c6:f2:e5:75:b2",
            "net15": "3a:58:77:32:82:70",
            "net16": "7a:b6:58:84:5e:7b",
            "net17": "26:76:08:14:0c:66",
            "net18": "d2:64:a8:5c:49:3c",
            "net19": "f6:18:93:0e:ed:01",
            "net2": "12:8a:af:f9:2b:0a",
            "net3": "06:cb:94:47:c1:8f",
            "net4": "6e:c7:b2:53:04:38",
            "net5": "4a:00:64:83:0b:c4",
            "net6": "8e:af:a9:e8:45:2c",
            "net7": "8a:ed:49:4d:f1:8b",
            "net8": "ba:44:dd:1f:35:57",
            "net9": "ce:07:57:74:f3:16"
        },
        "spine_2_1_6": {
            "net0": "0e:d3:af:a9:d1:e3",
            "net1": "d6:26:6d:4f:08:ff",
            "net10": "0e:d9:dc:1d:79:30",
            "net11": "72:88:65:b1:cb:6f",
            "net12": "ba:3d:5c:82:84:0e",
            "net13": "3a:0b:a4:9d:cf:16",
            "net14": "42:91:9a:72:b3:db",
            "net15": "5e:e6:0c:33:fa:d5",
            "net16": "2a:2a:a8:84:02:f0",
            "net17": "3a:73:08:95:16:55",
            "net18": "0e:60:41:d7:dc:4b",
            "net19": "0a:db:65:ef:93:d0",
            "net2": "8a:ec:49:6f:0b:b5",
            "net3": "8e:42:60:88:8d:61",
            "net4": "fa:98:46:28:00:48",
            "net5": "26:62:1b:63:fa:18",
            "net6": "1e:db:8a:65:d4:b9",
            "net7": "9a:93:11:6b:0f:25",
            "net8": "52:f9:8d:ec:fe:0e",
            "net9": "8e:15:58:20:1d:f1"
        },
        "spine_2_1_7": {
            "net0": "16:cf:f3:2a:2a:4a",
            "net1": "3a:61:67:7f:3d:f1",
            "net10": "ca:f6:a2:56:18:94",
            "net11": "8e:0f:ae:f1:49:3f",
            "net12": "06:bc:a2:01:e4:b2",
            "net13": "0e:c2:cc:18:f9:30",
            "net14": "e6:28:95:ca:f8:d9",
            "net15": "b2:e0:a1:c1:76:7d",
            "net16": "8a:b2:a5:39:09:42",
            "net17": "62:50:4e:98:a7:aa",
            "net18": "32:25:71:73:83:9d",
            "net19": "1a:f7:0c:36:64:8d",
            "net2": "3a:8d:aa:82:a4:2d",
            "net3": "ee:9e:a2:80:65:71",
            "net4": "b6:8f:20:86:a0:27",
            "net5": "62:26:ae:34:6c:d1",
            "net6": "66:af:c3:00:a2:0c",
            "net7": "66:bd:a6:b7:24:a5",
            "net8": "a2:50:ce:87:f2:48",
            "net9": "ae:7b:6d:19:b4:53"
        },
        "spine_2_1_8": {
            "net0": "c2:98:fa:6e:68:83",
            "net1": "ae:87:5a:ba:fa:02",
            "net10": "72:03:92:f4:04:67",
            "net11": "86:47:f8:0d:f7:6c",
            "net12": "82:75:1e:cb:3f:d0",
            "net13": "96:4f:93:65:69:bb",
            "net14": "6e:d2:0e:95:72:b3",
            "net15": "3e:de:14:c9:4c:07",
            "net16": "2e:9e:1f:6f:3a:b3",
            "net17": "3e:94:3c:d3:d4:b6",
            "net18": "aa:d4:15:78:18:6c",
            "net19": "de:1d:5a:bd:1d:6f",
            "net2": "32:a1:7c:e9:ef:45",
            "net3": "16:5e:29:db:a4:88",
            "net4": "b6:bc:ef:da:55:eb",
            "net5": "3a:d2:80:7d:ee:93",
            "net6": "b2:be:a2:4e:68:65",
            "net7": "fe:1d:7f:df:e0:19",
            "net8": "42:7b:fa:bf:a8:d4",
            "net9": "8a:dd:08:01:14:34"
        },
        "spine_2_1_9": {
            "net0": "ea:e3:ac:ce:b0:92",
            "net1": "ae:f2:d2:9d:18:5e",
            "net10": "32:3c:98:ea:4d:8e",
            "net11": "06:95:54:6e:e9:a7",
            "net12": "da:5c:81:24:07:32",
            "net13": "7a:a5:fd:f7:2a:fc",
            "net14": "4a:b4:eb:1d:08:bc",
            "net15": "be:18:c5:d8:a7:dc",
            "net16": "ea:a4:8f:27:49:72",
            "net17": "7e:d3:d5:d3:2f:26",
            "net18": "1e:6f:ca:f8:8f:d3",
            "net19": "66:02:6a:e6:aa:7b",
            "net2": "0a:ac:07:49:21:18",
            "net3": "82:1e:35:0e:f8:c2",
            "net4": "06:c5:2a:91:ad:d6",
            "net5": "3a:cb:87:23:84:ce",
            "net6": "02:48:90:8f:6e:6c",
            "net7": "26:7a:2a:25:08:d1",
            "net8": "aa:5b:f2:fb:d5:70",
            "net9": "22:47:99:28:71:d7"
        },
        "tof_1_2_1": {
            "net0": "c2:13:2b:fd:ee:35",
            "net1": "8a:c3:8d:81:e4:1c",
            "net10": "0a:e1:86:7e:95:77",
            "net11": "86:77:1a:36:c0:dc",
            "net12": "4e:62:77:0f:02:3d",
            "net13": "a6:df:57:08:51:d1",
            "net14": "92:7f:ab:ab:79:45",
            "net15": "ba:92:49:96:b9:58",
            "net16": "36:52:c8:c1:38:e1",
            "net17": "72:da:a8:9a:49:fa",
            "net18": "22:ba:91:f7:03:f4",
            "net19": "5a:24:5a:7f:a0:2d",
            "net2": "5a:9a:11:b0:0a:a7",
            "net3": "66:c5:59:ad:5e:5c",
            "net4": "d2:f8:15:43:5b:e9",
            "net5": "22:40:b2:a0:fc:a5",
            "net6": "02:4d:cd:3a:35:db",
            "net7": "8e:71:6b:9d:98:49",
            "net8": "8e:29:b0:46:6d:a1",
            "net9": "72:48:be:2d:38:5a"
        },
        "tof_1_2_10": {
            "net0": "92:84:8e:50:ac:d3",
            "net1": "76:ae:f4:24:12:23",
            "net10": "6a:e4:01:63:45:01",
            "net11": "6e:d2:bb:79:f1:01",
            "net12": "5a:6a:77:a9:2c:ad",
            "net13": "b2:c3:29:8d:ad:4c",
            "net14": "8a:73:02:22:dd:3a",
            "net15": "e6:3e:22:38:a7:ad",
            "net16": "3e:7a:3b:aa:bb:f3",
            "net17": "a2:06:6e:b1:74:57",
            "net18": "0a:e4:5f:ad:f0:15",
            "net19": "36:3e:5e:4f:ae:16",
            "net2": "8a:87:0e:5d:e7:1b",
            "net3": "e2:1f:df:14:b1:d4",
            "net4": "7e:c9:d0:71:e1:48",
            "net5": "d6:80:56:8c:fd:fd",
            "net6": "9a:87:cc:e5:e1:26",
            "net7": "52:27:2f:7e:85:cd",
            "net8": "c6:7e:2b:a0:04:7d",
            "net9": "be:b0:9e:8b:24:e1"
        },
        "tof_1_2_2": {
            "net0": "5e:cb:15:f0:5f:c6",
            "net1": "9a:3c:1f:d0:ab:f0",
            "net10": "8e:92:69:6b:e0:07",
            "net11": "66:b9:c7:f6:aa:fa",
            "net12": "b6:3a:d3:d9:3e:a9",
            "net13": "1a:18:9f:9f:30:0b",
            "net14": "da:c2:f2:2c:36:03",
            "net15": "6e:24:06:5d:01:ec",
            "net16": "8a:e9:fb:aa:44:8a",
            "net17": "56:86:c8:3d:ea:96",
            "net18": "02:62:f6:63:19:d1",
            "net19": "2e:bb:a4:6c:38:03",
            "net2": "e6:ff:4f:43:d4:38",
            "net3": "46:b4:04:14:6f:c9",
            "net4": "f6:7b:0f:45:ee:96",
            "net5": "aa:c8:76:bd:bd:28",
            "net6": "7e:a2:9a:1a:d6:81",
            "net7": "1e:73:9f:90:d1:ff",
            "net8": "5e:9e:1e:75:72:e3",
            "net9": "5a:03:73:fe:15:04"
        },
        "tof_1_2_3": {
            "net0": "46:f0:e7:6b:b1:03",
            "net1": "36:96:28:bf:b0:6e",
            "net10": "0e:92:f0:75:50:88",
            "net11": "9a:19:2f:ff:54:3d",
            "net12": "9a:bd:0d:38:ba:fe",
            "net13": "1e:a2:1f:b2:bb:6e",
            "net14": "92:66:ce:b2:e0:bd",
            "net15": "7a:df:16:d4:86:88",
            "net16": "ae:67:e5:ba:6f:29",
            "net17": "ce:fc:30:03:54:f4",
            "net18": "d2:43:9e:1b:61:b4",
            "net19": "82:ce:d6:e4:4b:d3",
            "net2": "3e:ea:6a:a1:43:6e",
            "net3": "d2:fb:10:36:fa:f0",
            "net4": "a6:65:cb:56:fc:7d",
            "net5": "1a:2b:15:2d:b4:00",
            "net6": "6a:79:04:92:6d:65",
            "net7": "f2:3b:84:86:76:98",
            "net8": "d6:af:51:44:61:3a",
            "net9": "06:8e:7e:77:d2:d2"
        },
        "tof_1_2_4": {
            "net0": "3a:f6:fd:42:72:f2",
            "net1": "1e:3c:a2:19:b9:49",
            "net10": "3e:da:13:33:88:2e",
            "net11": "5a:44:d1:64:44:c9",
            "net12": "f6:e2:b3:03:32:04",
            "net13": "92:23:ac:b6:50:71",
            "net14": "36:38:3d:e8:f3:5c",
            "net15": "6e:b5:63:43:37:84",
            "net16": "e2:89:ce:c9:66:cc",
            "net17": "36:a0:55:bd:3b:4c",
            "net18": "de:26:81:98:6b:3d",
            "net19": "02:b3:1a:6a:a7:3b",
            "net2": "36:ac:cf:41:f2:e8",
            "net3": "02:f0:f8:e8:eb:96",
            "net4": "9e:2f:ca:91:48:de",
            "net5": "e2:12:3c:1b:4c:cb",
            "net6": "46:5b:25:bf:fa:d2",
            "net7": "ae:71:cd:51:2a:ce",
            "net8": "16:87:fe:25:cd:31",
            "net9": "5e:61:dd:42:b6:16"
        },
        "tof_1_2_5": {
            "net0": "96:77:01:46:21:bd",
            "net1": "02:13:cf:e8:54:17",
            "net10": "5a:ad:8d:87:e1:b4",
            "net11": "f2:19:63:5d:35:a8",
            "net12": "2e:03:88:bc:2b:9c",
            "net13": "d2:bb:f4:4a:54:92",
            "net14": "6a:ed:52:0c:be:85",
            "net15": "7e:95:51:83:2a:62",
            "net16": "aa:bb:4a:57:1a:0c",
            "net17": "9a:fa:56:0f:0f:f1",
            "net18": "2a:0a:bc:18:b3:58",
            "net19": "e2:26:95:fe:2c:80",
            "net2": "96:c0:c8:86:be:6d",
            "net3": "ca:1a:f5:d2:ba:20",
            "net4": "32:d7:ab:ac:44:d7",
            "net5": "2a:08:e9:cf:a4:ec",
            "net6": "a2:c9:ee:e1:88:c7",
            "net7": "7a:17:5e:99:5e:46",
            "net8": "46:bc:d4:ae:cc:3b",
            "net9": "72:d0:a7:4b:52:c1"
        },
        "tof_1_2_6": {
            "net0": "72:f0:d8:cb:b3:1e",
            "net1": "e2:be:66:17:14:c8",
            "net10": "52:cb:85:1c:fd:aa",
            "net11": "ea:fe:21:e5:a6:8f",
            "net12": "c2:21:33:21:be:f2",
            "net13": "06:82:05:e1:ca:ed",
            "net14": "9e:71:1b:fb:92:50",
            "net15": "3e:c2:74:ab:22:10",
            "net16": "3e:c9:c8:f5:2a:ba",
            "net17": "92:4c:0d:e2:7a:b9",
            "net18": "32:6c:08:12:74:69",
            "net19": "86:2a:04:de:ab:df",
            "net2": "f2:58:c5:f6:42:5d",
            "net3": "f6:f2:cf:01:a1:4b",
            "net4": "02:f2:43:f8:ed:b6",
            "net5": "82:e1:27:3f:aa:c0",
            "net6": "82:c5:e2:ba:6b:0b",
            "net7": "86:41:79:1b:4e:2a",
            "net8": "2e:a7:37:f6:f9:c5",
            "net9": "46:3e:2a:54:5f:2f"
        },
        "tof_1_2_7": {
            "net0": "56:70:8e:f9:13:46",
            "net1": "ce:37:87:63:11:2c",
            "net10": "16:93:dc:a6:de:c1",
            "net11": "5e:bc:4e:4d:1e:c4",
            "net12": "da:9c:4c:ea:e2:2e",
            "net13": "fe:e0:35:e2:25:54",
            "net14": "02:63:ec:41:ad:31",
            "net15": "7e:1f:6e:d0:d4:20",
            "net16": "b6:78:d1:f4:3b:aa",
            "net17": "82:5b:aa:25:25:26",
            "net18": "2a:61:8d:a3:db:60",
            "net19": "fa:b2:64:90:33:4c",
            "net2": "a6:9b:78:86:ab:c4",
            "net3": "56:c0:ba:5d:a7:63",
            "net4": "7a:dc:0c:c5:76:bb",
            "net5": "26:f6:48:5a:c1:84",
            "net6": "be:54:13:74:a7:dd",
            "net7": "d2:41:1b:c7:e0:47",
            "net8": "6a:03:b2:4e:57:ba",
            "net9": "c6:21:d5:7b:68:64"
        },
        "tof_1_2_8": {
            "net0": "f2:bd:46:fa:ad:6d",
            "net1": "42:85:62:9b:82:1d",
            "net10": "16:7c:2a:c1:36:5a",
            "net11": "06:23:9a:f2:70:f1",
            "net12": "52:18:cc:3f:9f:ac",
            "net13": "56:8e:d5:23:87:fd",
            "net14": "82:3e:13:32:5b:17",
            "net15": "52:4c:09:82:1c:6a",
            "net16": "1a:10:70:11:e7:f4",
            "net17": "1e:24:a5:66:44:6d",
            "net18": "b2:21:62:8b:a1:33",
            "net19": "72:83:ea:06:52:ed",
            "net2": "0a:d9:27:e8:cf:14",
            "net3": "2a:81:9c:d3:e3:7e",
            "net4": "7a:51:2f:25:59:5a",
            "net5": "6e:69:f3:bc:c9:7a",
            "net6": "62:0a:14:89:5c:bc",
            "net7": "0a:88:08:1d:35:f6",
            "net8": "f6:44:5a:44:83:6b",
            "net9": "32:1c:71:f6:56:20"
        },
        "tof_1_2_9": {
            "net0": "62:0a:c8:3b:53:bf",
            "net1": "ee:a0:29:07:4b:08",
            "net10": "9a:c4:01:55:9e:c0",
            "net11": "c2:83:09:9e:e6:b2",
            "net12": "72:d8:a1:ff:a4:31",
            "net13": "7e:76:14:e3:1a:94",
            "net14": "4e:54:58:b4:10:6a",
            "net15": "5e:af:46:db:fa:95",
            "net16": "2a:b5:25:9a:a4:48",
            "net17": "de:8d:03:cd:fe:9a",
            "net18": "32:3a:9c:8e:5c:e9",
            "net19": "66:d6:e1:bf:de:1c",
            "net2": "7e:57:bb:21:af:ed",
            "net3": "f6:81:9f:11:50:20",
            "net4": "06:79:af:ab:9b:89",
            "net5": "f2:56:f2:03:d8:c1",
            "net6": "5e:f2:6e:e5:a0:fa",
            "net7": "16:97:7b:79:74:ef",
            "net8": "7a:7b:73:4b:c5:d9",
            "net9": "46:05:58:08:f0:4f"
        }
    },
    "failed_machine": "leaf_1_0_1",
    "failure_time": 1613167678.962161
}