{
    "k_leaf": 4,
    "k_top": 4,
    "redundancy_factor": 2,
    "is_k8s": true,
    "machine_mac_addresses": {
        "leaf_1_0_1": {
            "net0": "ce:6a:70:22:0a:b3",
            "net1": "e6:76:70:a4:fe:20",
            "net2": "6a:0f:f8:4a:5d:47",
            "net3": "2e:9d:fa:e1:7d:ca",
            "net4": "46:1d:9f:36:8a:c4"
        },
        "leaf_1_0_2": {
            "net0": "46:d5:db:30:9d:a7",
            "net1": "c2:04:fc:5a:70:ae",
            "net2": "ca:d5:54:ac:46:84",
            "net3": "6a:c5:d6:1e:bd:3b",
            "net4": "a6:f4:d9:52:e4:64"
        },
        "leaf_1_0_3": {
            "net0": "3e:4a:8d:75:29:df",
            "net1": "56:de:bf:38:dd:cf",
            "net2": "0a:2a:01:f0:0b:ec",
            "net3": "72:50:21:ab:0e:05",
            "net4": "a6:91:da:90:b4:df"
        },
        "leaf_1_0_4": {
            "net0": "9e:84:5a:1f:b6:5d",
            "net1": "ea:93:4e:48:5e:15",
            "net2": "4a:43:af:a4:82:a2",
            "net3": "5a:18:97:f1:3e:fa",
            "net4": "9a:d9:33:60:ae:27"
        },
        "leaf_2_0_1": {
            "net0": "32:a9:27:26:4c:92",
            "net1": "32:3e:64:97:be:ab",
            "net2": "de:ba:ef:31:24:e8",
            "net3": "4a:88:f2:8d:c1:d9",
            "net4": "96:66:65:be:fa:06"
        },
        "leaf_2_0_2": {
            "net0": "6e:02:d5:60:6e:74",
            "net1": "4e:3b:c7:09:42:0c",
            "net2": "56:43:a3:7f:91:77",
            "net3": "1e:3b:cf:6e:05:70",
            "net4": "96:1a:c9:69:9a:0f"
        },
        "leaf_2_0_3": {
            "net0": "3a:d4:6a:6d:bb:de",
            "net1": "5e:62:f6:43:1e:fa",
            "net2": "12:3c:7c:6a:87:43",
            "net3": "e2:56:02:84:27:c1",
            "net4": "b6:70:1a:b1:46:43"
        },
        "leaf_2_0_4": {
            "net0": "5a:96:21:b8:30:8d",
            "net1": "ba:0d:68:eb:26:3d",
            "net2": "52:0d:53:c1:51:79",
            "net3": "b2:f0:d8:f0:fc:a3",
            "net4": "da:c1:7d:bd:cf:3f"
        },
        "leaf_3_0_1": {
            "net0": "12:1b:0d:73:c3:73",
            "net1": "36:16:1d:5b:ae:1d",
            "net2": "a6:9f:45:68:41:af",
            "net3": "92:e0:8c:78:d0:34",
            "net4": "0a:8a:d3:c3:f8:83"
        },
        "leaf_3_0_2": {
            "net0": "8a:16:a3:fc:0d:42",
            "net1": "9e:e7:4f:c4:ee:c6",
            "net2": "d2:4f:25:cd:03:28",
            "net3": "e2:30:b6:ed:07:b7",
            "net4": "ba:f0:a8:57:70:0a"
        },
        "leaf_3_0_3": {
            "net0": "5a:70:27:d2:0a:4c",
            "net1": "ca:28:36:70:eb:6d",
            "net2": "0a:2d:65:c5:39:17",
            "net3": "72:a6:a9:df:83:76",
            "net4": "e6:e1:fb:45:3d:ed"
        },
        "leaf_3_0_4": {
            "net0": "72:11:b8:82:6d:f3",
            "net1": "4a:f1:3d:a3:21:e8",
            "net2": "0e:df:36:92:c6:ad",
            "net3": "d2:e4:9a:65:f9:65",
            "net4": "f6:49:14:84:80:c7"
        },
        "leaf_4_0_1": {
            "net0": "06:9c:ec:14:e5:4e",
            "net1": "da:82:28:76:8c:d2",
            "net2": "36:0b:5b:48:16:03",
            "net3": "12:85:cc:c7:c1:aa",
            "net4": "6a:0a:5b:90:ea:d8"
        },
        "leaf_4_0_2": {
            "net0": "f2:c3:0e:94:40:ae",
            "net1": "66:52:96:5c:cc:3a",
            "net2": "4e:77:9a:e0:c8:c4",
            "net3": "ce:40:c3:c9:27:c5",
            "net4": "02:a1:e6:3c:1d:da"
        },
        "leaf_4_0_3": {
            "net0": "16:87:db:cf:fe:ab",
            "net1": "f6:e9:77:46:cc:4b",
            "net2": "ea:83:9d:49:2e:c8",
            "net3": "86:0d:45:a6:06:9a",
            "net4": "0a:d2:c6:94:0b:37"
        },
        "leaf_4_0_4": {
            "net0": "c2:cc:2d:25:a1:7c",
            "net1": "86:7e:4f:66:b2:7c",
            "net2": "9a:37:c7:98:04:0e",
            "net3": "e6:47:a8:4a:24:93",
            "net4": "da:36:b9:6a:84:22"
        },
        "spine_1_1_1": {
            "net0": "22:97:d3:63:7a:91",
            "net1": "d6:8d:45:b6:c6:db",
            "net2": "56:98:3e:c7:31:b7",
            "net3": "76:32:75:0d:f5:86",
            "net4": "7e:f6:cf:9a:6a:3b",
            "net5": "76:21:bf:7d:ef:2a",
            "net6": "16:b6:91:d6:f6:ba",
            "net7": "7a:b9:b2:f7:07:db"
        },
        "spine_1_1_2": {
            "net0": "ea:1c:b0:4b:a2:f4",
            "net1": "f2:fe:71:f6:64:c4",
            "net2": "d6:3f:51:ad:35:eb",
            "net3": "9e:4a:1c:88:28:63",
            "net4": "c6:b9:6d:b7:7d:38",
            "net5": "3a:39:40:43:e2:a4",
            "net6": "62:64:bb:e3:a3:61",
            "net7": "26:68:ad:46:d0:79"
        },
        "spine_1_1_3": {
            "net0": "56:94:91:4e:8a:83",
            "net1": "22:18:9a:38:c0:ce",
            "net2": "1a:d7:36:7b:d9:a0",
            "net3": "7a:d4:64:7b:10:cc",
            "net4": "d2:21:34:42:56:53",
            "net5": "c6:90:74:31:3a:55",
            "net6": "c2:64:17:ea:03:d4",
            "net7": "d6:d6:15:16:62:c5"
        },
        "spine_1_1_4": {
            "net0": "ca:73:d2:f6:3e:95",
            "net1": "fa:47:20:0f:15:a0",
            "net2": "de:38:89:5f:d5:8e",
            "net3": "d6:a0:6b:12:13:de",
            "net4": "46:ab:22:6f:2c:ff",
            "net5": "06:12:fd:65:ac:56",
            "net6": "d2:c5:6a:64:3d:1c",
            "net7": "f6:fc:8e:99:a7:ec"
        },
        "spine_2_1_1": {
            "net0": "2a:ce:07:52:37:8a",
            "net1": "fe:64:2c:67:59:9f",
            "net2": "9a:14:3f:c4:06:54",
            "net3": "8e:fc:df:ba:a7:38",
            "net4": "de:06:c8:6c:43:57",
            "net5": "ca:9b:69:5a:bd:10",
            "net6": "e6:03:d3:15:a2:c8",
            "net7": "02:d6:c9:40:41:94"
        },
        "spine_2_1_2": {
            "net0": "be:18:b7:01:9a:f6",
            "net1": "7a:1e:5e:69:67:dc",
            "net2": "fe:37:ef:64:67:9a",
            "net3": "fe:1a:46:c3:05:5f",
            "net4": "02:8e:b9:a1:b2:54",
            "net5": "ba:b4:15:bc:ce:0d",
            "net6": "42:ef:48:58:45:15",
            "net7": "ae:8a:b7:2c:72:97"
        },
        "spine_2_1_3": {
            "net0": "6a:78:19:75:36:a6",
            "net1": "c2:2c:07:b6:ee:bc",
            "net2": "c6:da:96:8c:69:ab",
            "net3": "2e:05:63:8d:49:b2",
            "net4": "e2:17:6f:2e:b3:2f",
            "net5": "86:fb:b1:db:e9:35",
            "net6": "36:bc:c7:c5:1b:27",
            "net7": "b2:f5:54:06:a4:34"
        },
        "spine_2_1_4": {
            "net0": "32:e9:1a:9e:2a:64",
            "net1": "1a:aa:36:8e:ec:45",
            "net2": "9a:7d:6e:d2:a7:31",
            "net3": "ce:99:e9:10:e4:00",
            "net4": "f6:65:b5:eb:c8:ef",
            "net5": "8a:c0:9a:cd:a8:67",
            "net6": "da:34:f8:a1:2e:cd",
            "net7": "92:ab:94:9c:a7:30"
        },
        "spine_3_1_1": {
            "net0": "9a:96:a8:a2:0e:22",
            "net1": "72:cf:e3:7e:96:9e",
            "net2": "8a:e2:79:ae:31:d5",
            "net3": "f6:dd:7b:b2:39:d1",
            "net4": "12:d8:dc:98:3a:33",
            "net5": "b2:69:d5:c2:8c:7d",
            "net6": "52:0e:be:28:f2:0e",
            "net7": "a2:a1:e9:4e:7e:32"
        },
        "spine_3_1_2": {
            "net0": "f6:73:92:07:49:1f",
            "net1": "16:9c:c8:d1:12:2b",
            "net2": "ee:e4:94:e8:9e:45",
            "net3": "d2:89:ab:c4:70:91",
            "net4": "fe:13:b7:70:22:51",
            "net5": "f6:a5:83:85:2e:14",
            "net6": "36:03:95:8e:6e:54",
            "net7": "86:45:f4:03:bd:4c"
        },
        "spine_3_1_3": {
            "net0": "42:a8:f3:27:42:57",
            "net1": "2e:d2:51:76:f2:08",
            "net2": "82:3d:4c:80:3e:62",
            "net3": "1a:e9:38:8e:55:ad",
            "net4": "ea:2b:6b:fb:c8:34",
            "net5": "4e:c2:44:ad:2c:ed",
            "net6": "76:25:ce:f8:6e:35",
            "net7": "fa:0c:27:e8:23:c5"
        },
        "spine_3_1_4": {
            "net0": "06:d7:c5:b2:73:3b",
            "net1": "ba:85:00:cd:80:82",
            "net2": "b6:38:6c:61:23:f4",
            "net3": "f2:22:08:98:e7:38",
            "net4": "9a:82:e7:62:41:94",
            "net5": "36:73:d3:50:0f:78",
            "net6": "ce:db:0a:86:81:47",
            "net7": "ba:11:89:06:58:b8"
        },
        "spine_4_1_1": {
            "net0": "06:ff:24:28:ef:b3",
            "net1": "2e:8f:f0:b6:0f:aa",
            "net2": "b2:f5:13:5a:f6:4f",
            "net3": "2e:43:8e:0f:90:e7",
            "net4": "8e:5d:0c:ac:61:cb",
            "net5": "46:37:d8:61:a2:16",
            "net6": "36:2a:51:f2:73:92",
            "net7": "1e:a9:32:fb:40:57"
        },
        "spine_4_1_2": {
            "net0": "fe:b1:4a:f4:6c:c3",
            "net1": "26:96:6c:45:c5:a8",
            "net2": "de:51:ea:1b:fa:3d",
            "net3": "26:59:d2:f4:9d:00",
            "net4": "1a:1c:d1:55:e4:36",
            "net5": "d6:bd:b0:e8:6b:b7",
            "net6": "7a:4a:6e:99:67:9d",
            "net7": "16:3a:ff:ed:fc:51"
        },
        "spine_4_1_3": {
            "net0": "06:96:3f:8c:db:d3",
            "net1": "6e:7e:ff:b8:36:0a",
            "net2": "4e:8e:5e:45:13:ca",
            "net3": "ea:c4:29:2b:73:b1",
            "net4": "72:48:be:8c:69:9d",
            "net5": "06:75:90:55:c9:ea",
            "net6": "7a:bf:e6:6a:44:21",
            "net7": "ca:97:8a:23:5e:c9"
        },
        "spine_4_1_4": {
            "net0": "f2:d6:ef:91:ca:4c",
            "net1": "62:16:5e:ea:42:45",
            "net2": "e6:a7:ed:da:ec:42",
            "net3": "8e:31:6b:36:67:21",
            "net4": "96:8c:97:c6:e4:66",
            "net5": "ba:ab:b0:2d:61:42",
            "net6": "ce:3c:96:a0:85:9a",
            "net7": "06:84:9c:81:e5:cb"
        },
        "tof_1_2_1": {
            "net0": "8e:dc:d2:f1:3f:5e",
            "net1": "e6:a2:fa:be:9d:01",
            "net2": "1a:f8:d4:60:18:39",
            "net3": "a6:8b:50:5e:ba:62",
            "net4": "fa:ad:20:92:7c:42",
            "net5": "be:54:f8:6c:98:0e",
            "net6": "fa:35:89:ff:d3:59",
            "net7": "4a:4e:bc:ef:07:63"
        },
        "tof_1_2_2": {
            "net0": "e6:34:c9:bb:f1:20",
            "net1": "c2:b4:32:41:8b:a5",
            "net2": "5a:ec:34:52:91:57",
            "net3": "22:ce:a4:91:03:67",
            "net4": "6a:08:32:84:ee:82",
            "net5": "8a:5d:9f:2c:6c:b0",
            "net6": "66:7b:a6:80:91:38",
            "net7": "36:ae:f9:7b:27:56"
        },
        "tof_1_2_3": {
            "net0": "ca:c1:43:b5:0c:75",
            "net1": "0a:9e:29:37:05:fd",
            "net2": "1a:ed:c3:59:e2:56",
            "net3": "2e:b5:6a:be:26:f0",
            "net4": "96:c4:4d:79:bf:76",
            "net5": "92:00:e5:74:eb:a2",
            "net6": "e2:a7:a6:fa:6e:2a",
            "net7": "5e:2f:01:27:e6:96"
        },
        "tof_1_2_4": {
            "net0": "a2:dc:84:51:9b:a3",
            "net1": "e6:ba:54:13:2b:73",
            "net2": "46:bf:28:2d:5e:5e",
            "net3": "76:3c:2e:6b:63:34",
            "net4": "e2:fc:2b:41:da:47",
            "net5": "c2:b9:77:e9:24:ab",
            "net6": "36:26:7e:60:55:ad",
            "net7": "32:38:a7:3e:6a:c6"
        },
        "tof_2_2_1": {
            "net0": "8a:c5:69:6d:d5:79",
            "net1": "76:52:4b:98:56:fa",
            "net2": "76:36:bb:78:26:50",
            "net3": "c6:1b:73:de:6a:fe",
            "net4": "d6:f7:39:23:f5:96",
            "net5": "96:9d:0b:5b:e1:d4",
            "net6": "ee:43:f1:70:81:f0",
            "net7": "32:e1:cf:e0:0f:c2"
        },
        "tof_2_2_2": {
            "net0": "e2:9b:84:4c:44:4e",
            "net1": "22:6a:7d:5b:de:f3",
            "net2": "36:ac:0a:ad:9b:2b",
            "net3": "2e:96:8f:78:f8:71",
            "net4": "3e:c6:cb:90:6a:f2",
            "net5": "da:3a:45:62:c7:9b",
            "net6": "ee:28:e4:79:f8:53",
            "net7": "22:6e:80:0e:e3:48"
        },
        "tof_2_2_3": {
            "net0": "42:90:64:a2:4d:46",
            "net1": "d2:77:43:a0:d1:73",
            "net2": "12:c1:b4:40:cc:b0",
            "net3": "d2:ff:fb:bc:8b:9c",
            "net4": "c2:31:4d:ad:9d:a3",
            "net5": "6a:46:82:44:6d:94",
            "net6": "d6:84:29:c1:71:82",
            "net7": "1a:9c:6e:88:5c:f0"
        },
        "tof_2_2_4": {
            "net0": "9a:ae:7c:2c:e4:36",
            "net1": "b6:94:e9:e0:6b:ba",
            "net2": "12:61:f8:7c:02:d1",
            "net3": "d2:1a:34:1f:0a:dc",
            "net4": "d2:33:ee:a2:d9:32",
            "net5": "8a:c8:8b:c4:82:ba",
            "net6": "ea:9c:43:5b:b4:91",
            "net7": "46:99:0d:cc:87:7e"
        }
    },
    "failed_machine": "leaf_1_0_1",
    "failure_time": {
        "leaf_1_0_1": 1622551002.32361,
        "leaf_1_0_2": 1622551002.3377097,
        "leaf_1_0_3": 1622551002.346572,
        "leaf_1_0_4": 1622551002.3564708,
        "leaf_2_0_1": 1622551002.3645556,
        "leaf_2_0_2": 1622551002.3239174,
        "leaf_2_0_3": 1622551002.3357468,
        "leaf_2_0_4": 1622551002.3454814,
        "leaf_3_0_1": 1622551002.3536003,
        "leaf_3_0_2": 1622551002.3591197,
        "leaf_3_0_3": 1622551002.372571,
        "leaf_3_0_4": 1622551002.3844361,
        "leaf_4_0_1": 1622551002.3922637,
        "leaf_4_0_2": 1622551002.3986468,
        "leaf_4_0_3": 1622551002.4148624,
        "leaf_4_0_4": 1622551002.373101,
        "spine_1_1_1": 1622551002.384601,
        "spine_1_1_2": 1622551002.3953624,
        "spine_1_1_3": 1622551002.4042852,
        "spine_1_1_4": 1622551002.4130776,
        "spine_2_1_1": 1622551002.4266648,
        "spine_2_1_2": 1622551002.438283,
        "spine_2_1_3": 1622551002.4484248,
        "spine_2_1_4": 1622551002.460354,
        "spine_3_1_1": 1622551002.4699244,
        "spine_3_1_2": 1622551002.4264429,
        "spine_3_1_3": 1622551002.4358394,
        "spine_3_1_4": 1622551002.443058,
        "spine_4_1_1": 1622551002.4519846,
        "spine_4_1_2": 1622551002.4651887,
        "spine_4_1_3": 1622551002.4728465,
        "spine_4_1_4": 1622551002.4853425,
        "tof_1_2_1": 1622551002.4930851,
        "tof_1_2_2": 1622551002.4997962,
        "tof_1_2_3": 1622551002.510999,
        "tof_1_2_4": 1622551002.4793212,
        "tof_2_2_1": 1622551002.4874196,
        "tof_2_2_2": 1622551002.4956605,
        "tof_2_2_3": 1622551002.5037045,
        "tof_2_2_4": 1622551002.5136602
    }
}