{
    "description": "Scenario 4b: Spine spine_1_1_1 failure and recovery with BGP",
    "k_leaf": 6,
    "k_top": 6,
    "redundancy_factor": 2,
    "is_k8s": true,
    "machine_mac_addresses": {
        "leaf_1_0_1": {
            "net0": "32:77:9a:ae:33:cf",
            "net1": "8e:d6:5f:87:b3:8c",
            "net2": "ce:1f:9a:01:92:fe",
            "net3": "02:a8:7c:ba:bd:05",
            "net4": "fe:f4:75:2a:16:15",
            "net5": "02:81:d6:65:72:12",
            "net6": "9a:b0:bf:60:4b:21"
        },
        "leaf_1_0_2": {
            "net0": "76:81:be:e0:f6:84",
            "net1": "56:10:82:a2:a7:a2",
            "net2": "9e:19:84:d4:3d:5c",
            "net3": "e2:67:90:e7:83:ca",
            "net4": "2a:09:6c:52:9c:09",
            "net5": "9a:0b:96:b2:b8:77",
            "net6": "0a:83:b0:83:45:ed"
        },
        "leaf_1_0_3": {
            "net0": "c6:1b:dc:07:c9:01",
            "net1": "36:88:93:31:30:72",
            "net2": "ca:10:ba:d1:8d:0b",
            "net3": "e6:0b:97:ab:a7:15",
            "net4": "ce:23:e2:48:12:15",
            "net5": "aa:d3:71:9d:0f:c3",
            "net6": "ee:aa:25:2c:7d:bf"
        },
        "leaf_1_0_4": {
            "net0": "46:11:d8:96:4e:59",
            "net1": "f2:43:1e:3a:32:b8",
            "net2": "9e:8e:56:4b:dd:9b",
            "net3": "6e:4d:90:19:ad:97",
            "net4": "92:78:0b:7f:1e:c9",
            "net5": "f6:e6:5c:dd:6b:bf",
            "net6": "9e:02:0c:36:c5:c6"
        },
        "leaf_1_0_5": {
            "net0": "12:03:3a:61:f9:a3",
            "net1": "da:32:49:35:3c:74",
            "net2": "e2:21:37:99:e9:f3",
            "net3": "9a:4a:17:fd:3c:81",
            "net4": "f2:83:18:75:f1:25",
            "net5": "c2:86:63:7c:83:9f",
            "net6": "7e:ce:76:6e:e8:19"
        },
        "leaf_1_0_6": {
            "net0": "46:15:fa:0e:e3:3d",
            "net1": "fa:82:25:09:4e:15",
            "net2": "aa:a2:0f:74:33:c2",
            "net3": "ae:eb:a9:88:94:68",
            "net4": "26:18:3d:38:53:ef",
            "net5": "ea:29:c1:7b:c8:7c",
            "net6": "4e:5c:6a:53:9e:d9"
        },
        "leaf_2_0_1": {
            "net0": "4a:3f:a4:da:55:e4",
            "net1": "6a:f7:a3:cf:bf:7a",
            "net2": "b2:b2:b8:bb:29:b7",
            "net3": "9a:4f:64:8c:ad:55",
            "net4": "8e:16:59:21:3a:41",
            "net5": "52:dc:0a:e0:65:4e",
            "net6": "56:4f:3d:42:4d:bd"
        },
        "leaf_2_0_2": {
            "net0": "16:39:7c:51:05:11",
            "net1": "5a:51:9e:5f:eb:ea",
            "net2": "36:e1:84:bd:e3:7a",
            "net3": "4a:94:32:0e:2b:d5",
            "net4": "0e:89:4e:2a:2a:bf",
            "net5": "ee:6f:a0:f3:fe:95",
            "net6": "96:91:db:ee:fc:f1"
        },
        "leaf_2_0_3": {
            "net0": "12:66:c9:6a:4a:a7",
            "net1": "4a:6a:d3:df:04:ef",
            "net2": "1a:70:3c:fc:31:df",
            "net3": "56:da:f8:0a:71:47",
            "net4": "7e:a7:bd:e6:ca:67",
            "net5": "e2:1b:56:dd:47:82",
            "net6": "66:7a:c9:f1:f4:70"
        },
        "leaf_2_0_4": {
            "net0": "aa:64:4f:a7:f8:73",
            "net1": "22:da:6b:3b:6a:87",
            "net2": "62:b5:e7:c5:10:eb",
            "net3": "8e:03:7b:7d:9e:c8",
            "net4": "92:59:60:f3:e7:a6",
            "net5": "42:92:12:0e:8b:f1",
            "net6": "2a:09:a3:7c:16:bf"
        },
        "leaf_2_0_5": {
            "net0": "42:9b:55:6a:12:b8",
            "net1": "26:a5:e3:17:c8:9a",
            "net2": "0a:e7:4e:e7:ac:2d",
            "net3": "0e:8d:58:a0:ce:2b",
            "net4": "de:02:21:28:90:91",
            "net5": "9e:3f:b5:e5:73:f7",
            "net6": "b2:45:a3:f8:1c:4f"
        },
        "leaf_2_0_6": {
            "net0": "82:f7:42:11:d9:68",
            "net1": "fe:8c:74:63:03:79",
            "net2": "b6:1d:3c:3d:af:47",
            "net3": "22:f1:cb:dd:2d:b8",
            "net4": "32:fa:69:be:72:63",
            "net5": "3a:08:c3:62:91:9c",
            "net6": "e6:0a:72:4f:2a:4a"
        },
        "leaf_3_0_1": {
            "net0": "1e:c1:11:75:86:04",
            "net1": "ee:8b:f3:1c:07:63",
            "net2": "6a:a3:27:93:39:2c",
            "net3": "ca:ef:b3:49:6b:b7",
            "net4": "6a:ed:e4:60:49:91",
            "net5": "82:e6:94:d4:d5:6b",
            "net6": "3e:e3:3c:a4:b0:77"
        },
        "leaf_3_0_2": {
            "net0": "3a:98:68:8e:84:90",
            "net1": "ca:dc:9c:9d:5d:d7",
            "net2": "66:25:e7:d3:e2:cb",
            "net3": "aa:62:72:46:3f:4c",
            "net4": "f6:40:2e:02:8e:17",
            "net5": "ce:c2:14:6a:0a:d9",
            "net6": "4a:a3:fb:1a:92:f4"
        },
        "leaf_3_0_3": {
            "net0": "96:1c:f5:24:50:1d",
            "net1": "3e:6a:35:4c:b5:55",
            "net2": "a2:c1:0b:f4:6a:dc",
            "net3": "02:d1:0c:cc:46:ec",
            "net4": "a2:85:15:03:63:2d",
            "net5": "f6:a1:86:e4:8b:0d",
            "net6": "e2:0b:c5:60:ac:4c"
        },
        "leaf_3_0_4": {
            "net0": "ce:43:ed:1a:fb:2d",
            "net1": "be:11:bc:d0:42:2e",
            "net2": "86:3b:40:5b:3b:87",
            "net3": "ae:59:ce:e8:28:d8",
            "net4": "ae:33:f8:19:39:55",
            "net5": "fa:f6:9d:ee:d1:59",
            "net6": "1e:23:ef:09:07:43"
        },
        "leaf_3_0_5": {
            "net0": "76:c3:b0:f2:b5:b3",
            "net1": "f2:ef:73:3e:6a:ad",
            "net2": "76:d6:4c:8d:cd:2d",
            "net3": "9a:3a:f7:8b:4b:ec",
            "net4": "fe:a7:64:df:ba:53",
            "net5": "7a:e6:3e:ba:8d:1e",
            "net6": "32:06:62:f6:01:31"
        },
        "leaf_3_0_6": {
            "net0": "fe:8f:77:54:55:ad",
            "net1": "52:25:f9:d2:f7:e2",
            "net2": "86:37:f1:2a:f7:7d",
            "net3": "b2:f3:9f:11:01:62",
            "net4": "86:34:cf:cc:4d:98",
            "net5": "0e:29:69:39:03:59",
            "net6": "32:36:48:37:0d:0d"
        },
        "leaf_4_0_1": {
            "net0": "ce:ca:9f:68:48:42",
            "net1": "0e:73:9b:f7:2e:ee",
            "net2": "0a:33:89:f0:0c:d6",
            "net3": "c6:1f:e6:bb:3c:5b",
            "net4": "5e:fd:7f:2e:22:52",
            "net5": "0e:24:42:0b:91:bc",
            "net6": "06:02:d6:bb:13:c7"
        },
        "leaf_4_0_2": {
            "net0": "0e:70:cd:e5:fe:8b",
            "net1": "06:0c:0e:3a:47:b8",
            "net2": "52:69:5c:01:04:7b",
            "net3": "a6:06:8b:39:52:5f",
            "net4": "9a:83:c3:ea:5f:d2",
            "net5": "32:d1:89:c7:00:de",
            "net6": "d6:a3:9a:3f:99:68"
        },
        "leaf_4_0_3": {
            "net0": "7a:f6:21:c7:95:b1",
            "net1": "86:1a:49:de:6a:47",
            "net2": "c6:8e:ed:c1:a5:35",
            "net3": "32:9c:5f:d8:92:aa",
            "net4": "22:82:e9:49:28:dd",
            "net5": "76:16:8a:09:af:5c",
            "net6": "7e:04:40:6f:0d:ef"
        },
        "leaf_4_0_4": {
            "net0": "4e:c3:c2:0e:2c:84",
            "net1": "32:f7:06:8b:6d:ce",
            "net2": "1e:db:13:b8:eb:f9",
            "net3": "4a:46:af:14:5e:8d",
            "net4": "d2:22:84:16:55:c0",
            "net5": "62:19:28:46:8d:29",
            "net6": "be:25:7c:d0:e1:01"
        },
        "leaf_4_0_5": {
            "net0": "b6:41:20:89:10:36",
            "net1": "b6:f0:d9:0e:34:d2",
            "net2": "76:8c:62:fb:95:86",
            "net3": "76:ee:18:79:9f:e7",
            "net4": "c6:14:7b:3d:8e:07",
            "net5": "02:bf:b2:07:24:78",
            "net6": "42:da:57:70:29:2a"
        },
        "leaf_4_0_6": {
            "net0": "c6:21:a1:20:e1:ab",
            "net1": "d6:8f:f9:d3:4c:d3",
            "net2": "22:df:98:b3:3b:37",
            "net3": "c6:51:bb:4c:de:d1",
            "net4": "d6:ea:c5:40:62:6e",
            "net5": "0a:11:8f:fa:7d:f3",
            "net6": "66:38:d0:7f:f8:2e"
        },
        "leaf_5_0_1": {
            "net0": "86:3d:3b:8a:4c:3f",
            "net1": "86:f8:72:20:42:07",
            "net2": "52:ee:17:33:28:24",
            "net3": "4a:b9:69:c4:85:66",
            "net4": "ae:0e:05:14:a2:93",
            "net5": "06:73:2f:b9:5a:58",
            "net6": "32:55:6c:34:f1:bd"
        },
        "leaf_5_0_2": {
            "net0": "1a:32:01:4a:1f:9c",
            "net1": "ce:26:ea:9c:18:ee",
            "net2": "ba:d3:bf:db:68:fc",
            "net3": "3e:ce:86:8e:28:a6",
            "net4": "ce:b6:d1:74:e2:5c",
            "net5": "c2:da:13:c2:07:2f",
            "net6": "22:95:50:42:f4:65"
        },
        "leaf_5_0_3": {
            "net0": "6e:60:e1:76:35:73",
            "net1": "5e:01:fa:5a:75:d7",
            "net2": "fa:aa:c8:c8:67:2c",
            "net3": "de:e8:a6:e1:f7:25",
            "net4": "9a:93:f9:d1:77:3f",
            "net5": "36:72:e4:12:f8:42",
            "net6": "4e:96:31:73:e7:08"
        },
        "leaf_5_0_4": {
            "net0": "02:87:a9:64:e1:2a",
            "net1": "2e:0a:e3:07:6b:0b",
            "net2": "92:68:56:e6:54:bf",
            "net3": "e2:f3:e5:74:41:74",
            "net4": "a2:20:c7:6b:35:c5",
            "net5": "e6:b1:70:dc:10:ec",
            "net6": "6a:94:5d:9b:28:2d"
        },
        "leaf_5_0_5": {
            "net0": "26:38:67:2d:78:f5",
            "net1": "3e:a5:0a:4c:df:29",
            "net2": "36:a3:59:47:72:26",
            "net3": "3e:b6:d6:a7:ba:41",
            "net4": "2a:6a:db:b2:20:e4",
            "net5": "f6:8e:e1:7e:aa:3d",
            "net6": "3a:e7:61:e4:e1:49"
        },
        "leaf_5_0_6": {
            "net0": "fa:00:35:85:b1:c5",
            "net1": "16:c4:12:e9:f7:09",
            "net2": "da:80:80:eb:f5:0b",
            "net3": "3e:82:70:57:62:e7",
            "net4": "76:cb:ac:0f:6b:37",
            "net5": "d6:4e:f3:59:06:c9",
            "net6": "46:60:73:96:94:3c"
        },
        "leaf_6_0_1": {
            "net0": "5e:18:ab:27:35:50",
            "net1": "b2:6d:13:da:51:7f",
            "net2": "06:0a:be:df:8b:55",
            "net3": "32:fe:e3:1a:ad:bc",
            "net4": "ee:bb:cd:d7:f4:37",
            "net5": "da:56:07:cc:34:b8",
            "net6": "f2:9e:11:c6:b7:a0"
        },
        "leaf_6_0_2": {
            "net0": "5a:a0:ee:ba:98:27",
            "net1": "e2:a6:41:3e:05:0f",
            "net2": "1a:ba:66:88:07:f1",
            "net3": "9e:da:38:54:83:6e",
            "net4": "0e:7a:97:da:d4:8c",
            "net5": "46:27:97:6e:2a:00",
            "net6": "c6:ba:bd:f3:b2:2e"
        },
        "leaf_6_0_3": {
            "net0": "b2:0d:b1:16:53:1b",
            "net1": "5e:96:df:06:20:92",
            "net2": "7a:23:70:f9:f9:29",
            "net3": "ee:02:2f:55:d8:af",
            "net4": "16:43:34:ae:8c:e3",
            "net5": "3e:63:95:15:5b:18",
            "net6": "e2:69:54:51:ae:c2"
        },
        "leaf_6_0_4": {
            "net0": "0e:c8:17:2b:83:1c",
            "net1": "82:44:1d:ab:fd:fb",
            "net2": "ea:7c:8e:78:b0:e6",
            "net3": "a6:bc:6f:ae:22:47",
            "net4": "ca:88:ac:75:bd:20",
            "net5": "6a:3e:25:b1:c1:86",
            "net6": "9e:69:a7:14:83:00"
        },
        "leaf_6_0_5": {
            "net0": "aa:38:1f:6e:ef:55",
            "net1": "16:ad:b0:1a:3e:73",
            "net2": "ca:e9:02:a5:b9:ef",
            "net3": "ae:06:f8:28:e1:aa",
            "net4": "c2:a4:31:f2:10:bd",
            "net5": "0e:f7:2c:f6:c4:32",
            "net6": "6a:71:ab:47:c2:05"
        },
        "leaf_6_0_6": {
            "net0": "ca:d3:b3:d0:d2:2b",
            "net1": "8a:dc:80:ff:50:6d",
            "net2": "be:fc:c5:ad:9c:5c",
            "net3": "e2:a3:73:3b:d6:1c",
            "net4": "1a:4f:ed:33:49:88",
            "net5": "fa:b9:db:fa:2d:6f",
            "net6": "32:c9:cd:0b:ba:4f"
        },
        "spine_1_1_1": {
            "net0": "ba:26:53:c8:1d:32",
            "net1": "4a:84:e5:a1:60:9b",
            "net10": "2a:18:9b:3a:05:0b",
            "net11": "ae:b2:be:ed:a3:de",
            "net2": "9e:27:fb:dd:0e:17",
            "net3": "12:ef:f5:13:36:67",
            "net4": "b2:4e:ae:fa:76:16",
            "net5": "5a:ad:5e:aa:04:a1",
            "net6": "7e:1f:26:c0:df:1b",
            "net7": "16:bf:3a:69:ec:a4",
            "net8": "ca:53:0d:af:0d:7f",
            "net9": "b6:f9:7e:8c:58:ff"
        },
        "spine_1_1_2": {
            "net0": "de:dc:d7:5d:ca:66",
            "net1": "66:50:dc:39:49:45",
            "net10": "f6:87:d0:3f:87:cc",
            "net11": "32:4c:0a:05:28:5b",
            "net2": "56:8b:16:87:2f:4c",
            "net3": "66:7c:9f:1e:a6:c3",
            "net4": "4e:90:68:e3:83:ab",
            "net5": "4a:b2:66:24:b5:2c",
            "net6": "7e:27:07:6d:a5:fd",
            "net7": "ca:e1:05:16:51:4e",
            "net8": "ae:0f:f4:5c:6d:f0",
            "net9": "f2:5f:1a:43:49:7c"
        },
        "spine_1_1_3": {
            "net0": "e6:4d:a7:dd:2d:21",
            "net1": "5a:3c:55:ba:65:a6",
            "net10": "52:4d:27:46:0e:ff",
            "net11": "0a:29:f0:b5:5c:19",
            "net2": "ee:eb:ff:92:23:cc",
            "net3": "ee:66:17:7a:33:c7",
            "net4": "b6:ed:d7:c6:2a:0c",
            "net5": "3a:f7:c0:31:3f:ac",
            "net6": "76:21:42:cf:4f:6a",
            "net7": "6a:b0:d9:a8:5d:a5",
            "net8": "2a:8a:e0:2f:c6:d9",
            "net9": "92:1f:b1:12:75:dc"
        },
        "spine_1_1_4": {
            "net0": "de:40:20:41:7b:bc",
            "net1": "82:02:ad:2b:b0:d2",
            "net10": "e6:96:6a:7c:6f:b7",
            "net11": "72:f2:5b:5f:5c:6c",
            "net2": "86:c2:b8:18:86:35",
            "net3": "f2:e1:5a:36:8e:8b",
            "net4": "7e:6c:3c:96:b4:d1",
            "net5": "5a:89:95:c7:4a:92",
            "net6": "7a:35:b1:ea:0d:78",
            "net7": "8e:25:9a:67:73:19",
            "net8": "6a:5c:0d:a9:f8:1f",
            "net9": "42:a2:1c:e5:7e:4b"
        },
        "spine_1_1_5": {
            "net0": "2a:d4:49:fd:7c:5c",
            "net1": "4e:cc:86:e4:36:f0",
            "net10": "66:8c:00:8e:c3:20",
            "net11": "de:d5:69:7e:00:18",
            "net2": "a6:c7:c4:ae:01:13",
            "net3": "da:dc:4c:09:33:9d",
            "net4": "c6:3a:5b:7c:0c:3e",
            "net5": "a6:77:24:72:3e:35",
            "net6": "aa:6f:02:fd:df:ba",
            "net7": "ce:79:93:55:2b:4b",
            "net8": "3a:df:a5:bf:52:fc",
            "net9": "ea:63:87:0a:02:42"
        },
        "spine_1_1_6": {
            "net0": "c6:ec:5c:ab:8b:54",
            "net1": "ae:52:d5:f9:c2:74",
            "net10": "da:0d:6d:44:b5:81",
            "net11": "4e:82:cf:cc:26:5c",
            "net2": "ae:23:9c:2e:0d:77",
            "net3": "4a:90:82:bf:91:0a",
            "net4": "ea:7d:e9:55:ed:0d",
            "net5": "02:6c:86:20:a5:18",
            "net6": "1e:1b:52:33:89:22",
            "net7": "ee:62:fb:57:a1:6b",
            "net8": "d6:91:06:03:03:26",
            "net9": "66:e1:64:69:e4:29"
        },
        "spine_2_1_1": {
            "net0": "d6:b9:8e:2f:65:75",
            "net1": "5a:ff:95:bd:98:23",
            "net10": "ca:0e:e0:f7:e9:57",
            "net11": "da:d1:5f:ae:aa:26",
            "net2": "6e:2e:4c:3d:0c:d1",
            "net3": "02:67:ee:29:38:db",
            "net4": "d2:99:ca:c9:87:83",
            "net5": "02:3f:b0:5f:f1:75",
            "net6": "ae:45:04:26:e4:93",
            "net7": "2e:8e:99:87:95:54",
            "net8": "ca:ea:3a:36:5e:8e",
            "net9": "5e:53:54:fc:05:31"
        },
        "spine_2_1_2": {
            "net0": "0e:b7:46:66:45:00",
            "net1": "aa:24:8a:3e:ce:33",
            "net10": "1a:0e:ca:e7:96:d4",
            "net11": "0a:84:11:34:a9:36",
            "net2": "a2:30:f0:ff:4e:d3",
            "net3": "be:45:4d:89:c5:47",
            "net4": "3a:da:f5:8a:bc:28",
            "net5": "82:3c:34:9e:3b:19",
            "net6": "86:bc:d9:c0:52:15",
            "net7": "36:d1:3d:2a:95:d7",
            "net8": "f2:10:c7:fd:72:8e",
            "net9": "82:47:43:a8:be:d4"
        },
        "spine_2_1_3": {
            "net0": "02:89:d2:c5:f4:4c",
            "net1": "92:dc:aa:3f:d0:d7",
            "net10": "2a:4c:ca:f6:c1:69",
            "net11": "5a:55:57:7f:3a:39",
            "net2": "d6:5e:1f:80:d9:01",
            "net3": "a6:1f:74:13:01:76",
            "net4": "f6:04:09:4a:c1:8d",
            "net5": "36:56:21:85:07:76",
            "net6": "3a:f5:fb:19:c1:0d",
            "net7": "ee:3e:ed:a4:a9:d6",
            "net8": "ea:36:a2:c9:d6:5c",
            "net9": "3e:d0:14:d8:87:6b"
        },
        "spine_2_1_4": {
            "net0": "fa:b7:b8:a1:e2:5d",
            "net1": "d2:53:1e:19:ea:b0",
            "net10": "02:0f:f9:99:5a:ec",
            "net11": "be:4f:3d:09:53:e3",
            "net2": "82:34:61:ca:41:c6",
            "net3": "ca:4f:55:ac:21:8f",
            "net4": "9e:e0:87:1d:ed:df",
            "net5": "4e:7e:27:f1:5c:a9",
            "net6": "ee:47:33:e3:74:06",
            "net7": "66:00:16:48:34:93",
            "net8": "aa:0c:19:5d:86:42",
            "net9": "c6:df:b3:41:06:7e"
        },
        "spine_2_1_5": {
            "net0": "02:55:45:0f:16:9a",
            "net1": "26:9a:bc:0d:6d:aa",
            "net10": "ca:91:e9:32:0c:9d",
            "net11": "ba:c6:23:4d:26:6f",
            "net2": "7a:bd:c0:6f:fd:21",
            "net3": "3e:06:05:30:25:82",
            "net4": "8a:0a:39:a2:3c:d4",
            "net5": "be:98:ff:74:41:f5",
            "net6": "56:ed:f5:72:cb:7b",
            "net7": "56:92:01:a6:32:a8",
            "net8": "3a:a3:a4:2e:25:7e",
            "net9": "ea:3a:5e:d7:73:d9"
        },
        "spine_2_1_6": {
            "net0": "26:d8:ff:33:58:e5",
            "net1": "ce:86:42:d6:cb:4d",
            "net10": "8a:a1:77:00:dd:fe",
            "net11": "7e:7d:6a:a8:d6:4f",
            "net2": "96:7b:da:5d:47:97",
            "net3": "96:49:f5:c5:b3:9d",
            "net4": "86:ef:d7:a9:c6:d7",
            "net5": "6a:da:e5:dd:77:ed",
            "net6": "da:e8:97:0f:e9:88",
            "net7": "a6:dd:02:25:21:7f",
            "net8": "06:2e:d7:61:6e:10",
            "net9": "e6:e0:c3:7d:e1:58"
        },
        "spine_3_1_1": {
            "net0": "82:dd:60:1c:64:3e",
            "net1": "b6:f3:8d:0a:5c:1e",
            "net10": "36:ac:80:5e:40:1f",
            "net11": "d2:ec:02:f2:02:05",
            "net2": "a2:9a:8a:2f:e1:7e",
            "net3": "2e:50:fd:ff:37:bb",
            "net4": "1a:1d:8f:98:1e:33",
            "net5": "26:b1:3a:24:96:6f",
            "net6": "2e:cd:cc:26:a4:60",
            "net7": "e2:e5:bb:87:5f:9a",
            "net8": "ee:ac:23:3d:3c:60",
            "net9": "c6:80:51:fe:f7:03"
        },
        "spine_3_1_2": {
            "net0": "a6:cc:4f:af:94:59",
            "net1": "42:ea:cf:38:fd:b2",
            "net10": "f2:76:74:5c:6b:bc",
            "net11": "3e:66:7d:23:df:ae",
            "net2": "32:cc:bc:c7:23:4e",
            "net3": "5e:10:47:0f:b7:aa",
            "net4": "96:60:8b:a3:f5:11",
            "net5": "7a:3f:39:33:d0:03",
            "net6": "62:17:c4:06:dc:20",
            "net7": "0a:bb:19:70:b2:5a",
            "net8": "3a:cf:52:10:6b:26",
            "net9": "96:3e:e0:20:cb:4a"
        },
        "spine_3_1_3": {
            "net0": "02:65:1a:60:59:01",
            "net1": "92:b8:2b:36:5f:ee",
            "net10": "ee:3f:ca:33:0c:de",
            "net11": "6e:96:75:df:b6:37",
            "net2": "9a:a8:f2:c4:d5:06",
            "net3": "7a:a9:af:97:6d:e0",
            "net4": "2e:d9:0b:27:47:6a",
            "net5": "62:d3:f2:c8:db:ff",
            "net6": "76:09:f0:65:73:60",
            "net7": "72:3f:47:c4:a6:d2",
            "net8": "6e:15:be:f3:2f:2c",
            "net9": "52:51:70:92:64:25"
        },
        "spine_3_1_4": {
            "net0": "5a:48:1a:72:06:86",
            "net1": "de:1a:84:67:7c:a3",
            "net10": "8a:ec:bc:6e:d4:1c",
            "net11": "d2:14:a8:b2:fe:7b",
            "net2": "9e:94:72:9b:06:2f",
            "net3": "82:65:4d:00:5d:21",
            "net4": "3a:06:88:79:e7:52",
            "net5": "52:3b:51:48:0c:43",
            "net6": "56:69:21:22:a9:2f",
            "net7": "fe:6a:4a:1c:74:e6",
            "net8": "fa:f0:67:84:d8:df",
            "net9": "6a:5c:68:ba:5c:c0"
        },
        "spine_3_1_5": {
            "net0": "72:8a:fe:f3:b3:00",
            "net1": "36:e3:07:a7:16:82",
            "net10": "46:bc:fb:c2:29:13",
            "net11": "ee:79:89:1b:f0:db",
            "net2": "72:1c:f1:f5:41:4e",
            "net3": "fe:77:72:d0:d9:16",
            "net4": "ee:b2:49:f3:7b:9b",
            "net5": "7a:ae:cb:4a:b8:82",
            "net6": "7e:5a:42:2d:35:d0",
            "net7": "02:31:55:73:87:21",
            "net8": "6e:5c:f1:7d:a6:61",
            "net9": "f2:86:92:31:9f:f0"
        },
        "spine_3_1_6": {
            "net0": "46:7e:3c:d8:67:ac",
            "net1": "ae:a6:79:cb:81:02",
            "net10": "66:4d:af:4f:1f:5c",
            "net11": "d2:c3:89:a1:b1:e2",
            "net2": "76:59:c9:aa:07:d1",
            "net3": "86:d8:db:61:eb:84",
            "net4": "0e:ca:d3:23:bc:bf",
            "net5": "46:b6:c4:24:83:b3",
            "net6": "22:26:9b:a2:28:b8",
            "net7": "3e:f8:c6:c4:df:87",
            "net8": "92:28:34:d9:2b:b7",
            "net9": "e6:92:b2:b3:a7:0c"
        },
        "spine_4_1_1": {
            "net0": "36:c8:e3:43:fd:8d",
            "net1": "0e:cb:7b:d0:0c:4b",
            "net10": "66:63:3b:42:57:99",
            "net11": "26:77:7f:ff:b6:9d",
            "net2": "ee:04:a7:bd:eb:44",
            "net3": "7a:f7:59:9a:db:ed",
            "net4": "5e:42:e2:a3:a2:1b",
            "net5": "9e:e8:79:53:7a:ed",
            "net6": "92:33:9c:38:25:2a",
            "net7": "52:d3:3f:85:a3:48",
            "net8": "0a:b9:95:ff:6e:6b",
            "net9": "1a:15:8f:e2:47:eb"
        },
        "spine_4_1_2": {
            "net0": "d6:7a:d4:9d:24:d3",
            "net1": "42:64:9f:4c:59:0c",
            "net10": "5e:4a:a3:61:02:70",
            "net11": "d6:a7:79:4f:4f:98",
            "net2": "96:b4:6f:d7:fc:3f",
            "net3": "da:67:fb:1e:02:92",
            "net4": "7a:dc:ab:b9:99:f9",
            "net5": "ba:eb:6e:c0:40:9a",
            "net6": "f6:2e:13:5d:40:25",
            "net7": "1a:be:26:36:1f:ee",
            "net8": "e2:35:eb:cf:0f:a1",
            "net9": "2e:25:a1:23:7e:02"
        },
        "spine_4_1_3": {
            "net0": "96:88:33:94:cb:33",
            "net1": "3e:f4:a4:b3:3c:dd",
            "net10": "52:66:bd:47:4c:27",
            "net11": "fe:70:b5:2d:ba:e7",
            "net2": "52:ed:fe:ec:46:4f",
            "net3": "ee:ce:58:1b:aa:bb",
            "net4": "f6:92:21:5e:7c:ea",
            "net5": "82:27:4e:74:a7:c5",
            "net6": "de:4c:9e:e0:21:20",
            "net7": "56:b3:0a:cd:a1:df",
            "net8": "aa:70:52:a7:bb:eb",
            "net9": "66:78:6e:36:86:4d"
        },
        "spine_4_1_4": {
            "net0": "1e:cc:f7:f5:f2:4f",
            "net1": "7e:a1:e2:70:7a:fd",
            "net10": "56:1c:87:86:0b:9d",
            "net11": "0a:4e:79:0a:df:af",
            "net2": "ba:f8:8a:87:25:af",
            "net3": "f2:48:43:d8:1a:20",
            "net4": "42:0a:f7:30:93:5d",
            "net5": "12:e1:db:b4:18:6e",
            "net6": "7e:f3:3d:99:dc:41",
            "net7": "0e:d1:b4:13:a7:81",
            "net8": "ba:f4:ce:81:88:da",
            "net9": "e2:48:fe:34:21:21"
        },
        "spine_4_1_5": {
            "net0": "6e:12:06:4f:1c:95",
            "net1": "fe:61:70:03:34:3e",
            "net10": "6a:73:26:22:5b:72",
            "net11": "46:98:b3:da:50:30",
            "net2": "5e:17:51:ec:a9:fd",
            "net3": "7a:52:29:62:e5:a8",
            "net4": "ea:2c:23:a2:39:60",
            "net5": "66:75:c9:be:fb:1c",
            "net6": "56:ff:68:2c:55:c2",
            "net7": "be:db:d3:14:62:1d",
            "net8": "ca:aa:f8:2c:10:bb",
            "net9": "96:2a:27:2b:ac:ee"
        },
        "spine_4_1_6": {
            "net0": "42:fc:bb:d9:96:37",
            "net1": "5a:3e:75:84:92:e1",
            "net10": "4a:20:03:76:9d:15",
            "net11": "be:50:fd:56:e1:9a",
            "net2": "62:4e:41:d2:05:49",
            "net3": "a2:17:06:9f:6f:1b",
            "net4": "ca:9f:e9:b9:b0:f1",
            "net5": "ca:84:66:1e:31:78",
            "net6": "4a:c6:b4:fb:47:f4",
            "net7": "42:a0:ad:9e:16:84",
            "net8": "8a:f0:d0:bd:81:9b",
            "net9": "ce:a2:1a:92:ba:bb"
        },
        "spine_5_1_1": {
            "net0": "ae:e2:5e:7d:d2:dd",
            "net1": "36:97:ab:8f:c9:4d",
            "net10": "ee:03:60:86:7d:0c",
            "net11": "a2:e4:c1:46:72:54",
            "net2": "42:d3:46:bb:bc:2c",
            "net3": "82:66:97:e9:b8:52",
            "net4": "92:f3:6a:f9:ae:88",
            "net5": "a6:44:41:26:c4:9a",
            "net6": "be:ac:ce:36:1f:32",
            "net7": "ce:63:2f:c1:cf:54",
            "net8": "be:f8:3c:45:26:84",
            "net9": "aa:b9:9b:ad:de:5e"
        },
        "spine_5_1_2": {
            "net0": "aa:6f:04:1f:ba:6c",
            "net1": "76:62:5b:9c:2f:85",
            "net10": "9e:46:47:33:6d:2f",
            "net11": "4a:d5:05:b7:d9:06",
            "net2": "12:28:d9:33:5a:ba",
            "net3": "9e:e6:3a:d0:1d:d3",
            "net4": "72:09:16:84:07:98",
            "net5": "3a:98:2f:f6:21:01",
            "net6": "ca:55:a1:81:5d:ce",
            "net7": "92:a4:d8:76:a7:0c",
            "net8": "46:6e:dd:65:19:6e",
            "net9": "c2:91:e8:82:be:c0"
        },
        "spine_5_1_3": {
            "net0": "fe:b6:7c:24:57:15",
            "net1": "a6:67:19:17:0e:7e",
            "net10": "b6:52:68:d7:6e:26",
            "net11": "0a:10:ba:c1:b3:4e",
            "net2": "0a:c1:c8:0e:ce:7c",
            "net3": "7a:90:4a:c4:6c:4e",
            "net4": "da:d7:dd:26:30:e4",
            "net5": "e6:09:9e:64:70:03",
            "net6": "22:4b:4e:e0:e8:6d",
            "net7": "22:88:9d:e7:84:b4",
            "net8": "12:2b:b3:ce:b1:c9",
            "net9": "3a:4c:0e:00:a5:63"
        },
        "spine_5_1_4": {
            "net0": "12:50:4d:30:84:c2",
            "net1": "72:69:3b:6e:5f:a2",
            "net10": "16:fb:e9:0c:36:0d",
            "net11": "56:a2:6a:41:99:ad",
            "net2": "e6:72:47:3e:4a:6d",
            "net3": "1e:ff:35:c6:3b:da",
            "net4": "ee:d1:b2:46:e4:7c",
            "net5": "26:5c:20:f7:3a:0e",
            "net6": "1e:97:42:13:00:5c",
            "net7": "de:c1:18:0b:84:61",
            "net8": "66:85:d6:b6:a9:fe",
            "net9": "66:97:41:a2:55:be"
        },
        "spine_5_1_5": {
            "net0": "ca:33:4b:7c:c9:cf",
            "net1": "b2:c5:52:ec:6d:01",
            "net10": "da:a4:ae:da:e0:dd",
            "net11": "12:cd:4f:5e:1c:d1",
            "net2": "ce:c6:c1:c3:de:ed",
            "net3": "32:a6:8c:8e:01:ee",
            "net4": "ae:2e:e9:8e:99:6b",
            "net5": "b6:2d:47:d2:e1:60",
            "net6": "7e:b1:fa:f6:0b:87",
            "net7": "c6:b2:ea:f9:b9:28",
            "net8": "d6:36:de:af:1d:c5",
            "net9": "5e:99:ac:6c:c3:b8"
        },
        "spine_5_1_6": {
            "net0": "56:6b:7c:ec:83:e7",
            "net1": "4a:3c:53:2d:73:56",
            "net10": "fe:b6:03:8d:5c:c1",
            "net11": "0e:37:55:f6:cc:fa",
            "net2": "66:b3:c7:9b:85:1f",
            "net3": "86:24:2f:05:40:cb",
            "net4": "ea:43:63:3a:14:66",
            "net5": "da:d5:10:d1:c0:26",
            "net6": "ea:5d:d6:04:03:d6",
            "net7": "06:d2:6c:6a:0a:29",
            "net8": "8e:05:35:ad:5f:09",
            "net9": "56:d6:80:91:d5:0c"
        },
        "spine_6_1_1": {
            "net0": "06:7d:ee:e4:0a:29",
            "net1": "3e:95:dc:f8:37:e2",
            "net10": "da:10:bc:a8:de:3c",
            "net11": "66:76:c4:78:4e:87",
            "net2": "b2:48:da:2e:0d:c3",
            "net3": "b2:87:1e:9d:3c:3f",
            "net4": "56:97:76:53:07:c8",
            "net5": "96:a6:ee:0d:d0:ae",
            "net6": "a2:7e:da:f7:89:de",
            "net7": "8e:22:17:4a:ad:4b",
            "net8": "ba:ce:4c:a7:63:3d",
            "net9": "82:8f:c7:05:4d:1a"
        },
        "spine_6_1_2": {
            "net0": "c2:63:ac:c3:02:d5",
            "net1": "fa:c3:46:96:69:d3",
            "net10": "c6:67:61:43:c5:36",
            "net11": "62:cf:b5:d0:7d:78",
            "net2": "3a:2f:b0:c3:a0:b4",
            "net3": "ba:14:17:5e:a2:ab",
            "net4": "fe:4a:5c:91:79:88",
            "net5": "7e:79:80:1b:4e:79",
            "net6": "e6:dd:20:56:20:43",
            "net7": "a2:dc:ad:68:e2:4e",
            "net8": "5a:c8:e1:ac:5a:1d",
            "net9": "2e:b2:4b:a3:97:f6"
        },
        "spine_6_1_3": {
            "net0": "b2:8b:96:0c:e5:eb",
            "net1": "b6:56:05:c5:d9:86",
            "net10": "1e:b5:9e:7c:01:da",
            "net11": "a6:37:e8:2b:26:83",
            "net2": "9a:72:e3:8b:f8:41",
            "net3": "62:43:02:38:57:97",
            "net4": "c6:5f:b1:2e:0c:26",
            "net5": "f6:22:ea:22:fb:2e",
            "net6": "ee:ac:4f:e9:8d:93",
            "net7": "46:95:3d:b1:d6:8b",
            "net8": "12:3b:92:7a:96:db",
            "net9": "76:f0:bd:53:02:a0"
        },
        "spine_6_1_4": {
            "net0": "92:a4:d1:df:d2:06",
            "net1": "ba:a6:13:dd:a8:2a",
            "net10": "5a:d7:d5:5c:65:8e",
            "net11": "c2:dd:c7:38:fc:02",
            "net2": "5a:fd:bb:fd:f4:3e",
            "net3": "ca:df:fd:18:d6:d4",
            "net4": "ea:68:07:c9:db:18",
            "net5": "56:d5:e2:09:2c:22",
            "net6": "4e:43:57:23:34:06",
            "net7": "1a:f3:c4:b4:ee:62",
            "net8": "c2:24:7c:81:41:0a",
            "net9": "96:06:6f:28:96:05"
        },
        "spine_6_1_5": {
            "net0": "f2:97:2a:3a:a8:dc",
            "net1": "6a:a6:8e:4d:69:59",
            "net10": "ee:7a:f4:c2:92:db",
            "net11": "1e:43:63:2e:8f:bf",
            "net2": "ca:90:22:ff:34:c0",
            "net3": "8e:a4:c6:00:57:65",
            "net4": "c2:cc:57:35:90:db",
            "net5": "92:8b:96:fd:c0:1b",
            "net6": "56:21:da:41:c9:a8",
            "net7": "f2:08:41:49:30:5a",
            "net8": "16:ee:e1:91:79:4c",
            "net9": "1e:0b:14:ed:29:cc"
        },
        "spine_6_1_6": {
            "net0": "ea:d6:b3:a2:11:b2",
            "net1": "3e:2f:99:56:d6:1d",
            "net10": "22:4f:fa:aa:b8:c7",
            "net11": "e2:8c:6d:39:c2:8b",
            "net2": "fe:02:65:91:a1:ee",
            "net3": "a6:00:32:dc:3e:78",
            "net4": "f2:37:a4:11:94:6f",
            "net5": "a6:eb:3e:5d:20:06",
            "net6": "42:dc:25:38:02:d2",
            "net7": "4a:99:17:14:b0:0e",
            "net8": "16:5b:cd:fb:f3:48",
            "net9": "a2:2b:41:29:88:d0"
        },
        "tof_1_2_1": {
            "net0": "46:16:69:e9:66:0b",
            "net1": "ee:f0:cc:e8:b7:08",
            "net10": "96:97:49:43:eb:5b",
            "net11": "2e:99:a8:3d:b1:c8",
            "net2": "ba:69:2b:85:65:f3",
            "net3": "9a:fe:43:5c:2b:c9",
            "net4": "f6:61:29:ff:2c:16",
            "net5": "aa:12:17:6b:8a:9d",
            "net6": "9a:69:39:89:d2:b8",
            "net7": "d2:ea:1d:b1:99:a9",
            "net8": "de:cc:2d:6e:f9:82",
            "net9": "56:20:05:eb:df:e2"
        },
        "tof_1_2_2": {
            "net0": "d2:10:46:af:c9:92",
            "net1": "0a:60:39:28:cd:5d",
            "net10": "46:04:6b:1b:eb:0a",
            "net11": "ea:f8:5b:a6:89:39",
            "net2": "6a:f5:31:f7:01:f3",
            "net3": "16:02:02:02:fb:ff",
            "net4": "8a:f4:8b:14:fa:de",
            "net5": "72:52:c1:33:a6:12",
            "net6": "4a:b7:c5:ef:fd:58",
            "net7": "86:d1:7e:d2:ba:3b",
            "net8": "5e:e7:67:a3:0b:ce",
            "net9": "9e:2e:31:6a:5b:e1"
        },
        "tof_1_2_3": {
            "net0": "52:df:12:cd:07:64",
            "net1": "ae:ac:0b:40:d7:46",
            "net10": "ce:7f:fa:d4:3d:6b",
            "net11": "ca:e4:9d:f8:7a:b5",
            "net2": "56:44:8a:2e:e0:c3",
            "net3": "e6:33:44:62:f3:50",
            "net4": "96:f6:42:2c:93:15",
            "net5": "3a:7f:29:ff:f0:37",
            "net6": "ea:40:02:94:dd:82",
            "net7": "ca:3b:d2:78:ca:2a",
            "net8": "46:34:3f:e6:ab:d1",
            "net9": "c2:5d:4d:b8:19:37"
        },
        "tof_1_2_4": {
            "net0": "de:e6:6a:0a:42:c6",
            "net1": "9a:c2:ac:cb:fb:55",
            "net10": "7e:22:8b:04:e4:11",
            "net11": "a6:cd:3e:51:e2:ad",
            "net2": "1a:c6:4e:91:1b:ff",
            "net3": "3a:1c:02:ad:b0:a3",
            "net4": "ea:4c:7c:0f:e7:68",
            "net5": "72:72:04:54:0f:fe",
            "net6": "36:ce:8d:4f:fa:7c",
            "net7": "f2:ae:fa:3f:53:a3",
            "net8": "42:e4:d3:5b:bc:99",
            "net9": "c2:80:9a:b8:fe:bb"
        },
        "tof_1_2_5": {
            "net0": "b6:60:b7:de:d7:3c",
            "net1": "be:f8:63:38:2f:7a",
            "net10": "0e:46:1d:81:87:e0",
            "net11": "86:c5:42:16:c7:56",
            "net2": "4e:ff:4a:cb:9f:68",
            "net3": "1a:81:a7:6b:ce:f7",
            "net4": "0a:76:fe:76:04:7e",
            "net5": "86:23:dc:a5:cb:f0",
            "net6": "22:2f:64:fc:df:8c",
            "net7": "12:a4:04:50:c2:02",
            "net8": "6a:ce:db:78:66:da",
            "net9": "0e:d4:8c:1f:a0:ab"
        },
        "tof_1_2_6": {
            "net0": "9e:1b:89:22:dc:56",
            "net1": "e2:66:c1:8f:36:37",
            "net10": "82:53:56:d1:13:43",
            "net11": "5a:9f:ae:03:6f:bd",
            "net2": "4e:ac:00:1c:97:26",
            "net3": "3a:e7:ae:ae:31:77",
            "net4": "82:6a:5a:cf:08:bb",
            "net5": "62:c8:09:8a:ce:7f",
            "net6": "fa:90:e2:aa:f7:d1",
            "net7": "de:d2:43:9f:8c:be",
            "net8": "4e:f5:5b:f3:68:e9",
            "net9": "32:40:bb:f7:67:22"
        },
        "tof_2_2_1": {
            "net0": "86:6c:10:2d:40:8e",
            "net1": "6a:d6:d8:33:61:20",
            "net10": "7a:2e:26:a3:a3:62",
            "net11": "ca:eb:db:38:91:f8",
            "net2": "3e:c9:0b:72:0d:e4",
            "net3": "6a:17:c7:35:a1:9e",
            "net4": "ea:64:88:b2:a2:21",
            "net5": "36:e4:e1:5c:18:51",
            "net6": "5a:8d:71:ea:ab:8d",
            "net7": "ee:ea:fa:bf:95:58",
            "net8": "2e:74:ac:d7:ef:26",
            "net9": "0a:3d:90:75:81:9f"
        },
        "tof_2_2_2": {
            "net0": "56:8a:b9:db:39:4c",
            "net1": "76:8e:b4:39:47:9f",
            "net10": "4e:74:88:4a:1c:af",
            "net11": "2a:a8:e2:96:8d:b6",
            "net2": "96:7a:b1:ed:30:7a",
            "net3": "32:67:dc:6c:f3:c5",
            "net4": "5a:1c:36:a7:13:a5",
            "net5": "8e:ca:8d:26:df:16",
            "net6": "d6:4b:d9:af:99:72",
            "net7": "7a:fa:f6:f1:e4:87",
            "net8": "aa:39:ec:8f:88:b9",
            "net9": "66:48:71:af:38:b1"
        },
        "tof_2_2_3": {
            "net0": "72:ce:91:96:6f:0d",
            "net1": "de:2b:87:b9:51:45",
            "net10": "ee:ad:97:ce:2d:62",
            "net11": "9e:83:23:ac:a6:01",
            "net2": "aa:83:92:46:1f:91",
            "net3": "96:57:46:9b:86:4c",
            "net4": "32:80:99:4e:1d:3e",
            "net5": "6e:50:8a:8b:39:41",
            "net6": "12:35:7a:ef:b3:ff",
            "net7": "b6:57:40:21:14:6b",
            "net8": "72:35:e0:cd:21:8e",
            "net9": "42:17:53:4d:c3:6e"
        },
        "tof_2_2_4": {
            "net0": "1e:e7:cf:ea:b2:51",
            "net1": "c2:0c:ed:af:85:de",
            "net10": "9e:9b:9a:9e:12:14",
            "net11": "9e:3f:db:92:ec:73",
            "net2": "da:93:7e:c9:fb:c9",
            "net3": "0a:9f:2e:c5:80:28",
            "net4": "16:3e:99:57:0b:af",
            "net5": "ea:90:1b:89:ac:cf",
            "net6": "e2:f7:38:18:29:f6",
            "net7": "2e:a6:e4:38:9c:c0",
            "net8": "4e:25:02:7c:c4:b9",
            "net9": "c6:9a:4d:50:9f:b5"
        },
        "tof_2_2_5": {
            "net0": "0e:da:d8:55:d9:d1",
            "net1": "fe:cd:8d:1f:d3:da",
            "net10": "5e:56:62:a4:b9:c2",
            "net11": "32:d0:69:2f:2f:af",
            "net2": "ea:fb:2f:8a:1c:f3",
            "net3": "7a:97:0b:13:4d:3c",
            "net4": "0a:a1:6a:1b:45:66",
            "net5": "fe:bf:ec:44:d8:3c",
            "net6": "fa:5e:25:30:7e:4c",
            "net7": "5e:5a:3a:a8:d1:81",
            "net8": "82:37:ee:68:e5:92",
            "net9": "5a:d0:d4:94:f1:8f"
        },
        "tof_2_2_6": {
            "net0": "76:3a:a0:d9:45:e2",
            "net1": "56:39:fa:72:e2:fd",
            "net10": "f6:13:7e:d3:45:af",
            "net11": "ca:93:4a:bb:cd:8d",
            "net2": "a2:bb:05:56:f3:8e",
            "net3": "56:57:d8:bc:66:01",
            "net4": "c6:5a:39:ff:c5:f9",
            "net5": "da:f2:28:b0:fd:8c",
            "net6": "f2:47:80:65:9b:d5",
            "net7": "b6:3e:47:08:f7:c2",
            "net8": "3a:b7:fa:60:38:7c",
            "net9": "52:94:56:d3:58:0e"
        },
        "tof_3_2_1": {
            "net0": "2e:c1:20:e2:6e:c2",
            "net1": "72:94:19:ef:6f:ab",
            "net10": "be:57:f0:92:54:95",
            "net11": "ba:fd:77:ef:3c:fd",
            "net2": "b2:6e:9c:ae:3b:44",
            "net3": "92:21:fd:8c:88:2e",
            "net4": "b2:ab:32:00:28:c9",
            "net5": "b6:d8:02:ac:81:35",
            "net6": "2e:f3:d6:41:ca:94",
            "net7": "1a:9c:64:e3:50:ea",
            "net8": "02:06:13:66:0c:f9",
            "net9": "42:ea:cb:05:de:b4"
        },
        "tof_3_2_2": {
            "net0": "ee:5d:f1:49:ee:00",
            "net1": "ee:c0:9a:11:cb:84",
            "net10": "ae:a2:21:75:2a:e2",
            "net11": "aa:d5:59:6d:51:9d",
            "net2": "b2:9e:a1:90:bc:0a",
            "net3": "02:39:b8:72:8a:0b",
            "net4": "b2:f0:eb:89:c2:41",
            "net5": "6a:10:51:72:e1:b8",
            "net6": "6e:1f:7f:cf:17:be",
            "net7": "96:74:b3:9c:f6:45",
            "net8": "06:d5:ce:c3:8d:02",
            "net9": "66:8b:0b:3b:ba:ed"
        },
        "tof_3_2_3": {
            "net0": "8a:5e:9b:2c:b3:87",
            "net1": "12:7e:58:31:43:5f",
            "net10": "72:5c:32:a5:f7:7d",
            "net11": "e2:80:d4:c0:c8:2c",
            "net2": "6e:0a:00:da:d6:42",
            "net3": "ee:01:4f:48:1b:1a",
            "net4": "2a:6b:e2:a6:89:41",
            "net5": "e6:8b:bd:97:44:d6",
            "net6": "96:e5:c5:68:a0:c9",
            "net7": "7e:84:af:e9:81:1e",
            "net8": "56:fd:4f:88:47:22",
            "net9": "b6:26:d6:81:93:e9"
        },
        "tof_3_2_4": {
            "net0": "a2:87:a6:de:1b:24",
            "net1": "82:52:c9:4a:0f:42",
            "net10": "4e:b6:f7:3b:2a:be",
            "net11": "fa:c8:e7:41:c0:31",
            "net2": "0a:90:c3:2f:ac:33",
            "net3": "66:9a:8b:63:59:93",
            "net4": "ea:b3:fe:9c:50:c2",
            "net5": "92:1b:f5:80:34:af",
            "net6": "a2:c6:79:6c:de:a6",
            "net7": "ca:da:d8:6f:ba:32",
            "net8": "06:95:00:67:5c:c2",
            "net9": "86:d2:3a:5c:68:8f"
        },
        "tof_3_2_5": {
            "net0": "da:c8:65:96:13:a3",
            "net1": "0e:2a:b8:fc:d7:dc",
            "net10": "ba:27:fa:29:85:e5",
            "net11": "6e:e9:ba:df:45:e8",
            "net2": "ba:6b:b0:21:d6:a3",
            "net3": "ca:93:55:28:54:1f",
            "net4": "c2:94:23:51:45:a9",
            "net5": "ba:f9:b5:6b:6a:31",
            "net6": "a6:53:83:05:5f:47",
            "net7": "b6:79:55:74:44:94",
            "net8": "b2:a6:d9:28:9a:89",
            "net9": "26:aa:9e:55:76:bd"
        },
        "tof_3_2_6": {
            "net0": "7a:af:6d:2d:61:0c",
            "net1": "a2:80:d0:b0:20:96",
            "net10": "7e:24:80:11:3a:53",
            "net11": "e2:27:42:18:73:b0",
            "net2": "9e:c2:61:3b:d6:02",
            "net3": "42:73:4c:a0:43:c2",
            "net4": "7a:8b:9a:18:44:d4",
            "net5": "22:7e:ee:3f:6c:8e",
            "net6": "a2:6b:da:37:b9:6d",
            "net7": "d6:cc:60:cc:ae:41",
            "net8": "72:b3:ad:32:1f:8f",
            "net9": "b2:ee:8b:ef:2e:3c"
        }
    },
    "failed_machine": "spine_1_1_1",
    "failure_time": 1614467058.7189758,
    "recover_time": 1614467333.7875228
}