{
    "k_leaf": 14,
    "k_top": 14,
    "redundancy_factor": 14,
    "is_k8s": true,
    "machine_mac_addresses": {
        "leaf_1_0_1": {
            "net0": "e6:db:f2:55:33:0a",
            "net1": "f6:5a:65:60:60:38",
            "net10": "b6:ef:75:46:a8:d9",
            "net11": "f2:0d:6a:4f:4c:26",
            "net12": "5a:53:e1:30:89:af",
            "net13": "3a:02:d6:3a:4e:c4",
            "net14": "ca:73:e8:04:71:a1",
            "net2": "4e:25:cd:9e:c6:db",
            "net3": "b6:4c:d4:5c:9d:74",
            "net4": "b6:76:39:98:69:25",
            "net5": "f6:c3:cf:dc:38:7f",
            "net6": "8e:5d:51:b2:d4:76",
            "net7": "76:c3:75:f0:74:8c",
            "net8": "72:e5:9a:98:f8:c5",
            "net9": "32:0e:60:a6:54:7f"
        },
        "leaf_1_0_10": {
            "net0": "56:99:8a:b2:33:d0",
            "net1": "3a:39:36:06:bb:e8",
            "net10": "d6:33:c7:f2:31:67",
            "net11": "96:6e:1f:ec:9d:79",
            "net12": "d6:63:a0:40:ee:2e",
            "net13": "36:6a:8f:18:b0:f3",
            "net14": "26:13:b0:a0:6a:43",
            "net2": "ce:9e:c9:d8:ea:f9",
            "net3": "4a:0e:e2:ee:29:d8",
            "net4": "aa:9c:be:52:0a:35",
            "net5": "0a:58:7e:f2:78:29",
            "net6": "12:fa:f7:55:7d:4b",
            "net7": "4a:b6:e5:8c:6b:4b",
            "net8": "12:d3:a2:eb:ed:ca",
            "net9": "ae:7e:49:4d:09:c1"
        },
        "leaf_1_0_11": {
            "net0": "da:40:50:cb:75:61",
            "net1": "96:f3:9b:37:5f:f0",
            "net10": "06:34:90:2c:52:0c",
            "net11": "36:b7:14:d7:29:a7",
            "net12": "02:31:8c:92:b1:12",
            "net13": "aa:57:a9:9a:64:5a",
            "net14": "9e:ff:80:a1:6a:d3",
            "net2": "46:1f:a9:82:fc:28",
            "net3": "c6:89:1e:8b:35:a1",
            "net4": "9e:6a:50:b6:49:e1",
            "net5": "e2:a8:a8:09:9c:b0",
            "net6": "d2:71:68:30:9b:1c",
            "net7": "8a:19:12:43:96:40",
            "net8": "d6:21:43:6e:7a:0d",
            "net9": "12:78:a0:cb:be:f1"
        },
        "leaf_1_0_12": {
            "net0": "12:1a:f7:8a:99:96",
            "net1": "6e:8e:51:cd:e1:e2",
            "net10": "8a:fb:eb:a7:3e:19",
            "net11": "12:9d:3b:7f:51:93",
            "net12": "62:ab:8c:0b:4d:69",
            "net13": "1e:c7:50:b5:a0:c7",
            "net14": "f6:0f:58:bb:02:bd",
            "net2": "06:a0:07:5b:db:4f",
            "net3": "2a:9b:64:36:f7:5d",
            "net4": "6e:19:87:f3:0d:f6",
            "net5": "b6:9c:09:a9:b9:44",
            "net6": "72:f5:2e:2f:c3:88",
            "net7": "6a:41:10:39:6a:91",
            "net8": "12:94:f1:e1:b8:19",
            "net9": "0e:aa:6e:8c:c1:35"
        },
        "leaf_1_0_13": {
            "net0": "32:c4:f9:c6:8a:79",
            "net1": "8e:cb:ee:a8:e7:75",
            "net10": "02:9b:61:ce:1c:1c",
            "net11": "9e:ca:f0:92:99:23",
            "net12": "92:ee:7c:e3:4f:22",
            "net13": "f2:8c:90:2a:0b:86",
            "net14": "2a:a7:23:fa:20:94",
            "net2": "0e:c3:d1:54:76:19",
            "net3": "fa:94:28:81:94:46",
            "net4": "f2:89:0f:18:83:95",
            "net5": "fa:8e:9c:e8:a6:00",
            "net6": "ee:de:76:52:70:e5",
            "net7": "de:14:87:da:09:d4",
            "net8": "ba:2b:55:e1:12:59",
            "net9": "b2:8a:9f:87:8c:69"
        },
        "leaf_1_0_14": {
            "net0": "b6:5c:23:5e:cf:28",
            "net1": "de:ec:51:84:53:25",
            "net10": "72:4c:a2:25:15:5e",
            "net11": "a6:c3:a0:8a:26:57",
            "net12": "4e:18:92:ac:4c:6e",
            "net13": "0a:2f:99:62:90:eb",
            "net14": "2a:d6:2e:d2:03:5b",
            "net2": "7a:a5:65:ce:c4:4e",
            "net3": "56:9f:a8:90:29:2d",
            "net4": "32:9d:56:1c:a7:40",
            "net5": "f6:fd:cf:1c:ed:f0",
            "net6": "96:03:89:22:24:b6",
            "net7": "f6:1b:e1:94:10:e7",
            "net8": "6a:b2:7b:21:6c:cc",
            "net9": "7e:2c:91:d8:2c:48"
        },
        "leaf_1_0_2": {
            "net0": "7a:5c:e6:a5:9e:11",
            "net1": "fe:a1:91:2d:9f:44",
            "net10": "f6:64:de:d7:29:8d",
            "net11": "fa:6b:8b:ee:a8:4c",
            "net12": "02:1b:c6:aa:c7:5d",
            "net13": "2e:39:38:fd:0b:7b",
            "net14": "e2:5a:bd:77:8e:b3",
            "net2": "96:fb:ac:3e:55:81",
            "net3": "5e:fb:4d:a3:f3:e9",
            "net4": "fe:a6:e9:3c:6c:2e",
            "net5": "32:30:56:13:a7:ef",
            "net6": "ee:23:2d:64:07:ca",
            "net7": "86:ae:ae:0c:1f:a8",
            "net8": "06:57:70:3a:89:0e",
            "net9": "8a:3a:d1:07:fd:4e"
        },
        "leaf_1_0_3": {
            "net0": "0e:a8:e8:98:4a:a5",
            "net1": "4e:b8:c5:6f:b5:be",
            "net10": "ae:9f:86:16:e0:1d",
            "net11": "72:bc:89:ff:f0:96",
            "net12": "5e:3e:b5:21:0b:eb",
            "net13": "ba:c6:cd:62:e5:48",
            "net14": "06:42:fa:80:ae:b0",
            "net2": "5e:8f:33:e3:44:4c",
            "net3": "2a:f6:c2:da:5d:6d",
            "net4": "52:91:1e:17:59:e0",
            "net5": "c6:d7:ad:61:42:61",
            "net6": "d2:62:61:86:3a:42",
            "net7": "ce:65:c5:03:21:a2",
            "net8": "c2:f4:81:17:9a:0e",
            "net9": "b6:2f:6b:71:d8:45"
        },
        "leaf_1_0_4": {
            "net0": "8e:1b:e2:1a:41:38",
            "net1": "b6:0f:63:90:26:c8",
            "net10": "72:7a:2e:d4:c1:43",
            "net11": "ea:93:3a:c9:f7:41",
            "net12": "1e:32:ad:c9:5c:94",
            "net13": "d6:82:8a:45:00:1f",
            "net14": "a2:ac:37:1e:87:6a",
            "net2": "5e:0f:70:4b:7b:aa",
            "net3": "ea:06:2c:7a:aa:ba",
            "net4": "a2:84:76:ed:a2:2b",
            "net5": "7e:e2:fc:75:94:ca",
            "net6": "92:65:cf:cc:5e:25",
            "net7": "06:6e:86:26:2f:90",
            "net8": "c6:5d:e4:d4:2d:d7",
            "net9": "f2:b7:0a:94:6d:43"
        },
        "leaf_1_0_5": {
            "net0": "e6:b5:41:c4:e0:81",
            "net1": "12:e0:99:6e:6a:84",
            "net10": "ee:a0:f1:b3:7b:80",
            "net11": "f6:f0:c2:3a:6e:3e",
            "net12": "52:d5:51:8f:28:f2",
            "net13": "42:6e:58:a3:04:34",
            "net14": "76:d6:bd:bb:c2:5d",
            "net2": "da:6d:f4:0e:41:ff",
            "net3": "fa:b8:38:ff:33:ca",
            "net4": "3a:f7:08:e5:be:84",
            "net5": "2e:e6:04:d4:41:f4",
            "net6": "06:52:e2:c4:2b:28",
            "net7": "fe:2b:b7:3e:c7:33",
            "net8": "ea:87:37:1d:d8:51",
            "net9": "22:24:34:9f:d5:6f"
        },
        "leaf_1_0_6": {
            "net0": "86:bd:e6:33:ea:f5",
            "net1": "fe:57:79:34:11:9d",
            "net10": "3e:2a:16:a4:d9:3a",
            "net11": "f2:8e:e0:6f:fe:f2",
            "net12": "8e:43:11:39:61:8b",
            "net13": "3e:bd:a1:99:9e:81",
            "net14": "9e:57:74:f0:81:a0",
            "net2": "f2:0e:8b:9a:d1:2a",
            "net3": "62:51:fa:02:08:85",
            "net4": "b6:c8:29:0c:32:16",
            "net5": "fe:40:29:f1:de:e0",
            "net6": "da:cd:62:91:ca:85",
            "net7": "ae:aa:d6:cb:50:2a",
            "net8": "fa:e9:57:b6:1e:d1",
            "net9": "3a:3e:b5:6e:bb:ef"
        },
        "leaf_1_0_7": {
            "net0": "e2:e9:b8:e1:9a:38",
            "net1": "de:31:12:52:c5:b9",
            "net10": "12:2f:c5:df:3b:04",
            "net11": "e2:aa:15:03:d9:32",
            "net12": "02:ea:43:7d:b7:75",
            "net13": "6e:c3:b1:a4:e9:e2",
            "net14": "72:35:d2:7c:97:64",
            "net2": "f2:70:a6:e5:b5:19",
            "net3": "3a:94:ed:eb:38:71",
            "net4": "72:8e:5f:af:af:18",
            "net5": "9a:e0:85:55:14:b7",
            "net6": "e2:e9:58:85:ce:c8",
            "net7": "82:1c:24:88:bb:3d",
            "net8": "0a:bf:f3:90:2d:bf",
            "net9": "92:98:cf:86:e9:5f"
        },
        "leaf_1_0_8": {
            "net0": "22:4c:ff:02:9e:3f",
            "net1": "96:19:32:2e:d8:bc",
            "net10": "e2:2a:15:a0:75:50",
            "net11": "3e:d1:85:67:64:f9",
            "net12": "0a:b5:af:eb:1c:eb",
            "net13": "da:25:17:c3:6f:88",
            "net14": "f6:78:da:07:c3:1a",
            "net2": "32:7a:67:29:ea:55",
            "net3": "22:b2:a7:44:5a:5f",
            "net4": "3e:d5:66:8a:62:8d",
            "net5": "52:d1:3a:88:f7:32",
            "net6": "ce:c3:38:f2:30:16",
            "net7": "3e:a7:ba:89:02:91",
            "net8": "1a:d1:22:19:76:a4",
            "net9": "ba:36:17:7a:b9:86"
        },
        "leaf_1_0_9": {
            "net0": "ee:86:f2:f5:9e:26",
            "net1": "9e:5c:81:ff:14:ce",
            "net10": "be:0f:b0:41:77:d2",
            "net11": "4e:69:18:ef:3d:6e",
            "net12": "02:a2:46:c2:4b:c0",
            "net13": "66:a7:d7:0e:f3:72",
            "net14": "42:f6:20:ad:ed:18",
            "net2": "92:b1:2f:0d:ab:74",
            "net3": "22:6f:ac:70:f9:29",
            "net4": "d6:6b:61:96:0b:8f",
            "net5": "f2:f2:cd:9b:c5:47",
            "net6": "96:50:b5:a5:51:31",
            "net7": "da:a9:5f:8a:d1:0c",
            "net8": "7a:88:70:64:63:53",
            "net9": "aa:0b:de:72:58:d2"
        },
        "leaf_2_0_1": {
            "net0": "ae:a0:cc:ff:8f:cb",
            "net1": "7a:85:05:ff:15:78",
            "net10": "42:77:ad:50:ee:37",
            "net11": "3a:da:67:45:2d:b8",
            "net12": "82:97:9e:3c:79:9c",
            "net13": "62:45:ba:7c:5a:38",
            "net14": "96:52:6f:8e:27:f3",
            "net2": "f2:83:98:74:61:17",
            "net3": "12:5e:60:f1:1d:e5",
            "net4": "9a:99:86:93:92:9f",
            "net5": "1a:3d:5f:f3:11:1b",
            "net6": "7e:5b:6c:f3:b5:d3",
            "net7": "9e:89:15:35:36:ef",
            "net8": "22:5d:04:05:ea:07",
            "net9": "c2:2d:8a:17:24:c9"
        },
        "leaf_2_0_10": {
            "net0": "06:5b:94:07:af:1b",
            "net1": "16:bd:e6:fe:bf:b1",
            "net10": "6e:4a:e5:e3:c7:9f",
            "net11": "be:2a:6c:28:b4:d7",
            "net12": "2e:0a:04:35:a1:4e",
            "net13": "42:c0:85:b2:85:e9",
            "net14": "c2:42:27:13:82:a9",
            "net2": "6a:bb:5b:8e:a2:5c",
            "net3": "52:aa:0a:b0:e1:e9",
            "net4": "ce:ba:9b:c6:3d:b0",
            "net5": "7a:d4:8b:53:72:a7",
            "net6": "8e:f2:ab:ef:86:cb",
            "net7": "5e:be:6d:1b:6c:9c",
            "net8": "96:e7:76:77:9e:64",
            "net9": "76:94:e7:ff:c0:24"
        },
        "leaf_2_0_11": {
            "net0": "b6:9a:8c:72:cc:07",
            "net1": "ae:2e:1c:7e:17:93",
            "net10": "5a:ea:b9:45:83:7a",
            "net11": "76:d0:c5:b0:9f:7a",
            "net12": "0e:29:0b:51:2a:3b",
            "net13": "aa:6d:b1:a8:9e:d9",
            "net14": "4a:a8:01:06:0c:45",
            "net2": "06:8e:15:ac:f1:04",
            "net3": "56:6f:63:ea:14:4d",
            "net4": "12:93:11:db:97:29",
            "net5": "e6:59:d7:b2:b5:f8",
            "net6": "72:fa:10:95:e6:45",
            "net7": "22:a5:fd:1c:40:33",
            "net8": "c6:de:59:98:99:6f",
            "net9": "da:cd:49:6c:51:dc"
        },
        "leaf_2_0_12": {
            "net0": "9a:6d:fa:b8:aa:7d",
            "net1": "02:ba:7c:83:14:9e",
            "net10": "c2:19:af:95:28:24",
            "net11": "46:d4:60:ee:1f:60",
            "net12": "36:12:ac:0b:37:d1",
            "net13": "ca:a2:6e:51:56:54",
            "net14": "f2:9d:7f:b7:47:09",
            "net2": "9a:a9:d5:72:05:1b",
            "net3": "fa:b5:0d:3a:9d:89",
            "net4": "02:d4:d1:01:82:05",
            "net5": "56:39:f4:c0:07:3b",
            "net6": "42:0d:1d:68:18:b4",
            "net7": "16:29:94:b1:13:6f",
            "net8": "9e:04:77:6f:54:9d",
            "net9": "4e:24:4f:91:ca:2a"
        },
        "leaf_2_0_13": {
            "net0": "56:9c:99:ee:4d:be",
            "net1": "d2:6e:ac:4a:14:28",
            "net10": "fe:db:f5:66:ad:be",
            "net11": "ea:ab:4f:7f:49:91",
            "net12": "9e:5b:29:a6:39:c2",
            "net13": "f6:98:f8:f4:3b:e4",
            "net14": "ce:4c:27:e9:6b:cb",
            "net2": "96:7c:16:e1:3a:19",
            "net3": "96:28:eb:86:81:a7",
            "net4": "e2:9b:71:c8:92:7a",
            "net5": "4e:f2:65:c4:0c:20",
            "net6": "7a:70:47:71:74:ac",
            "net7": "92:9a:7b:0d:1b:b9",
            "net8": "f6:92:f9:b1:ca:b7",
            "net9": "8a:94:dc:26:a2:02"
        },
        "leaf_2_0_14": {
            "net0": "82:7b:53:ec:94:00",
            "net1": "0e:bd:e3:bd:b8:36",
            "net10": "92:0d:fa:27:c9:66",
            "net11": "0e:aa:e7:30:7c:f8",
            "net12": "ae:3a:50:38:31:15",
            "net13": "f6:93:ca:d8:3f:d9",
            "net14": "e6:8c:5c:57:b8:da",
            "net2": "36:5d:4b:d1:8a:ad",
            "net3": "52:6d:3b:2e:8e:b2",
            "net4": "92:bd:ad:ff:f4:ea",
            "net5": "5a:5c:ab:16:be:cd",
            "net6": "d6:11:49:56:61:b9",
            "net7": "ca:42:44:51:4b:7d",
            "net8": "c2:82:1a:3b:f6:3a",
            "net9": "b6:18:97:fa:b7:06"
        },
        "leaf_2_0_2": {
            "net0": "aa:fe:90:74:03:56",
            "net1": "76:ff:9a:aa:2d:d6",
            "net10": "0e:f2:67:41:79:40",
            "net11": "f2:2f:8e:01:2c:65",
            "net12": "3e:fc:58:fe:1b:67",
            "net13": "86:10:49:43:80:c9",
            "net14": "fa:34:c6:77:3d:d3",
            "net2": "86:0c:e3:b5:1c:d1",
            "net3": "32:ea:00:d5:db:19",
            "net4": "92:06:ca:c8:39:51",
            "net5": "8e:b7:e9:de:90:ed",
            "net6": "aa:cf:91:e8:04:62",
            "net7": "9a:19:97:6e:87:90",
            "net8": "16:d6:e4:5a:07:fd",
            "net9": "ee:8d:c5:21:15:d8"
        },
        "leaf_2_0_3": {
            "net0": "76:40:db:97:49:5f",
            "net1": "12:31:b5:0d:cb:0f",
            "net10": "5a:ad:76:7b:93:0c",
            "net11": "72:af:cc:81:c9:16",
            "net12": "0e:0b:bd:f2:69:be",
            "net13": "3e:98:8b:ab:69:de",
            "net14": "0a:db:db:4a:66:7a",
            "net2": "c6:39:cc:2e:f9:89",
            "net3": "da:10:1d:d8:7c:8a",
            "net4": "2a:b1:d1:ff:6f:da",
            "net5": "32:be:cf:a3:47:e9",
            "net6": "3a:76:cb:b4:41:77",
            "net7": "76:cd:ee:e4:87:70",
            "net8": "5a:0f:a1:1d:ef:b7",
            "net9": "6e:a1:c8:1e:58:9d"
        },
        "leaf_2_0_4": {
            "net0": "d6:b6:b9:6d:99:1e",
            "net1": "6a:8f:98:1b:78:bd",
            "net10": "da:38:4f:63:3c:68",
            "net11": "56:5c:52:f2:c4:d7",
            "net12": "fe:86:18:60:de:05",
            "net13": "22:cd:17:95:b3:f4",
            "net14": "e6:60:b1:a0:e8:7e",
            "net2": "86:37:07:7b:45:6a",
            "net3": "0a:fa:da:35:9b:a3",
            "net4": "ea:14:67:21:3b:fa",
            "net5": "2e:37:ff:ff:e2:97",
            "net6": "da:06:44:1e:ab:45",
            "net7": "0e:e7:29:f3:59:45",
            "net8": "1a:86:02:02:ab:e6",
            "net9": "52:c9:85:a4:95:9a"
        },
        "leaf_2_0_5": {
            "net0": "d2:c4:8e:37:66:e1",
            "net1": "e2:12:10:5a:06:8f",
            "net10": "4a:5e:89:73:f0:1d",
            "net11": "9a:72:d9:49:3c:02",
            "net12": "fa:b7:a0:45:8b:12",
            "net13": "66:4b:e2:66:c2:83",
            "net14": "16:59:4d:e5:58:7c",
            "net2": "36:fc:ca:c5:34:76",
            "net3": "f2:62:d5:e8:66:d1",
            "net4": "66:51:cf:a4:9c:2f",
            "net5": "ea:ff:be:e5:ad:22",
            "net6": "8e:38:3d:23:3e:2a",
            "net7": "1e:1e:6f:56:1e:2a",
            "net8": "ae:f8:5e:c1:5f:5d",
            "net9": "62:b0:53:81:0d:10"
        },
        "leaf_2_0_6": {
            "net0": "ca:33:d8:e9:04:ce",
            "net1": "76:00:11:22:28:69",
            "net10": "96:93:39:b5:1d:83",
            "net11": "5e:54:b7:a4:aa:b8",
            "net12": "2e:c7:30:7e:c4:fd",
            "net13": "02:24:14:82:ed:13",
            "net14": "12:3e:ce:46:e5:ab",
            "net2": "02:ec:39:63:5d:f9",
            "net3": "82:a0:49:50:55:17",
            "net4": "5a:14:67:94:a3:5f",
            "net5": "de:55:d4:f4:47:d7",
            "net6": "de:09:18:b3:bc:1b",
            "net7": "c6:da:8d:4f:1f:ff",
            "net8": "42:7c:ee:31:f7:61",
            "net9": "06:d6:8d:a7:57:e9"
        },
        "leaf_2_0_7": {
            "net0": "12:e5:f3:d0:c1:95",
            "net1": "56:f9:59:f9:14:29",
            "net10": "62:bc:56:bf:5d:dd",
            "net11": "fe:86:6e:e0:e2:de",
            "net12": "42:39:3c:7b:ee:72",
            "net13": "6e:fc:4e:2c:2d:47",
            "net14": "72:fa:8b:f8:0e:26",
            "net2": "c6:d7:5e:8f:2e:3d",
            "net3": "96:c9:90:ba:8b:84",
            "net4": "d6:fb:d4:0d:5f:c9",
            "net5": "26:01:3a:2f:fb:b4",
            "net6": "de:6f:65:1b:fd:e8",
            "net7": "5a:5a:e3:62:fd:13",
            "net8": "72:73:f5:19:82:15",
            "net9": "16:ea:eb:1e:14:c1"
        },
        "leaf_2_0_8": {
            "net0": "3a:80:b4:28:d0:5b",
            "net1": "82:6f:3f:0a:fa:cc",
            "net10": "aa:e1:d9:95:09:eb",
            "net11": "5a:5b:92:6f:91:21",
            "net12": "7a:9a:96:6a:b1:96",
            "net13": "36:70:36:5b:e1:63",
            "net14": "86:16:22:43:eb:18",
            "net2": "7a:3d:9c:1f:c0:ab",
            "net3": "5a:99:9b:33:cb:a1",
            "net4": "72:97:9b:20:91:51",
            "net5": "d2:b1:7e:c1:8f:8e",
            "net6": "de:2f:97:1c:2c:8b",
            "net7": "02:0a:73:50:52:5d",
            "net8": "5a:9a:ba:27:7b:b0",
            "net9": "ee:75:0b:f1:60:b8"
        },
        "leaf_2_0_9": {
            "net0": "1a:f3:d2:87:4e:6e",
            "net1": "e2:68:99:d9:ce:93",
            "net10": "ca:9b:73:75:10:1b",
            "net11": "a6:9b:5f:ab:4f:fc",
            "net12": "8a:63:5c:32:d8:33",
            "net13": "be:64:18:36:af:e5",
            "net14": "96:b3:ad:75:ae:7c",
            "net2": "fe:b7:89:32:41:83",
            "net3": "fa:b5:f6:dc:27:1e",
            "net4": "16:9c:76:6b:b0:65",
            "net5": "6a:58:fd:fd:a0:af",
            "net6": "ea:88:26:72:96:16",
            "net7": "ea:c8:0c:b0:91:0f",
            "net8": "ce:65:c6:31:a5:98",
            "net9": "ce:61:14:a4:63:5e"
        },
        "spine_1_1_1": {
            "net0": "5a:f3:61:e8:72:2f",
            "net1": "32:5e:4c:10:4f:26",
            "net10": "d6:8d:95:0b:c8:f0",
            "net11": "46:c9:de:28:73:9c",
            "net12": "5e:72:c7:dd:67:2c",
            "net13": "e6:ea:fc:27:5e:0c",
            "net14": "ca:f1:22:ff:34:d6",
            "net15": "9a:ee:40:a3:52:af",
            "net16": "1a:51:59:62:91:fe",
            "net17": "be:2f:5b:ad:e0:88",
            "net18": "32:42:07:5e:c3:cd",
            "net19": "1e:db:cc:ff:84:cd",
            "net2": "72:95:a4:bc:f7:5d",
            "net20": "46:d4:9b:4a:63:6a",
            "net21": "da:d3:fa:78:63:00",
            "net22": "92:a8:67:a3:40:ab",
            "net23": "aa:66:36:f1:b2:67",
            "net24": "3e:3c:59:59:b2:8b",
            "net25": "ba:80:b6:c7:b9:8a",
            "net26": "ca:eb:fc:6c:3b:c5",
            "net27": "f6:03:48:41:e2:3f",
            "net3": "ba:d4:e4:8b:1c:9e",
            "net4": "36:ca:f4:98:35:e5",
            "net5": "4e:aa:c1:ef:3c:4d",
            "net6": "ca:19:28:aa:af:cb",
            "net7": "d2:a0:6d:6e:47:54",
            "net8": "3e:ac:21:94:1b:de",
            "net9": "4a:60:54:ca:21:8b"
        },
        "spine_1_1_10": {
            "net0": "32:69:2b:56:90:f7",
            "net1": "7a:7e:5b:91:07:1e",
            "net10": "1e:5e:ac:b4:77:c1",
            "net11": "ca:81:45:03:b9:88",
            "net12": "42:00:ce:df:0e:59",
            "net13": "5e:ed:97:0e:e7:74",
            "net14": "22:94:a4:10:db:30",
            "net15": "76:3a:26:ca:7a:e7",
            "net16": "a6:ac:30:1d:26:c9",
            "net17": "8a:d9:cf:76:03:1b",
            "net18": "16:93:19:4d:1d:40",
            "net19": "ba:61:92:12:f0:67",
            "net2": "46:68:ad:92:cf:98",
            "net20": "9a:48:d1:72:1f:83",
            "net21": "ce:e3:51:4a:36:9b",
            "net22": "0e:ac:8b:0a:80:76",
            "net23": "aa:cf:ad:3b:73:92",
            "net24": "4e:5a:28:96:41:81",
            "net25": "96:30:40:b0:97:b3",
            "net26": "22:c2:ce:96:14:a2",
            "net27": "8e:ec:50:18:0a:93",
            "net3": "0e:11:38:de:a3:b9",
            "net4": "66:53:f5:94:4c:3f",
            "net5": "82:7c:66:e0:ba:a3",
            "net6": "76:12:af:0b:2d:ff",
            "net7": "d2:d5:c9:fe:c0:a1",
            "net8": "12:92:a4:fd:5a:bd",
            "net9": "72:9e:93:2d:94:db"
        },
        "spine_1_1_11": {
            "net0": "8e:d1:33:f9:f2:4a",
            "net1": "ee:11:bf:d6:f8:ec",
            "net10": "be:22:38:f7:23:03",
            "net11": "4e:0d:36:16:4d:5f",
            "net12": "4e:28:51:69:4d:30",
            "net13": "8a:62:8c:f1:c0:e2",
            "net14": "36:45:86:88:86:b4",
            "net15": "4a:a8:81:86:4f:d5",
            "net16": "1a:06:4d:08:b6:31",
            "net17": "32:21:e4:94:1b:58",
            "net18": "86:7f:11:e7:10:62",
            "net19": "5a:e2:2a:de:f4:32",
            "net2": "72:1f:5f:4d:fa:68",
            "net20": "b2:11:03:5f:bc:ef",
            "net21": "6e:8e:9f:b8:ab:b0",
            "net22": "0e:b6:ca:52:10:39",
            "net23": "86:9d:3d:97:2e:3e",
            "net24": "62:2e:97:1f:e7:ac",
            "net25": "5e:6e:76:4e:e9:86",
            "net26": "8a:34:f9:5a:1d:75",
            "net27": "0e:60:50:0c:79:b2",
            "net3": "76:a4:94:35:97:7c",
            "net4": "a6:78:e0:ce:c4:f1",
            "net5": "f2:cd:36:db:74:fc",
            "net6": "96:1d:6a:08:b2:e4",
            "net7": "ee:d5:3c:86:4a:f7",
            "net8": "3e:4f:a9:53:dd:7e",
            "net9": "32:25:62:5a:78:89"
        },
        "spine_1_1_12": {
            "net0": "a2:93:e0:78:d1:05",
            "net1": "5a:dc:be:c6:cd:6a",
            "net10": "ce:43:04:c9:b4:33",
            "net11": "ea:d1:9c:f2:74:30",
            "net12": "7e:f7:0f:60:8f:4d",
            "net13": "72:29:5a:a1:bb:95",
            "net14": "72:bb:58:ec:3a:99",
            "net15": "ae:b3:83:6f:fe:b8",
            "net16": "36:e6:8e:1e:56:c1",
            "net17": "2a:22:dc:8f:cf:a2",
            "net18": "4e:a7:d4:ac:cf:d0",
            "net19": "9e:ad:90:a2:9b:d4",
            "net2": "b2:e6:57:aa:89:e0",
            "net20": "5e:c5:3a:b6:00:d1",
            "net21": "fe:7e:c0:66:f3:8a",
            "net22": "52:a4:cb:39:14:73",
            "net23": "ce:ea:7a:15:f4:b8",
            "net24": "ca:a2:27:1c:98:70",
            "net25": "d2:a5:17:94:25:0f",
            "net26": "d2:ce:7a:82:d2:1e",
            "net27": "7e:79:06:29:93:f0",
            "net3": "6a:0e:9b:23:fa:19",
            "net4": "c2:be:3c:14:87:bd",
            "net5": "82:73:18:92:6c:ca",
            "net6": "62:b0:fb:f6:e3:ea",
            "net7": "fe:69:38:d0:80:54",
            "net8": "0a:f4:65:85:b0:25",
            "net9": "6e:84:15:0f:8f:c1"
        },
        "spine_1_1_13": {
            "net0": "12:21:d1:89:dc:b5",
            "net1": "72:a5:09:ab:aa:bf",
            "net10": "ee:3f:3a:2a:0f:93",
            "net11": "92:12:19:70:df:fd",
            "net12": "32:42:a3:82:00:2c",
            "net13": "9e:7f:d7:89:17:b3",
            "net14": "4a:15:bd:84:9a:ad",
            "net15": "52:d4:5b:a0:f0:0e",
            "net16": "da:89:62:49:01:ab",
            "net17": "9e:02:eb:f5:32:eb",
            "net18": "76:4d:7e:54:c3:c5",
            "net19": "7e:3c:c9:86:f1:3a",
            "net2": "4e:94:20:7f:b9:a9",
            "net20": "ba:64:af:ef:2f:5b",
            "net21": "d6:bf:53:88:31:69",
            "net22": "36:d5:48:1d:32:1a",
            "net23": "9a:dd:ba:23:05:40",
            "net24": "fa:d2:b0:4e:33:09",
            "net25": "0e:6e:fa:15:80:8e",
            "net26": "6a:e1:22:e6:74:57",
            "net27": "46:bf:b5:04:2c:a1",
            "net3": "26:4a:d7:04:e2:02",
            "net4": "ae:57:e6:bc:98:d8",
            "net5": "02:e0:fc:6c:7a:61",
            "net6": "aa:14:be:e9:b3:8d",
            "net7": "ba:61:87:93:cb:91",
            "net8": "a6:50:4f:39:15:d2",
            "net9": "e2:13:cf:f4:2b:24"
        },
        "spine_1_1_14": {
            "net0": "2e:2d:b4:ef:7c:5e",
            "net1": "fe:42:d3:c6:dd:72",
            "net10": "16:f0:46:82:6b:37",
            "net11": "32:df:9e:45:66:0d",
            "net12": "ea:38:f6:a2:2d:a7",
            "net13": "4e:ff:31:b1:1c:cf",
            "net14": "66:6a:61:94:2d:96",
            "net15": "8e:e6:4a:6b:21:ea",
            "net16": "02:d5:3e:fa:b4:ba",
            "net17": "6a:17:a7:1e:35:07",
            "net18": "b6:56:c8:22:d1:a6",
            "net19": "3e:f2:2c:2a:ef:aa",
            "net2": "fe:ca:44:b8:5c:2a",
            "net20": "52:93:36:45:66:f8",
            "net21": "ee:ef:b0:2e:d4:aa",
            "net22": "de:0d:b0:10:b1:06",
            "net23": "f2:af:68:b3:1d:de",
            "net24": "9a:7a:09:58:42:15",
            "net25": "e6:eb:5f:b3:be:20",
            "net26": "2e:f7:ce:42:9a:f1",
            "net27": "7e:a2:c6:35:30:12",
            "net3": "0e:1d:a2:bc:f4:21",
            "net4": "7a:36:48:fa:9e:e0",
            "net5": "0e:48:67:80:91:ba",
            "net6": "32:73:b2:ca:5f:99",
            "net7": "2e:fd:b8:e6:fc:86",
            "net8": "ba:7a:24:c4:24:84",
            "net9": "1a:9c:89:82:d9:c4"
        },
        "spine_1_1_2": {
            "net0": "2a:8f:19:b0:6a:ab",
            "net1": "b6:0b:e1:14:39:d0",
            "net10": "32:65:69:f4:9b:3a",
            "net11": "36:5d:51:95:9d:79",
            "net12": "26:0a:7a:a7:95:cc",
            "net13": "22:d3:69:e2:ec:bb",
            "net14": "76:ea:bd:19:14:40",
            "net15": "e2:8d:34:ba:0e:8a",
            "net16": "aa:a7:78:56:83:c9",
            "net17": "f2:8e:94:61:9e:93",
            "net18": "d6:9f:fc:4e:b9:f7",
            "net19": "4e:93:fd:d5:f1:53",
            "net2": "9e:33:bf:c1:2a:a9",
            "net20": "1a:6e:f7:f9:0b:84",
            "net21": "62:9d:5a:26:d7:9d",
            "net22": "86:8d:fe:54:4b:ca",
            "net23": "aa:53:7b:7f:5c:5d",
            "net24": "06:cc:6c:e8:15:6b",
            "net25": "ce:7d:e7:3e:aa:a9",
            "net26": "b2:fb:b1:49:3c:bc",
            "net27": "86:bb:f6:8a:2c:fd",
            "net3": "a6:40:cd:2c:75:5e",
            "net4": "12:8c:d4:0a:61:85",
            "net5": "9a:56:25:55:06:8d",
            "net6": "ae:86:27:30:6c:66",
            "net7": "de:79:65:c7:a3:03",
            "net8": "76:01:62:3b:2a:bf",
            "net9": "b6:81:60:f5:ab:ff"
        },
        "spine_1_1_3": {
            "net0": "02:73:ef:65:b6:86",
            "net1": "66:d2:4d:63:bd:1a",
            "net10": "42:f3:11:60:9d:7c",
            "net11": "ba:c1:25:ac:bd:e3",
            "net12": "ba:65:49:78:97:2d",
            "net13": "36:48:6d:be:11:f0",
            "net14": "46:8c:68:26:49:8b",
            "net15": "42:54:40:17:3f:bf",
            "net16": "56:07:01:19:08:12",
            "net17": "8e:3d:55:56:45:68",
            "net18": "c2:f8:5a:10:ec:35",
            "net19": "fa:10:9c:6c:61:b8",
            "net2": "56:fc:8a:9d:24:a4",
            "net20": "5a:2e:f8:ec:22:24",
            "net21": "36:4b:37:73:fb:19",
            "net22": "7a:b4:79:38:70:6f",
            "net23": "02:42:9f:48:b7:df",
            "net24": "82:42:33:2a:e8:b5",
            "net25": "1a:06:9d:e8:64:23",
            "net26": "1e:34:62:25:d4:9b",
            "net27": "4e:b2:e7:79:49:9b",
            "net3": "ba:20:c7:cc:1e:47",
            "net4": "0e:f5:04:f7:44:96",
            "net5": "c6:45:95:18:bb:c5",
            "net6": "f6:52:b5:ec:26:82",
            "net7": "ba:a2:40:d5:db:12",
            "net8": "5e:1e:e2:93:bc:57",
            "net9": "b6:b8:47:d6:96:6c"
        },
        "spine_1_1_4": {
            "net0": "4a:be:b8:59:4c:be",
            "net1": "8a:62:40:e2:1e:98",
            "net10": "fe:f6:6c:46:92:80",
            "net11": "d2:cf:bb:7e:80:51",
            "net12": "3e:c5:08:d4:b1:c4",
            "net13": "82:a0:ae:47:4e:1d",
            "net14": "f2:39:46:e6:30:c0",
            "net15": "26:99:9b:66:d4:0e",
            "net16": "2e:5d:20:5e:0c:3c",
            "net17": "c2:ef:ba:c4:5c:5d",
            "net18": "4a:d3:ab:81:a9:74",
            "net19": "3a:0f:f7:15:65:9e",
            "net2": "de:ec:fe:b5:b7:29",
            "net20": "56:cc:06:39:87:49",
            "net21": "1e:96:fe:56:5a:74",
            "net22": "6e:42:aa:39:1c:e0",
            "net23": "c6:41:fc:f4:0c:e2",
            "net24": "ae:3c:8e:db:e1:6b",
            "net25": "2e:7a:90:9b:5e:10",
            "net26": "ca:b1:79:c6:24:6d",
            "net27": "4e:96:e1:11:ec:c8",
            "net3": "c2:df:e2:76:9b:25",
            "net4": "2a:81:a9:5f:9e:70",
            "net5": "92:c0:e8:7b:9c:64",
            "net6": "26:02:87:5f:64:6e",
            "net7": "f2:bd:0b:69:f0:75",
            "net8": "ba:48:c4:e0:92:ae",
            "net9": "46:df:1d:4f:b0:af"
        },
        "spine_1_1_5": {
            "net0": "72:c6:9b:eb:dd:62",
            "net1": "66:e2:47:76:00:de",
            "net10": "52:82:1d:33:1f:3e",
            "net11": "4a:a6:50:2a:a8:7a",
            "net12": "42:49:27:c7:c4:16",
            "net13": "72:da:84:ac:7c:34",
            "net14": "9e:17:a4:e4:2f:ca",
            "net15": "e6:7c:df:23:a7:31",
            "net16": "1a:c0:59:68:12:e0",
            "net17": "1a:2c:a3:bd:55:6f",
            "net18": "da:5d:df:54:00:23",
            "net19": "6a:51:6c:02:9f:40",
            "net2": "8e:ff:5c:7b:31:6b",
            "net20": "f6:a3:e5:56:ca:d2",
            "net21": "3e:74:6b:19:40:4f",
            "net22": "12:80:aa:e1:be:56",
            "net23": "c6:0c:24:42:85:c6",
            "net24": "f2:17:89:f9:e7:07",
            "net25": "fa:52:57:64:92:4e",
            "net26": "9a:58:e6:ea:90:2e",
            "net27": "12:45:c9:a6:02:dd",
            "net3": "8e:8f:c0:d9:5f:2c",
            "net4": "a6:35:ba:0d:49:58",
            "net5": "42:2e:a3:34:5e:ce",
            "net6": "d6:f8:f8:4f:bd:42",
            "net7": "16:b8:a3:e4:24:4a",
            "net8": "86:c6:0b:83:4e:02",
            "net9": "f2:88:92:bc:bb:fa"
        },
        "spine_1_1_6": {
            "net0": "42:50:31:e6:29:41",
            "net1": "6e:7e:30:16:bd:aa",
            "net10": "d6:6e:06:fc:55:12",
            "net11": "d2:4a:c5:df:58:a3",
            "net12": "7a:e8:dc:e0:21:2c",
            "net13": "82:e9:6c:68:ba:d3",
            "net14": "c2:49:eb:7a:99:b0",
            "net15": "ea:0f:06:f5:86:60",
            "net16": "ba:86:d0:c3:4f:cb",
            "net17": "de:d8:e6:fd:74:4c",
            "net18": "2e:fc:29:ab:92:af",
            "net19": "96:b0:c6:54:1f:78",
            "net2": "f2:a6:51:c5:9b:c7",
            "net20": "42:26:86:5b:46:b0",
            "net21": "ba:58:71:4d:9a:b2",
            "net22": "0a:07:66:ed:58:04",
            "net23": "7a:8f:b6:b3:c9:69",
            "net24": "06:81:11:cc:ad:34",
            "net25": "9e:9e:0b:f5:26:10",
            "net26": "ee:23:e7:e9:c1:72",
            "net27": "da:fa:94:89:c8:6b",
            "net3": "de:57:e0:b3:19:b9",
            "net4": "36:3d:d5:a9:5d:86",
            "net5": "1e:ed:41:d9:e8:47",
            "net6": "3a:a8:37:e5:41:92",
            "net7": "82:7e:27:28:c6:8e",
            "net8": "a2:48:f9:d6:e5:52",
            "net9": "56:46:ba:d7:2d:1e"
        },
        "spine_1_1_7": {
            "net0": "12:ad:83:9d:eb:78",
            "net1": "62:85:c2:9b:85:55",
            "net10": "12:c9:16:5c:7f:c3",
            "net11": "3e:70:c7:b3:6a:46",
            "net12": "de:e6:62:bc:fc:c9",
            "net13": "0e:ab:2e:cb:d3:83",
            "net14": "3a:5e:d9:0a:dc:22",
            "net15": "c6:ac:64:f4:32:dd",
            "net16": "f2:8a:b8:b3:eb:2c",
            "net17": "7e:d1:98:1e:b1:44",
            "net18": "ee:6d:0d:a1:a9:49",
            "net19": "3a:62:65:28:05:c6",
            "net2": "02:e6:52:d4:71:8f",
            "net20": "ce:16:f8:52:72:87",
            "net21": "ce:61:24:2c:56:2f",
            "net22": "66:41:4d:c6:c8:47",
            "net23": "ba:2f:97:bc:40:8e",
            "net24": "52:b1:c7:29:ed:d6",
            "net25": "36:ac:8e:7f:d9:09",
            "net26": "f2:9c:48:ce:22:34",
            "net27": "0e:5e:b1:16:dd:5b",
            "net3": "ce:1d:58:a6:b2:58",
            "net4": "ee:a9:3a:88:2d:52",
            "net5": "0e:59:5d:4c:32:65",
            "net6": "fe:50:b0:ab:94:97",
            "net7": "ca:23:d6:8f:dd:1f",
            "net8": "e6:72:bc:7b:6b:1e",
            "net9": "7a:ad:70:7b:7a:1d"
        },
        "spine_1_1_8": {
            "net0": "f2:b6:74:e1:26:49",
            "net1": "7a:bc:36:a2:9e:5c",
            "net10": "ba:01:89:7f:22:a5",
            "net11": "42:e7:43:03:3d:3f",
            "net12": "3e:08:f3:e8:f3:8c",
            "net13": "32:82:60:ab:b7:71",
            "net14": "0e:0e:91:d6:21:5b",
            "net15": "9e:74:9e:57:29:de",
            "net16": "ae:3b:45:b1:19:6e",
            "net17": "be:6d:8e:a3:02:44",
            "net18": "c6:2a:ac:9c:a8:0d",
            "net19": "c2:8f:72:ea:3a:b2",
            "net2": "9a:f1:d0:05:1a:f3",
            "net20": "b6:b9:f6:d1:f8:f2",
            "net21": "1e:6d:2a:db:06:9d",
            "net22": "be:5d:d2:39:92:af",
            "net23": "b6:47:c1:44:3b:d1",
            "net24": "ea:82:89:2f:e8:24",
            "net25": "c2:6d:67:07:88:72",
            "net26": "36:6e:41:9c:ad:6c",
            "net27": "fe:0f:cf:fd:1b:82",
            "net3": "1a:84:f7:5a:08:01",
            "net4": "5a:10:d6:84:9f:71",
            "net5": "6e:d1:c9:84:4a:45",
            "net6": "46:d7:1b:f9:46:98",
            "net7": "66:c1:5c:12:ed:70",
            "net8": "2e:23:d1:6d:b4:30",
            "net9": "2e:1a:6a:ba:25:29"
        },
        "spine_1_1_9": {
            "net0": "0e:87:ab:2a:54:77",
            "net1": "92:83:64:d6:4b:75",
            "net10": "aa:0a:28:9c:59:46",
            "net11": "ba:d2:cd:7c:50:42",
            "net12": "36:8b:43:91:a2:0d",
            "net13": "2e:06:fd:d0:10:ac",
            "net14": "c2:62:85:84:1c:48",
            "net15": "ce:8a:4a:a1:f5:9b",
            "net16": "56:12:1a:c1:5c:3b",
            "net17": "9e:84:cd:23:9f:b8",
            "net18": "de:90:e6:4e:07:d5",
            "net19": "5a:03:47:f3:38:b7",
            "net2": "a2:19:6a:aa:68:fb",
            "net20": "42:b9:7b:04:db:eb",
            "net21": "e2:d8:03:d9:92:93",
            "net22": "5a:2b:86:e5:63:bf",
            "net23": "02:cc:6c:f9:99:4c",
            "net24": "4e:61:df:ce:e4:a2",
            "net25": "5e:ec:c6:67:48:bc",
            "net26": "0e:09:31:3f:3c:52",
            "net27": "4a:bc:f7:d2:7b:50",
            "net3": "26:73:47:8f:a8:c2",
            "net4": "d6:55:7e:20:20:99",
            "net5": "86:62:06:df:6f:2f",
            "net6": "ba:57:a3:be:62:ec",
            "net7": "92:f3:b5:b5:88:39",
            "net8": "36:8b:97:ee:11:e1",
            "net9": "a6:1f:cc:4d:ab:eb"
        },
        "spine_2_1_1": {
            "net0": "ba:06:5a:1e:2a:ad",
            "net1": "5e:c0:b4:7e:5a:60",
            "net10": "36:91:6c:df:f6:7d",
            "net11": "c2:50:b7:08:0c:4d",
            "net12": "66:03:07:c2:32:82",
            "net13": "0a:89:f3:85:2e:bf",
            "net14": "22:b3:0b:55:38:33",
            "net15": "7e:aa:c7:0f:7f:c8",
            "net16": "82:f2:f2:69:6b:27",
            "net17": "b2:d3:9a:be:e9:cb",
            "net18": "e2:3b:1f:f6:d0:7c",
            "net19": "62:40:3b:9f:bb:e5",
            "net2": "16:5a:52:61:5e:9f",
            "net20": "16:64:69:23:b5:80",
            "net21": "8e:3d:2b:1e:17:7e",
            "net22": "b6:64:0e:f1:b9:4b",
            "net23": "26:b3:31:83:bb:48",
            "net24": "f6:c4:4c:ad:86:22",
            "net25": "52:2f:eb:51:80:45",
            "net26": "3a:4a:10:5c:94:7a",
            "net27": "d6:31:7d:41:25:32",
            "net3": "a2:9b:f0:d8:1d:a0",
            "net4": "96:11:fb:aa:f3:1f",
            "net5": "3e:e9:ac:f4:0c:8f",
            "net6": "86:1a:74:c1:3c:97",
            "net7": "a2:e2:46:44:a8:e7",
            "net8": "26:7d:24:4f:09:b0",
            "net9": "a2:e9:3f:f3:e8:e4"
        },
        "spine_2_1_10": {
            "net0": "5e:3b:f7:85:eb:f8",
            "net1": "be:e8:6a:a8:42:6e",
            "net10": "fa:39:4d:d0:33:fd",
            "net11": "6a:ec:37:6b:45:10",
            "net12": "fe:e6:80:7f:69:84",
            "net13": "12:33:75:af:60:0b",
            "net14": "46:f5:7e:86:d0:5d",
            "net15": "6a:ad:e7:12:e7:fa",
            "net16": "9e:73:95:80:79:0a",
            "net17": "2a:af:e2:f0:ff:23",
            "net18": "62:57:fa:c8:d7:e4",
            "net19": "3e:e2:ff:8d:81:66",
            "net2": "72:33:89:e4:d7:93",
            "net20": "42:1f:49:51:66:a3",
            "net21": "52:71:0c:3b:4d:4e",
            "net22": "3a:93:3f:a4:e6:81",
            "net23": "9e:21:a4:8f:03:f7",
            "net24": "5e:c9:8b:e9:12:2c",
            "net25": "b6:94:80:df:14:d7",
            "net26": "d6:90:76:eb:7a:c2",
            "net27": "7e:32:83:27:8f:43",
            "net3": "b2:65:92:a6:a5:ed",
            "net4": "ae:8d:d9:ea:08:79",
            "net5": "a2:ae:f4:30:1e:0b",
            "net6": "fe:0b:35:2b:aa:2f",
            "net7": "02:ff:40:1c:c0:fb",
            "net8": "c6:fe:92:84:ae:9e",
            "net9": "52:49:8b:29:52:2e"
        },
        "spine_2_1_11": {
            "net0": "aa:d1:4f:52:58:54",
            "net1": "6e:58:5e:43:a7:e8",
            "net10": "22:e1:97:c7:41:fe",
            "net11": "f6:93:0a:e4:a7:33",
            "net12": "ba:40:f1:e8:9b:1a",
            "net13": "d6:28:ed:c5:52:93",
            "net14": "2e:fd:3f:57:5c:70",
            "net15": "12:34:a0:6b:94:e9",
            "net16": "ea:b1:f0:4f:38:ce",
            "net17": "1e:2b:d1:94:36:54",
            "net18": "9e:17:27:0d:1e:c7",
            "net19": "ca:4b:bc:21:24:26",
            "net2": "d2:10:db:72:29:f0",
            "net20": "02:b3:70:bd:2b:32",
            "net21": "a2:4b:a8:5e:0a:9f",
            "net22": "ba:2e:5c:22:df:8f",
            "net23": "d2:9f:ae:21:a1:38",
            "net24": "aa:ea:8e:d8:70:04",
            "net25": "6a:aa:ac:a2:eb:c5",
            "net26": "a2:80:69:cd:8a:b2",
            "net27": "c2:fa:ed:27:22:44",
            "net3": "1e:e9:4e:04:c9:f3",
            "net4": "ce:97:8e:60:4c:33",
            "net5": "6a:51:0b:59:fa:a7",
            "net6": "5e:cf:a4:62:41:b8",
            "net7": "ee:41:6e:1b:d6:dd",
            "net8": "e6:03:f9:46:7c:7e",
            "net9": "42:88:12:6d:31:c3"
        },
        "spine_2_1_12": {
            "net0": "82:89:5d:b0:73:c0",
            "net1": "56:00:aa:6b:ea:24",
            "net10": "2e:34:74:2b:9a:98",
            "net11": "da:8a:61:d5:7f:22",
            "net12": "d2:5a:b0:c3:a3:41",
            "net13": "da:6b:8d:04:47:9e",
            "net14": "3a:ac:24:92:2b:09",
            "net15": "26:08:09:11:52:05",
            "net16": "42:85:04:e6:af:cc",
            "net17": "d2:11:9a:76:45:1f",
            "net18": "8a:ff:01:d2:6b:68",
            "net19": "c6:23:0d:3c:b2:cc",
            "net2": "3a:35:83:a6:66:89",
            "net20": "7a:ee:df:09:98:3c",
            "net21": "92:6e:0d:b8:d0:b4",
            "net22": "8a:38:e8:84:5f:b6",
            "net23": "b2:d7:87:08:a1:a8",
            "net24": "1a:a9:53:5d:38:a2",
            "net25": "de:d2:8f:fe:f5:2f",
            "net26": "02:7b:f0:68:b9:5c",
            "net27": "8e:6e:60:d5:b3:80",
            "net3": "66:5b:09:71:93:f4",
            "net4": "ee:ef:41:30:72:77",
            "net5": "e6:88:e8:25:da:fc",
            "net6": "ee:b2:18:f2:c9:1d",
            "net7": "aa:2e:9e:fb:b9:47",
            "net8": "02:4c:b1:00:be:1b",
            "net9": "b2:9a:ef:b1:7d:fc"
        },
        "spine_2_1_13": {
            "net0": "ba:cd:af:59:95:5e",
            "net1": "46:1f:c2:cf:8f:ad",
            "net10": "02:42:cd:ad:93:6f",
            "net11": "22:2a:19:90:cb:5c",
            "net12": "1e:6e:70:aa:7e:bc",
            "net13": "22:6b:cb:60:b2:b5",
            "net14": "ee:a1:c7:91:bd:59",
            "net15": "0e:0d:d3:cf:41:45",
            "net16": "aa:45:ed:9c:46:01",
            "net17": "26:44:24:fb:c7:30",
            "net18": "6a:c8:47:e7:bc:74",
            "net19": "4a:bc:ef:11:44:c9",
            "net2": "42:9c:92:30:36:c4",
            "net20": "ee:12:79:4b:3e:48",
            "net21": "ae:62:ec:b3:77:e2",
            "net22": "da:82:ad:76:5f:12",
            "net23": "5a:2b:a3:f1:8d:c1",
            "net24": "66:c5:cf:2e:f1:c7",
            "net25": "aa:98:22:d3:b5:d3",
            "net26": "76:c9:df:f9:cf:44",
            "net27": "c6:5f:d4:3d:e3:a4",
            "net3": "a2:05:44:1f:97:77",
            "net4": "d2:a8:57:7c:29:86",
            "net5": "1a:2b:2f:ca:ea:f9",
            "net6": "26:85:25:1e:9e:cf",
            "net7": "2a:60:9e:7b:9e:10",
            "net8": "66:bf:6f:e1:61:05",
            "net9": "aa:b0:c1:45:29:41"
        },
        "spine_2_1_14": {
            "net0": "7e:7c:84:35:06:fc",
            "net1": "22:0e:90:4d:33:17",
            "net10": "ce:cd:c3:7c:41:9a",
            "net11": "c2:db:04:e2:d8:ec",
            "net12": "f6:23:05:3d:3d:4f",
            "net13": "76:a1:9c:f9:77:0d",
            "net14": "de:0c:87:02:e6:ae",
            "net15": "3e:27:20:63:1d:50",
            "net16": "3a:1d:08:72:01:6c",
            "net17": "6e:e7:9b:1d:ba:fa",
            "net18": "c6:ef:e9:d3:5d:92",
            "net19": "36:75:ce:af:f1:10",
            "net2": "5a:e8:ad:5d:c2:4a",
            "net20": "22:25:6e:c4:bb:7b",
            "net21": "32:e0:a9:47:43:4a",
            "net22": "a2:7c:e5:0d:9a:74",
            "net23": "92:8f:4b:a3:ec:2a",
            "net24": "1e:7d:09:37:d7:78",
            "net25": "ca:d3:3f:f7:61:86",
            "net26": "56:21:68:3c:d4:08",
            "net27": "76:c0:71:92:96:fc",
            "net3": "86:9b:5c:b0:55:40",
            "net4": "2a:61:7f:23:91:b6",
            "net5": "82:94:66:71:0d:66",
            "net6": "62:88:ab:88:19:66",
            "net7": "16:6c:07:e6:8f:f6",
            "net8": "fa:9a:c3:70:17:b1",
            "net9": "fa:93:97:01:24:95"
        },
        "spine_2_1_2": {
            "net0": "d2:df:75:26:73:a6",
            "net1": "2e:bd:bc:de:8e:9b",
            "net10": "e2:1f:7d:36:06:b2",
            "net11": "ea:62:2b:15:66:e8",
            "net12": "3e:31:6f:f5:49:fa",
            "net13": "a2:ed:13:4b:1c:90",
            "net14": "fa:01:2a:16:31:e4",
            "net15": "76:26:98:9a:ae:99",
            "net16": "1e:27:c7:4e:d9:db",
            "net17": "c6:f2:24:a8:5f:cd",
            "net18": "fe:75:12:1c:fe:d9",
            "net19": "2e:72:18:44:16:72",
            "net2": "02:98:06:2d:b1:da",
            "net20": "42:44:d6:73:d1:7b",
            "net21": "9e:7d:09:29:e0:cf",
            "net22": "82:9b:64:4e:dc:59",
            "net23": "4a:81:c8:a7:a8:de",
            "net24": "c6:f6:bc:de:9e:6b",
            "net25": "c2:4b:e5:ef:a6:48",
            "net26": "62:f8:bc:a8:6c:43",
            "net27": "b2:91:01:5c:2b:08",
            "net3": "ca:b4:98:51:91:c1",
            "net4": "ca:70:49:3e:a3:e5",
            "net5": "86:62:47:42:83:c1",
            "net6": "92:9d:a1:df:5e:f2",
            "net7": "2a:b0:d6:01:f7:64",
            "net8": "c2:74:a6:c2:5f:10",
            "net9": "96:1b:27:66:08:32"
        },
        "spine_2_1_3": {
            "net0": "a2:aa:57:7f:d9:e8",
            "net1": "5e:d7:d0:ef:ad:ec",
            "net10": "1a:95:27:72:05:8c",
            "net11": "c6:10:4a:d5:4e:c2",
            "net12": "22:2e:49:07:1c:2f",
            "net13": "56:e3:2f:3b:06:36",
            "net14": "fa:5f:c6:19:d4:c3",
            "net15": "9e:96:70:4b:ac:df",
            "net16": "ee:b0:cf:c9:2e:b5",
            "net17": "d6:70:e1:63:ec:bf",
            "net18": "2a:77:1c:3f:1d:f5",
            "net19": "6e:02:4e:4c:20:30",
            "net2": "8a:39:8b:f2:54:ec",
            "net20": "aa:a0:e9:28:6b:c2",
            "net21": "fe:79:a2:7c:1c:86",
            "net22": "62:f5:81:54:20:3b",
            "net23": "1e:e7:01:a2:bb:e3",
            "net24": "96:98:c9:6e:73:96",
            "net25": "12:9c:dc:e6:e1:3a",
            "net26": "92:5f:a4:28:fb:89",
            "net27": "4a:2d:50:5a:c0:d6",
            "net3": "be:31:20:a1:8a:78",
            "net4": "f6:46:06:7e:63:f8",
            "net5": "36:75:6c:57:a3:59",
            "net6": "0e:92:a2:a3:ca:ed",
            "net7": "42:11:e9:26:da:2f",
            "net8": "a2:3b:84:a3:d8:93",
            "net9": "22:6c:5c:fd:9e:58"
        },
        "spine_2_1_4": {
            "net0": "ee:d1:a3:e2:75:ca",
            "net1": "16:f2:3b:be:16:19",
            "net10": "8a:e1:82:80:08:b1",
            "net11": "1a:43:c5:47:c9:48",
            "net12": "7a:eb:d7:62:6c:8c",
            "net13": "26:51:38:8c:15:6b",
            "net14": "d2:03:a3:28:32:b8",
            "net15": "3a:f8:d7:65:23:7a",
            "net16": "fa:c3:a1:0c:86:b2",
            "net17": "3e:23:d4:c6:b0:ee",
            "net18": "7a:7c:ee:32:ce:01",
            "net19": "5e:2c:3e:2e:8d:79",
            "net2": "82:71:7b:91:59:4f",
            "net20": "1e:43:28:23:5a:8c",
            "net21": "c6:59:9e:37:98:00",
            "net22": "fe:80:cb:b8:a5:3c",
            "net23": "c6:59:03:7e:a9:a9",
            "net24": "ea:88:dd:44:2e:5a",
            "net25": "aa:9d:52:f9:e9:40",
            "net26": "3a:54:6f:62:07:92",
            "net27": "7a:ce:a5:d3:87:71",
            "net3": "26:d0:4f:24:04:f7",
            "net4": "3a:6d:d9:be:9b:e3",
            "net5": "3e:3d:fd:78:cb:ed",
            "net6": "7e:9a:b7:ba:93:cd",
            "net7": "fa:85:e3:59:ba:ed",
            "net8": "4a:82:0f:27:2f:9e",
            "net9": "ce:12:45:0d:e4:aa"
        },
        "spine_2_1_5": {
            "net0": "f6:b9:43:e8:02:8c",
            "net1": "06:1d:65:9a:74:c3",
            "net10": "e2:12:f9:a1:c9:00",
            "net11": "92:1d:19:3f:a8:41",
            "net12": "0e:0a:e2:ec:91:e4",
            "net13": "e6:28:87:97:91:f4",
            "net14": "32:83:64:8a:7e:33",
            "net15": "46:c1:d3:d8:3b:8d",
            "net16": "9e:5c:7d:e6:36:2d",
            "net17": "9e:2d:78:d4:99:34",
            "net18": "82:ac:03:44:e8:0d",
            "net19": "7a:05:11:54:53:70",
            "net2": "e6:3a:d7:3b:83:58",
            "net20": "62:29:3c:05:98:15",
            "net21": "ae:96:8f:76:43:28",
            "net22": "ea:3a:ba:34:10:c7",
            "net23": "f2:3d:a3:7a:be:ea",
            "net24": "ee:4d:0d:be:53:d3",
            "net25": "62:ac:8c:54:a2:e6",
            "net26": "e6:dd:0b:08:59:15",
            "net27": "76:60:b2:3d:04:e7",
            "net3": "d6:40:28:32:0c:b6",
            "net4": "96:02:5a:8d:b1:72",
            "net5": "ce:22:bf:86:31:c4",
            "net6": "42:5c:5f:a5:5d:8e",
            "net7": "be:fd:40:dc:78:5f",
            "net8": "8e:c8:39:cc:f3:5b",
            "net9": "0a:cd:c6:ac:65:4c"
        },
        "spine_2_1_6": {
            "net0": "36:ae:cf:ef:de:a2",
            "net1": "aa:f2:5f:cb:35:75",
            "net10": "2a:a0:66:af:eb:0e",
            "net11": "8a:71:a4:07:6a:69",
            "net12": "1e:55:cf:f8:6f:5d",
            "net13": "ea:06:bb:32:2c:b2",
            "net14": "0e:02:b3:19:42:d1",
            "net15": "6e:21:c2:23:0d:3b",
            "net16": "02:0b:0b:bd:b1:f2",
            "net17": "72:57:65:e7:dd:45",
            "net18": "de:3b:c9:45:89:1c",
            "net19": "7a:bd:99:31:9c:9d",
            "net2": "fe:58:1a:87:1d:9e",
            "net20": "c6:c2:50:25:f5:c3",
            "net21": "3a:29:18:12:c1:d3",
            "net22": "92:9d:e5:ff:88:eb",
            "net23": "16:98:5e:2b:ae:92",
            "net24": "1a:ae:70:ed:09:47",
            "net25": "f2:00:8b:23:8b:a8",
            "net26": "16:1d:b8:54:27:51",
            "net27": "7a:9d:ef:ce:ff:df",
            "net3": "86:b5:82:64:1a:70",
            "net4": "ba:c3:9c:85:95:28",
            "net5": "46:b2:c2:51:2a:0a",
            "net6": "fe:c3:bd:c2:5a:9b",
            "net7": "6a:aa:73:ed:e1:88",
            "net8": "52:fd:a8:d6:88:ca",
            "net9": "d2:ba:cf:da:e0:a8"
        },
        "spine_2_1_7": {
            "net0": "4a:9b:0a:7e:e2:74",
            "net1": "d2:61:73:65:99:cf",
            "net10": "6e:0b:8c:f7:cb:ad",
            "net11": "62:44:20:e2:17:5e",
            "net12": "b6:c6:12:ca:4a:48",
            "net13": "e2:35:05:01:59:cd",
            "net14": "8e:6c:6e:45:82:57",
            "net15": "5a:e3:a5:65:a1:12",
            "net16": "32:a5:8b:4f:a3:e7",
            "net17": "f2:93:89:c5:0d:4b",
            "net18": "06:f2:e2:2e:ba:4d",
            "net19": "1e:a4:61:59:25:23",
            "net2": "ce:af:29:16:e7:b1",
            "net20": "12:ab:9b:70:12:96",
            "net21": "e6:0a:5c:42:4e:45",
            "net22": "6e:16:81:1b:02:ad",
            "net23": "e2:ea:f4:8e:ec:18",
            "net24": "b6:43:69:3c:7c:71",
            "net25": "0e:19:09:e4:39:8d",
            "net26": "06:e9:92:9c:78:2f",
            "net27": "d2:8a:48:db:98:58",
            "net3": "92:12:28:0d:47:79",
            "net4": "52:97:27:56:4f:7d",
            "net5": "66:c6:d3:e6:73:24",
            "net6": "46:5e:9b:61:b6:9b",
            "net7": "82:ba:f7:e2:c0:d8",
            "net8": "46:28:bb:08:f4:61",
            "net9": "b2:1e:6a:d8:c3:3c"
        },
        "spine_2_1_8": {
            "net0": "2a:11:85:b6:87:d8",
            "net1": "b6:b0:77:30:9d:66",
            "net10": "8a:41:4d:8b:09:d5",
            "net11": "5e:1e:44:e3:2f:85",
            "net12": "c2:34:fd:e7:4a:80",
            "net13": "46:cd:65:45:39:4b",
            "net14": "56:30:a6:54:d9:5d",
            "net15": "0a:8d:53:8f:14:dd",
            "net16": "4a:88:93:1f:35:4a",
            "net17": "be:e6:13:c9:34:da",
            "net18": "aa:7e:4c:74:c6:77",
            "net19": "42:89:b1:77:a6:da",
            "net2": "0e:7f:36:63:47:1f",
            "net20": "7a:9a:f2:2c:30:76",
            "net21": "a6:29:60:30:00:a7",
            "net22": "f6:7d:23:fe:22:a4",
            "net23": "fe:00:5c:2d:e9:45",
            "net24": "b6:5f:36:fe:a1:be",
            "net25": "d6:d3:c1:9c:34:67",
            "net26": "2a:c4:a5:7b:16:14",
            "net27": "be:9e:ef:10:12:27",
            "net3": "3a:07:a8:ec:b1:09",
            "net4": "ea:45:fd:a1:3e:4e",
            "net5": "5a:6b:8d:92:8d:d4",
            "net6": "56:f6:ad:0a:ac:08",
            "net7": "3a:9a:3a:42:73:5a",
            "net8": "e6:59:d1:c3:11:32",
            "net9": "a6:dd:a0:b3:1e:a2"
        },
        "spine_2_1_9": {
            "net0": "c6:8b:66:9f:9d:d3",
            "net1": "3e:e6:a1:cd:c6:69",
            "net10": "26:93:ae:26:19:d4",
            "net11": "2a:dd:25:a5:c7:f1",
            "net12": "56:ff:de:5a:50:3d",
            "net13": "da:cd:8b:d1:79:d0",
            "net14": "aa:66:da:83:57:53",
            "net15": "22:5d:b1:4a:a8:fc",
            "net16": "ba:0e:b2:23:ce:75",
            "net17": "66:8d:44:65:b5:43",
            "net18": "ba:82:b7:1b:22:c5",
            "net19": "fe:cd:42:f9:6f:7e",
            "net2": "f6:6d:0e:8a:d1:74",
            "net20": "ba:57:3b:32:df:8c",
            "net21": "4e:74:c7:f5:11:d3",
            "net22": "86:10:4e:0d:a0:20",
            "net23": "62:ca:18:f3:50:ef",
            "net24": "12:f5:57:16:fe:76",
            "net25": "4a:0d:b2:4e:8a:15",
            "net26": "ba:22:70:8d:37:23",
            "net27": "1e:74:ad:84:49:82",
            "net3": "a6:d6:ac:5b:59:93",
            "net4": "4a:36:fe:a8:28:2f",
            "net5": "c2:af:df:4d:42:92",
            "net6": "ce:55:08:80:b4:58",
            "net7": "86:c1:38:29:85:0c",
            "net8": "16:84:fc:e5:16:69",
            "net9": "b2:32:17:ee:d9:c0"
        },
        "tof_1_2_1": {
            "net0": "f6:ae:19:61:e6:32",
            "net1": "32:8a:0e:c8:a4:92",
            "net10": "4a:f0:db:8e:8f:34",
            "net11": "c6:d8:eb:f7:fb:17",
            "net12": "06:fb:63:31:cc:54",
            "net13": "9a:4a:fa:d3:5b:e2",
            "net14": "0a:5a:b1:dd:d0:0c",
            "net15": "8e:58:d3:ec:53:c6",
            "net16": "9a:87:5c:e7:f8:b0",
            "net17": "06:23:67:e3:42:40",
            "net18": "8a:d5:7d:b4:90:18",
            "net19": "be:ea:e4:c6:6f:e6",
            "net2": "fa:67:a8:86:87:5e",
            "net20": "12:b8:50:29:70:0e",
            "net21": "8e:a2:a9:20:bc:f2",
            "net22": "7e:53:97:70:f2:c7",
            "net23": "c6:9c:02:14:0e:0b",
            "net24": "46:9d:05:58:e7:57",
            "net25": "06:50:a6:11:52:28",
            "net26": "f6:a5:ba:dd:c4:04",
            "net27": "86:69:ce:5e:8f:9d",
            "net3": "b6:a7:33:b7:ad:56",
            "net4": "c2:eb:03:55:58:bb",
            "net5": "ce:18:bd:40:a9:2e",
            "net6": "e2:85:07:8d:ad:6e",
            "net7": "9e:44:d5:dc:9e:23",
            "net8": "b6:e3:43:e4:d0:22",
            "net9": "ae:28:30:26:ab:86"
        },
        "tof_1_2_10": {
            "net0": "6e:d1:57:c4:40:6e",
            "net1": "da:d5:81:53:71:35",
            "net10": "9a:9d:e3:54:99:19",
            "net11": "ea:4d:ae:61:65:e6",
            "net12": "4e:00:eb:71:c8:93",
            "net13": "0a:72:6e:f1:70:cc",
            "net14": "0a:bc:31:f4:81:e2",
            "net15": "c2:fa:9a:35:ad:31",
            "net16": "ea:38:92:18:99:45",
            "net17": "e6:94:7b:fc:89:c3",
            "net18": "96:60:dc:83:ef:2d",
            "net19": "6a:31:00:d1:a2:5d",
            "net2": "4e:ed:1d:23:4b:a5",
            "net20": "c2:02:24:f4:ce:65",
            "net21": "82:cf:b4:cc:ae:96",
            "net22": "b2:f3:1d:5d:da:d6",
            "net23": "52:bd:0c:41:03:b4",
            "net24": "ce:d0:d0:aa:3a:00",
            "net25": "e2:b4:67:eb:c3:dc",
            "net26": "66:b8:5a:cf:57:d0",
            "net27": "96:8b:ee:8e:f8:b6",
            "net3": "52:ad:a3:c0:98:fd",
            "net4": "0a:ca:0a:37:03:51",
            "net5": "2e:a2:f5:a1:5d:77",
            "net6": "72:8b:fc:2f:65:78",
            "net7": "76:80:aa:a8:4f:9f",
            "net8": "b2:71:3f:56:15:4f",
            "net9": "16:5d:18:04:d2:ee"
        },
        "tof_1_2_11": {
            "net0": "56:8b:b7:bd:fc:92",
            "net1": "ee:e8:4d:f9:13:e3",
            "net10": "ce:f5:fe:ae:6b:da",
            "net11": "82:ea:3f:96:3a:8f",
            "net12": "46:e5:fe:e5:f4:67",
            "net13": "9a:10:7f:f9:f1:99",
            "net14": "fa:6f:ea:3c:45:9d",
            "net15": "32:42:5e:81:89:11",
            "net16": "22:f3:52:2d:98:17",
            "net17": "72:8c:73:33:a3:8b",
            "net18": "7a:57:f8:6f:f2:72",
            "net19": "c6:9f:0b:5e:99:80",
            "net2": "ea:d9:dd:50:b8:3c",
            "net20": "56:2e:fd:71:0c:db",
            "net21": "de:64:9e:84:f9:af",
            "net22": "be:5d:f9:6c:d1:32",
            "net23": "16:8b:1e:74:99:aa",
            "net24": "de:48:44:5f:31:2f",
            "net25": "de:95:c3:16:17:0f",
            "net26": "a2:b9:ff:04:a8:04",
            "net27": "aa:a1:42:c7:72:6e",
            "net3": "ce:4e:18:a3:39:cf",
            "net4": "36:80:e2:25:85:33",
            "net5": "7e:26:3a:c1:8e:e6",
            "net6": "62:cc:04:48:ef:0c",
            "net7": "1e:85:28:33:87:0f",
            "net8": "1a:4b:9c:4d:0f:27",
            "net9": "7a:df:12:3d:8a:0a"
        },
        "tof_1_2_12": {
            "net0": "e6:be:39:92:d1:84",
            "net1": "6a:72:71:08:45:ba",
            "net10": "ee:89:e8:ed:d4:cc",
            "net11": "e2:21:34:8c:84:7f",
            "net12": "3e:55:a9:42:77:51",
            "net13": "ce:e1:f0:85:62:91",
            "net14": "5e:c3:04:ba:69:8a",
            "net15": "96:ad:e2:2b:5b:fd",
            "net16": "82:98:c6:49:7a:15",
            "net17": "46:de:4f:86:41:c0",
            "net18": "3a:e7:f3:89:9e:7d",
            "net19": "4a:dc:2f:0c:77:22",
            "net2": "26:c5:8e:37:a9:d8",
            "net20": "2a:8e:3e:8f:cc:fb",
            "net21": "ba:70:0c:c6:44:c5",
            "net22": "5a:2a:04:95:78:5b",
            "net23": "1a:b4:23:fc:86:9e",
            "net24": "d2:45:38:17:40:55",
            "net25": "7e:e9:e3:a1:8e:86",
            "net26": "7a:50:33:56:09:b4",
            "net27": "52:b1:b0:fd:40:4c",
            "net3": "82:08:a8:dd:39:3b",
            "net4": "b6:e6:36:81:ed:a1",
            "net5": "b6:07:d6:1a:8d:c4",
            "net6": "66:89:90:95:32:c1",
            "net7": "52:79:5c:39:6e:e8",
            "net8": "2a:c9:01:60:68:55",
            "net9": "f6:21:7b:8f:7f:00"
        },
        "tof_1_2_13": {
            "net0": "d6:a3:bc:2d:4c:bf",
            "net1": "ae:c3:f5:48:e1:f2",
            "net10": "2a:c9:56:64:9c:e6",
            "net11": "12:80:28:69:3c:07",
            "net12": "ea:df:ce:f8:ec:fc",
            "net13": "06:51:99:78:b6:22",
            "net14": "c6:88:1e:91:c1:72",
            "net15": "2a:12:e1:f0:f7:0f",
            "net16": "d2:97:18:bf:35:ca",
            "net17": "0e:95:8c:a8:6e:27",
            "net18": "12:6b:18:94:24:e9",
            "net19": "86:44:80:52:b7:69",
            "net2": "ce:d7:66:2e:d5:0b",
            "net20": "66:2e:2b:5f:5a:af",
            "net21": "ce:5e:64:3e:34:e7",
            "net22": "46:41:83:dc:b3:05",
            "net23": "d2:2b:05:3e:89:7f",
            "net24": "3a:1c:5c:a1:e9:61",
            "net25": "6a:4c:8f:2c:27:e8",
            "net26": "a6:e1:7e:aa:75:f3",
            "net27": "e6:72:e0:2d:ca:99",
            "net3": "12:f4:c5:3e:d2:24",
            "net4": "6a:c3:8b:8d:c2:0a",
            "net5": "fe:ec:a0:1e:c7:02",
            "net6": "3a:8c:e8:07:ab:08",
            "net7": "76:cc:fc:5f:13:99",
            "net8": "ce:98:9c:50:98:c4",
            "net9": "be:73:f6:77:fa:60"
        },
        "tof_1_2_14": {
            "net0": "32:cd:75:c2:6f:40",
            "net1": "3e:c5:7b:93:b5:d7",
            "net10": "2a:d2:08:d8:c8:a9",
            "net11": "26:05:16:86:21:79",
            "net12": "92:fb:0f:bd:27:2d",
            "net13": "26:fe:8a:2b:45:7f",
            "net14": "e2:70:65:ed:62:44",
            "net15": "72:ad:88:b9:18:f0",
            "net16": "2e:6c:66:0d:a6:9b",
            "net17": "1a:e5:e4:08:f0:d8",
            "net18": "5e:2c:40:ea:1b:96",
            "net19": "ce:9b:b4:82:dd:3c",
            "net2": "1e:51:eb:53:0c:87",
            "net20": "c2:2b:3d:da:9d:2d",
            "net21": "f2:d3:39:25:b8:63",
            "net22": "12:7d:f1:c4:6b:6a",
            "net23": "92:2d:a5:a3:09:d6",
            "net24": "fa:12:f6:99:e8:cd",
            "net25": "e2:05:ec:c7:e6:35",
            "net26": "52:b1:94:fc:90:bc",
            "net27": "66:2b:63:5b:7b:bf",
            "net3": "16:e0:6e:f6:ec:c9",
            "net4": "6a:23:12:da:ee:f4",
            "net5": "a2:56:7a:f4:4e:e9",
            "net6": "be:72:7c:e6:b6:f4",
            "net7": "72:6e:78:e4:cf:84",
            "net8": "2a:06:60:08:c4:9e",
            "net9": "4e:62:16:24:9b:eb"
        },
        "tof_1_2_2": {
            "net0": "3e:58:3c:c9:76:4b",
            "net1": "e6:41:ea:ab:78:f3",
            "net10": "3a:f8:5d:fe:39:53",
            "net11": "7e:4e:e1:18:7a:3c",
            "net12": "ba:e0:ca:46:74:83",
            "net13": "fe:d4:96:77:74:a4",
            "net14": "62:61:67:14:eb:9b",
            "net15": "72:82:53:b8:af:8f",
            "net16": "e2:f5:3c:57:3e:53",
            "net17": "0e:97:3e:a3:7b:2a",
            "net18": "ba:8e:bd:fd:df:94",
            "net19": "fe:a4:73:0d:20:c4",
            "net2": "82:a1:71:ce:38:62",
            "net20": "aa:49:33:2b:d5:46",
            "net21": "ea:bc:98:82:33:8f",
            "net22": "5a:b3:10:c1:30:6c",
            "net23": "ae:50:8c:8c:f8:9c",
            "net24": "ce:b4:39:a7:61:ad",
            "net25": "72:b2:0d:6b:9f:bd",
            "net26": "ee:e1:6d:20:30:b8",
            "net27": "02:b8:6d:8f:49:09",
            "net3": "ea:b0:c6:29:48:d1",
            "net4": "92:d6:ed:62:44:ff",
            "net5": "9a:35:6b:f5:5d:26",
            "net6": "22:da:a1:c6:45:63",
            "net7": "ce:03:19:14:93:b4",
            "net8": "92:3a:1a:be:8b:28",
            "net9": "8e:da:12:d3:8a:ae"
        },
        "tof_1_2_3": {
            "net0": "6e:b3:2c:fd:0a:fd",
            "net1": "e2:e3:46:0b:25:ac",
            "net10": "36:3a:1b:3f:39:e4",
            "net11": "8e:ca:46:e3:70:63",
            "net12": "3a:b2:b6:13:ef:e5",
            "net13": "f6:bd:22:32:0a:cf",
            "net14": "12:95:79:8f:ee:8d",
            "net15": "96:f3:37:35:a3:af",
            "net16": "2a:5a:bf:48:0e:34",
            "net17": "da:af:e3:66:1f:7c",
            "net18": "66:d4:69:ba:b8:fd",
            "net19": "e2:45:5a:6c:75:ca",
            "net2": "ca:5a:24:15:ae:69",
            "net20": "56:ca:4f:c1:00:00",
            "net21": "d6:e7:c4:26:e0:f2",
            "net22": "4a:4a:eb:15:c2:46",
            "net23": "56:44:f5:9f:83:24",
            "net24": "be:8e:06:65:03:4b",
            "net25": "e6:a2:fb:7a:0d:08",
            "net26": "0a:bc:1b:67:9a:c2",
            "net27": "f2:01:1b:24:c4:a0",
            "net3": "42:c3:94:a0:9b:d8",
            "net4": "86:97:16:7e:22:91",
            "net5": "fe:ec:6c:de:08:1a",
            "net6": "8e:e2:2b:5c:8e:5b",
            "net7": "42:06:69:cd:c9:ae",
            "net8": "42:46:a6:c4:39:17",
            "net9": "3a:e7:71:a5:04:72"
        },
        "tof_1_2_4": {
            "net0": "d6:b7:5e:44:8d:b3",
            "net1": "1e:7f:b3:f7:7e:7b",
            "net10": "c6:f4:76:04:73:ae",
            "net11": "ee:77:0f:07:c7:8b",
            "net12": "0a:d0:c6:19:8f:59",
            "net13": "52:aa:f4:a2:3f:46",
            "net14": "e6:83:9e:1b:38:27",
            "net15": "16:ea:d5:fd:cc:06",
            "net16": "66:f0:f9:30:71:33",
            "net17": "aa:64:5c:e2:a6:ca",
            "net18": "c6:75:6d:18:a9:d4",
            "net19": "0e:12:6c:17:c6:32",
            "net2": "4a:3e:86:29:ce:78",
            "net20": "ca:42:e5:f7:a4:87",
            "net21": "02:ad:79:42:1b:fc",
            "net22": "a6:d2:18:18:66:18",
            "net23": "6a:ea:d9:a4:e4:0e",
            "net24": "92:6e:96:05:52:a6",
            "net25": "52:e0:e5:a6:6f:18",
            "net26": "72:d3:96:f0:7e:20",
            "net27": "4e:4c:27:7b:fe:25",
            "net3": "3e:d1:fe:d6:b2:f2",
            "net4": "fe:57:4b:8b:2e:0f",
            "net5": "22:da:12:b8:d1:17",
            "net6": "5a:b2:e0:ae:72:15",
            "net7": "b6:56:54:84:96:3d",
            "net8": "06:7c:fb:d4:df:59",
            "net9": "26:05:98:e6:40:f7"
        },
        "tof_1_2_5": {
            "net0": "c2:1d:2b:c2:5e:82",
            "net1": "b2:12:34:26:3e:63",
            "net10": "32:45:5b:75:a8:03",
            "net11": "4a:6e:de:ef:72:60",
            "net12": "86:b4:58:eb:0a:71",
            "net13": "a6:8d:ba:b3:dc:ae",
            "net14": "1a:9c:9a:c1:51:f2",
            "net15": "b6:01:1f:46:98:98",
            "net16": "e6:5e:a5:4d:a4:ae",
            "net17": "de:d8:da:94:fc:22",
            "net18": "fa:44:53:13:45:e5",
            "net19": "6e:98:d7:73:cc:b7",
            "net2": "f2:58:7c:59:4e:9d",
            "net20": "ee:dc:55:5c:78:af",
            "net21": "32:8b:c6:1a:e5:61",
            "net22": "ea:71:31:47:35:7e",
            "net23": "da:fa:96:35:e8:7a",
            "net24": "d2:c2:62:55:97:9e",
            "net25": "86:79:52:74:b9:07",
            "net26": "ae:79:ff:61:b6:4e",
            "net27": "b2:95:93:06:c9:80",
            "net3": "7a:dc:99:e6:ae:c8",
            "net4": "62:a1:d5:77:37:4e",
            "net5": "ee:4a:03:07:b8:d8",
            "net6": "52:0e:58:ab:65:e4",
            "net7": "a2:1f:ad:80:1c:4f",
            "net8": "16:ca:76:ea:e4:ab",
            "net9": "02:82:eb:a0:71:6e"
        },
        "tof_1_2_6": {
            "net0": "2e:81:ba:20:d0:a9",
            "net1": "46:81:55:37:0a:8a",
            "net10": "ae:bd:c4:90:b9:37",
            "net11": "ae:8a:99:36:2e:0e",
            "net12": "fe:c4:93:10:75:65",
            "net13": "6e:61:82:39:1d:73",
            "net14": "ae:19:0e:d2:e9:16",
            "net15": "6a:60:4b:e0:38:43",
            "net16": "82:b2:ff:33:fc:39",
            "net17": "a6:cf:02:59:34:de",
            "net18": "12:8a:8f:fc:b4:43",
            "net19": "fa:0f:af:99:5a:3e",
            "net2": "12:ea:7a:30:b2:0a",
            "net20": "7a:31:7a:1b:f4:33",
            "net21": "ee:d3:80:99:77:7b",
            "net22": "92:7a:85:e7:a0:73",
            "net23": "62:d0:2b:76:08:6f",
            "net24": "9a:07:ee:34:30:74",
            "net25": "ba:83:1b:7d:67:cc",
            "net26": "2e:33:9e:f7:7c:10",
            "net27": "0a:38:75:25:d6:0b",
            "net3": "0e:5c:c7:06:c4:1c",
            "net4": "d6:9d:e8:0e:a3:c9",
            "net5": "f6:02:e3:3e:c9:ef",
            "net6": "0e:bb:04:72:71:ad",
            "net7": "0e:81:cc:f1:6f:5a",
            "net8": "0a:3f:bd:ae:1b:08",
            "net9": "ee:d0:c7:0c:3b:e0"
        },
        "tof_1_2_7": {
            "net0": "ee:ca:e2:e3:2c:2a",
            "net1": "d6:e4:c9:23:43:16",
            "net10": "96:5a:6a:cd:3b:90",
            "net11": "0a:ab:64:4a:22:60",
            "net12": "3e:60:e1:6b:a0:50",
            "net13": "a6:7c:ad:83:27:63",
            "net14": "e2:77:0a:14:5f:47",
            "net15": "1e:30:a8:1f:2c:30",
            "net16": "36:c9:52:ce:ba:18",
            "net17": "5e:8e:d4:91:7b:3d",
            "net18": "9e:9c:9c:ec:01:ea",
            "net19": "8a:30:0a:9c:39:1e",
            "net2": "a6:2c:a6:c3:80:22",
            "net20": "3a:fb:9a:22:89:a5",
            "net21": "3e:9c:ab:e6:23:88",
            "net22": "3e:2c:73:5c:d5:79",
            "net23": "1a:8d:01:f1:21:3c",
            "net24": "fe:16:b1:80:07:1e",
            "net25": "42:4d:70:9c:46:7c",
            "net26": "92:ef:c5:55:10:d7",
            "net27": "e2:e1:de:d9:f3:11",
            "net3": "72:38:72:57:93:f0",
            "net4": "5e:c6:f9:43:16:24",
            "net5": "56:39:98:fb:83:93",
            "net6": "5a:37:b3:8c:71:d9",
            "net7": "fe:21:8a:7d:ec:80",
            "net8": "66:c1:98:a3:c4:86",
            "net9": "a6:6e:f0:ca:12:65"
        },
        "tof_1_2_8": {
            "net0": "62:9e:c1:c9:24:95",
            "net1": "02:0f:e9:42:16:26",
            "net10": "ce:45:35:ee:b8:ed",
            "net11": "26:62:09:fc:6c:11",
            "net12": "f2:f9:53:b2:dd:40",
            "net13": "3a:b5:9e:a5:c2:31",
            "net14": "6a:ef:e6:b0:23:bc",
            "net15": "7a:5b:90:ca:cf:c8",
            "net16": "02:84:17:36:5d:66",
            "net17": "96:31:0b:53:66:11",
            "net18": "a2:f3:16:94:5e:5c",
            "net19": "72:ef:05:7a:af:0c",
            "net2": "5a:73:56:75:87:d7",
            "net20": "7e:8a:bc:51:99:06",
            "net21": "da:5c:04:06:19:33",
            "net22": "12:0d:67:fb:1a:ab",
            "net23": "da:3f:d7:f9:83:93",
            "net24": "ca:e0:52:b4:c4:fd",
            "net25": "7e:c6:cb:17:22:7a",
            "net26": "aa:a4:31:70:5d:e1",
            "net27": "be:6b:86:3e:1f:9d",
            "net3": "96:3b:2e:bd:63:ff",
            "net4": "82:f8:cd:b8:92:8e",
            "net5": "32:af:68:c7:e9:80",
            "net6": "b6:9a:18:8f:cc:cd",
            "net7": "c2:64:f9:8d:91:09",
            "net8": "fa:02:60:6d:33:0f",
            "net9": "2a:cb:f8:0a:e9:2d"
        },
        "tof_1_2_9": {
            "net0": "c2:bc:04:21:1a:8e",
            "net1": "c6:be:5c:82:54:33",
            "net10": "1a:50:fd:02:32:58",
            "net11": "7e:e8:29:89:20:58",
            "net12": "ce:82:0e:60:08:66",
            "net13": "f6:34:13:aa:a7:aa",
            "net14": "1e:6c:4a:6a:28:9e",
            "net15": "7e:80:c9:68:ba:6a",
            "net16": "52:f1:1d:8a:2b:fc",
            "net17": "c2:01:6f:ec:26:01",
            "net18": "02:4b:66:a5:18:0e",
            "net19": "ae:38:5a:37:6c:6d",
            "net2": "6a:f0:2d:97:56:98",
            "net20": "9e:91:ea:ae:d5:ea",
            "net21": "5a:f6:ab:a6:54:34",
            "net22": "d6:be:b1:9c:b2:c3",
            "net23": "22:30:2e:77:25:b6",
            "net24": "6e:46:53:c0:3e:8d",
            "net25": "ca:bc:6a:6c:07:d1",
            "net26": "82:70:cc:4b:89:e5",
            "net27": "06:98:f8:96:fe:de",
            "net3": "d6:f3:67:c0:4e:e3",
            "net4": "a6:41:aa:c5:82:f2",
            "net5": "de:d9:27:ee:98:43",
            "net6": "a2:7b:a6:31:cf:42",
            "net7": "a6:f0:5d:8c:cf:e3",
            "net8": "de:25:5a:f4:b5:a5",
            "net9": "0a:ae:17:1a:1c:34"
        }
    },
    "failed_machine": "leaf_1_0_1",
    "failure_time": {
        "leaf_1_0_1": 1620862213.467443,
        "leaf_1_0_10": 1620862213.4778488,
        "leaf_1_0_11": 1620862213.4960752,
        "leaf_1_0_12": 1620862213.505174,
        "leaf_1_0_13": 1620862213.523525,
        "leaf_1_0_14": 1620862213.471908,
        "leaf_1_0_2": 1620862213.481271,
        "leaf_1_0_3": 1620862213.5006378,
        "leaf_1_0_4": 1620862213.5164082,
        "leaf_1_0_5": 1620862213.53623,
        "leaf_1_0_6": 1620862213.4715915,
        "leaf_1_0_7": 1620862213.484492,
        "leaf_1_0_8": 1620862213.4978778,
        "leaf_1_0_9": 1620862213.5071862,
        "leaf_2_0_1": 1620862213.532365,
        "leaf_2_0_10": 1620862213.475343,
        "leaf_2_0_11": 1620862213.4911659,
        "leaf_2_0_12": 1620862213.499293,
        "leaf_2_0_13": 1620862213.5114899,
        "leaf_2_0_14": 1620862213.5406306,
        "leaf_2_0_2": 1620862213.5356665,
        "leaf_2_0_3": 1620862213.5556734,
        "leaf_2_0_4": 1620862213.5692198,
        "leaf_2_0_5": 1620862213.5783281,
        "leaf_2_0_6": 1620862213.5921645,
        "leaf_2_0_7": 1620862213.5443926,
        "leaf_2_0_8": 1620862213.5599065,
        "leaf_2_0_9": 1620862213.570874,
        "spine_1_1_1": 1620862213.584286,
        "spine_1_1_10": 1620862213.5975897,
        "spine_1_1_11": 1620862213.5554917,
        "spine_1_1_12": 1620862213.5652888,
        "spine_1_1_13": 1620862213.5737658,
        "spine_1_1_14": 1620862213.580559,
        "spine_1_1_2": 1620862213.592273,
        "spine_1_1_3": 1620862213.5601165,
        "spine_1_1_4": 1620862213.5713503,
        "spine_1_1_5": 1620862213.57855,
        "spine_1_1_6": 1620862213.5865614,
        "spine_1_1_7": 1620862213.5997531,
        "spine_1_1_8": 1620862213.6025586,
        "spine_1_1_9": 1620862213.6252472,
        "spine_2_1_1": 1620862213.6394916,
        "spine_2_1_10": 1620862213.6597595,
        "spine_2_1_11": 1620862213.6656022,
        "spine_2_1_12": 1620862213.6018922,
        "spine_2_1_13": 1620862213.6090078,
        "spine_2_1_14": 1620862213.6325963,
        "spine_2_1_2": 1620862213.6442025,
        "spine_2_1_3": 1620862213.6638684,
        "spine_2_1_4": 1620862213.604955,
        "spine_2_1_5": 1620862213.6283922,
        "spine_2_1_6": 1620862213.6449933,
        "spine_2_1_7": 1620862213.6652539,
        "spine_2_1_8": 1620862213.6880388,
        "spine_2_1_9": 1620862213.6200342,
        "tof_1_2_1": 1620862213.6421304,
        "tof_1_2_10": 1620862213.6615717,
        "tof_1_2_11": 1620862213.6693926,
        "tof_1_2_12": 1620862213.6894474,
        "tof_1_2_13": 1620862213.6819637,
        "tof_1_2_14": 1620862213.6904337,
        "tof_1_2_2": 1620862213.7017539,
        "tof_1_2_3": 1620862213.712983,
        "tof_1_2_4": 1620862213.7284288,
        "tof_1_2_5": 1620862213.6887753,
        "tof_1_2_6": 1620862213.699631,
        "tof_1_2_7": 1620862213.710398,
        "tof_1_2_8": 1620862213.7263825,
        "tof_1_2_9": 1620862213.734384
    }
}