{
    "k_leaf": 14,
    "k_top": 14,
    "redundancy_factor": 14,
    "is_k8s": true,
    "machine_mac_addresses": {
        "leaf_1_0_1": {
            "net0": "8e:18:39:46:e5:b4",
            "net1": "82:06:8a:f8:b7:5e",
            "net10": "0a:68:58:6c:24:b2",
            "net11": "d6:01:4a:12:8c:72",
            "net12": "5a:e3:4b:30:d6:63",
            "net13": "7e:d5:30:50:c9:4a",
            "net14": "8a:97:86:cf:fe:a1",
            "net2": "8a:b1:08:b2:08:12",
            "net3": "66:63:d6:c6:93:8b",
            "net4": "2a:9a:eb:ef:ba:54",
            "net5": "9e:d8:09:5d:d0:d2",
            "net6": "6a:74:e1:17:d4:fd",
            "net7": "96:fe:fd:e2:8e:bf",
            "net8": "2e:b1:93:12:08:a8",
            "net9": "ce:f1:f0:9d:20:f1"
        },
        "leaf_1_0_10": {
            "net0": "ee:93:e7:14:39:26",
            "net1": "c2:d6:4e:3e:82:c2",
            "net10": "9e:fd:5b:d4:04:88",
            "net11": "32:6c:88:83:84:57",
            "net12": "0e:f0:25:d6:9a:10",
            "net13": "ee:20:8b:59:72:f7",
            "net14": "1a:37:62:b8:9a:40",
            "net2": "82:0b:d2:9e:95:8b",
            "net3": "ca:aa:69:ce:92:db",
            "net4": "82:93:e2:96:da:19",
            "net5": "f6:95:10:22:36:dd",
            "net6": "06:69:23:45:83:c5",
            "net7": "12:9c:f7:8f:5c:84",
            "net8": "d6:40:22:dc:62:df",
            "net9": "96:a2:7e:ab:84:9d"
        },
        "leaf_1_0_11": {
            "net0": "c2:00:18:32:28:ec",
            "net1": "e6:f9:85:8c:31:31",
            "net10": "1e:89:e8:ca:fe:d8",
            "net11": "72:fd:8a:43:3f:30",
            "net12": "62:1b:86:c3:d4:69",
            "net13": "06:8c:02:ba:e0:df",
            "net14": "02:1d:7a:69:77:01",
            "net2": "e2:e3:09:04:2b:93",
            "net3": "9a:3d:83:a3:ff:d9",
            "net4": "f6:3e:87:a4:c3:c1",
            "net5": "fa:cc:c6:a4:98:15",
            "net6": "2a:15:13:a6:24:5b",
            "net7": "92:c8:cc:00:61:b5",
            "net8": "56:fc:66:a0:45:fb",
            "net9": "1a:9a:37:44:25:15"
        },
        "leaf_1_0_12": {
            "net0": "6e:19:d4:b8:04:43",
            "net1": "02:94:54:a8:02:01",
            "net10": "86:14:8d:ee:a6:ff",
            "net11": "2a:a0:16:1b:8e:4e",
            "net12": "02:bc:d7:58:af:a2",
            "net13": "82:22:48:6d:66:f8",
            "net14": "46:c0:9f:b3:33:18",
            "net2": "f2:53:d7:2e:6e:79",
            "net3": "e2:b3:08:79:32:34",
            "net4": "c6:02:a2:c6:79:e5",
            "net5": "72:df:b2:10:97:b6",
            "net6": "46:a6:8c:07:28:b0",
            "net7": "22:72:82:0d:44:1a",
            "net8": "26:eb:02:3a:e4:cb",
            "net9": "16:b1:27:a5:a8:f0"
        },
        "leaf_1_0_13": {
            "net0": "0e:a6:ea:ff:9b:35",
            "net1": "2a:62:a2:32:69:91",
            "net10": "42:f6:a3:32:0b:0e",
            "net11": "96:18:ae:5b:3a:f5",
            "net12": "6a:ad:41:bb:f8:53",
            "net13": "da:3f:fb:fb:a7:61",
            "net14": "46:15:9f:33:67:0b",
            "net2": "0e:21:43:6b:80:4e",
            "net3": "6a:cf:1a:9b:43:f0",
            "net4": "3a:1f:04:c3:4a:63",
            "net5": "06:55:0c:99:28:7d",
            "net6": "3e:da:2b:3f:96:52",
            "net7": "ae:50:55:92:14:1c",
            "net8": "7a:38:c6:4e:c6:6f",
            "net9": "d2:a0:8c:fb:bd:21"
        },
        "leaf_1_0_14": {
            "net0": "22:99:cd:f3:71:e1",
            "net1": "f6:31:a5:d4:c0:e4",
            "net10": "c2:ca:79:f3:f1:44",
            "net11": "be:70:d3:b2:78:b4",
            "net12": "86:6d:16:71:51:db",
            "net13": "6e:8d:98:4c:f2:34",
            "net14": "da:fa:70:1b:15:57",
            "net2": "f6:9c:79:90:50:78",
            "net3": "f6:19:22:84:4d:b4",
            "net4": "ce:db:1b:48:f5:c1",
            "net5": "e2:b8:bb:ae:90:42",
            "net6": "1a:1c:e6:f4:ca:68",
            "net7": "e6:cb:19:f2:7c:27",
            "net8": "a2:c4:d9:d8:dd:15",
            "net9": "6e:32:b1:61:33:31"
        },
        "leaf_1_0_2": {
            "net0": "82:56:2a:3d:03:c7",
            "net1": "ba:6b:ae:ca:71:c4",
            "net10": "d6:f9:f3:e5:15:0b",
            "net11": "4e:ee:65:5f:10:f5",
            "net12": "16:2c:e3:61:ac:1b",
            "net13": "2a:38:4b:e9:23:91",
            "net14": "22:fd:51:17:43:0d",
            "net2": "42:23:52:47:e0:40",
            "net3": "52:f8:cd:43:8f:78",
            "net4": "7a:3e:9b:53:67:c6",
            "net5": "7a:37:39:ad:01:db",
            "net6": "92:4c:7b:6b:12:5e",
            "net7": "fe:05:fb:b5:db:bb",
            "net8": "f2:aa:b8:49:bb:0d",
            "net9": "0a:78:a0:43:de:e1"
        },
        "leaf_1_0_3": {
            "net0": "76:8f:02:5c:fa:c5",
            "net1": "96:47:e0:b8:2d:9c",
            "net10": "0e:33:23:ac:4c:24",
            "net11": "5e:0a:d6:38:19:ab",
            "net12": "76:e9:e6:de:77:27",
            "net13": "46:b1:ff:d8:5c:ac",
            "net14": "5e:c6:b1:42:0e:84",
            "net2": "56:d1:ac:42:26:51",
            "net3": "42:78:0b:1d:01:9d",
            "net4": "4e:e2:ac:ec:14:af",
            "net5": "e6:35:3d:84:6b:6e",
            "net6": "ee:48:2c:95:5b:64",
            "net7": "ae:2e:e1:bb:43:26",
            "net8": "9e:c6:73:21:9d:4f",
            "net9": "16:a1:2a:0d:07:12"
        },
        "leaf_1_0_4": {
            "net0": "26:da:aa:80:35:f3",
            "net1": "7e:58:e3:0a:67:fc",
            "net10": "6e:dd:db:05:a4:f2",
            "net11": "b2:72:3f:bf:9e:a3",
            "net12": "d6:3c:f3:20:36:8c",
            "net13": "86:d4:75:59:86:f8",
            "net14": "a6:2d:03:8f:14:6e",
            "net2": "ea:d1:97:8b:0c:ec",
            "net3": "f6:09:49:9b:ae:7d",
            "net4": "86:82:50:5a:07:b3",
            "net5": "1e:a5:92:08:36:df",
            "net6": "86:3f:34:f4:a1:fd",
            "net7": "76:5e:3c:b6:c6:fd",
            "net8": "32:ff:42:31:0f:00",
            "net9": "1e:5c:27:eb:dd:df"
        },
        "leaf_1_0_5": {
            "net0": "ce:6d:82:3f:cd:14",
            "net1": "e6:9a:9c:a6:7b:13",
            "net10": "a2:d3:4a:fa:2d:d0",
            "net11": "56:51:72:7b:f9:11",
            "net12": "fa:31:da:1c:c3:f1",
            "net13": "b6:9b:af:69:5c:6c",
            "net14": "ee:c8:95:bc:f1:67",
            "net2": "6a:68:df:eb:e3:00",
            "net3": "0e:76:b1:6f:73:d8",
            "net4": "ee:90:14:23:7d:c2",
            "net5": "56:cb:07:43:aa:b7",
            "net6": "4a:82:f0:ff:a3:c3",
            "net7": "3a:13:fe:e2:f6:22",
            "net8": "4e:b8:c7:ab:87:65",
            "net9": "fa:15:3e:9f:e4:fd"
        },
        "leaf_1_0_6": {
            "net0": "26:a4:b5:c0:9b:97",
            "net1": "fa:29:e9:50:58:56",
            "net10": "0e:28:25:93:fc:75",
            "net11": "72:e4:44:de:19:96",
            "net12": "56:6e:83:f5:0b:37",
            "net13": "76:e8:cd:15:1d:04",
            "net14": "56:d4:92:b3:68:65",
            "net2": "3a:c5:6f:bb:5a:3c",
            "net3": "c6:f9:26:74:ab:8f",
            "net4": "42:e0:71:15:80:19",
            "net5": "5a:7a:5b:9d:09:7f",
            "net6": "ce:19:80:b2:2f:d8",
            "net7": "16:ce:71:b2:38:04",
            "net8": "46:ea:d1:5c:a3:4c",
            "net9": "e2:1b:04:f3:b8:3f"
        },
        "leaf_1_0_7": {
            "net0": "5a:96:a5:a0:bb:ae",
            "net1": "0a:ef:33:a2:66:e7",
            "net10": "ce:96:a4:a9:56:59",
            "net11": "22:cc:6c:20:36:51",
            "net12": "3a:4e:e1:a3:f1:57",
            "net13": "8e:f3:21:99:a1:6e",
            "net14": "36:ec:41:e7:bd:31",
            "net2": "fa:54:bf:f9:13:05",
            "net3": "2a:e0:6e:2a:7f:91",
            "net4": "46:0c:0a:51:d3:ea",
            "net5": "be:a7:be:e4:9e:54",
            "net6": "82:34:6c:3b:5a:66",
            "net7": "72:c4:ad:76:71:30",
            "net8": "e6:25:06:00:9d:69",
            "net9": "ea:23:1f:68:ca:c8"
        },
        "leaf_1_0_8": {
            "net0": "22:35:77:3c:45:a0",
            "net1": "6a:25:f9:f3:e0:b8",
            "net10": "5e:8a:8f:55:0b:dc",
            "net11": "5a:5c:e9:1d:a2:be",
            "net12": "02:bb:ae:a3:fd:9e",
            "net13": "36:84:a3:29:fb:aa",
            "net14": "d6:73:11:d5:1f:2d",
            "net2": "4a:21:24:dc:6f:86",
            "net3": "76:76:dd:97:b0:15",
            "net4": "e2:35:45:54:09:9b",
            "net5": "e6:1f:7f:16:23:db",
            "net6": "06:d2:b2:7d:4e:e5",
            "net7": "7e:1e:64:11:38:d4",
            "net8": "c2:71:d9:26:0a:01",
            "net9": "22:8b:a6:ce:d3:f6"
        },
        "leaf_1_0_9": {
            "net0": "ca:bd:b0:72:d7:49",
            "net1": "ee:78:62:b6:6e:24",
            "net10": "3a:c5:d1:1f:08:a6",
            "net11": "0e:ea:65:15:69:a0",
            "net12": "a2:4d:b2:79:48:60",
            "net13": "be:1f:61:1c:b7:f8",
            "net14": "5e:06:b0:2a:52:cc",
            "net2": "ee:9f:3f:e0:da:aa",
            "net3": "be:6a:87:b6:f1:d8",
            "net4": "26:d2:94:8f:c7:ba",
            "net5": "6a:7c:45:46:96:93",
            "net6": "8a:6e:e5:af:f0:41",
            "net7": "ae:99:ae:df:d5:90",
            "net8": "5a:cb:a7:e9:77:20",
            "net9": "d2:a5:20:f3:07:71"
        },
        "leaf_2_0_1": {
            "net0": "36:d7:03:1a:8e:ba",
            "net1": "8e:8b:d3:3d:c7:47",
            "net10": "56:2f:b5:33:64:b3",
            "net11": "b6:58:d8:4c:75:36",
            "net12": "66:b6:1f:ba:ff:94",
            "net13": "66:4b:ae:78:98:59",
            "net14": "ae:4b:eb:9a:11:08",
            "net2": "1a:33:7b:40:3b:04",
            "net3": "12:e9:91:fa:f8:14",
            "net4": "b2:1d:f7:95:33:8f",
            "net5": "3a:23:b9:b0:55:c6",
            "net6": "1a:32:df:8b:b6:15",
            "net7": "56:b5:87:81:fc:cf",
            "net8": "42:ab:6d:91:b7:da",
            "net9": "da:c7:c3:b4:80:0e"
        },
        "leaf_2_0_10": {
            "net0": "76:7a:8a:78:71:48",
            "net1": "4e:0e:b6:3f:9e:a3",
            "net10": "5a:02:06:d4:39:25",
            "net11": "a2:2d:33:e3:58:ca",
            "net12": "32:a4:05:3f:f5:ad",
            "net13": "22:3b:93:c0:9e:8c",
            "net14": "2e:09:c4:d6:3c:ec",
            "net2": "0a:60:fc:e2:c3:5f",
            "net3": "c6:5b:09:ac:7d:ba",
            "net4": "62:09:39:4d:ba:8b",
            "net5": "36:f3:b6:e3:e5:70",
            "net6": "e2:d1:f6:e5:73:64",
            "net7": "ae:9f:47:b6:f6:bf",
            "net8": "06:fd:72:5e:eb:e4",
            "net9": "7e:9a:34:d3:53:fe"
        },
        "leaf_2_0_11": {
            "net0": "3e:e5:c2:87:0c:b0",
            "net1": "a2:8c:17:5e:e4:97",
            "net10": "e2:0f:61:68:12:9a",
            "net11": "52:00:29:7d:51:c0",
            "net12": "8a:38:44:5d:0b:6f",
            "net13": "02:2c:ef:dc:e4:fc",
            "net14": "82:f7:5c:b3:2b:66",
            "net2": "0e:1a:93:0f:b2:51",
            "net3": "72:f9:5e:fa:3d:48",
            "net4": "d6:f8:33:24:60:75",
            "net5": "3a:3a:91:7f:f8:a1",
            "net6": "72:bd:ce:a3:2b:cb",
            "net7": "62:e6:27:b6:15:ac",
            "net8": "f2:9f:13:6c:63:b8",
            "net9": "2a:2d:88:da:b4:bc"
        },
        "leaf_2_0_12": {
            "net0": "02:86:62:14:69:1a",
            "net1": "9e:52:0e:f9:66:c2",
            "net10": "d2:5b:16:88:69:af",
            "net11": "1e:f4:04:32:88:9b",
            "net12": "ce:7c:9b:4b:17:d0",
            "net13": "4a:c4:4c:cf:af:67",
            "net14": "72:52:93:7d:ec:77",
            "net2": "a6:f9:39:bf:87:fb",
            "net3": "8e:2c:8f:db:be:23",
            "net4": "a6:9e:82:d8:a2:e0",
            "net5": "46:a5:2c:db:d5:f8",
            "net6": "b2:2a:c5:17:33:aa",
            "net7": "da:e1:d7:8c:b0:48",
            "net8": "9a:00:3d:64:3e:31",
            "net9": "ca:d6:40:1d:94:11"
        },
        "leaf_2_0_13": {
            "net0": "fa:63:36:9e:dc:55",
            "net1": "1a:96:3d:0a:cd:90",
            "net10": "86:a4:af:6b:97:bc",
            "net11": "b2:84:f6:ec:c6:70",
            "net12": "0a:63:10:a1:8d:1c",
            "net13": "86:b1:37:56:92:c1",
            "net14": "6a:2d:53:ac:e2:c2",
            "net2": "6a:fc:a7:29:63:0d",
            "net3": "7a:ab:2b:c4:50:5f",
            "net4": "e6:dc:bc:1e:fa:c5",
            "net5": "12:fd:93:83:7f:d9",
            "net6": "92:ff:75:43:fc:25",
            "net7": "16:f7:4c:b5:ae:5f",
            "net8": "a2:fc:ca:74:40:9e",
            "net9": "92:e1:a7:67:c6:ea"
        },
        "leaf_2_0_14": {
            "net0": "0e:fb:3b:64:85:2f",
            "net1": "02:b2:33:78:21:bb",
            "net10": "1e:d6:45:67:b3:d2",
            "net11": "72:1c:da:16:1b:5b",
            "net12": "e6:e8:b6:68:86:e9",
            "net13": "e6:bd:34:ba:7e:e0",
            "net14": "f6:bd:41:a8:e6:6d",
            "net2": "be:93:db:af:c1:92",
            "net3": "ea:99:28:c6:f6:11",
            "net4": "da:59:b7:7e:d2:eb",
            "net5": "ae:75:01:58:8c:2a",
            "net6": "12:ff:22:68:e6:a6",
            "net7": "66:35:44:42:e3:51",
            "net8": "52:78:20:4c:ad:97",
            "net9": "7e:80:42:62:af:54"
        },
        "leaf_2_0_2": {
            "net0": "6e:af:2f:13:b1:8b",
            "net1": "c6:ae:15:ee:f1:0a",
            "net10": "8e:c2:e4:81:52:72",
            "net11": "56:e8:30:b9:cd:af",
            "net12": "66:9d:ca:18:9b:8d",
            "net13": "3a:3d:db:f7:3b:1b",
            "net14": "4e:c3:f1:19:5d:c8",
            "net2": "ea:14:c7:d3:88:1f",
            "net3": "c2:be:36:c8:f6:be",
            "net4": "8a:b1:19:1c:47:e2",
            "net5": "6e:e8:eb:b7:8e:78",
            "net6": "46:0e:67:0b:e9:da",
            "net7": "62:3e:b1:c6:84:d6",
            "net8": "92:2f:bb:ea:12:21",
            "net9": "02:f6:23:4c:9a:a8"
        },
        "leaf_2_0_3": {
            "net0": "32:4b:2c:24:c0:ae",
            "net1": "de:58:46:4a:12:35",
            "net10": "42:35:5f:e6:c1:8c",
            "net11": "62:6d:e9:dd:0f:8f",
            "net12": "56:e4:fc:13:b2:02",
            "net13": "0a:07:35:49:2a:17",
            "net14": "52:71:bb:bb:89:25",
            "net2": "7e:28:ec:78:36:71",
            "net3": "b2:c3:66:aa:dd:df",
            "net4": "1a:c3:25:f8:3f:88",
            "net5": "96:8d:08:f5:41:3f",
            "net6": "42:d1:3a:5d:0b:85",
            "net7": "12:65:31:51:95:c8",
            "net8": "9e:dc:3f:2a:5a:6a",
            "net9": "ee:7c:f3:8c:ac:88"
        },
        "leaf_2_0_4": {
            "net0": "46:e7:0b:60:f2:be",
            "net1": "46:4f:2e:e9:8b:70",
            "net10": "3e:cf:38:d9:15:ce",
            "net11": "26:2e:bd:6a:e5:5c",
            "net12": "52:c2:da:64:2b:87",
            "net13": "ee:fb:b3:72:fe:b9",
            "net14": "02:d3:a0:49:3a:ab",
            "net2": "7e:9b:03:1f:c8:96",
            "net3": "02:50:be:dd:b5:04",
            "net4": "26:6c:a8:2b:ab:68",
            "net5": "86:a7:25:8a:ba:bc",
            "net6": "aa:7b:94:b7:46:75",
            "net7": "22:4f:c5:5e:d6:0d",
            "net8": "02:94:6d:24:83:9a",
            "net9": "5e:40:49:30:f0:19"
        },
        "leaf_2_0_5": {
            "net0": "ee:2f:a0:34:8b:61",
            "net1": "da:ce:4a:17:da:c2",
            "net10": "62:d1:5e:ee:19:b3",
            "net11": "de:43:12:b0:9d:8f",
            "net12": "12:86:a0:67:38:60",
            "net13": "9a:a4:2f:fb:dd:da",
            "net14": "ba:0e:db:8f:89:09",
            "net2": "8e:30:cd:77:48:d0",
            "net3": "b6:65:a5:bd:43:6b",
            "net4": "b6:8f:45:22:78:54",
            "net5": "c2:21:53:f6:5a:be",
            "net6": "5e:f1:60:b9:41:99",
            "net7": "a6:7c:6a:1f:85:3e",
            "net8": "9a:3c:06:43:ae:dc",
            "net9": "a2:d9:52:16:d0:8d"
        },
        "leaf_2_0_6": {
            "net0": "46:05:c7:73:fb:f0",
            "net1": "86:72:17:f5:02:49",
            "net10": "56:04:9c:74:e2:b5",
            "net11": "4e:b6:c0:c0:80:a6",
            "net12": "3e:04:87:a9:ec:87",
            "net13": "ce:bb:eb:06:b9:f6",
            "net14": "46:40:13:ee:82:1b",
            "net2": "8a:cb:94:ce:25:8c",
            "net3": "3e:8b:cd:e7:bb:6a",
            "net4": "a6:5a:20:f6:e6:da",
            "net5": "7a:e4:c8:21:cd:b1",
            "net6": "26:69:40:9a:6d:27",
            "net7": "82:21:41:64:d1:08",
            "net8": "9a:7c:e4:68:a3:33",
            "net9": "ae:20:db:26:ed:97"
        },
        "leaf_2_0_7": {
            "net0": "a6:38:10:87:65:9e",
            "net1": "1e:76:7f:33:10:20",
            "net10": "0e:99:45:8f:a9:64",
            "net11": "3a:3f:be:2e:af:2c",
            "net12": "72:9b:72:0d:93:1d",
            "net13": "d6:3f:6b:cd:4d:6e",
            "net14": "42:0e:2a:57:43:6b",
            "net2": "42:74:ee:bf:9a:bb",
            "net3": "9e:d0:ab:7a:6a:0c",
            "net4": "f6:2d:6c:f1:bb:a1",
            "net5": "1a:03:2b:63:78:01",
            "net6": "6e:fa:21:9d:40:c7",
            "net7": "02:81:23:a8:a7:83",
            "net8": "ee:c6:a5:62:c8:68",
            "net9": "3a:30:81:1e:01:29"
        },
        "leaf_2_0_8": {
            "net0": "16:89:89:46:cd:17",
            "net1": "6a:36:31:62:06:14",
            "net10": "16:73:b3:6b:28:ea",
            "net11": "d6:9e:98:f6:17:ab",
            "net12": "4a:c5:45:06:4a:71",
            "net13": "d2:7a:d6:56:b7:3b",
            "net14": "52:e5:66:20:1b:10",
            "net2": "96:69:40:e2:ef:d7",
            "net3": "f2:64:05:14:7b:25",
            "net4": "86:1d:3c:cc:89:4e",
            "net5": "e6:fa:88:0c:ab:ba",
            "net6": "fe:1c:7a:e1:3d:0d",
            "net7": "66:93:1b:dc:4c:3d",
            "net8": "46:7a:31:16:94:14",
            "net9": "7e:ce:4b:ee:82:69"
        },
        "leaf_2_0_9": {
            "net0": "5a:d5:9f:78:d7:a6",
            "net1": "de:e6:dd:06:58:c3",
            "net10": "a6:79:e2:06:7d:a5",
            "net11": "56:75:cc:00:a8:d2",
            "net12": "12:e7:a5:5a:6e:4c",
            "net13": "c2:34:8d:39:da:23",
            "net14": "ae:c6:09:65:34:87",
            "net2": "06:c9:51:74:95:5a",
            "net3": "9e:2c:65:cb:61:02",
            "net4": "6e:a2:37:92:65:2c",
            "net5": "da:de:f7:4c:cf:e7",
            "net6": "52:e5:ff:59:91:4c",
            "net7": "ea:48:42:44:d0:0b",
            "net8": "d6:36:5d:35:6b:b4",
            "net9": "76:98:ac:a7:a0:c7"
        },
        "spine_1_1_1": {
            "net0": "f6:4e:40:7e:e4:68",
            "net1": "a6:a1:34:6e:46:96",
            "net10": "9e:ff:18:47:67:49",
            "net11": "36:1d:45:7c:c1:13",
            "net12": "c2:e5:60:ee:4e:d7",
            "net13": "d2:8a:cc:3b:df:96",
            "net14": "36:b4:7a:3f:7c:40",
            "net15": "4a:9b:0b:1e:e4:40",
            "net16": "c6:2a:0b:66:78:58",
            "net17": "b2:99:43:5f:e1:08",
            "net18": "7e:4c:a0:9f:e1:79",
            "net19": "7e:ae:0a:7b:ba:55",
            "net2": "9a:d1:ac:66:7e:cc",
            "net20": "16:22:36:a3:20:95",
            "net21": "e2:55:72:67:6b:dd",
            "net22": "f2:4a:0b:8c:29:9b",
            "net23": "aa:ea:51:e5:56:d5",
            "net24": "96:f0:3f:cb:16:63",
            "net25": "c2:7a:1d:fa:2e:f8",
            "net26": "02:21:af:23:9f:27",
            "net27": "1e:b7:6a:74:a5:6c",
            "net3": "be:f0:9f:2d:55:03",
            "net4": "ba:16:0b:25:d4:55",
            "net5": "a2:91:4d:bf:bc:be",
            "net6": "b6:26:6e:db:5d:13",
            "net7": "6a:cd:31:2f:f4:aa",
            "net8": "06:3e:53:c2:b4:31",
            "net9": "4a:f8:a4:fd:67:67"
        },
        "spine_1_1_10": {
            "net0": "ae:1d:36:01:06:fa",
            "net1": "aa:00:34:ad:3a:fb",
            "net10": "d6:5a:21:89:e9:5d",
            "net11": "de:f5:24:eb:23:e8",
            "net12": "92:59:98:52:cf:77",
            "net13": "2a:42:6e:d4:42:97",
            "net14": "02:d4:22:f3:6f:e5",
            "net15": "e6:28:11:d2:79:ec",
            "net16": "16:84:1f:f4:f5:53",
            "net17": "ba:57:f7:67:cc:7a",
            "net18": "be:e7:b9:0e:71:9d",
            "net19": "82:b6:f6:a9:2c:20",
            "net2": "ee:a7:2e:93:1d:e0",
            "net20": "12:2d:3b:cf:13:82",
            "net21": "62:df:63:c2:97:93",
            "net22": "12:f0:ae:4d:6f:d4",
            "net23": "a6:3b:05:76:28:36",
            "net24": "5a:fc:39:03:9e:6f",
            "net25": "9a:9b:cd:34:ae:35",
            "net26": "ce:1d:cf:3c:5d:8b",
            "net27": "46:83:5d:e7:75:ff",
            "net3": "32:60:12:0e:f7:7a",
            "net4": "a2:20:1e:95:95:40",
            "net5": "ea:c2:7e:ab:bc:39",
            "net6": "a6:e0:6f:59:bb:dc",
            "net7": "7a:eb:33:b6:cf:49",
            "net8": "5a:6b:fc:e7:de:46",
            "net9": "fa:7c:84:e4:19:86"
        },
        "spine_1_1_11": {
            "net0": "6e:5a:91:97:ce:00",
            "net1": "4a:9c:42:66:59:bc",
            "net10": "3a:1e:6c:7d:1b:b7",
            "net11": "86:6d:4f:4a:3c:9f",
            "net12": "da:96:ef:9c:25:e8",
            "net13": "32:52:52:2d:8c:d7",
            "net14": "6e:55:e7:98:12:26",
            "net15": "7a:3f:fd:87:38:b0",
            "net16": "42:40:a4:fd:24:0f",
            "net17": "32:d5:cb:79:08:8e",
            "net18": "86:d8:b9:20:a5:c0",
            "net19": "66:0d:4d:64:eb:6d",
            "net2": "e2:9c:74:14:dd:cd",
            "net20": "d2:33:c4:b1:b8:bb",
            "net21": "4e:23:af:55:7d:ae",
            "net22": "a6:e9:0d:c1:ee:42",
            "net23": "a6:e3:56:09:97:d2",
            "net24": "aa:4e:ef:fa:25:59",
            "net25": "02:bf:44:80:d3:43",
            "net26": "56:af:48:47:50:66",
            "net27": "26:7f:2b:89:44:2c",
            "net3": "9a:48:c6:4c:29:db",
            "net4": "da:47:cb:1f:f0:83",
            "net5": "16:d7:36:82:42:2f",
            "net6": "92:2a:b4:39:40:f8",
            "net7": "1a:9c:b1:19:f3:05",
            "net8": "2e:e7:b6:99:96:55",
            "net9": "ba:10:48:d1:e7:71"
        },
        "spine_1_1_12": {
            "net0": "62:7d:b3:45:f9:c3",
            "net1": "c6:8d:16:0d:bc:3f",
            "net10": "36:2b:5b:f4:2e:35",
            "net11": "06:aa:4b:76:84:25",
            "net12": "ba:c9:72:5d:69:37",
            "net13": "4a:46:30:0c:bf:70",
            "net14": "e2:e0:41:ac:06:5e",
            "net15": "9a:1b:a9:4c:54:f8",
            "net16": "ba:a0:dc:8c:5f:15",
            "net17": "aa:59:d5:26:92:2c",
            "net18": "62:b8:f1:60:e5:6a",
            "net19": "5e:41:a1:e6:de:18",
            "net2": "72:c0:15:f5:e3:f5",
            "net20": "76:df:25:ed:4e:8c",
            "net21": "b6:ec:e2:d9:24:05",
            "net22": "0a:88:df:72:dd:12",
            "net23": "ca:23:af:b8:45:d3",
            "net24": "06:19:fe:43:b4:5b",
            "net25": "0a:39:c4:3a:ac:b1",
            "net26": "92:5f:ed:1b:f5:67",
            "net27": "f6:4a:9e:ba:93:6d",
            "net3": "c2:11:31:6e:df:9d",
            "net4": "6a:d8:ff:ec:bb:df",
            "net5": "e6:e4:d2:25:54:c7",
            "net6": "5e:b1:52:d8:7d:ac",
            "net7": "b2:4d:57:e2:6a:6c",
            "net8": "f2:a1:3e:08:8a:4a",
            "net9": "92:dd:c6:46:dc:79"
        },
        "spine_1_1_13": {
            "net0": "0a:04:54:9d:5f:1f",
            "net1": "fe:64:d5:04:2b:a7",
            "net10": "6a:37:03:d3:0b:2b",
            "net11": "82:5a:34:41:bb:6c",
            "net12": "2a:73:10:8b:ad:6f",
            "net13": "9a:56:02:dc:0c:67",
            "net14": "62:77:8b:b9:09:d9",
            "net15": "9e:8b:03:d1:5d:d5",
            "net16": "e6:76:9c:7c:f8:a0",
            "net17": "3e:3c:f1:49:8c:c3",
            "net18": "16:79:f5:c1:b1:89",
            "net19": "06:6c:f7:a1:e6:63",
            "net2": "de:97:4b:a0:18:b5",
            "net20": "c6:34:0d:ad:cb:98",
            "net21": "7e:fc:b4:91:d6:d3",
            "net22": "3e:4e:8b:90:f1:f6",
            "net23": "9e:cb:8c:50:7c:7e",
            "net24": "d2:cf:2f:1d:c1:fc",
            "net25": "16:e6:69:bf:4f:97",
            "net26": "4a:02:b6:5d:68:46",
            "net27": "22:47:69:6c:49:c0",
            "net3": "1a:2a:26:5a:39:66",
            "net4": "ce:5f:ed:67:da:78",
            "net5": "9e:96:26:db:b2:56",
            "net6": "de:08:b8:f2:51:bd",
            "net7": "1a:3c:c1:da:26:c0",
            "net8": "3a:46:c5:2e:f9:e5",
            "net9": "16:3a:e4:ed:d7:62"
        },
        "spine_1_1_14": {
            "net0": "ce:ba:da:c0:78:95",
            "net1": "96:a0:82:ea:3c:b4",
            "net10": "a6:4f:57:24:84:55",
            "net11": "ea:f9:0a:bf:ff:46",
            "net12": "12:59:ac:58:f4:4a",
            "net13": "22:47:29:8e:7a:89",
            "net14": "0a:14:8c:32:44:29",
            "net15": "c6:c6:a4:ff:11:08",
            "net16": "fe:a2:2e:95:ea:b5",
            "net17": "8e:9d:9b:4d:7a:a5",
            "net18": "ea:07:a2:f4:91:9f",
            "net19": "d2:70:57:2d:da:d2",
            "net2": "0a:dd:35:55:0c:b7",
            "net20": "d2:8e:31:72:29:14",
            "net21": "46:d9:2b:f2:39:95",
            "net22": "02:55:63:40:6c:76",
            "net23": "7e:bb:d9:80:b6:b4",
            "net24": "d2:83:2f:21:71:9a",
            "net25": "12:62:f1:b2:87:ff",
            "net26": "c6:40:98:fd:04:21",
            "net27": "d6:22:20:d3:25:56",
            "net3": "e6:41:ad:18:a7:ab",
            "net4": "4a:dd:17:28:16:86",
            "net5": "a2:69:49:2a:f7:00",
            "net6": "4a:f0:5b:47:37:7d",
            "net7": "d2:8c:88:2f:2b:84",
            "net8": "6e:4c:17:a7:c5:d1",
            "net9": "3e:a8:18:9d:c7:6d"
        },
        "spine_1_1_2": {
            "net0": "02:ca:30:eb:2e:06",
            "net1": "f2:02:20:b9:2c:e0",
            "net10": "6a:12:2a:50:d8:85",
            "net11": "c2:8e:86:df:32:ae",
            "net12": "c6:76:cc:3a:5f:da",
            "net13": "ee:04:a6:71:a0:3f",
            "net14": "de:3d:00:7c:28:fc",
            "net15": "76:b7:8b:ce:fa:8b",
            "net16": "0a:f5:57:55:d8:90",
            "net17": "2e:8a:6c:69:b9:3a",
            "net18": "56:3a:95:a3:db:ac",
            "net19": "da:43:6f:8d:ee:53",
            "net2": "fa:0f:ee:fe:4c:ae",
            "net20": "3e:ce:57:cf:d0:85",
            "net21": "3e:e7:d8:b4:63:d4",
            "net22": "ea:6a:7e:af:b1:9a",
            "net23": "62:44:53:0b:a9:89",
            "net24": "3e:49:df:53:48:8d",
            "net25": "72:43:1e:14:2b:ae",
            "net26": "66:fe:05:7a:01:67",
            "net27": "16:4c:f0:39:80:4f",
            "net3": "52:70:a0:98:c1:d2",
            "net4": "b6:6f:b0:4c:f6:51",
            "net5": "1e:92:ea:0d:8d:bf",
            "net6": "56:42:d9:0c:40:68",
            "net7": "9e:71:c1:bc:aa:cd",
            "net8": "16:59:73:d0:2d:8d",
            "net9": "0e:7c:ae:17:bb:7a"
        },
        "spine_1_1_3": {
            "net0": "96:4e:e6:10:e4:fb",
            "net1": "16:95:50:35:4d:32",
            "net10": "06:34:ad:3a:2c:ac",
            "net11": "7a:ce:ec:d9:9e:b5",
            "net12": "aa:12:03:38:6d:6b",
            "net13": "ce:50:5b:14:fb:83",
            "net14": "7e:20:37:af:e1:aa",
            "net15": "be:73:6c:7c:a0:4b",
            "net16": "86:3b:e4:67:b8:a2",
            "net17": "82:38:cc:2c:5c:af",
            "net18": "da:79:26:cc:fc:e9",
            "net19": "ea:36:c1:a7:fd:ff",
            "net2": "12:ef:6d:aa:3e:57",
            "net20": "be:10:d6:b1:0a:2e",
            "net21": "02:1b:ea:11:8d:7c",
            "net22": "56:69:e5:f0:d1:e8",
            "net23": "da:79:ca:2d:b1:7e",
            "net24": "82:d7:24:23:05:04",
            "net25": "ca:5d:fb:98:c5:2f",
            "net26": "12:73:b2:7c:b0:82",
            "net27": "0a:78:4b:b4:6e:5c",
            "net3": "2e:a6:b9:48:fb:f3",
            "net4": "26:d5:0f:4b:c7:79",
            "net5": "f6:b7:75:8c:e5:7e",
            "net6": "8e:40:de:b9:16:90",
            "net7": "b2:4b:ac:3f:f7:bd",
            "net8": "3a:06:c1:f6:aa:8d",
            "net9": "a2:5c:0b:ae:88:ae"
        },
        "spine_1_1_4": {
            "net0": "2a:db:48:4f:ae:03",
            "net1": "16:f2:5e:6f:b1:c3",
            "net10": "a2:c1:54:a5:d7:93",
            "net11": "d6:99:16:02:57:35",
            "net12": "e6:43:1b:3d:1f:b9",
            "net13": "32:3e:42:3c:20:47",
            "net14": "66:f7:3f:cb:1e:f4",
            "net15": "7e:ec:a0:60:dc:0f",
            "net16": "da:a9:03:9a:a9:5f",
            "net17": "9e:ad:dc:29:29:d0",
            "net18": "1a:b1:11:a9:60:b1",
            "net19": "7e:45:fc:f5:b1:15",
            "net2": "32:1b:56:61:ab:6c",
            "net20": "86:36:1f:5f:f4:70",
            "net21": "3a:6b:b8:be:aa:e2",
            "net22": "72:31:6c:19:47:6f",
            "net23": "3a:98:4e:86:8c:94",
            "net24": "0e:e7:68:0c:37:9e",
            "net25": "06:7b:5e:d6:a6:df",
            "net26": "32:7b:b5:12:68:0d",
            "net27": "56:c0:bd:7e:2d:83",
            "net3": "62:3f:2f:f1:c8:17",
            "net4": "ce:e8:f7:98:3d:0d",
            "net5": "ae:3a:63:95:c2:4e",
            "net6": "4e:5d:63:07:9c:d2",
            "net7": "ba:f5:52:c7:3d:11",
            "net8": "12:75:32:d2:60:4f",
            "net9": "ce:4c:60:a0:46:ea"
        },
        "spine_1_1_5": {
            "net0": "36:3e:62:f2:83:98",
            "net1": "32:38:fb:de:15:ed",
            "net10": "46:d2:74:07:aa:ba",
            "net11": "26:21:e3:ab:1e:5d",
            "net12": "da:e3:08:d2:d0:e5",
            "net13": "32:6f:8e:f0:e1:1d",
            "net14": "be:0e:73:e3:80:1f",
            "net15": "26:23:a8:c3:e4:c9",
            "net16": "8e:1c:2b:9a:f6:0b",
            "net17": "1a:70:34:7b:3a:b9",
            "net18": "3a:dd:f6:70:2d:4f",
            "net19": "66:5d:77:39:6f:2b",
            "net2": "aa:44:44:40:dc:60",
            "net20": "02:dc:b0:b2:d1:82",
            "net21": "3e:ab:33:e8:2c:4e",
            "net22": "76:c0:ce:cd:b7:42",
            "net23": "a6:3a:1c:41:46:00",
            "net24": "56:36:21:50:87:8b",
            "net25": "e6:c5:d1:22:b3:af",
            "net26": "d2:8b:ce:77:47:38",
            "net27": "ce:e1:41:49:93:c9",
            "net3": "a6:89:b1:25:a6:b0",
            "net4": "fa:ef:a6:31:0b:4f",
            "net5": "96:9f:36:7b:fb:10",
            "net6": "12:85:3f:77:67:1f",
            "net7": "6a:0f:b7:d3:74:37",
            "net8": "da:01:a5:8e:ea:89",
            "net9": "5e:c2:a7:c4:f7:c4"
        },
        "spine_1_1_6": {
            "net0": "5e:c1:b9:10:66:65",
            "net1": "ba:2c:2d:40:fc:cb",
            "net10": "66:03:22:43:42:ef",
            "net11": "3e:c4:e9:6d:4b:ba",
            "net12": "42:8e:a0:36:df:a3",
            "net13": "b2:0e:bd:2c:3e:73",
            "net14": "9e:3e:43:7f:06:23",
            "net15": "26:9c:16:7d:de:25",
            "net16": "7e:37:3e:28:ac:b0",
            "net17": "16:66:f5:3b:65:53",
            "net18": "6e:77:94:93:86:82",
            "net19": "da:81:bf:67:f4:be",
            "net2": "96:77:0d:28:19:59",
            "net20": "2a:9f:a5:ed:54:ff",
            "net21": "fa:f6:a4:9c:13:3e",
            "net22": "42:00:d2:64:39:d9",
            "net23": "b6:c6:8c:35:d0:34",
            "net24": "12:19:c3:05:b0:3a",
            "net25": "c6:67:4c:13:ef:7c",
            "net26": "8a:3d:02:39:2e:a7",
            "net27": "7a:d8:2c:c0:29:64",
            "net3": "76:31:a1:6f:34:eb",
            "net4": "e2:24:8d:18:ea:7a",
            "net5": "fe:1b:ab:f3:3b:71",
            "net6": "32:1f:37:ed:ed:bc",
            "net7": "8e:1a:22:13:d6:e1",
            "net8": "c2:e2:f9:93:12:0a",
            "net9": "b2:3b:ce:02:da:8b"
        },
        "spine_1_1_7": {
            "net0": "5e:57:75:72:98:8a",
            "net1": "06:0f:7b:f4:91:6d",
            "net10": "7e:28:6e:a1:7e:18",
            "net11": "e6:a6:d4:ec:be:d1",
            "net12": "9e:bc:59:c4:21:b8",
            "net13": "ee:04:4e:6a:b0:82",
            "net14": "a2:aa:10:73:2c:49",
            "net15": "fe:88:f4:07:64:7a",
            "net16": "de:ba:7d:1e:f0:19",
            "net17": "da:b4:e0:13:69:4b",
            "net18": "a2:cd:65:9b:40:61",
            "net19": "0a:72:01:c5:47:28",
            "net2": "6a:f9:71:d8:16:52",
            "net20": "02:b9:63:ff:24:b2",
            "net21": "f6:e6:91:6c:5c:55",
            "net22": "d2:2b:06:61:d2:88",
            "net23": "b2:8f:d8:9b:7e:e0",
            "net24": "2e:9d:2d:e1:41:9f",
            "net25": "46:bb:c1:0d:ca:c2",
            "net26": "9a:f1:2f:b1:bf:49",
            "net27": "92:75:8f:7a:b5:d0",
            "net3": "b6:79:c5:9c:14:33",
            "net4": "a2:86:b9:80:58:1b",
            "net5": "d2:51:4c:38:64:78",
            "net6": "7e:4e:6c:bb:0e:08",
            "net7": "c6:58:96:4b:c3:c2",
            "net8": "aa:a2:56:11:9f:06",
            "net9": "3a:da:a3:e5:b8:01"
        },
        "spine_1_1_8": {
            "net0": "8e:63:23:8e:73:12",
            "net1": "2e:98:e7:5c:2e:f9",
            "net10": "46:1f:02:fb:6a:7f",
            "net11": "e2:a4:3f:53:b9:fe",
            "net12": "aa:e9:c4:17:fc:14",
            "net13": "02:f8:a3:02:a0:b5",
            "net14": "52:cc:76:92:79:da",
            "net15": "c2:29:6a:40:cf:b5",
            "net16": "96:1c:37:c8:65:76",
            "net17": "e6:b7:93:f9:69:62",
            "net18": "fa:55:ab:7b:33:be",
            "net19": "8e:bd:18:50:33:ee",
            "net2": "16:12:52:63:ae:96",
            "net20": "42:24:46:f0:1b:0a",
            "net21": "82:38:0b:6b:0f:db",
            "net22": "36:99:d0:b5:10:c2",
            "net23": "d6:76:ec:f0:6b:32",
            "net24": "a2:11:ae:3e:0d:90",
            "net25": "ea:a2:7b:f9:69:46",
            "net26": "42:c1:69:9e:48:04",
            "net27": "6a:d6:5d:5e:8d:1c",
            "net3": "ae:83:7c:9d:3e:fc",
            "net4": "52:fa:09:05:32:78",
            "net5": "e6:e8:10:72:de:ef",
            "net6": "de:cc:f9:80:b0:d1",
            "net7": "be:47:67:2f:7f:70",
            "net8": "72:0e:31:df:10:3f",
            "net9": "42:df:9d:c8:00:b1"
        },
        "spine_1_1_9": {
            "net0": "16:13:e7:e5:16:c1",
            "net1": "f6:d4:2b:9a:02:de",
            "net10": "c2:03:67:24:07:52",
            "net11": "d2:9b:ee:bc:4a:50",
            "net12": "a6:cc:df:f0:92:3b",
            "net13": "76:39:1a:97:fb:24",
            "net14": "26:c3:0b:8a:0f:0a",
            "net15": "9e:59:ab:d2:91:2f",
            "net16": "4e:46:92:d5:5c:a0",
            "net17": "b6:0e:ad:3e:27:2b",
            "net18": "de:f7:79:ac:cc:c4",
            "net19": "5a:c6:6c:0d:22:5b",
            "net2": "02:58:65:7c:05:df",
            "net20": "ce:3e:65:51:a3:b9",
            "net21": "ae:c3:78:ee:7f:38",
            "net22": "d2:f4:62:d5:02:c6",
            "net23": "ae:b3:39:2d:de:b2",
            "net24": "ea:24:10:6c:de:8e",
            "net25": "82:13:87:f3:c8:95",
            "net26": "b2:b0:0a:5d:0c:65",
            "net27": "86:d2:20:2e:97:d8",
            "net3": "e6:a3:59:d2:f2:8a",
            "net4": "6e:dc:8a:49:67:ce",
            "net5": "9e:63:7e:26:04:28",
            "net6": "66:55:b2:1b:48:8b",
            "net7": "36:f6:35:a7:6c:a0",
            "net8": "e6:db:6a:a5:c5:ea",
            "net9": "42:97:0d:62:ad:32"
        },
        "spine_2_1_1": {
            "net0": "2a:50:61:83:b7:fa",
            "net1": "7a:f9:01:af:df:3c",
            "net10": "1a:de:08:76:ea:37",
            "net11": "06:c5:f3:64:db:ee",
            "net12": "e2:4b:57:6f:6f:28",
            "net13": "ae:94:62:6f:0f:54",
            "net14": "a2:72:7a:f1:33:27",
            "net15": "1e:00:f2:09:e7:eb",
            "net16": "a2:3d:ad:ca:3b:df",
            "net17": "86:06:f3:b0:ab:ed",
            "net18": "52:ee:06:3d:12:56",
            "net19": "0a:2e:b5:a1:2d:92",
            "net2": "e6:61:33:a7:25:e4",
            "net20": "ea:33:e8:df:26:8c",
            "net21": "6a:b6:96:8b:3d:98",
            "net22": "1a:65:ed:54:e7:2c",
            "net23": "16:7c:eb:4d:50:a9",
            "net24": "ae:c7:90:a2:67:60",
            "net25": "62:87:fe:95:f5:25",
            "net26": "12:5c:0e:5a:18:56",
            "net27": "16:a6:77:e1:d9:24",
            "net3": "32:cb:e2:0a:cf:20",
            "net4": "96:bc:90:a1:59:0b",
            "net5": "de:0d:12:c2:1e:4a",
            "net6": "c6:5b:4e:00:3c:5e",
            "net7": "02:da:12:d4:6a:20",
            "net8": "4e:d2:b0:f4:1f:88",
            "net9": "5a:e8:dd:e8:2a:c9"
        },
        "spine_2_1_10": {
            "net0": "b6:02:c4:bd:07:2f",
            "net1": "1a:9d:67:43:8d:61",
            "net10": "e2:f6:dd:2d:d9:ce",
            "net11": "f6:0c:56:a6:27:24",
            "net12": "b6:98:f2:46:0e:7d",
            "net13": "4a:51:cd:cd:b1:dc",
            "net14": "06:ba:6e:df:8a:be",
            "net15": "ce:5b:96:e5:5a:0d",
            "net16": "32:ee:8c:f9:02:5f",
            "net17": "0e:14:7d:aa:cf:36",
            "net18": "16:c3:6c:57:09:02",
            "net19": "ee:0d:3d:a8:57:85",
            "net2": "c2:59:34:48:e0:2c",
            "net20": "0e:b6:69:9b:8a:b0",
            "net21": "3a:8c:14:f6:18:d7",
            "net22": "56:6e:aa:3a:7d:8f",
            "net23": "da:a7:e4:d4:f6:d6",
            "net24": "8a:23:40:d5:a0:74",
            "net25": "32:37:2e:70:ae:ae",
            "net26": "c2:df:1d:f0:6b:1c",
            "net27": "4e:15:19:53:b6:90",
            "net3": "82:a6:86:3f:78:f0",
            "net4": "46:9e:aa:bb:52:f1",
            "net5": "ee:f8:28:e7:38:b1",
            "net6": "3a:f2:54:a4:1d:48",
            "net7": "f6:61:ac:de:1f:e4",
            "net8": "e6:02:21:68:97:20",
            "net9": "a2:78:e1:7b:f3:fe"
        },
        "spine_2_1_11": {
            "net0": "be:85:84:d3:95:ab",
            "net1": "9a:89:5e:a4:2e:c1",
            "net10": "4e:1b:ad:fd:75:94",
            "net11": "02:5d:c2:85:73:06",
            "net12": "c6:36:81:ee:dc:51",
            "net13": "2a:cd:09:89:2d:1a",
            "net14": "6e:35:36:6e:1c:53",
            "net15": "8e:9a:82:73:18:6e",
            "net16": "82:ac:ca:33:49:aa",
            "net17": "7e:f3:20:5d:01:5a",
            "net18": "7e:f4:41:6c:1f:63",
            "net19": "6a:75:e1:91:73:e2",
            "net2": "c6:fa:b7:3c:20:e0",
            "net20": "56:43:a1:5d:d2:26",
            "net21": "96:a9:93:fb:8d:91",
            "net22": "6a:51:86:d7:6e:92",
            "net23": "82:c0:61:6e:c5:31",
            "net24": "8a:51:b6:2f:11:a5",
            "net25": "7a:c0:ac:31:1c:6d",
            "net26": "3a:a1:ad:fa:02:8b",
            "net27": "a6:6e:a9:a5:7f:15",
            "net3": "4a:25:4b:2f:7f:65",
            "net4": "ca:7a:ca:bc:86:2a",
            "net5": "3e:55:1c:f7:f1:dd",
            "net6": "da:aa:d7:ea:20:4b",
            "net7": "66:e1:08:91:af:98",
            "net8": "be:b5:5c:c4:b0:ef",
            "net9": "fa:40:c7:8f:0b:3d"
        },
        "spine_2_1_12": {
            "net0": "3e:99:c8:d6:0d:1a",
            "net1": "46:28:32:90:41:43",
            "net10": "c2:3e:6d:a7:d0:3f",
            "net11": "66:eb:a8:c6:0a:37",
            "net12": "3a:5a:8d:00:73:7e",
            "net13": "06:d0:06:bc:70:d8",
            "net14": "6a:a3:1d:59:b6:2d",
            "net15": "5a:cf:5f:45:ff:2c",
            "net16": "6e:fd:e0:2a:e4:9b",
            "net17": "9e:4c:e9:de:4b:1f",
            "net18": "26:4f:c5:76:a6:23",
            "net19": "9e:57:a5:a7:4a:bb",
            "net2": "56:cb:17:8d:14:5e",
            "net20": "66:88:7e:5a:4b:a7",
            "net21": "62:be:13:3d:3a:01",
            "net22": "f6:fd:8f:19:1c:6d",
            "net23": "be:8f:1c:f3:04:0f",
            "net24": "da:16:98:53:fd:ec",
            "net25": "5e:b3:70:34:8c:98",
            "net26": "be:c2:0b:03:9f:2d",
            "net27": "5e:e5:ef:5e:c4:9e",
            "net3": "56:d3:ec:4f:67:58",
            "net4": "be:74:0f:1d:00:f5",
            "net5": "82:df:96:09:4d:52",
            "net6": "c6:34:4a:11:35:c1",
            "net7": "c2:89:a0:61:f9:6c",
            "net8": "6a:81:d2:ff:ae:9f",
            "net9": "4a:73:65:a9:86:33"
        },
        "spine_2_1_13": {
            "net0": "5e:fe:17:cf:68:2e",
            "net1": "fa:a3:0a:06:bd:17",
            "net10": "42:3b:32:42:be:77",
            "net11": "6a:99:58:f7:e5:be",
            "net12": "5e:e1:86:09:c0:1d",
            "net13": "8a:d7:56:9b:85:79",
            "net14": "4a:25:d0:bc:47:45",
            "net15": "f6:7a:a5:8e:6d:d2",
            "net16": "de:2f:6b:ff:30:5a",
            "net17": "ce:be:98:dc:44:69",
            "net18": "0e:49:21:e8:d3:76",
            "net19": "76:57:8a:41:9b:4e",
            "net2": "2a:cb:3e:78:06:b8",
            "net20": "e2:5d:e1:a4:85:4b",
            "net21": "b6:6e:71:72:50:a6",
            "net22": "82:bf:bf:1f:ba:e3",
            "net23": "1e:ed:ca:b7:36:cc",
            "net24": "6a:dc:a3:01:89:74",
            "net25": "8e:a3:10:df:ad:72",
            "net26": "6a:70:6c:5d:98:2e",
            "net27": "52:1a:11:84:54:bc",
            "net3": "66:49:44:07:64:a9",
            "net4": "ba:c8:31:f5:1e:b2",
            "net5": "02:b3:bb:f8:ad:9f",
            "net6": "12:1e:3a:11:3c:b3",
            "net7": "12:a9:be:8e:be:6e",
            "net8": "c6:5a:d6:e5:a8:f9",
            "net9": "96:d5:dc:da:d9:f0"
        },
        "spine_2_1_14": {
            "net0": "36:6e:0c:53:ee:b3",
            "net1": "2a:2c:3e:a7:2c:fb",
            "net10": "8e:7f:c8:2f:02:e0",
            "net11": "a2:93:de:e2:96:03",
            "net12": "02:9a:33:2e:d5:f9",
            "net13": "0a:16:1d:52:6c:fb",
            "net14": "fa:20:63:f0:6d:57",
            "net15": "3e:40:f2:90:4a:09",
            "net16": "22:1a:8f:89:88:dc",
            "net17": "9e:8f:bc:4c:2e:0f",
            "net18": "8e:55:de:ba:26:5d",
            "net19": "32:06:65:62:c6:a6",
            "net2": "92:c0:d3:a6:fa:0c",
            "net20": "ca:29:a2:9d:24:19",
            "net21": "f2:fa:1a:ad:c7:d1",
            "net22": "42:7b:58:62:90:04",
            "net23": "a2:fa:3a:dd:ea:3f",
            "net24": "9a:70:59:94:68:fe",
            "net25": "12:2e:8e:eb:1b:e6",
            "net26": "2a:42:bf:f5:e6:81",
            "net27": "26:a9:60:d5:6f:e6",
            "net3": "5a:7f:30:c8:f5:ad",
            "net4": "6e:9b:a0:2e:63:6d",
            "net5": "5a:0b:e8:b3:2f:85",
            "net6": "92:da:fd:b7:ad:70",
            "net7": "a6:91:75:4c:e6:ab",
            "net8": "4e:0a:9a:fe:95:6e",
            "net9": "ae:9b:3f:04:ec:53"
        },
        "spine_2_1_2": {
            "net0": "7e:4e:a5:6f:62:78",
            "net1": "e2:17:93:ef:c3:0b",
            "net10": "d6:00:38:be:41:7b",
            "net11": "f6:a3:22:f2:87:8c",
            "net12": "7a:1f:67:64:86:ea",
            "net13": "9a:7c:c1:88:09:98",
            "net14": "52:a7:8f:82:9c:45",
            "net15": "4e:93:7b:65:be:d5",
            "net16": "a6:a6:5a:b2:10:70",
            "net17": "da:c0:11:a6:69:ef",
            "net18": "5a:85:c9:cf:32:b8",
            "net19": "fa:bd:2b:40:86:54",
            "net2": "1a:ab:85:8f:92:f4",
            "net20": "96:c1:33:90:38:f5",
            "net21": "ea:dc:47:13:bb:eb",
            "net22": "12:2c:0f:3b:6f:f2",
            "net23": "8a:59:07:3e:d1:7e",
            "net24": "e6:9a:81:8c:61:57",
            "net25": "f6:50:d8:4f:d8:15",
            "net26": "22:69:6a:01:3c:04",
            "net27": "ee:ff:b4:22:83:5f",
            "net3": "aa:75:65:7e:c9:83",
            "net4": "02:3a:c8:89:73:e7",
            "net5": "2e:91:07:f9:c7:9f",
            "net6": "2a:d9:ab:38:b5:d7",
            "net7": "f6:63:98:01:9a:50",
            "net8": "6e:ce:fa:e8:51:d0",
            "net9": "6a:74:01:a5:2d:82"
        },
        "spine_2_1_3": {
            "net0": "3e:83:51:84:84:da",
            "net1": "a2:49:90:8f:2a:6a",
            "net10": "26:9d:f4:1c:88:2d",
            "net11": "32:17:93:71:e0:66",
            "net12": "ee:b9:54:93:5b:27",
            "net13": "8a:de:70:7b:a4:5a",
            "net14": "66:8a:ad:b3:6b:e7",
            "net15": "9a:06:7a:f8:30:e5",
            "net16": "8a:97:db:bb:3e:c1",
            "net17": "2a:c6:85:ab:2b:4e",
            "net18": "c6:74:34:22:f9:86",
            "net19": "e2:7f:ca:f4:31:98",
            "net2": "86:26:1f:dc:16:61",
            "net20": "36:91:ae:9d:36:a9",
            "net21": "0a:b7:6b:ea:4d:0b",
            "net22": "da:6f:0d:0c:30:32",
            "net23": "ba:99:6d:1b:ad:49",
            "net24": "2a:61:65:51:ac:06",
            "net25": "9e:a0:3f:bd:74:04",
            "net26": "e6:f6:58:a7:de:b5",
            "net27": "ba:52:44:59:a7:bb",
            "net3": "96:0c:66:e6:22:05",
            "net4": "0e:36:20:63:ae:2e",
            "net5": "12:17:83:bf:ed:14",
            "net6": "7a:1c:af:03:ee:70",
            "net7": "a2:b3:75:b2:89:9b",
            "net8": "8a:7c:90:04:02:6c",
            "net9": "8e:c2:9d:7e:8a:cf"
        },
        "spine_2_1_4": {
            "net0": "e6:b0:0c:23:57:28",
            "net1": "2a:f1:1e:15:6b:56",
            "net10": "0a:98:12:95:31:3a",
            "net11": "1a:4c:26:bf:bb:4b",
            "net12": "1e:7a:f3:ca:21:6e",
            "net13": "5a:60:54:eb:9c:01",
            "net14": "e2:02:ed:4e:88:6a",
            "net15": "ee:6a:c2:a0:7b:f5",
            "net16": "ea:a5:31:fe:98:43",
            "net17": "9a:f0:38:b7:2b:9b",
            "net18": "a2:9a:23:cb:cc:6b",
            "net19": "82:c8:6d:72:2b:fe",
            "net2": "46:1f:a8:bf:c1:57",
            "net20": "0a:44:ee:96:f7:c8",
            "net21": "de:ee:e6:d0:6d:8d",
            "net22": "7e:ab:1e:49:e9:d6",
            "net23": "ea:3a:2d:03:32:0b",
            "net24": "12:82:aa:30:5f:64",
            "net25": "82:16:cf:a6:3d:77",
            "net26": "4e:09:5d:20:1c:11",
            "net27": "f2:9f:72:24:d0:d0",
            "net3": "56:bc:c8:70:6a:3b",
            "net4": "fe:5b:bd:0f:22:3e",
            "net5": "7a:1e:1c:69:5a:8d",
            "net6": "22:ef:37:a8:82:8c",
            "net7": "0a:61:90:07:87:7d",
            "net8": "16:d8:e0:6d:df:f2",
            "net9": "d2:27:c4:5d:04:d1"
        },
        "spine_2_1_5": {
            "net0": "c6:0f:97:e6:08:c2",
            "net1": "66:dd:34:81:a2:34",
            "net10": "02:dc:57:d0:5e:6a",
            "net11": "66:04:dd:d8:88:ff",
            "net12": "8e:15:f2:c9:e1:5e",
            "net13": "36:08:f8:dd:08:7e",
            "net14": "8a:db:0b:b5:3a:12",
            "net15": "da:f4:ee:86:a6:cf",
            "net16": "d6:3a:23:7a:d7:41",
            "net17": "b6:06:21:f6:dc:7a",
            "net18": "de:69:df:3c:70:5f",
            "net19": "a2:29:61:7e:ad:2d",
            "net2": "96:bc:06:6a:88:b8",
            "net20": "e2:48:7f:45:2e:ce",
            "net21": "ee:a4:4a:6a:84:29",
            "net22": "06:7a:01:37:90:6f",
            "net23": "92:1c:2b:ca:1a:6d",
            "net24": "3a:89:49:8b:91:af",
            "net25": "26:24:ca:33:cb:2e",
            "net26": "f2:71:8a:5f:92:b5",
            "net27": "76:94:e7:e4:42:6b",
            "net3": "22:2c:0c:f2:0b:8e",
            "net4": "7a:29:3d:95:c4:42",
            "net5": "d6:e4:38:61:93:ac",
            "net6": "82:d6:7a:d5:5d:49",
            "net7": "32:b1:94:8e:fe:8e",
            "net8": "b6:ef:18:e4:71:c7",
            "net9": "52:bc:94:7c:92:5f"
        },
        "spine_2_1_6": {
            "net0": "da:b5:a7:3c:e7:ce",
            "net1": "2a:b0:63:94:2f:18",
            "net10": "52:e9:1f:94:13:67",
            "net11": "ea:2e:47:64:b8:97",
            "net12": "6a:c3:05:5f:e2:a6",
            "net13": "3a:9c:cc:da:e8:be",
            "net14": "36:79:2f:0d:9d:e0",
            "net15": "82:f5:63:b4:e6:51",
            "net16": "12:24:ad:8e:b5:20",
            "net17": "be:fc:de:9b:c7:86",
            "net18": "7e:53:51:1d:22:11",
            "net19": "ae:10:9c:8c:c8:65",
            "net2": "f2:23:81:fd:42:05",
            "net20": "e6:6d:0d:52:17:e4",
            "net21": "36:1c:44:9d:b2:ba",
            "net22": "be:7e:a7:17:0f:f2",
            "net23": "e6:54:cb:ba:8b:96",
            "net24": "02:63:6c:69:84:c8",
            "net25": "c6:e4:81:97:ea:92",
            "net26": "02:b5:ca:5b:7b:fa",
            "net27": "46:8b:69:cc:e5:44",
            "net3": "f2:99:06:66:67:8f",
            "net4": "b6:0b:a8:a3:59:71",
            "net5": "0a:49:af:a1:e1:31",
            "net6": "fe:a3:52:74:2b:96",
            "net7": "52:0b:90:fa:24:b1",
            "net8": "4a:7b:b6:07:81:42",
            "net9": "da:96:a2:aa:b7:33"
        },
        "spine_2_1_7": {
            "net0": "6a:32:db:10:3f:f0",
            "net1": "2a:a6:0b:b1:96:4d",
            "net10": "4a:30:87:01:f1:fa",
            "net11": "3a:43:f6:df:0f:b3",
            "net12": "0e:3a:1d:cd:25:bc",
            "net13": "56:fb:f6:a8:b8:a9",
            "net14": "2e:47:83:a2:53:8c",
            "net15": "4e:e3:c4:06:8a:b1",
            "net16": "9a:38:77:91:1b:b6",
            "net17": "8a:81:c2:d5:58:77",
            "net18": "8a:ff:c6:5b:cb:da",
            "net19": "92:34:ef:b5:04:0f",
            "net2": "f2:ae:98:ef:72:88",
            "net20": "6e:0d:b3:bc:b6:96",
            "net21": "12:53:e5:d0:2c:ff",
            "net22": "ce:18:ff:83:78:8d",
            "net23": "76:78:91:fa:a4:b0",
            "net24": "fa:59:30:ca:bd:a3",
            "net25": "36:c1:71:cb:e8:d4",
            "net26": "7a:ed:bf:49:50:07",
            "net27": "76:99:11:50:2c:39",
            "net3": "12:b7:0b:4a:49:a5",
            "net4": "5e:6c:c7:88:57:28",
            "net5": "1e:fb:14:9b:be:e7",
            "net6": "9e:2d:91:ae:f1:4e",
            "net7": "ea:1f:16:0b:ad:55",
            "net8": "42:48:6e:da:e0:fe",
            "net9": "32:a4:30:1d:5e:88"
        },
        "spine_2_1_8": {
            "net0": "66:7d:a5:15:ef:7a",
            "net1": "a6:71:4d:d7:d3:ac",
            "net10": "06:8c:7f:42:64:76",
            "net11": "fa:a4:3f:54:7e:f5",
            "net12": "d6:f1:96:ce:2b:b4",
            "net13": "8e:8e:4a:d8:25:11",
            "net14": "f2:08:4a:2a:b2:90",
            "net15": "6a:61:10:7d:94:11",
            "net16": "1a:8c:a1:56:c9:d5",
            "net17": "02:2a:b2:bc:fa:1a",
            "net18": "22:bb:c8:6f:b0:3d",
            "net19": "a2:55:67:fb:a3:0d",
            "net2": "12:d9:13:57:3c:6b",
            "net20": "36:76:07:a6:e6:5e",
            "net21": "1e:43:ac:ae:df:86",
            "net22": "c2:18:8c:94:02:82",
            "net23": "c2:06:6e:0e:83:5c",
            "net24": "aa:b2:38:a9:c2:c2",
            "net25": "f6:2b:c8:99:c8:3f",
            "net26": "92:90:9f:6d:55:a7",
            "net27": "7e:e1:1a:ef:c6:69",
            "net3": "c2:63:a8:c0:bc:bd",
            "net4": "be:bd:64:49:6b:1c",
            "net5": "aa:d0:0f:61:74:12",
            "net6": "0a:7e:75:ff:09:22",
            "net7": "92:7d:33:87:22:4c",
            "net8": "f6:be:ae:cd:bf:15",
            "net9": "82:06:77:12:77:0b"
        },
        "spine_2_1_9": {
            "net0": "06:06:32:55:f8:ed",
            "net1": "5a:9c:bf:ed:2e:01",
            "net10": "aa:41:23:44:26:c0",
            "net11": "82:3b:c3:8e:5d:f2",
            "net12": "a2:25:78:c2:82:a3",
            "net13": "e2:d3:de:88:5f:45",
            "net14": "7a:81:0d:dd:f5:2d",
            "net15": "d2:06:de:c9:38:53",
            "net16": "ee:22:71:7f:e4:1f",
            "net17": "52:ad:43:94:41:9a",
            "net18": "0a:22:17:1b:bf:bb",
            "net19": "3a:d8:83:e2:62:2b",
            "net2": "66:08:b7:ed:1d:85",
            "net20": "aa:6e:f0:52:ca:34",
            "net21": "62:de:74:55:a1:1b",
            "net22": "b2:dc:ff:ff:16:f4",
            "net23": "ba:00:0b:e0:4a:e1",
            "net24": "aa:e5:ce:5b:48:3e",
            "net25": "36:9b:da:ab:91:af",
            "net26": "fe:b6:86:e5:72:7e",
            "net27": "0e:82:2a:36:60:ab",
            "net3": "5e:f1:62:98:49:59",
            "net4": "32:d1:43:6e:67:a0",
            "net5": "32:6c:00:69:9b:0e",
            "net6": "d2:ce:c3:61:da:3d",
            "net7": "0e:3a:7b:ef:b9:59",
            "net8": "ea:0f:13:a3:13:ee",
            "net9": "5a:88:6c:c4:cd:17"
        },
        "tof_1_2_1": {
            "net0": "86:12:a3:e3:6d:e9",
            "net1": "62:0d:67:72:c9:66",
            "net10": "9e:4d:66:7a:06:35",
            "net11": "96:99:b7:53:c9:64",
            "net12": "3a:40:0c:18:4c:dd",
            "net13": "1e:0a:8e:19:f0:8c",
            "net14": "da:97:4a:35:cd:f3",
            "net15": "76:1a:fd:2f:32:47",
            "net16": "92:d8:74:9d:cd:87",
            "net17": "5e:43:83:5a:94:03",
            "net18": "16:83:42:ef:2a:ff",
            "net19": "ce:21:d4:b0:e3:64",
            "net2": "ca:2a:a1:7e:a9:1d",
            "net20": "ca:fa:8a:5d:f9:73",
            "net21": "5a:3a:ff:a3:95:ba",
            "net22": "d2:1d:ba:c7:21:9c",
            "net23": "06:0e:6b:4f:3a:d5",
            "net24": "22:bb:08:27:ba:ea",
            "net25": "46:6b:9e:30:46:41",
            "net26": "0a:49:56:78:3a:72",
            "net27": "fa:e5:02:d6:b1:a4",
            "net3": "b6:bc:f6:f7:1a:8e",
            "net4": "c6:77:53:c4:4f:42",
            "net5": "72:af:99:2c:20:0f",
            "net6": "1e:b2:fe:79:75:b2",
            "net7": "0a:f5:34:6e:b3:7d",
            "net8": "4e:89:17:eb:9f:db",
            "net9": "06:9f:8e:fc:1c:52"
        },
        "tof_1_2_10": {
            "net0": "16:19:1d:95:57:1f",
            "net1": "7a:48:58:b2:1b:1f",
            "net10": "22:2f:63:5a:b1:22",
            "net11": "02:d7:1d:76:49:bb",
            "net12": "82:d6:39:17:ea:7c",
            "net13": "56:97:7b:24:e1:2d",
            "net14": "9a:93:78:d3:6e:84",
            "net15": "32:a3:dc:90:fb:0e",
            "net16": "fe:f7:96:29:0a:4b",
            "net17": "fa:eb:58:11:bc:63",
            "net18": "b6:ba:e2:0a:2f:7a",
            "net19": "c6:ef:fc:7d:17:bc",
            "net2": "ae:46:20:e0:55:f4",
            "net20": "46:98:1b:33:31:68",
            "net21": "c6:2c:8d:1c:d5:05",
            "net22": "6a:67:be:01:d3:01",
            "net23": "d6:bd:f9:4a:db:ee",
            "net24": "56:12:61:27:9b:d3",
            "net25": "7e:7f:97:71:36:23",
            "net26": "b6:d7:bb:3c:09:a8",
            "net27": "16:ea:29:f1:d1:95",
            "net3": "36:fe:96:89:22:88",
            "net4": "32:43:17:b8:b0:1f",
            "net5": "5e:3b:e6:aa:41:40",
            "net6": "1e:d0:8d:6a:46:6a",
            "net7": "82:5f:76:ad:f5:4e",
            "net8": "be:29:32:0a:90:6c",
            "net9": "fa:91:42:12:03:3d"
        },
        "tof_1_2_11": {
            "net0": "92:6f:09:f8:f6:68",
            "net1": "02:27:84:aa:a5:a7",
            "net10": "62:03:21:2c:af:78",
            "net11": "f2:6e:2f:f0:61:39",
            "net12": "f2:ac:30:b1:e0:82",
            "net13": "22:ca:c5:30:e2:33",
            "net14": "ee:63:68:dd:65:63",
            "net15": "aa:2c:32:2e:9f:66",
            "net16": "0e:31:61:e9:d2:7e",
            "net17": "2e:5f:38:78:bd:a9",
            "net18": "16:19:0e:5e:39:f1",
            "net19": "f6:88:df:87:9a:46",
            "net2": "a2:35:be:eb:2a:d0",
            "net20": "aa:d6:6e:42:de:2d",
            "net21": "3e:be:17:00:8a:f1",
            "net22": "36:8d:16:b8:01:a4",
            "net23": "fa:1b:97:68:a7:06",
            "net24": "fe:0a:2f:c3:ee:7b",
            "net25": "1a:65:28:74:44:d8",
            "net26": "4e:90:a9:7a:0e:b6",
            "net27": "82:8f:41:3b:3f:dd",
            "net3": "f2:8e:cf:4a:8f:6a",
            "net4": "ce:73:57:59:ad:d7",
            "net5": "1e:a7:01:d8:4e:ee",
            "net6": "fe:50:0a:5f:d1:d2",
            "net7": "7a:83:2c:91:26:d0",
            "net8": "6e:dc:07:96:62:f3",
            "net9": "d2:04:a5:11:20:95"
        },
        "tof_1_2_12": {
            "net0": "a6:19:34:64:fc:94",
            "net1": "ce:26:2f:1e:4a:11",
            "net10": "5e:b0:f5:ea:42:69",
            "net11": "06:39:c9:3d:78:b2",
            "net12": "76:63:ce:5f:ae:f4",
            "net13": "c2:5c:9f:13:9a:a4",
            "net14": "52:8b:6a:19:2d:10",
            "net15": "26:66:90:72:56:16",
            "net16": "16:aa:75:2d:33:c4",
            "net17": "de:c3:32:1c:bc:f6",
            "net18": "5a:1b:ad:77:55:1b",
            "net19": "c6:b9:94:28:1c:94",
            "net2": "7a:b9:0c:65:06:50",
            "net20": "5a:8d:bf:07:5e:18",
            "net21": "12:21:50:ae:e3:1d",
            "net22": "76:b5:bb:43:b1:ec",
            "net23": "b6:3f:26:4e:b2:97",
            "net24": "aa:3f:98:60:98:55",
            "net25": "fa:8e:c7:cf:e3:31",
            "net26": "d2:cf:dc:8c:a2:17",
            "net27": "9e:24:99:25:33:62",
            "net3": "b6:b8:2e:df:e0:91",
            "net4": "62:44:25:b2:7d:ab",
            "net5": "f2:d5:22:af:b6:5a",
            "net6": "1a:a9:da:dd:76:c7",
            "net7": "46:9f:b0:f6:27:be",
            "net8": "16:1b:2d:6d:a3:bf",
            "net9": "06:95:5c:ad:36:d1"
        },
        "tof_1_2_13": {
            "net0": "8e:a6:3e:c7:78:c3",
            "net1": "f6:1a:53:34:46:ff",
            "net10": "ba:41:a6:f6:97:fb",
            "net11": "d2:16:b3:35:7a:54",
            "net12": "2e:07:80:63:87:4a",
            "net13": "32:84:a0:44:26:1d",
            "net14": "2a:68:ed:82:6c:e4",
            "net15": "2a:ce:3f:82:03:50",
            "net16": "1a:80:4b:f6:03:2d",
            "net17": "3a:1f:1f:c1:b9:bf",
            "net18": "2a:b2:ae:19:9d:0e",
            "net19": "16:e2:ee:f7:0b:1d",
            "net2": "2a:2d:88:5a:17:c7",
            "net20": "c2:08:c5:f9:17:73",
            "net21": "7e:24:a7:fe:1b:41",
            "net22": "da:5d:13:03:16:35",
            "net23": "72:62:57:13:03:1a",
            "net24": "2a:94:fc:86:cd:9e",
            "net25": "f2:84:da:54:b8:3b",
            "net26": "4e:3b:60:ee:c0:2e",
            "net27": "4a:de:5a:d8:0a:27",
            "net3": "d6:5a:43:07:1c:09",
            "net4": "0a:47:b3:3e:0e:b1",
            "net5": "7e:74:3c:32:15:a9",
            "net6": "5e:5b:33:1a:51:7a",
            "net7": "c2:de:64:44:14:1d",
            "net8": "2a:b5:60:f3:6a:53",
            "net9": "8a:8e:44:5f:ca:e6"
        },
        "tof_1_2_14": {
            "net0": "e2:23:4e:85:2f:b7",
            "net1": "5e:94:6f:6b:97:35",
            "net10": "e2:db:54:6e:ed:b0",
            "net11": "7a:34:d9:03:b0:7e",
            "net12": "9a:96:04:64:85:c7",
            "net13": "92:03:16:33:2b:8d",
            "net14": "42:08:cb:5c:34:7e",
            "net15": "ca:22:fd:e4:e7:31",
            "net16": "2a:9b:f0:b5:6e:13",
            "net17": "6a:12:6a:97:ff:65",
            "net18": "22:41:10:c5:6c:d2",
            "net19": "22:ef:c5:1a:c8:f7",
            "net2": "ea:e2:b2:f8:6c:f6",
            "net20": "fa:75:4a:a9:87:9c",
            "net21": "92:ef:c3:01:60:48",
            "net22": "da:0e:5b:5d:86:84",
            "net23": "52:22:12:30:9b:98",
            "net24": "fe:d2:09:87:25:17",
            "net25": "16:9c:6a:cc:c0:dd",
            "net26": "e6:33:a6:df:c7:51",
            "net27": "7e:ba:d9:c1:c6:b7",
            "net3": "52:d4:99:3a:bd:60",
            "net4": "1a:d8:7f:0a:ed:cc",
            "net5": "e2:c6:41:6e:e3:d0",
            "net6": "e6:fd:49:ee:4f:cb",
            "net7": "9a:3e:39:8b:48:4b",
            "net8": "06:33:b0:e3:4e:91",
            "net9": "de:cd:b9:2f:d6:da"
        },
        "tof_1_2_2": {
            "net0": "36:ec:0f:8f:45:f7",
            "net1": "1e:74:64:d2:e2:c9",
            "net10": "56:8b:32:9c:9b:91",
            "net11": "4e:16:1d:96:6b:b1",
            "net12": "96:f2:9b:24:86:87",
            "net13": "0e:4e:62:0b:f0:69",
            "net14": "6e:87:70:ff:1a:57",
            "net15": "5a:b0:9f:24:61:73",
            "net16": "56:31:10:12:69:a1",
            "net17": "be:6f:fc:cd:9c:09",
            "net18": "1e:ef:c4:21:83:59",
            "net19": "b2:d2:20:5f:3b:24",
            "net2": "9e:ad:21:45:d2:22",
            "net20": "aa:a5:90:05:37:ee",
            "net21": "3e:7b:c1:e2:25:f7",
            "net22": "16:7a:33:c4:fa:f4",
            "net23": "92:c6:12:5a:4f:c8",
            "net24": "9e:be:0b:3e:83:62",
            "net25": "46:7a:87:37:8a:26",
            "net26": "ce:94:8b:a5:f5:2e",
            "net27": "6a:ac:ec:fd:a5:d7",
            "net3": "4a:30:d1:d4:3e:bf",
            "net4": "52:09:f9:71:ac:d2",
            "net5": "be:15:01:19:45:7f",
            "net6": "56:8a:ce:8f:0d:9d",
            "net7": "6a:73:e1:f9:e6:01",
            "net8": "fa:f6:a8:d5:d0:b4",
            "net9": "12:da:b1:e5:62:cb"
        },
        "tof_1_2_3": {
            "net0": "4a:22:5a:d5:aa:d9",
            "net1": "12:43:48:c7:58:3b",
            "net10": "5e:1e:68:31:56:b2",
            "net11": "fa:cd:13:74:c3:37",
            "net12": "ee:cc:12:e2:29:a1",
            "net13": "4a:e3:1c:e7:22:5f",
            "net14": "f6:1e:6d:70:ef:a7",
            "net15": "d2:5c:74:18:ee:4a",
            "net16": "0a:2b:b4:79:65:20",
            "net17": "f6:f1:10:43:fd:d9",
            "net18": "9e:ba:0c:40:b6:db",
            "net19": "1a:44:de:c9:b0:e8",
            "net2": "86:55:7c:2a:a4:fa",
            "net20": "5e:a9:5b:49:76:f2",
            "net21": "1e:f7:ec:d6:94:d4",
            "net22": "06:b0:ca:a7:94:dd",
            "net23": "ea:14:42:a4:be:e7",
            "net24": "16:64:4e:71:02:f5",
            "net25": "ee:11:aa:70:e7:bb",
            "net26": "5e:d5:78:27:a3:2d",
            "net27": "5e:a3:e0:fe:4e:e2",
            "net3": "32:e9:34:65:4e:8a",
            "net4": "62:b4:2c:49:48:01",
            "net5": "d2:07:bd:d2:43:d7",
            "net6": "9a:d4:6c:5f:89:ec",
            "net7": "62:c7:bc:23:7b:39",
            "net8": "92:29:9c:0d:35:23",
            "net9": "c2:06:54:96:4d:93"
        },
        "tof_1_2_4": {
            "net0": "ca:1e:4b:41:e6:02",
            "net1": "72:c4:64:cd:07:76",
            "net10": "e2:57:ec:02:02:0e",
            "net11": "66:6f:10:b5:11:6c",
            "net12": "9e:04:7e:07:48:b1",
            "net13": "5a:d9:ff:a0:06:83",
            "net14": "56:df:5e:11:a4:6d",
            "net15": "9e:65:e4:70:6e:0e",
            "net16": "aa:f6:26:79:e5:e7",
            "net17": "da:aa:14:ff:03:4c",
            "net18": "da:e9:a0:79:6e:84",
            "net19": "ca:4c:e8:44:ef:d7",
            "net2": "12:f9:b3:d5:99:53",
            "net20": "8a:f0:59:6b:da:04",
            "net21": "ee:58:79:5f:e8:d1",
            "net22": "82:be:b2:b5:8f:c6",
            "net23": "96:07:78:fe:97:3d",
            "net24": "22:9c:76:47:9e:17",
            "net25": "fa:00:50:0d:8c:ae",
            "net26": "4e:b1:1d:87:90:cc",
            "net27": "82:8b:2a:1b:95:c8",
            "net3": "0a:e1:f9:a2:90:e3",
            "net4": "0a:1a:0b:e1:b8:4e",
            "net5": "66:c0:19:32:94:fe",
            "net6": "16:ec:a1:95:79:37",
            "net7": "92:0e:96:f2:89:9a",
            "net8": "c6:ea:63:9e:58:3c",
            "net9": "8a:6a:74:ea:6f:b6"
        },
        "tof_1_2_5": {
            "net0": "8e:58:c6:da:ef:8c",
            "net1": "b6:12:cc:a6:a3:a8",
            "net10": "82:a7:2e:ec:15:05",
            "net11": "ea:69:80:89:05:76",
            "net12": "02:22:89:b5:54:0a",
            "net13": "ba:a5:2b:b4:83:1e",
            "net14": "c6:0b:25:36:2f:84",
            "net15": "62:d6:3f:2e:87:a8",
            "net16": "4e:0e:08:1e:ab:cd",
            "net17": "9a:60:f1:20:3d:20",
            "net18": "42:a0:21:16:a0:1d",
            "net19": "6e:72:bd:3a:07:7c",
            "net2": "32:44:e8:d3:a4:38",
            "net20": "1a:dc:b7:f1:63:98",
            "net21": "be:bc:c1:f3:c0:ce",
            "net22": "c2:c8:5f:a9:7b:c8",
            "net23": "62:4a:68:56:b3:e4",
            "net24": "0e:28:1c:9d:4c:22",
            "net25": "ca:ae:02:6b:78:49",
            "net26": "fe:bd:31:50:bb:cb",
            "net27": "a6:0d:66:3f:cc:75",
            "net3": "46:6f:c1:b5:92:e3",
            "net4": "5a:34:47:7d:cc:5f",
            "net5": "0a:45:d0:13:e4:e2",
            "net6": "5e:1d:fb:ca:07:7c",
            "net7": "de:45:79:63:f2:ec",
            "net8": "9a:ce:b9:b9:c5:43",
            "net9": "26:04:d7:f4:df:5c"
        },
        "tof_1_2_6": {
            "net0": "2a:65:38:77:69:56",
            "net1": "7e:7c:f9:ba:25:1b",
            "net10": "9e:5f:15:18:2c:3b",
            "net11": "7e:74:2f:fe:c0:59",
            "net12": "4a:86:f6:2a:81:18",
            "net13": "a6:a7:26:91:6e:10",
            "net14": "f6:60:27:2c:ab:68",
            "net15": "7a:90:81:57:3e:cc",
            "net16": "42:1b:63:4a:b8:07",
            "net17": "d2:79:00:41:2d:b1",
            "net18": "5e:d4:46:dc:0b:f6",
            "net19": "c6:c3:43:4b:a3:4b",
            "net2": "d6:fc:dd:00:fd:b1",
            "net20": "2e:04:fb:31:3a:16",
            "net21": "32:ca:d3:55:b4:61",
            "net22": "d2:0a:4a:73:fc:de",
            "net23": "22:c7:98:a9:16:4d",
            "net24": "76:25:39:19:06:c3",
            "net25": "6e:4b:6f:2f:1f:02",
            "net26": "3a:a7:32:d7:6c:ca",
            "net27": "f2:a4:f0:2b:a1:aa",
            "net3": "96:34:f4:75:78:1a",
            "net4": "12:a0:61:a2:44:93",
            "net5": "e6:29:e0:e0:84:95",
            "net6": "6a:e2:48:71:db:07",
            "net7": "7e:03:a5:da:a4:7d",
            "net8": "4e:45:f7:98:b5:22",
            "net9": "46:b7:ee:d5:22:45"
        },
        "tof_1_2_7": {
            "net0": "82:21:22:c0:17:9e",
            "net1": "ee:09:8c:5d:84:d2",
            "net10": "3e:76:95:d9:42:dc",
            "net11": "22:0e:cd:d5:0f:e5",
            "net12": "f2:2a:6d:63:72:35",
            "net13": "82:f8:c1:ce:10:cf",
            "net14": "aa:21:82:c2:ca:c8",
            "net15": "7e:11:55:cf:4a:95",
            "net16": "6e:8f:db:8b:6f:14",
            "net17": "1e:e9:1a:7f:0d:d5",
            "net18": "0a:03:12:6c:49:82",
            "net19": "b6:e6:ef:fc:ca:57",
            "net2": "de:e5:06:35:db:50",
            "net20": "66:b5:52:ab:fe:7a",
            "net21": "c2:75:b3:93:19:0c",
            "net22": "1a:22:31:80:51:0e",
            "net23": "a6:c7:78:8b:71:6a",
            "net24": "ba:0d:69:e4:59:03",
            "net25": "be:58:c6:9a:1f:2b",
            "net26": "2e:b6:cf:c2:66:a6",
            "net27": "9a:f0:50:2a:9e:44",
            "net3": "1a:54:de:a1:ae:9a",
            "net4": "16:33:20:31:1a:5d",
            "net5": "de:48:4f:b9:eb:61",
            "net6": "3a:77:a6:e4:9f:48",
            "net7": "b2:7a:3f:b2:f4:9f",
            "net8": "86:4b:c5:c2:0a:f7",
            "net9": "7a:03:7d:74:ef:7a"
        },
        "tof_1_2_8": {
            "net0": "c2:b6:e2:d9:a3:19",
            "net1": "7e:dc:0b:77:24:7a",
            "net10": "be:d0:ed:da:b1:15",
            "net11": "ea:05:b8:52:33:0c",
            "net12": "5e:c3:30:04:f0:d2",
            "net13": "82:03:88:4b:66:4a",
            "net14": "3e:9d:d6:0c:06:b1",
            "net15": "3e:33:13:4f:16:16",
            "net16": "46:3e:ac:dc:97:99",
            "net17": "26:2f:86:f1:34:1a",
            "net18": "72:94:79:01:e6:71",
            "net19": "d6:15:f9:1c:d5:a2",
            "net2": "1e:b6:7a:3d:5c:4f",
            "net20": "72:84:39:4b:d7:e4",
            "net21": "fe:c8:76:35:8f:26",
            "net22": "f2:bc:f3:fd:2c:55",
            "net23": "4e:08:61:d2:ad:2a",
            "net24": "fa:ee:83:3f:d4:c0",
            "net25": "ba:11:5b:cf:e2:e8",
            "net26": "fe:8c:f7:ec:68:90",
            "net27": "86:a4:a8:2f:07:51",
            "net3": "42:d3:f7:8d:c0:4a",
            "net4": "f6:ee:f0:f2:cb:b4",
            "net5": "62:c0:db:f3:4a:6d",
            "net6": "3a:4f:16:36:e1:86",
            "net7": "76:95:ee:82:67:ff",
            "net8": "a2:72:1f:0c:b7:6a",
            "net9": "f6:2d:be:aa:9c:8c"
        },
        "tof_1_2_9": {
            "net0": "8a:af:bb:0a:67:c6",
            "net1": "fa:72:ec:69:7b:86",
            "net10": "f2:86:61:27:c9:3c",
            "net11": "7e:fe:ac:c4:e8:d5",
            "net12": "f2:e4:48:2d:6a:66",
            "net13": "e2:27:42:c2:e1:5a",
            "net14": "92:2d:85:29:b0:96",
            "net15": "ce:c8:93:74:34:f4",
            "net16": "da:71:54:b9:c0:95",
            "net17": "ca:aa:2c:a4:b9:cb",
            "net18": "86:90:dd:6e:fe:a9",
            "net19": "b6:23:d6:95:1e:4c",
            "net2": "ba:4b:7d:fc:0a:9a",
            "net20": "66:53:a6:eb:00:bd",
            "net21": "9a:7e:92:c2:8c:1f",
            "net22": "d6:c6:e4:1b:56:b1",
            "net23": "12:0f:53:81:b0:1a",
            "net24": "16:48:f4:7d:c7:6c",
            "net25": "a6:b6:9d:e2:1f:c5",
            "net26": "ea:61:06:60:21:10",
            "net27": "7a:a7:85:0f:29:30",
            "net3": "76:48:82:e1:40:f2",
            "net4": "e2:b1:0e:a1:cf:eb",
            "net5": "4a:3d:70:ef:be:15",
            "net6": "42:f9:d6:da:30:ce",
            "net7": "4a:63:30:bd:d3:22",
            "net8": "ea:88:c0:7b:f6:4d",
            "net9": "a6:1b:a9:a6:9b:0d"
        }
    },
    "failed_machine": "leaf_1_0_1",
    "failure_time": {
        "leaf_1_0_1": 1622142955.0707996,
        "leaf_1_0_10": 1622142955.0816424,
        "leaf_1_0_11": 1622142955.094176,
        "leaf_1_0_12": 1622142955.105749,
        "leaf_1_0_13": 1622142955.1133974,
        "leaf_1_0_14": 1622142955.0759468,
        "leaf_1_0_2": 1622142955.0891612,
        "leaf_1_0_3": 1622142955.1000032,
        "leaf_1_0_4": 1622142955.1098819,
        "leaf_1_0_5": 1622142955.1219654,
        "leaf_1_0_6": 1622142955.0776675,
        "leaf_1_0_7": 1622142955.086475,
        "leaf_1_0_8": 1622142955.0953543,
        "leaf_1_0_9": 1622142955.1054094,
        "leaf_2_0_1": 1622142955.114819,
        "leaf_2_0_10": 1622142955.07842,
        "leaf_2_0_11": 1622142955.0893528,
        "leaf_2_0_12": 1622142955.0973914,
        "leaf_2_0_13": 1622142955.1088986,
        "leaf_2_0_14": 1622142955.122471,
        "leaf_2_0_2": 1622142955.1251786,
        "leaf_2_0_3": 1622142955.1421077,
        "leaf_2_0_4": 1622142955.1490004,
        "leaf_2_0_5": 1622142955.1654463,
        "leaf_2_0_6": 1622142955.1774347,
        "leaf_2_0_7": 1622142955.1296005,
        "leaf_2_0_8": 1622142955.1389093,
        "leaf_2_0_9": 1622142955.148942,
        "spine_1_1_1": 1622142955.164906,
        "spine_1_1_10": 1622142955.1755369,
        "spine_1_1_11": 1622142955.1348414,
        "spine_1_1_12": 1622142955.1476343,
        "spine_1_1_13": 1622142955.1596708,
        "spine_1_1_14": 1622142955.1726294,
        "spine_1_1_2": 1622142955.1852825,
        "spine_1_1_3": 1622142955.1343827,
        "spine_1_1_4": 1622142955.1456337,
        "spine_1_1_5": 1622142955.157583,
        "spine_1_1_6": 1622142955.1727376,
        "spine_1_1_7": 1622142955.1818206,
        "spine_1_1_8": 1622142955.1849089,
        "spine_1_1_9": 1622142955.1972764,
        "spine_2_1_1": 1622142955.2132936,
        "spine_2_1_10": 1622142955.2228022,
        "spine_2_1_11": 1622142955.236787,
        "spine_2_1_12": 1622142955.1889982,
        "spine_2_1_13": 1622142955.1995065,
        "spine_2_1_14": 1622142955.2083519,
        "spine_2_1_2": 1622142955.2213647,
        "spine_2_1_3": 1622142955.2334976,
        "spine_2_1_4": 1622142955.1869857,
        "spine_2_1_5": 1622142955.20327,
        "spine_2_1_6": 1622142955.2193606,
        "spine_2_1_7": 1622142955.231122,
        "spine_2_1_8": 1622142955.2433093,
        "spine_2_1_9": 1622142955.1943567,
        "tof_1_2_1": 1622142955.2048323,
        "tof_1_2_10": 1622142955.2197676,
        "tof_1_2_11": 1622142955.2320073,
        "tof_1_2_12": 1622142955.2437553,
        "tof_1_2_13": 1622142955.24204,
        "tof_1_2_14": 1622142955.2522333,
        "tof_1_2_2": 1622142955.2606804,
        "tof_1_2_3": 1622142955.2671616,
        "tof_1_2_4": 1622142955.2735398,
        "tof_1_2_5": 1622142955.2466261,
        "tof_1_2_6": 1622142955.2544727,
        "tof_1_2_7": 1622142955.262883,
        "tof_1_2_8": 1622142955.2706997,
        "tof_1_2_9": 1622142955.2785008
    }
}