{
    "k_leaf": 16,
    "k_top": 16,
    "redundancy_factor": 16,
    "is_k8s": true,
    "machine_mac_addresses": {
        "leaf_1_0_1": {
            "net0": "ca:af:ac:a2:a0:a4",
            "net1": "72:54:4b:c6:99:cd",
            "net10": "3e:67:65:a1:25:ab",
            "net11": "8a:cf:51:46:a6:c3",
            "net12": "f2:bc:97:a8:c7:69",
            "net13": "2e:46:39:47:dc:31",
            "net14": "8e:61:02:93:82:72",
            "net15": "de:51:86:ff:c0:88",
            "net16": "c6:53:32:72:79:84",
            "net2": "ce:7a:91:cb:20:4b",
            "net3": "ea:70:35:e6:25:27",
            "net4": "4e:7c:3d:bd:c4:ab",
            "net5": "12:1a:cd:2b:af:d6",
            "net6": "e2:31:9b:37:74:50",
            "net7": "1e:76:ff:4b:9f:54",
            "net8": "7a:12:6a:bf:e7:cf",
            "net9": "2a:59:01:cd:62:eb"
        },
        "leaf_1_0_10": {
            "net0": "52:ba:21:64:d1:49",
            "net1": "5a:72:8e:c7:1c:91",
            "net10": "2a:77:e2:9e:c8:c1",
            "net11": "82:25:88:4e:09:c7",
            "net12": "66:64:cb:16:b9:59",
            "net13": "d2:88:53:79:86:d7",
            "net14": "b6:c9:01:6b:84:a4",
            "net15": "06:ab:75:d7:8d:a0",
            "net16": "6e:25:6a:9c:c7:9e",
            "net2": "1a:9b:77:0c:06:2c",
            "net3": "ea:86:e9:d1:3f:aa",
            "net4": "d6:93:26:b5:4d:9d",
            "net5": "0e:24:e6:d4:23:fc",
            "net6": "12:8a:97:54:2e:67",
            "net7": "86:e0:b5:4c:5b:b3",
            "net8": "be:2f:78:90:f2:1e",
            "net9": "4e:0e:90:7f:0b:88"
        },
        "leaf_1_0_11": {
            "net0": "de:b0:f1:74:8b:76",
            "net1": "96:b2:7b:8d:db:40",
            "net10": "26:ed:91:36:ff:32",
            "net11": "42:32:4e:01:3c:b7",
            "net12": "16:79:37:8e:77:d9",
            "net13": "c2:e0:12:99:07:43",
            "net14": "c6:fb:a0:5d:6e:a0",
            "net15": "0e:e0:fb:bf:07:7e",
            "net16": "3a:6f:ce:f5:67:f6",
            "net2": "4a:d5:1b:25:33:80",
            "net3": "9a:2e:e7:01:15:a5",
            "net4": "a6:75:63:f3:3f:42",
            "net5": "d6:f2:21:b8:9a:48",
            "net6": "4e:c3:05:c9:f5:74",
            "net7": "96:0b:fc:6b:c1:80",
            "net8": "fa:ae:b8:e4:89:a1",
            "net9": "82:eb:a6:6c:57:49"
        },
        "leaf_1_0_12": {
            "net0": "ba:d8:d2:af:d9:36",
            "net1": "d6:e1:81:17:f7:a4",
            "net10": "5a:8a:9f:05:66:fa",
            "net11": "7a:1a:db:9b:82:ef",
            "net12": "36:fa:15:17:d2:30",
            "net13": "ee:d4:93:10:29:00",
            "net14": "a2:1a:f0:43:46:c8",
            "net15": "36:b7:d0:08:46:34",
            "net16": "ee:06:44:e4:c6:26",
            "net2": "6a:a6:c2:da:9b:94",
            "net3": "06:3d:75:78:6b:20",
            "net4": "e6:52:55:95:9e:26",
            "net5": "46:e8:60:b7:55:34",
            "net6": "9a:2b:df:17:12:92",
            "net7": "0e:2d:b7:f0:6b:61",
            "net8": "c2:79:e5:94:db:2b",
            "net9": "36:24:02:3f:f0:dd"
        },
        "leaf_1_0_13": {
            "net0": "92:55:4b:87:87:98",
            "net1": "72:dc:6b:f7:f9:05",
            "net10": "ea:46:c3:07:51:0d",
            "net11": "1e:b6:06:f9:db:40",
            "net12": "de:34:7b:89:97:fa",
            "net13": "76:c5:2f:37:fa:d0",
            "net14": "c2:82:39:c9:8f:70",
            "net15": "32:66:9e:11:56:ff",
            "net16": "76:a1:03:58:5f:75",
            "net2": "a6:31:85:1a:53:4a",
            "net3": "fa:79:51:16:ce:d8",
            "net4": "c2:4e:6c:83:56:10",
            "net5": "de:a5:36:67:38:2e",
            "net6": "46:b4:86:1a:17:b3",
            "net7": "a6:2f:3e:28:e8:cf",
            "net8": "0a:c1:d6:e0:12:e6",
            "net9": "96:fb:f9:d6:3a:c5"
        },
        "leaf_1_0_14": {
            "net0": "2e:4b:d6:4b:16:4f",
            "net1": "ce:6a:0f:df:9b:6e",
            "net10": "52:5e:3d:3b:22:ea",
            "net11": "2a:f3:11:15:bb:e4",
            "net12": "c6:1e:30:d5:5b:66",
            "net13": "b2:d1:f0:e1:b8:98",
            "net14": "56:78:be:00:8d:04",
            "net15": "b2:b5:df:73:cd:1e",
            "net16": "12:db:0d:61:d8:51",
            "net2": "62:e2:b5:3a:c3:40",
            "net3": "ee:d1:23:ea:0c:7d",
            "net4": "42:49:37:c5:83:0b",
            "net5": "fe:b1:5a:d3:ea:52",
            "net6": "e6:f5:eb:73:1e:8b",
            "net7": "06:f0:d4:b7:38:ef",
            "net8": "22:c6:5e:87:58:0d",
            "net9": "fa:b9:96:93:d1:1c"
        },
        "leaf_1_0_15": {
            "net0": "82:38:94:c7:bb:91",
            "net1": "0e:d8:c2:1c:6e:fa",
            "net10": "be:16:9f:64:e9:33",
            "net11": "42:28:2d:99:84:f8",
            "net12": "c6:b8:0e:f0:35:56",
            "net13": "12:f0:b9:82:c6:48",
            "net14": "76:90:45:27:15:9a",
            "net15": "b6:24:7a:2e:1c:ac",
            "net16": "32:83:ba:21:2b:83",
            "net2": "7a:33:66:e8:64:dd",
            "net3": "7e:98:1f:80:35:a9",
            "net4": "fe:bf:8a:dd:bf:34",
            "net5": "96:b7:3b:44:30:f0",
            "net6": "be:4f:e7:d8:a5:ef",
            "net7": "1e:3e:64:28:5c:f8",
            "net8": "aa:32:60:3b:d1:f7",
            "net9": "12:30:7e:6c:a8:a6"
        },
        "leaf_1_0_16": {
            "net0": "c6:9f:2a:a4:45:da",
            "net1": "56:0e:7c:b1:65:b2",
            "net10": "fe:75:67:ff:1b:2a",
            "net11": "6e:6b:6a:c3:4a:6f",
            "net12": "f6:55:85:62:cf:23",
            "net13": "26:52:59:70:0a:c3",
            "net14": "0e:90:82:c8:9b:14",
            "net15": "56:41:83:08:bd:62",
            "net16": "ca:b1:4e:fb:b0:21",
            "net2": "8a:ab:4b:98:32:cc",
            "net3": "4a:ad:3b:cd:d6:f4",
            "net4": "ce:cf:a9:3d:c1:e6",
            "net5": "ba:1e:a5:16:58:1b",
            "net6": "6e:9c:7e:b5:88:4e",
            "net7": "42:37:d8:81:92:8e",
            "net8": "b2:b4:1f:4f:d5:b9",
            "net9": "da:92:07:e6:1f:18"
        },
        "leaf_1_0_2": {
            "net0": "86:04:14:3e:7c:46",
            "net1": "b6:65:49:d2:c0:ee",
            "net10": "ba:74:76:09:cb:b4",
            "net11": "4a:35:f9:a4:e8:ed",
            "net12": "06:77:ae:6c:ad:ea",
            "net13": "02:15:94:cb:a0:c6",
            "net14": "16:c9:1b:ac:29:a6",
            "net15": "f6:81:53:13:07:be",
            "net16": "d6:c4:53:70:1c:b9",
            "net2": "3e:ea:dd:bf:5e:bd",
            "net3": "66:49:26:18:8b:96",
            "net4": "c2:bc:77:2f:20:6d",
            "net5": "1a:c0:05:82:c4:f7",
            "net6": "c2:6c:fe:71:65:a8",
            "net7": "36:3f:f1:6c:05:28",
            "net8": "3e:45:7c:a2:6b:e7",
            "net9": "16:aa:79:fb:2a:47"
        },
        "leaf_1_0_3": {
            "net0": "7e:93:48:8b:c1:08",
            "net1": "16:59:a7:0b:23:b1",
            "net10": "ba:5e:67:b7:36:8f",
            "net11": "3e:4c:a9:87:98:ee",
            "net12": "be:be:21:38:93:d8",
            "net13": "2a:16:f3:2a:84:8c",
            "net14": "4a:f8:8f:d3:27:ea",
            "net15": "42:56:c9:f7:bf:a1",
            "net16": "32:c4:4e:3e:ba:e8",
            "net2": "06:b4:f7:68:4f:a0",
            "net3": "4e:f0:04:44:3f:9a",
            "net4": "1a:90:cb:f7:21:f4",
            "net5": "1e:4c:b2:5a:d3:86",
            "net6": "92:9e:52:14:3a:d6",
            "net7": "a2:b4:5e:44:c4:e5",
            "net8": "ba:70:ed:ff:df:2d",
            "net9": "52:22:d8:cb:81:b1"
        },
        "leaf_1_0_4": {
            "net0": "ee:ea:26:cf:0e:06",
            "net1": "be:5e:89:0f:b2:e8",
            "net10": "ba:2b:83:6b:1f:15",
            "net11": "9a:4a:79:86:d1:e1",
            "net12": "66:7f:4b:8c:f1:ba",
            "net13": "96:99:64:3a:54:2e",
            "net14": "fa:33:6e:e5:11:85",
            "net15": "56:5b:5f:a4:32:44",
            "net16": "ea:2d:71:78:97:7b",
            "net2": "de:5e:80:e7:75:1c",
            "net3": "1a:35:21:89:d7:4c",
            "net4": "6e:5c:e2:ff:9e:c8",
            "net5": "d6:39:cc:ad:b6:81",
            "net6": "52:6b:d5:b2:2e:25",
            "net7": "ea:f3:be:0f:bb:75",
            "net8": "0a:34:64:52:63:44",
            "net9": "36:e4:22:15:e1:b8"
        },
        "leaf_1_0_5": {
            "net0": "f2:a1:0c:93:1c:e5",
            "net1": "2e:6b:00:c2:40:b6",
            "net10": "02:b1:39:26:ea:bd",
            "net11": "ea:d1:4f:4e:1a:0c",
            "net12": "e6:3c:98:f9:17:45",
            "net13": "52:79:f9:64:4d:81",
            "net14": "06:89:6f:7b:8a:cd",
            "net15": "ce:08:35:4a:58:ce",
            "net16": "ae:07:cc:f7:50:59",
            "net2": "f2:b8:ff:46:5b:3c",
            "net3": "5a:fc:e4:6c:da:6b",
            "net4": "7a:ac:d3:7d:13:e1",
            "net5": "66:31:e4:54:9f:e0",
            "net6": "b2:91:c9:01:fa:98",
            "net7": "aa:de:23:ae:f7:bf",
            "net8": "92:56:1c:df:dd:ed",
            "net9": "d2:f8:c1:3a:28:7a"
        },
        "leaf_1_0_6": {
            "net0": "ca:fd:33:65:3a:81",
            "net1": "1a:d0:db:6d:34:0a",
            "net10": "2e:1a:7b:b0:96:b1",
            "net11": "f2:0c:47:8f:c9:82",
            "net12": "1a:54:71:78:93:8f",
            "net13": "2e:e9:b1:8a:31:e1",
            "net14": "d6:67:22:ea:c9:e5",
            "net15": "52:c5:b3:8a:cf:58",
            "net16": "be:34:af:85:2f:02",
            "net2": "56:a0:18:8a:91:02",
            "net3": "0a:b7:04:4e:fe:c7",
            "net4": "ce:85:36:db:a1:ac",
            "net5": "b6:04:cf:2a:2b:17",
            "net6": "a2:97:19:f4:23:27",
            "net7": "c6:b2:ae:bf:9d:29",
            "net8": "3a:79:32:a7:19:fb",
            "net9": "be:90:9f:dd:ab:82"
        },
        "leaf_1_0_7": {
            "net0": "82:17:fc:61:a5:2d",
            "net1": "92:b5:d4:3e:94:eb",
            "net10": "de:d1:2b:4f:a7:74",
            "net11": "9e:d4:b0:56:4b:94",
            "net12": "7a:37:45:64:3f:e9",
            "net13": "ca:01:4d:bd:a2:79",
            "net14": "b6:09:3c:21:a7:d6",
            "net15": "16:d7:48:45:5b:91",
            "net16": "ca:69:c3:9f:df:df",
            "net2": "c6:56:ac:e0:55:fd",
            "net3": "fe:fe:fa:e5:68:98",
            "net4": "96:4e:01:5e:39:34",
            "net5": "6a:d1:33:30:5e:5a",
            "net6": "fe:0e:a5:f6:b1:3c",
            "net7": "9a:b3:fe:80:16:d0",
            "net8": "c2:58:35:37:c4:5f",
            "net9": "82:6b:7a:d0:59:e4"
        },
        "leaf_1_0_8": {
            "net0": "ea:93:bd:a8:03:a2",
            "net1": "1e:97:20:e6:43:c2",
            "net10": "06:c6:ac:f8:d2:3a",
            "net11": "02:19:04:62:fd:aa",
            "net12": "f2:64:e2:c0:4e:b2",
            "net13": "a2:7e:a9:06:b9:3f",
            "net14": "76:94:f4:69:83:4b",
            "net15": "22:b3:10:9d:eb:b0",
            "net16": "26:73:61:f4:63:cf",
            "net2": "3a:55:1d:bf:42:66",
            "net3": "8e:7e:ff:c6:1f:1f",
            "net4": "86:b5:e9:8e:24:f7",
            "net5": "7e:f0:ce:75:88:ec",
            "net6": "a6:a5:9d:3d:90:d7",
            "net7": "22:5d:54:fe:1f:2b",
            "net8": "8e:4a:8e:f5:c3:e3",
            "net9": "6a:c0:8c:d2:72:b3"
        },
        "leaf_1_0_9": {
            "net0": "7a:eb:d7:06:7f:39",
            "net1": "22:d0:5a:6c:fd:b9",
            "net10": "e6:c8:b3:c3:49:13",
            "net11": "4e:7a:42:c3:df:50",
            "net12": "4e:20:42:53:84:1b",
            "net13": "92:bf:83:e1:dd:81",
            "net14": "7a:a8:6f:53:73:0a",
            "net15": "92:a1:93:aa:c0:a7",
            "net16": "d2:d6:0c:31:0f:16",
            "net2": "7e:9a:94:18:e1:60",
            "net3": "06:12:07:85:c2:0d",
            "net4": "12:f5:5d:f3:68:69",
            "net5": "c6:f8:83:c2:7a:83",
            "net6": "fa:7b:21:62:39:04",
            "net7": "6e:fe:91:41:74:8b",
            "net8": "4a:07:f7:30:34:03",
            "net9": "8a:af:4a:7a:0f:cb"
        },
        "leaf_2_0_1": {
            "net0": "42:05:98:f3:f5:3c",
            "net1": "02:1d:ec:fd:bc:89",
            "net10": "7e:01:25:9d:91:30",
            "net11": "02:f8:f9:50:5b:fa",
            "net12": "ca:d0:e8:6e:2f:f5",
            "net13": "aa:3d:f0:9a:22:69",
            "net14": "3a:05:91:5f:ad:c4",
            "net15": "3a:64:49:43:01:07",
            "net16": "ce:db:35:d8:17:fb",
            "net2": "ce:68:1c:f6:7e:aa",
            "net3": "12:07:04:75:a5:bd",
            "net4": "12:5e:51:e6:26:3e",
            "net5": "22:ac:06:e7:0c:ed",
            "net6": "2a:8b:28:d7:00:73",
            "net7": "f2:12:c3:cc:46:f5",
            "net8": "86:a8:55:f1:d2:85",
            "net9": "aa:b7:bc:25:f8:75"
        },
        "leaf_2_0_10": {
            "net0": "5a:01:65:3b:54:b5",
            "net1": "b2:f2:70:d3:d9:0e",
            "net10": "fa:c0:28:66:23:b3",
            "net11": "42:77:de:1f:1f:36",
            "net12": "96:ca:d7:85:74:e6",
            "net13": "9e:6f:1a:27:ba:f6",
            "net14": "26:d1:8b:6b:6e:4b",
            "net15": "12:91:80:9b:84:32",
            "net16": "c6:f4:3d:fc:29:96",
            "net2": "e2:05:2a:79:b2:a6",
            "net3": "82:c5:3d:3b:5c:dd",
            "net4": "ee:a9:57:44:40:11",
            "net5": "36:4b:5d:95:1f:38",
            "net6": "72:9b:c0:cf:c4:03",
            "net7": "9a:25:cc:54:0a:af",
            "net8": "2e:f3:ba:15:20:3b",
            "net9": "12:f4:0b:24:37:d7"
        },
        "leaf_2_0_11": {
            "net0": "6a:eb:29:8b:b9:ef",
            "net1": "d6:f9:94:29:6f:f6",
            "net10": "62:02:f1:44:6b:d5",
            "net11": "26:4d:76:9e:6c:80",
            "net12": "c2:29:69:97:4f:4b",
            "net13": "2a:64:b0:64:ad:d1",
            "net14": "c2:e9:49:61:b7:ff",
            "net15": "6a:f2:a8:a2:78:78",
            "net16": "be:7c:29:38:31:a9",
            "net2": "9a:59:82:5d:15:46",
            "net3": "62:29:8e:b5:6e:8f",
            "net4": "5e:5d:6f:36:f7:7c",
            "net5": "aa:c0:72:c6:c6:5f",
            "net6": "f2:85:02:18:b2:54",
            "net7": "ee:82:2d:a2:98:d9",
            "net8": "2a:36:93:5a:e2:0e",
            "net9": "de:1c:59:2a:8f:73"
        },
        "leaf_2_0_12": {
            "net0": "92:0a:8a:20:cb:07",
            "net1": "e2:d5:b9:82:f4:6f",
            "net10": "fa:a2:1f:6a:69:c0",
            "net11": "da:00:8f:9c:4d:1d",
            "net12": "0a:74:08:ec:b9:a7",
            "net13": "5a:85:13:4a:6f:c3",
            "net14": "ce:ad:98:6d:0d:47",
            "net15": "6a:bb:ed:2e:06:d6",
            "net16": "fe:a9:44:98:88:22",
            "net2": "6a:29:6a:48:6a:c7",
            "net3": "92:60:a1:9b:77:15",
            "net4": "12:29:b6:97:18:9d",
            "net5": "be:af:a1:93:cc:e0",
            "net6": "4a:72:cf:00:a2:22",
            "net7": "ba:82:5d:d7:09:30",
            "net8": "4a:54:7f:78:e4:39",
            "net9": "92:6f:a7:cb:54:30"
        },
        "leaf_2_0_13": {
            "net0": "22:37:8d:b2:d6:3c",
            "net1": "a6:71:4a:a9:d5:13",
            "net10": "42:c8:a7:c9:6d:fc",
            "net11": "1e:3d:10:b0:b4:7b",
            "net12": "9a:0c:bc:74:b4:59",
            "net13": "72:d1:2a:1b:05:5b",
            "net14": "56:64:2e:a4:19:db",
            "net15": "5e:2d:e1:39:e3:11",
            "net16": "d6:31:85:90:f6:3c",
            "net2": "26:06:af:99:f2:4e",
            "net3": "7a:9b:97:21:b8:36",
            "net4": "0e:59:bf:af:5f:ec",
            "net5": "76:c1:3f:9c:fe:ba",
            "net6": "16:1d:b0:ad:69:f1",
            "net7": "0e:d1:f7:49:2c:04",
            "net8": "de:07:22:c0:7f:44",
            "net9": "5e:82:d1:42:9f:7a"
        },
        "leaf_2_0_14": {
            "net0": "62:c5:b2:97:93:ea",
            "net1": "52:f6:56:6c:62:18",
            "net10": "f6:8a:8e:b0:1b:0d",
            "net11": "2e:c1:22:7a:8f:fc",
            "net12": "a6:b1:df:82:94:ad",
            "net13": "d2:ac:7d:1d:cc:c9",
            "net14": "6a:57:9e:9e:b0:66",
            "net15": "fe:ee:36:2c:da:fd",
            "net16": "52:b2:fc:2b:6d:1d",
            "net2": "32:aa:3d:8b:e0:81",
            "net3": "1e:e4:27:8e:c7:d1",
            "net4": "2e:2a:c8:91:eb:65",
            "net5": "42:f5:60:fc:cc:3d",
            "net6": "66:b8:88:d1:f4:b1",
            "net7": "7e:ab:6e:73:7b:8f",
            "net8": "c2:55:b8:15:ca:93",
            "net9": "da:46:b6:27:18:e7"
        },
        "leaf_2_0_15": {
            "net0": "7a:63:f5:8d:dd:28",
            "net1": "36:81:03:6f:66:b0",
            "net10": "b2:08:ba:bb:f0:84",
            "net11": "f6:0a:a1:74:2b:58",
            "net12": "0a:0d:a0:24:21:a1",
            "net13": "76:da:f3:ec:11:bb",
            "net14": "82:bc:45:85:25:18",
            "net15": "22:58:dc:7a:bd:c1",
            "net16": "2a:d5:63:55:cf:f5",
            "net2": "12:73:c3:74:03:91",
            "net3": "9a:6d:25:a6:94:af",
            "net4": "16:0c:a4:92:3e:7f",
            "net5": "ba:40:d6:dd:84:4a",
            "net6": "1a:d4:68:ac:fd:dd",
            "net7": "16:38:1e:92:e2:8c",
            "net8": "7e:6e:3c:be:27:75",
            "net9": "4e:16:9c:08:4d:fd"
        },
        "leaf_2_0_16": {
            "net0": "9e:b8:1c:66:53:3d",
            "net1": "f6:9c:45:f0:a5:09",
            "net10": "be:c7:9f:e9:df:5d",
            "net11": "ba:95:91:97:23:a1",
            "net12": "fe:bc:ee:aa:06:56",
            "net13": "f6:81:cf:5f:2b:8d",
            "net14": "72:42:8c:55:29:9b",
            "net15": "6a:1c:9e:e4:04:e7",
            "net16": "5a:b2:63:4e:f7:4a",
            "net2": "de:da:c1:4a:c4:45",
            "net3": "ba:db:8b:12:28:f9",
            "net4": "da:96:bd:2d:91:a8",
            "net5": "fe:9b:df:8f:96:ae",
            "net6": "ce:43:b8:1c:3c:93",
            "net7": "06:ff:8a:fb:24:34",
            "net8": "fe:17:c6:a6:79:d9",
            "net9": "c2:7a:96:48:06:9c"
        },
        "leaf_2_0_2": {
            "net0": "5e:36:09:ca:d4:d0",
            "net1": "7e:66:63:c4:d5:19",
            "net10": "ca:35:be:19:21:30",
            "net11": "22:df:e6:55:09:95",
            "net12": "e2:3b:2e:af:ae:2d",
            "net13": "3e:0e:78:31:d8:db",
            "net14": "c6:d6:ba:33:7d:7a",
            "net15": "da:b2:35:8f:28:53",
            "net16": "26:ea:e0:e2:d2:05",
            "net2": "76:01:c0:64:75:d7",
            "net3": "52:9f:02:6f:ce:e8",
            "net4": "f6:ee:20:3a:d6:a9",
            "net5": "d6:35:4b:21:d3:73",
            "net6": "96:36:65:cc:a6:4d",
            "net7": "0a:0d:21:22:ae:ca",
            "net8": "ea:43:59:ff:c9:ae",
            "net9": "62:4e:f8:6b:80:67"
        },
        "leaf_2_0_3": {
            "net0": "da:6e:fc:35:69:57",
            "net1": "02:93:9a:f7:80:57",
            "net10": "12:28:61:d2:b9:8f",
            "net11": "d6:9e:b8:a7:35:a1",
            "net12": "56:49:26:3c:13:8d",
            "net13": "22:04:03:8b:c1:fa",
            "net14": "66:15:bf:31:8a:46",
            "net15": "12:08:c4:30:f4:62",
            "net16": "1e:d2:fc:21:2a:9a",
            "net2": "16:c4:55:63:f6:33",
            "net3": "42:de:33:d1:06:99",
            "net4": "22:86:ab:08:c4:6a",
            "net5": "fa:43:09:d6:3c:ea",
            "net6": "e6:47:df:a0:75:3c",
            "net7": "da:e9:f3:73:1b:f2",
            "net8": "fe:aa:25:16:1c:7e",
            "net9": "86:2d:78:d4:7f:b3"
        },
        "leaf_2_0_4": {
            "net0": "82:4e:aa:fa:cd:24",
            "net1": "da:92:b1:14:e1:df",
            "net10": "fe:c2:ee:7a:57:89",
            "net11": "1a:66:2e:a1:e9:ce",
            "net12": "ba:5a:d6:02:b0:d8",
            "net13": "92:e2:14:9e:27:47",
            "net14": "4a:fa:65:3e:2d:e4",
            "net15": "d6:af:6b:7e:ae:8c",
            "net16": "72:2c:57:a0:14:93",
            "net2": "76:43:3f:b0:b5:18",
            "net3": "b2:a4:cb:9b:70:38",
            "net4": "a6:d3:78:74:fe:62",
            "net5": "c2:64:f6:fc:4d:79",
            "net6": "6a:ac:a8:b5:61:85",
            "net7": "56:21:5f:72:2c:a4",
            "net8": "ee:6d:65:bd:43:e1",
            "net9": "02:98:03:61:3c:a6"
        },
        "leaf_2_0_5": {
            "net0": "7a:ee:6e:17:99:3f",
            "net1": "1e:fc:30:af:54:9a",
            "net10": "3a:7e:bb:93:f1:fa",
            "net11": "0a:09:b4:11:5a:8b",
            "net12": "1a:72:c5:c6:9e:80",
            "net13": "16:c0:59:47:e0:84",
            "net14": "32:12:9f:23:c6:f6",
            "net15": "de:71:cf:c5:4c:c8",
            "net16": "7a:dd:f6:1a:27:2a",
            "net2": "2a:db:fb:be:f8:90",
            "net3": "62:c9:41:50:d6:e2",
            "net4": "ee:e8:e1:c0:20:d4",
            "net5": "1a:bb:41:1a:c2:29",
            "net6": "6a:d0:61:47:fa:e3",
            "net7": "fe:1a:d9:fb:d2:69",
            "net8": "e6:c9:93:5a:2d:aa",
            "net9": "a6:3b:8f:5d:d6:fc"
        },
        "leaf_2_0_6": {
            "net0": "1e:a3:bc:6d:87:6b",
            "net1": "92:4b:53:14:81:7d",
            "net10": "32:b0:39:f0:32:b8",
            "net11": "da:ec:45:d8:4b:49",
            "net12": "3a:a2:54:7d:15:0d",
            "net13": "a6:5b:95:c5:29:fc",
            "net14": "6e:ed:1d:2d:1b:1f",
            "net15": "3e:5b:41:95:3b:7f",
            "net16": "d2:50:ca:bb:2b:74",
            "net2": "7a:86:3b:f3:e3:00",
            "net3": "4a:53:08:7d:e3:44",
            "net4": "62:b7:39:d3:c1:b8",
            "net5": "56:f4:1a:60:1e:7e",
            "net6": "02:ef:f7:00:a5:93",
            "net7": "66:3a:f4:59:2e:b1",
            "net8": "92:9b:fc:1f:50:13",
            "net9": "ba:fc:1f:dc:3a:ee"
        },
        "leaf_2_0_7": {
            "net0": "ea:b5:58:1b:7d:d7",
            "net1": "c2:fa:14:ed:c0:c2",
            "net10": "26:6d:46:58:0d:88",
            "net11": "ba:14:e7:2f:87:a5",
            "net12": "22:27:6b:d1:84:4e",
            "net13": "9e:b6:07:16:aa:f0",
            "net14": "06:d8:b8:ed:d5:46",
            "net15": "8e:ed:0b:4f:1f:c3",
            "net16": "4a:89:3a:11:da:1c",
            "net2": "fa:fa:86:e5:79:f3",
            "net3": "86:9e:43:64:a7:cb",
            "net4": "8e:1a:48:e0:1c:f0",
            "net5": "d6:36:b2:39:58:ca",
            "net6": "a2:46:a2:9a:4e:3c",
            "net7": "46:55:1f:ad:10:f1",
            "net8": "62:62:17:8d:45:fc",
            "net9": "76:16:79:6a:b1:ac"
        },
        "leaf_2_0_8": {
            "net0": "de:ca:15:1a:70:8c",
            "net1": "72:c8:d7:d2:87:64",
            "net10": "1a:27:4f:0b:78:8b",
            "net11": "0e:7f:a3:61:e7:72",
            "net12": "36:dc:b8:0a:34:86",
            "net13": "86:38:85:dc:d7:3d",
            "net14": "56:66:70:0b:bd:00",
            "net15": "16:f7:2e:be:e1:39",
            "net16": "5a:e9:31:a4:98:87",
            "net2": "3e:e2:b5:b8:36:b5",
            "net3": "12:27:10:3a:dd:cf",
            "net4": "36:d9:20:d9:3a:aa",
            "net5": "32:ab:73:0d:49:28",
            "net6": "fe:70:b7:f0:7a:d9",
            "net7": "2e:11:8c:c3:4e:c3",
            "net8": "ca:b0:71:5d:f7:ba",
            "net9": "9a:38:ea:8e:8d:54"
        },
        "leaf_2_0_9": {
            "net0": "46:44:9e:63:2b:e2",
            "net1": "1e:16:ef:81:dc:c5",
            "net10": "a2:67:6a:94:b3:f2",
            "net11": "a2:83:b9:3f:6f:65",
            "net12": "7a:41:43:56:18:9f",
            "net13": "9a:7d:9c:5a:3c:48",
            "net14": "8e:c5:50:2b:d0:27",
            "net15": "62:cf:2e:f9:d1:61",
            "net16": "3e:25:60:27:ab:ab",
            "net2": "7e:94:b8:22:d3:10",
            "net3": "d6:5c:2f:f7:f0:a6",
            "net4": "62:be:79:50:8e:44",
            "net5": "2e:b5:a5:92:ca:8e",
            "net6": "2a:b0:e4:61:eb:f1",
            "net7": "5e:46:75:b7:53:4f",
            "net8": "be:41:49:b2:a8:8b",
            "net9": "3e:c4:49:31:52:72"
        },
        "spine_1_1_1": {
            "net0": "26:38:93:7b:38:41",
            "net1": "1a:a5:99:6b:26:ba",
            "net10": "42:84:4b:e2:1a:d6",
            "net11": "16:e6:f2:32:57:4b",
            "net12": "42:49:8d:f5:24:40",
            "net13": "d2:76:b7:80:f5:d8",
            "net14": "42:e6:4a:9a:39:c2",
            "net15": "0a:87:7e:ce:60:69",
            "net16": "66:58:f9:7e:9b:be",
            "net17": "32:a5:33:22:08:54",
            "net18": "6e:c3:81:52:41:a9",
            "net19": "66:ca:26:f4:72:6c",
            "net2": "52:55:dc:cf:72:4f",
            "net20": "56:37:dc:b9:80:7f",
            "net21": "ee:4d:ce:ea:8f:18",
            "net22": "9e:45:48:3b:87:b9",
            "net23": "e6:92:3d:b2:8a:2f",
            "net24": "fa:ed:f1:88:43:75",
            "net25": "46:08:1f:ca:e8:7c",
            "net26": "f6:e6:6f:94:46:23",
            "net27": "42:ae:7e:a6:ad:dd",
            "net28": "7a:03:6e:b0:f5:91",
            "net29": "2a:5c:12:74:1f:2b",
            "net3": "be:bf:a4:e3:a2:c6",
            "net30": "82:13:d6:74:e9:16",
            "net31": "96:49:3b:f0:f1:d3",
            "net4": "9e:1c:5c:24:f9:66",
            "net5": "b6:fc:de:6d:a2:1b",
            "net6": "7e:89:d9:c7:e9:8e",
            "net7": "42:8e:a2:a5:5e:e0",
            "net8": "0e:c9:cb:c1:3b:c4",
            "net9": "52:49:3c:5f:78:8c"
        },
        "spine_1_1_10": {
            "net0": "2a:48:88:42:9f:eb",
            "net1": "8a:b4:00:7a:c7:6f",
            "net10": "aa:d7:54:a8:f4:90",
            "net11": "e6:c6:d5:2d:50:55",
            "net12": "da:0f:c4:cd:cc:f5",
            "net13": "f6:7a:8e:8d:ac:9a",
            "net14": "06:d9:dd:d7:e0:51",
            "net15": "72:9a:59:11:90:a5",
            "net16": "32:de:53:7b:58:31",
            "net17": "d2:00:71:2e:12:26",
            "net18": "72:39:68:15:4d:51",
            "net19": "3e:19:99:63:ce:fd",
            "net2": "6e:63:c7:f1:ad:23",
            "net20": "1a:fc:ad:21:a4:42",
            "net21": "0a:41:bf:03:fa:54",
            "net22": "c2:86:5b:1e:69:bd",
            "net23": "c2:c5:2e:b3:69:70",
            "net24": "3a:ad:04:65:57:04",
            "net25": "c2:38:f7:be:17:c0",
            "net26": "c6:6b:41:81:21:89",
            "net27": "c2:ed:28:0c:d8:b2",
            "net28": "5a:0a:f1:d8:83:61",
            "net29": "66:42:62:ab:ff:69",
            "net3": "3e:27:13:54:9e:f7",
            "net30": "b2:f9:e5:92:11:cb",
            "net31": "52:d2:64:12:41:63",
            "net4": "ee:f9:77:d0:b9:6f",
            "net5": "be:bc:bc:15:48:56",
            "net6": "1e:ab:24:79:60:28",
            "net7": "8a:7d:c2:23:72:c2",
            "net8": "3e:cd:7b:98:f5:93",
            "net9": "1a:c5:06:88:5e:10"
        },
        "spine_1_1_11": {
            "net0": "4a:19:4e:f6:b0:2f",
            "net1": "f2:ed:06:73:ea:00",
            "net10": "f6:81:8c:9e:dd:b2",
            "net11": "da:25:b3:b6:b3:03",
            "net12": "8e:6e:c0:59:0b:4d",
            "net13": "7e:83:58:88:c5:3b",
            "net14": "aa:e0:8d:03:14:01",
            "net15": "5e:6f:c5:89:30:9d",
            "net16": "12:90:fb:ff:60:cc",
            "net17": "46:fe:7e:9c:26:c1",
            "net18": "32:74:1a:ae:2e:75",
            "net19": "ee:21:2b:13:ef:f6",
            "net2": "6e:81:4b:80:3e:f8",
            "net20": "7e:d8:d0:7c:91:88",
            "net21": "ea:37:6c:8a:ae:80",
            "net22": "72:13:f5:39:0b:07",
            "net23": "2e:50:08:8e:c7:17",
            "net24": "66:10:36:86:61:0c",
            "net25": "4e:c6:64:0b:12:69",
            "net26": "8a:6f:48:72:93:59",
            "net27": "76:54:ab:6b:63:86",
            "net28": "0a:4e:c2:83:fe:b1",
            "net29": "5a:8d:1d:12:a0:e8",
            "net3": "e2:af:02:bd:d0:5b",
            "net30": "76:32:8e:a2:b6:ca",
            "net31": "4a:70:28:d4:97:bf",
            "net4": "e6:5c:7c:6d:a2:f3",
            "net5": "96:e7:eb:7a:8b:73",
            "net6": "42:64:b4:fa:58:75",
            "net7": "5e:ad:08:51:73:18",
            "net8": "aa:f2:87:0d:50:8f",
            "net9": "0e:1b:6d:e4:46:4c"
        },
        "spine_1_1_12": {
            "net0": "da:a9:eb:ba:d2:f3",
            "net1": "92:d2:93:bb:4c:76",
            "net10": "be:3e:4d:05:97:aa",
            "net11": "8e:bb:29:fc:98:8f",
            "net12": "fa:2b:30:b3:91:5b",
            "net13": "aa:f5:16:5e:76:3b",
            "net14": "ca:d5:2f:a3:8a:bf",
            "net15": "a6:e1:84:52:9e:ea",
            "net16": "a6:08:3b:7a:c8:db",
            "net17": "5a:62:89:71:90:c0",
            "net18": "46:07:72:b4:f9:f2",
            "net19": "ea:b5:e0:c4:a2:27",
            "net2": "9e:2b:8e:e7:cd:e9",
            "net20": "ea:15:6e:02:f1:37",
            "net21": "a2:14:63:36:b0:62",
            "net22": "46:ce:68:e3:11:3b",
            "net23": "4a:09:ca:76:97:05",
            "net24": "82:87:b4:02:0c:87",
            "net25": "02:9b:7d:69:44:61",
            "net26": "4e:9a:ea:d6:6d:c1",
            "net27": "76:4a:8c:bd:98:86",
            "net28": "12:71:27:c4:83:37",
            "net29": "1a:c5:83:f1:d0:c3",
            "net3": "16:bd:91:ed:79:44",
            "net30": "56:0d:15:08:1a:14",
            "net31": "0a:b1:63:61:e9:d5",
            "net4": "2e:cd:5d:8a:84:ab",
            "net5": "8a:4f:56:15:d2:1e",
            "net6": "ca:86:26:18:40:8e",
            "net7": "5a:a6:e6:ce:de:ae",
            "net8": "b6:2b:a2:94:1d:53",
            "net9": "e2:de:0e:dd:96:38"
        },
        "spine_1_1_13": {
            "net0": "d2:3d:f3:17:08:22",
            "net1": "5e:f9:2f:e5:89:23",
            "net10": "ae:13:d3:54:e8:57",
            "net11": "92:cd:1b:fd:b1:fe",
            "net12": "3e:57:5c:f0:48:f2",
            "net13": "62:ba:fb:3c:ab:2c",
            "net14": "62:cf:7d:94:d8:f6",
            "net15": "fa:94:a9:47:40:10",
            "net16": "d2:3c:bf:33:c6:81",
            "net17": "72:33:ea:42:f3:76",
            "net18": "3e:06:c8:36:c6:61",
            "net19": "d2:3a:d2:7e:0a:36",
            "net2": "62:73:c2:22:d7:7c",
            "net20": "5e:50:df:87:df:7a",
            "net21": "5a:b4:1f:f2:af:20",
            "net22": "c6:27:34:38:bd:88",
            "net23": "b6:3d:38:d3:3d:4a",
            "net24": "4a:f4:15:6e:2d:ab",
            "net25": "46:c4:50:3b:24:bf",
            "net26": "9a:76:a7:fc:40:82",
            "net27": "ee:eb:e2:0d:0f:a1",
            "net28": "6e:0e:2a:35:a2:91",
            "net29": "b6:73:ee:4c:36:34",
            "net3": "a2:4d:66:f0:45:02",
            "net30": "c6:5a:f6:4b:d6:de",
            "net31": "7a:ce:1d:37:99:64",
            "net4": "ea:44:74:0c:74:a2",
            "net5": "1e:bc:02:29:6e:c3",
            "net6": "4a:26:67:6a:db:85",
            "net7": "4e:9c:38:d6:80:01",
            "net8": "be:13:db:8b:87:39",
            "net9": "b2:0a:a3:c9:ca:bd"
        },
        "spine_1_1_14": {
            "net0": "5a:a1:9e:5d:78:b1",
            "net1": "ae:b1:ca:18:0e:21",
            "net10": "26:40:a0:ee:87:f7",
            "net11": "56:db:10:13:60:d3",
            "net12": "5e:55:85:d6:e5:24",
            "net13": "46:8e:f3:2f:a4:59",
            "net14": "0e:8b:fb:c5:37:63",
            "net15": "9e:33:db:66:6f:af",
            "net16": "4e:e8:97:07:d3:d4",
            "net17": "ca:55:44:ab:eb:75",
            "net18": "a6:1e:7e:36:2b:e1",
            "net19": "1e:2a:56:a8:c1:6e",
            "net2": "66:0d:a5:95:42:8a",
            "net20": "9a:a3:70:94:bf:bc",
            "net21": "06:54:eb:d9:b4:a1",
            "net22": "12:8a:6a:60:67:6b",
            "net23": "f6:61:c4:49:08:0b",
            "net24": "8a:cd:ce:30:32:a5",
            "net25": "7a:6d:ef:c2:60:6d",
            "net26": "82:e1:9a:2a:b1:96",
            "net27": "c6:f6:48:67:ab:0b",
            "net28": "42:b7:41:19:a8:74",
            "net29": "1e:67:17:c3:62:9e",
            "net3": "3e:93:05:6f:ea:c4",
            "net30": "72:35:2b:8a:c9:2b",
            "net31": "ea:4e:9f:50:4a:1a",
            "net4": "7a:16:16:e1:54:12",
            "net5": "3a:86:ce:f0:36:b5",
            "net6": "9a:e7:36:45:e7:49",
            "net7": "f6:f3:73:7b:3b:42",
            "net8": "4a:8f:b1:60:80:3e",
            "net9": "52:cd:69:84:16:b4"
        },
        "spine_1_1_15": {
            "net0": "32:35:80:e0:73:34",
            "net1": "46:a2:9c:d6:e8:c3",
            "net10": "fa:f9:4e:74:2a:d3",
            "net11": "9e:7d:87:bb:ff:ef",
            "net12": "e2:a2:cd:f9:c7:33",
            "net13": "5a:bc:6e:62:e0:01",
            "net14": "8e:d2:38:ae:5e:b1",
            "net15": "f6:b5:21:ec:ac:a0",
            "net16": "b2:90:cd:e8:d9:83",
            "net17": "8a:10:4a:26:10:68",
            "net18": "86:dd:36:05:10:04",
            "net19": "ea:af:b7:4d:81:4c",
            "net2": "e2:f8:ef:69:6f:10",
            "net20": "f6:2b:4b:9f:07:fb",
            "net21": "5a:17:76:e1:57:0e",
            "net22": "32:71:be:ab:1d:08",
            "net23": "3a:b6:21:5e:f1:be",
            "net24": "4e:ce:97:8b:ec:da",
            "net25": "9e:25:67:5c:1d:8a",
            "net26": "3e:bb:6a:1b:2f:95",
            "net27": "2e:06:1c:2c:dc:bd",
            "net28": "46:34:b0:60:bb:22",
            "net29": "82:a5:fa:90:df:08",
            "net3": "be:33:c6:d3:34:00",
            "net30": "7a:0b:89:aa:d5:4f",
            "net31": "1e:5a:64:54:60:6f",
            "net4": "66:df:7f:2b:b0:b8",
            "net5": "fa:e4:31:e8:aa:23",
            "net6": "72:6b:d6:8f:dd:26",
            "net7": "2a:a9:07:bc:dd:08",
            "net8": "da:96:76:f7:12:98",
            "net9": "d6:46:5c:c7:99:6a"
        },
        "spine_1_1_16": {
            "net0": "3a:8d:5d:f1:63:91",
            "net1": "d2:c9:ed:5b:94:77",
            "net10": "be:df:ab:cf:bb:9e",
            "net11": "d2:22:10:13:d7:a1",
            "net12": "12:b4:67:3b:78:75",
            "net13": "82:39:77:67:2e:ed",
            "net14": "fe:9b:9e:06:90:41",
            "net15": "06:42:9e:a9:83:82",
            "net16": "f6:57:ff:b2:af:90",
            "net17": "0a:f7:b2:45:50:3c",
            "net18": "7e:36:84:cc:8b:1d",
            "net19": "4a:de:b8:7b:48:99",
            "net2": "0a:ef:09:db:58:d5",
            "net20": "1a:67:59:20:e4:29",
            "net21": "96:30:9d:77:99:ec",
            "net22": "6a:1b:0e:78:08:47",
            "net23": "16:8a:df:ce:b0:ef",
            "net24": "16:4a:90:0e:6d:71",
            "net25": "d6:10:ac:7f:d2:b4",
            "net26": "5a:3b:b8:b3:c9:8e",
            "net27": "3e:90:26:fb:07:28",
            "net28": "da:86:b7:61:56:77",
            "net29": "7a:20:a7:bb:c1:dd",
            "net3": "7e:5a:42:d7:78:16",
            "net30": "ca:70:d6:a5:0e:56",
            "net31": "0a:8a:80:99:6d:b7",
            "net4": "2e:34:f2:1c:0e:c9",
            "net5": "f2:bd:ac:4f:a4:45",
            "net6": "0e:9a:97:8d:35:94",
            "net7": "ee:ab:80:3f:98:95",
            "net8": "1a:b3:f2:80:38:58",
            "net9": "52:08:b1:97:69:de"
        },
        "spine_1_1_2": {
            "net0": "52:57:02:de:9c:29",
            "net1": "3e:c3:a0:7c:e9:32",
            "net10": "86:43:51:a6:82:f1",
            "net11": "de:be:17:e3:a5:cd",
            "net12": "02:bd:5f:dd:09:51",
            "net13": "a2:11:e1:dd:bc:fc",
            "net14": "c2:45:7e:c5:ea:4b",
            "net15": "b2:5e:84:20:70:84",
            "net16": "9a:d7:fa:53:7d:70",
            "net17": "6a:ac:a7:b1:92:01",
            "net18": "ae:97:05:3c:b6:22",
            "net19": "82:d0:26:c3:e0:3f",
            "net2": "46:31:bc:cc:38:06",
            "net20": "32:6f:cf:9b:ab:bd",
            "net21": "be:c4:10:13:d2:d4",
            "net22": "0e:61:16:9c:ab:22",
            "net23": "b6:52:c6:29:36:d0",
            "net24": "72:0d:ea:bd:d9:ef",
            "net25": "76:0e:02:03:d8:40",
            "net26": "46:05:2b:3b:82:6d",
            "net27": "0a:6d:4f:c1:98:0c",
            "net28": "1a:75:6f:9f:f0:79",
            "net29": "12:50:a2:57:57:1e",
            "net3": "a6:6d:e2:cf:e0:16",
            "net30": "7a:9e:3d:df:a5:7c",
            "net31": "e2:62:0a:7f:17:25",
            "net4": "82:26:a3:ab:3f:31",
            "net5": "12:cd:f9:d7:8e:1d",
            "net6": "2e:08:23:34:7f:48",
            "net7": "82:fd:4e:60:35:02",
            "net8": "be:3a:5c:db:9f:07",
            "net9": "56:9f:23:6b:b0:30"
        },
        "spine_1_1_3": {
            "net0": "12:3b:dc:ff:d3:37",
            "net1": "da:a7:a7:ad:6a:26",
            "net10": "0a:0a:e6:7e:75:83",
            "net11": "a2:94:9b:e5:5e:5e",
            "net12": "e6:d7:85:74:16:84",
            "net13": "92:61:b5:74:6b:51",
            "net14": "a2:85:f5:64:0f:b2",
            "net15": "ae:ee:d5:4a:a5:f6",
            "net16": "c6:54:40:f5:7c:16",
            "net17": "0e:72:3a:6c:7d:48",
            "net18": "a2:b8:9f:16:59:fd",
            "net19": "ea:7f:87:52:3b:b2",
            "net2": "7a:cb:8d:13:4a:8b",
            "net20": "86:22:f5:18:95:69",
            "net21": "ae:3f:20:4f:d1:de",
            "net22": "4a:c9:5b:f4:43:aa",
            "net23": "7e:44:ab:41:58:7e",
            "net24": "e6:4f:3a:84:ac:ac",
            "net25": "9a:5b:bf:42:b1:05",
            "net26": "3a:32:1b:8b:c1:e1",
            "net27": "0a:86:90:e5:01:9a",
            "net28": "3a:a9:23:e8:f4:b0",
            "net29": "ea:5b:65:95:7f:c2",
            "net3": "0a:a8:e7:72:32:7d",
            "net30": "a2:30:83:cb:b1:68",
            "net31": "ce:15:ad:dc:6e:a4",
            "net4": "ae:9a:f1:0a:51:82",
            "net5": "82:b6:06:36:f2:1f",
            "net6": "ea:ec:2c:2f:8c:3c",
            "net7": "de:2c:3d:3b:30:ad",
            "net8": "1a:f2:60:6e:ce:97",
            "net9": "32:62:b6:00:14:47"
        },
        "spine_1_1_4": {
            "net0": "72:c2:a2:2f:31:13",
            "net1": "2e:bf:df:a1:14:d4",
            "net10": "6e:28:5c:3d:80:af",
            "net11": "02:e8:8a:48:a8:c9",
            "net12": "6a:7f:23:28:2b:4c",
            "net13": "2e:60:94:53:f6:f8",
            "net14": "36:5c:31:53:6b:36",
            "net15": "32:fe:3b:03:98:5a",
            "net16": "46:d5:74:44:a1:c8",
            "net17": "5e:23:f7:8f:33:18",
            "net18": "2e:ad:ad:b6:02:de",
            "net19": "7e:a8:26:24:48:38",
            "net2": "de:bb:4b:e7:3a:d9",
            "net20": "fa:b7:4e:81:45:d8",
            "net21": "fe:bb:39:18:25:f2",
            "net22": "4e:8f:ae:cd:26:24",
            "net23": "4e:41:76:d8:e6:09",
            "net24": "12:f9:4d:8b:5b:d9",
            "net25": "66:bd:a4:c7:aa:bc",
            "net26": "26:88:cd:ff:fc:e2",
            "net27": "1e:e5:b4:03:92:19",
            "net28": "06:67:77:c5:4a:29",
            "net29": "42:46:3f:fd:9c:d1",
            "net3": "1e:b1:43:06:6c:59",
            "net30": "b6:ab:64:a6:0c:b8",
            "net31": "da:2a:a6:27:08:7b",
            "net4": "32:5e:9c:70:f9:26",
            "net5": "3a:23:08:15:03:2e",
            "net6": "aa:2b:e6:a7:5c:b1",
            "net7": "2e:1a:ca:83:3f:b1",
            "net8": "32:b2:32:06:45:f6",
            "net9": "ae:cb:08:e9:c0:2e"
        },
        "spine_1_1_5": {
            "net0": "ca:fc:5c:08:7b:90",
            "net1": "46:5e:52:86:ae:1e",
            "net10": "e6:00:82:8f:80:52",
            "net11": "ce:88:f7:dd:1b:8c",
            "net12": "66:be:cb:89:83:ca",
            "net13": "26:df:67:86:13:58",
            "net14": "72:b8:6f:53:16:4d",
            "net15": "8a:c2:43:42:2a:2f",
            "net16": "4e:c8:62:0d:7c:8c",
            "net17": "2e:44:a6:88:1d:66",
            "net18": "aa:72:84:ae:01:ec",
            "net19": "da:2e:f7:63:d7:3a",
            "net2": "f6:ce:08:ed:10:55",
            "net20": "ae:1c:9e:cd:ea:d5",
            "net21": "a6:9a:30:ba:bd:73",
            "net22": "5e:52:66:e7:91:43",
            "net23": "9e:b6:df:9d:06:e9",
            "net24": "be:ff:eb:22:6c:8b",
            "net25": "86:f0:f8:8c:f1:70",
            "net26": "fe:82:10:d8:59:a6",
            "net27": "4a:8f:b0:bc:fe:76",
            "net28": "86:23:b2:c6:2e:f7",
            "net29": "22:b8:30:0f:37:7d",
            "net3": "ba:cb:83:bd:61:01",
            "net30": "a2:c6:55:aa:a4:cf",
            "net31": "ee:c2:75:f6:b1:e3",
            "net4": "06:c3:5d:7c:8e:13",
            "net5": "0a:ad:8e:6e:1f:53",
            "net6": "4a:76:2b:00:0d:81",
            "net7": "a6:69:48:a5:59:2d",
            "net8": "4e:a5:44:80:52:10",
            "net9": "8e:db:8f:45:00:1b"
        },
        "spine_1_1_6": {
            "net0": "ee:50:58:5a:8b:2d",
            "net1": "6e:e2:31:2b:b5:88",
            "net10": "0a:17:94:d2:d6:05",
            "net11": "82:55:b1:b5:71:79",
            "net12": "b6:81:e3:c1:80:fd",
            "net13": "ee:8d:32:40:44:c6",
            "net14": "be:a6:2b:4a:77:47",
            "net15": "3e:21:9d:9f:fb:44",
            "net16": "ae:75:1d:17:3c:42",
            "net17": "e6:64:7b:0f:7b:4b",
            "net18": "aa:4f:73:17:38:15",
            "net19": "f6:62:5a:bd:6f:a2",
            "net2": "16:c4:61:9e:d4:e0",
            "net20": "92:ff:a7:c7:d1:bf",
            "net21": "3e:f3:0f:d3:53:9b",
            "net22": "72:b2:d1:44:14:1d",
            "net23": "9e:00:18:50:c0:b5",
            "net24": "96:a3:d0:61:02:51",
            "net25": "16:ba:f0:fd:bc:9a",
            "net26": "52:25:15:cf:33:d6",
            "net27": "ae:6e:4a:bb:b9:ab",
            "net28": "da:91:55:a0:ee:e0",
            "net29": "fa:1f:03:74:19:f0",
            "net3": "be:d0:ee:05:79:66",
            "net30": "76:67:6f:63:71:17",
            "net31": "b2:79:d4:4b:13:5c",
            "net4": "9a:b5:85:e9:a3:43",
            "net5": "aa:43:07:ac:61:bf",
            "net6": "0e:ae:23:6a:e5:d9",
            "net7": "1e:b6:65:aa:a5:67",
            "net8": "4a:be:13:a7:95:a5",
            "net9": "02:15:ff:14:0e:67"
        },
        "spine_1_1_7": {
            "net0": "96:06:67:e5:75:7d",
            "net1": "62:55:fe:8d:cc:86",
            "net10": "ea:e0:b4:91:8c:27",
            "net11": "ce:4d:b1:48:a7:4c",
            "net12": "3e:1c:7e:1d:a8:8a",
            "net13": "8e:d8:98:25:6e:fa",
            "net14": "0e:6b:5e:7f:0e:d0",
            "net15": "ee:06:03:83:cb:56",
            "net16": "42:2a:c3:3a:fa:5e",
            "net17": "5e:e4:38:db:9d:87",
            "net18": "76:b7:8c:96:72:01",
            "net19": "22:5a:39:a8:5f:09",
            "net2": "2a:aa:50:71:71:e4",
            "net20": "86:05:35:0c:e9:09",
            "net21": "26:84:9d:16:15:56",
            "net22": "92:d9:88:e0:ee:b4",
            "net23": "ae:58:02:32:14:07",
            "net24": "6a:df:6e:46:e1:13",
            "net25": "a6:93:51:e0:28:f0",
            "net26": "4a:4c:9d:62:0d:a9",
            "net27": "06:54:a3:e0:98:8b",
            "net28": "32:87:87:8e:09:c8",
            "net29": "4e:5c:72:0e:ff:76",
            "net3": "e2:19:24:e6:59:36",
            "net30": "c6:ce:44:c9:3f:ba",
            "net31": "aa:2a:72:f1:94:b6",
            "net4": "76:c6:8f:ff:01:20",
            "net5": "46:e5:48:db:7d:72",
            "net6": "d6:80:c6:f9:9f:a5",
            "net7": "4a:e6:5a:06:24:e2",
            "net8": "2a:8e:ae:04:33:c6",
            "net9": "72:68:cc:2e:ad:00"
        },
        "spine_1_1_8": {
            "net0": "5a:15:50:1a:d4:b3",
            "net1": "b2:87:ca:12:fe:4b",
            "net10": "7a:d1:a7:d9:39:bc",
            "net11": "f6:97:4f:11:1c:f6",
            "net12": "d2:45:f3:07:c5:1b",
            "net13": "9e:18:86:5e:a9:87",
            "net14": "de:2b:88:ff:b5:7a",
            "net15": "e2:23:83:a8:fd:a8",
            "net16": "fe:a4:2e:e8:26:b6",
            "net17": "f2:f8:3f:dc:2c:84",
            "net18": "46:08:86:95:19:04",
            "net19": "f6:4d:54:c6:68:9b",
            "net2": "fe:68:1c:70:ab:56",
            "net20": "42:bc:85:83:45:b5",
            "net21": "1e:34:f2:cb:87:a4",
            "net22": "0a:8d:fa:ff:fc:5e",
            "net23": "56:ae:c4:2d:12:6b",
            "net24": "12:17:d6:21:3a:34",
            "net25": "42:ae:7a:7e:a7:21",
            "net26": "ae:6a:32:80:5d:db",
            "net27": "d2:ed:3b:15:34:6a",
            "net28": "32:84:3a:f5:c8:5a",
            "net29": "b2:8c:b6:01:32:62",
            "net3": "9a:18:8d:a5:30:a7",
            "net30": "02:f1:95:fe:3c:0c",
            "net31": "2e:6b:1b:04:2c:92",
            "net4": "82:28:d7:3b:97:42",
            "net5": "ce:9c:4c:c8:6c:60",
            "net6": "0e:5f:5c:b7:4e:71",
            "net7": "8e:31:5c:bc:b1:c7",
            "net8": "5a:45:a5:90:f8:e6",
            "net9": "a2:be:8c:76:d5:32"
        },
        "spine_1_1_9": {
            "net0": "d6:42:82:ba:9f:33",
            "net1": "c6:12:f6:b3:e7:78",
            "net10": "e6:7b:2d:02:0f:d0",
            "net11": "86:a6:e2:2d:80:02",
            "net12": "b2:de:0e:49:d4:e9",
            "net13": "5e:ef:96:ff:91:a9",
            "net14": "2a:a9:c7:af:cb:25",
            "net15": "be:b7:63:06:fc:5f",
            "net16": "1e:3b:59:65:2b:a0",
            "net17": "aa:c4:10:8b:0a:ff",
            "net18": "56:4b:73:05:bd:e9",
            "net19": "32:65:31:12:05:d7",
            "net2": "36:1f:06:ac:a4:6a",
            "net20": "ae:de:ee:97:8c:66",
            "net21": "1a:13:16:7d:7e:f6",
            "net22": "ae:cd:10:58:46:44",
            "net23": "9a:27:5b:53:67:51",
            "net24": "16:95:aa:46:c3:71",
            "net25": "16:3f:42:7c:34:57",
            "net26": "16:39:ab:56:e5:a4",
            "net27": "b6:10:94:63:c0:02",
            "net28": "f2:a8:20:de:fa:76",
            "net29": "62:8d:7e:50:d4:63",
            "net3": "9e:a9:41:ed:21:5a",
            "net30": "de:7c:c2:a3:e9:20",
            "net31": "4e:63:19:c1:ca:87",
            "net4": "ee:35:d5:ce:ad:c2",
            "net5": "1a:b1:a9:1b:50:71",
            "net6": "8e:ee:93:08:3d:3b",
            "net7": "b2:eb:4f:56:41:80",
            "net8": "de:de:0b:38:fc:b8",
            "net9": "4a:06:43:c9:c4:03"
        },
        "spine_2_1_1": {
            "net0": "02:dd:e3:06:dd:06",
            "net1": "5e:56:9b:30:b0:96",
            "net10": "96:79:b1:79:a8:7a",
            "net11": "2a:29:fc:16:9e:be",
            "net12": "16:a5:ea:fe:60:26",
            "net13": "ee:04:0f:63:ce:fa",
            "net14": "4a:37:e1:8d:0a:f3",
            "net15": "6e:01:30:f5:cd:46",
            "net16": "a6:f8:8e:2c:77:3b",
            "net17": "9e:2c:af:ce:30:5a",
            "net18": "9e:29:3c:1f:ce:82",
            "net19": "ea:e5:4a:76:37:9d",
            "net2": "42:b6:bb:6c:65:9a",
            "net20": "f2:71:30:1e:df:17",
            "net21": "2a:06:a5:12:05:d1",
            "net22": "52:28:6b:b3:59:a5",
            "net23": "b2:34:75:41:4e:4f",
            "net24": "ba:7b:2a:9f:89:0c",
            "net25": "36:ff:ec:5d:20:28",
            "net26": "e6:27:05:17:87:84",
            "net27": "e2:84:48:b6:fd:25",
            "net28": "ae:d0:b4:c8:7b:be",
            "net29": "12:20:8a:8f:45:40",
            "net3": "ae:c0:d2:f8:e7:f1",
            "net30": "da:d6:89:b5:02:69",
            "net31": "5a:fc:4c:7b:e9:78",
            "net4": "ee:a5:22:3c:a0:ee",
            "net5": "8e:04:81:97:20:bd",
            "net6": "1a:cf:5f:fa:1d:96",
            "net7": "c2:2c:ee:eb:5a:1d",
            "net8": "72:aa:02:30:2a:e6",
            "net9": "de:6a:df:c9:3c:f2"
        },
        "spine_2_1_10": {
            "net0": "7e:f5:95:17:1a:34",
            "net1": "92:c8:d8:52:75:97",
            "net10": "56:aa:47:bd:27:1d",
            "net11": "12:fe:a8:2d:4d:5c",
            "net12": "aa:bb:bf:3b:c8:ae",
            "net13": "3e:61:b8:b4:f4:3e",
            "net14": "92:77:14:4e:83:56",
            "net15": "aa:53:49:76:e4:87",
            "net16": "f6:39:e2:19:26:8e",
            "net17": "f6:bc:11:89:b5:27",
            "net18": "62:e3:94:46:29:4c",
            "net19": "22:c7:58:71:c0:32",
            "net2": "26:33:eb:07:ac:c0",
            "net20": "8e:25:89:d8:0a:b3",
            "net21": "d2:01:92:38:06:a7",
            "net22": "ba:e6:01:d4:6f:d8",
            "net23": "66:d2:d1:8c:49:ff",
            "net24": "5e:fc:6c:4f:57:2c",
            "net25": "06:f3:12:3d:5c:e0",
            "net26": "ce:7a:5a:d1:70:e4",
            "net27": "82:e8:c5:2e:4e:47",
            "net28": "12:f0:9d:8f:0b:87",
            "net29": "96:a6:0a:4e:03:2e",
            "net3": "b2:d5:ab:3c:d6:89",
            "net30": "c6:8c:c6:f6:ee:f8",
            "net31": "66:6e:26:9f:d5:21",
            "net4": "f2:15:22:c2:db:d9",
            "net5": "02:81:d5:67:a9:e5",
            "net6": "32:58:29:a8:2f:ba",
            "net7": "1e:b2:e4:a1:28:9f",
            "net8": "3e:4a:64:ab:1d:3e",
            "net9": "ee:ae:85:93:0c:8b"
        },
        "spine_2_1_11": {
            "net0": "f6:0b:d1:da:de:6a",
            "net1": "d6:a7:72:8e:34:d2",
            "net10": "02:a5:43:aa:0a:11",
            "net11": "ee:47:c8:ed:04:f9",
            "net12": "5a:40:73:5c:f2:db",
            "net13": "b2:69:49:8f:4c:24",
            "net14": "06:19:ee:e2:37:af",
            "net15": "a6:1e:eb:c5:41:1d",
            "net16": "22:b6:fe:75:a7:64",
            "net17": "6a:bf:4c:99:76:f5",
            "net18": "de:13:a9:07:6a:db",
            "net19": "ba:95:42:d8:ba:53",
            "net2": "16:2a:27:d2:ab:09",
            "net20": "ae:ad:34:b8:f4:56",
            "net21": "92:af:3c:1b:93:72",
            "net22": "e2:ec:54:e9:5c:dc",
            "net23": "1a:e9:66:60:11:2b",
            "net24": "06:86:63:68:3b:f2",
            "net25": "1e:e6:bb:57:da:bc",
            "net26": "f2:92:ed:19:57:b0",
            "net27": "36:65:24:76:db:69",
            "net28": "da:8c:51:3c:90:a9",
            "net29": "6a:00:64:3d:c8:0e",
            "net3": "ea:7a:a6:66:02:18",
            "net30": "0e:db:03:09:ce:05",
            "net31": "5e:bf:47:d6:bf:0f",
            "net4": "d6:0f:4c:b5:30:d0",
            "net5": "12:b2:41:72:91:1b",
            "net6": "36:a3:d7:14:ac:e9",
            "net7": "d6:4a:13:47:bd:8f",
            "net8": "e2:c2:5e:13:ff:5f",
            "net9": "26:35:d5:f6:42:e8"
        },
        "spine_2_1_12": {
            "net0": "52:51:35:05:50:21",
            "net1": "4a:64:3b:94:50:a3",
            "net10": "fe:e8:34:43:10:e4",
            "net11": "aa:65:4d:fe:49:6a",
            "net12": "de:fc:e5:56:0d:c3",
            "net13": "3e:0b:ab:ff:32:71",
            "net14": "9a:3f:03:8a:77:c1",
            "net15": "2e:df:b1:da:b6:75",
            "net16": "3a:5a:59:a8:cb:21",
            "net17": "76:42:c5:70:55:80",
            "net18": "8e:f9:50:f8:70:9c",
            "net19": "fe:1e:50:7e:cb:28",
            "net2": "f6:16:b9:c3:10:52",
            "net20": "46:e2:41:69:f6:23",
            "net21": "02:c9:c3:7e:dc:4e",
            "net22": "fe:81:ca:56:36:46",
            "net23": "7a:63:97:bf:c7:78",
            "net24": "b6:56:45:65:a5:ab",
            "net25": "1e:0b:d0:a2:dd:1d",
            "net26": "2e:7b:a6:66:d5:be",
            "net27": "1e:d0:62:72:bd:b1",
            "net28": "7a:77:da:81:50:83",
            "net29": "82:c7:5c:ec:90:d1",
            "net3": "fe:6d:f7:df:60:77",
            "net30": "76:22:48:98:71:8d",
            "net31": "ca:4f:56:3c:f7:7b",
            "net4": "96:f7:f7:fd:d3:b6",
            "net5": "8e:4f:3f:7c:d5:3e",
            "net6": "d2:5f:4c:55:32:b7",
            "net7": "ae:0f:ca:17:45:c8",
            "net8": "ce:c3:04:b0:1f:9b",
            "net9": "da:87:67:c7:9d:1f"
        },
        "spine_2_1_13": {
            "net0": "c6:ee:7e:75:45:2c",
            "net1": "4e:5e:f0:f7:f7:15",
            "net10": "62:32:54:d2:70:10",
            "net11": "1a:9d:35:ac:99:fd",
            "net12": "5e:a5:0e:c2:8e:1d",
            "net13": "fe:02:02:86:73:08",
            "net14": "96:c6:19:79:95:3f",
            "net15": "86:10:97:97:1f:6d",
            "net16": "d2:3a:29:35:5d:b8",
            "net17": "16:54:62:c7:5c:e1",
            "net18": "4e:93:a9:55:54:48",
            "net19": "ca:25:b7:23:88:47",
            "net2": "be:06:4a:e8:c2:31",
            "net20": "4e:79:ad:dd:0a:0f",
            "net21": "de:cc:40:0a:80:f0",
            "net22": "7e:d3:1c:69:94:28",
            "net23": "76:21:f0:cd:34:07",
            "net24": "d6:d3:91:44:71:70",
            "net25": "16:74:47:c3:06:7c",
            "net26": "32:b1:fe:5c:96:79",
            "net27": "f6:b1:ab:86:61:29",
            "net28": "86:54:e6:74:39:d8",
            "net29": "46:95:2d:68:3a:bb",
            "net3": "6e:07:bd:10:71:75",
            "net30": "5e:84:5a:59:59:f4",
            "net31": "0e:f7:ea:58:fd:ed",
            "net4": "02:7c:64:00:c0:2b",
            "net5": "9e:a6:7e:d2:cc:c3",
            "net6": "de:e6:da:d8:fd:4d",
            "net7": "16:6e:85:5f:5a:3c",
            "net8": "f6:37:de:0b:49:9a",
            "net9": "62:22:30:80:97:76"
        },
        "spine_2_1_14": {
            "net0": "d2:0b:1e:f8:ea:16",
            "net1": "5a:1c:33:b8:d0:6c",
            "net10": "82:68:d2:87:7e:37",
            "net11": "ea:e9:c1:73:6f:d2",
            "net12": "7a:e1:dc:a4:2a:86",
            "net13": "7a:71:84:08:dd:1c",
            "net14": "fe:37:f4:5f:96:2c",
            "net15": "be:60:62:8a:9d:64",
            "net16": "32:1b:6d:d5:26:bb",
            "net17": "56:4b:f6:45:cd:2f",
            "net18": "92:3d:6c:c0:ef:ff",
            "net19": "6e:a4:65:12:87:7f",
            "net2": "7a:25:d7:67:96:37",
            "net20": "c6:64:8a:c5:7b:5d",
            "net21": "62:c0:11:63:d2:62",
            "net22": "46:38:fb:2c:49:50",
            "net23": "aa:02:b4:1f:27:fd",
            "net24": "4a:12:55:16:61:9f",
            "net25": "6a:4a:77:4f:60:b0",
            "net26": "26:5f:df:20:6f:fc",
            "net27": "5a:0d:64:aa:03:f0",
            "net28": "f2:ff:78:27:9b:18",
            "net29": "92:23:33:fe:7c:51",
            "net3": "e6:51:0b:ea:c3:c1",
            "net30": "92:c6:ef:ce:ca:eb",
            "net31": "4a:86:53:40:1a:65",
            "net4": "36:70:d7:2a:ea:02",
            "net5": "ea:91:a8:fb:a4:c9",
            "net6": "ee:b2:86:1d:6b:71",
            "net7": "9a:7b:10:3c:41:f1",
            "net8": "be:7b:29:01:fe:49",
            "net9": "ca:fb:92:c9:12:3e"
        },
        "spine_2_1_15": {
            "net0": "1a:cb:db:1a:61:5c",
            "net1": "52:6c:b1:dd:bf:b6",
            "net10": "da:b5:c3:0b:55:8f",
            "net11": "9a:f1:ce:d5:61:a2",
            "net12": "92:5d:56:03:98:16",
            "net13": "ea:ab:71:5c:a2:39",
            "net14": "5e:4c:9a:96:4b:2d",
            "net15": "8a:f1:9b:2f:ee:82",
            "net16": "62:53:c0:59:e6:1f",
            "net17": "ee:89:af:c8:37:4a",
            "net18": "1a:4a:7e:ca:c2:3a",
            "net19": "ae:b4:ac:07:97:fb",
            "net2": "0e:3b:14:52:e5:0d",
            "net20": "f2:d4:3a:bd:8e:dc",
            "net21": "4a:14:49:3a:22:96",
            "net22": "b2:cc:6e:b0:87:ce",
            "net23": "d6:22:ce:15:45:0e",
            "net24": "96:65:8c:4f:e1:08",
            "net25": "6e:12:eb:dc:96:1a",
            "net26": "1e:77:aa:cc:57:c9",
            "net27": "6a:d2:65:95:25:57",
            "net28": "56:57:72:ed:60:28",
            "net29": "d6:78:c5:cf:94:09",
            "net3": "0a:c0:fb:36:e5:a5",
            "net30": "b2:db:b4:51:2b:96",
            "net31": "8e:bd:7f:89:a1:5e",
            "net4": "aa:7c:fc:17:c8:5c",
            "net5": "ca:9e:04:2b:77:49",
            "net6": "2a:73:67:58:95:47",
            "net7": "26:23:14:0f:9e:6e",
            "net8": "f2:45:b0:2e:3c:50",
            "net9": "7a:10:06:7d:bc:bf"
        },
        "spine_2_1_16": {
            "net0": "6a:29:52:e4:ea:d7",
            "net1": "1e:90:67:69:6c:81",
            "net10": "2a:ed:ee:9b:57:e7",
            "net11": "a2:8f:93:6d:45:88",
            "net12": "d2:36:cf:c8:e5:0b",
            "net13": "6e:3b:62:3e:41:9f",
            "net14": "f2:cc:b4:6c:c8:1f",
            "net15": "2a:a8:cb:60:84:1f",
            "net16": "d6:29:cb:5c:00:52",
            "net17": "3e:ee:3d:e1:a6:61",
            "net18": "12:1a:ea:bc:6c:0c",
            "net19": "be:40:96:3b:16:28",
            "net2": "7e:40:d9:f5:20:0c",
            "net20": "4e:9b:10:54:df:5c",
            "net21": "52:3e:a5:57:ef:60",
            "net22": "a2:bc:8a:17:13:a9",
            "net23": "56:16:ad:6e:74:fc",
            "net24": "2a:1f:cf:6f:6e:62",
            "net25": "0e:e4:c5:80:54:0c",
            "net26": "22:a9:db:63:8f:dd",
            "net27": "92:d1:16:84:14:ff",
            "net28": "c2:77:26:9f:a0:21",
            "net29": "c6:77:f5:27:a4:8c",
            "net3": "0e:e4:41:03:1c:ea",
            "net30": "52:28:3a:50:5a:95",
            "net31": "7a:6b:45:88:b0:d3",
            "net4": "b2:28:ae:05:4e:77",
            "net5": "1a:da:81:be:aa:19",
            "net6": "a2:e8:fd:1b:a9:31",
            "net7": "32:10:fc:7b:8f:9c",
            "net8": "16:aa:e5:21:11:c5",
            "net9": "32:04:4f:a9:cd:d2"
        },
        "spine_2_1_2": {
            "net0": "82:c3:ef:1f:4c:3b",
            "net1": "5a:9d:a0:85:71:85",
            "net10": "86:06:44:6a:76:0b",
            "net11": "ea:1e:1c:d3:15:c3",
            "net12": "22:84:5b:21:d8:c2",
            "net13": "ae:c1:ee:ce:1b:f7",
            "net14": "7a:43:03:c4:f3:c5",
            "net15": "26:f2:d2:17:a6:09",
            "net16": "ea:c0:ce:37:82:41",
            "net17": "de:e6:19:87:f1:c6",
            "net18": "3e:b7:19:f9:8a:b1",
            "net19": "0a:2b:73:e1:c1:c4",
            "net2": "aa:b9:c9:10:ac:3d",
            "net20": "56:cf:e5:27:ad:27",
            "net21": "32:23:1c:49:d6:d6",
            "net22": "62:0e:79:5f:43:bc",
            "net23": "8e:c9:0e:4d:f2:98",
            "net24": "82:0d:1a:f6:1f:cc",
            "net25": "7a:86:d3:16:3a:4b",
            "net26": "4a:31:a7:c1:8f:8a",
            "net27": "1e:9f:3e:b4:53:a9",
            "net28": "c2:35:de:ec:4a:36",
            "net29": "e6:39:85:24:ea:f5",
            "net3": "fe:2e:cc:49:3a:62",
            "net30": "0e:5a:ca:a1:df:16",
            "net31": "3e:54:e0:b8:c1:04",
            "net4": "a6:e1:82:32:3f:b5",
            "net5": "ba:01:b2:26:b1:1a",
            "net6": "d2:26:81:5f:45:5c",
            "net7": "aa:91:14:a3:06:a2",
            "net8": "12:43:c4:35:28:91",
            "net9": "be:87:c3:49:90:12"
        },
        "spine_2_1_3": {
            "net0": "ce:b5:48:15:d9:c0",
            "net1": "9a:fe:ea:8f:55:f6",
            "net10": "5a:84:99:b5:4d:bd",
            "net11": "96:87:f4:9d:30:a1",
            "net12": "b2:f4:26:48:03:99",
            "net13": "66:a3:a1:fc:02:5d",
            "net14": "26:d1:7e:81:dd:c0",
            "net15": "aa:2c:b9:67:f9:79",
            "net16": "62:44:66:0d:ca:2b",
            "net17": "52:db:31:05:22:dc",
            "net18": "ce:0f:18:c9:7b:89",
            "net19": "ea:9c:19:ac:d9:28",
            "net2": "9e:8d:01:71:8c:f8",
            "net20": "6e:ee:55:f8:c1:26",
            "net21": "ce:a0:8e:3d:80:60",
            "net22": "6a:8e:a3:f3:db:58",
            "net23": "ea:f6:50:81:d0:7a",
            "net24": "ee:f5:d9:d6:51:70",
            "net25": "52:1d:a5:0d:91:e7",
            "net26": "6e:52:9e:d0:60:04",
            "net27": "02:66:01:e0:5e:09",
            "net28": "0e:c6:dd:90:5a:38",
            "net29": "7a:29:e5:a4:f5:1f",
            "net3": "62:4e:08:81:17:d1",
            "net30": "7e:2e:39:cc:8f:4f",
            "net31": "16:a6:60:d4:91:03",
            "net4": "9a:f7:6c:0b:e1:60",
            "net5": "4a:72:9a:4f:f1:5d",
            "net6": "42:bf:87:cd:5c:23",
            "net7": "2a:3c:11:53:33:08",
            "net8": "e6:91:f1:67:d0:c9",
            "net9": "da:13:fd:18:93:76"
        },
        "spine_2_1_4": {
            "net0": "8e:e8:bc:61:c8:7d",
            "net1": "0a:59:13:b5:ab:d6",
            "net10": "fa:f8:c1:03:26:c1",
            "net11": "42:fd:a4:e8:ec:c4",
            "net12": "52:4f:01:2a:8b:dd",
            "net13": "46:20:ca:76:df:b2",
            "net14": "d6:99:93:3b:d0:60",
            "net15": "02:c8:ca:10:b3:24",
            "net16": "26:36:d3:0a:04:01",
            "net17": "22:89:86:81:98:41",
            "net18": "1a:ba:c6:ad:bd:32",
            "net19": "92:08:4c:60:62:3a",
            "net2": "de:98:83:04:f2:3a",
            "net20": "2e:ec:4e:4c:a5:4d",
            "net21": "a2:a8:d9:14:c9:7b",
            "net22": "2a:25:bc:ac:61:30",
            "net23": "4e:83:17:dc:2f:15",
            "net24": "62:eb:66:b4:bb:05",
            "net25": "1e:5d:01:b0:1b:56",
            "net26": "3a:43:d7:3c:4b:1c",
            "net27": "96:7f:25:3c:9e:f4",
            "net28": "c2:07:41:be:b1:6d",
            "net29": "d6:76:f8:1f:0e:94",
            "net3": "56:b2:44:ae:15:3a",
            "net30": "56:51:af:ca:8f:99",
            "net31": "ae:cf:81:3a:e3:99",
            "net4": "7e:bc:1d:ca:3b:39",
            "net5": "82:bf:f2:dd:37:05",
            "net6": "56:09:ea:26:60:e1",
            "net7": "0a:59:8d:a9:01:46",
            "net8": "22:f4:17:e4:c2:2e",
            "net9": "ba:6f:4a:42:02:e9"
        },
        "spine_2_1_5": {
            "net0": "f2:c6:18:b3:88:87",
            "net1": "da:fa:f2:a1:df:de",
            "net10": "16:5d:f5:c6:ff:b2",
            "net11": "4a:21:84:a2:fe:76",
            "net12": "1a:af:bd:bc:8d:25",
            "net13": "76:c2:2c:bb:fc:92",
            "net14": "86:c7:41:ec:b9:b4",
            "net15": "3e:07:9e:dc:42:1c",
            "net16": "0a:a5:58:a5:8b:cb",
            "net17": "26:27:ef:d7:0b:b1",
            "net18": "e6:ba:21:7a:5b:39",
            "net19": "92:8f:4a:08:f3:c0",
            "net2": "8e:01:63:5b:63:9c",
            "net20": "aa:ad:99:38:fa:0d",
            "net21": "4e:a5:82:52:88:22",
            "net22": "82:dd:3d:f0:2c:36",
            "net23": "2a:60:91:48:ef:19",
            "net24": "22:39:28:4a:77:1c",
            "net25": "3e:53:7f:35:40:d5",
            "net26": "12:69:94:81:82:57",
            "net27": "b2:70:fd:84:56:54",
            "net28": "36:36:ab:47:38:c5",
            "net29": "7a:b9:e8:ff:1a:1a",
            "net3": "06:46:4b:01:b6:41",
            "net30": "1a:00:04:fe:b6:b5",
            "net31": "32:86:0f:93:22:01",
            "net4": "fa:bc:e7:22:67:b9",
            "net5": "ae:d0:3e:15:04:b4",
            "net6": "ca:33:e6:44:9c:05",
            "net7": "26:7a:77:8d:87:34",
            "net8": "ea:97:34:2d:69:4d",
            "net9": "1e:03:a5:29:de:88"
        },
        "spine_2_1_6": {
            "net0": "66:8c:0a:f2:c2:5b",
            "net1": "16:ae:dc:76:9b:5b",
            "net10": "26:e6:ee:ee:ce:78",
            "net11": "06:cf:b9:64:7f:36",
            "net12": "02:0f:95:e1:09:c3",
            "net13": "36:1b:bb:ef:f0:f0",
            "net14": "ba:6b:80:94:8d:ea",
            "net15": "fe:7d:af:14:56:58",
            "net16": "9a:e8:1a:59:f5:50",
            "net17": "16:35:cc:2e:ef:2b",
            "net18": "de:b3:88:3a:91:f0",
            "net19": "f6:ba:1d:cf:36:1b",
            "net2": "de:e2:9c:81:75:58",
            "net20": "c2:70:1b:4b:05:67",
            "net21": "e2:d4:a2:5c:c3:1d",
            "net22": "fe:0d:f1:96:98:77",
            "net23": "62:6a:83:9b:a1:fd",
            "net24": "ee:47:8c:65:e9:89",
            "net25": "26:70:10:9a:9b:5a",
            "net26": "2e:db:68:03:e6:f0",
            "net27": "ba:44:7b:fa:15:58",
            "net28": "22:4c:37:7c:12:6f",
            "net29": "76:38:47:7b:3f:58",
            "net3": "9a:d6:f1:bd:9d:34",
            "net30": "2a:a6:44:bf:4e:5c",
            "net31": "16:78:52:ca:72:e7",
            "net4": "f2:c4:f1:0b:bf:94",
            "net5": "52:13:02:6c:36:58",
            "net6": "4e:88:e8:38:02:fc",
            "net7": "16:71:52:f5:eb:01",
            "net8": "56:9a:34:69:87:e6",
            "net9": "3e:f2:eb:4c:75:74"
        },
        "spine_2_1_7": {
            "net0": "b6:12:ec:60:2f:4b",
            "net1": "6e:dd:b4:30:81:5a",
            "net10": "9a:6b:07:03:7c:2f",
            "net11": "c2:b1:ff:57:e0:c1",
            "net12": "d2:c9:5f:e7:10:bb",
            "net13": "76:e0:a3:91:e3:54",
            "net14": "06:18:77:c4:b0:93",
            "net15": "da:79:ac:73:dc:25",
            "net16": "ee:0c:24:bb:db:b6",
            "net17": "de:c0:73:e4:d6:c4",
            "net18": "c2:bd:c8:98:37:ab",
            "net19": "3a:71:d4:f0:35:dc",
            "net2": "32:f9:63:94:3f:f0",
            "net20": "fe:58:97:c1:db:55",
            "net21": "f2:75:1f:76:2d:b2",
            "net22": "26:e4:45:bb:2e:a8",
            "net23": "0a:ca:27:65:63:65",
            "net24": "36:f4:c9:7f:b2:5c",
            "net25": "16:ac:be:fc:e3:58",
            "net26": "d6:65:09:62:69:b2",
            "net27": "02:c5:9e:e7:2f:10",
            "net28": "76:f8:c2:5f:17:7e",
            "net29": "aa:d7:76:6f:7e:10",
            "net3": "ea:ce:19:bb:4b:77",
            "net30": "b6:94:08:91:f8:55",
            "net31": "82:0f:93:c1:66:29",
            "net4": "ee:18:49:a4:8d:2c",
            "net5": "4e:19:98:df:1c:06",
            "net6": "da:71:be:85:6d:0d",
            "net7": "4a:6d:43:e3:80:39",
            "net8": "ea:3a:47:09:d9:64",
            "net9": "ba:33:db:1e:fb:b1"
        },
        "spine_2_1_8": {
            "net0": "f6:ac:8e:b0:23:8b",
            "net1": "c6:2d:8a:5d:8a:46",
            "net10": "ba:7d:e8:3d:7e:27",
            "net11": "46:55:d9:9a:4d:94",
            "net12": "16:a0:4a:fb:14:6e",
            "net13": "5e:ae:b9:2d:2e:dc",
            "net14": "ea:30:cb:db:4b:d9",
            "net15": "ca:48:aa:e7:d6:94",
            "net16": "d2:e8:e3:b7:3e:4e",
            "net17": "2a:c5:58:73:0d:65",
            "net18": "36:a7:49:84:e7:89",
            "net19": "96:87:cc:5a:b5:3b",
            "net2": "ce:98:c8:8f:48:b9",
            "net20": "be:85:15:7f:84:fb",
            "net21": "3a:41:6d:90:f0:97",
            "net22": "42:14:b4:34:d6:22",
            "net23": "26:56:24:84:81:75",
            "net24": "4e:4a:04:9e:ad:a1",
            "net25": "ea:29:d7:49:23:1a",
            "net26": "36:03:3c:34:86:7d",
            "net27": "ce:e9:fd:1f:49:fa",
            "net28": "ba:54:ef:1f:08:f5",
            "net29": "d2:13:54:49:25:35",
            "net3": "b2:32:d9:22:30:04",
            "net30": "f2:5e:8c:16:9b:75",
            "net31": "e2:9d:d6:44:49:59",
            "net4": "a6:e3:be:54:af:1e",
            "net5": "5e:e9:c0:16:e5:eb",
            "net6": "1a:83:a1:12:5d:fa",
            "net7": "82:e4:7b:d4:17:59",
            "net8": "86:62:39:f3:07:46",
            "net9": "0a:de:46:79:dd:4c"
        },
        "spine_2_1_9": {
            "net0": "b2:f2:40:11:af:20",
            "net1": "b6:cb:8d:fc:dd:81",
            "net10": "f2:79:f2:da:29:03",
            "net11": "ee:42:0d:81:ee:49",
            "net12": "8a:c8:cd:6a:69:d8",
            "net13": "6e:24:03:ff:36:f0",
            "net14": "b6:96:d3:e5:84:83",
            "net15": "fe:8c:88:66:73:38",
            "net16": "d2:d5:fa:40:cb:d6",
            "net17": "e2:1c:72:6c:70:af",
            "net18": "26:e3:52:5a:31:ac",
            "net19": "06:59:c6:6a:8f:43",
            "net2": "ee:2a:5b:c0:f4:25",
            "net20": "66:68:97:e6:5d:6b",
            "net21": "32:86:60:39:a6:a7",
            "net22": "56:35:63:8a:29:43",
            "net23": "6e:a8:9b:4a:41:b8",
            "net24": "fa:fd:b4:f1:68:9e",
            "net25": "7e:3d:cb:4a:a9:e8",
            "net26": "d2:65:78:9b:dc:ea",
            "net27": "96:45:06:b6:58:8d",
            "net28": "7a:88:57:04:77:74",
            "net29": "72:bb:0b:81:20:30",
            "net3": "ee:5f:68:cf:6f:0b",
            "net30": "16:ec:dd:65:17:eb",
            "net31": "e6:35:19:a9:76:a4",
            "net4": "fa:3c:44:5c:3f:e8",
            "net5": "ea:db:dd:6d:ed:12",
            "net6": "7e:dc:3c:d0:29:28",
            "net7": "fe:26:9d:0f:3b:56",
            "net8": "5e:73:e6:91:8c:bb",
            "net9": "f2:f2:a0:39:d0:6b"
        },
        "tof_1_2_1": {
            "net0": "aa:79:fe:ed:b6:d4",
            "net1": "32:a5:b0:46:8a:28",
            "net10": "8e:d5:3b:65:ca:2f",
            "net11": "52:4e:d6:7d:ec:9b",
            "net12": "fa:d1:41:ca:8d:0b",
            "net13": "9a:a8:20:e9:61:88",
            "net14": "1e:14:09:bd:1f:28",
            "net15": "72:06:63:11:36:a2",
            "net16": "06:2a:17:02:ba:8c",
            "net17": "12:58:d6:05:8d:77",
            "net18": "5a:18:da:11:8a:87",
            "net19": "06:59:43:5e:ec:d2",
            "net2": "a6:f1:09:c4:51:89",
            "net20": "0a:d8:85:8d:7c:e8",
            "net21": "42:77:55:99:84:ce",
            "net22": "1e:23:68:d6:64:2f",
            "net23": "5e:33:91:51:42:98",
            "net24": "b2:a2:f1:90:37:48",
            "net25": "0a:0a:04:d3:e8:78",
            "net26": "6e:17:16:7f:96:96",
            "net27": "1a:2c:d4:cd:6a:8f",
            "net28": "2e:0e:ae:d3:3f:99",
            "net29": "76:80:ec:e5:9a:57",
            "net3": "0e:9c:97:28:9c:9b",
            "net30": "e2:b3:c4:ce:b3:53",
            "net31": "32:ef:53:b4:25:52",
            "net4": "ba:81:21:d5:06:d4",
            "net5": "1e:8c:c8:5b:00:e6",
            "net6": "e2:5a:4c:a0:24:9a",
            "net7": "02:90:f8:12:f5:94",
            "net8": "1a:78:42:15:00:0b",
            "net9": "c6:3d:f6:8d:79:53"
        },
        "tof_1_2_10": {
            "net0": "4a:8d:36:c5:e4:55",
            "net1": "ca:74:50:9f:07:2f",
            "net10": "a6:05:0c:b7:89:5d",
            "net11": "2a:cb:d4:f9:1f:ad",
            "net12": "ee:7d:3c:0b:6c:64",
            "net13": "02:28:20:ed:f5:7c",
            "net14": "5e:d1:f5:b0:15:6f",
            "net15": "ba:e2:71:0f:57:7e",
            "net16": "6a:97:c5:f9:b9:a7",
            "net17": "16:17:00:12:de:63",
            "net18": "22:27:dd:43:b4:f4",
            "net19": "96:d6:61:df:15:93",
            "net2": "96:ac:3a:cd:b6:e3",
            "net20": "2e:99:26:0e:ea:f7",
            "net21": "1a:43:50:00:77:44",
            "net22": "a6:b2:53:c0:bd:51",
            "net23": "5a:85:ef:05:bd:06",
            "net24": "4e:d8:c5:d1:ce:6f",
            "net25": "9a:ac:3b:14:c9:15",
            "net26": "62:23:47:9b:89:e3",
            "net27": "fa:57:32:f6:da:0d",
            "net28": "7e:26:96:e5:65:77",
            "net29": "16:b7:74:f6:1b:12",
            "net3": "ae:30:13:7e:28:64",
            "net30": "66:13:87:c4:87:e2",
            "net31": "be:07:a4:23:e2:43",
            "net4": "c6:87:0d:95:dc:67",
            "net5": "ba:8a:7d:36:13:a8",
            "net6": "c2:1f:1d:0e:42:ad",
            "net7": "d6:2b:2a:ad:ec:30",
            "net8": "f2:ea:c8:3d:32:7e",
            "net9": "1e:72:0b:96:31:c5"
        },
        "tof_1_2_11": {
            "net0": "0a:40:53:e6:ca:13",
            "net1": "f6:f7:96:54:5a:f6",
            "net10": "96:05:a2:02:17:99",
            "net11": "4a:b2:63:91:9f:a5",
            "net12": "3a:a5:ba:1c:0d:67",
            "net13": "32:57:91:5f:ba:ff",
            "net14": "9e:c1:15:1c:87:df",
            "net15": "a6:43:cc:2b:7d:ea",
            "net16": "ea:f1:60:ed:6a:cc",
            "net17": "9e:64:71:31:a9:86",
            "net18": "1e:f7:c9:58:58:c7",
            "net19": "72:39:7c:02:cb:37",
            "net2": "0e:e6:62:72:b7:8c",
            "net20": "36:8f:67:c4:32:7b",
            "net21": "ce:42:c4:88:41:44",
            "net22": "2e:9d:f3:aa:e2:55",
            "net23": "92:d3:68:04:66:15",
            "net24": "5e:28:a0:ec:0e:db",
            "net25": "c2:6d:c2:a1:b9:60",
            "net26": "8a:70:b9:20:4e:ea",
            "net27": "6a:bf:2c:7c:6a:0f",
            "net28": "06:93:29:a9:96:d5",
            "net29": "62:0f:2e:d7:0b:4a",
            "net3": "b6:89:b9:68:43:dd",
            "net30": "f6:cc:53:c6:ac:df",
            "net31": "ee:7f:72:19:be:af",
            "net4": "8a:3b:a1:e5:da:7a",
            "net5": "a2:13:98:86:4e:f1",
            "net6": "62:c2:d7:a9:9a:7f",
            "net7": "b6:f6:c6:64:94:da",
            "net8": "0a:56:65:aa:12:3b",
            "net9": "46:2c:96:7d:b5:93"
        },
        "tof_1_2_12": {
            "net0": "c2:ac:a6:0a:dc:4e",
            "net1": "a2:ab:54:93:08:af",
            "net10": "5e:bc:e8:29:22:6a",
            "net11": "de:0b:23:15:bd:f6",
            "net12": "fa:03:e7:c5:e6:03",
            "net13": "ba:25:c7:d2:f9:ad",
            "net14": "3a:02:04:f0:5d:ce",
            "net15": "ee:fb:dd:74:db:60",
            "net16": "46:33:c0:a4:c9:88",
            "net17": "2e:f1:e6:58:13:ff",
            "net18": "86:ce:90:dd:d1:8d",
            "net19": "82:82:6d:c0:66:03",
            "net2": "3a:bb:c6:de:09:12",
            "net20": "aa:a2:ce:81:7b:5a",
            "net21": "36:f2:7e:48:46:c1",
            "net22": "3a:4d:04:15:9c:9d",
            "net23": "7a:74:2d:3f:48:fa",
            "net24": "66:4f:db:f1:b2:17",
            "net25": "d2:00:6c:39:34:b2",
            "net26": "32:97:7d:a2:e0:89",
            "net27": "56:7d:df:57:39:aa",
            "net28": "d6:b6:95:b9:c4:b1",
            "net29": "b6:f3:dd:f8:31:41",
            "net3": "16:01:5f:0e:d4:2f",
            "net30": "5a:f7:44:85:69:2c",
            "net31": "06:37:b9:07:58:eb",
            "net4": "ca:5a:e3:c8:18:28",
            "net5": "ea:36:66:75:d2:9d",
            "net6": "6e:59:4d:11:cb:47",
            "net7": "f2:b2:62:90:c8:c5",
            "net8": "42:3c:c5:48:c0:aa",
            "net9": "de:a1:30:49:8f:f8"
        },
        "tof_1_2_13": {
            "net0": "d6:79:aa:c0:c4:3d",
            "net1": "86:c1:e9:1b:35:a6",
            "net10": "7e:45:cb:d0:e4:d3",
            "net11": "4e:fc:a3:ce:11:a1",
            "net12": "d6:31:27:27:fc:60",
            "net13": "1a:e0:19:95:8b:54",
            "net14": "ea:bf:65:20:9f:cd",
            "net15": "fa:96:30:0a:dd:28",
            "net16": "e2:12:52:95:5c:17",
            "net17": "02:eb:b8:71:ef:86",
            "net18": "82:58:c1:38:1c:1f",
            "net19": "26:ca:b5:ab:dd:4b",
            "net2": "b2:bd:b1:81:de:27",
            "net20": "02:52:cd:77:6d:96",
            "net21": "42:d2:46:85:5f:7d",
            "net22": "1e:c2:a0:01:cf:ab",
            "net23": "a2:d8:9b:80:1a:37",
            "net24": "62:4a:eb:79:38:33",
            "net25": "02:d8:32:31:f2:a6",
            "net26": "7e:62:13:bb:1e:14",
            "net27": "16:b5:a8:eb:f7:f7",
            "net28": "06:a4:7f:d3:53:61",
            "net29": "a2:8c:28:fc:6b:e1",
            "net3": "76:8d:83:66:ed:96",
            "net30": "f2:b6:4f:23:a7:93",
            "net31": "66:b6:36:d9:60:72",
            "net4": "fe:96:83:b1:ba:b2",
            "net5": "32:cf:b7:07:b8:ce",
            "net6": "ce:60:53:36:26:da",
            "net7": "6e:8c:28:45:96:de",
            "net8": "5e:d6:9f:6a:a2:a8",
            "net9": "c2:71:d1:df:e2:0a"
        },
        "tof_1_2_14": {
            "net0": "7a:e6:bd:75:23:a8",
            "net1": "ae:18:f8:e2:74:78",
            "net10": "9e:ec:b9:ac:dc:14",
            "net11": "02:49:73:e5:ad:56",
            "net12": "5e:0e:0d:62:2b:89",
            "net13": "ee:10:f8:e1:a2:67",
            "net14": "da:8e:8e:52:77:fe",
            "net15": "46:03:7d:90:c9:57",
            "net16": "fa:43:1e:50:12:b6",
            "net17": "6a:33:7f:de:d9:b0",
            "net18": "f2:aa:b5:77:a8:fc",
            "net19": "da:a8:64:fa:2e:92",
            "net2": "36:cb:1c:2a:bf:8e",
            "net20": "de:5e:82:a7:2b:11",
            "net21": "56:a6:57:fc:8d:d3",
            "net22": "82:18:d5:68:99:5b",
            "net23": "46:c3:3d:9b:67:67",
            "net24": "f2:31:6c:a7:8c:e1",
            "net25": "a6:b4:4b:87:11:53",
            "net26": "b6:4c:f5:48:24:21",
            "net27": "c2:41:57:1a:c2:af",
            "net28": "8e:fd:2c:77:c2:3e",
            "net29": "d2:4f:85:20:75:8d",
            "net3": "9a:e2:f7:70:c7:74",
            "net30": "1a:78:ae:f5:44:a5",
            "net31": "32:73:6f:81:dd:7b",
            "net4": "2e:81:8b:ab:37:6f",
            "net5": "4a:14:1d:3f:e9:da",
            "net6": "fe:f0:73:6a:fb:bb",
            "net7": "72:b5:0a:10:49:57",
            "net8": "36:4e:ee:4f:81:69",
            "net9": "fa:24:f5:e5:40:2d"
        },
        "tof_1_2_15": {
            "net0": "aa:81:53:24:7d:02",
            "net1": "ce:d8:50:68:16:b6",
            "net10": "92:4b:16:ac:ea:7e",
            "net11": "62:c9:a7:aa:21:45",
            "net12": "aa:10:f7:53:6c:9d",
            "net13": "f2:12:71:f5:6a:50",
            "net14": "e2:4a:2c:79:04:20",
            "net15": "96:e2:85:70:ca:75",
            "net16": "e2:28:ff:35:60:21",
            "net17": "2a:49:ff:d6:c8:14",
            "net18": "b6:aa:59:9f:e0:44",
            "net19": "de:65:bd:d2:1a:3e",
            "net2": "22:f9:f8:10:f0:05",
            "net20": "6e:58:28:03:85:4a",
            "net21": "ba:a5:f4:e4:c1:e1",
            "net22": "ae:9f:0d:c4:74:89",
            "net23": "ae:68:8e:41:f9:40",
            "net24": "be:2c:06:20:24:07",
            "net25": "e6:a1:ec:a5:72:ac",
            "net26": "de:fc:4d:d2:78:a0",
            "net27": "9e:8a:38:10:85:ce",
            "net28": "6a:53:51:39:6a:9b",
            "net29": "c6:47:c5:66:ad:35",
            "net3": "f6:24:87:a1:f8:42",
            "net30": "b2:84:02:7f:6d:87",
            "net31": "9e:d2:7b:f3:db:6d",
            "net4": "e2:d7:8d:83:7a:f7",
            "net5": "02:e5:56:ed:6b:03",
            "net6": "82:47:b6:ca:71:4e",
            "net7": "e6:6b:68:dd:23:bf",
            "net8": "22:99:92:29:29:35",
            "net9": "b6:40:62:40:68:a5"
        },
        "tof_1_2_16": {
            "net0": "c2:89:88:cb:d4:bb",
            "net1": "fa:10:e8:73:e2:50",
            "net10": "2e:29:d1:54:70:48",
            "net11": "4a:16:be:97:a6:2f",
            "net12": "56:ff:72:f3:fd:42",
            "net13": "4e:36:59:e1:28:19",
            "net14": "ae:79:1e:d1:bd:14",
            "net15": "92:e1:20:94:f6:d4",
            "net16": "6a:0a:08:19:20:f4",
            "net17": "a2:17:8c:55:04:1e",
            "net18": "1a:18:6e:84:ad:fc",
            "net19": "82:bc:ca:e7:cc:e8",
            "net2": "42:c7:b3:c9:97:82",
            "net20": "e6:99:f1:c2:5a:95",
            "net21": "d6:d1:c0:14:d6:8a",
            "net22": "2e:7a:e1:ce:cc:c9",
            "net23": "8e:bb:e6:70:3c:e5",
            "net24": "aa:52:d8:aa:ea:17",
            "net25": "86:14:8f:84:a2:2c",
            "net26": "5a:80:f6:f2:38:c0",
            "net27": "ce:ce:ac:11:fb:da",
            "net28": "76:0d:e0:a9:bb:53",
            "net29": "ee:60:2d:43:c7:1c",
            "net3": "82:9d:db:84:16:fa",
            "net30": "4a:4d:2e:7a:e1:54",
            "net31": "4a:a7:e8:37:ba:8c",
            "net4": "2e:b2:c2:fc:11:98",
            "net5": "ea:12:a4:64:69:ad",
            "net6": "a6:4f:57:d0:32:03",
            "net7": "b6:6c:18:ac:d5:c2",
            "net8": "2e:67:f5:2a:19:f5",
            "net9": "76:04:ba:b8:90:c5"
        },
        "tof_1_2_2": {
            "net0": "c2:ac:a6:63:78:c2",
            "net1": "a6:03:26:bb:fe:4d",
            "net10": "ba:7b:3c:cc:df:4b",
            "net11": "82:11:81:1a:6f:5f",
            "net12": "e6:86:90:fb:ea:68",
            "net13": "ca:ff:a3:05:4f:ad",
            "net14": "a2:7d:c7:75:0f:ee",
            "net15": "62:7d:2b:fe:f7:db",
            "net16": "1a:db:63:e0:89:02",
            "net17": "ca:ef:26:dc:db:d2",
            "net18": "86:ea:8d:12:85:40",
            "net19": "8e:56:ed:c3:c9:f4",
            "net2": "7a:97:c7:5d:af:d9",
            "net20": "06:f9:6d:67:a9:93",
            "net21": "9e:e4:9d:b6:bd:e4",
            "net22": "b2:96:32:dd:a8:50",
            "net23": "4a:11:b6:86:41:21",
            "net24": "ca:39:14:4d:17:c6",
            "net25": "ee:b2:a9:62:9d:8a",
            "net26": "9a:bc:ff:e9:c0:8f",
            "net27": "ba:15:7a:0d:b5:69",
            "net28": "fe:22:1f:22:3e:ba",
            "net29": "fa:ef:0d:0a:8e:2a",
            "net3": "de:b8:47:36:ff:5b",
            "net30": "3e:3f:b5:ec:00:be",
            "net31": "f6:7f:16:68:ab:79",
            "net4": "3a:a8:04:97:a6:c4",
            "net5": "5a:61:6a:39:62:34",
            "net6": "6a:14:17:6b:b1:e0",
            "net7": "26:a1:a1:12:85:c2",
            "net8": "1e:33:4c:d2:02:3f",
            "net9": "06:14:88:ef:74:46"
        },
        "tof_1_2_3": {
            "net0": "7e:d1:dc:0a:67:67",
            "net1": "f2:17:24:43:98:75",
            "net10": "e2:ce:54:3b:2c:09",
            "net11": "ce:c5:2e:5c:66:3c",
            "net12": "ca:18:1c:89:73:96",
            "net13": "d6:be:bb:08:e7:e9",
            "net14": "aa:13:a7:1a:5e:65",
            "net15": "b2:63:fa:91:13:49",
            "net16": "26:08:9d:af:45:60",
            "net17": "72:ac:81:90:48:68",
            "net18": "a6:47:02:c1:b7:ac",
            "net19": "b6:1c:4c:98:a5:94",
            "net2": "ba:d5:fd:85:6e:7b",
            "net20": "0e:4f:13:ca:2b:66",
            "net21": "e2:9f:fa:a8:8e:ea",
            "net22": "7e:f9:14:d5:2b:f2",
            "net23": "a6:1c:0b:3b:0c:dd",
            "net24": "e6:81:f9:ad:cc:3a",
            "net25": "ee:30:ca:6e:49:00",
            "net26": "7a:fc:4d:a6:7a:b8",
            "net27": "a6:41:b7:2e:96:8f",
            "net28": "de:3c:92:f1:8b:68",
            "net29": "12:9d:72:06:b6:36",
            "net3": "b6:5e:eb:ba:dc:af",
            "net30": "ce:c2:59:09:48:d4",
            "net31": "e2:8f:8b:76:5a:d4",
            "net4": "1a:fd:9a:80:e0:ae",
            "net5": "92:13:dc:0e:d3:dc",
            "net6": "fa:18:81:d9:3f:4b",
            "net7": "aa:1f:06:c1:ac:d8",
            "net8": "5e:bd:9b:3f:81:b2",
            "net9": "56:30:55:b8:28:a0"
        },
        "tof_1_2_4": {
            "net0": "b2:b1:e0:3f:4c:8b",
            "net1": "52:85:6b:2a:68:ac",
            "net10": "ee:6b:d0:c0:5b:bc",
            "net11": "16:64:87:a5:c0:bc",
            "net12": "56:30:07:a9:d9:21",
            "net13": "36:7a:1b:77:35:dc",
            "net14": "46:2d:98:e1:4c:a7",
            "net15": "e2:c7:06:ed:29:73",
            "net16": "16:df:fa:ad:bd:21",
            "net17": "72:5c:c2:37:4b:40",
            "net18": "26:2a:dd:bb:de:c7",
            "net19": "f2:68:48:ed:db:98",
            "net2": "9a:88:7e:57:c5:71",
            "net20": "8a:82:36:4a:d2:0a",
            "net21": "4a:d1:d7:36:7f:82",
            "net22": "f2:aa:18:8c:58:e6",
            "net23": "a2:cf:f4:52:5a:7c",
            "net24": "ee:75:fc:9a:1d:32",
            "net25": "46:c9:ad:59:1f:06",
            "net26": "0a:b7:22:24:48:18",
            "net27": "ae:8e:81:f8:7c:ae",
            "net28": "26:a0:ab:ae:68:83",
            "net29": "0e:fc:2b:f6:be:16",
            "net3": "02:02:73:34:fc:33",
            "net30": "72:c1:d5:84:0f:7f",
            "net31": "42:da:ff:5e:88:aa",
            "net4": "de:a4:b5:45:24:e9",
            "net5": "66:de:5c:19:76:61",
            "net6": "3e:f5:47:e9:d5:33",
            "net7": "3e:f7:92:72:74:3c",
            "net8": "72:08:85:39:ef:3a",
            "net9": "ce:ea:cc:f0:77:9c"
        },
        "tof_1_2_5": {
            "net0": "32:34:f0:56:98:51",
            "net1": "fe:c1:24:cd:b7:81",
            "net10": "8a:09:e6:ea:fa:bc",
            "net11": "8e:22:15:59:78:2d",
            "net12": "22:90:60:b1:23:f0",
            "net13": "82:3e:28:5d:24:6b",
            "net14": "1a:72:68:b1:ab:5e",
            "net15": "b2:c3:e4:89:13:f5",
            "net16": "3a:a0:4b:57:2c:1a",
            "net17": "02:c8:b0:e6:22:12",
            "net18": "82:69:8f:d1:74:1f",
            "net19": "ce:05:d2:2c:57:a9",
            "net2": "fe:cd:0f:5e:79:25",
            "net20": "72:51:fa:09:fc:52",
            "net21": "56:60:50:76:bd:fe",
            "net22": "16:15:d6:69:e9:c6",
            "net23": "f6:ff:62:b0:f1:4b",
            "net24": "ea:95:1f:03:85:ce",
            "net25": "9e:d8:8e:aa:d8:de",
            "net26": "72:6e:66:33:81:96",
            "net27": "7e:8c:31:7c:e0:ce",
            "net28": "16:2a:2a:7e:da:62",
            "net29": "b2:7f:06:f6:99:15",
            "net3": "52:69:1e:85:89:36",
            "net30": "b2:08:cc:55:c0:8a",
            "net31": "ba:3c:cb:17:7f:ae",
            "net4": "fa:a6:b4:f4:4f:2d",
            "net5": "f2:07:d3:d0:69:41",
            "net6": "e6:ad:f7:11:75:92",
            "net7": "ca:77:38:d4:f6:32",
            "net8": "ae:d5:e9:b0:89:bf",
            "net9": "72:cd:99:4b:ba:40"
        },
        "tof_1_2_6": {
            "net0": "66:14:6b:25:38:57",
            "net1": "2a:41:af:2f:62:e0",
            "net10": "ba:7e:54:ec:4a:8e",
            "net11": "42:0a:c1:7d:ad:b2",
            "net12": "da:0d:b1:31:9b:74",
            "net13": "a6:28:ea:93:d7:2d",
            "net14": "12:c7:0d:42:6c:80",
            "net15": "ca:a9:a5:29:e9:b4",
            "net16": "a6:de:10:40:08:ff",
            "net17": "de:cd:35:9e:18:39",
            "net18": "7a:1c:39:14:70:ff",
            "net19": "a6:f4:f1:74:8e:bb",
            "net2": "de:78:4c:ca:5d:55",
            "net20": "a2:83:f2:4a:29:a5",
            "net21": "6e:b4:e8:20:14:64",
            "net22": "12:ae:a0:ef:af:e7",
            "net23": "d6:a3:86:b7:54:e9",
            "net24": "12:d8:7c:52:a1:9e",
            "net25": "ae:6e:de:c9:d3:ca",
            "net26": "c2:9d:44:8a:80:88",
            "net27": "8a:77:b5:d7:1f:f8",
            "net28": "2e:2b:0f:e4:8e:0a",
            "net29": "ea:4d:a5:82:09:78",
            "net3": "ce:49:4c:aa:6b:4a",
            "net30": "4a:2e:93:d0:63:ed",
            "net31": "d6:10:23:9a:c4:fa",
            "net4": "ee:02:16:79:a5:a9",
            "net5": "de:c7:29:0b:77:ce",
            "net6": "0e:51:b3:8f:6d:de",
            "net7": "52:7e:06:88:7d:d4",
            "net8": "da:8a:35:ef:27:73",
            "net9": "ee:02:ff:03:1e:4d"
        },
        "tof_1_2_7": {
            "net0": "8a:7b:1a:eb:ed:99",
            "net1": "f6:0a:e3:1a:79:cc",
            "net10": "56:9a:1a:a0:41:29",
            "net11": "02:93:f7:e0:1e:e3",
            "net12": "7e:a5:b9:16:d8:75",
            "net13": "8a:5f:f6:7b:77:73",
            "net14": "86:db:48:e6:70:ab",
            "net15": "de:33:4f:10:f1:57",
            "net16": "86:7c:d1:ff:72:d3",
            "net17": "fa:cb:e2:7b:41:1b",
            "net18": "ea:b6:3e:c0:75:f9",
            "net19": "96:6d:cf:63:58:c7",
            "net2": "ee:4e:fd:03:7e:87",
            "net20": "e2:9b:92:53:0f:f2",
            "net21": "8a:3b:22:5b:2e:bd",
            "net22": "7a:82:81:e0:eb:2c",
            "net23": "2e:f4:d6:02:92:36",
            "net24": "aa:9e:9d:98:8e:8b",
            "net25": "c2:e8:aa:ec:c6:83",
            "net26": "7a:32:31:05:8c:2d",
            "net27": "4e:d3:50:38:90:9f",
            "net28": "06:68:39:cb:f0:d0",
            "net29": "aa:b4:c5:c7:6d:0f",
            "net3": "e6:6a:1f:35:4c:10",
            "net30": "b2:88:6d:8c:4a:f1",
            "net31": "e2:c5:94:9b:dc:a6",
            "net4": "9e:10:76:e7:ab:bf",
            "net5": "4e:55:d3:67:19:7b",
            "net6": "fe:48:7d:f6:91:3d",
            "net7": "8e:42:14:6d:f7:e4",
            "net8": "e6:54:45:6d:66:14",
            "net9": "46:57:74:92:4f:6e"
        },
        "tof_1_2_8": {
            "net0": "c2:15:b6:34:0f:40",
            "net1": "46:a2:52:2d:67:01",
            "net10": "a6:9a:b1:8d:77:96",
            "net11": "ca:61:79:22:34:d0",
            "net12": "de:2c:81:c6:f5:9a",
            "net13": "3a:90:81:18:46:f8",
            "net14": "66:1b:6a:69:d4:94",
            "net15": "f2:06:08:ed:34:46",
            "net16": "66:2f:30:f2:fb:5c",
            "net17": "7e:e1:8c:41:fc:a3",
            "net18": "ba:8f:ff:cb:5d:8d",
            "net19": "86:18:af:62:c0:1d",
            "net2": "ca:a0:31:01:9b:fd",
            "net20": "de:e0:fc:45:37:35",
            "net21": "7e:ea:06:d8:7c:77",
            "net22": "f6:1e:16:02:fa:11",
            "net23": "fe:da:fa:e1:37:5a",
            "net24": "d6:c1:3c:4d:8f:f7",
            "net25": "8e:e5:5a:54:f5:97",
            "net26": "36:cf:be:a0:07:48",
            "net27": "ae:16:0d:8a:7e:b1",
            "net28": "b6:3d:9e:2a:53:74",
            "net29": "0e:da:b3:d5:dc:a4",
            "net3": "7e:07:c4:b6:b2:3e",
            "net30": "ea:41:af:1c:d7:76",
            "net31": "de:a9:89:d8:dd:7f",
            "net4": "3e:43:0c:6e:64:0c",
            "net5": "b2:ab:72:6e:43:dc",
            "net6": "9a:5f:af:c7:52:a8",
            "net7": "1a:8f:2f:eb:9b:53",
            "net8": "3a:be:c3:ec:ac:58",
            "net9": "3e:5b:f3:06:76:1a"
        },
        "tof_1_2_9": {
            "net0": "2a:09:d2:46:db:27",
            "net1": "46:ed:dc:45:f5:38",
            "net10": "16:1a:90:c2:12:c9",
            "net11": "56:30:c4:0a:58:0b",
            "net12": "3e:32:58:60:8a:04",
            "net13": "a6:9b:80:37:53:99",
            "net14": "a6:35:8f:1a:ef:98",
            "net15": "4e:f7:01:18:67:20",
            "net16": "1e:7f:24:a7:3c:c2",
            "net17": "9a:c0:75:c9:a8:e5",
            "net18": "aa:68:15:9c:a5:2e",
            "net19": "26:82:a7:17:9f:1f",
            "net2": "ca:79:08:1e:7a:56",
            "net20": "2a:e7:bd:1d:68:23",
            "net21": "fe:dc:57:cd:11:51",
            "net22": "aa:a3:17:d8:84:b3",
            "net23": "aa:4b:95:dc:48:80",
            "net24": "a2:df:62:3d:27:92",
            "net25": "f2:14:9c:dc:25:a1",
            "net26": "4a:07:48:69:cd:0f",
            "net27": "5e:31:75:88:37:36",
            "net28": "aa:73:ff:5c:4e:0d",
            "net29": "0a:e1:d3:d2:82:83",
            "net3": "0e:8b:4d:ce:04:f9",
            "net30": "3a:85:9c:b9:ef:1c",
            "net31": "f6:a2:e4:25:fa:23",
            "net4": "7e:ca:da:67:72:8b",
            "net5": "4a:75:cc:22:02:a7",
            "net6": "46:af:51:0d:cc:8d",
            "net7": "5e:c9:6e:fd:0c:72",
            "net8": "0e:c4:11:42:9d:69",
            "net9": "ea:1a:d8:71:a9:a8"
        }
    },
    "failed_machine": "leaf_1_0_1",
    "failure_time": {
        "leaf_1_0_1": 1622144283.455071,
        "leaf_1_0_10": 1622144283.4718285,
        "leaf_1_0_11": 1622144283.4859889,
        "leaf_1_0_12": 1622144283.4997497,
        "leaf_1_0_13": 1622144283.519333,
        "leaf_1_0_14": 1622144283.4667585,
        "leaf_1_0_15": 1622144283.4774156,
        "leaf_1_0_16": 1622144283.4983907,
        "leaf_1_0_2": 1622144283.5238683,
        "leaf_1_0_3": 1622144283.5357552,
        "leaf_1_0_4": 1622144283.4657526,
        "leaf_1_0_5": 1622144283.4792392,
        "leaf_1_0_6": 1622144283.494054,
        "leaf_1_0_7": 1622144283.503017,
        "leaf_1_0_8": 1622144283.5278268,
        "leaf_1_0_9": 1622144283.4687781,
        "leaf_2_0_1": 1622144283.4830902,
        "leaf_2_0_10": 1622144283.5002232,
        "leaf_2_0_11": 1622144283.516018,
        "leaf_2_0_12": 1622144283.5253372,
        "leaf_2_0_13": 1622144283.531112,
        "leaf_2_0_14": 1622144283.5486796,
        "leaf_2_0_15": 1622144283.5571754,
        "leaf_2_0_16": 1622144283.5689576,
        "leaf_2_0_2": 1622144283.582064,
        "leaf_2_0_3": 1622144283.5422647,
        "leaf_2_0_4": 1622144283.5494757,
        "leaf_2_0_5": 1622144283.559802,
        "leaf_2_0_6": 1622144283.570258,
        "leaf_2_0_7": 1622144283.5784085,
        "leaf_2_0_8": 1622144283.5447583,
        "leaf_2_0_9": 1622144283.5559955,
        "spine_1_1_1": 1622144283.5651102,
        "spine_1_1_10": 1622144283.5748167,
        "spine_1_1_11": 1622144283.5823076,
        "spine_1_1_12": 1622144283.5443914,
        "spine_1_1_13": 1622144283.552204,
        "spine_1_1_14": 1622144283.5587585,
        "spine_1_1_15": 1622144283.5698137,
        "spine_1_1_16": 1622144283.582826,
        "spine_1_1_2": 1622144283.5838423,
        "spine_1_1_3": 1622144283.5969586,
        "spine_1_1_4": 1622144283.606434,
        "spine_1_1_5": 1622144283.6185262,
        "spine_1_1_6": 1622144283.625505,
        "spine_1_1_7": 1622144283.5893471,
        "spine_1_1_8": 1622144283.5970316,
        "spine_1_1_9": 1622144283.6070652,
        "spine_2_1_1": 1622144283.6181252,
        "spine_2_1_10": 1622144283.6309185,
        "spine_2_1_11": 1622144283.5906122,
        "spine_2_1_12": 1622144283.6020994,
        "spine_2_1_13": 1622144283.6127567,
        "spine_2_1_14": 1622144283.6246617,
        "spine_2_1_15": 1622144283.6316667,
        "spine_2_1_16": 1622144283.5897949,
        "spine_2_1_2": 1622144283.600812,
        "spine_2_1_3": 1622144283.610143,
        "spine_2_1_4": 1622144283.6246083,
        "spine_2_1_5": 1622144283.6381962,
        "spine_2_1_6": 1622144283.6391408,
        "spine_2_1_7": 1622144283.6500022,
        "spine_2_1_8": 1622144283.6606543,
        "spine_2_1_9": 1622144283.6702926,
        "tof_1_2_1": 1622144283.6842167,
        "tof_1_2_10": 1622144283.6439533,
        "tof_1_2_11": 1622144283.655143,
        "tof_1_2_12": 1622144283.662824,
        "tof_1_2_13": 1622144283.6722655,
        "tof_1_2_14": 1622144283.684435,
        "tof_1_2_15": 1622144283.6437726,
        "tof_1_2_16": 1622144283.6547709,
        "tof_1_2_2": 1622144283.664099,
        "tof_1_2_3": 1622144283.674624,
        "tof_1_2_4": 1622144283.6847022,
        "tof_1_2_5": 1622144283.6498091,
        "tof_1_2_6": 1622144283.6587093,
        "tof_1_2_7": 1622144283.6691403,
        "tof_1_2_8": 1622144283.6784499,
        "tof_1_2_9": 1622144283.68642
    }
}