{
    "k_leaf": 4,
    "k_top": 4,
    "redundancy_factor": 2,
    "is_k8s": false,
    "machine_mac_addresses": {
        "leaf_1_0_1": {
            "eth0": "de:ee:20:af:ac:76",
            "eth1": "06:e1:29:05:a0:21",
            "eth2": "d6:f0:9a:6d:36:29",
            "eth3": "ea:df:6b:fd:5d:b7",
            "eth4": "ea:46:c5:06:53:2e"
        },
        "leaf_1_0_2": {
            "eth0": "1e:fe:34:3d:0a:26",
            "eth1": "1a:07:b3:de:d0:ca",
            "eth2": "a6:2e:c1:89:82:9d",
            "eth3": "da:11:6f:aa:d5:7d",
            "eth4": "ea:d8:46:37:0c:0e"
        },
        "leaf_1_0_3": {
            "eth0": "3e:48:08:d4:cc:ef",
            "eth1": "62:0e:6e:5b:57:6d",
            "eth2": "46:00:8d:4e:98:63",
            "eth3": "f6:32:3e:f0:9a:15",
            "eth4": "32:46:d2:8a:f1:d8"
        },
        "leaf_1_0_4": {
            "eth0": "46:90:5f:d9:2c:05",
            "eth1": "26:ae:9b:6c:da:8e",
            "eth2": "ba:19:e9:a2:ea:55",
            "eth3": "d6:e1:27:42:0f:5c",
            "eth4": "b2:57:ba:e6:3f:4d"
        },
        "leaf_2_0_1": {
            "eth0": "2e:6d:74:c9:d8:4f",
            "eth1": "16:f9:36:de:a4:9e",
            "eth2": "5e:3e:cf:3f:63:eb",
            "eth3": "5e:56:aa:d9:83:6b",
            "eth4": "6e:49:a9:a5:96:55"
        },
        "leaf_2_0_2": {
            "eth0": "b6:4c:72:f8:82:d6",
            "eth1": "06:9f:d2:65:31:49",
            "eth2": "12:f8:f7:67:2c:be",
            "eth3": "22:84:c5:d3:25:6d",
            "eth4": "66:75:4f:96:8f:53"
        },
        "leaf_2_0_3": {
            "eth0": "86:49:5d:40:03:49",
            "eth1": "3e:2d:ae:e2:3a:c7",
            "eth2": "26:bf:ef:62:d2:e6",
            "eth3": "12:48:9a:65:f7:df",
            "eth4": "ae:ef:26:25:f6:24"
        },
        "leaf_2_0_4": {
            "eth0": "d6:74:ef:37:c6:d6",
            "eth1": "f2:ec:71:fc:fd:ae",
            "eth2": "a2:7b:27:f4:b6:90",
            "eth3": "62:e0:0b:d0:e6:c3",
            "eth4": "3e:2a:7b:7e:a5:11"
        },
        "leaf_3_0_1": {
            "eth0": "42:a0:1e:ac:9c:71",
            "eth1": "02:32:c7:b6:f9:ec",
            "eth2": "8e:9b:f4:e9:9f:9f",
            "eth3": "16:a7:00:cf:f0:e3",
            "eth4": "2e:63:0b:8f:be:d1"
        },
        "leaf_3_0_2": {
            "eth0": "d2:d6:df:3f:a9:7d",
            "eth1": "e6:c0:91:cd:a7:d9",
            "eth2": "ca:4d:ff:28:06:1e",
            "eth3": "6e:e9:0c:5a:b4:64",
            "eth4": "0e:fb:c0:5b:4b:70"
        },
        "leaf_3_0_3": {
            "eth0": "fe:0f:52:16:3e:d4",
            "eth1": "be:76:53:4d:e3:9d",
            "eth2": "1e:cb:7f:2b:36:7d",
            "eth3": "0e:76:9e:48:61:04",
            "eth4": "42:01:3b:c9:b2:0c"
        },
        "leaf_3_0_4": {
            "eth0": "1e:9a:da:f0:ed:9a",
            "eth1": "fe:4d:ef:95:fe:a6",
            "eth2": "fe:0d:e4:a3:8d:20",
            "eth3": "3e:90:c8:80:8f:d6",
            "eth4": "d6:61:de:30:da:de"
        },
        "leaf_4_0_1": {
            "eth0": "06:ee:0f:af:c3:bf",
            "eth1": "4a:07:44:1f:d8:d2",
            "eth2": "e6:2d:57:5a:71:c7",
            "eth3": "de:5e:4c:2b:2d:01",
            "eth4": "7a:0a:cc:9b:0d:43"
        },
        "leaf_4_0_2": {
            "eth0": "22:4b:80:68:8c:34",
            "eth1": "52:59:4e:f6:41:7a",
            "eth2": "b6:c7:43:82:93:20",
            "eth3": "6e:c8:c9:f1:1d:5a",
            "eth4": "62:14:7d:7f:a8:91"
        },
        "leaf_4_0_3": {
            "eth0": "72:c1:51:d9:d4:15",
            "eth1": "42:63:9e:22:9b:3d",
            "eth2": "4e:c9:a9:68:57:71",
            "eth3": "8e:73:a4:2b:79:32",
            "eth4": "7e:c6:cb:5e:53:48"
        },
        "leaf_4_0_4": {
            "eth0": "02:e6:ca:43:67:82",
            "eth1": "2a:6f:9d:18:5b:f3",
            "eth2": "7e:0d:61:f8:40:a2",
            "eth3": "b2:e1:4a:e7:88:b7",
            "eth4": "32:ae:07:a3:d0:ed"
        },
        "spine_1_1_1": {
            "eth0": "12:8e:b9:97:9f:f0",
            "eth1": "c6:09:a4:f6:ad:41",
            "eth2": "ea:59:07:66:e3:56",
            "eth3": "ae:e7:a8:60:ce:e1",
            "eth4": "b2:22:35:ee:51:79",
            "eth5": "a2:6a:30:d9:5c:8e",
            "eth6": "a6:27:15:ca:58:8e",
            "eth7": "0e:de:f5:c5:50:1d"
        },
        "spine_1_1_2": {
            "eth0": "d2:d2:d3:85:74:fa",
            "eth1": "b6:39:8a:f4:e8:e7",
            "eth2": "9a:78:58:f5:91:25",
            "eth3": "5e:4e:a0:75:c8:5e",
            "eth4": "16:27:06:96:83:d9",
            "eth5": "4a:74:43:d8:25:8d",
            "eth6": "86:6c:89:55:94:58",
            "eth7": "ae:f0:19:58:94:4c"
        },
        "spine_1_1_3": {
            "eth0": "a2:ea:3e:cd:d9:91",
            "eth1": "da:07:7d:92:14:e0",
            "eth2": "5a:d9:d8:f8:22:45",
            "eth3": "72:59:d9:92:79:fb",
            "eth4": "4a:c8:30:4a:09:37",
            "eth5": "4e:15:6c:bf:f6:38",
            "eth6": "fa:47:2b:29:62:5b",
            "eth7": "c2:a2:74:2d:b4:a5"
        },
        "spine_1_1_4": {
            "eth0": "de:26:21:be:e7:1e",
            "eth1": "9a:c7:e5:c2:fe:ba",
            "eth2": "da:d3:e2:e1:a3:20",
            "eth3": "92:99:73:6b:27:60",
            "eth4": "fe:d5:12:54:09:c7",
            "eth5": "ba:94:f2:40:12:05",
            "eth6": "7e:43:38:04:ed:62",
            "eth7": "72:ca:8e:eb:b5:4c"
        },
        "spine_2_1_1": {
            "eth0": "4e:fd:e3:9b:f8:26",
            "eth1": "9a:b7:f8:41:95:31",
            "eth2": "3a:29:a9:96:4b:d6",
            "eth3": "a2:1e:98:5b:43:14",
            "eth4": "d6:c3:4c:36:a2:e0",
            "eth5": "b2:3c:a8:e9:3b:e3",
            "eth6": "06:0f:58:f2:ea:7e",
            "eth7": "22:c8:93:1a:c9:61"
        },
        "spine_2_1_2": {
            "eth0": "9a:80:1f:83:fb:a1",
            "eth1": "da:9e:24:ba:b6:42",
            "eth2": "76:91:3a:7f:56:33",
            "eth3": "f6:16:00:f3:7c:61",
            "eth4": "c6:4e:a8:44:0d:ec",
            "eth5": "aa:2a:4e:90:99:e9",
            "eth6": "22:28:01:12:4f:dd",
            "eth7": "16:97:50:8b:fb:07"
        },
        "spine_2_1_3": {
            "eth0": "16:09:d8:c9:b3:44",
            "eth1": "d2:e1:da:5f:ec:45",
            "eth2": "ca:a2:77:4b:ae:e9",
            "eth3": "22:55:73:27:9d:46",
            "eth4": "12:e7:67:0c:85:c3",
            "eth5": "22:53:1f:d1:78:43",
            "eth6": "32:06:74:4d:fe:b5",
            "eth7": "d2:9f:cb:b1:b9:ed"
        },
        "spine_2_1_4": {
            "eth0": "e2:f1:d6:3f:74:03",
            "eth1": "72:7b:b9:c5:60:f5",
            "eth2": "1e:b7:39:37:80:e2",
            "eth3": "e2:6b:56:54:c2:6f",
            "eth4": "0e:d7:10:ab:7b:09",
            "eth5": "c2:cf:66:60:29:84",
            "eth6": "0e:47:02:65:04:34",
            "eth7": "fe:77:c3:6d:e3:81"
        },
        "spine_3_1_1": {
            "eth0": "46:6b:aa:e9:9e:38",
            "eth1": "b2:fc:23:2a:8b:c1",
            "eth2": "ce:5f:06:a0:8d:42",
            "eth3": "36:56:1b:bd:15:8c",
            "eth4": "c2:51:fc:b5:ea:63",
            "eth5": "a2:99:f4:d2:00:43",
            "eth6": "9a:d3:7f:14:f4:b8",
            "eth7": "da:ff:d0:f9:5f:43"
        },
        "spine_3_1_2": {
            "eth0": "d6:37:21:b3:57:2f",
            "eth1": "5a:6a:bb:84:e5:e2",
            "eth2": "b6:6f:5d:c8:e7:4b",
            "eth3": "36:c6:bb:43:8f:06",
            "eth4": "2a:80:dc:c7:f9:95",
            "eth5": "8e:4d:0e:a6:f4:d2",
            "eth6": "f6:d2:ef:6c:98:f6",
            "eth7": "36:85:20:66:e4:dd"
        },
        "spine_3_1_3": {
            "eth0": "ee:dc:a3:03:a1:03",
            "eth1": "f6:6c:3d:37:d6:4d",
            "eth2": "e2:19:57:87:50:a0",
            "eth3": "4a:dd:e5:c5:b6:f7",
            "eth4": "0e:93:2e:4d:9e:1c",
            "eth5": "56:83:3a:94:39:9f",
            "eth6": "5a:4f:d4:80:b6:68",
            "eth7": "4e:95:93:77:fc:eb"
        },
        "spine_3_1_4": {
            "eth0": "fa:76:bb:22:28:2d",
            "eth1": "56:cf:0c:23:80:e2",
            "eth2": "c6:31:43:af:99:7d",
            "eth3": "02:b6:be:23:c5:09",
            "eth4": "c6:b6:40:12:56:3a",
            "eth5": "2a:f2:cb:f8:15:db",
            "eth6": "a6:1f:8a:be:f4:63",
            "eth7": "a6:5b:b9:a4:aa:4d"
        },
        "spine_4_1_1": {
            "eth0": "3e:18:de:55:05:d2",
            "eth1": "b2:69:aa:5d:66:ff",
            "eth2": "c6:25:18:f9:1c:a7",
            "eth3": "46:fc:4a:c3:1b:c9",
            "eth4": "e2:6d:5e:76:d6:ab",
            "eth5": "06:95:3f:1b:0c:b5",
            "eth6": "fa:17:31:6d:49:70",
            "eth7": "36:52:92:e2:f3:be"
        },
        "spine_4_1_2": {
            "eth0": "3e:fe:41:87:03:80",
            "eth1": "a6:96:86:6a:ee:b6",
            "eth2": "ee:3c:82:13:b8:e2",
            "eth3": "ba:16:52:28:09:33",
            "eth4": "22:f0:67:9b:72:a0",
            "eth5": "aa:53:6d:13:03:52",
            "eth6": "5e:b0:a9:6c:85:0d",
            "eth7": "6e:34:60:94:19:7c"
        },
        "spine_4_1_3": {
            "eth0": "e6:3d:43:6c:b4:59",
            "eth1": "42:b9:ae:5a:bc:1b",
            "eth2": "86:99:40:59:ef:02",
            "eth3": "42:8c:f5:91:c6:ac",
            "eth4": "82:4d:d4:27:75:b1",
            "eth5": "12:5a:4d:ab:44:6f",
            "eth6": "82:94:3c:ed:96:09",
            "eth7": "fe:95:d8:fc:2b:e0"
        },
        "spine_4_1_4": {
            "eth0": "7a:4b:7a:95:c1:2d",
            "eth1": "b6:22:55:ad:c3:85",
            "eth2": "82:fb:cb:0d:16:c7",
            "eth3": "2e:db:af:7a:d1:6d",
            "eth4": "92:b6:86:24:08:6c",
            "eth5": "96:45:89:6f:4e:5f",
            "eth6": "aa:b7:ad:57:a7:9e",
            "eth7": "06:02:c5:e4:ce:63"
        },
        "tof_1_2_1": {
            "eth0": "56:4d:80:e7:7d:3a",
            "eth1": "92:47:1b:c3:39:4a",
            "eth2": "26:74:8a:31:24:f2",
            "eth3": "66:22:97:61:6b:cc",
            "eth4": "fa:3b:68:11:60:4d",
            "eth5": "86:31:c5:25:3b:eb",
            "eth6": "32:55:e4:3b:44:52",
            "eth7": "1a:d7:86:1e:f5:90"
        },
        "tof_1_2_2": {
            "eth0": "ba:4a:10:79:65:0a",
            "eth1": "e2:df:0d:de:a0:a1",
            "eth2": "66:9e:a2:c7:79:2f",
            "eth3": "36:50:37:8f:8e:e0",
            "eth4": "2a:6f:78:24:f4:5d",
            "eth5": "6e:30:ac:09:6c:34",
            "eth6": "ba:e8:1a:ef:58:c2",
            "eth7": "4e:f6:f3:c8:5e:91"
        },
        "tof_1_2_3": {
            "eth0": "fe:74:fe:f5:1b:8a",
            "eth1": "0a:e8:ac:69:5c:f4",
            "eth2": "ae:f0:a3:6e:98:77",
            "eth3": "82:7f:f0:8b:9d:e8",
            "eth4": "16:81:48:66:8e:7c",
            "eth5": "7a:63:5d:1b:c2:5c",
            "eth6": "62:53:16:ba:6d:1b",
            "eth7": "9e:ad:bf:c9:d1:7b"
        },
        "tof_1_2_4": {
            "eth0": "6e:0c:4e:82:f2:28",
            "eth1": "6a:6e:3d:bf:74:07",
            "eth2": "a2:b0:b1:25:ce:27",
            "eth3": "6a:d7:65:f1:e8:72",
            "eth4": "36:3e:35:39:9e:79",
            "eth5": "b6:f4:bb:c7:1d:06",
            "eth6": "1e:9b:be:9e:bc:67",
            "eth7": "7e:4a:48:21:f7:58"
        },
        "tof_2_2_1": {
            "eth0": "16:ea:94:07:ec:67",
            "eth1": "52:5c:9d:3f:04:c4",
            "eth2": "72:4a:6f:52:35:8d",
            "eth3": "de:12:6f:a1:95:7c",
            "eth4": "ce:62:01:26:d3:93",
            "eth5": "e2:4b:6c:14:53:e5",
            "eth6": "62:d4:41:f3:2a:35",
            "eth7": "62:94:c3:97:16:ce"
        },
        "tof_2_2_2": {
            "eth0": "56:c3:09:b7:93:5a",
            "eth1": "0e:9f:fa:28:15:56",
            "eth2": "9a:9b:a1:44:a5:58",
            "eth3": "1e:db:8b:ec:8f:ca",
            "eth4": "a6:81:b2:b7:a9:ed",
            "eth5": "16:8f:4c:8f:99:88",
            "eth6": "66:92:08:e9:8f:0b",
            "eth7": "e2:48:f1:c1:76:5f"
        },
        "tof_2_2_3": {
            "eth0": "a2:b5:6b:17:9a:db",
            "eth1": "2e:5a:a0:d0:83:1c",
            "eth2": "a2:a1:07:8b:cd:a7",
            "eth3": "72:f5:60:e8:07:32",
            "eth4": "c2:fa:7a:e6:57:3e",
            "eth5": "9a:7b:b3:bc:0f:c6",
            "eth6": "ea:dc:a1:16:38:27",
            "eth7": "ae:e5:df:74:50:1e"
        },
        "tof_2_2_4": {
            "eth0": "b6:bc:1e:4a:0a:b6",
            "eth1": "1e:78:26:8e:f9:cc",
            "eth2": "3e:99:60:be:65:1e",
            "eth3": "d6:b4:14:54:69:a0",
            "eth4": "ea:50:22:08:09:d8",
            "eth5": "fe:53:89:15:e4:45",
            "eth6": "9a:e9:01:0e:f0:d8",
            "eth7": "56:df:f8:b9:0f:ff"
        }
    },
    "failed_machine": "leaf_1_0_1",
    "failure_time": {
        "leaf_1_0_1": 1622028276.677702,
        "leaf_1_0_2": 1622028276.703281,
        "leaf_1_0_3": 1622028276.7145658,
        "leaf_1_0_4": 1622028276.677762,
        "leaf_2_0_1": 1622028276.6914103,
        "leaf_2_0_2": 1622028276.6999037,
        "leaf_2_0_3": 1622028276.6911376,
        "leaf_2_0_4": 1622028276.7131205,
        "leaf_3_0_1": 1622028276.7364671,
        "leaf_3_0_2": 1622028276.6876187,
        "leaf_3_0_3": 1622028276.7060347,
        "leaf_3_0_4": 1622028276.7246866,
        "leaf_4_0_1": 1622028276.724361,
        "leaf_4_0_2": 1622028276.7436867,
        "leaf_4_0_3": 1622028276.7559202,
        "leaf_4_0_4": 1622028276.729872,
        "spine_1_1_1": 1622028276.7477016,
        "spine_1_1_2": 1622028276.7604365,
        "spine_1_1_3": 1622028276.7474418,
        "spine_1_1_4": 1622028276.759818,
        "spine_2_1_1": 1622028276.7785082,
        "spine_2_1_2": 1622028276.747946,
        "spine_2_1_3": 1622028276.7683632,
        "spine_2_1_4": 1622028276.7896094,
        "spine_3_1_1": 1622028276.7731843,
        "spine_3_1_2": 1622028276.7846973,
        "spine_3_1_3": 1622028276.8001094,
        "spine_3_1_4": 1622028276.774881,
        "spine_4_1_1": 1622028276.7874036,
        "spine_4_1_2": 1622028276.7983327,
        "spine_4_1_3": 1622028276.7986333,
        "spine_4_1_4": 1622028276.813223,
        "tof_1_2_1": 1622028276.8271413,
        "tof_1_2_2": 1622028276.8063514,
        "tof_1_2_3": 1622028276.8205218,
        "tof_1_2_4": 1622028276.8276849,
        "tof_2_2_1": 1622028276.805401,
        "tof_2_2_2": 1622028276.8238554,
        "tof_2_2_3": 1622028276.8345807,
        "tof_2_2_4": 1622028276.8142385
    }
}