{
    "description": "Scenario 3c: ToF tof_1_2_1 failure with BGP",
    "k_leaf": 8,
    "k_top": 8,
    "redundancy_factor": 4,
    "is_k8s": true,
    "machine_mac_addresses": {
        "leaf_1_0_1": {
            "net0": "7e:45:0a:9f:b0:1c",
            "net1": "4a:84:d9:da:00:6b",
            "net2": "c2:af:91:75:00:a7",
            "net3": "9e:4c:a6:45:86:b0",
            "net4": "b2:61:07:27:d4:b0",
            "net5": "fe:48:0e:fa:b3:7b",
            "net6": "26:9f:16:95:3f:02",
            "net7": "0e:e0:e4:a8:23:dd",
            "net8": "ea:e1:a5:4e:32:14"
        },
        "leaf_1_0_2": {
            "net0": "b2:77:ca:c5:f1:98",
            "net1": "5e:59:02:c9:77:68",
            "net2": "ce:e3:b0:7d:03:db",
            "net3": "d2:c3:fa:d0:be:f1",
            "net4": "9e:d6:62:7d:d5:24",
            "net5": "3e:19:b4:56:d8:45",
            "net6": "5a:af:20:3b:b5:b0",
            "net7": "5a:14:67:86:39:41",
            "net8": "de:6d:9c:74:1c:a0"
        },
        "leaf_1_0_3": {
            "net0": "4a:5b:3a:43:72:d7",
            "net1": "96:e9:9d:4b:6d:65",
            "net2": "a6:7f:48:e0:f6:fc",
            "net3": "2e:79:24:21:99:d2",
            "net4": "b6:aa:06:2b:86:2b",
            "net5": "1e:fc:5d:9a:de:4f",
            "net6": "96:0f:4d:a6:0d:de",
            "net7": "2a:02:33:f3:18:62",
            "net8": "92:84:7d:99:90:f5"
        },
        "leaf_1_0_4": {
            "net0": "12:cc:6f:65:ab:0e",
            "net1": "2e:11:33:f4:6e:1b",
            "net2": "b2:50:e1:37:30:87",
            "net3": "ae:01:94:66:ae:1e",
            "net4": "8e:eb:21:f8:b4:53",
            "net5": "a6:5d:ca:67:45:47",
            "net6": "ca:d9:23:4d:2a:93",
            "net7": "a2:96:4d:ad:0e:40",
            "net8": "b2:b8:51:9f:12:bf"
        },
        "leaf_1_0_5": {
            "net0": "96:e7:b7:46:55:03",
            "net1": "46:85:cb:c8:69:fd",
            "net2": "86:6c:65:eb:28:9f",
            "net3": "76:57:ac:a4:e7:49",
            "net4": "32:f2:9a:eb:90:9b",
            "net5": "66:c9:29:6a:ba:7b",
            "net6": "66:cb:e1:31:7d:03",
            "net7": "d6:f8:05:89:99:4a",
            "net8": "1e:49:85:ee:82:03"
        },
        "leaf_1_0_6": {
            "net0": "8a:81:a9:76:90:24",
            "net1": "76:ef:aa:25:aa:a3",
            "net2": "be:5d:f0:72:37:75",
            "net3": "fa:61:d2:9a:12:3b",
            "net4": "3e:cb:77:e6:58:f6",
            "net5": "da:b2:99:ce:b1:32",
            "net6": "1e:5e:d6:ba:b8:25",
            "net7": "6e:15:18:a6:3b:55",
            "net8": "7a:02:3c:49:f0:5c"
        },
        "leaf_1_0_7": {
            "net0": "6e:98:af:47:76:1f",
            "net1": "c2:4c:b8:46:1c:0f",
            "net2": "0e:af:a8:a8:5a:8f",
            "net3": "ca:a4:4a:9e:13:49",
            "net4": "22:9d:1d:9e:00:89",
            "net5": "46:f7:89:55:c1:c9",
            "net6": "3e:8e:89:da:f9:59",
            "net7": "5a:e5:f6:b5:34:34",
            "net8": "02:d8:9a:cb:e8:ec"
        },
        "leaf_1_0_8": {
            "net0": "12:bb:dd:c4:ca:fe",
            "net1": "16:8c:ec:ba:db:1b",
            "net2": "62:15:ab:f7:d3:78",
            "net3": "36:f0:51:d8:40:d1",
            "net4": "5e:ad:db:3b:66:96",
            "net5": "b6:47:25:8b:96:86",
            "net6": "da:92:02:b1:fb:df",
            "net7": "b2:0f:45:c1:04:50",
            "net8": "a6:39:48:d4:e5:b1"
        },
        "leaf_2_0_1": {
            "net0": "12:92:96:7e:4e:90",
            "net1": "4e:85:08:17:c1:a2",
            "net2": "d2:a2:82:24:84:a8",
            "net3": "5e:c0:ff:61:7b:39",
            "net4": "62:4d:01:9d:b9:93",
            "net5": "ae:7c:03:39:21:52",
            "net6": "36:77:91:fa:e4:7c",
            "net7": "d6:bf:d8:bd:c9:cd",
            "net8": "92:a2:8e:3a:19:ea"
        },
        "leaf_2_0_2": {
            "net0": "46:20:7e:5e:f3:cb",
            "net1": "7a:67:a8:e5:c6:49",
            "net2": "ae:01:06:74:d9:d8",
            "net3": "8a:b2:0e:f3:15:f6",
            "net4": "1a:74:e4:f8:f8:0c",
            "net5": "da:bd:a1:f5:62:1a",
            "net6": "2a:62:d5:69:43:16",
            "net7": "7e:87:66:f7:dd:8d",
            "net8": "ae:63:3e:fe:42:1c"
        },
        "leaf_2_0_3": {
            "net0": "76:1c:81:cc:f5:98",
            "net1": "66:02:7d:ff:da:ac",
            "net2": "5a:e4:9c:e9:55:dd",
            "net3": "8e:c7:90:9c:5d:d2",
            "net4": "12:11:b9:f4:22:6d",
            "net5": "12:c4:4e:fb:f8:7b",
            "net6": "de:19:0a:6c:be:4d",
            "net7": "62:99:b2:64:8d:56",
            "net8": "46:3b:69:84:72:51"
        },
        "leaf_2_0_4": {
            "net0": "9e:12:e0:c1:1d:47",
            "net1": "7a:7f:0f:44:96:71",
            "net2": "7a:5d:99:5d:40:ff",
            "net3": "ea:3a:f2:12:9d:70",
            "net4": "0a:cb:3f:c3:97:bb",
            "net5": "8e:2b:11:c9:cf:9d",
            "net6": "72:1d:32:97:b1:fe",
            "net7": "42:6f:e7:c2:9b:c3",
            "net8": "06:49:de:14:36:7d"
        },
        "leaf_2_0_5": {
            "net0": "ba:9b:06:97:20:2c",
            "net1": "f6:d4:fc:3f:c2:d9",
            "net2": "02:5e:39:17:a7:63",
            "net3": "ca:c3:0f:b3:f2:6c",
            "net4": "46:10:cd:3c:10:d7",
            "net5": "2a:1d:0d:24:f9:5e",
            "net6": "1a:17:a5:90:a9:bc",
            "net7": "32:c5:ee:0d:ec:83",
            "net8": "de:92:41:d4:c0:b1"
        },
        "leaf_2_0_6": {
            "net0": "ce:7a:8e:bc:4b:51",
            "net1": "4e:c2:c5:36:84:86",
            "net2": "72:be:48:d0:39:a1",
            "net3": "56:46:8d:07:76:2a",
            "net4": "7e:08:41:e7:44:0b",
            "net5": "1a:5d:f3:1f:b9:64",
            "net6": "2a:be:ee:93:6d:04",
            "net7": "22:1e:c0:47:d1:29",
            "net8": "56:d3:06:79:78:b2"
        },
        "leaf_2_0_7": {
            "net0": "2a:f5:8e:c4:be:ad",
            "net1": "ea:44:fe:98:61:28",
            "net2": "5a:47:15:e3:3f:c5",
            "net3": "f2:ef:e5:48:2e:13",
            "net4": "ea:44:d4:a0:5b:d2",
            "net5": "66:3a:92:b5:66:5a",
            "net6": "7a:3b:a6:85:15:ef",
            "net7": "5a:f6:ba:76:df:30",
            "net8": "06:e7:a9:e1:8c:49"
        },
        "leaf_2_0_8": {
            "net0": "5e:09:6e:9e:cf:24",
            "net1": "aa:3c:55:6d:91:20",
            "net2": "26:3b:3a:5b:68:9c",
            "net3": "86:c4:b3:36:b2:78",
            "net4": "3e:a0:9c:2b:75:ba",
            "net5": "da:ee:e9:50:01:29",
            "net6": "f2:b2:cc:c8:06:18",
            "net7": "22:6a:ce:5c:fd:5c",
            "net8": "b6:17:e0:43:e4:02"
        },
        "leaf_3_0_1": {
            "net0": "1a:f1:25:aa:d0:1b",
            "net1": "7a:7a:87:2e:fe:b1",
            "net2": "2a:25:42:48:28:75",
            "net3": "8e:b6:44:09:c5:40",
            "net4": "1a:91:10:47:10:28",
            "net5": "0a:35:6c:54:eb:5b",
            "net6": "9e:f1:71:06:ad:db",
            "net7": "1a:31:8a:a7:4b:a0",
            "net8": "5a:8e:56:50:32:21"
        },
        "leaf_3_0_2": {
            "net0": "d6:4d:cc:68:ef:b5",
            "net1": "ce:42:5d:59:af:c5",
            "net2": "e2:27:9e:2d:49:ee",
            "net3": "e6:9c:d7:8b:1d:65",
            "net4": "5e:ed:68:7f:1b:ad",
            "net5": "9e:11:dd:5b:fb:5f",
            "net6": "02:a0:82:f1:d4:0a",
            "net7": "62:b1:05:f1:8b:e5",
            "net8": "02:46:dc:6a:8e:99"
        },
        "leaf_3_0_3": {
            "net0": "52:df:2b:c9:3e:e6",
            "net1": "8a:81:6e:db:dd:ac",
            "net2": "a2:c0:74:05:32:bc",
            "net3": "96:05:a2:a3:e5:49",
            "net4": "d6:1e:78:fc:7d:ad",
            "net5": "ca:e2:1c:5e:0d:9f",
            "net6": "22:2d:98:f4:97:6f",
            "net7": "5e:50:f5:bb:e5:c9",
            "net8": "8e:ea:ad:22:85:a5"
        },
        "leaf_3_0_4": {
            "net0": "0a:4b:fd:4c:ca:f4",
            "net1": "c6:9e:d5:58:1d:88",
            "net2": "da:b8:c5:14:30:ab",
            "net3": "8a:f9:b2:47:04:9c",
            "net4": "f2:ee:2a:b0:ad:93",
            "net5": "9e:85:fa:64:e4:25",
            "net6": "96:c1:fe:60:98:3e",
            "net7": "36:1c:f5:b6:ce:86",
            "net8": "c6:02:73:99:b8:6f"
        },
        "leaf_3_0_5": {
            "net0": "da:31:6a:cb:87:20",
            "net1": "9a:16:6e:c7:ae:77",
            "net2": "02:cf:76:42:06:0b",
            "net3": "ce:55:f4:18:10:62",
            "net4": "d2:39:0d:6f:ca:2d",
            "net5": "de:30:a8:a5:56:b0",
            "net6": "1e:bc:ef:42:c5:07",
            "net7": "3e:3e:49:0e:12:74",
            "net8": "2a:9d:4f:16:79:a9"
        },
        "leaf_3_0_6": {
            "net0": "16:6f:60:3e:21:25",
            "net1": "26:c1:03:9e:78:72",
            "net2": "76:03:30:2a:27:7c",
            "net3": "2a:0b:94:92:c3:e3",
            "net4": "9e:ba:f8:07:34:8d",
            "net5": "f6:e2:9e:6a:f1:20",
            "net6": "a6:56:ca:ed:f5:a0",
            "net7": "ba:f0:8c:e6:83:61",
            "net8": "42:77:b1:33:84:82"
        },
        "leaf_3_0_7": {
            "net0": "d6:9d:56:52:b3:1b",
            "net1": "ea:33:da:57:06:b5",
            "net2": "6e:4c:6f:e2:fb:81",
            "net3": "f2:f0:df:54:30:3d",
            "net4": "36:00:44:a5:ed:1b",
            "net5": "aa:ed:92:23:e1:b2",
            "net6": "0e:2c:86:27:ca:af",
            "net7": "46:12:a8:b8:53:41",
            "net8": "fe:c0:b6:11:3c:8c"
        },
        "leaf_3_0_8": {
            "net0": "7e:08:95:57:71:09",
            "net1": "2a:28:3a:66:00:c5",
            "net2": "5a:51:3f:c1:7d:35",
            "net3": "9e:14:fb:b9:c6:c8",
            "net4": "32:3e:a7:fe:19:6a",
            "net5": "c6:f4:66:d6:7a:6d",
            "net6": "ea:77:2a:c8:cc:be",
            "net7": "66:f1:7d:8d:8b:81",
            "net8": "8e:83:0b:70:2b:9b"
        },
        "leaf_4_0_1": {
            "net0": "42:16:f6:82:00:0d",
            "net1": "7e:5a:47:51:56:ba",
            "net2": "66:ab:70:dd:f2:42",
            "net3": "aa:b5:2c:29:e7:f9",
            "net4": "e6:38:e5:4d:f0:9d",
            "net5": "ea:03:a2:33:e1:d6",
            "net6": "9a:bd:90:f5:3f:a0",
            "net7": "02:1d:79:b6:ab:e1",
            "net8": "0a:6c:1e:e1:85:c6"
        },
        "leaf_4_0_2": {
            "net0": "52:b7:74:7b:df:78",
            "net1": "1e:97:b7:40:13:ce",
            "net2": "8e:0f:c1:39:ba:1e",
            "net3": "62:fb:4e:1d:2e:66",
            "net4": "6e:fc:a0:13:4d:ae",
            "net5": "0e:6b:bc:15:1c:6b",
            "net6": "e6:f5:74:bc:26:2b",
            "net7": "92:7a:e4:21:00:d5",
            "net8": "6a:81:98:cd:b4:65"
        },
        "leaf_4_0_3": {
            "net0": "0e:6a:d0:a9:f3:eb",
            "net1": "d2:29:3e:c2:78:35",
            "net2": "1a:94:e9:f1:3a:57",
            "net3": "02:55:ae:06:f7:6f",
            "net4": "8e:57:af:51:3c:01",
            "net5": "c2:36:72:de:f4:60",
            "net6": "a6:d4:29:b0:61:78",
            "net7": "ae:05:98:44:c2:85",
            "net8": "fa:52:85:f3:7a:3b"
        },
        "leaf_4_0_4": {
            "net0": "aa:59:c8:0f:48:dd",
            "net1": "7a:8d:98:0f:aa:b9",
            "net2": "ee:38:1c:a7:03:54",
            "net3": "de:62:77:12:1c:35",
            "net4": "0e:d9:9c:f0:32:cb",
            "net5": "56:8c:3a:c5:dc:3f",
            "net6": "02:10:fa:dd:7a:84",
            "net7": "d2:1b:f0:c4:8d:ae",
            "net8": "16:c6:a2:41:f9:08"
        },
        "leaf_4_0_5": {
            "net0": "46:61:32:95:80:cc",
            "net1": "8a:ca:76:f7:86:4b",
            "net2": "02:61:d9:61:fc:02",
            "net3": "d6:b0:0d:a3:cb:e3",
            "net4": "e2:f3:80:9f:56:10",
            "net5": "96:0c:5d:44:39:b8",
            "net6": "a2:6b:65:51:bd:b6",
            "net7": "c6:1d:cd:48:a7:88",
            "net8": "62:07:38:5e:26:b4"
        },
        "leaf_4_0_6": {
            "net0": "5e:63:55:82:3c:b2",
            "net1": "96:fd:85:73:49:94",
            "net2": "e2:32:b5:a7:fb:f0",
            "net3": "86:8c:bb:91:f9:2f",
            "net4": "66:c0:2a:05:9d:9b",
            "net5": "22:21:c0:1a:a9:e4",
            "net6": "76:a0:b5:e5:6e:2b",
            "net7": "3a:c0:e9:b3:b2:0f",
            "net8": "ca:fe:32:bc:05:3c"
        },
        "leaf_4_0_7": {
            "net0": "22:3d:4b:57:b5:35",
            "net1": "e2:87:d7:10:fe:ab",
            "net2": "be:a2:49:dd:37:cd",
            "net3": "02:72:4e:14:43:af",
            "net4": "b6:d9:a0:4b:e4:9f",
            "net5": "e2:31:ee:39:67:c7",
            "net6": "f2:6a:4b:7a:24:04",
            "net7": "26:d3:32:7f:e7:b2",
            "net8": "0a:f1:18:f9:76:8e"
        },
        "leaf_4_0_8": {
            "net0": "ae:3a:cb:cc:75:01",
            "net1": "c6:19:3c:a6:d0:6b",
            "net2": "06:99:6d:8b:66:ad",
            "net3": "66:a0:fd:ad:75:67",
            "net4": "ee:92:a8:34:b9:a9",
            "net5": "f2:60:46:ce:06:a5",
            "net6": "06:76:5e:34:3f:fa",
            "net7": "36:eb:55:b8:7f:b7",
            "net8": "02:c7:9d:24:36:bb"
        },
        "spine_1_1_1": {
            "net0": "86:0d:94:ba:b8:0e",
            "net1": "ce:61:e2:bf:f5:ad",
            "net10": "fe:a4:0a:92:a0:54",
            "net11": "8a:86:6d:3c:e7:f9",
            "net12": "ba:73:0c:fe:95:e8",
            "net13": "96:69:6f:45:45:0c",
            "net14": "92:e6:78:d1:bb:2f",
            "net15": "5a:8a:90:aa:a0:4b",
            "net2": "6e:4f:a9:56:2e:04",
            "net3": "e2:6c:d6:02:4b:c7",
            "net4": "86:39:3b:c1:8e:d0",
            "net5": "22:6b:16:94:56:10",
            "net6": "62:b3:06:5c:bb:e7",
            "net7": "f6:96:48:cc:ae:cc",
            "net8": "a2:0c:75:39:82:0b",
            "net9": "5e:42:ac:b6:f6:fa"
        },
        "spine_1_1_2": {
            "net0": "32:23:12:24:76:8a",
            "net1": "52:6b:45:57:50:af",
            "net10": "12:f1:e0:dd:4c:e4",
            "net11": "7a:55:fc:01:7f:9a",
            "net12": "b6:62:a6:8e:76:73",
            "net13": "3a:1e:7b:15:84:9e",
            "net14": "66:11:59:26:ac:a9",
            "net15": "ba:3f:77:fc:64:12",
            "net2": "66:eb:a8:03:39:56",
            "net3": "f2:e5:22:76:be:4d",
            "net4": "a2:d8:b5:1c:46:03",
            "net5": "b6:45:04:c8:00:4c",
            "net6": "02:d5:65:63:a4:f0",
            "net7": "16:07:9e:3b:32:98",
            "net8": "b6:2d:c6:ba:8f:37",
            "net9": "16:d0:da:d3:dd:23"
        },
        "spine_1_1_3": {
            "net0": "f6:2b:ae:61:04:14",
            "net1": "1e:ec:1c:59:fe:d7",
            "net10": "62:f5:d2:50:ce:98",
            "net11": "16:00:28:dd:1a:e7",
            "net12": "3a:60:b6:24:95:51",
            "net13": "de:e8:7d:81:22:67",
            "net14": "b2:d7:c1:66:34:cf",
            "net15": "32:d9:c6:5f:e2:d0",
            "net2": "62:75:b8:45:88:56",
            "net3": "46:43:57:9a:fb:d3",
            "net4": "f6:05:a0:99:aa:1d",
            "net5": "de:15:07:60:64:c5",
            "net6": "3e:6d:a2:b9:64:d4",
            "net7": "ba:5c:a4:d6:8d:a9",
            "net8": "fa:5c:45:f0:74:7f",
            "net9": "d6:7f:81:2b:c9:ae"
        },
        "spine_1_1_4": {
            "net0": "fe:e0:f1:a3:a1:46",
            "net1": "fe:c3:91:4a:62:a7",
            "net10": "82:c9:b0:8b:d2:4e",
            "net11": "3e:98:1d:62:ae:0f",
            "net12": "62:61:99:6a:8a:5b",
            "net13": "46:2f:31:d8:63:de",
            "net14": "f6:54:59:29:4d:3e",
            "net15": "22:af:52:c7:87:86",
            "net2": "02:f9:12:2d:2a:60",
            "net3": "56:00:a2:af:a2:45",
            "net4": "f6:6a:aa:ba:ad:ba",
            "net5": "9a:6a:bc:e8:c9:25",
            "net6": "42:e2:4e:af:92:c9",
            "net7": "ca:3e:0f:b2:cf:4a",
            "net8": "9a:ca:05:88:3e:e8",
            "net9": "4a:0f:3d:2f:00:14"
        },
        "spine_1_1_5": {
            "net0": "56:74:b3:9a:5b:f1",
            "net1": "7a:0a:8b:e9:85:6d",
            "net10": "06:d7:d4:66:54:c3",
            "net11": "c6:48:f0:78:d4:25",
            "net12": "02:5f:f8:aa:9e:ff",
            "net13": "22:c2:03:43:18:9b",
            "net14": "7e:7e:e5:61:4f:2f",
            "net15": "ca:18:50:37:a1:3a",
            "net2": "8a:65:67:e9:64:0d",
            "net3": "16:26:21:af:01:3b",
            "net4": "12:53:6a:b4:9e:a9",
            "net5": "b6:6c:8f:9c:d7:f6",
            "net6": "26:cc:cd:21:6c:99",
            "net7": "6a:68:c9:ff:7b:43",
            "net8": "5a:fe:33:32:b4:18",
            "net9": "92:a1:af:a4:07:f7"
        },
        "spine_1_1_6": {
            "net0": "42:14:26:32:ee:61",
            "net1": "c6:b5:9a:34:94:60",
            "net10": "4a:76:0e:df:92:24",
            "net11": "16:ea:71:c0:55:3c",
            "net12": "d2:02:c4:26:be:fa",
            "net13": "c6:1c:0b:b5:0d:90",
            "net14": "9a:64:53:23:b3:0c",
            "net15": "4e:cf:02:2b:ff:44",
            "net2": "aa:07:f2:0a:85:a7",
            "net3": "66:ed:01:6d:3d:e6",
            "net4": "42:d8:f7:5b:04:30",
            "net5": "5a:6b:3d:5e:40:d3",
            "net6": "26:68:b4:33:a0:cb",
            "net7": "22:07:ea:87:c7:3e",
            "net8": "36:11:ef:cd:ac:b5",
            "net9": "a2:5d:ea:70:09:ae"
        },
        "spine_1_1_7": {
            "net0": "a2:e2:3e:20:a1:98",
            "net1": "22:13:ae:89:4a:4f",
            "net10": "7a:01:32:2e:ee:df",
            "net11": "b6:f5:fa:87:d7:48",
            "net12": "1a:76:3e:5f:39:77",
            "net13": "be:66:31:3a:bb:fa",
            "net14": "46:7e:80:6a:3f:7f",
            "net15": "ba:a9:33:54:c5:88",
            "net2": "fa:14:f9:24:05:4d",
            "net3": "d2:99:5d:d2:83:4f",
            "net4": "3e:a5:e4:89:6f:b5",
            "net5": "42:f3:6d:c0:bf:93",
            "net6": "ca:8d:5f:aa:97:05",
            "net7": "06:92:02:12:02:f2",
            "net8": "0e:ae:2c:78:e6:59",
            "net9": "ba:62:ca:1b:48:f7"
        },
        "spine_1_1_8": {
            "net0": "72:87:13:d9:8d:b3",
            "net1": "92:d1:97:9b:03:b8",
            "net10": "86:a2:9b:99:a0:45",
            "net11": "7e:b7:73:a8:1e:67",
            "net12": "4a:c8:e3:19:b9:b0",
            "net13": "d6:3e:c1:f7:11:27",
            "net14": "d2:10:9b:08:0f:3f",
            "net15": "76:58:55:f1:d0:69",
            "net2": "c2:66:40:fd:a5:91",
            "net3": "a2:fb:9d:35:29:ed",
            "net4": "66:0a:6c:bd:10:4a",
            "net5": "e6:d1:ab:93:d9:a5",
            "net6": "96:e0:da:62:7b:b7",
            "net7": "6e:fa:a6:05:79:b5",
            "net8": "a6:50:ce:8f:db:31",
            "net9": "72:0a:fe:4f:07:68"
        },
        "spine_2_1_1": {
            "net0": "0e:f2:54:ef:51:5a",
            "net1": "56:d5:4e:e2:f3:36",
            "net10": "da:cc:5c:69:e3:69",
            "net11": "d6:f9:65:00:50:fb",
            "net12": "d2:9e:3b:a2:8b:59",
            "net13": "12:1f:da:24:ff:56",
            "net14": "4a:c4:53:a9:65:62",
            "net15": "a6:57:bb:1e:75:91",
            "net2": "8e:7c:6f:5c:2e:71",
            "net3": "d2:45:bf:ff:7d:3a",
            "net4": "ca:ce:74:ad:78:2a",
            "net5": "4a:c7:4d:c7:69:a6",
            "net6": "32:c5:eb:8b:7f:09",
            "net7": "b6:a5:b2:76:11:d1",
            "net8": "ee:be:83:a8:18:c1",
            "net9": "2a:76:1c:dc:a7:12"
        },
        "spine_2_1_2": {
            "net0": "5e:7e:dd:88:75:49",
            "net1": "fa:52:fa:a1:45:64",
            "net10": "b6:9c:69:fd:7a:3d",
            "net11": "42:73:6f:ab:d5:0d",
            "net12": "66:23:cc:96:40:9d",
            "net13": "de:20:1f:a7:1e:5a",
            "net14": "ea:d9:76:cb:a1:4d",
            "net15": "1a:c2:45:02:13:83",
            "net2": "4a:74:8d:23:1c:87",
            "net3": "aa:30:77:18:57:eb",
            "net4": "3e:b4:c9:f3:8e:c7",
            "net5": "c2:56:73:80:3a:2c",
            "net6": "1e:4d:bd:ca:60:1f",
            "net7": "02:54:23:95:7d:91",
            "net8": "9a:57:b6:d4:a6:a5",
            "net9": "7a:ca:ad:e0:53:b6"
        },
        "spine_2_1_3": {
            "net0": "f6:c5:0a:8f:a1:7e",
            "net1": "0a:d2:ba:c0:0f:6b",
            "net10": "3a:8f:fe:fc:62:9b",
            "net11": "c2:bb:cf:52:ba:a8",
            "net12": "fa:bf:1c:75:13:8e",
            "net13": "92:c7:b3:59:8f:ac",
            "net14": "12:18:b1:e7:9c:18",
            "net15": "52:4a:89:80:f9:78",
            "net2": "fe:49:1f:2a:19:ed",
            "net3": "c2:07:5c:cb:09:1c",
            "net4": "96:7b:c4:94:43:bd",
            "net5": "a2:42:76:94:0f:c9",
            "net6": "0a:99:49:81:64:16",
            "net7": "32:67:1a:4a:6f:c5",
            "net8": "32:05:43:fa:11:be",
            "net9": "e6:16:89:dd:80:4b"
        },
        "spine_2_1_4": {
            "net0": "ba:ca:8f:65:e4:56",
            "net1": "12:63:a4:e4:03:f0",
            "net10": "3e:9f:46:60:9d:b1",
            "net11": "72:6e:24:a0:b6:79",
            "net12": "fa:20:4f:0c:fc:f7",
            "net13": "d6:d3:f1:a5:52:54",
            "net14": "2a:51:00:1b:8e:35",
            "net15": "6e:95:e9:6d:3e:00",
            "net2": "26:a8:2e:0f:4b:fe",
            "net3": "ae:13:e4:63:c9:3e",
            "net4": "8a:d8:61:fb:6b:36",
            "net5": "22:64:c8:35:a0:7b",
            "net6": "62:ce:9b:73:24:21",
            "net7": "4a:9f:a6:ef:e1:5f",
            "net8": "da:5b:d5:c4:f3:3d",
            "net9": "8e:d9:36:e7:24:d5"
        },
        "spine_2_1_5": {
            "net0": "c2:be:95:78:d7:f5",
            "net1": "9e:da:45:2d:05:3e",
            "net10": "36:05:bb:b8:80:9a",
            "net11": "2a:f6:3b:96:5f:e5",
            "net12": "5e:7d:cf:33:8c:f5",
            "net13": "2a:1b:8e:4d:29:a5",
            "net14": "ce:b6:54:9c:e0:65",
            "net15": "ba:8f:1c:2c:ed:06",
            "net2": "16:47:23:2b:bf:7b",
            "net3": "76:1d:4c:c2:fa:08",
            "net4": "02:e5:87:8f:1e:e9",
            "net5": "76:b2:e2:49:52:73",
            "net6": "86:88:1b:78:d4:ec",
            "net7": "0e:5d:51:37:49:7c",
            "net8": "a6:37:a7:d3:67:f2",
            "net9": "86:be:90:9e:a0:f3"
        },
        "spine_2_1_6": {
            "net0": "1a:c8:81:d9:2f:c2",
            "net1": "f2:6f:8f:d0:1b:ff",
            "net10": "02:7e:ca:02:60:32",
            "net11": "b6:d5:7d:bf:dd:f0",
            "net12": "fa:06:ff:b6:10:96",
            "net13": "56:f8:67:99:04:2b",
            "net14": "4a:18:ec:5d:e9:42",
            "net15": "5e:91:49:95:b4:fc",
            "net2": "ae:1c:d6:57:8f:c4",
            "net3": "52:8d:eb:64:ce:e4",
            "net4": "b6:ee:db:f1:d4:a8",
            "net5": "46:44:e1:0f:93:c9",
            "net6": "fa:3f:35:6f:d1:63",
            "net7": "46:9f:e5:2b:5e:bb",
            "net8": "8a:c6:cf:20:a5:3c",
            "net9": "76:fd:64:9e:b0:33"
        },
        "spine_2_1_7": {
            "net0": "06:3c:a1:59:bb:30",
            "net1": "5a:00:44:de:a2:99",
            "net10": "aa:10:0b:7f:3c:34",
            "net11": "16:f7:75:49:5f:52",
            "net12": "1e:2c:3e:b0:7f:12",
            "net13": "7a:46:85:47:83:5f",
            "net14": "1e:ab:95:36:27:5c",
            "net15": "96:06:c7:ed:b2:b3",
            "net2": "86:68:53:ac:e7:06",
            "net3": "f6:a7:b5:e0:55:c8",
            "net4": "d2:67:6d:5b:8b:59",
            "net5": "8a:d6:cd:f9:b6:9e",
            "net6": "42:4e:2e:e8:db:d8",
            "net7": "56:45:12:8e:f9:78",
            "net8": "62:49:ae:f4:9a:2c",
            "net9": "7e:c6:20:8e:dc:3b"
        },
        "spine_2_1_8": {
            "net0": "2e:3a:b9:47:18:eb",
            "net1": "26:90:86:5d:8c:0e",
            "net10": "2a:5e:7b:57:00:3a",
            "net11": "c6:5e:65:ef:19:67",
            "net12": "b2:74:17:e6:c7:37",
            "net13": "d6:72:46:8b:af:94",
            "net14": "0a:5a:14:c2:76:53",
            "net15": "a6:e0:67:e6:c3:89",
            "net2": "56:98:3a:42:72:13",
            "net3": "0a:5c:a1:30:ae:93",
            "net4": "62:77:ec:dc:53:a7",
            "net5": "ae:29:09:a0:7b:e6",
            "net6": "0a:f0:04:cd:a8:44",
            "net7": "02:5c:44:38:12:fb",
            "net8": "42:f0:2a:46:40:48",
            "net9": "82:a7:19:16:9d:f4"
        },
        "spine_3_1_1": {
            "net0": "7a:6d:97:c1:76:c3",
            "net1": "7e:55:b7:95:30:80",
            "net10": "ea:bc:82:3f:4e:76",
            "net11": "da:b9:a4:68:42:c4",
            "net12": "b2:a7:c0:a0:c0:a7",
            "net13": "32:cb:d8:6c:6e:a5",
            "net14": "1e:0d:05:6d:ad:69",
            "net15": "de:63:ce:d7:cc:14",
            "net2": "ee:02:1e:56:82:c6",
            "net3": "0a:3f:8e:e5:3c:93",
            "net4": "52:c3:98:59:b5:62",
            "net5": "d6:de:d6:85:b3:eb",
            "net6": "0e:26:99:b5:57:f0",
            "net7": "9e:dd:2e:6d:c1:d0",
            "net8": "4a:cd:9f:fe:cd:b1",
            "net9": "5a:94:13:49:92:d1"
        },
        "spine_3_1_2": {
            "net0": "b6:ef:68:5d:bf:cc",
            "net1": "06:49:f3:c9:0f:3c",
            "net10": "3e:59:33:67:61:0c",
            "net11": "ae:12:d6:32:a6:73",
            "net12": "6e:af:b8:a5:f0:5d",
            "net13": "42:9b:48:e2:0f:68",
            "net14": "ee:0a:e4:bb:72:3a",
            "net15": "56:6f:75:5e:5d:71",
            "net2": "f2:af:d4:ac:c2:fa",
            "net3": "b2:cb:50:85:2d:5e",
            "net4": "26:41:17:38:70:0a",
            "net5": "92:88:e6:c4:41:f4",
            "net6": "96:91:e2:4c:8b:36",
            "net7": "12:4a:b1:52:68:80",
            "net8": "e2:09:32:56:4a:f4",
            "net9": "8e:5b:2e:f3:a6:cc"
        },
        "spine_3_1_3": {
            "net0": "a2:71:52:c0:bd:5f",
            "net1": "b2:01:04:5c:0a:1e",
            "net10": "02:2e:c3:75:7d:a9",
            "net11": "72:63:fd:45:73:e6",
            "net12": "da:1e:ea:8c:c6:5b",
            "net13": "9a:01:c7:d7:3d:3e",
            "net14": "c2:de:65:90:e6:b1",
            "net15": "2e:82:94:1e:5c:53",
            "net2": "5a:2b:d5:8e:a7:20",
            "net3": "3a:c9:d8:d4:8f:9e",
            "net4": "76:bc:23:90:c8:53",
            "net5": "2a:89:d4:91:e7:03",
            "net6": "b6:12:bf:50:b9:a9",
            "net7": "92:6a:06:ca:f7:51",
            "net8": "5e:77:fd:30:5e:0a",
            "net9": "22:96:ae:3d:f5:eb"
        },
        "spine_3_1_4": {
            "net0": "8e:52:93:5d:09:2d",
            "net1": "3a:61:ea:2f:2e:0f",
            "net10": "3a:22:11:e1:98:29",
            "net11": "82:56:ff:bf:85:02",
            "net12": "62:5e:a0:22:f3:8a",
            "net13": "ea:bf:98:e2:cd:5d",
            "net14": "2a:d6:53:b1:99:8d",
            "net15": "62:b9:bf:90:63:d0",
            "net2": "2a:ea:e7:90:fd:f6",
            "net3": "66:1f:22:9f:54:31",
            "net4": "12:d9:fb:bd:68:6c",
            "net5": "76:a5:3c:2f:a4:57",
            "net6": "f6:cf:68:f2:2a:b0",
            "net7": "96:86:17:a8:4b:5a",
            "net8": "06:15:aa:06:f3:ec",
            "net9": "e2:ea:ba:03:da:a7"
        },
        "spine_3_1_5": {
            "net0": "fa:60:85:f9:25:b5",
            "net1": "de:ac:3d:1f:b4:c1",
            "net10": "7a:e8:80:fa:ad:cd",
            "net11": "42:d0:f3:f8:e1:77",
            "net12": "02:78:b8:7d:a2:d9",
            "net13": "52:36:8d:00:b4:d5",
            "net14": "fe:54:78:65:4e:18",
            "net15": "c6:44:9d:f4:23:fd",
            "net2": "36:4a:d9:f9:4a:85",
            "net3": "32:6e:9f:ad:a4:73",
            "net4": "22:7f:02:6e:f6:30",
            "net5": "e6:8e:03:4c:1a:7e",
            "net6": "22:a5:8f:7b:6a:c7",
            "net7": "22:87:2a:e9:19:b7",
            "net8": "aa:6b:e2:6c:ac:7a",
            "net9": "02:24:05:62:76:06"
        },
        "spine_3_1_6": {
            "net0": "92:d0:3d:7c:98:9b",
            "net1": "a2:47:4c:30:71:ab",
            "net10": "66:4d:ad:84:10:4f",
            "net11": "22:a1:88:7a:61:ac",
            "net12": "22:07:6d:d3:bc:a3",
            "net13": "2a:f0:4b:e3:36:98",
            "net14": "da:fb:78:49:69:e9",
            "net15": "66:7c:25:c5:71:70",
            "net2": "be:fe:0b:70:1d:48",
            "net3": "9a:1f:39:bf:23:3e",
            "net4": "8a:0b:e9:f5:72:41",
            "net5": "e6:95:40:b6:53:ff",
            "net6": "e6:b5:2c:8e:16:20",
            "net7": "e6:98:df:e4:9d:cd",
            "net8": "0a:bf:1d:57:c7:0d",
            "net9": "a2:cf:59:cf:94:6f"
        },
        "spine_3_1_7": {
            "net0": "76:f8:e1:18:ce:9f",
            "net1": "92:6a:07:ba:44:0c",
            "net10": "42:3a:83:82:c7:4b",
            "net11": "0a:01:f7:b1:36:4b",
            "net12": "86:86:89:29:3f:d0",
            "net13": "fe:d3:51:0b:29:78",
            "net14": "c6:59:8c:97:4c:53",
            "net15": "96:03:45:5d:05:04",
            "net2": "32:94:31:95:5f:72",
            "net3": "be:47:48:a3:53:32",
            "net4": "4a:f3:8b:e7:27:52",
            "net5": "3a:0f:89:5d:b2:bb",
            "net6": "52:41:ae:ac:1b:3a",
            "net7": "da:5e:ec:fa:9a:b9",
            "net8": "9e:fd:e3:83:e4:e8",
            "net9": "22:ce:ab:67:0d:d0"
        },
        "spine_3_1_8": {
            "net0": "da:fa:47:8c:fd:25",
            "net1": "82:fb:74:83:2a:31",
            "net10": "a2:d3:84:78:6f:35",
            "net11": "2e:c4:41:45:04:bc",
            "net12": "0e:45:d6:d7:e4:40",
            "net13": "42:ab:59:02:aa:f8",
            "net14": "a2:8d:e1:2c:94:c9",
            "net15": "7a:a4:95:25:ca:fd",
            "net2": "ee:17:9c:f9:9f:f8",
            "net3": "26:2b:b1:d9:2c:48",
            "net4": "86:f5:eb:02:5a:e7",
            "net5": "22:6c:01:e3:f2:ce",
            "net6": "e6:90:d2:85:71:6b",
            "net7": "86:11:02:24:f1:73",
            "net8": "1a:29:2d:3a:e1:28",
            "net9": "a6:07:20:fb:50:28"
        },
        "spine_4_1_1": {
            "net0": "6e:7c:54:4c:0b:73",
            "net1": "86:64:95:f2:26:2a",
            "net10": "8e:80:0f:6f:39:62",
            "net11": "6e:37:b9:d0:d1:5e",
            "net12": "8a:be:f5:ae:9b:64",
            "net13": "be:0f:64:90:02:29",
            "net14": "56:01:f4:b0:e9:86",
            "net15": "8a:38:70:f6:54:c7",
            "net2": "66:49:48:f1:d2:30",
            "net3": "fe:7d:25:3a:ce:80",
            "net4": "f2:63:80:0a:46:24",
            "net5": "8a:cf:b9:26:6c:2d",
            "net6": "da:1d:37:35:a4:3c",
            "net7": "62:07:41:3f:39:88",
            "net8": "be:e7:02:f2:e0:55",
            "net9": "02:2a:e6:b5:38:48"
        },
        "spine_4_1_2": {
            "net0": "36:49:1e:cc:c7:89",
            "net1": "36:a3:a1:6a:c6:54",
            "net10": "f2:37:39:c5:fa:55",
            "net11": "da:38:2f:47:97:38",
            "net12": "ca:34:54:e9:bd:48",
            "net13": "66:05:54:74:28:fb",
            "net14": "ba:9a:c4:46:71:78",
            "net15": "b2:d6:7e:e5:42:72",
            "net2": "26:06:f6:0f:cf:53",
            "net3": "96:c3:d1:87:13:24",
            "net4": "b2:df:10:7f:f4:16",
            "net5": "1e:47:8f:48:db:21",
            "net6": "42:4e:de:1d:e8:d9",
            "net7": "ce:61:dd:ae:a7:01",
            "net8": "26:51:04:7b:d4:df",
            "net9": "7e:7e:7e:29:24:1c"
        },
        "spine_4_1_3": {
            "net0": "e2:54:8f:b0:84:47",
            "net1": "7a:76:e9:25:6a:9e",
            "net10": "ce:20:c1:15:5f:92",
            "net11": "6e:ac:bb:c8:d6:d4",
            "net12": "da:e5:ba:17:85:c7",
            "net13": "c2:14:b7:fe:ff:91",
            "net14": "f2:a4:fb:54:5b:84",
            "net15": "9e:7a:df:8d:5a:e6",
            "net2": "4a:a7:37:6f:de:5d",
            "net3": "76:f3:07:0e:40:db",
            "net4": "e6:8a:87:d5:56:62",
            "net5": "12:16:e0:82:44:70",
            "net6": "c6:df:02:e9:be:23",
            "net7": "6a:d8:5d:77:0d:e9",
            "net8": "3e:07:1b:99:a3:3f",
            "net9": "fe:22:c7:bf:4d:fe"
        },
        "spine_4_1_4": {
            "net0": "c2:10:7f:a4:4e:35",
            "net1": "76:1b:96:43:8c:a4",
            "net10": "7e:6a:bb:54:c7:aa",
            "net11": "b2:90:e6:18:5a:94",
            "net12": "06:df:a4:0d:07:fa",
            "net13": "ea:3f:f1:f4:cb:da",
            "net14": "76:ba:52:f5:be:68",
            "net15": "1e:43:46:d3:b4:ca",
            "net2": "da:22:df:a9:f6:ce",
            "net3": "5e:06:c6:ad:96:6d",
            "net4": "4e:43:eb:1f:e3:59",
            "net5": "16:78:52:78:53:4a",
            "net6": "4e:9f:b1:6e:cc:83",
            "net7": "1e:f6:83:0f:94:90",
            "net8": "0a:3d:dd:b8:0c:92",
            "net9": "d6:58:62:86:4e:14"
        },
        "spine_4_1_5": {
            "net0": "56:7c:99:ad:1f:ce",
            "net1": "2e:89:2c:18:d5:46",
            "net10": "02:42:7d:10:4a:2a",
            "net11": "7e:c5:01:4a:25:49",
            "net12": "5a:57:02:48:41:37",
            "net13": "3e:bf:7b:2b:6e:77",
            "net14": "82:e5:5d:81:97:b0",
            "net15": "f6:66:d2:e3:9f:d3",
            "net2": "9e:85:7d:3f:cc:08",
            "net3": "52:d3:cc:f1:ff:3e",
            "net4": "6e:2a:ac:14:39:15",
            "net5": "b6:2a:3e:13:54:b8",
            "net6": "7a:33:f8:57:7e:32",
            "net7": "2e:37:55:69:a1:3d",
            "net8": "22:0b:f1:92:d6:c4",
            "net9": "22:98:5b:32:cf:e5"
        },
        "spine_4_1_6": {
            "net0": "a2:bb:72:53:ac:a1",
            "net1": "e6:16:4c:99:dc:21",
            "net10": "06:12:c4:cd:5e:cb",
            "net11": "e6:52:0b:c8:11:67",
            "net12": "a6:f7:4b:b1:4d:96",
            "net13": "0a:cb:b1:10:e4:48",
            "net14": "2a:eb:d2:f0:dd:13",
            "net15": "56:25:18:63:ab:23",
            "net2": "c2:ec:53:bf:45:0f",
            "net3": "46:d0:eb:ea:7d:e8",
            "net4": "52:19:ab:e7:4b:c2",
            "net5": "f6:30:8b:28:64:68",
            "net6": "0e:fc:e2:32:75:d9",
            "net7": "32:5b:d4:9f:60:5b",
            "net8": "9e:10:ef:37:fe:cd",
            "net9": "4e:df:92:8e:5d:c4"
        },
        "spine_4_1_7": {
            "net0": "2e:5c:6a:60:5b:a5",
            "net1": "76:df:a1:10:da:a6",
            "net10": "4a:50:6f:45:58:2f",
            "net11": "1a:5e:b2:6b:97:87",
            "net12": "f6:09:34:16:50:c6",
            "net13": "fe:d3:c0:ff:93:bc",
            "net14": "be:d6:d9:c2:55:09",
            "net15": "fa:80:aa:43:a3:d6",
            "net2": "92:05:f7:c2:10:4e",
            "net3": "ae:27:a8:12:a8:9c",
            "net4": "ca:3e:7f:d5:10:45",
            "net5": "8e:51:06:e3:73:fe",
            "net6": "b2:e2:ef:d6:ec:d5",
            "net7": "92:03:26:57:eb:43",
            "net8": "3a:9d:02:bf:d5:d2",
            "net9": "aa:38:02:e2:bb:38"
        },
        "spine_4_1_8": {
            "net0": "12:3a:27:85:a3:eb",
            "net1": "06:c6:ff:89:5e:09",
            "net10": "46:46:e0:67:db:f3",
            "net11": "be:d3:0c:1e:06:b7",
            "net12": "f2:a9:c5:50:d4:5c",
            "net13": "1a:b6:24:44:f2:00",
            "net14": "d2:9e:67:f7:2a:68",
            "net15": "62:23:c6:4b:87:ea",
            "net2": "5e:a3:25:64:b1:a5",
            "net3": "8e:cc:9d:f5:73:a0",
            "net4": "72:56:d5:d9:e3:33",
            "net5": "4a:9b:69:65:ae:2c",
            "net6": "d6:8d:5e:06:6b:35",
            "net7": "26:52:26:d3:2c:75",
            "net8": "76:9d:f6:53:2f:c5",
            "net9": "fe:9c:83:25:a4:59"
        },
        "tof_1_2_1": {
            "net0": "6a:c7:8f:5b:04:3a",
            "net1": "12:de:60:87:3b:f2",
            "net10": "26:a9:ca:e0:7b:1d",
            "net11": "76:4b:d9:3d:23:12",
            "net12": "a2:63:f6:2c:19:c7",
            "net13": "9a:f2:a4:e4:30:9b",
            "net14": "62:81:02:b0:77:ed",
            "net15": "0a:16:99:3c:ca:0a",
            "net2": "3a:d9:40:2a:2b:bb",
            "net3": "c2:fc:8f:3f:25:ea",
            "net4": "da:df:d1:0b:f5:b8",
            "net5": "de:a1:d4:55:9e:f7",
            "net6": "56:83:7b:89:5e:bc",
            "net7": "12:13:d6:68:f7:1e",
            "net8": "f6:56:8e:4a:a1:99",
            "net9": "46:df:96:85:18:cf"
        },
        "tof_1_2_2": {
            "net0": "46:ac:57:6e:48:85",
            "net1": "0a:e0:51:f5:a9:ce",
            "net10": "da:33:10:b4:33:5a",
            "net11": "92:ef:9c:3e:b3:6a",
            "net12": "62:74:d3:11:4a:8c",
            "net13": "a2:81:28:eb:6b:d9",
            "net14": "8a:c6:f4:fe:a2:b8",
            "net15": "0a:1d:67:46:a0:62",
            "net2": "92:6f:4c:4d:b4:b1",
            "net3": "32:7e:ab:c1:77:76",
            "net4": "de:2a:80:62:12:f4",
            "net5": "56:48:8c:5b:05:3f",
            "net6": "d6:6c:d9:dd:d1:3b",
            "net7": "1a:02:28:46:24:75",
            "net8": "76:ea:e2:5e:fa:57",
            "net9": "fa:c5:6d:49:9f:ae"
        },
        "tof_1_2_3": {
            "net0": "e6:cf:23:3a:67:b7",
            "net1": "62:7a:6c:4d:9c:b9",
            "net10": "06:b7:9b:a4:1d:69",
            "net11": "c2:29:c7:ec:90:83",
            "net12": "4e:03:f1:67:a6:82",
            "net13": "d2:08:0b:e2:54:24",
            "net14": "ca:6e:73:64:46:0d",
            "net15": "ca:44:ed:81:78:1a",
            "net2": "4a:1e:71:a9:04:7f",
            "net3": "06:43:8a:97:9e:8e",
            "net4": "e6:d4:08:2b:b0:5e",
            "net5": "a2:b5:80:c3:98:d7",
            "net6": "92:ae:bd:1a:27:ca",
            "net7": "06:cf:19:56:bf:84",
            "net8": "ce:1b:d0:78:8a:2a",
            "net9": "be:d1:fd:e5:d9:53"
        },
        "tof_1_2_4": {
            "net0": "0a:35:50:e5:b8:ab",
            "net1": "12:44:16:77:c3:d1",
            "net10": "4e:6e:e7:d1:13:40",
            "net11": "7a:25:5d:3e:ef:df",
            "net12": "56:ff:c2:b8:1a:cf",
            "net13": "06:3d:a1:dd:f1:3b",
            "net14": "4a:93:ea:14:ac:5b",
            "net15": "1a:80:98:c6:a4:1a",
            "net2": "26:0a:90:2c:98:1a",
            "net3": "12:f0:28:1f:69:5a",
            "net4": "32:49:1a:f8:e4:40",
            "net5": "1e:b8:43:8d:6e:9e",
            "net6": "86:91:15:ce:e3:2a",
            "net7": "ce:09:20:34:be:af",
            "net8": "52:71:b4:63:c9:a7",
            "net9": "e6:da:e0:9d:aa:a2"
        },
        "tof_1_2_5": {
            "net0": "4e:59:43:68:4b:e1",
            "net1": "2a:29:39:18:ea:c4",
            "net10": "36:44:b5:33:c2:09",
            "net11": "9a:3f:8b:34:31:98",
            "net12": "32:b9:8a:69:7f:22",
            "net13": "7a:cc:f4:cb:e8:54",
            "net14": "0e:27:0c:18:dd:4f",
            "net15": "e2:cc:73:20:69:52",
            "net2": "da:1d:54:2a:1d:d4",
            "net3": "6a:9e:0d:42:58:58",
            "net4": "96:62:5f:4e:67:01",
            "net5": "f6:5b:dc:9e:39:dd",
            "net6": "86:4e:02:a4:4e:62",
            "net7": "fa:e6:56:6f:f1:a3",
            "net8": "2e:b2:20:1c:26:82",
            "net9": "fa:45:e9:e3:05:a4"
        },
        "tof_1_2_6": {
            "net0": "46:b0:a8:34:2f:6f",
            "net1": "d2:25:98:8a:10:28",
            "net10": "9a:7b:aa:ee:81:b7",
            "net11": "16:95:9e:e9:82:e8",
            "net12": "c2:ce:f2:1b:82:af",
            "net13": "c2:e9:22:d5:8c:e8",
            "net14": "ca:44:b6:58:3b:41",
            "net15": "4a:3f:dd:6d:d7:e8",
            "net2": "ca:1d:88:95:f3:32",
            "net3": "06:e8:7b:d7:c1:d9",
            "net4": "76:07:23:d0:83:2d",
            "net5": "e6:b7:9d:fe:ce:51",
            "net6": "b6:e8:8b:63:85:3f",
            "net7": "16:2c:2d:5e:4a:c1",
            "net8": "5a:28:01:46:4d:08",
            "net9": "32:4e:9a:e4:ea:25"
        },
        "tof_1_2_7": {
            "net0": "d6:77:78:d2:91:55",
            "net1": "6a:3d:41:fa:a4:16",
            "net10": "ee:c6:0f:c8:42:8f",
            "net11": "c6:c6:b4:66:dc:1c",
            "net12": "16:94:27:cb:50:7f",
            "net13": "e6:8d:7f:df:97:c4",
            "net14": "aa:3e:c6:4f:94:6e",
            "net15": "5e:4e:a0:98:46:3f",
            "net2": "4e:3a:63:81:c9:20",
            "net3": "ba:0b:89:bb:e1:9d",
            "net4": "66:68:82:25:a4:c7",
            "net5": "26:96:bb:c1:3c:27",
            "net6": "0a:8e:41:e9:28:31",
            "net7": "2a:3c:f5:6f:9e:5d",
            "net8": "b2:04:0b:3e:bc:cc",
            "net9": "c6:81:9d:60:51:49"
        },
        "tof_1_2_8": {
            "net0": "82:9d:8d:45:6c:5f",
            "net1": "0e:0f:98:4f:64:a1",
            "net10": "5e:c9:73:3f:95:40",
            "net11": "fe:f2:f9:db:fd:d3",
            "net12": "96:c7:e2:73:a6:38",
            "net13": "06:79:cf:bf:c5:59",
            "net14": "c6:a7:ab:0a:e1:2b",
            "net15": "4a:2f:80:97:75:01",
            "net2": "a2:a2:49:88:81:d5",
            "net3": "0e:d2:0a:5a:ce:77",
            "net4": "1e:91:40:45:0d:f4",
            "net5": "02:c3:63:90:db:3d",
            "net6": "36:38:53:87:d8:a2",
            "net7": "e6:d2:8b:1c:3f:07",
            "net8": "06:b6:2d:1a:a5:38",
            "net9": "62:35:74:fd:65:3a"
        },
        "tof_2_2_1": {
            "net0": "32:9f:5a:fd:2e:40",
            "net1": "4e:31:75:07:c7:71",
            "net10": "fe:0e:8f:0c:c6:ed",
            "net11": "3a:11:54:32:d5:e8",
            "net12": "46:6f:ff:df:52:76",
            "net13": "7e:9d:78:1f:8f:11",
            "net14": "06:21:b9:24:09:21",
            "net15": "fe:66:76:6b:a5:da",
            "net2": "fa:02:14:64:05:c3",
            "net3": "42:6c:bc:55:5a:53",
            "net4": "ba:3a:3d:cd:d8:e6",
            "net5": "2a:fc:e2:15:f7:8b",
            "net6": "32:28:48:af:cb:55",
            "net7": "e6:6c:28:05:38:c7",
            "net8": "de:22:6b:6e:90:39",
            "net9": "7e:66:f5:e3:88:35"
        },
        "tof_2_2_2": {
            "net0": "9e:e9:02:a7:73:de",
            "net1": "9e:92:3d:77:1c:52",
            "net10": "6a:f4:de:dd:2a:9f",
            "net11": "de:91:2f:96:e1:43",
            "net12": "b6:f0:39:71:37:ee",
            "net13": "92:35:b7:ce:e7:3b",
            "net14": "72:95:95:a7:1e:1f",
            "net15": "e2:0b:54:94:ae:95",
            "net2": "42:5f:16:38:1c:d0",
            "net3": "36:ed:6d:c0:60:3e",
            "net4": "6e:c3:c3:f3:d8:41",
            "net5": "ce:1a:a5:bb:b4:88",
            "net6": "ca:9d:6d:fc:50:de",
            "net7": "d2:14:4f:56:34:41",
            "net8": "fa:82:41:b4:02:d6",
            "net9": "0a:da:87:1e:63:47"
        },
        "tof_2_2_3": {
            "net0": "36:98:f2:07:b8:ba",
            "net1": "36:e0:c5:a7:a7:2d",
            "net10": "86:37:56:57:b0:a8",
            "net11": "f2:0e:5f:c7:32:ee",
            "net12": "1a:e8:99:0b:fe:cb",
            "net13": "3e:9f:bf:c3:45:3b",
            "net14": "92:b6:f7:0f:e2:42",
            "net15": "9a:45:b9:e8:88:98",
            "net2": "12:77:a8:1d:1a:e6",
            "net3": "b6:1c:40:56:fc:0f",
            "net4": "86:3e:03:69:e6:ee",
            "net5": "f6:60:61:95:70:12",
            "net6": "be:2e:5a:cb:c4:dd",
            "net7": "7e:7c:5d:00:af:20",
            "net8": "9e:8b:86:12:bf:3d",
            "net9": "86:ac:0d:e2:ec:ff"
        },
        "tof_2_2_4": {
            "net0": "42:02:d7:d3:b1:4c",
            "net1": "52:3b:b2:79:60:c2",
            "net10": "66:23:ac:ae:e3:4e",
            "net11": "9e:51:d0:21:c9:a3",
            "net12": "b2:f7:76:92:b2:4e",
            "net13": "a2:c3:70:9f:5d:6a",
            "net14": "9e:c9:d5:56:0f:91",
            "net15": "96:15:85:33:89:8a",
            "net2": "7a:4f:61:37:fd:ad",
            "net3": "46:fe:05:ea:ca:77",
            "net4": "42:46:99:b0:94:23",
            "net5": "46:90:05:80:b3:21",
            "net6": "c2:23:35:eb:b6:76",
            "net7": "ce:17:42:11:4f:3c",
            "net8": "e6:af:99:16:3a:c0",
            "net9": "f6:3b:30:3b:7d:41"
        },
        "tof_2_2_5": {
            "net0": "b2:5b:8d:c2:32:4e",
            "net1": "e6:34:5c:e2:2d:14",
            "net10": "46:d1:df:9c:40:8a",
            "net11": "72:fb:81:e6:12:a1",
            "net12": "3a:59:78:62:5b:48",
            "net13": "2e:77:ac:de:66:c5",
            "net14": "72:d9:64:fc:6d:f7",
            "net15": "06:2f:01:82:db:96",
            "net2": "8a:26:8f:3f:64:10",
            "net3": "2e:ba:50:a1:a3:b3",
            "net4": "86:24:78:75:cc:d0",
            "net5": "b6:94:dc:74:f1:03",
            "net6": "72:ec:be:2b:58:33",
            "net7": "82:d6:49:64:60:20",
            "net8": "7a:68:a8:cb:7a:c4",
            "net9": "2a:90:3a:02:43:e2"
        },
        "tof_2_2_6": {
            "net0": "ea:4e:47:33:d9:e9",
            "net1": "3a:bc:0b:53:25:ba",
            "net10": "6e:39:e7:28:07:45",
            "net11": "0e:3a:00:99:29:8a",
            "net12": "0e:9e:ff:7a:e7:ef",
            "net13": "8e:8d:57:88:86:24",
            "net14": "9a:45:cc:9e:05:ec",
            "net15": "4a:54:35:19:a7:53",
            "net2": "5e:bc:ed:0f:60:48",
            "net3": "6e:e5:92:73:60:82",
            "net4": "7e:59:84:e9:96:80",
            "net5": "e6:10:3c:e6:4d:5b",
            "net6": "1a:2d:41:13:7a:60",
            "net7": "82:8a:9d:5f:34:49",
            "net8": "c2:47:5e:21:3a:2d",
            "net9": "66:2d:f5:84:e1:3a"
        },
        "tof_2_2_7": {
            "net0": "8a:7f:59:10:12:64",
            "net1": "92:c5:29:a9:ad:aa",
            "net10": "2e:88:23:a1:77:d6",
            "net11": "c2:3f:aa:ac:cd:27",
            "net12": "b2:6d:2d:4d:18:c4",
            "net13": "92:c5:8b:1d:1f:d9",
            "net14": "72:af:4f:4c:a0:7b",
            "net15": "c6:f6:64:f0:c6:4e",
            "net2": "da:c2:ec:0a:e8:b8",
            "net3": "f6:fa:0f:1f:12:c3",
            "net4": "b2:11:5a:bd:80:88",
            "net5": "a2:02:99:73:98:0a",
            "net6": "36:e9:7f:ec:fd:92",
            "net7": "5a:c5:9c:57:e3:ed",
            "net8": "4e:ef:ec:0f:03:54",
            "net9": "02:a7:0f:a2:ac:47"
        },
        "tof_2_2_8": {
            "net0": "ca:60:65:9c:3f:e5",
            "net1": "6e:7a:98:1f:5e:54",
            "net10": "26:a2:54:99:4b:59",
            "net11": "62:59:a7:b6:96:a1",
            "net12": "c2:e2:7a:03:d2:b7",
            "net13": "5e:0e:9e:24:b6:2c",
            "net14": "c6:cb:76:7f:f8:7b",
            "net15": "ce:0d:35:5b:65:f8",
            "net2": "fa:96:c9:53:01:63",
            "net3": "b2:49:08:e6:bb:1b",
            "net4": "f6:91:b5:8e:e1:91",
            "net5": "fa:6c:42:7a:09:b8",
            "net6": "d6:42:3c:0e:61:a0",
            "net7": "06:e6:8a:9b:7e:3e",
            "net8": "ee:1d:a9:d6:7a:40",
            "net9": "da:dd:7f:72:ba:40"
        }
    },
    "failed_machine": "tof_1_2_1",
    "failure_time": 1616279187.9708188
}