{
    "description": "Scenario 6b: net16 link failure and recovery of spine_1_1_1 with BGP",
    "k_leaf": 16,
    "k_top": 16,
    "redundancy_factor": 16,
    "is_k8s": true,
    "machine_mac_addresses": {
        "leaf_1_0_1": {
            "net0": "4a:2f:14:78:e0:88",
            "net1": "ae:ad:30:ca:3e:11",
            "net10": "9a:2d:93:3a:a5:eb",
            "net11": "e2:88:c4:e4:2c:30",
            "net12": "96:97:3a:9e:86:2e",
            "net13": "46:43:3e:7f:61:66",
            "net14": "02:1d:a6:6b:3c:85",
            "net15": "92:e1:27:93:8f:64",
            "net16": "2a:88:ea:c3:b0:a0",
            "net2": "62:fe:b5:f8:2f:88",
            "net3": "be:78:74:86:d8:9e",
            "net4": "ca:d6:0f:83:26:85",
            "net5": "da:51:ec:c9:84:11",
            "net6": "9a:68:0f:91:18:ef",
            "net7": "da:9d:c2:24:26:c1",
            "net8": "52:71:bb:b7:25:42",
            "net9": "5a:b2:98:b4:68:12"
        },
        "leaf_1_0_10": {
            "net0": "b2:35:91:b7:18:32",
            "net1": "9a:8d:74:6c:e0:7c",
            "net10": "ce:87:6a:07:18:89",
            "net11": "7e:47:de:54:e1:11",
            "net12": "aa:7c:50:a2:60:1f",
            "net13": "5a:a3:f6:2a:ac:84",
            "net14": "7e:29:18:56:fc:12",
            "net15": "6a:37:1b:10:e5:06",
            "net16": "9a:28:2c:ab:fa:7f",
            "net2": "06:a7:46:16:5a:0a",
            "net3": "ce:4e:ea:ac:14:c8",
            "net4": "96:95:da:67:b5:e0",
            "net5": "3a:16:f1:57:ca:d6",
            "net6": "fa:f4:99:a2:1d:65",
            "net7": "2a:b7:86:e7:81:d4",
            "net8": "52:78:ab:b8:ca:93",
            "net9": "22:8c:68:a2:0b:f9"
        },
        "leaf_1_0_11": {
            "net0": "26:9a:46:ef:da:b4",
            "net1": "5e:43:33:99:9c:b7",
            "net10": "6a:ea:fc:22:c0:08",
            "net11": "06:69:37:d4:d6:09",
            "net12": "0e:6a:87:14:1c:a3",
            "net13": "1a:01:2d:2d:36:5b",
            "net14": "9a:f6:90:7d:0a:21",
            "net15": "9a:56:03:2a:af:c8",
            "net16": "3e:de:ba:59:d2:ec",
            "net2": "ea:7e:77:d2:bc:1d",
            "net3": "16:ce:1d:07:2a:43",
            "net4": "ba:7b:fa:7b:73:85",
            "net5": "9a:47:25:7a:6e:f3",
            "net6": "56:0a:78:71:e2:95",
            "net7": "be:e9:c0:81:35:1b",
            "net8": "f2:44:b9:45:7a:78",
            "net9": "ea:4a:33:27:a6:60"
        },
        "leaf_1_0_12": {
            "net0": "56:85:3e:f2:b9:92",
            "net1": "9a:4a:0a:a9:09:fb",
            "net10": "62:11:ac:df:c7:ce",
            "net11": "f6:30:c1:25:00:22",
            "net12": "ee:72:a3:1b:8e:52",
            "net13": "fa:bf:2f:ef:6a:e4",
            "net14": "ee:e1:09:5b:28:55",
            "net15": "fe:50:a5:7d:69:fc",
            "net16": "26:11:b4:ca:39:6c",
            "net2": "5e:94:54:c7:3d:4c",
            "net3": "ae:c4:33:aa:64:9b",
            "net4": "12:f6:ee:6f:44:ba",
            "net5": "b2:f9:c8:c3:64:24",
            "net6": "b2:c0:e3:77:da:18",
            "net7": "ca:02:f1:34:e4:2a",
            "net8": "82:97:5d:84:8c:b3",
            "net9": "6a:8a:ae:4a:3c:bb"
        },
        "leaf_1_0_13": {
            "net0": "3a:e7:2a:65:0c:ba",
            "net1": "82:6b:c4:54:69:b1",
            "net10": "aa:35:27:a2:97:c8",
            "net11": "b6:bc:a4:94:2b:ac",
            "net12": "6a:6b:07:ed:70:bc",
            "net13": "d2:34:fc:d0:cd:14",
            "net14": "b2:d4:01:95:73:c9",
            "net15": "e2:24:0d:7c:27:e8",
            "net16": "f6:99:df:2b:8d:2f",
            "net2": "6e:40:f5:6c:fe:76",
            "net3": "06:74:9a:e1:b5:4c",
            "net4": "8e:28:7f:fb:47:3f",
            "net5": "aa:84:c7:62:be:be",
            "net6": "b2:fa:27:6c:46:8e",
            "net7": "8e:e3:58:63:8f:23",
            "net8": "b6:e7:70:d4:87:ce",
            "net9": "de:7a:ad:6a:24:54"
        },
        "leaf_1_0_14": {
            "net0": "0e:4e:8c:cb:a1:fb",
            "net1": "e6:01:bd:f2:f8:a5",
            "net10": "ba:66:67:e0:e3:0e",
            "net11": "72:cd:ab:8b:97:0e",
            "net12": "3a:f0:e2:5b:5d:20",
            "net13": "ba:a7:62:3e:1f:14",
            "net14": "26:79:a4:07:96:62",
            "net15": "7a:7d:ab:01:0d:00",
            "net16": "4a:88:98:48:3e:e8",
            "net2": "7a:0d:d4:9a:40:a8",
            "net3": "0e:02:84:94:b5:c1",
            "net4": "2a:20:a2:39:de:06",
            "net5": "22:71:74:e8:68:f7",
            "net6": "92:bd:77:b7:0e:7d",
            "net7": "e2:c1:43:bf:ec:48",
            "net8": "92:0c:43:dc:55:42",
            "net9": "ea:80:3b:2f:86:66"
        },
        "leaf_1_0_15": {
            "net0": "62:ce:1e:ab:26:3c",
            "net1": "76:be:26:92:73:ee",
            "net10": "66:2c:81:38:0d:9a",
            "net11": "92:ff:0e:b7:8d:a1",
            "net12": "86:7b:f2:24:95:d4",
            "net13": "16:a9:56:c7:ff:ae",
            "net14": "66:3d:93:c3:e3:66",
            "net15": "0a:49:03:60:36:51",
            "net16": "c6:bc:24:1e:97:56",
            "net2": "26:1d:dd:61:99:e7",
            "net3": "e6:41:7b:83:99:51",
            "net4": "06:0a:da:22:c3:c0",
            "net5": "ee:4b:3c:ea:b2:8c",
            "net6": "ca:6b:d3:6f:78:b2",
            "net7": "16:5b:29:45:f5:e2",
            "net8": "ca:ca:19:9e:5b:d2",
            "net9": "e2:df:45:38:7e:d5"
        },
        "leaf_1_0_16": {
            "net0": "9e:a8:cd:db:76:aa",
            "net1": "6e:d0:dc:78:45:4c",
            "net10": "d6:61:aa:4b:ae:51",
            "net11": "42:db:df:be:b0:69",
            "net12": "b2:5d:74:e0:7f:76",
            "net13": "d6:d5:39:a6:60:fd",
            "net14": "ea:1c:fb:e1:b9:ff",
            "net15": "7e:f9:e7:a0:b7:ed",
            "net16": "32:26:31:2b:c5:55",
            "net2": "a6:81:ad:1d:a9:cd",
            "net3": "0a:31:05:7c:a2:22",
            "net4": "da:a9:c8:ca:11:9b",
            "net5": "fe:8f:e1:31:7c:4c",
            "net6": "62:e4:d5:56:aa:33",
            "net7": "da:ec:58:d5:51:ed",
            "net8": "16:a2:23:af:d9:e7",
            "net9": "aa:ca:89:a6:28:20"
        },
        "leaf_1_0_2": {
            "net0": "4a:62:cc:5c:3f:09",
            "net1": "6a:65:2a:ea:c3:b9",
            "net10": "d2:e2:fb:09:d0:09",
            "net11": "26:24:ac:13:16:93",
            "net12": "f6:c9:ce:3f:56:3a",
            "net13": "86:1e:7b:ff:62:4c",
            "net14": "82:d6:fa:a2:9f:50",
            "net15": "56:24:f4:68:a7:a2",
            "net16": "82:c3:58:90:2a:53",
            "net2": "2e:4a:37:7d:0a:0c",
            "net3": "da:f8:41:8e:70:6c",
            "net4": "e6:6f:4f:98:67:9c",
            "net5": "0a:8f:52:e1:e3:6f",
            "net6": "7a:38:b2:75:e1:68",
            "net7": "7a:b6:1a:dd:d0:7b",
            "net8": "66:a2:4e:84:11:b4",
            "net9": "76:e7:42:7e:54:55"
        },
        "leaf_1_0_3": {
            "net0": "9a:b3:28:c6:85:1e",
            "net1": "7a:99:c5:21:c9:dd",
            "net10": "66:27:9f:08:d3:18",
            "net11": "ca:e6:39:80:58:43",
            "net12": "b6:11:8a:35:86:96",
            "net13": "b2:f6:74:8a:2c:5a",
            "net14": "9e:a1:59:8d:77:cb",
            "net15": "de:5b:24:5c:7f:cc",
            "net16": "fe:9c:cb:8b:0d:4b",
            "net2": "42:12:e4:b4:6f:b1",
            "net3": "52:3c:d7:0c:9e:85",
            "net4": "7a:67:04:8c:01:5d",
            "net5": "b2:8c:65:3b:0f:e8",
            "net6": "7a:21:2f:68:57:50",
            "net7": "46:64:81:28:38:1b",
            "net8": "56:09:8e:26:eb:1a",
            "net9": "96:18:f7:ff:9d:bd"
        },
        "leaf_1_0_4": {
            "net0": "ce:2b:4c:07:7c:c5",
            "net1": "2e:9e:2c:61:4a:7b",
            "net10": "7e:e3:86:7b:e6:7c",
            "net11": "7a:a7:75:cf:21:85",
            "net12": "c2:0a:af:b3:23:53",
            "net13": "ba:49:a3:9f:45:f0",
            "net14": "4a:ad:d5:5c:0b:21",
            "net15": "ea:f4:11:33:d0:87",
            "net16": "1a:7d:2d:77:69:0d",
            "net2": "8a:2b:e9:ff:a7:03",
            "net3": "be:1c:8c:8d:5e:77",
            "net4": "82:02:8c:cb:5a:e7",
            "net5": "66:78:cb:3c:1c:c8",
            "net6": "d2:a9:5b:f1:ff:f6",
            "net7": "32:9e:26:a0:0d:e7",
            "net8": "fe:23:81:49:b1:94",
            "net9": "36:84:52:35:a6:7a"
        },
        "leaf_1_0_5": {
            "net0": "2a:7d:97:d2:4d:62",
            "net1": "ee:98:b8:e7:23:d8",
            "net10": "96:c2:23:6b:8c:71",
            "net11": "7a:10:55:e7:21:41",
            "net12": "ae:3b:7e:c0:3d:ff",
            "net13": "3a:34:cd:ec:ef:13",
            "net14": "52:6d:d2:11:83:07",
            "net15": "62:65:ff:c1:7c:e6",
            "net16": "ea:84:65:d0:01:16",
            "net2": "fe:5c:d0:fb:6a:92",
            "net3": "fe:d8:90:cf:54:6a",
            "net4": "a2:fc:fa:a6:8a:08",
            "net5": "7a:10:38:06:14:3c",
            "net6": "12:5b:2d:70:43:fe",
            "net7": "c6:04:b6:19:2e:61",
            "net8": "22:7f:c2:53:5e:84",
            "net9": "82:2d:58:5e:b7:85"
        },
        "leaf_1_0_6": {
            "net0": "22:d3:26:1a:32:95",
            "net1": "12:f2:5b:f2:c3:9b",
            "net10": "9a:c9:8a:e0:fe:bd",
            "net11": "0a:dc:0d:ee:9a:1e",
            "net12": "3e:9c:e5:0f:5c:eb",
            "net13": "0a:21:01:3e:b7:69",
            "net14": "86:7f:e9:20:dc:04",
            "net15": "32:31:2c:b0:0d:1c",
            "net16": "22:a0:bc:c7:b6:11",
            "net2": "7a:cf:4d:ed:20:df",
            "net3": "42:16:a2:6e:e3:63",
            "net4": "66:45:b1:a6:1f:92",
            "net5": "2e:6d:09:45:25:a8",
            "net6": "26:ef:bf:71:de:46",
            "net7": "82:89:72:fb:9f:96",
            "net8": "ae:2e:c6:2b:b4:6e",
            "net9": "32:5b:89:83:64:e0"
        },
        "leaf_1_0_7": {
            "net0": "4a:12:63:26:50:f0",
            "net1": "82:fa:ac:e2:c3:6a",
            "net10": "66:84:3b:64:89:ee",
            "net11": "ea:1a:9e:ea:4a:2d",
            "net12": "26:f8:76:74:6b:4b",
            "net13": "aa:ab:37:da:f3:f1",
            "net14": "2a:30:38:2f:4d:e3",
            "net15": "4e:4a:c9:58:a0:d2",
            "net16": "e6:ee:86:e1:79:5e",
            "net2": "16:65:6f:9a:d5:5c",
            "net3": "2a:f0:06:c8:01:f4",
            "net4": "7a:b9:6a:bc:da:c9",
            "net5": "42:4e:50:73:60:65",
            "net6": "92:db:1f:c8:12:d0",
            "net7": "36:ca:31:a1:8d:d8",
            "net8": "d2:59:e2:d0:e0:a6",
            "net9": "f2:61:25:a3:2c:0d"
        },
        "leaf_1_0_8": {
            "net0": "d6:c5:d6:6b:49:60",
            "net1": "9e:9e:cd:5b:54:c8",
            "net10": "32:3e:f6:c5:6b:d8",
            "net11": "c6:b2:2f:64:01:f4",
            "net12": "c2:a8:7c:0c:bf:c6",
            "net13": "56:af:f0:51:00:99",
            "net14": "d6:24:4e:6e:0c:a1",
            "net15": "42:1e:31:8b:77:a6",
            "net16": "7e:83:55:61:04:aa",
            "net2": "8a:58:f1:7d:67:8b",
            "net3": "7e:6b:37:1f:79:d1",
            "net4": "2a:cf:ac:76:9a:cc",
            "net5": "ca:22:64:d6:ef:16",
            "net6": "62:88:56:48:cc:ba",
            "net7": "66:be:e0:37:fd:a1",
            "net8": "be:1e:69:db:10:76",
            "net9": "0a:82:36:92:e5:23"
        },
        "leaf_1_0_9": {
            "net0": "f6:6c:de:a4:02:fe",
            "net1": "16:c9:c0:e0:eb:b3",
            "net10": "5e:3c:32:3e:85:4e",
            "net11": "fe:f1:70:27:6c:01",
            "net12": "16:6d:24:c4:46:3a",
            "net13": "9a:04:57:25:03:b8",
            "net14": "26:04:4f:8b:fa:22",
            "net15": "22:01:81:ef:b6:3d",
            "net16": "ca:8c:a6:38:10:92",
            "net2": "82:31:a5:61:c6:30",
            "net3": "3a:25:bf:c0:19:5a",
            "net4": "aa:51:8c:6b:08:96",
            "net5": "ee:ec:d8:e7:5f:10",
            "net6": "ea:21:aa:c9:12:2b",
            "net7": "fe:04:77:9f:e0:e9",
            "net8": "76:b1:e2:56:19:34",
            "net9": "fe:8e:a7:31:06:40"
        },
        "leaf_2_0_1": {
            "net0": "8e:46:43:80:74:af",
            "net1": "7e:cc:8c:d5:59:3e",
            "net10": "3e:d9:1d:44:e0:59",
            "net11": "22:bc:6b:c8:bf:77",
            "net12": "4e:d8:48:eb:7b:98",
            "net13": "02:39:20:9b:92:00",
            "net14": "96:e9:86:bc:8a:de",
            "net15": "d2:68:0c:83:ee:e9",
            "net16": "ce:4b:09:a7:90:02",
            "net2": "66:90:04:e0:47:48",
            "net3": "ae:52:00:e1:86:67",
            "net4": "92:2c:b9:0f:59:84",
            "net5": "2e:f6:f2:6e:30:31",
            "net6": "c6:04:d9:e5:a7:93",
            "net7": "6e:20:34:28:df:7d",
            "net8": "22:74:d2:e7:3d:34",
            "net9": "a2:6e:39:18:92:ef"
        },
        "leaf_2_0_10": {
            "net0": "9a:13:6a:9f:a2:7d",
            "net1": "7e:20:43:e1:40:16",
            "net10": "52:6d:86:e0:29:0b",
            "net11": "ca:01:19:99:be:d2",
            "net12": "82:3a:a5:a3:9f:65",
            "net13": "5a:01:5f:a2:b8:4b",
            "net14": "e2:4b:b0:d3:8f:47",
            "net15": "5e:47:fd:09:cb:c6",
            "net16": "ae:4d:6b:1f:13:a2",
            "net2": "d2:ae:95:10:90:3e",
            "net3": "22:dc:49:f1:24:d2",
            "net4": "8e:2e:25:45:80:b6",
            "net5": "2e:06:1e:9a:1f:14",
            "net6": "ea:58:e6:58:f9:0d",
            "net7": "76:72:63:b9:7e:36",
            "net8": "3a:b1:b0:15:55:71",
            "net9": "ea:75:3c:c8:86:98"
        },
        "leaf_2_0_11": {
            "net0": "5a:59:b7:6f:36:8a",
            "net1": "5a:30:cf:a7:31:29",
            "net10": "16:b5:2c:7a:de:ae",
            "net11": "92:f5:42:21:ed:70",
            "net12": "ce:1b:ef:d0:08:a7",
            "net13": "ae:99:fa:62:d9:f0",
            "net14": "f6:f0:ad:36:43:e9",
            "net15": "be:96:db:83:62:dc",
            "net16": "d2:50:a2:3a:d8:a2",
            "net2": "b2:05:61:43:fc:c3",
            "net3": "42:30:d5:44:ae:ed",
            "net4": "1e:a6:2a:42:1b:4c",
            "net5": "d6:e3:5e:ac:ea:dd",
            "net6": "ee:dd:e3:51:26:51",
            "net7": "4e:4b:99:f5:da:20",
            "net8": "66:8f:c1:6b:14:82",
            "net9": "f2:c5:fa:19:1d:f5"
        },
        "leaf_2_0_12": {
            "net0": "b2:14:32:58:4a:67",
            "net1": "ca:4b:68:c9:7d:69",
            "net10": "8e:f1:f2:e4:c5:d9",
            "net11": "a6:bc:bc:8d:7a:9b",
            "net12": "6e:4c:26:ca:9d:1c",
            "net13": "76:34:76:2b:71:cc",
            "net14": "56:53:dc:c2:7f:09",
            "net15": "b6:7c:44:13:4c:c7",
            "net16": "92:a9:a4:44:ff:96",
            "net2": "86:20:06:90:81:b4",
            "net3": "92:1b:de:08:c4:bc",
            "net4": "32:97:ce:e8:80:dd",
            "net5": "2a:ea:7a:5e:cf:33",
            "net6": "de:a7:2f:2c:26:03",
            "net7": "8e:b0:bc:9c:69:8a",
            "net8": "d2:b4:bc:0e:98:92",
            "net9": "66:e4:46:72:9e:11"
        },
        "leaf_2_0_13": {
            "net0": "5e:6e:09:3e:bd:69",
            "net1": "ea:5d:46:6b:92:84",
            "net10": "06:4d:74:a6:a3:7d",
            "net11": "9a:a5:25:86:bb:74",
            "net12": "76:43:cb:f3:96:f4",
            "net13": "da:f3:20:bd:2c:ee",
            "net14": "8e:13:d0:4c:6c:60",
            "net15": "92:5e:40:65:ba:15",
            "net16": "2a:73:e6:fa:9f:ee",
            "net2": "2a:a4:ff:d1:61:dd",
            "net3": "aa:fc:77:5c:c0:6e",
            "net4": "2a:17:7a:29:9f:14",
            "net5": "66:2b:fe:25:39:da",
            "net6": "6a:d4:e4:bd:83:d5",
            "net7": "4e:ad:69:df:7f:72",
            "net8": "62:ed:c4:3e:49:12",
            "net9": "ce:6b:d2:a9:4a:ed"
        },
        "leaf_2_0_14": {
            "net0": "ce:fa:54:a1:e7:49",
            "net1": "26:5e:d4:dc:76:da",
            "net10": "1e:79:c5:e2:53:f2",
            "net11": "4a:9f:3b:76:3c:e0",
            "net12": "5a:11:e0:98:60:24",
            "net13": "42:a8:2e:da:53:72",
            "net14": "4e:25:da:ee:af:db",
            "net15": "12:d5:50:b9:ab:c7",
            "net16": "5a:c4:cd:f1:f8:5f",
            "net2": "fe:76:78:a1:0f:5c",
            "net3": "5e:f7:75:e4:44:82",
            "net4": "ca:8d:d9:3a:f2:b6",
            "net5": "ee:b5:ab:a3:14:58",
            "net6": "f6:29:f9:a6:d9:fe",
            "net7": "c6:84:df:01:7b:0f",
            "net8": "6e:65:31:fb:71:7e",
            "net9": "ee:e7:c6:ca:16:af"
        },
        "leaf_2_0_15": {
            "net0": "2e:6e:e6:bd:a7:eb",
            "net1": "0e:f3:cc:22:5c:f1",
            "net10": "56:d5:29:60:16:c4",
            "net11": "56:eb:45:10:64:22",
            "net12": "c6:ec:a6:74:97:13",
            "net13": "b2:35:b8:b3:81:8e",
            "net14": "0e:c6:e8:be:3f:b8",
            "net15": "6a:37:3c:d2:e2:c1",
            "net16": "aa:27:39:66:8c:7f",
            "net2": "f2:f0:74:a8:e3:70",
            "net3": "96:3b:5d:71:bc:61",
            "net4": "d2:a0:05:88:88:55",
            "net5": "fe:4e:dd:1e:3c:b0",
            "net6": "aa:79:8d:2f:ef:af",
            "net7": "56:19:c6:5c:8e:0c",
            "net8": "e6:72:b6:8a:bb:f7",
            "net9": "76:5b:26:b8:73:50"
        },
        "leaf_2_0_16": {
            "net0": "fe:a8:45:f5:55:77",
            "net1": "82:55:3a:17:e4:8d",
            "net10": "72:56:ca:24:cf:01",
            "net11": "8a:f2:cc:b9:b8:f9",
            "net12": "7e:85:db:df:27:14",
            "net13": "ee:b9:17:7d:e5:4f",
            "net14": "12:08:c1:ab:c9:f6",
            "net15": "9e:8e:ef:bc:f0:82",
            "net16": "4e:f2:24:be:b4:6a",
            "net2": "02:9a:64:75:a8:2c",
            "net3": "a2:b2:2e:27:6f:55",
            "net4": "52:cb:70:8d:e8:df",
            "net5": "ba:f7:bf:41:c8:36",
            "net6": "3a:9f:54:aa:b0:d0",
            "net7": "ba:d2:28:51:1f:43",
            "net8": "5a:01:86:20:88:d1",
            "net9": "c6:64:7c:c8:61:16"
        },
        "leaf_2_0_2": {
            "net0": "a6:1e:d9:89:79:16",
            "net1": "ea:73:a2:af:d4:71",
            "net10": "ca:22:e3:3b:0b:80",
            "net11": "5a:db:7a:ef:b6:6d",
            "net12": "7e:75:b8:06:7f:10",
            "net13": "42:ad:91:b0:03:24",
            "net14": "6a:0e:f5:44:e6:1c",
            "net15": "06:8a:28:6a:30:91",
            "net16": "aa:dd:a9:bd:6d:ff",
            "net2": "ee:ff:df:4a:43:b7",
            "net3": "0e:f0:f9:0d:b2:57",
            "net4": "12:df:8d:45:eb:86",
            "net5": "8a:1b:54:76:d7:5f",
            "net6": "2a:c8:ce:46:33:8e",
            "net7": "9e:2a:45:86:61:37",
            "net8": "76:45:2e:69:ce:df",
            "net9": "ea:f3:73:48:d8:19"
        },
        "leaf_2_0_3": {
            "net0": "e6:07:d9:4e:16:4b",
            "net1": "f6:4f:ca:ed:e1:b4",
            "net10": "1e:1b:17:79:1e:14",
            "net11": "2e:a4:f1:d6:d5:5b",
            "net12": "e6:36:22:cd:2d:e3",
            "net13": "96:c6:56:0c:f1:61",
            "net14": "26:8d:9f:9d:2e:17",
            "net15": "de:0d:27:52:23:a3",
            "net16": "a2:f2:15:12:33:86",
            "net2": "7e:c4:1f:ff:88:5a",
            "net3": "0e:bf:3b:8a:ec:9b",
            "net4": "2e:ac:f2:30:4a:58",
            "net5": "ee:c5:fc:dd:b5:3f",
            "net6": "ba:1f:af:08:01:de",
            "net7": "7a:aa:31:19:7e:35",
            "net8": "4a:a7:41:d1:fc:51",
            "net9": "e2:ec:b4:ab:b5:aa"
        },
        "leaf_2_0_4": {
            "net0": "1a:08:41:db:fb:f8",
            "net1": "62:91:03:f3:1b:d1",
            "net10": "96:c7:a2:6a:1c:e2",
            "net11": "ee:89:a0:49:51:c2",
            "net12": "ee:83:71:3a:4a:b0",
            "net13": "82:03:f8:96:42:f8",
            "net14": "12:b5:37:91:d2:24",
            "net15": "e6:66:ba:14:b4:8b",
            "net16": "56:f6:bb:28:68:12",
            "net2": "86:ed:e3:36:a2:b2",
            "net3": "f6:91:1f:24:7f:c9",
            "net4": "aa:70:3c:da:56:21",
            "net5": "d2:fc:1d:1e:80:83",
            "net6": "8a:17:4b:1b:e5:b5",
            "net7": "82:fe:d2:fe:39:f1",
            "net8": "ce:4f:cb:e4:36:d7",
            "net9": "5e:e5:be:a7:e7:93"
        },
        "leaf_2_0_5": {
            "net0": "a6:68:94:c6:49:a2",
            "net1": "3a:a6:96:cc:09:97",
            "net10": "1e:20:37:de:b8:c4",
            "net11": "ea:b1:b0:cf:14:b3",
            "net12": "52:df:4d:fd:ac:8e",
            "net13": "2a:54:98:3f:30:72",
            "net14": "8a:02:ae:d9:97:80",
            "net15": "32:6f:56:06:c1:66",
            "net16": "c6:b9:19:a4:7b:c0",
            "net2": "0a:6b:c1:98:b5:a1",
            "net3": "b6:e4:13:22:64:27",
            "net4": "f2:22:7d:e0:b6:d4",
            "net5": "8e:d5:76:57:c0:fb",
            "net6": "52:79:4d:68:6b:56",
            "net7": "92:58:8e:40:30:aa",
            "net8": "82:55:75:48:37:d3",
            "net9": "0e:d3:9e:2f:20:6c"
        },
        "leaf_2_0_6": {
            "net0": "ee:d9:96:28:ef:d6",
            "net1": "36:e1:e6:12:01:5f",
            "net10": "ae:86:f2:f5:84:0e",
            "net11": "02:60:a3:7c:a0:80",
            "net12": "1a:92:98:4a:96:77",
            "net13": "3a:c3:a2:27:ef:76",
            "net14": "6a:24:d3:31:83:74",
            "net15": "86:5a:5e:8f:6b:c6",
            "net16": "52:0b:e7:f1:8d:6e",
            "net2": "4a:64:55:11:fc:cd",
            "net3": "7e:e7:4b:63:b6:a4",
            "net4": "ee:95:15:c4:e0:26",
            "net5": "de:32:d6:5f:61:ae",
            "net6": "62:b3:69:b9:b6:0c",
            "net7": "16:e0:20:9c:8b:db",
            "net8": "96:df:1b:75:7f:ad",
            "net9": "c2:71:62:0d:8f:28"
        },
        "leaf_2_0_7": {
            "net0": "92:d1:7f:bd:66:00",
            "net1": "3e:b1:a0:54:51:5b",
            "net10": "2a:8a:cd:32:38:0e",
            "net11": "9a:85:5d:9b:3f:58",
            "net12": "4e:db:94:8f:44:02",
            "net13": "36:d3:ec:90:ec:37",
            "net14": "da:04:8e:eb:79:d4",
            "net15": "32:08:30:97:64:45",
            "net16": "22:b8:cd:84:7c:af",
            "net2": "5a:b2:9d:11:0d:d7",
            "net3": "d2:a8:05:29:57:c5",
            "net4": "2e:b1:e1:79:53:41",
            "net5": "1a:ea:bf:e5:a7:be",
            "net6": "ce:3b:56:4a:00:4d",
            "net7": "1e:e3:ab:a2:eb:d8",
            "net8": "8e:aa:63:bb:f7:ef",
            "net9": "26:d4:39:58:5e:9a"
        },
        "leaf_2_0_8": {
            "net0": "86:01:48:c0:82:c4",
            "net1": "4a:02:75:8c:ef:bc",
            "net10": "02:81:7f:d5:fe:b3",
            "net11": "7e:0e:21:a5:89:fa",
            "net12": "0a:39:5e:d2:6a:b5",
            "net13": "a6:0e:2f:96:2c:6f",
            "net14": "b2:66:62:cf:ab:d4",
            "net15": "6a:73:31:8d:7b:59",
            "net16": "ca:b2:90:62:31:c6",
            "net2": "e2:6a:64:1f:51:09",
            "net3": "a6:d5:d6:79:bb:b6",
            "net4": "e2:d1:55:92:4e:d6",
            "net5": "76:5a:b5:10:cd:73",
            "net6": "de:0a:e1:52:8e:9e",
            "net7": "26:81:42:4d:05:06",
            "net8": "42:6b:d7:1f:e4:55",
            "net9": "92:bf:24:95:fa:14"
        },
        "leaf_2_0_9": {
            "net0": "ae:69:03:2a:de:62",
            "net1": "0e:5e:fa:ed:f2:a9",
            "net10": "32:e7:e3:5c:cb:03",
            "net11": "b6:47:86:fa:95:72",
            "net12": "0e:9a:00:b9:47:82",
            "net13": "32:3a:c4:eb:97:c8",
            "net14": "e2:1d:86:01:85:89",
            "net15": "3e:96:51:74:99:d4",
            "net16": "5e:e6:a1:b9:26:97",
            "net2": "0a:4d:83:3a:4f:db",
            "net3": "02:9c:43:b9:b3:43",
            "net4": "7a:99:3d:9f:b7:09",
            "net5": "42:8d:06:82:fb:4b",
            "net6": "32:53:64:e6:97:c4",
            "net7": "62:0b:0c:b3:94:b1",
            "net8": "1e:b3:ac:9b:ba:07",
            "net9": "b2:97:13:ae:64:9f"
        },
        "spine_1_1_1": {
            "net0": "5a:84:ac:ab:d7:12",
            "net1": "1e:57:21:b3:85:8b",
            "net10": "22:96:a1:9f:92:0a",
            "net11": "16:56:25:03:64:57",
            "net12": "ba:4c:f8:e2:91:a2",
            "net13": "c2:b5:26:c7:9e:45",
            "net14": "ca:68:c2:74:8a:d9",
            "net15": "8a:4e:ed:d3:b7:4c",
            "net16": "ae:ca:e4:99:ea:2f",
            "net17": "76:bd:a6:ef:1d:e2",
            "net18": "6a:28:2e:3a:cd:c3",
            "net19": "a6:21:13:85:f4:d2",
            "net2": "6e:eb:95:69:cd:76",
            "net20": "32:9b:14:43:28:41",
            "net21": "0e:6f:5d:32:59:5b",
            "net22": "1e:cd:75:48:7f:f0",
            "net23": "7a:bf:0f:ce:3f:3c",
            "net24": "ae:4e:c7:8e:00:03",
            "net25": "26:16:dd:20:c1:ee",
            "net26": "5e:f0:25:7b:19:b9",
            "net27": "a2:28:71:4b:91:0e",
            "net28": "16:6c:32:7a:bc:1a",
            "net29": "46:a7:13:8a:89:f4",
            "net3": "d2:07:ec:8a:93:5d",
            "net30": "de:ca:90:63:b5:d8",
            "net31": "da:e0:42:9c:50:6e",
            "net4": "12:f5:35:a5:08:7b",
            "net5": "46:5f:d7:d5:5d:48",
            "net6": "ea:79:72:ac:fc:fb",
            "net7": "22:ba:dd:75:a4:a5",
            "net8": "be:86:e6:ae:3b:b4",
            "net9": "66:ea:01:74:d3:3a"
        },
        "spine_1_1_10": {
            "net0": "1a:2d:2e:45:cd:01",
            "net1": "06:86:d8:a3:3c:33",
            "net10": "4a:71:50:84:d1:35",
            "net11": "62:84:39:33:de:82",
            "net12": "12:b1:f8:55:52:9e",
            "net13": "9a:29:75:d1:da:13",
            "net14": "5a:2c:b9:95:a1:ea",
            "net15": "c6:5b:df:df:0f:fa",
            "net16": "f6:f2:75:d0:f5:19",
            "net17": "d2:11:e9:fa:91:2b",
            "net18": "02:02:0f:7a:9c:8d",
            "net19": "36:11:ef:96:da:62",
            "net2": "a6:bf:d5:ab:05:59",
            "net20": "d2:5a:41:21:33:32",
            "net21": "22:6c:37:8e:19:dd",
            "net22": "2a:64:74:b0:b6:7e",
            "net23": "fa:7c:08:f7:70:16",
            "net24": "d6:d1:4d:d5:94:99",
            "net25": "1a:e1:fb:5c:4b:d8",
            "net26": "c6:76:f3:59:15:67",
            "net27": "fe:bf:77:54:8a:cb",
            "net28": "02:10:37:ad:6c:fc",
            "net29": "a6:57:50:8d:a0:5f",
            "net3": "aa:ae:a6:8d:de:50",
            "net30": "a6:ef:19:07:30:eb",
            "net31": "92:1d:39:93:e1:29",
            "net4": "ee:36:72:3e:00:7a",
            "net5": "02:1b:53:44:f3:62",
            "net6": "8a:21:47:d6:17:cc",
            "net7": "06:2b:94:a2:7a:fc",
            "net8": "f6:d1:3f:95:4f:2f",
            "net9": "0a:ee:f9:21:7c:db"
        },
        "spine_1_1_11": {
            "net0": "5a:d0:3e:1d:38:7f",
            "net1": "d6:81:41:a5:e6:26",
            "net10": "f6:87:26:06:e0:32",
            "net11": "2a:5e:73:70:d8:f2",
            "net12": "ce:7a:d4:6f:d2:f1",
            "net13": "6a:3a:6e:a5:9d:b7",
            "net14": "56:34:aa:71:26:bd",
            "net15": "b2:1f:0d:37:85:ce",
            "net16": "e6:71:8f:79:71:7c",
            "net17": "ae:c8:74:2f:af:77",
            "net18": "16:ad:24:6f:99:2b",
            "net19": "46:11:91:ee:0f:8a",
            "net2": "ea:af:41:e2:81:6c",
            "net20": "4a:07:f4:9c:35:93",
            "net21": "fa:6e:49:ef:83:2f",
            "net22": "be:d6:91:a4:f2:0d",
            "net23": "4e:9c:f7:34:63:be",
            "net24": "9e:c7:b3:b3:ca:36",
            "net25": "e2:84:d4:5f:3c:53",
            "net26": "a6:e6:ed:9c:5e:c8",
            "net27": "62:26:37:1d:c4:e2",
            "net28": "a6:6f:9d:c8:0e:cc",
            "net29": "22:c5:5f:56:0f:ff",
            "net3": "4e:ad:fc:fa:47:d8",
            "net30": "02:10:75:db:21:74",
            "net31": "52:de:51:23:8f:a6",
            "net4": "22:e8:62:08:f0:c8",
            "net5": "5a:05:12:37:ab:f2",
            "net6": "42:88:c2:67:d1:1a",
            "net7": "06:e5:a0:d4:cd:29",
            "net8": "66:e9:fc:b0:bd:d6",
            "net9": "f2:3d:cf:1f:8c:60"
        },
        "spine_1_1_12": {
            "net0": "ca:06:58:67:a5:9f",
            "net1": "66:11:c5:60:49:9f",
            "net10": "da:0b:bd:45:c7:8c",
            "net11": "02:fd:f8:36:00:91",
            "net12": "b6:a2:d4:9b:92:4e",
            "net13": "22:5b:99:1f:3c:f8",
            "net14": "de:0f:f5:90:fb:d0",
            "net15": "ae:b3:17:3c:45:90",
            "net16": "aa:7d:f7:4b:41:5c",
            "net17": "72:6b:56:6e:e9:91",
            "net18": "0e:de:12:21:79:f9",
            "net19": "ba:44:55:36:dd:23",
            "net2": "26:7d:2c:ee:a1:ae",
            "net20": "b6:fb:df:98:7b:b4",
            "net21": "3a:24:7a:ff:c2:6e",
            "net22": "52:e4:73:78:a2:b7",
            "net23": "ea:7c:80:68:a4:2c",
            "net24": "7a:66:25:a1:e5:fe",
            "net25": "ee:1c:ec:3f:48:4b",
            "net26": "3e:46:0d:69:ce:ea",
            "net27": "62:54:62:bc:2d:5c",
            "net28": "6e:6c:79:0a:de:78",
            "net29": "ae:6d:2a:8c:b6:2e",
            "net3": "3e:b3:5e:d7:9a:e3",
            "net30": "e2:43:d3:1b:93:6e",
            "net31": "72:b8:33:60:3b:ad",
            "net4": "de:be:26:96:f3:e1",
            "net5": "56:76:19:b6:8e:af",
            "net6": "d6:66:51:13:07:96",
            "net7": "ae:f4:b0:3e:12:95",
            "net8": "be:6f:3e:42:9a:16",
            "net9": "86:b6:2a:6f:cf:a6"
        },
        "spine_1_1_13": {
            "net0": "f6:4f:5d:19:51:f8",
            "net1": "ce:2c:ec:00:f6:e4",
            "net10": "26:1d:df:86:df:53",
            "net11": "ca:ff:ff:c3:2e:91",
            "net12": "76:24:e4:62:d3:98",
            "net13": "3e:de:9f:73:de:38",
            "net14": "be:df:2e:52:f5:ac",
            "net15": "ce:40:fd:24:2c:55",
            "net16": "b2:2c:f2:f7:7c:ad",
            "net17": "76:5c:20:64:88:7f",
            "net18": "d2:51:60:15:f3:d0",
            "net19": "1a:f9:88:ee:63:cb",
            "net2": "12:7e:41:7b:3a:8b",
            "net20": "3a:5e:3a:a5:db:2f",
            "net21": "26:8c:69:f2:3a:3e",
            "net22": "e2:94:a2:b6:42:bd",
            "net23": "ea:26:89:9d:2e:e3",
            "net24": "22:2f:6c:1c:42:cc",
            "net25": "aa:55:a6:30:92:65",
            "net26": "1e:42:70:e3:34:32",
            "net27": "4a:89:b9:75:ef:b7",
            "net28": "c6:2f:60:50:25:86",
            "net29": "c2:51:9d:20:0d:68",
            "net3": "2a:ba:d8:a8:50:f1",
            "net30": "3e:f8:8f:1a:ac:f1",
            "net31": "06:36:89:53:13:1e",
            "net4": "f2:39:56:1a:80:88",
            "net5": "ce:49:0f:11:2b:fa",
            "net6": "7a:7f:dc:84:49:71",
            "net7": "96:9c:02:7a:13:dc",
            "net8": "a2:ed:b0:7f:1f:74",
            "net9": "f6:92:ab:80:51:61"
        },
        "spine_1_1_14": {
            "net0": "e2:d2:79:bb:ef:d1",
            "net1": "32:37:22:a5:3b:ff",
            "net10": "a2:b8:49:3a:6a:7f",
            "net11": "4e:37:cf:f9:8c:84",
            "net12": "d2:ef:0a:b1:c1:0b",
            "net13": "ca:af:a4:ec:dc:91",
            "net14": "fe:39:99:13:3d:f5",
            "net15": "f6:53:fa:29:58:64",
            "net16": "82:52:a2:48:42:23",
            "net17": "2a:c6:07:c2:a4:1e",
            "net18": "2e:26:c0:24:c6:0e",
            "net19": "4e:82:7a:7d:68:7a",
            "net2": "7a:ad:7f:f8:4b:c2",
            "net20": "ca:4d:98:fa:f5:d0",
            "net21": "36:71:d3:27:63:f6",
            "net22": "36:98:3d:7d:8d:91",
            "net23": "32:4a:a2:1d:53:e4",
            "net24": "22:54:2f:bc:b2:84",
            "net25": "f6:a1:f7:75:b1:00",
            "net26": "ea:ed:1a:8a:fe:cb",
            "net27": "72:27:33:91:68:19",
            "net28": "6a:15:36:80:e9:29",
            "net29": "d2:f2:59:4e:4b:19",
            "net3": "3a:14:1a:04:f2:7a",
            "net30": "de:94:99:61:b5:3a",
            "net31": "1e:7b:be:eb:82:6e",
            "net4": "5e:fd:b0:8c:32:be",
            "net5": "8e:b5:4d:a3:d2:ca",
            "net6": "76:2d:90:e9:ae:78",
            "net7": "f6:f6:50:b9:bd:86",
            "net8": "2e:b1:1a:d0:ec:11",
            "net9": "6a:24:dd:76:fc:2d"
        },
        "spine_1_1_15": {
            "net0": "be:c1:30:94:e6:4b",
            "net1": "be:03:27:0d:60:2d",
            "net10": "4e:05:ce:ac:5e:65",
            "net11": "9a:d5:c3:ac:f0:3e",
            "net12": "42:72:44:b6:d7:3a",
            "net13": "42:21:13:29:2e:8b",
            "net14": "f2:f5:64:83:70:4a",
            "net15": "de:5b:a8:06:d0:dd",
            "net16": "66:aa:8c:f7:4e:cd",
            "net17": "fe:15:63:0f:8f:d2",
            "net18": "36:bc:4b:b4:f1:b6",
            "net19": "02:b0:c8:5d:0c:c9",
            "net2": "0a:ae:8a:dc:33:aa",
            "net20": "0a:66:e8:28:c6:8c",
            "net21": "b2:7c:03:e7:e2:a2",
            "net22": "8e:ea:b8:e7:ba:b7",
            "net23": "56:e4:2c:20:22:7c",
            "net24": "0a:2a:7a:13:9e:d1",
            "net25": "de:9e:26:96:3e:23",
            "net26": "ea:ab:f2:12:2a:49",
            "net27": "5a:d8:1a:48:61:15",
            "net28": "82:1e:26:a2:b3:1b",
            "net29": "26:9b:9c:00:36:2c",
            "net3": "9e:fc:02:f5:4d:a9",
            "net30": "8e:f5:b3:c2:1f:41",
            "net31": "de:a4:29:0e:ff:22",
            "net4": "f6:4a:6a:4b:6c:62",
            "net5": "8a:49:4f:f2:22:4a",
            "net6": "ca:67:6e:bd:11:ab",
            "net7": "36:4e:75:6b:98:8a",
            "net8": "b2:74:d3:91:a1:a8",
            "net9": "c6:e8:0e:15:dd:1a"
        },
        "spine_1_1_16": {
            "net0": "7a:26:45:81:83:d9",
            "net1": "5a:2a:cd:7c:1b:2e",
            "net10": "0a:4e:d9:d6:42:76",
            "net11": "6a:d3:ac:54:53:45",
            "net12": "c2:be:32:17:83:ea",
            "net13": "ee:e6:86:a8:12:7d",
            "net14": "9e:c4:08:60:fc:4b",
            "net15": "96:66:a2:e6:cc:a8",
            "net16": "36:da:eb:0a:79:5f",
            "net17": "f2:8a:50:95:ab:d7",
            "net18": "0a:83:a9:2d:e4:94",
            "net19": "8e:4e:9f:0a:b9:7c",
            "net2": "5e:c8:65:f0:af:aa",
            "net20": "d2:17:e2:29:ec:49",
            "net21": "3a:60:7f:0c:73:ef",
            "net22": "8a:3c:f6:a2:08:d7",
            "net23": "6e:8c:1a:20:59:3c",
            "net24": "de:50:5a:28:ae:f1",
            "net25": "1a:25:81:55:a9:d5",
            "net26": "b6:20:38:cc:12:cc",
            "net27": "a6:48:2c:0e:54:63",
            "net28": "62:ec:03:42:4d:23",
            "net29": "b6:88:cd:c7:4b:04",
            "net3": "8e:48:e1:11:9a:96",
            "net30": "ea:8e:55:45:0f:9a",
            "net31": "ce:d6:94:ba:7a:80",
            "net4": "c2:44:74:24:29:e7",
            "net5": "72:a1:c5:4e:06:8f",
            "net6": "26:14:6f:41:61:ed",
            "net7": "a6:c3:89:61:33:e9",
            "net8": "ca:b5:f3:04:a3:da",
            "net9": "0a:99:43:74:57:54"
        },
        "spine_1_1_2": {
            "net0": "ae:70:a6:ff:fd:bf",
            "net1": "a6:7e:1a:e3:d8:ae",
            "net10": "7e:ca:d0:ea:b1:d8",
            "net11": "0e:ee:d6:12:7c:8d",
            "net12": "ea:53:11:0c:f7:d7",
            "net13": "c2:c6:5d:11:3b:37",
            "net14": "02:47:21:fe:45:7f",
            "net15": "3a:f0:c9:2d:b2:49",
            "net16": "f6:c3:60:62:6f:f5",
            "net17": "ca:0b:ba:21:42:3a",
            "net18": "62:a2:38:04:bb:22",
            "net19": "36:99:04:e4:b3:ec",
            "net2": "f2:25:c0:f8:b5:c5",
            "net20": "22:78:fd:74:18:13",
            "net21": "4a:54:43:10:97:c2",
            "net22": "9e:8a:75:b2:56:10",
            "net23": "8e:26:21:29:81:40",
            "net24": "6a:8c:5f:e3:99:69",
            "net25": "f6:44:3d:31:24:4a",
            "net26": "a2:53:0a:ec:74:93",
            "net27": "22:e1:7b:0f:c0:a5",
            "net28": "0a:eb:67:8e:bd:9b",
            "net29": "4e:43:5c:6c:bc:d8",
            "net3": "c2:33:a5:b8:e5:d1",
            "net30": "56:11:5a:58:26:cc",
            "net31": "fa:bd:d8:cc:7d:79",
            "net4": "5a:2b:ba:d7:81:a3",
            "net5": "4e:07:ba:e2:6a:b2",
            "net6": "26:d1:8a:67:ff:f9",
            "net7": "ea:e2:9c:3e:ba:2b",
            "net8": "e6:6f:59:53:ba:bd",
            "net9": "82:18:16:c0:2a:04"
        },
        "spine_1_1_3": {
            "net0": "8a:d0:9c:a0:0c:ad",
            "net1": "d6:d4:33:e1:f1:f4",
            "net10": "22:76:e3:38:82:c8",
            "net11": "4e:9c:95:5c:07:16",
            "net12": "06:34:50:99:82:7e",
            "net13": "5a:5b:22:e5:6c:d5",
            "net14": "fa:f0:24:01:d4:95",
            "net15": "fe:c7:68:f6:24:06",
            "net16": "42:8b:46:c4:23:67",
            "net17": "66:a6:9b:8e:14:a7",
            "net18": "d2:e8:db:4f:1c:71",
            "net19": "7e:00:a9:7f:15:70",
            "net2": "06:61:58:1d:cc:98",
            "net20": "f6:64:b8:7f:3e:01",
            "net21": "96:a9:c8:11:31:31",
            "net22": "36:7a:f8:d7:3a:60",
            "net23": "7a:4a:d4:9b:80:32",
            "net24": "d6:66:69:f1:bb:61",
            "net25": "ea:f3:48:a3:76:18",
            "net26": "e6:1f:93:e6:79:fa",
            "net27": "fe:4c:be:d8:7e:a8",
            "net28": "c2:82:f0:c9:70:06",
            "net29": "b2:75:ed:b1:a4:30",
            "net3": "d6:e0:a5:e3:c7:64",
            "net30": "b2:ec:b0:88:43:15",
            "net31": "c6:d7:e0:60:ba:36",
            "net4": "fa:67:6c:4a:78:e8",
            "net5": "c6:eb:ba:cc:5d:4a",
            "net6": "32:c4:86:56:59:7d",
            "net7": "d2:61:22:41:2e:d9",
            "net8": "fe:50:e1:af:5d:7d",
            "net9": "f6:e5:8d:1b:b5:55"
        },
        "spine_1_1_4": {
            "net0": "2a:e6:68:19:ef:4b",
            "net1": "0e:29:9e:3d:c2:eb",
            "net10": "1e:87:e2:02:c0:ff",
            "net11": "72:be:5e:a5:48:8e",
            "net12": "f6:a3:10:6e:1b:78",
            "net13": "8e:31:c7:aa:5d:cb",
            "net14": "b2:fe:2c:26:cb:66",
            "net15": "26:7f:80:67:58:90",
            "net16": "06:29:29:a2:49:5d",
            "net17": "96:95:5b:2b:d7:f1",
            "net18": "a2:69:e0:3d:f9:8a",
            "net19": "22:de:8d:f4:30:92",
            "net2": "0a:0e:08:a6:79:cb",
            "net20": "1a:e7:03:4f:96:b1",
            "net21": "32:df:84:0c:76:80",
            "net22": "6e:5a:35:14:e1:db",
            "net23": "96:c6:ea:3f:fb:c8",
            "net24": "a6:52:28:be:9e:4c",
            "net25": "62:5b:c2:5f:34:9a",
            "net26": "a6:ad:94:ce:5d:b6",
            "net27": "96:be:3e:8a:ba:b8",
            "net28": "2e:22:24:73:76:72",
            "net29": "2a:2d:9f:61:53:0a",
            "net3": "9a:47:1c:dd:a7:ad",
            "net30": "76:81:01:8c:cc:c7",
            "net31": "0a:6d:55:2e:53:7c",
            "net4": "5e:56:da:75:38:aa",
            "net5": "56:c9:d8:ec:d4:61",
            "net6": "42:72:b8:5f:48:0b",
            "net7": "be:dc:14:a5:b9:cd",
            "net8": "02:97:21:5f:d3:e1",
            "net9": "e6:c5:5d:0a:db:73"
        },
        "spine_1_1_5": {
            "net0": "8a:87:35:4e:71:f5",
            "net1": "e6:f1:9b:38:c8:f4",
            "net10": "6e:03:d8:69:88:94",
            "net11": "ee:a3:78:9f:7d:de",
            "net12": "e2:a7:64:6a:86:7d",
            "net13": "86:57:a7:56:24:87",
            "net14": "92:6a:ae:b3:bf:48",
            "net15": "f6:49:d6:1e:e1:b1",
            "net16": "7e:95:73:b0:ac:44",
            "net17": "42:02:1d:c8:03:8b",
            "net18": "ce:35:cb:9e:b6:5a",
            "net19": "1e:e6:ff:60:25:81",
            "net2": "22:75:11:67:76:e8",
            "net20": "a6:52:fd:c8:e3:28",
            "net21": "7e:45:ba:2a:90:16",
            "net22": "72:f8:4f:e1:8c:80",
            "net23": "ba:3c:86:32:27:3d",
            "net24": "d2:b0:3e:29:97:8e",
            "net25": "12:ef:39:db:69:6c",
            "net26": "c6:3b:4c:bc:f2:1d",
            "net27": "8a:6e:ba:09:15:56",
            "net28": "92:56:fe:51:ea:2c",
            "net29": "b2:24:53:26:68:ca",
            "net3": "3e:48:cc:c1:99:1a",
            "net30": "62:f6:43:52:e8:96",
            "net31": "3e:1a:cf:49:98:db",
            "net4": "5a:84:ad:3f:e5:bd",
            "net5": "9a:1b:2c:2a:0f:40",
            "net6": "ea:01:1d:88:0d:0d",
            "net7": "b2:e9:ab:c0:3c:49",
            "net8": "de:5b:f7:83:cb:7d",
            "net9": "e6:0d:60:01:53:98"
        },
        "spine_1_1_6": {
            "net0": "5e:60:ee:1e:d9:c2",
            "net1": "1e:1a:e3:f7:26:aa",
            "net10": "3a:4f:f6:91:51:48",
            "net11": "56:b8:68:8f:d3:cb",
            "net12": "8e:0b:2b:93:d1:35",
            "net13": "4e:02:d2:90:92:a5",
            "net14": "7a:5d:72:73:3f:4f",
            "net15": "06:5c:66:1b:fd:24",
            "net16": "be:60:4b:b2:b6:71",
            "net17": "16:7b:d2:61:39:c0",
            "net18": "fe:88:41:8c:45:6c",
            "net19": "3e:24:59:ed:a5:6c",
            "net2": "aa:5c:ce:3d:93:ea",
            "net20": "5e:96:89:d8:aa:42",
            "net21": "b6:4f:6c:36:c7:51",
            "net22": "82:86:d7:62:4e:a6",
            "net23": "8e:29:20:cc:67:59",
            "net24": "f2:24:b7:7a:8e:17",
            "net25": "ba:3c:60:e6:e2:8f",
            "net26": "ae:bd:ff:c6:ed:3d",
            "net27": "4a:b8:d0:12:ed:6d",
            "net28": "1a:e4:b4:58:dd:e4",
            "net29": "f2:47:e3:7d:4c:05",
            "net3": "66:75:52:f0:21:35",
            "net30": "a6:27:aa:9f:19:89",
            "net31": "5a:ec:ca:7b:bc:45",
            "net4": "da:c3:ab:78:da:28",
            "net5": "de:47:02:03:ff:60",
            "net6": "b2:19:80:1c:b7:3d",
            "net7": "62:3a:08:40:4d:0b",
            "net8": "4a:80:b5:d8:c6:7c",
            "net9": "f6:84:81:0e:af:00"
        },
        "spine_1_1_7": {
            "net0": "d2:58:e5:9b:eb:ad",
            "net1": "ae:01:2b:b7:5a:6a",
            "net10": "8a:49:2f:4f:9e:0b",
            "net11": "2a:4d:af:e9:2a:65",
            "net12": "4e:ae:17:a2:f2:c3",
            "net13": "f2:f3:4f:bc:1c:0e",
            "net14": "66:bb:56:4b:a3:a2",
            "net15": "82:ef:82:73:f7:b5",
            "net16": "ae:95:a3:db:80:63",
            "net17": "d2:50:df:64:4f:d8",
            "net18": "a6:ac:98:7e:ce:91",
            "net19": "66:fb:ed:5a:a8:dd",
            "net2": "76:33:9d:11:3e:15",
            "net20": "c2:91:0e:9c:a5:d0",
            "net21": "9a:0e:c0:8b:c9:75",
            "net22": "02:a2:25:56:a1:a1",
            "net23": "ba:e7:dd:10:64:2e",
            "net24": "e2:a4:2a:49:c5:9f",
            "net25": "8a:94:1d:c6:4b:fc",
            "net26": "fe:44:c2:9d:5f:82",
            "net27": "8e:84:03:99:f6:fa",
            "net28": "02:c9:d3:4b:14:2e",
            "net29": "86:68:f3:ae:7b:32",
            "net3": "7a:f4:dd:23:60:9c",
            "net30": "9e:42:b0:68:83:87",
            "net31": "ca:49:16:8a:22:b8",
            "net4": "5e:62:89:ef:11:6b",
            "net5": "7a:1d:58:41:47:25",
            "net6": "56:78:3a:75:e0:81",
            "net7": "66:91:d9:69:91:ec",
            "net8": "6a:49:aa:51:6b:d2",
            "net9": "a2:b6:97:11:67:ae"
        },
        "spine_1_1_8": {
            "net0": "f6:a4:2a:7c:70:ee",
            "net1": "e6:c8:95:22:ba:2d",
            "net10": "b6:c2:c8:06:7f:f9",
            "net11": "22:d2:31:e6:3d:c8",
            "net12": "aa:04:66:54:56:9a",
            "net13": "9e:ad:1b:3f:7d:08",
            "net14": "f2:55:d2:7b:b3:99",
            "net15": "fa:25:e1:39:94:23",
            "net16": "de:59:3d:1e:f9:e3",
            "net17": "ae:e5:d4:3b:1f:b9",
            "net18": "c6:ab:82:42:46:94",
            "net19": "f2:12:ec:99:d2:6a",
            "net2": "4e:fb:59:37:ae:0e",
            "net20": "ea:b7:3e:7d:9b:50",
            "net21": "86:23:ca:99:a4:b4",
            "net22": "9e:85:25:7c:9b:91",
            "net23": "f6:b6:08:2c:50:b1",
            "net24": "4e:14:1e:4a:72:35",
            "net25": "e2:3c:8b:82:79:47",
            "net26": "d6:86:83:f2:be:7f",
            "net27": "2a:10:13:36:5d:24",
            "net28": "5a:55:56:1d:51:ca",
            "net29": "aa:ec:a1:e8:16:02",
            "net3": "aa:df:28:65:c8:74",
            "net30": "2e:3e:f0:4d:df:b9",
            "net31": "8a:df:c2:25:0c:3c",
            "net4": "ce:1e:32:3e:02:c3",
            "net5": "1e:c3:f8:91:f7:2c",
            "net6": "06:a4:c0:1b:97:db",
            "net7": "ce:e1:6f:a6:09:85",
            "net8": "ae:2a:f8:18:6d:52",
            "net9": "0a:00:df:83:09:cb"
        },
        "spine_1_1_9": {
            "net0": "52:0e:2d:02:36:82",
            "net1": "d2:dc:72:f7:76:c5",
            "net10": "7e:68:1c:70:93:54",
            "net11": "be:cf:db:cf:bb:a9",
            "net12": "d2:45:22:16:53:97",
            "net13": "9e:56:db:f4:c8:c1",
            "net14": "d2:0b:57:1f:d3:96",
            "net15": "f6:c9:11:d6:64:a1",
            "net16": "d6:17:76:ec:06:34",
            "net17": "aa:46:02:af:f1:ae",
            "net18": "42:44:c5:9b:c0:5c",
            "net19": "ba:b1:c9:74:8d:94",
            "net2": "fa:30:7d:45:2b:8d",
            "net20": "0e:2e:ff:e3:db:b3",
            "net21": "9a:a8:1b:9c:fe:ca",
            "net22": "fe:06:2b:3a:df:b5",
            "net23": "a2:b3:5d:5d:50:6a",
            "net24": "0a:f8:4a:a7:bc:40",
            "net25": "1e:15:ad:40:a1:64",
            "net26": "aa:24:85:81:ac:94",
            "net27": "3e:bc:6e:9a:07:04",
            "net28": "9e:57:63:ff:49:6c",
            "net29": "42:e1:12:c4:21:af",
            "net3": "fa:ae:36:04:b5:10",
            "net30": "16:46:a5:7e:50:9a",
            "net31": "1a:06:f9:50:53:b0",
            "net4": "76:d7:f7:03:7c:29",
            "net5": "52:eb:08:cc:10:f7",
            "net6": "46:5c:56:80:b0:46",
            "net7": "e6:05:c8:44:94:06",
            "net8": "de:71:88:b4:be:ad",
            "net9": "96:c1:6e:1a:30:52"
        },
        "spine_2_1_1": {
            "net0": "1a:ac:67:1e:bd:d5",
            "net1": "9e:95:1b:49:9a:ae",
            "net10": "76:ba:d8:43:36:5a",
            "net11": "b6:38:13:f2:c1:9a",
            "net12": "fa:c9:c3:81:30:4b",
            "net13": "2a:18:5d:ea:82:fd",
            "net14": "92:85:6c:4d:78:b9",
            "net15": "aa:5f:1f:ed:f4:9c",
            "net16": "66:cb:2a:ec:91:1e",
            "net17": "02:c2:2b:f0:a0:e3",
            "net18": "2e:f2:69:24:71:d7",
            "net19": "36:cb:08:f2:79:42",
            "net2": "ba:4a:1a:c8:ae:99",
            "net20": "6a:36:e4:4f:18:f9",
            "net21": "6a:d4:fb:67:94:bc",
            "net22": "b6:03:1f:22:5f:19",
            "net23": "76:d6:6e:9b:43:c1",
            "net24": "b2:4b:0e:09:40:b7",
            "net25": "da:cc:6b:99:3b:9e",
            "net26": "36:2a:cd:14:3d:ab",
            "net27": "4a:00:15:8e:7a:20",
            "net28": "12:73:2e:b4:77:a0",
            "net29": "ea:1b:cb:44:3e:3d",
            "net3": "de:18:b7:3f:d7:ba",
            "net30": "16:84:65:88:27:94",
            "net31": "a2:8e:2f:53:17:76",
            "net4": "7a:49:d8:b0:96:77",
            "net5": "9e:eb:2a:7f:50:ff",
            "net6": "be:f1:80:99:2a:46",
            "net7": "de:da:ad:a5:3b:37",
            "net8": "9a:50:51:dd:a7:14",
            "net9": "96:85:7e:7c:1d:de"
        },
        "spine_2_1_10": {
            "net0": "3e:b9:da:90:df:4f",
            "net1": "a2:0f:0a:9f:65:1f",
            "net10": "e2:2c:a9:4a:b6:fa",
            "net11": "72:2a:45:a0:42:dd",
            "net12": "a2:b4:b6:72:b1:c8",
            "net13": "72:44:ff:50:c0:1a",
            "net14": "d2:1f:12:79:ed:6c",
            "net15": "6e:f6:34:96:45:70",
            "net16": "56:b6:e1:85:a2:27",
            "net17": "32:32:e2:ca:9e:b3",
            "net18": "2e:ba:6f:6e:2c:cd",
            "net19": "e2:4a:eb:25:01:f7",
            "net2": "3a:f3:b7:c6:96:2e",
            "net20": "ce:2a:86:4e:fe:6f",
            "net21": "aa:00:ae:91:2d:6f",
            "net22": "46:df:75:82:69:98",
            "net23": "9e:03:59:80:b9:89",
            "net24": "fa:2e:34:9a:e2:3d",
            "net25": "ca:de:22:13:aa:f8",
            "net26": "6a:dc:63:b0:37:1e",
            "net27": "66:7f:51:d1:68:9e",
            "net28": "3a:ec:37:9f:81:47",
            "net29": "1e:f9:6c:4a:ba:ee",
            "net3": "52:f8:df:c9:52:5a",
            "net30": "2e:18:7f:6a:b9:89",
            "net31": "8a:02:0e:ad:9e:81",
            "net4": "ae:e3:0e:47:9e:9e",
            "net5": "fe:8c:2b:ab:ea:00",
            "net6": "36:aa:2a:dc:03:47",
            "net7": "1e:a0:4b:35:54:e4",
            "net8": "b2:70:46:92:1b:0f",
            "net9": "1e:61:45:1e:92:9f"
        },
        "spine_2_1_11": {
            "net0": "da:ae:89:ff:a7:0d",
            "net1": "12:c8:20:ff:ad:59",
            "net10": "da:6d:68:1a:af:ec",
            "net11": "4a:9a:7b:e0:82:ea",
            "net12": "8a:91:2a:b9:d5:2d",
            "net13": "86:ae:32:a6:cd:e0",
            "net14": "f6:d5:92:02:42:76",
            "net15": "22:d0:8b:09:58:b1",
            "net16": "36:6a:9c:fb:64:d6",
            "net17": "5a:bf:22:64:a9:3b",
            "net18": "ee:29:47:1d:69:f8",
            "net19": "6e:8f:71:f6:f3:0c",
            "net2": "9a:31:42:b9:0e:13",
            "net20": "0e:72:df:f9:2e:50",
            "net21": "62:81:8f:67:38:95",
            "net22": "2e:da:79:50:99:b9",
            "net23": "0a:a2:a6:49:9c:1c",
            "net24": "56:a4:52:1a:8d:a4",
            "net25": "32:8d:f7:55:13:9e",
            "net26": "7e:ed:5b:46:ea:a0",
            "net27": "7e:aa:fa:43:23:48",
            "net28": "3a:fa:1b:95:c2:62",
            "net29": "2a:fe:53:66:87:88",
            "net3": "ae:34:91:a2:cd:4b",
            "net30": "a6:4f:dc:ee:04:2c",
            "net31": "b6:8b:9a:68:5d:bd",
            "net4": "e6:8f:71:d3:8b:73",
            "net5": "36:63:20:64:d0:6d",
            "net6": "12:08:dc:ad:32:42",
            "net7": "36:c1:46:40:17:b1",
            "net8": "72:18:0e:44:98:ad",
            "net9": "2a:f4:e3:6b:a0:92"
        },
        "spine_2_1_12": {
            "net0": "2e:97:27:56:97:93",
            "net1": "12:b8:8e:2c:b1:81",
            "net10": "ce:44:5e:bc:b6:e1",
            "net11": "8a:43:58:c8:ed:75",
            "net12": "5e:39:41:8b:7f:a6",
            "net13": "52:67:af:8e:68:69",
            "net14": "06:ea:79:de:ee:63",
            "net15": "ee:cb:02:56:56:b4",
            "net16": "0a:ad:5a:ce:76:ee",
            "net17": "f6:5c:5e:6f:26:59",
            "net18": "12:a9:80:9d:b2:d9",
            "net19": "62:fd:7e:7d:74:27",
            "net2": "56:89:48:1b:d3:28",
            "net20": "8e:10:2d:53:4e:ab",
            "net21": "92:15:1b:e6:02:db",
            "net22": "56:c8:d1:6a:cd:a3",
            "net23": "f2:9d:f9:d9:ad:34",
            "net24": "be:fc:9e:49:cd:e4",
            "net25": "f6:1e:0f:3b:7a:43",
            "net26": "22:4d:17:6e:d7:f8",
            "net27": "d6:10:db:87:44:b5",
            "net28": "4e:c7:5a:cd:81:da",
            "net29": "16:a8:a8:3e:91:86",
            "net3": "0e:8c:f7:09:e8:56",
            "net30": "76:bf:3c:4f:f2:98",
            "net31": "c6:cd:b3:13:dd:00",
            "net4": "ee:73:80:c3:5b:08",
            "net5": "32:fb:8b:ff:d7:ab",
            "net6": "5e:64:4b:a8:07:15",
            "net7": "92:d4:f9:12:03:83",
            "net8": "f6:d3:1b:b5:12:c8",
            "net9": "16:11:77:2a:c4:82"
        },
        "spine_2_1_13": {
            "net0": "ea:5a:a0:a1:f2:e4",
            "net1": "96:63:24:c5:86:90",
            "net10": "32:9a:25:fd:c3:3c",
            "net11": "7a:78:3c:08:48:0e",
            "net12": "82:05:83:11:3a:44",
            "net13": "16:24:b2:f8:42:b6",
            "net14": "92:24:50:cd:29:bb",
            "net15": "fa:98:d7:41:7c:6f",
            "net16": "36:69:b8:ad:93:eb",
            "net17": "ee:4c:c7:aa:9e:0a",
            "net18": "16:b5:96:26:b8:b5",
            "net19": "3a:10:db:fa:63:e7",
            "net2": "26:4f:c1:1a:99:13",
            "net20": "a6:b6:69:86:91:b1",
            "net21": "ae:ad:a8:da:00:1f",
            "net22": "26:1c:a2:e5:ce:77",
            "net23": "5e:78:43:51:0d:4c",
            "net24": "a2:7b:82:ba:50:aa",
            "net25": "2a:bd:42:ba:50:76",
            "net26": "96:50:10:18:71:82",
            "net27": "7e:0a:68:cd:a0:d4",
            "net28": "12:2a:dd:75:a9:ef",
            "net29": "ae:38:1a:9e:81:a7",
            "net3": "62:84:e5:29:e9:90",
            "net30": "6a:c6:1c:ec:6f:92",
            "net31": "a6:8a:a8:2a:81:62",
            "net4": "e2:e3:12:46:33:57",
            "net5": "42:cb:b3:52:4e:4b",
            "net6": "be:f8:cf:72:67:e7",
            "net7": "5e:2a:e9:a0:e3:26",
            "net8": "3e:0d:2d:47:52:9d",
            "net9": "da:5b:bd:90:41:ae"
        },
        "spine_2_1_14": {
            "net0": "e6:18:e1:77:35:ca",
            "net1": "9a:e5:55:66:75:cf",
            "net10": "56:c5:2b:95:15:a6",
            "net11": "76:5c:26:25:98:0e",
            "net12": "56:a5:d4:09:7f:c2",
            "net13": "a2:41:48:76:7f:c8",
            "net14": "26:cb:fd:46:73:b9",
            "net15": "9e:1a:0c:dc:f2:89",
            "net16": "ce:1f:34:ce:3d:74",
            "net17": "ea:32:03:15:57:bd",
            "net18": "ca:12:10:71:04:3e",
            "net19": "ae:b8:86:f8:99:e6",
            "net2": "1e:1d:b5:20:21:4c",
            "net20": "46:03:4c:c4:ab:fa",
            "net21": "ba:11:6b:f4:50:4b",
            "net22": "da:13:23:74:7e:1a",
            "net23": "4a:24:6f:8e:dd:e6",
            "net24": "06:8f:9e:a6:50:cd",
            "net25": "62:d3:fb:0f:36:76",
            "net26": "ba:15:d8:83:e4:3b",
            "net27": "0a:da:c9:8e:db:61",
            "net28": "86:0b:c4:8e:5c:a7",
            "net29": "a6:f2:fa:9f:b3:51",
            "net3": "f2:ae:d1:f2:e0:e1",
            "net30": "7a:4e:0b:ed:64:95",
            "net31": "22:c3:42:79:d4:6b",
            "net4": "fa:00:98:46:fe:93",
            "net5": "6e:09:ac:ef:80:45",
            "net6": "26:fc:80:f3:37:8c",
            "net7": "da:ba:6c:f0:4f:81",
            "net8": "fa:13:0a:c3:5c:00",
            "net9": "26:a2:b4:7a:1f:b0"
        },
        "spine_2_1_15": {
            "net0": "7e:ab:e5:54:a3:78",
            "net1": "4e:2c:94:85:87:70",
            "net10": "7a:14:99:4d:a0:2a",
            "net11": "a6:13:b9:1d:a6:80",
            "net12": "4e:91:99:7c:17:b5",
            "net13": "8a:a6:07:aa:b8:55",
            "net14": "76:42:bb:b7:3a:e0",
            "net15": "9a:59:47:50:8f:a4",
            "net16": "6a:66:14:11:a3:65",
            "net17": "ca:82:f8:a3:93:da",
            "net18": "0e:9f:f9:ea:73:62",
            "net19": "46:88:ce:3c:36:a8",
            "net2": "7a:66:4b:48:4c:b8",
            "net20": "76:71:e2:dc:1c:48",
            "net21": "1e:fe:31:95:83:10",
            "net22": "e6:6f:be:68:83:a8",
            "net23": "12:6a:99:24:44:a6",
            "net24": "12:62:e7:47:5e:28",
            "net25": "92:ab:5b:d5:3a:17",
            "net26": "76:1b:c7:4d:2a:d3",
            "net27": "1e:7e:b5:52:dc:16",
            "net28": "a2:52:a8:db:11:92",
            "net29": "ae:64:77:80:d4:27",
            "net3": "0a:fd:8b:3d:53:2a",
            "net30": "b6:6a:9e:fc:79:89",
            "net31": "b2:0b:d5:7d:6c:8f",
            "net4": "62:b7:42:ac:16:03",
            "net5": "16:5c:fa:c2:4a:c3",
            "net6": "c2:18:26:aa:42:76",
            "net7": "fa:27:76:68:28:fd",
            "net8": "0a:3f:3e:26:b3:23",
            "net9": "22:6e:4f:ab:f3:b7"
        },
        "spine_2_1_16": {
            "net0": "d2:a9:91:75:7f:28",
            "net1": "6e:03:59:f2:e8:cf",
            "net10": "0e:a7:5b:f3:02:52",
            "net11": "ba:6f:fd:22:88:1d",
            "net12": "d6:72:f2:79:da:a2",
            "net13": "76:65:9a:58:cd:5e",
            "net14": "26:7d:a7:5d:cd:0e",
            "net15": "26:5c:e0:57:75:55",
            "net16": "5a:d4:f5:75:11:cc",
            "net17": "e6:ca:ae:42:c0:13",
            "net18": "e2:8c:62:75:c9:c8",
            "net19": "4e:d3:8a:15:1b:5d",
            "net2": "7a:9b:30:c0:2a:54",
            "net20": "a6:16:b6:58:2d:f4",
            "net21": "f2:9d:63:1e:a2:89",
            "net22": "36:b9:67:13:8f:57",
            "net23": "8e:1b:59:2b:21:fc",
            "net24": "ea:1f:da:56:cd:f7",
            "net25": "4e:fe:a5:c1:f0:1d",
            "net26": "9a:39:a0:54:43:13",
            "net27": "02:31:c8:65:1a:d8",
            "net28": "aa:ca:44:ba:97:ee",
            "net29": "22:31:8f:b4:72:f6",
            "net3": "ca:b0:94:d1:86:aa",
            "net30": "ee:6c:d6:ea:f9:ac",
            "net31": "e2:0c:73:e6:5f:4d",
            "net4": "76:e3:fb:8a:1c:52",
            "net5": "d6:99:10:7e:c5:61",
            "net6": "6e:11:97:cc:21:d6",
            "net7": "be:f3:62:de:db:2f",
            "net8": "c6:5f:5a:d7:31:24",
            "net9": "c2:ab:25:3e:71:38"
        },
        "spine_2_1_2": {
            "net0": "e6:30:51:de:ac:e3",
            "net1": "36:25:cb:e6:90:a1",
            "net10": "ba:0d:0c:b5:59:38",
            "net11": "56:5f:55:4e:40:f6",
            "net12": "2a:e4:62:3f:d2:32",
            "net13": "2e:9f:65:0f:6a:11",
            "net14": "fa:db:4a:aa:a5:75",
            "net15": "22:39:c6:fd:a3:f7",
            "net16": "4a:31:db:d0:2f:9c",
            "net17": "c6:85:56:47:94:5d",
            "net18": "66:7c:e3:87:56:75",
            "net19": "16:a7:f4:38:93:33",
            "net2": "b2:69:7f:a5:eb:23",
            "net20": "52:ca:ff:57:3d:fc",
            "net21": "de:22:f0:42:e1:51",
            "net22": "8a:b4:db:d4:ac:f1",
            "net23": "d6:8f:97:ca:c7:44",
            "net24": "9a:8d:f0:9e:e7:a9",
            "net25": "9e:6b:a6:fa:f6:56",
            "net26": "da:75:b2:62:85:db",
            "net27": "52:2f:ad:f8:84:66",
            "net28": "0e:6e:34:53:c2:b6",
            "net29": "f6:49:fd:75:4f:d8",
            "net3": "72:fe:bd:0a:9b:51",
            "net30": "f6:c6:99:05:f7:17",
            "net31": "32:45:22:04:a2:45",
            "net4": "62:9a:f4:81:07:3c",
            "net5": "26:81:4a:c7:37:fe",
            "net6": "3a:a2:ac:e9:84:25",
            "net7": "ca:79:a0:e6:de:53",
            "net8": "6a:f1:5a:8a:c5:7f",
            "net9": "4a:a4:31:c1:4b:44"
        },
        "spine_2_1_3": {
            "net0": "a6:a0:69:a1:68:32",
            "net1": "52:0c:0d:5a:1f:5a",
            "net10": "6e:fc:fe:a4:5d:82",
            "net11": "62:42:48:9c:82:45",
            "net12": "1e:76:ee:93:9b:44",
            "net13": "2a:7d:42:f4:10:d4",
            "net14": "56:15:c8:9b:4e:26",
            "net15": "f6:26:54:ec:ff:ca",
            "net16": "f6:b3:41:fb:3d:a4",
            "net17": "7a:d3:11:1f:a6:a8",
            "net18": "aa:67:c9:60:7b:22",
            "net19": "5e:40:a4:4f:c2:36",
            "net2": "1e:39:d5:c9:88:7d",
            "net20": "5a:2f:b0:ce:27:41",
            "net21": "82:a9:55:1b:4f:32",
            "net22": "0a:78:0c:19:da:d4",
            "net23": "fe:0e:9d:78:44:af",
            "net24": "6a:fa:03:31:56:38",
            "net25": "d6:5b:6b:5d:a5:bf",
            "net26": "a2:e4:05:ec:2f:62",
            "net27": "6e:f5:e7:8e:df:b5",
            "net28": "a6:e6:f8:78:47:83",
            "net29": "f2:41:05:25:30:58",
            "net3": "9e:10:f5:0d:26:f4",
            "net30": "4a:5f:0c:6a:1d:40",
            "net31": "56:17:74:dd:cb:1b",
            "net4": "4e:ad:c3:2c:d1:22",
            "net5": "8a:cb:f7:58:29:93",
            "net6": "0a:e7:6f:44:52:b6",
            "net7": "36:7b:e1:af:4b:46",
            "net8": "12:0d:34:c7:11:e6",
            "net9": "9e:6c:35:73:4c:18"
        },
        "spine_2_1_4": {
            "net0": "62:96:49:96:99:04",
            "net1": "ba:e3:4a:d9:d4:ef",
            "net10": "42:f2:1c:74:b3:d4",
            "net11": "aa:63:86:dc:d5:d2",
            "net12": "6a:5e:31:5e:de:0d",
            "net13": "ca:cb:47:f5:ad:13",
            "net14": "e2:b8:3e:ba:3e:ba",
            "net15": "9e:59:65:ca:9e:5f",
            "net16": "62:12:62:05:67:1c",
            "net17": "b6:1c:f4:23:9d:5e",
            "net18": "4e:e6:22:34:74:2a",
            "net19": "52:92:60:e6:ca:2d",
            "net2": "fa:fe:c2:0e:c6:26",
            "net20": "46:f5:34:54:9f:2d",
            "net21": "72:b4:e9:03:e7:3c",
            "net22": "3e:cb:03:6f:82:44",
            "net23": "c6:3a:32:91:f1:78",
            "net24": "1a:58:5a:e6:af:a6",
            "net25": "aa:b3:2c:70:78:ac",
            "net26": "e6:bd:15:39:3e:03",
            "net27": "36:b6:75:b8:fe:2a",
            "net28": "76:cd:fd:d1:55:a5",
            "net29": "aa:e8:44:30:9c:0c",
            "net3": "26:f5:a9:b4:d0:7a",
            "net30": "aa:71:3c:88:00:7c",
            "net31": "16:04:74:ed:cd:2c",
            "net4": "4a:6e:36:3f:2a:14",
            "net5": "12:f0:c0:b3:62:10",
            "net6": "e6:2b:5e:19:f3:a3",
            "net7": "f6:01:8b:8c:36:ba",
            "net8": "1a:d4:8b:b1:5e:a4",
            "net9": "02:02:d2:38:58:40"
        },
        "spine_2_1_5": {
            "net0": "c6:39:bd:91:19:43",
            "net1": "9a:66:de:70:32:d9",
            "net10": "6a:74:e7:ff:42:4f",
            "net11": "8e:70:39:9f:78:1b",
            "net12": "1e:ff:5e:ff:e5:1e",
            "net13": "7e:97:78:e9:20:bf",
            "net14": "52:25:47:00:cd:3c",
            "net15": "26:e5:07:74:a3:c2",
            "net16": "36:73:94:15:ce:15",
            "net17": "ba:ee:51:81:df:7f",
            "net18": "da:d2:ba:24:ed:94",
            "net19": "f6:7f:3e:29:4a:e1",
            "net2": "82:13:eb:1a:bb:a4",
            "net20": "c6:15:e0:98:8f:50",
            "net21": "6a:43:4d:f9:23:e7",
            "net22": "3a:cd:7c:cf:2c:ec",
            "net23": "ca:ce:f7:42:4f:63",
            "net24": "76:19:4a:7e:80:6c",
            "net25": "ce:b3:fd:94:46:0c",
            "net26": "ba:40:c1:47:9d:da",
            "net27": "a2:e9:01:45:bf:65",
            "net28": "ce:3b:ec:6d:8b:6a",
            "net29": "7e:a5:57:94:ca:6f",
            "net3": "2e:9e:d4:94:f8:f4",
            "net30": "ba:1e:44:79:b4:1f",
            "net31": "fe:b8:c0:0f:0a:66",
            "net4": "da:70:4b:ea:98:85",
            "net5": "c2:d5:bf:ac:b6:c1",
            "net6": "46:09:9e:58:2a:d6",
            "net7": "7e:13:9b:35:1a:e1",
            "net8": "1e:ac:8d:0f:46:56",
            "net9": "5a:0a:b9:21:8e:02"
        },
        "spine_2_1_6": {
            "net0": "16:ee:d5:1f:aa:8a",
            "net1": "f6:7a:54:e6:3b:21",
            "net10": "86:e7:45:1b:52:a7",
            "net11": "5a:1d:10:e4:0f:ab",
            "net12": "9e:f5:51:00:d1:b6",
            "net13": "ba:de:15:e5:ba:9d",
            "net14": "f2:7e:21:9a:6c:79",
            "net15": "a6:e9:6c:62:73:7b",
            "net16": "aa:73:18:15:b4:ee",
            "net17": "3a:9f:2a:b7:ec:fe",
            "net18": "b2:3a:46:d3:68:fe",
            "net19": "36:6c:f1:b7:18:66",
            "net2": "e6:e2:0b:2d:d3:a0",
            "net20": "72:1d:d4:22:7e:2d",
            "net21": "b6:e6:5d:e3:92:52",
            "net22": "32:27:08:85:27:18",
            "net23": "56:54:e5:94:ea:4a",
            "net24": "86:37:77:1a:a0:8f",
            "net25": "3a:86:81:d5:0d:ec",
            "net26": "76:16:c4:4c:47:d5",
            "net27": "56:3e:4f:80:e2:4e",
            "net28": "a2:a7:31:f6:e4:f8",
            "net29": "02:5f:69:a5:2f:c7",
            "net3": "06:c7:5e:2a:21:69",
            "net30": "8e:0a:6d:a9:9a:3f",
            "net31": "3a:6f:5e:ea:e7:b1",
            "net4": "8e:b7:c9:2f:e9:01",
            "net5": "fa:de:88:62:fd:72",
            "net6": "92:62:b7:85:81:12",
            "net7": "c2:0b:0b:1f:53:f6",
            "net8": "56:64:75:1a:83:a6",
            "net9": "32:1f:f7:3d:e1:bd"
        },
        "spine_2_1_7": {
            "net0": "1a:50:9e:f6:8e:6b",
            "net1": "f2:3c:cf:fd:70:11",
            "net10": "b2:eb:57:b2:12:59",
            "net11": "ce:45:43:2c:73:58",
            "net12": "f2:6e:15:ff:91:eb",
            "net13": "52:fc:37:b1:36:23",
            "net14": "ba:92:b4:ed:ca:0a",
            "net15": "1a:18:0c:46:09:db",
            "net16": "36:1c:f9:e1:21:85",
            "net17": "ba:8e:ca:c8:72:7d",
            "net18": "2a:b5:09:a1:68:7f",
            "net19": "ea:48:c8:d3:26:6f",
            "net2": "b6:ed:be:ad:dd:c9",
            "net20": "a6:07:72:d4:25:c0",
            "net21": "7e:21:d4:3e:ba:39",
            "net22": "a2:e2:5c:3c:e9:84",
            "net23": "12:a8:68:4e:4d:27",
            "net24": "72:af:19:74:81:7c",
            "net25": "1a:ad:33:eb:f4:d8",
            "net26": "3e:94:c1:4b:cd:19",
            "net27": "ca:35:43:dd:8a:08",
            "net28": "86:7e:9d:a4:d6:b8",
            "net29": "32:2a:df:ff:b9:50",
            "net3": "4a:34:1b:ba:ac:8a",
            "net30": "22:94:5e:3a:0c:c0",
            "net31": "ae:26:0c:33:9c:67",
            "net4": "52:2d:bd:cd:c0:ec",
            "net5": "52:dd:3a:11:18:0f",
            "net6": "da:f6:9f:1f:24:9a",
            "net7": "5a:00:1c:fd:78:20",
            "net8": "ba:1a:ed:2f:b2:53",
            "net9": "a2:71:6a:02:21:66"
        },
        "spine_2_1_8": {
            "net0": "72:71:b2:38:69:ae",
            "net1": "b6:ff:f9:ad:71:a1",
            "net10": "62:f3:b3:b5:74:95",
            "net11": "aa:b3:23:9b:9a:2a",
            "net12": "16:d3:94:8b:7d:ae",
            "net13": "d2:98:70:4a:d9:a1",
            "net14": "be:8b:c5:d6:23:11",
            "net15": "72:bd:e4:7e:6e:ef",
            "net16": "06:f0:fc:61:84:11",
            "net17": "0a:bf:12:87:92:9f",
            "net18": "56:a5:1d:f3:14:25",
            "net19": "a6:1d:6f:67:24:7f",
            "net2": "32:2d:68:d1:ce:9e",
            "net20": "92:9d:6a:ca:85:f3",
            "net21": "4e:d0:d5:4b:81:7f",
            "net22": "9e:ca:68:b0:ac:07",
            "net23": "0a:af:f7:08:c6:e5",
            "net24": "6e:9f:d6:95:61:e6",
            "net25": "b2:29:93:53:42:30",
            "net26": "4e:db:2a:0c:8a:84",
            "net27": "7e:dc:c2:58:28:3e",
            "net28": "86:c8:d7:6a:5d:a0",
            "net29": "ae:b7:e4:15:4e:00",
            "net3": "62:03:3d:3c:40:54",
            "net30": "96:11:23:bd:9a:1e",
            "net31": "26:46:15:50:b6:92",
            "net4": "76:bf:a0:45:33:ca",
            "net5": "86:72:b7:6c:22:14",
            "net6": "2e:4b:e8:bf:f3:03",
            "net7": "b6:33:31:3b:c7:5c",
            "net8": "a2:3f:b7:f4:6b:c9",
            "net9": "42:2d:53:6e:8a:c3"
        },
        "spine_2_1_9": {
            "net0": "b2:a7:9c:f8:15:d6",
            "net1": "6e:06:e2:49:82:bc",
            "net10": "ce:3d:f7:0f:7c:69",
            "net11": "92:1b:0f:d7:9a:ae",
            "net12": "8e:29:fa:ef:ff:fc",
            "net13": "36:fd:e7:ec:08:e9",
            "net14": "32:32:4d:1a:bb:3e",
            "net15": "ae:0e:35:26:fc:49",
            "net16": "76:59:12:08:4c:e9",
            "net17": "42:e4:a8:dd:c5:b4",
            "net18": "d2:e7:37:ad:71:4a",
            "net19": "7e:48:af:96:71:76",
            "net2": "ca:f5:3d:2d:4e:3c",
            "net20": "16:5c:b3:46:d7:f8",
            "net21": "1a:f3:1f:53:b2:88",
            "net22": "66:93:f4:32:34:54",
            "net23": "2e:22:84:c2:34:0b",
            "net24": "c6:2d:32:ce:0c:36",
            "net25": "76:ac:31:23:58:98",
            "net26": "f2:d4:44:f0:41:d6",
            "net27": "d6:d5:7c:c2:68:06",
            "net28": "32:45:5f:7c:cd:6f",
            "net29": "e2:cf:b2:46:fb:87",
            "net3": "4e:56:26:b6:c5:e8",
            "net30": "fa:ec:eb:a1:e8:47",
            "net31": "e6:79:5d:43:37:4d",
            "net4": "f6:c0:ac:91:40:78",
            "net5": "f6:0f:1c:ea:1b:c7",
            "net6": "f6:ea:d8:bb:e7:02",
            "net7": "a2:10:6f:5d:25:f9",
            "net8": "1e:1c:fa:90:2f:b9",
            "net9": "36:8f:4b:a6:4b:ee"
        },
        "tof_1_2_1": {
            "net0": "6a:dc:6b:99:c7:44",
            "net1": "06:c8:55:7b:2d:f7",
            "net10": "de:3d:33:21:3a:50",
            "net11": "92:be:cc:d6:a7:70",
            "net12": "ba:e3:e8:1a:5a:7b",
            "net13": "e2:ec:b9:94:ed:ad",
            "net14": "a2:2c:3b:d9:54:f1",
            "net15": "fe:32:f6:96:d5:f9",
            "net16": "2e:6d:e8:89:ce:7f",
            "net17": "da:99:17:22:6b:40",
            "net18": "0a:d1:72:61:ed:a0",
            "net19": "86:f3:a6:e1:f3:e7",
            "net2": "12:ff:fd:74:85:1f",
            "net20": "66:33:f1:00:76:70",
            "net21": "3e:7d:fe:d4:21:fc",
            "net22": "36:bf:d9:0f:06:8e",
            "net23": "2e:80:e5:ac:be:4b",
            "net24": "5a:e4:87:87:ce:53",
            "net25": "06:20:44:b6:95:0d",
            "net26": "7a:cc:cf:1c:43:72",
            "net27": "42:d8:56:48:48:f2",
            "net28": "96:47:1c:97:6d:10",
            "net29": "f6:90:0b:33:6a:26",
            "net3": "22:4b:42:3d:92:d5",
            "net30": "02:ed:98:cc:3a:52",
            "net31": "6a:2a:a6:2b:a9:f5",
            "net4": "82:83:f6:1c:08:fd",
            "net5": "a2:df:e4:de:77:f1",
            "net6": "1e:ee:7d:44:69:11",
            "net7": "8e:ae:a0:da:78:94",
            "net8": "aa:b1:42:42:77:68",
            "net9": "7e:ab:04:21:7b:2f"
        },
        "tof_1_2_10": {
            "net0": "5a:47:88:25:3f:c8",
            "net1": "36:a3:be:14:4f:db",
            "net10": "7a:e1:a1:a5:c6:ef",
            "net11": "2e:55:0a:22:9a:d9",
            "net12": "3e:96:62:57:49:49",
            "net13": "5a:9b:79:99:ac:6c",
            "net14": "72:ac:6b:ca:24:59",
            "net15": "5a:82:57:70:88:07",
            "net16": "1a:82:06:52:67:d8",
            "net17": "1a:24:dd:26:aa:59",
            "net18": "5a:ac:21:fd:7f:0b",
            "net19": "a6:18:34:78:f7:9f",
            "net2": "d6:55:8a:b2:cb:57",
            "net20": "6a:53:89:a7:fd:bf",
            "net21": "62:0b:fe:64:be:9e",
            "net22": "36:a5:ff:ad:11:12",
            "net23": "56:5d:87:60:af:94",
            "net24": "96:4e:ba:7e:ec:08",
            "net25": "02:54:a2:b3:40:05",
            "net26": "9e:20:03:07:7b:c5",
            "net27": "1a:31:3c:42:6b:d5",
            "net28": "1a:b9:eb:9a:4e:01",
            "net29": "9e:15:e7:a6:20:4c",
            "net3": "2a:a7:98:6e:5f:00",
            "net30": "1a:c0:53:cb:d0:e7",
            "net31": "46:9a:05:27:92:94",
            "net4": "f6:e4:81:eb:2e:2b",
            "net5": "92:ab:bc:26:63:38",
            "net6": "02:d3:b1:8b:8f:d5",
            "net7": "0e:66:de:5e:91:99",
            "net8": "2a:8e:30:81:f9:fa",
            "net9": "86:36:32:fc:f2:78"
        },
        "tof_1_2_11": {
            "net0": "de:65:51:59:65:50",
            "net1": "86:b3:b1:a4:cb:72",
            "net10": "fa:a5:10:c5:49:3f",
            "net11": "b2:0a:d2:b3:fa:30",
            "net12": "72:46:23:70:c6:ff",
            "net13": "6e:3b:ba:59:d2:30",
            "net14": "de:7e:5a:79:e7:c5",
            "net15": "26:e7:d1:7c:20:3b",
            "net16": "d2:f0:14:71:ef:7d",
            "net17": "9a:15:95:e9:5c:88",
            "net18": "92:3c:c4:60:53:98",
            "net19": "0a:aa:87:3c:58:d7",
            "net2": "42:c0:86:44:c6:5c",
            "net20": "a2:eb:19:58:31:b5",
            "net21": "ce:1e:5d:08:84:b3",
            "net22": "ea:66:41:c9:e0:97",
            "net23": "de:5b:af:89:20:f3",
            "net24": "06:c2:65:1e:90:74",
            "net25": "ae:4c:3a:62:f0:ce",
            "net26": "42:3b:d7:43:9b:36",
            "net27": "a6:b3:39:81:79:8c",
            "net28": "32:c6:4a:84:0b:0e",
            "net29": "76:e2:ad:df:e3:ac",
            "net3": "7e:86:5a:32:76:ee",
            "net30": "22:30:42:9d:4a:d0",
            "net31": "b2:f6:25:37:3f:46",
            "net4": "e2:13:75:fa:00:27",
            "net5": "3a:5e:f2:a8:ca:e8",
            "net6": "f6:ba:12:57:2f:b7",
            "net7": "22:90:38:dc:7d:95",
            "net8": "12:5d:01:55:6a:7f",
            "net9": "a2:d2:98:4f:c4:2f"
        },
        "tof_1_2_12": {
            "net0": "46:fc:71:4a:d9:59",
            "net1": "1e:33:64:c1:75:39",
            "net10": "52:fb:3e:6e:55:79",
            "net11": "7a:01:e2:89:d7:89",
            "net12": "8a:b3:0a:a0:91:f1",
            "net13": "4e:10:5e:87:76:63",
            "net14": "fa:f2:66:cb:d8:e6",
            "net15": "6a:ce:84:b9:07:aa",
            "net16": "36:45:12:b4:cf:b9",
            "net17": "36:85:29:21:a0:ba",
            "net18": "ee:1d:b4:87:98:06",
            "net19": "6a:ba:9e:0c:ff:e6",
            "net2": "96:e8:ac:77:3b:5a",
            "net20": "ce:42:aa:0f:7f:29",
            "net21": "3a:40:62:fb:96:77",
            "net22": "fa:b7:36:44:31:db",
            "net23": "16:56:25:66:33:7c",
            "net24": "da:16:a4:08:5a:95",
            "net25": "72:f8:7a:0e:57:84",
            "net26": "32:a5:29:22:93:7f",
            "net27": "e2:2b:dc:f8:50:bb",
            "net28": "ae:e2:76:3b:e9:a6",
            "net29": "ae:2d:9a:30:5e:5b",
            "net3": "ae:43:2a:93:e2:a1",
            "net30": "e6:82:f9:e6:fb:c0",
            "net31": "ce:e4:2e:a4:b7:48",
            "net4": "92:a3:79:17:f9:4a",
            "net5": "02:ac:8c:be:12:19",
            "net6": "ea:a7:f9:e2:60:10",
            "net7": "4a:37:4d:cc:bd:6b",
            "net8": "2a:5e:ca:a0:85:27",
            "net9": "82:77:b0:80:fd:e3"
        },
        "tof_1_2_13": {
            "net0": "82:2e:fd:50:bf:5f",
            "net1": "ba:22:b0:56:06:e5",
            "net10": "86:ee:4a:eb:cc:20",
            "net11": "c2:16:fe:4d:fa:cd",
            "net12": "aa:23:6e:d9:e8:5d",
            "net13": "fe:98:42:52:1d:02",
            "net14": "a6:10:6e:be:5f:fa",
            "net15": "1a:82:ab:45:a5:7f",
            "net16": "52:2c:f0:c7:63:80",
            "net17": "1a:9e:69:22:cc:88",
            "net18": "7e:39:0d:8a:e3:1a",
            "net19": "da:d9:6d:c2:9a:d9",
            "net2": "b2:8b:eb:fa:ce:b1",
            "net20": "32:e1:2b:7a:4d:1f",
            "net21": "42:0f:4e:9f:91:6c",
            "net22": "46:11:4b:d3:aa:3b",
            "net23": "fe:93:c0:44:75:78",
            "net24": "ea:e8:73:99:87:bd",
            "net25": "ba:88:84:2a:f8:54",
            "net26": "ee:63:2f:83:80:5b",
            "net27": "72:8a:3b:3d:e1:f7",
            "net28": "3e:73:3e:26:27:d5",
            "net29": "36:8a:1c:12:7a:81",
            "net3": "12:9e:14:5c:b2:7c",
            "net30": "66:6c:68:f6:03:31",
            "net31": "d6:d2:87:f5:68:3f",
            "net4": "a2:c0:bb:cc:1b:9b",
            "net5": "0e:15:2b:b5:d6:0e",
            "net6": "32:49:08:41:bf:ce",
            "net7": "56:65:84:e1:22:84",
            "net8": "52:88:2a:7f:18:54",
            "net9": "82:2b:f4:7e:5d:08"
        },
        "tof_1_2_14": {
            "net0": "ae:9c:47:3d:73:84",
            "net1": "42:4c:d3:d9:19:33",
            "net10": "c6:3d:97:46:9f:08",
            "net11": "ce:fc:08:96:55:a0",
            "net12": "96:29:37:df:1d:4a",
            "net13": "1e:c7:24:ae:45:ee",
            "net14": "16:5e:71:2a:12:96",
            "net15": "02:f5:28:1d:73:3e",
            "net16": "82:92:15:02:d1:f9",
            "net17": "e6:a9:af:77:bc:a5",
            "net18": "62:11:a8:e9:c9:c1",
            "net19": "0e:c4:96:18:ed:8d",
            "net2": "32:bc:fd:70:4a:11",
            "net20": "8a:d4:5c:cf:39:d1",
            "net21": "ee:5e:76:14:34:bb",
            "net22": "46:bf:5d:ba:0a:96",
            "net23": "7e:a2:5d:43:39:50",
            "net24": "06:65:40:ac:ae:ea",
            "net25": "22:0d:47:0b:0b:77",
            "net26": "ee:dd:5d:8f:eb:84",
            "net27": "c2:d3:a9:4c:52:8a",
            "net28": "c6:97:e7:a3:01:39",
            "net29": "2e:a8:79:b1:82:0c",
            "net3": "92:4d:0d:05:31:6e",
            "net30": "aa:0f:da:44:23:e5",
            "net31": "5e:b6:78:ef:fe:f5",
            "net4": "36:42:e2:38:c7:61",
            "net5": "8a:87:3d:bc:f6:46",
            "net6": "26:d6:e0:22:8e:68",
            "net7": "c2:f6:ef:1b:c9:6d",
            "net8": "b6:41:3e:0f:9a:dc",
            "net9": "46:4e:60:1d:88:e6"
        },
        "tof_1_2_15": {
            "net0": "7a:d4:09:da:e7:c1",
            "net1": "c6:f9:dd:65:40:a6",
            "net10": "a6:d1:e9:d1:d8:ff",
            "net11": "52:21:8f:55:3c:8d",
            "net12": "4a:c5:81:23:a1:21",
            "net13": "62:04:b8:1f:11:84",
            "net14": "ee:e6:58:48:02:50",
            "net15": "de:9d:45:a3:98:67",
            "net16": "0e:08:03:db:df:47",
            "net17": "da:ac:2d:b7:80:1d",
            "net18": "9a:d4:2f:63:af:3f",
            "net19": "b2:26:74:46:59:58",
            "net2": "52:98:5e:b7:78:b8",
            "net20": "ba:fa:12:97:58:f5",
            "net21": "86:20:f3:14:05:8a",
            "net22": "0e:fa:b8:f3:3e:da",
            "net23": "e6:5b:a1:09:96:60",
            "net24": "b2:db:12:ae:01:d8",
            "net25": "22:71:36:05:04:d4",
            "net26": "a6:7f:21:0e:3a:e5",
            "net27": "ca:30:e8:52:9d:96",
            "net28": "7a:a7:30:97:cf:eb",
            "net29": "a2:81:d1:04:da:d7",
            "net3": "26:75:fb:21:64:aa",
            "net30": "46:c2:5f:eb:fb:23",
            "net31": "96:31:f0:40:a7:0f",
            "net4": "de:2d:01:a0:d2:93",
            "net5": "4a:10:96:56:c1:8f",
            "net6": "4a:ee:c0:7c:36:f1",
            "net7": "62:b1:1e:70:f3:ef",
            "net8": "4e:6b:8d:02:73:8e",
            "net9": "da:c7:fc:bb:58:33"
        },
        "tof_1_2_16": {
            "net0": "0a:bf:bc:eb:4e:d8",
            "net1": "2e:1d:dd:f3:c8:ea",
            "net10": "92:d5:98:19:b5:22",
            "net11": "9e:94:c3:a2:e9:22",
            "net12": "06:e8:93:04:a9:8c",
            "net13": "8a:4a:15:5d:94:0f",
            "net14": "ae:91:7d:16:bb:a1",
            "net15": "4a:f2:d1:ba:3d:bf",
            "net16": "12:6a:69:0f:3f:23",
            "net17": "3a:8f:e1:69:49:c2",
            "net18": "3e:08:7a:2c:6d:49",
            "net19": "5a:70:61:43:64:64",
            "net2": "e2:0e:fc:3b:d1:6f",
            "net20": "ba:61:ef:f6:78:a3",
            "net21": "4e:18:a3:32:98:e7",
            "net22": "6e:38:30:5c:1f:52",
            "net23": "e2:5b:6a:fc:69:01",
            "net24": "12:e9:d7:7a:7d:0b",
            "net25": "46:31:ac:e7:94:30",
            "net26": "52:8e:bd:e1:bf:7d",
            "net27": "be:7f:36:b4:29:82",
            "net28": "ce:f5:4e:90:7f:a6",
            "net29": "86:08:51:99:e5:a7",
            "net3": "2e:93:f3:d0:b2:7f",
            "net30": "62:4e:04:ab:e6:b0",
            "net31": "4a:4a:87:0d:f7:ce",
            "net4": "f6:16:30:c7:c0:9d",
            "net5": "aa:e2:69:e6:bd:7b",
            "net6": "1e:b5:fd:c0:e0:ab",
            "net7": "ee:06:4d:d5:94:07",
            "net8": "26:3d:32:f2:c4:49",
            "net9": "72:7a:b4:2d:7b:f2"
        },
        "tof_1_2_2": {
            "net0": "9e:92:54:3b:d4:21",
            "net1": "4a:40:bc:19:42:0c",
            "net10": "5a:69:81:e7:49:ff",
            "net11": "8e:92:e0:30:46:51",
            "net12": "a2:6b:a8:24:98:29",
            "net13": "da:63:32:f5:56:70",
            "net14": "e6:7f:a4:d6:35:55",
            "net15": "2a:35:40:eb:85:35",
            "net16": "e6:3c:9b:57:4c:6e",
            "net17": "ba:b8:0f:73:51:8a",
            "net18": "46:0d:de:05:86:bb",
            "net19": "fe:ed:fc:69:a6:ce",
            "net2": "c2:57:d5:01:d2:f9",
            "net20": "4a:0e:db:23:45:06",
            "net21": "2e:82:ba:69:e2:9d",
            "net22": "12:ae:b5:5d:82:01",
            "net23": "1a:ef:48:02:33:bf",
            "net24": "7e:0f:50:fb:51:b2",
            "net25": "92:b4:c0:dd:8d:13",
            "net26": "fe:5d:95:50:52:42",
            "net27": "c6:8d:ff:0a:33:eb",
            "net28": "be:39:d5:38:5a:17",
            "net29": "02:72:27:ec:8c:1b",
            "net3": "8e:79:2c:94:02:39",
            "net30": "ee:0e:aa:36:8f:6d",
            "net31": "2a:c4:56:34:c4:28",
            "net4": "06:a6:53:67:2b:22",
            "net5": "4e:73:70:ea:cf:b5",
            "net6": "0a:48:dc:59:5a:ee",
            "net7": "2e:8a:40:4a:b6:fa",
            "net8": "aa:e3:1f:20:c9:be",
            "net9": "4a:02:f2:99:f5:31"
        },
        "tof_1_2_3": {
            "net0": "3e:a6:01:4b:89:a6",
            "net1": "32:59:3d:3e:22:1f",
            "net10": "26:c2:74:6e:66:24",
            "net11": "7e:d3:06:26:5e:05",
            "net12": "66:5c:7a:3e:9a:10",
            "net13": "76:65:02:27:cb:49",
            "net14": "aa:0e:ef:0b:de:a7",
            "net15": "02:b1:a5:3f:c2:51",
            "net16": "b2:bd:79:dd:2b:01",
            "net17": "b6:51:4a:6e:85:e1",
            "net18": "da:3e:aa:e0:91:18",
            "net19": "06:37:68:55:85:62",
            "net2": "8e:d6:c8:8f:e9:71",
            "net20": "02:0e:e1:f0:5c:1c",
            "net21": "12:ca:13:dc:8e:18",
            "net22": "da:9d:f8:b6:13:b7",
            "net23": "0a:b8:6d:af:df:6f",
            "net24": "c2:53:17:99:73:89",
            "net25": "de:85:26:8e:53:ff",
            "net26": "66:de:78:92:1b:95",
            "net27": "2a:fe:ff:98:b5:f0",
            "net28": "ee:50:9c:1e:0a:5f",
            "net29": "e2:67:db:cf:5f:41",
            "net3": "7e:51:b0:eb:b1:8a",
            "net30": "32:eb:d3:63:b4:c1",
            "net31": "ea:8f:c9:cc:25:9f",
            "net4": "16:0b:e7:47:d2:7f",
            "net5": "46:af:a4:f3:54:e7",
            "net6": "6a:30:44:20:76:a4",
            "net7": "3a:85:36:de:34:90",
            "net8": "66:84:7b:ec:f0:db",
            "net9": "c6:ed:bf:81:c9:9f"
        },
        "tof_1_2_4": {
            "net0": "9a:c2:df:aa:9a:15",
            "net1": "22:0f:01:41:49:1e",
            "net10": "16:45:b7:77:f5:eb",
            "net11": "66:a3:62:55:34:66",
            "net12": "06:8b:a5:38:94:da",
            "net13": "96:14:88:dd:87:4e",
            "net14": "86:97:77:2a:9d:d5",
            "net15": "4a:cd:2d:ec:36:bb",
            "net16": "aa:d8:2b:4c:18:54",
            "net17": "c6:8e:4a:e7:de:2d",
            "net18": "e2:fd:7a:66:84:d2",
            "net19": "46:f2:d1:58:6f:1f",
            "net2": "42:3c:0a:26:aa:83",
            "net20": "1e:e2:42:2c:07:af",
            "net21": "32:f1:90:4b:45:4c",
            "net22": "9a:68:7c:ed:8d:1d",
            "net23": "b6:24:66:b0:55:76",
            "net24": "2a:e7:ce:a7:d8:f5",
            "net25": "e6:10:36:b0:74:9b",
            "net26": "6a:78:b8:31:fc:31",
            "net27": "22:21:40:72:8a:f9",
            "net28": "be:ea:9f:89:3a:81",
            "net29": "26:96:d9:7e:fa:9e",
            "net3": "f2:3f:a3:c3:d9:26",
            "net30": "42:ae:7b:56:7e:82",
            "net31": "ea:f7:c5:fc:8c:9c",
            "net4": "ca:10:5d:8b:4a:72",
            "net5": "ee:65:bb:0b:08:88",
            "net6": "16:91:bd:7a:93:ba",
            "net7": "9a:3f:e9:f0:51:af",
            "net8": "fa:e9:fa:cc:ac:1e",
            "net9": "2a:49:3a:53:f9:42"
        },
        "tof_1_2_5": {
            "net0": "1e:bb:5a:8d:3c:06",
            "net1": "9a:ef:2d:98:9d:db",
            "net10": "d2:ac:e5:02:1d:2f",
            "net11": "92:45:ea:69:bc:73",
            "net12": "0e:eb:24:cb:2d:96",
            "net13": "56:c7:70:dd:1e:85",
            "net14": "72:6e:3e:dd:96:97",
            "net15": "ce:f9:6b:b5:7f:ee",
            "net16": "f6:31:4e:fb:a0:bc",
            "net17": "6a:14:56:bf:87:0d",
            "net18": "0a:ce:b9:51:df:3a",
            "net19": "be:23:02:e0:0e:13",
            "net2": "4e:02:37:9a:9a:f4",
            "net20": "8a:df:f4:89:29:1a",
            "net21": "1a:31:9d:66:1c:a5",
            "net22": "aa:70:76:6f:fb:13",
            "net23": "76:36:e5:62:d8:e0",
            "net24": "86:bc:61:f5:8c:10",
            "net25": "92:e7:87:e0:c4:ea",
            "net26": "b2:49:11:e1:ec:41",
            "net27": "12:6f:0d:1a:00:31",
            "net28": "06:7c:6b:99:94:42",
            "net29": "56:9b:c6:71:20:a4",
            "net3": "6e:6d:0b:cc:6d:45",
            "net30": "9a:c1:36:d0:c2:29",
            "net31": "4e:9d:77:bb:97:fc",
            "net4": "9a:ac:b3:c1:ae:fd",
            "net5": "72:a1:29:64:ca:06",
            "net6": "b2:6e:de:b5:0e:d5",
            "net7": "82:c5:17:a6:35:64",
            "net8": "4a:38:49:7f:a5:cf",
            "net9": "4a:af:6c:26:9b:e1"
        },
        "tof_1_2_6": {
            "net0": "46:bc:08:98:b3:f8",
            "net1": "02:c0:39:d8:23:ec",
            "net10": "e6:1e:61:c9:c5:cc",
            "net11": "8a:51:76:ce:26:c5",
            "net12": "fe:e9:fb:98:0e:47",
            "net13": "8e:2c:b9:9b:24:44",
            "net14": "16:45:97:4b:43:36",
            "net15": "52:01:19:60:fb:48",
            "net16": "8a:78:8c:39:83:00",
            "net17": "26:9f:fc:0f:65:a5",
            "net18": "16:fd:9b:36:e9:fa",
            "net19": "42:21:62:d4:70:a4",
            "net2": "92:91:06:53:8c:f2",
            "net20": "0a:03:fa:14:7e:d7",
            "net21": "1a:9b:af:b5:b6:03",
            "net22": "a2:c7:1d:25:53:61",
            "net23": "1e:f9:5d:ed:1c:f8",
            "net24": "9e:d5:5e:4e:82:50",
            "net25": "1a:4e:10:5c:dd:d1",
            "net26": "d2:a9:d4:17:84:03",
            "net27": "a6:0c:fa:db:87:da",
            "net28": "aa:15:9c:29:d0:cf",
            "net29": "aa:19:9f:47:61:c1",
            "net3": "9e:d9:bf:c9:51:a0",
            "net30": "3a:33:7b:6c:a6:1c",
            "net31": "46:fe:cf:37:e8:91",
            "net4": "7e:c6:d4:98:bc:59",
            "net5": "e2:6a:fb:63:1d:de",
            "net6": "b6:3d:e0:af:48:61",
            "net7": "06:1c:7e:1e:f1:06",
            "net8": "0a:9c:e1:6a:e2:0b",
            "net9": "42:cb:18:3a:f5:da"
        },
        "tof_1_2_7": {
            "net0": "16:6b:54:53:e7:ad",
            "net1": "0a:23:cb:35:c2:87",
            "net10": "72:08:b2:c0:02:7b",
            "net11": "86:81:89:1d:bd:78",
            "net12": "7e:65:e0:a6:f5:b9",
            "net13": "ea:ab:d6:d2:d8:ca",
            "net14": "42:cc:dd:76:9c:d4",
            "net15": "d2:47:d5:0d:e4:ea",
            "net16": "ca:c2:85:44:79:ec",
            "net17": "66:dd:9f:63:93:0d",
            "net18": "06:98:fc:3f:75:f0",
            "net19": "9a:b1:96:d7:47:66",
            "net2": "82:7c:77:4c:99:a8",
            "net20": "d2:15:a8:da:16:dc",
            "net21": "36:83:17:43:0f:ef",
            "net22": "ee:e4:6e:37:c0:b0",
            "net23": "92:15:33:ed:09:f5",
            "net24": "ba:16:d0:9e:5d:d1",
            "net25": "5e:46:74:bd:0c:a3",
            "net26": "a6:d4:00:7c:7e:cf",
            "net27": "f6:4e:ec:8b:78:e4",
            "net28": "5e:b1:94:46:66:78",
            "net29": "b6:67:ac:ab:2c:e8",
            "net3": "c6:50:f2:0e:90:2e",
            "net30": "52:57:2b:f3:c4:f1",
            "net31": "12:df:a8:73:35:5a",
            "net4": "9a:ac:0b:4a:9c:5d",
            "net5": "12:53:7d:61:f4:15",
            "net6": "ee:65:29:8b:5d:f9",
            "net7": "be:32:1f:92:0c:fe",
            "net8": "da:a6:48:70:c0:d0",
            "net9": "5e:af:1c:04:cd:ba"
        },
        "tof_1_2_8": {
            "net0": "7a:be:e8:56:1d:5f",
            "net1": "92:91:2b:c7:c1:9d",
            "net10": "5e:26:a6:2c:d5:d9",
            "net11": "9e:cb:e2:98:7d:7f",
            "net12": "72:de:65:ea:d1:0a",
            "net13": "52:ae:8d:15:68:47",
            "net14": "72:ed:13:a2:e9:5f",
            "net15": "36:ca:6f:56:d8:fb",
            "net16": "2a:19:f3:b3:72:04",
            "net17": "16:78:4e:8b:d9:94",
            "net18": "66:3f:a9:b7:b8:df",
            "net19": "ba:98:10:40:74:19",
            "net2": "06:55:24:a8:70:4f",
            "net20": "7e:e8:fc:ec:b2:64",
            "net21": "3a:e7:63:6e:36:0c",
            "net22": "ee:27:96:e8:68:ba",
            "net23": "f6:bf:ca:aa:d7:09",
            "net24": "56:73:b5:f3:23:5d",
            "net25": "9e:a7:d0:45:e0:22",
            "net26": "42:28:b6:66:36:08",
            "net27": "86:86:7f:21:75:c0",
            "net28": "ce:ad:27:45:41:24",
            "net29": "76:19:05:ab:8b:bb",
            "net3": "26:be:30:e6:6f:87",
            "net30": "02:6d:95:38:59:6f",
            "net31": "66:cd:93:85:58:da",
            "net4": "8a:ba:78:9f:40:89",
            "net5": "3a:c9:a3:f2:f4:75",
            "net6": "86:99:98:05:5d:fa",
            "net7": "42:f9:b7:33:c7:49",
            "net8": "16:f3:6b:c3:d7:31",
            "net9": "f2:21:1c:31:eb:09"
        },
        "tof_1_2_9": {
            "net0": "42:ed:c3:fb:35:4b",
            "net1": "0a:98:e1:ba:43:ff",
            "net10": "1e:8b:76:68:74:0f",
            "net11": "62:e1:72:2f:98:59",
            "net12": "4e:3a:f9:8a:8f:c0",
            "net13": "f6:6a:5f:11:1d:80",
            "net14": "ae:12:b2:a1:8e:1f",
            "net15": "f2:e1:c7:d9:47:fd",
            "net16": "fa:2f:bd:68:9e:99",
            "net17": "ce:d1:78:2b:62:56",
            "net18": "06:e1:9e:f0:04:3b",
            "net19": "e2:e9:df:cc:60:a6",
            "net2": "56:a5:82:7a:7b:f4",
            "net20": "42:a9:31:5e:43:c1",
            "net21": "f2:9c:91:5f:62:7a",
            "net22": "d2:26:3f:0f:8a:9e",
            "net23": "72:65:f7:d7:f4:35",
            "net24": "0e:1c:e5:04:74:d5",
            "net25": "36:61:00:d5:9d:86",
            "net26": "c2:e5:69:fa:ba:e8",
            "net27": "c2:32:03:51:72:9b",
            "net28": "12:7b:29:26:00:63",
            "net29": "d2:84:02:8e:e8:b5",
            "net3": "ea:79:9e:75:48:4e",
            "net30": "06:49:6f:04:39:02",
            "net31": "56:34:10:4a:bf:7d",
            "net4": "96:ea:f9:1c:58:a7",
            "net5": "56:60:3d:de:5a:e0",
            "net6": "46:65:c8:e3:d3:ac",
            "net7": "26:40:64:a3:26:a8",
            "net8": "5a:a1:7f:e7:a6:fd",
            "net9": "26:bf:6e:73:bc:57"
        }
    },
    "failed_machine": "spine_1_1_1",
    "failed_interfaces": [
        "net16"
    ],
    "failure_time": 1615005354.0307748,
    "recover_time": 1615005595.455178
}