{
    "k_leaf": 14,
    "k_top": 14,
    "redundancy_factor": 14,
    "is_k8s": true,
    "machine_mac_addresses": {
        "leaf_1_0_1": {
            "net0": "aa:22:15:c3:62:d5",
            "net1": "22:75:99:fd:cb:02",
            "net10": "9a:c8:d1:6c:2d:d6",
            "net11": "be:ad:04:f8:f6:74",
            "net12": "22:d0:c4:7a:a4:0f",
            "net13": "42:c2:77:6f:98:ee",
            "net14": "62:57:8c:c2:a4:37",
            "net2": "6e:f1:90:c2:25:83",
            "net3": "9e:17:11:5e:86:29",
            "net4": "6e:70:f8:56:bb:8c",
            "net5": "fe:e3:8b:71:9c:80",
            "net6": "7e:12:f8:20:52:0e",
            "net7": "46:bd:31:b3:9b:fe",
            "net8": "ee:e5:30:44:da:24",
            "net9": "4e:d3:10:f3:52:33"
        },
        "leaf_1_0_10": {
            "net0": "9a:15:cd:ae:1d:a3",
            "net1": "52:ae:a2:d2:31:63",
            "net10": "7a:99:c4:5c:8f:73",
            "net11": "12:ae:57:90:9e:bd",
            "net12": "fe:49:d5:de:58:80",
            "net13": "b6:34:47:47:c2:b1",
            "net14": "9a:f6:b3:51:6b:ae",
            "net2": "26:24:ca:5b:21:4e",
            "net3": "9e:ff:58:28:a6:32",
            "net4": "7a:a7:5b:52:2f:2c",
            "net5": "0a:92:c1:53:17:18",
            "net6": "86:f0:ea:bc:51:b5",
            "net7": "1a:4b:40:cb:90:77",
            "net8": "5a:92:56:cb:a4:c7",
            "net9": "f6:e2:e3:34:80:d9"
        },
        "leaf_1_0_11": {
            "net0": "5a:83:41:b4:71:3c",
            "net1": "92:82:ec:86:e1:dd",
            "net10": "1e:d0:dd:52:f5:66",
            "net11": "ee:d7:43:2f:55:b2",
            "net12": "ba:a6:ae:56:1e:3c",
            "net13": "46:6f:60:be:0a:19",
            "net14": "aa:c0:86:b6:86:e6",
            "net2": "42:ef:47:4e:9d:d4",
            "net3": "42:37:96:4c:40:78",
            "net4": "aa:65:22:63:c1:35",
            "net5": "56:e1:35:fe:0f:c2",
            "net6": "8a:55:7c:b9:ca:e2",
            "net7": "e6:44:2c:a2:30:fb",
            "net8": "ca:0b:47:02:17:a4",
            "net9": "9e:4c:ec:ad:d8:4a"
        },
        "leaf_1_0_12": {
            "net0": "26:74:a0:dc:cd:fd",
            "net1": "e6:f2:de:c0:85:fd",
            "net10": "a2:25:a0:d2:ca:4a",
            "net11": "9e:79:cf:46:d4:87",
            "net12": "c2:f0:c1:3b:ae:30",
            "net13": "46:73:01:12:92:fa",
            "net14": "3a:15:38:15:b7:27",
            "net2": "c6:53:56:7b:b9:a7",
            "net3": "72:f0:ae:1f:2c:d7",
            "net4": "c6:09:4e:02:a2:34",
            "net5": "72:fe:91:59:93:c6",
            "net6": "42:a1:c6:c1:df:f7",
            "net7": "6a:49:a8:ce:8a:20",
            "net8": "a6:79:d6:8c:46:e8",
            "net9": "92:18:4f:c9:35:4f"
        },
        "leaf_1_0_13": {
            "net0": "aa:77:b4:a9:27:30",
            "net1": "62:24:b1:fa:0f:f5",
            "net10": "fa:d0:86:ba:f8:51",
            "net11": "5a:d2:8e:e5:5f:1e",
            "net12": "72:cf:3f:c9:9a:f5",
            "net13": "ba:4b:6b:28:5c:b1",
            "net14": "8e:df:74:99:cd:2f",
            "net2": "72:4e:3a:44:4f:c8",
            "net3": "22:11:e1:4f:ab:7d",
            "net4": "ca:d9:b2:ea:ca:82",
            "net5": "1a:3d:12:ed:27:1c",
            "net6": "e2:c3:2b:56:ae:f4",
            "net7": "7e:b0:01:80:e9:ec",
            "net8": "4a:15:9e:64:ee:1f",
            "net9": "da:97:12:0e:dd:31"
        },
        "leaf_1_0_14": {
            "net0": "06:1e:e3:cf:e2:d0",
            "net1": "6a:da:d6:43:27:88",
            "net10": "be:d3:5c:2c:8f:ad",
            "net11": "06:df:eb:85:24:ed",
            "net12": "42:ac:0a:e5:7e:b6",
            "net13": "7a:b0:9c:cf:98:3b",
            "net14": "96:e2:ff:d5:4a:e5",
            "net2": "86:e0:ef:73:91:f0",
            "net3": "82:71:1f:ad:f0:b2",
            "net4": "e6:8d:43:df:65:88",
            "net5": "ee:c4:15:f5:5b:9f",
            "net6": "ae:32:cc:2e:8b:a1",
            "net7": "0e:2b:e1:36:f6:19",
            "net8": "0a:47:5a:4d:2a:36",
            "net9": "42:06:b2:47:5b:de"
        },
        "leaf_1_0_2": {
            "net0": "52:93:ef:77:3e:8a",
            "net1": "fe:f0:91:1d:44:c4",
            "net10": "56:01:2a:ea:76:4f",
            "net11": "ee:9a:80:e9:08:fd",
            "net12": "d6:32:22:35:7c:5d",
            "net13": "e6:a0:a7:05:7a:66",
            "net14": "a6:65:db:3f:a9:38",
            "net2": "e2:2e:6d:8d:6f:e2",
            "net3": "56:bf:c9:17:4e:54",
            "net4": "5a:38:85:25:00:d1",
            "net5": "3a:06:b1:74:e8:11",
            "net6": "42:bb:9a:74:16:29",
            "net7": "3e:1f:05:7e:60:56",
            "net8": "72:2d:cf:ea:b1:38",
            "net9": "de:0e:3d:de:f1:24"
        },
        "leaf_1_0_3": {
            "net0": "5e:c7:7a:fc:50:95",
            "net1": "4a:bc:53:c2:e3:ae",
            "net10": "d2:97:69:9b:4d:ce",
            "net11": "76:7b:8e:66:f0:94",
            "net12": "12:23:ca:90:4d:4b",
            "net13": "5a:a9:0a:bb:16:b2",
            "net14": "c6:ee:5d:eb:bd:6f",
            "net2": "12:53:74:6c:44:5e",
            "net3": "b2:a0:9b:95:f2:1c",
            "net4": "86:92:79:ab:70:7f",
            "net5": "1e:da:3a:5d:f7:ad",
            "net6": "fa:0b:0d:d9:20:e9",
            "net7": "66:df:8d:83:60:98",
            "net8": "6e:9d:bf:2e:b9:f8",
            "net9": "ba:27:00:35:d3:95"
        },
        "leaf_1_0_4": {
            "net0": "52:cb:83:18:99:82",
            "net1": "76:4c:6b:bc:2c:a2",
            "net10": "ee:a5:16:73:b0:e4",
            "net11": "5e:3a:1c:3f:d1:12",
            "net12": "8a:91:a8:90:5a:3d",
            "net13": "ba:c6:14:e3:fd:55",
            "net14": "8e:38:51:35:63:c8",
            "net2": "e6:c9:32:93:60:86",
            "net3": "86:cf:db:85:d2:13",
            "net4": "76:ac:9e:d9:c7:49",
            "net5": "be:d1:62:2a:41:89",
            "net6": "4a:e1:8e:4d:19:d0",
            "net7": "46:5b:00:f8:9c:7f",
            "net8": "b2:6c:0c:fb:26:30",
            "net9": "c6:2a:90:21:a4:57"
        },
        "leaf_1_0_5": {
            "net0": "62:c5:4f:99:67:23",
            "net1": "16:57:01:aa:19:e3",
            "net10": "ba:54:9b:72:98:52",
            "net11": "96:52:a4:5e:22:c5",
            "net12": "ea:d6:78:48:a3:a9",
            "net13": "66:32:a4:c2:c5:f9",
            "net14": "de:b3:d4:d4:a2:49",
            "net2": "1a:7d:59:5f:8f:cf",
            "net3": "ce:3d:a0:51:a5:58",
            "net4": "26:9c:dd:3e:6c:f5",
            "net5": "c6:d5:04:0b:64:e7",
            "net6": "62:6d:85:80:fa:9a",
            "net7": "ca:df:1d:6b:87:56",
            "net8": "aa:39:f1:a0:4c:9e",
            "net9": "2a:f8:a2:71:7a:5a"
        },
        "leaf_1_0_6": {
            "net0": "92:66:e5:9b:55:d6",
            "net1": "2a:20:c3:3e:7a:9b",
            "net10": "fe:fb:3e:4a:c4:b5",
            "net11": "ee:3d:91:50:c1:3b",
            "net12": "7e:50:bb:e3:fc:41",
            "net13": "3a:28:50:68:a8:9a",
            "net14": "76:08:58:81:15:64",
            "net2": "ea:91:82:cc:de:44",
            "net3": "66:55:20:b6:64:72",
            "net4": "1e:88:a6:22:07:7b",
            "net5": "da:c5:7d:47:a0:71",
            "net6": "16:22:0d:57:ac:d5",
            "net7": "f2:b8:48:7e:02:40",
            "net8": "0a:1e:10:37:be:8b",
            "net9": "92:33:54:50:76:84"
        },
        "leaf_1_0_7": {
            "net0": "5a:a9:b7:f7:04:a2",
            "net1": "e2:34:a0:69:13:db",
            "net10": "8a:92:67:3d:a8:77",
            "net11": "a2:4f:30:32:47:3b",
            "net12": "9a:5c:ac:64:79:d8",
            "net13": "9e:2b:38:8c:b3:0f",
            "net14": "1a:02:f2:b5:f6:99",
            "net2": "e2:ae:62:f6:5e:3d",
            "net3": "7a:89:ac:6f:72:aa",
            "net4": "02:9e:71:55:eb:a4",
            "net5": "f6:69:42:66:bc:32",
            "net6": "b2:53:75:d1:19:e1",
            "net7": "9e:51:46:cf:71:c7",
            "net8": "e6:fa:1c:59:3a:c8",
            "net9": "0a:fe:a2:ab:c4:d0"
        },
        "leaf_1_0_8": {
            "net0": "f6:e9:02:ee:2c:ca",
            "net1": "46:a0:c9:49:19:0b",
            "net10": "ca:30:be:89:44:0f",
            "net11": "22:07:91:92:89:7e",
            "net12": "22:6e:01:a0:73:96",
            "net13": "e2:e3:55:a9:a7:d6",
            "net14": "1e:3f:5e:e7:73:f2",
            "net2": "e6:92:f9:5c:b3:91",
            "net3": "2e:7c:6b:75:69:a5",
            "net4": "3a:f5:d9:76:4e:d1",
            "net5": "1a:4e:83:a8:cd:63",
            "net6": "ee:ee:85:6a:be:4e",
            "net7": "96:12:1c:08:7e:14",
            "net8": "22:91:88:0d:0b:99",
            "net9": "2e:b2:7a:7f:9e:3f"
        },
        "leaf_1_0_9": {
            "net0": "a6:78:f2:b6:58:ca",
            "net1": "3e:87:79:40:0f:d2",
            "net10": "ea:77:de:e0:fb:8d",
            "net11": "12:c2:ca:f8:a5:d0",
            "net12": "52:75:4a:e0:c6:8a",
            "net13": "ee:f2:21:4c:fe:61",
            "net14": "46:7e:28:14:f6:69",
            "net2": "be:87:64:5f:2d:3d",
            "net3": "22:81:09:d2:e6:52",
            "net4": "02:db:9a:5e:10:a1",
            "net5": "3a:5e:9a:af:7b:b9",
            "net6": "f6:93:a6:74:8d:c0",
            "net7": "ca:d4:6d:2d:b7:7f",
            "net8": "7a:a6:c9:3f:d3:31",
            "net9": "a2:b1:64:ff:c1:6e"
        },
        "leaf_2_0_1": {
            "net0": "6e:c0:33:90:95:22",
            "net1": "a2:97:eb:be:4f:72",
            "net10": "ba:b4:5a:5d:8a:be",
            "net11": "3e:9b:18:56:09:03",
            "net12": "32:d6:66:83:1c:0e",
            "net13": "d6:bc:58:93:76:f1",
            "net14": "52:20:20:c0:19:5e",
            "net2": "b2:b5:1e:34:7b:dd",
            "net3": "de:a9:50:74:0b:28",
            "net4": "a6:e8:fb:c0:27:5f",
            "net5": "86:30:63:28:d1:17",
            "net6": "82:bf:ad:a7:4e:64",
            "net7": "46:8f:82:3a:c2:69",
            "net8": "9e:c5:71:db:cf:8e",
            "net9": "de:61:82:f0:49:d9"
        },
        "leaf_2_0_10": {
            "net0": "42:e4:b0:36:2b:a4",
            "net1": "f6:f5:a0:e7:67:81",
            "net10": "3e:b6:78:4d:9c:b7",
            "net11": "8e:fe:bd:c6:87:b6",
            "net12": "8e:11:d4:71:50:6c",
            "net13": "42:fa:a6:63:ae:b5",
            "net14": "ea:3d:07:18:48:e5",
            "net2": "76:88:8b:8b:d7:2e",
            "net3": "ae:45:6c:a7:c2:8f",
            "net4": "12:1e:f1:e5:c0:e5",
            "net5": "aa:b9:b9:ea:6c:b2",
            "net6": "06:d5:0d:57:e8:1a",
            "net7": "72:14:37:54:52:4e",
            "net8": "42:90:0d:a1:3b:8c",
            "net9": "ee:86:6b:40:78:f7"
        },
        "leaf_2_0_11": {
            "net0": "6e:20:99:5d:69:e1",
            "net1": "32:b0:34:7a:69:d5",
            "net10": "3a:e6:12:6a:37:95",
            "net11": "96:0a:30:27:9f:14",
            "net12": "5e:07:52:31:70:5b",
            "net13": "da:81:62:25:f0:00",
            "net14": "1a:e9:98:1b:26:48",
            "net2": "96:d7:08:04:ac:28",
            "net3": "c6:d4:97:74:b5:27",
            "net4": "7e:68:e0:57:f5:45",
            "net5": "56:32:68:88:93:4e",
            "net6": "02:b2:f2:ad:13:32",
            "net7": "2e:c2:c5:9c:4f:72",
            "net8": "9e:ce:f2:dd:85:e1",
            "net9": "16:8c:8e:10:51:bd"
        },
        "leaf_2_0_12": {
            "net0": "ba:17:64:2a:03:23",
            "net1": "a2:f0:86:8a:53:71",
            "net10": "52:dd:45:8a:f5:1e",
            "net11": "2e:58:79:de:6d:f7",
            "net12": "12:de:60:34:eb:63",
            "net13": "92:35:e6:77:28:3f",
            "net14": "ee:9b:eb:e9:9f:47",
            "net2": "fa:d4:9b:ed:c2:83",
            "net3": "aa:68:8a:8d:01:82",
            "net4": "de:e2:54:16:90:a5",
            "net5": "ea:a2:35:dc:7a:bb",
            "net6": "52:c9:e4:a5:ce:99",
            "net7": "76:68:b3:32:bb:2e",
            "net8": "7a:e4:3b:ed:03:5c",
            "net9": "c6:76:f4:1c:6f:cb"
        },
        "leaf_2_0_13": {
            "net0": "46:f5:20:8f:94:a3",
            "net1": "1e:0b:e1:ba:fd:87",
            "net10": "aa:18:cf:87:f6:f9",
            "net11": "76:9a:3f:05:47:8a",
            "net12": "e2:9d:55:53:0d:60",
            "net13": "be:51:57:8f:31:ab",
            "net14": "f6:aa:a4:08:54:25",
            "net2": "8a:94:2b:9c:f4:54",
            "net3": "66:6f:83:be:29:5f",
            "net4": "42:57:ef:e8:a0:42",
            "net5": "9a:c3:b5:89:cf:a4",
            "net6": "a6:8a:6d:c2:c9:da",
            "net7": "ee:c3:d9:cc:62:be",
            "net8": "7a:a9:c5:8c:97:7a",
            "net9": "1e:f4:b5:5a:6d:3a"
        },
        "leaf_2_0_14": {
            "net0": "da:08:3b:b0:1c:ae",
            "net1": "de:6e:98:53:df:3e",
            "net10": "f2:c9:37:e8:e9:ce",
            "net11": "9e:fd:88:24:a3:79",
            "net12": "aa:14:64:4f:91:8b",
            "net13": "b6:fc:e0:55:57:33",
            "net14": "2a:a7:9c:72:9b:10",
            "net2": "fa:a5:14:8c:83:31",
            "net3": "fa:ee:cb:24:25:8a",
            "net4": "f2:84:77:f4:f0:6f",
            "net5": "1a:4a:44:5e:5a:e7",
            "net6": "66:4f:b8:5a:fa:9d",
            "net7": "b2:c6:2e:74:01:28",
            "net8": "be:fd:a1:cd:a5:b0",
            "net9": "ea:b0:f5:93:92:4b"
        },
        "leaf_2_0_2": {
            "net0": "96:16:c8:e8:d5:3a",
            "net1": "f6:38:3a:8f:16:79",
            "net10": "9e:43:07:de:9a:23",
            "net11": "2a:7a:92:ef:da:a3",
            "net12": "b2:f9:e7:8a:91:a2",
            "net13": "3a:e6:26:e9:46:69",
            "net14": "c2:a0:e2:f1:cd:de",
            "net2": "76:c2:aa:73:9a:c6",
            "net3": "26:60:8a:58:3f:1f",
            "net4": "7a:02:2e:8e:f7:60",
            "net5": "3e:ba:92:c8:42:c2",
            "net6": "ce:5f:af:2c:6c:29",
            "net7": "2e:94:89:92:9f:43",
            "net8": "0a:ee:7a:fc:6a:cb",
            "net9": "b6:f4:6f:d3:88:80"
        },
        "leaf_2_0_3": {
            "net0": "2e:2a:aa:e4:40:4c",
            "net1": "4e:1c:71:b8:86:c2",
            "net10": "f2:03:3a:50:79:41",
            "net11": "66:16:59:79:ec:97",
            "net12": "7a:a3:1d:ed:0e:f8",
            "net13": "ce:fd:cc:ea:76:2a",
            "net14": "8e:19:7d:df:dc:0a",
            "net2": "2e:b4:15:77:2f:c0",
            "net3": "a6:5f:5b:fb:96:6d",
            "net4": "42:14:d2:9e:ab:f1",
            "net5": "62:d2:a4:11:20:5c",
            "net6": "56:ab:43:27:60:b6",
            "net7": "ba:97:5e:91:56:08",
            "net8": "a6:1b:c4:f7:fe:46",
            "net9": "be:e5:b7:44:37:5d"
        },
        "leaf_2_0_4": {
            "net0": "32:1f:62:7e:9e:a5",
            "net1": "6e:82:d4:41:54:14",
            "net10": "ce:20:73:d1:f9:f3",
            "net11": "6a:a8:12:f5:5b:ce",
            "net12": "aa:39:92:89:74:18",
            "net13": "3e:e1:fd:e2:5b:b7",
            "net14": "ce:8b:5a:01:a3:b9",
            "net2": "fe:6e:36:24:8f:30",
            "net3": "96:e5:b4:5c:14:4a",
            "net4": "2a:42:3e:6f:0d:09",
            "net5": "32:e7:72:dd:ce:8c",
            "net6": "4a:78:b1:b6:8e:b5",
            "net7": "ea:6d:81:d9:c7:b9",
            "net8": "0e:7f:b4:8b:9e:65",
            "net9": "f6:1d:33:28:3d:a3"
        },
        "leaf_2_0_5": {
            "net0": "4a:a5:ec:8c:61:e3",
            "net1": "5a:be:1e:81:d3:85",
            "net10": "82:af:95:bc:6f:21",
            "net11": "aa:31:06:6b:e7:5b",
            "net12": "42:ed:b1:73:07:6c",
            "net13": "3e:a2:cd:6e:7d:25",
            "net14": "e6:ed:89:ac:d3:17",
            "net2": "46:e4:53:a0:d7:a4",
            "net3": "92:c9:98:35:6a:38",
            "net4": "1e:5a:5d:fc:be:a6",
            "net5": "ee:5e:a7:db:0b:f5",
            "net6": "ca:f9:08:e5:53:c2",
            "net7": "fe:46:19:47:c8:ab",
            "net8": "9a:12:b4:be:f7:c1",
            "net9": "da:b4:83:8d:65:17"
        },
        "leaf_2_0_6": {
            "net0": "fa:87:4b:a6:19:fa",
            "net1": "62:ac:c1:fb:3c:88",
            "net10": "a6:b5:21:d7:2f:d7",
            "net11": "c6:3b:7e:24:e4:bc",
            "net12": "4e:b6:a3:6e:6d:40",
            "net13": "6a:b4:b8:ca:f5:1c",
            "net14": "d6:94:bd:53:3f:8b",
            "net2": "e6:a0:48:6d:04:ce",
            "net3": "1a:70:93:df:05:51",
            "net4": "02:7e:9f:85:71:02",
            "net5": "b6:9e:37:08:10:1a",
            "net6": "2a:0e:a1:fc:7b:9b",
            "net7": "12:cd:0a:6b:58:c0",
            "net8": "ea:e6:58:37:ad:be",
            "net9": "ce:2a:6f:d9:8e:df"
        },
        "leaf_2_0_7": {
            "net0": "3e:8f:60:5c:df:17",
            "net1": "06:9c:c4:de:64:89",
            "net10": "3e:56:9d:68:80:b8",
            "net11": "52:73:dd:77:d5:a7",
            "net12": "c6:a9:d2:1b:3d:7b",
            "net13": "b6:cf:a2:2c:d4:37",
            "net14": "c2:87:e7:e9:cc:e9",
            "net2": "42:9c:04:5a:35:1f",
            "net3": "1e:b7:60:98:98:b4",
            "net4": "b2:34:94:93:63:d6",
            "net5": "ca:7b:95:fe:5c:ff",
            "net6": "da:f0:a1:ad:45:33",
            "net7": "6e:ce:c6:53:bb:4a",
            "net8": "2e:1d:90:5d:76:ce",
            "net9": "ea:a7:e3:3c:e7:91"
        },
        "leaf_2_0_8": {
            "net0": "36:b8:f8:a4:71:c0",
            "net1": "36:58:39:d2:a6:38",
            "net10": "a6:f8:fb:1b:f3:4c",
            "net11": "0a:e4:5c:f0:d4:db",
            "net12": "16:66:37:b6:e3:10",
            "net13": "2e:7e:df:9b:71:1a",
            "net14": "c2:11:60:a0:6f:6d",
            "net2": "02:ec:ae:c6:77:da",
            "net3": "02:01:3c:63:dc:6e",
            "net4": "42:2d:52:12:cd:64",
            "net5": "ca:06:03:67:ac:ac",
            "net6": "c2:6d:15:b2:7f:0e",
            "net7": "be:f5:10:83:e9:5b",
            "net8": "5e:2d:ab:51:cb:b7",
            "net9": "f6:20:5e:31:e2:31"
        },
        "leaf_2_0_9": {
            "net0": "ce:f4:34:c9:f9:e4",
            "net1": "1a:29:e1:de:4e:63",
            "net10": "16:3f:fe:c5:4a:fc",
            "net11": "62:28:70:01:ad:74",
            "net12": "02:02:af:c9:1b:39",
            "net13": "3a:fc:ab:9d:ad:5d",
            "net14": "a6:e4:2a:b2:2c:f8",
            "net2": "7a:88:28:35:7e:ac",
            "net3": "52:30:05:49:12:6f",
            "net4": "3a:dc:b8:6a:eb:8b",
            "net5": "3a:cc:1b:f7:dd:69",
            "net6": "e2:48:94:36:e8:b3",
            "net7": "8e:33:96:21:86:ef",
            "net8": "7e:fa:b2:ee:03:d8",
            "net9": "e2:33:41:c2:d4:eb"
        },
        "spine_1_1_1": {
            "net0": "5e:33:01:25:6c:06",
            "net1": "22:79:f8:42:ef:4a",
            "net10": "c2:9a:b6:1b:df:da",
            "net11": "22:70:c8:1f:b5:03",
            "net12": "1e:b0:b4:44:76:b6",
            "net13": "1e:66:53:72:14:bb",
            "net14": "b6:81:3e:64:e4:f0",
            "net15": "be:b3:84:a4:77:4b",
            "net16": "76:44:8c:fe:cd:b6",
            "net17": "3a:6c:dd:c1:29:2d",
            "net18": "1a:8c:7d:8b:39:6c",
            "net19": "9e:0d:e2:99:67:e1",
            "net2": "1e:12:f2:2c:c2:4d",
            "net20": "0a:2f:45:20:da:95",
            "net21": "16:5c:60:f8:44:dd",
            "net22": "9a:81:5e:45:0e:c7",
            "net23": "b2:88:9f:70:8f:02",
            "net24": "26:1d:ce:e3:8a:3b",
            "net25": "ee:60:1c:60:57:c9",
            "net26": "8e:44:da:c7:c9:5b",
            "net27": "f2:b9:b0:51:81:bc",
            "net3": "52:cf:e1:c8:3a:bf",
            "net4": "7a:e2:31:de:c8:2c",
            "net5": "aa:83:9f:b2:b3:e4",
            "net6": "a6:e2:74:da:ed:3a",
            "net7": "06:12:53:96:6d:12",
            "net8": "5a:f3:86:fc:9f:e0",
            "net9": "4e:69:ad:67:52:90"
        },
        "spine_1_1_10": {
            "net0": "46:4b:4c:1f:cc:d4",
            "net1": "ba:77:d0:a7:5f:b9",
            "net10": "ca:be:42:66:7a:12",
            "net11": "9a:a0:ae:2b:10:68",
            "net12": "62:5f:5e:6b:26:32",
            "net13": "e2:09:f1:7b:7c:8d",
            "net14": "5e:0b:fe:5d:d0:f5",
            "net15": "1a:3a:28:2c:e4:f7",
            "net16": "52:78:4d:0a:0b:ef",
            "net17": "b2:a4:79:e0:e4:5c",
            "net18": "da:24:30:9f:b1:dd",
            "net19": "a2:b9:36:42:a2:67",
            "net2": "d6:18:fd:73:04:00",
            "net20": "5e:10:74:62:41:47",
            "net21": "02:f3:b9:82:10:3d",
            "net22": "f2:79:54:c6:85:17",
            "net23": "42:5e:db:d5:71:10",
            "net24": "5a:51:60:3f:4e:65",
            "net25": "9e:23:ca:99:58:dd",
            "net26": "32:80:bd:d1:e0:5d",
            "net27": "6a:4d:e2:12:df:1b",
            "net3": "ea:e4:a9:5a:22:dc",
            "net4": "36:60:46:11:b0:57",
            "net5": "3e:b1:8e:76:e1:33",
            "net6": "2e:b8:a2:db:72:fe",
            "net7": "e6:1c:36:4c:a1:94",
            "net8": "46:0a:2f:e0:c7:2e",
            "net9": "ba:17:4e:5a:f6:29"
        },
        "spine_1_1_11": {
            "net0": "1e:a8:4d:70:8b:39",
            "net1": "7a:06:86:d9:11:24",
            "net10": "12:8b:44:42:08:fa",
            "net11": "96:9f:53:77:32:67",
            "net12": "5a:89:09:82:08:a8",
            "net13": "fe:6f:67:5b:83:a2",
            "net14": "da:94:51:aa:5b:f8",
            "net15": "86:51:0e:c1:de:26",
            "net16": "66:13:a2:d8:4b:c4",
            "net17": "52:55:7d:ed:fc:69",
            "net18": "ae:0c:b4:b4:c2:79",
            "net19": "26:4e:b4:e6:33:fd",
            "net2": "6a:7b:31:f0:b5:5c",
            "net20": "f2:87:ec:1f:1e:9b",
            "net21": "62:80:28:37:22:27",
            "net22": "8e:5b:63:c7:ec:34",
            "net23": "de:23:da:ec:2d:98",
            "net24": "da:8d:8b:5c:41:1b",
            "net25": "1e:8c:f8:70:a9:25",
            "net26": "ae:69:69:3f:8f:d0",
            "net27": "ea:a2:e6:5a:71:de",
            "net3": "fa:dc:6d:38:0c:50",
            "net4": "c6:db:d3:01:a8:90",
            "net5": "4a:a8:f3:96:3a:47",
            "net6": "5a:7a:86:71:cc:da",
            "net7": "8e:67:b7:49:24:59",
            "net8": "b6:31:30:12:93:52",
            "net9": "6a:08:37:f5:ba:0f"
        },
        "spine_1_1_12": {
            "net0": "0e:5c:3f:e9:a3:12",
            "net1": "9a:ac:e8:93:a4:d6",
            "net10": "9e:f4:db:0c:4b:33",
            "net11": "8e:51:8b:e0:14:36",
            "net12": "22:e2:0b:ca:b6:36",
            "net13": "fe:69:e9:ff:42:cb",
            "net14": "9e:56:66:2d:e1:94",
            "net15": "b2:6c:b6:20:90:34",
            "net16": "a2:d5:1e:47:0f:4f",
            "net17": "26:90:d5:3f:05:e7",
            "net18": "1e:6b:d9:a0:6a:8f",
            "net19": "22:33:f8:a8:a5:24",
            "net2": "32:c8:fe:c8:51:3d",
            "net20": "c2:15:76:47:b1:72",
            "net21": "52:76:71:c2:7f:49",
            "net22": "26:e3:2e:ea:ce:93",
            "net23": "ba:0d:c6:82:f1:7b",
            "net24": "ba:07:a1:bb:f4:5a",
            "net25": "4e:ca:e1:2b:8d:c7",
            "net26": "66:e3:3a:90:7c:41",
            "net27": "86:b5:12:85:ff:70",
            "net3": "82:b9:72:b0:cf:38",
            "net4": "32:5d:ea:80:71:07",
            "net5": "1a:10:06:dd:c3:03",
            "net6": "9a:0f:e8:54:78:6c",
            "net7": "6a:2e:35:99:f7:19",
            "net8": "6e:3e:31:f2:04:c7",
            "net9": "46:b6:51:04:f6:a7"
        },
        "spine_1_1_13": {
            "net0": "6e:28:c4:b1:96:7c",
            "net1": "d6:0a:fd:e5:65:78",
            "net10": "62:38:c5:de:ea:ba",
            "net11": "a6:14:59:4f:17:30",
            "net12": "6e:00:0e:2b:7e:47",
            "net13": "a2:66:1c:28:d7:ac",
            "net14": "32:a5:b7:d9:2f:fb",
            "net15": "1a:ba:fb:3a:c0:25",
            "net16": "9e:9b:c7:f2:12:f2",
            "net17": "9a:7b:e8:7b:6f:1f",
            "net18": "96:df:43:ee:19:6a",
            "net19": "16:e8:fd:6a:c5:1b",
            "net2": "d6:9b:2e:34:a7:2b",
            "net20": "06:68:36:8b:44:a0",
            "net21": "62:5d:8a:a6:a5:71",
            "net22": "0a:35:9e:d9:ad:20",
            "net23": "22:93:84:ab:7f:9f",
            "net24": "8a:b2:12:f0:cc:90",
            "net25": "2e:20:9e:04:91:2c",
            "net26": "82:3e:00:e1:0e:66",
            "net27": "de:76:68:d9:0b:dd",
            "net3": "da:5d:85:31:ea:a4",
            "net4": "6e:be:05:e9:50:23",
            "net5": "7a:6a:e3:1f:b5:23",
            "net6": "1a:d5:74:00:d9:06",
            "net7": "86:a5:0c:8f:34:67",
            "net8": "5e:54:f5:06:58:9c",
            "net9": "f6:a0:73:fd:12:ec"
        },
        "spine_1_1_14": {
            "net0": "d6:66:e7:95:d8:a3",
            "net1": "ea:84:45:2c:07:a6",
            "net10": "ea:9b:98:ee:ee:4a",
            "net11": "36:01:fe:e7:2f:39",
            "net12": "9a:20:48:e0:ca:8c",
            "net13": "36:19:88:a1:75:0a",
            "net14": "22:61:77:b9:27:bb",
            "net15": "7e:0c:ab:43:70:03",
            "net16": "c6:9c:aa:21:4f:3e",
            "net17": "ca:d9:aa:bc:ef:58",
            "net18": "06:7a:f6:a0:69:68",
            "net19": "66:ff:39:b0:d2:99",
            "net2": "b2:de:87:8f:27:e1",
            "net20": "8a:f9:b9:24:21:56",
            "net21": "66:86:51:d5:21:6b",
            "net22": "36:04:a2:41:42:79",
            "net23": "fa:c4:35:66:19:18",
            "net24": "be:82:0d:a4:eb:43",
            "net25": "d2:12:37:f4:9f:37",
            "net26": "36:8d:c2:94:df:e4",
            "net27": "0a:67:9b:f8:6e:ef",
            "net3": "ce:d4:c2:b6:01:30",
            "net4": "9e:a0:ac:8b:c2:57",
            "net5": "fe:15:18:aa:28:8d",
            "net6": "06:2d:ad:39:73:07",
            "net7": "96:d5:04:db:32:02",
            "net8": "6a:ff:2d:75:93:07",
            "net9": "62:ba:eb:d1:c1:d3"
        },
        "spine_1_1_2": {
            "net0": "12:80:9d:bc:e5:97",
            "net1": "fe:88:87:e2:0d:35",
            "net10": "fa:04:f3:cb:36:13",
            "net11": "d6:18:ac:32:84:ec",
            "net12": "fa:af:78:5f:9b:73",
            "net13": "f6:0f:82:9e:0d:99",
            "net14": "3e:18:f1:b7:03:71",
            "net15": "1e:73:a1:ea:5a:d0",
            "net16": "ba:a4:8c:39:b9:37",
            "net17": "66:ec:e1:ae:81:a4",
            "net18": "a2:b5:6d:4e:69:39",
            "net19": "62:65:f7:47:09:83",
            "net2": "e6:26:f6:75:d6:20",
            "net20": "e2:34:2b:75:05:fc",
            "net21": "f6:ee:59:8d:06:c2",
            "net22": "de:30:a8:85:80:0b",
            "net23": "2e:86:2c:01:70:0f",
            "net24": "96:42:10:63:7b:ec",
            "net25": "32:67:99:8e:5e:33",
            "net26": "5a:e8:0b:a3:3e:75",
            "net27": "d6:8b:4c:4a:b9:f4",
            "net3": "5e:5f:84:10:95:12",
            "net4": "6e:2c:40:2e:d3:94",
            "net5": "42:e5:b0:b4:f1:24",
            "net6": "b2:d9:f7:f7:3e:55",
            "net7": "92:e6:a1:94:0c:93",
            "net8": "3e:08:d7:fe:93:e2",
            "net9": "66:ab:40:06:e2:c8"
        },
        "spine_1_1_3": {
            "net0": "56:ac:fb:23:b5:bf",
            "net1": "c6:f4:71:3f:33:ce",
            "net10": "ae:d4:8c:16:f5:71",
            "net11": "76:87:8e:c6:b9:7b",
            "net12": "b6:0b:de:74:7d:98",
            "net13": "56:8a:46:9d:cc:5e",
            "net14": "3a:6b:d1:c1:94:f4",
            "net15": "c2:00:95:1b:03:bc",
            "net16": "5a:bd:b6:52:59:fc",
            "net17": "7e:a5:15:21:76:ce",
            "net18": "fa:e2:51:63:49:e2",
            "net19": "26:06:87:b4:f3:8b",
            "net2": "e2:c5:ce:b4:a0:d4",
            "net20": "32:06:ba:ac:f7:3f",
            "net21": "46:47:3e:72:c2:7d",
            "net22": "1e:77:c0:d6:86:c9",
            "net23": "ae:62:4b:58:ec:da",
            "net24": "c2:c0:e2:61:bb:c3",
            "net25": "22:ee:63:7e:d8:7b",
            "net26": "62:12:9c:8c:11:b0",
            "net27": "5a:2b:98:4e:72:0f",
            "net3": "66:f5:8f:10:19:ac",
            "net4": "1a:a5:37:68:1c:a1",
            "net5": "fa:56:04:db:95:cd",
            "net6": "ae:ef:c9:92:21:8c",
            "net7": "fa:af:6d:3c:67:2e",
            "net8": "52:27:59:4b:6b:1a",
            "net9": "2e:db:b5:0f:32:ec"
        },
        "spine_1_1_4": {
            "net0": "22:06:f7:41:b7:56",
            "net1": "62:a9:98:d2:ad:77",
            "net10": "0a:ad:01:94:db:50",
            "net11": "7a:fe:f6:16:fc:3f",
            "net12": "ca:da:b0:c3:b2:11",
            "net13": "52:37:a1:8f:b6:19",
            "net14": "c2:44:86:4e:ce:9d",
            "net15": "ba:40:45:ae:9f:68",
            "net16": "8e:b2:1b:a2:0c:5a",
            "net17": "62:11:1b:02:9d:a9",
            "net18": "fa:a0:dc:98:fe:eb",
            "net19": "72:0f:25:65:fc:12",
            "net2": "8e:7b:97:fd:77:33",
            "net20": "da:c8:c9:a1:da:26",
            "net21": "02:12:58:f6:dc:69",
            "net22": "12:48:2a:e0:68:15",
            "net23": "ca:af:54:e9:55:21",
            "net24": "2a:55:d7:57:5b:72",
            "net25": "7a:ce:1c:1f:23:f1",
            "net26": "6a:9e:ec:d9:a8:0c",
            "net27": "62:bc:c1:03:be:4a",
            "net3": "5a:6d:49:7a:52:20",
            "net4": "fe:58:53:3e:99:5b",
            "net5": "ba:9c:ed:9d:de:92",
            "net6": "ca:28:bf:c6:e3:2c",
            "net7": "76:87:39:be:a4:11",
            "net8": "de:cd:33:10:e4:c3",
            "net9": "2a:03:bc:f5:8c:84"
        },
        "spine_1_1_5": {
            "net0": "52:dd:f5:43:7a:5c",
            "net1": "e2:3e:4b:c1:42:21",
            "net10": "b2:ea:7e:fa:44:c4",
            "net11": "56:33:8e:7e:a3:8e",
            "net12": "fe:2e:fa:2a:99:e0",
            "net13": "7a:da:17:57:45:a3",
            "net14": "3e:64:82:9e:37:c4",
            "net15": "c2:2f:ac:f8:76:57",
            "net16": "be:9c:1f:d8:32:07",
            "net17": "f2:84:65:5c:93:50",
            "net18": "fa:b7:44:5b:09:fb",
            "net19": "1a:13:cd:c1:cd:44",
            "net2": "d2:4a:3a:4e:86:01",
            "net20": "fe:a5:72:36:f3:07",
            "net21": "7e:bc:e7:13:e5:a5",
            "net22": "ba:ab:00:5b:9f:f2",
            "net23": "de:d5:6b:af:47:1b",
            "net24": "66:93:84:d4:16:1c",
            "net25": "06:29:73:64:30:45",
            "net26": "5a:81:6c:e8:85:f1",
            "net27": "8e:7f:92:0a:ca:5f",
            "net3": "b6:f1:cd:65:6e:7c",
            "net4": "2e:45:fd:25:ef:c9",
            "net5": "ea:f8:19:78:10:2b",
            "net6": "6e:05:8d:d9:55:46",
            "net7": "4a:34:85:ac:05:b4",
            "net8": "0a:b2:f2:00:2f:df",
            "net9": "62:f0:b7:70:2e:60"
        },
        "spine_1_1_6": {
            "net0": "06:56:bd:f6:5a:7a",
            "net1": "8e:83:cd:fd:34:89",
            "net10": "16:f8:44:c0:69:13",
            "net11": "ae:04:2c:42:2f:e7",
            "net12": "32:0a:73:f1:9f:31",
            "net13": "6a:f0:f0:8b:9b:14",
            "net14": "a6:2c:11:14:c5:04",
            "net15": "66:a1:d2:8d:ac:f5",
            "net16": "36:d2:70:c1:15:c5",
            "net17": "5a:d1:5f:fd:d7:c2",
            "net18": "26:21:ce:eb:e3:74",
            "net19": "5a:08:e3:9d:a8:6d",
            "net2": "de:18:24:ae:07:b7",
            "net20": "42:e9:47:03:da:02",
            "net21": "a2:a7:69:cc:48:f6",
            "net22": "fa:54:77:c2:c1:4c",
            "net23": "96:2e:fc:70:06:ac",
            "net24": "1a:af:6a:2f:82:05",
            "net25": "ee:70:28:52:18:ae",
            "net26": "a6:34:23:4b:17:a3",
            "net27": "8e:c5:a9:6e:0c:1c",
            "net3": "ce:16:a4:d7:e8:2d",
            "net4": "86:be:90:d9:8c:a0",
            "net5": "16:49:a9:34:f1:a7",
            "net6": "7a:c5:11:b3:6c:cf",
            "net7": "a6:72:09:f4:d8:d3",
            "net8": "ee:05:ab:59:5f:cf",
            "net9": "b6:b7:25:57:a8:ba"
        },
        "spine_1_1_7": {
            "net0": "b6:15:37:2f:c7:8b",
            "net1": "12:12:2e:b0:7a:08",
            "net10": "ea:61:e5:c7:62:f6",
            "net11": "72:f1:41:e8:8b:a7",
            "net12": "4a:52:e7:fd:02:1f",
            "net13": "ba:2b:87:17:bf:ee",
            "net14": "e6:c9:2b:47:b5:0c",
            "net15": "ca:34:75:8c:f8:cd",
            "net16": "da:83:17:6b:3b:f7",
            "net17": "f2:3e:3c:b7:c4:c8",
            "net18": "4a:91:d8:8d:8b:14",
            "net19": "9a:22:80:bd:89:08",
            "net2": "5a:c8:f0:c4:d5:19",
            "net20": "9e:54:e7:00:fd:40",
            "net21": "46:ac:10:92:0e:ca",
            "net22": "66:8f:e0:4b:cc:17",
            "net23": "aa:3d:92:33:ad:3b",
            "net24": "06:86:44:5d:0a:2f",
            "net25": "ae:ff:c0:11:74:3e",
            "net26": "76:a3:84:6c:65:01",
            "net27": "72:5b:fb:36:cf:60",
            "net3": "6e:f4:ca:42:ba:0e",
            "net4": "76:0a:e2:a2:e4:af",
            "net5": "a6:fb:87:8c:40:26",
            "net6": "f2:24:9a:3f:f7:47",
            "net7": "de:73:ed:e6:9d:c4",
            "net8": "12:7f:f5:0f:e2:29",
            "net9": "1a:89:27:a6:aa:4c"
        },
        "spine_1_1_8": {
            "net0": "fa:55:1d:5c:5e:54",
            "net1": "aa:88:b5:ac:df:0e",
            "net10": "26:cc:ef:1f:ae:54",
            "net11": "6a:46:90:f0:ce:37",
            "net12": "e6:34:b8:79:9d:a4",
            "net13": "a2:7d:1a:d1:a7:88",
            "net14": "a6:9a:05:a7:27:7b",
            "net15": "36:ea:83:1e:70:cb",
            "net16": "66:21:99:37:21:c2",
            "net17": "36:ce:aa:92:67:a6",
            "net18": "6a:42:83:c7:78:77",
            "net19": "f2:0c:b4:bc:34:46",
            "net2": "8a:b7:40:56:8e:cf",
            "net20": "32:5a:12:15:a5:6e",
            "net21": "ea:32:ec:76:d4:af",
            "net22": "16:8a:22:70:a6:a4",
            "net23": "56:b6:30:d4:77:ac",
            "net24": "76:0e:82:f3:98:0f",
            "net25": "2e:80:ed:ae:b9:7a",
            "net26": "a2:e6:a9:4f:17:5d",
            "net27": "2e:34:36:29:d6:ab",
            "net3": "a6:f8:4a:ad:91:a2",
            "net4": "82:06:8e:c4:56:ac",
            "net5": "3a:d1:e6:10:25:f6",
            "net6": "d6:18:63:25:6b:d0",
            "net7": "42:e8:d5:9e:86:15",
            "net8": "56:96:65:d6:7e:46",
            "net9": "2e:84:75:09:f8:f0"
        },
        "spine_1_1_9": {
            "net0": "c6:f4:d2:a7:77:c2",
            "net1": "be:8a:1d:e1:d5:89",
            "net10": "fe:24:e3:59:f2:99",
            "net11": "52:3f:69:7f:e4:3f",
            "net12": "8e:3b:d5:20:de:10",
            "net13": "a2:ae:e2:31:26:fe",
            "net14": "0a:96:4c:8a:63:93",
            "net15": "0e:fd:99:ae:e1:42",
            "net16": "56:81:61:14:db:a9",
            "net17": "ca:09:bf:e6:a0:f8",
            "net18": "fa:cc:fb:6f:22:14",
            "net19": "ba:e3:1c:e9:8b:d9",
            "net2": "c6:19:21:b3:1a:95",
            "net20": "16:c6:ef:b0:8b:ba",
            "net21": "5e:e7:1d:d7:45:3c",
            "net22": "9a:e5:36:ac:e9:98",
            "net23": "8a:89:a6:85:a8:b0",
            "net24": "8a:e5:a3:34:06:57",
            "net25": "82:f3:11:6b:86:62",
            "net26": "46:fb:fa:cf:79:ac",
            "net27": "22:d3:3d:44:f6:d4",
            "net3": "8e:c4:a8:d3:b3:94",
            "net4": "f6:33:d1:6f:51:00",
            "net5": "02:e6:0a:4e:7e:48",
            "net6": "4e:b3:f9:e0:86:78",
            "net7": "c2:a0:8d:57:15:6d",
            "net8": "26:a9:2c:e7:93:e2",
            "net9": "8a:d8:44:4f:9e:7a"
        },
        "spine_2_1_1": {
            "net0": "92:65:34:7d:14:d7",
            "net1": "6a:26:4f:20:8b:f3",
            "net10": "26:0c:d9:54:0a:a6",
            "net11": "d6:d0:66:36:e7:7a",
            "net12": "f2:fb:86:a7:e6:50",
            "net13": "e6:bf:06:91:0f:b7",
            "net14": "92:ac:9d:16:6a:9f",
            "net15": "86:64:50:aa:b0:68",
            "net16": "0a:84:0c:e4:23:6f",
            "net17": "6e:21:6d:72:fb:b2",
            "net18": "f6:87:05:bc:5c:04",
            "net19": "1e:47:4f:2e:dd:e9",
            "net2": "52:dc:c6:fd:da:83",
            "net20": "a2:e9:f0:d4:c6:13",
            "net21": "32:d7:e4:38:27:1a",
            "net22": "fe:6a:50:f6:46:a7",
            "net23": "82:d0:7d:8b:d4:d0",
            "net24": "1e:d4:13:40:ce:bc",
            "net25": "9a:c1:a2:a9:5c:63",
            "net26": "f2:90:0c:1a:31:59",
            "net27": "ce:24:aa:4b:6b:37",
            "net3": "2a:94:6f:e0:e8:ce",
            "net4": "32:bc:8a:2c:85:b4",
            "net5": "e6:ef:94:b2:5a:16",
            "net6": "ea:a6:8b:30:a3:2a",
            "net7": "5e:f4:60:dd:11:fc",
            "net8": "1e:8f:34:c1:cf:5d",
            "net9": "3a:a2:4d:9e:5a:2f"
        },
        "spine_2_1_10": {
            "net0": "9e:62:27:c5:eb:05",
            "net1": "46:b7:94:c8:cc:e8",
            "net10": "ba:e8:c8:29:a0:75",
            "net11": "76:86:20:98:a7:b3",
            "net12": "a6:b5:d1:0c:d6:5c",
            "net13": "7e:78:62:f0:08:c6",
            "net14": "62:3a:39:6d:d8:87",
            "net15": "2a:81:43:2c:d2:96",
            "net16": "ca:5e:9a:7d:1f:3c",
            "net17": "82:2e:ac:f6:a9:45",
            "net18": "be:6c:7c:b3:a6:58",
            "net19": "ba:e9:f1:c4:cb:1f",
            "net2": "9e:71:d8:05:ff:56",
            "net20": "4a:91:0d:17:aa:6f",
            "net21": "ee:83:70:f4:78:ae",
            "net22": "ee:78:2c:c5:8f:72",
            "net23": "b6:d0:28:66:f6:04",
            "net24": "62:76:74:16:1c:0a",
            "net25": "86:30:67:33:ee:10",
            "net26": "02:9f:41:aa:72:f5",
            "net27": "26:01:a4:45:1d:df",
            "net3": "8a:c7:1c:c6:af:3d",
            "net4": "5e:c6:40:5d:6d:c7",
            "net5": "3a:d4:8b:6e:83:89",
            "net6": "86:d7:f5:5f:58:aa",
            "net7": "56:d6:d2:8f:22:25",
            "net8": "66:ea:91:8b:7a:47",
            "net9": "3e:78:1b:6d:87:77"
        },
        "spine_2_1_11": {
            "net0": "d2:c0:6b:63:81:ce",
            "net1": "36:52:d8:b1:f2:d3",
            "net10": "de:9f:9d:9b:36:3c",
            "net11": "26:96:59:74:11:84",
            "net12": "a6:aa:bd:47:e8:8e",
            "net13": "8e:6e:bb:fb:8b:98",
            "net14": "d2:44:20:60:ce:03",
            "net15": "4a:7b:b0:3b:15:af",
            "net16": "ba:dc:a0:8e:df:e6",
            "net17": "9a:4e:b7:04:b4:87",
            "net18": "ea:e3:1c:34:12:6c",
            "net19": "ce:8e:61:a1:31:74",
            "net2": "72:40:e3:ff:e6:d3",
            "net20": "c6:09:dc:3f:62:07",
            "net21": "de:71:f3:d3:fb:d5",
            "net22": "86:a1:59:29:79:e6",
            "net23": "8e:62:10:2f:5c:d7",
            "net24": "9e:b6:f2:00:59:2a",
            "net25": "3a:42:87:f7:3a:cb",
            "net26": "7a:43:1c:f2:06:7a",
            "net27": "02:cc:41:0a:9c:17",
            "net3": "2e:29:71:b1:24:ef",
            "net4": "2a:06:88:64:98:a2",
            "net5": "9e:48:0c:4f:92:c3",
            "net6": "e2:d7:97:f4:3f:d5",
            "net7": "82:32:dd:e3:04:ba",
            "net8": "3a:ce:64:de:d3:a8",
            "net9": "86:a2:22:52:c6:29"
        },
        "spine_2_1_12": {
            "net0": "72:76:94:ea:2d:1f",
            "net1": "fa:3d:35:cc:b9:21",
            "net10": "9a:2e:b7:6a:4b:23",
            "net11": "3a:6e:37:21:ce:db",
            "net12": "4a:ae:5e:34:54:2f",
            "net13": "a6:ef:cc:bc:72:69",
            "net14": "42:96:ee:9b:ab:f9",
            "net15": "f2:1f:94:5d:31:78",
            "net16": "6e:b5:c6:e2:36:33",
            "net17": "82:f0:c1:d8:04:53",
            "net18": "fa:e2:f6:35:24:a7",
            "net19": "1a:ff:63:69:62:7e",
            "net2": "e6:a8:b6:10:6a:76",
            "net20": "1e:2a:6b:5d:c5:81",
            "net21": "1e:bd:c1:24:bc:49",
            "net22": "ea:03:8e:b3:d5:d2",
            "net23": "4e:1e:33:b6:59:1e",
            "net24": "ae:7b:c5:d6:84:10",
            "net25": "3e:1d:44:55:cc:6e",
            "net26": "82:e7:b1:d5:1c:3a",
            "net27": "22:68:ec:0e:3e:ea",
            "net3": "42:87:43:4a:9e:db",
            "net4": "96:bd:9b:02:ae:9c",
            "net5": "6a:4b:30:36:d2:84",
            "net6": "6a:d8:ad:0f:c3:b6",
            "net7": "d6:e3:68:1f:8f:61",
            "net8": "c2:4b:e0:00:25:86",
            "net9": "fa:0c:d4:ae:ad:55"
        },
        "spine_2_1_13": {
            "net0": "96:da:05:7f:ed:ea",
            "net1": "12:bb:c1:20:33:a2",
            "net10": "fe:4e:c7:df:8b:b6",
            "net11": "9e:e8:8c:78:34:62",
            "net12": "22:41:19:0a:a5:a8",
            "net13": "72:1b:67:01:09:6f",
            "net14": "c6:28:04:c0:c0:d0",
            "net15": "16:a7:27:21:77:2c",
            "net16": "ce:43:65:56:d1:07",
            "net17": "f6:d3:fa:d1:5b:21",
            "net18": "3a:76:0b:2f:4d:81",
            "net19": "46:c2:b8:9f:24:db",
            "net2": "a2:40:c7:c2:19:c8",
            "net20": "4e:c3:2b:ef:ee:57",
            "net21": "56:81:03:f6:d2:c3",
            "net22": "2e:a9:91:70:6d:7a",
            "net23": "c6:eb:38:dc:8f:bd",
            "net24": "8e:59:3f:53:50:50",
            "net25": "96:ad:ed:49:cf:24",
            "net26": "ae:64:c5:c1:96:e0",
            "net27": "0a:e3:90:bd:45:3f",
            "net3": "46:d4:93:73:71:7a",
            "net4": "36:32:6f:1f:6d:68",
            "net5": "e2:34:3b:3a:ae:35",
            "net6": "72:f2:bd:d6:f7:8d",
            "net7": "e2:15:0e:f6:f3:1b",
            "net8": "f6:6d:83:27:d7:57",
            "net9": "da:8e:dd:74:35:71"
        },
        "spine_2_1_14": {
            "net0": "fe:cb:05:d6:49:3c",
            "net1": "0e:10:49:bb:7b:f8",
            "net10": "3a:0e:be:95:0e:d4",
            "net11": "e6:76:ad:d9:3b:ff",
            "net12": "a2:61:20:d2:7b:bb",
            "net13": "82:00:4d:03:b5:6f",
            "net14": "ea:42:0a:b3:84:91",
            "net15": "8a:93:16:0c:cb:71",
            "net16": "96:e4:ea:26:7e:cc",
            "net17": "8e:59:2d:30:0d:b6",
            "net18": "da:bd:39:b9:bf:40",
            "net19": "32:02:62:27:b7:ce",
            "net2": "86:64:25:9c:33:82",
            "net20": "76:3b:eb:27:db:1b",
            "net21": "06:0d:6f:03:fe:aa",
            "net22": "e2:38:cf:60:23:73",
            "net23": "1e:ba:b9:cd:84:65",
            "net24": "fe:6e:39:ac:8e:3a",
            "net25": "c2:a9:be:16:3f:ec",
            "net26": "ae:f9:70:ef:8e:14",
            "net27": "0e:de:4a:4c:52:b5",
            "net3": "02:20:50:cc:fd:96",
            "net4": "82:3f:4b:21:be:98",
            "net5": "6a:00:42:ef:2b:0a",
            "net6": "ee:7e:29:72:d6:12",
            "net7": "f6:4a:6d:10:b1:b5",
            "net8": "3e:3f:4d:39:cf:a3",
            "net9": "da:d6:60:63:29:eb"
        },
        "spine_2_1_2": {
            "net0": "96:d4:29:57:1f:d2",
            "net1": "ee:da:50:cb:8f:6d",
            "net10": "ba:7a:34:62:e9:01",
            "net11": "a2:58:87:ef:32:5d",
            "net12": "42:d3:32:d3:47:27",
            "net13": "ea:12:04:fe:ea:36",
            "net14": "1a:64:06:23:1d:45",
            "net15": "ee:4a:49:5a:93:f7",
            "net16": "4a:85:bb:e7:4d:84",
            "net17": "02:b5:01:96:5e:31",
            "net18": "e6:90:8b:33:94:18",
            "net19": "6a:f9:ad:79:0b:82",
            "net2": "06:eb:f2:2a:b4:c2",
            "net20": "a6:05:b3:44:5c:bd",
            "net21": "6a:e0:21:00:ca:7f",
            "net22": "8e:0b:17:43:2a:d9",
            "net23": "ce:eb:91:58:64:31",
            "net24": "92:5f:92:e5:83:2c",
            "net25": "f6:39:14:4c:4c:e5",
            "net26": "76:61:6b:af:83:dc",
            "net27": "8e:4c:17:ad:00:1e",
            "net3": "c2:35:ab:85:80:9f",
            "net4": "5a:bc:04:b7:ba:d1",
            "net5": "42:be:2a:2f:ce:87",
            "net6": "b2:1f:4f:10:9a:45",
            "net7": "de:21:3a:d8:b4:87",
            "net8": "9e:f2:7f:e9:cf:67",
            "net9": "62:2b:57:47:02:da"
        },
        "spine_2_1_3": {
            "net0": "2e:a6:e8:0e:0a:c0",
            "net1": "6e:69:d5:38:a8:54",
            "net10": "2a:89:01:ff:9d:26",
            "net11": "46:72:3d:5f:81:c3",
            "net12": "26:f8:5c:1a:42:f6",
            "net13": "2e:4c:cf:54:f6:31",
            "net14": "76:2b:ed:2b:fa:44",
            "net15": "1e:0d:1c:06:c1:20",
            "net16": "7e:05:99:bb:b4:79",
            "net17": "f6:b4:03:51:94:b8",
            "net18": "ce:20:42:9d:ba:b0",
            "net19": "72:15:53:fd:85:f0",
            "net2": "06:c6:2f:f2:5d:de",
            "net20": "a2:ac:bf:3b:b9:ff",
            "net21": "5a:f2:f6:0c:a0:95",
            "net22": "16:63:c4:fb:50:06",
            "net23": "3e:ba:88:fa:ca:38",
            "net24": "42:76:23:66:10:d5",
            "net25": "7a:48:7c:41:22:3f",
            "net26": "be:58:b6:57:12:e2",
            "net27": "76:50:ec:43:13:5c",
            "net3": "9e:ca:9c:29:65:04",
            "net4": "c6:f8:32:cb:f3:4d",
            "net5": "02:bb:02:fb:d5:40",
            "net6": "32:eb:6e:db:bf:1c",
            "net7": "f2:01:bc:cd:49:d7",
            "net8": "82:8f:14:09:0b:0e",
            "net9": "f6:6f:64:f9:eb:94"
        },
        "spine_2_1_4": {
            "net0": "12:45:ff:c7:73:be",
            "net1": "86:2d:f1:93:49:7b",
            "net10": "a2:1e:d0:70:64:f1",
            "net11": "82:f2:ff:78:1c:4d",
            "net12": "6e:ac:45:49:3d:00",
            "net13": "c6:92:fc:8a:72:e3",
            "net14": "0e:6c:e9:39:e4:0a",
            "net15": "06:07:4a:ac:04:b3",
            "net16": "6a:70:56:7c:3d:03",
            "net17": "f6:24:12:b8:fd:83",
            "net18": "52:33:3c:c1:0b:62",
            "net19": "fa:99:85:6a:a1:c6",
            "net2": "96:9d:d9:6f:6a:10",
            "net20": "26:fb:8d:5f:74:b2",
            "net21": "8a:62:a1:2f:78:09",
            "net22": "8e:58:d1:23:43:1b",
            "net23": "b6:83:b1:b8:82:c0",
            "net24": "fa:5a:ef:c0:86:d3",
            "net25": "fe:0f:b3:49:10:56",
            "net26": "3e:17:12:82:23:1c",
            "net27": "f6:9e:47:c1:ce:cc",
            "net3": "6a:bb:78:5b:a5:43",
            "net4": "c2:af:57:3b:65:e0",
            "net5": "2e:9b:e5:dc:3f:a0",
            "net6": "e6:fd:06:40:f0:d1",
            "net7": "62:c0:67:9e:dd:54",
            "net8": "76:c9:8e:10:1b:b0",
            "net9": "22:98:04:33:b4:c7"
        },
        "spine_2_1_5": {
            "net0": "52:da:d4:0f:8b:8c",
            "net1": "ba:1b:36:6c:38:57",
            "net10": "56:5b:f5:f5:34:7f",
            "net11": "be:bc:60:77:34:3e",
            "net12": "32:1e:0c:01:58:c2",
            "net13": "ea:8f:be:f1:69:67",
            "net14": "2a:36:44:83:c8:c4",
            "net15": "e2:36:b5:7b:9d:f3",
            "net16": "5e:73:23:ba:ab:c0",
            "net17": "ca:96:c3:81:9c:96",
            "net18": "32:88:23:c5:40:f8",
            "net19": "4a:23:0d:3b:84:e5",
            "net2": "1a:de:dc:85:ec:bf",
            "net20": "b2:e6:78:a2:72:ab",
            "net21": "ba:0d:17:bd:e8:83",
            "net22": "ee:66:bc:2b:ee:40",
            "net23": "2a:cc:6e:cf:05:ec",
            "net24": "8e:0a:d1:f6:45:8f",
            "net25": "12:0d:a8:36:0e:8b",
            "net26": "fa:66:b8:82:5f:b7",
            "net27": "52:58:80:fa:18:ba",
            "net3": "9a:af:02:19:f7:80",
            "net4": "6a:9a:f4:1b:ea:38",
            "net5": "6a:61:10:6b:cd:32",
            "net6": "fa:66:65:ff:9d:98",
            "net7": "22:f1:26:6e:3d:db",
            "net8": "2e:66:66:0a:72:9b",
            "net9": "92:32:36:09:da:2b"
        },
        "spine_2_1_6": {
            "net0": "6e:ac:d5:07:34:29",
            "net1": "4a:b3:74:0f:10:f2",
            "net10": "66:f0:1b:e2:fc:5b",
            "net11": "82:b4:39:22:15:72",
            "net12": "0a:71:1e:26:93:91",
            "net13": "42:b6:7b:86:ee:f7",
            "net14": "26:9d:6c:ce:0f:d2",
            "net15": "6e:23:dc:3c:2e:c5",
            "net16": "4a:e1:39:3b:78:be",
            "net17": "36:e8:69:d9:ff:7a",
            "net18": "9a:5e:f0:30:a5:1e",
            "net19": "fa:9d:6b:97:4e:16",
            "net2": "2a:c6:41:c0:31:d4",
            "net20": "a6:c2:f8:7c:71:74",
            "net21": "5e:bd:bd:2d:74:17",
            "net22": "5a:74:0e:80:25:5e",
            "net23": "46:1b:56:10:c9:7a",
            "net24": "86:93:5d:d8:7c:90",
            "net25": "1e:6a:dd:08:2c:ac",
            "net26": "8a:4e:74:a1:87:c7",
            "net27": "ea:5a:4c:e8:f8:f9",
            "net3": "ba:a3:65:de:c4:0d",
            "net4": "d6:ae:d1:4d:71:e4",
            "net5": "42:4c:57:6a:8f:97",
            "net6": "26:09:63:6c:6a:89",
            "net7": "8e:b7:3f:5e:11:e6",
            "net8": "26:80:4a:99:64:2e",
            "net9": "12:d3:0d:29:4e:bb"
        },
        "spine_2_1_7": {
            "net0": "4e:b1:35:2f:72:9d",
            "net1": "32:77:31:f7:e5:35",
            "net10": "52:8b:12:a8:b8:46",
            "net11": "72:7b:20:30:cf:0a",
            "net12": "6a:1a:d3:2b:22:d2",
            "net13": "9e:b6:a6:8e:13:fb",
            "net14": "42:a3:e9:57:22:09",
            "net15": "0a:70:48:d5:63:69",
            "net16": "4e:9f:ce:a3:d6:e5",
            "net17": "b2:5b:6a:ed:6b:6b",
            "net18": "a2:ee:c9:01:ba:f3",
            "net19": "b2:de:61:89:9a:4f",
            "net2": "ea:f8:a1:d2:6d:4c",
            "net20": "ae:37:b0:53:b1:94",
            "net21": "ce:25:b9:bc:81:7f",
            "net22": "5a:a0:53:e9:ed:bc",
            "net23": "e6:14:9f:17:75:68",
            "net24": "de:69:b9:4f:50:25",
            "net25": "92:3f:c5:ad:77:34",
            "net26": "ae:87:04:43:6b:b1",
            "net27": "3a:32:28:a8:e5:3b",
            "net3": "ee:af:30:6b:c9:f5",
            "net4": "fe:cc:47:32:f6:dd",
            "net5": "b6:f1:55:83:dd:62",
            "net6": "92:12:4a:35:67:5e",
            "net7": "06:bf:af:9e:e2:fa",
            "net8": "8e:c3:c8:60:55:8b",
            "net9": "f6:f5:04:1b:3f:06"
        },
        "spine_2_1_8": {
            "net0": "76:67:85:30:5d:a1",
            "net1": "62:21:2f:71:7a:54",
            "net10": "0a:3f:12:3e:a4:b4",
            "net11": "d2:bd:9b:58:6e:72",
            "net12": "f2:69:8d:88:12:4d",
            "net13": "9a:7e:6f:71:35:bc",
            "net14": "ca:b5:bc:cd:41:67",
            "net15": "72:7c:62:1d:ee:b9",
            "net16": "42:26:f4:aa:c8:04",
            "net17": "16:2b:ea:4c:a2:e0",
            "net18": "92:54:53:f8:a9:e6",
            "net19": "ee:df:07:b7:6d:11",
            "net2": "ce:06:2d:ed:1a:52",
            "net20": "ce:2c:6a:98:b7:33",
            "net21": "02:8e:8c:86:0c:74",
            "net22": "f6:97:13:c6:60:ad",
            "net23": "9e:22:91:3b:3a:ae",
            "net24": "6a:25:72:95:b1:fe",
            "net25": "f6:f2:60:81:15:13",
            "net26": "9e:54:b0:70:cd:57",
            "net27": "ce:6c:23:a6:b5:a5",
            "net3": "0a:3b:44:6c:06:15",
            "net4": "a6:09:35:43:04:81",
            "net5": "ea:f8:f4:ff:f1:de",
            "net6": "6e:83:b5:bd:05:cb",
            "net7": "72:01:7b:22:4a:e6",
            "net8": "06:83:c8:0e:1e:f5",
            "net9": "7e:e3:d5:60:0f:9c"
        },
        "spine_2_1_9": {
            "net0": "e6:3a:42:4c:01:cb",
            "net1": "76:be:b4:8f:bf:73",
            "net10": "42:23:37:eb:7c:14",
            "net11": "3e:d4:12:d2:17:67",
            "net12": "3a:1b:25:4b:5a:29",
            "net13": "b6:3a:37:81:d4:1b",
            "net14": "92:e8:f5:4d:38:3e",
            "net15": "9a:be:33:76:b8:e8",
            "net16": "fe:75:db:84:a0:e5",
            "net17": "8e:f2:c9:94:e3:dc",
            "net18": "d2:a2:c0:74:72:8b",
            "net19": "6e:10:ba:ec:9e:9a",
            "net2": "ee:2a:2f:a4:df:69",
            "net20": "1e:ef:f9:a7:cd:3a",
            "net21": "8a:65:f5:cf:5b:78",
            "net22": "d2:c5:dc:34:24:60",
            "net23": "ce:07:0a:d7:f5:70",
            "net24": "aa:f8:bd:86:58:25",
            "net25": "82:d0:f9:92:99:b8",
            "net26": "0e:0a:88:4e:4a:58",
            "net27": "aa:67:4e:f9:06:de",
            "net3": "3e:c2:6d:29:02:0b",
            "net4": "c2:70:e0:ef:9a:17",
            "net5": "ba:53:79:2f:06:75",
            "net6": "c6:4e:78:19:05:e7",
            "net7": "5a:a6:82:81:78:b0",
            "net8": "92:16:13:63:36:0b",
            "net9": "c2:69:77:4e:80:d2"
        },
        "tof_1_2_1": {
            "net0": "f6:49:1d:52:b3:3f",
            "net1": "8a:c8:a1:dd:5e:59",
            "net10": "ea:34:ad:4f:01:81",
            "net11": "e6:b3:69:1e:a3:48",
            "net12": "7e:7e:2c:81:07:1a",
            "net13": "5a:ab:83:df:50:e3",
            "net14": "62:ca:3b:d5:d2:45",
            "net15": "ee:85:af:cb:1e:c6",
            "net16": "22:a0:b3:e4:4b:a8",
            "net17": "c6:f2:2d:88:99:ba",
            "net18": "ca:95:36:1f:a2:7e",
            "net19": "fa:9a:3e:32:28:0b",
            "net2": "ea:d5:e9:67:63:2b",
            "net20": "ee:b5:a8:1e:97:e5",
            "net21": "ce:ad:4d:30:f6:6b",
            "net22": "da:e7:4a:2b:21:6a",
            "net23": "96:a6:ce:4f:fa:0a",
            "net24": "6a:96:c4:71:51:cc",
            "net25": "52:1e:46:cb:99:68",
            "net26": "d6:9c:fa:99:cb:93",
            "net27": "7e:8e:a5:21:b5:32",
            "net3": "7e:45:66:b8:36:2b",
            "net4": "c6:c7:56:64:95:df",
            "net5": "7a:d7:ad:28:b5:64",
            "net6": "26:cb:e6:7b:2c:9f",
            "net7": "12:8d:3b:e5:0d:42",
            "net8": "4a:4d:a6:5f:15:0e",
            "net9": "46:79:ea:8b:7f:27"
        },
        "tof_1_2_10": {
            "net0": "7a:4d:25:0d:e1:19",
            "net1": "66:f9:6b:e7:29:f8",
            "net10": "b2:43:4d:5c:8e:d1",
            "net11": "a2:62:9e:4e:7d:1b",
            "net12": "2a:85:8f:ed:ce:b0",
            "net13": "de:97:d4:d8:a7:9e",
            "net14": "76:31:75:64:c5:0a",
            "net15": "06:c1:26:a3:e6:aa",
            "net16": "ae:f4:72:51:9c:52",
            "net17": "d6:e6:2f:ac:d2:5c",
            "net18": "ca:93:7f:09:cb:30",
            "net19": "56:56:e2:47:98:a2",
            "net2": "5a:33:aa:cc:ff:24",
            "net20": "52:f3:3e:b0:78:6b",
            "net21": "7e:6d:56:16:fe:8e",
            "net22": "6e:1f:3c:6c:38:6d",
            "net23": "c6:fd:b2:07:5b:42",
            "net24": "ea:49:bb:5e:12:b8",
            "net25": "4a:b4:20:7f:77:b0",
            "net26": "d6:a0:93:09:0f:a9",
            "net27": "8e:12:de:c9:a1:36",
            "net3": "22:62:8f:4f:72:9f",
            "net4": "6a:5c:df:48:12:e6",
            "net5": "ca:da:92:f5:f2:59",
            "net6": "fe:95:62:c5:5f:2d",
            "net7": "26:7a:1f:c7:87:63",
            "net8": "0a:0c:d9:0e:06:f6",
            "net9": "ae:21:94:04:31:a6"
        },
        "tof_1_2_11": {
            "net0": "5e:be:f3:da:75:e3",
            "net1": "56:9d:f4:c8:77:b3",
            "net10": "ce:17:ce:3b:0c:cf",
            "net11": "42:8c:3f:e5:a9:bb",
            "net12": "8a:41:6c:7d:22:8b",
            "net13": "ee:b9:fd:de:36:62",
            "net14": "92:b9:0e:f4:42:83",
            "net15": "7a:ae:1e:00:bf:94",
            "net16": "4a:cf:be:b0:55:b8",
            "net17": "12:3c:9e:80:49:34",
            "net18": "de:a3:df:4a:a9:0f",
            "net19": "82:dd:c7:79:bd:8c",
            "net2": "1a:6d:51:16:71:a0",
            "net20": "36:2a:e4:ad:5e:1b",
            "net21": "4a:e4:f8:52:c7:ff",
            "net22": "6a:86:de:5c:51:a0",
            "net23": "5a:e7:4c:71:5c:26",
            "net24": "4e:45:0a:d5:df:d7",
            "net25": "62:6d:17:cd:af:ff",
            "net26": "da:d9:2a:c9:b2:af",
            "net27": "ba:b7:b8:dc:d2:e0",
            "net3": "5e:e5:a0:ff:48:c2",
            "net4": "fe:bf:df:5d:c8:01",
            "net5": "f2:4f:f7:64:60:fe",
            "net6": "9a:f4:4b:e7:20:ec",
            "net7": "5e:1f:64:8e:2c:9d",
            "net8": "92:75:54:b2:60:74",
            "net9": "b6:3c:a5:4f:96:ce"
        },
        "tof_1_2_12": {
            "net0": "06:0e:76:e9:b2:6c",
            "net1": "22:7d:b3:b0:38:ec",
            "net10": "26:ed:e2:7a:e5:cf",
            "net11": "4a:a9:22:ea:b4:49",
            "net12": "d6:8a:10:1a:06:1d",
            "net13": "b2:aa:7e:a4:8f:7f",
            "net14": "2a:87:92:c0:0c:65",
            "net15": "f6:0a:3b:7f:0d:e9",
            "net16": "6a:6f:c8:fc:d3:94",
            "net17": "1e:6d:f5:25:dd:90",
            "net18": "62:34:6d:83:86:2d",
            "net19": "0a:a5:58:a5:e7:36",
            "net2": "22:7d:48:41:2b:c5",
            "net20": "ca:3b:d6:02:ba:d1",
            "net21": "0a:06:34:17:88:55",
            "net22": "32:99:f9:b6:17:6f",
            "net23": "4a:5f:e3:b8:d3:c0",
            "net24": "1a:94:18:58:a8:76",
            "net25": "5a:52:a8:7e:d9:fc",
            "net26": "3a:18:ff:b2:eb:e2",
            "net27": "a6:fd:32:36:60:1f",
            "net3": "b2:2b:7d:8a:a0:f9",
            "net4": "e2:e4:d5:30:03:66",
            "net5": "e6:8f:fe:1e:29:d7",
            "net6": "5a:5f:8a:08:98:87",
            "net7": "fa:44:ba:c1:3e:12",
            "net8": "12:95:f3:da:b7:5f",
            "net9": "da:28:3b:17:bf:c9"
        },
        "tof_1_2_13": {
            "net0": "3e:e8:ac:de:b9:ce",
            "net1": "a6:1f:fe:e3:57:55",
            "net10": "46:7b:d0:04:03:a1",
            "net11": "0a:b2:a7:c1:6f:89",
            "net12": "6a:a1:ee:7c:bb:c1",
            "net13": "0e:84:24:cf:1b:20",
            "net14": "da:83:7d:6f:6a:75",
            "net15": "fa:e1:0b:40:09:dc",
            "net16": "16:c8:0d:a2:75:02",
            "net17": "aa:8e:c0:26:ad:4d",
            "net18": "ce:41:2c:8a:28:69",
            "net19": "06:f4:5b:2d:00:23",
            "net2": "d2:61:84:30:f0:aa",
            "net20": "56:a3:33:ea:17:02",
            "net21": "ba:15:ed:2b:3c:9d",
            "net22": "52:c0:22:c4:26:ec",
            "net23": "52:47:13:46:f2:81",
            "net24": "a2:1c:eb:76:f7:c3",
            "net25": "e2:fd:1f:9e:75:88",
            "net26": "9e:37:92:f2:ce:87",
            "net27": "2a:62:59:59:27:9b",
            "net3": "fa:ef:e9:f8:0c:9c",
            "net4": "d6:3d:d0:ff:7d:d8",
            "net5": "12:9a:8d:de:8c:e2",
            "net6": "0e:62:10:08:45:ed",
            "net7": "a6:16:c9:93:7e:9c",
            "net8": "a2:9f:74:c9:23:7f",
            "net9": "6a:a8:d9:b2:9e:de"
        },
        "tof_1_2_14": {
            "net0": "16:eb:6e:ea:df:41",
            "net1": "b6:89:5b:cc:4a:39",
            "net10": "6e:0c:04:fe:fe:6b",
            "net11": "1a:f6:db:03:b8:f9",
            "net12": "66:20:e6:68:03:b0",
            "net13": "ba:cf:b2:13:f9:97",
            "net14": "26:9b:8a:1a:23:b8",
            "net15": "76:02:68:24:a6:94",
            "net16": "1e:14:1a:7c:4e:1a",
            "net17": "22:53:30:a6:47:7f",
            "net18": "56:9a:f5:69:4d:ff",
            "net19": "5a:24:21:96:6f:25",
            "net2": "8e:e7:13:3b:22:84",
            "net20": "ee:8a:c8:6d:7b:39",
            "net21": "66:3d:8b:a8:8a:65",
            "net22": "9e:14:ee:67:49:9e",
            "net23": "c6:ef:86:6a:b7:d4",
            "net24": "b6:66:6c:4c:14:48",
            "net25": "aa:d8:bf:6e:64:d8",
            "net26": "be:9e:fa:7b:a4:2d",
            "net27": "2a:ec:f5:11:fb:61",
            "net3": "be:39:33:d1:22:07",
            "net4": "a6:28:8d:73:8f:d7",
            "net5": "42:07:81:ac:19:40",
            "net6": "fe:89:10:d0:9b:22",
            "net7": "8a:11:af:4f:c7:b4",
            "net8": "da:37:ed:2b:f6:0c",
            "net9": "de:f0:33:c0:59:87"
        },
        "tof_1_2_2": {
            "net0": "f6:10:8d:1c:33:80",
            "net1": "e2:d7:af:b5:c2:f1",
            "net10": "46:a1:c1:a7:64:80",
            "net11": "7a:35:c3:ab:a6:e2",
            "net12": "4e:e6:c2:02:88:48",
            "net13": "66:29:99:b9:e9:35",
            "net14": "3e:2b:96:9b:cf:97",
            "net15": "42:45:c4:5e:68:2a",
            "net16": "b2:38:26:2b:b1:25",
            "net17": "22:09:8e:7d:0a:cd",
            "net18": "6a:ec:47:2c:98:f8",
            "net19": "0e:5f:48:15:f4:aa",
            "net2": "fe:d2:cd:44:a3:aa",
            "net20": "d6:96:4b:66:83:96",
            "net21": "06:28:88:44:28:f4",
            "net22": "8a:c1:2b:eb:a1:f2",
            "net23": "f2:a2:06:51:71:1f",
            "net24": "7a:b8:c8:58:ff:e1",
            "net25": "86:89:23:c1:b3:a0",
            "net26": "12:02:e3:a2:73:99",
            "net27": "76:8e:0e:c5:c9:cb",
            "net3": "2a:51:7f:92:a9:0b",
            "net4": "c6:a3:9c:73:58:df",
            "net5": "8a:9b:93:84:c7:90",
            "net6": "8a:66:6e:d7:ff:f7",
            "net7": "22:4d:1f:11:b0:68",
            "net8": "96:65:5b:f4:54:2f",
            "net9": "06:54:c2:22:8b:d6"
        },
        "tof_1_2_3": {
            "net0": "46:1f:22:a4:d2:7b",
            "net1": "aa:b1:63:be:53:6d",
            "net10": "62:91:8c:a4:22:cf",
            "net11": "fa:c7:00:fe:61:b8",
            "net12": "8a:01:e7:50:cb:22",
            "net13": "9a:f5:2e:8d:e7:37",
            "net14": "0e:df:81:0a:ea:ed",
            "net15": "9e:29:36:2d:96:12",
            "net16": "fa:a5:b8:02:98:87",
            "net17": "26:99:85:05:07:6f",
            "net18": "92:a5:c1:54:80:b2",
            "net19": "5e:af:4b:ff:7b:be",
            "net2": "e2:e5:91:15:e2:c3",
            "net20": "12:9a:36:6d:90:7f",
            "net21": "62:75:60:cb:11:35",
            "net22": "ae:a4:99:18:d7:b7",
            "net23": "8e:4c:92:aa:9d:e9",
            "net24": "ae:24:ea:da:70:48",
            "net25": "a6:e7:d2:b9:51:07",
            "net26": "be:f1:f5:47:5d:ee",
            "net27": "22:87:05:63:f6:ea",
            "net3": "0a:39:49:4d:af:65",
            "net4": "a6:a6:72:8a:b8:61",
            "net5": "52:08:4c:3d:76:30",
            "net6": "12:0f:0f:9c:46:68",
            "net7": "3e:72:de:bb:15:5f",
            "net8": "fe:e5:94:2f:35:bb",
            "net9": "2e:7a:50:d3:ed:6b"
        },
        "tof_1_2_4": {
            "net0": "26:2b:d0:1e:47:d6",
            "net1": "de:4a:4f:a5:b2:52",
            "net10": "f6:bb:98:26:00:a1",
            "net11": "36:81:ee:d6:a6:55",
            "net12": "42:36:25:84:8b:26",
            "net13": "06:1b:32:7c:cf:06",
            "net14": "32:fc:4e:37:38:84",
            "net15": "a6:2e:81:cc:8c:af",
            "net16": "aa:59:8e:42:e5:2d",
            "net17": "42:0c:91:57:4a:3a",
            "net18": "da:7c:ca:23:08:f7",
            "net19": "da:48:fb:a9:e2:78",
            "net2": "66:4c:2a:90:23:40",
            "net20": "7a:2a:5c:51:9e:34",
            "net21": "66:df:fd:0d:5e:ec",
            "net22": "a6:08:1e:5d:c3:97",
            "net23": "92:45:2f:37:49:c5",
            "net24": "ca:a2:59:01:43:85",
            "net25": "9a:31:47:8b:a4:6a",
            "net26": "d2:05:54:2d:81:c5",
            "net27": "8a:c2:0a:5f:a5:e1",
            "net3": "e6:a6:c6:df:ae:ba",
            "net4": "c2:58:76:40:a8:d0",
            "net5": "12:c1:e2:f9:53:a4",
            "net6": "76:43:36:44:fa:e0",
            "net7": "72:fc:9e:f1:10:05",
            "net8": "e6:f3:ba:b6:95:9d",
            "net9": "12:b4:eb:12:d2:3d"
        },
        "tof_1_2_5": {
            "net0": "fe:ac:6b:86:d7:db",
            "net1": "ae:35:9b:0d:de:04",
            "net10": "ee:d0:f4:05:22:3e",
            "net11": "ee:b2:67:21:16:31",
            "net12": "4a:a2:62:14:2c:f6",
            "net13": "06:34:73:96:0b:14",
            "net14": "42:cf:8c:f9:dc:0f",
            "net15": "8a:54:21:be:16:53",
            "net16": "f2:6e:8e:14:ef:2d",
            "net17": "52:91:c4:93:48:83",
            "net18": "4e:57:d6:70:84:49",
            "net19": "9a:1f:a0:9e:9a:5b",
            "net2": "f2:ac:a9:c6:8b:87",
            "net20": "fa:dd:8c:cb:98:e3",
            "net21": "9a:fd:e6:cf:0f:d7",
            "net22": "6a:bf:4b:fa:02:be",
            "net23": "46:a0:f2:5e:1e:dd",
            "net24": "3a:6d:2b:57:43:7d",
            "net25": "36:e1:df:ae:af:04",
            "net26": "ee:fe:c1:af:b4:31",
            "net27": "6a:85:26:73:dd:2a",
            "net3": "36:4d:ce:d9:0e:b4",
            "net4": "da:2f:7f:8b:51:95",
            "net5": "b2:05:a0:0c:19:e2",
            "net6": "7e:22:88:57:a9:f3",
            "net7": "96:2a:c9:5d:a9:b3",
            "net8": "46:3e:8e:68:8f:70",
            "net9": "a2:22:fe:f8:0b:77"
        },
        "tof_1_2_6": {
            "net0": "36:6e:f9:1c:16:44",
            "net1": "7e:17:5a:63:f4:08",
            "net10": "ee:76:44:ae:65:22",
            "net11": "b2:a4:55:29:e2:c4",
            "net12": "2a:d5:99:4e:79:e5",
            "net13": "62:0e:8f:2d:83:3b",
            "net14": "22:18:ef:f7:7a:78",
            "net15": "52:d5:e9:c7:6e:65",
            "net16": "22:de:f0:cd:86:67",
            "net17": "5e:99:74:a8:39:21",
            "net18": "aa:70:db:38:22:ba",
            "net19": "82:c9:0f:0f:99:f2",
            "net2": "9e:d0:30:f1:18:35",
            "net20": "a2:5b:9e:5b:53:bf",
            "net21": "ea:0f:2a:7e:25:4d",
            "net22": "02:c2:a2:9e:25:1a",
            "net23": "6e:34:0d:31:99:c5",
            "net24": "36:c2:da:52:9e:8e",
            "net25": "26:d0:a4:cc:5e:fd",
            "net26": "ea:09:f1:96:e3:77",
            "net27": "36:b3:ff:8b:b2:ec",
            "net3": "8a:df:ca:94:59:78",
            "net4": "4a:fc:24:ef:5b:da",
            "net5": "4a:84:9d:fb:09:05",
            "net6": "c2:87:69:e7:65:46",
            "net7": "16:38:62:8a:34:2a",
            "net8": "d6:e9:92:a2:95:f4",
            "net9": "c6:1c:5e:37:18:ba"
        },
        "tof_1_2_7": {
            "net0": "5e:65:53:7a:31:af",
            "net1": "72:77:30:81:11:c3",
            "net10": "b6:b5:9a:3f:90:2e",
            "net11": "56:f3:38:9c:d2:a7",
            "net12": "da:c0:d3:4a:11:3c",
            "net13": "3a:0c:bd:0e:09:3c",
            "net14": "f6:47:48:e3:d5:70",
            "net15": "8e:08:c8:a7:1d:34",
            "net16": "06:98:7f:57:a4:ad",
            "net17": "f2:09:e3:97:16:01",
            "net18": "8e:46:30:32:ee:bf",
            "net19": "9a:9c:db:5b:03:e2",
            "net2": "f2:94:42:5a:ab:1a",
            "net20": "9a:5b:1e:70:8f:6a",
            "net21": "ea:27:c3:68:0c:4f",
            "net22": "fa:99:ad:eb:86:21",
            "net23": "aa:3d:c8:d2:01:30",
            "net24": "ea:a1:ab:d4:96:19",
            "net25": "16:42:9c:ed:43:3c",
            "net26": "a6:3b:bd:a0:49:18",
            "net27": "2e:12:e8:4f:54:88",
            "net3": "be:4b:66:45:79:c8",
            "net4": "8a:f2:1e:ff:61:35",
            "net5": "2a:43:46:5d:c9:71",
            "net6": "76:71:1b:d0:b6:19",
            "net7": "8e:f2:96:b6:7b:b1",
            "net8": "36:89:63:19:0c:78",
            "net9": "5e:57:ae:49:9c:5a"
        },
        "tof_1_2_8": {
            "net0": "5a:49:2e:5a:b5:11",
            "net1": "52:90:33:d0:fc:fc",
            "net10": "92:d8:e2:14:51:93",
            "net11": "ba:88:41:3d:37:bd",
            "net12": "c6:88:6d:56:38:44",
            "net13": "d2:86:7c:f2:89:1f",
            "net14": "56:3e:70:c9:c0:7d",
            "net15": "3a:d4:42:6f:a8:32",
            "net16": "3a:99:14:0b:44:e9",
            "net17": "3e:d3:e4:85:d1:60",
            "net18": "46:16:3f:88:f4:b7",
            "net19": "5a:89:5e:ab:3c:f8",
            "net2": "62:5d:e3:4e:55:be",
            "net20": "26:8d:12:ca:57:07",
            "net21": "c2:bf:e1:a2:32:98",
            "net22": "66:0c:0d:90:9e:6f",
            "net23": "92:e1:9d:db:c8:e6",
            "net24": "7a:d7:10:91:46:42",
            "net25": "92:77:fc:d1:c3:7b",
            "net26": "92:70:1d:23:49:d4",
            "net27": "4e:c1:5d:ca:f2:6c",
            "net3": "d2:88:65:b6:22:03",
            "net4": "c2:a0:f8:5b:78:51",
            "net5": "ca:fc:07:5c:29:a9",
            "net6": "32:3a:19:cc:d4:43",
            "net7": "46:02:db:a1:27:6c",
            "net8": "06:ea:30:a1:44:10",
            "net9": "da:17:d7:4e:73:3c"
        },
        "tof_1_2_9": {
            "net0": "86:c3:d1:e8:ab:60",
            "net1": "9e:00:e6:c7:17:05",
            "net10": "9a:58:8b:d3:65:15",
            "net11": "ba:2a:ea:65:3b:89",
            "net12": "02:a3:fa:45:a3:76",
            "net13": "5a:77:f2:4b:9e:4f",
            "net14": "92:5b:7a:ef:81:a2",
            "net15": "5a:27:b2:79:da:2d",
            "net16": "f2:4b:c7:30:93:c7",
            "net17": "66:94:0d:5c:df:aa",
            "net18": "a2:1a:27:b7:a5:e3",
            "net19": "3a:f7:a3:95:74:4b",
            "net2": "7e:c6:d9:eb:44:b0",
            "net20": "ca:13:3e:18:69:0d",
            "net21": "aa:6f:07:c6:ed:76",
            "net22": "62:79:ff:71:0a:2c",
            "net23": "66:ef:0c:88:31:38",
            "net24": "7a:a8:f5:3d:4c:78",
            "net25": "7e:af:c9:39:70:36",
            "net26": "8a:72:77:f9:16:24",
            "net27": "8a:d8:34:0c:9a:70",
            "net3": "e6:89:ef:35:0c:59",
            "net4": "fe:66:5d:9d:fb:75",
            "net5": "96:19:cc:38:c8:4f",
            "net6": "5a:d7:0d:dc:54:36",
            "net7": "96:65:01:18:ed:6c",
            "net8": "de:74:58:f9:98:51",
            "net9": "92:c5:14:bd:6d:36"
        }
    },
    "failed_machine": "leaf_1_0_1",
    "failure_time": {
        "leaf_1_0_1": 1622143587.51924,
        "leaf_1_0_10": 1622143587.5356553,
        "leaf_1_0_11": 1622143587.5552118,
        "leaf_1_0_12": 1622143587.5728636,
        "leaf_1_0_13": 1622143587.5919435,
        "leaf_1_0_14": 1622143587.5189612,
        "leaf_1_0_2": 1622143587.5300672,
        "leaf_1_0_3": 1622143587.542077,
        "leaf_1_0_4": 1622143587.559455,
        "leaf_1_0_5": 1622143587.5818152,
        "leaf_1_0_6": 1622143587.51954,
        "leaf_1_0_7": 1622143587.537537,
        "leaf_1_0_8": 1622143587.5532281,
        "leaf_1_0_9": 1622143587.5712142,
        "leaf_2_0_1": 1622143587.5867338,
        "leaf_2_0_10": 1622143587.5211546,
        "leaf_2_0_11": 1622143587.5388353,
        "leaf_2_0_12": 1622143587.560465,
        "leaf_2_0_13": 1622143587.5803456,
        "leaf_2_0_14": 1622143587.6002371,
        "leaf_2_0_2": 1622143587.6019902,
        "leaf_2_0_3": 1622143587.6194928,
        "leaf_2_0_4": 1622143587.6377015,
        "leaf_2_0_5": 1622143587.6587198,
        "leaf_2_0_6": 1622143587.6846077,
        "leaf_2_0_7": 1622143587.603426,
        "leaf_2_0_8": 1622143587.6164546,
        "leaf_2_0_9": 1622143587.6342921,
        "spine_1_1_1": 1622143587.6584504,
        "spine_1_1_10": 1622143587.6717162,
        "spine_1_1_11": 1622143587.6087224,
        "spine_1_1_12": 1622143587.6295507,
        "spine_1_1_13": 1622143587.6491995,
        "spine_1_1_14": 1622143587.6654897,
        "spine_1_1_2": 1622143587.6872473,
        "spine_1_1_3": 1622143587.613138,
        "spine_1_1_4": 1622143587.630516,
        "spine_1_1_5": 1622143587.6493375,
        "spine_1_1_6": 1622143587.661047,
        "spine_1_1_7": 1622143587.6807013,
        "spine_1_1_8": 1622143587.687584,
        "spine_1_1_9": 1622143587.7002094,
        "spine_2_1_1": 1622143587.7176204,
        "spine_2_1_10": 1622143587.731566,
        "spine_2_1_11": 1622143587.7440257,
        "spine_2_1_12": 1622143587.6935315,
        "spine_2_1_13": 1622143587.7111933,
        "spine_2_1_14": 1622143587.7232144,
        "spine_2_1_2": 1622143587.7449083,
        "spine_2_1_3": 1622143587.7674096,
        "spine_2_1_4": 1622143587.6935737,
        "spine_2_1_5": 1622143587.7170463,
        "spine_2_1_6": 1622143587.731977,
        "spine_2_1_7": 1622143587.7488108,
        "spine_2_1_8": 1622143587.7666912,
        "spine_2_1_9": 1622143587.6998825,
        "tof_1_2_1": 1622143587.7193892,
        "tof_1_2_10": 1622143587.737181,
        "tof_1_2_11": 1622143587.7547295,
        "tof_1_2_12": 1622143587.7774956,
        "tof_1_2_13": 1622143587.7649052,
        "tof_1_2_14": 1622143587.784582,
        "tof_1_2_2": 1622143587.795813,
        "tof_1_2_3": 1622143587.8042412,
        "tof_1_2_4": 1622143587.810144,
        "tof_1_2_5": 1622143587.7852724,
        "tof_1_2_6": 1622143587.797782,
        "tof_1_2_7": 1622143587.8097932,
        "tof_1_2_8": 1622143587.8157992,
        "tof_1_2_9": 1622143587.8250337
    }
}