{
    "description": "Scenario 4c: ToF tof_1_2_1 failure and recovery with BGP",
    "k_leaf": 10,
    "k_top": 10,
    "redundancy_factor": 5,
    "is_k8s": true,
    "machine_mac_addresses": {
        "leaf_1_0_1": {
            "net0": "7e:d9:ef:05:df:7b",
            "net1": "ee:1e:3b:b4:8d:7a",
            "net10": "8e:e2:34:7e:75:42",
            "net2": "66:a2:fb:fc:4a:35",
            "net3": "02:ef:33:56:7b:4a",
            "net4": "5e:5a:de:65:77:94",
            "net5": "26:7e:39:be:39:da",
            "net6": "36:ab:41:01:c9:e6",
            "net7": "7e:4f:8e:fb:a5:e6",
            "net8": "8a:08:1c:c7:10:b5",
            "net9": "c2:c6:86:19:e2:3f"
        },
        "leaf_1_0_10": {
            "net0": "7e:1c:94:ea:ac:e6",
            "net1": "aa:4f:5d:c5:da:2e",
            "net10": "ea:29:8b:12:04:f6",
            "net2": "02:d7:bb:41:a2:a8",
            "net3": "6a:37:a9:14:74:37",
            "net4": "9a:36:33:2d:73:e4",
            "net5": "ce:76:37:3f:6f:f7",
            "net6": "e2:d9:bb:e4:77:e3",
            "net7": "42:52:63:e0:f6:2a",
            "net8": "22:d6:52:bc:cb:21",
            "net9": "c2:09:c7:f6:d6:28"
        },
        "leaf_1_0_2": {
            "net0": "c2:a1:c5:2c:98:a8",
            "net1": "7a:df:17:9f:c0:a5",
            "net10": "a2:eb:cc:25:8e:25",
            "net2": "46:08:45:86:6a:9a",
            "net3": "d6:ec:f4:f1:2a:c9",
            "net4": "da:e3:ed:23:6d:c1",
            "net5": "9e:a0:93:db:9a:1d",
            "net6": "fe:f5:36:b4:ba:d7",
            "net7": "1e:6c:8f:78:24:a0",
            "net8": "2a:de:6b:b5:56:5b",
            "net9": "ca:c4:68:5a:31:57"
        },
        "leaf_1_0_3": {
            "net0": "9e:f9:9b:7b:ce:c5",
            "net1": "6e:21:01:f6:a5:9a",
            "net10": "36:41:1a:c2:a3:cc",
            "net2": "b2:ac:62:5c:34:2b",
            "net3": "2e:0e:35:14:38:73",
            "net4": "6a:07:1d:e4:a4:42",
            "net5": "d6:21:86:df:c0:3e",
            "net6": "92:82:06:85:45:51",
            "net7": "ca:29:82:ce:52:6b",
            "net8": "fa:5e:87:08:12:01",
            "net9": "fe:86:8b:0f:74:fc"
        },
        "leaf_1_0_4": {
            "net0": "56:02:be:e4:73:41",
            "net1": "ee:9b:48:cc:be:cd",
            "net10": "d2:3f:1c:02:b4:9a",
            "net2": "b2:31:7a:46:89:84",
            "net3": "f2:e6:be:8b:c8:7b",
            "net4": "4a:07:15:07:b6:82",
            "net5": "c2:21:22:d3:ff:24",
            "net6": "32:8d:93:cf:5b:7e",
            "net7": "e6:a7:cc:ed:72:a0",
            "net8": "76:6d:fd:50:6d:85",
            "net9": "22:37:20:a8:a2:05"
        },
        "leaf_1_0_5": {
            "net0": "aa:ef:be:98:87:34",
            "net1": "d2:40:e3:68:4c:19",
            "net10": "92:73:78:c0:9b:7e",
            "net2": "46:0b:b8:c3:db:4b",
            "net3": "12:f7:94:3f:da:57",
            "net4": "76:7e:44:5e:92:a2",
            "net5": "c6:d3:20:7f:7c:a1",
            "net6": "9a:2e:46:ff:7c:9c",
            "net7": "c6:6d:7b:86:86:f2",
            "net8": "02:7a:94:99:bd:60",
            "net9": "26:e7:6c:1a:f9:55"
        },
        "leaf_1_0_6": {
            "net0": "aa:f1:aa:5c:22:f8",
            "net1": "2a:00:78:b4:4e:e0",
            "net10": "56:75:2e:f2:0c:8e",
            "net2": "e2:92:7f:04:5e:28",
            "net3": "2e:28:f4:a0:52:0a",
            "net4": "82:cb:36:f7:69:ce",
            "net5": "b2:5f:b8:60:1c:b8",
            "net6": "f6:6c:38:9f:84:51",
            "net7": "c6:30:09:28:f9:22",
            "net8": "f6:49:26:25:80:7b",
            "net9": "e6:b8:10:76:b0:1a"
        },
        "leaf_1_0_7": {
            "net0": "c2:82:d9:3e:73:bf",
            "net1": "5e:34:eb:05:36:05",
            "net10": "1e:d0:7a:78:1b:c7",
            "net2": "2a:d8:58:ba:28:39",
            "net3": "4e:77:a0:58:c6:89",
            "net4": "2a:51:cd:47:d6:82",
            "net5": "a2:fe:ed:67:ac:a2",
            "net6": "8e:62:12:b9:b4:16",
            "net7": "9a:f2:f6:a4:5d:69",
            "net8": "aa:78:bc:29:8e:f5",
            "net9": "92:af:8c:fc:83:10"
        },
        "leaf_1_0_8": {
            "net0": "fa:2d:b1:d9:b8:28",
            "net1": "8a:d3:cb:3c:ea:40",
            "net10": "06:6e:90:79:da:1d",
            "net2": "06:0c:cd:63:38:97",
            "net3": "e6:e6:1c:4c:65:09",
            "net4": "02:6d:87:ba:24:9c",
            "net5": "ca:c3:ee:93:04:b1",
            "net6": "56:40:00:5a:ec:0c",
            "net7": "a6:cf:8a:ee:21:e1",
            "net8": "fa:61:51:78:04:a6",
            "net9": "f2:6a:52:b1:ed:45"
        },
        "leaf_1_0_9": {
            "net0": "ea:f4:6f:58:1f:67",
            "net1": "e2:2b:66:7c:a5:90",
            "net10": "96:2c:9d:e0:a7:ef",
            "net2": "ee:87:ee:ee:5c:c7",
            "net3": "7a:19:85:82:c6:9e",
            "net4": "f2:94:81:8f:da:e3",
            "net5": "aa:71:f9:30:1b:de",
            "net6": "4a:59:6d:38:d5:eb",
            "net7": "16:51:a4:9a:08:42",
            "net8": "ea:12:50:a1:9b:9a",
            "net9": "de:ed:f7:ca:33:34"
        },
        "leaf_2_0_1": {
            "net0": "a6:81:a9:90:68:6b",
            "net1": "b6:4e:fa:14:43:a9",
            "net10": "6a:15:53:41:ca:f3",
            "net2": "92:3d:96:f3:a1:71",
            "net3": "92:b7:4a:46:26:5f",
            "net4": "16:c0:6a:a1:56:97",
            "net5": "82:39:d9:7a:68:ff",
            "net6": "f6:52:37:17:d4:2c",
            "net7": "36:11:61:81:94:25",
            "net8": "5a:7f:8c:da:7c:03",
            "net9": "76:eb:40:6a:b2:5a"
        },
        "leaf_2_0_10": {
            "net0": "fa:30:6e:6c:76:9a",
            "net1": "0e:d4:29:6a:c3:82",
            "net10": "6e:50:9b:71:b0:db",
            "net2": "22:ac:e4:1f:e7:b7",
            "net3": "92:43:75:1a:39:ef",
            "net4": "72:c6:e4:c6:a4:e8",
            "net5": "ce:e0:06:8a:45:8d",
            "net6": "9e:e2:4a:1d:10:21",
            "net7": "de:a5:cf:2b:b3:ed",
            "net8": "86:aa:e5:85:6f:5f",
            "net9": "ce:25:6e:cd:c6:13"
        },
        "leaf_2_0_2": {
            "net0": "b6:07:a8:fe:2f:7d",
            "net1": "9e:97:56:1a:ee:e9",
            "net10": "3a:54:f6:fc:6e:fa",
            "net2": "fa:9b:2d:10:4d:3f",
            "net3": "da:31:86:8c:3b:2a",
            "net4": "ce:c0:56:ff:70:d3",
            "net5": "76:3c:cf:a0:c9:b9",
            "net6": "f2:a5:87:d5:68:dd",
            "net7": "f2:b5:a2:35:50:31",
            "net8": "fa:f8:eb:9e:c0:a3",
            "net9": "3a:a3:c8:d5:fe:bb"
        },
        "leaf_2_0_3": {
            "net0": "8a:dd:05:95:f1:39",
            "net1": "aa:14:98:eb:e9:db",
            "net10": "6e:7a:29:28:36:7c",
            "net2": "66:e0:e9:ff:be:b7",
            "net3": "7e:e5:0c:5d:fc:b8",
            "net4": "66:10:59:cd:6f:33",
            "net5": "6a:5d:d0:8c:db:83",
            "net6": "9e:47:71:c6:57:5b",
            "net7": "aa:4f:9a:85:b6:99",
            "net8": "0a:47:49:01:82:6a",
            "net9": "fe:b5:08:b6:47:80"
        },
        "leaf_2_0_4": {
            "net0": "fa:ce:81:f3:47:7a",
            "net1": "9e:81:f8:25:b4:8a",
            "net10": "ee:70:1b:23:94:53",
            "net2": "06:f7:df:17:5c:34",
            "net3": "46:f5:28:40:50:ba",
            "net4": "42:e8:1d:ac:af:a4",
            "net5": "b2:75:1e:12:1c:94",
            "net6": "3e:8a:e2:62:93:f5",
            "net7": "92:8d:81:04:fc:de",
            "net8": "12:62:74:38:97:dd",
            "net9": "22:4b:ca:26:0b:14"
        },
        "leaf_2_0_5": {
            "net0": "1a:9d:62:6d:dd:49",
            "net1": "fa:0f:19:2d:5e:4c",
            "net10": "26:b7:c7:16:69:e4",
            "net2": "be:4c:57:f3:f8:9d",
            "net3": "8a:62:8f:bd:d6:ef",
            "net4": "f2:e3:8c:b5:8b:af",
            "net5": "7e:f1:f9:6e:2e:05",
            "net6": "7e:45:0c:f9:a3:89",
            "net7": "0a:cb:8d:80:28:47",
            "net8": "0a:3b:16:b7:6d:66",
            "net9": "1e:1c:7b:6e:7d:4d"
        },
        "leaf_2_0_6": {
            "net0": "32:63:fe:a3:47:7e",
            "net1": "1a:84:12:ea:1a:19",
            "net10": "0e:36:b1:f4:b3:ce",
            "net2": "66:2f:d0:be:26:8a",
            "net3": "76:40:f9:fc:9a:a9",
            "net4": "0e:6d:ab:80:d1:f5",
            "net5": "42:66:18:e1:4e:14",
            "net6": "72:2e:21:ab:8b:09",
            "net7": "76:53:7c:e6:01:96",
            "net8": "c2:9c:c1:75:c1:26",
            "net9": "46:50:e8:8a:ce:39"
        },
        "leaf_2_0_7": {
            "net0": "fa:54:99:d0:3d:67",
            "net1": "6e:0d:c2:33:7a:6c",
            "net10": "66:cc:87:4a:c1:01",
            "net2": "8e:23:57:1a:8a:a1",
            "net3": "d2:ff:01:6f:40:2d",
            "net4": "92:b4:cb:14:77:24",
            "net5": "26:17:64:c8:a1:db",
            "net6": "de:e4:a0:2d:03:a7",
            "net7": "f6:a3:43:e3:13:4e",
            "net8": "be:a9:99:53:aa:0c",
            "net9": "6e:fc:c4:69:41:1d"
        },
        "leaf_2_0_8": {
            "net0": "86:51:38:c0:57:98",
            "net1": "4e:86:d8:c4:7c:92",
            "net10": "62:4d:43:d8:a7:45",
            "net2": "ae:96:33:77:8f:7f",
            "net3": "32:d2:78:d9:05:c2",
            "net4": "52:ef:ca:58:70:7b",
            "net5": "8a:de:04:ac:52:33",
            "net6": "72:41:c2:33:12:e1",
            "net7": "72:91:ea:22:74:49",
            "net8": "d6:41:32:26:4f:79",
            "net9": "36:4b:29:71:d7:78"
        },
        "leaf_2_0_9": {
            "net0": "ca:a0:58:bd:90:af",
            "net1": "0e:c3:43:98:b4:91",
            "net10": "86:91:fc:7c:a1:e2",
            "net2": "72:16:b4:5a:f0:fa",
            "net3": "be:ec:aa:5b:d8:1e",
            "net4": "72:1a:3e:94:62:21",
            "net5": "f2:b4:f8:dc:bc:b1",
            "net6": "aa:95:ee:5e:9a:70",
            "net7": "e2:a3:ad:a4:45:9d",
            "net8": "ce:cf:67:af:6f:67",
            "net9": "52:b7:50:63:f5:a0"
        },
        "leaf_3_0_1": {
            "net0": "46:cd:60:62:21:21",
            "net1": "6a:a6:ad:91:5e:79",
            "net10": "26:6f:20:a1:0f:b7",
            "net2": "7e:09:ec:74:b4:eb",
            "net3": "96:f5:12:53:6d:9b",
            "net4": "ce:ff:f1:2b:61:08",
            "net5": "12:d5:ff:8e:1f:ec",
            "net6": "96:d1:45:17:59:79",
            "net7": "6a:50:7f:c1:9a:2a",
            "net8": "62:93:61:00:fc:7e",
            "net9": "2a:6f:ae:bd:9d:bd"
        },
        "leaf_3_0_10": {
            "net0": "8a:e8:d3:89:38:8b",
            "net1": "4a:91:31:aa:4d:64",
            "net10": "4e:48:44:82:19:71",
            "net2": "8a:aa:51:f9:f5:bc",
            "net3": "36:02:06:3e:71:b6",
            "net4": "06:0d:28:92:a0:31",
            "net5": "2a:58:0b:1d:29:8c",
            "net6": "96:0c:17:38:94:8d",
            "net7": "da:27:f6:8d:15:d1",
            "net8": "6a:79:ad:98:df:30",
            "net9": "fe:42:7f:66:c5:e9"
        },
        "leaf_3_0_2": {
            "net0": "46:0f:22:71:f9:c8",
            "net1": "5a:47:58:3f:02:cb",
            "net10": "3e:f0:58:d1:90:fd",
            "net2": "fe:4f:6d:9b:62:90",
            "net3": "e2:cd:ea:ef:18:67",
            "net4": "fa:b3:86:95:42:55",
            "net5": "92:b1:9e:98:e5:b6",
            "net6": "c6:dd:40:44:2f:7f",
            "net7": "6a:55:3e:d2:57:2c",
            "net8": "66:1e:72:a2:c8:03",
            "net9": "62:30:83:06:c8:2a"
        },
        "leaf_3_0_3": {
            "net0": "f6:11:a4:dd:db:63",
            "net1": "62:8c:72:68:0f:7a",
            "net10": "b2:c9:93:ad:57:e8",
            "net2": "52:de:67:a9:dd:30",
            "net3": "36:f8:4e:9f:e1:55",
            "net4": "9a:eb:60:80:bc:22",
            "net5": "d6:55:c9:a7:4e:b1",
            "net6": "9a:3a:a4:2d:bb:dc",
            "net7": "fe:d4:77:20:03:77",
            "net8": "82:c3:97:c0:ef:5b",
            "net9": "4a:2e:bd:7f:b5:03"
        },
        "leaf_3_0_4": {
            "net0": "a2:1a:78:ad:4d:4b",
            "net1": "86:ec:a7:48:b4:ad",
            "net10": "86:02:fe:4d:bf:e5",
            "net2": "a2:eb:bb:85:71:b4",
            "net3": "d2:fa:4c:d3:f4:44",
            "net4": "96:f1:38:60:42:3b",
            "net5": "22:fb:97:95:1b:42",
            "net6": "6e:a3:23:66:0f:19",
            "net7": "e2:45:35:b8:05:8f",
            "net8": "12:c1:60:bd:ab:09",
            "net9": "1e:cd:83:4e:90:2d"
        },
        "leaf_3_0_5": {
            "net0": "d6:c1:ba:19:aa:39",
            "net1": "2a:93:68:8a:35:cb",
            "net10": "e6:27:76:2e:14:aa",
            "net2": "42:c5:97:6a:a0:8b",
            "net3": "72:4e:b2:3c:9b:f1",
            "net4": "66:90:9e:ee:22:6c",
            "net5": "c2:56:a3:42:7f:f1",
            "net6": "32:81:b4:23:3e:09",
            "net7": "be:f1:99:6d:ff:65",
            "net8": "b2:a0:df:de:0c:ae",
            "net9": "1e:f9:cf:ee:66:8c"
        },
        "leaf_3_0_6": {
            "net0": "c2:be:7c:3c:57:08",
            "net1": "86:99:9a:b2:75:ae",
            "net10": "32:a7:5e:9c:ff:bf",
            "net2": "82:0a:bf:db:b7:d9",
            "net3": "5e:6c:47:e2:dc:83",
            "net4": "36:73:18:f2:a7:2c",
            "net5": "2e:37:1e:1a:ee:3a",
            "net6": "8a:2e:66:db:0c:60",
            "net7": "36:dd:7b:e8:79:77",
            "net8": "7a:b1:07:7e:9c:2c",
            "net9": "a6:4d:c6:1c:69:15"
        },
        "leaf_3_0_7": {
            "net0": "c2:3e:f8:b1:b4:48",
            "net1": "9e:64:38:b4:b7:78",
            "net10": "ca:8a:b6:f3:a5:42",
            "net2": "6a:37:57:b6:99:43",
            "net3": "da:2e:e7:e1:d9:de",
            "net4": "aa:1b:e9:07:b8:11",
            "net5": "5a:7c:ed:48:1b:ee",
            "net6": "ce:3a:f0:ff:a9:0e",
            "net7": "d2:37:81:98:30:12",
            "net8": "42:b1:e0:8f:22:d1",
            "net9": "3e:8c:f1:cb:96:90"
        },
        "leaf_3_0_8": {
            "net0": "62:d8:0e:d6:2a:9a",
            "net1": "56:8f:4c:ac:e5:19",
            "net10": "02:61:ae:d6:60:da",
            "net2": "d2:88:6f:3d:29:c5",
            "net3": "b6:cb:4f:21:e8:74",
            "net4": "5e:6c:51:71:04:83",
            "net5": "06:65:2f:d9:71:b3",
            "net6": "26:2b:ef:0c:f7:77",
            "net7": "1e:67:16:49:17:77",
            "net8": "16:f4:9c:04:e4:88",
            "net9": "f2:fd:01:32:1a:ab"
        },
        "leaf_3_0_9": {
            "net0": "ae:35:50:ba:9b:26",
            "net1": "a6:58:30:2a:9a:c8",
            "net10": "1e:3d:ca:e6:5b:9f",
            "net2": "0a:89:f0:59:67:a4",
            "net3": "6e:41:90:fc:55:de",
            "net4": "7a:f7:a0:7f:b7:96",
            "net5": "1e:e0:cd:62:11:86",
            "net6": "fe:68:b7:46:9e:e4",
            "net7": "b6:70:cb:0b:6f:86",
            "net8": "5e:f8:22:db:42:43",
            "net9": "02:5e:fc:dd:a5:da"
        },
        "leaf_4_0_1": {
            "net0": "f2:55:0f:d5:ec:e0",
            "net1": "fe:99:9d:eb:f5:2b",
            "net10": "4e:79:bb:41:ea:3e",
            "net2": "fe:0f:8c:df:58:fe",
            "net3": "06:34:72:f4:6f:95",
            "net4": "76:e2:0a:ff:e5:4f",
            "net5": "be:31:64:3f:5e:22",
            "net6": "d6:08:48:d5:e8:7b",
            "net7": "56:2c:ef:96:e9:e4",
            "net8": "ae:53:0a:90:20:74",
            "net9": "9a:d5:2a:f7:48:7b"
        },
        "leaf_4_0_10": {
            "net0": "f2:d5:22:53:49:c8",
            "net1": "06:91:01:64:19:16",
            "net10": "b2:54:15:a0:de:45",
            "net2": "86:da:1e:99:f9:32",
            "net3": "1a:a7:88:55:ca:b6",
            "net4": "0a:aa:e2:67:33:24",
            "net5": "9e:fc:92:4c:58:5e",
            "net6": "36:82:7e:af:2f:a0",
            "net7": "a6:29:76:5b:cc:a5",
            "net8": "36:c9:a1:c7:46:20",
            "net9": "a2:64:fe:0d:65:68"
        },
        "leaf_4_0_2": {
            "net0": "42:a6:0b:e8:0a:65",
            "net1": "52:3b:0c:d8:d9:d9",
            "net10": "2a:e2:e9:ed:c2:c5",
            "net2": "ae:c5:bf:24:03:3d",
            "net3": "a2:f7:ac:94:c7:ad",
            "net4": "3e:05:66:9c:fb:87",
            "net5": "76:08:7a:db:fe:ac",
            "net6": "c6:c1:5c:bc:df:a7",
            "net7": "56:41:d7:6f:51:74",
            "net8": "d2:37:43:3f:6b:57",
            "net9": "a2:a9:79:cd:0b:27"
        },
        "leaf_4_0_3": {
            "net0": "72:e2:42:8e:8a:ee",
            "net1": "82:d2:1b:40:95:71",
            "net10": "d6:d3:11:12:1e:a2",
            "net2": "7e:70:38:a1:12:12",
            "net3": "ae:83:20:e0:e1:93",
            "net4": "96:56:39:0a:f4:c8",
            "net5": "a2:78:f8:5e:aa:b7",
            "net6": "5a:3a:9f:99:f2:a9",
            "net7": "3e:d4:5c:e3:8b:52",
            "net8": "be:8a:51:bd:ff:ec",
            "net9": "da:48:3b:a0:ac:79"
        },
        "leaf_4_0_4": {
            "net0": "3a:0d:fb:b8:39:3d",
            "net1": "b6:c8:59:7d:0c:b9",
            "net10": "52:eb:f6:54:13:65",
            "net2": "1e:f4:ad:4e:25:57",
            "net3": "a2:e5:93:13:0a:e4",
            "net4": "56:64:44:68:94:fc",
            "net5": "92:c1:0a:8e:10:97",
            "net6": "d6:dc:76:79:4a:15",
            "net7": "6e:1b:06:17:30:91",
            "net8": "16:67:d2:9c:35:99",
            "net9": "fa:3d:9e:f4:96:5f"
        },
        "leaf_4_0_5": {
            "net0": "3e:8e:3b:04:69:2f",
            "net1": "86:98:c3:55:1a:95",
            "net10": "0e:39:52:40:54:11",
            "net2": "86:7e:9a:44:d5:fc",
            "net3": "a2:cd:de:63:59:4d",
            "net4": "32:c3:96:a7:0c:27",
            "net5": "6e:27:b8:bb:70:e7",
            "net6": "16:f6:f1:a3:d3:2b",
            "net7": "32:01:37:80:74:b3",
            "net8": "32:51:6e:84:9d:63",
            "net9": "66:ca:2f:f5:80:d3"
        },
        "leaf_4_0_6": {
            "net0": "5a:69:a5:14:e0:46",
            "net1": "fe:eb:c3:2e:6e:7e",
            "net10": "ce:76:0f:e1:95:2b",
            "net2": "ce:50:93:93:5f:83",
            "net3": "1a:5c:74:c5:65:4e",
            "net4": "82:da:0c:23:c4:07",
            "net5": "7a:db:8a:89:e2:c7",
            "net6": "ca:3f:b7:0b:8f:1c",
            "net7": "42:a1:e1:48:f2:97",
            "net8": "72:40:b0:92:70:9e",
            "net9": "7e:bd:6b:a1:a4:cf"
        },
        "leaf_4_0_7": {
            "net0": "a6:f7:ec:d4:54:af",
            "net1": "8a:8d:17:ea:74:b5",
            "net10": "82:c7:88:11:eb:d4",
            "net2": "5a:4c:75:2e:f5:ed",
            "net3": "3a:c3:53:c2:61:47",
            "net4": "6a:7e:7d:6e:aa:70",
            "net5": "7a:62:5e:cf:33:49",
            "net6": "a6:4c:20:4b:a4:bb",
            "net7": "ea:94:b7:93:82:d9",
            "net8": "a2:d5:fd:22:4a:eb",
            "net9": "26:b8:ca:6c:d7:a8"
        },
        "leaf_4_0_8": {
            "net0": "d2:8c:35:cf:82:15",
            "net1": "56:bd:1f:77:77:b7",
            "net10": "06:4a:4b:54:6c:3c",
            "net2": "ae:a9:d1:85:62:ba",
            "net3": "66:e9:48:30:09:70",
            "net4": "4e:fe:08:fc:99:5e",
            "net5": "7e:09:76:9f:01:23",
            "net6": "1e:00:a6:c8:48:b9",
            "net7": "fa:b7:07:87:1c:ec",
            "net8": "e6:15:65:99:92:c5",
            "net9": "3a:df:ca:de:ce:f3"
        },
        "leaf_4_0_9": {
            "net0": "be:1e:d6:ae:ef:02",
            "net1": "06:79:d4:41:2b:23",
            "net10": "da:f5:19:4a:14:1a",
            "net2": "7a:f8:45:6e:e8:72",
            "net3": "b6:85:09:b1:64:24",
            "net4": "6a:50:1f:b1:87:ad",
            "net5": "52:09:57:f0:83:af",
            "net6": "da:6c:7c:33:95:fe",
            "net7": "da:ae:13:25:7d:39",
            "net8": "a2:58:b4:ef:a1:0a",
            "net9": "c2:4e:cd:eb:2c:62"
        },
        "spine_1_1_1": {
            "net0": "ae:4d:55:ac:1f:c4",
            "net1": "5e:d5:15:75:d9:58",
            "net10": "8e:0b:2a:bf:85:d5",
            "net11": "86:d8:cc:7e:b9:35",
            "net12": "4e:12:b4:ea:77:a1",
            "net13": "da:8e:9a:c3:1b:a9",
            "net14": "7a:fa:ff:29:fa:32",
            "net15": "0a:56:63:fd:75:df",
            "net16": "1a:af:5a:b2:21:e7",
            "net17": "1a:03:2b:8e:62:69",
            "net18": "72:67:48:c7:8c:92",
            "net19": "56:5a:14:f9:4c:57",
            "net2": "fa:14:d9:e0:13:d9",
            "net3": "02:54:79:67:c4:56",
            "net4": "d6:da:b5:72:5f:05",
            "net5": "4a:af:95:6f:25:41",
            "net6": "ae:d4:1c:bf:eb:50",
            "net7": "d6:d2:a6:cc:d9:b6",
            "net8": "ba:e1:9b:1c:11:78",
            "net9": "ea:61:94:a7:31:97"
        },
        "spine_1_1_10": {
            "net0": "fa:2c:af:bb:8a:e0",
            "net1": "ba:38:a2:73:98:b0",
            "net10": "72:7d:87:45:55:39",
            "net11": "7e:7c:a2:1d:13:ab",
            "net12": "b6:f2:24:b3:79:2a",
            "net13": "c6:1a:0a:58:57:24",
            "net14": "b2:9d:dc:88:a2:74",
            "net15": "e2:3b:a5:57:a1:2e",
            "net16": "e2:21:b6:64:c9:f1",
            "net17": "e6:1f:d9:ab:62:dd",
            "net18": "a6:d3:2a:40:e5:be",
            "net19": "a2:02:68:ea:b2:aa",
            "net2": "7a:21:ff:e0:0d:0b",
            "net3": "d6:32:f6:56:58:03",
            "net4": "f2:53:5f:7c:ef:27",
            "net5": "aa:70:c8:d7:ca:9f",
            "net6": "f6:2e:57:2d:3f:cd",
            "net7": "12:83:28:0f:86:57",
            "net8": "be:61:35:25:55:6d",
            "net9": "16:45:71:cf:54:f8"
        },
        "spine_1_1_2": {
            "net0": "02:b7:df:21:5e:86",
            "net1": "9e:90:5c:5b:ce:91",
            "net10": "2e:dc:07:b7:cb:32",
            "net11": "d2:c7:b1:a7:81:c0",
            "net12": "ce:fd:c1:9a:27:42",
            "net13": "0a:53:a9:53:f3:db",
            "net14": "72:46:52:91:98:26",
            "net15": "a2:fc:ae:d0:61:de",
            "net16": "2a:98:0b:67:b4:4a",
            "net17": "ca:32:70:42:f2:5e",
            "net18": "72:fa:84:3a:69:c9",
            "net19": "d2:2d:f9:75:4e:4e",
            "net2": "5e:68:0d:e4:f1:77",
            "net3": "f2:b3:8a:0c:8f:d2",
            "net4": "a2:8c:42:96:e8:9c",
            "net5": "82:f8:f0:ca:fa:a0",
            "net6": "22:bc:0b:e9:72:56",
            "net7": "6a:6a:61:78:94:5c",
            "net8": "02:f2:a3:af:f6:b5",
            "net9": "06:39:0b:a8:70:33"
        },
        "spine_1_1_3": {
            "net0": "4e:14:72:65:96:1b",
            "net1": "b6:2a:69:db:8f:2b",
            "net10": "b6:0c:a9:60:a8:16",
            "net11": "ba:dd:17:ae:65:c4",
            "net12": "5a:90:7c:d9:d6:57",
            "net13": "6a:50:63:70:4d:00",
            "net14": "fe:2a:3a:76:dd:5f",
            "net15": "e6:47:13:84:e2:30",
            "net16": "12:e0:d9:3a:21:dc",
            "net17": "da:83:7f:45:3f:cd",
            "net18": "c6:cb:dd:c9:87:e0",
            "net19": "36:15:ee:16:a2:5b",
            "net2": "06:0b:87:41:10:15",
            "net3": "a6:f1:0c:78:67:72",
            "net4": "96:71:3e:9f:54:c3",
            "net5": "6a:cb:f6:13:21:03",
            "net6": "86:68:10:28:d9:38",
            "net7": "56:95:8d:59:b7:a6",
            "net8": "c2:98:88:2e:8a:21",
            "net9": "ae:a5:a9:74:3b:16"
        },
        "spine_1_1_4": {
            "net0": "7a:5e:77:2f:13:ab",
            "net1": "2a:2f:f4:43:21:49",
            "net10": "f6:63:74:99:aa:2a",
            "net11": "62:37:59:0a:0c:0d",
            "net12": "f6:97:f3:46:97:5a",
            "net13": "ce:ab:9a:20:4c:02",
            "net14": "86:fd:07:76:e1:63",
            "net15": "96:17:19:8e:08:0b",
            "net16": "92:ef:9a:7d:76:a4",
            "net17": "06:0b:ac:f7:86:98",
            "net18": "7e:2f:8a:b5:22:f1",
            "net19": "42:9b:19:d5:05:e6",
            "net2": "e2:d3:a9:b7:fb:b0",
            "net3": "56:e4:9a:e1:93:c6",
            "net4": "be:43:4b:76:56:2d",
            "net5": "6e:cf:4d:48:51:63",
            "net6": "96:6c:55:56:8b:64",
            "net7": "86:5a:1c:97:ca:42",
            "net8": "be:18:11:61:7b:72",
            "net9": "5a:1d:4a:a1:fc:62"
        },
        "spine_1_1_5": {
            "net0": "7a:28:52:41:28:6e",
            "net1": "9a:21:01:12:eb:de",
            "net10": "3e:4e:d5:9d:ec:98",
            "net11": "c6:5e:52:c0:8f:9b",
            "net12": "ee:9e:30:dd:f5:ce",
            "net13": "62:ef:3a:50:53:c6",
            "net14": "4a:55:cf:4c:78:76",
            "net15": "42:ce:37:88:f3:44",
            "net16": "da:83:70:db:f0:f1",
            "net17": "72:82:af:51:0b:30",
            "net18": "2e:29:e5:46:48:09",
            "net19": "12:e5:d5:84:3e:fe",
            "net2": "5e:66:32:ca:f9:84",
            "net3": "d2:67:3f:23:f5:df",
            "net4": "36:b4:78:2c:0b:2d",
            "net5": "0a:f5:db:60:d5:06",
            "net6": "ce:cf:cd:66:35:30",
            "net7": "3e:01:51:b8:c4:3d",
            "net8": "26:60:e0:78:33:84",
            "net9": "36:9a:00:fe:73:49"
        },
        "spine_1_1_6": {
            "net0": "ca:00:76:4f:f9:9d",
            "net1": "ee:6b:24:01:a0:ec",
            "net10": "ce:e8:a7:c1:96:db",
            "net11": "e6:4e:3b:5c:7a:43",
            "net12": "62:16:f2:ed:5c:a4",
            "net13": "fa:ad:c4:3d:95:96",
            "net14": "ee:2c:55:b3:46:50",
            "net15": "22:3d:66:7f:3a:80",
            "net16": "d2:b5:0d:49:42:29",
            "net17": "62:37:6c:38:b7:b8",
            "net18": "9e:34:f7:e8:7e:e4",
            "net19": "1a:37:8f:5b:96:aa",
            "net2": "62:af:9e:e5:4e:01",
            "net3": "ee:0b:ac:8d:8a:bd",
            "net4": "92:54:29:6e:a5:f2",
            "net5": "b6:43:52:ad:66:66",
            "net6": "7e:f1:23:04:33:8b",
            "net7": "b2:f8:cc:6b:d8:a5",
            "net8": "e6:6d:09:c9:6a:54",
            "net9": "76:83:51:b5:00:88"
        },
        "spine_1_1_7": {
            "net0": "5e:c3:de:ef:5c:7d",
            "net1": "42:f2:74:4b:78:68",
            "net10": "2a:fb:9b:2e:b8:75",
            "net11": "0a:99:ba:a1:2f:45",
            "net12": "a2:53:29:85:0b:33",
            "net13": "06:d9:fc:fe:58:c4",
            "net14": "96:fd:1f:b4:34:07",
            "net15": "7a:59:4f:53:b8:26",
            "net16": "06:e1:7c:82:f7:89",
            "net17": "6e:3f:0f:4f:0d:dc",
            "net18": "76:ca:ca:d5:9a:07",
            "net19": "66:e9:23:a6:14:92",
            "net2": "42:f5:a6:f9:6c:a5",
            "net3": "7a:0d:92:d6:9d:2a",
            "net4": "9e:f4:e4:07:0b:2c",
            "net5": "4a:e1:ab:26:30:38",
            "net6": "e2:6e:b8:ca:9a:03",
            "net7": "d6:41:ab:24:31:3c",
            "net8": "a2:dc:80:cd:35:f7",
            "net9": "f6:4e:b8:ce:40:6f"
        },
        "spine_1_1_8": {
            "net0": "36:8c:1f:05:de:e4",
            "net1": "36:83:8b:e3:8e:c7",
            "net10": "fe:13:3e:9d:04:2d",
            "net11": "32:ba:ab:7d:69:8c",
            "net12": "fa:5f:ea:d4:7d:79",
            "net13": "32:ad:ee:83:46:0d",
            "net14": "1a:b4:d3:bd:8a:2e",
            "net15": "3a:c9:9e:22:2f:7a",
            "net16": "fe:c5:bb:24:41:14",
            "net17": "8a:17:33:76:41:7e",
            "net18": "52:99:21:a1:cb:34",
            "net19": "f2:76:da:76:4b:8a",
            "net2": "d6:1c:05:fc:3b:81",
            "net3": "12:6b:8e:bc:7e:59",
            "net4": "ea:0e:1a:bf:b1:d8",
            "net5": "5a:52:8a:19:11:9e",
            "net6": "26:11:cc:10:f8:3a",
            "net7": "76:e3:c0:71:9f:51",
            "net8": "06:72:1a:ad:8a:b1",
            "net9": "ca:00:30:d3:08:11"
        },
        "spine_1_1_9": {
            "net0": "3a:b6:99:15:5a:69",
            "net1": "fa:94:81:a5:33:d2",
            "net10": "9a:28:ce:df:03:c7",
            "net11": "ba:89:35:ff:09:e8",
            "net12": "96:0d:6e:35:36:a0",
            "net13": "ce:80:dc:0c:8f:43",
            "net14": "a6:7b:5a:b8:06:4f",
            "net15": "12:b6:67:bf:fd:a3",
            "net16": "3a:84:e0:a6:fc:2b",
            "net17": "8e:6f:5d:4c:6a:b4",
            "net18": "d6:ef:92:f5:7f:d2",
            "net19": "5e:42:b9:66:b5:b4",
            "net2": "9e:d9:ab:d3:a9:ec",
            "net3": "be:3c:e5:6a:1d:3d",
            "net4": "4a:c1:44:44:0d:c3",
            "net5": "1a:8e:b2:63:ef:62",
            "net6": "fe:a2:74:08:42:2b",
            "net7": "d6:2b:ef:5c:a8:c4",
            "net8": "3e:82:7e:53:54:fa",
            "net9": "6e:06:db:0a:7f:61"
        },
        "spine_2_1_1": {
            "net0": "52:09:ef:78:25:5a",
            "net1": "aa:29:80:2f:4a:7c",
            "net10": "2e:6a:62:f2:a5:f9",
            "net11": "22:d2:95:d1:96:44",
            "net12": "76:ef:e7:55:12:50",
            "net13": "02:9f:c5:e3:3a:0e",
            "net14": "3e:e5:b8:04:8b:8c",
            "net15": "76:dc:04:2e:93:b7",
            "net16": "8e:6a:82:dc:16:bc",
            "net17": "7a:91:c3:66:6c:79",
            "net18": "d2:2b:09:2a:4d:45",
            "net19": "92:d2:b8:21:ec:5d",
            "net2": "9e:09:45:76:69:4b",
            "net3": "1a:8d:80:f7:f9:31",
            "net4": "7e:7e:c1:a6:df:7e",
            "net5": "2e:45:d6:e5:e7:f0",
            "net6": "a2:b0:47:69:0b:8a",
            "net7": "82:1d:cb:38:c5:6b",
            "net8": "6e:f2:ae:c0:c3:4f",
            "net9": "fa:4f:99:a7:e6:71"
        },
        "spine_2_1_10": {
            "net0": "4a:56:17:dd:9f:8a",
            "net1": "36:44:31:11:27:6f",
            "net10": "0a:15:cf:2f:ca:ad",
            "net11": "06:fb:96:6a:99:02",
            "net12": "16:7d:8d:f1:59:63",
            "net13": "e2:23:7d:2a:01:52",
            "net14": "b6:14:4c:ce:75:c2",
            "net15": "26:8b:7d:01:95:25",
            "net16": "3e:37:e8:1d:46:32",
            "net17": "0e:54:fb:32:c6:5e",
            "net18": "9e:67:d3:04:8c:54",
            "net19": "9a:6d:b4:5c:51:fc",
            "net2": "fe:4d:29:3c:bd:a8",
            "net3": "e2:15:ce:8d:7f:d8",
            "net4": "d2:26:1c:54:fe:4c",
            "net5": "d6:b4:c9:4f:c5:19",
            "net6": "42:82:4b:28:57:4c",
            "net7": "7e:ca:55:20:87:70",
            "net8": "5a:7c:31:79:f2:0f",
            "net9": "a6:47:31:a2:8b:ef"
        },
        "spine_2_1_2": {
            "net0": "7a:67:14:56:5f:14",
            "net1": "1e:5f:7c:55:88:94",
            "net10": "52:3d:38:c3:5c:aa",
            "net11": "e6:8e:75:0b:75:54",
            "net12": "a6:04:3c:f7:b7:13",
            "net13": "fe:76:49:73:38:a3",
            "net14": "c2:5c:ab:8f:cb:da",
            "net15": "16:fa:fb:0f:98:3f",
            "net16": "9a:1e:73:a1:cd:5c",
            "net17": "f6:9e:33:c0:40:0b",
            "net18": "2e:6b:ca:7a:ac:61",
            "net19": "56:c7:aa:26:40:ce",
            "net2": "3e:6e:e7:ec:50:8f",
            "net3": "4e:b6:35:81:91:56",
            "net4": "be:d2:30:e2:7b:51",
            "net5": "4e:c8:a1:83:87:8e",
            "net6": "aa:17:1b:ad:58:dd",
            "net7": "1a:59:04:88:08:06",
            "net8": "da:e6:b7:9e:06:5d",
            "net9": "36:a8:8a:d6:58:c3"
        },
        "spine_2_1_3": {
            "net0": "e2:00:7a:b7:3c:19",
            "net1": "aa:45:1d:a1:17:84",
            "net10": "0a:80:06:58:e5:34",
            "net11": "aa:94:42:61:a5:dd",
            "net12": "4a:59:bf:09:5e:c3",
            "net13": "3a:d1:89:67:0f:8a",
            "net14": "2a:74:c7:be:84:2c",
            "net15": "62:19:49:3b:7a:5d",
            "net16": "5a:02:73:bb:e0:1b",
            "net17": "ee:09:04:4f:ca:72",
            "net18": "96:e1:ba:b6:d9:74",
            "net19": "62:5c:d0:a4:ef:13",
            "net2": "f2:f7:06:cc:d5:b8",
            "net3": "66:0f:a4:5e:f1:76",
            "net4": "fe:5c:1d:12:c1:60",
            "net5": "72:f2:50:21:43:f6",
            "net6": "d2:36:a6:26:2d:74",
            "net7": "52:53:ef:1f:a6:76",
            "net8": "32:db:04:21:fa:64",
            "net9": "9e:c0:dc:93:fc:35"
        },
        "spine_2_1_4": {
            "net0": "ae:42:9e:53:bb:3c",
            "net1": "de:c4:d1:10:28:91",
            "net10": "ce:5f:6e:86:6e:29",
            "net11": "0e:27:e7:f2:d0:92",
            "net12": "46:4c:0f:bd:ce:41",
            "net13": "56:aa:85:8c:7a:70",
            "net14": "8e:bc:ee:49:c8:f7",
            "net15": "92:33:89:d1:22:f2",
            "net16": "ae:71:d9:65:67:5b",
            "net17": "8e:5a:5f:13:ca:5a",
            "net18": "7a:0f:01:4a:56:5f",
            "net19": "ba:1d:71:5a:67:cb",
            "net2": "86:9f:a6:dd:b8:06",
            "net3": "6e:7d:c5:5e:a7:99",
            "net4": "6a:b9:42:2d:2f:2f",
            "net5": "d2:09:1b:25:15:2a",
            "net6": "8a:1e:f2:0e:83:d9",
            "net7": "3e:b6:89:3f:b9:83",
            "net8": "c2:eb:0f:e9:34:a0",
            "net9": "4a:bc:81:1b:03:17"
        },
        "spine_2_1_5": {
            "net0": "12:30:a3:eb:44:e6",
            "net1": "7a:60:7f:78:5f:68",
            "net10": "1e:80:0a:2b:75:9f",
            "net11": "42:a3:21:34:b8:ab",
            "net12": "62:2d:69:55:13:56",
            "net13": "36:51:3e:bb:79:06",
            "net14": "66:d3:f3:b8:26:a7",
            "net15": "2e:67:ea:bb:d4:23",
            "net16": "6e:25:1a:f1:0f:3f",
            "net17": "c2:1b:62:a1:a6:e7",
            "net18": "1e:88:bf:fb:a3:5e",
            "net19": "f6:20:96:8a:a0:c8",
            "net2": "72:2b:22:48:7e:a2",
            "net3": "e6:e4:ff:97:b9:83",
            "net4": "26:fd:0f:60:da:56",
            "net5": "22:27:d5:4a:f5:a8",
            "net6": "1e:93:b7:95:63:69",
            "net7": "ae:53:c6:b5:62:f6",
            "net8": "4e:22:db:ed:71:46",
            "net9": "d6:8a:86:72:6d:e2"
        },
        "spine_2_1_6": {
            "net0": "6e:20:bb:21:e3:d9",
            "net1": "96:2a:18:87:85:b3",
            "net10": "12:26:02:90:49:be",
            "net11": "ba:58:9f:1b:0a:03",
            "net12": "02:7a:08:2b:78:f1",
            "net13": "aa:94:09:ea:f2:d2",
            "net14": "8e:4d:e3:d1:f7:80",
            "net15": "9e:f3:25:9c:89:13",
            "net16": "fe:a8:58:e9:be:15",
            "net17": "b2:3c:c5:7e:1b:a6",
            "net18": "0e:55:6c:d9:12:cb",
            "net19": "52:f4:f7:c9:5f:27",
            "net2": "76:59:8c:26:6e:ea",
            "net3": "b2:40:2a:30:58:90",
            "net4": "8a:02:c4:ea:95:00",
            "net5": "76:16:61:d7:7e:24",
            "net6": "e6:a7:9b:7a:d1:9a",
            "net7": "42:43:96:bf:3a:6a",
            "net8": "f2:f9:7d:81:81:8c",
            "net9": "8e:78:af:91:b7:60"
        },
        "spine_2_1_7": {
            "net0": "1a:30:f8:0e:f5:ad",
            "net1": "d2:3c:54:93:10:4c",
            "net10": "fa:8f:2a:89:e2:c1",
            "net11": "fa:8d:4d:b7:ac:ee",
            "net12": "2e:93:eb:8f:8a:85",
            "net13": "e6:02:11:e1:61:7d",
            "net14": "be:d1:03:35:57:9b",
            "net15": "4a:e0:a2:09:ec:41",
            "net16": "8e:a8:07:1d:7a:32",
            "net17": "4e:45:39:ab:36:3c",
            "net18": "c2:84:f0:ad:b3:b0",
            "net19": "46:88:cb:69:55:ba",
            "net2": "76:80:f6:ec:08:c8",
            "net3": "56:1e:6d:c7:09:f8",
            "net4": "1e:db:98:96:56:2b",
            "net5": "06:09:a1:35:29:cd",
            "net6": "ae:6c:41:93:5d:4e",
            "net7": "7a:5e:da:e0:64:a1",
            "net8": "9e:d8:3f:96:c9:3e",
            "net9": "8a:da:1a:19:1d:d4"
        },
        "spine_2_1_8": {
            "net0": "fa:19:c2:63:0a:ce",
            "net1": "72:a1:65:65:44:af",
            "net10": "0a:da:1c:1e:a5:2a",
            "net11": "42:ab:42:a7:48:a7",
            "net12": "b6:a7:79:fd:fc:23",
            "net13": "f6:c5:eb:60:e2:fa",
            "net14": "b6:90:66:00:a8:a2",
            "net15": "02:e2:5a:07:b3:48",
            "net16": "ee:55:70:5d:b5:57",
            "net17": "9e:fe:e4:25:fc:68",
            "net18": "16:bb:21:b4:00:d7",
            "net19": "d6:3e:3c:ec:a6:af",
            "net2": "36:6b:1e:7b:c4:df",
            "net3": "52:f8:9c:02:ee:41",
            "net4": "82:39:e3:b4:98:fb",
            "net5": "3a:96:63:39:b9:82",
            "net6": "e6:1f:2d:21:fd:6f",
            "net7": "fa:c4:80:2c:a6:2e",
            "net8": "d6:7a:d7:89:ac:e7",
            "net9": "4a:96:2b:0c:22:dc"
        },
        "spine_2_1_9": {
            "net0": "f2:83:9a:e8:45:79",
            "net1": "92:46:13:45:c8:41",
            "net10": "7e:8f:dd:23:8d:20",
            "net11": "56:df:87:3d:47:a2",
            "net12": "82:d1:3e:6f:dc:36",
            "net13": "02:73:46:8c:f2:b2",
            "net14": "0a:2d:51:4c:95:25",
            "net15": "7a:8d:a3:9d:53:b7",
            "net16": "86:4f:78:ef:07:f8",
            "net17": "fa:b0:be:a2:2b:9c",
            "net18": "b6:21:05:43:4d:7d",
            "net19": "a6:83:17:8f:8b:68",
            "net2": "62:44:22:8e:fb:21",
            "net3": "1e:5a:6c:75:b8:19",
            "net4": "be:1f:82:38:9e:f1",
            "net5": "ea:ba:a7:29:3e:39",
            "net6": "ea:3d:59:97:fa:dd",
            "net7": "02:d0:b2:bd:05:b4",
            "net8": "b6:6c:8d:79:1e:69",
            "net9": "32:cb:70:bd:be:5e"
        },
        "spine_3_1_1": {
            "net0": "ca:e3:de:91:57:e4",
            "net1": "5e:4b:21:a4:07:a3",
            "net10": "2e:47:51:b9:ec:59",
            "net11": "72:fd:1b:2c:66:be",
            "net12": "b6:70:4f:ee:7a:59",
            "net13": "b6:8a:fc:e2:97:04",
            "net14": "f6:60:aa:fc:ec:fe",
            "net15": "e6:19:f8:29:4d:b4",
            "net16": "be:00:60:f1:cd:58",
            "net17": "26:a8:e7:de:c0:a0",
            "net18": "fa:a8:65:3f:b2:2b",
            "net19": "d2:64:fc:f6:c2:3d",
            "net2": "06:3f:97:67:2a:5a",
            "net3": "2a:1c:ff:30:e9:50",
            "net4": "16:17:7b:d9:8e:9a",
            "net5": "2e:86:e8:1a:12:7b",
            "net6": "26:eb:2a:7f:d3:0e",
            "net7": "b2:67:0f:f6:6c:88",
            "net8": "3e:ef:d5:25:0f:b5",
            "net9": "8a:81:e3:ac:32:ed"
        },
        "spine_3_1_10": {
            "net0": "36:a3:54:54:fc:27",
            "net1": "da:15:55:79:ef:a6",
            "net10": "e6:be:bf:6f:d6:f5",
            "net11": "82:00:0e:24:f5:e5",
            "net12": "62:9e:7c:68:d4:a1",
            "net13": "52:5a:9c:c4:c8:96",
            "net14": "ca:42:29:8d:b7:da",
            "net15": "b6:4e:82:bb:67:a0",
            "net16": "36:d3:c7:df:01:5a",
            "net17": "1a:1f:61:b1:7e:dd",
            "net18": "86:a6:58:49:5c:6d",
            "net19": "56:d8:b8:4d:98:96",
            "net2": "a2:09:7d:06:ab:f2",
            "net3": "ea:58:83:51:ee:72",
            "net4": "32:b8:1f:3f:3b:36",
            "net5": "5e:44:d4:e7:aa:68",
            "net6": "3a:cc:57:af:1a:4b",
            "net7": "1e:e3:6c:b9:ca:93",
            "net8": "a6:a7:c7:a7:bc:7b",
            "net9": "2a:31:96:6a:4f:ce"
        },
        "spine_3_1_2": {
            "net0": "7e:f7:6b:78:1b:cd",
            "net1": "ea:ac:2a:26:79:2c",
            "net10": "ca:4b:a1:12:d7:be",
            "net11": "be:5e:d5:0d:45:aa",
            "net12": "da:f5:93:d1:75:fd",
            "net13": "76:f2:ae:65:9c:21",
            "net14": "1a:88:a6:ba:fa:8e",
            "net15": "2a:52:76:75:ef:f4",
            "net16": "72:cb:a9:42:fd:af",
            "net17": "f2:cb:5d:92:ec:81",
            "net18": "b6:77:d6:b2:4b:35",
            "net19": "7a:19:76:bf:26:73",
            "net2": "5a:03:ed:db:2b:e5",
            "net3": "52:5b:24:27:ad:af",
            "net4": "56:b8:fc:6e:68:0b",
            "net5": "2e:57:08:f7:c3:d8",
            "net6": "a2:8c:43:a4:f9:eb",
            "net7": "4e:89:2c:64:26:df",
            "net8": "ce:41:a3:1d:80:c9",
            "net9": "1a:19:de:19:9d:1b"
        },
        "spine_3_1_3": {
            "net0": "0a:62:4c:b0:e6:38",
            "net1": "42:12:8b:7d:36:f0",
            "net10": "42:1c:03:bc:b8:76",
            "net11": "66:bc:42:e1:f5:82",
            "net12": "56:09:79:99:1a:07",
            "net13": "ba:0e:32:68:64:99",
            "net14": "ee:12:73:9c:08:26",
            "net15": "a6:62:b3:07:71:dd",
            "net16": "7e:ae:d9:9e:e8:63",
            "net17": "d2:56:6c:b2:5f:42",
            "net18": "9e:42:0e:ad:7f:d6",
            "net19": "be:74:fc:3c:32:3f",
            "net2": "ea:9c:a7:90:27:54",
            "net3": "ba:12:8a:80:7b:be",
            "net4": "b2:1f:94:cc:d1:82",
            "net5": "1a:46:89:c3:e8:27",
            "net6": "be:71:8d:ea:68:69",
            "net7": "2a:d5:92:44:3f:0f",
            "net8": "da:21:f3:be:10:e4",
            "net9": "46:00:a8:df:53:d1"
        },
        "spine_3_1_4": {
            "net0": "5e:28:1c:b4:ca:1d",
            "net1": "f2:35:03:72:84:52",
            "net10": "6a:ff:7a:0e:c5:c2",
            "net11": "62:d8:a4:80:83:86",
            "net12": "46:1f:c0:bd:e9:d3",
            "net13": "7a:89:d1:33:67:c9",
            "net14": "76:02:d1:3c:4f:d0",
            "net15": "f2:5a:48:10:2b:a5",
            "net16": "82:02:05:47:84:b5",
            "net17": "66:4c:8a:d6:3e:54",
            "net18": "4a:d1:6d:f4:1b:a8",
            "net19": "36:bc:c6:d4:fa:2a",
            "net2": "c2:34:34:f7:44:c5",
            "net3": "b2:1a:5a:c4:d5:ca",
            "net4": "f6:e3:0b:e7:a4:bf",
            "net5": "fa:73:6a:26:2f:19",
            "net6": "de:bb:c5:0e:c1:8d",
            "net7": "fe:6f:08:95:5d:6f",
            "net8": "22:e7:62:9f:a9:d5",
            "net9": "42:d2:51:06:a2:86"
        },
        "spine_3_1_5": {
            "net0": "26:88:b1:d6:2d:e9",
            "net1": "fe:3f:41:3b:63:2e",
            "net10": "c2:e2:94:6c:02:73",
            "net11": "02:cf:ec:49:1f:dc",
            "net12": "0e:72:95:4c:17:3d",
            "net13": "7e:1d:55:e6:81:52",
            "net14": "ea:ca:be:56:84:d8",
            "net15": "8e:59:3d:37:66:35",
            "net16": "be:44:0f:49:03:9b",
            "net17": "5a:10:7d:78:65:8a",
            "net18": "52:63:21:69:89:1c",
            "net19": "fe:4c:5c:d4:d5:4a",
            "net2": "a2:ac:1c:7d:9e:27",
            "net3": "1e:0a:c5:64:d5:8a",
            "net4": "ca:a0:24:c7:3a:fd",
            "net5": "16:a1:3d:07:60:a6",
            "net6": "42:6c:33:12:db:58",
            "net7": "46:b0:ee:58:55:41",
            "net8": "4a:5b:82:03:1c:3e",
            "net9": "c6:38:29:7e:7e:77"
        },
        "spine_3_1_6": {
            "net0": "8a:21:d9:ef:93:f0",
            "net1": "e6:c0:24:e7:f5:48",
            "net10": "be:ec:28:ac:31:9b",
            "net11": "c6:1a:47:31:4d:35",
            "net12": "96:31:d4:19:19:e1",
            "net13": "d2:98:2b:45:68:45",
            "net14": "2e:82:fc:32:b6:ae",
            "net15": "3e:c3:33:20:d8:ab",
            "net16": "9e:9c:f1:8c:a8:72",
            "net17": "ba:a6:96:fa:e4:4c",
            "net18": "f2:0e:25:4f:41:9b",
            "net19": "fe:ad:fa:04:65:c7",
            "net2": "26:26:f3:22:8e:dc",
            "net3": "2a:9f:c6:40:6c:6c",
            "net4": "c2:6a:d8:59:4a:c4",
            "net5": "46:63:0e:13:12:2c",
            "net6": "2a:4c:b9:93:52:ab",
            "net7": "86:d2:b4:69:05:8b",
            "net8": "ae:f1:55:d2:2d:10",
            "net9": "06:27:01:ee:b4:f6"
        },
        "spine_3_1_7": {
            "net0": "8e:cf:ae:c4:1b:90",
            "net1": "92:2d:43:69:5a:3c",
            "net10": "b2:ba:8f:d2:19:c4",
            "net11": "6e:f4:ba:9e:2d:27",
            "net12": "66:e6:d3:0f:29:c6",
            "net13": "12:db:c3:8f:07:91",
            "net14": "ee:f1:f9:29:be:43",
            "net15": "6a:a9:af:fd:12:e6",
            "net16": "c2:90:fb:38:9f:f5",
            "net17": "ca:a6:9d:41:54:39",
            "net18": "36:e8:11:5c:cf:91",
            "net19": "4e:66:44:cf:eb:7b",
            "net2": "32:58:aa:91:6c:25",
            "net3": "da:93:cd:3b:6e:5f",
            "net4": "72:13:26:88:93:5b",
            "net5": "4e:25:74:49:c4:37",
            "net6": "96:88:88:5a:25:ab",
            "net7": "92:87:37:5f:23:2a",
            "net8": "b6:7a:a6:15:7e:19",
            "net9": "52:4e:f0:10:36:a3"
        },
        "spine_3_1_8": {
            "net0": "7e:96:0e:3e:72:42",
            "net1": "96:cd:4c:96:5a:72",
            "net10": "2a:f4:55:d4:a0:ed",
            "net11": "76:fa:44:c9:34:9f",
            "net12": "72:29:f4:96:b9:20",
            "net13": "aa:97:c3:79:ad:a6",
            "net14": "66:fc:78:5c:6c:c1",
            "net15": "02:cd:de:5d:c6:19",
            "net16": "d6:c0:fd:ea:43:60",
            "net17": "92:dd:b2:b1:64:0a",
            "net18": "46:28:6b:41:60:dc",
            "net19": "62:ac:0e:a9:6e:bd",
            "net2": "2e:87:91:32:c4:d8",
            "net3": "b2:1a:5e:5b:6e:94",
            "net4": "ce:0d:1d:ab:9e:50",
            "net5": "2a:8f:4a:01:fb:fc",
            "net6": "36:c2:5f:85:33:4d",
            "net7": "86:6d:a7:c7:c8:84",
            "net8": "ce:0b:8f:2c:05:07",
            "net9": "52:91:c3:31:74:ac"
        },
        "spine_3_1_9": {
            "net0": "1e:4e:2c:b6:5a:3c",
            "net1": "66:99:cc:17:c5:84",
            "net10": "06:c4:b2:49:74:99",
            "net11": "46:eb:73:ce:d6:db",
            "net12": "9e:d1:08:65:ab:7f",
            "net13": "de:e2:af:07:2e:56",
            "net14": "0e:3c:a1:9c:18:df",
            "net15": "9a:18:03:6a:09:54",
            "net16": "e2:94:d7:cc:22:c5",
            "net17": "ee:df:6d:85:78:74",
            "net18": "d6:51:32:6d:25:8b",
            "net19": "fa:8b:0b:98:70:03",
            "net2": "82:cc:ac:dd:7f:2b",
            "net3": "06:23:ac:6f:5e:aa",
            "net4": "26:1e:14:49:2d:da",
            "net5": "5e:4d:5e:33:ac:8c",
            "net6": "4e:b9:d5:30:88:0e",
            "net7": "0e:7f:11:6c:d1:41",
            "net8": "2e:63:93:d9:b4:67",
            "net9": "8e:b7:0e:84:45:45"
        },
        "spine_4_1_1": {
            "net0": "86:04:7a:b3:0b:0a",
            "net1": "3a:fb:6a:25:a3:ca",
            "net10": "72:2a:af:f0:59:5e",
            "net11": "ca:2a:83:d2:d3:d1",
            "net12": "da:e7:3a:6a:22:3c",
            "net13": "02:78:2e:ee:52:25",
            "net14": "ae:59:2f:3b:63:ef",
            "net15": "36:3c:5f:89:1a:1a",
            "net16": "fa:3a:1d:6b:7e:ed",
            "net17": "2e:51:ef:cc:78:c5",
            "net18": "ba:e0:86:56:33:2a",
            "net19": "76:96:2c:3a:5a:d2",
            "net2": "de:68:63:b2:03:de",
            "net3": "e6:a3:4f:cb:51:16",
            "net4": "62:4f:9e:b3:c7:39",
            "net5": "66:d8:73:22:c4:14",
            "net6": "a2:fa:0e:ad:54:94",
            "net7": "a6:54:b2:f5:9e:21",
            "net8": "be:fe:41:62:10:d1",
            "net9": "fa:3b:d9:01:86:2a"
        },
        "spine_4_1_10": {
            "net0": "f6:94:21:e6:b0:8e",
            "net1": "32:88:35:22:83:dc",
            "net10": "1e:18:70:2e:97:ba",
            "net11": "2a:f0:23:92:29:b0",
            "net12": "be:4d:cb:38:3c:9c",
            "net13": "9e:9a:1a:3f:71:15",
            "net14": "52:ce:1f:14:7b:6a",
            "net15": "4a:f2:a5:59:40:05",
            "net16": "4e:06:9c:f3:05:29",
            "net17": "fe:aa:32:75:4b:d7",
            "net18": "f6:af:ff:71:99:b7",
            "net19": "a2:df:2e:1d:93:3d",
            "net2": "ce:b9:aa:d7:23:46",
            "net3": "f2:34:11:05:1e:bb",
            "net4": "62:43:40:bc:d3:7c",
            "net5": "52:9f:e4:34:10:e8",
            "net6": "aa:44:11:95:0c:db",
            "net7": "0a:7e:d5:c1:c5:ee",
            "net8": "c6:69:d1:0e:a7:65",
            "net9": "86:7a:4a:92:b9:1c"
        },
        "spine_4_1_2": {
            "net0": "26:f5:0c:fb:fe:7d",
            "net1": "4e:c0:6d:69:28:88",
            "net10": "da:3f:06:36:cb:c0",
            "net11": "1e:92:76:be:59:0a",
            "net12": "0e:c8:51:84:09:6d",
            "net13": "d2:76:5a:ba:ea:b3",
            "net14": "d2:76:d7:2a:46:de",
            "net15": "92:c9:63:d2:88:ee",
            "net16": "46:5d:3d:8a:84:e7",
            "net17": "66:d0:18:73:37:a9",
            "net18": "b6:19:f5:a7:78:e5",
            "net19": "86:23:03:de:51:d8",
            "net2": "9e:15:23:73:07:f6",
            "net3": "ca:e5:88:77:bb:cd",
            "net4": "ee:aa:fc:25:35:ee",
            "net5": "be:35:26:52:25:e7",
            "net6": "ea:8e:f8:96:ad:1a",
            "net7": "fe:a3:47:a5:70:3a",
            "net8": "26:49:2f:0e:6a:d9",
            "net9": "46:6e:f3:4d:b5:87"
        },
        "spine_4_1_3": {
            "net0": "72:69:48:c9:65:d8",
            "net1": "62:6d:37:f1:f9:62",
            "net10": "8e:b6:70:02:c5:4f",
            "net11": "32:fd:a9:ec:d2:a5",
            "net12": "d2:b4:b6:30:36:15",
            "net13": "b6:a7:e4:b7:12:43",
            "net14": "1a:ac:2c:77:1f:46",
            "net15": "46:70:7e:ea:45:55",
            "net16": "6e:63:0c:33:62:98",
            "net17": "b2:97:04:d2:cd:71",
            "net18": "92:76:e3:48:de:e3",
            "net19": "92:c2:41:dc:78:80",
            "net2": "b6:04:ea:fb:a4:25",
            "net3": "52:76:9a:7e:6b:3c",
            "net4": "1e:9e:7b:9b:b8:5f",
            "net5": "b2:2c:f0:b0:ed:1f",
            "net6": "a6:a9:97:aa:ed:e5",
            "net7": "f2:73:3a:17:ed:69",
            "net8": "c2:f7:e7:84:67:2e",
            "net9": "66:d2:20:da:7d:59"
        },
        "spine_4_1_4": {
            "net0": "c6:8f:21:7d:03:42",
            "net1": "d6:df:26:0a:4e:00",
            "net10": "02:83:61:e0:c7:93",
            "net11": "c2:b9:84:cc:06:ce",
            "net12": "be:83:4c:bd:d5:09",
            "net13": "b2:13:45:a4:8c:26",
            "net14": "d2:44:d6:66:44:92",
            "net15": "52:28:b7:4f:c1:64",
            "net16": "fa:f2:0b:34:04:c6",
            "net17": "66:ff:23:2a:5f:73",
            "net18": "8a:11:a9:12:ac:83",
            "net19": "32:43:8e:5b:d1:3c",
            "net2": "32:b6:cc:7a:9f:e1",
            "net3": "ca:cc:8a:14:ad:79",
            "net4": "4a:e5:62:1c:2a:bf",
            "net5": "fa:06:99:7c:45:0a",
            "net6": "16:69:f6:7d:08:74",
            "net7": "7e:f3:7f:5b:89:94",
            "net8": "a2:24:87:62:d9:f0",
            "net9": "66:53:05:98:d6:e4"
        },
        "spine_4_1_5": {
            "net0": "c6:6c:2b:78:fd:71",
            "net1": "36:58:5f:46:b3:59",
            "net10": "d2:c1:e3:94:30:2a",
            "net11": "72:66:43:ee:7b:e8",
            "net12": "d2:c3:0a:4e:01:ec",
            "net13": "76:80:36:a2:d3:97",
            "net14": "62:eb:7b:a4:92:e2",
            "net15": "0e:86:18:c1:84:3c",
            "net16": "1e:70:bb:e6:e7:03",
            "net17": "aa:bf:01:f8:88:16",
            "net18": "c6:4e:d7:5b:2e:ab",
            "net19": "1e:dc:ec:ab:2d:44",
            "net2": "ce:9f:5e:b6:c8:16",
            "net3": "12:cb:e7:ee:45:a4",
            "net4": "66:07:ce:ae:03:ab",
            "net5": "02:bf:55:08:05:99",
            "net6": "92:73:de:ab:d4:a0",
            "net7": "ea:0c:d7:e1:0e:06",
            "net8": "4e:0f:f1:f5:17:62",
            "net9": "2e:1c:ce:ff:d4:07"
        },
        "spine_4_1_6": {
            "net0": "ca:67:e6:cc:84:fc",
            "net1": "96:1b:15:2a:e9:06",
            "net10": "da:8d:44:38:b6:bb",
            "net11": "ee:43:1c:11:8b:a2",
            "net12": "a2:f7:cb:65:68:d3",
            "net13": "4a:79:0e:15:9f:de",
            "net14": "f2:df:e4:f1:c3:2f",
            "net15": "36:c5:f0:9a:f5:95",
            "net16": "1e:90:c3:1b:a7:3b",
            "net17": "a2:c1:3f:ab:d3:1f",
            "net18": "16:a1:b6:3a:7e:be",
            "net19": "f2:9c:45:92:4a:66",
            "net2": "82:6d:64:1d:7b:7b",
            "net3": "7a:9f:3f:56:b5:08",
            "net4": "e2:66:42:c8:4f:17",
            "net5": "4e:05:35:c1:3b:ea",
            "net6": "26:35:45:53:e9:a9",
            "net7": "3e:5f:b7:74:af:8b",
            "net8": "0e:2c:43:cf:7f:ae",
            "net9": "e6:8f:59:4d:d2:03"
        },
        "spine_4_1_7": {
            "net0": "7a:97:d3:0a:e9:bf",
            "net1": "ca:3a:31:00:b7:e4",
            "net10": "0a:02:86:37:aa:4e",
            "net11": "42:20:87:73:e2:96",
            "net12": "5e:fb:be:5e:55:92",
            "net13": "76:f6:5e:94:d3:75",
            "net14": "72:76:4c:80:1d:fc",
            "net15": "12:04:7a:d3:d4:aa",
            "net16": "96:91:b5:b5:b5:ca",
            "net17": "02:c0:48:9c:ea:39",
            "net18": "ae:8b:9d:52:e8:ea",
            "net19": "c6:a6:dd:21:8c:59",
            "net2": "16:d7:03:8e:d2:57",
            "net3": "ba:a9:f2:56:2c:97",
            "net4": "0e:89:a5:b4:3a:6e",
            "net5": "1a:bc:a1:44:3d:b2",
            "net6": "be:5d:fd:62:6f:a2",
            "net7": "5a:36:16:59:c4:0a",
            "net8": "56:c9:da:d1:19:6b",
            "net9": "6a:4b:1d:03:04:4a"
        },
        "spine_4_1_8": {
            "net0": "fa:33:cb:13:8a:cb",
            "net1": "9a:52:e8:5d:c1:02",
            "net10": "02:d5:81:3b:d2:a0",
            "net11": "36:b1:d5:ab:6c:9d",
            "net12": "5e:81:c7:64:60:00",
            "net13": "72:02:97:cf:40:63",
            "net14": "0a:23:07:15:1d:cf",
            "net15": "32:8f:55:a6:86:fe",
            "net16": "86:9a:28:99:b6:42",
            "net17": "da:1f:85:98:4d:f5",
            "net18": "1e:9e:b0:4d:af:f7",
            "net19": "a2:e9:e6:82:6e:af",
            "net2": "4a:5b:d0:b8:7d:00",
            "net3": "02:43:a1:78:a4:78",
            "net4": "5e:20:9e:5c:7e:bc",
            "net5": "ba:1a:55:eb:46:6b",
            "net6": "36:3b:6c:94:91:b3",
            "net7": "9a:b6:ed:17:6e:bf",
            "net8": "a2:67:11:01:17:6f",
            "net9": "f6:8e:0e:4b:11:9b"
        },
        "spine_4_1_9": {
            "net0": "62:3a:d3:e5:45:85",
            "net1": "5e:04:40:71:2d:38",
            "net10": "6e:e5:e7:f8:bf:bb",
            "net11": "06:83:bf:9e:28:46",
            "net12": "02:c7:66:d7:73:f8",
            "net13": "ee:32:d1:46:0c:82",
            "net14": "fe:b9:43:84:ba:f6",
            "net15": "f2:67:4e:fe:bf:19",
            "net16": "4e:ce:a9:f5:26:30",
            "net17": "ee:18:b5:15:c0:e1",
            "net18": "82:41:b2:10:e3:57",
            "net19": "9a:e1:1e:81:52:07",
            "net2": "12:28:0b:32:9b:d2",
            "net3": "8a:7d:b5:fb:c1:0f",
            "net4": "c2:40:aa:d4:38:a1",
            "net5": "2a:a7:6e:d6:5d:da",
            "net6": "aa:33:59:c7:b7:86",
            "net7": "72:9e:15:b0:61:96",
            "net8": "06:4b:6f:1e:b8:f7",
            "net9": "5e:c6:82:f6:eb:35"
        },
        "tof_1_2_1": {
            "net0": "0a:ad:e2:3c:1d:f2",
            "net1": "42:a2:4d:0e:95:12",
            "net10": "6e:68:0a:c6:e7:72",
            "net11": "36:15:da:17:52:5f",
            "net12": "3e:b0:00:9b:93:28",
            "net13": "76:08:45:c1:e0:bd",
            "net14": "46:b1:38:7c:4a:79",
            "net15": "d6:ed:05:9b:96:71",
            "net16": "0a:5d:25:0c:73:3e",
            "net17": "5e:2c:0e:02:ce:dd",
            "net18": "1e:22:21:62:93:5c",
            "net19": "62:52:a1:d0:9e:03",
            "net2": "16:f4:9d:76:76:38",
            "net3": "ce:82:14:1d:5b:9b",
            "net4": "fe:6d:6f:6d:e2:9b",
            "net5": "6e:8c:b0:ed:6a:16",
            "net6": "d2:2c:79:40:37:81",
            "net7": "1a:f2:a7:22:62:bd",
            "net8": "c2:78:b7:3a:c5:6f",
            "net9": "1e:d3:30:04:13:af"
        },
        "tof_1_2_10": {
            "net0": "fa:65:0f:49:15:cf",
            "net1": "fa:5a:2a:86:4e:f3",
            "net10": "ce:bf:a1:64:46:35",
            "net11": "5a:9e:2f:20:81:dd",
            "net12": "ea:f8:38:14:94:c2",
            "net13": "b2:10:76:7f:9f:33",
            "net14": "3a:bb:b8:d4:ac:32",
            "net15": "1e:bd:bc:26:24:ed",
            "net16": "6e:ce:fd:1b:f0:02",
            "net17": "56:4f:d5:c2:97:ac",
            "net18": "66:79:ba:12:c5:ed",
            "net19": "12:0d:61:b4:6f:48",
            "net2": "1a:91:67:0c:bf:60",
            "net3": "c6:e6:ee:0d:ab:31",
            "net4": "62:ba:7c:67:d7:42",
            "net5": "6e:af:bd:35:68:6b",
            "net6": "42:3e:2d:9c:4b:65",
            "net7": "fa:8c:a0:fc:cd:fb",
            "net8": "fa:70:ec:0f:51:e2",
            "net9": "be:57:93:69:1c:be"
        },
        "tof_1_2_2": {
            "net0": "fe:bc:e6:ae:82:4c",
            "net1": "2a:a7:66:e6:4d:85",
            "net10": "fa:db:e7:a2:40:a7",
            "net11": "96:1a:b1:8a:58:9b",
            "net12": "ea:1f:20:70:36:b0",
            "net13": "9a:3a:9d:69:79:51",
            "net14": "06:c0:f1:1e:c7:28",
            "net15": "36:95:29:2a:e6:40",
            "net16": "4a:ca:50:73:3c:1d",
            "net17": "02:ac:03:69:d0:a4",
            "net18": "a2:3d:f4:6d:73:d7",
            "net19": "0e:ab:81:3f:22:bd",
            "net2": "be:4b:02:51:64:ca",
            "net3": "be:76:03:e1:a4:8d",
            "net4": "2e:35:86:28:eb:aa",
            "net5": "12:b7:8e:0f:53:46",
            "net6": "5e:ac:3b:d1:b5:a3",
            "net7": "d2:4c:7c:5a:d9:41",
            "net8": "12:e6:f1:5f:a1:8a",
            "net9": "5a:35:50:cf:42:35"
        },
        "tof_1_2_3": {
            "net0": "3e:27:45:7c:86:05",
            "net1": "56:1b:84:cf:15:31",
            "net10": "3e:69:64:34:50:80",
            "net11": "3a:4b:a2:7a:92:91",
            "net12": "52:3b:b8:8a:49:c0",
            "net13": "ca:d5:44:fa:33:7f",
            "net14": "82:6f:7f:23:2f:2b",
            "net15": "ee:e6:6f:dd:45:8a",
            "net16": "1e:eb:2e:6a:4e:de",
            "net17": "16:11:d1:db:d8:fc",
            "net18": "22:d8:7f:45:6b:cc",
            "net19": "b6:1c:d9:0a:ab:82",
            "net2": "46:88:71:13:aa:ff",
            "net3": "ce:63:14:73:9e:ce",
            "net4": "ce:8e:40:4c:df:c2",
            "net5": "aa:65:db:e7:f9:57",
            "net6": "62:91:a7:10:01:f4",
            "net7": "ae:d0:54:a4:c0:2e",
            "net8": "06:0d:98:98:18:5d",
            "net9": "da:28:8b:aa:77:a2"
        },
        "tof_1_2_4": {
            "net0": "de:54:c1:f3:22:c3",
            "net1": "fa:3b:cc:d5:f6:f7",
            "net10": "da:66:25:5a:23:81",
            "net11": "8a:e3:c7:77:5d:c7",
            "net12": "c6:ed:e0:ec:53:f7",
            "net13": "5a:3b:ad:9c:6e:48",
            "net14": "be:84:1b:c7:3a:c0",
            "net15": "8e:c9:6e:05:6f:75",
            "net16": "b2:72:24:d6:24:ba",
            "net17": "c2:97:37:a5:2e:48",
            "net18": "b2:3b:7f:2d:6a:ca",
            "net19": "46:23:d3:ef:b4:ff",
            "net2": "9e:ef:88:ac:b7:10",
            "net3": "c6:ac:f9:aa:8d:e7",
            "net4": "0a:18:08:89:83:3e",
            "net5": "5e:50:73:54:91:7c",
            "net6": "de:a4:69:c1:62:fa",
            "net7": "f2:55:f8:f3:34:5f",
            "net8": "96:25:d3:eb:1e:6b",
            "net9": "ba:4b:e8:fc:40:ed"
        },
        "tof_1_2_5": {
            "net0": "9a:81:e7:3e:93:3e",
            "net1": "6a:b8:30:61:9c:45",
            "net10": "9a:b5:33:0c:83:34",
            "net11": "12:58:54:6c:02:31",
            "net12": "ba:7b:09:4d:ee:38",
            "net13": "da:19:8c:2b:87:03",
            "net14": "86:be:cd:c0:e7:03",
            "net15": "42:97:07:57:0c:54",
            "net16": "e6:a2:88:94:72:c8",
            "net17": "8a:e5:c2:9a:05:f8",
            "net18": "c6:f6:d8:18:11:ce",
            "net19": "8e:1a:bf:f2:d2:fc",
            "net2": "46:0d:b5:44:d9:11",
            "net3": "4a:08:39:a6:4b:c7",
            "net4": "5e:78:9e:38:bf:37",
            "net5": "fe:34:6e:47:b6:02",
            "net6": "02:a4:b8:6f:67:8f",
            "net7": "e6:7c:ae:3e:43:70",
            "net8": "ca:65:0b:cb:77:66",
            "net9": "36:71:ae:f9:32:a4"
        },
        "tof_1_2_6": {
            "net0": "e6:6f:f1:c6:de:44",
            "net1": "0a:a1:fd:7d:22:6b",
            "net10": "de:bb:c1:2a:f8:08",
            "net11": "fa:35:33:e7:b0:e8",
            "net12": "ae:8a:cc:ec:0c:84",
            "net13": "52:2e:5f:29:2f:61",
            "net14": "0a:85:ab:4d:b3:0e",
            "net15": "72:4b:b9:19:5b:98",
            "net16": "6a:fa:eb:7e:7e:05",
            "net17": "5a:5c:04:aa:7c:cc",
            "net18": "1e:6d:23:39:ec:b5",
            "net19": "92:cf:b6:a9:90:ff",
            "net2": "6e:dd:8c:ca:a6:51",
            "net3": "36:01:44:6b:7b:cd",
            "net4": "de:a1:9a:a2:02:6c",
            "net5": "b2:16:22:43:d7:77",
            "net6": "aa:0e:75:97:71:e6",
            "net7": "ba:26:2a:06:63:85",
            "net8": "1a:04:16:9b:f2:a8",
            "net9": "ea:ea:6e:51:a2:82"
        },
        "tof_1_2_7": {
            "net0": "a2:73:b6:7b:3b:ca",
            "net1": "0a:fc:2e:b2:2f:71",
            "net10": "e6:72:60:b2:f0:23",
            "net11": "66:62:45:79:91:eb",
            "net12": "ea:71:53:cc:bf:66",
            "net13": "1e:a8:e1:01:ba:f0",
            "net14": "9e:2b:96:61:eb:11",
            "net15": "a6:e9:e7:e0:a5:85",
            "net16": "16:33:f9:4a:bf:9f",
            "net17": "5e:91:59:5e:61:bd",
            "net18": "d6:d6:d2:fe:45:2c",
            "net19": "6e:ab:37:91:3b:56",
            "net2": "86:d8:e0:e5:c0:9a",
            "net3": "ae:b2:1c:ad:0f:c6",
            "net4": "16:c4:71:6d:b8:77",
            "net5": "8e:fd:db:19:3c:d4",
            "net6": "c6:69:1e:1f:6a:08",
            "net7": "5e:aa:44:90:ae:07",
            "net8": "f6:e3:50:73:11:84",
            "net9": "66:3a:a9:7b:92:e0"
        },
        "tof_1_2_8": {
            "net0": "d2:9f:a8:90:f4:d2",
            "net1": "5a:24:85:c8:d3:02",
            "net10": "9e:b1:0f:28:92:75",
            "net11": "de:b3:42:a6:cd:32",
            "net12": "16:9b:b9:cd:1c:46",
            "net13": "5e:5b:5d:f1:a0:28",
            "net14": "ee:f9:93:88:bc:5a",
            "net15": "ae:47:5f:2a:91:c1",
            "net16": "12:c6:fe:a2:06:25",
            "net17": "ba:d8:77:6f:b9:42",
            "net18": "2a:aa:12:a3:f3:bb",
            "net19": "82:c0:cd:df:4f:d4",
            "net2": "2e:40:c3:6b:68:86",
            "net3": "9a:1b:04:52:bf:34",
            "net4": "1a:1d:c6:75:37:21",
            "net5": "36:1f:52:61:e8:8b",
            "net6": "b6:08:34:ed:b6:9c",
            "net7": "9e:34:ad:2d:b5:df",
            "net8": "56:23:0d:50:ac:87",
            "net9": "ae:5e:ea:25:03:78"
        },
        "tof_1_2_9": {
            "net0": "e2:a2:9a:8a:01:02",
            "net1": "96:d8:31:f7:60:65",
            "net10": "12:16:8e:d7:29:f0",
            "net11": "b2:33:9f:5e:07:c4",
            "net12": "be:de:88:ed:4f:51",
            "net13": "ce:16:72:f2:75:da",
            "net14": "e2:82:41:f1:1b:f4",
            "net15": "02:d4:9d:1e:aa:2d",
            "net16": "16:ff:7e:c7:d1:3f",
            "net17": "9e:d1:1c:a7:00:18",
            "net18": "a6:28:fc:ce:fb:1b",
            "net19": "8e:00:c6:f4:e5:4d",
            "net2": "0e:08:12:ba:9d:bb",
            "net3": "26:61:5b:56:b8:66",
            "net4": "4a:44:f2:d7:b1:4a",
            "net5": "fe:b7:47:9a:f3:46",
            "net6": "02:ce:98:9b:2d:32",
            "net7": "4a:24:dc:9c:0f:38",
            "net8": "62:c1:b2:fa:41:3e",
            "net9": "82:23:8b:a5:fb:bb"
        },
        "tof_2_2_1": {
            "net0": "d6:6a:eb:60:d6:f4",
            "net1": "2a:7d:5b:4e:d1:fe",
            "net10": "8a:cc:e2:8d:3a:5c",
            "net11": "e6:10:d8:b7:da:b7",
            "net12": "86:51:08:71:c6:b7",
            "net13": "ae:01:29:2f:85:a4",
            "net14": "ce:4b:96:a7:bb:8f",
            "net15": "da:f5:0e:4e:85:fb",
            "net16": "9e:8f:3b:48:05:7f",
            "net17": "62:f1:c8:7b:38:13",
            "net18": "f6:d3:34:3c:9a:46",
            "net19": "ca:c0:41:62:0f:df",
            "net2": "92:d0:15:e2:57:22",
            "net3": "32:4f:07:b1:29:61",
            "net4": "aa:f9:22:42:b2:a6",
            "net5": "fa:c4:d9:f1:33:01",
            "net6": "6e:2b:2b:7c:2f:2b",
            "net7": "d6:df:b8:46:cd:de",
            "net8": "72:72:ea:92:d0:99",
            "net9": "56:83:80:5c:3a:10"
        },
        "tof_2_2_10": {
            "net0": "7a:19:82:86:59:0f",
            "net1": "0e:00:bb:68:2b:f5",
            "net10": "1e:70:34:41:89:23",
            "net11": "ee:30:ee:64:b9:6e",
            "net12": "9e:c8:c5:f8:75:5d",
            "net13": "36:d7:54:01:db:a6",
            "net14": "32:a1:7a:9d:f5:de",
            "net15": "2a:08:e7:c0:be:81",
            "net16": "52:f3:ef:c9:db:60",
            "net17": "da:a2:f0:ce:6e:69",
            "net18": "d2:8e:fa:d4:5f:22",
            "net19": "46:df:66:35:d2:88",
            "net2": "6a:15:ec:c4:4b:bc",
            "net3": "8a:bc:73:85:6a:b1",
            "net4": "b6:49:24:f1:62:47",
            "net5": "5e:b7:7b:b9:ac:c9",
            "net6": "f6:c0:2b:2f:1f:2c",
            "net7": "2a:0f:51:25:3d:15",
            "net8": "de:d0:29:c6:ca:9e",
            "net9": "26:a7:08:b6:4a:b4"
        },
        "tof_2_2_2": {
            "net0": "46:a0:63:93:83:d3",
            "net1": "52:bc:f5:03:91:69",
            "net10": "66:f4:83:27:44:83",
            "net11": "0e:7a:0b:47:5e:75",
            "net12": "5a:44:81:25:af:fc",
            "net13": "e2:1b:f5:db:ed:39",
            "net14": "9a:05:a8:94:d6:a6",
            "net15": "fe:10:67:31:0e:45",
            "net16": "46:be:3c:94:9d:6d",
            "net17": "d6:bd:24:69:7c:c7",
            "net18": "7e:b6:2a:77:aa:1d",
            "net19": "6a:60:c6:75:67:3e",
            "net2": "7a:69:61:9f:d4:65",
            "net3": "66:b4:a1:0e:b8:f7",
            "net4": "0a:4f:04:f5:55:21",
            "net5": "02:17:b9:87:28:db",
            "net6": "8a:e1:93:6d:15:5f",
            "net7": "ae:90:c0:23:1b:9e",
            "net8": "0e:99:fe:97:99:65",
            "net9": "86:e7:d2:34:a5:2c"
        },
        "tof_2_2_3": {
            "net0": "96:7a:25:4a:ca:85",
            "net1": "c6:52:8c:8a:d3:90",
            "net10": "3e:44:22:e0:b4:4e",
            "net11": "e6:23:cb:48:ed:7a",
            "net12": "e6:0c:05:71:8c:b3",
            "net13": "6e:d7:4f:8e:d6:fc",
            "net14": "92:07:cc:d1:9d:bc",
            "net15": "82:d6:15:52:cb:70",
            "net16": "2e:3f:c2:90:8f:a1",
            "net17": "b6:96:f5:2a:78:09",
            "net18": "d2:4a:0d:bd:8e:ae",
            "net19": "7a:45:5a:ea:49:58",
            "net2": "4a:59:9e:99:d2:a2",
            "net3": "e2:e4:c1:fe:c2:7b",
            "net4": "be:c2:e5:55:6d:0c",
            "net5": "02:d0:0a:f4:a7:b1",
            "net6": "c6:4f:27:e5:11:70",
            "net7": "2a:68:ed:1c:0b:83",
            "net8": "e2:6e:a4:c8:c4:3f",
            "net9": "4e:45:bf:dd:8a:62"
        },
        "tof_2_2_4": {
            "net0": "da:13:53:bc:e1:ff",
            "net1": "1a:e9:67:c6:fb:18",
            "net10": "26:62:ab:8c:65:0a",
            "net11": "7e:ae:69:cc:74:17",
            "net12": "1e:db:90:7a:39:82",
            "net13": "fe:72:c8:ac:66:b2",
            "net14": "f6:1e:c7:4a:3c:58",
            "net15": "fa:8b:5f:c1:ee:d5",
            "net16": "ae:e4:f0:63:dc:2a",
            "net17": "fa:59:ee:67:4d:7c",
            "net18": "46:24:24:48:28:81",
            "net19": "b2:39:0f:b7:35:31",
            "net2": "8e:fd:09:b2:9b:f5",
            "net3": "d2:39:e3:b2:0d:ef",
            "net4": "1a:c7:42:54:06:75",
            "net5": "0a:86:1b:bd:1e:1a",
            "net6": "16:a2:e2:3c:d4:f1",
            "net7": "16:3d:22:8c:44:32",
            "net8": "e6:81:6b:e0:ca:1b",
            "net9": "fe:fa:e5:22:09:8b"
        },
        "tof_2_2_5": {
            "net0": "5a:c9:ec:89:53:d6",
            "net1": "82:88:a1:f0:7d:1a",
            "net10": "62:e7:d7:89:bc:2a",
            "net11": "e2:2b:69:99:b8:39",
            "net12": "9e:3a:0f:f3:71:a3",
            "net13": "32:bc:4b:c7:5c:97",
            "net14": "de:09:a2:e3:fa:f1",
            "net15": "ce:11:74:bf:aa:cf",
            "net16": "22:0b:77:83:d9:67",
            "net17": "ba:20:ac:40:55:1b",
            "net18": "7e:3e:9c:53:d4:a2",
            "net19": "46:6d:dc:a4:0a:13",
            "net2": "9e:2c:5e:b0:ce:01",
            "net3": "b6:f4:0b:03:a4:f8",
            "net4": "5e:fe:78:67:52:f8",
            "net5": "f2:c2:bd:5e:3d:d1",
            "net6": "aa:c3:f1:e7:4c:da",
            "net7": "02:8e:b1:08:0e:16",
            "net8": "82:9b:aa:03:5f:98",
            "net9": "9e:6e:5b:7e:9d:b5"
        },
        "tof_2_2_6": {
            "net0": "86:c3:2b:a8:b1:71",
            "net1": "3a:1b:df:7b:14:e8",
            "net10": "a6:cd:fe:b8:10:27",
            "net11": "9e:00:38:7e:53:68",
            "net12": "b6:97:f2:a6:e4:e6",
            "net13": "92:fb:c1:74:91:13",
            "net14": "02:40:2f:24:68:5e",
            "net15": "5a:f5:4d:2e:b3:9d",
            "net16": "4a:b8:ba:30:99:7d",
            "net17": "a2:ac:9b:b8:f8:69",
            "net18": "e2:55:0a:6a:24:f2",
            "net19": "02:23:e3:b1:5e:ea",
            "net2": "9a:43:b4:58:fc:af",
            "net3": "c6:c8:28:01:88:e5",
            "net4": "a6:60:0e:23:92:35",
            "net5": "76:93:f1:88:29:3e",
            "net6": "96:d0:76:b9:3d:bb",
            "net7": "56:5d:5a:ed:36:4a",
            "net8": "8e:95:af:4c:ee:a4",
            "net9": "02:8f:ed:f1:1f:45"
        },
        "tof_2_2_7": {
            "net0": "42:cd:9a:fd:d1:db",
            "net1": "56:26:3e:d6:c6:b4",
            "net10": "d2:5a:77:4e:d9:f5",
            "net11": "1e:f5:17:55:9a:43",
            "net12": "d6:a5:64:6c:10:1e",
            "net13": "9a:70:0e:48:e8:e7",
            "net14": "ce:25:34:51:f3:87",
            "net15": "fe:5d:e9:e4:60:7a",
            "net16": "52:3d:2f:8d:ad:23",
            "net17": "fa:eb:1e:46:b3:29",
            "net18": "76:38:01:e9:94:72",
            "net19": "3e:90:11:a6:07:af",
            "net2": "3e:df:06:aa:d2:1a",
            "net3": "8a:c5:70:9b:bf:7f",
            "net4": "06:ec:8c:93:32:fe",
            "net5": "76:76:d0:52:15:b5",
            "net6": "66:67:55:9e:be:38",
            "net7": "2e:05:99:2e:67:94",
            "net8": "de:55:47:01:69:43",
            "net9": "fa:ea:41:fa:51:bb"
        },
        "tof_2_2_8": {
            "net0": "86:40:bf:66:90:c7",
            "net1": "0a:0c:38:36:6c:4f",
            "net10": "da:36:90:9a:ae:11",
            "net11": "06:d5:55:e2:b4:61",
            "net12": "66:0e:55:ea:de:20",
            "net13": "b6:95:36:a9:09:f3",
            "net14": "36:fb:cf:d3:af:b4",
            "net15": "a6:ce:6c:25:31:0b",
            "net16": "02:7a:ac:f3:da:d7",
            "net17": "0e:bb:ff:f9:a0:6e",
            "net18": "d6:95:41:0f:ed:3e",
            "net19": "3e:0b:a2:19:5b:60",
            "net2": "8e:6b:48:e4:3c:d5",
            "net3": "42:35:1e:27:36:18",
            "net4": "ee:fb:1d:c2:6e:8a",
            "net5": "de:1a:01:84:74:48",
            "net6": "f6:eb:1a:95:63:e4",
            "net7": "02:5f:0e:d7:2b:7c",
            "net8": "fe:5c:c7:4e:c5:cc",
            "net9": "06:1d:8a:34:66:7d"
        },
        "tof_2_2_9": {
            "net0": "32:d6:ed:60:2d:4d",
            "net1": "42:4c:50:25:e8:7e",
            "net10": "b6:6f:cd:93:f9:77",
            "net11": "e6:ec:8e:47:f1:78",
            "net12": "ea:7f:b8:28:7b:ea",
            "net13": "56:3f:ea:18:03:c3",
            "net14": "5a:e3:7d:ff:ca:96",
            "net15": "f6:7a:0d:64:0f:64",
            "net16": "86:64:3b:58:3e:fd",
            "net17": "aa:71:46:88:32:ea",
            "net18": "a6:f8:d4:16:12:86",
            "net19": "ca:83:c0:a4:cb:67",
            "net2": "ce:4a:cf:bb:30:54",
            "net3": "0e:a6:a2:15:9a:7f",
            "net4": "aa:aa:1b:97:ac:f0",
            "net5": "ce:88:1d:12:2f:64",
            "net6": "3e:7d:d4:99:64:66",
            "net7": "12:8e:a0:82:da:a7",
            "net8": "b2:95:18:72:c9:44",
            "net9": "e2:3b:bf:73:4b:6d"
        }
    },
    "failed_machine": "tof_1_2_1",
    "failure_time": 1614502887.425898,
    "recover_time": 1614503175.7719796
}