{
    "k_leaf": 12,
    "k_top": 12,
    "redundancy_factor": 12,
    "is_k8s": true,
    "machine_mac_addresses": {
        "leaf_1_0_1": {
            "net0": "46:aa:e1:13:65:bb",
            "net1": "0e:b4:d0:72:b0:f0",
            "net10": "9a:ca:2b:8a:c2:b5",
            "net11": "f2:4e:81:fa:8a:75",
            "net12": "ee:31:0e:c7:71:87",
            "net2": "a6:de:77:fb:e2:5e",
            "net3": "4e:20:ff:3b:23:1a",
            "net4": "82:49:f5:d0:54:42",
            "net5": "22:b5:26:4e:4e:18",
            "net6": "32:bb:09:77:c8:f2",
            "net7": "9e:4c:09:cf:5e:55",
            "net8": "66:42:8c:bc:69:51",
            "net9": "5e:4c:3c:f2:2f:0b"
        },
        "leaf_1_0_10": {
            "net0": "6e:01:0d:7b:c0:28",
            "net1": "d6:81:d4:c5:7e:2b",
            "net10": "b2:78:1f:b6:0e:5b",
            "net11": "72:0a:83:1f:26:8b",
            "net12": "5a:4c:15:d2:cf:64",
            "net2": "5a:65:54:be:69:41",
            "net3": "36:85:35:8c:c3:7b",
            "net4": "2e:37:70:cd:0d:06",
            "net5": "32:5c:52:83:08:f5",
            "net6": "9a:36:c6:3a:f1:d8",
            "net7": "be:4e:da:90:6e:94",
            "net8": "02:a0:60:3f:2a:46",
            "net9": "3a:06:0a:ac:e5:8f"
        },
        "leaf_1_0_11": {
            "net0": "26:4d:7c:b5:7f:10",
            "net1": "c6:a2:72:7d:fa:6e",
            "net10": "b6:8a:f3:a1:38:3c",
            "net11": "fe:ef:8a:a8:7a:a9",
            "net12": "4e:b5:34:4c:92:9a",
            "net2": "de:07:f5:af:a6:af",
            "net3": "6a:41:d9:17:99:fc",
            "net4": "62:41:fa:0a:01:b0",
            "net5": "7e:8e:c9:ef:6c:ef",
            "net6": "1e:c2:07:46:c4:be",
            "net7": "ba:3c:23:90:c5:8b",
            "net8": "aa:18:64:58:ec:b7",
            "net9": "02:ba:d4:d7:ff:15"
        },
        "leaf_1_0_12": {
            "net0": "8e:a3:08:12:ff:5d",
            "net1": "46:d4:c8:4a:d7:fd",
            "net10": "ee:11:72:25:70:89",
            "net11": "9e:71:9d:da:0e:4f",
            "net12": "52:65:f3:eb:ed:ce",
            "net2": "2e:bf:c4:a3:c6:a7",
            "net3": "f6:19:b5:53:0b:6d",
            "net4": "ca:d1:a6:ac:0e:5f",
            "net5": "ce:12:68:1a:00:17",
            "net6": "b6:c2:ea:e0:c6:b8",
            "net7": "96:12:ba:99:6c:6c",
            "net8": "3a:95:5d:b7:dd:9d",
            "net9": "1a:6a:fa:1f:e0:aa"
        },
        "leaf_1_0_2": {
            "net0": "de:6a:70:20:25:21",
            "net1": "7a:e0:a0:09:c2:57",
            "net10": "2e:d0:c2:a4:8c:10",
            "net11": "e6:e5:36:94:46:e4",
            "net12": "b2:27:4c:a5:7b:7b",
            "net2": "d6:79:f0:20:4f:c9",
            "net3": "be:c9:26:ae:86:ad",
            "net4": "a2:e9:64:1b:e1:95",
            "net5": "9a:a1:09:bb:08:1b",
            "net6": "f2:27:a4:6d:c8:da",
            "net7": "da:0d:6b:cb:3f:f8",
            "net8": "02:6d:18:51:bb:ed",
            "net9": "a6:7e:75:bc:c7:ac"
        },
        "leaf_1_0_3": {
            "net0": "2a:96:37:00:db:52",
            "net1": "be:84:9e:8c:c3:7c",
            "net10": "e6:6c:74:d5:f5:f7",
            "net11": "52:61:fd:72:f8:69",
            "net12": "4e:a4:f4:e5:05:99",
            "net2": "62:84:73:2d:f8:55",
            "net3": "16:80:9d:0d:81:4f",
            "net4": "a6:46:03:f5:bd:d5",
            "net5": "b6:6e:0f:40:f9:ec",
            "net6": "b2:9b:f9:b7:f8:ec",
            "net7": "1e:ea:71:06:d0:4e",
            "net8": "96:e7:58:ec:df:a8",
            "net9": "d6:0d:de:c4:6b:ac"
        },
        "leaf_1_0_4": {
            "net0": "ca:c3:62:36:6a:60",
            "net1": "4e:a6:da:64:d4:81",
            "net10": "1a:72:7b:2c:28:d3",
            "net11": "ea:cf:32:9a:21:5f",
            "net12": "12:e8:68:ad:f8:31",
            "net2": "ba:37:e4:45:f3:33",
            "net3": "d6:10:99:d2:6e:e5",
            "net4": "9e:44:82:cf:8a:2f",
            "net5": "1a:05:26:f2:8d:d6",
            "net6": "9e:e7:53:47:5d:1e",
            "net7": "ba:3e:24:f4:86:07",
            "net8": "ae:0b:51:fc:7d:6f",
            "net9": "b2:25:92:f4:b4:6e"
        },
        "leaf_1_0_5": {
            "net0": "1a:52:fb:47:3d:11",
            "net1": "66:3f:99:90:d1:00",
            "net10": "fe:ce:bc:c7:c9:c5",
            "net11": "62:79:fe:1d:2e:64",
            "net12": "5a:bf:7e:5e:0e:14",
            "net2": "6e:1c:1a:b6:0f:d1",
            "net3": "f6:7a:08:01:ae:fd",
            "net4": "46:ef:0a:36:86:c2",
            "net5": "92:5c:82:47:07:88",
            "net6": "de:d4:3e:4e:92:19",
            "net7": "e2:c6:d1:34:89:f1",
            "net8": "ae:90:3e:bb:69:de",
            "net9": "52:c2:9b:c9:91:ba"
        },
        "leaf_1_0_6": {
            "net0": "72:e8:8d:95:2e:00",
            "net1": "9a:43:f2:2e:01:80",
            "net10": "02:e0:78:28:fa:c0",
            "net11": "ba:d4:0a:88:90:f5",
            "net12": "86:22:a0:09:e4:11",
            "net2": "7e:a9:5c:e4:fb:c1",
            "net3": "6e:4b:b2:c6:9a:e6",
            "net4": "02:17:dc:2a:e1:25",
            "net5": "9e:c0:16:3c:98:8f",
            "net6": "2a:8d:23:70:78:8a",
            "net7": "c2:d5:3d:63:73:37",
            "net8": "9e:fc:11:ac:53:25",
            "net9": "b6:4c:8c:f8:ed:b3"
        },
        "leaf_1_0_7": {
            "net0": "4e:d8:e8:b7:9e:97",
            "net1": "8a:3d:f9:d1:24:fc",
            "net10": "ba:e7:0e:64:a8:92",
            "net11": "fe:90:cf:77:03:8f",
            "net12": "6a:f7:2b:5b:0a:e1",
            "net2": "1e:ab:4a:20:c2:11",
            "net3": "a6:f6:69:50:2b:65",
            "net4": "06:33:77:cb:01:75",
            "net5": "52:10:97:1c:07:35",
            "net6": "0a:c8:de:4f:b7:da",
            "net7": "6a:21:08:da:f7:89",
            "net8": "2e:d3:68:91:b9:16",
            "net9": "36:9d:7b:b7:89:0c"
        },
        "leaf_1_0_8": {
            "net0": "ae:a7:56:cf:c7:55",
            "net1": "de:d9:29:f0:c2:dc",
            "net10": "d2:63:10:48:21:58",
            "net11": "3a:11:1a:f8:e4:d0",
            "net12": "a2:e6:58:5c:61:23",
            "net2": "62:92:c3:cd:67:49",
            "net3": "ca:d7:1d:09:c9:9e",
            "net4": "56:b9:14:41:19:ab",
            "net5": "2e:51:24:27:75:e3",
            "net6": "4a:83:ed:14:76:ad",
            "net7": "de:9b:55:cb:9b:10",
            "net8": "0e:03:2a:8a:98:7d",
            "net9": "c6:0a:c7:41:e7:fd"
        },
        "leaf_1_0_9": {
            "net0": "42:9c:0c:77:b0:74",
            "net1": "b2:88:65:2d:ea:84",
            "net10": "d6:9a:0c:ac:8f:db",
            "net11": "36:1e:1f:7e:dd:2a",
            "net12": "72:1c:64:d2:2f:c2",
            "net2": "ea:9b:7c:ff:40:58",
            "net3": "76:fc:e4:c2:a5:25",
            "net4": "a6:26:7c:95:f0:48",
            "net5": "f2:cb:66:a5:f1:bb",
            "net6": "72:6a:e5:c6:6a:18",
            "net7": "6a:df:30:a7:96:1b",
            "net8": "72:0d:21:68:f4:e5",
            "net9": "1e:37:8c:83:ab:06"
        },
        "leaf_2_0_1": {
            "net0": "c2:e0:c3:67:1c:be",
            "net1": "e2:c1:47:3d:3c:f1",
            "net10": "9e:3f:2d:a1:a6:ea",
            "net11": "b2:b4:40:41:64:94",
            "net12": "e2:42:28:e9:ab:ee",
            "net2": "1e:e8:fe:06:e3:d5",
            "net3": "c6:de:e2:f1:9a:10",
            "net4": "ca:33:b8:58:b8:64",
            "net5": "ae:29:d4:1f:7c:ce",
            "net6": "e2:ec:32:0e:c2:5f",
            "net7": "9a:12:0b:a7:89:4f",
            "net8": "aa:c6:09:64:dc:04",
            "net9": "3a:66:69:59:67:62"
        },
        "leaf_2_0_10": {
            "net0": "fe:88:66:46:68:12",
            "net1": "8a:c3:0f:36:76:44",
            "net10": "8e:14:1f:87:cd:a8",
            "net11": "fa:6c:0a:c5:8a:34",
            "net12": "06:e8:28:5b:fd:fc",
            "net2": "62:ca:46:66:ce:33",
            "net3": "8a:98:15:ef:3d:f9",
            "net4": "2e:27:e3:13:7b:85",
            "net5": "ce:de:77:c2:95:b9",
            "net6": "06:98:de:a9:b2:c6",
            "net7": "7e:64:3c:43:26:1c",
            "net8": "ee:07:e4:72:3a:d3",
            "net9": "9a:d6:87:ab:4a:22"
        },
        "leaf_2_0_11": {
            "net0": "9e:e2:cc:df:df:d2",
            "net1": "ba:d0:71:6d:de:16",
            "net10": "b6:02:46:2f:1f:f7",
            "net11": "c2:a0:64:72:0a:2c",
            "net12": "0a:27:4b:92:75:0e",
            "net2": "ca:46:84:09:b2:4f",
            "net3": "6e:c2:87:f3:c5:13",
            "net4": "a6:67:b8:6d:5b:08",
            "net5": "f2:36:96:2a:68:f5",
            "net6": "02:8f:a7:c0:d8:22",
            "net7": "ba:ca:69:23:f2:26",
            "net8": "c2:cb:70:97:34:eb",
            "net9": "f2:1d:2b:77:7b:53"
        },
        "leaf_2_0_12": {
            "net0": "66:87:c4:62:5f:f7",
            "net1": "2e:29:ac:d3:05:9f",
            "net10": "de:c3:08:cd:03:e6",
            "net11": "a2:78:64:b9:3c:5a",
            "net12": "e2:e0:a6:1d:60:31",
            "net2": "ae:5f:2b:90:d5:1a",
            "net3": "4a:69:19:d2:b1:4e",
            "net4": "12:3b:b9:aa:11:2f",
            "net5": "22:8c:d4:83:33:92",
            "net6": "1a:f8:53:c7:46:18",
            "net7": "ba:19:c8:b0:eb:b2",
            "net8": "1e:99:d1:83:cd:03",
            "net9": "e2:6d:2b:e0:99:01"
        },
        "leaf_2_0_2": {
            "net0": "b2:c1:dd:3c:50:ac",
            "net1": "8a:2d:44:9a:de:95",
            "net10": "da:32:dd:94:b1:ab",
            "net11": "8a:03:05:f4:02:77",
            "net12": "c2:d4:ab:07:14:8f",
            "net2": "9e:37:5d:27:2b:99",
            "net3": "fe:ea:a5:1b:4d:e9",
            "net4": "82:30:35:a1:ff:af",
            "net5": "5e:07:51:80:28:52",
            "net6": "e2:4d:a5:0e:14:a6",
            "net7": "fa:8d:16:a7:1f:a7",
            "net8": "ea:c9:11:4c:42:00",
            "net9": "5e:2a:aa:33:b8:c7"
        },
        "leaf_2_0_3": {
            "net0": "4e:6e:be:fb:94:8b",
            "net1": "de:c8:90:89:f0:65",
            "net10": "f6:c6:89:ae:49:16",
            "net11": "fe:e8:c4:68:3b:1e",
            "net12": "86:f9:a1:54:5e:56",
            "net2": "a6:94:d6:a0:0e:09",
            "net3": "86:67:2a:1f:9f:0a",
            "net4": "d2:47:5e:9a:d3:3b",
            "net5": "a2:9e:5a:6c:e0:61",
            "net6": "b2:a1:49:f2:87:dc",
            "net7": "8a:6f:3e:49:92:31",
            "net8": "02:65:06:b8:ca:dc",
            "net9": "22:3f:70:1f:89:86"
        },
        "leaf_2_0_4": {
            "net0": "22:ce:ee:d6:7c:74",
            "net1": "aa:31:ee:b3:47:f4",
            "net10": "76:99:1e:4f:23:45",
            "net11": "12:e4:d5:c2:eb:22",
            "net12": "a2:af:a6:af:ed:34",
            "net2": "da:12:15:d5:a6:be",
            "net3": "c6:ca:50:5a:64:35",
            "net4": "82:c6:04:fe:61:fd",
            "net5": "72:7c:06:88:f8:e0",
            "net6": "ee:81:0e:f3:02:4f",
            "net7": "2a:2b:3a:81:1e:61",
            "net8": "c2:76:66:b3:9f:f7",
            "net9": "22:bb:21:f9:7c:9b"
        },
        "leaf_2_0_5": {
            "net0": "be:1c:93:98:68:b0",
            "net1": "a6:74:18:c5:a7:3b",
            "net10": "c2:2f:fa:cc:12:27",
            "net11": "8a:e7:b9:6a:f9:6a",
            "net12": "06:e2:14:95:c8:52",
            "net2": "66:71:09:bb:ad:86",
            "net3": "46:1e:85:b7:01:24",
            "net4": "b6:c1:b1:83:40:7f",
            "net5": "d6:2d:7c:6b:35:be",
            "net6": "42:b3:ed:7f:21:3d",
            "net7": "82:d3:76:06:ad:41",
            "net8": "3a:89:39:74:6c:02",
            "net9": "2e:c4:88:a1:3f:70"
        },
        "leaf_2_0_6": {
            "net0": "86:da:d5:7b:5b:20",
            "net1": "fe:e6:b1:26:60:dd",
            "net10": "92:03:ff:0d:c5:37",
            "net11": "92:99:20:47:10:90",
            "net12": "3e:d0:62:78:dc:b1",
            "net2": "32:ed:3a:1a:2f:a9",
            "net3": "ee:64:56:81:e1:3c",
            "net4": "9a:00:4f:25:9c:6b",
            "net5": "36:0f:56:91:f0:da",
            "net6": "aa:2b:eb:2f:8f:c8",
            "net7": "ba:bd:ee:5f:30:35",
            "net8": "42:7f:1d:30:ae:72",
            "net9": "9e:a5:17:95:35:f0"
        },
        "leaf_2_0_7": {
            "net0": "e2:c1:2c:2e:7e:e8",
            "net1": "e6:da:ac:cb:c9:61",
            "net10": "82:24:51:d4:1a:75",
            "net11": "4a:db:52:96:76:27",
            "net12": "9e:5b:8e:9f:f9:f2",
            "net2": "a6:03:69:a5:d0:e4",
            "net3": "c2:da:45:f8:06:2d",
            "net4": "86:ec:fe:fa:91:1c",
            "net5": "d6:45:64:5b:ca:81",
            "net6": "86:48:45:fa:2d:97",
            "net7": "46:f5:e6:7f:9d:44",
            "net8": "ae:fe:83:d2:6b:99",
            "net9": "5a:c0:b0:e5:66:c1"
        },
        "leaf_2_0_8": {
            "net0": "62:fd:60:5b:ac:3d",
            "net1": "66:2e:f5:0c:92:9c",
            "net10": "62:e5:f7:78:5a:1f",
            "net11": "da:92:d7:4e:60:95",
            "net12": "e2:a8:20:d2:85:cb",
            "net2": "7e:0f:49:27:c6:02",
            "net3": "e2:8c:57:00:7f:24",
            "net4": "52:6f:fa:84:47:02",
            "net5": "ba:fa:a5:1f:4c:e1",
            "net6": "f2:af:56:6d:5a:53",
            "net7": "9a:f7:e0:31:64:fe",
            "net8": "4e:c7:2d:6c:88:52",
            "net9": "72:f1:cf:dc:8f:ff"
        },
        "leaf_2_0_9": {
            "net0": "42:75:30:6f:f3:22",
            "net1": "8e:4f:5a:c9:15:b1",
            "net10": "4a:6e:5d:4e:14:b3",
            "net11": "36:87:8f:99:48:d4",
            "net12": "8a:f7:a4:29:ed:1f",
            "net2": "c2:67:bb:12:8d:23",
            "net3": "2a:9c:f5:30:c2:9d",
            "net4": "42:79:0e:54:54:5d",
            "net5": "52:63:a9:c5:b0:d4",
            "net6": "92:25:30:03:41:eb",
            "net7": "c2:07:23:c1:20:f8",
            "net8": "f2:81:02:44:ed:02",
            "net9": "c6:65:26:ad:fd:2b"
        },
        "spine_1_1_1": {
            "net0": "ee:17:e5:e4:e5:51",
            "net1": "0a:d3:48:a2:25:33",
            "net10": "96:a9:4f:1c:11:f2",
            "net11": "b6:b7:0d:0b:7e:dc",
            "net12": "96:94:e0:28:c5:b3",
            "net13": "66:a0:20:e5:e7:cc",
            "net14": "de:40:64:97:fb:98",
            "net15": "e2:8b:53:90:b0:0d",
            "net16": "ae:d1:dc:63:a3:8c",
            "net17": "1a:29:d2:0e:4d:45",
            "net18": "1a:cd:c1:0c:e0:ad",
            "net19": "fa:17:af:15:61:50",
            "net2": "72:9b:74:1b:a7:d7",
            "net20": "f2:fb:87:0a:f1:69",
            "net21": "fe:aa:16:ea:7e:c9",
            "net22": "c2:da:8b:f2:dd:bd",
            "net23": "46:c0:2a:05:6c:0f",
            "net3": "72:6b:38:5e:ab:18",
            "net4": "f2:70:6f:8e:2b:00",
            "net5": "d2:0d:48:2a:50:1e",
            "net6": "f6:9a:c2:b8:7f:e2",
            "net7": "c2:00:fb:5d:ce:78",
            "net8": "d2:5e:ac:81:93:c0",
            "net9": "82:e6:15:6d:b8:44"
        },
        "spine_1_1_10": {
            "net0": "8a:78:86:bc:02:5b",
            "net1": "ba:03:3c:49:e3:d0",
            "net10": "b2:5c:93:77:20:dc",
            "net11": "86:d0:35:38:b9:6a",
            "net12": "36:27:19:3b:b2:a1",
            "net13": "fe:16:97:9e:d9:e0",
            "net14": "b6:93:5f:34:48:a3",
            "net15": "ba:ef:66:df:0f:6c",
            "net16": "7e:ac:e3:e5:5c:e6",
            "net17": "6e:f6:48:45:5d:72",
            "net18": "6e:28:3a:a8:b8:60",
            "net19": "ea:41:ba:6b:12:43",
            "net2": "d2:75:f7:03:58:07",
            "net20": "e2:92:38:e1:74:1a",
            "net21": "fa:34:e4:20:47:f0",
            "net22": "66:c3:20:1a:07:d5",
            "net23": "fe:d5:fd:a6:a5:f8",
            "net3": "12:3a:09:ff:8c:64",
            "net4": "6a:93:fd:dd:7d:30",
            "net5": "da:6c:68:5b:a3:0f",
            "net6": "7e:39:5e:6d:25:89",
            "net7": "b6:6b:44:e3:ea:7a",
            "net8": "46:0c:0b:4b:ae:a3",
            "net9": "82:88:a7:84:d8:4c"
        },
        "spine_1_1_11": {
            "net0": "62:47:cb:fa:d8:91",
            "net1": "d2:66:2d:83:40:33",
            "net10": "42:29:a4:ab:be:4a",
            "net11": "3a:f4:03:73:39:5f",
            "net12": "9a:b1:ae:43:50:53",
            "net13": "ca:64:30:df:90:20",
            "net14": "ae:81:94:9d:86:34",
            "net15": "be:3c:44:15:00:20",
            "net16": "a2:7c:d7:bf:c8:db",
            "net17": "4a:c2:c5:3d:15:37",
            "net18": "e6:f5:45:0f:a1:bd",
            "net19": "86:d1:87:ba:68:fb",
            "net2": "de:69:04:4c:ec:11",
            "net20": "56:95:bb:97:59:ab",
            "net21": "32:86:dc:00:ea:3a",
            "net22": "7e:a2:22:25:c1:43",
            "net23": "9a:9b:25:67:12:8e",
            "net3": "26:e0:82:4c:95:09",
            "net4": "52:44:1e:8c:7c:dc",
            "net5": "5e:32:aa:04:02:ba",
            "net6": "c2:65:e9:d2:8b:b7",
            "net7": "92:bc:a0:0f:2e:ff",
            "net8": "7e:c1:1b:b6:80:b2",
            "net9": "76:60:10:a6:2c:9d"
        },
        "spine_1_1_12": {
            "net0": "36:aa:7a:91:47:c1",
            "net1": "52:55:08:15:6f:25",
            "net10": "02:35:6f:4e:c4:3b",
            "net11": "42:77:2a:de:42:28",
            "net12": "ce:e5:26:ec:51:88",
            "net13": "9a:63:38:57:4b:2c",
            "net14": "22:34:42:d9:f8:7b",
            "net15": "e2:30:ff:b9:6d:d9",
            "net16": "42:a6:05:0e:a9:34",
            "net17": "f2:91:a2:0c:6d:21",
            "net18": "66:46:31:00:34:48",
            "net19": "b6:80:04:bc:30:23",
            "net2": "72:8c:94:7e:5d:dc",
            "net20": "3a:32:53:96:96:0d",
            "net21": "66:33:88:f4:57:34",
            "net22": "2a:dd:51:1f:6a:36",
            "net23": "aa:47:17:d5:61:21",
            "net3": "7a:38:e0:96:4b:cd",
            "net4": "b6:62:80:4e:16:db",
            "net5": "be:d1:54:52:27:3a",
            "net6": "6a:7c:ca:3a:10:15",
            "net7": "62:2c:08:70:24:bd",
            "net8": "c6:51:3e:86:b9:a2",
            "net9": "36:98:5f:89:a0:81"
        },
        "spine_1_1_2": {
            "net0": "b6:a3:ea:6b:1d:48",
            "net1": "e6:7a:7d:46:58:1a",
            "net10": "92:4d:2f:b7:10:20",
            "net11": "66:eb:bf:50:fe:ea",
            "net12": "7a:9c:5a:f8:59:be",
            "net13": "be:04:35:a2:fc:a2",
            "net14": "5a:72:e8:66:ef:18",
            "net15": "b2:66:6c:ca:5e:ff",
            "net16": "ee:4e:60:0d:9d:22",
            "net17": "6e:f5:eb:b9:07:02",
            "net18": "1a:98:6f:37:aa:24",
            "net19": "16:70:4c:60:12:0c",
            "net2": "12:4b:70:c4:61:11",
            "net20": "e2:40:dc:bf:29:15",
            "net21": "6e:fe:4c:72:ef:10",
            "net22": "7a:a2:4e:ab:89:d0",
            "net23": "66:60:47:ae:31:5b",
            "net3": "f6:28:da:96:d2:92",
            "net4": "d2:20:2a:fd:9f:84",
            "net5": "12:67:ca:df:3e:1d",
            "net6": "ca:b8:e3:21:a7:44",
            "net7": "3a:76:87:b4:2b:79",
            "net8": "1e:af:4e:a9:2c:89",
            "net9": "66:36:31:de:34:70"
        },
        "spine_1_1_3": {
            "net0": "9e:92:7c:77:18:79",
            "net1": "0e:4d:15:51:87:ef",
            "net10": "0a:0c:ab:52:51:07",
            "net11": "1a:26:02:96:86:b3",
            "net12": "2e:e9:6f:74:1b:3b",
            "net13": "8e:0a:87:85:fb:1f",
            "net14": "56:2c:e4:53:09:3f",
            "net15": "66:9b:e9:6a:8f:48",
            "net16": "86:02:b8:74:ab:4e",
            "net17": "ce:dc:2d:9d:ab:28",
            "net18": "a2:e5:a5:ab:00:5f",
            "net19": "de:38:f7:9d:5a:c4",
            "net2": "1a:d7:f0:b8:27:51",
            "net20": "a6:a7:f7:66:5d:fc",
            "net21": "32:ea:aa:a9:45:3d",
            "net22": "86:71:67:b8:43:e4",
            "net23": "fe:0c:70:cc:cb:61",
            "net3": "be:dd:f6:bf:ea:fd",
            "net4": "8e:23:ac:09:da:30",
            "net5": "5e:41:31:2d:0e:de",
            "net6": "3e:ab:3f:97:9f:b2",
            "net7": "16:84:70:3f:c3:45",
            "net8": "ee:d1:b3:d0:3f:32",
            "net9": "c2:ba:b4:23:8f:28"
        },
        "spine_1_1_4": {
            "net0": "16:99:fd:f8:23:bb",
            "net1": "ce:38:d9:a6:19:14",
            "net10": "c2:44:5f:2e:68:fa",
            "net11": "8a:3d:f1:1b:ab:78",
            "net12": "8e:bf:e5:29:5b:9c",
            "net13": "2e:34:5a:59:0d:17",
            "net14": "5e:78:a0:10:a1:84",
            "net15": "ea:1f:8d:28:68:36",
            "net16": "ea:25:85:3b:61:1a",
            "net17": "ea:dc:d4:c0:af:f3",
            "net18": "86:8f:81:c8:0c:00",
            "net19": "66:0f:36:9c:75:0c",
            "net2": "da:9c:20:90:fb:a8",
            "net20": "aa:cf:26:c7:25:8e",
            "net21": "1a:ae:19:e7:fd:59",
            "net22": "7a:b0:5b:79:f5:3f",
            "net23": "82:58:86:08:ee:8a",
            "net3": "0e:c3:70:de:80:95",
            "net4": "3e:b3:fa:28:74:b8",
            "net5": "8a:85:6e:62:b7:ba",
            "net6": "4a:e6:50:39:43:80",
            "net7": "56:13:3d:51:dc:db",
            "net8": "fa:40:dc:10:4c:bf",
            "net9": "ce:09:bb:f0:11:5e"
        },
        "spine_1_1_5": {
            "net0": "0a:72:69:e1:8b:5c",
            "net1": "d6:c4:ac:09:29:1c",
            "net10": "1e:1f:c5:8a:90:bb",
            "net11": "06:8d:a0:d6:f2:c1",
            "net12": "c6:92:49:cd:e4:01",
            "net13": "26:da:9e:08:7a:d9",
            "net14": "a6:44:08:0e:b6:52",
            "net15": "f2:bc:32:7a:68:76",
            "net16": "56:dc:1c:be:2f:64",
            "net17": "fe:37:42:af:17:f4",
            "net18": "fe:c3:cc:30:1f:26",
            "net19": "b2:be:4a:c5:51:4c",
            "net2": "3a:5e:7e:a9:98:93",
            "net20": "ea:ab:dd:c5:a3:6b",
            "net21": "82:a9:20:4c:66:48",
            "net22": "c2:db:db:fe:33:90",
            "net23": "92:2d:ec:5a:8a:aa",
            "net3": "9e:c6:6e:6a:e0:dd",
            "net4": "ba:20:57:0b:bc:35",
            "net5": "fa:ba:1e:31:30:8f",
            "net6": "f6:92:3a:f0:40:9f",
            "net7": "ba:7d:7d:71:fa:60",
            "net8": "f2:ea:e9:5e:cc:fa",
            "net9": "26:02:68:d8:c2:c3"
        },
        "spine_1_1_6": {
            "net0": "32:95:56:ed:1a:9e",
            "net1": "32:b8:02:66:df:6e",
            "net10": "ae:15:df:ef:a0:4a",
            "net11": "7e:41:aa:11:d4:35",
            "net12": "46:15:79:ba:29:43",
            "net13": "06:0e:07:31:84:bc",
            "net14": "3a:21:59:78:28:84",
            "net15": "fe:07:37:17:38:e2",
            "net16": "fa:4d:88:7c:8a:fe",
            "net17": "4a:63:b1:4c:cd:ce",
            "net18": "26:85:08:e5:50:77",
            "net19": "fa:22:69:72:56:77",
            "net2": "be:56:e1:bc:17:05",
            "net20": "9e:64:4f:d3:b1:73",
            "net21": "e6:1f:d4:23:4b:16",
            "net22": "5e:d8:d8:fd:05:06",
            "net23": "16:47:20:b2:93:94",
            "net3": "9a:e0:c3:de:92:04",
            "net4": "96:b1:e9:10:d2:87",
            "net5": "a6:c4:c3:53:fe:87",
            "net6": "8e:97:5f:ce:bf:a0",
            "net7": "82:57:1d:ca:82:45",
            "net8": "22:87:4c:a2:9a:e8",
            "net9": "26:78:8f:68:a2:5d"
        },
        "spine_1_1_7": {
            "net0": "76:9b:a7:fa:e3:63",
            "net1": "c2:7d:c5:e8:04:22",
            "net10": "ce:26:d3:29:c3:53",
            "net11": "e6:1e:61:bb:2f:be",
            "net12": "66:95:ff:2d:42:e5",
            "net13": "a2:7a:f6:97:e9:b0",
            "net14": "d2:d5:01:63:79:ed",
            "net15": "e2:59:1b:9c:3a:c4",
            "net16": "be:93:08:fa:69:ac",
            "net17": "9a:6a:99:9e:b1:9a",
            "net18": "3e:a2:de:56:3c:6c",
            "net19": "e6:38:b7:48:cd:ce",
            "net2": "86:d7:d6:63:92:7a",
            "net20": "16:e3:6a:66:31:b7",
            "net21": "82:70:f7:ed:76:84",
            "net22": "8a:5b:d2:9e:c1:ff",
            "net23": "e6:f7:8d:94:80:62",
            "net3": "f2:73:fc:71:2d:82",
            "net4": "b2:9d:6d:99:38:d5",
            "net5": "36:d6:7a:49:17:e8",
            "net6": "42:fd:41:23:52:ce",
            "net7": "8e:9c:95:ca:c9:e4",
            "net8": "de:c8:0f:f5:17:e1",
            "net9": "a2:81:b7:19:4e:3d"
        },
        "spine_1_1_8": {
            "net0": "4a:97:d9:b3:d3:a4",
            "net1": "52:9a:5a:22:f7:0d",
            "net10": "5a:2b:58:ed:9b:d0",
            "net11": "02:f0:ba:00:d1:10",
            "net12": "5e:7d:3e:f6:4f:91",
            "net13": "c6:6b:bc:d4:2a:ba",
            "net14": "52:0d:17:ee:77:52",
            "net15": "06:78:47:f8:72:2c",
            "net16": "2e:6f:d3:32:96:99",
            "net17": "22:36:0a:7d:ac:07",
            "net18": "2e:81:9d:51:0c:33",
            "net19": "72:cb:29:6c:47:38",
            "net2": "f6:5c:9a:54:98:47",
            "net20": "5e:5a:8f:40:2f:fc",
            "net21": "1a:31:4d:37:d0:58",
            "net22": "5a:6e:b5:5d:83:f5",
            "net23": "e6:c1:7a:55:13:58",
            "net3": "ea:2c:6e:17:53:1e",
            "net4": "f6:73:2f:b4:b8:63",
            "net5": "de:32:f9:a0:ab:07",
            "net6": "8a:6f:ef:f3:11:dd",
            "net7": "36:4e:a4:0d:e6:5e",
            "net8": "c2:a0:f1:a1:b5:f3",
            "net9": "be:37:9e:32:e6:f9"
        },
        "spine_1_1_9": {
            "net0": "6e:c6:e8:cf:ac:51",
            "net1": "aa:99:66:8e:58:7b",
            "net10": "e2:dd:75:06:4e:e2",
            "net11": "ae:b8:0d:04:25:4c",
            "net12": "32:27:27:59:c5:74",
            "net13": "4e:04:e9:ae:04:c4",
            "net14": "7a:97:9f:84:4e:89",
            "net15": "ea:1f:8c:cd:15:35",
            "net16": "ce:6e:9c:f5:9f:83",
            "net17": "26:fb:dc:51:43:71",
            "net18": "8a:f9:30:7e:b0:81",
            "net19": "6e:72:46:cf:d4:9b",
            "net2": "b6:9f:4d:49:24:dd",
            "net20": "a2:d2:04:d2:89:ec",
            "net21": "ca:ef:ed:3a:28:76",
            "net22": "fe:a0:0b:55:91:b3",
            "net23": "82:43:9a:46:31:0a",
            "net3": "d6:8e:23:b6:5c:eb",
            "net4": "86:e1:28:cb:45:cb",
            "net5": "06:9d:68:43:76:e6",
            "net6": "66:d7:50:9f:56:7d",
            "net7": "d2:91:ac:fe:29:7f",
            "net8": "72:a1:12:dd:eb:43",
            "net9": "26:bc:2c:63:f4:77"
        },
        "spine_2_1_1": {
            "net0": "36:03:5d:dc:2e:a5",
            "net1": "c2:aa:26:6c:9d:3e",
            "net10": "aa:28:1e:dc:42:d9",
            "net11": "c6:de:7f:64:11:93",
            "net12": "ea:97:a1:68:e3:a7",
            "net13": "92:8b:c2:df:d1:90",
            "net14": "aa:61:05:d2:94:62",
            "net15": "62:b0:60:5c:db:85",
            "net16": "a6:71:28:ef:16:43",
            "net17": "96:01:79:33:15:cb",
            "net18": "fe:37:66:6e:67:a3",
            "net19": "1a:de:fb:7e:e3:2d",
            "net2": "ea:27:aa:f4:4d:73",
            "net20": "fa:f5:3a:55:62:e9",
            "net21": "ce:31:53:b5:18:80",
            "net22": "f6:51:35:bd:d1:9f",
            "net23": "d6:63:23:77:b4:81",
            "net3": "ca:ae:6f:ce:45:5b",
            "net4": "82:07:48:49:d8:ba",
            "net5": "62:17:dd:e6:b4:76",
            "net6": "d2:aa:00:f9:c9:96",
            "net7": "b6:63:27:72:f3:65",
            "net8": "a6:7a:37:b2:2d:5b",
            "net9": "6e:9a:4f:4e:6b:3c"
        },
        "spine_2_1_10": {
            "net0": "96:79:c7:28:ef:a7",
            "net1": "4e:db:7f:d4:ab:55",
            "net10": "a2:cf:16:a0:2d:5e",
            "net11": "42:73:40:3e:b7:3f",
            "net12": "ae:60:01:46:74:36",
            "net13": "ba:b2:86:68:c5:23",
            "net14": "5a:b2:d1:14:dc:fb",
            "net15": "02:78:a4:7c:ac:6f",
            "net16": "ca:02:40:47:20:a1",
            "net17": "92:a9:a1:e9:70:41",
            "net18": "32:3f:29:73:dd:83",
            "net19": "ea:75:55:6a:2c:f5",
            "net2": "fa:7c:e5:c2:c8:e2",
            "net20": "3a:b8:b1:d9:dd:99",
            "net21": "26:ad:9c:c4:b6:3e",
            "net22": "e2:b7:73:0a:d4:d7",
            "net23": "e2:e5:23:f8:f0:28",
            "net3": "a2:e7:bb:7b:72:95",
            "net4": "d6:b9:08:8b:85:54",
            "net5": "2a:e0:eb:2d:5a:44",
            "net6": "6e:fb:59:b2:f6:68",
            "net7": "3a:6d:8e:5a:c1:82",
            "net8": "3a:c5:b8:a3:86:07",
            "net9": "ea:86:29:f4:0d:e6"
        },
        "spine_2_1_11": {
            "net0": "d2:6d:96:7e:fb:00",
            "net1": "be:b1:ea:9e:fe:04",
            "net10": "72:50:aa:1e:75:98",
            "net11": "ce:52:f1:33:45:e2",
            "net12": "8e:50:52:13:b5:08",
            "net13": "1a:54:21:f4:3b:53",
            "net14": "e6:af:50:6e:08:c1",
            "net15": "0a:ba:52:a9:f2:d5",
            "net16": "b6:88:50:65:df:8d",
            "net17": "22:47:96:91:4e:e3",
            "net18": "1a:7c:bc:a2:00:46",
            "net19": "2a:15:9b:79:35:76",
            "net2": "12:fc:6f:44:17:6a",
            "net20": "ce:25:07:a7:d4:ff",
            "net21": "d2:4a:25:4e:7c:6a",
            "net22": "ca:be:f2:4b:d4:94",
            "net23": "be:a4:4e:ad:6d:4f",
            "net3": "b2:2a:5f:58:f2:0e",
            "net4": "9e:1f:96:27:9a:05",
            "net5": "4e:cf:c7:39:28:e4",
            "net6": "ea:05:b0:0f:0b:96",
            "net7": "de:a8:f4:a4:58:47",
            "net8": "42:03:85:1e:30:7e",
            "net9": "7e:e7:93:cb:10:f9"
        },
        "spine_2_1_12": {
            "net0": "3a:f2:55:aa:df:1f",
            "net1": "4e:c2:66:2a:c3:62",
            "net10": "ae:dc:e6:8d:07:1c",
            "net11": "02:6f:5f:a8:c1:44",
            "net12": "ee:1b:e8:d0:df:63",
            "net13": "82:43:0e:1f:0e:e7",
            "net14": "de:e3:11:10:84:13",
            "net15": "26:74:0b:47:b9:1f",
            "net16": "26:58:ea:ae:10:4a",
            "net17": "46:bb:3c:b3:85:56",
            "net18": "8e:7f:71:dd:f9:9a",
            "net19": "92:be:10:1b:f9:d1",
            "net2": "da:4e:7f:94:a7:87",
            "net20": "4e:a1:76:e2:f5:c2",
            "net21": "9e:8f:6a:e5:ff:16",
            "net22": "3a:5f:da:8e:8a:7a",
            "net23": "2e:1b:2b:b7:b2:24",
            "net3": "32:c1:1c:5c:57:43",
            "net4": "12:9c:55:95:dc:73",
            "net5": "9a:73:c7:e8:1d:27",
            "net6": "06:6e:0d:14:de:32",
            "net7": "b2:31:4b:4c:e4:65",
            "net8": "0a:1c:11:9b:37:09",
            "net9": "2a:c6:de:ab:4b:d8"
        },
        "spine_2_1_2": {
            "net0": "96:a5:ed:ee:f0:e6",
            "net1": "1e:3a:19:80:b8:89",
            "net10": "d2:77:73:7a:76:7c",
            "net11": "fe:75:69:a8:e2:63",
            "net12": "86:4f:05:09:14:a4",
            "net13": "7e:e7:00:1d:56:be",
            "net14": "8e:d7:a3:fc:86:fd",
            "net15": "6a:ae:e1:75:4c:56",
            "net16": "4a:29:0a:d2:11:b7",
            "net17": "56:b5:40:08:3f:50",
            "net18": "ca:27:72:91:fe:81",
            "net19": "02:bb:6f:32:10:8a",
            "net2": "c2:ae:29:74:fe:6c",
            "net20": "c6:f6:35:c2:1c:cc",
            "net21": "da:f6:9a:eb:f9:af",
            "net22": "0e:40:91:c2:db:58",
            "net23": "86:39:f9:27:8f:63",
            "net3": "d2:41:29:d5:d1:87",
            "net4": "fa:3a:a1:d2:fb:eb",
            "net5": "02:3e:d8:3d:b8:68",
            "net6": "8a:3c:9d:d3:43:46",
            "net7": "ee:8e:7a:0a:11:27",
            "net8": "56:4a:b3:6b:3d:f6",
            "net9": "4e:59:61:0c:aa:c0"
        },
        "spine_2_1_3": {
            "net0": "92:5e:22:88:bc:be",
            "net1": "ca:d2:e0:51:67:61",
            "net10": "d6:24:a1:88:3d:35",
            "net11": "02:84:4b:2b:42:e9",
            "net12": "4e:91:6e:3e:71:8a",
            "net13": "1e:80:9f:59:37:bc",
            "net14": "6a:61:4f:36:4e:4d",
            "net15": "d6:e0:1a:41:a5:d8",
            "net16": "f6:11:c0:2c:15:d9",
            "net17": "0a:2f:ed:77:e3:44",
            "net18": "1e:bd:74:7d:3b:a7",
            "net19": "5a:ce:3b:82:20:e9",
            "net2": "9a:52:d3:85:11:08",
            "net20": "06:7e:1c:6a:04:e1",
            "net21": "9a:7c:11:c6:9b:42",
            "net22": "e6:ff:14:5d:7e:e1",
            "net23": "c6:95:a9:c9:58:65",
            "net3": "72:27:e4:54:35:a2",
            "net4": "1a:2c:a7:39:95:4a",
            "net5": "8a:fc:51:d6:db:ff",
            "net6": "d6:e5:9d:2e:f1:1e",
            "net7": "f6:1d:8e:28:76:da",
            "net8": "22:30:5c:89:92:51",
            "net9": "f6:f0:60:be:2c:e2"
        },
        "spine_2_1_4": {
            "net0": "c6:58:e4:88:2d:ca",
            "net1": "8e:ef:d0:ee:4c:4b",
            "net10": "7a:9a:34:37:62:66",
            "net11": "26:f5:2f:5d:f6:1b",
            "net12": "32:9a:9f:d5:1d:1c",
            "net13": "ea:c7:94:af:b9:d7",
            "net14": "fe:3b:e1:64:86:47",
            "net15": "a2:bf:77:ce:5b:c3",
            "net16": "ca:67:7b:2f:9c:f4",
            "net17": "4a:82:51:60:8a:ed",
            "net18": "6e:11:f0:69:b0:71",
            "net19": "1a:9b:02:ea:88:cc",
            "net2": "c6:1a:30:a8:d3:40",
            "net20": "46:a0:ce:8f:13:fd",
            "net21": "f6:4f:b7:22:ea:8f",
            "net22": "46:d7:40:3a:f7:42",
            "net23": "76:27:ee:c6:fe:2d",
            "net3": "12:ef:93:a4:56:51",
            "net4": "16:84:ea:dd:24:d0",
            "net5": "a6:aa:47:da:c4:e0",
            "net6": "ca:92:75:63:00:8c",
            "net7": "a6:41:24:c1:27:70",
            "net8": "fa:73:18:cd:1d:cc",
            "net9": "86:8b:b2:77:89:8c"
        },
        "spine_2_1_5": {
            "net0": "52:3e:3d:08:89:79",
            "net1": "02:99:76:00:0c:34",
            "net10": "de:40:09:b2:0a:db",
            "net11": "92:7e:d5:89:a7:9d",
            "net12": "3e:7c:8a:3a:c4:69",
            "net13": "96:55:da:5d:d2:b5",
            "net14": "62:75:6b:c5:7e:b2",
            "net15": "ea:a1:e5:78:db:ac",
            "net16": "6e:50:0d:5c:3c:8b",
            "net17": "6e:f7:37:fb:8e:b2",
            "net18": "d2:82:af:74:98:ad",
            "net19": "da:d8:99:1d:c7:9b",
            "net2": "9a:49:c9:3a:dc:78",
            "net20": "3e:da:43:7a:c4:ee",
            "net21": "ba:31:41:1c:07:c3",
            "net22": "fa:b2:0f:6c:6f:fa",
            "net23": "ca:61:06:14:ae:e9",
            "net3": "72:95:b5:5b:cd:3e",
            "net4": "2e:77:ce:f7:f3:f7",
            "net5": "5a:58:2c:13:2f:60",
            "net6": "ba:a9:a0:0e:ff:67",
            "net7": "42:43:0f:d1:e1:c0",
            "net8": "d6:61:f2:0b:ef:ce",
            "net9": "fa:3d:19:82:c8:71"
        },
        "spine_2_1_6": {
            "net0": "9e:8f:8e:20:30:30",
            "net1": "9a:6e:32:8f:75:06",
            "net10": "8a:58:93:64:53:76",
            "net11": "92:f3:88:e6:29:49",
            "net12": "b2:f1:c2:e2:f0:25",
            "net13": "d6:62:0a:d0:0b:95",
            "net14": "76:3b:32:7b:b8:a6",
            "net15": "fe:16:91:6e:ee:b0",
            "net16": "0a:97:49:4c:4d:9f",
            "net17": "ba:90:9c:61:61:20",
            "net18": "a6:7b:dc:ed:85:f4",
            "net19": "0a:46:5a:0b:c7:e3",
            "net2": "92:e7:fa:cc:11:a9",
            "net20": "b2:50:f4:81:60:41",
            "net21": "ea:eb:c0:76:d1:03",
            "net22": "da:56:b0:c0:38:eb",
            "net23": "32:4c:b7:89:ae:2d",
            "net3": "12:2b:8f:16:cf:c1",
            "net4": "26:7a:0f:88:d6:c0",
            "net5": "ba:8e:07:01:2d:84",
            "net6": "92:c5:77:35:c6:00",
            "net7": "32:28:9a:8a:e9:78",
            "net8": "c6:e4:66:19:35:c3",
            "net9": "86:de:38:44:47:3a"
        },
        "spine_2_1_7": {
            "net0": "b6:f7:90:b1:a9:73",
            "net1": "06:8b:e1:06:6b:95",
            "net10": "02:11:a8:63:a2:c0",
            "net11": "76:c0:eb:77:7a:0d",
            "net12": "1e:de:66:c6:fc:60",
            "net13": "ca:69:58:aa:99:69",
            "net14": "c2:2f:27:6b:a8:ae",
            "net15": "ae:a9:6f:da:e3:c5",
            "net16": "22:c1:21:aa:69:c4",
            "net17": "e6:46:ff:04:e6:98",
            "net18": "6a:85:39:5b:11:8c",
            "net19": "86:d3:56:ea:29:78",
            "net2": "2a:7e:4a:2f:f3:59",
            "net20": "8e:8f:8e:c4:19:ee",
            "net21": "9a:6f:2a:a9:c5:de",
            "net22": "a6:11:1a:4a:8c:8e",
            "net23": "76:e5:8d:bb:42:03",
            "net3": "72:51:73:d2:b7:53",
            "net4": "3a:a1:ff:46:20:b7",
            "net5": "9e:73:71:58:19:de",
            "net6": "9a:77:ac:50:e6:9f",
            "net7": "1e:70:0c:89:d5:c7",
            "net8": "26:f1:e1:7d:33:07",
            "net9": "32:fe:96:57:0c:71"
        },
        "spine_2_1_8": {
            "net0": "2a:8b:08:f1:66:69",
            "net1": "02:26:b8:f1:f5:c9",
            "net10": "16:52:4b:c0:06:c7",
            "net11": "52:14:27:c1:14:b9",
            "net12": "52:e4:2e:10:1d:59",
            "net13": "be:70:5a:f4:58:d9",
            "net14": "3e:86:68:e9:bf:df",
            "net15": "9a:fa:16:6b:49:c7",
            "net16": "ba:a1:c0:cb:7e:94",
            "net17": "aa:c1:66:87:71:52",
            "net18": "de:d9:6c:d5:d1:5d",
            "net19": "be:e3:7a:e6:d7:f6",
            "net2": "2a:41:99:bb:84:88",
            "net20": "2a:60:2f:f4:8e:1c",
            "net21": "f6:fd:bd:45:c8:04",
            "net22": "ba:4c:e6:89:f1:88",
            "net23": "da:2a:ca:56:5e:88",
            "net3": "52:0f:e2:97:1d:44",
            "net4": "e6:0a:0f:d8:c4:a2",
            "net5": "b6:13:86:49:c0:bd",
            "net6": "f2:90:49:30:45:96",
            "net7": "b2:4d:ec:81:e0:2b",
            "net8": "ee:52:9d:8a:ee:ba",
            "net9": "96:fc:f0:4a:1e:4a"
        },
        "spine_2_1_9": {
            "net0": "1e:b6:d1:50:e3:20",
            "net1": "be:b1:e4:c5:23:95",
            "net10": "f6:4d:df:4d:de:7a",
            "net11": "1a:e4:bb:32:97:5d",
            "net12": "42:8a:52:21:ea:a2",
            "net13": "7a:dc:62:c8:8e:18",
            "net14": "3a:68:fd:7c:e4:07",
            "net15": "6a:5d:d0:f7:33:ba",
            "net16": "92:d0:c3:c5:a9:0c",
            "net17": "06:17:f1:00:0e:2a",
            "net18": "6e:b5:d7:58:0a:78",
            "net19": "86:7a:30:a5:ee:a1",
            "net2": "5a:53:8c:67:ae:af",
            "net20": "ee:f6:ba:09:5f:eb",
            "net21": "42:9f:b6:3f:c3:c0",
            "net22": "ba:30:c0:e3:c9:5b",
            "net23": "32:78:d1:80:58:6c",
            "net3": "22:48:95:ae:d5:81",
            "net4": "06:26:ea:3f:fc:96",
            "net5": "d2:3f:49:74:ef:71",
            "net6": "fa:41:34:a6:4b:75",
            "net7": "76:f3:35:e4:b5:2c",
            "net8": "76:91:13:0b:14:1f",
            "net9": "5e:65:58:74:78:36"
        },
        "tof_1_2_1": {
            "net0": "82:d5:bd:b9:62:9f",
            "net1": "ca:69:48:ad:17:cb",
            "net10": "c6:42:6e:91:1c:d7",
            "net11": "fe:1e:42:4d:c1:a7",
            "net12": "66:21:bf:92:90:91",
            "net13": "6e:87:92:15:dc:71",
            "net14": "4e:7f:bf:8d:3b:3d",
            "net15": "2e:e1:ea:15:7b:be",
            "net16": "e6:92:4a:68:50:39",
            "net17": "56:45:d8:f9:a4:ee",
            "net18": "d6:04:53:36:1a:c7",
            "net19": "2e:d3:8a:ef:c3:7a",
            "net2": "96:a6:58:6d:ea:83",
            "net20": "da:f4:75:b8:18:09",
            "net21": "66:b1:73:a6:d2:9a",
            "net22": "02:b3:32:93:7d:07",
            "net23": "46:91:4d:ab:d4:22",
            "net3": "7a:d7:eb:f3:a7:be",
            "net4": "4e:c8:a3:4b:02:8e",
            "net5": "9a:e3:4a:8b:09:4a",
            "net6": "6e:d6:e3:dd:49:41",
            "net7": "06:44:67:72:42:37",
            "net8": "82:97:6c:73:ec:b9",
            "net9": "16:aa:48:56:74:92"
        },
        "tof_1_2_10": {
            "net0": "56:65:5f:bf:03:81",
            "net1": "26:48:e5:a3:a5:21",
            "net10": "02:c4:3a:95:05:f5",
            "net11": "8a:95:7d:19:9c:fe",
            "net12": "72:9b:6f:2c:f1:a9",
            "net13": "6e:8f:d9:80:49:59",
            "net14": "f2:c7:e9:63:0b:e6",
            "net15": "6a:d5:0f:33:1b:5c",
            "net16": "0a:1a:a1:0f:7c:26",
            "net17": "3e:13:91:eb:02:4c",
            "net18": "6e:3e:a9:92:50:3a",
            "net19": "1a:b5:ec:87:d4:f3",
            "net2": "be:f7:8c:d1:e0:66",
            "net20": "6a:34:e2:8e:c0:39",
            "net21": "ba:48:7e:52:7b:89",
            "net22": "f2:36:11:cd:2e:dd",
            "net23": "a2:e1:ca:8d:94:52",
            "net3": "a2:2e:8f:a0:34:d3",
            "net4": "d6:b1:27:e6:1e:61",
            "net5": "ea:f0:d7:3d:d9:e5",
            "net6": "be:b0:19:e7:f2:7f",
            "net7": "6e:18:f2:14:8d:33",
            "net8": "9e:e2:88:82:20:56",
            "net9": "16:4e:3d:3b:4f:27"
        },
        "tof_1_2_11": {
            "net0": "5e:a3:65:70:ff:07",
            "net1": "16:91:3b:fb:86:c0",
            "net10": "e2:d2:88:c0:a4:01",
            "net11": "fe:a2:60:de:54:c1",
            "net12": "0e:68:ab:be:60:70",
            "net13": "ce:8e:07:b3:1a:7e",
            "net14": "72:b5:20:2f:45:a6",
            "net15": "be:cc:4d:a9:69:60",
            "net16": "da:d8:10:0e:b9:69",
            "net17": "16:e8:38:54:03:f7",
            "net18": "ca:37:43:12:e2:c5",
            "net19": "0e:a9:91:81:49:bf",
            "net2": "66:31:40:63:97:cb",
            "net20": "e2:5d:93:6a:cb:79",
            "net21": "d2:a4:95:8f:5c:64",
            "net22": "e2:d7:2b:8e:d2:9c",
            "net23": "26:21:1e:6f:1c:13",
            "net3": "86:32:c1:cf:ad:66",
            "net4": "be:f1:d4:e4:d2:7e",
            "net5": "6a:ba:df:e3:b7:00",
            "net6": "12:cf:0f:c5:a2:3e",
            "net7": "ce:a7:33:7d:f1:8d",
            "net8": "be:ff:34:b0:17:c6",
            "net9": "22:2a:9e:57:e7:28"
        },
        "tof_1_2_12": {
            "net0": "d2:ef:92:a2:1a:3e",
            "net1": "da:aa:72:b1:d6:e6",
            "net10": "c2:28:2d:8e:2d:17",
            "net11": "82:ce:1c:89:b2:90",
            "net12": "66:65:ea:42:23:3e",
            "net13": "06:65:c9:d0:03:9a",
            "net14": "22:fd:17:f7:a8:44",
            "net15": "4a:e9:2a:d5:23:f3",
            "net16": "0e:34:7f:e6:1c:40",
            "net17": "de:1c:0c:1a:ec:f7",
            "net18": "0a:83:46:53:31:b7",
            "net19": "96:d2:27:8f:60:1f",
            "net2": "96:37:fd:6f:99:bf",
            "net20": "9a:83:09:67:c2:a8",
            "net21": "ee:cc:51:c6:d5:94",
            "net22": "9e:3e:69:33:7c:21",
            "net23": "a6:08:0f:2a:66:83",
            "net3": "c2:27:ed:af:86:51",
            "net4": "d6:25:04:0b:68:1b",
            "net5": "96:dc:71:db:25:90",
            "net6": "06:c9:cb:b3:56:c6",
            "net7": "6a:a6:af:93:4b:e8",
            "net8": "d2:8a:b8:a3:d3:2b",
            "net9": "fe:50:e7:51:2c:62"
        },
        "tof_1_2_2": {
            "net0": "0e:a7:9b:8b:51:0e",
            "net1": "d6:8a:85:31:9f:01",
            "net10": "3a:28:07:cf:52:ee",
            "net11": "c2:63:36:aa:19:f2",
            "net12": "0e:2e:67:6b:fa:30",
            "net13": "d6:1f:a5:d7:c2:d4",
            "net14": "72:c0:de:74:ce:5c",
            "net15": "1a:66:b0:6f:ae:f8",
            "net16": "76:eb:11:29:90:a2",
            "net17": "62:e5:85:12:4c:f9",
            "net18": "ea:c7:13:60:2c:86",
            "net19": "e2:b0:c9:c6:e1:0f",
            "net2": "e6:ec:a5:fa:5d:20",
            "net20": "8e:0b:1f:09:ad:00",
            "net21": "86:34:d9:ae:fc:46",
            "net22": "ae:98:31:86:fb:71",
            "net23": "72:b9:f7:35:45:ae",
            "net3": "0a:38:1c:38:20:35",
            "net4": "d6:a6:b9:e4:ef:35",
            "net5": "66:fc:c9:31:10:78",
            "net6": "22:f3:f8:1b:f7:c9",
            "net7": "1e:e8:ef:7b:3d:75",
            "net8": "e6:50:db:eb:eb:ac",
            "net9": "fe:19:36:93:2b:cc"
        },
        "tof_1_2_3": {
            "net0": "f6:cc:4b:c8:8c:3b",
            "net1": "86:8a:fd:3e:54:00",
            "net10": "5e:78:47:aa:d1:0b",
            "net11": "fa:9d:34:5f:fa:82",
            "net12": "c6:81:4e:1a:ef:9a",
            "net13": "5a:a3:ae:6b:0e:07",
            "net14": "82:54:93:bb:2e:65",
            "net15": "0e:c2:52:89:87:dc",
            "net16": "5e:5a:ec:52:85:c6",
            "net17": "56:82:38:77:10:92",
            "net18": "d6:7f:1a:5f:09:ac",
            "net19": "de:51:9e:cc:ea:4e",
            "net2": "76:5e:be:b3:54:a8",
            "net20": "72:8a:17:ff:7b:b1",
            "net21": "12:96:64:c9:eb:23",
            "net22": "86:28:9b:84:f4:9d",
            "net23": "da:e5:79:d5:ab:30",
            "net3": "1a:ab:0b:ed:99:ce",
            "net4": "8e:04:6c:bd:c6:78",
            "net5": "6e:fb:e5:6c:76:5d",
            "net6": "86:8d:36:06:14:81",
            "net7": "fa:52:65:0e:63:59",
            "net8": "96:1e:45:5c:7c:75",
            "net9": "fa:de:d3:82:a5:91"
        },
        "tof_1_2_4": {
            "net0": "66:5e:4b:4c:7c:38",
            "net1": "fe:4d:b7:61:a1:6a",
            "net10": "a6:ea:5c:6b:39:ee",
            "net11": "02:b6:9c:ec:5e:1f",
            "net12": "3a:7f:84:32:6a:7b",
            "net13": "2a:88:ca:db:09:dd",
            "net14": "82:13:d7:c9:9d:10",
            "net15": "c2:44:81:8a:bf:ba",
            "net16": "82:5f:fe:dd:e1:9c",
            "net17": "5a:c7:8e:a2:51:9d",
            "net18": "7e:ee:77:84:33:8d",
            "net19": "ae:e1:22:3d:45:90",
            "net2": "52:61:87:08:d2:00",
            "net20": "5a:8e:cc:d9:dd:96",
            "net21": "a2:a6:29:d1:2a:21",
            "net22": "3a:f7:b4:50:80:f1",
            "net23": "16:dc:06:9f:f1:05",
            "net3": "ca:9a:63:b2:87:a1",
            "net4": "02:6c:03:0d:9f:4f",
            "net5": "02:e4:73:2b:ff:ac",
            "net6": "f2:50:15:00:11:7d",
            "net7": "e6:eb:ae:31:64:09",
            "net8": "aa:20:95:07:e2:5b",
            "net9": "1e:e0:24:a6:4d:6a"
        },
        "tof_1_2_5": {
            "net0": "4a:53:19:7d:f5:9f",
            "net1": "d6:6b:3c:1f:a2:48",
            "net10": "86:70:c0:7c:6e:75",
            "net11": "16:65:1a:3a:4f:aa",
            "net12": "22:5c:05:32:36:45",
            "net13": "96:ba:f5:54:28:71",
            "net14": "66:d0:4a:1e:b6:74",
            "net15": "e2:d3:db:bb:3f:20",
            "net16": "1e:c9:e2:9d:1e:18",
            "net17": "92:a9:d4:28:d0:b2",
            "net18": "9a:6f:91:d9:bd:14",
            "net19": "22:b2:f9:8e:9f:0d",
            "net2": "12:4d:d8:04:ba:c2",
            "net20": "0e:a5:cf:22:7e:b8",
            "net21": "2a:29:75:ef:08:06",
            "net22": "52:3c:39:cd:00:90",
            "net23": "b6:97:20:24:35:1b",
            "net3": "c6:95:06:85:6d:ee",
            "net4": "4a:57:63:89:12:58",
            "net5": "de:4e:f0:3a:b3:5e",
            "net6": "76:1b:7f:b3:c8:8e",
            "net7": "3e:1e:dd:1d:7c:17",
            "net8": "ca:bd:de:ea:41:ce",
            "net9": "de:c4:eb:7d:64:98"
        },
        "tof_1_2_6": {
            "net0": "a6:29:70:2f:2d:56",
            "net1": "06:39:f9:13:80:92",
            "net10": "52:7c:36:56:60:87",
            "net11": "c6:96:b4:d7:66:08",
            "net12": "42:b9:36:3e:f9:d6",
            "net13": "92:00:4f:ea:e6:68",
            "net14": "b6:ea:1d:31:7e:6c",
            "net15": "2e:5c:d0:ad:5d:25",
            "net16": "92:2b:90:f7:05:8d",
            "net17": "62:22:99:52:f6:2c",
            "net18": "b2:fa:14:9e:57:6b",
            "net19": "be:53:cf:b7:7d:9e",
            "net2": "26:47:11:60:e9:e8",
            "net20": "de:08:fc:94:7c:8a",
            "net21": "26:ea:47:db:56:d0",
            "net22": "92:0e:78:22:70:3a",
            "net23": "da:3d:b5:88:b0:92",
            "net3": "d6:16:ad:c0:38:67",
            "net4": "d6:e7:b6:09:0f:ba",
            "net5": "06:0d:89:54:3c:85",
            "net6": "4e:1f:06:01:8c:51",
            "net7": "be:e0:79:b9:a0:25",
            "net8": "7a:b5:3c:8b:5d:e9",
            "net9": "d6:13:c5:45:ac:3e"
        },
        "tof_1_2_7": {
            "net0": "3e:3c:7f:01:b7:92",
            "net1": "6e:e2:a9:c4:4e:e7",
            "net10": "aa:f1:40:ce:ae:32",
            "net11": "ae:b2:9d:e5:a0:f7",
            "net12": "4e:00:8b:dd:df:28",
            "net13": "7e:da:28:d9:e3:30",
            "net14": "82:06:cd:1a:b0:17",
            "net15": "ee:6f:57:1d:9c:05",
            "net16": "b6:1f:6f:13:bf:23",
            "net17": "72:79:6f:3b:62:08",
            "net18": "aa:2a:9c:a4:6d:03",
            "net19": "22:25:dc:f2:9f:3a",
            "net2": "1a:3a:64:b1:17:b7",
            "net20": "ee:84:27:b0:75:3b",
            "net21": "2a:36:33:42:af:e8",
            "net22": "0a:54:77:0f:3f:3d",
            "net23": "ae:2b:ec:23:28:b8",
            "net3": "92:a5:00:44:ee:9c",
            "net4": "a6:fd:83:c4:b1:77",
            "net5": "b6:04:07:78:4c:70",
            "net6": "ae:b1:44:5f:c6:70",
            "net7": "42:b6:f6:db:80:d9",
            "net8": "fa:2d:bd:8c:bc:2c",
            "net9": "86:58:31:bc:36:2c"
        },
        "tof_1_2_8": {
            "net0": "8a:9c:66:0e:3c:8c",
            "net1": "4a:02:0d:43:e2:8a",
            "net10": "ea:cd:fa:bb:f0:33",
            "net11": "fe:3c:5f:e7:c6:37",
            "net12": "da:98:7b:b1:0f:c3",
            "net13": "6a:35:a5:2c:4a:e2",
            "net14": "ba:e1:a7:bf:0f:86",
            "net15": "e6:7b:b8:e1:bf:22",
            "net16": "0e:d1:a4:e9:fa:66",
            "net17": "4e:ef:81:cd:36:9c",
            "net18": "12:7c:43:5a:98:f3",
            "net19": "3e:8a:84:45:2b:24",
            "net2": "c2:a5:56:14:a1:4f",
            "net20": "82:de:89:8c:4d:06",
            "net21": "12:26:76:aa:f6:ac",
            "net22": "92:ef:94:f0:a4:fa",
            "net23": "9a:3a:fd:d2:e9:8d",
            "net3": "0a:c7:7d:59:7a:50",
            "net4": "a6:b2:ab:78:6d:f7",
            "net5": "5e:e6:50:27:43:de",
            "net6": "f6:03:38:8a:4a:38",
            "net7": "c6:2b:aa:a7:5a:dd",
            "net8": "a2:ce:2b:a0:4e:89",
            "net9": "46:aa:eb:51:62:d6"
        },
        "tof_1_2_9": {
            "net0": "76:cc:96:a1:aa:d6",
            "net1": "2a:e4:7f:90:7b:13",
            "net10": "de:ee:22:a1:4a:63",
            "net11": "de:92:89:e5:48:56",
            "net12": "2e:63:96:90:a0:9d",
            "net13": "fa:96:f7:ba:80:fa",
            "net14": "2a:b8:d5:2e:76:06",
            "net15": "ce:96:99:30:2b:cb",
            "net16": "9e:9c:91:c2:37:4b",
            "net17": "a6:45:ee:1b:56:8b",
            "net18": "a6:54:5b:37:df:85",
            "net19": "56:a3:03:4f:8d:32",
            "net2": "ea:a9:49:b1:1c:92",
            "net20": "e2:7c:ff:b4:db:55",
            "net21": "9a:4c:2e:c3:ec:2e",
            "net22": "26:af:a2:33:cc:ad",
            "net23": "ae:01:8b:aa:ab:e5",
            "net3": "66:bf:56:dc:91:1e",
            "net4": "e6:46:a8:4f:d1:30",
            "net5": "fa:7a:bd:5a:74:06",
            "net6": "9a:49:aa:d6:20:17",
            "net7": "e2:15:ef:02:a3:7c",
            "net8": "76:76:00:62:9a:b1",
            "net9": "46:f4:e4:98:86:d6"
        }
    },
    "failed_machine": "leaf_1_0_1",
    "failure_time": {
        "leaf_1_0_1": 1622133839.6714222,
        "leaf_1_0_10": 1622133839.7221346,
        "leaf_1_0_11": 1622133839.7618082,
        "leaf_1_0_12": 1622133839.7851593,
        "leaf_1_0_2": 1622133839.7063222,
        "leaf_1_0_3": 1622133839.729462,
        "leaf_1_0_4": 1622133839.7850177,
        "leaf_1_0_5": 1622133839.903566,
        "leaf_1_0_6": 1622133839.71054,
        "leaf_1_0_7": 1622133839.7572913,
        "leaf_1_0_8": 1622133839.8071904,
        "leaf_1_0_9": 1622133839.9432008,
        "leaf_2_0_1": 1622133839.7114558,
        "leaf_2_0_10": 1622133839.742155,
        "leaf_2_0_11": 1622133839.7834036,
        "leaf_2_0_12": 1622133839.8597338,
        "leaf_2_0_2": 1622133839.9450588,
        "leaf_2_0_3": 1622133840.0691662,
        "leaf_2_0_4": 1622133840.0801296,
        "leaf_2_0_5": 1622133840.0993075,
        "leaf_2_0_6": 1622133839.914011,
        "leaf_2_0_7": 1622133839.958395,
        "leaf_2_0_8": 1622133840.0726948,
        "leaf_2_0_9": 1622133840.095841,
        "spine_1_1_1": 1622133840.0417213,
        "spine_1_1_10": 1622133840.0711668,
        "spine_1_1_11": 1622133840.091439,
        "spine_1_1_12": 1622133840.1014273,
        "spine_1_1_2": 1622133840.0616357,
        "spine_1_1_3": 1622133840.0748987,
        "spine_1_1_4": 1622133840.0940957,
        "spine_1_1_5": 1622133840.171164,
        "spine_1_1_6": 1622133840.1746762,
        "spine_1_1_7": 1622133840.208194,
        "spine_1_1_8": 1622133840.2892187,
        "spine_1_1_9": 1622133840.3009813,
        "spine_2_1_1": 1622133840.164398,
        "spine_2_1_10": 1622133840.1862292,
        "spine_2_1_11": 1622133840.1981215,
        "spine_2_1_12": 1622133840.2407646,
        "spine_2_1_2": 1622133840.1860068,
        "spine_2_1_3": 1622133840.211479,
        "spine_2_1_4": 1622133840.2936816,
        "spine_2_1_5": 1622133840.3029187,
        "spine_2_1_6": 1622133840.196953,
        "spine_2_1_7": 1622133840.2779353,
        "spine_2_1_8": 1622133840.2997153,
        "spine_2_1_9": 1622133840.3113093,
        "tof_1_2_1": 1622133840.2987118,
        "tof_1_2_10": 1622133840.3079853,
        "tof_1_2_11": 1622133840.3228786,
        "tof_1_2_12": 1622133840.3334656,
        "tof_1_2_2": 1622133840.313259,
        "tof_1_2_3": 1622133840.3277664,
        "tof_1_2_4": 1622133840.342075,
        "tof_1_2_5": 1622133840.3830843,
        "tof_1_2_6": 1622133840.31284,
        "tof_1_2_7": 1622133840.3310976,
        "tof_1_2_8": 1622133840.4025803,
        "tof_1_2_9": 1622133840.4157467
    }
}