{
    "k_leaf": 2,
    "k_top": 2,
    "redundancy_factor": 2,
    "is_k8s": false,
    "failed_machine": "leaf_1_0_1",
    "failure_time": {
        "leaf_1_0_1": 1622025039.1596093,
        "leaf_1_0_2": 1622025039.1710422,
        "leaf_2_0_1": 1622025039.1633053,
        "leaf_2_0_2": 1622025039.1710384,
        "spine_1_1_1": 1622025039.1711588,
        "spine_1_1_2": 1622025039.1805623,
        "spine_2_1_1": 1622025039.1806178,
        "spine_2_1_2": 1622025039.183803,
        "tof_1_2_1": 1622025039.1917791,
        "tof_1_2_2": 1622025039.1912858
    },
    "packet_count": {
        "total": [
            293,
            52659
        ],
        "leaf_2_0_2": {
            "total": [
                18,
                3190
            ],
            "eth0": {
                "total": [
                    8,
                    1560
                ],
                "csnp": [
                    8,
                    1560
                ]
            },
            "eth1": {
                "total": [
                    10,
                    1630
                ],
                "csnp": [
                    8,
                    1560
                ],
                "psnp": [
                    2,
                    70
                ]
            }
        },
        "leaf_1_0_2": {
            "total": [
                22,
                3650
            ],
            "eth0": {
                "total": [
                    11,
                    1825
                ],
                "csnp": [
                    9,
                    1755
                ],
                "psnp": [
                    2,
                    70
                ]
            },
            "eth1": {
                "total": [
                    11,
                    1825
                ],
                "csnp": [
                    9,
                    1755
                ],
                "psnp": [
                    2,
                    70
                ]
            }
        },
        "tof_1_2_1": {
            "total": [
                42,
                7870
            ],
            "eth0": {
                "total": [
                    11,
                    1985
                ],
                "csnp": [
                    10,
                    1950
                ],
                "psnp": [
                    1,
                    35
                ]
            },
            "eth1": {
                "total": [
                    11,
                    1985
                ],
                "csnp": [
                    10,
                    1950
                ],
                "psnp": [
                    1,
                    35
                ]
            },
            "eth2": {
                "total": [
                    10,
                    1950
                ],
                "csnp": [
                    10,
                    1950
                ]
            },
            "eth3": {
                "total": [
                    10,
                    1950
                ],
                "csnp": [
                    10,
                    1950
                ]
            }
        },
        "spine_2_1_1": {
            "total": [
                38,
                7090
            ],
            "eth0": {
                "total": [
                    9,
                    1755
                ],
                "csnp": [
                    9,
                    1755
                ]
            },
            "eth1": {
                "total": [
                    9,
                    1755
                ],
                "csnp": [
                    9,
                    1755
                ]
            },
            "eth2": {
                "total": [
                    9,
                    1755
                ],
                "csnp": [
                    9,
                    1755
                ]
            },
            "eth3": {
                "total": [
                    11,
                    1825
                ],
                "csnp": [
                    9,
                    1755
                ],
                "psnp": [
                    2,
                    70
                ]
            }
        },
        "tof_1_2_2": {
            "total": [
                40,
                6976
            ],
            "eth0": {
                "total": [
                    10,
                    1706
                ],
                "csnp": [
                    8,
                    1560
                ],
                "psnp": [
                    1,
                    35
                ],
                "lsp": [
                    1,
                    111
                ]
            },
            "eth1": {
                "total": [
                    10,
                    1706
                ],
                "csnp": [
                    8,
                    1560
                ],
                "lsp": [
                    1,
                    111
                ],
                "psnp": [
                    1,
                    35
                ]
            },
            "eth2": {
                "total": [
                    10,
                    1782
                ],
                "csnp": [
                    8,
                    1560
                ],
                "lsp": [
                    2,
                    222
                ]
            },
            "eth3": {
                "total": [
                    10,
                    1782
                ],
                "csnp": [
                    8,
                    1560
                ],
                "lsp": [
                    2,
                    222
                ]
            }
        },
        "leaf_2_0_1": {
            "total": [
                20,
                3580
            ],
            "eth0": {
                "total": [
                    9,
                    1755
                ],
                "csnp": [
                    9,
                    1755
                ]
            },
            "eth1": {
                "total": [
                    11,
                    1825
                ],
                "csnp": [
                    9,
                    1755
                ],
                "psnp": [
                    2,
                    70
                ]
            }
        },
        "spine_1_1_1": {
            "total": [
                37,
                6719
            ],
            "eth0": {
                "total": [
                    8,
                    1560
                ],
                "csnp": [
                    8,
                    1560
                ]
            },
            "eth1": {
                "total": [
                    10,
                    1782
                ],
                "csnp": [
                    8,
                    1560
                ],
                "lsp": [
                    2,
                    222
                ]
            },
            "eth2": {
                "total": [
                    9,
                    1671
                ],
                "csnp": [
                    8,
                    1560
                ],
                "lsp": [
                    1,
                    111
                ]
            },
            "eth3": {
                "total": [
                    10,
                    1706
                ],
                "csnp": [
                    8,
                    1560
                ],
                "lsp": [
                    1,
                    111
                ],
                "psnp": [
                    1,
                    35
                ]
            }
        },
        "spine_1_1_2": {
            "total": [
                38,
                6830
            ],
            "eth0": {
                "total": [
                    9,
                    1671
                ],
                "csnp": [
                    8,
                    1560
                ],
                "lsp": [
                    1,
                    111
                ]
            },
            "eth1": {
                "total": [
                    10,
                    1782
                ],
                "csnp": [
                    8,
                    1560
                ],
                "lsp": [
                    2,
                    222
                ]
            },
            "eth2": {
                "total": [
                    9,
                    1671
                ],
                "csnp": [
                    8,
                    1560
                ],
                "lsp": [
                    1,
                    111
                ]
            },
            "eth3": {
                "total": [
                    10,
                    1706
                ],
                "csnp": [
                    8,
                    1560
                ],
                "psnp": [
                    1,
                    35
                ],
                "lsp": [
                    1,
                    111
                ]
            }
        },
        "spine_2_1_2": {
            "total": [
                38,
                6754
            ],
            "eth0": {
                "total": [
                    10,
                    1782
                ],
                "csnp": [
                    8,
                    1560
                ],
                "lsp": [
                    2,
                    222
                ]
            },
            "eth1": {
                "total": [
                    10,
                    1782
                ],
                "csnp": [
                    8,
                    1560
                ],
                "lsp": [
                    2,
                    222
                ]
            },
            "eth2": {
                "total": [
                    8,
                    1560
                ],
                "csnp": [
                    8,
                    1560
                ]
            },
            "eth3": {
                "total": [
                    10,
                    1630
                ],
                "csnp": [
                    8,
                    1560
                ],
                "psnp": [
                    2,
                    70
                ]
            }
        }
    },
    "packets_by_collision_domain": {
        "AAAG": 1,
        "AAAI": 1,
        "AAAQ": 0,
        "AAAS": 0,
        "AAAH": 2,
        "AAAJ": 2,
        "AAAR": 2,
        "AAAT": 2,
        "AAAD": 2,
        "AAAE": 2,
        "AAAA": 0,
        "AAAB": 1,
        "AAAK": 0,
        "AAAL": 2,
        "AAAN": 0,
        "AAAO": 2
    },
    "blast_radius": {
        "by_collision_domain": {
            "AAAA": [
                0,
                0
            ],
            "AAAB": [
                0,
                1
            ],
            "AAAE": [
                1,
                2
            ],
            "AAAI": [
                1,
                1
            ],
            "AAAJ": [
                1,
                2
            ],
            "AAAD": [
                1,
                2
            ],
            "AAAG": [
                1,
                1
            ],
            "AAAH": [
                1,
                2
            ],
            "AAAR": [
                2,
                2
            ],
            "AAAT": [
                2,
                2
            ],
            "AAAQ": [
                2,
                0
            ],
            "AAAS": [
                2,
                0
            ],
            "AAAK": [
                3,
                0
            ],
            "AAAN": [
                3,
                0
            ],
            "AAAL": [
                3,
                2
            ],
            "AAAO": [
                3,
                2
            ]
        },
        "by_distance": {
            "0": 1,
            "1": 10,
            "2": 4,
            "3": 4
        }
    },
    "radius_graph": {
        "nodes": [
            {
                "id": "spine_2_1_1",
                "label": "spine_2_1_1"
            },
            {
                "id": "spine_2_1_2",
                "label": "spine_2_1_2"
            },
            {
                "id": "leaf_1_0_2",
                "label": "leaf_1_0_2"
            },
            {
                "id": "leaf_2_0_2",
                "label": "leaf_2_0_2"
            },
            {
                "id": "leaf_1_0_1",
                "label": "leaf_1_0_1"
            },
            {
                "id": "tof_1_2_2",
                "label": "tof_1_2_2"
            },
            {
                "id": "spine_1_1_2",
                "label": "spine_1_1_2"
            },
            {
                "id": "tof_1_2_1",
                "label": "tof_1_2_1"
            },
            {
                "id": "leaf_2_0_1",
                "label": "leaf_2_0_1"
            },
            {
                "id": "spine_1_1_1",
                "label": "spine_1_1_1"
            }
        ],
        "links": [
            {
                "source": "tof_1_2_1",
                "target": "spine_1_1_1",
                "value": 1,
                "label": "AAAG"
            },
            {
                "source": "tof_1_2_1",
                "target": "spine_1_1_2",
                "value": 1,
                "label": "AAAI"
            },
            {
                "source": "tof_1_2_1",
                "target": "spine_2_1_1",
                "value": 0,
                "label": "AAAQ"
            },
            {
                "source": "tof_1_2_1",
                "target": "spine_2_1_2",
                "value": 0,
                "label": "AAAS"
            },
            {
                "source": "tof_1_2_2",
                "target": "spine_1_1_1",
                "value": 2,
                "label": "AAAH"
            },
            {
                "source": "tof_1_2_2",
                "target": "spine_1_1_2",
                "value": 2,
                "label": "AAAJ"
            },
            {
                "source": "tof_1_2_2",
                "target": "spine_2_1_1",
                "value": 2,
                "label": "AAAR"
            },
            {
                "source": "tof_1_2_2",
                "target": "spine_2_1_2",
                "value": 2,
                "label": "AAAT"
            },
            {
                "source": "leaf_1_0_1",
                "target": "spine_1_1_1",
                "value": 0,
                "label": "AAAA"
            },
            {
                "source": "leaf_1_0_1",
                "target": "spine_1_1_2",
                "value": 1,
                "label": "AAAB"
            },
            {
                "source": "leaf_1_0_2",
                "target": "spine_1_1_1",
                "value": 2,
                "label": "AAAD"
            },
            {
                "source": "leaf_1_0_2",
                "target": "spine_1_1_2",
                "value": 2,
                "label": "AAAE"
            },
            {
                "source": "spine_1_1_1",
                "target": "leaf_1_0_1",
                "value": 0,
                "label": "AAAA"
            },
            {
                "source": "spine_1_1_1",
                "target": "leaf_1_0_2",
                "value": 2,
                "label": "AAAD"
            },
            {
                "source": "spine_1_1_1",
                "target": "tof_1_2_1",
                "value": 1,
                "label": "AAAG"
            },
            {
                "source": "spine_1_1_1",
                "target": "tof_1_2_2",
                "value": 2,
                "label": "AAAH"
            },
            {
                "source": "spine_1_1_2",
                "target": "leaf_1_0_1",
                "value": 1,
                "label": "AAAB"
            },
            {
                "source": "spine_1_1_2",
                "target": "leaf_1_0_2",
                "value": 2,
                "label": "AAAE"
            },
            {
                "source": "spine_1_1_2",
                "target": "tof_1_2_1",
                "value": 1,
                "label": "AAAI"
            },
            {
                "source": "spine_1_1_2",
                "target": "tof_1_2_2",
                "value": 2,
                "label": "AAAJ"
            },
            {
                "source": "leaf_2_0_1",
                "target": "spine_2_1_1",
                "value": 0,
                "label": "AAAK"
            },
            {
                "source": "leaf_2_0_1",
                "target": "spine_2_1_2",
                "value": 2,
                "label": "AAAL"
            },
            {
                "source": "leaf_2_0_2",
                "target": "spine_2_1_1",
                "value": 0,
                "label": "AAAN"
            },
            {
                "source": "leaf_2_0_2",
                "target": "spine_2_1_2",
                "value": 2,
                "label": "AAAO"
            },
            {
                "source": "spine_2_1_1",
                "target": "leaf_2_0_1",
                "value": 0,
                "label": "AAAK"
            },
            {
                "source": "spine_2_1_1",
                "target": "leaf_2_0_2",
                "value": 0,
                "label": "AAAN"
            },
            {
                "source": "spine_2_1_1",
                "target": "tof_1_2_1",
                "value": 0,
                "label": "AAAQ"
            },
            {
                "source": "spine_2_1_1",
                "target": "tof_1_2_2",
                "value": 2,
                "label": "AAAR"
            },
            {
                "source": "spine_2_1_2",
                "target": "leaf_2_0_1",
                "value": 2,
                "label": "AAAL"
            },
            {
                "source": "spine_2_1_2",
                "target": "leaf_2_0_2",
                "value": 2,
                "label": "AAAO"
            },
            {
                "source": "spine_2_1_2",
                "target": "tof_1_2_1",
                "value": 0,
                "label": "AAAS"
            },
            {
                "source": "spine_2_1_2",
                "target": "tof_1_2_2",
                "value": 2,
                "label": "AAAT"
            }
        ]
    },
    "max_number_of_rounds": 5,
    "packets_per_round": {
        "0": 0,
        "1": 3,
        "2": 3,
        "3": 7,
        "4": 3,
        "5": 3
    },
    "round_graph": {
        "nodes": [
            {
                "id": "tof_1_2_2-3",
                "label": "tof_1_2_2-3"
            },
            {
                "id": "spine_2_1_2-4",
                "label": "spine_2_1_2-4"
            },
            {
                "id": "spine_2_1_1-2",
                "label": "spine_2_1_1-2"
            },
            {
                "id": "leaf_1_0_2-5",
                "label": "leaf_1_0_2-5"
            },
            {
                "id": "tof_1_2_1-3",
                "label": "tof_1_2_1-3"
            },
            {
                "id": "spine_2_1_2-2",
                "label": "spine_2_1_2-2"
            },
            {
                "id": "leaf_2_0_1-5",
                "label": "leaf_2_0_1-5"
            },
            {
                "id": "spine_1_1_2-2",
                "label": "spine_1_1_2-2"
            },
            {
                "id": "spine_1_1_1-0",
                "label": "spine_1_1_1-0"
            },
            {
                "id": "spine_2_1_1-4",
                "label": "spine_2_1_1-4"
            },
            {
                "id": "spine_1_1_1-4",
                "label": "spine_1_1_1-4"
            },
            {
                "id": "leaf_2_0_2-5",
                "label": "leaf_2_0_2-5"
            },
            {
                "id": "tof_1_2_2-1",
                "label": "tof_1_2_2-1"
            },
            {
                "id": "leaf_2_0_2-3",
                "label": "leaf_2_0_2-3"
            },
            {
                "id": "leaf_2_0_1-3",
                "label": "leaf_2_0_1-3"
            },
            {
                "id": "tof_1_2_1-1",
                "label": "tof_1_2_1-1"
            },
            {
                "id": "leaf_1_0_1",
                "label": "leaf_1_0_1"
            },
            {
                "id": "leaf_1_0_2-3",
                "label": "leaf_1_0_2-3"
            },
            {
                "id": "leaf_1_0_2-1",
                "label": "leaf_1_0_2-1"
            },
            {
                "id": "leaf_1_0_1-3",
                "label": "leaf_1_0_1-3"
            }
        ],
        "links": [
            {
                "source": "leaf_1_0_1",
                "target": "spine_1_1_1-0",
                "value": 0
            },
            {
                "source": "spine_1_1_1-0",
                "target": "tof_1_2_2-1",
                "value": 1,
                "label": [
                    {
                        "time": 1622025068.077135,
                        "type": "LSP",
                        "LSP ID": "0100.0000.0002.00-00",
                        "Seq.N": 3,
                        "Orig.": "spine_1_1_1"
                    }
                ]
            },
            {
                "source": "spine_1_1_1-0",
                "target": "tof_1_2_1-1",
                "value": 1,
                "label": [
                    {
                        "time": 1622025068.077203,
                        "type": "FS-LSP",
                        "LSP ID": "0100.0000.0002.00-00",
                        "Seq.N": 3,
                        "Orig.": "spine_1_1_1",
                        "Scope": "Level 2 Circuit Flooding Scope",
                        "Priority": false
                    }
                ]
            },
            {
                "source": "spine_1_1_1-0",
                "target": "leaf_1_0_2-1",
                "value": 1,
                "label": [
                    {
                        "time": 1622025068.077247,
                        "type": "FS-LSP",
                        "LSP ID": "0100.0000.0002.00-00",
                        "Seq.N": 3,
                        "Orig.": "spine_1_1_1",
                        "Scope": "Level 2 Circuit Flooding Scope",
                        "Priority": false
                    }
                ]
            },
            {
                "source": "tof_1_2_2-1",
                "target": "spine_2_1_2-2",
                "value": 1,
                "label": [
                    {
                        "time": 1622025068.077442,
                        "type": "LSP",
                        "LSP ID": "0100.0000.0002.00-00",
                        "Seq.N": 3,
                        "Orig.": "spine_1_1_1"
                    }
                ]
            },
            {
                "source": "tof_1_2_2-1",
                "target": "spine_2_1_1-2",
                "value": 1,
                "label": [
                    {
                        "time": 1622025068.077476,
                        "type": "FS-LSP",
                        "LSP ID": "0100.0000.0002.00-00",
                        "Seq.N": 3,
                        "Orig.": "spine_1_1_1",
                        "Scope": "Level 2 Circuit Flooding Scope",
                        "Priority": false
                    }
                ]
            },
            {
                "source": "tof_1_2_2-1",
                "target": "spine_1_1_2-2",
                "value": 1,
                "label": [
                    {
                        "time": 1622025068.0775,
                        "type": "LSP",
                        "LSP ID": "0100.0000.0002.00-00",
                        "Seq.N": 3,
                        "Orig.": "spine_1_1_1"
                    }
                ]
            },
            {
                "source": "spine_2_1_2-2",
                "target": "leaf_2_0_2-3",
                "value": 1,
                "label": [
                    {
                        "time": 1622025068.077756,
                        "type": "LSP",
                        "LSP ID": "0100.0000.0002.00-00",
                        "Seq.N": 3,
                        "Orig.": "spine_1_1_1"
                    }
                ]
            },
            {
                "source": "spine_2_1_2-2",
                "target": "leaf_2_0_1-3",
                "value": 1,
                "label": [
                    {
                        "time": 1622025068.077781,
                        "type": "FS-LSP",
                        "LSP ID": "0100.0000.0002.00-00",
                        "Seq.N": 3,
                        "Orig.": "spine_1_1_1",
                        "Scope": "Level 2 Circuit Flooding Scope",
                        "Priority": false
                    }
                ]
            },
            {
                "source": "spine_1_1_2-2",
                "target": "leaf_1_0_2-3",
                "value": 2,
                "label": [
                    {
                        "time": 1622025068.077738,
                        "type": "FS-LSP",
                        "LSP ID": "0100.0000.0002.00-00",
                        "Seq.N": 3,
                        "Orig.": "spine_1_1_1",
                        "Scope": "Level 2 Circuit Flooding Scope",
                        "Priority": false
                    },
                    {
                        "time": 1622025070.1811,
                        "type": "FS-LSP",
                        "LSP ID": "0100.0000.0006.00-00",
                        "Seq.N": 3,
                        "Orig.": "spine_1_1_2",
                        "Scope": "Level 2 Circuit Flooding Scope",
                        "Priority": false
                    }
                ]
            },
            {
                "source": "spine_1_1_2-2",
                "target": "leaf_1_0_1-3",
                "value": 1,
                "label": [
                    {
                        "time": 1622025068.077761,
                        "type": "FS-LSP",
                        "LSP ID": "0100.0000.0002.00-00",
                        "Seq.N": 3,
                        "Orig.": "spine_1_1_1",
                        "Scope": "Level 2 Circuit Flooding Scope",
                        "Priority": false
                    }
                ]
            },
            {
                "source": "spine_1_1_2-2",
                "target": "tof_1_2_2-3",
                "value": 1,
                "label": [
                    {
                        "time": 1622025070.181004,
                        "type": "LSP",
                        "LSP ID": "0100.0000.0006.00-00",
                        "Seq.N": 3,
                        "Orig.": "spine_1_1_2"
                    }
                ]
            },
            {
                "source": "spine_1_1_2-2",
                "target": "tof_1_2_1-3",
                "value": 1,
                "label": [
                    {
                        "time": 1622025070.181058,
                        "type": "FS-LSP",
                        "LSP ID": "0100.0000.0006.00-00",
                        "Seq.N": 3,
                        "Orig.": "spine_1_1_2",
                        "Scope": "Level 2 Circuit Flooding Scope",
                        "Priority": false
                    }
                ]
            },
            {
                "source": "tof_1_2_2-3",
                "target": "spine_2_1_2-4",
                "value": 1,
                "label": [
                    {
                        "time": 1622025070.181295,
                        "type": "LSP",
                        "LSP ID": "0100.0000.0006.00-00",
                        "Seq.N": 3,
                        "Orig.": "spine_1_1_2"
                    }
                ]
            },
            {
                "source": "tof_1_2_2-3",
                "target": "spine_2_1_1-4",
                "value": 1,
                "label": [
                    {
                        "time": 1622025070.181325,
                        "type": "FS-LSP",
                        "LSP ID": "0100.0000.0006.00-00",
                        "Seq.N": 3,
                        "Orig.": "spine_1_1_2",
                        "Scope": "Level 2 Circuit Flooding Scope",
                        "Priority": false
                    }
                ]
            },
            {
                "source": "tof_1_2_2-3",
                "target": "spine_1_1_1-4",
                "value": 1,
                "label": [
                    {
                        "time": 1622025070.181349,
                        "type": "LSP",
                        "LSP ID": "0100.0000.0006.00-00",
                        "Seq.N": 3,
                        "Orig.": "spine_1_1_2"
                    }
                ]
            },
            {
                "source": "spine_2_1_2-4",
                "target": "leaf_2_0_2-5",
                "value": 1,
                "label": [
                    {
                        "time": 1622025070.181604,
                        "type": "LSP",
                        "LSP ID": "0100.0000.0006.00-00",
                        "Seq.N": 3,
                        "Orig.": "spine_1_1_2"
                    }
                ]
            },
            {
                "source": "spine_2_1_2-4",
                "target": "leaf_2_0_1-5",
                "value": 1,
                "label": [
                    {
                        "time": 1622025070.181635,
                        "type": "FS-LSP",
                        "LSP ID": "0100.0000.0006.00-00",
                        "Seq.N": 3,
                        "Orig.": "spine_1_1_2",
                        "Scope": "Level 2 Circuit Flooding Scope",
                        "Priority": false
                    }
                ]
            },
            {
                "source": "spine_1_1_1-4",
                "target": "leaf_1_0_2-5",
                "value": 1,
                "label": [
                    {
                        "time": 1622025070.181736,
                        "type": "FS-LSP",
                        "LSP ID": "0100.0000.0006.00-00",
                        "Seq.N": 3,
                        "Orig.": "spine_1_1_2",
                        "Scope": "Level 2 Circuit Flooding Scope",
                        "Priority": false
                    }
                ]
            }
        ]
    },
    "logical_time_plot": {
        "points": {
            "spine_1_1_1": {
                "1": {
                    "time": 1622025068.077135,
                    "type": "LSP",
                    "LSP ID": "0100.0000.0002.00-00",
                    "Seq.N": 3,
                    "Orig.": "spine_1_1_1",
                    "Logical Clock": 1
                },
                "2": {
                    "time": 1622025068.077203,
                    "type": "FS-LSP",
                    "LSP ID": "0100.0000.0002.00-00",
                    "Seq.N": 3,
                    "Orig.": "spine_1_1_1",
                    "Scope": "Level 2 Circuit Flooding Scope",
                    "Priority": false,
                    "Logical Clock": 2
                },
                "3": {
                    "time": 1622025068.077247,
                    "type": "FS-LSP",
                    "LSP ID": "0100.0000.0002.00-00",
                    "Seq.N": 3,
                    "Orig.": "spine_1_1_1",
                    "Scope": "Level 2 Circuit Flooding Scope",
                    "Priority": false,
                    "Logical Clock": 3
                },
                "14": {
                    "time": 1622025070.18136,
                    "type": "LSP",
                    "LSP ID": "0100.0000.0006.00-00",
                    "Seq.N": 3,
                    "Orig.": "spine_1_1_2",
                    "Logical Clock": 14
                },
                "15": {
                    "time": 1622025070.181736,
                    "type": "FS-LSP",
                    "LSP ID": "0100.0000.0006.00-00",
                    "Seq.N": 3,
                    "Orig.": "spine_1_1_2",
                    "Scope": "Level 2 Circuit Flooding Scope",
                    "Priority": false,
                    "Logical Clock": 15
                }
            },
            "tof_1_2_2": {
                "2": {
                    "time": 1622025068.077183,
                    "type": "LSP",
                    "LSP ID": "0100.0000.0002.00-00",
                    "Seq.N": 3,
                    "Orig.": "spine_1_1_1",
                    "Logical Clock": 2
                },
                "3": {
                    "time": 1622025068.077442,
                    "type": "LSP",
                    "LSP ID": "0100.0000.0002.00-00",
                    "Seq.N": 3,
                    "Orig.": "spine_1_1_1",
                    "Logical Clock": 3
                },
                "4": {
                    "time": 1622025068.077476,
                    "type": "FS-LSP",
                    "LSP ID": "0100.0000.0002.00-00",
                    "Seq.N": 3,
                    "Orig.": "spine_1_1_1",
                    "Scope": "Level 2 Circuit Flooding Scope",
                    "Priority": false,
                    "Logical Clock": 4
                },
                "5": {
                    "time": 1622025068.0775,
                    "type": "LSP",
                    "LSP ID": "0100.0000.0002.00-00",
                    "Seq.N": 3,
                    "Orig.": "spine_1_1_1",
                    "Logical Clock": 5
                },
                "10": {
                    "time": 1622025070.18104,
                    "type": "LSP",
                    "LSP ID": "0100.0000.0006.00-00",
                    "Seq.N": 3,
                    "Orig.": "spine_1_1_2",
                    "Logical Clock": 10
                },
                "11": {
                    "time": 1622025070.181295,
                    "type": "LSP",
                    "LSP ID": "0100.0000.0006.00-00",
                    "Seq.N": 3,
                    "Orig.": "spine_1_1_2",
                    "Logical Clock": 11
                },
                "12": {
                    "time": 1622025070.181325,
                    "type": "FS-LSP",
                    "LSP ID": "0100.0000.0006.00-00",
                    "Seq.N": 3,
                    "Orig.": "spine_1_1_2",
                    "Scope": "Level 2 Circuit Flooding Scope",
                    "Priority": false,
                    "Logical Clock": 12
                },
                "13": {
                    "time": 1622025070.181349,
                    "type": "LSP",
                    "LSP ID": "0100.0000.0006.00-00",
                    "Seq.N": 3,
                    "Orig.": "spine_1_1_2",
                    "Logical Clock": 13
                }
            },
            "tof_1_2_1": {
                "3": {
                    "time": 1622025068.077231,
                    "type": "FS-LSP",
                    "LSP ID": "0100.0000.0002.00-00",
                    "Seq.N": 3,
                    "Orig.": "spine_1_1_1",
                    "Scope": "Level 2 Circuit Flooding Scope",
                    "Priority": false,
                    "Logical Clock": 3
                },
                "11": {
                    "time": 1622025070.181084,
                    "type": "FS-LSP",
                    "LSP ID": "0100.0000.0006.00-00",
                    "Seq.N": 3,
                    "Orig.": "spine_1_1_2",
                    "Scope": "Level 2 Circuit Flooding Scope",
                    "Priority": false,
                    "Logical Clock": 11
                }
            },
            "leaf_1_0_2": {
                "4": {
                    "time": 1622025068.07726,
                    "type": "FS-LSP",
                    "LSP ID": "0100.0000.0002.00-00",
                    "Seq.N": 3,
                    "Orig.": "spine_1_1_1",
                    "Scope": "Level 2 Circuit Flooding Scope",
                    "Priority": false,
                    "Logical Clock": 4
                },
                "8": {
                    "time": 1622025068.077749,
                    "type": "FS-LSP",
                    "LSP ID": "0100.0000.0002.00-00",
                    "Seq.N": 3,
                    "Orig.": "spine_1_1_1",
                    "Scope": "Level 2 Circuit Flooding Scope",
                    "Priority": false,
                    "Logical Clock": 8
                },
                "12": {
                    "time": 1622025070.181126,
                    "type": "FS-LSP",
                    "LSP ID": "0100.0000.0006.00-00",
                    "Seq.N": 3,
                    "Orig.": "spine_1_1_2",
                    "Scope": "Level 2 Circuit Flooding Scope",
                    "Priority": false,
                    "Logical Clock": 12
                },
                "16": {
                    "time": 1622025070.181752,
                    "type": "FS-LSP",
                    "LSP ID": "0100.0000.0006.00-00",
                    "Seq.N": 3,
                    "Orig.": "spine_1_1_2",
                    "Scope": "Level 2 Circuit Flooding Scope",
                    "Priority": false,
                    "Logical Clock": 16
                }
            },
            "spine_2_1_2": {
                "4": {
                    "time": 1622025068.077461,
                    "type": "LSP",
                    "LSP ID": "0100.0000.0002.00-00",
                    "Seq.N": 3,
                    "Orig.": "spine_1_1_1",
                    "Logical Clock": 4
                },
                "5": {
                    "time": 1622025068.077756,
                    "type": "LSP",
                    "LSP ID": "0100.0000.0002.00-00",
                    "Seq.N": 3,
                    "Orig.": "spine_1_1_1",
                    "Logical Clock": 5
                },
                "6": {
                    "time": 1622025068.077781,
                    "type": "FS-LSP",
                    "LSP ID": "0100.0000.0002.00-00",
                    "Seq.N": 3,
                    "Orig.": "spine_1_1_1",
                    "Scope": "Level 2 Circuit Flooding Scope",
                    "Priority": false,
                    "Logical Clock": 6
                },
                "12": {
                    "time": 1622025070.18131,
                    "type": "LSP",
                    "LSP ID": "0100.0000.0006.00-00",
                    "Seq.N": 3,
                    "Orig.": "spine_1_1_2",
                    "Logical Clock": 12
                },
                "13": {
                    "time": 1622025070.181604,
                    "type": "LSP",
                    "LSP ID": "0100.0000.0006.00-00",
                    "Seq.N": 3,
                    "Orig.": "spine_1_1_2",
                    "Logical Clock": 13
                },
                "14": {
                    "time": 1622025070.181635,
                    "type": "FS-LSP",
                    "LSP ID": "0100.0000.0006.00-00",
                    "Seq.N": 3,
                    "Orig.": "spine_1_1_2",
                    "Scope": "Level 2 Circuit Flooding Scope",
                    "Priority": false,
                    "Logical Clock": 14
                }
            },
            "spine_2_1_1": {
                "5": {
                    "time": 1622025068.077487,
                    "type": "FS-LSP",
                    "LSP ID": "0100.0000.0002.00-00",
                    "Seq.N": 3,
                    "Orig.": "spine_1_1_1",
                    "Scope": "Level 2 Circuit Flooding Scope",
                    "Priority": false,
                    "Logical Clock": 5
                },
                "13": {
                    "time": 1622025070.181336,
                    "type": "FS-LSP",
                    "LSP ID": "0100.0000.0006.00-00",
                    "Seq.N": 3,
                    "Orig.": "spine_1_1_2",
                    "Scope": "Level 2 Circuit Flooding Scope",
                    "Priority": false,
                    "Logical Clock": 13
                }
            },
            "spine_1_1_2": {
                "6": {
                    "time": 1622025068.077513,
                    "type": "LSP",
                    "LSP ID": "0100.0000.0002.00-00",
                    "Seq.N": 3,
                    "Orig.": "spine_1_1_1",
                    "Logical Clock": 6
                },
                "7": {
                    "time": 1622025068.077738,
                    "type": "FS-LSP",
                    "LSP ID": "0100.0000.0002.00-00",
                    "Seq.N": 3,
                    "Orig.": "spine_1_1_1",
                    "Scope": "Level 2 Circuit Flooding Scope",
                    "Priority": false,
                    "Logical Clock": 7
                },
                "8": {
                    "time": 1622025068.077761,
                    "type": "FS-LSP",
                    "LSP ID": "0100.0000.0002.00-00",
                    "Seq.N": 3,
                    "Orig.": "spine_1_1_1",
                    "Scope": "Level 2 Circuit Flooding Scope",
                    "Priority": false,
                    "Logical Clock": 8
                },
                "9": {
                    "time": 1622025070.181004,
                    "type": "LSP",
                    "LSP ID": "0100.0000.0006.00-00",
                    "Seq.N": 3,
                    "Orig.": "spine_1_1_2",
                    "Logical Clock": 9
                },
                "10": {
                    "time": 1622025070.181058,
                    "type": "FS-LSP",
                    "LSP ID": "0100.0000.0006.00-00",
                    "Seq.N": 3,
                    "Orig.": "spine_1_1_2",
                    "Scope": "Level 2 Circuit Flooding Scope",
                    "Priority": false,
                    "Logical Clock": 10
                },
                "11": {
                    "time": 1622025070.1811,
                    "type": "FS-LSP",
                    "LSP ID": "0100.0000.0006.00-00",
                    "Seq.N": 3,
                    "Orig.": "spine_1_1_2",
                    "Scope": "Level 2 Circuit Flooding Scope",
                    "Priority": false,
                    "Logical Clock": 11
                }
            },
            "leaf_2_0_2": {
                "6": {
                    "time": 1622025068.077769,
                    "type": "LSP",
                    "LSP ID": "0100.0000.0002.00-00",
                    "Seq.N": 3,
                    "Orig.": "spine_1_1_1",
                    "Logical Clock": 6
                },
                "14": {
                    "time": 1622025070.18162,
                    "type": "LSP",
                    "LSP ID": "0100.0000.0006.00-00",
                    "Seq.N": 3,
                    "Orig.": "spine_1_1_2",
                    "Logical Clock": 14
                }
            },
            "leaf_2_0_1": {
                "7": {
                    "time": 1622025068.07779,
                    "type": "FS-LSP",
                    "LSP ID": "0100.0000.0002.00-00",
                    "Seq.N": 3,
                    "Orig.": "spine_1_1_1",
                    "Scope": "Level 2 Circuit Flooding Scope",
                    "Priority": false,
                    "Logical Clock": 7
                },
                "15": {
                    "time": 1622025070.181645,
                    "type": "FS-LSP",
                    "LSP ID": "0100.0000.0006.00-00",
                    "Seq.N": 3,
                    "Orig.": "spine_1_1_2",
                    "Scope": "Level 2 Circuit Flooding Scope",
                    "Priority": false,
                    "Logical Clock": 15
                }
            }
        },
        "edges": [
            [
                [
                    "spine_1_1_1",
                    1
                ],
                [
                    "tof_1_2_2",
                    2
                ]
            ],
            [
                [
                    "spine_1_1_1",
                    2
                ],
                [
                    "tof_1_2_1",
                    3
                ]
            ],
            [
                [
                    "spine_1_1_1",
                    3
                ],
                [
                    "leaf_1_0_2",
                    4
                ]
            ],
            [
                [
                    "tof_1_2_2",
                    3
                ],
                [
                    "spine_2_1_2",
                    4
                ]
            ],
            [
                [
                    "tof_1_2_2",
                    4
                ],
                [
                    "spine_2_1_1",
                    5
                ]
            ],
            [
                [
                    "tof_1_2_2",
                    5
                ],
                [
                    "spine_1_1_2",
                    6
                ]
            ],
            [
                [
                    "spine_2_1_2",
                    5
                ],
                [
                    "leaf_2_0_2",
                    6
                ]
            ],
            [
                [
                    "spine_2_1_2",
                    6
                ],
                [
                    "leaf_2_0_1",
                    7
                ]
            ],
            [
                [
                    "spine_1_1_2",
                    7
                ],
                [
                    "leaf_1_0_2",
                    8
                ]
            ],
            [
                [
                    "spine_1_1_2",
                    8
                ],
                [
                    "leaf_1_0_1",
                    null
                ]
            ],
            [
                [
                    "spine_1_1_2",
                    9
                ],
                [
                    "tof_1_2_2",
                    10
                ]
            ],
            [
                [
                    "spine_1_1_2",
                    10
                ],
                [
                    "tof_1_2_1",
                    11
                ]
            ],
            [
                [
                    "spine_1_1_2",
                    11
                ],
                [
                    "leaf_1_0_2",
                    12
                ]
            ],
            [
                [
                    "tof_1_2_2",
                    11
                ],
                [
                    "spine_2_1_2",
                    12
                ]
            ],
            [
                [
                    "tof_1_2_2",
                    12
                ],
                [
                    "spine_2_1_1",
                    13
                ]
            ],
            [
                [
                    "tof_1_2_2",
                    13
                ],
                [
                    "spine_1_1_1",
                    14
                ]
            ],
            [
                [
                    "spine_2_1_2",
                    13
                ],
                [
                    "leaf_2_0_2",
                    14
                ]
            ],
            [
                [
                    "spine_2_1_2",
                    14
                ],
                [
                    "leaf_2_0_1",
                    15
                ]
            ],
            [
                [
                    "spine_1_1_1",
                    15
                ],
                [
                    "leaf_1_0_2",
                    16
                ]
            ]
        ]
    },
    "max_scalar_clock": 16
}