{
    "description": "Scenario 4c: ToF tof_1_2_1 failure and recovery with BGP",
    "k_leaf": 16,
    "k_top": 16,
    "redundancy_factor": 16,
    "is_k8s": true,
    "machine_mac_addresses": {
        "leaf_1_0_1": {
            "net0": "7a:c9:53:29:7c:fc",
            "net1": "0a:f9:e9:10:9c:6f",
            "net10": "2e:2d:16:eb:67:66",
            "net11": "16:bd:cb:d5:72:92",
            "net12": "92:f8:10:95:e5:b9",
            "net13": "8a:92:9b:0d:8a:d7",
            "net14": "7a:5f:a9:5d:3d:67",
            "net15": "92:77:54:7f:6b:53",
            "net16": "aa:aa:2c:5a:05:5f",
            "net2": "0a:d9:0d:9c:5e:30",
            "net3": "be:23:5f:fb:bf:d7",
            "net4": "ba:83:d3:c8:c3:b3",
            "net5": "16:74:0b:48:e2:13",
            "net6": "0a:01:9a:26:9a:4d",
            "net7": "aa:7a:c8:be:86:1b",
            "net8": "ee:c9:29:89:bb:d3",
            "net9": "b2:85:54:5d:93:c9"
        },
        "leaf_1_0_10": {
            "net0": "72:ae:f4:b6:5c:08",
            "net1": "aa:6e:63:ee:36:61",
            "net10": "42:be:a7:c5:51:34",
            "net11": "52:5b:d8:b6:ab:1a",
            "net12": "6e:a3:39:9e:83:2d",
            "net13": "6e:f1:62:cf:dd:42",
            "net14": "7a:a9:30:f3:ce:97",
            "net15": "02:59:22:19:f3:9c",
            "net16": "b2:0e:9a:f7:e6:13",
            "net2": "c6:5e:e0:77:6f:2d",
            "net3": "9e:a5:7e:c5:05:8c",
            "net4": "ba:7b:4c:a4:67:6e",
            "net5": "c2:21:96:da:85:6b",
            "net6": "0a:eb:6d:54:b8:48",
            "net7": "2e:1a:e3:c8:63:dc",
            "net8": "8a:3b:f3:08:ae:ef",
            "net9": "aa:65:af:4d:ad:6f"
        },
        "leaf_1_0_11": {
            "net0": "c6:8c:89:7a:0a:66",
            "net1": "6a:0d:30:13:ab:27",
            "net10": "92:fa:66:05:c9:19",
            "net11": "32:d7:b6:83:f6:35",
            "net12": "aa:04:5c:a6:b2:5f",
            "net13": "6a:e5:27:6c:78:d4",
            "net14": "7e:b0:b0:1e:81:58",
            "net15": "6e:24:0b:3f:9d:94",
            "net16": "e6:d5:dd:c8:e4:1d",
            "net2": "66:35:02:24:04:2d",
            "net3": "06:2a:95:72:cb:81",
            "net4": "46:32:78:70:aa:ea",
            "net5": "e2:d8:1b:eb:43:a6",
            "net6": "1e:75:fb:51:05:54",
            "net7": "26:37:f8:67:01:be",
            "net8": "82:4d:78:47:d6:8c",
            "net9": "9e:53:eb:45:6a:74"
        },
        "leaf_1_0_12": {
            "net0": "ee:ab:99:cc:63:7c",
            "net1": "9a:3c:d2:42:c2:ed",
            "net10": "ae:93:86:7d:41:71",
            "net11": "ae:61:9b:9e:84:81",
            "net12": "0a:83:7b:37:73:1e",
            "net13": "26:fb:a2:c3:54:5f",
            "net14": "c6:88:0a:99:25:bb",
            "net15": "ae:d6:36:05:8c:b3",
            "net16": "f6:1c:c7:65:45:d8",
            "net2": "4e:59:da:c0:ba:27",
            "net3": "c2:34:52:2a:03:52",
            "net4": "c2:f2:07:c5:6e:cc",
            "net5": "de:71:b6:0d:ae:bb",
            "net6": "7e:f7:fe:9f:79:d7",
            "net7": "f6:64:21:95:0f:e4",
            "net8": "f6:c7:dd:64:79:15",
            "net9": "ce:f6:34:d4:d5:37"
        },
        "leaf_1_0_13": {
            "net0": "a2:ea:19:f1:07:48",
            "net1": "76:95:56:34:77:cb",
            "net10": "8e:39:fa:7c:06:b3",
            "net11": "12:f4:24:ca:d4:4b",
            "net12": "e2:94:c8:ef:7d:dc",
            "net13": "42:51:df:36:8b:5d",
            "net14": "06:09:e3:1c:75:28",
            "net15": "7a:4d:06:27:87:92",
            "net16": "26:64:6c:1e:c9:89",
            "net2": "02:d8:75:cc:df:01",
            "net3": "ae:cb:3c:d3:61:11",
            "net4": "86:55:0e:af:19:f6",
            "net5": "ea:5a:d7:3f:21:32",
            "net6": "72:86:35:a2:26:92",
            "net7": "f6:93:e0:0a:92:f4",
            "net8": "16:31:35:5c:87:d2",
            "net9": "8e:8c:88:50:41:fb"
        },
        "leaf_1_0_14": {
            "net0": "0a:44:c9:58:57:e4",
            "net1": "be:a3:2b:dc:44:81",
            "net10": "de:2e:a7:91:90:d5",
            "net11": "76:6d:92:2c:b4:e1",
            "net12": "ce:0b:27:53:c4:08",
            "net13": "7a:f8:b5:73:3c:48",
            "net14": "5a:f8:60:58:c1:bc",
            "net15": "a6:73:fd:cf:2b:3b",
            "net16": "9e:35:3b:52:f6:42",
            "net2": "86:73:83:ef:1a:a7",
            "net3": "e2:cb:33:7f:90:bc",
            "net4": "12:b5:68:70:00:fb",
            "net5": "7a:c1:9f:ad:32:c6",
            "net6": "66:ef:b1:ff:df:ac",
            "net7": "96:cc:48:9b:88:96",
            "net8": "2e:be:fe:80:fe:7a",
            "net9": "ba:e8:be:34:3d:4f"
        },
        "leaf_1_0_15": {
            "net0": "da:ed:a5:20:11:95",
            "net1": "fa:e7:d6:63:74:cd",
            "net10": "de:9d:c2:9c:87:80",
            "net11": "a2:eb:5f:cd:aa:f5",
            "net12": "ce:f2:97:5d:4b:23",
            "net13": "26:4d:ac:ee:28:0b",
            "net14": "7e:22:b0:61:77:f6",
            "net15": "82:4e:76:9e:8c:ff",
            "net16": "0e:cf:a5:de:7e:91",
            "net2": "c2:84:26:3d:f7:5d",
            "net3": "da:fc:5f:8a:3d:75",
            "net4": "b2:c8:a5:f1:78:a8",
            "net5": "b2:c4:0a:a2:1f:28",
            "net6": "92:52:96:98:e1:51",
            "net7": "c6:26:83:ac:d5:37",
            "net8": "06:0b:d1:8b:53:94",
            "net9": "9a:95:65:47:2b:cc"
        },
        "leaf_1_0_16": {
            "net0": "76:e4:94:9f:5d:f7",
            "net1": "b2:be:e3:41:7d:38",
            "net10": "6e:b8:3c:3f:ec:76",
            "net11": "fe:c4:c2:9e:b1:4d",
            "net12": "5e:f7:ed:e3:39:91",
            "net13": "82:b4:9b:b6:81:f8",
            "net14": "0e:77:d7:63:4b:60",
            "net15": "2a:91:b0:5e:54:ae",
            "net16": "d6:7b:45:10:33:65",
            "net2": "1e:43:bf:88:f3:80",
            "net3": "d6:18:85:a3:93:65",
            "net4": "2e:b2:ca:74:d5:e4",
            "net5": "2e:0e:60:a1:02:cc",
            "net6": "02:79:44:d2:5f:21",
            "net7": "ce:49:78:46:18:2a",
            "net8": "22:21:43:7e:6b:1c",
            "net9": "ba:0a:e5:3f:c0:37"
        },
        "leaf_1_0_2": {
            "net0": "4e:ee:2d:25:25:67",
            "net1": "9e:f9:6f:e2:8d:2b",
            "net10": "76:ed:26:b6:87:a6",
            "net11": "f6:95:74:78:b4:6a",
            "net12": "1e:8c:9e:b5:d8:8c",
            "net13": "fe:34:90:fd:61:a4",
            "net14": "0e:e7:9b:30:39:54",
            "net15": "02:ab:08:61:0f:58",
            "net16": "56:24:db:53:37:ac",
            "net2": "72:0c:ec:b8:47:33",
            "net3": "be:9f:a4:5f:b7:43",
            "net4": "da:b2:f6:87:47:93",
            "net5": "2e:c9:d4:60:da:a4",
            "net6": "ea:0e:d6:01:9e:9c",
            "net7": "c6:7b:a5:1d:39:17",
            "net8": "d2:e4:3d:2a:3a:9e",
            "net9": "92:8a:fd:89:dd:af"
        },
        "leaf_1_0_3": {
            "net0": "f6:98:85:62:87:19",
            "net1": "3e:d7:8c:98:85:0a",
            "net10": "aa:f0:04:54:32:40",
            "net11": "b2:b5:c7:04:ff:ff",
            "net12": "46:b6:e9:87:ff:7f",
            "net13": "ce:be:cf:1d:f9:6c",
            "net14": "02:7f:66:95:b6:ab",
            "net15": "be:fd:db:cf:78:cb",
            "net16": "42:4d:77:f2:a6:25",
            "net2": "46:64:a4:90:12:b1",
            "net3": "6a:67:fd:cc:14:a3",
            "net4": "8e:67:1b:61:37:0b",
            "net5": "9a:07:c8:6b:bc:5d",
            "net6": "12:21:6b:b2:cc:7e",
            "net7": "ea:12:58:72:60:60",
            "net8": "32:84:55:aa:30:c3",
            "net9": "6a:57:21:cf:13:09"
        },
        "leaf_1_0_4": {
            "net0": "b2:4c:21:f1:6b:b9",
            "net1": "6e:55:8c:a9:48:b2",
            "net10": "2e:14:de:5d:df:b8",
            "net11": "56:b9:87:89:b9:74",
            "net12": "82:95:34:e6:32:b4",
            "net13": "2a:11:80:20:45:76",
            "net14": "ba:a7:d4:4f:46:89",
            "net15": "5a:6b:57:62:d1:ca",
            "net16": "de:90:20:5e:cd:5a",
            "net2": "8e:4e:08:b9:d4:b0",
            "net3": "c6:6e:57:85:74:9d",
            "net4": "1e:f2:bb:0b:34:fa",
            "net5": "3e:10:c3:1c:83:3c",
            "net6": "e2:b9:6a:9a:d4:fb",
            "net7": "7a:72:86:61:1e:d5",
            "net8": "5a:cc:26:61:c0:5f",
            "net9": "da:14:46:98:3b:70"
        },
        "leaf_1_0_5": {
            "net0": "ee:fe:a3:e7:f6:64",
            "net1": "da:46:18:31:7c:27",
            "net10": "26:ba:3e:c6:fd:f5",
            "net11": "be:39:a7:81:91:71",
            "net12": "da:68:9a:89:f5:cd",
            "net13": "76:97:fa:9e:15:0d",
            "net14": "d6:2b:10:13:16:6e",
            "net15": "12:e2:66:7f:0d:ec",
            "net16": "f6:72:8a:05:46:27",
            "net2": "72:13:57:e5:b8:fe",
            "net3": "9a:a8:62:ed:cb:25",
            "net4": "fa:91:13:c1:3f:c1",
            "net5": "86:26:62:75:78:73",
            "net6": "1a:9c:bd:ca:25:f3",
            "net7": "9e:57:52:ef:a3:63",
            "net8": "c2:c1:56:a3:a5:e5",
            "net9": "32:45:0a:1c:17:42"
        },
        "leaf_1_0_6": {
            "net0": "76:f5:5f:7d:88:b1",
            "net1": "b6:fd:db:59:e5:70",
            "net10": "32:88:bd:9c:e7:58",
            "net11": "2a:6b:d6:4e:3d:39",
            "net12": "ee:30:34:fa:6d:1f",
            "net13": "c2:81:81:22:77:bb",
            "net14": "ee:74:63:d3:46:53",
            "net15": "66:cb:6e:99:05:24",
            "net16": "b6:fc:95:6f:40:e4",
            "net2": "de:00:8e:41:52:65",
            "net3": "fa:e6:1a:65:d7:35",
            "net4": "ee:9d:0e:8f:c1:83",
            "net5": "9e:0d:84:c3:7e:dd",
            "net6": "6a:30:d8:d0:7c:92",
            "net7": "b2:59:ba:63:29:30",
            "net8": "6e:7d:ca:1c:2c:ca",
            "net9": "ae:81:6e:6b:24:73"
        },
        "leaf_1_0_7": {
            "net0": "e2:c9:a5:57:d9:ec",
            "net1": "76:58:d0:b6:ee:f0",
            "net10": "1e:27:83:5d:b7:44",
            "net11": "a6:c8:62:58:4b:58",
            "net12": "62:a3:36:7d:25:e0",
            "net13": "fa:e4:81:c6:70:3b",
            "net14": "36:80:a4:b0:88:40",
            "net15": "de:09:97:12:79:16",
            "net16": "be:fc:f5:de:a1:eb",
            "net2": "4a:fd:ee:72:69:ee",
            "net3": "ba:8d:31:62:13:9f",
            "net4": "0e:87:6d:0d:82:d8",
            "net5": "1a:93:50:1e:42:10",
            "net6": "ae:a4:3e:bf:80:dd",
            "net7": "ea:98:e7:a3:0f:2e",
            "net8": "c2:fe:40:e9:06:3e",
            "net9": "f6:cb:05:89:9f:90"
        },
        "leaf_1_0_8": {
            "net0": "62:ac:12:99:d2:fe",
            "net1": "fe:20:2d:0a:65:30",
            "net10": "2e:e4:e3:d4:2e:59",
            "net11": "f2:b7:8d:98:d4:90",
            "net12": "42:c6:4e:51:1f:f1",
            "net13": "2e:11:c0:a2:3e:f2",
            "net14": "6e:43:ae:91:50:44",
            "net15": "22:c6:c2:ae:6a:90",
            "net16": "be:e4:6d:68:06:7c",
            "net2": "76:73:b1:46:1a:d3",
            "net3": "12:d1:a0:8a:ce:25",
            "net4": "2e:4e:22:ca:98:42",
            "net5": "06:8a:2e:c4:c5:b3",
            "net6": "d6:f2:3c:26:8d:55",
            "net7": "c6:25:f5:99:f6:87",
            "net8": "ba:bf:ba:c5:87:5b",
            "net9": "82:2d:a1:48:eb:5d"
        },
        "leaf_1_0_9": {
            "net0": "6a:ef:d0:ac:94:10",
            "net1": "ea:bc:66:a4:38:28",
            "net10": "1e:eb:25:a1:c2:7f",
            "net11": "8a:8f:f9:df:02:a1",
            "net12": "f6:fa:4f:c0:bd:c4",
            "net13": "f6:28:b2:d5:b7:b9",
            "net14": "be:b0:fd:1f:ff:dc",
            "net15": "76:a1:e3:15:48:77",
            "net16": "46:b7:af:2e:21:a2",
            "net2": "82:85:70:58:5b:08",
            "net3": "92:f5:1c:4e:18:21",
            "net4": "7a:f3:10:61:42:0e",
            "net5": "fa:59:f2:73:f7:1e",
            "net6": "3a:e3:35:29:a7:12",
            "net7": "5e:4e:0d:ec:71:61",
            "net8": "52:55:48:2a:5e:f1",
            "net9": "e2:38:f2:cc:91:ce"
        },
        "leaf_2_0_1": {
            "net0": "e2:e5:53:3b:c5:cf",
            "net1": "36:be:60:9c:19:38",
            "net10": "3a:7a:71:fe:28:2a",
            "net11": "e2:e6:3d:d4:24:b7",
            "net12": "c6:e1:d1:30:f9:bb",
            "net13": "4e:fc:01:d6:a7:c6",
            "net14": "aa:18:f3:6f:7b:d5",
            "net15": "2e:c8:48:74:96:e3",
            "net16": "aa:9b:a6:15:67:96",
            "net2": "ea:7a:ac:38:61:50",
            "net3": "5e:8d:55:88:c5:d6",
            "net4": "f2:4d:7b:64:96:fa",
            "net5": "a2:01:4b:41:f1:0d",
            "net6": "7a:85:42:09:b3:f8",
            "net7": "2a:07:55:0d:35:a0",
            "net8": "42:3a:ee:a0:21:de",
            "net9": "b2:90:21:cc:e3:14"
        },
        "leaf_2_0_10": {
            "net0": "c2:40:fe:4f:33:98",
            "net1": "f2:c5:38:a1:e2:86",
            "net10": "9e:6e:c0:2c:d6:62",
            "net11": "62:b2:58:07:e7:f3",
            "net12": "2e:8d:89:8d:06:62",
            "net13": "92:87:d0:77:cf:2a",
            "net14": "06:2f:e8:67:bf:8e",
            "net15": "a6:95:43:72:3e:0f",
            "net16": "fa:fa:dc:d8:e5:5e",
            "net2": "e6:72:99:a9:05:02",
            "net3": "26:0c:6b:09:46:78",
            "net4": "9a:f8:e5:58:91:67",
            "net5": "32:85:99:16:26:5b",
            "net6": "06:90:1b:21:70:b0",
            "net7": "72:f3:ff:93:53:15",
            "net8": "52:e3:f0:23:a7:36",
            "net9": "5e:a1:90:6f:c4:76"
        },
        "leaf_2_0_11": {
            "net0": "3e:c9:c9:19:2a:84",
            "net1": "da:e3:c1:e7:ab:a6",
            "net10": "62:1f:4d:4b:a8:8c",
            "net11": "9e:73:af:d5:f8:88",
            "net12": "9a:15:55:d2:c6:54",
            "net13": "02:31:4e:71:a9:f1",
            "net14": "9e:ea:5d:88:60:e2",
            "net15": "6e:da:bf:fc:82:f4",
            "net16": "e6:f1:d6:90:4b:f0",
            "net2": "a2:47:b6:77:79:57",
            "net3": "d6:ec:b3:40:16:21",
            "net4": "2e:35:4e:4b:6f:37",
            "net5": "de:06:d8:a8:53:dc",
            "net6": "62:9d:0a:3f:3b:c0",
            "net7": "36:0e:23:21:99:3b",
            "net8": "f2:75:a1:7e:f0:21",
            "net9": "e2:eb:da:75:d5:44"
        },
        "leaf_2_0_12": {
            "net0": "aa:a0:86:6b:08:ae",
            "net1": "4e:09:9b:81:1a:f8",
            "net10": "66:61:1d:db:78:88",
            "net11": "d2:20:b1:3c:25:87",
            "net12": "16:30:4c:ac:9e:42",
            "net13": "6a:97:b7:f8:53:3b",
            "net14": "16:a2:77:02:e4:4e",
            "net15": "a2:b8:d5:fd:bf:ab",
            "net16": "ae:0c:64:11:68:c2",
            "net2": "ca:61:d1:71:56:c5",
            "net3": "aa:42:a0:4a:55:1c",
            "net4": "8e:96:ad:d1:cc:a5",
            "net5": "82:80:82:62:be:d9",
            "net6": "92:c0:a8:83:1e:f9",
            "net7": "1a:4f:69:66:2d:4b",
            "net8": "aa:57:3c:a2:40:12",
            "net9": "ae:87:48:d7:3c:ac"
        },
        "leaf_2_0_13": {
            "net0": "76:d4:87:fd:1e:48",
            "net1": "ae:ca:67:97:fe:f9",
            "net10": "de:59:41:70:d6:f6",
            "net11": "72:12:1c:a9:06:8a",
            "net12": "8e:0f:1a:40:89:50",
            "net13": "52:27:f4:13:5e:d8",
            "net14": "aa:2b:8b:c5:38:5f",
            "net15": "7e:90:9d:41:41:86",
            "net16": "2a:62:8f:59:1e:b5",
            "net2": "7e:81:2f:f4:14:58",
            "net3": "c6:d6:02:85:b5:1d",
            "net4": "66:1a:c3:f1:2a:e2",
            "net5": "9a:74:fb:de:5a:cb",
            "net6": "52:29:9d:8b:7d:1a",
            "net7": "42:61:0a:04:15:94",
            "net8": "7a:b4:4e:45:08:f4",
            "net9": "9a:55:6f:1f:b8:75"
        },
        "leaf_2_0_14": {
            "net0": "fa:f0:cf:e9:1f:32",
            "net1": "1a:0e:55:12:98:b7",
            "net10": "1e:f4:d3:51:30:3a",
            "net11": "22:9e:ab:77:1b:a7",
            "net12": "56:20:c8:5b:f4:bd",
            "net13": "0e:de:6d:fc:99:49",
            "net14": "4a:75:18:d9:8b:3b",
            "net15": "26:d9:d7:22:d0:b1",
            "net16": "82:31:d6:19:24:d6",
            "net2": "8e:88:7b:d8:96:1e",
            "net3": "4e:72:74:fa:03:b0",
            "net4": "5a:61:d9:d7:45:0e",
            "net5": "b2:dc:36:4b:bd:56",
            "net6": "42:cd:39:cd:2e:e6",
            "net7": "da:68:9d:7c:85:4a",
            "net8": "a2:f7:0e:86:29:d4",
            "net9": "92:14:a1:96:ce:93"
        },
        "leaf_2_0_15": {
            "net0": "76:d8:84:15:f0:6b",
            "net1": "42:5a:ef:a0:6d:b6",
            "net10": "7e:ba:d5:63:72:96",
            "net11": "d6:36:6d:1c:35:51",
            "net12": "46:2c:4e:1c:82:f0",
            "net13": "22:e9:b2:aa:ee:d8",
            "net14": "22:36:94:df:5d:1a",
            "net15": "9e:5f:4e:50:60:81",
            "net16": "0e:81:03:fb:cb:d4",
            "net2": "32:ca:60:12:ea:b1",
            "net3": "aa:bc:b5:f6:24:ce",
            "net4": "1e:1a:8b:c2:58:f3",
            "net5": "de:a5:7e:b5:5d:28",
            "net6": "aa:76:67:63:b4:e9",
            "net7": "0a:fb:61:ab:fa:a2",
            "net8": "fe:d3:3f:0b:7f:63",
            "net9": "06:e1:dd:85:da:a2"
        },
        "leaf_2_0_16": {
            "net0": "c2:f2:73:d3:5a:e0",
            "net1": "4e:b4:e2:df:4c:83",
            "net10": "06:e2:48:2e:86:f2",
            "net11": "da:56:dc:bf:7c:2e",
            "net12": "76:96:22:f9:a3:58",
            "net13": "2a:ec:c1:6a:b3:92",
            "net14": "e6:df:9e:ef:1a:a7",
            "net15": "4e:82:5b:cd:ea:81",
            "net16": "26:55:b3:06:e9:2a",
            "net2": "2a:fc:89:09:69:62",
            "net3": "4e:3f:f6:af:59:32",
            "net4": "8a:22:93:b4:cf:ba",
            "net5": "1a:3b:47:59:2d:a3",
            "net6": "e2:b2:b1:09:d8:50",
            "net7": "fe:18:58:77:ec:a9",
            "net8": "e2:03:98:6d:bf:37",
            "net9": "96:77:69:9e:08:6d"
        },
        "leaf_2_0_2": {
            "net0": "aa:8e:66:0a:dc:b7",
            "net1": "fa:f4:ec:0b:0f:34",
            "net10": "7e:61:25:29:b6:e6",
            "net11": "46:fe:54:1c:a9:4c",
            "net12": "52:e6:b2:1b:eb:18",
            "net13": "32:eb:9e:73:20:ba",
            "net14": "ba:ce:c3:c3:d0:76",
            "net15": "f6:8b:e4:02:55:f0",
            "net16": "06:6d:b7:8b:c6:9d",
            "net2": "fe:ac:92:20:e0:4e",
            "net3": "b6:5b:01:20:0c:ce",
            "net4": "0e:fe:27:00:4a:22",
            "net5": "ba:a6:07:c8:bc:0b",
            "net6": "5e:78:81:e7:34:95",
            "net7": "de:4e:a7:df:b7:2d",
            "net8": "f2:0c:f8:2c:5b:fe",
            "net9": "6e:c2:9f:13:5f:ab"
        },
        "leaf_2_0_3": {
            "net0": "7e:d4:8c:18:e7:d7",
            "net1": "0e:49:9f:ae:b4:ca",
            "net10": "fe:71:e3:7c:60:3d",
            "net11": "5a:25:a7:ce:8c:ac",
            "net12": "9e:19:6b:8c:7c:3b",
            "net13": "b6:53:b9:c4:93:08",
            "net14": "16:f6:57:07:ec:0e",
            "net15": "be:f0:bb:3c:ee:78",
            "net16": "7a:81:1a:01:67:e7",
            "net2": "da:e6:1c:66:82:e8",
            "net3": "ae:b8:ac:65:78:85",
            "net4": "46:02:78:68:08:9e",
            "net5": "9e:5b:69:bf:70:f7",
            "net6": "ca:b4:1a:42:88:4e",
            "net7": "42:aa:82:6d:7f:de",
            "net8": "da:cf:bb:ef:e9:19",
            "net9": "a6:51:af:29:18:be"
        },
        "leaf_2_0_4": {
            "net0": "96:ef:8f:1d:1a:4a",
            "net1": "d2:55:4e:04:ff:5f",
            "net10": "be:02:52:33:a5:ba",
            "net11": "b6:f5:4e:08:02:2d",
            "net12": "b6:ac:8b:ce:da:8e",
            "net13": "02:47:90:77:36:f5",
            "net14": "f6:8d:67:f1:03:1a",
            "net15": "86:b5:14:51:2d:1a",
            "net16": "6a:4c:f0:17:7a:2f",
            "net2": "4a:c6:96:70:55:68",
            "net3": "b2:5f:5c:71:4a:34",
            "net4": "76:01:d4:d0:ed:7b",
            "net5": "da:33:98:fe:6f:6a",
            "net6": "06:00:88:3d:6d:2c",
            "net7": "0e:4e:0d:ac:e1:0c",
            "net8": "ea:57:a7:0b:b4:ad",
            "net9": "e2:1b:ea:d2:f7:36"
        },
        "leaf_2_0_5": {
            "net0": "8a:34:64:b6:95:d5",
            "net1": "d6:a2:1d:d3:61:79",
            "net10": "0e:85:f3:be:a4:1d",
            "net11": "2a:40:9c:f3:dd:27",
            "net12": "c6:77:48:ad:da:ef",
            "net13": "6a:85:91:67:31:c8",
            "net14": "2e:b6:d2:83:cb:77",
            "net15": "32:42:d3:27:2b:b5",
            "net16": "d2:57:f9:56:52:ce",
            "net2": "12:08:fe:44:78:49",
            "net3": "4e:f7:7d:27:92:62",
            "net4": "0e:13:e2:28:ef:6c",
            "net5": "ba:cd:0e:80:72:c3",
            "net6": "9a:b0:f6:96:45:8c",
            "net7": "82:bf:a8:8a:6a:f9",
            "net8": "d6:7a:42:ea:40:d1",
            "net9": "0e:96:a4:03:8b:fa"
        },
        "leaf_2_0_6": {
            "net0": "62:4c:de:15:93:37",
            "net1": "e2:72:70:54:03:c5",
            "net10": "e2:81:83:9f:21:91",
            "net11": "96:4c:8e:47:c0:81",
            "net12": "be:f4:07:04:1c:ae",
            "net13": "c2:5c:33:a5:5b:5c",
            "net14": "62:d2:43:b0:96:de",
            "net15": "f6:ae:08:50:73:4b",
            "net16": "4e:4a:a6:2f:45:31",
            "net2": "c2:07:88:c2:e9:61",
            "net3": "5e:41:74:96:55:5d",
            "net4": "26:35:20:53:68:d0",
            "net5": "62:61:83:6c:25:c1",
            "net6": "96:fe:ff:87:81:84",
            "net7": "ae:cb:6c:75:ba:2e",
            "net8": "d6:70:2e:09:b4:30",
            "net9": "3e:36:c8:7b:99:bd"
        },
        "leaf_2_0_7": {
            "net0": "ee:78:33:c0:b7:1c",
            "net1": "d2:1f:15:05:ed:ff",
            "net10": "2a:de:33:e1:ad:ec",
            "net11": "ca:c0:cf:f8:ff:f1",
            "net12": "6a:f0:aa:0b:1b:42",
            "net13": "62:1e:b8:a1:05:de",
            "net14": "3a:a3:b1:2e:fd:4f",
            "net15": "ae:43:7d:85:e5:8c",
            "net16": "e2:09:ca:56:e7:50",
            "net2": "fa:28:86:45:58:d3",
            "net3": "b2:62:bd:9a:eb:37",
            "net4": "52:6b:62:49:57:98",
            "net5": "ea:07:55:46:0b:66",
            "net6": "6e:17:62:58:e6:fa",
            "net7": "de:44:c0:53:be:7c",
            "net8": "52:56:57:a3:b6:8b",
            "net9": "1a:fd:82:e0:3f:98"
        },
        "leaf_2_0_8": {
            "net0": "16:e7:3b:e8:c7:65",
            "net1": "aa:a6:eb:c6:f4:35",
            "net10": "e2:54:6b:f6:b3:6d",
            "net11": "0a:a5:0a:ba:63:30",
            "net12": "72:83:25:5d:a5:2b",
            "net13": "e6:b4:b4:27:6e:a4",
            "net14": "46:86:36:69:58:f0",
            "net15": "8e:63:2c:29:a3:4a",
            "net16": "f6:a1:e0:93:ab:22",
            "net2": "c2:7f:b6:96:e9:5d",
            "net3": "12:a6:4b:74:cf:ad",
            "net4": "ba:a4:ef:3a:b2:48",
            "net5": "0e:36:09:3a:1b:70",
            "net6": "12:76:20:6f:46:5d",
            "net7": "72:77:d9:de:27:3a",
            "net8": "36:8b:80:62:7e:70",
            "net9": "22:e1:95:2b:b3:84"
        },
        "leaf_2_0_9": {
            "net0": "d6:1f:18:4e:d7:f6",
            "net1": "1a:3b:80:e9:f5:6e",
            "net10": "ca:89:b9:93:82:15",
            "net11": "8e:d6:23:3c:46:88",
            "net12": "da:bd:6f:70:e5:1c",
            "net13": "ca:f3:dc:61:65:e1",
            "net14": "4a:1e:16:18:2a:22",
            "net15": "06:9d:43:b2:9b:ca",
            "net16": "aa:49:a6:5b:1d:bd",
            "net2": "3a:cc:97:8e:06:40",
            "net3": "42:18:24:5e:83:4c",
            "net4": "26:aa:03:4e:38:c6",
            "net5": "62:6a:51:9d:73:a8",
            "net6": "9a:08:63:8d:ee:5f",
            "net7": "6e:84:fd:79:8f:25",
            "net8": "d6:b1:a2:fe:05:e3",
            "net9": "7e:e5:7b:42:af:5a"
        },
        "spine_1_1_1": {
            "net0": "e2:d8:72:b2:40:7b",
            "net1": "0e:77:01:09:68:a6",
            "net10": "3e:46:c0:31:59:54",
            "net11": "12:16:b0:2c:1f:28",
            "net12": "06:d2:19:6b:53:25",
            "net13": "8e:dd:35:a6:60:18",
            "net14": "2a:d8:1b:10:f9:1a",
            "net15": "26:9f:05:1f:4d:ec",
            "net16": "22:bc:37:0f:98:05",
            "net17": "1a:63:a5:1a:83:a2",
            "net18": "ea:79:98:7e:0a:0e",
            "net19": "fa:8a:de:97:79:88",
            "net2": "86:59:ab:64:1d:dd",
            "net20": "96:93:39:10:80:49",
            "net21": "56:4c:d1:ae:34:ee",
            "net22": "86:f3:9f:02:59:cc",
            "net23": "06:0d:b7:87:93:c8",
            "net24": "5a:41:65:da:03:b4",
            "net25": "7a:ff:8d:ff:b0:25",
            "net26": "7e:26:1a:12:78:37",
            "net27": "46:9c:06:97:1a:7b",
            "net28": "82:00:1a:bf:61:84",
            "net29": "ae:73:8c:21:c6:9b",
            "net3": "aa:39:87:a5:69:02",
            "net30": "a6:b0:e7:e3:bf:02",
            "net31": "b2:17:97:ad:10:a0",
            "net4": "5e:c3:31:6c:d0:9f",
            "net5": "6a:49:13:a6:d9:59",
            "net6": "ca:bc:46:a2:64:e3",
            "net7": "16:13:24:c4:96:3e",
            "net8": "82:d2:96:ea:ec:d9",
            "net9": "92:90:a3:c6:69:c4"
        },
        "spine_1_1_10": {
            "net0": "36:18:fc:ce:03:40",
            "net1": "c6:2e:28:40:b0:d9",
            "net10": "e6:90:7e:c9:4f:de",
            "net11": "a2:45:e4:b2:14:f7",
            "net12": "42:a8:e7:c1:30:62",
            "net13": "1a:cc:22:01:df:6d",
            "net14": "ee:7c:86:3f:20:67",
            "net15": "fa:b2:25:5a:c3:62",
            "net16": "22:d1:f3:a3:d0:bf",
            "net17": "7e:0a:25:6a:c7:d9",
            "net18": "e2:9e:7a:3c:10:b2",
            "net19": "de:6c:dd:7e:3a:83",
            "net2": "7a:6c:a0:d9:d0:7d",
            "net20": "42:7f:b7:8a:90:70",
            "net21": "b2:cd:ea:4c:0d:9f",
            "net22": "ca:0a:8b:8a:d7:c8",
            "net23": "5a:14:ea:72:0c:cf",
            "net24": "92:01:fd:03:0a:49",
            "net25": "02:ac:bf:1b:eb:ae",
            "net26": "e2:30:6f:c7:93:79",
            "net27": "ae:c0:f1:b6:de:40",
            "net28": "56:ed:90:89:03:60",
            "net29": "7e:7d:16:24:82:bf",
            "net3": "6a:55:e4:23:de:d1",
            "net30": "e2:c1:24:21:1d:fe",
            "net31": "6e:94:e0:30:b3:89",
            "net4": "ea:10:14:4e:d7:36",
            "net5": "6e:97:da:57:bd:de",
            "net6": "9a:bd:18:5e:39:5e",
            "net7": "22:81:2a:c1:37:24",
            "net8": "26:8f:e8:79:9c:f5",
            "net9": "a6:4c:cb:8e:3b:c5"
        },
        "spine_1_1_11": {
            "net0": "4e:ed:22:e0:60:7d",
            "net1": "9e:cf:8c:9e:32:6d",
            "net10": "ae:e0:6f:e5:af:76",
            "net11": "0a:78:67:b2:e8:7a",
            "net12": "06:3c:dc:c5:4d:c1",
            "net13": "3e:0a:11:88:19:a9",
            "net14": "8e:e0:0b:7c:81:ca",
            "net15": "a6:ce:41:8d:c6:fe",
            "net16": "72:a3:9e:4c:8b:e5",
            "net17": "3e:7c:f0:d3:53:72",
            "net18": "8e:57:e6:9f:2c:1d",
            "net19": "32:42:77:52:13:05",
            "net2": "16:fb:85:f0:b2:8f",
            "net20": "a2:58:bd:69:35:f5",
            "net21": "76:5d:a7:16:98:ef",
            "net22": "96:68:43:01:56:85",
            "net23": "52:01:cc:ed:5f:92",
            "net24": "9e:c2:e6:ff:fe:df",
            "net25": "1a:ac:93:cb:c6:f1",
            "net26": "ae:ac:b5:cf:06:06",
            "net27": "62:68:b6:a7:f9:b2",
            "net28": "6e:8d:95:67:ca:b5",
            "net29": "26:e8:d1:88:b9:41",
            "net3": "32:a0:3d:21:89:dc",
            "net30": "0a:5f:ca:8a:56:0f",
            "net31": "f2:06:c4:e7:58:46",
            "net4": "ea:d9:ed:de:1b:fb",
            "net5": "ea:f4:8c:07:90:61",
            "net6": "92:f1:aa:99:50:5e",
            "net7": "ce:81:2a:93:36:5d",
            "net8": "66:39:49:8b:ee:03",
            "net9": "be:63:52:f2:bd:e7"
        },
        "spine_1_1_12": {
            "net0": "06:b7:da:dc:7e:bd",
            "net1": "9a:d1:39:57:5a:2b",
            "net10": "ce:2e:85:39:0a:b6",
            "net11": "5a:a5:1d:c0:d8:d2",
            "net12": "e2:28:77:7f:77:a6",
            "net13": "76:e2:82:1d:d2:38",
            "net14": "2a:19:d4:80:b0:31",
            "net15": "7e:fc:0e:5b:49:c0",
            "net16": "ba:1d:7d:dc:d5:ee",
            "net17": "26:02:3b:1d:8c:29",
            "net18": "82:99:f3:3f:16:1c",
            "net19": "ca:85:24:80:95:6a",
            "net2": "0a:f5:d6:79:bb:95",
            "net20": "b6:1b:f0:a0:50:3b",
            "net21": "b2:29:d0:93:0f:72",
            "net22": "f2:b3:44:36:85:06",
            "net23": "d6:18:a9:14:95:a3",
            "net24": "66:a1:65:b8:cf:b4",
            "net25": "96:19:d3:8c:3e:ad",
            "net26": "22:4a:98:03:cd:ee",
            "net27": "4e:a6:bf:2f:22:73",
            "net28": "4a:c7:04:3a:80:70",
            "net29": "66:da:b3:00:30:ab",
            "net3": "32:72:6c:7c:fa:5c",
            "net30": "46:23:bb:56:a1:40",
            "net31": "d6:0a:d7:17:73:e4",
            "net4": "a2:06:5f:f7:8d:29",
            "net5": "de:68:99:9c:b6:e7",
            "net6": "ce:3e:ee:bc:3e:42",
            "net7": "b6:fe:79:39:49:b5",
            "net8": "7e:f9:47:af:9d:e1",
            "net9": "7e:0a:d0:c6:71:10"
        },
        "spine_1_1_13": {
            "net0": "ca:51:b4:28:a0:4d",
            "net1": "fe:c2:1a:14:80:0a",
            "net10": "a6:2d:76:a0:b0:05",
            "net11": "aa:bd:b9:52:e5:54",
            "net12": "46:b8:70:c3:bb:d1",
            "net13": "16:7a:9a:61:cc:ba",
            "net14": "06:80:6c:d9:bc:cc",
            "net15": "ee:ef:6b:cf:5a:59",
            "net16": "62:a8:d5:4b:a4:1a",
            "net17": "ce:d2:d4:71:a0:28",
            "net18": "2e:09:7c:32:30:5d",
            "net19": "06:85:07:d1:0d:3e",
            "net2": "e6:35:33:32:35:03",
            "net20": "ae:76:22:f8:64:c8",
            "net21": "a6:85:75:17:bc:9d",
            "net22": "ea:3a:62:9d:db:f3",
            "net23": "ce:2f:4f:8d:87:77",
            "net24": "46:30:29:b2:38:8a",
            "net25": "8a:2d:a9:ac:e4:1d",
            "net26": "52:05:c2:7f:23:8f",
            "net27": "c6:4a:ee:5b:16:07",
            "net28": "3a:c5:78:d8:8a:65",
            "net29": "be:1b:57:df:13:e5",
            "net3": "72:59:a9:9e:b5:80",
            "net30": "aa:29:d2:41:8a:83",
            "net31": "6a:32:fc:e6:83:68",
            "net4": "b6:48:b4:21:73:eb",
            "net5": "3a:bc:be:02:88:df",
            "net6": "26:f5:3e:ce:26:e1",
            "net7": "26:1e:34:5e:0c:7f",
            "net8": "2e:fd:4c:ad:55:85",
            "net9": "fa:c0:c2:a7:40:b8"
        },
        "spine_1_1_14": {
            "net0": "b6:f6:eb:a5:55:d7",
            "net1": "96:74:9a:a8:d0:ef",
            "net10": "7a:d2:76:fc:ba:c3",
            "net11": "fa:a0:29:02:6a:a8",
            "net12": "a6:4e:2f:d0:f7:21",
            "net13": "7e:d9:01:91:9f:87",
            "net14": "e2:3e:27:88:16:ea",
            "net15": "5e:07:ae:8e:80:4e",
            "net16": "aa:1a:6f:e8:cf:fe",
            "net17": "1e:35:84:cd:b9:e1",
            "net18": "6a:02:fd:83:ce:35",
            "net19": "9e:bf:90:02:6a:ff",
            "net2": "b6:23:b1:03:d0:0b",
            "net20": "26:e9:2f:2a:4d:91",
            "net21": "ba:62:0d:16:e9:0c",
            "net22": "52:08:85:42:27:11",
            "net23": "46:e2:9e:ca:d9:8e",
            "net24": "aa:67:f0:46:ae:a6",
            "net25": "12:ce:82:1d:0e:30",
            "net26": "36:2c:e9:cd:1b:f9",
            "net27": "ca:ee:70:d1:0d:a3",
            "net28": "c2:b4:04:8a:0c:d9",
            "net29": "3a:04:32:3f:39:f7",
            "net3": "f6:c2:01:81:b3:21",
            "net30": "02:35:ba:f9:70:26",
            "net31": "8a:0d:a0:ac:26:66",
            "net4": "ca:9b:a8:ea:a4:8c",
            "net5": "0e:20:cc:f5:e2:a1",
            "net6": "ca:f1:e8:18:67:45",
            "net7": "b6:48:09:63:b2:7e",
            "net8": "16:8b:7a:61:98:90",
            "net9": "c6:fa:f5:5b:66:6d"
        },
        "spine_1_1_15": {
            "net0": "f2:71:4d:11:f3:50",
            "net1": "8a:42:45:9f:d2:a0",
            "net10": "56:96:e8:12:40:0f",
            "net11": "f2:eb:02:a7:2f:d8",
            "net12": "de:e6:50:48:0b:f2",
            "net13": "ae:45:9b:00:ba:a5",
            "net14": "86:f0:33:7a:4a:de",
            "net15": "da:bd:55:64:47:04",
            "net16": "ee:c0:26:61:27:61",
            "net17": "6e:ff:28:f6:37:98",
            "net18": "f2:33:9d:18:66:6f",
            "net19": "ca:df:85:67:50:96",
            "net2": "e2:2e:25:b8:4b:de",
            "net20": "ce:ce:4b:d6:68:9c",
            "net21": "56:c8:0d:b2:55:25",
            "net22": "e2:5c:a8:47:76:74",
            "net23": "56:ed:90:c4:8e:6f",
            "net24": "6e:46:b2:d1:bc:68",
            "net25": "9e:37:58:a2:0a:5e",
            "net26": "76:16:e4:14:05:01",
            "net27": "1a:a5:a1:da:42:bc",
            "net28": "ba:fc:b3:4d:f4:2a",
            "net29": "7e:74:44:8e:82:0f",
            "net3": "86:67:a8:bb:f1:b3",
            "net30": "5a:10:4f:74:53:f3",
            "net31": "b6:41:34:86:36:ae",
            "net4": "32:98:77:93:3e:97",
            "net5": "82:ab:31:c0:f0:69",
            "net6": "6a:38:30:63:6f:14",
            "net7": "6a:e4:80:24:7f:cb",
            "net8": "c2:a7:39:c6:41:9c",
            "net9": "a6:c1:bc:4e:5f:b3"
        },
        "spine_1_1_16": {
            "net0": "7a:97:d7:f3:2e:4c",
            "net1": "26:46:02:23:cc:14",
            "net10": "4a:22:7d:ba:71:13",
            "net11": "56:81:b2:09:f1:31",
            "net12": "d6:3c:57:9b:43:86",
            "net13": "7e:7f:5a:9e:d5:09",
            "net14": "56:bb:6e:df:dc:e7",
            "net15": "fa:02:a5:fb:85:9b",
            "net16": "8e:56:5e:f6:14:1b",
            "net17": "ba:aa:50:c6:5d:36",
            "net18": "d2:e6:2e:20:c1:b0",
            "net19": "9e:e8:12:3b:80:da",
            "net2": "66:d0:46:30:47:b5",
            "net20": "0e:11:e5:3a:59:84",
            "net21": "5a:b2:97:e4:6c:43",
            "net22": "7e:ef:24:cd:42:73",
            "net23": "76:de:ba:d3:7e:9a",
            "net24": "4a:81:26:68:0c:f5",
            "net25": "6e:05:b0:dc:b1:2f",
            "net26": "26:cb:a0:fd:72:a2",
            "net27": "82:d9:d4:75:47:fb",
            "net28": "72:3c:b1:c1:ea:35",
            "net29": "a6:ec:5a:68:1c:c5",
            "net3": "8e:f6:26:29:34:da",
            "net30": "86:95:99:13:d6:80",
            "net31": "02:a5:c0:c5:a5:c3",
            "net4": "72:dc:37:00:fb:a9",
            "net5": "1a:5e:b3:68:65:ca",
            "net6": "52:37:1b:be:f5:3a",
            "net7": "06:0e:20:7b:2b:48",
            "net8": "22:f4:0d:81:90:54",
            "net9": "da:b9:e0:cb:d5:db"
        },
        "spine_1_1_2": {
            "net0": "aa:54:7a:35:43:42",
            "net1": "3a:c0:25:f4:aa:93",
            "net10": "96:9f:05:b9:01:c1",
            "net11": "62:1f:85:fd:9c:9b",
            "net12": "ea:08:3f:a5:7f:0c",
            "net13": "ce:85:f3:f6:24:67",
            "net14": "c2:f3:21:4d:72:f9",
            "net15": "5e:92:f2:aa:77:e6",
            "net16": "ee:15:19:bd:33:53",
            "net17": "fa:14:07:68:e0:ef",
            "net18": "02:bb:a6:9d:9a:8b",
            "net19": "be:69:23:41:a1:d9",
            "net2": "22:b9:5b:51:70:5e",
            "net20": "5a:4f:60:cf:07:c3",
            "net21": "0e:87:14:30:e4:6a",
            "net22": "ce:58:f0:3f:00:a1",
            "net23": "ba:5f:ed:3d:10:a1",
            "net24": "fa:f1:21:bd:d4:8e",
            "net25": "a2:95:0e:d0:14:ef",
            "net26": "46:6c:86:f9:bc:f7",
            "net27": "a6:74:90:c5:a5:44",
            "net28": "e6:88:3b:e2:70:97",
            "net29": "22:d1:55:fe:25:e4",
            "net3": "66:1b:18:43:e8:4d",
            "net30": "16:07:d5:59:a4:37",
            "net31": "6e:8b:a0:89:b9:c8",
            "net4": "b2:68:d6:9d:88:d3",
            "net5": "4a:ca:a2:81:ee:85",
            "net6": "32:9f:8f:53:84:e6",
            "net7": "2e:0c:0e:4f:2c:4a",
            "net8": "8a:cd:d6:2a:5a:44",
            "net9": "42:d1:f7:7b:e6:a5"
        },
        "spine_1_1_3": {
            "net0": "3e:d1:d2:d2:e9:09",
            "net1": "f2:36:24:7b:a0:72",
            "net10": "c2:7c:1e:ba:85:2e",
            "net11": "5a:62:7c:a5:57:fe",
            "net12": "1e:58:94:be:f7:73",
            "net13": "7a:40:72:8f:95:52",
            "net14": "22:a4:d3:af:7f:3d",
            "net15": "ee:08:92:11:83:71",
            "net16": "b6:cc:5a:d0:02:fd",
            "net17": "0a:b3:c3:79:f8:e5",
            "net18": "b6:96:af:59:a9:65",
            "net19": "66:4b:3b:12:c9:29",
            "net2": "5e:87:6a:3c:c1:b2",
            "net20": "b6:ed:fa:59:fc:ee",
            "net21": "a6:95:33:93:e0:90",
            "net22": "b6:38:db:6c:89:10",
            "net23": "be:b9:8e:e4:76:ad",
            "net24": "76:0c:37:ce:10:c9",
            "net25": "22:e8:bd:9f:d8:3e",
            "net26": "d6:d4:8c:76:a8:63",
            "net27": "a2:0c:df:ae:c7:b1",
            "net28": "f6:27:79:82:fa:73",
            "net29": "5a:9e:e1:6d:04:e1",
            "net3": "06:4d:2b:d1:79:c5",
            "net30": "0e:3f:4d:fd:ee:41",
            "net31": "8e:75:fc:80:0d:40",
            "net4": "da:ae:30:55:a2:1f",
            "net5": "86:86:8c:dc:6f:36",
            "net6": "86:25:c6:92:47:9b",
            "net7": "82:0a:59:a0:4c:00",
            "net8": "fa:7c:b0:06:a8:d3",
            "net9": "66:0e:15:73:eb:ac"
        },
        "spine_1_1_4": {
            "net0": "02:a6:21:82:92:ca",
            "net1": "e2:42:d7:92:ce:6c",
            "net10": "66:4c:37:e2:71:76",
            "net11": "72:ec:92:4e:1f:26",
            "net12": "32:3b:3c:dc:4b:2f",
            "net13": "96:b5:d2:b1:09:a8",
            "net14": "52:77:79:70:6a:53",
            "net15": "fe:b3:88:d2:18:fb",
            "net16": "26:66:f0:87:f0:69",
            "net17": "b6:60:88:42:bf:c2",
            "net18": "82:c8:65:5f:4c:83",
            "net19": "2a:65:77:da:d2:85",
            "net2": "92:0f:af:2c:92:2c",
            "net20": "72:94:19:45:5d:43",
            "net21": "32:2c:38:80:ca:e1",
            "net22": "da:1a:84:4f:48:ba",
            "net23": "96:0a:c5:64:00:90",
            "net24": "06:7e:f1:5d:a1:1e",
            "net25": "a6:6d:93:a3:2c:9a",
            "net26": "f2:24:f3:f8:ed:ad",
            "net27": "2a:8e:4c:dd:46:ee",
            "net28": "ea:52:56:c4:5e:0c",
            "net29": "ee:d6:5e:98:36:1d",
            "net3": "46:84:12:cc:88:fe",
            "net30": "0a:f3:3a:15:fe:a2",
            "net31": "12:88:09:42:ae:8f",
            "net4": "8e:b7:be:89:16:75",
            "net5": "d6:07:d0:6d:70:d9",
            "net6": "06:c4:ee:18:75:e1",
            "net7": "de:39:c5:79:c3:c7",
            "net8": "8e:00:1e:54:de:4f",
            "net9": "92:6d:4a:a2:3a:01"
        },
        "spine_1_1_5": {
            "net0": "36:1d:f5:ed:35:d7",
            "net1": "92:29:a3:09:42:92",
            "net10": "52:fe:ab:68:4b:c9",
            "net11": "3a:47:fc:b6:2f:9a",
            "net12": "32:3f:b9:a2:01:1d",
            "net13": "b6:c5:b9:13:c5:02",
            "net14": "1e:43:4a:19:6f:ad",
            "net15": "ae:9b:e2:52:6a:17",
            "net16": "02:cf:b1:33:1f:c4",
            "net17": "9a:c8:e9:0b:39:a2",
            "net18": "46:13:d0:3d:28:db",
            "net19": "ee:43:49:7b:b5:33",
            "net2": "46:af:3a:c3:f6:4e",
            "net20": "5a:eb:db:08:f6:96",
            "net21": "a2:2d:57:d8:7a:de",
            "net22": "b2:06:b4:da:f4:df",
            "net23": "e2:56:0e:f8:69:db",
            "net24": "e6:82:37:c7:ac:5f",
            "net25": "56:3b:90:1e:29:b5",
            "net26": "fe:1b:9b:2d:82:37",
            "net27": "1e:77:8b:b6:42:6f",
            "net28": "6a:84:41:68:2b:80",
            "net29": "0e:d1:69:22:01:ea",
            "net3": "9a:72:31:b6:e0:f6",
            "net30": "52:3c:24:40:ab:85",
            "net31": "16:cf:26:bf:7d:74",
            "net4": "fe:85:5b:74:42:40",
            "net5": "0a:e7:90:15:13:a4",
            "net6": "72:8c:2b:ff:c6:e8",
            "net7": "aa:a2:ef:d4:23:d0",
            "net8": "ba:68:8b:4b:78:b5",
            "net9": "d2:b1:92:32:84:82"
        },
        "spine_1_1_6": {
            "net0": "e6:e8:2d:aa:20:ba",
            "net1": "32:16:9b:64:9c:4d",
            "net10": "f2:01:2a:01:c0:5e",
            "net11": "ee:f5:f3:29:b4:5b",
            "net12": "76:6d:b4:15:b8:1c",
            "net13": "ba:d3:bd:4c:c2:33",
            "net14": "32:1d:4b:af:70:30",
            "net15": "22:46:1d:6f:b2:b1",
            "net16": "0e:6a:ae:b9:f0:cd",
            "net17": "8a:04:48:82:fd:e4",
            "net18": "0a:d5:02:74:41:03",
            "net19": "e6:bb:94:4d:82:cc",
            "net2": "3e:dc:a4:54:ff:d1",
            "net20": "fe:4c:84:df:68:8a",
            "net21": "1e:8b:f2:d9:16:83",
            "net22": "12:b4:60:cb:85:ba",
            "net23": "aa:8f:3a:23:59:fd",
            "net24": "9e:20:17:92:c5:5c",
            "net25": "f2:98:3d:e0:4f:dd",
            "net26": "9e:35:5a:d0:59:c0",
            "net27": "6e:b5:c8:09:da:df",
            "net28": "ea:1e:db:da:f7:64",
            "net29": "4a:cc:a2:01:78:f8",
            "net3": "be:e9:03:17:e9:b5",
            "net30": "92:49:ea:ed:84:ae",
            "net31": "e2:4d:20:39:f4:8d",
            "net4": "d6:b0:9c:f1:8e:d0",
            "net5": "5e:d2:7b:47:da:b3",
            "net6": "6e:de:68:38:fd:5d",
            "net7": "9a:34:52:4b:1c:55",
            "net8": "c2:17:d5:a0:08:8a",
            "net9": "3a:3c:de:03:a6:29"
        },
        "spine_1_1_7": {
            "net0": "12:5c:33:27:64:30",
            "net1": "6e:c1:97:5d:b3:48",
            "net10": "e6:cd:97:d7:5c:bb",
            "net11": "82:79:8c:ae:b5:59",
            "net12": "96:30:c3:c6:62:fc",
            "net13": "fe:7c:84:45:40:87",
            "net14": "96:bc:16:c9:0b:5a",
            "net15": "b6:65:eb:00:f6:bc",
            "net16": "ea:7f:af:08:99:ec",
            "net17": "a6:14:46:6e:d8:ed",
            "net18": "1e:19:11:53:38:1a",
            "net19": "da:74:ea:46:62:5a",
            "net2": "0a:46:ac:0a:fd:3a",
            "net20": "7a:e7:af:e6:9f:3f",
            "net21": "96:2b:5b:9f:13:5a",
            "net22": "aa:21:4b:e2:37:2e",
            "net23": "06:7a:6d:23:1c:08",
            "net24": "f6:1c:dc:cd:02:9d",
            "net25": "e2:b2:3e:58:4a:9d",
            "net26": "06:dd:d9:f6:d4:42",
            "net27": "3e:32:8e:aa:d6:69",
            "net28": "7e:5b:69:26:b7:20",
            "net29": "72:cf:1b:93:d0:3c",
            "net3": "ae:86:24:e4:39:31",
            "net30": "6a:d9:4a:34:93:89",
            "net31": "6e:f7:d8:d6:c0:10",
            "net4": "ba:e9:fb:0a:4b:b8",
            "net5": "8a:0b:e1:a8:51:11",
            "net6": "66:db:ea:58:55:03",
            "net7": "2a:7b:41:d0:ec:22",
            "net8": "62:d3:4a:9e:eb:25",
            "net9": "9e:a4:51:cb:dd:9f"
        },
        "spine_1_1_8": {
            "net0": "4e:8a:2b:ff:bf:1f",
            "net1": "12:d0:ee:f4:94:e2",
            "net10": "46:80:03:57:7a:10",
            "net11": "2e:5d:d7:6f:45:1f",
            "net12": "56:a9:05:ad:63:51",
            "net13": "a6:3a:8b:69:c2:f0",
            "net14": "aa:7a:97:78:f1:6e",
            "net15": "de:d5:b6:b5:7f:7b",
            "net16": "82:80:82:0e:45:c5",
            "net17": "b2:d7:3a:08:d1:d4",
            "net18": "ba:9f:e0:33:9e:78",
            "net19": "c6:fe:4a:18:2d:72",
            "net2": "36:89:a2:2d:72:ec",
            "net20": "46:f1:2b:8a:88:47",
            "net21": "ea:bb:4c:5e:b1:cc",
            "net22": "32:de:32:34:02:68",
            "net23": "2e:77:d4:57:7a:2e",
            "net24": "ca:35:d5:2b:01:02",
            "net25": "ae:36:32:73:87:18",
            "net26": "aa:e0:c8:80:a2:ff",
            "net27": "fe:dd:bd:c0:ed:fc",
            "net28": "aa:49:5d:fb:51:0e",
            "net29": "32:5f:7f:72:88:c6",
            "net3": "86:e3:f7:8a:90:4b",
            "net30": "72:94:52:3e:41:d6",
            "net31": "42:28:93:c4:39:0e",
            "net4": "be:07:69:f6:4a:85",
            "net5": "d2:0a:5c:9e:af:0a",
            "net6": "22:29:a2:48:d5:63",
            "net7": "1e:fb:83:7c:2c:b3",
            "net8": "76:87:f1:4e:03:57",
            "net9": "d2:61:80:d0:6e:b0"
        },
        "spine_1_1_9": {
            "net0": "7a:a3:2b:32:ac:a7",
            "net1": "da:dd:a0:5f:b8:9f",
            "net10": "da:fd:83:85:ec:2d",
            "net11": "ca:56:f0:7d:4c:2a",
            "net12": "02:c0:fb:f9:b2:4d",
            "net13": "d2:3b:ca:fc:9f:f9",
            "net14": "2e:6d:b1:ea:4c:a5",
            "net15": "7e:b7:e2:26:97:52",
            "net16": "aa:1f:7e:89:b8:17",
            "net17": "4a:c5:f5:12:ee:4d",
            "net18": "36:17:43:ce:36:32",
            "net19": "36:c6:24:ba:84:a7",
            "net2": "02:e4:56:16:29:9f",
            "net20": "42:da:9a:07:59:fc",
            "net21": "06:5b:92:92:57:33",
            "net22": "5a:05:fa:6b:7b:b7",
            "net23": "be:0b:6f:9f:d6:58",
            "net24": "7e:ca:ae:b3:ad:0c",
            "net25": "de:cf:9e:33:4a:18",
            "net26": "06:08:68:4c:4c:b2",
            "net27": "86:b3:0d:cd:f5:bd",
            "net28": "ee:77:4c:dd:b1:61",
            "net29": "62:89:0a:4a:f3:9a",
            "net3": "9e:89:cf:9b:8c:50",
            "net30": "d2:00:d1:08:d3:c8",
            "net31": "fe:24:15:25:e8:7b",
            "net4": "de:f4:68:25:6a:e9",
            "net5": "e6:53:ee:75:44:09",
            "net6": "56:44:71:d5:3c:69",
            "net7": "0e:61:88:92:54:e0",
            "net8": "f2:15:18:33:98:aa",
            "net9": "56:c7:21:b2:5e:f9"
        },
        "spine_2_1_1": {
            "net0": "46:10:4c:7b:16:75",
            "net1": "1a:2c:e6:5a:35:41",
            "net10": "d2:6e:71:91:5f:6e",
            "net11": "82:df:14:fb:de:54",
            "net12": "8e:61:1d:3a:19:1e",
            "net13": "3e:6e:9a:f5:7b:31",
            "net14": "fa:1e:97:bb:bf:67",
            "net15": "be:63:40:88:b7:b0",
            "net16": "52:ff:24:62:a1:96",
            "net17": "96:5a:54:b7:08:59",
            "net18": "ce:86:bf:fd:9c:04",
            "net19": "66:a6:57:70:57:f7",
            "net2": "22:eb:f8:39:59:23",
            "net20": "72:e8:17:f2:2e:6c",
            "net21": "f6:8e:ca:3d:c5:4a",
            "net22": "0e:3f:53:29:80:46",
            "net23": "ea:73:f7:21:33:1a",
            "net24": "36:53:69:20:28:f7",
            "net25": "06:ea:a1:33:26:51",
            "net26": "7e:d9:96:cd:e2:0b",
            "net27": "4e:3b:1f:e5:41:27",
            "net28": "16:36:04:4f:79:e9",
            "net29": "82:84:51:a5:43:44",
            "net3": "ea:8c:14:22:b3:35",
            "net30": "7a:3c:06:7e:b4:63",
            "net31": "0a:14:d6:91:90:f2",
            "net4": "fa:9b:77:34:f9:2f",
            "net5": "a2:e1:c6:72:ca:b3",
            "net6": "0e:2a:0e:d6:46:7f",
            "net7": "d2:95:57:cc:ee:f1",
            "net8": "5a:85:09:5a:dc:60",
            "net9": "32:96:a1:2b:3a:28"
        },
        "spine_2_1_10": {
            "net0": "82:a0:0b:f8:a3:f2",
            "net1": "f2:68:76:37:bd:97",
            "net10": "0a:61:78:8d:ff:0d",
            "net11": "72:38:fd:95:e0:04",
            "net12": "66:2c:40:26:f7:7b",
            "net13": "b6:4b:7e:c8:45:b1",
            "net14": "ee:cd:57:b1:bc:33",
            "net15": "6e:10:3c:a0:4d:88",
            "net16": "ae:d3:ce:17:14:8b",
            "net17": "62:19:96:85:2d:54",
            "net18": "02:83:cb:52:45:c3",
            "net19": "12:41:2e:43:3f:81",
            "net2": "0a:0a:2b:5f:b3:ff",
            "net20": "ee:65:ad:48:08:30",
            "net21": "ae:95:fb:5e:15:3c",
            "net22": "ea:f8:da:90:b9:e8",
            "net23": "0a:25:cc:3a:97:a9",
            "net24": "52:c7:c5:a8:f9:04",
            "net25": "a6:2e:83:99:74:b3",
            "net26": "0a:66:07:62:46:13",
            "net27": "ae:20:4a:40:04:48",
            "net28": "fa:ae:08:4e:06:e1",
            "net29": "36:2c:43:1b:a8:1c",
            "net3": "16:ec:52:60:33:70",
            "net30": "42:c4:e6:6d:d5:e2",
            "net31": "3a:3f:c9:b3:97:56",
            "net4": "52:bc:06:ed:02:74",
            "net5": "3a:b4:e4:c2:35:d1",
            "net6": "02:9b:53:9e:15:c3",
            "net7": "fa:0f:79:e2:a5:6c",
            "net8": "1e:83:cd:b1:8b:d0",
            "net9": "e6:da:6a:d0:90:47"
        },
        "spine_2_1_11": {
            "net0": "56:41:5e:c0:3f:b4",
            "net1": "36:d8:03:5f:1b:13",
            "net10": "d6:13:56:86:96:9c",
            "net11": "02:5d:1b:8f:a4:e1",
            "net12": "a2:70:05:ca:72:a9",
            "net13": "4e:5b:20:6c:00:01",
            "net14": "ca:94:4b:cc:14:c1",
            "net15": "0a:47:78:64:71:57",
            "net16": "3a:0f:21:a8:0c:08",
            "net17": "3e:4c:5b:03:ca:07",
            "net18": "ce:c0:aa:39:74:19",
            "net19": "0a:42:c5:8e:95:f4",
            "net2": "3a:67:56:cd:64:ef",
            "net20": "26:d5:5b:65:ca:f7",
            "net21": "be:8a:55:49:f3:22",
            "net22": "ee:ed:49:db:19:e9",
            "net23": "56:4a:ee:2d:aa:6f",
            "net24": "ae:f0:1e:67:0b:c8",
            "net25": "56:b2:bf:5d:d8:ca",
            "net26": "aa:19:30:7f:63:42",
            "net27": "ea:4b:74:1a:cd:00",
            "net28": "3a:40:cd:d8:0e:55",
            "net29": "e2:25:7f:5c:d8:19",
            "net3": "6a:85:b4:8d:11:73",
            "net30": "76:30:86:9c:d7:94",
            "net31": "8e:21:f9:08:8b:6e",
            "net4": "ba:ed:d7:13:58:53",
            "net5": "2a:04:1b:c4:86:27",
            "net6": "ae:58:86:77:35:da",
            "net7": "b6:e7:ba:c6:53:6f",
            "net8": "1a:b5:52:46:88:f5",
            "net9": "52:93:a5:3b:f5:b1"
        },
        "spine_2_1_12": {
            "net0": "86:35:35:ec:3f:ac",
            "net1": "4a:54:a6:04:54:3f",
            "net10": "42:20:97:54:92:19",
            "net11": "b2:fb:0a:aa:f7:f9",
            "net12": "d6:ff:45:bc:46:b6",
            "net13": "7e:26:5d:bf:ce:f2",
            "net14": "36:ab:df:ea:c9:bd",
            "net15": "c6:2c:8b:2b:1d:c4",
            "net16": "42:e6:ca:0f:01:85",
            "net17": "6e:68:f1:fe:bb:ee",
            "net18": "ea:64:84:a7:f0:5e",
            "net19": "72:17:cf:5b:cb:34",
            "net2": "62:e7:c0:68:3b:24",
            "net20": "ae:fe:59:36:a2:ee",
            "net21": "2e:5c:37:b4:07:b0",
            "net22": "16:d2:31:28:25:b7",
            "net23": "aa:c3:71:b6:34:ba",
            "net24": "aa:ae:be:81:1b:5f",
            "net25": "2e:2d:f4:b2:df:3b",
            "net26": "72:1b:f8:6e:b3:46",
            "net27": "82:a6:cb:56:40:91",
            "net28": "42:3b:7a:af:be:d2",
            "net29": "6e:7e:6e:de:c0:8f",
            "net3": "b6:0e:4b:94:8c:59",
            "net30": "92:a1:af:8c:d1:5b",
            "net31": "56:8b:86:3d:88:c7",
            "net4": "aa:58:9d:3c:f7:51",
            "net5": "76:0f:e8:7c:a0:48",
            "net6": "9a:96:ad:41:40:51",
            "net7": "3e:14:10:b0:36:c3",
            "net8": "22:3a:73:a7:db:ec",
            "net9": "8a:fa:4a:0c:12:75"
        },
        "spine_2_1_13": {
            "net0": "2e:5c:63:21:9c:17",
            "net1": "ae:e7:07:59:96:52",
            "net10": "56:74:9e:85:6d:81",
            "net11": "b6:0f:2f:61:7a:f3",
            "net12": "ca:ec:f6:29:50:33",
            "net13": "a2:37:7b:98:fc:ed",
            "net14": "b2:e6:3b:b3:12:fb",
            "net15": "f6:a6:be:d1:58:6b",
            "net16": "8e:0d:23:83:2c:9b",
            "net17": "4e:7d:5b:14:29:f7",
            "net18": "6e:6c:f3:c5:f6:c3",
            "net19": "16:d6:80:54:f7:ea",
            "net2": "4e:cf:6f:ea:cb:a8",
            "net20": "1e:b2:d2:fe:a9:92",
            "net21": "be:d5:07:3d:ff:b8",
            "net22": "3a:f4:ec:8a:6e:ca",
            "net23": "9a:5e:99:bd:31:af",
            "net24": "86:0b:3a:37:a4:e4",
            "net25": "62:bc:e7:ab:5d:93",
            "net26": "62:a3:61:26:26:ee",
            "net27": "72:11:63:22:76:f3",
            "net28": "6a:07:de:88:49:83",
            "net29": "a2:bc:32:f8:3f:6d",
            "net3": "d6:ea:39:e0:05:59",
            "net30": "56:8e:17:52:61:53",
            "net31": "3e:44:bb:84:fc:f3",
            "net4": "ba:c3:de:a1:96:68",
            "net5": "7e:71:20:df:ae:53",
            "net6": "ca:9c:3a:9c:3c:40",
            "net7": "8e:f5:6d:81:e0:7b",
            "net8": "32:dd:ea:a4:a1:f3",
            "net9": "46:d4:34:9a:2e:2e"
        },
        "spine_2_1_14": {
            "net0": "ee:47:b8:eb:d8:6f",
            "net1": "4a:dd:98:27:a0:86",
            "net10": "fa:76:82:3d:65:fa",
            "net11": "2a:25:90:4e:26:76",
            "net12": "82:ab:2e:66:f5:29",
            "net13": "2a:f6:fa:9d:90:26",
            "net14": "a2:40:76:1e:13:b7",
            "net15": "0a:33:19:8f:36:a8",
            "net16": "f6:9c:57:6f:6f:43",
            "net17": "8a:ed:53:4b:24:83",
            "net18": "ae:92:8f:78:74:4d",
            "net19": "32:0a:e8:7d:a0:9c",
            "net2": "46:88:26:3f:9e:48",
            "net20": "26:09:74:bf:72:ee",
            "net21": "82:69:c2:78:c1:25",
            "net22": "02:02:40:a9:1f:1b",
            "net23": "d6:3a:2d:ec:19:5a",
            "net24": "6a:74:ac:e6:3c:05",
            "net25": "ba:33:49:b9:f3:05",
            "net26": "8e:c8:09:f4:9d:c6",
            "net27": "ba:8a:85:6d:3f:4e",
            "net28": "06:3d:8a:11:f7:35",
            "net29": "12:8e:cb:69:01:13",
            "net3": "0a:47:21:15:7b:7d",
            "net30": "fa:4d:e2:30:9d:fe",
            "net31": "b6:af:97:7d:2a:68",
            "net4": "36:97:13:25:52:77",
            "net5": "d2:12:ab:02:26:95",
            "net6": "06:25:27:ef:de:52",
            "net7": "7a:3f:d9:21:a8:59",
            "net8": "0a:c0:bd:5b:82:c9",
            "net9": "b6:07:68:77:ff:a1"
        },
        "spine_2_1_15": {
            "net0": "12:88:01:38:f2:8e",
            "net1": "e6:3e:56:33:67:19",
            "net10": "d2:03:65:bb:ab:b5",
            "net11": "8e:ca:1f:03:82:56",
            "net12": "e6:25:28:00:e1:78",
            "net13": "6a:03:71:c1:53:76",
            "net14": "1e:cc:4a:a9:f2:9a",
            "net15": "9e:fc:12:a8:4d:03",
            "net16": "ce:e0:8c:cd:eb:d0",
            "net17": "76:a2:a8:6e:ed:84",
            "net18": "d2:e0:d0:2c:f6:6b",
            "net19": "b6:fb:86:32:6f:f3",
            "net2": "56:6a:70:05:4c:44",
            "net20": "46:7b:99:5a:73:62",
            "net21": "9a:27:5d:48:88:27",
            "net22": "d6:b7:71:8f:72:a5",
            "net23": "e6:bb:11:b1:bd:f9",
            "net24": "8e:b9:db:c3:d5:14",
            "net25": "62:f1:61:f1:58:92",
            "net26": "8e:d6:aa:cd:33:71",
            "net27": "62:e0:a8:31:29:61",
            "net28": "ce:7f:69:01:a7:ea",
            "net29": "4a:60:f4:4d:62:d9",
            "net3": "2a:77:b5:5e:1e:e2",
            "net30": "b6:b4:33:bd:48:8b",
            "net31": "fe:c0:e2:e9:e0:a6",
            "net4": "a6:ac:50:82:90:f7",
            "net5": "7a:80:10:b1:4a:cc",
            "net6": "7a:16:6f:c1:b2:d2",
            "net7": "0e:bf:be:d8:28:0c",
            "net8": "1e:06:d8:ee:24:a6",
            "net9": "62:ff:26:88:be:3b"
        },
        "spine_2_1_16": {
            "net0": "0a:cb:40:ef:77:ab",
            "net1": "ba:cb:67:da:c1:34",
            "net10": "de:83:67:3f:ee:f2",
            "net11": "4a:42:bc:09:a6:b2",
            "net12": "7e:d3:95:5a:43:a9",
            "net13": "e6:4f:99:42:1e:37",
            "net14": "fa:6c:6f:bb:3b:de",
            "net15": "ee:52:c4:b6:2f:04",
            "net16": "7a:6f:70:d0:df:c9",
            "net17": "ae:c7:43:2d:c8:c6",
            "net18": "fe:6f:ac:8a:c9:82",
            "net19": "3a:e6:83:34:59:64",
            "net2": "76:dc:e0:ae:ef:2a",
            "net20": "72:8c:fa:9f:da:96",
            "net21": "ee:17:65:9f:f5:b2",
            "net22": "a6:31:40:5d:17:b0",
            "net23": "62:0f:7e:93:b5:b4",
            "net24": "52:43:b5:b8:55:47",
            "net25": "62:fa:ff:b9:01:9a",
            "net26": "9e:93:66:a6:51:a5",
            "net27": "1e:b9:0f:95:ab:a0",
            "net28": "72:57:26:b9:75:c8",
            "net29": "0e:4c:7c:e6:f8:f4",
            "net3": "a6:87:2f:45:6a:11",
            "net30": "86:f3:1a:e9:1b:0a",
            "net31": "2e:29:c8:c0:5f:ff",
            "net4": "f2:4b:10:3e:8b:28",
            "net5": "9e:ca:d7:7e:f3:90",
            "net6": "aa:0a:91:be:e9:c9",
            "net7": "e6:a4:3e:c0:16:ad",
            "net8": "0a:a8:90:61:d5:1d",
            "net9": "12:f8:ed:71:9e:b7"
        },
        "spine_2_1_2": {
            "net0": "f6:66:b7:f4:f4:b2",
            "net1": "1e:0b:14:9a:63:24",
            "net10": "76:21:76:05:f3:14",
            "net11": "52:bd:43:92:01:17",
            "net12": "1e:cb:77:f4:da:b1",
            "net13": "4e:95:2d:ee:f8:8c",
            "net14": "fa:46:28:df:cb:85",
            "net15": "c6:4f:d7:f2:1f:f6",
            "net16": "76:4c:fe:fe:42:d6",
            "net17": "46:41:a0:8e:99:6a",
            "net18": "8e:a5:a8:f2:7f:29",
            "net19": "56:87:97:f7:83:1f",
            "net2": "56:82:ef:3d:db:5a",
            "net20": "6e:bd:6e:e7:f7:e0",
            "net21": "b2:9f:85:a5:ef:66",
            "net22": "e2:a6:66:5c:30:63",
            "net23": "2e:51:7c:5c:2f:a7",
            "net24": "2e:da:22:40:79:2b",
            "net25": "e2:a8:12:c3:b1:d7",
            "net26": "02:22:55:17:33:bd",
            "net27": "6e:5d:5f:ff:76:77",
            "net28": "fe:a7:51:1d:c2:39",
            "net29": "3a:4f:c4:20:fd:30",
            "net3": "0a:46:be:f1:a7:d6",
            "net30": "6e:99:18:25:a5:50",
            "net31": "b6:36:d4:59:23:3e",
            "net4": "ce:b4:fb:f3:bb:02",
            "net5": "c6:b9:d6:2a:cd:02",
            "net6": "8a:df:8d:d0:b1:a4",
            "net7": "92:ea:4d:5f:80:46",
            "net8": "8a:f5:be:c8:f1:9d",
            "net9": "8a:26:7e:bb:ad:6d"
        },
        "spine_2_1_3": {
            "net0": "56:c1:28:88:8d:99",
            "net1": "3e:2f:2e:0a:c7:57",
            "net10": "ee:cd:fd:e2:55:54",
            "net11": "0a:a1:79:e1:2e:23",
            "net12": "06:78:4c:7c:48:8a",
            "net13": "aa:43:98:2b:b1:cf",
            "net14": "5a:d3:36:ef:30:c5",
            "net15": "b6:d1:6e:67:1a:e1",
            "net16": "66:38:5d:f4:bd:c6",
            "net17": "5e:b5:2b:9d:5b:5f",
            "net18": "4e:e1:ed:21:46:51",
            "net19": "66:13:de:ae:2e:f6",
            "net2": "d2:b1:65:70:4c:f8",
            "net20": "96:24:53:05:a1:e9",
            "net21": "36:6b:09:a8:b8:f2",
            "net22": "8e:9a:e9:1f:59:ba",
            "net23": "ea:b4:df:79:f6:ec",
            "net24": "76:df:9d:57:e6:cd",
            "net25": "d2:8c:f3:91:0a:10",
            "net26": "da:39:a3:8a:c9:26",
            "net27": "32:ec:38:83:79:7d",
            "net28": "8a:3c:24:22:69:cf",
            "net29": "d6:2f:eb:ad:18:10",
            "net3": "ee:e4:fc:4e:1b:90",
            "net30": "96:28:c4:71:3d:c8",
            "net31": "aa:c1:7e:a2:8b:3a",
            "net4": "b6:12:cd:4e:c5:3f",
            "net5": "3a:7d:30:29:41:ce",
            "net6": "66:b6:01:a0:dd:65",
            "net7": "f6:20:a0:08:07:20",
            "net8": "fa:a4:04:20:78:4f",
            "net9": "ce:c7:8c:86:84:6f"
        },
        "spine_2_1_4": {
            "net0": "36:b6:68:e4:b6:df",
            "net1": "2a:98:66:d8:bf:cf",
            "net10": "26:e8:4e:e1:8b:24",
            "net11": "6e:e6:69:1a:80:c9",
            "net12": "4a:fa:0e:16:ba:58",
            "net13": "c6:d1:59:ff:1f:37",
            "net14": "1e:02:1d:20:7c:07",
            "net15": "5e:27:e5:cd:cc:1f",
            "net16": "fa:fa:bd:96:48:ff",
            "net17": "de:3d:09:79:ea:b5",
            "net18": "c2:ee:be:a1:b5:a0",
            "net19": "ce:3c:f8:58:cc:71",
            "net2": "5e:09:bc:51:9c:76",
            "net20": "8e:03:aa:4c:ac:52",
            "net21": "3e:a0:4d:79:be:00",
            "net22": "6a:b6:af:0c:18:e7",
            "net23": "2e:ee:cf:68:15:4d",
            "net24": "da:65:3c:37:c1:b2",
            "net25": "b2:03:c4:82:a1:98",
            "net26": "16:8f:ee:e9:66:35",
            "net27": "de:82:ee:ae:ef:2c",
            "net28": "72:62:83:4a:fe:d8",
            "net29": "26:97:45:d3:e6:c7",
            "net3": "be:a3:d4:a5:2c:46",
            "net30": "7e:da:18:95:aa:ec",
            "net31": "72:5e:a4:79:78:e0",
            "net4": "d6:be:c7:e2:cd:a8",
            "net5": "36:bd:51:4f:aa:e2",
            "net6": "62:48:c3:0f:73:21",
            "net7": "de:16:ce:3c:f2:bd",
            "net8": "ca:bb:c2:9c:1a:29",
            "net9": "ee:3d:a5:34:3b:57"
        },
        "spine_2_1_5": {
            "net0": "2e:c1:a8:7e:ec:07",
            "net1": "12:e0:56:b7:7e:3c",
            "net10": "9e:e5:0d:6f:6f:e4",
            "net11": "d2:d3:12:b9:2e:3b",
            "net12": "ba:12:e1:98:73:f0",
            "net13": "fa:7d:88:f8:f2:42",
            "net14": "c2:9d:72:9c:1c:89",
            "net15": "f2:8c:98:e7:ac:6f",
            "net16": "2a:ed:07:78:20:b9",
            "net17": "8a:22:fe:ed:bb:47",
            "net18": "ae:b9:12:5f:64:53",
            "net19": "3e:48:ff:60:6a:ec",
            "net2": "9a:b7:de:b6:77:4e",
            "net20": "62:9c:3a:e7:e6:cc",
            "net21": "a6:a1:29:4c:e5:c8",
            "net22": "46:41:09:01:3a:18",
            "net23": "e6:99:43:28:82:60",
            "net24": "5a:b1:2e:42:75:28",
            "net25": "82:e9:0a:76:ce:c6",
            "net26": "36:ee:4f:94:c3:3d",
            "net27": "c6:24:ea:d8:dd:51",
            "net28": "e2:01:6b:bf:fc:a1",
            "net29": "66:5a:ca:83:ed:d3",
            "net3": "82:c2:ed:d4:54:21",
            "net30": "6a:cf:a3:55:0d:66",
            "net31": "f6:bb:38:0a:15:5b",
            "net4": "86:34:37:d0:4c:9d",
            "net5": "46:6d:da:16:86:b6",
            "net6": "f6:fe:73:1e:76:d8",
            "net7": "f6:1c:6d:ce:b6:55",
            "net8": "02:d9:0b:67:52:25",
            "net9": "76:b6:8c:dc:06:17"
        },
        "spine_2_1_6": {
            "net0": "92:b2:8c:66:81:4d",
            "net1": "3e:77:88:bc:6f:d3",
            "net10": "9e:e9:32:21:71:cc",
            "net11": "86:da:8e:fe:24:b5",
            "net12": "36:a0:6c:08:e1:e0",
            "net13": "16:35:03:98:0e:5b",
            "net14": "16:b1:75:60:6d:ed",
            "net15": "e6:e0:40:4f:fb:cb",
            "net16": "ce:49:e0:fe:30:cd",
            "net17": "22:e8:0f:44:8e:0c",
            "net18": "e6:51:7f:11:65:43",
            "net19": "06:e6:4f:4d:06:46",
            "net2": "1e:17:b8:8f:d5:3a",
            "net20": "f2:d4:fc:07:aa:fd",
            "net21": "02:e7:14:89:ac:d9",
            "net22": "76:27:6f:45:aa:86",
            "net23": "3a:b3:cf:18:98:03",
            "net24": "7a:18:6e:51:9c:bf",
            "net25": "c6:55:b2:df:15:19",
            "net26": "02:af:a0:51:b3:3b",
            "net27": "82:7c:87:f0:f4:b3",
            "net28": "2e:00:ee:94:71:bf",
            "net29": "92:18:c1:93:52:73",
            "net3": "de:da:09:1d:08:82",
            "net30": "9e:2d:f4:ea:07:d9",
            "net31": "36:6b:82:5d:3e:da",
            "net4": "ce:d7:f5:be:fc:cb",
            "net5": "5a:ac:dd:74:0a:f3",
            "net6": "76:bc:bc:f1:1b:9b",
            "net7": "02:b1:91:9c:37:d9",
            "net8": "26:57:27:3d:cc:6d",
            "net9": "96:d5:3b:90:84:67"
        },
        "spine_2_1_7": {
            "net0": "a6:02:4b:39:a0:0a",
            "net1": "12:77:fd:e3:e8:c8",
            "net10": "22:93:ea:25:c2:0a",
            "net11": "56:1f:7c:b1:aa:02",
            "net12": "62:5d:f5:bf:41:75",
            "net13": "a6:07:e4:f3:99:33",
            "net14": "56:4b:0f:6f:e0:c3",
            "net15": "a6:b6:2e:df:41:c2",
            "net16": "36:2f:03:88:15:55",
            "net17": "8e:6d:7f:01:f8:17",
            "net18": "02:1a:fe:0c:65:2a",
            "net19": "a6:55:eb:32:f3:e9",
            "net2": "fe:02:98:26:4d:0f",
            "net20": "72:fe:ac:7c:61:1b",
            "net21": "ee:49:25:45:5f:75",
            "net22": "d6:e8:3b:34:c5:78",
            "net23": "be:dc:2b:1d:6d:37",
            "net24": "a2:8f:f5:25:78:a7",
            "net25": "3e:ba:61:85:85:89",
            "net26": "82:8a:0d:b6:34:34",
            "net27": "2a:ec:50:32:a4:06",
            "net28": "aa:4a:ce:27:72:d7",
            "net29": "46:43:b7:a3:e5:d2",
            "net3": "96:6e:29:d9:a8:b7",
            "net30": "be:d6:99:f2:94:aa",
            "net31": "c2:69:e4:2e:6d:3f",
            "net4": "3a:49:59:86:a7:5a",
            "net5": "82:57:ee:5f:a7:36",
            "net6": "76:f3:39:6c:2b:de",
            "net7": "b6:7a:fb:50:3f:5b",
            "net8": "2e:d1:91:ea:fc:99",
            "net9": "e6:0a:5d:d5:30:6a"
        },
        "spine_2_1_8": {
            "net0": "72:84:99:22:bd:c2",
            "net1": "b2:9d:cb:4b:d4:fd",
            "net10": "8e:bd:fc:3a:c1:0a",
            "net11": "26:ee:c5:e5:90:11",
            "net12": "ea:08:e9:65:71:7e",
            "net13": "c2:99:ba:87:44:e0",
            "net14": "d6:95:2c:81:26:1a",
            "net15": "52:18:0f:79:4d:8c",
            "net16": "72:92:b1:a9:ca:f2",
            "net17": "4e:54:20:be:8a:74",
            "net18": "be:77:14:39:98:70",
            "net19": "92:eb:bb:3b:c0:67",
            "net2": "16:35:52:89:bc:8e",
            "net20": "e2:38:ff:77:c9:e8",
            "net21": "16:f2:50:eb:6a:a5",
            "net22": "0e:65:de:e2:ef:79",
            "net23": "da:d0:1b:e5:6e:4b",
            "net24": "36:9a:19:ac:cc:a9",
            "net25": "6a:e7:e0:af:ba:9a",
            "net26": "5a:05:d2:23:3d:d2",
            "net27": "3a:de:4c:f7:8a:f5",
            "net28": "86:8a:bb:6a:ba:97",
            "net29": "46:a2:8c:ce:01:35",
            "net3": "6a:ed:76:1e:37:ac",
            "net30": "36:a6:3e:11:9a:37",
            "net31": "8e:e0:99:bd:2a:bd",
            "net4": "d6:74:7c:7e:6d:56",
            "net5": "36:58:8a:e2:f9:a5",
            "net6": "d6:2d:44:82:a1:a8",
            "net7": "7a:21:7a:29:41:0d",
            "net8": "ba:7e:2d:79:83:62",
            "net9": "46:a2:34:c0:46:01"
        },
        "spine_2_1_9": {
            "net0": "be:ec:7c:76:8d:f4",
            "net1": "7a:55:9b:64:ce:99",
            "net10": "a6:f5:ca:16:46:41",
            "net11": "9a:5f:ae:82:6e:47",
            "net12": "ca:b6:87:3f:dd:3c",
            "net13": "f2:3d:cf:5a:19:5e",
            "net14": "2e:d2:49:8d:24:ac",
            "net15": "92:b9:f8:ef:0b:bd",
            "net16": "ee:36:13:d4:1b:e3",
            "net17": "e2:6b:ff:1e:dc:cc",
            "net18": "82:80:ed:be:da:96",
            "net19": "b2:ce:1e:4c:12:bc",
            "net2": "fe:c4:ab:db:f8:1e",
            "net20": "72:d0:36:cf:e1:f7",
            "net21": "82:50:51:fd:5c:04",
            "net22": "ea:f1:e4:46:9c:2e",
            "net23": "d6:44:c6:c2:50:0a",
            "net24": "d6:86:ba:b0:26:1a",
            "net25": "36:0d:f5:0e:02:de",
            "net26": "2e:10:65:16:a8:9f",
            "net27": "be:77:7c:fc:34:a6",
            "net28": "c6:8e:f0:fd:77:9a",
            "net29": "5a:18:91:64:5e:49",
            "net3": "7a:7b:09:e1:fa:20",
            "net30": "f2:b0:b2:8c:f7:6d",
            "net31": "3e:5d:4f:c8:ae:d1",
            "net4": "62:d1:3d:4f:ac:b5",
            "net5": "56:dc:96:7b:5c:93",
            "net6": "6e:16:e5:e1:f3:53",
            "net7": "fa:3c:42:a6:71:db",
            "net8": "ce:70:53:8c:ae:3d",
            "net9": "72:c0:6e:35:ff:74"
        },
        "tof_1_2_1": {
            "net0": "36:66:25:bb:7a:0a",
            "net1": "32:dc:a1:de:3d:32",
            "net10": "9e:ce:00:a4:a3:94",
            "net11": "5e:8d:13:a3:ca:f3",
            "net12": "9a:b3:b7:a5:d5:e4",
            "net13": "76:9e:bd:e2:a2:81",
            "net14": "4a:be:38:db:66:55",
            "net15": "92:a5:c2:36:1f:d5",
            "net16": "f2:20:4d:ff:2f:37",
            "net17": "1e:e7:b2:2e:16:fe",
            "net18": "0a:00:25:67:14:b5",
            "net19": "fa:79:98:be:b6:ac",
            "net2": "ee:03:fd:32:2f:7b",
            "net20": "62:0e:f1:86:6b:8c",
            "net21": "1e:da:fa:c3:e7:d4",
            "net22": "26:9f:a5:ff:27:dc",
            "net23": "ce:8a:aa:2f:8f:ab",
            "net24": "6e:8d:0c:4a:81:2f",
            "net25": "fa:1b:fc:15:5d:01",
            "net26": "1e:c9:83:57:d2:1a",
            "net27": "ea:d5:03:24:b0:ff",
            "net28": "56:3b:f7:8b:54:35",
            "net29": "9e:25:6a:63:60:d9",
            "net3": "56:fc:2a:3e:db:50",
            "net30": "3a:29:14:62:41:4c",
            "net31": "b2:6c:2c:b5:91:bf",
            "net4": "de:2a:c8:63:bd:94",
            "net5": "5a:98:81:01:26:db",
            "net6": "ae:30:dd:9c:c6:7d",
            "net7": "9a:93:59:52:0a:79",
            "net8": "3e:12:d2:69:d3:89",
            "net9": "ba:73:85:c0:a8:68"
        },
        "tof_1_2_10": {
            "net0": "02:0a:f6:73:e0:8e",
            "net1": "da:6a:9d:f2:21:f7",
            "net10": "ee:ab:d1:0c:fe:8d",
            "net11": "42:74:45:a8:c6:08",
            "net12": "c6:48:dc:23:62:82",
            "net13": "b2:1b:65:08:95:aa",
            "net14": "12:84:27:7c:93:af",
            "net15": "0e:80:45:02:2a:22",
            "net16": "66:a6:fe:45:51:a6",
            "net17": "9e:63:c7:42:81:46",
            "net18": "7a:be:3c:8c:8c:02",
            "net19": "a2:ca:04:d8:7a:22",
            "net2": "7a:6c:3d:fa:30:5a",
            "net20": "d6:92:49:d2:98:e8",
            "net21": "6e:33:72:a5:0e:b9",
            "net22": "62:c2:7e:34:7e:42",
            "net23": "1e:94:e6:64:d9:1c",
            "net24": "62:cf:83:08:3b:0c",
            "net25": "52:67:50:01:36:8f",
            "net26": "4e:f6:7d:a1:cc:80",
            "net27": "06:9a:18:35:67:e7",
            "net28": "b6:8e:89:5c:a9:31",
            "net29": "b2:a4:0a:1b:a1:c2",
            "net3": "3e:d5:11:e0:ab:1b",
            "net30": "82:58:c4:4f:12:46",
            "net31": "ea:bb:3c:b8:51:b6",
            "net4": "fa:b0:8d:55:2d:50",
            "net5": "ee:71:87:f4:ac:43",
            "net6": "7a:9e:5b:bb:87:c8",
            "net7": "46:3f:d0:d6:f0:6f",
            "net8": "ce:5d:62:8f:b4:7f",
            "net9": "12:4a:e2:94:e2:11"
        },
        "tof_1_2_11": {
            "net0": "5a:04:c0:33:00:36",
            "net1": "96:34:25:bd:d5:a9",
            "net10": "82:0e:42:e3:b5:d4",
            "net11": "d6:ee:12:ab:13:75",
            "net12": "de:5c:f7:0a:89:1c",
            "net13": "c2:a3:47:5f:2b:ed",
            "net14": "66:a3:ea:54:f2:24",
            "net15": "ca:ed:62:84:fc:82",
            "net16": "9a:d7:b4:4b:76:7c",
            "net17": "1e:14:c4:8a:b0:87",
            "net18": "96:9f:6d:ce:86:ec",
            "net19": "02:ca:1a:47:38:b0",
            "net2": "26:a1:42:78:60:60",
            "net20": "36:79:7b:4b:68:d7",
            "net21": "72:53:fb:05:e0:3d",
            "net22": "26:f1:a3:5a:79:65",
            "net23": "3e:59:c4:17:40:47",
            "net24": "1a:af:1f:84:88:7c",
            "net25": "ba:df:5c:16:21:ae",
            "net26": "8a:b7:5f:8e:ad:4b",
            "net27": "76:66:cc:2d:14:c8",
            "net28": "f2:3b:3c:43:66:08",
            "net29": "12:70:0b:24:bd:0a",
            "net3": "92:d3:7e:fb:af:41",
            "net30": "1a:97:c6:8a:38:d3",
            "net31": "c2:e1:07:8c:32:4e",
            "net4": "c6:27:d4:87:c2:61",
            "net5": "fa:a4:a9:4e:70:5f",
            "net6": "5e:65:b6:bc:be:cf",
            "net7": "4e:79:79:cf:63:c8",
            "net8": "be:61:ec:97:1a:cd",
            "net9": "1a:e9:0a:72:30:19"
        },
        "tof_1_2_12": {
            "net0": "fe:09:8d:b4:2e:51",
            "net1": "32:86:38:55:c7:9a",
            "net10": "92:e8:f4:cd:98:17",
            "net11": "8e:41:bc:54:cd:f1",
            "net12": "22:d6:73:b2:9b:7e",
            "net13": "d6:b6:3f:98:e2:72",
            "net14": "4e:63:7b:26:41:95",
            "net15": "46:8a:59:d2:6c:90",
            "net16": "ce:97:70:12:0d:d3",
            "net17": "76:ce:52:08:4d:48",
            "net18": "ae:f7:67:f4:59:d4",
            "net19": "8a:26:67:75:8d:2a",
            "net2": "82:65:14:16:bc:34",
            "net20": "22:75:ec:52:b8:dc",
            "net21": "ce:1b:cf:21:be:4b",
            "net22": "76:d4:9e:08:51:ef",
            "net23": "6a:ce:03:08:17:03",
            "net24": "fe:be:96:7e:06:3d",
            "net25": "52:48:6c:06:a8:22",
            "net26": "fa:4d:38:63:bd:3a",
            "net27": "b6:72:e4:9e:98:0a",
            "net28": "ee:fd:ab:6e:e4:f8",
            "net29": "3a:94:62:36:3d:ce",
            "net3": "16:40:80:f4:d0:f5",
            "net30": "be:d8:e9:6b:ad:1e",
            "net31": "de:b8:c9:e0:0c:4f",
            "net4": "2e:87:b6:dd:0d:1c",
            "net5": "9a:1f:dd:68:f0:4b",
            "net6": "aa:ed:cb:40:31:83",
            "net7": "42:5f:64:01:a6:63",
            "net8": "2a:7e:3e:9a:4c:72",
            "net9": "6a:82:f3:02:43:b9"
        },
        "tof_1_2_13": {
            "net0": "de:bc:32:99:c3:7e",
            "net1": "7a:7e:af:65:15:59",
            "net10": "7e:8a:dd:d5:1e:a4",
            "net11": "96:f5:66:93:87:19",
            "net12": "96:32:a5:fb:a2:58",
            "net13": "02:65:e6:7d:e6:d8",
            "net14": "26:0b:84:df:45:08",
            "net15": "8e:ca:5e:3d:cf:d2",
            "net16": "2e:15:d5:4f:37:10",
            "net17": "3a:c2:78:5e:c7:c5",
            "net18": "32:21:69:24:98:60",
            "net19": "12:83:75:1e:89:b7",
            "net2": "de:e7:b1:9c:a5:ea",
            "net20": "ee:b1:56:06:fe:62",
            "net21": "86:3c:a8:f9:90:38",
            "net22": "02:d2:dc:0f:c1:b8",
            "net23": "92:6c:16:2d:35:ec",
            "net24": "62:15:97:90:ab:ca",
            "net25": "52:49:91:4b:38:19",
            "net26": "fa:7d:fb:eb:48:12",
            "net27": "ae:f0:fc:3f:3b:53",
            "net28": "ba:bd:d2:16:15:e5",
            "net29": "ca:a0:63:8d:e4:10",
            "net3": "4e:c3:c9:bd:e7:e9",
            "net30": "76:e4:be:43:6a:69",
            "net31": "de:83:9b:d0:9e:72",
            "net4": "7e:f5:8e:01:0a:74",
            "net5": "56:84:89:1b:fe:4a",
            "net6": "3a:73:f4:0d:35:1e",
            "net7": "52:b5:8c:44:21:51",
            "net8": "7a:db:c2:b1:c4:f6",
            "net9": "2e:49:32:80:d2:e2"
        },
        "tof_1_2_14": {
            "net0": "2e:bc:03:48:cc:e5",
            "net1": "fa:c8:85:23:3e:b7",
            "net10": "e2:5c:c9:cd:e5:77",
            "net11": "36:08:1c:28:e7:20",
            "net12": "5a:aa:f9:75:5f:a0",
            "net13": "ee:98:5e:14:d7:49",
            "net14": "7a:54:17:4c:77:9d",
            "net15": "ce:83:21:51:91:d9",
            "net16": "be:13:a6:9b:0a:1d",
            "net17": "ee:4d:ff:8b:0f:31",
            "net18": "9a:02:55:ac:22:3b",
            "net19": "62:67:05:2e:e0:e5",
            "net2": "da:cd:35:e9:ad:3e",
            "net20": "5a:70:4d:5c:28:df",
            "net21": "ee:11:6f:93:dc:f0",
            "net22": "c6:f8:9d:2a:8f:87",
            "net23": "86:fa:36:29:a3:2a",
            "net24": "b6:5c:53:a0:f0:d6",
            "net25": "3a:66:1f:ef:9d:33",
            "net26": "66:c2:29:17:e0:76",
            "net27": "ae:28:57:4e:f3:10",
            "net28": "a2:6d:cf:06:8d:94",
            "net29": "72:91:93:dd:b2:ba",
            "net3": "fe:d6:cd:c2:1a:ce",
            "net30": "3e:6e:65:a1:de:1e",
            "net31": "da:69:c2:43:28:b3",
            "net4": "f2:53:b1:51:6a:2d",
            "net5": "36:e4:f5:6f:80:f9",
            "net6": "b6:f0:9b:9f:02:e4",
            "net7": "0a:e7:49:ed:47:52",
            "net8": "76:21:3e:d7:53:0a",
            "net9": "7e:f6:c5:e3:ba:50"
        },
        "tof_1_2_15": {
            "net0": "2e:d9:f0:0c:60:02",
            "net1": "da:b4:61:ab:c4:0c",
            "net10": "a2:44:58:bd:64:cb",
            "net11": "72:23:91:48:c7:a9",
            "net12": "fa:18:5d:ec:d3:bb",
            "net13": "4e:3a:9a:52:5c:9a",
            "net14": "f2:b6:8c:2b:e0:2d",
            "net15": "aa:75:22:a8:75:93",
            "net16": "9e:4e:6e:0d:f5:2a",
            "net17": "42:87:30:20:f2:ff",
            "net18": "c2:76:c7:06:74:3a",
            "net19": "9a:6c:63:07:97:18",
            "net2": "aa:18:a9:98:b4:34",
            "net20": "c6:68:b8:02:07:40",
            "net21": "46:5e:59:d2:fd:79",
            "net22": "62:c2:57:15:c1:88",
            "net23": "22:42:0a:57:7b:a6",
            "net24": "66:0a:fc:1f:c1:c8",
            "net25": "12:52:67:0d:81:41",
            "net26": "82:70:11:77:5a:68",
            "net27": "52:b4:a5:3c:6a:c3",
            "net28": "da:3b:66:6f:9f:3f",
            "net29": "a2:f8:32:54:a1:92",
            "net3": "8e:44:b9:c9:f0:50",
            "net30": "22:16:a7:9b:4d:73",
            "net31": "d2:c4:49:0d:a9:f7",
            "net4": "06:32:d6:af:9c:6a",
            "net5": "ba:c2:07:ff:4c:b4",
            "net6": "22:b9:49:7d:10:93",
            "net7": "de:8b:d1:0f:f7:31",
            "net8": "2e:3f:69:03:2b:a5",
            "net9": "72:6f:a8:83:3e:7f"
        },
        "tof_1_2_16": {
            "net0": "7a:49:f5:5a:fb:10",
            "net1": "de:5e:9e:66:13:90",
            "net10": "2e:b0:c2:7c:20:ad",
            "net11": "b6:ae:14:8f:8a:15",
            "net12": "66:d6:6a:4d:60:fe",
            "net13": "52:be:5e:23:3d:39",
            "net14": "56:bf:1c:ab:fe:47",
            "net15": "42:02:ce:d9:4f:ff",
            "net16": "4a:df:b2:11:ce:cf",
            "net17": "ca:44:af:c1:e8:68",
            "net18": "62:3d:d8:d4:2a:b2",
            "net19": "8e:54:3c:dd:eb:a6",
            "net2": "5e:5c:22:54:89:62",
            "net20": "ba:be:7f:70:80:95",
            "net21": "7a:d8:4b:3a:f9:23",
            "net22": "a2:c7:78:85:34:a7",
            "net23": "8a:f5:a3:e1:f2:bc",
            "net24": "c2:c7:72:8b:4e:2e",
            "net25": "76:e1:c1:ca:21:a3",
            "net26": "96:8b:e2:83:55:ac",
            "net27": "ba:1b:76:b9:cc:ad",
            "net28": "3a:e0:d4:14:ae:b5",
            "net29": "7a:0a:0f:5c:f3:df",
            "net3": "5a:65:7e:64:c3:29",
            "net30": "aa:dd:0a:40:10:7d",
            "net31": "ea:9b:10:c8:42:35",
            "net4": "7e:8c:14:f2:9e:b4",
            "net5": "ca:77:f1:68:e8:2b",
            "net6": "96:a8:57:3c:41:42",
            "net7": "f2:1a:e8:30:c6:cf",
            "net8": "4e:a2:2b:fe:00:62",
            "net9": "ce:db:18:ff:e7:c6"
        },
        "tof_1_2_2": {
            "net0": "86:86:fa:40:e1:8d",
            "net1": "6e:86:b5:23:4e:42",
            "net10": "2e:ee:9f:a8:d0:62",
            "net11": "6e:a6:14:38:5f:4b",
            "net12": "72:bd:82:5c:dc:bd",
            "net13": "f6:14:c8:3b:36:2f",
            "net14": "2a:1c:0f:9f:6d:6c",
            "net15": "f2:10:94:13:4d:67",
            "net16": "6e:fb:61:d3:45:d1",
            "net17": "da:40:8e:8c:fb:95",
            "net18": "be:8b:cb:5a:5d:0d",
            "net19": "ea:a1:71:f4:c1:18",
            "net2": "c6:29:c2:9a:ec:50",
            "net20": "1e:4b:5c:64:0c:a6",
            "net21": "ea:c6:d6:de:21:1b",
            "net22": "3e:7b:92:80:c3:73",
            "net23": "92:1c:ab:72:0b:c4",
            "net24": "76:6e:17:44:4e:d0",
            "net25": "96:0f:0e:8a:4f:aa",
            "net26": "b6:7b:64:17:f7:27",
            "net27": "12:ec:26:a2:ec:ae",
            "net28": "62:21:f0:49:10:e9",
            "net29": "8a:56:10:71:39:b8",
            "net3": "46:7a:ef:38:62:ad",
            "net30": "7e:0a:ce:60:07:94",
            "net31": "92:af:30:96:f0:e6",
            "net4": "be:5e:07:45:74:cb",
            "net5": "02:72:47:f2:be:60",
            "net6": "3e:ef:61:83:bf:0c",
            "net7": "ce:5e:d7:6c:66:05",
            "net8": "a6:50:f4:7b:b6:5c",
            "net9": "06:ca:a4:63:9f:70"
        },
        "tof_1_2_3": {
            "net0": "de:90:4d:6d:c3:d4",
            "net1": "4e:17:f4:f6:f3:fb",
            "net10": "9e:79:ba:64:30:1b",
            "net11": "12:a6:80:21:ff:5e",
            "net12": "4e:2e:e2:c5:d8:f7",
            "net13": "26:a5:30:6a:87:86",
            "net14": "26:de:8b:2a:9c:a6",
            "net15": "3e:4c:aa:bb:90:25",
            "net16": "52:7d:a6:a2:9b:53",
            "net17": "1e:6e:17:2c:ee:46",
            "net18": "66:37:62:6f:1d:a1",
            "net19": "36:c2:af:d0:be:3f",
            "net2": "ba:8e:29:d2:68:4f",
            "net20": "26:cf:83:e3:d4:08",
            "net21": "3a:f4:54:1f:fc:b9",
            "net22": "12:1a:ff:d7:a1:53",
            "net23": "02:19:01:ae:6b:82",
            "net24": "da:45:57:de:98:12",
            "net25": "2e:49:44:82:7e:9c",
            "net26": "2e:ea:aa:83:3a:94",
            "net27": "96:e7:2e:87:6c:2c",
            "net28": "da:e4:80:02:34:6c",
            "net29": "26:96:c7:d6:8d:48",
            "net3": "f2:eb:b0:50:d0:cc",
            "net30": "5a:6c:56:e9:4f:30",
            "net31": "5a:d8:a1:7f:78:00",
            "net4": "16:03:c8:d0:33:6e",
            "net5": "d6:58:1d:f9:e8:8d",
            "net6": "d6:71:06:f8:be:7a",
            "net7": "36:c4:fe:2a:8a:86",
            "net8": "a6:70:c3:06:7d:eb",
            "net9": "62:28:92:8e:bf:b9"
        },
        "tof_1_2_4": {
            "net0": "1a:a8:77:c8:ad:34",
            "net1": "d6:1c:07:3c:2a:a2",
            "net10": "6a:4c:e6:99:07:c5",
            "net11": "0a:b8:ff:d8:31:1a",
            "net12": "fe:a0:d5:e6:b7:24",
            "net13": "e6:9c:a8:b7:d8:ac",
            "net14": "ce:d8:25:e2:01:09",
            "net15": "ae:53:1e:95:8f:04",
            "net16": "0e:8d:8f:b8:15:6a",
            "net17": "86:7f:e8:4d:40:d5",
            "net18": "5e:02:49:01:3f:e6",
            "net19": "c2:df:5d:db:23:89",
            "net2": "7a:6f:11:53:98:56",
            "net20": "6a:5e:79:36:b0:f5",
            "net21": "ba:9e:76:5d:34:e1",
            "net22": "3a:32:81:1d:53:3e",
            "net23": "56:72:78:9c:d5:50",
            "net24": "6e:a1:64:83:d6:2e",
            "net25": "ca:9a:eb:1b:49:6f",
            "net26": "12:29:62:22:98:aa",
            "net27": "ea:fc:d2:7c:19:6d",
            "net28": "d6:b2:26:38:15:ba",
            "net29": "52:d4:84:b1:f1:c8",
            "net3": "c6:92:39:75:fd:57",
            "net30": "36:69:09:79:3c:61",
            "net31": "4a:6c:97:2c:7c:14",
            "net4": "22:af:58:e3:93:2a",
            "net5": "0e:8f:2e:18:f1:3a",
            "net6": "82:c4:21:03:97:c3",
            "net7": "02:b8:8d:aa:c6:40",
            "net8": "92:d2:c2:eb:b0:e3",
            "net9": "5a:f6:7b:6c:32:e0"
        },
        "tof_1_2_5": {
            "net0": "6a:0c:ce:f1:38:ba",
            "net1": "fa:46:12:74:3a:f4",
            "net10": "16:15:72:cf:54:8e",
            "net11": "4e:93:9f:e6:05:73",
            "net12": "12:f5:8b:9d:15:61",
            "net13": "7a:da:74:32:00:c9",
            "net14": "b2:57:68:12:7c:06",
            "net15": "52:e7:f6:7d:82:e1",
            "net16": "8e:a5:fa:80:2e:01",
            "net17": "2a:ca:9f:cd:7c:83",
            "net18": "c2:dd:c1:d3:fa:bf",
            "net19": "d2:33:89:db:13:96",
            "net2": "36:2a:5a:29:3a:32",
            "net20": "ba:47:9f:93:b0:ed",
            "net21": "76:82:99:74:33:2c",
            "net22": "1e:df:08:e8:54:90",
            "net23": "32:f1:1d:b1:06:0f",
            "net24": "16:0b:7c:8f:f3:c7",
            "net25": "e2:40:b8:d0:a3:13",
            "net26": "d2:40:a0:3b:36:3c",
            "net27": "12:f0:e8:4b:62:8d",
            "net28": "4e:8b:a3:30:ce:bb",
            "net29": "1a:30:15:d1:0c:9e",
            "net3": "c2:fc:76:41:a9:43",
            "net30": "92:1c:fe:e7:c4:7d",
            "net31": "ba:0d:fe:9d:0b:ca",
            "net4": "92:63:33:de:cd:f2",
            "net5": "aa:5b:1e:96:dd:7a",
            "net6": "f6:d5:25:6e:a4:2a",
            "net7": "0e:e2:6c:ce:60:9a",
            "net8": "f6:d5:a5:86:53:4f",
            "net9": "5e:a3:a9:41:ad:40"
        },
        "tof_1_2_6": {
            "net0": "ea:f8:2f:0e:36:8c",
            "net1": "fe:cb:b1:1a:94:2c",
            "net10": "a2:97:8c:33:89:fd",
            "net11": "f6:95:e9:d6:e3:69",
            "net12": "4a:e8:6a:04:e6:29",
            "net13": "5e:cf:3f:bb:ff:d3",
            "net14": "16:15:93:f7:86:09",
            "net15": "9a:a1:66:eb:47:ad",
            "net16": "92:9b:86:f1:a5:6f",
            "net17": "96:e5:67:1d:aa:f6",
            "net18": "ae:35:0f:08:51:32",
            "net19": "1a:9f:89:cd:97:c8",
            "net2": "e6:6c:b1:a3:14:7f",
            "net20": "de:05:df:f1:8c:3b",
            "net21": "d6:43:df:dc:11:e1",
            "net22": "86:42:cf:68:64:38",
            "net23": "16:e2:98:c5:87:ef",
            "net24": "b2:80:7f:08:da:10",
            "net25": "62:46:74:42:f2:7f",
            "net26": "7a:ad:66:6e:c4:ed",
            "net27": "a6:f5:de:98:41:8e",
            "net28": "5a:e0:b0:4b:7c:12",
            "net29": "1a:0e:10:f1:77:55",
            "net3": "82:2a:90:64:48:e9",
            "net30": "86:1f:dd:c7:2d:6e",
            "net31": "ca:1a:3d:69:be:80",
            "net4": "52:eb:14:b9:ca:ad",
            "net5": "5e:97:ce:cf:05:54",
            "net6": "f2:cd:20:68:d7:a6",
            "net7": "a6:32:11:41:51:be",
            "net8": "b2:39:86:8e:4c:a7",
            "net9": "b2:e7:75:32:77:fa"
        },
        "tof_1_2_7": {
            "net0": "76:d2:cc:fc:40:4f",
            "net1": "ae:0e:72:72:4a:d4",
            "net10": "b2:99:0f:c8:87:c1",
            "net11": "1e:ec:97:bf:61:80",
            "net12": "c2:e4:9a:6a:be:5e",
            "net13": "42:5c:44:de:b7:53",
            "net14": "7a:f7:71:b7:66:33",
            "net15": "ca:19:8e:d9:74:50",
            "net16": "7e:1c:ee:0f:e8:f0",
            "net17": "86:d5:d4:2c:c6:f5",
            "net18": "a6:91:c1:81:13:98",
            "net19": "e2:df:c4:14:3d:3b",
            "net2": "12:5b:be:54:4c:9c",
            "net20": "52:79:18:52:51:05",
            "net21": "e6:65:67:b6:eb:13",
            "net22": "ba:58:c4:bd:ae:e5",
            "net23": "1a:f2:d6:97:26:68",
            "net24": "4e:c5:ee:d9:c0:d4",
            "net25": "a6:4a:08:4e:48:9b",
            "net26": "3e:4a:22:f6:2f:7a",
            "net27": "32:96:54:1a:9c:ef",
            "net28": "a6:9c:05:15:86:1a",
            "net29": "f6:c5:ac:f4:ed:1c",
            "net3": "a6:54:de:4c:f0:d0",
            "net30": "2e:98:23:92:92:6a",
            "net31": "8a:88:0f:d8:a9:7c",
            "net4": "2e:e1:2c:82:ac:f3",
            "net5": "e6:b1:6a:5a:78:48",
            "net6": "5e:bf:d6:c3:84:ca",
            "net7": "6a:fe:cc:5b:95:a7",
            "net8": "d2:5b:70:ca:46:0a",
            "net9": "82:49:f3:2a:ff:01"
        },
        "tof_1_2_8": {
            "net0": "36:f0:c9:8e:8e:4a",
            "net1": "ba:cb:d2:bf:49:ea",
            "net10": "1a:ec:39:3b:93:0e",
            "net11": "9a:88:a2:9a:4d:5c",
            "net12": "1e:c5:1c:fe:7c:cf",
            "net13": "96:b0:99:25:b1:04",
            "net14": "82:c2:0d:d0:74:4e",
            "net15": "e2:ad:9d:00:1a:a5",
            "net16": "82:70:e6:15:b6:a7",
            "net17": "ee:b4:c4:c6:a3:f7",
            "net18": "fe:92:aa:c4:b8:6f",
            "net19": "c6:bb:76:8f:55:a4",
            "net2": "16:a2:ed:2c:32:cc",
            "net20": "ce:d7:67:49:6c:33",
            "net21": "f6:ef:5a:01:2d:74",
            "net22": "2a:43:25:a9:c6:2f",
            "net23": "aa:1e:18:45:ae:4e",
            "net24": "86:3a:39:f6:f7:e4",
            "net25": "d6:ff:d3:01:07:d7",
            "net26": "a6:dd:93:db:75:88",
            "net27": "4e:9a:4b:1b:b4:5f",
            "net28": "0a:16:d8:69:68:1f",
            "net29": "86:47:33:cd:cb:42",
            "net3": "72:d9:e5:28:43:fe",
            "net30": "5e:24:a0:bf:bf:11",
            "net31": "e2:95:b4:d7:d4:3b",
            "net4": "a6:96:33:66:12:aa",
            "net5": "36:01:d8:d0:7c:fc",
            "net6": "aa:ff:9d:0b:71:08",
            "net7": "62:c7:2e:e3:bc:19",
            "net8": "ce:60:00:67:cc:49",
            "net9": "de:4c:7a:0f:46:c0"
        },
        "tof_1_2_9": {
            "net0": "96:20:56:0d:9a:2c",
            "net1": "22:99:85:e3:c1:a7",
            "net10": "82:98:9d:96:f4:f5",
            "net11": "4a:07:8a:b6:68:e5",
            "net12": "ba:85:79:23:27:da",
            "net13": "ce:cd:e9:06:78:a2",
            "net14": "36:dc:9a:cb:09:c7",
            "net15": "42:91:33:ae:a0:9c",
            "net16": "f2:46:85:f7:9b:df",
            "net17": "1a:19:8e:f7:55:4c",
            "net18": "c2:ab:32:dd:62:72",
            "net19": "ca:31:25:5e:23:58",
            "net2": "f6:a7:e1:e1:d5:c3",
            "net20": "56:fb:0b:0f:54:28",
            "net21": "82:ae:6b:95:67:ef",
            "net22": "fa:28:5d:a5:48:77",
            "net23": "b2:cc:eb:83:ce:31",
            "net24": "56:a3:e7:9a:3b:9a",
            "net25": "7a:05:5c:b1:1d:fc",
            "net26": "3e:65:87:ec:5e:3c",
            "net27": "fe:28:0c:30:0c:6b",
            "net28": "86:04:88:11:a1:fe",
            "net29": "2e:1d:2e:b0:cb:f4",
            "net3": "6e:88:22:06:6e:5e",
            "net30": "26:9a:f5:65:c5:69",
            "net31": "2e:65:3a:87:ed:a4",
            "net4": "be:18:86:bb:c3:da",
            "net5": "3e:53:41:9f:e2:93",
            "net6": "f2:2c:87:ef:c2:ea",
            "net7": "12:e4:5f:cb:ab:f3",
            "net8": "8e:01:95:7c:d2:6b",
            "net9": "c6:55:1e:73:c2:4b"
        }
    },
    "failed_machine": "tof_1_2_1",
    "failure_time": 1616339409.0917532,
    "recover_time": 1616339544.8285341
}