{
    "description": "Scenario 4b: Spine spine_1_1_1 failure and recovery with BGP",
    "k_leaf": 16,
    "k_top": 16,
    "redundancy_factor": 16,
    "is_k8s": true,
    "machine_mac_addresses": {
        "leaf_1_0_1": {
            "net0": "2e:45:0f:63:96:58",
            "net1": "6a:b3:2b:c4:59:39",
            "net10": "fa:0d:e5:20:cb:aa",
            "net11": "32:bc:80:71:54:0a",
            "net12": "b2:37:23:5b:7a:96",
            "net13": "76:87:ce:f3:f7:a4",
            "net14": "82:bc:b9:8b:fa:31",
            "net15": "6e:2d:29:e9:90:a2",
            "net16": "d2:24:07:c9:fd:4c",
            "net2": "de:56:18:98:55:50",
            "net3": "6e:94:16:c4:1f:41",
            "net4": "ea:ca:19:4b:bd:09",
            "net5": "c2:93:da:66:d4:56",
            "net6": "16:13:6a:82:47:b8",
            "net7": "1a:f7:2a:2e:f4:ad",
            "net8": "ce:c1:cd:9d:2c:84",
            "net9": "1e:46:6b:72:c7:65"
        },
        "leaf_1_0_10": {
            "net0": "da:d8:6f:70:62:56",
            "net1": "be:86:a4:a6:4e:80",
            "net10": "e2:b6:b4:64:48:13",
            "net11": "ce:b1:d9:0c:28:8f",
            "net12": "02:5c:05:a4:a3:c3",
            "net13": "22:15:9f:29:99:9e",
            "net14": "ba:e9:8b:ca:b2:8a",
            "net15": "ca:59:2c:54:b6:a2",
            "net16": "e6:7b:5a:96:ec:7d",
            "net2": "56:b2:84:f6:f9:5d",
            "net3": "16:37:84:24:e4:f2",
            "net4": "36:4f:c1:a5:f4:87",
            "net5": "06:9e:5f:eb:08:31",
            "net6": "ce:a1:eb:07:79:46",
            "net7": "ca:c9:59:98:37:c9",
            "net8": "82:bc:2e:d9:8d:3b",
            "net9": "2e:ad:32:f3:6e:bc"
        },
        "leaf_1_0_11": {
            "net0": "3a:d0:b5:48:6c:ea",
            "net1": "f6:50:98:a0:fc:20",
            "net10": "82:c1:d8:ae:00:69",
            "net11": "4a:76:65:1f:f5:49",
            "net12": "2a:e5:b9:88:a7:60",
            "net13": "ae:ed:fa:2d:4c:91",
            "net14": "c6:f2:41:ca:c9:4e",
            "net15": "2a:ac:65:b2:9c:6b",
            "net16": "d2:56:fe:01:0d:de",
            "net2": "d2:9b:cf:a8:43:41",
            "net3": "ca:e7:a6:d6:74:94",
            "net4": "b2:c8:32:ec:e0:d5",
            "net5": "ca:68:d5:63:e7:18",
            "net6": "52:9d:6c:39:f9:3a",
            "net7": "5e:d1:ed:9a:e1:e4",
            "net8": "1a:39:8c:c9:dd:02",
            "net9": "5e:17:5d:33:ab:19"
        },
        "leaf_1_0_12": {
            "net0": "2e:e6:98:6c:70:1c",
            "net1": "d6:64:60:f3:cd:15",
            "net10": "16:15:63:62:33:b9",
            "net11": "82:93:5d:33:bb:c5",
            "net12": "c6:ec:25:3e:bc:4f",
            "net13": "5a:a6:98:b7:4d:99",
            "net14": "8e:76:f0:81:8f:7a",
            "net15": "8e:0c:0c:ae:97:86",
            "net16": "2e:0d:84:34:e5:e7",
            "net2": "1e:26:f9:aa:91:d5",
            "net3": "f2:98:fc:a4:53:05",
            "net4": "c2:c2:94:d1:c9:f3",
            "net5": "72:89:84:83:a4:c3",
            "net6": "1e:a2:5b:49:f6:e4",
            "net7": "7a:a8:66:af:61:1f",
            "net8": "16:a8:b8:11:8c:46",
            "net9": "de:a3:6b:78:82:ac"
        },
        "leaf_1_0_13": {
            "net0": "66:d4:af:08:58:26",
            "net1": "76:08:bd:25:03:8c",
            "net10": "86:b2:0f:b4:26:0d",
            "net11": "06:08:4a:70:74:fc",
            "net12": "22:79:b6:1a:28:a9",
            "net13": "9a:4f:d8:68:76:15",
            "net14": "da:5a:39:fd:ae:5e",
            "net15": "f6:79:31:c2:7b:10",
            "net16": "1a:7f:71:c3:6b:24",
            "net2": "5a:78:08:b5:8b:a1",
            "net3": "ea:a5:f6:b0:34:0f",
            "net4": "f2:4b:19:7d:d4:1b",
            "net5": "4a:3f:5d:51:62:15",
            "net6": "5a:24:25:33:99:a2",
            "net7": "aa:36:cb:d5:1a:4f",
            "net8": "ea:8a:45:85:ae:91",
            "net9": "ea:6f:05:9f:8e:ea"
        },
        "leaf_1_0_14": {
            "net0": "e2:00:ee:52:8c:aa",
            "net1": "d2:b8:6d:e9:30:96",
            "net10": "66:3f:25:49:41:4c",
            "net11": "8e:8e:c0:f6:8c:3a",
            "net12": "e6:e0:cc:76:bf:98",
            "net13": "b2:f7:dd:09:fa:c8",
            "net14": "1a:c1:f3:19:3d:93",
            "net15": "e2:18:63:86:d5:01",
            "net16": "e2:64:4b:10:9d:4c",
            "net2": "1e:4e:8a:66:37:f6",
            "net3": "92:66:e2:b1:d2:1b",
            "net4": "8e:86:03:18:19:40",
            "net5": "32:84:b4:cc:bd:89",
            "net6": "22:a1:45:9d:a1:55",
            "net7": "56:e5:22:65:3f:3c",
            "net8": "96:7b:21:d7:7a:86",
            "net9": "be:46:16:04:81:d6"
        },
        "leaf_1_0_15": {
            "net0": "86:ed:4a:4b:db:b1",
            "net1": "1e:3a:f9:0c:53:a7",
            "net10": "42:5c:66:d4:11:c2",
            "net11": "ba:73:1c:76:90:35",
            "net12": "7a:39:c0:12:9d:b1",
            "net13": "aa:65:f3:1a:bb:38",
            "net14": "ba:cb:12:2f:9f:69",
            "net15": "b2:0a:80:02:98:0c",
            "net16": "22:09:fd:f5:d3:a3",
            "net2": "46:61:c3:97:9a:de",
            "net3": "ee:e2:54:66:df:3a",
            "net4": "92:a9:a6:d0:d9:a7",
            "net5": "92:85:bb:89:b2:3e",
            "net6": "de:6b:a8:d7:9a:e2",
            "net7": "c2:43:b5:41:77:2c",
            "net8": "ce:74:49:71:0b:2a",
            "net9": "82:47:1f:02:e6:63"
        },
        "leaf_1_0_16": {
            "net0": "aa:3c:21:6c:0f:00",
            "net1": "46:1a:06:5a:f2:eb",
            "net10": "be:70:77:85:99:7e",
            "net11": "02:29:f1:b5:fb:cd",
            "net12": "1e:a0:00:5f:67:f8",
            "net13": "da:cc:ea:a1:14:c8",
            "net14": "56:84:f5:d2:8e:33",
            "net15": "62:0d:80:11:b7:78",
            "net16": "d6:57:30:03:05:62",
            "net2": "b6:ed:22:22:37:08",
            "net3": "d2:d8:40:d8:a7:fd",
            "net4": "ae:b1:06:f9:8d:c1",
            "net5": "7a:f2:ed:e2:46:3a",
            "net6": "0e:08:3c:eb:b9:a5",
            "net7": "fa:cc:aa:2a:04:c6",
            "net8": "ee:74:b0:c1:f6:a2",
            "net9": "36:d5:05:cf:e7:ab"
        },
        "leaf_1_0_2": {
            "net0": "32:0b:91:dc:73:81",
            "net1": "4a:f3:47:7e:c6:2f",
            "net10": "4e:1f:ba:48:b3:37",
            "net11": "02:7b:0d:a3:1e:11",
            "net12": "ae:86:4c:4a:3d:ab",
            "net13": "22:4d:62:32:44:88",
            "net14": "da:0a:7f:df:56:d6",
            "net15": "52:6a:c0:07:15:0b",
            "net16": "82:ef:00:b9:65:77",
            "net2": "02:15:c7:f1:0a:42",
            "net3": "ae:a2:05:5c:b9:82",
            "net4": "c6:f1:d7:66:14:74",
            "net5": "12:46:50:c8:63:6e",
            "net6": "e2:92:7d:8e:6a:fe",
            "net7": "8a:cc:64:63:ea:48",
            "net8": "de:09:d4:24:d3:26",
            "net9": "ce:ca:f4:dd:99:ea"
        },
        "leaf_1_0_3": {
            "net0": "fa:f6:8f:b1:a8:8a",
            "net1": "36:7b:ff:ef:1f:b3",
            "net10": "02:0b:f8:57:0c:68",
            "net11": "4e:ef:6f:02:8d:d8",
            "net12": "f2:b5:d7:b3:ad:65",
            "net13": "ca:23:e9:a9:45:e1",
            "net14": "fa:94:4e:4a:38:cc",
            "net15": "d2:7d:fc:0b:bb:41",
            "net16": "fa:c8:2c:84:05:1d",
            "net2": "9e:b4:97:47:71:7d",
            "net3": "e6:02:c7:0b:d0:c2",
            "net4": "ea:40:bb:b3:53:4f",
            "net5": "de:0b:af:01:42:8c",
            "net6": "7a:ba:7d:9e:2a:c8",
            "net7": "1a:46:d5:b2:b6:00",
            "net8": "72:7b:8d:60:88:c6",
            "net9": "f2:26:2c:55:32:14"
        },
        "leaf_1_0_4": {
            "net0": "92:8b:a4:1f:58:0a",
            "net1": "8e:7f:84:3c:16:1c",
            "net10": "1a:30:4c:0c:fe:d3",
            "net11": "aa:4f:fe:6c:ca:8e",
            "net12": "06:ad:33:0e:42:18",
            "net13": "36:26:a7:bc:b0:25",
            "net14": "4e:c1:5b:9b:58:51",
            "net15": "8a:68:ec:5c:0e:d4",
            "net16": "86:d8:fc:97:09:15",
            "net2": "1e:11:97:3f:78:b4",
            "net3": "02:73:43:7c:d6:60",
            "net4": "5a:5a:fa:75:a3:5e",
            "net5": "6e:bb:2c:7c:38:cc",
            "net6": "7a:e4:5b:47:13:0e",
            "net7": "a6:3f:74:e4:4d:65",
            "net8": "0a:c2:96:2e:ce:64",
            "net9": "0a:3e:5f:07:0c:9d"
        },
        "leaf_1_0_5": {
            "net0": "ee:49:f6:c8:64:55",
            "net1": "ee:29:c5:bd:a9:a8",
            "net10": "22:e6:47:30:6f:d1",
            "net11": "32:32:c6:ea:55:f5",
            "net12": "aa:09:fd:c8:82:10",
            "net13": "c2:e2:36:26:4b:01",
            "net14": "de:c1:4d:77:9b:d5",
            "net15": "ae:76:81:0c:63:83",
            "net16": "82:8a:ad:86:9f:31",
            "net2": "ce:d2:ea:94:d4:57",
            "net3": "4e:6f:b1:ea:ea:35",
            "net4": "52:a8:60:de:78:38",
            "net5": "92:3e:b9:54:61:8a",
            "net6": "da:c6:5b:fb:58:ea",
            "net7": "16:e0:7d:ba:e1:c1",
            "net8": "32:53:c9:35:2b:bb",
            "net9": "aa:c3:49:4c:52:d1"
        },
        "leaf_1_0_6": {
            "net0": "36:f3:cb:e1:bd:3c",
            "net1": "ca:b7:e0:03:ff:d9",
            "net10": "26:f6:7a:b9:43:c2",
            "net11": "9a:22:85:b2:aa:4b",
            "net12": "b2:f7:9c:53:2b:82",
            "net13": "3a:fb:79:4d:28:bf",
            "net14": "d2:4d:eb:f5:6d:68",
            "net15": "f2:d5:f3:10:c3:c4",
            "net16": "56:a1:e1:b8:2a:2a",
            "net2": "ee:0d:ee:66:65:f7",
            "net3": "76:b5:76:d3:b8:c6",
            "net4": "b2:74:86:e3:27:c8",
            "net5": "56:9d:2c:0f:e2:86",
            "net6": "66:3d:12:c1:16:74",
            "net7": "fe:3f:4f:8b:f4:08",
            "net8": "26:82:06:81:44:10",
            "net9": "de:53:aa:30:86:7e"
        },
        "leaf_1_0_7": {
            "net0": "9e:c3:3f:fb:73:5a",
            "net1": "5a:a7:61:29:24:e9",
            "net10": "fa:d1:ae:74:06:71",
            "net11": "5a:8f:ad:68:8a:99",
            "net12": "0e:a0:af:ad:b2:0d",
            "net13": "22:0f:0f:23:bd:bf",
            "net14": "02:91:26:b8:84:46",
            "net15": "fe:f1:bb:e4:44:7a",
            "net16": "56:3c:af:ef:9a:86",
            "net2": "2a:36:ae:54:d3:15",
            "net3": "36:c8:c3:44:b5:80",
            "net4": "8e:8e:05:f7:eb:d3",
            "net5": "22:42:1d:59:0b:c5",
            "net6": "0e:da:08:52:28:50",
            "net7": "a6:d8:2f:d5:5f:2e",
            "net8": "a2:2a:00:2c:de:fb",
            "net9": "ae:43:d6:37:9b:4d"
        },
        "leaf_1_0_8": {
            "net0": "3e:4c:4e:08:19:d4",
            "net1": "52:3c:c7:07:cb:4e",
            "net10": "7e:66:59:ca:05:20",
            "net11": "6e:af:bb:e7:a7:a3",
            "net12": "8a:0a:ad:59:ab:97",
            "net13": "12:26:ab:02:ee:dc",
            "net14": "da:e4:d8:54:eb:a8",
            "net15": "d6:6f:26:8f:e9:55",
            "net16": "2e:e0:69:35:88:2f",
            "net2": "a6:7f:7d:a7:ac:95",
            "net3": "2a:9b:75:41:c9:64",
            "net4": "02:d5:39:f6:c6:f7",
            "net5": "da:18:db:9e:47:be",
            "net6": "72:da:b3:d2:bc:25",
            "net7": "5a:fc:2f:31:0a:61",
            "net8": "0a:16:45:83:02:4e",
            "net9": "fa:68:f1:e3:4f:39"
        },
        "leaf_1_0_9": {
            "net0": "72:65:bd:90:be:76",
            "net1": "ce:fd:a5:c8:ec:08",
            "net10": "2e:52:3c:b5:72:43",
            "net11": "9e:7e:d4:3d:83:3a",
            "net12": "0e:f9:7a:9a:27:4c",
            "net13": "62:3e:82:e9:04:de",
            "net14": "62:4b:d3:98:0c:48",
            "net15": "02:ff:a6:0c:db:8b",
            "net16": "ae:d9:fc:a8:0b:5f",
            "net2": "6a:7e:ba:98:7a:d4",
            "net3": "8e:4a:d6:0b:aa:b8",
            "net4": "0e:94:0d:8a:5b:89",
            "net5": "de:d6:93:d0:60:fb",
            "net6": "92:ef:3b:e8:27:c1",
            "net7": "fe:7c:b4:b8:84:fb",
            "net8": "86:39:e8:3c:06:88",
            "net9": "2a:27:82:b5:6a:c3"
        },
        "leaf_2_0_1": {
            "net0": "56:9e:fd:da:81:e0",
            "net1": "32:4e:b4:0e:23:d8",
            "net10": "52:e5:b7:56:57:4b",
            "net11": "c6:8c:3b:42:6e:b6",
            "net12": "6a:d3:c5:64:22:aa",
            "net13": "8e:78:49:80:62:66",
            "net14": "62:cb:15:49:9f:f4",
            "net15": "42:eb:b6:4a:24:e6",
            "net16": "7e:96:19:0d:fe:62",
            "net2": "e2:33:73:09:65:49",
            "net3": "be:c5:00:9b:83:71",
            "net4": "82:b5:e4:da:93:54",
            "net5": "96:6e:e3:fc:16:d6",
            "net6": "ea:e2:ea:8d:71:e9",
            "net7": "aa:0b:ec:ba:fd:0c",
            "net8": "26:c9:ad:7a:6e:71",
            "net9": "2e:b4:3f:24:6f:bd"
        },
        "leaf_2_0_10": {
            "net0": "52:94:1f:de:74:a8",
            "net1": "da:b3:f9:da:4c:76",
            "net10": "aa:82:48:ff:d9:eb",
            "net11": "3a:73:a6:83:73:5c",
            "net12": "82:43:b1:9a:85:1c",
            "net13": "16:11:e7:cf:a1:be",
            "net14": "66:47:f0:75:4a:17",
            "net15": "8a:fe:7a:4f:22:05",
            "net16": "22:53:6f:49:d3:ef",
            "net2": "22:1b:a0:3c:ac:09",
            "net3": "ca:e3:76:ef:38:e8",
            "net4": "ba:08:83:ed:67:58",
            "net5": "76:f3:84:ed:70:8b",
            "net6": "4a:c7:98:35:c4:fc",
            "net7": "2a:90:8b:85:c1:d8",
            "net8": "02:0b:39:ef:63:57",
            "net9": "5a:45:67:fd:32:7e"
        },
        "leaf_2_0_11": {
            "net0": "ee:3f:ee:3c:48:93",
            "net1": "66:55:1f:7f:5e:57",
            "net10": "12:fc:46:81:10:e1",
            "net11": "aa:05:bd:fa:eb:a9",
            "net12": "6a:b5:d2:43:ac:c1",
            "net13": "72:9e:b3:c9:05:4c",
            "net14": "56:21:4c:5e:ce:c9",
            "net15": "c2:63:43:ed:1b:3f",
            "net16": "8e:e6:d7:a0:60:40",
            "net2": "d2:b4:ed:69:63:1f",
            "net3": "b2:35:f0:29:d0:70",
            "net4": "b2:cc:b0:07:9c:eb",
            "net5": "0e:4c:87:14:54:50",
            "net6": "76:0b:d2:ea:1d:41",
            "net7": "7a:1b:1c:92:94:da",
            "net8": "9a:50:95:7f:84:90",
            "net9": "46:b1:3a:57:85:62"
        },
        "leaf_2_0_12": {
            "net0": "aa:31:04:9b:ee:4d",
            "net1": "52:54:46:5d:fd:7f",
            "net10": "ea:cf:0e:f6:78:e0",
            "net11": "32:b7:73:5f:2c:d4",
            "net12": "56:9a:ef:ed:e4:ad",
            "net13": "c6:fd:7a:b9:55:80",
            "net14": "12:4d:9b:04:71:4f",
            "net15": "a6:c6:ab:5a:b7:89",
            "net16": "32:53:06:56:ae:31",
            "net2": "32:e9:7c:2e:73:6f",
            "net3": "5a:0d:e9:a1:4b:c6",
            "net4": "16:15:5d:d2:ad:fc",
            "net5": "2a:f7:8c:8c:d0:f7",
            "net6": "e6:5c:8a:0d:30:e9",
            "net7": "36:0e:47:3f:46:bd",
            "net8": "da:41:7d:b1:60:05",
            "net9": "3a:38:6e:b1:a0:a6"
        },
        "leaf_2_0_13": {
            "net0": "ea:ad:94:06:9e:6d",
            "net1": "26:bf:c8:33:07:73",
            "net10": "1a:d8:79:10:f1:aa",
            "net11": "3e:d0:0c:f7:41:a7",
            "net12": "fe:53:d5:06:58:5e",
            "net13": "c6:c7:c2:e6:8c:08",
            "net14": "1a:34:24:81:1f:fe",
            "net15": "fe:9c:70:4e:d3:8c",
            "net16": "ee:69:a5:95:7f:b6",
            "net2": "ca:e4:ef:93:71:a0",
            "net3": "86:48:b0:ee:08:44",
            "net4": "3a:d9:3a:ff:6d:37",
            "net5": "ba:61:47:8e:aa:ed",
            "net6": "06:95:c2:96:41:50",
            "net7": "8e:ac:04:7c:00:50",
            "net8": "ca:f2:c4:80:7a:90",
            "net9": "76:72:84:5c:21:07"
        },
        "leaf_2_0_14": {
            "net0": "76:29:3b:2c:e4:02",
            "net1": "9e:2a:c5:b5:7b:fc",
            "net10": "7a:4c:b0:18:a8:e7",
            "net11": "06:3b:10:05:47:7b",
            "net12": "e6:32:65:20:98:3d",
            "net13": "e2:2d:de:d3:ab:65",
            "net14": "2a:f4:5f:45:df:c0",
            "net15": "ee:f4:5d:9d:8c:72",
            "net16": "f6:26:10:12:d9:13",
            "net2": "a2:6d:36:b3:8e:24",
            "net3": "2a:f3:35:1f:5f:b5",
            "net4": "96:55:c5:0c:44:f5",
            "net5": "8a:68:04:45:de:98",
            "net6": "f6:76:69:9a:d1:3b",
            "net7": "46:d2:50:77:78:46",
            "net8": "6e:0d:74:b6:5a:96",
            "net9": "de:5c:36:ba:79:19"
        },
        "leaf_2_0_15": {
            "net0": "26:61:d8:c4:e0:1a",
            "net1": "7a:99:ed:94:a5:db",
            "net10": "42:9a:85:13:a9:ea",
            "net11": "66:b5:e8:ab:7e:89",
            "net12": "76:10:c0:9e:ed:3f",
            "net13": "b2:02:6b:9a:2d:78",
            "net14": "0e:5e:db:dc:09:f4",
            "net15": "3a:44:6b:64:b2:b4",
            "net16": "2e:3e:3d:e5:8c:72",
            "net2": "46:a0:aa:31:ad:23",
            "net3": "2a:51:f8:f5:4c:f0",
            "net4": "d2:f7:9d:51:53:e0",
            "net5": "66:4e:8b:7d:a4:cf",
            "net6": "ce:e4:b4:46:56:7e",
            "net7": "22:38:a4:41:36:da",
            "net8": "ea:19:f8:ae:61:f4",
            "net9": "52:cb:8d:6e:c8:a8"
        },
        "leaf_2_0_16": {
            "net0": "fa:18:02:0f:78:f6",
            "net1": "f2:80:1f:fb:df:c1",
            "net10": "a2:d9:57:aa:2f:98",
            "net11": "d2:4c:01:9e:57:8c",
            "net12": "42:8c:de:5b:89:ed",
            "net13": "16:73:9d:e4:8b:c3",
            "net14": "6a:d0:2e:8c:6b:94",
            "net15": "fe:4f:ce:48:c0:fe",
            "net16": "fe:d6:8f:dd:f7:8d",
            "net2": "ee:10:5b:b2:d3:ce",
            "net3": "42:94:58:73:a9:cf",
            "net4": "c6:96:10:10:c1:3c",
            "net5": "32:10:c6:c8:5a:12",
            "net6": "ba:bf:0f:a3:2d:6b",
            "net7": "fe:02:03:c8:fd:5d",
            "net8": "b2:06:d0:32:3f:5b",
            "net9": "36:20:b4:0e:60:c9"
        },
        "leaf_2_0_2": {
            "net0": "b6:c8:ae:e6:09:92",
            "net1": "36:a5:5f:dc:48:f6",
            "net10": "7a:70:28:62:e2:c0",
            "net11": "6e:5c:2c:33:60:dc",
            "net12": "16:01:87:43:6d:e3",
            "net13": "aa:94:c5:15:7a:7a",
            "net14": "7a:15:ba:a9:13:44",
            "net15": "f6:1d:5b:45:b5:a3",
            "net16": "e6:4f:15:c1:f3:d9",
            "net2": "2a:14:ac:b7:7c:76",
            "net3": "e6:ed:4a:07:50:bb",
            "net4": "c2:e7:b1:f9:e3:23",
            "net5": "c6:57:8e:4b:df:f6",
            "net6": "0e:b3:f3:82:38:32",
            "net7": "0e:85:df:03:9a:13",
            "net8": "66:99:95:3e:ec:0a",
            "net9": "ee:9b:f9:51:f0:af"
        },
        "leaf_2_0_3": {
            "net0": "fe:1b:44:d8:f3:59",
            "net1": "56:01:03:5d:bc:12",
            "net10": "8a:b9:90:e4:e1:d8",
            "net11": "82:29:32:56:61:e3",
            "net12": "e2:1b:d8:59:03:1d",
            "net13": "ca:2d:b2:28:76:8a",
            "net14": "de:ab:be:ee:24:56",
            "net15": "ce:39:6f:5f:51:48",
            "net16": "f2:4e:1e:60:5c:5a",
            "net2": "46:71:a8:53:c5:1b",
            "net3": "32:8e:2b:1d:cc:22",
            "net4": "c6:03:ce:1d:1a:b0",
            "net5": "4a:49:55:0d:2b:45",
            "net6": "e2:82:83:21:e3:59",
            "net7": "fe:19:76:ef:44:cd",
            "net8": "e2:6a:06:ed:22:1a",
            "net9": "36:30:29:c8:d7:d3"
        },
        "leaf_2_0_4": {
            "net0": "a2:b6:3d:e7:2a:14",
            "net1": "7a:41:ba:2a:b0:12",
            "net10": "0e:58:29:36:63:e3",
            "net11": "ce:e3:65:49:75:d0",
            "net12": "9e:74:3c:87:78:7c",
            "net13": "c6:e8:09:04:c8:3e",
            "net14": "62:a5:37:24:81:b2",
            "net15": "7e:79:e4:44:eb:30",
            "net16": "0e:e6:db:37:4c:dd",
            "net2": "42:e5:d3:c3:96:56",
            "net3": "b2:41:e6:72:64:50",
            "net4": "56:bd:37:72:6e:92",
            "net5": "3e:29:33:2b:6e:1a",
            "net6": "c6:59:4c:60:79:86",
            "net7": "c2:9e:4e:b2:c0:bb",
            "net8": "2a:10:48:fa:a3:8b",
            "net9": "2e:c0:a9:86:d3:77"
        },
        "leaf_2_0_5": {
            "net0": "16:34:6e:ac:3f:9f",
            "net1": "de:10:b2:06:d5:b1",
            "net10": "ce:09:5b:fc:1a:11",
            "net11": "c2:b8:e2:4c:47:a8",
            "net12": "9e:f0:31:58:fb:d9",
            "net13": "b6:14:24:d1:91:0b",
            "net14": "42:67:c1:72:49:b2",
            "net15": "3a:e1:54:c5:db:70",
            "net16": "ea:42:12:79:cf:6b",
            "net2": "96:c6:e7:b7:ad:62",
            "net3": "ae:b4:40:e1:30:ee",
            "net4": "ce:72:c9:ee:71:e1",
            "net5": "36:1d:c4:61:06:d0",
            "net6": "46:e1:73:59:06:1f",
            "net7": "82:94:06:46:16:11",
            "net8": "fa:6c:c8:66:7f:2b",
            "net9": "96:24:2c:15:a4:ef"
        },
        "leaf_2_0_6": {
            "net0": "7a:b8:63:d4:b9:e3",
            "net1": "32:b1:6b:ab:2a:09",
            "net10": "d2:ce:72:59:ed:f0",
            "net11": "d6:a7:88:3c:76:60",
            "net12": "d6:70:bf:a9:7a:23",
            "net13": "62:9b:f7:1d:2b:b9",
            "net14": "12:05:4c:8a:07:80",
            "net15": "ca:d3:d2:ca:56:e2",
            "net16": "5e:ec:26:9e:1a:44",
            "net2": "5e:51:ec:b1:67:3d",
            "net3": "36:5c:1e:98:42:f1",
            "net4": "4e:97:47:a6:ea:e7",
            "net5": "92:a8:5a:ac:7a:76",
            "net6": "0e:e8:7f:90:c1:96",
            "net7": "16:12:f7:dd:aa:de",
            "net8": "22:f0:60:7e:57:70",
            "net9": "12:61:1a:0f:41:d5"
        },
        "leaf_2_0_7": {
            "net0": "62:f3:18:80:d7:90",
            "net1": "ca:c5:23:95:13:90",
            "net10": "36:ec:e0:61:fe:e0",
            "net11": "36:40:cd:66:94:f9",
            "net12": "66:f2:32:a1:28:0f",
            "net13": "e2:d3:28:16:f3:18",
            "net14": "72:ac:93:8f:af:9b",
            "net15": "32:58:48:48:c4:f4",
            "net16": "8a:bc:c9:ad:fe:b7",
            "net2": "1a:f9:47:bf:d7:8d",
            "net3": "ee:64:2d:69:b2:dd",
            "net4": "36:8e:66:53:71:11",
            "net5": "96:cc:1d:cc:ab:ca",
            "net6": "da:64:b0:d3:68:ce",
            "net7": "12:ad:8a:10:b6:c4",
            "net8": "9a:33:26:a7:ae:86",
            "net9": "16:4d:20:e1:eb:f6"
        },
        "leaf_2_0_8": {
            "net0": "2a:57:8a:b2:77:f2",
            "net1": "56:db:10:b4:e6:a4",
            "net10": "ca:4a:86:6a:e5:bd",
            "net11": "b6:27:5c:38:70:ef",
            "net12": "e2:60:73:47:f8:fd",
            "net13": "0a:ba:95:18:2e:0a",
            "net14": "06:0f:e3:e9:4e:5e",
            "net15": "3e:ae:2f:a8:f3:bc",
            "net16": "fa:e7:d8:47:d7:96",
            "net2": "16:ea:5e:92:f3:d2",
            "net3": "76:36:34:0e:da:a3",
            "net4": "f6:79:95:9b:a1:6c",
            "net5": "fe:a7:b6:94:b6:50",
            "net6": "76:eb:1b:b0:57:6f",
            "net7": "76:fb:40:63:b4:9f",
            "net8": "ba:20:db:22:37:31",
            "net9": "2e:67:91:81:c4:2a"
        },
        "leaf_2_0_9": {
            "net0": "1e:aa:ab:e6:20:25",
            "net1": "9a:1b:db:24:8b:b9",
            "net10": "da:e5:9a:fe:2b:65",
            "net11": "42:79:27:04:d5:b8",
            "net12": "26:c3:63:1f:c3:70",
            "net13": "22:0e:ee:7f:6f:ae",
            "net14": "5a:b9:08:e6:85:ee",
            "net15": "16:fd:80:1b:42:a4",
            "net16": "4a:0d:80:95:fd:53",
            "net2": "5e:81:be:0b:31:3c",
            "net3": "ca:93:53:cc:8b:96",
            "net4": "36:6b:c9:6f:f2:52",
            "net5": "86:2f:52:34:ef:c1",
            "net6": "82:ed:0e:79:3b:65",
            "net7": "d6:d6:3a:5e:99:37",
            "net8": "d6:02:cc:c4:e2:b1",
            "net9": "3a:1c:a5:64:8c:2c"
        },
        "spine_1_1_1": {
            "net0": "1a:06:1b:30:74:02",
            "net1": "ca:29:c7:17:38:9b",
            "net10": "d6:5c:a2:76:45:32",
            "net11": "9e:4f:1e:26:ff:66",
            "net12": "8a:df:76:e4:26:d4",
            "net13": "36:e1:6c:08:ba:01",
            "net14": "3a:15:28:0b:79:33",
            "net15": "5a:49:5c:35:08:a7",
            "net16": "06:56:59:2a:94:9a",
            "net17": "d2:64:fd:b2:fe:18",
            "net18": "a6:47:2a:07:b4:b2",
            "net19": "be:21:ad:70:8c:dc",
            "net2": "26:cd:41:77:2a:cb",
            "net20": "2a:78:ab:d6:4d:4a",
            "net21": "3a:2e:df:8b:68:33",
            "net22": "b6:e2:02:f3:a6:56",
            "net23": "06:79:63:74:29:6e",
            "net24": "96:b3:d2:b5:cb:11",
            "net25": "ea:7f:15:45:3f:4f",
            "net26": "32:f5:ea:be:b6:b2",
            "net27": "92:e7:0f:00:8c:e0",
            "net28": "fe:75:ee:30:05:03",
            "net29": "86:dd:f5:f1:6c:d5",
            "net3": "9a:8c:3d:ec:b9:34",
            "net30": "3e:16:a6:87:84:e2",
            "net31": "26:b1:b2:8c:66:f9",
            "net4": "de:67:b5:87:e1:71",
            "net5": "3a:ff:b6:80:e4:3a",
            "net6": "66:2a:bd:38:66:ea",
            "net7": "9a:9e:44:e5:ad:00",
            "net8": "32:d4:b6:0e:9d:16",
            "net9": "82:f8:76:15:a6:3a"
        },
        "spine_1_1_10": {
            "net0": "c2:e5:5b:9c:26:9e",
            "net1": "0e:f8:5a:67:3d:36",
            "net10": "0e:53:92:3d:46:e6",
            "net11": "9e:da:3b:09:d4:c6",
            "net12": "26:e8:4d:e6:b7:23",
            "net13": "62:8b:ec:20:1b:37",
            "net14": "0e:ec:73:6a:26:bc",
            "net15": "06:f7:a6:7a:ca:ff",
            "net16": "ee:23:a7:df:27:e8",
            "net17": "e2:e5:4e:72:57:3b",
            "net18": "6e:4a:36:74:7e:3b",
            "net19": "96:39:b4:57:82:89",
            "net2": "ca:8b:a0:51:f0:49",
            "net20": "8e:96:ae:02:85:36",
            "net21": "16:fc:cb:fc:97:a2",
            "net22": "0e:30:53:d2:ce:4d",
            "net23": "d6:72:a7:85:ea:52",
            "net24": "aa:f9:1f:c6:3e:9f",
            "net25": "86:40:b2:05:94:98",
            "net26": "1e:5b:2d:4d:36:d6",
            "net27": "da:d9:a2:2a:c1:25",
            "net28": "ae:90:77:c8:38:b5",
            "net29": "e6:8e:1c:da:90:02",
            "net3": "46:b1:84:80:15:63",
            "net30": "62:5c:e3:a7:a0:be",
            "net31": "66:3d:90:c0:59:da",
            "net4": "3e:45:96:21:a0:61",
            "net5": "a2:94:98:4a:69:e0",
            "net6": "32:96:46:7b:a5:4c",
            "net7": "be:b9:68:67:fc:94",
            "net8": "46:64:68:fe:45:d3",
            "net9": "0e:94:e5:a8:16:a4"
        },
        "spine_1_1_11": {
            "net0": "f6:01:16:69:e8:7c",
            "net1": "96:50:57:cc:77:aa",
            "net10": "ca:a9:ed:35:32:3f",
            "net11": "c2:06:da:06:37:d9",
            "net12": "22:55:9c:02:68:7b",
            "net13": "72:8f:41:c8:38:3f",
            "net14": "16:f6:90:71:35:ed",
            "net15": "26:d6:72:87:0a:16",
            "net16": "ca:57:b4:a2:47:37",
            "net17": "6e:f8:fc:3b:b8:60",
            "net18": "52:e4:7d:95:6c:c8",
            "net19": "76:03:6c:05:a5:9c",
            "net2": "7e:a6:4d:91:b2:8a",
            "net20": "86:9d:b2:b1:56:2f",
            "net21": "56:2a:ed:c9:d3:e1",
            "net22": "52:a7:64:85:96:05",
            "net23": "32:d7:36:87:70:cd",
            "net24": "fa:05:a2:81:93:af",
            "net25": "62:6c:43:f0:2b:b0",
            "net26": "5a:84:8b:81:5e:6c",
            "net27": "3e:2f:dd:bb:77:99",
            "net28": "ae:98:bf:a2:a6:2e",
            "net29": "7e:5b:8a:a7:de:ea",
            "net3": "9a:58:87:5e:b7:39",
            "net30": "12:10:e4:e0:d5:50",
            "net31": "7e:32:59:cc:e2:85",
            "net4": "0a:93:38:15:f5:d6",
            "net5": "6e:02:77:a4:97:33",
            "net6": "6e:5a:ae:d4:a6:3c",
            "net7": "5a:f3:1b:da:cb:12",
            "net8": "3e:4a:83:86:07:aa",
            "net9": "16:b4:be:01:cb:15"
        },
        "spine_1_1_12": {
            "net0": "ca:4c:52:4f:c3:af",
            "net1": "e6:95:49:55:05:08",
            "net10": "da:05:3c:c2:dd:18",
            "net11": "f2:da:00:a9:f4:e9",
            "net12": "b6:14:82:f5:4a:17",
            "net13": "36:2f:96:1f:c2:fc",
            "net14": "b6:f4:6d:6c:f5:78",
            "net15": "7a:be:70:ac:be:7c",
            "net16": "b6:a2:f6:1b:96:1c",
            "net17": "62:b9:3c:36:9e:ea",
            "net18": "62:b4:d0:ea:ca:e7",
            "net19": "62:d8:cd:56:c7:c3",
            "net2": "32:a5:7b:64:9b:f7",
            "net20": "f6:e4:0f:00:30:5e",
            "net21": "86:e0:bb:9f:4c:5c",
            "net22": "52:f3:d2:c1:02:1e",
            "net23": "3e:6b:2e:65:4d:b3",
            "net24": "12:87:1d:43:bc:0c",
            "net25": "6e:59:8e:ff:8e:2f",
            "net26": "8a:6a:9e:15:16:ea",
            "net27": "76:a8:a8:8a:ad:3f",
            "net28": "3a:19:ef:5f:e5:5c",
            "net29": "12:08:d7:8a:a5:c0",
            "net3": "66:0e:f7:50:34:66",
            "net30": "a6:c7:eb:b2:08:92",
            "net31": "b2:01:e8:0c:98:75",
            "net4": "4a:91:db:bd:df:98",
            "net5": "3a:e7:e0:ed:ae:6d",
            "net6": "2a:71:09:47:ae:f6",
            "net7": "26:de:c4:ad:48:b0",
            "net8": "f6:27:d7:5c:71:84",
            "net9": "da:5a:02:6d:91:7b"
        },
        "spine_1_1_13": {
            "net0": "5e:65:de:32:a1:7b",
            "net1": "02:72:3a:b0:fe:ab",
            "net10": "42:33:1a:a8:d6:8d",
            "net11": "ea:cf:89:0d:95:39",
            "net12": "de:17:90:1f:6f:dd",
            "net13": "9a:24:08:03:d7:1a",
            "net14": "66:c4:5e:45:8c:c4",
            "net15": "46:01:36:d7:7f:dc",
            "net16": "6e:f2:db:60:1f:50",
            "net17": "32:b4:04:e1:07:9d",
            "net18": "9e:f5:e8:02:4f:ca",
            "net19": "3a:03:27:16:71:81",
            "net2": "32:85:cd:d7:43:f3",
            "net20": "4e:d3:3d:f7:b2:44",
            "net21": "26:ea:70:92:de:c5",
            "net22": "66:07:76:e3:96:7e",
            "net23": "66:71:8f:78:d4:70",
            "net24": "da:ed:bf:aa:5e:f0",
            "net25": "ee:4c:d9:aa:93:d1",
            "net26": "d2:e5:e1:c0:81:6f",
            "net27": "46:aa:e4:be:dc:87",
            "net28": "9a:5e:7a:cc:42:06",
            "net29": "ae:4d:0b:32:86:01",
            "net3": "b2:3d:37:74:b3:24",
            "net30": "1a:08:15:f3:87:36",
            "net31": "76:fe:a4:15:c5:f0",
            "net4": "7a:7c:73:11:44:cd",
            "net5": "ae:70:11:68:46:bf",
            "net6": "76:3b:c2:20:c4:39",
            "net7": "7e:fe:ed:28:a6:79",
            "net8": "22:db:1c:1b:63:43",
            "net9": "c2:88:f8:ff:56:50"
        },
        "spine_1_1_14": {
            "net0": "d6:26:48:a8:26:bc",
            "net1": "de:56:e1:4e:8e:e4",
            "net10": "c6:f0:5b:c5:f8:7c",
            "net11": "5e:c1:9d:ad:2c:ea",
            "net12": "06:8c:64:80:20:5e",
            "net13": "9a:a6:16:ad:4b:84",
            "net14": "ae:9f:ca:a2:52:29",
            "net15": "e2:7a:0d:f2:32:0b",
            "net16": "da:44:b8:7e:bf:d5",
            "net17": "62:6b:aa:74:54:27",
            "net18": "7e:57:b2:ab:9f:46",
            "net19": "f2:9a:70:fb:3c:88",
            "net2": "3e:74:9e:48:15:01",
            "net20": "c2:7e:bf:31:8a:cc",
            "net21": "42:10:28:51:2c:36",
            "net22": "36:a0:61:65:ea:70",
            "net23": "92:01:0d:8b:9c:5e",
            "net24": "66:bb:4f:e3:8b:5e",
            "net25": "ee:90:2b:08:77:13",
            "net26": "aa:8d:ff:b6:75:e3",
            "net27": "7e:e8:ad:ca:b8:7c",
            "net28": "ee:11:56:18:89:3a",
            "net29": "4a:28:4f:f9:d9:9e",
            "net3": "be:df:f6:f9:77:1a",
            "net30": "4a:11:a9:31:44:74",
            "net31": "da:55:2d:9b:28:f1",
            "net4": "d6:cd:77:c3:03:b1",
            "net5": "26:f1:7e:dc:f6:be",
            "net6": "fe:6a:85:1d:68:58",
            "net7": "f6:0e:a8:2f:02:ad",
            "net8": "3a:41:20:b7:18:85",
            "net9": "f6:c0:1b:7a:88:90"
        },
        "spine_1_1_15": {
            "net0": "16:4f:25:70:4e:67",
            "net1": "a6:3b:68:c4:4f:b3",
            "net10": "5a:ab:11:49:6e:e4",
            "net11": "02:01:33:b3:c9:b4",
            "net12": "1a:09:42:dc:5c:25",
            "net13": "82:76:9c:a1:8e:a0",
            "net14": "56:19:43:f1:c0:31",
            "net15": "86:51:14:13:03:4f",
            "net16": "12:4a:e2:07:b3:4c",
            "net17": "0e:bd:95:0b:ad:5f",
            "net18": "ea:05:72:79:d0:77",
            "net19": "f6:37:47:09:d4:38",
            "net2": "2e:67:2e:e1:91:f8",
            "net20": "9a:63:66:d4:d2:d3",
            "net21": "2a:ac:73:a1:2a:4f",
            "net22": "d2:1e:a7:c6:8e:95",
            "net23": "6e:5e:09:6e:4e:eb",
            "net24": "16:13:81:37:37:75",
            "net25": "1e:b3:4a:43:7b:36",
            "net26": "fa:ea:a6:d2:16:46",
            "net27": "4e:6d:9f:7c:8b:43",
            "net28": "66:65:b7:2f:65:f6",
            "net29": "02:9b:80:3e:fc:b1",
            "net3": "42:d1:96:9f:84:99",
            "net30": "e6:bc:60:2e:86:ba",
            "net31": "3a:fd:55:62:f2:6c",
            "net4": "a6:75:a6:65:7a:4a",
            "net5": "06:ca:07:09:f3:e4",
            "net6": "a2:70:45:28:f7:75",
            "net7": "b6:cb:97:ad:4f:e5",
            "net8": "2e:36:d0:7b:85:b7",
            "net9": "ee:75:48:65:2b:8a"
        },
        "spine_1_1_16": {
            "net0": "52:c3:12:21:33:e9",
            "net1": "86:8a:3f:90:dc:24",
            "net10": "a2:32:d3:0b:7f:8d",
            "net11": "f2:6d:e9:4d:da:dd",
            "net12": "52:ff:fd:03:99:1c",
            "net13": "52:4e:00:6c:9b:2e",
            "net14": "26:6e:07:aa:c0:78",
            "net15": "46:7a:c3:fc:0c:d7",
            "net16": "46:07:b5:b4:1d:04",
            "net17": "ee:8e:bf:6a:fa:aa",
            "net18": "c6:13:76:c3:2e:0e",
            "net19": "ee:d5:c1:0b:76:af",
            "net2": "7a:3d:13:81:e5:df",
            "net20": "9e:f3:b9:0c:58:a6",
            "net21": "8a:66:a1:d2:d2:70",
            "net22": "92:17:87:0a:42:4b",
            "net23": "f6:12:55:83:ba:1a",
            "net24": "2a:47:01:af:2d:64",
            "net25": "c6:b8:1c:99:01:2d",
            "net26": "16:1b:cc:15:ad:21",
            "net27": "0a:06:b2:10:c0:7c",
            "net28": "02:c3:93:80:27:55",
            "net29": "da:a9:f3:a7:5d:5a",
            "net3": "1e:5c:00:f4:17:fd",
            "net30": "ee:22:0f:49:da:42",
            "net31": "7e:d8:8a:24:23:29",
            "net4": "ce:6a:68:ff:e9:c6",
            "net5": "ae:03:38:f7:22:3a",
            "net6": "4e:18:02:a0:47:fd",
            "net7": "0e:0f:74:5f:be:f6",
            "net8": "66:08:93:03:39:06",
            "net9": "ce:c7:cc:c6:7f:f7"
        },
        "spine_1_1_2": {
            "net0": "ba:13:fd:7a:27:72",
            "net1": "7e:63:db:f1:d4:ec",
            "net10": "aa:81:cb:92:f0:4f",
            "net11": "ea:bb:b6:de:14:69",
            "net12": "b2:ad:22:bf:60:37",
            "net13": "5a:2b:27:ce:95:a9",
            "net14": "62:6b:75:fb:77:d2",
            "net15": "ba:c6:2d:42:b6:64",
            "net16": "3e:02:ab:b4:e8:c8",
            "net17": "8e:ff:70:93:56:0f",
            "net18": "1a:3e:a6:84:c5:92",
            "net19": "06:55:f0:71:3f:22",
            "net2": "62:1c:63:0b:76:b4",
            "net20": "a2:fc:88:83:65:30",
            "net21": "3e:3a:0f:91:77:90",
            "net22": "f6:4c:85:33:11:ce",
            "net23": "06:fd:b5:2d:c9:07",
            "net24": "0a:bd:76:8e:5e:bb",
            "net25": "96:bf:57:ec:2a:27",
            "net26": "e2:b6:78:e2:41:a1",
            "net27": "ba:37:5b:b3:19:9c",
            "net28": "96:ff:3e:64:05:8c",
            "net29": "f6:ee:62:bf:75:54",
            "net3": "9e:03:00:f0:ea:5f",
            "net30": "8a:80:9e:4d:85:9f",
            "net31": "d6:64:1b:32:91:02",
            "net4": "ea:9b:c0:02:54:26",
            "net5": "16:86:af:2d:87:a8",
            "net6": "aa:6f:d2:4b:00:1e",
            "net7": "06:cc:79:63:ea:a2",
            "net8": "ee:0f:3b:c2:25:b7",
            "net9": "66:3c:c5:c2:db:33"
        },
        "spine_1_1_3": {
            "net0": "b2:52:88:3f:df:4a",
            "net1": "56:a9:cb:3e:7f:49",
            "net10": "26:ec:a3:7a:bd:ef",
            "net11": "3a:f2:86:8b:42:58",
            "net12": "52:c6:22:b5:5c:bc",
            "net13": "02:be:b7:b0:ec:68",
            "net14": "62:9b:15:15:31:72",
            "net15": "86:ea:8f:85:ba:e7",
            "net16": "8a:0e:4e:be:b9:c1",
            "net17": "16:2d:82:62:99:3d",
            "net18": "2e:15:83:14:59:51",
            "net19": "2a:93:6e:fd:8a:fc",
            "net2": "16:e5:c9:a7:6e:d8",
            "net20": "c2:50:30:83:c0:ea",
            "net21": "de:38:90:84:79:98",
            "net22": "02:c0:36:df:91:a2",
            "net23": "06:37:7c:26:6b:f3",
            "net24": "06:24:43:f5:bb:d8",
            "net25": "aa:1f:ae:2a:da:87",
            "net26": "a2:6f:80:75:5d:7c",
            "net27": "fe:d1:24:e4:fa:e2",
            "net28": "1e:7c:3e:cd:39:77",
            "net29": "fa:0e:c5:b8:56:fe",
            "net3": "ba:f3:1b:71:e4:95",
            "net30": "42:a2:60:17:0f:9b",
            "net31": "26:bd:4c:2e:8a:38",
            "net4": "42:e0:bd:c7:39:e8",
            "net5": "da:ee:41:a7:56:90",
            "net6": "3a:e6:cb:b4:b0:8c",
            "net7": "7a:04:e7:1d:c5:6b",
            "net8": "2e:50:46:2a:d8:53",
            "net9": "4a:e0:b9:86:a2:46"
        },
        "spine_1_1_4": {
            "net0": "e2:f4:e3:c4:9c:c6",
            "net1": "7a:d6:6b:c3:f4:94",
            "net10": "9a:ad:b1:f8:f3:ea",
            "net11": "76:89:37:84:ba:21",
            "net12": "e2:42:91:9b:b6:8c",
            "net13": "82:a2:4b:14:5a:a6",
            "net14": "7a:6b:66:2d:0f:78",
            "net15": "ba:6e:2c:0b:6f:06",
            "net16": "22:d5:b2:8b:bb:80",
            "net17": "e6:de:64:81:b8:41",
            "net18": "3a:86:e3:41:b7:e0",
            "net19": "da:05:37:03:eb:4b",
            "net2": "26:e3:6d:0d:2e:5d",
            "net20": "a6:ed:74:9c:53:80",
            "net21": "02:d0:34:3d:28:fb",
            "net22": "72:34:15:4f:7b:b5",
            "net23": "32:6c:0d:3a:ff:68",
            "net24": "9e:b8:c8:4e:e7:d9",
            "net25": "5a:ef:55:94:60:bd",
            "net26": "5a:07:52:fd:b1:b0",
            "net27": "9e:0a:75:f9:f1:ac",
            "net28": "c2:69:fd:65:2f:b3",
            "net29": "c6:42:0a:b2:66:e4",
            "net3": "66:bc:7e:e1:f0:2d",
            "net30": "16:91:af:54:79:f8",
            "net31": "d6:5a:eb:d8:41:28",
            "net4": "d6:2e:5c:69:a3:53",
            "net5": "8a:19:73:0c:21:e3",
            "net6": "e2:a7:4a:54:8b:8a",
            "net7": "0e:dc:6b:6c:4e:8a",
            "net8": "d2:b0:80:23:c5:f8",
            "net9": "aa:b9:fd:91:7c:4e"
        },
        "spine_1_1_5": {
            "net0": "6a:54:5d:01:27:26",
            "net1": "56:6f:c2:ab:bd:29",
            "net10": "4a:45:46:37:fc:8f",
            "net11": "d2:cc:bb:68:32:3c",
            "net12": "62:d9:81:9b:54:48",
            "net13": "8e:2d:14:28:ba:b3",
            "net14": "fe:6a:34:5b:36:f8",
            "net15": "82:0e:f5:24:e4:e8",
            "net16": "e2:7a:5b:ff:29:c3",
            "net17": "aa:1e:e4:61:5e:e4",
            "net18": "52:04:f7:8f:d5:ef",
            "net19": "7a:05:9b:96:cc:b5",
            "net2": "c2:f1:81:dd:88:e9",
            "net20": "6a:b3:fb:1e:ca:7b",
            "net21": "de:a4:bc:20:9d:59",
            "net22": "e6:71:bc:2f:3f:2c",
            "net23": "42:99:98:84:86:c3",
            "net24": "9a:61:4c:9a:1d:3f",
            "net25": "ba:02:21:2c:3a:3d",
            "net26": "e6:f7:74:23:77:1c",
            "net27": "e6:b0:18:56:b8:dc",
            "net28": "ba:1c:b7:2d:b3:77",
            "net29": "42:48:68:07:e7:fa",
            "net3": "da:83:6d:57:5a:92",
            "net30": "aa:d6:85:03:07:32",
            "net31": "2a:99:65:55:47:c0",
            "net4": "46:b9:77:26:df:b3",
            "net5": "2e:60:4b:b6:14:82",
            "net6": "8e:06:3b:96:25:f3",
            "net7": "52:2c:39:71:1a:82",
            "net8": "c2:5f:8e:4e:b2:54",
            "net9": "6a:f2:4e:55:9e:dd"
        },
        "spine_1_1_6": {
            "net0": "76:b4:cf:b0:cc:68",
            "net1": "ae:24:bd:f8:2d:6e",
            "net10": "62:1d:e1:76:8c:c6",
            "net11": "12:80:8e:c1:82:7e",
            "net12": "5a:50:b3:71:8c:ba",
            "net13": "fe:ce:1c:01:d7:b6",
            "net14": "0e:7e:16:95:9c:0e",
            "net15": "66:c6:61:40:fa:61",
            "net16": "22:d9:73:d1:4b:51",
            "net17": "ea:90:49:9e:d2:c5",
            "net18": "92:31:17:ee:c3:42",
            "net19": "6a:fb:41:84:7c:28",
            "net2": "ee:b4:03:64:6b:0a",
            "net20": "fe:96:f3:35:97:16",
            "net21": "62:f0:cb:9f:32:66",
            "net22": "e2:54:98:75:b8:37",
            "net23": "1a:b0:d0:e3:66:92",
            "net24": "5a:5e:a1:dc:f7:65",
            "net25": "a2:55:53:db:57:1f",
            "net26": "0e:ec:ca:65:d6:06",
            "net27": "32:6d:71:15:4f:2b",
            "net28": "9a:17:90:ec:3d:b6",
            "net29": "8a:79:24:fa:5f:d2",
            "net3": "22:41:dd:b4:be:1b",
            "net30": "96:42:2b:dd:61:e2",
            "net31": "4a:43:44:11:1a:27",
            "net4": "22:94:92:c4:41:82",
            "net5": "4a:5a:29:43:68:96",
            "net6": "ce:b5:91:aa:ce:67",
            "net7": "b2:0b:3c:f0:69:a0",
            "net8": "0a:ad:12:14:60:7f",
            "net9": "06:33:a8:74:72:58"
        },
        "spine_1_1_7": {
            "net0": "9a:d0:4f:04:3e:f0",
            "net1": "26:22:4f:45:84:96",
            "net10": "6a:a5:a6:75:fe:d6",
            "net11": "be:33:bc:eb:29:5e",
            "net12": "fa:81:c2:b3:ad:ea",
            "net13": "ee:bf:04:57:64:6f",
            "net14": "2a:a9:ea:c3:10:a4",
            "net15": "6a:72:f9:f4:ae:14",
            "net16": "36:b1:0e:c4:a0:79",
            "net17": "a2:8a:f6:86:b2:7d",
            "net18": "1a:9c:43:4c:95:38",
            "net19": "5a:f9:db:dc:6f:45",
            "net2": "a2:cd:1d:f2:34:7f",
            "net20": "ea:7a:4e:71:b0:77",
            "net21": "26:8e:3a:94:39:14",
            "net22": "e2:ef:ad:57:0c:57",
            "net23": "fa:ef:94:92:07:09",
            "net24": "f2:f5:76:55:2c:9f",
            "net25": "96:a5:70:d3:2a:84",
            "net26": "d2:9a:cb:af:5c:30",
            "net27": "7e:b8:ec:3b:e5:b5",
            "net28": "da:91:0e:85:39:0b",
            "net29": "56:16:81:e0:05:03",
            "net3": "f6:b9:a4:e2:6e:d8",
            "net30": "86:ae:5f:f6:ff:76",
            "net31": "86:30:28:ca:58:ab",
            "net4": "fe:03:6e:bd:f8:12",
            "net5": "16:4e:87:6c:be:e8",
            "net6": "22:c3:e3:ed:1c:c6",
            "net7": "92:c8:d0:b6:d0:b9",
            "net8": "f2:c8:f5:16:c8:e4",
            "net9": "ae:fd:b9:00:65:19"
        },
        "spine_1_1_8": {
            "net0": "6a:a4:ce:0d:66:e3",
            "net1": "ee:7a:9d:5d:6e:a9",
            "net10": "0a:ce:2e:13:cd:83",
            "net11": "5e:dd:8a:31:94:86",
            "net12": "26:db:b5:e5:a5:0e",
            "net13": "a2:a1:2c:37:e1:51",
            "net14": "4e:29:ad:8c:4e:35",
            "net15": "96:ee:6d:4f:85:b6",
            "net16": "ce:dd:3a:f2:59:af",
            "net17": "86:a7:57:c4:0c:ce",
            "net18": "06:1f:b3:44:67:bc",
            "net19": "9a:c5:d7:6d:68:c6",
            "net2": "a6:fa:13:2c:76:aa",
            "net20": "62:56:03:7c:07:2e",
            "net21": "ba:8d:a3:4e:8a:6e",
            "net22": "aa:d5:42:e4:c2:f5",
            "net23": "ae:6c:4f:de:b8:c2",
            "net24": "1e:c0:46:91:1a:f3",
            "net25": "76:d6:05:16:a6:0b",
            "net26": "86:df:91:4f:fe:33",
            "net27": "6a:b2:35:38:b2:ac",
            "net28": "96:0f:dd:14:72:7a",
            "net29": "9e:6e:df:b7:81:85",
            "net3": "9e:c5:83:62:94:81",
            "net30": "6a:87:3f:1f:89:1d",
            "net31": "16:4a:ff:3e:01:fc",
            "net4": "a2:a2:86:79:f9:f0",
            "net5": "8a:49:99:7b:66:a0",
            "net6": "26:cf:7f:a8:81:07",
            "net7": "be:57:6b:73:d5:4c",
            "net8": "1a:14:b9:f6:56:84",
            "net9": "6e:1a:fb:39:6d:09"
        },
        "spine_1_1_9": {
            "net0": "f6:63:65:21:b0:34",
            "net1": "d6:f0:4b:1a:36:e9",
            "net10": "76:bc:da:94:3e:9d",
            "net11": "76:00:c4:69:f6:2c",
            "net12": "92:fc:41:3e:b1:b8",
            "net13": "8e:f9:3e:2f:dc:ea",
            "net14": "ba:a9:e2:52:f9:20",
            "net15": "b2:b0:34:5e:e2:12",
            "net16": "e6:10:72:fa:be:f9",
            "net17": "6a:60:99:93:95:e5",
            "net18": "36:b7:a6:43:bf:13",
            "net19": "fa:4d:d6:2a:1c:28",
            "net2": "86:9b:d3:75:0e:18",
            "net20": "ce:aa:79:b8:1c:48",
            "net21": "42:c7:b3:1f:fc:36",
            "net22": "4e:a9:43:8f:53:bc",
            "net23": "e6:2e:bf:53:02:ce",
            "net24": "76:a8:59:e2:0b:0e",
            "net25": "de:2e:a8:b9:b3:a5",
            "net26": "6e:17:ca:c8:26:f1",
            "net27": "b2:30:34:38:9b:cc",
            "net28": "1e:e3:53:74:66:5e",
            "net29": "c2:08:80:7c:6a:f4",
            "net3": "82:68:4e:dd:d5:bc",
            "net30": "b6:dc:77:8f:50:18",
            "net31": "62:c4:52:e5:01:85",
            "net4": "22:0e:65:4f:6e:b2",
            "net5": "ae:a3:e7:12:0d:15",
            "net6": "0e:17:bd:af:ce:a5",
            "net7": "be:f3:e9:97:5e:74",
            "net8": "d2:ec:f5:39:31:d7",
            "net9": "9e:d9:ef:3a:f4:d2"
        },
        "spine_2_1_1": {
            "net0": "b6:46:38:e6:8b:6e",
            "net1": "46:ea:1d:f8:42:83",
            "net10": "c2:ec:16:5e:13:c9",
            "net11": "8a:c3:ae:f1:98:8d",
            "net12": "3e:50:34:96:fc:30",
            "net13": "2e:87:6d:75:7c:57",
            "net14": "3a:74:7a:c8:60:ac",
            "net15": "86:0e:2d:b9:77:79",
            "net16": "fa:58:1d:d8:fe:5b",
            "net17": "e2:7d:ee:1c:7b:e7",
            "net18": "ce:54:7d:80:b5:99",
            "net19": "22:27:3a:d4:59:96",
            "net2": "86:1d:1d:c4:e2:eb",
            "net20": "92:b1:14:ac:6c:61",
            "net21": "02:4a:87:be:68:c4",
            "net22": "1e:30:8f:80:a3:6a",
            "net23": "5a:9d:15:12:00:29",
            "net24": "92:5d:33:b7:13:69",
            "net25": "5a:01:0d:e9:58:4c",
            "net26": "16:fd:8c:93:5b:84",
            "net27": "fa:a5:0c:34:b2:86",
            "net28": "b2:83:46:08:09:45",
            "net29": "1a:87:63:9f:76:f6",
            "net3": "1a:6d:78:05:ec:7a",
            "net30": "9e:00:0d:c1:59:91",
            "net31": "32:9f:10:e2:91:fa",
            "net4": "3a:ef:ff:87:a8:e4",
            "net5": "62:5d:dd:2b:d4:a3",
            "net6": "6e:a2:22:80:2e:12",
            "net7": "6e:04:cf:4b:34:41",
            "net8": "62:5f:7b:5c:95:31",
            "net9": "4e:34:53:d2:5a:13"
        },
        "spine_2_1_10": {
            "net0": "b2:9e:4f:0a:75:3b",
            "net1": "12:a4:13:9e:3c:9a",
            "net10": "a6:99:17:f3:2f:1f",
            "net11": "72:1d:1f:5a:09:4b",
            "net12": "a2:be:1c:6f:df:02",
            "net13": "e6:ad:7b:a6:3d:7e",
            "net14": "e6:27:31:cf:08:15",
            "net15": "b6:92:ae:16:8d:5d",
            "net16": "de:51:ee:5b:59:69",
            "net17": "16:7f:33:76:72:c0",
            "net18": "ae:52:a5:5a:22:59",
            "net19": "92:14:d5:0b:25:7d",
            "net2": "d6:f6:11:10:7e:f2",
            "net20": "ca:80:f8:cb:89:4c",
            "net21": "36:fb:0c:4b:aa:d7",
            "net22": "4a:8e:63:5c:72:d4",
            "net23": "ca:03:19:60:65:2d",
            "net24": "e2:5e:73:06:65:2a",
            "net25": "b6:02:96:d0:4d:36",
            "net26": "22:c4:e4:fa:4b:d7",
            "net27": "62:7c:cb:1a:ce:75",
            "net28": "82:30:1d:f7:4f:d5",
            "net29": "66:86:70:d5:f1:5e",
            "net3": "e6:0d:30:10:e2:80",
            "net30": "4a:f3:97:34:f9:cb",
            "net31": "06:f9:00:08:e0:b0",
            "net4": "52:12:e0:2a:83:3b",
            "net5": "c2:30:fb:15:3e:6e",
            "net6": "c2:15:07:08:7e:83",
            "net7": "9a:93:97:4e:78:37",
            "net8": "52:42:cb:a5:81:3a",
            "net9": "36:e1:11:5e:04:1d"
        },
        "spine_2_1_11": {
            "net0": "96:05:18:f9:c6:4e",
            "net1": "66:fc:ed:69:3f:55",
            "net10": "32:e9:f2:16:12:d1",
            "net11": "da:4c:96:67:78:56",
            "net12": "aa:7e:90:12:ae:f2",
            "net13": "56:7d:58:27:93:71",
            "net14": "0a:8f:70:93:45:47",
            "net15": "72:ce:80:64:0a:c9",
            "net16": "fe:0f:87:be:54:a1",
            "net17": "76:24:b9:04:51:50",
            "net18": "32:34:13:a4:7e:8a",
            "net19": "da:6c:5b:92:e4:f2",
            "net2": "26:49:e1:83:0c:80",
            "net20": "12:75:1f:b3:9a:b9",
            "net21": "86:78:c9:92:90:d0",
            "net22": "02:0d:3d:ff:01:cc",
            "net23": "9e:7a:1b:b0:f3:8a",
            "net24": "3e:25:f6:65:dc:dd",
            "net25": "36:5d:c7:d0:cd:54",
            "net26": "ca:f8:8f:4c:32:c2",
            "net27": "3a:36:2d:be:a7:f7",
            "net28": "e6:30:c7:76:e7:ac",
            "net29": "6e:5f:1b:4e:b5:02",
            "net3": "6a:83:16:fe:d6:da",
            "net30": "ba:95:26:17:98:d3",
            "net31": "b6:f7:62:e7:2a:4a",
            "net4": "3e:d6:86:ee:b5:79",
            "net5": "8e:70:d5:c0:bc:93",
            "net6": "86:51:b2:c0:39:4c",
            "net7": "02:f7:f5:ac:e8:c0",
            "net8": "a6:ad:ca:27:eb:19",
            "net9": "22:57:9a:d3:f3:1d"
        },
        "spine_2_1_12": {
            "net0": "86:bc:1b:30:0e:a2",
            "net1": "d6:93:90:41:b7:aa",
            "net10": "fa:a4:a6:7f:45:33",
            "net11": "1e:09:06:3c:ef:c8",
            "net12": "ee:04:ab:be:2c:e3",
            "net13": "5e:7b:82:6d:bf:ce",
            "net14": "de:90:22:52:f1:a3",
            "net15": "3e:a9:bf:82:e5:73",
            "net16": "da:4a:88:ba:91:ed",
            "net17": "aa:ce:d5:98:f7:5e",
            "net18": "fa:3e:7b:12:6e:bd",
            "net19": "e6:94:b4:cb:6f:0d",
            "net2": "de:87:53:a4:bb:64",
            "net20": "8a:31:cb:43:4d:30",
            "net21": "f2:89:e7:90:81:e0",
            "net22": "56:e3:84:24:97:b2",
            "net23": "32:d1:86:cd:84:6b",
            "net24": "32:c3:5d:75:19:05",
            "net25": "ba:48:ad:73:7c:08",
            "net26": "c6:9f:48:93:ac:3a",
            "net27": "0e:55:c7:ee:50:48",
            "net28": "6e:32:a3:ce:f6:b9",
            "net29": "de:6f:2c:b2:dc:af",
            "net3": "66:b2:76:5f:26:6e",
            "net30": "32:c7:8b:35:59:c7",
            "net31": "4e:7b:f5:a5:b3:34",
            "net4": "ae:4d:56:10:4e:92",
            "net5": "72:62:1c:84:04:e5",
            "net6": "62:07:7d:32:78:f5",
            "net7": "ea:f2:f4:b6:c7:b7",
            "net8": "2e:bb:56:1b:b6:ed",
            "net9": "9e:07:c7:ba:3c:09"
        },
        "spine_2_1_13": {
            "net0": "02:31:f0:35:b3:24",
            "net1": "1e:ea:63:2c:f8:c0",
            "net10": "5a:36:09:42:ce:42",
            "net11": "1a:18:25:9b:c0:e7",
            "net12": "3e:6f:b2:76:68:c8",
            "net13": "ea:c9:a2:90:52:de",
            "net14": "92:22:5c:2d:f5:64",
            "net15": "d2:c5:c8:8d:02:c8",
            "net16": "be:5d:d3:5d:a9:dc",
            "net17": "92:f5:79:e8:8c:ab",
            "net18": "fe:3e:21:17:8c:da",
            "net19": "5e:b8:4b:80:bf:bd",
            "net2": "52:85:f8:bd:f4:c2",
            "net20": "c2:02:22:2f:7f:a9",
            "net21": "1a:a7:f2:7a:0b:29",
            "net22": "86:ec:e8:c2:9f:cf",
            "net23": "3a:f6:2f:2e:4b:c7",
            "net24": "4a:f1:97:77:a1:85",
            "net25": "9a:7a:3c:f7:c1:fc",
            "net26": "0e:49:9b:b6:d5:5b",
            "net27": "66:e1:c5:04:b7:ae",
            "net28": "8a:78:fb:0f:90:96",
            "net29": "92:9e:0c:50:b8:69",
            "net3": "3e:98:8f:cd:0e:41",
            "net30": "6a:b7:d8:30:bb:87",
            "net31": "ea:5b:de:c4:64:12",
            "net4": "ea:97:ec:db:1a:11",
            "net5": "d2:19:61:f3:9d:9f",
            "net6": "d6:06:b7:d1:25:f3",
            "net7": "2e:81:e0:65:f8:e4",
            "net8": "ae:95:d3:a5:33:6f",
            "net9": "8e:8a:6b:ab:9c:93"
        },
        "spine_2_1_14": {
            "net0": "26:17:15:33:5f:e5",
            "net1": "26:da:f8:b2:90:03",
            "net10": "d2:c5:66:ab:5c:e2",
            "net11": "d6:97:21:2f:31:29",
            "net12": "1a:55:6e:55:39:98",
            "net13": "62:d0:d1:57:b8:3c",
            "net14": "0a:c4:1d:6b:d1:8e",
            "net15": "e2:b1:67:1e:e4:d9",
            "net16": "ee:78:e9:c8:a8:b0",
            "net17": "8a:cc:8d:f0:44:8c",
            "net18": "52:34:cd:6c:6a:a5",
            "net19": "0e:75:5a:0c:75:2e",
            "net2": "42:96:01:a4:12:26",
            "net20": "ee:29:cf:a8:40:f4",
            "net21": "22:b1:62:e7:28:4d",
            "net22": "2e:42:a1:5f:bb:97",
            "net23": "be:6d:65:bb:a1:ca",
            "net24": "8e:91:8d:2d:e8:c1",
            "net25": "02:35:ea:96:69:ba",
            "net26": "a2:c5:32:3a:ef:c3",
            "net27": "fa:5a:bd:1d:17:f5",
            "net28": "e6:69:98:06:09:be",
            "net29": "2e:2b:b2:95:21:aa",
            "net3": "f2:b9:c4:52:94:e3",
            "net30": "e6:61:46:7a:ca:26",
            "net31": "da:85:0a:d3:e2:5c",
            "net4": "12:06:18:9b:b1:47",
            "net5": "ea:34:b0:a4:11:5f",
            "net6": "a6:2c:49:40:f8:7e",
            "net7": "a6:a5:8e:cd:24:ca",
            "net8": "32:cb:fd:21:c5:e6",
            "net9": "1e:48:ae:4c:59:67"
        },
        "spine_2_1_15": {
            "net0": "2a:19:fc:18:99:69",
            "net1": "06:82:fb:f9:44:7f",
            "net10": "e6:cf:56:39:81:9b",
            "net11": "46:34:89:40:61:f8",
            "net12": "a2:0a:50:56:4e:ab",
            "net13": "da:99:d1:37:ad:8c",
            "net14": "46:fd:cc:10:6a:f8",
            "net15": "8e:25:41:c4:fd:bc",
            "net16": "b2:9c:ef:c5:96:d9",
            "net17": "66:9a:7c:41:b7:5f",
            "net18": "22:f4:fe:9c:58:69",
            "net19": "16:7e:9e:62:b4:a5",
            "net2": "f6:bb:98:87:90:cd",
            "net20": "6e:b2:47:2d:32:ce",
            "net21": "46:24:34:06:f7:da",
            "net22": "0a:62:ec:40:e8:66",
            "net23": "ae:04:58:50:fa:a1",
            "net24": "ea:39:61:a3:84:2f",
            "net25": "ca:ec:dd:a6:97:de",
            "net26": "76:0e:a0:6f:48:9b",
            "net27": "e6:9b:c9:35:54:71",
            "net28": "a2:07:13:df:de:17",
            "net29": "8a:9d:3d:40:22:d6",
            "net3": "32:35:c0:5f:0e:a1",
            "net30": "2e:92:e9:43:a9:7a",
            "net31": "76:e2:cc:62:95:39",
            "net4": "5e:30:8c:4e:d4:cb",
            "net5": "fa:a9:cb:9b:cd:29",
            "net6": "66:ad:68:69:bd:54",
            "net7": "ca:cd:57:c9:8c:67",
            "net8": "1e:45:f4:a0:41:43",
            "net9": "aa:28:c6:2a:a8:d7"
        },
        "spine_2_1_16": {
            "net0": "ae:d0:64:73:a9:66",
            "net1": "16:12:7b:a2:b9:44",
            "net10": "56:9e:c1:8f:47:e2",
            "net11": "5e:ca:ee:82:0e:c5",
            "net12": "22:81:76:34:60:c6",
            "net13": "86:2d:8d:ca:20:8d",
            "net14": "d2:82:e1:8e:20:86",
            "net15": "da:55:59:3d:60:4e",
            "net16": "c2:35:8f:f9:85:fd",
            "net17": "c6:60:9a:37:7a:44",
            "net18": "12:07:9d:77:31:0b",
            "net19": "ca:20:42:37:b0:26",
            "net2": "96:2e:a3:40:e9:6f",
            "net20": "ea:aa:27:f9:b3:a3",
            "net21": "de:9c:e4:9d:26:e1",
            "net22": "f2:e1:71:38:18:98",
            "net23": "9e:7f:04:2c:26:04",
            "net24": "ee:98:e8:dc:01:62",
            "net25": "66:ae:8c:01:d1:ee",
            "net26": "36:c6:6a:05:e8:ef",
            "net27": "9a:89:ac:eb:82:a2",
            "net28": "96:b9:50:f4:e8:44",
            "net29": "a6:21:ca:3b:33:5d",
            "net3": "be:ed:dd:31:94:b0",
            "net30": "2e:cd:56:96:3a:29",
            "net31": "ba:bd:58:3e:f5:33",
            "net4": "7e:cb:f0:72:05:d3",
            "net5": "e2:e2:c7:4d:6b:e8",
            "net6": "aa:4f:96:3f:62:5d",
            "net7": "ce:01:fa:21:9f:47",
            "net8": "76:5e:5f:27:de:1c",
            "net9": "26:c5:dd:c3:0c:ca"
        },
        "spine_2_1_2": {
            "net0": "de:53:23:41:5c:1d",
            "net1": "7a:d7:64:ba:c1:be",
            "net10": "5a:57:5d:64:59:c2",
            "net11": "72:ba:42:0d:ce:da",
            "net12": "7e:26:5b:d1:5f:10",
            "net13": "ea:eb:73:67:9d:ba",
            "net14": "e6:8d:98:6a:f2:80",
            "net15": "ba:e7:a6:74:da:4f",
            "net16": "2a:96:cb:b6:aa:98",
            "net17": "6e:a1:0d:72:42:03",
            "net18": "5a:81:ce:a9:c4:ce",
            "net19": "2e:be:f2:01:e8:2d",
            "net2": "5e:3c:da:db:1f:ce",
            "net20": "e2:15:b0:ba:94:66",
            "net21": "e2:4d:0d:7c:d7:5f",
            "net22": "72:75:5c:bc:d8:92",
            "net23": "d2:18:17:4c:b9:66",
            "net24": "3e:1a:7e:45:e8:da",
            "net25": "06:b7:fa:81:c8:75",
            "net26": "36:b3:a0:d9:1a:15",
            "net27": "fa:b8:6b:61:5b:f3",
            "net28": "0e:12:6a:63:ea:33",
            "net29": "da:7f:52:e2:66:02",
            "net3": "be:a2:76:c6:dc:08",
            "net30": "0e:aa:c6:36:4b:e9",
            "net31": "3e:38:44:d2:86:b0",
            "net4": "2a:04:e9:a2:f0:29",
            "net5": "76:3e:b9:2e:21:d5",
            "net6": "72:bc:7a:ad:f9:83",
            "net7": "2e:ca:21:38:aa:4d",
            "net8": "76:b9:3b:76:dd:7c",
            "net9": "4a:8c:2e:49:8b:83"
        },
        "spine_2_1_3": {
            "net0": "be:2c:a6:3b:0e:0d",
            "net1": "3a:b4:8e:9b:1d:42",
            "net10": "72:93:bb:3c:24:0b",
            "net11": "1e:24:00:3c:f1:ab",
            "net12": "c6:1b:f1:67:9a:40",
            "net13": "f2:8d:2d:de:91:bd",
            "net14": "ce:37:fe:d5:94:83",
            "net15": "6a:28:06:39:08:2f",
            "net16": "32:e5:df:d0:66:14",
            "net17": "fa:9d:8d:da:53:00",
            "net18": "72:55:a6:be:db:25",
            "net19": "96:26:f9:13:4a:4f",
            "net2": "2a:ab:c4:20:10:4a",
            "net20": "26:91:ae:c4:02:1d",
            "net21": "4e:da:bf:68:a0:ec",
            "net22": "5a:2e:de:be:a2:80",
            "net23": "f2:68:f0:0c:fd:c4",
            "net24": "4e:fb:86:98:97:65",
            "net25": "06:d2:10:ad:86:3d",
            "net26": "c2:df:63:e2:74:4e",
            "net27": "62:1f:67:72:97:c7",
            "net28": "5e:7c:ef:73:a0:a5",
            "net29": "06:5f:59:ae:f1:fc",
            "net3": "a6:f8:52:30:3d:d5",
            "net30": "9a:91:8e:11:44:30",
            "net31": "1e:b0:d6:59:d9:5a",
            "net4": "de:85:5d:56:c9:82",
            "net5": "ee:a1:8f:cc:4c:99",
            "net6": "96:c1:ba:49:f2:27",
            "net7": "ca:e4:58:e3:88:a6",
            "net8": "82:9e:71:c7:ec:f0",
            "net9": "82:c6:08:03:34:ef"
        },
        "spine_2_1_4": {
            "net0": "7e:63:0e:f6:25:fe",
            "net1": "ee:92:5e:b2:0d:23",
            "net10": "62:b0:53:ea:36:38",
            "net11": "f6:68:3a:c2:50:3e",
            "net12": "3e:9c:ad:93:53:a4",
            "net13": "d6:2a:d4:c7:52:b1",
            "net14": "32:19:19:c4:6a:b1",
            "net15": "e2:e2:fa:56:3a:30",
            "net16": "e2:a9:36:16:1c:e5",
            "net17": "3a:e6:a0:c3:4c:98",
            "net18": "f6:b8:6c:ac:9e:32",
            "net19": "32:15:ab:6a:9b:4a",
            "net2": "22:76:56:ff:36:af",
            "net20": "2e:c1:23:bf:67:60",
            "net21": "2a:c0:3e:48:b5:ef",
            "net22": "b2:f3:23:b2:6e:ad",
            "net23": "36:ae:91:46:33:6e",
            "net24": "fa:84:a1:68:3f:9b",
            "net25": "1a:9f:83:92:17:76",
            "net26": "1e:2c:60:08:e4:8c",
            "net27": "52:fe:e6:47:79:b8",
            "net28": "1a:ae:0a:72:18:64",
            "net29": "0a:0d:55:c4:f6:ba",
            "net3": "36:fe:87:2b:82:b9",
            "net30": "ae:ba:09:a1:46:30",
            "net31": "42:f2:f1:df:9a:3b",
            "net4": "12:5b:e1:64:0c:19",
            "net5": "a6:f0:dd:b9:ae:9a",
            "net6": "0e:6c:26:36:15:d3",
            "net7": "ce:29:e6:4e:67:34",
            "net8": "ce:bc:d1:03:59:e9",
            "net9": "6a:ad:9d:d4:79:fa"
        },
        "spine_2_1_5": {
            "net0": "8a:77:0f:77:ba:90",
            "net1": "32:5e:a2:53:05:9e",
            "net10": "6e:88:fd:6d:62:fe",
            "net11": "0a:aa:5d:9b:d0:31",
            "net12": "46:c4:da:70:55:f2",
            "net13": "26:f8:d0:cb:44:16",
            "net14": "3e:87:c5:2d:da:ab",
            "net15": "86:31:b3:81:f1:2c",
            "net16": "32:c7:3e:a2:b3:6d",
            "net17": "62:8f:f2:09:03:ac",
            "net18": "a2:00:4e:77:1e:9a",
            "net19": "fe:46:0a:0f:77:50",
            "net2": "b6:0c:a3:43:78:da",
            "net20": "c2:27:ee:b3:7f:9b",
            "net21": "d6:48:0d:1e:ce:8c",
            "net22": "ee:c6:2a:07:44:86",
            "net23": "52:fc:1f:24:10:fb",
            "net24": "ee:21:25:ab:08:19",
            "net25": "42:0e:1e:37:59:1d",
            "net26": "22:f2:23:23:0b:81",
            "net27": "7e:da:6c:ae:00:02",
            "net28": "ba:72:a6:f0:7e:d0",
            "net29": "76:31:58:ca:0d:58",
            "net3": "46:80:67:0f:62:3d",
            "net30": "a6:ca:ce:df:58:a7",
            "net31": "5a:f3:d4:f2:6f:24",
            "net4": "3a:a2:1e:a6:80:8d",
            "net5": "ae:79:1b:8b:ad:8c",
            "net6": "56:d0:a6:d2:bf:35",
            "net7": "2a:3a:9d:fd:5f:4f",
            "net8": "22:e7:ba:31:04:ad",
            "net9": "be:36:85:65:b5:af"
        },
        "spine_2_1_6": {
            "net0": "2a:38:8b:48:bf:72",
            "net1": "76:71:cc:79:c5:41",
            "net10": "06:0f:84:ea:49:35",
            "net11": "aa:ed:62:f6:14:7a",
            "net12": "6a:16:cb:86:1a:55",
            "net13": "7e:f2:1a:05:20:45",
            "net14": "d6:a3:b6:8c:a0:7a",
            "net15": "4a:29:ff:df:a2:ab",
            "net16": "82:f5:f9:13:62:54",
            "net17": "8e:15:18:44:73:b8",
            "net18": "92:8a:8a:67:02:54",
            "net19": "86:ae:07:d1:71:cb",
            "net2": "9a:6a:7e:3d:54:70",
            "net20": "fe:2b:54:73:13:b7",
            "net21": "d6:e6:47:6c:5d:a4",
            "net22": "c6:38:c8:11:91:fa",
            "net23": "5a:2d:eb:ac:e8:73",
            "net24": "76:32:85:f4:57:cf",
            "net25": "92:1d:cc:06:83:79",
            "net26": "3e:b4:f5:ec:4a:a4",
            "net27": "46:4b:9c:30:a5:eb",
            "net28": "4e:67:89:ad:73:8e",
            "net29": "46:90:53:1f:74:db",
            "net3": "46:ff:c5:04:23:4f",
            "net30": "3e:90:86:1b:40:9a",
            "net31": "da:98:f0:a1:9a:11",
            "net4": "e2:ae:0d:cb:64:a7",
            "net5": "9e:fb:df:9f:8d:80",
            "net6": "e6:47:e2:05:0e:20",
            "net7": "7a:d8:43:67:ac:a3",
            "net8": "26:94:7f:5c:b4:fb",
            "net9": "62:c6:4f:d7:1a:15"
        },
        "spine_2_1_7": {
            "net0": "3e:0b:a5:8e:fb:1e",
            "net1": "ba:f4:b5:4f:c7:4d",
            "net10": "f6:09:3a:26:89:c9",
            "net11": "96:a3:b7:96:9d:39",
            "net12": "52:e3:17:7f:df:b3",
            "net13": "ca:5c:12:94:5c:7a",
            "net14": "3a:a6:0c:5e:c0:1b",
            "net15": "96:62:77:80:c2:9f",
            "net16": "56:1c:f8:df:d0:ce",
            "net17": "3e:6d:a5:4f:ec:a9",
            "net18": "ce:27:db:f1:e3:f5",
            "net19": "3e:63:7f:84:6c:d9",
            "net2": "66:a7:d2:97:bb:91",
            "net20": "e2:51:56:01:d2:41",
            "net21": "5a:d4:69:fe:6f:6d",
            "net22": "46:95:db:e0:03:90",
            "net23": "76:98:ed:bf:a7:2b",
            "net24": "96:16:27:41:ab:e8",
            "net25": "e6:57:34:73:e0:9b",
            "net26": "c6:05:9b:aa:99:fc",
            "net27": "e2:2f:df:0e:79:3f",
            "net28": "4e:fc:e3:90:cf:93",
            "net29": "46:b6:37:87:ea:1e",
            "net3": "2e:f1:28:13:72:9f",
            "net30": "86:97:99:95:60:7d",
            "net31": "7e:a1:c0:6b:40:d7",
            "net4": "2e:8a:f6:06:6b:e8",
            "net5": "f6:36:d0:58:2b:93",
            "net6": "1e:17:16:52:a7:94",
            "net7": "ce:d7:5e:e6:75:f3",
            "net8": "36:e9:d4:98:ff:94",
            "net9": "56:ac:e5:dc:6d:51"
        },
        "spine_2_1_8": {
            "net0": "4a:59:0d:cc:0a:d6",
            "net1": "3a:e0:5b:36:3a:33",
            "net10": "ae:c2:82:a0:bd:7b",
            "net11": "f2:34:a4:15:ef:b1",
            "net12": "ae:a0:a5:0b:22:5e",
            "net13": "d2:26:50:ab:57:4d",
            "net14": "5e:5f:98:a9:af:e0",
            "net15": "72:c5:95:2f:03:2b",
            "net16": "42:95:f8:3c:de:74",
            "net17": "d6:08:9f:f0:a7:6a",
            "net18": "ce:57:4f:8a:9d:b4",
            "net19": "4e:34:9e:6b:ae:e6",
            "net2": "92:d8:2e:00:e0:bd",
            "net20": "ca:68:c7:66:5b:96",
            "net21": "2a:0d:93:8b:c8:47",
            "net22": "fa:77:cb:bb:89:81",
            "net23": "32:3e:4f:30:dc:16",
            "net24": "06:aa:39:2a:20:e0",
            "net25": "66:0d:41:0f:a3:ab",
            "net26": "b6:15:56:90:64:ad",
            "net27": "a2:4e:43:57:0e:47",
            "net28": "66:b3:99:4b:3b:89",
            "net29": "42:36:a5:82:e0:21",
            "net3": "72:26:84:cc:46:5f",
            "net30": "8a:a8:60:2e:e7:fe",
            "net31": "8e:58:2e:30:0f:a8",
            "net4": "d2:ef:e0:84:a2:fb",
            "net5": "16:cb:88:20:76:a0",
            "net6": "de:a2:65:bb:84:9a",
            "net7": "5a:90:ff:e1:fa:76",
            "net8": "82:c6:93:be:dd:3c",
            "net9": "22:f9:1a:31:8d:3b"
        },
        "spine_2_1_9": {
            "net0": "6a:3b:98:cb:c9:ea",
            "net1": "7a:98:ce:1b:79:52",
            "net10": "a6:67:5d:91:8f:68",
            "net11": "7e:31:51:61:2b:1c",
            "net12": "12:07:63:86:0e:94",
            "net13": "46:15:30:df:89:b1",
            "net14": "12:d2:7d:b8:7c:e2",
            "net15": "96:6a:4b:72:e4:10",
            "net16": "ea:04:4b:85:1f:b7",
            "net17": "62:9d:93:37:a3:a4",
            "net18": "8e:43:af:9e:9a:c8",
            "net19": "9a:e0:48:42:58:47",
            "net2": "fe:5c:41:16:53:73",
            "net20": "a6:ed:dc:92:84:e9",
            "net21": "9a:73:4c:29:35:82",
            "net22": "ca:ce:15:11:dd:16",
            "net23": "fa:67:7f:85:75:ff",
            "net24": "32:19:64:3d:cd:b5",
            "net25": "8e:8c:3e:52:99:4b",
            "net26": "92:fb:20:99:37:9c",
            "net27": "32:e9:d3:e8:a6:18",
            "net28": "ca:4e:b4:2d:9f:90",
            "net29": "22:df:57:11:a0:5d",
            "net3": "f6:16:b5:c8:f1:ef",
            "net30": "c6:e2:d8:43:ca:e8",
            "net31": "26:ae:e5:ca:95:c2",
            "net4": "66:17:ae:3e:e8:bf",
            "net5": "da:4f:bd:b9:5c:f9",
            "net6": "8a:65:c4:44:91:ce",
            "net7": "32:63:e1:11:2e:46",
            "net8": "ae:af:45:73:11:96",
            "net9": "fe:ba:3f:13:60:98"
        },
        "tof_1_2_1": {
            "net0": "9e:b4:1e:4f:f0:af",
            "net1": "32:2c:94:01:e6:65",
            "net10": "ba:4d:1e:8c:61:65",
            "net11": "e2:bc:d7:00:d0:39",
            "net12": "86:88:48:20:79:37",
            "net13": "da:90:f4:a9:ab:71",
            "net14": "12:e7:85:9a:77:d5",
            "net15": "7a:2d:79:54:4a:0e",
            "net16": "ea:dc:c1:05:81:90",
            "net17": "ba:28:b6:3d:01:13",
            "net18": "aa:79:e2:6f:19:fb",
            "net19": "a6:d2:f6:b2:9d:47",
            "net2": "a6:04:94:13:01:ae",
            "net20": "6a:f8:b4:2b:b5:be",
            "net21": "de:82:de:80:b5:af",
            "net22": "ba:d4:f1:1e:43:0c",
            "net23": "56:64:d2:61:6f:f0",
            "net24": "32:b8:fe:f9:52:25",
            "net25": "6a:8d:30:90:5c:6d",
            "net26": "22:ce:bb:ce:af:2e",
            "net27": "d2:0d:09:21:ec:2c",
            "net28": "1e:0a:d4:3c:12:6b",
            "net29": "26:11:2c:12:2c:6d",
            "net3": "9a:c0:4c:3f:1f:e1",
            "net30": "fe:ff:53:d7:8d:b6",
            "net31": "de:cb:32:7f:e2:a2",
            "net4": "8e:22:a2:89:ba:c7",
            "net5": "ea:d9:f0:90:24:b0",
            "net6": "f2:78:61:b1:62:89",
            "net7": "6a:59:b9:49:1b:7a",
            "net8": "92:89:1c:b4:fd:f0",
            "net9": "0e:43:77:8a:7a:e3"
        },
        "tof_1_2_10": {
            "net0": "06:e7:94:0d:23:b3",
            "net1": "e2:d4:ef:f9:8a:b5",
            "net10": "72:f6:c5:79:18:06",
            "net11": "42:dc:f1:10:94:6e",
            "net12": "7a:fd:72:a9:81:42",
            "net13": "aa:df:dc:bc:06:7a",
            "net14": "02:2f:c9:e4:0d:f4",
            "net15": "6a:1a:fc:e8:a1:c4",
            "net16": "06:cf:cd:4c:a7:db",
            "net17": "ce:80:94:11:31:02",
            "net18": "66:88:b7:e6:ba:41",
            "net19": "be:c5:fe:ab:38:b8",
            "net2": "ba:52:6d:a6:0b:b3",
            "net20": "fa:f5:52:bc:89:6e",
            "net21": "f6:9d:4e:0b:59:3a",
            "net22": "92:89:50:b1:40:c1",
            "net23": "aa:56:33:ee:fa:07",
            "net24": "4a:52:fe:0a:c2:33",
            "net25": "1e:c4:4e:f6:85:42",
            "net26": "b2:03:5d:47:64:66",
            "net27": "96:e0:50:70:c1:6f",
            "net28": "86:d6:b6:17:c7:43",
            "net29": "4e:ab:3f:d6:2e:01",
            "net3": "4a:15:c5:73:fd:93",
            "net30": "82:87:6c:69:1c:5b",
            "net31": "1e:62:46:ef:23:c2",
            "net4": "4e:bc:db:a0:cd:52",
            "net5": "22:ed:51:27:d4:58",
            "net6": "3a:c9:ab:54:1e:f8",
            "net7": "be:7d:9b:44:7c:a1",
            "net8": "2e:d5:63:4c:6f:07",
            "net9": "02:ba:be:91:6f:a7"
        },
        "tof_1_2_11": {
            "net0": "fa:37:7b:64:42:e3",
            "net1": "52:84:a3:16:0e:ef",
            "net10": "f6:aa:fe:f3:bf:02",
            "net11": "82:30:65:2f:a9:ca",
            "net12": "2e:d9:23:ee:cd:93",
            "net13": "6a:8c:a4:7c:20:40",
            "net14": "ae:d1:51:b2:a9:b0",
            "net15": "d6:98:2d:ed:e1:f6",
            "net16": "d6:35:d2:c2:cf:43",
            "net17": "b2:06:07:fd:16:59",
            "net18": "fa:cb:45:2b:19:82",
            "net19": "4a:67:59:73:24:62",
            "net2": "06:9b:de:28:44:6b",
            "net20": "32:1b:b2:69:54:48",
            "net21": "a6:81:93:12:2c:f0",
            "net22": "92:51:0b:71:29:e7",
            "net23": "06:71:ed:67:d9:0b",
            "net24": "9e:b1:24:1e:32:c4",
            "net25": "02:39:f2:5b:69:78",
            "net26": "5e:8d:cd:14:f7:a2",
            "net27": "16:ed:e9:49:9d:73",
            "net28": "4e:9c:9f:96:3d:8d",
            "net29": "22:7d:f4:71:94:ff",
            "net3": "b2:36:26:e4:7b:13",
            "net30": "7a:d0:ac:17:63:02",
            "net31": "be:1a:d9:9c:87:92",
            "net4": "0e:8d:c5:a0:4f:70",
            "net5": "ea:8b:3d:37:30:3d",
            "net6": "f2:6f:40:32:ff:d1",
            "net7": "1a:a4:7a:f6:d8:d9",
            "net8": "1e:3f:05:6a:a2:bc",
            "net9": "9e:77:33:20:e1:ab"
        },
        "tof_1_2_12": {
            "net0": "aa:5d:82:04:0c:4c",
            "net1": "42:60:48:8b:55:46",
            "net10": "02:e2:57:fe:b1:74",
            "net11": "ce:11:8c:1c:f6:73",
            "net12": "1e:8d:63:17:6e:60",
            "net13": "c6:70:7e:d7:0d:61",
            "net14": "c2:fd:78:d4:60:46",
            "net15": "46:ff:89:72:32:1c",
            "net16": "0e:6e:64:7c:a4:02",
            "net17": "e6:2b:4d:38:c2:95",
            "net18": "da:07:45:5d:c4:07",
            "net19": "9a:c5:07:2d:bf:15",
            "net2": "26:ee:dd:07:4d:7b",
            "net20": "66:c2:39:76:4e:cd",
            "net21": "be:bd:84:05:47:95",
            "net22": "ca:74:b7:af:65:10",
            "net23": "22:ce:9a:05:cb:af",
            "net24": "c6:dd:d0:2e:c7:70",
            "net25": "06:df:a4:cf:bf:9a",
            "net26": "5e:d7:e0:eb:b6:f8",
            "net27": "36:a4:98:ff:47:93",
            "net28": "4a:9e:31:2a:85:5a",
            "net29": "22:c9:9c:6b:71:6c",
            "net3": "e6:86:cc:19:5d:f8",
            "net30": "2a:17:a5:cf:3e:54",
            "net31": "32:9e:18:93:0b:7c",
            "net4": "ce:4b:c6:23:3e:69",
            "net5": "c6:6e:ca:8f:f3:8a",
            "net6": "7a:e9:57:6a:50:50",
            "net7": "f2:82:4a:12:db:7b",
            "net8": "26:c9:6d:f1:16:0b",
            "net9": "5e:6d:ce:f5:c3:72"
        },
        "tof_1_2_13": {
            "net0": "e6:8c:e1:78:e7:87",
            "net1": "02:10:5e:a1:a9:f0",
            "net10": "da:73:15:40:c9:dc",
            "net11": "46:8b:97:91:26:fc",
            "net12": "32:31:67:56:22:be",
            "net13": "4a:9e:24:cf:45:0b",
            "net14": "3e:4f:50:63:d6:f7",
            "net15": "22:d2:d9:f1:75:ad",
            "net16": "86:83:c2:9b:22:78",
            "net17": "fe:79:79:5f:7c:6b",
            "net18": "7e:35:96:93:af:8d",
            "net19": "ee:60:01:81:39:d1",
            "net2": "c2:d2:9f:77:7a:81",
            "net20": "ee:ea:c7:18:07:4e",
            "net21": "b6:37:12:7b:d1:b6",
            "net22": "e6:03:21:78:d0:c2",
            "net23": "c2:ea:1b:e4:e3:29",
            "net24": "26:34:71:21:34:31",
            "net25": "2a:a6:c1:40:07:5f",
            "net26": "fa:e6:c4:bb:b5:9c",
            "net27": "ba:cc:b5:b4:cb:3e",
            "net28": "ee:16:e6:de:e0:93",
            "net29": "76:99:42:ea:9b:d0",
            "net3": "86:22:e5:33:68:ba",
            "net30": "7a:7e:34:d6:79:00",
            "net31": "fe:d0:95:3e:cb:5b",
            "net4": "ca:68:aa:ce:81:ee",
            "net5": "6e:ec:d6:c2:c8:4f",
            "net6": "a2:2c:90:5d:d8:27",
            "net7": "76:a4:d7:59:71:d1",
            "net8": "36:80:06:62:11:56",
            "net9": "ca:0b:97:90:af:94"
        },
        "tof_1_2_14": {
            "net0": "12:e1:57:60:a8:56",
            "net1": "02:b6:31:63:5e:1e",
            "net10": "fe:0a:88:f8:54:56",
            "net11": "a2:63:cf:96:4b:86",
            "net12": "d6:0d:4d:ed:2a:d9",
            "net13": "2a:b6:bc:b4:f4:90",
            "net14": "a6:18:13:e5:96:9c",
            "net15": "5e:bc:38:41:ee:59",
            "net16": "52:c6:9b:f4:f9:b4",
            "net17": "de:8c:c9:58:57:08",
            "net18": "62:dd:ce:8f:c0:97",
            "net19": "16:92:0e:f3:9d:9d",
            "net2": "32:0a:1d:48:ac:11",
            "net20": "ce:71:ec:d1:e3:aa",
            "net21": "0e:10:57:61:11:5d",
            "net22": "56:8e:28:21:88:9a",
            "net23": "fe:f5:46:de:c8:7f",
            "net24": "76:93:42:eb:9e:43",
            "net25": "02:f7:db:8d:cb:6e",
            "net26": "be:1e:12:9e:11:d7",
            "net27": "f6:92:90:ef:ee:80",
            "net28": "42:da:f3:c9:8c:4a",
            "net29": "92:12:2f:cc:65:5c",
            "net3": "06:6b:a3:25:23:50",
            "net30": "62:34:ef:d9:c7:bf",
            "net31": "a2:9e:94:b0:cf:ca",
            "net4": "b2:9a:5e:6c:a5:6a",
            "net5": "ea:37:cb:22:89:63",
            "net6": "b2:4e:f2:41:4c:5a",
            "net7": "2e:a5:85:11:3c:4a",
            "net8": "2e:99:0e:f6:33:05",
            "net9": "32:e5:35:2d:cd:64"
        },
        "tof_1_2_15": {
            "net0": "4a:18:6d:89:71:ff",
            "net1": "be:11:8d:2e:ee:e4",
            "net10": "0a:5f:bc:9e:26:90",
            "net11": "c6:16:4c:1a:bf:e8",
            "net12": "6a:00:a8:6e:cb:1b",
            "net13": "ae:e5:a7:59:fc:09",
            "net14": "72:dd:ee:4c:4f:7d",
            "net15": "7e:55:bc:17:cf:ac",
            "net16": "76:2c:ee:a9:a6:a9",
            "net17": "f6:b9:90:9f:15:17",
            "net18": "ee:6c:b6:a5:2b:78",
            "net19": "9e:31:f1:31:04:96",
            "net2": "36:95:d5:b5:73:c7",
            "net20": "72:70:5b:ff:6c:b7",
            "net21": "1e:e6:ad:02:c2:cc",
            "net22": "e2:7c:0f:82:4c:64",
            "net23": "6e:76:59:eb:a4:a9",
            "net24": "82:ab:dc:2b:3b:4d",
            "net25": "d2:71:92:59:da:2a",
            "net26": "82:05:ef:93:2d:b5",
            "net27": "62:68:f9:43:43:33",
            "net28": "e2:5c:20:81:df:a1",
            "net29": "d6:d8:40:5f:bc:f5",
            "net3": "6e:27:b2:73:01:bf",
            "net30": "26:c9:0d:ee:fb:6a",
            "net31": "0e:19:67:99:88:cf",
            "net4": "b2:9e:22:fd:15:fa",
            "net5": "36:88:d1:95:74:26",
            "net6": "66:1e:73:4d:ad:86",
            "net7": "f2:ca:e1:1c:f5:e1",
            "net8": "4e:6c:90:72:6b:14",
            "net9": "5a:ce:3d:70:12:be"
        },
        "tof_1_2_16": {
            "net0": "0a:c0:1a:d0:8c:27",
            "net1": "06:a6:17:85:07:33",
            "net10": "aa:f5:40:f1:27:c2",
            "net11": "9a:18:31:15:ea:bc",
            "net12": "1a:2c:90:08:3f:c2",
            "net13": "46:45:23:44:60:ff",
            "net14": "a6:71:d1:2e:12:d3",
            "net15": "d2:ca:e3:97:09:88",
            "net16": "c6:74:62:7f:0f:20",
            "net17": "8e:db:57:b8:88:2a",
            "net18": "7a:d1:4f:d2:6b:77",
            "net19": "16:d2:5b:8a:bc:fc",
            "net2": "b6:2b:48:31:90:4a",
            "net20": "d6:17:73:22:37:ad",
            "net21": "26:dd:9b:b5:18:d4",
            "net22": "6e:44:5b:43:f3:ae",
            "net23": "2a:c1:02:d2:bf:90",
            "net24": "f2:4a:9f:92:11:65",
            "net25": "d6:92:bb:a3:23:45",
            "net26": "fe:7d:dc:c6:5c:43",
            "net27": "ca:2a:c6:26:a9:d8",
            "net28": "f2:89:bd:a8:9f:b7",
            "net29": "be:54:f6:be:01:08",
            "net3": "ce:1c:3f:47:74:06",
            "net30": "de:98:1d:41:95:64",
            "net31": "0e:78:07:ec:55:e2",
            "net4": "b6:de:07:81:fd:21",
            "net5": "26:8a:71:dc:83:a2",
            "net6": "da:df:2e:10:a9:c8",
            "net7": "d6:06:96:f6:6a:4a",
            "net8": "0e:36:ba:a8:b6:62",
            "net9": "be:d2:5d:36:25:df"
        },
        "tof_1_2_2": {
            "net0": "8e:29:1e:0d:c6:6c",
            "net1": "c6:ef:89:98:bb:a0",
            "net10": "32:7f:42:7a:16:43",
            "net11": "6a:72:8c:69:8b:81",
            "net12": "a6:be:7d:81:58:bf",
            "net13": "2e:79:d6:eb:b8:2f",
            "net14": "0a:c9:49:68:35:d4",
            "net15": "ae:9c:39:15:5e:5d",
            "net16": "92:99:e1:42:0e:69",
            "net17": "6e:5d:38:09:d5:e9",
            "net18": "8a:cf:2c:54:79:6d",
            "net19": "b6:16:92:6a:bd:b1",
            "net2": "c2:21:25:d8:0d:72",
            "net20": "aa:07:d1:de:e5:61",
            "net21": "aa:88:a1:d8:ad:ac",
            "net22": "4e:2a:78:da:53:e6",
            "net23": "82:c6:b3:de:89:6f",
            "net24": "ae:63:64:77:10:a6",
            "net25": "ce:1c:c2:03:eb:bc",
            "net26": "6e:41:55:c0:98:b6",
            "net27": "da:be:1b:77:09:eb",
            "net28": "ca:3c:cd:5b:8a:4d",
            "net29": "96:e9:11:93:18:56",
            "net3": "7a:9d:e6:53:00:86",
            "net30": "06:d3:2a:60:22:1a",
            "net31": "62:74:09:fd:1d:ec",
            "net4": "2a:09:14:0d:45:06",
            "net5": "2a:c4:57:1f:0a:82",
            "net6": "4a:36:69:b6:4b:60",
            "net7": "a2:e6:fb:e3:9b:d2",
            "net8": "72:8a:49:28:18:cf",
            "net9": "c6:6c:19:0f:a8:20"
        },
        "tof_1_2_3": {
            "net0": "36:a0:bf:13:a9:5d",
            "net1": "2e:f5:80:8a:97:2a",
            "net10": "de:53:95:db:9e:6f",
            "net11": "4a:6f:6f:29:22:40",
            "net12": "4e:35:81:9b:25:f7",
            "net13": "5a:10:81:14:b5:0a",
            "net14": "16:ed:90:f8:f8:b6",
            "net15": "96:76:4c:b6:de:4e",
            "net16": "8a:a1:ae:60:cd:17",
            "net17": "0e:2d:c1:fe:27:89",
            "net18": "3a:18:40:f4:b7:17",
            "net19": "12:85:8b:9c:14:77",
            "net2": "42:c9:32:36:63:8c",
            "net20": "a2:b8:cb:17:d2:db",
            "net21": "ce:ac:0c:79:93:85",
            "net22": "9e:7e:57:e2:90:49",
            "net23": "c6:bf:23:a8:dc:98",
            "net24": "12:79:7b:30:e2:e6",
            "net25": "da:27:eb:90:0e:70",
            "net26": "d6:13:98:0d:84:50",
            "net27": "6e:0a:0f:e9:19:8c",
            "net28": "be:e8:fe:41:1d:6b",
            "net29": "5e:32:0a:4b:56:00",
            "net3": "56:61:65:91:18:27",
            "net30": "4a:19:d3:32:53:0b",
            "net31": "32:0d:57:5f:5c:e1",
            "net4": "46:33:26:0b:95:e4",
            "net5": "a2:fe:d6:26:38:b5",
            "net6": "d2:d8:44:79:91:45",
            "net7": "8e:a3:d1:dc:15:de",
            "net8": "9a:56:89:41:c3:1e",
            "net9": "c6:80:7f:76:a9:6a"
        },
        "tof_1_2_4": {
            "net0": "06:c6:1f:27:de:8f",
            "net1": "6e:6a:0d:5c:3e:2d",
            "net10": "a6:77:99:4a:35:fd",
            "net11": "f6:95:7b:b4:70:c4",
            "net12": "46:a0:ab:94:f6:f7",
            "net13": "e2:6a:ea:13:9f:b3",
            "net14": "3a:6e:37:5f:08:9c",
            "net15": "12:42:95:eb:72:2f",
            "net16": "22:ac:b2:96:ff:45",
            "net17": "92:1f:53:0f:ff:12",
            "net18": "ce:32:9e:99:c8:a7",
            "net19": "4a:68:c9:a3:db:a6",
            "net2": "d2:41:71:b5:4b:0f",
            "net20": "ae:35:2b:35:9a:1a",
            "net21": "0e:a0:2f:05:96:7e",
            "net22": "ae:2f:fe:ba:58:18",
            "net23": "ca:3c:a9:d6:ca:35",
            "net24": "52:3d:ee:a4:a5:c2",
            "net25": "3a:33:18:3e:08:9b",
            "net26": "5e:44:01:0c:ef:c8",
            "net27": "5a:4f:42:25:42:6f",
            "net28": "56:34:0e:b6:c1:2a",
            "net29": "22:84:c2:14:13:56",
            "net3": "9a:74:ac:e0:85:37",
            "net30": "2a:52:35:c2:97:20",
            "net31": "5e:8a:36:6b:59:66",
            "net4": "76:aa:b1:ed:09:7a",
            "net5": "66:bf:8b:d5:ef:20",
            "net6": "be:6f:e1:a4:43:76",
            "net7": "ca:51:19:e0:e3:9f",
            "net8": "d6:ad:80:a3:a8:e2",
            "net9": "6a:14:89:e7:4c:14"
        },
        "tof_1_2_5": {
            "net0": "62:c2:c9:96:f5:4b",
            "net1": "12:64:d8:17:ee:38",
            "net10": "b6:1b:ed:94:ad:40",
            "net11": "7e:5c:07:0f:b3:40",
            "net12": "5e:95:1a:28:ab:af",
            "net13": "7e:f1:7b:aa:dd:11",
            "net14": "56:2c:ad:4b:51:2e",
            "net15": "5e:08:3f:b9:e2:32",
            "net16": "1a:f4:6e:df:08:ff",
            "net17": "e2:85:56:21:9c:3c",
            "net18": "a6:8c:a3:3d:0c:91",
            "net19": "d2:b6:cf:cd:d4:1e",
            "net2": "d6:f8:67:fa:e2:28",
            "net20": "aa:7c:8a:38:4b:f4",
            "net21": "be:d2:ec:39:31:8f",
            "net22": "2e:b2:b2:20:e9:02",
            "net23": "7a:ec:e1:aa:cc:85",
            "net24": "5e:f5:d9:1a:07:19",
            "net25": "a6:80:9a:05:7d:5d",
            "net26": "4a:51:cc:60:86:83",
            "net27": "e2:c4:14:08:8a:15",
            "net28": "62:66:65:68:ce:43",
            "net29": "a2:94:c3:83:b9:b4",
            "net3": "6a:27:51:ca:37:79",
            "net30": "32:cc:00:ed:71:40",
            "net31": "66:6f:0e:4e:3c:e1",
            "net4": "36:a6:9b:a3:19:4b",
            "net5": "c6:b8:4d:a0:0e:cc",
            "net6": "7e:c8:4d:4a:9d:d6",
            "net7": "32:9b:1f:bd:ea:e8",
            "net8": "ce:ef:32:8c:39:ae",
            "net9": "e6:22:74:31:98:2e"
        },
        "tof_1_2_6": {
            "net0": "16:2e:56:d0:aa:50",
            "net1": "6a:f1:b6:fe:fb:66",
            "net10": "b2:dd:d2:0c:97:b6",
            "net11": "8e:0b:42:5d:58:b9",
            "net12": "a2:2c:ba:21:f5:d4",
            "net13": "f6:49:09:57:a9:71",
            "net14": "ae:d7:63:05:3c:a5",
            "net15": "ba:b4:7a:04:cc:eb",
            "net16": "9a:38:82:e8:15:30",
            "net17": "82:48:09:00:a0:3d",
            "net18": "7e:68:1b:9b:d6:ab",
            "net19": "8a:26:9c:ec:2b:11",
            "net2": "02:72:74:df:3c:45",
            "net20": "ea:ac:ed:1e:d4:e4",
            "net21": "d6:f1:54:f0:a6:62",
            "net22": "8a:35:cb:8b:d6:15",
            "net23": "be:dd:56:3e:82:46",
            "net24": "da:43:06:15:8e:7a",
            "net25": "9a:95:d5:a8:b7:0d",
            "net26": "2a:1f:c4:4b:94:c6",
            "net27": "f2:ed:96:84:00:79",
            "net28": "0a:b7:bb:3e:f4:1c",
            "net29": "fa:88:60:09:dd:64",
            "net3": "66:09:4a:98:4e:c8",
            "net30": "86:d5:1c:42:ba:2d",
            "net31": "0e:66:61:c7:cf:a0",
            "net4": "86:ea:11:d8:00:a9",
            "net5": "42:46:20:6f:04:e5",
            "net6": "0e:d6:14:08:81:73",
            "net7": "3e:06:76:d1:eb:0d",
            "net8": "e2:2a:f8:6f:6d:1e",
            "net9": "4e:a0:0e:61:40:97"
        },
        "tof_1_2_7": {
            "net0": "f6:6f:77:13:41:ee",
            "net1": "8e:40:10:96:54:2c",
            "net10": "e6:ff:8e:30:1c:f5",
            "net11": "16:78:50:ee:15:3e",
            "net12": "ae:fe:33:70:42:31",
            "net13": "8a:f3:76:25:5d:38",
            "net14": "b2:49:5c:e4:f3:94",
            "net15": "ae:cf:b8:c8:63:02",
            "net16": "f6:5f:6b:8b:85:54",
            "net17": "8a:69:7d:4a:b6:dd",
            "net18": "da:19:05:a7:31:fc",
            "net19": "96:fe:a5:0b:b5:b6",
            "net2": "1a:64:47:3d:eb:7e",
            "net20": "d6:8b:1a:5f:91:00",
            "net21": "8e:82:7a:a3:c8:29",
            "net22": "ca:1d:d8:19:67:25",
            "net23": "ea:a9:05:b1:89:57",
            "net24": "aa:56:18:b0:54:7d",
            "net25": "62:f1:86:00:43:f8",
            "net26": "c6:a4:b1:f8:61:17",
            "net27": "06:d8:ff:91:11:6d",
            "net28": "46:51:19:b0:15:e0",
            "net29": "b6:b0:77:d3:12:7c",
            "net3": "32:b5:e7:64:66:ad",
            "net30": "9e:9f:ca:ac:0c:94",
            "net31": "ee:e8:52:a6:b8:e0",
            "net4": "fa:3d:d2:15:bf:ca",
            "net5": "0e:6f:a3:b6:a4:5f",
            "net6": "7a:79:5d:22:cf:3e",
            "net7": "76:af:3e:fb:72:13",
            "net8": "2e:db:d8:2f:1d:c9",
            "net9": "9a:6e:30:ae:23:b1"
        },
        "tof_1_2_8": {
            "net0": "e6:df:a5:3c:43:bd",
            "net1": "d6:08:82:ce:8c:4e",
            "net10": "9e:46:0a:a0:e9:2f",
            "net11": "0e:02:13:c1:8a:a6",
            "net12": "3a:fd:36:53:e5:e7",
            "net13": "d2:f9:0f:c8:9c:06",
            "net14": "42:bc:1a:6e:c6:8b",
            "net15": "96:af:ab:5a:a0:df",
            "net16": "ea:53:03:4e:7f:6e",
            "net17": "16:4c:6e:ad:50:bf",
            "net18": "66:ae:94:a3:8a:61",
            "net19": "82:4e:e7:e9:13:bb",
            "net2": "9a:02:5f:66:b8:3b",
            "net20": "fe:67:8d:e0:ae:8c",
            "net21": "ae:c7:79:3c:90:df",
            "net22": "82:fc:ce:b1:1f:55",
            "net23": "82:bd:8a:7b:bb:34",
            "net24": "ba:ce:db:d8:eb:fe",
            "net25": "42:a5:ba:23:ce:b6",
            "net26": "52:5b:38:ac:c4:1e",
            "net27": "be:94:25:29:f3:6e",
            "net28": "86:83:23:91:f3:ed",
            "net29": "5e:ff:db:7b:85:5e",
            "net3": "1a:df:29:30:01:9e",
            "net30": "b2:56:bd:79:68:54",
            "net31": "ce:21:b7:06:5a:96",
            "net4": "4a:03:5f:4a:85:17",
            "net5": "e2:52:6e:39:8e:c9",
            "net6": "0a:4e:fc:b0:86:4a",
            "net7": "66:5f:59:a3:e4:a8",
            "net8": "4a:8e:08:ed:63:6c",
            "net9": "d2:90:14:49:dc:92"
        },
        "tof_1_2_9": {
            "net0": "5a:0b:27:95:01:ef",
            "net1": "8a:8c:db:ce:36:f1",
            "net10": "66:45:3c:1c:9b:e1",
            "net11": "6a:ba:a7:0a:4b:5f",
            "net12": "8a:66:9c:f5:a7:3d",
            "net13": "fe:a5:c2:90:84:2b",
            "net14": "b6:9f:02:07:df:df",
            "net15": "0a:0f:2c:ba:1d:fd",
            "net16": "12:72:ba:ac:22:b2",
            "net17": "c6:8c:be:c7:23:d8",
            "net18": "7a:8f:3b:0d:4a:3d",
            "net19": "9a:a8:e6:57:3d:72",
            "net2": "72:fd:8b:2b:ef:cb",
            "net20": "3e:ce:be:d7:3d:33",
            "net21": "02:05:51:3f:50:de",
            "net22": "02:1b:95:a8:c1:07",
            "net23": "72:2f:38:bb:40:86",
            "net24": "3a:bc:b1:df:48:15",
            "net25": "96:35:c9:67:13:22",
            "net26": "82:c2:8b:33:b6:2c",
            "net27": "56:53:7b:28:e1:e6",
            "net28": "ee:55:89:29:69:55",
            "net29": "6e:01:0c:ed:c9:fb",
            "net3": "62:b3:ac:47:e0:7e",
            "net30": "86:da:70:97:c0:42",
            "net31": "b2:e2:9c:37:45:a4",
            "net4": "96:9a:77:67:11:39",
            "net5": "ce:c4:ea:3e:9a:9e",
            "net6": "1a:79:67:a3:b3:41",
            "net7": "aa:7b:c7:af:ba:78",
            "net8": "3a:cb:e2:10:dd:0c",
            "net9": "b2:fe:cc:2c:86:20"
        }
    },
    "failed_machine": "spine_1_1_1",
    "failure_time": 1616322070.9547894,
    "recover_time": 1616322209.3476927
}