{
    "description": "Scenario 5a: net0 link failure of leaf_1_0_1 with BGP",
    "k_leaf": 10,
    "k_top": 10,
    "redundancy_factor": 5,
    "is_k8s": true,
    "machine_mac_addresses": {
        "leaf_1_0_1": {
            "net0": "16:51:4e:81:e8:b3",
            "net1": "82:c8:6d:89:bb:8c",
            "net10": "fa:c7:16:b3:69:84",
            "net2": "96:46:98:08:0f:1d",
            "net3": "fe:fd:f4:b9:90:db",
            "net4": "1a:d1:b1:69:b4:c4",
            "net5": "ee:5c:1d:6e:a6:37",
            "net6": "76:39:b9:37:05:2c",
            "net7": "5e:fe:0b:68:92:7b",
            "net8": "a6:37:1e:14:b4:05",
            "net9": "f2:cf:ba:5b:e3:23"
        },
        "leaf_1_0_10": {
            "net0": "3a:a1:de:0c:0f:b8",
            "net1": "2e:f0:d4:74:09:5a",
            "net10": "fa:67:c1:8d:2e:03",
            "net2": "ee:9b:ce:da:47:2b",
            "net3": "b2:53:4c:10:81:56",
            "net4": "d6:b7:99:f5:a7:2c",
            "net5": "fa:eb:3e:16:e3:02",
            "net6": "1a:f6:8a:62:05:0a",
            "net7": "e2:a9:92:5e:7f:f6",
            "net8": "7e:8e:5c:71:97:86",
            "net9": "2a:c0:0f:18:bc:f2"
        },
        "leaf_1_0_2": {
            "net0": "26:1b:ea:24:ac:cc",
            "net1": "2e:5d:b2:10:b9:fd",
            "net10": "0a:b6:75:af:e4:03",
            "net2": "b2:84:a9:04:e2:48",
            "net3": "22:e0:87:44:3e:01",
            "net4": "2a:86:1f:f5:ce:c9",
            "net5": "e6:6f:50:0d:01:e6",
            "net6": "0a:7f:9e:90:cc:a2",
            "net7": "6a:5c:c6:4b:18:5a",
            "net8": "0e:3f:67:ab:e6:93",
            "net9": "de:ec:d2:8e:5e:dc"
        },
        "leaf_1_0_3": {
            "net0": "7a:54:58:61:6b:ee",
            "net1": "4a:2f:6a:2a:2d:40",
            "net10": "fa:2b:77:a3:64:5d",
            "net2": "66:f5:29:8a:4c:d8",
            "net3": "ae:d5:ad:0a:f3:f1",
            "net4": "ee:b4:7a:2b:a6:2a",
            "net5": "da:d9:00:46:fb:38",
            "net6": "92:6e:ce:66:bc:7e",
            "net7": "de:01:41:40:f2:9b",
            "net8": "d2:29:b3:c9:a1:35",
            "net9": "ce:b4:91:3f:fb:4c"
        },
        "leaf_1_0_4": {
            "net0": "32:9b:b1:ba:88:d2",
            "net1": "f6:ee:fd:57:87:7f",
            "net10": "0a:b4:36:eb:ad:b0",
            "net2": "b6:d8:47:e4:de:4b",
            "net3": "7e:cd:23:91:e9:c5",
            "net4": "22:3f:de:6a:14:6a",
            "net5": "fa:47:a6:f1:ef:8e",
            "net6": "42:1b:bd:e9:4e:7f",
            "net7": "12:a2:46:a6:ab:81",
            "net8": "c2:36:f2:88:b8:56",
            "net9": "fa:ac:e8:b5:5b:16"
        },
        "leaf_1_0_5": {
            "net0": "12:b5:b6:6a:a8:f7",
            "net1": "32:c1:18:15:70:93",
            "net10": "c2:a3:14:03:ea:55",
            "net2": "7a:d6:fc:38:3a:ac",
            "net3": "56:9d:09:b9:dd:36",
            "net4": "22:d5:49:c5:a1:ee",
            "net5": "86:cc:b1:a5:8f:dc",
            "net6": "e6:49:84:6e:e9:a0",
            "net7": "d2:81:0d:a6:79:ab",
            "net8": "be:ad:0c:e2:6d:40",
            "net9": "72:c0:94:83:44:47"
        },
        "leaf_1_0_6": {
            "net0": "82:d7:1d:62:ab:3f",
            "net1": "02:ea:c9:d8:2a:d5",
            "net10": "e6:02:96:94:f2:8f",
            "net2": "6a:be:7a:87:24:9e",
            "net3": "e2:4b:5d:f8:41:e8",
            "net4": "c2:9c:da:39:f3:75",
            "net5": "2a:0f:5d:5f:2a:ce",
            "net6": "2e:47:f1:4a:47:92",
            "net7": "9e:c5:b7:99:77:e3",
            "net8": "8a:c4:43:0f:56:26",
            "net9": "fa:1a:87:6f:2c:f7"
        },
        "leaf_1_0_7": {
            "net0": "6a:0d:a8:38:7a:74",
            "net1": "2e:8d:a4:fe:72:19",
            "net10": "56:53:23:4e:9c:d9",
            "net2": "5a:1a:c7:d8:73:94",
            "net3": "0a:b4:0b:58:e6:53",
            "net4": "2a:69:0f:ca:d3:9e",
            "net5": "ae:33:7c:8d:00:cb",
            "net6": "4a:94:59:87:21:81",
            "net7": "d6:50:a2:21:69:9b",
            "net8": "06:d6:50:ff:71:b7",
            "net9": "86:59:1f:2d:b6:c0"
        },
        "leaf_1_0_8": {
            "net0": "36:ba:fc:24:68:8e",
            "net1": "1a:a1:c3:0f:df:4d",
            "net10": "96:93:58:a6:7c:09",
            "net2": "f2:36:ed:a9:7c:1c",
            "net3": "a6:5d:b2:31:c3:af",
            "net4": "1a:bf:09:11:07:96",
            "net5": "76:80:34:c8:4c:42",
            "net6": "32:aa:4c:c9:b9:ff",
            "net7": "12:f8:b5:41:ad:f3",
            "net8": "3a:81:6e:79:cd:ca",
            "net9": "5e:17:ee:0d:8e:42"
        },
        "leaf_1_0_9": {
            "net0": "ae:22:7b:64:88:40",
            "net1": "22:7f:7d:63:df:e8",
            "net10": "52:38:bb:95:08:60",
            "net2": "52:13:22:19:42:70",
            "net3": "c6:96:46:00:c7:bf",
            "net4": "5e:94:68:6a:6a:c6",
            "net5": "5a:23:76:f3:38:e4",
            "net6": "f6:68:69:57:7a:3f",
            "net7": "3e:e8:c1:b9:3e:6b",
            "net8": "9e:b8:c8:05:ad:af",
            "net9": "de:4b:28:e7:43:43"
        },
        "leaf_2_0_1": {
            "net0": "3e:c4:04:42:f3:24",
            "net1": "ee:b6:04:72:3c:79",
            "net10": "02:41:c9:d6:0a:fc",
            "net2": "fe:35:4e:4d:47:95",
            "net3": "4e:b5:8f:b6:57:ed",
            "net4": "22:5b:99:7e:92:b0",
            "net5": "aa:01:7e:34:bb:b9",
            "net6": "f2:a9:65:36:90:6f",
            "net7": "b2:cd:e7:81:f1:6d",
            "net8": "3e:cd:78:59:ce:06",
            "net9": "8a:30:88:b0:aa:37"
        },
        "leaf_2_0_10": {
            "net0": "ca:99:d1:6f:4b:eb",
            "net1": "8e:61:f9:96:d6:a1",
            "net10": "66:65:65:7c:7a:b3",
            "net2": "4e:f9:0e:d1:a4:cd",
            "net3": "d6:d7:48:d4:98:78",
            "net4": "be:c0:08:d4:ac:e7",
            "net5": "82:5a:08:db:d3:02",
            "net6": "92:12:b4:78:c0:b3",
            "net7": "fe:bb:dc:b2:ac:c4",
            "net8": "12:2e:c3:33:1c:cc",
            "net9": "ba:8e:98:f9:e6:f2"
        },
        "leaf_2_0_2": {
            "net0": "de:8c:c5:f7:50:b5",
            "net1": "a6:42:a1:33:e9:80",
            "net10": "ca:62:b2:a1:27:98",
            "net2": "7e:92:a2:04:33:dd",
            "net3": "aa:76:06:29:b4:5f",
            "net4": "d6:53:3c:5b:23:fa",
            "net5": "3e:ae:d4:ac:37:d0",
            "net6": "06:68:3b:ab:5a:9b",
            "net7": "f6:1c:8b:b7:9e:d1",
            "net8": "ae:15:1b:35:20:ec",
            "net9": "1a:0a:4f:fc:cd:7f"
        },
        "leaf_2_0_3": {
            "net0": "96:e5:e3:32:81:95",
            "net1": "ca:aa:e2:9c:51:0a",
            "net10": "fe:de:34:d0:45:20",
            "net2": "6a:47:08:e4:4e:b7",
            "net3": "f6:21:10:0d:fd:7a",
            "net4": "96:c8:3e:dc:58:78",
            "net5": "46:83:b3:2d:16:7f",
            "net6": "12:ce:f7:8f:61:a9",
            "net7": "82:eb:df:1b:ad:2a",
            "net8": "ca:68:5b:f2:ef:5f",
            "net9": "d6:da:9c:41:b0:0f"
        },
        "leaf_2_0_4": {
            "net0": "0a:06:59:da:df:d7",
            "net1": "26:ca:47:46:11:4f",
            "net10": "8a:8e:68:0c:c5:1c",
            "net2": "0e:71:94:d7:fb:4f",
            "net3": "86:7b:43:f9:b6:47",
            "net4": "4a:4f:a1:aa:7a:85",
            "net5": "56:30:d4:7a:5e:92",
            "net6": "56:cf:53:dc:5e:a3",
            "net7": "92:6e:78:00:27:17",
            "net8": "92:72:df:d7:70:95",
            "net9": "9a:5b:79:6d:ae:01"
        },
        "leaf_2_0_5": {
            "net0": "be:fe:77:03:13:9c",
            "net1": "06:f7:40:6b:dd:0a",
            "net10": "ce:25:c8:a0:5a:f5",
            "net2": "72:56:b5:d5:5e:e0",
            "net3": "5a:2e:4e:ce:b2:78",
            "net4": "6e:3a:2a:98:54:c6",
            "net5": "b2:86:05:24:ca:fb",
            "net6": "ca:db:22:54:79:59",
            "net7": "fa:08:71:20:ac:a9",
            "net8": "36:d6:64:a7:45:97",
            "net9": "a2:9c:e1:d4:e7:29"
        },
        "leaf_2_0_6": {
            "net0": "16:0f:da:ea:49:48",
            "net1": "92:b2:1c:5d:48:26",
            "net10": "f2:7d:25:b4:75:6f",
            "net2": "1a:be:ef:f2:7c:22",
            "net3": "12:81:40:ec:4a:d0",
            "net4": "a2:f8:03:e3:9e:84",
            "net5": "82:83:bb:54:f4:50",
            "net6": "d2:37:4d:66:48:4a",
            "net7": "a6:45:d5:30:5f:74",
            "net8": "4a:c2:8d:39:9b:08",
            "net9": "6e:8a:27:21:95:fa"
        },
        "leaf_2_0_7": {
            "net0": "26:bc:90:6f:cc:9d",
            "net1": "0e:25:16:cc:82:94",
            "net10": "de:22:2f:6c:c9:36",
            "net2": "1e:77:bb:ff:7c:ca",
            "net3": "7e:54:2e:ba:d2:f1",
            "net4": "56:12:77:06:7c:9d",
            "net5": "56:7f:05:d9:68:f3",
            "net6": "9a:83:8b:13:a8:5a",
            "net7": "92:d6:49:db:20:48",
            "net8": "8a:d0:19:8a:5e:b1",
            "net9": "4a:6e:61:98:4f:fc"
        },
        "leaf_2_0_8": {
            "net0": "86:9b:21:37:2d:00",
            "net1": "0a:5f:5b:5a:4e:8b",
            "net10": "5a:72:a7:fe:30:f5",
            "net2": "32:07:7e:ca:db:0d",
            "net3": "ae:31:40:9c:f8:1d",
            "net4": "66:2c:a0:fa:19:76",
            "net5": "36:a2:cf:b8:0a:92",
            "net6": "ce:d1:71:c1:cf:4e",
            "net7": "ba:78:4d:3e:b9:48",
            "net8": "8e:5c:2a:f0:6e:3d",
            "net9": "6a:1b:a0:40:41:0f"
        },
        "leaf_2_0_9": {
            "net0": "36:10:b9:b1:8d:c3",
            "net1": "46:c5:8f:d9:16:27",
            "net10": "da:49:e9:01:27:c9",
            "net2": "b6:d1:cb:e7:05:cb",
            "net3": "82:94:dd:21:46:19",
            "net4": "d6:61:35:0c:af:d3",
            "net5": "0a:ea:d5:e0:f0:20",
            "net6": "3e:00:55:7a:63:e1",
            "net7": "aa:4f:40:e6:6e:04",
            "net8": "8e:35:dc:df:0b:61",
            "net9": "96:a2:ee:1c:23:46"
        },
        "leaf_3_0_1": {
            "net0": "e2:2a:e3:4c:51:91",
            "net1": "9a:4e:80:24:e7:b2",
            "net10": "82:18:df:5d:e1:9f",
            "net2": "16:01:ce:92:96:90",
            "net3": "56:55:f3:fd:80:44",
            "net4": "8a:76:a4:e8:c7:21",
            "net5": "26:db:9e:6a:85:29",
            "net6": "c6:4d:32:48:b2:88",
            "net7": "be:36:65:0b:05:66",
            "net8": "06:23:a8:a0:83:1b",
            "net9": "ae:2c:a0:21:fe:63"
        },
        "leaf_3_0_10": {
            "net0": "0a:a5:5f:51:8a:cc",
            "net1": "12:4a:75:ef:28:b0",
            "net10": "b2:5d:85:17:80:6b",
            "net2": "4e:e9:f0:b9:98:1c",
            "net3": "c2:4a:6d:27:1c:02",
            "net4": "3a:22:16:ff:c3:07",
            "net5": "e2:6b:70:6d:d4:36",
            "net6": "f2:b0:cb:5c:71:c0",
            "net7": "06:89:06:7f:ef:1c",
            "net8": "22:03:35:d8:c2:57",
            "net9": "ae:4a:e3:50:31:5b"
        },
        "leaf_3_0_2": {
            "net0": "8e:09:8c:8c:bc:82",
            "net1": "6e:40:17:ec:f0:00",
            "net10": "ca:ca:99:31:6d:68",
            "net2": "1e:78:df:24:ae:ec",
            "net3": "72:8b:a0:03:3c:9c",
            "net4": "1e:d1:38:ea:ff:aa",
            "net5": "82:8d:b6:79:2a:2e",
            "net6": "8e:8d:cb:c7:ae:c9",
            "net7": "6e:74:50:8d:df:a3",
            "net8": "a2:2f:57:50:79:ec",
            "net9": "a6:7b:f6:72:b6:ea"
        },
        "leaf_3_0_3": {
            "net0": "ae:17:d9:44:2f:e4",
            "net1": "be:87:6f:8e:c0:36",
            "net10": "ce:69:8a:4e:9b:44",
            "net2": "e6:2b:1e:77:f5:3f",
            "net3": "82:c0:72:09:c0:d6",
            "net4": "ca:08:52:53:12:73",
            "net5": "fe:d4:72:fb:23:90",
            "net6": "16:8b:22:22:33:16",
            "net7": "8a:29:35:69:1e:3f",
            "net8": "de:03:10:a5:bb:ad",
            "net9": "ae:df:55:82:7a:41"
        },
        "leaf_3_0_4": {
            "net0": "5e:3a:86:45:8f:50",
            "net1": "02:a2:66:19:1c:16",
            "net10": "f2:b0:50:e4:8c:99",
            "net2": "0a:cd:b1:d9:9c:f3",
            "net3": "e2:85:55:3b:b9:1f",
            "net4": "86:e6:9d:4f:94:79",
            "net5": "2e:2c:fe:a3:83:05",
            "net6": "2e:9d:58:0f:dd:93",
            "net7": "3a:30:60:ad:5f:d3",
            "net8": "02:bd:3b:67:20:d4",
            "net9": "56:9c:49:7c:54:53"
        },
        "leaf_3_0_5": {
            "net0": "4a:22:d4:3c:67:67",
            "net1": "46:df:fa:6f:09:74",
            "net10": "92:2b:b2:1c:0a:be",
            "net2": "e2:d8:31:f3:32:f2",
            "net3": "d6:23:78:83:18:5c",
            "net4": "26:7f:69:bf:ad:42",
            "net5": "4a:c4:bf:fa:ce:86",
            "net6": "26:28:4c:8c:99:eb",
            "net7": "de:15:60:ff:47:56",
            "net8": "b6:6f:c0:e1:68:7e",
            "net9": "da:d2:86:06:49:42"
        },
        "leaf_3_0_6": {
            "net0": "86:f8:76:13:aa:6b",
            "net1": "5a:b1:72:7b:bb:f5",
            "net10": "4a:2e:2a:73:72:16",
            "net2": "a6:8b:5e:cd:e0:65",
            "net3": "8a:a7:73:26:ea:53",
            "net4": "8e:36:a2:87:35:46",
            "net5": "36:d3:42:29:8b:6d",
            "net6": "26:29:01:d3:b8:cd",
            "net7": "46:e0:02:ae:37:d7",
            "net8": "92:cf:45:3a:0e:81",
            "net9": "ca:08:7e:1c:1b:c7"
        },
        "leaf_3_0_7": {
            "net0": "de:77:62:f9:fc:b3",
            "net1": "5a:04:02:ab:a5:69",
            "net10": "b6:2a:78:e2:4c:c1",
            "net2": "da:f5:68:a7:69:f2",
            "net3": "4a:c8:b2:7b:c1:35",
            "net4": "6a:83:9e:a7:b4:35",
            "net5": "9e:0b:a4:4e:2b:f2",
            "net6": "56:65:cf:38:88:6b",
            "net7": "02:3a:ac:89:d5:c0",
            "net8": "96:40:71:db:a9:37",
            "net9": "42:3e:42:13:25:3b"
        },
        "leaf_3_0_8": {
            "net0": "36:09:84:23:14:30",
            "net1": "1e:6c:40:29:94:74",
            "net10": "d2:39:be:02:47:ea",
            "net2": "6e:33:ec:98:11:10",
            "net3": "36:cb:a4:85:7b:3b",
            "net4": "ce:60:97:7f:02:d4",
            "net5": "d6:da:42:64:c6:2d",
            "net6": "26:31:2c:48:0b:37",
            "net7": "6a:29:ad:4f:28:24",
            "net8": "1a:4f:c4:6b:b9:26",
            "net9": "3e:b4:d2:08:fe:54"
        },
        "leaf_3_0_9": {
            "net0": "62:24:f2:28:c8:0a",
            "net1": "2a:d7:f9:d9:07:27",
            "net10": "d2:11:90:df:c6:8b",
            "net2": "5a:30:bf:46:61:a2",
            "net3": "36:d5:57:cd:8c:09",
            "net4": "8a:c3:03:eb:d1:7e",
            "net5": "42:9a:5c:db:6f:c6",
            "net6": "2e:33:b0:90:ea:45",
            "net7": "b2:3c:de:45:a3:20",
            "net8": "d6:78:ac:3a:67:f2",
            "net9": "42:23:72:a8:60:7e"
        },
        "leaf_4_0_1": {
            "net0": "5e:ab:7c:d8:32:18",
            "net1": "72:95:82:97:88:3d",
            "net10": "82:ac:88:d3:94:1c",
            "net2": "de:22:58:40:97:d9",
            "net3": "a6:f9:e2:e2:ca:04",
            "net4": "96:73:73:8b:23:60",
            "net5": "6e:a6:d6:da:88:c5",
            "net6": "16:2e:83:1c:51:d0",
            "net7": "ca:5e:fd:9a:48:bd",
            "net8": "86:bf:af:e9:7d:6a",
            "net9": "52:ac:2d:39:8a:ba"
        },
        "leaf_4_0_10": {
            "net0": "72:0a:03:21:b9:ec",
            "net1": "4e:d6:1c:d5:14:9e",
            "net10": "8e:b7:e1:b8:21:0a",
            "net2": "4e:d3:bc:ea:05:b2",
            "net3": "7a:60:0c:a8:d8:69",
            "net4": "0e:04:78:3e:13:00",
            "net5": "de:bd:02:6b:a0:18",
            "net6": "3e:02:e3:7e:da:4b",
            "net7": "e2:ff:5f:22:90:25",
            "net8": "62:9e:d4:00:87:37",
            "net9": "9e:c7:6d:8f:c9:0f"
        },
        "leaf_4_0_2": {
            "net0": "62:7b:33:dc:f5:82",
            "net1": "aa:9a:9a:a1:2f:6a",
            "net10": "06:cb:ef:62:d8:d9",
            "net2": "46:5b:a0:db:c9:b4",
            "net3": "7e:c9:5d:2b:ba:8c",
            "net4": "da:eb:e7:2e:87:c7",
            "net5": "6a:af:dc:21:e4:37",
            "net6": "0a:b9:02:5a:94:f1",
            "net7": "e2:70:04:37:da:34",
            "net8": "32:7b:87:e0:9b:88",
            "net9": "2a:ed:a4:a2:17:fa"
        },
        "leaf_4_0_3": {
            "net0": "4a:88:b4:3b:6b:ff",
            "net1": "ca:4b:e9:3c:4f:f0",
            "net10": "8a:d3:12:27:5c:4b",
            "net2": "56:59:56:19:33:29",
            "net3": "a2:a6:60:9f:1d:19",
            "net4": "b6:10:c3:42:c6:e4",
            "net5": "b2:71:fc:9f:1e:f4",
            "net6": "c6:40:df:48:45:a7",
            "net7": "76:3e:e2:fa:7f:02",
            "net8": "2e:81:25:12:31:64",
            "net9": "ce:04:12:83:06:4a"
        },
        "leaf_4_0_4": {
            "net0": "c6:99:81:38:d7:77",
            "net1": "c6:36:fb:82:38:e0",
            "net10": "2e:91:35:e5:79:f9",
            "net2": "5a:e2:6c:cf:7c:89",
            "net3": "8a:cf:c9:23:34:af",
            "net4": "b6:96:9c:fb:ee:75",
            "net5": "86:d6:b2:a1:bc:db",
            "net6": "56:04:76:66:ca:d3",
            "net7": "de:9a:fc:70:af:4b",
            "net8": "c6:28:19:a6:74:d0",
            "net9": "26:a0:01:d5:0f:53"
        },
        "leaf_4_0_5": {
            "net0": "ca:28:d0:22:8a:21",
            "net1": "6a:a0:a7:94:5e:f0",
            "net10": "9a:39:e9:9c:3f:0f",
            "net2": "26:00:8e:26:5f:ec",
            "net3": "c2:9b:ab:ec:7a:ae",
            "net4": "c2:0e:af:f8:2e:09",
            "net5": "52:d9:4b:48:d0:47",
            "net6": "12:cf:e9:42:e5:0b",
            "net7": "6e:cd:73:17:96:4f",
            "net8": "0e:20:76:a7:2b:d4",
            "net9": "06:85:71:e4:54:f3"
        },
        "leaf_4_0_6": {
            "net0": "4a:c2:53:79:4a:00",
            "net1": "d2:5a:52:00:82:69",
            "net10": "0e:48:54:9c:0f:99",
            "net2": "32:86:ed:03:27:6f",
            "net3": "2e:67:81:af:f1:92",
            "net4": "02:5f:86:e3:4a:be",
            "net5": "e2:82:f8:65:f1:e0",
            "net6": "b6:60:27:72:49:c8",
            "net7": "3e:1c:2a:4f:14:5c",
            "net8": "da:35:53:9c:d5:e9",
            "net9": "ba:b4:fe:fb:9e:cc"
        },
        "leaf_4_0_7": {
            "net0": "22:02:39:47:ef:0c",
            "net1": "0e:75:bd:a8:fd:aa",
            "net10": "ce:87:0c:4e:5b:60",
            "net2": "6a:a5:20:d5:05:60",
            "net3": "22:08:28:7a:4a:d5",
            "net4": "ae:1e:a1:8d:da:2c",
            "net5": "82:50:b7:07:0e:7e",
            "net6": "16:81:2f:01:f2:04",
            "net7": "36:36:a0:c8:59:c1",
            "net8": "ce:b0:5c:fc:dd:a5",
            "net9": "fa:61:66:d5:ce:0e"
        },
        "leaf_4_0_8": {
            "net0": "32:7b:52:aa:3a:93",
            "net1": "e6:d9:01:5e:92:50",
            "net10": "e6:d3:a9:d6:af:c0",
            "net2": "4a:58:79:4b:6a:2c",
            "net3": "26:1c:d0:7d:41:75",
            "net4": "66:64:5d:af:bc:8c",
            "net5": "be:c2:e8:50:25:f5",
            "net6": "0e:0c:e6:0c:c6:08",
            "net7": "02:b3:80:d4:c7:84",
            "net8": "3e:60:4d:c9:18:5e",
            "net9": "96:a7:87:35:30:e7"
        },
        "leaf_4_0_9": {
            "net0": "26:f6:db:3f:46:6c",
            "net1": "1e:23:e4:b8:e8:d5",
            "net10": "aa:e1:34:09:c4:6b",
            "net2": "6e:5c:8d:91:06:47",
            "net3": "0e:8f:5d:01:94:0d",
            "net4": "fa:9e:ea:4e:50:35",
            "net5": "72:e8:dd:77:0a:33",
            "net6": "76:ec:a8:c5:c0:b5",
            "net7": "82:d0:f7:97:4d:c4",
            "net8": "7e:c6:9a:01:d9:0c",
            "net9": "76:64:eb:b0:f9:c1"
        },
        "spine_1_1_1": {
            "net0": "2a:c4:8f:c3:3a:a2",
            "net1": "ee:e3:18:44:15:f1",
            "net10": "3e:55:78:02:d0:13",
            "net11": "ea:a8:29:c0:61:46",
            "net12": "fa:70:2a:1e:fd:fa",
            "net13": "46:c3:9d:93:92:03",
            "net14": "02:9a:3d:45:cd:98",
            "net15": "a6:14:06:34:c2:e6",
            "net16": "9e:aa:43:fc:f7:c9",
            "net17": "aa:ee:1d:23:89:26",
            "net18": "56:e2:fa:29:75:fd",
            "net19": "c6:69:25:68:4b:16",
            "net2": "c2:29:1c:36:78:48",
            "net3": "76:fa:95:2a:20:a4",
            "net4": "e2:7b:3b:24:ef:97",
            "net5": "9e:45:eb:33:bb:5c",
            "net6": "36:24:e4:c7:d1:a8",
            "net7": "3e:85:a3:04:80:95",
            "net8": "36:54:ec:d9:f9:1e",
            "net9": "22:83:02:c4:fe:82"
        },
        "spine_1_1_10": {
            "net0": "2e:61:a8:48:59:6e",
            "net1": "16:dc:3a:3a:e7:21",
            "net10": "8e:cf:08:61:25:65",
            "net11": "96:33:99:f6:cc:c0",
            "net12": "f2:ae:c5:83:da:a6",
            "net13": "8a:46:95:3f:95:d2",
            "net14": "0a:f1:7f:f3:81:6a",
            "net15": "5e:52:ff:ea:00:05",
            "net16": "32:7b:65:07:d4:2e",
            "net17": "76:07:bc:be:ab:4a",
            "net18": "3a:82:0a:0d:54:22",
            "net19": "7e:f4:e9:ac:63:95",
            "net2": "3a:d2:56:f8:29:d3",
            "net3": "fa:69:d3:4e:43:53",
            "net4": "22:02:42:a5:44:85",
            "net5": "d2:37:e9:13:f8:8c",
            "net6": "fe:bc:60:a1:2f:5f",
            "net7": "9a:cf:a5:a0:82:3d",
            "net8": "2e:e9:1a:d9:d8:86",
            "net9": "02:58:ab:19:5c:f5"
        },
        "spine_1_1_2": {
            "net0": "5e:6b:11:3c:06:0f",
            "net1": "c6:8b:c4:36:3b:bf",
            "net10": "1a:fa:4c:7c:f1:0c",
            "net11": "1a:44:48:7d:61:51",
            "net12": "8e:9f:b7:d2:03:34",
            "net13": "32:3e:9a:51:03:e7",
            "net14": "72:b7:eb:b7:72:a9",
            "net15": "6e:7e:bf:fc:59:70",
            "net16": "12:18:1f:ac:d3:bd",
            "net17": "26:16:a6:80:b6:d4",
            "net18": "e6:ea:00:5c:83:b7",
            "net19": "72:de:66:e2:80:5f",
            "net2": "96:3e:3c:c7:8a:80",
            "net3": "1a:a0:56:d2:99:b8",
            "net4": "92:55:0b:5a:7c:84",
            "net5": "4e:77:a2:ce:e9:bf",
            "net6": "7e:f3:d8:77:73:cb",
            "net7": "ae:88:77:26:0b:2c",
            "net8": "72:6d:2e:af:0c:69",
            "net9": "16:41:88:0c:2c:a5"
        },
        "spine_1_1_3": {
            "net0": "d6:9b:39:c9:73:4a",
            "net1": "12:6f:a0:c5:65:43",
            "net10": "da:08:5d:6e:2d:43",
            "net11": "56:21:7b:08:bc:f6",
            "net12": "52:15:57:31:1e:66",
            "net13": "c6:77:28:d1:d9:8d",
            "net14": "f6:e4:38:bb:a6:cf",
            "net15": "12:76:88:cb:64:5f",
            "net16": "e6:6c:03:85:fc:2e",
            "net17": "ca:6b:11:db:f4:c2",
            "net18": "6a:d3:f5:6a:4c:ba",
            "net19": "9a:64:4a:3e:46:3d",
            "net2": "42:d9:60:28:18:23",
            "net3": "aa:14:ea:c5:34:96",
            "net4": "0e:49:16:c6:9d:6c",
            "net5": "4e:79:d0:84:51:00",
            "net6": "9a:82:1e:0f:2a:53",
            "net7": "66:b2:6a:48:13:65",
            "net8": "e6:86:d9:2b:85:d6",
            "net9": "7e:f1:de:6f:fb:7c"
        },
        "spine_1_1_4": {
            "net0": "0e:68:cc:62:f4:8b",
            "net1": "22:7c:5c:09:98:21",
            "net10": "d2:4c:0c:7b:7c:1e",
            "net11": "5a:31:41:67:51:c3",
            "net12": "ea:cb:b0:c5:0e:18",
            "net13": "d6:3f:76:69:9a:f2",
            "net14": "de:80:ad:3d:18:be",
            "net15": "ba:20:88:39:6f:9c",
            "net16": "6a:da:0b:99:7f:16",
            "net17": "06:8f:57:4b:b3:d2",
            "net18": "56:68:23:90:c2:fe",
            "net19": "fa:f3:7f:25:ff:50",
            "net2": "c6:93:4f:51:d4:5c",
            "net3": "42:57:64:30:64:a4",
            "net4": "fa:31:3c:f6:42:92",
            "net5": "e2:40:21:74:e7:45",
            "net6": "f6:44:a4:c9:4c:29",
            "net7": "0e:79:60:d4:f4:d5",
            "net8": "da:94:af:bf:19:e7",
            "net9": "52:f7:a7:57:c2:06"
        },
        "spine_1_1_5": {
            "net0": "82:27:5b:0d:b4:0f",
            "net1": "be:bb:72:15:5a:e6",
            "net10": "42:54:3f:e5:a9:5a",
            "net11": "2e:c6:60:8a:b2:30",
            "net12": "7a:a2:65:ed:93:ab",
            "net13": "66:2b:be:9f:eb:d9",
            "net14": "02:28:48:3d:d0:ee",
            "net15": "6a:14:6e:60:3c:41",
            "net16": "8a:55:e9:8d:18:74",
            "net17": "c2:cf:2f:94:9e:a0",
            "net18": "1a:20:ef:32:fc:05",
            "net19": "ca:26:56:d7:bc:06",
            "net2": "da:f3:0a:5a:7d:8b",
            "net3": "3a:3a:1b:22:8f:1f",
            "net4": "ba:1b:98:ec:4a:57",
            "net5": "52:ec:b1:f3:19:c8",
            "net6": "12:63:1e:52:6d:19",
            "net7": "92:46:fe:57:8d:b2",
            "net8": "e2:13:09:65:47:9a",
            "net9": "c2:ff:7f:c7:a4:69"
        },
        "spine_1_1_6": {
            "net0": "f6:1f:e5:88:b0:72",
            "net1": "22:40:2f:1b:db:78",
            "net10": "5e:62:77:76:2e:ef",
            "net11": "1e:18:b5:19:3a:27",
            "net12": "da:88:5a:48:03:dc",
            "net13": "a2:61:e8:d6:20:e7",
            "net14": "7e:72:33:63:9a:83",
            "net15": "c6:29:41:f8:6e:4e",
            "net16": "5e:24:b7:b2:e7:05",
            "net17": "be:37:81:28:b1:9f",
            "net18": "5e:be:b4:9b:9c:e7",
            "net19": "ce:bb:f2:5c:7f:4f",
            "net2": "9a:56:a7:9a:43:db",
            "net3": "6a:12:ab:1c:eb:08",
            "net4": "3a:31:67:ce:1a:e8",
            "net5": "ae:8e:ba:65:1e:7b",
            "net6": "be:7b:69:ac:02:6c",
            "net7": "ee:f8:1e:fe:1b:3a",
            "net8": "32:f8:40:57:2c:cb",
            "net9": "e6:a6:33:1d:03:37"
        },
        "spine_1_1_7": {
            "net0": "f6:35:2a:74:76:ba",
            "net1": "0e:7a:b9:b8:34:3b",
            "net10": "f6:00:30:90:b8:4f",
            "net11": "aa:19:f4:97:d2:5b",
            "net12": "4a:35:c1:e7:fc:da",
            "net13": "96:86:92:2e:d5:04",
            "net14": "7a:ff:54:f5:c5:55",
            "net15": "8a:20:e2:42:b1:38",
            "net16": "16:59:dc:90:97:22",
            "net17": "9a:5a:78:8d:6f:66",
            "net18": "f6:ff:c8:d7:3b:01",
            "net19": "ba:02:c7:b5:00:60",
            "net2": "4e:f2:e2:f9:b8:02",
            "net3": "36:4b:0b:08:90:34",
            "net4": "d2:e5:1d:6a:c6:dc",
            "net5": "86:47:a7:95:82:4a",
            "net6": "8e:0e:a0:8d:9c:b7",
            "net7": "46:0f:60:19:2f:00",
            "net8": "0e:6d:9c:5e:f0:1c",
            "net9": "b2:0c:e1:85:5e:ec"
        },
        "spine_1_1_8": {
            "net0": "12:37:fc:64:13:8e",
            "net1": "c2:2f:59:c8:7e:7f",
            "net10": "e6:72:88:b3:ed:85",
            "net11": "66:5e:6b:0c:fd:15",
            "net12": "ae:d8:f2:21:db:cf",
            "net13": "6e:53:53:67:04:07",
            "net14": "26:ab:85:41:ee:44",
            "net15": "46:8c:f8:d9:45:50",
            "net16": "fe:4b:2a:38:ef:ea",
            "net17": "ca:aa:30:4e:43:4c",
            "net18": "ee:42:70:7c:91:80",
            "net19": "fe:19:6f:8b:56:f1",
            "net2": "76:7d:3c:5c:ea:28",
            "net3": "e6:c5:b4:6f:7b:f3",
            "net4": "76:8c:78:3d:ad:13",
            "net5": "de:8e:ec:c2:cd:f5",
            "net6": "7e:7a:71:dd:d5:ab",
            "net7": "c2:d1:68:ec:9f:d5",
            "net8": "ae:b8:73:51:73:82",
            "net9": "f6:24:c8:43:34:12"
        },
        "spine_1_1_9": {
            "net0": "72:ff:e1:04:1c:84",
            "net1": "8a:42:4e:1d:fe:95",
            "net10": "c2:33:be:e6:57:ab",
            "net11": "be:83:d1:2b:7e:eb",
            "net12": "02:a6:45:4e:b3:2d",
            "net13": "ee:f5:fd:5f:8e:db",
            "net14": "ba:9a:2a:a1:77:ff",
            "net15": "7a:43:5b:31:d3:ca",
            "net16": "5e:3f:51:42:c4:ce",
            "net17": "0e:72:b1:bf:01:28",
            "net18": "2e:9c:c3:ea:1d:8b",
            "net19": "56:c6:ec:97:13:0c",
            "net2": "12:04:5a:a8:81:e1",
            "net3": "a6:9c:5c:7d:3e:cc",
            "net4": "ce:f7:1d:d6:ae:3f",
            "net5": "d6:57:e0:59:17:5d",
            "net6": "fe:4c:34:7e:a3:4c",
            "net7": "f6:da:4d:8b:37:d9",
            "net8": "52:9c:b1:30:3e:03",
            "net9": "e6:34:a4:11:63:93"
        },
        "spine_2_1_1": {
            "net0": "fe:3c:8e:42:4b:ae",
            "net1": "de:2b:5c:cd:b3:08",
            "net10": "66:f0:8d:f0:b3:e4",
            "net11": "92:94:2f:f9:97:af",
            "net12": "26:01:d1:a2:0e:35",
            "net13": "92:ae:73:99:36:7e",
            "net14": "86:a4:81:01:b7:80",
            "net15": "16:d0:28:1c:de:1e",
            "net16": "32:03:54:cc:99:28",
            "net17": "be:28:b6:8a:8a:dd",
            "net18": "8a:37:55:d3:9f:61",
            "net19": "aa:21:62:1f:f6:73",
            "net2": "ae:bf:fc:28:cd:63",
            "net3": "e6:90:20:ce:9a:78",
            "net4": "aa:1b:40:35:35:d4",
            "net5": "3a:92:79:0e:8e:c3",
            "net6": "be:a8:ea:a1:57:6d",
            "net7": "82:3c:e4:6b:c7:c6",
            "net8": "02:d2:42:1e:2b:96",
            "net9": "b2:c0:88:de:d3:44"
        },
        "spine_2_1_10": {
            "net0": "f2:d8:4c:59:c3:5f",
            "net1": "4a:64:d2:66:0c:2b",
            "net10": "36:8c:69:f1:59:7b",
            "net11": "c2:89:a0:8c:72:2c",
            "net12": "c2:55:9e:dd:d2:d3",
            "net13": "8e:5d:dd:1d:78:e2",
            "net14": "3e:77:02:e5:2b:b6",
            "net15": "f2:aa:21:c0:70:fb",
            "net16": "4a:7a:dc:ae:2d:d8",
            "net17": "6a:6f:45:f8:b3:0a",
            "net18": "be:30:9d:2e:15:f8",
            "net19": "5a:18:7e:fa:2f:1d",
            "net2": "8a:6d:17:af:f7:a2",
            "net3": "e6:bf:85:94:d2:b5",
            "net4": "de:0c:a3:d0:fe:70",
            "net5": "da:b8:4f:82:a9:2c",
            "net6": "1a:78:ba:9b:c9:d5",
            "net7": "a6:87:f7:e0:d4:20",
            "net8": "7a:ba:c6:5f:fc:d1",
            "net9": "f6:fc:1d:2f:9a:7c"
        },
        "spine_2_1_2": {
            "net0": "76:cf:a3:46:32:02",
            "net1": "3e:59:82:cc:a6:1d",
            "net10": "9a:d0:e6:e4:ad:98",
            "net11": "7e:9d:32:f0:79:23",
            "net12": "be:b4:12:91:5b:b5",
            "net13": "92:31:bc:86:0f:d3",
            "net14": "6e:0b:44:5d:2f:44",
            "net15": "16:5d:78:f3:a2:e4",
            "net16": "8e:d5:67:e3:64:89",
            "net17": "e2:f3:5e:78:6e:ca",
            "net18": "f2:d1:f9:05:c1:89",
            "net19": "6e:2d:a0:0f:09:3a",
            "net2": "62:48:68:bf:06:2d",
            "net3": "92:1d:ab:dc:50:f5",
            "net4": "6a:dc:cf:b1:74:91",
            "net5": "aa:1e:ee:c5:ba:80",
            "net6": "96:dc:45:b2:c9:8e",
            "net7": "66:24:95:de:f0:5d",
            "net8": "8a:70:de:5f:bb:79",
            "net9": "ba:d0:ca:3a:cd:fb"
        },
        "spine_2_1_3": {
            "net0": "d6:62:a1:8b:ff:2d",
            "net1": "62:f7:e7:37:40:dd",
            "net10": "06:54:89:04:29:33",
            "net11": "22:f8:82:47:51:3e",
            "net12": "32:52:4c:21:a2:72",
            "net13": "be:55:1d:57:38:1f",
            "net14": "42:86:e4:60:cd:57",
            "net15": "26:c4:70:ab:7c:ab",
            "net16": "d6:a9:d3:d4:33:13",
            "net17": "9a:b2:48:b2:90:e6",
            "net18": "02:3b:0b:e2:35:d7",
            "net19": "3a:85:e6:e3:cc:c7",
            "net2": "12:bb:08:92:11:ff",
            "net3": "96:d6:9b:a8:2b:03",
            "net4": "6a:59:8e:cd:27:9c",
            "net5": "76:55:76:c5:d9:ce",
            "net6": "5a:1c:8f:2a:24:cf",
            "net7": "8e:8a:3b:a7:b9:f0",
            "net8": "62:1d:90:77:08:18",
            "net9": "5a:36:df:db:14:a0"
        },
        "spine_2_1_4": {
            "net0": "06:53:33:fb:94:52",
            "net1": "52:d1:01:b7:81:d1",
            "net10": "22:fd:9e:7a:e5:37",
            "net11": "f6:52:1b:c9:3c:1b",
            "net12": "e2:48:f1:6d:90:24",
            "net13": "5e:52:9b:3c:b3:f1",
            "net14": "52:c4:97:84:b1:ea",
            "net15": "ae:25:6f:4f:70:f8",
            "net16": "02:8f:32:ed:08:6d",
            "net17": "32:9c:84:5b:dd:d2",
            "net18": "16:10:01:1e:1f:ae",
            "net19": "8e:5f:47:65:c4:cc",
            "net2": "7e:37:ba:f6:43:42",
            "net3": "d6:25:79:cd:c6:11",
            "net4": "56:0e:3c:4f:60:69",
            "net5": "ba:a6:62:5d:38:f3",
            "net6": "8a:12:f0:d5:c0:13",
            "net7": "e6:c7:80:d4:86:9d",
            "net8": "9e:4d:d1:fd:7e:f1",
            "net9": "12:8a:fd:15:02:c2"
        },
        "spine_2_1_5": {
            "net0": "42:15:73:31:38:ca",
            "net1": "5e:91:2f:46:f2:d4",
            "net10": "8a:c4:c0:57:75:c1",
            "net11": "ee:a6:74:82:81:e4",
            "net12": "ce:2f:ad:2f:ce:b4",
            "net13": "ca:80:15:a7:fd:bc",
            "net14": "a6:0f:d7:08:39:35",
            "net15": "36:29:45:22:52:92",
            "net16": "8e:d9:9b:46:a6:45",
            "net17": "0e:45:3f:70:ee:ff",
            "net18": "76:4b:73:6f:ed:84",
            "net19": "66:3e:f0:47:9a:e2",
            "net2": "3a:a0:57:27:25:28",
            "net3": "32:a3:86:e0:88:14",
            "net4": "6e:bc:2f:6c:4b:32",
            "net5": "56:10:b5:1a:e8:2f",
            "net6": "92:eb:45:73:31:df",
            "net7": "5e:9b:7b:ee:ec:cc",
            "net8": "62:f9:35:d4:0e:3d",
            "net9": "36:fa:83:1c:a9:01"
        },
        "spine_2_1_6": {
            "net0": "ea:ed:f5:43:11:33",
            "net1": "72:60:82:11:bd:84",
            "net10": "6a:24:89:9d:6b:af",
            "net11": "da:9e:23:66:c0:f5",
            "net12": "be:90:eb:ea:58:5c",
            "net13": "6a:dc:b9:90:e6:c3",
            "net14": "6a:1d:6a:e2:cc:6b",
            "net15": "06:23:d3:88:93:ad",
            "net16": "32:87:2d:a5:60:de",
            "net17": "96:78:9d:57:a5:af",
            "net18": "aa:54:39:83:f4:21",
            "net19": "ca:a8:eb:87:bb:7a",
            "net2": "16:62:af:1a:c6:ef",
            "net3": "6a:34:d0:e1:5e:c5",
            "net4": "0e:78:c8:b6:55:6d",
            "net5": "56:63:c6:d8:75:8f",
            "net6": "ae:20:7f:35:61:7b",
            "net7": "f6:d4:57:a6:47:37",
            "net8": "ae:7d:fe:62:83:c5",
            "net9": "6e:68:40:ab:39:52"
        },
        "spine_2_1_7": {
            "net0": "16:a3:d7:96:a0:df",
            "net1": "ce:f5:06:1c:1d:af",
            "net10": "de:88:c9:e0:cb:02",
            "net11": "ae:65:e5:10:5f:76",
            "net12": "96:e4:89:d0:0a:e4",
            "net13": "42:71:9b:8a:dd:71",
            "net14": "16:72:7a:47:0a:50",
            "net15": "f6:d8:e7:37:7e:27",
            "net16": "b6:61:06:da:72:30",
            "net17": "e2:62:4b:6a:bc:f3",
            "net18": "6a:d0:08:39:ff:af",
            "net19": "1e:e7:9f:c5:5e:71",
            "net2": "ee:71:6e:e0:94:35",
            "net3": "ea:98:3e:dc:ae:0a",
            "net4": "52:98:dc:cc:07:8e",
            "net5": "ae:68:74:f4:56:8a",
            "net6": "7e:11:3c:1d:dc:d8",
            "net7": "0a:13:df:5a:aa:0e",
            "net8": "9a:4a:be:f4:a9:36",
            "net9": "ea:78:36:4c:1d:30"
        },
        "spine_2_1_8": {
            "net0": "ce:85:af:11:c7:a7",
            "net1": "c2:fa:0b:31:f4:fb",
            "net10": "fe:ad:80:11:18:df",
            "net11": "06:e6:e6:31:66:1c",
            "net12": "d6:39:74:6c:a6:7c",
            "net13": "c6:53:71:6b:eb:ac",
            "net14": "ca:07:85:4f:6e:c3",
            "net15": "66:ee:e8:f4:99:02",
            "net16": "86:c9:f6:af:43:19",
            "net17": "da:40:cf:9d:6d:69",
            "net18": "3a:51:fa:18:95:cb",
            "net19": "6a:29:b5:5b:d0:1d",
            "net2": "6e:f4:87:d1:9f:eb",
            "net3": "52:ef:c0:8d:75:f8",
            "net4": "5a:f2:9c:91:50:cc",
            "net5": "66:bf:65:89:8f:f1",
            "net6": "16:c3:c4:62:27:c5",
            "net7": "9e:10:61:99:bc:e5",
            "net8": "7e:82:d3:ef:94:3f",
            "net9": "1e:2b:45:45:c0:72"
        },
        "spine_2_1_9": {
            "net0": "82:04:90:2b:6e:52",
            "net1": "52:c7:bd:42:73:7a",
            "net10": "2a:f4:26:e4:77:ce",
            "net11": "56:6d:46:16:4d:a5",
            "net12": "26:f9:21:8e:ff:11",
            "net13": "32:bc:8f:9d:38:74",
            "net14": "b6:43:b4:85:b7:55",
            "net15": "aa:0a:d7:97:e6:17",
            "net16": "aa:1f:44:f0:af:e0",
            "net17": "26:b4:28:28:36:ee",
            "net18": "a6:8e:ab:0f:ea:99",
            "net19": "9a:85:94:69:93:5f",
            "net2": "42:63:2f:15:d1:bd",
            "net3": "46:56:af:8b:ae:67",
            "net4": "5e:66:cc:d0:36:91",
            "net5": "0a:99:d6:78:cf:b3",
            "net6": "82:97:9a:1f:ab:35",
            "net7": "86:c3:fc:f2:82:59",
            "net8": "4e:ae:cd:26:50:ca",
            "net9": "62:77:1c:71:0c:26"
        },
        "spine_3_1_1": {
            "net0": "1a:72:b6:f9:64:74",
            "net1": "ca:2d:e9:a9:ee:bf",
            "net10": "66:c9:90:0b:47:57",
            "net11": "a2:6b:dc:ad:33:e3",
            "net12": "46:fd:a6:5a:4e:37",
            "net13": "1e:4e:ff:82:4d:bd",
            "net14": "22:c9:49:37:d9:12",
            "net15": "da:0d:2a:da:1c:ac",
            "net16": "62:61:c8:16:4b:bb",
            "net17": "62:80:b9:7e:11:7d",
            "net18": "52:5d:50:56:92:8c",
            "net19": "1e:80:ee:08:ed:b4",
            "net2": "6e:a6:c4:04:fa:11",
            "net3": "12:a7:ee:e7:56:28",
            "net4": "36:a1:bc:f3:5c:01",
            "net5": "16:5f:c4:1c:8f:ba",
            "net6": "fa:8a:31:46:d3:47",
            "net7": "22:8c:3e:ce:9c:a9",
            "net8": "36:1d:07:de:4a:c6",
            "net9": "ca:f7:2a:f2:94:a3"
        },
        "spine_3_1_10": {
            "net0": "ea:3b:1e:1a:0c:9b",
            "net1": "ee:8c:5e:df:bd:f2",
            "net10": "b6:55:21:27:e1:4e",
            "net11": "16:9e:d5:c9:4d:c3",
            "net12": "9a:a4:86:97:10:4b",
            "net13": "02:57:e2:94:02:e2",
            "net14": "5a:07:0d:a7:b3:b3",
            "net15": "32:1b:95:78:56:d3",
            "net16": "2a:19:71:19:39:cf",
            "net17": "42:80:30:76:27:1a",
            "net18": "ce:ba:28:09:b8:24",
            "net19": "e6:85:11:3e:64:0e",
            "net2": "c2:9c:2b:0c:5f:47",
            "net3": "b2:8b:0b:de:a1:df",
            "net4": "42:8a:79:ef:fc:13",
            "net5": "16:07:e2:77:9a:80",
            "net6": "f2:87:9d:9a:c3:54",
            "net7": "e2:20:27:de:4c:d3",
            "net8": "e6:1b:49:6a:e7:1a",
            "net9": "12:d7:e9:44:03:41"
        },
        "spine_3_1_2": {
            "net0": "76:3a:af:dc:45:a6",
            "net1": "72:e4:d2:1b:d2:f7",
            "net10": "d2:cf:61:0c:d5:ee",
            "net11": "42:f0:9c:29:4b:f7",
            "net12": "02:2e:4d:13:3f:c1",
            "net13": "0a:d6:6a:b1:68:c3",
            "net14": "76:b7:1f:4b:85:29",
            "net15": "e2:ef:a1:a2:e9:d0",
            "net16": "96:3a:1c:a2:03:b4",
            "net17": "e2:6d:ec:c2:6c:12",
            "net18": "ee:b1:9e:9f:95:35",
            "net19": "d2:84:81:2c:db:4c",
            "net2": "26:81:db:9b:5c:1f",
            "net3": "7a:48:2d:87:95:8d",
            "net4": "da:3a:d0:dd:8a:1f",
            "net5": "9e:14:df:1b:35:24",
            "net6": "8a:0b:f2:9b:d0:ad",
            "net7": "3e:58:0e:88:b1:e4",
            "net8": "5e:18:6a:75:f0:09",
            "net9": "12:d0:7d:a7:f0:5d"
        },
        "spine_3_1_3": {
            "net0": "56:39:77:9b:32:6a",
            "net1": "be:1d:46:2a:10:e5",
            "net10": "5a:ee:4c:b2:0a:fb",
            "net11": "7a:45:da:d0:a2:3c",
            "net12": "16:b5:f3:6d:3f:d2",
            "net13": "5a:82:90:ca:03:2b",
            "net14": "22:90:18:16:0a:69",
            "net15": "16:5f:1f:e7:bd:6b",
            "net16": "ba:9c:43:af:b3:29",
            "net17": "46:bc:72:52:ff:99",
            "net18": "96:76:19:2c:b8:e9",
            "net19": "6e:37:54:76:ea:2a",
            "net2": "86:f6:9a:21:4e:53",
            "net3": "ee:1a:85:60:e0:39",
            "net4": "8a:5c:2c:1e:26:a5",
            "net5": "22:2c:08:9e:3c:f6",
            "net6": "4a:c1:f3:aa:88:40",
            "net7": "ca:19:7b:84:04:de",
            "net8": "d2:03:5a:9e:b1:e4",
            "net9": "e6:17:ab:66:12:df"
        },
        "spine_3_1_4": {
            "net0": "9a:d9:07:8a:79:43",
            "net1": "ba:ca:38:9c:36:f4",
            "net10": "46:d2:6b:97:fa:c2",
            "net11": "66:78:3b:4a:4d:22",
            "net12": "2e:04:63:6b:bc:d6",
            "net13": "96:87:57:0a:e0:1b",
            "net14": "3e:5e:35:29:73:56",
            "net15": "fe:20:c6:3d:c7:50",
            "net16": "fa:98:c4:0c:13:46",
            "net17": "e6:b9:3a:54:dc:5d",
            "net18": "b6:b9:1c:5b:f1:ca",
            "net19": "16:94:49:81:54:1c",
            "net2": "be:b5:4c:c0:9c:7f",
            "net3": "5e:6b:2d:51:f0:a4",
            "net4": "f6:f4:ee:d8:2c:1a",
            "net5": "86:23:f6:29:4b:07",
            "net6": "22:15:cd:5e:a2:53",
            "net7": "02:61:f1:5b:b6:b8",
            "net8": "ea:a1:47:2c:b3:8b",
            "net9": "ea:8b:7e:22:cd:98"
        },
        "spine_3_1_5": {
            "net0": "46:65:f5:30:33:f4",
            "net1": "de:0d:bd:d1:bd:2b",
            "net10": "1a:6d:6b:33:4d:e7",
            "net11": "ee:06:1e:c0:69:0f",
            "net12": "62:9a:8f:13:1f:a1",
            "net13": "d2:e5:dc:62:bf:42",
            "net14": "6a:f8:7b:1e:06:e0",
            "net15": "22:d4:79:96:bb:d7",
            "net16": "62:6f:90:2e:46:b5",
            "net17": "b2:e7:4e:1a:82:f1",
            "net18": "5a:08:3a:0b:f4:49",
            "net19": "7e:9f:6b:3c:04:5b",
            "net2": "ca:f4:9b:4e:f7:b2",
            "net3": "66:dc:1c:5c:7c:05",
            "net4": "06:86:9a:bb:a4:ac",
            "net5": "f2:ea:2e:d0:a9:d8",
            "net6": "36:58:81:c5:a7:1f",
            "net7": "c2:71:70:53:eb:50",
            "net8": "82:8d:91:a5:d1:88",
            "net9": "2e:4f:d1:50:34:b4"
        },
        "spine_3_1_6": {
            "net0": "5e:69:d9:2d:6e:bb",
            "net1": "da:fd:ca:d0:b2:21",
            "net10": "72:e9:d8:c7:01:82",
            "net11": "4e:80:e2:e6:ef:ae",
            "net12": "a6:ae:6c:2e:63:e3",
            "net13": "ba:0b:dd:43:a6:5f",
            "net14": "12:24:40:47:89:d4",
            "net15": "f2:79:50:49:fb:6f",
            "net16": "66:22:88:c1:6c:b3",
            "net17": "7a:b0:12:33:ca:c4",
            "net18": "02:b0:81:1e:d4:86",
            "net19": "6a:a2:96:99:cf:4a",
            "net2": "02:02:a8:65:14:fd",
            "net3": "aa:41:b8:a0:16:82",
            "net4": "ce:7e:d8:ad:ae:95",
            "net5": "2e:60:16:89:78:ba",
            "net6": "fe:b6:23:e2:08:2c",
            "net7": "9a:7e:8f:5f:7f:d0",
            "net8": "76:ea:09:b2:f5:4d",
            "net9": "e2:3b:8b:79:22:5a"
        },
        "spine_3_1_7": {
            "net0": "62:e2:be:2c:36:64",
            "net1": "6e:d1:2a:24:fc:e7",
            "net10": "ea:b5:59:40:e9:92",
            "net11": "92:5b:94:85:74:70",
            "net12": "7e:6a:fe:0d:bc:85",
            "net13": "be:14:e2:eb:7c:6a",
            "net14": "7e:a7:ed:1d:73:09",
            "net15": "8a:47:f4:7f:d5:f9",
            "net16": "ce:e9:e5:00:92:61",
            "net17": "f6:e1:5b:49:ea:90",
            "net18": "ea:4b:09:02:eb:90",
            "net19": "0a:ef:2a:75:0e:3c",
            "net2": "d2:24:0b:e8:d2:22",
            "net3": "32:b2:97:ad:35:e7",
            "net4": "aa:fb:79:55:28:3d",
            "net5": "d2:23:99:ef:e5:76",
            "net6": "92:9e:e2:4a:86:03",
            "net7": "5a:b9:93:17:f9:74",
            "net8": "96:19:10:82:7e:5c",
            "net9": "da:f0:58:0f:d8:e8"
        },
        "spine_3_1_8": {
            "net0": "4a:40:27:01:ca:07",
            "net1": "06:e2:33:d0:e2:75",
            "net10": "b6:da:5b:03:8a:40",
            "net11": "1e:42:27:03:77:43",
            "net12": "da:ec:c7:4b:c9:17",
            "net13": "ca:9f:1e:1a:4e:96",
            "net14": "3e:11:53:69:2f:84",
            "net15": "aa:f4:27:af:0b:b9",
            "net16": "72:0c:67:6d:5d:5b",
            "net17": "ca:f5:a9:bb:b4:18",
            "net18": "de:1a:d7:a3:e1:5b",
            "net19": "fe:5f:41:ad:f9:76",
            "net2": "8e:13:a3:08:b5:f3",
            "net3": "12:60:24:9a:47:b8",
            "net4": "ca:f2:91:43:49:7f",
            "net5": "ba:22:9b:a6:9f:7d",
            "net6": "66:9a:e5:cd:4b:25",
            "net7": "ea:b2:a8:77:94:7c",
            "net8": "86:56:65:39:23:40",
            "net9": "fe:ad:aa:59:76:21"
        },
        "spine_3_1_9": {
            "net0": "fe:57:bd:13:13:e1",
            "net1": "76:e9:19:ae:a8:58",
            "net10": "3a:d3:59:ac:07:77",
            "net11": "a2:53:1d:d4:bd:c1",
            "net12": "66:89:ed:93:73:90",
            "net13": "c6:35:46:76:87:43",
            "net14": "ae:f1:ab:d0:a9:e6",
            "net15": "86:b7:76:94:b9:b2",
            "net16": "16:b5:e5:24:36:c8",
            "net17": "52:50:59:10:6a:43",
            "net18": "76:df:cf:d7:1a:04",
            "net19": "3a:22:01:a3:81:76",
            "net2": "72:27:63:fb:b8:2a",
            "net3": "72:58:21:f9:a1:90",
            "net4": "aa:1e:04:ff:1d:7a",
            "net5": "ea:d6:83:fd:b8:5b",
            "net6": "12:43:ce:af:28:93",
            "net7": "42:74:bd:16:a9:ca",
            "net8": "d6:6c:f9:3d:71:a9",
            "net9": "de:6d:32:08:de:63"
        },
        "spine_4_1_1": {
            "net0": "06:b2:b2:23:4d:54",
            "net1": "c6:d6:39:aa:b4:54",
            "net10": "da:1f:7e:dd:1f:00",
            "net11": "02:e5:6b:16:f1:25",
            "net12": "c6:ef:92:e7:92:11",
            "net13": "fe:d3:67:c9:74:f9",
            "net14": "1a:62:f8:78:46:d5",
            "net15": "b2:3e:76:85:3b:98",
            "net16": "9a:27:e9:c2:51:4e",
            "net17": "2e:f2:46:e0:c2:87",
            "net18": "ea:c3:a7:96:f4:c9",
            "net19": "5a:c8:0b:59:45:02",
            "net2": "3a:02:3c:2e:c4:1c",
            "net3": "c6:d6:76:b6:39:3e",
            "net4": "b6:80:30:a6:dd:81",
            "net5": "da:b4:76:57:70:91",
            "net6": "3a:c4:42:a2:42:72",
            "net7": "9e:a3:5d:e5:3a:ca",
            "net8": "66:8f:93:0d:6f:1d",
            "net9": "e6:5f:bf:79:1b:9b"
        },
        "spine_4_1_10": {
            "net0": "16:35:98:c1:7c:7f",
            "net1": "46:be:b0:c0:d3:fb",
            "net10": "2a:1e:2c:80:ae:01",
            "net11": "ce:37:25:82:0b:5a",
            "net12": "1a:0f:0a:1a:77:63",
            "net13": "2e:50:4e:9b:c8:c0",
            "net14": "a2:43:e5:67:93:41",
            "net15": "0e:04:b0:0e:17:cc",
            "net16": "ce:86:1e:70:3a:fb",
            "net17": "de:3f:ad:b3:47:04",
            "net18": "52:ba:b2:00:6e:d9",
            "net19": "ba:94:c2:59:e3:5e",
            "net2": "aa:1b:99:d0:30:ad",
            "net3": "02:74:46:34:f4:a8",
            "net4": "52:cb:c8:36:a4:bf",
            "net5": "a6:bd:1e:fa:26:42",
            "net6": "7e:87:a3:fd:a2:fc",
            "net7": "56:99:16:ea:98:af",
            "net8": "ae:63:b3:de:90:00",
            "net9": "22:35:d8:83:3c:73"
        },
        "spine_4_1_2": {
            "net0": "8e:f3:c9:0d:6d:34",
            "net1": "66:b4:d5:41:b2:3c",
            "net10": "f2:ee:e1:e3:9e:e1",
            "net11": "ae:3c:0a:e7:0c:b9",
            "net12": "b2:cc:c3:1b:9e:a4",
            "net13": "62:6d:b6:be:10:6f",
            "net14": "92:27:51:05:7e:05",
            "net15": "82:ce:fd:58:97:29",
            "net16": "f2:c5:ca:3e:73:5d",
            "net17": "16:aa:8a:13:ef:76",
            "net18": "46:b4:0d:2d:5d:06",
            "net19": "3a:42:4d:b1:56:7d",
            "net2": "4e:bf:07:e7:86:99",
            "net3": "ce:98:76:97:b2:23",
            "net4": "e2:83:9a:72:94:d5",
            "net5": "ee:8e:04:b4:68:40",
            "net6": "22:26:77:17:7d:b2",
            "net7": "22:45:b5:da:48:e6",
            "net8": "4e:36:5a:bb:aa:2b",
            "net9": "16:58:f7:92:2e:76"
        },
        "spine_4_1_3": {
            "net0": "1e:d8:fb:50:a2:d6",
            "net1": "76:f1:9c:85:af:99",
            "net10": "52:94:fd:c5:bc:42",
            "net11": "86:a8:89:f1:b8:14",
            "net12": "32:4d:aa:77:a2:48",
            "net13": "d6:73:9d:c8:be:53",
            "net14": "b6:77:e2:9c:46:d2",
            "net15": "f2:55:50:f5:5e:0a",
            "net16": "c2:f0:b6:1b:43:3f",
            "net17": "ba:6d:7c:70:a5:25",
            "net18": "ee:aa:9f:26:af:23",
            "net19": "5e:b9:54:00:3d:11",
            "net2": "0a:a5:13:57:2d:55",
            "net3": "16:91:af:cf:36:57",
            "net4": "de:b2:4a:9b:63:ef",
            "net5": "1a:df:d6:35:25:24",
            "net6": "c6:c2:3a:6b:db:4c",
            "net7": "5e:22:d4:fc:a9:65",
            "net8": "b2:b6:29:26:c3:12",
            "net9": "5a:41:03:c7:78:73"
        },
        "spine_4_1_4": {
            "net0": "e2:dd:8c:f7:68:b0",
            "net1": "ee:b0:d1:b8:e9:df",
            "net10": "c6:0b:6f:1a:c2:0b",
            "net11": "42:b6:99:10:c3:8d",
            "net12": "7e:98:e6:79:57:4c",
            "net13": "ae:81:3f:15:c7:a2",
            "net14": "a6:5c:5d:18:f6:af",
            "net15": "ce:fc:31:73:6e:50",
            "net16": "b6:f3:5d:f3:97:ab",
            "net17": "a6:bf:f1:e9:4c:07",
            "net18": "fa:91:d2:52:e9:60",
            "net19": "76:78:b2:76:f4:ce",
            "net2": "e2:f7:14:07:1e:fe",
            "net3": "5a:54:52:49:4d:ec",
            "net4": "ea:9b:b5:41:f2:c7",
            "net5": "f2:0e:7f:f9:cb:81",
            "net6": "fe:1d:b6:28:af:dc",
            "net7": "76:5b:9d:8f:ae:1c",
            "net8": "e2:8f:75:9b:fe:36",
            "net9": "5a:67:49:40:d4:70"
        },
        "spine_4_1_5": {
            "net0": "de:ed:79:47:92:60",
            "net1": "ae:f6:41:d5:38:70",
            "net10": "3e:5e:30:f2:56:15",
            "net11": "06:80:31:00:4e:26",
            "net12": "3e:48:92:b5:83:dc",
            "net13": "9e:6d:7e:68:f2:02",
            "net14": "c6:ff:97:e9:23:a4",
            "net15": "9a:b1:ce:bb:3d:04",
            "net16": "be:9f:fa:a8:f7:20",
            "net17": "da:66:f9:42:45:95",
            "net18": "6e:0b:a6:a7:cf:95",
            "net19": "c2:ae:71:bc:5b:f4",
            "net2": "9e:fb:27:08:3f:18",
            "net3": "32:5f:f8:c8:54:c7",
            "net4": "0e:54:64:62:f4:b5",
            "net5": "aa:c8:82:68:b6:92",
            "net6": "52:ff:50:ed:61:19",
            "net7": "9a:aa:71:f0:43:9b",
            "net8": "86:86:27:fb:b6:11",
            "net9": "1a:71:c5:d1:e5:7a"
        },
        "spine_4_1_6": {
            "net0": "be:5f:72:b5:80:ae",
            "net1": "6e:81:7d:04:aa:5d",
            "net10": "02:d7:b0:35:b8:c1",
            "net11": "c2:39:7f:d6:e4:a7",
            "net12": "be:9e:0e:93:f6:12",
            "net13": "0a:f6:7b:2e:fc:60",
            "net14": "da:0e:5c:44:7d:56",
            "net15": "86:b5:94:70:7d:69",
            "net16": "3a:27:b9:51:70:5b",
            "net17": "6e:6b:e7:12:f5:5c",
            "net18": "be:b7:ec:49:7b:21",
            "net19": "a2:50:aa:3a:89:e5",
            "net2": "9e:b0:3c:34:2b:02",
            "net3": "9e:b9:1a:59:88:8e",
            "net4": "26:4b:84:da:83:78",
            "net5": "b2:ab:b7:78:97:24",
            "net6": "c6:45:90:49:d6:55",
            "net7": "96:57:b3:e4:5d:e6",
            "net8": "da:ad:da:94:bd:98",
            "net9": "16:91:ad:31:ac:66"
        },
        "spine_4_1_7": {
            "net0": "76:ed:af:3a:ad:92",
            "net1": "56:8c:b5:40:fa:9d",
            "net10": "ca:df:a5:23:6f:21",
            "net11": "92:9c:91:ae:37:05",
            "net12": "22:f7:58:09:e6:a4",
            "net13": "36:1d:a2:b8:e5:c5",
            "net14": "6e:1a:96:11:b3:5a",
            "net15": "a2:61:4f:d3:16:fb",
            "net16": "b6:97:eb:81:cd:07",
            "net17": "1e:3a:b0:3e:d0:5e",
            "net18": "0e:0c:7d:ee:0d:e5",
            "net19": "c6:aa:72:e8:a0:bf",
            "net2": "b2:f8:43:39:32:b4",
            "net3": "2a:89:d7:ac:cd:33",
            "net4": "fe:02:62:2e:8b:d3",
            "net5": "22:ad:ce:4a:75:30",
            "net6": "3e:7e:eb:8a:ed:84",
            "net7": "96:5a:dc:90:4e:47",
            "net8": "5e:eb:37:0c:3c:14",
            "net9": "5a:79:16:13:57:fb"
        },
        "spine_4_1_8": {
            "net0": "6a:64:fa:2a:22:41",
            "net1": "aa:5a:64:7b:ba:e3",
            "net10": "fe:1a:02:6f:85:75",
            "net11": "02:14:30:1b:6e:f1",
            "net12": "62:b3:90:60:89:94",
            "net13": "ae:a3:56:3e:c8:dd",
            "net14": "ea:32:c6:d7:e9:13",
            "net15": "82:d5:7a:3d:20:b1",
            "net16": "c6:ad:8e:7e:d7:e7",
            "net17": "aa:da:cb:8c:0e:ea",
            "net18": "96:46:00:82:32:69",
            "net19": "ba:2a:0f:3d:3a:0c",
            "net2": "5a:8c:80:4f:45:76",
            "net3": "52:a1:58:a2:cc:47",
            "net4": "a2:5c:fb:4f:47:f2",
            "net5": "82:46:8a:43:f1:8d",
            "net6": "82:a4:27:d5:9b:d9",
            "net7": "1a:ca:ff:22:8b:c2",
            "net8": "fa:07:ac:5f:db:00",
            "net9": "92:60:4b:5d:79:8b"
        },
        "spine_4_1_9": {
            "net0": "ae:65:4d:74:0e:d5",
            "net1": "32:cf:8e:af:d6:f1",
            "net10": "62:c3:e6:09:94:ba",
            "net11": "4e:5f:e9:25:78:18",
            "net12": "3e:e9:16:b6:71:23",
            "net13": "c2:ef:97:fe:7c:d7",
            "net14": "8a:20:56:12:33:dc",
            "net15": "82:36:e8:ee:b0:89",
            "net16": "5e:c8:1c:8e:8c:ff",
            "net17": "aa:a8:9e:ea:3a:d0",
            "net18": "de:7f:b3:6d:8b:38",
            "net19": "f2:1d:10:34:c4:84",
            "net2": "c6:72:c2:17:12:11",
            "net3": "ee:05:b8:10:58:c9",
            "net4": "96:47:6c:d6:de:fe",
            "net5": "3e:e8:36:7c:e6:3d",
            "net6": "f2:b3:4d:03:25:9a",
            "net7": "ee:ff:d2:f0:de:12",
            "net8": "02:c1:71:bc:f7:91",
            "net9": "3a:c8:f1:2b:07:0e"
        },
        "tof_1_2_1": {
            "net0": "12:22:38:12:b6:e9",
            "net1": "2a:1e:62:ed:28:67",
            "net10": "e2:9f:86:be:4f:74",
            "net11": "7e:a6:94:10:f3:98",
            "net12": "c2:a2:d1:c5:79:a9",
            "net13": "36:b6:64:87:37:d8",
            "net14": "06:6b:46:09:e2:6d",
            "net15": "6a:fd:dc:2d:5b:94",
            "net16": "e6:14:13:9b:a8:a8",
            "net17": "96:96:ba:7f:28:c7",
            "net18": "d2:97:8d:0c:5f:fb",
            "net19": "8e:4a:8f:22:1a:c3",
            "net2": "4a:62:c0:5b:88:d9",
            "net3": "1a:fc:06:ae:b8:59",
            "net4": "9a:13:90:1b:72:95",
            "net5": "ea:42:0d:d4:dd:28",
            "net6": "02:62:ae:2c:4c:18",
            "net7": "36:e4:67:0b:90:ca",
            "net8": "a6:26:fe:d3:d9:57",
            "net9": "56:c3:e5:21:3d:fb"
        },
        "tof_1_2_10": {
            "net0": "9a:58:61:bb:3e:ff",
            "net1": "2e:fc:9b:76:94:15",
            "net10": "82:e2:99:7e:f8:ec",
            "net11": "ba:62:e2:af:46:30",
            "net12": "02:05:7c:23:18:99",
            "net13": "6e:3c:e0:9b:c5:99",
            "net14": "b2:f8:3c:2b:61:6f",
            "net15": "aa:04:4f:df:98:ee",
            "net16": "6a:2b:21:f5:29:f4",
            "net17": "9e:3b:fb:5c:09:72",
            "net18": "96:40:c7:45:d1:ee",
            "net19": "26:63:b2:ec:e6:9c",
            "net2": "f6:4a:cc:3f:80:f7",
            "net3": "ce:8c:b6:c0:2e:c7",
            "net4": "4e:59:0a:84:8e:50",
            "net5": "82:83:a1:71:61:d0",
            "net6": "8e:8f:c6:e3:15:5d",
            "net7": "5a:ca:6d:ff:58:e4",
            "net8": "32:8b:a2:8f:03:99",
            "net9": "8e:62:95:e5:00:be"
        },
        "tof_1_2_2": {
            "net0": "ce:82:dc:16:23:7a",
            "net1": "ee:c6:2f:94:e4:b4",
            "net10": "8a:4b:1c:17:d7:a3",
            "net11": "3a:c7:70:29:25:14",
            "net12": "9a:aa:d9:05:73:f7",
            "net13": "82:56:cd:ed:4c:5a",
            "net14": "0e:18:07:38:ea:80",
            "net15": "be:14:8d:01:6f:ca",
            "net16": "76:84:76:e5:6a:12",
            "net17": "ce:dd:b8:83:82:58",
            "net18": "ca:1a:d3:d9:d0:6a",
            "net19": "12:b5:d4:12:7d:f5",
            "net2": "de:74:af:5d:45:82",
            "net3": "a2:52:75:6d:b7:23",
            "net4": "22:5f:c0:37:73:c3",
            "net5": "e6:5d:09:1e:5f:0a",
            "net6": "b2:8a:9e:e6:88:5d",
            "net7": "82:4d:84:58:ed:ba",
            "net8": "92:56:5c:6f:0d:df",
            "net9": "ce:79:a9:4d:70:34"
        },
        "tof_1_2_3": {
            "net0": "ce:94:a8:3b:04:6e",
            "net1": "5e:8e:51:89:23:dd",
            "net10": "a2:14:5a:3b:04:47",
            "net11": "26:f0:7e:9e:ea:cf",
            "net12": "f2:bc:1a:05:4b:20",
            "net13": "0e:4f:71:4c:07:46",
            "net14": "ea:13:44:09:d7:10",
            "net15": "9a:ca:3b:5e:02:3d",
            "net16": "72:de:6b:a7:fa:89",
            "net17": "26:a2:c4:c2:b6:28",
            "net18": "f6:26:8d:46:5a:a7",
            "net19": "9a:bb:3d:23:ff:b6",
            "net2": "62:9c:61:6d:d5:d7",
            "net3": "3e:ff:b2:13:82:8a",
            "net4": "5a:5a:64:1a:da:0f",
            "net5": "aa:da:dc:18:f2:ec",
            "net6": "32:f8:a0:2c:eb:97",
            "net7": "92:6b:60:cd:f9:23",
            "net8": "22:42:8e:70:1f:f1",
            "net9": "a2:d6:ea:9a:5f:1f"
        },
        "tof_1_2_4": {
            "net0": "16:f0:da:67:21:6c",
            "net1": "a6:55:5c:ab:fa:d2",
            "net10": "42:88:9e:1c:59:6d",
            "net11": "2e:ef:7a:29:c1:d9",
            "net12": "be:92:86:22:ee:b7",
            "net13": "f6:e4:20:d7:8c:71",
            "net14": "52:67:00:ed:90:0f",
            "net15": "0a:11:43:1a:7f:a1",
            "net16": "8a:8a:75:62:07:79",
            "net17": "3a:84:6d:5b:ca:32",
            "net18": "be:65:fc:23:d4:d2",
            "net19": "72:d9:0d:29:61:bc",
            "net2": "06:e1:ca:b2:0e:2e",
            "net3": "c6:70:9a:0d:c0:f3",
            "net4": "5a:3a:a3:3f:c8:73",
            "net5": "f2:9b:d4:87:3d:8b",
            "net6": "72:47:b0:04:07:f3",
            "net7": "e2:8b:b8:6c:66:ed",
            "net8": "ee:f8:7c:6e:ec:bf",
            "net9": "52:a4:32:98:d6:e0"
        },
        "tof_1_2_5": {
            "net0": "fa:c9:a5:bd:ed:11",
            "net1": "e6:81:34:8c:7a:96",
            "net10": "82:93:d4:9a:2a:60",
            "net11": "aa:ed:1c:16:d0:a4",
            "net12": "4a:b0:ba:41:cd:d7",
            "net13": "3e:2d:4f:ae:36:b9",
            "net14": "06:b8:61:30:f2:5f",
            "net15": "7a:d6:35:b8:39:ad",
            "net16": "82:22:9d:18:2b:2a",
            "net17": "62:b3:b4:20:dc:00",
            "net18": "0a:21:65:22:e9:b1",
            "net19": "4a:7f:f8:fe:cc:2c",
            "net2": "9a:cf:9a:5d:77:2e",
            "net3": "72:07:cc:4a:07:be",
            "net4": "8a:44:8e:be:cd:a7",
            "net5": "a6:e0:66:20:57:e0",
            "net6": "f6:20:cb:37:0f:bf",
            "net7": "02:1c:4a:00:6d:37",
            "net8": "82:07:ce:b5:41:5e",
            "net9": "ae:35:1f:80:92:23"
        },
        "tof_1_2_6": {
            "net0": "9a:f9:01:d8:ff:22",
            "net1": "7e:91:94:18:08:dd",
            "net10": "6a:97:cd:af:d0:dd",
            "net11": "92:79:fe:3c:aa:92",
            "net12": "92:73:32:96:07:62",
            "net13": "46:9c:11:68:3b:6f",
            "net14": "42:47:88:77:a4:00",
            "net15": "a6:c1:df:be:73:4c",
            "net16": "9e:1e:02:29:38:68",
            "net17": "0a:63:9f:60:54:df",
            "net18": "6e:0b:18:a3:af:11",
            "net19": "56:bd:14:d0:92:5d",
            "net2": "9a:72:62:a1:fd:cd",
            "net3": "12:e7:ae:6b:a1:16",
            "net4": "c6:de:ad:34:2a:df",
            "net5": "5e:e9:ca:d9:28:08",
            "net6": "72:8c:d0:34:c6:9c",
            "net7": "2a:c5:1e:24:b1:0a",
            "net8": "9e:6e:dd:ba:d7:9f",
            "net9": "f6:5b:9c:38:1b:e6"
        },
        "tof_1_2_7": {
            "net0": "e2:d2:42:80:3f:b1",
            "net1": "52:50:3a:86:d4:a0",
            "net10": "06:f6:25:97:d5:ae",
            "net11": "ca:be:ad:43:be:4d",
            "net12": "16:9b:b8:fb:a4:c7",
            "net13": "4a:12:44:89:96:fc",
            "net14": "42:a4:c1:68:5f:75",
            "net15": "e2:4e:6c:6b:be:0e",
            "net16": "ce:b9:9d:17:2b:b3",
            "net17": "8e:d1:54:4f:8b:64",
            "net18": "6e:8d:7e:11:56:b4",
            "net19": "8a:de:d4:58:d3:b9",
            "net2": "b6:9f:c3:e8:89:f4",
            "net3": "6e:1e:d3:bf:4e:0b",
            "net4": "be:8c:92:8d:7a:25",
            "net5": "5e:4f:8c:43:2b:e8",
            "net6": "ce:0c:5b:2c:17:32",
            "net7": "f2:a9:06:0e:d3:05",
            "net8": "5e:e5:b7:ce:c1:09",
            "net9": "aa:72:9c:aa:ae:eb"
        },
        "tof_1_2_8": {
            "net0": "ea:ef:81:c2:95:22",
            "net1": "0a:5d:c9:e5:d7:be",
            "net10": "92:29:2f:17:24:2e",
            "net11": "2e:a1:0e:98:18:9c",
            "net12": "b6:63:63:d2:21:ce",
            "net13": "9a:46:01:72:5e:4d",
            "net14": "8e:b3:93:bb:9a:5c",
            "net15": "ee:6e:6c:8e:c8:fe",
            "net16": "be:33:29:88:71:a9",
            "net17": "3a:f4:e7:7a:60:14",
            "net18": "be:f0:f0:e3:15:08",
            "net19": "ea:5a:e1:8e:e2:ff",
            "net2": "26:51:f5:d0:97:31",
            "net3": "86:d4:80:8a:49:ef",
            "net4": "3a:6d:24:85:ec:c6",
            "net5": "42:78:2c:df:9e:28",
            "net6": "0e:b5:32:41:65:8d",
            "net7": "0a:f2:f6:33:f4:61",
            "net8": "5a:13:25:16:59:0c",
            "net9": "ce:10:04:b5:8c:a5"
        },
        "tof_1_2_9": {
            "net0": "92:8b:c5:b8:d3:5b",
            "net1": "9e:2b:4d:01:6a:01",
            "net10": "82:61:69:ff:52:e4",
            "net11": "6a:9a:b3:7b:0c:f3",
            "net12": "1e:df:d8:f3:3b:8d",
            "net13": "fa:07:47:ef:88:27",
            "net14": "22:61:2c:bd:09:89",
            "net15": "3a:25:aa:d5:3b:79",
            "net16": "6a:84:48:20:d8:e8",
            "net17": "7e:05:c7:87:b0:bc",
            "net18": "02:70:99:fd:60:d5",
            "net19": "02:a8:85:49:e9:97",
            "net2": "d6:f1:23:71:5e:6d",
            "net3": "02:bc:59:bd:f7:39",
            "net4": "ae:19:bb:05:dc:f1",
            "net5": "0e:75:09:d7:e3:e7",
            "net6": "3a:69:2c:40:97:19",
            "net7": "86:e6:46:ed:fc:6c",
            "net8": "5e:b1:18:57:6f:a8",
            "net9": "d6:63:04:fd:cb:f7"
        },
        "tof_2_2_1": {
            "net0": "8e:d6:91:f6:e0:bf",
            "net1": "22:6e:e4:48:48:a1",
            "net10": "be:43:74:94:fb:99",
            "net11": "ce:1c:5c:c2:f9:e3",
            "net12": "86:b9:db:81:f0:33",
            "net13": "22:20:7e:6e:97:16",
            "net14": "ce:aa:86:49:b1:db",
            "net15": "9a:49:63:69:ae:26",
            "net16": "1a:43:e7:5c:85:1f",
            "net17": "86:5c:8f:47:99:86",
            "net18": "ca:66:ea:83:24:f9",
            "net19": "fa:3e:af:a3:d0:25",
            "net2": "6a:d6:2c:51:f4:9d",
            "net3": "2a:1e:c2:b3:4f:8b",
            "net4": "fe:9a:9e:25:94:eb",
            "net5": "36:be:f3:45:1f:b0",
            "net6": "42:90:73:60:8b:e9",
            "net7": "52:82:a1:0b:fa:b0",
            "net8": "5e:32:81:bb:a0:d9",
            "net9": "6e:11:5d:a6:e7:92"
        },
        "tof_2_2_10": {
            "net0": "0e:6e:e7:e7:bd:73",
            "net1": "26:ef:8a:c7:09:53",
            "net10": "62:93:29:ce:88:9b",
            "net11": "46:4b:6b:d1:76:fc",
            "net12": "96:1a:ca:8c:03:90",
            "net13": "d2:69:f0:63:5d:b2",
            "net14": "0a:93:82:77:b3:72",
            "net15": "52:78:56:5e:27:34",
            "net16": "22:74:9b:2c:52:5d",
            "net17": "62:c9:9c:0a:26:2e",
            "net18": "b6:d6:c6:47:3e:71",
            "net19": "ca:af:dd:65:de:a2",
            "net2": "f2:bc:01:09:2a:4b",
            "net3": "06:e8:3d:04:e9:12",
            "net4": "8e:d8:bf:0b:75:92",
            "net5": "16:92:b1:b4:de:d2",
            "net6": "1e:bc:c9:d6:5c:7b",
            "net7": "ea:01:54:20:44:d5",
            "net8": "ce:13:41:3a:f4:2c",
            "net9": "f6:c3:66:3f:d8:12"
        },
        "tof_2_2_2": {
            "net0": "76:e9:18:2a:45:d6",
            "net1": "3e:1d:6e:2c:d8:dd",
            "net10": "76:6f:19:cd:80:aa",
            "net11": "2a:f9:56:50:29:d7",
            "net12": "16:de:98:08:21:9f",
            "net13": "66:8f:f5:a7:1a:3f",
            "net14": "5e:be:45:6d:bd:78",
            "net15": "56:b9:74:ea:cc:e2",
            "net16": "5e:7b:7f:29:7a:0b",
            "net17": "0a:bd:4b:90:f6:ff",
            "net18": "f2:04:07:3d:e8:ba",
            "net19": "02:cd:0b:a7:51:1f",
            "net2": "ee:43:28:63:6c:2d",
            "net3": "8a:2b:44:c2:4a:89",
            "net4": "62:e0:b2:e1:c6:55",
            "net5": "f6:b1:00:5b:bb:09",
            "net6": "a6:9c:f5:18:48:e4",
            "net7": "b2:93:93:c9:61:e1",
            "net8": "9e:c9:14:dc:0e:95",
            "net9": "c2:39:91:92:c1:cb"
        },
        "tof_2_2_3": {
            "net0": "7e:9e:74:0e:d8:99",
            "net1": "1a:88:fe:55:28:80",
            "net10": "e6:1a:09:0c:83:d5",
            "net11": "6a:1d:d0:ed:5d:34",
            "net12": "02:75:60:0f:42:fa",
            "net13": "22:8c:f4:cc:3d:b9",
            "net14": "1a:38:e3:bf:bb:41",
            "net15": "a6:cc:9d:e4:1a:69",
            "net16": "ee:d2:ee:4e:1a:9d",
            "net17": "92:78:68:d4:74:ae",
            "net18": "82:4e:eb:97:b2:c8",
            "net19": "6e:0c:b2:13:57:e8",
            "net2": "9a:ff:c5:1f:33:03",
            "net3": "02:71:d9:22:c9:87",
            "net4": "72:ff:a9:17:57:66",
            "net5": "de:8b:18:15:55:db",
            "net6": "52:af:72:3e:f7:41",
            "net7": "62:6a:13:07:7e:4d",
            "net8": "2a:43:5e:b3:c8:f9",
            "net9": "8a:19:92:c8:d3:0c"
        },
        "tof_2_2_4": {
            "net0": "6a:50:bd:60:f6:47",
            "net1": "1e:82:43:b6:de:a8",
            "net10": "16:6b:04:7c:9b:d9",
            "net11": "1e:31:df:64:fa:29",
            "net12": "56:37:9f:8d:6a:2e",
            "net13": "62:59:1d:c4:2c:40",
            "net14": "5a:d0:e6:64:a9:30",
            "net15": "c6:4a:90:ee:82:f9",
            "net16": "ca:79:ef:80:2d:53",
            "net17": "2a:c3:df:4b:48:39",
            "net18": "1e:f7:cc:b8:f7:7d",
            "net19": "2e:7c:f2:73:12:fd",
            "net2": "e6:c7:e1:5c:d8:ef",
            "net3": "56:50:e7:25:21:7a",
            "net4": "02:6e:03:99:cd:9b",
            "net5": "82:85:65:be:c1:9b",
            "net6": "7e:11:ec:6d:18:38",
            "net7": "06:d6:61:28:a3:4a",
            "net8": "42:75:4d:ef:e1:f5",
            "net9": "26:3b:7b:d4:97:aa"
        },
        "tof_2_2_5": {
            "net0": "42:86:9a:f8:b9:4b",
            "net1": "3e:95:3c:0d:f3:8c",
            "net10": "4e:ef:f9:ae:73:5a",
            "net11": "1e:a4:6a:34:7d:5a",
            "net12": "16:56:a7:28:3d:7c",
            "net13": "8e:6a:03:f1:60:e1",
            "net14": "2a:17:6a:91:3c:59",
            "net15": "76:ca:c7:3e:2a:91",
            "net16": "9e:0c:d1:b3:c1:ed",
            "net17": "42:a7:8d:6f:18:f3",
            "net18": "2e:a0:ac:80:c2:0c",
            "net19": "ba:d0:04:f1:d3:b0",
            "net2": "6e:55:77:a1:f5:7c",
            "net3": "da:f7:0b:57:50:8a",
            "net4": "96:96:2f:1a:62:1c",
            "net5": "d2:06:ec:16:71:20",
            "net6": "b2:61:ac:06:b2:9c",
            "net7": "32:93:c4:10:02:e1",
            "net8": "9a:82:28:39:1a:00",
            "net9": "ae:cd:a6:6f:09:6b"
        },
        "tof_2_2_6": {
            "net0": "c6:e3:2d:36:08:e2",
            "net1": "06:f2:a8:3b:b2:d0",
            "net10": "66:be:74:3c:ce:83",
            "net11": "9e:1b:21:6c:63:5c",
            "net12": "32:05:5c:b1:72:be",
            "net13": "3e:8b:31:7d:98:6e",
            "net14": "42:59:6d:c3:46:7d",
            "net15": "d6:7f:bb:99:cd:1e",
            "net16": "da:36:b1:a5:34:2b",
            "net17": "da:b4:e9:4c:f2:c7",
            "net18": "f2:c5:48:48:74:18",
            "net19": "26:67:68:36:19:6a",
            "net2": "9a:1c:eb:88:5b:52",
            "net3": "9a:a2:81:c7:39:6f",
            "net4": "fa:8f:aa:db:d8:b2",
            "net5": "be:f5:16:cc:36:ff",
            "net6": "fe:9e:20:82:33:02",
            "net7": "7e:e1:bf:48:34:a7",
            "net8": "b2:76:3f:33:1a:5b",
            "net9": "8e:e4:95:03:1f:1d"
        },
        "tof_2_2_7": {
            "net0": "7a:62:8a:29:ed:0d",
            "net1": "2a:f9:ac:86:4b:d6",
            "net10": "02:e0:c3:7b:60:67",
            "net11": "96:65:cd:57:af:5f",
            "net12": "be:0c:3d:90:dc:ef",
            "net13": "da:64:65:ff:6c:b3",
            "net14": "fa:51:16:df:d2:f2",
            "net15": "ca:af:ae:75:85:47",
            "net16": "3e:8c:52:5b:f2:23",
            "net17": "be:1d:17:1d:a3:e0",
            "net18": "2e:63:4c:51:ac:7f",
            "net19": "1e:e2:5e:23:58:5e",
            "net2": "e2:4b:c7:d0:fe:6d",
            "net3": "ea:3f:cb:ee:2a:67",
            "net4": "ae:30:90:c1:ba:3d",
            "net5": "86:df:36:51:b3:60",
            "net6": "9e:48:3f:c8:ce:2a",
            "net7": "42:bc:a4:45:8d:51",
            "net8": "9e:f3:04:8e:97:43",
            "net9": "7e:77:69:d4:84:c7"
        },
        "tof_2_2_8": {
            "net0": "56:66:68:6b:3a:09",
            "net1": "d2:e2:bc:df:e0:13",
            "net10": "ea:f4:2c:38:2a:26",
            "net11": "2a:db:a3:ba:3c:ba",
            "net12": "36:b1:79:53:48:1b",
            "net13": "0e:b3:5f:26:d6:ce",
            "net14": "4e:06:09:a9:c4:b8",
            "net15": "de:d1:ce:e5:59:b1",
            "net16": "8a:3a:99:aa:f4:5e",
            "net17": "c2:4e:d4:36:36:d0",
            "net18": "c6:4d:dd:d2:db:02",
            "net19": "86:55:c5:b1:93:3a",
            "net2": "2e:be:9d:a1:e7:d1",
            "net3": "72:40:9b:96:76:3f",
            "net4": "aa:88:93:d4:54:71",
            "net5": "52:b3:89:81:f7:10",
            "net6": "56:9b:b6:a8:b2:62",
            "net7": "0a:2c:93:10:a4:1f",
            "net8": "e2:41:83:3c:01:f6",
            "net9": "e2:41:c2:36:3e:05"
        },
        "tof_2_2_9": {
            "net0": "72:aa:ac:f0:69:ed",
            "net1": "42:80:ed:1d:63:b5",
            "net10": "86:00:d8:4a:43:5f",
            "net11": "32:e0:53:62:d2:f2",
            "net12": "72:b3:03:70:94:5d",
            "net13": "be:60:1f:b8:80:65",
            "net14": "a2:9a:ce:b1:01:3f",
            "net15": "12:14:a0:d2:21:2c",
            "net16": "ea:74:e1:14:7a:ed",
            "net17": "22:95:5d:bf:8b:2a",
            "net18": "1a:a8:51:c1:30:88",
            "net19": "7a:05:30:13:37:a2",
            "net2": "42:33:71:f6:24:ff",
            "net3": "5a:43:e4:39:d1:62",
            "net4": "8a:6b:4a:ed:05:7a",
            "net5": "a2:83:37:e0:8d:fc",
            "net6": "be:55:5b:91:5d:fb",
            "net7": "36:03:8a:5c:32:83",
            "net8": "3a:f7:33:cb:ca:b8",
            "net9": "56:92:80:5f:35:bb"
        }
    },
    "failed_machine": "leaf_1_0_1",
    "failed_interfaces": [
        "net0"
    ],
    "failure_time": 1616347008.2184463
}