{
    "k_leaf": 14,
    "k_top": 14,
    "redundancy_factor": 14,
    "is_k8s": true,
    "machine_mac_addresses": {
        "leaf_1_0_1": {
            "net0": "5e:7a:a7:74:4f:1a",
            "net1": "fa:2c:87:aa:49:d9",
            "net10": "76:81:43:ce:32:61",
            "net11": "2a:29:41:52:ac:60",
            "net12": "8a:97:df:a5:6c:14",
            "net13": "26:3f:dc:8b:32:42",
            "net14": "7a:8e:09:4d:28:73",
            "net2": "2a:71:e3:a7:f7:0b",
            "net3": "12:6e:77:79:63:89",
            "net4": "8e:9b:4b:46:88:55",
            "net5": "e6:8f:d7:68:da:98",
            "net6": "a2:7f:42:f8:fc:cb",
            "net7": "7a:1c:cd:61:75:26",
            "net8": "f2:6a:62:f9:4a:3b",
            "net9": "42:80:d2:82:b7:18"
        },
        "leaf_1_0_10": {
            "net0": "e6:82:a6:46:53:ca",
            "net1": "46:4e:a3:60:aa:4a",
            "net10": "7e:3b:c2:44:b6:80",
            "net11": "96:d0:2d:3b:e0:84",
            "net12": "d2:ed:a2:ab:b5:50",
            "net13": "d6:61:10:27:62:fd",
            "net14": "86:c8:a0:ab:2c:ba",
            "net2": "4e:0f:37:35:f0:1a",
            "net3": "fe:65:df:fb:42:f1",
            "net4": "62:d5:b6:eb:6f:49",
            "net5": "7a:dc:51:ad:1e:c3",
            "net6": "5e:2e:53:2d:c4:4e",
            "net7": "ae:3b:f6:4a:82:a5",
            "net8": "c2:12:6f:a7:35:32",
            "net9": "c2:f7:bf:98:8f:e7"
        },
        "leaf_1_0_11": {
            "net0": "96:55:ba:49:96:13",
            "net1": "72:1d:19:a5:78:b0",
            "net10": "ca:c4:15:d8:ee:a1",
            "net11": "62:ea:8e:4b:d8:22",
            "net12": "72:90:e8:af:0d:43",
            "net13": "06:72:a2:9a:b6:52",
            "net14": "2a:42:4b:e7:b1:6b",
            "net2": "4e:27:54:f6:89:9e",
            "net3": "46:84:99:4a:9d:12",
            "net4": "ea:ce:a4:03:fc:24",
            "net5": "2e:0b:d0:a5:8c:c6",
            "net6": "82:de:ab:e5:0a:a4",
            "net7": "4a:44:c4:4c:71:69",
            "net8": "ae:16:56:7c:24:8c",
            "net9": "f6:65:1c:5a:1b:44"
        },
        "leaf_1_0_12": {
            "net0": "6e:7a:ee:6f:f8:98",
            "net1": "ae:87:d2:a9:ac:7c",
            "net10": "02:c1:1c:34:70:a7",
            "net11": "12:f9:9a:e7:e6:7d",
            "net12": "06:e6:9e:8e:52:9f",
            "net13": "22:ba:1a:cf:e3:4f",
            "net14": "3e:0d:0b:06:be:9b",
            "net2": "fa:37:7b:ff:f0:28",
            "net3": "8a:d3:94:1f:70:59",
            "net4": "ae:7f:a0:a4:4b:df",
            "net5": "5e:ef:69:2a:06:ea",
            "net6": "a2:69:8b:b8:d4:d7",
            "net7": "c6:71:ae:fc:81:11",
            "net8": "16:24:24:99:47:16",
            "net9": "2e:b9:e1:92:60:46"
        },
        "leaf_1_0_13": {
            "net0": "8e:5a:00:b5:1b:09",
            "net1": "06:d0:9c:e4:78:76",
            "net10": "ca:f0:6a:ee:29:d8",
            "net11": "c2:ab:bd:c1:93:32",
            "net12": "56:02:3c:0f:4b:85",
            "net13": "b2:66:7a:8f:85:55",
            "net14": "6e:68:f8:fc:9e:32",
            "net2": "c2:42:12:76:14:40",
            "net3": "c2:4a:5d:91:a2:ea",
            "net4": "16:86:af:62:c7:fb",
            "net5": "f6:b3:14:54:9d:b0",
            "net6": "a2:cd:a5:fb:03:e5",
            "net7": "b2:ce:6f:c5:ec:b0",
            "net8": "ee:e7:b3:8e:1c:0d",
            "net9": "3e:a0:81:72:23:f6"
        },
        "leaf_1_0_14": {
            "net0": "a6:be:9c:da:c1:03",
            "net1": "9e:b5:d2:3f:51:8b",
            "net10": "da:6c:1a:57:c3:3d",
            "net11": "8e:7b:43:d6:dc:99",
            "net12": "6e:a4:8b:8d:d1:25",
            "net13": "ce:ee:93:0c:e3:a2",
            "net14": "ea:91:b1:26:71:c9",
            "net2": "72:d5:b5:82:90:23",
            "net3": "aa:c2:76:43:63:f6",
            "net4": "fa:6c:4e:f6:ba:b7",
            "net5": "be:bf:bb:98:8f:7c",
            "net6": "ee:cc:9c:5d:23:bc",
            "net7": "56:97:8f:b4:84:44",
            "net8": "c6:fd:69:9f:67:77",
            "net9": "0e:17:65:ad:b5:4f"
        },
        "leaf_1_0_2": {
            "net0": "8a:90:a6:eb:e4:c2",
            "net1": "ce:0c:c7:34:9d:4f",
            "net10": "5e:32:e3:ce:50:70",
            "net11": "ce:bd:b1:68:fb:d7",
            "net12": "6a:6f:9f:6c:f0:9c",
            "net13": "3e:e9:36:8c:fb:f9",
            "net14": "9e:ea:84:b3:6d:9c",
            "net2": "be:8b:23:ba:35:29",
            "net3": "62:0a:41:ae:3d:a0",
            "net4": "72:8e:e2:ba:1d:30",
            "net5": "ee:5d:e6:cc:58:1c",
            "net6": "f2:14:5e:7e:36:a7",
            "net7": "8e:13:66:52:ad:c9",
            "net8": "0a:84:b1:e8:53:f7",
            "net9": "66:15:53:22:27:c7"
        },
        "leaf_1_0_3": {
            "net0": "22:b6:1a:99:80:47",
            "net1": "ba:d3:2e:a1:a6:36",
            "net10": "0a:c0:8f:b3:7a:ea",
            "net11": "f6:c2:5b:f6:b0:b6",
            "net12": "12:4c:b0:f2:f0:49",
            "net13": "c6:6f:72:68:0a:35",
            "net14": "2e:8c:40:10:5a:71",
            "net2": "8a:0a:d2:d3:d2:44",
            "net3": "e2:3a:de:d4:c9:3a",
            "net4": "82:7a:d6:f0:66:e7",
            "net5": "2a:ae:ef:8b:37:be",
            "net6": "6a:0b:34:e6:a2:cb",
            "net7": "16:8e:91:6c:73:57",
            "net8": "ee:2e:2a:81:cd:ae",
            "net9": "ca:ff:0b:3e:9e:7f"
        },
        "leaf_1_0_4": {
            "net0": "7a:f4:6f:69:4f:0b",
            "net1": "72:14:52:94:1d:d3",
            "net10": "fe:a4:e8:c7:63:47",
            "net11": "32:09:65:71:66:0a",
            "net12": "4a:25:de:06:65:76",
            "net13": "ce:25:f0:c0:55:67",
            "net14": "36:88:bf:75:10:97",
            "net2": "32:da:d1:54:34:f7",
            "net3": "82:80:fe:88:3e:2c",
            "net4": "ea:21:35:ef:66:d5",
            "net5": "0e:eb:c6:7b:9c:9d",
            "net6": "ea:5c:a1:ab:4d:67",
            "net7": "82:67:e3:05:f4:66",
            "net8": "9e:f5:ab:5d:19:53",
            "net9": "ba:b1:d3:ac:fd:8f"
        },
        "leaf_1_0_5": {
            "net0": "d2:e9:43:6a:d0:ff",
            "net1": "9a:74:93:9c:42:cc",
            "net10": "ae:4d:0f:81:43:b2",
            "net11": "4e:99:58:1a:a3:fb",
            "net12": "72:d9:b7:64:64:b7",
            "net13": "66:f6:75:d0:65:e4",
            "net14": "2e:c2:27:26:22:c6",
            "net2": "a6:45:20:e7:b0:31",
            "net3": "a6:a7:d1:42:7f:1a",
            "net4": "8a:28:63:23:bb:07",
            "net5": "36:9c:68:7d:e7:63",
            "net6": "be:c6:08:11:a1:39",
            "net7": "d6:42:aa:ca:ab:a6",
            "net8": "26:54:d5:82:25:b5",
            "net9": "62:48:e4:18:de:1a"
        },
        "leaf_1_0_6": {
            "net0": "a2:19:f4:fb:cc:41",
            "net1": "46:1d:5b:98:cc:d1",
            "net10": "fa:f6:ec:65:0b:ac",
            "net11": "de:5c:a3:cd:74:f7",
            "net12": "7e:7f:3c:1a:71:81",
            "net13": "02:a7:12:9f:3a:29",
            "net14": "da:6a:ce:99:b7:6b",
            "net2": "06:0c:8d:53:d4:52",
            "net3": "86:b6:77:86:f0:f3",
            "net4": "9e:51:e2:eb:5c:9b",
            "net5": "8e:33:b8:a1:0d:95",
            "net6": "0a:b3:86:6e:b8:70",
            "net7": "6a:05:d6:23:73:0c",
            "net8": "4e:96:b3:da:82:48",
            "net9": "e2:c9:bd:f2:71:90"
        },
        "leaf_1_0_7": {
            "net0": "ee:6f:38:e8:93:07",
            "net1": "ee:80:58:d7:ab:60",
            "net10": "f6:11:72:40:95:45",
            "net11": "2e:ba:6d:89:b0:28",
            "net12": "86:35:41:06:e1:62",
            "net13": "e6:cb:f9:25:83:bf",
            "net14": "9e:51:f4:79:05:32",
            "net2": "4a:e0:06:cc:f9:13",
            "net3": "06:9c:b8:eb:ea:71",
            "net4": "86:3c:da:9b:c1:f4",
            "net5": "22:78:72:ff:21:64",
            "net6": "9a:bb:f5:30:ef:b3",
            "net7": "72:af:83:86:1f:08",
            "net8": "16:26:49:4e:51:62",
            "net9": "06:ee:2c:fe:4c:06"
        },
        "leaf_1_0_8": {
            "net0": "0e:65:57:2c:90:bd",
            "net1": "72:c6:85:22:77:54",
            "net10": "62:ff:35:4f:91:44",
            "net11": "4e:b9:1e:3e:a5:1c",
            "net12": "f2:17:37:5e:55:b9",
            "net13": "b6:91:c4:0f:8a:e5",
            "net14": "86:cb:2b:06:e4:ed",
            "net2": "ea:da:67:1b:67:a8",
            "net3": "12:bf:b3:ea:b1:77",
            "net4": "da:97:ac:53:f4:c1",
            "net5": "72:e9:d3:0a:2b:1f",
            "net6": "ee:3c:43:bd:c4:e8",
            "net7": "4a:02:b4:14:75:0e",
            "net8": "86:04:f8:11:72:51",
            "net9": "96:f2:3a:2b:42:f7"
        },
        "leaf_1_0_9": {
            "net0": "e6:10:84:80:3a:d0",
            "net1": "de:4c:0b:57:b0:75",
            "net10": "ca:01:3a:96:5e:89",
            "net11": "26:a3:e4:d4:e6:ac",
            "net12": "02:8b:97:d1:d9:03",
            "net13": "7a:2c:aa:c6:e1:85",
            "net14": "52:86:90:3e:fa:2d",
            "net2": "86:02:64:47:d0:a9",
            "net3": "da:7f:8c:d8:40:48",
            "net4": "6e:5a:b2:a8:92:af",
            "net5": "ba:15:39:14:c9:df",
            "net6": "66:a5:db:16:f6:73",
            "net7": "6a:6f:d3:3d:25:49",
            "net8": "2a:29:aa:52:00:2f",
            "net9": "9e:af:8e:db:19:b6"
        },
        "leaf_2_0_1": {
            "net0": "fa:0f:d1:36:1e:73",
            "net1": "7a:a5:0a:d5:91:60",
            "net10": "d2:a0:3b:50:0c:c1",
            "net11": "36:c9:db:17:8c:3c",
            "net12": "6a:18:2e:00:6a:b5",
            "net13": "6e:65:9a:d7:fb:11",
            "net14": "6e:d5:01:2f:82:b3",
            "net2": "1e:76:58:7f:04:e0",
            "net3": "66:1d:9b:39:73:2e",
            "net4": "2e:1a:01:32:5a:23",
            "net5": "4e:de:d4:2a:99:14",
            "net6": "de:39:bb:cd:5d:fc",
            "net7": "3a:09:f7:ec:3a:18",
            "net8": "a6:a8:a6:33:a1:5b",
            "net9": "0e:32:16:2d:5d:8b"
        },
        "leaf_2_0_10": {
            "net0": "86:ac:96:18:fd:60",
            "net1": "e6:af:3f:8c:2d:bd",
            "net10": "8e:42:0b:fe:71:41",
            "net11": "12:56:8e:79:05:03",
            "net12": "4e:30:8e:37:6d:9d",
            "net13": "f6:9f:47:76:7f:7b",
            "net14": "de:49:77:73:55:bb",
            "net2": "92:54:9e:31:ef:5c",
            "net3": "3a:20:e4:30:9d:c3",
            "net4": "6a:fa:d1:61:17:c3",
            "net5": "66:fa:43:f8:2a:69",
            "net6": "02:f6:0f:aa:ac:e4",
            "net7": "2a:5d:0f:0f:62:6a",
            "net8": "86:37:ed:97:fd:b5",
            "net9": "46:a7:da:eb:5d:69"
        },
        "leaf_2_0_11": {
            "net0": "42:65:8d:af:e3:fc",
            "net1": "fa:38:00:8d:66:f9",
            "net10": "c2:00:5e:bf:83:ee",
            "net11": "1a:ca:92:85:0b:8c",
            "net12": "0e:e5:e3:00:8a:be",
            "net13": "ce:e2:36:53:0e:67",
            "net14": "12:77:de:78:9d:e3",
            "net2": "06:36:99:42:ef:a7",
            "net3": "b6:dd:2f:d7:3f:8c",
            "net4": "a6:a4:18:65:8b:d9",
            "net5": "e6:97:b9:63:0a:d0",
            "net6": "82:62:7e:fd:22:c9",
            "net7": "c6:c6:0a:a8:be:2f",
            "net8": "e6:72:d5:4b:ab:ea",
            "net9": "da:f3:89:ab:85:56"
        },
        "leaf_2_0_12": {
            "net0": "a2:c4:74:58:ce:d5",
            "net1": "be:e7:e2:70:39:16",
            "net10": "a6:4b:36:f6:30:4c",
            "net11": "da:e8:20:b7:10:8e",
            "net12": "de:67:2f:83:d2:49",
            "net13": "4e:cb:91:8e:bd:55",
            "net14": "0e:5d:d1:cd:ea:33",
            "net2": "1a:72:cb:4e:66:a3",
            "net3": "4e:c8:b7:1e:33:c9",
            "net4": "36:e6:9b:44:22:ca",
            "net5": "7e:33:dc:0c:2e:8c",
            "net6": "0a:c2:2b:aa:b7:0a",
            "net7": "ea:10:91:5f:1f:33",
            "net8": "7a:95:14:bd:ea:dd",
            "net9": "a6:aa:cd:bc:94:57"
        },
        "leaf_2_0_13": {
            "net0": "06:58:c1:ae:8f:b8",
            "net1": "c2:7f:18:8b:3a:50",
            "net10": "8e:50:07:64:7e:34",
            "net11": "9a:08:89:bd:da:b3",
            "net12": "ae:53:90:b0:f5:24",
            "net13": "6e:20:40:c5:6b:a7",
            "net14": "3e:45:4c:88:63:8c",
            "net2": "26:10:b0:65:27:0c",
            "net3": "aa:e6:3e:0f:9e:c2",
            "net4": "d6:a0:0f:f1:95:3b",
            "net5": "d6:bc:0e:26:48:82",
            "net6": "be:72:73:fa:8c:bd",
            "net7": "2e:7c:e1:d0:1a:5e",
            "net8": "1e:5d:a3:e0:86:4e",
            "net9": "02:7f:78:9c:9a:e0"
        },
        "leaf_2_0_14": {
            "net0": "c2:f9:e4:9d:4f:b2",
            "net1": "52:81:54:f8:d9:f7",
            "net10": "36:70:ea:eb:1b:48",
            "net11": "2a:f8:39:8f:d2:24",
            "net12": "ee:6b:0e:3a:2c:3a",
            "net13": "16:db:ad:7f:c7:ce",
            "net14": "7e:a4:a5:b6:2d:bc",
            "net2": "72:f9:fe:ac:88:0b",
            "net3": "4a:01:36:a7:bc:78",
            "net4": "ea:19:2d:13:eb:9d",
            "net5": "d2:36:26:a8:04:25",
            "net6": "3a:68:d3:8d:d8:7f",
            "net7": "9e:14:0c:54:5a:1d",
            "net8": "c2:ce:63:7b:18:de",
            "net9": "76:43:b2:87:e1:fb"
        },
        "leaf_2_0_2": {
            "net0": "02:ff:1f:ab:8c:d6",
            "net1": "1a:8b:70:d1:f9:84",
            "net10": "ee:91:ad:b4:e0:be",
            "net11": "e2:40:a3:a4:d0:38",
            "net12": "c6:0b:69:72:b4:62",
            "net13": "fe:0d:97:5b:90:b4",
            "net14": "7e:6e:44:b7:a1:31",
            "net2": "2a:a6:3a:4c:1e:d5",
            "net3": "46:40:bc:72:e3:44",
            "net4": "ce:7a:58:b1:8a:c5",
            "net5": "ee:c5:9d:51:99:c0",
            "net6": "6a:31:bb:00:9a:6a",
            "net7": "8e:e0:be:65:8f:28",
            "net8": "32:da:ca:9f:64:96",
            "net9": "8e:bd:77:a9:25:7a"
        },
        "leaf_2_0_3": {
            "net0": "7e:ff:2c:6a:9b:67",
            "net1": "d2:ee:1e:75:3b:15",
            "net10": "36:44:97:9f:b8:6e",
            "net11": "36:6c:93:37:8c:2c",
            "net12": "4e:89:08:58:45:60",
            "net13": "02:41:6b:4d:cd:cc",
            "net14": "aa:d4:16:43:69:54",
            "net2": "7e:40:44:9f:47:96",
            "net3": "76:98:97:69:1f:ac",
            "net4": "ca:6d:c9:97:86:c1",
            "net5": "be:ac:23:e3:d4:cb",
            "net6": "76:26:6f:c7:1f:0a",
            "net7": "6a:74:07:88:76:5b",
            "net8": "6e:65:6d:06:34:42",
            "net9": "8e:ce:73:81:fe:81"
        },
        "leaf_2_0_4": {
            "net0": "fa:4d:58:aa:20:ad",
            "net1": "5a:af:e0:f3:65:fb",
            "net10": "3a:52:7c:e0:66:76",
            "net11": "16:21:04:4c:6f:3c",
            "net12": "52:89:8b:01:46:ed",
            "net13": "16:d2:7b:87:10:41",
            "net14": "6a:f8:b3:73:67:1f",
            "net2": "16:df:8c:6c:ce:2b",
            "net3": "da:92:07:91:9f:71",
            "net4": "ee:c4:4a:2d:06:a0",
            "net5": "72:e3:3c:72:d3:0a",
            "net6": "02:4a:5f:54:6e:40",
            "net7": "ae:4f:2e:ee:75:68",
            "net8": "96:f1:f2:73:fe:48",
            "net9": "76:e2:50:a2:e7:4e"
        },
        "leaf_2_0_5": {
            "net0": "76:d1:a4:fd:be:27",
            "net1": "c2:c8:c6:3b:29:57",
            "net10": "76:2d:64:87:e0:3a",
            "net11": "62:47:91:f9:d6:bc",
            "net12": "ee:e7:5a:97:61:38",
            "net13": "46:04:11:91:09:6f",
            "net14": "be:07:4e:98:b6:3f",
            "net2": "c2:21:aa:81:b6:70",
            "net3": "22:f0:47:51:af:82",
            "net4": "de:9f:85:c4:4f:da",
            "net5": "82:8e:ca:92:6d:ce",
            "net6": "02:67:c2:78:49:9f",
            "net7": "8e:d9:41:a5:84:89",
            "net8": "66:5f:4b:62:55:0c",
            "net9": "e6:3d:f4:f2:33:4c"
        },
        "leaf_2_0_6": {
            "net0": "66:51:b3:35:90:4c",
            "net1": "6e:c7:7a:2c:8c:c8",
            "net10": "4e:2e:16:39:22:67",
            "net11": "1e:d8:a0:e6:7a:d6",
            "net12": "b6:d2:1a:e5:32:a0",
            "net13": "fa:68:20:38:03:cd",
            "net14": "4a:11:a5:15:b5:c3",
            "net2": "76:e8:a9:3d:9c:85",
            "net3": "82:c4:54:f1:f0:bc",
            "net4": "2e:5b:d0:e7:b6:ff",
            "net5": "e2:dc:59:47:98:56",
            "net6": "86:2e:47:bc:ff:8f",
            "net7": "9e:d0:f7:43:04:61",
            "net8": "2e:50:d5:c9:a7:ca",
            "net9": "b6:6d:8e:0b:04:b0"
        },
        "leaf_2_0_7": {
            "net0": "52:02:9d:9f:1e:74",
            "net1": "2e:49:bd:c3:17:f2",
            "net10": "ae:8f:a3:07:b2:3c",
            "net11": "b6:f3:0b:29:91:ef",
            "net12": "76:5e:c3:d0:46:ef",
            "net13": "da:31:75:02:d6:c7",
            "net14": "d6:90:af:86:54:de",
            "net2": "ea:c1:2a:53:72:5d",
            "net3": "2e:32:1b:06:26:7e",
            "net4": "fa:ed:46:42:40:7b",
            "net5": "fa:3d:ca:53:98:9d",
            "net6": "ba:d8:75:bc:90:7b",
            "net7": "8a:2a:15:22:16:3f",
            "net8": "3a:1b:30:a0:6c:83",
            "net9": "5e:fe:94:61:3f:f6"
        },
        "leaf_2_0_8": {
            "net0": "8a:d6:b4:44:b3:3c",
            "net1": "96:20:24:1b:7e:1e",
            "net10": "de:d2:cc:23:2e:2f",
            "net11": "d6:46:d2:1e:a4:0c",
            "net12": "42:74:59:e6:0b:33",
            "net13": "d2:9d:29:5d:92:ee",
            "net14": "be:5f:94:9f:81:e2",
            "net2": "42:3e:0a:ea:a9:f2",
            "net3": "d6:3c:a2:de:17:41",
            "net4": "e6:6b:36:63:b9:0d",
            "net5": "be:2e:b3:f3:2c:bc",
            "net6": "7a:73:ed:98:dc:37",
            "net7": "96:f3:6d:13:05:91",
            "net8": "a2:d2:58:cc:ef:4c",
            "net9": "e2:e9:cc:eb:40:8e"
        },
        "leaf_2_0_9": {
            "net0": "6a:65:12:06:e2:54",
            "net1": "26:9d:40:4c:4e:d6",
            "net10": "fa:6f:dc:ef:55:40",
            "net11": "22:53:c6:e4:c9:9a",
            "net12": "c6:15:8c:b2:de:53",
            "net13": "9a:f7:82:89:ab:cb",
            "net14": "e6:5e:8a:30:be:0c",
            "net2": "fe:8c:2b:be:b6:54",
            "net3": "7a:4e:47:6a:c9:64",
            "net4": "5e:4d:c1:26:11:68",
            "net5": "56:e2:b0:d0:bb:9d",
            "net6": "7e:ef:6a:ec:2c:72",
            "net7": "16:9a:57:f9:da:91",
            "net8": "6e:28:ff:58:f1:01",
            "net9": "ce:6f:dd:04:a8:b9"
        },
        "spine_1_1_1": {
            "net0": "b2:dd:7e:8b:16:a0",
            "net1": "8e:a2:bd:04:60:46",
            "net10": "5e:0e:e2:f5:fa:7e",
            "net11": "0e:91:5d:ba:1c:b0",
            "net12": "f6:e5:e3:a6:cb:3c",
            "net13": "06:40:f1:cd:1f:ef",
            "net14": "fe:b7:69:89:cb:c6",
            "net15": "ce:33:c2:e0:c1:b5",
            "net16": "1e:50:a5:3f:f5:71",
            "net17": "26:aa:69:81:52:47",
            "net18": "f6:76:be:d4:02:44",
            "net19": "6e:83:54:ba:78:db",
            "net2": "76:ef:2a:25:14:73",
            "net20": "5a:8b:88:f4:b1:06",
            "net21": "d2:ab:c1:7d:eb:88",
            "net22": "d6:6c:2a:bc:08:b8",
            "net23": "22:35:f3:c9:c4:1a",
            "net24": "06:e4:62:b4:84:c6",
            "net25": "c6:9d:7c:1f:1a:dc",
            "net26": "3e:66:98:de:b9:44",
            "net27": "ee:11:70:a8:c7:f1",
            "net3": "06:54:c3:e5:f9:06",
            "net4": "ea:43:07:e4:ad:79",
            "net5": "02:85:26:7c:92:f9",
            "net6": "96:b9:16:b4:b4:dc",
            "net7": "a6:63:ac:3c:08:47",
            "net8": "0e:91:4a:34:7c:53",
            "net9": "a6:93:3e:54:3c:3e"
        },
        "spine_1_1_10": {
            "net0": "ee:62:33:4e:59:45",
            "net1": "fa:fc:bd:b9:b3:58",
            "net10": "2a:1c:be:6f:4c:b6",
            "net11": "9a:7b:54:1b:51:76",
            "net12": "92:e2:0f:ff:0e:93",
            "net13": "de:4e:fa:85:ad:44",
            "net14": "42:0b:cf:b1:a6:16",
            "net15": "d6:1c:5e:87:0f:90",
            "net16": "b2:2d:b6:cb:5f:16",
            "net17": "da:00:35:a2:02:69",
            "net18": "3e:3f:77:f3:37:15",
            "net19": "1a:10:ae:c1:f8:88",
            "net2": "a2:5c:59:3e:a1:5a",
            "net20": "56:84:8f:4f:ed:bd",
            "net21": "3a:6b:a1:76:6d:50",
            "net22": "06:b6:96:74:f5:d0",
            "net23": "46:b6:0e:4c:54:e4",
            "net24": "42:f6:39:8c:a3:5d",
            "net25": "7a:69:28:5a:78:c4",
            "net26": "42:01:4b:c8:c2:d7",
            "net27": "22:56:e4:15:e4:47",
            "net3": "9a:24:a1:9c:74:19",
            "net4": "86:7e:5b:06:1b:47",
            "net5": "9a:62:75:44:07:00",
            "net6": "ca:68:64:58:75:48",
            "net7": "96:42:5e:72:8c:a4",
            "net8": "ba:08:63:a8:52:ba",
            "net9": "f2:59:9f:04:76:e0"
        },
        "spine_1_1_11": {
            "net0": "32:88:86:5f:cb:b1",
            "net1": "3e:ed:e1:97:a7:19",
            "net10": "1e:28:df:d2:af:3a",
            "net11": "86:86:6f:86:d2:9f",
            "net12": "6e:ca:87:28:f2:d7",
            "net13": "36:d2:c0:7d:54:60",
            "net14": "8e:a3:cc:55:7d:4c",
            "net15": "76:d9:4b:fd:31:9e",
            "net16": "76:e5:45:ce:a6:8e",
            "net17": "d2:6e:5f:bf:68:c1",
            "net18": "be:a3:6a:c5:03:e2",
            "net19": "ae:af:b5:da:43:32",
            "net2": "e2:e4:7c:b7:5f:f6",
            "net20": "ee:33:4c:dd:f8:83",
            "net21": "9a:3a:61:d7:66:e1",
            "net22": "da:91:b2:2e:72:8c",
            "net23": "32:6c:64:aa:41:7a",
            "net24": "2a:92:2b:83:16:46",
            "net25": "4a:19:d1:60:66:a3",
            "net26": "0a:db:a3:9c:16:b2",
            "net27": "7e:27:10:bf:dc:17",
            "net3": "6e:17:ff:69:1e:0f",
            "net4": "aa:38:74:aa:e2:0e",
            "net5": "a6:5e:a6:0b:bf:78",
            "net6": "b6:2b:5f:4f:5c:0b",
            "net7": "7a:8d:6f:a7:29:9e",
            "net8": "1a:79:0a:8c:ed:60",
            "net9": "72:11:6a:d5:a8:99"
        },
        "spine_1_1_12": {
            "net0": "4e:45:e7:5b:09:b5",
            "net1": "c2:a8:d1:a2:77:29",
            "net10": "8a:71:12:6c:cd:94",
            "net11": "fe:2b:c0:59:b4:d8",
            "net12": "8e:ee:e2:ef:d7:54",
            "net13": "6a:f4:f6:1d:a4:13",
            "net14": "76:c6:48:fd:0f:7b",
            "net15": "2a:63:21:53:34:45",
            "net16": "76:da:bc:18:79:a2",
            "net17": "0e:ac:a0:26:47:ec",
            "net18": "66:63:6f:d9:77:52",
            "net19": "2e:e1:97:f2:db:58",
            "net2": "ee:0a:75:d8:0d:90",
            "net20": "82:d1:dd:09:84:5a",
            "net21": "32:5c:f8:2c:44:ba",
            "net22": "3a:18:38:c3:4c:8f",
            "net23": "de:cc:f2:5b:0b:32",
            "net24": "a2:94:d6:cd:43:05",
            "net25": "62:88:79:5e:7c:32",
            "net26": "6a:64:ff:3f:cf:9d",
            "net27": "16:70:c7:53:cb:b4",
            "net3": "3a:4d:1f:19:86:8b",
            "net4": "16:fb:c7:2f:79:f2",
            "net5": "06:d4:e5:97:00:7e",
            "net6": "fe:4d:24:9e:f9:98",
            "net7": "4a:44:10:47:a2:12",
            "net8": "fe:75:50:c3:fc:34",
            "net9": "6a:40:b8:51:28:ad"
        },
        "spine_1_1_13": {
            "net0": "62:7d:d3:a8:b8:87",
            "net1": "a6:98:30:26:29:df",
            "net10": "ea:bb:79:fc:1e:a7",
            "net11": "92:7f:c5:b5:f0:64",
            "net12": "42:93:6a:ba:1c:1b",
            "net13": "06:47:29:8d:f2:0d",
            "net14": "fe:b6:14:d6:24:c2",
            "net15": "72:76:e9:e8:3a:b0",
            "net16": "1a:2c:c6:ac:94:cb",
            "net17": "02:cf:fc:4f:f5:ce",
            "net18": "76:52:04:72:29:8a",
            "net19": "ea:3b:32:be:74:9c",
            "net2": "da:d9:cb:bc:34:2c",
            "net20": "36:42:83:8f:4d:c4",
            "net21": "62:b6:5b:cc:8f:6f",
            "net22": "c6:e0:0f:b8:08:0b",
            "net23": "96:11:64:63:2d:66",
            "net24": "9a:99:51:9d:1c:92",
            "net25": "2a:03:2d:2b:0c:3c",
            "net26": "ba:cd:55:22:78:b9",
            "net27": "06:af:75:bf:0d:54",
            "net3": "7e:38:48:b9:d1:a3",
            "net4": "32:7a:05:06:7e:26",
            "net5": "26:3d:a1:8b:20:a0",
            "net6": "3a:df:eb:f4:fe:3a",
            "net7": "46:d5:64:33:f6:09",
            "net8": "4a:f4:56:61:f4:7d",
            "net9": "9a:8d:43:dd:a0:63"
        },
        "spine_1_1_14": {
            "net0": "52:eb:65:61:da:2f",
            "net1": "ae:b5:a7:14:3e:fe",
            "net10": "fa:19:af:c9:5d:74",
            "net11": "66:5a:9d:6f:3b:17",
            "net12": "ba:e8:89:f5:fe:8e",
            "net13": "fe:ca:2b:55:8c:23",
            "net14": "16:45:8b:69:0f:0e",
            "net15": "62:b7:de:79:2c:2c",
            "net16": "22:02:08:e1:c0:e7",
            "net17": "52:4c:e1:8b:41:a1",
            "net18": "e2:37:09:33:f5:b8",
            "net19": "16:ea:1e:9a:61:38",
            "net2": "da:cd:21:ed:39:0f",
            "net20": "a6:50:77:f4:cd:14",
            "net21": "ba:3e:74:c8:4e:c7",
            "net22": "aa:28:da:cc:87:7d",
            "net23": "6e:1b:3f:87:d2:24",
            "net24": "e6:81:30:9e:22:d5",
            "net25": "8e:2a:9e:6a:ef:75",
            "net26": "12:f7:eb:46:00:89",
            "net27": "3e:78:fe:ea:cc:55",
            "net3": "ee:e0:19:fe:03:65",
            "net4": "be:46:a4:ec:d8:65",
            "net5": "22:1e:2f:47:0b:5e",
            "net6": "1a:8d:29:15:83:a7",
            "net7": "72:95:41:9f:4b:92",
            "net8": "b6:2c:ee:56:a5:12",
            "net9": "1e:2c:15:dc:ef:ed"
        },
        "spine_1_1_2": {
            "net0": "1a:17:93:25:80:d3",
            "net1": "2e:d9:36:54:b2:93",
            "net10": "b6:b6:e1:04:15:79",
            "net11": "96:a8:f6:1f:b1:78",
            "net12": "66:de:7e:f1:42:d3",
            "net13": "d2:7e:62:9d:3e:a6",
            "net14": "e6:6e:7d:5b:1b:a4",
            "net15": "6a:c3:2a:98:58:b3",
            "net16": "b2:3b:6f:45:78:38",
            "net17": "02:bb:67:e0:2a:c8",
            "net18": "0a:e9:c3:60:6e:80",
            "net19": "fe:f9:00:53:cd:8d",
            "net2": "d2:71:c5:a4:0d:26",
            "net20": "7a:c1:63:7b:4d:2e",
            "net21": "0e:d1:8d:ac:b9:1a",
            "net22": "b2:2a:54:31:73:86",
            "net23": "76:b5:90:c3:a8:b2",
            "net24": "a2:ca:b4:2a:36:7c",
            "net25": "8a:78:00:2f:04:f8",
            "net26": "7e:c4:a4:51:52:95",
            "net27": "16:aa:7e:8a:41:d0",
            "net3": "3a:b2:85:60:37:86",
            "net4": "5e:a1:18:64:bc:90",
            "net5": "8e:dc:e8:4f:d1:3a",
            "net6": "d6:b5:ef:cf:39:f1",
            "net7": "96:ea:02:72:70:d2",
            "net8": "9a:6a:94:59:a6:0e",
            "net9": "9e:91:ae:09:8f:1e"
        },
        "spine_1_1_3": {
            "net0": "ea:38:ad:06:08:ac",
            "net1": "56:11:23:81:df:ad",
            "net10": "ee:ab:92:74:9a:5c",
            "net11": "7e:ce:81:55:12:68",
            "net12": "8a:bb:a8:89:c4:f8",
            "net13": "42:b4:44:be:81:77",
            "net14": "12:fa:1b:26:d9:ee",
            "net15": "fe:24:d1:e3:2a:c3",
            "net16": "2e:f1:a3:be:0b:bb",
            "net17": "86:ac:51:12:ae:69",
            "net18": "f6:0a:bf:a2:ad:1a",
            "net19": "de:6f:ed:ab:e6:6c",
            "net2": "2e:42:9f:f0:13:d1",
            "net20": "f2:e2:c3:67:b3:2a",
            "net21": "86:df:f9:be:2a:c2",
            "net22": "3e:7c:20:14:cb:1f",
            "net23": "a2:09:40:c7:49:f3",
            "net24": "36:1d:56:7e:e3:45",
            "net25": "2e:9a:06:99:7a:78",
            "net26": "3e:0d:a7:4e:48:57",
            "net27": "36:94:ee:a9:1d:f3",
            "net3": "be:f5:b5:fe:06:ad",
            "net4": "3a:13:fc:98:c3:0b",
            "net5": "ba:6d:b2:8b:5c:0a",
            "net6": "fa:97:a5:5a:df:38",
            "net7": "fa:cf:5b:00:76:40",
            "net8": "ba:63:e2:cb:95:58",
            "net9": "46:a5:58:86:b2:df"
        },
        "spine_1_1_4": {
            "net0": "e6:f2:5f:ed:b7:45",
            "net1": "da:45:7e:7a:1e:76",
            "net10": "da:4f:49:d2:54:7a",
            "net11": "d6:25:67:30:b8:80",
            "net12": "be:a8:06:ca:7b:9f",
            "net13": "c6:ee:52:95:dc:13",
            "net14": "0a:d8:43:90:ce:a1",
            "net15": "22:21:2e:f9:aa:1d",
            "net16": "e6:4e:02:f5:4f:73",
            "net17": "a2:e5:87:ec:7c:a7",
            "net18": "46:1a:9f:02:4c:35",
            "net19": "c2:9f:80:96:df:23",
            "net2": "7e:c1:ea:d6:95:fd",
            "net20": "4a:84:81:ea:b5:96",
            "net21": "0a:f6:d4:78:94:88",
            "net22": "76:d2:1d:27:37:5f",
            "net23": "52:8d:25:c3:54:66",
            "net24": "b2:82:d2:fe:0b:08",
            "net25": "06:3b:2d:c0:b3:a1",
            "net26": "56:2b:30:b6:a5:6d",
            "net27": "b6:1e:61:61:18:b5",
            "net3": "46:5a:d7:a7:ce:ca",
            "net4": "4a:76:4c:32:f8:e3",
            "net5": "fe:73:4f:86:3f:45",
            "net6": "92:72:24:07:27:da",
            "net7": "a6:29:45:c5:53:b4",
            "net8": "12:6b:e1:98:41:c8",
            "net9": "72:ec:09:ed:90:e9"
        },
        "spine_1_1_5": {
            "net0": "8e:29:20:e3:1a:1b",
            "net1": "ee:5c:c4:77:24:15",
            "net10": "3a:bd:a7:e3:75:56",
            "net11": "7a:2c:5e:39:b2:83",
            "net12": "d2:50:72:ec:9f:1c",
            "net13": "82:b2:55:9d:f8:4c",
            "net14": "c2:4b:5e:59:33:a6",
            "net15": "02:4e:2b:0d:56:e8",
            "net16": "2a:10:08:43:78:d2",
            "net17": "82:19:40:07:74:5d",
            "net18": "02:47:f1:6d:ef:34",
            "net19": "52:4f:b5:b3:92:da",
            "net2": "a6:74:f0:05:03:69",
            "net20": "ca:e0:73:52:8e:86",
            "net21": "fa:5f:66:a3:9d:c3",
            "net22": "0a:0f:50:7c:a4:a8",
            "net23": "3a:18:7c:ff:84:c9",
            "net24": "2e:2f:b6:b5:c1:54",
            "net25": "22:1c:9b:65:91:16",
            "net26": "62:ec:02:6e:fa:63",
            "net27": "8e:7a:f3:03:a6:a6",
            "net3": "5e:95:02:1f:e7:8e",
            "net4": "aa:13:f7:73:ef:9c",
            "net5": "02:93:1a:8c:f4:16",
            "net6": "c2:bf:34:19:a2:1b",
            "net7": "32:78:9c:9e:e1:97",
            "net8": "92:b7:a3:e2:df:08",
            "net9": "fa:05:0c:84:db:a7"
        },
        "spine_1_1_6": {
            "net0": "e6:99:da:2c:3a:36",
            "net1": "52:f3:77:9e:13:7a",
            "net10": "6a:fe:8c:09:ab:ae",
            "net11": "46:01:7e:06:23:f7",
            "net12": "52:a7:7d:44:6f:c6",
            "net13": "b6:d6:12:b1:55:87",
            "net14": "72:1f:f4:51:81:9d",
            "net15": "fa:63:b4:95:b6:00",
            "net16": "76:cf:4d:fb:f1:7f",
            "net17": "a6:c5:eb:7e:a7:36",
            "net18": "56:ea:35:8b:b4:42",
            "net19": "12:af:a6:ee:3b:91",
            "net2": "8a:3e:32:18:00:57",
            "net20": "de:b8:9c:ae:79:32",
            "net21": "42:8b:0a:fc:6a:24",
            "net22": "de:47:71:2d:d6:5c",
            "net23": "fe:15:83:9c:d8:a7",
            "net24": "ea:b5:bc:a5:a8:3a",
            "net25": "96:10:2b:d4:c8:70",
            "net26": "62:1c:80:b0:e3:9e",
            "net27": "76:d6:36:23:82:e7",
            "net3": "0e:f3:a4:ba:31:aa",
            "net4": "7e:74:ce:82:13:5d",
            "net5": "26:c6:f6:38:77:28",
            "net6": "b2:8b:a2:4f:17:ba",
            "net7": "c2:95:8d:69:3a:65",
            "net8": "5e:79:9b:54:c9:ed",
            "net9": "72:e2:cc:5d:33:68"
        },
        "spine_1_1_7": {
            "net0": "26:70:4b:68:89:08",
            "net1": "da:c1:51:d2:83:bc",
            "net10": "e2:0c:5e:13:c3:a8",
            "net11": "7e:56:c0:de:c8:11",
            "net12": "72:b5:ba:7b:e5:2d",
            "net13": "42:db:52:46:19:3d",
            "net14": "62:4e:95:8d:cf:e6",
            "net15": "02:e5:4e:ec:e4:f8",
            "net16": "2e:af:42:44:59:93",
            "net17": "42:86:c8:70:95:42",
            "net18": "2a:75:3b:69:88:c5",
            "net19": "fe:f4:be:7b:45:25",
            "net2": "1a:46:7c:ba:76:53",
            "net20": "2a:b4:b7:5c:15:b2",
            "net21": "7a:29:5f:58:71:70",
            "net22": "9e:87:5d:0a:1f:a7",
            "net23": "9a:ed:ec:a3:5d:a9",
            "net24": "9a:4a:92:a4:dd:88",
            "net25": "a2:21:0c:f4:d0:d0",
            "net26": "1e:25:31:3e:dd:9f",
            "net27": "ca:d6:83:fa:fe:71",
            "net3": "ea:5d:91:9d:7f:64",
            "net4": "62:1f:4c:7a:55:6b",
            "net5": "92:1e:5b:90:c3:30",
            "net6": "62:4a:c8:63:2b:e1",
            "net7": "2a:9a:83:37:be:2c",
            "net8": "d6:8b:13:76:42:23",
            "net9": "0a:a2:29:55:4e:5e"
        },
        "spine_1_1_8": {
            "net0": "ca:2d:e2:5e:7e:4b",
            "net1": "f2:23:7b:1b:28:06",
            "net10": "36:23:71:50:0f:1b",
            "net11": "1e:da:78:c5:58:87",
            "net12": "ce:c3:c1:d3:0b:dd",
            "net13": "9a:98:4e:30:a7:c0",
            "net14": "1e:82:82:bd:c3:5e",
            "net15": "ee:7d:c4:82:b8:a3",
            "net16": "d6:19:2d:b3:be:f2",
            "net17": "3e:33:0b:e3:92:16",
            "net18": "1e:de:e7:1e:e4:2c",
            "net19": "5e:0e:1b:9a:1f:87",
            "net2": "e6:ab:83:ec:bd:e1",
            "net20": "02:56:60:db:38:09",
            "net21": "a2:0b:0b:d4:6c:6b",
            "net22": "ce:bd:26:fb:6d:35",
            "net23": "8e:d8:a3:c8:1d:cf",
            "net24": "e6:dc:b9:68:5f:74",
            "net25": "fa:d4:1a:47:59:75",
            "net26": "8a:74:91:16:98:46",
            "net27": "4e:de:80:32:8a:22",
            "net3": "7a:92:1e:5a:e3:db",
            "net4": "b6:70:3e:f1:e0:a4",
            "net5": "96:50:c9:ce:a9:24",
            "net6": "fe:e8:31:55:a2:ad",
            "net7": "86:3a:e9:96:61:cb",
            "net8": "06:a7:e8:17:a7:10",
            "net9": "5a:5b:12:60:ad:45"
        },
        "spine_1_1_9": {
            "net0": "02:bf:60:67:1f:c4",
            "net1": "de:54:02:3d:2d:69",
            "net10": "62:3d:2a:9c:b8:cc",
            "net11": "82:77:3d:1f:21:09",
            "net12": "2a:9a:37:a8:58:70",
            "net13": "8e:a3:15:09:2c:0e",
            "net14": "96:e9:4d:09:fe:d4",
            "net15": "3e:86:48:11:3c:a8",
            "net16": "da:47:fe:34:b0:b1",
            "net17": "5a:13:fb:ab:e4:f2",
            "net18": "6a:44:01:a6:5f:69",
            "net19": "0a:dd:84:78:86:8a",
            "net2": "c2:b5:8d:45:e4:5d",
            "net20": "a6:b7:6c:e5:59:91",
            "net21": "26:89:75:94:9a:97",
            "net22": "06:6c:da:b8:c9:e3",
            "net23": "52:2b:dd:b6:e5:79",
            "net24": "12:b4:e5:e9:90:f6",
            "net25": "86:df:18:68:e8:42",
            "net26": "96:93:08:07:a8:c6",
            "net27": "06:af:ed:aa:0b:7e",
            "net3": "26:cf:10:77:90:b8",
            "net4": "52:b6:87:d7:89:7e",
            "net5": "8a:fe:bc:45:75:c5",
            "net6": "82:3d:7a:21:33:14",
            "net7": "12:85:fd:50:6d:3a",
            "net8": "0e:ca:b2:2a:e8:2e",
            "net9": "9e:3d:cb:f6:45:f0"
        },
        "spine_2_1_1": {
            "net0": "2e:ca:7f:be:ed:43",
            "net1": "a2:cf:31:05:9e:0b",
            "net10": "86:52:58:e3:6a:54",
            "net11": "ba:67:fb:68:49:8a",
            "net12": "2a:1b:3c:4b:17:03",
            "net13": "aa:f7:00:c7:7e:b8",
            "net14": "be:b0:7c:ec:f6:14",
            "net15": "d6:1c:52:1e:c2:b5",
            "net16": "92:94:b6:51:6a:1f",
            "net17": "82:4c:71:63:a5:47",
            "net18": "82:59:0e:6f:18:13",
            "net19": "a6:57:3f:d4:b8:f0",
            "net2": "1e:68:6c:00:3a:0f",
            "net20": "be:c9:be:40:1a:d5",
            "net21": "9a:44:3b:fc:a6:61",
            "net22": "96:ac:54:08:0a:b8",
            "net23": "2a:71:ad:b8:67:44",
            "net24": "22:25:0f:da:8f:a3",
            "net25": "b2:75:a6:a4:29:8d",
            "net26": "3e:60:c9:31:1d:2e",
            "net27": "4e:c6:55:93:e2:c4",
            "net3": "5e:ab:30:85:c9:54",
            "net4": "36:70:f8:42:df:2b",
            "net5": "7e:27:31:7a:79:c0",
            "net6": "fa:30:76:55:de:38",
            "net7": "52:37:f5:72:c2:be",
            "net8": "fa:25:73:30:b2:8b",
            "net9": "6e:29:30:8b:fc:e5"
        },
        "spine_2_1_10": {
            "net0": "2a:4f:ba:9c:94:27",
            "net1": "c2:84:91:27:df:bd",
            "net10": "f6:b2:56:75:88:b7",
            "net11": "3e:7e:26:13:ee:04",
            "net12": "96:e2:54:74:dc:02",
            "net13": "02:25:56:91:52:15",
            "net14": "aa:88:ec:89:4f:01",
            "net15": "fe:99:8a:09:65:ec",
            "net16": "82:c1:b9:2b:67:9d",
            "net17": "36:77:00:43:67:16",
            "net18": "2a:0b:92:d2:44:68",
            "net19": "32:40:d5:2b:a5:fe",
            "net2": "fe:3d:cc:33:f2:ae",
            "net20": "c6:ab:d4:b5:2a:61",
            "net21": "4e:61:b0:9b:be:5d",
            "net22": "96:80:1a:bb:ae:76",
            "net23": "b6:a5:10:1b:82:a5",
            "net24": "9e:f2:2d:c5:79:9a",
            "net25": "4e:c3:4d:db:21:23",
            "net26": "12:c8:3b:ab:4b:e8",
            "net27": "32:92:72:28:14:a0",
            "net3": "ea:2e:47:28:9f:83",
            "net4": "ee:8a:ab:6c:5c:37",
            "net5": "6a:39:90:58:00:33",
            "net6": "2e:9b:fb:d1:2f:1e",
            "net7": "e2:b8:2c:8e:49:24",
            "net8": "2a:3a:5b:2d:67:dc",
            "net9": "62:d0:aa:96:5b:58"
        },
        "spine_2_1_11": {
            "net0": "6a:6c:48:02:80:b0",
            "net1": "0a:c3:68:a0:7c:ae",
            "net10": "b6:8a:31:9e:09:59",
            "net11": "f6:16:ee:00:a4:5a",
            "net12": "fe:02:8a:60:21:2f",
            "net13": "3a:09:a0:c2:24:54",
            "net14": "7a:56:65:d1:9f:99",
            "net15": "86:30:97:6b:fd:b7",
            "net16": "12:f4:5b:36:90:86",
            "net17": "46:cd:61:02:b8:86",
            "net18": "aa:be:4e:f4:ed:b0",
            "net19": "66:0c:64:67:6f:c4",
            "net2": "2a:41:a1:4f:79:49",
            "net20": "52:4a:1b:54:c9:f1",
            "net21": "9a:05:a8:da:01:2b",
            "net22": "2e:9e:28:98:7f:d7",
            "net23": "5a:c6:1d:42:6f:54",
            "net24": "36:13:2e:d0:b7:b3",
            "net25": "ca:f6:c8:97:c4:6f",
            "net26": "d6:76:26:bd:df:4a",
            "net27": "b6:80:2b:bb:5c:b7",
            "net3": "f6:fc:fb:d9:32:9b",
            "net4": "62:73:fd:15:bb:06",
            "net5": "a2:9d:1c:3f:e6:5b",
            "net6": "26:b5:6a:8f:05:f2",
            "net7": "5a:e3:b8:e9:2f:e6",
            "net8": "4e:34:fc:c5:2d:7f",
            "net9": "d6:74:aa:01:c4:c3"
        },
        "spine_2_1_12": {
            "net0": "be:02:63:b4:0e:9f",
            "net1": "e2:73:0b:06:ab:2f",
            "net10": "be:6e:eb:0d:84:20",
            "net11": "f2:76:21:cb:44:be",
            "net12": "9e:14:0f:4e:4f:68",
            "net13": "e2:d7:5d:16:3c:bd",
            "net14": "9e:ec:ee:19:ef:fe",
            "net15": "de:1b:1e:fb:2e:b8",
            "net16": "42:6e:0f:2d:0d:77",
            "net17": "72:97:b2:17:dc:29",
            "net18": "72:d6:71:ec:30:88",
            "net19": "fa:6e:89:60:df:04",
            "net2": "aa:24:59:ef:20:0f",
            "net20": "92:65:d7:95:07:c9",
            "net21": "46:90:ac:67:e5:0f",
            "net22": "da:ce:bf:c2:bf:10",
            "net23": "3a:68:23:a8:2a:38",
            "net24": "9a:72:d3:79:77:22",
            "net25": "be:fd:7c:2e:d6:ff",
            "net26": "66:7f:8c:61:7c:c4",
            "net27": "46:8b:05:5b:13:a0",
            "net3": "76:fc:5a:b8:9c:63",
            "net4": "02:5c:53:c2:e1:d0",
            "net5": "3a:a3:78:59:28:67",
            "net6": "02:cc:6e:ed:fe:fa",
            "net7": "ba:29:57:62:75:a5",
            "net8": "de:c8:36:db:9e:a0",
            "net9": "0a:3a:93:85:bb:a0"
        },
        "spine_2_1_13": {
            "net0": "c6:8e:59:5a:d8:c3",
            "net1": "3a:ce:68:eb:9d:e8",
            "net10": "32:c9:0a:b4:53:51",
            "net11": "aa:da:25:6f:ac:33",
            "net12": "7e:6a:97:f8:ed:dd",
            "net13": "02:ef:20:ae:f9:7f",
            "net14": "26:df:68:dd:a0:08",
            "net15": "e2:46:11:55:1c:9d",
            "net16": "22:e6:04:b8:dc:5e",
            "net17": "36:1e:d8:f4:db:de",
            "net18": "2a:c5:32:ca:ab:52",
            "net19": "06:51:e3:15:55:95",
            "net2": "da:e6:e0:49:de:aa",
            "net20": "da:e4:8c:1e:1b:12",
            "net21": "86:2a:d6:22:49:2e",
            "net22": "7a:91:eb:9d:8e:a8",
            "net23": "52:43:a1:d1:8f:86",
            "net24": "c6:b9:6b:0c:7b:7f",
            "net25": "9e:e2:41:bf:f7:fb",
            "net26": "2e:d4:19:d6:13:76",
            "net27": "d2:91:0c:8a:fd:76",
            "net3": "9a:c8:b4:88:b7:51",
            "net4": "76:e4:9b:53:c7:4f",
            "net5": "46:5c:40:88:1a:56",
            "net6": "86:4f:dd:7c:d1:79",
            "net7": "fa:d3:9a:76:56:ce",
            "net8": "e2:8a:3f:05:ee:a0",
            "net9": "a6:29:e8:e7:38:1d"
        },
        "spine_2_1_14": {
            "net0": "b6:7d:4a:a1:58:49",
            "net1": "2a:fd:7c:1a:1f:65",
            "net10": "e6:fe:94:63:d5:8c",
            "net11": "a2:58:7e:29:b1:c4",
            "net12": "be:fa:b8:d4:90:c6",
            "net13": "ce:81:de:c1:81:14",
            "net14": "86:83:c7:f1:f5:98",
            "net15": "86:ee:44:5e:2d:52",
            "net16": "7e:bb:a5:b0:b1:d8",
            "net17": "0e:95:de:39:73:3a",
            "net18": "96:bf:f3:60:7e:16",
            "net19": "66:f3:90:ce:5b:da",
            "net2": "3e:cc:ca:19:fd:da",
            "net20": "ae:d3:0a:52:69:c7",
            "net21": "a2:65:e4:1d:b6:2c",
            "net22": "ea:d9:ad:f3:2e:f3",
            "net23": "66:46:d8:88:d2:ee",
            "net24": "da:d3:0c:f9:3c:13",
            "net25": "9a:0f:84:d2:ec:38",
            "net26": "0e:28:b0:d5:52:cf",
            "net27": "96:b8:b3:89:70:68",
            "net3": "1a:fe:59:29:cf:7e",
            "net4": "a2:5f:3e:db:98:c2",
            "net5": "1e:7d:f1:94:f6:c6",
            "net6": "4a:2f:9c:ae:4e:be",
            "net7": "a6:1e:70:d2:2a:76",
            "net8": "f2:e2:a7:e2:c4:dd",
            "net9": "96:17:19:fe:21:61"
        },
        "spine_2_1_2": {
            "net0": "de:72:a9:5d:82:12",
            "net1": "16:3d:bb:18:df:1d",
            "net10": "ea:8d:4a:2d:25:6c",
            "net11": "5a:bb:c3:c7:79:9d",
            "net12": "56:66:35:e0:04:b1",
            "net13": "f2:e0:ca:66:4a:8a",
            "net14": "76:97:fb:48:ca:9f",
            "net15": "76:b9:2a:48:a3:32",
            "net16": "1e:b1:2c:46:4d:44",
            "net17": "4a:b4:91:01:75:35",
            "net18": "16:08:21:56:79:5b",
            "net19": "1e:ec:68:0e:9c:f2",
            "net2": "7e:86:b3:14:8f:48",
            "net20": "0e:f4:fc:48:af:1e",
            "net21": "22:93:04:12:92:ef",
            "net22": "2a:c0:35:ca:0e:3f",
            "net23": "de:7e:69:a8:c1:15",
            "net24": "62:69:be:41:29:21",
            "net25": "0a:0a:8c:b7:ff:ad",
            "net26": "fe:1a:67:5e:36:72",
            "net27": "1e:dc:10:56:4f:84",
            "net3": "1a:6f:96:a6:fc:5d",
            "net4": "02:a1:33:f0:0f:7f",
            "net5": "56:d0:84:6d:09:e0",
            "net6": "7e:95:f0:25:64:03",
            "net7": "f6:1e:81:66:77:6e",
            "net8": "e2:23:9d:41:98:4c",
            "net9": "8a:75:bb:97:dd:bd"
        },
        "spine_2_1_3": {
            "net0": "9a:3d:3c:25:27:52",
            "net1": "56:ce:77:92:0c:2f",
            "net10": "02:eb:b6:72:29:77",
            "net11": "9a:e2:28:1a:44:69",
            "net12": "0e:84:4e:22:11:25",
            "net13": "26:f8:f7:5a:74:97",
            "net14": "e2:fd:e7:55:77:ef",
            "net15": "42:5f:4a:03:f8:f8",
            "net16": "36:a1:fe:62:1c:ef",
            "net17": "e6:e4:90:98:e7:1f",
            "net18": "56:97:b2:23:97:4b",
            "net19": "82:24:1d:0c:26:7e",
            "net2": "fe:2f:15:03:97:b4",
            "net20": "32:50:b9:5a:63:cd",
            "net21": "f6:18:f6:71:68:70",
            "net22": "32:2e:e2:70:da:94",
            "net23": "02:2d:78:54:16:86",
            "net24": "6e:49:34:54:df:50",
            "net25": "b6:bb:d7:2f:21:eb",
            "net26": "d6:74:e1:cd:00:5a",
            "net27": "5e:64:da:ee:16:07",
            "net3": "5a:6a:c0:55:56:e0",
            "net4": "56:18:31:e6:78:13",
            "net5": "5a:63:1e:08:ab:f5",
            "net6": "f2:69:06:04:75:9a",
            "net7": "5a:86:ba:de:13:b5",
            "net8": "62:16:a5:f8:b9:31",
            "net9": "de:24:ea:36:66:c9"
        },
        "spine_2_1_4": {
            "net0": "fa:5b:a6:c2:c3:83",
            "net1": "ba:6f:0e:22:23:bb",
            "net10": "52:b8:b0:09:b3:fc",
            "net11": "8a:ed:18:54:a7:0a",
            "net12": "c6:d5:d6:91:4f:a8",
            "net13": "46:12:44:5f:a7:19",
            "net14": "9e:8a:a7:a5:e4:c2",
            "net15": "76:2e:f1:ef:7c:8f",
            "net16": "06:6d:c5:4a:1e:22",
            "net17": "26:ea:1d:73:af:42",
            "net18": "36:29:b9:01:ef:81",
            "net19": "ae:b5:d0:74:8e:e1",
            "net2": "82:a5:c5:ff:ff:bc",
            "net20": "ae:6f:df:a9:38:fd",
            "net21": "52:06:4c:d6:8d:28",
            "net22": "2e:a7:74:31:79:a5",
            "net23": "a6:ce:3f:e8:66:86",
            "net24": "e2:cf:3a:67:67:dc",
            "net25": "b2:b5:e3:1b:24:f8",
            "net26": "9e:47:71:e5:49:f2",
            "net27": "86:65:0d:b6:8a:54",
            "net3": "62:20:8c:dd:65:f5",
            "net4": "e6:7a:e4:59:20:e3",
            "net5": "76:95:ad:2c:ff:ce",
            "net6": "ce:88:b5:20:6e:1a",
            "net7": "b6:f2:cc:97:45:0d",
            "net8": "e6:f4:c7:a5:a0:14",
            "net9": "be:b2:ef:7b:27:89"
        },
        "spine_2_1_5": {
            "net0": "56:86:b0:1a:99:bc",
            "net1": "8a:21:f5:de:eb:78",
            "net10": "82:c1:cc:49:38:e1",
            "net11": "da:ed:af:f6:9c:46",
            "net12": "1a:07:72:3f:cb:05",
            "net13": "2a:61:5c:2f:43:5c",
            "net14": "f6:2f:28:c0:b1:8c",
            "net15": "7a:55:9f:67:2e:a3",
            "net16": "7a:13:e7:90:c3:af",
            "net17": "0a:f8:6e:43:54:24",
            "net18": "46:f2:29:a9:b3:b0",
            "net19": "1e:70:21:f0:24:fc",
            "net2": "ce:12:0f:39:ad:42",
            "net20": "2a:5d:65:79:f2:ba",
            "net21": "fe:cb:2e:ca:ee:cb",
            "net22": "f2:70:39:cb:9b:e0",
            "net23": "3a:6c:c5:30:b6:87",
            "net24": "16:45:0c:a6:07:13",
            "net25": "ea:6b:ea:ed:24:6a",
            "net26": "86:aa:c7:89:ad:fd",
            "net27": "3a:10:fd:23:03:28",
            "net3": "ee:7c:e8:90:6a:7b",
            "net4": "22:b4:1c:29:71:be",
            "net5": "ae:4f:ff:9c:4d:67",
            "net6": "ea:dd:30:07:89:fd",
            "net7": "ba:60:16:dc:a9:51",
            "net8": "92:f3:97:44:1a:43",
            "net9": "36:1a:9e:fd:bb:de"
        },
        "spine_2_1_6": {
            "net0": "ee:9b:ea:86:f8:65",
            "net1": "ae:e6:b4:b0:d9:bf",
            "net10": "ae:95:59:2a:80:4b",
            "net11": "9e:eb:27:6a:1a:59",
            "net12": "f2:0d:04:43:44:79",
            "net13": "4e:b7:42:26:9d:ce",
            "net14": "ee:26:0c:15:e0:1d",
            "net15": "2a:80:dd:f3:3e:14",
            "net16": "1e:26:3d:48:c1:c1",
            "net17": "12:9a:bd:08:f4:e1",
            "net18": "5e:40:13:b3:aa:51",
            "net19": "4a:d3:84:5e:f4:8c",
            "net2": "de:5c:f2:5b:41:85",
            "net20": "52:f4:2d:7e:44:e1",
            "net21": "06:90:6a:79:8d:ba",
            "net22": "16:13:72:10:1f:02",
            "net23": "1e:00:f2:d7:01:16",
            "net24": "de:1e:ff:26:5b:6f",
            "net25": "b6:22:69:52:7e:08",
            "net26": "0a:b8:da:c4:d0:49",
            "net27": "12:3d:c5:56:2a:ec",
            "net3": "9e:15:2c:c0:21:a0",
            "net4": "2e:17:9a:a7:bb:e3",
            "net5": "0a:53:57:51:25:38",
            "net6": "46:80:57:96:aa:ca",
            "net7": "d2:22:39:73:2d:9a",
            "net8": "fa:d6:1b:75:75:73",
            "net9": "fe:3f:e9:9b:7b:ff"
        },
        "spine_2_1_7": {
            "net0": "5a:6b:f3:47:97:ff",
            "net1": "9e:50:04:cd:04:96",
            "net10": "d2:bd:c8:5d:e8:90",
            "net11": "ea:73:e0:8a:43:66",
            "net12": "fa:51:4e:6b:c8:6f",
            "net13": "f2:d7:3f:b3:8a:18",
            "net14": "42:25:c0:7c:80:98",
            "net15": "7e:16:91:97:43:67",
            "net16": "6e:c4:42:2e:2e:0d",
            "net17": "8e:61:52:39:96:af",
            "net18": "12:81:c7:74:51:ab",
            "net19": "66:7f:68:20:6c:a3",
            "net2": "ba:92:90:11:fc:39",
            "net20": "1a:21:6a:69:7d:fb",
            "net21": "b2:d5:e5:88:f0:06",
            "net22": "46:92:f0:7b:3e:1c",
            "net23": "d2:8b:1f:4d:0b:89",
            "net24": "2e:ef:40:89:d8:5a",
            "net25": "2a:20:be:70:65:0c",
            "net26": "ba:1a:e8:c9:f1:1e",
            "net27": "66:f0:94:21:a2:48",
            "net3": "d6:70:25:2e:f9:ef",
            "net4": "36:0b:25:56:53:f4",
            "net5": "76:00:40:19:70:2f",
            "net6": "b6:59:0e:2e:27:70",
            "net7": "82:34:43:d1:8f:b4",
            "net8": "7e:ca:1e:13:63:bf",
            "net9": "32:0a:92:ac:55:25"
        },
        "spine_2_1_8": {
            "net0": "a6:2f:cb:65:1b:9c",
            "net1": "ae:49:71:5c:04:14",
            "net10": "02:45:f2:56:9b:5c",
            "net11": "0a:2d:9e:66:2d:44",
            "net12": "c2:df:b4:0c:6e:5b",
            "net13": "3a:b7:f4:2e:38:61",
            "net14": "6a:c4:21:70:d9:1a",
            "net15": "aa:0e:d6:d3:c7:4a",
            "net16": "ca:a5:90:8c:28:97",
            "net17": "a6:89:95:0e:7c:bd",
            "net18": "26:10:69:c1:bb:f3",
            "net19": "ce:0b:c6:4e:b5:0d",
            "net2": "fe:30:3e:dd:2b:dd",
            "net20": "02:5a:63:58:14:a0",
            "net21": "f6:62:fa:22:b1:d1",
            "net22": "f6:4d:0e:1e:f3:52",
            "net23": "de:af:72:e2:25:63",
            "net24": "e2:5c:62:e8:7e:23",
            "net25": "4a:40:5d:7a:56:25",
            "net26": "da:f3:e6:91:58:1b",
            "net27": "ee:fc:61:99:52:b8",
            "net3": "62:ce:77:46:8f:5e",
            "net4": "8a:f1:e5:c1:82:3d",
            "net5": "a6:f8:7e:3d:2e:8d",
            "net6": "8e:e7:af:a7:44:0d",
            "net7": "2e:c5:f3:83:fb:e5",
            "net8": "4e:fb:4f:56:32:97",
            "net9": "4a:9c:53:58:46:9a"
        },
        "spine_2_1_9": {
            "net0": "6a:66:03:0c:1d:e7",
            "net1": "9e:5c:13:d0:4b:73",
            "net10": "4e:e7:44:8c:97:97",
            "net11": "de:9e:12:e2:6a:33",
            "net12": "c2:0e:d0:a3:db:d8",
            "net13": "8e:43:4c:81:a2:a8",
            "net14": "aa:64:87:a9:5e:f9",
            "net15": "d6:06:6f:75:02:58",
            "net16": "8a:9f:2d:b2:6d:69",
            "net17": "ea:8f:48:39:d1:03",
            "net18": "c2:66:9b:b0:af:3d",
            "net19": "4e:f1:22:ae:94:d0",
            "net2": "b2:71:bd:4d:36:0e",
            "net20": "7a:cf:38:c6:18:b5",
            "net21": "0a:ee:cc:17:4d:89",
            "net22": "5e:cb:56:63:77:6b",
            "net23": "62:ff:c0:22:e1:00",
            "net24": "7e:0b:cd:63:a2:09",
            "net25": "7e:17:ac:b7:36:ff",
            "net26": "4a:cc:62:ab:26:fe",
            "net27": "3a:28:41:b8:57:d8",
            "net3": "8a:11:24:38:20:6c",
            "net4": "72:61:18:70:45:a0",
            "net5": "22:2c:03:12:54:be",
            "net6": "e6:98:50:f3:f0:35",
            "net7": "4a:8d:61:57:92:2a",
            "net8": "0a:0a:3f:7c:95:14",
            "net9": "fa:ae:2b:cc:9c:ff"
        },
        "tof_1_2_1": {
            "net0": "82:43:95:7c:7c:cf",
            "net1": "96:ba:57:bb:47:33",
            "net10": "76:85:f2:82:03:06",
            "net11": "d2:ec:c4:84:65:a8",
            "net12": "36:9b:b8:b4:1a:9c",
            "net13": "12:b7:b1:b8:fa:1c",
            "net14": "3a:9f:1b:55:d4:4c",
            "net15": "aa:1c:c2:1c:6c:f6",
            "net16": "4a:dd:fd:9c:45:b3",
            "net17": "6a:d3:78:fb:9c:65",
            "net18": "aa:de:1e:18:74:bb",
            "net19": "c6:e3:a8:d5:5d:13",
            "net2": "f6:27:e9:c7:a4:30",
            "net20": "76:c3:25:c6:52:a9",
            "net21": "8e:e5:cd:5d:ce:b0",
            "net22": "06:fb:05:2e:c0:9a",
            "net23": "de:40:5d:f6:ec:2b",
            "net24": "66:d4:54:53:3c:1d",
            "net25": "f6:0a:a8:ac:28:be",
            "net26": "9a:17:9f:b2:14:e7",
            "net27": "7a:5f:54:a1:67:86",
            "net3": "46:a4:36:12:c6:fa",
            "net4": "8e:bb:41:f0:09:41",
            "net5": "9e:3e:85:f2:88:0b",
            "net6": "ee:fc:1c:e2:c1:43",
            "net7": "be:e1:2b:6d:1e:98",
            "net8": "7a:84:b0:4c:b7:52",
            "net9": "d2:e0:89:72:24:ba"
        },
        "tof_1_2_10": {
            "net0": "56:eb:10:26:a2:2e",
            "net1": "a6:2f:be:5f:b8:a1",
            "net10": "42:b9:bd:c7:1e:ad",
            "net11": "3e:f1:68:fc:ea:a5",
            "net12": "3a:b9:2b:a0:62:8a",
            "net13": "a2:a5:01:60:72:7c",
            "net14": "ae:f0:4d:31:ba:66",
            "net15": "ae:46:cc:e7:bb:96",
            "net16": "e6:2e:f5:bc:c8:ba",
            "net17": "f2:1e:73:d9:6d:31",
            "net18": "de:a6:5f:34:7e:c5",
            "net19": "02:bc:99:54:cc:48",
            "net2": "d2:fc:9a:95:cf:a2",
            "net20": "86:f2:a0:5d:44:79",
            "net21": "fa:e7:5a:1b:d1:3b",
            "net22": "96:80:28:c5:98:f4",
            "net23": "c6:ec:ee:15:9d:5f",
            "net24": "ee:62:1f:37:c5:72",
            "net25": "ea:65:d1:7e:97:31",
            "net26": "0a:79:0c:06:aa:32",
            "net27": "6a:69:0d:5c:8a:a3",
            "net3": "1e:fd:db:49:fc:77",
            "net4": "6a:85:2d:f5:07:cb",
            "net5": "62:d2:b2:81:5c:9b",
            "net6": "d6:06:3e:31:8f:49",
            "net7": "16:15:9b:53:73:4c",
            "net8": "72:7c:f1:d6:01:be",
            "net9": "ba:79:fc:a9:5a:98"
        },
        "tof_1_2_11": {
            "net0": "f6:42:da:a9:38:57",
            "net1": "26:ff:85:f8:aa:47",
            "net10": "0a:4f:4c:d7:02:1c",
            "net11": "92:b9:cf:14:06:c6",
            "net12": "d2:a2:1a:18:f0:09",
            "net13": "1a:0f:9b:a3:44:24",
            "net14": "5a:d5:3c:a5:da:34",
            "net15": "ca:c4:05:46:1c:c9",
            "net16": "ee:80:13:f2:ce:b8",
            "net17": "52:32:ad:36:4c:45",
            "net18": "76:2c:68:11:55:2f",
            "net19": "3e:06:3b:4f:f0:4e",
            "net2": "ee:60:80:c5:72:11",
            "net20": "16:d2:86:48:1a:b5",
            "net21": "52:ea:7e:f3:24:18",
            "net22": "b6:d5:a4:c5:46:d8",
            "net23": "02:ca:5c:0f:c3:43",
            "net24": "ea:25:cc:ef:1f:31",
            "net25": "76:52:3a:58:91:6c",
            "net26": "16:b8:9b:fa:07:00",
            "net27": "12:0b:17:c7:2d:30",
            "net3": "4a:78:d5:34:e1:68",
            "net4": "16:8c:7b:e3:0b:7c",
            "net5": "46:fa:27:59:3f:6f",
            "net6": "de:1e:fd:79:06:e5",
            "net7": "92:68:81:54:81:9e",
            "net8": "de:db:bc:a8:85:8f",
            "net9": "ba:c7:eb:df:1e:5c"
        },
        "tof_1_2_12": {
            "net0": "7e:61:e5:ea:79:73",
            "net1": "aa:ea:45:f0:99:78",
            "net10": "e6:eb:e8:eb:be:42",
            "net11": "22:a1:8f:bf:e9:06",
            "net12": "d6:d6:5a:e8:38:93",
            "net13": "2a:78:b3:ad:be:e2",
            "net14": "ee:fc:c9:8a:77:ae",
            "net15": "c2:49:34:a8:36:82",
            "net16": "02:81:ca:b2:4d:26",
            "net17": "16:eb:d0:ba:75:ab",
            "net18": "7e:6e:7e:a6:cf:3b",
            "net19": "5a:2c:d2:55:5e:73",
            "net2": "86:1f:93:d7:68:2c",
            "net20": "4a:d3:e7:64:3e:48",
            "net21": "1a:25:cd:55:52:46",
            "net22": "2e:9c:e2:ae:16:c2",
            "net23": "0e:b0:08:cb:4e:4b",
            "net24": "42:c3:aa:5c:3a:03",
            "net25": "3a:a9:e8:56:56:11",
            "net26": "56:c4:48:ab:87:e2",
            "net27": "4e:9d:c8:67:36:3c",
            "net3": "56:c3:25:66:94:c2",
            "net4": "92:78:73:37:88:d4",
            "net5": "a6:12:be:8f:d4:35",
            "net6": "7e:e2:54:f0:64:92",
            "net7": "fa:61:c8:c7:a5:51",
            "net8": "96:d8:13:36:f9:06",
            "net9": "be:1b:47:08:3b:6d"
        },
        "tof_1_2_13": {
            "net0": "0a:e8:89:5a:9f:d0",
            "net1": "ca:f5:38:cc:79:c2",
            "net10": "c2:66:67:ec:98:cb",
            "net11": "22:3e:da:ba:4d:5a",
            "net12": "82:7a:2b:df:49:cb",
            "net13": "ee:a6:a7:14:ae:c9",
            "net14": "82:13:e4:de:f5:5a",
            "net15": "3e:d9:3a:5f:51:53",
            "net16": "6e:c7:1e:5c:f1:70",
            "net17": "be:10:ea:95:58:32",
            "net18": "b2:44:ef:df:f9:52",
            "net19": "5a:be:07:ae:8d:19",
            "net2": "66:de:ac:d9:6c:8c",
            "net20": "9e:eb:9b:95:aa:48",
            "net21": "aa:37:eb:c7:0e:6b",
            "net22": "e6:bb:b5:e2:0a:0d",
            "net23": "3a:25:96:40:53:7b",
            "net24": "ea:c8:43:ab:f2:55",
            "net25": "6a:cf:03:1b:c5:21",
            "net26": "f6:13:a5:6e:08:1e",
            "net27": "2a:30:85:c0:0c:bc",
            "net3": "4e:cc:24:e3:82:49",
            "net4": "4e:f7:03:15:a7:dd",
            "net5": "3a:68:48:bb:0a:87",
            "net6": "b2:08:14:c9:0f:af",
            "net7": "72:d3:c0:e1:3d:aa",
            "net8": "b6:f0:3b:f6:f2:c7",
            "net9": "52:f9:77:43:ce:f9"
        },
        "tof_1_2_14": {
            "net0": "6a:53:c4:8f:14:9e",
            "net1": "02:f6:be:0a:12:f1",
            "net10": "b6:ee:4b:c7:a5:f6",
            "net11": "ce:55:a4:fd:e7:d8",
            "net12": "de:ca:b3:7b:ad:8f",
            "net13": "9a:72:96:c1:22:fe",
            "net14": "5a:28:8b:bd:22:01",
            "net15": "6e:9b:c8:da:da:7a",
            "net16": "aa:e8:8c:77:0b:12",
            "net17": "42:62:95:70:52:b9",
            "net18": "2e:09:7b:0e:42:22",
            "net19": "ae:a3:35:aa:6c:a6",
            "net2": "02:c0:71:57:25:8c",
            "net20": "72:cf:0a:40:f3:b5",
            "net21": "0a:69:07:e9:9c:47",
            "net22": "12:76:69:f1:2b:78",
            "net23": "8a:ba:9e:83:1b:7d",
            "net24": "1a:81:59:75:2d:41",
            "net25": "e2:cf:0c:54:c4:ed",
            "net26": "86:33:6e:d8:48:6d",
            "net27": "7e:ba:6f:21:f3:77",
            "net3": "ce:68:60:3c:5f:3e",
            "net4": "f2:66:58:a7:68:05",
            "net5": "52:d9:79:4b:52:78",
            "net6": "4e:4b:3f:a5:56:bf",
            "net7": "ba:85:5d:1f:41:d8",
            "net8": "56:81:74:1e:31:f6",
            "net9": "2e:25:8e:e3:c7:4a"
        },
        "tof_1_2_2": {
            "net0": "ba:c4:05:46:af:c0",
            "net1": "66:44:85:81:35:71",
            "net10": "42:e2:3b:97:cf:ce",
            "net11": "f6:de:05:cc:c1:73",
            "net12": "d6:99:20:21:5d:c7",
            "net13": "be:b9:2a:8d:ef:d5",
            "net14": "62:05:ab:e7:8c:2a",
            "net15": "9e:05:c4:2e:9e:3b",
            "net16": "92:7d:93:73:82:18",
            "net17": "6a:fa:33:19:68:99",
            "net18": "d2:10:bf:d9:b7:76",
            "net19": "4e:bc:d2:ae:43:7f",
            "net2": "fa:d6:d2:1a:10:3c",
            "net20": "4e:b1:33:94:c7:17",
            "net21": "2e:d9:8f:a6:f0:03",
            "net22": "76:c4:d9:07:c6:15",
            "net23": "de:c0:65:33:e4:90",
            "net24": "62:7b:95:7f:c3:7c",
            "net25": "76:1b:03:00:75:18",
            "net26": "82:e6:41:75:3b:f0",
            "net27": "b2:49:fc:da:b7:36",
            "net3": "c2:47:d6:05:cc:b8",
            "net4": "b6:d1:50:37:21:e5",
            "net5": "36:28:22:d3:e4:ad",
            "net6": "c2:c8:e5:01:75:0c",
            "net7": "2e:87:7e:96:9e:a9",
            "net8": "d6:30:82:d8:60:6e",
            "net9": "be:ac:a8:6f:a2:65"
        },
        "tof_1_2_3": {
            "net0": "1a:79:6e:8f:16:e6",
            "net1": "92:90:36:20:8f:cb",
            "net10": "66:38:f5:65:90:7e",
            "net11": "56:55:58:9e:3a:28",
            "net12": "f2:64:8b:9e:6d:e5",
            "net13": "5a:09:1a:2a:85:42",
            "net14": "f6:9c:87:38:7e:a9",
            "net15": "ce:77:89:b2:96:2d",
            "net16": "aa:32:b8:e2:f3:ed",
            "net17": "c6:4d:2c:0a:d0:92",
            "net18": "b2:0b:a3:7e:c3:26",
            "net19": "36:3a:76:04:6a:86",
            "net2": "7a:71:e0:0b:9d:aa",
            "net20": "6a:ed:71:20:f9:33",
            "net21": "7e:e3:16:da:ee:8e",
            "net22": "66:97:89:d4:61:e6",
            "net23": "a6:df:ee:c8:81:c2",
            "net24": "9e:4c:15:79:43:42",
            "net25": "e2:2c:be:4f:08:dc",
            "net26": "76:fb:46:2c:7d:fb",
            "net27": "0e:b5:1d:d7:ab:99",
            "net3": "c6:e0:59:cb:ab:d4",
            "net4": "b2:2a:14:39:7e:35",
            "net5": "9e:05:e1:c6:f9:2f",
            "net6": "86:ab:a1:a2:97:49",
            "net7": "9e:9d:cb:b6:c7:15",
            "net8": "6e:0e:01:37:20:91",
            "net9": "a2:07:33:a3:34:8a"
        },
        "tof_1_2_4": {
            "net0": "66:5f:f0:2d:7f:63",
            "net1": "9e:5c:0e:c0:93:32",
            "net10": "ca:24:e8:9c:19:61",
            "net11": "46:4b:5f:b3:92:55",
            "net12": "9e:68:08:9e:8d:7e",
            "net13": "36:32:05:3f:8c:dc",
            "net14": "02:ea:cd:64:05:36",
            "net15": "d6:d0:32:fd:6c:e7",
            "net16": "0a:3e:91:3f:2b:e6",
            "net17": "52:5b:e0:ed:ed:35",
            "net18": "b2:79:92:48:42:e1",
            "net19": "b6:24:11:ca:92:2a",
            "net2": "2e:e0:f8:1d:bf:fc",
            "net20": "82:a4:ea:5a:f9:02",
            "net21": "1e:31:95:2d:23:03",
            "net22": "a6:90:cf:a3:78:02",
            "net23": "12:68:c4:ea:70:da",
            "net24": "9e:62:19:83:9a:f9",
            "net25": "c6:82:63:89:2f:d4",
            "net26": "4e:09:5d:cb:33:ae",
            "net27": "86:db:29:77:76:63",
            "net3": "96:4c:49:55:10:b0",
            "net4": "72:e1:e3:6a:a5:65",
            "net5": "36:60:8a:6f:85:1d",
            "net6": "f2:bc:11:23:c8:fb",
            "net7": "1a:27:e8:ea:46:62",
            "net8": "2e:a0:4c:5d:9a:39",
            "net9": "4a:4d:4e:d7:de:de"
        },
        "tof_1_2_5": {
            "net0": "3e:81:92:59:6c:21",
            "net1": "76:5b:32:df:ac:d6",
            "net10": "5a:8c:0d:12:f3:f4",
            "net11": "f6:f7:d8:bf:4d:3b",
            "net12": "82:82:9b:00:19:88",
            "net13": "c2:c3:e2:0d:9c:16",
            "net14": "e2:fd:b5:55:f2:ec",
            "net15": "02:10:8c:6a:1b:91",
            "net16": "ee:a8:c9:22:14:9e",
            "net17": "4e:2f:b8:96:7b:86",
            "net18": "aa:6b:9a:3e:70:13",
            "net19": "56:49:de:9a:93:cf",
            "net2": "1a:3b:81:31:8d:e2",
            "net20": "ea:1f:51:cc:d9:f4",
            "net21": "4a:ad:82:5a:43:85",
            "net22": "02:2d:97:f0:85:b1",
            "net23": "a6:8a:18:73:17:99",
            "net24": "56:b7:cf:18:a1:c8",
            "net25": "76:2c:81:25:49:66",
            "net26": "86:a9:51:f1:3a:ac",
            "net27": "1e:74:e3:4d:af:be",
            "net3": "a6:b7:3c:6f:53:87",
            "net4": "36:dd:ec:6b:5e:f7",
            "net5": "4e:c2:24:41:53:5d",
            "net6": "b2:9b:77:a3:28:37",
            "net7": "6e:61:7a:ce:2b:e4",
            "net8": "8a:7c:bf:de:00:d1",
            "net9": "32:62:47:94:fe:b5"
        },
        "tof_1_2_6": {
            "net0": "d2:cd:4a:e2:81:9d",
            "net1": "be:62:76:2e:45:a2",
            "net10": "32:95:33:81:a6:dc",
            "net11": "d2:6c:c2:29:ae:be",
            "net12": "12:38:4f:4f:82:75",
            "net13": "8e:6b:95:43:db:31",
            "net14": "ca:94:a0:eb:3d:59",
            "net15": "aa:63:65:2c:94:5a",
            "net16": "d6:8b:1c:97:4b:bc",
            "net17": "82:2e:05:92:d2:4a",
            "net18": "92:80:fc:16:69:e8",
            "net19": "4e:32:00:f9:c8:93",
            "net2": "26:4e:8a:c7:35:7d",
            "net20": "62:a3:3c:64:85:70",
            "net21": "86:15:be:94:b9:39",
            "net22": "0a:8e:0d:f6:18:dd",
            "net23": "46:52:58:ab:af:0d",
            "net24": "6e:09:c2:81:73:7a",
            "net25": "ae:84:12:5c:40:b7",
            "net26": "e2:5f:97:0e:e3:7e",
            "net27": "ea:a8:33:22:ff:62",
            "net3": "6e:af:5e:71:58:47",
            "net4": "8e:ac:a8:e1:dc:90",
            "net5": "66:cb:d8:07:f3:98",
            "net6": "da:31:d9:2e:64:5f",
            "net7": "be:a5:bb:98:5a:6e",
            "net8": "b6:36:ed:a6:a7:d0",
            "net9": "f2:0c:86:e7:b3:8b"
        },
        "tof_1_2_7": {
            "net0": "82:08:7c:24:66:63",
            "net1": "9e:8e:62:cf:58:8a",
            "net10": "42:e2:8e:54:78:cb",
            "net11": "02:42:93:b4:03:36",
            "net12": "26:4e:74:fd:33:22",
            "net13": "a6:d9:9f:d3:0c:b7",
            "net14": "56:ec:ee:4a:3e:7b",
            "net15": "ea:80:b4:d1:5b:51",
            "net16": "a6:07:c9:74:32:61",
            "net17": "ea:f8:87:a3:bc:e2",
            "net18": "de:f2:be:ae:d8:0d",
            "net19": "06:54:9f:a5:65:ce",
            "net2": "3e:c0:0a:c8:5c:88",
            "net20": "62:3f:e7:20:28:49",
            "net21": "92:3e:3b:35:ed:4c",
            "net22": "4a:97:48:c5:9a:56",
            "net23": "22:52:6d:4b:e7:d5",
            "net24": "ee:71:a0:a4:7d:1b",
            "net25": "fe:3a:99:dd:07:20",
            "net26": "ea:13:a6:40:82:d6",
            "net27": "da:bf:cd:f2:7b:e7",
            "net3": "86:a2:7c:0f:0d:1d",
            "net4": "62:72:ec:a3:2b:6e",
            "net5": "56:bd:74:b1:8a:4a",
            "net6": "66:f0:30:1c:4d:54",
            "net7": "3e:43:94:8d:59:f3",
            "net8": "4a:5a:13:00:96:26",
            "net9": "ea:11:bf:8f:46:1b"
        },
        "tof_1_2_8": {
            "net0": "ba:cf:2c:4a:e6:5b",
            "net1": "06:85:ef:9a:dc:59",
            "net10": "06:d3:fa:eb:13:f4",
            "net11": "2a:e9:a2:66:71:b6",
            "net12": "0a:bd:9c:b4:f7:58",
            "net13": "ea:40:0b:64:b6:38",
            "net14": "2a:ce:1e:d8:af:aa",
            "net15": "2a:ad:3c:86:94:36",
            "net16": "5e:1e:62:f6:6f:49",
            "net17": "6a:ac:c6:8a:68:b5",
            "net18": "86:63:21:ac:21:4b",
            "net19": "72:cc:86:73:a2:87",
            "net2": "82:77:e7:7d:24:63",
            "net20": "66:38:87:11:41:a3",
            "net21": "7e:b3:27:35:9f:f7",
            "net22": "c2:04:4b:5f:23:4e",
            "net23": "d2:80:9c:8e:2b:c5",
            "net24": "12:5a:6a:b0:80:2b",
            "net25": "aa:a4:77:43:76:38",
            "net26": "72:34:3c:30:64:9d",
            "net27": "5a:26:4d:a9:5b:62",
            "net3": "76:dd:b1:05:26:a4",
            "net4": "6a:f7:79:6a:76:86",
            "net5": "d6:79:5c:9b:13:39",
            "net6": "a2:15:37:0e:89:2d",
            "net7": "42:48:52:4d:3e:15",
            "net8": "7e:4b:5e:98:52:15",
            "net9": "42:5f:71:2a:de:49"
        },
        "tof_1_2_9": {
            "net0": "26:91:02:8a:08:cc",
            "net1": "f6:04:15:6e:78:47",
            "net10": "8e:0e:bb:e7:a0:dd",
            "net11": "4e:38:36:72:4b:3d",
            "net12": "1e:97:f8:96:5c:54",
            "net13": "2e:d8:1e:64:92:b2",
            "net14": "fe:b4:c6:2c:f8:09",
            "net15": "7e:91:da:4e:1b:f4",
            "net16": "d6:e1:e3:43:58:0b",
            "net17": "a6:9f:05:75:c7:df",
            "net18": "3e:d5:6d:ca:a4:b7",
            "net19": "ce:76:68:45:c7:0d",
            "net2": "6a:9c:30:a7:aa:de",
            "net20": "ce:1c:81:6f:85:25",
            "net21": "da:3b:5f:fa:e0:f4",
            "net22": "86:61:53:54:2f:dc",
            "net23": "f6:da:d1:66:c8:1f",
            "net24": "ca:14:c2:05:d3:98",
            "net25": "82:11:0c:e6:1b:06",
            "net26": "aa:2b:a3:8f:58:a0",
            "net27": "d2:50:08:ba:40:11",
            "net3": "ea:c0:f7:3b:91:b9",
            "net4": "92:60:0d:aa:da:39",
            "net5": "fe:a8:cb:0b:56:21",
            "net6": "7a:77:9b:8f:2f:e8",
            "net7": "12:91:96:b8:25:96",
            "net8": "8a:bc:07:01:c4:fc",
            "net9": "42:e1:9a:c3:53:1f"
        }
    },
    "failed_machine": "tof_1_2_1",
    "failure_time": {
        "leaf_1_0_1": 1636243069.3628798,
        "leaf_1_0_10": 1636243069.9122198,
        "leaf_1_0_11": 1636243069.390913,
        "leaf_1_0_12": 1636243069.432765,
        "leaf_1_0_13": 1636243069.4556265,
        "leaf_1_0_14": 1636243069.719649,
        "leaf_1_0_2": 1636243069.7933803,
        "leaf_1_0_3": 1636243069.8111331,
        "leaf_1_0_4": 1636243069.833495,
        "leaf_1_0_5": 1636243069.3733606,
        "leaf_1_0_6": 1636243069.381723,
        "leaf_1_0_7": 1636243069.3914986,
        "leaf_1_0_8": 1636243069.4156559,
        "leaf_1_0_9": 1636243069.4365742,
        "leaf_2_0_1": 1636243069.4546425,
        "leaf_2_0_10": 1636243069.5251932,
        "leaf_2_0_11": 1636243070.1947947,
        "leaf_2_0_12": 1636243070.3179789,
        "leaf_2_0_13": 1636243069.8028982,
        "leaf_2_0_14": 1636243069.8308232,
        "leaf_2_0_2": 1636243070.3781419,
        "leaf_2_0_3": 1636243069.9525023,
        "leaf_2_0_4": 1636243070.0356617,
        "leaf_2_0_5": 1636243070.0732353,
        "leaf_2_0_6": 1636243070.1177793,
        "leaf_2_0_7": 1636243070.1907318,
        "leaf_2_0_8": 1636243070.7358203,
        "leaf_2_0_9": 1636243069.842576,
        "spine_1_1_1": 1636243069.8558042,
        "spine_1_1_10": 1636243069.9363394,
        "spine_1_1_11": 1636243069.957295,
        "spine_1_1_12": 1636243070.0730977,
        "spine_1_1_13": 1636243070.0967462,
        "spine_1_1_14": 1636243070.1678004,
        "spine_1_1_2": 1636243070.2039764,
        "spine_1_1_3": 1636243070.2237136,
        "spine_1_1_4": 1636243070.236111,
        "spine_1_1_5": 1636243070.243276,
        "spine_1_1_6": 1636243070.2545443,
        "spine_1_1_7": 1636243070.824611,
        "spine_1_1_8": 1636243070.8358834,
        "spine_1_1_9": 1636243070.3177526,
        "spine_2_1_1": 1636243070.3435233,
        "spine_2_1_10": 1636243070.3549738,
        "spine_2_1_11": 1636243070.9113004,
        "spine_2_1_12": 1636243070.2473009,
        "spine_2_1_13": 1636243070.2563272,
        "spine_2_1_14": 1636243070.3059652,
        "spine_2_1_2": 1636243070.3194337,
        "spine_2_1_3": 1636243070.3436487,
        "spine_2_1_4": 1636243070.3542202,
        "spine_2_1_5": 1636243070.3708668,
        "spine_2_1_6": 1636243070.4035382,
        "spine_2_1_7": 1636243070.4107473,
        "spine_2_1_8": 1636243070.4059975,
        "spine_2_1_9": 1636243070.4157302,
        "tof_1_2_1": 1636243070.4279678,
        "tof_1_2_10": 1636243070.4462883,
        "tof_1_2_11": 1636243070.5033886,
        "tof_1_2_12": 1636243070.5149348,
        "tof_1_2_13": 1636243071.0591388,
        "tof_1_2_14": 1636243071.072808,
        "tof_1_2_2": 1636243070.5507638,
        "tof_1_2_3": 1636243070.417526,
        "tof_1_2_4": 1636243070.4359553,
        "tof_1_2_5": 1636243070.4454668,
        "tof_1_2_6": 1636243070.5064538,
        "tof_1_2_7": 1636243070.5157747,
        "tof_1_2_8": 1636243070.528529,
        "tof_1_2_9": 1636243070.5497549
    }
}