{
    "k_leaf": 16,
    "k_top": 16,
    "redundancy_factor": 16,
    "is_k8s": true,
    "machine_mac_addresses": {
        "leaf_1_0_1": {
            "net0": "9a:4b:e7:6c:1f:58",
            "net1": "f6:2a:1c:5b:2b:58",
            "net10": "7a:5e:61:9a:da:d3",
            "net11": "b2:d5:c9:86:91:63",
            "net12": "62:70:dc:45:70:14",
            "net13": "66:7d:81:78:4f:85",
            "net14": "9e:c2:3c:ec:dc:50",
            "net15": "46:29:8a:35:27:37",
            "net16": "c2:b6:b5:90:de:40",
            "net2": "f6:77:14:ae:5f:cf",
            "net3": "3a:7d:73:1b:0e:45",
            "net4": "f2:21:dc:a0:fe:3f",
            "net5": "8e:48:78:9a:e9:31",
            "net6": "ea:1d:de:9f:cb:3e",
            "net7": "7e:bd:ea:9c:6f:44",
            "net8": "aa:09:af:44:1f:cd",
            "net9": "5a:9d:1a:5d:68:a5"
        },
        "leaf_1_0_10": {
            "net0": "fe:2a:d9:29:5a:db",
            "net1": "d2:55:91:49:73:07",
            "net10": "d6:56:84:a6:71:cd",
            "net11": "fe:18:cb:f2:8e:b4",
            "net12": "7a:1d:a6:66:a3:4d",
            "net13": "2a:8c:54:aa:30:ab",
            "net14": "36:31:62:df:9f:58",
            "net15": "86:ce:46:9c:f1:ca",
            "net16": "82:23:50:4e:ab:a9",
            "net2": "e6:65:7a:ad:4b:02",
            "net3": "ca:73:31:be:54:da",
            "net4": "52:61:aa:e0:48:f1",
            "net5": "82:f6:f5:9e:ef:95",
            "net6": "72:ae:90:58:d7:d5",
            "net7": "b6:ef:0c:12:03:05",
            "net8": "66:65:f8:90:ae:3d",
            "net9": "8e:07:b8:58:22:3a"
        },
        "leaf_1_0_11": {
            "net0": "26:71:93:ce:07:41",
            "net1": "26:7a:42:7e:68:eb",
            "net10": "6e:0e:58:75:a0:0f",
            "net11": "a6:59:68:4c:0a:73",
            "net12": "ca:0a:ce:25:1e:bd",
            "net13": "a6:6b:75:63:1b:38",
            "net14": "1a:4c:e4:4c:73:b8",
            "net15": "66:77:29:41:e1:d7",
            "net16": "ba:29:cd:b5:67:0e",
            "net2": "36:78:1f:6e:ef:45",
            "net3": "f6:8a:2b:b9:88:52",
            "net4": "66:e8:7d:f9:5b:d3",
            "net5": "22:48:d0:fb:bb:9f",
            "net6": "72:bc:4a:4f:10:cf",
            "net7": "0e:91:cc:8a:80:21",
            "net8": "f6:9a:35:95:8c:f4",
            "net9": "52:c3:33:10:86:33"
        },
        "leaf_1_0_12": {
            "net0": "82:3e:d1:23:bc:b7",
            "net1": "52:a9:55:a7:fa:fc",
            "net10": "42:b7:3a:56:48:84",
            "net11": "8e:e2:b4:c8:75:ae",
            "net12": "6a:24:c3:b9:cb:17",
            "net13": "1a:a3:76:2c:b5:c6",
            "net14": "4e:78:68:9c:a3:55",
            "net15": "e2:55:b2:dc:04:b6",
            "net16": "46:6d:aa:67:be:c5",
            "net2": "c2:9e:32:d7:24:3d",
            "net3": "96:dc:0f:4f:2f:e5",
            "net4": "96:b3:b1:5e:84:c8",
            "net5": "1e:3e:e9:4e:19:5a",
            "net6": "c2:eb:c9:6f:42:5a",
            "net7": "ae:9a:fb:ef:9d:7f",
            "net8": "7a:f6:a0:4b:f5:c0",
            "net9": "7e:a1:fa:8b:ae:59"
        },
        "leaf_1_0_13": {
            "net0": "ae:f7:e9:3b:62:eb",
            "net1": "46:05:64:4e:53:96",
            "net10": "da:ab:5a:e4:1b:ad",
            "net11": "be:da:c0:78:0c:80",
            "net12": "a6:b6:d3:78:37:1e",
            "net13": "6e:7e:94:d8:55:cb",
            "net14": "82:8c:db:6b:e0:3c",
            "net15": "52:b7:83:0a:28:bf",
            "net16": "26:3d:1d:3d:a1:71",
            "net2": "ea:61:7c:29:49:d7",
            "net3": "92:3d:d4:d1:2c:27",
            "net4": "fe:22:1c:30:f8:7a",
            "net5": "02:e3:b0:66:84:ca",
            "net6": "f2:f6:8a:6f:b7:79",
            "net7": "82:02:ab:28:fb:b4",
            "net8": "fa:e8:54:8e:f9:d4",
            "net9": "ae:e3:29:97:ee:c4"
        },
        "leaf_1_0_14": {
            "net0": "ca:e4:c3:f3:a7:a2",
            "net1": "d6:f0:e4:d6:cf:b5",
            "net10": "2e:2f:ef:2e:35:8f",
            "net11": "4a:d5:5d:e3:ff:71",
            "net12": "7a:11:f3:53:fd:f6",
            "net13": "ee:87:bd:3d:d3:b0",
            "net14": "3a:6b:0d:37:5c:f7",
            "net15": "1e:ae:2e:40:a7:9e",
            "net16": "ce:d3:3f:e6:db:e3",
            "net2": "66:24:63:2a:ce:c1",
            "net3": "46:f3:c1:46:58:c6",
            "net4": "32:48:1b:ce:0e:59",
            "net5": "06:5f:65:ee:2b:38",
            "net6": "aa:1a:42:a0:5d:20",
            "net7": "0e:4c:57:3b:d0:b1",
            "net8": "ba:3e:07:b2:f9:24",
            "net9": "e2:44:f0:5c:aa:0e"
        },
        "leaf_1_0_15": {
            "net0": "f6:54:ec:8b:36:dc",
            "net1": "ee:62:eb:f3:b2:c5",
            "net10": "16:60:1d:74:51:53",
            "net11": "46:4c:12:90:f1:02",
            "net12": "be:46:96:2d:0a:92",
            "net13": "ae:f2:5f:90:5b:24",
            "net14": "d2:26:a0:05:91:27",
            "net15": "fa:d7:fb:68:a1:e4",
            "net16": "12:a3:79:05:45:9d",
            "net2": "ea:f4:a3:b7:18:fe",
            "net3": "42:de:03:c6:1a:33",
            "net4": "22:f4:ad:d2:80:02",
            "net5": "e6:44:16:95:71:5f",
            "net6": "c2:c4:fd:25:96:5f",
            "net7": "16:56:60:8b:a8:c2",
            "net8": "22:da:f4:db:54:5e",
            "net9": "52:c4:3e:a1:86:2c"
        },
        "leaf_1_0_16": {
            "net0": "7e:61:44:d5:05:bf",
            "net1": "42:98:26:56:8b:e7",
            "net10": "8e:16:57:08:89:b3",
            "net11": "da:13:b4:35:b8:98",
            "net12": "72:73:7e:2f:a4:10",
            "net13": "32:de:1a:e7:a6:0a",
            "net14": "b2:45:c1:c9:6d:39",
            "net15": "12:f6:34:1d:3d:60",
            "net16": "3a:f8:34:fd:5b:af",
            "net2": "a2:f0:89:77:fb:b4",
            "net3": "d2:6e:dc:46:56:e9",
            "net4": "d6:65:d1:2e:9d:6a",
            "net5": "fa:ae:66:62:e9:fc",
            "net6": "aa:e1:7e:60:f1:df",
            "net7": "a2:fe:47:31:6b:63",
            "net8": "56:19:20:37:87:f0",
            "net9": "0e:ed:cf:29:c4:13"
        },
        "leaf_1_0_2": {
            "net0": "8a:e2:03:5f:c4:80",
            "net1": "46:54:c2:bc:38:1a",
            "net10": "3e:a8:be:25:b5:e8",
            "net11": "ae:67:b0:d2:a4:1b",
            "net12": "e2:a7:84:e2:34:45",
            "net13": "32:00:e5:b1:c8:f1",
            "net14": "a2:d9:c9:ca:73:3d",
            "net15": "d2:08:11:ad:8e:7d",
            "net16": "1a:bb:89:17:b1:eb",
            "net2": "da:c5:33:40:99:a8",
            "net3": "4a:a8:79:c9:50:0d",
            "net4": "a6:8d:99:cd:0c:16",
            "net5": "0e:f4:03:a1:1e:a0",
            "net6": "b6:51:a5:04:a8:20",
            "net7": "9e:e2:e0:76:5d:76",
            "net8": "ea:1b:40:5a:a8:be",
            "net9": "ae:da:81:cc:5c:97"
        },
        "leaf_1_0_3": {
            "net0": "9a:a7:84:dd:ed:2e",
            "net1": "2e:c3:a0:8c:5f:30",
            "net10": "5e:a4:a2:89:1b:f1",
            "net11": "46:48:af:f8:4e:61",
            "net12": "be:ff:29:9f:ca:91",
            "net13": "f6:de:3d:dc:3b:39",
            "net14": "0e:90:f8:7d:52:6c",
            "net15": "3e:8d:23:3c:af:7a",
            "net16": "d2:47:93:07:df:3c",
            "net2": "12:92:b5:68:44:71",
            "net3": "2a:97:03:df:c4:d1",
            "net4": "da:f4:f5:a6:d0:28",
            "net5": "e6:e9:04:75:97:9f",
            "net6": "2e:33:82:cd:e2:37",
            "net7": "a6:e2:c4:35:3d:a6",
            "net8": "06:5c:05:71:f3:13",
            "net9": "3a:57:f6:16:02:54"
        },
        "leaf_1_0_4": {
            "net0": "3a:41:55:47:38:62",
            "net1": "8a:23:a8:7f:16:66",
            "net10": "a6:59:42:71:fd:0c",
            "net11": "fa:c8:8b:ea:24:9e",
            "net12": "c2:c4:94:15:c5:e9",
            "net13": "06:3f:95:bb:d6:24",
            "net14": "26:e0:4a:ab:5d:13",
            "net15": "12:7a:42:e2:a5:6a",
            "net16": "f2:d9:40:6a:0a:d1",
            "net2": "86:d0:f0:0c:2b:3b",
            "net3": "9a:c1:73:74:2e:ce",
            "net4": "62:81:14:9a:07:81",
            "net5": "16:90:df:61:97:01",
            "net6": "0e:f4:e1:c8:97:b9",
            "net7": "da:2b:f9:d5:c2:7e",
            "net8": "42:9d:c6:0d:f2:6d",
            "net9": "c6:bc:42:cd:c2:09"
        },
        "leaf_1_0_5": {
            "net0": "ee:b8:f4:a4:21:38",
            "net1": "f2:39:3e:28:9c:dc",
            "net10": "8e:51:45:ca:0b:43",
            "net11": "4e:90:33:b8:38:59",
            "net12": "82:0b:0e:2c:35:8a",
            "net13": "56:df:ec:c7:34:f9",
            "net14": "76:98:32:f6:b9:96",
            "net15": "56:46:4b:ae:cc:3f",
            "net16": "ba:62:dc:13:f8:dd",
            "net2": "26:2d:91:98:49:b4",
            "net3": "a6:98:8f:83:24:cd",
            "net4": "2e:7c:9e:57:73:60",
            "net5": "3a:0b:3b:04:e7:8f",
            "net6": "e6:11:ac:eb:fe:6e",
            "net7": "ee:be:af:3b:ba:cb",
            "net8": "6e:91:6d:a7:1d:05",
            "net9": "f2:fd:d3:3b:f5:37"
        },
        "leaf_1_0_6": {
            "net0": "56:bb:e0:dc:96:a8",
            "net1": "fe:1e:21:2e:af:40",
            "net10": "9e:a0:d6:d9:29:e5",
            "net11": "66:00:32:6f:ea:83",
            "net12": "c6:d1:52:12:94:90",
            "net13": "32:62:66:94:ce:67",
            "net14": "fe:b3:2c:26:a8:13",
            "net15": "2e:c6:f8:11:39:34",
            "net16": "62:76:61:3e:95:e1",
            "net2": "ea:96:94:de:f8:c4",
            "net3": "62:c6:6c:a7:b3:0d",
            "net4": "22:a6:74:ac:dd:3a",
            "net5": "8e:4e:47:42:cd:63",
            "net6": "36:36:9d:a8:6c:c9",
            "net7": "32:22:a6:02:a3:49",
            "net8": "a2:fe:b6:4d:f7:93",
            "net9": "12:0a:52:52:24:5a"
        },
        "leaf_1_0_7": {
            "net0": "aa:d2:01:0e:a1:0b",
            "net1": "82:5c:b2:68:78:7f",
            "net10": "36:bb:74:29:42:ce",
            "net11": "22:1f:32:54:70:e6",
            "net12": "3e:db:fe:11:7e:48",
            "net13": "de:50:f2:ec:aa:a5",
            "net14": "9a:e4:ee:36:6c:01",
            "net15": "ee:0e:25:f8:43:bf",
            "net16": "0a:b5:04:fd:62:64",
            "net2": "3a:b1:ac:06:f1:0f",
            "net3": "82:b1:ef:13:82:bc",
            "net4": "0e:ba:e8:93:05:94",
            "net5": "02:dd:99:3a:ef:0f",
            "net6": "a6:14:b4:f4:b3:3c",
            "net7": "7a:93:59:0a:b6:c7",
            "net8": "b6:f0:e1:3b:a4:77",
            "net9": "9e:bf:27:e5:20:9d"
        },
        "leaf_1_0_8": {
            "net0": "0e:c3:de:62:9d:d7",
            "net1": "ee:09:9c:9e:cb:5e",
            "net10": "6e:01:dd:58:ac:1a",
            "net11": "6a:d4:ed:f5:94:31",
            "net12": "ba:31:77:ea:f5:c9",
            "net13": "92:65:18:93:6c:cf",
            "net14": "9e:82:c0:c4:93:c4",
            "net15": "7e:c1:0e:3c:48:4b",
            "net16": "8a:7c:ec:b6:2e:5e",
            "net2": "ca:37:8d:07:b4:08",
            "net3": "32:1c:03:12:9b:05",
            "net4": "f6:56:c3:c6:63:95",
            "net5": "6e:34:79:62:01:3e",
            "net6": "16:c3:80:9c:36:2a",
            "net7": "be:ec:e9:2b:9e:73",
            "net8": "1e:b1:11:e9:73:f6",
            "net9": "ae:8f:a1:de:58:54"
        },
        "leaf_1_0_9": {
            "net0": "a2:19:2c:ad:ea:1d",
            "net1": "6a:1d:20:69:94:90",
            "net10": "8a:68:0a:41:99:02",
            "net11": "e6:ae:a9:6a:2f:13",
            "net12": "fe:45:e9:4f:d7:1f",
            "net13": "9e:46:12:09:91:0b",
            "net14": "0a:f9:a3:d0:cd:91",
            "net15": "12:d1:58:79:49:f6",
            "net16": "8e:9f:db:6e:a0:5d",
            "net2": "6a:ce:b4:bc:0a:07",
            "net3": "46:76:81:7e:21:04",
            "net4": "a2:c7:eb:f9:62:44",
            "net5": "d6:2f:b4:d5:5f:c8",
            "net6": "ce:dc:9f:88:7f:19",
            "net7": "0e:1e:f9:e6:e8:20",
            "net8": "ae:67:b8:e5:ee:61",
            "net9": "ea:8d:49:ac:95:b3"
        },
        "leaf_2_0_1": {
            "net0": "c6:e7:51:90:5e:f7",
            "net1": "0e:48:61:17:14:d9",
            "net10": "82:63:0f:2d:34:7c",
            "net11": "1e:5a:00:af:c2:45",
            "net12": "96:97:df:07:bb:d7",
            "net13": "52:4e:9d:ce:67:80",
            "net14": "1a:be:f2:fd:59:97",
            "net15": "b2:9f:80:cb:61:ee",
            "net16": "d2:3e:6d:ef:4d:cd",
            "net2": "02:53:2e:d2:98:4e",
            "net3": "a2:53:9c:5a:d6:f2",
            "net4": "e6:72:19:95:28:e5",
            "net5": "f6:91:a9:2a:52:84",
            "net6": "0a:ba:fc:78:5f:2b",
            "net7": "82:e7:11:47:8b:79",
            "net8": "4a:93:8e:b7:15:08",
            "net9": "4a:03:90:13:ad:68"
        },
        "leaf_2_0_10": {
            "net0": "ce:5c:a2:30:a6:35",
            "net1": "4a:ea:57:63:19:38",
            "net10": "1a:c6:10:dd:a0:0c",
            "net11": "da:60:53:8f:3c:43",
            "net12": "fa:6d:0c:df:46:6b",
            "net13": "16:f7:9d:12:f5:a9",
            "net14": "26:7d:89:db:7b:0e",
            "net15": "f2:9f:15:4c:80:84",
            "net16": "9e:59:63:c7:2a:0e",
            "net2": "be:44:bd:31:80:64",
            "net3": "d2:32:0a:24:67:4e",
            "net4": "a2:1a:9f:98:13:52",
            "net5": "72:e1:7c:6d:97:05",
            "net6": "5a:e6:85:3e:f0:e4",
            "net7": "86:04:04:10:0f:a2",
            "net8": "9a:d7:d9:bb:3f:3b",
            "net9": "c6:12:04:78:b1:9b"
        },
        "leaf_2_0_11": {
            "net0": "2e:1d:d4:20:04:ae",
            "net1": "9e:44:26:3e:68:95",
            "net10": "e6:24:2d:71:a5:13",
            "net11": "0e:0e:d2:a6:29:1f",
            "net12": "0a:c6:98:89:b8:5d",
            "net13": "e6:c4:18:44:79:09",
            "net14": "86:ef:ce:b0:70:b5",
            "net15": "8e:1c:c3:0b:07:3e",
            "net16": "66:7c:aa:1a:a0:97",
            "net2": "46:fe:b0:12:60:ee",
            "net3": "a6:af:ac:13:a4:f1",
            "net4": "da:d7:73:0f:34:ec",
            "net5": "82:fb:71:7b:a2:2c",
            "net6": "6e:68:23:02:9a:18",
            "net7": "16:ea:e7:88:70:b9",
            "net8": "fe:99:95:8b:f4:ee",
            "net9": "ca:e8:4d:a5:07:10"
        },
        "leaf_2_0_12": {
            "net0": "16:93:63:74:91:74",
            "net1": "ae:ca:e9:1e:f8:eb",
            "net10": "46:76:5d:99:19:de",
            "net11": "0a:85:fa:62:0f:25",
            "net12": "ba:26:30:43:71:ad",
            "net13": "8e:1d:f2:be:99:00",
            "net14": "42:06:3d:a6:85:37",
            "net15": "72:2e:33:f9:f4:eb",
            "net16": "a6:23:27:dd:ee:2b",
            "net2": "62:59:be:f4:3e:fb",
            "net3": "1a:51:d6:8e:40:4e",
            "net4": "4e:5e:3f:83:7b:3a",
            "net5": "1e:80:a6:57:18:3f",
            "net6": "32:41:e7:be:00:d3",
            "net7": "d2:7f:82:9f:ae:77",
            "net8": "86:d9:32:61:f0:54",
            "net9": "82:38:a4:2d:40:24"
        },
        "leaf_2_0_13": {
            "net0": "5a:05:41:9d:d5:47",
            "net1": "c6:06:90:12:b9:c5",
            "net10": "c2:d8:a4:07:cd:22",
            "net11": "ce:70:cf:0b:62:c5",
            "net12": "d6:b7:7a:77:97:20",
            "net13": "ba:43:5d:99:2a:a1",
            "net14": "e2:ec:67:54:ae:84",
            "net15": "fa:59:95:6d:9e:83",
            "net16": "a6:f0:46:1d:54:7c",
            "net2": "6a:29:3a:99:d1:89",
            "net3": "c6:39:9e:ac:55:be",
            "net4": "12:e1:d5:75:00:54",
            "net5": "36:59:6e:9d:30:ac",
            "net6": "82:d3:84:de:3f:78",
            "net7": "f6:72:e6:04:42:40",
            "net8": "92:08:84:37:37:a0",
            "net9": "2e:33:15:4f:5d:e2"
        },
        "leaf_2_0_14": {
            "net0": "36:1b:d8:08:e2:14",
            "net1": "3a:94:07:25:9f:aa",
            "net10": "72:b9:dc:e4:4a:08",
            "net11": "ca:58:18:06:b9:c1",
            "net12": "a2:48:59:7f:19:72",
            "net13": "2e:6b:c7:87:23:4e",
            "net14": "ae:1d:e6:75:92:9d",
            "net15": "8a:19:11:48:1a:ff",
            "net16": "e6:8f:df:e2:d2:ec",
            "net2": "ba:fb:bd:8e:ea:db",
            "net3": "6a:a5:c0:f1:8a:72",
            "net4": "6e:ad:13:86:5d:16",
            "net5": "02:96:0d:d4:64:30",
            "net6": "76:c0:74:9f:c0:02",
            "net7": "9e:20:cb:08:05:5a",
            "net8": "fa:1d:78:62:2d:71",
            "net9": "6a:52:98:b4:1b:ba"
        },
        "leaf_2_0_15": {
            "net0": "2a:b7:18:0c:0c:ca",
            "net1": "4e:ca:8b:df:42:ba",
            "net10": "ce:79:8f:6b:60:ca",
            "net11": "96:c1:d0:cd:54:6c",
            "net12": "d2:dd:2f:30:b2:7f",
            "net13": "96:36:8f:84:1c:9b",
            "net14": "d6:0d:26:f8:52:b9",
            "net15": "0a:11:f4:f4:61:ae",
            "net16": "4a:14:33:d4:e9:e5",
            "net2": "1a:2a:df:60:73:f0",
            "net3": "02:92:f0:d9:3b:5b",
            "net4": "ee:49:6a:09:7a:de",
            "net5": "1a:7e:b3:e8:27:e5",
            "net6": "ba:10:9f:03:ba:99",
            "net7": "ba:97:45:16:f7:24",
            "net8": "f6:80:78:5b:4f:e8",
            "net9": "c2:37:7b:b1:bb:08"
        },
        "leaf_2_0_16": {
            "net0": "4a:bb:70:f6:32:ad",
            "net1": "8e:9c:6e:43:1c:0a",
            "net10": "f6:16:32:9a:35:5b",
            "net11": "2e:ca:cd:1e:2a:a2",
            "net12": "12:8b:cb:15:b2:78",
            "net13": "8a:ae:0c:ba:18:68",
            "net14": "be:96:8b:22:94:f6",
            "net15": "e6:f4:24:c9:48:a1",
            "net16": "c6:80:82:ab:17:df",
            "net2": "d6:1b:2c:f5:90:4d",
            "net3": "5e:4a:c9:be:ab:1b",
            "net4": "f6:4b:2b:b9:c0:2b",
            "net5": "26:3a:40:c3:d8:98",
            "net6": "c2:b0:4f:f2:e7:41",
            "net7": "42:58:ac:cb:c3:94",
            "net8": "2a:9f:e3:47:d1:b8",
            "net9": "46:55:27:c6:bd:17"
        },
        "leaf_2_0_2": {
            "net0": "9a:f7:67:64:b2:4d",
            "net1": "4a:c3:eb:ef:86:bd",
            "net10": "fa:97:cb:b6:44:fd",
            "net11": "22:e2:6a:ed:42:41",
            "net12": "b2:27:25:60:2e:9e",
            "net13": "3a:57:6a:fc:51:2d",
            "net14": "46:20:e8:92:d1:49",
            "net15": "16:9d:23:ae:c0:55",
            "net16": "9e:9a:4a:17:1d:33",
            "net2": "12:8a:c2:3b:bb:ed",
            "net3": "1a:1a:38:f2:a6:c1",
            "net4": "0a:ae:0c:b8:79:1f",
            "net5": "2a:54:26:07:16:a1",
            "net6": "d6:0a:a3:f6:43:92",
            "net7": "12:56:8d:d8:7b:f2",
            "net8": "1e:2c:00:3e:f4:bd",
            "net9": "76:71:b1:6f:fb:cd"
        },
        "leaf_2_0_3": {
            "net0": "16:5b:5d:10:f9:13",
            "net1": "da:6c:f6:b6:cd:16",
            "net10": "02:8f:73:04:5e:3a",
            "net11": "7a:6c:5e:6b:0e:9a",
            "net12": "fe:0e:84:8d:3c:5c",
            "net13": "3e:dc:c9:4d:e1:05",
            "net14": "7a:f1:7b:0a:64:f1",
            "net15": "fa:0c:2b:ce:4a:bc",
            "net16": "da:5c:20:be:0c:eb",
            "net2": "c2:5e:8f:cb:5a:b1",
            "net3": "6a:23:be:be:00:24",
            "net4": "76:67:98:84:d4:02",
            "net5": "fa:a2:37:6c:a8:0c",
            "net6": "8a:12:41:dc:d6:6e",
            "net7": "6e:57:b1:7f:de:d4",
            "net8": "ce:de:10:15:1a:20",
            "net9": "d2:40:e8:dc:69:0c"
        },
        "leaf_2_0_4": {
            "net0": "a2:52:fa:c6:22:08",
            "net1": "46:4f:a3:4b:f9:34",
            "net10": "5e:92:39:79:2f:86",
            "net11": "fe:5f:62:e9:56:02",
            "net12": "52:3e:81:ac:82:84",
            "net13": "66:ed:53:d6:93:67",
            "net14": "4a:32:b2:b3:c5:0b",
            "net15": "d2:93:f5:67:50:ea",
            "net16": "b2:da:eb:fa:a2:63",
            "net2": "ae:2b:30:a5:59:3f",
            "net3": "a6:6f:9b:bf:a7:f7",
            "net4": "62:63:2a:56:3c:7e",
            "net5": "9e:78:40:48:f1:39",
            "net6": "3e:12:81:7b:31:b3",
            "net7": "5e:28:a6:45:ef:29",
            "net8": "c2:51:a1:ee:6f:26",
            "net9": "ce:f7:71:f8:88:09"
        },
        "leaf_2_0_5": {
            "net0": "1e:58:3f:8d:36:d7",
            "net1": "82:68:d3:fa:e4:a3",
            "net10": "ae:7e:2f:26:49:0f",
            "net11": "6a:2f:0b:79:b2:6c",
            "net12": "ca:54:99:df:a8:db",
            "net13": "da:ac:cf:c4:81:d2",
            "net14": "6e:23:80:8d:1f:b1",
            "net15": "3e:1c:c3:fc:89:bb",
            "net16": "56:5a:6a:0c:bc:59",
            "net2": "fa:f1:10:e4:f0:80",
            "net3": "46:3c:d3:08:e3:95",
            "net4": "72:40:af:50:fa:45",
            "net5": "2e:62:17:77:25:07",
            "net6": "c2:d1:9a:85:a5:06",
            "net7": "72:70:23:bd:01:4a",
            "net8": "a6:b7:7f:db:50:56",
            "net9": "4e:88:46:f2:23:bb"
        },
        "leaf_2_0_6": {
            "net0": "c6:3f:dd:71:94:6e",
            "net1": "96:6c:09:25:66:f5",
            "net10": "fe:64:a8:94:80:5a",
            "net11": "96:2f:da:52:07:e8",
            "net12": "e6:e9:7f:6f:3b:48",
            "net13": "5a:5a:0a:4c:29:3a",
            "net14": "72:7f:70:93:34:cb",
            "net15": "72:d6:47:38:8a:31",
            "net16": "c2:d4:31:40:93:a8",
            "net2": "66:bb:6a:b0:8f:f9",
            "net3": "2e:a0:81:74:7c:51",
            "net4": "e6:3f:e8:c5:a1:c7",
            "net5": "5e:75:51:0f:3b:3e",
            "net6": "d6:60:78:fa:fc:bd",
            "net7": "52:97:dc:7a:98:94",
            "net8": "7e:64:e3:ee:b7:48",
            "net9": "66:63:5d:31:9a:b2"
        },
        "leaf_2_0_7": {
            "net0": "b6:5c:9d:cc:0f:80",
            "net1": "76:03:90:8d:da:fd",
            "net10": "12:64:02:0e:7e:e5",
            "net11": "c6:b7:e9:2d:bf:91",
            "net12": "62:9c:cf:1b:f3:12",
            "net13": "f6:c0:db:9e:2d:fa",
            "net14": "a6:3b:8e:b5:e6:89",
            "net15": "3a:af:6d:1a:2c:c6",
            "net16": "0e:ee:4f:8c:65:4d",
            "net2": "56:38:db:51:a7:18",
            "net3": "fe:fe:d9:12:19:6f",
            "net4": "f6:0e:7a:f1:cd:b7",
            "net5": "8a:bd:44:05:86:c9",
            "net6": "ae:3f:bc:a1:59:5d",
            "net7": "c6:33:68:e9:14:da",
            "net8": "9e:8b:c2:44:dc:3f",
            "net9": "c6:30:f9:cc:93:a1"
        },
        "leaf_2_0_8": {
            "net0": "32:63:b7:ab:e0:95",
            "net1": "36:1a:d8:26:4b:e3",
            "net10": "52:be:0b:79:86:8b",
            "net11": "96:fc:c9:be:6c:c5",
            "net12": "b2:67:50:1a:03:1a",
            "net13": "c2:e0:c6:e3:b4:ba",
            "net14": "8e:a8:e3:c0:d3:fb",
            "net15": "3e:22:50:30:97:72",
            "net16": "ce:a4:c1:ec:13:12",
            "net2": "4a:97:85:2a:6f:3e",
            "net3": "36:71:af:d2:0b:43",
            "net4": "b2:53:26:6c:16:e7",
            "net5": "52:02:07:d1:3d:1e",
            "net6": "0e:26:25:a8:db:69",
            "net7": "12:e9:47:ba:90:8d",
            "net8": "16:43:e5:23:b0:a9",
            "net9": "2e:ab:6b:c9:2f:49"
        },
        "leaf_2_0_9": {
            "net0": "96:a2:8a:20:b3:3c",
            "net1": "b2:a6:f8:60:e9:76",
            "net10": "72:fe:c5:fb:77:93",
            "net11": "ce:b7:dd:b7:04:2d",
            "net12": "2a:a1:f5:61:ce:36",
            "net13": "aa:91:f6:9e:8a:1e",
            "net14": "c2:4e:8f:02:e8:c2",
            "net15": "ee:cd:43:9a:a9:13",
            "net16": "4e:29:e3:1f:a9:4d",
            "net2": "8a:4d:4f:9b:c3:50",
            "net3": "76:5d:9a:50:e4:00",
            "net4": "66:ae:3c:18:85:69",
            "net5": "e2:37:5e:eb:1d:d7",
            "net6": "1a:3a:40:a0:39:51",
            "net7": "66:59:ed:c0:34:e6",
            "net8": "7a:49:b4:4e:ec:eb",
            "net9": "f2:f3:c1:eb:8d:fb"
        },
        "spine_1_1_1": {
            "net0": "06:8c:e7:4b:fe:db",
            "net1": "06:e6:5c:96:86:5e",
            "net10": "66:be:8f:9c:82:3c",
            "net11": "02:04:bd:1b:06:fa",
            "net12": "f6:05:42:f3:75:af",
            "net13": "42:57:6a:ee:75:f2",
            "net14": "ba:1e:7a:f1:fa:35",
            "net15": "16:d0:8c:5a:c2:9d",
            "net16": "fe:a1:a2:db:38:93",
            "net17": "de:62:cb:bd:31:a6",
            "net18": "12:05:80:01:bb:28",
            "net19": "9e:df:1e:c6:00:92",
            "net2": "42:1e:f0:8c:d5:8c",
            "net20": "3a:07:93:fa:64:62",
            "net21": "1e:18:9d:fe:e9:bc",
            "net22": "d6:0e:d1:d2:50:d7",
            "net23": "1e:b2:2c:4a:62:d5",
            "net24": "12:20:fd:27:7d:96",
            "net25": "42:d3:1f:d7:e2:76",
            "net26": "72:39:0d:77:05:6a",
            "net27": "5e:3c:be:89:85:92",
            "net28": "5e:96:09:09:15:c4",
            "net29": "92:71:36:4a:f6:50",
            "net3": "f6:ff:95:b8:2a:2d",
            "net30": "12:56:8d:00:c7:b7",
            "net31": "02:2e:83:d1:a2:4e",
            "net4": "62:b8:5f:9c:10:0f",
            "net5": "a6:e2:5f:03:56:e0",
            "net6": "12:f6:c3:2f:2e:a5",
            "net7": "ce:34:06:68:c9:94",
            "net8": "32:2f:64:43:17:95",
            "net9": "ea:96:de:52:a1:48"
        },
        "spine_1_1_10": {
            "net0": "2e:64:82:f2:50:e2",
            "net1": "d6:34:57:77:11:10",
            "net10": "fe:cf:0b:98:a9:9a",
            "net11": "d6:85:0a:f3:8e:ec",
            "net12": "46:03:93:3d:f1:ae",
            "net13": "7e:c0:80:18:dd:5a",
            "net14": "be:84:61:0c:44:ea",
            "net15": "aa:98:1b:8e:1e:c3",
            "net16": "96:cb:6c:52:01:c9",
            "net17": "26:a2:85:e4:0e:5e",
            "net18": "1a:97:d7:02:7c:cf",
            "net19": "1e:51:41:b8:52:33",
            "net2": "3e:a0:dc:7f:24:e3",
            "net20": "f6:3b:33:5a:5b:42",
            "net21": "ca:b2:9e:ad:bc:32",
            "net22": "a6:d1:ab:9c:f4:49",
            "net23": "9e:6e:d2:58:12:c4",
            "net24": "76:58:cc:e5:5c:e3",
            "net25": "16:0d:08:eb:97:ef",
            "net26": "1e:f0:f2:43:f0:92",
            "net27": "b6:33:2d:7f:ed:49",
            "net28": "e2:bb:c0:2f:18:b5",
            "net29": "de:25:70:61:12:5c",
            "net3": "52:2e:d1:1c:84:0a",
            "net30": "42:b1:e3:31:9c:4a",
            "net31": "4e:a9:ad:97:9e:a9",
            "net4": "4a:48:fb:47:d2:1f",
            "net5": "a6:2a:3d:1c:e5:21",
            "net6": "0a:3b:44:5b:07:b7",
            "net7": "a2:1a:62:fa:ef:cc",
            "net8": "46:65:0a:b7:61:60",
            "net9": "d2:48:bf:c1:60:67"
        },
        "spine_1_1_11": {
            "net0": "0e:cf:2b:6d:f3:65",
            "net1": "42:b7:df:a1:92:e7",
            "net10": "4a:85:a9:97:58:08",
            "net11": "9a:ff:ed:47:5d:8e",
            "net12": "86:ed:c8:18:10:ae",
            "net13": "46:15:22:1e:4e:f8",
            "net14": "d6:f3:00:65:ed:36",
            "net15": "ea:eb:07:ea:09:09",
            "net16": "a2:f6:91:f2:8f:60",
            "net17": "aa:6e:2d:f0:09:67",
            "net18": "ba:fe:85:30:a3:42",
            "net19": "5a:a6:47:a8:9a:2a",
            "net2": "36:70:d4:f1:2b:36",
            "net20": "42:c4:2f:f8:98:3b",
            "net21": "2e:bf:e0:a4:41:ac",
            "net22": "5e:8d:f5:31:89:6c",
            "net23": "ce:6e:34:80:0f:f7",
            "net24": "22:41:98:ce:84:9c",
            "net25": "ce:a6:85:00:15:f8",
            "net26": "2e:d9:27:46:60:5a",
            "net27": "9e:8f:e4:83:b5:c2",
            "net28": "e6:53:9d:f1:8f:96",
            "net29": "ee:48:ba:71:cc:8b",
            "net3": "9e:8d:fc:e3:8e:e1",
            "net30": "fe:23:2d:b5:4c:e0",
            "net31": "62:e3:c1:b5:33:36",
            "net4": "7e:7a:b7:95:6e:4a",
            "net5": "26:a2:37:b7:4f:36",
            "net6": "ce:96:16:88:69:6f",
            "net7": "b2:59:ba:55:4a:d3",
            "net8": "92:d4:29:54:87:42",
            "net9": "ee:90:42:b9:87:0b"
        },
        "spine_1_1_12": {
            "net0": "4a:65:69:0f:69:30",
            "net1": "22:f8:a3:7b:41:c3",
            "net10": "de:f2:6c:4d:c6:cc",
            "net11": "d2:1f:e8:87:03:a1",
            "net12": "82:87:8e:47:61:21",
            "net13": "ae:58:02:99:d8:20",
            "net14": "a6:da:c4:52:29:1c",
            "net15": "b6:90:06:0e:28:0a",
            "net16": "36:7c:3d:9e:26:b0",
            "net17": "02:5d:33:18:c1:5c",
            "net18": "f6:96:cf:98:ec:2d",
            "net19": "26:06:97:0e:0c:ef",
            "net2": "4e:b6:64:f1:7b:88",
            "net20": "8e:9d:d3:41:44:02",
            "net21": "ae:ce:f1:03:e8:46",
            "net22": "a2:79:ad:46:da:08",
            "net23": "8a:3f:8b:58:8d:40",
            "net24": "7e:1a:58:4b:62:2f",
            "net25": "2e:0d:77:f2:ea:60",
            "net26": "7e:56:d9:42:64:76",
            "net27": "f6:5c:15:b5:9f:3d",
            "net28": "aa:43:c5:a4:0c:ca",
            "net29": "da:9b:48:d3:bf:9f",
            "net3": "06:28:d8:7a:bb:1a",
            "net30": "1a:bd:bd:97:dd:39",
            "net31": "46:0b:25:85:9d:c7",
            "net4": "8e:76:ba:17:bc:17",
            "net5": "22:22:30:42:b7:90",
            "net6": "6e:fe:3f:31:7c:0f",
            "net7": "32:5e:85:05:2f:6a",
            "net8": "1a:fc:12:e4:7c:75",
            "net9": "62:cd:26:82:d9:89"
        },
        "spine_1_1_13": {
            "net0": "e2:f2:45:8d:19:3f",
            "net1": "22:bd:9d:7e:26:4a",
            "net10": "32:7e:51:05:81:d1",
            "net11": "5e:67:da:b5:ed:91",
            "net12": "86:81:e6:26:31:7b",
            "net13": "66:ee:49:7c:3e:ec",
            "net14": "86:9a:ce:8a:b3:06",
            "net15": "a2:35:93:02:84:ab",
            "net16": "7e:c9:a9:14:ac:db",
            "net17": "02:23:84:47:e8:56",
            "net18": "fe:99:79:ca:f2:0e",
            "net19": "0a:c8:25:13:31:a8",
            "net2": "46:7f:32:62:d0:b2",
            "net20": "be:71:3e:ab:68:58",
            "net21": "8a:f0:a5:8f:1b:b6",
            "net22": "e6:60:3f:88:e8:17",
            "net23": "b2:03:42:71:9f:61",
            "net24": "92:01:19:8e:81:76",
            "net25": "d2:61:af:c0:df:d3",
            "net26": "ea:82:7d:c8:c7:7d",
            "net27": "9a:6d:b8:1a:5e:a3",
            "net28": "2e:c9:42:9c:05:ea",
            "net29": "7e:cf:3c:51:a4:53",
            "net3": "96:60:a6:1f:36:2f",
            "net30": "ca:2a:51:59:24:6d",
            "net31": "be:41:06:29:b0:da",
            "net4": "96:a2:47:48:4e:93",
            "net5": "ea:85:b0:f6:71:f7",
            "net6": "aa:38:71:93:e9:8f",
            "net7": "d2:5c:ce:b3:74:17",
            "net8": "16:5d:03:08:e8:ee",
            "net9": "f6:e8:a0:65:1e:39"
        },
        "spine_1_1_14": {
            "net0": "8e:9c:94:60:5b:5d",
            "net1": "92:c0:bb:38:a7:db",
            "net10": "66:89:9c:09:d2:63",
            "net11": "e6:bc:0b:91:99:b6",
            "net12": "fe:9a:f4:b8:83:96",
            "net13": "46:62:00:b4:38:83",
            "net14": "0a:0e:36:39:0a:a0",
            "net15": "6e:91:78:99:55:d4",
            "net16": "f2:2f:a1:4e:4e:50",
            "net17": "9a:58:ae:2c:4a:ac",
            "net18": "c6:01:a3:cb:88:a4",
            "net19": "be:8b:ca:de:c1:a4",
            "net2": "ee:64:e4:dc:ca:36",
            "net20": "16:4f:04:12:67:5d",
            "net21": "52:33:a9:43:d1:1c",
            "net22": "a6:e5:21:ea:25:30",
            "net23": "ae:48:27:00:96:db",
            "net24": "aa:95:e6:e4:70:10",
            "net25": "7a:bb:51:d2:92:1c",
            "net26": "6e:87:49:96:41:94",
            "net27": "0a:61:26:93:ed:2d",
            "net28": "ba:2a:fa:cc:b5:52",
            "net29": "da:5a:b7:a8:fb:f1",
            "net3": "92:5f:32:c6:d1:c0",
            "net30": "0e:4b:da:ea:db:5b",
            "net31": "0a:4f:34:9e:c9:d2",
            "net4": "36:ec:1d:78:4f:a5",
            "net5": "12:71:88:f1:2f:60",
            "net6": "c2:87:91:87:c0:84",
            "net7": "f6:1f:75:6b:dc:af",
            "net8": "f6:37:75:68:9d:f2",
            "net9": "e2:04:e3:85:a8:89"
        },
        "spine_1_1_15": {
            "net0": "c6:56:a3:f8:1a:dd",
            "net1": "46:d9:0c:3c:02:5d",
            "net10": "66:ea:3c:7c:cf:b6",
            "net11": "aa:32:52:4e:42:cf",
            "net12": "fe:d6:3d:74:f5:d7",
            "net13": "5a:d1:a7:35:01:ae",
            "net14": "d2:d0:73:ad:a5:b8",
            "net15": "c6:22:bd:f5:e0:c1",
            "net16": "ae:c7:f6:60:26:78",
            "net17": "d6:ca:d7:81:8b:b6",
            "net18": "9e:8a:31:25:a2:97",
            "net19": "82:cd:5d:c0:83:6d",
            "net2": "d6:52:d2:5d:e9:ec",
            "net20": "f6:7f:05:95:ce:0d",
            "net21": "6a:27:22:f4:b3:db",
            "net22": "62:09:cb:88:29:bd",
            "net23": "3a:2c:4e:e3:0d:46",
            "net24": "de:a6:ae:93:c4:37",
            "net25": "ae:fd:3d:56:c9:58",
            "net26": "9a:43:fc:50:5c:e7",
            "net27": "7a:9b:56:58:b8:56",
            "net28": "ee:5a:4c:54:d8:a0",
            "net29": "32:d9:07:9f:3b:20",
            "net3": "06:fc:9c:cc:2f:a7",
            "net30": "66:ee:cc:9d:20:3d",
            "net31": "96:2f:bf:b5:be:4a",
            "net4": "2a:79:ec:b9:f8:e1",
            "net5": "96:c4:eb:5a:68:13",
            "net6": "12:a1:c1:08:dd:69",
            "net7": "3e:fb:ca:62:cf:0b",
            "net8": "06:5a:a3:fe:f1:82",
            "net9": "42:14:79:cc:ae:7d"
        },
        "spine_1_1_16": {
            "net0": "ea:d2:99:7c:b3:22",
            "net1": "f6:cc:ae:34:fb:d3",
            "net10": "fa:3a:18:38:77:59",
            "net11": "3e:11:d3:82:45:a8",
            "net12": "86:f7:ee:0e:6c:15",
            "net13": "0e:45:46:a1:9b:e2",
            "net14": "7e:fa:6e:32:d1:1a",
            "net15": "d6:1f:a1:a9:df:2f",
            "net16": "1e:cb:5c:68:33:ff",
            "net17": "5e:31:55:2a:01:50",
            "net18": "a2:91:72:f5:3d:08",
            "net19": "8e:61:06:a7:d0:33",
            "net2": "66:23:f7:89:86:0b",
            "net20": "ca:64:50:fa:f8:80",
            "net21": "ee:de:96:42:ad:bf",
            "net22": "b6:55:bc:c8:94:11",
            "net23": "5e:c1:da:54:50:1d",
            "net24": "6a:ee:52:8a:ab:e6",
            "net25": "86:27:3b:5b:1f:17",
            "net26": "02:94:0b:9c:0c:d0",
            "net27": "2a:a3:6d:31:34:d9",
            "net28": "2e:83:e1:e3:eb:67",
            "net29": "d2:a0:fe:4e:8d:0f",
            "net3": "aa:94:2d:da:69:cd",
            "net30": "ce:13:87:86:37:1d",
            "net31": "92:bd:31:14:5a:34",
            "net4": "d2:0f:d3:6a:a8:41",
            "net5": "a6:c0:aa:17:d4:34",
            "net6": "4e:39:ea:e4:48:41",
            "net7": "8a:dd:52:0f:1d:14",
            "net8": "52:4f:a8:8b:0f:2a",
            "net9": "ae:49:c7:da:55:92"
        },
        "spine_1_1_2": {
            "net0": "2a:49:6e:d4:75:76",
            "net1": "9a:f6:2d:13:bb:e0",
            "net10": "4e:5b:71:47:f1:d4",
            "net11": "1a:c4:1b:00:16:24",
            "net12": "ea:83:18:38:37:c3",
            "net13": "92:de:79:d7:f1:23",
            "net14": "62:bd:04:2a:33:fa",
            "net15": "12:b1:96:7e:db:b4",
            "net16": "7a:be:34:d6:00:33",
            "net17": "fe:43:a2:81:07:c6",
            "net18": "16:32:82:62:f5:09",
            "net19": "76:6f:9a:57:be:b0",
            "net2": "1a:d7:3a:63:2e:b9",
            "net20": "82:8a:ce:aa:38:4e",
            "net21": "2a:3f:d6:d0:cc:20",
            "net22": "42:fa:0e:19:44:de",
            "net23": "6a:a1:f3:8a:4f:23",
            "net24": "8a:86:80:11:bd:59",
            "net25": "fa:3d:af:4a:d6:dd",
            "net26": "d6:d7:85:56:6c:97",
            "net27": "f6:69:a7:ce:f0:4b",
            "net28": "7a:fd:b2:d5:da:95",
            "net29": "2e:92:b6:64:a2:c3",
            "net3": "32:ca:a7:84:3f:84",
            "net30": "3e:3f:2b:7d:09:c3",
            "net31": "86:85:6a:dd:ba:42",
            "net4": "a6:99:f8:97:5c:7c",
            "net5": "be:29:39:f0:8b:b8",
            "net6": "16:66:12:76:fe:a7",
            "net7": "4a:2f:49:2b:22:9c",
            "net8": "3e:5e:1f:63:54:d5",
            "net9": "b6:90:8f:e1:84:70"
        },
        "spine_1_1_3": {
            "net0": "fe:31:25:f1:c2:73",
            "net1": "6e:44:f1:1f:41:23",
            "net10": "b2:1b:94:c1:74:d7",
            "net11": "5a:03:7b:8d:bd:69",
            "net12": "8e:41:c5:57:7e:7b",
            "net13": "12:16:96:05:b5:69",
            "net14": "52:f2:03:35:e3:e2",
            "net15": "9a:79:05:68:6d:3e",
            "net16": "aa:fe:01:fd:b8:83",
            "net17": "0e:d4:eb:2f:7b:2d",
            "net18": "ae:e9:e7:bb:1e:39",
            "net19": "9a:ea:57:06:89:32",
            "net2": "62:31:5c:9c:99:27",
            "net20": "9e:78:4a:9c:2b:04",
            "net21": "3e:79:0a:98:a7:be",
            "net22": "6e:03:67:3d:ff:3d",
            "net23": "ea:32:b9:51:c1:e0",
            "net24": "96:c2:8d:65:f2:d1",
            "net25": "7a:65:eb:13:73:d9",
            "net26": "96:49:6e:da:82:e5",
            "net27": "6e:0e:46:a8:96:f1",
            "net28": "3a:fe:90:33:5c:0e",
            "net29": "5a:a0:84:ae:95:3c",
            "net3": "82:8c:0e:e1:3b:91",
            "net30": "82:7d:97:80:f5:ad",
            "net31": "76:13:e7:8a:41:9a",
            "net4": "8e:f1:7b:11:ca:18",
            "net5": "ae:ad:f5:44:40:db",
            "net6": "b6:28:7d:57:db:6a",
            "net7": "12:0a:7e:8a:cd:40",
            "net8": "16:84:c1:16:dc:90",
            "net9": "82:b6:4f:40:f8:d1"
        },
        "spine_1_1_4": {
            "net0": "72:48:00:89:23:be",
            "net1": "fe:1c:4b:06:b3:38",
            "net10": "26:14:85:7c:f0:f4",
            "net11": "42:4e:d4:eb:ff:f3",
            "net12": "a6:14:56:75:3e:63",
            "net13": "fa:1c:ab:dd:36:9a",
            "net14": "02:7f:35:33:59:18",
            "net15": "3e:0e:93:f7:a6:74",
            "net16": "7a:80:13:86:30:fb",
            "net17": "96:0e:bb:e3:85:78",
            "net18": "56:47:5b:73:ed:42",
            "net19": "ee:8f:76:e9:0f:e2",
            "net2": "0a:76:64:4f:62:c2",
            "net20": "76:1d:68:59:9b:fe",
            "net21": "c2:aa:c0:db:50:88",
            "net22": "de:68:09:b0:97:62",
            "net23": "4e:aa:c3:a7:59:6f",
            "net24": "1e:97:7b:0e:28:f1",
            "net25": "92:3f:27:10:7b:39",
            "net26": "ae:c5:6f:1e:0a:c2",
            "net27": "3e:fe:92:8e:91:aa",
            "net28": "0e:a1:7a:f5:c7:ad",
            "net29": "b6:2e:79:ac:04:42",
            "net3": "a6:e9:a6:b6:c9:0b",
            "net30": "02:f3:74:19:63:6e",
            "net31": "36:9b:31:64:ec:09",
            "net4": "be:0a:45:fd:3d:83",
            "net5": "42:aa:d0:a8:d9:34",
            "net6": "b6:1c:65:15:d7:52",
            "net7": "3a:bd:f1:82:f9:22",
            "net8": "8e:f3:88:d6:ce:26",
            "net9": "ca:f5:55:7f:aa:8a"
        },
        "spine_1_1_5": {
            "net0": "ce:3a:02:e5:0f:a4",
            "net1": "76:58:e7:92:86:43",
            "net10": "8e:68:c1:51:d2:23",
            "net11": "3a:2e:37:25:3c:f0",
            "net12": "c2:bd:5d:75:5d:c4",
            "net13": "e6:32:83:e4:d6:8f",
            "net14": "8e:05:9e:25:d4:1b",
            "net15": "a6:3e:08:5a:59:0a",
            "net16": "72:5c:66:c7:29:8e",
            "net17": "52:a5:42:82:aa:93",
            "net18": "86:99:45:b1:5b:d2",
            "net19": "52:d7:d1:93:cb:f0",
            "net2": "a6:70:a9:b1:de:9f",
            "net20": "e2:a6:ac:60:18:24",
            "net21": "6e:a5:a1:e6:64:28",
            "net22": "d6:68:a2:1e:e8:e3",
            "net23": "66:37:85:9e:0c:f6",
            "net24": "2e:90:b2:c6:5c:98",
            "net25": "7a:ed:0e:92:c1:59",
            "net26": "9e:a1:22:47:f3:e9",
            "net27": "7a:a0:42:d6:38:c9",
            "net28": "56:ed:cc:ea:8a:51",
            "net29": "ca:04:46:ae:e2:a6",
            "net3": "82:3e:90:1f:57:ad",
            "net30": "76:45:01:e1:59:c5",
            "net31": "d6:bc:b0:5a:e1:51",
            "net4": "e6:7d:64:57:17:62",
            "net5": "c6:9f:a6:36:2f:1c",
            "net6": "ae:f4:ed:b1:ba:06",
            "net7": "ce:f3:33:f3:75:27",
            "net8": "ee:43:76:a6:22:aa",
            "net9": "d2:8e:17:c1:08:53"
        },
        "spine_1_1_6": {
            "net0": "5a:0e:bd:ae:3e:e0",
            "net1": "3e:15:ce:5f:b2:43",
            "net10": "de:48:fa:ac:87:f7",
            "net11": "9e:9f:04:f4:1d:f3",
            "net12": "3e:fc:c0:de:23:9a",
            "net13": "72:a7:47:3f:c9:c1",
            "net14": "ba:41:f0:4f:e6:bb",
            "net15": "86:8b:0d:a3:5a:f3",
            "net16": "42:72:ac:a0:7c:71",
            "net17": "ca:4b:a8:28:17:8b",
            "net18": "02:57:50:b9:e5:5c",
            "net19": "16:52:d3:fa:2e:f8",
            "net2": "12:c5:d3:91:1f:21",
            "net20": "ee:c6:d5:fa:e2:29",
            "net21": "56:dd:4c:8f:ba:c3",
            "net22": "0e:b2:e3:3b:7b:82",
            "net23": "42:5c:6d:19:05:d3",
            "net24": "1a:7f:1d:88:86:7a",
            "net25": "e2:cf:d2:d5:61:a0",
            "net26": "da:34:a2:11:78:bd",
            "net27": "02:5c:c9:b2:0e:70",
            "net28": "06:97:11:31:8d:52",
            "net29": "d2:e5:8d:4d:59:36",
            "net3": "ca:72:af:a1:d6:d6",
            "net30": "ce:3a:99:9a:57:d0",
            "net31": "42:74:32:fb:13:66",
            "net4": "e2:53:10:b3:b6:fa",
            "net5": "5a:12:85:a5:95:6e",
            "net6": "56:90:62:e6:1e:b6",
            "net7": "26:99:86:dd:48:2d",
            "net8": "5a:bf:d3:ed:57:25",
            "net9": "d2:cc:e5:bc:a9:ab"
        },
        "spine_1_1_7": {
            "net0": "f6:82:1d:32:c2:08",
            "net1": "72:e0:4e:40:0b:a0",
            "net10": "f2:56:5c:e7:d3:e6",
            "net11": "4a:84:77:89:db:a8",
            "net12": "de:d7:e5:0c:b3:63",
            "net13": "36:d6:8f:41:0b:b1",
            "net14": "fa:7b:17:f9:a7:86",
            "net15": "6a:02:86:67:cb:06",
            "net16": "b6:95:b0:21:e5:d0",
            "net17": "96:22:c2:63:0b:87",
            "net18": "da:57:db:65:cd:5c",
            "net19": "66:03:a3:b5:63:25",
            "net2": "7e:ce:e9:64:41:bf",
            "net20": "5e:7c:af:82:b0:e8",
            "net21": "62:19:f5:a5:12:e8",
            "net22": "ae:a0:ca:7f:f5:b8",
            "net23": "7a:7e:73:a8:2f:14",
            "net24": "d6:51:83:1d:a3:97",
            "net25": "aa:b0:2f:07:3c:f3",
            "net26": "e6:a8:8e:af:38:01",
            "net27": "7a:24:43:9c:6e:e4",
            "net28": "5a:be:aa:40:2d:57",
            "net29": "12:6e:f8:f6:f1:97",
            "net3": "86:7c:7a:ac:19:bd",
            "net30": "7a:83:cb:34:9d:d2",
            "net31": "f2:94:8d:ef:82:b5",
            "net4": "b6:9b:0f:1f:f6:61",
            "net5": "ea:18:ee:3e:c6:59",
            "net6": "ae:a9:d8:2c:3f:f5",
            "net7": "ca:3c:d1:e5:8b:9d",
            "net8": "1e:19:29:4c:f3:96",
            "net9": "2a:26:db:62:ae:8f"
        },
        "spine_1_1_8": {
            "net0": "ee:af:47:d8:c0:14",
            "net1": "c2:c6:df:87:f6:b6",
            "net10": "76:87:a7:7e:e3:cd",
            "net11": "7a:cc:9a:77:f9:d7",
            "net12": "3a:91:5a:a1:f9:c7",
            "net13": "0a:03:82:f6:5f:93",
            "net14": "16:18:91:03:6e:0b",
            "net15": "3e:dd:3b:4e:4d:ff",
            "net16": "4a:e6:5b:bd:8b:85",
            "net17": "22:7e:d1:c6:ac:3f",
            "net18": "1e:9f:61:b9:e4:74",
            "net19": "8a:82:10:5f:11:78",
            "net2": "6a:0d:c2:33:70:b4",
            "net20": "ee:0e:bd:ac:eb:bd",
            "net21": "d6:6c:cc:b7:f8:40",
            "net22": "3a:d2:62:03:ae:f1",
            "net23": "92:a4:dc:c6:af:f4",
            "net24": "62:2b:07:a5:8e:af",
            "net25": "5e:39:31:03:26:37",
            "net26": "4a:77:3c:a4:59:46",
            "net27": "fe:6d:29:9d:23:d6",
            "net28": "9e:4a:d1:15:0e:a7",
            "net29": "a6:28:82:6c:78:f3",
            "net3": "a6:ba:b0:17:e8:a3",
            "net30": "fa:38:7a:5b:e7:69",
            "net31": "42:16:ed:3f:9c:1c",
            "net4": "b2:de:67:c0:16:47",
            "net5": "36:93:70:ce:a4:51",
            "net6": "ee:fa:00:33:6e:56",
            "net7": "32:d7:c0:89:77:c0",
            "net8": "d6:83:ab:a6:66:64",
            "net9": "42:a6:d8:55:09:b3"
        },
        "spine_1_1_9": {
            "net0": "a6:7f:b1:02:80:89",
            "net1": "d2:67:29:87:b7:8e",
            "net10": "5e:fe:d7:08:bc:66",
            "net11": "ea:2b:73:d7:9a:bf",
            "net12": "f6:d0:b7:e3:cf:75",
            "net13": "fe:08:6a:d5:be:bb",
            "net14": "da:5e:a3:a2:fc:d4",
            "net15": "ea:92:cb:1e:05:cd",
            "net16": "0a:b5:a1:c1:e6:26",
            "net17": "d2:5c:a6:40:ef:e0",
            "net18": "06:b1:c4:fe:33:ae",
            "net19": "52:1f:79:d5:26:05",
            "net2": "ce:0b:3e:1b:6f:30",
            "net20": "f6:aa:c0:e8:27:e3",
            "net21": "fe:1e:b6:2d:86:42",
            "net22": "76:7e:1c:31:0f:6e",
            "net23": "aa:d0:87:c2:64:73",
            "net24": "f6:d2:ad:6c:9e:74",
            "net25": "8e:07:f4:25:16:79",
            "net26": "56:d9:9b:c7:19:55",
            "net27": "02:19:f8:c1:b9:ea",
            "net28": "b6:56:d2:1a:1f:61",
            "net29": "ca:f8:b5:5c:c3:d2",
            "net3": "be:16:29:3f:9b:38",
            "net30": "76:2a:1a:d5:7b:18",
            "net31": "2a:df:57:13:3b:cb",
            "net4": "5a:98:d3:df:c8:b7",
            "net5": "8e:81:0c:72:95:02",
            "net6": "fa:c5:32:79:e6:a3",
            "net7": "e6:35:19:87:95:51",
            "net8": "a6:1d:04:75:6d:1a",
            "net9": "8a:c6:e8:48:25:41"
        },
        "spine_2_1_1": {
            "net0": "c2:d4:a8:33:f9:04",
            "net1": "3e:4f:56:82:80:11",
            "net10": "66:29:fb:13:d8:fa",
            "net11": "b2:80:15:d4:4a:0b",
            "net12": "76:40:59:41:55:48",
            "net13": "a6:4c:af:55:be:71",
            "net14": "fa:0b:b9:f4:46:bf",
            "net15": "be:d8:51:9b:34:e8",
            "net16": "8a:b2:6d:dd:27:28",
            "net17": "72:43:fd:2c:c2:94",
            "net18": "a6:53:9b:f7:ad:95",
            "net19": "e6:7e:d8:48:d2:ca",
            "net2": "4a:75:f2:6c:1f:b7",
            "net20": "02:dc:62:a4:0e:e8",
            "net21": "7a:89:4d:8a:dc:79",
            "net22": "ce:1c:94:33:02:3e",
            "net23": "2a:3a:5a:24:f2:f7",
            "net24": "46:3e:a0:6b:e4:d3",
            "net25": "62:25:a8:ca:8a:9d",
            "net26": "ba:8a:10:b9:05:e8",
            "net27": "02:ec:8a:36:d8:7e",
            "net28": "be:1a:35:f8:da:e9",
            "net29": "a2:3f:ca:4e:b7:a1",
            "net3": "16:20:dc:92:86:e7",
            "net30": "66:c1:99:0f:48:27",
            "net31": "1e:71:f2:9a:93:92",
            "net4": "1e:cd:5d:20:0e:6d",
            "net5": "82:7c:df:33:5d:4d",
            "net6": "aa:f6:02:8f:09:90",
            "net7": "9e:4a:1a:34:4f:7a",
            "net8": "7e:15:df:69:56:7a",
            "net9": "26:cc:38:76:a5:59"
        },
        "spine_2_1_10": {
            "net0": "6e:f5:0c:56:18:7f",
            "net1": "9a:d9:4a:35:8f:02",
            "net10": "e2:68:c7:20:b1:f7",
            "net11": "92:69:40:e6:86:04",
            "net12": "22:80:6e:f4:9f:3e",
            "net13": "8a:37:74:13:ee:1b",
            "net14": "76:85:ac:4d:b9:2b",
            "net15": "aa:d1:cb:5f:ba:04",
            "net16": "a6:20:bb:d1:d2:fc",
            "net17": "46:07:db:c8:13:b5",
            "net18": "5a:7f:a8:cf:39:b4",
            "net19": "92:d3:7f:9d:a7:06",
            "net2": "de:3a:a9:48:ab:dc",
            "net20": "42:91:88:15:79:db",
            "net21": "ee:f6:85:fc:32:0c",
            "net22": "8e:62:8c:65:48:2d",
            "net23": "d2:ff:36:84:ec:5f",
            "net24": "6e:b8:30:89:4f:5a",
            "net25": "9a:76:8e:1e:99:99",
            "net26": "8a:98:01:25:14:96",
            "net27": "ee:2c:89:c3:03:78",
            "net28": "f6:b4:f1:c8:dd:32",
            "net29": "06:0f:0a:09:be:49",
            "net3": "56:90:9e:ee:41:3c",
            "net30": "be:4b:0b:02:a3:b5",
            "net31": "5e:ad:f5:9b:d0:ea",
            "net4": "b2:6e:b0:37:04:8e",
            "net5": "d2:83:e5:d8:7f:df",
            "net6": "16:72:30:b5:73:cc",
            "net7": "56:a4:5a:04:f4:9e",
            "net8": "ba:c8:38:e7:df:ba",
            "net9": "c2:b7:f9:45:9b:88"
        },
        "spine_2_1_11": {
            "net0": "7a:68:c9:78:02:a2",
            "net1": "82:b9:fd:6f:3b:27",
            "net10": "7e:39:ec:3b:11:05",
            "net11": "76:ef:e1:1e:25:7d",
            "net12": "32:65:75:59:1a:44",
            "net13": "4e:ae:29:62:17:6e",
            "net14": "56:43:65:8e:08:5f",
            "net15": "72:4e:3f:b3:2e:55",
            "net16": "de:c4:ab:41:a8:ae",
            "net17": "e6:ed:8e:bb:c3:3f",
            "net18": "32:05:79:a1:fd:1d",
            "net19": "42:2f:c0:1b:f8:a2",
            "net2": "c6:b4:7f:22:fa:73",
            "net20": "0a:79:1e:7c:bd:3c",
            "net21": "96:3c:f3:7c:e1:27",
            "net22": "72:5d:2e:21:01:7c",
            "net23": "22:3d:bc:0b:7d:d3",
            "net24": "a6:d4:3e:a0:50:3a",
            "net25": "02:58:f5:51:a0:59",
            "net26": "92:7a:22:16:a7:c8",
            "net27": "5e:d4:a3:cc:04:29",
            "net28": "36:32:11:e7:6f:fc",
            "net29": "26:92:50:42:d3:19",
            "net3": "c6:86:c3:80:c2:3e",
            "net30": "c6:34:7f:f4:82:43",
            "net31": "7a:63:59:e2:e6:f6",
            "net4": "6e:21:2d:aa:4a:70",
            "net5": "56:9c:99:37:1a:a0",
            "net6": "5a:4b:02:d4:af:02",
            "net7": "3a:30:ba:7f:21:6d",
            "net8": "06:ca:5d:ce:d3:e6",
            "net9": "7e:f4:96:fe:8d:40"
        },
        "spine_2_1_12": {
            "net0": "fa:5d:75:f5:f5:99",
            "net1": "ea:4f:32:cb:0f:03",
            "net10": "8e:37:1b:48:48:cd",
            "net11": "4a:57:a8:29:03:42",
            "net12": "1e:67:fb:74:ed:ad",
            "net13": "f6:a0:c2:94:54:05",
            "net14": "c6:9c:2b:c6:2e:8b",
            "net15": "22:a2:b1:ed:b7:69",
            "net16": "26:ad:bb:e5:a1:5c",
            "net17": "62:23:54:ad:eb:e7",
            "net18": "0e:5e:9e:09:04:b1",
            "net19": "be:9a:2f:dc:bb:8d",
            "net2": "02:3a:14:99:30:6f",
            "net20": "a6:c4:99:11:97:7c",
            "net21": "ba:91:a3:c3:f7:df",
            "net22": "ce:d8:23:6d:82:02",
            "net23": "6e:17:da:fd:b1:c5",
            "net24": "56:b7:3d:bf:3c:5b",
            "net25": "ca:d0:7a:f2:38:40",
            "net26": "4a:81:06:82:7b:d3",
            "net27": "26:eb:3d:4b:b2:62",
            "net28": "1e:60:3e:c0:2c:92",
            "net29": "d6:9c:7d:3b:27:db",
            "net3": "f2:bc:92:49:6e:34",
            "net30": "2e:d3:4f:eb:e8:bb",
            "net31": "1e:02:ce:8e:c1:3c",
            "net4": "22:7c:6a:7e:27:2d",
            "net5": "82:31:bc:d1:51:2f",
            "net6": "0a:c0:60:8f:03:6e",
            "net7": "52:24:c6:62:83:07",
            "net8": "fe:13:22:04:51:4c",
            "net9": "22:e0:4e:46:04:6f"
        },
        "spine_2_1_13": {
            "net0": "26:bc:e1:ac:a1:34",
            "net1": "56:73:e6:e3:c6:b0",
            "net10": "c6:42:cc:4f:ca:30",
            "net11": "a2:71:86:2b:a5:b4",
            "net12": "06:11:0f:ac:bb:99",
            "net13": "ce:3d:a8:04:35:36",
            "net14": "6a:31:92:f1:0a:09",
            "net15": "aa:ff:aa:f1:be:eb",
            "net16": "e6:eb:ad:d6:19:02",
            "net17": "56:18:4a:31:97:1e",
            "net18": "46:43:11:3f:85:fe",
            "net19": "ea:99:44:37:12:56",
            "net2": "46:22:c4:23:ba:47",
            "net20": "32:34:39:51:06:7f",
            "net21": "c6:cd:cc:5f:39:5e",
            "net22": "e2:15:6c:a5:a7:d2",
            "net23": "72:34:47:de:94:4b",
            "net24": "9e:b7:0f:b5:a5:55",
            "net25": "f6:fd:b9:74:b1:53",
            "net26": "82:53:d7:5f:8b:b0",
            "net27": "86:51:aa:25:77:c0",
            "net28": "8e:37:71:22:cb:47",
            "net29": "e2:84:99:7d:50:86",
            "net3": "2a:03:bb:7c:8b:da",
            "net30": "ae:d3:61:06:17:26",
            "net31": "0e:ad:5b:9b:aa:b5",
            "net4": "a2:29:24:08:18:d1",
            "net5": "8e:f6:1b:da:59:2a",
            "net6": "ae:67:2a:f4:24:e6",
            "net7": "22:89:c4:2c:39:60",
            "net8": "46:19:62:04:83:64",
            "net9": "ce:bf:61:70:b8:7e"
        },
        "spine_2_1_14": {
            "net0": "02:d5:67:2c:16:6a",
            "net1": "ce:e9:03:70:3d:23",
            "net10": "22:1c:5f:86:2a:ee",
            "net11": "1a:66:96:5c:34:89",
            "net12": "96:11:d0:c5:0f:93",
            "net13": "9e:b9:c1:52:a1:67",
            "net14": "b2:01:94:63:a8:77",
            "net15": "2a:fc:bb:53:dc:a0",
            "net16": "d2:6c:b9:11:7c:e9",
            "net17": "ce:b4:35:63:07:f0",
            "net18": "aa:21:2b:6c:cf:67",
            "net19": "3a:12:8c:de:73:cf",
            "net2": "a2:22:ac:09:2e:9c",
            "net20": "92:fc:4b:b2:6e:59",
            "net21": "e2:18:6b:db:61:a7",
            "net22": "22:fc:d6:c4:76:7b",
            "net23": "3e:32:bc:d8:5c:a8",
            "net24": "a6:be:50:2d:72:6e",
            "net25": "d6:18:d0:c2:d8:09",
            "net26": "f2:77:cd:2b:b0:54",
            "net27": "a2:9d:2c:68:e8:63",
            "net28": "76:70:68:33:39:4b",
            "net29": "6a:3c:09:1c:45:b6",
            "net3": "de:7f:50:81:d7:f2",
            "net30": "9a:91:e0:40:67:89",
            "net31": "e2:95:f9:66:16:d3",
            "net4": "e2:2a:72:52:43:9e",
            "net5": "3e:6b:1f:fe:e6:51",
            "net6": "1e:eb:2f:05:24:7a",
            "net7": "ea:c6:e2:68:09:4a",
            "net8": "12:80:d1:b2:42:f8",
            "net9": "5a:bb:89:5a:3f:e8"
        },
        "spine_2_1_15": {
            "net0": "c2:df:a9:99:b0:13",
            "net1": "82:b0:d0:45:c4:70",
            "net10": "8e:7d:67:aa:a8:a2",
            "net11": "c2:17:bc:4f:75:40",
            "net12": "36:2e:fb:d3:5b:94",
            "net13": "f6:e2:11:df:15:21",
            "net14": "9e:c2:5c:8f:74:0d",
            "net15": "96:b3:d7:64:a0:5b",
            "net16": "1a:c1:b9:93:eb:c0",
            "net17": "d2:93:7b:f4:e4:ac",
            "net18": "f2:00:91:a7:9e:44",
            "net19": "92:1a:24:8d:54:f8",
            "net2": "4a:49:4b:be:36:82",
            "net20": "ae:74:3b:78:fd:94",
            "net21": "da:36:1f:b4:ae:d6",
            "net22": "fe:e7:b2:a0:f7:80",
            "net23": "2e:49:c4:7e:19:89",
            "net24": "8a:54:b1:48:34:5d",
            "net25": "3e:c7:54:c9:08:1a",
            "net26": "76:8a:5c:26:bb:07",
            "net27": "d2:8a:52:92:5e:e7",
            "net28": "f2:42:8f:07:77:a5",
            "net29": "3a:fa:d1:e2:64:6b",
            "net3": "66:5b:db:f3:44:d6",
            "net30": "de:13:3e:39:6a:b8",
            "net31": "8e:5a:95:7b:2f:9f",
            "net4": "8a:63:9b:b2:82:41",
            "net5": "22:d9:96:4e:c8:81",
            "net6": "7e:11:bc:19:9b:6d",
            "net7": "fa:ec:a9:77:29:26",
            "net8": "46:5f:44:4b:47:ff",
            "net9": "32:6e:77:a4:e5:2d"
        },
        "spine_2_1_16": {
            "net0": "ae:2f:6a:d3:95:b0",
            "net1": "e2:a1:ef:1e:4b:ac",
            "net10": "16:e4:da:80:ca:96",
            "net11": "7a:94:54:3a:d0:26",
            "net12": "46:9c:7d:ad:71:1b",
            "net13": "fe:c5:d5:8c:fa:bc",
            "net14": "d6:a6:03:db:95:77",
            "net15": "9e:79:77:76:9a:fc",
            "net16": "26:16:f8:38:59:61",
            "net17": "ca:e7:43:fd:bd:25",
            "net18": "56:ca:a6:02:98:be",
            "net19": "12:17:70:54:9c:c6",
            "net2": "ea:85:9a:2a:d6:a4",
            "net20": "6e:8e:6d:63:19:9c",
            "net21": "b6:8e:dd:a1:5c:97",
            "net22": "7a:61:62:74:2e:f7",
            "net23": "9e:95:56:2f:9d:70",
            "net24": "16:4f:aa:a8:19:5f",
            "net25": "f6:60:45:57:de:ff",
            "net26": "16:3c:7c:a8:b4:79",
            "net27": "ea:67:d0:bd:68:b3",
            "net28": "86:be:20:0f:03:ad",
            "net29": "d2:dc:b0:e5:f0:6c",
            "net3": "2a:1b:a3:4b:ac:22",
            "net30": "4a:c4:da:29:2e:79",
            "net31": "2a:4e:da:63:b2:26",
            "net4": "6a:58:0f:7d:dd:b8",
            "net5": "ea:a9:0d:6a:0e:70",
            "net6": "8e:17:66:07:4e:2d",
            "net7": "d2:cb:af:a7:51:e6",
            "net8": "4a:90:0a:63:86:e7",
            "net9": "c2:e7:2a:1e:04:62"
        },
        "spine_2_1_2": {
            "net0": "b2:b3:0f:b8:ad:c4",
            "net1": "42:60:38:09:14:2f",
            "net10": "2a:98:d6:d3:6e:b0",
            "net11": "ce:a6:57:83:ef:ca",
            "net12": "9e:19:4f:33:2f:bd",
            "net13": "5e:b3:43:2c:ea:2f",
            "net14": "ce:a4:86:6b:7f:05",
            "net15": "7a:af:6b:8d:e5:bc",
            "net16": "92:38:e5:29:38:0b",
            "net17": "aa:0e:bc:02:30:3c",
            "net18": "9e:ed:ed:e4:71:af",
            "net19": "6a:90:19:16:cf:9d",
            "net2": "42:86:5a:6d:cb:9a",
            "net20": "66:89:96:b2:de:31",
            "net21": "32:cf:f1:65:68:c1",
            "net22": "be:82:08:6b:d1:d2",
            "net23": "ae:9d:44:f3:39:52",
            "net24": "be:06:fb:a6:94:43",
            "net25": "5e:54:f0:10:f8:bf",
            "net26": "be:aa:04:ce:c3:5c",
            "net27": "76:19:cd:94:89:2f",
            "net28": "b6:b9:d7:ae:07:27",
            "net29": "8e:d4:06:02:a2:bf",
            "net3": "2e:9c:a4:9d:b3:53",
            "net30": "be:c3:58:d0:24:74",
            "net31": "5a:bc:4d:c4:ba:96",
            "net4": "06:22:f5:0f:bf:e8",
            "net5": "86:04:8f:78:c6:2c",
            "net6": "1a:90:77:8a:4f:c6",
            "net7": "da:a5:50:8c:4c:5a",
            "net8": "8e:da:58:51:c3:d0",
            "net9": "2e:d3:72:53:52:30"
        },
        "spine_2_1_3": {
            "net0": "46:e3:6f:9b:01:7b",
            "net1": "be:6f:cf:2f:50:bb",
            "net10": "f6:cc:9b:55:cb:61",
            "net11": "c6:75:5b:bd:fd:97",
            "net12": "0e:62:4b:36:36:23",
            "net13": "ba:01:8a:2b:0a:b6",
            "net14": "d6:e7:83:cf:47:b8",
            "net15": "5e:58:09:20:6f:15",
            "net16": "4e:0a:54:ae:90:99",
            "net17": "06:37:31:24:37:15",
            "net18": "ba:39:bb:47:98:fc",
            "net19": "d6:d9:6b:7b:c0:3a",
            "net2": "2e:50:e1:01:41:47",
            "net20": "92:e1:c7:1c:64:f3",
            "net21": "d2:3f:7b:af:2f:95",
            "net22": "72:4c:06:7c:81:3a",
            "net23": "76:bb:05:ea:14:ef",
            "net24": "be:d2:ac:a4:78:bc",
            "net25": "2a:71:f9:8c:d5:1e",
            "net26": "ca:a9:7e:91:38:0b",
            "net27": "e2:25:1b:3c:e7:1a",
            "net28": "86:45:95:a3:bd:0a",
            "net29": "6a:8b:22:f9:bf:e6",
            "net3": "22:12:bf:45:e5:21",
            "net30": "76:31:96:38:47:e8",
            "net31": "ce:ed:14:25:2b:1f",
            "net4": "b6:22:2b:e2:84:b7",
            "net5": "22:b0:e6:e8:5d:65",
            "net6": "2a:5b:b2:d8:c6:03",
            "net7": "72:f7:64:a3:d4:81",
            "net8": "16:67:e8:c5:5b:4b",
            "net9": "da:3f:72:4c:9f:5d"
        },
        "spine_2_1_4": {
            "net0": "42:31:66:6b:94:51",
            "net1": "d6:0c:9c:09:77:fa",
            "net10": "e6:b6:eb:13:df:28",
            "net11": "b2:6b:bc:a1:73:a8",
            "net12": "7a:30:30:db:82:06",
            "net13": "b2:58:f7:a5:5f:f5",
            "net14": "c6:4e:ad:7e:d2:37",
            "net15": "1a:3f:99:00:eb:ad",
            "net16": "ca:97:54:6b:a9:0f",
            "net17": "06:a0:c4:9d:21:ec",
            "net18": "1e:70:4c:c3:2d:4f",
            "net19": "32:52:ad:d0:d1:26",
            "net2": "02:92:ed:12:3e:f2",
            "net20": "fa:a8:f2:e1:4f:20",
            "net21": "aa:92:2c:e0:54:f7",
            "net22": "92:e3:b2:27:b7:89",
            "net23": "4a:39:3a:e8:11:3f",
            "net24": "da:5c:aa:dd:e4:b9",
            "net25": "de:b4:a7:a2:c1:98",
            "net26": "8e:db:e3:a3:c3:83",
            "net27": "6e:98:46:a3:8e:59",
            "net28": "56:be:40:1f:55:f1",
            "net29": "72:bd:8c:03:a8:45",
            "net3": "5a:3a:e8:58:ab:a0",
            "net30": "32:6f:6d:70:42:e6",
            "net31": "1e:cd:0f:a4:90:7d",
            "net4": "32:2a:cb:88:54:d0",
            "net5": "f6:d9:bb:0f:b7:b9",
            "net6": "b6:bf:b9:6c:97:8f",
            "net7": "c2:78:d6:8c:04:00",
            "net8": "46:c9:30:f1:74:01",
            "net9": "66:5c:7a:19:3d:4d"
        },
        "spine_2_1_5": {
            "net0": "ae:bd:3f:d1:ad:21",
            "net1": "56:54:bd:bd:8d:26",
            "net10": "da:6d:15:c0:60:ab",
            "net11": "82:0f:8b:ff:b2:0a",
            "net12": "26:68:f0:b8:26:9c",
            "net13": "52:78:d0:17:f0:b7",
            "net14": "32:97:4a:e3:42:7b",
            "net15": "ca:6c:5a:de:cc:c8",
            "net16": "fa:85:a8:35:73:48",
            "net17": "da:5f:e8:12:4e:db",
            "net18": "0e:e9:4b:54:5b:3f",
            "net19": "e2:fe:c3:af:dc:38",
            "net2": "a6:57:08:02:0d:88",
            "net20": "3e:03:c4:58:70:6d",
            "net21": "e6:dc:73:8c:94:d9",
            "net22": "42:24:90:04:7d:12",
            "net23": "76:cf:e9:27:ef:40",
            "net24": "7a:0b:92:dd:a9:9b",
            "net25": "32:0b:c5:ad:6d:ba",
            "net26": "f2:24:64:a7:d2:05",
            "net27": "26:26:2c:8a:00:13",
            "net28": "2e:ee:d5:0f:68:db",
            "net29": "52:8a:e3:8e:72:02",
            "net3": "b2:f2:c4:61:ca:7f",
            "net30": "16:99:ac:1c:6c:ea",
            "net31": "e2:30:b0:58:ea:31",
            "net4": "86:cc:78:96:11:bb",
            "net5": "a6:a4:ff:df:1f:14",
            "net6": "6e:5b:e4:2e:98:79",
            "net7": "6e:06:a7:59:75:4e",
            "net8": "2a:53:61:4a:7a:ef",
            "net9": "32:c8:66:e9:9e:c4"
        },
        "spine_2_1_6": {
            "net0": "26:eb:b6:70:01:03",
            "net1": "4a:67:3a:ad:5e:07",
            "net10": "c6:af:b5:87:12:d5",
            "net11": "da:79:31:89:87:ab",
            "net12": "7e:06:e0:b2:22:98",
            "net13": "16:34:a9:31:9c:60",
            "net14": "de:a7:62:3f:32:c5",
            "net15": "52:0b:e3:79:81:e1",
            "net16": "4a:67:bb:ba:90:a6",
            "net17": "06:1c:92:b7:b5:96",
            "net18": "86:b8:03:07:9a:90",
            "net19": "32:5d:b0:93:79:1b",
            "net2": "62:fe:99:eb:6c:31",
            "net20": "0e:4a:3e:27:cf:41",
            "net21": "0a:b3:20:25:e0:54",
            "net22": "c6:77:17:5c:cd:85",
            "net23": "62:05:58:4e:5a:27",
            "net24": "56:a3:a0:5a:f4:79",
            "net25": "8e:6b:e7:a7:45:e1",
            "net26": "aa:c8:3f:31:a9:ef",
            "net27": "3a:ea:a3:01:05:1c",
            "net28": "c6:d5:a2:8d:92:e4",
            "net29": "c6:7a:fb:2f:92:a9",
            "net3": "8e:40:84:1f:26:6f",
            "net30": "ca:d8:66:94:d3:22",
            "net31": "02:83:24:df:ac:48",
            "net4": "f2:cb:28:41:27:16",
            "net5": "76:8e:da:57:71:ae",
            "net6": "a2:10:83:21:59:8d",
            "net7": "fa:15:9d:69:37:4c",
            "net8": "e6:74:d7:8d:96:98",
            "net9": "1a:04:90:c5:18:fd"
        },
        "spine_2_1_7": {
            "net0": "5a:dc:16:7e:36:9b",
            "net1": "56:7e:a8:21:9d:89",
            "net10": "c6:a8:65:8f:1e:76",
            "net11": "da:54:fd:22:a9:82",
            "net12": "9e:04:4a:f9:6c:e4",
            "net13": "7a:40:61:bb:19:65",
            "net14": "be:db:fd:23:7f:da",
            "net15": "de:68:24:ed:e8:cc",
            "net16": "5a:e8:a9:d9:54:ff",
            "net17": "ae:1d:6d:45:94:6b",
            "net18": "0e:ad:09:87:92:e2",
            "net19": "ba:70:b2:80:a5:0e",
            "net2": "3e:e6:71:03:41:28",
            "net20": "9e:b9:cb:c0:ff:1d",
            "net21": "52:8a:28:cc:fb:13",
            "net22": "de:08:df:60:c9:69",
            "net23": "8a:f8:a7:d7:fe:f3",
            "net24": "56:3f:95:c7:38:65",
            "net25": "8e:80:ca:de:b1:57",
            "net26": "52:43:79:1b:36:4c",
            "net27": "ba:03:ea:e4:b9:f2",
            "net28": "66:ad:df:36:d4:75",
            "net29": "96:cb:79:05:d5:1e",
            "net3": "22:4b:3f:79:81:fb",
            "net30": "f6:b0:ca:77:88:b7",
            "net31": "da:e9:29:63:25:f5",
            "net4": "a6:e4:ee:39:e1:fc",
            "net5": "36:88:85:cb:c0:75",
            "net6": "02:c5:02:a9:b3:a1",
            "net7": "4a:9a:2c:a8:09:df",
            "net8": "7e:78:ed:36:68:69",
            "net9": "62:ae:18:bf:71:8b"
        },
        "spine_2_1_8": {
            "net0": "82:3d:b4:c9:fa:8d",
            "net1": "42:ee:0a:01:6c:a1",
            "net10": "ae:a6:6f:7a:94:fb",
            "net11": "ca:6b:f7:d3:28:3e",
            "net12": "8a:44:c7:45:91:f3",
            "net13": "1e:4f:12:50:e7:c1",
            "net14": "ca:a9:3d:12:22:d9",
            "net15": "6e:d3:37:7e:31:6a",
            "net16": "ee:bf:26:09:33:7b",
            "net17": "c6:36:6b:6a:bc:1a",
            "net18": "56:36:b3:fc:bf:48",
            "net19": "da:17:92:32:9d:fd",
            "net2": "92:e6:fb:51:53:95",
            "net20": "2e:cc:19:86:c2:be",
            "net21": "d6:28:3c:ae:eb:c3",
            "net22": "62:b7:da:06:0e:04",
            "net23": "f2:f4:6a:14:a7:21",
            "net24": "5e:0b:49:36:7f:d2",
            "net25": "de:5c:d0:1e:31:36",
            "net26": "5e:51:67:f5:4a:cb",
            "net27": "f2:01:d8:ce:b5:31",
            "net28": "e2:77:aa:20:6b:ed",
            "net29": "ea:5f:94:01:6a:e7",
            "net3": "a2:94:33:c4:69:ca",
            "net30": "82:2d:59:de:a1:25",
            "net31": "82:be:1c:1d:88:81",
            "net4": "1e:21:05:51:d3:a1",
            "net5": "3e:66:f6:ea:e3:cb",
            "net6": "1a:67:1b:92:75:dc",
            "net7": "be:5a:bb:8b:3c:e4",
            "net8": "2e:ff:5e:3f:4a:38",
            "net9": "de:b4:44:db:82:0a"
        },
        "spine_2_1_9": {
            "net0": "0e:34:dd:f1:5f:c7",
            "net1": "16:a9:39:9b:a8:f7",
            "net10": "f2:b4:a0:b3:cb:57",
            "net11": "ea:7f:bc:36:c0:03",
            "net12": "c2:ad:4e:93:fc:a3",
            "net13": "ea:58:5c:63:5e:58",
            "net14": "a2:a6:35:3f:e2:e3",
            "net15": "36:2f:35:d1:9d:cc",
            "net16": "fa:19:5a:66:e7:6e",
            "net17": "7a:9d:53:bc:b0:4b",
            "net18": "9a:88:a7:25:e5:4f",
            "net19": "aa:95:7f:bb:69:70",
            "net2": "1a:03:67:74:9c:b7",
            "net20": "8e:d6:df:13:75:4f",
            "net21": "66:f4:3d:89:e3:c5",
            "net22": "ca:53:a2:29:e6:8d",
            "net23": "1e:3b:21:1d:d9:74",
            "net24": "be:30:45:31:34:6b",
            "net25": "4a:c9:37:d7:96:24",
            "net26": "ca:3f:bb:5f:c0:26",
            "net27": "22:08:47:ce:bc:da",
            "net28": "0e:ed:bf:1d:43:bc",
            "net29": "86:a0:e5:16:7c:3f",
            "net3": "be:c1:2d:13:47:14",
            "net30": "86:13:cd:e1:3b:ba",
            "net31": "3e:a5:26:b8:24:6b",
            "net4": "4a:1f:98:fa:4a:69",
            "net5": "2e:4f:28:3f:96:b9",
            "net6": "1a:c2:eb:31:80:68",
            "net7": "06:b8:ed:84:30:0d",
            "net8": "0a:7a:14:a5:81:fe",
            "net9": "9e:bf:32:11:ab:08"
        },
        "tof_1_2_1": {
            "net0": "4a:61:ee:2a:69:0c",
            "net1": "82:07:be:c4:8f:09",
            "net10": "1e:4c:84:02:d8:f0",
            "net11": "b2:4e:d6:7b:1a:a2",
            "net12": "9e:f4:29:89:5f:ca",
            "net13": "2e:52:3a:eb:42:7a",
            "net14": "0a:5e:98:d4:93:4c",
            "net15": "62:b0:23:3c:57:56",
            "net16": "5a:91:f8:ef:20:78",
            "net17": "b6:f0:6e:69:b7:6d",
            "net18": "52:19:51:80:6e:99",
            "net19": "c6:fd:78:41:5f:4c",
            "net2": "c2:15:3e:a7:c8:77",
            "net20": "c2:59:a8:46:d4:6e",
            "net21": "d6:02:4a:47:5f:8d",
            "net22": "66:47:26:3f:33:78",
            "net23": "f6:38:03:a8:cc:d9",
            "net24": "fa:0d:76:0a:f4:e5",
            "net25": "16:c8:d6:ac:b3:62",
            "net26": "6e:ad:7b:8e:f6:4d",
            "net27": "9a:7f:b7:fb:82:b2",
            "net28": "56:e6:2b:74:92:4d",
            "net29": "56:44:6c:b0:df:2e",
            "net3": "9e:6b:1a:18:16:b7",
            "net30": "c2:b2:f6:9d:3d:24",
            "net31": "6e:9a:ae:53:e3:55",
            "net4": "7e:a3:36:3a:d3:4b",
            "net5": "42:ee:1e:90:d7:5d",
            "net6": "1a:92:cc:73:5d:c3",
            "net7": "86:42:4d:1b:22:4d",
            "net8": "6e:5c:63:c0:ca:a6",
            "net9": "12:3c:ac:50:81:c4"
        },
        "tof_1_2_10": {
            "net0": "8a:ee:cb:48:c4:15",
            "net1": "96:fe:29:8e:11:71",
            "net10": "aa:d4:4f:d3:42:2f",
            "net11": "2a:9a:b4:68:90:ca",
            "net12": "f2:a8:3a:0c:94:c3",
            "net13": "9a:60:7e:26:0b:94",
            "net14": "86:e7:7b:8f:50:23",
            "net15": "8a:3d:c1:86:81:ee",
            "net16": "b6:34:41:6c:bf:9c",
            "net17": "e6:8f:4b:56:99:ae",
            "net18": "46:92:88:5e:94:f8",
            "net19": "82:af:17:3c:d8:5d",
            "net2": "f2:8e:ce:7e:01:7e",
            "net20": "ce:41:9a:99:1d:05",
            "net21": "de:2c:4d:a2:e1:0d",
            "net22": "4e:82:c0:85:82:94",
            "net23": "3e:31:af:fb:7e:b9",
            "net24": "fe:a0:bb:0f:1f:85",
            "net25": "46:b5:de:c8:ec:65",
            "net26": "56:f6:dd:2a:13:81",
            "net27": "12:81:19:8e:f4:8d",
            "net28": "a2:5a:f4:d8:93:02",
            "net29": "a2:c7:25:51:e0:12",
            "net3": "36:c6:3e:4e:f6:e0",
            "net30": "32:4c:1f:d3:b7:94",
            "net31": "c2:ab:ee:a3:96:56",
            "net4": "9e:48:77:41:36:b8",
            "net5": "de:70:55:e0:21:af",
            "net6": "72:e9:47:9f:8a:f4",
            "net7": "ae:28:78:cd:2c:fa",
            "net8": "2a:fb:46:e6:46:fb",
            "net9": "4a:2a:7a:1b:89:d1"
        },
        "tof_1_2_11": {
            "net0": "3e:cd:c6:82:1a:7e",
            "net1": "b2:bf:1d:b0:e3:c8",
            "net10": "26:42:2a:4a:a7:fa",
            "net11": "ea:41:69:e1:b4:02",
            "net12": "16:a2:15:1c:d6:3f",
            "net13": "de:fc:27:7d:c8:44",
            "net14": "6e:ec:97:48:88:74",
            "net15": "8a:a2:4d:d0:c4:e0",
            "net16": "8a:c8:4c:79:e8:4b",
            "net17": "c6:4d:31:eb:22:ce",
            "net18": "46:46:5f:d6:ee:03",
            "net19": "0e:b2:97:ac:75:c4",
            "net2": "e6:26:95:22:13:91",
            "net20": "32:ce:6a:7b:2a:29",
            "net21": "92:9f:91:9f:36:f3",
            "net22": "ea:8d:bc:8b:d0:86",
            "net23": "aa:8c:26:06:65:e4",
            "net24": "de:b3:20:84:2e:a1",
            "net25": "f6:9a:2f:6f:c6:b2",
            "net26": "8a:6a:d6:ba:fe:85",
            "net27": "7e:b5:2d:4f:cc:2e",
            "net28": "72:ae:48:11:b7:ec",
            "net29": "4a:12:60:fd:63:35",
            "net3": "b6:60:d5:d0:ba:63",
            "net30": "76:8b:8a:1f:79:b4",
            "net31": "2a:89:58:9f:27:38",
            "net4": "ba:99:71:cc:75:a9",
            "net5": "e6:74:c6:31:fa:92",
            "net6": "02:9a:12:f2:c0:86",
            "net7": "e2:23:62:6b:d2:e8",
            "net8": "26:2e:5d:93:ae:2e",
            "net9": "d6:45:a2:12:ee:62"
        },
        "tof_1_2_12": {
            "net0": "a2:38:f1:1f:91:e7",
            "net1": "62:ae:81:b7:5b:90",
            "net10": "4a:41:ca:fe:18:fc",
            "net11": "4a:8f:2d:dd:37:cb",
            "net12": "f6:15:c2:fd:87:24",
            "net13": "ca:6b:db:cc:6b:80",
            "net14": "ea:b7:5e:8d:cd:85",
            "net15": "1a:12:2d:da:47:c1",
            "net16": "a2:b1:90:ed:dc:47",
            "net17": "ca:1d:bc:72:5e:13",
            "net18": "de:35:ce:17:34:c1",
            "net19": "6a:48:76:3c:7e:c8",
            "net2": "f2:c8:e5:87:bd:bc",
            "net20": "06:d9:48:cd:c7:55",
            "net21": "2e:04:48:90:17:25",
            "net22": "1e:97:27:07:63:98",
            "net23": "32:39:8d:db:02:d9",
            "net24": "46:17:d3:70:8a:b8",
            "net25": "9e:8f:28:3c:1d:f0",
            "net26": "1e:66:f4:75:74:cc",
            "net27": "32:f5:e5:ab:6f:1c",
            "net28": "a6:74:b8:dd:a8:b3",
            "net29": "c6:26:94:d4:d3:a9",
            "net3": "f2:17:71:52:38:3f",
            "net30": "56:c7:db:e1:e1:20",
            "net31": "b6:dd:c2:8a:26:17",
            "net4": "ee:7b:85:cd:d8:f8",
            "net5": "8e:d1:b2:23:73:e3",
            "net6": "2e:06:77:f6:ed:9a",
            "net7": "96:6c:2f:e5:5e:81",
            "net8": "9e:3a:09:b0:ae:3e",
            "net9": "5e:31:d7:9d:f1:b6"
        },
        "tof_1_2_13": {
            "net0": "ae:c5:44:d3:14:e6",
            "net1": "0e:4a:97:74:31:9f",
            "net10": "92:f7:3f:9d:83:29",
            "net11": "62:cb:23:5f:1c:d3",
            "net12": "ca:8f:ad:94:27:01",
            "net13": "e6:79:6f:16:1b:e9",
            "net14": "ce:2a:27:58:01:5e",
            "net15": "66:df:7b:4e:4d:a4",
            "net16": "f2:41:cd:44:bc:93",
            "net17": "be:71:20:a2:d5:8e",
            "net18": "8e:3c:22:58:7c:b5",
            "net19": "8a:14:ea:74:d6:f6",
            "net2": "f2:6c:2f:07:ff:c1",
            "net20": "1a:fa:15:9a:58:fe",
            "net21": "f2:51:01:84:b8:0e",
            "net22": "f6:71:ae:ab:21:53",
            "net23": "fe:2c:3e:a7:4a:d2",
            "net24": "66:25:66:c0:db:34",
            "net25": "ae:1d:bf:4c:29:63",
            "net26": "32:c8:77:8f:e5:25",
            "net27": "12:f1:45:66:9b:af",
            "net28": "4e:ee:e6:f2:ab:32",
            "net29": "8e:b7:95:10:b2:c3",
            "net3": "06:c3:16:3c:0e:f1",
            "net30": "62:5e:2e:6b:c6:61",
            "net31": "9a:0b:de:0c:c0:4e",
            "net4": "26:5a:c3:21:38:7c",
            "net5": "ba:51:d1:14:ea:7b",
            "net6": "ca:cc:0c:f0:47:af",
            "net7": "2e:90:05:c2:04:17",
            "net8": "72:f0:6b:9d:ab:25",
            "net9": "1a:d5:6e:3e:91:22"
        },
        "tof_1_2_14": {
            "net0": "de:f5:53:6c:fb:74",
            "net1": "2a:26:e1:c8:48:b5",
            "net10": "c2:80:65:43:b9:32",
            "net11": "6a:8a:a0:16:8e:a2",
            "net12": "92:c8:cd:06:e7:fc",
            "net13": "aa:6c:2b:ad:ef:26",
            "net14": "be:ac:61:67:4a:33",
            "net15": "6a:75:8b:4e:6a:b4",
            "net16": "f2:ed:14:0c:e4:b9",
            "net17": "22:e0:49:39:88:77",
            "net18": "da:2b:f3:c2:24:c5",
            "net19": "26:1b:10:77:cf:73",
            "net2": "52:2d:61:a8:21:e2",
            "net20": "6e:ba:a2:b8:0e:67",
            "net21": "ca:a8:0b:a1:a0:6f",
            "net22": "0e:d3:80:06:ef:f2",
            "net23": "aa:42:64:80:93:ff",
            "net24": "96:fd:30:27:aa:0f",
            "net25": "46:a3:61:ab:df:88",
            "net26": "4a:14:f5:0b:23:51",
            "net27": "06:47:39:ed:34:f0",
            "net28": "d2:48:44:a0:63:99",
            "net29": "2a:fa:45:8a:a9:3b",
            "net3": "52:30:90:cc:30:79",
            "net30": "fa:ec:cf:68:40:bd",
            "net31": "0e:c9:b5:ae:75:50",
            "net4": "72:50:e6:b3:d5:47",
            "net5": "62:01:6c:b6:a1:c7",
            "net6": "12:80:48:36:73:19",
            "net7": "1e:90:6b:36:a4:9a",
            "net8": "92:b5:32:40:7b:a2",
            "net9": "9a:a4:15:5e:2d:66"
        },
        "tof_1_2_15": {
            "net0": "b6:18:dd:73:71:04",
            "net1": "a6:58:f3:59:64:8e",
            "net10": "0a:43:69:34:aa:b9",
            "net11": "0e:94:74:3c:c5:99",
            "net12": "32:e2:14:5b:37:fd",
            "net13": "3e:86:d9:2d:75:f7",
            "net14": "86:b7:a5:20:18:0e",
            "net15": "6a:f9:c8:43:ad:4c",
            "net16": "9e:d3:b9:64:a1:c0",
            "net17": "96:63:ec:df:44:cf",
            "net18": "5e:38:0e:0e:71:25",
            "net19": "9a:65:a0:80:89:d8",
            "net2": "b2:eb:86:bc:6d:08",
            "net20": "52:d6:de:35:59:7b",
            "net21": "72:fa:4d:a1:48:46",
            "net22": "b6:1c:60:6b:7b:ab",
            "net23": "06:0a:7c:62:19:6b",
            "net24": "4a:65:e0:27:a5:d8",
            "net25": "4a:26:e8:2f:d7:26",
            "net26": "f6:9b:e4:25:fc:04",
            "net27": "a2:de:4f:9a:1b:00",
            "net28": "ee:82:83:eb:0a:d1",
            "net29": "0a:c0:47:aa:bd:fe",
            "net3": "26:0c:ca:e0:76:5a",
            "net30": "d6:c6:c5:05:50:31",
            "net31": "4a:5f:80:4a:15:6f",
            "net4": "22:2a:f0:40:f3:10",
            "net5": "b2:ca:e4:e3:73:20",
            "net6": "42:09:ec:8e:62:61",
            "net7": "d6:95:ea:25:79:5f",
            "net8": "ca:6a:fe:46:e3:63",
            "net9": "22:49:53:af:2e:e7"
        },
        "tof_1_2_16": {
            "net0": "82:87:12:0f:f3:20",
            "net1": "82:0f:8e:d4:27:50",
            "net10": "86:73:60:33:e4:cd",
            "net11": "46:32:e1:88:c3:98",
            "net12": "ae:95:ed:ee:8a:6e",
            "net13": "ee:d9:70:e7:ae:37",
            "net14": "86:8c:ca:c7:00:70",
            "net15": "86:8d:be:22:49:7c",
            "net16": "66:e2:df:03:e5:8c",
            "net17": "1a:a7:d9:88:93:c3",
            "net18": "f2:4b:bc:12:55:04",
            "net19": "1e:f8:9b:0b:6d:fe",
            "net2": "56:44:00:3a:92:c9",
            "net20": "0e:85:02:d3:f0:14",
            "net21": "da:8d:72:a8:5c:8c",
            "net22": "52:3f:76:04:83:40",
            "net23": "da:23:f8:d3:b5:f7",
            "net24": "52:19:37:57:53:ef",
            "net25": "12:e2:fa:63:65:16",
            "net26": "0e:b1:66:19:40:fb",
            "net27": "ba:98:5d:38:20:0e",
            "net28": "be:a3:0e:17:9f:60",
            "net29": "8e:df:37:4e:bc:3e",
            "net3": "8e:36:d8:8c:14:08",
            "net30": "72:1e:55:47:6a:1c",
            "net31": "8e:c2:3d:48:c5:8c",
            "net4": "56:28:71:36:88:5f",
            "net5": "9e:1b:69:fe:b8:53",
            "net6": "9e:5e:d3:33:5a:b3",
            "net7": "5a:c5:9c:7e:ea:2a",
            "net8": "f6:88:d5:d5:11:14",
            "net9": "72:46:2c:7b:0b:c2"
        },
        "tof_1_2_2": {
            "net0": "62:12:c7:fa:49:0d",
            "net1": "5e:74:84:83:47:de",
            "net10": "c6:07:47:77:12:8a",
            "net11": "62:e5:db:a6:2a:d9",
            "net12": "86:09:78:d2:3e:10",
            "net13": "5e:f4:96:ff:1b:80",
            "net14": "1e:52:51:1f:39:a9",
            "net15": "1e:cb:99:12:cb:93",
            "net16": "d2:15:36:cf:41:89",
            "net17": "06:67:1d:0c:a6:24",
            "net18": "c2:06:1f:15:07:ea",
            "net19": "ca:2a:b0:fc:1b:84",
            "net2": "82:5b:e5:1f:62:d3",
            "net20": "f6:9e:7d:4b:d9:81",
            "net21": "2e:4a:19:75:90:fc",
            "net22": "e6:7b:2c:c6:7b:cf",
            "net23": "c2:1b:39:20:28:e7",
            "net24": "f6:3a:39:62:f3:fd",
            "net25": "62:5d:63:c6:48:46",
            "net26": "92:42:8a:21:ac:d2",
            "net27": "fa:4d:dc:f9:db:5a",
            "net28": "b2:5e:96:a8:6e:6d",
            "net29": "6e:7b:cb:d4:0c:7f",
            "net3": "a6:50:be:10:68:6f",
            "net30": "72:26:97:b7:68:e5",
            "net31": "be:e4:99:6f:56:ed",
            "net4": "46:1a:84:d7:4e:94",
            "net5": "46:26:b7:5f:3a:4b",
            "net6": "06:09:e9:d3:47:15",
            "net7": "06:ac:51:2f:86:f5",
            "net8": "ce:7e:fa:1d:b8:c4",
            "net9": "6a:69:9a:5b:9a:cc"
        },
        "tof_1_2_3": {
            "net0": "02:01:8b:3f:fd:d4",
            "net1": "ba:b8:01:1b:a4:d2",
            "net10": "0e:d3:1d:f0:4f:ca",
            "net11": "1e:11:f7:3d:bf:aa",
            "net12": "c2:74:72:c3:76:e8",
            "net13": "d2:a2:4b:ea:85:f2",
            "net14": "5a:bf:1d:9a:91:a9",
            "net15": "f6:28:6c:21:df:c2",
            "net16": "52:8e:5b:ff:e6:55",
            "net17": "6a:83:71:58:ae:35",
            "net18": "32:78:10:f7:d9:42",
            "net19": "8a:c2:ce:83:8f:40",
            "net2": "86:96:2e:aa:09:e0",
            "net20": "46:4c:5c:89:b0:06",
            "net21": "32:ea:22:13:71:e3",
            "net22": "2a:25:1b:b6:2c:76",
            "net23": "5a:74:21:ab:60:e1",
            "net24": "b2:ed:75:67:0c:89",
            "net25": "c2:95:5b:75:80:8d",
            "net26": "b2:2a:a3:53:4a:3c",
            "net27": "32:18:c4:aa:12:f8",
            "net28": "0e:2a:8d:45:81:5c",
            "net29": "3e:38:9a:75:4b:f9",
            "net3": "e2:e8:e6:fb:5c:c0",
            "net30": "0e:27:6f:8c:b6:73",
            "net31": "76:fe:91:3d:20:32",
            "net4": "be:49:78:d9:22:30",
            "net5": "4e:89:23:a6:5c:d9",
            "net6": "46:f6:6c:71:9b:01",
            "net7": "d6:8b:a0:19:fb:e0",
            "net8": "ba:86:26:e2:31:6b",
            "net9": "5a:a4:54:5b:b3:8e"
        },
        "tof_1_2_4": {
            "net0": "f2:59:87:a0:49:74",
            "net1": "26:48:28:b1:5c:e7",
            "net10": "1a:a9:4f:4f:de:e4",
            "net11": "5e:5e:97:4d:ff:b7",
            "net12": "36:36:c8:fa:42:df",
            "net13": "c6:2d:01:dd:d5:37",
            "net14": "42:a1:06:b0:db:79",
            "net15": "da:00:89:db:62:e9",
            "net16": "9e:36:ad:b8:6f:a7",
            "net17": "02:61:81:c7:5c:7d",
            "net18": "ea:cf:b9:cf:7d:f4",
            "net19": "86:5b:7d:3c:50:49",
            "net2": "4a:b3:f5:c0:36:a6",
            "net20": "e2:20:27:b9:ed:aa",
            "net21": "1e:27:bf:77:7f:6c",
            "net22": "6e:fa:df:49:e9:0e",
            "net23": "62:c0:b1:49:df:2a",
            "net24": "62:d0:79:d7:e1:b7",
            "net25": "ea:f1:e4:eb:04:21",
            "net26": "7e:ca:a3:9c:5a:1b",
            "net27": "3e:70:36:c0:62:7f",
            "net28": "06:df:13:8b:44:8a",
            "net29": "5a:20:c5:e9:34:ee",
            "net3": "76:1d:ba:35:b8:5a",
            "net30": "2a:3d:e5:77:70:70",
            "net31": "9a:b1:da:83:10:55",
            "net4": "ee:4e:b5:a1:b8:67",
            "net5": "86:cd:a1:2d:26:08",
            "net6": "92:c8:6b:b0:82:be",
            "net7": "fe:de:fe:74:58:d8",
            "net8": "9e:01:a1:6f:b1:ca",
            "net9": "2e:ab:d2:9f:b9:2e"
        },
        "tof_1_2_5": {
            "net0": "62:c8:88:01:20:c6",
            "net1": "ee:c2:dd:44:f0:9d",
            "net10": "4a:95:80:9a:5e:36",
            "net11": "46:fc:76:19:87:e5",
            "net12": "ee:08:75:97:c4:dd",
            "net13": "8e:aa:a7:97:6f:0a",
            "net14": "1e:44:a3:a5:b6:ee",
            "net15": "9a:e3:2d:29:0c:97",
            "net16": "4e:31:a1:d3:a9:0a",
            "net17": "12:80:fe:42:ce:1c",
            "net18": "a2:c5:c8:51:74:2e",
            "net19": "76:88:00:ca:29:a2",
            "net2": "0e:65:f3:87:27:dc",
            "net20": "f6:8c:7f:ee:90:d9",
            "net21": "f6:ad:ec:1f:a1:ba",
            "net22": "9e:fd:1e:15:c8:48",
            "net23": "2a:e2:09:1a:c8:33",
            "net24": "ca:db:f2:d0:99:40",
            "net25": "d2:ee:27:a1:30:76",
            "net26": "2a:76:0e:2f:0d:8e",
            "net27": "ca:fe:9d:39:dc:9d",
            "net28": "3a:4d:87:c4:9e:bd",
            "net29": "0e:4e:4b:18:93:a9",
            "net3": "6a:67:21:ed:fd:c9",
            "net30": "1a:ac:52:ca:11:5b",
            "net31": "12:d5:3b:b3:47:36",
            "net4": "ca:c7:1e:50:af:c1",
            "net5": "ca:00:8a:22:97:45",
            "net6": "9e:d2:27:0b:90:33",
            "net7": "06:69:8b:3a:46:d0",
            "net8": "02:c0:2b:e3:fb:2d",
            "net9": "02:65:44:b8:87:32"
        },
        "tof_1_2_6": {
            "net0": "26:02:91:ca:e3:d2",
            "net1": "56:eb:a5:58:87:c1",
            "net10": "fe:f4:67:64:6e:a5",
            "net11": "be:95:eb:57:87:a2",
            "net12": "9e:55:c7:4d:a5:5b",
            "net13": "8e:1a:d6:dd:8f:3c",
            "net14": "ce:a4:b4:cc:38:bc",
            "net15": "2a:b8:be:5c:4b:24",
            "net16": "3e:aa:8c:81:9e:b3",
            "net17": "ca:6b:8c:f9:d1:1e",
            "net18": "b2:ba:f6:43:14:e7",
            "net19": "c2:3a:20:6f:de:7f",
            "net2": "4a:01:6f:cc:91:84",
            "net20": "02:1e:63:ba:11:ef",
            "net21": "aa:50:e1:63:2c:42",
            "net22": "5a:48:c0:b7:39:eb",
            "net23": "72:42:de:a7:db:3e",
            "net24": "ea:f2:42:44:95:2e",
            "net25": "8e:7e:29:31:a7:85",
            "net26": "32:32:ee:d9:f8:f5",
            "net27": "46:43:70:49:16:dd",
            "net28": "3e:1d:1f:b6:c7:98",
            "net29": "92:cd:16:7c:e8:ca",
            "net3": "0e:12:ca:98:2b:fd",
            "net30": "9e:6f:fd:06:9a:ce",
            "net31": "e2:6e:bd:38:f1:fc",
            "net4": "8a:7b:e5:59:4d:4a",
            "net5": "6a:83:0d:b2:ad:54",
            "net6": "86:27:99:13:eb:36",
            "net7": "8e:2f:30:04:47:86",
            "net8": "d2:ce:f0:11:c4:9a",
            "net9": "e6:02:9c:77:5a:cf"
        },
        "tof_1_2_7": {
            "net0": "8a:19:fb:58:7c:16",
            "net1": "ca:6c:7b:63:35:41",
            "net10": "56:d1:30:1c:a5:c7",
            "net11": "5a:60:6b:23:bf:82",
            "net12": "ea:c1:f5:fb:c1:6e",
            "net13": "12:79:1e:01:22:20",
            "net14": "06:d2:e5:10:a4:b4",
            "net15": "ba:e8:3f:86:68:f8",
            "net16": "c6:89:c2:54:84:a2",
            "net17": "8e:7f:28:27:ac:26",
            "net18": "b6:d7:4e:83:82:0d",
            "net19": "a2:c3:b6:1c:68:70",
            "net2": "ee:db:40:69:2e:e5",
            "net20": "b2:86:7f:bf:aa:9e",
            "net21": "c6:57:d0:bb:61:74",
            "net22": "1e:c8:1a:52:47:e6",
            "net23": "26:b7:a1:2e:9c:ec",
            "net24": "1e:aa:4b:e6:ef:98",
            "net25": "66:a6:f3:95:34:be",
            "net26": "46:e2:a1:a7:15:6d",
            "net27": "86:84:15:f3:86:4e",
            "net28": "8a:94:b8:12:f1:72",
            "net29": "1a:b4:4d:e5:bb:95",
            "net3": "0a:85:00:be:b1:32",
            "net30": "be:34:29:37:3e:8e",
            "net31": "ca:5b:d8:42:ac:52",
            "net4": "ce:36:af:ad:56:1d",
            "net5": "1e:8f:18:11:af:40",
            "net6": "e2:b7:72:bf:80:b4",
            "net7": "86:f9:e3:37:59:9e",
            "net8": "1e:76:d7:4f:9e:5d",
            "net9": "22:b3:f4:e7:24:1b"
        },
        "tof_1_2_8": {
            "net0": "de:78:aa:51:2d:71",
            "net1": "9e:47:3c:94:82:8b",
            "net10": "4e:82:90:0e:02:6d",
            "net11": "a6:0b:3a:8b:f7:f5",
            "net12": "da:ac:2e:7c:8f:e6",
            "net13": "c2:9b:72:6d:a0:8d",
            "net14": "9e:9a:4b:da:48:8c",
            "net15": "ba:dc:2c:69:23:87",
            "net16": "86:48:b5:da:90:9f",
            "net17": "da:d1:60:cb:ed:a3",
            "net18": "c6:be:28:6e:b3:f6",
            "net19": "3e:72:a6:64:b9:05",
            "net2": "fe:40:20:04:25:0d",
            "net20": "7a:0f:ee:5b:92:69",
            "net21": "92:ce:ae:33:fb:11",
            "net22": "2e:b5:57:e4:6a:d7",
            "net23": "62:79:64:ad:92:c2",
            "net24": "f2:a0:16:14:42:00",
            "net25": "06:66:09:fc:36:5f",
            "net26": "7a:e9:07:95:bf:1f",
            "net27": "b6:1e:3d:33:38:04",
            "net28": "36:ed:c7:15:ea:93",
            "net29": "2e:b2:df:f3:aa:97",
            "net3": "4e:20:d6:b1:33:34",
            "net30": "32:89:ca:67:1f:6e",
            "net31": "a2:71:12:40:15:f2",
            "net4": "aa:9c:10:30:03:c3",
            "net5": "16:4d:6e:de:ec:a1",
            "net6": "26:55:19:07:40:78",
            "net7": "76:b1:1f:a6:14:16",
            "net8": "da:ea:41:cd:19:68",
            "net9": "c6:db:bb:f1:97:65"
        },
        "tof_1_2_9": {
            "net0": "a6:a8:b1:76:7e:47",
            "net1": "6a:a0:7b:35:f8:ef",
            "net10": "f6:8b:ff:2f:dc:1c",
            "net11": "9a:1a:16:0f:a1:02",
            "net12": "36:e2:57:8e:f2:a5",
            "net13": "6a:b0:60:1d:6c:81",
            "net14": "5e:02:f7:85:84:dd",
            "net15": "5a:91:fa:80:21:a1",
            "net16": "96:c7:b0:15:d6:22",
            "net17": "2a:a3:43:17:d8:d0",
            "net18": "2e:f5:82:26:fd:40",
            "net19": "de:6b:dd:74:a6:fb",
            "net2": "56:f0:21:b4:cd:48",
            "net20": "72:f4:35:fd:59:5c",
            "net21": "da:78:59:c0:41:1a",
            "net22": "a2:f3:dd:70:93:74",
            "net23": "b2:de:16:9c:80:30",
            "net24": "e2:1b:98:69:d6:dd",
            "net25": "a2:49:b7:a1:4c:ff",
            "net26": "0a:8e:d9:33:92:ff",
            "net27": "e6:00:ac:aa:35:c4",
            "net28": "f6:0b:6f:be:0b:d9",
            "net29": "72:e1:01:96:2d:0b",
            "net3": "ce:d6:15:5a:34:67",
            "net30": "5e:a8:27:13:13:7d",
            "net31": "26:3d:3d:0a:ba:fa",
            "net4": "6a:38:dc:f7:0d:cd",
            "net5": "ae:08:41:00:55:14",
            "net6": "f6:38:05:5c:a0:f5",
            "net7": "16:8c:ce:ba:2a:55",
            "net8": "2a:5f:7f:06:a2:6e",
            "net9": "f2:c4:be:11:bd:f4"
        }
    },
    "failed_machine": "spine_1_1_1",
    "failure_time": {
        "leaf_1_0_1": 1636378850.0151212,
        "leaf_1_0_10": 1636378850.0280623,
        "leaf_1_0_11": 1636378850.0447853,
        "leaf_1_0_12": 1636378850.0515394,
        "leaf_1_0_13": 1636378850.0621712,
        "leaf_1_0_14": 1636378850.2114766,
        "leaf_1_0_15": 1636378850.0879245,
        "leaf_1_0_16": 1636378850.0971339,
        "leaf_1_0_2": 1636378850.1074803,
        "leaf_1_0_3": 1636378850.1181023,
        "leaf_1_0_4": 1636378850.1546824,
        "leaf_1_0_5": 1636378850.0228143,
        "leaf_1_0_6": 1636378850.031536,
        "leaf_1_0_7": 1636378850.047268,
        "leaf_1_0_8": 1636378850.1991618,
        "leaf_1_0_9": 1636378850.06494,
        "leaf_2_0_1": 1636378850.2156603,
        "leaf_2_0_10": 1636378850.0904496,
        "leaf_2_0_11": 1636378850.2426276,
        "leaf_2_0_12": 1636378850.2569346,
        "leaf_2_0_13": 1636378850.1254063,
        "leaf_2_0_14": 1636378850.1357784,
        "leaf_2_0_15": 1636378850.1508522,
        "leaf_2_0_16": 1636378850.1599138,
        "leaf_2_0_2": 1636378850.1699896,
        "leaf_2_0_3": 1636378850.1770198,
        "leaf_2_0_4": 1636378850.3260348,
        "leaf_2_0_5": 1636378850.195579,
        "leaf_2_0_6": 1636378850.3480706,
        "leaf_2_0_7": 1636378850.217168,
        "leaf_2_0_8": 1636378850.2670343,
        "leaf_2_0_9": 1636378850.1487336,
        "spine_1_1_1": 1636378850.1587076,
        "spine_1_1_10": 1636378850.3065286,
        "spine_1_1_11": 1636378850.17507,
        "spine_1_1_12": 1636378850.1805634,
        "spine_1_1_13": 1636378850.1907625,
        "spine_1_1_14": 1636378850.2032604,
        "spine_1_1_15": 1636378850.2098012,
        "spine_1_1_16": 1636378850.2190015,
        "spine_1_1_2": 1636378850.2261348,
        "spine_1_1_3": 1636378850.2344148,
        "spine_1_1_4": 1636378850.2435734,
        "spine_1_1_5": 1636378850.2560396,
        "spine_1_1_6": 1636378850.2652857,
        "spine_1_1_7": 1636378850.2747107,
        "spine_1_1_8": 1636378850.2911859,
        "spine_1_1_9": 1636378850.3052595,
        "spine_2_1_1": 1636378850.3158312,
        "spine_2_1_10": 1636378850.3246202,
        "spine_2_1_11": 1636378850.228856,
        "spine_2_1_12": 1636378850.239639,
        "spine_2_1_13": 1636378850.392231,
        "spine_2_1_14": 1636378850.260888,
        "spine_2_1_15": 1636378850.2717166,
        "spine_2_1_16": 1636378850.430016,
        "spine_2_1_2": 1636378850.4409902,
        "spine_2_1_3": 1636378850.3125124,
        "spine_2_1_4": 1636378850.3238935,
        "spine_2_1_5": 1636378850.4752336,
        "spine_2_1_6": 1636378850.3348656,
        "spine_2_1_7": 1636378850.490652,
        "spine_2_1_8": 1636378850.501438,
        "spine_2_1_9": 1636378850.3711228,
        "tof_1_2_1": 1636378850.3856955,
        "tof_1_2_10": 1636378850.3976068,
        "tof_1_2_11": 1636378850.4065416,
        "tof_1_2_12": 1636378850.4137735,
        "tof_1_2_13": 1636378850.4256377,
        "tof_1_2_14": 1636378850.43601,
        "tof_1_2_15": 1636378850.3476079,
        "tof_1_2_16": 1636378850.3625333,
        "tof_1_2_2": 1636378850.3708522,
        "tof_1_2_3": 1636378850.3874912,
        "tof_1_2_4": 1636378850.4006298,
        "tof_1_2_5": 1636378850.4097168,
        "tof_1_2_6": 1636378850.4234,
        "tof_1_2_7": 1636378850.435527,
        "tof_1_2_8": 1636378850.4465911,
        "tof_1_2_9": 1636378850.4626045
    },
    "recover_time": {
        "leaf_1_0_1": 1636378912.5738,
        "leaf_1_0_10": 1636378912.5849361,
        "leaf_1_0_11": 1636378912.6012242,
        "leaf_1_0_12": 1636378912.6097977,
        "leaf_1_0_13": 1636378912.6229565,
        "leaf_1_0_14": 1636378912.7725718,
        "leaf_1_0_15": 1636378912.649431,
        "leaf_1_0_16": 1636378912.660244,
        "leaf_1_0_2": 1636378912.6710184,
        "leaf_1_0_3": 1636378912.6854904,
        "leaf_1_0_4": 1636378912.7160926,
        "leaf_1_0_5": 1636378912.58539,
        "leaf_1_0_6": 1636378912.5988643,
        "leaf_1_0_7": 1636378912.6079352,
        "leaf_1_0_8": 1636378912.7618093,
        "leaf_1_0_9": 1636378912.6267185,
        "leaf_2_0_1": 1636378912.7830315,
        "leaf_2_0_10": 1636378912.6492045,
        "leaf_2_0_11": 1636378912.8045397,
        "leaf_2_0_12": 1636378912.8167992,
        "leaf_2_0_13": 1636378912.6873238,
        "leaf_2_0_14": 1636378912.7031834,
        "leaf_2_0_15": 1636378912.7216387,
        "leaf_2_0_16": 1636378912.731438,
        "leaf_2_0_2": 1636378912.7443469,
        "leaf_2_0_3": 1636378912.754452,
        "leaf_2_0_4": 1636378912.903783,
        "leaf_2_0_5": 1636378912.7741232,
        "leaf_2_0_6": 1636378912.9271495,
        "leaf_2_0_7": 1636378912.7978692,
        "leaf_2_0_8": 1636378912.8351533,
        "leaf_2_0_9": 1636378912.7051775,
        "spine_1_1_10": 1636378912.8611197,
        "spine_1_1_11": 1636378912.7305207,
        "spine_1_1_12": 1636378912.7399356,
        "spine_1_1_13": 1636378912.7476585,
        "spine_1_1_14": 1636378912.7586539,
        "spine_1_1_15": 1636378912.7651498,
        "spine_1_1_16": 1636378912.7774448,
        "spine_1_1_2": 1636378912.7876244,
        "spine_1_1_3": 1636378912.798656,
        "spine_1_1_4": 1636378912.812433,
        "spine_1_1_5": 1636378912.824121,
        "spine_1_1_6": 1636378912.8318994,
        "spine_1_1_7": 1636378912.83929,
        "spine_1_1_8": 1636378912.8562007,
        "spine_1_1_9": 1636378912.8680925,
        "spine_2_1_1": 1636378912.8735745,
        "spine_2_1_10": 1636378912.884052,
        "spine_2_1_11": 1636378912.8913789,
        "spine_2_1_12": 1636378912.8132892,
        "spine_2_1_13": 1636378912.9664292,
        "spine_2_1_14": 1636378912.8367379,
        "spine_2_1_15": 1636378912.8453832,
        "spine_2_1_16": 1636378912.9987893,
        "spine_2_1_2": 1636378913.0075777,
        "spine_2_1_3": 1636378912.8819995,
        "spine_2_1_4": 1636378912.8901696,
        "spine_2_1_5": 1636378913.040169,
        "spine_2_1_6": 1636378912.9114537,
        "spine_2_1_7": 1636378913.042188,
        "spine_2_1_8": 1636378913.0555012,
        "spine_2_1_9": 1636378912.925328,
        "tof_1_2_1": 1636378912.9379845,
        "tof_1_2_10": 1636378912.9510026,
        "tof_1_2_11": 1636378912.9605064,
        "tof_1_2_12": 1636378912.971581,
        "tof_1_2_13": 1636378912.9847972,
        "tof_1_2_14": 1636378913.0036917,
        "tof_1_2_15": 1636378913.017961,
        "tof_1_2_16": 1636378912.925776,
        "tof_1_2_2": 1636378912.9351346,
        "tof_1_2_3": 1636378912.947133,
        "tof_1_2_4": 1636378912.956033,
        "tof_1_2_5": 1636378912.9694824,
        "tof_1_2_6": 1636378912.9829447,
        "tof_1_2_7": 1636378912.994127,
        "tof_1_2_8": 1636378913.0050263,
        "tof_1_2_9": 1636378913.0220528,
        "spine_1_1_1": 1636378937.0309339
    }
}