{
    "k_leaf": 8,
    "k_top": 8,
    "redundancy_factor": 8,
    "is_k8s": true,
    "machine_mac_addresses": {
        "leaf_1_0_1": {
            "net0": "82:c8:f6:e7:42:ba",
            "net1": "f6:8a:d8:33:ac:81",
            "net2": "3a:a0:5e:2f:b7:d6",
            "net3": "22:5d:c8:8c:27:5b",
            "net4": "a6:19:bb:f8:98:35",
            "net5": "62:64:fb:27:26:61",
            "net6": "f2:b3:d1:5f:a9:a6",
            "net7": "42:1b:91:1b:f4:2b",
            "net8": "1e:d8:28:a4:4f:75"
        },
        "leaf_1_0_2": {
            "net0": "4a:31:cf:1a:37:9c",
            "net1": "42:5d:4d:63:57:c2",
            "net2": "26:a2:00:3f:82:1b",
            "net3": "fe:59:c2:f1:01:00",
            "net4": "0a:bd:82:3c:71:98",
            "net5": "86:3a:02:96:bd:85",
            "net6": "d2:5c:bf:63:0b:2f",
            "net7": "e6:3f:42:88:5e:ad",
            "net8": "82:60:8f:17:74:58"
        },
        "leaf_1_0_3": {
            "net0": "6e:fd:bc:2f:fe:d5",
            "net1": "32:99:ee:22:82:ae",
            "net2": "ba:19:82:f5:c5:92",
            "net3": "16:90:2d:e7:2d:db",
            "net4": "d6:45:99:2f:fd:c3",
            "net5": "0e:2b:42:cc:5e:e8",
            "net6": "46:06:0b:f1:00:df",
            "net7": "a2:6e:97:1b:73:0c",
            "net8": "76:cb:ec:56:36:e4"
        },
        "leaf_1_0_4": {
            "net0": "f6:bb:d3:4a:8a:80",
            "net1": "2e:c4:f6:5f:e5:2d",
            "net2": "aa:b6:e7:13:c3:3b",
            "net3": "5a:ab:cc:75:e8:6e",
            "net4": "0a:df:71:60:7d:ba",
            "net5": "0e:63:8c:2a:e2:b1",
            "net6": "fe:9e:72:7c:72:fc",
            "net7": "fe:74:f2:ae:4f:c2",
            "net8": "d6:c4:2c:bb:75:0b"
        },
        "leaf_1_0_5": {
            "net0": "b6:0c:ff:a3:b6:fc",
            "net1": "4a:7c:9b:c3:ef:e6",
            "net2": "7a:fe:98:f2:5f:c1",
            "net3": "9a:c0:f0:12:ee:87",
            "net4": "b2:e2:05:f5:15:bc",
            "net5": "ce:3e:92:39:0d:cf",
            "net6": "62:53:12:47:3e:a4",
            "net7": "f6:9b:55:a1:48:1e",
            "net8": "8e:b9:2f:0a:d1:e0"
        },
        "leaf_1_0_6": {
            "net0": "d2:a8:a1:30:4e:6c",
            "net1": "42:01:c9:6f:76:e6",
            "net2": "be:58:cb:3b:09:48",
            "net3": "26:95:bf:1c:bb:27",
            "net4": "72:00:7c:4a:3a:18",
            "net5": "8e:9a:44:cf:72:75",
            "net6": "82:56:2d:2f:2f:ff",
            "net7": "4e:0b:15:35:db:31",
            "net8": "1a:0a:89:83:33:fd"
        },
        "leaf_1_0_7": {
            "net0": "8a:c7:19:5b:4e:37",
            "net1": "46:7d:8c:d9:ce:bb",
            "net2": "16:9f:b0:cd:c1:d0",
            "net3": "6a:99:c7:1d:aa:b1",
            "net4": "ce:59:e7:a3:9b:52",
            "net5": "d6:3c:51:8e:76:06",
            "net6": "9e:5d:b6:78:98:dc",
            "net7": "5a:29:41:33:8c:66",
            "net8": "7e:45:f1:90:4b:85"
        },
        "leaf_1_0_8": {
            "net0": "06:dd:bb:8f:f9:ce",
            "net1": "82:95:98:49:75:b7",
            "net2": "c2:69:de:e7:b5:8b",
            "net3": "9a:31:a0:49:7e:4d",
            "net4": "b2:bd:7f:8b:24:f6",
            "net5": "26:47:1e:95:19:ca",
            "net6": "ee:59:79:b9:be:0b",
            "net7": "ea:c1:2c:86:5b:b2",
            "net8": "72:e6:bd:1d:df:07"
        },
        "leaf_2_0_1": {
            "net0": "12:89:38:16:a6:d3",
            "net1": "a2:e7:4a:69:11:20",
            "net2": "ba:d5:e3:73:f5:9c",
            "net3": "f2:b3:02:64:6a:c0",
            "net4": "56:41:91:9c:45:86",
            "net5": "82:b7:7b:3b:5d:45",
            "net6": "76:b0:54:ac:62:7f",
            "net7": "ee:ca:81:c5:36:4d",
            "net8": "32:a8:5b:77:19:27"
        },
        "leaf_2_0_2": {
            "net0": "be:4c:4b:56:08:01",
            "net1": "0e:ab:63:e8:9c:35",
            "net2": "a6:d1:1e:10:57:88",
            "net3": "fe:0e:38:a0:90:ab",
            "net4": "16:38:d8:e8:65:18",
            "net5": "0a:4b:2f:fc:c1:ff",
            "net6": "ce:53:4c:91:e2:27",
            "net7": "56:aa:a4:e6:e7:e9",
            "net8": "82:8d:3f:d6:57:ad"
        },
        "leaf_2_0_3": {
            "net0": "46:3e:a4:26:c6:0a",
            "net1": "9e:e2:ab:df:32:9a",
            "net2": "a6:38:5b:d0:d5:30",
            "net3": "3a:1e:33:4c:42:23",
            "net4": "1a:19:fd:71:cc:38",
            "net5": "72:be:f7:0e:2f:f6",
            "net6": "26:7e:97:fd:4e:a6",
            "net7": "e2:97:a5:99:bc:99",
            "net8": "92:25:ba:f8:bb:b1"
        },
        "leaf_2_0_4": {
            "net0": "82:ee:6c:3e:a4:bd",
            "net1": "be:4a:33:29:80:e7",
            "net2": "f6:77:15:b6:66:53",
            "net3": "4a:18:ea:23:b4:94",
            "net4": "6e:e1:7a:75:8e:8d",
            "net5": "ca:1c:92:1a:29:3f",
            "net6": "1e:7f:c1:b4:50:a6",
            "net7": "3e:a4:ef:74:d8:ad",
            "net8": "02:7c:42:b2:85:2f"
        },
        "leaf_2_0_5": {
            "net0": "ea:ce:4a:51:0b:fb",
            "net1": "ae:31:a7:63:8f:0f",
            "net2": "76:0f:f9:09:b9:61",
            "net3": "52:82:ce:4e:ae:55",
            "net4": "5e:d8:47:d0:97:1d",
            "net5": "62:e0:ed:ed:88:fd",
            "net6": "4a:f8:4e:79:7b:ac",
            "net7": "c6:3e:79:3e:6e:c1",
            "net8": "ae:36:1a:35:de:25"
        },
        "leaf_2_0_6": {
            "net0": "4e:9e:7c:73:8f:6f",
            "net1": "4a:70:ea:15:36:49",
            "net2": "72:25:a4:9d:cb:d5",
            "net3": "be:e5:97:15:31:ec",
            "net4": "ce:32:38:8a:56:86",
            "net5": "62:a2:07:1d:dd:3a",
            "net6": "fe:97:96:12:18:b2",
            "net7": "aa:6d:b4:f7:f0:d3",
            "net8": "5a:0c:d9:15:e1:12"
        },
        "leaf_2_0_7": {
            "net0": "ba:8d:33:b1:54:4b",
            "net1": "e6:bc:80:95:52:fb",
            "net2": "86:bb:8c:de:ac:08",
            "net3": "92:fb:dc:8d:87:82",
            "net4": "72:1d:ad:4b:7c:83",
            "net5": "da:da:2a:5b:d5:5d",
            "net6": "4a:bb:5f:c1:3d:1a",
            "net7": "42:e0:ba:b1:d4:07",
            "net8": "a6:d7:22:22:74:0f"
        },
        "leaf_2_0_8": {
            "net0": "56:97:cd:fe:85:bb",
            "net1": "3e:90:93:53:d0:6b",
            "net2": "f6:c3:20:dd:c7:c7",
            "net3": "ba:0f:f7:3a:20:32",
            "net4": "12:ad:8b:a2:0b:74",
            "net5": "ce:6e:69:98:62:08",
            "net6": "6e:22:c1:fd:28:1a",
            "net7": "0a:1b:3c:b6:be:d8",
            "net8": "26:69:3b:6a:62:71"
        },
        "spine_1_1_1": {
            "net0": "fe:34:18:77:43:38",
            "net1": "3e:ac:d7:bb:bb:29",
            "net10": "32:01:40:df:44:59",
            "net11": "56:af:9d:7e:4c:7e",
            "net12": "e2:01:c7:f3:69:39",
            "net13": "a2:b1:52:06:e5:de",
            "net14": "52:d0:e2:ef:a2:3a",
            "net15": "c6:2d:96:93:8a:e1",
            "net2": "fe:5a:d8:f7:88:2b",
            "net3": "8e:fa:79:df:ca:f1",
            "net4": "ca:ed:24:4c:2a:79",
            "net5": "e2:e4:63:06:c0:72",
            "net6": "96:8f:8a:3c:d3:ff",
            "net7": "1e:e9:89:e4:2b:31",
            "net8": "a2:de:f1:6e:cf:c5",
            "net9": "ee:0a:cc:c6:54:ba"
        },
        "spine_1_1_2": {
            "net0": "c6:fa:5e:04:bc:a3",
            "net1": "76:f1:7e:98:7a:be",
            "net10": "76:86:ab:58:0e:7c",
            "net11": "66:33:52:3a:1f:51",
            "net12": "02:7f:5c:22:d8:b6",
            "net13": "5e:62:cc:c6:99:ca",
            "net14": "0a:30:e6:b5:42:d2",
            "net15": "42:a0:b7:b5:67:cc",
            "net2": "76:7c:1e:44:ca:31",
            "net3": "ae:47:f5:97:65:11",
            "net4": "96:75:44:96:82:b4",
            "net5": "26:81:c8:f5:49:76",
            "net6": "aa:72:39:69:72:b8",
            "net7": "9e:8d:ff:51:4b:be",
            "net8": "32:89:1b:42:b2:fa",
            "net9": "fa:b6:bc:06:23:07"
        },
        "spine_1_1_3": {
            "net0": "4e:ca:84:fd:d8:29",
            "net1": "ea:5f:4b:9b:47:12",
            "net10": "fa:53:b5:35:9b:66",
            "net11": "9a:6d:bd:0c:a7:79",
            "net12": "36:2c:77:bc:32:c9",
            "net13": "0a:69:4e:36:3b:dd",
            "net14": "22:b9:1e:d0:55:6b",
            "net15": "12:0c:c4:e5:cf:af",
            "net2": "22:1e:11:76:eb:2b",
            "net3": "a6:a0:d4:7d:68:3b",
            "net4": "9a:43:32:ef:ad:2b",
            "net5": "32:8d:b8:e3:1c:a3",
            "net6": "ea:a0:5a:82:6d:ba",
            "net7": "3a:ff:6f:c1:cc:8b",
            "net8": "fa:ac:c2:43:86:d7",
            "net9": "62:e4:7a:5e:19:e9"
        },
        "spine_1_1_4": {
            "net0": "8a:1b:8d:b6:72:eb",
            "net1": "16:8a:b3:8f:92:c8",
            "net10": "02:ce:e1:5c:47:ee",
            "net11": "62:76:41:fe:e8:de",
            "net12": "9e:6a:a9:5d:8e:7e",
            "net13": "86:83:34:bb:4a:bb",
            "net14": "f6:a9:e0:bc:95:05",
            "net15": "ea:31:13:7c:56:27",
            "net2": "ea:b8:39:87:aa:74",
            "net3": "aa:71:c1:db:77:e1",
            "net4": "32:5e:65:25:d3:62",
            "net5": "4e:8b:e4:46:84:3d",
            "net6": "4a:43:6d:ab:f9:1d",
            "net7": "f6:98:6a:5e:2a:86",
            "net8": "c6:36:3d:c6:0f:fe",
            "net9": "76:22:58:2c:be:8b"
        },
        "spine_1_1_5": {
            "net0": "3a:2e:21:27:f2:94",
            "net1": "8a:9c:73:86:0b:89",
            "net10": "a6:05:e2:3a:76:9f",
            "net11": "86:a5:eb:37:2d:d0",
            "net12": "56:87:02:23:19:38",
            "net13": "66:29:d6:72:52:55",
            "net14": "6e:e9:53:db:95:ba",
            "net15": "86:89:59:78:39:46",
            "net2": "f6:27:2b:25:50:2b",
            "net3": "52:45:31:67:b1:a4",
            "net4": "8e:7b:49:0b:a6:78",
            "net5": "66:52:06:8a:52:a3",
            "net6": "06:54:58:65:33:ff",
            "net7": "aa:94:ec:b8:cf:e8",
            "net8": "4a:c6:28:fe:56:1f",
            "net9": "7e:b0:a1:98:73:49"
        },
        "spine_1_1_6": {
            "net0": "96:9b:20:1e:b3:b8",
            "net1": "8a:02:63:25:82:94",
            "net10": "b2:64:55:13:67:b3",
            "net11": "72:2e:82:03:bb:3e",
            "net12": "72:06:29:92:2c:d0",
            "net13": "9e:26:4b:8d:7d:25",
            "net14": "aa:c9:35:87:5f:22",
            "net15": "3e:fb:d3:91:e4:e6",
            "net2": "8e:a8:67:bc:19:20",
            "net3": "f2:94:db:2c:30:ec",
            "net4": "be:d3:3c:7f:9c:c5",
            "net5": "1a:62:af:00:7d:e9",
            "net6": "da:2c:f2:40:af:45",
            "net7": "82:48:19:f8:44:2a",
            "net8": "62:ad:ca:e6:90:08",
            "net9": "36:ca:b1:b0:9b:34"
        },
        "spine_1_1_7": {
            "net0": "ee:53:34:a0:e9:f0",
            "net1": "0e:40:76:27:08:94",
            "net10": "56:e6:54:1d:e0:72",
            "net11": "b2:b8:82:0e:f9:51",
            "net12": "76:df:94:fc:56:c1",
            "net13": "02:7e:71:35:c1:dd",
            "net14": "b6:c3:14:c5:cb:56",
            "net15": "ee:38:76:ee:43:3c",
            "net2": "a6:0c:2a:4e:97:9c",
            "net3": "2a:16:57:91:21:7b",
            "net4": "32:5a:f9:d9:84:4e",
            "net5": "96:d8:08:b5:94:c5",
            "net6": "62:e0:e8:2b:a5:7e",
            "net7": "56:40:33:75:26:1d",
            "net8": "16:6b:f2:b1:3b:c7",
            "net9": "ea:aa:14:15:cd:f7"
        },
        "spine_1_1_8": {
            "net0": "3a:f4:20:b6:57:fa",
            "net1": "62:d7:52:e1:da:20",
            "net10": "5e:fa:4e:47:7b:15",
            "net11": "e2:98:a3:b8:5c:98",
            "net12": "2a:a1:33:f8:fe:8f",
            "net13": "42:81:10:88:4f:33",
            "net14": "5e:11:91:92:a2:8b",
            "net15": "ea:c3:16:c0:f9:99",
            "net2": "de:a2:45:62:75:87",
            "net3": "2e:7a:c4:7c:67:91",
            "net4": "2e:35:6b:bb:c5:5f",
            "net5": "b2:93:ff:44:cd:37",
            "net6": "26:3a:9f:1b:5d:42",
            "net7": "9e:d1:90:3c:a1:1a",
            "net8": "5a:29:ad:1f:64:9c",
            "net9": "66:10:b7:64:55:e8"
        },
        "spine_2_1_1": {
            "net0": "02:db:63:7d:10:72",
            "net1": "c2:71:c8:fe:14:e0",
            "net10": "9a:2f:cf:08:7c:dd",
            "net11": "6a:3d:b2:86:a0:67",
            "net12": "c6:c1:4a:61:d5:1a",
            "net13": "e6:3d:bf:f3:e9:64",
            "net14": "da:01:91:f2:55:e8",
            "net15": "6e:46:f8:bb:00:6b",
            "net2": "7a:26:27:66:e5:2b",
            "net3": "0a:cd:b2:e2:3c:97",
            "net4": "de:c2:f6:af:5d:6e",
            "net5": "ea:1e:4c:a8:33:7b",
            "net6": "16:cc:39:7c:b6:7a",
            "net7": "5e:b0:8c:8f:a0:6b",
            "net8": "ee:5b:a3:71:bf:28",
            "net9": "0a:16:3b:77:03:79"
        },
        "spine_2_1_2": {
            "net0": "ea:f9:b9:3c:a6:ca",
            "net1": "d2:64:b4:84:69:cb",
            "net10": "6a:94:93:93:cf:98",
            "net11": "be:f4:0b:4b:43:26",
            "net12": "3a:6a:e0:9a:8b:6c",
            "net13": "1a:5c:62:40:b7:04",
            "net14": "aa:03:d5:50:3f:3c",
            "net15": "ca:07:25:9d:d5:29",
            "net2": "0a:37:33:95:8a:54",
            "net3": "c6:e9:54:dc:82:36",
            "net4": "ee:3e:4c:4a:fa:fe",
            "net5": "5a:e7:d9:5a:c0:62",
            "net6": "36:e9:c9:15:a1:b2",
            "net7": "b2:dd:8d:02:3c:0b",
            "net8": "76:aa:3d:53:3c:9c",
            "net9": "c2:1c:1a:1d:14:f7"
        },
        "spine_2_1_3": {
            "net0": "c6:b6:d3:87:f5:09",
            "net1": "be:6d:64:17:1e:09",
            "net10": "ea:2e:22:70:f3:25",
            "net11": "d2:1a:b8:09:1a:96",
            "net12": "1a:da:26:60:c6:3d",
            "net13": "5a:9b:90:98:3b:ea",
            "net14": "2a:7b:26:31:5f:b4",
            "net15": "3e:59:a3:bf:5d:08",
            "net2": "4e:3d:36:f8:72:83",
            "net3": "32:ce:89:b8:dd:fb",
            "net4": "e6:4e:b0:4f:90:93",
            "net5": "06:f5:a4:06:aa:27",
            "net6": "c6:ac:50:e4:81:44",
            "net7": "3e:55:85:c6:3c:80",
            "net8": "d6:13:64:08:20:f8",
            "net9": "ca:ef:2b:fd:f7:09"
        },
        "spine_2_1_4": {
            "net0": "a6:d4:74:5f:81:1b",
            "net1": "d2:34:e4:74:5f:73",
            "net10": "42:b2:bd:bb:d4:99",
            "net11": "a6:8e:a9:ca:e0:58",
            "net12": "4a:e0:a0:93:2d:1f",
            "net13": "4a:4c:41:22:0e:9d",
            "net14": "02:98:1d:84:80:88",
            "net15": "1a:0a:8a:61:24:e2",
            "net2": "e6:9a:0c:c9:d5:db",
            "net3": "e2:a8:1b:7d:f5:c2",
            "net4": "aa:b3:39:56:f0:93",
            "net5": "e6:9d:d3:b8:43:55",
            "net6": "36:1a:d5:db:46:41",
            "net7": "22:49:01:7d:f9:36",
            "net8": "1a:fb:c1:92:f8:6c",
            "net9": "8a:79:c9:68:cc:d9"
        },
        "spine_2_1_5": {
            "net0": "ae:96:24:8b:ee:1a",
            "net1": "36:a9:6b:2c:0b:d7",
            "net10": "5e:df:39:3d:21:98",
            "net11": "4e:7f:82:2a:5e:eb",
            "net12": "1e:0b:dc:8d:43:e6",
            "net13": "ca:1f:56:b6:a8:92",
            "net14": "9a:dc:93:6f:1c:79",
            "net15": "be:eb:db:db:21:61",
            "net2": "b6:a0:c0:36:be:c6",
            "net3": "26:d3:40:bf:d8:4b",
            "net4": "7a:58:30:9f:b8:9c",
            "net5": "d2:2a:b1:8a:a7:cd",
            "net6": "fe:d3:70:09:f7:a0",
            "net7": "aa:3e:22:f9:ba:fe",
            "net8": "56:e6:75:07:9d:bd",
            "net9": "62:73:f7:2c:f5:05"
        },
        "spine_2_1_6": {
            "net0": "e2:c6:c0:66:87:f6",
            "net1": "a6:d5:44:f4:7f:5e",
            "net10": "02:a4:2a:a4:c0:f5",
            "net11": "76:93:a7:07:21:4c",
            "net12": "da:6b:b4:61:1e:35",
            "net13": "76:f7:f1:97:4c:38",
            "net14": "5a:ae:95:ad:87:81",
            "net15": "92:4e:2c:07:4c:1c",
            "net2": "d2:33:11:79:b8:cb",
            "net3": "c6:91:9f:75:46:2a",
            "net4": "f6:fe:0f:ed:dd:63",
            "net5": "8a:4e:e1:96:ea:03",
            "net6": "ca:e1:cc:42:2c:37",
            "net7": "ce:44:39:7a:ec:26",
            "net8": "7e:c0:db:c8:e1:10",
            "net9": "22:d2:a0:e6:fe:15"
        },
        "spine_2_1_7": {
            "net0": "be:8b:c8:e3:ac:4b",
            "net1": "82:dd:4a:96:5c:d8",
            "net10": "ca:b4:fe:4a:e4:64",
            "net11": "c6:a7:ef:15:e3:1c",
            "net12": "2a:d6:78:9c:55:54",
            "net13": "ce:08:01:1a:b5:7d",
            "net14": "ce:d4:fd:a3:43:33",
            "net15": "aa:6e:71:2a:a2:cc",
            "net2": "26:e7:79:1a:61:6a",
            "net3": "ee:4e:d0:ba:b1:5e",
            "net4": "66:24:0d:30:ea:ec",
            "net5": "ce:ab:10:0c:34:7a",
            "net6": "da:87:ab:5c:79:38",
            "net7": "9a:73:99:fd:b2:b0",
            "net8": "5a:3b:47:32:90:25",
            "net9": "82:ad:33:2f:09:77"
        },
        "spine_2_1_8": {
            "net0": "7a:f1:a6:7e:ca:fb",
            "net1": "4a:fc:b0:2c:b5:ba",
            "net10": "5a:f3:62:15:2a:cb",
            "net11": "be:a4:5f:01:2f:45",
            "net12": "a6:8c:00:03:d9:38",
            "net13": "a2:7c:3f:92:7a:f6",
            "net14": "ba:34:ae:7e:3c:0f",
            "net15": "5e:e3:82:e3:bc:42",
            "net2": "0e:42:7e:c6:a1:01",
            "net3": "4e:eb:30:1a:13:ec",
            "net4": "de:45:2d:f0:dc:dc",
            "net5": "f2:c4:b9:bf:ec:5e",
            "net6": "ae:a8:9e:76:6d:f6",
            "net7": "aa:be:df:37:4f:d3",
            "net8": "06:26:64:27:0e:79",
            "net9": "7a:5a:2b:bd:5c:2d"
        },
        "tof_1_2_1": {
            "net0": "f6:1c:a5:ad:06:3d",
            "net1": "7a:09:70:ad:7c:69",
            "net10": "8e:ca:fb:57:8c:14",
            "net11": "d2:b6:4c:0a:67:be",
            "net12": "be:e0:e2:eb:3e:86",
            "net13": "5e:17:0b:d7:17:68",
            "net14": "9e:5e:c9:6e:29:59",
            "net15": "a2:51:24:d6:02:6f",
            "net2": "02:ec:98:50:da:35",
            "net3": "22:8e:9a:3f:12:ef",
            "net4": "62:7c:63:01:54:37",
            "net5": "c6:af:bd:2c:fc:60",
            "net6": "f6:e9:19:2e:c8:eb",
            "net7": "82:d6:b8:ae:df:3e",
            "net8": "0a:a8:c3:ca:8b:f0",
            "net9": "32:61:77:e5:04:e2"
        },
        "tof_1_2_2": {
            "net0": "56:a9:0a:35:d2:96",
            "net1": "fa:bf:7a:4f:da:a7",
            "net10": "da:32:a2:46:dc:8b",
            "net11": "46:0a:1f:a1:1b:c6",
            "net12": "2e:cb:73:ce:84:94",
            "net13": "f6:fc:25:d1:47:23",
            "net14": "8a:f6:28:a7:af:f3",
            "net15": "1a:ba:bc:6a:d0:ae",
            "net2": "56:12:5c:fe:54:45",
            "net3": "a2:80:a4:03:40:b9",
            "net4": "4e:2d:a4:a7:24:e0",
            "net5": "aa:e4:88:f1:a1:6d",
            "net6": "36:51:92:a5:e1:d2",
            "net7": "f2:ff:72:fd:1d:55",
            "net8": "1e:46:ca:38:33:c8",
            "net9": "52:94:78:26:dc:b2"
        },
        "tof_1_2_3": {
            "net0": "52:1b:b2:7d:12:2e",
            "net1": "5a:b9:f2:73:5c:c0",
            "net10": "b2:ed:9c:15:8b:99",
            "net11": "86:68:29:ba:f2:c0",
            "net12": "f6:50:86:ae:66:86",
            "net13": "aa:d1:fe:9e:f5:f4",
            "net14": "0e:f9:2a:17:1c:3d",
            "net15": "c6:4e:ed:54:2a:80",
            "net2": "0a:c0:be:b6:18:54",
            "net3": "ae:47:70:2e:a0:cd",
            "net4": "c6:47:53:d0:70:91",
            "net5": "da:f5:21:1d:da:49",
            "net6": "8e:55:d2:a3:2c:85",
            "net7": "f2:f6:ec:3c:37:a8",
            "net8": "72:4a:f2:c9:1f:e7",
            "net9": "2e:13:d8:1f:0f:4e"
        },
        "tof_1_2_4": {
            "net0": "be:79:23:98:c4:69",
            "net1": "5e:a0:1a:14:5d:ea",
            "net10": "d2:05:24:a9:9f:e9",
            "net11": "26:46:04:94:0d:ff",
            "net12": "d6:8f:0f:4b:32:e1",
            "net13": "42:4b:c1:a7:29:dc",
            "net14": "62:1e:c6:07:11:41",
            "net15": "ce:dc:a8:c3:91:59",
            "net2": "0a:94:4b:08:de:49",
            "net3": "1e:9f:cb:a8:45:f1",
            "net4": "8e:9f:90:cd:c7:e0",
            "net5": "5a:00:fd:20:cf:dd",
            "net6": "52:84:73:b6:39:e3",
            "net7": "4e:94:1d:26:a7:fa",
            "net8": "06:44:a7:86:da:bb",
            "net9": "ca:22:a0:8b:e8:48"
        },
        "tof_1_2_5": {
            "net0": "ee:14:fe:71:50:e4",
            "net1": "1e:53:f1:ed:19:04",
            "net10": "ce:d0:00:01:77:9d",
            "net11": "aa:44:dd:69:ee:75",
            "net12": "a6:5f:51:5b:9a:74",
            "net13": "66:46:96:4e:f1:5e",
            "net14": "2e:bf:ee:a7:25:75",
            "net15": "d6:f4:63:82:ad:5c",
            "net2": "fe:bf:46:32:32:d6",
            "net3": "f6:b4:5d:d4:d9:d4",
            "net4": "66:56:e9:90:a3:bc",
            "net5": "46:d8:84:32:2a:0b",
            "net6": "ee:a8:49:7f:28:62",
            "net7": "56:a6:3d:dc:9e:05",
            "net8": "ae:2b:41:1c:c8:2b",
            "net9": "d6:8e:d3:a5:56:3b"
        },
        "tof_1_2_6": {
            "net0": "42:96:4b:c4:90:ee",
            "net1": "46:1f:b5:41:be:7a",
            "net10": "32:c7:ca:f6:06:1f",
            "net11": "c6:a2:81:93:65:4a",
            "net12": "d6:22:a6:92:c6:1e",
            "net13": "12:07:b1:6b:ed:f2",
            "net14": "ba:be:f8:c6:70:b4",
            "net15": "9e:46:31:ab:6f:d6",
            "net2": "2e:b1:ff:0e:98:68",
            "net3": "8e:a9:f7:54:af:f5",
            "net4": "3e:1d:80:93:49:d5",
            "net5": "aa:bd:85:36:79:bf",
            "net6": "72:a7:df:93:a6:58",
            "net7": "92:61:7e:8e:15:d0",
            "net8": "be:f7:42:17:0c:f9",
            "net9": "7a:4e:bb:cc:ee:9c"
        },
        "tof_1_2_7": {
            "net0": "fe:64:10:af:22:ee",
            "net1": "9e:90:52:9e:0b:a9",
            "net10": "be:2b:97:3b:f1:5b",
            "net11": "92:f8:8e:36:fb:87",
            "net12": "82:3c:54:f7:27:40",
            "net13": "3e:b3:8e:e8:b2:7b",
            "net14": "36:f2:02:51:ce:0f",
            "net15": "0a:7e:35:37:79:d8",
            "net2": "8a:de:d3:ff:9e:eb",
            "net3": "ce:30:af:df:3e:07",
            "net4": "52:cb:75:77:18:f7",
            "net5": "aa:56:f4:00:28:d1",
            "net6": "5a:28:c4:82:1f:74",
            "net7": "fe:9d:d4:c7:04:7a",
            "net8": "de:02:28:31:0e:d1",
            "net9": "92:cf:b3:6c:2e:e6"
        },
        "tof_1_2_8": {
            "net0": "ae:ea:df:2f:b0:f3",
            "net1": "92:ba:55:c3:b8:ca",
            "net10": "0e:b4:b9:d6:43:3b",
            "net11": "d6:11:6b:6a:f4:8d",
            "net12": "5a:8d:06:8d:fe:af",
            "net13": "0a:3f:ea:9c:fe:37",
            "net14": "5e:d2:68:fd:2c:e3",
            "net15": "46:82:8e:2c:0e:49",
            "net2": "06:db:16:92:82:e9",
            "net3": "3a:46:45:31:71:16",
            "net4": "d2:3d:63:b1:13:34",
            "net5": "5a:d2:8b:c6:2c:6b",
            "net6": "c6:81:6c:f3:38:f8",
            "net7": "66:d8:86:ea:bf:e5",
            "net8": "62:f0:0a:c7:85:c1",
            "net9": "4a:d6:2f:0b:57:f8"
        }
    },
    "failed_machine": "spine_1_1_1",
    "failure_time": {
        "leaf_1_0_1": 1636070302.9788704,
        "leaf_1_0_2": 1636070302.9883528,
        "leaf_1_0_3": 1636070302.996827,
        "leaf_1_0_4": 1636070303.0114293,
        "leaf_1_0_5": 1636070303.0220795,
        "leaf_1_0_6": 1636070302.9792852,
        "leaf_1_0_7": 1636070302.9902697,
        "leaf_1_0_8": 1636070302.9978406,
        "leaf_2_0_1": 1636070303.0124934,
        "leaf_2_0_2": 1636070303.0262036,
        "leaf_2_0_3": 1636070303.5570755,
        "leaf_2_0_4": 1636070303.5646303,
        "leaf_2_0_5": 1636070303.0497954,
        "leaf_2_0_6": 1636070303.0632958,
        "leaf_2_0_7": 1636070303.599797,
        "leaf_2_0_8": 1636070303.0344596,
        "spine_1_1_1": 1636070303.0555482,
        "spine_1_1_2": 1636070303.0623822,
        "spine_1_1_3": 1636070303.5979993,
        "spine_1_1_4": 1636070303.0821543,
        "spine_1_1_5": 1636070303.0932717,
        "spine_1_1_6": 1636070303.102753,
        "spine_1_1_7": 1636070303.1101828,
        "spine_1_1_8": 1636070303.1179843,
        "spine_2_1_1": 1636070303.1263027,
        "spine_2_1_2": 1636070303.095779,
        "spine_2_1_3": 1636070303.1044712,
        "spine_2_1_4": 1636070303.1126554,
        "spine_2_1_5": 1636070303.1206334,
        "spine_2_1_6": 1636070303.1281178,
        "spine_2_1_7": 1636070303.1354246,
        "spine_2_1_8": 1636070303.1443672,
        "tof_1_2_1": 1636070303.1548898,
        "tof_1_2_2": 1636070303.1623993,
        "tof_1_2_3": 1636070303.1735954,
        "tof_1_2_4": 1636070303.1394193,
        "tof_1_2_5": 1636070303.6757822,
        "tof_1_2_6": 1636070303.1635888,
        "tof_1_2_7": 1636070303.172739,
        "tof_1_2_8": 1636070303.7108564
    }
}