{
    "k_leaf": 4,
    "k_top": 4,
    "redundancy_factor": 4,
    "is_k8s": false,
    "machine_mac_addresses": {
        "leaf_1_0_1": {
            "eth0": "3e:82:4a:63:21:19",
            "eth1": "2a:18:20:bc:f9:24",
            "eth2": "0a:df:17:3f:7b:86",
            "eth3": "fa:9e:ff:2e:65:23",
            "eth4": "96:10:5a:96:f9:e5"
        },
        "leaf_1_0_2": {
            "eth0": "46:f0:11:21:34:e4",
            "eth1": "ee:d4:78:6e:68:4f",
            "eth2": "8a:ef:99:60:dd:f9",
            "eth3": "9e:8a:31:03:31:fb",
            "eth4": "c2:28:18:07:20:b0"
        },
        "leaf_1_0_3": {
            "eth0": "9a:6e:4e:08:ee:cd",
            "eth1": "b6:44:7a:e6:c7:33",
            "eth2": "e2:72:40:7e:73:97",
            "eth3": "f2:19:f9:c7:a6:7f",
            "eth4": "76:c1:f1:47:12:49"
        },
        "leaf_1_0_4": {
            "eth0": "da:c7:39:fd:1d:67",
            "eth1": "26:5a:f7:7d:bb:87",
            "eth2": "86:ea:81:f2:e5:83",
            "eth3": "8a:c0:2f:70:94:cc",
            "eth4": "96:b4:18:d0:d8:02"
        },
        "leaf_2_0_1": {
            "eth0": "5a:c6:ea:a8:04:cf",
            "eth1": "06:55:e8:38:41:36",
            "eth2": "b2:f6:c5:98:06:25",
            "eth3": "9e:aa:b4:56:77:a0",
            "eth4": "a2:4f:bc:8d:02:d9"
        },
        "leaf_2_0_2": {
            "eth0": "26:4c:a0:13:27:80",
            "eth1": "12:2c:a8:5f:d3:70",
            "eth2": "22:6b:8c:08:fd:55",
            "eth3": "ce:ba:e8:43:32:f5",
            "eth4": "aa:71:1b:aa:71:ee"
        },
        "leaf_2_0_3": {
            "eth0": "62:96:d6:20:d0:b4",
            "eth1": "ea:82:a2:88:a7:6c",
            "eth2": "ce:60:0c:05:3e:7c",
            "eth3": "56:b1:fb:20:37:5c",
            "eth4": "46:df:02:19:0c:a6"
        },
        "leaf_2_0_4": {
            "eth0": "7a:c1:d9:8d:13:bf",
            "eth1": "c2:ea:c1:24:37:e2",
            "eth2": "4e:50:2b:03:07:a3",
            "eth3": "4e:cb:ff:42:5f:0e",
            "eth4": "66:8f:cc:4d:bf:b0"
        },
        "spine_1_1_1": {
            "eth0": "52:51:78:48:8e:fc",
            "eth1": "ba:54:8d:6b:8f:64",
            "eth2": "aa:82:8d:d6:c4:66",
            "eth3": "6e:b2:dc:9d:12:59",
            "eth4": "3a:5c:4f:01:ed:3f",
            "eth5": "ee:6f:82:66:0d:91",
            "eth6": "7e:26:1c:d2:9f:d9",
            "eth7": "1e:8d:ca:61:f5:4d"
        },
        "spine_1_1_2": {
            "eth0": "5e:78:73:9c:52:7c",
            "eth1": "86:e0:cc:a0:9d:f0",
            "eth2": "6e:fd:76:fc:63:9a",
            "eth3": "96:2d:64:31:e0:0b",
            "eth4": "fe:1e:82:b6:5d:f7",
            "eth5": "3a:a7:f7:3b:15:db",
            "eth6": "36:51:5b:4c:37:45",
            "eth7": "82:bc:34:f9:ff:81"
        },
        "spine_1_1_3": {
            "eth0": "86:23:b9:81:4d:2f",
            "eth1": "aa:82:67:15:5d:51",
            "eth2": "36:ca:ac:23:8e:77",
            "eth3": "f2:75:4e:fe:e6:bc",
            "eth4": "4a:f3:1b:77:3e:2a",
            "eth5": "92:3e:e9:e4:6f:ae",
            "eth6": "ae:34:f4:8c:03:58",
            "eth7": "12:93:4a:93:2c:70"
        },
        "spine_1_1_4": {
            "eth0": "5e:5d:31:09:36:fb",
            "eth1": "62:4b:cc:99:36:a5",
            "eth2": "76:cc:95:10:6f:35",
            "eth3": "4e:48:8d:bf:a1:28",
            "eth4": "ba:0e:8e:f7:0e:b0",
            "eth5": "2e:6b:9c:e0:81:79",
            "eth6": "ce:fa:19:d0:2a:52",
            "eth7": "0e:90:71:27:02:9f"
        },
        "spine_2_1_1": {
            "eth0": "06:ac:af:a7:74:a8",
            "eth1": "22:7e:5d:d1:f2:b8",
            "eth2": "96:f0:81:84:57:55",
            "eth3": "ba:8c:33:5e:fe:75",
            "eth4": "3a:35:02:ce:90:88",
            "eth5": "82:be:1f:f6:10:c6",
            "eth6": "42:d9:19:45:f8:fb",
            "eth7": "02:5f:b3:29:8f:2a"
        },
        "spine_2_1_2": {
            "eth0": "7a:b8:11:8a:ce:f2",
            "eth1": "fe:db:e7:c0:96:ee",
            "eth2": "9a:62:f6:8b:a1:e8",
            "eth3": "12:3a:e9:23:b5:cc",
            "eth4": "da:07:5f:fd:1b:70",
            "eth5": "fe:36:6d:53:97:fa",
            "eth6": "ba:99:94:32:5e:b6",
            "eth7": "b2:28:8e:c6:0d:6a"
        },
        "spine_2_1_3": {
            "eth0": "ce:a6:30:02:51:d5",
            "eth1": "56:ed:4f:58:2d:fb",
            "eth2": "1a:31:72:28:39:07",
            "eth3": "fa:6b:96:36:21:80",
            "eth4": "2a:b6:cf:0a:e3:26",
            "eth5": "1e:6e:7b:d8:4a:f3",
            "eth6": "fa:39:45:48:bd:22",
            "eth7": "a6:f6:19:cb:80:ef"
        },
        "spine_2_1_4": {
            "eth0": "f2:73:d0:01:6e:96",
            "eth1": "ca:7b:30:5c:f8:35",
            "eth2": "d2:5c:08:a8:a0:35",
            "eth3": "0a:4f:7a:7b:d8:a8",
            "eth4": "e6:65:69:ed:57:60",
            "eth5": "3a:32:76:74:f7:60",
            "eth6": "4e:da:16:3a:9e:b7",
            "eth7": "16:ee:48:14:3a:55"
        },
        "tof_1_2_1": {
            "eth0": "32:5d:9e:7f:90:90",
            "eth1": "32:cd:e3:5f:40:f6",
            "eth2": "86:b5:1b:6b:fa:e1",
            "eth3": "42:e6:30:d8:d9:32",
            "eth4": "1a:6a:c0:ac:9b:8e",
            "eth5": "ee:7c:3d:fa:c9:a1",
            "eth6": "b2:7d:ef:3c:55:63",
            "eth7": "26:eb:d2:96:25:ee"
        },
        "tof_1_2_2": {
            "eth0": "16:32:cf:c2:5b:da",
            "eth1": "ea:72:59:f0:19:7b",
            "eth2": "4e:f4:e8:d3:67:79",
            "eth3": "f6:2e:44:71:4c:1e",
            "eth4": "32:ca:49:c2:76:10",
            "eth5": "32:2b:9e:ab:0d:54",
            "eth6": "e2:97:fe:09:29:cb",
            "eth7": "32:9c:a6:85:12:7c"
        },
        "tof_1_2_3": {
            "eth0": "72:ab:04:86:ba:1e",
            "eth1": "1e:49:30:70:79:f3",
            "eth2": "2a:55:23:55:0a:29",
            "eth3": "e6:97:63:68:5c:79",
            "eth4": "9e:7b:a2:3f:d1:5c",
            "eth5": "6a:39:0e:18:21:07",
            "eth6": "96:f3:94:3d:f4:68",
            "eth7": "da:d9:b1:4c:58:a8"
        },
        "tof_1_2_4": {
            "eth0": "76:2f:46:8e:d7:29",
            "eth1": "fe:4e:fc:f7:f1:3e",
            "eth2": "fe:61:94:a6:f1:8f",
            "eth3": "3e:e1:06:f8:8d:3a",
            "eth4": "c6:65:ce:9b:fd:ab",
            "eth5": "fa:03:b7:e0:bd:ce",
            "eth6": "a2:dc:7c:04:48:9d",
            "eth7": "32:bb:01:e9:7e:41"
        }
    },
    "failed_machine": "leaf_1_0_1",
    "failure_time": {
        "leaf_1_0_1": 1622026704.6473281,
        "leaf_1_0_2": 1622026704.6604118,
        "leaf_1_0_3": 1622026704.6529264,
        "leaf_1_0_4": 1622026704.6708214,
        "leaf_2_0_1": 1622026704.6535764,
        "leaf_2_0_2": 1622026704.6673286,
        "leaf_2_0_3": 1622026704.6542504,
        "leaf_2_0_4": 1622026704.667499,
        "spine_1_1_1": 1622026704.6766193,
        "spine_1_1_2": 1622026704.694847,
        "spine_1_1_3": 1622026704.683712,
        "spine_1_1_4": 1622026704.7078254,
        "spine_2_1_1": 1622026704.6807213,
        "spine_2_1_2": 1622026704.6902242,
        "spine_2_1_3": 1622026704.6851609,
        "spine_2_1_4": 1622026704.7004395,
        "tof_1_2_1": 1622026704.70318,
        "tof_1_2_2": 1622026704.7194018,
        "tof_1_2_3": 1622026704.7154422,
        "tof_1_2_4": 1622026704.7198741
    }
}