{
    "k_leaf": 2,
    "k_top": 2,
    "redundancy_factor": 1,
    "is_k8s": true,
    "machine_mac_addresses": {
        "leaf_1_0_1": {
            "net0": "ba:72:be:21:dc:6d",
            "net1": "72:8f:96:a9:b3:df",
            "net2": "a6:51:1c:86:92:f9"
        },
        "leaf_1_0_2": {
            "net0": "8a:c9:2d:07:0b:44",
            "net1": "62:08:5d:4a:5e:b8",
            "net2": "0e:4f:dd:27:b8:0d"
        },
        "leaf_2_0_1": {
            "net0": "06:2f:39:98:e2:ed",
            "net1": "6a:6a:4f:dd:39:43",
            "net2": "c6:5f:b0:58:d1:ff"
        },
        "leaf_2_0_2": {
            "net0": "f6:f0:d9:12:b7:59",
            "net1": "8a:2d:e6:45:f2:84",
            "net2": "ae:d1:36:1b:50:c1"
        },
        "leaf_3_0_1": {
            "net0": "b2:0b:69:7a:c5:7e",
            "net1": "c6:01:1d:ba:ea:e7",
            "net2": "a6:46:1c:a4:d3:de"
        },
        "leaf_3_0_2": {
            "net0": "d2:73:b6:f2:89:e6",
            "net1": "1a:63:55:f4:75:38",
            "net2": "2e:03:ec:32:67:f4"
        },
        "leaf_4_0_1": {
            "net0": "ae:13:e1:e6:c0:66",
            "net1": "7a:2d:69:13:2b:ca",
            "net2": "9a:79:52:58:ae:21"
        },
        "leaf_4_0_2": {
            "net0": "22:b4:03:6e:c6:0b",
            "net1": "52:f5:f7:26:7a:04",
            "net2": "26:c9:6a:76:c0:8f"
        },
        "spine_1_1_1": {
            "net0": "be:fa:da:ea:b4:15",
            "net1": "46:49:bd:71:83:ca",
            "net2": "da:dc:8d:ac:ca:3b",
            "net3": "d6:73:5f:82:a6:ed"
        },
        "spine_1_1_2": {
            "net0": "3e:66:ac:57:c0:ba",
            "net1": "6e:3d:a5:75:d6:73",
            "net2": "ba:11:b0:a6:fa:3a",
            "net3": "82:36:e2:c9:e8:60"
        },
        "spine_2_1_1": {
            "net0": "b6:a1:f5:1e:f0:c1",
            "net1": "d2:1b:33:15:71:63",
            "net2": "6e:d5:5f:38:13:10",
            "net3": "e2:5a:ad:d8:83:b2"
        },
        "spine_2_1_2": {
            "net0": "5e:2d:9c:ba:8b:a2",
            "net1": "6e:97:69:83:d3:44",
            "net2": "8a:f0:ae:01:a7:fa",
            "net3": "de:68:b5:3c:97:50"
        },
        "spine_3_1_1": {
            "net0": "1a:d9:00:04:0e:34",
            "net1": "0e:ea:ad:b5:a2:54",
            "net2": "76:ee:fb:68:53:17",
            "net3": "1e:67:19:9c:a3:ba"
        },
        "spine_3_1_2": {
            "net0": "76:1a:31:bd:dc:f2",
            "net1": "de:92:34:74:ba:fa",
            "net2": "46:b9:f9:10:10:50",
            "net3": "e2:99:c3:b1:21:d4"
        },
        "spine_4_1_1": {
            "net0": "22:f7:aa:db:1c:12",
            "net1": "a6:29:ae:16:40:3f",
            "net2": "ae:8a:23:65:cc:5d",
            "net3": "f6:31:07:b6:82:f0"
        },
        "spine_4_1_2": {
            "net0": "42:c1:04:d0:fa:1d",
            "net1": "ae:41:62:61:6a:1f",
            "net2": "c6:22:8e:c2:1d:ed",
            "net3": "5a:5b:15:71:11:ad"
        },
        "tof_1_2_1": {
            "net0": "26:d5:c4:f6:81:0b",
            "net1": "42:35:52:0a:1e:3b",
            "net2": "ca:12:88:f9:92:12",
            "net3": "42:b5:6e:dc:45:48"
        },
        "tof_1_2_2": {
            "net0": "46:40:ac:9b:40:fd",
            "net1": "16:3a:19:fb:a0:73",
            "net2": "7e:87:60:7c:cb:bb",
            "net3": "e2:1c:10:b8:a4:11"
        },
        "tof_2_2_1": {
            "net0": "72:cd:dc:54:1b:3a",
            "net1": "ce:34:d6:16:20:09",
            "net2": "b6:a4:ca:cf:45:77",
            "net3": "a2:a1:2f:6f:8e:95"
        },
        "tof_2_2_2": {
            "net0": "6a:50:7e:c5:74:cd",
            "net1": "7e:6f:f9:62:90:17",
            "net2": "9e:90:b3:f0:b9:7f",
            "net3": "5e:4c:66:4c:8e:6b"
        }
    },
    "failed_machine": "leaf_1_0_1",
    "failed_interfaces": [
        "net0"
    ],
    "failure_time": {
        "leaf_1_0_1": 1634634477.8188467,
        "leaf_1_0_2": 1634634477.8253627,
        "leaf_2_0_1": 1634634480.7500553,
        "leaf_2_0_2": 1634634477.8193936,
        "leaf_3_0_1": 1634634480.752712,
        "leaf_3_0_2": 1634634483.366901,
        "leaf_4_0_1": 1634634480.7867017,
        "leaf_4_0_2": 1634634484.5064802,
        "spine_1_1_1": 1634634484.5282488,
        "spine_1_1_2": 1634634484.5063863,
        "spine_2_1_1": 1634634485.4832232,
        "spine_2_1_2": 1634634487.1187928,
        "spine_3_1_1": 1634634485.6405163,
        "spine_3_1_2": 1634634487.109671,
        "spine_4_1_1": 1634634487.1182418,
        "spine_4_1_2": 1634634487.2707715,
        "tof_1_2_1": 1634634487.3800306,
        "tof_1_2_2": 1634634487.4165165,
        "tof_2_2_1": 1634634488.7818422,
        "tof_2_2_2": 1634634488.888905
    },
    "recover_time": {
        "leaf_1_0_1": 1634634558.3887565,
        "leaf_1_0_2": 1634634558.3982058,
        "leaf_2_0_1": 1634634558.412346,
        "leaf_2_0_2": 1634634558.3888774,
        "leaf_3_0_1": 1634634558.3996844,
        "leaf_3_0_2": 1634634558.4162126,
        "leaf_4_0_1": 1634634558.422039,
        "leaf_4_0_2": 1634634558.4450078,
        "spine_1_1_1": 1634634558.8207479,
        "spine_1_1_2": 1634634558.4237938,
        "spine_2_1_1": 1634634559.5371387,
        "spine_2_1_2": 1634634559.6252515,
        "spine_3_1_1": 1634634559.8034976,
        "spine_3_1_2": 1634634559.8151777,
        "spine_4_1_1": 1634634560.1425257,
        "spine_4_1_2": 1634634559.7784708,
        "tof_1_2_1": 1634634559.8001623,
        "tof_1_2_2": 1634634559.9519916,
        "tof_2_2_1": 1634634560.2959404,
        "tof_2_2_2": 1634634561.033696
    }
}