{
    "k_leaf": 12,
    "k_top": 12,
    "redundancy_factor": 12,
    "is_k8s": true,
    "machine_mac_addresses": {
        "leaf_1_0_1": {
            "net0": "16:88:34:d7:21:ed",
            "net1": "92:de:02:a8:a4:92",
            "net10": "b6:89:f1:27:33:4e",
            "net11": "12:97:fc:d9:21:5b",
            "net12": "e6:63:8a:18:b7:8e",
            "net2": "6e:62:ba:08:62:7d",
            "net3": "2a:01:e3:a7:f5:87",
            "net4": "5e:e8:a2:47:74:c7",
            "net5": "32:bb:a7:14:ef:8a",
            "net6": "06:40:e0:37:6c:42",
            "net7": "da:39:89:46:d7:5d",
            "net8": "ba:d0:fa:1d:16:a9",
            "net9": "a6:76:93:c7:86:54"
        },
        "leaf_1_0_10": {
            "net0": "de:d8:cf:12:de:4f",
            "net1": "ce:9d:00:fd:48:c6",
            "net10": "36:31:ae:88:67:82",
            "net11": "c2:f2:64:5c:db:52",
            "net12": "96:e0:98:b4:84:bd",
            "net2": "7a:a4:1f:4d:d0:41",
            "net3": "72:f4:e9:41:bb:05",
            "net4": "f6:5a:de:e8:6d:78",
            "net5": "8a:04:9c:5f:cb:11",
            "net6": "ca:98:d9:3f:4f:51",
            "net7": "16:19:ea:b3:48:2e",
            "net8": "be:c2:b4:e8:97:dd",
            "net9": "ea:23:86:5d:9b:8d"
        },
        "leaf_1_0_11": {
            "net0": "66:01:9d:a6:9e:aa",
            "net1": "02:12:7c:1c:77:97",
            "net10": "4a:98:4c:17:17:bd",
            "net11": "d6:6c:b6:37:1a:b5",
            "net12": "fa:96:3e:5d:48:8f",
            "net2": "02:f2:d5:fe:42:31",
            "net3": "f2:96:bf:bc:23:08",
            "net4": "2e:d1:aa:e0:ab:99",
            "net5": "3e:d8:c8:b6:11:8f",
            "net6": "52:af:7e:df:1c:9d",
            "net7": "9e:e1:ee:0b:0e:c2",
            "net8": "f2:ad:d0:56:c7:11",
            "net9": "32:9e:be:03:1c:84"
        },
        "leaf_1_0_12": {
            "net0": "8a:a0:8d:8c:38:e0",
            "net1": "56:7d:e8:84:42:24",
            "net10": "9e:f2:43:03:5a:32",
            "net11": "8e:6a:59:a7:58:4f",
            "net12": "92:a8:fc:63:55:4e",
            "net2": "56:4d:09:89:7f:f6",
            "net3": "c2:2b:19:c8:49:6f",
            "net4": "0a:92:21:60:cf:97",
            "net5": "f6:87:a3:12:4b:91",
            "net6": "be:39:9e:db:7f:f7",
            "net7": "c2:24:b0:3c:2a:c1",
            "net8": "62:56:11:96:39:5d",
            "net9": "a6:9f:c4:8e:e8:1d"
        },
        "leaf_1_0_2": {
            "net0": "22:9c:46:54:08:d7",
            "net1": "f6:d4:da:94:bb:16",
            "net10": "3a:4a:bd:96:6d:ca",
            "net11": "5e:80:17:23:48:fa",
            "net12": "72:bd:9d:b7:71:1e",
            "net2": "4e:87:f2:e6:47:1b",
            "net3": "1a:41:42:0e:54:a4",
            "net4": "aa:13:e9:28:28:0e",
            "net5": "32:44:86:da:0b:ee",
            "net6": "a2:34:97:fc:a4:6a",
            "net7": "16:5a:8e:af:69:86",
            "net8": "7a:84:50:52:70:32",
            "net9": "b6:d2:b6:90:42:60"
        },
        "leaf_1_0_3": {
            "net0": "6e:49:05:7a:a2:c5",
            "net1": "4a:12:d2:ba:d0:0d",
            "net10": "0e:c3:0e:c1:2b:1a",
            "net11": "1a:1a:86:09:db:0b",
            "net12": "52:54:f7:22:37:86",
            "net2": "0a:24:db:ae:f7:61",
            "net3": "2a:92:99:9d:59:e3",
            "net4": "72:93:23:dc:f1:16",
            "net5": "4e:41:db:5f:50:0b",
            "net6": "5e:dc:39:e2:83:6c",
            "net7": "a2:cb:4e:2c:51:93",
            "net8": "76:35:e6:b8:88:53",
            "net9": "6e:1e:a8:33:a4:ec"
        },
        "leaf_1_0_4": {
            "net0": "fe:fb:5e:8f:97:3d",
            "net1": "02:6d:83:0b:40:4a",
            "net10": "8a:0f:e2:cf:80:ea",
            "net11": "92:3e:d2:22:bf:7b",
            "net12": "42:9a:53:ca:87:03",
            "net2": "ee:d8:73:ad:3d:c9",
            "net3": "be:78:47:07:40:c5",
            "net4": "8a:3e:06:51:f8:95",
            "net5": "da:b2:ec:08:52:72",
            "net6": "ba:76:f2:53:f8:22",
            "net7": "a2:73:fc:fd:aa:46",
            "net8": "8a:85:d3:0f:f9:2b",
            "net9": "d6:38:ea:8c:65:80"
        },
        "leaf_1_0_5": {
            "net0": "6a:6c:d3:ae:34:55",
            "net1": "d2:fa:e0:7e:7d:5c",
            "net10": "a6:72:37:a3:87:ca",
            "net11": "9a:05:99:e0:0d:db",
            "net12": "12:26:06:12:81:37",
            "net2": "b6:12:e0:89:56:98",
            "net3": "16:7b:97:e1:fe:c6",
            "net4": "42:d6:0f:62:d0:81",
            "net5": "ce:4f:72:71:f7:0c",
            "net6": "26:79:59:cc:fc:33",
            "net7": "5e:cd:06:f1:8c:02",
            "net8": "72:f9:95:74:22:d2",
            "net9": "8a:ca:f5:18:af:fc"
        },
        "leaf_1_0_6": {
            "net0": "22:29:75:8a:f5:4f",
            "net1": "16:f1:26:38:fe:fe",
            "net10": "a6:0f:c4:05:d9:12",
            "net11": "46:db:cc:b9:f6:40",
            "net12": "6e:85:f4:63:05:c4",
            "net2": "06:3f:4d:41:e9:9b",
            "net3": "ae:80:ba:d1:b2:13",
            "net4": "da:62:c6:64:e0:60",
            "net5": "4e:d8:8c:b3:62:a6",
            "net6": "da:91:4c:2f:06:ec",
            "net7": "ae:be:3a:82:1a:a9",
            "net8": "3e:a2:18:00:76:48",
            "net9": "aa:d4:b9:d2:6b:ea"
        },
        "leaf_1_0_7": {
            "net0": "be:e2:9e:e3:96:72",
            "net1": "ce:82:7c:ff:37:cb",
            "net10": "a6:51:f8:d6:c6:4d",
            "net11": "12:93:a1:7f:fa:08",
            "net12": "9e:ce:59:42:c2:20",
            "net2": "7a:7e:43:1f:57:98",
            "net3": "32:40:7f:7b:c0:b3",
            "net4": "ee:13:14:70:80:80",
            "net5": "32:de:cf:d6:c7:7c",
            "net6": "f2:b3:35:0d:96:df",
            "net7": "ea:ba:14:98:00:bb",
            "net8": "d2:90:41:e6:07:0f",
            "net9": "f2:42:55:c7:aa:b5"
        },
        "leaf_1_0_8": {
            "net0": "1e:36:06:03:2b:f4",
            "net1": "86:0d:29:c6:b5:f7",
            "net10": "72:d5:14:58:55:e0",
            "net11": "c6:f2:f6:2c:be:9c",
            "net12": "a2:eb:e0:e9:b4:78",
            "net2": "2a:f0:cc:45:f7:9a",
            "net3": "36:21:4e:e4:11:31",
            "net4": "66:92:e9:cb:42:3f",
            "net5": "86:09:db:9f:a9:14",
            "net6": "5a:65:22:dc:1e:ae",
            "net7": "76:e5:e1:24:7c:13",
            "net8": "9e:89:2f:5c:f9:12",
            "net9": "62:ef:a2:e1:20:78"
        },
        "leaf_1_0_9": {
            "net0": "72:0e:cd:da:72:56",
            "net1": "36:a3:4b:15:b0:55",
            "net10": "76:b0:e0:63:4c:6a",
            "net11": "4e:5b:d9:1c:6c:de",
            "net12": "b6:0a:cb:8a:1a:c2",
            "net2": "b2:e0:50:dc:df:c8",
            "net3": "3e:cb:cd:10:0b:73",
            "net4": "9a:2b:ed:5f:8e:59",
            "net5": "ca:11:aa:13:be:bf",
            "net6": "2e:6f:1b:02:ad:6b",
            "net7": "f6:e0:f0:a8:00:05",
            "net8": "92:6a:b4:d4:f6:70",
            "net9": "ae:86:c4:c8:a5:24"
        },
        "leaf_2_0_1": {
            "net0": "ee:8d:c1:bb:14:6d",
            "net1": "ae:3d:86:7e:24:66",
            "net10": "ba:72:7c:08:7b:19",
            "net11": "b6:e7:71:ca:e1:b2",
            "net12": "da:bd:7f:08:df:ab",
            "net2": "72:aa:d2:eb:69:7c",
            "net3": "5e:d4:19:9a:b1:e9",
            "net4": "16:45:bb:94:30:ac",
            "net5": "fa:63:a2:c6:93:9d",
            "net6": "1a:57:81:20:8e:1a",
            "net7": "3a:55:87:67:75:63",
            "net8": "6e:a9:81:9f:1e:9b",
            "net9": "da:a8:05:d0:f2:18"
        },
        "leaf_2_0_10": {
            "net0": "46:d4:2f:2f:71:b0",
            "net1": "d2:c1:f7:6f:6a:ec",
            "net10": "e6:22:7c:6d:96:ec",
            "net11": "8a:1e:97:29:90:57",
            "net12": "4e:db:4e:f9:fa:33",
            "net2": "1a:0b:74:ea:e8:0e",
            "net3": "32:11:ec:3a:88:fd",
            "net4": "b2:f0:d1:64:15:ff",
            "net5": "96:3e:24:b5:89:0d",
            "net6": "5a:53:cd:ee:ed:0a",
            "net7": "a2:56:50:10:55:b2",
            "net8": "36:b8:86:59:94:4e",
            "net9": "4e:88:7b:c0:a1:13"
        },
        "leaf_2_0_11": {
            "net0": "aa:c0:57:95:cd:12",
            "net1": "b2:6e:ec:1c:ba:b9",
            "net10": "ce:4c:5b:df:9b:03",
            "net11": "7a:e1:29:58:88:2f",
            "net12": "26:35:fc:7e:77:6b",
            "net2": "ee:b5:ac:10:db:79",
            "net3": "f6:53:05:a9:c1:13",
            "net4": "d6:a4:f1:47:0b:69",
            "net5": "72:98:b0:45:a1:a7",
            "net6": "7e:e1:86:7c:55:f1",
            "net7": "1a:32:9b:81:b8:b5",
            "net8": "2a:aa:d5:60:76:21",
            "net9": "82:8d:13:66:46:f5"
        },
        "leaf_2_0_12": {
            "net0": "32:f0:42:be:25:ba",
            "net1": "32:d0:9b:4e:7f:4e",
            "net10": "1e:ff:67:16:dc:ab",
            "net11": "5a:96:55:3d:96:97",
            "net12": "be:33:77:e6:35:1d",
            "net2": "7a:b9:81:76:f9:3c",
            "net3": "a6:dc:9a:d5:79:8f",
            "net4": "da:02:4f:df:c8:91",
            "net5": "ce:35:03:d5:63:07",
            "net6": "36:32:f6:66:f3:bc",
            "net7": "ea:16:ee:84:57:aa",
            "net8": "ee:ab:e7:ff:46:2b",
            "net9": "b2:74:60:16:1a:1f"
        },
        "leaf_2_0_2": {
            "net0": "36:7c:b5:4c:7a:6e",
            "net1": "86:f6:0b:62:1c:cb",
            "net10": "4a:8d:63:66:90:6b",
            "net11": "2e:17:cc:84:1a:ff",
            "net12": "06:a1:a2:d8:9c:a3",
            "net2": "72:19:b3:6c:2a:ed",
            "net3": "46:bf:05:24:e7:60",
            "net4": "b6:5d:34:41:6b:f3",
            "net5": "be:03:90:63:f9:b6",
            "net6": "8e:5e:5e:3e:bf:2e",
            "net7": "2e:c8:f8:ee:d3:ce",
            "net8": "f2:2f:a1:8d:2a:69",
            "net9": "ba:94:4b:2e:c7:bc"
        },
        "leaf_2_0_3": {
            "net0": "66:f0:68:70:ec:63",
            "net1": "62:00:e6:fe:fd:4c",
            "net10": "4e:95:e3:72:d6:69",
            "net11": "3e:79:43:be:f9:f7",
            "net12": "ca:e2:67:a3:d2:2c",
            "net2": "42:f1:98:05:2d:fc",
            "net3": "c2:12:0d:81:c0:ff",
            "net4": "ea:3d:1c:4c:fa:42",
            "net5": "36:54:4a:33:6b:93",
            "net6": "c6:c1:5f:c9:7b:9b",
            "net7": "fe:9c:86:88:2e:ef",
            "net8": "56:7c:1a:ad:86:c1",
            "net9": "66:f4:8d:a7:b6:fb"
        },
        "leaf_2_0_4": {
            "net0": "82:1b:74:83:59:8d",
            "net1": "e2:72:47:11:16:d3",
            "net10": "5e:73:4c:05:8c:ac",
            "net11": "86:4a:14:db:95:00",
            "net12": "52:e5:61:fa:3e:15",
            "net2": "62:0b:29:86:fa:e7",
            "net3": "16:f0:e2:31:48:d7",
            "net4": "0e:fa:cf:67:91:a1",
            "net5": "92:a9:95:7f:7a:09",
            "net6": "a2:3a:ce:21:71:66",
            "net7": "c6:0b:d6:3e:e3:f5",
            "net8": "1e:47:be:63:6c:5b",
            "net9": "fa:bf:f5:cf:6d:43"
        },
        "leaf_2_0_5": {
            "net0": "d6:4e:d8:b0:33:b4",
            "net1": "7a:91:ac:09:70:ba",
            "net10": "5a:31:cc:b2:65:28",
            "net11": "8a:a7:38:04:96:be",
            "net12": "a2:10:b5:c4:4a:32",
            "net2": "2a:60:95:74:3d:0f",
            "net3": "76:b0:fb:df:6e:af",
            "net4": "ee:9a:4b:27:c1:16",
            "net5": "32:c5:94:4c:22:bd",
            "net6": "e2:81:52:1d:85:49",
            "net7": "4a:f9:b4:83:2e:31",
            "net8": "32:e7:02:a9:51:80",
            "net9": "ee:c9:7a:a0:17:00"
        },
        "leaf_2_0_6": {
            "net0": "2a:2b:b9:a2:32:f9",
            "net1": "ca:99:fb:eb:b5:b8",
            "net10": "2e:bd:c7:ee:1c:9a",
            "net11": "ba:aa:8d:22:ff:61",
            "net12": "1a:3b:2f:78:b9:92",
            "net2": "12:50:7e:95:1b:d0",
            "net3": "2a:b7:53:ed:92:2e",
            "net4": "7a:cd:7e:f5:4c:9d",
            "net5": "fa:24:87:1c:1b:34",
            "net6": "0a:25:17:b3:e1:d5",
            "net7": "a6:a9:b8:3c:a9:ef",
            "net8": "16:ee:95:0e:8a:0e",
            "net9": "aa:96:cb:21:bb:ab"
        },
        "leaf_2_0_7": {
            "net0": "d6:87:30:a7:d3:10",
            "net1": "56:75:53:8d:de:71",
            "net10": "8a:47:e6:08:a0:09",
            "net11": "92:74:1b:9e:b5:b1",
            "net12": "16:95:6a:fb:9e:df",
            "net2": "6a:a1:24:35:57:40",
            "net3": "d6:7e:51:7f:73:e6",
            "net4": "9a:7e:3a:fb:06:6f",
            "net5": "02:0d:95:e6:8e:ad",
            "net6": "9a:0a:fb:aa:e3:11",
            "net7": "3e:03:94:c2:77:76",
            "net8": "fa:f5:aa:46:ce:87",
            "net9": "ea:83:f9:ae:5b:7f"
        },
        "leaf_2_0_8": {
            "net0": "76:61:df:17:26:b3",
            "net1": "8e:2a:47:ac:5e:76",
            "net10": "3e:b9:fd:62:d3:6d",
            "net11": "c6:6c:0e:c2:17:b1",
            "net12": "ea:47:63:88:3e:39",
            "net2": "02:05:c1:09:36:9e",
            "net3": "0a:07:de:fe:f8:67",
            "net4": "4e:cd:6f:38:5e:99",
            "net5": "62:44:de:69:21:75",
            "net6": "06:6c:db:e9:66:ed",
            "net7": "82:5e:72:06:d0:e8",
            "net8": "ba:ec:eb:18:d1:84",
            "net9": "32:ca:bf:de:18:d6"
        },
        "leaf_2_0_9": {
            "net0": "be:4c:5d:ad:d5:a4",
            "net1": "ce:fd:e3:9d:0a:dd",
            "net10": "3a:2b:2c:d0:7c:12",
            "net11": "26:b3:4b:22:60:ec",
            "net12": "5a:c5:c2:82:73:46",
            "net2": "26:49:4e:46:e1:f9",
            "net3": "ba:b4:06:e9:25:9f",
            "net4": "42:4e:aa:25:49:59",
            "net5": "9a:34:5f:e4:8a:91",
            "net6": "b6:32:8f:da:fe:e0",
            "net7": "8a:d6:ce:90:a7:7f",
            "net8": "8a:60:c0:1a:7a:cc",
            "net9": "3e:ec:25:bd:28:d2"
        },
        "spine_1_1_1": {
            "net0": "f2:44:9d:39:ac:e2",
            "net1": "f2:64:26:0a:8b:d8",
            "net10": "d6:d5:ce:f7:b6:0e",
            "net11": "a6:cf:50:fe:c7:fa",
            "net12": "16:62:12:62:53:66",
            "net13": "ea:2f:a9:24:dd:7f",
            "net14": "c2:18:03:d1:da:82",
            "net15": "56:68:ec:49:c5:92",
            "net16": "b6:02:3f:05:47:ee",
            "net17": "42:97:4c:91:c3:ff",
            "net18": "76:8c:a7:bb:d7:91",
            "net19": "3a:0c:46:2e:9a:a5",
            "net2": "fa:bc:c5:38:43:b7",
            "net20": "22:d9:ba:35:df:a5",
            "net21": "2a:84:e2:dc:a0:08",
            "net22": "da:17:67:dc:b9:5f",
            "net23": "7a:d4:d1:ab:8b:48",
            "net3": "76:f8:92:bb:f7:f3",
            "net4": "fe:be:b9:1a:e0:94",
            "net5": "f6:32:70:7f:85:9b",
            "net6": "e2:a8:f5:a3:6b:48",
            "net7": "36:b1:02:61:19:07",
            "net8": "b2:5a:eb:a1:2f:db",
            "net9": "42:da:15:6b:91:a9"
        },
        "spine_1_1_10": {
            "net0": "b2:17:f5:bb:b2:46",
            "net1": "3a:2c:a5:86:4f:a4",
            "net10": "76:56:ce:4d:df:6d",
            "net11": "ee:0e:3a:fa:70:03",
            "net12": "c2:0e:fe:4d:27:05",
            "net13": "96:3b:eb:dc:09:73",
            "net14": "12:c1:5d:60:bd:e1",
            "net15": "f2:ee:81:10:3f:ef",
            "net16": "22:30:18:4c:8d:76",
            "net17": "f2:a6:12:2f:53:98",
            "net18": "e2:aa:b8:01:d5:02",
            "net19": "7e:0d:84:f3:f5:b9",
            "net2": "72:f1:47:3c:47:ad",
            "net20": "8a:46:e0:66:74:b7",
            "net21": "ba:71:7e:ac:03:f5",
            "net22": "fe:64:33:d7:db:fa",
            "net23": "1a:8e:67:39:8b:bd",
            "net3": "f6:6b:28:9d:2a:be",
            "net4": "8e:44:03:14:a2:67",
            "net5": "86:d2:24:d2:0f:16",
            "net6": "8a:2a:2b:0b:24:1f",
            "net7": "8e:92:44:ac:22:15",
            "net8": "0a:c7:54:21:df:65",
            "net9": "72:74:94:b7:3c:2f"
        },
        "spine_1_1_11": {
            "net0": "6e:56:8d:9b:f1:5a",
            "net1": "62:37:fd:a1:30:01",
            "net10": "0e:c1:8a:ea:17:92",
            "net11": "66:b0:f2:8a:f3:30",
            "net12": "1a:c1:48:cd:89:56",
            "net13": "52:19:1b:ba:f1:97",
            "net14": "6a:f4:03:0d:e6:48",
            "net15": "16:5d:2c:40:f1:04",
            "net16": "3a:e5:a2:c3:ca:85",
            "net17": "06:0c:be:bd:a7:99",
            "net18": "ba:cb:87:80:9e:2f",
            "net19": "72:12:14:ea:06:e1",
            "net2": "5a:df:dc:85:0e:7e",
            "net20": "4a:8f:4b:83:da:92",
            "net21": "ba:82:f7:a5:2e:53",
            "net22": "72:c6:fa:e0:1d:85",
            "net23": "72:99:1d:61:96:57",
            "net3": "ce:6f:75:5e:ae:0e",
            "net4": "7e:47:cc:7e:e5:22",
            "net5": "b6:e6:6b:87:86:71",
            "net6": "26:32:6f:f2:21:d6",
            "net7": "4e:2b:e0:1c:bc:df",
            "net8": "26:33:14:ab:cd:c9",
            "net9": "36:86:e6:da:96:26"
        },
        "spine_1_1_12": {
            "net0": "62:3e:df:23:86:08",
            "net1": "e2:a0:ea:ef:3a:06",
            "net10": "46:ad:74:f1:15:7e",
            "net11": "3e:ab:2b:23:25:df",
            "net12": "ae:ef:c2:d0:34:ed",
            "net13": "aa:91:22:1f:63:ff",
            "net14": "06:83:03:98:a8:ad",
            "net15": "a6:42:07:e5:b3:b6",
            "net16": "4a:76:29:1a:74:83",
            "net17": "b6:53:c4:b3:5a:77",
            "net18": "ea:a5:0f:02:0d:ee",
            "net19": "f6:da:48:b5:a1:11",
            "net2": "6e:ac:bb:8d:ec:90",
            "net20": "e6:b7:80:f9:db:ac",
            "net21": "e6:6d:e3:86:ba:e4",
            "net22": "aa:ce:5d:80:94:0d",
            "net23": "4a:6e:f6:ed:e6:77",
            "net3": "c6:a1:e4:2f:b0:7c",
            "net4": "72:7d:e5:8e:bf:e8",
            "net5": "e6:fd:c0:c9:6a:d8",
            "net6": "5a:58:29:ff:19:ef",
            "net7": "8a:c6:6f:9d:85:3a",
            "net8": "3e:ec:92:33:b4:ab",
            "net9": "1a:96:63:56:1f:5a"
        },
        "spine_1_1_2": {
            "net0": "9a:38:bf:f9:6b:db",
            "net1": "0a:3e:4c:34:b8:8a",
            "net10": "1e:97:bf:ff:e1:51",
            "net11": "c2:41:fe:1c:27:36",
            "net12": "a2:2c:ae:79:d0:36",
            "net13": "9e:04:f4:6a:12:78",
            "net14": "8a:40:3b:de:24:f1",
            "net15": "d6:67:00:26:4c:47",
            "net16": "72:77:1b:c0:ed:9d",
            "net17": "72:83:fb:12:ea:3d",
            "net18": "4a:cc:5c:49:4d:9f",
            "net19": "ea:8d:c8:f8:de:8f",
            "net2": "fe:39:97:7a:98:b4",
            "net20": "9a:ae:59:0b:30:2d",
            "net21": "02:17:7a:2e:20:69",
            "net22": "56:21:76:32:7b:3e",
            "net23": "be:b2:38:83:89:82",
            "net3": "ea:d3:3e:71:64:b3",
            "net4": "c2:d5:a8:46:2e:ae",
            "net5": "a6:09:f3:11:88:b6",
            "net6": "46:89:e4:6a:ab:a9",
            "net7": "d6:92:83:4c:ed:a8",
            "net8": "0a:eb:4c:59:0f:4c",
            "net9": "1e:76:e6:4b:f0:cd"
        },
        "spine_1_1_3": {
            "net0": "3a:7d:f5:28:bd:eb",
            "net1": "22:0f:d7:28:e4:a4",
            "net10": "8e:75:9b:4f:2c:99",
            "net11": "22:e1:87:d1:36:ce",
            "net12": "62:5d:db:a7:be:bf",
            "net13": "12:5b:21:fd:47:fb",
            "net14": "4a:74:da:2b:43:3d",
            "net15": "86:eb:aa:cb:ad:49",
            "net16": "8a:db:9d:6f:78:ef",
            "net17": "ba:dd:14:d4:85:b6",
            "net18": "5a:35:06:bb:16:52",
            "net19": "be:33:10:ac:34:84",
            "net2": "e6:38:77:29:2f:72",
            "net20": "9a:99:52:60:80:1e",
            "net21": "1a:40:f1:30:ff:9b",
            "net22": "ce:d6:79:86:75:fe",
            "net23": "aa:5a:b6:49:8e:3a",
            "net3": "d2:d0:30:2b:f7:7a",
            "net4": "ee:77:02:d7:7e:f1",
            "net5": "ba:d3:91:2a:3d:aa",
            "net6": "4e:aa:f8:46:68:16",
            "net7": "fe:af:1f:6a:f2:b0",
            "net8": "ca:e7:b9:40:93:1f",
            "net9": "6e:77:d7:64:04:6c"
        },
        "spine_1_1_4": {
            "net0": "92:b4:8e:24:0e:82",
            "net1": "16:49:cd:e3:1d:12",
            "net10": "2e:5a:a0:68:53:03",
            "net11": "ee:31:35:b4:f8:ba",
            "net12": "3a:3f:d7:92:e0:73",
            "net13": "d2:5d:25:15:30:c8",
            "net14": "d6:9f:cb:9c:7c:6d",
            "net15": "16:9c:46:9d:54:c7",
            "net16": "86:8b:45:69:a0:37",
            "net17": "02:8b:96:96:76:1e",
            "net18": "4a:b9:39:8e:64:47",
            "net19": "3a:01:f4:2f:b7:65",
            "net2": "56:eb:45:63:c7:60",
            "net20": "de:b5:57:d5:47:7f",
            "net21": "8e:78:d5:3d:c4:34",
            "net22": "ca:1c:cd:7d:8e:17",
            "net23": "1a:9c:9a:f0:c3:bf",
            "net3": "aa:7e:87:5a:06:ac",
            "net4": "62:3a:7d:90:39:c4",
            "net5": "c2:ac:11:fb:12:4d",
            "net6": "52:f3:bf:c5:6b:81",
            "net7": "a6:00:e1:59:cf:42",
            "net8": "8a:f1:b1:53:65:8d",
            "net9": "42:7b:d1:3b:2e:88"
        },
        "spine_1_1_5": {
            "net0": "fe:22:a2:a3:b4:02",
            "net1": "f6:e4:9e:24:e3:2f",
            "net10": "8a:35:7a:0e:7f:32",
            "net11": "12:4d:33:6f:65:d8",
            "net12": "06:af:97:aa:1e:58",
            "net13": "e6:ab:15:64:c8:24",
            "net14": "42:fd:4a:30:f6:7b",
            "net15": "6a:72:b7:d0:58:76",
            "net16": "e2:9b:a2:a5:f4:ce",
            "net17": "26:79:d5:b6:61:1f",
            "net18": "a6:dd:74:fd:69:b6",
            "net19": "76:57:af:e7:dd:af",
            "net2": "da:73:03:db:a2:47",
            "net20": "9e:c0:29:dc:d3:d8",
            "net21": "a2:bf:41:70:d6:d4",
            "net22": "8a:c2:a7:17:e9:0c",
            "net23": "6e:e4:95:0e:72:79",
            "net3": "ba:a3:90:7e:40:3e",
            "net4": "fa:08:d0:a3:f3:88",
            "net5": "76:0e:c0:90:43:91",
            "net6": "f2:ce:eb:c4:bb:0f",
            "net7": "76:c1:05:84:34:37",
            "net8": "c2:b6:b2:c2:1d:95",
            "net9": "de:cf:fb:ed:9e:2d"
        },
        "spine_1_1_6": {
            "net0": "5a:79:13:91:87:88",
            "net1": "1a:bd:ee:4f:26:e7",
            "net10": "b2:d1:39:dc:6c:b3",
            "net11": "3a:a2:9f:ad:f2:98",
            "net12": "7a:f9:27:6b:0a:92",
            "net13": "c6:e6:ba:ba:b6:fd",
            "net14": "fe:ad:97:f4:fa:64",
            "net15": "52:73:a2:25:be:7a",
            "net16": "a2:62:91:31:f7:8b",
            "net17": "42:a4:26:38:55:0d",
            "net18": "22:bf:49:85:9e:10",
            "net19": "de:59:84:0d:55:b2",
            "net2": "aa:a9:a7:d2:c9:21",
            "net20": "1e:6c:e1:b8:13:ef",
            "net21": "a2:dd:90:f0:42:f7",
            "net22": "66:51:7b:e6:24:25",
            "net23": "76:c8:09:b2:8d:bc",
            "net3": "0e:e9:a7:b1:66:32",
            "net4": "8e:28:5b:0a:c3:c0",
            "net5": "b6:d0:20:8a:2a:a1",
            "net6": "42:43:83:96:1a:8d",
            "net7": "12:27:ab:7e:91:a4",
            "net8": "f6:81:9d:be:3c:d8",
            "net9": "c6:3c:18:ce:6b:d2"
        },
        "spine_1_1_7": {
            "net0": "ba:e8:49:8a:89:92",
            "net1": "c6:6c:0e:c7:f6:e3",
            "net10": "8e:96:67:e6:9c:c8",
            "net11": "0e:99:ec:82:d8:e1",
            "net12": "32:61:b7:41:71:04",
            "net13": "d2:9a:75:69:19:5e",
            "net14": "ee:8e:f6:f5:17:68",
            "net15": "e6:05:aa:a6:75:c1",
            "net16": "3e:17:6b:c6:b2:db",
            "net17": "96:10:53:6a:46:85",
            "net18": "fa:ae:e2:57:2c:6f",
            "net19": "2e:c1:fd:26:75:3c",
            "net2": "2a:86:a0:11:3d:26",
            "net20": "66:cb:67:03:dd:9d",
            "net21": "ee:e4:ee:a1:84:60",
            "net22": "ca:63:82:37:55:db",
            "net23": "4e:1a:24:d0:9f:4a",
            "net3": "12:56:c9:44:83:16",
            "net4": "ee:ea:0f:57:fd:bc",
            "net5": "8a:e8:97:92:f8:27",
            "net6": "a6:d4:c3:ec:c4:69",
            "net7": "76:1f:db:1b:91:3c",
            "net8": "92:fd:37:92:95:be",
            "net9": "de:8c:fb:ed:bd:34"
        },
        "spine_1_1_8": {
            "net0": "1e:54:8e:8d:5f:a7",
            "net1": "02:a7:cb:7a:6f:af",
            "net10": "2e:6b:a7:8f:07:74",
            "net11": "9a:20:78:dc:ae:a1",
            "net12": "3e:35:2d:fb:ef:29",
            "net13": "ca:b8:39:4f:c0:ba",
            "net14": "0e:97:d5:7e:45:fa",
            "net15": "46:0a:7f:44:c6:65",
            "net16": "1e:4e:d9:79:e7:6b",
            "net17": "8a:75:ea:7e:48:94",
            "net18": "d6:5d:04:e0:09:b3",
            "net19": "52:dd:7e:b0:b5:ad",
            "net2": "ee:4d:9f:8b:e3:d7",
            "net20": "32:57:66:6c:d5:71",
            "net21": "e6:71:6b:4e:39:be",
            "net22": "ba:c8:17:7b:5f:f9",
            "net23": "6a:1e:6e:11:b2:8b",
            "net3": "a6:5f:39:b5:7b:e2",
            "net4": "be:61:0e:95:46:45",
            "net5": "2a:05:94:ae:58:45",
            "net6": "82:67:63:c8:c8:a9",
            "net7": "0a:13:34:b3:5a:4e",
            "net8": "42:4e:88:4c:30:6f",
            "net9": "c6:93:0b:d7:bc:f2"
        },
        "spine_1_1_9": {
            "net0": "a6:06:8e:b4:ff:7b",
            "net1": "ea:c4:e5:2b:ca:39",
            "net10": "6e:4b:fb:2e:82:e6",
            "net11": "36:77:08:6b:ae:9c",
            "net12": "62:3c:31:e4:73:b1",
            "net13": "e2:3c:9a:68:a5:ae",
            "net14": "72:d2:f8:ab:e6:55",
            "net15": "b6:ff:35:e2:ee:c8",
            "net16": "8e:75:33:1a:9f:0b",
            "net17": "fa:f2:09:e7:dd:a1",
            "net18": "4a:58:b9:a1:40:9f",
            "net19": "d2:e3:1d:8c:75:7e",
            "net2": "ea:33:e5:cd:57:bb",
            "net20": "3e:69:82:c5:db:40",
            "net21": "16:22:d5:da:3b:9a",
            "net22": "32:e4:0f:bf:b0:67",
            "net23": "12:92:96:65:08:66",
            "net3": "8e:e0:45:bd:9a:ae",
            "net4": "96:ed:22:a2:78:63",
            "net5": "4a:e8:46:41:58:11",
            "net6": "ba:e6:7b:bd:dd:6b",
            "net7": "1e:b6:78:b5:72:29",
            "net8": "fe:b8:69:49:04:25",
            "net9": "f2:4c:ea:3e:a8:6a"
        },
        "spine_2_1_1": {
            "net0": "7e:00:c7:b7:f2:25",
            "net1": "16:99:46:b3:89:94",
            "net10": "ea:6e:30:99:0d:dd",
            "net11": "6a:28:e2:e7:99:0b",
            "net12": "36:8b:4e:ca:f7:42",
            "net13": "ca:c2:86:46:4c:ef",
            "net14": "66:90:5e:f1:70:70",
            "net15": "c6:48:51:d9:46:5d",
            "net16": "9a:d8:07:eb:a3:f4",
            "net17": "fa:b2:85:51:b5:c5",
            "net18": "e2:c5:ee:e2:57:25",
            "net19": "ce:40:70:03:25:cf",
            "net2": "82:e5:c4:37:09:1d",
            "net20": "c6:f2:fb:36:60:91",
            "net21": "42:70:32:96:78:cb",
            "net22": "32:8a:f3:ed:e1:31",
            "net23": "6e:e0:d3:60:0e:3c",
            "net3": "da:12:40:16:41:48",
            "net4": "a6:4d:27:4a:5e:5d",
            "net5": "fa:3f:8b:64:81:66",
            "net6": "4a:64:e5:4e:fa:8c",
            "net7": "82:05:80:25:6d:a4",
            "net8": "ae:7e:72:b7:a3:94",
            "net9": "6e:2a:75:f5:28:87"
        },
        "spine_2_1_10": {
            "net0": "1a:ee:3f:61:95:b9",
            "net1": "ea:92:23:ef:ff:6a",
            "net10": "02:78:07:c1:56:8c",
            "net11": "52:48:c2:a7:40:ca",
            "net12": "fe:2c:0f:3a:f5:69",
            "net13": "36:26:f1:4a:58:fb",
            "net14": "4e:6d:1a:4b:26:69",
            "net15": "e6:66:d5:d8:10:a4",
            "net16": "ea:dc:58:f9:f9:29",
            "net17": "76:ec:90:6f:ad:4d",
            "net18": "d6:ce:5b:3d:75:92",
            "net19": "ce:f8:d4:c1:a7:80",
            "net2": "32:69:68:53:59:d9",
            "net20": "8a:5e:2d:16:17:22",
            "net21": "42:7f:38:61:a9:3a",
            "net22": "96:10:c8:cd:6b:86",
            "net23": "7a:94:e7:a7:34:70",
            "net3": "42:f1:d4:ac:c7:22",
            "net4": "76:8e:a4:df:0c:30",
            "net5": "36:66:9b:08:0a:d7",
            "net6": "f2:b1:f4:2e:55:61",
            "net7": "c6:ae:94:5a:34:7f",
            "net8": "ce:27:ce:4a:6b:16",
            "net9": "fe:fe:f5:d6:3d:73"
        },
        "spine_2_1_11": {
            "net0": "8e:97:20:3c:e3:c7",
            "net1": "fe:8a:6d:79:9d:6c",
            "net10": "26:ba:b3:c7:ee:1e",
            "net11": "92:5b:0c:6e:aa:11",
            "net12": "7a:95:6e:da:5f:e6",
            "net13": "32:87:99:cd:18:f0",
            "net14": "e2:5b:d8:70:b8:d9",
            "net15": "02:24:e7:35:d6:1a",
            "net16": "4a:c6:d2:fd:82:bc",
            "net17": "0a:2c:dc:29:7e:54",
            "net18": "ae:27:94:f1:52:7f",
            "net19": "72:24:cf:9e:b8:5b",
            "net2": "fa:cf:32:f3:e7:2b",
            "net20": "5e:0b:fb:33:7c:a6",
            "net21": "5e:30:60:ba:83:6e",
            "net22": "56:01:3c:cc:19:98",
            "net23": "ce:d7:aa:b2:69:82",
            "net3": "62:e3:3f:46:23:0f",
            "net4": "2e:a2:88:eb:96:98",
            "net5": "62:90:44:59:b4:14",
            "net6": "62:ff:c1:64:14:64",
            "net7": "a6:71:e4:6c:29:1c",
            "net8": "f6:5e:b3:d0:4c:bc",
            "net9": "76:ad:ac:76:9a:58"
        },
        "spine_2_1_12": {
            "net0": "3e:a1:19:7b:1c:00",
            "net1": "6e:29:03:86:48:5f",
            "net10": "2e:bb:1b:b6:e6:4b",
            "net11": "ae:26:51:c9:e1:98",
            "net12": "9e:80:06:3b:46:39",
            "net13": "02:19:11:56:14:f9",
            "net14": "0a:60:f9:d0:b3:90",
            "net15": "1a:7d:01:4a:32:04",
            "net16": "36:d9:2e:d1:d2:cf",
            "net17": "d6:df:12:2d:e2:66",
            "net18": "6a:84:a0:05:b1:5f",
            "net19": "d6:cd:70:5f:96:d0",
            "net2": "2e:8d:33:90:18:77",
            "net20": "a2:76:c2:3d:c7:99",
            "net21": "ba:d3:ed:b1:73:07",
            "net22": "ee:27:03:63:c7:dd",
            "net23": "2a:99:b3:7f:28:59",
            "net3": "56:33:6b:74:ca:25",
            "net4": "ea:f7:51:e2:aa:51",
            "net5": "32:c1:5f:8a:4d:b1",
            "net6": "ba:ed:ea:30:42:01",
            "net7": "e2:c8:2a:e5:21:fc",
            "net8": "9e:60:88:5b:f7:57",
            "net9": "1e:7f:63:24:3e:68"
        },
        "spine_2_1_2": {
            "net0": "ea:44:09:c5:52:a0",
            "net1": "56:55:4a:cc:7b:c9",
            "net10": "6e:df:18:04:27:1d",
            "net11": "62:b5:78:9a:82:2f",
            "net12": "92:e9:a1:a9:45:af",
            "net13": "56:e5:af:76:52:20",
            "net14": "42:6f:0e:fc:c8:66",
            "net15": "16:87:81:c7:ca:6f",
            "net16": "62:22:46:ad:23:61",
            "net17": "d2:65:72:00:6f:b6",
            "net18": "9a:a8:b1:91:47:24",
            "net19": "ce:0a:f8:af:fb:6b",
            "net2": "c2:06:18:3f:e8:9d",
            "net20": "ae:9f:37:a8:00:63",
            "net21": "a6:63:06:9c:0d:dd",
            "net22": "1a:f8:fd:6e:4c:fe",
            "net23": "92:0b:d5:1c:9c:b1",
            "net3": "c6:60:91:49:f8:b9",
            "net4": "8a:51:b7:71:53:3a",
            "net5": "62:31:38:2a:8d:61",
            "net6": "2a:ec:a8:8d:d1:25",
            "net7": "ca:43:a2:76:59:eb",
            "net8": "ae:0e:7a:f1:b9:63",
            "net9": "32:8f:66:79:00:45"
        },
        "spine_2_1_3": {
            "net0": "16:72:d0:ee:95:8f",
            "net1": "22:8a:13:49:b6:7f",
            "net10": "42:9d:ca:f4:fc:71",
            "net11": "7a:8d:8b:fe:22:4e",
            "net12": "46:41:c0:c9:b4:ae",
            "net13": "82:7d:45:df:1f:30",
            "net14": "e2:3f:6e:8c:3c:e2",
            "net15": "c6:62:ba:21:57:70",
            "net16": "ee:0e:29:94:71:a6",
            "net17": "22:1e:86:a5:e0:6b",
            "net18": "4e:8a:40:40:c7:6e",
            "net19": "66:ef:96:aa:06:5a",
            "net2": "66:2b:6e:57:25:85",
            "net20": "22:cd:21:3f:31:4f",
            "net21": "86:40:60:4a:86:d7",
            "net22": "36:4c:a3:2d:86:3a",
            "net23": "a6:59:6a:92:55:f3",
            "net3": "d2:c5:96:1c:7a:2d",
            "net4": "36:17:90:01:fb:94",
            "net5": "46:82:5a:68:2b:fd",
            "net6": "06:da:7a:7a:3d:7d",
            "net7": "36:1e:f3:3d:b7:69",
            "net8": "12:93:5c:bf:8e:d0",
            "net9": "16:55:38:92:8f:aa"
        },
        "spine_2_1_4": {
            "net0": "d2:8d:0c:1e:da:73",
            "net1": "f6:35:23:04:e7:09",
            "net10": "f2:86:45:b5:90:89",
            "net11": "da:dc:cd:f0:02:c1",
            "net12": "a2:3f:d4:c4:90:1f",
            "net13": "a6:98:c3:05:f5:ae",
            "net14": "a6:d8:69:5b:8a:58",
            "net15": "8e:3c:09:e2:f1:df",
            "net16": "52:15:3d:7a:81:71",
            "net17": "f6:3d:37:82:bd:c4",
            "net18": "9a:95:ef:76:39:05",
            "net19": "6e:f2:6c:d3:a5:9c",
            "net2": "d2:ba:c3:c0:cb:27",
            "net20": "7a:41:60:5a:ec:74",
            "net21": "c6:3a:33:0e:bc:4d",
            "net22": "36:60:55:1a:d2:b0",
            "net23": "16:ef:15:4c:87:36",
            "net3": "3a:de:c8:2e:11:90",
            "net4": "6e:9a:7d:27:c7:1e",
            "net5": "36:bf:c5:92:16:29",
            "net6": "82:e1:f8:96:3c:57",
            "net7": "1a:59:fc:a6:64:f4",
            "net8": "aa:e5:a1:38:d9:6f",
            "net9": "5a:b2:6b:df:39:b9"
        },
        "spine_2_1_5": {
            "net0": "5a:94:24:e1:df:77",
            "net1": "62:5c:d8:84:1e:38",
            "net10": "82:85:c9:50:a6:24",
            "net11": "42:1b:db:fa:53:96",
            "net12": "da:6e:ab:d2:4a:46",
            "net13": "e2:b2:57:3b:eb:6f",
            "net14": "f2:05:72:9c:f6:19",
            "net15": "12:84:db:f1:66:5f",
            "net16": "52:51:8e:0d:02:77",
            "net17": "fe:49:3e:23:35:f6",
            "net18": "3a:cb:08:9b:14:b5",
            "net19": "4e:3d:4a:52:df:7e",
            "net2": "d6:af:09:80:8b:cc",
            "net20": "12:49:5c:4a:16:32",
            "net21": "4a:2e:32:e0:60:57",
            "net22": "be:ed:f7:e4:2d:8a",
            "net23": "3e:f3:8b:43:27:38",
            "net3": "62:a0:9e:64:13:9b",
            "net4": "2a:e1:24:d0:b8:c5",
            "net5": "8e:1b:96:99:b8:b2",
            "net6": "66:59:3d:a0:2f:82",
            "net7": "12:32:b6:21:82:81",
            "net8": "12:03:48:d7:24:96",
            "net9": "06:73:2f:ab:7e:54"
        },
        "spine_2_1_6": {
            "net0": "ca:40:0c:5e:4c:48",
            "net1": "52:0e:1f:68:19:28",
            "net10": "f6:98:e1:5c:63:a4",
            "net11": "36:cb:78:b2:3a:dc",
            "net12": "4e:15:cc:e4:f0:c0",
            "net13": "e2:31:de:cb:bd:60",
            "net14": "b2:ef:58:03:26:6f",
            "net15": "aa:cb:63:2c:e2:1a",
            "net16": "5a:54:dd:32:6f:ee",
            "net17": "6e:ba:c7:34:f3:f0",
            "net18": "66:f2:4b:72:1f:51",
            "net19": "66:a8:f9:05:8d:38",
            "net2": "3a:32:8e:32:e4:5c",
            "net20": "16:17:ca:d1:9d:c7",
            "net21": "fa:40:36:a0:83:2a",
            "net22": "22:36:65:4c:f8:4b",
            "net23": "6a:18:2c:14:d8:3b",
            "net3": "6a:9c:53:f2:ed:8c",
            "net4": "56:19:8f:d5:79:b2",
            "net5": "a6:74:0a:e3:8c:b7",
            "net6": "f2:cf:e5:4d:78:7e",
            "net7": "8a:a6:ba:11:5c:0c",
            "net8": "fa:d9:27:ce:28:95",
            "net9": "da:2f:03:4f:01:f4"
        },
        "spine_2_1_7": {
            "net0": "3a:fa:cd:6f:e6:b3",
            "net1": "6e:ac:73:c7:24:41",
            "net10": "d2:78:4a:4c:f9:1c",
            "net11": "c2:9d:5d:87:19:53",
            "net12": "76:7c:19:57:60:e5",
            "net13": "06:5d:bf:52:74:2e",
            "net14": "02:2b:ff:f4:8f:96",
            "net15": "b2:9d:70:d8:d5:d9",
            "net16": "92:cb:ff:18:d4:54",
            "net17": "7a:07:b3:d1:fd:34",
            "net18": "ee:1a:02:d1:a7:b9",
            "net19": "8e:f2:84:68:f7:2f",
            "net2": "a2:1f:61:ef:0d:6f",
            "net20": "6a:ef:89:45:f4:e7",
            "net21": "ca:f9:fb:51:21:9e",
            "net22": "3e:2b:40:04:5c:7b",
            "net23": "6e:0a:06:8b:67:71",
            "net3": "c6:7a:b9:f9:8e:9f",
            "net4": "d2:fb:4c:b6:bd:9e",
            "net5": "ee:a5:4c:2e:e2:e3",
            "net6": "0e:45:a2:6c:ce:7c",
            "net7": "f6:e0:25:0a:69:f2",
            "net8": "2a:2d:22:89:0b:bb",
            "net9": "d2:c8:f3:10:c1:48"
        },
        "spine_2_1_8": {
            "net0": "92:b3:f7:59:e1:7c",
            "net1": "b2:59:2e:12:d1:18",
            "net10": "f6:f4:81:f3:73:e0",
            "net11": "0a:21:c5:64:28:b3",
            "net12": "4a:34:95:78:52:c0",
            "net13": "0a:62:1d:2a:b3:16",
            "net14": "7e:a5:98:7d:34:73",
            "net15": "9a:40:67:c2:df:84",
            "net16": "1e:03:8f:1c:6a:f8",
            "net17": "ee:fe:14:f4:e3:44",
            "net18": "42:f0:0c:2d:a4:f5",
            "net19": "f2:ea:16:b1:68:2e",
            "net2": "a2:4e:70:67:8f:cf",
            "net20": "7a:dd:a3:17:ff:e1",
            "net21": "fa:ba:55:56:7e:3b",
            "net22": "e6:dc:26:6d:fa:c2",
            "net23": "fe:22:f2:4c:59:c9",
            "net3": "9e:f2:eb:13:64:a5",
            "net4": "1e:6c:cf:af:6b:7e",
            "net5": "fe:02:a2:ea:3d:f3",
            "net6": "aa:5a:d4:b4:cf:9d",
            "net7": "96:6a:fe:be:1e:37",
            "net8": "2a:d0:f3:4d:b0:0e",
            "net9": "72:86:37:fc:93:b4"
        },
        "spine_2_1_9": {
            "net0": "36:a5:a4:18:0f:d9",
            "net1": "7a:5d:0a:51:f9:07",
            "net10": "a6:40:85:c1:a6:bf",
            "net11": "02:fa:ed:f5:e0:d0",
            "net12": "de:13:a9:e1:1f:db",
            "net13": "6a:bc:4e:3d:c9:68",
            "net14": "e6:56:37:99:75:ad",
            "net15": "9e:c0:7b:79:44:f8",
            "net16": "e2:b9:cd:ab:e0:f9",
            "net17": "12:36:86:74:5e:da",
            "net18": "ca:89:33:47:87:43",
            "net19": "32:b8:26:18:2b:a0",
            "net2": "b6:b7:ab:41:68:8f",
            "net20": "92:af:23:8c:16:b9",
            "net21": "32:b7:af:6e:8c:dd",
            "net22": "aa:e9:37:9c:61:0d",
            "net23": "26:7d:a0:89:77:1c",
            "net3": "96:fc:03:88:4b:f3",
            "net4": "06:0f:8b:5e:92:7e",
            "net5": "de:92:b9:75:bb:3e",
            "net6": "3a:c1:e6:4d:d4:9f",
            "net7": "1e:98:ab:c8:da:ae",
            "net8": "16:96:8a:b0:ff:55",
            "net9": "9a:49:b4:26:36:c2"
        },
        "tof_1_2_1": {
            "net0": "4a:35:7b:a7:72:c6",
            "net1": "72:c3:5d:05:88:54",
            "net10": "1e:f5:d2:a7:44:ef",
            "net11": "66:19:d3:3c:01:ee",
            "net12": "2e:73:2e:18:28:57",
            "net13": "b2:61:32:2d:6e:83",
            "net14": "be:bc:4d:05:6d:ce",
            "net15": "7e:de:6a:c9:dd:b3",
            "net16": "22:c5:63:d2:60:72",
            "net17": "16:b2:4f:d0:56:ff",
            "net18": "fa:92:d8:39:6c:78",
            "net19": "8a:c8:5d:31:17:d2",
            "net2": "2a:4a:46:34:d6:2a",
            "net20": "ee:99:d6:1a:57:ed",
            "net21": "66:a8:e3:1f:1e:87",
            "net22": "56:36:11:0a:85:d4",
            "net23": "a2:e1:3b:f3:c8:a8",
            "net3": "5e:4b:f8:bc:e0:66",
            "net4": "82:b0:c5:c5:ad:db",
            "net5": "8e:d7:5c:b3:7b:75",
            "net6": "a2:c6:47:80:cf:d9",
            "net7": "d6:12:89:29:67:40",
            "net8": "72:85:80:ea:b2:76",
            "net9": "de:5c:b4:d8:03:65"
        },
        "tof_1_2_10": {
            "net0": "7a:87:a7:d3:a0:3c",
            "net1": "fe:4f:2a:49:50:d0",
            "net10": "c6:87:df:d7:8d:42",
            "net11": "6a:cf:00:46:a8:48",
            "net12": "fa:b7:fd:34:60:dd",
            "net13": "06:0e:46:0f:cf:4b",
            "net14": "f2:d9:b0:b7:d8:ec",
            "net15": "9e:c0:da:40:bf:6a",
            "net16": "b2:c0:91:ea:c1:3d",
            "net17": "5a:63:93:96:e0:8d",
            "net18": "5e:8d:dc:0c:5d:97",
            "net19": "12:95:e4:90:17:96",
            "net2": "92:03:7e:f1:e6:b2",
            "net20": "1a:2e:e9:29:57:ea",
            "net21": "4a:54:c3:c2:1d:77",
            "net22": "aa:48:35:a8:c8:07",
            "net23": "f2:76:20:94:67:bb",
            "net3": "72:77:4f:8d:7d:19",
            "net4": "52:d7:54:38:a0:c9",
            "net5": "6e:dc:b7:6e:56:93",
            "net6": "36:e9:30:3d:6a:f7",
            "net7": "0e:66:07:be:18:18",
            "net8": "ce:7a:57:bb:18:b0",
            "net9": "6a:9d:d8:98:6c:7c"
        },
        "tof_1_2_11": {
            "net0": "56:43:46:6a:e9:7a",
            "net1": "4a:6d:05:5d:34:c2",
            "net10": "66:96:50:9e:d7:20",
            "net11": "ba:cc:6a:b0:26:57",
            "net12": "e2:f5:bd:d0:f8:b6",
            "net13": "7a:05:ab:31:5c:91",
            "net14": "1e:8e:f7:a7:57:83",
            "net15": "7e:dc:3d:7d:15:24",
            "net16": "42:1a:69:7e:42:72",
            "net17": "82:94:76:05:50:f3",
            "net18": "26:c2:77:ad:01:a3",
            "net19": "86:2e:e8:0a:9a:19",
            "net2": "8e:1c:78:db:b2:30",
            "net20": "56:3d:e4:52:52:29",
            "net21": "6e:eb:1c:cb:b7:c1",
            "net22": "02:c4:78:74:a3:2a",
            "net23": "f6:c4:da:01:42:c8",
            "net3": "d2:60:0a:15:89:a4",
            "net4": "be:1b:fa:7c:10:ef",
            "net5": "16:d8:9c:78:34:ef",
            "net6": "8e:4f:3e:38:d7:a8",
            "net7": "66:85:51:23:21:6a",
            "net8": "ce:dc:cd:bc:a8:12",
            "net9": "3e:ec:09:fa:03:f7"
        },
        "tof_1_2_12": {
            "net0": "be:62:b9:4c:b7:aa",
            "net1": "7a:47:bc:45:7a:c6",
            "net10": "42:28:5a:ae:33:60",
            "net11": "52:42:e5:e0:c7:70",
            "net12": "92:26:e7:aa:a3:75",
            "net13": "7e:eb:bf:37:db:f9",
            "net14": "e6:4d:2f:64:2e:d1",
            "net15": "ea:27:49:bb:9f:12",
            "net16": "3e:d7:c2:a5:43:8f",
            "net17": "02:21:35:08:ea:af",
            "net18": "32:64:0f:0b:44:7b",
            "net19": "f6:b5:cd:30:27:1e",
            "net2": "ce:3f:86:f4:07:b1",
            "net20": "d2:0c:72:7f:72:e1",
            "net21": "02:9e:b6:64:75:d1",
            "net22": "6a:67:3a:bc:24:a5",
            "net23": "7a:76:ed:a3:69:3e",
            "net3": "0a:6b:83:a3:bf:ce",
            "net4": "be:0c:07:50:95:c3",
            "net5": "de:76:03:b0:8d:0f",
            "net6": "76:d7:07:e8:8b:6e",
            "net7": "02:c2:9a:68:95:d7",
            "net8": "8e:a8:b3:23:a6:83",
            "net9": "da:a8:8e:a3:16:8a"
        },
        "tof_1_2_2": {
            "net0": "b2:86:f6:0f:f2:ed",
            "net1": "1e:c6:04:2f:f6:ba",
            "net10": "3e:98:35:e7:60:de",
            "net11": "c6:0a:2d:05:de:62",
            "net12": "f6:d6:04:64:1b:6c",
            "net13": "92:c8:97:1d:74:a1",
            "net14": "ae:fe:11:d3:d4:87",
            "net15": "2e:db:4d:04:02:4f",
            "net16": "e6:29:38:b2:58:83",
            "net17": "ca:c3:5f:27:50:cd",
            "net18": "b6:0a:5c:c4:ff:b2",
            "net19": "62:4f:33:13:cc:16",
            "net2": "a2:da:a6:c1:48:9c",
            "net20": "c2:57:56:a6:60:73",
            "net21": "56:db:d2:f9:70:c3",
            "net22": "b2:56:b3:c1:7a:8d",
            "net23": "12:36:d4:8c:b3:7c",
            "net3": "a2:8f:5d:d9:5e:1b",
            "net4": "9a:2b:ce:b9:3a:ec",
            "net5": "be:a0:70:42:19:83",
            "net6": "ca:dd:08:00:3f:b2",
            "net7": "2a:9c:5f:94:ff:9a",
            "net8": "82:ba:8b:83:de:8b",
            "net9": "2e:f4:c7:1d:a2:dc"
        },
        "tof_1_2_3": {
            "net0": "6e:b5:c9:2b:ce:22",
            "net1": "82:c5:61:75:47:1f",
            "net10": "9e:28:4f:9e:3e:fe",
            "net11": "42:38:22:52:88:e1",
            "net12": "ca:b4:56:45:a7:f4",
            "net13": "2a:27:33:18:bd:6e",
            "net14": "f2:2f:b3:99:c5:76",
            "net15": "de:3c:17:c0:2a:ff",
            "net16": "2a:65:69:11:76:33",
            "net17": "f2:63:8a:d4:71:ee",
            "net18": "22:d5:eb:8a:e7:38",
            "net19": "b6:28:fc:fd:79:4f",
            "net2": "b6:43:eb:4c:2d:ad",
            "net20": "36:c2:9f:37:81:35",
            "net21": "c2:0e:d3:b2:95:05",
            "net22": "fa:a0:da:8f:c1:59",
            "net23": "aa:e9:a1:fb:e5:3a",
            "net3": "66:09:dd:de:c2:ed",
            "net4": "fe:7a:7b:fc:1e:d4",
            "net5": "ca:6e:b8:22:41:a0",
            "net6": "6e:1d:50:da:0f:ba",
            "net7": "ba:3b:98:c9:10:26",
            "net8": "1e:a4:2d:22:54:7e",
            "net9": "02:73:43:e4:1b:d5"
        },
        "tof_1_2_4": {
            "net0": "32:1b:d8:66:3a:a4",
            "net1": "9e:cb:02:93:75:86",
            "net10": "de:c1:7c:8d:3b:13",
            "net11": "0e:d4:86:72:41:5b",
            "net12": "0e:b3:fb:f5:02:31",
            "net13": "2a:b2:05:dc:ac:91",
            "net14": "ea:ca:47:ef:e4:c0",
            "net15": "b6:41:84:26:9a:6b",
            "net16": "0a:05:ca:be:09:f0",
            "net17": "5e:ec:5c:f6:62:d8",
            "net18": "aa:4e:f2:c8:e0:89",
            "net19": "c6:f3:67:1e:e4:f6",
            "net2": "0e:0a:4a:ea:61:90",
            "net20": "fa:76:03:0f:38:03",
            "net21": "de:e3:1f:2c:a9:1c",
            "net22": "66:52:bd:9f:75:10",
            "net23": "8e:5b:11:12:ea:09",
            "net3": "16:03:0e:eb:c6:28",
            "net4": "ba:ee:1e:54:c4:e9",
            "net5": "5e:91:78:fc:51:7a",
            "net6": "3a:ed:bd:0a:f4:aa",
            "net7": "2e:e6:ca:5d:4a:aa",
            "net8": "e2:05:8f:9f:66:ad",
            "net9": "e6:1b:48:34:8c:a0"
        },
        "tof_1_2_5": {
            "net0": "ba:c0:26:d5:2e:a3",
            "net1": "72:9d:09:b0:da:1c",
            "net10": "22:08:2f:27:53:09",
            "net11": "ca:f8:51:52:97:86",
            "net12": "2a:bd:2d:c6:12:73",
            "net13": "5e:31:28:d5:e8:e5",
            "net14": "f6:f2:d8:2c:7e:a1",
            "net15": "b2:e0:8a:9f:c7:ea",
            "net16": "ce:a1:d5:4c:c8:98",
            "net17": "3e:77:a5:83:5a:7d",
            "net18": "16:c7:ca:16:10:5e",
            "net19": "e2:35:1b:d5:40:93",
            "net2": "82:7b:7b:f8:34:5d",
            "net20": "a2:1e:b8:c7:87:6d",
            "net21": "fa:e1:18:c1:2b:d9",
            "net22": "3a:ab:98:b6:0a:a2",
            "net23": "e6:a2:2a:80:ac:55",
            "net3": "06:67:78:76:b1:db",
            "net4": "fa:e3:ad:97:96:ed",
            "net5": "5a:96:14:ce:c8:bc",
            "net6": "9e:91:91:c9:5a:8e",
            "net7": "56:c7:35:9a:99:32",
            "net8": "b2:38:03:a5:33:82",
            "net9": "96:f8:c7:2e:7b:c7"
        },
        "tof_1_2_6": {
            "net0": "0e:c6:96:d1:33:ac",
            "net1": "d2:d8:87:20:46:4e",
            "net10": "8a:93:20:96:3b:3f",
            "net11": "66:61:cb:00:21:5c",
            "net12": "fe:c5:f4:fb:16:e5",
            "net13": "82:99:60:f2:95:f6",
            "net14": "46:6a:c3:13:11:ca",
            "net15": "da:86:44:c8:5a:e0",
            "net16": "ee:39:2b:a2:c1:72",
            "net17": "d2:c3:50:49:bb:f2",
            "net18": "62:f5:ff:c3:ad:d9",
            "net19": "0a:f5:7e:91:55:f7",
            "net2": "6e:58:fa:14:9a:e2",
            "net20": "02:af:de:c2:3c:2b",
            "net21": "66:36:9d:96:12:67",
            "net22": "16:7c:f0:d0:b9:a9",
            "net23": "4e:36:d5:bf:04:bd",
            "net3": "36:92:27:aa:d9:ce",
            "net4": "92:6c:e5:ec:8e:05",
            "net5": "a6:10:82:3f:30:0f",
            "net6": "e2:ca:17:e3:56:55",
            "net7": "ca:82:26:02:b4:56",
            "net8": "42:aa:f6:e7:97:7f",
            "net9": "26:09:4f:11:44:e7"
        },
        "tof_1_2_7": {
            "net0": "da:85:51:38:8c:3d",
            "net1": "6a:75:92:cd:01:fa",
            "net10": "ee:a1:1c:f3:94:f9",
            "net11": "22:20:76:5e:d5:46",
            "net12": "6e:4a:05:55:d3:ef",
            "net13": "ae:29:9d:d2:f0:12",
            "net14": "fe:57:53:7e:83:ad",
            "net15": "22:a8:33:03:64:74",
            "net16": "de:71:d5:3a:d1:1c",
            "net17": "e6:73:f6:0d:fe:e1",
            "net18": "56:1e:69:0f:82:1d",
            "net19": "8a:ab:4d:1b:b2:ae",
            "net2": "72:8d:80:dd:4f:94",
            "net20": "36:17:a3:50:e0:35",
            "net21": "f6:5f:aa:a1:66:7d",
            "net22": "7e:5a:bb:37:c6:97",
            "net23": "32:c4:d4:a5:9d:4e",
            "net3": "0a:aa:05:b0:9c:2e",
            "net4": "22:87:c2:e7:ac:13",
            "net5": "d2:31:5a:b2:57:b6",
            "net6": "46:f9:92:29:1a:4f",
            "net7": "fa:77:5c:a3:0f:41",
            "net8": "66:7b:97:cd:43:b5",
            "net9": "be:a0:bb:fc:e8:0c"
        },
        "tof_1_2_8": {
            "net0": "ea:36:c2:4d:7a:1f",
            "net1": "4e:df:eb:e6:23:a1",
            "net10": "ea:2b:cd:c0:f1:7e",
            "net11": "d2:f6:9a:af:47:94",
            "net12": "1e:2e:e6:5b:44:60",
            "net13": "be:e5:20:7c:58:75",
            "net14": "62:d7:ac:a2:ee:81",
            "net15": "5e:c6:4a:21:36:14",
            "net16": "12:38:a4:7d:b5:cb",
            "net17": "62:6b:59:40:fa:df",
            "net18": "5e:0a:36:4a:48:1c",
            "net19": "96:a7:25:03:0a:79",
            "net2": "ee:e1:3f:19:d5:bf",
            "net20": "fa:d0:3f:87:f6:44",
            "net21": "0e:e3:3d:7a:90:34",
            "net22": "ce:6b:74:c4:8f:36",
            "net23": "32:aa:68:cc:8b:ba",
            "net3": "aa:e3:c1:43:31:3d",
            "net4": "9e:2d:95:e8:57:28",
            "net5": "4e:6f:9d:44:cd:cb",
            "net6": "fa:9d:66:49:0b:55",
            "net7": "a6:4f:66:76:0d:f7",
            "net8": "4a:09:8d:5c:f7:2c",
            "net9": "62:6b:c2:33:d1:fd"
        },
        "tof_1_2_9": {
            "net0": "2a:99:01:49:c9:76",
            "net1": "82:b5:13:fc:51:c0",
            "net10": "f6:04:4b:01:25:80",
            "net11": "7e:82:3f:ea:aa:bb",
            "net12": "42:ce:3d:0d:6d:4a",
            "net13": "02:fa:0d:2b:fc:34",
            "net14": "d2:bc:bc:90:69:11",
            "net15": "22:86:03:f8:53:7b",
            "net16": "22:08:28:26:fb:9c",
            "net17": "0e:0a:20:41:fb:53",
            "net18": "b6:2f:82:41:91:ea",
            "net19": "7e:47:ea:e6:ea:ec",
            "net2": "f6:62:a8:05:8a:f7",
            "net20": "3a:b7:16:cf:b5:f5",
            "net21": "be:ae:5d:51:46:2e",
            "net22": "8a:62:84:d0:3a:3f",
            "net23": "22:62:5b:9b:25:7b",
            "net3": "9e:36:04:55:76:0b",
            "net4": "c6:b1:83:d5:9c:29",
            "net5": "6e:39:bb:75:f5:53",
            "net6": "b2:28:6c:ae:9d:55",
            "net7": "1e:d5:4e:dc:ea:d8",
            "net8": "aa:96:85:1a:ae:cf",
            "net9": "ea:e9:a6:ad:80:6b"
        }
    },
    "failed_machine": "tof_1_2_1",
    "failure_time": {
        "leaf_1_0_1": 1636237450.9355369,
        "leaf_1_0_10": 1636237451.4159265,
        "leaf_1_0_11": 1636237450.9526563,
        "leaf_1_0_12": 1636237450.9655468,
        "leaf_1_0_2": 1636237450.9756203,
        "leaf_1_0_3": 1636237450.9985528,
        "leaf_1_0_4": 1636237451.0076585,
        "leaf_1_0_5": 1636237451.022091,
        "leaf_1_0_6": 1636237450.9431703,
        "leaf_1_0_7": 1636237450.9612558,
        "leaf_1_0_8": 1636237450.9724114,
        "leaf_1_0_9": 1636237450.9878683,
        "leaf_2_0_1": 1636237451.0014021,
        "leaf_2_0_10": 1636237451.0088282,
        "leaf_2_0_11": 1636237451.491935,
        "leaf_2_0_12": 1636237451.073225,
        "leaf_2_0_2": 1636237451.5474591,
        "leaf_2_0_3": 1636237451.089863,
        "leaf_2_0_4": 1636237451.1069417,
        "leaf_2_0_5": 1636237451.1177638,
        "leaf_2_0_6": 1636237451.1404395,
        "leaf_2_0_7": 1636237451.1699822,
        "leaf_2_0_8": 1636237451.1845796,
        "leaf_2_0_9": 1636237451.201109,
        "spine_1_1_1": 1636237451.553854,
        "spine_1_1_10": 1636237451.1055818,
        "spine_1_1_11": 1636237451.1177604,
        "spine_1_1_12": 1636237451.1310756,
        "spine_1_1_2": 1636237451.1505594,
        "spine_1_1_3": 1636237451.6575477,
        "spine_1_1_4": 1636237451.2044346,
        "spine_1_1_5": 1636237451.2115417,
        "spine_1_1_6": 1636237451.2087889,
        "spine_1_1_7": 1636237451.225848,
        "spine_1_1_8": 1636237451.2605758,
        "spine_1_1_9": 1636237451.753814,
        "spine_2_1_1": 1636237451.2960255,
        "spine_2_1_10": 1636237451.3071535,
        "spine_2_1_11": 1636237451.3185647,
        "spine_2_1_12": 1636237451.3307762,
        "spine_2_1_2": 1636237451.2292182,
        "spine_2_1_3": 1636237451.2780585,
        "spine_2_1_4": 1636237451.2889397,
        "spine_2_1_5": 1636237451.309467,
        "spine_2_1_6": 1636237451.321101,
        "spine_2_1_7": 1636237451.3301706,
        "spine_2_1_8": 1636237451.3481274,
        "spine_2_1_9": 1636237451.3684251,
        "tof_1_2_1": 1636237451.3465407,
        "tof_1_2_10": 1636237451.3514478,
        "tof_1_2_11": 1636237451.3968086,
        "tof_1_2_12": 1636237451.4409823,
        "tof_1_2_2": 1636237451.4604487,
        "tof_1_2_3": 1636237451.4794264,
        "tof_1_2_4": 1636237451.9760792,
        "tof_1_2_5": 1636237451.511415,
        "tof_1_2_6": 1636237451.3756618,
        "tof_1_2_7": 1636237451.4273183,
        "tof_1_2_8": 1636237451.4755173,
        "tof_1_2_9": 1636237451.4978247
    }
}