{
    "k_leaf": 8,
    "k_top": 8,
    "redundancy_factor": 4,
    "is_k8s": true,
    "machine_mac_addresses": {
        "leaf_1_0_1": {
            "net0": "32:71:b5:a1:ba:34",
            "net1": "96:d3:53:9c:5a:bd",
            "net2": "0e:91:4e:28:5a:bb",
            "net3": "62:a4:95:68:d5:d7",
            "net4": "72:62:5c:4b:b2:1d",
            "net5": "6e:23:c6:9e:2c:86",
            "net6": "9e:96:76:47:c7:60",
            "net7": "de:81:e1:55:d2:a2",
            "net8": "ae:71:8e:a0:56:c1"
        },
        "leaf_1_0_2": {
            "net0": "b6:61:5c:65:70:2d",
            "net1": "06:b4:68:68:e2:1d",
            "net2": "ee:9d:db:a5:57:66",
            "net3": "fa:f5:70:1c:69:5c",
            "net4": "16:1f:4a:73:d9:09",
            "net5": "ba:2c:a5:a7:b7:61",
            "net6": "ae:ef:00:2e:8d:8d",
            "net7": "96:7d:5a:0c:7b:50",
            "net8": "de:38:c0:1e:b6:c2"
        },
        "leaf_1_0_3": {
            "net0": "fe:8d:ac:ec:31:45",
            "net1": "82:bf:7f:56:5c:b6",
            "net2": "4e:3a:e3:d8:cb:58",
            "net3": "ee:84:18:ef:08:fe",
            "net4": "f6:1b:f7:08:57:55",
            "net5": "ea:1a:bc:9e:a1:eb",
            "net6": "a6:e2:c0:86:3c:7e",
            "net7": "da:0f:52:e8:ed:07",
            "net8": "8a:37:f3:28:bb:1b"
        },
        "leaf_1_0_4": {
            "net0": "ee:79:d7:d6:cf:15",
            "net1": "1e:8b:24:3f:82:fe",
            "net2": "9e:1a:a1:6f:bf:36",
            "net3": "1a:01:74:9b:fe:06",
            "net4": "0a:11:4b:10:35:68",
            "net5": "f6:f1:c1:47:26:f9",
            "net6": "6a:d8:ba:53:3f:66",
            "net7": "4a:88:14:18:e1:e7",
            "net8": "0a:21:59:85:89:92"
        },
        "leaf_1_0_5": {
            "net0": "9e:76:3d:0c:7e:50",
            "net1": "ce:ab:65:97:45:46",
            "net2": "82:d1:20:2d:8d:63",
            "net3": "fe:06:11:9b:45:76",
            "net4": "42:e6:6f:b0:1a:09",
            "net5": "b6:c7:f6:36:97:15",
            "net6": "8e:88:2f:3a:27:e7",
            "net7": "22:f5:07:d1:fb:6d",
            "net8": "3e:dc:18:09:ff:af"
        },
        "leaf_1_0_6": {
            "net0": "3a:7c:86:b2:02:2b",
            "net1": "3a:75:34:98:da:cc",
            "net2": "56:66:a9:a0:fc:95",
            "net3": "b6:d3:4f:37:eb:ec",
            "net4": "be:6c:d7:d6:e3:02",
            "net5": "4e:b0:65:8a:5c:92",
            "net6": "fe:dc:d5:b5:05:dd",
            "net7": "ba:41:77:13:18:61",
            "net8": "2e:16:0b:0a:4e:f5"
        },
        "leaf_1_0_7": {
            "net0": "16:ed:90:16:bd:6b",
            "net1": "9e:b8:b5:be:2f:f9",
            "net2": "76:af:c8:33:12:07",
            "net3": "ee:b4:10:2b:67:d1",
            "net4": "16:58:c5:49:3c:11",
            "net5": "1e:a1:eb:bf:58:4b",
            "net6": "ee:55:ee:7a:54:8a",
            "net7": "ae:08:b9:41:c0:54",
            "net8": "7e:21:63:92:d4:bc"
        },
        "leaf_1_0_8": {
            "net0": "8a:f9:de:d7:51:07",
            "net1": "c6:15:18:52:19:bc",
            "net2": "da:7b:10:0a:f6:3d",
            "net3": "2e:30:42:34:63:d9",
            "net4": "22:8b:c3:a8:a7:e6",
            "net5": "42:7b:35:4c:8b:c7",
            "net6": "fe:32:31:8a:da:79",
            "net7": "0e:4f:8f:a9:97:84",
            "net8": "56:5e:8f:92:8d:b0"
        },
        "leaf_2_0_1": {
            "net0": "ea:df:e5:59:c4:37",
            "net1": "16:84:73:31:79:ef",
            "net2": "a2:8a:af:0b:43:14",
            "net3": "e6:f6:e9:c5:32:52",
            "net4": "fe:b5:99:db:39:0e",
            "net5": "0a:dd:11:8c:34:18",
            "net6": "de:4f:47:18:39:ed",
            "net7": "72:7c:50:75:c8:97",
            "net8": "66:59:fa:30:73:a9"
        },
        "leaf_2_0_2": {
            "net0": "1a:c3:d2:c2:b1:b4",
            "net1": "c6:48:88:cb:20:b9",
            "net2": "0e:2d:bd:0d:ed:84",
            "net3": "5a:9e:1d:51:fe:c4",
            "net4": "6a:ed:7d:3e:4c:33",
            "net5": "02:6f:d9:7e:a1:06",
            "net6": "ce:6a:7c:cf:7f:79",
            "net7": "b6:62:89:ce:b6:5d",
            "net8": "22:23:65:f8:3e:0c"
        },
        "leaf_2_0_3": {
            "net0": "1a:31:ad:d9:9f:f4",
            "net1": "ca:54:11:e2:e8:d8",
            "net2": "26:00:b5:b4:ad:ab",
            "net3": "0a:4c:46:9d:e6:3f",
            "net4": "ee:3e:22:96:26:45",
            "net5": "8a:2a:58:d2:3f:da",
            "net6": "f6:37:45:1e:0e:c5",
            "net7": "72:c6:c7:6b:62:96",
            "net8": "32:26:8e:ad:3f:37"
        },
        "leaf_2_0_4": {
            "net0": "a6:8e:4b:7f:b1:db",
            "net1": "0a:92:c7:20:69:4a",
            "net2": "2e:24:05:88:02:22",
            "net3": "ba:38:a5:2e:e6:d9",
            "net4": "aa:f1:34:b4:84:b7",
            "net5": "4e:00:68:d9:26:64",
            "net6": "36:cd:01:32:14:69",
            "net7": "ea:ca:3b:f2:d2:67",
            "net8": "86:8c:f3:51:d8:86"
        },
        "leaf_2_0_5": {
            "net0": "9a:57:0d:b3:e5:1b",
            "net1": "3e:a2:05:27:60:c1",
            "net2": "46:79:b5:8c:36:e8",
            "net3": "6e:c9:53:a8:9c:df",
            "net4": "ea:6d:3b:1c:9d:0e",
            "net5": "c2:2a:0a:52:b1:c6",
            "net6": "4a:9f:19:45:1b:f8",
            "net7": "12:83:20:bf:8d:0c",
            "net8": "f2:61:d1:7a:ef:69"
        },
        "leaf_2_0_6": {
            "net0": "42:83:f6:e2:0c:aa",
            "net1": "f2:1b:e8:37:b3:71",
            "net2": "56:6b:5e:8a:47:a8",
            "net3": "1a:d7:d3:0a:28:b5",
            "net4": "22:fb:cd:e7:a3:5f",
            "net5": "b6:ac:f2:e1:08:86",
            "net6": "26:01:9d:60:a7:ac",
            "net7": "fe:84:1d:8c:e0:ac",
            "net8": "f6:27:6b:64:f6:2a"
        },
        "leaf_2_0_7": {
            "net0": "92:0e:7e:7a:72:e4",
            "net1": "ee:b7:fd:15:a6:d5",
            "net2": "8a:dd:86:97:ed:fb",
            "net3": "02:31:f0:7f:41:60",
            "net4": "02:22:03:1f:e2:b5",
            "net5": "02:cd:73:9c:26:1a",
            "net6": "76:77:28:7a:34:a5",
            "net7": "06:cb:bf:8d:55:c0",
            "net8": "e2:91:0e:25:e7:a1"
        },
        "leaf_2_0_8": {
            "net0": "36:93:c4:9b:54:ed",
            "net1": "62:19:67:70:fc:19",
            "net2": "02:b7:3b:f2:67:6d",
            "net3": "36:fd:d5:f2:6d:7d",
            "net4": "c2:79:fe:16:94:0f",
            "net5": "06:4b:11:45:68:ef",
            "net6": "56:cb:fa:3b:5e:2c",
            "net7": "1a:41:a8:75:f2:68",
            "net8": "9e:a6:70:4d:9a:84"
        },
        "leaf_3_0_1": {
            "net0": "e6:3f:fe:9d:08:42",
            "net1": "16:1b:1b:d0:82:ed",
            "net2": "16:bc:c0:49:a9:3d",
            "net3": "c2:d9:59:fa:ad:58",
            "net4": "76:da:da:21:f1:9a",
            "net5": "2a:d9:1e:f1:1e:96",
            "net6": "92:cc:f5:09:25:f7",
            "net7": "56:fe:59:0f:21:7b",
            "net8": "6e:5c:1f:c5:d7:3e"
        },
        "leaf_3_0_2": {
            "net0": "52:e7:f2:fc:f3:da",
            "net1": "7e:0f:39:f2:91:71",
            "net2": "ba:86:6b:81:ee:15",
            "net3": "be:1d:89:4b:9e:02",
            "net4": "ce:97:9f:03:1a:9b",
            "net5": "62:65:5a:df:26:6a",
            "net6": "02:f5:53:f9:8e:1d",
            "net7": "d2:f8:62:25:5d:13",
            "net8": "ea:cf:8f:79:fb:cd"
        },
        "leaf_3_0_3": {
            "net0": "3a:a2:5b:3e:85:02",
            "net1": "8e:17:94:bd:12:23",
            "net2": "12:de:e6:8c:d1:f1",
            "net3": "06:3c:a5:68:39:6a",
            "net4": "0a:b2:5a:5f:b1:f9",
            "net5": "1e:50:1a:62:b6:a0",
            "net6": "fe:04:fb:07:c4:47",
            "net7": "d6:b2:10:cf:8a:6e",
            "net8": "62:2f:a7:bb:d1:40"
        },
        "leaf_3_0_4": {
            "net0": "f2:41:85:08:7f:9a",
            "net1": "d2:fa:37:9e:75:27",
            "net2": "86:ad:34:80:ee:bf",
            "net3": "12:57:0d:0b:32:d9",
            "net4": "7a:0e:ac:e8:76:e9",
            "net5": "d2:95:49:46:02:a6",
            "net6": "2e:4e:17:00:4f:2a",
            "net7": "c6:3a:9d:52:89:e1",
            "net8": "ae:dd:10:88:73:90"
        },
        "leaf_3_0_5": {
            "net0": "ce:5a:88:c8:b1:bd",
            "net1": "be:3d:81:f6:28:b3",
            "net2": "0a:b7:eb:58:2d:50",
            "net3": "3a:ae:05:01:95:e0",
            "net4": "72:a6:e2:0b:9d:6f",
            "net5": "06:c5:65:0f:1f:71",
            "net6": "d2:6d:74:dc:f9:e0",
            "net7": "72:be:41:cc:b3:9a",
            "net8": "c6:ba:c3:51:ad:83"
        },
        "leaf_3_0_6": {
            "net0": "3a:f7:41:89:7a:87",
            "net1": "96:ae:c4:d4:3c:b2",
            "net2": "fe:e6:21:5b:ec:3e",
            "net3": "96:cf:46:00:d8:aa",
            "net4": "c6:46:08:7e:68:ac",
            "net5": "06:3f:7f:4f:06:60",
            "net6": "ae:84:c3:b8:c3:4b",
            "net7": "7a:24:9c:66:33:ca",
            "net8": "ae:2f:b6:af:2d:d3"
        },
        "leaf_3_0_7": {
            "net0": "aa:48:31:f3:dc:d7",
            "net1": "42:d9:24:bb:ac:94",
            "net2": "b2:52:ed:e5:3a:61",
            "net3": "0e:d4:7b:e8:56:b9",
            "net4": "7e:cd:cc:0b:da:8b",
            "net5": "86:4a:0b:23:26:6c",
            "net6": "3a:6e:fe:7d:31:fa",
            "net7": "a6:e4:4b:59:b4:e3",
            "net8": "f6:5e:97:45:4e:6f"
        },
        "leaf_3_0_8": {
            "net0": "96:81:43:de:6c:ef",
            "net1": "c2:93:6b:3c:aa:80",
            "net2": "e6:31:80:7b:61:3c",
            "net3": "e2:72:61:f4:85:ac",
            "net4": "12:97:b5:e8:a0:14",
            "net5": "ca:89:d4:59:bc:f0",
            "net6": "8e:2a:14:14:b8:85",
            "net7": "9a:4e:b3:78:ef:49",
            "net8": "a6:eb:d3:14:fa:f3"
        },
        "leaf_4_0_1": {
            "net0": "4a:0c:cc:9f:e5:d0",
            "net1": "9e:f7:39:d6:e4:41",
            "net2": "5a:5d:57:b5:d7:28",
            "net3": "d2:b5:1e:93:3c:e8",
            "net4": "da:42:85:a9:91:1d",
            "net5": "7a:0b:d4:68:7a:c0",
            "net6": "da:4f:da:f6:4a:a4",
            "net7": "82:c1:53:34:4a:a8",
            "net8": "16:26:4c:3a:24:74"
        },
        "leaf_4_0_2": {
            "net0": "1a:42:8a:01:f2:56",
            "net1": "92:54:c7:83:1e:a1",
            "net2": "9a:1f:3e:35:d9:04",
            "net3": "16:31:0e:6d:e5:ed",
            "net4": "ce:f1:0d:fc:8b:68",
            "net5": "f2:dd:28:d4:89:93",
            "net6": "ce:17:61:8a:76:14",
            "net7": "ae:b4:c3:34:7c:4b",
            "net8": "e6:03:83:54:ac:b5"
        },
        "leaf_4_0_3": {
            "net0": "5a:a4:8b:f0:41:f1",
            "net1": "9e:84:6d:34:d5:10",
            "net2": "ce:2c:72:0a:ad:ad",
            "net3": "de:76:86:4c:68:15",
            "net4": "76:59:72:f4:ca:7f",
            "net5": "9e:31:36:1f:9e:06",
            "net6": "6a:62:12:69:02:b2",
            "net7": "f6:de:4f:eb:86:b4",
            "net8": "9a:89:78:0f:58:ea"
        },
        "leaf_4_0_4": {
            "net0": "7e:51:9f:74:c1:b7",
            "net1": "26:4d:20:14:2a:48",
            "net2": "86:4d:85:60:66:a9",
            "net3": "de:2b:f9:16:d6:d9",
            "net4": "46:ca:0a:2f:c4:db",
            "net5": "ae:bf:9f:12:93:b5",
            "net6": "fe:f2:47:45:3e:0a",
            "net7": "42:c7:27:d6:3a:39",
            "net8": "a6:26:27:d0:0e:fa"
        },
        "leaf_4_0_5": {
            "net0": "42:82:95:3b:a7:92",
            "net1": "8e:35:bb:6a:1e:97",
            "net2": "36:dc:17:bd:6e:b4",
            "net3": "a2:8a:5f:b2:08:4a",
            "net4": "22:25:d8:56:7a:7e",
            "net5": "9e:63:74:65:09:4a",
            "net6": "4e:40:8f:ea:5e:06",
            "net7": "0a:47:e0:b5:37:90",
            "net8": "6e:68:c1:40:ec:88"
        },
        "leaf_4_0_6": {
            "net0": "52:18:37:23:49:ec",
            "net1": "ce:50:a7:45:c6:f6",
            "net2": "d2:28:1d:8d:62:65",
            "net3": "42:7c:f2:13:da:dc",
            "net4": "32:00:9f:34:f9:86",
            "net5": "02:f4:6d:f6:41:16",
            "net6": "aa:ab:69:c1:2d:6c",
            "net7": "4a:77:6a:39:6b:b6",
            "net8": "66:92:e6:ad:e2:d4"
        },
        "leaf_4_0_7": {
            "net0": "ba:73:17:0f:b4:93",
            "net1": "4a:86:87:52:f8:c4",
            "net2": "32:24:16:57:ab:30",
            "net3": "1e:a5:db:a1:94:fd",
            "net4": "36:39:c1:c5:01:6e",
            "net5": "4e:57:ba:34:53:46",
            "net6": "32:ec:51:a9:22:f0",
            "net7": "32:b0:a6:11:0f:b9",
            "net8": "1e:4c:a4:9d:53:3e"
        },
        "leaf_4_0_8": {
            "net0": "8e:04:71:c6:2c:01",
            "net1": "26:09:8e:42:c5:3b",
            "net2": "86:ce:97:af:fb:1f",
            "net3": "3a:65:fe:1d:5b:ad",
            "net4": "02:56:e0:c9:8a:3a",
            "net5": "66:a4:f8:91:b6:32",
            "net6": "52:07:05:d0:30:c9",
            "net7": "6e:d1:c1:c4:28:2d",
            "net8": "ae:4d:5a:1d:d0:68"
        },
        "spine_1_1_1": {
            "net0": "ee:40:79:d4:e5:8a",
            "net1": "ca:59:1c:0d:6b:04",
            "net10": "1a:c3:f0:69:15:d6",
            "net11": "22:a5:3f:74:46:0d",
            "net12": "3a:37:c0:7c:5b:fa",
            "net13": "c2:ec:95:98:cc:c4",
            "net14": "16:ab:bf:d5:0f:a4",
            "net15": "7a:b0:c4:28:5b:bb",
            "net2": "36:d7:ef:63:aa:94",
            "net3": "6a:df:c8:5b:65:49",
            "net4": "de:6d:62:62:5e:dd",
            "net5": "b6:7c:df:d1:98:a2",
            "net6": "4a:af:ad:fb:a8:ff",
            "net7": "0a:7c:10:c1:b3:38",
            "net8": "66:e7:3d:c4:ad:ba",
            "net9": "d2:49:12:de:4e:88"
        },
        "spine_1_1_2": {
            "net0": "76:2f:34:47:0d:f3",
            "net1": "02:0e:98:0a:88:4b",
            "net10": "06:09:e1:92:e2:09",
            "net11": "3e:8d:9d:ba:49:b3",
            "net12": "1e:05:c0:ef:5c:a4",
            "net13": "7a:84:51:d8:ea:09",
            "net14": "46:c0:37:07:a7:e0",
            "net15": "7e:dc:49:a6:5a:e0",
            "net2": "86:38:3b:93:06:00",
            "net3": "9e:ac:fd:13:cf:fb",
            "net4": "06:5c:9e:fd:80:56",
            "net5": "1e:ad:c2:eb:f8:5b",
            "net6": "9e:a0:9a:98:84:40",
            "net7": "2a:e1:0d:9a:e0:38",
            "net8": "4e:29:c0:89:4b:39",
            "net9": "5a:52:50:63:7a:7f"
        },
        "spine_1_1_3": {
            "net0": "2a:74:c1:5f:37:06",
            "net1": "aa:30:01:6a:d8:ed",
            "net10": "1a:df:6d:48:40:e2",
            "net11": "3a:6d:32:6d:7a:e2",
            "net12": "b2:3d:12:65:57:67",
            "net13": "0e:66:73:9d:b6:eb",
            "net14": "4a:a2:39:ea:6e:0d",
            "net15": "5a:cd:61:c2:2a:01",
            "net2": "16:ae:48:53:48:4c",
            "net3": "16:c8:4e:e5:1b:4d",
            "net4": "06:1d:a3:63:62:83",
            "net5": "92:4c:ed:2d:a9:aa",
            "net6": "da:77:41:69:79:3f",
            "net7": "12:8a:b9:92:58:69",
            "net8": "2e:0f:43:40:9b:3b",
            "net9": "7e:b0:eb:82:cb:8c"
        },
        "spine_1_1_4": {
            "net0": "ca:67:6c:7d:f6:c1",
            "net1": "b6:8b:f3:3d:b1:b6",
            "net10": "7a:50:66:1c:74:a2",
            "net11": "1a:c7:26:3b:c4:e8",
            "net12": "e2:a1:d4:6a:f0:1b",
            "net13": "be:3a:69:7e:24:3a",
            "net14": "72:8f:c7:ff:d9:86",
            "net15": "f2:65:b2:bb:cb:50",
            "net2": "7e:9b:41:0b:a1:1e",
            "net3": "56:ae:f3:8b:9c:9c",
            "net4": "4e:49:cd:1a:9b:cd",
            "net5": "4e:d3:9d:c3:72:33",
            "net6": "be:0a:93:1c:c7:51",
            "net7": "0e:db:e7:8d:8d:32",
            "net8": "fe:03:f7:01:33:13",
            "net9": "62:fe:a1:76:30:78"
        },
        "spine_1_1_5": {
            "net0": "f6:fd:a1:ef:6a:4e",
            "net1": "0e:99:76:82:b5:1f",
            "net10": "0a:1b:f8:09:08:44",
            "net11": "1e:3d:c3:43:d1:e1",
            "net12": "9e:67:8f:d2:e2:05",
            "net13": "12:64:6e:d7:d6:53",
            "net14": "82:9e:fa:ec:8b:bb",
            "net15": "2a:2d:c8:94:8e:db",
            "net2": "96:bc:e7:2f:69:67",
            "net3": "c6:e7:e9:56:bc:62",
            "net4": "36:e6:64:78:74:b2",
            "net5": "e6:d0:3c:35:a3:b3",
            "net6": "46:85:be:03:4a:d4",
            "net7": "36:c2:57:48:be:63",
            "net8": "56:a3:30:22:c1:78",
            "net9": "5e:7d:00:c1:9b:3c"
        },
        "spine_1_1_6": {
            "net0": "1a:83:b2:1e:f8:98",
            "net1": "b2:f0:25:47:4e:f4",
            "net10": "66:5a:b0:3a:2b:87",
            "net11": "d2:63:8c:2e:d1:11",
            "net12": "26:76:ac:a6:65:52",
            "net13": "4e:61:4c:1c:8e:5d",
            "net14": "32:f8:9a:31:26:8e",
            "net15": "56:4d:90:23:bf:26",
            "net2": "be:17:ea:cc:ef:5c",
            "net3": "36:91:12:56:3c:29",
            "net4": "42:6b:0e:cc:3f:33",
            "net5": "56:24:e0:86:1e:42",
            "net6": "36:a4:95:eb:9c:cc",
            "net7": "a6:e8:36:5a:2a:f9",
            "net8": "d6:9d:66:39:f9:9e",
            "net9": "4e:bf:1b:53:c6:fa"
        },
        "spine_1_1_7": {
            "net0": "4e:ae:ce:88:e5:64",
            "net1": "86:c3:8c:1c:fb:be",
            "net10": "d6:29:69:01:50:b8",
            "net11": "1e:db:2a:8c:26:79",
            "net12": "0e:26:54:9b:ee:c7",
            "net13": "7e:f5:20:20:9d:05",
            "net14": "12:a1:cf:35:9f:07",
            "net15": "a2:e4:3f:ad:f3:3d",
            "net2": "7e:ad:e4:78:bd:3d",
            "net3": "5a:96:93:3a:fd:02",
            "net4": "5a:6f:fd:17:a4:2a",
            "net5": "3a:f7:e8:e4:bb:51",
            "net6": "96:bb:65:da:1b:54",
            "net7": "ba:8d:5c:95:1c:40",
            "net8": "6e:78:ad:98:27:38",
            "net9": "06:0a:82:52:db:6e"
        },
        "spine_1_1_8": {
            "net0": "9e:3b:36:35:06:83",
            "net1": "d2:c3:c5:cb:58:8b",
            "net10": "2a:ca:16:8d:57:63",
            "net11": "76:ab:77:69:1e:c0",
            "net12": "fe:f3:4f:d3:39:b2",
            "net13": "4a:07:10:7a:8a:81",
            "net14": "26:9c:3a:dd:3a:f9",
            "net15": "b2:da:6f:e3:d2:86",
            "net2": "b6:dd:ec:5e:be:fd",
            "net3": "ca:78:03:04:29:00",
            "net4": "06:b8:86:16:98:5d",
            "net5": "d2:2f:23:e6:19:0d",
            "net6": "f2:be:ee:53:b7:09",
            "net7": "e2:29:0e:58:41:16",
            "net8": "ce:fb:2f:0b:56:58",
            "net9": "66:0d:5d:ef:4e:a7"
        },
        "spine_2_1_1": {
            "net0": "2a:c1:24:8c:92:ad",
            "net1": "5e:e7:f5:e3:ca:49",
            "net10": "9a:d7:63:3e:11:37",
            "net11": "26:8b:f2:a2:9e:41",
            "net12": "62:3b:a5:a5:19:94",
            "net13": "7e:b4:42:d7:80:03",
            "net14": "e2:a6:28:9e:0f:97",
            "net15": "aa:92:d7:4f:81:06",
            "net2": "76:73:c6:96:0d:1e",
            "net3": "8a:99:c2:30:c5:44",
            "net4": "42:f4:23:67:5b:11",
            "net5": "52:ca:ff:b0:8c:08",
            "net6": "62:b6:cd:46:5f:72",
            "net7": "8e:14:fe:83:d5:c7",
            "net8": "86:7b:ed:5e:b0:d6",
            "net9": "e2:e8:9b:04:bf:22"
        },
        "spine_2_1_2": {
            "net0": "32:bb:03:1f:09:f6",
            "net1": "ce:20:12:fb:04:74",
            "net10": "46:83:23:d1:77:19",
            "net11": "fe:da:63:5e:c5:66",
            "net12": "fe:f5:cd:03:d1:c1",
            "net13": "aa:c0:36:b5:b5:c1",
            "net14": "26:92:31:3f:c4:4d",
            "net15": "d6:5b:bd:e8:51:5e",
            "net2": "a2:6f:1d:d8:77:fc",
            "net3": "ce:4c:76:b1:91:dd",
            "net4": "ca:7c:cd:28:a2:a5",
            "net5": "6e:6b:d0:47:4e:ed",
            "net6": "fe:32:09:5b:d8:26",
            "net7": "d2:05:e5:9d:03:47",
            "net8": "c6:f5:47:50:df:05",
            "net9": "76:f0:16:59:44:51"
        },
        "spine_2_1_3": {
            "net0": "06:b1:32:52:ea:bd",
            "net1": "4a:82:8f:bf:4b:02",
            "net10": "7a:d5:12:fd:59:e6",
            "net11": "1e:9c:24:ee:33:b7",
            "net12": "e6:2d:81:dc:23:24",
            "net13": "7e:ed:ad:13:17:c5",
            "net14": "ca:b1:c0:0d:03:fa",
            "net15": "3a:80:16:fc:3f:98",
            "net2": "0e:e5:ed:e8:af:3f",
            "net3": "3e:f0:4c:6d:e9:26",
            "net4": "02:6f:b4:5a:d7:7c",
            "net5": "3a:93:15:78:b3:2a",
            "net6": "76:5c:a9:9e:27:75",
            "net7": "52:4c:b4:ac:f5:b3",
            "net8": "4e:df:1f:66:40:63",
            "net9": "76:e6:41:a6:a9:23"
        },
        "spine_2_1_4": {
            "net0": "56:c4:56:c0:0f:b9",
            "net1": "52:6e:59:b6:53:00",
            "net10": "52:9a:cb:b4:a9:fc",
            "net11": "da:5d:3e:86:1b:3c",
            "net12": "ba:23:94:4c:9e:b8",
            "net13": "ba:58:7e:f6:72:5a",
            "net14": "8a:0d:f6:38:ce:85",
            "net15": "ee:d1:0e:f1:a1:00",
            "net2": "66:81:6e:82:9f:d4",
            "net3": "ee:f3:df:7c:9c:69",
            "net4": "7e:c2:fe:b3:55:df",
            "net5": "f6:16:7a:8b:7b:68",
            "net6": "ea:fd:65:4e:01:4b",
            "net7": "f2:d9:64:9b:62:87",
            "net8": "de:2c:87:6a:15:aa",
            "net9": "aa:00:87:00:3e:51"
        },
        "spine_2_1_5": {
            "net0": "16:d9:ea:3f:ef:dd",
            "net1": "ae:4b:02:9b:fd:1d",
            "net10": "de:46:86:58:7f:0c",
            "net11": "26:3e:70:10:74:c9",
            "net12": "2a:4c:a0:5a:3f:76",
            "net13": "3e:95:ff:3e:92:1a",
            "net14": "12:3d:76:d7:35:f0",
            "net15": "06:ed:73:1e:37:d5",
            "net2": "2a:87:18:53:8d:15",
            "net3": "3e:4c:90:6e:c9:35",
            "net4": "46:0d:ed:50:7a:76",
            "net5": "ce:12:2c:79:21:88",
            "net6": "22:76:b2:3e:a7:53",
            "net7": "4a:68:f7:bf:41:f3",
            "net8": "f6:87:a4:29:13:27",
            "net9": "fe:d6:09:95:f7:50"
        },
        "spine_2_1_6": {
            "net0": "c2:ac:11:e7:21:bf",
            "net1": "de:b3:0a:4a:5c:3f",
            "net10": "d2:39:1c:c5:dc:02",
            "net11": "d6:4d:5b:84:7b:d0",
            "net12": "2a:05:b3:fc:1a:03",
            "net13": "62:6c:f2:4c:01:b5",
            "net14": "4a:3e:85:42:55:b8",
            "net15": "7e:d6:18:3d:40:73",
            "net2": "d2:76:30:f5:42:a8",
            "net3": "5e:b3:8c:17:04:d9",
            "net4": "8a:ae:00:e0:c8:15",
            "net5": "2a:9f:fb:ce:c7:72",
            "net6": "6e:2c:d6:4c:53:97",
            "net7": "2e:0c:bf:d8:9a:ce",
            "net8": "ea:61:83:d2:51:4e",
            "net9": "52:3a:64:b0:15:e8"
        },
        "spine_2_1_7": {
            "net0": "ba:d8:26:35:7f:b4",
            "net1": "7e:96:60:1d:40:07",
            "net10": "52:e3:b7:e5:71:8d",
            "net11": "9e:d6:90:2b:67:51",
            "net12": "9e:5f:b3:da:18:d7",
            "net13": "4a:fb:ba:a2:09:79",
            "net14": "16:fd:a3:70:2c:89",
            "net15": "1a:1c:85:90:72:92",
            "net2": "76:87:6e:c4:bd:ca",
            "net3": "46:82:fb:38:d9:73",
            "net4": "4e:cb:2b:6b:c4:de",
            "net5": "56:21:c7:c2:95:30",
            "net6": "9e:91:c5:d9:ff:84",
            "net7": "aa:9d:0c:94:02:d1",
            "net8": "ce:ea:38:34:de:e7",
            "net9": "56:82:96:0a:81:70"
        },
        "spine_2_1_8": {
            "net0": "b6:e6:da:7b:8c:2c",
            "net1": "c2:97:ba:1f:cc:d3",
            "net10": "a2:2c:5e:e9:37:35",
            "net11": "4e:80:99:9a:8b:83",
            "net12": "4a:2f:38:16:a0:20",
            "net13": "d2:ac:2e:f2:02:09",
            "net14": "ca:7f:d7:9c:17:82",
            "net15": "66:73:75:87:cb:21",
            "net2": "c6:43:a5:88:39:a5",
            "net3": "8a:28:e5:77:40:ae",
            "net4": "2a:e3:31:78:70:97",
            "net5": "fa:99:b4:d5:4a:4d",
            "net6": "ee:7a:b2:2b:11:77",
            "net7": "4e:04:aa:22:48:7b",
            "net8": "0a:a3:b6:94:77:d6",
            "net9": "de:df:9d:4a:23:33"
        },
        "spine_3_1_1": {
            "net0": "22:ed:9e:47:49:5a",
            "net1": "12:69:68:c6:a5:1c",
            "net10": "d2:92:35:75:3a:b0",
            "net11": "86:86:82:b5:5e:98",
            "net12": "b2:ba:0b:b0:cb:b1",
            "net13": "ae:2b:84:bf:29:bb",
            "net14": "1e:bc:65:31:35:5c",
            "net15": "46:32:43:88:92:e8",
            "net2": "1a:8e:4d:2e:4a:e4",
            "net3": "a6:70:f2:69:af:be",
            "net4": "9a:5d:99:b6:71:84",
            "net5": "76:c1:51:37:b6:4f",
            "net6": "c6:b9:e0:f0:37:b7",
            "net7": "c2:ed:5d:58:34:75",
            "net8": "4a:53:b2:6a:b4:11",
            "net9": "d2:d0:29:b4:76:89"
        },
        "spine_3_1_2": {
            "net0": "86:1b:30:bf:0f:e1",
            "net1": "42:22:f6:92:31:ee",
            "net10": "36:6d:3d:ac:be:89",
            "net11": "fa:bc:14:d1:c3:e9",
            "net12": "46:43:4f:e4:66:02",
            "net13": "66:92:59:0d:c9:d6",
            "net14": "32:0b:f2:0f:91:3c",
            "net15": "36:3a:f7:dd:fb:29",
            "net2": "7e:4b:5b:dd:d9:28",
            "net3": "0e:80:ee:f6:33:54",
            "net4": "6a:c8:87:7e:63:93",
            "net5": "ca:d0:aa:4c:c7:c8",
            "net6": "6e:71:62:54:6f:5b",
            "net7": "d6:96:9b:e0:2b:59",
            "net8": "2a:3f:3c:d7:cd:b8",
            "net9": "ea:cf:bb:9a:3d:00"
        },
        "spine_3_1_3": {
            "net0": "72:b7:66:5e:1e:e3",
            "net1": "d6:b6:33:fa:0b:1e",
            "net10": "7a:75:b7:6b:6e:26",
            "net11": "ca:37:01:9e:6a:82",
            "net12": "d6:30:d5:91:90:1d",
            "net13": "32:a3:49:3a:34:1f",
            "net14": "92:15:17:75:08:28",
            "net15": "7a:6d:eb:de:fe:d4",
            "net2": "7a:21:c3:37:51:de",
            "net3": "16:a2:0d:ad:bb:0f",
            "net4": "c2:42:e1:aa:7d:2b",
            "net5": "06:5c:75:9d:d0:d2",
            "net6": "ea:c8:4a:45:11:69",
            "net7": "6e:6c:55:83:12:df",
            "net8": "ce:79:99:9c:c5:3d",
            "net9": "92:d5:bd:a9:6a:8e"
        },
        "spine_3_1_4": {
            "net0": "2e:f5:c5:52:36:7d",
            "net1": "5e:28:76:8f:47:8c",
            "net10": "22:ae:1f:52:bf:16",
            "net11": "ae:65:fe:a1:66:10",
            "net12": "fe:32:e4:0d:83:c2",
            "net13": "0e:f2:53:23:a4:18",
            "net14": "92:05:35:a0:95:91",
            "net15": "36:de:2c:c2:c4:12",
            "net2": "d2:db:51:e0:fb:0c",
            "net3": "f6:46:05:8a:57:3c",
            "net4": "4a:87:a2:da:c1:54",
            "net5": "06:cf:e4:12:19:1e",
            "net6": "32:60:2e:8c:c4:65",
            "net7": "26:88:2c:e3:06:c7",
            "net8": "6e:9b:28:3a:3b:f6",
            "net9": "02:1a:59:5e:6a:05"
        },
        "spine_3_1_5": {
            "net0": "c2:59:79:bc:6f:a3",
            "net1": "7e:80:f6:ee:64:29",
            "net10": "4e:19:ba:e1:ca:cc",
            "net11": "9e:db:c7:5f:66:26",
            "net12": "d2:44:e4:24:83:62",
            "net13": "82:1f:e3:83:74:b8",
            "net14": "5a:3f:01:e6:c2:e2",
            "net15": "0e:7a:43:fd:18:8b",
            "net2": "5a:04:7c:33:52:a5",
            "net3": "56:06:e1:ea:fa:17",
            "net4": "4e:f4:f8:0b:ee:e0",
            "net5": "42:c6:f6:c5:b2:fe",
            "net6": "56:41:15:c9:81:51",
            "net7": "46:85:e7:73:87:ef",
            "net8": "5a:8c:47:9c:a3:31",
            "net9": "d6:67:b1:b3:05:20"
        },
        "spine_3_1_6": {
            "net0": "22:31:99:f8:0a:b7",
            "net1": "2e:1d:f7:15:6d:5a",
            "net10": "e2:2e:2d:ec:37:3b",
            "net11": "c2:fb:b5:e2:2d:86",
            "net12": "c6:16:d2:30:11:5e",
            "net13": "aa:8e:98:8b:12:b5",
            "net14": "aa:96:cd:d3:99:5d",
            "net15": "ea:72:eb:78:7d:d0",
            "net2": "52:44:2b:f2:a4:fb",
            "net3": "06:de:b2:c3:7b:54",
            "net4": "1e:5f:01:cf:f4:bc",
            "net5": "9e:f7:e8:0f:88:b1",
            "net6": "fe:c2:5a:d6:84:57",
            "net7": "4e:ea:9c:9f:40:a3",
            "net8": "0e:ae:df:92:82:0b",
            "net9": "06:3b:9d:32:64:28"
        },
        "spine_3_1_7": {
            "net0": "c2:6f:41:fb:fa:8e",
            "net1": "66:4f:2f:f3:f0:ba",
            "net10": "d6:3f:d1:28:82:e4",
            "net11": "ea:46:19:7e:b6:d4",
            "net12": "aa:58:22:bf:cd:7b",
            "net13": "76:6e:bb:48:59:06",
            "net14": "26:c0:43:29:69:17",
            "net15": "92:ff:4f:ba:6d:d0",
            "net2": "52:a2:8b:0f:be:8d",
            "net3": "2a:76:43:0a:88:54",
            "net4": "4e:30:43:12:fe:6b",
            "net5": "52:47:35:8b:99:9e",
            "net6": "0a:37:b9:86:7f:90",
            "net7": "4e:81:ee:a2:bc:08",
            "net8": "82:3a:8c:cb:43:04",
            "net9": "aa:93:91:34:e0:ce"
        },
        "spine_3_1_8": {
            "net0": "26:fa:77:f5:75:d4",
            "net1": "ca:b5:6a:2b:5b:49",
            "net10": "8e:8f:da:8d:3d:7e",
            "net11": "82:4e:b5:95:30:14",
            "net12": "d6:c9:62:b1:9d:88",
            "net13": "2a:79:e5:f2:c2:d6",
            "net14": "f6:2a:b8:59:4e:2d",
            "net15": "22:82:c7:ad:cc:01",
            "net2": "56:33:aa:86:25:2d",
            "net3": "36:8b:34:06:db:e5",
            "net4": "82:3d:b5:21:59:ee",
            "net5": "b2:47:aa:c4:a8:1f",
            "net6": "0a:3d:26:c8:46:ed",
            "net7": "16:a7:69:74:7d:a3",
            "net8": "82:9b:30:5a:ea:1c",
            "net9": "5a:b4:0f:76:d5:ce"
        },
        "spine_4_1_1": {
            "net0": "26:e4:ed:a4:5d:4e",
            "net1": "a6:d8:93:39:c0:b1",
            "net10": "66:3e:82:47:d5:89",
            "net11": "7a:de:20:21:dc:68",
            "net12": "3a:b0:cd:1e:64:fe",
            "net13": "d6:7f:bb:bb:45:e6",
            "net14": "82:27:42:84:2d:f3",
            "net15": "62:3c:a9:cb:a3:75",
            "net2": "36:7e:01:00:ee:0e",
            "net3": "9a:a2:c2:d5:78:d5",
            "net4": "a2:d4:61:84:29:20",
            "net5": "8a:0b:f1:6a:89:74",
            "net6": "d6:8d:57:e0:41:1e",
            "net7": "ea:11:f3:71:36:ce",
            "net8": "4a:dc:14:b7:74:df",
            "net9": "82:92:8c:9b:fc:f2"
        },
        "spine_4_1_2": {
            "net0": "b2:a7:01:df:30:54",
            "net1": "e6:ff:36:30:96:c7",
            "net10": "1a:02:e4:bb:3a:7f",
            "net11": "ee:4c:ca:9f:b6:3b",
            "net12": "62:71:3e:15:27:d8",
            "net13": "5a:7d:6e:37:6a:cb",
            "net14": "0e:80:8b:b1:dd:f4",
            "net15": "e2:a9:b7:4b:fd:99",
            "net2": "fe:b9:4f:a8:8a:86",
            "net3": "c6:2b:4d:22:f3:5a",
            "net4": "92:8f:8d:9d:a8:f7",
            "net5": "26:53:d5:87:7a:de",
            "net6": "2a:38:75:f4:f7:bf",
            "net7": "a6:dd:b4:f7:16:27",
            "net8": "1a:07:dd:01:92:a6",
            "net9": "0e:9f:00:40:77:ca"
        },
        "spine_4_1_3": {
            "net0": "5e:a1:64:23:c0:ef",
            "net1": "7e:50:da:dd:73:9e",
            "net10": "1a:db:0b:8c:ca:37",
            "net11": "c6:eb:ac:f5:96:7f",
            "net12": "2e:6e:54:16:5d:66",
            "net13": "86:0b:20:08:a8:69",
            "net14": "b2:1f:24:8b:1e:a4",
            "net15": "be:68:25:8e:79:46",
            "net2": "4a:a0:89:52:b2:97",
            "net3": "56:54:1f:ba:56:70",
            "net4": "2a:3c:54:04:54:a6",
            "net5": "56:ac:4e:ec:5b:f9",
            "net6": "7e:e8:46:5c:85:78",
            "net7": "2a:c5:1b:cb:cf:e3",
            "net8": "2a:68:71:93:39:6e",
            "net9": "4e:a7:ab:51:9c:51"
        },
        "spine_4_1_4": {
            "net0": "f6:ea:44:c0:a3:dc",
            "net1": "ca:68:54:80:a7:51",
            "net10": "5e:ee:e6:dd:75:88",
            "net11": "6e:5a:50:95:18:49",
            "net12": "0a:6d:36:8e:09:b1",
            "net13": "2a:bf:a4:c2:c2:3a",
            "net14": "5a:cb:5b:41:41:f9",
            "net15": "d2:7c:c7:04:d0:8c",
            "net2": "d2:c7:14:51:54:a2",
            "net3": "f6:d7:09:bf:35:f0",
            "net4": "ce:7e:13:33:88:b4",
            "net5": "aa:85:73:82:b9:b0",
            "net6": "fa:22:30:90:da:7a",
            "net7": "26:9e:a8:fd:58:2f",
            "net8": "ea:0d:ac:37:df:b9",
            "net9": "a6:33:01:35:b3:4f"
        },
        "spine_4_1_5": {
            "net0": "6e:a5:3c:ee:fc:19",
            "net1": "2a:04:8d:7e:7d:b4",
            "net10": "5e:6c:09:82:f2:2b",
            "net11": "d6:e7:b2:4f:06:9e",
            "net12": "b6:82:67:6b:6a:31",
            "net13": "9e:86:40:e7:48:9a",
            "net14": "22:92:c9:21:6d:a6",
            "net15": "de:d7:b5:fa:f1:03",
            "net2": "56:cf:52:00:bd:d8",
            "net3": "a2:d9:00:d4:7d:ac",
            "net4": "3a:b0:36:86:22:0a",
            "net5": "72:80:f5:fa:5c:7c",
            "net6": "4a:8b:3d:aa:87:ac",
            "net7": "92:4e:a8:c6:14:c2",
            "net8": "f6:3e:a5:0d:cb:eb",
            "net9": "82:3b:f6:b9:e1:f2"
        },
        "spine_4_1_6": {
            "net0": "3a:1d:d6:5b:82:f5",
            "net1": "56:dd:0e:d6:73:01",
            "net10": "d6:16:a1:e3:2f:d3",
            "net11": "1a:5e:3d:e3:34:bd",
            "net12": "4e:9c:ce:34:7d:0e",
            "net13": "c6:0f:84:a5:44:f9",
            "net14": "aa:04:50:bc:be:cc",
            "net15": "4a:f0:dc:10:6b:d5",
            "net2": "9a:9d:0a:fc:e9:32",
            "net3": "d2:5c:59:a8:29:b5",
            "net4": "46:0d:b1:09:12:b5",
            "net5": "be:03:c8:e4:e5:1c",
            "net6": "7e:ed:86:f3:7b:3f",
            "net7": "42:13:e8:c2:1d:16",
            "net8": "26:c4:46:80:f8:8b",
            "net9": "92:85:cd:f2:96:3b"
        },
        "spine_4_1_7": {
            "net0": "ea:c9:c0:10:1e:b6",
            "net1": "62:13:0e:4e:0e:99",
            "net10": "5e:88:3b:85:7f:11",
            "net11": "d6:de:ab:6f:1b:46",
            "net12": "3e:90:85:aa:3f:9a",
            "net13": "56:a1:94:9e:dd:0f",
            "net14": "d2:b4:d1:3c:7c:bd",
            "net15": "3a:9b:f4:28:24:5e",
            "net2": "1a:3f:ae:dd:1a:8f",
            "net3": "52:df:ed:c5:68:c6",
            "net4": "8a:39:1f:b1:b9:d7",
            "net5": "9a:2b:f0:50:93:bb",
            "net6": "32:a4:98:35:ad:e3",
            "net7": "66:05:0f:90:63:63",
            "net8": "36:25:93:01:83:db",
            "net9": "ba:3f:46:22:99:9a"
        },
        "spine_4_1_8": {
            "net0": "96:df:c0:a8:f2:a9",
            "net1": "a6:76:ec:d1:dd:5c",
            "net10": "42:87:c8:7a:59:f2",
            "net11": "f6:8c:5e:13:19:16",
            "net12": "c6:fa:dd:bd:0a:7c",
            "net13": "2e:a3:63:08:55:69",
            "net14": "46:1f:33:f2:fc:d5",
            "net15": "a6:1d:02:88:69:c4",
            "net2": "3a:7a:5f:e0:70:55",
            "net3": "7e:a9:a1:7b:dc:1d",
            "net4": "4a:b1:85:20:a7:85",
            "net5": "5a:3b:1b:fb:9d:b1",
            "net6": "82:a1:42:2c:12:c9",
            "net7": "4e:20:50:80:27:f2",
            "net8": "aa:e5:0d:16:b8:d5",
            "net9": "de:5b:43:3f:7b:74"
        },
        "tof_1_2_1": {
            "net0": "d2:55:39:45:67:3a",
            "net1": "de:75:48:01:8f:55",
            "net10": "5a:a8:58:d6:64:17",
            "net11": "22:4d:b2:fb:30:6c",
            "net12": "82:2e:8e:55:80:67",
            "net13": "d6:81:89:aa:3d:5f",
            "net14": "42:1f:15:a7:2e:d7",
            "net15": "d6:9e:24:0c:38:56",
            "net2": "1e:6f:42:aa:23:48",
            "net3": "ba:c9:58:3b:93:31",
            "net4": "0a:bc:9f:25:28:c9",
            "net5": "0a:5b:80:34:12:54",
            "net6": "5a:99:87:e4:63:cd",
            "net7": "ee:6b:f7:b0:c5:db",
            "net8": "de:b7:f5:d3:74:86",
            "net9": "2e:83:5a:1a:81:c6"
        },
        "tof_1_2_2": {
            "net0": "6a:7c:00:02:fa:cd",
            "net1": "0a:44:fc:06:58:10",
            "net10": "2a:f2:eb:5d:b3:cc",
            "net11": "0e:d7:67:11:c9:1f",
            "net12": "06:d2:a8:0c:b1:25",
            "net13": "6e:24:e2:2a:04:5e",
            "net14": "46:82:68:09:94:4a",
            "net15": "ae:f5:96:50:6d:8f",
            "net2": "5e:5b:21:87:f1:0c",
            "net3": "ca:36:7e:9d:ff:30",
            "net4": "b2:0a:2f:ad:c7:16",
            "net5": "76:a7:c3:f0:16:3c",
            "net6": "d6:e4:1c:ec:66:2d",
            "net7": "16:c9:26:62:ca:a8",
            "net8": "36:8b:ae:80:24:f9",
            "net9": "aa:30:a6:84:3d:87"
        },
        "tof_1_2_3": {
            "net0": "92:91:5d:25:2e:20",
            "net1": "aa:d0:bc:9f:ec:7a",
            "net10": "e6:cd:55:78:9c:17",
            "net11": "5e:05:b9:d6:49:59",
            "net12": "6e:e1:94:f9:25:be",
            "net13": "8a:be:c3:35:55:27",
            "net14": "1a:81:1b:29:f6:b6",
            "net15": "5e:b5:ec:10:bb:4e",
            "net2": "4e:88:05:a1:af:ac",
            "net3": "ea:a0:94:45:86:85",
            "net4": "ae:e4:cb:ef:75:2f",
            "net5": "d2:30:ec:11:0a:45",
            "net6": "22:50:4b:9c:44:e0",
            "net7": "c2:6a:34:3c:76:4c",
            "net8": "1e:d3:50:f9:c0:5d",
            "net9": "2a:e3:9d:90:b5:1b"
        },
        "tof_1_2_4": {
            "net0": "72:7c:26:be:c8:d2",
            "net1": "26:9a:2c:84:3b:7d",
            "net10": "f2:bd:bf:89:64:86",
            "net11": "8a:b3:6b:b9:c0:ac",
            "net12": "ee:08:92:0b:af:5e",
            "net13": "16:a5:8e:09:9c:e0",
            "net14": "8a:b3:34:74:01:e7",
            "net15": "d2:23:c9:84:66:f3",
            "net2": "e6:98:5c:51:f2:7b",
            "net3": "b6:e1:3e:0c:50:35",
            "net4": "de:0b:1a:c7:47:1c",
            "net5": "6e:44:6c:23:e5:c0",
            "net6": "b6:2e:7e:e7:c9:88",
            "net7": "aa:83:49:bd:2a:53",
            "net8": "9e:81:eb:09:ec:29",
            "net9": "8e:fc:f5:31:fa:f6"
        },
        "tof_1_2_5": {
            "net0": "be:27:64:ec:1e:83",
            "net1": "3e:fd:4b:b5:15:98",
            "net10": "de:28:a0:b1:11:7b",
            "net11": "ee:a1:d1:3b:08:43",
            "net12": "fa:0a:31:22:32:c8",
            "net13": "32:2e:f2:c7:c4:17",
            "net14": "92:4f:cf:3b:63:89",
            "net15": "f2:14:4e:fa:2b:4d",
            "net2": "ce:58:38:61:ca:9c",
            "net3": "26:6a:d0:cb:bf:2c",
            "net4": "0e:6c:77:a6:fd:28",
            "net5": "56:b3:e2:ce:5c:c5",
            "net6": "36:18:d0:de:94:d7",
            "net7": "02:d4:aa:05:c4:71",
            "net8": "e2:94:0e:30:7c:80",
            "net9": "62:f0:b7:3f:de:c7"
        },
        "tof_1_2_6": {
            "net0": "b2:6e:41:d7:92:17",
            "net1": "f2:c2:cf:93:0a:b8",
            "net10": "1e:21:81:fd:bc:2c",
            "net11": "f2:4f:12:c5:33:ea",
            "net12": "2a:95:11:39:12:f2",
            "net13": "a6:44:03:e3:b2:07",
            "net14": "f2:bb:2a:b2:5c:6f",
            "net15": "d6:0a:d7:7c:54:da",
            "net2": "c2:8f:e4:70:b0:d2",
            "net3": "26:6f:6f:23:78:d4",
            "net4": "32:6c:6b:49:f6:d7",
            "net5": "de:35:e5:85:73:d2",
            "net6": "9a:20:93:2f:36:fa",
            "net7": "62:45:7e:7b:66:d6",
            "net8": "d2:1b:c6:f4:10:2c",
            "net9": "d2:80:5e:74:57:87"
        },
        "tof_1_2_7": {
            "net0": "62:14:40:8e:1d:ff",
            "net1": "9e:a4:21:62:04:2c",
            "net10": "de:48:c2:56:95:a2",
            "net11": "36:9c:31:43:0c:bb",
            "net12": "6a:49:1f:94:af:a6",
            "net13": "be:d3:4f:3a:27:28",
            "net14": "c2:ad:e7:66:ce:70",
            "net15": "a6:97:41:36:9b:8e",
            "net2": "aa:96:54:83:35:b0",
            "net3": "ca:24:6f:00:b8:99",
            "net4": "be:70:b8:4e:f9:52",
            "net5": "b6:7d:a4:f2:3f:0c",
            "net6": "0e:2b:26:2a:09:e9",
            "net7": "ea:9d:a6:cc:79:c4",
            "net8": "72:b3:ab:05:52:9e",
            "net9": "7e:c7:29:e5:80:1f"
        },
        "tof_1_2_8": {
            "net0": "86:c8:a0:54:10:ad",
            "net1": "ce:a0:ee:1d:a9:22",
            "net10": "1a:6a:fe:40:ea:2b",
            "net11": "b6:7c:2e:5b:f1:35",
            "net12": "de:55:54:97:46:1d",
            "net13": "de:8d:a7:8e:ad:67",
            "net14": "2a:81:a0:c8:67:30",
            "net15": "a6:12:18:c1:fa:76",
            "net2": "d2:1a:96:5b:96:38",
            "net3": "96:d0:64:74:ad:44",
            "net4": "6e:09:5d:d2:e4:f3",
            "net5": "86:39:95:e3:8d:41",
            "net6": "d2:fb:ea:29:e3:ab",
            "net7": "f6:f2:03:35:a0:1b",
            "net8": "b2:a7:89:f5:b0:70",
            "net9": "0a:cf:f6:1f:9d:17"
        },
        "tof_2_2_1": {
            "net0": "4e:48:8e:8d:09:bf",
            "net1": "12:3f:58:38:84:93",
            "net10": "06:cf:64:2d:96:ac",
            "net11": "86:07:86:d6:b5:59",
            "net12": "8a:59:c4:61:3c:f7",
            "net13": "c6:1d:1e:05:d5:c4",
            "net14": "62:30:9f:a6:dc:68",
            "net15": "96:46:42:54:c3:1d",
            "net2": "f2:e5:10:d2:c8:4e",
            "net3": "86:b9:85:32:40:b4",
            "net4": "06:ed:54:da:fc:11",
            "net5": "3a:fb:1b:fe:0f:2f",
            "net6": "f2:f8:97:98:8b:e9",
            "net7": "8e:2f:f4:3e:78:56",
            "net8": "a6:91:dc:20:c5:c5",
            "net9": "e2:f8:e4:91:36:7c"
        },
        "tof_2_2_2": {
            "net0": "7e:71:06:55:fa:44",
            "net1": "72:93:60:54:fa:c5",
            "net10": "2a:9e:f2:25:9c:f9",
            "net11": "26:19:44:73:55:f4",
            "net12": "72:81:09:de:26:be",
            "net13": "46:f7:7c:77:0f:b6",
            "net14": "12:92:98:89:fa:fb",
            "net15": "1a:27:3c:86:49:73",
            "net2": "8e:7b:2a:3a:be:38",
            "net3": "5e:8d:b8:96:96:6e",
            "net4": "ba:36:87:63:f6:9b",
            "net5": "52:14:79:1d:c5:46",
            "net6": "be:2e:8c:3b:79:ef",
            "net7": "fa:e0:54:80:0d:4c",
            "net8": "ee:af:cf:b2:d7:1e",
            "net9": "7a:15:b6:30:fb:a5"
        },
        "tof_2_2_3": {
            "net0": "1e:c4:f0:e0:39:0d",
            "net1": "ae:98:53:d9:f9:d0",
            "net10": "16:c0:34:9b:e4:fe",
            "net11": "f2:da:b9:30:1d:ca",
            "net12": "02:0f:c0:17:da:31",
            "net13": "d2:c2:29:1b:aa:2d",
            "net14": "96:8c:b7:d7:5a:fa",
            "net15": "a2:f8:59:c0:1f:23",
            "net2": "ea:37:21:b6:7a:fc",
            "net3": "e6:59:88:dc:6c:94",
            "net4": "fe:c6:dd:51:90:70",
            "net5": "4a:51:39:01:34:db",
            "net6": "26:35:c3:f6:64:3c",
            "net7": "82:d2:25:dc:33:2d",
            "net8": "06:80:32:ab:f8:e4",
            "net9": "b6:62:25:20:1a:11"
        },
        "tof_2_2_4": {
            "net0": "b6:93:ea:87:8c:a3",
            "net1": "5e:84:f8:c7:2d:04",
            "net10": "f6:e9:39:63:13:60",
            "net11": "ce:19:06:ff:16:25",
            "net12": "fa:c2:7a:4b:91:51",
            "net13": "22:97:97:5a:b4:11",
            "net14": "ae:de:a7:6b:1f:36",
            "net15": "86:ec:7d:32:d9:fd",
            "net2": "d6:61:01:01:e3:c3",
            "net3": "ba:01:8f:0e:bd:3b",
            "net4": "d2:82:9b:b3:82:78",
            "net5": "8e:29:15:6f:f8:a3",
            "net6": "42:4c:44:a0:65:7b",
            "net7": "12:46:7a:c3:3c:a2",
            "net8": "ce:49:30:06:47:ae",
            "net9": "1a:d0:f8:6e:36:91"
        },
        "tof_2_2_5": {
            "net0": "9e:2d:d4:12:83:5f",
            "net1": "1a:62:28:ef:f8:12",
            "net10": "a6:8b:1c:d5:6c:69",
            "net11": "52:96:38:dc:33:d7",
            "net12": "5a:40:4a:7b:0c:9f",
            "net13": "1a:26:93:d3:fa:2d",
            "net14": "42:91:a9:64:b9:35",
            "net15": "be:a9:23:84:65:fd",
            "net2": "8a:ff:0e:e6:61:6d",
            "net3": "56:d0:28:b9:fb:64",
            "net4": "ce:d6:42:fc:5f:3b",
            "net5": "82:0e:49:ab:d4:a1",
            "net6": "aa:79:8d:d0:52:32",
            "net7": "ce:0f:e1:20:97:f1",
            "net8": "1a:fa:3f:3a:4a:a5",
            "net9": "b6:e5:fb:e8:30:aa"
        },
        "tof_2_2_6": {
            "net0": "d6:1c:66:84:3b:27",
            "net1": "0a:ea:29:85:ed:df",
            "net10": "56:df:a6:33:a3:19",
            "net11": "26:ff:99:70:78:74",
            "net12": "be:78:e4:51:ce:e6",
            "net13": "0e:04:fc:04:f9:02",
            "net14": "8e:b7:97:ad:b0:2d",
            "net15": "1a:e7:35:da:06:0f",
            "net2": "4a:9b:33:ca:4a:cf",
            "net3": "96:c1:96:bd:cf:cb",
            "net4": "3a:90:9a:d6:eb:9e",
            "net5": "96:a7:2f:31:3e:30",
            "net6": "4e:24:ad:6a:a0:78",
            "net7": "16:57:a3:5e:df:39",
            "net8": "8a:56:64:9e:e6:f3",
            "net9": "d6:ae:92:eb:85:a8"
        },
        "tof_2_2_7": {
            "net0": "c6:c1:2a:68:0b:1f",
            "net1": "32:b8:39:a9:c7:cf",
            "net10": "aa:00:c4:14:24:b6",
            "net11": "fe:98:44:d2:73:62",
            "net12": "b6:54:a4:94:61:75",
            "net13": "e2:71:c0:e2:77:f5",
            "net14": "b6:c4:59:f3:54:01",
            "net15": "22:e7:13:cb:3f:dd",
            "net2": "12:d4:dd:2d:34:ac",
            "net3": "2e:56:dd:fd:15:b1",
            "net4": "3e:b9:e1:c0:6f:61",
            "net5": "d6:91:a2:ee:be:74",
            "net6": "02:38:e4:1c:ea:7d",
            "net7": "da:c0:06:8c:77:55",
            "net8": "92:4f:6f:0c:a8:7c",
            "net9": "8a:f3:8a:eb:de:17"
        },
        "tof_2_2_8": {
            "net0": "ca:06:15:8d:f8:7a",
            "net1": "82:fa:76:b0:b5:83",
            "net10": "ca:6e:c0:93:63:5b",
            "net11": "6e:33:8d:ef:fa:ea",
            "net12": "ca:e2:7a:69:d4:56",
            "net13": "6e:12:bb:8f:2f:d8",
            "net14": "ca:36:b4:94:c8:5d",
            "net15": "9a:66:76:30:d7:e7",
            "net2": "2e:cc:94:ca:f4:6b",
            "net3": "12:6c:13:e5:c1:e8",
            "net4": "4e:2c:dd:f7:0f:19",
            "net5": "06:ee:c0:44:bf:ba",
            "net6": "ca:06:b1:c0:3f:cd",
            "net7": "4e:99:4a:2c:09:61",
            "net8": "3a:eb:83:0b:25:b1",
            "net9": "3e:1b:05:93:2d:94"
        }
    },
    "failed_machine": "leaf_1_0_1",
    "failure_time": {
        "leaf_1_0_1": 1621947643.8078973,
        "leaf_1_0_2": 1621947643.8187811,
        "leaf_1_0_3": 1621947643.8372667,
        "leaf_1_0_4": 1621947643.856023,
        "leaf_1_0_5": 1621947643.8802495,
        "leaf_1_0_6": 1621947643.8109722,
        "leaf_1_0_7": 1621947643.818235,
        "leaf_1_0_8": 1621947643.8364513,
        "leaf_2_0_1": 1621947643.8497374,
        "leaf_2_0_2": 1621947638.1223094,
        "leaf_2_0_3": 1621947643.8154655,
        "leaf_2_0_4": 1621947643.8223648,
        "leaf_2_0_5": 1621947643.8372009,
        "leaf_2_0_6": 1621947643.858807,
        "leaf_2_0_7": 1621947643.8796968,
        "leaf_2_0_8": 1621947643.8101845,
        "leaf_3_0_1": 1621947643.827738,
        "leaf_3_0_2": 1621947643.8370583,
        "leaf_3_0_3": 1621947643.8567057,
        "leaf_3_0_4": 1621947643.8814607,
        "leaf_3_0_5": 1621947643.8863115,
        "leaf_3_0_6": 1621947643.9001448,
        "leaf_3_0_7": 1621947643.916127,
        "leaf_3_0_8": 1621947643.9257607,
        "leaf_4_0_1": 1621947643.9391725,
        "leaf_4_0_2": 1621947643.8980737,
        "leaf_4_0_3": 1621947643.907942,
        "leaf_4_0_4": 1621947643.9153366,
        "leaf_4_0_5": 1621947643.921864,
        "leaf_4_0_6": 1621947643.9320867,
        "leaf_4_0_7": 1621947643.8972576,
        "leaf_4_0_8": 1621947638.1630368,
        "spine_1_1_1": 1621947643.9143736,
        "spine_1_1_2": 1621947643.9276528,
        "spine_1_1_3": 1621947638.1983414,
        "spine_1_1_4": 1621947638.1572857,
        "spine_1_1_5": 1621947638.1690464,
        "spine_1_1_6": 1621947643.9159098,
        "spine_1_1_7": 1621947643.9315023,
        "spine_1_1_8": 1621947643.9472864,
        "spine_2_1_1": 1621947638.203345,
        "spine_2_1_2": 1621947643.962305,
        "spine_2_1_3": 1621947643.986781,
        "spine_2_1_4": 1621947644.0013118,
        "spine_2_1_5": 1621947644.0151057,
        "spine_2_1_6": 1621947643.9549577,
        "spine_2_1_7": 1621947643.9757676,
        "spine_2_1_8": 1621947644.0009549,
        "spine_3_1_1": 1621947644.0130231,
        "spine_3_1_2": 1621947638.2886894,
        "spine_3_1_3": 1621947643.9622843,
        "spine_3_1_4": 1621947638.2522442,
        "spine_3_1_5": 1621947644.0034544,
        "spine_3_1_6": 1621947644.0168173,
        "spine_3_1_7": 1621947644.0286047,
        "spine_3_1_8": 1621947643.9659052,
        "spine_4_1_1": 1621947643.9936655,
        "spine_4_1_2": 1621947644.013208,
        "spine_4_1_3": 1621947644.0200987,
        "spine_4_1_4": 1621947644.0357492,
        "spine_4_1_5": 1621947644.0279312,
        "spine_4_1_6": 1621947644.0416129,
        "spine_4_1_7": 1621947644.0589542,
        "spine_4_1_8": 1621947644.073213,
        "tof_1_2_1": 1621947644.099813,
        "tof_1_2_2": 1621947644.0403817,
        "tof_1_2_3": 1621947638.317973,
        "tof_1_2_4": 1621947644.0822396,
        "tof_1_2_5": 1621947638.3581438,
        "tof_1_2_6": 1621947644.1072633,
        "tof_1_2_7": 1621947644.0437155,
        "tof_1_2_8": 1621947644.061139,
        "tof_2_2_1": 1621947638.342138,
        "tof_2_2_2": 1621947644.1035492,
        "tof_2_2_3": 1621947644.1182375,
        "tof_2_2_4": 1621947644.0467837,
        "tof_2_2_5": 1621947644.065923,
        "tof_2_2_6": 1621947644.0837166,
        "tof_2_2_7": 1621947644.1055822,
        "tof_2_2_8": 1621947644.111766
    }
}