{
    "description": "Scenario 4a: Leaf leaf_1_0_1 failure and recovery with BGP",
    "k_leaf": 10,
    "k_top": 10,
    "redundancy_factor": 5,
    "is_k8s": true,
    "machine_mac_addresses": {
        "leaf_1_0_1": {
            "net0": "7a:2d:37:7c:d2:61",
            "net1": "e2:e2:e4:15:24:7d",
            "net10": "56:5b:c8:ff:c3:14",
            "net2": "ba:38:e9:2b:3a:bc",
            "net3": "7e:dc:eb:33:11:90",
            "net4": "56:47:c8:15:8c:82",
            "net5": "72:86:4f:59:f3:c4",
            "net6": "ba:06:43:da:db:f9",
            "net7": "46:dc:a9:e0:af:61",
            "net8": "9a:6d:70:33:60:75",
            "net9": "f2:9e:e1:e3:62:bd"
        },
        "leaf_1_0_10": {
            "net0": "fa:66:d0:e0:9a:75",
            "net1": "ee:6c:a4:27:7c:e2",
            "net10": "56:fa:4c:7c:f6:9a",
            "net2": "e6:41:b5:71:d0:73",
            "net3": "9a:e4:77:b2:ba:ae",
            "net4": "3a:64:c7:c8:73:0d",
            "net5": "a6:9a:7e:bb:66:e3",
            "net6": "f6:af:53:11:06:e7",
            "net7": "2e:b1:37:a9:9a:2a",
            "net8": "fa:b0:9c:3f:b0:a9",
            "net9": "92:c9:96:a0:71:6e"
        },
        "leaf_1_0_2": {
            "net0": "3e:0b:62:0c:70:b8",
            "net1": "6a:d0:d7:f3:88:98",
            "net10": "26:1d:95:d8:3b:68",
            "net2": "ba:25:8c:b6:f5:6c",
            "net3": "8e:99:f5:95:1e:c9",
            "net4": "1e:56:fd:26:89:57",
            "net5": "de:17:2a:5c:5b:68",
            "net6": "f2:3c:b0:61:2d:7d",
            "net7": "b2:1c:a1:e0:21:0d",
            "net8": "3a:3f:d5:f6:c1:b7",
            "net9": "c6:ec:ae:5d:35:48"
        },
        "leaf_1_0_3": {
            "net0": "72:c0:45:b3:ed:66",
            "net1": "fa:00:71:c5:5e:c9",
            "net10": "ce:e8:8a:30:87:f5",
            "net2": "52:5c:23:ab:d9:df",
            "net3": "da:b6:9b:7f:25:94",
            "net4": "3a:22:13:92:47:35",
            "net5": "3e:d1:0c:de:b9:01",
            "net6": "fe:d2:d6:16:6a:ba",
            "net7": "52:47:00:51:ed:22",
            "net8": "fa:7e:3d:a3:d6:25",
            "net9": "0e:e9:2e:7d:ac:c9"
        },
        "leaf_1_0_4": {
            "net0": "6a:a3:65:09:88:b5",
            "net1": "6a:63:8e:40:0e:71",
            "net10": "f2:a4:a0:21:d8:fd",
            "net2": "ba:9a:6c:dd:9a:9e",
            "net3": "be:93:51:b8:da:0f",
            "net4": "de:20:5c:49:b6:d3",
            "net5": "a6:33:73:bb:74:6e",
            "net6": "b2:85:65:d9:d7:ad",
            "net7": "3e:63:01:ef:1f:81",
            "net8": "8e:9d:2d:bf:1c:29",
            "net9": "ee:1c:af:c6:5f:76"
        },
        "leaf_1_0_5": {
            "net0": "6e:1e:7d:10:52:f8",
            "net1": "82:cd:b7:82:52:3c",
            "net10": "86:46:0c:03:27:ec",
            "net2": "02:c1:27:7c:22:6d",
            "net3": "6a:79:d6:8f:9c:27",
            "net4": "06:6e:12:0f:eb:23",
            "net5": "e6:99:82:9c:8b:7f",
            "net6": "6e:ec:41:35:e3:dd",
            "net7": "96:d1:18:db:43:43",
            "net8": "7e:56:1b:33:38:67",
            "net9": "aa:93:a5:54:d3:54"
        },
        "leaf_1_0_6": {
            "net0": "ba:64:d0:80:be:6c",
            "net1": "1a:ca:97:a5:45:58",
            "net10": "d2:e0:a8:32:3e:6d",
            "net2": "46:71:89:bf:a9:95",
            "net3": "1a:81:5a:00:a9:27",
            "net4": "86:5b:a3:d9:f4:ca",
            "net5": "12:ad:6b:0d:24:1f",
            "net6": "92:c6:e5:3c:be:49",
            "net7": "e6:a1:5c:2a:a9:2f",
            "net8": "46:b1:dc:7c:39:88",
            "net9": "86:e0:f2:27:17:02"
        },
        "leaf_1_0_7": {
            "net0": "5a:6f:a9:09:50:75",
            "net1": "46:45:10:28:ef:5c",
            "net10": "b2:8d:4c:0d:50:f9",
            "net2": "7a:f5:2c:0b:76:b2",
            "net3": "ce:59:d2:7b:af:af",
            "net4": "8e:67:e4:2a:be:0a",
            "net5": "66:4f:80:24:5f:62",
            "net6": "ee:c9:52:c0:63:2e",
            "net7": "c6:0a:c5:f2:07:0f",
            "net8": "c2:8a:f1:d7:d3:a6",
            "net9": "4e:83:41:cd:e1:90"
        },
        "leaf_1_0_8": {
            "net0": "a6:fc:00:5b:2e:84",
            "net1": "9e:b0:dc:62:6e:b2",
            "net10": "5a:b4:86:1c:24:90",
            "net2": "82:3c:00:59:38:70",
            "net3": "16:bd:41:f3:37:c5",
            "net4": "e2:d3:48:12:43:ae",
            "net5": "f6:62:71:0d:8e:57",
            "net6": "5a:cf:01:84:57:ec",
            "net7": "e2:c1:58:53:15:6b",
            "net8": "2a:85:8b:ff:06:d1",
            "net9": "86:25:30:1a:89:03"
        },
        "leaf_1_0_9": {
            "net0": "3e:12:89:85:73:96",
            "net1": "ba:9c:d6:12:64:ed",
            "net10": "72:b3:00:c9:65:25",
            "net2": "32:2c:20:1c:72:8e",
            "net3": "4e:a9:78:48:8b:61",
            "net4": "1e:a0:fa:6e:a7:8a",
            "net5": "f2:63:92:55:dd:8e",
            "net6": "62:3c:f3:68:4b:43",
            "net7": "de:3f:c5:22:2d:33",
            "net8": "ae:38:3f:46:40:4f",
            "net9": "b2:69:25:ff:d6:f8"
        },
        "leaf_2_0_1": {
            "net0": "7e:2e:3f:00:14:03",
            "net1": "c2:b0:38:85:ae:8b",
            "net10": "4e:07:37:d7:b0:86",
            "net2": "22:90:cd:a3:fa:2c",
            "net3": "d2:8e:c3:bc:6e:67",
            "net4": "d2:48:fb:70:1e:91",
            "net5": "6e:dd:32:c6:73:4c",
            "net6": "16:8d:a4:de:11:11",
            "net7": "6a:25:35:23:6f:6b",
            "net8": "aa:bf:c5:ea:b6:f5",
            "net9": "f2:53:2d:16:cf:11"
        },
        "leaf_2_0_10": {
            "net0": "8e:b4:78:53:ee:d1",
            "net1": "12:a7:96:4b:c8:0e",
            "net10": "0e:27:f1:3b:cd:ec",
            "net2": "b6:26:d6:1f:4f:73",
            "net3": "9a:44:7f:46:a7:2f",
            "net4": "8a:8b:fb:2b:38:74",
            "net5": "fe:20:8a:bd:13:6c",
            "net6": "62:88:a9:7b:32:06",
            "net7": "72:2b:f0:78:df:be",
            "net8": "62:62:73:1d:86:88",
            "net9": "be:2f:64:fc:d0:b0"
        },
        "leaf_2_0_2": {
            "net0": "da:45:ab:99:2e:dc",
            "net1": "96:6f:60:63:33:e8",
            "net10": "de:ea:9b:97:a6:f5",
            "net2": "32:5a:b3:c1:1c:24",
            "net3": "86:43:4d:27:5a:28",
            "net4": "de:20:58:19:19:61",
            "net5": "0e:2c:9b:e4:a7:08",
            "net6": "8e:31:dd:a2:90:fc",
            "net7": "4e:ad:f6:b4:f4:26",
            "net8": "02:12:96:cc:81:55",
            "net9": "06:3a:79:34:e7:37"
        },
        "leaf_2_0_3": {
            "net0": "16:26:9a:e6:ce:08",
            "net1": "fa:74:24:a9:4a:e9",
            "net10": "36:44:a6:6c:5c:19",
            "net2": "22:03:05:ec:89:50",
            "net3": "8a:a4:e1:be:06:af",
            "net4": "0a:ec:84:7d:1c:3b",
            "net5": "6e:64:b3:cc:de:d3",
            "net6": "86:a8:8d:f4:72:ce",
            "net7": "4e:79:22:0c:b6:49",
            "net8": "72:ac:79:08:52:88",
            "net9": "52:98:98:25:c2:0c"
        },
        "leaf_2_0_4": {
            "net0": "7a:cf:76:e4:9a:cc",
            "net1": "c6:7c:8a:b3:32:c8",
            "net10": "f6:0c:fa:a2:34:02",
            "net2": "fa:19:bb:1e:ce:5a",
            "net3": "16:9f:89:8f:57:05",
            "net4": "ce:12:28:86:60:e5",
            "net5": "8a:f8:21:2d:7c:30",
            "net6": "ba:40:d6:7a:54:71",
            "net7": "92:84:9f:b8:07:56",
            "net8": "2a:24:bd:1f:e9:ce",
            "net9": "86:c1:fc:99:95:4d"
        },
        "leaf_2_0_5": {
            "net0": "7e:9c:d7:2b:db:d0",
            "net1": "1e:81:60:73:20:51",
            "net10": "ee:dd:e9:e5:ed:32",
            "net2": "8a:62:56:b4:1a:9d",
            "net3": "06:38:3f:d6:44:6e",
            "net4": "a6:e1:3a:68:2b:0b",
            "net5": "ca:9d:2a:04:7b:23",
            "net6": "36:a5:de:f4:ce:0c",
            "net7": "da:86:50:45:65:80",
            "net8": "f2:c6:46:f9:43:a5",
            "net9": "46:57:26:1c:d3:f1"
        },
        "leaf_2_0_6": {
            "net0": "de:64:1c:42:08:1d",
            "net1": "e6:95:17:69:57:53",
            "net10": "5a:f9:00:5f:47:a2",
            "net2": "22:ef:cc:8a:e7:1c",
            "net3": "fa:d2:82:9f:5e:20",
            "net4": "a2:bc:e9:62:c6:10",
            "net5": "76:a8:50:ab:59:ec",
            "net6": "fe:56:0c:4e:05:2b",
            "net7": "1e:84:c3:31:82:c0",
            "net8": "8a:41:19:ff:b0:a1",
            "net9": "26:bd:81:13:cc:4b"
        },
        "leaf_2_0_7": {
            "net0": "8a:95:50:a0:e9:2f",
            "net1": "c2:d8:d9:f9:9e:6f",
            "net10": "62:eb:62:9e:3d:de",
            "net2": "a2:0e:dd:8e:dd:d4",
            "net3": "0e:b1:4c:8d:a6:53",
            "net4": "f6:60:82:19:60:06",
            "net5": "ea:73:c8:70:65:89",
            "net6": "da:02:81:d9:42:76",
            "net7": "d6:48:75:a6:dd:86",
            "net8": "32:4c:c2:e1:66:50",
            "net9": "a6:53:72:c4:eb:07"
        },
        "leaf_2_0_8": {
            "net0": "0a:fc:2c:30:39:e1",
            "net1": "be:51:22:6b:76:2e",
            "net10": "9a:d3:01:6b:5a:1b",
            "net2": "ee:f8:5a:82:e2:a5",
            "net3": "0a:76:41:58:f2:f8",
            "net4": "be:a2:c3:15:6d:4d",
            "net5": "6e:6d:40:f1:48:8c",
            "net6": "b6:24:d4:b5:f3:3b",
            "net7": "7a:1a:35:c7:d5:9a",
            "net8": "8e:bb:0a:1b:60:f3",
            "net9": "ca:4d:30:00:4a:18"
        },
        "leaf_2_0_9": {
            "net0": "56:29:64:a9:94:db",
            "net1": "b6:3a:21:1f:5a:13",
            "net10": "0a:67:44:5b:b2:d3",
            "net2": "1a:3f:c0:2e:83:09",
            "net3": "1e:0b:64:d5:55:a9",
            "net4": "0e:88:62:6c:9e:13",
            "net5": "62:ed:c8:81:44:ca",
            "net6": "06:a3:31:fe:d4:26",
            "net7": "76:e3:b4:30:10:00",
            "net8": "fa:1c:be:43:b7:98",
            "net9": "66:b9:cc:84:7c:28"
        },
        "leaf_3_0_1": {
            "net0": "fa:70:54:26:32:f3",
            "net1": "36:23:b1:bc:26:5a",
            "net10": "1a:ac:a9:06:26:87",
            "net2": "62:f2:d2:1f:e7:08",
            "net3": "52:ba:1a:c1:93:b0",
            "net4": "32:99:c5:b7:6d:04",
            "net5": "32:83:4e:42:1d:3d",
            "net6": "fa:ad:1d:de:ff:d3",
            "net7": "f6:3d:3f:d1:96:08",
            "net8": "72:3d:f2:cb:3e:01",
            "net9": "4e:07:38:7d:02:c9"
        },
        "leaf_3_0_10": {
            "net0": "26:3a:74:78:7a:e6",
            "net1": "3e:6f:af:c5:fd:c8",
            "net10": "c2:e9:63:f0:88:0b",
            "net2": "ee:13:ba:4f:e9:61",
            "net3": "46:fc:87:4b:ed:45",
            "net4": "52:80:81:60:1d:19",
            "net5": "16:c3:4c:db:41:13",
            "net6": "42:49:6b:5b:a2:6a",
            "net7": "32:db:ce:c2:80:c6",
            "net8": "6e:43:9f:a4:cf:38",
            "net9": "6e:cc:7c:4f:1b:c7"
        },
        "leaf_3_0_2": {
            "net0": "7e:d9:dd:d3:e7:9c",
            "net1": "4a:c7:67:5e:51:53",
            "net10": "ae:88:de:85:02:70",
            "net2": "aa:eb:ae:a3:56:ad",
            "net3": "a2:99:ad:ce:0c:dd",
            "net4": "06:c3:a6:00:25:47",
            "net5": "ee:6d:72:7e:e2:95",
            "net6": "ea:e5:9b:b2:45:c7",
            "net7": "fe:37:bc:fd:8a:be",
            "net8": "aa:99:65:9d:32:db",
            "net9": "16:21:31:03:92:db"
        },
        "leaf_3_0_3": {
            "net0": "8a:b8:9f:c4:7e:bd",
            "net1": "02:85:6f:09:46:98",
            "net10": "ca:dd:59:c8:c5:46",
            "net2": "1e:cb:a6:58:97:6c",
            "net3": "06:7c:e4:77:50:4f",
            "net4": "2e:aa:a7:10:ab:15",
            "net5": "0a:f1:c0:df:7b:83",
            "net6": "d2:4e:33:88:9a:ac",
            "net7": "22:74:68:60:3d:6f",
            "net8": "52:a8:d6:ff:f3:6b",
            "net9": "c6:c9:57:7f:39:79"
        },
        "leaf_3_0_4": {
            "net0": "46:f8:09:16:72:9a",
            "net1": "ce:e6:d6:a5:dc:6e",
            "net10": "9a:56:a5:60:b7:7a",
            "net2": "3a:07:0a:b9:54:d6",
            "net3": "a6:63:45:c3:b2:24",
            "net4": "ae:97:34:1d:64:36",
            "net5": "16:04:1d:ac:89:67",
            "net6": "aa:d1:11:e6:16:ce",
            "net7": "42:0d:4b:7c:b4:18",
            "net8": "1a:f9:e4:fb:c6:ee",
            "net9": "8e:f3:e3:52:f5:55"
        },
        "leaf_3_0_5": {
            "net0": "8e:fc:ec:44:97:41",
            "net1": "86:6c:e6:9d:06:70",
            "net10": "72:6f:9d:6c:28:d8",
            "net2": "62:50:47:3a:a0:ee",
            "net3": "66:2c:76:0f:c8:fb",
            "net4": "2a:5d:ee:fc:75:3c",
            "net5": "de:5f:8a:63:48:91",
            "net6": "82:d8:4c:5f:93:4e",
            "net7": "ea:58:0e:c8:7b:6b",
            "net8": "0e:5f:e9:0e:cb:3f",
            "net9": "3a:ac:92:9c:16:a6"
        },
        "leaf_3_0_6": {
            "net0": "46:22:47:bd:c0:c3",
            "net1": "5e:a5:f2:94:77:2d",
            "net10": "56:50:be:40:a7:0d",
            "net2": "0e:3d:70:d9:4b:b9",
            "net3": "ca:58:b1:96:28:03",
            "net4": "3a:43:7a:84:8c:c7",
            "net5": "66:60:b1:90:db:71",
            "net6": "9a:28:c7:bd:35:e7",
            "net7": "4e:8b:50:a0:00:c2",
            "net8": "56:42:4a:1c:46:bc",
            "net9": "32:14:2d:19:2a:e1"
        },
        "leaf_3_0_7": {
            "net0": "f2:04:32:21:b4:fe",
            "net1": "96:01:6b:75:f8:94",
            "net10": "1e:46:5d:e4:eb:ce",
            "net2": "a6:25:59:a1:fb:b0",
            "net3": "d2:15:f9:d6:73:88",
            "net4": "86:1b:a9:c3:ed:a5",
            "net5": "76:cc:c2:dd:32:fd",
            "net6": "9e:c9:65:51:f8:2b",
            "net7": "02:ef:21:a6:01:84",
            "net8": "9e:c5:0e:3a:d5:9c",
            "net9": "e6:28:47:1b:55:20"
        },
        "leaf_3_0_8": {
            "net0": "fa:48:a9:4c:01:c3",
            "net1": "3a:95:ae:c3:47:5a",
            "net10": "12:2d:b4:a2:22:48",
            "net2": "de:71:6c:4c:1f:9a",
            "net3": "4e:b1:42:ab:06:82",
            "net4": "76:5e:c1:39:53:c1",
            "net5": "76:f7:c9:a2:2b:1a",
            "net6": "6a:9c:be:7e:ed:64",
            "net7": "42:87:d2:4b:b9:04",
            "net8": "52:7b:3e:10:66:47",
            "net9": "06:61:8d:5d:16:7f"
        },
        "leaf_3_0_9": {
            "net0": "0a:6b:23:61:f8:b5",
            "net1": "6a:d3:75:e4:6d:f9",
            "net10": "f6:00:93:98:ac:fb",
            "net2": "9a:0d:f7:ad:12:f0",
            "net3": "be:28:4a:b2:b2:71",
            "net4": "2a:e8:44:c8:ed:96",
            "net5": "7e:31:c8:ea:03:8d",
            "net6": "66:db:b0:56:5f:7a",
            "net7": "f6:6d:e9:2b:e6:5f",
            "net8": "82:58:3c:2e:9c:8b",
            "net9": "22:a7:c0:e8:11:18"
        },
        "leaf_4_0_1": {
            "net0": "76:0f:46:3d:48:0b",
            "net1": "4a:42:c5:79:26:34",
            "net10": "3e:f8:bb:2a:43:3c",
            "net2": "d6:d7:f3:1b:66:0d",
            "net3": "ea:3a:36:13:f7:db",
            "net4": "92:d1:ed:55:8a:fb",
            "net5": "8a:4f:60:cf:45:bf",
            "net6": "8a:e4:46:9a:32:5a",
            "net7": "ba:5d:10:73:bf:b9",
            "net8": "16:1d:8a:2c:27:c8",
            "net9": "a2:d1:83:2f:b8:13"
        },
        "leaf_4_0_10": {
            "net0": "36:aa:9c:da:34:5b",
            "net1": "86:56:e3:d8:4b:b7",
            "net10": "ce:ed:35:f6:91:32",
            "net2": "3e:6d:63:60:91:3b",
            "net3": "ee:a8:43:5d:1a:97",
            "net4": "f6:c8:7d:02:fb:54",
            "net5": "fa:11:a2:e3:01:54",
            "net6": "e6:85:e5:50:e6:7d",
            "net7": "82:c1:f1:4b:27:55",
            "net8": "da:ad:d4:dd:75:dc",
            "net9": "d2:1d:e0:fd:c3:3f"
        },
        "leaf_4_0_2": {
            "net0": "22:56:cb:50:37:34",
            "net1": "ee:b0:69:6d:6e:ff",
            "net10": "26:43:d2:75:3c:7c",
            "net2": "d2:87:68:40:c2:d7",
            "net3": "c6:64:f3:50:e6:61",
            "net4": "0a:31:e6:1f:70:8d",
            "net5": "02:3e:4c:be:52:74",
            "net6": "5e:92:49:5c:52:ec",
            "net7": "6e:69:ed:a2:6d:49",
            "net8": "92:4d:43:53:54:c2",
            "net9": "2a:36:0d:83:63:d3"
        },
        "leaf_4_0_3": {
            "net0": "ae:c7:c6:bb:74:22",
            "net1": "12:3c:8f:27:1b:db",
            "net10": "46:07:01:65:0d:7e",
            "net2": "de:3c:8d:39:4d:6a",
            "net3": "12:47:f3:37:69:36",
            "net4": "9a:58:bb:e8:3d:4d",
            "net5": "42:e6:25:6e:89:13",
            "net6": "06:87:20:4a:59:16",
            "net7": "16:4b:9e:9b:bd:fd",
            "net8": "22:5c:83:01:3d:b5",
            "net9": "1a:1c:b9:e8:0e:84"
        },
        "leaf_4_0_4": {
            "net0": "6e:d1:49:7c:2e:57",
            "net1": "42:ed:db:ba:54:cd",
            "net10": "0e:8e:85:ed:ba:ea",
            "net2": "32:51:de:93:b8:01",
            "net3": "d2:d7:26:e2:2a:61",
            "net4": "ee:b4:51:4e:47:3e",
            "net5": "ee:1e:46:87:f6:4c",
            "net6": "2e:9b:d6:c6:53:b9",
            "net7": "7a:41:33:2f:52:eb",
            "net8": "ce:a4:22:d4:01:81",
            "net9": "f6:6d:b9:d4:3a:a9"
        },
        "leaf_4_0_5": {
            "net0": "2e:e7:71:0c:e3:e5",
            "net1": "86:8f:7b:15:5b:34",
            "net10": "c6:c5:87:98:a1:48",
            "net2": "f2:b5:83:63:9c:0c",
            "net3": "96:0a:6d:50:95:cf",
            "net4": "76:07:06:1c:e8:81",
            "net5": "46:03:24:a6:c8:fc",
            "net6": "b6:19:5b:41:f2:a7",
            "net7": "82:0b:63:21:cb:b3",
            "net8": "8e:1d:23:7d:75:07",
            "net9": "62:46:6c:91:b0:75"
        },
        "leaf_4_0_6": {
            "net0": "76:35:1a:d8:6f:f2",
            "net1": "96:96:f6:80:b6:70",
            "net10": "1e:7c:40:b2:c6:95",
            "net2": "9a:f4:13:63:81:e6",
            "net3": "c2:fb:fd:11:2e:f9",
            "net4": "42:b4:be:da:23:a3",
            "net5": "ee:59:a7:59:9b:38",
            "net6": "82:e9:25:d8:40:16",
            "net7": "ba:71:3b:56:70:f8",
            "net8": "32:d3:ad:10:e6:b1",
            "net9": "96:6a:01:84:3c:56"
        },
        "leaf_4_0_7": {
            "net0": "06:08:b6:00:a3:65",
            "net1": "42:d7:d3:8f:70:91",
            "net10": "6a:28:55:8a:c1:9e",
            "net2": "b6:bd:32:65:e6:4a",
            "net3": "92:6b:8c:ef:db:f8",
            "net4": "6e:96:0f:bf:17:9e",
            "net5": "86:a8:3b:23:f6:34",
            "net6": "3e:eb:8a:a1:91:88",
            "net7": "da:45:98:51:7c:11",
            "net8": "ea:cd:9a:a5:2b:4b",
            "net9": "6a:96:63:cd:ba:bb"
        },
        "leaf_4_0_8": {
            "net0": "c2:79:ce:f9:c9:08",
            "net1": "5e:9b:ec:2f:b0:e5",
            "net10": "b2:44:d2:46:1a:de",
            "net2": "fa:ea:4e:59:3f:d7",
            "net3": "0a:d0:4d:a3:4e:5a",
            "net4": "ce:5c:83:f9:1c:1c",
            "net5": "be:72:4a:c1:a5:ae",
            "net6": "46:c1:a7:f4:af:6e",
            "net7": "72:e1:55:80:fd:77",
            "net8": "e6:f1:06:d5:3b:1c",
            "net9": "8e:02:b3:f6:53:24"
        },
        "leaf_4_0_9": {
            "net0": "36:9a:f5:e3:fa:12",
            "net1": "06:54:99:79:fc:5a",
            "net10": "b2:0e:7a:10:dd:60",
            "net2": "96:e7:8c:44:0f:ab",
            "net3": "96:ce:da:df:c5:f2",
            "net4": "fe:75:59:0e:07:5c",
            "net5": "3a:1a:ca:81:4d:bd",
            "net6": "46:32:26:c2:22:8f",
            "net7": "fa:79:6e:ec:db:db",
            "net8": "e6:9a:55:66:48:ea",
            "net9": "4a:a9:59:fa:85:30"
        },
        "spine_1_1_1": {
            "net0": "a2:ee:72:7e:ac:91",
            "net1": "9a:82:f1:c8:36:72",
            "net10": "22:ea:14:1d:f4:33",
            "net11": "da:7b:66:ad:07:62",
            "net12": "52:c4:39:d2:77:dc",
            "net13": "7a:e5:c1:3b:91:e5",
            "net14": "0a:c5:7d:0d:1d:c4",
            "net15": "8e:3a:b5:e8:79:94",
            "net16": "86:34:67:89:38:2e",
            "net17": "2e:22:00:8a:ed:f6",
            "net18": "02:62:70:20:56:4b",
            "net19": "b6:bf:a5:ac:3a:29",
            "net2": "72:20:f1:84:76:11",
            "net3": "da:86:b7:15:7d:aa",
            "net4": "32:c3:24:2c:5b:44",
            "net5": "8e:8b:44:bb:91:7b",
            "net6": "0e:fb:c2:2c:43:3f",
            "net7": "ce:0e:3c:0b:6a:cb",
            "net8": "de:15:cf:35:c5:fa",
            "net9": "ae:6f:8b:15:b1:96"
        },
        "spine_1_1_10": {
            "net0": "ae:ef:41:7b:78:20",
            "net1": "2a:86:a4:ec:48:73",
            "net10": "92:8d:8e:30:b2:80",
            "net11": "36:b5:ed:a1:96:00",
            "net12": "06:10:a2:40:56:d4",
            "net13": "42:83:5b:6a:72:b8",
            "net14": "ca:45:c7:96:a4:16",
            "net15": "7a:4e:bc:a1:c3:b3",
            "net16": "7a:55:fd:bb:0e:e1",
            "net17": "ca:21:96:1b:e9:93",
            "net18": "7a:7f:67:5d:f9:50",
            "net19": "86:41:c3:80:43:2a",
            "net2": "92:d4:a5:8f:3b:4e",
            "net3": "8a:d3:2d:3b:c5:0f",
            "net4": "9a:4f:c7:7f:64:f3",
            "net5": "e6:f4:2a:17:74:fb",
            "net6": "02:a0:19:cd:42:80",
            "net7": "02:4c:70:bc:13:f0",
            "net8": "2a:0a:da:04:fa:fb",
            "net9": "7a:c2:5c:7c:64:8a"
        },
        "spine_1_1_2": {
            "net0": "6a:05:02:8f:a5:ae",
            "net1": "b6:9e:39:f5:6e:66",
            "net10": "f6:85:5c:e1:d8:77",
            "net11": "c6:52:15:51:5e:f3",
            "net12": "8e:d4:60:29:5e:f6",
            "net13": "6a:17:e3:ff:6e:cd",
            "net14": "e6:15:4c:10:f8:d6",
            "net15": "3a:b0:51:8e:26:cd",
            "net16": "92:c6:c3:c3:81:b7",
            "net17": "4e:ce:c3:ba:e2:d8",
            "net18": "5e:60:0e:d4:72:32",
            "net19": "7a:af:85:63:3b:5b",
            "net2": "8a:00:f4:67:f1:a8",
            "net3": "36:96:63:18:23:2f",
            "net4": "a2:fb:04:5d:70:b3",
            "net5": "3e:b0:15:bb:32:10",
            "net6": "0a:cf:09:29:65:42",
            "net7": "f2:c2:d2:d8:e1:41",
            "net8": "12:a6:c0:5d:74:59",
            "net9": "96:f6:e4:65:79:df"
        },
        "spine_1_1_3": {
            "net0": "7a:0d:4a:e6:18:08",
            "net1": "5e:c8:0b:98:70:72",
            "net10": "66:e7:63:b0:17:38",
            "net11": "1a:02:c5:f2:70:07",
            "net12": "ae:1b:6a:e6:ca:86",
            "net13": "72:a4:ef:3a:10:69",
            "net14": "2e:c0:e5:00:77:5b",
            "net15": "5e:04:51:9e:9d:c5",
            "net16": "12:74:25:c2:4e:89",
            "net17": "b2:49:a4:cc:dd:1e",
            "net18": "22:65:8e:8b:6b:bd",
            "net19": "a2:76:1a:be:94:69",
            "net2": "72:53:e4:04:fd:47",
            "net3": "56:d5:26:02:a9:10",
            "net4": "ba:16:22:31:f2:52",
            "net5": "c2:a0:aa:8f:29:83",
            "net6": "8e:b5:2b:67:f4:fb",
            "net7": "f6:02:03:01:7e:36",
            "net8": "36:91:4b:e0:6b:3f",
            "net9": "42:c2:df:ca:a0:02"
        },
        "spine_1_1_4": {
            "net0": "86:a7:b3:c5:f8:2e",
            "net1": "8e:4f:86:fb:2b:d4",
            "net10": "ce:84:fd:9d:e3:95",
            "net11": "9e:0f:3c:da:6a:be",
            "net12": "72:ae:2b:6c:7c:f3",
            "net13": "1e:34:48:0b:f3:e3",
            "net14": "92:78:ca:e4:5f:d2",
            "net15": "6a:8c:5c:cc:13:18",
            "net16": "6a:96:92:c7:4a:99",
            "net17": "92:25:42:d9:2f:c2",
            "net18": "16:b1:7e:d1:c1:75",
            "net19": "2e:70:eb:06:18:82",
            "net2": "16:c0:c8:f4:89:fd",
            "net3": "52:09:c5:f4:0e:4a",
            "net4": "b2:3a:df:8c:92:19",
            "net5": "96:16:20:dd:12:1b",
            "net6": "42:46:89:e6:fb:e6",
            "net7": "7a:45:33:8f:ca:a6",
            "net8": "0e:62:41:1e:86:85",
            "net9": "a2:88:6c:d4:4a:5e"
        },
        "spine_1_1_5": {
            "net0": "ce:aa:49:9b:58:24",
            "net1": "d6:e5:e2:73:f3:92",
            "net10": "c6:c2:bd:98:a1:8c",
            "net11": "16:36:f7:dc:16:07",
            "net12": "26:23:b1:f2:78:ff",
            "net13": "0a:c7:45:e3:fe:ea",
            "net14": "3e:a3:b3:b0:c5:00",
            "net15": "76:1b:a1:79:60:72",
            "net16": "d2:40:b2:26:8a:a3",
            "net17": "7e:de:7f:64:36:5e",
            "net18": "be:1f:86:7b:cc:7b",
            "net19": "5e:c5:89:bb:ce:c4",
            "net2": "b6:37:fe:65:65:54",
            "net3": "22:be:88:99:78:f9",
            "net4": "6e:db:60:43:2c:8f",
            "net5": "aa:3b:d7:13:ba:e0",
            "net6": "92:e0:17:bc:67:cf",
            "net7": "22:77:d1:28:9b:cd",
            "net8": "ae:6b:a6:5f:46:cb",
            "net9": "c6:26:8b:56:35:b3"
        },
        "spine_1_1_6": {
            "net0": "b6:05:90:ab:91:6c",
            "net1": "66:24:69:ed:49:9a",
            "net10": "be:21:2c:2e:77:24",
            "net11": "ca:95:d0:bc:a4:c9",
            "net12": "e2:40:74:90:75:50",
            "net13": "06:cf:ad:4b:b6:d7",
            "net14": "5a:f4:8f:0e:55:a7",
            "net15": "e6:05:be:76:51:73",
            "net16": "06:1a:05:f3:f4:74",
            "net17": "c2:02:dd:91:a7:e5",
            "net18": "16:6d:49:11:1f:fc",
            "net19": "3a:5f:40:fb:cf:5a",
            "net2": "1e:d3:47:54:40:63",
            "net3": "26:c2:af:fb:3d:7b",
            "net4": "d2:cb:c5:07:d0:30",
            "net5": "b2:77:6f:d9:b4:93",
            "net6": "9a:11:c0:60:6e:39",
            "net7": "9a:30:2e:01:ee:a2",
            "net8": "7e:3f:9e:46:1e:a3",
            "net9": "4a:dd:fc:5e:ad:1d"
        },
        "spine_1_1_7": {
            "net0": "c2:54:fe:b8:ab:cf",
            "net1": "86:71:ae:3b:dc:ee",
            "net10": "fa:fc:47:e7:9c:8c",
            "net11": "5a:cb:d6:81:3f:11",
            "net12": "c2:41:35:58:7d:10",
            "net13": "42:60:63:14:31:46",
            "net14": "4a:06:ba:69:57:27",
            "net15": "36:17:0d:39:6c:66",
            "net16": "1e:7a:82:58:ee:ff",
            "net17": "ea:20:23:86:11:17",
            "net18": "1a:95:05:7a:51:09",
            "net19": "de:e4:6b:9c:b7:23",
            "net2": "12:15:46:eb:f2:5e",
            "net3": "1a:1e:26:2c:2a:8c",
            "net4": "9e:fa:b0:58:a0:6f",
            "net5": "12:9c:79:d7:c6:d4",
            "net6": "5e:d1:33:87:99:53",
            "net7": "5a:b6:7c:3b:3b:78",
            "net8": "d2:5c:8b:5d:50:18",
            "net9": "0a:45:b2:3c:cb:e5"
        },
        "spine_1_1_8": {
            "net0": "16:cd:b8:c0:ed:43",
            "net1": "e6:ac:b4:61:55:f6",
            "net10": "d6:3d:f4:69:66:69",
            "net11": "42:c5:8a:ea:89:1d",
            "net12": "82:8a:b0:d5:1c:29",
            "net13": "2e:4c:59:c3:b9:8d",
            "net14": "fe:b3:ac:b6:fe:ae",
            "net15": "fa:bf:75:21:cf:8d",
            "net16": "3a:24:16:73:20:5d",
            "net17": "b2:1c:8a:22:48:48",
            "net18": "22:14:94:55:53:9c",
            "net19": "42:46:9f:c5:d9:2b",
            "net2": "7a:e0:d2:bc:21:74",
            "net3": "7a:b9:44:eb:ce:5e",
            "net4": "36:a9:90:d1:2a:b1",
            "net5": "1e:b5:88:c5:a1:c0",
            "net6": "7e:bf:d2:06:9b:5b",
            "net7": "32:75:1f:30:e1:59",
            "net8": "06:b9:5d:7a:35:76",
            "net9": "b2:4b:38:65:1a:32"
        },
        "spine_1_1_9": {
            "net0": "8e:aa:f1:aa:3a:64",
            "net1": "2a:6f:bb:91:07:05",
            "net10": "c6:e0:a3:b7:c1:08",
            "net11": "aa:9a:c1:6e:97:24",
            "net12": "26:d9:e1:11:1a:df",
            "net13": "86:a9:09:bf:b6:3e",
            "net14": "0a:c1:58:34:3c:79",
            "net15": "0e:7e:63:8c:ee:20",
            "net16": "62:62:3a:e2:8b:3d",
            "net17": "4e:2d:3d:4d:a6:ff",
            "net18": "f2:3c:d5:01:05:0b",
            "net19": "f6:f6:04:07:31:30",
            "net2": "32:5a:74:60:15:d0",
            "net3": "7a:55:ad:f4:4f:30",
            "net4": "b6:51:b3:31:fc:bb",
            "net5": "d6:39:be:87:6d:6b",
            "net6": "9e:3a:59:ae:9e:3f",
            "net7": "06:f9:19:0a:67:a8",
            "net8": "ee:90:7b:66:83:b0",
            "net9": "06:1d:26:2e:52:ae"
        },
        "spine_2_1_1": {
            "net0": "52:e2:38:d9:a9:ec",
            "net1": "8e:90:9b:fb:aa:ff",
            "net10": "ae:ba:56:9c:3d:1c",
            "net11": "c2:47:57:5a:fb:66",
            "net12": "22:d7:e1:8c:81:b8",
            "net13": "7e:73:0f:60:4d:d2",
            "net14": "7e:55:19:44:3f:40",
            "net15": "32:64:84:0b:54:af",
            "net16": "72:a6:94:78:de:02",
            "net17": "66:74:0d:9f:c0:62",
            "net18": "72:33:a5:fc:d4:ad",
            "net19": "06:38:9f:1b:3b:c4",
            "net2": "52:cc:7f:7c:dc:fe",
            "net3": "66:8d:fd:23:4c:a7",
            "net4": "1a:f7:d1:fb:b2:31",
            "net5": "ea:e1:62:2e:a5:39",
            "net6": "1e:62:bf:9b:50:d8",
            "net7": "02:3d:4f:f8:4c:12",
            "net8": "aa:f7:b7:90:c8:68",
            "net9": "42:93:a5:db:15:2a"
        },
        "spine_2_1_10": {
            "net0": "da:71:6b:32:35:63",
            "net1": "e2:b0:1d:1b:e8:af",
            "net10": "62:9b:a2:4c:61:21",
            "net11": "3e:a7:27:f1:4b:2f",
            "net12": "2a:2a:09:c9:bc:f5",
            "net13": "22:6d:0c:0a:27:ea",
            "net14": "fa:8a:f0:b5:77:92",
            "net15": "8e:bb:bb:a3:70:9b",
            "net16": "6e:f3:64:aa:db:c4",
            "net17": "a2:70:52:e8:0c:03",
            "net18": "22:6e:e8:7e:b2:a3",
            "net19": "f6:45:9e:5c:f0:1f",
            "net2": "8e:d9:5b:20:33:e4",
            "net3": "72:c8:4a:46:41:72",
            "net4": "be:4f:b5:28:60:67",
            "net5": "ea:46:dd:84:f5:c3",
            "net6": "da:15:08:4e:cf:17",
            "net7": "aa:ec:a3:bc:85:c8",
            "net8": "e2:4c:8f:64:ed:9e",
            "net9": "8e:de:d2:ce:03:d3"
        },
        "spine_2_1_2": {
            "net0": "5e:ae:d5:48:f3:1b",
            "net1": "de:75:94:d0:38:30",
            "net10": "4e:35:82:14:a5:e8",
            "net11": "6e:d0:46:3f:ab:d6",
            "net12": "02:a4:2e:04:d7:94",
            "net13": "f2:de:cc:2e:ba:a0",
            "net14": "9a:82:04:0f:99:86",
            "net15": "f6:72:44:85:39:bc",
            "net16": "8a:2c:d2:92:50:f2",
            "net17": "8e:43:6c:ab:db:c2",
            "net18": "86:59:ad:1c:74:e4",
            "net19": "b2:30:e9:ec:14:de",
            "net2": "ea:ef:26:40:82:70",
            "net3": "66:5a:cb:f1:fc:e5",
            "net4": "b2:a1:75:98:47:a9",
            "net5": "42:19:c5:dc:51:fe",
            "net6": "92:22:fa:fd:8a:1d",
            "net7": "ca:fb:4b:c8:95:f3",
            "net8": "de:b1:b4:7c:ba:79",
            "net9": "1e:00:9b:ba:b4:c2"
        },
        "spine_2_1_3": {
            "net0": "ee:6b:58:56:66:b1",
            "net1": "3a:81:4e:ab:cf:76",
            "net10": "0a:9e:89:b7:e0:28",
            "net11": "aa:ed:d6:95:42:61",
            "net12": "ba:38:17:5f:1f:82",
            "net13": "2e:8b:c4:95:c7:27",
            "net14": "62:d0:28:10:3d:86",
            "net15": "7a:e3:9b:d1:eb:e3",
            "net16": "22:a9:6e:15:31:d5",
            "net17": "86:7e:d9:e5:b5:7a",
            "net18": "fe:62:02:2a:3d:d2",
            "net19": "46:21:2d:12:66:40",
            "net2": "ae:22:16:64:d5:5a",
            "net3": "82:fa:4f:ec:32:30",
            "net4": "1e:39:ab:94:b4:29",
            "net5": "76:0c:1b:a0:dc:84",
            "net6": "fa:1e:f5:0d:1f:b1",
            "net7": "82:e1:8c:d9:0e:64",
            "net8": "a2:9a:92:f5:c9:73",
            "net9": "5a:83:19:fc:fc:fc"
        },
        "spine_2_1_4": {
            "net0": "9a:84:50:ac:a6:68",
            "net1": "9e:15:e8:1e:6a:5b",
            "net10": "46:c9:ba:9c:1c:79",
            "net11": "f2:ce:49:af:44:e0",
            "net12": "0a:da:63:bd:8e:1b",
            "net13": "f6:40:21:9a:26:76",
            "net14": "6e:70:3e:5b:c7:af",
            "net15": "ba:c0:6c:f6:12:d5",
            "net16": "b6:42:d6:62:7c:ba",
            "net17": "ca:72:75:d5:23:0e",
            "net18": "42:a0:09:23:5f:cb",
            "net19": "56:c3:01:57:8a:b7",
            "net2": "ba:13:6a:f0:b8:0f",
            "net3": "3e:18:2e:b3:9f:60",
            "net4": "36:1e:80:16:6e:78",
            "net5": "ae:48:e5:e0:e5:89",
            "net6": "4a:4b:e3:dc:87:ea",
            "net7": "c6:ba:59:ce:07:02",
            "net8": "0e:ed:a6:90:83:86",
            "net9": "fa:e5:e4:4c:c6:77"
        },
        "spine_2_1_5": {
            "net0": "ce:23:7e:44:c3:09",
            "net1": "fa:ab:5a:b5:3f:5b",
            "net10": "f6:f7:76:e2:eb:46",
            "net11": "b6:37:32:3f:93:a4",
            "net12": "fe:98:04:3b:98:2f",
            "net13": "32:38:a9:10:54:b7",
            "net14": "12:34:96:54:ca:a5",
            "net15": "62:cc:29:aa:d8:6d",
            "net16": "82:8b:a4:3a:40:e6",
            "net17": "06:be:ff:f6:f3:45",
            "net18": "22:a5:b8:64:32:b2",
            "net19": "8e:93:78:c5:75:a3",
            "net2": "46:7f:08:00:e9:a5",
            "net3": "be:ca:8e:25:05:08",
            "net4": "1a:a1:de:dc:bd:2e",
            "net5": "9e:27:77:50:7c:9c",
            "net6": "ba:ce:9e:a4:98:58",
            "net7": "ae:bf:6b:f9:ad:3a",
            "net8": "82:11:de:ba:e0:c1",
            "net9": "e6:fc:d5:79:1c:a3"
        },
        "spine_2_1_6": {
            "net0": "6a:54:0a:7c:4c:bb",
            "net1": "06:ee:8c:16:fd:b0",
            "net10": "72:92:1d:36:b1:94",
            "net11": "6e:37:b6:df:b8:86",
            "net12": "22:43:68:89:1c:3a",
            "net13": "72:38:14:72:d2:ee",
            "net14": "02:f1:d6:22:e7:9f",
            "net15": "72:70:4b:8d:78:3a",
            "net16": "e2:00:f4:5a:6f:5d",
            "net17": "42:aa:57:19:44:c0",
            "net18": "ee:fb:d9:00:09:b0",
            "net19": "22:e9:02:5f:41:37",
            "net2": "fa:7f:7e:3b:20:24",
            "net3": "4a:04:03:6c:c7:e5",
            "net4": "1a:3d:28:91:c9:72",
            "net5": "96:dd:d4:eb:01:c9",
            "net6": "a6:d7:39:ce:4b:f0",
            "net7": "36:87:92:6d:e8:4f",
            "net8": "26:94:30:32:c7:9e",
            "net9": "1e:d9:86:31:8a:ce"
        },
        "spine_2_1_7": {
            "net0": "a6:a8:7b:99:ed:ad",
            "net1": "02:1e:f1:0d:dd:4a",
            "net10": "0e:12:4b:e2:55:bb",
            "net11": "6a:2b:63:71:b1:09",
            "net12": "7a:72:21:9f:5c:42",
            "net13": "d2:e7:a3:72:62:cc",
            "net14": "66:19:4d:47:90:68",
            "net15": "ae:e5:14:6f:c7:cf",
            "net16": "4e:b4:41:66:a9:1c",
            "net17": "3e:20:82:56:c7:c4",
            "net18": "ba:b7:b9:fb:3e:fd",
            "net19": "b2:b2:c7:29:5e:43",
            "net2": "e2:c7:00:00:27:98",
            "net3": "9e:4b:6b:6d:a3:e8",
            "net4": "ea:3b:47:e4:aa:bc",
            "net5": "d6:b5:df:c9:e7:04",
            "net6": "16:72:d8:b4:1b:73",
            "net7": "3a:37:6d:c6:cd:46",
            "net8": "aa:29:b1:a9:91:e5",
            "net9": "12:71:70:52:ed:12"
        },
        "spine_2_1_8": {
            "net0": "06:da:dd:02:e2:87",
            "net1": "52:b2:c6:69:07:b4",
            "net10": "8e:c8:5c:c8:c1:72",
            "net11": "12:99:fb:64:7d:b2",
            "net12": "d2:3d:ba:70:58:00",
            "net13": "0a:13:e5:79:73:eb",
            "net14": "ea:8d:7c:8f:f7:af",
            "net15": "92:d4:20:99:35:93",
            "net16": "72:6a:d3:7c:3a:6e",
            "net17": "2a:12:bf:11:34:0c",
            "net18": "4e:c6:99:7c:27:64",
            "net19": "b6:fa:b6:7e:52:86",
            "net2": "26:43:95:e1:a3:60",
            "net3": "42:96:f6:1e:6a:c9",
            "net4": "66:4e:f1:78:11:f9",
            "net5": "46:61:ed:ec:d1:4a",
            "net6": "42:ee:b1:f4:d6:6e",
            "net7": "02:60:61:55:0d:a4",
            "net8": "3a:ae:eb:db:79:2e",
            "net9": "72:50:97:0a:95:06"
        },
        "spine_2_1_9": {
            "net0": "12:aa:d6:6d:2c:e7",
            "net1": "32:66:1e:90:e2:aa",
            "net10": "12:c6:cc:f8:44:c9",
            "net11": "0e:2a:c3:60:d8:8e",
            "net12": "8a:39:3f:b3:b0:9a",
            "net13": "d6:c4:2a:cc:1f:b5",
            "net14": "a6:a4:15:d2:63:e4",
            "net15": "56:de:2f:05:56:fc",
            "net16": "ee:b0:20:1c:ac:89",
            "net17": "7e:7f:8f:98:3a:86",
            "net18": "8e:f9:03:1c:30:14",
            "net19": "66:ff:0e:e0:0e:ee",
            "net2": "4e:61:3b:82:e4:34",
            "net3": "b2:b7:9c:2e:7d:13",
            "net4": "f6:ea:70:58:78:b6",
            "net5": "f2:7d:77:31:f4:1b",
            "net6": "8e:43:98:f9:92:78",
            "net7": "5a:2f:08:7b:7d:cb",
            "net8": "b6:c7:ff:b8:82:1e",
            "net9": "52:65:be:ce:46:21"
        },
        "spine_3_1_1": {
            "net0": "42:d6:21:87:30:48",
            "net1": "da:49:6a:08:a0:ee",
            "net10": "e6:49:f4:4b:1b:7e",
            "net11": "ae:c9:37:56:b2:d5",
            "net12": "8a:57:3a:48:77:a2",
            "net13": "02:a6:20:8a:64:94",
            "net14": "36:f4:1b:bb:a1:bb",
            "net15": "6e:3a:61:00:3f:82",
            "net16": "c6:7a:aa:0a:dc:99",
            "net17": "92:dc:0c:c4:e0:8b",
            "net18": "3e:82:9a:59:87:32",
            "net19": "1e:dc:51:69:ae:f8",
            "net2": "ce:b9:26:48:48:c0",
            "net3": "16:82:33:ee:10:0b",
            "net4": "c2:a4:c2:51:ae:56",
            "net5": "b2:58:d0:50:80:d6",
            "net6": "32:c4:51:df:2c:5d",
            "net7": "32:2a:d7:31:72:eb",
            "net8": "ce:33:5c:e9:72:fe",
            "net9": "3e:de:0b:e2:ef:05"
        },
        "spine_3_1_10": {
            "net0": "42:8f:5c:e7:b5:13",
            "net1": "e6:09:ee:f8:60:bf",
            "net10": "0e:e6:e7:7d:24:57",
            "net11": "9e:83:9e:18:08:fb",
            "net12": "0a:55:aa:7d:39:7e",
            "net13": "b2:39:48:58:9f:ee",
            "net14": "92:4b:d8:df:a9:64",
            "net15": "92:c2:b2:f3:39:72",
            "net16": "f2:ba:1f:19:dd:3d",
            "net17": "22:dd:fd:8b:13:bd",
            "net18": "ae:0f:ec:02:79:3d",
            "net19": "92:75:cd:f5:c0:e5",
            "net2": "6a:46:50:ae:76:3a",
            "net3": "f2:52:9f:e5:db:9c",
            "net4": "86:5d:7d:7f:69:04",
            "net5": "1a:e3:1a:d7:f2:7b",
            "net6": "aa:ee:79:67:50:6c",
            "net7": "72:2e:c1:d8:a0:63",
            "net8": "aa:b7:7a:03:44:1e",
            "net9": "ae:49:39:24:6c:aa"
        },
        "spine_3_1_2": {
            "net0": "0e:99:da:9a:70:31",
            "net1": "be:41:43:66:49:03",
            "net10": "5a:42:94:a9:63:e7",
            "net11": "ce:32:0a:5d:57:50",
            "net12": "12:2c:63:f6:58:00",
            "net13": "36:f8:f5:8d:08:c0",
            "net14": "96:ea:ea:25:41:8d",
            "net15": "8e:15:4f:17:d5:d5",
            "net16": "26:d2:fb:49:ac:19",
            "net17": "a2:a2:54:2d:10:7b",
            "net18": "f2:3b:aa:cd:a8:26",
            "net19": "8e:62:b5:d2:ea:32",
            "net2": "da:99:4d:d2:3e:a3",
            "net3": "36:6b:d4:52:7a:5e",
            "net4": "5a:f4:69:d8:29:b5",
            "net5": "7e:3d:78:7e:2d:37",
            "net6": "ea:3c:ae:83:a7:f8",
            "net7": "ca:48:4b:f6:6e:67",
            "net8": "26:40:18:6d:98:b5",
            "net9": "42:ab:4b:68:a5:62"
        },
        "spine_3_1_3": {
            "net0": "32:c6:b5:e0:11:c8",
            "net1": "2a:dc:2c:45:c1:64",
            "net10": "a6:dc:32:e2:d6:4a",
            "net11": "ae:41:f4:a9:4d:5a",
            "net12": "62:d9:8b:2b:28:ed",
            "net13": "36:ea:7b:a8:63:be",
            "net14": "a2:6b:11:d3:fa:63",
            "net15": "22:1e:18:7a:8c:ca",
            "net16": "fe:2e:4e:63:59:ab",
            "net17": "e6:3e:e0:7f:20:da",
            "net18": "e2:46:29:57:a2:64",
            "net19": "4a:41:b8:fd:ff:8e",
            "net2": "6e:14:b7:6c:cb:5a",
            "net3": "be:b2:3e:1b:d8:05",
            "net4": "4a:77:17:06:aa:d6",
            "net5": "46:c4:28:1e:9a:7c",
            "net6": "26:ca:2c:0a:70:32",
            "net7": "ae:69:56:18:1c:8d",
            "net8": "12:eb:63:32:4d:10",
            "net9": "9e:5c:9d:e0:a9:a4"
        },
        "spine_3_1_4": {
            "net0": "2a:97:8a:25:d0:33",
            "net1": "de:99:69:47:76:56",
            "net10": "8e:73:93:80:55:7b",
            "net11": "6a:5d:63:9d:0a:f6",
            "net12": "b2:35:47:f0:62:9a",
            "net13": "96:5f:fa:58:0f:f0",
            "net14": "d2:8d:21:49:7f:9f",
            "net15": "ce:9b:00:4a:f1:e4",
            "net16": "62:f2:3e:43:0a:0b",
            "net17": "76:f4:1b:9e:b8:1f",
            "net18": "56:cb:ed:2b:a2:9b",
            "net19": "36:01:0a:c0:37:2c",
            "net2": "7a:53:94:d7:27:fc",
            "net3": "62:28:e9:22:ca:a7",
            "net4": "1e:a0:44:75:54:d2",
            "net5": "36:05:db:88:06:d9",
            "net6": "ca:2d:b1:e3:0e:68",
            "net7": "6a:59:f7:89:14:f7",
            "net8": "be:5b:54:b0:ce:89",
            "net9": "ee:1a:24:51:15:70"
        },
        "spine_3_1_5": {
            "net0": "56:0a:5e:1b:84:44",
            "net1": "8a:cd:24:3b:a3:39",
            "net10": "ca:25:7f:c9:b4:1c",
            "net11": "c2:d4:39:4a:7a:5c",
            "net12": "6e:1f:45:b4:52:66",
            "net13": "ce:6c:1f:fe:f1:5f",
            "net14": "b6:5c:7a:37:46:cf",
            "net15": "02:88:fb:a7:33:de",
            "net16": "9a:e7:89:03:ed:0e",
            "net17": "5e:d5:42:b6:42:e0",
            "net18": "86:ab:f9:4d:7e:eb",
            "net19": "da:a7:f6:48:43:86",
            "net2": "22:76:bf:be:d8:4c",
            "net3": "2a:23:10:70:f0:8e",
            "net4": "ca:f6:ee:79:de:06",
            "net5": "56:d0:c7:52:ec:ff",
            "net6": "c6:88:40:4a:7e:fb",
            "net7": "5a:08:4d:e0:25:cc",
            "net8": "22:80:4d:94:23:e1",
            "net9": "c6:d1:34:1f:46:ee"
        },
        "spine_3_1_6": {
            "net0": "42:dc:03:2d:f0:85",
            "net1": "32:34:bf:60:56:34",
            "net10": "6a:6f:e4:41:6a:c8",
            "net11": "76:ee:0a:56:c1:ec",
            "net12": "2a:fa:be:22:bd:bf",
            "net13": "ba:86:ab:88:a1:03",
            "net14": "a6:0c:2b:cf:b0:e2",
            "net15": "0a:37:e3:1e:f0:5d",
            "net16": "02:36:8d:da:41:96",
            "net17": "9a:42:7a:aa:a0:87",
            "net18": "a6:d3:b6:89:d2:a3",
            "net19": "6e:81:7d:39:60:c7",
            "net2": "0a:76:34:36:50:e0",
            "net3": "46:f2:6f:cb:f0:ef",
            "net4": "46:e4:c8:bc:79:d6",
            "net5": "d6:3f:92:a5:3a:2b",
            "net6": "36:8f:c4:96:7b:36",
            "net7": "b2:7d:65:01:97:64",
            "net8": "66:1d:86:58:6e:40",
            "net9": "82:dd:4c:c8:ae:0f"
        },
        "spine_3_1_7": {
            "net0": "f6:c1:90:5c:73:55",
            "net1": "8a:25:a6:f8:a0:fd",
            "net10": "06:7f:4b:89:a5:47",
            "net11": "46:b0:ce:a8:49:80",
            "net12": "be:91:2b:d8:bc:8e",
            "net13": "32:03:a9:73:4a:aa",
            "net14": "a2:04:94:f9:e7:64",
            "net15": "de:b0:c4:e4:50:b4",
            "net16": "d2:bb:35:39:8c:b8",
            "net17": "86:e7:13:4c:a0:a8",
            "net18": "92:7a:0b:54:16:8f",
            "net19": "52:6c:85:87:33:fd",
            "net2": "42:5a:33:46:7d:70",
            "net3": "76:9a:78:53:6e:ec",
            "net4": "ba:34:ca:a6:d9:42",
            "net5": "e6:01:7b:ec:ef:65",
            "net6": "32:a3:e1:49:ad:1b",
            "net7": "d6:40:1b:b4:2b:fe",
            "net8": "66:1c:03:82:3e:29",
            "net9": "da:86:b6:f5:08:8b"
        },
        "spine_3_1_8": {
            "net0": "8a:ad:b7:57:75:ca",
            "net1": "8e:c4:ca:7d:f9:e5",
            "net10": "9e:bb:61:28:44:1e",
            "net11": "3e:7f:17:14:34:d7",
            "net12": "1a:44:22:7d:03:4b",
            "net13": "ee:4f:38:87:40:cf",
            "net14": "4e:c9:c0:6e:0a:9e",
            "net15": "3a:15:03:c6:7d:80",
            "net16": "82:50:71:00:e2:3e",
            "net17": "9a:25:33:11:2a:d1",
            "net18": "8a:98:7c:b3:20:6e",
            "net19": "d6:30:57:f3:30:dc",
            "net2": "2e:24:0d:d6:08:c0",
            "net3": "7e:77:28:da:af:c3",
            "net4": "9e:0c:06:08:2d:27",
            "net5": "3a:bb:05:65:df:b2",
            "net6": "3a:01:73:22:ec:d6",
            "net7": "e6:a4:bc:bf:08:24",
            "net8": "12:ab:cf:77:96:93",
            "net9": "c2:91:10:79:32:f1"
        },
        "spine_3_1_9": {
            "net0": "fe:25:67:db:8b:b2",
            "net1": "d2:42:bd:03:c3:8a",
            "net10": "76:81:6e:4e:23:75",
            "net11": "2a:c4:c3:25:8e:89",
            "net12": "22:ef:3e:09:19:ad",
            "net13": "56:5a:8d:5f:c6:67",
            "net14": "26:66:e5:74:b5:0f",
            "net15": "fa:a4:4d:41:92:5a",
            "net16": "16:78:1b:45:d7:49",
            "net17": "0e:45:7b:74:0f:56",
            "net18": "e2:c2:e1:d8:06:90",
            "net19": "82:89:d6:19:29:a3",
            "net2": "a2:e4:99:b0:eb:78",
            "net3": "be:00:10:d9:69:90",
            "net4": "46:de:b4:c2:35:a2",
            "net5": "3e:c4:8d:04:bf:e1",
            "net6": "da:48:5c:6c:17:fd",
            "net7": "56:66:ce:69:76:61",
            "net8": "9a:c5:cb:f1:4e:60",
            "net9": "3a:fc:22:92:a6:f1"
        },
        "spine_4_1_1": {
            "net0": "5e:51:3c:2f:89:a7",
            "net1": "16:0a:ef:d1:92:52",
            "net10": "ae:3d:e6:53:e9:bb",
            "net11": "f6:2f:b9:1a:ad:2c",
            "net12": "fa:29:4e:74:10:36",
            "net13": "ba:c0:f0:f6:e5:ff",
            "net14": "3e:1e:63:2d:dd:fb",
            "net15": "86:b6:74:49:a4:cc",
            "net16": "76:5c:2e:e5:bf:c1",
            "net17": "7a:67:cb:61:b1:37",
            "net18": "be:fe:e5:37:59:53",
            "net19": "8a:34:0a:99:69:0d",
            "net2": "02:dc:0d:3c:7e:17",
            "net3": "52:7e:cf:c7:6a:56",
            "net4": "ba:73:92:05:e8:41",
            "net5": "e6:85:42:5a:f6:03",
            "net6": "52:c0:5b:28:e7:ee",
            "net7": "1a:57:02:09:eb:d4",
            "net8": "96:24:99:32:83:83",
            "net9": "3a:82:eb:d5:fa:98"
        },
        "spine_4_1_10": {
            "net0": "fe:f5:11:ef:10:97",
            "net1": "1e:32:63:ea:83:66",
            "net10": "3e:d2:fc:af:06:81",
            "net11": "b2:49:f0:7a:52:70",
            "net12": "46:9d:ec:98:00:8e",
            "net13": "62:00:ae:c4:55:0c",
            "net14": "e6:1f:b4:f1:b7:cb",
            "net15": "46:d3:b6:d7:4b:84",
            "net16": "3e:d7:0a:30:e6:02",
            "net17": "12:36:c4:15:f3:19",
            "net18": "c6:45:83:10:4e:e0",
            "net19": "92:6f:60:39:9b:f8",
            "net2": "ba:04:e7:d5:17:07",
            "net3": "16:20:18:b0:6d:da",
            "net4": "42:e7:7c:63:b2:ed",
            "net5": "b2:44:7c:9f:22:bb",
            "net6": "2a:fa:d9:d3:41:f1",
            "net7": "5e:04:7b:4a:75:87",
            "net8": "1e:9b:f3:05:40:1f",
            "net9": "56:79:ff:f7:25:29"
        },
        "spine_4_1_2": {
            "net0": "72:18:56:ca:dc:6c",
            "net1": "be:2f:25:8a:b2:40",
            "net10": "fe:3a:df:f6:92:73",
            "net11": "4e:a6:1c:5e:41:38",
            "net12": "ba:53:17:fc:22:72",
            "net13": "aa:b3:97:8c:30:b7",
            "net14": "26:a2:34:e8:a0:ae",
            "net15": "62:96:95:18:94:40",
            "net16": "e6:b0:7d:26:cf:e6",
            "net17": "a6:2e:f7:cd:ad:39",
            "net18": "fa:2a:bf:8a:c7:6e",
            "net19": "7e:f7:b7:ac:b9:1d",
            "net2": "fa:3e:67:a8:71:8e",
            "net3": "b2:6c:e5:6f:40:d1",
            "net4": "4e:da:57:b6:b3:56",
            "net5": "5a:c3:f3:79:71:80",
            "net6": "92:72:65:0e:dd:98",
            "net7": "c2:3e:9a:16:39:ab",
            "net8": "be:0e:6d:2f:e4:a9",
            "net9": "62:31:cf:65:33:4e"
        },
        "spine_4_1_3": {
            "net0": "26:7b:36:90:e2:a2",
            "net1": "da:0c:83:94:30:d9",
            "net10": "b2:c1:fb:9d:ef:61",
            "net11": "12:6a:e8:97:64:db",
            "net12": "7a:b7:4f:b8:a2:f5",
            "net13": "12:a3:b5:fe:9d:b8",
            "net14": "9a:15:02:e4:a2:1b",
            "net15": "36:88:1c:56:7f:10",
            "net16": "12:2e:73:46:25:f0",
            "net17": "9a:c5:11:e9:72:35",
            "net18": "3e:4e:43:eb:fd:e8",
            "net19": "86:f4:00:76:05:67",
            "net2": "5a:b0:6d:68:3a:48",
            "net3": "16:16:79:5f:42:34",
            "net4": "9e:a3:6b:4e:e2:9c",
            "net5": "0a:ed:85:ed:53:54",
            "net6": "66:3f:c2:f0:40:fb",
            "net7": "da:b9:14:b4:56:c3",
            "net8": "62:24:3d:14:be:9e",
            "net9": "ae:6f:50:89:a4:02"
        },
        "spine_4_1_4": {
            "net0": "b6:0b:56:21:1e:56",
            "net1": "4a:30:ba:64:06:94",
            "net10": "d6:7f:93:84:b5:01",
            "net11": "ae:7e:4e:c9:ad:e9",
            "net12": "ce:a2:ea:d5:b0:34",
            "net13": "92:d5:bd:67:13:ce",
            "net14": "b6:b5:63:42:93:cc",
            "net15": "9e:02:ca:08:1a:48",
            "net16": "6e:3c:64:6e:8c:2b",
            "net17": "3a:8c:7f:97:9a:90",
            "net18": "0a:ea:26:ae:72:7f",
            "net19": "46:93:ad:ba:e7:23",
            "net2": "fe:c3:2a:26:db:8d",
            "net3": "62:d7:51:10:82:2f",
            "net4": "0a:ef:71:d8:6d:16",
            "net5": "92:b5:59:75:02:5e",
            "net6": "6a:ed:01:95:63:b4",
            "net7": "8a:c4:50:a9:4c:fd",
            "net8": "b2:93:40:46:23:c1",
            "net9": "f2:be:b5:52:ff:d5"
        },
        "spine_4_1_5": {
            "net0": "5a:00:b6:54:2e:09",
            "net1": "6e:ff:4c:ed:e2:c5",
            "net10": "72:ca:43:7e:d9:70",
            "net11": "aa:76:bf:45:8f:0f",
            "net12": "92:e2:ec:95:7b:a6",
            "net13": "0e:ac:6f:ff:f4:d9",
            "net14": "2e:a7:f3:ce:aa:0f",
            "net15": "a2:57:b3:ef:2a:27",
            "net16": "6a:3e:d9:a8:ca:4c",
            "net17": "32:5a:ea:14:7e:72",
            "net18": "da:6f:44:bb:32:d8",
            "net19": "2a:b0:20:15:e4:b0",
            "net2": "4a:81:df:a0:cb:db",
            "net3": "62:91:5e:2f:a1:d8",
            "net4": "d6:c6:bb:24:7e:48",
            "net5": "0a:5e:5b:1e:cd:51",
            "net6": "f2:d4:42:72:21:28",
            "net7": "22:cf:e7:2a:2f:85",
            "net8": "ae:12:c4:a2:03:a0",
            "net9": "3a:2c:ea:bd:03:28"
        },
        "spine_4_1_6": {
            "net0": "86:2c:00:54:70:79",
            "net1": "8e:db:c6:65:32:5a",
            "net10": "ca:fc:c7:bc:d7:37",
            "net11": "46:10:9f:80:74:8c",
            "net12": "ea:0f:61:93:24:a8",
            "net13": "ba:b4:83:76:da:08",
            "net14": "be:fb:61:55:bf:8f",
            "net15": "0e:96:9e:fe:5a:6f",
            "net16": "36:50:21:4b:df:b9",
            "net17": "82:1e:9b:a1:69:a0",
            "net18": "02:fd:e0:f1:63:2f",
            "net19": "52:ca:73:9a:45:40",
            "net2": "ea:94:5c:e4:43:36",
            "net3": "52:36:fb:a6:42:c4",
            "net4": "fe:21:cb:d8:4b:77",
            "net5": "1a:d8:11:15:e0:99",
            "net6": "6e:d7:85:32:c8:c4",
            "net7": "c6:29:0f:af:9c:68",
            "net8": "82:83:92:0b:6e:d4",
            "net9": "62:84:dd:a7:72:89"
        },
        "spine_4_1_7": {
            "net0": "86:90:03:50:e8:35",
            "net1": "6e:e8:60:1b:8c:9a",
            "net10": "6a:0f:ae:6f:6a:c5",
            "net11": "f6:6e:b9:ca:f1:09",
            "net12": "ca:ae:3f:52:2e:1a",
            "net13": "d6:9f:ec:19:20:a1",
            "net14": "e2:f8:c2:df:0d:ea",
            "net15": "72:70:04:c2:b6:ec",
            "net16": "86:23:48:29:a7:29",
            "net17": "0e:03:69:a5:33:0e",
            "net18": "d6:ee:ca:b0:45:df",
            "net19": "b2:62:aa:9d:1a:d3",
            "net2": "ba:cb:74:ec:60:54",
            "net3": "7a:49:56:d0:65:78",
            "net4": "b6:ec:55:e7:7e:05",
            "net5": "a6:e8:db:ef:61:83",
            "net6": "66:7a:74:2e:81:75",
            "net7": "3a:90:51:08:28:6f",
            "net8": "86:08:9e:53:47:9c",
            "net9": "d6:c7:e4:e2:24:38"
        },
        "spine_4_1_8": {
            "net0": "e6:da:5c:46:62:46",
            "net1": "e2:df:83:0d:41:af",
            "net10": "ba:a9:80:91:2b:08",
            "net11": "ca:8d:91:6a:41:da",
            "net12": "7e:60:bd:8e:db:7e",
            "net13": "ce:eb:64:9a:da:16",
            "net14": "d2:06:65:c7:6b:42",
            "net15": "6a:45:89:c9:38:c5",
            "net16": "26:11:7b:f5:a9:b6",
            "net17": "96:e9:ac:69:9d:f7",
            "net18": "92:4d:da:8a:78:9d",
            "net19": "4a:01:4c:3d:09:95",
            "net2": "c2:99:6e:07:63:87",
            "net3": "ce:05:7a:52:57:9b",
            "net4": "3e:0c:df:11:54:99",
            "net5": "d2:f6:7a:8b:59:da",
            "net6": "06:86:8d:db:b6:71",
            "net7": "86:75:cc:46:e8:65",
            "net8": "96:f1:20:00:bf:82",
            "net9": "86:8b:2b:02:83:13"
        },
        "spine_4_1_9": {
            "net0": "16:3c:e7:43:62:32",
            "net1": "06:c0:b5:40:9e:b0",
            "net10": "5a:b0:63:09:65:2b",
            "net11": "0a:e8:b7:63:fe:87",
            "net12": "ba:c4:2c:d7:04:53",
            "net13": "0e:b0:73:dd:9c:0d",
            "net14": "ae:7b:c2:7e:d0:07",
            "net15": "56:92:03:a5:af:c2",
            "net16": "b2:67:3c:29:0c:ea",
            "net17": "92:94:67:77:5b:12",
            "net18": "32:02:6e:c0:96:d5",
            "net19": "fa:e6:8f:83:42:51",
            "net2": "82:11:98:6f:d5:13",
            "net3": "42:9e:ab:37:92:08",
            "net4": "ce:15:77:e1:90:4e",
            "net5": "6a:a1:5a:b2:20:11",
            "net6": "fe:ca:f9:c8:25:1d",
            "net7": "2a:37:fa:19:8f:a2",
            "net8": "f2:02:b6:fc:45:b1",
            "net9": "0a:8c:c9:f1:bc:5d"
        },
        "tof_1_2_1": {
            "net0": "be:5e:81:1d:dc:f8",
            "net1": "36:d7:51:0b:b7:1e",
            "net10": "4a:76:d7:ff:68:25",
            "net11": "0a:5b:40:33:2f:24",
            "net12": "b6:84:31:4f:a4:b4",
            "net13": "1e:9c:6a:a8:d1:1f",
            "net14": "4e:ee:66:d1:84:0d",
            "net15": "3e:fa:ef:32:c4:84",
            "net16": "8a:be:f7:32:8e:ba",
            "net17": "32:7d:da:c4:7e:ac",
            "net18": "a2:39:bd:10:e2:66",
            "net19": "36:fa:5d:ca:59:b5",
            "net2": "ba:ea:39:03:a6:c1",
            "net3": "96:01:df:ae:b5:57",
            "net4": "7a:20:cf:29:f2:56",
            "net5": "32:63:18:c3:d0:f1",
            "net6": "c6:cd:89:b7:31:5a",
            "net7": "16:32:bb:d9:2c:1b",
            "net8": "12:1a:df:c4:c3:f0",
            "net9": "fe:1c:d9:c4:af:7c"
        },
        "tof_1_2_10": {
            "net0": "52:4e:40:56:0b:05",
            "net1": "e2:85:4c:30:5c:8a",
            "net10": "96:13:12:2c:f2:ff",
            "net11": "c6:ce:c7:80:29:27",
            "net12": "16:ab:d2:22:60:76",
            "net13": "2a:85:40:43:23:41",
            "net14": "56:02:7a:b0:7b:a1",
            "net15": "c2:cc:e7:8b:28:c4",
            "net16": "0e:3d:5e:eb:54:26",
            "net17": "e2:39:9f:6e:55:eb",
            "net18": "c6:63:c4:5f:d4:a7",
            "net19": "46:64:fe:3b:f9:d6",
            "net2": "36:91:e4:ba:bf:f4",
            "net3": "a6:4e:ae:3a:b1:1e",
            "net4": "0e:fb:b6:de:11:f0",
            "net5": "b2:02:5f:ff:5c:4e",
            "net6": "c6:50:2e:f5:96:47",
            "net7": "86:e4:ad:79:5e:88",
            "net8": "ee:44:1b:35:06:e5",
            "net9": "c2:5d:e2:9f:f4:8d"
        },
        "tof_1_2_2": {
            "net0": "9a:6d:e3:07:fd:8a",
            "net1": "96:7a:da:9b:f9:9d",
            "net10": "36:11:25:03:fa:7b",
            "net11": "e2:72:a1:e6:ef:43",
            "net12": "7a:8b:64:74:ee:16",
            "net13": "ee:b9:5a:3a:8d:d3",
            "net14": "96:09:29:23:14:5f",
            "net15": "72:16:62:98:12:60",
            "net16": "e6:b2:4f:fa:cb:2d",
            "net17": "7e:cb:8f:06:b8:4a",
            "net18": "8a:03:a7:f2:c7:9d",
            "net19": "62:b8:e7:eb:50:91",
            "net2": "e2:ec:46:5c:db:a0",
            "net3": "66:d7:1a:25:ef:f1",
            "net4": "ce:b4:78:64:ab:b8",
            "net5": "a2:92:9e:49:b4:68",
            "net6": "ae:ef:5c:39:14:86",
            "net7": "a2:b6:a1:bb:07:b4",
            "net8": "4e:6a:98:58:d3:dc",
            "net9": "1a:34:dc:2c:57:3f"
        },
        "tof_1_2_3": {
            "net0": "fe:3f:8c:c8:ff:70",
            "net1": "ea:fe:5e:dc:4c:9c",
            "net10": "16:7d:f3:47:ef:99",
            "net11": "7e:98:83:b3:cb:52",
            "net12": "3e:e6:fa:94:6d:24",
            "net13": "26:15:f2:59:bc:88",
            "net14": "9e:5c:b1:33:b6:14",
            "net15": "7e:94:05:ff:b0:5e",
            "net16": "ee:6d:e0:e7:55:b6",
            "net17": "d6:b4:6e:74:50:95",
            "net18": "9e:eb:56:f9:86:41",
            "net19": "b2:31:4b:42:a3:66",
            "net2": "de:90:b6:3f:e0:03",
            "net3": "6a:0b:39:0d:ef:73",
            "net4": "0e:f8:20:7c:1f:35",
            "net5": "d6:93:f6:02:8c:5e",
            "net6": "5e:9d:2c:94:e7:39",
            "net7": "36:2b:4b:23:bf:76",
            "net8": "16:4b:73:1f:fe:3b",
            "net9": "de:25:62:4b:54:00"
        },
        "tof_1_2_4": {
            "net0": "f6:28:66:6c:f3:04",
            "net1": "86:40:85:20:7d:5f",
            "net10": "66:20:69:d8:54:04",
            "net11": "36:0a:33:d6:0b:9b",
            "net12": "ca:b6:a9:c9:fd:1c",
            "net13": "16:87:b3:27:be:2c",
            "net14": "42:52:75:24:38:ad",
            "net15": "06:54:c2:f1:2a:72",
            "net16": "de:b1:e8:75:7d:7d",
            "net17": "4a:dc:56:be:2a:d0",
            "net18": "32:92:be:c0:24:59",
            "net19": "8e:f0:5f:b8:66:05",
            "net2": "22:c6:b5:b1:a6:f1",
            "net3": "3a:24:97:e7:26:e3",
            "net4": "a2:0d:0b:6d:a7:80",
            "net5": "e6:b1:6d:74:0e:ff",
            "net6": "1e:01:1e:4a:ca:ff",
            "net7": "e2:a8:1b:cb:da:81",
            "net8": "96:b1:02:95:b3:05",
            "net9": "4e:5d:e1:d3:c2:6b"
        },
        "tof_1_2_5": {
            "net0": "de:69:11:27:aa:43",
            "net1": "56:fb:7f:6d:f8:60",
            "net10": "ee:6d:fe:8c:a2:ac",
            "net11": "ba:18:b4:89:06:4b",
            "net12": "32:46:59:9b:85:da",
            "net13": "76:4e:47:76:94:0a",
            "net14": "32:16:eb:3f:8e:c8",
            "net15": "aa:93:bf:ce:b9:d5",
            "net16": "b2:6c:32:92:0a:34",
            "net17": "1e:bb:27:0a:13:90",
            "net18": "1a:32:3a:c6:f4:1e",
            "net19": "f6:c7:89:45:ad:94",
            "net2": "26:3b:64:07:9b:bb",
            "net3": "92:8e:2e:95:c1:f5",
            "net4": "42:f3:9e:62:ac:b4",
            "net5": "32:40:45:8f:b7:da",
            "net6": "32:39:14:b4:23:2d",
            "net7": "f2:98:78:e8:44:d0",
            "net8": "5e:42:c1:59:06:89",
            "net9": "3e:14:8c:fa:8c:eb"
        },
        "tof_1_2_6": {
            "net0": "ce:32:b4:9f:ca:9f",
            "net1": "36:bb:70:b2:06:9e",
            "net10": "e6:3a:e3:15:77:04",
            "net11": "ee:21:cf:79:a9:f3",
            "net12": "c6:ba:03:1e:a2:4d",
            "net13": "62:c1:38:56:07:08",
            "net14": "be:24:1c:de:64:a5",
            "net15": "ee:d9:d3:8c:f2:41",
            "net16": "3e:41:4e:72:ae:3d",
            "net17": "ca:74:d8:26:6c:a5",
            "net18": "ba:82:38:94:77:28",
            "net19": "8a:93:b8:1a:2e:8f",
            "net2": "66:38:6e:bd:98:63",
            "net3": "ba:aa:92:e6:44:80",
            "net4": "26:b3:91:f7:33:a4",
            "net5": "d6:1d:4d:82:52:39",
            "net6": "02:29:71:08:c6:5f",
            "net7": "06:fd:6c:1c:48:10",
            "net8": "da:64:aa:18:5e:9d",
            "net9": "0e:8c:bf:25:80:15"
        },
        "tof_1_2_7": {
            "net0": "e6:4d:b6:02:2c:fe",
            "net1": "4a:c7:74:da:64:82",
            "net10": "02:bf:6c:30:69:a6",
            "net11": "1e:c4:c0:a3:a5:6a",
            "net12": "a6:1f:a0:57:7c:98",
            "net13": "56:ab:55:10:c1:e8",
            "net14": "0e:1f:c0:69:f2:b8",
            "net15": "c2:9c:b4:b6:11:e4",
            "net16": "1e:3e:bb:36:36:da",
            "net17": "26:54:24:26:9a:b3",
            "net18": "5a:04:21:12:53:2f",
            "net19": "ce:91:7b:9f:1e:29",
            "net2": "86:d1:74:ff:b2:2c",
            "net3": "5a:f5:cc:63:6c:7a",
            "net4": "12:db:33:83:94:0d",
            "net5": "c2:45:84:77:16:fb",
            "net6": "72:e4:30:eb:9c:37",
            "net7": "7e:ea:47:c0:3c:f1",
            "net8": "26:12:7d:04:48:2d",
            "net9": "82:ca:ce:61:c5:6d"
        },
        "tof_1_2_8": {
            "net0": "ee:d8:9f:7c:df:16",
            "net1": "fe:b8:b5:d1:cc:b6",
            "net10": "ee:41:9b:69:d3:4b",
            "net11": "0e:28:dc:56:57:2c",
            "net12": "76:d8:53:8b:bf:54",
            "net13": "36:89:1b:ec:4a:98",
            "net14": "b2:68:13:9a:ee:e9",
            "net15": "ee:5b:1c:bb:af:1b",
            "net16": "c2:34:58:99:02:13",
            "net17": "1e:97:e3:c4:9c:d3",
            "net18": "ea:41:1d:23:61:cc",
            "net19": "c6:d6:8f:fb:74:ce",
            "net2": "1a:ba:b3:6a:36:50",
            "net3": "72:a0:c2:c6:00:58",
            "net4": "e2:2b:fb:13:c3:ac",
            "net5": "fe:2e:1d:ba:40:09",
            "net6": "06:95:01:85:3c:ed",
            "net7": "5e:ca:d0:d8:c7:9f",
            "net8": "ce:6d:39:77:d6:65",
            "net9": "d6:56:d6:e1:76:c0"
        },
        "tof_1_2_9": {
            "net0": "a2:08:1d:1a:66:37",
            "net1": "f2:60:be:06:21:63",
            "net10": "32:42:3b:c6:14:aa",
            "net11": "fa:1a:b1:9e:3f:38",
            "net12": "42:da:8b:1c:4a:87",
            "net13": "8e:04:cc:f8:cf:86",
            "net14": "52:be:4e:19:11:0e",
            "net15": "be:27:1c:b8:45:ca",
            "net16": "b6:79:32:cc:8b:2f",
            "net17": "92:d2:b0:a7:1c:8f",
            "net18": "c6:2b:8f:db:55:94",
            "net19": "7a:1e:0d:d5:72:14",
            "net2": "26:55:22:86:eb:73",
            "net3": "92:79:55:80:63:91",
            "net4": "26:c5:9f:1c:ac:33",
            "net5": "82:02:1f:25:f2:0a",
            "net6": "c6:62:8d:98:1e:67",
            "net7": "aa:c6:a8:ea:36:4c",
            "net8": "2e:4e:9f:61:2a:88",
            "net9": "de:86:c1:8e:20:59"
        },
        "tof_2_2_1": {
            "net0": "ae:f6:ed:0f:84:0e",
            "net1": "22:f4:6e:b6:bd:0d",
            "net10": "0e:a3:66:d1:51:58",
            "net11": "be:03:85:3e:d4:17",
            "net12": "fe:fa:11:13:da:0b",
            "net13": "2e:a9:93:fd:6d:d6",
            "net14": "6e:50:48:9c:9a:5b",
            "net15": "12:e2:74:9e:56:a3",
            "net16": "7e:8b:0a:21:c6:3f",
            "net17": "32:0f:89:90:11:9a",
            "net18": "02:89:2c:bc:df:f7",
            "net19": "d2:48:9c:a6:eb:5d",
            "net2": "0a:15:9f:dc:09:0e",
            "net3": "6a:ee:ba:53:57:44",
            "net4": "86:88:50:f9:15:d9",
            "net5": "92:69:f7:1c:56:10",
            "net6": "56:86:76:7e:aa:61",
            "net7": "aa:8f:ac:a1:0a:38",
            "net8": "ce:f9:25:a4:38:91",
            "net9": "26:9b:b7:92:b1:cb"
        },
        "tof_2_2_10": {
            "net0": "06:51:3b:0e:18:83",
            "net1": "82:e8:40:76:b1:08",
            "net10": "9a:c7:61:e6:03:bb",
            "net11": "16:c3:8e:df:07:79",
            "net12": "4e:ae:85:86:4e:37",
            "net13": "2a:94:c0:e8:51:11",
            "net14": "3a:c2:5a:93:5d:b6",
            "net15": "26:b1:e0:1a:18:ba",
            "net16": "76:e8:89:13:d9:e3",
            "net17": "9e:23:ae:2f:a2:07",
            "net18": "5e:b6:13:e4:8d:e0",
            "net19": "72:71:b4:03:40:d0",
            "net2": "d2:88:98:ab:b7:42",
            "net3": "3e:2b:05:90:6c:45",
            "net4": "4e:80:ec:20:f1:83",
            "net5": "fa:05:0f:72:56:93",
            "net6": "6a:6d:29:a7:a7:73",
            "net7": "3a:92:33:cb:29:60",
            "net8": "62:0f:db:ca:a8:d8",
            "net9": "62:a9:60:ab:e2:c7"
        },
        "tof_2_2_2": {
            "net0": "2e:4e:9a:ac:7d:42",
            "net1": "f2:b8:67:8e:bf:33",
            "net10": "ae:50:86:d5:74:43",
            "net11": "b2:e5:37:de:a8:7e",
            "net12": "c6:b8:4d:ee:a8:d9",
            "net13": "92:4b:11:a2:9b:6f",
            "net14": "56:24:0b:b3:3f:52",
            "net15": "3a:9a:45:2c:95:36",
            "net16": "e6:71:bb:23:f2:01",
            "net17": "2e:cd:52:33:61:b0",
            "net18": "a6:3c:0e:ab:54:53",
            "net19": "fa:b7:c4:74:ef:cd",
            "net2": "d2:97:e4:b1:27:15",
            "net3": "1e:ea:81:f1:9e:8f",
            "net4": "42:43:96:0d:69:26",
            "net5": "46:6f:dd:3c:0b:fb",
            "net6": "a6:92:68:b6:71:ea",
            "net7": "8a:5f:6e:e5:db:31",
            "net8": "96:63:27:40:e6:be",
            "net9": "62:d8:4a:cd:8a:66"
        },
        "tof_2_2_3": {
            "net0": "f2:71:28:77:83:1c",
            "net1": "b2:50:b8:12:23:7b",
            "net10": "12:68:19:03:48:21",
            "net11": "ae:9a:6f:46:5f:7f",
            "net12": "7e:a8:cb:96:9e:08",
            "net13": "de:01:56:48:8d:e1",
            "net14": "a2:18:6b:5b:0f:f7",
            "net15": "72:09:d6:e6:a2:8a",
            "net16": "e2:1b:04:70:53:46",
            "net17": "d6:fd:65:32:f5:79",
            "net18": "fa:57:23:28:bf:ea",
            "net19": "8a:e2:14:5a:5f:68",
            "net2": "56:ee:06:ce:6f:0a",
            "net3": "fa:8e:12:4f:7c:70",
            "net4": "de:0f:54:22:ce:d6",
            "net5": "0e:11:19:16:0e:56",
            "net6": "c6:d5:de:1a:78:d5",
            "net7": "f6:79:e9:78:6f:c7",
            "net8": "7e:72:70:70:1a:34",
            "net9": "be:5b:d8:2d:6c:f8"
        },
        "tof_2_2_4": {
            "net0": "82:92:72:ca:e5:f8",
            "net1": "5a:cd:1a:e7:91:bb",
            "net10": "3e:5b:93:9d:bc:60",
            "net11": "e2:a6:d5:89:3b:a9",
            "net12": "5a:b6:6e:12:7f:22",
            "net13": "92:e1:cd:01:80:29",
            "net14": "5a:1a:54:05:00:b2",
            "net15": "8e:93:c9:bd:2e:b9",
            "net16": "e6:aa:b0:e5:81:c6",
            "net17": "7e:0b:78:a7:37:60",
            "net18": "a2:92:15:b7:04:31",
            "net19": "96:98:60:89:16:11",
            "net2": "96:89:97:0f:21:cf",
            "net3": "22:05:46:d4:4f:2f",
            "net4": "e2:40:d8:8f:66:9f",
            "net5": "ae:8e:da:68:ba:98",
            "net6": "12:ac:83:51:60:b6",
            "net7": "ea:87:97:cc:37:89",
            "net8": "12:73:71:5a:d5:4f",
            "net9": "ba:2a:69:c6:0e:0c"
        },
        "tof_2_2_5": {
            "net0": "16:f6:bb:49:e3:5e",
            "net1": "d2:33:3c:1e:46:07",
            "net10": "be:88:46:0e:fb:c9",
            "net11": "ba:31:5f:98:89:ae",
            "net12": "8a:c2:87:79:2c:e2",
            "net13": "46:94:bc:97:bd:d5",
            "net14": "6a:4a:6a:4d:9a:bb",
            "net15": "3a:63:24:78:9a:7c",
            "net16": "f6:f0:bb:61:a4:f4",
            "net17": "16:d1:21:02:80:95",
            "net18": "aa:2f:42:5c:aa:d9",
            "net19": "a2:53:d2:87:6c:85",
            "net2": "d6:4f:b4:3a:fa:11",
            "net3": "ce:8d:ab:ae:e1:62",
            "net4": "36:29:f7:45:31:a6",
            "net5": "7e:25:6d:c6:0e:1f",
            "net6": "36:cd:cb:b2:77:6d",
            "net7": "ca:cd:e4:5c:eb:ab",
            "net8": "e6:44:c2:19:d1:21",
            "net9": "6e:26:60:6e:c6:ac"
        },
        "tof_2_2_6": {
            "net0": "52:10:53:c7:69:41",
            "net1": "f2:ee:53:20:91:c1",
            "net10": "92:2d:0f:61:b9:14",
            "net11": "ae:4d:4e:c3:c0:de",
            "net12": "fe:13:c4:89:2e:ac",
            "net13": "aa:34:f9:f3:5a:0d",
            "net14": "02:17:c1:f0:0c:60",
            "net15": "5a:01:1c:da:83:53",
            "net16": "ba:18:b2:bb:ba:3e",
            "net17": "52:8f:a5:a0:18:f0",
            "net18": "22:18:93:b0:fd:1c",
            "net19": "9e:b0:3a:d6:8a:f1",
            "net2": "b2:1f:aa:cc:bf:8e",
            "net3": "5e:f5:ff:ea:28:8f",
            "net4": "7e:2a:a2:4f:f2:88",
            "net5": "c2:95:c1:bb:ba:6a",
            "net6": "ae:20:78:c0:9c:a7",
            "net7": "f2:e2:8e:ef:c1:b3",
            "net8": "0a:23:0d:2f:21:74",
            "net9": "92:d3:4b:85:36:ae"
        },
        "tof_2_2_7": {
            "net0": "be:30:fd:27:f4:29",
            "net1": "7e:ce:51:4f:a1:c6",
            "net10": "fe:9e:d1:4d:35:97",
            "net11": "fe:4f:59:0d:9e:f5",
            "net12": "82:53:a0:7d:7c:18",
            "net13": "fe:b5:87:79:9b:bf",
            "net14": "5a:13:41:d8:2f:4e",
            "net15": "c2:3b:20:b6:93:42",
            "net16": "6a:7e:bc:be:df:0c",
            "net17": "d2:29:9b:7c:c8:cd",
            "net18": "c6:d8:dd:86:0c:e9",
            "net19": "a2:9e:73:a2:c7:44",
            "net2": "f6:03:d9:9a:b5:cd",
            "net3": "da:63:3e:4e:e1:af",
            "net4": "9a:82:10:aa:a5:fe",
            "net5": "9e:af:23:ed:f1:74",
            "net6": "16:eb:b7:a8:38:37",
            "net7": "ea:6b:a8:e2:fb:42",
            "net8": "96:0f:0f:30:e1:5f",
            "net9": "d6:34:80:64:7c:62"
        },
        "tof_2_2_8": {
            "net0": "d6:af:1f:ba:08:a1",
            "net1": "0e:b7:48:07:06:ab",
            "net10": "12:91:a5:91:5e:99",
            "net11": "5e:a6:1e:a5:a0:cc",
            "net12": "66:a8:93:32:ce:ca",
            "net13": "5e:08:a7:99:86:e6",
            "net14": "2e:4f:3d:dd:ab:ba",
            "net15": "d6:49:ca:c3:81:4c",
            "net16": "12:79:fb:5d:1b:0a",
            "net17": "52:68:ff:99:a3:8d",
            "net18": "8a:29:d9:d2:d3:ad",
            "net19": "1e:1e:9d:3a:83:3e",
            "net2": "fa:10:2b:6a:0d:c0",
            "net3": "72:7e:12:fe:39:f3",
            "net4": "36:b5:dd:3c:86:13",
            "net5": "06:00:d0:93:d9:06",
            "net6": "a6:28:61:6a:b5:de",
            "net7": "9e:62:69:9b:ae:7c",
            "net8": "d6:18:8e:51:67:31",
            "net9": "02:75:ee:2f:c6:ac"
        },
        "tof_2_2_9": {
            "net0": "6e:4c:98:63:81:ce",
            "net1": "fe:be:01:01:ef:80",
            "net10": "3e:1f:0c:d5:dd:a0",
            "net11": "06:9d:d6:1b:0d:df",
            "net12": "a6:f3:b7:c6:1a:69",
            "net13": "62:81:ad:80:73:e9",
            "net14": "aa:9b:22:a2:ea:7a",
            "net15": "1e:7f:30:d5:04:1f",
            "net16": "26:85:6a:dd:bd:a1",
            "net17": "b6:e3:aa:1e:20:87",
            "net18": "4a:3d:57:ef:1b:30",
            "net19": "fa:9b:95:94:2d:0a",
            "net2": "ba:d4:c7:6e:79:fc",
            "net3": "9a:32:e7:d7:28:50",
            "net4": "16:e7:95:82:ef:9b",
            "net5": "42:ef:6e:b0:48:9f",
            "net6": "f6:b3:50:3b:67:cf",
            "net7": "86:ad:e1:79:93:2f",
            "net8": "92:a7:22:b6:60:b5",
            "net9": "06:0a:f6:de:43:a1"
        }
    },
    "failed_machine": "leaf_1_0_1",
    "failure_time": 1614449454.414165,
    "recover_time": 1614449730.1515803
}