{
    "k_leaf": 2,
    "k_top": 2,
    "redundancy_factor": 2,
    "is_k8s": true,
    "failed_machine": "leaf_1_0_1",
    "failure_time": {
        "leaf_1_0_1": 1622464897.6837041,
        "leaf_1_0_2": 1622464897.6927023,
        "leaf_2_0_1": 1622464897.6851635,
        "leaf_2_0_2": 1622464897.6993675,
        "spine_1_1_1": 1622464897.7001956,
        "spine_1_1_2": 1622464897.7123857,
        "spine_2_1_1": 1622464897.7135522,
        "spine_2_1_2": 1622464897.724329,
        "tof_1_2_1": 1622464897.7224293,
        "tof_1_2_2": 1622464897.729425
    },
    "packet_count": {
        "total": [
            28,
            756
        ],
        "leaf_1_0_2": {
            "total": [
                2,
                54
            ],
            "net0": {
                "total": [
                    1,
                    27
                ],
                "withdrawn": [
                    1,
                    27
                ]
            },
            "net1": {
                "total": [
                    1,
                    27
                ],
                "withdrawn": [
                    1,
                    27
                ]
            }
        },
        "leaf_2_0_2": {
            "total": [
                2,
                54
            ],
            "net0": {
                "total": [
                    1,
                    27
                ],
                "withdrawn": [
                    1,
                    27
                ]
            },
            "net1": {
                "total": [
                    1,
                    27
                ],
                "withdrawn": [
                    1,
                    27
                ]
            }
        },
        "spine_1_1_2": {
            "total": [
                3,
                81
            ],
            "net1": {
                "total": [
                    1,
                    27
                ],
                "withdrawn": [
                    1,
                    27
                ]
            },
            "net2": {
                "total": [
                    1,
                    27
                ],
                "withdrawn": [
                    1,
                    27
                ]
            },
            "net3": {
                "total": [
                    1,
                    27
                ],
                "withdrawn": [
                    1,
                    27
                ]
            }
        },
        "spine_2_1_2": {
            "total": [
                4,
                108
            ],
            "net0": {
                "total": [
                    1,
                    27
                ],
                "withdrawn": [
                    1,
                    27
                ]
            },
            "net1": {
                "total": [
                    1,
                    27
                ],
                "withdrawn": [
                    1,
                    27
                ]
            },
            "net2": {
                "total": [
                    1,
                    27
                ],
                "withdrawn": [
                    1,
                    27
                ]
            },
            "net3": {
                "total": [
                    1,
                    27
                ],
                "withdrawn": [
                    1,
                    27
                ]
            }
        },
        "tof_1_2_2": {
            "total": [
                4,
                108
            ],
            "net0": {
                "total": [
                    1,
                    27
                ],
                "withdrawn": [
                    1,
                    27
                ]
            },
            "net1": {
                "total": [
                    1,
                    27
                ],
                "withdrawn": [
                    1,
                    27
                ]
            },
            "net2": {
                "total": [
                    1,
                    27
                ],
                "withdrawn": [
                    1,
                    27
                ]
            },
            "net3": {
                "total": [
                    1,
                    27
                ],
                "withdrawn": [
                    1,
                    27
                ]
            }
        },
        "leaf_2_0_1": {
            "total": [
                2,
                54
            ],
            "net0": {
                "total": [
                    1,
                    27
                ],
                "withdrawn": [
                    1,
                    27
                ]
            },
            "net1": {
                "total": [
                    1,
                    27
                ],
                "withdrawn": [
                    1,
                    27
                ]
            }
        },
        "spine_2_1_1": {
            "total": [
                4,
                108
            ],
            "net0": {
                "total": [
                    1,
                    27
                ],
                "withdrawn": [
                    1,
                    27
                ]
            },
            "net1": {
                "total": [
                    1,
                    27
                ],
                "withdrawn": [
                    1,
                    27
                ]
            },
            "net2": {
                "total": [
                    1,
                    27
                ],
                "withdrawn": [
                    1,
                    27
                ]
            },
            "net3": {
                "total": [
                    1,
                    27
                ],
                "withdrawn": [
                    1,
                    27
                ]
            }
        },
        "spine_1_1_1": {
            "total": [
                3,
                81
            ],
            "net1": {
                "total": [
                    1,
                    27
                ],
                "withdrawn": [
                    1,
                    27
                ]
            },
            "net2": {
                "total": [
                    1,
                    27
                ],
                "withdrawn": [
                    1,
                    27
                ]
            },
            "net3": {
                "total": [
                    1,
                    27
                ],
                "withdrawn": [
                    1,
                    27
                ]
            }
        },
        "tof_1_2_1": {
            "total": [
                4,
                108
            ],
            "net0": {
                "total": [
                    1,
                    27
                ],
                "withdrawn": [
                    1,
                    27
                ]
            },
            "net1": {
                "total": [
                    1,
                    27
                ],
                "withdrawn": [
                    1,
                    27
                ]
            },
            "net2": {
                "total": [
                    1,
                    27
                ],
                "withdrawn": [
                    1,
                    27
                ]
            },
            "net3": {
                "total": [
                    1,
                    27
                ],
                "withdrawn": [
                    1,
                    27
                ]
            }
        }
    },
    "packets_by_collision_domain": {
        "AAAG": 2,
        "AAAI": 2,
        "AAAQ": 2,
        "AAAS": 2,
        "AAAH": 2,
        "AAAJ": 2,
        "AAAR": 2,
        "AAAT": 2,
        "AAAD": 2,
        "AAAE": 2,
        "AAAK": 2,
        "AAAL": 2,
        "AAAN": 2,
        "AAAO": 2
    },
    "blast_radius": {
        "by_collision_domain": {
            "AAAE": [
                1,
                2
            ],
            "AAAI": [
                1,
                2
            ],
            "AAAJ": [
                1,
                2
            ],
            "AAAD": [
                1,
                2
            ],
            "AAAG": [
                1,
                2
            ],
            "AAAH": [
                1,
                2
            ],
            "AAAR": [
                2,
                2
            ],
            "AAAT": [
                2,
                2
            ],
            "AAAQ": [
                2,
                2
            ],
            "AAAS": [
                2,
                2
            ],
            "AAAK": [
                3,
                2
            ],
            "AAAN": [
                3,
                2
            ],
            "AAAL": [
                3,
                2
            ],
            "AAAO": [
                3,
                2
            ]
        },
        "by_distance": {
            "1": 12,
            "2": 8,
            "3": 8
        }
    },
    "radius_graph": {
        "nodes": [
            {
                "id": "leaf_1_0_1",
                "label": "leaf_1_0_1"
            },
            {
                "id": "leaf_2_0_1",
                "label": "leaf_2_0_1"
            },
            {
                "id": "tof_1_2_2",
                "label": "tof_1_2_2"
            },
            {
                "id": "tof_1_2_1",
                "label": "tof_1_2_1"
            },
            {
                "id": "spine_2_1_1",
                "label": "spine_2_1_1"
            },
            {
                "id": "spine_1_1_2",
                "label": "spine_1_1_2"
            },
            {
                "id": "leaf_2_0_2",
                "label": "leaf_2_0_2"
            },
            {
                "id": "spine_2_1_2",
                "label": "spine_2_1_2"
            },
            {
                "id": "leaf_1_0_2",
                "label": "leaf_1_0_2"
            },
            {
                "id": "spine_1_1_1",
                "label": "spine_1_1_1"
            }
        ],
        "links": [
            {
                "source": "tof_1_2_1",
                "target": "spine_1_1_1",
                "value": 2,
                "label": "AAAG"
            },
            {
                "source": "tof_1_2_1",
                "target": "spine_1_1_2",
                "value": 2,
                "label": "AAAI"
            },
            {
                "source": "tof_1_2_1",
                "target": "spine_2_1_1",
                "value": 2,
                "label": "AAAQ"
            },
            {
                "source": "tof_1_2_1",
                "target": "spine_2_1_2",
                "value": 2,
                "label": "AAAS"
            },
            {
                "source": "tof_1_2_2",
                "target": "spine_1_1_1",
                "value": 2,
                "label": "AAAH"
            },
            {
                "source": "tof_1_2_2",
                "target": "spine_1_1_2",
                "value": 2,
                "label": "AAAJ"
            },
            {
                "source": "tof_1_2_2",
                "target": "spine_2_1_1",
                "value": 2,
                "label": "AAAR"
            },
            {
                "source": "tof_1_2_2",
                "target": "spine_2_1_2",
                "value": 2,
                "label": "AAAT"
            },
            {
                "source": "leaf_1_0_1",
                "target": "spine_1_1_1",
                "value": 0,
                "label": "AAAA"
            },
            {
                "source": "leaf_1_0_1",
                "target": "spine_1_1_2",
                "value": 0,
                "label": "AAAB"
            },
            {
                "source": "leaf_1_0_2",
                "target": "spine_1_1_1",
                "value": 2,
                "label": "AAAD"
            },
            {
                "source": "leaf_1_0_2",
                "target": "spine_1_1_2",
                "value": 2,
                "label": "AAAE"
            },
            {
                "source": "spine_1_1_1",
                "target": "leaf_1_0_1",
                "value": 0,
                "label": "AAAA"
            },
            {
                "source": "spine_1_1_1",
                "target": "leaf_1_0_2",
                "value": 2,
                "label": "AAAD"
            },
            {
                "source": "spine_1_1_1",
                "target": "tof_1_2_1",
                "value": 2,
                "label": "AAAG"
            },
            {
                "source": "spine_1_1_1",
                "target": "tof_1_2_2",
                "value": 2,
                "label": "AAAH"
            },
            {
                "source": "spine_1_1_2",
                "target": "leaf_1_0_1",
                "value": 0,
                "label": "AAAB"
            },
            {
                "source": "spine_1_1_2",
                "target": "leaf_1_0_2",
                "value": 2,
                "label": "AAAE"
            },
            {
                "source": "spine_1_1_2",
                "target": "tof_1_2_1",
                "value": 2,
                "label": "AAAI"
            },
            {
                "source": "spine_1_1_2",
                "target": "tof_1_2_2",
                "value": 2,
                "label": "AAAJ"
            },
            {
                "source": "leaf_2_0_1",
                "target": "spine_2_1_1",
                "value": 2,
                "label": "AAAK"
            },
            {
                "source": "leaf_2_0_1",
                "target": "spine_2_1_2",
                "value": 2,
                "label": "AAAL"
            },
            {
                "source": "leaf_2_0_2",
                "target": "spine_2_1_1",
                "value": 2,
                "label": "AAAN"
            },
            {
                "source": "leaf_2_0_2",
                "target": "spine_2_1_2",
                "value": 2,
                "label": "AAAO"
            },
            {
                "source": "spine_2_1_1",
                "target": "leaf_2_0_1",
                "value": 2,
                "label": "AAAK"
            },
            {
                "source": "spine_2_1_1",
                "target": "leaf_2_0_2",
                "value": 2,
                "label": "AAAN"
            },
            {
                "source": "spine_2_1_1",
                "target": "tof_1_2_1",
                "value": 2,
                "label": "AAAQ"
            },
            {
                "source": "spine_2_1_1",
                "target": "tof_1_2_2",
                "value": 2,
                "label": "AAAR"
            },
            {
                "source": "spine_2_1_2",
                "target": "leaf_2_0_1",
                "value": 2,
                "label": "AAAL"
            },
            {
                "source": "spine_2_1_2",
                "target": "leaf_2_0_2",
                "value": 2,
                "label": "AAAO"
            },
            {
                "source": "spine_2_1_2",
                "target": "tof_1_2_1",
                "value": 2,
                "label": "AAAS"
            },
            {
                "source": "spine_2_1_2",
                "target": "tof_1_2_2",
                "value": 2,
                "label": "AAAT"
            }
        ]
    },
    "max_number_of_rounds": 4,
    "packets_per_round": {
        "0": 0,
        "1": 6,
        "2": 10,
        "3": 8,
        "4": 4
    },
    "round_graph": {
        "nodes": [
            {
                "id": "leaf_1_0_1",
                "label": "leaf_1_0_1"
            },
            {
                "id": "spine_1_1_1-2",
                "label": "spine_1_1_1-2"
            },
            {
                "id": "tof_1_2_1-1",
                "label": "tof_1_2_1-1"
            },
            {
                "id": "leaf_2_0_1-3",
                "label": "leaf_2_0_1-3"
            },
            {
                "id": "spine_2_1_1-2",
                "label": "spine_2_1_1-2"
            },
            {
                "id": "spine_1_1_2-2",
                "label": "spine_1_1_2-2"
            },
            {
                "id": "spine_2_1_2-4",
                "label": "spine_2_1_2-4"
            },
            {
                "id": "spine_2_1_1-4",
                "label": "spine_2_1_1-4"
            },
            {
                "id": "spine_1_1_1-0",
                "label": "spine_1_1_1-0"
            },
            {
                "id": "spine_2_1_2-2",
                "label": "spine_2_1_2-2"
            },
            {
                "id": "tof_1_2_2-1",
                "label": "tof_1_2_2-1"
            },
            {
                "id": "spine_1_1_2-0",
                "label": "spine_1_1_2-0"
            },
            {
                "id": "leaf_1_0_2-1",
                "label": "leaf_1_0_2-1"
            },
            {
                "id": "tof_1_2_2-3",
                "label": "tof_1_2_2-3"
            },
            {
                "id": "leaf_2_0_2-3",
                "label": "leaf_2_0_2-3"
            },
            {
                "id": "tof_1_2_1-3",
                "label": "tof_1_2_1-3"
            }
        ],
        "links": [
            {
                "source": "leaf_1_0_1",
                "target": "spine_1_1_2-0",
                "value": 0
            },
            {
                "source": "leaf_1_0_1",
                "target": "spine_1_1_1-0",
                "value": 0
            },
            {
                "source": "spine_1_1_2-0",
                "target": "leaf_1_0_2-1",
                "value": 1,
                "label": [
                    {
                        "time": 1622464899.214223,
                        "type": "Update (WD)",
                        "WD Routes": "200.0.0.0/24"
                    }
                ]
            },
            {
                "source": "spine_1_1_2-0",
                "target": "tof_1_2_1-1",
                "value": 1,
                "label": [
                    {
                        "time": 1622464899.214328,
                        "type": "Update (WD)",
                        "WD Routes": "200.0.0.0/24"
                    }
                ]
            },
            {
                "source": "spine_1_1_2-0",
                "target": "tof_1_2_2-1",
                "value": 1,
                "label": [
                    {
                        "time": 1622464899.214377,
                        "type": "Update (WD)",
                        "WD Routes": "200.0.0.0/24"
                    }
                ]
            },
            {
                "source": "spine_1_1_1-0",
                "target": "leaf_1_0_2-1",
                "value": 1,
                "label": [
                    {
                        "time": 1622464899.214038,
                        "type": "Update (WD)",
                        "WD Routes": "200.0.0.0/24"
                    }
                ]
            },
            {
                "source": "spine_1_1_1-0",
                "target": "tof_1_2_1-1",
                "value": 1,
                "label": [
                    {
                        "time": 1622464899.214255,
                        "type": "Update (WD)",
                        "WD Routes": "200.0.0.0/24"
                    }
                ]
            },
            {
                "source": "spine_1_1_1-0",
                "target": "tof_1_2_2-1",
                "value": 1,
                "label": [
                    {
                        "time": 1622464899.214315,
                        "type": "Update (WD)",
                        "WD Routes": "200.0.0.0/24"
                    }
                ]
            },
            {
                "source": "leaf_1_0_2-1",
                "target": "spine_1_1_1-2",
                "value": 1,
                "label": [
                    {
                        "time": 1622464899.265007,
                        "type": "Update (WD)",
                        "WD Routes": "200.0.0.0/24"
                    }
                ]
            },
            {
                "source": "leaf_1_0_2-1",
                "target": "spine_1_1_2-2",
                "value": 1,
                "label": [
                    {
                        "time": 1622464899.265055,
                        "type": "Update (WD)",
                        "WD Routes": "200.0.0.0/24"
                    }
                ]
            },
            {
                "source": "tof_1_2_1-1",
                "target": "spine_1_1_1-2",
                "value": 1,
                "label": [
                    {
                        "time": 1622464899.265275,
                        "type": "Update (WD)",
                        "WD Routes": "200.0.0.0/24"
                    }
                ]
            },
            {
                "source": "tof_1_2_1-1",
                "target": "spine_1_1_2-2",
                "value": 1,
                "label": [
                    {
                        "time": 1622464899.265438,
                        "type": "Update (WD)",
                        "WD Routes": "200.0.0.0/24"
                    }
                ]
            },
            {
                "source": "tof_1_2_1-1",
                "target": "spine_2_1_1-2",
                "value": 1,
                "label": [
                    {
                        "time": 1622464899.2655,
                        "type": "Update (WD)",
                        "WD Routes": "200.0.0.0/24"
                    }
                ]
            },
            {
                "source": "tof_1_2_1-1",
                "target": "spine_2_1_2-2",
                "value": 1,
                "label": [
                    {
                        "time": 1622464899.265545,
                        "type": "Update (WD)",
                        "WD Routes": "200.0.0.0/24"
                    }
                ]
            },
            {
                "source": "tof_1_2_2-1",
                "target": "spine_1_1_1-2",
                "value": 1,
                "label": [
                    {
                        "time": 1622464899.265075,
                        "type": "Update (WD)",
                        "WD Routes": "200.0.0.0/24"
                    }
                ]
            },
            {
                "source": "tof_1_2_2-1",
                "target": "spine_1_1_2-2",
                "value": 1,
                "label": [
                    {
                        "time": 1622464899.26517,
                        "type": "Update (WD)",
                        "WD Routes": "200.0.0.0/24"
                    }
                ]
            },
            {
                "source": "tof_1_2_2-1",
                "target": "spine_2_1_1-2",
                "value": 1,
                "label": [
                    {
                        "time": 1622464899.265206,
                        "type": "Update (WD)",
                        "WD Routes": "200.0.0.0/24"
                    }
                ]
            },
            {
                "source": "tof_1_2_2-1",
                "target": "spine_2_1_2-2",
                "value": 1,
                "label": [
                    {
                        "time": 1622464899.26525,
                        "type": "Update (WD)",
                        "WD Routes": "200.0.0.0/24"
                    }
                ]
            },
            {
                "source": "spine_2_1_1-2",
                "target": "leaf_2_0_1-3",
                "value": 1,
                "label": [
                    {
                        "time": 1622464899.316223,
                        "type": "Update (WD)",
                        "WD Routes": "200.0.0.0/24"
                    }
                ]
            },
            {
                "source": "spine_2_1_1-2",
                "target": "leaf_2_0_2-3",
                "value": 1,
                "label": [
                    {
                        "time": 1622464899.316384,
                        "type": "Update (WD)",
                        "WD Routes": "200.0.0.0/24"
                    }
                ]
            },
            {
                "source": "spine_2_1_1-2",
                "target": "tof_1_2_1-3",
                "value": 1,
                "label": [
                    {
                        "time": 1622464899.316514,
                        "type": "Update (WD)",
                        "WD Routes": "200.0.0.0/24"
                    }
                ]
            },
            {
                "source": "spine_2_1_1-2",
                "target": "tof_1_2_2-3",
                "value": 1,
                "label": [
                    {
                        "time": 1622464899.316642,
                        "type": "Update (WD)",
                        "WD Routes": "200.0.0.0/24"
                    }
                ]
            },
            {
                "source": "spine_2_1_2-2",
                "target": "leaf_2_0_1-3",
                "value": 1,
                "label": [
                    {
                        "time": 1622464899.316806,
                        "type": "Update (WD)",
                        "WD Routes": "200.0.0.0/24"
                    }
                ]
            },
            {
                "source": "spine_2_1_2-2",
                "target": "leaf_2_0_2-3",
                "value": 1,
                "label": [
                    {
                        "time": 1622464899.316946,
                        "type": "Update (WD)",
                        "WD Routes": "200.0.0.0/24"
                    }
                ]
            },
            {
                "source": "spine_2_1_2-2",
                "target": "tof_1_2_1-3",
                "value": 1,
                "label": [
                    {
                        "time": 1622464899.317053,
                        "type": "Update (WD)",
                        "WD Routes": "200.0.0.0/24"
                    }
                ]
            },
            {
                "source": "spine_2_1_2-2",
                "target": "tof_1_2_2-3",
                "value": 1,
                "label": [
                    {
                        "time": 1622464899.317173,
                        "type": "Update (WD)",
                        "WD Routes": "200.0.0.0/24"
                    }
                ]
            },
            {
                "source": "leaf_2_0_1-3",
                "target": "spine_2_1_1-4",
                "value": 1,
                "label": [
                    {
                        "time": 1622464899.366815,
                        "type": "Update (WD)",
                        "WD Routes": "200.0.0.0/24"
                    }
                ]
            },
            {
                "source": "leaf_2_0_1-3",
                "target": "spine_2_1_2-4",
                "value": 1,
                "label": [
                    {
                        "time": 1622464899.366868,
                        "type": "Update (WD)",
                        "WD Routes": "200.0.0.0/24"
                    }
                ]
            },
            {
                "source": "leaf_2_0_2-3",
                "target": "spine_2_1_1-4",
                "value": 1,
                "label": [
                    {
                        "time": 1622464899.367357,
                        "type": "Update (WD)",
                        "WD Routes": "200.0.0.0/24"
                    }
                ]
            },
            {
                "source": "leaf_2_0_2-3",
                "target": "spine_2_1_2-4",
                "value": 1,
                "label": [
                    {
                        "time": 1622464899.367485,
                        "type": "Update (WD)",
                        "WD Routes": "200.0.0.0/24"
                    }
                ]
            }
        ]
    },
    "logical_time_plot": {
        "points": {
            "spine_1_1_2": {
                "1": {
                    "time": 1622464899.214223,
                    "type": "Update (WD)",
                    "WD Routes": "200.0.0.0/24",
                    "Logical Clock": 1
                },
                "2": {
                    "time": 1622464899.214328,
                    "type": "Update (WD)",
                    "WD Routes": "200.0.0.0/24",
                    "Logical Clock": 2
                },
                "3": {
                    "time": 1622464899.214377,
                    "type": "Update (WD)",
                    "WD Routes": "200.0.0.0/24",
                    "Logical Clock": 3
                },
                "6": {
                    "time": 1622464899.265178,
                    "type": "Update (WD)",
                    "WD Routes": "200.0.0.0/24",
                    "Logical Clock": 6
                },
                "7": {
                    "time": 1622464899.265526,
                    "type": "Update (WD)",
                    "WD Routes": "200.0.0.0/24",
                    "Logical Clock": 7
                },
                "8": {
                    "time": 1622464899.265309,
                    "type": "Update (WD)",
                    "WD Routes": "200.0.0.0/24",
                    "Logical Clock": 8
                }
            },
            "leaf_1_0_2": {
                "2": {
                    "time": 1622464899.214555,
                    "type": "Update (WD)",
                    "WD Routes": "200.0.0.0/24",
                    "Logical Clock": 2
                },
                "3": {
                    "time": 1622464899.214541,
                    "type": "Update (WD)",
                    "WD Routes": "200.0.0.0/24",
                    "Logical Clock": 3
                },
                "4": {
                    "time": 1622464899.265007,
                    "type": "Update (WD)",
                    "WD Routes": "200.0.0.0/24",
                    "Logical Clock": 4
                },
                "5": {
                    "time": 1622464899.265055,
                    "type": "Update (WD)",
                    "WD Routes": "200.0.0.0/24",
                    "Logical Clock": 5
                }
            },
            "tof_1_2_1": {
                "3": {
                    "time": 1622464899.214694,
                    "type": "Update (WD)",
                    "WD Routes": "200.0.0.0/24",
                    "Logical Clock": 3
                },
                "4": {
                    "time": 1622464899.214612,
                    "type": "Update (WD)",
                    "WD Routes": "200.0.0.0/24",
                    "Logical Clock": 4
                },
                "5": {
                    "time": 1622464899.265275,
                    "type": "Update (WD)",
                    "WD Routes": "200.0.0.0/24",
                    "Logical Clock": 5
                },
                "6": {
                    "time": 1622464899.265438,
                    "type": "Update (WD)",
                    "WD Routes": "200.0.0.0/24",
                    "Logical Clock": 6
                },
                "7": {
                    "time": 1622464899.2655,
                    "type": "Update (WD)",
                    "WD Routes": "200.0.0.0/24",
                    "Logical Clock": 7
                },
                "8": {
                    "time": 1622464899.265545,
                    "type": "Update (WD)",
                    "WD Routes": "200.0.0.0/24",
                    "Logical Clock": 8
                },
                "13": {
                    "time": 1622464899.316819,
                    "type": "Update (WD)",
                    "WD Routes": "200.0.0.0/24",
                    "Logical Clock": 13
                },
                "14": {
                    "time": 1622464899.316891,
                    "type": "Update (WD)",
                    "WD Routes": "200.0.0.0/24",
                    "Logical Clock": 14
                }
            },
            "tof_1_2_2": {
                "4": {
                    "time": 1622464899.214614,
                    "type": "Update (WD)",
                    "WD Routes": "200.0.0.0/24",
                    "Logical Clock": 4
                },
                "5": {
                    "time": 1622464899.214572,
                    "type": "Update (WD)",
                    "WD Routes": "200.0.0.0/24",
                    "Logical Clock": 5
                },
                "6": {
                    "time": 1622464899.265075,
                    "type": "Update (WD)",
                    "WD Routes": "200.0.0.0/24",
                    "Logical Clock": 6
                },
                "7": {
                    "time": 1622464899.26517,
                    "type": "Update (WD)",
                    "WD Routes": "200.0.0.0/24",
                    "Logical Clock": 7
                },
                "8": {
                    "time": 1622464899.265206,
                    "type": "Update (WD)",
                    "WD Routes": "200.0.0.0/24",
                    "Logical Clock": 8
                },
                "9": {
                    "time": 1622464899.26525,
                    "type": "Update (WD)",
                    "WD Routes": "200.0.0.0/24",
                    "Logical Clock": 9
                },
                "14": {
                    "time": 1622464899.316761,
                    "type": "Update (WD)",
                    "WD Routes": "200.0.0.0/24",
                    "Logical Clock": 14
                },
                "15": {
                    "time": 1622464899.316953,
                    "type": "Update (WD)",
                    "WD Routes": "200.0.0.0/24",
                    "Logical Clock": 15
                }
            },
            "spine_1_1_1": {
                "1": {
                    "time": 1622464899.214038,
                    "type": "Update (WD)",
                    "WD Routes": "200.0.0.0/24",
                    "Logical Clock": 1
                },
                "2": {
                    "time": 1622464899.214255,
                    "type": "Update (WD)",
                    "WD Routes": "200.0.0.0/24",
                    "Logical Clock": 2
                },
                "3": {
                    "time": 1622464899.214315,
                    "type": "Update (WD)",
                    "WD Routes": "200.0.0.0/24",
                    "Logical Clock": 3
                },
                "5": {
                    "time": 1622464899.265227,
                    "type": "Update (WD)",
                    "WD Routes": "200.0.0.0/24",
                    "Logical Clock": 5
                },
                "6": {
                    "time": 1622464899.265318,
                    "type": "Update (WD)",
                    "WD Routes": "200.0.0.0/24",
                    "Logical Clock": 6
                },
                "7": {
                    "time": 1622464899.265401,
                    "type": "Update (WD)",
                    "WD Routes": "200.0.0.0/24",
                    "Logical Clock": 7
                }
            },
            "spine_2_1_1": {
                "8": {
                    "time": 1622464899.26575,
                    "type": "Update (WD)",
                    "WD Routes": "200.0.0.0/24",
                    "Logical Clock": 8
                },
                "9": {
                    "time": 1622464899.265555,
                    "type": "Update (WD)",
                    "WD Routes": "200.0.0.0/24",
                    "Logical Clock": 9
                },
                "10": {
                    "time": 1622464899.316223,
                    "type": "Update (WD)",
                    "WD Routes": "200.0.0.0/24",
                    "Logical Clock": 10
                },
                "11": {
                    "time": 1622464899.316384,
                    "type": "Update (WD)",
                    "WD Routes": "200.0.0.0/24",
                    "Logical Clock": 11
                },
                "12": {
                    "time": 1622464899.316514,
                    "type": "Update (WD)",
                    "WD Routes": "200.0.0.0/24",
                    "Logical Clock": 12
                },
                "13": {
                    "time": 1622464899.316642,
                    "type": "Update (WD)",
                    "WD Routes": "200.0.0.0/24",
                    "Logical Clock": 13
                },
                "14": {
                    "time": 1622464899.367044,
                    "type": "Update (WD)",
                    "WD Routes": "200.0.0.0/24",
                    "Logical Clock": 14
                },
                "15": {
                    "time": 1622464899.367636,
                    "type": "Update (WD)",
                    "WD Routes": "200.0.0.0/24",
                    "Logical Clock": 15
                }
            },
            "spine_2_1_2": {
                "9": {
                    "time": 1622464899.26616,
                    "type": "Update (WD)",
                    "WD Routes": "200.0.0.0/24",
                    "Logical Clock": 9
                },
                "10": {
                    "time": 1622464899.266133,
                    "type": "Update (WD)",
                    "WD Routes": "200.0.0.0/24",
                    "Logical Clock": 10
                },
                "11": {
                    "time": 1622464899.316806,
                    "type": "Update (WD)",
                    "WD Routes": "200.0.0.0/24",
                    "Logical Clock": 11
                },
                "12": {
                    "time": 1622464899.316946,
                    "type": "Update (WD)",
                    "WD Routes": "200.0.0.0/24",
                    "Logical Clock": 12
                },
                "13": {
                    "time": 1622464899.317053,
                    "type": "Update (WD)",
                    "WD Routes": "200.0.0.0/24",
                    "Logical Clock": 13
                },
                "14": {
                    "time": 1622464899.317173,
                    "type": "Update (WD)",
                    "WD Routes": "200.0.0.0/24",
                    "Logical Clock": 14
                },
                "15": {
                    "time": 1622464899.367596,
                    "type": "Update (WD)",
                    "WD Routes": "200.0.0.0/24",
                    "Logical Clock": 15
                },
                "16": {
                    "time": 1622464899.36813,
                    "type": "Update (WD)",
                    "WD Routes": "200.0.0.0/24",
                    "Logical Clock": 16
                }
            },
            "leaf_2_0_1": {
                "11": {
                    "time": 1622464899.316435,
                    "type": "Update (WD)",
                    "WD Routes": "200.0.0.0/24",
                    "Logical Clock": 11
                },
                "12": {
                    "time": 1622464899.316581,
                    "type": "Update (WD)",
                    "WD Routes": "200.0.0.0/24",
                    "Logical Clock": 12
                },
                "13": {
                    "time": 1622464899.366815,
                    "type": "Update (WD)",
                    "WD Routes": "200.0.0.0/24",
                    "Logical Clock": 13
                },
                "14": {
                    "time": 1622464899.366868,
                    "type": "Update (WD)",
                    "WD Routes": "200.0.0.0/24",
                    "Logical Clock": 14
                }
            },
            "leaf_2_0_2": {
                "12": {
                    "time": 1622464899.316692,
                    "type": "Update (WD)",
                    "WD Routes": "200.0.0.0/24",
                    "Logical Clock": 12
                },
                "13": {
                    "time": 1622464899.316832,
                    "type": "Update (WD)",
                    "WD Routes": "200.0.0.0/24",
                    "Logical Clock": 13
                },
                "14": {
                    "time": 1622464899.367357,
                    "type": "Update (WD)",
                    "WD Routes": "200.0.0.0/24",
                    "Logical Clock": 14
                },
                "15": {
                    "time": 1622464899.367485,
                    "type": "Update (WD)",
                    "WD Routes": "200.0.0.0/24",
                    "Logical Clock": 15
                }
            }
        },
        "edges": [
            [
                [
                    "spine_1_1_2",
                    1
                ],
                [
                    "leaf_1_0_2",
                    2
                ]
            ],
            [
                [
                    "spine_1_1_2",
                    2
                ],
                [
                    "tof_1_2_1",
                    3
                ]
            ],
            [
                [
                    "spine_1_1_2",
                    3
                ],
                [
                    "tof_1_2_2",
                    4
                ]
            ],
            [
                [
                    "spine_1_1_1",
                    1
                ],
                [
                    "leaf_1_0_2",
                    3
                ]
            ],
            [
                [
                    "spine_1_1_1",
                    2
                ],
                [
                    "tof_1_2_1",
                    4
                ]
            ],
            [
                [
                    "spine_1_1_1",
                    3
                ],
                [
                    "tof_1_2_2",
                    5
                ]
            ],
            [
                [
                    "leaf_1_0_2",
                    4
                ],
                [
                    "spine_1_1_1",
                    5
                ]
            ],
            [
                [
                    "leaf_1_0_2",
                    5
                ],
                [
                    "spine_1_1_2",
                    6
                ]
            ],
            [
                [
                    "tof_1_2_1",
                    5
                ],
                [
                    "spine_1_1_1",
                    6
                ]
            ],
            [
                [
                    "tof_1_2_1",
                    6
                ],
                [
                    "spine_1_1_2",
                    7
                ]
            ],
            [
                [
                    "tof_1_2_1",
                    7
                ],
                [
                    "spine_2_1_1",
                    8
                ]
            ],
            [
                [
                    "tof_1_2_1",
                    8
                ],
                [
                    "spine_2_1_2",
                    9
                ]
            ],
            [
                [
                    "tof_1_2_2",
                    6
                ],
                [
                    "spine_1_1_1",
                    7
                ]
            ],
            [
                [
                    "tof_1_2_2",
                    7
                ],
                [
                    "spine_1_1_2",
                    8
                ]
            ],
            [
                [
                    "tof_1_2_2",
                    8
                ],
                [
                    "spine_2_1_1",
                    9
                ]
            ],
            [
                [
                    "tof_1_2_2",
                    9
                ],
                [
                    "spine_2_1_2",
                    10
                ]
            ],
            [
                [
                    "spine_2_1_1",
                    10
                ],
                [
                    "leaf_2_0_1",
                    11
                ]
            ],
            [
                [
                    "spine_2_1_1",
                    11
                ],
                [
                    "leaf_2_0_2",
                    12
                ]
            ],
            [
                [
                    "spine_2_1_1",
                    12
                ],
                [
                    "tof_1_2_1",
                    13
                ]
            ],
            [
                [
                    "spine_2_1_1",
                    13
                ],
                [
                    "tof_1_2_2",
                    14
                ]
            ],
            [
                [
                    "spine_2_1_2",
                    11
                ],
                [
                    "leaf_2_0_1",
                    12
                ]
            ],
            [
                [
                    "spine_2_1_2",
                    12
                ],
                [
                    "leaf_2_0_2",
                    13
                ]
            ],
            [
                [
                    "spine_2_1_2",
                    13
                ],
                [
                    "tof_1_2_1",
                    14
                ]
            ],
            [
                [
                    "spine_2_1_2",
                    14
                ],
                [
                    "tof_1_2_2",
                    15
                ]
            ],
            [
                [
                    "leaf_2_0_1",
                    13
                ],
                [
                    "spine_2_1_1",
                    14
                ]
            ],
            [
                [
                    "leaf_2_0_1",
                    14
                ],
                [
                    "spine_2_1_2",
                    15
                ]
            ],
            [
                [
                    "leaf_2_0_2",
                    14
                ],
                [
                    "spine_2_1_1",
                    15
                ]
            ],
            [
                [
                    "leaf_2_0_2",
                    15
                ],
                [
                    "spine_2_1_2",
                    16
                ]
            ]
        ]
    },
    "max_scalar_clock": 16
}