{
    "k_leaf": 2,
    "k_top": 2,
    "redundancy_factor": 2,
    "is_k8s": true,
    "failed_machine": "spine_1_1_1",
    "failed_interfaces": [
        "net2"
    ],
    "failure_time": {
        "leaf_1_0_1": 1636583098.4474878,
        "leaf_1_0_2": 1636583097.9934883,
        "leaf_2_0_1": 1636583097.9759095,
        "leaf_2_0_2": 1636583098.4576793,
        "spine_1_1_1": 1636583098.0074935,
        "spine_1_1_2": 1636583098.4849997,
        "spine_2_1_1": 1636583098.0087862,
        "spine_2_1_2": 1636583098.0214386,
        "tof_1_2_1": 1636583098.0304234,
        "tof_1_2_2": 1636583098.0409071
    },
    "packet_count": {
        "total": [
            278,
            44898
        ],
        "leaf_1_0_2": {
            "total": [
                17,
                2713
            ],
            "net0": {
                "total": [
                    8,
                    1338
                ],
                "csnp": [
                    6,
                    1170
                ],
                "psnp": [
                    1,
                    35
                ],
                "lsp": [
                    1,
                    133
                ]
            },
            "net1": {
                "total": [
                    9,
                    1375
                ],
                "csnp": [
                    6,
                    1170
                ],
                "lsp": [
                    1,
                    135
                ],
                "psnp": [
                    2,
                    70
                ]
            }
        },
        "leaf_2_0_1": {
            "total": [
                19,
                2683
            ],
            "net0": {
                "total": [
                    9,
                    1275
                ],
                "csnp": [
                    6,
                    1170
                ],
                "psnp": [
                    3,
                    105
                ]
            },
            "net1": {
                "total": [
                    10,
                    1408
                ],
                "csnp": [
                    6,
                    1170
                ],
                "psnp": [
                    3,
                    105
                ],
                "lsp": [
                    1,
                    133
                ]
            }
        },
        "spine_1_1_2": {
            "total": [
                36,
                5694
            ],
            "net0": {
                "total": [
                    10,
                    1508
                ],
                "psnp": [
                    2,
                    70
                ],
                "lsp": [
                    2,
                    268
                ],
                "csnp": [
                    6,
                    1170
                ]
            },
            "net1": {
                "total": [
                    9,
                    1373
                ],
                "psnp": [
                    2,
                    70
                ],
                "csnp": [
                    6,
                    1170
                ],
                "lsp": [
                    1,
                    133
                ]
            },
            "net2": {
                "total": [
                    8,
                    1340
                ],
                "lsp": [
                    1,
                    135
                ],
                "csnp": [
                    6,
                    1170
                ],
                "psnp": [
                    1,
                    35
                ]
            },
            "net3": {
                "total": [
                    9,
                    1473
                ],
                "lsp": [
                    2,
                    268
                ],
                "psnp": [
                    1,
                    35
                ],
                "csnp": [
                    6,
                    1170
                ]
            }
        },
        "leaf_2_0_2": {
            "total": [
                18,
                2550
            ],
            "net0": {
                "total": [
                    9,
                    1275
                ],
                "csnp": [
                    6,
                    1170
                ],
                "psnp": [
                    3,
                    105
                ]
            },
            "net1": {
                "total": [
                    9,
                    1275
                ],
                "csnp": [
                    6,
                    1170
                ],
                "psnp": [
                    3,
                    105
                ]
            }
        },
        "leaf_1_0_1": {
            "total": [
                20,
                3138
            ],
            "net0": {
                "total": [
                    9,
                    1533
                ],
                "psnp": [
                    1,
                    35
                ],
                "csnp": [
                    7,
                    1365
                ],
                "lsp": [
                    1,
                    133
                ]
            },
            "net1": {
                "total": [
                    11,
                    1605
                ],
                "csnp": [
                    7,
                    1365
                ],
                "lsp": [
                    1,
                    135
                ],
                "psnp": [
                    3,
                    105
                ]
            }
        },
        "tof_1_2_2": {
            "total": [
                39,
                6339
            ],
            "net0": {
                "total": [
                    9,
                    1533
                ],
                "psnp": [
                    1,
                    35
                ],
                "csnp": [
                    7,
                    1365
                ],
                "lsp": [
                    1,
                    133
                ]
            },
            "net1": {
                "total": [
                    10,
                    1470
                ],
                "csnp": [
                    7,
                    1365
                ],
                "psnp": [
                    3,
                    105
                ]
            },
            "net2": {
                "total": [
                    10,
                    1668
                ],
                "csnp": [
                    7,
                    1365
                ],
                "lsp": [
                    2,
                    268
                ],
                "psnp": [
                    1,
                    35
                ]
            },
            "net3": {
                "total": [
                    10,
                    1668
                ],
                "csnp": [
                    7,
                    1365
                ],
                "lsp": [
                    2,
                    268
                ],
                "psnp": [
                    1,
                    35
                ]
            }
        },
        "tof_1_2_1": {
            "total": [
                30,
                5184
            ],
            "net0": {
                "total": [
                    6,
                    1170
                ],
                "csnp": [
                    6,
                    1170
                ]
            },
            "net1": {
                "total": [
                    8,
                    1338
                ],
                "psnp": [
                    1,
                    35
                ],
                "csnp": [
                    6,
                    1170
                ],
                "lsp": [
                    1,
                    133
                ]
            },
            "net2": {
                "total": [
                    8,
                    1338
                ],
                "psnp": [
                    1,
                    35
                ],
                "csnp": [
                    6,
                    1170
                ],
                "lsp": [
                    1,
                    133
                ]
            },
            "net3": {
                "total": [
                    8,
                    1338
                ],
                "psnp": [
                    1,
                    35
                ],
                "csnp": [
                    6,
                    1170
                ],
                "lsp": [
                    1,
                    133
                ]
            }
        },
        "spine_2_1_1": {
            "total": [
                37,
                6271
            ],
            "net0": {
                "total": [
                    9,
                    1633
                ],
                "lsp": [
                    2,
                    268
                ],
                "csnp": [
                    7,
                    1365
                ]
            },
            "net1": {
                "total": [
                    9,
                    1633
                ],
                "lsp": [
                    2,
                    268
                ],
                "csnp": [
                    7,
                    1365
                ]
            },
            "net2": {
                "total": [
                    9,
                    1535
                ],
                "lsp": [
                    1,
                    135
                ],
                "csnp": [
                    7,
                    1365
                ],
                "psnp": [
                    1,
                    35
                ]
            },
            "net3": {
                "total": [
                    10,
                    1470
                ],
                "psnp": [
                    3,
                    105
                ],
                "csnp": [
                    7,
                    1365
                ]
            }
        },
        "spine_1_1_1": {
            "total": [
                24,
                4020
            ],
            "net0": {
                "total": [
                    8,
                    1340
                ],
                "lsp": [
                    1,
                    135
                ],
                "csnp": [
                    6,
                    1170
                ],
                "psnp": [
                    1,
                    35
                ]
            },
            "net1": {
                "total": [
                    8,
                    1340
                ],
                "lsp": [
                    1,
                    135
                ],
                "csnp": [
                    6,
                    1170
                ],
                "psnp": [
                    1,
                    35
                ]
            },
            "net3": {
                "total": [
                    8,
                    1340
                ],
                "lsp": [
                    1,
                    135
                ],
                "csnp": [
                    6,
                    1170
                ],
                "psnp": [
                    1,
                    35
                ]
            }
        },
        "spine_2_1_2": {
            "total": [
                38,
                6306
            ],
            "net0": {
                "total": [
                    10,
                    1668
                ],
                "lsp": [
                    2,
                    268
                ],
                "csnp": [
                    7,
                    1365
                ],
                "psnp": [
                    1,
                    35
                ]
            },
            "net1": {
                "total": [
                    9,
                    1633
                ],
                "lsp": [
                    2,
                    268
                ],
                "csnp": [
                    7,
                    1365
                ]
            },
            "net2": {
                "total": [
                    9,
                    1535
                ],
                "lsp": [
                    1,
                    135
                ],
                "csnp": [
                    7,
                    1365
                ],
                "psnp": [
                    1,
                    35
                ]
            },
            "net3": {
                "total": [
                    10,
                    1470
                ],
                "psnp": [
                    3,
                    105
                ],
                "csnp": [
                    7,
                    1365
                ]
            }
        }
    },
    "packets_by_collision_domain": {
        "AAAG": 0,
        "AAAI": 2,
        "AAAQ": 2,
        "AAAS": 2,
        "AAAH": 2,
        "AAAJ": 2,
        "AAAR": 2,
        "AAAT": 2,
        "AAAA": 2,
        "AAAB": 3,
        "AAAD": 2,
        "AAAE": 2,
        "AAAK": 2,
        "AAAL": 3,
        "AAAN": 2,
        "AAAO": 2
    },
    "blast_radius": {
        "by_collision_domain": {
            "AAAA": [
                0,
                2
            ],
            "AAAD": [
                0,
                2
            ],
            "AAAG": [
                0,
                0
            ],
            "AAAH": [
                0,
                2
            ],
            "AAAE": [
                1,
                2
            ],
            "AAAI": [
                1,
                2
            ],
            "AAAQ": [
                1,
                2
            ],
            "AAAS": [
                1,
                2
            ],
            "AAAB": [
                1,
                3
            ],
            "AAAJ": [
                1,
                2
            ],
            "AAAR": [
                1,
                2
            ],
            "AAAT": [
                1,
                2
            ],
            "AAAL": [
                2,
                3
            ],
            "AAAO": [
                2,
                2
            ],
            "AAAK": [
                2,
                2
            ],
            "AAAN": [
                2,
                2
            ]
        },
        "by_distance": {
            "0": 6,
            "1": 17,
            "2": 9
        }
    },
    "radius_graph": {
        "nodes": [
            {
                "id": "spine_2_1_2",
                "label": "spine_2_1_2"
            },
            {
                "id": "leaf_1_0_2",
                "label": "leaf_1_0_2"
            },
            {
                "id": "tof_1_2_1",
                "label": "tof_1_2_1"
            },
            {
                "id": "leaf_2_0_1",
                "label": "leaf_2_0_1"
            },
            {
                "id": "leaf_1_0_1",
                "label": "leaf_1_0_1"
            },
            {
                "id": "spine_1_1_2",
                "label": "spine_1_1_2"
            },
            {
                "id": "spine_2_1_1",
                "label": "spine_2_1_1"
            },
            {
                "id": "tof_1_2_2",
                "label": "tof_1_2_2"
            },
            {
                "id": "leaf_2_0_2",
                "label": "leaf_2_0_2"
            },
            {
                "id": "spine_1_1_1",
                "label": "spine_1_1_1"
            }
        ],
        "links": [
            {
                "source": "tof_1_2_1",
                "target": "spine_1_1_1",
                "value": 0,
                "label": "AAAG"
            },
            {
                "source": "tof_1_2_1",
                "target": "spine_1_1_2",
                "value": 2,
                "label": "AAAI"
            },
            {
                "source": "tof_1_2_1",
                "target": "spine_2_1_1",
                "value": 2,
                "label": "AAAQ"
            },
            {
                "source": "tof_1_2_1",
                "target": "spine_2_1_2",
                "value": 2,
                "label": "AAAS"
            },
            {
                "source": "tof_1_2_2",
                "target": "spine_1_1_1",
                "value": 2,
                "label": "AAAH"
            },
            {
                "source": "tof_1_2_2",
                "target": "spine_1_1_2",
                "value": 2,
                "label": "AAAJ"
            },
            {
                "source": "tof_1_2_2",
                "target": "spine_2_1_1",
                "value": 2,
                "label": "AAAR"
            },
            {
                "source": "tof_1_2_2",
                "target": "spine_2_1_2",
                "value": 2,
                "label": "AAAT"
            },
            {
                "source": "leaf_1_0_1",
                "target": "spine_1_1_1",
                "value": 2,
                "label": "AAAA"
            },
            {
                "source": "leaf_1_0_1",
                "target": "spine_1_1_2",
                "value": 3,
                "label": "AAAB"
            },
            {
                "source": "leaf_1_0_2",
                "target": "spine_1_1_1",
                "value": 2,
                "label": "AAAD"
            },
            {
                "source": "leaf_1_0_2",
                "target": "spine_1_1_2",
                "value": 2,
                "label": "AAAE"
            },
            {
                "source": "spine_1_1_1",
                "target": "leaf_1_0_1",
                "value": 2,
                "label": "AAAA"
            },
            {
                "source": "spine_1_1_1",
                "target": "leaf_1_0_2",
                "value": 2,
                "label": "AAAD"
            },
            {
                "source": "spine_1_1_1",
                "target": "tof_1_2_1",
                "value": 0,
                "label": "AAAG"
            },
            {
                "source": "spine_1_1_1",
                "target": "tof_1_2_2",
                "value": 2,
                "label": "AAAH"
            },
            {
                "source": "spine_1_1_2",
                "target": "leaf_1_0_1",
                "value": 3,
                "label": "AAAB"
            },
            {
                "source": "spine_1_1_2",
                "target": "leaf_1_0_2",
                "value": 2,
                "label": "AAAE"
            },
            {
                "source": "spine_1_1_2",
                "target": "tof_1_2_1",
                "value": 2,
                "label": "AAAI"
            },
            {
                "source": "spine_1_1_2",
                "target": "tof_1_2_2",
                "value": 2,
                "label": "AAAJ"
            },
            {
                "source": "leaf_2_0_1",
                "target": "spine_2_1_1",
                "value": 2,
                "label": "AAAK"
            },
            {
                "source": "leaf_2_0_1",
                "target": "spine_2_1_2",
                "value": 3,
                "label": "AAAL"
            },
            {
                "source": "leaf_2_0_2",
                "target": "spine_2_1_1",
                "value": 2,
                "label": "AAAN"
            },
            {
                "source": "leaf_2_0_2",
                "target": "spine_2_1_2",
                "value": 2,
                "label": "AAAO"
            },
            {
                "source": "spine_2_1_1",
                "target": "leaf_2_0_1",
                "value": 2,
                "label": "AAAK"
            },
            {
                "source": "spine_2_1_1",
                "target": "leaf_2_0_2",
                "value": 2,
                "label": "AAAN"
            },
            {
                "source": "spine_2_1_1",
                "target": "tof_1_2_1",
                "value": 2,
                "label": "AAAQ"
            },
            {
                "source": "spine_2_1_1",
                "target": "tof_1_2_2",
                "value": 2,
                "label": "AAAR"
            },
            {
                "source": "spine_2_1_2",
                "target": "leaf_2_0_1",
                "value": 3,
                "label": "AAAL"
            },
            {
                "source": "spine_2_1_2",
                "target": "leaf_2_0_2",
                "value": 2,
                "label": "AAAO"
            },
            {
                "source": "spine_2_1_2",
                "target": "tof_1_2_1",
                "value": 2,
                "label": "AAAS"
            },
            {
                "source": "spine_2_1_2",
                "target": "tof_1_2_2",
                "value": 2,
                "label": "AAAT"
            }
        ]
    },
    "max_number_of_rounds": 11,
    "packets_per_round": {
        "0": 0,
        "1": 3,
        "2": 3,
        "3": 6,
        "4": 1,
        "5": 3,
        "6": 3,
        "7": 3,
        "8": 5,
        "9": 3,
        "10": 1,
        "11": 1
    },
    "round_graph": {
        "nodes": [
            {
                "id": "leaf_2_0_1-9",
                "label": "leaf_2_0_1-9"
            },
            {
                "id": "spine_1_1_1-0",
                "label": "spine_1_1_1-0"
            },
            {
                "id": "spine_2_1_1-6",
                "label": "spine_2_1_1-6"
            },
            {
                "id": "spine_2_1_1-8",
                "label": "spine_2_1_1-8"
            },
            {
                "id": "spine_1_1_2-6",
                "label": "spine_1_1_2-6"
            },
            {
                "id": "leaf_1_0_1-7",
                "label": "leaf_1_0_1-7"
            },
            {
                "id": "spine_1_1_1-8",
                "label": "spine_1_1_1-8"
            },
            {
                "id": "leaf_2_0_2-5",
                "label": "leaf_2_0_2-5"
            },
            {
                "id": "leaf_1_0_2-1",
                "label": "leaf_1_0_2-1"
            },
            {
                "id": "leaf_2_0_2-3",
                "label": "leaf_2_0_2-3"
            },
            {
                "id": "spine_2_1_2-4",
                "label": "spine_2_1_2-4"
            },
            {
                "id": "spine_1_1_2-2",
                "label": "spine_1_1_2-2"
            },
            {
                "id": "leaf_1_0_2-7",
                "label": "leaf_1_0_2-7"
            },
            {
                "id": "leaf_1_0_1-3",
                "label": "leaf_1_0_1-3"
            },
            {
                "id": "tof_1_2_1-3",
                "label": "tof_1_2_1-3"
            },
            {
                "id": "leaf_2_0_1-3",
                "label": "leaf_2_0_1-3"
            },
            {
                "id": "leaf_2_0_2-11",
                "label": "leaf_2_0_2-11"
            },
            {
                "id": "tof_1_2_2-3",
                "label": "tof_1_2_2-3"
            },
            {
                "id": "tof_1_2_1-5",
                "label": "tof_1_2_1-5"
            },
            {
                "id": "leaf_1_0_1-1",
                "label": "leaf_1_0_1-1"
            },
            {
                "id": "spine_2_1_2-10",
                "label": "spine_2_1_2-10"
            },
            {
                "id": "spine_2_1_2-8",
                "label": "spine_2_1_2-8"
            },
            {
                "id": "tof_1_2_2-7",
                "label": "tof_1_2_2-7"
            },
            {
                "id": "leaf_2_0_1-5",
                "label": "leaf_2_0_1-5"
            },
            {
                "id": "spine_2_1_2-6",
                "label": "spine_2_1_2-6"
            },
            {
                "id": "spine_2_1_1-2",
                "label": "spine_2_1_1-2"
            },
            {
                "id": "leaf_2_0_2-9",
                "label": "leaf_2_0_2-9"
            },
            {
                "id": "tof_1_2_2-1",
                "label": "tof_1_2_2-1"
            }
        ],
        "links": [
            {
                "source": "spine_1_1_1-0",
                "target": "tof_1_2_2-1",
                "value": 1,
                "label": [
                    {
                        "time": 1636583098.790959,
                        "type": "FS-LSP",
                        "LSP ID": "0100.0000.0002.00-00",
                        "Seq.N": 3,
                        "Orig.": "kathara-spine-1-1-1-de87967a",
                        "Scope": "Level 2 Circuit Flooding Scope",
                        "Priority": false
                    }
                ]
            },
            {
                "source": "spine_1_1_1-0",
                "target": "leaf_1_0_2-1",
                "value": 1,
                "label": [
                    {
                        "time": 1636583098.791005,
                        "type": "FS-LSP",
                        "LSP ID": "0100.0000.0002.00-00",
                        "Seq.N": 3,
                        "Orig.": "kathara-spine-1-1-1-de87967a",
                        "Scope": "Level 2 Circuit Flooding Scope",
                        "Priority": false
                    }
                ]
            },
            {
                "source": "spine_1_1_1-0",
                "target": "leaf_1_0_1-1",
                "value": 1,
                "label": [
                    {
                        "time": 1636583098.791017,
                        "type": "FS-LSP",
                        "LSP ID": "0100.0000.0002.00-00",
                        "Seq.N": 3,
                        "Orig.": "kathara-spine-1-1-1-de87967a",
                        "Scope": "Level 2 Circuit Flooding Scope",
                        "Priority": false
                    }
                ]
            },
            {
                "source": "tof_1_2_2-1",
                "target": "spine_2_1_1-2",
                "value": 1,
                "label": [
                    {
                        "time": 1636583099.576991,
                        "type": "LSP",
                        "LSP ID": "0100.0000.0002.00-00",
                        "Seq.N": 3,
                        "Orig.": "kathara-spine-1-1-1-de87967a"
                    }
                ]
            },
            {
                "source": "leaf_1_0_2-1",
                "target": "spine_1_1_2-2",
                "value": 1,
                "label": [
                    {
                        "time": 1636583099.74123,
                        "type": "LSP",
                        "LSP ID": "0100.0000.0002.00-00",
                        "Seq.N": 3,
                        "Orig.": "kathara-spine-1-1-1-de87967a"
                    }
                ]
            },
            {
                "source": "leaf_1_0_1-1",
                "target": "spine_1_1_2-2",
                "value": 1,
                "label": [
                    {
                        "time": 1636583100.206,
                        "type": "LSP",
                        "LSP ID": "0100.0000.0002.00-00",
                        "Seq.N": 3,
                        "Orig.": "kathara-spine-1-1-1-de87967a"
                    }
                ]
            },
            {
                "source": "spine_2_1_1-2",
                "target": "leaf_2_0_2-3",
                "value": 1,
                "label": [
                    {
                        "time": 1636583099.578081,
                        "type": "FS-LSP",
                        "LSP ID": "0100.0000.0002.00-00",
                        "Seq.N": 3,
                        "Orig.": "kathara-spine-1-1-1-de87967a",
                        "Scope": "Level 2 Circuit Flooding Scope",
                        "Priority": false
                    }
                ]
            },
            {
                "source": "spine_2_1_1-2",
                "target": "leaf_2_0_1-3",
                "value": 1,
                "label": [
                    {
                        "time": 1636583099.578101,
                        "type": "FS-LSP",
                        "LSP ID": "0100.0000.0002.00-00",
                        "Seq.N": 3,
                        "Orig.": "kathara-spine-1-1-1-de87967a",
                        "Scope": "Level 2 Circuit Flooding Scope",
                        "Priority": false
                    }
                ]
            },
            {
                "source": "spine_2_1_1-2",
                "target": "tof_1_2_1-3",
                "value": 1,
                "label": [
                    {
                        "time": 1636583099.578113,
                        "type": "FS-LSP",
                        "LSP ID": "0100.0000.0002.00-00",
                        "Seq.N": 3,
                        "Orig.": "kathara-spine-1-1-1-de87967a",
                        "Scope": "Level 2 Circuit Flooding Scope",
                        "Priority": false
                    }
                ]
            },
            {
                "source": "spine_1_1_2-2",
                "target": "tof_1_2_2-3",
                "value": 1,
                "label": [
                    {
                        "time": 1636583100.20631,
                        "type": "FS-LSP",
                        "LSP ID": "0100.0000.0002.00-00",
                        "Seq.N": 3,
                        "Orig.": "kathara-spine-1-1-1-de87967a",
                        "Scope": "Level 2 Circuit Flooding Scope",
                        "Priority": false
                    }
                ]
            },
            {
                "source": "spine_1_1_2-2",
                "target": "tof_1_2_1-3",
                "value": 1,
                "label": [
                    {
                        "time": 1636583100.206349,
                        "type": "FS-LSP",
                        "LSP ID": "0100.0000.0002.00-00",
                        "Seq.N": 3,
                        "Orig.": "kathara-spine-1-1-1-de87967a",
                        "Scope": "Level 2 Circuit Flooding Scope",
                        "Priority": false
                    }
                ]
            },
            {
                "source": "spine_1_1_2-2",
                "target": "leaf_1_0_1-3",
                "value": 1,
                "label": [
                    {
                        "time": 1636583100.206368,
                        "type": "FS-LSP",
                        "LSP ID": "0100.0000.0002.00-00",
                        "Seq.N": 3,
                        "Orig.": "kathara-spine-1-1-1-de87967a",
                        "Scope": "Level 2 Circuit Flooding Scope",
                        "Priority": false
                    }
                ]
            },
            {
                "source": "tof_1_2_2-3",
                "target": "spine_2_1_2-4",
                "value": 1,
                "label": [
                    {
                        "time": 1636583099.747925,
                        "type": "LSP",
                        "LSP ID": "0100.0000.0002.00-00",
                        "Seq.N": 3,
                        "Orig.": "kathara-spine-1-1-1-de87967a"
                    }
                ]
            },
            {
                "source": "spine_2_1_2-4",
                "target": "leaf_2_0_2-5",
                "value": 1,
                "label": [
                    {
                        "time": 1636583099.749069,
                        "type": "FS-LSP",
                        "LSP ID": "0100.0000.0002.00-00",
                        "Seq.N": 3,
                        "Orig.": "kathara-spine-1-1-1-de87967a",
                        "Scope": "Level 2 Circuit Flooding Scope",
                        "Priority": false
                    }
                ]
            },
            {
                "source": "spine_2_1_2-4",
                "target": "leaf_2_0_1-5",
                "value": 1,
                "label": [
                    {
                        "time": 1636583099.749111,
                        "type": "FS-LSP",
                        "LSP ID": "0100.0000.0002.00-00",
                        "Seq.N": 3,
                        "Orig.": "kathara-spine-1-1-1-de87967a",
                        "Scope": "Level 2 Circuit Flooding Scope",
                        "Priority": false
                    }
                ]
            },
            {
                "source": "spine_2_1_2-4",
                "target": "tof_1_2_1-5",
                "value": 1,
                "label": [
                    {
                        "time": 1636583099.749136,
                        "type": "FS-LSP",
                        "LSP ID": "0100.0000.0002.00-00",
                        "Seq.N": 3,
                        "Orig.": "kathara-spine-1-1-1-de87967a",
                        "Scope": "Level 2 Circuit Flooding Scope",
                        "Priority": false
                    }
                ]
            },
            {
                "source": "tof_1_2_1-5",
                "target": "spine_2_1_2-6",
                "value": 1,
                "label": [
                    {
                        "time": 1636583127.410189,
                        "type": "FS-LSP",
                        "LSP ID": "0100.0000.0018.00-00",
                        "Seq.N": 3,
                        "Orig.": "kathara-tof-1-2-1-a95ebb2a",
                        "Scope": "Level 2 Circuit Flooding Scope",
                        "Priority": false
                    }
                ]
            },
            {
                "source": "tof_1_2_1-5",
                "target": "spine_2_1_1-6",
                "value": 1,
                "label": [
                    {
                        "time": 1636583127.41023,
                        "type": "FS-LSP",
                        "LSP ID": "0100.0000.0018.00-00",
                        "Seq.N": 3,
                        "Orig.": "kathara-tof-1-2-1-a95ebb2a",
                        "Scope": "Level 2 Circuit Flooding Scope",
                        "Priority": false
                    }
                ]
            },
            {
                "source": "tof_1_2_1-5",
                "target": "spine_1_1_2-6",
                "value": 1,
                "label": [
                    {
                        "time": 1636583127.410242,
                        "type": "FS-LSP",
                        "LSP ID": "0100.0000.0018.00-00",
                        "Seq.N": 3,
                        "Orig.": "kathara-tof-1-2-1-a95ebb2a",
                        "Scope": "Level 2 Circuit Flooding Scope",
                        "Priority": false
                    }
                ]
            },
            {
                "source": "spine_1_1_2-6",
                "target": "tof_1_2_2-7",
                "value": 1,
                "label": [
                    {
                        "time": 1636583128.577098,
                        "type": "LSP",
                        "LSP ID": "0100.0000.0018.00-00",
                        "Seq.N": 3,
                        "Orig.": "kathara-tof-1-2-1-a95ebb2a"
                    }
                ]
            },
            {
                "source": "spine_1_1_2-6",
                "target": "leaf_1_0_1-7",
                "value": 1,
                "label": [
                    {
                        "time": 1636583128.696989,
                        "type": "LSP",
                        "LSP ID": "0100.0000.0018.00-00",
                        "Seq.N": 3,
                        "Orig.": "kathara-tof-1-2-1-a95ebb2a"
                    }
                ]
            },
            {
                "source": "spine_1_1_2-6",
                "target": "leaf_1_0_2-7",
                "value": 1,
                "label": [
                    {
                        "time": 1636583128.858149,
                        "type": "LSP",
                        "LSP ID": "0100.0000.0018.00-00",
                        "Seq.N": 3,
                        "Orig.": "kathara-tof-1-2-1-a95ebb2a"
                    }
                ]
            },
            {
                "source": "tof_1_2_2-7",
                "target": "spine_2_1_2-8",
                "value": 1,
                "label": [
                    {
                        "time": 1636583128.111854,
                        "type": "FS-LSP",
                        "LSP ID": "0100.0000.0018.00-00",
                        "Seq.N": 3,
                        "Orig.": "kathara-tof-1-2-1-a95ebb2a",
                        "Scope": "Level 2 Circuit Flooding Scope",
                        "Priority": false
                    }
                ]
            },
            {
                "source": "tof_1_2_2-7",
                "target": "spine_2_1_1-8",
                "value": 1,
                "label": [
                    {
                        "time": 1636583128.11188,
                        "type": "FS-LSP",
                        "LSP ID": "0100.0000.0018.00-00",
                        "Seq.N": 3,
                        "Orig.": "kathara-tof-1-2-1-a95ebb2a",
                        "Scope": "Level 2 Circuit Flooding Scope",
                        "Priority": false
                    }
                ]
            },
            {
                "source": "tof_1_2_2-7",
                "target": "spine_1_1_1-8",
                "value": 1,
                "label": [
                    {
                        "time": 1636583128.111894,
                        "type": "FS-LSP",
                        "LSP ID": "0100.0000.0018.00-00",
                        "Seq.N": 3,
                        "Orig.": "kathara-tof-1-2-1-a95ebb2a",
                        "Scope": "Level 2 Circuit Flooding Scope",
                        "Priority": false
                    }
                ]
            },
            {
                "source": "leaf_1_0_1-7",
                "target": "spine_1_1_1-8",
                "value": 1,
                "label": [
                    {
                        "time": 1636583128.697606,
                        "type": "FS-LSP",
                        "LSP ID": "0100.0000.0018.00-00",
                        "Seq.N": 3,
                        "Orig.": "kathara-tof-1-2-1-a95ebb2a",
                        "Scope": "Level 2 Circuit Flooding Scope",
                        "Priority": false
                    }
                ]
            },
            {
                "source": "leaf_1_0_2-7",
                "target": "spine_1_1_1-8",
                "value": 1,
                "label": [
                    {
                        "time": 1636583128.393992,
                        "type": "FS-LSP",
                        "LSP ID": "0100.0000.0018.00-00",
                        "Seq.N": 3,
                        "Orig.": "kathara-tof-1-2-1-a95ebb2a",
                        "Scope": "Level 2 Circuit Flooding Scope",
                        "Priority": false
                    }
                ]
            },
            {
                "source": "spine_2_1_2-8",
                "target": "leaf_2_0_1-9",
                "value": 1,
                "label": [
                    {
                        "time": 1636583128.236436,
                        "type": "LSP",
                        "LSP ID": "0100.0000.0018.00-00",
                        "Seq.N": 3,
                        "Orig.": "kathara-tof-1-2-1-a95ebb2a"
                    }
                ]
            },
            {
                "source": "spine_2_1_1-8",
                "target": "leaf_2_0_1-9",
                "value": 1,
                "label": [
                    {
                        "time": 1636583128.23715,
                        "type": "LSP",
                        "LSP ID": "0100.0000.0018.00-00",
                        "Seq.N": 3,
                        "Orig.": "kathara-tof-1-2-1-a95ebb2a"
                    }
                ]
            },
            {
                "source": "spine_2_1_1-8",
                "target": "leaf_2_0_2-9",
                "value": 1,
                "label": [
                    {
                        "time": 1636583128.42449,
                        "type": "LSP",
                        "LSP ID": "0100.0000.0018.00-00",
                        "Seq.N": 3,
                        "Orig.": "kathara-tof-1-2-1-a95ebb2a"
                    }
                ]
            },
            {
                "source": "leaf_2_0_1-9",
                "target": "spine_2_1_2-10",
                "value": 1,
                "label": [
                    {
                        "time": 1636583128.237143,
                        "type": "FS-LSP",
                        "LSP ID": "0100.0000.0018.00-00",
                        "Seq.N": 3,
                        "Orig.": "kathara-tof-1-2-1-a95ebb2a",
                        "Scope": "Level 2 Circuit Flooding Scope",
                        "Priority": false
                    }
                ]
            },
            {
                "source": "spine_2_1_2-10",
                "target": "leaf_2_0_2-11",
                "value": 1,
                "label": [
                    {
                        "time": 1636583128.423461,
                        "type": "LSP",
                        "LSP ID": "0100.0000.0018.00-00",
                        "Seq.N": 3,
                        "Orig.": "kathara-tof-1-2-1-a95ebb2a"
                    }
                ]
            }
        ]
    },
    "logical_time_plot": {
        "points": {
            "spine_1_1_1": {
                "1": {
                    "time": 1636583098.790959,
                    "type": "FS-LSP",
                    "LSP ID": "0100.0000.0002.00-00",
                    "Seq.N": 3,
                    "Orig.": "kathara-spine-1-1-1-de87967a",
                    "Scope": "Level 2 Circuit Flooding Scope",
                    "Priority": false,
                    "Logical Clock": 1
                },
                "2": {
                    "time": 1636583098.791005,
                    "type": "FS-LSP",
                    "LSP ID": "0100.0000.0002.00-00",
                    "Seq.N": 3,
                    "Orig.": "kathara-spine-1-1-1-de87967a",
                    "Scope": "Level 2 Circuit Flooding Scope",
                    "Priority": false,
                    "Logical Clock": 2
                },
                "3": {
                    "time": 1636583098.791017,
                    "type": "FS-LSP",
                    "LSP ID": "0100.0000.0002.00-00",
                    "Seq.N": 3,
                    "Orig.": "kathara-spine-1-1-1-de87967a",
                    "Scope": "Level 2 Circuit Flooding Scope",
                    "Priority": false,
                    "Logical Clock": 3
                },
                "24": {
                    "time": 1636583128.113087,
                    "type": "FS-LSP",
                    "LSP ID": "0100.0000.0018.00-00",
                    "Seq.N": 3,
                    "Orig.": "kathara-tof-1-2-1-a95ebb2a",
                    "Scope": "Level 2 Circuit Flooding Scope",
                    "Priority": false,
                    "Logical Clock": 24
                },
                "25": {
                    "time": 1636583128.233636,
                    "type": "FS-LSP",
                    "LSP ID": "0100.0000.0018.00-00",
                    "Seq.N": 3,
                    "Orig.": "kathara-tof-1-2-1-a95ebb2a",
                    "Scope": "Level 2 Circuit Flooding Scope",
                    "Priority": false,
                    "Logical Clock": 25
                },
                "26": {
                    "time": 1636583128.394809,
                    "type": "FS-LSP",
                    "LSP ID": "0100.0000.0018.00-00",
                    "Seq.N": 3,
                    "Orig.": "kathara-tof-1-2-1-a95ebb2a",
                    "Scope": "Level 2 Circuit Flooding Scope",
                    "Priority": false,
                    "Logical Clock": 26
                }
            },
            "tof_1_2_2": {
                "2": {
                    "time": 1636583098.790339,
                    "type": "FS-LSP",
                    "LSP ID": "0100.0000.0002.00-00",
                    "Seq.N": 3,
                    "Orig.": "kathara-spine-1-1-1-de87967a",
                    "Scope": "Level 2 Circuit Flooding Scope",
                    "Priority": false,
                    "Logical Clock": 2
                },
                "3": {
                    "time": 1636583099.576991,
                    "type": "LSP",
                    "LSP ID": "0100.0000.0002.00-00",
                    "Seq.N": 3,
                    "Orig.": "kathara-spine-1-1-1-de87967a",
                    "Logical Clock": 3
                },
                "8": {
                    "time": 1636583099.741544,
                    "type": "FS-LSP",
                    "LSP ID": "0100.0000.0002.00-00",
                    "Seq.N": 3,
                    "Orig.": "kathara-spine-1-1-1-de87967a",
                    "Scope": "Level 2 Circuit Flooding Scope",
                    "Priority": false,
                    "Logical Clock": 8
                },
                "9": {
                    "time": 1636583099.747925,
                    "type": "LSP",
                    "LSP ID": "0100.0000.0002.00-00",
                    "Seq.N": 3,
                    "Orig.": "kathara-spine-1-1-1-de87967a",
                    "Logical Clock": 9
                },
                "20": {
                    "time": 1636583128.111745,
                    "type": "LSP",
                    "LSP ID": "0100.0000.0018.00-00",
                    "Seq.N": 3,
                    "Orig.": "kathara-tof-1-2-1-a95ebb2a",
                    "Logical Clock": 20
                },
                "21": {
                    "time": 1636583128.111854,
                    "type": "FS-LSP",
                    "LSP ID": "0100.0000.0018.00-00",
                    "Seq.N": 3,
                    "Orig.": "kathara-tof-1-2-1-a95ebb2a",
                    "Scope": "Level 2 Circuit Flooding Scope",
                    "Priority": false,
                    "Logical Clock": 21
                },
                "22": {
                    "time": 1636583128.11188,
                    "type": "FS-LSP",
                    "LSP ID": "0100.0000.0018.00-00",
                    "Seq.N": 3,
                    "Orig.": "kathara-tof-1-2-1-a95ebb2a",
                    "Scope": "Level 2 Circuit Flooding Scope",
                    "Priority": false,
                    "Logical Clock": 22
                },
                "23": {
                    "time": 1636583128.111894,
                    "type": "FS-LSP",
                    "LSP ID": "0100.0000.0018.00-00",
                    "Seq.N": 3,
                    "Orig.": "kathara-tof-1-2-1-a95ebb2a",
                    "Scope": "Level 2 Circuit Flooding Scope",
                    "Priority": false,
                    "Logical Clock": 23
                }
            },
            "leaf_1_0_2": {
                "3": {
                    "time": 1636583098.791027,
                    "type": "FS-LSP",
                    "LSP ID": "0100.0000.0002.00-00",
                    "Seq.N": 3,
                    "Orig.": "kathara-spine-1-1-1-de87967a",
                    "Scope": "Level 2 Circuit Flooding Scope",
                    "Priority": false,
                    "Logical Clock": 3
                },
                "4": {
                    "time": 1636583099.74123,
                    "type": "LSP",
                    "LSP ID": "0100.0000.0002.00-00",
                    "Seq.N": 3,
                    "Orig.": "kathara-spine-1-1-1-de87967a",
                    "Logical Clock": 4
                },
                "22": {
                    "time": 1636583128.393664,
                    "type": "LSP",
                    "LSP ID": "0100.0000.0018.00-00",
                    "Seq.N": 3,
                    "Orig.": "kathara-tof-1-2-1-a95ebb2a",
                    "Logical Clock": 22
                },
                "23": {
                    "time": 1636583128.393992,
                    "type": "FS-LSP",
                    "LSP ID": "0100.0000.0018.00-00",
                    "Seq.N": 3,
                    "Orig.": "kathara-tof-1-2-1-a95ebb2a",
                    "Scope": "Level 2 Circuit Flooding Scope",
                    "Priority": false,
                    "Logical Clock": 23
                }
            },
            "leaf_1_0_1": {
                "4": {
                    "time": 1636583099.255672,
                    "type": "FS-LSP",
                    "LSP ID": "0100.0000.0002.00-00",
                    "Seq.N": 3,
                    "Orig.": "kathara-spine-1-1-1-de87967a",
                    "Scope": "Level 2 Circuit Flooding Scope",
                    "Priority": false,
                    "Logical Clock": 4
                },
                "5": {
                    "time": 1636583100.206,
                    "type": "LSP",
                    "LSP ID": "0100.0000.0002.00-00",
                    "Seq.N": 3,
                    "Orig.": "kathara-spine-1-1-1-de87967a",
                    "Logical Clock": 5
                },
                "10": {
                    "time": 1636583100.206675,
                    "type": "FS-LSP",
                    "LSP ID": "0100.0000.0002.00-00",
                    "Seq.N": 3,
                    "Orig.": "kathara-spine-1-1-1-de87967a",
                    "Scope": "Level 2 Circuit Flooding Scope",
                    "Priority": false,
                    "Logical Clock": 10
                },
                "21": {
                    "time": 1636583128.697315,
                    "type": "LSP",
                    "LSP ID": "0100.0000.0018.00-00",
                    "Seq.N": 3,
                    "Orig.": "kathara-tof-1-2-1-a95ebb2a",
                    "Logical Clock": 21
                },
                "22": {
                    "time": 1636583128.697606,
                    "type": "FS-LSP",
                    "LSP ID": "0100.0000.0018.00-00",
                    "Seq.N": 3,
                    "Orig.": "kathara-tof-1-2-1-a95ebb2a",
                    "Scope": "Level 2 Circuit Flooding Scope",
                    "Priority": false,
                    "Logical Clock": 22
                }
            },
            "spine_2_1_1": {
                "4": {
                    "time": 1636583099.577995,
                    "type": "LSP",
                    "LSP ID": "0100.0000.0002.00-00",
                    "Seq.N": 3,
                    "Orig.": "kathara-spine-1-1-1-de87967a",
                    "Logical Clock": 4
                },
                "5": {
                    "time": 1636583099.578081,
                    "type": "FS-LSP",
                    "LSP ID": "0100.0000.0002.00-00",
                    "Seq.N": 3,
                    "Orig.": "kathara-spine-1-1-1-de87967a",
                    "Scope": "Level 2 Circuit Flooding Scope",
                    "Priority": false,
                    "Logical Clock": 5
                },
                "6": {
                    "time": 1636583099.578101,
                    "type": "FS-LSP",
                    "LSP ID": "0100.0000.0002.00-00",
                    "Seq.N": 3,
                    "Orig.": "kathara-spine-1-1-1-de87967a",
                    "Scope": "Level 2 Circuit Flooding Scope",
                    "Priority": false,
                    "Logical Clock": 6
                },
                "7": {
                    "time": 1636583099.578113,
                    "type": "FS-LSP",
                    "LSP ID": "0100.0000.0002.00-00",
                    "Seq.N": 3,
                    "Orig.": "kathara-spine-1-1-1-de87967a",
                    "Scope": "Level 2 Circuit Flooding Scope",
                    "Priority": false,
                    "Logical Clock": 7
                },
                "17": {
                    "time": 1636583127.411195,
                    "type": "FS-LSP",
                    "LSP ID": "0100.0000.0018.00-00",
                    "Seq.N": 3,
                    "Orig.": "kathara-tof-1-2-1-a95ebb2a",
                    "Scope": "Level 2 Circuit Flooding Scope",
                    "Priority": false,
                    "Logical Clock": 17
                },
                "23": {
                    "time": 1636583128.113139,
                    "type": "FS-LSP",
                    "LSP ID": "0100.0000.0018.00-00",
                    "Seq.N": 3,
                    "Orig.": "kathara-tof-1-2-1-a95ebb2a",
                    "Scope": "Level 2 Circuit Flooding Scope",
                    "Priority": false,
                    "Logical Clock": 23
                },
                "24": {
                    "time": 1636583128.23715,
                    "type": "LSP",
                    "LSP ID": "0100.0000.0018.00-00",
                    "Seq.N": 3,
                    "Orig.": "kathara-tof-1-2-1-a95ebb2a",
                    "Logical Clock": 24
                },
                "25": {
                    "time": 1636583128.42449,
                    "type": "LSP",
                    "LSP ID": "0100.0000.0018.00-00",
                    "Seq.N": 3,
                    "Orig.": "kathara-tof-1-2-1-a95ebb2a",
                    "Logical Clock": 25
                }
            },
            "spine_1_1_2": {
                "5": {
                    "time": 1636583100.20609,
                    "type": "LSP",
                    "LSP ID": "0100.0000.0002.00-00",
                    "Seq.N": 3,
                    "Orig.": "kathara-spine-1-1-1-de87967a",
                    "Logical Clock": 5
                },
                "6": {
                    "time": 1636583100.206263,
                    "type": "LSP",
                    "LSP ID": "0100.0000.0002.00-00",
                    "Seq.N": 3,
                    "Orig.": "kathara-spine-1-1-1-de87967a",
                    "Logical Clock": 6
                },
                "7": {
                    "time": 1636583100.20631,
                    "type": "FS-LSP",
                    "LSP ID": "0100.0000.0002.00-00",
                    "Seq.N": 3,
                    "Orig.": "kathara-spine-1-1-1-de87967a",
                    "Scope": "Level 2 Circuit Flooding Scope",
                    "Priority": false,
                    "Logical Clock": 7
                },
                "8": {
                    "time": 1636583100.206349,
                    "type": "FS-LSP",
                    "LSP ID": "0100.0000.0002.00-00",
                    "Seq.N": 3,
                    "Orig.": "kathara-spine-1-1-1-de87967a",
                    "Scope": "Level 2 Circuit Flooding Scope",
                    "Priority": false,
                    "Logical Clock": 8
                },
                "9": {
                    "time": 1636583100.206368,
                    "type": "FS-LSP",
                    "LSP ID": "0100.0000.0002.00-00",
                    "Seq.N": 3,
                    "Orig.": "kathara-spine-1-1-1-de87967a",
                    "Scope": "Level 2 Circuit Flooding Scope",
                    "Priority": false,
                    "Logical Clock": 9
                },
                "18": {
                    "time": 1636583127.875911,
                    "type": "FS-LSP",
                    "LSP ID": "0100.0000.0018.00-00",
                    "Seq.N": 3,
                    "Orig.": "kathara-tof-1-2-1-a95ebb2a",
                    "Scope": "Level 2 Circuit Flooding Scope",
                    "Priority": false,
                    "Logical Clock": 18
                },
                "19": {
                    "time": 1636583128.577098,
                    "type": "LSP",
                    "LSP ID": "0100.0000.0018.00-00",
                    "Seq.N": 3,
                    "Orig.": "kathara-tof-1-2-1-a95ebb2a",
                    "Logical Clock": 19
                },
                "20": {
                    "time": 1636583128.696989,
                    "type": "LSP",
                    "LSP ID": "0100.0000.0018.00-00",
                    "Seq.N": 3,
                    "Orig.": "kathara-tof-1-2-1-a95ebb2a",
                    "Logical Clock": 20
                },
                "21": {
                    "time": 1636583128.858149,
                    "type": "LSP",
                    "LSP ID": "0100.0000.0018.00-00",
                    "Seq.N": 3,
                    "Orig.": "kathara-tof-1-2-1-a95ebb2a",
                    "Logical Clock": 21
                }
            },
            "leaf_2_0_2": {
                "6": {
                    "time": 1636583100.042775,
                    "type": "FS-LSP",
                    "LSP ID": "0100.0000.0002.00-00",
                    "Seq.N": 3,
                    "Orig.": "kathara-spine-1-1-1-de87967a",
                    "Scope": "Level 2 Circuit Flooding Scope",
                    "Priority": false,
                    "Logical Clock": 6
                },
                "12": {
                    "time": 1636583100.214879,
                    "type": "FS-LSP",
                    "LSP ID": "0100.0000.0002.00-00",
                    "Seq.N": 3,
                    "Orig.": "kathara-spine-1-1-1-de87967a",
                    "Scope": "Level 2 Circuit Flooding Scope",
                    "Priority": false,
                    "Logical Clock": 12
                },
                "26": {
                    "time": 1636583128.889428,
                    "type": "LSP",
                    "LSP ID": "0100.0000.0018.00-00",
                    "Seq.N": 3,
                    "Orig.": "kathara-tof-1-2-1-a95ebb2a",
                    "Logical Clock": 26
                },
                "29": {
                    "time": 1636583128.889409,
                    "type": "LSP",
                    "LSP ID": "0100.0000.0018.00-00",
                    "Seq.N": 3,
                    "Orig.": "kathara-tof-1-2-1-a95ebb2a",
                    "Logical Clock": 29
                }
            },
            "leaf_2_0_1": {
                "7": {
                    "time": 1636583099.577711,
                    "type": "FS-LSP",
                    "LSP ID": "0100.0000.0002.00-00",
                    "Seq.N": 3,
                    "Orig.": "kathara-spine-1-1-1-de87967a",
                    "Scope": "Level 2 Circuit Flooding Scope",
                    "Priority": false,
                    "Logical Clock": 7
                },
                "13": {
                    "time": 1636583099.749883,
                    "type": "FS-LSP",
                    "LSP ID": "0100.0000.0002.00-00",
                    "Seq.N": 3,
                    "Orig.": "kathara-spine-1-1-1-de87967a",
                    "Scope": "Level 2 Circuit Flooding Scope",
                    "Priority": false,
                    "Logical Clock": 13
                },
                "24": {
                    "time": 1636583128.237073,
                    "type": "LSP",
                    "LSP ID": "0100.0000.0018.00-00",
                    "Seq.N": 3,
                    "Orig.": "kathara-tof-1-2-1-a95ebb2a",
                    "Logical Clock": 24
                },
                "25": {
                    "time": 1636583128.236924,
                    "type": "LSP",
                    "LSP ID": "0100.0000.0018.00-00",
                    "Seq.N": 3,
                    "Orig.": "kathara-tof-1-2-1-a95ebb2a",
                    "Logical Clock": 25
                },
                "26": {
                    "time": 1636583128.237143,
                    "type": "FS-LSP",
                    "LSP ID": "0100.0000.0018.00-00",
                    "Seq.N": 3,
                    "Orig.": "kathara-tof-1-2-1-a95ebb2a",
                    "Scope": "Level 2 Circuit Flooding Scope",
                    "Priority": false,
                    "Logical Clock": 26
                }
            },
            "tof_1_2_1": {
                "8": {
                    "time": 1636583099.577694,
                    "type": "FS-LSP",
                    "LSP ID": "0100.0000.0002.00-00",
                    "Seq.N": 3,
                    "Orig.": "kathara-spine-1-1-1-de87967a",
                    "Scope": "Level 2 Circuit Flooding Scope",
                    "Priority": false,
                    "Logical Clock": 8
                },
                "9": {
                    "time": 1636583099.741731,
                    "type": "FS-LSP",
                    "LSP ID": "0100.0000.0002.00-00",
                    "Seq.N": 3,
                    "Orig.": "kathara-spine-1-1-1-de87967a",
                    "Scope": "Level 2 Circuit Flooding Scope",
                    "Priority": false,
                    "Logical Clock": 9
                },
                "14": {
                    "time": 1636583099.749945,
                    "type": "FS-LSP",
                    "LSP ID": "0100.0000.0002.00-00",
                    "Seq.N": 3,
                    "Orig.": "kathara-spine-1-1-1-de87967a",
                    "Scope": "Level 2 Circuit Flooding Scope",
                    "Priority": false,
                    "Logical Clock": 14
                },
                "15": {
                    "time": 1636583127.410189,
                    "type": "FS-LSP",
                    "LSP ID": "0100.0000.0018.00-00",
                    "Seq.N": 3,
                    "Orig.": "kathara-tof-1-2-1-a95ebb2a",
                    "Scope": "Level 2 Circuit Flooding Scope",
                    "Priority": false,
                    "Logical Clock": 15
                },
                "16": {
                    "time": 1636583127.41023,
                    "type": "FS-LSP",
                    "LSP ID": "0100.0000.0018.00-00",
                    "Seq.N": 3,
                    "Orig.": "kathara-tof-1-2-1-a95ebb2a",
                    "Scope": "Level 2 Circuit Flooding Scope",
                    "Priority": false,
                    "Logical Clock": 16
                },
                "17": {
                    "time": 1636583127.410242,
                    "type": "FS-LSP",
                    "LSP ID": "0100.0000.0018.00-00",
                    "Seq.N": 3,
                    "Orig.": "kathara-tof-1-2-1-a95ebb2a",
                    "Scope": "Level 2 Circuit Flooding Scope",
                    "Priority": false,
                    "Logical Clock": 17
                }
            },
            "spine_2_1_2": {
                "10": {
                    "time": 1636583099.748322,
                    "type": "LSP",
                    "LSP ID": "0100.0000.0002.00-00",
                    "Seq.N": 3,
                    "Orig.": "kathara-spine-1-1-1-de87967a",
                    "Logical Clock": 10
                },
                "11": {
                    "time": 1636583099.749069,
                    "type": "FS-LSP",
                    "LSP ID": "0100.0000.0002.00-00",
                    "Seq.N": 3,
                    "Orig.": "kathara-spine-1-1-1-de87967a",
                    "Scope": "Level 2 Circuit Flooding Scope",
                    "Priority": false,
                    "Logical Clock": 11
                },
                "12": {
                    "time": 1636583099.749111,
                    "type": "FS-LSP",
                    "LSP ID": "0100.0000.0002.00-00",
                    "Seq.N": 3,
                    "Orig.": "kathara-spine-1-1-1-de87967a",
                    "Scope": "Level 2 Circuit Flooding Scope",
                    "Priority": false,
                    "Logical Clock": 12
                },
                "13": {
                    "time": 1636583099.749136,
                    "type": "FS-LSP",
                    "LSP ID": "0100.0000.0002.00-00",
                    "Seq.N": 3,
                    "Orig.": "kathara-spine-1-1-1-de87967a",
                    "Scope": "Level 2 Circuit Flooding Scope",
                    "Priority": false,
                    "Logical Clock": 13
                },
                "16": {
                    "time": 1636583127.410765,
                    "type": "FS-LSP",
                    "LSP ID": "0100.0000.0018.00-00",
                    "Seq.N": 3,
                    "Orig.": "kathara-tof-1-2-1-a95ebb2a",
                    "Scope": "Level 2 Circuit Flooding Scope",
                    "Priority": false,
                    "Logical Clock": 16
                },
                "22": {
                    "time": 1636583128.112035,
                    "type": "FS-LSP",
                    "LSP ID": "0100.0000.0018.00-00",
                    "Seq.N": 3,
                    "Orig.": "kathara-tof-1-2-1-a95ebb2a",
                    "Scope": "Level 2 Circuit Flooding Scope",
                    "Priority": false,
                    "Logical Clock": 22
                },
                "23": {
                    "time": 1636583128.236436,
                    "type": "LSP",
                    "LSP ID": "0100.0000.0018.00-00",
                    "Seq.N": 3,
                    "Orig.": "kathara-tof-1-2-1-a95ebb2a",
                    "Logical Clock": 23
                },
                "27": {
                    "time": 1636583128.237567,
                    "type": "FS-LSP",
                    "LSP ID": "0100.0000.0018.00-00",
                    "Seq.N": 3,
                    "Orig.": "kathara-tof-1-2-1-a95ebb2a",
                    "Scope": "Level 2 Circuit Flooding Scope",
                    "Priority": false,
                    "Logical Clock": 27
                },
                "28": {
                    "time": 1636583128.423461,
                    "type": "LSP",
                    "LSP ID": "0100.0000.0018.00-00",
                    "Seq.N": 3,
                    "Orig.": "kathara-tof-1-2-1-a95ebb2a",
                    "Logical Clock": 28
                }
            }
        },
        "edges": [
            [
                [
                    "spine_1_1_1",
                    1
                ],
                [
                    "tof_1_2_2",
                    2
                ]
            ],
            [
                [
                    "spine_1_1_1",
                    2
                ],
                [
                    "leaf_1_0_2",
                    3
                ]
            ],
            [
                [
                    "spine_1_1_1",
                    3
                ],
                [
                    "leaf_1_0_1",
                    4
                ]
            ],
            [
                [
                    "tof_1_2_2",
                    3
                ],
                [
                    "spine_2_1_1",
                    4
                ]
            ],
            [
                [
                    "leaf_1_0_2",
                    4
                ],
                [
                    "spine_1_1_2",
                    5
                ]
            ],
            [
                [
                    "leaf_1_0_1",
                    5
                ],
                [
                    "spine_1_1_2",
                    6
                ]
            ],
            [
                [
                    "spine_2_1_1",
                    5
                ],
                [
                    "leaf_2_0_2",
                    6
                ]
            ],
            [
                [
                    "spine_2_1_1",
                    6
                ],
                [
                    "leaf_2_0_1",
                    7
                ]
            ],
            [
                [
                    "spine_2_1_1",
                    7
                ],
                [
                    "tof_1_2_1",
                    8
                ]
            ],
            [
                [
                    "spine_1_1_2",
                    7
                ],
                [
                    "tof_1_2_2",
                    8
                ]
            ],
            [
                [
                    "spine_1_1_2",
                    8
                ],
                [
                    "tof_1_2_1",
                    9
                ]
            ],
            [
                [
                    "spine_1_1_2",
                    9
                ],
                [
                    "leaf_1_0_1",
                    10
                ]
            ],
            [
                [
                    "tof_1_2_2",
                    9
                ],
                [
                    "spine_2_1_2",
                    10
                ]
            ],
            [
                [
                    "spine_2_1_2",
                    11
                ],
                [
                    "leaf_2_0_2",
                    12
                ]
            ],
            [
                [
                    "spine_2_1_2",
                    12
                ],
                [
                    "leaf_2_0_1",
                    13
                ]
            ],
            [
                [
                    "spine_2_1_2",
                    13
                ],
                [
                    "tof_1_2_1",
                    14
                ]
            ],
            [
                [
                    "tof_1_2_1",
                    15
                ],
                [
                    "spine_2_1_2",
                    16
                ]
            ],
            [
                [
                    "tof_1_2_1",
                    16
                ],
                [
                    "spine_2_1_1",
                    17
                ]
            ],
            [
                [
                    "tof_1_2_1",
                    17
                ],
                [
                    "spine_1_1_2",
                    18
                ]
            ],
            [
                [
                    "spine_1_1_2",
                    19
                ],
                [
                    "tof_1_2_2",
                    20
                ]
            ],
            [
                [
                    "spine_1_1_2",
                    20
                ],
                [
                    "leaf_1_0_1",
                    21
                ]
            ],
            [
                [
                    "spine_1_1_2",
                    21
                ],
                [
                    "leaf_1_0_2",
                    22
                ]
            ],
            [
                [
                    "tof_1_2_2",
                    21
                ],
                [
                    "spine_2_1_2",
                    22
                ]
            ],
            [
                [
                    "tof_1_2_2",
                    22
                ],
                [
                    "spine_2_1_1",
                    23
                ]
            ],
            [
                [
                    "tof_1_2_2",
                    23
                ],
                [
                    "spine_1_1_1",
                    24
                ]
            ],
            [
                [
                    "leaf_1_0_1",
                    22
                ],
                [
                    "spine_1_1_1",
                    25
                ]
            ],
            [
                [
                    "leaf_1_0_2",
                    23
                ],
                [
                    "spine_1_1_1",
                    26
                ]
            ],
            [
                [
                    "spine_2_1_2",
                    23
                ],
                [
                    "leaf_2_0_1",
                    24
                ]
            ],
            [
                [
                    "spine_2_1_1",
                    24
                ],
                [
                    "leaf_2_0_1",
                    25
                ]
            ],
            [
                [
                    "spine_2_1_1",
                    25
                ],
                [
                    "leaf_2_0_2",
                    26
                ]
            ],
            [
                [
                    "leaf_2_0_1",
                    26
                ],
                [
                    "spine_2_1_2",
                    27
                ]
            ],
            [
                [
                    "spine_2_1_2",
                    28
                ],
                [
                    "leaf_2_0_2",
                    29
                ]
            ]
        ]
    },
    "max_scalar_clock": 29
}