{
    "description": "Scenario 6a: net0 link failure and recovery of leaf_1_0_1 with BGP",
    "k_leaf": 14,
    "k_top": 14,
    "redundancy_factor": 14,
    "is_k8s": true,
    "machine_mac_addresses": {
        "leaf_1_0_1": {
            "net0": "3e:6a:19:b4:d2:68",
            "net1": "0e:ef:18:56:36:a9",
            "net10": "82:d9:15:f0:55:2e",
            "net11": "3e:0d:a4:aa:0f:4e",
            "net12": "66:30:dd:fe:0e:b4",
            "net13": "3e:88:a4:ac:49:90",
            "net14": "ca:d7:47:33:60:e5",
            "net2": "92:5c:3a:34:d3:34",
            "net3": "b2:51:d0:06:9d:38",
            "net4": "6a:21:04:bf:bf:c7",
            "net5": "1a:58:8e:d5:e0:28",
            "net6": "42:f3:d5:29:8f:ef",
            "net7": "36:78:60:e8:82:35",
            "net8": "8a:5d:8f:e2:11:40",
            "net9": "ae:80:ad:d6:71:75"
        },
        "leaf_1_0_10": {
            "net0": "22:82:89:b0:1e:72",
            "net1": "c2:f1:9c:e6:18:ad",
            "net10": "2a:62:37:bb:b4:44",
            "net11": "26:04:32:88:5d:bb",
            "net12": "e2:d7:6d:f2:40:d2",
            "net13": "82:1e:04:9c:65:56",
            "net14": "6e:08:43:4f:b3:2c",
            "net2": "52:15:45:76:2b:60",
            "net3": "52:53:40:63:36:03",
            "net4": "9a:48:8b:2e:67:04",
            "net5": "66:41:99:11:8a:4f",
            "net6": "da:58:b4:10:cd:9e",
            "net7": "e6:37:76:b4:49:74",
            "net8": "26:4b:a7:08:41:f7",
            "net9": "0e:e3:40:79:1f:64"
        },
        "leaf_1_0_11": {
            "net0": "f2:9a:36:d7:ed:9a",
            "net1": "c2:79:d4:ab:2f:27",
            "net10": "42:36:8e:13:73:6b",
            "net11": "fe:08:50:42:b1:63",
            "net12": "3a:0d:0a:c6:06:f5",
            "net13": "6a:51:57:ba:07:ad",
            "net14": "7e:39:5a:bd:de:99",
            "net2": "86:46:a1:a3:9f:bf",
            "net3": "8e:5f:c8:10:5e:43",
            "net4": "a2:97:49:a0:ab:c3",
            "net5": "06:e0:ec:50:41:0e",
            "net6": "ae:55:75:df:42:ba",
            "net7": "5e:68:7f:88:46:2f",
            "net8": "72:f4:20:45:e7:63",
            "net9": "0e:0a:69:2e:9f:0b"
        },
        "leaf_1_0_12": {
            "net0": "4a:8a:e6:15:90:94",
            "net1": "aa:e5:c0:b6:d1:0b",
            "net10": "3a:68:1a:77:08:af",
            "net11": "72:20:79:91:58:63",
            "net12": "3e:cc:26:46:b2:0e",
            "net13": "12:ab:f8:7c:fa:14",
            "net14": "3a:94:20:cb:9c:fd",
            "net2": "22:8f:0c:0f:13:39",
            "net3": "ce:13:69:98:0f:24",
            "net4": "6e:01:23:0e:4a:d2",
            "net5": "c6:10:19:74:79:e2",
            "net6": "be:55:56:74:0b:5f",
            "net7": "0a:2c:ec:b2:4d:b0",
            "net8": "6a:2c:93:5b:00:37",
            "net9": "4a:4a:f9:b9:c2:23"
        },
        "leaf_1_0_13": {
            "net0": "7a:5b:6b:27:9d:63",
            "net1": "8a:8b:4a:f2:b3:d1",
            "net10": "f2:7a:9b:6a:ef:5e",
            "net11": "d6:20:44:fc:14:d1",
            "net12": "ce:b6:9b:56:46:12",
            "net13": "f2:6a:86:db:83:a7",
            "net14": "8e:d8:5f:bb:5a:91",
            "net2": "a2:a3:a1:22:0b:89",
            "net3": "6e:39:d6:90:f1:4d",
            "net4": "7a:c1:67:b9:43:b7",
            "net5": "b6:e4:a7:ed:5b:59",
            "net6": "8e:fc:8e:e4:e6:1b",
            "net7": "1e:79:0d:e7:21:a0",
            "net8": "d6:41:95:82:18:77",
            "net9": "32:5e:38:88:9a:92"
        },
        "leaf_1_0_14": {
            "net0": "52:ca:58:43:df:89",
            "net1": "02:21:53:85:62:d1",
            "net10": "6e:bf:7e:31:af:59",
            "net11": "6a:40:86:81:45:83",
            "net12": "3a:b0:5a:8a:aa:ac",
            "net13": "5e:0a:49:b2:50:18",
            "net14": "52:46:8c:33:82:93",
            "net2": "36:5c:c4:4e:4d:a7",
            "net3": "1a:f1:83:7a:74:4b",
            "net4": "e2:c9:60:63:f8:8f",
            "net5": "66:b1:ea:ed:01:78",
            "net6": "fa:ed:f1:08:1d:65",
            "net7": "e2:8b:53:f9:4f:87",
            "net8": "7a:0d:39:07:8c:36",
            "net9": "8e:d2:90:ab:a9:61"
        },
        "leaf_1_0_2": {
            "net0": "7a:e9:3b:2e:04:51",
            "net1": "ca:20:bb:63:22:3e",
            "net10": "02:f0:65:f2:e4:7c",
            "net11": "f6:03:9a:d2:cb:0e",
            "net12": "36:4e:8e:9c:32:f6",
            "net13": "9a:2a:bc:a0:79:46",
            "net14": "26:a4:bf:d2:5a:bb",
            "net2": "1a:db:ec:a4:c5:4f",
            "net3": "7e:63:ac:f0:7e:83",
            "net4": "6e:80:bf:a5:af:2f",
            "net5": "9e:38:d5:aa:4c:b1",
            "net6": "6a:e0:e9:43:d6:b3",
            "net7": "2a:37:0a:62:14:1a",
            "net8": "72:e7:07:80:9d:9c",
            "net9": "ea:c7:0f:19:97:be"
        },
        "leaf_1_0_3": {
            "net0": "46:7b:83:73:b9:bf",
            "net1": "02:c6:86:60:d8:89",
            "net10": "f2:fb:0b:f0:db:b6",
            "net11": "e2:0b:84:6b:b6:c6",
            "net12": "d6:d3:a6:72:83:b7",
            "net13": "82:21:3e:e3:59:78",
            "net14": "2e:de:1e:27:4d:36",
            "net2": "92:13:cd:8c:7f:56",
            "net3": "6a:c9:06:5f:3c:7c",
            "net4": "fa:e8:57:3e:f1:bb",
            "net5": "ce:22:94:03:fe:f2",
            "net6": "da:12:40:b9:0e:37",
            "net7": "fa:82:df:bd:b1:81",
            "net8": "22:f7:8c:b5:3c:7d",
            "net9": "1a:85:da:fd:ae:cf"
        },
        "leaf_1_0_4": {
            "net0": "4e:02:d2:4e:77:1a",
            "net1": "22:f6:f5:40:42:8d",
            "net10": "ae:54:4c:a1:7b:30",
            "net11": "96:f3:d6:82:71:2a",
            "net12": "6a:d6:28:ba:ce:ff",
            "net13": "2a:58:c6:bf:46:4d",
            "net14": "12:e1:48:09:39:a5",
            "net2": "82:53:aa:fc:fb:cf",
            "net3": "f6:91:3e:c6:be:6d",
            "net4": "e6:89:b4:3c:70:df",
            "net5": "ea:49:9d:50:d8:0a",
            "net6": "ee:3b:ea:70:b1:ca",
            "net7": "8a:62:3c:e8:57:68",
            "net8": "12:80:e8:68:e0:7e",
            "net9": "ae:59:90:1f:4d:2f"
        },
        "leaf_1_0_5": {
            "net0": "76:65:11:c8:b2:ac",
            "net1": "72:69:25:05:8a:a9",
            "net10": "ce:f9:5d:cd:c3:9d",
            "net11": "1a:14:3d:c1:17:f6",
            "net12": "b2:a8:7f:50:25:4b",
            "net13": "ba:78:3b:9e:10:6f",
            "net14": "66:47:d1:0f:ca:22",
            "net2": "6e:ad:64:cb:e1:01",
            "net3": "2a:d7:d9:0c:eb:05",
            "net4": "56:96:9c:e1:22:15",
            "net5": "6a:ef:cb:a7:cc:05",
            "net6": "22:0b:5f:3d:04:e9",
            "net7": "7a:af:25:89:d6:3b",
            "net8": "56:7c:3a:cf:9d:aa",
            "net9": "12:0b:28:c4:2b:33"
        },
        "leaf_1_0_6": {
            "net0": "a2:32:79:c1:ce:c4",
            "net1": "aa:3e:dd:51:5c:e2",
            "net10": "ea:22:4b:c4:c3:49",
            "net11": "06:95:6c:70:34:8c",
            "net12": "2e:20:52:c0:c4:7b",
            "net13": "06:8e:4c:ea:a0:f2",
            "net14": "9a:a0:1e:9f:96:b0",
            "net2": "ce:62:31:e1:fb:ed",
            "net3": "5e:cc:22:36:f3:ca",
            "net4": "1a:7a:61:df:dd:7f",
            "net5": "e2:59:be:b8:38:9a",
            "net6": "de:18:e6:78:58:21",
            "net7": "02:42:e7:b7:1e:27",
            "net8": "3e:0d:bd:19:22:9d",
            "net9": "ee:f6:72:b9:b6:0c"
        },
        "leaf_1_0_7": {
            "net0": "d6:8d:26:c5:04:1a",
            "net1": "e6:88:39:c0:11:a9",
            "net10": "5a:a1:60:e7:4a:6b",
            "net11": "c2:16:e4:da:ca:db",
            "net12": "56:c2:c8:9b:7f:ca",
            "net13": "46:4d:86:16:9d:36",
            "net14": "5a:a8:6d:c3:c3:21",
            "net2": "7a:c4:38:a5:d9:e9",
            "net3": "e2:ae:46:63:e4:56",
            "net4": "46:fc:41:74:01:af",
            "net5": "ae:c8:1b:52:6c:7b",
            "net6": "d2:ed:68:74:32:c2",
            "net7": "7e:53:09:ed:bb:e4",
            "net8": "3a:64:93:be:e2:b7",
            "net9": "9a:30:dd:eb:d9:c7"
        },
        "leaf_1_0_8": {
            "net0": "4e:57:4f:cd:3d:18",
            "net1": "2a:75:36:e5:69:d4",
            "net10": "d6:a3:d0:54:37:c4",
            "net11": "fa:6e:f4:95:7e:ae",
            "net12": "ae:71:ab:93:bd:26",
            "net13": "42:29:3e:9d:45:16",
            "net14": "e2:88:b3:b8:ab:fb",
            "net2": "fe:11:ef:3e:0d:f5",
            "net3": "ee:1c:b9:ec:19:2e",
            "net4": "3a:02:74:78:fd:d1",
            "net5": "16:18:8e:72:13:a3",
            "net6": "a6:e5:f2:d5:0d:98",
            "net7": "ee:27:b2:69:de:e5",
            "net8": "ba:3d:23:b6:98:bd",
            "net9": "4e:8e:d3:74:8b:f0"
        },
        "leaf_1_0_9": {
            "net0": "86:c9:48:ef:58:aa",
            "net1": "72:66:ab:17:36:04",
            "net10": "f2:98:b8:c2:23:16",
            "net11": "5a:34:47:09:c7:61",
            "net12": "5e:71:c3:fe:44:06",
            "net13": "4e:4a:06:c9:4d:27",
            "net14": "c2:d7:02:12:59:ea",
            "net2": "12:e7:ca:e5:63:41",
            "net3": "52:63:f3:30:a5:92",
            "net4": "82:52:e9:19:92:af",
            "net5": "ea:70:09:d4:a5:2f",
            "net6": "1a:89:bd:c7:ea:af",
            "net7": "26:11:7e:6e:9f:a4",
            "net8": "ce:98:bc:07:10:be",
            "net9": "b6:d7:1f:7f:14:db"
        },
        "leaf_2_0_1": {
            "net0": "fa:60:0e:c2:44:50",
            "net1": "52:90:56:fd:e7:88",
            "net10": "96:16:da:b1:09:a7",
            "net11": "12:36:4c:b8:d2:6d",
            "net12": "76:63:d2:08:b0:a1",
            "net13": "5a:48:7b:41:c7:3b",
            "net14": "d2:c9:a4:f2:c5:75",
            "net2": "02:03:52:3f:ae:be",
            "net3": "ce:53:4d:54:bc:34",
            "net4": "2a:0f:f8:55:70:e7",
            "net5": "8a:fa:e1:5e:5c:f9",
            "net6": "ee:7e:3a:72:04:90",
            "net7": "36:41:f2:79:64:1f",
            "net8": "62:e1:81:07:7d:74",
            "net9": "d2:72:b7:b4:7d:14"
        },
        "leaf_2_0_10": {
            "net0": "26:a7:a9:11:95:fd",
            "net1": "06:24:09:3e:71:2e",
            "net10": "aa:4d:49:eb:49:42",
            "net11": "ce:b4:12:13:5f:ac",
            "net12": "ae:01:16:fb:5b:ab",
            "net13": "96:ea:27:46:42:d1",
            "net14": "56:a2:30:85:33:84",
            "net2": "a2:58:33:83:f0:42",
            "net3": "be:a7:0a:ed:dc:c8",
            "net4": "96:55:84:7c:bb:15",
            "net5": "de:5c:92:ef:9e:f0",
            "net6": "32:d9:9b:02:aa:20",
            "net7": "76:5e:cd:0f:cd:32",
            "net8": "66:18:e0:1e:b8:fc",
            "net9": "d6:16:98:cf:6a:a9"
        },
        "leaf_2_0_11": {
            "net0": "3e:94:56:37:f3:08",
            "net1": "d2:ac:c0:e1:6a:44",
            "net10": "72:d9:2f:77:09:ce",
            "net11": "5e:77:69:d0:dc:31",
            "net12": "ee:30:c2:b3:b8:38",
            "net13": "0e:fe:72:e2:94:ab",
            "net14": "d6:e2:d5:ac:a5:e4",
            "net2": "1e:8f:d3:f3:29:2b",
            "net3": "86:66:e9:7e:b9:75",
            "net4": "86:18:30:92:87:c2",
            "net5": "b6:a7:fc:54:e0:85",
            "net6": "6e:0a:e1:f0:db:eb",
            "net7": "b2:55:78:b9:c9:c9",
            "net8": "ba:ab:ca:02:57:c6",
            "net9": "52:a0:5d:f4:2c:0b"
        },
        "leaf_2_0_12": {
            "net0": "0a:8c:a9:1f:82:81",
            "net1": "4a:75:6c:65:bd:4a",
            "net10": "22:dd:de:d4:03:81",
            "net11": "a2:98:a2:5f:fb:c1",
            "net12": "72:24:54:e4:0c:af",
            "net13": "22:c9:14:bc:31:cf",
            "net14": "e6:9a:22:a3:88:15",
            "net2": "36:ad:8e:c9:00:c3",
            "net3": "f6:ee:34:8e:02:5c",
            "net4": "76:d4:0e:7e:e0:18",
            "net5": "12:94:e7:6a:a5:ce",
            "net6": "86:0e:2f:00:90:c0",
            "net7": "fe:13:cf:f2:2d:38",
            "net8": "06:d3:12:f4:fa:06",
            "net9": "12:8f:80:ee:22:91"
        },
        "leaf_2_0_13": {
            "net0": "ba:6f:6e:c9:40:9c",
            "net1": "5a:f3:d2:57:64:e7",
            "net10": "0e:cf:74:74:0a:bf",
            "net11": "5a:f7:bf:7e:16:e3",
            "net12": "32:df:aa:93:fe:2a",
            "net13": "ce:4a:26:cb:5c:32",
            "net14": "ce:e8:b7:71:66:6a",
            "net2": "46:07:c6:22:72:50",
            "net3": "fe:18:db:45:70:cf",
            "net4": "56:bc:c1:03:1c:af",
            "net5": "12:c5:b6:8b:c0:25",
            "net6": "02:25:3b:a1:ea:27",
            "net7": "8e:b2:18:b2:2b:ae",
            "net8": "26:53:43:6e:39:8f",
            "net9": "5a:d1:34:de:35:3b"
        },
        "leaf_2_0_14": {
            "net0": "36:86:81:6a:b9:13",
            "net1": "ee:1e:25:02:65:72",
            "net10": "76:f4:41:d9:93:86",
            "net11": "6a:74:0a:65:90:b1",
            "net12": "7a:48:57:f1:db:7a",
            "net13": "36:de:66:7c:bd:f7",
            "net14": "e6:e5:1a:c0:66:31",
            "net2": "b6:60:2b:a4:b5:12",
            "net3": "f6:f9:14:6c:40:09",
            "net4": "be:c3:1f:4f:24:60",
            "net5": "22:fe:ff:8a:b7:bb",
            "net6": "6e:f1:6e:77:75:6c",
            "net7": "56:16:ea:b9:30:9c",
            "net8": "5e:9a:59:66:a3:87",
            "net9": "ea:06:3a:f6:c5:a1"
        },
        "leaf_2_0_2": {
            "net0": "0a:9b:24:ff:e7:95",
            "net1": "d2:15:bb:a4:63:09",
            "net10": "3a:87:bb:52:cb:30",
            "net11": "ca:83:36:2e:62:98",
            "net12": "c6:7e:b3:b3:4b:a5",
            "net13": "0e:42:ee:2a:01:1e",
            "net14": "ca:f3:0a:96:14:92",
            "net2": "da:7e:5d:85:db:ff",
            "net3": "d6:0d:ac:39:96:bc",
            "net4": "32:86:8f:98:b8:2a",
            "net5": "6a:0a:23:3e:27:6c",
            "net6": "6e:4b:4c:7f:63:30",
            "net7": "42:d9:f3:c4:d3:eb",
            "net8": "fa:2b:5b:34:cb:ea",
            "net9": "ca:50:16:d1:cb:c7"
        },
        "leaf_2_0_3": {
            "net0": "46:72:fc:d8:50:6f",
            "net1": "b2:ff:e0:4d:b7:b8",
            "net10": "ae:94:1f:d8:9e:62",
            "net11": "5e:03:d0:eb:fa:80",
            "net12": "d6:0b:95:28:d8:b7",
            "net13": "d6:c9:80:16:1f:21",
            "net14": "b2:7d:2b:a2:a1:d7",
            "net2": "12:3f:3a:73:02:86",
            "net3": "62:27:6a:c2:7d:89",
            "net4": "ba:a8:d8:41:f5:37",
            "net5": "86:93:75:e6:13:c1",
            "net6": "72:ae:66:5d:5f:ac",
            "net7": "d6:58:0c:06:0e:6f",
            "net8": "7e:f1:0c:cd:91:3c",
            "net9": "06:2c:51:70:3d:95"
        },
        "leaf_2_0_4": {
            "net0": "c6:83:57:9d:a8:bf",
            "net1": "9e:2d:3f:4f:70:75",
            "net10": "e2:77:ca:53:30:a2",
            "net11": "7a:6b:31:b3:4b:d2",
            "net12": "ae:8b:04:21:d5:1d",
            "net13": "72:d4:5f:a7:8a:d7",
            "net14": "2e:eb:cb:c3:52:df",
            "net2": "2e:33:aa:c8:7c:29",
            "net3": "2e:4f:02:66:15:4a",
            "net4": "6a:35:c6:7c:5c:87",
            "net5": "f6:1b:95:4b:fc:3f",
            "net6": "6e:99:86:8f:3b:f4",
            "net7": "a2:ba:50:c6:01:f1",
            "net8": "aa:84:39:9b:55:f4",
            "net9": "fe:36:88:af:cb:c8"
        },
        "leaf_2_0_5": {
            "net0": "96:84:98:ee:a1:cd",
            "net1": "9e:d2:85:c3:c7:52",
            "net10": "96:1d:06:81:07:55",
            "net11": "6a:a3:16:f9:c5:2d",
            "net12": "0a:a1:90:51:56:79",
            "net13": "f2:49:65:1e:b6:af",
            "net14": "b2:3b:70:02:1e:7c",
            "net2": "e2:47:56:a6:03:bf",
            "net3": "72:bb:88:0c:04:35",
            "net4": "8a:40:3f:ff:0e:38",
            "net5": "b6:d0:7b:85:84:5c",
            "net6": "ee:e2:14:60:4f:2c",
            "net7": "36:38:01:c5:76:8d",
            "net8": "da:f0:f3:92:96:fb",
            "net9": "0e:f0:d4:66:f6:a7"
        },
        "leaf_2_0_6": {
            "net0": "d2:4a:8f:f8:56:9d",
            "net1": "66:86:1f:f8:6d:08",
            "net10": "2a:bf:ab:05:e3:56",
            "net11": "36:db:9f:82:7a:c3",
            "net12": "c6:ec:d5:29:b0:73",
            "net13": "9a:91:be:ac:39:1c",
            "net14": "e6:e6:1e:62:bd:58",
            "net2": "6e:71:27:24:03:2b",
            "net3": "ea:5c:d2:38:e5:b5",
            "net4": "6a:7b:bf:94:a2:b9",
            "net5": "c2:95:46:11:61:fc",
            "net6": "be:18:5d:aa:cd:12",
            "net7": "b2:28:e4:cc:a1:3c",
            "net8": "4a:96:5e:d0:5f:12",
            "net9": "4a:b5:c3:e9:87:47"
        },
        "leaf_2_0_7": {
            "net0": "92:46:18:c2:f3:12",
            "net1": "f6:d8:fc:de:1a:83",
            "net10": "b2:8a:8f:cc:b9:8c",
            "net11": "8e:40:25:a0:30:b5",
            "net12": "c6:2a:53:aa:26:30",
            "net13": "e6:11:7b:32:39:ce",
            "net14": "b2:dc:19:3f:48:16",
            "net2": "26:c7:97:25:81:55",
            "net3": "2e:34:fe:e4:a4:23",
            "net4": "36:f3:80:27:73:13",
            "net5": "e6:56:6b:1b:fe:09",
            "net6": "d6:de:7e:b9:32:7d",
            "net7": "92:6a:61:e4:8b:2c",
            "net8": "e6:09:f3:c4:b7:79",
            "net9": "3e:b2:a3:75:2b:c6"
        },
        "leaf_2_0_8": {
            "net0": "aa:1c:8c:d2:ff:bc",
            "net1": "1a:fd:a7:de:ed:60",
            "net10": "32:cd:e0:ba:11:a8",
            "net11": "1e:af:d3:81:e9:fa",
            "net12": "26:b0:68:bf:19:29",
            "net13": "f2:c2:51:0b:dd:a7",
            "net14": "ba:a5:63:66:88:48",
            "net2": "e2:43:a6:f5:b2:17",
            "net3": "c2:56:4b:7a:d3:7e",
            "net4": "ce:45:db:31:99:1b",
            "net5": "52:3c:ee:11:19:d2",
            "net6": "b6:64:d3:a2:f8:2b",
            "net7": "f2:44:78:ff:3a:db",
            "net8": "76:cb:e7:5e:e0:54",
            "net9": "b2:22:2f:93:18:10"
        },
        "leaf_2_0_9": {
            "net0": "b2:22:ef:5f:91:9d",
            "net1": "ca:6c:29:cb:15:4b",
            "net10": "f2:dc:bc:21:e7:0e",
            "net11": "9e:6a:e3:12:60:91",
            "net12": "62:34:86:60:41:03",
            "net13": "86:7b:79:7f:7f:82",
            "net14": "b2:22:2e:f5:92:2d",
            "net2": "22:9c:1f:b6:7b:77",
            "net3": "8e:e9:0f:aa:16:3a",
            "net4": "52:22:d4:79:b8:56",
            "net5": "ea:f5:dc:45:e2:ae",
            "net6": "3e:32:8b:89:b0:d0",
            "net7": "4e:5b:a0:d7:cb:f2",
            "net8": "da:8c:1e:72:40:f0",
            "net9": "e6:8c:65:08:a3:df"
        },
        "spine_1_1_1": {
            "net0": "1e:38:6c:74:ae:f6",
            "net1": "e6:51:59:98:8f:b7",
            "net10": "0e:42:b3:61:0c:dc",
            "net11": "f6:41:5d:3d:e3:06",
            "net12": "82:81:f3:a9:d8:7b",
            "net13": "82:a4:10:39:87:6f",
            "net14": "82:41:98:0c:51:94",
            "net15": "36:23:9b:c9:47:77",
            "net16": "32:c3:56:c0:dc:40",
            "net17": "26:0e:1a:40:da:2b",
            "net18": "be:62:b8:8e:0a:8a",
            "net19": "5a:85:40:b6:72:0b",
            "net2": "76:86:fe:b1:ba:19",
            "net20": "72:a4:ad:21:61:c5",
            "net21": "d6:46:87:aa:50:7e",
            "net22": "02:41:b9:46:b8:1e",
            "net23": "3a:fb:f3:f7:54:37",
            "net24": "16:e7:2b:91:7d:50",
            "net25": "d2:cd:99:52:e5:b4",
            "net26": "16:cd:6b:9f:37:71",
            "net27": "9e:2a:2b:4d:57:7d",
            "net3": "da:75:7b:48:6a:a5",
            "net4": "d6:05:2a:b8:20:e2",
            "net5": "86:c4:80:39:a0:4d",
            "net6": "12:a5:b8:84:1d:39",
            "net7": "12:c7:2c:ac:03:54",
            "net8": "8e:c1:b0:79:5c:28",
            "net9": "06:07:22:ef:a3:f6"
        },
        "spine_1_1_10": {
            "net0": "0e:08:85:53:d4:2a",
            "net1": "46:3f:83:2f:81:b9",
            "net10": "66:2d:f2:74:76:c5",
            "net11": "f2:4a:d1:c6:e2:ce",
            "net12": "c6:18:97:33:18:af",
            "net13": "8e:7d:7a:03:e2:d2",
            "net14": "26:0f:74:e9:56:75",
            "net15": "da:f0:0c:31:61:da",
            "net16": "96:57:ed:13:43:9f",
            "net17": "66:cc:eb:5a:c3:a6",
            "net18": "e6:fa:bb:5c:3d:d1",
            "net19": "96:f1:3c:0a:3f:32",
            "net2": "26:6c:9b:76:c0:02",
            "net20": "52:72:31:ad:56:af",
            "net21": "aa:77:fe:cd:11:69",
            "net22": "e6:c6:83:b4:f1:69",
            "net23": "26:77:51:f0:78:36",
            "net24": "aa:57:69:33:41:44",
            "net25": "46:b0:78:4a:9f:f9",
            "net26": "32:c3:fb:c5:06:76",
            "net27": "c2:ba:4f:69:68:06",
            "net3": "f2:60:8b:6c:7c:98",
            "net4": "0e:8a:18:7c:cb:ef",
            "net5": "ee:2f:26:51:00:1c",
            "net6": "9a:d7:c1:a7:3f:9b",
            "net7": "c2:ed:83:26:bd:72",
            "net8": "8e:2f:0b:25:59:21",
            "net9": "0e:dd:d3:8f:ab:6f"
        },
        "spine_1_1_11": {
            "net0": "c2:9f:01:47:4a:51",
            "net1": "76:5e:95:c6:92:6b",
            "net10": "9a:89:f1:7f:55:e8",
            "net11": "82:3e:9b:d8:15:27",
            "net12": "36:3f:9d:dd:35:05",
            "net13": "ae:0d:38:d9:c6:2a",
            "net14": "aa:7c:f2:a7:ba:f4",
            "net15": "d6:90:c8:ee:30:6f",
            "net16": "fe:bd:92:ac:f3:b4",
            "net17": "72:9b:d0:8f:08:1a",
            "net18": "de:44:42:33:bf:da",
            "net19": "e2:89:42:62:b6:b4",
            "net2": "7a:79:92:6c:a3:45",
            "net20": "4a:3c:69:bf:7c:31",
            "net21": "66:17:75:f3:06:c4",
            "net22": "f6:ed:af:ed:c1:ab",
            "net23": "fa:45:89:fa:3d:f1",
            "net24": "4a:2a:8c:12:f4:26",
            "net25": "02:0e:5f:ea:0c:33",
            "net26": "26:92:e9:c5:69:55",
            "net27": "82:80:36:c0:54:e2",
            "net3": "76:3c:4e:41:39:0b",
            "net4": "3e:ac:85:91:cb:19",
            "net5": "8e:af:49:83:49:7e",
            "net6": "aa:1e:d6:d2:b9:cd",
            "net7": "6a:63:d7:d6:11:da",
            "net8": "46:7d:3e:24:94:15",
            "net9": "22:c9:20:5e:7a:85"
        },
        "spine_1_1_12": {
            "net0": "86:b0:45:03:33:3f",
            "net1": "52:e4:5e:14:12:65",
            "net10": "9a:c0:17:98:51:c6",
            "net11": "ee:17:6b:69:ae:e6",
            "net12": "e2:18:23:ff:d6:ba",
            "net13": "de:e2:22:90:ea:db",
            "net14": "c2:51:b4:65:c1:6d",
            "net15": "3a:29:0a:73:89:6a",
            "net16": "66:89:6b:cb:ab:da",
            "net17": "b6:5e:25:b5:18:6f",
            "net18": "2a:15:1f:e9:fe:7b",
            "net19": "26:31:d7:8c:db:ce",
            "net2": "a6:f8:2e:3f:13:f0",
            "net20": "b2:66:66:f1:22:d6",
            "net21": "82:39:53:10:f7:96",
            "net22": "7e:79:ff:3a:2e:d2",
            "net23": "96:c2:e8:be:9f:12",
            "net24": "6a:32:65:5e:38:c4",
            "net25": "8e:cc:bf:0f:28:46",
            "net26": "de:19:cf:f7:05:50",
            "net27": "9a:83:47:34:ea:28",
            "net3": "96:f3:3f:90:26:b6",
            "net4": "02:45:46:88:76:55",
            "net5": "ae:12:0d:60:9d:28",
            "net6": "4e:e9:f6:6a:16:23",
            "net7": "aa:e9:4f:2a:db:5e",
            "net8": "76:eb:df:a3:94:bc",
            "net9": "ba:4e:d2:99:0a:a1"
        },
        "spine_1_1_13": {
            "net0": "ae:18:18:18:ba:ab",
            "net1": "ae:2e:e8:df:5e:2e",
            "net10": "a2:fd:54:60:a0:a9",
            "net11": "f6:60:db:18:04:a2",
            "net12": "e6:9e:59:e2:40:62",
            "net13": "2e:4a:04:80:81:36",
            "net14": "86:ac:50:85:07:60",
            "net15": "8e:e4:52:6b:b6:ba",
            "net16": "22:83:b8:ad:30:5c",
            "net17": "ea:f3:c5:01:55:b4",
            "net18": "de:68:a6:af:b3:fb",
            "net19": "e6:e7:67:0b:69:d6",
            "net2": "ca:ff:d8:77:cf:da",
            "net20": "de:41:11:51:5d:83",
            "net21": "d6:3a:bc:f9:21:ff",
            "net22": "e6:63:a8:3b:12:d0",
            "net23": "ce:98:bd:fd:53:c2",
            "net24": "26:39:a7:a0:ab:76",
            "net25": "66:34:f4:f0:8d:61",
            "net26": "fe:30:c0:b6:03:1b",
            "net27": "7e:7b:b0:7a:7d:4f",
            "net3": "7a:0e:4f:04:c5:30",
            "net4": "6e:6e:bd:39:27:86",
            "net5": "9e:48:e8:52:8e:e4",
            "net6": "7a:e8:ef:fc:29:da",
            "net7": "4a:44:79:92:5b:8b",
            "net8": "7a:eb:74:7a:46:48",
            "net9": "12:72:e7:d7:3c:3d"
        },
        "spine_1_1_14": {
            "net0": "56:8e:3d:71:d4:7a",
            "net1": "62:3e:97:20:19:44",
            "net10": "3a:61:37:de:28:45",
            "net11": "1a:07:32:e4:c2:e7",
            "net12": "ce:c8:59:cc:c7:31",
            "net13": "de:3c:76:60:c7:dc",
            "net14": "e2:0b:a6:c2:dd:0b",
            "net15": "42:a7:1c:cf:08:56",
            "net16": "92:cd:97:f4:ce:01",
            "net17": "46:b2:ff:bb:64:11",
            "net18": "82:8d:d0:e2:c0:06",
            "net19": "ba:e4:93:2a:c5:9b",
            "net2": "a2:9a:de:b1:90:d3",
            "net20": "36:e2:9f:a4:55:aa",
            "net21": "b2:91:be:08:ea:dc",
            "net22": "ea:53:0e:80:a7:24",
            "net23": "aa:5b:79:a4:81:d4",
            "net24": "26:ab:81:57:36:7f",
            "net25": "16:60:64:ae:e1:18",
            "net26": "22:2f:33:6c:9c:fa",
            "net27": "be:04:05:6e:45:65",
            "net3": "ce:c1:9b:d1:96:12",
            "net4": "c2:0b:60:05:93:18",
            "net5": "5a:15:48:90:c5:18",
            "net6": "26:02:bc:3f:0f:2d",
            "net7": "16:94:9d:a4:67:27",
            "net8": "32:ca:06:5e:ef:6b",
            "net9": "22:8d:00:9e:28:fa"
        },
        "spine_1_1_2": {
            "net0": "3a:4b:41:87:a8:f9",
            "net1": "0e:a9:ba:f3:84:20",
            "net10": "82:e3:a6:c3:71:da",
            "net11": "32:b1:de:9f:c7:94",
            "net12": "76:92:a3:99:8c:c5",
            "net13": "fa:f3:a8:ef:e4:62",
            "net14": "96:6d:32:00:6c:79",
            "net15": "ee:7d:76:ff:c2:13",
            "net16": "ee:d1:3e:f8:2d:82",
            "net17": "d6:43:53:5a:71:ef",
            "net18": "0a:b2:f0:2d:b3:50",
            "net19": "de:bb:dc:ba:00:60",
            "net2": "f2:8d:33:f7:85:3e",
            "net20": "66:f0:ad:a9:0a:99",
            "net21": "52:3a:07:04:f5:9d",
            "net22": "0a:ff:73:de:09:6c",
            "net23": "b6:b4:f4:f3:67:9c",
            "net24": "6e:04:a1:0f:77:5b",
            "net25": "7a:a4:ec:dc:78:a2",
            "net26": "fa:91:65:a1:e9:63",
            "net27": "6a:e4:8c:4c:71:17",
            "net3": "76:85:bf:b3:32:ae",
            "net4": "52:7b:72:0a:2b:6f",
            "net5": "d2:2a:24:af:10:5a",
            "net6": "f6:50:20:18:1b:3d",
            "net7": "2a:f8:bc:d6:77:ca",
            "net8": "96:02:72:92:1f:8a",
            "net9": "f6:59:31:c6:e0:c8"
        },
        "spine_1_1_3": {
            "net0": "6a:ba:7e:27:ad:80",
            "net1": "da:96:f0:56:4e:6a",
            "net10": "82:3c:a8:c7:d2:4b",
            "net11": "42:91:27:c1:11:35",
            "net12": "06:f4:13:58:b9:35",
            "net13": "fa:d1:f5:2c:81:79",
            "net14": "fa:d0:6c:db:aa:3a",
            "net15": "3a:14:7d:9e:25:46",
            "net16": "5a:92:5d:07:22:66",
            "net17": "9a:79:d1:38:81:4b",
            "net18": "6a:17:28:53:ac:e2",
            "net19": "66:0b:7b:e7:15:d8",
            "net2": "52:bf:1e:7a:a7:35",
            "net20": "02:f0:fb:1f:7d:9a",
            "net21": "ea:03:ac:eb:44:f7",
            "net22": "aa:75:7d:30:a1:b9",
            "net23": "3e:a6:91:8b:0e:99",
            "net24": "3e:47:90:73:9a:6f",
            "net25": "2e:08:2d:6c:91:fe",
            "net26": "46:04:ea:6e:9d:1e",
            "net27": "52:aa:00:bf:dd:ee",
            "net3": "22:12:11:25:74:fd",
            "net4": "6a:4f:3a:14:2f:7f",
            "net5": "12:52:5b:d4:f7:99",
            "net6": "b2:60:ea:25:ef:22",
            "net7": "36:88:47:b1:82:23",
            "net8": "ae:f0:84:ee:9e:ee",
            "net9": "fe:35:f3:6f:ab:55"
        },
        "spine_1_1_4": {
            "net0": "c2:d3:26:b7:8b:16",
            "net1": "92:44:d2:e8:a9:7b",
            "net10": "62:bf:96:5e:41:b8",
            "net11": "1e:12:0d:4b:13:4d",
            "net12": "2e:df:bb:5a:ed:d9",
            "net13": "12:57:9b:12:0a:b3",
            "net14": "c6:e8:28:c9:e9:b5",
            "net15": "72:d5:73:f3:98:dd",
            "net16": "ae:8d:54:58:ac:b7",
            "net17": "ce:af:db:ea:16:39",
            "net18": "56:02:5d:94:90:bb",
            "net19": "d6:04:1b:b0:ec:90",
            "net2": "62:3d:63:af:08:61",
            "net20": "02:f0:53:e0:48:3c",
            "net21": "1e:9f:31:86:28:7e",
            "net22": "32:4c:73:92:fb:5d",
            "net23": "36:b6:2c:08:65:53",
            "net24": "e2:f2:b8:d0:c3:08",
            "net25": "ea:64:1b:76:fe:da",
            "net26": "22:92:e7:83:51:d6",
            "net27": "46:35:da:9d:f2:ff",
            "net3": "ae:ca:f4:09:c4:f9",
            "net4": "16:e2:85:df:64:87",
            "net5": "ee:60:6e:8d:b9:d0",
            "net6": "96:6d:73:f0:d8:a9",
            "net7": "aa:ea:aa:2f:c8:53",
            "net8": "ce:93:71:c1:9f:fe",
            "net9": "46:dd:d6:db:a8:13"
        },
        "spine_1_1_5": {
            "net0": "7a:1f:c5:5f:e2:1d",
            "net1": "12:f9:31:0d:58:c2",
            "net10": "0e:db:48:e0:2c:7a",
            "net11": "92:75:1d:04:19:43",
            "net12": "c6:4f:74:c0:94:09",
            "net13": "26:49:21:0b:f9:75",
            "net14": "aa:bc:dd:6f:d6:27",
            "net15": "2a:79:9d:71:e5:63",
            "net16": "72:c3:2b:94:d8:b7",
            "net17": "1a:59:fb:ce:ef:24",
            "net18": "8a:b4:df:d2:80:b9",
            "net19": "d6:a1:6e:ab:5b:d6",
            "net2": "d2:44:27:02:bb:ef",
            "net20": "a2:84:fd:f4:f7:d8",
            "net21": "9a:93:61:57:5f:bc",
            "net22": "32:76:80:07:c1:da",
            "net23": "66:3b:c5:9a:b5:9f",
            "net24": "9a:43:cf:f0:41:e2",
            "net25": "a2:7a:b8:32:55:03",
            "net26": "aa:bf:43:80:ed:8f",
            "net27": "be:dc:aa:a7:5f:a7",
            "net3": "ea:04:26:40:e4:39",
            "net4": "ca:45:09:5d:eb:ec",
            "net5": "26:3b:0e:e6:e6:cc",
            "net6": "ba:ff:3e:25:11:60",
            "net7": "7a:0d:c9:47:6f:85",
            "net8": "ee:e1:4d:3e:e1:7d",
            "net9": "7a:84:de:0e:f9:12"
        },
        "spine_1_1_6": {
            "net0": "56:b7:bf:20:d6:03",
            "net1": "42:c9:9d:09:a3:99",
            "net10": "b6:b9:f5:57:9a:0d",
            "net11": "8a:64:0a:01:bd:9f",
            "net12": "96:e4:ff:d2:97:b3",
            "net13": "6a:16:89:3b:ad:71",
            "net14": "ea:d0:24:f2:09:5b",
            "net15": "7a:9e:74:0f:eb:d3",
            "net16": "36:2c:62:55:79:ca",
            "net17": "52:12:ba:06:c3:23",
            "net18": "06:d3:96:ba:52:07",
            "net19": "b6:fd:4e:12:31:e2",
            "net2": "a6:23:b1:cd:e1:ac",
            "net20": "82:ab:6c:bc:c3:88",
            "net21": "4a:58:e2:44:87:cb",
            "net22": "3e:38:b0:55:11:e6",
            "net23": "42:2d:2a:bb:40:09",
            "net24": "ea:d0:19:fc:43:cd",
            "net25": "06:d4:98:d2:d7:46",
            "net26": "42:99:54:2c:fb:18",
            "net27": "ce:cc:06:c6:6b:35",
            "net3": "f2:02:59:0b:94:fa",
            "net4": "3a:50:62:ce:f1:58",
            "net5": "3a:b2:43:77:fa:21",
            "net6": "6a:fd:7f:55:3a:67",
            "net7": "6a:00:1f:1b:0e:21",
            "net8": "6a:9f:19:b8:4a:8c",
            "net9": "5a:ea:88:ba:6d:a8"
        },
        "spine_1_1_7": {
            "net0": "0a:71:76:b1:6a:88",
            "net1": "0a:27:00:45:06:44",
            "net10": "ca:24:12:85:05:54",
            "net11": "92:63:af:e0:d4:b8",
            "net12": "86:00:20:70:75:b3",
            "net13": "aa:7d:dd:3c:62:4a",
            "net14": "42:86:c2:97:b0:d5",
            "net15": "5e:45:c1:91:e3:9a",
            "net16": "3e:a3:6a:f8:74:b8",
            "net17": "a2:41:ed:7d:57:6e",
            "net18": "d6:50:26:48:b3:6f",
            "net19": "b2:c9:09:8b:99:15",
            "net2": "ca:7c:67:bc:91:e7",
            "net20": "96:15:80:4c:c2:76",
            "net21": "9a:ea:17:f9:0f:1c",
            "net22": "86:3b:98:68:91:eb",
            "net23": "72:7d:01:df:0f:21",
            "net24": "6e:0a:c9:e6:d8:a5",
            "net25": "c2:0c:f5:79:53:0a",
            "net26": "de:95:0e:e0:fb:bf",
            "net27": "6e:bc:68:91:78:ae",
            "net3": "7e:ed:70:01:0d:91",
            "net4": "ce:9a:3c:48:15:d5",
            "net5": "b6:0a:bc:9e:87:2f",
            "net6": "72:73:d4:30:a2:33",
            "net7": "6a:05:8d:91:a6:61",
            "net8": "46:db:c6:43:a5:2e",
            "net9": "ae:96:5c:53:71:a0"
        },
        "spine_1_1_8": {
            "net0": "ee:15:a1:1b:14:e3",
            "net1": "42:32:6a:66:ab:6f",
            "net10": "aa:10:5f:fc:30:eb",
            "net11": "9e:96:78:05:ca:e7",
            "net12": "7a:71:f5:c2:9a:1c",
            "net13": "de:ca:83:64:da:26",
            "net14": "4e:f0:a3:e8:8d:9f",
            "net15": "e2:95:fa:04:83:14",
            "net16": "ce:29:b8:c6:af:7d",
            "net17": "5e:8b:f4:a6:f2:1a",
            "net18": "62:d0:89:4d:6b:ea",
            "net19": "a2:d5:f8:1e:66:61",
            "net2": "26:3a:ec:4c:82:7d",
            "net20": "0a:42:9f:1f:73:dd",
            "net21": "d2:f3:4d:67:ab:79",
            "net22": "26:23:00:e4:7a:ae",
            "net23": "1a:c5:7c:17:c5:05",
            "net24": "32:44:48:92:5c:2d",
            "net25": "72:b8:da:81:96:5e",
            "net26": "3e:af:d3:48:0c:aa",
            "net27": "9a:2a:46:72:4e:25",
            "net3": "1e:95:6a:fc:6e:75",
            "net4": "1e:d3:1d:52:bd:50",
            "net5": "0e:57:ca:6e:0b:ad",
            "net6": "62:0e:af:e8:ad:46",
            "net7": "5a:e0:0e:48:83:fc",
            "net8": "2e:a1:6e:fa:e3:f7",
            "net9": "6e:62:ca:2e:5b:86"
        },
        "spine_1_1_9": {
            "net0": "56:08:35:db:6d:e4",
            "net1": "02:95:6d:86:c5:19",
            "net10": "9e:04:25:c2:ab:64",
            "net11": "ea:00:31:f4:f8:94",
            "net12": "a2:34:3d:50:eb:2a",
            "net13": "36:ce:d6:2a:07:a5",
            "net14": "26:88:5f:29:4e:26",
            "net15": "8a:a9:fe:c8:0f:d0",
            "net16": "c2:d7:00:ea:8a:d5",
            "net17": "9a:f7:da:8c:d8:39",
            "net18": "fe:21:80:44:4c:f7",
            "net19": "b6:ca:4d:07:17:96",
            "net2": "26:1b:51:03:b9:64",
            "net20": "5a:b2:96:0b:e5:f1",
            "net21": "42:8a:2c:d3:e8:b4",
            "net22": "ea:08:5b:87:44:b5",
            "net23": "1a:45:ae:05:3b:8f",
            "net24": "22:a1:d8:b4:9f:3a",
            "net25": "3a:3e:1f:b4:7d:cc",
            "net26": "82:03:dd:dc:a7:c5",
            "net27": "a2:41:7d:03:b5:54",
            "net3": "72:2a:c4:b2:11:70",
            "net4": "1a:c8:ab:8e:89:04",
            "net5": "1e:26:76:10:68:03",
            "net6": "e6:2f:c2:4f:9a:66",
            "net7": "ee:23:65:82:73:28",
            "net8": "42:80:af:39:ab:e6",
            "net9": "42:08:9f:3b:4b:cb"
        },
        "spine_2_1_1": {
            "net0": "62:2e:2c:ea:f2:64",
            "net1": "46:40:b8:bf:dc:99",
            "net10": "fa:22:09:65:e1:78",
            "net11": "96:d4:15:8b:0f:87",
            "net12": "76:11:82:c6:8e:ba",
            "net13": "1e:f7:29:5e:26:20",
            "net14": "8e:2f:ee:6b:f0:2b",
            "net15": "2e:cc:90:2e:3a:9b",
            "net16": "ae:f3:2b:60:20:6d",
            "net17": "a6:26:dc:79:df:33",
            "net18": "12:7a:47:43:10:64",
            "net19": "f2:d4:c0:59:55:4e",
            "net2": "9a:8b:fa:2a:e9:7f",
            "net20": "1a:62:4c:1f:91:68",
            "net21": "42:36:e7:c3:3a:dc",
            "net22": "9a:4c:bf:e8:75:85",
            "net23": "7e:a0:8e:a5:67:1b",
            "net24": "ae:bf:9a:6b:19:73",
            "net25": "82:78:a2:5b:63:74",
            "net26": "62:53:cf:60:0c:f4",
            "net27": "be:c3:7d:ca:0e:cf",
            "net3": "d6:20:31:97:5d:b0",
            "net4": "96:e9:1c:cd:13:1c",
            "net5": "02:36:48:29:a2:e1",
            "net6": "72:db:e8:a4:23:27",
            "net7": "ce:68:7b:4c:b3:06",
            "net8": "0e:34:3a:03:ee:ce",
            "net9": "8e:c1:fa:8d:da:a5"
        },
        "spine_2_1_10": {
            "net0": "66:9b:fb:2b:25:ef",
            "net1": "2e:9d:5a:22:ac:bf",
            "net10": "a6:e7:0d:99:88:48",
            "net11": "76:1c:e9:a7:d1:60",
            "net12": "aa:12:2d:77:a5:4c",
            "net13": "b2:4f:70:dd:77:51",
            "net14": "0a:be:e5:25:ba:f3",
            "net15": "9a:64:70:d0:b1:a7",
            "net16": "be:3e:d2:d2:da:1f",
            "net17": "0e:19:c3:2d:0d:da",
            "net18": "02:c6:40:70:6f:dd",
            "net19": "8e:5c:de:4f:7f:25",
            "net2": "26:b4:21:01:0c:64",
            "net20": "0a:f0:bc:a9:2e:de",
            "net21": "c2:15:81:1a:67:55",
            "net22": "8a:b3:ed:3c:d2:13",
            "net23": "da:f2:db:8e:38:04",
            "net24": "c6:97:81:18:59:69",
            "net25": "da:87:4f:34:63:08",
            "net26": "8e:e8:10:55:d3:56",
            "net27": "d6:1c:f2:9e:d8:67",
            "net3": "3a:9d:6a:d7:15:60",
            "net4": "2a:f5:56:2d:8a:fb",
            "net5": "a2:98:e1:bd:01:ad",
            "net6": "c2:b9:3b:ea:f0:ab",
            "net7": "92:6a:1c:a1:8e:51",
            "net8": "4e:86:d1:22:86:ec",
            "net9": "4e:d4:2c:f6:8d:91"
        },
        "spine_2_1_11": {
            "net0": "d6:8e:a0:61:e0:d0",
            "net1": "f2:cb:93:71:ff:0c",
            "net10": "ee:f1:12:f4:c6:1b",
            "net11": "9a:4b:78:90:48:d8",
            "net12": "36:1d:71:8c:09:a0",
            "net13": "ba:72:1b:60:d0:d4",
            "net14": "46:68:f4:48:79:76",
            "net15": "8e:0d:95:50:c8:5c",
            "net16": "72:98:29:b9:40:40",
            "net17": "76:7a:5a:9e:f9:4e",
            "net18": "86:bb:c7:d5:f6:24",
            "net19": "d6:9f:c9:c5:8e:06",
            "net2": "22:b7:d7:8d:26:17",
            "net20": "ce:98:21:9b:0a:a3",
            "net21": "de:f6:b1:dd:46:9e",
            "net22": "f6:fb:b8:98:04:15",
            "net23": "02:a3:6c:d9:c7:13",
            "net24": "2a:b8:7f:38:4e:75",
            "net25": "1a:a4:33:67:f5:8f",
            "net26": "9e:13:fd:e9:d4:5e",
            "net27": "1e:69:e0:c9:76:c3",
            "net3": "4a:c3:4b:98:dd:6c",
            "net4": "7e:c3:96:14:3a:0a",
            "net5": "ca:f1:40:e9:62:56",
            "net6": "96:2b:e9:52:97:5c",
            "net7": "b6:b2:1f:46:5d:4f",
            "net8": "12:4e:06:0b:99:32",
            "net9": "4a:ef:a0:85:ff:68"
        },
        "spine_2_1_12": {
            "net0": "c6:bf:66:e7:78:d4",
            "net1": "b6:79:e7:02:36:bf",
            "net10": "de:a6:78:0e:37:30",
            "net11": "fe:fc:81:7c:6d:75",
            "net12": "e2:74:48:5c:61:ee",
            "net13": "4e:a9:ef:0a:11:2d",
            "net14": "42:9d:56:72:3a:38",
            "net15": "3e:40:73:d4:fd:fd",
            "net16": "6e:00:e5:a6:f8:f5",
            "net17": "72:19:2a:91:bc:dd",
            "net18": "aa:20:5e:82:59:26",
            "net19": "72:02:9b:e0:ed:16",
            "net2": "9e:b1:86:b2:75:36",
            "net20": "72:e7:26:80:78:81",
            "net21": "d6:ce:cb:10:86:5f",
            "net22": "76:3f:e3:6f:e9:eb",
            "net23": "aa:9c:69:f1:47:ac",
            "net24": "22:89:b2:47:fb:09",
            "net25": "b6:6d:14:fd:31:34",
            "net26": "7a:90:aa:4d:d7:0e",
            "net27": "c6:fe:7f:6f:44:48",
            "net3": "06:2b:26:41:fa:b6",
            "net4": "92:1b:c4:9e:ee:71",
            "net5": "ba:b3:36:61:fa:69",
            "net6": "46:45:d9:4a:9a:18",
            "net7": "8e:8e:28:38:fa:cd",
            "net8": "1e:a0:e5:19:0d:28",
            "net9": "6a:04:42:a8:4b:36"
        },
        "spine_2_1_13": {
            "net0": "52:78:89:c6:df:83",
            "net1": "02:19:c1:70:06:a5",
            "net10": "4e:27:f6:5b:95:e7",
            "net11": "4a:93:c7:14:b7:e8",
            "net12": "12:66:86:55:5b:53",
            "net13": "ce:5e:92:6a:e8:38",
            "net14": "16:63:74:52:32:9f",
            "net15": "7e:fd:71:33:40:19",
            "net16": "12:ae:b9:28:a0:fb",
            "net17": "06:a3:f3:7f:ae:f8",
            "net18": "66:0a:9a:0a:dc:cc",
            "net19": "aa:90:23:0c:f0:e0",
            "net2": "2a:b8:69:0a:a3:63",
            "net20": "06:b3:b0:a3:79:60",
            "net21": "72:3d:b3:1c:f8:33",
            "net22": "ee:0e:c0:d5:4f:4f",
            "net23": "56:8d:af:0a:cd:6b",
            "net24": "d6:54:5c:45:fa:ad",
            "net25": "ee:c5:5c:4c:50:c6",
            "net26": "5a:4a:c9:b3:22:b7",
            "net27": "1a:92:32:f9:39:ec",
            "net3": "56:ba:d0:db:f1:e4",
            "net4": "2a:71:da:93:e0:d6",
            "net5": "86:50:6a:41:3c:a4",
            "net6": "86:29:8b:7c:d9:20",
            "net7": "7a:3d:c4:ab:16:40",
            "net8": "02:70:4d:5f:96:e0",
            "net9": "ba:94:c4:82:b6:2a"
        },
        "spine_2_1_14": {
            "net0": "82:e8:71:29:39:58",
            "net1": "86:ab:08:7a:d5:ce",
            "net10": "36:72:48:03:dc:69",
            "net11": "d2:51:7c:e2:d5:e4",
            "net12": "f2:9b:ac:64:1c:5c",
            "net13": "4a:d1:62:a8:52:66",
            "net14": "f2:46:0f:53:0b:a7",
            "net15": "ca:d7:80:33:b9:23",
            "net16": "82:1f:aa:62:88:9c",
            "net17": "3e:91:ee:9e:cf:b6",
            "net18": "ce:89:4e:16:71:80",
            "net19": "76:3b:f0:c0:2e:f8",
            "net2": "2a:9f:04:4e:14:a1",
            "net20": "72:d7:e6:fc:9c:75",
            "net21": "1e:6a:2a:00:5c:75",
            "net22": "b2:e4:65:70:73:e1",
            "net23": "56:f3:f3:6b:8e:2b",
            "net24": "86:ca:53:90:e4:64",
            "net25": "3a:ee:99:5c:46:f1",
            "net26": "56:57:ec:23:52:42",
            "net27": "c2:47:e5:6e:7f:56",
            "net3": "12:db:b6:ea:02:0f",
            "net4": "16:60:62:c3:d5:e9",
            "net5": "be:76:13:f8:72:8f",
            "net6": "aa:8f:53:b2:7a:d6",
            "net7": "36:c9:43:31:c1:f8",
            "net8": "d2:85:a3:c1:ec:5a",
            "net9": "32:aa:f2:c9:be:13"
        },
        "spine_2_1_2": {
            "net0": "d6:21:ee:5a:57:61",
            "net1": "de:d3:8c:9f:af:43",
            "net10": "da:46:51:d8:aa:e3",
            "net11": "5a:5d:3d:ca:d3:5f",
            "net12": "36:5d:4f:5e:cb:92",
            "net13": "1e:ef:41:59:05:43",
            "net14": "7a:3b:89:9b:b4:95",
            "net15": "3e:87:87:79:e0:cf",
            "net16": "86:e4:ba:b0:d4:76",
            "net17": "3a:a7:6f:7e:a2:7a",
            "net18": "ca:b3:90:61:e6:33",
            "net19": "42:92:03:9f:63:f8",
            "net2": "c2:90:db:5c:ef:b8",
            "net20": "ba:cf:d9:ee:ad:74",
            "net21": "26:5a:8d:d5:2e:28",
            "net22": "b2:37:2d:13:f6:79",
            "net23": "1a:95:75:c7:21:2a",
            "net24": "da:61:db:59:fd:41",
            "net25": "2a:91:0a:7f:4f:49",
            "net26": "4a:04:22:3c:d9:af",
            "net27": "3e:3d:7a:f3:60:e2",
            "net3": "26:3c:ef:aa:6c:9a",
            "net4": "22:d8:9f:ee:7e:7d",
            "net5": "0e:d6:5c:84:aa:ca",
            "net6": "ee:69:db:d0:d3:a5",
            "net7": "6e:f1:25:15:98:d3",
            "net8": "9e:6e:b8:9a:c6:b0",
            "net9": "be:47:89:d1:3a:79"
        },
        "spine_2_1_3": {
            "net0": "ee:1f:45:ae:c1:09",
            "net1": "2e:49:6e:b0:a5:dc",
            "net10": "9a:76:dc:18:5c:9c",
            "net11": "5e:ca:f9:00:5b:23",
            "net12": "62:0e:5b:b1:6b:ee",
            "net13": "6e:d6:cd:e0:da:96",
            "net14": "56:d9:4e:38:34:8f",
            "net15": "5a:b1:a0:c8:de:5d",
            "net16": "7e:f1:ff:f4:b2:f0",
            "net17": "1a:1b:e4:90:f2:78",
            "net18": "02:0e:4d:69:a3:5b",
            "net19": "2e:a5:b9:98:7d:86",
            "net2": "ea:01:d0:d0:fb:b6",
            "net20": "ca:78:d3:69:53:46",
            "net21": "d6:1e:62:3f:e8:c3",
            "net22": "b6:08:99:a3:b0:58",
            "net23": "1a:69:aa:54:d1:88",
            "net24": "6e:f0:54:80:a7:33",
            "net25": "96:65:06:92:2b:bc",
            "net26": "02:0c:f6:2a:e2:6d",
            "net27": "0a:2a:0c:75:e8:b5",
            "net3": "36:7b:9d:22:5d:29",
            "net4": "0a:61:02:c4:5b:70",
            "net5": "76:20:87:a2:6c:43",
            "net6": "72:7c:6c:a4:95:59",
            "net7": "66:fa:11:56:2e:b0",
            "net8": "d2:fd:74:94:27:40",
            "net9": "de:ff:2f:b8:c7:fd"
        },
        "spine_2_1_4": {
            "net0": "ea:db:28:39:18:df",
            "net1": "32:1e:c2:b5:89:d0",
            "net10": "5e:31:93:76:13:4e",
            "net11": "7e:cf:57:bc:4c:44",
            "net12": "ea:0a:10:01:f2:b4",
            "net13": "26:64:29:04:79:01",
            "net14": "2e:59:6a:56:c8:c4",
            "net15": "2a:9a:8d:a6:0d:8e",
            "net16": "da:15:90:8c:01:01",
            "net17": "e2:0e:fd:c4:73:c6",
            "net18": "aa:ee:65:24:f8:c2",
            "net19": "9a:cf:87:82:1f:df",
            "net2": "8a:1f:29:87:84:6a",
            "net20": "5e:0a:e0:eb:5e:51",
            "net21": "aa:3e:aa:c1:ae:02",
            "net22": "8a:88:61:9f:37:eb",
            "net23": "aa:70:9d:90:f2:4d",
            "net24": "12:bc:09:a9:e3:62",
            "net25": "46:c6:32:d8:1c:10",
            "net26": "fa:4b:d0:16:69:42",
            "net27": "9a:37:63:9f:08:ce",
            "net3": "0e:aa:45:c7:62:77",
            "net4": "c6:7d:92:51:2a:d0",
            "net5": "da:6f:c4:4f:88:31",
            "net6": "0e:d7:94:f8:c3:d0",
            "net7": "8e:c0:20:10:17:96",
            "net8": "6e:56:ec:e2:ff:3e",
            "net9": "ce:55:c1:38:4d:d8"
        },
        "spine_2_1_5": {
            "net0": "66:67:a2:da:93:15",
            "net1": "56:8a:76:6e:97:f5",
            "net10": "d6:c8:e5:b3:15:e7",
            "net11": "ea:ba:7c:aa:58:48",
            "net12": "16:49:ce:a5:02:7e",
            "net13": "f6:52:6d:ea:1e:d3",
            "net14": "52:86:1f:92:df:0c",
            "net15": "12:b3:24:fc:39:2c",
            "net16": "a6:11:24:7c:9d:6e",
            "net17": "42:1e:ce:40:9b:b2",
            "net18": "e6:c5:7c:32:78:ba",
            "net19": "ea:bb:d5:dc:a6:31",
            "net2": "fe:28:64:41:19:17",
            "net20": "9a:3d:8f:e0:51:1e",
            "net21": "52:57:bd:a7:97:bd",
            "net22": "12:25:14:22:27:d4",
            "net23": "82:12:af:e9:36:bf",
            "net24": "5a:11:63:a3:d7:57",
            "net25": "86:6f:98:bd:8e:d7",
            "net26": "6a:d6:00:a9:af:35",
            "net27": "fa:3a:72:63:3e:d5",
            "net3": "f2:a4:2a:64:50:06",
            "net4": "ba:5b:51:4a:44:55",
            "net5": "32:da:88:54:b1:76",
            "net6": "0a:7e:ef:1b:87:db",
            "net7": "62:a3:8e:19:b2:73",
            "net8": "ce:c9:91:9f:82:df",
            "net9": "3a:90:8d:4f:9a:7d"
        },
        "spine_2_1_6": {
            "net0": "4e:a8:1c:15:1f:0f",
            "net1": "7a:58:39:c1:ad:ad",
            "net10": "8e:b9:d6:86:11:a5",
            "net11": "b2:f5:66:e3:b0:3a",
            "net12": "1a:7e:16:a5:dd:86",
            "net13": "6a:d3:a7:4d:10:cc",
            "net14": "92:29:2d:3c:82:b9",
            "net15": "ea:9a:a8:6e:0c:15",
            "net16": "ae:27:e2:e8:95:05",
            "net17": "ae:5d:52:70:08:5e",
            "net18": "ae:81:dc:0e:b1:60",
            "net19": "be:74:10:85:cb:6c",
            "net2": "5a:9a:12:49:35:08",
            "net20": "d6:e3:ae:9a:ef:3d",
            "net21": "d6:a6:da:95:b6:06",
            "net22": "de:77:fc:1f:e2:97",
            "net23": "1e:11:38:89:00:99",
            "net24": "42:8e:55:84:a0:ac",
            "net25": "46:e7:6d:a8:86:70",
            "net26": "2e:fe:0a:6f:9e:7b",
            "net27": "fe:01:bc:24:a7:41",
            "net3": "56:a6:f6:c9:07:82",
            "net4": "62:1e:c8:f1:98:15",
            "net5": "1a:f5:53:c3:ad:c2",
            "net6": "8a:c5:0c:3d:85:51",
            "net7": "ca:be:fc:de:c1:32",
            "net8": "e6:9d:32:3e:59:d2",
            "net9": "82:15:6e:fa:76:e2"
        },
        "spine_2_1_7": {
            "net0": "fa:bb:65:af:76:1e",
            "net1": "32:9d:bc:a8:f0:69",
            "net10": "76:4e:3e:22:5a:e7",
            "net11": "9a:8b:f5:12:aa:38",
            "net12": "f6:a5:4d:82:98:07",
            "net13": "66:bf:74:39:c5:ca",
            "net14": "7a:e2:78:bc:cd:60",
            "net15": "32:7f:2e:53:98:35",
            "net16": "8e:5b:24:16:23:4d",
            "net17": "f6:1c:2d:4b:e4:bb",
            "net18": "12:1f:2f:dd:c8:c4",
            "net19": "ba:c2:ac:c1:b4:65",
            "net2": "8e:45:25:6d:61:76",
            "net20": "7e:95:fa:97:2e:81",
            "net21": "ca:ff:39:43:20:bd",
            "net22": "6a:b1:a1:7c:32:32",
            "net23": "26:bb:83:4b:cf:eb",
            "net24": "d2:28:e0:64:a9:b5",
            "net25": "ae:e0:76:b6:80:cd",
            "net26": "4e:5f:0e:21:9e:ac",
            "net27": "92:f5:a0:ee:46:91",
            "net3": "e6:1a:a5:bc:ca:2b",
            "net4": "fe:eb:53:fb:3e:4d",
            "net5": "96:94:3b:cb:1a:61",
            "net6": "4a:55:40:29:59:ba",
            "net7": "16:75:bd:cb:14:a2",
            "net8": "ba:21:29:27:1a:f0",
            "net9": "b6:23:88:52:69:0e"
        },
        "spine_2_1_8": {
            "net0": "92:d9:4d:e4:df:af",
            "net1": "4a:b3:0f:96:bb:e7",
            "net10": "4e:40:b2:7b:28:f6",
            "net11": "a6:72:fb:00:d7:2f",
            "net12": "36:d2:a6:64:59:66",
            "net13": "96:e9:91:04:05:ba",
            "net14": "de:a0:a8:e1:48:28",
            "net15": "0a:aa:a4:c7:ce:11",
            "net16": "16:50:16:a3:20:bd",
            "net17": "f6:8f:78:f4:86:e6",
            "net18": "f2:37:5b:c4:9c:12",
            "net19": "42:2e:da:f3:39:a3",
            "net2": "ca:eb:9e:40:fb:f3",
            "net20": "ca:84:76:d9:56:77",
            "net21": "4a:37:11:85:2d:1b",
            "net22": "f6:e0:89:24:84:92",
            "net23": "32:05:4c:f5:2f:50",
            "net24": "c2:b2:b2:1a:c4:df",
            "net25": "0a:33:41:c8:24:b0",
            "net26": "fe:30:70:7e:64:02",
            "net27": "e2:ac:4b:c5:a5:47",
            "net3": "ba:ec:27:2d:03:08",
            "net4": "e2:cd:0e:16:68:a3",
            "net5": "62:32:5e:74:c0:4b",
            "net6": "de:dc:71:a8:79:e9",
            "net7": "ba:cf:3e:17:e8:03",
            "net8": "fe:2f:58:1b:3c:1f",
            "net9": "16:ac:b2:b2:1d:e6"
        },
        "spine_2_1_9": {
            "net0": "0e:b2:37:b8:4b:ce",
            "net1": "32:1c:94:6a:70:85",
            "net10": "e6:31:d2:b2:0f:ce",
            "net11": "1e:f0:b2:c9:e4:5a",
            "net12": "4a:7e:3d:c6:7c:b4",
            "net13": "ce:db:a4:8c:64:c2",
            "net14": "a6:73:d9:d6:ed:87",
            "net15": "7a:26:1c:01:23:6b",
            "net16": "8a:49:91:e0:47:60",
            "net17": "52:91:fd:60:47:b2",
            "net18": "8a:91:06:91:66:7d",
            "net19": "c2:1c:78:4a:59:21",
            "net2": "da:17:fd:b5:c4:f3",
            "net20": "ee:dc:37:62:2c:74",
            "net21": "be:cb:c1:76:50:d1",
            "net22": "66:19:bb:1e:17:78",
            "net23": "a6:18:8f:09:6b:8a",
            "net24": "ba:04:be:bd:bf:ea",
            "net25": "2e:03:bc:6b:0c:f6",
            "net26": "7a:64:d4:07:f1:e7",
            "net27": "0e:73:a1:7e:51:99",
            "net3": "a2:55:a8:4c:8d:39",
            "net4": "4a:39:6c:73:78:20",
            "net5": "6e:62:5e:1a:a0:d9",
            "net6": "aa:84:47:05:3f:5a",
            "net7": "a6:c6:cc:9c:45:3e",
            "net8": "f6:40:b7:44:52:61",
            "net9": "36:91:86:e3:e8:3b"
        },
        "tof_1_2_1": {
            "net0": "ae:63:90:fa:39:c2",
            "net1": "3a:79:2b:2b:14:30",
            "net10": "82:13:2e:0c:53:b4",
            "net11": "56:b4:11:fb:94:50",
            "net12": "c2:ee:85:93:52:d3",
            "net13": "9e:e7:26:f9:a3:fc",
            "net14": "92:13:e7:b0:f0:ad",
            "net15": "4e:4e:6f:e7:0e:c0",
            "net16": "36:ec:93:cc:16:62",
            "net17": "de:64:93:db:b8:fe",
            "net18": "ae:b7:81:9e:89:5c",
            "net19": "de:c3:55:e5:88:29",
            "net2": "c2:f0:a0:96:60:9b",
            "net20": "f2:a2:ac:cd:a8:7a",
            "net21": "82:79:4d:de:a4:f3",
            "net22": "52:3f:90:53:6c:24",
            "net23": "92:dd:03:34:7a:88",
            "net24": "72:84:dc:c6:b2:be",
            "net25": "b2:37:a9:7b:af:0b",
            "net26": "5e:6b:f6:16:59:81",
            "net27": "ae:6e:a3:92:39:b7",
            "net3": "da:8e:30:bd:c4:70",
            "net4": "a2:73:22:0d:10:e2",
            "net5": "4e:7b:b6:64:05:ab",
            "net6": "a2:d4:8a:96:9c:9e",
            "net7": "62:f2:67:bc:5f:c1",
            "net8": "1e:c8:c5:8e:4c:e9",
            "net9": "fa:57:8f:72:4f:cb"
        },
        "tof_1_2_10": {
            "net0": "06:d2:98:b9:65:99",
            "net1": "56:29:59:75:b7:4b",
            "net10": "ca:33:4b:50:59:e8",
            "net11": "16:97:c5:a9:b2:8d",
            "net12": "ea:b2:de:21:87:38",
            "net13": "2e:e1:08:7a:b8:2d",
            "net14": "da:9d:7c:e3:b1:48",
            "net15": "92:97:5a:64:36:a2",
            "net16": "9e:30:cc:a8:28:44",
            "net17": "c6:f0:56:b7:ab:f6",
            "net18": "1a:39:e8:92:a2:f6",
            "net19": "2e:ed:24:4f:c1:3a",
            "net2": "ae:a8:54:ea:07:1b",
            "net20": "36:ee:06:d6:2f:b1",
            "net21": "7e:89:24:53:8c:30",
            "net22": "da:8a:b8:06:ee:dc",
            "net23": "fe:2c:ec:46:3d:cd",
            "net24": "c6:4c:33:cb:1c:4e",
            "net25": "aa:4d:38:10:fc:21",
            "net26": "76:5c:98:ec:7d:52",
            "net27": "6a:94:3c:09:b6:04",
            "net3": "1e:61:38:c7:6d:7f",
            "net4": "7e:f1:bb:58:ec:7d",
            "net5": "32:3d:e5:80:b4:87",
            "net6": "0e:5a:73:a3:c0:97",
            "net7": "66:d4:9a:64:04:cf",
            "net8": "fa:bf:71:59:1f:18",
            "net9": "f2:88:4a:4a:3e:dd"
        },
        "tof_1_2_11": {
            "net0": "72:ba:12:0e:ce:af",
            "net1": "f2:c2:3a:4a:5e:bf",
            "net10": "62:ba:6f:26:3e:06",
            "net11": "02:13:34:ae:05:af",
            "net12": "1e:ff:20:f1:ed:6e",
            "net13": "d6:c1:3e:43:3b:a8",
            "net14": "be:4d:76:c6:27:1d",
            "net15": "42:06:fc:82:3b:39",
            "net16": "4e:a7:b0:35:98:67",
            "net17": "a2:ca:85:ac:81:eb",
            "net18": "be:61:14:f4:c1:24",
            "net19": "72:03:e0:14:f6:e5",
            "net2": "7e:bf:4c:f6:51:a9",
            "net20": "a2:f8:92:12:e5:8b",
            "net21": "1a:a7:bc:57:52:2a",
            "net22": "46:53:34:1f:c1:8b",
            "net23": "32:15:05:8c:1d:35",
            "net24": "92:b8:30:0c:79:e3",
            "net25": "12:db:db:03:f6:2c",
            "net26": "ae:21:7d:dd:46:24",
            "net27": "0a:1e:71:df:72:5d",
            "net3": "1e:6a:75:14:fe:d2",
            "net4": "2a:07:c4:94:46:2b",
            "net5": "1a:f8:cb:9b:c9:b3",
            "net6": "e6:fc:fb:cf:a3:c6",
            "net7": "82:e5:e7:16:2d:23",
            "net8": "22:3c:8c:cb:24:e3",
            "net9": "b6:f9:31:a1:7c:8c"
        },
        "tof_1_2_12": {
            "net0": "b6:2f:3e:25:8d:fa",
            "net1": "8a:d4:ab:52:16:84",
            "net10": "62:a7:31:fc:88:44",
            "net11": "42:d0:63:34:4c:8f",
            "net12": "2e:46:a1:8b:74:d9",
            "net13": "22:b2:84:9a:1a:a2",
            "net14": "f6:4b:0d:c2:63:3c",
            "net15": "ee:ea:aa:03:89:43",
            "net16": "12:40:08:f1:e2:6a",
            "net17": "36:ad:69:36:98:63",
            "net18": "f6:8f:8f:b8:0d:47",
            "net19": "2e:f3:63:b6:31:69",
            "net2": "b2:95:20:44:d6:0e",
            "net20": "6e:b6:f2:3e:07:4c",
            "net21": "5e:5c:9e:69:44:2c",
            "net22": "da:a5:5f:45:4c:4c",
            "net23": "de:80:05:87:46:dd",
            "net24": "2e:37:95:5d:3f:46",
            "net25": "56:81:f3:fa:97:e3",
            "net26": "02:9f:61:94:81:05",
            "net27": "fa:5d:cc:31:48:17",
            "net3": "f6:ab:b6:99:38:2c",
            "net4": "26:48:25:40:a0:3b",
            "net5": "fa:a2:d3:56:1b:bd",
            "net6": "72:a1:1d:b0:18:c9",
            "net7": "b2:ea:c0:b8:d0:27",
            "net8": "ea:40:b1:91:b1:de",
            "net9": "82:17:b3:31:e5:50"
        },
        "tof_1_2_13": {
            "net0": "02:fd:d5:2c:d2:06",
            "net1": "16:c0:9b:17:78:0b",
            "net10": "da:65:d5:48:54:d7",
            "net11": "72:35:44:9f:4b:c3",
            "net12": "4a:50:73:e3:da:19",
            "net13": "a6:f1:50:55:cf:f8",
            "net14": "32:3d:59:c5:26:90",
            "net15": "52:86:43:8e:c6:ae",
            "net16": "76:9b:f1:5d:9c:2e",
            "net17": "76:88:f4:81:7d:3b",
            "net18": "ce:36:94:a0:bc:9c",
            "net19": "66:80:03:04:53:14",
            "net2": "f2:5f:63:14:03:e4",
            "net20": "ca:0f:34:9a:81:61",
            "net21": "1a:b6:09:22:e4:4b",
            "net22": "ce:d7:42:ff:54:7c",
            "net23": "0e:45:69:e5:46:1e",
            "net24": "0e:18:1e:f7:70:b1",
            "net25": "62:ef:18:2e:5d:a2",
            "net26": "ea:ce:33:72:43:29",
            "net27": "22:01:52:81:b8:14",
            "net3": "12:55:25:4e:a4:10",
            "net4": "0a:f2:f7:ce:e0:05",
            "net5": "86:0f:0d:be:8f:e2",
            "net6": "4e:e4:57:47:7e:5e",
            "net7": "36:ea:b1:a8:dd:a8",
            "net8": "8e:01:21:bc:b5:95",
            "net9": "be:72:db:43:5c:14"
        },
        "tof_1_2_14": {
            "net0": "da:e8:83:7b:86:46",
            "net1": "56:d0:90:37:5f:ca",
            "net10": "86:a3:67:26:9f:55",
            "net11": "8a:ce:9a:17:23:b8",
            "net12": "5a:ee:fb:4e:02:4f",
            "net13": "32:b2:f5:9d:b2:f4",
            "net14": "6a:e3:15:9c:71:75",
            "net15": "8e:6f:9d:f9:46:b2",
            "net16": "c6:70:9d:6e:f8:be",
            "net17": "ea:5a:f5:40:52:f6",
            "net18": "4a:ac:aa:1b:15:24",
            "net19": "16:13:06:84:96:83",
            "net2": "8a:27:37:3f:15:96",
            "net20": "f2:8e:a5:10:72:7c",
            "net21": "32:71:73:53:71:c8",
            "net22": "b6:c4:55:3c:9b:04",
            "net23": "56:de:19:15:cd:ba",
            "net24": "de:7c:36:69:16:e1",
            "net25": "86:ff:cd:7c:14:1a",
            "net26": "3e:28:08:f8:28:61",
            "net27": "06:76:6c:65:1c:0d",
            "net3": "9a:9e:bb:75:85:fd",
            "net4": "1e:01:16:c2:c7:4c",
            "net5": "9e:7b:2b:58:43:66",
            "net6": "a6:45:81:d1:14:d9",
            "net7": "a6:fc:8d:ed:d3:85",
            "net8": "2a:8d:f5:1b:08:93",
            "net9": "22:00:a4:22:14:f1"
        },
        "tof_1_2_2": {
            "net0": "86:31:2c:7b:e8:3d",
            "net1": "72:5b:77:ef:83:94",
            "net10": "f2:d1:d0:62:b0:27",
            "net11": "6e:72:63:c8:0a:4a",
            "net12": "62:88:a3:e0:40:fa",
            "net13": "0e:0f:61:89:26:e4",
            "net14": "16:7d:c0:42:29:ee",
            "net15": "ce:93:d0:87:5e:53",
            "net16": "76:93:b4:00:3e:00",
            "net17": "a6:6d:82:de:04:a8",
            "net18": "52:d1:78:c2:e9:8c",
            "net19": "de:eb:26:53:cc:b6",
            "net2": "6a:ca:f2:e8:31:41",
            "net20": "b6:6b:83:94:13:4b",
            "net21": "06:46:43:da:fd:1c",
            "net22": "ce:c1:73:cd:c3:4c",
            "net23": "9a:62:10:e1:7e:c3",
            "net24": "92:55:1f:35:b9:2c",
            "net25": "66:91:a8:23:dd:83",
            "net26": "5e:35:13:76:0b:1d",
            "net27": "aa:21:6a:b8:9c:cd",
            "net3": "da:bb:ca:61:7c:62",
            "net4": "1a:93:1a:c1:a6:c3",
            "net5": "52:1f:28:13:ec:0e",
            "net6": "1a:03:50:b5:3e:38",
            "net7": "f6:5a:ea:db:c6:0e",
            "net8": "b2:ad:46:cd:91:c5",
            "net9": "56:58:71:fb:b3:eb"
        },
        "tof_1_2_3": {
            "net0": "b6:4e:67:a2:4f:af",
            "net1": "4e:a6:7f:f6:6c:0d",
            "net10": "5a:d1:ad:13:74:57",
            "net11": "ca:5f:9d:d1:67:cc",
            "net12": "c6:85:46:86:75:ba",
            "net13": "92:fd:08:de:90:a5",
            "net14": "ca:03:fd:78:e2:93",
            "net15": "52:17:94:c8:2f:1c",
            "net16": "32:6f:5d:44:27:23",
            "net17": "de:01:b2:c9:f3:05",
            "net18": "ee:58:a3:b2:24:65",
            "net19": "9e:08:06:a2:fd:52",
            "net2": "ee:65:e0:bf:78:a9",
            "net20": "1a:fd:7e:52:98:9e",
            "net21": "46:a5:dc:52:19:f7",
            "net22": "9a:ef:03:58:04:f1",
            "net23": "9a:51:cb:f2:67:27",
            "net24": "62:5f:12:cb:fe:43",
            "net25": "5a:5a:13:1d:12:9d",
            "net26": "c2:14:9b:08:ef:ca",
            "net27": "22:c7:b2:48:5c:aa",
            "net3": "ee:24:7f:89:63:d4",
            "net4": "82:68:34:bd:14:4d",
            "net5": "32:79:34:2c:9e:fa",
            "net6": "6e:63:1c:5c:c4:94",
            "net7": "5a:28:07:c9:e2:0e",
            "net8": "4e:7c:a8:28:e1:86",
            "net9": "62:02:0b:8a:48:82"
        },
        "tof_1_2_4": {
            "net0": "02:aa:a6:9b:16:84",
            "net1": "16:93:32:92:c8:79",
            "net10": "da:d0:7b:35:c7:76",
            "net11": "ba:3f:c8:44:9a:a9",
            "net12": "72:bb:68:e9:5d:5e",
            "net13": "56:97:9e:df:f2:23",
            "net14": "62:0a:7d:56:17:8c",
            "net15": "82:4a:03:79:9b:19",
            "net16": "7a:62:6a:2a:ea:c2",
            "net17": "32:da:e1:5a:3b:b2",
            "net18": "c6:86:bd:fe:db:fb",
            "net19": "4a:e0:9f:2a:27:26",
            "net2": "6e:ac:2c:bb:b9:cb",
            "net20": "0a:9e:d6:49:94:6b",
            "net21": "f2:50:3a:77:57:78",
            "net22": "76:76:50:dc:8c:13",
            "net23": "02:e9:23:cd:61:4c",
            "net24": "4e:7f:b3:f9:8f:d1",
            "net25": "2a:a0:49:1f:67:6a",
            "net26": "8a:00:2e:a2:5e:3b",
            "net27": "9e:6e:2a:d2:e7:bd",
            "net3": "da:82:19:ef:89:41",
            "net4": "86:e6:75:de:e2:b3",
            "net5": "16:84:a0:af:3c:19",
            "net6": "a6:74:31:e1:1b:e5",
            "net7": "5e:83:c3:54:74:78",
            "net8": "02:9d:fe:e8:f0:65",
            "net9": "ce:ab:e3:81:ad:17"
        },
        "tof_1_2_5": {
            "net0": "12:99:fa:27:55:4c",
            "net1": "7e:45:cb:2c:da:0f",
            "net10": "ca:0b:23:cc:ee:f5",
            "net11": "ae:a8:47:c2:47:b9",
            "net12": "72:a4:90:95:b7:d1",
            "net13": "e6:f9:97:6d:91:a0",
            "net14": "56:cd:23:7c:eb:af",
            "net15": "9e:dd:88:70:dc:74",
            "net16": "16:f6:58:de:20:88",
            "net17": "c6:e4:96:6e:0d:98",
            "net18": "16:29:f2:07:12:8f",
            "net19": "1e:02:0a:15:df:b2",
            "net2": "62:22:ea:33:e7:0b",
            "net20": "d2:51:6f:5b:bb:a4",
            "net21": "5a:a3:6b:85:c1:07",
            "net22": "12:b9:09:74:7e:09",
            "net23": "fa:0b:aa:fb:e5:01",
            "net24": "1e:8f:34:c8:67:84",
            "net25": "9a:9b:63:e7:db:8d",
            "net26": "8a:46:db:ef:6b:41",
            "net27": "02:97:a7:77:fe:ba",
            "net3": "b2:9a:12:d5:8d:8e",
            "net4": "6e:6d:d8:0b:22:78",
            "net5": "46:53:40:a8:d5:d8",
            "net6": "e2:ce:dd:0e:0a:ba",
            "net7": "d2:00:bc:69:9f:83",
            "net8": "22:56:eb:28:1b:94",
            "net9": "d2:f9:54:58:6c:f5"
        },
        "tof_1_2_6": {
            "net0": "7e:50:6e:c4:4f:28",
            "net1": "4e:cb:03:8d:16:dc",
            "net10": "ba:cc:d4:15:dd:b8",
            "net11": "4a:1c:4e:1f:69:a5",
            "net12": "3a:a5:f2:71:d0:c1",
            "net13": "86:aa:5e:1f:0c:1f",
            "net14": "ea:d5:66:16:4a:60",
            "net15": "3a:46:44:46:1b:4b",
            "net16": "52:c2:c4:77:7a:b5",
            "net17": "4e:93:09:91:10:7c",
            "net18": "72:49:67:dd:08:27",
            "net19": "66:96:cb:6a:10:21",
            "net2": "42:4d:71:59:c1:ee",
            "net20": "82:ce:3e:fb:8b:43",
            "net21": "da:d7:f6:ab:83:a4",
            "net22": "6e:c9:11:e1:46:70",
            "net23": "ba:16:ed:fe:c9:fd",
            "net24": "22:ec:27:ce:85:99",
            "net25": "c6:b0:58:e4:d5:a9",
            "net26": "fa:ee:ac:e2:5d:1a",
            "net27": "de:e0:4f:10:64:b0",
            "net3": "fe:5d:53:1f:39:9e",
            "net4": "7a:69:f9:7f:62:85",
            "net5": "7e:08:67:2a:35:70",
            "net6": "8a:76:c1:85:ca:14",
            "net7": "72:a4:f6:b9:1e:0e",
            "net8": "96:02:bd:c8:97:30",
            "net9": "72:c5:cc:0a:40:f4"
        },
        "tof_1_2_7": {
            "net0": "16:40:01:f9:31:98",
            "net1": "de:36:50:be:5f:ae",
            "net10": "36:ca:9a:9d:6d:0d",
            "net11": "e2:ae:d1:f7:d0:cd",
            "net12": "26:c8:98:dc:41:7a",
            "net13": "9a:c3:72:20:ed:24",
            "net14": "22:42:50:b4:d2:46",
            "net15": "86:cd:38:73:7f:b7",
            "net16": "12:f9:8b:09:3c:0d",
            "net17": "4a:86:4b:ef:22:74",
            "net18": "02:dd:e0:91:53:6d",
            "net19": "56:34:2a:5a:e7:2a",
            "net2": "3a:b8:19:f1:27:b1",
            "net20": "2a:82:1e:9a:71:95",
            "net21": "c6:3c:9f:07:09:fa",
            "net22": "06:ba:c7:0c:91:ff",
            "net23": "06:57:5b:c3:85:32",
            "net24": "a2:70:b4:b3:a0:b9",
            "net25": "16:87:01:d0:12:26",
            "net26": "c6:11:f7:44:ff:ee",
            "net27": "06:e8:47:83:ae:9a",
            "net3": "9e:ac:87:c1:4b:e1",
            "net4": "42:a4:1e:61:48:c9",
            "net5": "ca:a5:9e:69:dd:f3",
            "net6": "3a:83:40:c1:83:09",
            "net7": "4a:50:e8:70:8b:22",
            "net8": "9a:c3:a0:aa:ad:51",
            "net9": "62:70:58:17:e3:5d"
        },
        "tof_1_2_8": {
            "net0": "d6:8a:b6:8d:b2:9f",
            "net1": "72:23:5b:9e:7c:1a",
            "net10": "86:eb:87:f9:73:c9",
            "net11": "c2:1b:53:d9:38:17",
            "net12": "7e:a5:4b:2c:d0:03",
            "net13": "a2:9f:99:38:61:97",
            "net14": "7e:f7:8f:1e:c2:1d",
            "net15": "3e:52:64:16:ca:d8",
            "net16": "de:07:36:7e:b9:e1",
            "net17": "72:9b:06:da:77:63",
            "net18": "46:84:6e:65:c3:ad",
            "net19": "6e:bb:bd:58:d7:4f",
            "net2": "fa:3e:d7:b8:cb:a2",
            "net20": "be:fb:01:4f:17:a8",
            "net21": "12:b9:25:ff:9c:05",
            "net22": "72:cd:2f:c1:5c:ec",
            "net23": "56:11:fa:6a:bb:a0",
            "net24": "2e:8c:26:d8:33:61",
            "net25": "4a:33:cb:94:b9:1e",
            "net26": "7e:68:44:b7:85:82",
            "net27": "aa:22:bd:2e:ab:63",
            "net3": "0e:76:a4:42:39:60",
            "net4": "8a:8f:62:d9:24:c1",
            "net5": "d2:91:2d:8b:fa:e9",
            "net6": "8e:be:6d:52:2a:8c",
            "net7": "5e:3f:e9:1a:5e:7c",
            "net8": "02:a1:07:57:1a:0e",
            "net9": "7e:08:33:23:d6:0f"
        },
        "tof_1_2_9": {
            "net0": "9e:c7:18:ef:73:75",
            "net1": "72:f8:d9:36:bc:17",
            "net10": "a2:d9:cf:70:96:4c",
            "net11": "0a:ad:96:1d:aa:7e",
            "net12": "3a:e9:89:27:96:89",
            "net13": "a6:68:10:ab:46:76",
            "net14": "12:e8:3a:f3:4b:0f",
            "net15": "5e:a9:41:2d:42:ee",
            "net16": "1a:2a:2e:16:25:a1",
            "net17": "96:d3:76:9c:19:d4",
            "net18": "e2:09:4a:b9:ec:a8",
            "net19": "1a:1f:65:bc:f9:14",
            "net2": "c2:c5:21:fb:1f:1c",
            "net20": "12:65:6d:d7:5a:14",
            "net21": "9a:4d:92:9a:1f:59",
            "net22": "7a:5e:6b:3a:3f:69",
            "net23": "82:69:eb:53:df:d8",
            "net24": "3e:a0:aa:88:30:9e",
            "net25": "32:19:d4:a3:d2:28",
            "net26": "96:83:e1:68:c2:64",
            "net27": "e6:2e:ec:78:7e:fd",
            "net3": "56:64:14:16:19:78",
            "net4": "ca:8d:c3:4b:7e:e5",
            "net5": "d2:8c:b7:8c:62:1b",
            "net6": "ca:20:7b:3e:94:2f",
            "net7": "92:61:b1:a8:1b:b9",
            "net8": "66:6d:12:72:88:c3",
            "net9": "f6:6e:9b:14:d0:70"
        }
    },
    "failed_machine": "leaf_1_0_1",
    "failed_interfaces": [
        "net0"
    ],
    "failure_time": 1616508498.7563076,
    "recover_time": 1616508859.4269874
}