{
    "k_leaf": 2,
    "k_top": 2,
    "redundancy_factor": 2,
    "is_k8s": true,
    "machine_mac_addresses": {
        "leaf_1_0_1": {
            "net0": "9e:f6:f7:64:5c:32",
            "net1": "4a:93:18:b7:b5:a6",
            "net2": "66:fa:84:9d:c8:79"
        },
        "leaf_1_0_2": {
            "net0": "b6:82:ff:8d:4f:c6",
            "net1": "3e:19:ea:95:8d:2a",
            "net2": "de:c1:d4:fd:35:88"
        },
        "leaf_2_0_1": {
            "net0": "06:66:36:46:9a:4e",
            "net1": "0a:5e:ed:43:59:bb",
            "net2": "ce:45:ed:7b:17:5f"
        },
        "leaf_2_0_2": {
            "net0": "8e:30:d6:75:09:24",
            "net1": "f6:1d:ca:de:8c:a6",
            "net2": "0e:70:c3:4e:79:d8"
        },
        "spine_1_1_1": {
            "net0": "8e:83:06:82:f1:7e",
            "net1": "2a:2e:3d:06:32:c6",
            "net2": "42:d6:d9:a1:50:c8",
            "net3": "26:48:e0:b9:de:2f"
        },
        "spine_1_1_2": {
            "net0": "aa:8f:3c:37:ea:95",
            "net1": "52:d7:d8:4f:2a:e3",
            "net2": "9e:8b:95:03:52:0a",
            "net3": "da:22:0e:36:35:d2"
        },
        "spine_2_1_1": {
            "net0": "da:02:89:35:47:7b",
            "net1": "32:06:e8:d0:a0:f9",
            "net2": "2e:a8:9b:42:00:ec",
            "net3": "9a:27:ba:f4:6b:cc"
        },
        "spine_2_1_2": {
            "net0": "fe:cb:65:7f:3e:fb",
            "net1": "16:a7:50:e3:1f:26",
            "net2": "4a:18:8c:8d:12:07",
            "net3": "2e:0f:7a:16:96:26"
        },
        "tof_1_2_1": {
            "net0": "8e:53:9c:d5:e5:db",
            "net1": "2a:81:14:fc:7d:17",
            "net2": "ca:98:38:1d:c9:b2",
            "net3": "ea:b4:8f:85:c7:b7"
        },
        "tof_1_2_2": {
            "net0": "d2:c7:b4:8e:d9:fd",
            "net1": "82:7e:55:56:02:86",
            "net2": "02:85:ab:76:0d:c6",
            "net3": "76:ba:1b:cc:cb:f2"
        }
    },
    "failed_machine": "tof_1_2_1",
    "failure_time": {
        "leaf_1_0_1": 1634416610.822696,
        "leaf_1_0_2": 1634416610.837046,
        "leaf_2_0_1": 1634416610.82436,
        "leaf_2_0_2": 1634416610.837914,
        "spine_1_1_1": 1634416610.8597784,
        "spine_1_1_2": 1634416610.8716958,
        "spine_2_1_1": 1634416610.8609476,
        "spine_2_1_2": 1634416610.874282,
        "tof_1_2_1": 1634416610.8823159,
        "tof_1_2_2": 1634416610.8909924
    }
}