{
    "k_leaf": 10,
    "k_top": 10,
    "redundancy_factor": 10,
    "is_k8s": true,
    "machine_mac_addresses": {
        "leaf_1_0_1": {
            "net0": "9e:bd:e5:95:04:29",
            "net1": "6a:e0:89:3f:e4:13",
            "net10": "a6:16:e6:f7:e8:16",
            "net2": "be:78:f7:2c:ef:1b",
            "net3": "7e:59:da:98:4f:b0",
            "net4": "e2:4f:07:78:68:52",
            "net5": "f6:63:49:41:f2:c9",
            "net6": "3a:b5:51:c0:ff:c6",
            "net7": "3e:f4:0e:67:65:c6",
            "net8": "12:f2:7b:9f:b7:b2",
            "net9": "86:3f:aa:ba:07:2a"
        },
        "leaf_1_0_10": {
            "net0": "be:07:42:c3:41:c2",
            "net1": "1e:1d:a0:6d:97:e6",
            "net10": "fe:b8:d0:ee:27:17",
            "net2": "6e:b3:ef:0a:df:61",
            "net3": "da:cd:df:a3:ad:9d",
            "net4": "2a:de:db:d6:5b:08",
            "net5": "5a:fb:2d:ff:26:1f",
            "net6": "5a:3a:cd:b5:08:04",
            "net7": "16:38:ee:84:2c:f5",
            "net8": "82:14:93:a8:47:ae",
            "net9": "2e:55:2c:bb:00:7d"
        },
        "leaf_1_0_2": {
            "net0": "82:a8:f7:4c:05:76",
            "net1": "96:6f:c6:95:eb:c0",
            "net10": "ce:b8:39:ae:9a:dd",
            "net2": "46:19:a0:0d:3f:37",
            "net3": "b2:a6:33:e5:35:4f",
            "net4": "82:e4:3c:71:8a:83",
            "net5": "ae:c2:50:0f:c6:d9",
            "net6": "a2:b0:7f:b9:8b:bf",
            "net7": "76:86:81:67:a9:b9",
            "net8": "2e:cd:84:d3:47:e5",
            "net9": "de:ce:23:e7:47:01"
        },
        "leaf_1_0_3": {
            "net0": "26:9a:c5:d6:fc:0d",
            "net1": "c6:b4:f3:a3:d4:e0",
            "net10": "9e:e3:04:ef:40:df",
            "net2": "6a:31:7e:1e:cd:eb",
            "net3": "d6:ea:e5:ee:5f:53",
            "net4": "5e:63:4f:22:23:15",
            "net5": "66:cf:f3:be:62:4b",
            "net6": "da:a2:de:6b:65:f0",
            "net7": "c2:23:7e:95:5e:4f",
            "net8": "2a:13:26:c4:ea:5b",
            "net9": "72:1f:35:90:b2:07"
        },
        "leaf_1_0_4": {
            "net0": "5e:23:f2:8d:9f:5c",
            "net1": "a6:cf:fa:34:7a:e3",
            "net10": "12:03:17:da:17:7a",
            "net2": "82:65:ab:3a:aa:4a",
            "net3": "7a:ba:a7:43:bc:80",
            "net4": "e2:4b:12:9e:b4:bc",
            "net5": "a2:39:c5:44:70:6d",
            "net6": "9e:31:59:25:44:54",
            "net7": "52:9f:4b:ee:b5:be",
            "net8": "e6:ad:bf:77:f2:b9",
            "net9": "26:d3:da:c0:7b:c2"
        },
        "leaf_1_0_5": {
            "net0": "ae:1f:45:ce:8d:d0",
            "net1": "fe:17:2b:5a:c7:03",
            "net10": "22:18:83:5e:2f:52",
            "net2": "8e:f7:1a:ee:bf:d3",
            "net3": "c2:c6:cb:37:a6:04",
            "net4": "0a:f5:d2:43:cb:7e",
            "net5": "ce:9f:36:fd:1e:3e",
            "net6": "2a:fd:96:ef:46:ae",
            "net7": "72:0b:dd:7b:93:ae",
            "net8": "32:e3:b7:d4:73:a9",
            "net9": "5a:15:6c:f8:2d:c7"
        },
        "leaf_1_0_6": {
            "net0": "a2:f1:7c:9b:19:1f",
            "net1": "4e:61:63:d7:55:bd",
            "net10": "52:55:7d:b9:fa:22",
            "net2": "86:84:44:d2:b1:40",
            "net3": "2e:25:07:3d:79:d3",
            "net4": "92:4e:ca:aa:98:43",
            "net5": "3e:d2:7f:11:b3:7f",
            "net6": "5e:89:7b:a2:1b:86",
            "net7": "f2:c9:11:41:ae:29",
            "net8": "92:5c:fd:60:f4:68",
            "net9": "7a:dd:c4:0e:82:5b"
        },
        "leaf_1_0_7": {
            "net0": "7a:99:25:a4:e7:37",
            "net1": "76:7e:72:46:ee:3c",
            "net10": "96:88:e0:22:64:5a",
            "net2": "7a:37:41:c9:80:a3",
            "net3": "0a:de:2c:87:71:7b",
            "net4": "e6:03:ad:c5:46:5f",
            "net5": "82:d1:dd:b2:6b:6a",
            "net6": "52:13:a8:d2:1b:53",
            "net7": "96:c2:78:3f:02:14",
            "net8": "d2:22:e8:f9:a6:26",
            "net9": "be:ca:c4:38:18:ba"
        },
        "leaf_1_0_8": {
            "net0": "fe:a0:84:01:f5:55",
            "net1": "72:76:6e:e7:60:6d",
            "net10": "6e:2f:77:64:35:db",
            "net2": "06:f4:8e:f1:d7:e1",
            "net3": "46:d0:e4:f4:60:98",
            "net4": "7a:db:b9:85:73:01",
            "net5": "22:d9:2d:77:8f:8d",
            "net6": "ee:8e:7f:c7:d4:4b",
            "net7": "3e:de:f3:a4:4a:63",
            "net8": "1a:f9:a4:47:bd:5b",
            "net9": "42:ea:99:a0:cd:1c"
        },
        "leaf_1_0_9": {
            "net0": "2a:2f:c8:c5:67:82",
            "net1": "32:a3:e7:56:4a:4b",
            "net10": "62:c7:d9:df:44:fd",
            "net2": "12:8f:b2:62:ef:24",
            "net3": "66:15:da:d1:32:a4",
            "net4": "1a:a5:c6:d2:30:89",
            "net5": "9e:94:dd:95:01:bf",
            "net6": "16:26:de:5f:5f:68",
            "net7": "46:b9:cb:30:ab:28",
            "net8": "6e:5e:a6:d6:fb:8f",
            "net9": "62:b5:5e:50:38:36"
        },
        "leaf_2_0_1": {
            "net0": "9e:ef:a8:39:df:16",
            "net1": "7e:40:5a:78:bb:6e",
            "net10": "fa:e8:85:35:0a:e7",
            "net2": "26:d4:93:1d:b6:79",
            "net3": "86:84:61:63:fa:b9",
            "net4": "b2:2e:83:01:9a:af",
            "net5": "3e:c8:74:0b:9b:0e",
            "net6": "76:9e:09:c9:76:e2",
            "net7": "ee:20:1c:32:fb:86",
            "net8": "0a:24:c2:79:a3:8e",
            "net9": "aa:51:76:1c:45:89"
        },
        "leaf_2_0_10": {
            "net0": "76:9f:39:ed:78:fe",
            "net1": "1e:f2:23:ba:c2:7e",
            "net10": "3a:ee:ae:5d:f9:d3",
            "net2": "9a:a0:6f:68:e1:53",
            "net3": "ea:14:08:5b:3e:20",
            "net4": "e6:43:08:d2:87:28",
            "net5": "6e:fd:95:77:7c:60",
            "net6": "16:41:d1:22:c0:8f",
            "net7": "86:3e:32:d1:88:bb",
            "net8": "8e:ad:ce:e5:06:e9",
            "net9": "16:fc:c0:2f:24:09"
        },
        "leaf_2_0_2": {
            "net0": "26:8d:93:98:f2:1a",
            "net1": "8a:c5:b4:a9:41:b9",
            "net10": "f2:61:25:a3:df:6c",
            "net2": "1a:c5:66:5e:5f:f5",
            "net3": "1e:0e:35:d4:63:8f",
            "net4": "66:c3:37:0e:f2:4d",
            "net5": "0e:9b:52:10:f0:53",
            "net6": "9a:8f:77:c2:7b:12",
            "net7": "fe:c0:4d:63:43:3b",
            "net8": "32:86:ee:7f:bd:9a",
            "net9": "be:09:47:9c:94:81"
        },
        "leaf_2_0_3": {
            "net0": "26:0f:0c:0d:ee:5d",
            "net1": "2e:c0:54:2b:b4:79",
            "net10": "92:62:ec:c4:1a:30",
            "net2": "52:aa:65:8c:dc:67",
            "net3": "3a:7c:00:05:f6:f1",
            "net4": "4e:b1:e2:69:9f:5b",
            "net5": "5a:42:0a:c1:1d:bf",
            "net6": "0a:89:ca:e1:bf:d7",
            "net7": "de:34:16:85:64:67",
            "net8": "0e:56:b7:9f:4a:74",
            "net9": "72:1f:02:e6:cf:8f"
        },
        "leaf_2_0_4": {
            "net0": "12:38:b1:b6:39:c9",
            "net1": "92:21:34:ae:ea:a6",
            "net10": "e2:5e:07:81:31:a5",
            "net2": "06:98:be:bc:77:ff",
            "net3": "52:38:24:73:c9:ce",
            "net4": "6a:8a:14:fc:78:a9",
            "net5": "42:8d:15:d2:6c:51",
            "net6": "da:6e:42:63:bd:eb",
            "net7": "a6:59:c9:b9:07:b4",
            "net8": "be:0b:81:77:b3:70",
            "net9": "86:3b:73:2d:4d:cc"
        },
        "leaf_2_0_5": {
            "net0": "96:f3:b7:99:58:0f",
            "net1": "16:48:90:32:20:9d",
            "net10": "32:58:c2:01:c5:39",
            "net2": "d6:84:d9:83:78:a1",
            "net3": "ea:62:70:bd:08:ac",
            "net4": "66:68:25:64:d2:72",
            "net5": "e2:8a:ad:95:5e:1e",
            "net6": "1a:a9:3c:5a:3d:cd",
            "net7": "fe:9b:45:27:98:b1",
            "net8": "ea:a7:f8:a0:2c:7b",
            "net9": "ce:d4:4d:98:78:9d"
        },
        "leaf_2_0_6": {
            "net0": "3e:5d:6b:29:8a:12",
            "net1": "22:16:d7:8b:94:9e",
            "net10": "ca:9c:a8:51:81:40",
            "net2": "6e:7f:3f:d9:0f:b5",
            "net3": "0a:99:2a:e2:a8:fd",
            "net4": "2e:41:75:95:fa:e5",
            "net5": "72:25:1e:7f:22:fa",
            "net6": "92:6f:17:36:43:c9",
            "net7": "1a:e4:1f:46:d3:c8",
            "net8": "06:d9:03:76:73:12",
            "net9": "86:a6:32:14:01:ed"
        },
        "leaf_2_0_7": {
            "net0": "4e:bb:a2:81:5b:46",
            "net1": "ae:dd:55:7e:a6:78",
            "net10": "d2:09:d9:86:69:36",
            "net2": "96:be:f5:13:3a:78",
            "net3": "32:1f:ec:5f:f7:a5",
            "net4": "3a:cf:75:36:81:40",
            "net5": "ae:47:fc:e0:43:93",
            "net6": "9a:6c:3f:99:7a:41",
            "net7": "42:7f:4a:02:89:c7",
            "net8": "1e:68:1e:ae:86:b2",
            "net9": "a2:7d:23:ee:83:12"
        },
        "leaf_2_0_8": {
            "net0": "56:80:71:cb:c9:77",
            "net1": "ea:ea:2f:9b:38:c9",
            "net10": "8e:0b:aa:be:4c:9c",
            "net2": "c6:c3:b5:5c:df:ad",
            "net3": "d6:ff:9c:cd:2b:ca",
            "net4": "c2:91:31:44:96:5f",
            "net5": "5e:2d:68:29:36:ad",
            "net6": "42:3e:41:2e:f4:d4",
            "net7": "06:4e:b8:83:85:dd",
            "net8": "3e:e6:ff:ee:b4:79",
            "net9": "06:6c:e3:95:46:ce"
        },
        "leaf_2_0_9": {
            "net0": "7e:e8:48:ea:d2:49",
            "net1": "b2:52:b4:22:a9:29",
            "net10": "52:3c:27:6a:98:92",
            "net2": "9e:aa:c5:63:9f:f2",
            "net3": "ce:74:9b:72:c0:ce",
            "net4": "7a:99:4a:62:2a:ab",
            "net5": "22:3a:f0:9e:39:53",
            "net6": "e6:32:59:42:8e:cb",
            "net7": "26:64:23:1f:4b:3b",
            "net8": "ae:9f:87:20:b5:bd",
            "net9": "22:8e:41:9e:43:8e"
        },
        "spine_1_1_1": {
            "net0": "b2:28:7d:4b:92:81",
            "net1": "22:cb:c4:c6:81:43",
            "net10": "06:4f:1e:4f:b6:f4",
            "net11": "36:ab:ba:60:a5:10",
            "net12": "72:54:c8:15:a0:df",
            "net13": "be:7b:c2:77:35:0f",
            "net14": "5e:8a:68:c4:d3:08",
            "net15": "62:b9:a6:81:fe:3e",
            "net16": "9a:60:15:fd:b7:e1",
            "net17": "2e:3c:cc:d5:ff:6d",
            "net18": "ee:81:0d:92:41:28",
            "net19": "12:8a:c6:e1:93:18",
            "net2": "8a:18:31:4b:f8:ee",
            "net3": "92:cb:6c:7a:0c:4b",
            "net4": "f6:d8:cf:73:72:cf",
            "net5": "ba:62:59:59:ce:8e",
            "net6": "d2:9f:c1:88:b7:62",
            "net7": "16:be:a1:f9:54:3b",
            "net8": "de:e2:8b:ea:0f:0b",
            "net9": "9e:2c:96:e1:23:99"
        },
        "spine_1_1_10": {
            "net0": "b6:b2:27:71:92:2a",
            "net1": "3a:6e:90:a5:e3:f4",
            "net10": "5a:60:76:97:19:2a",
            "net11": "56:f4:b4:f7:8a:2d",
            "net12": "da:dc:4f:2f:1b:2e",
            "net13": "aa:4e:1d:43:c6:56",
            "net14": "46:cb:76:a0:9e:af",
            "net15": "6a:16:0e:6c:95:33",
            "net16": "be:30:5c:f2:03:97",
            "net17": "2e:1c:2c:d0:44:40",
            "net18": "82:75:49:1e:69:b0",
            "net19": "1e:7a:fc:75:53:14",
            "net2": "6e:f4:6c:ff:3d:98",
            "net3": "aa:56:7a:03:ed:0a",
            "net4": "92:6a:b9:1e:c2:5c",
            "net5": "06:d9:34:d7:15:92",
            "net6": "1e:0b:d0:22:b8:d9",
            "net7": "fa:26:4c:60:e9:74",
            "net8": "5a:00:18:58:f9:13",
            "net9": "d2:d1:87:5f:c4:12"
        },
        "spine_1_1_2": {
            "net0": "4e:4e:2d:09:f4:b5",
            "net1": "62:bc:8f:3c:ae:0a",
            "net10": "56:ba:14:9c:cf:d4",
            "net11": "32:4a:2f:ec:c7:4b",
            "net12": "86:51:cd:f6:65:59",
            "net13": "c6:f5:28:df:0a:14",
            "net14": "5a:d9:51:0b:79:78",
            "net15": "2a:5b:dc:fe:df:ab",
            "net16": "fa:26:b2:e8:6b:86",
            "net17": "16:b8:ae:90:77:ff",
            "net18": "d6:a2:60:a5:a3:99",
            "net19": "62:59:32:ae:74:ad",
            "net2": "46:1e:ef:36:0b:55",
            "net3": "8e:33:07:c3:b9:7c",
            "net4": "26:88:8e:ab:0e:a0",
            "net5": "6e:09:4c:f5:23:28",
            "net6": "9a:da:52:d8:86:b5",
            "net7": "8e:7a:a7:7f:d5:d8",
            "net8": "ca:44:76:a3:62:68",
            "net9": "ee:f8:a2:b9:2b:9a"
        },
        "spine_1_1_3": {
            "net0": "7e:d6:e2:9b:94:f7",
            "net1": "3a:af:e7:45:98:ed",
            "net10": "ce:b8:40:2a:d3:ec",
            "net11": "f6:43:87:ee:00:db",
            "net12": "2e:69:4a:94:de:f0",
            "net13": "92:1a:7c:c3:45:58",
            "net14": "76:43:d8:af:03:3d",
            "net15": "be:e3:56:f2:ef:73",
            "net16": "b6:28:bf:e8:f5:ee",
            "net17": "4a:e2:5e:73:e6:44",
            "net18": "f6:5c:1b:6b:a3:33",
            "net19": "32:4e:c9:5d:06:44",
            "net2": "6e:1e:1c:d1:2b:fd",
            "net3": "8e:42:12:c0:ab:5c",
            "net4": "4e:74:c7:c2:04:3c",
            "net5": "da:fa:21:2c:de:45",
            "net6": "7e:72:d6:62:58:09",
            "net7": "6e:cc:eb:c7:e2:54",
            "net8": "f6:83:1f:be:b8:db",
            "net9": "92:a0:1b:a8:f2:de"
        },
        "spine_1_1_4": {
            "net0": "ca:c6:d1:e0:c7:85",
            "net1": "36:60:18:d0:af:24",
            "net10": "0a:4b:d3:71:ee:3e",
            "net11": "c6:9c:03:d4:94:22",
            "net12": "a6:5d:9d:0c:93:9d",
            "net13": "4e:9e:e1:31:08:94",
            "net14": "5a:e4:5b:40:67:6b",
            "net15": "22:a4:f7:b2:48:f9",
            "net16": "06:fd:5e:b3:72:71",
            "net17": "1e:8d:06:38:df:50",
            "net18": "b2:36:66:7d:af:27",
            "net19": "ea:fa:04:d0:3f:2a",
            "net2": "f6:25:a1:f7:5a:39",
            "net3": "aa:04:13:91:ff:27",
            "net4": "16:76:d1:84:94:bf",
            "net5": "9a:0f:db:e1:8a:9f",
            "net6": "c2:ee:98:ab:d5:4d",
            "net7": "3e:eb:98:94:38:c2",
            "net8": "ba:cf:a4:3a:8e:29",
            "net9": "fa:56:40:f4:c2:b3"
        },
        "spine_1_1_5": {
            "net0": "12:e9:da:19:11:c2",
            "net1": "f2:35:8f:ec:2b:e4",
            "net10": "6a:52:39:89:cf:cb",
            "net11": "16:7c:6d:f3:71:f6",
            "net12": "82:d6:bb:69:6d:6d",
            "net13": "96:45:a3:83:a8:cb",
            "net14": "22:67:99:da:12:f0",
            "net15": "4a:79:fd:a4:87:19",
            "net16": "b2:4c:d3:91:ae:c6",
            "net17": "5a:77:12:b3:bc:2e",
            "net18": "16:57:a0:3b:a5:71",
            "net19": "7e:2d:b8:fa:20:fb",
            "net2": "1a:71:02:a2:be:e6",
            "net3": "8a:d1:3c:05:60:13",
            "net4": "16:a2:e5:77:3b:f7",
            "net5": "16:ee:0f:5f:cb:0a",
            "net6": "4e:b6:dd:8a:51:42",
            "net7": "c2:77:1e:ac:5f:be",
            "net8": "a6:29:d3:84:ee:7e",
            "net9": "42:cf:9b:5f:a4:79"
        },
        "spine_1_1_6": {
            "net0": "12:a1:91:53:ed:8c",
            "net1": "52:b1:91:20:a4:5d",
            "net10": "0a:df:59:1c:df:72",
            "net11": "fa:2b:30:de:00:d3",
            "net12": "be:af:c3:94:e9:8c",
            "net13": "e2:19:3f:28:1a:ae",
            "net14": "56:8c:f8:d6:0f:c6",
            "net15": "56:9b:67:c6:71:ce",
            "net16": "b2:b3:b9:3e:96:b9",
            "net17": "f2:c9:7c:53:46:f9",
            "net18": "b2:69:c9:36:f5:cc",
            "net19": "36:86:42:45:76:12",
            "net2": "f6:f3:98:5f:0e:f8",
            "net3": "02:4b:aa:7a:59:4f",
            "net4": "72:ca:91:dc:01:15",
            "net5": "2e:86:9f:11:1f:0d",
            "net6": "66:62:3e:bd:4c:eb",
            "net7": "6a:c4:a3:c8:9a:11",
            "net8": "36:1d:f3:e3:9e:85",
            "net9": "d2:3b:ad:94:5d:01"
        },
        "spine_1_1_7": {
            "net0": "32:da:38:e5:66:60",
            "net1": "2e:39:3e:f9:54:74",
            "net10": "e2:6a:04:c5:b7:5c",
            "net11": "02:d2:87:bc:1e:49",
            "net12": "d6:d9:4d:02:6a:e2",
            "net13": "32:94:61:d1:91:5a",
            "net14": "06:41:1a:13:e7:e8",
            "net15": "da:c3:5c:0f:03:74",
            "net16": "ba:26:93:0c:76:ca",
            "net17": "f2:ea:72:3a:ed:00",
            "net18": "1a:ae:ea:c0:a0:0b",
            "net19": "56:67:05:19:79:17",
            "net2": "36:d8:bd:e5:2c:2d",
            "net3": "0a:90:6e:1a:7b:52",
            "net4": "fa:0b:79:6a:ea:59",
            "net5": "76:93:a4:9a:7e:13",
            "net6": "56:ea:80:2b:d8:92",
            "net7": "ce:90:66:cf:fe:62",
            "net8": "9e:cb:19:ee:64:22",
            "net9": "06:85:f0:8c:bc:90"
        },
        "spine_1_1_8": {
            "net0": "ce:27:46:80:75:95",
            "net1": "fa:8a:57:b6:84:7e",
            "net10": "0e:8c:54:fd:32:f8",
            "net11": "ba:d6:3d:cd:68:cc",
            "net12": "32:16:c2:da:2b:16",
            "net13": "42:39:c9:09:b1:4c",
            "net14": "4e:d0:54:d0:7d:77",
            "net15": "c2:0b:02:41:98:a8",
            "net16": "5e:e5:cf:2e:cd:5e",
            "net17": "fa:53:d5:15:5e:2e",
            "net18": "e6:83:5a:a6:13:b5",
            "net19": "a2:05:52:8c:0c:60",
            "net2": "ca:e9:93:8b:f9:07",
            "net3": "7e:15:8e:14:79:22",
            "net4": "6e:72:0b:84:bd:11",
            "net5": "c2:9e:2a:cf:3d:b4",
            "net6": "02:f0:5e:79:ad:f3",
            "net7": "3a:48:40:71:50:9f",
            "net8": "26:5a:6a:9d:72:31",
            "net9": "5a:3a:9f:8e:d0:5a"
        },
        "spine_1_1_9": {
            "net0": "0a:01:bb:c8:e1:39",
            "net1": "72:15:a4:2f:2b:da",
            "net10": "4a:b6:3f:51:ad:36",
            "net11": "62:12:d8:51:ca:2a",
            "net12": "42:9f:48:52:d7:0f",
            "net13": "be:3b:97:f3:db:69",
            "net14": "42:a5:3c:bf:e5:11",
            "net15": "de:e7:55:f2:d8:06",
            "net16": "da:fd:ee:8b:81:f7",
            "net17": "6e:22:e5:f9:bc:7d",
            "net18": "c6:87:94:5e:af:23",
            "net19": "b2:7a:a2:4d:04:3f",
            "net2": "46:77:37:ab:03:27",
            "net3": "7e:bb:64:73:a4:01",
            "net4": "52:a8:32:43:3d:ac",
            "net5": "4e:79:de:48:f1:dd",
            "net6": "9e:dd:4f:f8:db:3d",
            "net7": "62:5b:42:d1:73:02",
            "net8": "9a:65:53:cc:97:14",
            "net9": "9e:5a:a8:fc:d6:2b"
        },
        "spine_2_1_1": {
            "net0": "06:19:8f:d7:0e:6b",
            "net1": "66:c2:ad:f2:16:ef",
            "net10": "c6:01:80:e7:c7:7b",
            "net11": "d6:44:a9:1e:cd:b9",
            "net12": "a2:f1:bb:e9:36:f0",
            "net13": "f6:92:e0:f9:9c:ac",
            "net14": "76:7d:8c:6c:5f:59",
            "net15": "8e:df:e2:fd:56:af",
            "net16": "4e:f0:ce:8c:27:65",
            "net17": "12:b7:c4:6b:46:96",
            "net18": "1e:16:21:6b:89:ce",
            "net19": "fe:e9:87:d2:97:d9",
            "net2": "5e:99:d1:08:0a:bb",
            "net3": "1e:8e:6c:4c:db:b4",
            "net4": "96:a0:8e:48:72:ed",
            "net5": "72:88:6f:f1:50:5b",
            "net6": "fa:26:c2:50:d8:f3",
            "net7": "26:9d:a7:84:90:e8",
            "net8": "16:27:bf:ec:64:32",
            "net9": "06:6c:81:b1:76:e7"
        },
        "spine_2_1_10": {
            "net0": "ba:a2:25:75:b1:3a",
            "net1": "22:2a:90:f2:a1:70",
            "net10": "be:cf:04:02:01:76",
            "net11": "62:bc:63:4a:fb:5f",
            "net12": "ce:ee:6a:02:93:c4",
            "net13": "86:ad:66:99:00:f4",
            "net14": "12:83:c6:fb:7e:db",
            "net15": "ea:25:d4:2e:a0:39",
            "net16": "9a:c5:74:ce:56:33",
            "net17": "82:21:a2:be:26:b4",
            "net18": "aa:d4:cb:c2:6e:5d",
            "net19": "ca:8c:7d:e8:29:e9",
            "net2": "a6:95:8f:53:e2:50",
            "net3": "22:73:3c:f8:d5:7c",
            "net4": "5e:f1:07:79:59:52",
            "net5": "86:cc:60:95:fd:94",
            "net6": "4e:d5:5b:9f:67:81",
            "net7": "ea:55:68:30:9b:b2",
            "net8": "4a:c2:22:33:61:c9",
            "net9": "2a:7f:fe:a6:85:92"
        },
        "spine_2_1_2": {
            "net0": "2a:92:1f:3e:53:04",
            "net1": "a6:b6:50:92:a2:c7",
            "net10": "7a:71:9e:5b:20:12",
            "net11": "2a:34:85:46:52:8f",
            "net12": "ce:32:70:ad:ae:61",
            "net13": "ca:56:da:7c:36:fb",
            "net14": "f6:c5:81:4f:14:cc",
            "net15": "ae:bd:f2:1b:b3:cf",
            "net16": "f6:4b:13:db:d6:76",
            "net17": "a2:08:69:d8:c6:c9",
            "net18": "ae:93:e3:b7:35:fd",
            "net19": "0a:dc:5b:b5:0a:a7",
            "net2": "9a:82:e1:7f:5f:b3",
            "net3": "46:19:75:1e:0a:da",
            "net4": "1a:55:9a:7a:8b:4e",
            "net5": "ca:85:62:8c:f6:87",
            "net6": "4e:66:ff:9d:fb:10",
            "net7": "ce:a2:47:26:4f:02",
            "net8": "06:92:18:62:55:44",
            "net9": "42:57:c4:af:9e:4d"
        },
        "spine_2_1_3": {
            "net0": "02:56:e6:6f:34:f0",
            "net1": "da:6a:6d:5a:3c:96",
            "net10": "02:fd:29:84:7e:9d",
            "net11": "7e:f9:ee:a0:c0:89",
            "net12": "1e:aa:8c:62:1f:f0",
            "net13": "02:2f:5f:24:5a:15",
            "net14": "66:a7:01:5a:b3:3c",
            "net15": "62:4d:d3:71:99:2b",
            "net16": "06:46:14:e2:2e:1b",
            "net17": "86:f0:6f:41:c2:ce",
            "net18": "8a:cb:2b:b7:16:0b",
            "net19": "d6:3b:57:7d:50:9f",
            "net2": "fa:0e:58:c6:e0:13",
            "net3": "e2:b9:23:3e:d5:a8",
            "net4": "56:6f:20:95:c6:1a",
            "net5": "0a:5f:02:d8:f0:8d",
            "net6": "b6:f6:a0:51:a9:f8",
            "net7": "ce:14:64:f3:88:6c",
            "net8": "ba:35:be:83:48:24",
            "net9": "e6:ce:c0:ba:23:1e"
        },
        "spine_2_1_4": {
            "net0": "62:08:57:c6:84:97",
            "net1": "72:99:23:74:6b:c9",
            "net10": "5e:9c:d3:6c:a2:b4",
            "net11": "fe:66:64:a0:c9:90",
            "net12": "3e:69:b8:76:55:f0",
            "net13": "0a:d3:a3:1a:e8:bd",
            "net14": "e6:d6:5c:19:b9:9f",
            "net15": "f2:d1:a2:ce:d9:18",
            "net16": "0a:af:78:f1:c2:12",
            "net17": "d6:27:a9:d4:0d:81",
            "net18": "ca:f7:1f:00:1d:b1",
            "net19": "12:d6:48:c5:99:7e",
            "net2": "a2:f9:6a:55:82:79",
            "net3": "f6:ca:c8:d2:e2:a4",
            "net4": "da:71:a1:e6:25:1d",
            "net5": "ea:2d:e4:a2:dd:fb",
            "net6": "52:29:15:34:1e:d9",
            "net7": "86:21:14:88:94:72",
            "net8": "d6:06:49:0a:d4:10",
            "net9": "5e:5b:14:45:90:49"
        },
        "spine_2_1_5": {
            "net0": "ba:6d:25:e0:4c:b8",
            "net1": "26:f3:e3:b9:58:ae",
            "net10": "be:42:d6:a4:80:35",
            "net11": "66:9e:55:9d:78:86",
            "net12": "a6:e8:19:ee:d4:72",
            "net13": "ae:2f:f7:8a:91:51",
            "net14": "6a:87:7f:02:e0:b7",
            "net15": "fa:4a:07:96:35:00",
            "net16": "2e:61:e0:33:f7:15",
            "net17": "86:a4:dd:2e:ee:f6",
            "net18": "96:d5:6e:57:4a:b2",
            "net19": "42:46:ca:3c:c9:72",
            "net2": "ea:65:09:f2:2c:8e",
            "net3": "46:fb:11:8c:93:a1",
            "net4": "ca:47:0e:50:53:86",
            "net5": "06:a2:df:40:3d:01",
            "net6": "c2:c8:e2:4b:40:33",
            "net7": "fa:33:45:36:91:23",
            "net8": "7a:90:12:bf:5f:46",
            "net9": "e6:63:dd:0f:ef:d3"
        },
        "spine_2_1_6": {
            "net0": "8e:6a:73:1c:16:2e",
            "net1": "32:44:7e:4f:68:d3",
            "net10": "fe:91:66:36:c2:41",
            "net11": "c2:6d:42:77:2b:7e",
            "net12": "5e:bb:84:18:fb:53",
            "net13": "32:f3:fa:0d:2f:3a",
            "net14": "36:49:cc:ec:f7:d6",
            "net15": "d6:60:01:48:15:a0",
            "net16": "c6:6c:97:0a:1a:ab",
            "net17": "0a:96:1a:ff:86:c9",
            "net18": "22:61:99:cb:e8:7a",
            "net19": "d2:5f:80:6a:d9:c1",
            "net2": "42:b4:97:10:3c:1a",
            "net3": "3a:b4:ae:63:43:c1",
            "net4": "de:6a:fb:9f:2c:ff",
            "net5": "c2:48:1e:97:d6:ca",
            "net6": "8a:fb:92:12:94:b6",
            "net7": "8a:da:ba:1b:24:8e",
            "net8": "1e:b9:8b:dc:47:2a",
            "net9": "ae:1a:3b:fd:69:1b"
        },
        "spine_2_1_7": {
            "net0": "76:56:d4:05:a2:f7",
            "net1": "96:75:2b:59:d3:e5",
            "net10": "6e:e6:02:17:30:79",
            "net11": "5e:65:ab:e1:01:e8",
            "net12": "32:1c:6d:cc:3d:1d",
            "net13": "da:51:72:af:2f:94",
            "net14": "ce:cb:bf:e6:e7:75",
            "net15": "8e:f8:ea:74:d7:2e",
            "net16": "3a:9f:c0:f1:e7:23",
            "net17": "32:7f:c0:d3:64:2c",
            "net18": "26:0e:b1:aa:49:b5",
            "net19": "1e:0f:ab:b5:e8:8a",
            "net2": "aa:da:f9:99:f3:54",
            "net3": "2e:88:4d:7e:18:28",
            "net4": "fa:32:3a:f6:6b:ec",
            "net5": "6e:6f:99:92:7c:79",
            "net6": "b6:a1:3e:54:fb:67",
            "net7": "7a:fc:d8:15:8a:ad",
            "net8": "62:71:6e:1e:6d:43",
            "net9": "9a:02:e8:15:37:94"
        },
        "spine_2_1_8": {
            "net0": "22:13:79:22:44:ca",
            "net1": "e2:d6:b4:e8:21:3b",
            "net10": "02:64:ae:d2:27:1c",
            "net11": "12:53:3b:7f:c7:f7",
            "net12": "0a:07:f3:37:b2:28",
            "net13": "c6:af:47:6b:2c:1a",
            "net14": "82:32:52:35:03:3c",
            "net15": "c6:26:dd:eb:44:f7",
            "net16": "06:57:7c:f3:7f:e0",
            "net17": "2a:a0:45:0a:fb:b2",
            "net18": "7a:a2:2e:a5:c7:c0",
            "net19": "d2:2a:dd:29:93:b4",
            "net2": "06:0a:fb:b6:a1:a0",
            "net3": "ae:50:56:31:d3:e8",
            "net4": "be:79:1e:bd:80:7e",
            "net5": "76:2f:a4:be:85:de",
            "net6": "2a:6d:a2:19:02:ff",
            "net7": "32:d7:bf:db:f7:e9",
            "net8": "fe:16:ec:83:74:00",
            "net9": "52:41:8d:b0:b1:15"
        },
        "spine_2_1_9": {
            "net0": "aa:42:00:3b:68:7f",
            "net1": "6a:d4:7f:08:65:47",
            "net10": "72:e7:1d:36:cd:ee",
            "net11": "12:63:7b:58:6b:54",
            "net12": "1e:db:b6:cb:2f:b2",
            "net13": "d6:aa:24:83:1e:71",
            "net14": "76:04:a7:e2:42:06",
            "net15": "1e:15:5d:85:e3:df",
            "net16": "ee:31:85:f2:26:09",
            "net17": "e2:65:8a:d0:5f:a1",
            "net18": "32:29:82:a4:c7:4a",
            "net19": "36:70:98:81:46:4c",
            "net2": "d6:28:57:6f:bb:54",
            "net3": "e2:e4:93:1e:2f:94",
            "net4": "be:c3:a7:da:b2:50",
            "net5": "b2:54:d5:b9:6b:64",
            "net6": "66:9d:a8:41:66:92",
            "net7": "72:2d:64:fa:45:65",
            "net8": "86:b1:4b:d6:c7:02",
            "net9": "86:28:08:d3:46:66"
        },
        "tof_1_2_1": {
            "net0": "e2:5f:9b:bd:35:4e",
            "net1": "ba:63:9d:fc:82:37",
            "net10": "9a:07:76:98:37:be",
            "net11": "e2:0b:fd:8c:25:1c",
            "net12": "4a:71:77:f8:2b:aa",
            "net13": "3a:78:02:74:ac:58",
            "net14": "9e:35:80:e9:ea:17",
            "net15": "0a:c7:4e:6b:fe:ae",
            "net16": "02:bd:1f:58:75:ab",
            "net17": "e2:78:81:b5:4a:00",
            "net18": "22:31:f1:06:3e:97",
            "net19": "0a:11:1d:1c:64:44",
            "net2": "de:73:5c:52:88:e2",
            "net3": "6e:c1:df:3d:d7:c2",
            "net4": "36:bd:09:a8:f8:05",
            "net5": "06:4f:5f:d1:81:a9",
            "net6": "6e:7e:85:c0:d4:d7",
            "net7": "fe:10:36:07:83:e7",
            "net8": "96:92:50:2c:c9:1f",
            "net9": "36:d9:8b:bb:d3:d0"
        },
        "tof_1_2_10": {
            "net0": "0a:3d:98:31:be:cb",
            "net1": "16:75:1c:33:74:3e",
            "net10": "2a:49:ac:fc:16:54",
            "net11": "c6:aa:42:ad:21:eb",
            "net12": "f6:bb:e7:62:ce:55",
            "net13": "2e:a9:42:06:bb:75",
            "net14": "4e:a2:3a:5b:62:c1",
            "net15": "2e:fa:60:97:d7:2b",
            "net16": "0e:18:45:64:c4:25",
            "net17": "82:99:01:3c:6a:c4",
            "net18": "c2:83:88:4f:da:99",
            "net19": "aa:c2:08:1f:c6:df",
            "net2": "52:ea:bb:24:b0:1e",
            "net3": "b2:93:f8:c9:3a:8f",
            "net4": "e6:1c:1d:29:9e:6a",
            "net5": "56:b2:95:3f:26:64",
            "net6": "aa:b2:86:a1:4d:94",
            "net7": "62:bd:2c:de:ce:80",
            "net8": "4a:af:f2:8a:e3:8c",
            "net9": "2e:a3:29:23:21:fb"
        },
        "tof_1_2_2": {
            "net0": "0e:a4:71:77:b9:d5",
            "net1": "46:3f:8a:13:45:90",
            "net10": "7a:6b:42:18:7e:71",
            "net11": "12:3e:2a:e0:db:09",
            "net12": "72:b5:4c:f8:81:66",
            "net13": "4a:16:84:e2:f3:c8",
            "net14": "5e:df:01:f0:04:94",
            "net15": "c6:45:a1:d0:ab:1c",
            "net16": "aa:96:33:eb:7c:e8",
            "net17": "da:34:4d:b5:ac:52",
            "net18": "d2:37:f7:7a:62:50",
            "net19": "06:1d:07:64:92:79",
            "net2": "4e:2f:7b:fa:3b:54",
            "net3": "1e:45:66:fb:de:2d",
            "net4": "32:d9:29:9d:de:99",
            "net5": "b6:9d:71:ca:a4:82",
            "net6": "3a:58:8a:1a:44:8c",
            "net7": "7a:fd:a8:4f:96:c0",
            "net8": "12:51:e9:6d:67:8d",
            "net9": "ba:4f:6e:37:a7:c1"
        },
        "tof_1_2_3": {
            "net0": "9a:5f:70:0b:27:ed",
            "net1": "36:36:21:ab:a3:67",
            "net10": "a6:f7:36:9a:30:0b",
            "net11": "22:43:e9:fe:56:0b",
            "net12": "aa:39:d1:08:6a:ca",
            "net13": "ee:d9:d9:45:9f:ad",
            "net14": "d6:84:13:9c:e1:79",
            "net15": "92:71:72:fa:8d:f0",
            "net16": "86:cc:3b:9f:e7:1d",
            "net17": "4e:6d:11:4d:f7:f9",
            "net18": "36:10:1b:ae:e2:f6",
            "net19": "0e:64:e3:8f:62:88",
            "net2": "d2:07:29:17:b9:e6",
            "net3": "b2:c6:26:8d:e7:f5",
            "net4": "46:06:7e:db:91:da",
            "net5": "7e:bf:91:3b:37:6f",
            "net6": "02:dd:bc:26:8e:86",
            "net7": "c2:df:f9:e3:9e:72",
            "net8": "4e:c7:79:39:88:ba",
            "net9": "f6:78:38:38:f1:3d"
        },
        "tof_1_2_4": {
            "net0": "ee:46:52:e5:be:21",
            "net1": "36:fa:f4:e6:0e:7a",
            "net10": "9a:1b:dc:16:b9:b7",
            "net11": "32:d6:2e:c0:d2:61",
            "net12": "7e:81:2d:12:68:d1",
            "net13": "2a:e1:57:62:ae:df",
            "net14": "8e:bc:ce:52:b2:3e",
            "net15": "ea:27:a3:d4:df:c8",
            "net16": "de:ed:93:11:25:4a",
            "net17": "06:30:f4:25:5c:4b",
            "net18": "2e:3e:76:80:a7:28",
            "net19": "8e:78:11:18:38:47",
            "net2": "5e:f3:97:d0:7a:4f",
            "net3": "7a:28:80:57:9b:ae",
            "net4": "d6:2b:f1:17:04:9d",
            "net5": "12:7f:89:91:96:93",
            "net6": "c6:08:6c:e4:52:a6",
            "net7": "de:6e:0d:db:cd:41",
            "net8": "f2:4e:e1:19:87:8b",
            "net9": "86:2d:ed:ef:26:39"
        },
        "tof_1_2_5": {
            "net0": "4a:4b:71:3d:13:01",
            "net1": "8e:1c:7e:ef:45:e6",
            "net10": "5e:68:81:27:e4:4b",
            "net11": "ce:2b:9f:68:b4:bc",
            "net12": "f6:7e:04:87:ad:46",
            "net13": "62:b0:4a:3e:7c:3d",
            "net14": "d6:97:64:10:50:79",
            "net15": "52:f1:bb:70:e5:7e",
            "net16": "02:47:c5:3e:d4:5f",
            "net17": "3e:53:49:fc:6c:09",
            "net18": "1a:53:53:5e:fe:18",
            "net19": "a6:9a:39:f8:d2:d0",
            "net2": "0a:ad:81:e9:0d:fb",
            "net3": "aa:ea:14:63:66:84",
            "net4": "fe:2d:4e:5c:97:75",
            "net5": "f6:17:01:9f:bd:6b",
            "net6": "f2:20:1a:e3:e4:c1",
            "net7": "4a:82:61:4b:df:ec",
            "net8": "86:b4:2c:af:19:f1",
            "net9": "d2:82:81:5b:27:e9"
        },
        "tof_1_2_6": {
            "net0": "a6:a0:a1:11:7e:54",
            "net1": "06:fd:36:25:e1:28",
            "net10": "8a:61:22:ba:f0:93",
            "net11": "fa:37:8e:b3:81:97",
            "net12": "a2:ca:f7:b3:62:31",
            "net13": "56:f7:2f:98:38:bf",
            "net14": "4e:e8:84:83:7e:c6",
            "net15": "52:de:b5:aa:e4:5d",
            "net16": "c6:d5:e1:73:9c:99",
            "net17": "3a:2e:53:f5:15:3a",
            "net18": "06:9e:2d:10:2b:75",
            "net19": "26:d8:46:e4:b5:fd",
            "net2": "72:91:29:bc:55:d1",
            "net3": "1a:f4:10:d9:28:fc",
            "net4": "86:0c:d2:21:ca:08",
            "net5": "6e:47:ea:15:8f:ca",
            "net6": "0a:46:cb:15:e9:be",
            "net7": "8e:ca:e4:1d:63:df",
            "net8": "2a:76:8e:17:63:45",
            "net9": "8e:ca:42:1e:16:4f"
        },
        "tof_1_2_7": {
            "net0": "7a:d9:be:4a:8f:6e",
            "net1": "9a:c0:58:30:e7:9d",
            "net10": "0a:52:ff:39:66:98",
            "net11": "de:3b:11:9b:2b:5a",
            "net12": "4a:19:cd:bc:b3:4d",
            "net13": "62:7b:10:2a:ea:25",
            "net14": "8a:b1:91:91:28:e1",
            "net15": "ca:2b:16:ae:9f:fb",
            "net16": "36:4c:b3:12:15:27",
            "net17": "fe:6f:fa:1c:ef:77",
            "net18": "fe:26:51:ff:e0:95",
            "net19": "02:bc:84:35:4b:6f",
            "net2": "f6:67:d7:92:97:7d",
            "net3": "3a:a5:0b:e9:93:15",
            "net4": "7a:3b:25:5e:4f:cd",
            "net5": "be:c8:1d:75:f6:41",
            "net6": "e6:b3:bd:89:9e:83",
            "net7": "f6:62:74:1c:9d:a0",
            "net8": "f6:02:bf:dd:6a:65",
            "net9": "fe:c5:56:05:b7:25"
        },
        "tof_1_2_8": {
            "net0": "1a:0d:36:fc:c1:e8",
            "net1": "8a:e6:6d:d7:9c:36",
            "net10": "02:47:ca:30:f9:e8",
            "net11": "4a:f9:e4:71:52:d9",
            "net12": "22:b0:8d:cf:5b:6d",
            "net13": "0e:02:1a:a1:89:1d",
            "net14": "c2:f3:77:d4:70:e6",
            "net15": "a6:40:3e:e6:3a:1a",
            "net16": "a2:dd:1a:9f:12:ed",
            "net17": "36:bc:ae:e1:ec:3a",
            "net18": "1a:36:79:03:fe:59",
            "net19": "6a:c7:42:46:d3:9e",
            "net2": "0e:f1:f1:38:3e:82",
            "net3": "32:c7:6a:26:08:6d",
            "net4": "92:7a:41:c9:ca:79",
            "net5": "36:9b:76:1e:a3:6c",
            "net6": "e6:bd:4b:bc:8e:d6",
            "net7": "ae:57:d3:3e:0a:75",
            "net8": "9a:8b:2e:b2:98:de",
            "net9": "56:cc:50:24:4f:a7"
        },
        "tof_1_2_9": {
            "net0": "9a:29:86:3d:f8:41",
            "net1": "8a:75:51:65:e1:83",
            "net10": "26:29:28:c9:81:8f",
            "net11": "32:af:8f:9b:04:ad",
            "net12": "8e:e6:82:1d:67:3c",
            "net13": "6a:30:04:80:e8:83",
            "net14": "ce:e2:18:c8:9b:05",
            "net15": "52:ab:60:3a:e8:75",
            "net16": "52:eb:d4:45:31:d9",
            "net17": "f6:05:57:79:ce:33",
            "net18": "fe:2d:45:70:d5:7a",
            "net19": "7e:39:26:04:9a:7c",
            "net2": "22:e5:29:ea:c3:c1",
            "net3": "6e:98:71:f9:a5:53",
            "net4": "2e:f5:47:f8:36:f1",
            "net5": "76:f3:28:a1:6e:14",
            "net6": "16:8c:c6:f9:3e:ad",
            "net7": "12:a8:aa:5a:d0:3d",
            "net8": "12:be:10:67:42:87",
            "net9": "ea:c3:69:65:24:e0"
        }
    },
    "failed_machine": "leaf_1_0_1",
    "failed_interfaces": [
        "net0"
    ],
    "failure_time": {
        "leaf_1_0_1": 1635527314.3308806,
        "leaf_1_0_10": 1635527314.6206472,
        "leaf_1_0_2": 1635527314.3547325,
        "leaf_1_0_3": 1635527314.3700154,
        "leaf_1_0_4": 1635527314.3822544,
        "leaf_1_0_5": 1635527314.3953516,
        "leaf_1_0_6": 1635527314.6814108,
        "leaf_1_0_7": 1635527314.3310506,
        "leaf_1_0_8": 1635527314.3432996,
        "leaf_1_0_9": 1635527314.3545442,
        "leaf_2_0_1": 1635527314.3655427,
        "leaf_2_0_10": 1635527314.379342,
        "leaf_2_0_2": 1635527314.3903952,
        "leaf_2_0_3": 1635527314.3999891,
        "leaf_2_0_4": 1635527314.4165807,
        "leaf_2_0_5": 1635527314.4275317,
        "leaf_2_0_6": 1635527314.4359136,
        "leaf_2_0_7": 1635527314.4431548,
        "leaf_2_0_8": 1635527314.7272298,
        "leaf_2_0_9": 1635527314.4593499,
        "spine_1_1_1": 1635527314.4673984,
        "spine_1_1_10": 1635527314.4158978,
        "spine_1_1_2": 1635527314.4281447,
        "spine_1_1_3": 1635527314.4407718,
        "spine_1_1_4": 1635527314.450133,
        "spine_1_1_5": 1635527314.456995,
        "spine_1_1_6": 1635527314.4699926,
        "spine_1_1_7": 1635527314.4784722,
        "spine_1_1_8": 1635527314.750967,
        "spine_1_1_9": 1635527314.4823635,
        "spine_2_1_1": 1635527314.4902005,
        "spine_2_1_10": 1635527314.4985466,
        "spine_2_1_2": 1635527314.508275,
        "spine_2_1_3": 1635527314.5218544,
        "spine_2_1_4": 1635527314.5339112,
        "spine_2_1_5": 1635527314.4871287,
        "spine_2_1_6": 1635527314.494585,
        "spine_2_1_7": 1635527314.5030608,
        "spine_2_1_8": 1635527314.7905507,
        "spine_2_1_9": 1635527314.5372806,
        "tof_1_2_1": 1635527314.5507684,
        "tof_1_2_10": 1635527314.5646763,
        "tof_1_2_2": 1635527314.5506341,
        "tof_1_2_3": 1635527314.561623,
        "tof_1_2_4": 1635527314.5701687,
        "tof_1_2_5": 1635527314.5792394,
        "tof_1_2_6": 1635527314.586625,
        "tof_1_2_7": 1635527314.5942645,
        "tof_1_2_8": 1635527314.6059213,
        "tof_1_2_9": 1635527314.5749624
    }
}