{
    "k_leaf": 4,
    "k_top": 4,
    "redundancy_factor": 4,
    "is_k8s": true,
    "machine_mac_addresses": {
        "leaf_1_0_1": {
            "net0": "2e:c1:50:ed:97:52",
            "net1": "be:49:77:01:8a:cd",
            "net2": "0e:81:d6:bc:0b:95",
            "net3": "82:e2:69:98:fe:6d",
            "net4": "22:6e:e0:f7:72:11"
        },
        "leaf_1_0_2": {
            "net0": "3a:66:bf:51:48:ea",
            "net1": "76:93:54:41:ee:fa",
            "net2": "7a:d7:9c:86:23:67",
            "net3": "8e:2e:7f:11:89:76",
            "net4": "de:ea:fd:3f:c5:28"
        },
        "leaf_1_0_3": {
            "net0": "96:70:e0:19:7c:91",
            "net1": "02:75:48:ce:a8:00",
            "net2": "4e:62:19:4e:14:99",
            "net3": "fe:47:a3:cd:0d:6f",
            "net4": "26:5e:26:da:d0:e6"
        },
        "leaf_1_0_4": {
            "net0": "d2:c1:91:f8:f5:f0",
            "net1": "7a:4e:72:13:ba:56",
            "net2": "96:74:4f:4a:d5:85",
            "net3": "fe:16:b5:e1:c9:50",
            "net4": "8a:8a:f8:60:15:50"
        },
        "leaf_2_0_1": {
            "net0": "7a:76:e9:75:72:12",
            "net1": "56:ec:29:38:dc:c4",
            "net2": "56:d9:30:47:d9:5c",
            "net3": "ca:3b:d3:7a:51:18",
            "net4": "f2:3d:01:2c:bf:1c"
        },
        "leaf_2_0_2": {
            "net0": "9e:51:3b:af:05:c4",
            "net1": "12:8b:72:92:fc:c0",
            "net2": "32:72:fa:84:16:e2",
            "net3": "86:91:85:c4:3d:8a",
            "net4": "9e:86:c2:ef:a3:8f"
        },
        "leaf_2_0_3": {
            "net0": "9a:a0:63:f6:93:7d",
            "net1": "ee:db:94:65:60:e2",
            "net2": "5a:7f:4c:0e:90:82",
            "net3": "6a:79:8e:63:42:06",
            "net4": "fe:1b:03:d4:b1:19"
        },
        "leaf_2_0_4": {
            "net0": "d6:11:81:f5:11:ce",
            "net1": "92:04:95:24:93:6d",
            "net2": "36:8c:9f:6a:8e:7e",
            "net3": "16:94:3b:5d:48:82",
            "net4": "3e:60:d6:d4:59:1a"
        },
        "spine_1_1_1": {
            "net0": "3a:e8:0f:7e:f7:54",
            "net1": "72:69:1d:39:17:78",
            "net2": "f6:8a:cd:c2:b1:b0",
            "net3": "3e:66:61:db:39:51",
            "net4": "ca:08:09:f1:b7:d9",
            "net5": "6e:4b:cb:03:03:28",
            "net6": "06:dc:ad:68:b1:dd",
            "net7": "56:f0:96:7c:d6:a5"
        },
        "spine_1_1_2": {
            "net0": "8e:14:31:3a:f9:75",
            "net1": "1a:3e:f7:76:b1:ed",
            "net2": "8e:5a:d5:ae:19:11",
            "net3": "66:64:f3:05:be:d3",
            "net4": "d2:87:64:3b:c2:a3",
            "net5": "4a:ac:8a:b3:07:0e",
            "net6": "42:e0:b7:98:15:45",
            "net7": "1e:23:e9:99:ad:08"
        },
        "spine_1_1_3": {
            "net0": "3a:74:4a:d4:d0:aa",
            "net1": "0a:77:37:8b:22:bb",
            "net2": "62:20:1b:d5:22:ef",
            "net3": "76:79:d8:cb:fe:02",
            "net4": "c6:c8:1f:40:30:2b",
            "net5": "9a:b5:42:c9:e2:0b",
            "net6": "26:ca:6b:2d:83:14",
            "net7": "ee:14:79:42:fc:00"
        },
        "spine_1_1_4": {
            "net0": "82:e7:91:ee:d9:67",
            "net1": "76:a0:62:a9:f5:8f",
            "net2": "8e:46:2f:52:9e:63",
            "net3": "2a:fa:35:a1:53:b5",
            "net4": "8a:a0:78:78:c9:9a",
            "net5": "4e:cf:89:16:da:99",
            "net6": "16:88:17:0a:8f:ef",
            "net7": "a6:af:40:b9:2a:0f"
        },
        "spine_2_1_1": {
            "net0": "8a:dc:12:f2:97:09",
            "net1": "3a:18:b1:91:a6:08",
            "net2": "36:07:34:d1:90:b0",
            "net3": "92:cb:9e:1f:7a:ed",
            "net4": "f6:1d:be:92:b2:ce",
            "net5": "6a:c8:c2:f0:3e:b1",
            "net6": "b6:f9:a2:d1:f2:ad",
            "net7": "c2:1f:11:77:43:40"
        },
        "spine_2_1_2": {
            "net0": "ae:9c:de:b0:08:12",
            "net1": "9a:31:f8:af:d9:a5",
            "net2": "5a:b4:86:50:0a:69",
            "net3": "be:29:93:90:79:3b",
            "net4": "12:f1:cb:2e:99:eb",
            "net5": "ae:70:b9:e9:37:1e",
            "net6": "56:87:75:93:5a:f1",
            "net7": "da:fc:c5:fb:d3:70"
        },
        "spine_2_1_3": {
            "net0": "4a:54:1b:e1:66:e5",
            "net1": "0e:d8:69:85:98:f5",
            "net2": "6e:e6:47:01:62:86",
            "net3": "7e:08:02:e2:fe:8f",
            "net4": "72:56:29:ae:1a:58",
            "net5": "be:ad:94:4c:7d:da",
            "net6": "fa:0e:73:53:01:e7",
            "net7": "ca:64:16:1c:6c:66"
        },
        "spine_2_1_4": {
            "net0": "c2:f9:c9:f1:1f:16",
            "net1": "02:15:e9:ed:a6:0a",
            "net2": "7a:2e:a8:a6:4d:7e",
            "net3": "0e:34:c2:c0:11:d4",
            "net4": "fe:ba:c8:77:9d:f8",
            "net5": "a6:a5:00:98:8f:a6",
            "net6": "62:98:d1:9f:68:c2",
            "net7": "a2:e0:1a:6d:7c:6b"
        },
        "tof_1_2_1": {
            "net0": "d2:82:75:34:ba:11",
            "net1": "4e:5c:36:2d:51:18",
            "net2": "ea:08:75:4d:e8:f2",
            "net3": "66:14:ca:91:ef:a9",
            "net4": "2a:83:c4:44:f2:33",
            "net5": "42:da:fc:da:80:31",
            "net6": "12:8d:05:fa:e4:92",
            "net7": "ba:64:0e:26:63:68"
        },
        "tof_1_2_2": {
            "net0": "ee:92:f1:0f:3c:94",
            "net1": "9e:77:c2:1d:c3:98",
            "net2": "ee:ee:18:65:99:0d",
            "net3": "7a:97:72:af:5a:cc",
            "net4": "9e:60:27:35:0a:b6",
            "net5": "c2:e4:ee:89:9e:77",
            "net6": "8a:cd:24:26:8a:11",
            "net7": "a2:3b:80:d6:c8:93"
        },
        "tof_1_2_3": {
            "net0": "12:34:e8:c4:00:58",
            "net1": "02:c1:3f:eb:54:b0",
            "net2": "da:4c:4e:a3:e4:ed",
            "net3": "7e:70:ec:db:04:12",
            "net4": "12:86:40:51:ec:0a",
            "net5": "7a:92:31:bb:95:c2",
            "net6": "46:b9:cd:84:a8:74",
            "net7": "02:1a:69:55:e1:96"
        },
        "tof_1_2_4": {
            "net0": "f2:d0:a5:f9:d4:df",
            "net1": "a6:20:4a:4f:c3:7f",
            "net2": "6e:93:d4:94:35:30",
            "net3": "7e:49:86:2e:e0:29",
            "net4": "46:bc:b1:da:57:2f",
            "net5": "d2:75:a1:35:6b:ed",
            "net6": "8a:81:04:ec:6b:54",
            "net7": "26:11:4c:2b:b9:2f"
        }
    },
    "failed_machine": "leaf_1_0_1",
    "failure_time": {
        "leaf_1_0_1": 1621992710.4846601,
        "leaf_1_0_2": 1621992700.9187324,
        "leaf_1_0_3": 1621992710.5039282,
        "leaf_1_0_4": 1621992710.5279229,
        "leaf_2_0_1": 1621992710.496467,
        "leaf_2_0_2": 1621992710.5221307,
        "leaf_2_0_3": 1621992700.9100573,
        "leaf_2_0_4": 1621992710.5350752,
        "spine_1_1_1": 1621992710.546786,
        "spine_1_1_2": 1621992710.5931256,
        "spine_1_1_3": 1621992710.5602872,
        "spine_1_1_4": 1621992710.588774,
        "spine_2_1_1": 1621992710.5711665,
        "spine_2_1_2": 1621992701.0039525,
        "spine_2_1_3": 1621992710.5832279,
        "spine_2_1_4": 1621992710.610952,
        "tof_1_2_1": 1621992710.620263,
        "tof_1_2_2": 1621992710.6283655,
        "tof_1_2_3": 1621992710.6218328,
        "tof_1_2_4": 1621992710.6339965
    }
}