{
    "k_leaf": 14,
    "k_top": 14,
    "redundancy_factor": 14,
    "is_k8s": true,
    "machine_mac_addresses": {
        "leaf_1_0_1": {
            "net0": "62:35:23:0f:b5:97",
            "net1": "8a:7a:44:0b:0d:03",
            "net10": "b6:f6:3d:94:6c:e1",
            "net11": "6a:5b:dd:43:e7:65",
            "net12": "4e:66:d1:59:61:63",
            "net13": "3a:29:27:b6:33:6c",
            "net14": "36:9d:8e:d7:1c:69",
            "net2": "12:47:64:90:f9:42",
            "net3": "a2:4f:5b:86:76:7e",
            "net4": "76:ec:65:23:c0:f6",
            "net5": "5e:3a:7c:4c:a0:60",
            "net6": "e6:08:ee:d2:cb:bf",
            "net7": "62:d2:98:b6:d5:8e",
            "net8": "52:3a:49:b3:3d:ba",
            "net9": "d6:4f:c6:cf:de:5a"
        },
        "leaf_1_0_10": {
            "net0": "de:d7:b7:7b:29:00",
            "net1": "fa:e7:16:30:9b:61",
            "net10": "5e:68:66:70:c5:0c",
            "net11": "ae:59:cd:93:ac:0d",
            "net12": "36:43:3f:c4:fb:f0",
            "net13": "e2:dd:c3:69:50:2d",
            "net14": "06:d7:d0:ea:59:0e",
            "net2": "1a:0c:a7:28:a9:af",
            "net3": "7a:25:d1:dc:25:7c",
            "net4": "de:1e:55:9e:84:65",
            "net5": "1a:12:02:0c:33:78",
            "net6": "26:cf:e6:c3:89:68",
            "net7": "42:a2:22:01:67:65",
            "net8": "ae:96:df:b4:14:15",
            "net9": "7a:15:70:ed:fe:98"
        },
        "leaf_1_0_11": {
            "net0": "ce:35:fe:56:de:b5",
            "net1": "d6:bd:22:ea:fd:38",
            "net10": "ea:26:53:8d:b2:35",
            "net11": "32:6d:da:a3:88:ee",
            "net12": "86:6d:22:ff:9c:55",
            "net13": "4e:26:6c:b9:05:dd",
            "net14": "26:8c:81:c5:ab:60",
            "net2": "36:64:e0:2e:93:5d",
            "net3": "32:30:2a:86:27:90",
            "net4": "7e:b9:10:c8:a2:5c",
            "net5": "a2:10:09:2b:80:7c",
            "net6": "3e:99:5d:40:7e:1f",
            "net7": "46:eb:8c:64:21:83",
            "net8": "9e:0c:bc:af:99:09",
            "net9": "aa:c5:17:04:d4:c7"
        },
        "leaf_1_0_12": {
            "net0": "12:df:0c:f5:8f:ea",
            "net1": "06:09:76:6c:3b:88",
            "net10": "4e:99:0f:c8:1a:e0",
            "net11": "c6:f9:90:e1:3b:25",
            "net12": "5a:4a:29:85:39:0f",
            "net13": "9e:26:1f:2d:47:91",
            "net14": "aa:50:b5:8f:cd:3e",
            "net2": "ce:52:15:bb:cf:34",
            "net3": "aa:0e:21:82:b4:a6",
            "net4": "ae:56:96:43:b9:02",
            "net5": "86:b2:66:78:ca:07",
            "net6": "c6:0d:c0:bd:77:18",
            "net7": "96:67:cb:19:54:29",
            "net8": "ca:23:dc:7a:37:e1",
            "net9": "1e:f6:c7:4c:27:d7"
        },
        "leaf_1_0_13": {
            "net0": "f2:37:50:33:ee:13",
            "net1": "96:4c:40:54:66:6d",
            "net10": "32:22:f4:3d:f5:b1",
            "net11": "ca:28:79:20:95:96",
            "net12": "1e:77:1c:ad:76:e4",
            "net13": "9a:94:b0:fb:f7:f9",
            "net14": "72:4a:09:d9:62:97",
            "net2": "ea:c8:bd:d6:a0:f3",
            "net3": "6e:05:25:3f:a5:45",
            "net4": "3a:6f:73:90:ca:65",
            "net5": "ea:a4:6a:0a:68:c0",
            "net6": "3a:b2:44:b1:73:d9",
            "net7": "f6:ea:23:61:4b:f2",
            "net8": "be:5a:88:21:83:8f",
            "net9": "06:f0:7f:bb:ad:7d"
        },
        "leaf_1_0_14": {
            "net0": "b6:dd:28:16:ca:d1",
            "net1": "c6:53:08:72:0f:cf",
            "net10": "56:1c:b6:1d:93:0d",
            "net11": "46:02:5c:62:3e:9f",
            "net12": "aa:14:ba:30:db:4f",
            "net13": "ae:7f:05:a3:87:44",
            "net14": "8e:c8:36:5e:bb:a3",
            "net2": "16:7c:69:25:26:66",
            "net3": "96:37:f0:aa:df:90",
            "net4": "f6:e5:8a:22:95:38",
            "net5": "56:e7:74:2a:25:2e",
            "net6": "46:ce:bc:36:b8:c2",
            "net7": "86:24:02:9e:84:8b",
            "net8": "56:cd:c7:fe:5b:96",
            "net9": "12:c3:25:f0:0f:30"
        },
        "leaf_1_0_2": {
            "net0": "c2:c5:03:c3:9b:56",
            "net1": "7e:74:ea:ee:8b:da",
            "net10": "62:99:83:1c:d9:38",
            "net11": "36:62:ae:0a:04:31",
            "net12": "d6:0d:74:fe:e0:7c",
            "net13": "36:45:0f:97:c8:81",
            "net14": "82:03:b5:14:e8:7f",
            "net2": "9a:fa:a3:37:39:83",
            "net3": "8e:0e:1d:6a:df:89",
            "net4": "82:c2:fe:bd:5d:f5",
            "net5": "96:e8:c4:76:a1:af",
            "net6": "3e:d5:f2:01:72:69",
            "net7": "2a:d0:ca:b8:eb:07",
            "net8": "4e:00:14:b5:4d:7a",
            "net9": "2a:63:67:09:f4:c9"
        },
        "leaf_1_0_3": {
            "net0": "d2:2e:dc:2e:08:ae",
            "net1": "b6:8e:bb:00:52:bf",
            "net10": "fe:b5:3c:09:04:39",
            "net11": "5a:70:e8:f1:28:11",
            "net12": "92:93:27:2c:0d:b6",
            "net13": "76:7d:68:81:18:ac",
            "net14": "aa:8f:4b:d3:5c:5a",
            "net2": "de:29:7f:ea:92:84",
            "net3": "72:a2:16:c1:67:18",
            "net4": "ce:d2:68:04:b3:ca",
            "net5": "4e:e2:c1:3f:c9:7d",
            "net6": "ca:54:3a:c7:01:ca",
            "net7": "3e:ff:fb:6e:02:e3",
            "net8": "52:0a:3f:b8:a9:88",
            "net9": "da:d6:e1:0d:e9:5d"
        },
        "leaf_1_0_4": {
            "net0": "ee:15:43:1a:96:78",
            "net1": "b6:bf:60:bc:6c:71",
            "net10": "aa:f4:91:a0:fb:62",
            "net11": "ea:e4:a4:e4:d2:ad",
            "net12": "8a:56:93:56:af:12",
            "net13": "3e:92:45:e4:67:bc",
            "net14": "7e:87:4f:55:0a:e7",
            "net2": "76:d9:29:56:fb:a4",
            "net3": "a6:cb:11:7f:19:04",
            "net4": "2a:cd:de:16:96:e4",
            "net5": "be:2c:9d:c8:a7:02",
            "net6": "6e:d7:c0:19:91:0c",
            "net7": "1a:a5:81:f2:b9:d9",
            "net8": "0a:a2:e3:e4:94:04",
            "net9": "26:8d:9b:fb:32:fc"
        },
        "leaf_1_0_5": {
            "net0": "06:71:d5:a3:56:32",
            "net1": "4a:62:c7:db:d4:a1",
            "net10": "ba:8a:68:41:e2:69",
            "net11": "8a:c2:4e:50:e0:40",
            "net12": "5e:23:38:b1:48:16",
            "net13": "06:96:67:dc:c9:bb",
            "net14": "3e:28:3f:54:77:0d",
            "net2": "fa:78:79:0c:3b:41",
            "net3": "0e:fb:46:15:88:89",
            "net4": "32:ad:e1:2d:84:a9",
            "net5": "52:c6:cd:d3:62:9e",
            "net6": "66:1e:95:48:4e:66",
            "net7": "32:38:1f:c3:6a:4e",
            "net8": "42:d8:4e:7f:36:c7",
            "net9": "2a:3b:bb:66:dd:b7"
        },
        "leaf_1_0_6": {
            "net0": "9a:33:c6:ac:d3:be",
            "net1": "62:4c:7e:e3:d2:ff",
            "net10": "fa:be:8c:02:22:8e",
            "net11": "aa:71:3d:48:0a:84",
            "net12": "c6:66:cc:10:88:5b",
            "net13": "3a:33:98:d9:73:f6",
            "net14": "ee:27:00:4b:8a:3a",
            "net2": "ce:fe:00:9b:63:8d",
            "net3": "9e:f1:e6:57:d3:b3",
            "net4": "b2:d9:52:df:20:3f",
            "net5": "2a:bd:6d:94:4e:37",
            "net6": "56:56:a4:b0:c9:ae",
            "net7": "be:26:9f:a6:48:02",
            "net8": "b6:37:ce:8f:b2:b9",
            "net9": "f6:81:72:d1:52:f7"
        },
        "leaf_1_0_7": {
            "net0": "b2:a6:8f:52:cc:1b",
            "net1": "b2:9e:6e:a0:a3:f2",
            "net10": "ca:4b:72:cf:e3:23",
            "net11": "e6:83:08:55:5e:3d",
            "net12": "de:bb:d5:40:77:84",
            "net13": "ca:14:e5:43:4a:e5",
            "net14": "2a:da:cd:85:85:6c",
            "net2": "52:5d:96:66:c2:6e",
            "net3": "16:29:1c:2e:4e:95",
            "net4": "de:7c:4b:f8:70:3e",
            "net5": "a6:45:db:dc:7a:b0",
            "net6": "46:da:c3:9e:9f:e4",
            "net7": "ee:2e:21:17:bf:64",
            "net8": "36:2b:d5:1f:7b:6c",
            "net9": "9a:86:20:db:75:28"
        },
        "leaf_1_0_8": {
            "net0": "f2:3a:33:86:3c:b7",
            "net1": "c2:02:4b:ee:e9:df",
            "net10": "3e:dc:db:d5:e9:8c",
            "net11": "46:b1:99:6e:92:4c",
            "net12": "d2:0f:5a:9e:2d:db",
            "net13": "2e:87:bf:b4:39:c6",
            "net14": "16:cb:60:ea:24:f5",
            "net2": "8e:55:4c:ee:64:6c",
            "net3": "3e:16:2a:06:7b:73",
            "net4": "fa:58:ff:81:f6:c3",
            "net5": "fe:c9:8b:11:70:69",
            "net6": "16:fb:c1:d8:0e:be",
            "net7": "7e:7c:c5:46:4f:24",
            "net8": "5a:4e:65:c9:a1:ef",
            "net9": "2a:c5:e9:de:7c:69"
        },
        "leaf_1_0_9": {
            "net0": "a2:0f:43:cf:bd:ba",
            "net1": "12:90:11:27:cc:57",
            "net10": "56:73:99:b7:6a:8f",
            "net11": "0a:b2:bd:2f:55:34",
            "net12": "5e:17:c2:4b:5d:81",
            "net13": "56:05:3a:0c:b0:83",
            "net14": "96:18:a1:9c:3b:b8",
            "net2": "c2:c3:68:1c:b0:77",
            "net3": "7e:1d:e1:d3:4e:51",
            "net4": "da:cb:38:03:e4:0b",
            "net5": "4e:e0:b2:b2:19:ce",
            "net6": "02:08:0e:f2:20:da",
            "net7": "6e:37:8b:22:33:ad",
            "net8": "de:e2:e1:12:6c:81",
            "net9": "ee:de:c8:54:ee:97"
        },
        "leaf_2_0_1": {
            "net0": "2e:c0:f2:56:33:ee",
            "net1": "c2:0d:91:da:ee:c8",
            "net10": "e2:ec:44:1b:6d:92",
            "net11": "1e:4f:7a:3f:c6:81",
            "net12": "e2:1a:ec:68:62:b0",
            "net13": "da:f3:03:11:aa:0e",
            "net14": "ca:8b:f6:cd:06:3c",
            "net2": "c6:a8:56:7b:04:53",
            "net3": "9e:f5:fe:83:d8:0c",
            "net4": "4e:a3:8d:b6:fd:53",
            "net5": "96:c3:ef:72:62:fb",
            "net6": "ae:ba:b1:fa:2d:e5",
            "net7": "8e:47:dd:3c:df:81",
            "net8": "3e:11:53:33:f1:d8",
            "net9": "52:98:ae:b6:fe:68"
        },
        "leaf_2_0_10": {
            "net0": "86:c6:84:57:12:de",
            "net1": "66:d0:ea:ff:3a:14",
            "net10": "ee:c4:ae:2a:a1:14",
            "net11": "be:68:3c:49:ed:70",
            "net12": "72:76:e0:85:9b:4d",
            "net13": "32:3f:64:dd:6f:61",
            "net14": "76:71:e9:b5:d6:ea",
            "net2": "62:4e:35:a4:fa:78",
            "net3": "7e:d6:73:1f:25:f6",
            "net4": "c2:af:78:e5:16:46",
            "net5": "9e:94:bd:11:e1:8a",
            "net6": "5a:e0:98:c2:ee:87",
            "net7": "c2:63:11:2d:93:48",
            "net8": "66:1e:f7:82:e8:ef",
            "net9": "26:b0:ca:a1:50:44"
        },
        "leaf_2_0_11": {
            "net0": "2a:92:3a:8c:30:7e",
            "net1": "76:29:2b:cf:a3:4c",
            "net10": "fe:93:07:f2:10:69",
            "net11": "8a:50:1e:74:0a:9f",
            "net12": "0e:27:81:78:81:c3",
            "net13": "d6:d7:94:73:8a:4f",
            "net14": "7a:b9:6e:ec:f7:de",
            "net2": "56:95:c4:aa:d1:ca",
            "net3": "ba:f9:ef:b0:60:bf",
            "net4": "1a:7b:b8:52:24:a6",
            "net5": "02:d7:83:8a:4d:df",
            "net6": "5e:fd:84:ba:40:55",
            "net7": "1a:41:fe:03:ca:2a",
            "net8": "4a:d9:d7:00:0e:34",
            "net9": "6a:61:f8:51:03:5c"
        },
        "leaf_2_0_12": {
            "net0": "8a:ef:7c:7d:6a:02",
            "net1": "12:67:a7:f5:43:76",
            "net10": "ae:24:e2:0c:fd:84",
            "net11": "02:76:ca:ee:96:e0",
            "net12": "32:f2:f3:37:66:c9",
            "net13": "76:0b:c2:7c:e5:c8",
            "net14": "9e:5a:ef:91:c7:39",
            "net2": "3e:7b:7b:7c:26:00",
            "net3": "1e:ef:63:15:00:92",
            "net4": "3a:49:a9:c7:da:2f",
            "net5": "da:88:01:ce:65:8b",
            "net6": "2e:39:31:72:7d:b1",
            "net7": "52:f7:8d:50:05:8b",
            "net8": "4e:9c:d8:b9:5b:ee",
            "net9": "8a:e2:ea:ee:4c:67"
        },
        "leaf_2_0_13": {
            "net0": "8e:49:71:c5:b1:dd",
            "net1": "52:78:58:4a:aa:69",
            "net10": "b2:a5:f3:05:13:fe",
            "net11": "fa:c4:f8:c5:fe:3d",
            "net12": "be:ab:57:50:c3:42",
            "net13": "c2:0c:5d:6d:2c:4a",
            "net14": "ea:fd:76:23:16:8b",
            "net2": "fa:a8:0e:49:77:b8",
            "net3": "aa:45:d8:b0:1a:3f",
            "net4": "e2:ed:4b:55:dc:d8",
            "net5": "ce:5d:6c:5d:99:4b",
            "net6": "f6:4c:7e:5b:6b:0c",
            "net7": "d2:3e:6e:98:89:a2",
            "net8": "4e:75:08:f2:4a:a9",
            "net9": "96:6b:8d:97:ab:cf"
        },
        "leaf_2_0_14": {
            "net0": "26:77:9b:41:fc:1f",
            "net1": "6a:1e:b7:e8:8b:39",
            "net10": "6e:3f:62:f4:80:8f",
            "net11": "6e:73:7a:33:49:91",
            "net12": "ee:f8:d0:c0:7c:f2",
            "net13": "62:8d:89:fc:c2:07",
            "net14": "5a:47:f0:f6:c3:ab",
            "net2": "22:27:bd:5e:26:36",
            "net3": "46:87:1f:59:17:db",
            "net4": "ce:02:a3:3c:68:9a",
            "net5": "7e:cc:57:b6:b6:a5",
            "net6": "0a:dd:b7:00:fa:97",
            "net7": "a2:00:fc:58:89:5b",
            "net8": "ba:c7:93:ed:be:0c",
            "net9": "f6:3e:8f:e9:e9:6c"
        },
        "leaf_2_0_2": {
            "net0": "d6:b9:d4:8e:df:1d",
            "net1": "ba:cd:9d:a8:2b:25",
            "net10": "ae:3a:9f:ef:38:41",
            "net11": "36:e7:44:f7:a5:25",
            "net12": "9a:e8:93:63:2a:2d",
            "net13": "6e:be:ed:6c:71:26",
            "net14": "32:22:d2:48:ea:01",
            "net2": "ca:61:8a:d4:6d:c9",
            "net3": "6a:3f:5f:dc:d7:62",
            "net4": "d2:59:a5:cb:f6:e1",
            "net5": "42:5b:18:60:03:8e",
            "net6": "92:9e:a1:bd:db:30",
            "net7": "a2:e4:b1:ac:35:16",
            "net8": "8a:f8:6d:c1:31:18",
            "net9": "ee:5c:ec:84:cd:af"
        },
        "leaf_2_0_3": {
            "net0": "06:55:c4:45:22:d7",
            "net1": "aa:1d:41:89:fd:3f",
            "net10": "8e:d0:29:4e:94:5b",
            "net11": "9a:cd:86:79:59:cb",
            "net12": "8a:04:1e:6b:7f:5a",
            "net13": "c6:11:7a:51:0a:1f",
            "net14": "26:fa:8a:f2:5f:e1",
            "net2": "de:bb:71:47:ef:e5",
            "net3": "8a:76:65:c5:bd:7b",
            "net4": "2e:62:e5:11:56:cf",
            "net5": "16:71:7d:96:25:aa",
            "net6": "6a:4f:0c:82:4f:98",
            "net7": "d2:ad:98:c6:b6:ac",
            "net8": "72:39:00:f0:21:f7",
            "net9": "c6:e6:05:94:ea:7e"
        },
        "leaf_2_0_4": {
            "net0": "ea:19:2e:07:99:6c",
            "net1": "6e:ae:90:22:cf:a9",
            "net10": "ea:46:cf:b6:99:07",
            "net11": "f6:39:04:8d:61:36",
            "net12": "66:ec:fb:84:92:91",
            "net13": "3a:57:71:28:b5:0c",
            "net14": "3a:19:21:8a:ee:49",
            "net2": "9e:59:4d:a8:d9:ed",
            "net3": "76:2c:0a:54:90:1b",
            "net4": "2a:16:ec:46:4b:11",
            "net5": "22:ef:75:a1:80:1b",
            "net6": "ea:a5:0c:3e:82:c8",
            "net7": "2a:e4:9a:99:10:76",
            "net8": "3e:2c:58:02:bb:24",
            "net9": "66:04:52:7c:3d:bc"
        },
        "leaf_2_0_5": {
            "net0": "66:80:ad:02:25:85",
            "net1": "1e:28:75:00:21:1b",
            "net10": "6a:ff:09:3a:c7:f4",
            "net11": "f6:d4:fc:18:e3:4f",
            "net12": "b2:fb:87:72:0b:ee",
            "net13": "86:0f:f8:73:43:bf",
            "net14": "32:6d:e4:eb:18:0c",
            "net2": "0a:02:80:09:33:b3",
            "net3": "56:b3:bb:3f:84:11",
            "net4": "5a:de:a9:3d:fb:d8",
            "net5": "aa:49:50:7a:91:32",
            "net6": "7e:87:d3:82:2e:27",
            "net7": "7a:c8:f4:f9:6c:3b",
            "net8": "96:d5:b3:df:f0:48",
            "net9": "72:08:a8:6e:78:fc"
        },
        "leaf_2_0_6": {
            "net0": "d6:27:dc:a1:dd:42",
            "net1": "3a:15:f5:66:0a:37",
            "net10": "8e:90:7c:10:8b:c3",
            "net11": "8e:0d:22:7d:58:1a",
            "net12": "06:c1:36:e9:af:b8",
            "net13": "d6:d0:9b:b9:93:60",
            "net14": "4a:3b:96:ca:db:69",
            "net2": "32:13:8a:84:99:83",
            "net3": "86:86:e7:05:1a:df",
            "net4": "f2:6d:e1:23:aa:f0",
            "net5": "3a:0c:53:42:fd:76",
            "net6": "f2:89:bb:98:1f:0d",
            "net7": "32:ef:d6:93:cc:ba",
            "net8": "0e:e2:15:08:5d:b8",
            "net9": "fa:42:4f:8c:d4:9e"
        },
        "leaf_2_0_7": {
            "net0": "0e:39:fe:78:3d:e5",
            "net1": "ea:7b:95:9f:01:7c",
            "net10": "be:da:07:9f:86:cd",
            "net11": "36:93:6e:b8:c8:63",
            "net12": "ee:a1:c0:78:2c:36",
            "net13": "ae:57:c4:1e:c1:f9",
            "net14": "36:51:f4:35:1f:9e",
            "net2": "ca:54:2f:49:b8:99",
            "net3": "de:15:6d:e6:82:e2",
            "net4": "3e:76:05:8b:2a:de",
            "net5": "f2:e4:bc:3e:07:37",
            "net6": "76:e4:08:be:be:4e",
            "net7": "e6:12:5a:30:43:a6",
            "net8": "3a:94:4f:3b:9e:24",
            "net9": "36:e9:7a:22:ad:9a"
        },
        "leaf_2_0_8": {
            "net0": "f2:c6:9d:ef:7f:fe",
            "net1": "02:69:17:d3:bf:91",
            "net10": "86:67:4b:88:13:05",
            "net11": "0a:0f:e3:68:52:54",
            "net12": "ae:f1:59:d8:5f:b8",
            "net13": "2e:d4:49:ea:d1:b1",
            "net14": "6a:a6:17:0a:64:62",
            "net2": "72:2f:83:f1:6d:8f",
            "net3": "ce:7e:fc:7a:39:db",
            "net4": "4a:80:fc:98:53:2b",
            "net5": "7a:42:54:16:d7:f0",
            "net6": "ea:78:17:cb:10:a4",
            "net7": "76:32:4f:2d:95:2a",
            "net8": "9e:48:50:e7:d7:47",
            "net9": "2a:c0:6a:84:ea:d8"
        },
        "leaf_2_0_9": {
            "net0": "02:15:65:13:cb:6d",
            "net1": "9e:50:08:f9:47:c9",
            "net10": "fe:c3:53:fd:05:19",
            "net11": "22:af:40:c8:49:76",
            "net12": "42:ad:8e:3d:76:32",
            "net13": "ce:33:b5:d4:f1:e0",
            "net14": "02:10:78:6a:8f:07",
            "net2": "22:07:2e:6a:a1:9a",
            "net3": "76:15:7e:97:d0:58",
            "net4": "fe:f7:51:ed:79:f6",
            "net5": "76:c5:5a:14:17:37",
            "net6": "7e:1e:39:ce:77:fb",
            "net7": "de:b0:ad:c7:d6:0b",
            "net8": "0e:70:fc:26:19:b7",
            "net9": "96:f5:3c:e3:ca:49"
        },
        "spine_1_1_1": {
            "net0": "2a:00:7f:df:bb:cc",
            "net1": "ee:dc:e2:69:51:43",
            "net10": "ee:64:4f:2d:14:24",
            "net11": "8e:dd:cf:f0:c5:d2",
            "net12": "c2:4b:7c:35:e2:da",
            "net13": "aa:41:db:71:95:91",
            "net14": "42:33:ce:2b:76:93",
            "net15": "4e:91:83:1b:a3:fb",
            "net16": "d2:73:d3:1e:6f:ac",
            "net17": "1e:c7:f4:d5:6a:4f",
            "net18": "1a:e3:a6:5c:6f:a2",
            "net19": "86:78:08:21:64:e0",
            "net2": "32:88:b3:5b:c6:1f",
            "net20": "f6:9a:c0:4f:b5:fd",
            "net21": "fa:13:23:bf:60:e3",
            "net22": "0e:66:a5:f9:8f:54",
            "net23": "8e:1c:27:54:0a:1a",
            "net24": "7a:9c:a2:f4:ea:55",
            "net25": "e2:e4:ce:d8:17:a5",
            "net26": "92:9e:3c:76:4b:7d",
            "net27": "d2:12:3e:f8:d8:03",
            "net3": "de:20:e9:18:ba:17",
            "net4": "8e:2f:49:2c:77:42",
            "net5": "f6:fc:37:8e:02:2f",
            "net6": "26:97:f2:0a:29:00",
            "net7": "e2:23:77:0c:c7:ea",
            "net8": "da:9a:f2:58:de:47",
            "net9": "66:eb:6d:1b:76:cd"
        },
        "spine_1_1_10": {
            "net0": "fa:ce:39:dd:20:5b",
            "net1": "2e:5b:ed:0d:4f:19",
            "net10": "4a:07:c6:54:a4:07",
            "net11": "be:02:1f:79:fb:63",
            "net12": "9a:28:47:d6:fe:4b",
            "net13": "22:b6:76:9a:40:56",
            "net14": "6e:b6:8b:5e:e5:32",
            "net15": "2a:77:f0:b7:12:f9",
            "net16": "52:23:e9:ce:f4:da",
            "net17": "b6:98:1f:47:e6:96",
            "net18": "1a:6f:23:9b:26:25",
            "net19": "0e:65:45:46:83:ba",
            "net2": "52:ea:7d:1a:9e:0c",
            "net20": "86:89:4f:3e:c7:c9",
            "net21": "0a:60:78:8d:19:96",
            "net22": "0a:cc:c3:98:f2:37",
            "net23": "2e:46:2b:ab:b3:a1",
            "net24": "66:0a:2e:7b:08:43",
            "net25": "56:15:e7:a3:0d:7d",
            "net26": "2e:5e:4f:12:ca:d5",
            "net27": "ee:02:95:1c:e7:df",
            "net3": "96:fb:31:e2:28:e3",
            "net4": "1e:62:f6:f1:38:42",
            "net5": "56:b1:85:38:2d:7e",
            "net6": "02:b2:8c:87:c3:40",
            "net7": "ee:f1:46:6f:3c:27",
            "net8": "2e:07:c3:03:5d:9b",
            "net9": "62:4f:b0:03:d6:e0"
        },
        "spine_1_1_11": {
            "net0": "02:1d:ea:3d:89:c0",
            "net1": "06:3e:88:db:24:31",
            "net10": "e2:f1:cf:22:f4:e3",
            "net11": "82:3e:ad:c8:77:af",
            "net12": "76:2a:d6:20:34:01",
            "net13": "82:fd:41:2b:e4:81",
            "net14": "4e:d5:2e:6a:71:c8",
            "net15": "3e:94:bf:a0:40:f3",
            "net16": "32:1a:e9:8e:6a:a7",
            "net17": "46:7c:b9:7b:75:5c",
            "net18": "52:4e:44:10:1a:a3",
            "net19": "36:7f:7f:a5:e8:5f",
            "net2": "16:de:0b:82:d8:dd",
            "net20": "02:0a:82:57:7a:fd",
            "net21": "f2:9a:d6:52:27:71",
            "net22": "46:2b:b0:10:60:01",
            "net23": "3a:ad:b0:fb:84:b6",
            "net24": "f6:36:36:75:4c:a8",
            "net25": "8a:d5:b2:d6:19:39",
            "net26": "ca:0c:32:ac:1d:3b",
            "net27": "56:bb:78:9d:14:d6",
            "net3": "52:cb:ef:6f:33:d4",
            "net4": "12:a9:ff:84:d0:0b",
            "net5": "86:fa:fe:85:da:d7",
            "net6": "4a:30:1a:3f:66:1c",
            "net7": "42:87:4e:8b:4b:75",
            "net8": "66:e5:44:4f:ac:e3",
            "net9": "5a:61:0e:af:07:f5"
        },
        "spine_1_1_12": {
            "net0": "de:12:23:1b:bb:26",
            "net1": "1e:3c:d8:f9:41:14",
            "net10": "de:69:3a:0d:17:7d",
            "net11": "ee:5f:ca:80:b4:d2",
            "net12": "1a:9f:f7:46:df:b9",
            "net13": "7a:60:51:8a:38:c6",
            "net14": "3a:3a:f1:24:28:7c",
            "net15": "96:e7:46:ff:3a:35",
            "net16": "ae:35:7e:28:08:6d",
            "net17": "a6:1c:fd:26:be:fd",
            "net18": "da:48:d4:89:8c:b8",
            "net19": "de:2e:29:ea:87:fc",
            "net2": "92:8c:86:3b:85:31",
            "net20": "a2:b6:f2:c9:a7:dc",
            "net21": "66:d0:87:c0:58:fe",
            "net22": "a2:26:f5:55:88:db",
            "net23": "b6:98:b1:14:db:d9",
            "net24": "2e:a1:c3:38:29:30",
            "net25": "2a:e9:e4:3e:7d:4d",
            "net26": "4a:79:b8:b2:06:12",
            "net27": "72:8b:c2:6d:fa:b6",
            "net3": "b6:82:03:cc:a4:9b",
            "net4": "ba:6b:4c:7b:1d:b6",
            "net5": "fa:42:e0:59:cf:b3",
            "net6": "fe:48:54:cd:2f:ae",
            "net7": "52:45:81:85:78:ef",
            "net8": "22:46:a9:3a:75:5a",
            "net9": "f2:49:df:56:ec:1d"
        },
        "spine_1_1_13": {
            "net0": "5e:a7:fa:ac:24:95",
            "net1": "f2:21:8b:de:54:2d",
            "net10": "6a:d7:c1:fe:aa:17",
            "net11": "62:c7:63:b8:63:73",
            "net12": "62:12:29:59:09:d4",
            "net13": "26:be:60:4c:1f:b1",
            "net14": "22:73:ea:88:d2:88",
            "net15": "0a:6b:58:ec:f2:a5",
            "net16": "2a:09:17:12:b3:e3",
            "net17": "22:08:7c:00:13:73",
            "net18": "5e:ba:ce:bc:f2:10",
            "net19": "de:e0:05:4c:f8:cd",
            "net2": "02:69:f8:74:84:ea",
            "net20": "7a:77:e6:d6:88:00",
            "net21": "ce:d5:75:31:9f:34",
            "net22": "16:20:8b:af:8d:27",
            "net23": "26:6a:31:9b:94:4e",
            "net24": "e6:33:a5:e6:69:78",
            "net25": "ea:d4:52:c6:2f:8b",
            "net26": "e6:7f:26:6e:d9:60",
            "net27": "de:a1:49:83:55:82",
            "net3": "9a:6c:5b:da:34:83",
            "net4": "36:88:6e:15:4a:a0",
            "net5": "be:97:6f:ee:f8:79",
            "net6": "ca:6b:a3:47:18:9d",
            "net7": "86:33:02:a2:e0:41",
            "net8": "1e:a2:48:07:bf:fc",
            "net9": "42:b3:56:96:49:16"
        },
        "spine_1_1_14": {
            "net0": "72:06:b2:84:60:c3",
            "net1": "d2:88:9e:eb:e3:1d",
            "net10": "8a:78:e8:00:6e:d9",
            "net11": "ce:9e:38:2d:d4:78",
            "net12": "5e:39:de:c9:38:76",
            "net13": "06:c9:ab:4d:d9:2f",
            "net14": "12:3c:70:bd:22:7a",
            "net15": "56:a4:1b:e2:ae:bf",
            "net16": "16:bf:43:cd:14:4a",
            "net17": "8a:17:20:59:b7:3f",
            "net18": "92:fc:fa:2b:9d:29",
            "net19": "c2:31:95:8d:f2:58",
            "net2": "72:3d:76:10:a4:7e",
            "net20": "aa:b7:b2:74:82:a7",
            "net21": "a6:2c:b1:b4:de:d7",
            "net22": "9a:f1:f2:cb:aa:8d",
            "net23": "3e:02:55:bc:f8:8d",
            "net24": "e6:d9:a5:d2:eb:55",
            "net25": "a6:78:5e:86:26:d4",
            "net26": "72:7d:79:38:24:ee",
            "net27": "62:39:35:a6:d4:7c",
            "net3": "ee:34:bb:1f:4f:5f",
            "net4": "4e:ad:c5:1c:18:b2",
            "net5": "e2:83:b0:0b:35:8b",
            "net6": "0a:34:ec:8b:9b:b6",
            "net7": "62:83:2f:59:46:4c",
            "net8": "a2:d9:38:87:6c:e6",
            "net9": "fa:23:f3:7e:07:ef"
        },
        "spine_1_1_2": {
            "net0": "d6:c1:6a:b1:19:7e",
            "net1": "3a:43:ed:a1:0c:5c",
            "net10": "3e:ae:11:21:8e:c9",
            "net11": "42:e3:9b:b0:4a:19",
            "net12": "52:a5:83:fe:cc:94",
            "net13": "9a:1f:73:20:45:65",
            "net14": "12:c8:8c:20:77:cb",
            "net15": "16:ff:7d:ae:33:44",
            "net16": "96:40:29:00:1b:b5",
            "net17": "32:38:6a:b3:2f:aa",
            "net18": "c6:4c:71:fa:0a:7c",
            "net19": "3a:9c:17:8c:5d:d5",
            "net2": "fe:d6:4f:e4:e6:80",
            "net20": "12:e3:17:c0:2a:cb",
            "net21": "a6:49:14:67:16:8c",
            "net22": "2a:6f:bb:72:1c:04",
            "net23": "1a:1f:6b:a0:07:e6",
            "net24": "ea:42:39:6f:cd:32",
            "net25": "86:6c:b7:67:1a:fa",
            "net26": "02:1c:f9:d6:f6:c4",
            "net27": "ce:3b:30:a3:24:75",
            "net3": "fa:a5:f7:d5:f3:51",
            "net4": "9a:db:c9:c9:87:82",
            "net5": "8e:58:48:41:19:b9",
            "net6": "3e:86:aa:7f:1f:86",
            "net7": "aa:82:ed:4c:20:0f",
            "net8": "da:99:1a:86:a1:39",
            "net9": "2a:c4:e6:e6:1f:c8"
        },
        "spine_1_1_3": {
            "net0": "3a:0e:c0:21:8b:fa",
            "net1": "26:0f:5b:32:67:c5",
            "net10": "92:2e:3d:3c:12:e3",
            "net11": "b2:02:10:b8:8d:a6",
            "net12": "b2:ec:cb:dd:a3:81",
            "net13": "72:a2:4e:1c:8c:f8",
            "net14": "f6:63:0a:3e:ad:76",
            "net15": "c6:50:e3:2a:fc:69",
            "net16": "76:ad:52:a2:94:62",
            "net17": "ee:e4:47:47:fc:2a",
            "net18": "16:14:26:60:3a:56",
            "net19": "36:0d:8a:4a:eb:57",
            "net2": "1e:9e:81:a6:85:1e",
            "net20": "b6:24:c4:81:6e:45",
            "net21": "9e:2f:ac:09:c9:69",
            "net22": "fe:cf:fc:cb:c4:a6",
            "net23": "76:cb:5e:17:a4:58",
            "net24": "f6:95:38:1a:df:5d",
            "net25": "da:29:6f:d0:2c:62",
            "net26": "ba:86:6f:b5:fb:8c",
            "net27": "aa:7e:40:e4:ad:84",
            "net3": "8a:84:28:b4:56:05",
            "net4": "d6:be:da:30:9e:bf",
            "net5": "96:93:d1:e2:b3:d1",
            "net6": "6e:8e:de:45:80:db",
            "net7": "ce:83:f1:6d:4f:f8",
            "net8": "ca:e6:ff:8b:eb:d8",
            "net9": "e6:fa:57:ed:3e:6e"
        },
        "spine_1_1_4": {
            "net0": "ee:6e:4b:6e:f3:2e",
            "net1": "26:06:83:cc:3e:1b",
            "net10": "66:3d:79:b5:8d:f8",
            "net11": "b2:a6:ca:c3:d5:c6",
            "net12": "96:c7:f2:78:33:ca",
            "net13": "3e:1c:e7:80:7e:90",
            "net14": "66:70:67:31:da:6b",
            "net15": "9a:2f:85:62:7e:06",
            "net16": "5a:9a:b6:ae:76:13",
            "net17": "de:93:a4:a6:d3:d3",
            "net18": "ba:95:74:ad:51:a5",
            "net19": "ea:67:6a:4e:10:19",
            "net2": "02:18:8d:07:ea:fa",
            "net20": "a6:37:e7:0d:77:46",
            "net21": "4e:7e:b7:b4:2c:bf",
            "net22": "da:2f:d2:0c:92:71",
            "net23": "d2:99:00:5c:34:75",
            "net24": "7e:2d:cb:5c:81:3a",
            "net25": "12:ef:d3:7c:5c:5c",
            "net26": "0a:98:e0:50:df:0b",
            "net27": "22:41:2f:53:03:af",
            "net3": "b6:7b:06:fc:9c:41",
            "net4": "be:8f:62:22:0b:4e",
            "net5": "b6:e7:b6:df:ed:99",
            "net6": "6e:e7:49:bc:7c:6e",
            "net7": "3e:8f:6f:f6:80:34",
            "net8": "4e:a5:05:71:a5:22",
            "net9": "f6:fa:3c:70:24:e3"
        },
        "spine_1_1_5": {
            "net0": "a6:1d:93:79:91:08",
            "net1": "ee:49:88:7a:0f:62",
            "net10": "56:3b:69:8c:ab:73",
            "net11": "ce:13:4e:9f:cd:27",
            "net12": "82:a7:2f:69:98:af",
            "net13": "0e:1f:fd:28:53:53",
            "net14": "ee:02:69:b7:11:be",
            "net15": "1e:0a:cd:1d:08:72",
            "net16": "8a:03:45:98:e8:6a",
            "net17": "e2:89:f5:90:a3:b2",
            "net18": "66:fb:e6:5b:9a:e4",
            "net19": "aa:bd:bc:dd:c3:1d",
            "net2": "f2:82:bc:ef:44:43",
            "net20": "62:77:1b:67:8d:a9",
            "net21": "1a:ab:4b:e1:0c:4b",
            "net22": "ae:7d:d2:0f:23:fa",
            "net23": "ce:cd:c2:bf:98:59",
            "net24": "6a:b6:db:89:af:1b",
            "net25": "d6:d8:c3:8c:0a:be",
            "net26": "66:5a:dd:dc:da:4e",
            "net27": "12:52:54:dc:4c:a8",
            "net3": "9a:55:2c:a7:1c:34",
            "net4": "12:e8:17:2f:98:94",
            "net5": "7a:77:f6:1e:0d:35",
            "net6": "0e:ad:d4:3f:54:c9",
            "net7": "36:eb:59:69:05:f4",
            "net8": "ee:c5:58:48:ab:e4",
            "net9": "de:dd:f4:a1:0a:46"
        },
        "spine_1_1_6": {
            "net0": "7e:48:1f:44:05:6d",
            "net1": "ba:c9:fc:47:4d:c0",
            "net10": "96:e4:a9:eb:f7:c3",
            "net11": "26:88:1d:9e:a7:fa",
            "net12": "ce:41:20:99:02:2d",
            "net13": "b2:ba:9b:89:1b:f1",
            "net14": "ae:34:20:cb:c3:44",
            "net15": "aa:82:f0:bd:af:e2",
            "net16": "f2:24:e8:81:0d:8f",
            "net17": "b6:da:69:7f:06:27",
            "net18": "a6:51:b4:71:22:1c",
            "net19": "be:eb:d3:fd:ce:d5",
            "net2": "b6:0e:8a:bc:fa:ec",
            "net20": "26:66:c9:49:0f:65",
            "net21": "aa:de:9e:68:aa:95",
            "net22": "86:a3:bb:77:88:76",
            "net23": "d2:0c:af:0d:bc:b9",
            "net24": "2e:dc:6e:4d:91:01",
            "net25": "36:dc:0e:29:74:9e",
            "net26": "a2:ab:d9:92:0b:6a",
            "net27": "b2:70:c0:da:cf:ae",
            "net3": "ea:0f:e6:c8:ee:6f",
            "net4": "86:26:c0:61:72:2e",
            "net5": "3e:9e:87:6b:39:5e",
            "net6": "f2:b2:54:20:77:c8",
            "net7": "56:ea:6d:f3:c9:5a",
            "net8": "8e:56:12:42:c2:6a",
            "net9": "2a:34:d6:96:1c:e4"
        },
        "spine_1_1_7": {
            "net0": "da:92:2a:78:99:b0",
            "net1": "6a:e9:3f:e5:ab:23",
            "net10": "7e:c8:89:77:99:db",
            "net11": "ca:4a:d4:a8:7f:78",
            "net12": "ea:e8:d8:c2:53:65",
            "net13": "56:b6:01:52:48:b7",
            "net14": "b2:71:71:64:6c:e4",
            "net15": "c2:61:86:3d:54:b8",
            "net16": "6e:5b:6a:49:7f:89",
            "net17": "d6:5f:e2:5c:31:bf",
            "net18": "62:b0:31:d5:63:fb",
            "net19": "7a:85:0b:5f:ae:fa",
            "net2": "d2:8e:be:36:b5:4b",
            "net20": "2a:06:7e:89:5c:73",
            "net21": "ee:a1:d5:45:a8:9e",
            "net22": "3e:aa:0a:40:5a:5f",
            "net23": "52:c6:54:0d:89:c7",
            "net24": "8a:0a:85:7e:58:02",
            "net25": "1a:52:b1:57:c9:df",
            "net26": "9a:3a:e6:e4:54:b1",
            "net27": "3a:3d:48:ee:3e:5a",
            "net3": "ce:66:69:08:95:f4",
            "net4": "8e:e5:d0:38:e0:17",
            "net5": "5a:70:43:2b:1c:17",
            "net6": "36:6e:b2:c8:de:3d",
            "net7": "72:7e:3c:3f:a7:da",
            "net8": "16:c8:6a:34:92:ed",
            "net9": "b6:cc:f4:27:d3:b6"
        },
        "spine_1_1_8": {
            "net0": "1a:e2:16:9f:b6:56",
            "net1": "f6:aa:76:3c:b5:26",
            "net10": "ae:e4:85:b6:2f:75",
            "net11": "be:15:ce:57:14:54",
            "net12": "fe:bf:44:6e:d0:90",
            "net13": "62:15:70:c7:98:93",
            "net14": "6e:7e:54:8d:86:f4",
            "net15": "5e:bf:4d:71:98:68",
            "net16": "da:56:da:df:54:45",
            "net17": "1a:73:a5:4d:13:c2",
            "net18": "86:a9:3e:07:8d:a1",
            "net19": "ae:d0:c6:2c:f6:4f",
            "net2": "fa:0a:7b:e4:e0:5a",
            "net20": "96:2c:cd:21:b6:64",
            "net21": "fe:83:f3:a2:e2:97",
            "net22": "fa:e1:32:c8:d1:be",
            "net23": "56:2b:d1:a7:86:5d",
            "net24": "32:35:72:57:ba:d9",
            "net25": "32:aa:bb:25:d8:ff",
            "net26": "36:46:c3:80:51:cf",
            "net27": "8e:0f:18:2d:6e:71",
            "net3": "6a:9d:01:28:47:1e",
            "net4": "fe:fd:6b:e7:83:45",
            "net5": "6e:8c:95:79:56:81",
            "net6": "7e:09:40:c4:77:dd",
            "net7": "0a:0f:63:37:98:9b",
            "net8": "86:83:41:a0:80:b3",
            "net9": "6a:a9:8f:9c:a9:cd"
        },
        "spine_1_1_9": {
            "net0": "ee:5a:75:8e:6c:33",
            "net1": "fe:ce:de:07:3f:6e",
            "net10": "ce:4f:47:dd:ff:5d",
            "net11": "e2:f0:ec:2a:4c:59",
            "net12": "8e:94:b2:f2:5c:9e",
            "net13": "aa:47:ef:44:05:f4",
            "net14": "7e:fa:b6:af:60:60",
            "net15": "b2:56:76:ba:07:ef",
            "net16": "0a:32:8d:bb:7a:16",
            "net17": "1e:d4:ad:34:c1:f2",
            "net18": "ee:ee:60:5c:b7:30",
            "net19": "6e:35:56:28:64:ab",
            "net2": "46:89:90:2b:ef:96",
            "net20": "86:f0:8a:b6:da:5f",
            "net21": "0a:d8:9a:40:08:e1",
            "net22": "86:2f:af:5f:25:5a",
            "net23": "b6:97:b7:ad:26:23",
            "net24": "ae:02:c7:0e:63:c1",
            "net25": "0e:22:ac:80:65:a9",
            "net26": "aa:2f:cb:33:a8:ee",
            "net27": "4a:3c:16:45:2f:8b",
            "net3": "42:3b:9f:be:6a:d4",
            "net4": "c6:11:0f:2c:b5:12",
            "net5": "7a:24:7e:b9:19:9d",
            "net6": "fe:bf:7a:a7:f0:f5",
            "net7": "f6:17:7f:9f:6e:cd",
            "net8": "fa:70:40:f7:18:7b",
            "net9": "6a:77:5e:47:35:d6"
        },
        "spine_2_1_1": {
            "net0": "3a:31:68:0b:a5:ee",
            "net1": "ea:d9:28:8f:3e:0e",
            "net10": "1e:25:96:04:93:ff",
            "net11": "9e:53:f5:8d:1b:c6",
            "net12": "46:3e:b8:43:9d:8c",
            "net13": "66:12:21:05:d9:bb",
            "net14": "de:2c:d6:c5:0e:be",
            "net15": "ce:1b:e7:cd:da:94",
            "net16": "7e:f9:5b:1c:85:6a",
            "net17": "06:55:2d:af:f0:65",
            "net18": "ba:45:cb:93:2f:2c",
            "net19": "f2:49:bd:5f:3e:e3",
            "net2": "6e:7f:e7:7a:85:86",
            "net20": "76:c6:ad:83:f6:47",
            "net21": "3a:d9:25:0d:9a:7a",
            "net22": "62:ce:9a:7b:75:18",
            "net23": "22:1d:ab:16:72:23",
            "net24": "ca:aa:f4:59:c6:68",
            "net25": "2a:55:0c:74:db:48",
            "net26": "0e:4b:1e:6a:37:83",
            "net27": "c2:04:4f:5d:41:d8",
            "net3": "02:6f:ac:f5:b9:77",
            "net4": "66:88:9d:b1:d9:dc",
            "net5": "de:b0:43:d5:df:d7",
            "net6": "16:91:fb:4a:00:17",
            "net7": "36:af:02:e3:23:03",
            "net8": "12:d0:35:79:6e:b8",
            "net9": "ba:5a:2a:53:eb:d8"
        },
        "spine_2_1_10": {
            "net0": "1e:1f:08:04:58:4c",
            "net1": "3e:5f:6d:12:43:a4",
            "net10": "3a:be:12:19:b1:6f",
            "net11": "be:35:e5:52:e4:6b",
            "net12": "a6:d1:c1:ef:5b:90",
            "net13": "3a:59:80:94:5e:78",
            "net14": "3e:a4:90:0f:d1:cf",
            "net15": "ba:d0:fc:36:8e:a5",
            "net16": "5e:bb:c8:23:a3:a4",
            "net17": "aa:a9:41:37:e6:a9",
            "net18": "de:dd:f9:1a:c0:a9",
            "net19": "42:57:0a:70:28:33",
            "net2": "7a:f5:ab:85:fb:90",
            "net20": "ce:33:16:7d:43:41",
            "net21": "26:8b:52:26:6b:3d",
            "net22": "f6:3a:a8:e5:23:7a",
            "net23": "36:d1:48:05:a8:1c",
            "net24": "e2:07:37:b2:d3:3c",
            "net25": "6a:09:2d:29:a9:26",
            "net26": "3a:de:80:16:6e:ef",
            "net27": "da:7c:3a:64:c0:cf",
            "net3": "7e:4a:7f:bf:8d:79",
            "net4": "de:9a:f1:44:65:a7",
            "net5": "52:12:41:a9:63:90",
            "net6": "02:a3:4a:90:50:ba",
            "net7": "86:d5:92:17:b4:a4",
            "net8": "6e:11:b2:2b:5c:74",
            "net9": "62:56:77:40:a5:6c"
        },
        "spine_2_1_11": {
            "net0": "f6:d3:eb:de:d1:2f",
            "net1": "46:c3:bd:07:b8:12",
            "net10": "a6:d3:6a:b5:e7:0f",
            "net11": "aa:dc:b7:be:05:db",
            "net12": "6a:17:81:08:82:3d",
            "net13": "ae:b5:3d:5f:7d:60",
            "net14": "36:e0:7b:dc:39:23",
            "net15": "52:e5:e9:93:e7:ec",
            "net16": "3e:2b:dc:b5:59:02",
            "net17": "fe:cd:81:55:ff:7d",
            "net18": "3e:cc:18:aa:71:d0",
            "net19": "82:56:c4:08:51:3b",
            "net2": "fe:ad:3f:ae:ba:d6",
            "net20": "fa:be:f0:74:60:0b",
            "net21": "a6:83:ef:b6:45:37",
            "net22": "96:cb:18:51:3d:95",
            "net23": "d2:b3:6c:f9:d2:a5",
            "net24": "ba:7f:76:d4:b7:00",
            "net25": "62:25:d8:80:a9:6b",
            "net26": "62:ec:e5:22:a9:cb",
            "net27": "c2:7f:09:fd:c8:d8",
            "net3": "6a:6e:be:18:80:7f",
            "net4": "2a:c0:5e:49:c1:ff",
            "net5": "7a:55:1f:a0:50:93",
            "net6": "06:57:08:bd:92:b2",
            "net7": "02:1e:b2:34:de:0b",
            "net8": "92:0c:21:59:a9:9a",
            "net9": "62:ec:9a:72:59:16"
        },
        "spine_2_1_12": {
            "net0": "42:4d:89:17:fe:2a",
            "net1": "6e:9a:02:1d:ab:8f",
            "net10": "76:4f:38:c4:7c:1b",
            "net11": "f6:90:7a:75:aa:0e",
            "net12": "f6:1c:56:41:9c:e9",
            "net13": "8e:47:b1:5d:a2:82",
            "net14": "ee:aa:f9:ab:71:15",
            "net15": "02:9d:32:da:e6:ea",
            "net16": "7e:45:12:ca:96:56",
            "net17": "42:41:c3:12:7a:4e",
            "net18": "be:d6:da:25:92:f8",
            "net19": "a6:b5:35:d8:cf:54",
            "net2": "ea:e6:7b:46:60:86",
            "net20": "e6:d0:8e:12:3c:49",
            "net21": "96:a9:9a:9d:ec:65",
            "net22": "be:b7:68:a2:b9:37",
            "net23": "6a:10:22:0c:ef:54",
            "net24": "72:67:06:c3:94:80",
            "net25": "02:7f:d0:4f:e6:51",
            "net26": "b2:2d:d6:e6:9b:7b",
            "net27": "7a:ea:20:ca:47:dd",
            "net3": "be:6c:e0:8d:d2:34",
            "net4": "fe:2f:66:95:19:e2",
            "net5": "1e:28:d1:81:ad:ef",
            "net6": "2e:e0:10:d9:cc:d6",
            "net7": "0e:b5:36:cc:ee:4c",
            "net8": "e2:a9:ff:08:db:74",
            "net9": "7e:aa:e5:83:44:31"
        },
        "spine_2_1_13": {
            "net0": "9a:7f:de:01:2a:6e",
            "net1": "5a:e7:15:13:f0:ec",
            "net10": "52:33:8c:0f:a4:2d",
            "net11": "c2:47:3a:8d:08:b4",
            "net12": "aa:f8:d9:fa:a5:3f",
            "net13": "96:b2:fa:39:68:da",
            "net14": "36:21:bf:92:c2:41",
            "net15": "4a:ea:7f:26:28:d6",
            "net16": "8e:06:23:ab:89:6f",
            "net17": "0a:b6:f0:bd:e6:c9",
            "net18": "3a:55:e0:b1:63:a3",
            "net19": "06:ad:33:20:0b:0c",
            "net2": "3a:fe:8f:17:df:24",
            "net20": "96:e1:41:05:15:5d",
            "net21": "ea:5e:cf:ee:26:cc",
            "net22": "d2:9b:a9:db:ec:bd",
            "net23": "fa:86:04:b7:a4:07",
            "net24": "fa:0b:e1:99:7f:08",
            "net25": "ce:ba:30:8d:ad:ff",
            "net26": "e2:cb:74:62:05:ac",
            "net27": "06:27:4e:a6:43:23",
            "net3": "f6:99:2b:1b:73:1a",
            "net4": "f2:1b:c4:8f:7b:c5",
            "net5": "2a:a4:fd:b6:76:be",
            "net6": "66:8e:ce:69:49:59",
            "net7": "5e:bc:22:b9:38:b7",
            "net8": "96:b8:87:65:4a:22",
            "net9": "16:c2:b5:53:6b:8e"
        },
        "spine_2_1_14": {
            "net0": "de:18:dd:2d:e2:f8",
            "net1": "0e:77:ec:42:8b:bd",
            "net10": "ae:cb:ce:fe:0a:f2",
            "net11": "2a:56:b3:c2:f8:c6",
            "net12": "2e:d3:9b:7e:18:96",
            "net13": "66:66:50:cd:9f:83",
            "net14": "92:4a:15:5a:18:57",
            "net15": "7a:03:59:e7:42:85",
            "net16": "7a:eb:7a:63:e2:9a",
            "net17": "4e:22:7e:08:a1:43",
            "net18": "a2:91:89:17:19:ef",
            "net19": "66:c6:36:88:26:73",
            "net2": "6e:da:a9:8f:41:9f",
            "net20": "2e:87:b3:6b:38:56",
            "net21": "a2:06:1d:e3:76:ab",
            "net22": "b2:e4:44:f0:52:1b",
            "net23": "46:1f:06:32:a0:f0",
            "net24": "ee:4e:3a:32:0e:fd",
            "net25": "4a:26:7c:86:65:c6",
            "net26": "92:3c:54:d0:01:80",
            "net27": "72:2c:7c:2a:12:d3",
            "net3": "22:a3:da:bd:03:17",
            "net4": "8a:06:5c:c7:08:a3",
            "net5": "3a:a8:bd:c0:2d:81",
            "net6": "0a:40:49:98:1a:af",
            "net7": "f2:fb:c1:90:79:ca",
            "net8": "36:8e:d2:0c:8a:06",
            "net9": "36:aa:57:d5:d4:a8"
        },
        "spine_2_1_2": {
            "net0": "c6:42:18:0a:4f:ff",
            "net1": "4e:1c:6d:cb:a4:a6",
            "net10": "fe:a4:05:81:91:ef",
            "net11": "16:29:d7:b3:f8:c4",
            "net12": "ae:ba:81:5a:c6:86",
            "net13": "3a:85:47:41:8b:60",
            "net14": "d6:b2:31:1f:9d:ca",
            "net15": "ba:38:2f:61:79:21",
            "net16": "a6:ec:68:59:2f:de",
            "net17": "aa:12:bb:3c:fd:6e",
            "net18": "1e:e9:82:3f:bc:d2",
            "net19": "fe:3a:df:99:05:7c",
            "net2": "fe:74:78:18:7f:37",
            "net20": "2e:1c:15:02:60:3f",
            "net21": "82:0b:55:b0:56:74",
            "net22": "12:50:48:25:dc:56",
            "net23": "ea:36:88:be:74:40",
            "net24": "2a:1c:a8:3e:f1:05",
            "net25": "7a:c7:f3:17:2b:79",
            "net26": "36:9e:69:60:2d:bb",
            "net27": "02:8a:ef:99:39:db",
            "net3": "de:15:8a:44:81:d7",
            "net4": "42:5f:e7:fc:b0:bd",
            "net5": "aa:7f:83:35:95:6a",
            "net6": "2a:38:ae:59:e9:ed",
            "net7": "16:d8:21:98:dc:7f",
            "net8": "ca:43:28:eb:19:fc",
            "net9": "6e:e9:3d:b0:90:30"
        },
        "spine_2_1_3": {
            "net0": "9e:45:4c:a1:78:c5",
            "net1": "2e:2a:7c:76:e8:4a",
            "net10": "86:ad:7a:13:c3:33",
            "net11": "0e:70:7f:00:c3:44",
            "net12": "de:34:9c:3c:41:b0",
            "net13": "be:44:7a:0e:14:20",
            "net14": "d6:97:fc:8b:06:62",
            "net15": "02:58:a1:44:84:3e",
            "net16": "ca:9a:7b:03:68:08",
            "net17": "9a:46:1f:a2:23:91",
            "net18": "f2:a8:1b:4c:22:a8",
            "net19": "b2:52:c8:9e:9c:f8",
            "net2": "0a:74:92:36:9e:bb",
            "net20": "e6:0a:9e:cd:50:c6",
            "net21": "46:ed:d1:be:76:05",
            "net22": "3e:5d:4a:42:a8:fa",
            "net23": "f2:c0:b9:43:98:a4",
            "net24": "d6:ce:4f:d9:7c:14",
            "net25": "da:49:e9:a9:b4:fe",
            "net26": "7a:d0:bf:f0:54:81",
            "net27": "ae:57:39:47:99:6b",
            "net3": "f6:9e:df:87:f3:1a",
            "net4": "26:7d:1b:cf:8f:e4",
            "net5": "fe:7f:86:c0:88:8d",
            "net6": "aa:91:1a:67:54:39",
            "net7": "76:c2:9d:f0:89:92",
            "net8": "66:6a:91:7e:4b:e2",
            "net9": "f2:c7:7a:3f:e8:4a"
        },
        "spine_2_1_4": {
            "net0": "2a:5a:f4:a7:9a:73",
            "net1": "72:e0:e3:8b:7c:81",
            "net10": "56:46:c5:70:6a:9a",
            "net11": "96:e2:4c:3f:d2:56",
            "net12": "e6:08:d0:07:39:b6",
            "net13": "fa:53:5c:f6:cb:1d",
            "net14": "42:2c:36:c5:d3:cf",
            "net15": "b6:42:30:f3:13:85",
            "net16": "2a:9d:9d:cb:89:52",
            "net17": "8e:17:de:68:29:8f",
            "net18": "fa:46:bc:f2:31:f1",
            "net19": "12:d4:9f:b2:4a:44",
            "net2": "fe:fe:e5:a9:0f:41",
            "net20": "12:56:c1:8b:c8:69",
            "net21": "8e:ac:21:81:6c:18",
            "net22": "9a:4c:11:3a:60:1b",
            "net23": "16:33:64:d3:f3:a7",
            "net24": "7e:77:f6:bd:6f:34",
            "net25": "6e:4a:13:98:e2:f1",
            "net26": "e2:43:bc:d2:84:f3",
            "net27": "96:4b:c3:ca:d7:09",
            "net3": "86:02:cb:b3:98:88",
            "net4": "6a:03:8c:ad:96:9e",
            "net5": "6a:91:9c:f5:97:b8",
            "net6": "16:77:e0:f9:40:2e",
            "net7": "12:1f:08:60:9f:e1",
            "net8": "b2:bd:34:d0:3d:0d",
            "net9": "0a:be:91:9c:e8:b3"
        },
        "spine_2_1_5": {
            "net0": "06:7a:4b:53:82:59",
            "net1": "22:9d:ca:4c:75:87",
            "net10": "0e:4f:bf:a3:15:bb",
            "net11": "a6:a6:eb:f4:e3:e9",
            "net12": "f6:c4:c4:a2:60:8a",
            "net13": "de:4c:5d:ec:f1:29",
            "net14": "7a:8e:13:af:3d:0a",
            "net15": "a2:d5:ea:84:b4:b4",
            "net16": "06:d0:cc:24:94:08",
            "net17": "12:22:fc:82:f5:73",
            "net18": "12:54:9f:fd:4f:ed",
            "net19": "ea:65:90:4d:ce:2c",
            "net2": "f6:69:13:fe:c0:34",
            "net20": "a2:06:90:6e:8b:46",
            "net21": "9a:d7:ee:6d:ae:8b",
            "net22": "e2:55:4d:ee:5c:d7",
            "net23": "56:3c:e1:21:db:b2",
            "net24": "9e:e8:62:66:98:a7",
            "net25": "4a:5b:18:ba:f9:bc",
            "net26": "1a:22:1d:fe:9b:29",
            "net27": "a2:bb:08:d5:cb:bb",
            "net3": "ba:53:c5:ae:db:53",
            "net4": "2e:1a:1b:72:f1:a1",
            "net5": "be:19:de:40:79:94",
            "net6": "02:70:4a:e5:67:22",
            "net7": "96:c6:57:b1:22:ce",
            "net8": "5e:d2:8d:de:83:1b",
            "net9": "3a:c6:41:8d:f5:0d"
        },
        "spine_2_1_6": {
            "net0": "26:b3:f7:5e:0b:86",
            "net1": "6a:0f:40:2e:c4:f8",
            "net10": "46:76:5a:1d:5c:04",
            "net11": "fa:83:1a:66:73:6b",
            "net12": "8a:cf:43:f2:67:5a",
            "net13": "36:b9:f2:51:96:f0",
            "net14": "ce:06:d1:37:6a:81",
            "net15": "4e:3b:00:85:0d:89",
            "net16": "d6:4e:41:8e:b1:eb",
            "net17": "c6:98:f2:37:fa:d9",
            "net18": "46:9f:06:f3:e9:33",
            "net19": "8a:79:07:ce:5a:6d",
            "net2": "1e:99:13:5f:5f:78",
            "net20": "0a:8f:46:f9:2d:1a",
            "net21": "72:0e:f4:fb:ae:77",
            "net22": "6e:f6:ce:8c:92:16",
            "net23": "a2:7b:4d:0e:80:90",
            "net24": "66:1b:f2:40:b5:f8",
            "net25": "12:81:83:93:0c:c3",
            "net26": "46:46:d2:75:1d:40",
            "net27": "76:8a:ef:ac:91:4c",
            "net3": "9e:9e:b2:25:ff:72",
            "net4": "86:fb:90:4f:14:bb",
            "net5": "7a:e8:54:0c:63:95",
            "net6": "be:c8:06:12:ce:a5",
            "net7": "ea:d3:2f:ae:e3:1e",
            "net8": "e6:4c:b0:a9:fd:74",
            "net9": "2e:2e:d2:b1:49:e8"
        },
        "spine_2_1_7": {
            "net0": "6e:a7:8d:65:98:18",
            "net1": "b2:f8:27:e0:3b:9c",
            "net10": "56:81:e8:b9:94:c4",
            "net11": "8a:0b:84:28:e5:fa",
            "net12": "5e:23:cd:df:ef:45",
            "net13": "a6:92:c1:b3:7b:85",
            "net14": "92:18:96:48:79:50",
            "net15": "2e:56:1e:b0:d9:8f",
            "net16": "42:21:b9:3e:04:a5",
            "net17": "ae:d4:34:52:e3:e5",
            "net18": "a2:01:dc:f3:37:e1",
            "net19": "36:20:6b:5c:b5:30",
            "net2": "62:eb:4a:89:99:9a",
            "net20": "62:c0:f8:df:d0:0a",
            "net21": "16:13:6d:c3:ea:6c",
            "net22": "92:54:b9:77:14:3f",
            "net23": "6e:39:8f:96:d6:f9",
            "net24": "0a:db:fd:19:a7:33",
            "net25": "be:e3:8b:28:df:d0",
            "net26": "8e:41:91:c7:a2:3c",
            "net27": "b2:a9:5f:69:13:41",
            "net3": "d2:73:ce:62:a9:8f",
            "net4": "52:05:8f:ed:72:88",
            "net5": "c2:20:ef:af:06:4c",
            "net6": "b6:e5:62:18:61:47",
            "net7": "86:23:ca:fa:0c:87",
            "net8": "e2:f9:0d:0f:4a:9a",
            "net9": "86:d0:67:7a:5a:b7"
        },
        "spine_2_1_8": {
            "net0": "16:79:1d:69:30:f1",
            "net1": "26:3f:1e:27:f8:a9",
            "net10": "36:7d:b3:86:4d:ae",
            "net11": "86:0c:9b:5a:72:10",
            "net12": "82:75:e0:3c:72:f6",
            "net13": "5e:41:ff:63:3a:f7",
            "net14": "ea:da:fc:bf:23:cc",
            "net15": "26:cc:aa:13:52:b5",
            "net16": "8a:48:ae:69:fe:60",
            "net17": "1e:b5:a6:98:69:78",
            "net18": "02:c9:69:46:c4:d7",
            "net19": "22:c6:38:db:37:68",
            "net2": "82:86:cf:64:01:74",
            "net20": "ee:9f:bb:cc:8c:09",
            "net21": "a6:b2:fa:30:85:66",
            "net22": "0e:e5:85:ef:7f:df",
            "net23": "ea:09:f9:c3:55:62",
            "net24": "1e:16:8c:2f:ad:7d",
            "net25": "0e:70:b9:99:07:3b",
            "net26": "ca:9c:90:3f:1e:8e",
            "net27": "a6:c4:1f:58:59:6e",
            "net3": "52:71:fc:3c:ef:c2",
            "net4": "a6:41:a5:9e:4e:b0",
            "net5": "7a:f7:e5:e4:15:19",
            "net6": "06:b7:78:92:ba:ac",
            "net7": "c6:5d:fb:c8:16:12",
            "net8": "e6:09:cc:e5:fe:68",
            "net9": "0a:f5:3f:49:6e:ab"
        },
        "spine_2_1_9": {
            "net0": "2e:3c:00:b5:2d:aa",
            "net1": "ee:bd:d7:da:e5:21",
            "net10": "3e:69:af:47:00:f8",
            "net11": "3a:98:6d:ff:f9:44",
            "net12": "72:70:f3:d0:e3:bb",
            "net13": "a6:a5:f2:34:f3:ab",
            "net14": "ba:0b:ff:f1:fc:53",
            "net15": "32:55:12:f1:b5:86",
            "net16": "fe:63:b7:a2:61:80",
            "net17": "b2:b9:30:64:d3:9b",
            "net18": "8a:67:4e:22:7c:ed",
            "net19": "36:7f:ef:8c:af:cb",
            "net2": "96:07:fd:02:de:44",
            "net20": "42:9d:f7:b7:13:73",
            "net21": "d2:5d:3c:41:20:ea",
            "net22": "22:f8:47:04:f1:04",
            "net23": "1e:5e:51:4a:52:49",
            "net24": "46:d8:3f:9d:cb:1f",
            "net25": "4e:3e:70:da:24:5e",
            "net26": "fa:a5:3f:c3:11:81",
            "net27": "36:55:d0:24:c6:c2",
            "net3": "46:9d:25:f2:b6:c4",
            "net4": "16:7e:fe:1e:13:99",
            "net5": "de:79:0d:38:19:fa",
            "net6": "8e:ed:fc:94:2e:cb",
            "net7": "12:f8:84:28:d9:1e",
            "net8": "6a:c4:3c:0f:03:a8",
            "net9": "6e:1a:e8:8d:20:9b"
        },
        "tof_1_2_1": {
            "net0": "6a:bb:6b:f6:2d:bf",
            "net1": "c6:a5:5f:7e:a4:b4",
            "net10": "7a:fe:ef:14:3b:0a",
            "net11": "ee:af:b0:1a:5f:73",
            "net12": "d2:bc:87:6e:6f:46",
            "net13": "82:ab:be:c7:9a:05",
            "net14": "46:da:9f:da:79:d3",
            "net15": "42:0a:a9:68:4f:fc",
            "net16": "16:13:46:bb:31:58",
            "net17": "2a:2f:16:03:70:39",
            "net18": "e6:ee:7f:a4:74:8b",
            "net19": "b6:c5:3b:02:9d:ab",
            "net2": "0a:83:99:a1:a6:4a",
            "net20": "ce:2a:0e:f8:e0:a9",
            "net21": "02:b7:a9:16:43:51",
            "net22": "2a:ec:49:8b:28:de",
            "net23": "46:c2:a6:ea:00:67",
            "net24": "6e:fd:6e:ea:ff:73",
            "net25": "f2:fa:7e:4f:c8:af",
            "net26": "1e:78:b3:ca:a4:6e",
            "net27": "72:23:66:10:04:89",
            "net3": "06:0a:ba:02:4b:2b",
            "net4": "42:42:26:b6:fe:73",
            "net5": "f6:8e:cd:50:ca:cf",
            "net6": "b2:45:dc:54:d3:cb",
            "net7": "86:e6:03:aa:34:8a",
            "net8": "fe:d6:8d:df:af:6a",
            "net9": "62:58:67:fb:02:1c"
        },
        "tof_1_2_10": {
            "net0": "2a:93:51:40:be:9d",
            "net1": "ee:55:2e:cb:f9:31",
            "net10": "16:e5:fa:07:53:e8",
            "net11": "12:b9:92:f5:ad:87",
            "net12": "de:51:64:f4:0c:7e",
            "net13": "76:78:63:1a:03:39",
            "net14": "72:e1:c2:03:0b:b9",
            "net15": "92:fd:94:ae:03:fc",
            "net16": "d2:da:da:a3:31:f2",
            "net17": "76:4c:ae:d6:8e:37",
            "net18": "4e:f2:63:46:43:49",
            "net19": "f6:0c:46:cf:dc:bf",
            "net2": "02:3f:48:bd:b1:b4",
            "net20": "ee:91:71:d4:a4:68",
            "net21": "d2:79:c7:63:23:0e",
            "net22": "c6:b1:aa:36:24:b5",
            "net23": "06:01:a5:fe:2c:01",
            "net24": "9a:bb:15:7d:63:46",
            "net25": "6e:77:7c:40:2a:cd",
            "net26": "f6:6e:ac:fd:da:86",
            "net27": "c6:c0:f2:d3:39:3e",
            "net3": "92:c3:80:8b:06:f5",
            "net4": "c6:af:fb:5d:ff:37",
            "net5": "22:f7:28:d8:63:32",
            "net6": "4e:b8:0f:84:7c:a2",
            "net7": "3e:96:78:73:80:1a",
            "net8": "f2:f2:42:00:f3:b1",
            "net9": "32:e0:eb:58:4e:17"
        },
        "tof_1_2_11": {
            "net0": "4a:dd:8e:70:fd:67",
            "net1": "12:1f:22:52:cf:55",
            "net10": "f2:60:b7:6e:f6:5f",
            "net11": "6e:5c:06:f4:b0:b2",
            "net12": "ba:ae:ba:98:1b:d5",
            "net13": "9e:94:72:2f:37:ae",
            "net14": "12:ea:1e:48:b2:a6",
            "net15": "b2:e7:34:ab:f4:d9",
            "net16": "c6:7d:7e:2f:19:59",
            "net17": "82:96:c7:42:4f:5f",
            "net18": "76:0c:da:9a:01:1e",
            "net19": "ea:ab:a5:c7:fe:f9",
            "net2": "be:d3:1f:11:6b:10",
            "net20": "f6:01:d4:7f:1d:26",
            "net21": "e2:b4:ac:4a:aa:d1",
            "net22": "9a:8a:28:bf:1e:77",
            "net23": "ae:60:12:db:3a:60",
            "net24": "c6:c5:3c:ee:f5:42",
            "net25": "92:47:3a:e4:eb:fe",
            "net26": "aa:51:ea:03:21:9e",
            "net27": "b2:b0:b5:dd:18:7f",
            "net3": "46:33:b7:ee:43:63",
            "net4": "8e:e4:b6:06:c7:14",
            "net5": "12:b0:8f:e1:67:2f",
            "net6": "96:9a:9e:cb:84:9b",
            "net7": "be:3d:8b:26:b0:4e",
            "net8": "5a:f5:88:4d:dc:dd",
            "net9": "ba:a4:fe:7d:bd:d2"
        },
        "tof_1_2_12": {
            "net0": "3e:13:39:86:46:21",
            "net1": "22:5f:fa:c8:9a:8f",
            "net10": "fe:a5:5e:3d:94:c0",
            "net11": "46:b2:9f:1d:5f:eb",
            "net12": "52:42:bc:fd:46:8f",
            "net13": "72:3e:53:e8:8b:8d",
            "net14": "42:df:de:22:89:1f",
            "net15": "3a:e5:19:8f:65:d8",
            "net16": "8a:2d:be:fb:21:9d",
            "net17": "8e:da:1e:ed:67:80",
            "net18": "f2:d3:7a:d9:bc:cf",
            "net19": "d6:04:3b:47:37:cd",
            "net2": "92:d4:24:44:0f:6a",
            "net20": "5a:7c:34:6e:34:e8",
            "net21": "92:8b:08:35:0e:6e",
            "net22": "16:3b:ae:0e:22:71",
            "net23": "0a:89:9b:7b:4b:45",
            "net24": "2e:b4:57:7a:bd:6b",
            "net25": "96:02:91:7c:a0:10",
            "net26": "7a:b1:37:90:c1:b8",
            "net27": "36:ca:d1:2e:93:43",
            "net3": "a2:61:54:77:16:58",
            "net4": "46:76:70:fb:bf:3e",
            "net5": "aa:ec:ff:c3:47:8e",
            "net6": "2a:f0:13:b8:49:43",
            "net7": "96:bd:d6:f7:bd:5e",
            "net8": "b6:a4:a1:78:cc:d1",
            "net9": "ee:e1:ac:c5:33:16"
        },
        "tof_1_2_13": {
            "net0": "3e:7c:d1:1c:1b:ec",
            "net1": "9e:b9:e2:05:3c:2e",
            "net10": "f2:74:d3:87:cd:35",
            "net11": "22:33:28:49:4c:73",
            "net12": "8e:4c:03:e9:56:35",
            "net13": "4e:bf:d3:e7:3e:5d",
            "net14": "de:c8:58:8b:23:0d",
            "net15": "12:64:60:6e:bd:87",
            "net16": "26:68:11:b3:75:be",
            "net17": "0a:be:88:68:38:45",
            "net18": "8e:11:3e:1a:6a:5b",
            "net19": "62:aa:1f:1d:4d:79",
            "net2": "86:f0:ef:22:9a:01",
            "net20": "62:a7:83:19:60:9c",
            "net21": "32:a8:5f:54:99:87",
            "net22": "c6:50:8c:3a:1a:96",
            "net23": "3e:34:a1:2b:07:69",
            "net24": "7e:91:4b:0e:39:46",
            "net25": "06:10:2b:70:49:62",
            "net26": "0e:5a:6c:61:2f:fa",
            "net27": "72:e4:96:44:06:71",
            "net3": "22:04:00:d1:cd:20",
            "net4": "fa:63:2c:56:a8:c0",
            "net5": "ce:c0:7d:62:c0:e2",
            "net6": "3a:86:11:62:68:f9",
            "net7": "66:fa:b9:9c:92:57",
            "net8": "ba:1a:c3:3a:2f:fa",
            "net9": "62:86:2c:30:43:4f"
        },
        "tof_1_2_14": {
            "net0": "5e:5f:cf:5b:a8:b2",
            "net1": "5e:ac:4e:81:61:3a",
            "net10": "02:72:60:1d:c0:b9",
            "net11": "32:9e:03:41:1c:90",
            "net12": "d6:f1:20:e5:8e:0d",
            "net13": "f6:2d:f7:9a:d8:e1",
            "net14": "5e:94:da:20:c7:da",
            "net15": "ea:e4:45:54:49:c4",
            "net16": "4e:82:af:c3:62:82",
            "net17": "76:8a:aa:53:4c:23",
            "net18": "3a:4b:70:cb:e7:51",
            "net19": "a2:48:d0:b8:e4:a9",
            "net2": "ee:44:06:c0:c3:08",
            "net20": "de:4e:e2:8a:8b:e5",
            "net21": "02:d6:11:78:f0:5e",
            "net22": "2a:10:d8:65:15:42",
            "net23": "f6:98:19:e3:5f:4b",
            "net24": "d6:89:27:73:96:dd",
            "net25": "ca:eb:a9:09:48:0d",
            "net26": "32:19:b1:78:f6:40",
            "net27": "8e:79:f8:36:b2:ed",
            "net3": "9e:53:63:85:71:91",
            "net4": "82:16:20:01:6d:73",
            "net5": "ba:3f:c2:31:c1:a6",
            "net6": "6a:5a:6e:e4:7e:f9",
            "net7": "52:03:5a:3b:0c:63",
            "net8": "fa:24:80:6e:ae:a6",
            "net9": "1a:69:25:18:1a:5e"
        },
        "tof_1_2_2": {
            "net0": "a6:16:83:5b:b6:9f",
            "net1": "8e:11:20:09:40:e2",
            "net10": "c2:2b:ff:f5:36:18",
            "net11": "ea:2c:70:7c:6d:d5",
            "net12": "1e:43:61:f6:17:d2",
            "net13": "9e:6c:5d:92:78:cd",
            "net14": "4e:af:42:ce:59:16",
            "net15": "92:57:f9:24:39:87",
            "net16": "b2:f9:ae:8d:c1:df",
            "net17": "0a:1a:1d:6b:e5:d3",
            "net18": "be:5f:80:1b:bc:0a",
            "net19": "da:f0:9a:2b:79:ed",
            "net2": "b6:07:c9:39:82:1c",
            "net20": "c6:bc:f4:f4:12:80",
            "net21": "3e:d5:91:f6:3e:9a",
            "net22": "aa:f8:8d:c6:b2:0d",
            "net23": "9a:be:5b:30:41:6d",
            "net24": "0e:59:23:30:27:d9",
            "net25": "0a:dd:22:db:25:8f",
            "net26": "1e:35:01:ed:8e:d6",
            "net27": "2e:2b:7f:9b:4d:57",
            "net3": "6a:10:aa:76:e4:5c",
            "net4": "6a:80:58:5f:49:b0",
            "net5": "3e:0a:60:92:37:43",
            "net6": "0e:e3:f3:87:06:bf",
            "net7": "be:b3:b1:a9:6d:8a",
            "net8": "4a:21:aa:ac:7d:97",
            "net9": "de:39:3d:d4:cd:6c"
        },
        "tof_1_2_3": {
            "net0": "26:32:c7:83:56:87",
            "net1": "de:9a:19:4a:c3:1d",
            "net10": "8e:17:83:4b:98:9e",
            "net11": "3e:fc:20:e0:08:75",
            "net12": "b6:dc:4c:3e:85:76",
            "net13": "b6:47:d7:77:a7:9e",
            "net14": "e2:ee:f0:8d:75:e2",
            "net15": "7e:21:f9:60:7e:b9",
            "net16": "76:6c:e7:f2:de:c2",
            "net17": "96:9f:f7:c3:96:0d",
            "net18": "6e:62:13:f8:5d:19",
            "net19": "72:be:4e:b8:60:70",
            "net2": "7e:09:1b:ba:53:4f",
            "net20": "5e:fe:4c:14:11:91",
            "net21": "6e:ec:af:74:8e:ad",
            "net22": "76:b4:5c:59:d8:1a",
            "net23": "62:01:df:d9:ed:2c",
            "net24": "0a:23:c7:93:78:26",
            "net25": "32:a1:3e:74:f3:42",
            "net26": "42:14:97:4c:21:43",
            "net27": "16:71:40:c2:80:4d",
            "net3": "c6:ee:6b:49:c3:e9",
            "net4": "12:73:b0:54:7d:a4",
            "net5": "7a:b2:b8:d9:1a:4e",
            "net6": "b6:6a:53:f8:55:d6",
            "net7": "3a:2d:45:0a:eb:49",
            "net8": "ca:e2:42:f7:81:e8",
            "net9": "16:81:44:67:a5:09"
        },
        "tof_1_2_4": {
            "net0": "36:bf:1e:e5:b2:3a",
            "net1": "ca:ad:d0:1e:57:60",
            "net10": "56:34:75:7f:61:46",
            "net11": "72:23:6b:21:84:43",
            "net12": "52:6a:fe:4f:36:bb",
            "net13": "06:57:ba:ee:90:50",
            "net14": "b2:38:74:3b:56:7c",
            "net15": "2a:8e:96:01:cf:dd",
            "net16": "be:11:91:a2:2e:8e",
            "net17": "d2:32:b1:39:6a:c3",
            "net18": "92:af:df:ef:f9:a7",
            "net19": "92:de:85:ba:0b:7d",
            "net2": "82:7a:32:b8:2b:45",
            "net20": "6e:d0:3d:e7:9f:6e",
            "net21": "f2:b3:95:45:74:c8",
            "net22": "8e:ba:10:5c:3a:d3",
            "net23": "a2:ee:1c:62:32:d8",
            "net24": "6a:e1:1b:88:25:81",
            "net25": "5a:01:87:77:39:e9",
            "net26": "a2:80:4c:a5:2c:4c",
            "net27": "8a:cc:b6:88:48:11",
            "net3": "52:69:aa:ae:1a:15",
            "net4": "06:8d:9e:b8:92:77",
            "net5": "da:4f:fb:7d:86:56",
            "net6": "f2:7b:0a:28:2f:90",
            "net7": "66:68:92:e7:6c:96",
            "net8": "0e:91:0b:ff:58:d1",
            "net9": "16:13:4d:c8:62:02"
        },
        "tof_1_2_5": {
            "net0": "c6:fd:c2:1e:d0:c3",
            "net1": "1e:46:e6:d0:84:ed",
            "net10": "9a:36:32:08:fa:de",
            "net11": "ee:4f:af:97:61:7e",
            "net12": "7e:3e:15:2f:9b:b3",
            "net13": "26:fd:a9:cd:40:01",
            "net14": "e2:20:cb:29:4c:1a",
            "net15": "a6:0a:90:0f:e3:5c",
            "net16": "c2:91:a0:54:b3:eb",
            "net17": "92:fc:f8:4b:c5:06",
            "net18": "46:07:e2:19:95:99",
            "net19": "ae:a8:d3:b9:9c:2a",
            "net2": "ae:f2:eb:da:5d:46",
            "net20": "ba:c8:d3:75:0a:ed",
            "net21": "a2:2d:f2:95:a5:74",
            "net22": "32:0f:44:0b:a7:e5",
            "net23": "72:1f:3e:79:5c:f9",
            "net24": "4a:b9:ca:1e:36:22",
            "net25": "26:6f:19:f0:6b:05",
            "net26": "b2:71:c8:56:19:45",
            "net27": "6a:74:b6:50:0e:07",
            "net3": "fe:ee:9b:21:90:0c",
            "net4": "ea:ad:7e:e8:43:95",
            "net5": "b2:34:76:65:6d:1a",
            "net6": "b6:de:20:21:7d:b4",
            "net7": "c2:87:08:8c:7c:b7",
            "net8": "4e:6e:0b:8c:1c:0c",
            "net9": "7e:60:99:9f:6a:0e"
        },
        "tof_1_2_6": {
            "net0": "7e:1d:d0:14:65:73",
            "net1": "ee:6b:35:84:61:a6",
            "net10": "de:ac:d5:55:90:85",
            "net11": "8a:dd:fa:28:ad:6f",
            "net12": "2e:9a:09:8c:e5:8e",
            "net13": "66:7e:64:ab:3b:99",
            "net14": "4a:0e:7a:b2:47:f1",
            "net15": "26:f3:a1:9c:fb:98",
            "net16": "86:8a:79:83:2a:57",
            "net17": "e2:3a:a3:be:04:85",
            "net18": "ea:9d:5b:9d:b0:89",
            "net19": "1a:51:04:79:7a:00",
            "net2": "52:dc:8d:9d:67:fb",
            "net20": "0e:45:f1:4a:a3:a2",
            "net21": "2a:e2:f3:2e:bb:93",
            "net22": "52:a2:75:26:c9:c5",
            "net23": "b2:47:be:ff:3e:0e",
            "net24": "6a:79:4e:64:fc:bb",
            "net25": "3e:57:25:29:47:40",
            "net26": "66:76:51:b2:9a:33",
            "net27": "5a:39:57:d9:15:cb",
            "net3": "6e:f3:3f:cf:8a:82",
            "net4": "46:c8:54:cd:8b:dd",
            "net5": "4e:1f:ca:99:7f:27",
            "net6": "a6:b1:21:4d:e4:5e",
            "net7": "9e:80:a9:93:91:e7",
            "net8": "e6:54:ee:9c:07:ff",
            "net9": "9a:d9:d0:e3:19:ce"
        },
        "tof_1_2_7": {
            "net0": "da:39:d7:9d:80:18",
            "net1": "62:63:d9:e7:1e:9c",
            "net10": "7e:61:02:bf:60:6c",
            "net11": "5a:9f:d8:4a:5c:ea",
            "net12": "0a:1e:fc:54:e7:c1",
            "net13": "56:56:7e:3f:4c:c6",
            "net14": "1e:6e:39:d7:a9:ba",
            "net15": "86:e1:18:3b:74:24",
            "net16": "ba:ad:8a:a4:01:2c",
            "net17": "5e:40:f8:1c:40:c8",
            "net18": "3a:6d:9c:7d:60:7d",
            "net19": "1a:f7:94:68:bc:0c",
            "net2": "1a:dd:0a:6d:3c:4d",
            "net20": "d6:da:42:22:5b:6a",
            "net21": "76:2a:48:42:bb:ed",
            "net22": "6e:b0:c0:5c:89:ec",
            "net23": "22:b3:03:76:08:00",
            "net24": "12:2f:8c:f2:ea:67",
            "net25": "4e:09:4f:d4:f8:4d",
            "net26": "ce:0e:63:1e:c2:33",
            "net27": "c2:2c:34:3d:ae:6b",
            "net3": "7a:0c:2f:0b:c7:fc",
            "net4": "ae:28:ed:5e:ad:4f",
            "net5": "b6:4c:ae:aa:4e:f1",
            "net6": "32:94:51:b4:5b:95",
            "net7": "6a:2a:8d:7d:7c:8b",
            "net8": "5e:79:52:3c:fd:2d",
            "net9": "12:7b:be:9b:24:25"
        },
        "tof_1_2_8": {
            "net0": "ee:8b:a8:ec:5c:a3",
            "net1": "3a:0f:9c:36:3b:db",
            "net10": "d2:08:3b:ad:de:7d",
            "net11": "1a:ed:8f:76:a1:d8",
            "net12": "62:14:5d:50:5a:77",
            "net13": "8a:4e:31:fb:c2:f1",
            "net14": "9a:6f:0f:27:a1:d1",
            "net15": "86:95:c6:13:58:c8",
            "net16": "6e:7c:57:08:b5:34",
            "net17": "b2:69:62:d0:30:e7",
            "net18": "a6:94:54:15:3e:89",
            "net19": "32:6e:71:06:4d:49",
            "net2": "e2:d5:49:72:53:b8",
            "net20": "6a:ab:ee:fb:3b:f0",
            "net21": "b6:5a:73:5a:00:b2",
            "net22": "72:4b:8f:3d:25:14",
            "net23": "be:9c:5d:42:64:d6",
            "net24": "72:dd:b2:f2:7f:bb",
            "net25": "82:06:9b:22:a6:70",
            "net26": "ce:05:3f:01:44:b2",
            "net27": "62:45:c3:2c:a8:8c",
            "net3": "ce:c6:40:1e:a2:ac",
            "net4": "1a:1f:24:5f:03:5c",
            "net5": "4a:4a:bd:c0:8c:ae",
            "net6": "c2:37:ee:fb:64:aa",
            "net7": "2a:19:52:6f:43:3c",
            "net8": "4a:ce:bd:a6:90:d5",
            "net9": "4a:c7:85:80:0d:8b"
        },
        "tof_1_2_9": {
            "net0": "12:29:44:90:b4:ed",
            "net1": "b2:74:3e:2b:9f:b7",
            "net10": "9e:31:29:86:66:39",
            "net11": "46:ae:0b:d6:22:cf",
            "net12": "32:4e:30:7a:30:d3",
            "net13": "42:49:1a:d9:d9:e7",
            "net14": "ee:a0:16:88:28:ee",
            "net15": "f6:f8:36:b3:65:9b",
            "net16": "ce:b8:c7:57:a8:04",
            "net17": "ce:61:f7:f2:4a:62",
            "net18": "46:a9:e5:b5:d5:26",
            "net19": "fa:1a:8a:85:09:50",
            "net2": "16:d8:f5:42:bf:e0",
            "net20": "0a:24:a0:d1:a0:1f",
            "net21": "92:66:b6:5a:9d:0b",
            "net22": "7a:07:08:2d:c8:11",
            "net23": "2e:16:4d:6c:b5:fa",
            "net24": "f2:8c:01:d2:8a:b8",
            "net25": "f6:6b:31:86:ed:ae",
            "net26": "e2:9b:3c:61:eb:f3",
            "net27": "d6:fc:98:f1:13:50",
            "net3": "62:80:bb:b3:ea:e2",
            "net4": "a2:73:7c:31:fb:c4",
            "net5": "a6:df:5c:40:d0:32",
            "net6": "1e:68:9f:e4:4c:7d",
            "net7": "8e:f8:1f:88:67:5b",
            "net8": "9e:8b:2c:20:8a:26",
            "net9": "0e:c8:2f:37:e5:35"
        }
    },
    "failed_machine": "tof_1_2_1",
    "failure_time": {
        "leaf_1_0_1": 1635168822.279629,
        "leaf_1_0_10": 1635168822.1681144,
        "leaf_1_0_11": 1635168822.1845846,
        "leaf_1_0_12": 1635168822.1973581,
        "leaf_1_0_13": 1635168822.3346872,
        "leaf_1_0_14": 1635168822.34352,
        "leaf_1_0_2": 1635168822.2277312,
        "leaf_1_0_3": 1635168822.362374,
        "leaf_1_0_4": 1635168822.25471,
        "leaf_1_0_5": 1635168822.1533978,
        "leaf_1_0_6": 1635168822.167689,
        "leaf_1_0_7": 1635168822.1842456,
        "leaf_1_0_8": 1635168822.1993918,
        "leaf_1_0_9": 1635168822.2150238,
        "leaf_2_0_1": 1635168822.2253323,
        "leaf_2_0_10": 1635168822.2347343,
        "leaf_2_0_11": 1635168822.2420654,
        "leaf_2_0_12": 1635168822.254899,
        "leaf_2_0_13": 1635168822.267849,
        "leaf_2_0_14": 1635168822.2799704,
        "leaf_2_0_2": 1635168822.2855077,
        "leaf_2_0_3": 1635168822.2957563,
        "leaf_2_0_4": 1635168822.3039844,
        "leaf_2_0_5": 1635168822.325298,
        "leaf_2_0_6": 1635168822.3358967,
        "leaf_2_0_7": 1635168822.346723,
        "leaf_2_0_8": 1635168822.377877,
        "leaf_2_0_9": 1635168822.267721,
        "spine_1_1_1": 1635168822.2783508,
        "spine_1_1_10": 1635168822.292499,
        "spine_1_1_11": 1635168822.2992275,
        "spine_1_1_12": 1635168822.3066423,
        "spine_1_1_13": 1635168822.3235054,
        "spine_1_1_14": 1635168822.3332903,
        "spine_1_1_2": 1635168822.4732292,
        "spine_1_1_3": 1635168822.3727725,
        "spine_1_1_4": 1635168822.383225,
        "spine_1_1_5": 1635168822.3970456,
        "spine_1_1_6": 1635168822.4085162,
        "spine_1_1_7": 1635168822.4310796,
        "spine_1_1_8": 1635168822.439834,
        "spine_1_1_9": 1635168822.4538717,
        "spine_2_1_1": 1635168822.4706528,
        "spine_2_1_10": 1635168822.4843776,
        "spine_2_1_11": 1635168822.4927738,
        "spine_2_1_12": 1635168822.3868573,
        "spine_2_1_13": 1635168822.4087012,
        "spine_2_1_14": 1635168822.432584,
        "spine_2_1_2": 1635168822.438228,
        "spine_2_1_3": 1635168822.4511125,
        "spine_2_1_4": 1635168822.4648147,
        "spine_2_1_5": 1635168822.6077752,
        "spine_2_1_6": 1635168822.6213124,
        "spine_2_1_7": 1635168822.5045824,
        "spine_2_1_8": 1635168822.5001745,
        "spine_2_1_9": 1635168822.5082512,
        "tof_1_2_1": 1635168822.5175974,
        "tof_1_2_10": 1635168822.5323029,
        "tof_1_2_11": 1635168822.5467281,
        "tof_1_2_12": 1635168822.5695438,
        "tof_1_2_13": 1635168822.582274,
        "tof_1_2_14": 1635168822.5957282,
        "tof_1_2_2": 1635168822.6070733,
        "tof_1_2_3": 1635168822.6412024,
        "tof_1_2_4": 1635168822.5307608,
        "tof_1_2_5": 1635168822.6696382,
        "tof_1_2_6": 1635168822.5706744,
        "tof_1_2_7": 1635168822.584853,
        "tof_1_2_8": 1635168822.5950115,
        "tof_1_2_9": 1635168822.6062896
    }
}