{"Node": 0,
"Coreness": 0,
"NumeroNodi": 0,
"NumeroArchi": 0,
"minCoreness": 0,
"maxCoreness": 0,
"children": [
	{"Node": 117122,
	 "Coreness": 1,
	 "minCoreness":  1,
	 "maxCoreness": 1,
	 "NumeroNodi": 1858428,
	 "NumeroArchi": 0,
	 "children": [
		{"Node": 356228,
		 "Coreness": 2,
		 "minCoreness":  2,
		 "maxCoreness": 2,
		 "NumeroNodi": 4402832,
		 "NumeroArchi": 0,
		 "children": [
			{"Node": 3124,
			 "Coreness": 3,
			 "minCoreness":  3,
			 "maxCoreness": 3,
			 "NumeroNodi": 4,
			 "NumeroArchi": 0,
			 "children": [
			 ]},
			{"Node": 3123,
			 "Coreness": 3,
			 "minCoreness":  3,
			 "maxCoreness": 3,
			 "NumeroNodi": 4,
			 "NumeroArchi": 0,
			 "children": [
			 ]},
			{"Node": 3122,
			 "Coreness": 3,
			 "minCoreness":  3,
			 "maxCoreness": 3,
			 "NumeroNodi": 5,
			 "NumeroArchi": 0,
			 "children": [
			 ]},
			{"Node": 3121,
			 "Coreness": 3,
			 "minCoreness":  3,
			 "maxCoreness": 3,
			 "NumeroNodi": 7,
			 "NumeroArchi": 0,
			 "children": [
			 ]},
			{"Node": 3120,
			 "Coreness": 3,
			 "minCoreness":  3,
			 "maxCoreness": 3,
			 "NumeroNodi": 5,
			 "NumeroArchi": 0,
			 "children": [
			 ]},
			{"Node": 3119,
			 "Coreness": 3,
			 "minCoreness":  3,
			 "maxCoreness": 3,
			 "NumeroNodi": 5,
			 "NumeroArchi": 0,
			 "children": [
			 ]},
			{"Node": 3118,
			 "Coreness": 3,
			 "minCoreness":  3,
			 "maxCoreness": 3,
			 "NumeroNodi": 11,
			 "NumeroArchi": 0,
			 "children": [
			 ]},
			{"Node": 3117,
			 "Coreness": 3,
			 "minCoreness":  3,
			 "maxCoreness": 3,
			 "NumeroNodi": 5,
			 "NumeroArchi": 0,
			 "children": [
			 ]},
			{"Node": 3116,
			 "Coreness": 3,
			 "minCoreness":  3,
			 "maxCoreness": 3,
			 "NumeroNodi": 14,
			 "NumeroArchi": 0,
			 "children": [
			 ]},
			{"Node": 3113,
			 "Coreness": 3,
			 "minCoreness":  3,
			 "maxCoreness": 3,
			 "NumeroNodi": 5,
			 "NumeroArchi": 0,
			 "children": [
			 ]},
			{"Node": 3112,
			 "Coreness": 3,
			 "minCoreness":  3,
			 "maxCoreness": 3,
			 "NumeroNodi": 5,
			 "NumeroArchi": 0,
			 "children": [
			 ]},
			{"Node": 3111,
			 "Coreness": 3,
			 "minCoreness":  3,
			 "maxCoreness": 3,
			 "NumeroNodi": 4,
			 "NumeroArchi": 0,
			 "children": [
			 ]},
			{"Node": 3110,
			 "Coreness": 3,
			 "minCoreness":  3,
			 "maxCoreness": 3,
			 "NumeroNodi": 5,
			 "NumeroArchi": 0,
			 "children": [
			 ]},
			{"Node": 3108,
			 "Coreness": 3,
			 "minCoreness":  3,
			 "maxCoreness": 3,
			 "NumeroNodi": 14,
			 "NumeroArchi": 0,
			 "children": [
			 ]},
			{"Node": 3107,
			 "Coreness": 3,
			 "minCoreness":  3,
			 "maxCoreness": 3,
			 "NumeroNodi": 5,
			 "NumeroArchi": 0,
			 "children": [
			 ]},
			{"Node": 3100,
			 "Coreness": 3,
			 "minCoreness":  3,
			 "maxCoreness": 3,
			 "NumeroNodi": 5,
			 "NumeroArchi": 0,
			 "children": [
			 ]},
			{"Node": 3106,
			 "Coreness": 3,
			 "minCoreness":  3,
			 "maxCoreness": 3,
			 "NumeroNodi": 5,
			 "NumeroArchi": 0,
			 "children": [
			 ]},
			{"Node": 3105,
			 "Coreness": 3,
			 "minCoreness":  3,
			 "maxCoreness": 3,
			 "NumeroNodi": 5,
			 "NumeroArchi": 0,
			 "children": [
			 ]},
			{"Node": 3101,
			 "Coreness": 3,
			 "minCoreness":  3,
			 "maxCoreness": 3,
			 "NumeroNodi": 5,
			 "NumeroArchi": 0,
			 "children": [
			 ]},
			{"Node": 3104,
			 "Coreness": 3,
			 "minCoreness":  3,
			 "maxCoreness": 3,
			 "NumeroNodi": 8,
			 "NumeroArchi": 0,
			 "children": [
			 ]},
			{"Node": 3103,
			 "Coreness": 3,
			 "minCoreness":  3,
			 "maxCoreness": 3,
			 "NumeroNodi": 5,
			 "NumeroArchi": 0,
			 "children": [
			 ]},
			{"Node": 3102,
			 "Coreness": 3,
			 "minCoreness":  3,
			 "maxCoreness": 3,
			 "NumeroNodi": 4,
			 "NumeroArchi": 0,
			 "children": [
			 ]},
			{"Node": 3099,
			 "Coreness": 3,
			 "minCoreness":  3,
			 "maxCoreness": 3,
			 "NumeroNodi": 4,
			 "NumeroArchi": 0,
			 "children": [
			 ]},
			{"Node": 3098,
			 "Coreness": 3,
			 "minCoreness":  3,
			 "maxCoreness": 3,
			 "NumeroNodi": 5,
			 "NumeroArchi": 0,
			 "children": [
			 ]},
			{"Node": 3097,
			 "Coreness": 3,
			 "minCoreness":  3,
			 "maxCoreness": 3,
			 "NumeroNodi": 5,
			 "NumeroArchi": 0,
			 "children": [
			 ]},
			{"Node": 3096,
			 "Coreness": 3,
			 "minCoreness":  3,
			 "maxCoreness": 3,
			 "NumeroNodi": 5,
			 "NumeroArchi": 0,
			 "children": [
			 ]},
			{"Node": 3095,
			 "Coreness": 3,
			 "minCoreness":  3,
			 "maxCoreness": 3,
			 "NumeroNodi": 4,
			 "NumeroArchi": 0,
			 "children": [
			 ]},
			{"Node": 3094,
			 "Coreness": 3,
			 "minCoreness":  3,
			 "maxCoreness": 3,
			 "NumeroNodi": 6,
			 "NumeroArchi": 0,
			 "children": [
			 ]},
			{"Node": 3093,
			 "Coreness": 3,
			 "minCoreness":  3,
			 "maxCoreness": 3,
			 "NumeroNodi": 5,
			 "NumeroArchi": 0,
			 "children": [
			 ]},
			{"Node": 3092,
			 "Coreness": 3,
			 "minCoreness":  3,
			 "maxCoreness": 3,
			 "NumeroNodi": 4,
			 "NumeroArchi": 0,
			 "children": [
			 ]},
			{"Node": 3091,
			 "Coreness": 3,
			 "minCoreness":  3,
			 "maxCoreness": 3,
			 "NumeroNodi": 5,
			 "NumeroArchi": 0,
			 "children": [
			 ]},
			{"Node": 3090,
			 "Coreness": 3,
			 "minCoreness":  3,
			 "maxCoreness": 3,
			 "NumeroNodi": 5,
			 "NumeroArchi": 0,
			 "children": [
			 ]},
			{"Node": 3085,
			 "Coreness": 3,
			 "minCoreness":  3,
			 "maxCoreness": 3,
			 "NumeroNodi": 6,
			 "NumeroArchi": 0,
			 "children": [
			 ]},
			{"Node": 3086,
			 "Coreness": 3,
			 "minCoreness":  3,
			 "maxCoreness": 3,
			 "NumeroNodi": 4,
			 "NumeroArchi": 0,
			 "children": [
			 ]},
			{"Node": 3089,
			 "Coreness": 3,
			 "minCoreness":  3,
			 "maxCoreness": 3,
			 "NumeroNodi": 11,
			 "NumeroArchi": 0,
			 "children": [
			 ]},
			{"Node": 3088,
			 "Coreness": 3,
			 "minCoreness":  3,
			 "maxCoreness": 3,
			 "NumeroNodi": 4,
			 "NumeroArchi": 0,
			 "children": [
			 ]},
			{"Node": 3087,
			 "Coreness": 3,
			 "minCoreness":  3,
			 "maxCoreness": 3,
			 "NumeroNodi": 5,
			 "NumeroArchi": 0,
			 "children": [
			 ]},
			{"Node": 3084,
			 "Coreness": 3,
			 "minCoreness":  3,
			 "maxCoreness": 3,
			 "NumeroNodi": 4,
			 "NumeroArchi": 0,
			 "children": [
			 ]},
			{"Node": 3083,
			 "Coreness": 3,
			 "minCoreness":  3,
			 "maxCoreness": 3,
			 "NumeroNodi": 6,
			 "NumeroArchi": 0,
			 "children": [
			 ]},
			{"Node": 3082,
			 "Coreness": 3,
			 "minCoreness":  3,
			 "maxCoreness": 3,
			 "NumeroNodi": 4,
			 "NumeroArchi": 0,
			 "children": [
			 ]},
			{"Node": 3081,
			 "Coreness": 3,
			 "minCoreness":  3,
			 "maxCoreness": 3,
			 "NumeroNodi": 28,
			 "NumeroArchi": 0,
			 "children": [
			 ]},
			{"Node": 3080,
			 "Coreness": 3,
			 "minCoreness":  3,
			 "maxCoreness": 3,
			 "NumeroNodi": 5,
			 "NumeroArchi": 0,
			 "children": [
			 ]},
			{"Node": 3079,
			 "Coreness": 3,
			 "minCoreness":  3,
			 "maxCoreness": 3,
			 "NumeroNodi": 5,
			 "NumeroArchi": 0,
			 "children": [
			 ]},
			{"Node": 3078,
			 "Coreness": 3,
			 "minCoreness":  3,
			 "maxCoreness": 3,
			 "NumeroNodi": 6,
			 "NumeroArchi": 0,
			 "children": [
			 ]},
			{"Node": 3077,
			 "Coreness": 3,
			 "minCoreness":  3,
			 "maxCoreness": 3,
			 "NumeroNodi": 5,
			 "NumeroArchi": 0,
			 "children": [
			 ]},
			{"Node": 3064,
			 "Coreness": 3,
			 "minCoreness":  3,
			 "maxCoreness": 3,
			 "NumeroNodi": 12,
			 "NumeroArchi": 0,
			 "children": [
			 ]},
			{"Node": 3063,
			 "Coreness": 3,
			 "minCoreness":  3,
			 "maxCoreness": 3,
			 "NumeroNodi": 5,
			 "NumeroArchi": 0,
			 "children": [
			 ]},
			{"Node": 3076,
			 "Coreness": 3,
			 "minCoreness":  3,
			 "maxCoreness": 3,
			 "NumeroNodi": 4,
			 "NumeroArchi": 0,
			 "children": [
			 ]},
			{"Node": 3075,
			 "Coreness": 3,
			 "minCoreness":  3,
			 "maxCoreness": 3,
			 "NumeroNodi": 5,
			 "NumeroArchi": 0,
			 "children": [
			 ]},
			{"Node": 3074,
			 "Coreness": 3,
			 "minCoreness":  3,
			 "maxCoreness": 3,
			 "NumeroNodi": 7,
			 "NumeroArchi": 0,
			 "children": [
			 ]},
			{"Node": 3073,
			 "Coreness": 3,
			 "minCoreness":  3,
			 "maxCoreness": 3,
			 "NumeroNodi": 21,
			 "NumeroArchi": 0,
			 "children": [
			 ]},
			{"Node": 3072,
			 "Coreness": 3,
			 "minCoreness":  3,
			 "maxCoreness": 3,
			 "NumeroNodi": 4,
			 "NumeroArchi": 0,
			 "children": [
			 ]},
			{"Node": 3071,
			 "Coreness": 3,
			 "minCoreness":  3,
			 "maxCoreness": 3,
			 "NumeroNodi": 5,
			 "NumeroArchi": 0,
			 "children": [
			 ]},
			{"Node": 3058,
			 "Coreness": 3,
			 "minCoreness":  3,
			 "maxCoreness": 3,
			 "NumeroNodi": 5,
			 "NumeroArchi": 0,
			 "children": [
			 ]},
			{"Node": 3070,
			 "Coreness": 3,
			 "minCoreness":  3,
			 "maxCoreness": 3,
			 "NumeroNodi": 6,
			 "NumeroArchi": 0,
			 "children": [
			 ]},
			{"Node": 3069,
			 "Coreness": 3,
			 "minCoreness":  3,
			 "maxCoreness": 3,
			 "NumeroNodi": 10,
			 "NumeroArchi": 0,
			 "children": [
			 ]},
			{"Node": 3068,
			 "Coreness": 3,
			 "minCoreness":  3,
			 "maxCoreness": 3,
			 "NumeroNodi": 4,
			 "NumeroArchi": 0,
			 "children": [
			 ]},
			{"Node": 3066,
			 "Coreness": 3,
			 "minCoreness":  3,
			 "maxCoreness": 3,
			 "NumeroNodi": 4,
			 "NumeroArchi": 0,
			 "children": [
			 ]},
			{"Node": 3065,
			 "Coreness": 3,
			 "minCoreness":  3,
			 "maxCoreness": 3,
			 "NumeroNodi": 4,
			 "NumeroArchi": 0,
			 "children": [
			 ]},
			{"Node": 3067,
			 "Coreness": 3,
			 "minCoreness":  3,
			 "maxCoreness": 3,
			 "NumeroNodi": 5,
			 "NumeroArchi": 0,
			 "children": [
			 ]},
			{"Node": 3057,
			 "Coreness": 3,
			 "minCoreness":  3,
			 "maxCoreness": 3,
			 "NumeroNodi": 5,
			 "NumeroArchi": 0,
			 "children": [
			 ]},
			{"Node": 3062,
			 "Coreness": 3,
			 "minCoreness":  3,
			 "maxCoreness": 3,
			 "NumeroNodi": 5,
			 "NumeroArchi": 0,
			 "children": [
			 ]},
			{"Node": 3061,
			 "Coreness": 3,
			 "minCoreness":  3,
			 "maxCoreness": 3,
			 "NumeroNodi": 5,
			 "NumeroArchi": 0,
			 "children": [
			 ]},
			{"Node": 3060,
			 "Coreness": 3,
			 "minCoreness":  3,
			 "maxCoreness": 3,
			 "NumeroNodi": 5,
			 "NumeroArchi": 0,
			 "children": [
			 ]},
			{"Node": 3059,
			 "Coreness": 3,
			 "minCoreness":  3,
			 "maxCoreness": 3,
			 "NumeroNodi": 5,
			 "NumeroArchi": 0,
			 "children": [
			 ]},
			{"Node": 3056,
			 "Coreness": 3,
			 "minCoreness":  3,
			 "maxCoreness": 3,
			 "NumeroNodi": 21,
			 "NumeroArchi": 0,
			 "children": [
			 ]},
			{"Node": 3049,
			 "Coreness": 3,
			 "minCoreness":  3,
			 "maxCoreness": 3,
			 "NumeroNodi": 19,
			 "NumeroArchi": 0,
			 "children": [
			 ]},
			{"Node": 3055,
			 "Coreness": 3,
			 "minCoreness":  3,
			 "maxCoreness": 3,
			 "NumeroNodi": 6,
			 "NumeroArchi": 0,
			 "children": [
			 ]},
			{"Node": 3046,
			 "Coreness": 3,
			 "minCoreness":  3,
			 "maxCoreness": 3,
			 "NumeroNodi": 5,
			 "NumeroArchi": 0,
			 "children": [
			 ]},
			{"Node": 3047,
			 "Coreness": 3,
			 "minCoreness":  3,
			 "maxCoreness": 3,
			 "NumeroNodi": 5,
			 "NumeroArchi": 0,
			 "children": [
			 ]},
			{"Node": 3045,
			 "Coreness": 3,
			 "minCoreness":  3,
			 "maxCoreness": 3,
			 "NumeroNodi": 4,
			 "NumeroArchi": 0,
			 "children": [
			 ]},
			{"Node": 3043,
			 "Coreness": 3,
			 "minCoreness":  3,
			 "maxCoreness": 3,
			 "NumeroNodi": 14,
			 "NumeroArchi": 0,
			 "children": [
			 ]},
			{"Node": 3044,
			 "Coreness": 3,
			 "minCoreness":  3,
			 "maxCoreness": 3,
			 "NumeroNodi": 14,
			 "NumeroArchi": 0,
			 "children": [
			 ]},
			{"Node": 3042,
			 "Coreness": 3,
			 "minCoreness":  3,
			 "maxCoreness": 3,
			 "NumeroNodi": 7,
			 "NumeroArchi": 0,
			 "children": [
			 ]},
			{"Node": 3041,
			 "Coreness": 3,
			 "minCoreness":  3,
			 "maxCoreness": 3,
			 "NumeroNodi": 5,
			 "NumeroArchi": 0,
			 "children": [
			 ]},
			{"Node": 3054,
			 "Coreness": 3,
			 "minCoreness":  3,
			 "maxCoreness": 3,
			 "NumeroNodi": 5,
			 "NumeroArchi": 0,
			 "children": [
			 ]},
			{"Node": 3040,
			 "Coreness": 3,
			 "minCoreness":  3,
			 "maxCoreness": 3,
			 "NumeroNodi": 18,
			 "NumeroArchi": 0,
			 "children": [
			 ]},
			{"Node": 3053,
			 "Coreness": 3,
			 "minCoreness":  3,
			 "maxCoreness": 3,
			 "NumeroNodi": 8,
			 "NumeroArchi": 0,
			 "children": [
			 ]},
			{"Node": 3052,
			 "Coreness": 3,
			 "minCoreness":  3,
			 "maxCoreness": 3,
			 "NumeroNodi": 5,
			 "NumeroArchi": 0,
			 "children": [
			 ]},
			{"Node": 3039,
			 "Coreness": 3,
			 "minCoreness":  3,
			 "maxCoreness": 3,
			 "NumeroNodi": 5,
			 "NumeroArchi": 0,
			 "children": [
			 ]},
			{"Node": 3038,
			 "Coreness": 3,
			 "minCoreness":  3,
			 "maxCoreness": 3,
			 "NumeroNodi": 5,
			 "NumeroArchi": 0,
			 "children": [
			 ]},
			{"Node": 3050,
			 "Coreness": 3,
			 "minCoreness":  3,
			 "maxCoreness": 3,
			 "NumeroNodi": 20,
			 "NumeroArchi": 0,
			 "children": [
			 ]},
			{"Node": 3037,
			 "Coreness": 3,
			 "minCoreness":  3,
			 "maxCoreness": 3,
			 "NumeroNodi": 6,
			 "NumeroArchi": 0,
			 "children": [
			 ]},
			{"Node": 3036,
			 "Coreness": 3,
			 "minCoreness":  3,
			 "maxCoreness": 3,
			 "NumeroNodi": 5,
			 "NumeroArchi": 0,
			 "children": [
			 ]},
			{"Node": 3035,
			 "Coreness": 3,
			 "minCoreness":  3,
			 "maxCoreness": 3,
			 "NumeroNodi": 5,
			 "NumeroArchi": 0,
			 "children": [
			 ]},
			{"Node": 3034,
			 "Coreness": 3,
			 "minCoreness":  3,
			 "maxCoreness": 3,
			 "NumeroNodi": 5,
			 "NumeroArchi": 0,
			 "children": [
			 ]},
			{"Node": 3033,
			 "Coreness": 3,
			 "minCoreness":  3,
			 "maxCoreness": 3,
			 "NumeroNodi": 4,
			 "NumeroArchi": 0,
			 "children": [
			 ]},
			{"Node": 3032,
			 "Coreness": 3,
			 "minCoreness":  3,
			 "maxCoreness": 3,
			 "NumeroNodi": 8,
			 "NumeroArchi": 0,
			 "children": [
			 ]},
			{"Node": 3031,
			 "Coreness": 3,
			 "minCoreness":  3,
			 "maxCoreness": 3,
			 "NumeroNodi": 5,
			 "NumeroArchi": 0,
			 "children": [
			 ]},
			{"Node": 3019,
			 "Coreness": 3,
			 "minCoreness":  3,
			 "maxCoreness": 3,
			 "NumeroNodi": 4,
			 "NumeroArchi": 0,
			 "children": [
			 ]},
			{"Node": 3018,
			 "Coreness": 3,
			 "minCoreness":  3,
			 "maxCoreness": 3,
			 "NumeroNodi": 5,
			 "NumeroArchi": 0,
			 "children": [
			 ]},
			{"Node": 3030,
			 "Coreness": 3,
			 "minCoreness":  3,
			 "maxCoreness": 3,
			 "NumeroNodi": 4,
			 "NumeroArchi": 0,
			 "children": [
			 ]},
			{"Node": 3029,
			 "Coreness": 3,
			 "minCoreness":  3,
			 "maxCoreness": 3,
			 "NumeroNodi": 4,
			 "NumeroArchi": 0,
			 "children": [
			 ]},
			{"Node": 3025,
			 "Coreness": 3,
			 "minCoreness":  3,
			 "maxCoreness": 3,
			 "NumeroNodi": 5,
			 "NumeroArchi": 0,
			 "children": [
			 ]},
			{"Node": 3017,
			 "Coreness": 3,
			 "minCoreness":  3,
			 "maxCoreness": 3,
			 "NumeroNodi": 17,
			 "NumeroArchi": 0,
			 "children": [
			 ]},
			{"Node": 3016,
			 "Coreness": 3,
			 "minCoreness":  3,
			 "maxCoreness": 3,
			 "NumeroNodi": 12,
			 "NumeroArchi": 0,
			 "children": [
			 ]},
			{"Node": 3028,
			 "Coreness": 3,
			 "minCoreness":  3,
			 "maxCoreness": 3,
			 "NumeroNodi": 8,
			 "NumeroArchi": 0,
			 "children": [
			 ]},
			{"Node": 3027,
			 "Coreness": 3,
			 "minCoreness":  3,
			 "maxCoreness": 3,
			 "NumeroNodi": 18,
			 "NumeroArchi": 0,
			 "children": [
			 ]},
			{"Node": 3024,
			 "Coreness": 3,
			 "minCoreness":  3,
			 "maxCoreness": 3,
			 "NumeroNodi": 4,
			 "NumeroArchi": 0,
			 "children": [
			 ]},
			{"Node": 3023,
			 "Coreness": 3,
			 "minCoreness":  3,
			 "maxCoreness": 3,
			 "NumeroNodi": 5,
			 "NumeroArchi": 0,
			 "children": [
			 ]},
			{"Node": 3022,
			 "Coreness": 3,
			 "minCoreness":  3,
			 "maxCoreness": 3,
			 "NumeroNodi": 4,
			 "NumeroArchi": 0,
			 "children": [
			 ]},
			{"Node": 3014,
			 "Coreness": 3,
			 "minCoreness":  3,
			 "maxCoreness": 3,
			 "NumeroNodi": 5,
			 "NumeroArchi": 0,
			 "children": [
			 ]},
			{"Node": 3021,
			 "Coreness": 3,
			 "minCoreness":  3,
			 "maxCoreness": 3,
			 "NumeroNodi": 5,
			 "NumeroArchi": 0,
			 "children": [
			 ]},
			{"Node": 3020,
			 "Coreness": 3,
			 "minCoreness":  3,
			 "maxCoreness": 3,
			 "NumeroNodi": 5,
			 "NumeroArchi": 0,
			 "children": [
			 ]},
			{"Node": 3013,
			 "Coreness": 3,
			 "minCoreness":  3,
			 "maxCoreness": 3,
			 "NumeroNodi": 20,
			 "NumeroArchi": 0,
			 "children": [
			 ]},
			{"Node": 3012,
			 "Coreness": 3,
			 "minCoreness":  3,
			 "maxCoreness": 3,
			 "NumeroNodi": 5,
			 "NumeroArchi": 0,
			 "children": [
			 ]},
			{"Node": 3011,
			 "Coreness": 3,
			 "minCoreness":  3,
			 "maxCoreness": 3,
			 "NumeroNodi": 5,
			 "NumeroArchi": 0,
			 "children": [
			 ]},
			{"Node": 3010,
			 "Coreness": 3,
			 "minCoreness":  3,
			 "maxCoreness": 3,
			 "NumeroNodi": 5,
			 "NumeroArchi": 0,
			 "children": [
			 ]},
			{"Node": 3002,
			 "Coreness": 3,
			 "minCoreness":  3,
			 "maxCoreness": 3,
			 "NumeroNodi": 5,
			 "NumeroArchi": 0,
			 "children": [
			 ]},
			{"Node": 3003,
			 "Coreness": 3,
			 "minCoreness":  3,
			 "maxCoreness": 3,
			 "NumeroNodi": 5,
			 "NumeroArchi": 0,
			 "children": [
			 ]},
			{"Node": 3001,
			 "Coreness": 3,
			 "minCoreness":  3,
			 "maxCoreness": 3,
			 "NumeroNodi": 5,
			 "NumeroArchi": 0,
			 "children": [
			 ]},
			{"Node": 3005,
			 "Coreness": 3,
			 "minCoreness":  3,
			 "maxCoreness": 3,
			 "NumeroNodi": 20,
			 "NumeroArchi": 0,
			 "children": [
			 ]},
			{"Node": 3006,
			 "Coreness": 3,
			 "minCoreness":  3,
			 "maxCoreness": 3,
			 "NumeroNodi": 14,
			 "NumeroArchi": 0,
			 "children": [
			 ]},
			{"Node": 3009,
			 "Coreness": 3,
			 "minCoreness":  3,
			 "maxCoreness": 3,
			 "NumeroNodi": 29,
			 "NumeroArchi": 0,
			 "children": [
			 ]},
			{"Node": 3008,
			 "Coreness": 3,
			 "minCoreness":  3,
			 "maxCoreness": 3,
			 "NumeroNodi": 20,
			 "NumeroArchi": 0,
			 "children": [
			 ]}		 ]}	 ]} ]
}