{"Node": 0,
"Coreness": 0,
"NumeroNodi": 0,
"NumeroArchi": 0,
"minCoreness": 0,
"maxCoreness": 0,
"children": [
	{"Node": 388403,
	 "Coreness": 1,
	 "minCoreness":  1,
	 "maxCoreness": 1,
	 "NumeroNodi": 7027823,
	 "NumeroArchi": 0,
	 "children": [
		{"Node": 1381219,
		 "Coreness": 2,
		 "minCoreness":  2,
		 "maxCoreness": 2,
		 "NumeroNodi": 16915812,
		 "NumeroArchi": 0,
		 "children": [
			{"Node": 3571,
			 "Coreness": 3,
			 "minCoreness":  3,
			 "maxCoreness": 3,
			 "NumeroNodi": 4,
			 "NumeroArchi": 0,
			 "children": [
			 ]},
			{"Node": 3570,
			 "Coreness": 3,
			 "minCoreness":  3,
			 "maxCoreness": 3,
			 "NumeroNodi": 4,
			 "NumeroArchi": 0,
			 "children": [
			 ]},
			{"Node": 3569,
			 "Coreness": 3,
			 "minCoreness":  3,
			 "maxCoreness": 3,
			 "NumeroNodi": 6,
			 "NumeroArchi": 0,
			 "children": [
			 ]},
			{"Node": 3568,
			 "Coreness": 3,
			 "minCoreness":  3,
			 "maxCoreness": 3,
			 "NumeroNodi": 13,
			 "NumeroArchi": 0,
			 "children": [
			 ]},
			{"Node": 3567,
			 "Coreness": 3,
			 "minCoreness":  3,
			 "maxCoreness": 3,
			 "NumeroNodi": 4,
			 "NumeroArchi": 0,
			 "children": [
			 ]},
			{"Node": 3566,
			 "Coreness": 3,
			 "minCoreness":  3,
			 "maxCoreness": 3,
			 "NumeroNodi": 5,
			 "NumeroArchi": 0,
			 "children": [
			 ]},
			{"Node": 3565,
			 "Coreness": 3,
			 "minCoreness":  3,
			 "maxCoreness": 3,
			 "NumeroNodi": 22,
			 "NumeroArchi": 0,
			 "children": [
			 ]},
			{"Node": 3563,
			 "Coreness": 3,
			 "minCoreness":  3,
			 "maxCoreness": 3,
			 "NumeroNodi": 5,
			 "NumeroArchi": 0,
			 "children": [
			 ]},
			{"Node": 3564,
			 "Coreness": 3,
			 "minCoreness":  3,
			 "maxCoreness": 3,
			 "NumeroNodi": 4,
			 "NumeroArchi": 0,
			 "children": [
			 ]},
			{"Node": 3562,
			 "Coreness": 3,
			 "minCoreness":  3,
			 "maxCoreness": 3,
			 "NumeroNodi": 4,
			 "NumeroArchi": 0,
			 "children": [
			 ]},
			{"Node": 3557,
			 "Coreness": 3,
			 "minCoreness":  3,
			 "maxCoreness": 3,
			 "NumeroNodi": 5,
			 "NumeroArchi": 0,
			 "children": [
			 ]},
			{"Node": 3558,
			 "Coreness": 3,
			 "minCoreness":  3,
			 "maxCoreness": 3,
			 "NumeroNodi": 5,
			 "NumeroArchi": 0,
			 "children": [
			 ]},
			{"Node": 3559,
			 "Coreness": 3,
			 "minCoreness":  3,
			 "maxCoreness": 3,
			 "NumeroNodi": 5,
			 "NumeroArchi": 0,
			 "children": [
			 ]},
			{"Node": 3560,
			 "Coreness": 3,
			 "minCoreness":  3,
			 "maxCoreness": 3,
			 "NumeroNodi": 24,
			 "NumeroArchi": 0,
			 "children": [
			 ]},
			{"Node": 3556,
			 "Coreness": 3,
			 "minCoreness":  3,
			 "maxCoreness": 3,
			 "NumeroNodi": 5,
			 "NumeroArchi": 0,
			 "children": [
			 ]},
			{"Node": 3555,
			 "Coreness": 3,
			 "minCoreness":  3,
			 "maxCoreness": 3,
			 "NumeroNodi": 7,
			 "NumeroArchi": 0,
			 "children": [
			 ]},
			{"Node": 3554,
			 "Coreness": 3,
			 "minCoreness":  3,
			 "maxCoreness": 3,
			 "NumeroNodi": 5,
			 "NumeroArchi": 0,
			 "children": [
			 ]},
			{"Node": 3553,
			 "Coreness": 3,
			 "minCoreness":  3,
			 "maxCoreness": 3,
			 "NumeroNodi": 5,
			 "NumeroArchi": 0,
			 "children": [
			 ]},
			{"Node": 3552,
			 "Coreness": 3,
			 "minCoreness":  3,
			 "maxCoreness": 3,
			 "NumeroNodi": 11,
			 "NumeroArchi": 0,
			 "children": [
			 ]},
			{"Node": 3551,
			 "Coreness": 3,
			 "minCoreness":  3,
			 "maxCoreness": 3,
			 "NumeroNodi": 5,
			 "NumeroArchi": 0,
			 "children": [
			 ]},
			{"Node": 3550,
			 "Coreness": 3,
			 "minCoreness":  3,
			 "maxCoreness": 3,
			 "NumeroNodi": 4,
			 "NumeroArchi": 0,
			 "children": [
			 ]},
			{"Node": 3549,
			 "Coreness": 3,
			 "minCoreness":  3,
			 "maxCoreness": 3,
			 "NumeroNodi": 6,
			 "NumeroArchi": 0,
			 "children": [
			 ]},
			{"Node": 3548,
			 "Coreness": 3,
			 "minCoreness":  3,
			 "maxCoreness": 3,
			 "NumeroNodi": 5,
			 "NumeroArchi": 0,
			 "children": [
			 ]},
			{"Node": 3547,
			 "Coreness": 3,
			 "minCoreness":  3,
			 "maxCoreness": 3,
			 "NumeroNodi": 6,
			 "NumeroArchi": 0,
			 "children": [
			 ]},
			{"Node": 3545,
			 "Coreness": 3,
			 "minCoreness":  3,
			 "maxCoreness": 3,
			 "NumeroNodi": 4,
			 "NumeroArchi": 0,
			 "children": [
			 ]},
			{"Node": 3546,
			 "Coreness": 3,
			 "minCoreness":  3,
			 "maxCoreness": 3,
			 "NumeroNodi": 5,
			 "NumeroArchi": 0,
			 "children": [
			 ]},
			{"Node": 3544,
			 "Coreness": 3,
			 "minCoreness":  3,
			 "maxCoreness": 3,
			 "NumeroNodi": 5,
			 "NumeroArchi": 0,
			 "children": [
			 ]},
			{"Node": 3543,
			 "Coreness": 3,
			 "minCoreness":  3,
			 "maxCoreness": 3,
			 "NumeroNodi": 21,
			 "NumeroArchi": 0,
			 "children": [
			 ]},
			{"Node": 3542,
			 "Coreness": 3,
			 "minCoreness":  3,
			 "maxCoreness": 3,
			 "NumeroNodi": 14,
			 "NumeroArchi": 0,
			 "children": [
			 ]},
			{"Node": 3539,
			 "Coreness": 3,
			 "minCoreness":  3,
			 "maxCoreness": 3,
			 "NumeroNodi": 5,
			 "NumeroArchi": 0,
			 "children": [
			 ]},
			{"Node": 3538,
			 "Coreness": 3,
			 "minCoreness":  3,
			 "maxCoreness": 3,
			 "NumeroNodi": 5,
			 "NumeroArchi": 0,
			 "children": [
			 ]},
			{"Node": 3537,
			 "Coreness": 3,
			 "minCoreness":  3,
			 "maxCoreness": 3,
			 "NumeroNodi": 4,
			 "NumeroArchi": 0,
			 "children": [
			 ]},
			{"Node": 3536,
			 "Coreness": 3,
			 "minCoreness":  3,
			 "maxCoreness": 3,
			 "NumeroNodi": 5,
			 "NumeroArchi": 0,
			 "children": [
			 ]},
			{"Node": 3535,
			 "Coreness": 3,
			 "minCoreness":  3,
			 "maxCoreness": 3,
			 "NumeroNodi": 5,
			 "NumeroArchi": 0,
			 "children": [
			 ]},
			{"Node": 3534,
			 "Coreness": 3,
			 "minCoreness":  3,
			 "maxCoreness": 3,
			 "NumeroNodi": 4,
			 "NumeroArchi": 0,
			 "children": [
			 ]},
			{"Node": 3533,
			 "Coreness": 3,
			 "minCoreness":  3,
			 "maxCoreness": 3,
			 "NumeroNodi": 5,
			 "NumeroArchi": 0,
			 "children": [
			 ]},
			{"Node": 3531,
			 "Coreness": 3,
			 "minCoreness":  3,
			 "maxCoreness": 3,
			 "NumeroNodi": 14,
			 "NumeroArchi": 0,
			 "children": [
			 ]},
			{"Node": 3530,
			 "Coreness": 3,
			 "minCoreness":  3,
			 "maxCoreness": 3,
			 "NumeroNodi": 5,
			 "NumeroArchi": 0,
			 "children": [
			 ]},
			{"Node": 3529,
			 "Coreness": 3,
			 "minCoreness":  3,
			 "maxCoreness": 3,
			 "NumeroNodi": 4,
			 "NumeroArchi": 0,
			 "children": [
			 ]},
			{"Node": 3528,
			 "Coreness": 3,
			 "minCoreness":  3,
			 "maxCoreness": 3,
			 "NumeroNodi": 5,
			 "NumeroArchi": 0,
			 "children": [
			 ]},
			{"Node": 3527,
			 "Coreness": 3,
			 "minCoreness":  3,
			 "maxCoreness": 3,
			 "NumeroNodi": 5,
			 "NumeroArchi": 0,
			 "children": [
			 ]},
			{"Node": 3526,
			 "Coreness": 3,
			 "minCoreness":  3,
			 "maxCoreness": 3,
			 "NumeroNodi": 5,
			 "NumeroArchi": 0,
			 "children": [
			 ]},
			{"Node": 3525,
			 "Coreness": 3,
			 "minCoreness":  3,
			 "maxCoreness": 3,
			 "NumeroNodi": 7,
			 "NumeroArchi": 0,
			 "children": [
			 ]},
			{"Node": 3524,
			 "Coreness": 3,
			 "minCoreness":  3,
			 "maxCoreness": 3,
			 "NumeroNodi": 4,
			 "NumeroArchi": 0,
			 "children": [
			 ]},
			{"Node": 3523,
			 "Coreness": 3,
			 "minCoreness":  3,
			 "maxCoreness": 3,
			 "NumeroNodi": 5,
			 "NumeroArchi": 0,
			 "children": [
			 ]},
			{"Node": 3522,
			 "Coreness": 3,
			 "minCoreness":  3,
			 "maxCoreness": 3,
			 "NumeroNodi": 5,
			 "NumeroArchi": 0,
			 "children": [
			 ]},
			{"Node": 3502,
			 "Coreness": 3,
			 "minCoreness":  3,
			 "maxCoreness": 3,
			 "NumeroNodi": 5,
			 "NumeroArchi": 0,
			 "children": [
			 ]},
			{"Node": 3520,
			 "Coreness": 3,
			 "minCoreness":  3,
			 "maxCoreness": 3,
			 "NumeroNodi": 5,
			 "NumeroArchi": 0,
			 "children": [
			 ]},
			{"Node": 3517,
			 "Coreness": 3,
			 "minCoreness":  3,
			 "maxCoreness": 3,
			 "NumeroNodi": 5,
			 "NumeroArchi": 0,
			 "children": [
			 ]},
			{"Node": 3516,
			 "Coreness": 3,
			 "minCoreness":  3,
			 "maxCoreness": 3,
			 "NumeroNodi": 5,
			 "NumeroArchi": 0,
			 "children": [
			 ]},
			{"Node": 3507,
			 "Coreness": 3,
			 "minCoreness":  3,
			 "maxCoreness": 3,
			 "NumeroNodi": 6,
			 "NumeroArchi": 0,
			 "children": [
			 ]},
			{"Node": 3501,
			 "Coreness": 3,
			 "minCoreness":  3,
			 "maxCoreness": 3,
			 "NumeroNodi": 5,
			 "NumeroArchi": 0,
			 "children": [
			 ]},
			{"Node": 3521,
			 "Coreness": 3,
			 "minCoreness":  3,
			 "maxCoreness": 3,
			 "NumeroNodi": 5,
			 "NumeroArchi": 0,
			 "children": [
			 ]},
			{"Node": 3509,
			 "Coreness": 3,
			 "minCoreness":  3,
			 "maxCoreness": 3,
			 "NumeroNodi": 5,
			 "NumeroArchi": 0,
			 "children": [
			 ]},
			{"Node": 3519,
			 "Coreness": 3,
			 "minCoreness":  3,
			 "maxCoreness": 3,
			 "NumeroNodi": 5,
			 "NumeroArchi": 0,
			 "children": [
			 ]},
			{"Node": 3518,
			 "Coreness": 3,
			 "minCoreness":  3,
			 "maxCoreness": 3,
			 "NumeroNodi": 5,
			 "NumeroArchi": 0,
			 "children": [
			 ]},
			{"Node": 3511,
			 "Coreness": 3,
			 "minCoreness":  3,
			 "maxCoreness": 3,
			 "NumeroNodi": 5,
			 "NumeroArchi": 0,
			 "children": [
			 ]},
			{"Node": 3515,
			 "Coreness": 3,
			 "minCoreness":  3,
			 "maxCoreness": 3,
			 "NumeroNodi": 8,
			 "NumeroArchi": 0,
			 "children": [
			 ]},
			{"Node": 3514,
			 "Coreness": 3,
			 "minCoreness":  3,
			 "maxCoreness": 3,
			 "NumeroNodi": 5,
			 "NumeroArchi": 0,
			 "children": [
			 ]},
			{"Node": 3513,
			 "Coreness": 3,
			 "minCoreness":  3,
			 "maxCoreness": 3,
			 "NumeroNodi": 5,
			 "NumeroArchi": 0,
			 "children": [
			 ]},
			{"Node": 3512,
			 "Coreness": 3,
			 "minCoreness":  3,
			 "maxCoreness": 3,
			 "NumeroNodi": 4,
			 "NumeroArchi": 0,
			 "children": [
			 ]},
			{"Node": 3508,
			 "Coreness": 3,
			 "minCoreness":  3,
			 "maxCoreness": 3,
			 "NumeroNodi": 4,
			 "NumeroArchi": 0,
			 "children": [
			 ]},
			{"Node": 3506,
			 "Coreness": 3,
			 "minCoreness":  3,
			 "maxCoreness": 3,
			 "NumeroNodi": 5,
			 "NumeroArchi": 0,
			 "children": [
			 ]},
			{"Node": 3505,
			 "Coreness": 3,
			 "minCoreness":  3,
			 "maxCoreness": 3,
			 "NumeroNodi": 5,
			 "NumeroArchi": 0,
			 "children": [
			 ]},
			{"Node": 3504,
			 "Coreness": 3,
			 "minCoreness":  3,
			 "maxCoreness": 3,
			 "NumeroNodi": 6,
			 "NumeroArchi": 0,
			 "children": [
			 ]},
			{"Node": 3510,
			 "Coreness": 3,
			 "minCoreness":  3,
			 "maxCoreness": 3,
			 "NumeroNodi": 8,
			 "NumeroArchi": 0,
			 "children": [
			 ]},
			{"Node": 3499,
			 "Coreness": 3,
			 "minCoreness":  3,
			 "maxCoreness": 3,
			 "NumeroNodi": 36,
			 "NumeroArchi": 0,
			 "children": [
			 ]},
			{"Node": 3503,
			 "Coreness": 3,
			 "minCoreness":  3,
			 "maxCoreness": 3,
			 "NumeroNodi": 5,
			 "NumeroArchi": 0,
			 "children": [
			 ]},
			{"Node": 3498,
			 "Coreness": 3,
			 "minCoreness":  3,
			 "maxCoreness": 3,
			 "NumeroNodi": 10,
			 "NumeroArchi": 0,
			 "children": [
			 ]},
			{"Node": 3497,
			 "Coreness": 3,
			 "minCoreness":  3,
			 "maxCoreness": 3,
			 "NumeroNodi": 5,
			 "NumeroArchi": 0,
			 "children": [
			 ]},
			{"Node": 3496,
			 "Coreness": 3,
			 "minCoreness":  3,
			 "maxCoreness": 3,
			 "NumeroNodi": 5,
			 "NumeroArchi": 0,
			 "children": [
			 ]},
			{"Node": 3495,
			 "Coreness": 3,
			 "minCoreness":  3,
			 "maxCoreness": 3,
			 "NumeroNodi": 5,
			 "NumeroArchi": 0,
			 "children": [
			 ]},
			{"Node": 3494,
			 "Coreness": 3,
			 "minCoreness":  3,
			 "maxCoreness": 3,
			 "NumeroNodi": 5,
			 "NumeroArchi": 0,
			 "children": [
			 ]},
			{"Node": 3492,
			 "Coreness": 3,
			 "minCoreness":  3,
			 "maxCoreness": 3,
			 "NumeroNodi": 23,
			 "NumeroArchi": 0,
			 "children": [
			 ]},
			{"Node": 3493,
			 "Coreness": 3,
			 "minCoreness":  3,
			 "maxCoreness": 3,
			 "NumeroNodi": 23,
			 "NumeroArchi": 0,
			 "children": [
			 ]},
			{"Node": 3491,
			 "Coreness": 3,
			 "minCoreness":  3,
			 "maxCoreness": 3,
			 "NumeroNodi": 5,
			 "NumeroArchi": 0,
			 "children": [
			 ]},
			{"Node": 3490,
			 "Coreness": 3,
			 "minCoreness":  3,
			 "maxCoreness": 3,
			 "NumeroNodi": 5,
			 "NumeroArchi": 0,
			 "children": [
			 ]},
			{"Node": 3487,
			 "Coreness": 3,
			 "minCoreness":  3,
			 "maxCoreness": 3,
			 "NumeroNodi": 5,
			 "NumeroArchi": 0,
			 "children": [
			 ]},
			{"Node": 3489,
			 "Coreness": 3,
			 "minCoreness":  3,
			 "maxCoreness": 3,
			 "NumeroNodi": 6,
			 "NumeroArchi": 0,
			 "children": [
			 ]},
			{"Node": 3488,
			 "Coreness": 3,
			 "minCoreness":  3,
			 "maxCoreness": 3,
			 "NumeroNodi": 9,
			 "NumeroArchi": 0,
			 "children": [
			 ]},
			{"Node": 3486,
			 "Coreness": 3,
			 "minCoreness":  3,
			 "maxCoreness": 3,
			 "NumeroNodi": 6,
			 "NumeroArchi": 0,
			 "children": [
			 ]},
			{"Node": 3485,
			 "Coreness": 3,
			 "minCoreness":  3,
			 "maxCoreness": 3,
			 "NumeroNodi": 5,
			 "NumeroArchi": 0,
			 "children": [
			 ]},
			{"Node": 3484,
			 "Coreness": 3,
			 "minCoreness":  3,
			 "maxCoreness": 3,
			 "NumeroNodi": 5,
			 "NumeroArchi": 0,
			 "children": [
			 ]},
			{"Node": 3483,
			 "Coreness": 3,
			 "minCoreness":  3,
			 "maxCoreness": 3,
			 "NumeroNodi": 5,
			 "NumeroArchi": 0,
			 "children": [
			 ]},
			{"Node": 3482,
			 "Coreness": 3,
			 "minCoreness":  3,
			 "maxCoreness": 3,
			 "NumeroNodi": 5,
			 "NumeroArchi": 0,
			 "children": [
			 ]},
			{"Node": 3481,
			 "Coreness": 3,
			 "minCoreness":  3,
			 "maxCoreness": 3,
			 "NumeroNodi": 5,
			 "NumeroArchi": 0,
			 "children": [
			 ]},
			{"Node": 3479,
			 "Coreness": 3,
			 "minCoreness":  3,
			 "maxCoreness": 3,
			 "NumeroNodi": 5,
			 "NumeroArchi": 0,
			 "children": [
			 ]},
			{"Node": 3480,
			 "Coreness": 3,
			 "minCoreness":  3,
			 "maxCoreness": 3,
			 "NumeroNodi": 4,
			 "NumeroArchi": 0,
			 "children": [
			 ]},
			{"Node": 3478,
			 "Coreness": 3,
			 "minCoreness":  3,
			 "maxCoreness": 3,
			 "NumeroNodi": 5,
			 "NumeroArchi": 0,
			 "children": [
			 ]},
			{"Node": 3477,
			 "Coreness": 3,
			 "minCoreness":  3,
			 "maxCoreness": 3,
			 "NumeroNodi": 23,
			 "NumeroArchi": 0,
			 "children": [
			 ]},
			{"Node": 3476,
			 "Coreness": 3,
			 "minCoreness":  3,
			 "maxCoreness": 3,
			 "NumeroNodi": 4,
			 "NumeroArchi": 0,
			 "children": [
			 ]},
			{"Node": 3475,
			 "Coreness": 3,
			 "minCoreness":  3,
			 "maxCoreness": 3,
			 "NumeroNodi": 14,
			 "NumeroArchi": 0,
			 "children": [
			 ]},
			{"Node": 3474,
			 "Coreness": 3,
			 "minCoreness":  3,
			 "maxCoreness": 3,
			 "NumeroNodi": 5,
			 "NumeroArchi": 0,
			 "children": [
			 ]},
			{"Node": 3473,
			 "Coreness": 3,
			 "minCoreness":  3,
			 "maxCoreness": 3,
			 "NumeroNodi": 5,
			 "NumeroArchi": 0,
			 "children": [
			 ]},
			{"Node": 3472,
			 "Coreness": 3,
			 "minCoreness":  3,
			 "maxCoreness": 3,
			 "NumeroNodi": 5,
			 "NumeroArchi": 0,
			 "children": [
			 ]},
			{"Node": 3469,
			 "Coreness": 3,
			 "minCoreness":  3,
			 "maxCoreness": 3,
			 "NumeroNodi": 4,
			 "NumeroArchi": 0,
			 "children": [
			 ]},
			{"Node": 3471,
			 "Coreness": 3,
			 "minCoreness":  3,
			 "maxCoreness": 3,
			 "NumeroNodi": 10,
			 "NumeroArchi": 0,
			 "children": [
			 ]},
			{"Node": 3470,
			 "Coreness": 3,
			 "minCoreness":  3,
			 "maxCoreness": 3,
			 "NumeroNodi": 4,
			 "NumeroArchi": 0,
			 "children": [
			 ]},
			{"Node": 3468,
			 "Coreness": 3,
			 "minCoreness":  3,
			 "maxCoreness": 3,
			 "NumeroNodi": 5,
			 "NumeroArchi": 0,
			 "children": [
			 ]},
			{"Node": 3467,
			 "Coreness": 3,
			 "minCoreness":  3,
			 "maxCoreness": 3,
			 "NumeroNodi": 5,
			 "NumeroArchi": 0,
			 "children": [
			 ]},
			{"Node": 3466,
			 "Coreness": 3,
			 "minCoreness":  3,
			 "maxCoreness": 3,
			 "NumeroNodi": 6,
			 "NumeroArchi": 0,
			 "children": [
			 ]},
			{"Node": 3465,
			 "Coreness": 3,
			 "minCoreness":  3,
			 "maxCoreness": 3,
			 "NumeroNodi": 8,
			 "NumeroArchi": 0,
			 "children": [
			 ]},
			{"Node": 3464,
			 "Coreness": 3,
			 "minCoreness":  3,
			 "maxCoreness": 3,
			 "NumeroNodi": 5,
			 "NumeroArchi": 0,
			 "children": [
			 ]},
			{"Node": 3463,
			 "Coreness": 3,
			 "minCoreness":  3,
			 "maxCoreness": 3,
			 "NumeroNodi": 10,
			 "NumeroArchi": 0,
			 "children": [
			 ]},
			{"Node": 3461,
			 "Coreness": 3,
			 "minCoreness":  3,
			 "maxCoreness": 3,
			 "NumeroNodi": 5,
			 "NumeroArchi": 0,
			 "children": [
			 ]},
			{"Node": 3460,
			 "Coreness": 3,
			 "minCoreness":  3,
			 "maxCoreness": 3,
			 "NumeroNodi": 5,
			 "NumeroArchi": 0,
			 "children": [
			 ]},
			{"Node": 3459,
			 "Coreness": 3,
			 "minCoreness":  3,
			 "maxCoreness": 3,
			 "NumeroNodi": 8,
			 "NumeroArchi": 0,
			 "children": [
			 ]},
			{"Node": 3458,
			 "Coreness": 3,
			 "minCoreness":  3,
			 "maxCoreness": 3,
			 "NumeroNodi": 5,
			 "NumeroArchi": 0,
			 "children": [
			 ]},
			{"Node": 3457,
			 "Coreness": 3,
			 "minCoreness":  3,
			 "maxCoreness": 3,
			 "NumeroNodi": 5,
			 "NumeroArchi": 0,
			 "children": [
			 ]},
			{"Node": 3456,
			 "Coreness": 3,
			 "minCoreness":  3,
			 "maxCoreness": 3,
			 "NumeroNodi": 4,
			 "NumeroArchi": 0,
			 "children": [
			 ]},
			{"Node": 3455,
			 "Coreness": 3,
			 "minCoreness":  3,
			 "maxCoreness": 3,
			 "NumeroNodi": 5,
			 "NumeroArchi": 0,
			 "children": [
			 ]},
			{"Node": 3453,
			 "Coreness": 3,
			 "minCoreness":  3,
			 "maxCoreness": 3,
			 "NumeroNodi": 4,
			 "NumeroArchi": 0,
			 "children": [
			 ]},
			{"Node": 3452,
			 "Coreness": 3,
			 "minCoreness":  3,
			 "maxCoreness": 3,
			 "NumeroNodi": 4,
			 "NumeroArchi": 0,
			 "children": [
			 ]},
			{"Node": 3451,
			 "Coreness": 3,
			 "minCoreness":  3,
			 "maxCoreness": 3,
			 "NumeroNodi": 5,
			 "NumeroArchi": 0,
			 "children": [
			 ]},
			{"Node": 3454,
			 "Coreness": 3,
			 "minCoreness":  3,
			 "maxCoreness": 3,
			 "NumeroNodi": 5,
			 "NumeroArchi": 0,
			 "children": [
			 ]},
			{"Node": 3449,
			 "Coreness": 3,
			 "minCoreness":  3,
			 "maxCoreness": 3,
			 "NumeroNodi": 5,
			 "NumeroArchi": 0,
			 "children": [
			 ]},
			{"Node": 3450,
			 "Coreness": 3,
			 "minCoreness":  3,
			 "maxCoreness": 3,
			 "NumeroNodi": 4,
			 "NumeroArchi": 0,
			 "children": [
			 ]},
			{"Node": 3448,
			 "Coreness": 3,
			 "minCoreness":  3,
			 "maxCoreness": 3,
			 "NumeroNodi": 8,
			 "NumeroArchi": 0,
			 "children": [
			 ]},
			{"Node": 3446,
			 "Coreness": 3,
			 "minCoreness":  3,
			 "maxCoreness": 3,
			 "NumeroNodi": 5,
			 "NumeroArchi": 0,
			 "children": [
			 ]},
			{"Node": 3447,
			 "Coreness": 3,
			 "minCoreness":  3,
			 "maxCoreness": 3,
			 "NumeroNodi": 5,
			 "NumeroArchi": 0,
			 "children": [
			 ]},
			{"Node": 3445,
			 "Coreness": 3,
			 "minCoreness":  3,
			 "maxCoreness": 3,
			 "NumeroNodi": 6,
			 "NumeroArchi": 0,
			 "children": [
			 ]},
			{"Node": 3408,
			 "Coreness": 3,
			 "minCoreness":  3,
			 "maxCoreness": 3,
			 "NumeroNodi": 4,
			 "NumeroArchi": 0,
			 "children": [
			 ]},
			{"Node": 3407,
			 "Coreness": 3,
			 "minCoreness":  3,
			 "maxCoreness": 3,
			 "NumeroNodi": 6,
			 "NumeroArchi": 0,
			 "children": [
			 ]},
			{"Node": 3444,
			 "Coreness": 3,
			 "minCoreness":  3,
			 "maxCoreness": 3,
			 "NumeroNodi": 5,
			 "NumeroArchi": 0,
			 "children": [
			 ]},
			{"Node": 3443,
			 "Coreness": 3,
			 "minCoreness":  3,
			 "maxCoreness": 3,
			 "NumeroNodi": 4,
			 "NumeroArchi": 0,
			 "children": [
			 ]},
			{"Node": 3442,
			 "Coreness": 3,
			 "minCoreness":  3,
			 "maxCoreness": 3,
			 "NumeroNodi": 5,
			 "NumeroArchi": 0,
			 "children": [
			 ]},
			{"Node": 3441,
			 "Coreness": 3,
			 "minCoreness":  3,
			 "maxCoreness": 3,
			 "NumeroNodi": 5,
			 "NumeroArchi": 0,
			 "children": [
			 ]},
			{"Node": 3436,
			 "Coreness": 3,
			 "minCoreness":  3,
			 "maxCoreness": 3,
			 "NumeroNodi": 6,
			 "NumeroArchi": 0,
			 "children": [
			 ]},
			{"Node": 3437,
			 "Coreness": 3,
			 "minCoreness":  3,
			 "maxCoreness": 3,
			 "NumeroNodi": 4,
			 "NumeroArchi": 0,
			 "children": [
			 ]},
			{"Node": 3406,
			 "Coreness": 3,
			 "minCoreness":  3,
			 "maxCoreness": 3,
			 "NumeroNodi": 5,
			 "NumeroArchi": 0,
			 "children": [
			 ]},
			{"Node": 3405,
			 "Coreness": 3,
			 "minCoreness":  3,
			 "maxCoreness": 3,
			 "NumeroNodi": 9,
			 "NumeroArchi": 0,
			 "children": [
			 ]},
			{"Node": 3404,
			 "Coreness": 3,
			 "minCoreness":  3,
			 "maxCoreness": 3,
			 "NumeroNodi": 19,
			 "NumeroArchi": 0,
			 "children": [
			 ]},
			{"Node": 3440,
			 "Coreness": 3,
			 "minCoreness":  3,
			 "maxCoreness": 3,
			 "NumeroNodi": 11,
			 "NumeroArchi": 0,
			 "children": [
			 ]},
			{"Node": 3403,
			 "Coreness": 3,
			 "minCoreness":  3,
			 "maxCoreness": 3,
			 "NumeroNodi": 8,
			 "NumeroArchi": 0,
			 "children": [
			 ]},
			{"Node": 3439,
			 "Coreness": 3,
			 "minCoreness":  3,
			 "maxCoreness": 3,
			 "NumeroNodi": 4,
			 "NumeroArchi": 0,
			 "children": [
			 ]},
			{"Node": 3402,
			 "Coreness": 3,
			 "minCoreness":  3,
			 "maxCoreness": 3,
			 "NumeroNodi": 5,
			 "NumeroArchi": 0,
			 "children": [
			 ]},
			{"Node": 3438,
			 "Coreness": 3,
			 "minCoreness":  3,
			 "maxCoreness": 3,
			 "NumeroNodi": 5,
			 "NumeroArchi": 0,
			 "children": [
			 ]},
			{"Node": 3401,
			 "Coreness": 3,
			 "minCoreness":  3,
			 "maxCoreness": 3,
			 "NumeroNodi": 5,
			 "NumeroArchi": 0,
			 "children": [
			 ]},
			{"Node": 3400,
			 "Coreness": 3,
			 "minCoreness":  3,
			 "maxCoreness": 3,
			 "NumeroNodi": 5,
			 "NumeroArchi": 0,
			 "children": [
			 ]},
			{"Node": 3399,
			 "Coreness": 3,
			 "minCoreness":  3,
			 "maxCoreness": 3,
			 "NumeroNodi": 5,
			 "NumeroArchi": 0,
			 "children": [
			 ]},
			{"Node": 3435,
			 "Coreness": 3,
			 "minCoreness":  3,
			 "maxCoreness": 3,
			 "NumeroNodi": 8,
			 "NumeroArchi": 0,
			 "children": [
			 ]},
			{"Node": 3434,
			 "Coreness": 3,
			 "minCoreness":  3,
			 "maxCoreness": 3,
			 "NumeroNodi": 5,
			 "NumeroArchi": 0,
			 "children": [
			 ]},
			{"Node": 3433,
			 "Coreness": 3,
			 "minCoreness":  3,
			 "maxCoreness": 3,
			 "NumeroNodi": 5,
			 "NumeroArchi": 0,
			 "children": [
			 ]},
			{"Node": 3395,
			 "Coreness": 3,
			 "minCoreness":  3,
			 "maxCoreness": 3,
			 "NumeroNodi": 5,
			 "NumeroArchi": 0,
			 "children": [
			 ]},
			{"Node": 3389,
			 "Coreness": 3,
			 "minCoreness":  3,
			 "maxCoreness": 3,
			 "NumeroNodi": 10,
			 "NumeroArchi": 0,
			 "children": [
			 ]},
			{"Node": 3386,
			 "Coreness": 3,
			 "minCoreness":  3,
			 "maxCoreness": 3,
			 "NumeroNodi": 6,
			 "NumeroArchi": 0,
			 "children": [
			 ]},
			{"Node": 3385,
			 "Coreness": 3,
			 "minCoreness":  3,
			 "maxCoreness": 3,
			 "NumeroNodi": 7,
			 "NumeroArchi": 0,
			 "children": [
			 ]},
			{"Node": 3398,
			 "Coreness": 3,
			 "minCoreness":  3,
			 "maxCoreness": 3,
			 "NumeroNodi": 4,
			 "NumeroArchi": 0,
			 "children": [
			 ]},
			{"Node": 3397,
			 "Coreness": 3,
			 "minCoreness":  3,
			 "maxCoreness": 3,
			 "NumeroNodi": 4,
			 "NumeroArchi": 0,
			 "children": [
			 ]},
			{"Node": 3432,
			 "Coreness": 3,
			 "minCoreness":  3,
			 "maxCoreness": 3,
			 "NumeroNodi": 5,
			 "NumeroArchi": 0,
			 "children": [
			 ]},
			{"Node": 3431,
			 "Coreness": 3,
			 "minCoreness":  3,
			 "maxCoreness": 3,
			 "NumeroNodi": 4,
			 "NumeroArchi": 0,
			 "children": [
			 ]},
			{"Node": 3396,
			 "Coreness": 3,
			 "minCoreness":  3,
			 "maxCoreness": 3,
			 "NumeroNodi": 4,
			 "NumeroArchi": 0,
			 "children": [
			 ]},
			{"Node": 3430,
			 "Coreness": 3,
			 "minCoreness":  3,
			 "maxCoreness": 3,
			 "NumeroNodi": 6,
			 "NumeroArchi": 0,
			 "children": [
			 ]},
			{"Node": 3429,
			 "Coreness": 3,
			 "minCoreness":  3,
			 "maxCoreness": 3,
			 "NumeroNodi": 5,
			 "NumeroArchi": 0,
			 "children": [
			 ]},
			{"Node": 3428,
			 "Coreness": 3,
			 "minCoreness":  3,
			 "maxCoreness": 3,
			 "NumeroNodi": 5,
			 "NumeroArchi": 0,
			 "children": [
			 ]},
			{"Node": 3391,
			 "Coreness": 3,
			 "minCoreness":  3,
			 "maxCoreness": 3,
			 "NumeroNodi": 16,
			 "NumeroArchi": 0,
			 "children": [
			 ]},
			{"Node": 3427,
			 "Coreness": 3,
			 "minCoreness":  3,
			 "maxCoreness": 3,
			 "NumeroNodi": 5,
			 "NumeroArchi": 0,
			 "children": [
			 ]},
			{"Node": 3394,
			 "Coreness": 3,
			 "minCoreness":  3,
			 "maxCoreness": 3,
			 "NumeroNodi": 6,
			 "NumeroArchi": 0,
			 "children": [
			 ]},
			{"Node": 3393,
			 "Coreness": 3,
			 "minCoreness":  3,
			 "maxCoreness": 3,
			 "NumeroNodi": 5,
			 "NumeroArchi": 0,
			 "children": [
			 ]},
			{"Node": 3392,
			 "Coreness": 3,
			 "minCoreness":  3,
			 "maxCoreness": 3,
			 "NumeroNodi": 7,
			 "NumeroArchi": 0,
			 "children": [
			 ]},
			{"Node": 3426,
			 "Coreness": 3,
			 "minCoreness":  3,
			 "maxCoreness": 3,
			 "NumeroNodi": 13,
			 "NumeroArchi": 0,
			 "children": [
			 ]},
			{"Node": 3363,
			 "Coreness": 3,
			 "minCoreness":  3,
			 "maxCoreness": 3,
			 "NumeroNodi": 6,
			 "NumeroArchi": 0,
			 "children": [
			 ]},
			{"Node": 3425,
			 "Coreness": 3,
			 "minCoreness":  3,
			 "maxCoreness": 3,
			 "NumeroNodi": 5,
			 "NumeroArchi": 0,
			 "children": [
			 ]},
			{"Node": 3384,
			 "Coreness": 3,
			 "minCoreness":  3,
			 "maxCoreness": 3,
			 "NumeroNodi": 4,
			 "NumeroArchi": 0,
			 "children": [
			 ]},
			{"Node": 3387,
			 "Coreness": 3,
			 "minCoreness":  3,
			 "maxCoreness": 3,
			 "NumeroNodi": 10,
			 "NumeroArchi": 0,
			 "children": [
			 ]},
			{"Node": 3261,
			 "Coreness": 3,
			 "minCoreness":  3,
			 "maxCoreness": 3,
			 "NumeroNodi": 5,
			 "NumeroArchi": 0,
			 "children": [
			 ]},
			{"Node": 3260,
			 "Coreness": 3,
			 "minCoreness":  3,
			 "maxCoreness": 3,
			 "NumeroNodi": 5,
			 "NumeroArchi": 0,
			 "children": [
			 ]},
			{"Node": 3252,
			 "Coreness": 3,
			 "minCoreness":  3,
			 "maxCoreness": 3,
			 "NumeroNodi": 5,
			 "NumeroArchi": 0,
			 "children": [
			 ]},
			{"Node": 3259,
			 "Coreness": 3,
			 "minCoreness":  3,
			 "maxCoreness": 3,
			 "NumeroNodi": 10,
			 "NumeroArchi": 0,
			 "children": [
			 ]},
			{"Node": 3258,
			 "Coreness": 3,
			 "minCoreness":  3,
			 "maxCoreness": 3,
			 "NumeroNodi": 5,
			 "NumeroArchi": 0,
			 "children": [
			 ]},
			{"Node": 3257,
			 "Coreness": 3,
			 "minCoreness":  3,
			 "maxCoreness": 3,
			 "NumeroNodi": 5,
			 "NumeroArchi": 0,
			 "children": [
			 ]},
			{"Node": 3251,
			 "Coreness": 3,
			 "minCoreness":  3,
			 "maxCoreness": 3,
			 "NumeroNodi": 10,
			 "NumeroArchi": 0,
			 "children": [
			 ]},
			{"Node": 3255,
			 "Coreness": 3,
			 "minCoreness":  3,
			 "maxCoreness": 3,
			 "NumeroNodi": 5,
			 "NumeroArchi": 0,
			 "children": [
			 ]},
			{"Node": 3424,
			 "Coreness": 3,
			 "minCoreness":  3,
			 "maxCoreness": 3,
			 "NumeroNodi": 5,
			 "NumeroArchi": 0,
			 "children": [
			 ]},
			{"Node": 3423,
			 "Coreness": 3,
			 "minCoreness":  3,
			 "maxCoreness": 3,
			 "NumeroNodi": 4,
			 "NumeroArchi": 0,
			 "children": [
			 ]},
			{"Node": 3254,
			 "Coreness": 3,
			 "minCoreness":  3,
			 "maxCoreness": 3,
			 "NumeroNodi": 5,
			 "NumeroArchi": 0,
			 "children": [
			 ]},
			{"Node": 3253,
			 "Coreness": 3,
			 "minCoreness":  3,
			 "maxCoreness": 3,
			 "NumeroNodi": 5,
			 "NumeroArchi": 0,
			 "children": [
			 ]},
			{"Node": 3353,
			 "Coreness": 3,
			 "minCoreness":  3,
			 "maxCoreness": 3,
			 "NumeroNodi": 5,
			 "NumeroArchi": 0,
			 "children": [
			 ]},
			{"Node": 3422,
			 "Coreness": 3,
			 "minCoreness":  3,
			 "maxCoreness": 3,
			 "NumeroNodi": 5,
			 "NumeroArchi": 0,
			 "children": [
			 ]},
			{"Node": 3362,
			 "Coreness": 3,
			 "minCoreness":  3,
			 "maxCoreness": 3,
			 "NumeroNodi": 10,
			 "NumeroArchi": 0,
			 "children": [
			 ]},
			{"Node": 3249,
			 "Coreness": 3,
			 "minCoreness":  3,
			 "maxCoreness": 3,
			 "NumeroNodi": 9,
			 "NumeroArchi": 0,
			 "children": [
			 ]},
			{"Node": 3248,
			 "Coreness": 3,
			 "minCoreness":  3,
			 "maxCoreness": 3,
			 "NumeroNodi": 8,
			 "NumeroArchi": 0,
			 "children": [
			 ]},
			{"Node": 3239,
			 "Coreness": 3,
			 "minCoreness":  3,
			 "maxCoreness": 3,
			 "NumeroNodi": 5,
			 "NumeroArchi": 0,
			 "children": [
			 ]},
			{"Node": 3247,
			 "Coreness": 3,
			 "minCoreness":  3,
			 "maxCoreness": 3,
			 "NumeroNodi": 5,
			 "NumeroArchi": 0,
			 "children": [
			 ]},
			{"Node": 3360,
			 "Coreness": 3,
			 "minCoreness":  3,
			 "maxCoreness": 3,
			 "NumeroNodi": 6,
			 "NumeroArchi": 0,
			 "children": [
			 ]},
			{"Node": 3245,
			 "Coreness": 3,
			 "minCoreness":  3,
			 "maxCoreness": 3,
			 "NumeroNodi": 8,
			 "NumeroArchi": 0,
			 "children": [
			 ]},
			{"Node": 3237,
			 "Coreness": 3,
			 "minCoreness":  3,
			 "maxCoreness": 3,
			 "NumeroNodi": 16,
			 "NumeroArchi": 0,
			 "children": [
			 ]},
			{"Node": 3236,
			 "Coreness": 3,
			 "minCoreness":  3,
			 "maxCoreness": 3,
			 "NumeroNodi": 6,
			 "NumeroArchi": 0,
			 "children": [
			 ]},
			{"Node": 3235,
			 "Coreness": 3,
			 "minCoreness":  3,
			 "maxCoreness": 3,
			 "NumeroNodi": 7,
			 "NumeroArchi": 0,
			 "children": [
			 ]},
			{"Node": 3246,
			 "Coreness": 3,
			 "minCoreness":  3,
			 "maxCoreness": 3,
			 "NumeroNodi": 4,
			 "NumeroArchi": 0,
			 "children": [
			 ]},
			{"Node": 3262,
			 "Coreness": 3,
			 "minCoreness":  3,
			 "maxCoreness": 3,
			 "NumeroNodi": 16,
			 "NumeroArchi": 0,
			 "children": [
			 ]},
			{"Node": 3238,
			 "Coreness": 3,
			 "minCoreness":  3,
			 "maxCoreness": 3,
			 "NumeroNodi": 5,
			 "NumeroArchi": 0,
			 "children": [
			 ]},
			{"Node": 3243,
			 "Coreness": 3,
			 "minCoreness":  3,
			 "maxCoreness": 3,
			 "NumeroNodi": 5,
			 "NumeroArchi": 0,
			 "children": [
			 ]},
			{"Node": 3084,
			 "Coreness": 3,
			 "minCoreness":  3,
			 "maxCoreness": 3,
			 "NumeroNodi": 5,
			 "NumeroArchi": 0,
			 "children": [
			 ]},
			{"Node": 3244,
			 "Coreness": 3,
			 "minCoreness":  3,
			 "maxCoreness": 3,
			 "NumeroNodi": 5,
			 "NumeroArchi": 0,
			 "children": [
			 ]},
			{"Node": 3241,
			 "Coreness": 3,
			 "minCoreness":  3,
			 "maxCoreness": 3,
			 "NumeroNodi": 5,
			 "NumeroArchi": 0,
			 "children": [
			 ]},
			{"Node": 3359,
			 "Coreness": 3,
			 "minCoreness":  3,
			 "maxCoreness": 3,
			 "NumeroNodi": 5,
			 "NumeroArchi": 0,
			 "children": [
			 ]},
			{"Node": 3421,
			 "Coreness": 3,
			 "minCoreness":  3,
			 "maxCoreness": 3,
			 "NumeroNodi": 5,
			 "NumeroArchi": 0,
			 "children": [
			 ]},
			{"Node": 3240,
			 "Coreness": 3,
			 "minCoreness":  3,
			 "maxCoreness": 3,
			 "NumeroNodi": 4,
			 "NumeroArchi": 0,
			 "children": [
			 ]},
			{"Node": 3264,
			 "Coreness": 3,
			 "minCoreness":  3,
			 "maxCoreness": 3,
			 "NumeroNodi": 4,
			 "NumeroArchi": 0,
			 "children": [
			 ]},
			{"Node": 3420,
			 "Coreness": 3,
			 "minCoreness":  3,
			 "maxCoreness": 3,
			 "NumeroNodi": 5,
			 "NumeroArchi": 0,
			 "children": [
			 ]},
			{"Node": 3242,
			 "Coreness": 3,
			 "minCoreness":  3,
			 "maxCoreness": 3,
			 "NumeroNodi": 5,
			 "NumeroArchi": 0,
			 "children": [
			 ]},
			{"Node": 3419,
			 "Coreness": 3,
			 "minCoreness":  3,
			 "maxCoreness": 3,
			 "NumeroNodi": 7,
			 "NumeroArchi": 0,
			 "children": [
			 ]},
			{"Node": 3082,
			 "Coreness": 3,
			 "minCoreness":  3,
			 "maxCoreness": 3,
			 "NumeroNodi": 5,
			 "NumeroArchi": 0,
			 "children": [
			 ]},
			{"Node": 3083,
			 "Coreness": 3,
			 "minCoreness":  3,
			 "maxCoreness": 3,
			 "NumeroNodi": 5,
			 "NumeroArchi": 0,
			 "children": [
			 ]},
			{"Node": 3358,
			 "Coreness": 3,
			 "minCoreness":  3,
			 "maxCoreness": 3,
			 "NumeroNodi": 6,
			 "NumeroArchi": 0,
			 "children": [
			 ]},
			{"Node": 3356,
			 "Coreness": 3,
			 "minCoreness":  3,
			 "maxCoreness": 3,
			 "NumeroNodi": 32,
			 "NumeroArchi": 0,
			 "children": [
			 ]},
			{"Node": 3355,
			 "Coreness": 3,
			 "minCoreness":  3,
			 "maxCoreness": 3,
			 "NumeroNodi": 8,
			 "NumeroArchi": 0,
			 "children": [
			 ]},
			{"Node": 3354,
			 "Coreness": 3,
			 "minCoreness":  3,
			 "maxCoreness": 3,
			 "NumeroNodi": 4,
			 "NumeroArchi": 0,
			 "children": [
			 ]},
			{"Node": 3418,
			 "Coreness": 3,
			 "minCoreness":  3,
			 "maxCoreness": 3,
			 "NumeroNodi": 9,
			 "NumeroArchi": 0,
			 "children": [
			 ]},
			{"Node": 3416,
			 "Coreness": 3,
			 "minCoreness":  3,
			 "maxCoreness": 3,
			 "NumeroNodi": 5,
			 "NumeroArchi": 0,
			 "children": [
			 ]},
			{"Node": 3415,
			 "Coreness": 3,
			 "minCoreness":  3,
			 "maxCoreness": 3,
			 "NumeroNodi": 5,
			 "NumeroArchi": 0,
			 "children": [
			 ]},
			{"Node": 3414,
			 "Coreness": 3,
			 "minCoreness":  3,
			 "maxCoreness": 3,
			 "NumeroNodi": 5,
			 "NumeroArchi": 0,
			 "children": [
			 ]},
			{"Node": 3413,
			 "Coreness": 3,
			 "minCoreness":  3,
			 "maxCoreness": 3,
			 "NumeroNodi": 4,
			 "NumeroArchi": 0,
			 "children": [
			 ]},
			{"Node": 3412,
			 "Coreness": 3,
			 "minCoreness":  3,
			 "maxCoreness": 3,
			 "NumeroNodi": 5,
			 "NumeroArchi": 0,
			 "children": [
			 ]},
			{"Node": 3411,
			 "Coreness": 3,
			 "minCoreness":  3,
			 "maxCoreness": 3,
			 "NumeroNodi": 5,
			 "NumeroArchi": 0,
			 "children": [
			 ]},
			{"Node": 3410,
			 "Coreness": 3,
			 "minCoreness":  3,
			 "maxCoreness": 3,
			 "NumeroNodi": 5,
			 "NumeroArchi": 0,
			 "children": [
			 ]},
			{"Node": 3409,
			 "Coreness": 3,
			 "minCoreness":  3,
			 "maxCoreness": 3,
			 "NumeroNodi": 5,
			 "NumeroArchi": 0,
			 "children": [
			 ]},
			{"Node": 3383,
			 "Coreness": 3,
			 "minCoreness":  3,
			 "maxCoreness": 3,
			 "NumeroNodi": 4,
			 "NumeroArchi": 0,
			 "children": [
			 ]},
			{"Node": 3382,
			 "Coreness": 3,
			 "minCoreness":  3,
			 "maxCoreness": 3,
			 "NumeroNodi": 6,
			 "NumeroArchi": 0,
			 "children": [
			 ]},
			{"Node": 3381,
			 "Coreness": 3,
			 "minCoreness":  3,
			 "maxCoreness": 3,
			 "NumeroNodi": 4,
			 "NumeroArchi": 0,
			 "children": [
			 ]},
			{"Node": 3380,
			 "Coreness": 3,
			 "minCoreness":  3,
			 "maxCoreness": 3,
			 "NumeroNodi": 28,
			 "NumeroArchi": 0,
			 "children": [
			 ]},
			{"Node": 3379,
			 "Coreness": 3,
			 "minCoreness":  3,
			 "maxCoreness": 3,
			 "NumeroNodi": 5,
			 "NumeroArchi": 0,
			 "children": [
			 ]},
			{"Node": 3378,
			 "Coreness": 3,
			 "minCoreness":  3,
			 "maxCoreness": 3,
			 "NumeroNodi": 5,
			 "NumeroArchi": 0,
			 "children": [
			 ]},
			{"Node": 3377,
			 "Coreness": 3,
			 "minCoreness":  3,
			 "maxCoreness": 3,
			 "NumeroNodi": 6,
			 "NumeroArchi": 0,
			 "children": [
			 ]},
			{"Node": 3376,
			 "Coreness": 3,
			 "minCoreness":  3,
			 "maxCoreness": 3,
			 "NumeroNodi": 5,
			 "NumeroArchi": 0,
			 "children": [
			 ]},
			{"Node": 3375,
			 "Coreness": 3,
			 "minCoreness":  3,
			 "maxCoreness": 3,
			 "NumeroNodi": 4,
			 "NumeroArchi": 0,
			 "children": [
			 ]},
			{"Node": 3374,
			 "Coreness": 3,
			 "minCoreness":  3,
			 "maxCoreness": 3,
			 "NumeroNodi": 5,
			 "NumeroArchi": 0,
			 "children": [
			 ]},
			{"Node": 3373,
			 "Coreness": 3,
			 "minCoreness":  3,
			 "maxCoreness": 3,
			 "NumeroNodi": 7,
			 "NumeroArchi": 0,
			 "children": [
			 ]},
			{"Node": 3372,
			 "Coreness": 3,
			 "minCoreness":  3,
			 "maxCoreness": 3,
			 "NumeroNodi": 21,
			 "NumeroArchi": 0,
			 "children": [
			 ]},
			{"Node": 3371,
			 "Coreness": 3,
			 "minCoreness":  3,
			 "maxCoreness": 3,
			 "NumeroNodi": 4,
			 "NumeroArchi": 0,
			 "children": [
			 ]},
			{"Node": 3370,
			 "Coreness": 3,
			 "minCoreness":  3,
			 "maxCoreness": 3,
			 "NumeroNodi": 5,
			 "NumeroArchi": 0,
			 "children": [
			 ]},
			{"Node": 3369,
			 "Coreness": 3,
			 "minCoreness":  3,
			 "maxCoreness": 3,
			 "NumeroNodi": 6,
			 "NumeroArchi": 0,
			 "children": [
			 ]},
			{"Node": 3368,
			 "Coreness": 3,
			 "minCoreness":  3,
			 "maxCoreness": 3,
			 "NumeroNodi": 10,
			 "NumeroArchi": 0,
			 "children": [
			 ]},
			{"Node": 3367,
			 "Coreness": 3,
			 "minCoreness":  3,
			 "maxCoreness": 3,
			 "NumeroNodi": 4,
			 "NumeroArchi": 0,
			 "children": [
			 ]},
			{"Node": 3365,
			 "Coreness": 3,
			 "minCoreness":  3,
			 "maxCoreness": 3,
			 "NumeroNodi": 4,
			 "NumeroArchi": 0,
			 "children": [
			 ]},
			{"Node": 3364,
			 "Coreness": 3,
			 "minCoreness":  3,
			 "maxCoreness": 3,
			 "NumeroNodi": 4,
			 "NumeroArchi": 0,
			 "children": [
			 ]},
			{"Node": 3366,
			 "Coreness": 3,
			 "minCoreness":  3,
			 "maxCoreness": 3,
			 "NumeroNodi": 5,
			 "NumeroArchi": 0,
			 "children": [
			 ]},
			{"Node": 3352,
			 "Coreness": 3,
			 "minCoreness":  3,
			 "maxCoreness": 3,
			 "NumeroNodi": 11,
			 "NumeroArchi": 0,
			 "children": [
			 ]},
			{"Node": 3351,
			 "Coreness": 3,
			 "minCoreness":  3,
			 "maxCoreness": 3,
			 "NumeroNodi": 5,
			 "NumeroArchi": 0,
			 "children": [
			 ]},
			{"Node": 3350,
			 "Coreness": 3,
			 "minCoreness":  3,
			 "maxCoreness": 3,
			 "NumeroNodi": 5,
			 "NumeroArchi": 0,
			 "children": [
			 ]},
			{"Node": 3349,
			 "Coreness": 3,
			 "minCoreness":  3,
			 "maxCoreness": 3,
			 "NumeroNodi": 5,
			 "NumeroArchi": 0,
			 "children": [
			 ]},
			{"Node": 3348,
			 "Coreness": 3,
			 "minCoreness":  3,
			 "maxCoreness": 3,
			 "NumeroNodi": 5,
			 "NumeroArchi": 0,
			 "children": [
			 ]},
			{"Node": 3347,
			 "Coreness": 3,
			 "minCoreness":  3,
			 "maxCoreness": 3,
			 "NumeroNodi": 5,
			 "NumeroArchi": 0,
			 "children": [
			 ]},
			{"Node": 3331,
			 "Coreness": 3,
			 "minCoreness":  3,
			 "maxCoreness": 3,
			 "NumeroNodi": 12,
			 "NumeroArchi": 0,
			 "children": [
			 ]},
			{"Node": 3330,
			 "Coreness": 3,
			 "minCoreness":  3,
			 "maxCoreness": 3,
			 "NumeroNodi": 5,
			 "NumeroArchi": 0,
			 "children": [
			 ]},
			{"Node": 3346,
			 "Coreness": 3,
			 "minCoreness":  3,
			 "maxCoreness": 3,
			 "NumeroNodi": 5,
			 "NumeroArchi": 0,
			 "children": [
			 ]},
			{"Node": 3345,
			 "Coreness": 3,
			 "minCoreness":  3,
			 "maxCoreness": 3,
			 "NumeroNodi": 4,
			 "NumeroArchi": 0,
			 "children": [
			 ]},
			{"Node": 3344,
			 "Coreness": 3,
			 "minCoreness":  3,
			 "maxCoreness": 3,
			 "NumeroNodi": 5,
			 "NumeroArchi": 0,
			 "children": [
			 ]},
			{"Node": 3148,
			 "Coreness": 3,
			 "minCoreness":  3,
			 "maxCoreness": 3,
			 "NumeroNodi": 5,
			 "NumeroArchi": 0,
			 "children": [
			 ]},
			{"Node": 3343,
			 "Coreness": 3,
			 "minCoreness":  3,
			 "maxCoreness": 3,
			 "NumeroNodi": 13,
			 "NumeroArchi": 0,
			 "children": [
			 ]},
			{"Node": 3341,
			 "Coreness": 3,
			 "minCoreness":  3,
			 "maxCoreness": 3,
			 "NumeroNodi": 5,
			 "NumeroArchi": 0,
			 "children": [
			 ]},
			{"Node": 3342,
			 "Coreness": 3,
			 "minCoreness":  3,
			 "maxCoreness": 3,
			 "NumeroNodi": 5,
			 "NumeroArchi": 0,
			 "children": [
			 ]},
			{"Node": 3147,
			 "Coreness": 3,
			 "minCoreness":  3,
			 "maxCoreness": 3,
			 "NumeroNodi": 5,
			 "NumeroArchi": 0,
			 "children": [
			 ]},
			{"Node": 3340,
			 "Coreness": 3,
			 "minCoreness":  3,
			 "maxCoreness": 3,
			 "NumeroNodi": 5,
			 "NumeroArchi": 0,
			 "children": [
			 ]},
			{"Node": 3339,
			 "Coreness": 3,
			 "minCoreness":  3,
			 "maxCoreness": 3,
			 "NumeroNodi": 7,
			 "NumeroArchi": 0,
			 "children": [
			 ]},
			{"Node": 3338,
			 "Coreness": 3,
			 "minCoreness":  3,
			 "maxCoreness": 3,
			 "NumeroNodi": 4,
			 "NumeroArchi": 0,
			 "children": [
			 ]},
			{"Node": 3334,
			 "Coreness": 3,
			 "minCoreness":  3,
			 "maxCoreness": 3,
			 "NumeroNodi": 20,
			 "NumeroArchi": 0,
			 "children": [
			 ]},
			{"Node": 3336,
			 "Coreness": 3,
			 "minCoreness":  3,
			 "maxCoreness": 3,
			 "NumeroNodi": 4,
			 "NumeroArchi": 0,
			 "children": [
			 ]},
			{"Node": 3329,
			 "Coreness": 3,
			 "minCoreness":  3,
			 "maxCoreness": 3,
			 "NumeroNodi": 5,
			 "NumeroArchi": 0,
			 "children": [
			 ]},
			{"Node": 3328,
			 "Coreness": 3,
			 "minCoreness":  3,
			 "maxCoreness": 3,
			 "NumeroNodi": 5,
			 "NumeroArchi": 0,
			 "children": [
			 ]},
			{"Node": 3327,
			 "Coreness": 3,
			 "minCoreness":  3,
			 "maxCoreness": 3,
			 "NumeroNodi": 5,
			 "NumeroArchi": 0,
			 "children": [
			 ]},
			{"Node": 3333,
			 "Coreness": 3,
			 "minCoreness":  3,
			 "maxCoreness": 3,
			 "NumeroNodi": 5,
			 "NumeroArchi": 0,
			 "children": [
			 ]},
			{"Node": 3332,
			 "Coreness": 3,
			 "minCoreness":  3,
			 "maxCoreness": 3,
			 "NumeroNodi": 6,
			 "NumeroArchi": 0,
			 "children": [
			 ]},
			{"Node": 3326,
			 "Coreness": 3,
			 "minCoreness":  3,
			 "maxCoreness": 3,
			 "NumeroNodi": 4,
			 "NumeroArchi": 0,
			 "children": [
			 ]},
			{"Node": 3325,
			 "Coreness": 3,
			 "minCoreness":  3,
			 "maxCoreness": 3,
			 "NumeroNodi": 5,
			 "NumeroArchi": 0,
			 "children": [
			 ]},
			{"Node": 3337,
			 "Coreness": 3,
			 "minCoreness":  3,
			 "maxCoreness": 3,
			 "NumeroNodi": 5,
			 "NumeroArchi": 0,
			 "children": [
			 ]},
			{"Node": 3335,
			 "Coreness": 3,
			 "minCoreness":  3,
			 "maxCoreness": 3,
			 "NumeroNodi": 5,
			 "NumeroArchi": 0,
			 "children": [
			 ]},
			{"Node": 3324,
			 "Coreness": 3,
			 "minCoreness":  3,
			 "maxCoreness": 3,
			 "NumeroNodi": 5,
			 "NumeroArchi": 0,
			 "children": [
			 ]},
			{"Node": 3323,
			 "Coreness": 3,
			 "minCoreness":  3,
			 "maxCoreness": 3,
			 "NumeroNodi": 5,
			 "NumeroArchi": 0,
			 "children": [
			 ]},
			{"Node": 3322,
			 "Coreness": 3,
			 "minCoreness":  3,
			 "maxCoreness": 3,
			 "NumeroNodi": 7,
			 "NumeroArchi": 0,
			 "children": [
			 ]},
			{"Node": 3320,
			 "Coreness": 3,
			 "minCoreness":  3,
			 "maxCoreness": 3,
			 "NumeroNodi": 5,
			 "NumeroArchi": 0,
			 "children": [
			 ]},
			{"Node": 3321,
			 "Coreness": 3,
			 "minCoreness":  3,
			 "maxCoreness": 3,
			 "NumeroNodi": 5,
			 "NumeroArchi": 0,
			 "children": [
			 ]},
			{"Node": 3319,
			 "Coreness": 3,
			 "minCoreness":  3,
			 "maxCoreness": 3,
			 "NumeroNodi": 5,
			 "NumeroArchi": 0,
			 "children": [
			 ]},
			{"Node": 3318,
			 "Coreness": 3,
			 "minCoreness":  3,
			 "maxCoreness": 3,
			 "NumeroNodi": 4,
			 "NumeroArchi": 0,
			 "children": [
			 ]},
			{"Node": 3317,
			 "Coreness": 3,
			 "minCoreness":  3,
			 "maxCoreness": 3,
			 "NumeroNodi": 4,
			 "NumeroArchi": 0,
			 "children": [
			 ]},
			{"Node": 3313,
			 "Coreness": 3,
			 "minCoreness":  3,
			 "maxCoreness": 3,
			 "NumeroNodi": 5,
			 "NumeroArchi": 0,
			 "children": [
			 ]},
			{"Node": 3316,
			 "Coreness": 3,
			 "minCoreness":  3,
			 "maxCoreness": 3,
			 "NumeroNodi": 4,
			 "NumeroArchi": 0,
			 "children": [
			 ]},
			{"Node": 3315,
			 "Coreness": 3,
			 "minCoreness":  3,
			 "maxCoreness": 3,
			 "NumeroNodi": 5,
			 "NumeroArchi": 0,
			 "children": [
			 ]},
			{"Node": 3314,
			 "Coreness": 3,
			 "minCoreness":  3,
			 "maxCoreness": 3,
			 "NumeroNodi": 4,
			 "NumeroArchi": 0,
			 "children": [
			 ]},
			{"Node": 3135,
			 "Coreness": 3,
			 "minCoreness":  3,
			 "maxCoreness": 3,
			 "NumeroNodi": 5,
			 "NumeroArchi": 0,
			 "children": [
			 ]},
			{"Node": 3134,
			 "Coreness": 3,
			 "minCoreness":  3,
			 "maxCoreness": 3,
			 "NumeroNodi": 9,
			 "NumeroArchi": 0,
			 "children": [
			 ]},
			{"Node": 3133,
			 "Coreness": 3,
			 "minCoreness":  3,
			 "maxCoreness": 3,
			 "NumeroNodi": 5,
			 "NumeroArchi": 0,
			 "children": [
			 ]},
			{"Node": 3132,
			 "Coreness": 3,
			 "minCoreness":  3,
			 "maxCoreness": 3,
			 "NumeroNodi": 5,
			 "NumeroArchi": 0,
			 "children": [
			 ]},
			{"Node": 3131,
			 "Coreness": 3,
			 "minCoreness":  3,
			 "maxCoreness": 3,
			 "NumeroNodi": 14,
			 "NumeroArchi": 0,
			 "children": [
			 ]},
			{"Node": 3130,
			 "Coreness": 3,
			 "minCoreness":  3,
			 "maxCoreness": 3,
			 "NumeroNodi": 6,
			 "NumeroArchi": 0,
			 "children": [
			 ]},
			{"Node": 3124,
			 "Coreness": 3,
			 "minCoreness":  3,
			 "maxCoreness": 3,
			 "NumeroNodi": 4,
			 "NumeroArchi": 0,
			 "children": [
			 ]},
			{"Node": 3312,
			 "Coreness": 3,
			 "minCoreness":  3,
			 "maxCoreness": 3,
			 "NumeroNodi": 5,
			 "NumeroArchi": 0,
			 "children": [
			 ]},
			{"Node": 3311,
			 "Coreness": 3,
			 "minCoreness":  3,
			 "maxCoreness": 3,
			 "NumeroNodi": 12,
			 "NumeroArchi": 0,
			 "children": [
			 ]},
			{"Node": 3306,
			 "Coreness": 3,
			 "minCoreness":  3,
			 "maxCoreness": 3,
			 "NumeroNodi": 7,
			 "NumeroArchi": 0,
			 "children": [
			 ]},
			{"Node": 3129,
			 "Coreness": 3,
			 "minCoreness":  3,
			 "maxCoreness": 3,
			 "NumeroNodi": 4,
			 "NumeroArchi": 0,
			 "children": [
			 ]},
			{"Node": 3309,
			 "Coreness": 3,
			 "minCoreness":  3,
			 "maxCoreness": 3,
			 "NumeroNodi": 5,
			 "NumeroArchi": 0,
			 "children": [
			 ]},
			{"Node": 3127,
			 "Coreness": 3,
			 "minCoreness":  3,
			 "maxCoreness": 3,
			 "NumeroNodi": 16,
			 "NumeroArchi": 0,
			 "children": [
			 ]},
			{"Node": 3128,
			 "Coreness": 3,
			 "minCoreness":  3,
			 "maxCoreness": 3,
			 "NumeroNodi": 5,
			 "NumeroArchi": 0,
			 "children": [
			 ]},
			{"Node": 3308,
			 "Coreness": 3,
			 "minCoreness":  3,
			 "maxCoreness": 3,
			 "NumeroNodi": 5,
			 "NumeroArchi": 0,
			 "children": [
			 ]},
			{"Node": 3307,
			 "Coreness": 3,
			 "minCoreness":  3,
			 "maxCoreness": 3,
			 "NumeroNodi": 5,
			 "NumeroArchi": 0,
			 "children": [
			 ]},
			{"Node": 3301,
			 "Coreness": 3,
			 "minCoreness":  3,
			 "maxCoreness": 3,
			 "NumeroNodi": 5,
			 "NumeroArchi": 0,
			 "children": [
			 ]},
			{"Node": 3300,
			 "Coreness": 3,
			 "minCoreness":  3,
			 "maxCoreness": 3,
			 "NumeroNodi": 5,
			 "NumeroArchi": 0,
			 "children": [
			 ]},
			{"Node": 3234,
			 "Coreness": 3,
			 "minCoreness":  3,
			 "maxCoreness": 3,
			 "NumeroNodi": 5,
			 "NumeroArchi": 0,
			 "children": [
			 ]},
			{"Node": 3303,
			 "Coreness": 3,
			 "minCoreness":  3,
			 "maxCoreness": 3,
			 "NumeroNodi": 5,
			 "NumeroArchi": 0,
			 "children": [
			 ]},
			{"Node": 3125,
			 "Coreness": 3,
			 "minCoreness":  3,
			 "maxCoreness": 3,
			 "NumeroNodi": 5,
			 "NumeroArchi": 0,
			 "children": [
			 ]},
			{"Node": 3223,
			 "Coreness": 3,
			 "minCoreness":  3,
			 "maxCoreness": 3,
			 "NumeroNodi": 5,
			 "NumeroArchi": 0,
			 "children": [
			 ]},
			{"Node": 3302,
			 "Coreness": 3,
			 "minCoreness":  3,
			 "maxCoreness": 3,
			 "NumeroNodi": 5,
			 "NumeroArchi": 0,
			 "children": [
			 ]},
			{"Node": 3305,
			 "Coreness": 3,
			 "minCoreness":  3,
			 "maxCoreness": 3,
			 "NumeroNodi": 5,
			 "NumeroArchi": 0,
			 "children": [
			 ]},
			{"Node": 3123,
			 "Coreness": 3,
			 "minCoreness":  3,
			 "maxCoreness": 3,
			 "NumeroNodi": 5,
			 "NumeroArchi": 0,
			 "children": [
			 ]},
			{"Node": 3304,
			 "Coreness": 3,
			 "minCoreness":  3,
			 "maxCoreness": 3,
			 "NumeroNodi": 5,
			 "NumeroArchi": 0,
			 "children": [
			 ]},
			{"Node": 3122,
			 "Coreness": 3,
			 "minCoreness":  3,
			 "maxCoreness": 3,
			 "NumeroNodi": 7,
			 "NumeroArchi": 0,
			 "children": [
			 ]},
			{"Node": 3232,
			 "Coreness": 3,
			 "minCoreness":  3,
			 "maxCoreness": 3,
			 "NumeroNodi": 4,
			 "NumeroArchi": 0,
			 "children": [
			 ]},
			{"Node": 3233,
			 "Coreness": 3,
			 "minCoreness":  3,
			 "maxCoreness": 3,
			 "NumeroNodi": 5,
			 "NumeroArchi": 0,
			 "children": [
			 ]},
			{"Node": 3121,
			 "Coreness": 3,
			 "minCoreness":  3,
			 "maxCoreness": 3,
			 "NumeroNodi": 21,
			 "NumeroArchi": 0,
			 "children": [
			 ]},
			{"Node": 3120,
			 "Coreness": 3,
			 "minCoreness":  3,
			 "maxCoreness": 3,
			 "NumeroNodi": 8,
			 "NumeroArchi": 0,
			 "children": [
			 ]},
			{"Node": 3299,
			 "Coreness": 3,
			 "minCoreness":  3,
			 "maxCoreness": 3,
			 "NumeroNodi": 4,
			 "NumeroArchi": 0,
			 "children": [
			 ]},
			{"Node": 3119,
			 "Coreness": 3,
			 "minCoreness":  3,
			 "maxCoreness": 3,
			 "NumeroNodi": 12,
			 "NumeroArchi": 0,
			 "children": [
			 ]},
			{"Node": 3118,
			 "Coreness": 3,
			 "minCoreness":  3,
			 "maxCoreness": 3,
			 "NumeroNodi": 8,
			 "NumeroArchi": 0,
			 "children": [
			 ]},
			{"Node": 3116,
			 "Coreness": 3,
			 "minCoreness":  3,
			 "maxCoreness": 3,
			 "NumeroNodi": 6,
			 "NumeroArchi": 0,
			 "children": [
			 ]},
			{"Node": 3117,
			 "Coreness": 3,
			 "minCoreness":  3,
			 "maxCoreness": 3,
			 "NumeroNodi": 4,
			 "NumeroArchi": 0,
			 "children": [
			 ]},
			{"Node": 3231,
			 "Coreness": 3,
			 "minCoreness":  3,
			 "maxCoreness": 3,
			 "NumeroNodi": 13,
			 "NumeroArchi": 0,
			 "children": [
			 ]},
			{"Node": 3230,
			 "Coreness": 3,
			 "minCoreness":  3,
			 "maxCoreness": 3,
			 "NumeroNodi": 4,
			 "NumeroArchi": 0,
			 "children": [
			 ]},
			{"Node": 3221,
			 "Coreness": 3,
			 "minCoreness":  3,
			 "maxCoreness": 3,
			 "NumeroNodi": 5,
			 "NumeroArchi": 0,
			 "children": [
			 ]},
			{"Node": 3298,
			 "Coreness": 3,
			 "minCoreness":  3,
			 "maxCoreness": 3,
			 "NumeroNodi": 4,
			 "NumeroArchi": 0,
			 "children": [
			 ]},
			{"Node": 3297,
			 "Coreness": 3,
			 "minCoreness":  3,
			 "maxCoreness": 3,
			 "NumeroNodi": 5,
			 "NumeroArchi": 0,
			 "children": [
			 ]},
			{"Node": 3296,
			 "Coreness": 3,
			 "minCoreness":  3,
			 "maxCoreness": 3,
			 "NumeroNodi": 5,
			 "NumeroArchi": 0,
			 "children": [
			 ]},
			{"Node": 3228,
			 "Coreness": 3,
			 "minCoreness":  3,
			 "maxCoreness": 3,
			 "NumeroNodi": 4,
			 "NumeroArchi": 0,
			 "children": [
			 ]},
			{"Node": 3229,
			 "Coreness": 3,
			 "minCoreness":  3,
			 "maxCoreness": 3,
			 "NumeroNodi": 16,
			 "NumeroArchi": 0,
			 "children": [
			 ]},
			{"Node": 3295,
			 "Coreness": 3,
			 "minCoreness":  3,
			 "maxCoreness": 3,
			 "NumeroNodi": 5,
			 "NumeroArchi": 0,
			 "children": [
			 ]},
			{"Node": 3294,
			 "Coreness": 3,
			 "minCoreness":  3,
			 "maxCoreness": 3,
			 "NumeroNodi": 5,
			 "NumeroArchi": 0,
			 "children": [
			 ]},
			{"Node": 3113,
			 "Coreness": 3,
			 "minCoreness":  3,
			 "maxCoreness": 3,
			 "NumeroNodi": 8,
			 "NumeroArchi": 0,
			 "children": [
			 ]},
			{"Node": 3114,
			 "Coreness": 3,
			 "minCoreness":  3,
			 "maxCoreness": 3,
			 "NumeroNodi": 13,
			 "NumeroArchi": 0,
			 "children": [
			 ]},
			{"Node": 3226,
			 "Coreness": 3,
			 "minCoreness":  3,
			 "maxCoreness": 3,
			 "NumeroNodi": 16,
			 "NumeroArchi": 0,
			 "children": [
			 ]},
			{"Node": 3227,
			 "Coreness": 3,
			 "minCoreness":  3,
			 "maxCoreness": 3,
			 "NumeroNodi": 8,
			 "NumeroArchi": 0,
			 "children": [
			 ]},
			{"Node": 3225,
			 "Coreness": 3,
			 "minCoreness":  3,
			 "maxCoreness": 3,
			 "NumeroNodi": 8,
			 "NumeroArchi": 0,
			 "children": [
			 ]},
			{"Node": 3115,
			 "Coreness": 3,
			 "minCoreness":  3,
			 "maxCoreness": 3,
			 "NumeroNodi": 5,
			 "NumeroArchi": 0,
			 "children": [
			 ]},
			{"Node": 3222,
			 "Coreness": 3,
			 "minCoreness":  3,
			 "maxCoreness": 3,
			 "NumeroNodi": 5,
			 "NumeroArchi": 0,
			 "children": [
			 ]},
			{"Node": 3112,
			 "Coreness": 3,
			 "minCoreness":  3,
			 "maxCoreness": 3,
			 "NumeroNodi": 4,
			 "NumeroArchi": 0,
			 "children": [
			 ]},
			{"Node": 3293,
			 "Coreness": 3,
			 "minCoreness":  3,
			 "maxCoreness": 3,
			 "NumeroNodi": 10,
			 "NumeroArchi": 0,
			 "children": [
			 ]},
			{"Node": 3205,
			 "Coreness": 3,
			 "minCoreness":  3,
			 "maxCoreness": 3,
			 "NumeroNodi": 5,
			 "NumeroArchi": 0,
			 "children": [
			 ]},
			{"Node": 3204,
			 "Coreness": 3,
			 "minCoreness":  3,
			 "maxCoreness": 3,
			 "NumeroNodi": 5,
			 "NumeroArchi": 0,
			 "children": [
			 ]},
			{"Node": 3203,
			 "Coreness": 3,
			 "minCoreness":  3,
			 "maxCoreness": 3,
			 "NumeroNodi": 5,
			 "NumeroArchi": 0,
			 "children": [
			 ]},
			{"Node": 3025,
			 "Coreness": 3,
			 "minCoreness":  3,
			 "maxCoreness": 3,
			 "NumeroNodi": 4,
			 "NumeroArchi": 0,
			 "children": [
			 ]},
			{"Node": 3111,
			 "Coreness": 3,
			 "minCoreness":  3,
			 "maxCoreness": 3,
			 "NumeroNodi": 4,
			 "NumeroArchi": 0,
			 "children": [
			 ]},
			{"Node": 3110,
			 "Coreness": 3,
			 "minCoreness":  3,
			 "maxCoreness": 3,
			 "NumeroNodi": 5,
			 "NumeroArchi": 0,
			 "children": [
			 ]},
			{"Node": 3202,
			 "Coreness": 3,
			 "minCoreness":  3,
			 "maxCoreness": 3,
			 "NumeroNodi": 5,
			 "NumeroArchi": 0,
			 "children": [
			 ]},
			{"Node": 3200,
			 "Coreness": 3,
			 "minCoreness":  3,
			 "maxCoreness": 3,
			 "NumeroNodi": 5,
			 "NumeroArchi": 0,
			 "children": [
			 ]},
			{"Node": 3199,
			 "Coreness": 3,
			 "minCoreness":  3,
			 "maxCoreness": 3,
			 "NumeroNodi": 5,
			 "NumeroArchi": 0,
			 "children": [
			 ]},
			{"Node": 3201,
			 "Coreness": 3,
			 "minCoreness":  3,
			 "maxCoreness": 3,
			 "NumeroNodi": 5,
			 "NumeroArchi": 0,
			 "children": [
			 ]},
			{"Node": 3108,
			 "Coreness": 3,
			 "minCoreness":  3,
			 "maxCoreness": 3,
			 "NumeroNodi": 9,
			 "NumeroArchi": 0,
			 "children": [
			 ]},
			{"Node": 3109,
			 "Coreness": 3,
			 "minCoreness":  3,
			 "maxCoreness": 3,
			 "NumeroNodi": 4,
			 "NumeroArchi": 0,
			 "children": [
			 ]},
			{"Node": 3107,
			 "Coreness": 3,
			 "minCoreness":  3,
			 "maxCoreness": 3,
			 "NumeroNodi": 11,
			 "NumeroArchi": 0,
			 "children": [
			 ]},
			{"Node": 3198,
			 "Coreness": 3,
			 "minCoreness":  3,
			 "maxCoreness": 3,
			 "NumeroNodi": 5,
			 "NumeroArchi": 0,
			 "children": [
			 ]},
			{"Node": 3104,
			 "Coreness": 3,
			 "minCoreness":  3,
			 "maxCoreness": 3,
			 "NumeroNodi": 5,
			 "NumeroArchi": 0,
			 "children": [
			 ]},
			{"Node": 3193,
			 "Coreness": 3,
			 "minCoreness":  3,
			 "maxCoreness": 3,
			 "NumeroNodi": 5,
			 "NumeroArchi": 0,
			 "children": [
			 ]},
			{"Node": 3192,
			 "Coreness": 3,
			 "minCoreness":  3,
			 "maxCoreness": 3,
			 "NumeroNodi": 5,
			 "NumeroArchi": 0,
			 "children": [
			 ]},
			{"Node": 3291,
			 "Coreness": 3,
			 "minCoreness":  3,
			 "maxCoreness": 3,
			 "NumeroNodi": 5,
			 "NumeroArchi": 0,
			 "children": [
			 ]},
			{"Node": 3103,
			 "Coreness": 3,
			 "minCoreness":  3,
			 "maxCoreness": 3,
			 "NumeroNodi": 5,
			 "NumeroArchi": 0,
			 "children": [
			 ]},
			{"Node": 3081,
			 "Coreness": 3,
			 "minCoreness":  3,
			 "maxCoreness": 3,
			 "NumeroNodi": 21,
			 "NumeroArchi": 0,
			 "children": [
			 ]},
			{"Node": 3106,
			 "Coreness": 3,
			 "minCoreness":  3,
			 "maxCoreness": 3,
			 "NumeroNodi": 8,
			 "NumeroArchi": 0,
			 "children": [
			 ]},
			{"Node": 3292,
			 "Coreness": 3,
			 "minCoreness":  3,
			 "maxCoreness": 3,
			 "NumeroNodi": 6,
			 "NumeroArchi": 0,
			 "children": [
			 ]},
			{"Node": 3097,
			 "Coreness": 3,
			 "minCoreness":  3,
			 "maxCoreness": 3,
			 "NumeroNodi": 7,
			 "NumeroArchi": 0,
			 "children": [
			 ]},
			{"Node": 3197,
			 "Coreness": 3,
			 "minCoreness":  3,
			 "maxCoreness": 3,
			 "NumeroNodi": 32,
			 "NumeroArchi": 0,
			 "children": [
			 ]},
			{"Node": 3102,
			 "Coreness": 3,
			 "minCoreness":  3,
			 "maxCoreness": 3,
			 "NumeroNodi": 8,
			 "NumeroArchi": 0,
			 "children": [
			 ]},
			{"Node": 3074,
			 "Coreness": 3,
			 "minCoreness":  3,
			 "maxCoreness": 3,
			 "NumeroNodi": 19,
			 "NumeroArchi": 0,
			 "children": [
			 ]},
			{"Node": 3196,
			 "Coreness": 3,
			 "minCoreness":  3,
			 "maxCoreness": 3,
			 "NumeroNodi": 10,
			 "NumeroArchi": 0,
			 "children": [
			 ]},
			{"Node": 3024,
			 "Coreness": 3,
			 "minCoreness":  3,
			 "maxCoreness": 3,
			 "NumeroNodi": 5,
			 "NumeroArchi": 0,
			 "children": [
			 ]},
			{"Node": 3080,
			 "Coreness": 3,
			 "minCoreness":  3,
			 "maxCoreness": 3,
			 "NumeroNodi": 6,
			 "NumeroArchi": 0,
			 "children": [
			 ]},
			{"Node": 3290,
			 "Coreness": 3,
			 "minCoreness":  3,
			 "maxCoreness": 3,
			 "NumeroNodi": 6,
			 "NumeroArchi": 0,
			 "children": [
			 ]},
			{"Node": 3071,
			 "Coreness": 3,
			 "minCoreness":  3,
			 "maxCoreness": 3,
			 "NumeroNodi": 5,
			 "NumeroArchi": 0,
			 "children": [
			 ]},
			{"Node": 3072,
			 "Coreness": 3,
			 "minCoreness":  3,
			 "maxCoreness": 3,
			 "NumeroNodi": 5,
			 "NumeroArchi": 0,
			 "children": [
			 ]},
			{"Node": 3289,
			 "Coreness": 3,
			 "minCoreness":  3,
			 "maxCoreness": 3,
			 "NumeroNodi": 5,
			 "NumeroArchi": 0,
			 "children": [
			 ]},
			{"Node": 3195,
			 "Coreness": 3,
			 "minCoreness":  3,
			 "maxCoreness": 3,
			 "NumeroNodi": 5,
			 "NumeroArchi": 0,
			 "children": [
			 ]},
			{"Node": 3194,
			 "Coreness": 3,
			 "minCoreness":  3,
			 "maxCoreness": 3,
			 "NumeroNodi": 5,
			 "NumeroArchi": 0,
			 "children": [
			 ]},
			{"Node": 3023,
			 "Coreness": 3,
			 "minCoreness":  3,
			 "maxCoreness": 3,
			 "NumeroNodi": 9,
			 "NumeroArchi": 0,
			 "children": [
			 ]},
			{"Node": 3191,
			 "Coreness": 3,
			 "minCoreness":  3,
			 "maxCoreness": 3,
			 "NumeroNodi": 5,
			 "NumeroArchi": 0,
			 "children": [
			 ]},
			{"Node": 3100,
			 "Coreness": 3,
			 "minCoreness":  3,
			 "maxCoreness": 3,
			 "NumeroNodi": 4,
			 "NumeroArchi": 0,
			 "children": [
			 ]},
			{"Node": 3070,
			 "Coreness": 3,
			 "minCoreness":  3,
			 "maxCoreness": 3,
			 "NumeroNodi": 4,
			 "NumeroArchi": 0,
			 "children": [
			 ]},
			{"Node": 3101,
			 "Coreness": 3,
			 "minCoreness":  3,
			 "maxCoreness": 3,
			 "NumeroNodi": 15,
			 "NumeroArchi": 0,
			 "children": [
			 ]},
			{"Node": 3285,
			 "Coreness": 3,
			 "minCoreness":  3,
			 "maxCoreness": 3,
			 "NumeroNodi": 12,
			 "NumeroArchi": 0,
			 "children": [
			 ]},
			{"Node": 3186,
			 "Coreness": 3,
			 "minCoreness":  3,
			 "maxCoreness": 3,
			 "NumeroNodi": 5,
			 "NumeroArchi": 0,
			 "children": [
			 ]},
			{"Node": 3068,
			 "Coreness": 3,
			 "minCoreness":  3,
			 "maxCoreness": 3,
			 "NumeroNodi": 14,
			 "NumeroArchi": 0,
			 "children": [
			 ]},
			{"Node": 3069,
			 "Coreness": 3,
			 "minCoreness":  3,
			 "maxCoreness": 3,
			 "NumeroNodi": 14,
			 "NumeroArchi": 0,
			 "children": [
			 ]},
			{"Node": 3288,
			 "Coreness": 3,
			 "minCoreness":  3,
			 "maxCoreness": 3,
			 "NumeroNodi": 5,
			 "NumeroArchi": 0,
			 "children": [
			 ]},
			{"Node": 3099,
			 "Coreness": 3,
			 "minCoreness":  3,
			 "maxCoreness": 3,
			 "NumeroNodi": 20,
			 "NumeroArchi": 0,
			 "children": [
			 ]},
			{"Node": 3190,
			 "Coreness": 3,
			 "minCoreness":  3,
			 "maxCoreness": 3,
			 "NumeroNodi": 14,
			 "NumeroArchi": 0,
			 "children": [
			 ]},
			{"Node": 3187,
			 "Coreness": 3,
			 "minCoreness":  3,
			 "maxCoreness": 3,
			 "NumeroNodi": 4,
			 "NumeroArchi": 0,
			 "children": [
			 ]},
			{"Node": 3096,
			 "Coreness": 3,
			 "minCoreness":  3,
			 "maxCoreness": 3,
			 "NumeroNodi": 4,
			 "NumeroArchi": 0,
			 "children": [
			 ]},
			{"Node": 3020,
			 "Coreness": 3,
			 "minCoreness":  3,
			 "maxCoreness": 3,
			 "NumeroNodi": 5,
			 "NumeroArchi": 0,
			 "children": [
			 ]},
			{"Node": 3284,
			 "Coreness": 3,
			 "minCoreness":  3,
			 "maxCoreness": 3,
			 "NumeroNodi": 4,
			 "NumeroArchi": 0,
			 "children": [
			 ]},
			{"Node": 3283,
			 "Coreness": 3,
			 "minCoreness":  3,
			 "maxCoreness": 3,
			 "NumeroNodi": 5,
			 "NumeroArchi": 0,
			 "children": [
			 ]},
			{"Node": 3022,
			 "Coreness": 3,
			 "minCoreness":  3,
			 "maxCoreness": 3,
			 "NumeroNodi": 5,
			 "NumeroArchi": 0,
			 "children": [
			 ]},
			{"Node": 3098,
			 "Coreness": 3,
			 "minCoreness":  3,
			 "maxCoreness": 3,
			 "NumeroNodi": 5,
			 "NumeroArchi": 0,
			 "children": [
			 ]},
			{"Node": 3093,
			 "Coreness": 3,
			 "minCoreness":  3,
			 "maxCoreness": 3,
			 "NumeroNodi": 12,
			 "NumeroArchi": 0,
			 "children": [
			 ]},
			{"Node": 3017,
			 "Coreness": 3,
			 "minCoreness":  3,
			 "maxCoreness": 3,
			 "NumeroNodi": 4,
			 "NumeroArchi": 0,
			 "children": [
			 ]},
			{"Node": 3287,
			 "Coreness": 3,
			 "minCoreness":  3,
			 "maxCoreness": 3,
			 "NumeroNodi": 8,
			 "NumeroArchi": 0,
			 "children": [
			 ]},
			{"Node": 3019,
			 "Coreness": 3,
			 "minCoreness":  3,
			 "maxCoreness": 3,
			 "NumeroNodi": 6,
			 "NumeroArchi": 0,
			 "children": [
			 ]},
			{"Node": 3286,
			 "Coreness": 3,
			 "minCoreness":  3,
			 "maxCoreness": 3,
			 "NumeroNodi": 4,
			 "NumeroArchi": 0,
			 "children": [
			 ]},
			{"Node": 3021,
			 "Coreness": 3,
			 "minCoreness":  3,
			 "maxCoreness": 3,
			 "NumeroNodi": 4,
			 "NumeroArchi": 0,
			 "children": [
			 ]},
			{"Node": 3094,
			 "Coreness": 3,
			 "minCoreness":  3,
			 "maxCoreness": 3,
			 "NumeroNodi": 8,
			 "NumeroArchi": 0,
			 "children": [
			 ]},
			{"Node": 3067,
			 "Coreness": 3,
			 "minCoreness":  3,
			 "maxCoreness": 3,
			 "NumeroNodi": 7,
			 "NumeroArchi": 0,
			 "children": [
			 ]},
			{"Node": 3092,
			 "Coreness": 3,
			 "minCoreness":  3,
			 "maxCoreness": 3,
			 "NumeroNodi": 10,
			 "NumeroArchi": 0,
			 "children": [
			 ]},
			{"Node": 3095,
			 "Coreness": 3,
			 "minCoreness":  3,
			 "maxCoreness": 3,
			 "NumeroNodi": 16,
			 "NumeroArchi": 0,
			 "children": [
			 ]},
			{"Node": 3091,
			 "Coreness": 3,
			 "minCoreness":  3,
			 "maxCoreness": 3,
			 "NumeroNodi": 5,
			 "NumeroArchi": 0,
			 "children": [
			 ]},
			{"Node": 3018,
			 "Coreness": 3,
			 "minCoreness":  3,
			 "maxCoreness": 3,
			 "NumeroNodi": 5,
			 "NumeroArchi": 0,
			 "children": [
			 ]},
			{"Node": 3282,
			 "Coreness": 3,
			 "minCoreness":  3,
			 "maxCoreness": 3,
			 "NumeroNodi": 8,
			 "NumeroArchi": 0,
			 "children": [
			 ]},
			{"Node": 3088,
			 "Coreness": 3,
			 "minCoreness":  3,
			 "maxCoreness": 3,
			 "NumeroNodi": 5,
			 "NumeroArchi": 0,
			 "children": [
			 ]},
			{"Node": 3016,
			 "Coreness": 3,
			 "minCoreness":  3,
			 "maxCoreness": 3,
			 "NumeroNodi": 5,
			 "NumeroArchi": 0,
			 "children": [
			 ]},
			{"Node": 3090,
			 "Coreness": 3,
			 "minCoreness":  3,
			 "maxCoreness": 3,
			 "NumeroNodi": 5,
			 "NumeroArchi": 0,
			 "children": [
			 ]},
			{"Node": 3089,
			 "Coreness": 3,
			 "minCoreness":  3,
			 "maxCoreness": 3,
			 "NumeroNodi": 5,
			 "NumeroArchi": 0,
			 "children": [
			 ]},
			{"Node": 3066,
			 "Coreness": 3,
			 "minCoreness":  3,
			 "maxCoreness": 3,
			 "NumeroNodi": 5,
			 "NumeroArchi": 0,
			 "children": [
			 ]},
			{"Node": 3281,
			 "Coreness": 3,
			 "minCoreness":  3,
			 "maxCoreness": 3,
			 "NumeroNodi": 9,
			 "NumeroArchi": 0,
			 "children": [
			 ]},
			{"Node": 3079,
			 "Coreness": 3,
			 "minCoreness":  3,
			 "maxCoreness": 3,
			 "NumeroNodi": 5,
			 "NumeroArchi": 0,
			 "children": [
			 ]},
			{"Node": 3065,
			 "Coreness": 3,
			 "minCoreness":  3,
			 "maxCoreness": 3,
			 "NumeroNodi": 18,
			 "NumeroArchi": 0,
			 "children": [
			 ]},
			{"Node": 3087,
			 "Coreness": 3,
			 "minCoreness":  3,
			 "maxCoreness": 3,
			 "NumeroNodi": 8,
			 "NumeroArchi": 0,
			 "children": [
			 ]},
			{"Node": 3078,
			 "Coreness": 3,
			 "minCoreness":  3,
			 "maxCoreness": 3,
			 "NumeroNodi": 8,
			 "NumeroArchi": 0,
			 "children": [
			 ]},
			{"Node": 3077,
			 "Coreness": 3,
			 "minCoreness":  3,
			 "maxCoreness": 3,
			 "NumeroNodi": 5,
			 "NumeroArchi": 0,
			 "children": [
			 ]},
			{"Node": 3085,
			 "Coreness": 3,
			 "minCoreness":  3,
			 "maxCoreness": 3,
			 "NumeroNodi": 4,
			 "NumeroArchi": 0,
			 "children": [
			 ]},
			{"Node": 3064,
			 "Coreness": 3,
			 "minCoreness":  3,
			 "maxCoreness": 3,
			 "NumeroNodi": 5,
			 "NumeroArchi": 0,
			 "children": [
			 ]},
			{"Node": 3273,
			 "Coreness": 3,
			 "minCoreness":  3,
			 "maxCoreness": 3,
			 "NumeroNodi": 8,
			 "NumeroArchi": 0,
			 "children": [
			 ]},
			{"Node": 3063,
			 "Coreness": 3,
			 "minCoreness":  3,
			 "maxCoreness": 3,
			 "NumeroNodi": 5,
			 "NumeroArchi": 0,
			 "children": [
			 ]},
			{"Node": 3075,
			 "Coreness": 3,
			 "minCoreness":  3,
			 "maxCoreness": 3,
			 "NumeroNodi": 20,
			 "NumeroArchi": 0,
			 "children": [
			 ]},
			{"Node": 3015,
			 "Coreness": 3,
			 "minCoreness":  3,
			 "maxCoreness": 3,
			 "NumeroNodi": 7,
			 "NumeroArchi": 0,
			 "children": [
			 ]},
			{"Node": 3014,
			 "Coreness": 3,
			 "minCoreness":  3,
			 "maxCoreness": 3,
			 "NumeroNodi": 5,
			 "NumeroArchi": 0,
			 "children": [
			 ]},
			{"Node": 3280,
			 "Coreness": 3,
			 "minCoreness":  3,
			 "maxCoreness": 3,
			 "NumeroNodi": 5,
			 "NumeroArchi": 0,
			 "children": [
			 ]},
			{"Node": 3279,
			 "Coreness": 3,
			 "minCoreness":  3,
			 "maxCoreness": 3,
			 "NumeroNodi": 5,
			 "NumeroArchi": 0,
			 "children": [
			 ]},
			{"Node": 3009,
			 "Coreness": 3,
			 "minCoreness":  3,
			 "maxCoreness": 3,
			 "NumeroNodi": 5,
			 "NumeroArchi": 0,
			 "children": [
			 ]},
			{"Node": 3010,
			 "Coreness": 3,
			 "minCoreness":  3,
			 "maxCoreness": 3,
			 "NumeroNodi": 5,
			 "NumeroArchi": 0,
			 "children": [
			 ]},
			{"Node": 3062,
			 "Coreness": 3,
			 "minCoreness":  3,
			 "maxCoreness": 3,
			 "NumeroNodi": 6,
			 "NumeroArchi": 0,
			 "children": [
			 ]},
			{"Node": 3008,
			 "Coreness": 3,
			 "minCoreness":  3,
			 "maxCoreness": 3,
			 "NumeroNodi": 5,
			 "NumeroArchi": 0,
			 "children": [
			 ]},
			{"Node": 3013,
			 "Coreness": 3,
			 "minCoreness":  3,
			 "maxCoreness": 3,
			 "NumeroNodi": 5,
			 "NumeroArchi": 0,
			 "children": [
			 ]},
			{"Node": 3003,
			 "Coreness": 3,
			 "minCoreness":  3,
			 "maxCoreness": 3,
			 "NumeroNodi": 5,
			 "NumeroArchi": 0,
			 "children": [
			 ]},
			{"Node": 3278,
			 "Coreness": 3,
			 "minCoreness":  3,
			 "maxCoreness": 3,
			 "NumeroNodi": 4,
			 "NumeroArchi": 0,
			 "children": [
			 ]},
			{"Node": 3007,
			 "Coreness": 3,
			 "minCoreness":  3,
			 "maxCoreness": 3,
			 "NumeroNodi": 5,
			 "NumeroArchi": 0,
			 "children": [
			 ]},
			{"Node": 3061,
			 "Coreness": 3,
			 "minCoreness":  3,
			 "maxCoreness": 3,
			 "NumeroNodi": 5,
			 "NumeroArchi": 0,
			 "children": [
			 ]},
			{"Node": 3006,
			 "Coreness": 3,
			 "minCoreness":  3,
			 "maxCoreness": 3,
			 "NumeroNodi": 5,
			 "NumeroArchi": 0,
			 "children": [
			 ]},
			{"Node": 3002,
			 "Coreness": 3,
			 "minCoreness":  3,
			 "maxCoreness": 3,
			 "NumeroNodi": 4,
			 "NumeroArchi": 0,
			 "children": [
			 ]},
			{"Node": 3001,
			 "Coreness": 3,
			 "minCoreness":  3,
			 "maxCoreness": 3,
			 "NumeroNodi": 5,
			 "NumeroArchi": 0,
			 "children": [
			 ]},
			{"Node": 3012,
			 "Coreness": 3,
			 "minCoreness":  3,
			 "maxCoreness": 3,
			 "NumeroNodi": 6,
			 "NumeroArchi": 0,
			 "children": [
			 ]},
			{"Node": 3277,
			 "Coreness": 3,
			 "minCoreness":  3,
			 "maxCoreness": 3,
			 "NumeroNodi": 9,
			 "NumeroArchi": 0,
			 "children": [
			 ]},
			{"Node": 3060,
			 "Coreness": 3,
			 "minCoreness":  3,
			 "maxCoreness": 3,
			 "NumeroNodi": 5,
			 "NumeroArchi": 0,
			 "children": [
			 ]},
			{"Node": 3004,
			 "Coreness": 3,
			 "minCoreness":  3,
			 "maxCoreness": 3,
			 "NumeroNodi": 5,
			 "NumeroArchi": 0,
			 "children": [
			 ]},
			{"Node": 3011,
			 "Coreness": 3,
			 "minCoreness":  3,
			 "maxCoreness": 3,
			 "NumeroNodi": 8,
			 "NumeroArchi": 0,
			 "children": [
			 ]},
			{"Node": 3005,
			 "Coreness": 3,
			 "minCoreness":  3,
			 "maxCoreness": 3,
			 "NumeroNodi": 5,
			 "NumeroArchi": 0,
			 "children": [
			 ]},
			{"Node": 3059,
			 "Coreness": 3,
			 "minCoreness":  3,
			 "maxCoreness": 3,
			 "NumeroNodi": 5,
			 "NumeroArchi": 0,
			 "children": [
			 ]},
			{"Node": 3276,
			 "Coreness": 3,
			 "minCoreness":  3,
			 "maxCoreness": 3,
			 "NumeroNodi": 16,
			 "NumeroArchi": 0,
			 "children": [
			 ]},
			{"Node": 3275,
			 "Coreness": 3,
			 "minCoreness":  3,
			 "maxCoreness": 3,
			 "NumeroNodi": 4,
			 "NumeroArchi": 0,
			 "children": [
			 ]},
			{"Node": 3058,
			 "Coreness": 3,
			 "minCoreness":  3,
			 "maxCoreness": 3,
			 "NumeroNodi": 4,
			 "NumeroArchi": 0,
			 "children": [
			 ]},
			{"Node": 3269,
			 "Coreness": 3,
			 "minCoreness":  3,
			 "maxCoreness": 3,
			 "NumeroNodi": 40,
			 "NumeroArchi": 0,
			 "children": [
			 ]},
			{"Node": 3274,
			 "Coreness": 3,
			 "minCoreness":  3,
			 "maxCoreness": 3,
			 "NumeroNodi": 5,
			 "NumeroArchi": 0,
			 "children": [
			 ]},
			{"Node": 3057,
			 "Coreness": 3,
			 "minCoreness":  3,
			 "maxCoreness": 3,
			 "NumeroNodi": 8,
			 "NumeroArchi": 0,
			 "children": [
			 ]},
			{"Node": 3272,
			 "Coreness": 3,
			 "minCoreness":  3,
			 "maxCoreness": 3,
			 "NumeroNodi": 4,
			 "NumeroArchi": 0,
			 "children": [
			 ]},
			{"Node": 3270,
			 "Coreness": 3,
			 "minCoreness":  3,
			 "maxCoreness": 3,
			 "NumeroNodi": 4,
			 "NumeroArchi": 0,
			 "children": [
			 ]},
			{"Node": 3271,
			 "Coreness": 3,
			 "minCoreness":  3,
			 "maxCoreness": 3,
			 "NumeroNodi": 7,
			 "NumeroArchi": 0,
			 "children": [
			 ]},
			{"Node": 3220,
			 "Coreness": 3,
			 "minCoreness":  3,
			 "maxCoreness": 3,
			 "NumeroNodi": 5,
			 "NumeroArchi": 0,
			 "children": [
			 ]},
			{"Node": 3219,
			 "Coreness": 3,
			 "minCoreness":  3,
			 "maxCoreness": 3,
			 "NumeroNodi": 5,
			 "NumeroArchi": 0,
			 "children": [
			 ]},
			{"Node": 3056,
			 "Coreness": 3,
			 "minCoreness":  3,
			 "maxCoreness": 3,
			 "NumeroNodi": 5,
			 "NumeroArchi": 0,
			 "children": [
			 ]},
			{"Node": 3044,
			 "Coreness": 3,
			 "minCoreness":  3,
			 "maxCoreness": 3,
			 "NumeroNodi": 4,
			 "NumeroArchi": 0,
			 "children": [
			 ]},
			{"Node": 3218,
			 "Coreness": 3,
			 "minCoreness":  3,
			 "maxCoreness": 3,
			 "NumeroNodi": 4,
			 "NumeroArchi": 0,
			 "children": [
			 ]},
			{"Node": 3043,
			 "Coreness": 3,
			 "minCoreness":  3,
			 "maxCoreness": 3,
			 "NumeroNodi": 5,
			 "NumeroArchi": 0,
			 "children": [
			 ]},
			{"Node": 3055,
			 "Coreness": 3,
			 "minCoreness":  3,
			 "maxCoreness": 3,
			 "NumeroNodi": 4,
			 "NumeroArchi": 0,
			 "children": [
			 ]},
			{"Node": 3054,
			 "Coreness": 3,
			 "minCoreness":  3,
			 "maxCoreness": 3,
			 "NumeroNodi": 4,
			 "NumeroArchi": 0,
			 "children": [
			 ]},
			{"Node": 3050,
			 "Coreness": 3,
			 "minCoreness":  3,
			 "maxCoreness": 3,
			 "NumeroNodi": 5,
			 "NumeroArchi": 0,
			 "children": [
			 ]},
			{"Node": 3042,
			 "Coreness": 3,
			 "minCoreness":  3,
			 "maxCoreness": 3,
			 "NumeroNodi": 17,
			 "NumeroArchi": 0,
			 "children": [
			 ]},
			{"Node": 3041,
			 "Coreness": 3,
			 "minCoreness":  3,
			 "maxCoreness": 3,
			 "NumeroNodi": 12,
			 "NumeroArchi": 0,
			 "children": [
			 ]},
			{"Node": 3053,
			 "Coreness": 3,
			 "minCoreness":  3,
			 "maxCoreness": 3,
			 "NumeroNodi": 8,
			 "NumeroArchi": 0,
			 "children": [
			 ]},
			{"Node": 3052,
			 "Coreness": 3,
			 "minCoreness":  3,
			 "maxCoreness": 3,
			 "NumeroNodi": 18,
			 "NumeroArchi": 0,
			 "children": [
			 ]},
			{"Node": 3049,
			 "Coreness": 3,
			 "minCoreness":  3,
			 "maxCoreness": 3,
			 "NumeroNodi": 4,
			 "NumeroArchi": 0,
			 "children": [
			 ]},
			{"Node": 3048,
			 "Coreness": 3,
			 "minCoreness":  3,
			 "maxCoreness": 3,
			 "NumeroNodi": 5,
			 "NumeroArchi": 0,
			 "children": [
			 ]},
			{"Node": 3047,
			 "Coreness": 3,
			 "minCoreness":  3,
			 "maxCoreness": 3,
			 "NumeroNodi": 4,
			 "NumeroArchi": 0,
			 "children": [
			 ]},
			{"Node": 3039,
			 "Coreness": 3,
			 "minCoreness":  3,
			 "maxCoreness": 3,
			 "NumeroNodi": 5,
			 "NumeroArchi": 0,
			 "children": [
			 ]},
			{"Node": 3212,
			 "Coreness": 3,
			 "minCoreness":  3,
			 "maxCoreness": 3,
			 "NumeroNodi": 5,
			 "NumeroArchi": 0,
			 "children": [
			 ]},
			{"Node": 3217,
			 "Coreness": 3,
			 "minCoreness":  3,
			 "maxCoreness": 3,
			 "NumeroNodi": 5,
			 "NumeroArchi": 0,
			 "children": [
			 ]},
			{"Node": 3216,
			 "Coreness": 3,
			 "minCoreness":  3,
			 "maxCoreness": 3,
			 "NumeroNodi": 5,
			 "NumeroArchi": 0,
			 "children": [
			 ]},
			{"Node": 3215,
			 "Coreness": 3,
			 "minCoreness":  3,
			 "maxCoreness": 3,
			 "NumeroNodi": 5,
			 "NumeroArchi": 0,
			 "children": [
			 ]},
			{"Node": 3207,
			 "Coreness": 3,
			 "minCoreness":  3,
			 "maxCoreness": 3,
			 "NumeroNodi": 5,
			 "NumeroArchi": 0,
			 "children": [
			 ]},
			{"Node": 3214,
			 "Coreness": 3,
			 "minCoreness":  3,
			 "maxCoreness": 3,
			 "NumeroNodi": 8,
			 "NumeroArchi": 0,
			 "children": [
			 ]},
			{"Node": 3213,
			 "Coreness": 3,
			 "minCoreness":  3,
			 "maxCoreness": 3,
			 "NumeroNodi": 5,
			 "NumeroArchi": 0,
			 "children": [
			 ]},
			{"Node": 3208,
			 "Coreness": 3,
			 "minCoreness":  3,
			 "maxCoreness": 3,
			 "NumeroNodi": 5,
			 "NumeroArchi": 0,
			 "children": [
			 ]},
			{"Node": 3209,
			 "Coreness": 3,
			 "minCoreness":  3,
			 "maxCoreness": 3,
			 "NumeroNodi": 5,
			 "NumeroArchi": 0,
			 "children": [
			 ]},
			{"Node": 3210,
			 "Coreness": 3,
			 "minCoreness":  3,
			 "maxCoreness": 3,
			 "NumeroNodi": 4,
			 "NumeroArchi": 0,
			 "children": [
			 ]},
			{"Node": 3206,
			 "Coreness": 3,
			 "minCoreness":  3,
			 "maxCoreness": 3,
			 "NumeroNodi": 5,
			 "NumeroArchi": 0,
			 "children": [
			 ]},
			{"Node": 3211,
			 "Coreness": 3,
			 "minCoreness":  3,
			 "maxCoreness": 3,
			 "NumeroNodi": 23,
			 "NumeroArchi": 0,
			 "children": [
			 ]},
			{"Node": 3046,
			 "Coreness": 3,
			 "minCoreness":  3,
			 "maxCoreness": 3,
			 "NumeroNodi": 5,
			 "NumeroArchi": 0,
			 "children": [
			 ]},
			{"Node": 3185,
			 "Coreness": 3,
			 "minCoreness":  3,
			 "maxCoreness": 3,
			 "NumeroNodi": 5,
			 "NumeroArchi": 0,
			 "children": [
			 ]},
			{"Node": 3184,
			 "Coreness": 3,
			 "minCoreness":  3,
			 "maxCoreness": 3,
			 "NumeroNodi": 5,
			 "NumeroArchi": 0,
			 "children": [
			 ]},
			{"Node": 3183,
			 "Coreness": 3,
			 "minCoreness":  3,
			 "maxCoreness": 3,
			 "NumeroNodi": 5,
			 "NumeroArchi": 0,
			 "children": [
			 ]},
			{"Node": 3045,
			 "Coreness": 3,
			 "minCoreness":  3,
			 "maxCoreness": 3,
			 "NumeroNodi": 5,
			 "NumeroArchi": 0,
			 "children": [
			 ]},
			{"Node": 3182,
			 "Coreness": 3,
			 "minCoreness":  3,
			 "maxCoreness": 3,
			 "NumeroNodi": 5,
			 "NumeroArchi": 0,
			 "children": [
			 ]},
			{"Node": 3038,
			 "Coreness": 3,
			 "minCoreness":  3,
			 "maxCoreness": 3,
			 "NumeroNodi": 20,
			 "NumeroArchi": 0,
			 "children": [
			 ]},
			{"Node": 3037,
			 "Coreness": 3,
			 "minCoreness":  3,
			 "maxCoreness": 3,
			 "NumeroNodi": 5,
			 "NumeroArchi": 0,
			 "children": [
			 ]},
			{"Node": 3036,
			 "Coreness": 3,
			 "minCoreness":  3,
			 "maxCoreness": 3,
			 "NumeroNodi": 5,
			 "NumeroArchi": 0,
			 "children": [
			 ]},
			{"Node": 3035,
			 "Coreness": 3,
			 "minCoreness":  3,
			 "maxCoreness": 3,
			 "NumeroNodi": 5,
			 "NumeroArchi": 0,
			 "children": [
			 ]},
			{"Node": 3181,
			 "Coreness": 3,
			 "minCoreness":  3,
			 "maxCoreness": 3,
			 "NumeroNodi": 6,
			 "NumeroArchi": 0,
			 "children": [
			 ]},
			{"Node": 3027,
			 "Coreness": 3,
			 "minCoreness":  3,
			 "maxCoreness": 3,
			 "NumeroNodi": 5,
			 "NumeroArchi": 0,
			 "children": [
			 ]},
			{"Node": 3028,
			 "Coreness": 3,
			 "minCoreness":  3,
			 "maxCoreness": 3,
			 "NumeroNodi": 5,
			 "NumeroArchi": 0,
			 "children": [
			 ]},
			{"Node": 3026,
			 "Coreness": 3,
			 "minCoreness":  3,
			 "maxCoreness": 3,
			 "NumeroNodi": 5,
			 "NumeroArchi": 0,
			 "children": [
			 ]},
			{"Node": 3030,
			 "Coreness": 3,
			 "minCoreness":  3,
			 "maxCoreness": 3,
			 "NumeroNodi": 20,
			 "NumeroArchi": 0,
			 "children": [
			 ]},
			{"Node": 3031,
			 "Coreness": 3,
			 "minCoreness":  3,
			 "maxCoreness": 3,
			 "NumeroNodi": 14,
			 "NumeroArchi": 0,
			 "children": [
			 ]},
			{"Node": 3034,
			 "Coreness": 3,
			 "minCoreness":  3,
			 "maxCoreness": 3,
			 "NumeroNodi": 29,
			 "NumeroArchi": 0,
			 "children": [
			 ]},
			{"Node": 3033,
			 "Coreness": 3,
			 "minCoreness":  3,
			 "maxCoreness": 3,
			 "NumeroNodi": 20,
			 "NumeroArchi": 0,
			 "children": [
			 ]},
			{"Node": 3180,
			 "Coreness": 3,
			 "minCoreness":  3,
			 "maxCoreness": 3,
			 "NumeroNodi": 5,
			 "NumeroArchi": 0,
			 "children": [
			 ]},
			{"Node": 3179,
			 "Coreness": 3,
			 "minCoreness":  3,
			 "maxCoreness": 3,
			 "NumeroNodi": 27,
			 "NumeroArchi": 0,
			 "children": [
			 ]},
			{"Node": 3174,
			 "Coreness": 3,
			 "minCoreness":  3,
			 "maxCoreness": 3,
			 "NumeroNodi": 5,
			 "NumeroArchi": 0,
			 "children": [
			 ]},
			{"Node": 3175,
			 "Coreness": 3,
			 "minCoreness":  3,
			 "maxCoreness": 3,
			 "NumeroNodi": 8,
			 "NumeroArchi": 0,
			 "children": [
			 ]},
			{"Node": 3173,
			 "Coreness": 3,
			 "minCoreness":  3,
			 "maxCoreness": 3,
			 "NumeroNodi": 5,
			 "NumeroArchi": 0,
			 "children": [
			 ]},
			{"Node": 3177,
			 "Coreness": 3,
			 "minCoreness":  3,
			 "maxCoreness": 3,
			 "NumeroNodi": 4,
			 "NumeroArchi": 0,
			 "children": [
			 ]},
			{"Node": 3176,
			 "Coreness": 3,
			 "minCoreness":  3,
			 "maxCoreness": 3,
			 "NumeroNodi": 10,
			 "NumeroArchi": 0,
			 "children": [
			 ]},
			{"Node": 3172,
			 "Coreness": 3,
			 "minCoreness":  3,
			 "maxCoreness": 3,
			 "NumeroNodi": 6,
			 "NumeroArchi": 0,
			 "children": [
			 ]},
			{"Node": 3171,
			 "Coreness": 3,
			 "minCoreness":  3,
			 "maxCoreness": 3,
			 "NumeroNodi": 10,
			 "NumeroArchi": 0,
			 "children": [
			 ]},
			{"Node": 3170,
			 "Coreness": 3,
			 "minCoreness":  3,
			 "maxCoreness": 3,
			 "NumeroNodi": 8,
			 "NumeroArchi": 0,
			 "children": [
			 ]},
			{"Node": 3158,
			 "Coreness": 3,
			 "minCoreness":  3,
			 "maxCoreness": 3,
			 "NumeroNodi": 6,
			 "NumeroArchi": 0,
			 "children": [
			 ]},
			{"Node": 3160,
			 "Coreness": 3,
			 "minCoreness":  3,
			 "maxCoreness": 3,
			 "NumeroNodi": 12,
			 "NumeroArchi": 0,
			 "children": [
			 ]},
			{"Node": 3169,
			 "Coreness": 3,
			 "minCoreness":  3,
			 "maxCoreness": 3,
			 "NumeroNodi": 8,
			 "NumeroArchi": 0,
			 "children": [
			 ]},
			{"Node": 3168,
			 "Coreness": 3,
			 "minCoreness":  3,
			 "maxCoreness": 3,
			 "NumeroNodi": 12,
			 "NumeroArchi": 0,
			 "children": [
			 ]},
			{"Node": 3166,
			 "Coreness": 3,
			 "minCoreness":  3,
			 "maxCoreness": 3,
			 "NumeroNodi": 5,
			 "NumeroArchi": 0,
			 "children": [
			 ]},
			{"Node": 3165,
			 "Coreness": 3,
			 "minCoreness":  3,
			 "maxCoreness": 3,
			 "NumeroNodi": 5,
			 "NumeroArchi": 0,
			 "children": [
			 ]},
			{"Node": 3151,
			 "Coreness": 3,
			 "minCoreness":  3,
			 "maxCoreness": 3,
			 "NumeroNodi": 4,
			 "NumeroArchi": 0,
			 "children": [
			 ]},
			{"Node": 3164,
			 "Coreness": 3,
			 "minCoreness":  3,
			 "maxCoreness": 3,
			 "NumeroNodi": 5,
			 "NumeroArchi": 0,
			 "children": [
			 ]},
			{"Node": 3163,
			 "Coreness": 3,
			 "minCoreness":  3,
			 "maxCoreness": 3,
			 "NumeroNodi": 6,
			 "NumeroArchi": 0,
			 "children": [
			 ]},
			{"Node": 3162,
			 "Coreness": 3,
			 "minCoreness":  3,
			 "maxCoreness": 3,
			 "NumeroNodi": 13,
			 "NumeroArchi": 0,
			 "children": [
			 ]},
			{"Node": 3146,
			 "Coreness": 3,
			 "minCoreness":  3,
			 "maxCoreness": 3,
			 "NumeroNodi": 5,
			 "NumeroArchi": 0,
			 "children": [
			 ]},
			{"Node": 3157,
			 "Coreness": 3,
			 "minCoreness":  3,
			 "maxCoreness": 3,
			 "NumeroNodi": 4,
			 "NumeroArchi": 0,
			 "children": [
			 ]},
			{"Node": 3145,
			 "Coreness": 3,
			 "minCoreness":  3,
			 "maxCoreness": 3,
			 "NumeroNodi": 5,
			 "NumeroArchi": 0,
			 "children": [
			 ]},
			{"Node": 3150,
			 "Coreness": 3,
			 "minCoreness":  3,
			 "maxCoreness": 3,
			 "NumeroNodi": 16,
			 "NumeroArchi": 0,
			 "children": [
			 ]},
			{"Node": 3149,
			 "Coreness": 3,
			 "minCoreness":  3,
			 "maxCoreness": 3,
			 "NumeroNodi": 8,
			 "NumeroArchi": 0,
			 "children": [
			 ]},
			{"Node": 3144,
			 "Coreness": 3,
			 "minCoreness":  3,
			 "maxCoreness": 3,
			 "NumeroNodi": 5,
			 "NumeroArchi": 0,
			 "children": [
			 ]},
			{"Node": 3143,
			 "Coreness": 3,
			 "minCoreness":  3,
			 "maxCoreness": 3,
			 "NumeroNodi": 5,
			 "NumeroArchi": 0,
			 "children": [
			 ]},
			{"Node": 3156,
			 "Coreness": 3,
			 "minCoreness":  3,
			 "maxCoreness": 3,
			 "NumeroNodi": 4,
			 "NumeroArchi": 0,
			 "children": [
			 ]},
			{"Node": 3155,
			 "Coreness": 3,
			 "minCoreness":  3,
			 "maxCoreness": 3,
			 "NumeroNodi": 8,
			 "NumeroArchi": 0,
			 "children": [
			 ]},
			{"Node": 3142,
			 "Coreness": 3,
			 "minCoreness":  3,
			 "maxCoreness": 3,
			 "NumeroNodi": 4,
			 "NumeroArchi": 0,
			 "children": [
			 ]},
			{"Node": 3154,
			 "Coreness": 3,
			 "minCoreness":  3,
			 "maxCoreness": 3,
			 "NumeroNodi": 10,
			 "NumeroArchi": 0,
			 "children": [
			 ]},
			{"Node": 3153,
			 "Coreness": 3,
			 "minCoreness":  3,
			 "maxCoreness": 3,
			 "NumeroNodi": 12,
			 "NumeroArchi": 0,
			 "children": [
			 ]},
			{"Node": 3152,
			 "Coreness": 3,
			 "minCoreness":  3,
			 "maxCoreness": 3,
			 "NumeroNodi": 19,
			 "NumeroArchi": 0,
			 "children": [
			 ]},
			{"Node": 3141,
			 "Coreness": 3,
			 "minCoreness":  3,
			 "maxCoreness": 3,
			 "NumeroNodi": 5,
			 "NumeroArchi": 0,
			 "children": [
			 ]},
			{"Node": 3140,
			 "Coreness": 3,
			 "minCoreness":  3,
			 "maxCoreness": 3,
			 "NumeroNodi": 5,
			 "NumeroArchi": 0,
			 "children": [
			 ]},
			{"Node": 3137,
			 "Coreness": 3,
			 "minCoreness":  3,
			 "maxCoreness": 3,
			 "NumeroNodi": 5,
			 "NumeroArchi": 0,
			 "children": [
			 ]},
			{"Node": 3139,
			 "Coreness": 3,
			 "minCoreness":  3,
			 "maxCoreness": 3,
			 "NumeroNodi": 8,
			 "NumeroArchi": 0,
			 "children": [
			 ]},
			{"Node": 3138,
			 "Coreness": 3,
			 "minCoreness":  3,
			 "maxCoreness": 3,
			 "NumeroNodi": 5,
			 "NumeroArchi": 0,
			 "children": [
			 ]},
			{"Node": 3136,
			 "Coreness": 3,
			 "minCoreness":  3,
			 "maxCoreness": 3,
			 "NumeroNodi": 6,
			 "NumeroArchi": 0,
			 "children": [
			 ]}		 ]}	 ]} ]
}