{
	"nodes": [
		{"id": 0, "rotationScheme": ["e11","e10","e0","e15"]},
		{"id": 1, "rotationScheme": ["e9","e17","e4","e0"]},
		{"id": 2, "rotationScheme": ["e12","e19","e7","e5"]},
		{"id": 3, "rotationScheme": ["e14","e13","e5"]},
		{"id": 4, "rotationScheme": ["e6","e7","e2"]},
		{"id": 5, "rotationScheme": ["e8","e17","e3","e1","e19"]},
		{"id": 6, "rotationScheme": ["e9","e10","e16","e3"]},
		{"id": 7, "rotationScheme": ["e11","e18","e2","e1","e16"]},
		{"id": 8, "rotationScheme": ["e12","e13","e8"]},
		{"id": 9, "rotationScheme": ["e14","e6","e18","e15","e4"]}
	],

	"edges": [
		{"id": "e0", "u": 0, "v": 1},
		{"id": "e1", "u": 7, "v": 5},
		{"id": "e2", "u": 7, "v": 4},
		{"id": "e3", "u": 6, "v": 5},
		{"id": "e4", "u": 1, "v": 9},
		{"id": "e5", "u": 2, "v": 3},
		{"id": "e6", "u": 9, "v": 4},
		{"id": "e7", "u": 4, "v": 2},
		{"id": "e8", "u": 8, "v": 5},
		{"id": "e9", "u": 1, "v": 6},
		{"id": "e10", "u": 6, "v": 0},
		{"id": "e11", "u": 0, "v": 7},
		{"id": "e12", "u": 2, "v": 8},
		{"id": "e13", "u": 8, "v": 3},
		{"id": "e14", "u": 3, "v": 9},
		{"id": "e15", "u": 9, "v": 0},
		{"id": "e16", "u": 6, "v": 7},
		{"id": "e17", "u": 1, "v": 5},
		{"id": "e18", "u": 9, "v": 7},
		{"id": "e19", "u": 5, "v": 2}
	]
}

