(kicad_sch (version 20230121) (generator eeschema)

  (uuid 571ad08e-6e96-4dc3-8fb9-a02ccebd79e7)

  (paper "A4")

  (title_block
    (title "ChipSat-1")
    (date "2023-03-17")
    (rev "1.2")
    (company "Université du Luxembourg")
    (comment 1 "SpaSys")
  )

  (lib_symbols
    (symbol "power:GND" (power) (pin_names (offset 0)) (in_bom yes) (on_board yes)
      (property "Reference" "#PWR" (at 0 -6.35 0)
        (effects (font (size 1.27 1.27)) hide)
      )
      (property "Value" "GND" (at 0 -3.81 0)
        (effects (font (size 1.27 1.27)))
      )
      (property "Footprint" "" (at 0 0 0)
        (effects (font (size 1.27 1.27)) hide)
      )
      (property "Datasheet" "" (at 0 0 0)
        (effects (font (size 1.27 1.27)) hide)
      )
      (property "ki_keywords" "power-flag" (at 0 0 0)
        (effects (font (size 1.27 1.27)) hide)
      )
      (property "ki_description" "Power symbol creates a global label with name \"GND\" , ground" (at 0 0 0)
        (effects (font (size 1.27 1.27)) hide)
      )
      (symbol "GND_0_1"
        (polyline
          (pts
            (xy 0 0)
            (xy 0 -1.27)
            (xy 1.27 -1.27)
            (xy 0 -2.54)
            (xy -1.27 -1.27)
            (xy 0 -1.27)
          )
          (stroke (width 0) (type default))
          (fill (type none))
        )
      )
      (symbol "GND_1_1"
        (pin power_in line (at 0 0 270) (length 0) hide
          (name "GND" (effects (font (size 1.27 1.27))))
          (number "1" (effects (font (size 1.27 1.27))))
        )
      )
    )
    (symbol "power:GND1" (power) (pin_names (offset 0)) (in_bom yes) (on_board yes)
      (property "Reference" "#PWR" (at 0 -6.35 0)
        (effects (font (size 1.27 1.27)) hide)
      )
      (property "Value" "GND1" (at 0 -3.81 0)
        (effects (font (size 1.27 1.27)))
      )
      (property "Footprint" "" (at 0 0 0)
        (effects (font (size 1.27 1.27)) hide)
      )
      (property "Datasheet" "" (at 0 0 0)
        (effects (font (size 1.27 1.27)) hide)
      )
      (property "ki_keywords" "power-flag" (at 0 0 0)
        (effects (font (size 1.27 1.27)) hide)
      )
      (property "ki_description" "Power symbol creates a global label with name \"GND1\" , ground" (at 0 0 0)
        (effects (font (size 1.27 1.27)) hide)
      )
      (symbol "GND1_0_1"
        (polyline
          (pts
            (xy 0 0)
            (xy 0 -1.27)
            (xy 1.27 -1.27)
            (xy 0 -2.54)
            (xy -1.27 -1.27)
            (xy 0 -1.27)
          )
          (stroke (width 0) (type default))
          (fill (type none))
        )
      )
      (symbol "GND1_1_1"
        (pin power_in line (at 0 0 270) (length 0) hide
          (name "GND1" (effects (font (size 1.27 1.27))))
          (number "1" (effects (font (size 1.27 1.27))))
        )
      )
    )
    (symbol "power:GND2" (power) (pin_names (offset 0)) (in_bom yes) (on_board yes)
      (property "Reference" "#PWR" (at 0 -6.35 0)
        (effects (font (size 1.27 1.27)) hide)
      )
      (property "Value" "GND2" (at 0 -3.81 0)
        (effects (font (size 1.27 1.27)))
      )
      (property "Footprint" "" (at 0 0 0)
        (effects (font (size 1.27 1.27)) hide)
      )
      (property "Datasheet" "" (at 0 0 0)
        (effects (font (size 1.27 1.27)) hide)
      )
      (property "ki_keywords" "power-flag" (at 0 0 0)
        (effects (font (size 1.27 1.27)) hide)
      )
      (property "ki_description" "Power symbol creates a global label with name \"GND2\" , ground" (at 0 0 0)
        (effects (font (size 1.27 1.27)) hide)
      )
      (symbol "GND2_0_1"
        (polyline
          (pts
            (xy 0 0)
            (xy 0 -1.27)
            (xy 1.27 -1.27)
            (xy 0 -2.54)
            (xy -1.27 -1.27)
            (xy 0 -1.27)
          )
          (stroke (width 0) (type default))
          (fill (type none))
        )
      )
      (symbol "GND2_1_1"
        (pin power_in line (at 0 0 270) (length 0) hide
          (name "GND2" (effects (font (size 1.27 1.27))))
          (number "1" (effects (font (size 1.27 1.27))))
        )
      )
    )
  )

  (junction (at 152.4 87.63) (diameter 0) (color 0 0 0 0)
    (uuid 3394ec56-e29b-4016-bab8-aa7c6568ab5d)
  )
  (junction (at 92.71 99.06) (diameter 0) (color 0 0 0 0)
    (uuid 4f44f176-139e-4ad8-b426-c26c7d175908)
  )
  (junction (at 90.17 96.52) (diameter 0) (color 0 0 0 0)
    (uuid 707fd7d6-d2d5-4a8e-bcdb-45562f1d19b5)
  )

  (wire (pts (xy 92.71 81.28) (xy 92.71 99.06))
    (stroke (width 0) (type default))
    (uuid 1c2b1b21-3826-465a-97f6-8a3adb405457)
  )
  (wire (pts (xy 90.17 96.52) (xy 97.79 96.52))
    (stroke (width 0) (type default))
    (uuid 3f09a949-f79b-4a83-8cc8-fe1a769c7cca)
  )
  (wire (pts (xy 90.17 78.74) (xy 97.79 78.74))
    (stroke (width 0) (type default))
    (uuid 452f7a24-78b5-49b5-8619-4bfbfcd8fbd1)
  )
  (wire (pts (xy 92.71 81.28) (xy 97.79 81.28))
    (stroke (width 0) (type default))
    (uuid 48fd3757-72e4-4c14-a061-4ac6d23e803e)
  )
  (wire (pts (xy 97.79 118.11) (xy 92.71 118.11))
    (stroke (width 0) (type default))
    (uuid 766fd0f9-d3d8-43b9-bccd-81b164027d4b)
  )
  (wire (pts (xy 90.17 78.74) (xy 90.17 96.52))
    (stroke (width 0) (type default))
    (uuid 873ad06d-a320-4102-8755-bf067c14dce1)
  )
  (wire (pts (xy 152.4 87.63) (xy 160.02 87.63))
    (stroke (width 0) (type default))
    (uuid b177cdc8-0c89-44b2-8215-fdf2ea172db5)
  )
  (wire (pts (xy 90.17 115.57) (xy 90.17 96.52))
    (stroke (width 0) (type default))
    (uuid b9ab7cc9-c09a-4943-97a6-55cda7ad1990)
  )
  (wire (pts (xy 92.71 99.06) (xy 97.79 99.06))
    (stroke (width 0) (type default))
    (uuid b9ed12d2-7623-4b66-8e26-da3b32ef544f)
  )
  (wire (pts (xy 144.78 87.63) (xy 152.4 87.63))
    (stroke (width 0) (type default))
    (uuid c37a5622-3cd1-4d3d-aa5e-089aacbe06d3)
  )
  (wire (pts (xy 92.71 118.11) (xy 92.71 99.06))
    (stroke (width 0) (type default))
    (uuid d40a8a8a-50ec-4927-8d57-d43da92feff8)
  )
  (wire (pts (xy 97.79 115.57) (xy 90.17 115.57))
    (stroke (width 0) (type default))
    (uuid f9576bec-f1ee-4d62-81be-426260c07b37)
  )

  (text "Due to interface with mothercraft, the grounds should be common"
    (at 144.78 85.09 0)
    (effects (font (size 1.27 1.27)) (justify left bottom))
    (uuid 1c0e960c-9913-4073-b781-4eab6ba4cdc8)
  )
  (text "Connect inhibit inputs\nto external interface" (at 85.09 99.06 0)
    (effects (font (size 1.27 1.27)) (justify right bottom))
    (uuid 1d4002f9-ef24-4b08-ad74-d09ff433d108)
  )

  (symbol (lib_id "power:GND") (at 144.78 87.63 0) (unit 1)
    (in_bom yes) (on_board yes) (dnp no) (fields_autoplaced)
    (uuid 81f00fc3-c824-4ffb-9401-b229c1bf93fa)
    (property "Reference" "#PWR0101" (at 144.78 93.98 0)
      (effects (font (size 1.27 1.27)) hide)
    )
    (property "Value" "GND" (at 144.78 92.71 0)
      (effects (font (size 1.27 1.27)))
    )
    (property "Footprint" "" (at 144.78 87.63 0)
      (effects (font (size 1.27 1.27)) hide)
    )
    (property "Datasheet" "" (at 144.78 87.63 0)
      (effects (font (size 1.27 1.27)) hide)
    )
    (pin "1" (uuid 55e450a3-fe48-4319-99a3-a658286b9025))
    (instances
      (project "PCB"
        (path "/571ad08e-6e96-4dc3-8fb9-a02ccebd79e7"
          (reference "#PWR0101") (unit 1)
        )
      )
    )
  )

  (symbol (lib_id "power:GND1") (at 152.4 87.63 0) (unit 1)
    (in_bom yes) (on_board yes) (dnp no) (fields_autoplaced)
    (uuid 8df049c9-f68c-4a6a-85ed-b7a96a6f93eb)
    (property "Reference" "#PWR0102" (at 152.4 93.98 0)
      (effects (font (size 1.27 1.27)) hide)
    )
    (property "Value" "GND1" (at 152.4 92.71 0)
      (effects (font (size 1.27 1.27)))
    )
    (property "Footprint" "" (at 152.4 87.63 0)
      (effects (font (size 1.27 1.27)) hide)
    )
    (property "Datasheet" "" (at 152.4 87.63 0)
      (effects (font (size 1.27 1.27)) hide)
    )
    (pin "1" (uuid f6f22e82-147d-41d0-b355-6371dc5d1ee3))
    (instances
      (project "PCB"
        (path "/571ad08e-6e96-4dc3-8fb9-a02ccebd79e7"
          (reference "#PWR0102") (unit 1)
        )
      )
    )
  )

  (symbol (lib_id "power:GND2") (at 160.02 87.63 0) (unit 1)
    (in_bom yes) (on_board yes) (dnp no) (fields_autoplaced)
    (uuid 95cd042b-c8fb-4fd4-bdc2-08f9940558e9)
    (property "Reference" "#PWR0103" (at 160.02 93.98 0)
      (effects (font (size 1.27 1.27)) hide)
    )
    (property "Value" "GND2" (at 160.02 92.71 0)
      (effects (font (size 1.27 1.27)))
    )
    (property "Footprint" "" (at 160.02 87.63 0)
      (effects (font (size 1.27 1.27)) hide)
    )
    (property "Datasheet" "" (at 160.02 87.63 0)
      (effects (font (size 1.27 1.27)) hide)
    )
    (pin "1" (uuid 2a9b3767-e64c-4e77-8902-ef43f9347da8))
    (instances
      (project "PCB"
        (path "/571ad08e-6e96-4dc3-8fb9-a02ccebd79e7"
          (reference "#PWR0103") (unit 1)
        )
      )
    )
  )

  (sheet (at 97.79 73.66) (size 34.29 12.7) (fields_autoplaced)
    (stroke (width 0.1524) (type solid))
    (fill (color 0 0 0 0.0000))
    (uuid 3f0a593a-f5d6-4037-a904-84b77fcf44ec)
    (property "Sheetname" "212" (at 97.79 72.9484 0)
      (effects (font (size 1.27 1.27)) (justify left bottom))
    )
    (property "Sheetfile" "212.kicad_sch" (at 97.79 86.9446 0)
      (effects (font (size 1.27 1.27)) (justify left top))
    )
    (pin "VOUT" output (at 97.79 76.2 180)
      (effects (font (size 1.27 1.27)) (justify left))
      (uuid 6aaa6fff-435e-47c6-8fd5-224b7f8e2d0a)
    )
    (pin "VOUT_EN" input (at 97.79 78.74 180)
      (effects (font (size 1.27 1.27)) (justify left))
      (uuid a412fe1a-7ba3-457c-a97f-9dc831b2425e)
    )
    (pin "INHIBIT_+" input (at 97.79 81.28 180)
      (effects (font (size 1.27 1.27)) (justify left))
      (uuid 0abb9872-e7a5-4746-b2bb-9dac6caa8199)
    )
    (pin "INHIBIT_-" input (at 97.79 83.82 180)
      (effects (font (size 1.27 1.27)) (justify left))
      (uuid 14facb94-5b2d-41cd-9875-5d171e8c85ff)
    )
    (instances
      (project "PCB"
        (path "/571ad08e-6e96-4dc3-8fb9-a02ccebd79e7" (page "2"))
      )
    )
  )

  (sheet (at 97.79 111.76) (size 34.29 11.43) (fields_autoplaced)
    (stroke (width 0.1524) (type solid))
    (fill (color 0 0 0 0.0000))
    (uuid bac338f8-f1c8-4363-a70f-c8328c96efda)
    (property "Sheetname" "211B" (at 97.79 111.0484 0)
      (effects (font (size 1.27 1.27)) (justify left bottom))
    )
    (property "Sheetfile" "211B.kicad_sch" (at 97.79 123.7746 0)
      (effects (font (size 1.27 1.27)) (justify left top))
    )
    (pin "INHIBIT_+" input (at 97.79 118.11 180)
      (effects (font (size 1.27 1.27)) (justify left))
      (uuid b2ff764f-f6ae-40af-85ef-7d1d5c523ca5)
    )
    (pin "INHIBIT_-" input (at 97.79 120.65 180)
      (effects (font (size 1.27 1.27)) (justify left))
      (uuid b78537b9-742d-4e80-b120-011f572d8d36)
    )
    (pin "VOUT_EN" input (at 97.79 115.57 180)
      (effects (font (size 1.27 1.27)) (justify left))
      (uuid c7a3cda0-5f61-4919-b8e6-77670ff77ffb)
    )
    (instances
      (project "PCB"
        (path "/571ad08e-6e96-4dc3-8fb9-a02ccebd79e7" (page "4"))
      )
    )
  )

  (sheet (at 97.79 92.71) (size 34.29 11.43) (fields_autoplaced)
    (stroke (width 0.1524) (type solid))
    (fill (color 0 0 0 0.0000))
    (uuid d012688b-7a14-45be-8853-ccc0dc10dc71)
    (property "Sheetname" "211A" (at 97.79 91.9984 0)
      (effects (font (size 1.27 1.27)) (justify left bottom))
    )
    (property "Sheetfile" "211A.kicad_sch" (at 97.79 104.7246 0)
      (effects (font (size 1.27 1.27)) (justify left top))
    )
    (pin "INHIBIT_-" input (at 97.79 101.6 180)
      (effects (font (size 1.27 1.27)) (justify left))
      (uuid 8e90381f-e6ee-404b-bbd5-02ecf17f62c4)
    )
    (pin "INHIBIT_+" input (at 97.79 99.06 180)
      (effects (font (size 1.27 1.27)) (justify left))
      (uuid c09880d2-9109-4654-ad0a-cf524f95a752)
    )
    (pin "VOUT_EN" input (at 97.79 96.52 180)
      (effects (font (size 1.27 1.27)) (justify left))
      (uuid eb54133a-5d52-43c0-ad2d-6c475bc7a0da)
    )
    (instances
      (project "PCB"
        (path "/571ad08e-6e96-4dc3-8fb9-a02ccebd79e7" (page "3"))
      )
    )
  )

  (sheet_instances
    (path "/" (page "1"))
  )
)
