1
43
47
48
49
51
58
59
70
77
86
87
93
96
99
106
107
111
118
119
127
135
137
138
176
178
179
180
185
186
190
196
199
203
204
205
207
227
232
236
239
243
247
249
262
264
273
279
284
288
289
305
309
311
323
379
385
389
424
428
441
449
461
463
464
469
470
487
496
500
502
525
529
535
546
554
558
564
586
587
588
594
595
597
599
602
611
614
617
648
649
650
654
668
670
673
674
681
700
724
725
729
738
743
750
751
752
753
754
757
773
774
778
779
782
787
790
798
802
811
833
834
836
846
847
849
857
865
866
867
873
876
887
892
896
899
903
910
916
936
938
964
967
970
971
978
979
985
987
988
994
996
997
998
999
1004
1005
1014
1015
1018
1021
1023
1029
1032
1044
1045
1050
1051
1057
1060
1066
1076
1081
1088
1102
1103
1110
1118
1123
1130
1135
1148
1153
1174
1175
1176
1178
1182
1188
1195
1198
1413
1615
1669
1826
1832
1833
1983
2153
2249
2266
2366
2526
2969
3100
3134
3690
3744
3776
3845
3848
3893
4093
4171
4650
4671
4737
4845
5105
5192
5202
5281
5312
5320
5431
5610
5699
5780
5789
5810
5816
5852
5862
5879
5884
5885
5886
5892
5950
5951
5957
5958
5960
5961
5962
5988
5997
6022
6029
6030
6031
6036
6037
6043
6047
6050
6057
6076
6083
6106
6119
6131
6132
6133
6137
6140
6166
6175
6176
6180
6213
6255
6262
6267
6274
6287
6288
6305
6306
6322
6575
6590
6613
6657
6675
6723
6912
6919
7027
7057
7302
7339
7341
7345
7362
7363
7405
7420
7427
7628
7680
7902
7921
7922
7967
7971
7976
7991
8029
8082
8094
8096
8113
8158
8180
8215
8221
8263
8314
8376
8449
8629
8742
8871
8892
9061
9085
9260
9378
9475
9700
9750
9934
10140
10238
10256
10258
10267
10341
10413
10430
10457
10458
10465
10467
10468
10469
10470
10471
10690
10742
10917
10931
10972
11005
11146
11163
11197
11234
11266
11333
11427
11579
11686
11701
11850
11970
12025
12035
12046
12377
12473
12530
12591
12599
12647
13130
13711
13730
13804
13849
13945
14180
14900
15104
15459
15816
15993
16118
16757
16898
17085
17106
18950
19236
20245
20724
21236
21643
21672
21859
22207
22880
23524
24066
24139
24417
24699
25310
25701
27476
28782
31246
31268
32196
33002
33022
33032
33037
34756
35717
36247
37464
41211
57449
60961
61265
61503
64689
64956
64959
64960
64969
64982
65040
65063
65065
65072
65095
65249
65359
65533
66535
66868
67427
67678
68144
68152
68310
68368
68841
68867
68934
69217
69362
69507
69522
69602
70912
70914
70941
71070
71080
71602
72259
72924
74190
74839
74865
75619
75725
75810
76152
76807
76808
78168
79025
79050
79803
80283
81152
81596
81721
83697
84571
84740
84951
85362
85744
86555
87071
87642
88079
89594
91482
91493
91518
91528
91586
92109
92133
92146
92153
92181
92258
92753
92779
92817
92829
92832
92843
92851
92865
92904
92907
92918
92953
93078
93556
94154
94214
94216
94270
94309
94448
94715
96373
96799
96801
96814
97165
97328
97364
97417
98009
98681
99289
99478
99823
99824
100130
100714
101812
102926
102950
107475
107526
107689
107737
107738
107812
108079
110992
111299
112072
114861
115015
119570
120639
121396
121991
122331
122336
122356
122357
123701
123727
123831
123938
123966
124886
125468
126154
127370
128841
130418
133383
135191
136460
145742
145815
150964
151014
151023
151134
151282
151410
151438
151446
152109
152314
152416
154035
159664
160130
160556
161166
161368
161466
161658
161712
161930
164628
164860
165007
166760
168058
168379
168934
169019
171548
173909
174541
182230
189008
189028
189156
193232
193530
193653
193804
194080
221493
222285
222656
246983
250154
250388
273260
348154
352019
417358
418040
439153
439155
439156
439160
439162
439167
439168
439174
439176
439177
439178
439184
439186
439190
439202
439213
439216
439217
439224
439232
439233
439235
439242
439255
439258
439280
439281
439284
439312
439322
439353
439357
439358
439373
439400
439423
439427
439434
439498
439503
439524
439531
439535
439586
439691
439715
439716
439744
439750
439829
439871
439918
439939
439960
439994
439998
440046
440080
440103
440104
440121
440122
440159
440473
440568
440569
440641
440658
440667
440731
440832
440875
440995
440996
441422
441467
441476
441477
441478
442011
442424
443244
443563
443849
444109
444212
444266
444493
444523
444539
444899
444972
445127
445238
445262
445408
445580
445638
445639
445675
445858
445894
445929
446101
446284
446495
448580
449407
451388
452306
460602
460604
493570
493591
497299
515717
517030
517460
517543
520194
520298
546304
637775
643327
643757
643798
643975
643976
644109
644169
657272
736715
854070
1548897
1548899
1549344
1550278
1551339
1551340
1551643
1615663
1809010
2723872
2724705
2724794
2781043
3013625
3014237
3017884
3034646
3035026
3035456
3036640
3036931
3037582
3038401
3081385
3083779
3246953
3375152
3382778
3648225
3651426
3698251
3702506
3819775
3952518
4068592
4083111
4099458
4161539
4300518
4369395
4448381
4462283
4564493
4651717
4737557
4755801
4874812
5003412
5081328
5152822
5153580
5200225
5231440
5232324
5237032
5245668
5245672
5246008
5246487
5247114
5248709
5255803
5255805
5257127
5260155
5280335
5280450
5280581
5280802
5280879
5280933
5280934
5281116
5281119
5281120
5281123
5281127
5281163
5281786
5281969
5282745
5282761
5282767
5282768
5282805
5283387
5283446
5283450
5283454
5284583
5287708
5288979
5288991
5289590
5312414
5312435
5312441
5312508
5312513
5312517
5312519
5312529
5312547
5318023
5318367
5318518
5318532
5351619
5354342
5359254
5459861
5459864
5459914
5460044
5460291
5460362
5460448
5460495
5460674
5461103
5462190
5484352
5488196
5497143
5497181
5539777
6101690
6161490
6323381
6347578
6419721
6419722
6426851
6426853
6426896
6426901
6426903
6427003
6437359
6439678
6439848
6441454
6443013
6453952
6602431
6602434
6857410
6857552
6857581
6918986
6923516
6925665
6926437
6942100
6950207
6951085
6951124
6951210
6971009
6971018
6971019
6971022
6971029
6971033
6971044
6971047
6971051
6971053
6971056
6971061
6971062
6971063
6971251
6971252
6971294
6991974
6991977
6991978
6991982
6992003
6992010
6992072
6992086
6992087
6992089
6992096
6992098
6992099
6992100
6992101
6992102
6992103
6992112
6992114
6992128
6992129
6992130
6992293
6992295
6992309
6992310
6992318
6992319
6992341
6992367
6992372
6992383
6992386
6992394
6992563
6992637
6992638
6992639
6992640
6992643
6992654
6992697
6992868
6992869
6993038
6993039
6993089
6993090
6993110
6993111
6993117
6993118
6993119
6993120
6993123
6993386
6994980
6995276
6997289
7009553
7009554
7009555
7009559
7009560
7009561
7009567
7009576
7009577
7009595
7009596
7009597
7009598
7009607
7009623
7009625
7009630
7009649
7009650
7009663
7010493
7010499
7010521
7010531
7010532
7010533
7010534
7010567
7010568
7010579
7010580
7015694
7015695
7016044
7016045
7016077
7016078
7016079
7016080
7016103
7016114
7018721
7019080
7019081
7019082
7019083
7019084
7019085
7019109
7019110
7019989
7019992
7019993
7020101
7020102
7020105
7020106
7020158
7020159
7020163
7020200
7020201
7020901
7020902
7021456
7021815
7021816
7021827
7021828
7021830
7021870
7021871
7023106
7023107
7043901
7045767
7045798
7048523
7058174
7068808
7079600
7079601
7081594
7082009
7098621
7311724
7311725
7311726
7359121
7359122
7408078
7408079
7408133
7408194
7408195
7408624
7408625
9547068
9547069
9547071
9548602
9816473
9835868
9900065
9991606
10104953
10177002
10197711
10243361
10375946
10400039
10427569
10465398
10557014
10859892
10897651
11005824
11215652
11217234
11471380
11583971
11722594
11792612
11805205
11902892
11902893
12285879
12313370
12650900
12691389
13012726
13767083
14160009
14178779
14237629
14239303
14704021
15030923
15341575
15560222
16035470
16048618
16061120
16061132
16066475
16066476
16081932
16663321
16734910
16738686
18653118
18676629
18877593
18971002
19347555
19782904
20055371
20057275
20130941
20144841
20488062
20849086
21125948
21225084
21883788
21952380
21961011
21980959
22066174
22169124
22419314
22486802
22494954
22494956
22675590
22833510
22833524
22833596
23322899
23379797
23443619
23511544
23583984
23592950
24762165
24771808
24779456
24779458
24779461
24779463
24779476
24779491
24779494
24798687
24949895
25172310
25200477
25200642
25200752
25201103
25201243
25201623
25202002
25202874
25243997
25244088
25244553
25244659
25244769
25244873
25244978
25245041
25245858
25245862
25246222
25246272
25246407
40846588
42607465
42607484
44123456
44202063
44205804
44207815
44272391
44338232
44367445
44369076
44369145
45360331
46224610
46891690
46906042
49791955
49791978
52921800
52924051
52924053
52925129
52925130
53439214
53448507
53461858
53477713
53477718
53477823
53480467
53480919
53480920
53480921
53480922
53480923
53480924
53480925
53480926
53480931
53480932
53480933
53480936
53480938
53480940
53481653
53813767
54029176
54405190
54670067
57383916
57397078
57397101
57397115
57509571
57521647
57525501
57689797
58114173
58177709
58177710
58663891
59119146
59366488
59658623
60041248
61158071
70679121
71318433
71318435
71347543
71371114
71402235
71429009
71464477
71464481
71514783
71586757
71587802
71728363
71768149
71768151
71768169
71768172
71774817
73981715
75213081
75595895
76963096
78093979
85115123
86289642
86289643
86289656
86289660
86289662
86289663
86289666
86289672
86289687
86289688
86289690
86289691
86289692
86289693
86289694
86289695
86289696
86289697
86289698
86289699
86289700
86289701
86289702
86289703
86289704
86289705
86289706
86289707
86289708
86289709
86289730
86289731
86289738
86289739
86289742
86289743
86289744
86289750
86289752
86289753
86289754
86289755
86289756
86289757
86289758
86289759
86289760
86289761
86289762
86289763
86289765
86289766
86289767
86289768
86289769
86289770
86289771
86289772
86289773
86289774
86289775
86289776
86289777
86289778
86289779
86289780
86289781
86289782
86289783
86289784
86289785
86289786
86289787
86289788
86289789
86289790
86289791
86289792
86289793
86289794
86289795
86289796
86289797
86289798
86289814
86289816
86289818
86289819
86289820
86289821
86289822
86289823
86289824
86289825
86289826
86289827
86289828
86289829
86289830
86289844
86289846
86289847
86289848
86289849
86289850
86289851
86289852
86289853
86289854
86289855
86289856
86289857
86289858
86289859
86289885
86289886
86289887
86289888
86289889
86289890
86289891
86289892
86289893
86289894
86289895
86289896
86289897
86289898
86289899
86289900
86289901
86289902
86290042
88113319
88733505
88747248
88747398
90657370
90657394
90657442
90657684
90657965
90913566
91704044
92042745
101039148
101415075
117629482
118343040
118523814
118796870
118796935
118797961
118797962
118797963
121232662
121489511
122164832
122198194
131750879
131750925
131752248
131752249
131752727
131753062
131770061
132282383
132282388
132282392
132472379
132472380
134895646
135369651
135372298
135372455
135373086
135373094
135398556
135398563
135398570
135398595
135398599
135398602
135398619
135398631
135398633
135398634
135398635
135398638
135398640
135398641
135398643
135398653
135398658
135398670
135398700
135398727
135398728
135408877
135420630
135433595
135440064
135445750
135464078
135476781
135529112
135911932
136219920
137319715
138628585
139057051
139060126
139148732
146015339
154573386
156274072
168007633
171116407
171390563
