6
19
48
51
58
59
61
70
71
72
85
86
87
96
98
105
111
119
128
129
133
134
135
137
176
177
187
190
199
204
239
241
243
248
249
264
278
280
281
284
296
305
311
321
323
338
379
428
457
469
472
473
496
516
525
547
561
586
587
599
611
612
647
649
668
673
681
683
700
702
706
712
724
729
750
751
753
757
760
763
767
768
773
774
780
781
788
790
798
803
811
880
887
890
892
896
903
910
916
928
936
938
951
967
970
971
979
980
984
985
996
998
1001
1005
1014
1015
1021
1024
1029
1045
1049
1050
1051
1052
1053
1054
1055
1060
1088
1102
1103
1110
1112
1123
1130
1132
1135
1145
1146
1148
1153
1174
1175
1176
1179
1188
1194
1195
1198
1669
1738
1826
1983
2244
2513
2519
2526
2682
2764
2796
2907
2966
2969
3469
3562
3689
3767
3845
3955
4055
4462
4510
4687
4971
5202
5281
5350
5610
5754
5757
5778
5779
5780
5789
5793
5816
5839
5862
5870
5881
5884
5886
5893
5896
5920
5943
5950
5951
5957
5958
5960
5961
5962
5988
5994
5997
6013
6022
6030
6031
6036
6047
6057
6058
6076
6083
6106
6128
6131
6132
6133
6137
6140
6176
6238
6255
6262
6267
6274
6287
6288
6305
6306
6322
6325
6329
6338
6354
6597
6613
6723
6736
6816
6912
7102
7339
7405
7902
8094
8158
8629
8948
8955
9305
9308
9700
9750
9903
10133
10214
10238
10267
10413
10635
10889
10918
11005
11146
11811
12296
12404
12575
12594
12599
12620
13130
13597
13805
13945
14181
14985
15047
15103
15625
15993
16950
17106
17473
18058
18068
18189
18950
19235
21706
22069
22253
22880
23327
24139
24472
24766
25076
28091
31229
31515
33032
33576
34756
38347
39763
41635
60823
60961
61106
61503
64689
65063
65065
65070
65076
65091
65094
65110
65125
65127
65150
65359
65533
65543
65559
65728
66416
67678
68841
69507
69828
70914
73268
73323
74426
74688
75834
77213
79014
79025
79050
79076
80349
81261
82400
83814
83939
83944
83967
83970
83998
87642
91451
91486
91493
91552
92133
92135
92136
92153
92746
92753
92854
93072
93556
94140
94715
97535
98504
99470
99735
100252
101770
102175
104756
104757
104994
105020
105021
105024
105074
107669
107689
107722
107737
107758
107812
114926
115254
115311
119399
119405
121893
121920
121935
121948
121969
121992
122108
122136
122196
122283
122312
122328
122356
122357
123727
123743
123912
123929
123938
123953
123976
123991
124886
124970
124999
127296
128419
130805
130881
134601
145692
145742
150629
150841
150901
157837
158781
159296
160556
160603
160617
160663
160666
160913
161166
161234
161491
161500
164800
165007
165388
165390
165435
165436
165491
165609
165620
166760
167685
167760
168038
168166
169621
170404
171548
172198
173183
174549
186907
188803
189122
192722
192826
193305
193396
193425
193475
221493
222656
222786
246983
252379
281966
301590
321710
439153
439155
439160
439162
439165
439167
439168
439176
439182
439183
439184
439186
439190
439191
439194
439197
439201
439213
439216
439227
439230
439233
439236
439258
439260
439273
439278
439279
439280
439284
439285
439288
439296
439341
439376
439391
439400
439415
439418
439423
439424
439427
439432
439444
439452
439455
439456
439468
439498
439554
439577
439709
439744
439756
439763
439788
439853
439902
439904
439905
439924
439940
439998
440018
440038
440043
440071
440113
440122
440162
440194
440211
440304
440364
440388
440417
440536
440558
440559
440560
440573
440641
440707
440775
440776
440850
440851
440962
440985
440995
440996
440997
441300
441422
443212
443247
443266
444188
444485
444493
444795
444863
444899
444972
445049
445127
445344
445354
445555
445580
445639
445675
445713
445995
446013
446220
446284
446715
447123
447145
447277
447920
448209
448223
448457
449118
449171
449534
451489
451714
469588
493570
526795
547556
638014
638015
638072
643975
643976
644066
644071
644109
667490
676415
736715
969516
1349907
1549098
1738118
2723872
2733526
2733536
3001028
3032806
3033895
3034794
3036285
3036931
3037043
3037556
3037883
3081055
3081372
3081383
3081439
3081958
3082032
3082152
3082227
4613280
5233914
5280335
5280346
5280352
5280353
5280360
5280363
5280382
5280383
5280393
5280398
5280427
5280450
5280453
5280489
5280490
5280492
5280493
5280497
5280531
5280541
5280592
5280625
5280673
5280745
5280749
5280778
5280795
5280844
5280877
5280878
5280879
5280883
5280892
5280893
5280914
5280915
5280934
5281426
5281915
5281969
5282280
5282360
5282367
5282411
5283078
5283137
5283142
5283144
5283146
5283147
5283157
5283159
5283162
5283169
5283202
5283203
5283204
5283205
5283211
5283560
5283564
5283565
5283572
5283731
5283756
5284235
5284239
5284513
5287993
5289590
5318532
5327099
5360696
5360697
5459811
5459822
5459827
5459829
5459861
5459864
5460048
5460448
5460495
5460855
5462146
5462148
5462190
5462210
5462244
5462266
5497111
5497112
5497113
5497143
5497182
5885531
6323381
6326983
6419712
6435286
6436082
6438629
6439179
6439225
6439678
6441454
6442739
6442740
6442778
6449839
6450190
6453841
6454686
6713940
6857417
6857542
6918831
7048564
7058173
9543037
9543169
9543349
9547180
9547273
9548609
9548885
9549326
9805944
9808022
9862886
9962735
9974249
10062737
10143562
10260120
10368940
10400369
10425706
10434409
10473088
10902296
10975657
10986305
11046191
11046252
11060176
11559259
11559293
11667655
11825433
11828886
11954196
11954197
11958364
11966108
11966110
11966111
11966114
11966121
11966124
11966132
11966142
11966155
11966158
11966160
11966162
11966163
11966169
11966172
11966173
11966175
11966177
11966179
11966190
11966197
11966204
11966205
11966216
11966220
11966295
11988266
12942934
13453453
14212362
14671060
15558498
15590160
15942888
15942889
16042541
16061126
16061142
16069986
16755624
16760025
17756737
17796835
20839325
20849244
21587070
22298942
22833664
23279502
23657851
23724484
23724596
23724597
24755487
24755528
24771772
24830990
24883423
24892715
24892719
24892721
24892725
24892748
24906328
24906329
25010743
25010746
25010760
25137904
25163995
25164091
25195379
25223702
25229584
25242251
25245205
25246198
25271599
25271602
40490622
42608397
42611257
44123502
44176398
44224030
44229245
44251266
44263831
44602421
45100481
45259170
45259180
45266510
45266511
45266891
45266910
45266911
45479489
45480545
46173939
46173940
46173941
46174067
46224536
46224537
46224539
49787001
49835951
49859680
49866558
50986092
50986248
50997229
51351698
52921883
52921886
52921890
52921893
52921894
52921895
52921992
52921998
52921999
52922059
53297445
53297448
53297449
53380302
53432205
53477499
53477501
53477502
53477503
53477567
53477671
53477675
53477679
53477715
53477912
53480223
53481405
53481688
53936469
54670067
55289370
55300606
56927827
56927863
56927872
56927874
56927876
56927904
56927907
56927909
56927910
56927911
56927963
56927965
56927970
56927971
56927972
56927973
56927974
56927977
56927978
56927981
56927982
56928001
56928006
56928012
56928013
56928014
59385584
70678653
70678705
70678715
70678741
70698368
71448892
71508666
71627307
72193709
72193760
72204623
72204812
72204813
72205182
72715842
86289617
86289912
86583344
88956918
89101936
90218097
90659875
91820303
92136116
101600091
101894912
102330427
102397186
102571773
118987287
118987288
122198250
122368871
122391250
129626613
131983349
132282523
132282526
132282527
132282529
132282530
132282531
132282532
132472310
132472315
132849242
134820283
135398556
135398561
135398565
135398574
135398581
135398585
135398597
135398599
135398604
135398610
135398614
135398616
135398619
135398621
135398623
135398627
135398631
135398633
135398634
135398638
135398640
135398641
135398643
135398650
135398651
135398652
135398655
135398657
135398658
135398661
135398667
135398687
135398695
135398701
135398724
135398735
135400185
135402010
135402041
135402045
135405047
135412609
135415876
135437103
135439316
135440063
135444742
135445750
135450591
135471108
135476778
135476780
135476784
135488904
135565291
135566401
135567131
135567132
136165274
137319715
138402012
139291704
162640002
168475438
