﻿id,cid,dsn,cmpdname,srccmpd,srccmpdname,srccmpdurl,srccmpdkind,taxid,srctax,srctaxname,srctaxurl,taxname,evids,evurls,pmids,dois,citations
   614374,2537,NPASS,Camphor,NPC173996,"4,7,7-Trimethylbicyclo[2.2.1]Heptan-3-One",https://bidd.group/NPASS/compound.php?compoundID=NPC173996,Natural Product,13429,NPO6701,Cinnamomum camphora,https://bidd.group/NPASS/organism.php?org_id=NPO6701,Cinnamomum camphora (camphor tree),NULL,NULL,NULL,NULL,NULL
614888,2537,LOTUS,Camphor,Q181559,Camphor,https://www.wikidata.org/wiki/Q181559,Natural Product,13429,Q158722,Cinnamomum camphora,https://www.wikidata.org/wiki/Q158722,Cinnamomum camphora (camphor tree),DOI:10.1590/S1516-89132000000300011|DOI:10.1080/10412905.1998.9700962|DOI:10.1093/JAT/9.1.24|DOI:10.1080/10412905.1993.9698258,https://doi.org/10.1590/S1516-89132000000300011|https://doi.org/10.1080/10412905.1998.9700962|https://doi.org/10.1093/JAT/9.1.24|https://doi.org/10.1080/10412905.1993.9698258,NULL,10.1590/S1516-89132000000300011|10.1080/10412905.1998.9700962|10.1093/JAT/9.1.24|10.1080/10412905.1993.9698258,https://www.wikidata.org/wiki/Q104374956|https://www.wikidata.org/wiki/Q104374951|https://www.wikidata.org/wiki/Q70076306|https://www.wikidata.org/wiki/Q104374328
615408,2758,LOTUS,Eucalyptol,Q161572,Eucalyptol,https://www.wikidata.org/wiki/Q161572,Natural Product,13429,Q158722,Cinnamomum camphora,https://www.wikidata.org/wiki/Q158722,Cinnamomum camphora (camphor tree),DOI:10.1007/S11418-006-0039-1,https://doi.org/10.1007/S11418-006-0039-1,NULL,10.1007/S11418-006-0039-1,https://www.wikidata.org/wiki/Q50050636
615999,2758,NPASS,Eucalyptol,NPC287331,Eucalyptol,https://bidd.group/NPASS/compound.php?compoundID=NPC287331,Natural Product,13429,NPO6701,Cinnamomum camphora,https://bidd.group/NPASS/organism.php?org_id=NPO6701,Cinnamomum camphora (camphor tree),NULL,NULL,NULL,NULL,NULL
616456,2758,NPASS,Eucalyptol,NPC287331,Eucalyptol,https://bidd.group/NPASS/compound.php?compoundID=NPC287331,Natural Product,13429,NPO6701,Cinnamomum camphora,https://bidd.group/NPASS/organism.php?org_id=NPO6701,Cinnamomum camphora (camphor tree),NULL,NULL,NULL,NULL,NULL
616460,2758,NPASS,Eucalyptol,NPC287331,Eucalyptol,https://bidd.group/NPASS/compound.php?compoundID=NPC287331,Natural Product,13429,NPO6701,Cinnamomum camphora,https://bidd.group/NPASS/organism.php?org_id=NPO6701,Cinnamomum camphora (camphor tree),NULL,NULL,NULL,NULL,NULL
616467,2758,NPASS,Eucalyptol,NPC287331,Eucalyptol,https://bidd.group/NPASS/compound.php?compoundID=NPC287331,Natural Product,13429,NPO6701,Cinnamomum camphora,https://bidd.group/NPASS/organism.php?org_id=NPO6701,Cinnamomum camphora (camphor tree),NULL,NULL,NULL,NULL,NULL
618504,3314,NPASS,Eugenol,NPC257124,Eugenol,https://bidd.group/NPASS/compound.php?compoundID=NPC257124,Natural Product,13429,NPO6701,Cinnamomum camphora,https://bidd.group/NPASS/organism.php?org_id=NPO6701,Cinnamomum camphora (camphor tree),NULL,NULL,NULL,NULL,NULL
618512,3314,NPASS,Eugenol,NPC257124,Eugenol,https://bidd.group/NPASS/compound.php?compoundID=NPC257124,Natural Product,13429,NPO6701,Cinnamomum camphora,https://bidd.group/NPASS/organism.php?org_id=NPO6701,Cinnamomum camphora (camphor tree),NULL,NULL,NULL,NULL,NULL
618513,3314,NPASS,Eugenol,NPC257124,Eugenol,https://bidd.group/NPASS/compound.php?compoundID=NPC257124,Natural Product,13429,NPO6701,Cinnamomum camphora,https://bidd.group/NPASS/organism.php?org_id=NPO6701,Cinnamomum camphora (camphor tree),NULL,NULL,NULL,NULL,NULL
618515,3314,NPASS,Eugenol,NPC257124,Eugenol,https://bidd.group/NPASS/compound.php?compoundID=NPC257124,Natural Product,13429,NPO6701,Cinnamomum camphora,https://bidd.group/NPASS/organism.php?org_id=NPO6701,Cinnamomum camphora (camphor tree),NULL,NULL,NULL,NULL,NULL
619128,3314,LOTUS,Eugenol,Q423357,Eugenol,https://www.wikidata.org/wiki/Q423357,Natural Product,13429,Q158722,Cinnamomum camphora,https://www.wikidata.org/wiki/Q158722,Cinnamomum camphora (camphor tree),DOI:10.1248/CPB.56.97|DOI:10.1007/S11418-006-0039-1,https://doi.org/10.1248/CPB.56.97|https://doi.org/10.1007/S11418-006-0039-1,NULL,10.1248/CPB.56.97|10.1007/S11418-006-0039-1,https://www.wikidata.org/wiki/Q46822578|https://www.wikidata.org/wiki/Q50050636
623053,4276,LOTUS,Myristicin,Q414057,Myristicin,https://www.wikidata.org/wiki/Q414057,Natural Product,13429,Q158722,Cinnamomum camphora,https://www.wikidata.org/wiki/Q158722,Cinnamomum camphora (camphor tree),DOI:10.1246/BCSJ.41.1465,https://doi.org/10.1246/BCSJ.41.1465,NULL,10.1246/BCSJ.41.1465,https://www.wikidata.org/wiki/Q115517177
623324,4458,LOTUS,"3,7-Dimethyl-2,6-octadien-1-ol",Q27109834,"3,7-Dimethyl-2,6-octadien-1-ol",https://www.wikidata.org/wiki/Q27109834,Natural Product,13429,Q158722,Cinnamomum camphora,https://www.wikidata.org/wiki/Q158722,Cinnamomum camphora (camphor tree),DOI:10.1246/NIKKASHI1921.64.1125,https://doi.org/10.1246/NIKKASHI1921.64.1125,NULL,10.1246/NIKKASHI1921.64.1125,https://www.wikidata.org/wiki/Q105011523
626104,5144,LOTUS,Safrole,Q412424,Safrole,https://www.wikidata.org/wiki/Q412424,Natural Product,13429,Q158722,Cinnamomum camphora,https://www.wikidata.org/wiki/Q158722,Cinnamomum camphora (camphor tree),DOI:10.1080/10412905.1993.9698258|DOI:10.1246/NIKKASHI1921.64.1125,https://doi.org/10.1080/10412905.1993.9698258|https://doi.org/10.1246/NIKKASHI1921.64.1125,NULL,10.1080/10412905.1993.9698258|10.1246/NIKKASHI1921.64.1125,https://www.wikidata.org/wiki/Q104374328|https://www.wikidata.org/wiki/Q105011523
626363,5144,NPASS,Safrole,NPC31279,Safrole,https://bidd.group/NPASS/compound.php?compoundID=NPC31279,Natural Product,13429,NPO6701,Cinnamomum camphora,https://bidd.group/NPASS/organism.php?org_id=NPO6701,Cinnamomum camphora (camphor tree),NULL,NULL,NULL,NULL,NULL
626365,5144,NPASS,Safrole,NPC31279,Safrole,https://bidd.group/NPASS/compound.php?compoundID=NPC31279,Natural Product,13429,NPO6701,Cinnamomum camphora,https://bidd.group/NPASS/organism.php?org_id=NPO6701,Cinnamomum camphora (camphor tree),NULL,NULL,NULL,NULL,NULL
627059,5204,LOTUS,Asarinin,Q102015395,Asarinin,https://www.wikidata.org/wiki/Q102015395,Natural Product,13429,Q158722,Cinnamomum camphora,https://www.wikidata.org/wiki/Q158722,Cinnamomum camphora (camphor tree),DOI:10.1021/NP900225P,https://doi.org/10.1021/NP900225P,NULL,10.1021/NP900225P,https://www.wikidata.org/wiki/Q43276618
649347,6549,LOTUS,Linalool,Q410932,Linalool,https://www.wikidata.org/wiki/Q410932,Natural Product,13429,Q158722,Cinnamomum camphora,https://www.wikidata.org/wiki/Q158722,Cinnamomum camphora (camphor tree),DOI:10.1590/S1516-89132000000300011|DOI:10.1021/JF00013A016|DOI:10.1080/10412905.1993.9698258,https://doi.org/10.1590/S1516-89132000000300011|https://doi.org/10.1021/JF00013A016|https://doi.org/10.1080/10412905.1993.9698258,NULL,10.1590/S1516-89132000000300011|10.1021/JF00013A016|10.1080/10412905.1993.9698258,https://www.wikidata.org/wiki/Q104374956|https://www.wikidata.org/wiki/Q60307855|https://www.wikidata.org/wiki/Q104374328
654036,6887,NPASS,"Bicyclo[7.2.0]undec-4-ene, 4,11,11-trimethyl-8-methylene-, (1R,4E,9S)-",NPC7568,NPC7568,https://bidd.group/NPASS/compound.php?compoundID=NPC7568,Natural Product,13429,NPO6701,Cinnamomum camphora,https://bidd.group/NPASS/organism.php?org_id=NPO6701,Cinnamomum camphora (camphor tree),NULL,NULL,NULL,NULL,NULL
654276,6887,NPASS,"Bicyclo[7.2.0]undec-4-ene, 4,11,11-trimethyl-8-methylene-, (1R,4E,9S)-",NPC7568,NPC7568,https://bidd.group/NPASS/compound.php?compoundID=NPC7568,Natural Product,13429,NPO6701,Cinnamomum camphora,https://bidd.group/NPASS/organism.php?org_id=NPO6701,Cinnamomum camphora (camphor tree),NULL,NULL,NULL,NULL,NULL
656301,7127,LOTUS,Methyleugenol,Q419829,Methyleugenol,https://www.wikidata.org/wiki/Q419829,Natural Product,13429,Q158722,Cinnamomum camphora,https://www.wikidata.org/wiki/Q158722,Cinnamomum camphora (camphor tree),DOI:10.5897/JMPR12.157,https://doi.org/10.5897/JMPR12.157,NULL,10.5897/JMPR12.157,https://www.wikidata.org/wiki/Q115784052
659036,7461,LOTUS,gamma-Terpinene,Q423975,gamma-Terpinene,https://www.wikidata.org/wiki/Q423975,Natural Product,13429,Q158722,Cinnamomum camphora,https://www.wikidata.org/wiki/Q158722,Cinnamomum camphora (camphor tree),DOI:10.1016/J.INDCROP.2013.06.023|DOI:10.1186/1756-3305-7-407,https://doi.org/10.1016/J.INDCROP.2013.06.023|https://doi.org/10.1186/1756-3305-7-407,NULL,10.1016/J.INDCROP.2013.06.023|10.1186/1756-3305-7-407,https://www.wikidata.org/wiki/Q115783975|https://www.wikidata.org/wiki/Q34151429
660631,7462,LOTUS,alpha-Terpinene,Q423851,alpha-Terpinene,https://www.wikidata.org/wiki/Q423851,Natural Product,13429,Q158722,Cinnamomum camphora,https://www.wikidata.org/wiki/Q158722,Cinnamomum camphora (camphor tree),DOI:10.1186/1756-3305-7-407|DOI:10.1016/J.INDCROP.2013.06.023|DOI:10.1080/10412905.1998.9700962|DOI:10.1080/10575630108041259|DOI:10.5897/JMPR12.157,https://doi.org/10.1186/1756-3305-7-407|https://doi.org/10.1016/J.INDCROP.2013.06.023|https://doi.org/10.1080/10412905.1998.9700962|https://doi.org/10.1080/10575630108041259|https://doi.org/10.5897/JMPR12.157,NULL,10.1186/1756-3305-7-407|10.1016/J.INDCROP.2013.06.023|10.1080/10412905.1998.9700962|10.1080/10575630108041259|10.5897/JMPR12.157,https://www.wikidata.org/wiki/Q34151429|https://www.wikidata.org/wiki/Q115783975|https://www.wikidata.org/wiki/Q104374951|https://www.wikidata.org/wiki/Q43730825|https://www.wikidata.org/wiki/Q115784052
661252,7463,LOTUS,P-Cymene,Q284072,P-Cymene,https://www.wikidata.org/wiki/Q284072,Natural Product,13429,Q158722,Cinnamomum camphora,https://www.wikidata.org/wiki/Q158722,Cinnamomum camphora (camphor tree),DOI:10.1186/1756-3305-7-407|DOI:10.1016/J.INDCROP.2013.06.023|DOI:10.1080/10412905.1998.9700962|DOI:10.1080/10575630108041259|DOI:10.1246/NIKKASHI1921.64.1125|DOI:10.5897/JMPR12.157,https://doi.org/10.1186/1756-3305-7-407|https://doi.org/10.1016/J.INDCROP.2013.06.023|https://doi.org/10.1080/10412905.1998.9700962|https://doi.org/10.1080/10575630108041259|https://doi.org/10.1246/NIKKASHI1921.64.1125|https://doi.org/10.5897/JMPR12.157,NULL,10.1186/1756-3305-7-407|10.1016/J.INDCROP.2013.06.023|10.1080/10412905.1998.9700962|10.1080/10575630108041259|10.1246/NIKKASHI1921.64.1125|10.5897/JMPR12.157,https://www.wikidata.org/wiki/Q34151429|https://www.wikidata.org/wiki/Q115783975|https://www.wikidata.org/wiki/Q104374951|https://www.wikidata.org/wiki/Q43730825|https://www.wikidata.org/wiki/Q105011523|https://www.wikidata.org/wiki/Q115784052
663025,7501,NPASS,Styrene,NPC149436,Styrene,https://bidd.group/NPASS/compound.php?compoundID=NPC149436,Natural Product,13429,NPO6701,Cinnamomum camphora,https://bidd.group/NPASS/organism.php?org_id=NPO6701,Cinnamomum camphora (camphor tree),NULL,NULL,NULL,NULL,NULL
663028,7501,NPASS,Styrene,NPC149436,Styrene,https://bidd.group/NPASS/compound.php?compoundID=NPC149436,Natural Product,13429,NPO6701,Cinnamomum camphora,https://bidd.group/NPASS/organism.php?org_id=NPO6701,Cinnamomum camphora (camphor tree),NULL,NULL,NULL,NULL,NULL
664339,7910,LOTUS,4-Methyl-2-pentanol,Q2528979,4-Methyl-2-pentanol,https://www.wikidata.org/wiki/Q2528979,Natural Product,13429,Q158722,Cinnamomum camphora,https://www.wikidata.org/wiki/Q158722,Cinnamomum camphora (camphor tree),DOI:10.1080/10412905.1993.9698258,https://doi.org/10.1080/10412905.1993.9698258,NULL,10.1080/10412905.1993.9698258,https://www.wikidata.org/wiki/Q104374328
665627,8123,LOTUS,Ethyl octadec-9-enoate,Q81976457,Ethyl octadec-9-enoate,https://www.wikidata.org/wiki/Q81976457,Natural Product,13429,Q158722,Cinnamomum camphora,https://www.wikidata.org/wiki/Q158722,Cinnamomum camphora (camphor tree),DOI:10.1002/PS.3961,https://doi.org/10.1002/PS.3961,NULL,10.1002/PS.3961,https://www.wikidata.org/wiki/Q40251652
666444,8163,LOTUS,2-Undecanone,Q2024187,2-Undecanone,https://www.wikidata.org/wiki/Q2024187,Natural Product,13429,Q158722,Cinnamomum camphora,https://www.wikidata.org/wiki/Q158722,Cinnamomum camphora (camphor tree),DOI:10.1080/10412905.1998.9700962,https://doi.org/10.1080/10412905.1998.9700962,NULL,10.1080/10412905.1998.9700962,https://www.wikidata.org/wiki/Q104374951
678252,9231,NPASS,Azulene,NPC264470,Azulene,https://bidd.group/NPASS/compound.php?compoundID=NPC264470,Natural Product,13429,NPO6701,Cinnamomum camphora,https://bidd.group/NPASS/organism.php?org_id=NPO6701,Cinnamomum camphora (camphor tree),NULL,NULL,NULL,NULL,NULL
684418,10224,LOTUS,"1,6-Dimethyl-4-isopropyltetralin",Q22139926,"1,6-Dimethyl-4-isopropyltetralin",https://www.wikidata.org/wiki/Q22139926,Natural Product,13429,Q158722,Cinnamomum camphora,https://www.wikidata.org/wiki/Q158722,Cinnamomum camphora (camphor tree),DOI:10.1007/S11418-006-0039-1,https://doi.org/10.1007/S11418-006-0039-1,NULL,10.1007/S11418-006-0039-1,https://www.wikidata.org/wiki/Q50050636
684419,10224,NPASS,"1,6-Dimethyl-4-isopropyltetralin",NPC252539,NPC252539,https://bidd.group/NPASS/compound.php?compoundID=NPC252539,Natural Product,13429,NPO6701,Cinnamomum camphora,https://bidd.group/NPASS/organism.php?org_id=NPO6701,Cinnamomum camphora (camphor tree),NULL,NULL,NULL,NULL,NULL
684972,10224,NPASS,"1,6-Dimethyl-4-isopropyltetralin",NPC252539,NPC252539,https://bidd.group/NPASS/compound.php?compoundID=NPC252539,Natural Product,13429,NPO6701,Cinnamomum camphora,https://bidd.group/NPASS/organism.php?org_id=NPO6701,Cinnamomum camphora (camphor tree),NULL,NULL,NULL,NULL,NULL
686272,10282,LOTUS,p-Menth-1-en-3-ol,Q81984934,p-Menth-1-en-3-ol,https://www.wikidata.org/wiki/Q81984934,Natural Product,13429,Q158722,Cinnamomum camphora,https://www.wikidata.org/wiki/Q158722,Cinnamomum camphora (camphor tree),DOI:10.1002/JCCS.198400021,https://doi.org/10.1002/JCCS.198400021,NULL,10.1002/JCCS.198400021,https://www.wikidata.org/wiki/Q104384090
686544,10364,LOTUS,Carvacrol,Q225543,Carvacrol,https://www.wikidata.org/wiki/Q225543,Natural Product,13429,Q158722,Cinnamomum camphora,https://www.wikidata.org/wiki/Q158722,Cinnamomum camphora (camphor tree),DOI:10.1007/S11418-006-0039-1,https://doi.org/10.1007/S11418-006-0039-1,NULL,10.1007/S11418-006-0039-1,https://www.wikidata.org/wiki/Q50050636
686807,10364,NPASS,Carvacrol,NPC312132,Carvacrol,https://bidd.group/NPASS/compound.php?compoundID=NPC312132,Natural Product,13429,NPO6701,Cinnamomum camphora,https://bidd.group/NPASS/organism.php?org_id=NPO6701,Cinnamomum camphora (camphor tree),NULL,NULL,NULL,NULL,NULL
686815,10364,NPASS,Carvacrol,NPC312132,Carvacrol,https://bidd.group/NPASS/compound.php?compoundID=NPC312132,Natural Product,13429,NPO6701,Cinnamomum camphora,https://bidd.group/NPASS/organism.php?org_id=NPO6701,Cinnamomum camphora (camphor tree),NULL,NULL,NULL,NULL,NULL
686817,10364,NPASS,Carvacrol,NPC312132,Carvacrol,https://bidd.group/NPASS/compound.php?compoundID=NPC312132,Natural Product,13429,NPO6701,Cinnamomum camphora,https://bidd.group/NPASS/organism.php?org_id=NPO6701,Cinnamomum camphora (camphor tree),NULL,NULL,NULL,NULL,NULL
691940,10534,NPASS,"Norbornane, 2-methyl-3-methylene-2-(4-methyl-3-pentenyl)-",NPC117416,NPC117416,https://bidd.group/NPASS/compound.php?compoundID=NPC117416,Natural Product,13429,NPO6701,Cinnamomum camphora,https://bidd.group/NPASS/organism.php?org_id=NPO6701,Cinnamomum camphora (camphor tree),NULL,NULL,NULL,NULL,NULL
694025,10657,NPASS,beta-Cadinene,NPC305327,NPC305327,https://bidd.group/NPASS/compound.php?compoundID=NPC305327,Natural Product,13429,NPO6701,Cinnamomum camphora,https://bidd.group/NPASS/organism.php?org_id=NPO6701,Cinnamomum camphora (camphor tree),NULL,NULL,NULL,NULL,NULL
694031,10657,NPASS,beta-Cadinene,NPC305327,NPC305327,https://bidd.group/NPASS/compound.php?compoundID=NPC305327,Natural Product,13429,NPO6701,Cinnamomum camphora,https://bidd.group/NPASS/organism.php?org_id=NPO6701,Cinnamomum camphora (camphor tree),NULL,NULL,NULL,NULL,NULL
694533,10659,NPASS,Apiole,NPC92869,Apiol,https://bidd.group/NPASS/compound.php?compoundID=NPC92869,Natural Product,13429,NPO6701,Cinnamomum camphora,https://bidd.group/NPASS/organism.php?org_id=NPO6701,Cinnamomum camphora (camphor tree),NULL,NULL,NULL,NULL,NULL
694534,10659,NPASS,Apiole,NPC92869,Apiol,https://bidd.group/NPASS/compound.php?compoundID=NPC92869,Natural Product,13429,NPO6701,Cinnamomum camphora,https://bidd.group/NPASS/organism.php?org_id=NPO6701,Cinnamomum camphora (camphor tree),NULL,NULL,NULL,NULL,NULL
694537,10659,NPASS,Apiole,NPC92869,Apiol,https://bidd.group/NPASS/compound.php?compoundID=NPC92869,Natural Product,13429,NPO6701,Cinnamomum camphora,https://bidd.group/NPASS/organism.php?org_id=NPO6701,Cinnamomum camphora (camphor tree),NULL,NULL,NULL,NULL,NULL
702925,11463,LOTUS,Terpinolene,Q2405051,Terpinolene,https://www.wikidata.org/wiki/Q2405051,Natural Product,13429,Q158722,Cinnamomum camphora,https://www.wikidata.org/wiki/Q158722,Cinnamomum camphora (camphor tree),DOI:10.1016/J.INDCROP.2013.06.023|DOI:10.1080/10412905.1998.9700962|DOI:10.1080/10575630108041259,https://doi.org/10.1016/J.INDCROP.2013.06.023|https://doi.org/10.1080/10412905.1998.9700962|https://doi.org/10.1080/10575630108041259,NULL,10.1016/J.INDCROP.2013.06.023|10.1080/10412905.1998.9700962|10.1080/10575630108041259,https://www.wikidata.org/wiki/Q115783975|https://www.wikidata.org/wiki/Q104374951|https://www.wikidata.org/wiki/Q43730825
706215,12407,NPASS,Hexacosane,NPC216127,NPC216127,https://bidd.group/NPASS/compound.php?compoundID=NPC216127,Natural Product,13429,NPO6701,Cinnamomum camphora,https://bidd.group/NPASS/organism.php?org_id=NPO6701,Cinnamomum camphora (camphor tree),NULL,NULL,NULL,NULL,NULL
707472,12585,LOTUS,2-Pentene,Q12871786,2-Pentene,https://www.wikidata.org/wiki/Q12871786,Natural Product,13429,Q158722,Cinnamomum camphora,https://www.wikidata.org/wiki/Q158722,Cinnamomum camphora (camphor tree),DOI:10.1186/1756-3305-7-407,https://doi.org/10.1186/1756-3305-7-407,NULL,10.1186/1756-3305-7-407,https://www.wikidata.org/wiki/Q34151429
707741,12746,LOTUS,1-Methylcyclopentene,Q24736866,1-Methylcyclopentene,https://www.wikidata.org/wiki/Q24736866,Natural Product,13429,Q158722,Cinnamomum camphora,https://www.wikidata.org/wiki/Q158722,Cinnamomum camphora (camphor tree),DOI:10.1186/1756-3305-7-407,https://doi.org/10.1186/1756-3305-7-407,NULL,10.1186/1756-3305-7-407,https://www.wikidata.org/wiki/Q34151429
710171,14525,NPASS,Fenchone,NPC258672,Fenchone,https://bidd.group/NPASS/compound.php?compoundID=NPC258672,Natural Product,13429,NPO6701,Cinnamomum camphora,https://bidd.group/NPASS/organism.php?org_id=NPO6701,Cinnamomum camphora (camphor tree),NULL,NULL,NULL,NULL,NULL
711114,14896,LOTUS,beta-Pinene,Q300928,beta-Pinene,https://www.wikidata.org/wiki/Q300928,Natural Product,13429,Q158722,Cinnamomum camphora,https://www.wikidata.org/wiki/Q158722,Cinnamomum camphora (camphor tree),DOI:10.1038/SREP46579,https://doi.org/10.1038/SREP46579,NULL,10.1038/SREP46579,https://www.wikidata.org/wiki/Q33470311
715915,17100,LOTUS,alpha-TERPINEOL,Q27109437,alpha-TERPINEOL,https://www.wikidata.org/wiki/Q27109437,Natural Product,13429,Q158722,Cinnamomum camphora,https://www.wikidata.org/wiki/Q158722,Cinnamomum camphora (camphor tree),DOI:10.1080/10412905.1993.9698258,https://doi.org/10.1080/10412905.1993.9698258,NULL,10.1080/10412905.1993.9698258,https://www.wikidata.org/wiki/Q104374328
720880,22179,LOTUS,Laurolitsine,Q27135167,Laurolitsine,https://www.wikidata.org/wiki/Q27135167,Natural Product,13429,Q158722,Cinnamomum camphora,https://www.wikidata.org/wiki/Q158722,Cinnamomum camphora (camphor tree),DOI:10.1248/YAKUSHI1947.84.4_365,https://doi.org/10.1248/YAKUSHI1947.84.4_365,NULL,10.1248/YAKUSHI1947.84.4_365,https://www.wikidata.org/wiki/Q105147969
720881,22179,NPASS,Laurolitsine,NPC26240,Norboldine,https://bidd.group/NPASS/compound.php?compoundID=NPC26240,Natural Product,13429,NPO6701,Cinnamomum camphora,https://bidd.group/NPASS/organism.php?org_id=NPO6701,Cinnamomum camphora (camphor tree),NULL,NULL,NULL,NULL,NULL
720884,22179,NPASS,Laurolitsine,NPC26240,Norboldine,https://bidd.group/NPASS/compound.php?compoundID=NPC26240,Natural Product,13429,NPO6701,Cinnamomum camphora,https://bidd.group/NPASS/organism.php?org_id=NPO6701,Cinnamomum camphora (camphor tree),NULL,NULL,NULL,NULL,NULL
722643,23204,NPASS,"1,4,8-Cycloundecatriene, 2,6,6,9-tetramethyl-, (1E,4E,8E)-",NPC320738,NPC320738,https://bidd.group/NPASS/compound.php?compoundID=NPC320738,Natural Product,13429,NPO6701,Cinnamomum camphora,https://bidd.group/NPASS/organism.php?org_id=NPO6701,Cinnamomum camphora (camphor tree),NULL,NULL,NULL,NULL,NULL
727752,31253,LOTUS,Myrcene,Q424577,Myrcene,https://www.wikidata.org/wiki/Q424577,Natural Product,13429,Q158722,Cinnamomum camphora,https://www.wikidata.org/wiki/Q158722,Cinnamomum camphora (camphor tree),DOI:10.1080/10412905.1993.9698258,https://doi.org/10.1080/10412905.1993.9698258,NULL,10.1080/10412905.1993.9698258,https://www.wikidata.org/wiki/Q104374328
732884,61303,LOTUS,2-Pentadecanone,Q27161440,2-Pentadecanone,https://www.wikidata.org/wiki/Q27161440,Natural Product,13429,Q158722,Cinnamomum camphora,https://www.wikidata.org/wiki/Q158722,Cinnamomum camphora (camphor tree),DOI:10.1246/BCSJ.42.3591,https://doi.org/10.1246/BCSJ.42.3591,NULL,10.1246/BCSJ.42.3591,https://www.wikidata.org/wiki/Q71355794
733105,61839,LOTUS,Hex-3-en-1-yl butanoate,Q223077,Hex-3-en-1-yl butanoate,https://www.wikidata.org/wiki/Q223077,Natural Product,13429,Q158722,Cinnamomum camphora,https://www.wikidata.org/wiki/Q158722,Cinnamomum camphora (camphor tree),DOI:10.1186/1756-3305-7-407,https://doi.org/10.1186/1756-3305-7-407,NULL,10.1186/1756-3305-7-407,https://www.wikidata.org/wiki/Q34151429
733766,62566,LOTUS,beta-Bourbonene,Q104667257,beta-Bourbonene,https://www.wikidata.org/wiki/Q104667257,Natural Product,13429,Q158722,Cinnamomum camphora,https://www.wikidata.org/wiki/Q158722,Cinnamomum camphora (camphor tree),DOI:10.1016/J.INDCROP.2013.06.023|DOI:10.1080/10412905.1998.9700962,https://doi.org/10.1016/J.INDCROP.2013.06.023|https://doi.org/10.1080/10412905.1998.9700962,NULL,10.1016/J.INDCROP.2013.06.023|10.1080/10412905.1998.9700962,https://www.wikidata.org/wiki/Q115783975|https://www.wikidata.org/wiki/Q104374951
734016,64685,LOTUS,Isoborneol,Q27103499,Isoborneol,https://www.wikidata.org/wiki/Q27103499,Natural Product,13429,Q158722,Cinnamomum camphora,https://www.wikidata.org/wiki/Q158722,Cinnamomum camphora (camphor tree),DOI:10.1007/S11418-006-0039-1,https://doi.org/10.1007/S11418-006-0039-1,NULL,10.1007/S11418-006-0039-1,https://www.wikidata.org/wiki/Q50050636
747682,72307,LOTUS,Sesamin,Q3511416,Sesamin,https://www.wikidata.org/wiki/Q3511416,Natural Product,13429,Q158722,Cinnamomum camphora,https://www.wikidata.org/wiki/Q158722,Cinnamomum camphora (camphor tree),DOI:10.1002/JCCS.198400021,https://doi.org/10.1002/JCCS.198400021,NULL,10.1002/JCCS.198400021,https://www.wikidata.org/wiki/Q104384090
747693,72307,NPASS,Sesamin,NPC171928,Sesamin,https://bidd.group/NPASS/compound.php?compoundID=NPC171928,Natural Product,13429,NPO6701,Cinnamomum camphora,https://bidd.group/NPASS/organism.php?org_id=NPO6701,Cinnamomum camphora (camphor tree),NULL,NULL,NULL,NULL,NULL
760486,82227,LOTUS,(+)-alpha-Pinene,Q2095629,(+)-alpha-Pinene,https://www.wikidata.org/wiki/Q2095629,Natural Product,13429,Q158722,Cinnamomum camphora,https://www.wikidata.org/wiki/Q158722,Cinnamomum camphora (camphor tree),DOI:10.1016/J.INDCROP.2013.06.023,https://doi.org/10.1016/J.INDCROP.2013.06.023,NULL,10.1016/J.INDCROP.2013.06.023,https://www.wikidata.org/wiki/Q115783975
769303,92138,LOTUS,Elemol,Q27282855,Elemol,https://www.wikidata.org/wiki/Q27282855,Natural Product,13429,Q158722,Cinnamomum camphora,https://www.wikidata.org/wiki/Q158722,Cinnamomum camphora (camphor tree),DOI:10.1016/J.INDCROP.2013.06.023|DOI:10.1080/10412905.1998.9700962,https://doi.org/10.1016/J.INDCROP.2013.06.023|https://doi.org/10.1080/10412905.1998.9700962,NULL,10.1016/J.INDCROP.2013.06.023|10.1080/10412905.1998.9700962,https://www.wikidata.org/wiki/Q115783975|https://www.wikidata.org/wiki/Q104374951
770663,92221,LOTUS,(+)-Camphene,Q27105194,(+)-Camphene,https://www.wikidata.org/wiki/Q27105194,Natural Product,13429,Q158722,Cinnamomum camphora,https://www.wikidata.org/wiki/Q158722,Cinnamomum camphora (camphor tree),DOI:10.1186/1756-3305-7-407|DOI:10.1016/J.INDCROP.2013.06.023|DOI:10.1080/10412905.1998.9700962|DOI:10.1080/10575630108041259|DOI:10.1246/BCSJ.50.2821|DOI:10.5897/JMPR12.157,https://doi.org/10.1186/1756-3305-7-407|https://doi.org/10.1016/J.INDCROP.2013.06.023|https://doi.org/10.1080/10412905.1998.9700962|https://doi.org/10.1080/10575630108041259|https://doi.org/10.1246/BCSJ.50.2821|https://doi.org/10.5897/JMPR12.157,NULL,10.1186/1756-3305-7-407|10.1016/J.INDCROP.2013.06.023|10.1080/10412905.1998.9700962|10.1080/10575630108041259|10.1246/BCSJ.50.2821|10.5897/JMPR12.157,https://www.wikidata.org/wiki/Q34151429|https://www.wikidata.org/wiki/Q115783975|https://www.wikidata.org/wiki/Q104374951|https://www.wikidata.org/wiki/Q43730825|https://www.wikidata.org/wiki/Q104968679|https://www.wikidata.org/wiki/Q115784052
774139,94164,NPASS,alpha-Santalene,NPC60427,NPC60427,https://bidd.group/NPASS/compound.php?compoundID=NPC60427,Natural Product,13429,NPO6701,Cinnamomum camphora,https://bidd.group/NPASS/organism.php?org_id=NPO6701,Cinnamomum camphora (camphor tree),NULL,NULL,NULL,NULL,NULL
774960,94275,LOTUS,delta-Guaiene,Q27132629,delta-Guaiene,https://www.wikidata.org/wiki/Q27132629,Natural Product,13429,Q158722,Cinnamomum camphora,https://www.wikidata.org/wiki/Q158722,Cinnamomum camphora (camphor tree),DOI:10.1246/BCSJ.41.234,https://doi.org/10.1246/BCSJ.41.234,NULL,10.1246/BCSJ.41.234,https://www.wikidata.org/wiki/Q104970512
776468,96117,LOTUS,Dotriacontanol,Q4545776,Dotriacontanol,https://www.wikidata.org/wiki/Q4545776,Natural Product,13429,Q158722,Cinnamomum camphora,https://www.wikidata.org/wiki/Q158722,Cinnamomum camphora (camphor tree),DOI:10.1002/JCCS.198400021,https://doi.org/10.1002/JCCS.198400021,NULL,10.1002/JCCS.198400021,https://www.wikidata.org/wiki/Q104384090
777966,97583,LOTUS,"2,3-Methylenedioxynaphthalene",Q83052023,"2,3-Methylenedioxynaphthalene",https://www.wikidata.org/wiki/Q83052023,Natural Product,13429,Q158722,Cinnamomum camphora,https://www.wikidata.org/wiki/Q158722,Cinnamomum camphora (camphor tree),DOI:10.1246/BCSJ.42.3591,https://doi.org/10.1246/BCSJ.42.3591,NULL,10.1246/BCSJ.42.3591,https://www.wikidata.org/wiki/Q71355794
782381,101612,LOTUS,Episesamin,Q104394002,Episesamin,https://www.wikidata.org/wiki/Q104394002,Natural Product,13429,Q158722,Cinnamomum camphora,https://www.wikidata.org/wiki/Q158722,Cinnamomum camphora (camphor tree),DOI:10.1177/1934578X0600100104,https://doi.org/10.1177/1934578X0600100104,NULL,10.1177/1934578X0600100104,https://www.wikidata.org/wiki/Q115784957
783877,101750,NPASS,alpha-Camphorene,NPC44177,NPC44177,https://bidd.group/NPASS/compound.php?compoundID=NPC44177,Natural Product,13429,NPO6701,Cinnamomum camphora,https://bidd.group/NPASS/organism.php?org_id=NPO6701,Cinnamomum camphora (camphor tree),NULL,NULL,NULL,NULL,NULL
791332,122738,NPASS,Procyanidin B2,NPC236202,Procyanidin B2,https://bidd.group/NPASS/compound.php?compoundID=NPC236202,Natural Product,13429,NPO6701,Cinnamomum camphora,https://bidd.group/NPASS/organism.php?org_id=NPO6701,Cinnamomum camphora (camphor tree),NULL,NULL,NULL,NULL,NULL
791500,122738,NPASS,Procyanidin B2,NPC236202,Procyanidin B2,https://bidd.group/NPASS/compound.php?compoundID=NPC236202,Natural Product,13429,NPO6701,Cinnamomum camphora,https://bidd.group/NPASS/organism.php?org_id=NPO6701,Cinnamomum camphora (camphor tree),NULL,NULL,NULL,NULL,NULL
797703,137651,LOTUS,"Pent-2-ynal, 4,4-dimethyl-",Q83050995,"Pent-2-ynal, 4,4-dimethyl-",https://www.wikidata.org/wiki/Q83050995,Natural Product,13429,Q158722,Cinnamomum camphora,https://www.wikidata.org/wiki/Q158722,Cinnamomum camphora (camphor tree),DOI:10.1186/1756-3305-7-407,https://doi.org/10.1186/1756-3305-7-407,NULL,10.1186/1756-3305-7-407,https://www.wikidata.org/wiki/Q34151429
812754,169853,NPASS,Procyanidin C1,NPC279406,Procyanidin C1,https://bidd.group/NPASS/compound.php?compoundID=NPC279406,Natural Product,13429,NPO6701,Cinnamomum camphora,https://bidd.group/NPASS/organism.php?org_id=NPO6701,Cinnamomum camphora (camphor tree),NULL,NULL,NULL,NULL,NULL
812958,169853,NPASS,Procyanidin C1,NPC279406,Procyanidin C1,https://bidd.group/NPASS/compound.php?compoundID=NPC279406,Natural Product,13429,NPO6701,Cinnamomum camphora,https://bidd.group/NPASS/organism.php?org_id=NPO6701,Cinnamomum camphora (camphor tree),NULL,NULL,NULL,NULL,NULL
825337,222284,LOTUS,Beta-Sitosterol,Q121802,Beta-Sitosterol,https://www.wikidata.org/wiki/Q121802,Natural Product,13429,Q158722,Cinnamomum camphora,https://www.wikidata.org/wiki/Q158722,Cinnamomum camphora (camphor tree),DOI:10.1002/JCCS.198400021|DOI:10.1177/1934578X0600100104,https://doi.org/10.1002/JCCS.198400021|https://doi.org/10.1177/1934578X0600100104,NULL,10.1002/JCCS.198400021|10.1177/1934578X0600100104,https://www.wikidata.org/wiki/Q104384090|https://www.wikidata.org/wiki/Q115784957
826057,227829,LOTUS,Guaiol,Q5613321,Guaiol,https://www.wikidata.org/wiki/Q5613321,Natural Product,13429,Q158722,Cinnamomum camphora,https://www.wikidata.org/wiki/Q158722,Cinnamomum camphora (camphor tree),DOI:10.5897/JMPR12.157,https://doi.org/10.5897/JMPR12.157,NULL,10.5897/JMPR12.157,https://www.wikidata.org/wiki/Q115784052
826212,230921,LOTUS,(1R)-Camphor,Q67879759,(1R)-Camphor,https://www.wikidata.org/wiki/Q67879759,Natural Product,13429,Q158722,Cinnamomum camphora,https://www.wikidata.org/wiki/Q158722,Cinnamomum camphora (camphor tree),DOI:10.1016/J.INDCROP.2013.06.023,https://doi.org/10.1016/J.INDCROP.2013.06.023,NULL,10.1016/J.INDCROP.2013.06.023,https://www.wikidata.org/wiki/Q115783975
836589,382073,NPASS,(-)-Sesamin,NPC33611,"5-[(3R,3As,6R,6As)-3-(1,3-Benzodioxol-5-Yl)-1,3,3A,4,6,6A-Hexahydrofuro[3,4-C]Furan-6-Yl]-1,3-Benzodioxole",https://bidd.group/NPASS/compound.php?compoundID=NPC33611,Natural Product,13429,NPO6701,Cinnamomum camphora,https://bidd.group/NPASS/organism.php?org_id=NPO6701,Cinnamomum camphora (camphor tree),NULL,NULL,NULL,NULL,NULL
836747,384876,LOTUS,Kusunokinin,Q104396811,Kusunokinin,https://www.wikidata.org/wiki/Q104396811,Natural Product,13429,Q158722,Cinnamomum camphora,https://www.wikidata.org/wiki/Q158722,Cinnamomum camphora (camphor tree),DOI:10.1246/BCSJ.50.2821,https://doi.org/10.1246/BCSJ.50.2821,NULL,10.1246/BCSJ.50.2821,https://www.wikidata.org/wiki/Q104968679
836748,384877,LOTUS,Arctigenin methyl ether,Q27273182,Arctigenin methyl ether,https://www.wikidata.org/wiki/Q27273182,Natural Product,13429,Q158722,Cinnamomum camphora,https://www.wikidata.org/wiki/Q158722,Cinnamomum camphora (camphor tree),DOI:10.1246/BCSJ.50.2821,https://doi.org/10.1246/BCSJ.50.2821,NULL,10.1246/BCSJ.50.2821,https://www.wikidata.org/wiki/Q104968679
839695,393063,NPASS,Anhydrodebromaplysiatoxin,NPC295196,NPC295196,https://bidd.group/NPASS/compound.php?compoundID=NPC295196,Natural Product,13429,NPO6701,Cinnamomum camphora,https://bidd.group/NPASS/organism.php?org_id=NPO6701,Cinnamomum camphora (camphor tree),NULL,NULL,NULL,NULL,NULL
842364,439250,LOTUS,(-)-Limonene,Q27089405,(-)-Limonene,https://www.wikidata.org/wiki/Q27089405,Natural Product,13429,Q158722,Cinnamomum camphora,https://www.wikidata.org/wiki/Q158722,Cinnamomum camphora (camphor tree),DOI:10.1016/J.INDCROP.2013.06.023,https://doi.org/10.1016/J.INDCROP.2013.06.023,NULL,10.1016/J.INDCROP.2013.06.023,https://www.wikidata.org/wiki/Q115783975
843217,439653,NPASS,Reticuline,NPC147390,(S)-Reticuline,https://bidd.group/NPASS/compound.php?compoundID=NPC147390,Natural Product,13429,NPO6701,Cinnamomum camphora,https://bidd.group/NPASS/organism.php?org_id=NPO6701,Cinnamomum camphora (camphor tree),NULL,NULL,NULL,NULL,NULL
843327,439711,LOTUS,alpha-Fenchol,Q27089421,alpha-Fenchol,https://www.wikidata.org/wiki/Q27089421,Natural Product,13429,Q158722,Cinnamomum camphora,https://www.wikidata.org/wiki/Q158722,Cinnamomum camphora (camphor tree),DOI:10.1080/10575630108041259,https://doi.org/10.1080/10575630108041259,NULL,10.1080/10575630108041259,https://www.wikidata.org/wiki/Q43730825
843945,440586,NPASS,(R)-Reticuline,NPC428,(R)-Reticuline,https://bidd.group/NPASS/compound.php?compoundID=NPC428,Natural Product,13429,NPO6701,Cinnamomum camphora,https://bidd.group/NPASS/organism.php?org_id=NPO6701,Cinnamomum camphora (camphor tree),NULL,NULL,NULL,NULL,NULL
844115,440586,NPASS,(R)-Reticuline,NPC428,(R)-Reticuline,https://bidd.group/NPASS/compound.php?compoundID=NPC428,Natural Product,13429,NPO6701,Cinnamomum camphora,https://bidd.group/NPASS/organism.php?org_id=NPO6701,Cinnamomum camphora (camphor tree),NULL,NULL,NULL,NULL,NULL
844556,440917,LOTUS,D-Limonene,Q27888324,D-Limonene,https://www.wikidata.org/wiki/Q27888324,Natural Product,13429,Q158722,Cinnamomum camphora,https://www.wikidata.org/wiki/Q158722,Cinnamomum camphora (camphor tree),DOI:10.1186/1756-3305-7-407|DOI:10.1016/J.INDCROP.2013.06.023|DOI:10.1080/10412905.1998.9700962|DOI:10.1080/10575630108041259|DOI:10.1246/NIKKASHI1921.64.1125|DOI:10.5897/JMPR12.157|DOI:10.1080/10412905.1993.9698258,https://doi.org/10.1186/1756-3305-7-407|https://doi.org/10.1016/J.INDCROP.2013.06.023|https://doi.org/10.1080/10412905.1998.9700962|https://doi.org/10.1080/10575630108041259|https://doi.org/10.1246/NIKKASHI1921.64.1125|https://doi.org/10.5897/JMPR12.157|https://doi.org/10.1080/10412905.1993.9698258,NULL,10.1186/1756-3305-7-407|10.1016/J.INDCROP.2013.06.023|10.1080/10412905.1998.9700962|10.1080/10575630108041259|10.1246/NIKKASHI1921.64.1125|10.5897/JMPR12.157|10.1080/10412905.1993.9698258,https://www.wikidata.org/wiki/Q34151429|https://www.wikidata.org/wiki/Q115783975|https://www.wikidata.org/wiki/Q104374951|https://www.wikidata.org/wiki/Q43730825|https://www.wikidata.org/wiki/Q105011523|https://www.wikidata.org/wiki/Q115784052|https://www.wikidata.org/wiki/Q104374328
844862,440966,LOTUS,(-)-Camphene,Q27105230,(-)-Camphene,https://www.wikidata.org/wiki/Q27105230,Natural Product,13429,Q158722,Cinnamomum camphora,https://www.wikidata.org/wiki/Q158722,Cinnamomum camphora (camphor tree),DOI:10.1016/J.INDCROP.2013.06.023,https://doi.org/10.1016/J.INDCROP.2013.06.023,NULL,10.1016/J.INDCROP.2013.06.023,https://www.wikidata.org/wiki/Q115783975
845053,440967,LOTUS,(-)-beta-Pinene,Q27103655,(-)-beta-Pinene,https://www.wikidata.org/wiki/Q27103655,Natural Product,13429,Q158722,Cinnamomum camphora,https://www.wikidata.org/wiki/Q158722,Cinnamomum camphora (camphor tree),DOI:10.1016/J.INDCROP.2013.06.023|DOI:10.1080/10412905.1998.9700962|DOI:10.1080/10412905.1993.9698258|DOI:10.1080/10575630108041259,https://doi.org/10.1016/J.INDCROP.2013.06.023|https://doi.org/10.1080/10412905.1998.9700962|https://doi.org/10.1080/10412905.1993.9698258|https://doi.org/10.1080/10575630108041259,NULL,10.1016/J.INDCROP.2013.06.023|10.1080/10412905.1998.9700962|10.1080/10412905.1993.9698258|10.1080/10575630108041259,https://www.wikidata.org/wiki/Q115783975|https://www.wikidata.org/wiki/Q104374951|https://www.wikidata.org/wiki/Q104374328|https://www.wikidata.org/wiki/Q43730825
845288,440968,LOTUS,(-)-alpha-Pinene,Q300852,(-)-alpha-Pinene,https://www.wikidata.org/wiki/Q300852,Natural Product,13429,Q158722,Cinnamomum camphora,https://www.wikidata.org/wiki/Q158722,Cinnamomum camphora (camphor tree),DOI:10.1186/1756-3305-7-407|DOI:10.1016/J.INDCROP.2013.06.023|DOI:10.1080/10412905.1998.9700962|DOI:10.1080/10575630108041259|DOI:10.5897/JMPR12.157,https://doi.org/10.1186/1756-3305-7-407|https://doi.org/10.1016/J.INDCROP.2013.06.023|https://doi.org/10.1080/10412905.1998.9700962|https://doi.org/10.1080/10575630108041259|https://doi.org/10.5897/JMPR12.157,NULL,10.1186/1756-3305-7-407|10.1016/J.INDCROP.2013.06.023|10.1080/10412905.1998.9700962|10.1080/10575630108041259|10.5897/JMPR12.157,https://www.wikidata.org/wiki/Q34151429|https://www.wikidata.org/wiki/Q115783975|https://www.wikidata.org/wiki/Q104374951|https://www.wikidata.org/wiki/Q43730825|https://www.wikidata.org/wiki/Q115784052
845441,441005,LOTUS,(+)-delta-Cadinene,Q27089406,(+)-delta-Cadinene,https://www.wikidata.org/wiki/Q27089406,Natural Product,13429,Q158722,Cinnamomum camphora,https://www.wikidata.org/wiki/Q158722,Cinnamomum camphora (camphor tree),DOI:10.1080/10412905.1998.9700962|DOI:10.1080/10575630108041259,https://doi.org/10.1080/10412905.1998.9700962|https://doi.org/10.1080/10575630108041259,NULL,10.1080/10412905.1998.9700962|10.1080/10575630108041259,https://www.wikidata.org/wiki/Q104374951|https://www.wikidata.org/wiki/Q43730825
849338,442393,LOTUS,beta-Selinene,Q27108640,beta-Selinene,https://www.wikidata.org/wiki/Q27108640,Natural Product,13429,Q158722,Cinnamomum camphora,https://www.wikidata.org/wiki/Q158722,Cinnamomum camphora (camphor tree),DOI:10.1016/J.INDCROP.2013.06.023,https://doi.org/10.1016/J.INDCROP.2013.06.023,NULL,10.1016/J.INDCROP.2013.06.023,https://www.wikidata.org/wiki/Q115783975
849585,442461,LOTUS,(-)-3-Carene,Q15222645,(-)-3-Carene,https://www.wikidata.org/wiki/Q15222645,Natural Product,13429,Q158722,Cinnamomum camphora,https://www.wikidata.org/wiki/Q158722,Cinnamomum camphora (camphor tree),DOI:10.1016/J.INDCROP.2013.06.023|DOI:10.1080/10412905.1998.9700962,https://doi.org/10.1016/J.INDCROP.2013.06.023|https://doi.org/10.1080/10412905.1998.9700962,NULL,10.1016/J.INDCROP.2013.06.023|10.1080/10412905.1998.9700962,https://www.wikidata.org/wiki/Q115783975|https://www.wikidata.org/wiki/Q104374951
849656,442482,LOTUS,(R)-(-)-alpha-Phellandrene,Q25933788,(R)-(-)-alpha-Phellandrene,https://www.wikidata.org/wiki/Q25933788,Natural Product,13429,Q158722,Cinnamomum camphora,https://www.wikidata.org/wiki/Q158722,Cinnamomum camphora (camphor tree),DOI:10.1016/J.INDCROP.2013.06.023|DOI:10.5897/JMPR12.157|DOI:10.1080/10412905.1998.9700962|DOI:10.1080/10575630108041259,https://doi.org/10.1016/J.INDCROP.2013.06.023|https://doi.org/10.5897/JMPR12.157|https://doi.org/10.1080/10412905.1998.9700962|https://doi.org/10.1080/10575630108041259,NULL,10.1016/J.INDCROP.2013.06.023|10.5897/JMPR12.157|10.1080/10412905.1998.9700962|10.1080/10575630108041259,https://www.wikidata.org/wiki/Q115783975|https://www.wikidata.org/wiki/Q115784052|https://www.wikidata.org/wiki/Q104374951|https://www.wikidata.org/wiki/Q43730825
849673,442501,LOTUS,(+)-alpha-Terpineol,Q27105290,(+)-alpha-Terpineol,https://www.wikidata.org/wiki/Q27105290,Natural Product,13429,Q158722,Cinnamomum camphora,https://www.wikidata.org/wiki/Q158722,Cinnamomum camphora (camphor tree),DOI:10.1016/J.INDCROP.2013.06.023,https://doi.org/10.1016/J.INDCROP.2013.06.023,NULL,10.1016/J.INDCROP.2013.06.023,https://www.wikidata.org/wiki/Q115783975
851457,443162,LOTUS,(-)-alpha-Terpineol,Q27105253,(-)-alpha-Terpineol,https://www.wikidata.org/wiki/Q27105253,Natural Product,13429,Q158722,Cinnamomum camphora,https://www.wikidata.org/wiki/Q158722,Cinnamomum camphora (camphor tree),DOI:10.1016/J.INDCROP.2013.06.023,https://doi.org/10.1016/J.INDCROP.2013.06.023,NULL,10.1016/J.INDCROP.2013.06.023,https://www.wikidata.org/wiki/Q115783975
851922,444294,LOTUS,(-)-Camphor,Q27095844,(-)-Camphor,https://www.wikidata.org/wiki/Q27095844,Natural Product,13429,Q158722,Cinnamomum camphora,https://www.wikidata.org/wiki/Q158722,Cinnamomum camphora (camphor tree),DOI:10.1016/J.INDCROP.2013.06.023,https://doi.org/10.1016/J.INDCROP.2013.06.023,NULL,10.1016/J.INDCROP.2013.06.023,https://www.wikidata.org/wiki/Q115783975
852846,474541,NPASS,Procyanidin B8,NPC18185,Catechin-(4Alpha->6)-Epicatechin,https://bidd.group/NPASS/compound.php?compoundID=NPC18185,Natural Product,13429,NPO6701,Cinnamomum camphora,https://bidd.group/NPASS/organism.php?org_id=NPO6701,Cinnamomum camphora (camphor tree),NULL,NULL,NULL,NULL,NULL
857396,499033,NPASS,CID 499033,NPC282509,NPC282509,https://bidd.group/NPASS/compound.php?compoundID=NPC282509,Natural Product,13429,NPO6701,Cinnamomum camphora,https://bidd.group/NPASS/organism.php?org_id=NPO6701,Cinnamomum camphora (camphor tree),NULL,NULL,NULL,NULL,NULL
857398,499033,NPASS,CID 499033,NPC282509,NPC282509,https://bidd.group/NPASS/compound.php?compoundID=NPC282509,Natural Product,13429,NPO6701,Cinnamomum camphora,https://bidd.group/NPASS/organism.php?org_id=NPO6701,Cinnamomum camphora (camphor tree),NULL,NULL,NULL,NULL,NULL
857596,519662,LOTUS,Cadin-4-en-10-ol,Q104170958,Cadin-4-en-10-ol,https://www.wikidata.org/wiki/Q104170958,Natural Product,13429,Q158722,Cinnamomum camphora,https://www.wikidata.org/wiki/Q158722,Cinnamomum camphora (camphor tree),DOI:10.1246/BCSJ.41.1465,https://doi.org/10.1246/BCSJ.41.1465,NULL,10.1246/BCSJ.41.1465,https://www.wikidata.org/wiki/Q115517177
857676,521214,LOTUS,Juniper camphor,Q67879974,Juniper camphor,https://www.wikidata.org/wiki/Q67879974,Natural Product,13429,Q158722,Cinnamomum camphora,https://www.wikidata.org/wiki/Q158722,Cinnamomum camphora (camphor tree),DOI:10.1246/BCSJ.41.1465,https://doi.org/10.1246/BCSJ.41.1465,NULL,10.1246/BCSJ.41.1465,https://www.wikidata.org/wiki/Q115517177
857679,521215,LOTUS,"2-(4a-Methyl-8-methylidene-1,2,3,4,5,6,7,8a-octahydronaphthalen-2-yl)propan-2-ol",Q103816897,"2-(4a-Methyl-8-methylidene-1,2,3,4,5,6,7,8a-octahydronaphthalen-2-yl)propan-2-ol",https://www.wikidata.org/wiki/Q103816897,Natural Product,13429,Q158722,Cinnamomum camphora,https://www.wikidata.org/wiki/Q158722,Cinnamomum camphora (camphor tree),DOI:10.1246/BCSJ.41.1465,https://doi.org/10.1246/BCSJ.41.1465,NULL,10.1246/BCSJ.41.1465,https://www.wikidata.org/wiki/Q115517177
857702,521245,LOTUS,"2-(3,8-Dimethyl-1,2,3,4,5,6,7,8-octahydroazulen-5-yl)propan-2-ol",Q81986254,"2-(3,8-Dimethyl-1,2,3,4,5,6,7,8-octahydroazulen-5-yl)propan-2-ol",https://www.wikidata.org/wiki/Q81986254,Natural Product,13429,Q158722,Cinnamomum camphora,https://www.wikidata.org/wiki/Q158722,Cinnamomum camphora (camphor tree),DOI:10.1246/BCSJ.41.1465,https://doi.org/10.1246/BCSJ.41.1465,NULL,10.1246/BCSJ.41.1465,https://www.wikidata.org/wiki/Q115517177
857807,527050,LOTUS,"trans-3,7-Dimethylocta-1,5-diene-3,7-diol",Q105219324,"trans-3,7-Dimethylocta-1,5-diene-3,7-diol",https://www.wikidata.org/wiki/Q105219324,Natural Product,13429,Q158722,Cinnamomum camphora,https://www.wikidata.org/wiki/Q158722,Cinnamomum camphora (camphor tree),DOI:10.1016/S0031-9422(00)81896-8,https://doi.org/10.1016/S0031-9422(00)81896-8,NULL,10.1016/S0031-9422(00)81896-8,https://www.wikidata.org/wiki/Q105034719
858100,543305,LOTUS,"7-Hexadecenoic acid, methyl ester",Q115948408,"7-Hexadecenoic acid, methyl ester",https://www.wikidata.org/wiki/Q115948408,Natural Product,13429,Q158722,Cinnamomum camphora,https://www.wikidata.org/wiki/Q158722,Cinnamomum camphora (camphor tree),DOI:10.5897/JMPR12.157,https://doi.org/10.5897/JMPR12.157,NULL,10.5897/JMPR12.157,https://www.wikidata.org/wiki/Q115784052
858122,547972,LOTUS,2-(4-Ethenyl-4-methyl-3-prop-1-en-2-ylcyclohexyl)propan-2-ol,Q104167115,2-(4-Ethenyl-4-methyl-3-prop-1-en-2-ylcyclohexyl)propan-2-ol,https://www.wikidata.org/wiki/Q104167115,Natural Product,13429,Q158722,Cinnamomum camphora,https://www.wikidata.org/wiki/Q158722,Cinnamomum camphora (camphor tree),DOI:10.1246/BCSJ.41.1465,https://doi.org/10.1246/BCSJ.41.1465,NULL,10.1246/BCSJ.41.1465,https://www.wikidata.org/wiki/Q115517177
858123,548927,LOTUS,"2,6-Dimethylocta-1,7-diene-3,6-diol",Q82106767,"2,6-Dimethylocta-1,7-diene-3,6-diol",https://www.wikidata.org/wiki/Q82106767,Natural Product,13429,Q158722,Cinnamomum camphora,https://www.wikidata.org/wiki/Q158722,Cinnamomum camphora (camphor tree),DOI:10.1016/S0031-9422(00)81896-8,https://doi.org/10.1016/S0031-9422(00)81896-8,NULL,10.1016/S0031-9422(00)81896-8,https://www.wikidata.org/wiki/Q105034719
858154,561870,LOTUS,cis-2-Thujen-4-ol,Q115948109,cis-2-Thujen-4-ol,https://www.wikidata.org/wiki/Q115948109,Natural Product,13429,Q158722,Cinnamomum camphora,https://www.wikidata.org/wiki/Q158722,Cinnamomum camphora (camphor tree),DOI:10.1080/10412905.1993.9698258,https://doi.org/10.1080/10412905.1993.9698258,NULL,10.1080/10412905.1993.9698258,https://www.wikidata.org/wiki/Q104374328
862134,628557,NPASS,Norboldine,NPC4296,NPC4296,https://bidd.group/NPASS/compound.php?compoundID=NPC4296,Natural Product,13429,NPO6701,Cinnamomum camphora,https://bidd.group/NPASS/organism.php?org_id=NPO6701,Cinnamomum camphora (camphor tree),NULL,NULL,NULL,NULL,NULL
862881,637566,LOTUS,Geraniol,Q410836,Geraniol,https://www.wikidata.org/wiki/Q410836,Natural Product,13429,Q158722,Cinnamomum camphora,https://www.wikidata.org/wiki/Q158722,Cinnamomum camphora (camphor tree),DOI:10.1186/1756-3305-7-407|DOI:10.1246/NIKKASHI1921.64.1125,https://doi.org/10.1186/1756-3305-7-407|https://doi.org/10.1246/NIKKASHI1921.64.1125,NULL,10.1186/1756-3305-7-407|10.1246/NIKKASHI1921.64.1125,https://www.wikidata.org/wiki/Q34151429|https://www.wikidata.org/wiki/Q105011523
863017,638011,LOTUS,Citral,Q410888,Citral,https://www.wikidata.org/wiki/Q410888,Natural Product,13429,Q158722,Cinnamomum camphora,https://www.wikidata.org/wiki/Q158722,Cinnamomum camphora (camphor tree),DOI:10.1186/1756-3305-7-407,https://doi.org/10.1186/1756-3305-7-407,NULL,10.1186/1756-3305-7-407,https://www.wikidata.org/wiki/Q34151429
863498,643779,LOTUS,Neral,Q27104033,Neral,https://www.wikidata.org/wiki/Q27104033,Natural Product,13429,Q158722,Cinnamomum camphora,https://www.wikidata.org/wiki/Q158722,Cinnamomum camphora (camphor tree),DOI:10.1080/10412905.1998.9700962,https://doi.org/10.1080/10412905.1998.9700962,NULL,10.1080/10412905.1998.9700962,https://www.wikidata.org/wiki/Q104374951
863581,643820,LOTUS,Nerol,Q415359,Nerol,https://www.wikidata.org/wiki/Q415359,Natural Product,13429,Q158722,Cinnamomum camphora,https://www.wikidata.org/wiki/Q158722,Cinnamomum camphora (camphor tree),DOI:10.1186/1756-3305-7-407,https://doi.org/10.1186/1756-3305-7-407,NULL,10.1186/1756-3305-7-407,https://www.wikidata.org/wiki/Q34151429
868235,1201521,LOTUS,(+)-Fenchone,Q27067421,(+)-Fenchone,https://www.wikidata.org/wiki/Q27067421,Natural Product,13429,Q158722,Cinnamomum camphora,https://www.wikidata.org/wiki/Q158722,Cinnamomum camphora (camphor tree),DOI:10.1080/10575630108041259,https://doi.org/10.1080/10575630108041259,NULL,10.1080/10575630108041259,https://www.wikidata.org/wiki/Q43730825
868407,1549040,NPASS,cis-Anethole,NPC259134,1-Methoxy-4-[(Z)-Prop-1-Enyl]Benzene,https://bidd.group/NPASS/compound.php?compoundID=NPC259134,Natural Product,13429,NPO6701,Cinnamomum camphora,https://bidd.group/NPASS/organism.php?org_id=NPO6701,Cinnamomum camphora (camphor tree),NULL,NULL,NULL,NULL,NULL
868422,1549040,NPASS,cis-Anethole,NPC259134,1-Methoxy-4-[(Z)-Prop-1-Enyl]Benzene,https://bidd.group/NPASS/compound.php?compoundID=NPC259134,Natural Product,13429,NPO6701,Cinnamomum camphora,https://bidd.group/NPASS/organism.php?org_id=NPO6701,Cinnamomum camphora (camphor tree),NULL,NULL,NULL,NULL,NULL
870208,2724161,LOTUS,(+)-Terpinen-4-ol,Q27280168,(+)-Terpinen-4-ol,https://www.wikidata.org/wiki/Q27280168,Natural Product,13429,Q158722,Cinnamomum camphora,https://www.wikidata.org/wiki/Q158722,Cinnamomum camphora (camphor tree),DOI:10.1016/J.INDCROP.2013.06.023,https://doi.org/10.1016/J.INDCROP.2013.06.023,NULL,10.1016/J.INDCROP.2013.06.023,https://www.wikidata.org/wiki/Q115783975
870242,2794921,NPASS,(R)-Fenchone; L-(-)-Fenchone; L-Fenchone; l-Fenchone,NPC293343,(-)-Fenchone,https://bidd.group/NPASS/compound.php?compoundID=NPC293343,Natural Product,13429,NPO6701,Cinnamomum camphora,https://bidd.group/NPASS/organism.php?org_id=NPO6701,Cinnamomum camphora (camphor tree),NULL,NULL,NULL,NULL,NULL
870244,2794921,NPASS,(R)-Fenchone; L-(-)-Fenchone; L-Fenchone; l-Fenchone,NPC293343,(-)-Fenchone,https://bidd.group/NPASS/compound.php?compoundID=NPC293343,Natural Product,13429,NPO6701,Cinnamomum camphora,https://bidd.group/NPASS/organism.php?org_id=NPO6701,Cinnamomum camphora (camphor tree),NULL,NULL,NULL,NULL,NULL
874003,3084131,NPASS,Paulownin,NPC101807,Paulownin,https://bidd.group/NPASS/compound.php?compoundID=NPC101807,Natural Product,13429,NPO6701,Cinnamomum camphora,https://bidd.group/NPASS/organism.php?org_id=NPO6701,Cinnamomum camphora (camphor tree),NULL,NULL,NULL,NULL,NULL
951792,5281515,LOTUS,Caryophyllene,Q421614,Caryophyllene,https://www.wikidata.org/wiki/Q421614,Natural Product,13429,Q158722,Cinnamomum camphora,https://www.wikidata.org/wiki/Q158722,Cinnamomum camphora (camphor tree),DOI:10.1080/10412905.1993.9698258|DOI:10.1246/NIKKASHI1921.64.1125,https://doi.org/10.1080/10412905.1993.9698258|https://doi.org/10.1246/NIKKASHI1921.64.1125,NULL,10.1080/10412905.1993.9698258|10.1246/NIKKASHI1921.64.1125,https://www.wikidata.org/wiki/Q104374328|https://www.wikidata.org/wiki/Q105011523
952754,5281519,LOTUS,Germacrene B,Q27106722,Germacrene B,https://www.wikidata.org/wiki/Q27106722,Natural Product,13429,Q158722,Cinnamomum camphora,https://www.wikidata.org/wiki/Q158722,Cinnamomum camphora (camphor tree),DOI:10.1080/10412905.1998.9700962,https://doi.org/10.1080/10412905.1998.9700962,NULL,10.1080/10412905.1998.9700962,https://www.wikidata.org/wiki/Q104374951
952911,5281520,LOTUS,Humulene,Q1995108,Humulene,https://www.wikidata.org/wiki/Q1995108,Natural Product,13429,Q158722,Cinnamomum camphora,https://www.wikidata.org/wiki/Q158722,Cinnamomum camphora (camphor tree),DOI:10.1080/10412905.1993.9698258,https://doi.org/10.1080/10412905.1993.9698258,NULL,10.1080/10412905.1993.9698258,https://www.wikidata.org/wiki/Q104374328
954087,5281525,LOTUS,"(3S,6E)-Nerolidol",Q27126988,"(3S,6E)-Nerolidol",https://www.wikidata.org/wiki/Q27126988,Natural Product,13429,Q158722,Cinnamomum camphora,https://www.wikidata.org/wiki/Q158722,Cinnamomum camphora (camphor tree),DOI:10.1186/1756-3305-7-407,https://doi.org/10.1186/1756-3305-7-407,NULL,10.1186/1756-3305-7-407,https://www.wikidata.org/wiki/Q34151429
955120,5281553,LOTUS,beta-Ocimene,Q26777012,beta-Ocimene,https://www.wikidata.org/wiki/Q26777012,Natural Product,13429,Q158722,Cinnamomum camphora,https://www.wikidata.org/wiki/Q158722,Cinnamomum camphora (camphor tree),DOI:10.1016/J.INDCROP.2013.06.023|DOI:10.1080/10412905.1993.9698258,https://doi.org/10.1016/J.INDCROP.2013.06.023|https://doi.org/10.1080/10412905.1993.9698258,NULL,10.1016/J.INDCROP.2013.06.023|10.1080/10412905.1993.9698258,https://www.wikidata.org/wiki/Q115783975|https://www.wikidata.org/wiki/Q104374328
970855,5281764,LOTUS,Chicoric acid,Q5119402,Chicoric acid,https://www.wikidata.org/wiki/Q5119402,Natural Product,13429,Q158722,Cinnamomum camphora,https://www.wikidata.org/wiki/Q158722,Cinnamomum camphora (camphor tree),DOI:10.1186/1756-3305-7-407|DOI:10.1080/10412905.1993.9698258,https://doi.org/10.1186/1756-3305-7-407|https://doi.org/10.1080/10412905.1993.9698258,NULL,10.1186/1756-3305-7-407|10.1080/10412905.1993.9698258,https://www.wikidata.org/wiki/Q34151429|https://www.wikidata.org/wiki/Q104374328
977613,5282716,NPASS,3-Octenoic acid,NPC259295,NPC259295,https://bidd.group/NPASS/compound.php?compoundID=NPC259295,Natural Product,13429,NPO6701,Cinnamomum camphora,https://bidd.group/NPASS/organism.php?org_id=NPO6701,Cinnamomum camphora (camphor tree),NULL,NULL,NULL,NULL,NULL
980821,5284503,LOTUS,trans-3-Hexen-1-ol,Q27259468,trans-3-Hexen-1-ol,https://www.wikidata.org/wiki/Q27259468,Natural Product,13429,Q158722,Cinnamomum camphora,https://www.wikidata.org/wiki/Q158722,Cinnamomum camphora (camphor tree),DOI:10.1186/1756-3305-7-407,https://doi.org/10.1186/1756-3305-7-407,NULL,10.1186/1756-3305-7-407,https://www.wikidata.org/wiki/Q34151429
985197,5315338,LOTUS,"4-[(3S,3aR,6R,6aR)-3-(1,3-benzodioxol-5-yl)-1,3,3a,4,6,6a-hexahydrofuro[3,4-c]furan-6-yl]-2-methoxyphenol",Q105283261,"4-[(3S,3aR,6R,6aR)-3-(1,3-benzodioxol-5-yl)-1,3,3a,4,6,6a-hexahydrofuro[3,4-c]furan-6-yl]-2-methoxyphenol",https://www.wikidata.org/wiki/Q105283261,Natural Product,13429,Q158722,Cinnamomum camphora,https://www.wikidata.org/wiki/Q158722,Cinnamomum camphora (camphor tree),DOI:10.1002/JCCS.198400021,https://doi.org/10.1002/JCCS.198400021,NULL,10.1002/JCCS.198400021,https://www.wikidata.org/wiki/Q104384090
985687,5315586,NPASS,"(3S,4aS)-3,8-dimethyl-5-prop-1-en-2-yl-1,2,3,4,4a,5,6,8a-octahydronaphthalene",NPC259317,NPC259317,https://bidd.group/NPASS/compound.php?compoundID=NPC259317,Natural Product,13429,NPO6701,Cinnamomum camphora,https://bidd.group/NPASS/organism.php?org_id=NPO6701,Cinnamomum camphora (camphor tree),NULL,NULL,NULL,NULL,NULL
985688,5315586,NPASS,"(3S,4aS)-3,8-dimethyl-5-prop-1-en-2-yl-1,2,3,4,4a,5,6,8a-octahydronaphthalene",NPC259317,NPC259317,https://bidd.group/NPASS/compound.php?compoundID=NPC259317,Natural Product,13429,NPO6701,Cinnamomum camphora,https://bidd.group/NPASS/organism.php?org_id=NPO6701,Cinnamomum camphora (camphor tree),NULL,NULL,NULL,NULL,NULL
986043,5315645,LOTUS,"1,7-Dimethyl-7-(4-methylpent-3-enyl)bicyclo[2.2.1]heptan-2-ol",Q105252208,"1,7-Dimethyl-7-(4-methylpent-3-enyl)bicyclo[2.2.1]heptan-2-ol",https://www.wikidata.org/wiki/Q105252208,Natural Product,13429,Q158722,Cinnamomum camphora,https://www.wikidata.org/wiki/Q158722,Cinnamomum camphora (camphor tree),DOI:10.1016/S0040-4039(01)89916-0,https://doi.org/10.1016/S0040-4039(01)89916-0,NULL,10.1016/S0040-4039(01)89916-0,https://www.wikidata.org/wiki/Q115947167
986044,5315646,NPASS,Campherenone,NPC108820,NPC108820,https://bidd.group/NPASS/compound.php?compoundID=NPC108820,Natural Product,13429,NPO6701,Cinnamomum camphora,https://bidd.group/NPASS/organism.php?org_id=NPO6701,Cinnamomum camphora (camphor tree),NULL,NULL,NULL,NULL,NULL
986045,5315646,NPASS,Campherenone,NPC108820,NPC108820,https://bidd.group/NPASS/compound.php?compoundID=NPC108820,Natural Product,13429,NPO6701,Cinnamomum camphora,https://bidd.group/NPASS/organism.php?org_id=NPO6701,Cinnamomum camphora (camphor tree),NULL,NULL,NULL,NULL,NULL
986049,5315649,NPASS,gamma-Camphorene,NPC292128,NPC292128,https://bidd.group/NPASS/compound.php?compoundID=NPC292128,Natural Product,13429,NPO6701,Cinnamomum camphora,https://bidd.group/NPASS/organism.php?org_id=NPO6701,Cinnamomum camphora (camphor tree),NULL,NULL,NULL,NULL,NULL
986998,5315892,LOTUS,Cinnamyl alcohol,Q204030,Cinnamyl alcohol,https://www.wikidata.org/wiki/Q204030,Natural Product,13429,Q158722,Cinnamomum camphora,https://www.wikidata.org/wiki/Q158722,Cinnamomum camphora (camphor tree),DOI:10.1002/JCCS.198400021,https://doi.org/10.1002/JCCS.198400021,NULL,10.1002/JCCS.198400021,https://www.wikidata.org/wiki/Q104384090
987656,5316074,NPASS,alpha-Corocalene,NPC109782,NPC109782,https://bidd.group/NPASS/compound.php?compoundID=NPC109782,Natural Product,13429,NPO6701,Cinnamomum camphora,https://bidd.group/NPASS/organism.php?org_id=NPO6701,Cinnamomum camphora (camphor tree),NULL,NULL,NULL,NULL,NULL
987658,5316074,NPASS,alpha-Corocalene,NPC109782,NPC109782,https://bidd.group/NPASS/compound.php?compoundID=NPC109782,Natural Product,13429,NPO6701,Cinnamomum camphora,https://bidd.group/NPASS/organism.php?org_id=NPO6701,Cinnamomum camphora (camphor tree),NULL,NULL,NULL,NULL,NULL
987659,5316074,LOTUS,alpha-Corocalene,Q105293020,alpha-Corocalene,https://www.wikidata.org/wiki/Q105293020,Natural Product,13429,Q158722,Cinnamomum camphora,https://www.wikidata.org/wiki/Q158722,Cinnamomum camphora (camphor tree),DOI:10.1246/BCSJ.41.234,https://doi.org/10.1246/BCSJ.41.234,NULL,10.1246/BCSJ.41.234,https://www.wikidata.org/wiki/Q104970512
993691,5317570,LOTUS,(-)-Germacrene D,Q27121450,(-)-Germacrene D,https://www.wikidata.org/wiki/Q27121450,Natural Product,13429,Q158722,Cinnamomum camphora,https://www.wikidata.org/wiki/Q158722,Cinnamomum camphora (camphor tree),DOI:10.1016/J.INDCROP.2013.06.023|DOI:10.1080/10412905.1998.9700962|DOI:10.1080/10575630108041259,https://doi.org/10.1016/J.INDCROP.2013.06.023|https://doi.org/10.1080/10412905.1998.9700962|https://doi.org/10.1080/10575630108041259,NULL,10.1016/J.INDCROP.2013.06.023|10.1080/10412905.1998.9700962|10.1080/10575630108041259,https://www.wikidata.org/wiki/Q115783975|https://www.wikidata.org/wiki/Q104374951|https://www.wikidata.org/wiki/Q43730825
997222,5318618,NPASS,Isoobtusilactone,NPC209113,Isoobutasilactone,https://bidd.group/NPASS/compound.php?compoundID=NPC209113,Natural Product,13429,NPO6701,Cinnamomum camphora,https://bidd.group/NPASS/organism.php?org_id=NPO6701,Cinnamomum camphora (camphor tree),NULL,NULL,NULL,NULL,NULL
997223,5318618,LOTUS,Isoobtusilactone,Q104394580,Isoobtusilactone,https://www.wikidata.org/wiki/Q104394580,Natural Product,13429,Q158722,Cinnamomum camphora,https://www.wikidata.org/wiki/Q158722,Cinnamomum camphora (camphor tree),DOI:10.1016/S0031-9422(00)89583-7,https://doi.org/10.1016/S0031-9422(00)89583-7,NULL,10.1016/S0031-9422(00)89583-7,https://www.wikidata.org/wiki/Q104394579
998800,5318906,NPASS,"2-[(1S,8S)-1,8-dimethyl-1,2,3,4,6,7,8,8a-octahydronaphthalen-2-yl]propan-2-ol",NPC113243,NPC113243,https://bidd.group/NPASS/compound.php?compoundID=NPC113243,Natural Product,13429,NPO6701,Cinnamomum camphora,https://bidd.group/NPASS/organism.php?org_id=NPO6701,Cinnamomum camphora (camphor tree),NULL,NULL,NULL,NULL,NULL
999107,5318906,NPASS,"2-[(1S,8S)-1,8-dimethyl-1,2,3,4,6,7,8,8a-octahydronaphthalen-2-yl]propan-2-ol",NPC113243,NPC113243,https://bidd.group/NPASS/compound.php?compoundID=NPC113243,Natural Product,13429,NPO6701,Cinnamomum camphora,https://bidd.group/NPASS/organism.php?org_id=NPO6701,Cinnamomum camphora (camphor tree),NULL,NULL,NULL,NULL,NULL
999108,5318906,NPASS,"2-[(1S,8S)-1,8-dimethyl-1,2,3,4,6,7,8,8a-octahydronaphthalen-2-yl]propan-2-ol",NPC113243,NPC113243,https://bidd.group/NPASS/compound.php?compoundID=NPC113243,Natural Product,13429,NPO6701,Cinnamomum camphora,https://bidd.group/NPASS/organism.php?org_id=NPO6701,Cinnamomum camphora (camphor tree),NULL,NULL,NULL,NULL,NULL
1002468,5320128,NPASS,cis-Nerolidol,NPC108494,"(6Z)-3,7,11-Trimethyldodeca-1,6,10-Trien-3-Ol",https://bidd.group/NPASS/compound.php?compoundID=NPC108494,Natural Product,13429,NPO6701,Cinnamomum camphora,https://bidd.group/NPASS/organism.php?org_id=NPO6701,Cinnamomum camphora (camphor tree),NULL,NULL,NULL,NULL,NULL
1002593,5320128,NPASS,cis-Nerolidol,NPC108494,"(6Z)-3,7,11-Trimethyldodeca-1,6,10-Trien-3-Ol",https://bidd.group/NPASS/compound.php?compoundID=NPC108494,Natural Product,13429,NPO6701,Cinnamomum camphora,https://bidd.group/NPASS/organism.php?org_id=NPO6701,Cinnamomum camphora (camphor tree),NULL,NULL,NULL,NULL,NULL
1003564,5320327,NPASS,[(E)-3-methyl-4-(3-methyl-5-oxo-6-propan-2-ylidenecyclohex-2-en-1-yl)but-2-enyl] acetate,NPC178375,NPC178375,https://bidd.group/NPASS/compound.php?compoundID=NPC178375,Natural Product,13429,NPO6701,Cinnamomum camphora,https://bidd.group/NPASS/organism.php?org_id=NPO6701,Cinnamomum camphora (camphor tree),NULL,NULL,NULL,NULL,NULL
1003565,5320327,NPASS,[(E)-3-methyl-4-(3-methyl-5-oxo-6-propan-2-ylidenecyclohex-2-en-1-yl)but-2-enyl] acetate,NPC178375,NPC178375,https://bidd.group/NPASS/compound.php?compoundID=NPC178375,Natural Product,13429,NPO6701,Cinnamomum camphora,https://bidd.group/NPASS/organism.php?org_id=NPO6701,Cinnamomum camphora (camphor tree),NULL,NULL,NULL,NULL,NULL
1005799,5322107,NPASS,"(5E)-10-hydroxy-2,6,10-trimethyldodeca-2,5,11-trien-4-one",NPC160975,NPC160975,https://bidd.group/NPASS/compound.php?compoundID=NPC160975,Natural Product,13429,NPO6701,Cinnamomum camphora,https://bidd.group/NPASS/organism.php?org_id=NPO6701,Cinnamomum camphora (camphor tree),NULL,NULL,NULL,NULL,NULL
1005800,5322107,NPASS,"(5E)-10-hydroxy-2,6,10-trimethyldodeca-2,5,11-trien-4-one",NPC160975,NPC160975,https://bidd.group/NPASS/compound.php?compoundID=NPC160975,Natural Product,13429,NPO6701,Cinnamomum camphora,https://bidd.group/NPASS/organism.php?org_id=NPO6701,Cinnamomum camphora (camphor tree),NULL,NULL,NULL,NULL,NULL
1006316,5325830,LOTUS,(-)-Terpinen-4-ol,Q27271081,(-)-Terpinen-4-ol,https://www.wikidata.org/wiki/Q27271081,Natural Product,13429,Q158722,Cinnamomum camphora,https://www.wikidata.org/wiki/Q158722,Cinnamomum camphora (camphor tree),DOI:10.1016/J.INDCROP.2013.06.023,https://doi.org/10.1016/J.INDCROP.2013.06.023,NULL,10.1016/J.INDCROP.2013.06.023,https://www.wikidata.org/wiki/Q115783975
1008204,5352033,NPASS,Debromoaplysiatoxin,NPC62800,Debromoaplysiatoxin,https://bidd.group/NPASS/compound.php?compoundID=NPC62800,Natural Product,13429,NPO6701,Cinnamomum camphora,https://bidd.group/NPASS/organism.php?org_id=NPO6701,Cinnamomum camphora (camphor tree),NULL,NULL,NULL,NULL,NULL
1008777,5356544,LOTUS,Peruviol,Q27270067,Peruviol,https://www.wikidata.org/wiki/Q27270067,Natural Product,13429,Q158722,Cinnamomum camphora,https://www.wikidata.org/wiki/Q158722,Cinnamomum camphora (camphor tree),DOI:10.1080/10412905.1998.9700962|DOI:10.1080/10412905.1993.9698258,https://doi.org/10.1080/10412905.1998.9700962|https://doi.org/10.1080/10412905.1993.9698258,NULL,10.1080/10412905.1998.9700962|10.1080/10412905.1993.9698258,https://www.wikidata.org/wiki/Q104374951|https://www.wikidata.org/wiki/Q104374328
1009083,5363269,LOTUS,Ethyl oleate,Q6578680,Ethyl oleate,https://www.wikidata.org/wiki/Q6578680,Natural Product,13429,Q158722,Cinnamomum camphora,https://www.wikidata.org/wiki/Q158722,Cinnamomum camphora (camphor tree),DOI:10.1002/PS.3961,https://doi.org/10.1002/PS.3961,NULL,10.1002/PS.3961,https://www.wikidata.org/wiki/Q40251652
1009086,5363269,NPASS,Ethyl oleate,NPC128061,Ethyl Oleate,https://bidd.group/NPASS/compound.php?compoundID=NPC128061,Natural Product,13429,NPO6701,Cinnamomum camphora,https://bidd.group/NPASS/organism.php?org_id=NPO6701,Cinnamomum camphora (camphor tree),PMID:25612070,https://www.ncbi.nlm.nih.gov/pubmed/25612070,25612070,NULL,NULL
1009357,5368821,LOTUS,"2,6-Dimethyl-2,4,6-octatriene",Q15628365,"2,6-Dimethyl-2,4,6-octatriene",https://www.wikidata.org/wiki/Q15628365,Natural Product,13429,Q158722,Cinnamomum camphora,https://www.wikidata.org/wiki/Q158722,Cinnamomum camphora (camphor tree),DOI:10.1186/1756-3305-7-407,https://doi.org/10.1186/1756-3305-7-407,NULL,10.1186/1756-3305-7-407,https://www.wikidata.org/wiki/Q34151429
1010451,5463450,LOTUS,trans-Dihydroocimene,Q105313067,trans-Dihydroocimene,https://www.wikidata.org/wiki/Q105313067,Natural Product,13429,Q158722,Cinnamomum camphora,https://www.wikidata.org/wiki/Q158722,Cinnamomum camphora (camphor tree),DOI:10.1186/1756-3305-7-407|DOI:10.1080/10412905.1993.9698258,https://doi.org/10.1186/1756-3305-7-407|https://doi.org/10.1080/10412905.1993.9698258,NULL,10.1186/1756-3305-7-407|10.1080/10412905.1993.9698258,https://www.wikidata.org/wiki/Q34151429|https://www.wikidata.org/wiki/Q104374328
1013221,5742590,LOTUS,Sitogluside,Q15410900,Sitogluside,https://www.wikidata.org/wiki/Q15410900,Natural Product,13429,Q158722,Cinnamomum camphora,https://www.wikidata.org/wiki/Q158722,Cinnamomum camphora (camphor tree),DOI:10.1002/JCCS.198400021,https://doi.org/10.1002/JCCS.198400021,NULL,10.1002/JCCS.198400021,https://www.wikidata.org/wiki/Q104384090
1013717,5743442,NPASS,Octacosyl ferulate,NPC63959,NPC63959,https://bidd.group/NPASS/compound.php?compoundID=NPC63959,Natural Product,13429,NPO6701,Cinnamomum camphora,https://bidd.group/NPASS/organism.php?org_id=NPO6701,Cinnamomum camphora (camphor tree),NULL,NULL,NULL,NULL,NULL
1015258,5867807,NPASS,"9,12-Octadecadienoate",NPC223695,NPC223695,https://bidd.group/NPASS/compound.php?compoundID=NPC223695,Natural Product,13429,NPO6701,Cinnamomum camphora,https://bidd.group/NPASS/organism.php?org_id=NPO6701,Cinnamomum camphora (camphor tree),NULL,NULL,NULL,NULL,NULL
1015265,5957728,NPASS,Cinnamate,NPC239564,NPC239564,https://bidd.group/NPASS/compound.php?compoundID=NPC239564,Natural Product,13429,NPO6701,Cinnamomum camphora,https://bidd.group/NPASS/organism.php?org_id=NPO6701,Cinnamomum camphora (camphor tree),NULL,NULL,NULL,NULL,NULL
1015332,5957728,NPASS,Cinnamate,NPC239564,NPC239564,https://bidd.group/NPASS/compound.php?compoundID=NPC239564,Natural Product,13429,NPO6701,Cinnamomum camphora,https://bidd.group/NPASS/organism.php?org_id=NPO6701,Cinnamomum camphora (camphor tree),NULL,NULL,NULL,NULL,NULL
1020598,6321405,LOTUS,(-)-Isoborneol,Q15644616,(-)-Isoborneol,https://www.wikidata.org/wiki/Q15644616,Natural Product,13429,Q158722,Cinnamomum camphora,https://www.wikidata.org/wiki/Q158722,Cinnamomum camphora (camphor tree),DOI:10.1080/10575630108041259|DOI:10.1038/SREP46579,https://doi.org/10.1080/10575630108041259|https://doi.org/10.1038/SREP46579,NULL,10.1080/10575630108041259|10.1038/SREP46579,https://www.wikidata.org/wiki/Q43730825|https://www.wikidata.org/wiki/Q33470311
1020978,6326181,LOTUS,4-Thujanol,Q27276574,4-Thujanol,https://www.wikidata.org/wiki/Q27276574,Natural Product,13429,Q158722,Cinnamomum camphora,https://www.wikidata.org/wiki/Q158722,Cinnamomum camphora (camphor tree),DOI:10.1016/J.INDCROP.2013.06.023|DOI:10.1186/1756-3305-7-407,https://doi.org/10.1016/J.INDCROP.2013.06.023|https://doi.org/10.1186/1756-3305-7-407,NULL,10.1016/J.INDCROP.2013.06.023|10.1186/1756-3305-7-407,https://www.wikidata.org/wiki/Q115783975|https://www.wikidata.org/wiki/Q34151429
1024465,6427787,LOTUS,"(3S,6S)-6-ethenyl-2,2,6-trimethyloxan-3-ol",Q104923630,"(3S,6S)-6-ethenyl-2,2,6-trimethyloxan-3-ol",https://www.wikidata.org/wiki/Q104923630,Natural Product,13429,Q158722,Cinnamomum camphora,https://www.wikidata.org/wiki/Q158722,Cinnamomum camphora (camphor tree),DOI:10.1186/1756-3305-7-407,https://doi.org/10.1186/1756-3305-7-407,NULL,10.1186/1756-3305-7-407,https://www.wikidata.org/wiki/Q34151429
1024636,6429022,NPASS,trans-Calamenene,NPC7965,NPC7965,https://bidd.group/NPASS/compound.php?compoundID=NPC7965,Natural Product,13429,NPO6701,Cinnamomum camphora,https://bidd.group/NPASS/organism.php?org_id=NPO6701,Cinnamomum camphora (camphor tree),NULL,NULL,NULL,NULL,NULL
1024905,6429302,LOTUS,trans-alpha-Bergamotene,Q27132147,trans-alpha-Bergamotene,https://www.wikidata.org/wiki/Q27132147,Natural Product,13429,Q158722,Cinnamomum camphora,https://www.wikidata.org/wiki/Q158722,Cinnamomum camphora (camphor tree),DOI:10.1080/10575630108041259,https://doi.org/10.1080/10575630108041259,NULL,10.1080/10575630108041259,https://www.wikidata.org/wiki/Q43730825
1025002,6431197,LOTUS,Santalene (minor),Q105208294,Santalene (minor),https://www.wikidata.org/wiki/Q105208294,Natural Product,13429,Q158722,Cinnamomum camphora,https://www.wikidata.org/wiki/Q158722,Cinnamomum camphora (camphor tree),DOI:10.1080/10575630108041259,https://doi.org/10.1080/10575630108041259,NULL,10.1080/10575630108041259,https://www.wikidata.org/wiki/Q43730825
1025020,6432005,LOTUS,gamma-Eudesmol,Q27131974,gamma-Eudesmol,https://www.wikidata.org/wiki/Q27131974,Natural Product,13429,Q158722,Cinnamomum camphora,https://www.wikidata.org/wiki/Q158722,Cinnamomum camphora (camphor tree),DOI:10.5897/JMPR12.157,https://doi.org/10.5897/JMPR12.157,NULL,10.5897/JMPR12.157,https://www.wikidata.org/wiki/Q115784052
1027661,6434062,LOTUS,"Octatriene, dimethyl-",Q76325757,"Octatriene, dimethyl-",https://www.wikidata.org/wiki/Q76325757,Natural Product,13429,Q158722,Cinnamomum camphora,https://www.wikidata.org/wiki/Q158722,Cinnamomum camphora (camphor tree),DOI:10.1080/10412905.1993.9698258,https://doi.org/10.1080/10412905.1993.9698258,NULL,10.1080/10412905.1993.9698258,https://www.wikidata.org/wiki/Q104374328
1027874,6440420,NPASS,"4-Tetradecenamide, N-((2Z)-2-((1S,3R,4R,6S)-4-(acetyloxy)-3-methyl-2-oxo-7-oxabicyclo(4.1.0)hept-1-yl)-3-chloro-2-propenyl)-7-methoxy-N-methyl-, (4E,7S)-",NPC64895,NPC64895,https://bidd.group/NPASS/compound.php?compoundID=NPC64895,Natural Product,13429,NPO6701,Cinnamomum camphora,https://bidd.group/NPASS/organism.php?org_id=NPO6701,Cinnamomum camphora (camphor tree),NULL,NULL,NULL,NULL,NULL
1028122,6442492,NPASS,Obtusilactone A,NPC49302,Obtusilactone A,https://bidd.group/NPASS/compound.php?compoundID=NPC49302,Natural Product,13429,NPO6701,Cinnamomum camphora,https://bidd.group/NPASS/organism.php?org_id=NPO6701,Cinnamomum camphora (camphor tree),NULL,NULL,NULL,NULL,NULL
1028123,6442493,LOTUS,Isooblusilactonc A,Q104993216,Isooblusilactonc A,https://www.wikidata.org/wiki/Q104993216,Natural Product,13429,Q158722,Cinnamomum camphora,https://www.wikidata.org/wiki/Q158722,Cinnamomum camphora (camphor tree),DOI:10.1016/S0031-9422(00)89583-7,https://doi.org/10.1016/S0031-9422(00)89583-7,NULL,10.1016/S0031-9422(00)89583-7,https://www.wikidata.org/wiki/Q104394579
1028124,6442495,LOTUS,Obtusilactone,Q104398771,Obtusilactone,https://www.wikidata.org/wiki/Q104398771,Natural Product,13429,Q158722,Cinnamomum camphora,https://www.wikidata.org/wiki/Q158722,Cinnamomum camphora (camphor tree),DOI:10.1016/S0031-9422(00)89583-7,https://doi.org/10.1016/S0031-9422(00)89583-7,NULL,10.1016/S0031-9422(00)89583-7,https://www.wikidata.org/wiki/Q104394579
1028125,6442495,NPASS,Obtusilactone,NPC127118,Obtusilactone,https://bidd.group/NPASS/compound.php?compoundID=NPC127118,Natural Product,13429,NPO6701,Cinnamomum camphora,https://bidd.group/NPASS/organism.php?org_id=NPO6701,Cinnamomum camphora (camphor tree),NULL,NULL,NULL,NULL,NULL
1028611,6482487,LOTUS,"Epicatechin 5,7,3'-trimethyl ether",Q76390149,"Epicatechin 5,7,3'-trimethyl ether",https://www.wikidata.org/wiki/Q76390149,Natural Product,13429,Q158722,Cinnamomum camphora,https://www.wikidata.org/wiki/Q158722,Cinnamomum camphora (camphor tree),DOI:10.1016/S0031-9422(00)89583-7,https://doi.org/10.1016/S0031-9422(00)89583-7,NULL,10.1016/S0031-9422(00)89583-7,https://www.wikidata.org/wiki/Q104394579
1030865,6918391,LOTUS,beta-Elemene,Q27132237,beta-Elemene,https://www.wikidata.org/wiki/Q27132237,Natural Product,13429,Q158722,Cinnamomum camphora,https://www.wikidata.org/wiki/Q158722,Cinnamomum camphora (camphor tree),DOI:10.1246/BCSJ.41.234|DOI:10.1080/10412905.1998.9700962|DOI:10.1080/10575630108041259,https://doi.org/10.1246/BCSJ.41.234|https://doi.org/10.1080/10412905.1998.9700962|https://doi.org/10.1080/10575630108041259,NULL,10.1246/BCSJ.41.234|10.1080/10412905.1998.9700962|10.1080/10575630108041259,https://www.wikidata.org/wiki/Q104970512|https://www.wikidata.org/wiki/Q104374951|https://www.wikidata.org/wiki/Q43730825
1031187,6973640,LOTUS,(+)-Isoborneol,Q27270411,(+)-Isoborneol,https://www.wikidata.org/wiki/Q27270411,Natural Product,13429,Q158722,Cinnamomum camphora,https://www.wikidata.org/wiki/Q158722,Cinnamomum camphora (camphor tree),DOI:10.1186/1756-3305-7-407|DOI:10.1038/SREP46579|DOI:10.1016/J.INDCROP.2013.06.023|DOI:10.1080/10412905.1998.9700962|DOI:10.1080/10575630108041259|DOI:10.5897/JMPR12.157,https://doi.org/10.1186/1756-3305-7-407|https://doi.org/10.1038/SREP46579|https://doi.org/10.1016/J.INDCROP.2013.06.023|https://doi.org/10.1080/10412905.1998.9700962|https://doi.org/10.1080/10575630108041259|https://doi.org/10.5897/JMPR12.157,NULL,10.1186/1756-3305-7-407|10.1038/SREP46579|10.1016/J.INDCROP.2013.06.023|10.1080/10412905.1998.9700962|10.1080/10575630108041259|10.5897/JMPR12.157,https://www.wikidata.org/wiki/Q34151429|https://www.wikidata.org/wiki/Q33470311|https://www.wikidata.org/wiki/Q115783975|https://www.wikidata.org/wiki/Q104374951|https://www.wikidata.org/wiki/Q43730825|https://www.wikidata.org/wiki/Q115784052
1053740,10093349,LOTUS,"3-(3,4-Dimethoxybenzyl)-4-(3,4,5-trimethoxybenzyl)-dihydrofuran-2(5H)-one",Q110076022,"3-(3,4-Dimethoxybenzyl)-4-(3,4,5-trimethoxybenzyl)-dihydrofuran-2(5H)-one",https://www.wikidata.org/wiki/Q110076022,Natural Product,13429,Q158722,Cinnamomum camphora,https://www.wikidata.org/wiki/Q158722,Cinnamomum camphora (camphor tree),DOI:10.1246/BCSJ.50.2821,https://doi.org/10.1246/BCSJ.50.2821,NULL,10.1246/BCSJ.50.2821,https://www.wikidata.org/wiki/Q104968679
1054339,10104370,LOTUS,beta-Bisabolene,Q11595687,beta-Bisabolene,https://www.wikidata.org/wiki/Q11595687,Natural Product,13429,Q158722,Cinnamomum camphora,https://www.wikidata.org/wiki/Q158722,Cinnamomum camphora (camphor tree),DOI:10.5897/JMPR12.157,https://doi.org/10.5897/JMPR12.157,NULL,10.5897/JMPR12.157,https://www.wikidata.org/wiki/Q115784052
1061035,10336729,LOTUS,"(2R,3R)-2-(Benzo[d][1,3]dioxol-5-yl)-5,7-dimethoxychroman-3-ol",Q72445454,"(2R,3R)-2-(Benzo[d][1,3]dioxol-5-yl)-5,7-dimethoxychroman-3-ol",https://www.wikidata.org/wiki/Q72445454,Natural Product,13429,Q158722,Cinnamomum camphora,https://www.wikidata.org/wiki/Q158722,Cinnamomum camphora (camphor tree),DOI:10.1016/S0031-9422(00)89583-7,https://doi.org/10.1016/S0031-9422(00)89583-7,NULL,10.1016/S0031-9422(00)89583-7,https://www.wikidata.org/wiki/Q104394579
1069878,10487440,NPASS,CID 10487440,NPC235901,NPC235901,https://bidd.group/NPASS/compound.php?compoundID=NPC235901,Natural Product,13429,NPO6701,Cinnamomum camphora,https://bidd.group/NPASS/organism.php?org_id=NPO6701,Cinnamomum camphora (camphor tree),NULL,NULL,NULL,NULL,NULL
1069894,10487440,NPASS,CID 10487440,NPC235901,NPC235901,https://bidd.group/NPASS/compound.php?compoundID=NPC235901,Natural Product,13429,NPO6701,Cinnamomum camphora,https://bidd.group/NPASS/organism.php?org_id=NPO6701,Cinnamomum camphora (camphor tree),NULL,NULL,NULL,NULL,NULL
1071168,10528184,NPASS,Malyngamide N,NPC21324,Malyngamide N,https://bidd.group/NPASS/compound.php?compoundID=NPC21324,Natural Product,13429,NPO6701,Cinnamomum camphora,https://bidd.group/NPASS/organism.php?org_id=NPO6701,Cinnamomum camphora (camphor tree),NULL,NULL,NULL,NULL,NULL
1073332,10623415,NPASS,malyngamide M,NPC17374,Malyngamide M,https://bidd.group/NPASS/compound.php?compoundID=NPC17374,Natural Product,13429,NPO6701,Cinnamomum camphora,https://bidd.group/NPASS/organism.php?org_id=NPO6701,Cinnamomum camphora (camphor tree),NULL,NULL,NULL,NULL,NULL
1083149,10856614,LOTUS,alpha-Selinene,Q7448480,alpha-Selinene,https://www.wikidata.org/wiki/Q7448480,Natural Product,13429,Q158722,Cinnamomum camphora,https://www.wikidata.org/wiki/Q158722,Cinnamomum camphora (camphor tree),DOI:10.1016/J.INDCROP.2013.06.023,https://doi.org/10.1016/J.INDCROP.2013.06.023,NULL,10.1016/J.INDCROP.2013.06.023,https://www.wikidata.org/wiki/Q115783975
1083468,10887971,LOTUS,(+)-Sabinene,Q27121788,(+)-Sabinene,https://www.wikidata.org/wiki/Q27121788,Natural Product,13429,Q158722,Cinnamomum camphora,https://www.wikidata.org/wiki/Q158722,Cinnamomum camphora (camphor tree),DOI:10.1016/J.INDCROP.2013.06.023|DOI:10.5897/JMPR12.157|DOI:10.1080/10412905.1998.9700962|DOI:10.1080/10575630108041259,https://doi.org/10.1016/J.INDCROP.2013.06.023|https://doi.org/10.5897/JMPR12.157|https://doi.org/10.1080/10412905.1998.9700962|https://doi.org/10.1080/10575630108041259,NULL,10.1016/J.INDCROP.2013.06.023|10.5897/JMPR12.157|10.1080/10412905.1998.9700962|10.1080/10575630108041259,https://www.wikidata.org/wiki/Q115783975|https://www.wikidata.org/wiki/Q115784052|https://www.wikidata.org/wiki/Q104374951|https://www.wikidata.org/wiki/Q43730825
1083487,10889018,LOTUS,beta-Santalene,Q27108639,beta-Santalene,https://www.wikidata.org/wiki/Q27108639,Natural Product,13429,Q158722,Cinnamomum camphora,https://www.wikidata.org/wiki/Q158722,Cinnamomum camphora (camphor tree),DOI:10.1246/BCSJ.41.234,https://doi.org/10.1246/BCSJ.41.234,NULL,10.1246/BCSJ.41.234,https://www.wikidata.org/wiki/Q104970512
1084962,10894352,NPASS,"(3S,4R)-3,4-Bis(3,4-dimethoxybenzyl)tetrahydrofuran-2-one",NPC90276,NPC90276,https://bidd.group/NPASS/compound.php?compoundID=NPC90276,Natural Product,13429,NPO6701,Cinnamomum camphora,https://bidd.group/NPASS/organism.php?org_id=NPO6701,Cinnamomum camphora (camphor tree),NULL,NULL,NULL,NULL,NULL
1090751,10987383,LOTUS,10-Epizonarene,Q104995584,10-Epizonarene,https://www.wikidata.org/wiki/Q104995584,Natural Product,13429,Q158722,Cinnamomum camphora,https://www.wikidata.org/wiki/Q158722,Cinnamomum camphora (camphor tree),DOI:10.1080/10575630108041259,https://doi.org/10.1080/10575630108041259,NULL,10.1080/10575630108041259,https://www.wikidata.org/wiki/Q43730825
1105934,11250133,NPASS,Procyanidin B1,NPC108811,Procyanidin B1,https://bidd.group/NPASS/compound.php?compoundID=NPC108811,Natural Product,13429,NPO6701,Cinnamomum camphora,https://bidd.group/NPASS/organism.php?org_id=NPO6701,Cinnamomum camphora (camphor tree),NULL,NULL,NULL,NULL,NULL
1105941,11250133,NPASS,Procyanidin B1,NPC108811,Procyanidin B1,https://bidd.group/NPASS/compound.php?compoundID=NPC108811,Natural Product,13429,NPO6701,Cinnamomum camphora,https://bidd.group/NPASS/organism.php?org_id=NPO6701,Cinnamomum camphora (camphor tree),NULL,NULL,NULL,NULL,NULL
1116802,11469649,LOTUS,"3-Cyclohexene-1-methanol, alpha,alpha,4-trimethyl-, 1-acetate, (1R)-",Q27289621,"3-Cyclohexene-1-methanol, alpha,alpha,4-trimethyl-, 1-acetate, (1R)-",https://www.wikidata.org/wiki/Q27289621,Natural Product,13429,Q158722,Cinnamomum camphora,https://www.wikidata.org/wiki/Q158722,Cinnamomum camphora (camphor tree),DOI:10.1080/10412905.1998.9700962,https://doi.org/10.1080/10412905.1998.9700962,NULL,10.1080/10412905.1998.9700962,https://www.wikidata.org/wiki/Q104374951
1125767,11744854,LOTUS,cis-Sabinene hydrate,Q105147491,cis-Sabinene hydrate,https://www.wikidata.org/wiki/Q105147491,Natural Product,13429,Q158722,Cinnamomum camphora,https://www.wikidata.org/wiki/Q158722,Cinnamomum camphora (camphor tree),DOI:10.1016/J.INDCROP.2013.06.023|DOI:10.1080/10412905.1998.9700962,https://doi.org/10.1016/J.INDCROP.2013.06.023|https://doi.org/10.1080/10412905.1998.9700962,NULL,10.1016/J.INDCROP.2013.06.023|10.1080/10412905.1998.9700962,https://www.wikidata.org/wiki/Q115783975|https://www.wikidata.org/wiki/Q104374951
1141915,12300118,LOTUS,14-Hydroxy-9-epi-caryophyllene,Q67879567,14-Hydroxy-9-epi-caryophyllene,https://www.wikidata.org/wiki/Q67879567,Natural Product,13429,Q158722,Cinnamomum camphora,https://www.wikidata.org/wiki/Q158722,Cinnamomum camphora (camphor tree),DOI:10.1080/10412905.1998.9700962,https://doi.org/10.1080/10412905.1998.9700962,NULL,10.1080/10412905.1998.9700962,https://www.wikidata.org/wiki/Q104374951
1141938,12302243,LOTUS,alpha-Calacorene,Q104253247,alpha-Calacorene,https://www.wikidata.org/wiki/Q104253247,Natural Product,13429,Q158722,Cinnamomum camphora,https://www.wikidata.org/wiki/Q158722,Cinnamomum camphora (camphor tree),DOI:10.1246/BCSJ.41.234|DOI:10.1080/10575630108041259,https://doi.org/10.1246/BCSJ.41.234|https://doi.org/10.1080/10575630108041259,NULL,10.1246/BCSJ.41.234|10.1080/10575630108041259,https://www.wikidata.org/wiki/Q104970512|https://www.wikidata.org/wiki/Q43730825
1141943,12302243,NPASS,alpha-Calacorene,NPC74474,NPC74474,https://bidd.group/NPASS/compound.php?compoundID=NPC74474,Natural Product,13429,NPO6701,Cinnamomum camphora,https://bidd.group/NPASS/organism.php?org_id=NPO6701,Cinnamomum camphora (camphor tree),NULL,NULL,NULL,NULL,NULL
1142343,12306053,LOTUS,(+)-alpha-Bulgarene,Q105223892,(+)-alpha-Bulgarene,https://www.wikidata.org/wiki/Q105223892,Natural Product,13429,Q158722,Cinnamomum camphora,https://www.wikidata.org/wiki/Q158722,Cinnamomum camphora (camphor tree),DOI:10.1080/10575630108041259,https://doi.org/10.1080/10575630108041259,NULL,10.1080/10575630108041259,https://www.wikidata.org/wiki/Q43730825
1142478,12309449,LOTUS,delta-Elemene,Q63409802,delta-Elemene,https://www.wikidata.org/wiki/Q63409802,Natural Product,13429,Q158722,Cinnamomum camphora,https://www.wikidata.org/wiki/Q158722,Cinnamomum camphora (camphor tree),DOI:10.1016/J.INDCROP.2013.06.023,https://doi.org/10.1016/J.INDCROP.2013.06.023,NULL,10.1016/J.INDCROP.2013.06.023,https://www.wikidata.org/wiki/Q115783975
1142692,12309838,LOTUS,(+)-alpha-Fenchene,Q24791135,(+)-alpha-Fenchene,https://www.wikidata.org/wiki/Q24791135,Natural Product,13429,Q158722,Cinnamomum camphora,https://www.wikidata.org/wiki/Q158722,Cinnamomum camphora (camphor tree),DOI:10.1016/J.INDCROP.2013.06.023|DOI:10.1080/10412905.1998.9700962,https://doi.org/10.1016/J.INDCROP.2013.06.023|https://doi.org/10.1080/10412905.1998.9700962,NULL,10.1016/J.INDCROP.2013.06.023|10.1080/10412905.1998.9700962,https://www.wikidata.org/wiki/Q115783975|https://www.wikidata.org/wiki/Q104374951
1143039,12313021,LOTUS,"(4aalpha,8aalpha)-1alpha,2,3,4,4a,5,6,8a-Octahydro-7-methyl-4-methylene-1-(1-methylethyl)naphthalene",Q105311238,"(4aalpha,8aalpha)-1alpha,2,3,4,4a,5,6,8a-Octahydro-7-methyl-4-methylene-1-(1-methylethyl)naphthalene",https://www.wikidata.org/wiki/Q105311238,Natural Product,13429,Q158722,Cinnamomum camphora,https://www.wikidata.org/wiki/Q158722,Cinnamomum camphora (camphor tree),DOI:10.1080/10575630108041259,https://doi.org/10.1080/10575630108041259,NULL,10.1080/10575630108041259,https://www.wikidata.org/wiki/Q43730825
1143040,12313023,LOTUS,(+)-gamma-Bulgarene,Q105311291,(+)-gamma-Bulgarene,https://www.wikidata.org/wiki/Q105311291,Natural Product,13429,Q158722,Cinnamomum camphora,https://www.wikidata.org/wiki/Q158722,Cinnamomum camphora (camphor tree),DOI:10.1080/10575630108041259,https://doi.org/10.1080/10575630108041259,NULL,10.1080/10575630108041259,https://www.wikidata.org/wiki/Q43730825
1143202,12314479,LOTUS,"(3S,8S,9S,10R,13R,14S,17R)-17-[(E,2S,5S)-5-Ethyl-6-methylhept-3-en-2-yl]-10,13-dimethyl-2,3,4,7,8,9,11,12,14,15,16,17-dodecahydro-1H-cyclopenta[a]phenanthren-3-ol",Q104415348,"(3S,8S,9S,10R,13R,14S,17R)-17-[(E,2S,5S)-5-Ethyl-6-methylhept-3-en-2-yl]-10,13-dimethyl-2,3,4,7,8,9,11,12,14,15,16,17-dodecahydro-1H-cyclopenta[a]phenanthren-3-ol",https://www.wikidata.org/wiki/Q104415348,Natural Product,13429,Q158722,Cinnamomum camphora,https://www.wikidata.org/wiki/Q158722,Cinnamomum camphora (camphor tree),DOI:10.1177/1934578X0600100104,https://doi.org/10.1177/1934578X0600100104,NULL,10.1177/1934578X0600100104,https://www.wikidata.org/wiki/Q115784957
1150367,13747828,NPASS,(-)-Paulownin,NPC266588,NPC266588,https://bidd.group/NPASS/compound.php?compoundID=NPC266588,Natural Product,13429,NPO6701,Cinnamomum camphora,https://bidd.group/NPASS/organism.php?org_id=NPO6701,Cinnamomum camphora (camphor tree),NULL,NULL,NULL,NULL,NULL
1151853,13854258,LOTUS,"(1aR,4aR,7S,7aS,7bR)-1,1,7-trimethyl-4-methylidene-1a,2,3,4a,5,6,7a,7b-octahydrocyclopropa[h]azulen-7-ol",Q105000256,"(1aR,4aR,7S,7aS,7bR)-1,1,7-trimethyl-4-methylidene-1a,2,3,4a,5,6,7a,7b-octahydrocyclopropa[h]azulen-7-ol",https://www.wikidata.org/wiki/Q105000256,Natural Product,13429,Q158722,Cinnamomum camphora,https://www.wikidata.org/wiki/Q158722,Cinnamomum camphora (camphor tree),DOI:10.1186/1756-3305-7-407|DOI:10.1080/10412905.1998.9700962,https://doi.org/10.1186/1756-3305-7-407|https://doi.org/10.1080/10412905.1998.9700962,NULL,10.1186/1756-3305-7-407|10.1080/10412905.1998.9700962,https://www.wikidata.org/wiki/Q34151429|https://www.wikidata.org/wiki/Q104374951
1153149,13894537,LOTUS,Bicyclogermacrene,Q27132747,Bicyclogermacrene,https://www.wikidata.org/wiki/Q27132747,Natural Product,13429,Q158722,Cinnamomum camphora,https://www.wikidata.org/wiki/Q158722,Cinnamomum camphora (camphor tree),DOI:10.1080/10412905.1998.9700962,https://doi.org/10.1080/10412905.1998.9700962,NULL,10.1080/10412905.1998.9700962,https://www.wikidata.org/wiki/Q104374951
1154830,14032964,LOTUS,"3,6-Bis(2H-1,3-benzodioxol-5-yl)tetrahydro-1H,3H-furo[3,4-c]furan-1-ol",Q82435892,"3,6-Bis(2H-1,3-benzodioxol-5-yl)tetrahydro-1H,3H-furo[3,4-c]furan-1-ol",https://www.wikidata.org/wiki/Q82435892,Natural Product,13429,Q158722,Cinnamomum camphora,https://www.wikidata.org/wiki/Q158722,Cinnamomum camphora (camphor tree),DOI:10.1002/JCCS.198400021,https://doi.org/10.1002/JCCS.198400021,NULL,10.1002/JCCS.198400021,https://www.wikidata.org/wiki/Q104384090
1178331,15241420,LOTUS,"(3E,6S)-2,6-Dimethylocta-3,7-diene-2,6-diol",Q105219325,"(3E,6S)-2,6-Dimethylocta-3,7-diene-2,6-diol",https://www.wikidata.org/wiki/Q105219325,Natural Product,13429,Q158722,Cinnamomum camphora,https://www.wikidata.org/wiki/Q158722,Cinnamomum camphora (camphor tree),DOI:10.1016/S0031-9422(00)89020-2,https://doi.org/10.1016/S0031-9422(00)89020-2,NULL,10.1016/S0031-9422(00)89020-2,https://www.wikidata.org/wiki/Q105035679
1186218,15560285,LOTUS,(+)-gamma-Gurjunene,Q104989706,(+)-gamma-Gurjunene,https://www.wikidata.org/wiki/Q104989706,Natural Product,13429,Q158722,Cinnamomum camphora,https://www.wikidata.org/wiki/Q158722,Cinnamomum camphora (camphor tree),DOI:10.1016/J.INDCROP.2013.06.023,https://doi.org/10.1016/J.INDCROP.2013.06.023,NULL,10.1016/J.INDCROP.2013.06.023,https://www.wikidata.org/wiki/Q115783975
1186294,15625635,LOTUS,Randilongin,Q76506782,Randilongin,https://www.wikidata.org/wiki/Q76506782,Natural Product,13429,Q158722,Cinnamomum camphora,https://www.wikidata.org/wiki/Q158722,Cinnamomum camphora (camphor tree),DOI:10.1002/JCCS.198400021,https://doi.org/10.1002/JCCS.198400021,NULL,10.1002/JCCS.198400021,https://www.wikidata.org/wiki/Q104384090
1187858,15775267,LOTUS,"(1aR,4R,4aR,7aS,7bR)-1,1,4-trimethyl-7-methylidene-2,3,4,4a,5,6,7a,7b-octahydro-1aH-cyclopropa[e]azulene",Q110077228,"(1aR,4R,4aR,7aS,7bR)-1,1,4-trimethyl-7-methylidene-2,3,4,4a,5,6,7a,7b-octahydro-1aH-cyclopropa[e]azulene",https://www.wikidata.org/wiki/Q110077228,Natural Product,13429,Q158722,Cinnamomum camphora,https://www.wikidata.org/wiki/Q158722,Cinnamomum camphora (camphor tree),DOI:10.1016/J.INDCROP.2013.06.023,https://doi.org/10.1016/J.INDCROP.2013.06.023,NULL,10.1016/J.INDCROP.2013.06.023,https://www.wikidata.org/wiki/Q115783975
1212988,21672112,NPASS,"[(1R)-1-[(1S,3R,4S,5S,9R,13S,14R)-13-hydroxy-3-[(2S,5S)-5-(3-hydroxyphenyl)-5-methoxypentan-2-yl]-4,14,16,16-tetramethyl-7,11-dioxo-2,6,10,17-tetraoxatricyclo[11.3.1.11,5]octadecan-9-yl]ethyl] acetate",NPC234104,NPC234104,https://bidd.group/NPASS/compound.php?compoundID=NPC234104,Natural Product,13429,NPO6701,Cinnamomum camphora,https://bidd.group/NPASS/organism.php?org_id=NPO6701,Cinnamomum camphora (camphor tree),NULL,NULL,NULL,NULL,NULL
1212989,21672113,NPASS,Manauealide B,NPC121260,NPC121260,https://bidd.group/NPASS/compound.php?compoundID=NPC121260,Natural Product,13429,NPO6701,Cinnamomum camphora,https://bidd.group/NPASS/organism.php?org_id=NPO6701,Cinnamomum camphora (camphor tree),NULL,NULL,NULL,NULL,NULL
1212990,21672114,NPASS,Aplysiatoxin,NPC51198,Aplysiatoxin,https://bidd.group/NPASS/compound.php?compoundID=NPC51198,Natural Product,13429,NPO6701,Cinnamomum camphora,https://bidd.group/NPASS/organism.php?org_id=NPO6701,Cinnamomum camphora (camphor tree),NULL,NULL,NULL,NULL,NULL
1220593,22435466,LOTUS,"(4E)-hexa-2,4-diene",Q115948011,"(4E)-hexa-2,4-diene",https://www.wikidata.org/wiki/Q115948011,Natural Product,13429,Q158722,Cinnamomum camphora,https://www.wikidata.org/wiki/Q158722,Cinnamomum camphora (camphor tree),DOI:10.1186/1756-3305-7-407,https://doi.org/10.1186/1756-3305-7-407,NULL,10.1186/1756-3305-7-407,https://www.wikidata.org/wiki/Q34151429
1225017,23308299,NPASS,"(4S)-1,7,7-trimethylbicyclo[2.2.1]heptan-2-one",NPC273607,NPC273607,https://bidd.group/NPASS/compound.php?compoundID=NPC273607,Natural Product,13429,NPO6701,Cinnamomum camphora,https://bidd.group/NPASS/organism.php?org_id=NPO6701,Cinnamomum camphora (camphor tree),NULL,NULL,NULL,NULL,NULL
1225019,23308299,NPASS,"(4S)-1,7,7-trimethylbicyclo[2.2.1]heptan-2-one",NPC273607,NPC273607,https://bidd.group/NPASS/compound.php?compoundID=NPC273607,Natural Product,13429,NPO6701,Cinnamomum camphora,https://bidd.group/NPASS/organism.php?org_id=NPO6701,Cinnamomum camphora (camphor tree),NULL,NULL,NULL,NULL,NULL
1245615,42433480,LOTUS,"(3R,7R,11S)-3,7,11,15-tetramethylhexadec-1-en-3-ol",Q105140217,"(3R,7R,11S)-3,7,11,15-tetramethylhexadec-1-en-3-ol",https://www.wikidata.org/wiki/Q105140217,Natural Product,13429,Q158722,Cinnamomum camphora,https://www.wikidata.org/wiki/Q158722,Cinnamomum camphora (camphor tree),DOI:10.5897/JMPR12.157,https://doi.org/10.5897/JMPR12.157,NULL,10.5897/JMPR12.157,https://www.wikidata.org/wiki/Q115784052
1246833,44144290,LOTUS,"4-[(1R,3aS,4S,6aS)-4-(1,3-Benzodioxol-5-yl)tetrahydro-1H,3H-furo[3,4-c]furan-1-yl]-2-methoxyphenol",Q105283260,"4-[(1R,3aS,4S,6aS)-4-(1,3-Benzodioxol-5-yl)tetrahydro-1H,3H-furo[3,4-c]furan-1-yl]-2-methoxyphenol",https://www.wikidata.org/wiki/Q105283260,Natural Product,13429,Q158722,Cinnamomum camphora,https://www.wikidata.org/wiki/Q158722,Cinnamomum camphora (camphor tree),DOI:10.1002/JCCS.198400021,https://doi.org/10.1002/JCCS.198400021,NULL,10.1002/JCCS.198400021,https://www.wikidata.org/wiki/Q104384090
1275949,46237230,NPASS,Isomahubannolide-23,NPC125365,Isomahubannolide-23,https://bidd.group/NPASS/compound.php?compoundID=NPC125365,Natural Product,13429,NPO6701,Cinnamomum camphora,https://bidd.group/NPASS/organism.php?org_id=NPO6701,Cinnamomum camphora (camphor tree),NULL,NULL,NULL,NULL,NULL
1284467,50919054,LOTUS,"(1R,2S,6S,7S,8R)-1,3-dimethyl-8-propan-2-yltricyclo[4.4.0.02,7]dec-3-ene",Q105288764,"(1R,2S,6S,7S,8R)-1,3-dimethyl-8-propan-2-yltricyclo[4.4.0.02,7]dec-3-ene",https://www.wikidata.org/wiki/Q105288764,Natural Product,13429,Q158722,Cinnamomum camphora,https://www.wikidata.org/wiki/Q158722,Cinnamomum camphora (camphor tree),DOI:10.5897/JMPR12.157|DOI:10.1080/10412905.1998.9700962|DOI:10.1080/10412905.1993.9698258|DOI:10.1080/10575630108041259,https://doi.org/10.5897/JMPR12.157|https://doi.org/10.1080/10412905.1998.9700962|https://doi.org/10.1080/10412905.1993.9698258|https://doi.org/10.1080/10575630108041259,NULL,10.5897/JMPR12.157|10.1080/10412905.1998.9700962|10.1080/10412905.1993.9698258|10.1080/10575630108041259,https://www.wikidata.org/wiki/Q115784052|https://www.wikidata.org/wiki/Q104374951|https://www.wikidata.org/wiki/Q104374328|https://www.wikidata.org/wiki/Q43730825
1295527,53308122,LOTUS,Isolinderanolide B,Q104399412,Isolinderanolide B,https://www.wikidata.org/wiki/Q104399412,Natural Product,13429,Q158722,Cinnamomum camphora,https://www.wikidata.org/wiki/Q158722,Cinnamomum camphora (camphor tree),DOI:10.1016/S0031-9422(00)89583-7,https://doi.org/10.1016/S0031-9422(00)89583-7,NULL,10.1016/S0031-9422(00)89583-7,https://www.wikidata.org/wiki/Q104394579
1313915,71307295,LOTUS,"3',4'-Methylenedioxy-5,7-dimethylepicatechin",Q105167849,"3',4'-Methylenedioxy-5,7-dimethylepicatechin",https://www.wikidata.org/wiki/Q105167849,Natural Product,13429,Q158722,Cinnamomum camphora,https://www.wikidata.org/wiki/Q158722,Cinnamomum camphora (camphor tree),DOI:10.1246/BCSJ.50.2821,https://doi.org/10.1246/BCSJ.50.2821,NULL,10.1246/BCSJ.50.2821,https://www.wikidata.org/wiki/Q104968679
1315121,71364441,LOTUS,"10-Hydroxy-2,6,10-trimethyldodeca-2,6,11-trien-4-one",Q105187428,"10-Hydroxy-2,6,10-trimethyldodeca-2,6,11-trien-4-one",https://www.wikidata.org/wiki/Q105187428,Natural Product,13429,Q158722,Cinnamomum camphora,https://www.wikidata.org/wiki/Q158722,Cinnamomum camphora (camphor tree),DOI:10.1246/NIKKASHI.1974.762,https://doi.org/10.1246/NIKKASHI.1974.762,NULL,10.1246/NIKKASHI.1974.762,https://www.wikidata.org/wiki/Q115947727
1331721,76005700,LOTUS,4-Hydroxy-5-methylidene-3-tetradecylideneoxolan-2-one,Q104993215,4-Hydroxy-5-methylidene-3-tetradecylideneoxolan-2-one,https://www.wikidata.org/wiki/Q104993215,Natural Product,13429,Q158722,Cinnamomum camphora,https://www.wikidata.org/wiki/Q158722,Cinnamomum camphora (camphor tree),DOI:10.1248/CPB.56.97|DOI:10.1021/NP900225P,https://doi.org/10.1248/CPB.56.97|https://doi.org/10.1021/NP900225P,NULL,10.1248/CPB.56.97|10.1021/NP900225P,https://www.wikidata.org/wiki/Q46822578|https://www.wikidata.org/wiki/Q43276618
1335153,78385385,LOTUS,9-Oxofarnesol,Q115947941,9-Oxofarnesol,https://www.wikidata.org/wiki/Q115947941,Natural Product,13429,Q158722,Cinnamomum camphora,https://www.wikidata.org/wiki/Q158722,Cinnamomum camphora (camphor tree),DOI:10.1246/NIKKASHI.1974.762,https://doi.org/10.1246/NIKKASHI.1974.762,NULL,10.1246/NIKKASHI.1974.762,https://www.wikidata.org/wiki/Q115947727
1335159,78385630,LOTUS,"10-Hydroxy-2,6,10-trimethyldodeca-2,5,11-trien-4-one",Q115947940,"10-Hydroxy-2,6,10-trimethyldodeca-2,5,11-trien-4-one",https://www.wikidata.org/wiki/Q115947940,Natural Product,13429,Q158722,Cinnamomum camphora,https://www.wikidata.org/wiki/Q158722,Cinnamomum camphora (camphor tree),DOI:10.1246/NIKKASHI.1974.762,https://doi.org/10.1246/NIKKASHI.1974.762,NULL,10.1246/NIKKASHI.1974.762,https://www.wikidata.org/wiki/Q115947727
1349010,91746682,LOTUS,cis-Thujenol,Q104375759,cis-Thujenol,https://www.wikidata.org/wiki/Q104375759,Natural Product,13429,Q158722,Cinnamomum camphora,https://www.wikidata.org/wiki/Q158722,Cinnamomum camphora (camphor tree),DOI:10.1080/10412905.1993.9698258,https://doi.org/10.1080/10412905.1993.9698258,NULL,10.1080/10412905.1993.9698258,https://www.wikidata.org/wiki/Q104374328
1349798,92178625,NPASS,"(4R)-4-(6-methylhepta-1,5-dien-2-yl)-1-(4-methylpent-3-enyl)cyclohexene",NPC169071,NPC169071,https://bidd.group/NPASS/compound.php?compoundID=NPC169071,Natural Product,13429,NPO6701,Cinnamomum camphora,https://bidd.group/NPASS/organism.php?org_id=NPO6701,Cinnamomum camphora (camphor tree),NULL,NULL,NULL,NULL,NULL
1407578,129716175,LOTUS,9-Oxofarnesyl acetate,Q115947942,9-Oxofarnesyl acetate,https://www.wikidata.org/wiki/Q115947942,Natural Product,13429,Q158722,Cinnamomum camphora,https://www.wikidata.org/wiki/Q158722,Cinnamomum camphora (camphor tree),DOI:10.1246/NIKKASHI.1974.762,https://doi.org/10.1246/NIKKASHI.1974.762,NULL,10.1246/NIKKASHI.1974.762,https://www.wikidata.org/wiki/Q115947727
1408656,131705161,LOTUS,"(1aR,4S,4aS,7R,7aR,7bS)-1,1,4,7-tetramethyl-2,3,4a,5,6,7,7a,7b-octahydro-1aH-cyclopropa[e]azulen-4-ol",Q104921468,"(1aR,4S,4aS,7R,7aR,7bS)-1,1,4,7-tetramethyl-2,3,4a,5,6,7,7a,7b-octahydro-1aH-cyclopropa[e]azulen-4-ol",https://www.wikidata.org/wiki/Q104921468,Natural Product,13429,Q158722,Cinnamomum camphora,https://www.wikidata.org/wiki/Q158722,Cinnamomum camphora (camphor tree),DOI:10.1016/J.INDCROP.2013.06.023,https://doi.org/10.1016/J.INDCROP.2013.06.023,NULL,10.1016/J.INDCROP.2013.06.023,https://www.wikidata.org/wiki/Q115783975
1438829,154495976,LOTUS,"(3R,6S)-2,6-dimethylocta-1,7-diene-3,6-diol",Q105035680,"(3R,6S)-2,6-dimethylocta-1,7-diene-3,6-diol",https://www.wikidata.org/wiki/Q105035680,Natural Product,13429,Q158722,Cinnamomum camphora,https://www.wikidata.org/wiki/Q158722,Cinnamomum camphora (camphor tree),DOI:10.1016/S0031-9422(00)89020-2,https://doi.org/10.1016/S0031-9422(00)89020-2,NULL,10.1016/S0031-9422(00)89020-2,https://www.wikidata.org/wiki/Q105035679
1438847,154496016,LOTUS,"(2R,3R,4S,5S,6S)-2-[[(3S,8S,9S,10R,13R,14S,17R)-17-[(2R,5R)-5-ethyl-6-methylheptan-2-yl]-10,13-dimethyl-2,3,4,7,8,9,11,12,14,15,16,17-dodecahydro-1H-cyclopenta[a]phenanthren-3-yl]oxy]-6-(hydroxymethyl)oxane-3,4,5-triol",Q105183066,"(2R,3R,4S,5S,6S)-2-[[(3S,8S,9S,10R,13R,14S,17R)-17-[(2R,5R)-5-ethyl-6-methylheptan-2-yl]-10,13-dimethyl-2,3,4,7,8,9,11,12,14,15,16,17-dodecahydro-1H-cyclopenta[a]phenanthren-3-yl]oxy]-6-(hydroxymethyl)oxane-3,4,5-triol",https://www.wikidata.org/wiki/Q105183066,Natural Product,13429,Q158722,Cinnamomum camphora,https://www.wikidata.org/wiki/Q158722,Cinnamomum camphora (camphor tree),DOI:10.1002/JCCS.198400021|DOI:10.1177/1934578X0600100104,https://doi.org/10.1002/JCCS.198400021|https://doi.org/10.1177/1934578X0600100104,NULL,10.1002/JCCS.198400021|10.1177/1934578X0600100104,https://www.wikidata.org/wiki/Q104384090|https://www.wikidata.org/wiki/Q115784957
1515817,162898995,LOTUS,"[1,7-Dimethyl-7-(4-methylpent-3-enyl)-2-bicyclo[2.2.1]heptanyl] acetate",Q115947168,"[1,7-Dimethyl-7-(4-methylpent-3-enyl)-2-bicyclo[2.2.1]heptanyl] acetate",https://www.wikidata.org/wiki/Q115947168,Natural Product,13429,Q158722,Cinnamomum camphora,https://www.wikidata.org/wiki/Q158722,Cinnamomum camphora (camphor tree),DOI:10.1016/S0040-4039(01)89916-0,https://doi.org/10.1016/S0040-4039(01)89916-0,NULL,10.1016/S0040-4039(01)89916-0,https://www.wikidata.org/wiki/Q115947167
1520627,162910660,NPASS,"(1S,3R,4S,5S,9R,13S,14R)-3-[(2S,5R)-5-(4-chloro-3-hydroxyphenyl)-5-methoxypentan-2-yl]-13-hydroxy-9-[(1S)-1-hydroxyethyl]-4,14,16,16-tetramethyl-2,6,10,17-tetraoxatricyclo[11.3.1.11,5]octadecane-7,11-dione",NPC41889,NPC41889,https://bidd.group/NPASS/compound.php?compoundID=NPC41889,Natural Product,13429,NPO6701,Cinnamomum camphora,https://bidd.group/NPASS/organism.php?org_id=NPO6701,Cinnamomum camphora (camphor tree),NULL,NULL,NULL,NULL,NULL
1534046,162940141,NPASS,"(5R)-5-(6-methylhepta-1,5-dien-2-yl)-1-(4-methylpent-3-enyl)cyclohexene",NPC92076,NPC92076,https://bidd.group/NPASS/compound.php?compoundID=NPC92076,Natural Product,13429,NPO6701,Cinnamomum camphora,https://bidd.group/NPASS/organism.php?org_id=NPO6701,Cinnamomum camphora (camphor tree),NULL,NULL,NULL,NULL,NULL
1537710,162960853,LOTUS,"[(2R)-2,3-dihydroxypropyl] 24-hydroxytetracosanoate",Q105253715,"[(2R)-2,3-dihydroxypropyl] 24-hydroxytetracosanoate",https://www.wikidata.org/wiki/Q105253715,Natural Product,13429,Q158722,Cinnamomum camphora,https://www.wikidata.org/wiki/Q158722,Cinnamomum camphora (camphor tree),DOI:10.1016/S0031-9422(00)89583-7,https://doi.org/10.1016/S0031-9422(00)89583-7,NULL,10.1016/S0031-9422(00)89583-7,https://www.wikidata.org/wiki/Q104394579
1548861,163039676,LOTUS,"(4R,5R)-5-dodecyl-4-hydroxy-4-methylcyclopent-2-en-1-one",Q105034720,"(4R,5R)-5-dodecyl-4-hydroxy-4-methylcyclopent-2-en-1-one",https://www.wikidata.org/wiki/Q105034720,Natural Product,13429,Q158722,Cinnamomum camphora,https://www.wikidata.org/wiki/Q158722,Cinnamomum camphora (camphor tree),DOI:10.1016/S0031-9422(00)81896-8,https://doi.org/10.1016/S0031-9422(00)81896-8,NULL,10.1016/S0031-9422(00)81896-8,https://www.wikidata.org/wiki/Q105034719
1549120,163041816,NPASS,"[3-[(1R,4S)-4-[(1S,3R,4S,5S,9R,13S,14R)-13-hydroxy-9-[(1S)-1-hydroxyethyl]-4,14,16,16-tetramethyl-7,11-dioxo-2,6,10,17-tetraoxatricyclo[11.3.1.11,5]octadecan-3-yl]-1-methoxypentyl]phenyl] acetate",NPC106194,NPC106194,https://bidd.group/NPASS/compound.php?compoundID=NPC106194,Natural Product,13429,NPO6701,Cinnamomum camphora,https://bidd.group/NPASS/organism.php?org_id=NPO6701,Cinnamomum camphora (camphor tree),NULL,NULL,NULL,NULL,NULL
1554119,163075659,LOTUS,"[(2R)-2,3-dihydroxypropyl] 28-hydroxyoctacosanoate",Q105140953,"[(2R)-2,3-dihydroxypropyl] 28-hydroxyoctacosanoate",https://www.wikidata.org/wiki/Q105140953,Natural Product,13429,Q158722,Cinnamomum camphora,https://www.wikidata.org/wiki/Q158722,Cinnamomum camphora (camphor tree),DOI:10.1016/S0031-9422(00)89583-7,https://doi.org/10.1016/S0031-9422(00)89583-7,NULL,10.1016/S0031-9422(00)89583-7,https://www.wikidata.org/wiki/Q104394579
1570424,163195980,LOTUS,"4-[[2-[[2-[[2-[[2-[[2-[[2-[[2-[[6-Amino-2-[[2-[[2-[[2-[[2-[[2-[[2-[[2-[[2-[[2-[[2-[[2-[(2-amino-1,3-dihydroxybutylidene)amino]-1-hydroxypropylidene]amino]-1-hydroxy-3-sulfanylpropylidene]amino]-1,3-dihydroxybutylidene]amino]-1-hydroxypropylidene]amino]-1,3-dihydroxybutylidene]amino]-1,5-dihydroxy-5-iminopentylidene]amino]-1,5-dihydroxy-5-iminopentylidene]amino]-1,3-dihydroxybutylidene]amino]-1-hydroxypropylidene]amino]-1-hydroxypropylidene]amino]-1-hydroxy-3-(4-hydroxyphenyl)propylidene]amino]-1-hydroxyhexylidene]amino]-1,3-dihydroxybutylidene]amino]-1-hydroxy-4-methylpentylidene]amino]-1-hydroxy-3-methylbutylidene]amino]-1,3-dihydroxypropylidene]amino]-1-hydroxy-3-methylpentylidene]amino]-1-hydroxy-4-methylpentylidene]amino]-1,3-dihydroxypropylidene]amino]-5-[1,3-dihydroxy-1-(1-hydroxy-3-oxopropan-2-yl)iminopropan-2-yl]imino-5-hydroxypentanoic acid",Q77373339,Cinnamomin,https://www.wikidata.org/wiki/Q77373339,Natural Product,13429,Q158722,Cinnamomum camphora,https://www.wikidata.org/wiki/Q158722,Cinnamomum camphora (camphor tree),DOI:10.1016/S0041-0101(99)00078-1|DOI:10.1002/(SICI)1099-0844(199609)14:3<157::AID-CBF667>3.3.CO;2-N|DOI:10.1002/CBF.667,https://doi.org/10.1016/S0041-0101(99)00078-1|https://doi.org/10.1002/(SICI)1099-0844(199609)14:3<157::AID-CBF667>3.3.CO;2-N|https://doi.org/10.1002/CBF.667,NULL,10.1016/S0041-0101(99)00078-1|10.1002/(SICI)1099-0844(199609)14:3<157::AID-CBF667>3.3.CO;2-N|10.1002/CBF.667,https://www.wikidata.org/wiki/Q77984311|https://www.wikidata.org/wiki/Q41170319|https://www.wikidata.org/wiki/Q110186254
