1	2
6	6
47	47
48	48
49	49
51	51
58	58
59	59
70	70
71	71
75	75
86	86
88	88
96	96
98	98
105	105
111	111
119	119
127	127
128	128
129	129
131	131
133	133
135	135
137	137
143	
175	176
176	176
177	177
186	186
187	187
190	190
192	192
215	215
222	
223	
227	227
239	239
241	241
247	248
249	249
252	
259	
260	
264	264
265	265
271	
278	278
280	280
283	284
288	85
289	289
305	305
311	311
312	
313	
323	323
379	379
380	380
402	
421	421
428	428
441	441
457	457
460	460
472	472
473	473
479	479
487	487
496	496
525	525
530	
533	
547	547
558	558
586	586
647	647
649	649
659	
663	663
668	668
672	672
673	673
675	675
681	681
683	683
700	700
702	702
706	706
712	712
724	724
725	134
729	729
753	753
756	756
760	760
768	768
769	767
780	780
783	
784	
785	785
800	800
802	802
803	803
807	
813	
847	847
863	863
868	868
880	880
887	887
888	
890	890
892	892
896	896
903	903
910	910
923	
936	936
937	938
938	938
943	
946	
962	
964	964
967	967
970	970
971	971
972	972
977	
979	979
980	980
983	
984	984
985	985
987	987
988	988
996	996
998	998
1001	1001
1004	
1005	1005
1014	1014
1015	1015
1023	
1030	1030
1031	1031
1032	1032
1038	
1045	1045
1049	1049
1050	1050
1051	1051
1052	1052
1053	1053
1054	1054
1055	1055
1060	1060
1061	
1066	1066
1088	1088
1089	
1090	
1092	
1099	
1102	1102
1103	1103
1110	1110
1112	1112
1117	
1118	
1125	
1130	1130
1135	1135
1145	1145
1146	1146
1150	1150
1174	1174
1175	1175
1176	1176
1188	1188
1195	1195
1196	1196
1198	1198
1237	1237
1669	1669
1738	1738
1775	1775
1826	1826
1864	1864
1983	1983
2513	2513
2682	2682
2966	2966
2969	2969
3308	3308
3380	3380
3562	3562
3656	3656
3689	3689
3845	3845
3893	3893
3985	3855
4455	
4510	4510
4650	4650
4678	4678
4754	4754
4971	4971
5202	5202
5281	5281
5505	5505
5610	5610
5699	5699
5756	5756
5757	5757
5779	5779
5780	5780
5789	5789
5793	5793
5816	5816
5819	5819
5862	5862
5870	5870
5879	5879
5880	5880
5881	5881
5884	5884
5886	5886
5893	5893
5896	5896
5943	5943
5950	5950
5951	5951
5957	5957
5958	5958
5961	5961
5988	5988
5994	5994
5997	5997
6013	6013
6022	6022
6029	6029
6030	6030
6031	6031
6037	6037
6047	6047
6057	6057
6058	6058
6076	6076
6083	6083
6088	6088
6106	6106
6112	6112
6128	6128
6131	6131
6132	6132
6133	6133
6137	6137
6175	6175
6176	6176
6238	6238
6262	6262
6267	6267
6274	6274
6287	6287
6288	6288
6305	6305
6306	6306
6323	6323
6329	6329
6338	6338
6723	6723
6736	6736
6804	
6816	6816
6830	
6912	6912
7027	7027
7339	7339
7405	7405
8221	8221
8582	
8892	8892
8955	8955
8977	
9076	9076
9322	781
9378	9378
9700	9700
10214	10214
10238	10238
10253	10253
10257	10257
10267	10267
10469	10469
10635	10635
10663	10663
10805	10805
10889	10889
10917	10918
11005	11005
11146	11146
11147	11147
11148	11148
11177	5281
11197	11197
11266	11266
11302	11302
11811	11811
12296	12296
12404	12404
12594	12594
12647	12647
13597	13597
13711	13711
13712	13712
13804	13805
13945	13945
14180	14181
14710	3624
15047	15047
15103	15103
15104	15104
15625	15625
15667	15667
15939	15939
15993	15993
16950	16950
17106	17106
17473	17473
17732	17732
18058	18058
18068	18068
18950	18950
18986	18986
21100	21100
22069	22069
22253	22253
22420	2907
22880	22880
23978	
24341	
24472	24472
24478	
24621	
24841	
25076	25076
25975	6597
26840	26840
27099	
27284	
27854	
28091	28091
28486	
28782	6322
29936	
30165	
31515	31515
32051	
33032	33032
33576	33576
34756	34756
35717	35717
36314	36314
37786	37786
38347	38347
39763	39763
40086	40086
41211	41211
60961	60961
61106	61106
61503	61503
61549	
64689	64689
64956	64956
64968	64968
64969	64969
65063	65063
65065	65065
65070	65070
65091	65091
65094	65094
65113	65113
65246	65246
65253	
65369	65369
65533	65533
65559	65559
65728	65728
66416	66416
66868	66868
67678	67678
68152	68152
68841	68841
69248	69248
69507	69507
69698	69698
69828	69828
70469	70469
71070	71070
71077	71077
71082	71082
71920	71921
73323	73323
74426	74426
74688	74688
75834	75834
79014	79014
79025	79025
79050	79050
79076	79076
79127	79127
80349	80349
81261	81261
82400	82400
83887	83887
83939	83939
83998	83998
84571	84571
85782	85782
87642	87642
91451	91451
91477	91477
91486	91486
91493	91493
91506	91506
91528	91528
92133	92133
92153	92153
92746	92746
92753	92753
92836	92836
93072	93072
93556	93556
94141	94141
94190	94191
98223	98223
98470	98470
98504	98504
98792	
99735	99735
101399	101399
101770	101770
104730	
104748	
104775	264
105021	105021
105024	105024
105074	105074
107669	107669
107689	107689
107735	1060
107737	107737
107738	107739
107758	107758
108192	108192
112072	112072
113417	113417
114683	114683
114833	114833
114918	114918
114926	114926
115116	115116
115255	115255
115260	115260
119219	119219
119399	119399
119405	119405
119560	119560
121885	
121920	121920
121992	121992
122136	122136
122196	122196
122283	122283
122312	122312
122347	
122357	122357
123699	123699
123727	123727
123743	123743
123912	123912
123929	123929
123938	123938
124886	124886
124985	124985
128419	128419
128859	128859
128973	
129657	129658
129803	
131150	131151
139340	
145068	
145729	145729
147004	147004
150855	150855
150885	150885
150901	150901
151276	151276
151725	151725
157350	
159296	159296
160419	1110
160520	160520
160556	160556
160603	160603
160617	160617
160663	160663
161166	161166
161234	161234
161255	161255
161488	161488
161491	161491
161597	161597
164533	51
164550	970
164628	164628
164719	164719
164800	164800
165007	165007
165390	165390
165435	165435
165436	165436
165491	165491
166830	166830
169148	169148
169508	
169621	169621
170404	170404
171161	171161
171548	171548
186004	186004
189122	189122
192826	192826
193305	193305
193321	193321
193396	193396
193425	193425
196065	196065
210328	210328
222528	222528
222656	222656
222865	222865
223997	223997
246983	246983
252379	252379
439153	439153
439155	439155
439156	439156
439161	439161
439162	439162
439164	439164
439165	439165
439167	439167
439168	439168
439175	
439176	439176
439179	439179
439182	439182
439183	439183
439184	439184
439186	439186
439190	439190
439191	439191
439193	439193
439194	439194
439208	
439213	439213
439214	439214
439216	439216
439217	439217
439218	439218
439224	439224
439227	439227
439229	439229
439231	439231
439234	
439236	439236
439252	439252
439258	439258
439260	439260
439278	439278
439279	439279
439280	439280
439284	439284
439287	439287
439313	439313
439316	439316
439335	439335
439340	439340
439350	439350
439357	439357
439376	439376
439391	439391
439402	439402
439415	439415
439418	439418
439423	439423
439424	439424
439427	439427
439444	439444
439452	439452
439455	439455
439456	439456
439468	439468
439498	439498
439577	439577
439640	439640
439658	439658
439717	439717
439744	439744
439756	439756
439853	439853
439905	439905
439924	439924
439939	439939
440018	440018
440033	440033
440043	440043
440045	440045
440046	440046
440071	440071
440103	440103
440113	440113
440114	440114
440122	440122
440127	440127
440194	440194
440211	440211
440217	440217
440304	440304
440403	440403
440536	440536
440558	440558
440560	440560
440565	440565
440566	440566
440600	440600
440601	440601
440602	440602
440603	440603
440604	440604
440606	440606
440608	440608
440610	440610
440615	440615
440623	440623
440624	440624
440728	440728
440729	440729
440738	440738
440741	440741
440743	440743
440744	440744
440745	440745
440753	440753
440758	440758
440760	440760
440763	440763
440810	440810
440840	
440841	
440863	440863
440865	440865
440867	440867
440869	440869
440873	440873
440898	440898
440923	
440995	440995
440996	440996
441253	441253
441263	441263
441300	441300
442163	
443078	443078
443247	443247
443266	443266
444485	444485
444493	444493
444791	444791
444795	444795
444863	444863
444899	444899
444972	444972
445049	445049
445127	445127
445344	445344
445354	445354
445468	445468
445557	445557
445580	445580
445713	445713
445995	445995
446013	446013
446066	446066
446220	446220
446284	446284
446440	446440
446718	1103
446798	446798
447078	447078
447123	447123
447277	447277
447920	447920
447938	447938
448223	448223
448265	
448457	448457
449005	449005
449007	449007
449008	449008
449118	449118
449171	449171
449534	449534
452110	160339
454064	454064
460602	460603
469588	469588
493570	493570
504166	985
522017	522017
526795	526795
543601	543601
636708	636708
637090	637090
638014	638014
638015	638015
643757	643757
643975	643975
643976	643976
644041	6329
644066	644066
644078	644078
644102	
644109	644109
644160	644160
644168	1051
644260	644260
644350	
656504	656504
657272	439285
667490	667490
736172	736172
736715	736715
1349907	1349907
1492348	967
1549073	6322
1549097	1549098
1738118	1738118
1778309	6030
2042020	65065
2724385	2724385
2733526	2733526
2733535	2733536
3001028	3001028
3032417	3032417
3033895	3033895
3036285	3036285
3036931	3036931
3037032	10413
3037556	3037556
3080603	3080603
3081382	3081382
3081383	3081383
3081958	3081958
3082032	3082032
3082089	3082089
3082152	3082152
3082227	3082227
3246953	3246953
3423467	278
3434975	2244
3440921	
3452892	1045
3541112	441
3609399	3609399
3674425	1005
3681305	
3713609	681
3946848	763
4048638	5202
4068592	1123
4097574	
4099879	4099879
4185785	4185785
4402710	464
4418048	743
4584184	473
4643300	668
4755801	239
5047209	
5255796	975
5257127	750
5257176	199
5280344	5280344
5280355	5280355
5280360	5280360
5280363	5280363
5280381	5280381
5280382	5280382
5280383	5280383
5280393	5280393
5280398	5280398
5280413	5280413
5280450	5280450
5280453	5280453
5280489	5280489
5280490	5280490
5280492	5280492
5280493	5280493
5280497	5280497
5280531	5280531
5280541	5280541
5280581	5280581
5280592	5280592
5280625	5280625
5280673	5280673
5280724	5280724
5280745	5280745
5280760	5280760
5280765	5280765
5280767	5280767
5280768	5280768
5280769	5280769
5280776	5280776
5280795	5280795
5280825	5280825
5280826	5280826
5280827	5280827
5280828	
5280878	5280878
5280886	5280886
5280892	5280892
5280893	5280893
5280933	5280933
5280934	5280934
5281426	5281426
5281877	5281877
5281915	5281915
5281969	5281969
5282280	5282280
5282283	5282283
5282707	5282707
5282714	5282714
5282724	5282724
5282729	5282729
5282738	5282738
5282743	5282743
5282982	5282982
5282996	5282996
5282997	5282997
5283155	5283155
5283156	5283156
5283157	5283157
5283202	5283202
5283389	5283389
5283496	5283496
5283499	5283499
5283512	3246995
5283518	5283518
5283523	5283523
5283529	5283529
5283539	5283539
5283560	5283560
5283565	5283565
5283583	5283583
5283588	5283588
5283731	5283731
5283756	5283756
5284235	5284235
5284239	5284239
5284270	5284270
5284271	5284271
5287971	446962
5288075	446961
5288266	5288266
5288565	445127
5288700	440194
5288798	439230
5289090	5289090
5289118	7405
5289133	5289133
5289145	5289145
5289590	5289590
5311263	5311263
5312508	5312508
5312798	5312798
5312804	5312804
5312861	5312861
5322095	5322095
5326793	5326793
5351619	3037043
5352425	
5353955	5353955
5359597	
5360696	5360696
5360697	5360697
5363137	5363137
5365005	5365005
5459377	5313082
5459771	5318532
5459792	222656
5459802	5459802
5459820	439190
5459862	122357
5459879	5459879
5459920	439233
5459934	5280398
5459960	599
5460066	5280393
5460164	5460164
5460183	6713940
5460257	93072
5460265	444899
5460289	439216
5460294	5960
5460299	33032
5460307	444972
5460308	757
5460314	221493
5460318	9903
5460389	780
5460399	92136
5460495	5460495
5460691	
5460701	8948
5460765	10267
5460800	439902
5460855	5460855
5460926	5962
5460943	6274
5461108	5957
5461136	161491
5462164	5462164
5462210	5462210
5462303	5462303
5462874	5462874
5497103	5283485
5497111	5497111
5497112	5497112
5497143	5497143
5497163	5497163
5497181	5497181
5497182	5497182
5771758	5771758
5885531	5885531
6183479	444972
6323481	6323481
6325610	6325610
6326971	
6326983	6326983
6327000	6327000
6398953	
6419701	6419701
6419712	6419712
6419722	5862
6436082	6436082
6437063	6437063
6437081	5313476
6438587	6438587
6438629	6438629
6439225	6439225
6441454	6441454
6441487	5313355
6441562	6441562
6443547	6443547
6443760	6443760
6443788	5313164
6444117	6444117
6450190	6450190
6451121	6451121
6454686	6454686
6506224	6506224
6857403	6857403
6857549	71077
6857581	5951
6857680	6857417
6918831	6918831
6920143	5816
6921840	439260
6923516	6305
6925665	6140
6931663	439227
6942100	6057
6971017	96
6971018	6287
6971019	6288
6971033	6047
6971044	439280
6971047	145742
6971056	673
6971064	5459822
6971254	111
6992003	440121
6992083	188803
6992086	5961
6992087	6137
6992088	6262
6992089	6267
6992097	1102
6992098	9750
6992099	119
6992111	92136
7043949	12035
7048684	124886
7048686	439162
7058055	6022
7058165	6131
7058166	6176
7058168	6133
7058169	13945
7059430	123938
7059571	6076
7067843	5280352
7098621	439498
7311724	5950
7311726	1088
9543037	9543037
9543238	1112
9543678	9543678
9543679	9543679
9543688	9543688
9543691	9543691
9543694	9543694
9543695	9543695
9543699	9543699
9543700	9543700
9543703	9543703
9543705	9543705
9543710	9543710
9543714	9543714
9543716	9543716
9543722	9543722
9543723	9543723
9543728	9543728
9543729	9543729
9543730	9543730
9543735	9543735
9543736	9543736
9543737	9543737
9543739	9543739
9543743	9543743
9543744	9543744
9543745	9543745
9543747	9543747
9543752	9543752
9543755	9543755
9543764	9543764
9543767	9543767
9543771	9543771
9543776	9543776
9543782	9543782
9543785	9543785
9543786	9543786
9543787	9543787
9543795	9543795
9543796	9543796
9543797	9543797
9543807	9543807
9543808	9543808
9543817	9543817
9543819	9543819
9543830	9543830
9543842	9543842
9543851	9543851
9543862	9543862
9543872	9543872
9543873	9543873
9543882	9543882
9543891	9543891
9543972	9543972
9543986	9543986
9543987	9543987
9543989	9543989
9544004	9544004
9544010	9544010
9544011	9544011
9544021	9544021
9544047	9544047
9544049	9544049
9544061	9544061
9544066	9544066
9544069	9544069
9544078	9544078
9544083	9544083
9544087	9544087
9544090	9544090
9544110	9544110
9544125	9544125
9544140	9544140
9544150	9544150
9544166	9544166
9544167	9544167
9544179	9544179
9544195	9544195
9544196	9544196
9544216	9544216
9544220	9544220
9544227	9544227
9544279	9544279
9544294	9544294
9544299	9544299
9544304	9544304
9544319	9544319
9544320	9544320
9544341	9544341
9544345	9544345
9544362	9544362
9544363	9544363
9544383	9544383
9544390	9544390
9544410	9544410
9544514	9544514
9544519	9544519
9544551	9544551
9544571	9544571
9544573	9544573
9544577	9544577
9544638	9544638
9544639	9544639
9544695	9544695
9544702	9544702
9544709	9544709
9544762	9544762
9544769	9544769
9544831	9544831
9544835	9544835
9544845	9544845
9544905	9544905
9544978	9544978
9545124	9545124
9545200	9545200
9545204	9545204
9545277	9545277
9545507	9545507
9545801	9545801
9545999	9545999
9546726	9546726
9546742	9546742
9546746	9546746
9546747	9546747
9546749	9546749
9546753	9546753
9546757	9546757
9546800	9546800
9546809	9546809
9546812	9546812
9546816	9546816
9546843	9546843
9546969	9546969
9547000	9547000
9547086	9547086
9547091	9547091
9547096	9547096
9547116	9547116
9547136	9547136
9547158	9547158
9547161	9547161
9547167	9547167
9547168	9547168
9547179	9547179
9547180	9547180
9547273	9547273
9548579	5462146
9548609	9548609
9548817	4971
9548885	9548885
9549262	18068
9549326	9549326
9811499	9811499
9852308	9852308
9862886	9862886
9940925	9940925
9947823	9947823
9962735	9962735
10056458	10056458
10143562	10143562
10176114	10176114
10197713	10197713
10369168	10369168
10432493	10432493
10473088	10473088
10747814	5283486
11046191	11046191
11060176	11060176
11297439	11297439
11583971	13805
11722594	11722594
11764207	11764207
11792612	11792612
11825433	11825433
11953816	167760
11953835	11953835
11953876	11953876
11954011	11954011
11966108	11966108
11966110	11966110
11966111	11966111
11966117	11966117
11966121	11966121
11966124	11966124
11966132	11966132
11966141	11966141
11966142	11966142
11966155	11966155
11966158	11966158
11966160	11966160
11966162	11966162
11966163	11966163
11966165	11966165
11966169	11966169
11966172	11966172
11966173	11966173
11966175	11966175
11966177	11966177
11966179	11966179
11966181	440162
11966190	11966190
11966194	11966194
11966197	11966197
11966204	11966204
11966216	11966216
11966220	11966220
11966295	11966295
11966314	87
11988283	64968
12850019	12850019
13453453	13453453
13734178	13734178
13781857	
13783824	13783824
13846017	
14029830	14029830
14057128	14057128
14122775	14122775
14275341	14275341
14275352	14275352
14275359	14275359
14275390	14275390
14275403	14275403
14275409	14275409
14275411	14275411
14505435	14505435
14671060	14671060
15081535	15081535
15569776	15569776
15719509	6102512
15938963	1132
15938965	6083
15938971	5893
15938972	5886
15942888	15942888
15942889	15942889
15983949	5884
16019955	
16019966	16019966
16042541	16042541
16058371	16058371
16058372	16058372
16061126	16061126
16061151	16061151
16061152	16061152
16061159	16061159
16219824	5313387
16395893	16395893
16399653	16399653
16667349	19235
16667373	445675
16682731	16682731
16755624	16755624
16755631	9700
16755653	41635
17589822	60823
17796835	17796835
18601100	65063
18971002	284
19782904	311
20056717	6031
20057076	12594
20057277	20057277
20057304	20057304
20488062	996
20833812	20833812
20839325	20839325
20848918	7339
20849056	123929
21123869	160663
21144996	439184
21252287	21252287
21252321	21252321
21584050	890
21604863	440641
21604864	439284
21604869	439153
21761708	439456
21883788	444972
21917715	296
22022579	123991
22169024	
22639876	767
22833510	22833510
22833512	22833512
22833558	22833558
22833559	22833559
22833590	22833590
22833612	22833612
22833663	22833664
22848660	12599
22880141	5313597
23419734	5460448
23421198	439165
23421208	73323
23511544	867
23583984	23583984
23615194	159296
23615271	174549
23615305	439468
23615346	150629
23615442	1059
23615443	439236
23617374	14181
23724625	23724625
23724626	23724626
23724627	23724627
23724628	23724628
24742076	107758
24755487	24755487
24755528	24755528
24755529	24755529
24762165	34756
24778615	5313088
24778618	5313092
24778620	5313094
24778624	5313098
24778625	5313099
24778633	5313107
24778634	5313108
24778635	5313110
24778664	5313143
24778686	449006
24778688	5313173
24778699	5313193
24778702	5313196
24778711	5313208
24778715	5313214
24778719	5313219
24778723	5313225
24778764	5313276
24778766	5313279
24778767	5313280
24778768	5313282
24778771	24778772
24778815	5313337
24778825	5313348
24778840	5313366
24778855	5313381
24778857	5313384
24778860	5313390
24778895	5313426
24778898	5313429
24778939	5313479
24778941	5313482
24778945	5313486
24778947	5313488
24778948	5313489
24778949	5313491
24778979	5313526
24778990	5313539
24779048	5313605
24779076	5313634
24779544	24779544
24779545	24779545
24779550	24779550
24779551	24779551
24779552	24779552
24779553	24779553
24779556	24779556
24779559	24779559
24779567	24779567
24779568	24779568
24794349	439167
24794350	439168
24830990	24830990
24883423	24883423
24883430	24883430
24892719	24892719
24892725	24892725
24892748	24892748
24892761	24892761
24892762	24892762
24906329	24906329
24906330	24906330
24906332	24906332
25006224	25006224
25010743	25010743
25010746	25010746
25113190	87642
25113193	165436
25137904	25137904
25163995	25163995
25164091	25164091
25195379	25195379
25200523	440043
25201153	443247
25201247	25201247
25201336	121969
25201525	167650
25201573	774
25201943	916
25201948	439455
25202335	25246198
25202620	17473
25202847	123727
25203490	439415
25240174	25240174
25240356	25240356
25240357	25240357
25240358	25240358
25240359	25240359
25240361	25240361
25240363	25240363
25240364	25240364
25240366	25240366
25240368	25240368
25240370	25240370
25240371	25240371
25240373	25240373
25240374	25240374
25240376	25240376
25240378	25240378
25240381	25240381
25240382	25240382
25240460	25240460
25240837	25240837
25243937	440364
25243941	5497113
25243963	440996
25243996	22833664
25243997	439258
25244088	107812
25244136	5462214
25244408	65070
25244548	439400
25244665	65091
25244990	561
25245165	25245165
25245205	25245205
25245548	439183
25245609	440304
25245622	439296
25246098	9974249
25246198	25246198
25246222	439155
25320183	15993
25322932	97535
28094582	9305
36688062	160603
36688186	91493
40467846	439278
40467895	65359
40486925	445580
40490622	40490622
40511942	83944
42607498	42607498
42627598	42627598
44123501	44123502
44176398	44176398
44229134	439156
44229177	5462190
44229199	643976
44229244	44229245
44237379	127296
44263831	44263831
44367445	5960
44602421	44602421
44825325	6438639
45100481	45100481
45259170	45259170
45259180	45259180
45266510	45266510
45266511	45266511
45266540	92153
45266541	444493
45266545	92133
45266564	11966110
45266565	5497143
45266575	9549326
45266576	165435
45266596	9543169
45266598	122283
45266600	644071
45266604	3081383
45266605	644109
45266608	644066
45266614	94140
45266637	69248
45266654	166760
45266657	65110
45266677	11988266
45266724	439905
45266761	24771808
45266871	45266871
45266891	45266891
45266892	45266892
45266910	45266910
45266911	45266911
45479706	
45480541	493570
45480544	45480545
45934311	45934311
46173176	25271599
46224535	46224535
46224536	46224536
46224537	46224537
46224538	46224538
46224539	46224539
46878387	45259167
46878393	160617
46878398	440122
46878409	439191
46878417	439273
46878424	5280335
46878426	448209
46878582	5283560
46891802	46891802
46891810	46891810
46891867	46891867
46891869	46891869
46906034	24892715
46906035	643975
46926099	10214
46926269	6419712
46931118	446013
46931152	46931152
49786976	49786976
49787001	49787001
49791756	49791756
49791958	33576
49791978	778
49791979	193305
49852317	10238
49859598	49859598
49859651	49859651
49859680	49859680
49859692	49859692
49859706	49859706
50990923	50990923
52921640	11966204
52921800	52921800
52921801	52921801
52921890	52921890
52921893	52921893
52921895	52921895
52921992	52921992
52921998	52921998
52921999	52921999
52922020	52922020
52922049	52922049
52922056	3006797
52922220	52922221
52922230	52922231
52922448	52922449
52922450	52922451
52922452	52922453
52922458	5313287
52922463	52922464
52922465	52922466
52922655	52922656
52922657	52922658
52922685	52922686
52922697	52922698
52922729	52922730
52922731	52922732
52922739	52922740
52922745	52922746
52922747	52922748
52922787	52922788
52922789	52922790
52922797	52922798
52922803	52922804
52922805	52922806
52922807	52922808
52922845	52922846
52922855	52922856
52922861	52922862
52922863	52922864
52922865	52922866
52923077	52923078
52923079	52923080
52923253	52923254
52923255	52923256
52923257	52923258
52923315	52923316
52923375	52923376
52924117	52924117
52924122	52924122
52924227	52924227
52924228	52924228
52924229	52924229
52924232	52924232
52924236	52924236
52924329	52924329
52924330	52924330
52924344	52924344
52924349	52924349
52924365	52924365
52924366	52924366
52924370	52924370
52924373	52924373
52924374	52924374
52924394	52924394
52924395	52924395
52924399	52924399
52924402	52924402
52924403	52924403
52924404	52924404
52924427	52924427
52924430	52924430
52924431	52924431
52924432	52924432
52924536	52924536
52924537	52924537
52924625	52924625
52924626	52924626
52924627	52924627
52924656	52924656
52924686	52924686
52924874	52924874
52924878	52924878
52924879	52924879
52924890	52924890
52924893	52924893
52924896	52924896
52924897	52924897
52924898	52924898
52924902	52924902
52924903	52924903
52924915	52924915
52924917	52924917
52924918	52924918
52924919	52924919
52924920	52924920
52924922	52924922
52924925	52924925
52924938	52924938
52924939	52924939
52924940	52924940
52924942	52924942
52924943	52924943
52924944	52924944
52924945	52924945
52925214	52925214
52925321	52925321
52925323	52925323
52925329	52925329
52925426	52925426
52925445	52925445
52925462	52925462
52925469	52925469
52925526	52925526
52925527	52925527
52925721	52925721
52925722	52925722
52925984	52925984
52925988	52925988
52925989	52925989
52925994	52925994
52926006	52926006
52926008	52926008
52926009	52926009
52926011	52926011
52926014	52926014
52926017	52926017
52926030	52926030
52926033	52926033
52926034	52926034
52926035	52926035
52926036	52926036
52926065	52926065
52926069	52926069
52926071	52926071
52926076	52926076
52926081	52926081
52926083	52926083
52926089	52926089
52926476	52926476
52926477	52926477
52926478	52926478
52926484	52926484
52926580	52926580
52926581	52926581
52926595	52926595
52926600	52926600
52926616	52926616
52926617	52926617
52926624	52926624
52926645	52926645
52926646	52926646
52926653	52926653
52926654	52926654
52926681	52926681
52926682	52926682
52926876	52926876
52927123	52927123
52927140	52927140
52927144	52927144
52927145	52927145
52927150	52927150
52927164	52927164
52927166	52927166
52927167	52927167
52927169	52927169
52927171	52927171
52927174	52927174
52927219	52927219
52927223	52927223
52927230	52927230
52927236	52927236
52927243	52927243
52927245	52927245
52927246	52927246
52927248	52927248
52928690	52928690
52928695	52928695
52928803	52928803
52928804	52928804
52928810	52928810
52928811	52928811
52928906	52928906
52928907	52928907
52928921	52928921
52928926	52928926
52928942	52928942
52928943	52928943
52928947	52928947
52928950	52928950
52928951	52928951
52928971	52928971
52928972	52928972
52928976	52928976
52928979	52928979
52928980	52928980
52928981	52928981
52929004	52929004
52929007	52929007
52929008	52929008
52929009	52929009
52929113	52929113
52929114	52929114
52929202	52929202
52929203	52929203
52929204	52929204
52929233	52929233
52929263	52929263
52929453	52929453
52929454	52929454
52929467	52929467
52929470	52929470
52929471	52929471
52929472	52929472
52929476	52929476
52929477	52929477
52929490	52929490
52929492	52929492
52929494	52929494
52929495	52929495
52929497	52929497
52929513	52929513
52929514	52929514
52929515	52929515
52929517	52929517
52929518	52929518
52929547	52929547
52929548	52929548
52929553	52929553
52929559	52929559
52929561	52929561
52929751	52929751
52929752	52929752
52941750	52941750
53262277	5483640
53262356	449118
53356659	4971
53356674	4971
53380302	53380302
53432205	53432205
53477461	53477461
53477501	53477501
53477502	53477502
53477503	53477503
53477508	53477508
53477567	53477567
53477637	11966205
53477671	53477671
53477675	53477675
53477677	53477677
53477679	53477679
53477707	53477707
53477720	53477720
53477721	53477722
53477782	53477782
53477801	53477802
53477815	53477815
53477847	53477847
53477850	53477850
53477852	53477852
53477912	53477912
53477913	53477913
53477914	53477914
53477915	53477915
53477916	53477916
53477917	53477917
53477918	53477918
53477922	53477922
53477923	53477923
53477924	53477924
53477925	53477925
53477926	53477926
53477927	53477927
53477933	53477933
53477934	53477934
53477935	53477935
53477940	53477940
53477941	53477941
53477942	53477942
53477943	53477943
53477950	53477950
53477951	53477951
53477952	53477952
53477953	53477953
53477955	53477955
53477958	53477958
53477959	53477959
53477960	53477960
53477961	53477961
53477962	53477962
53478028	53478028
53478029	53478029
53478037	53478037
53478038	53478038
53478040	53478040
53478041	53478041
53478049	53478049
53478050	53478050
53478052	53478052
53478053	53478053
53478063	53478063
53478065	53478065
53478066	53478066
53478067	53478067
53478069	53478069
53478072	53478072
53478073	53478073
53478074	53478074
53478075	53478075
53478076	53478076
53478091	53478091
53478093	53478093
53478094	53478094
53478107	53478107
53478108	53478108
53478121	53478121
53478123	53478123
53478126	53478126
53478127	53478127
53478128	53478128
53478129	53478129
53478130	53478130
53478151	53478151
53478152	53478152
53478196	53478196
53478197	53478197
53478253	53478253
53478254	53478254
53478255	53478255
53478256	53478256
53478257	53478257
53478283	53478283
53478304	53478304
53478326	53478326
53478327	53478327
53478602	53478602
53478604	53478604
53478605	53478606
53478607	53478608
53478669	53478670
53478679	53478680
53478681	53478682
53478701	53478702
53478723	53478724
53478725	53478726
53478727	53478728
53478731	53478732
53478737	53478738
53478739	53478740
53478741	53478742
53478743	53478744
53478765	53478766
53478767	53478768
53478787	53478788
53478789	53478790
53478809	53478810
53478811	53478812
53478833	53478834
53478835	53478836
53478879	53478880
53478881	53478882
53478973	53478974
53478975	53478976
53478977	53478978
53478979	53478980
53478981	53478982
53479013	53479014
53479037	53479038
53479093	53479094
53479095	53479096
53479491	53479492
53479551	53479551
53479552	53479552
53479553	53479553
53479587	53479587
53479588	53479588
53479596	53479596
53479597	53479597
53479598	53479598
53479599	53479599
53479609	53479609
53479610	53479610
53479624	53479624
53479626	53479626
53479627	53479627
53479628	53479628
53479630	53479630
53479633	53479633
53479634	53479634
53479635	53479635
53479636	53479636
53479637	53479637
53479650	53479650
53479651	53479651
53479662	53479662
53479663	53479663
53479674	53479674
53479675	53479675
53479686	53479686
53479687	53479687
53479709	53479709
53479710	53479710
53479757	53479757
53479758	53479758
53479759	53479759
53479760	53479760
53479761	53479761
53479777	53479777
53479789	53479789
53479817	53479817
53479818	53479818
53480165	53480165
53480228	53480228
53480341	53480341
53480354	53480354
53480360	53480360
53480361	53480361
53480382	53480382
53480383	53480383
53480386	53480386
53480387	53480387
53480408	53480408
53480409	53480409
53480483	53480483
53480490	53480490
53480497	
53480522	53480522
53480523	53480523
53480524	
53480545	53480545
53480559	
53480603	53480603
53480606	53480606
53480607	53480607
53480610	53480610
53480611	53480611
53480617	53480617
53480619	53480619
53480620	53480620
53480621	53480621
53480622	53480622
53480623	53480623
53480624	53480624
53480629	53480629
53480630	53480630
53480634	53480634
53480638	53480638
53480642	53480642
53480645	53480645
53480652	53480652
53481003	53481003
53481795	53481795
53481796	53481796
53481797	53481797
53481798	53481798
53481799	53481799
53481800	53481800
53481801	53481801
53481802	53481802
53481808	53481808
53481809	53481809
53481810	53481810
53481811	53481811
53481812	53481812
53481813	53481813
53481814	53481814
53481815	53481815
53481816	53481816
53481823	53481823
53481824	53481824
53481825	53481825
53481826	53481826
53481827	53481827
53481828	53481828
53481829	53481829
53481830	53481830
53481838	53481838
53481840	53481840
53481841	53481841
53481842	53481842
53481843	53481843
53481844	53481844
53481845	53481845
53481853	53481853
53481854	53481854
53481855	53481855
53481856	53481856
53481857	53481857
53481858	53481858
53481859	53481859
53481860	53481860
53481870	53481870
53481871	53481871
53481872	53481872
53481873	53481873
53481874	53481874
53481875	53481875
53481886	53481886
53481887	53481887
53481888	53481888
53481889	53481889
53481890	53481890
53481902	53481902
53481903	53481903
53481904	53481904
53481905	53481905
53481912	53481912
53481913	53481913
53936469	53936469
54670067	54670067
54675850	338
54679076	54670067
54691355	119405
55290163	55290163
55300606	55300606
56927827	56927827
56927863	56927863
56927874	56927874
56927876	56927876
56927902	56927902
56927904	56927904
56927907	56927907
56927909	56927909
56927910	56927910
56927911	56927911
56927963	56927963
56927964	56927965
56927966	56927966
56927967	56927967
56927968	56927968
56927970	56927970
56927971	56927971
56927977	56927977
56927978	56927978
56927980	56927980
56927981	56927981
56927982	56927982
56927983	56927983
56927993	56927993
56928001	56928001
56928006	56928006
56928009	56928009
56928012	56928012
56928013	56928013
56928014	56928014
57339307	57339307
57689797	68841
58177710	9547069
58838673	
59720717	9547087
70678541	6713940
70678574	70678540
70678590	6713940
70678621	70678621
70678653	70678653
70678705	70678705
70678741	70678741
70679255	70679256
70680298	49835951
70680301	11046252
70680351	70680351
70698368	70698368
71306319	6713940
71306339	9963963
71508666	71508666
71581082	25271602
72193709	72193709
72204813	72204813
73292904	73292904
74600207	5233914
86289088	160666
86289309	165388
86289328	86289328
86289440	45479489
86289544	86289544
86583344	86583344
87978475	87978475
88956918	88956918
90657386	5462266
90657462	160913
90658133	90658133
90658924	130805
91857880	91857880
91859643	91859643
92136116	92136116
97161142	97161142
99647664	99647664
100921577	100921577
100921659	100921659
101079454	101079454
101113757	101113757
101706280	101706280
101706281	101706281
102330427	102330427
118701872	118701872
118702052	118702052
118702053	118702053
118702087	118702087
118702088	118702088
118702094	118702094
118702123	118702123
118702124	118702124
118702130	118702130
118702194	118702194
118702195	118702195
118702201	118702201
118702302	118702302
118702303	118702303
118702304	118702304
118702309	118702309
118702310	118702310
118702337	118702337
118702339	118702339
118702344	118702344
118702345	118702345
118702409	118702409
118702411	118702411
118702416	118702416
118702417	118702417
118702423	118702423
118702553	118702553
118702554	118702554
118702555	118702555
118702556	118702556
118702560	118702560
118702561	118702561
118702562	118702562
118702567	118702567
118702568	118702568
118702624	118702624
118702627	118702627
118702631	118702631
118702633	118702633
118702638	118702638
118702639	118702639
118702645	118702645
118703056	118703056
118703057	118703057
118703058	118703058
118703059	118703059
118703061	118703061
118703063	118703063
118703064	118703064
118703065	118703065
118703067	118703067
118703071	118703071
118703073	118703073
118703077	118703077
118703091	118703091
122368871	122368871
131753212	131753212
131753216	131753216
131753217	131753217
131753219	131753219
131753222	131753222
131753223	131753223
131753226	131753226
131753230	131753230
131753232	131753232
131753233	131753233
131753269	131753269
131753273	131753273
131753274	131753274
131753275	131753275
131753277	131753277
131753280	131753280
131753281	131753281
131753284	131753284
131753288	131753288
131753290	131753290
131753291	131753291
131753297	131753297
131753302	131753302
131753303	131753303
131753305	131753305
131753308	131753308
131753309	131753309
131753312	131753312
131753316	131753316
131753318	131753318
131753319	131753319
131753327	131753327
131753335	131753335
131753342	131753342
131753348	131753348
131753349	131753349
131753446	131753446
131753447	131753447
131753451	131753451
131753452	131753452
131753453	131753453
131753455	131753455
131753458	131753458
131753459	131753459
131753462	131753462
131753466	131753466
131753468	131753468
131753469	131753469
131753477	131753477
131753482	131753482
131753485	131753485
131753488	131753488
131753489	131753489
131753492	131753492
131753496	131753496
131753498	131753498
131753499	131753499
131753504	131753504
131753509	131753509
131753511	131753511
131753514	131753514
131753515	131753515
131753518	131753518
131753522	131753522
131753524	131753524
131753525	131753525
131753570	131753570
131753577	131753577
131753583	131753583
131753584	131753584
131753652	131753652
131753660	131753660
131753663	131753663
131753664	131753664
131753667	131753667
131753671	131753671
131753673	131753673
131753674	131753674
131753682	131753682
131753690	131753690
131753694	131753694
131753697	131753697
131753701	131753701
131753703	131753703
131753704	131753704
131753787	131753787
131753793	131753793
131753794	131753794
131753892	131753892
131753900	131753900
131753907	131753907
131753911	131753911
131753913	131753913
131753914	131753914
131753973	131753973
131753974	131753974
131754004	131754004
131754999	131754999
131755002	131755002
131755009	131755009
131755016	131755016
131755017	131755017
131755020	131755020
131755028	131755028
131755029	131755029
131755040	131755040
131755052	131755052
131755053	131755053
131755143	131755143
131755144	131755144
131755147	131755147
131755153	131755153
131755155	131755155
131755156	131755156
131755162	131755162
131755167	131755167
131755170	131755170
131755173	131755173
131755174	131755174
131755177	131755177
131755181	131755181
131755183	131755183
131755184	131755184
131755191	131755191
131755192	131755192
131755195	131755195
131755202	131755202
131755203	131755203
131755243	131755243
131755250	131755250
131755256	131755256
131755257	131755257
131755322	131755322
131755325	131755325
131755332	131755332
131755333	131755333
131755338	131755338
131755346	131755346
131755352	131755352
131755356	131755356
131755358	131755358
131755359	131755359
131755441	131755441
131755442	131755442
131755531	131755531
131755538	131755538
131755544	131755544
131755549	131755549
131755550	131755550
131755605	131755605
131755606	131755606
131755788	131755788
131755791	131755791
131755799	131755799
131755808	131755808
131755820	131755820
131755821	131755821
131755931	131755931
131755936	131755936
131755939	131755939
131755942	131755942
131755943	131755943
131755946	131755946
131755950	131755950
131755952	131755952
131755953	131755953
131755961	131755961
131755962	131755962
131755965	131755965
131755971	131755971
131755973	131755973
131755974	131755974
131756012	131756012
131756019	131756019
131756025	131756025
131756026	131756026
131756090	131756090
131756093	131756093
131756099	131756099
131756101	131756101
131756102	131756102
131756106	131756106
131756114	131756114
131756118	131756118
131756121	131756121
131756125	131756125
131756127	131756127
131756128	131756128
131756207	131756207
131756208	131756208
131756293	131756293
131756301	131756301
131756308	131756308
131756312	131756312
131756314	131756314
131756315	131756315
131756368	131756368
131756369	131756369
131756395	131756395
131756580	131756580
131756588	131756588
131756589	131756589
131756772	131756772
131756779	131756779
131756785	131756785
131756786	131756786
131756954	131756954
131756955	131756955
131757097	131757097
131757098	131757098
131757123	131757123
131759314	131759314
131759317	131759317
131759323	131759323
131759325	131759325
131759326	131759326
131759333	131759333
131759345	131759345
131759346	131759346
131759350	131759350
131759416	131759416
131759417	131759417
131759420	131759420
131759426	131759426
131759428	131759428
131759429	131759429
131759434	131759434
131759437	131759437
131759440	131759440
131759441	131759441
131759444	131759444
131759448	131759448
131759450	131759450
131759451	131759451
131759456	131759456
131759457	131759457
131759460	131759460
131759466	131759466
131759468	131759468
131759469	131759469
131759497	131759497
131759504	131759504
131759510	131759510
131759511	131759511
131759562	131759562
131759565	131759565
131759571	131759571
131759573	131759573
131759574	131759574
131759582	131759582
131759586	131759586
131759589	131759589
131759593	131759593
131759595	131759595
131759596	131759596
131759660	131759660
131759661	131759661
131759735	131759735
131759742	131759742
131759746	131759746
131759748	131759748
131759749	131759749
131759792	131759792
131759793	131759793
131759815	131759815
131759960	131759960
131759967	131759967
131759973	131759973
131759974	131759974
131760061	131760061
131760064	131760064
131760065	131760065
131760068	131760068
131760072	131760072
131760074	131760074
131760075	131760075
131760124	131760124
131760131	131760131
131760137	131760137
131760138	131760138
131760187	131760187
131760190	131760190
131760191	131760191
131760194	131760194
131760198	131760198
131760200	131760200
131760201	131760201
131760208	131760208
131760212	131760212
131760215	131760215
131760219	131760219
131760221	131760221
131760222	131760222
131760278	131760278
131760284	131760284
131760285	131760285
131760355	131760355
131760362	131760362
131760366	131760366
131760368	131760368
131760369	131760369
131760410	131760410
131760411	131760411
131760432	131760432
131760566	131760566
131760578	131760578
131760579	131760579
131760663	131760663
131760666	131760666
131760669	131760669
131760673	131760673
131760675	131760675
131760676	131760676
131760684	131760684
131760705	131760705
131760712	131760712
131760718	131760718
131760719	131760719
131760763	131760763
131760766	131760766
131760773	131760773
131760774	131760774
131760779	131760779
131760783	131760783
131760786	131760786
131760790	131760790
131760792	131760792
131760793	131760793
131760851	131760851
131760852	131760852
131760917	131760917
131760924	131760924
131760929	131760929
131760930	131760930
131760969	131760969
131760970	131760970
131760990	131760990
131761816	131761816
131761823	131761823
131761829	131761829
131761830	131761830
131761949	131761949
131761955	131761955
131761956	131761956
131762063	131762063
131762064	131762064
131762082	131762082
131763144	131763144
131763145	131763145
131763245	131763245
131763251	131763251
131763252	131763252
131763289	131763289
131763291	131763291
131763294	131763294
131763298	131763298
131763300	131763300
131763301	131763301
131763344	131763344
131763345	131763345
131763397	131763397
131763402	131763402
131763403	131763403
131763432	131763432
131763433	131763433
131763448	131763448
131763555	131763555
131763561	131763561
131763562	131763562
131763667	131763667
131763673	131763673
131763674	131763674
131763722	131763722
131763726	131763726
131763728	131763728
131763764	131763764
131763770	131763770
131763771	131763771
131763820	131763820
131763824	131763824
131763826	131763826
131763827	131763827
131763854	131763854
131763855	131763855
131763869	131763869
131764828	131764828
131764829	131764829
131764890	131764890
131764891	131764891
131764902	131764902
131765716	131765716
131765717	131765717
131765767	131765767
131765768	131765768
131765810	131765810
131765834	131765834
131765835	131765835
131765846	131765846
131765847	131765847
131765854	131765854
131766181	131766181
131766182	131766182
131766187	131766187
131766849	131766849
131766850	131766850
131766851	131766851
131766853	131766853
131766854	131766854
131766859	131766859
131766864	131766864
131766865	131766865
131766866	131766866
131766867	131766867
131766868	131766868
131766869	131766869
131766876	131766876
131766878	131766878
131766879	131766879
131766884	131766884
131766934	131766934
131766943	131766943
131766945	131766945
131766966	131766966
131766969	131766969
131766970	131766970
131766971	131766971
131766972	131766972
131766973	131766973
131766974	131766974
131766980	131766980
131766984	131766984
131766985	131766985
131766988	131766988
131766991	131766991
131767020	131767020
131767022	131767022
131767023	131767023
131767040	131767040
131767044	131767044
131767070	131767070
131767072	131767072
131767073	131767073
131767078	131767078
131767321	131767321
131767338	131767338
131767340	131767340
131767341	131767341
131767346	131767346
131767447	131767447
131767449	131767449
131767450	131767450
131767467	131767467
131767471	131767471
131767496	131767496
131767498	131767498
131767499	131767499
131767504	131767504
131767757	131767757
131767761	131767761
131767762	131767762
131767765	131767765
131767768	131767768
131767780	131767780
131767781	131767781
131767782	131767782
131767783	131767783
131767784	131767784
131767791	131767791
131767793	131767793
131767794	131767794
131767801	131767801
131767802	131767802
131767803	131767803
131767804	131767804
131767813	131767813
131767814	131767814
131767824	131767824
131767868	131767868
131767870	131767870
131767871	131767871
131767888	131767888
131767892	131767892
131767916	131767916
131767918	131767918
131767919	131767919
131767926	131767926
131767927	131767927
131767928	131767928
131767929	131767929
131767936	131767936
131767940	131767940
131767973	131767973
131767974	131767974
131767980	131767980
131768013	131768013
131768274	131768274
131768293	131768293
131768294	131768294
131768424	131768424
131768425	131768425
131768432	131768432
131768471	131768471
131768708	131768708
131768709	131768709
131768719	131768719
131821847	131821847
131821848	131821848
131821850	131821850
131821864	131821864
131821865	131821865
131821884	131821884
131821890	131821890
131821891	131821891
131821897	131821897
131821898	131821898
131821910	131821910
131821911	131821911
131821912	131821912
131821914	131821914
131821916	131821916
131821917	131821917
131821918	131821918
131821919	131821919
131821929	131821929
131821930	131821930
131821937	131821937
131821938	131821938
131821945	131821945
131821946	131821946
131821953	131821953
131821954	131821954
131821970	131821970
131821971	131821971
131821999	131821999
131822000	131822000
131822001	131822001
131822002	131822002
131822013	131822013
131822035	131822035
131822036	131822036
131822229	131822229
131822234	131822234
131822245	131822245
131822608	131822608
131822609	131822609
131822625	131822625
131822626	131822626
131822627	131822627
131822628	131822628
131822629	131822629
131822638	131822638
131822639	131822639
131822642	131822642
131822653	131822653
131822654	131822654
131822664	131822664
131823105	131823105
131823109	131823109
131823110	131823110
131823113	131823113
131823119	131823119
131823120	131823120
131823127	131823127
131823230	131823230
131823232	131823232
131823233	131823233
131823236	131823236
131823243	131823243
131823333	131823333
132282523	132282523
134692116	132849242
135398513	135398513
135398555	135398556
135398560	135398561
135398570	135398570
135398574	135398574
135398580	135398581
135398581	135398581
135398585	135398585
135398598	135398599
135398599	135398599
135398603	135398604
135398609	135398610
135398613	135398614
135398615	135398616
135398618	135398619
135398619	135398619
135398621	135398621
135398623	135398623
135398626	135398627
135398630	135398631
135398632	135398633
135398633	135398633
135398634	135398634
135398638	135398638
135398639	135398640
135398641	135398641
135398642	135398643
135398649	135398650
135398650	135398650
135398658	135398658
135398695	135398695
135398701	135398701
135398724	135398724
135398742	135398742
135402045	135402045
135403630	135403630
135412609	135412609
135430861	135402041
135439316	135439316
135445750	135445750
135476776	135476776
135476778	135476778
135476784	135476784
135510647	135400185
135565291	135565291
135871110	135567131
135871111	135488904
135873312	135873313
136093829	135566401
136165273	136165274
136351786	5462146
136630897	135567132
139036274	16760025
139291704	139291704
155903279	49866558
156907985	156907985
23	23
87	87
110	110
281	281
296	296
322	322
499	499
529	529
545	
561	561
597	597
599	599
670	670
691	691
774	774
781	781
851	851
978	978
997	997
3614	3614
4581	4581
5538	5538
6255	6255
6613	6613
6675	6675
7427	7427
7680	7680
8215	8215
10140	10140
10467	10467
10470	10470
10471	10471
10690	10690
11850	11850
11970	11970
12599	12599
13538	13538
13730	13730
13805	13805
16500	16500
16898	16898
18189	18189
19235	19235
21706	21706
24139	24139
33002	33002
33037	33037
34755	34756
41635	41635
64959	64959
65110	65110
65127	65127
69867	69867
72886	72886
74300	74300
75810	75810
79686	79686
82208	
92146	92146
92283	92283
94140	94140
94318	94318
99470	99470
107722	107722
122250	122250
122325	122325
122336	122336
122356	122356
123966	123966
128841	128841
147899	147899
150629	150629
151014	151014
151284	151284
151438	151438
160482	160482
160531	160531
160666	160666
161233	161234
161500	161500
164735	164735
164860	164860
165067	165067
165388	165388
166760	166760
168166	168166
168381	168382
168718	168718
174549	174549
188824	157837
188966	188966
193475	193475
193536	193536
213144	213145
221493	221493
222284	222284
259994	259994
411840	411840
439178	439178
439196	439196
439230	439230
439233	439233
439242	439242
439255	439255
439273	439273
439286	439286
439353	439353
439373	439373
439394	439394
439400	439400
439436	439436
439454	439454
439479	439479
439531	439531
439544	439544
439709	439709
439966	439966
440101	440101
440162	440162
440641	440641
440658	440658
440667	440667
440717	440717
440726	440726
440764	440764
440850	440850
440940	440940
440985	440985
440997	440997
441440	192884
441477	441477
445528	445528
445638	445638
445639	445639
445675	445675
445683	445683
446317	446317
638072	638072
644071	644071
3081085	3081085
3081439	3081439
3246938	3246939
3698251	757
3702506	135
5232324	1015
5280335	5280335
5280352	5280352
5280473	5280473
5280630	5280630
5280650	5280650
5280733	5280733
5280778	5280778
5281328	5281328
5281909	5281909
5282919	5282919
5282920	5282920
5283146	5283146
5283204	5283204
5283546	5283546
5284267	5284267
5288991	121992
5312543	5312543
5318532	5318532
5362487	
5459811	5459811
5459827	5459827
5459829	5459829
5459864	5459864
5459911	5459911
5459918	5459918
5459941	5459941
5460005	5460005
5460291	5460291
5460448	5460448
5462190	5462190
5483640	5483640
5497113	5497113
6443777	6443777
6450015	6912389
6857410	6857410
6857417	6857417
6971009	6274
6971015	91552
6971029	161166
6971051	99478
6971053	5810
6992102	439232
6992383	96799
6994044	11161
6995276	99289
7015181	445883
7016106	7016106
7043901	6306
7045767	439756
7045798	6106
7058163	9305
7272001	5478845
7276368	7276368
7311725	71080
9543026	9543026
9543050	9543050
9833951	9833951
9847290	5280613
10040501	10040501
10883396	5283560
11085507	11085507
11205997	1052
11215652	65359
11333582	11333582
11355423	11355423
11471380	11471380
11953814	449186
11953821	6604726
11954197	11954197
11966134	11966134
11966146	11966146
11966171	11966171
11966188	11966188
11966217	11966217
11966267	11966267
11988266	11988266
12303781	12303781
14345320	14345320
14535566	14535566
15431613	15431613
16048611	16048611
16066475	16066475
16066476	16066476
16734910	16734910
16755622	165491
18676629	971
18762062	
18779926	
18931838	
20802017	20802017
21713352	
21952380	1110
21961011	
21980959	176
22066174	
22132154	
22141747	
22247451	
22326046	
22486802	
22833664	22833664
23616913	23616913
23621393	23621393
23724475	23724475
23724672	23724672
24906334	24906334
25074411	25074411
25201126	440851
25201322	123826
25201408	239828
25202092	439788
25202453	75891
25203146	439460
25229571	25229571
25229583	25229583
25229584	25229584
25229585	25229585
25243949	144
25244135	25244135
25244394	25244394
25244978	558
25245372	25245372
25245445	25245445
25246233	25246233
25246407	124886
25271599	25271599
25271601	25271601
25271602	25271602
28167170	1549098
42608345	42608345
44202063	44202063
44205804	44205804
44229226	439316
44286856	440854
44317142	644260
45266674	147004
45281170	45281170
46224544	46224544
46907933	46907934
49787004	49787004
49791955	5459861
49791998	11811
50986193	50986193
50986247	50986247
52921580	441455
52921643	49787001
52922050	52922050
53262363	105024
53297342	53297342
53477791	6604733
53481369	53481369
53481370	53481370
53481371	53481371
53481373	53481373
53481374	53481374
53481375	53481375
53481376	53481376
53481377	53481377
53481695	53481696
54196400	54196400
56928068	
57521647	57521647
57525501	57525501
59066632	92136
59658623	1005
70678996	70678996
70679000	70679000
70679008	70679008
70679011	70679011
70679040	70679041
70679056	70679056
70679238	70679238
70698344	70698344
71514783	71514783
71514784	71514784
71581018	71581018
71581022	71581022
71581095	71581095
71581216	71581216
71586757	1132
71627273	71627273
71627307	71627307
71627316	71627316
71668356	71668356
72193760	72193760
72193768	72193768
72193778	72193778
72193792	72193792
72193800	72193800
72193818	72193818
72551501	72551501
72551558	72551558
72551572	72551572
72551577	72551577
73415790	5893
86289269	86289269
86289274	86289274
86289276	86289276
86289630	86289630
86289642	86289642
86289656	86289656
86289660	86289660
86289662	86289662
86289663	86289663
86289665	86289665
86289666	86289666
86289672	86289672
86289686	440033
86289687	86289687
86289690	86289690
86289691	86289691
86289692	86289692
86289693	86289693
86289694	86289694
86289695	86289695
86289696	86289696
86289697	86289697
86289698	86289698
86289700	86289700
86289701	86289701
86289702	86289702
86289703	86289703
86289704	86289704
86289705	86289705
86289706	86289706
86289707	86289707
86289708	86289708
86289709	86289709
86289730	86289730
86289731	86289731
86289738	86289738
86289739	86289739
86289766	86289766
86289768	86289768
86289769	86289769
86289770	86289770
86289771	86289771
86289772	86289772
86289773	86289773
86289774	86289774
86289775	86289775
86289776	86289776
86289777	86289777
86289778	86289778
86289779	86289779
86289780	86289780
86289781	86289781
86289782	86289782
86289783	86289783
86289784	86289784
86289785	86289785
86289786	86289786
86289787	86289787
86289788	86289788
86289789	86289789
86289790	86289790
86289791	86289791
86289792	86289792
86289793	86289793
86289794	86289794
86289795	86289795
86289796	86289796
86289797	86289797
86289798	86289798
86289814	86289814
86289816	86289816
86289818	86289818
86289819	86289819
86289820	86289820
86289821	86289821
86289822	86289822
86289823	86289823
86289824	86289824
86289825	86289825
86289826	86289826
86289827	86289827
86289828	86289828
86289844	86289844
86289846	86289846
86289847	86289847
86289848	86289848
86289849	86289849
86289850	86289850
86289851	86289851
86289852	86289852
86289853	86289853
86289854	86289854
86289855	86289855
86289856	86289856
86289857	86289857
86289885	86289885
86290042	86290042
86583403	86583403
88113319	311
88733505	6287
88747248	6262
88747398	33032
90659268	90659268
90659296	90659296
90659870	90659871
91828285	91828285
91828287	91828287
91828289	91828289
91828295	91828295
91828300	91828300
91828302	91828302
91828304	91828304
102044173	102044173
117629482	938
121493984	121493984
122198194	5962
122706044	122706044
122706184	122706184
122706230	122706230
122706291	122706291
122706387	122706387
122706423	122706423
122706482	122706482
122706500	122706500
122706515	122706515
122706574	122706574
122706658	122706658
126456435	126456435
129656953	129656953
132282068	132282068
132282070	132282070
132282072	132282072
132282075	132282075
132282078	132282078
132282080	132282080
132282081	132282081
132282083	132282083
132282085	132282085
132282087	132282087
132282089	132282089
132282091	132282091
132282093	132282093
132282095	132282095
132282097	132282097
132282099	132282099
132282101	132282101
132282103	132282103
132282105	132282105
132282107	132282107
132282109	132282109
132282111	132282111
132282113	132282113
132282115	132282115
132282117	132282117
132282121	132282121
132282124	132282124
132282127	132282127
132282130	132282130
132282133	132282133
132282136	132282136
132282139	132282139
132282143	132282143
132282144	132282144
132282146	132282146
132282148	132282148
132282150	132282150
132282152	132282152
132282154	132282154
132282156	132282156
132282158	132282158
132282160	132282160
132282162	132282162
132282164	132282164
132282166	132282166
132282168	132282168
132282170	132282170
132282172	132282172
132282174	132282174
132282176	132282176
132282178	132282178
132282180	132282180
132282182	132282182
132282184	132282184
132282186	132282186
132282188	132282188
132282190	132282190
132282192	132282192
132282194	132282194
132282196	132282196
132282198	132282198
132282200	132282200
132282202	132282202
132282204	132282204
132282207	132282207
132282210	132282210
132282213	132282213
132282216	132282216
132282219	132282219
132282222	132282222
132282225	132282225
132282228	132282228
132282231	132282231
132282233	132282233
132282235	132282235
132282237	132282237
132282239	132282239
132282241	132282241
132282243	132282243
132282245	132282245
132282247	132282247
132282249	132282249
132282251	132282251
132282253	132282253
132282255	132282255
132282257	132282257
132282259	132282259
132282261	132282261
132282263	132282263
132282265	132282265
132282267	132282267
132282270	132282270
132282272	132282272
132282274	132282274
132282277	132282277
132282280	132282280
132282283	132282283
132282286	132282286
132282289	132282289
132282292	132282292
132282295	132282295
132282298	132282298
132282301	132282301
132282304	132282304
132282306	132282306
132282308	132282308
132282310	132282310
132282313	132282313
132282315	132282315
132282317	132282317
132282319	132282319
132282321	132282321
132282324	132282324
132282327	132282327
132282329	132282329
132282332	132282332
132282335	132282335
132282338	132282338
132282341	132282341
132282345	132282345
132282348	132282348
132282351	132282351
132282354	132282354
132282357	132282357
132282360	132282360
132282363	132282363
132282366	132282366
132282369	132282369
132282371	132282371
132282374	132282374
132282377	132282377
132282381	132282381
132282383	132282383
132282386	132282386
132282388	132282388
132282390	132282390
132282392	132282392
132282394	132282394
132282397	132282397
132282400	132282400
132282403	132282403
132282406	132282406
132282409	132282409
132282412	132282412
132282415	132282415
132282418	132282418
132282419	132282419
132282422	132282422
132282425	132282425
132282427	132282427
132282430	132282430
132282433	132282433
132282436	132282436
132282439	132282439
132282442	132282442
132282445	132282445
132282448	132282448
132282451	132282451
132282454	132282454
132282457	132282457
132282460	132282460
132282463	132282463
132282466	132282466
132282469	132282469
132282472	132282472
132282476	132282476
132282479	132282479
132282482	132282482
132282485	132282485
132282488	132282488
132282491	132282491
132282494	132282494
132282497	132282497
132282500	132282500
132282502	132282502
132282505	132282505
132472326	68759
134160314	134160314
134160315	134160315
134160316	134160316
134160344	134160344
134160348	134160348
134160366	134160366
134160371	134160371
134821689	5884
135369651	985
135372298	379
135373094	2969
135398556	135398556
135398561	135398561
135398572	135398572
135398592	135398592
135398593	135398593
135398595	135398595
135398597	135398597
135398602	135398602
135398604	135398604
135398610	135398610
135398614	135398614
135398616	135398616
135398631	135398631
135398635	135398635
135398640	135398640
135398643	135398643
135398651	135398651
135398653	135398653
135398662	135398662
135398667	135398667
135403648	135403648
135405047	135405047
135463437	135463437
135483919	135483919
135525167	135525167
135611160	135611160
135926598	135926598
136948344	136948344
137218006	137218006
138628585	222656
139031701	139031701
139031703	139031703
139057051	5281
139060126	5960
139148725	83887
146015339	6031
155289471	155289471
155289473	155289473
155289475	155289475
155289477	155289477
156274072	51
157660071	563
162393663	162393663
162393664	162393664
162393665	162393665
162393666	162393667
162393668	162393668
162393669	162393669
162393670	162393670
162393671	162393671
162393672	162393672
162393673	162393673
162393674	162393674
162393675	162393675
162393676	162393676
162393677	162393677
162393678	162393678
162393679	162393679
162393680	162393680
162393681	162393681
162393682	162393682
162393683	162393683
162393684	162393684
162393685	162393685
162393686	162393686
162393687	162393687
162393688	162393688
162393689	162393689
162393690	162393690
162393691	162393691
162393692	162393692
162393693	162393693
162393694	162393694
162393695	162393695
162393696	162393696
162393697	162393697
162393698	162393698
162393699	162393699
162393700	162393700
162393701	162393701
162393702	162393702
162393703	162393703
162393704	162393704
162393705	162393705
162393706	162393706
162393707	162393707
162393708	162393708
162393709	162393709
162393710	162393710
162393711	162393711
162393712	162393712
162393713	162393713
162393714	162393714
162393715	162393715
162393716	162393716
162393717	162393717
162393718	162393718
162393719	162393719
162393720	162393720
162393721	162393721
162393722	162393723
162393724	162393725
162393726	162393726
162393727	162393727
162393728	162393728
162393729	162393729
162393730	162393730
163026560	135398645
118	118
134	134
178	178
179	179
185	185
199	199
203	203
204	204
273	273
279	279
385	385
463	463
469	469
502	502
650	650
654	654
674	674
752	752
782	782
787	
798	798
873	873
999	999
1000	1000
1018	1018
1021	1021
1057	1057
1076	1076
1081	1081
1172	1172
1178	1178
1615	1615
1833	1833
2366	2366
2526	2526
3690	3690
4671	4671
4737	4737
4845	4845
5192	5192
6050	6050
6575	6575
6590	6590
6919	6919
7057	7057
7420	7420
7628	
7902	7902
7922	7922
7967	7967
7991	7991
8082	8082
8158	8158
8180	8180
8314	8314
8629	8629
8871	8871
9085	9085
10256	10256
10341	10341
10413	10413
10430	10430
12377	12377
12473	12473
12530	12530
12591	12591
13387	13387
13849	13849
15459	15459
15816	15816
19236	19236
24066	24066
25561	25561
37464	37464
64960	64960
65040	65040
66535	66535
68144	68144
68310	68310
68368	68368
69602	69602
71602	71602
72259	72259
72924	72924
74839	74839
75619	75619
79803	79803
84740	84740
91518	91518
92135	92135
92865	92865
92904	92904
96373	96373
97165	97165
99474	99474
107526	107526
108079	108079
115244	448301
115254	115254
119033	119033
121396	121396
122331	122331
123831	123831
125468	125468
130418	130418
133323	133323
164933	164933
193530	193530
194080	194080
222285	222285
250388	250388
306137	306137
439163	439163
439174	439174
439177	439177
439322	439322
439358	439358
439503	439503
439535	439535
439685	439685
439715	439715
439829	439830
439960	439960
440104	440104
440569	440569
440731	440731
440864	440864
440875	440875
441341	441341
441467	441467
441483	441483
442011	442011
442424	442424
442985	442985
443849	443849
444212	444212
444539	444539
445929	445929
448580	448580
460603	460603
517460	6657
545567	545567
1548899	92843
1549100	439283
2724480	160907
2733768	2733768
3035026	3035026
3651426	773
4083111	834
4099458	1148
4300518	1153
5081328	9934
5237032	1182
5245668	100714
5245672	6119
5247114	236
5248709	866
5255803	857
5260155	594
5274585	5274585
5280499	5280499
5280523	5280523
5280804	5280804
5281116	5281116
5281119	5281119
5281120	5281120
5281123	5281123
5281127	5281127
5281163	5281163
5281643	5281643
5282102	5282102
5282149	5282149
5282768	5282768
5283387	5283387
5283652	5283652
5287708	439235
5312440	5312440
5312529	5312529
5480249	5480249
6439848	6439848
6443013	6443013
6926437	5852
6971061	64969
6971063	535
6971252	80283
6971294	440473
6991978	92832
6991982	439773
6992112	5460362
6992114	112072
6992697	92907
7048523	137
9543853	9543853
10265467	10265467
10400039	10400039
10693008	10693008
10699171	10699171
11025495	11025495
11792570	11792570
12650900	12650900
16048618	16048618
19347555	2266
20144841	243
21579566	21579566
23322899	743
24771808	24771808
24949895	24949895
25200642	500
25201103	64956
25201243	16118
25202002	440159
25244553	738
25244769	207
25245041	910
25246272	614
53740714	53740714
57383916	602
57397078	424
57397101	611
57397115	994
57509571	3037043
59366488	469
70679177	70679178
70679209	70679210
70679213	70679214
70679243	70679244
70679245	70679246
70680364	70680364
70680366	70680366
70680368	70680368
70680370	70680370
70680372	70680372
71581185	71581185
71581214	71581214
71581219	71581219
76963096	13805
86289643	86289643
86289742	86289742
86289743	86289743
86289744	86289744
86289750	86289750
86289752	86289752
86289753	86289753
86289754	86289754
86289755	86289755
86289756	86289756
86289757	86289757
86289758	86289758
86289759	86289759
86289760	86289760
86289761	86289761
86289762	86289762
86289763	86289763
86289765	86289765
86289812	86289812
86289829	86289829
86289830	86289830
86289858	86289858
86289859	86289859
86289875	86289875
86289876	86289876
86289877	86289877
86289878	86289878
86289879	86289879
86289880	86289880
86289881	86289881
86289882	86289882
86289886	86289886
86289887	86289887
86289888	86289888
86289889	86289889
86289890	86289890
86289891	86289891
86289892	86289892
86289893	86289893
86289894	86289894
86289895	86289895
86289896	86289896
86289897	86289897
86289898	86289898
86289899	86289899
86289900	86289900
86289901	86289901
86289902	86289902
90657684	10243361
91865524	91865524
101623311	101623311
118343040	811
118797943	118797943
118797944	118797944
118797945	118797945
118797946	118797946
118797947	118797947
118797948	118797948
118797949	118797949
118797950	118797950
118797951	118797951
118797952	118797952
118797953	118797953
118797954	118797954
118797955	118797955
118797961	118797961
118797962	118797962
118797963	118797963
118797964	118797964
118797965	118797965
118987307	118987308
118987310	118987311
118987313	118987314
118987315	118987316
118987317	118987318
118987319	118987320
118987321	118987322
118987323	118987324
118987325	118987326
121232662	121232662
121232714	121232714
121232715	121232715
121232716	121232716
121232717	121232717
121232718	121232718
121232719	121232719
121232720	121232720
121232721	121232721
121232722	121232722
121232723	121232723
134895646	389
135372455	8094
135373086	876
135398563	135398563
135398579	135398579
135398670	135398670
135398700	135398700
135398727	135398727
135402011	135402011
135402036	135402036
135420630	135420630
137319715	137319715
162821676	162821676
162821677	162821677
162866317	162866317
162930489	162930489
162956066	162956066
163024280	163024280
163043077	163043077
163085705	163085705
