6
11
13
135
176
204
232
240
243
244
248
253
277
281
300
305
308
311
323
338
342
370
379
403
424
454
499
604
612
614
617
654
674
700
757
767
768
798
827
867
875
887
926
949
957
965
980
985
994
998
1017
1032
1048
1072
1110
1130
1147
1183
1254
1292
1318
1480
1483
1486
1489
1493
1570
1732
1775
1807
1969
2083
2130
2140
2153
2160
2171
2206
2242
2256
2266
2269
2286
2335
2345
2374
2450
2537
2541
2681
2683
2713
2723
2758
2788
2955
2969
3031
3033
3053
3102
3117
3120
3149
3255
3259
3293
3301
3305
3314
3333
3374
3383
3435
3446
3468
3485
3496
3520
3672
3728
3730
3776
3893
3931
3955
3961
4004
4075
4091
4101
4133
4458
4510
4594
4610
4632
4684
4737
4764
4765
4793
4806
4837
4920
4936
4937
4947
5143
5192
5215
5251
5281
5291
5327
5336
5395
5402
5413
5430
5455
5541
5564
5565
5656
5755
5794
5870
5943
5964
5976
5988
6004
6013
6049
6054
6061
6101
6115
6210
6212
6230
6269
6278
6337
6338
6344
6366
6376
6386
6391
6395
6397
6398
6399
6409
6410
6411
6412
6417
6420
6421
6422
6448
6490
6491
6501
6502
6503
6505
6510
6516
6517
6518
6525
6535
6540
6544
6547
6549
6564
6567
6568
6574
6575
6599
6610
6623
6625
6626
6629
6640
6641
6649
6658
6666
6668
6669
6695
6734
6736
6780
6781
6782
6810
6811
6812
6828
6854
6868
6874
6895
6896
6909
6914
6915
6917
6922
6924
6926
6934
6944
6945
6946
6947
6950
6961
6978
6979
6989
7007
7009
7013
7017
7022
7026
7040
7044
7047
7050
7061
7062
7064
7070
7072
7073
7103
7104
7108
7122
7129
7131
7150
7153
7155
7175
7184
7187
7204
7207
7211
7220
7222
7230
7232
7233
7239
7243
7245
7248
7252
7254
7257
7259
7260
7281
7285
7289
7290
7301
7311
7333
7337
7338
7343
7344
7347
7348
7349
7352
7354
7360
7371
7372
7384
7385
7387
7393
7397
7403
7409
7415
7416
7433
7439
7447
7451
7456
7464
7470
7471
7473
7474
7475
7488
7489
7497
7499
7502
7515
7521
7528
7540
7543
7547
7555
7557
7561
7564
7570
7573
7577
7579
7583
7589
7594
7615
7616
7618
7619
7620
7621
7622
7636
7652
7657
7660
7670
7681
7687
7693
7703
7714
7715
7719
7720
7731
7762
7767
7768
7774
7780
7784
7791
7792
7794
7803
7812
7813
7814
7819
7820
7824
7829
7838
7839
7872
7876
7881
7888
7909
7910
7912
7913
7914
7918
7920
7924
7932
7934
7935
7946
7952
7954
7955
7956
7957
7958
7964
7969
7972
7977
7979
7993
7996
7998
8006
8020
8028
8031
8033
8034
8071
8075
8079
8081
8083
8084
8086
8087
8095
8097
8098
8103
8111
8113
8115
8117
8121
8133
8134
8143
8146
8147
8150
8163
8167
8168
8172
8174
8175
8177
8179
8184
8189
8193
8194
8197
8200
8210
8211
8215
8216
8219
8227
8247
8282
8285
8294
8295
8301
8326
8337
8363
8371
8376
8396
8404
8405
8408
8418
8420
8425
8426
8427
8430
8434
8437
8438
8445
8449
8458
8461
8467
8470
8471
8474
8479
8481
8485
8490
8491
8506
8508
8530
8554
8631
8635
8685
8697
8754
8756
8758
8766
8773
8778
8785
8795
8812
8814
8815
8821
8827
8831
8842
8843
8846
8868
8878
8885
8888
8892
8899
8904
8908
8909
8923
8925
8928
8998
9005
9015
9017
9024
9053
9237
9257
9275
9387
9554
9582
9731
9732
9782
9794
9845
9883
10005
10215
10317
10443
10569
10687
10690
10788
10800
10900
10908
10911
10913
10914
10943
10949
10989
11005
11049
11157
11169
11174
11315
11335
11339
11443
11448
11487
11490
11529
11568
11741
11742
11761
11775
11899
12025
12198
12201
12209
12291
12329
12348
12443
12450
12487
12512
12586
12682
12687
12704
12713
12724
12898
12968
12971
12975
12989
13075
13097
13101
13130
13134
13192
13220
13232
13263
13286
13297
13345
13360
13387
13507
13521
13527
13529
13539
13574
13583
13662
13763
13807
13818
13830
13838
13931
13976
13981
14050
14145
14242
14456
14474
14489
14756
14855
14927
15025
15073
15133
15295
15365
15413
15426
15433
15458
15488
15618
15659
15660
15793
15797
15884
15910
15914
16028
16221
16241
16299
16333
16387
16562
16640
16698
16720
16726
16767
16843
16891
16942
16949
16958
17046
17047
17073
17100
17113
17151
17162
17204
17208
17224
17238
17304
17317
17318
17341
17379
17406
17410
17467
17560
17587
17593
17595
17596
17617
17635
17694
17719
17731
17740
17778
17857
17869
18065
18137
18156
18196
18204
18206
18286
18320
18336
18360
18503
18511
18617
18630
18659
18689
18739
18807
18840
18842
18981
18984
19089
19117
19119
19241
19262
19295
19459
19478
19523
19988
20038
20239
20240
20417
20432
20473
20587
21080
21210
21239
21354
21609
21733
21768
21839
21859
22119
22139
22200
22629
22772
22829
22833
22947
23035
23284
23294
23368
23435
23831
24020
24113
24153
24712
24730
24752
24764
24847
24915
25059
25127
25185
25320
25484
25485
25535
25644
25745
25795
25902
26176
26177
26315
26955
27678
27687
27866
27873
28594
29096
29249
29385
30083
30479
30692
31214
31234
31236
31244
31256
31261
31266
31272
31275
31288
31289
31337
31344
31347
31352
31355
31357
31362
31364
31369
31373
31382
31386
31388
31398
31416
32611
32793
33023
33259
33287
33344
33635
33637
33787
33798
33919
34023
34089
34526
34536
36081
36209
36573
37175
37524
37907
38222
38258
38779
39800
40764
40818
41270
42296
43031
43525
45459
47457
47933
49939
51040
51132
52582
53167
54267
54738
56160
60988
60995
61014
61021
61023
61029
61163
61196
61198
61221
61247
61274
61344
61389
61559
61572
61580
61637
61718
61799
61801
61948
61973
61975
62010
62109
62118
62154
62276
62277
62302
62306
62308
62329
62334
62406
62411
62414
62449
62450
62474
62479
62493
62501
62503
62511
62532
62538
62551
62556
62558
62582
62591
62593
62783
62823
62838
64685
64963
65282
65360
66021
66117
66171
66187
66475
66609
66617
66638
66721
66752
66786
66793
66821
66822
66984
66985
67054
67070
67108
67123
67136
67184
67191
67271
67296
67304
67310
67542
67717
67734
67749
67793
67815
67820
67839
68067
68162
68414
69303
70214
70355
70423
70452
70711
70769
70807
70985
71482
72628
73462
73800
73828
73864
73948
74348
74483
74516
74640
74816
75099
75129
75211
75227
75261
75282
75290
75386
75407
75472
75498
75500
75614
75628
75660
75662
75706
75816
75819
75842
75922
75982
76004
76136
76262
76359
76444
76458
76459
76482
76497
76530
76589
76969
77074
77125
77145
77173
77411
77463
77703
77714
77726
77929
78075
78141
78164
78170
78286
78373
78498
78736
78860
78882
78905
78933
79196
79345
79372
79877
79991
80101
80120
80296
80370
80714
80865
80877
80900
80999
81152
81184
81254
81278
81530
81531
81646
81729
81768
81857
81882
81984
81986
82027
82029
82126
82190
82235
82983
82995
83011
83146
83268
83648
83698
83700
84520
84858
84892
84899
84964
85065
85128
85158
85172
85689
85940
85960
86171
86187
86237
86370
86438
86579
86787
86799
86876
87146
87149
87206
87244
87622
87688
87779
87935
88208
88389
88855
89180
89248
89352
89440
89573
89597
90209
90255
90282
90303
90495
90571
90864
90918
90922
90960
91110
91360
91384
91497
91539
91555
91593
91604
91620
91733
91756
91759
91760
92172
92190
92238
92274
92292
92387
92565
92606
92654
92705
92839
93006
93079
93089
93118
93199
93247
93276
93348
93375
93419
93502
93674
93766
93821
93867
94210
94326
94439
94502
94611
94656
95332
95655
97720
97915
98143
98230
98256
98429
98478
98642
99068
99501
100909
101330
101444
101604
101713
102705
102796
102856
103056
103261
103305
103409
103658
103697
104012
104133
104150
104301
104556
104694
105262
105382
105447
105634
105671
105679
105841
106429
106673
106705
106729
106797
107010
107065
107381
107537
107646
107689
108242
108265
108312
108630
108956
109160
109193
109194
109234
109668
110655
110892
111037
111360
111420
111651
111923
112209
112234
112265
112683
113646
114475
114481
115157
117054
117907
118170
118250
118285
118456
118692
118717
118726
118771
119688
121752
121754
122612
122903
123395
123504
123767
124072
128328
131409
134122
136433
138539
141094
150833
153116
153920
154218
154403
155666
156323
156605
157881
157882
157898
158190
158781
159788
159839
160111
160192
160357
160435
161083
161797
161976
162074
162097
162160
162235
162388
162420
162427
162652
163484
163595
164282
164512
164514
166121
166436
166442
166444
166480
166483
166497
166503
166508
167782
169132
169360
169745
170561
170608
170728
170801
171789
171970
172190
172623
174076
174092
174176
174265
174364
174375
174427
174476
175375
175585
177691
184292
186342
187807
204482
216239
221491
225155
225290
228987
235712
243274
272696
313030
314787
347468
350062
351563
351770
352271
352756
365393
374829
394580
395460
407376
421949
422780
425415
425720
428363
431636
444913
444972
446987
451474
475447
516981
520186
520213
520540
540869
542750
546251
547494
551484
556888
586744
588007
596718
607248
611409
621745
625613
631125
643460
643493
673702
687125
697993
700999
726893
735362
810913
819555
834083
847415
904858
1235118
1268121
1501912
1519430
1712029
1712058
1811074
1900035
2723650
2723790
2723853
2724165
2724574
2733480
2733920
2734078
2734224
2734226
2735009
2735792
2735919
2736501
2760115
2763179
2774943
2779028
2782408
2782436
2782928
2782939
2783248
2818389
2832097
3000605
3010127
3015401
3015459
3015505
3015783
3015813
3016289
3016472
3017432
3018067
3018173
3022550
3032295
3032854
3033030
3033871
3033992
3034478
3036907
3038533
3086157
3114841
3141996
3437285
3477050
3482402
3559338
3576105
3613389
3648390
3672772
3711856
3734524
3766139
3844407
3955936
4078311
4079622
4128060
4156734
4306514
4312530
4342487
4354960
4379449
4462283
4523964
4616637
4921319
5079722
5140913
5212856
5232958
5257871
5282942
5284557
5287407
5328940
5353356
5356787
5463763
5463795
5463797
5463804
5463973
5464465
5475987
5486793
5489481
5494409
5750263
6013640
6108780
6327349
6327546
6328134
6328250
6335230
6366484
6426661
6433892
6438182
6451919
6850852
6950273
7020339
7076399
7569008
9570326
9571022
9662329
9793859
9796266
9803353
9809413
9817544
9834143
9843116
9866479
9871958
9882147
9894858
9898899
9923998
9930667
9946627
9955886
9967061
10034817
10044483
10176880
10176981
10192570
10262831
10410121
10537570
10560336
10563242
10609474
10877399
10888198
10902298
10937610
10942389
10945667
11009533
11015046
11027846
11035192
11062492
11073469
11094747
11100884
11115326
11122236
11167602
11171903
11178283
11181837
11184839
11205154
11206532
11217611
11229455
11240471
11248060
11252298
11263950
11272882
11287340
11290045
11385571
11386054
11389580
11402004
11403991
11472103
11487124
11502517
11525234
11556911
11567168
11587850
11600680
11672960
11693711
11701254
11707647
11723843
11732152
11745673
11816451
11817097
11825533
11826859
11828334
11970671
12002825
12104942
12104944
12104946
12116443
12116445
12117503
12127911
12134865
12138822
12138824
12138834
12161087
12338361
12410820
12419881
12633773
12867376
13071617
13187470
13387417
13797172
13850879
13981353
14008528
14019395
14069470
14089755
14123192
14150693
14169491
14175377
14393383
14419064
14631277
14671673
14671679
14912291
14973992
14990169
15109998
15462548
15552386
15614600
15724700
15869329
16050379
16063567
16205480
16220111
16655129
16682740
16682803
16683224
16684206
16726631
16767268
17760531
17893144
17907909
17953462
17959832
18362422
18457607
18519354
18541843
18924227
18945537
18955245
19370648
19388302
19786034
19795380
19800828
19870362
19887795
19962532
20286321
20395353
20435527
20445477
20624593
20715243
20778516
20841611
20849318
21026733
21057026
21116775
21118014
21118515
21118904
21124827
21125034
21125292
21226417
21305833
21535290
21570738
21615098
21871876
21885336
21946229
21965063
21966273
22019754
22019755
22035425
22051913
22065733
22240488
22391830
22467566
22497189
22630180
22833363
22833368
22833405
22833432
22833469
22935812
23002459
23067259
23393741
23617311
23620031
24264941
24820569
24843401
25068251
25116113
29980915
29984087
44144919
44145070
44146693
44147409
44147423
44153097
44181894
46318059
51347655
52915299
52953008
53260162
53260165
53394802
53395271
53395272
53395494
53400350
53400353
53400423
53400456
53400515
53400578
53401323
53421419
53423532
53424022
53425103
53438111
53471252
53756597
53764071
54255839
54589430
54676825
54676860
54676884
54678486
54679073
54680085
54721880
56602311
56969824
57177801
57257889
57346531
57348669
57352847
57357853
57357911
57376579
57414498
57483300
57901553
57901557
57957831
57979229
58591885
59273262
59677930
63701728
66647880
66769843
66810189
68162365
68278598
71306913
71312639
71377731
71431050
72737828
72750803
73170005
73456710
73555412
73555446
73818855
76068403
76971642
85039214
85813076
85879350
85879365
86233917
86278173
87165727
87225207
87668466
89798625
89884416
89999256
89999443
91216140
91431739
91996421
91997932
101266883
101266884
101731127
101731129
101757812
101757813
101757814
101757815
101757816
101757817
101757818
101757819
102269401
102295954
102494927
118229906
118281119
130979957
131727912
132472057
132556006
134852054
135399673
135400189
135406868
135406983
135414344
135422074
135440630
135442968
135483690
135564889
135599796
135608366
135666641
135730717
135755548
135802006
135849768
135850413
135973226
136002753
136058972
136090733
136109196
136160641
136180125
136274475
136494638
136497878
136500903
136594047
136601774
136962105
137274588
138396506
138402797
139594562
139594991
139595077
139595331
139595342
139596275
139596554
139596614
139597155
139597492
139804131
141336490
145865716
145865717
145865731
145865732
146678672
147905560
151251909
154024139
156596262
156596263
156596264
156596266
156596267
156596269
156596270
156596271
156596272
156596273
156596274
156596275
156596277
156596278
156596279
156596280
156596281
156596282
156596283
156596284
156599995
156599997
156600003
156600011
156600012
156600013
156600014
156600021
156600022
156600023
156600025
156600029
156600031
156600033
156600034
156600037
156600041
156600042
156600044
156600045
156600048
156600051
156600053
156600054
156600056
156600059
156600060
156600063
156600065
156600067
156600070
156600071
156600072
156600075
156600078
156600083
156600086
156600088
156600090
156600092
163184940
163184941
163184942
