<?xml version="1.0" encoding="UTF-8" standalone="no"?>
<svg
   xmlns:dc="http://purl.org/dc/elements/1.1/"
   xmlns:cc="http://creativecommons.org/ns#"
   xmlns:rdf="http://www.w3.org/1999/02/22-rdf-syntax-ns#"
   xmlns:svg="http://www.w3.org/2000/svg"
   xmlns="http://www.w3.org/2000/svg"
   xmlns:sodipodi="http://sodipodi.sourceforge.net/DTD/sodipodi-0.dtd"
   xmlns:inkscape="http://www.inkscape.org/namespaces/inkscape"
   width="1085.0"
   height="260.0"
   version="1.1"
   id="svg203"
   sodipodi:docname="PubChemLiteEXPOSOMICS_logo.svg"
   inkscape:version="1.0.2-2 (e86c870879, 2021-01-15)"
   inkscape:export-filename="C:\Users\astag\Downloads\PubChemLiteEXPOSOMICS_logo.png"
   inkscape:export-xdpi="96"
   inkscape:export-ydpi="96">
  <metadata
     id="metadata209">
    <rdf:RDF>
      <cc:Work
         rdf:about="">
        <dc:format>image/svg+xml</dc:format>
        <dc:type
           rdf:resource="http://purl.org/dc/dcmitype/StillImage" />
        <dc:title>PubchemLiteEXPOSOMICS_logo__standard</dc:title>
      </cc:Work>
    </rdf:RDF>
  </metadata>
  <defs
     id="defs207" />
  <sodipodi:namedview
     pagecolor="#ffffff"
     bordercolor="#666666"
     borderopacity="1"
     objecttolerance="10"
     gridtolerance="10"
     guidetolerance="10"
     inkscape:pageopacity="0"
     inkscape:pageshadow="2"
     inkscape:window-width="2561"
     inkscape:window-height="1107"
     id="namedview205"
     showgrid="false"
     inkscape:zoom="1.6202765"
     inkscape:cx="542.5"
     inkscape:cy="130"
     inkscape:window-x="584"
     inkscape:window-y="153"
     inkscape:window-maximized="0"
     inkscape:current-layer="svg203"
     inkscape:document-rotation="0" />
  <title
     id="title171">PubchemLiteEXPOSOMICS_logo__standard</title>
  <desc
     id="desc173">Created with Bez</desc>
  <g
     id="Group">
    <path
       id="Polygon"
       fill="#000"
       fill-opacity="0.0"
       stroke="#0071bc"
       stroke-width="12.0"
       stroke-linecap="round"
       stroke-linejoin="round"
       d="M305.0,54.3 L384.2,7.4 L463.4,54.3 L463.4,148.3 L384.2,195.3 L305.0,148.3 L305.0,54.3 Z" />
    <g
       id="C"
       style="fill:#5b616b;fill-opacity:1">
      <path
         id="C-1"
         fill="#000"
         d="M411.2,84.0 L434.8,84.0 C434.0,77.4 432.3,71.6 429.5,66.5 C426.7,61.5 423.2,57.2 418.9,53.8 C414.6,50.4 409.7,47.7 404.3,45.9 C398.9,44.2 393.1,43.3 387.1,43.3 C378.6,43.3 371.0,44.8 364.2,47.9 C357.4,50.9 351.7,55.1 347.1,60.5 C342.4,65.9 338.9,72.2 336.4,79.5 C333.9,86.7 332.7,94.5 332.7,103.0 C332.7,111.2 333.9,118.9 336.4,126.0 C338.9,133.2 342.4,139.4 347.1,144.6 C351.7,149.9 357.4,154.1 364.2,157.1 C371.0,160.1 378.6,161.6 387.1,161.6 C393.9,161.6 400.1,160.5 405.8,158.4 C411.5,156.3 416.4,153.2 420.7,149.2 C424.9,145.2 428.3,140.4 430.9,134.7 C433.5,129.0 435.1,122.6 435.7,115.5 L412.1,115.5 C411.2,123.1 408.7,129.2 404.5,133.9 C400.3,138.5 394.5,140.8 387.1,140.8 C381.6,140.8 376.9,139.8 373.1,137.6 C369.3,135.4 366.2,132.5 363.8,129.0 C361.4,125.4 359.7,121.3 358.6,116.8 C357.5,112.4 357.0,107.7 357.0,103.0 C357.0,98.0 357.5,93.2 358.6,88.6 C359.7,83.9 361.4,79.8 363.8,76.1 C366.2,72.5 369.3,69.6 373.1,67.4 C376.9,65.2 381.6,64.2 387.1,64.2 C390.0,64.2 392.9,64.7 395.6,65.7 C398.4,66.7 400.8,68.1 403.0,69.9 C405.2,71.7 407.0,73.8 408.4,76.1 C409.9,78.5 410.8,81.1 411.2,84.0 Z"
         style="fill:#5b616b;fill-opacity:1" />
    </g>
  </g>
  <g
     id="Lite"
     style="fill:#5b616b;fill-opacity:1">
    <path
       id="L"
       fill="#000"
       d="M814.5,47.2 L814.5,157.8 L892.7,157.8 L892.7,137.3 L838.8,137.3 L838.8,47.2 L814.5,47.2 Z"
       style="fill:#5b616b;fill-opacity:1" />
    <path
       id="i"
       fill="#000"
       d="M926.7,65.3 L926.7,47.2 L904.7,47.2 L904.7,65.3 L926.7,65.3 ZM904.7,77.7 L904.7,157.8 L926.7,157.8 L926.7,77.7 L904.7,77.7 Z"
       style="fill:#5b616b;fill-opacity:1" />
    <path
       id="t"
       fill="#000"
       d="M971.9,77.7 L971.9,53.7 L949.9,53.7 L949.9,77.7 L936.6,77.7 L936.6,92.4 L949.9,92.4 L949.9,139.6 C949.9,143.7 950.6,146.9 951.9,149.4 C953.2,151.9 955.1,153.8 957.4,155.1 C959.7,156.5 962.4,157.4 965.5,157.8 C968.5,158.3 971.7,158.5 975.1,158.5 C977.3,158.5 979.5,158.5 981.8,158.4 C984.1,158.3 986.1,158.1 988.0,157.8 L988.0,140.7 C987.0,140.9 985.9,141.1 984.7,141.2 C983.6,141.3 982.4,141.4 981.2,141.4 C977.5,141.4 975.0,140.7 973.7,139.5 C972.5,138.3 971.9,135.8 971.9,132.1 L971.9,92.4 L988.0,92.4 L988.0,77.7 L971.9,77.7 Z"
       style="fill:#5b616b;fill-opacity:1" />
    <path
       id="e"
       fill="#000"
       d="M1052.4,109.1 L1016.6,109.1 C1016.7,107.6 1017.1,105.8 1017.6,103.9 C1018.2,101.9 1019.2,100.0 1020.6,98.3 C1022.0,96.5 1023.8,95.1 1026.2,93.9 C1028.5,92.7 1031.4,92.1 1034.9,92.1 C1040.3,92.1 1044.3,93.5 1046.9,96.4 C1049.6,99.3 1051.4,103.6 1052.4,109.1 ZM1016.6,123.1 L1074.4,123.1 C1074.8,116.9 1074.3,110.9 1072.9,105.3 C1071.4,99.6 1069.1,94.5 1065.8,90.1 C1062.6,85.6 1058.4,82.1 1053.3,79.5 C1048.3,76.8 1042.3,75.5 1035.5,75.5 C1029.4,75.5 1023.9,76.6 1018.9,78.8 C1013.9,80.9 1009.6,83.9 1006.0,87.7 C1002.3,91.5 999.6,95.9 997.6,101.1 C995.6,106.2 994.6,111.8 994.6,117.8 C994.6,124.0 995.6,129.7 997.5,134.8 C999.4,140.0 1002.1,144.4 1005.6,148.2 C1009.2,151.9 1013.4,154.7 1018.5,156.8 C1023.6,158.8 1029.2,159.8 1035.5,159.8 C1044.6,159.8 1052.4,157.7 1058.8,153.6 C1065.2,149.5 1069.9,142.6 1073.0,133.0 L1053.7,133.0 C1052.9,135.5 1051.0,137.8 1047.8,140.0 C1044.6,142.3 1040.7,143.4 1036.3,143.4 C1030.1,143.4 1025.4,141.8 1022.1,138.6 C1018.8,135.4 1016.9,130.2 1016.6,123.1 Z"
       style="fill:#5b616b;fill-opacity:1" />
  </g>
  <g
     id="hem"
     style="fill:#5b616b;fill-opacity:1">
    <path
       id="h"
       fill="#000"
       d="M485.2,47.2 L485.2,157.8 L507.2,157.8 L507.2,115.8 C507.2,107.6 508.5,101.8 511.2,98.2 C513.9,94.7 518.2,92.9 524.2,92.9 C529.5,92.9 533.2,94.5 535.2,97.8 C537.3,101.0 538.3,105.9 538.3,112.5 L538.3,157.8 L560.3,157.8 L560.3,108.5 C560.3,103.6 559.9,99.0 559.0,95.0 C558.1,90.9 556.6,87.4 554.4,84.6 C552.3,81.7 549.3,79.5 545.5,77.9 C541.8,76.3 536.9,75.5 531.0,75.5 C526.9,75.5 522.7,76.6 518.3,78.7 C514.0,80.8 510.4,84.2 507.7,88.8 L507.2,88.8 L507.2,47.2 L485.2,47.2 Z"
       style="fill:#5b616b;fill-opacity:1" />
    <path
       id="e-1"
       fill="#000"
       d="M630.9,109.1 L595.2,109.1 C595.3,107.6 595.6,105.8 596.2,103.9 C596.7,101.9 597.7,100.0 599.1,98.3 C600.5,96.5 602.4,95.1 604.7,93.9 C607.0,92.7 609.9,92.1 613.4,92.1 C618.8,92.1 622.8,93.5 625.4,96.4 C628.1,99.3 629.9,103.6 630.9,109.1 ZM595.2,123.1 L652.9,123.1 C653.3,116.9 652.8,110.9 651.4,105.3 C649.9,99.6 647.6,94.5 644.3,90.1 C641.1,85.6 636.9,82.1 631.9,79.5 C626.8,76.8 620.9,75.5 614.1,75.5 C608.0,75.5 602.4,76.6 597.4,78.8 C592.4,80.9 588.1,83.9 584.5,87.7 C580.9,91.5 578.1,95.9 576.1,101.1 C574.2,106.2 573.2,111.8 573.2,117.8 C573.2,124.0 574.1,129.7 576.0,134.8 C577.9,140.0 580.7,144.4 584.2,148.2 C587.7,151.9 592.0,154.7 597.0,156.8 C602.1,158.8 607.8,159.8 614.1,159.8 C623.1,159.8 630.9,157.7 637.3,153.6 C643.7,149.5 648.4,142.6 651.5,133.0 L632.2,133.0 C631.5,135.5 629.5,137.8 626.3,140.0 C623.1,142.3 619.3,143.4 614.8,143.4 C608.6,143.4 603.9,141.8 600.6,138.6 C597.3,135.4 595.5,130.2 595.2,123.1 Z"
       style="fill:#5b616b;fill-opacity:1" />
    <path
       id="m"
       fill="#000"
       d="M666.6,77.7 L666.6,157.8 L688.6,157.8 L688.6,111.3 C688.6,107.4 689.1,104.2 690.3,101.8 C691.4,99.4 692.8,97.5 694.4,96.2 C696.0,94.9 697.6,94.0 699.3,93.6 C701.0,93.1 702.4,92.9 703.4,92.9 C706.9,92.9 709.6,93.5 711.4,94.7 C713.2,95.8 714.5,97.4 715.3,99.4 C716.0,101.3 716.5,103.5 716.6,105.8 C716.7,108.1 716.7,110.5 716.7,112.9 L716.7,157.8 L738.7,157.8 L738.7,113.2 C738.7,110.7 738.9,108.2 739.3,105.8 C739.6,103.4 740.4,101.2 741.4,99.3 C742.5,97.4 744.0,95.8 745.9,94.7 C747.8,93.5 750.4,92.9 753.4,92.9 C756.5,92.9 759.0,93.4 760.8,94.4 C762.6,95.5 764.0,96.8 764.9,98.6 C765.8,100.4 766.4,102.4 766.6,104.8 C766.8,107.2 766.9,109.7 766.9,112.4 L766.9,157.8 L788.9,157.8 L788.9,104.2 C788.9,99.0 788.2,94.6 786.7,90.9 C785.3,87.3 783.3,84.3 780.7,82.0 C778.1,79.8 775.0,78.1 771.4,77.1 C767.8,76.0 763.9,75.5 759.6,75.5 C754.1,75.5 749.2,76.9 745.2,79.6 C741.1,82.2 737.9,85.3 735.5,88.8 C733.3,83.9 730.1,80.4 726.0,78.5 C721.8,76.5 717.2,75.5 712.1,75.5 C706.8,75.5 702.2,76.7 698.1,78.9 C694.0,81.2 690.5,84.4 687.6,88.5 L687.3,88.5 L687.3,77.7 L666.6,77.7 Z"
       style="fill:#5b616b;fill-opacity:1" />
  </g>
  <g
     id="Pub"
     style="fill:#5b616b;fill-opacity:1">
    <path
       id="P"
       fill="#000"
       d="M36.8,99.2 L36.8,66.1 L55.7,66.1 C58.4,66.1 61.1,66.3 63.7,66.7 C66.3,67.1 68.6,67.9 70.5,69.1 C72.5,70.3 74.1,72.0 75.2,74.1 C76.4,76.3 77.0,79.1 77.0,82.7 C77.0,86.2 76.4,89.0 75.2,91.2 C74.1,93.3 72.5,95.0 70.5,96.2 C68.6,97.4 66.3,98.2 63.7,98.6 C61.1,99.0 58.4,99.2 55.7,99.2 L36.8,99.2 ZM12.4,47.2 L12.4,157.8 L36.8,157.8 L36.8,118.1 L62.3,118.1 C69.2,118.1 75.1,117.1 80.0,115.1 C84.8,113.1 88.8,110.4 91.8,107.1 C94.9,103.8 97.1,100.0 98.5,95.7 C99.9,91.5 100.6,87.1 100.6,82.7 C100.6,78.1 99.9,73.7 98.5,69.5 C97.1,65.3 94.9,61.5 91.8,58.2 C88.8,54.9 84.8,52.2 80.0,50.2 C75.1,48.2 69.2,47.2 62.3,47.2 L12.4,47.2 Z"
       style="fill:#5b616b;fill-opacity:1" />
    <path
       id="u"
       fill="#000"
       d="M188.5,157.8 L188.5,77.7 L166.5,77.7 L166.5,119.7 C166.5,127.8 165.2,133.7 162.5,137.2 C159.8,140.8 155.5,142.6 149.5,142.6 C144.2,142.6 140.6,141.0 138.5,137.7 C136.5,134.5 135.4,129.5 135.4,122.9 L135.4,77.7 L113.4,77.7 L113.4,126.9 C113.4,131.9 113.9,136.4 114.7,140.5 C115.6,144.6 117.1,148.0 119.3,150.9 C121.5,153.7 124.4,155.9 128.2,157.5 C132.0,159.0 136.8,159.8 142.7,159.8 C147.3,159.8 151.9,158.7 156.3,156.7 C160.8,154.6 164.4,151.3 167.2,146.6 L167.6,146.6 L167.6,157.8 L188.5,157.8 Z"
       style="fill:#5b616b;fill-opacity:1" />
    <path
       id="b"
       fill="#000"
       d="M264.0,117.8 C264.0,121.1 263.6,124.3 262.9,127.4 C262.2,130.5 261.0,133.2 259.5,135.6 C257.9,138.0 256.0,139.9 253.7,141.3 C251.3,142.7 248.5,143.4 245.2,143.4 C242.0,143.4 239.2,142.7 236.9,141.3 C234.5,139.9 232.5,138.0 231.0,135.6 C229.4,133.2 228.3,130.5 227.6,127.4 C226.8,124.3 226.5,121.1 226.5,117.8 C226.5,114.4 226.8,111.1 227.6,108.1 C228.3,105.0 229.4,102.2 231.0,99.8 C232.5,97.5 234.5,95.6 236.9,94.2 C239.2,92.8 242.0,92.1 245.2,92.1 C248.5,92.1 251.3,92.8 253.7,94.2 C256.0,95.6 257.9,97.5 259.5,99.8 C261.0,102.2 262.2,105.0 262.9,108.1 C263.6,111.1 264.0,114.4 264.0,117.8 ZM205.3,47.2 L205.3,157.8 L226.2,157.8 L226.2,147.5 L226.5,147.5 C228.9,152.0 232.4,155.1 237.0,157.0 C241.7,158.9 246.9,159.8 252.8,159.8 C256.8,159.8 260.8,159.0 264.7,157.3 C268.7,155.7 272.2,153.1 275.4,149.7 C278.5,146.3 281.1,141.9 283.0,136.6 C285.0,131.3 286.0,125.0 286.0,117.7 C286.0,110.3 285.0,104.0 283.0,98.7 C281.1,93.4 278.5,89.0 275.4,85.6 C272.2,82.2 268.7,79.7 264.7,78.0 C260.8,76.4 256.8,75.5 252.8,75.5 C247.9,75.5 243.1,76.5 238.5,78.4 C233.9,80.3 230.3,83.3 227.6,87.5 L227.3,87.5 L227.3,47.2 L205.3,47.2 Z"
       style="fill:#5b616b;fill-opacity:1" />
  </g>
  <g
     id="EXPOSOMICS"
     style="fill:#0071bc;fill-opacity:1">
    <path
       id="E"
       fill="#000"
       d="M484.2,189.1 L484.2,248.5 L529.3,248.5 L529.3,237.6 L497.3,237.6 L497.3,223.0 L526.1,223.0 L526.1,212.8 L497.3,212.8 L497.3,200.1 L528.7,200.1 L528.7,189.1 L484.2,189.1 Z"
       style="fill:#0071bc;fill-opacity:1" />
    <path
       id="X"
       fill="#000"
       d="M556.6,217.4 L535.9,248.5 L550.5,248.5 L563.8,228.0 L576.7,248.5 L592.3,248.5 L571.6,217.5 L590.6,189.1 L576.3,189.1 L564.3,208.1 L552.6,189.1 L537.5,189.1 L556.6,217.4 Z"
       style="fill:#0071bc;fill-opacity:1" />
    <path
       id="P-1"
       fill="#000"
       d="M614.5,217.1 L614.5,199.3 L624.7,199.3 C626.2,199.3 627.6,199.4 629.0,199.6 C630.4,199.8 631.6,200.3 632.6,200.9 C633.7,201.5 634.5,202.4 635.2,203.6 C635.8,204.8 636.1,206.3 636.1,208.2 C636.1,210.1 635.8,211.6 635.2,212.8 C634.5,213.9 633.7,214.8 632.6,215.5 C631.6,216.1 630.4,216.5 629.0,216.8 C627.6,217.0 626.2,217.1 624.7,217.1 L614.5,217.1 ZM601.4,189.1 L601.4,248.5 L614.5,248.5 L614.5,227.2 L628.2,227.2 C632.0,227.2 635.1,226.7 637.7,225.6 C640.3,224.5 642.5,223.1 644.1,221.3 C645.7,219.6 646.9,217.5 647.7,215.2 C648.4,212.9 648.8,210.6 648.8,208.2 C648.8,205.7 648.4,203.4 647.7,201.1 C646.9,198.8 645.7,196.8 644.1,195.0 C642.5,193.3 640.3,191.8 637.7,190.8 C635.1,189.7 632.0,189.1 628.2,189.1 L601.4,189.1 Z"
       style="fill:#0071bc;fill-opacity:1" />
    <path
       id="O"
       fill="#000"
       d="M671.3,219.1 C671.3,216.5 671.6,213.9 672.2,211.5 C672.8,209.1 673.7,206.9 675.0,205.0 C676.3,203.1 677.9,201.5 680.0,200.4 C682.0,199.3 684.5,198.7 687.5,198.7 C690.4,198.7 692.9,199.3 695.0,200.4 C697.0,201.5 698.7,203.1 699.9,205.0 C701.2,206.9 702.2,209.1 702.7,211.5 C703.3,213.9 703.6,216.5 703.6,219.1 C703.6,221.6 703.3,224.0 702.7,226.4 C702.2,228.7 701.2,230.8 699.9,232.7 C698.7,234.6 697.0,236.1 695.0,237.3 C692.9,238.4 690.4,239.0 687.5,239.0 C684.5,239.0 682.0,238.4 680.0,237.3 C677.9,236.1 676.3,234.6 675.0,232.7 C673.7,230.8 672.8,228.7 672.2,226.4 C671.6,224.0 671.3,221.6 671.3,219.1 ZM658.3,219.1 C658.3,223.4 658.9,227.4 660.3,231.2 C661.6,234.9 663.5,238.2 666.0,241.0 C668.5,243.7 671.6,245.9 675.2,247.5 C678.8,249.1 682.9,249.9 687.5,249.9 C692.1,249.9 696.2,249.1 699.8,247.5 C703.4,245.9 706.4,243.7 708.9,241.0 C711.4,238.2 713.3,234.9 714.7,231.2 C716.0,227.4 716.7,223.4 716.7,219.1 C716.7,214.6 716.0,210.5 714.7,206.7 C713.3,202.9 711.4,199.6 708.9,196.8 C706.4,194.0 703.4,191.7 699.8,190.1 C696.2,188.5 692.1,187.7 687.5,187.7 C682.9,187.7 678.8,188.5 675.2,190.1 C671.6,191.7 668.5,194.0 666.0,196.8 C663.5,199.6 661.6,202.9 660.3,206.7 C658.9,210.5 658.3,214.6 658.3,219.1 Z"
       style="fill:#0071bc;fill-opacity:1" />
    <path
       id="S"
       fill="#000"
       d="M738.4,228.8 L725.7,228.8 C725.7,232.5 726.3,235.6 727.7,238.3 C729.1,241.0 731.0,243.2 733.3,244.9 C735.7,246.6 738.4,247.9 741.5,248.7 C744.6,249.5 747.7,249.9 751.0,249.9 C755.1,249.9 758.6,249.4 761.7,248.4 C764.8,247.5 767.4,246.2 769.5,244.5 C771.5,242.8 773.1,240.8 774.2,238.5 C775.2,236.1 775.7,233.6 775.7,230.9 C775.7,227.6 775.0,224.8 773.6,222.7 C772.2,220.6 770.5,218.9 768.6,217.6 C766.6,216.3 764.7,215.4 762.7,214.8 C760.7,214.2 759.2,213.8 758.1,213.6 C754.4,212.6 751.4,211.9 749.1,211.3 C746.8,210.6 745.0,210.0 743.7,209.4 C742.4,208.8 741.5,208.2 741.0,207.4 C740.6,206.7 740.4,205.8 740.4,204.6 C740.4,203.3 740.6,202.3 741.2,201.4 C741.8,200.6 742.5,199.9 743.3,199.4 C744.2,198.8 745.1,198.4 746.2,198.2 C747.2,198.0 748.3,197.9 749.4,197.9 C751.0,197.9 752.4,198.0 753.8,198.3 C755.2,198.6 756.4,199.0 757.4,199.7 C758.5,200.4 759.3,201.3 760.0,202.4 C760.6,203.6 761.0,205.1 761.1,206.8 L773.7,206.8 C773.7,203.4 773.1,200.5 771.8,198.1 C770.5,195.7 768.7,193.7 766.5,192.1 C764.3,190.6 761.7,189.4 758.9,188.8 C756.0,188.1 753.0,187.7 749.9,187.7 C747.3,187.7 744.6,188.1 742.0,188.8 C739.3,189.5 736.9,190.6 734.8,192.1 C732.7,193.6 731.0,195.5 729.7,197.7 C728.4,200.0 727.7,202.6 727.7,205.7 C727.7,208.4 728.2,210.7 729.3,212.6 C730.3,214.5 731.6,216.1 733.3,217.4 C735.0,218.7 736.8,219.7 739.0,220.5 C741.1,221.3 743.2,222.0 745.4,222.6 C747.6,223.2 749.7,223.7 751.9,224.2 C754.0,224.7 755.8,225.3 757.5,226.0 C759.2,226.7 760.5,227.5 761.5,228.5 C762.6,229.5 763.1,230.8 763.1,232.4 C763.1,233.9 762.7,235.1 761.9,236.1 C761.1,237.1 760.2,237.8 759.0,238.4 C757.8,238.9 756.6,239.3 755.3,239.5 C753.9,239.7 752.7,239.8 751.5,239.8 C749.8,239.8 748.1,239.6 746.5,239.2 C744.9,238.8 743.5,238.1 742.3,237.3 C741.1,236.4 740.2,235.3 739.5,233.9 C738.7,232.5 738.4,230.8 738.4,228.8 Z"
       style="fill:#0071bc;fill-opacity:1" />
    <path
       id="O-1"
       fill="#000"
       d="M797.9,219.1 C797.9,216.5 798.1,213.9 798.7,211.5 C799.3,209.1 800.2,206.9 801.5,205.0 C802.8,203.1 804.5,201.5 806.5,200.4 C808.6,199.3 811.1,198.7 814.0,198.7 C816.9,198.7 819.4,199.3 821.5,200.4 C823.5,201.5 825.2,203.1 826.5,205.0 C827.7,206.9 828.7,209.1 829.3,211.5 C829.8,213.9 830.1,216.5 830.1,219.1 C830.1,221.6 829.8,224.0 829.3,226.4 C828.7,228.7 827.7,230.8 826.5,232.7 C825.2,234.6 823.5,236.1 821.5,237.3 C819.4,238.4 816.9,239.0 814.0,239.0 C811.1,239.0 808.6,238.4 806.5,237.3 C804.5,236.1 802.8,234.6 801.5,232.7 C800.2,230.8 799.3,228.7 798.7,226.4 C798.1,224.0 797.9,221.6 797.9,219.1 ZM784.8,219.1 C784.8,223.4 785.5,227.4 786.8,231.2 C788.1,234.9 790.0,238.2 792.5,241.0 C795.0,243.7 798.1,245.9 801.7,247.5 C805.4,249.1 809.4,249.9 814.0,249.9 C818.6,249.9 822.7,249.1 826.3,247.5 C829.9,245.9 833.0,243.7 835.5,241.0 C838.0,238.2 839.9,234.9 841.2,231.2 C842.5,227.4 843.2,223.4 843.2,219.1 C843.2,214.6 842.5,210.5 841.2,206.7 C839.9,202.9 838.0,199.6 835.5,196.8 C833.0,194.0 829.9,191.7 826.3,190.1 C822.7,188.5 818.6,187.7 814.0,187.7 C809.4,187.7 805.4,188.5 801.7,190.1 C798.1,191.7 795.0,194.0 792.5,196.8 C790.0,199.6 788.1,202.9 786.8,206.7 C785.5,210.5 784.8,214.6 784.8,219.1 Z"
       style="fill:#0071bc;fill-opacity:1" />
    <path
       id="M"
       fill="#000"
       d="M856.0,189.1 L856.0,248.5 L868.2,248.5 L868.2,206.8 L868.4,206.8 L883.0,248.5 L893.0,248.5 L907.6,206.4 L907.7,206.4 L907.7,248.5 L920.0,248.5 L920.0,189.1 L901.6,189.1 L888.4,230.0 L888.3,230.0 L874.4,189.1 L856.0,189.1 Z"
       style="fill:#0071bc;fill-opacity:1" />
    <path
       id="I"
       fill="#000"
       d="M935.4,189.1 L935.4,248.5 L948.4,248.5 L948.4,189.1 L935.4,189.1 Z"
       style="fill:#0071bc;fill-opacity:1" />
    <path
       id="C-2"
       fill="#000"
       d="M1003.4,209.1 L1016.1,209.1 C1015.7,205.7 1014.7,202.6 1013.2,199.9 C1011.7,197.3 1009.8,195.0 1007.5,193.2 C1005.2,191.4 1002.6,190.1 999.7,189.1 C996.8,188.2 993.7,187.7 990.4,187.7 C985.9,187.7 981.8,188.5 978.2,190.1 C974.5,191.7 971.5,194.0 969.0,196.8 C966.5,199.6 964.6,202.9 963.2,206.7 C961.9,210.5 961.2,214.6 961.2,219.1 C961.2,223.4 961.9,227.4 963.2,231.2 C964.6,234.9 966.5,238.2 969.0,241.0 C971.5,243.7 974.5,245.9 978.2,247.5 C981.8,249.1 985.9,249.9 990.4,249.9 C994.1,249.9 997.4,249.3 1000.5,248.2 C1003.5,247.1 1006.2,245.5 1008.5,243.4 C1010.8,241.3 1012.6,238.7 1014.0,235.7 C1015.4,232.7 1016.2,229.4 1016.6,225.7 L1003.9,225.7 C1003.4,229.6 1002.0,232.9 999.8,235.3 C997.5,237.7 994.4,239.0 990.4,239.0 C987.5,239.0 985.0,238.4 982.9,237.3 C980.9,236.1 979.2,234.6 977.9,232.7 C976.7,230.8 975.7,228.7 975.2,226.4 C974.6,224.0 974.3,221.6 974.3,219.1 C974.3,216.5 974.6,213.9 975.2,211.5 C975.7,209.1 976.7,206.9 977.9,205.0 C979.2,203.1 980.9,201.5 982.9,200.4 C985.0,199.3 987.5,198.7 990.4,198.7 C992.0,198.7 993.6,199.0 995.0,199.5 C996.5,200.0 997.8,200.7 999.0,201.7 C1000.2,202.6 1001.1,203.7 1001.9,205.0 C1002.7,206.2 1003.2,207.6 1003.4,209.1 Z"
       style="fill:#0071bc;fill-opacity:1" />
    <path
       id="S-1"
       fill="#000"
       d="M1038.3,228.8 L1025.6,228.8 C1025.6,232.5 1026.2,235.6 1027.6,238.3 C1029.0,241.0 1030.9,243.2 1033.2,244.9 C1035.6,246.6 1038.3,247.9 1041.4,248.7 C1044.5,249.5 1047.6,249.9 1050.9,249.9 C1055.0,249.9 1058.5,249.4 1061.6,248.4 C1064.7,247.5 1067.3,246.2 1069.3,244.5 C1071.4,242.8 1073.0,240.8 1074.0,238.5 C1075.1,236.1 1075.6,233.6 1075.6,230.9 C1075.6,227.6 1074.9,224.8 1073.5,222.7 C1072.1,220.6 1070.4,218.9 1068.5,217.6 C1066.5,216.3 1064.6,215.4 1062.6,214.8 C1060.6,214.2 1059.1,213.8 1058.0,213.6 C1054.3,212.6 1051.3,211.9 1049.0,211.3 C1046.6,210.6 1044.8,210.0 1043.5,209.4 C1042.2,208.8 1041.4,208.2 1040.9,207.4 C1040.5,206.7 1040.3,205.8 1040.3,204.6 C1040.3,203.3 1040.5,202.3 1041.1,201.4 C1041.6,200.6 1042.3,199.9 1043.2,199.4 C1044.1,198.8 1045.0,198.4 1046.1,198.2 C1047.1,198.0 1048.2,197.9 1049.2,197.9 C1050.9,197.9 1052.3,198.0 1053.7,198.3 C1055.1,198.6 1056.3,199.0 1057.3,199.7 C1058.4,200.4 1059.2,201.3 1059.8,202.4 C1060.5,203.6 1060.9,205.1 1061.0,206.8 L1073.6,206.8 C1073.6,203.4 1073.0,200.5 1071.7,198.1 C1070.4,195.7 1068.6,193.7 1066.4,192.1 C1064.2,190.6 1061.6,189.4 1058.8,188.8 C1055.9,188.1 1052.9,187.7 1049.8,187.7 C1047.2,187.7 1044.5,188.1 1041.8,188.8 C1039.2,189.5 1036.8,190.6 1034.7,192.1 C1032.6,193.6 1030.9,195.5 1029.6,197.7 C1028.3,200.0 1027.6,202.6 1027.6,205.7 C1027.6,208.4 1028.1,210.7 1029.1,212.6 C1030.2,214.5 1031.5,216.1 1033.2,217.4 C1034.8,218.7 1036.7,219.7 1038.8,220.5 C1040.9,221.3 1043.1,222.0 1045.3,222.6 C1047.5,223.2 1049.6,223.7 1051.7,224.2 C1053.8,224.7 1055.7,225.3 1057.4,226.0 C1059.1,226.7 1060.4,227.5 1061.4,228.5 C1062.5,229.5 1063.0,230.8 1063.0,232.4 C1063.0,233.9 1062.6,235.1 1061.8,236.1 C1061.0,237.1 1060.1,237.8 1058.9,238.4 C1057.7,238.9 1056.5,239.3 1055.1,239.5 C1053.8,239.7 1052.6,239.8 1051.4,239.8 C1049.7,239.8 1048.0,239.6 1046.4,239.2 C1044.8,238.8 1043.4,238.1 1042.2,237.3 C1041.0,236.4 1040.1,235.3 1039.3,233.9 C1038.6,232.5 1038.3,230.8 1038.3,228.8 Z"
       style="fill:#0071bc;fill-opacity:1" />
  </g>
</svg>
