hid,SourceName,SourceID,HNID,nCIDs,nodeNames,nodeHNID,nodeIDs,parentIDs,node_nCIDs,includeNode
1,MeSH,DescTree,1,130349,Chemicals and Drugs Category,1448648,node_81819,root,130349,TRUE
1,MeSH,DescTree,1,130349,Drug Combinations,1266292,node_560807,node_560805,91,TRUE
1,MeSH,DescTree,1,130349,"Drugs, Chinese Herbal",1386214,node_563174,node_560805,54,TRUE
1,MeSH,DescTree,1,130349,Pharmaceutical Preparations,1386213,node_560805,node_81819,280,TRUE
1,MeSH,DescTree,1,130349,Synthetic Drugs,3625338,node_566744,node_560805,1,TRUE
2,ChEBI,OBO,952816,103401,pharmaceutical,984685,node_2735762,node_2732681,5509,TRUE
14,KEGG,br08301,2334510,1502,43 Radioactive drugs,2335462,node_2055,node_1784,21,TRUE
14,KEGG,br08301,2334510,1502,430 Radioactive drugs,2335362,node_2056,node_2055,21,TRUE
15,KEGG,br08302,2337902,1172,Aminosalicylates and/or Prodrugs,3957059,node_1079,node_1041,4,TRUE
15,KEGG,br08302,2337902,1172,Nonsteroidal Anti-inflammatory Drugs,2340616,node_780,node_723,29,TRUE
15,KEGG,br08302,2337902,1172,"Nonsteroidal Anti-Inflammatory Drugs, Ophthalmic",3714100,node_1862,node_1861,10,TRUE
17,KEGG,br08304,2351814,1,Crude drugs,2352047,node_1,root,1,TRUE
17,KEGG,br08304,2351814,1,Purgative drugs,2352232,node_228,node_1,1,TRUE
17,KEGG,br08304,2351814,1,Purgative drugs,2352247,node_229,node_228,1,TRUE
23,KEGG,br08311,2366387,923,Crude drugs,2366830,node_1,root,2,TRUE
24,KEGG,br08312,2367851,628,Crude drugs,2368793,node_2,node_1,4,TRUE
24,KEGG,br08312,2367851,628,Crude drugs,2370629,node_2356,node_1786,2,TRUE
24,KEGG,br08312,2367851,628,Designated second-class OTC drugs,2369373,node_1541,root,70,TRUE
24,KEGG,br08312,2367851,628,Drugs requiring guidance,2370094,node_1692,root,11,TRUE
24,KEGG,br08312,2367851,628,First-class OTC drugs,2370688,node_1718,root,36,TRUE
24,KEGG,br08312,2367851,628,New approved switch OTC drugs,2368328,node_1693,node_1692,9,TRUE
24,KEGG,br08312,2367851,628,Powerful drugs,2369172,node_1713,node_1692,2,TRUE
24,KEGG,br08312,2367851,628,Second-class OTC drugs,2370741,node_1786,root,343,TRUE
24,KEGG,br08312,2367851,628,Third-class OTC drugs,2369224,node_1,root,283,TRUE
25,KEGG,br08313,2370919,306,05 Alertness drug,2371444,node_218,node_134,3,TRUE
25,KEGG,br08313,2370919,306,06 Antivertigo drugs (incl. motion/morning sickness remedies),2371098,node_168,node_134,11,TRUE
25,KEGG,br08313,2370919,306,08 Other drugs for nervous and sensory organs,2371413,node_212,node_134,2,TRUE
25,KEGG,br08313,2370919,306,09 Histamine H2 receptor blocker containing drugs,2371414,node_408,node_307,5,TRUE
25,KEGG,br08313,2370919,306,20 Other drugs for digestive organs,2371393,node_393,node_307,1,TRUE
25,KEGG,br08313,2370919,306,21 Cardiotonics (Senso containing drugs),2371044,node_597,node_596,1,TRUE
25,KEGG,br08313,2370919,306,22 Blood vessel reinforcing drugs,2371272,node_602,node_596,1,TRUE
25,KEGG,br08313,2370919,306,23 Arteriosclerosis drugs (incl. linoleate and lecithin based drugs),2371412,node_622,node_596,2,TRUE
25,KEGG,br08313,2370919,306,24 Anemia drugs,2371354,node_616,node_596,3,TRUE
25,KEGG,br08313,2370919,306,25 Other drugs for circulatory system and blood,2371329,node_606,node_596,2,TRUE
25,KEGG,br08313,2370919,306,29 Hemorrhoid drugs for internal use,2371101,node_901,node_900,1,TRUE
25,KEGG,br08313,2370919,306,30 Hemorrhoid drugs for external use,2371366,node_905,node_900,14,TRUE
25,KEGG,br08313,2370919,306,31 Other drugs for urogenital organs and anus,2371655,node_923,node_900,4,TRUE
25,KEGG,br08313,2370919,306,32 Vitamin A based drugs,2371565,node_118,node_13,2,TRUE
25,KEGG,br08313,2370919,306,33 Vitamin D based drugs,2370972,node_14,node_13,1,TRUE
25,KEGG,br08313,2370919,306,34 Vitamin E based drugs,2371234,node_45,node_13,5,TRUE
25,KEGG,br08313,2370919,306,35 Vitamin B1 based drugs,2371604,node_122,node_13,8,TRUE
25,KEGG,br08313,2370919,306,36 Vitamin B2 based drugs,2371435,node_82,node_13,4,TRUE
25,KEGG,br08313,2370919,306,37 Vitamin B6 based drugs,2371492,node_111,node_13,2,TRUE
25,KEGG,br08313,2370919,306,38 Vitamin C based drugs,2371303,node_78,node_13,3,TRUE
25,KEGG,br08313,2370919,306,39 Vitamin AD based drugs,2371281,node_54,node_13,2,TRUE
25,KEGG,br08313,2370919,306,40 Vitamin B2B6 based drugs,2371285,node_58,node_13,5,TRUE
25,KEGG,br08313,2370919,306,41 Vitamin EC based drugs,2371083,node_16,node_13,4,TRUE
25,KEGG,br08313,2370919,306,42 Vitamin B1B6B12 based drugs,2371169,node_33,node_13,11,TRUE
25,KEGG,br08313,2370919,306,44 Calcium based drugs,2371154,node_21,node_13,9,TRUE
25,KEGG,br08313,2370919,306,45 Protein and amino acid based drugs,2371499,node_114,node_13,3,TRUE
25,KEGG,br08313,2370919,306,51 Other drugs for women,2370932,node_268,node_267,8,TRUE
25,KEGG,br08313,2370919,306,52 Antihistamine based drugs,2371469,node_5,node_1,7,TRUE
25,KEGG,br08313,2370919,306,58 Ringworm drugs,2371014,node_444,node_438,22,TRUE
25,KEGG,br08313,2370919,306,Drugs for women,2371058,node_267,root,8,TRUE
69,KEGG,br08323,2373694,234,Crude drugs,2373788,node_150,root,167,TRUE
72,PubChem,Compound TOC,1749165,49517422,DEA Drug Facts,3869001,node_137,node_110,45,TRUE
72,PubChem,Compound TOC,1749165,49517422,Drug-Drug Interactions,4088594,node_521,node_511,2451,TRUE
72,PubChem,Compound TOC,1749165,49517422,Drug-Food Interactions,4088595,node_522,node_511,1080,TRUE
72,PubChem,Compound TOC,1749165,49517422,Drug-Gene Interactions,3834821,node_517,node_511,9410,TRUE
72,PubChem,Compound TOC,1749165,49517422,Drug and Medication Information,1857071,node_110,root,17889,TRUE
72,PubChem,Compound TOC,1749165,49517422,Drug Classes,3647570,node_132,node_110,1954,TRUE
72,PubChem,Compound TOC,1749165,49517422,Drug Effects during Lactation,3647571,node_133,node_110,474,TRUE
72,PubChem,Compound TOC,1749165,49517422,Drug Enforcement Administration (DEA),4024330,node_257,node_178,670,TRUE
72,PubChem,Compound TOC,1749165,49517422,Drug Enforcement Administration (DEA) Classification,3850689,node_63,node_28,670,TRUE
72,PubChem,Compound TOC,1749165,49517422,Drug Gene Interaction database (DGIdb),3857765,node_242,node_178,9410,TRUE
72,PubChem,Compound TOC,1749165,49517422,Drug Idiosyncrasies,1857174,node_126,node_110,94,TRUE
72,PubChem,Compound TOC,1749165,49517422,Drug Indication,1857173,node_125,node_110,4328,TRUE
72,PubChem,Compound TOC,1749165,49517422,Drug Labels for Ingredients,1857109,node_117,node_110,2942,TRUE
72,PubChem,Compound TOC,1749165,49517422,Drug Tolerance,1857108,node_116,node_110,421,TRUE
72,PubChem,Compound TOC,1749165,49517422,Drug Transformations,4041262,node_138,node_110,134,TRUE
72,PubChem,Compound TOC,1749165,49517422,Drug Warnings,1857101,node_115,node_110,2495,TRUE
72,PubChem,Compound TOC,1749165,49517422,DrugBank,2166068,node_180,node_178,10114,TRUE
72,PubChem,Compound TOC,1749165,49517422,DrugBank Interactions,1857079,node_512,node_511,6125,TRUE
72,PubChem,Compound TOC,1749165,49517422,Drugs and Lactation Database (LactMed),3647736,node_234,node_178,474,TRUE
72,PubChem,Compound TOC,1749165,49517422,EMA Drug Information,3647577,node_134,node_110,2557,TRUE
72,PubChem,Compound TOC,1749165,49517422,FDA Drugs,4032640,node_258,node_178,5116,TRUE
72,PubChem,Compound TOC,1749165,49517422,FDA Medication Guides,1857314,node_130,node_110,749,TRUE
72,PubChem,Compound TOC,1749165,49517422,FDA Medication Guides,2888961,node_207,node_178,749,TRUE
72,PubChem,Compound TOC,1749165,49517422,KEGG: Animal Drugs,1857268,node_51,node_28,280,TRUE
72,PubChem,Compound TOC,1749165,49517422,KEGG: Crude Drug,1856991,node_35,node_28,2,TRUE
72,PubChem,Compound TOC,1749165,49517422,KEGG: Drug,1857260,node_50,node_28,1502,TRUE
72,PubChem,Compound TOC,1749165,49517422,KEGG: Drug Classes,3647724,node_58,node_28,4620,TRUE
72,PubChem,Compound TOC,1749165,49517422,KEGG: OTC drugs,1857065,node_37,node_28,306,TRUE
72,PubChem,Compound TOC,1749165,49517422,KEGG: Risk Category of Japanese OTC Drugs,3647715,node_57,node_28,628,TRUE
72,PubChem,Compound TOC,1749165,49517422,KEGG: Target-based Classification of Drugs,1857277,node_52,node_28,4142,TRUE
72,PubChem,Compound TOC,1749165,49517422,Maximum Drug Dose,1857212,node_129,node_110,59,TRUE
72,PubChem,Compound TOC,1749165,49517422,NCI Cancer Drugs,1857165,node_124,node_110,303,TRUE
72,PubChem,Compound TOC,1749165,49517422,NCI Cancer Drugs,3128991,node_216,node_178,303,TRUE
72,PubChem,Compound TOC,1749165,49517422,NCI Investigational Drugs,2534392,node_202,node_178,195,TRUE
72,PubChem,Compound TOC,1749165,49517422,WHO Anatomical Therapeutic Chemical (ATC) Classification,4129386,node_267,node_178,4363,TRUE
72,PubChem,Compound TOC,1749165,49517422,WHO ATC,2166077,node_185,node_178,16399,TRUE
72,PubChem,Compound TOC,1749165,49517422,WHO ATC Classification System,3647727,node_59,node_28,16399,TRUE
78,FDA Pharm Classes,FDA_pharm_tree,1936306,1284,Alkylating Drug [EPC],1946876,node_32691,node_32671,18,TRUE
78,FDA Pharm Classes,FDA_pharm_tree,1936306,1284,Nonsteroidal Anti-inflammatory Drug [EPC],1947040,node_33081,node_33066,21,TRUE
78,FDA Pharm Classes,FDA_pharm_tree,1936306,1284,Platinum-based Drug [EPC],1946736,node_33121,node_33120,3,TRUE
78,FDA Pharm Classes,FDA_pharm_tree,1936306,1284,Radiopharmaceutical Activity [MoA],1936438,node_29393,node_29390,47,TRUE
78,FDA Pharm Classes,FDA_pharm_tree,1936306,1284,Tetracycline-class Drug [EPC],1947198,node_33264,node_33254,3,TRUE
79,WHO ATC,ATCTree,1949731,16452,A02 - Drugs for acid related disorders,1949777,node_46,node_1,284,TRUE
79,WHO ATC,ATCTree,1949731,16452,A02B - Drugs for peptic ulcer and gastro-oesophageal reflux disease (gord),1949811,node_80,node_46,198,TRUE
79,WHO ATC,ATCTree,1949731,16452,A03 - Drugs for functional gastrointestinal disorders,1949866,node_141,node_1,243,TRUE
79,WHO ATC,ATCTree,1949731,16452,A03A - Drugs for functional gastrointestinal disorders,1949867,node_142,node_141,129,TRUE
79,WHO ATC,ATCTree,1949731,16452,A06 - Drugs for constipation,1950026,node_305,node_1,303,TRUE
79,WHO ATC,ATCTree,1949731,16452,A06A - Drugs for constipation,1950027,node_306,node_305,303,TRUE
79,WHO ATC,ATCTree,1949731,16452,A10 - Drugs used in diabetes,1950214,node_499,node_1,293,TRUE
79,WHO ATC,ATCTree,1949731,16452,"A10B - Blood glucose lowering drugs, excl. insulins",1950249,node_535,node_499,273,TRUE
79,WHO ATC,ATCTree,1949731,16452,A10X - Other drugs used in diabetes,1950323,node_621,node_499,2,TRUE
79,WHO ATC,ATCTree,1949731,16452,G04C - Drugs used in benign prostatic hypertrophy,1952337,node_2709,node_2665,66,TRUE
79,WHO ATC,ATCTree,1949731,16452,J04A - Drugs for treatment of tuberculosis,1952790,node_3179,node_3178,185,TRUE
79,WHO ATC,ATCTree,1949731,16452,J04B - Drugs for treatment of lepra,1952824,node_3216,node_3178,11,TRUE
79,WHO ATC,ATCTree,1949731,16452,M05 - Drugs for treatment of bone diseases,1953657,node_4159,node_3931,55,TRUE
79,WHO ATC,ATCTree,1949731,16452,M05B - Drugs affecting bone structure and mineralization,1953658,node_4160,node_4159,55,TRUE
79,WHO ATC,ATCTree,1949731,16452,M09 - Other drugs for disorders of the musculo-skeletal system,1953686,node_4191,node_3931,47,TRUE
79,WHO ATC,ATCTree,1949731,16452,M09A - Other drugs for disorders of the musculo-skeletal system,1953687,node_4192,node_4191,47,TRUE
79,WHO ATC,ATCTree,1949731,16452,N04 - Anti-parkinson drugs,1953965,node_4494,node_4209,158,TRUE
79,WHO ATC,ATCTree,1949731,16452,N06D - Anti-dementia drugs,1954328,node_4866,node_4749,50,TRUE
79,WHO ATC,ATCTree,1949731,16452,N07 - Other nervous system drugs,1954341,node_4879,node_4209,184,TRUE
79,WHO ATC,ATCTree,1949731,16452,N07B - Drugs used in addictive disorders,1954356,node_4894,node_4879,80,TRUE
79,WHO ATC,ATCTree,1949731,16452,N07X - Other nervous system drugs,1954381,node_4920,node_4879,45,TRUE
79,WHO ATC,ATCTree,1949731,16452,R03 - Drugs for obstructive airway diseases,1954673,node_5221,node_5112,373,TRUE
79,WHO ATC,ATCTree,1949731,16452,"R03B - Other drugs for obstructive airway diseases, inhalants",1954719,node_5275,node_5221,180,TRUE
79,WHO ATC,ATCTree,1949731,16452,R03D - Other systemic drugs for obstructive airway diseases,1954769,node_5327,node_5221,77,TRUE
79,WHO ATC,ATCTree,1949731,16452,V09 - Diagnostic radiopharmaceuticals,1955580,node_6166,node_5911,73,TRUE
79,WHO ATC,ATCTree,1949731,16452,V09X - Other diagnostic radiopharmaceuticals,1955702,node_6293,node_6166,4,TRUE
79,WHO ATC,ATCTree,1949731,16452,V10 - Therapeutic radiopharmaceuticals,1955712,node_6303,node_5911,12,TRUE
79,WHO ATC,ATCTree,1949731,16452,V10X - Other therapeutic radiopharmaceuticals,1955730,node_6321,node_6303,5,TRUE
84,ChemIDplus,ChemIDplus_tree,3091656,324487,Designer Drug,3092244,node_461,node_442,1,TRUE
84,ChemIDplus,ChemIDplus_tree,3091656,324487,Drug / Therapeutic Agent,3092267,node_484,node_442,87006,TRUE
84,ChemIDplus,ChemIDplus_tree,3091656,324487,Drug Carriers,3092268,node_485,node_442,3,TRUE
84,ChemIDplus,ChemIDplus_tree,3091656,324487,DrugBank,3092269,node_2092,node_2086,2421,TRUE
84,ChemIDplus,ChemIDplus_tree,3091656,324487,DrugDigest,3092270,node_2093,node_2086,1794,TRUE
84,ChemIDplus,ChemIDplus_tree,3091656,324487,DrugImage,3092271,node_2094,node_2086,1,TRUE
84,ChemIDplus,ChemIDplus_tree,3091656,324487,DrugPortal,3092272,node_2015,node_2005,72120,TRUE
84,ChemIDplus,ChemIDplus_tree,3091656,324487,Drugs@FDA,3092273,node_2095,node_2086,3185,TRUE
84,ChemIDplus,ChemIDplus_tree,3091656,324487,MedlinePlusDrug,3092552,node_2032,node_2005,1762,TRUE
84,ChemIDplus,ChemIDplus_tree,3091656,324487,MedlinePlusDrug Mob,3092553,node_2033,node_2005,1762,TRUE
84,ChemIDplus,ChemIDplus_tree,3091656,324487,MedlinePlusDrug2,3092554,node_2034,node_2005,6,TRUE
84,ChemIDplus,ChemIDplus_tree,3091656,324487,MedlinePlusDrug3,3092555,node_2035,node_2005,1,TRUE
84,ChemIDplus,ChemIDplus_tree,3091656,324487,Metabolic Side Effects of Drugs and Substances,3388995,node_750,node_719,56,TRUE
84,ChemIDplus,ChemIDplus_tree,3091656,324487,Pharmaceutical Solutions,3092721,node_857,node_830,15,TRUE
84,ChemIDplus,ChemIDplus_tree,3091656,324487,Pharmaceutical Vehicles,3092722,node_858,node_830,6,TRUE
84,ChemIDplus,ChemIDplus_tree,3091656,324487,"Preservatives, Pharmaceutical",3092752,node_886,node_830,6,TRUE
84,ChemIDplus,ChemIDplus_tree,3091656,324487,Prodrugs,3092753,node_887,node_830,1,TRUE
84,ChemIDplus,ChemIDplus_tree,3091656,324487,Psychotropic Drugs,3092776,node_910,node_830,325,TRUE
84,ChemIDplus,ChemIDplus_tree,3091656,324487,Radiopharmaceuticals,3092806,node_929,node_924,36,TRUE
84,ChemIDplus,ChemIDplus_tree,3091656,324487,"Sleep Aids, Pharmaceutical",3092883,node_979,node_946,6,TRUE
84,ChemIDplus,ChemIDplus_tree,3091656,324487,Veterinary Drug,3093796,node_1119,node_1110,1,TRUE
92,IUPHAR/BPS Guide to PHARMACOLOGY,Target Classification,3361437,6414,SLC47 family of multidrug and toxin extrusion transporters,3361661,node_776,node_690,4,TRUE
96,KEGG,br08330,3439111,4620,DG01504 Nonsteroidal anti-inflammatory drug (NSAID),3616679,node_8670,node_8364,202,TRUE
96,KEGG,br08330,3439111,4620,DG01715 Drugs for nicotine dependence,3445739,node_9432,node_9431,4,TRUE
96,KEGG,br08330,3439111,4620,DG01716 Drugs for alcohol dependence,3445745,node_9440,node_9431,11,TRUE
96,KEGG,br08330,3439111,4620,DG01717 Drugs for opioid dependence,3445755,node_9457,node_9431,16,TRUE
96,KEGG,br08330,3439111,4620,DG01718 Drugs for addictive disorder,3445738,node_9431,node_9061,31,TRUE
96,KEGG,br08330,3439111,4620,"DG01898 Anti-inflammatory drug, phenylacetic acid derivatives",3616964,node_9034,node_8989,19,TRUE
96,KEGG,br08330,3439111,4620,"DG01899 Anti-inflammatory drug, indoleacetic acid derivatives",3616229,node_9013,node_8989,9,TRUE
96,KEGG,br08330,3439111,4620,"DG01906 Anti-inflammatory drug, acetic acid derivatives",3616409,node_8734,node_8670,57,TRUE
96,KEGG,br08330,3439111,4620,"DG01906 Anti-inflammatory drug, acetic acid derivatives",3617072,node_8989,node_8364,57,TRUE
96,KEGG,br08330,3439111,4620,"DG01907 Anti-inflammatory drug, coxibs",3616785,node_8538,node_8532,13,TRUE
96,KEGG,br08330,3439111,4620,"DG01908 Anti-inflammatory drug, propionic acid derivatives",3616604,node_8610,node_8364,51,TRUE
96,KEGG,br08330,3439111,4620,"DG01908 Anti-inflammatory drug, propionic acid derivatives",3616867,node_8846,node_8670,51,TRUE
96,KEGG,br08330,3439111,4620,"DG01909 Anti-inflammatory drug, salicylic acid derivatives",3616151,node_8675,node_8670,40,TRUE
96,KEGG,br08330,3439111,4620,"DG01909 Anti-inflammatory drug, salicylic acid derivatives",3616746,node_8920,node_8364,40,TRUE
96,KEGG,br08330,3439111,4620,"DG01910 Anti-inflammatory drug, oxicams",3616586,node_8827,node_8670,13,TRUE
96,KEGG,br08330,3439111,4620,"DG01910 Anti-inflammatory drug, oxicams",3616841,node_8966,node_8364,13,TRUE
96,KEGG,br08330,3439111,4620,"DG01911 Anti-inflammatory drug, fenamic acid derivatives",3616182,node_8721,node_8670,10,TRUE
96,KEGG,br08330,3439111,4620,"DG01911 Anti-inflammatory drug, fenamic acid derivatives",3616563,node_8597,node_8364,10,TRUE
96,KEGG,br08330,3439111,4620,"DG01947 Anti-inflammatory drug, pyrazolone",3616330,node_8588,node_8364,7,TRUE
96,KEGG,br08330,3439111,4620,"DG01949 Anti-inflammatory drug, phenylbutazones",3616947,node_8906,node_8670,11,TRUE
96,KEGG,br08330,3439111,4620,"DG01981 Anti-inflammatory drug, anilide derivatives",3616868,node_8981,node_8364,6,TRUE
96,KEGG,br08330,3439111,4620,DG01985 Disease modifying anti-rheumatic drugs (DMARDs),3445500,node_8559,node_8364,19,TRUE
99,EPA Chemical and Products Database (CPDat),cpdat_tree,3739864,23284,Drug,3741023,node_1159,node_1154,7330,TRUE
99,EPA Chemical and Products Database (CPDat),cpdat_tree,3739864,23284,Drug,3742450,node_2580,node_2560,729,TRUE
99,EPA Chemical and Products Database (CPDat),cpdat_tree,3739864,23284,Drug,3750409,node_1201,node_1193,1546,TRUE
99,EPA Chemical and Products Database (CPDat),cpdat_tree,3739864,23284,Drugbank,3741057,node_1193,node_851,1556,TRUE
101,NORMAN Suspect List Exchange,norman_sle_tree,3981444,132904,Animal Drugs Approved in Taiwan,4112126,node_807,node_806,187,TRUE
101,NORMAN Suspect List Exchange,norman_sle_tree,3981444,132904,Illicit drugs and related compounds,4041200,node_626,node_563,4,TRUE
101,NORMAN Suspect List Exchange,norman_sle_tree,3981444,132904,Pharmaceuticals,4041235,node_563,node_483,136,TRUE
101,NORMAN Suspect List Exchange,norman_sle_tree,3981444,132904,Pharmaceuticals,4112117,node_806,node_805,1068,TRUE
101,NORMAN Suspect List Exchange,norman_sle_tree,3981444,132904,S10 | SWISSPHARMA | Pharmaceutical List with Consumption Data,4041177,node_470,root,995,TRUE
101,NORMAN Suspect List Exchange,norman_sle_tree,3981444,132904,S55 | ZINC15PHARMA | Pharmaceuticals from ZINC15,4041062,node_438,root,8322,TRUE
101,NORMAN Suspect List Exchange,norman_sle_tree,3981444,132904,S56 | UOATARGPHARMA | Target Pharmaceutical/Drug List from University of Athens,4041217,node_475,root,180,TRUE
101,NORMAN Suspect List Exchange,norman_sle_tree,3981444,132904,"S57 | GREEKPHARMA | Suspect Pharmaceuticals from the National Organization of Medicine, Greece",4041094,node_446,root,262,TRUE
101,NORMAN Suspect List Exchange,norman_sle_tree,3981444,132904,S72 | NTUPHTW | Pharmaceutically Active Substances from National Taiwan University,4112125,node_805,root,1068,TRUE
101,NORMAN Suspect List Exchange,norman_sle_tree,3981444,132904,S72 | NTUPHTW | Pharmaceutically Active Substances from National Taiwan University,4112144,node_840,root,1065,TRUE
102,Drug Enforcement Administration (DEA),dea_tree,4025044,670,DEA Drugs,4025045,node_1,root,45,TRUE
102,Drug Enforcement Administration (DEA),dea_tree,4025044,670,Designer Drugs,4025050,node_4,node_1,3,TRUE
