"hid","SourceName","SourceID","HNID","nCIDs","nodeNames","nodeHNID","nodeIDs","parentIDs","node_nCIDs","includeNode"
14,"KEGG","br08301",2334510,1502,"115 Stimulants",2334835,"node_2656","node_2638",1,TRUE
14,"KEGG","br08301",2334510,1502,"221 Respiratory stimulants",2336311,"node_944","node_870",5,TRUE
79,"WHO ATC","ATCTree",1949731,16452,"C01C - Cardiac stimulants excl. cardiac glycosides",1950839,"node_1162","node_1106",179,TRUE
79,"WHO ATC","ATCTree",1949731,16452,"G03G - Gonadotropins and other ovulation stimulants",1952260,"node_2627","node_2489",14,TRUE
79,"WHO ATC","ATCTree",1949731,16452,"L03 - Immunostimulants",1953324,"node_3803","node_3500",65,TRUE
79,"WHO ATC","ATCTree",1949731,16452,"L03A - Immunostimulants",1953325,"node_3804","node_3803",65,TRUE
79,"WHO ATC","ATCTree",1949731,16452,"N06B - Psychostimulants, agents used for adhd and nootropics",1954283,"node_4820","node_4749",130,TRUE
84,"ChemIDplus","ChemIDplus_tree",3091656,324487,"Appetite Stimulants",3091975,"node_281","node_11",2,TRUE
84,"ChemIDplus","ChemIDplus_tree",3091656,324487,"Central Nervous System Stimulants",3092131,"node_364","node_323",70,TRUE
84,"ChemIDplus","ChemIDplus_tree",3091656,324487,"Ganglionic Stimulants",3092380,"node_578","node_565",5,TRUE
101,"NORMAN Suspect List Exchange","norman_sle_tree",3981444,132904,"S58 | PSYCHOCANNAB | Synthetic Cannabinoids and Psychoactive Compounds",4041151,"node_463","root",525,TRUE
101,"NORMAN Suspect List Exchange","norman_sle_tree",3981444,132904,"Stimulants",4041058,"node_555","node_554",5,TRUE
102,"Drug Enforcement Administration (DEA)","dea_tree",4025044,670,"Stimulants",4025054,"node_8","node_1",15,TRUE
