Code,Structure Category Name ,Note
100,perfluoroalkyl carbonyl compounds,CnF2n+1-C(=O)-R
101,perfluoroalkyl carbonyl halides,R = F/Cl/Br/I
102,"perfluoroalkyl carboxylic acids (PFCAs), their salts and esters","R = OH, ONa, OCH3, etc."
103,other perfluoroalkyl carbonyl-based nonpolymers,to be refined
103.01,perfluoroalkyl carbonyl amides / amido ethanols and other alcohols,"R = NH2, NH(OH), etc."
103.02,perfluoroalkyl carbonyl silanes ,Si
103.03,perfluoroalkyl carbonyl (meth)acrylate,R = R'-OC(O)CH=CH2
104,other perfluoroalkyl carbonyl-based side-chain fluorinated polymers,to be refined
104.01,perfluoroalkyl carbonyl (meth)acrylate polymers,NULL
105,perfluoroalkyl dicarbonyl halides,F/Cl/Br/I-C(=O)-(CF2)n-C(=O)-F/Cl/Br/I
106,perfluoroalkyl dicarboxylic acids and other non-polymers,HOOC-(CF2)n-COOH
107,1-H perfluoroalkyl carbonyl halides,H(CF2)nC(=O)-F/Cl/Br/I
108,1-H perfluoroalkyl carboxylic acids ,H(CF2)nCOOH
109,1-H perfluoroalkyl carbonyl-based non-polymers,H-(CF2CF2)n-C(=O)-R
200,perfluoroalkane sulfonyl compounds ,CnF2n+1-S(=O)(=O)-R
201,perfluoroalkane sulfonyl halides,R = F/Cl/Br/I
202,"perfluoroalkane sulfonic acids (PFSAs), their salts and esters","R = OH, ONa, OCH3, etc."
203,perfluoroalkane sulfonyl-based nonpolymers,
203.01,perfluoroalkane sulfonyl amides/amido ethanols (xFASA/Es) and other alcohols,"R = NH2, N(H)CH2CH2OH, etc."
203.02,"perfluoroalkane sulfonyl amido ethanols, phosphate esters (SAmPAPs)","R = N(H)CH2CH2O-PO3H2, etc."
203.03,perfluoroalkane sulfonyl (meth)acrylates,NULL
203.04,perfluoroalkane sulfonyl silanes,Si
203.05,perfluoroalkane sulfonyl acetic acids & esters,NULL
204,perfluoroalkane sulfonyl-based side-chain fluorinated polymers,to be refined
204.01,perfluoroalkane sulfonyl (meth)acrylate polymers,C=C-C(=O)-O-R
204.02,perfluoroalkane sulfonyl urethane polymers,R-O-C(=O)-N(R)-R
204.03,perfluoroalkane sulfonyl siloxanes/silicon polymers,Si
205,perfluoroalkane sulfinic acids ,CnF2n+1-SO2H
206,1-H perfluoroalkane sulfonic acids,H-(CF2CF2)n-SO3H
207,1-H perfluoroalkane sulfonyl-based non-polymers,H-(CF2CF2)n-SO2-R
208,perfluoroalkane disulfonic acids,NULL
209,perfluoroalkane disulfonyl-based non-polymers,NULL
300,perfluoroalkyl phosphate compounds,CnF2n+1-P(O)-R
301,perfluoroalkyl phosphate-related halides,to be refined
301.01,bis(perfluoroalkyl) phosphinyl halides,CnF2n+1-P(=O)(CmF2m+1)-F/Cl/Br/I
301.02,perfluoroalkyl phosphorus halides,CnF2n+1-P-F/Cl/Br/I
302,"perfluoroalkyl phosphonic acids (PFPAs), their salts and esters",R = (OH)2
303,"perfluoroalkyl phosphinic acids (PFPiAs), their salts and esters",CnF2n+1-P(=O)(CmF2m+1)-OH
304,bis(perfluoroalkyl) phosphinyl-based nonpolymers,to be refined
304.01,bis(perfluoroalkyl) phosphinyl amids (PFPiAMs),
400,fluorotelomer-related compounds,
401,perfluoroalkyl iodides (PFAIs),CnF2n+1-I
402,n:2 fluorotelomer-based non-polymers,"CnF2n+1-C2H4-R, to be refined"
402.01,n:2 fluorotelomer iodides (n:2 FTIs),R = I
402.02,n:2 fluorotelomer olefins (n:2 FTOs),CnF2n+1-CH=CH2
402.03,n:2 fluorotelomer alcohols (n:2 FTOHs) / thiols,"R = OH, SH"
402.04,"n:2 fluorotelomer alcohol, phosphate esters (PAPs)","R = O-PO3H2, etc."
402.05,n:2 fluorotelomer-based silanes,Si
402.06,n:2 fluorotelomer-based (meth)acrylate,CnF2n+1-CH2CH2-OC(=O)CH=CH2
402.07,n:2 fluorotelomer sulfonic acids (n:2 FTSAs),R = SO3H
402.08,n:2 fluorotelomer sulfonyl-based compounds,R = SO2-R'
402.09,n:2 fluorotelomer phosphonic / phosphinic acids ,R = P(=O)(OH)2
402.1,n:2 FTOH ethoxylates,CnF2n+1(CmF2m+1O)xH
402.11,"n:2 FT amine, amino & derivatives",CnF2n+1-C2H4-N-R
402.12,n:2 FT-thiol derivatives,CnF2n+1-C2H4-S-R
402.5,n:2 fluorotelomer carboxylic acids (FTCAs),CnF2n+1-CH2COOH; degradation products
402.51,n:3 acids,CnF2n+1-CH2CH2COOH; degradation products
402.52,FTAL ,CnF2n+1-CH2CHO; degradation products
403,n:2 fluorotelomer-based side-chain fluorinated polymers,
403.01,n:2 fluorotelomer-based (meth)acrylate polymers,C=C-C(=O)-O-R
403.02,n:2 fluorotelomer-based urethane polymers,R-O-C(=O)-N(R)-R
403.03,n:2 fluorotelomer-based siloxanes/silicon polymers,Si
403.04,n:2 fluorotelomer-based sulfonyl (meth)acrylate polymers,NULL
404,n:1 fluorotelomer-based non-polymers,CnF2n+1-CH2-R
404.01,n:1 fluorotelomer alcohols,R = OH
404.02,n:1 FT (meth)acrylate,CH2-OC(=O)CH=CH2
404.03,n:1 PAPs,NULL
404.04,n:1 silanes ,NULL
404.05,n:1 FT sulfonyl-based substances,CnF2n+1-CH2-SO2-R
404.51,n:1 FTAL,CnF2n+1-CHO
405,n:1 fluorotelomer-based side-chain fluorinated polymers,
405.01,n:1 fluorotelomer-based (meth)acrylic polymers,NULL
406,fluorotelomer epoxides and derivatives,
406.01,fluorotelomer epoxides,CnF2n+1I + CH2=CHCH2OH --> CnF2n+1-CH2CH(I)CH2OH --> CnF2n+1-CH2(CHCH2O)
406.02,fluorotelomer epoxides derivatives,NULL
407,Hydrofluorotelomer non-polymers,CnF2n+1CH2CmF2m+1-R
408,hydrofluorotelomer-based side chain fluorinated polymers,CnF2n+1-CmH2m+1-CxF2x+1-C2H4-R
409,perfluoroalkyl diiodides,NULL
410,1-H n:1 FT,H-(CF2CF2)n-CH2-R
500,per- and polyfluoroalkyl ether-based compounds,CnF2n+1-O-CmF2m+1-R
501,perfluoroalkyl ethers / alkanes + aromatics,
501.01,perfluoroalkyl ethers / alkanes + aromatics - monoethers,
501.02,perfluoroalkyl ethers / alkanes + aromatics - diethers,
501.03,perfluoroalkyl ethers / alkanes + aromatics - triethers,
501.04,perfluoroalkyl ethers / alkanes + aromatics - 4-10 ether linkages,
501.05,perfluoroalkyl ethers / alkanes + aromatics - more than 10 ether linkages,
502,"per- and polyfluoroalkyl ether carboxylic acids (PFECAs), their salts and esters, as well as derivatives such as amides",CnF2n+1-O-CmF2m+1-COOH
502.01,"PFECAs, salts and esters - monoethers",
502.02,"PFECAs, salts and esters - diethers",
502.03,"PFECAs, salts and esters - triethers",
502.04,"PFECAs, salts and esters - 4-10 ether linkages",
502.05,"PFECAs, salts and esters - more than 10 ether linkages",
502.51,PFECA-related substances - monoethers,NULL
502.52,PFECA-related substances - diethers,NULL
502.53,PFECA-related substances - triethers,NULL
502.54,PFECA-related substances - 4-10 ether linkages,NULL
502.55,PFECA-related substances - more than 10 ether linkages,NULL
503,"per- and polyfluoroalkyl ether sulfonic acids (PFESAs), their salts and esters, as well as derivatives",CnF2n+1-O-CmF2m+1-SO3H
503.01,"PFESAs, salts and esters - monoethers",
503.02,"PFESAs, salts and esters - diethers",
503.03,"PFESAs, salts and esters - triethers",
503.04,"PFESAs, salts and esters - 4-10 ether linkages",
503.05,"PFESAs, salts and esters - more than 10 ether linkages",
503.51,PFESA-related substances - monoethers,NULL
503.52,PFESA-related substances - diethers,NULL
503.53,PFESA-related substances - triethers,NULL
503.54,PFESA-related substances - 4-10 ether linkages,NULL
503.55,PFESA-related substances - more than 10 ether linkages,NULL
504,perfluoroethers alkenes and derivatives,R = Cl/Br/I
504.01,perfluoroethers alkenes and derivatives - monoethers,
504.02,perfluoroethers alkenes and derivatives - diethers,
504.03,perfluoroethers alkenes and derivatives - triethers,
504.04,perfluoroethers alkenes and derivatives - 4-10 ether linkages,
504.05,perfluoroethers alkenes and derivatives - more than 10 ether linkages,
505,per- and polyfluoroalkyl ether halides (except F),R = Cl/Br/I
505.01,per- and polyfluoroalkyl ether halides (except F) - monoethers,
505.02,per- and polyfluoroalkyl ether halides (except F) - diethers,
505.03,per- and polyfluoroalkyl ether halides (except F) - triethers,
505.04,per- and polyfluoroalkyl ether halides (except F) - 4-10 ether linkages,
505.05,per- and polyfluoroalkyl ether halides (except F) - more than 10 ether linkages,
506,per - and polyfluoroalkyl ether + telomer-based substances,CnF2n+1-O-CmF2m+1-C2H4/CH2-R
506.01,per - and polyfluoroalkyl ether + telomer-based substances - monoethers,
506.02,per - and polyfluoroalkyl ether + telomer-based substances - diethers,
506.03,per - and polyfluoroalkyl ether + telomer-based substances - triethers,
506.04,per - and polyfluoroalkyl ether + telomer-based substances - 4-10 ether linkages,
506.05,per - and polyfluoroalkyl ether + telomer-based substances - more than 10 ether linkages,
507,other per- and polyfluoroalkyl ether-based compounds,"R = OH, etc."
507.01,other per- and polyfluoroalkyl ether-based compounds - monoethers,
507.02,other per- and polyfluoroalkyl ether-based compounds - diethers,
507.03,other per- and polyfluoroalkyl ether-based compounds - triethers,
507.04,other per- and polyfluoroalkyl ether-based compounds - 4-10 ether linkages,
507.05,other per- and polyfluoroalkyl ether-based compounds - more than 10 ether linkages,
600,other PFAA precursors and related compounds - perfluoroalkyl ones,NULL
601,perfluoroalkyl silanes,NULL
602,perfluoroalkyl alcohols,CnF2n+1-OH
603,perfluoroalkyl alcohol-based side-chain fluorinated polymers,NULL
604,perfluoroalkanes & armoatics,CnF2n+1
605,perfluoroalkenes & derivatives,CnF2n
606,perfluoroalkyl amines,(CnF2n+1)x-N
607,perfluoroalkyl epoxides & derivatives,CnF2n+1-epoxides
608,perfluoroalkyl ketons,CnF2n+1C(=O)CmF2m+1
609,perfluoaoalkyl halides (other than iodides),NULL
610,perfluoroalkyl radicals,NULL
611,perfluoroalkyl cyanide,CnF2n+1CN
612,perfluoroalkyl metal,CnF2n+1-Metal
613,perfluoroalkyl thiol and derivatives,CnF2n+1-SH & CnF2n+1-S-R'
614,perfluoroalkyl sulfide,CnF2n+1-S
700,other PFAA precursors or related compounds - semifluorinated,
701,"hydrofluorocarbons (HFCs), semifluorinated alkanes (SFAs) and their derivatives",CnF2n+1-CmH2m+1
701.1,HFCs and derivatives,n < = 3 (for SFA-type one) or non-SFA-type HFCs
701.2,SFAs and derivatives,n > = 4
702,hydrofluoroethers (HFEs) and derivatives,CnF2n+1-O-CmH2m+1-R
702.1,HFEs,
702.2,HFE-based silanes ,
702.3,other HFE-based derivatives,NULL
703,hydrofluoroolefins (HFOs),CnF2n+1-CH=CH2
704,semi-fluorinated ketons,CnF2n+1-C(=O)-CmH2m+1
705,side-chain fluorinated aromatics,"CnF2n+1-C6H5, etc."
800,fluoropolymers,to be refined
801,polytetrafluoroethylene (PTFE),R-(CF2CF2)n-R'
801.1,non-functionalized PTFE,
801.2,functionalized PTFE,
802,polyvinylidene fluoride (PVDF),R-(CH2CF2)n-R'
802.1,non-functionalized PVDF,
802.2,functionalized PVDF,
803,fluorinated ethylene propylene (FEP),R-(CF2CF2)n-(CF2-CF(CF3))m-R
804,perfluoralkoxyl polymer (PFA),R-(CF2CF2)n-(CF2-CF(OCF3))m-R
805,polyvinyl fluoride (PVF),R-(CH2-CHF)n-R
806,Ethylene tetrafluoroethylene (ETFE),R-(CH2CH2CF2CF2)n-R'
807,VDF-HFP,NULL
808,PCTFE,NULL
809,THV,NULL
810,oxetane polymer,NULL
