"hid","SourceName","SourceID","HNID","nCIDs","nodeNames","nodeHNID","nodeIDs","parentIDs","node_nCIDs","includeNode"
72,"PubChem","Compound TOC",1749165,49517422,"EI-MS",1856988,"node_296","node_294",1053,TRUE
72,"PubChem","Compound TOC",1749165,49517422,"GC-MS",1856940,"node_295","node_294",238248,TRUE
72,"PubChem","Compound TOC",1749165,49517422,"LC-MS",3857761,"node_298","node_294",17112,TRUE
72,"PubChem","Compound TOC",1749165,49517422,"Mass Spectrometry",1857112,"node_294","node_277",256381,TRUE
72,"PubChem","Compound TOC",1749165,49517422,"MassBank of North America (MoNA)",3395385,"node_221","node_178",26288,TRUE
72,"PubChem","Compound TOC",1749165,49517422,"MS-MS",1857020,"node_297","node_294",7838,TRUE
72,"PubChem","Compound TOC",1749165,49517422,"NIST Mass Spectrometry Data Center",3857764,"node_241","node_178",262555,TRUE
72,"PubChem","Compound TOC",1749165,49517422,"Other MS",3857762,"node_299","node_294",4117,TRUE
101,"NORMAN Suspect List Exchange","norman_sle_tree",3981444,132904,"S01 | MASSBANK | NORMAN Compounds in MassBank EU",4041250,"node_482","root",7575,TRUE
101,"NORMAN Suspect List Exchange","norman_sle_tree",3981444,132904,"S06 | ITNANTIBIOTIC | Antibiotic List from the ITN MSCA ANSWER",4041013,"node_424","root",676,TRUE
101,"NORMAN Suspect List Exchange","norman_sle_tree",3981444,132904,"S19 | MZCLOUD | mzCloud Compounds",4041256,"node_701","root",8717,TRUE
101,"NORMAN Suspect List Exchange","norman_sle_tree",3981444,132904,"S31 | WRTMSD | Wiley Registry of Tandem Mass Spectral Data, MSforID",4041099,"node_447","root",1427,TRUE
101,"NORMAN Suspect List Exchange","norman_sle_tree",3981444,132904,"S46 | PFASNTREV19 | List of PFAS reported in Non-Target HRMS Studies from Liu et al 2019",4041209,"node_474","root",680,TRUE
101,"NORMAN Suspect List Exchange","norman_sle_tree",3981444,132904,"S51 | WRIGCHRMS | Reference Standards for GC-HRMS from WRI",4040985,"node_419","root",822,TRUE
101,"NORMAN Suspect List Exchange","norman_sle_tree",3981444,132904,"S65 | UATHTARGETSGC | University of Athens GC-HRMS Target List",4041090,"node_445","root",321,TRUE
101,"NORMAN Suspect List Exchange","norman_sle_tree",3981444,132904,"S70 | EISUSGCEIMS | Environmental Institute GC-EI-MS suspect list",4112140,"node_816","root",3232,TRUE
