Predecessor_CID,Predecessor_Name,Predecessor_InChIKey,Successor_CID,Successor_Name,Successor_InChIKey,Transformation,Biosystem,Enzyme,Source_ID,Source,Source_Description,Dataset_DOI,Dataset_Description,Evidence_ID,Evidence_Description
102526,2-(4-Hydroxyphenyl)propanoic acid,ZHMMPVANGNPCBW-UHFFFAOYSA-N,,,,"Reduction of alpha,beta unsaturated carbon-carbon double bond adjacent to an electron withdrawing group / Human Gut Microbial",Gut microbial environment,EC 1.6.99.1,BIOTID02174,MetXBioDB,MetXBioDB is a biotransformation database used to improve the knowledge- and machine learning-based systems in BioTransformer (http://biotransformer.ca/),10.5281/zenodo.4056560,S73 | METXBIODB | Metabolite Reaction Database from BioTransformer,10.1186/s13321-018-0324-5,"Joannou, G.E. et al., J. Steroid Biochem. Mol. Biol., 54, 167-184, 1995|Coldham, N.G. et al., Xenobiotica, 32, 45-62, 2002."
3698,Amrinone,RNLQIBCLLYYYFJ-UHFFFAOYSA-N,,,,Glucuronidation of primary aromatic amine / Human Phase II,Human,UGT,BIOTID01736,MetXBioDB,MetXBioDB is a biotransformation database used to improve the knowledge- and machine learning-based systems in BioTransformer (http://biotransformer.ca/),10.5281/zenodo.4056560,S73 | METXBIODB | Metabolite Reaction Database from BioTransformer,10.1186/s13321-018-0324-5,https://www.drugbank.ca/drugs/DB01427
10435492,P-Hydroxynefazodone,XGIODORTBODPTQ-UHFFFAOYSA-N,0,"1-(3-chloro-4-oxocyclohexa-2,5-dien-1-ylidene)-4-{3-[3-ethyl-5-oxo-4-(2-phenoxyethyl)-4,5-dihydro-1H-1,2,4-triazol-1-yl]propyl}-1lambda5-piperazin-1-ylium",UMYTXCCAWDJHPP-UHFFFAOYSA-N,2 electron oxidation of p-aminophenols to quinone imines (pattern 1) / Human Phase I,Human,CYP3A4,BIOTID01316,MetXBioDB,MetXBioDB is a biotransformation database used to improve the knowledge- and machine learning-based systems in BioTransformer (http://biotransformer.ca/),10.5281/zenodo.4056560,S73 | METXBIODB | Metabolite Reaction Database from BioTransformer,10.1186/s13321-018-0324-5,"Bolleddula, J. et al. (2014); Biotransformation and bioactivation reactions of alicyclic amines in drug molecules, Drug Metabolism Reviews, 46:3, 379-419, DOI:10.3109/03602532.2014.924962."
135398744,sildenafil,BNRNXUUZRGQAQC-UHFFFAOYSA-N,136622597,N-Desmethyl sildenafil,VACAHCFUDUBDNR-UHFFFAOYSA-N,N-dealkylation of sulfonamide / Human Phase I,Human,CYP3A4; CYP2C9; CYP2C19; CYP2D6,BIOTID00946,MetXBioDB,MetXBioDB is a biotransformation database used to improve the knowledge- and machine learning-based systems in BioTransformer (http://biotransformer.ca/),10.5281/zenodo.4056560,S73 | METXBIODB | Metabolite Reaction Database from BioTransformer,10.1186/s13321-018-0324-5,"Zhou, S.F. et al. (2009); Substrates, Inducers, Inhibitors and Structure-Activity Relationships of Human Cytochrome P450 2C9 and Implications in Drug Development; Current Medicinal Chemistry, 2009, 16, 3480-3675"
9797370,JNJ-10198409,ZDNURMVOKAERHZ-UHFFFAOYSA-N,154699801,JNJ-10198409 N-glucuronide C,MRWZWFDJHGQBAU-UHFFFAOYSA-O,N-glucuronidation of azole / Human Phase II,Human,UGT,BIOTID01685,MetXBioDB,MetXBioDB is a biotransformation database used to improve the knowledge- and machine learning-based systems in BioTransformer (http://biotransformer.ca/),10.5281/zenodo.4056560,S73 | METXBIODB | Metabolite Reaction Database from BioTransformer,10.1186/s13321-018-0324-5,"Kaivosaari, S. et al. (2011); N-glucuronidation of drugs and other xenobiotics by human and animal UDP-glucuronosyltransferases.; Xenobiotica. 2011 Aug;41(8):652-69. DOI:10.3109/00498254.2011.563327"
