Mass_difference,Count,Reaction,Formula_gained,Formula_lost,SMARTS
15.9949,965,"Oxidation, epoxidation, hydroxylation",O1,,
176.0321,420,Glucuronidation,C6O6H8,,OC4[C@@H]([C@H]([C@@H]([C@H](O4)C(=O)O)O)O)O
-14.0157,369,Demethylation,,CH2,
-28.0313,117,"Desethylation, didemethylation, dealkylation",,C2H4,
79.9568,85,Sulfonation,SO3,,S(=O)(=O)O
-2.0157,45,Dehydrogenation,,H2,
-42.047,42,"Deisopropylation, depropylation, dealkylation",,C3H6,
31.9898,37,(Di)hydroxylation,O2,,
42.0106,37,Acetylation,C2H2O,,CC(=O)
29.9742,35,"Methyl carboxylation, other oxidation",O2,H2,C(=O)O
18.0106,30,"Oxidation, epoxidation, hydroxylation",H2O,,
13.9793,27,"Oxidation, epoxidation",O1,H2,
-15.9949,24,"Dehydroxylation, reduction",,O1,
-17.9661,24,"Dehalogenation, dechlorination",OH,Cl,
177.0399,23,Glucuronidation,C6O6H9,,OC4[C@@H]([C@H]([C@@H]([C@H](O4)C(=O)O)O)O)O
2.0157,23,"Reduction, hydrogenation",H2,,
-58.0055,23,"Hydrolysis, loss of acetic acid, loss of methylester",,C2H2O2,"CC(=O)[OH], C(=O)OC"
0,21,"Rearrangements, ring forming/breaking",,,
-56.0626,20,Dealkylation,,C4H8,
-15.9772,18,Desulfuration,O1,S1,
34.0055,16,"Hydroxylation, epoxidation",H2O2,,
-12,14,Demethylenation (ring opening),,C1,
1.9793,12,Demethylation+hydroxylation (on same or differing sites),O,CH2,
-42.0106,12,"Hydrolysis, deacetylation",,C2H2O,
45.9958,12,"ESA, dechlorination+sulfonation",SO3H,Cl,
-38.0157,11,"Dealkyneation, dealkylation+aromatic ring opening",,C3H2,
-29.9928,11,Hydroxylation of thiomethyl,O,SCH2,
-71.0371,11,"Loss of N,N-dimethylformamide",,C3H5NO,CN(C)C(=O)
-3.9868,11,"OXA, dechlorination+carboxylation",HCl,O2,
-44.0262,10,"Dealkoxylation, dehydroxyethylation",,CH2O,
-29.9742,10,Reduction of nitro to amide,O2,H2,
-12.0364,10,Dealkylation+hydroxylation,C2H4,O,
179.1715,9,"GSH-conjugation of organoiodide, glutathione conjugation of organoiodide",C10H16N3O6S,I,SCC(C(=O)NCC(=O)O)NC(=O)CCC(C(=O)O)N
-72.0211,9,Ethyl formate loss,,C3H4O2,"C(=O)OCC, CCC(=O)O"
14.0157,9,Methylation,CH2,,
-99.0684,9,"Hydrolysis, cleavage",,C5H9NO,"C(=O)NCCCC, others"
-33.961,9,"Dechlorination, dehalogenation",H,Cl,
18.9946,9,Oxidation of cynao group,N,HO2,C#N>>C(=O)O
-76.0313,9,"Dephenylation, didealkynelatoin",,C6H4,c1ccccc1
307.0838,8,"GSH-conjugation, glutathione conjugation",C10H17N3O6S,,SCC(C(=O)NCC(=O)O)NC(=O)CCC(C(=O)O)N
-90.047,8,"Dealkylation, dearylation, debenzylation",,C7H6,c1ccccc1C
-45.9974,8,(Dechlorination+hydroxylation)+deethylation,O,C2H3Cl,
271.1071,7,"GSH-conjugation of organochloride, glutathione conjugation of organochloride",C10H16N3O6S,Cl,SCC(C(=O)NCC(=O)O)NC(=O)CCC(C(=O)O)N
-30.0106,7,Demethoxylation,,CH2O,
305.0682,7,"GSH-conjugation, glutathione conjugation",C10H15N3O6S,,SCC(C(=O)NCC(=O)O)NC(=O)CCC(C(=O)O)N
-83.0735,7,Hydroxylation+hydrolysis/ cleavage,O,C5H9NO,"C(=O)NCCCC, others"
-43.9898,7,Decarboxylation,,CO2,
-40.0313,7,"Descyclopropyl, dealkenation",,C3H4,
-181.0487,7,"Des(N-(4,6-Dimethoxypyrimidin-2-yl)formamide)",,C7H7N3O3,c1c(OC)nc(NC(=O)NS(=O)(=O))nc1(OC)>>[NH2]S(=O)(=O)
-61.9923,6,Dechloroethylation,,C2H4Cl,CCCl
57.0215,6,Glycination,C2H3NO,,C(=O)O>>C(=O)NCC(=O)[OH]
-15.0109,6,"Deamination, desamination",,NH,
0.984,6,Amide hydroxylation,O,NH,[NH2]>>[OH]
-147.8708,6,Dethiotrichloromethylation,H,SCCl3,NSC(Cl)(Cl)Cl>>N
15.9585,6,Demethylation+carboxylation,O2,CH4,
44.9851,6,Aromatic nitro addition,NO2,H,c1ccccc1>>c1ccccc1[N+](=O)[O-]
-70.0783,5,"Dealkylation, didealkylation",,C5H10,
-152.0061,5,"De(O,O-Diethyl thiophosphonate)",,C4H9O2PS,CCOP(=S)(OCC)O>>O
-164.0837,5,N-cleavage,,C10H12O2,c1cc(OC)c(OC)cc1CCN>>N (and others)
-58.0419,5,"N-dealkoxylation, O-dealkoxylation",,C3H6O,
-57.0215,5,Methylformamide loss,,C2H3NO,"C(=O)NC, others"
-166.0491,5,"N-(4-methoxy-6-methyl-1,3,5-triazin-2-yl)formamide loss",,C6H6N4O2,c1(OC)nc(C)nc(NC(=O)NS(=O)(=O))n1>>NS(=O)(=O)
-123.9748,5,"De(O,O-Dimethyl thiophosphonate)",,C2H5O2PS,"[O,S]P(OC)(OC)(=S)>>[O,S]"
