Name,Synonym,Molecular_Formula,Adduct,CCS_A2,PrecursorMz,PrecursorRT,CAS_RN,SMILES,PubChem_CID,Comment,Reference_ID
8:2 diPAP,"bis(1H,1H,2H,2H-perfluorodecyl)phosphate",C20H9F34O4P,[M-H]-,262.86,14.27,988.9623,114519-85-6,C(COP(=O)(O)OCCC(C(C(C(C(C(C(C(F)(F)F)(F)F)(F)F)(F)F)(F)F)(F)F)(F)F)(F)F)C(C(C(C(C(C(C(C(F)(F)F)(F)F)(F)F)(F)F)(F)F)(F)F)(F)F)(F)F,3022253,CCS Type: DT; Buffer gas: N2; Ionization: ESI-; Dataset: PFAS,DOI:10.1021/acs.est.2c00201
10:2 FTS,10:2 fluorotelomer sulfonic acid,C12H5F21SO3,[M-H]-,203.62,12.37,626.9551,120226-60-0,C(CS(=O)(=O)O)C(C(C(C(C(C(C(C(C(C(F)(F)F)(F)F)(F)F)(F)F)(F)F)(F)F)(F)F)(F)F)(F)F)(F)F,23136180,CCS Type: DT; Buffer gas: N2; Ionization: ESI-; Dataset: PFAS,DOI:10.1021/acs.est.2c00201
PFO2NA (dimer),"2,3,3,3-Tetrafluoro-2-(1,1,2,3,3,3-hexafluoro-2-(perfluoropropoxy)propoxy)propanoic acid",C18H2F34O8,[M-H]-,240.87,10.7,990.9128,13252-14-7,C(=O)(C(C(F)(F)F)(OC(C(C(F)(F)F)(OC(C(C(F)(F)F)(F)F)(F)F)F)(F)F)F)O,93076,CCS Type: DT; Buffer gas: N2; Ionization: ESI-; Dataset: PFAS,DOI:10.1021/acs.est.2c00201
TFMS(1),trifluoromethanesulfonic acid,CF3SO3H,[M-H]-,109.59,0.38,148.9526,1493-13-6,C(F)(F)(F)S(=O)(=O)O,62406,CCS Type: DT; Buffer gas: N2; Ionization: ESI-; Dataset: PFAS,DOI:10.1021/acs.est.2c00201
TFMS(2),trifluoromethanesulfonic acid,CF3SO3H,[M-H]-,111.32,0.38,148.9526,1493-13-6,C(F)(F)(F)S(=O)(=O)O,62406,CCS Type: DT; Buffer gas: N2; Ionization: ESI-; Dataset: PFAS,DOI:10.1021/acs.est.2c00201
NFDHA (dimer),"Perfluoro-3,6-dioxaheptanoic acid (3,6-OPFHpA)",C10H2F18O8,[M-H]-,195.5,6.49,590.9384,151772-58-6,C(=O)(C(OC(C(OC(F)(F)F)(F)F)(F)F)(F)F)O,2782393,CCS Type: DT; Buffer gas: N2; Ionization: ESI-; Dataset: PFAS,DOI:10.1021/acs.est.2c00201
MeFBSAA,(N-methyl)perfluorobutanesulfonomide,C7H6F9NO4S,[M-H]-,158.42,7.56,369.9801,159381-10-9,CN(CC(O)=O)S(=O)(=O)C(F)(F)C(F)(F)C(F)(F)C(F)(F)F,22286935,CCS Type: DT; Buffer gas: N2; Ionization: ESI-; Dataset: PFAS,DOI:10.1021/acs.est.2c00201
8Cl-PFOS,1-chloro-perfluorooctanesulfonic acid,C8HClF16O3S,[M-H]-,173.33,10.68,514.9007,1651215-26-7,C(C(C(C(C(F)(S(=O)(=O)O)Cl)(F)F)(F)F)(F)F)(C(C(C(F)(F)F)(F)F)(F)F)(F)F,87556140,CCS Type: DT; Buffer gas: N2; Ionization: ESI-; Dataset: PFAS,DOI:10.1021/acs.est.2c00201
PFODA,perfluorooctadecanoic acid,C18HF35O2,[M-H]-,243.5,14.29,912.9339,16517-11-6,C(=O)(C(C(C(C(C(C(C(C(C(C(C(C(C(C(C(C(C(F)(F)F)(F)F)(F)F)(F)F)(F)F)(F)F)(F)F)(F)F)(F)F)(F)F)(F)F)(F)F)(F)F)(F)F)(F)F)(F)F)(F)F)O,167547,CCS Type: DT; Buffer gas: N2; Ionization: ESI-; Dataset: PFAS,DOI:10.1021/acs.est.2c00201
EtFOSE,N-Ethyl-N-(2-hydroxyethyl)perfluorooctanesulfonamide,C12H10F17NO3S,[M-H]-,197.38,12.01,570.0037,1691-99-2,CCN(CCO)S(=O)(=O)C(C(C(C(C(C(C(C(F)(F)F)(F)F)(F)F)(F)F)(F)F)(F)F)(F)F)(F)F,74322,CCS Type: DT; Buffer gas: N2; Ionization: ESI-; Dataset: PFAS,DOI:10.1021/acs.est.2c00201
PFOS,perfluorooctanesulfonate,C8HF17O3S,[M-H]-,168.27,10.12,498.9302,1763-23-1,C(C(C(C(C(F)(F)S(=O)(=O)O)(F)F)(F)F)(F)F)(C(C(C(F)(F)F)(F)F)(F)F)(F)F,74483,CCS Type: DT; Buffer gas: N2; Ionization: ESI-; Dataset: PFAS,DOI:10.1021/acs.est.2c00201
FBSAA,2-(Perfluorobutanesulfonamido)acetic acid,C6H4F9NO4S,[M-H]-,147.21,6.86,355.9645,1910057-70-3,OC(=O)CNS(=O)(=O)C(F)(F)C(F)(F)C(F)(F)C(F)(F)F,10784527,CCS Type: DT; Buffer gas: N2; Ionization: ESI-; Dataset: PFAS,DOI:10.1021/acs.est.2c00201
PFUdA,perfluoroundecanoic acid,C11HF21O2,[M-H]-,182.86,11.77,562.9568,2058-94-8,C(=O)(C(C(C(C(C(C(C(C(C(C(F)(F)F)(F)F)(F)F)(F)F)(F)F)(F)F)(F)F)(F)F)(F)F)(F)F)O,77222,CCS Type: DT; Buffer gas: N2; Ionization: ESI-; Dataset: PFAS,DOI:10.1021/acs.est.2c00201
NMeFOSAA,N-methylperfluoro-1-octanesulfonamideoacetic acid,C11H6F17NO4S,[M-H]-,190.01,10.94,569.9673,2355-31-9,CN(CC(=O)O)S(=O)(=O)C(C(C(C(C(C(C(C(F)(F)F)(F)F)(F)F)(F)F)(F)F)(F)F)(F)F)(F)F,22286931,CCS Type: DT; Buffer gas: N2; Ionization: ESI-; Dataset: PFAS,DOI:10.1021/acs.est.2c00201
NMeFOSE,N-methylperfluorooctane sulfamidoethanol,C11H8F17NO3S,[M-H]-,193.03,12.92,555.9881,24448-09-7,CN(CCO)S(=O)(=O)C(C(C(C(C(C(C(C(F)(F)F)(F)F)(F)F)(F)F)(F)F)(F)F)(F)F)(F)F,90507,CCS Type: DT; Buffer gas: N2; Ionization: ESI-; Dataset: PFAS,DOI:10.1021/acs.est.2c00201
PFPeS,perfluoropentanesulfonate,C5HF11O3S,[M-H]-,142.2,7.03,348.9398,2706-91-4,C(C(C(F)(F)F)(F)F)(C(C(F)(F)S(=O)(=O)O)(F)F)(F)F,75922,CCS Type: DT; Buffer gas: N2; Ionization: ESI-; Dataset: PFAS,DOI:10.1021/acs.est.2c00201
6:2 FTS,6:2 fluorotelomer sulfonic acid,C8H5F13SO3,[M-H]-,168.13,9.31,426.9679,27619-97-2,C(CS(=O)(=O)O)C(C(C(C(C(C(F)(F)F)(F)F)(F)F)(F)F)(F)F)(F)F,119688,CCS Type: DT; Buffer gas: N2; Ionization: ESI-; Dataset: PFAS,DOI:10.1021/acs.est.2c00201
FOSAA,Perfluorooctane sulfonamidoacetic acid,C10H4F17NO4S,[M-H]-,181.66,10.51,555.9517,2806-24-8,C(C(=O)O)NS(=O)(=O)C(C(C(C(C(C(C(C(F)(F)F)(F)F)(F)F)(F)F)(F)F)(F)F)(F)F)(F)F,10507011,CCS Type: DT; Buffer gas: N2; Ionization: ESI-; Dataset: PFAS,DOI:10.1021/acs.est.2c00201
Nafion Byproduct 1,"Perfluoro-3,6-dioxa-4-methyl-7-octenesulfonic acid",C7HF13O5S,[M-H]-,156.2,9.06,442.9264,29311-67-9,C(=C(F)F)(OC(C(C(F)(F)F)(OC(C(F)(F)S(=O)(=O)O)(F)F)F)(F)F)F,61890,CCS Type: DT; Buffer gas: N2; Ionization: ESI-; Dataset: PFAS,DOI:10.1021/acs.est.2c00201
diSAmPAP,Bis(2-{ethyl[(heptadecafluorooctyl)sulfonyl]amino}ethyl) hydrogen phosphate,C24H19F34N2O8PS2,[M-H]-,307.21,14.74,1202.9705,2965-52-8,CCN(CCOP(=O)(O)OCCN(CC)S(=O)(=O)C(C(C(C(C(C(C(C(F)(F)F)(F)F)(F)F)(F)F)(F)F)(F)F)(F)F)(F)F)S(=O)(=O)C(C(C(C(C(C(C(C(F)(F)F)(F)F)(F)F)(F)F)(F)F)(F)F)(F)F)(F)F,102352,CCS Type: DT; Buffer gas: N2; Ionization: ESI-; Dataset: PFAS,DOI:10.1021/acs.est.2c00201
NEtFOSAA,N-ethylperfluoro-1-octanesulfonamideoacetic acid,C12H8F17NO4S,[M-H]-,197.2,11.79,583.983,2991-50-6,CCN(CC(=O)O)S(=O)(=O)C(C(C(C(C(C(C(C(F)(F)F)(F)F)(F)F)(F)F)(F)F)(F)F)(F)F)(F)F,18134,CCS Type: DT; Buffer gas: N2; Ionization: ESI-; Dataset: PFAS,DOI:10.1021/acs.est.2c00201
FBSA,perfluoro-1-butanesulfonamide,C4H2F9SO2N,[M-H]-,134.99,6.68,297.959,30334-69-1,C(C(C(F)(F)S(=O)(=O)N)(F)F)(C(F)(F)F)(F)F,10958205,CCS Type: DT; Buffer gas: N2; Ionization: ESI-; Dataset: PFAS,DOI:10.1021/acs.est.2c00201
PFDoA,perfluorododecanoic acid,C12HF23O2,[M-H]-,191.37,12.36,612.9537,307-55-1,C(=O)(C(C(C(C(C(C(C(C(C(C(C(F)(F)F)(F)F)(F)F)(F)F)(F)F)(F)F)(F)F)(F)F)(F)F)(F)F)(F)F)O,67545,CCS Type: DT; Buffer gas: N2; Ionization: ESI-; Dataset: PFAS,DOI:10.1021/acs.est.2c00201
NMeFOSA,N-methylperfluorooctanesulfonamide,C9H4F17NO2S,[M-H]-,169.15,11.86,511.9619,31506-32-8,CNS(=O)(=O)C(C(C(C(C(C(C(C(F)(F)F)(F)F)(F)F)(F)F)(F)F)(F)F)(F)F)(F)F,3034468,CCS Type: DT; Buffer gas: N2; Ionization: ESI-; Dataset: PFAS,DOI:10.1021/acs.est.2c00201
PFO3TrDA (dimer),"Perfluoro-3,6,9-trioxatridecanoic acid",C20H2F38O10,[M-H]-,257.43,11.78,1122.896,330562-41-9,C(=O)(C(OC(C(OC(C(OC(C(C(C(F)(F)F)(F)F)(F)F)(F)F)(F)F)(F)F)(F)F)(F)F)(F)F)O,2760333,CCS Type: DT; Buffer gas: N2; Ionization: ESI-; Dataset: PFAS,DOI:10.1021/acs.est.2c00201
PFECHS,perfluoro(perfluoroethyl)cyclohexanesulfonic acid,C8F15HO3S,[M-H]-,153.34,9.02,460.9334,335-24-0,C1(C(C(C(C(C1(F)F)(F)F)(F)S(=O)(=O)O)(F)F)(F)F)(C(C(F)(F)F)(F)F)F,101650,CCS Type: DT; Buffer gas: N2; Ionization: ESI-; Dataset: PFAS,DOI:10.1021/acs.est.2c00201
PFDA,perfluorodecanoic acid,C10HF19O2,[M-H]-,174.21,11.1,512.96,335-76-2,C(=O)(C(C(C(C(C(C(C(C(C(F)(F)F)(F)F)(F)F)(F)F)(F)F)(F)F)(F)F)(F)F)(F)F)O,9555,CCS Type: DT; Buffer gas: N2; Ionization: ESI-; Dataset: PFAS,DOI:10.1021/acs.est.2c00201
PFDS,perfluorodecanesulfonate,C10HF21O3S,[M-H]-,186.21,11.76,598.9238,335-77-3,C(C(C(C(C(C(F)(F)S(=O)(=O)O)(F)F)(F)F)(F)F)(F)F)(C(C(C(C(F)(F)F)(F)F)(F)F)(F)F)(F)F,67636,CCS Type: DT; Buffer gas: N2; Ionization: ESI-; Dataset: PFAS,DOI:10.1021/acs.est.2c00201
diPFHxA,Octafluoroadipic acid,C6H2F8O4,[M-H]-,130.67,0.37,288.9747,336-08-3,C(=O)(C(C(C(C(C(=O)O)(F)F)(F)F)(F)F)(F)F)O,67640,CCS Type: DT; Buffer gas: N2; Ionization: ESI-; Dataset: PFAS,DOI:10.1021/acs.est.2c00201
FBSE,2-(Perfluorobutanesulfonamido)ethanol,C6H6F9NO3S,[M-H]-,146.83,8.51,341.9852,34454-99-4,C(CO)NS(=O)(=O)C(C(C(C(F)(F)F)(F)F)(F)F)(F)F,12576037,CCS Type: DT; Buffer gas: N2; Ionization: ESI-; Dataset: PFAS,DOI:10.1021/acs.est.2c00201
FBSEE,"[N,N-bis(2-hydroxyethyl)]Perfluorobutanesulfonamide",C8H10F9NO4S,[M-H]-,163.84,8.78,386.0114,34455-00-0,C(CO)N(CCO)S(=O)(=O)C(C(C(C(F)(F)F)(F)F)(F)F)(F)F,118689,CCS Type: DT; Buffer gas: N2; Ionization: ESI-; Dataset: PFAS,DOI:10.1021/acs.est.2c00201
PFEtS,perfluoroethanesulfonic acid,C2HF5O3S,[M-H]-,117.4,1.3,198.9494,354-88-1,C(C(F)(F)S(=O)(=O)O)(F)(F)F,10219841,CCS Type: DT; Buffer gas: N2; Ionization: ESI-; Dataset: PFAS,DOI:10.1021/acs.est.2c00201
PFHxS,perfluorohexanesulfonate,C6HF13O3S,[M-H]-,150.51,8.38,398.9366,355-46-4,C(C(C(C(F)(F)S(=O)(=O)O)(F)F)(F)F)(C(C(F)(F)F)(F)F)(F)F,67734,CCS Type: DT; Buffer gas: N2; Ionization: ESI-; Dataset: PFAS,DOI:10.1021/acs.est.2c00201
"1H,1H,5H-Perfluoropentanol","2,2,3,3,4,4,5,5-octafluoro-1-pentanol",C5H4F8O,[M-H]-,124.5,4.8,231.0056,355-80-6,C(C(C(C(C(F)F)(F)F)(F)F)(F)F)O,9641,CCS Type: DT; Buffer gas: N2; Ionization: ESI-; Dataset: PFAS,DOI:10.1021/acs.est.2c00201
PFBS,perfluorobutanesulfonate,C4HF9O3S,[M-H]-,133.62,5.2,298.943,375-73-5,C(C(C(F)(F)S(=O)(=O)O)(F)F)(C(F)(F)F)(F)F,67815,CCS Type: DT; Buffer gas: N2; Ionization: ESI-; Dataset: PFAS,DOI:10.1021/acs.est.2c00201
PFHpS,perfluoroheptanesulfonate,C7HF15O3S,[M-H]-,159.24,9.2,448.9334,375-92-8,C(C(C(C(F)(F)F)(F)F)(F)F)(C(C(C(F)(F)S(=O)(=O)O)(F)F)(F)F)(F)F,67820,CCS Type: DT; Buffer gas: N2; Ionization: ESI-; Dataset: PFAS,DOI:10.1021/acs.est.2c00201
PFNA,perflurononanoic acid,C9HF17O2,[M-H]-,165.15,10.3,462.9632,375-95-1,C(=O)(C(C(C(C(C(C(C(C(F)(F)F)(F)F)(F)F)(F)F)(F)F)(F)F)(F)F)(F)F)O,67821,CCS Type: DT; Buffer gas: N2; Ionization: ESI-; Dataset: PFAS,DOI:10.1021/acs.est.2c00201
PFTeDA,perfluorotetradecanoic acid,C14HF27O2,[M-H]-,209.19,13.3,712.9473,376-06-7,C(=O)(C(C(C(C(C(C(C(C(C(C(C(C(C(F)(F)F)(F)F)(F)F)(F)F)(F)F)(F)F)(F)F)(F)F)(F)F)(F)F)(F)F)(F)F)(F)F)O,67822,CCS Type: DT; Buffer gas: N2; Ionization: ESI-; Dataset: PFAS,DOI:10.1021/acs.est.2c00201
5H-PFPeA,5H-perfluoropentanoic acid,C5H2F8O2,[M-H]-,142.99,1.19,244.9854,376-72-7,C(C(C(C(C(=O)O)(F)F)(F)F)(F)F)(F)F,120227,CCS Type: DT; Buffer gas: N2; Ionization: ESI-; Dataset: PFAS,DOI:10.1021/acs.est.2c00201
8:2 FTS,8:2 fluorotelomer sulfonic acid,C10H5F17SO3,[M-H]-,185.8,11.08,526.9615,39108-34-4,C(CS(=O)(=O)O)C(C(C(C(C(C(C(C(F)(F)F)(F)F)(F)F)(F)F)(F)F)(F)F)(F)F)(F)F,3016044,CCS Type: DT; Buffer gas: N2; Ionization: ESI-; Dataset: PFAS,DOI:10.1021/acs.est.2c00201
PFO3OA (dimer),"perfluoro(3,5,7-trioxaoctanoic) acid",C10H2F18O10,[M-H]-,198.95,6.95,622.9282,39492-89-2,C(=O)(C(OC(OC(OC(F)(F)F)(F)F)(F)F)(F)F)O,87185480,CCS Type: DT; Buffer gas: N2; Ionization: ESI-; Dataset: PFAS,DOI:10.1021/acs.est.2c00201
PFO4DA (dimer),"perfluoro(3,5,7,9-tetraoxadecanoic) acid",C12H2F22O12,[M-H]-,217.05,8.86,754.9117,39492-90-5,C(=O)(C(OC(OC(OC(OC(F)(F)F)(F)F)(F)F)(F)F)(F)F)O,57358057,CCS Type: DT; Buffer gas: N2; Ionization: ESI-; Dataset: PFAS,DOI:10.1021/acs.est.2c00201
PFO4DA,"Perfluoro(3,5,7,9-tetraoxadecanoic) acid",C6HF11O6,[M-H]-,146.66,6.68,376.9525,39492-90-5,C(=O)(C(OC(OC(OC(OC(F)(F)F)(F)F)(F)F)(F)F)(F)F)O,57358057,CCS Type: DT; Buffer gas: N2; Ionization: ESI-; Dataset: PFAS,DOI:10.1021/acs.est.2c00201
PFO5DoA (dimer),"perfluoro(3,5,7,9,11-pentaoxadodecanoic) acid",C14HF26O14,[M-H]-,233.35,10.15,886.8951,39492-91-6,C(=O)(C(OC(OC(OC(OC(OC(F)(F)F)(F)F)(F)F)(F)F)(F)F)(F)F)O,57358058,CCS Type: DT; Buffer gas: N2; Ionization: ESI-; Dataset: PFAS,DOI:10.1021/acs.est.2c00201
PFHxPA,Perfluorohexylphosphonic acid,C6H2F13O3P,[M-H]-,152.88,4.55,398.9461,40143-76-8,C(C(C(C(F)(F)P(=O)(O)O)(F)F)(F)F)(C(C(F)(F)F)(F)F)(F)F,15930820,CCS Type: DT; Buffer gas: N2; Ionization: ESI-; Dataset: PFAS,DOI:10.1021/acs.est.2c00201
6:6 PFPi,6:6 Perfluorophosphinic acid,C12HF26O2P,[M-H]-,195.4,12.28,700.9226,40143-77-9,C(C(C(C(F)(F)P(=O)(C(C(C(C(C(C(F)(F)F)(F)F)(F)F)(F)F)(F)F)(F)F)O)(F)F)(F)F)(C(C(F)(F)F)(F)F)(F)F,71363384,CCS Type: DT; Buffer gas: N2; Ionization: ESI-; Dataset: PFAS,DOI:10.1021/acs.est.2c00201
PFOPA,Perfluorooctyl phosphonic acid,C8H2F17O3P,[M-H]-,169.83,7.81,498.9397,40143-78-0,C(C(C(C(C(F)(F)P(=O)(O)O)(F)F)(F)F)(F)F)(C(C(C(F)(F)F)(F)F)(F)F)(F)F,13528037,CCS Type: DT; Buffer gas: N2; Ionization: ESI-; Dataset: PFAS,DOI:10.1021/acs.est.2c00201
8:8 PFPi,8:8 Perfluorophosphinic acid,C16HF34O2P,[M-H]-,233.99,14.13,900.9098,40143-79-1,C(C(C(C(C(F)(F)P(=O)(C(C(C(C(C(C(C(C(F)(F)F)(F)F)(F)F)(F)F)(F)F)(F)F)(F)F)(F)F)O)(F)F)(F)F)(F)F)(C(C(C(F)(F)F)(F)F)(F)F)(F)F,13528039,CCS Type: DT; Buffer gas: N2; Ionization: ESI-; Dataset: PFAS,DOI:10.1021/acs.est.2c00201
NEtFOSA,N-Ethylperfluorooctanesulfonamide,C10H6F17NO2S,[M-H]-,179.41,12.26,525.9775,4151-50-2,CCNS(=O)(=O)C(C(C(C(C(C(C(C(F)(F)F)(F)F)(F)F)(F)F)(F)F)(F)F)(F)F)(F)F,77797,CCS Type: DT; Buffer gas: N2; Ionization: ESI-; Dataset: PFAS,DOI:10.1021/acs.est.2c00201
FHxSA,perfluoro-1-hexanesulfonamide,C6H2F13SO2N,[M-H]-,151.96,9.78,397.9526,41997-13-1,C(C(C(C(F)(F)S(=O)(=O)N)(F)F)(F)F)(C(C(F)(F)F)(F)F)(F)F,11603678,CCS Type: DT; Buffer gas: N2; Ionization: ESI-; Dataset: PFAS,DOI:10.1021/acs.est.2c00201
PFPrA(2),Pentafluoropropionic acid,C3HF5O2,[M-H]-,115.1,0.82,162.9818,422-64-0,C(=O)(C(C(F)(F)F)(F)F)O,62356,CCS Type: DT; Buffer gas: N2; Ionization: ESI-; Dataset: PFAS,DOI:10.1021/acs.est.2c00201
PFPrS,perfluoropropanesulfonic acid,C3HF7O3S,[M-H]-,125.1,3.2,248.9462,423-41-6,C(C(F)(F)F)(C(F)(F)S(=O)(=O)O)(F)F,9859771,CCS Type: DT; Buffer gas: N2; Ionization: ESI-; Dataset: PFAS,DOI:10.1021/acs.est.2c00201
11:1 FTOH,11:1 fluorotelomer alcohol,C12H3F23O,[M-H]-,179.62,13.98,598.9738,423-65-4,C(C(C(C(C(C(C(C(C(C(C(C(F)(F)F)(F)F)(F)F)(F)F)(F)F)(F)F)(F)F)(F)F)(F)F)(F)F)(F)F)O,2760321,CCS Type: DT; Buffer gas: N2; Ionization: ESI-; Dataset: PFAS,DOI:10.1021/acs.est.2c00201
N_AP_FHxSA,N-(3-dimethylaminopropan-1-yl)perfluoro-1-hexanesulfonamide,C11H13F13N2O2S,[M-H]-,182.79,9.27,483.0417,50598-28-2,CN(C)CCCNS(=O)(=O)C(C(C(C(C(C(F)(F)F)(F)F)(F)F)(F)F)(F)F)(F)F,111913,CCS Type: DT; Buffer gas: N2; Ionization: ESI-; Dataset: PFAS,DOI:10.1021/acs.est.2c00201
PFBPA,Perfluorobutylphosphonic acid,C4H2F9O3P,[M-H]-,135.68,0.66,298.9525,52299-24-8,C(C(C(F)(F)P(=O)(O)O)(F)F)(C(F)(F)F)(F)F,14452717,CCS Type: DT; Buffer gas: N2; Ionization: ESI-; Dataset: PFAS,DOI:10.1021/acs.est.2c00201
PFDPA,Perfluorodecylphosphonic acid,C10H2F21O3P,[M-H]-,188.12,10.31,598.9333,52299-26-0,C(C(C(C(C(C(F)(F)P(=O)(O)O)(F)F)(F)F)(F)F)(F)F)(C(C(C(C(F)(F)F)(F)F)(F)F)(F)F)(F)F,85828788,CCS Type: DT; Buffer gas: N2; Ionization: ESI-; Dataset: PFAS,DOI:10.1021/acs.est.2c00201
6:2 diPAP,"bis(1H,1H,2H,2H-perfluorooctyl)phosphate",C16H9F26O4P,[M-H]-,233.93,13.39,788.9751,57677-95-9,C(COP(=O)(O)OCCC(C(C(C(C(C(F)(F)F)(F)F)(F)F)(F)F)(F)F)(F)F)C(C(C(C(C(C(F)(F)F)(F)F)(F)F)(F)F)(F)F)(F)F,14550408,CCS Type: DT; Buffer gas: N2; Ionization: ESI-; Dataset: PFAS,DOI:10.1021/acs.est.2c00201
6:8 PFPi,6:8 Perfluorophosphinic acid,C14HF30O2P,[M-H]-,213.25,13.06,800.9162,610800-34-5,C(C(C(C(C(F)(F)P(=O)(C(C(C(C(C(C(F)(F)F)(F)F)(F)F)(F)F)(F)F)(F)F)O)(F)F)(F)F)(F)F)(C(C(C(F)(F)F)(F)F)(F)F)(F)F,85871532,CCS Type: DT; Buffer gas: N2; Ionization: ESI-; Dataset: PFAS,DOI:10.1021/acs.est.2c00201
HFPO-TeA (dimer),"Perfluoro-(2,5,8-trimethyl-3,6,9-trioxadodecanoic)acid",C24H2F46O10,[M-H]-,278.77,12.43,1322.884,65294-16-8,C(=O)(C(C(F)(F)F)(OC(C(C(F)(F)F)(OC(C(C(F)(F)F)(OC(C(C(F)(F)F)(F)F)(F)F)F)(F)F)F)(F)F)F)O,182328,CCS Type: DT; Buffer gas: N2; Ionization: ESI-; Dataset: PFAS,DOI:10.1021/acs.est.2c00201
PFHxDA,perfluorohexadecanoic acid,C16HF31O2,[M-H]-,226.12,14.02,812.9409,67905-19-5,C(=O)(C(C(C(C(C(C(C(C(C(C(C(C(C(C(C(F)(F)F)(F)F)(F)F)(F)F)(F)F)(F)F)(F)F)(F)F)(F)F)(F)F)(F)F)(F)F)(F)F)(F)F)(F)F)O,106027,CCS Type: DT; Buffer gas: N2; Ionization: ESI-; Dataset: PFAS,DOI:10.1021/acs.est.2c00201
PFNS,perfluorononanesulfonate,C9HF19SO3,[M-H]-,177.24,11.1,548.927,68259-12-1,C(C(C(C(C(F)(F)F)(F)F)(F)F)(F)F)(C(C(C(C(F)(F)S(=O)(=O)O)(F)F)(F)F)(F)F)(F)F,86998,CCS Type: DT; Buffer gas: N2; Ionization: ESI-; Dataset: PFAS,DOI:10.1021/acs.est.2c00201
MeFHxSA,N-methylperfluorohexanesulfonamide,C7H4F13NO2S,[M-H]-,152.91,10.47,411.9682,68259-15-4,CNS(=O)(=O)C(C(C(C(C(C(F)(F)F)(F)F)(F)F)(F)F)(F)F)(F)F,109952,CCS Type: DT; Buffer gas: N2; Ionization: ESI-; Dataset: PFAS,DOI:10.1021/acs.est.2c00201
MeFBSA,N-methylperfluorobutanesulfonamide,C5H4F9NO2S,[M-H]-,138.88,7.69,311.9746,68298-12-4,CNS(=O)(=O)C(C(C(C(F)(F)F)(F)F)(F)F)(F)F,109968,CCS Type: DT; Buffer gas: N2; Ionization: ESI-; Dataset: PFAS,DOI:10.1021/acs.est.2c00201
8:2 FTUCA,2H-perfluoro-2-decenoic acid,C10H2F16O2,[M-H]-,192.4,10.25,456.9727,70887-84-2,C(=C(C(C(C(C(C(C(C(F)(F)F)(F)F)(F)F)(F)F)(F)F)(F)F)(F)F)F)C(=O)O,71404795,CCS Type: DT; Buffer gas: N2; Ionization: ESI-; Dataset: PFAS,DOI:10.1021/acs.est.2c00201
PFTrDA,perfluorotridecanoic acid,C13HF25O2,[M-H]-,200.76,12.86,662.9505,72629-94-8,C(=O)(C(C(C(C(C(C(C(C(C(C(C(C(F)(F)F)(F)F)(F)F)(F)F)(F)F)(F)F)(F)F)(F)F)(F)F)(F)F)(F)F)(F)F)O,3018355,CCS Type: DT; Buffer gas: N2; Ionization: ESI-; Dataset: PFAS,DOI:10.1021/acs.est.2c00201
9Cl-PF3ONS,9-chlorohexadecafluoro-3-oxanone-1-sulfonic acid,C8HF16SO4Cl,[M-H]-,170.24,10.82,530.8956,73606-19-6,C(C(C(C(F)(F)Cl)(F)F)(F)F)(C(C(OC(C(F)(F)S(=O)(=O)O)(F)F)(F)F)(F)F)(F)F,22568738,CCS Type: DT; Buffer gas: N2; Ionization: ESI-; Dataset: PFAS,DOI:10.1021/acs.est.2c00201
Nafion Byproduct 2,"7H-Perfluoro-4-methyl-3,6-dioxaoctanesulfonic acid",C7H2F14O5S,[M-H]-,155.21,8.46,462.9327,749836-20-2,C(C(F)(F)F)(OC(C(C(F)(F)F)(OC(C(F)(F)S(=O)(=O)O)(F)F)F)(F)F)F,14317645,CCS Type: DT; Buffer gas: N2; Ionization: ESI-; Dataset: PFAS,DOI:10.1021/acs.est.2c00201
4:2 FTS,4:2 fluorotelomer sulfonic acid,C6H5F9SO3,[M-H]-,150.39,6.51,326.9743,757124-22-4,C(CS(=O)(=O)O)C(C(C(C(F)(F)F)(F)F)(F)F)(F)F,20734543,CCS Type: DT; Buffer gas: N2; Ionization: ESI-; Dataset: PFAS,DOI:10.1021/acs.est.2c00201
TFA(1),trifluoroacetic acid,C2HF3O2,[M-H]-,106.25,0.36,112.985,76-05-1,C(=O)(C(F)(F)F)O,6422,CCS Type: DT; Buffer gas: N2; Ionization: ESI-; Dataset: PFAS,DOI:10.1021/acs.est.2c00201
TFA(2),trifluoroacetic acid,C2HF3O2,[M-H]-,122.14,0.36,112.985,76-05-1,C(=O)(C(F)(F)F)O,6422,CCS Type: DT; Buffer gas: N2; Ionization: ESI-; Dataset: PFAS,DOI:10.1021/acs.est.2c00201
11Cl-PF3OUdS,,C10HF20SO4Cl,[M-H]-,186.52,12.1,630.8892,763051-92-9,C(C(C(C(C(F)(F)Cl)(F)F)(F)F)(F)F)(C(C(C(OC(C(F)(F)S(=O)(=O)O)(F)F)(F)F)(F)F)(F)F)(F)F,15099039,CCS Type: DT; Buffer gas: N2; Ionization: ESI-; Dataset: PFAS,DOI:10.1021/acs.est.2c00201
Hydro-EVE,"2,2,3,3-Tetrafluoro-3-{[1,1,1,2,3,3-hexafluoro-3-(1,2,2,2-tetrafluoroethoxy)propan-2-yl]oxy}propanoic acid",C8H2F14O4,[M-H]-,151.2,8.28,426.9651,773804-62-9,C(C(F)(F)F)(OC(C(C(F)(F)F)(OC(C(C(=O)O)(F)F)(F)F)F)(F)F)F,131713263,CCS Type: DT; Buffer gas: N2; Ionization: ESI-; Dataset: PFAS,DOI:10.1021/acs.est.2c00201
PFDoS,perfluorododecanesulfonate,C12HF25O3S,[M-H]-,203.67,12.83,698.9174,79780-39-5,C(C(C(C(C(C(C(F)(F)S(=O)(=O)O)(F)F)(F)F)(F)F)(F)F)(F)F)(C(C(C(C(C(F)(F)F)(F)F)(F)F)(F)F)(F)F)(F)F,3018866,CCS Type: DT; Buffer gas: N2; Ionization: ESI-; Dataset: PFAS,DOI:10.1021/acs.est.2c00201
NVHOS,Perfluoroethoxysulfonic acid,C4H2F8O4S,[M-H]-,132.93,3.41,296.9473,801209-99-4,C(C(F)(F)F)(OC(C(F)(F)S(=O)(=O)O)(F)F)F,87285272,CCS Type: DT; Buffer gas: N2; Ionization: ESI-; Dataset: PFAS,DOI:10.1021/acs.est.2c00201
8:2 FTPA,"(1H,1H,2H,2H-Heptadecafluorodec-1-yl)phosphonic acid",C10H6F17O3P,[M-H]-,188.22,11.08,526.9705,80220-63-9,C(CP(=O)(O)O)C(C(C(C(C(C(C(C(F)(F)F)(F)F)(F)F)(F)F)(F)F)(F)F)(F)F)(F)F,22630493,CCS Type: DT; Buffer gas: N2; Ionization: ESI-; Dataset: PFAS,DOI:10.1021/acs.est.2c00201
PFMBA (dimer),Perfluoro-5-oxahexanoic acid (PF5OHxA),C10H2F18O6,[M-H]-,183.5,5.38,558.9486,863090-89-5,C(=O)(C(C(C(OC(F)(F)F)(F)F)(F)F)(F)F)O,12498036,CCS Type: DT; Buffer gas: N2; Ionization: ESI-; Dataset: PFAS,DOI:10.1021/acs.est.2c00201
9Cl-PFNA,9-chloro-prefluorononanoic acid,C9HClF16O2,[M-H]-,168.64,7.99,478.9331,865-79-2,C(=O)(C(C(C(C(C(C(C(C(F)(F)Cl)(F)F)(F)F)(F)F)(F)F)(F)F)(F)F)(F)F)O,2782473,CCS Type: DT; Buffer gas: N2; Ionization: ESI-; Dataset: PFAS,DOI:10.1021/acs.est.2c00201
5:2 FTCA,"2H,2H,3H,3H-Perfluorooctanoic acid",C8H5F11O2,[M-H]-,157.54,8.44,341.0036,914637-49-3,C(CC(C(C(C(C(F)(F)F)(F)F)(F)F)(F)F)(F)F)C(=O)O,14632790,CCS Type: DT; Buffer gas: N2; Ionization: ESI-; Dataset: PFAS,DOI:10.1021/acs.est.2c00201
N-CMAmP-6:2FOSA (6:2 FTAB),"N-(carboxymethyl)-N,N-dimethyl-N-[3-(1H,1H,2H,2H-perfluoro-1-octanesulfonamido)propan-1-yl]ammonium",C15H19F13N2O4S,[M-H]-,215.21,9.95,569.0785,94088-80-9,C[N+](C)(C)CCCNS(=O)(=O)CCC(C(C(C(C(C(F)(F)F)(F)F)(F)F)(F)F)(F)F)(F)F,3038536,CCS Type: DT; Buffer gas: N2; Ionization: ESI-; Dataset: PFAS,DOI:10.1021/acs.est.2c00201
6:2/8:2 diPAP,6:2/8:2 Fluorotelomer phosphate diester,C18H9F30O4P,[M-H]-,247.12,13.51,888.9687,943913-15-3,C(COP(=O)(O)OCCC(C(C(C(C(C(F)(F)F)(F)F)(F)F)(F)F)(F)F)(F)F)C(C(C(C(C(C(C(C(F)(F)F)(F)F)(F)F)(F)F)(F)F)(F)F)(F)F)(F)F,101536705,CCS Type: DT; Buffer gas: N2; Ionization: ESI-; Dataset: PFAS,DOI:10.1021/acs.est.2c00201
13C8-PFOS,M8PFOS,[13C]8HF17O3S,[M-H]-,168.27,10.4,506.9617,,OS(=O)(=O)[13C](F)(F)[13C](F)(F)[13C](F)(F)[13C](F)(F)[13C](F)(F)[13C](F)(F)[13C](F)(F)[13C](F)(F)F,165360275,CCS Type: DT; Buffer gas: N2; Ionization: ESI-; Dataset: PFAS,DOI:10.1021/acs.est.2c00201
13C3-PFHxS,M3PFHxS,[13C]3C3HF13O3S,[M-H]-,150.51,8.38,401.9529,,C(C([13C]([13C]([13C](F)(F)S(=O)(=O)O)(F)F)(F)F)(F)F)(C(F)(F)F)(F)F,165360273,CCS Type: DT; Buffer gas: N2; Ionization: ESI-; Dataset: PFAS,DOI:10.1021/acs.est.2c00201
13C3-PFBS,M3PFBS,[13C]3CHF9O3S,[M-H]-,133.62,5.2,301.9584,,OS(=O)(=O)C(F)(F)[13C](F)(F)[13C](F)(F)[13C](F)(F)F,165360271,CCS Type: DT; Buffer gas: N2; Ionization: ESI-; Dataset: PFAS,DOI:10.1021/acs.est.2c00201
13C2-PFTeDA,M2PFTeDA,[13C]2C12HF27O2,[M-H]-,209.19,13.3,714.9468,,[13C](=O)([13C](C(C(C(C(C(C(C(C(C(C(C(C(F)(F)F)(F)F)(F)F)(F)F)(F)F)(F)F)(F)F)(F)F)(F)F)(F)F)(F)F)(F)F)(F)F)O,165363580,CCS Type: DT; Buffer gas: N2; Ionization: ESI-; Dataset: PFAS,DOI:10.1021/acs.est.2c00201
13C2-PFDoA,MPFDoA,[13C]2C10HF23O2,[M-H]-,191.37,12.36,614.9551,,[13C](=O)([13C](C(C(C(C(C(C(C(C(C(C(F)(F)F)(F)F)(F)F)(F)F)(F)F)(F)F)(F)F)(F)F)(F)F)(F)F)(F)F)O,165363581,CCS Type: DT; Buffer gas: N2; Ionization: ESI-; Dataset: PFAS,DOI:10.1021/acs.est.2c00201
EVE acid,,C8HF13O4,[M-H]-,146.26,8.8,406.9589,,OC(=O)C(F)(F)C(F)(F)OC(F)(C(F)(F)F)C(F)(F)OC(F)=C(F)F,112235,CCS Type: DT; Buffer gas: N2; Ionization: ESI-; Dataset: PFAS,DOI:10.1021/acs.est.2c00201
R-EVE,,C8H2F12O5,[M-H]-,146.3,2.37,404.9632,,C(=O)(C(C(C(C(F)(F)F)(OC(C(C(=O)O)(F)F)(F)F)F)(F)F)(F)F)O,165363145,CCS Type: DT; Buffer gas: N2; Ionization: ESI-; Dataset: PFAS,DOI:10.1021/acs.est.2c00201
Nafion Byproduct 4,"2,2,3,3,4,5,5,5-4-(1,1,2,2-tetrafluoro-2- sulfoethoxy)pentanoic acid",C7H2F12O6S,[M-H]-,151.27,2.8,440.9308,,OC(=O)C(F)(F)C(F)(F)C(F)(OC(F)(F)C(F)(F)S(O)(=O)=O)C(F)(F)F,138395003,CCS Type: DT; Buffer gas: N2; Ionization: ESI-; Dataset: PFAS,DOI:10.1021/acs.est.2c00201
Nafion Byproduct 5,,C7H3F11O7S,[M-H]-,152.91,3.04,438.9351,,C(F)(OC(F)(F)C(F)(OC(F)(F)C(F)(F)S(O)(=O)=O)C(F)(F)F)C(O)=O,165362390,CCS Type: DT; Buffer gas: N2; Ionization: ESI-; Dataset: PFAS,DOI:10.1021/acs.est.2c00201
Nafion Byproduct 6,,C6H2F12O4S,[M-H]-,146.16,8.55,396.9409,,C(C(C(C(F)(F)F)(OC(C(F)(F)S(=O)(=O)O)(F)F)F)(F)F)(F)F,165363146,CCS Type: DT; Buffer gas: N2; Ionization: ESI-; Dataset: PFAS,DOI:10.1021/acs.est.2c00201
FDSA,Perfluorodecanesulfonamide,C10H2F21NO2S,[M-H]-,188.12,12.54,597.9398,,C(C(C(C(C(C(F)(F)S(=O)(=O)N)(F)F)(F)F)(F)F)(F)F)(C(C(C(C(F)(F)F)(F)F)(F)F)(F)F)(F)F,21267702,CCS Type: DT; Buffer gas: N2; Ionization: ESI-; Dataset: PFAS,DOI:10.1021/acs.est.2c00201
Cl-PFOPA,8-Chloroperfluorooctylphosphonic acid,C8H2F16ClO3P,[M-H]-,174.95,8.48,514.9102,,C(C(C(C(C(F)(F)Cl)(F)F)(F)F)(F)F)(C(C(C(F)(F)P(=O)(O)O)(F)F)(F)F)(F)F,138395139,CCS Type: DT; Buffer gas: N2; Ionization: ESI-; Dataset: PFAS,DOI:10.1021/acs.est.2c00201
Cl-PFHxPA,6-Chloroperfluorohexylphosphonic acid,C6H2F12ClO3P,[M-H]-,156.12,5.54,414.9166,,C(C(C(C(F)(F)Cl)(F)F)(F)F)(C(C(F)(F)P(=O)(O)O)(F)F)(F)F,101545603,CCS Type: DT; Buffer gas: N2; Ionization: ESI-; Dataset: PFAS,DOI:10.1021/acs.est.2c00201
PFEESA,Perfluoroethoxyethanesulfonic acid,C4HF9O4S,[M-H]-,137.99,6.31,314.9379,113507-82-7,C(C(F)(F)F)(OC(C(F)(F)S(=O)(=O)O)(F)F)(F)F,2776108,CCS Type: DT; Buffer gas: N2; Ionization: ESI-; Dataset: PFAS,DOI:10.1021/acs.est.2c00201
PMPA,Perfluoro-2-methoxypropanoic acid,C4HF7O3,[M-H-CO2]-,115.2,2.56,184.9843,13140-29-9,C(=O)(C(C(F)(F)F)(OC(F)(F)F)F)O,13213330,CCS Type: DT; Buffer gas: N2; Ionization: ESI-; Dataset: PFAS,DOI:10.1021/acs.est.2c00201
HFPO-DA (GenX),Perfluoro-2-propoxypropanoic acid,C6HF11O3,[M-H-CO2]-,127.46,7.14,284.9779,13252-13-6,C(=O)(C(C(F)(F)F)(OC(C(C(F)(F)F)(F)F)(F)F)F)O,114481,CCS Type: DT; Buffer gas: N2; Ionization: ESI-; Dataset: PFAS,DOI:10.1021/acs.est.2c00201
PFO3DoDA,"Perfluoro-3,6,9-trioxadecanoic acid",C7HF13O5,[M-H-CO2]-,149.52,10.07,366.9645,151772-59-7,C(=O)(C(OC(C(OC(C(OC(F)(F)F)(F)F)(F)F)(F)F)(F)F)(F)F)O,2778260,CCS Type: DT; Buffer gas: N2; Ionization: ESI-; Dataset: PFAS,DOI:10.1021/acs.est.2c00201
PFODA,perfluorooctadecanoic acid,C18HF35O2,[M-H-CO2]-,222.2,14.29,868.9441,16517-11-6,C(=O)(C(C(C(C(C(C(C(C(C(C(C(C(C(C(C(C(C(F)(F)F)(F)F)(F)F)(F)F)(F)F)(F)F)(F)F)(F)F)(F)F)(F)F)(F)F)(F)F)(F)F)(F)F)(F)F)(F)F)(F)F)O,167547,CCS Type: DT; Buffer gas: N2; Ionization: ESI-; Dataset: PFAS,DOI:10.1021/acs.est.2c00201
PFUdA,perfluoroundecanoic acid,C11HF21O2,[M-H-CO2]-,163.36,11.77,518.967,2058-94-8,C(=O)(C(C(C(C(C(C(C(C(C(C(F)(F)F)(F)F)(F)F)(F)F)(F)F)(F)F)(F)F)(F)F)(F)F)(F)F)O,77222,CCS Type: DT; Buffer gas: N2; Ionization: ESI-; Dataset: PFAS,DOI:10.1021/acs.est.2c00201
PFPeA,perfluoropentanoic acid,C5HF9O2,[M-H-CO2]-,117.43,4.52,218.9862,2706-90-3,C(=O)(C(C(C(C(F)(F)F)(F)F)(F)F)(F)F)O,75921,CCS Type: DT; Buffer gas: N2; Ionization: ESI-; Dataset: PFAS,DOI:10.1021/acs.est.2c00201
PFHxA,perfluorohexanoic acid,C6HF11O2,[M-H-CO2]-,125.1,6.66,268.983,307-24-4,C(=O)(C(C(C(C(C(F)(F)F)(F)F)(F)F)(F)F)(F)F)O,67542,CCS Type: DT; Buffer gas: N2; Ionization: ESI-; Dataset: PFAS,DOI:10.1021/acs.est.2c00201
PFDoA,perfluorododecanoic acid,C12HF23O2,[M-H-CO2]-,171.5,12.36,568.9638,307-55-1,C(=O)(C(C(C(C(C(C(C(C(C(C(C(F)(F)F)(F)F)(F)F)(F)F)(F)F)(F)F)(F)F)(F)F)(F)F)(F)F)(F)F)O,67545,CCS Type: DT; Buffer gas: N2; Ionization: ESI-; Dataset: PFAS,DOI:10.1021/acs.est.2c00201
PFOA,perflurooctanoic acid,C8HF15O2,[M-H-CO2]-,139.5,9.37,368.9766,335-67-1,C(=O)(C(C(C(C(C(C(C(F)(F)F)(F)F)(F)F)(F)F)(F)F)(F)F)(F)F)O,9554,CCS Type: DT; Buffer gas: N2; Ionization: ESI-; Dataset: PFAS,DOI:10.1021/acs.est.2c00201
PFDA,perfluorodecanoic acid,C10HF19O2,[M-H-CO2]-,155.28,11.1,468.9702,335-76-2,C(=O)(C(C(C(C(C(C(C(C(C(F)(F)F)(F)F)(F)F)(F)F)(F)F)(F)F)(F)F)(F)F)(F)F)O,9555,CCS Type: DT; Buffer gas: N2; Ionization: ESI-; Dataset: PFAS,DOI:10.1021/acs.est.2c00201
PFBA,perfluorobutanoic acid,C4HF7O2,[M-H-CO2]-,110.76,2.26,168.9894,375-22-4,C(=O)(C(C(C(F)(F)F)(F)F)(F)F)O,9777,CCS Type: DT; Buffer gas: N2; Ionization: ESI-; Dataset: PFAS,DOI:10.1021/acs.est.2c00201
PFHpA,perfluoroheptanoic acid,C7HF13O2,[M-H-CO2]-,132.38,8.21,318.9798,375-85-9,C(=O)(C(C(C(C(C(C(F)(F)F)(F)F)(F)F)(F)F)(F)F)(F)F)O,67818,CCS Type: DT; Buffer gas: N2; Ionization: ESI-; Dataset: PFAS,DOI:10.1021/acs.est.2c00201
PFNA,perflurononanoic acid,C9HF17O2,[M-H-CO2]-,147.02,10.3,418.9734,375-95-1,C(=O)(C(C(C(C(C(C(C(C(F)(F)F)(F)F)(F)F)(F)F)(F)F)(F)F)(F)F)(F)F)O,67821,CCS Type: DT; Buffer gas: N2; Ionization: ESI-; Dataset: PFAS,DOI:10.1021/acs.est.2c00201
PFTeDA,perfluorotetradecanoic acid,C14HF27O2,[M-H-CO2]-,187.62,13.3,668.9574,376-06-7,C(=O)(C(C(C(C(C(C(C(C(C(C(C(C(C(F)(F)F)(F)F)(F)F)(F)F)(F)F)(F)F)(F)F)(F)F)(F)F)(F)F)(F)F)(F)F)(F)F)O,67822,CCS Type: DT; Buffer gas: N2; Ionization: ESI-; Dataset: PFAS,DOI:10.1021/acs.est.2c00201
PFMPA,Perfluoro-3-methoxypropanoic acid,C4HF7O3,[M-H-CO2]-,115.45,10.3,184.9843,377-73-1,C(=O)(C(C(OC(F)(F)F)(F)F)(F)F)O,120228,CCS Type: DT; Buffer gas: N2; Ionization: ESI-; Dataset: PFAS,DOI:10.1021/acs.est.2c00201
PEPA,Perfluoro-2-ethoxypropanoic acid,C5HF9O3,[M-H-CO2]-,120.92,5.01,234.9811,377-76-4,C(=O)(C(C(OC(C(F)(F)F)(F)F)(F)F)(F)F)O,21827655,CCS Type: DT; Buffer gas: N2; Ionization: ESI-; Dataset: PFAS,DOI:10.1021/acs.est.2c00201
PFPrA(1),Pentafluoropropionic acid,C3HF5O2,[M-H-CO2]-,119.28,10.47,118.992,422-64-0,C(=O)(C(C(F)(F)F)(F)F)O,62356,CCS Type: DT; Buffer gas: N2; Ionization: ESI-; Dataset: PFAS,DOI:10.1021/acs.est.2c00201
PFPrA(2),Pentafluoropropionic acid,C3HF5O2,[M-H-CO2]-,104.5986,0.82,118.992,422-64-0,C(=O)(C(C(F)(F)F)(F)F)O,62356,CCS Type: DT; Buffer gas: N2; Ionization: ESI-; Dataset: PFAS,DOI:10.1021/acs.est.2c00201
PFHxDA,perfluorohexadecanoic acid,C16HF31O2,[M-H-CO2]-,203.67,14.02,768.951,67905-19-5,C(=O)(C(C(C(C(C(C(C(C(C(C(C(C(C(C(C(F)(F)F)(F)F)(F)F)(F)F)(F)F)(F)F)(F)F)(F)F)(F)F)(F)F)(F)F)(F)F)(F)F)(F)F)(F)F)O,106027,CCS Type: DT; Buffer gas: N2; Ionization: ESI-; Dataset: PFAS,DOI:10.1021/acs.est.2c00201
PFTrDA,perfluorotridecanoic acid,C13HF25O2,[M-H-CO2]-,179.65,12.86,618.9606,72629-94-8,C(=O)(C(C(C(C(C(C(C(C(C(C(C(C(F)(F)F)(F)F)(F)F)(F)F)(F)F)(F)F)(F)F)(F)F)(F)F)(F)F)(F)F)(F)F)O,3018355,CCS Type: DT; Buffer gas: N2; Ionization: ESI-; Dataset: PFAS,DOI:10.1021/acs.est.2c00201
TFA(1),trifluoroacetic acid,C2HF3O2,[M-H-CO2]-,96.52,0.36,68.9952,76-05-1,C(=O)(C(F)(F)F)O,6422,CCS Type: DT; Buffer gas: N2; Ionization: ESI-; Dataset: PFAS,DOI:10.1021/acs.est.2c00201
PFECA G,Perfluoro-4-isopropoxybutanoic acid,C7HF13O3,[M-H-CO2]-,138.97,4.24,334.9747,801212-59-9,C(=O)(C(C(C(OC(C(F)(F)F)(C(F)(F)F)F)(F)F)(F)F)(F)F)O,45075727,CCS Type: DT; Buffer gas: N2; Ionization: ESI-; Dataset: PFAS,DOI:10.1021/acs.est.2c00201
9Cl-PFNA,9-chloro-prefluorononanoic acid,C9HClF16O2,[M-H-CO2]-,150.52,7.99,434.9433,865-79-2,C(=O)(C(C(C(C(C(C(C(C(F)(F)Cl)(F)F)(F)F)(F)F)(F)F)(F)F)(F)F)(F)F)O,2782473,CCS Type: DT; Buffer gas: N2; Ionization: ESI-; Dataset: PFAS,DOI:10.1021/acs.est.2c00201
ADONA,"4,8-Dioxa-3H-perfluorononanoic acid",C7H2F12O4,[M-H-CO2]-,139.58,10.95,332.979,919005-14-4,C(C(C(=O)O)(F)F)(OC(C(C(OC(F)(F)F)(F)F)(F)F)(F)F)F,52915299,CCS Type: DT; Buffer gas: N2; Ionization: ESI-; Dataset: PFAS,DOI:10.1021/acs.est.2c00201
"Perfluoro-n-(1,2-13C2)tetradecanoic acid",M2PFTeDA,[13C]2C12HF27O2,[M-H-CO2]-,187.6171424,13.30333333,669.9607893,2708218-82-8,[13C](=O)([13C](C(C(C(C(C(C(C(C(C(C(C(C(F)(F)F)(F)F)(F)F)(F)F)(F)F)(F)F)(F)F)(F)F)(F)F)(F)F)(F)F)(F)F)(F)F)O,165363580,CCS Type: DT; Buffer gas: N2; Ionization: ESI-; Dataset: PFAS,DOI:10.1038/s41597-024-04363-0
"Perfluoro-n-(1,2-13C2)dodecanoic acid",MPFDoA,[13C]2C10HF23O2,[M-H-CO2]-,171.5041611,12.35666667,569.9671766,960315-52-0,[13C](=O)([13C](C(C(C(C(C(C(C(C(C(C(F)(F)F)(F)F)(F)F)(F)F)(F)F)(F)F)(F)F)(F)F)(F)F)(F)F)(F)F)O,165363581,CCS Type: DT; Buffer gas: N2; Ionization: ESI-; Dataset: PFAS,DOI:10.1038/s41597-024-04363-0
"Perfluoro-n-(1,2,3,4,5,6,7-13C7)undecanoic acid",M7PFUdA,[13C]7C4HF21O2,[M-H-CO2]-,163.3625106,11.76666667,524.9871445,,[13C](=O)([13C]([13C]([13C]([13C]([13C]([13C](C(C(C(C(F)(F)F)(F)F)(F)F)(F)F)(F)F)(F)F)(F)F)(F)F)(F)F)(F)F)O,165363575,CCS Type: DT; Buffer gas: N2; Ionization: ESI-; Dataset: PFAS,DOI:10.1038/s41597-024-04363-0
"Perfluoro-n-(1,2,3,4,5,6,7-13C7)undecanoic acid",M7PFUdA,[13C]7C4HF21O2,[M-H]-,183.6,11.76666667,569.9803,,[13C](=O)([13C]([13C]([13C]([13C]([13C]([13C](C(C(C(C(F)(F)F)(F)F)(F)F)(F)F)(F)F)(F)F)(F)F)(F)F)(F)F)(F)F)O,165363575,CCS Type: DT; Buffer gas: N2; Ionization: ESI-; Dataset: PFAS,DOI:10.1038/s41597-024-04363-0
"Perfluoro-n-(1,2,3,4,5,6-13C6)decanoic acid",M6PFDA,[13C]6C4HF19O2,[M-H]-,174.5019682,11.09666667,518.9802,960315-50-8,[13C](=O)([13C](C(C(C(C(C(C(C(C(F)(F)F)(F)F)(F)F)(F)F)(F)F)(F)F)(F)F)(F)F)(F)F)O,102145671,CCS Type: DT; Buffer gas: N2; Ionization: ESI-; Dataset: PFAS,DOI:10.1038/s41597-024-04363-0
"Perfluoro-n-(1,2,3,4,5,6-13C6)decanoic acid",M6PFDA,[13C]6C4HF19O2,[M-H-CO2]-,155.2802541,11.09666667,473.9869833,960315-50-8,[13C](=O)([13C](C(C(C(C(C(C(C(C(F)(F)F)(F)F)(F)F)(F)F)(F)F)(F)F)(F)F)(F)F)(F)F)O,102145671,CCS Type: DT; Buffer gas: N2; Ionization: ESI-; Dataset: PFAS,DOI:10.1038/s41597-024-04363-0
Perfluoro-n-(13C9)nonanoic acid,M9PFNA,[13C]9HF17O2,[M-H]-,165.5655524,10.3,471.9934,2283397-80-6,[13C](=O)([13C]([13C]([13C]([13C]([13C]([13C]([13C]([13C](F)(F)F)(F)F)(F)F)(F)F)(F)F)(F)F)(F)F)(F)F)O,165360267,CCS Type: DT; Buffer gas: N2; Ionization: ESI-; Dataset: PFAS,DOI:10.1038/s41597-024-04363-0
Perfluoro-n-(13C9)nonanoic acid,M9PFNA,[13C]9HF17O2,[M-H-CO2]-,147.0221206,10.3,427.0002415,2283397-80-6,[13C](=O)([13C]([13C]([13C]([13C]([13C]([13C]([13C]([13C](F)(F)F)(F)F)(F)F)(F)F)(F)F)(F)F)(F)F)(F)F)O,165360267,CCS Type: DT; Buffer gas: N2; Ionization: ESI-; Dataset: PFAS,DOI:10.1038/s41597-024-04363-0
Perfluoro-n-(13C8)octanoic acid,M8PFOA,[13C]8HF15O2,[M-H-CO2]-,139.5013897,9.366666667,376.0000803,1350614-84-4,[13C](=O)([13C]([13C]([13C]([13C]([13C]([13C]([13C](F)(F)F)(F)F)(F)F)(F)F)(F)F)(F)F)(F)F)O,101375161,CCS Type: DT; Buffer gas: N2; Ionization: ESI-; Dataset: PFAS,DOI:10.1038/s41597-024-04363-0
"Perfluoro-n-(1,2,3,4,6-13C5)hexanoic acid",M5PFHxA,[13C]5CHF11O2,[M-H-CO2]-,125.0959737,6.656666667,272.9964032,2328024-54-8,[13C](=O)([13C]([13C]([13C](C([13C](F)(F)F)(F)F)(F)F)(F)F)(F)F)O,165363576,CCS Type: DT; Buffer gas: N2; Ionization: ESI-; Dataset: PFAS,DOI:10.1038/s41597-024-04363-0
"Perfluoro-n-(1,2,3,4-13C4)heptanoic acid",M4PFHpA,[13C]4C3HF13O2,[M-H-CO2]-,132.381688,8.21,321.9898547,2328024-55-9,[13C](=O)([13C]([13C]([13C](C(C(C(F)(F)F)(F)F)(F)F)(F)F)(F)F)(F)F)O,165360266,CCS Type: DT; Buffer gas: N2; Ionization: ESI-; Dataset: PFAS,DOI:10.1038/s41597-024-04363-0
Perfluoro-n-(13C5)pentanoic acid,M5PFPeA,[13C]5HF9O2,[M-H-CO2]-,117.4346832,4.516666667,222.999,2283397-79-3,[13C](=O)([13C]([13C]([13C]([13C](F)(F)F)(F)F)(F)F)(F)F)O,165360265,CCS Type: DT; Buffer gas: N2; Ionization: ESI-; Dataset: PFAS,DOI:10.1038/s41597-024-04363-0
Perfluoro-n-(13C4)butanoic acid,MPFBA,[13C]4HF7O2,[M-H-CO2]-,110.7561553,2.256666667,171.9989,1017281-29-6,[13C](=O)([13C]([13C]([13C](F)(F)F)(F)F)(F)F)O,165363577,CCS Type: DT; Buffer gas: N2; Ionization: ESI-; Dataset: PFAS,DOI:10.1038/s41597-024-04363-0
Perfluoro-1-(13C8)octanesulfonamide,M8FOSA,[13C]8F17SO2NH2,[M-H]-,170.5,11.56,505.973,1365803-60-6,[13C]([13C]([13C]([13C]([13C](F)(F)S(=O)(=O)N)(F)F)(F)F)(F)F)([13C]([13C]([13C](F)(F)F)(F)F)(F)F)(F)F,165360282,CCS Type: DT; Buffer gas: N2; Ionization: ESI-; Dataset: PFAS,DOI:10.1038/s41597-024-04363-0
N-methyl-d3-perfluoro-1-octanesulfonamide,d-N-MeFOSA,C9D3H1F17NO2S,[M-H]-,174.4,12.73,514.9807,936109-37-4,[2H]C([2H])([2H])NS(=O)(=O)C(C(C(C(C(C(C(C(F)(F)F)(F)F)(F)F)(F)F)(F)F)(F)F)(F)F)(F)F,102403774,CCS Type: DT; Buffer gas: N2; Ionization: ESI-; Dataset: PFAS,DOI:10.1038/s41597-024-04363-0
N-ethyl-d5-perfluoro-1-octanesulfonamide,d-N-EtFOSA,C10D5H1F17NO2S,[M-H]-,178.9,13.13,531.0089,936109-40-9,[2H]C([2H])([2H])C([2H])([2H])NS(=O)(=O)C(C(C(C(C(C(C(C(F)(F)F)(F)F)(F)F)(F)F)(F)F)(F)F)(F)F)(F)F,102145672,CCS Type: DT; Buffer gas: N2; Ionization: ESI-; Dataset: PFAS,DOI:10.1038/s41597-024-04363-0
N-methyl-d3-perfluoro-1-octansulfonamidoacetic acid,d3-N-MeFOSAA,C11D3H3F17NO4S,[M-H]-,193.8,11.46,572.9862,1400690-70-1,[2H]C([2H])([2H])N(CC(=O)O)S(=O)(=O)C(C(C(C(C(C(C(C(F)(F)F)(F)F)(F)F)(F)F)(F)F)(F)F)(F)F)(F)F,165360287,CCS Type: DT; Buffer gas: N2; Ionization: ESI-; Dataset: PFAS,DOI:10.1038/s41597-024-04363-0
N-ethyl-d5-perfluoro-1-octanesulfonamidoacetic acid,d5-N-EtFOSAA,C12D5H3F17NO4S,[M-H]-,197.4,11.81,589.0144,1265205-97-7,[2H]C([2H])([2H])C([2H])([2H])N(CC(=O)O)S(=O)(=O)C(C(C(C(C(C(C(C(F)(F)F)(F)F)(F)F)(F)F)(F)F)(F)F)(F)F)(F)F,165360288,CCS Type: DT; Buffer gas: N2; Ionization: ESI-; Dataset: PFAS,DOI:10.1038/s41597-024-04363-0
2-(N-methyl-d3-perfluoro-1-octanesulfonamido)ethan-d4-ol,d7-N-MeFOSE,C11D7H1F17NO3S,[M-H]-,193.6,12.73,563.032,1265205-95-5,[2H]C([2H])([2H])N(C([2H])([2H])C([2H])([2H])O)S(=O)(=O)C(C(C(C(C(C(C(C(F)(F)F)(F)F)(F)F)(F)F)(F)F)(F)F)(F)F)(F)F,165360289,CCS Type: DT; Buffer gas: N2; Ionization: ESI-; Dataset: PFAS,DOI:10.1038/s41597-024-04363-0
2-(N-ethyl-d5-perfluoro-1-octanesulfonamido)ethan-d4-ol,d9-N-EtFOSE,C12D9H1F17NO3S,[M-H]-,197.7,13.1,579.0602,1265205-96-6,[2H]C([2H])([2H])C([2H])([2H])N(C([2H])([2H])C([2H])([2H])O)S(=O)(=O)C(C(C(C(C(C(C(C(F)(F)F)(F)F)(F)F)(F)F)(F)F)(F)F)(F)F)(F)F,165360290,CCS Type: DT; Buffer gas: N2; Ionization: ESI-; Dataset: PFAS,DOI:10.1038/s41597-024-04363-0
"2,3,3,3-Tetrafluoro-2-(1,1,2,3,3,3-heptafluoropropoxy)(13C3)propanoic acid",M3HFPO-DA,[13C]3C3HF11O3,[M-H-CO2]-,127.46,7.1,286.9846081,,[13C](=O)([13C]([13C](F)(F)F)(OC(C(C(F)(F)F)(F)F)(F)F)F)O,165368073,CCS Type: DT; Buffer gas: N2; Ionization: ESI-; Dataset: PFAS,DOI:10.1038/s41597-024-04363-0
"1H, 1H, 2H, 2H-perfluoro(1,2-13C2)hexanesulfonate",M2-4:2FTS,[13C]2C4H5F9SO3,[M-H]-,150.9921104,6.506666667,328.981,,[13CH2]([13CH2]S(=O)(=O)O)C(C(C(C(F)(F)F)(F)F)(F)F)(F)F,165360292,CCS Type: DT; Buffer gas: N2; Ionization: ESI-; Dataset: PFAS,DOI:10.1038/s41597-024-04363-0
"1H, 1H, 2H, 2H-perfluoro(1,2-13C2)octanesulfonate",M2-6:2FTS,[13C]2C6H5F13SO3,[M-H]-,169.0161946,9.31,428.9746,,[13CH2]([13CH2]S(=O)(=O)O)C(C(C(C(C(C(F)(F)F)(F)F)(F)F)(F)F)(F)F)(F)F,165360294,CCS Type: DT; Buffer gas: N2; Ionization: ESI-; Dataset: PFAS,DOI:10.1038/s41597-024-04363-0
"1H, 1H, 2H, 2H-perfluoro(1,2-13C2)decanesulfonate",M2-8:2FTS,[13C]2C8H5F17SO3,[M-H]-,186.961443,11.08333333,528.9682,,[13CH2]([13CH2]S(=O)(=O)O)C(C(C(C(C(C(C(C(F)(F)F)(F)F)(F)F)(F)F)(F)F)(F)F)(F)F)(F)F,165360296,CCS Type: DT; Buffer gas: N2; Ionization: ESI-; Dataset: PFAS,DOI:10.1038/s41597-024-04363-0
"2-Perfluorohexyl(1,2-13C2)ethanoic acid",MFHEA,[13C]2C6H3F13O2,[M-H]-,181.9441171,8.7,378.991429,872398-75-9,[13CH2]([13C](=O)O)C(C(C(C(C(C(F)(F)F)(F)F)(F)F)(F)F)(F)F)(F)F,138394397,CCS Type: DT; Buffer gas: N2; Ionization: ESI-; Dataset: PFAS,DOI:10.1038/s41597-024-04363-0
"2-Perfluorohexyl(1,2-13C2)ethanoic acid",MFHEA,[13C]2C14H6F26O4,[M-H]-,216.2944753,8.7,758.990683,872398-75-9,[13CH2]([13C](=O)O)C(C(C(C(C(C(F)(F)F)(F)F)(F)F)(F)F)(F)F)(F)F,138394397,CCS Type: DT; Buffer gas: N2; Ionization: ESI-; Dataset: PFAS,DOI:10.1038/s41597-024-04363-0
"2-Perfluoro-2-(1,2-13C2)octenoic acid",MFHUEA,[13C]2C6H2F12O2,[M-H]-,181.2989179,8.6,358.985201,872398-78-2,[13CH](=C(C(C(C(C(C(F)(F)F)(F)F)(F)F)(F)F)(F)F)F)[13C](=O)O,165360306,CCS Type: DT; Buffer gas: N2; Ionization: ESI-; Dataset: PFAS,DOI:10.1038/s41597-024-04363-0
"2-Perfluoro-2-(1,2-13C2)octenoic acid",MFHUEA,[13C]2C14H4F24O4,[M-H]-,212.5316251,8.6,718.978227,872398-78-2,[13CH](=C(C(C(C(C(C(F)(F)F)(F)F)(F)F)(F)F)(F)F)F)[13C](=O)O,165360306,CCS Type: DT; Buffer gas: N2; Ionization: ESI-; Dataset: PFAS,DOI:10.1038/s41597-024-04363-0
"2-Perfluorooctyl(1,2-13C2)ethanoic acid",MFOEA,[13C]2C8H3F17O2,[M-H]-,198.5927979,10.75,478.985041,872398-76-0,[13CH2]([13C](=O)O)C(C(C(C(C(C(C(C(F)(F)F)(F)F)(F)F)(F)F)(F)F)(F)F)(F)F)(F)F,165360304,CCS Type: DT; Buffer gas: N2; Ionization: ESI-; Dataset: PFAS,DOI:10.1038/s41597-024-04363-0
"2-Perfluorooctyl(1,2-13C2)ethanoic acid",MFOEA,[13C]2C18H6F34O2,[M-H]-,243.7371349,10.75,958.977907,872398-76-0,[13CH2]([13C](=O)O)C(C(C(C(C(C(C(C(F)(F)F)(F)F)(F)F)(F)F)(F)F)(F)F)(F)F)(F)F,165360304,CCS Type: DT; Buffer gas: N2; Ionization: ESI-; Dataset: PFAS,DOI:10.1038/s41597-024-04363-0
"2-Perfluordecyl(1,2-13C2)ethanoic acid",MFDEA,[13C]2C22H6F42O4,[M-H]-,269.566667,12.2,1158.965131,872398-77-1,[13CH2]([13C](=O)O)C(C(C(C(C(C(C(C(C(C(F)(F)F)(F)F)(F)F)(F)F)(F)F)(F)F)(F)F)(F)F)(F)F)(F)F,165360305,CCS Type: DT; Buffer gas: N2; Ionization: ESI-; Dataset: PFAS,DOI:10.1038/s41597-024-04363-0
"2H-Perfluoro-2-(1,2-13C2)dodecanoic acid",MFDUEA,[13C]2C22H4F40O4,[M-H]-,265.5604094,12.18,1118.952675,872398-80-6,[13CH](=C(C(C(C(C(C(C(C(C(C(F)(F)F)(F)F)(F)F)(F)F)(F)F)(F)F)(F)F)(F)F)(F)F)F)[13C](=O)O,165360307,CCS Type: DT; Buffer gas: N2; Ionization: ESI-; Dataset: PFAS,DOI:10.1038/s41597-024-04363-0
"2H-Perfluoro-2-(1,2-13C2)decenoic acid",MFOUEA,[13C]2C8H4F32O4,[M-H]-,239.7811491,10.72,918.965451,872398-79-3,[13CH](=C(C(C(C(C(C(C(C(F)(F)F)(F)F)(F)F)(F)F)(F)F)(F)F)(F)F)F)C(=O)O,165360297,CCS Type: DT; Buffer gas: N2; Ionization: ESI-; Dataset: PFAS,DOI:10.1038/s41597-024-04363-0
"bis[1H, 1H, 2H, 2H-(1,2-13C2)perfluorooctyl] phosphate",M4-6:2diPAP,[13C]2C14H9F26O4P,[M-H]-,232.0636969,13.4,792.98792,,[13CH2]([13CH2]OP(=O)(O)O[13CH2][13CH2]C(C(C(C(C(C(F)(F)F)(F)F)(F)F)(F)F)(F)F)(F)F)C(C(C(C(C(C(F)(F)F)(F)F)(F)F)(F)F)(F)F)(F)F,138394469,CCS Type: DT; Buffer gas: N2; Ionization: ESI-; Dataset: PFAS,DOI:10.1038/s41597-024-04363-0
"bis[1H, 1H, 2H, 2H-(1,2-13C2)perfluorooctyl] phosphate",M4-6:2diPAP,[13C]2C30H18F52O8P2,[M-H]-,333.2971021,13.4,1586.983665,,[13CH2]([13CH2]OP(=O)(O)O[13CH2][13CH2]C(C(C(C(C(C(F)(F)F)(F)F)(F)F)(F)F)(F)F)(F)F)C(C(C(C(C(C(F)(F)F)(F)F)(F)F)(F)F)(F)F)(F)F,138394469,CCS Type: DT; Buffer gas: N2; Ionization: ESI-; Dataset: PFAS,DOI:10.1038/s41597-024-04363-0
"bis[1H, 1H, 2H, 2H-(1,2-13C2)perfluorodecyl] phosphate",M4-8:2diPAP,[13C]2C18H9F34O4P,[M-H]-,261.5544012,14.5,992.975144,,[13CH2]([13CH2]OP(=O)(O)O[13CH2][13CH2]C(C(C(C(C(C(C(C(F)(F)F)(F)F)(F)F)(F)F)(F)F)(F)F)(F)F)(F)F)C(C(C(C(C(C(C(C(F)(F)F)(F)F)(F)F)(F)F)(F)F)(F)F)(F)F)(F)F,138394471,CCS Type: DT; Buffer gas: N2; Ionization: ESI-; Dataset: PFAS,DOI:10.1038/s41597-024-04363-0
Perfluoro-1-methylheptane sulfonate,P1MHpS,C8HF17O3S,[M-H]-,163.4100284,10.38333333,498.9296714,927670-12-0,C(C(C(C(C(F)(F)F)(F)S(=O)(=O)O)(F)F)(F)F)(C(C(C(F)(F)F)(F)F)(F)F)(F)F,87088748,CCS Type: DT; Buffer gas: N2; Ionization: ESI-; Dataset: PFAS,DOI:10.1038/s41597-024-04363-0
Perfluoro-3-methylheptane sulfonate,P3MHpS,C8HF17O3S,[M-H]-,163.9264335,10.13,498.9296714,,C(C(C(C(C(F)(F)F)(F)F)(F)F)(F)F)(C(C(F)(F)S(=O)(=O)O)(F)F)(C(F)(F)F)F,102175775,CCS Type: DT; Buffer gas: N2; Ionization: ESI-; Dataset: PFAS,DOI:10.1038/s41597-024-04363-0
Perfluoro-4-methylheptane sulfonate,P4MHpS,C8HF17O3S,[M-H]-,164.2945668,10.09666667,498.9296714,,C(C(C(C(F)(F)F)(F)F)(F)F)(C(C(C(F)(F)S(=O)(=O)O)(F)F)(F)F)(C(F)(F)F)F,102175774,CCS Type: DT; Buffer gas: N2; Ionization: ESI-; Dataset: PFAS,DOI:10.1038/s41597-024-04363-0
Perfluoro-5-methylheptane sulfonate,P5MHpS,C8HF17O3S,[M-H]-,164.5408556,10.07,498.9296714,747385-21-3,C(C(C(C(C(F)(F)S(=O)(=O)O)(F)F)(F)F)(F)F)(C(C(F)(F)F)(F)F)(C(F)(F)F)F,102175773,CCS Type: DT; Buffer gas: N2; Ionization: ESI-; Dataset: PFAS,DOI:10.1038/s41597-024-04363-0
Perfluoro-6-methylheptane sulfonate,P6MHpS,C8HF17O3S,[M-H]-,166.0898023,10.16333333,498.9296714,255831-20-0,C(C(C(C(C(C(F)(F)S(=O)(=O)O)(F)F)(F)F)(F)F)(F)F)(C(F)(F)F)(C(F)(F)F)F,44147115,CCS Type: DT; Buffer gas: N2; Ionization: ESI-; Dataset: PFAS,DOI:10.1038/s41597-024-04363-0
"Perfluoro-3,5-dimethylhexane sulfonate",P35DMHxS,C8HF17O3S,[M-H]-,161.8833273,9.913333333,498.9296714,,C(C(C(C(F)(F)F)(C(F)(F)F)F)(F)F)(C(C(F)(F)S(=O)(=O)O)(F)F)(C(F)(F)F)F,101481200,CCS Type: DT; Buffer gas: N2; Ionization: ESI-; Dataset: PFAS,DOI:10.1038/s41597-024-04363-0
"Perfluoro-4,4-dimethylhexane sulfonate",P44DMHxS,C8HF17O3S,[M-H]-,161.3199093,9.8,498.9296714,,C(C(C(C(F)(F)S(=O)(=O)O)(F)F)(F)F)(C(C(F)(F)F)(F)F)(C(F)(F)F)C(F)(F)F,101481201,CCS Type: DT; Buffer gas: N2; Ionization: ESI-; Dataset: PFAS,DOI:10.1038/s41597-024-04363-0
"Perfluoro-4,5-dimethylhexane sulfonate",P45DMHxS,C8HF17O3S,[M-H]-,162.1570955,9.833333333,498.9296714,,C(C(C(F)(F)F)(C(F)(F)F)F)(C(C(C(F)(F)S(=O)(=O)O)(F)F)(F)F)(C(F)(F)F)F,101481202,CCS Type: DT; Buffer gas: N2; Ionization: ESI-; Dataset: PFAS,DOI:10.1038/s41597-024-04363-0
"Perfluoro-5,5-dimethylhexane sulfonate",P55DMHpS,C8HF17O3S,[M-H]-,163.6075735,9.833333333,498.9296714,,C(C(C(C(C(F)(F)S(=O)(=O)O)(F)F)(F)F)(F)F)(C(F)(F)F)(C(F)(F)F)C(F)(F)F,101481203,CCS Type: DT; Buffer gas: N2; Ionization: ESI-; Dataset: PFAS,DOI:10.1038/s41597-024-04363-0
perflurononanoic acid ,PFNA,C9HF17O2,[M-H-CO2]-,147.0221206,10.3,418.973402,375-95-1,C(=O)(C(C(C(C(C(C(C(C(F)(F)F)(F)F)(F)F)(F)F)(F)F)(F)F)(F)F)(F)F)O,67821,CCS Type: DT; Buffer gas: N2; Ionization: ESI-; Dataset: PFAS,DOI:10.1038/s41597-024-04363-0
perflurooctanoic acid ,PFOA-L,C8HF15O2,[M-H-CO2]-,139.5013897,9.366666667,368.976596,335-67-1,C(=O)(C(C(C(C(C(C(C(F)(F)F)(F)F)(F)F)(F)F)(F)F)(F)F)(F)F)O,9554,CCS Type: DT; Buffer gas: N2; Ionization: ESI-; Dataset: PFAS,DOI:10.1038/s41597-024-04363-0
Perfluoro-3-methylheptanoic acid,P3MHpA,C8HF15O2,[M-H-CO2]-,138.6458395,9.236666667,368.9765,705240-04-6,C(=O)(C(C(C(C(C(C(F)(F)F)(F)F)(F)F)(F)F)(C(F)(F)F)F)(F)F)O,24848983,CCS Type: DT; Buffer gas: N2; Ionization: ESI-; Dataset: PFAS,DOI:10.1038/s41597-024-04363-0
Perfluoro-4-methylheptanoic acid,P4MHpA,C8HF15O2,[M-H-CO2]-,136.8596833,9.22,368.9765,1144512-18-4,C(=O)(C(C(C(C(C(C(F)(F)F)(F)F)(F)F)(C(F)(F)F)F)(F)F)(F)F)O,24848984,CCS Type: DT; Buffer gas: N2; Ionization: ESI-; Dataset: PFAS,DOI:10.1038/s41597-024-04363-0
Perfluoro-5-methylheptanoic acid,P5MHpA,C8HF15O2,[M-H-CO2]-,136.7601618,9.123333333,368.9765,909009-42-3,C(=O)(C(C(C(C(C(C(F)(F)F)(F)F)(C(F)(F)F)F)(F)F)(F)F)(F)F)O,101561191,CCS Type: DT; Buffer gas: N2; Ionization: ESI-; Dataset: PFAS,DOI:10.1038/s41597-024-04363-0
Perfluoro-6-methylheptanoic acid,P6MHpA,C8HF15O2,[M-H-CO2]-,138.6467733,9.17,368.9765,15166-06-0,C(=O)(C(C(C(C(C(C(F)(F)F)(C(F)(F)F)F)(F)F)(F)F)(F)F)(F)F)O,14671316,CCS Type: DT; Buffer gas: N2; Ionization: ESI-; Dataset: PFAS,DOI:10.1038/s41597-024-04363-0
"Perfluoro-3,5-dimethylhexanoic acid",P35DMHxA,C8HF15O2,[M-H-CO2]-,136.3134694,9.046666667,368.9765,1144512-35-5,C(=O)(C(C(C(C(C(F)(F)F)(C(F)(F)F)F)(F)F)(C(F)(F)F)F)(F)F)O,138396467,CCS Type: DT; Buffer gas: N2; Ionization: ESI-; Dataset: PFAS,DOI:10.1038/s41597-024-04363-0
"Perfluoro-4,4-dimethylhexanoic acid",P44DMHxA,C8HF15O2,[M-H-CO2]-,135.867048,8.903333333,368.9765,1192593-79-5,C(=O)(C(C(C(C(C(F)(F)F)(F)F)(C(F)(F)F)C(F)(F)F)(F)F)(F)F)O,132993927,CCS Type: DT; Buffer gas: N2; Ionization: ESI-; Dataset: PFAS,DOI:10.1038/s41597-024-04363-0
"Perfluoro-4,5-dimethylhexanoic acid",P45DMHxA,C8HF15O2,[M-H-CO2]-,135.7434623,8.926666667,368.9765,1144512-36-6,C(=O)(C(C(C(C(C(F)(F)F)(C(F)(F)F)F)(C(F)(F)F)F)(F)F)(F)F)O,129850088,CCS Type: DT; Buffer gas: N2; Ionization: ESI-; Dataset: PFAS,DOI:10.1038/s41597-024-04363-0
"Perfluoro-5,5-dimethylhexanoic acid",P55DMHpA,C8HF15O2,[M-H-CO2]-,135.6440049,8.923333333,368.9765,1144512-34-4,C(=O)(C(C(C(C(C(F)(F)F)(C(F)(F)F)C(F)(F)F)(F)F)(F)F)(F)F)O,101369574,CCS Type: DT; Buffer gas: N2; Ionization: ESI-; Dataset: PFAS,DOI:10.1038/s41597-024-04363-0
2H-Perfluoro-2-octenoic acid,FHUEA,C8H2F12O2,[M-H]-,180.4157449,8.6,356.978493,70887-88-6,C(=C(C(C(C(C(C(F)(F)F)(F)F)(F)F)(F)F)(F)F)F)C(=O)O,85976247,CCS Type: DT; Buffer gas: N2; Ionization: ESI-; Dataset: PFAS,DOI:10.1038/s41597-024-04363-0
2H-Perfluoro-2-octenoic acid,FHUEA (dimer),C16H4F24O4,[M-H]-,212.2856082,8.6,714.9648106,70887-88-6,C(=C(C(C(C(C(C(F)(F)F)(F)F)(F)F)(F)F)(F)F)F)C(=O)O,85976247,CCS Type: DT; Buffer gas: N2; Ionization: ESI-; Dataset: PFAS,DOI:10.1038/s41597-024-04363-0
2H-Perfluoro-2-dodecanoic acid,FDUEA,C12H2F20O2,[M-H]-,190.4154691,12.12,556.9657186,70887-94-4,C(=C(/C(C(C(C(C(C(C(C(C(F)(F)F)(F)F)(F)F)(F)F)(F)F)(F)F)(F)F)(F)F)(F)F)\F)\C(=O)O,101674537,CCS Type: DT; Buffer gas: N2; Ionization: ESI-; Dataset: PFAS,DOI:10.1038/s41597-024-04363-0
2H-Perfluoro-2-dodecanoic acid ,FDUEA (dimer),C24H4F40O4,[M-H]-,265.3783176,12.12,1114.939262,70887-94-4,C(=C(/C(C(C(C(C(C(C(C(C(F)(F)F)(F)F)(F)F)(F)F)(F)F)(F)F)(F)F)(F)F)(F)F)\F)\C(=O)O,101674537,CCS Type: DT; Buffer gas: N2; Ionization: ESI-; Dataset: PFAS,DOI:10.1038/s41597-024-04363-0
5H-Octafluoropentanoic acid,"5H-PFPeA (dimer, Na)",C10H4F16O4,[M-2H+Na]-,178.4177875,2.62,512.9595304,376-72-7,C(C(C(C(C(=O)O)(F)F)(F)F)(F)F)(F)F,120227,CCS Type: DT; Buffer gas: N2; Ionization: ESI-; Dataset: PFAS,DOI:10.1038/s41597-024-04363-0
5H-Octafluoropentanoic acid,"5H-PFPeA (dimer, K)",C10H4F16O4,[M-2H+K]-,182.9939554,2.62,512.9595304,376-72-7,C(C(C(C(C(=O)O)(F)F)(F)F)(F)F)(F)F,120227,CCS Type: DT; Buffer gas: N2; Ionization: ESI-; Dataset: PFAS,DOI:10.1038/s41597-024-04363-0
5H-Octafluoropentanoic acid,"5H-PFPeA (trimer, 2Na)",C15H6F24O6,[M-3H+2Na]-,217.3864367,2.62,780.9341806,376-72-7,C(C(C(C(C(=O)O)(F)F)(F)F)(F)F)(F)F,120227,CCS Type: DT; Buffer gas: N2; Ionization: ESI-; Dataset: PFAS,DOI:10.1038/s41597-024-04363-0
5H-Octafluoropentanoic acid,"5H-PFPeA (trimer, Na, K)",C15H6F24O6,[M-3H+Na+K]-,220.0141566,2.62,796.9081186,376-72-7,C(C(C(C(C(=O)O)(F)F)(F)F)(F)F)(F)F,120227,CCS Type: DT; Buffer gas: N2; Ionization: ESI-; Dataset: PFAS,DOI:10.1038/s41597-024-04363-0
5H-Octafluoropentanoic acid,"5H-PFPeA (tetramer, 3Na)",C20H8F32O8,[M-4H+3Na]-,256.100293,2.62,1048.908831,376-72-7,C(C(C(C(C(=O)O)(F)F)(F)F)(F)F)(F)F,120227,CCS Type: DT; Buffer gas: N2; Ionization: ESI-; Dataset: PFAS,DOI:10.1038/s41597-024-04363-0
5H-Octafluoropentanoic acid,"5H-PFPeA (tetramer, 2Na, K)",C20H8F32O8,[M-4H+2Na+K]-,257.9658294,2.62,1064.882769,376-72-7,C(C(C(C(C(=O)O)(F)F)(F)F)(F)F)(F)F,120227,CCS Type: DT; Buffer gas: N2; Ionization: ESI-; Dataset: PFAS,DOI:10.1038/s41597-024-04363-0
5H-Octafluoropentanoic acid,"5H-PFPeA (tetramer, Na, 2K",C20H8F32O8,[M-4H+Na+2K]-,260.5350906,2.62,1080.856707,376-72-7,C(C(C(C(C(=O)O)(F)F)(F)F)(F)F)(F)F,120227,CCS Type: DT; Buffer gas: N2; Ionization: ESI-; Dataset: PFAS,DOI:10.1038/s41597-024-04363-0
5H-Octafluoropentanoic acid,"5H-PFPeA (pentamer, 4Na)",C25H10F40O10,[M-5H+4Na]-,286.1653328,2.62,1316.883481,376-72-2,C(C(C(C(C(=O)O)(F)F)(F)F)(F)F)(F)F,120227,CCS Type: DT; Buffer gas: N2; Ionization: ESI-; Dataset: PFAS,DOI:10.1038/s41597-024-04363-0
5H-Octafluoropentanoic acid,"5H-PFPeA (pentamer, 3Na, K)",C25H10F40O10,[M-5H+3Na+K]-,287.9194405,2.62,1332.857419,376-72-2,C(C(C(C(C(=O)O)(F)F)(F)F)(F)F)(F)F,120227,CCS Type: DT; Buffer gas: N2; Ionization: ESI-; Dataset: PFAS,DOI:10.1038/s41597-024-04363-0
"4,4,5,5,6,6,6-heptafluorohexanoic acid","3:3FTCA (dimer, Na)",C12H10F14O4,[M-2H+Na]-,197.5967282,4.21,505.0096716,356-02-5,C(CC(C(C(F)(F)F)(F)F)(F)F)C(=O)O,2774909,CCS Type: DT; Buffer gas: N2; Ionization: ESI-; Dataset: PFAS,DOI:10.1038/s41597-024-04363-0
"4,4,5,5,6,6,6-heptafluorohexanoic acid","3:3FTCA (trimer, 2Na)",C18H15F21O6,[M-3H+2Na]-,245.7350127,4.21,769.0093924,356-02-5,C(CC(C(C(F)(F)F)(F)F)(F)F)C(=O)O,2774909,CCS Type: DT; Buffer gas: N2; Ionization: ESI-; Dataset: PFAS,DOI:10.1038/s41597-024-04363-0
8H-Perfluorooctanoic acid,8HPFOAa,C8H2F14O2,[M-COOH-HF]-,133.2228121,7.62,330.9792416,13973-14-3,C(C(C(C(C(C(C(C(=O)O)(F)F)(F)F)(F)F)(F)F)(F)F)(F)F)(F)F,14922999,CCS Type: DT; Buffer gas: N2; Ionization: ESI-; Dataset: PFAS,DOI:10.1038/s41597-024-04363-0
8H-Perfluorooctanoic acid,8HPFOAb,C8H2F14O2,[M-COOH-HF]-,137.8101679,7.62,330.9792416,13973-14-3,C(C(C(C(C(C(C(C(=O)O)(F)F)(F)F)(F)F)(F)F)(F)F)(F)F)(F)F,14922999,CCS Type: DT; Buffer gas: N2; Ionization: ESI-; Dataset: PFAS,DOI:10.1038/s41597-024-04363-0
8H-Perfluorooctanoic acid,8HPFOA(dimer),C16H4F28O4,[M-H]-,200.830478,7.62,790.9584234,13973-14-3,C(C(C(C(C(C(C(C(=O)O)(F)F)(F)F)(F)F)(F)F)(F)F)(F)F)(F)F,14922999,CCS Type: DT; Buffer gas: N2; Ionization: ESI-; Dataset: PFAS,DOI:10.1038/s41597-024-04363-0
N-[3-(Trimethylammonio)propan-1-yl]perfluoro-1-hexanesulfonazanide,N-TAmP-FHxSA,C12H15F13N2O2S,[M-H]-,188.0366076,9.5,497.056836,38850-51-0,C[N+](C)(C)CCC[N-]S(=O)(=O)C(C(C(C(C(C(F)(F)F)(F)F)(F)F)(F)F)(F)F)(F)F,165364182,CCS Type: DT; Buffer gas: N2; Ionization: ESI-; Dataset: PFAS,DOI:10.1038/s41597-024-04363-0
N-(2-Ndroxyethyl)-N-methylperfluorohexane-1-sulfonamide,N-MeFHxSE,C9H8F13NO3S,[M-C2H4-OH]-,156.218697,11.57,411.9676914,68555-75-9,CN(CCO)S(=O)(=O)C(C(C(C(C(C(F)(F)F)(F)F)(F)F)(F)F)(F)F)(F)F,110556,CCS Type: DT; Buffer gas: N2; Ionization: ESI-; Dataset: PFAS,DOI:10.1038/s41597-024-04363-0
N-Ethyl-N-(perfluoro-n-hexane-1-sulfonyl)glycine,N-EtFHSAA,C10H8F13NO4S,[M-H ]-,179.6800999,10.3,483.9888198,68957-32-4,CCN(CC(=O)O)S(=O)(=O)C(C(C(C(C(C(F)(F)F)(F)F)(F)F)(F)F)(F)F)(F)F,105445,CCS Type: DT; Buffer gas: N2; Ionization: ESI-; Dataset: PFAS,DOI:10.1038/s41597-024-04363-0
N-Ethyl-N-(perfluoro-n-hexane-1-sulfonyl)glycine,N-EtFHSAA,C10H8F13NO4S,[M-CH2-COOH]-,160.7257947,10.3,425.9833406,68957-32-4,CCN(CC(=O)O)S(=O)(=O)C(C(C(C(C(C(F)(F)F)(F)F)(F)F)(F)F)(F)F)(F)F,105445,CCS Type: DT; Buffer gas: N2; Ionization: ESI-; Dataset: PFAS,DOI:10.1038/s41597-024-04363-0
N-Ethyl-N-(perfluoro-n-hexane-1-sulfonyl)glycine,N-EtFHSAA,C20H16F26N2O8S2,[M-H]-,258.1112104,10.3,968.9854642,68957-32-4,CCN(CC(=O)O)S(=O)(=O)C(C(C(C(C(C(F)(F)F)(F)F)(F)F)(F)F)(F)F)(F)F,105445,CCS Type: DT; Buffer gas: N2; Ionization: ESI-; Dataset: PFAS,DOI:10.1038/s41597-024-04363-0
N-Ethyl-N-(perfluoro-n-hexane-1-sulfonyl)glycine,N-EtFHSAA,C20H16F26N2O8S2,[M-2H+Na]-,272.1101628,10.3,990.9674096,68957-32-4,CCN(CC(=O)O)S(=O)(=O)C(C(C(C(C(C(F)(F)F)(F)F)(F)F)(F)F)(F)F)(F)F,105445,CCS Type: DT; Buffer gas: N2; Ionization: ESI-; Dataset: PFAS,DOI:10.1038/s41597-024-04363-0
N-Perfluorohexnaesulfonylglycine,FHxSAA,C8H4F13NO4S,[M-H]-,165.1103073,9.2,455.9575214,1003193-99-4,C(C(=O)O)NS(=O)(=O)C(C(C(C(C(C(F)(F)F)(F)F)(F)F)(F)F)(F)F)(F)F,139596791,CCS Type: DT; Buffer gas: N2; Ionization: ESI-; Dataset: PFAS,DOI:10.1038/s41597-024-04363-0
N-Methyl-N-(n-perfluorohexane-1-sulfonyl)glycine,N-MeFHxSAA,C9H6F13NO4S,[M-H]-,176.1056846,9.46,469.9731706,715646-50-7,CN(CC(=O)O)S(=O)(=O)C(C(C(C(C(C(F)(F)F)(F)F)(F)F)(F)F)(F)F)(F)F,87481295,CCS Type: DT; Buffer gas: N2; Ionization: ESI-; Dataset: PFAS,DOI:10.1038/s41597-024-04363-0
N-Methyl-N-(n-perfluorohexane-1-sulfonyl)glycine,N-MeFHxSAA,C18H12F26N2O8S2,[M-H]-,250.7372333,9.46,940.9541658,715646-50-7,CN(CC(=O)O)S(=O)(=O)C(C(C(C(C(C(F)(F)F)(F)F)(F)F)(F)F)(F)F)(F)F,87481295,CCS Type: DT; Buffer gas: N2; Ionization: ESI-; Dataset: PFAS,DOI:10.1038/s41597-024-04363-0
N-Methyl-N-(n-perfluorohexane-1-sulfonyl)glycine,N-MeFHxSAA,C18H12F26N2O8S3,[M-2H+Na]-,268.0421246,9.46,962.9361112,715646-50-7,CN(CC(=O)O)S(=O)(=O)C(C(C(C(C(C(F)(F)F)(F)F)(F)F)(F)F)(F)F)(F)F,87481295,CCS Type: DT; Buffer gas: N2; Ionization: ESI-; Dataset: PFAS,DOI:10.1038/s41597-024-04363-0
"1H,1H,2H,2H-Perfluorooctyl phosphate",6:2PAP,C8H6F13O4P,[M-H]-,172.4353721,9,442.9717876,150033-29-7,C(C(C(F)(F)P(=O)(O)O)(F)F)(C(F)(F)F)(F)F,14250578,CCS Type: DT; Buffer gas: N2; Ionization: ESI-; Dataset: PFAS,DOI:10.1038/s41597-024-04363-0
"1H,1H,2H,2H-Perfluorooctyl phosphate",6:2PAP(dimer),C16H12F26O8P2,[M-H]-,243.4587036,9,886.9513998,150033-29-7,C(C(C(F)(F)P(=O)(O)O)(F)F)(C(F)(F)F)(F)F,14250578,CCS Type: DT; Buffer gas: N2; Ionization: ESI-; Dataset: PFAS,DOI:10.1038/s41597-024-04363-0
"1H,1H,2H,2H-Perfluorodecylphosphate",8:2PAP,C10H6F17O4P,[M-H]-,189.5023068,11,542.9654004,438237-75-3,C(COP(=O)(O)O)C(C(C(C(C(C(C(C(F)(F)F)(F)F)(F)F)(F)F)(F)F)(F)F)(F)F)(F)F,10143739,CCS Type: DT; Buffer gas: N2; Ionization: ESI-; Dataset: PFAS,DOI:10.1038/s41597-024-04363-0
"1H,1H,2H,2H-perfluorodecylphosphate",8:2PAP(dimer),C20H12F34O8P2,[M-H]-,269.1230452,11,1086.938625,438237-75-3,C(COP(=O)(O)O)C(C(C(C(C(C(C(C(F)(F)F)(F)F)(F)F)(F)F)(F)F)(F)F)(F)F)(F)F,10143739,CCS Type: DT; Buffer gas: N2; Ionization: ESI-; Dataset: PFAS,DOI:10.1038/s41597-024-04363-0
2-(N-ethylperfluorooctane-1-sulfonamido)ethyl phosphate,SAmPAP,C12H11F17NO6PS,[M-H]-,210.8096297,12,649.9694994,2624-80-8,CCN(CCOP(=O)(O)O)S(=O)(=O)C(C(C(C(C(C(C(C(F)(F)F)(F)F)(F)F)(F)F)(F)F)(F)F)(F)F)(F)F,77442,CCS Type: DT; Buffer gas: N2; Ionization: ESI-; Dataset: PFAS,DOI:10.1038/s41597-024-04363-0
2-(N-ethylperfluorooctane-1-sulfonamido)ethyl phosphate,SAmPAP(dimer),C24H22F34N2O12P2S2,[M-H]-,307.006397,12,1300.946823,2624-80-8,CCN(CCOP(=O)(O)O)S(=O)(=O)C(C(C(C(C(C(C(C(F)(F)F)(F)F)(F)F)(F)F)(F)F)(F)F)(F)F)(F)F,77442,CCS Type: DT; Buffer gas: N2; Ionization: ESI-; Dataset: PFAS,DOI:10.1038/s41597-024-04363-0
"6-(1,1,1,3,3,3-hexafluoropropan-2-yloxy)-2-N-methyl-1,3,5-triazine-2,4-diamine",625950a,C7H7F6N5O,[M-H]-,148.0707928,7.21,290.0476518,301211-06-3,CNC1=NC(=NC(=N1)N)OC(C(F)(F)F)C(F)(F)F,625950,CCS Type: DT; Buffer gas: N2; Ionization: ESI-; Dataset: PFAS,DOI:10.1038/s41597-024-04363-0
"6-(1,1,1,3,3,3-hexafluoropropan-2-yloxy)-2-N-methyl-1,3,5-triazine-2,4-diamine",625950a,C7H7F6N5O,[M-H]-,148.6769321,7.21,290.0476518,301211-06-3,CNC1=NC(=NC(=N1)N)OC(C(F)(F)F)C(F)(F)F,625950,CCS Type: DT; Buffer gas: N2; Ionization: ESI-; Dataset: PFAS,DOI:10.1038/s41597-024-04363-0
"6-(1,1,1,3,3,3-hexafluoropropan-2-yloxy)-2-N-methyl-1,3,5-triazine-2,4-diamine",625950b,C7H7F6N5O,[M-H]-,151.2286914,7.21,290.0476518,301211-06-3,CNC1=NC(=NC(=N1)N)OC(C(F)(F)F)C(F)(F)F,625950,CCS Type: DT; Buffer gas: N2; Ionization: ESI-; Dataset: PFAS,DOI:10.1038/s41597-024-04363-0
"2H-Perfluoro-2-(1,2-13C2)dodecanoic acid",MFDUEA,[13C]2C10H2F20O2,[M-H]-,189.9521147,12.18,558.96572,872398-80-6,[13CH](=C(C(C(C(C(C(C(C(C(C(F)(F)F)(F)F)(F)F)(F)F)(F)F)(F)F)(F)F)(F)F)(F)F)F)[13C](=O)O,165360307,CCS Type: DT; Buffer gas: N2; Ionization: APCI-; Dataset: PFAS,DOI:10.1038/s41597-024-04363-0
"Bis[1H, 1H, 2H, 2H-(1,2-13C2)perfluorooctyl] phosphate",M4-6:2diPAP,[13C]4C12H9F26O4P,[M-H]-,232.0489923,13.4,792.98792,,[13CH2]([13CH2]OP(=O)(O)O[13CH2][13CH2]C(C(C(C(C(C(F)(F)F)(F)F)(F)F)(F)F)(F)F)(F)F)C(C(C(C(C(C(F)(F)F)(F)F)(F)F)(F)F)(F)F)(F)F,138394469,CCS Type: DT; Buffer gas: N2; Ionization: APCI-; Dataset: PFAS,DOI:10.1038/s41597-024-04363-0
"Bis[1H, 1H, 2H, 2H-(1,2-13C2)perfluorodecyl] phosphate",M4-8:2diPAP,[13C]4C16H9F34O4P,[M-H]-,261.1847444,14.5,992.975144,,[13CH2]([13CH2]OP(=O)(O)O[13CH2][13CH2]C(C(C(C(C(C(C(C(F)(F)F)(F)F)(F)F)(F)F)(F)F)(F)F)(F)F)(F)F)C(C(C(C(C(C(C(C(F)(F)F)(F)F)(F)F)(F)F)(F)F)(F)F)(F)F)(F)F,138394471,CCS Type: DT; Buffer gas: N2; Ionization: APCI-; Dataset: PFAS,DOI:10.1038/s41597-024-04363-0
2H-Perfluoro-2-dodecanoic acid,FDUEA,C12H2F20O2,[M-H]-,189.8949485,12.12,556.9657186,70887-94-4,C(=C(/C(C(C(C(C(C(C(C(C(F)(F)F)(F)F)(F)F)(F)F)(F)F)(F)F)(F)F)(F)F)(F)F)\F)\C(=O)O,101674537,CCS Type: DT; Buffer gas: N2; Ionization: APCI-; Dataset: PFAS,DOI:10.1038/s41597-024-04363-0
"1H,1H,2H,2H-perfluorooctyl phosphate",6:2PAP,C8H6F13O4P,[M-H]-,172.8958269,9,442.9717876,150033-29-7,C(COP(=O)(O)O)C(C(C(C(C(C(F)(F)F)(F)F)(F)F)(F)F)(F)F)(F)F,14250578,CCS Type: DT; Buffer gas: N2; Ionization: APCI-; Dataset: PFAS,DOI:10.1038/s41597-024-04363-0
"1H,1H,2H,2H-perfluorodecylphosphate",8:2PAP,C10H6F17O4P,[M-H]-,190.0365654,11,542.9654004,438237-75-3,C(COP(=O)(O)O)C(C(C(C(C(C(C(C(F)(F)F)(F)F)(F)F)(F)F)(F)F)(F)F)(F)F)(F)F,10143739,CCS Type: DT; Buffer gas: N2; Ionization: APCI-; Dataset: PFAS,DOI:10.1038/s41597-024-04363-0
2-(N-ethylperfluorooctane-1-sulfonamido)ethyl phosphate,SAmPAP,C12H11F17NO6PS,[M-H]-,211.0685807,12,649.9694994,2624-80-8,CCN(CCOP(=O)(O)O)S(=O)(=O)C(C(C(C(C(C(C(C(F)(F)F)(F)F)(F)F)(F)F)(F)F)(F)F)(F)F)(F)F,77442,CCS Type: DT; Buffer gas: N2; Ionization: APCI-; Dataset: PFAS,DOI:10.1038/s41597-024-04363-0
Bis-[2-(n-ethylperfluorooctane-1-sulfonamido)ethyl] phosphate,diSAmPAP,C24H19F34N2O8PS2,[M-H]-,305.2676351,14.95,1202.969927,23282-60-2,CCN(CCOP(=O)(O)OCCN(CC)S(=O)(=O)C(C(C(C(C(C(C(C(F)(F)F)(F)F)(F)F)(F)F)(F)F)(F)F)(F)F)(F)F)S(=O)(=O)C(C(C(C(C(C(C(C(F)(F)F)(F)F)(F)F)(F)F)(F)F)(F)F)(F)F)(F)F,102352,CCS Type: DT; Buffer gas: N2; Ionization: APCI-; Dataset: PFAS,DOI:10.1038/s41597-024-04363-0
5H-Octafluoropentanoic acid,5H-PFPeA,C10H4F16O4,[M-H]-,169.7382422,2.62,490.977585,376-72-7,C(C(C(C(C(=O)O)(F)F)(F)F)(F)F)(F)F,120227,CCS Type: DT; Buffer gas: N2; Ionization: APCI-; Dataset: PFAS,DOI:10.1038/s41597-024-04363-0
5H-Octafluoropentanoic acid,5H-PFPeA,C10H4F16O4,[M-2H+Na]-,178.8456717,2.62,512.9595304,376-72-7,C(C(C(C(C(=O)O)(F)F)(F)F)(F)F)(F)F,120227,CCS Type: DT; Buffer gas: N2; Ionization: APCI-; Dataset: PFAS,DOI:10.1038/s41597-024-04363-0
"4,4,5,5,6,6,6-heptafluorohexanoic acid",3:3FTCA,C12H10F14O4,[M-H]-,184.8286027,4.21,483.0277262,356-02-5,C(CC(C(C(F)(F)F)(F)F)(F)F)C(=O)O,2774909,CCS Type: DT; Buffer gas: N2; Ionization: APCI-; Dataset: PFAS,DOI:10.1038/s41597-024-04363-0
"Tris(trifluoromethyl)-1,3,5-triazine",ATM2,C6F9N3,[M+CH3O]-,143.7333333,,316.013789,368-66-1,C1(=NC(=NC(=N1)C(F)(F)F)C(F)(F)F)C(F)(F)F,9715,CCS Type: DT; Buffer gas: N2; Ionization: APCI-; Dataset: PFAS,DOI:10.1038/s41597-024-04363-0
"Hexakis(2,2-Difluoroethoxy)phosphazene",ATM3,C12H18F12N3O6P3,[M+Cl]-,210.9333333,,655.9905352,186817-57-2,C(C(F)F)OP1(=NP(=NP(=N1)(OCC(F)F)OCC(F)F)(OCC(F)F)OCC(F)F)OCC(F)F,44717242,CCS Type: DT; Buffer gas: N2; Ionization: APCI-; Dataset: PFAS,DOI:10.1038/s41597-024-04363-0
"Hexakis(1H,1H,3H-Tetrafluoropropoxy)phosphazene",ATM4,C18H18F24N3O6P3,[M+Cl]-,246.9333333,,955.9713736,58943-98-9,C(C(C(F)F)(F)F)OP1(=NP(=NP(=N1)(OCC(C(F)F)(F)F)OCC(C(F)F)(F)F)(OCC(C(F)F)(F)F)OCC(C(F)F)(F)F)OCC(C(F)F)(F)F,2775076,CCS Type: DT; Buffer gas: N2; Ionization: APCI-; Dataset: PFAS,DOI:10.1038/s41597-024-04363-0
"Hexakis(1H,1H,4H-hexafluorobutyloxy)phosphazine",ATM5,C24H18F36N3O6P3,[M+Cl]-,279.7,,1255.952212,186406-47-3,C(C(C(C(F)F)(F)F)(F)F)OP1(=NP(=NP(=N1)(OCC(C(C(F)F)(F)F)(F)F)OCC(C(C(F)F)(F)F)(F)F)(OCC(C(C(F)F)(F)F)(F)F)OCC(C(C(F)F)(F)F)(F)F)OCC(C(C(F)F)(F)F)(F)F,51342023,CCS Type: DT; Buffer gas: N2; Ionization: APCI-; Dataset: PFAS,DOI:10.1038/s41597-024-04363-0
"Hexakis(1H, 1H, 5H-Octafluoropentoxy) Phosphazene",ATM6,C30H18F48N3O6P3,[M+Cl]-,311.47,,1555.93305,16059-16-8,C(C(C(C(C(F)F)(F)F)(F)F)(F)F)OP1(=NP(=NP(=N1)(OCC(C(C(C(F)F)(F)F)(F)F)(F)F)OCC(C(C(C(F)F)(F)F)(F)F)(F)F)(OCC(C(C(C(F)F)(F)F)(F)F)(F)F)OCC(C(C(C(F)F)(F)F)(F)F)(F)F)OCC(C(C(C(F)F)(F)F)(F)F)(F)F,2775070,CCS Type: DT; Buffer gas: N2; Ionization: APCI-; Dataset: PFAS,DOI:10.1038/s41597-024-04363-0
N-(2-Ndroxyethyl)-N-methylperfluorohexane-1-sulfonamide,N-MeFHxSE,C9H8F13NO3S,[M-C2H4-OH]-,156.6730906,11.57,411.9676914,68555-75-9,CN(CCO)S(=O)(=O)C(C(C(C(C(C(F)(F)F)(F)F)(F)F)(F)F)(F)F)(F)F,110556,CCS Type: DT; Buffer gas: N2; Ionization: APCI-; Dataset: PFAS,DOI:10.1038/s41597-024-04363-0
N-Ethyl-N-(perfluoro-n-hexane-1-sulfonyl)glycine,N-EtFHSAA,C10H8F13NO4S,[M-H]-,179.8480421,10.3,483.9888198,68957-32-4,CCN(CC(=O)O)S(=O)(=O)C(C(C(C(C(C(F)(F)F)(F)F)(F)F)(F)F)(F)F)(F)F,105445,CCS Type: DT; Buffer gas: N2; Ionization: APCI-; Dataset: PFAS,DOI:10.1038/s41597-024-04363-0
N-Ethyl-N-(perfluoro-n-hexane-1-sulfonyl)glycine,N-EtFHSAA,C10H8F13NO4S,[M-CH2-COOH]-,160.9253063,10.3,425.9833406,68957-32-4,CCN(CC(=O)O)S(=O)(=O)C(C(C(C(C(C(F)(F)F)(F)F)(F)F)(F)F)(F)F)(F)F,105445,CCS Type: DT; Buffer gas: N2; Ionization: APCI-; Dataset: PFAS,DOI:10.1038/s41597-024-04363-0
N-Perfluorohexnaesulfonylglycine,FHxSAA,C8H4F13NO4S,[M-H]-,165.0309869,9.2,455.9575214,1003193-99-4,C(C(=O)O)NS(=O)(=O)C(C(C(C(C(C(F)(F)F)(F)F)(F)F)(F)F)(F)F)(F)F,139596791,CCS Type: DT; Buffer gas: N2; Ionization: APCI-; Dataset: PFAS,DOI:10.1038/s41597-024-04363-0
N-Methyl-N-(n-perfluorohexane-1-sulfonyl)glycine,N-MeFHxSAA,C9H6F13NO4S,[M-H]-,176.0833473,9.46,469.9731706,715646-50-7,CN(CC(=O)O)S(=O)(=O)C(C(C(C(C(C(F)(F)F)(F)F)(F)F)(F)F)(F)F)(F)F,87481295,CCS Type: DT; Buffer gas: N2; Ionization: APCI-; Dataset: PFAS,DOI:10.1038/s41597-024-04363-0
"1,1,2,2,3,3,4,4,5,5,6,6,6-tridecafluorohexylsulfonyl-[3-(trimethylazaniumyl)propyl]azanide",N-TAmP-FHxSA,C12H15F13N2O2S,[M+H]+,191.34,8.8,499.0719,38850-51-0,C[N+](C)(C)CCC[N-]S(=O)(=O)C(C(C(C(C(C(F)(F)F)(F)F)(F)F)(F)F)(F)F)(F)F,165364182,CCS Type: DT; Buffer gas: N2; Ionization: ESI+; Dataset: PFAS,DOI:10.1038/s41597-024-04363-0
"N-[3-(dimethylamino)propyl]-1,1,2,2,3,3,4,4,5,5,6,6,6-tridecafluorohexane-1-sulfonamide",N-AP-FHxSA,C11H13F13N2O2S,[M+H]+,184.39,9.4,485.0563,50598-28-2,CN(C)CCCNS(=O)(=O)C(C(C(C(C(C(F)(F)F)(F)F)(F)F)(F)F)(F)F)(F)F,111913,CCS Type: DT; Buffer gas: N2; Ionization: ESI+; Dataset: PFAS,DOI:10.1038/s41597-024-04363-0
"2-[dimethyl-[3-(3,3,4,4,5,5,6,6,7,7,8,8,8-tridecafluorooctylsulfonylamino)propyl]azaniumyl]acetate",6:2 FTAB,C15H19F13N2O4S,[M+H]+,211.87,9.4,571.0931,34455-29-3,C[N+](C)(CCCNS(=O)(=O)CCC(C(C(C(C(C(F)(F)F)(F)F)(F)F)(F)F)(F)F)(F)F)CC(=O)[O-],118691,CCS Type: DT; Buffer gas: N2; Ionization: ESI+; Dataset: PFAS,DOI:10.1038/s41597-024-04363-0
"2-[dimethyl-[3-(3,3,4,4,5,5,6,6,7,7,8,8,8-tridecafluorooctylsulfonylamino)propyl]azaniumyl]acetate",6:2 FTAB,C15H19F13N2O4S,[M+Na]+,213.45,9.4,593.075,34455-29-3,C[N+](C)(CCCNS(=O)(=O)CCC(C(C(C(C(C(F)(F)F)(F)F)(F)F)(F)F)(F)F)(F)F)CC(=O)[O-],118691,CCS Type: DT; Buffer gas: N2; Ionization: ESI+; Dataset: PFAS,DOI:10.1038/s41597-024-04363-0
N-Ethylheptafluorooctanesulfonamidoethyl acrylate,EtFOSEA,C15H12F17NO4S,[M+NH4]+,214.9485298,14.05,643.055928,423-82-5,CCN(CCOC(=O)C=C)S(=O)(=O)C(C(C(C(C(C(C(C(F)(F)F)(F)F)(F)F)(F)F)(F)F)(F)F)(F)F)(F)F,67921,CCS Type: DT; Buffer gas: N2; Ionization: ESI+; Dataset: PFAS,DOI:10.1038/s41597-024-04363-0
N-Ethylheptafluorooctanesulfonamidoethyl acrylate,EtFOSEA,C15H12F17NO4S,[M+Na]+,211.4730343,14.05,648.0113256,423-82-5,CCN(CCOC(=O)C=C)S(=O)(=O)C(C(C(C(C(C(C(C(F)(F)F)(F)F)(F)F)(F)F)(F)F)(F)F)(F)F)(F)F,67921,CCS Type: DT; Buffer gas: N2; Ionization: ESI+; Dataset: PFAS,DOI:10.1038/s41597-024-04363-0
N-Methyltridecafluorohexanesulfonamidoethyl acrylate,MeFHxSEA,C12H10F13NO4S,[M+NH4]+,193.9845844,12.59,529.046666,67584-57-0,CN(CCOC(=O)C=C)S(=O)(=O)C(C(C(C(C(C(F)(F)F)(F)F)(F)F)(F)F)(F)F)(F)F,105449,CCS Type: DT; Buffer gas: N2; Ionization: ESI+; Dataset: PFAS,DOI:10.1038/s41597-024-04363-0
N-Methyltridecafluorohexanesulfonamidoethyl acrylate,MeFHxSEA,C12H10F13NO4S,[M+Na]+,192.9764783,12.59,534.0020636,67584-57-0,CN(CCOC(=O)C=C)S(=O)(=O)C(C(C(C(C(C(F)(F)F)(F)F)(F)F)(F)F)(F)F)(F)F,105449,CCS Type: DT; Buffer gas: N2; Ionization: ESI+; Dataset: PFAS,DOI:10.1038/s41597-024-04363-0
N-Methyltridecafluorohexanesulfonamidoethyl acrylate,MeFHxSEA,C12H10F13NO4S,[M+K]+,193.0834714,12.59,549.9760016,67584-57-0,CN(CCOC(=O)C=C)S(=O)(=O)C(C(C(C(C(C(F)(F)F)(F)F)(F)F)(F)F)(F)F)(F)F,105449,CCS Type: DT; Buffer gas: N2; Ionization: ESI+; Dataset: PFAS,DOI:10.1038/s41597-024-04363-0
N-Methylheptadecafluorooctanesulfonamidoethyl acrylate,MeFOSEA,C14H10F17NO4S,[M+NH4]+,211.6788741,13.71,629.0402788,25268-77-3,CN(CCOC(=O)C=C)S(=O)(=O)C(C(C(C(C(C(C(C(F)(F)F)(F)F)(F)F)(F)F)(F)F)(F)F)(F)F)(F)F,91369,CCS Type: DT; Buffer gas: N2; Ionization: ESI+; Dataset: PFAS,DOI:10.1038/s41597-024-04363-0
N-Methylheptadecafluorooctanesulfonamidoethyl acrylate,MeFOSEA,C14H10F17NO4S,[M+Na]+,209.4550251,13.71,633.9956764,25268-77-3,CN(CCOC(=O)C=C)S(=O)(=O)C(C(C(C(C(C(C(C(F)(F)F)(F)F)(F)F)(F)F)(F)F)(F)F)(F)F)(F)F,91369,CCS Type: DT; Buffer gas: N2; Ionization: ESI+; Dataset: PFAS,DOI:10.1038/s41597-024-04363-0
N-Methylheptadecafluorooctanesulfonamidoethyl acrylate,MeFOSEA,C14H10F17NO4S,[M+K]+,210.7224953,13.71,649.9696144,25268-77-3,CN(CCOC(=O)C=C)S(=O)(=O)C(C(C(C(C(C(C(C(F)(F)F)(F)F)(F)F)(F)F)(F)F)(F)F)(F)F)(F)F,91369,CCS Type: DT; Buffer gas: N2; Ionization: ESI+; Dataset: PFAS,DOI:10.1038/s41597-024-04363-0
N-Ethyltridecafluorohexanesulphonamidoethyl methacrylate,EtFHxSEMA,C14H14F13NO4S,[M+NH4]+,202.2724367,13.54,557.0779644,67906-70-1,CCN(CCOC(=O)C(=C)C)S(=O)(=O)C(C(C(C(C(C(F)(F)F)(F)F)(F)F)(F)F)(F)F)(F)F,106119,CCS Type: DT; Buffer gas: N2; Ionization: ESI+; Dataset: PFAS,DOI:10.1038/s41597-024-04363-0
N-Ethyltridecafluorohexanesulphonamidoethyl methacrylate,EtFHxSEMA,C14H14F13NO4S,[M+Na]+,200.9722079,13.54,562.033362,67906-70-1,CCN(CCOC(=O)C(=C)C)S(=O)(=O)C(C(C(C(C(C(F)(F)F)(F)F)(F)F)(F)F)(F)F)(F)F,106119,CCS Type: DT; Buffer gas: N2; Ionization: ESI+; Dataset: PFAS,DOI:10.1038/s41597-024-04363-0
"Bis[1H, 1H, 2H, 2H-(1,2-13C2)perfluorooctyl] phosphate",M4-6:2diPAP,[13C]2C14H9F26O4P,[M+H]+,232.1785334,13.4,794.99798,,[13CH2]([13CH2]OP(=O)(O)O[13CH2][13CH2]C(C(C(C(C(C(F)(F)F)(F)F)(F)F)(F)F)(F)F)(F)F)C(C(C(C(C(C(F)(F)F)(F)F)(F)F)(F)F)(F)F)(F)F,138394469,CCS Type: DT; Buffer gas: N2; Ionization: ESI+; Dataset: PFAS,DOI:10.1038/s41597-024-04363-0
"Bis[1H, 1H, 2H, 2H-(1,2-13C2)perfluorooctyl] phosphate",M4-6:2diPAP,[13C]2C14H9F26O4P,[M+NH4]+,224.7250661,13.4,812.02452,,[13CH2]([13CH2]OP(=O)(O)O[13CH2][13CH2]C(C(C(C(C(C(F)(F)F)(F)F)(F)F)(F)F)(F)F)(F)F)C(C(C(C(C(C(F)(F)F)(F)F)(F)F)(F)F)(F)F)(F)F,138394469,CCS Type: DT; Buffer gas: N2; Ionization: ESI+; Dataset: PFAS,DOI:10.1038/s41597-024-04363-0
"Bis[1H, 1H, 2H, 2H-(1,2-13C2)perfluorooctyl] phosphate",M4-6:2diPAP,[13C]2C14H9F26O4P,[M+Na]+,217.4549602,13.4,816.97992,,[13CH2]([13CH2]OP(=O)(O)O[13CH2][13CH2]C(C(C(C(C(C(F)(F)F)(F)F)(F)F)(F)F)(F)F)(F)F)C(C(C(C(C(C(F)(F)F)(F)F)(F)F)(F)F)(F)F)(F)F,138394469,CCS Type: DT; Buffer gas: N2; Ionization: ESI+; Dataset: PFAS,DOI:10.1038/s41597-024-04363-0
"Bis[1H, 1H, 2H, 2H-(1,2-13C2)perfluorodecyl] phosphate",M4-8:2diPAP,[13C]4C16H9F34O4P,[M+H]+,260.0912381,14.5,994.9852,,[13CH2]([13CH2]OP(=O)(O)O[13CH2][13CH2]C(C(C(C(C(C(C(C(F)(F)F)(F)F)(F)F)(F)F)(F)F)(F)F)(F)F)(F)F)C(C(C(C(C(C(C(C(F)(F)F)(F)F)(F)F)(F)F)(F)F)(F)F)(F)F)(F)F,138394471,CCS Type: DT; Buffer gas: N2; Ionization: ESI+; Dataset: PFAS,DOI:10.1038/s41597-024-04363-0
"Bis[1H, 1H, 2H, 2H-(1,2-13C2)perfluorodecyl] phosphate",M4-8:2diPAP,[13C]4C16H9F34O4P,[M+NH4]+,249.2194396,14.5,1012.01175,,[13CH2]([13CH2]OP(=O)(O)O[13CH2][13CH2]C(C(C(C(C(C(C(C(F)(F)F)(F)F)(F)F)(F)F)(F)F)(F)F)(F)F)(F)F)C(C(C(C(C(C(C(C(F)(F)F)(F)F)(F)F)(F)F)(F)F)(F)F)(F)F)(F)F,138394471,CCS Type: DT; Buffer gas: N2; Ionization: ESI+; Dataset: PFAS,DOI:10.1038/s41597-024-04363-0
"Bis[1H, 1H, 2H, 2H-(1,2-13C2)perfluorodecyl] phosphate",M4-8:2diPAP,[13C]4C16H9F34O4P,[M+Na]+,242.0524925,14.5,1016.96715,,[13CH2]([13CH2]OP(=O)(O)O[13CH2][13CH2]C(C(C(C(C(C(C(C(F)(F)F)(F)F)(F)F)(F)F)(F)F)(F)F)(F)F)(F)F)C(C(C(C(C(C(C(C(F)(F)F)(F)F)(F)F)(F)F)(F)F)(F)F)(F)F)(F)F,138394471,CCS Type: DT; Buffer gas: N2; Ionization: ESI+; Dataset: PFAS,DOI:10.1038/s41597-024-04363-0
"1H,1H,2H,2H-perfluorooctyl phosphate",6:2PAP,C8H6F13O4P,[M+H]+,181.2539819,9,444.9874368,150033-29-7,C(COP(=O)(O)O)C(C(C(C(C(C(F)(F)F)(F)F)(F)F)(F)F)(F)F)(F)F,14250578,CCS Type: DT; Buffer gas: N2; Ionization: ESI+; Dataset: PFAS,DOI:10.1038/s41597-024-04363-0
"1H,1H,2H,2H-perfluorooctyl phosphate",6:2PAP,C8H6F13O4P,[M+NH4]+,180.3123052,9,462.0139846,150033-29-7,C(COP(=O)(O)O)C(C(C(C(C(C(F)(F)F)(F)F)(F)F)(F)F)(F)F)(F)F,14250578,CCS Type: DT; Buffer gas: N2; Ionization: ESI+; Dataset: PFAS,DOI:10.1038/s41597-024-04363-0
"1H,1H,2H,2H-perfluorooctyl phosphate",6:2PAP,C8H6F13O4P,[M+Na]+,177.4072443,9,466.9693822,150033-29-7,C(COP(=O)(O)O)C(C(C(C(C(C(F)(F)F)(F)F)(F)F)(F)F)(F)F)(F)F,14250578,CCS Type: DT; Buffer gas: N2; Ionization: ESI+; Dataset: PFAS,DOI:10.1038/s41597-024-04363-0
"1H,1H,2H,2H-perfluorodecylphosphate",8:2PAP,C10H6F17O4P,[M+H]+,198.1395375,11,544.9810496,438237-75-3,C(COP(=O)(O)O)C(C(C(C(C(C(C(C(F)(F)F)(F)F)(F)F)(F)F)(F)F)(F)F)(F)F)(F)F,10143739,CCS Type: DT; Buffer gas: N2; Ionization: ESI+; Dataset: PFAS,DOI:10.1038/s41597-024-04363-0
"1H,1H,2H,2H-perfluorodecylphosphate",8:2PAP,C10H6F17O4P,[M+NH4]+,196.315373,11,562.0075974,438237-75-3,C(COP(=O)(O)O)C(C(C(C(C(C(C(C(F)(F)F)(F)F)(F)F)(F)F)(F)F)(F)F)(F)F)(F)F,10143739,CCS Type: DT; Buffer gas: N2; Ionization: ESI+; Dataset: PFAS,DOI:10.1038/s41597-024-04363-0
"1H,1H,2H,2H-perfluorodecylphosphate",8:2PAP,C10H6F17O4P,[M+Na]+,192.7233192,11,566.962995,438237-75-3,C(COP(=O)(O)O)C(C(C(C(C(C(C(C(F)(F)F)(F)F)(F)F)(F)F)(F)F)(F)F)(F)F)(F)F,10143739,CCS Type: DT; Buffer gas: N2; Ionization: ESI+; Dataset: PFAS,DOI:10.1038/s41597-024-04363-0
2-(N-ethylperfluorooctane-1-sulfonamido)ethyl phosphate,SAmPAP,C12H11F17NO6PS,[M+H]+,216.4717779,12,651.9851486,2624-80-8,CCN(CCOP(=O)(O)O)S(=O)(=O)C(C(C(C(C(C(C(C(F)(F)F)(F)F)(F)F)(F)F)(F)F)(F)F)(F)F)(F)F,77442,CCS Type: DT; Buffer gas: N2; Ionization: ESI+; Dataset: PFAS,DOI:10.1038/s41597-024-04363-0
2-(N-ethylperfluorooctane-1-sulfonamido)ethyl phosphate,SAmPAP,C12H11F17NO6PS,[M+NH4]+,217.0217833,12,669.0116964,2624-80-8,CCN(CCOP(=O)(O)O)S(=O)(=O)C(C(C(C(C(C(C(C(F)(F)F)(F)F)(F)F)(F)F)(F)F)(F)F)(F)F)(F)F,77442,CCS Type: DT; Buffer gas: N2; Ionization: ESI+; Dataset: PFAS,DOI:10.1038/s41597-024-04363-0
2-(N-ethylperfluorooctane-1-sulfonamido)ethyl phosphate,SAmPAP,C12H11F17NO6PS,[M+Na]+,216.2526429,12,673.967094,2624-80-8,CCN(CCOP(=O)(O)O)S(=O)(=O)C(C(C(C(C(C(C(C(F)(F)F)(F)F)(F)F)(F)F)(F)F)(F)F)(F)F)(F)F,77442,CCS Type: DT; Buffer gas: N2; Ionization: ESI+; Dataset: PFAS,DOI:10.1038/s41597-024-04363-0
Bis-[2-(n-ethylperfluorooctane-1-sulfonamido)ethyl] phosphate,diSAmPAP,C24H19F34N2O8PS2,[M+H]+,306.6918897,14.95,1204.985576,23282-60-2,CCN(CCOP(=O)(O)OCCN(CC)S(=O)(=O)C(C(C(C(C(C(C(C(F)(F)F)(F)F)(F)F)(F)F)(F)F)(F)F)(F)F)(F)F)S(=O)(=O)C(C(C(C(C(C(C(C(F)(F)F)(F)F)(F)F)(F)F)(F)F)(F)F)(F)F)(F)F,102352,CCS Type: DT; Buffer gas: N2; Ionization: ESI+; Dataset: PFAS,DOI:10.1038/s41597-024-04363-0
Bis-[2-(n-ethylperfluorooctane-1-sulfonamido)ethyl] phosphate,diSAmPAP,C24H19F34N2O8PS2,[M+NH4]+,291.2057304,14.95,1222.012124,23282-60-2,CCN(CCOP(=O)(O)OCCN(CC)S(=O)(=O)C(C(C(C(C(C(C(C(F)(F)F)(F)F)(F)F)(F)F)(F)F)(F)F)(F)F)(F)F)S(=O)(=O)C(C(C(C(C(C(C(C(F)(F)F)(F)F)(F)F)(F)F)(F)F)(F)F)(F)F)(F)F,102352,CCS Type: DT; Buffer gas: N2; Ionization: ESI+; Dataset: PFAS,DOI:10.1038/s41597-024-04363-0
Bis-[2-(n-ethylperfluorooctane-1-sulfonamido)ethyl] phosphate,diSAmPAP,C24H19F34N2O8PS2,[M+Na]+,284.6184821,14.95,1226.967521,23282-60-2,CCN(CCOP(=O)(O)OCCN(CC)S(=O)(=O)C(C(C(C(C(C(C(C(F)(F)F)(F)F)(F)F)(F)F)(F)F)(F)F)(F)F)(F)F)S(=O)(=O)C(C(C(C(C(C(C(C(F)(F)F)(F)F)(F)F)(F)F)(F)F)(F)F)(F)F)(F)F,102352,CCS Type: DT; Buffer gas: N2; Ionization: ESI+; Dataset: PFAS,DOI:10.1038/s41597-024-04363-0
"6-(1,1,1,3,3,3-hexafluoropropan-2-yloxy)-2-N-methyl-1,3,5-triazine-2,4-diamine",,C7H7F6N5O,[M+H]+,155.9405332,7.21,292.063301,301211-06-3,CNC1=NC(=NC(=N1)N)OC(C(F)(F)F)C(F)(F)F,625950,CCS Type: DT; Buffer gas: N2; Ionization: ESI+; Dataset: PFAS,DOI:10.1038/s41597-024-04363-0
"Bis[1H, 1H, 2H, 2H-(1,2-13C2)perfluorooctyl] phosphate",M4-6:2diPAP,[13C]4C12H9F26O4P,[M+H]+,232.1242333,13.4,794.99798,,[13CH2]([13CH2]OP(=O)(O)O[13CH2][13CH2]C(C(C(C(C(C(F)(F)F)(F)F)(F)F)(F)F)(F)F)(F)F)C(C(C(C(C(C(F)(F)F)(F)F)(F)F)(F)F)(F)F)(F)F,138394469,CCS Type: DT; Buffer gas: N2; Ionization: APCI+; Dataset: PFAS,DOI:10.1038/s41597-024-04363-0
"Bis[1H, 1H, 2H, 2H-(1,2-13C2)perfluorooctyl] phosphate",M4-6:2diPAP,[13C]4C12H9F26O4P,[M+NH4]+,224.8031313,13.4,812.02452,,[13CH2]([13CH2]OP(=O)(O)O[13CH2][13CH2]C(C(C(C(C(C(F)(F)F)(F)F)(F)F)(F)F)(F)F)(F)F)C(C(C(C(C(C(F)(F)F)(F)F)(F)F)(F)F)(F)F)(F)F,138394469,CCS Type: DT; Buffer gas: N2; Ionization: APCI+; Dataset: PFAS,DOI:10.1038/s41597-024-04363-0
"Bis[1H, 1H, 2H, 2H-(1,2-13C2)perfluorodecyl] phosphate",M4-8:2diPAP,[13C]4C16H9F34O4P,[M+H]+,260.4618518,14.5,994.9852,,[13CH2]([13CH2]OP(=O)(O)O[13CH2][13CH2]C(C(C(C(C(C(C(C(F)(F)F)(F)F)(F)F)(F)F)(F)F)(F)F)(F)F)(F)F)C(C(C(C(C(C(C(C(F)(F)F)(F)F)(F)F)(F)F)(F)F)(F)F)(F)F)(F)F,138394471,CCS Type: DT; Buffer gas: N2; Ionization: APCI+; Dataset: PFAS,DOI:10.1038/s41597-024-04363-0
"Bis[1H, 1H, 2H, 2H-(1,2-13C2)perfluorodecyl] phosphate",M4-8:2diPAP,[13C]4C16H9F34O4P,[M+NH4]+,249.4088872,14.5,1012.01175,,[13CH2]([13CH2]OP(=O)(O)O[13CH2][13CH2]C(C(C(C(C(C(C(C(F)(F)F)(F)F)(F)F)(F)F)(F)F)(F)F)(F)F)(F)F)C(C(C(C(C(C(C(C(F)(F)F)(F)F)(F)F)(F)F)(F)F)(F)F)(F)F)(F)F,138394471,CCS Type: DT; Buffer gas: N2; Ionization: APCI+; Dataset: PFAS,DOI:10.1038/s41597-024-04363-0
"1H,1H,2H,2H-perfluorooctyl phosphate",6:2PAP,C8H6F13O4P,[M+H]+,181.3074343,9,444.9874368,150033-29-7,C(COP(=O)(O)O)C(C(C(C(C(C(F)(F)F)(F)F)(F)F)(F)F)(F)F)(F)F,14250578,CCS Type: DT; Buffer gas: N2; Ionization: APCI+; Dataset: PFAS,DOI:10.1038/s41597-024-04363-0
"1H,1H,2H,2H-perfluorooctyl phosphate",6:2PAP,C8H6F13O4P,[M+NH4]+,180.436223,9,462.0139846,150033-29-7,C(COP(=O)(O)O)C(C(C(C(C(C(F)(F)F)(F)F)(F)F)(F)F)(F)F)(F)F,14250578,CCS Type: DT; Buffer gas: N2; Ionization: APCI+; Dataset: PFAS,DOI:10.1038/s41597-024-04363-0
"1H,1H,2H,2H-perfluorodecylphosphate",8:2PAP,C10H6F17O4P,[M+H]+,198.5610904,11,544.9810496,438237-75-3,C(COP(=O)(O)O)C(C(C(C(C(C(C(C(F)(F)F)(F)F)(F)F)(F)F)(F)F)(F)F)(F)F)(F)F,10143739,CCS Type: DT; Buffer gas: N2; Ionization: APCI+; Dataset: PFAS,DOI:10.1038/s41597-024-04363-0
"1H,1H,2H,2H-perfluorodecylphosphate",8:2PAP,C10H6F17O4P,[M+NH4]+,196.3555112,11,562.0075974,438237-75-3,C(COP(=O)(O)O)C(C(C(C(C(C(C(C(F)(F)F)(F)F)(F)F)(F)F)(F)F)(F)F)(F)F)(F)F,10143739,CCS Type: DT; Buffer gas: N2; Ionization: APCI+; Dataset: PFAS,DOI:10.1038/s41597-024-04363-0
N-Ethylheptafluorooctanesulfonamidoethyl acrylate,EtFOSEA,C15H12F17NO4S,[M+NH4]+,214.7314411,14.05,643.055928,423-82-5,CCN(CCOC(=O)C=C)S(=O)(=O)C(C(C(C(C(C(C(C(F)(F)F)(F)F)(F)F)(F)F)(F)F)(F)F)(F)F)(F)F,67921,CCS Type: DT; Buffer gas: N2; Ionization: APCI+; Dataset: PFAS,DOI:10.1038/s41597-024-04363-0
N-Methyltridecafluorohexanesulfonamidoethyl acrylate,MeFHxSEA,C12H10F13NO4S,[M+NH4]+,194.0897598,12.59,534.0020636,67584-57-0,CN(CCOC(=O)C=C)S(=O)(=O)C(C(C(C(C(C(F)(F)F)(F)F)(F)F)(F)F)(F)F)(F)F,105449,CCS Type: DT; Buffer gas: N2; Ionization: APCI+; Dataset: PFAS,DOI:10.1038/s41597-024-04363-0
N-Methylheptadecafluorooctanesulfonamidoethyl acrylate,MeFOSEA,C14H10F17NO4S,[M+NH4]+,211.5676624,13.71,633.9956764,25268-77-3,CN(CCOC(=O)C=C)S(=O)(=O)C(C(C(C(C(C(C(C(F)(F)F)(F)F)(F)F)(F)F)(F)F)(F)F)(F)F)(F)F,91369,CCS Type: DT; Buffer gas: N2; Ionization: APCI+; Dataset: PFAS,DOI:10.1038/s41597-024-04363-0
N-Ethyltridecafluorohexanesulphonamidoethyl methacrylate,EtFHxSEMA,C14H14F13NO4S,[M+NH4]+,202.3077695,13.54,557.0779644,67906-70-1,CCN(CCOC(=O)C(=C)C)S(=O)(=O)C(C(C(C(C(C(F)(F)F)(F)F)(F)F)(F)F)(F)F)(F)F,106119,CCS Type: DT; Buffer gas: N2; Ionization: APCI+; Dataset: PFAS,DOI:10.1038/s41597-024-04363-0
