Dataset,Link
Lipids,https://gitlab.com/uniluxembourg/lcsb/eci/pubchem/-/raw/master/annotations/CCS/BakerLab/CCS_Template_BakerLab_Lipids.csv
PFAS,https://gitlab.com/uniluxembourg/lcsb/eci/pubchem/-/raw/master/annotations/CCS/BakerLab/CCS_Template_BakerLab_PFAS.csv
TOXCAST,https://gitlab.com/uniluxembourg/lcsb/eci/pubchem/-/raw/master/annotations/CCS/BakerLab/CCS_Template_BakerLab_TOXCAST.csv
Antidepressants,https://gitlab.com/uniluxembourg/lcsb/eci/pubchem/-/raw/master/annotations/CCS/BakerLab/CCS_Template_BakerLab_Antidepressants.csv
Pesticides,https://gitlab.com/uniluxembourg/lcsb/eci/pubchem/-/raw/master/annotations/CCS/BakerLab/CCS_Template_BakerLab_Pesticides.csv
