Eawag_ID,Name,Synonym1,Synonym2,Abbr_Synonym,InChIKey,PubChem_CID,Category,Classification-Level1,Classification-Level2,Classification-Level3,Classification-Level4,Classification-Level5,ATC-Classification-Code,Wirkstoffgruppe,Untergruppe Wirkstoffklasse,Wirkstoffklasse (D),ENClassification-Level1,ENClassification-Level2,ENClassification-Level3,ENClassification-Level4
4,Metamitron-desamino,,,,OUSYWCQYMPDAEO-UHFFFAOYSA-N,135413636,Pesticide,Herbicide,Triazinone herbicides,Transformation product,,,,Pestizid,0,0,0,triazinone herbicides,0,0
91,Metribuzin-desamino,,,DA,MIWRSUQXSCLDNV-UHFFFAOYSA-N,135502804,Pesticide,Transformation product,,,,,,Pestizid,0,0,0,0,0,0
93,Metribuzin-diketo,,,DK,AHBXXEZLRFCZSF-UHFFFAOYSA-N,41909,Pesticide,Transformation product,,,,,,Pestizid,0,0,0,0,0,0
150,Trinexapac acid,Trinexapac-acid,,,UNMYTEORJFXQBK-UHFFFAOYSA-N,17990286,Pesticide,Transformation product,,,,,,Pestizid,0,0,0,0,0,0
283,Irgarol-descyclopropyl,,,,MWWBDLRPMWTLRX-UHFFFAOYSA-N,13019211,Pesticide,Transformation product,,,,,,Biozid,0,0,0,0,0,0
335,Norfluoxetine,,,,WIQRCHMSJFFONW-UHFFFAOYSA-N,4541,Pharmaceutical,Transformation product,,,,,,Pharmazeutika,0,0,0,0,0,0
502,Metolachlor ESA,Metolachlor-ESA,,,CIGKZVUEZXGYSV-UHFFFAOYSA-N,6426849,Pesticide,Herbicide,Amide herbicides,Anilide herbicides,Chloroacetanilide herbicides,Transformation product,,Pestizid,0,0,0,amide herbicides,anilide herbicides,chloroacetanilide herbicides
2701,"Carbamazepine-10,11-dihydro-10,11-dihydroxy",,,,PRGQOPPDPVELEG-KBPBESRZSA-N,114725,Pharmaceutical,Antiepileptic,Transformation product,,,,,Pharmazeutika,Antiepileptikum,0,0,0,0,0
2734,Azoxystrobin acid,,,,IKCXDZCEWZARFL-FOWTUZBSSA-N,66685656,Pesticide,Fungicide,Transformation product,,,,,Pestizid,Fungicide metabolite,0,0,0,0,0
2737,Ranitidine-S-oxide,,,,SKHXRNHSZTXSLP-UKTHLTGXSA-N,3033889,Pharmaceutical,Transformation product,,,,,,Pharmazeutika,0,0,0,0,0,0
2738,Ranitidine-N-oxide,,,,DFJVUWAHTQPQCV-MDWZMJQESA-N,3033888,Pharmaceutical,Transformation product,,,,,,Pharmazeutika,0,0,0,0,0,0
2783,Prednisolone,,,,OIGNJSKKLXVSLS-VWUMJDOOSA-N,5755,Pharmaceutical,,,,,,,Pharmazeutika,0,0,0,0,0,0
2795,Valsartan acid,,,,USAWIVMZUYOXCF-UHFFFAOYSA-N,19388302,Pharmaceutical,,,,,,,Pharmazeutika,0,0,0,0,0,0
2798,1-Methylbenzotriazole,1-Methyl-benzotriazole,,,HXQHRUJXQJEGER-UHFFFAOYSA-N,25902,Corrosion inhibitor,Transformation product,,,,,,Korrosionsschutzmittel,0,0,0,0,0,0
2804,Candesartan,,,,HTQMVQVXFRQIKW-UHFFFAOYSA-N,2541,Pharmaceutical,Sartan,,,,,,Pharmazeutika,Sartan,0,0,0,0,0
2821,Amitriptyline,,,,KRMDCWKBEZIMAB-UHFFFAOYSA-N,2160,Pharmaceutical,Antidepressant,,,,,,Pharmazeutika,0,Antidepressivum,0,0,0,0
2822,Amphetamine,,,,KWTSXDURSIMDCE-UHFFFAOYSA-N,3007,Pharmaceutical,Anaesthetic,,,,,,Betäubungsmittel,0,0,0,0,0,0
2823,Benzoylecgonine,,,,GVGYEFKIHJTNQZ-CLRIEMFWSA-N,442997,Pharmaceutical,Anaesthetic,Transformation product,,,,,Betäubungsmittel,0,0,0,0,0,0
2825,"2-Ethylidene-1,5-dimethyl-3,3-diphenylpyrrolidine",,,EDDP,AJRJPORIQGYFMT-PVOVUMCXSA-N,5378015,Pharmaceutical,Anaesthetic,Transformation product,,,,,Betäubungsmittel,0,0,0,0,0,0
2841,Clozapine,,,,ZUXABONWMNSFBN-UHFFFAOYSA-N,135398737,Pharmaceutical,Neuroleptic,,,,,,Pharmazeutika,Neuroleptikum,0,0,0,0,0
2845,Capecitabine,,,,GAGWJHPBXLXJQN-UORFTKCHSA-N,60953,Pharmaceutical,Cytostatic,,,,,,Pharmazeutika,Zytostatikum,0,0,0,0,0
2852,Amisulpride,,,,NTJOBXMMWNYJFB-UHFFFAOYSA-N,2159,Pharmaceutical,Neuroleptic,,,,,,Pharmazeutika,Neuroleptikum,0,0,0,0,0
2854,Clopidogrel carboxylic acid,,,,DCASRSISIKYPDD-UHFFFAOYSA-N,4129546,Pharmaceutical,Platelet aggregation inhibitors,Transformation product,,,,,Pharmazeutika,Thrombozytenaggregationshemmer,0,0,0,0,0
2862,"2',3'-di-O-acetyl-5'-deoxy-5-fluorocytidine",,,,NWJBWNIUGNXJGO-RPULLILYSA-N,11809635,Pharmaceutical,,,,,,,Pharmazeutika,0,0,0,0,0,0
2899,1-Hydroxybenzotriazole,1-Hydroxy-Benzotriazole,,,ASOKPJOREAFHNY-UHFFFAOYSA-N,75771,Corrosion inhibitor,,,,,,,Korrosionsschutzmittel,0,0,0,0,0,0
2900,4-Hydroxybenzotriazole,4-Hydroxy-Benzotriazole,,,NPZTUJOABDZTLV-UHFFFAOYSA-N,135399369,Corrosion inhibitor,Transformation product,,,,,,Korrosionsschutzmittel,0,0,0,0,0,0
2922,Bisperfluorooctyl phosphate,,,,ZDYYWMSLMLTXDM-UHFFFAOYSA-N,14550408,PFAS,Perfluorophosphate,,,,,,PFC,Perfluorophosphate,0,0,0,0,0
2923,Bisperfluorodecyl phosphate,,,,AFWOYEYXUDHGHF-UHFFFAOYSA-N,3022253,PFAS,Perfluorophosphate,,,,,,PFC,Perfluorophosphate,0,0,0,0,0
2953,Methiocarb sulfoxide,Methiocarb-sulfoxide,,,FNCMBMZOZQAWJA-UHFFFAOYSA-N,17521,Pesticide,Transformation product,,,,,,Pestizid,0,0,0,0,0,0
2955,Thiacloprid-amide,,,,LEZHOZPJYAQQNU-UHFFFAOYSA-N,86222983,Pesticide,Insecticide,Transformation product,,,,,Pestizid,0,0,0,0,0,0
3066,4-Chlorophenol,,,,WXNZTHHGJRFXKQ-UHFFFAOYSA-N,4684,Pharmaceutical,Transformation product,,,,,,Pharmazeutika,0,0,0,0,0,0
3121,Flucytosine,,,5-FC,XRECTZIEBJDKEO-UHFFFAOYSA-N,3366,Pharmaceutical,Antimycotic,,,,,,Pharmazeutika,Antimykotikum,0,0,0,0,0
3184,1H-Benzotriazole-5-carboxylic acid,,,,GUOVBFFLXKJFEE-UHFFFAOYSA-N,72917,Corrosion inhibitor,Transformation product,,,,,,Korrosionsschutzmittel,0,0,0,0,0,0
3185,"1H-1,2,3-triazole",,,,QWENRTYMTSOGBR-UHFFFAOYSA-N,67516,Multiple,Transformation product,,,,,,Korrosionsschutzmittel,0,0,0,0,0,0
3186,"1H-1,2,3-triazole-5-OH",,,,LZTSCEYDCZBRCJ-UHFFFAOYSA-N,135436542,Corrosion inhibitor,Transformation product,,,,,,Korrosionsschutzmittel,0,0,0,0,0,0
3199,Cortisone,,,,MFYSYFVPBJMHGN-ZPOLXVRWSA-N,222786,Pharmaceutical,Steroid hormone,,,,,,Pharmazeutika,Steroidhormon,0,0,0,0,0
3244,Betamethasone-21-acetate,,,,AKUJBENLRBOFTD-QZIXMDIESA-N,443967,Pharmaceutical,,,,,,,Pharmazeutika,0,0,0,0,0,0
3253,Guanylurea,,,,SQSPRWMERUQXNE-UHFFFAOYSA-N,8859,Pharmaceutical,Transformation product,,,,,,Pharmazeutika,0,0,0,0,0,0
3254,Pheniramine-N-oxide,,,,OBBDJQMNZLQVAZ-UHFFFAOYSA-N,222605,Pharmaceutical,Transformation product,,,,,,Pharmazeutika,0,0,0,0,0,0
3257,"4-Amino-6-chloro-1,3-benzenedisulfonamide",,,,IHJCXVZDYSXXFT-UHFFFAOYSA-N,67136,Pharmaceutical,,,,,,,Pharmazeutika,0,0,0,0,0,0
3264,Dexamethason-21-acetate,,,,AKUJBENLRBOFTD-RPRRAYFGSA-N,236702,Pharmaceutical,,,,,,,Pharmazeutika,0,0,0,0,0,0
3271,Pargyline-N-oxide,,,,NZCJCBZLNHDNCR-UHFFFAOYSA-N,173313,Pharmaceutical,Transformation product,,,,,,Pharmazeutika,0,0,0,0,0,0
3277,Normianserin,Desmethylmianserin,,,ZBILSSSEXRZGKS-UHFFFAOYSA-N,115194,Pharmaceutical,Transformation product,,,,,,Pharmazeutika,0,0,0,0,0,0
3278,Mianserin-N-oxide,,,,VVDXWJOYXVNLLQ-UHFFFAOYSA-N,3085244,Pharmaceutical,Transformation product,,,,,,Pharmazeutika,0,0,0,0,0,0
3279,Lidocaine-N-oxide,,,,YDVXPJXUHRROBA-UHFFFAOYSA-N,3036923,Pharmaceutical,Transformation product,,,,,,Pharmazeutika,0,0,0,0,0,0
3280,Nornicotine,,,,MYKUKUCHPMASKF-UHFFFAOYSA-N,412,Natural product,Stimulants,Transformation product,,,,,Naturstoff,0,0,0,0,0,0
3281,Nordeprenyl,,,,UUFAJPMQSFXDFR-UHFFFAOYSA-N,200718,Pharmaceutical,Transformation product,,,,,,Pharmazeutika,0,0,0,0,0,0
3282,Cotinine,,,,UIKROCXWUNQSPJ-UHFFFAOYSA-N,408,Natural product,Stimulants,Transformation product,,,,,Natural occuring substance,0,0,0,0,0,0
3310,Tramadol N-oxide,,,,HBXKSXMNNGHBEA-ZBFHGGJFSA-N,9861699,Pharmaceutical,Transformation product,,,,,,Pharmazeutika,0,0,0,0,0,0
3312,Gabapentin Related Compound E,,,,SDAXMMUAZRUWNL-UHFFFAOYSA-N,260003,Pharmaceutical,,,,,,,Pharmazeutika,0,0,0,0,0,0
3380,4-Chlorobenzophenone,,,,UGVRJVHOJNYEHR-UHFFFAOYSA-N,8653,Pharmaceutical,Antihistamine,,,,,,Pharmazeutika,Antihistaminikum,0,0,0,0,0
3383,1-[(4-Chlorophenyl)phenylmethyl]piperazine,,,,UZKBSZSTDQSMDR-UHFFFAOYSA-N,9340,Pharmaceutical,,,,,,,Pharmazeutika,0,0,0,0,0,0
3384,3-[(4-chlorobenzoyl)amino]propanoic acid,,,,ZCGLNFAUVVHTQO-UHFFFAOYSA-N,1235725,Pharmaceutical,Transformation product,,,,,,0,0,0,0,0,0,0
3396,Venlafaxine N-oxide,,,,LASJEFFANGIOGZ-UHFFFAOYSA-N,76559643,Pharmaceutical,Transformation product,,,,,,Pharmazeutika,0,0,0,0,0,0
3397,4'-Hydroxydiclofenac,4'-Hydroxy Diclofenac,,,KGVXVPRLBMWZLG-UHFFFAOYSA-N,116545,Pharmaceutical,Transformation product,,,,,,0,0,0,0,0,0,0
3398,N-Bisdesmethyltramadol,N-Bisdesmethyl Tramadol,,,QNPPIKMBCJUUTG-UHFFFAOYSA-N,3056578,Pharmaceutical,Transformation product,,,,,,Pharmazeutika,0,0,0,0,0,0
3399,Amisulpride N-oxide,,,,LLIKIPAUZJTRGB-UHFFFAOYSA-N,71313372,Pharmaceutical,Transformation product,,,,,,0,0,0,0,0,0,0
3403,5-Hydroxydiclofenac,5-Hydroxy Diclofenac,,,VNQURRWYKFZKJZ-UHFFFAOYSA-N,3052566,Pharmaceutical,Transformation product,,,,,,0,0,0,0,0,0,0
3420,N-Desmethylpheniramine,,,,GDCVFNAQLOMGMS-UHFFFAOYSA-N,161283,Pharmaceutical,Transformation product,,,,,,Pharmazeutika,0,0,0,0,0,0
3461,R-Deprenyl N-oxide,,,,IVFPCTFUZXEDKP-UHFFFAOYSA-N,11447032,Pharmaceutical,Transformation product,,,,,,Pharmazeutika,0,0,0,0,0,0
3463,Kresoxim-methyl acid,,,,LXOPDEDFRXZTNO-FBMGVBCBSA-N,20055208,Pesticide,Fungicide,Transformation product,,,,,Pestizid,Fungicide Metabolite,0,0,0,0,0
3471,Norlidocaine,,,,WRMRXPASUROZGT-UHFFFAOYSA-N,24415,Pharmaceutical,Transformation product,,,,,,Pharmazeutika,0,0,0,0,0,0
3477,"4-Chloro-N,N-dimethylaniline",,,,IONGEXNDPXANJD-UHFFFAOYSA-N,136530,Multiple,Transformation product,,,,,,0,0,0,0,0,0,0
3478,4-Chloro-N-methylaniline,,,,XCEYKKJMLOFDSS-UHFFFAOYSA-N,70272,Multiple,Transformation product,,,,,,0,0,0,0,0,0,0
3561,Trimipramine N-oxide,,,,UNOPAPJVNIQNJP-UHFFFAOYSA-N,14151360,Pharmaceutical,Transformation product,,,,,,Pharmazeutika,0,0,0,0,0,0
3565,N-Desmethyltramadol,,,,VUMQHLSPUAFKKK-UHFFFAOYSA-N,198555,Pharmaceutical,Transformation product,,,,,,Pharmazeutika,0,0,0,0,0,0
3599,Fenthion-sulfone,,,,ZDHYERRNXRANLI-UHFFFAOYSA-N,19578,Pesticide,Transformation product,,,,,,Pestizid,0,0,0,0,0,0
3606,"3,4-Methylenedioxy-N-ethylamphetamine",,,MDEA,PVXVWWANJIWJOO-UHFFFAOYSA-N,105039,Pharmaceutical,Illicit drugs and related compounds,,,,,,0,0,0,0,0,0,0
3607,Norclozapine,,,,HESZUPIXRNZIOI-UHFFFAOYSA-N,135409468,Pharmaceutical,Transformation product,,,,,,Pharmazeutika,0,0,0,0,0,0
3608,Nordiazepam,,,,AKPLHCDWDRPJGD-UHFFFAOYSA-N,2997,Pharmaceutical,Transformation product,,,,,,Pharmazeutika,0,0,0,0,0,0
3612,Norfentanyl,,,,PMCBDBWCQQBSRJ-UHFFFAOYSA-O,6992364,Pharmaceutical,Transformation product,,,,,,Pharmazeutika,0,0,0,0,0,0
3613,"3,4-Methylenedioxy-N-methylamphetamine",,,MDMA,SHXWCVYOXRDMCX-UHFFFAOYSA-N,1615,Pharmaceutical,Illicit drugs and related compounds,,,,,,0,0,0,0,0,0,0
3619,Ecgonine-methyl-ester,,,EME,QIQNNBXHAYSQRY-ABIFROTESA-N,443844,Pharmaceutical,Anaesthetic,,,,,,Betäubungsmittel,0,0,0,0,0,0
3692,Nortriptyline,,,,PHVGLTMQBUFIQQ-UHFFFAOYSA-N,4543,Pharmaceutical,Transformation product,,,,,,Pharmazeutika,0,0,0,0,0,0
3707,Fenthion-sulfoxide,,,,DLAPIMGBBDILHJ-UHFFFAOYSA-N,19577,Pesticide,Transformation product,,,,,,Pestizid,0,0,0,0,0,0
3712,8-Hydroxymirtazapine,8-hydroxy Mirtazapine,,,DAWYIZBOUQIVNX-UHFFFAOYSA-N,11500131,Pharmaceutical,Transformation product,,,,,,0,0,0,0,0,0,0
3715,"3,4-Methylenedioxyamphetamine",,,MDA,NGBBVGZWCFBOGO-UHFFFAOYSA-N,1614,Pharmaceutical,Illicit drugs and related compounds,,,,,,0,0,0,0,0,0,0
3719,7-Aminoflunitrazepam,7-amino-flunitrazepam,,,LTCDLGUFORGHGY-UHFFFAOYSA-N,92294,Pharmaceutical,Transformation product,,,,,,0,0,0,0,0,0,0
196,Ranitidine,,,,VMXUWOKSQNHOCA-UKTHLTGXSA-N,3001055,Pharmaceutical,Alimentary tract and metabolism,Drugs for acid related disorders,Drugs for peptic ulcer and gastro-oesophageal reflux disease (GORD),H2-receptor antagonists,Antiulcer,A02BA02,Pharmazeutika,Antihistaminikum,Ulkustherapeitukum,ALIMENTARY TRACT AND METABOLISM,DRUGS FOR ACID RELATED DISORDERS,DRUGS FOR PEPTIC ULCER AND GASTRO-OESOPHAGEAL REFLUX DISEASE (GORD),H2-receptor antagonists
2550,Metformin,,,,XZWYZXLIPXDOLR-UHFFFAOYSA-N,4091,Pharmaceutical,Alimentary tract and metabolism,Drugs used in diabeties,"Blood glucose lowering drugs, excluding insulins",Biguanides,Antidiabetic,A10BA02,Pharmazeutika,Antidiabetikum,Antidiabetikum,ALIMENTARY TRACT AND METABOLISM,DRUGS USED IN DIABETES,"BLOOD GLUCOSE LOWERING DRUGS, EXCL. INSULINS",Biguanides
3242,Betamethasone,,,,UREBDLICKHMUKA-DVTGEIKXSA-N,9782,Pharmaceutical,Alimentary tract and metabolism,Glucocorticoide,,,,,Pharmazeutika,Glucocorticoid,0,ALIMENTARY TRACT AND METABOLISM,0,0,0
3243,Prednisone,,,,XOFYZVNMUHMLCC-ZPOLXVRWSA-N,5865,Pharmaceutical,Alimentary tract and metabolism,Glucocorticoide,,,,,Pharmazeutika,Glucocorticoid,0,ALIMENTARY TRACT AND METABOLISM,0,0,0
3580,Albendazole,,,,HXHWSAZORRCQMX-UHFFFAOYSA-N,2082,Pharmaceutical,Anthelmintic,,,,,,Pharmazeutika,Anthelminthikum,0,anthelminthic,0,0,0
3647,Albendazole sulfone,,,,CLSJYOLYMZNKJB-UHFFFAOYSA-N,53174,Pharmaceutical,Anthelmintic,Transformation product,,,,,Pharmazeutika,Anthelminthikum,0,anthelminthic,0,0,0
3275,Deprenyl,Selegiline,,,MEZLKOACVSPNER-GFCCVEGCSA-N,26757,Pharmaceutical,Antiparkinson,,,,,,Pharmazeutika,Antiparkinsonmittel,0,anti parkinson drug,0,0,0
3446,Clarithromycin N-oxide,,,,KDRPFIWYMNONLJ-KCBOHYOISA-N,11320230,Pharmaceutical,Antibiotic,Transformation product,,,,,Pharmazeutika,Antibiotikum,0,antibiotic,0,0,0
2772,Cetirizine,,,,ZKLPARSLTMPFCP-OAQYLSRUSA-N,1549000,Pharmaceutical,Antihistamine,,,,,,Pharmazeutika,Antihistaminikum,Antihistaminikum,antihistamine,0,0,0
3381,Cetirizine N-oxide,,,,IVDOUUOLLFEMJQ-UHFFFAOYSA-N,45038602,Pharmaceutical,Antihistamine,Transformation product,,,,,Pharmazeutika,Antihistaminikum,0,antihistamine,0,0,0
3476,Chlorcyclizine,,,,WFNAKBGANONZEQ-UHFFFAOYSA-N,2710,Pharmaceutical,Antihistamine,,,,,,Pharmazeutika,Antihistaminikum,0,antihistamine,0,0,0
179,Sulfadiazine,,,,SEEPANYCNGTZFQ-UHFFFAOYSA-N,5215,Pharmaceutical,Antiinfectives for systemic use,Antibacterials for systemic use,Sulfonamides and trimethoprim,Intermediate-acting sulfonamides,Antibiotic,J01EC02,Pharmazeutika,Antibiotikum,Antibiotikum,ANTIINFECTIVES FOR SYSTEMIC USE,ANTIBACTERIALS FOR SYSTEMIC USE,SULFONAMIDES AND TRIMETHOPRIM,Intermediate-acting sulfonamides
181,Sulfamethazine,,,,ASWVTGNCAZCNNR-UHFFFAOYSA-N,5327,Pharmaceutical,Antiinfectives for systemic use,Antibacterials for systemic use,Sulfonamides and trimethoprim,Short-acting sulfonamides,Antibiotic,J01EB03,Pharmazeutika,Antibiotikum,Antibiotikum,ANTIINFECTIVES FOR SYSTEMIC USE,ANTIBACTERIALS FOR SYSTEMIC USE,SULFONAMIDES AND TRIMETHOPRIM,Short-acting sulfonamides
183,Sulfadimethoxine,,,,ZZORFUFYDOWNEF-UHFFFAOYSA-N,5323,Pharmaceutical,Antiinfectives for systemic use,Antibacterials for systemic use,Sulfonamides and trimethoprim,Long-acting sulfonamides,Antibiotic,J01ED02,Pharmazeutika,Antibiotikum,Antibiotikum,ANTIINFECTIVES FOR SYSTEMIC USE,ANTIBACTERIALS FOR SYSTEMIC USE,SULFONAMIDES AND TRIMETHOPRIM,Long-acting sulfonamides
185,Sulfathiazole,,,,JNMRHUJNCSQMMB-UHFFFAOYSA-N,5340,Pharmaceutical,Antiinfectives for systemic use,Antibiotics and chemotherapeutics for dermatological use,Chemotherapeutics for topical use,Sulfonamides,Antibiotic,D06BA02,Pharmazeutika,Antibiotikum,Antibiotikum,ANTIINFECTIVES FOR SYSTEMIC USE,ANTIBIOTICS AND CHEMOTHERAPEUTICS FOR DERMATOLOGICAL USE,CHEMOTHERAPEUTICS FOR TOPICAL USE,Sulfonamides
191,Clarithromycin,,,,AGOYDEPGAOXOCK-KCBOHYOISA-N,84029,Pharmaceutical,Antiinfectives for systemic use,Antibacterials for systemic use,"Macrolides, lincosamines and streptogramins",Macrolides,Antibiotic,J01FA09,Pharmazeutika,Antibiotikum,Antibiotikum,ANTIINFECTIVES FOR SYSTEMIC USE,ANTIBACTERIALS FOR SYSTEMIC USE,"MACROLIDES, LINCOSAMIDES AND STREPTOGRAMINS",Macrolides
245,N4-Acetylsulfadimethoxine,N4-Acetyl-Sulfadimethoxine,,,DQWIIKBKAIPUPY-UHFFFAOYSA-N,168167,Pharmaceutical,Transformation product,,,,,J01ED02,Pharmazeutika,Antibiotikum,Antibiotikum,ANTIINFECTIVES FOR SYSTEMIC USE,ANTIBACTERIALS FOR SYSTEMIC USE,SULFONAMIDES AND TRIMETHOPRIM,Long-acting sulfonamides
247,N4-Acetylsulfamethazine,,,,LJKAKWDUZRJNPJ-UHFFFAOYSA-N,66855,Pharmaceutical,Transformation product,,,,,J01EB03,Pharmazeutika,Antibiotikum,Antibiotikum,ANTIINFECTIVES FOR SYSTEMIC USE,ANTIBACTERIALS FOR SYSTEMIC USE,SULFONAMIDES AND TRIMETHOPRIM,Short-acting sulfonamides
248,N4-Acetylsulfadiazine,,,,NJIZUWGMNCUKGU-UHFFFAOYSA-N,64952,Pharmaceutical,Transformation product,,,,,J01EC02,Pharmazeutika,Antibiotikum,Antibiotikum,ANTIINFECTIVES FOR SYSTEMIC USE,ANTIBACTERIALS FOR SYSTEMIC USE,SULFONAMIDES AND TRIMETHOPRIM,ntermediate-acting sulfonamides
298,Sulfamethoxazole,,,,JLKIGFTWXXRPMT-UHFFFAOYSA-N,5329,Pharmaceutical,Antiinfectives for systemic use,Antibacterials for systemic use,Sulfonamides and trimethoprim,Intermediate-acting sulfonamides,Antibiotic,J01EC01,Pharmazeutika,Antibiotikum,Antibiotikum,ANTIINFECTIVES FOR SYSTEMIC USE,ANTIBACTERIALS FOR SYSTEMIC USE,SULFONAMIDES AND TRIMETHOPRIM,Intermediate-acting sulfonamides
299,N4-Acetylsulfamethoxazole,,,,GXPIUNZCALHVBA-UHFFFAOYSA-N,65280,Pharmaceutical,Transformation product,,,,,J01EC01,Pharmazeutika,Antibiotikum,Antibiotikum,ANTIINFECTIVES FOR SYSTEMIC USE,ANTIBACTERIALS FOR SYSTEMIC USE,SULFONAMIDES AND TRIMETHOPRIM,Intermediate-acting sulfonamides
658,Oseltamivir,,,,VSZGPKBBMSAYNT-RRFJBIMHSA-N,65028,Pharmaceutical,Antiinfectives for systemic use,Antivirals for systemic use,Direct acting antivirals,Neuraminidase inhibitors,,J05AH02,Pharmazeutika,Virostatikum,Anitviral,ANTIINFECTIVES FOR SYSTEMIC USE,ANTIVIRALS FOR SYSTEMIC USE,DIRECT ACTING ANTIVIRALS,Neuraminidase inhibitors
659,Oseltamivir acid,Oseltamivir-carboxylate,,,NENPYTRHICXVCS-YNEHKIRRSA-N,449381,Pharmaceutical,Transformation product,,,,,J05AH02,Pharmazeutika,Virostatikum,Anitviral,ANTIINFECTIVES FOR SYSTEMIC USE,ANTIVIRALS FOR SYSTEMIC USE,DIRECT ACTING ANTIVIRALS,Neuraminidase inhibitors
3106,Emtricitabine,,,,XQSPYNMVSIKCOC-NTSWFWBYSA-N,60877,Pharmaceutical,Antiinfectives for systemic use,Virustatic,,,,,Pharmazeutika,Virustatikum,0,ANTIINFECTIVES FOR SYSTEMIC USE,0,0,0
3634,Thiamphenicol,,,,OTVAEFIXJLOWRX-UHFFFAOYSA-N,5433,Pharmaceutical,Antiinfectives for systemic use,Antibiotic,,,,,Pharmazeutika,Antibiotikum,0,ANTIINFECTIVES FOR SYSTEMIC USE,0,0,0
3641,Florfenicol,,,,AYIRNRDRBQJXIF-UHFFFAOYSA-N,5201447,Pharmaceutical,Antiinfectives for systemic use,Antibiotic,,,,,Pharmazeutika,Antibiotikum,0,ANTIINFECTIVES FOR SYSTEMIC USE,0,0,0
2739,Climbazole,,,,OWEGWHBOCFMBLP-UHFFFAOYSA-N,37907,Pharmaceutical,Personal Care Product,Antimycotic,,,,,Personal Care Product,Antimykotikum,0,antimycotic,0,0,0
2603,Gemcitabine,,,,SDUQYLNIPVEERB-QPPQHZFASA-N,60750,Pharmaceutical,Antineoplastic and immunomodulating agents,Antineoplastic agents,Antimetabolites,Pyrimidine analogues,Cytostatic,L01BC05,Pharmazeutika,Zytostatikum,Zytostatikum,ANTINEOPLASTIC AND IMMUNOMODULATING AGENTS,ANTINEOPLASTIC AGENTS,ANTIMETABOLITES,Pyrimidine analogues
2649,"2',2'-Difluorodeoxyuridine",,,,FIRDBEQIJQERSE-UHFFFAOYSA-N,13922189,Pharmaceutical,Antineoplastic and immunomodulating agents,Antineoplastic agents,Antimetabolites,Pyrimidine analogues,Cytostatic,L01BC05,Pharmazeutika,Zytostatikum,Zytostatikum,ANTINEOPLASTIC AND IMMUNOMODULATING AGENTS,ANTINEOPLASTIC AGENTS,ANTIMETABOLITES,Pyrimidine analogues
3074,Permethrin,,,,RLLPVAHGXHCWKJ-HKUYNNGSSA-N,40463,Pesticide,Biocide,"Antiparasitic products, insecticides and repellents",Antiparasitic,,,,Pharmazeutika,Antiparasitäres Mittel,0,"ANTIPARASITIC PRODUCTS, INSECTICIDES AND REPELLENTS",0,0,0
2780,Codeine,,,,OROGSEYTTFOCAN-DNJOTXNNSA-N,5284371,Pharmaceutical,Anaesthetic,Antitussive,,,,,Betäubungsmittel,Antitussivum,Antitussivum,antitussive,0,0,0
297,Dichlofluanid,,,,WURGXGVFSMYFCG-UHFFFAOYSA-N,14145,Pesticide,Fungicide,,,,,,Pestizid,PSM-Fungizid/Biozid,0,biocides,0,0,0
3190,2-Mercaptobenzothiazole,,,,YXIWHUQXZSMYRE-UHFFFAOYSA-N,697993,Pesticide,Biocide,,,,,,Pestizid,Biozid,0,biocides,0,0,0
3029,Ticlopidine,,,,PHWBOXQYWZNQIN-UHFFFAOYSA-N,5472,Pharmaceutical,Blood and blood forming organs,Anticoagulant,,,,,Pharmazeutika,Blutgerinnungshemmer,0,BLOOD AND BLOOD FORMING ORGANS,0,0,0
169,Atenolol,,,,METKIMKYRPQLGS-UHFFFAOYSA-N,2249,Pharmaceutical,Cardiovascular system,Beta blocker,"Beta blocking agents, selective",,,C07AB03,Pharmazeutika,Betablocker,Betablocker,CARDIOVASCULAR SYSTEM,BETA BLOCKING AGENTS,BETA BLOCKING AGENTS,"Beta blocking agents, selective"
172,Metoprolol,,,,IUBSYMUCCVWXPE-UHFFFAOYSA-N,4171,Pharmaceutical,Cardiovascular system,Beta blocker,"Beta blocking agents, selective",,,C07AB02,Pharmazeutika,Betablocker,Betablocker,CARDIOVASCULAR SYSTEM,BETA BLOCKING AGENTS,BETA BLOCKING AGENTS,"Beta blocking agents, selective"
209,Bezafibrate,,,,IIBYAHWJQTYFKB-UHFFFAOYSA-N,39042,Pharmaceutical,Cardiovascular system,Lipid modifying agents,"Lipid modifying agents, plain",Fibrates,Antilipemic,C10AB02,Pharmazeutika,Lipidsenker,0,CARDIOVASCULAR SYSTEM,LIPID MODIFYING AGENTS,"LIPID MODIFYING AGENTS, PLAIN",Fibrates
336,Fenofibrate,,,,YMTINGFKWWXKFG-UHFFFAOYSA-N,3339,Pharmaceutical,Cardiovascular system,Lipid modifying agents,"Lipid modifying agents, plain",Fibrates,Antilipemic,C10AB05,Pharmazeutika,Lipidsenker,0,CARDIOVASCULAR SYSTEM,LIPID MODIFYING AGENTS,"LIPID MODIFYING AGENTS, PLAIN",Fibrates
337,Fenofibric acid,,,,MQOBSOSZFYZQOK-UHFFFAOYSA-N,64929,Pharmaceutical,Cardiovascular system,Lipid modifying agents,"Lipid modifying agents, plain",Fibrates,Transformation product,C10AB05,Pharmazeutika,0,0,CARDIOVASCULAR SYSTEM,LIPID MODIFYING AGENTS,"LIPID MODIFYING AGENTS, PLAIN",Fibrates
674,Verapamil,,,,SGTNSNPWRIOYBX-UHFFFAOYSA-N,2520,Pharmaceutical,Cardiovascular system,Calcium channel blockers,Selective calcium channel blockers with direct cardiac effects,Phenylalkylamine derivatives,Calcium antagonist,C08DA01,Pharmazeutika,Calciumantagonist,0,CARDIOVASCULAR SYSTEM,CALCIUM CHANNEL BLOCKERS,SELECTIVE CALCIUM CHANNEL BLOCKERS WITH DIRECT CARDIAC EFFECTS,Phenylalkylamine derivatives
697,Atenolol acid,Metoprolol acid,,,PUQIRTNPJRFRCZ-UHFFFAOYSA-N,62936,Pharmaceutical,Cardiovascular system,Beta blocker,"Beta blocking agents, selective",Transformation product,,C07AB03,Pharmazeutika,Betablocker,Betablocker,CARDIOVASCULAR SYSTEM,BETA BLOCKING AGENTS,BETA BLOCKING AGENTS,"Beta blocking agents, selective"
2583,Valsartan,,,,ACWBQPMHZXGDFX-QFIPXVFZSA-N,60846,Pharmaceutical,Cardiovascular system,Agents acting on the renin-angiotensin system,"Angiotensin II antagonists, plain",Antihypertension,,C09CA03,Pharmazeutika,Antihypertensivum,0,CARDIOVASCULAR SYSTEM,AGENTS ACTING ON THE RENIN-ANGIOTENSIN SYSTEM,"ANGIOTENSIN II ANTAGONISTS, PLAIN","Angiotensin II antagonists, plain"
2610,Hydrochlorothiazide,,,,JZUFKLXOESDKRF-UHFFFAOYSA-N,3639,Pharmaceutical,Cardiovascular system,Diuretic,"Low-ceiling diuretics, thiazides","Thiazides, plain",,C03AA03,Pharmazeutika,Diuretikum,0,CARDIOVASCULAR SYSTEM,DIURETICS,"LOW-CEILING DIURETICS, THIAZIDES","Thiazides, plain"
2637,D617,,,,WLOBUUJURNEQCL-UHFFFAOYSA-N,93168,Pharmaceutical,Cardiovascular system,Calcium channel blockers,Selective calcium channel blockers with direct cardiac effects,Phenylalkylamine derivatives,Calcium antagonist,C08DA01,Pharmazeutika,Calciumantagonist,Calciumantagonist,CARDIOVASCULAR SYSTEM,CALCIUM CHANNEL BLOCKERS,SELECTIVE CALCIUM CHANNEL BLOCKERS WITH DIRECT CARDIAC EFFECTS,Phenylalkylamine derivatives
2670,Atenolol-desisopropyl,,,,UWMXVJVTKRSOPW-UHFFFAOYSA-N,14211540,Pharmaceutical,Cardiovascular system,Beta blocker,"Beta blocking agents, selective",Transformation product,,C07AB03,Pharmazeutika,Betablocker,Betablocker,CARDIOVASCULAR SYSTEM,BETA BLOCKING AGENTS,BETA BLOCKING AGENTS,"Beta blocking agents, selective"
2774,Irbesartan,,,,YOSHYTLCDANDAN-UHFFFAOYSA-N,3749,Pharmaceutical,Cardiovascular system,Antihypertension,,,,,Pharmazeutika,Antihypertensivum,0,CARDIOVASCULAR SYSTEM,0,0,0
2794,Losartan,,,,PSIFNNKUMBGKDQ-UHFFFAOYSA-N,3961,Pharmaceutical,Cardiovascular system,Antihypertension,,,,,Pharmazeutika,Antihypertensivum,0,CARDIOVASCULAR SYSTEM,0,0,0
166,1H-Benzotriazole,,,,QRUDEWIWKLJBPS-UHFFFAOYSA-N,7220,Corrosion inhibitor,,,,,,,Korrosionsschutzmittel,0,0,corrosion inhibitor,0,0,0
2791,4-Methylbenzotriazole,4-Methyl-Benzotriazole,,,CMGDVUCDZOBDNL-UHFFFAOYSA-N,122499,Corrosion inhibitor,Transformation product,,,,,,Korrosionsschutzmittel,0,0,corrosion inhibitor,0,0,0
249,N4-Acetylsulfathiazole,,,,KXNXWINFSDKMHD-UHFFFAOYSA-N,67183,Pharmaceutical,Dermatological,Antibiotic and chemotherapeutics for dermatological use,Chemotherapeutics for topical use,Sulfonamides,Transformation product,D06BA02,Pharmazeutika,Antibiotikum,Antibiotikum,DERMATOLOGICALS,ANTIBIOTICS AND CHEMOTHERAPEUTICS FOR DERMATOLOGICAL USE,CHEMOTHERAPEUTICS FOR TOPICAL USE,Sulfonamides
3005,Pheniramine,,,,IJHNSHDBIRRJRN-UHFFFAOYSA-N,4761,Pharmaceutical,Dermatological,Antihistamine,,,,,Pharmazeutika,Antihistaminikum,0,DERMATOLOGICALS,,0,0
3256,Chlorothiazide,,,,JBMKAUGHUNFTOL-UHFFFAOYSA-N,2720,Pharmaceutical,Diuretic,,,,,,Pharmazeutika,Diuretikum,0,diuretic,0,0,0
89,Azoxystrobin,,,,WFDXOXNFNRHQEC-GHRIWEEISA-N,3034285,Pesticide,Fungicide,Antibiotic fungicides,Strobilurin fungicides,,,,Pestizid,Fungizid,0,fungicides,antibiotic fungicides,strobilurin fungicides,0
138,2-Aminobenzimidazole,,,,JWYUFVNJZUSCSM-UHFFFAOYSA-N,13624,Pesticide,Fungicide,Benzimidazole fungicides,Transformation product,,,,Biozid,0,0,fungicides,benzimidazole fungicides,0,0
154,Kresoxim-methyl,,,,ZOTBXTZVPHCKPN-HTXNQAPBSA-N,6112114,Pesticide,Fungicide,Antibiotic fungicides,Strobilurin fungicides,,,,Pestizid,Fungizid,0,fungicides,antibiotic fungicides,strobilurin fungicides,0
278,Carbendazim,,,,TWFZGCMQGLPBSX-UHFFFAOYSA-N,25429,Pesticide,Fungicide,Benzimidazole fungicides,,,,,Biozid,Fungizid,0,fungicides,benzimidazole fungicides,0,0
296,"N,N-Dimethylaminosulfanilide","N,N-Dimethyl-N'-phenylsulfamide",,DMSA,QCDQDISRALTLNQ-UHFFFAOYSA-N,78441,Pesticide,Fungicide,Amide fungicides,Phenylsulfamide fungicides,,,,Pestizid,0,0,fungicides,amide fungicides,phenylsulfamide fungicides,0
302,Irgarol,,,,HDHLIWCXDDZUFH-UHFFFAOYSA-N,91590,Pesticide,Fungicide,Herbicide,Anti-fouling agent,,,,Biozid,Fungizid,0,fungicides,0,0,0
341,"N,N-Dimethylsulfamide",,,,QMHAHUAQAJVBIW-UHFFFAOYSA-N,134472,Pesticide,Fungicide,Amide fungicides,Phenylsulfamide fungicides,,,,Biozid,0,0,fungicides,amide fungicides,phenylsulfamide fungicides,0
2934,Difenoconazole,,,,BQYJATMQXGBDHF-UHFFFAOYSA-N,86173,Pesticide,Fungicide,,,,,,Pestizid,Fungizid,0,fungicides,0,0,0
3646,"2-(Methylsulfanyl)-1,3-benzothiazole",,,,UTBVIMLZIRIFFR-UHFFFAOYSA-N,11989,Pesticide,Fungicide,,,,,,Pestizid,Fungizid,0,fungicides,0,0,0
24,Bromoxynil,,,,UPMXNNIRAGDFEH-UHFFFAOYSA-N,15531,Pesticide,Herbicide,Nitrile herbicides,,,,,Pestizid,Herbizid,0,herbicides,nitrile herbicides,0,0
52,4-Isopropylaniline,,,,LRTFPLFDLJYEKT-UHFFFAOYSA-N,7464,Pesticide,Herbicide,Urea herbicides,Phenylurea herbicides,,,,Pestizid,0,0,herbicides,urea herbicides,phenylurea herbicides,0
58,Metamitron,,,,VHCNQEUWZYOAEV-UHFFFAOYSA-N,38854,Pesticide,Herbicide,Triazinone herbicides,,,,,Pestizid,Herbizid,0,herbicides,triazinone herbicides,0,0
67,Metolachlor-Morpholinone,,,,DVBDYPDVNRJKNJ-UHFFFAOYSA-N,179957,Pesticide,Herbicide,Amide herbicides,Anilide herbicides,Chloroacetanilide herbicides,,,Pestizid,0,0,herbicides,amide herbicides,anilide herbicides,chloroacetanilide herbicides
84,Dichlobenil,,,,YOYAIZYFCNQIRF-UHFFFAOYSA-N,3031,Pesticide,Herbicide,,,,,,Pestizid,Herbizid,0,herbicides,0,0,0
85,"2,6-Dichlorobenzamide",,,,JHSPCUHPSIUQRB-UHFFFAOYSA-N,16183,Pesticide,Herbicide,Nitrile herbicides,Transformation product,,,,Pestizid,0,0,herbicides,nitrile herbicides,0,0
88,Chloridazon,,,,WYKYKTKDBLFHCY-UHFFFAOYSA-N,15546,Pesticide,Herbicide,Pyridazinone herbicides,,,,,Pestizid,Herbizid,0,herbicides,pyridazinone herbicides,0,0
90,Metribuzin,,,,FOXFZRUHNHCZPX-UHFFFAOYSA-N,30479,Pesticide,Herbicide,Triazinone herbicides,,,,,Pestizid,Herbizid,0,herbicides,triazinone herbicides,0,0
117,Ethofumesate,,,,IRCMYGHHKLLGHV-UHFFFAOYSA-N,33360,Pesticide,Herbicide,Benzofuranyl alkylsulfonate herbicides,,,,,Pestizid,Herbizid,0,herbicides,benzofuranyl alkylsulfonate herbicides,0,0
118,Ethofumesate-2-keto,,,,CXWYCAYNZXSHTF-UHFFFAOYSA-N,590774,Pesticide,Herbicide,Benzofuranyl alkylsulfonate herbicides,Transformation product,,,,Pestizid,0,0,herbicides,benzofuranyl alkylsulfonate herbicides,0,0
124,Thifensulfuron-methyl,,,,AHTPATJNIAFOLR-UHFFFAOYSA-N,73674,Pesticide,Herbicide,Urea herbicides,Sulfonylurea herbicides,,,,Pestizid,Herbizid,0,herbicides,urea herbicides,sulfonylurea herbicides,0
125,"2-Amino-4-methoxy-6-methyl-1,3,5 triazine",,,,NXFQWRWXEYTOTK-UHFFFAOYSA-N,15466,Pesticide,Herbicide,Urea herbicides,Sulfonylurea herbicides,,,,Pestizid,0,0,herbicides,urea herbicides,sulfonylurea herbicides,0
126,Methyl 2-(aminosulfonyl)benzoate,Methyl-2-(aminosulfonyl)benzoate,,,VSOOBQALJVLTBH-UHFFFAOYSA-N,42546,Pesticide,Herbicide,Urea herbicides,Sulfonylurea herbicides,Triazinylsulfonylurea herbicides,Transformation product,,Pestizid,0,0,herbicides,urea herbicides,sulfonylurea herbicides,triazinylsulfonylurea herbicides
128,Metsulfuron-methyl,,,,RSMUVYRMZCOLBH-UHFFFAOYSA-N,52999,Pesticide,Herbicide,Urea herbicides,Sulfonylurea herbicides,,,,Pestizid,Herbizid,0,herbicides,urea herbicides,sulfonylurea herbicides,0
132,Prometon,,,,ISEUFVQQFVOBCY-UHFFFAOYSA-N,4928,Pesticide,Herbicide,Triazine herbicides,Methoxytriazine herbicides,,,,Pestizid,Herbizid,0,herbicides,triazine herbicides,methoxytriazine herbicides,0
133,Prometryn,,,,AAEVYOVXGOFMJO-UHFFFAOYSA-N,4929,Pesticide,Herbicide,Triazine herbicides,Methylthiotriazine herbicides,,,,Pestizid,Herbizid,0,herbicides,triazine herbicides,methylthiotriazine herbicides,0
142,Propazine-2-hydroxy,Prometon-Hydroxy,,,RUOTUMSRCIMLJK-UHFFFAOYSA-N,135461611,Pesticide,Herbicide,Triazine herbicides,Methoxytriazine herbicides,Transformation product,,,Pestizid,Herbizid,0,herbicides,triazine herbicides,methoxytriazine herbicides,0
157,Atraton,,,,PXWUKZGIHQRDHL-UHFFFAOYSA-N,15359,Pesticide,Herbicide,Triazine herbicides,Methoxytriazine herbicides,,,,Pestizid,Herbizid,0,herbicides,triazine herbicides,methoxytriazine herbicides,0
254,Dimethenamid,,,,JLYFCTQDENRSOL-UHFFFAOYSA-N,91744,Pesticide,Herbicide,Amide herbicides,,,,,Pestizid,Herbizid,0,herbicides,amide herbicides,0,0
259,Dimethenamid OXA,Dimethenamid-OXA,,,HOYCASTVMCEOTP-UHFFFAOYSA-N,86290064,Pesticide,Herbicide,Amide herbicides,Transformation product,,,,Pestizid,0,0,herbicides,amide herbicide,0,0
260,Dimethenamid ESA,Dimethenamid-ESA,,,YMYKMSAZEZQEER-UHFFFAOYSA-N,6426850,Pesticide,Herbicide,Amide herbicides,Transformation product,,,,Pestizid,0,0,herbicides,amide herbicide,0,0
262,Simazine,,,,ODCWYMIRDDJXKW-UHFFFAOYSA-N,5216,Pesticide,Herbicide,Triazine herbicides,Chlorotriazine herbicides,,,,Pestizid,Herbizid,0,herbicides,triazine herbicides,chlorotriazine herbicides,0
265,Metolachlor OXA,Metolachlor-OXA,,,LNOOSYCKMKZOJB-UHFFFAOYSA-N,15842092,Pesticide,Herbicide,Amide herbicides,Anilide herbicides,Chloroacetanilide herbicides,Transformation product,,Pestizid,0,0,herbicides,amide herbicides,anilide herbicides,chloroacetanilide herbicides
268,Metolachlor,,,,WVQBLGZPHOPPFO-UHFFFAOYSA-N,4169,Pesticide,Herbicide,Amide herbicides,Anilide herbicides,Chloroacetanilide herbicides,,,Pestizid,Herbizid,0,herbicides,amide herbicides,anilide herbicides,chloroacetanilide herbicides
269,Metazachlor,,,,STEPQTYSZVCJPV-UHFFFAOYSA-N,49384,Pesticide,Herbicide,Amide herbicides,Anilide herbicides,Chloroacetanilide herbicides,,,Pestizid,Herbizid,0,herbicides,amide herbicides,anilide herbicides,chloroacetanilide herbicides
277,Atrazine-desethyl-2-hydroxy,Prometon-hydroxy-desisopropyl,,,GCKLGRUZDXSATG-UHFFFAOYSA-N,135510207,Pesticide,Herbicide,Triazine herbicides,Chlorotriazine herbicides,Transformation product,,,Pestizid,Herbizid,0,herbicides,triazine herbicides,chlorotriazine herbicides,0
279,Atrazine-2-hydroxy,2-hydroxyatrazine,,,NFMIMWNQWAWNDW-UHFFFAOYSA-N,135398733,Pesticide,Herbicide,Triazine herbicides,Chlorotriazine herbicides,Transformation product,,,Pestizid,Herbizid,0,herbicides,triazine herbicides,chlorotriazine herbicides,0
284,Terbutylazine,,,,FZXISNSWEXTPMF-UHFFFAOYSA-N,22206,Pesticide,Herbicide,Triazine herbicides,Chlorotriazine herbicides,,,,Pestizid,Herbizid,0,herbicides,triazine herbicides,chlorotriazine herbicides,0
285,Isoproturon-didemethyl,1-(4-Isoprophenyl)urea,,,ABBKOIZWGCVCKE-UHFFFAOYSA-N,185831,Pesticide,Herbicide,Urea herbicides,Phenylurea herbicides,Transformation product,,,Pestizid,0,0,herbicides,urea herbicides,phenylurea herbicides,0
286,Isoproturon,,,,PUIYMUZLKQOUOZ-UHFFFAOYSA-N,36679,Pesticide,Herbicide,Urea herbicides,Phenylurea herbicides,,,,Pestizid,Herbizid,0,herbicides,urea herbicides,phenylurea herbicides,0
287,Atrazine-desisopropyl,,,,IVENSCMCQBJAKW-UHFFFAOYSA-N,13878,Pesticide,Herbicide,Triazine herbicides,Chlorotriazine herbicides,Transformation product,,,Pestizid,Herbizid,0,herbicides,triazine herbicides,chlorotriazine herbicides,0
288,Atrazine,,,,MXWJVTOOROXGIU-UHFFFAOYSA-N,2256,Pesticide,Herbicide,Triazine herbicides,Chlorotriazine herbicides,,,,Pestizid,Herbizid,0,herbicides,triazine herbicides,chlorotriazine herbicides,0
289,Diuron-desdimethyl,"1-(3,4-Dichlorophenyl)urea",,,CYESCLHCWJKRKM-UHFFFAOYSA-N,16854,Pesticide,Herbicide,Urea herbicides,Phenylurea herbicides,Transformation product,,,Biozid,0,0,herbicides,urea herbicides,phenylurea herbicides,0
292,Diuron,,,,XMTQQYYKAHVGBJ-UHFFFAOYSA-N,3120,Pesticide,Herbicide,Urea herbicides,Phenylurea herbicides,,,,Biozid,Herbizid,0,herbicides,urea herbicides,phenylurea herbicides,0
294,Diuron-desmonomethyl,"1-(3,4-Dichlorophenyl)-3-methylurea",Diuron-desmethyl,DCPMU,IDQHRQQSSQDLTR-UHFFFAOYSA-N,19113,Pesticide,Herbicide,Urea herbicides,Phenylurea herbicides,Transformation product,,,Biozid,0,0,herbicides,urea herbicides,phenylurea herbicides,0
304,Isoproturon-monodemethyl,1-(4-Isoprophenyl)-3-methylurea,,,DOULWWSSZVEPIN-UHFFFAOYSA-N,182167,Pesticide,Herbicide,Urea herbicides,Phenylurea herbicides,Transformation product,,,Pestizid,0,0,herbicides,urea herbicides,phenylurea herbicides,0
306,Terbutryn,,,,IROINLKCQGIITA-UHFFFAOYSA-N,13450,Pesticide,Herbicide,Triazine herbicides,Methylthiotriazine herbicides,,,,Biozid,Herbizid,0,herbicides,triazine herbicides,methylthiotriazine herbicides,0
309,Atrazine-desethyl,,,,DFWFIQKMSFGDCQ-UHFFFAOYSA-N,22563,Pesticide,Herbicide,Triazine herbicides,Chlorotriazine herbicides,Transformation product,,,Pestizid,Herbizid,0,herbicides,triazine herbicides,chlorotriazine herbicides,0
346,Terbumeton,,,,BCQMBFHBDZVHKU-UHFFFAOYSA-N,36584,Pesticide,Herbicide,Triazine herbicides,Methoxytriazine herbicides,,,,Pestizid,Herbizid,0,herbicides,triazine herbicides,methoxytriazine herbicides,0
347,Terbutylazine-2-hydroxy,,,,OYTCZOJKXCTBHG-UHFFFAOYSA-N,135495928,Pesticide,Herbicide,Triazine herbicides,Chlorotriazine herbicides,Transformation product,,,Pestizid,Herbizid,0,herbicides,triazine herbicides,chlorotriazine herbicides,0
663,Flufenacet ESA,Flufenacet-ESA,,,SZCMHDLOUVZYST-UHFFFAOYSA-N,16212225,Pesticide,Herbicide,Amide herbicides,Anilide herbicides,Transformation product,,,Pestizid,0,0,herbicides,amide herbicides,anilide herbicides,0
664,Flufenacet OXA,Flufenacet-OXA,Flufenacet oxalate,,FFKNXXCOXIZLJD-UHFFFAOYSA-N,16212222,Pesticide,Herbicide,Amide herbicides,Anilide herbicides,Transformation product,,,Pestizid,0,0,herbicides,amide herbicides,anilide herbicides,0
665,Propachlor ESA,Propachlor-ESA,,,BFSZJLBDHMMCAH-UHFFFAOYSA-N,16212221,Pesticide,Herbicide,Amide herbicides,Anilide herbicides,Chloroacetanilide herbicides,Transformation product,,Pestizid,0,0,herbicides,amide herbicides,anilide herbicides,chloroacetanilide herbicides
666,Propachlor OXA,Propachlor-OXA,Propachlor oxalate,,HYHJOUPYTUBFIX-UHFFFAOYSA-N,155385,Pesticide,Herbicide,Amide herbicides,Anilide herbicides,Chloroacetanilide herbicides,Transformation product,,Pestizid,0,0,herbicides,amide herbicides,anilide herbicides,chloroacetanilide herbicides
667,Simeton,,,,HKAMKLBXTLTVCN-UHFFFAOYSA-N,12654,Pesticide,Herbicide,Triazine herbicides,Methylthiotriazine herbicides,,,,Pestizid,Herbizid,0,herbicides,triazine herbicides,methoxytriazine herbicides,0
668,Simazine-2-hydroxy,,,,YQIXRXMOJFQVBV-UHFFFAOYSA-N,135408659,Pesticide,Herbicide,Triazine herbicides,Chlorotriazine herbicides,Transformation product,,,Pestizid,Herbizid,0,herbicides,triazine herbicides,chlorotriazine herbicides,0
670,Sebuthylazine,,,,BZRUVKZGXNSXMB-UHFFFAOYSA-N,23712,Pesticide,Herbicide,Triazine herbicides,Chlorotriazine herbicides,,,,Pestizid,Herbizid,0,herbicides,triazine herbicides,chlorotriazine herbicides,0
671,Terbutylazine-desethyl,,,,LMKQNTMFZLAJDV-UHFFFAOYSA-N,108201,Pesticide,Herbicide,Triazine herbicides,Chlorotriazine herbicides,Transformation product,,,Pestizid,Herbizid,0,herbicides,triazine herbicides,chlorotriazine herbicides,0
672,Terbutylazine-desethyl-2-hydroxy,,,,NUISVCFZNCYUIM-UHFFFAOYSA-N,135612794,Pesticide,Herbicide,Triazine herbicides,Chlorotriazine herbicides,Transformation product,,,Pestizid,Herbizid,0,herbicides,triazine herbicides,chlorotriazine herbicides,0
698,Chloridazone-desphenyl,,,,FEWPCPCEGBPTAL-UHFFFAOYSA-N,95827,Pesticide,Herbicide,Pyridazinone herbicides,Transformation product,,,,Pestizid,Herbizid,0,herbicides,pyridazinone herbicides,0,0
699,Chloridazone-methyl-desphenyl,,,,XNSGCNYTNLWRKM-UHFFFAOYSA-N,594330,Pesticide,Herbicide,Pyridazinone herbicides,Transformation product,,,,Pestizid,Herbizid,0,herbicides,pyridazinone herbicides,0,0
706,Metazachlor OXA,Metazachlor-OXA,,,PHMHHVKFXZNTKU-UHFFFAOYSA-N,86290103,Pesticide,Herbicide,Amide herbicides,Anilide herbicides,Chloroacetanilide herbicides,Transformation product,,Pestizid,0,0,herbicides,amide herbicides,anilide herbicides,chloroacetanilide herbicides
707,Dimethachlor,,,,SCCDDNKJYDZXMM-UHFFFAOYSA-N,39722,Pesticide,Herbicide,Amide herbicides,Anilide herbicides,Chloroacetanilide herbicides,,,Pestizid,Herbizid,0,herbicides,amide herbicides,anilide herbicides,chloroacetanilide herbicides
708,Propachlor,,,,MFOUDYKPLGXPGO-UHFFFAOYSA-N,4931,Pesticide,Herbicide,Amide herbicides,Anilide herbicides,Chloroacetanilide herbicides,,,Pestizid,Herbizid,0,herbicides,amide herbicides,anilide herbicides,chloroacetanilide herbicides
709,Flufenacet,,,,IANUJLZYFUDJIH-UHFFFAOYSA-N,86429,Pesticide,Herbicide,Amide herbicides,Anilide herbicides,,,,Pestizid,Herbizid,0,herbicides,amide herbicides,anilide herbicides,0
804,"3,5-dibromo-4-hydroxybenzoic acid",,,,PHWAJJWKNLWZGJ-UHFFFAOYSA-N,76857,Pesticide,Herbicide,Uracil herbicides,Transformation product,,,,Pestizid,0,0,herbicides,uracil herbicides,0,0
2535,Dimethachlor ESA,Dimethachlor-ESA,,,RVSCDWJKJDBFRS-UHFFFAOYSA-N,86290104,Pesticide,Herbicide,Amide herbicides,Anilide herbicides,Chloroacetanilide herbicides,Transformation product,,Pestizid,0,0,herbicides,amide herbicides,anilide herbicides,chloroacetanilide herbicides
2536,Dimethachlor OXA,Dimethachlor-OXA,,,MHGMSAFPNAKIRZ-UHFFFAOYSA-N,86290105,Pesticide,Herbicide,Amide herbicides,Anilide herbicides,Chloroacetanilide herbicides,Transformation product,,Pestizid,0,0,herbicides,amide herbicides,anilide herbicides,chloroacetanilide herbicides
2741,Propazine,,,,WJNRPILHGGKWCK-UHFFFAOYSA-N,4937,Pesticide,Herbicide,,,,,,Pestizid,Herbizid,0,herbicides,0,0,0
3034,Ametryn,,,,RQVYBGPQFYCBGX-UHFFFAOYSA-N,13263,Pesticide,Herbicide,,,,,,Pestizid,Herbizid,0,herbicides,0,0,0
3604,Profoxydim,,,,NZYQPWCHQXECMD-UHFFFAOYSA-N,135565117,Pesticide,Herbicide,,,,,,Pestizid,Herbizid,0,herbicides,0,0,0
3201,Hydrocortisone,,,,JYGXADMDTFJGBT-VWUMJDOOSA-N,5754,Pharmaceutical,Hormone,Steroid hormone,,,,,Pharmazeutika,Steroidhormon,0,hormone,0,0,0
107,Amitraz,,,,QXAITBQSYVNQDR-UHFFFAOYSA-N,36324,Pesticide,Insecticide,,,,,,Pestizid,Insektizid,0,insecticides,0,0,0
293,Diazinon,,,,FHIVAFMUCKRCQO-UHFFFAOYSA-N,3017,Pesticide,Insecticide,Organophosphorus insecticides,Organothiophosphate insecticides,Heterocyclic organothiophosphate insecticides,,,Pestizid,Insektizid,0,insecticides,organophosphorus insecticides,organothiophosphate insecticides,heterocyclic organothiophosphate insecticides
325,(3-Phenoxyphenyl)methanol,,,,KGANAERDZBAECK-UHFFFAOYSA-N,26295,Pesticide,Insecticide,Pyrethroid insecticides,Pyrethroid ester insecticides,Transformation product,,,Pestizid,0,0,insecticides,pyrethroid insecticides,pyrethroid ester insecticides,0
326,3-Phenoxybenzoic acid,,,,NXTDJHZGHOFSQG-UHFFFAOYSA-N,19539,Pesticide,Insecticide,Pyrethroid insecticides,Pyrethroid ester insecticides,Transformation product,,,Pestizid,Insecticide metabolite,0,insecticides,pyrethroid insecticides,pyrethroid ester insecticides,0
330,"2,4-dimethylphenylformamide",,,,JOFDPSBOUCXJCC-UHFFFAOYSA-N,92363,Pesticide,Insecticide,Formamidine insecticides,Transformation product,,,,Pestizid,Insecticide metabolite,0,insecticides,formamidine insecticides,0,0
330,"N-(2,4-dimethylphenyl)formamide",,,,JOFDPSBOUCXJCC-UHFFFAOYSA-N,92363,Pesticide,Insecticide,Formamidine insecticides,Transformation product,,,,Pestizid,Insecticide metabolite,0,insecticides,formamidine insecticides,0,0
331,"N'-(2,4-Dimethylphenyl)-N-methylformamidine",,,,JIIOLEGNERQDIP-UHFFFAOYSA-N,36326,Pesticide,Insecticide,Formamidine insecticides,Transformation product,,,,Pestizid,Insektizid,0,insecticides,formamidine insecticides,0,0
2666,Fipronil,,,,ZOCSXAVNDGMNBV-UHFFFAOYSA-N,3352,Pesticide,Insecticide,Pyrazole insecticides,Phenylpyrazole insecticides,,,,Pestizid,Insektizid,0,insecticides,pyrazole insecticides,phenylpyrazole insecticides,0
2667,Fipronil-sulfone,,,,LGHZJDKSVUTELU-UHFFFAOYSA-N,3078139,Pesticide,Insecticide,Pyrazole insecticides,Phenylpyrazole insecticides,Transformation product,,,Pestizid,Insecticide metabolite,0,insecticides,pyrazole insecticides,phenylpyrazole insecticides,0
2668,Fipronil-sulfide,,,,FQXWEKADCSXYOC-UHFFFAOYSA-N,9953940,Pesticide,Insecticide,Pyrazole insecticides,Phenylpyrazole insecticides,Transformation product,,,Pestizid,Insecticide metabolite,0,insecticides,pyrazole insecticides,phenylpyrazole insecticides,0
2669,Fipronil-desulfinyl,,,,JWKXVHLIRTVXLD-UHFFFAOYSA-N,22673275,Pesticide,Insecticide,Pyrazole insecticides,Phenylpyrazole insecticides,Transformation product,,,Pestizid,Insecticide metabolite,0,insecticides,pyrazole insecticides,phenylpyrazole insecticides,0
2705,Diazoxon,,,,VBLJFQYCTRKKKF-UHFFFAOYSA-N,13754,Pesticide,Insecticide,Organophosphorus insecticides,Organothiophosphate insecticides,Heterocyclic organothiophosphate insecticides,Transformation product,,Pestizid,0,0,insecticides,organophosphorus insecticides,organothiophosphate insecticides,heterocyclic organothiophosphate insecticides
2706,Pyrimidinol,,,,AJPIUNPJBFBUKK-UHFFFAOYSA-N,135444498,Pesticide,Insecticide,Organophosphorus insecticides,Organothiophosphate insecticides,Heterocyclic organothiophosphate insecticides,Transformation product,,Pestizid,Insecticide metabolite,0,insecticides,organophosphorus insecticides,organothiophosphate insecticides,heterocyclic organothiophosphate insecticides
2709,Imidacloprid,,,,YWTYJOPNNQFBPC-UHFFFAOYSA-N,86418,Pesticide,Insecticide,Nicotinoid insecticides,Nitroguanidine insecticides,,,,Pestizid,Insektizid,0,insecticides,nicotinoid insecticides,nitroguanidine insecticides,0
2937,Methiocarb,,,,YFBPRJGDJKVWAH-UHFFFAOYSA-N,16248,Pesticide,Insecticide,,,,,,Pestizid,Insektizid,0,insecticides,0,0,0
2954,Thiacloprid,,,,HOKKPVIRMVDYPB-UHFFFAOYSA-N,115224,Pesticide,Insecticide,,,,,,Pestizid,PSM-Insektizid,0,insecticides,0,0,0
2956,Imidacloprid-urea,,,,ADWTYURAFSWNSU-UHFFFAOYSA-N,15390532,Pesticide,Insecticide,Transformation product,,,,,Pestizid,Insecticide metabolite,0,insecticides,0,0,0
3059,Imidacloprid-desnitro,,,,UEQZFAGVRGWPDK-UHFFFAOYSA-N,10130527,Pesticide,Insecticide,Transformation product,,,,,Pestizid,Insecticide metabolite,0,insecticides,0,0,0
201,Diclofenac,,,,DCOPUUMXTXDBNB-UHFFFAOYSA-N,3033,Pharmaceutical,Musculo-skeletal system,Antiinflammatory and antirheumatic products,"Antiinflammatory and antirheumatic products, non-steroids",Acetic acid derivatives and related substances,,M01AB05,Pharmazeutika,Antirheumatikum,Analgetikum,MUSCULO-SKELETAL SYSTEM,ANTIINFLAMMATORY AND ANTIRHEUMATIC PRODUCTS,"ANTIINFLAMMATORY AND ANTIRHEUMATIC PRODUCTS, NON-STEROIDS",Acetic acid derivatives and related substances
3008,Nicotine,,,,SNICXCGAKADSCV-JTQLQIEISA-N,89594,Natural product,Stimulants,,,,,,Naturstoff,0,0,natural occuring substance,0,0,0
194,Carbamazepine,,,,FFGPTBGBLSHEPO-UHFFFAOYSA-N,2554,Pharmaceutical,Nervous System,Antiepileptic,Carboxamide derivatives,,,N03AF01,Pharmazeutika,Antiepileptikum,Antiepileptikum,NERVOUS SYSTEM,ANTIEPILEPTICS,ANTIEPILEPTICS,Carboxamide derivatives
236,4-Acetamidoantipyrine,N-Acetyl-4-Aminoantipyrin,,4-AAA,OIAGWXKSCXPNNZ-UHFFFAOYSA-N,65743,Pharmaceutical,Nervous System,Analgesic,Pyrazolones,Transformation product,,N02BB02,Pharmazeutika,Analgetikum,Analgetikum,NERVOUS SYSTEM,ANALGESICS,OTHER ANALGESICS AND ANTIPYRETICS,Pyrazolones
303,Caffeine,,,,RYYVLZVUVIJVGH-UHFFFAOYSA-N,2519,Natural product,Stimulants,Nervous System,Psychoanaleptics,"Psycostimulants, agents used for ADHD and nootropics",Xanthine derivatives,,Natural occuring substance,0,0,NERVOUS SYSTEM,PSYCHOANALEPTICS,"PSYCHOSTIMULANTS, AGENTS USED FOR ADHD AND NOOTROPICS",Xanthine derivatives
334,Fluoxetine,,,,RTHCYVBBDHJXIQ-UHFFFAOYSA-N,3386,Pharmaceutical,Nervous System,Psychoanaleptics,Antidepressant,Selective serotonin reuptake inhibitors,,N06AB03,Pharmazeutika,Antidepressivum,Antidepressivum,NERVOUS SYSTEM,PSYCHOANALEPTICS,ANTIDEPRESSANTS,Selective serotonin reuptake inhibitors
645,Venlafaxine,,,,PNVNVHUZROJLTJ-UHFFFAOYSA-N,5656,Pharmaceutical,Nervous System,Psychoanaleptics,Antidepressant,,,N06AX16,Pharmazeutika,Antidepressivum,Antidepressivum,NERVOUS SYSTEM,PSYCHOANALEPTICS,ANTIDEPRESSANTS,Other antidepressants
702,Aminopyrine,,,,RMMXTBMQSGEXHJ-UHFFFAOYSA-N,6009,Pharmaceutical,Nervous System,Analgesic,Pyrazolones,,,N02BB03,Pharmazeutika,Analgetikum,Analgetikum,NERVOUS SYSTEM,ANALGESICS,OTHER ANALGESICS AND ANTIPYRETICS,Pyrazolones
845,4-Aminoantipyrine,4-Aminopyrine,,4-AA,RLFWWDJHLFCNIJ-UHFFFAOYSA-N,2151,Pharmaceutical,Nervous System,Analgesic,Pyrazolones,Transformation product,,N02BB03,Pharmazeutika,Analgetikum,Analgetikum,NERVOUS SYSTEM,ANALGESICS,OTHER ANALGESICS AND ANTIPYRETICS,Pyrazolones
916,"Carbamazepine-10,11-epoxide",,,,ZRWWEEVEIOGMMT-UHFFFAOYSA-N,2555,Pharmaceutical,Nervous System,Antiepileptic,Carboxamide derivatives,Transformation product,,N03AF01,Pharmazeutika,Antiepileptikum,Antiepileptikum,NERVOUS SYSTEM,ANTIEPILEPTICS,ANTIEPILEPTICS,Carboxamide derivatives
992,Iminostilbene,,,,LCGTWRLJTMHIQZ-UHFFFAOYSA-N,9212,Pharmaceutical,Nervous System,Antiepileptic,Carboxamide derivatives,Transformation product,,N03AF01,Pharmazeutika,Antiepileptikum,Antiepileptikum,NERVOUS SYSTEM,ANTIEPILEPTICS,ANTIEPILEPTICS,Carboxamide derivatives
1034,N-Desvenlafaxine,N-Desmethylvenlafaxine,,,MKAFOJAJJMUXLW-UHFFFAOYSA-N,3501942,Pharmaceutical,Nervous System,Psychoanaleptics,Antidepressant,Other antidepressants,Transformation product,N06AX16,Pharmazeutika,Antidepressivum,Antidepressivum,NERVOUS SYSTEM,PSYCHOANALEPTICS,ANTIDEPRESSANTS,Other antidepressants
1038,4-Formylaminoantipyrine,,,4-FAA,WSJBSKRPKADYRQ-UHFFFAOYSA-N,72666,Pharmaceutical,Nervous System,Analgesic,Pyrazolones,Transformation product,,N02BB03,Pharmazeutika,Analgetikum,Analgetikum,NERVOUS SYSTEM,ANALGESICS,OTHER ANALGESICS AND ANTIPYRETICS,Pyrazolones
1053,O-Desvenlafaxine,O-Desmethylvenlafaxine,,,KYYIDSXMWOZKMP-UHFFFAOYSA-N,125017,Pharmaceutical,Nervous System,Psycholeptics,Antidepressant,Transformation product,,N06AX23,Pharmazeutika,Antidepressivum,Antidepressivum,NERVOUS SYSTEM,PSYCHOANALEPTICS,ANTIDEPRESSANTS,Other antidepressants
2561,Gabapentin,,,,UGJMXCAKCUNAIE-UHFFFAOYSA-N,3446,Pharmaceutical,Nervous System,Antiepileptic,,,,N03AX12,Pharmazeutika,Antiepileptikum,Antiepileptikum,NERVOUS SYSTEM,ANTIEPILEPTICS,ANTIEPILEPTICS,Other antiepileptics
2567,Tramadol,,,,TVYLLZQTGLZFBW-ZBFHGGJFSA-N,33741,Pharmaceutical,Nervous System,Analgesic,Opioid,,,N02AX02,Pharmazeutika,Analgetikum,0,NERVOUS SYSTEM,ANALGESICS,OPIOIDS,Other opioids
2572,Lidocaine,,,,NNJVILVZKWQKPM-UHFFFAOYSA-N,3676,Pharmaceutical,Nervous System,Anaesthetic,Local anaesthetic,Amides,,N01BB02,Pharmazeutika,Lokalanästhetikum,Lokalanästhetikum,NERVOUS SYSTEM,ANESTHETICS,"ANESTHETICS, LOCAL",Amides
2626,Diazepam,,,,AAOVKJBEBIDNHE-UHFFFAOYSA-N,3016,Pharmaceutical,Nervous System,Psycholeptics,Anxiolytic,Benzodiazepine derivatives,Anticonvulsive,N05BA01,Betäubungsmittel,Anxyiolytikum,Antikonvulsivum,NERVOUS SYSTEM,PSYCHOLEPTICS,ANXIOLYTICS,Benzodiazepine derivatives
2657,"N,O-Didesvenlafaxine","N,O-Didesmethylvenlafaxine",,,MMSWXJSQCAEDLK-UHFFFAOYSA-N,3451347,Pharmaceutical,Nervous System,Psychoanaleptics,Antidepressant,Transformation product,,N06AX16,Pharmazeutika,Antidepressivum,Antidepressivum,NERVOUS SYSTEM,PSYCHOANALEPTICS,ANTIDEPRESSANTS,Other antidepressants
2658,"N,N-Didesvenlafaxine","N,N-Didesmethylvenlafaxine",,,SUQHIQRIIBKNOR-UHFFFAOYSA-N,9795857,Pharmaceutical,Nervous System,Psychoanaleptics,Antidepressant,Transformation product,,N06AX16,Pharmazeutika,Antidepressivum,Antidepressivum,NERVOUS SYSTEM,PSYCHOANALEPTICS,ANTIDEPRESSANTS,Other antidepressants
2708,AMDOPH,Dioxypyramidon,,,IRTZMJWVZQYURE-UHFFFAOYSA-N,68214,Pharmaceutical,Nervous System,Analgesic,Pyrazolones,,,,Pharmazeutika,0,0,NERVOUS SYSTEM,ANALGESICS,OTHER ANALGESICS AND ANTIPYRETICS,Pyrazolones
2744,Morphine,,,,BQJCRHHNABKAKU-KBQPJGBKSA-N,5288826,Pharmaceutical,Nervous System,Analgesic,Opioid,Natural opium alkaloids,Narcotic,N02AA01,Betäubungsmittel,Narkotikum,0,NERVOUS SYSTEM,ANALGESICS,OPIOIDS,Natural opium alkaloids
2828,Methadone,,,,USSIQXCVUWKGNF-UHFFFAOYSA-N,4095,Pharmaceutical,Nervous System,Anaesthetic,Opioid,,,,Betäubungsmittel,Opioid,0,NERVOUS SYSTEM,0,0,0
2861,Trimipramine,,,,ZSCDBOWYZJWBIY-UHFFFAOYSA-N,5584,Pharmaceutical,Nervous System,Antidepressant,,,,,Pharmazeutika,Antidepressivum,0,NERVOUS SYSTEM,0,0,0
3004,Pargyline,,,,DPWPWRLQFGFJFI-UHFFFAOYSA-N,4688,Pharmaceutical,Nervous System,Analgesic,,,,,Pharmazeutika,Analgetikum,0,NERVOUS SYSTEM,0,0,0
3274,Mianserin,,,,UEQUQVLFIPOEMF-UHFFFAOYSA-N,4184,Pharmaceutical,Nervous System,Antidepressant,,,,,Pharmazeutika,Antidepressivum,0,NERVOUS SYSTEM,0,0,0
3622,Mirtazapine,,,,RONZAEMNMFQXRA-UHFFFAOYSA-N,4205,Pharmaceutical,Nervous System,Antidepressant,,,,,Pharmazeutika,Antidepressivum,0,NERVOUS SYSTEM,0,0,0
3640,Fentanyl,,,,PJMPHNIQZUBGLI-UHFFFAOYSA-N,3345,Pharmaceutical,Nervous System,Anaesthetic,Opioid,,,,Betäubungsmittel,Opioid,0,NERVOUS SYSTEM,0,0,0
3681,Flunitrazepam,,,,PPTYJKAXVCCBDU-UHFFFAOYSA-N,3380,Pharmaceutical,Nervous System,Sedative,,,,,Pharmazeutika,Sedativum,0,NERVOUS SYSTEM,0,0,0
151,Trinexapac-ethyl,,,,RVKCCVTVZORVGD-UHFFFAOYSA-N,92421,Pesticide,Plant growth regulator,,,,,,Pestizid,Pflanzenwachstumsregulator,0,plant growth regulators,0,0,0
2817,Cocaine,,,,ZPUCINDJVBIVPJ-UHFFFAOYSA-N,2826,Pharmaceutical,Illicit drugs and related compounds,Stimulants,Recreational drug,Anaesthetic,,,Betäubungsmittel,Stimulans,Anhang a,recreational drug,0,0,0
3084,Meclozine,,,,OCJYIGYOJCODJL-UHFFFAOYSA-N,4034,Pharmaceutical,Antihistamine,,,,,,Pharmazeutika,Antihistaminikum,0,RESPIRATORY SYSTEM,<= wrong,0,0
3632,Theophylline,Theophyline,,,ZFXYFBGIUFBOJW-UHFFFAOYSA-N,2153,Natural product,Stimulants,Respiratory system,,,,,Naturstoff,Stimulans,0,RESPIRATORY SYSTEM,0,0,0
2924,Perfluorooctyl phosphate,,,,FZTRDYSPWWJCOF-UHFFFAOYSA-N,14250578,PFAS,Perfluorophosphate,Surfactant,,,,,PFC,Perfluorophosphate,0,surfactant,0,0,0
2925,Perfluorodecyl phosphate,,,,MIABSAQIFYEDJP-UHFFFAOYSA-N,10143739,PFAS,Perfluorophosphate,Surfactant,,,,,PFC,Perfluorophosphate,0,surfactant,0,0,0
2612,Dexamethasone,,,,UREBDLICKHMUKA-CXSFZGCWSA-N,5743,Pharmaceutical,Systemic hormonal preparations,Corticosteroids for systemic use,Glucocorticoids,,,H02AB02,Pharmazeutika,Corticosteroid,Glucocorticoid,SYSTEMIC HORMONAL PREPARATIONS,CORTICOSTEROIDS FOR SYSTEMIC USE,"CORTICOSTEROIDS FOR SYSTEMIC USE, PLAIN",Glucocorticoids
