"hid","SourceName","SourceID","HNID","nCIDs","nodeNames","nodeHNID","nodeIDs","parentIDs","node_nCIDs","includeNode"
101,"NORMAN Suspect List Exchange","norman_sle_tree",3981444,132904,"Animal Drugs Approved in Taiwan",4112126,"node_807","node_806",187,TRUE
101,"NORMAN Suspect List Exchange","norman_sle_tree",3981444,132904,"S72 | NTUPHTW | Pharmaceutically Active Substances from National Taiwan University",4112125,"node_805","root",1068,TRUE
101,"NORMAN Suspect List Exchange","norman_sle_tree",3981444,132904,"S72 | NTUPHTW | Pharmaceutically Active Substances from National Taiwan University",4112144,"node_840","root",1065,TRUE
