"hid","SourceName","SourceID","HNID","nCIDs","nodeNames","nodeHNID","nodeIDs","parentIDs","node_nCIDs","includeNode"
101,"NORMAN Suspect List Exchange","norman_sle_tree",3981444,132904,"EU REACH Pre-registered",3981867,"node_400","node_394",844,TRUE
101,"NORMAN Suspect List Exchange","norman_sle_tree",3981444,132904,"EU REACH Registered",3981868,"node_401","node_394",60,TRUE
101,"NORMAN Suspect List Exchange","norman_sle_tree",3981444,132904,"S32 | REACH2017 | 2017 List of REACH Chemicals",4041148,"node_461","root",66534,TRUE
