hid,SourceName,SourceID,HNID,nCIDs,nodeNames,nodeHNID,nodeIDs,parentIDs,node_nCIDs,includeNode
2,ChEBI,OBO,952816,103401,plasticiser,1677199,node_2750135,node_2732681,11,TRUE
7,KEGG,br08006,2295998,89,Plasticizers and plastics,2296011,node_1,root,13,TRUE
14,KEGG,br08301,2334510,1502,42 Antineoplastics,2335321,node_1851,node_1784,137,FALSE
15,KEGG,br08302,2337902,1172,Antineoplastics,2339800,node_2590,root,124,FALSE
15,KEGG,br08302,2337902,1172,"Antineoplastics, Other",2340259,node_2759,node_2590,13,FALSE
62,KEGG,br08316,2371664,367,Plasticizer,2372782,node_2081,root,11,TRUE
79,WHO ATC,ATCTree,1949731,16452,L - Antineoplastic and immunomodulating agents,1953076,node_3500,root,1721,FALSE
79,WHO ATC,ATCTree,1949731,16452,L01 - Antineoplastic agents,1953077,node_3501,node_3500,1303,FALSE
79,WHO ATC,ATCTree,1949731,16452,L01X - Other antineoplastic agents,1953176,node_3602,node_3501,649,FALSE
84,ChemIDplus,ChemIDplus_tree,3091656,324487,Plasticizers,3092742,node_876,node_830,4,TRUE
96,KEGG,br08330,3439111,4620,Antineoplastic,3440484,node_1716,root,338,FALSE
96,KEGG,br08330,3439111,4620,DG01439 Arabinofuranosyl type antineoplastic,3440830,node_2077,node_2075,21,FALSE
96,KEGG,br08330,3439111,4620,DG01439 Arabinofuranosyl type antineoplastic,3440871,node_2119,node_1716,21,FALSE
96,KEGG,br08330,3439111,4620,DG01524 Triazole antineoplastic,3440891,node_2175,node_1716,3,FALSE
96,KEGG,br08330,3439111,4620,DG01620 Tamoxifene-type antineoplastic,3446013,node_9915,node_9911,17,FALSE
96,KEGG,br08330,3439111,4620,DG01682 Anthracycline antineoplastic,3440892,node_2179,node_1716,24,FALSE
96,KEGG,br08330,3439111,4620,DG01727 Anthraquinone antineoplastic,3440926,node_2213,node_1716,10,FALSE
96,KEGG,br08330,3439111,4620,"DG01930 Dihydrofolate reductase inhibitor, antineoplastic",3440819,node_2065,node_1716,7,FALSE
96,KEGG,br08330,3439111,4620,"DG01930 Dihydrofolate reductase inhibitor, antineoplastic",3440878,node_2154,node_2153,7,FALSE
96,KEGG,br08330,3439111,4620,DG01935 Fluoropyrimidine antineoplastic,3440855,node_2102,node_2075,7,FALSE
96,KEGG,br08330,3439111,4620,DG01935 Fluoropyrimidine antineoplastic,3440875,node_2144,node_1716,7,FALSE
96,KEGG,br08330,3439111,4620,"DG01958 Nucleic acid derivative, antineoplastic",3440829,node_2075,node_1716,34,FALSE
96,KEGG,br08330,3439111,4620,"DG01958 Nucleic acid derivative, antineoplastic",3440963,node_2269,node_2246,34,FALSE
96,KEGG,br08330,3439111,4620,"DG01965 Antineoplastic, vinca alkaloid",3440937,node_2226,node_1716,15,FALSE
99,EPA Chemical and Products Database (CPDat),cpdat_tree,3739864,23284,Other additives for thermoplastic,3740534,node_682,node_626,1,TRUE
99,EPA Chemical and Products Database (CPDat),cpdat_tree,3739864,23284,Plasticiser,3740267,node_407,node_358,44,TRUE
99,EPA Chemical and Products Database (CPDat),cpdat_tree,3739864,23284,Plasticizer,3740201,node_340,node_289,4,TRUE
99,EPA Chemical and Products Database (CPDat),cpdat_tree,3739864,23284,Plasticizer,3740412,node_558,node_502,38,TRUE
99,EPA Chemical and Products Database (CPDat),cpdat_tree,3739864,23284,Plasticizer,3740477,node_624,node_594,10,TRUE
99,EPA Chemical and Products Database (CPDat),cpdat_tree,3739864,23284,Plasticizer,3740539,node_687,node_626,32,TRUE
99,EPA Chemical and Products Database (CPDat),cpdat_tree,3739864,23284,Plastics,3741050,node_1186,node_1170,1,TRUE
99,EPA Chemical and Products Database (CPDat),cpdat_tree,3739864,23284,Plastics,3741600,node_1730,node_1707,109,TRUE
99,EPA Chemical and Products Database (CPDat),cpdat_tree,3739864,23284,Plastics,3741647,node_1777,node_1738,423,TRUE
99,EPA Chemical and Products Database (CPDat),cpdat_tree,3739864,23284,Plastics,3741733,node_1863,node_1841,244,TRUE
99,EPA Chemical and Products Database (CPDat),cpdat_tree,3739864,23284,Plastics,3741780,node_1910,node_1887,7,TRUE
99,EPA Chemical and Products Database (CPDat),cpdat_tree,3739864,23284,Plastics,3741807,node_1937,node_1920,15,TRUE
101,NORMAN Suspect List Exchange,norman_sle_tree,3981444,132904,Antineoplastic and immunomodulating agents,4041012,node_571,node_563,2,FALSE
101,NORMAN Suspect List Exchange,norman_sle_tree,3981444,132904,Plasticiser,4067013,node_782,node_734,46,TRUE
101,NORMAN Suspect List Exchange,norman_sle_tree,3981444,132904,S47 | ECHAPLASTICS | A list from the Plastic Additives Initiative Mapping Exercise by ECHA,4041152,node_464,root,236,TRUE
101,NORMAN Suspect List Exchange,norman_sle_tree,3981444,132904,S48 | CCPDBLISTA | Database of Chemicals associated with Plastic Packaging (CPPdb) List A,4041100,node_448,root,635,TRUE
101,NORMAN Suspect List Exchange,norman_sle_tree,3981444,132904,S49 | CCPDBLISTB | Database of Chemicals associated with Plastic Packaging (CPPdb) List B,4041149,node_462,root,2069,TRUE
