"hid","SourceName","SourceID","HNID","nCIDs","nodeNames","nodeHNID","nodeIDs","parentIDs","node_nCIDs","includeNode"
99,"EPA Chemical and Products Database (CPDat)","cpdat_tree",3739864,23284,"Perfluorochemical",3741748,"node_1878","node_1869",12,TRUE
101,"NORMAN Suspect List Exchange","norman_sle_tree",3981444,132904,"100 Perfluoroalkyl carbonyl compounds (CnF2n+1-C(=O)-R)",3981456,"node_252","node_251",492,TRUE
101,"NORMAN Suspect List Exchange","norman_sle_tree",3981444,132904,"200 Perfluoroalkane sulfonyl compounds  (CnF2n+1-S(=O)(=O)-R)",3981457,"node_264","node_251",458,TRUE
101,"NORMAN Suspect List Exchange","norman_sle_tree",3981444,132904,"300 Perfluoroalkyl phosphate compounds (CnF2n+1-P(O)-R)",3981458,"node_281","node_251",16,TRUE
101,"NORMAN Suspect List Exchange","norman_sle_tree",3981444,132904,"500 Per- and polyfluoroalkyl ether-based compounds (CnF2n+1-O-CmF2m+1-R)",3981460,"node_322","node_251",322,TRUE
101,"NORMAN Suspect List Exchange","norman_sle_tree",3981444,132904,"600 Other PFAA precursors and related compounds - perfluoroalkyl ones",3981461,"node_355","node_251",282,TRUE
101,"NORMAN Suspect List Exchange","norman_sle_tree",3981444,132904,"Perfluorocarbon Chain Length",3981452,"node_11","node_1",3656,TRUE
101,"NORMAN Suspect List Exchange","norman_sle_tree",3981444,132904,"Perfluorophosphates",4041113,"node_698","node_697",4,TRUE
101,"NORMAN Suspect List Exchange","norman_sle_tree",3981444,132904,"PFAS",4041259,"node_697","node_483",4,TRUE
101,"NORMAN Suspect List Exchange","norman_sle_tree",3981444,132904,"S09 | PFASTRIER | PFAS Suspect List of fluorinated substances from X. Trier and colleagues",4041043,"node_432","root",499,TRUE
101,"NORMAN Suspect List Exchange","norman_sle_tree",3981444,132904,"S14 | KEMIPFAS | PFAS Highly Fluorinated Substances List from KEMI",4041040,"node_429","root",1344,TRUE
101,"NORMAN Suspect List Exchange","norman_sle_tree",3981444,132904,"S25 | OECDPFAS | List of PFAS from the OECD",3981445,"node_1","root",3680,TRUE
101,"NORMAN Suspect List Exchange","norman_sle_tree",3981444,132904,"S25 | OECDPFAS | List of PFAS from the OECD",4041034,"node_427","root",3694,TRUE
101,"NORMAN Suspect List Exchange","norman_sle_tree",3981444,132904,"S46 | PFASNTREV19 | List of PFAS reported in Non-Target HRMS Studies from Liu et al 2019",4041209,"node_474","root",680,TRUE
