hid,SourceName,SourceID,HNID,nCIDs,nodeNames,nodeHNID,nodeIDs,parentIDs,node_nCIDs,includeNode
4,KEGG,br08002,2289983,1956,FA0804 N-acyl ethanolamines (endocannabinoids),3367224,node_534,node_521,3,TRUE
5,KEGG,br08003,2292706,2845,Cannabinoids,2295529,node_2766,node_2765,7,TRUE
22,KEGG,br08310,2358608,4142,Cannabinoid,2366209,node_5819,node_3608,11,TRUE
54,LIPID MAPS,LM,3494073,42579,N-acyl ethanolamines (endocannabinoids) [FA0804],283135,node_66,node_62,52,TRUE
60,KEGG,br08010,2298624,312,Cannabinoid,2298634,node_261,node_260,4,TRUE
78,FDA Pharm Classes,FDA_pharm_tree,1936306,1284,Cannabinoid [EPC],1947100,node_32804,node_32775,2,TRUE
84,ChemIDplus,ChemIDplus_tree,3091656,324487,Cannabinoid Receptor,3092039,node_343,node_323,22,FALSE
84,ChemIDplus,ChemIDplus_tree,3091656,324487,CB1 Cannabinoid Inverse Agonist,3092015,node_324,node_323,1,FALSE
84,ChemIDplus,ChemIDplus_tree,3091656,324487,CB1 Cannabinoid Receptor Antagonist,3092016,node_325,node_323,1,FALSE
92,IUPHAR/BPS Guide to PHARMACOLOGY,Target Classification,3361437,6414,Cannabinoid receptors,3361450,node_15,node_2,55,FALSE
92,IUPHAR/BPS Guide to PHARMACOLOGY,Target Classification,3361437,6414,Endocannabinoid turnover,3362151,node_658,node_249,38,FALSE
101,NORMAN Suspect List Exchange,norman_sle_tree,3981444,132904,S45 | SYNTHCANNAB | Synthetic Cannabinoids,4041111,node_451,root,39,TRUE
101,NORMAN Suspect List Exchange,norman_sle_tree,3981444,132904,S58 | PSYCHOCANNAB | Synthetic Cannabinoids and Psychoactive Compounds,4041151,node_463,root,525,FALSE
