hid,SourceName,SourceID,HNID,nCIDs,nodeNames,nodeHNID,nodeIDs,parentIDs,node_nCIDs,includeNode
4,KEGG,br08002,2289983,1956,FA0201 12-oxophytodienoic acid metabolites,2290173,node_211,node_210,2,TRUE
14,KEGG,br08301,2334510,1502,3 Agents affecting metabolism,2336024,node_2110,root,217,FALSE
14,KEGG,br08301,2334510,1502,39 Other agents affecting metabolism,2334673,node_2111,node_2110,133,FALSE
14,KEGG,br08301,2334510,1502,422 Antimetabolites,2335684,node_2009,node_1851,17,FALSE
15,KEGG,br08302,2337902,1172,Antimetabolites,2340710,node_2815,node_2590,5,FALSE
15,KEGG,br08302,2337902,1172,"Antimetabolites, Antiproliferative",3956876,node_3217,node_3208,6,FALSE
15,KEGG,br08302,2337902,1172,"Antimetabolites, Purine",3956885,node_3227,node_3208,2,FALSE
28,KEGG,br08331,2374221,280,96 Agents affecting metabolism,2374361,node_73,root,55,FALSE
28,KEGG,br08331,2374221,280,969 Other agents affecting metabolism,2374478,node_97,node_73,5,FALSE
28,KEGG,br08331,2374221,280,"9699 Agents affecting metabolism, n.e.c.",2374957,node_110,node_97,2,FALSE
54,LIPID MAPS,LM,3494073,42579,12-oxophytodienoic acid metabolites [FA0201],280483,node_21,node_20,17,TRUE
72,PubChem,Compound TOC,1749165,49517422,Agrochemical Transformations,3973846,node_152,node_148,1384,TRUE
72,PubChem,Compound TOC,1749165,49517422,Drug Transformations,4041262,node_138,node_110,134,TRUE
72,PubChem,Compound TOC,1749165,49517422,Human Metabolite Information,1857207,node_320,node_315,64198,TRUE
72,PubChem,Compound TOC,1749165,49517422,KEGG: Metabolite,1857184,node_46,node_28,521,TRUE
72,PubChem,Compound TOC,1749165,49517422,Metabolism/Metabolites,3647588,node_328,node_315,5654,TRUE
72,PubChem,Compound TOC,1749165,49517422,Metabolite Pathways,1857186,node_321,node_320,43173,TRUE
72,PubChem,Compound TOC,1749165,49517422,Metabolite References,1857189,node_168,node_165,92167,TRUE
72,PubChem,Compound TOC,1749165,49517422,Transformations,3956434,node_330,node_315,4640,TRUE
78,FDA Pharm Classes,FDA_pharm_tree,1936306,1284,Antimetabolite [EPC],1948679,node_32735,node_32671,3,FALSE
78,FDA Pharm Classes,FDA_pharm_tree,1936306,1284,Antimetabolite Immunosuppressant [EPC],1946931,node_32699,node_32671,1,FALSE
78,FDA Pharm Classes,FDA_pharm_tree,1936306,1284,Purine Antimetabolite [EPC],1947030,node_33148,node_33120,2,FALSE
79,WHO ATC,ATCTree,1949731,16452,A - Alimentary tract and metabolism,1949732,node_1,root,2781,FALSE
79,WHO ATC,ATCTree,1949731,16452,A16 - Other alimentary tract and metabolism products,1950458,node_757,node_1,121,FALSE
79,WHO ATC,ATCTree,1949731,16452,A16A - Other alimentary tract and metabolism products,1950459,node_758,node_757,121,FALSE
79,WHO ATC,ATCTree,1949731,16452,L01B - Antimetabolites,1953111,node_3536,node_3501,182,FALSE
92,IUPHAR/BPS Guide to PHARMACOLOGY,Target Classification,3361437,6414,Leukotriene and lipoxin metabolism,3361695,node_280,node_276,9,FALSE
92,IUPHAR/BPS Guide to PHARMACOLOGY,Target Classification,3361437,6414,Nucleoside synthesis and metabolism,3362129,node_651,node_249,24,FALSE
96,KEGG,br08330,3439111,4620,DG02018 Antimetabolite,3440957,node_2246,node_1716,51,FALSE
101,NORMAN Suspect List Exchange,norman_sle_tree,3981444,132904,Alimentary tract and metabolism,4041221,node_631,node_563,4,FALSE
101,NORMAN Suspect List Exchange,norman_sle_tree,3981444,132904,"Pesticide transformation products (TPs, metabolites, successors)",3981448,node_417,node_415,1099,TRUE
101,NORMAN Suspect List Exchange,norman_sle_tree,3981444,132904,S38 | SOLNSLMCTPS | SOLUTIONS Predicted Transformation Products by LMC,4041071,node_440,root,2798,TRUE
101,NORMAN Suspect List Exchange,norman_sle_tree,3981444,132904,S60 | SWISSPEST19 | Swiss Pesticides and Metabolites from Kiefer et al 2019,3981446,node_415,root,1355,TRUE
101,NORMAN Suspect List Exchange,norman_sle_tree,3981444,132904,S60 | SWISSPEST19 | Swiss Pesticides and Metabolites from Kiefer et al 2019,4041166,node_468,root,1478,TRUE
101,NORMAN Suspect List Exchange,norman_sle_tree,3981444,132904,S66 | EAWAGTPS | Parent-Transformation Product Pairs from Eawag,4041145,node_459,root,258,TRUE
101,NORMAN Suspect List Exchange,norman_sle_tree,3981444,132904,S66 | EAWAGTPS | Parent-Transformation Product Pairs from Eawag,4041251,node_483,root,258,TRUE
101,NORMAN Suspect List Exchange,norman_sle_tree,3981444,132904,S68 | HSDBTPS | Transformation Products Extracted from HSDB Content in PubChem,4066933,node_702,root,101,TRUE
101,NORMAN Suspect List Exchange,norman_sle_tree,3981444,132904,S68 | HSDBTPS | Transformation Products Extracted from HSDB Content in PubChem,4067032,node_801,root,102,TRUE
101,NORMAN Suspect List Exchange,norman_sle_tree,3981444,132904,S73 | METXBIODB | Metabolite Reaction Database from BioTransformer,4153374,node_841,root,3134,TRUE
101,NORMAN Suspect List Exchange,norman_sle_tree,3981444,132904,Transformation products,4041087,node_553,node_552,6,TRUE
101,NORMAN Suspect List Exchange,norman_sle_tree,3981444,132904,Transformation products,4041101,node_500,node_487,7,TRUE
101,NORMAN Suspect List Exchange,norman_sle_tree,3981444,132904,Transformation products,4041199,node_625,node_563,43,TRUE
101,NORMAN Suspect List Exchange,norman_sle_tree,3981444,132904,Transformation products,4041222,node_486,node_485,3,TRUE
101,NORMAN Suspect List Exchange,norman_sle_tree,3981444,132904,Transformation products,4066957,node_726,node_704,75,TRUE
101,NORMAN Suspect List Exchange,norman_sle_tree,3981444,132904,"Transformation products (TPs, successors)",4041188,node_551,node_483,158,TRUE
101,NORMAN Suspect List Exchange,norman_sle_tree,3981444,132904,"Transformation products (TPs, successors)",4067034,node_803,node_801,85,TRUE
