hid,SourceName,SourceID,HNID,nCIDs,nodeNames,nodeHNID,nodeIDs,parentIDs,node_nCIDs,includeNode
72,PubChem,Compound TOC,1749165,49517422,Federal Drinking Water Guidelines,1857315,node_437,node_433,537,TRUE
72,PubChem,Compound TOC,1749165,49517422,Federal Drinking Water Standards,1857293,node_435,node_433,365,TRUE
72,PubChem,Compound TOC,1749165,49517422,State Drinking Water Guidelines,3647647,node_441,node_433,868,TRUE
72,PubChem,Compound TOC,1749165,49517422,State Drinking Water Standards,3647646,node_440,node_433,310,TRUE
101,NORMAN Suspect List Exchange,norman_sle_tree,3981444,132904,S05 | KWRSJERPS | KWR Drinking Water Suspect List,4041075,node_441,root,158,TRUE
101,NORMAN Suspect List Exchange,norman_sle_tree,3981444,132904,S63 | UBADWGW | Substances Detected in Drinking (DW) or Groundwater (GW),4041161,node_467,root,83,TRUE
101,NORMAN Suspect List Exchange,norman_sle_tree,3981444,132904,S64 | NATOXAQ | NaToxAq: Natural Toxins and Drinking Water Quality - From Source to Tap,4041240,node_481,root,129,FALSE
