"hid","SourceName","SourceID","HNID","nCIDs","nodeNames","nodeHNID","nodeIDs","parentIDs","node_nCIDs","includeNode"
72,"PubChem","Compound TOC",1749165,49517422,"EI-MS",1856988,"node_296","node_294",1053,TRUE
72,"PubChem","Compound TOC",1749165,49517422,"GC-MS",1856940,"node_295","node_294",238248,TRUE
101,"NORMAN Suspect List Exchange","norman_sle_tree",3981444,132904,"S70 | EISUSGCEIMS | Environmental Institute GC-EI-MS suspect list",4112140,"node_816","root",3232,TRUE
