"hid","SourceName","SourceID","HNID","nCIDs","nodeNames","nodeHNID","nodeIDs","parentIDs","node_nCIDs","includeNode"
1,"MeSH","DescTree",1,130349,"Technology, Industry, and Agriculture",1271527,"node_19729","node_19728",44,TRUE
72,"PubChem","Compound TOC",1749165,49517422,"Industry Uses",1857005,"node_343","node_341",5740,TRUE
81,"EPA Safer Choice","EPA_Safer_Choice_tree",2955724,969,"Specialized Industrial Chemicals",2955742,"node_56","root",15,TRUE
81,"EPA Safer Choice","EPA_Safer_Choice_tree",2955724,969,"Specialized Industrial Chemicals",2955780,"node_39","node_30",15,TRUE
83,"UN Globally Harmonized System of Classification and Labelling of Chemicals (GHS)","UN_GHS_tree",3069707,148692,"P260: Do not breathe dust/fume/gas/mist/vapors/spray.",3069886,"node_177","node_156",18821,TRUE
83,"UN Globally Harmonized System of Classification and Labelling of Chemicals (GHS)","UN_GHS_tree",3069707,148692,"P261: Avoid breathing dust/fume/gas/mist/vapors/spray.",3069887,"node_178","node_156",100037,TRUE
84,"ChemIDplus","ChemIDplus_tree",3091656,324487,"Ceiling (30 mppcf)/%SiO2+2, total dust",3092084,"node_1167","node_1143",1,TRUE
84,"ChemIDplus","ChemIDplus_tree",3091656,324487,"Ceiling /%SiO2+2 mg/m3 (30 ppm); total dust",3092090,"node_1173","node_1143",1,TRUE
84,"ChemIDplus","ChemIDplus_tree",3091656,324487,"Ceiling 0.1 mg/m3 fume; 0.5 mg/m3 respirable dust",3092096,"node_1179","node_1143",1,TRUE
99,"EPA Chemical and Products Database (CPDat)","cpdat_tree",3739864,23284,"Dustbinding",3742451,"node_2581","node_2560",23,TRUE
99,"EPA Chemical and Products Database (CPDat)","cpdat_tree",3739864,23284,"EPA Chemical Data Reporting Rule (CDR 2012) - Industrial sector use",3741655,"node_1785","node_851",3092,TRUE
99,"EPA Chemical and Products Database (CPDat)","cpdat_tree",3739864,23284,"Industrial",3741593,"node_1723","node_1707",236,TRUE
99,"EPA Chemical and Products Database (CPDat)","cpdat_tree",3739864,23284,"Industrial",3741705,"node_1835","node_1831",7,TRUE
99,"EPA Chemical and Products Database (CPDat)","cpdat_tree",3739864,23284,"Industrial",3741773,"node_1903","node_1887",1,TRUE
99,"EPA Chemical and Products Database (CPDat)","cpdat_tree",3739864,23284,"Industrial_fluid",3741043,"node_1179","node_1170",2,TRUE
99,"EPA Chemical and Products Database (CPDat)","cpdat_tree",3739864,23284,"Industrial_fluid",3741592,"node_1722","node_1707",165,TRUE
99,"EPA Chemical and Products Database (CPDat)","cpdat_tree",3739864,23284,"Industrial_fluid",3742474,"node_2604","node_2560",124,TRUE
99,"EPA Chemical and Products Database (CPDat)","cpdat_tree",3739864,23284,"Industrial_manufacturing",3741029,"node_1165","node_1154",5356,TRUE
99,"EPA Chemical and Products Database (CPDat)","cpdat_tree",3739864,23284,"National Industrial Chemicals Notification and Assessment Scheme (NICNAS)",3741790,"node_1920","node_851",81,TRUE
99,"EPA Chemical and Products Database (CPDat)","cpdat_tree",3739864,23284,"Specialized industrial",3740298,"node_439","node_425",3,TRUE
99,"EPA Chemical and Products Database (CPDat)","cpdat_tree",3739864,23284,"SPIN Industrial sector",3742088,"node_2218","node_851",2248,TRUE
101,"NORMAN Suspect List Exchange","norman_sle_tree",3981444,132904,"S35 | INDOORCT16 | Indoor Environment Substances from the 2016 Collaborative NORMAN Dust Trial",4041234,"node_479","root",1938,TRUE
