hid,SourceName,SourceID,HNID,nCIDs,nodeNames,nodeHNID,nodeIDs,parentIDs,node_nCIDs,includeNode
7,KEGG,br08006,2295998,89,Bisphenol A,2296069,node_9,node_8,1,TRUE
7,KEGG,br08006,2295998,89,Bisphenols,2296056,node_8,node_1,1,TRUE
9,KEGG,br08008,2297167,749,Bisphenol A diglycidyl ether,2297620,node_332,node_134,1,FALSE
101,NORMAN Suspect List Exchange,norman_sle_tree,3981444,132904,S20 | BISPHENOLS | Bisphenols List,4041191,node_471,root,52,TRUE
