"hid","SourceName","SourceID","HNID","nCIDs","nodeNames","nodeHNID","nodeIDs","parentIDs","node_nCIDs","includeNode"
101,"NORMAN Suspect List Exchange","norman_sle_tree",3981444,132904,"S08 | ATHENSSUS | University of Athens Surfactants and Suspects List",4041057,"node_436","root",328,TRUE
101,"NORMAN Suspect List Exchange","norman_sle_tree",3981444,132904,"S21 | UATHTARGETS | University of Athens Target List",4041141,"node_457","root",2244,TRUE
101,"NORMAN Suspect List Exchange","norman_sle_tree",3981444,132904,"S56 | UOATARGPHARMA | Target Pharmaceutical/Drug List from University of Athens",4041217,"node_475","root",180,TRUE
101,"NORMAN Suspect List Exchange","norman_sle_tree",3981444,132904,"S57 | GREEKPHARMA | Suspect Pharmaceuticals from the National Organization of Medicine, Greece",4041094,"node_446","root",262,TRUE
101,"NORMAN Suspect List Exchange","norman_sle_tree",3981444,132904,"S65 | UATHTARGETSGC | University of Athens GC-HRMS Target List",4041090,"node_445","root",321,TRUE
