hid,SourceName,SourceID,HNID,nCIDs,nodeNames,nodeHNID,nodeIDs,parentIDs,node_nCIDs,includeNode
2,ChEBI,OBO,952816,103401,cosmetic,984862,node_2749287,node_2732681,14,TRUE
84,ChemIDplus,ChemIDplus_tree,3091656,324487,Cosmetics,3092182,node_412,node_323,27,TRUE
99,EPA Chemical and Products Database (CPDat),cpdat_tree,3739864,23284,Cosmeticcolorant,3740238,node_378,node_358,126,TRUE
101,NORMAN Suspect List Exchange,norman_sle_tree,3981444,132904,Cosmetic colorant,4066985,node_754,node_734,214,TRUE
101,NORMAN Suspect List Exchange,norman_sle_tree,3981444,132904,S13 | EUCOSMETICS | Combined Inventory of Ingredients Employed in Cosmetic Products (2000) and Revised Inventory (2006),4041160,node_466,root,3333,TRUE
101,NORMAN Suspect List Exchange,norman_sle_tree,3981444,132904,S13 | EUCOSMETICS | Combined Inventory of Ingredients Employed in Cosmetic Products (2000) and Revised Inventory (2006),4066965,node_734,root,4128,TRUE
