"hid","SourceName","SourceID","HNID","nCIDs","nodeNames","nodeHNID","nodeIDs","parentIDs","node_nCIDs","includeNode"
72,"PubChem","Compound TOC",1749165,49517422,"CCSbase",4112373,"node_265","node_178",4911,TRUE
72,"PubChem","Compound TOC",1749165,49517422,"CCSBase",4121371,"node_266","node_178",4911,TRUE
72,"PubChem","Compound TOC",1749165,49517422,"CCSBase Classification",4121372,"node_66","node_28",4911,TRUE
72,"PubChem","Compound TOC",1749165,49517422,"Collision Cross Section",4016771,"node_108","node_68",5448,TRUE
101,"NORMAN Suspect List Exchange","norman_sle_tree",3981444,132904,"S50 | CCSCOMPEND | The Unified Collision Cross Section (CCS) Compendium",4041228,"node_477","root",634,TRUE
101,"NORMAN Suspect List Exchange","norman_sle_tree",3981444,132904,"S50 | CCSCOMPEND | The Unified Collision Cross Section (CCS) Compendium",4112141,"node_817","root",648,TRUE
101,"NORMAN Suspect List Exchange","norman_sle_tree",3981444,132904,"S61 | UJICCSLIB | Collision Cross Section (CCS) Library from UJI",4041008,"node_423","root",574,TRUE
101,"NORMAN Suspect List Exchange","norman_sle_tree",3981444,132904,"S61 | UJICCSLIB | Collision Cross Section (CCS) Library from UJI",4112133,"node_808","root",574,TRUE
