"hid","SourceName","SourceID","HNID","nCIDs","nodeNames","nodeHNID","nodeIDs","parentIDs","node_nCIDs","includeNode"
101,"NORMAN Suspect List Exchange","norman_sle_tree",3981444,132904,"S12 | NORMANEWS | NormaNEWS for Retrospective Screening of New Emerging Contaminants",4041107,"node_450","root",131,TRUE
101,"NORMAN Suspect List Exchange","norman_sle_tree",3981444,132904,"S62 | NORMANEWS2 | NormaNEWS2: Retrospective Screening of New Emerging Contaminants",4041036,"node_428","root",301,TRUE
