Role,Agrochemical
Role,Drug
Role,Biomarker
Role,Bisphenols
Role,Cannabinoids
Role,Cosmetics
Role,Emerging Contaminant
Role,Exposome
Role,Food
Role,Hormone
Role,Hydrocarbon
Role,Metabolites
Role,NPS
Role,Natural Product
Role,PFAS
Role,PMT
Role,Phthalate
Role,Plastics
Role,Surfactant
Role,Toxins
Role,Transformations
Role,Vitamin
Agrochemical,Biocide
Agrochemical,Fungicide
Agrochemical,Insecticide
Drug,Antibiotic
,
Matrix,Blood
Matrix,Water
Matrix,Dust
Matrix,Indoor
Matrix,Smoke
Water,Drinking water
Water,Groundwater
Water,Wastewater
,
Environmental Monitoring,Monitoring
Environmental Monitoring,NormaNEWS
Environmental Monitoring,Priority
,
Analytical,CCS
Analytical,MassSpec
MassSpec,GCMS
MassSpec,LCMS
MassSpec,MSMS
,
Sources,ECHA
Sources,Eawag
Sources,Greece
Sources,KEMI
Sources,Luxembourg
Sources,NORMAN
Sources,REACH
Sources,Switzerland
Sources,Taiwan
Sources,UBA
Sources,USEPA
