"hid","SourceName","SourceID","HNID","nCIDs","nodeNames","nodeHNID","nodeIDs","parentIDs","node_nCIDs","includeNode"
72,"PubChem","Compound TOC",1749165,49517422,"KEGG: Major components of natural products",1857015,"node_36","node_28",234,TRUE
79,"WHO ATC","ATCTree",1949731,16452,"L01C - Plant alkaloids and other natural products",1953136,"node_3562","node_3501",209,TRUE
84,"ChemIDplus","ChemIDplus_tree",3091656,324487,"Natural Product",3092609,"node_763","node_751",2231,TRUE
84,"ChemIDplus","ChemIDplus_tree",3091656,324487,"Natural Products",3092610,"node_764","node_751",2,TRUE
84,"ChemIDplus","ChemIDplus_tree",3091656,324487,"Natural Products, Marine",3092611,"node_765","node_751",1,TRUE
84,"ChemIDplus","ChemIDplus_tree",3091656,324487,"Natural Products, Microbial",3092612,"node_766","node_751",1,TRUE
101,"NORMAN Suspect List Exchange","norman_sle_tree",3981444,132904,"Natural products",4041214,"node_554","node_483",5,TRUE
101,"NORMAN Suspect List Exchange","norman_sle_tree",3981444,132904,"S59 | NPINESCT | Natural Product Insecticides",4041015,"node_426","root",83,TRUE
