"hid","SourceName","SourceID","HNID","nCIDs","nodeNames","nodeHNID","nodeIDs","parentIDs","node_nCIDs","includeNode"
2,"ChEBI","OBO",952816,103401,"provitamin",984293,"node_2683184","node_2675400",8,TRUE
3,"KEGG","br08001",2289173,521,"Fat-soluble vitamins [Fig]",2289595,"node_427","node_426",6,TRUE
3,"KEGG","br08001",2289173,521,"Vitamins",2289594,"node_426","node_425",16,TRUE
3,"KEGG","br08001",2289173,521,"Vitamins and cofactors",2289593,"node_425","root",45,TRUE
3,"KEGG","br08001",2289173,521,"Water-soluble vitamins [Fig]",2289602,"node_434","node_426",10,TRUE
4,"KEGG","br08002",2289983,1956,"PR0202 Vitamin E",2291984,"node_2120","node_2111",8,TRUE
4,"KEGG","br08002",2289983,1956,"PR0203 Vitamin K",2291993,"node_2129","node_2111",8,TRUE
4,"KEGG","br08002",2289983,1956,"ST0301 Vitamin D2 and derivatives",2291185,"node_1287","node_1286",6,TRUE
4,"KEGG","br08002",2289983,1956,"ST0302 Vitamin D3 and derivatives",2291189,"node_1294","node_1286",5,TRUE
4,"KEGG","br08002",2289983,1956,"ST0303 Vitamin D4 and derivatives",2291195,"node_1300","node_1286",1,TRUE
4,"KEGG","br08002",2289983,1956,"ST0304 Vitamin D5 and derivatives",2291197,"node_1302","node_1286",1,TRUE
14,"KEGG","br08301",2334510,1502,"31 Vitamins",2336939,"node_2464","node_2110",40,TRUE
14,"KEGG","br08301",2334510,1502,"311 Vitamins A and D preparations",2337702,"node_2515","node_2464",8,TRUE
14,"KEGG","br08301",2334510,1502,"312 Vitamin B1 preparations",2335566,"node_2468","node_2464",11,TRUE
14,"KEGG","br08301",2334510,1502,"313 Vitamin B preparations",2337831,"node_2529","node_2464",16,TRUE
14,"KEGG","br08301",2334510,1502,"314 Vitamin C preparations",2337647,"node_2511","node_2464",1,TRUE
14,"KEGG","br08301",2334510,1502,"315 Vitamin E preparations",2335245,"node_2465","node_2464",1,TRUE
14,"KEGG","br08301",2334510,1502,"316 Vitamin K preparations",2337621,"node_2507","node_2464",2,TRUE
14,"KEGG","br08301",2334510,1502,"319 Miscellaneous vitamins",2337346,"node_2504","node_2464",1,TRUE
15,"KEGG","br08302",2337902,1172,"Electrolytes/Minerals/Metals/Vitamins",2999888,"node_3560","root",22,TRUE
15,"KEGG","br08302",2337902,1172,"Vitamin D-related Agents",3714629,"node_1638","node_1603",4,TRUE
15,"KEGG","br08302",2337902,1172,"Vitamin K Antagonist",3957246,"node_3676","node_3655",2,TRUE
15,"KEGG","br08302",2337902,1172,"Vitamins",2999992,"node_3578","node_3560",1,TRUE
22,"KEGG","br08310",2358608,4142,"Vitamin-K-epoxide reductase [EC:1.17.4.4]",3396656,"node_2346","node_1996",15,TRUE
22,"KEGG","br08310",2358608,4142,"Vitamin D3 like receptor",2360456,"node_1836","node_1786",19,TRUE
24,"KEGG","br08312",2367851,628,"Vitamin A",2367912,"node_2731","node_2720",1,TRUE
24,"KEGG","br08312",2367851,628,"Vitamin A",2369355,"node_1194","node_843",1,TRUE
25,"KEGG","br08313",2370919,306,"32 Vitamin A based drugs",2371565,"node_118","node_13",2,TRUE
25,"KEGG","br08313",2370919,306,"33 Vitamin D based drugs",2370972,"node_14","node_13",1,TRUE
25,"KEGG","br08313",2370919,306,"34 Vitamin E based drugs",2371234,"node_45","node_13",5,TRUE
25,"KEGG","br08313",2370919,306,"35 Vitamin B1 based drugs",2371604,"node_122","node_13",8,TRUE
25,"KEGG","br08313",2370919,306,"36 Vitamin B2 based drugs",2371435,"node_82","node_13",4,TRUE
25,"KEGG","br08313",2370919,306,"37 Vitamin B6 based drugs",2371492,"node_111","node_13",2,TRUE
25,"KEGG","br08313",2370919,306,"38 Vitamin C based drugs",2371303,"node_78","node_13",3,TRUE
25,"KEGG","br08313",2370919,306,"39 Vitamin AD based drugs",2371281,"node_54","node_13",2,TRUE
25,"KEGG","br08313",2370919,306,"40 Vitamin B2B6 based drugs",2371285,"node_58","node_13",5,TRUE
25,"KEGG","br08313",2370919,306,"41 Vitamin EC based drugs",2371083,"node_16","node_13",4,TRUE
25,"KEGG","br08313",2370919,306,"42 Vitamin B1B6B12 based drugs",2371169,"node_33","node_13",11,TRUE
25,"KEGG","br08313",2370919,306,"43 Vitamin containing supplements",2371462,"node_87","node_13",20,TRUE
25,"KEGG","br08313",2370919,306,"Vitamin A (USP)",2371114,"node_119","node_118",1,TRUE
25,"KEGG","br08313",2370919,306,"Vitamin A (USP)",2371114,"node_56","node_54",1,TRUE
25,"KEGG","br08313",2370919,306,"Vitamin A (USP)",2371114,"node_91","node_87",1,TRUE
28,"KEGG","br08331",2374221,280,"9582 Vitamin preparations (for external use)",2374289,"node_617","node_613",2,TRUE
28,"KEGG","br08331",2374221,280,"962 Vitamin preparations",2374500,"node_116","node_73",12,TRUE
28,"KEGG","br08331",2374221,280,"9621 Vitamin A, D and preparations",2374777,"node_129","node_116",2,TRUE
28,"KEGG","br08331",2374221,280,"9622 Vitamin B1 and preparations",2374455,"node_126","node_116",2,TRUE
28,"KEGG","br08331",2374221,280,"9623 Vitamin B and preparations (except vitamin B1 preparations)",2374388,"node_120","node_116",5,TRUE
28,"KEGG","br08331",2374221,280,"9624 Vitamin C and preparations",2374223,"node_117","node_116",1,TRUE
28,"KEGG","br08331",2374221,280,"9625 Vitamin E and preparations",2374925,"node_133","node_116",1,TRUE
28,"KEGG","br08331",2374221,280,"9626 Vitamin K and preparations",2375038,"node_135","node_116",1,TRUE
54,"LIPID MAPS","LM",3494073,42579,"Vitamin D2 and derivatives [ST0301]",304758,"node_252","node_251",53,TRUE
54,"LIPID MAPS","LM",3494073,42579,"Vitamin D3 and derivatives [ST0302]",304812,"node_253","node_251",666,TRUE
54,"LIPID MAPS","LM",3494073,42579,"Vitamin D4 and derivatives [ST0303]",305491,"node_254","node_251",4,TRUE
54,"LIPID MAPS","LM",3494073,42579,"Vitamin D5 and derivatives [ST0304]",305496,"node_255","node_251",3,TRUE
54,"LIPID MAPS","LM",3494073,42579,"Vitamin D6 and derivatives [ST0305]",305500,"node_256","node_251",2,TRUE
54,"LIPID MAPS","LM",3494073,42579,"Vitamin D7 and derivatives [ST0306]",305503,"node_257","node_251",4,TRUE
54,"LIPID MAPS","LM",3494073,42579,"Vitamin E [PR0202]",307591,"node_286","node_284",13,TRUE
54,"LIPID MAPS","LM",3494073,42579,"Vitamin K [PR0203]",307604,"node_287","node_284",6,TRUE
62,"KEGG","br08316",2371664,367,"[111331] Dry formed vitamin A",2372568,"node_526","node_516",1,TRUE
78,"FDA Pharm Classes","FDA_pharm_tree",1936306,1284,"Provitamin D2 Compound [EPC]",1947224,"node_33157","node_33120",1,TRUE
78,"FDA Pharm Classes","FDA_pharm_tree",1936306,1284,"Vitamin A [EPC]",1947265,"node_33295","node_33284",1,TRUE
78,"FDA Pharm Classes","FDA_pharm_tree",1936306,1284,"Vitamin B Complex Compounds [Chemical/Ingredient]",1947033,"node_29286","node_29275",4,TRUE
78,"FDA Pharm Classes","FDA_pharm_tree",1936306,1284,"Vitamin B Complex Member [EPC]",1947032,"node_33288","node_33284",1,TRUE
78,"FDA Pharm Classes","FDA_pharm_tree",1936306,1284,"Vitamin B12 [EPC]",1947266,"node_33296","node_33284",1,TRUE
78,"FDA Pharm Classes","FDA_pharm_tree",1936306,1284,"Vitamin B6 Analog [EPC]",2739075,"node_33304","node_33284",1,TRUE
78,"FDA Pharm Classes","FDA_pharm_tree",1936306,1284,"Vitamin C [EPC]",3182899,"node_33306","node_33284",1,TRUE
78,"FDA Pharm Classes","FDA_pharm_tree",1936306,1284,"Vitamin D [EPC]",1947267,"node_33297","node_33284",1,TRUE
78,"FDA Pharm Classes","FDA_pharm_tree",1936306,1284,"Vitamin D Analog [EPC]",1947167,"node_33289","node_33284",1,TRUE
78,"FDA Pharm Classes","FDA_pharm_tree",1936306,1284,"Vitamin D2 Analog [EPC]",1947222,"node_33292","node_33284",1,TRUE
78,"FDA Pharm Classes","FDA_pharm_tree",1936306,1284,"Vitamin D3 Analog [EPC]",1947223,"node_33293","node_33284",3,TRUE
78,"FDA Pharm Classes","FDA_pharm_tree",1936306,1284,"Vitamin K [EPC]",1948574,"node_33299","node_33284",1,TRUE
78,"FDA Pharm Classes","FDA_pharm_tree",1936306,1284,"Vitamin K Antagonist [EPC]",1946796,"node_33285","node_33284",2,TRUE
79,"WHO ATC","ATCTree",1949731,16452,"A11 - Vitamins",1950326,"node_624","node_1",210,TRUE
79,"WHO ATC","ATCTree",1949731,16452,"A11C - Vitamin a and d, incl. combinations of the two",1950336,"node_634","node_624",141,TRUE
79,"WHO ATC","ATCTree",1949731,16452,"A11D - Vitamin b1, plain and in combination with vitamin b6 and b12",1950349,"node_648","node_624",14,TRUE
79,"WHO ATC","ATCTree",1949731,16452,"A11G - Ascorbic acid (vitamin c), incl. combinations",1950361,"node_660","node_624",1,TRUE
79,"WHO ATC","ATCTree",1949731,16452,"A11H - Other plain vitamin preparations",1950366,"node_665","node_624",56,TRUE
79,"WHO ATC","ATCTree",1949731,16452,"B02B - Vitamin k and other hemostatics",1950586,"node_899","node_888",46,TRUE
79,"WHO ATC","ATCTree",1949731,16452,"B03B - Vitamin b12 and folic acid",1950659,"node_976","node_939",131,TRUE
84,"ChemIDplus","ChemIDplus_tree",3091656,324487,"Provitamins",3092774,"node_908","node_830",5,TRUE
84,"ChemIDplus","ChemIDplus_tree",3091656,324487,"Vitamin B Complex",3093799,"node_1122","node_1110",30,TRUE
84,"ChemIDplus","ChemIDplus_tree",3091656,324487,"Vitamin D",3093800,"node_1123","node_1110",1,TRUE
84,"ChemIDplus","ChemIDplus_tree",3091656,324487,"Vitamin D Analog",3093801,"node_1124","node_1110",1,TRUE
84,"ChemIDplus","ChemIDplus_tree",3091656,324487,"Vitamins",3093802,"node_1125","node_1110",63,TRUE
92,"IUPHAR/BPS Guide to PHARMACOLOGY","Target Classification",3361437,6414,"1I. Vitamin D receptor-like receptors",3361525,"node_86","node_79",45,TRUE
92,"IUPHAR/BPS Guide to PHARMACOLOGY","Target Classification",3361437,6414,"SLC19 family of vitamin transporters",3361620,"node_755","node_690",5,TRUE
96,"KEGG","br08330",3439111,4620,"DG01603 Vitamin K",3442623,"node_4851","node_2677",7,TRUE
96,"KEGG","br08330",3439111,4620,"DG01606 Activated vitamin D3",3446392,"node_10430","node_10429",9,TRUE
96,"KEGG","br08330",3439111,4620,"DG01607 Vitamin D derivatives",3446391,"node_10429","node_9061",20,TRUE
99,"EPA Chemical and Products Database (CPDat)","cpdat_tree",3739864,23284,"Vitamin e",3740327,"node_471","node_448",1,TRUE
