"hid","SourceName","SourceID","HNID","nCIDs","nodeNames","nodeHNID","nodeIDs","parentIDs","node_nCIDs","includeNode"
1,"MeSH","DescTree",1,130349,"Biomarkers",1271941,"node_525195","node_518927",29,TRUE
101,"NORMAN Suspect List Exchange","norman_sle_tree",3981444,132904,"S34 | EXPOSOMEXPL | Biomarkers from Exposome Explorer",4041042,"node_431","root",435,TRUE
