hid,SourceName,SourceID,HNID,nCIDs,nodeNames,nodeHNID,nodeIDs,parentIDs,node_nCIDs,includeNode
62,KEGG,br08316,2371664,367,Surfactant,2373121,node_2773,root,14,TRUE
81,EPA Safer Choice,EPA_Safer_Choice_tree,2955724,969,Surfactants,2955743,node_57,root,268,TRUE
81,EPA Safer Choice,EPA_Safer_Choice_tree,2955724,969,Surfactants,2955758,node_15,node_1,256,TRUE
81,EPA Safer Choice,EPA_Safer_Choice_tree,2955724,969,Surfactants,2955769,node_27,node_17,13,TRUE
99,EPA Chemical and Products Database (CPDat),cpdat_tree,3739864,23284,Surfactant,3740105,node_242,node_204,54,TRUE
99,EPA Chemical and Products Database (CPDat),cpdat_tree,3739864,23284,Surfactant,3740146,node_284,node_245,5,TRUE
99,EPA Chemical and Products Database (CPDat),cpdat_tree,3739864,23284,Surfactant,3740214,node_353,node_289,2,TRUE
99,EPA Chemical and Products Database (CPDat),cpdat_tree,3739864,23284,Surfactant,3740279,node_419,node_358,262,TRUE
99,EPA Chemical and Products Database (CPDat),cpdat_tree,3739864,23284,Surfactant,3740300,node_441,node_425,56,TRUE
99,EPA Chemical and Products Database (CPDat),cpdat_tree,3739864,23284,Surfactant,3740326,node_470,node_448,1,TRUE
99,EPA Chemical and Products Database (CPDat),cpdat_tree,3739864,23284,Surfactant,3740434,node_580,node_502,3,TRUE
99,EPA Chemical and Products Database (CPDat),cpdat_tree,3739864,23284,Surfactant,3740607,node_756,node_707,1,TRUE
99,EPA Chemical and Products Database (CPDat),cpdat_tree,3739864,23284,Surfactant,3740675,node_825,node_761,15,TRUE
99,EPA Chemical and Products Database (CPDat),cpdat_tree,3739864,23284,Surfactant,3741710,node_1840,node_1831,48,TRUE
101,NORMAN Suspect List Exchange,norman_sle_tree,3981444,132904,S07 | EAWAGSURF | Eawag Surfactants Suspect List,4041146,node_460,root,175,TRUE
101,NORMAN Suspect List Exchange,norman_sle_tree,3981444,132904,S08 | ATHENSSUS | University of Athens Surfactants and Suspects List,4041057,node_436,root,328,FALSE
101,NORMAN Suspect List Exchange,norman_sle_tree,3981444,132904,S23 | EIUBASURF | Surfactant Suspect List from EI and UBA,4041105,node_449,root,1145,TRUE
101,NORMAN Suspect List Exchange,norman_sle_tree,3981444,132904,Surfactant,4067025,node_794,node_734,562,TRUE
