HID,SourceName,SourceID,TreeName,HNID,hasCIDs
1,MeSH,DescTree,MeSH Tree,1,TRUE
2,ChEBI,NA,NA,NA,TRUE
3,KEGG,br08001,Compounds with biological roles,2289173,TRUE
4,KEGG,br08002,Lipids,2289983,TRUE
5,KEGG,br08003,Phytochemical compounds,2292706,TRUE
6,KEGG,br08005,Bioactive peptides,2295771,TRUE
7,KEGG,br08006,Endocrine disrupting compounds,2295998,TRUE
8,KEGG,br08007,Pesticides,2296113,TRUE
9,KEGG,br08008,Carcinogens,2297167,TRUE
10,KEGG,br08201,Enzymatic reactions,2300538,FALSE
11,KEGG,br08202,IUBMB reaction hierarchy,2317924,FALSE
12,KEGG,br08203,Glycosyltransferase reactions,2319619,FALSE
13,KEGG,br08204,Reaction class,2319796,FALSE
14,KEGG,br08301,Therapeutic category of drugs in Japan,2334510,TRUE
15,KEGG,br08302,USP drug classification,2337902,TRUE
16,KEGG,br08303,Anatomical Therapeutic Chemical (ATC) classification,2340888,TRUE
17,KEGG,br08304,Traditional Chinese Medicine in Japan,2351814,TRUE
18,KEGG,br08305,Crude drugs,2352285,TRUE
19,NA,NA,NA,NA,NA
20,NA,NA,NA,NA,NA
21,NA,NA,NA,NA,NA
22,KEGG,br08310,Target-based classification of drugs,2358608,TRUE
23,KEGG,br08311,Drugs listed in the Japanese Pharmacopoeia,2366387,TRUE
24,KEGG,br08312,Risk category of Japanese OTC drugs,2367851,TRUE
25,KEGG,br08313,Classification of Japanese OTC drugs,2370919,TRUE
26,KEGG,br08321,Essential oils,2373423,FALSE
27,KEGG,br08322,Medicinal herbs,2373529,FALSE
28,KEGG,br08331,Animal drugs in Japan,2374221,TRUE
29,KEGG,br08401,Infectious diseases,2375051,FALSE
30,KEGG,br08402,Human diseases,2375372,FALSE
31,KEGG,br08403,Human diseases in ICD-10 classification,2376807,FALSE
32,KEGG,br08410,ICD-10 International Classification of Diseases,2378948,FALSE
33,KEGG,br08420,ICD-O-3 International Classification of Diseases for Oncology,2391421,FALSE
34,NA,NA,NA,NA,NA
35,KEGG,br08501,Human organ systems,2392302,FALSE
36,KEGG,br08502,Human cells,2392950,FALSE
37,KEGG,br08601,KEGG organisms,2393432,FALSE
38,KEGG,br08602,Animal classification,2398696,FALSE
39,KEGG,br08603,Plant classification,2398864,FALSE
40,KEGG,br08604,Photosynthetic organisms,2398996,FALSE
41,KEGG,br08901,KEGG pathway maps,2456383,FALSE
42,KEGG,br08902,BRITE hierarchy files,2456935,FALSE
43,NA,NA,NA,NA,NA
44,NA,NA,NA,NA,NA
45,NA,NA,NA,NA,NA
46,NA,NA,NA,NA,NA
47,NA,NA,NA,NA,NA
48,NA,NA,NA,NA,NA
49,NA,NA,NA,NA,NA
50,NA,NA,NA,NA,NA
51,NA,NA,NA,NA,NA
52,NA,NA,NA,NA,NA
53,NA,NA,NA,NA,NA
54,LIPID MAPS,LM,Lipid Classification,3494073,TRUE
55,NA,NA,NA,NA,NA
56,NA,NA,NA,NA,NA
57,NA,NA,NA,NA,NA
58,NA,NA,NA,NA,NA
59,KEGG,br08009,Natural toxins,2298189,TRUE
60,KEGG,br08010,Target-based classification of compounds,2298624,TRUE
61,NA,NA,NA,NA,NA
62,KEGG,br08316,Pharmaceutical additives in Japan,2371664,TRUE
63,NA,NA,NA,NA,NA
64,NA,NA,NA,NA,NA
65,KEGG,br08605,Plant pathogens,2399233,FALSE
66,KEGG,br08610,KEGG organisms in the NCBI taxonomy,2408505,FALSE
67,NA,NA,NA,NA,NA
68,NA,NA,NA,NA,NA
69,KEGG,br08323,Major components of natural products,2373694,TRUE
70,KEGG,br08607,Endosymbionts,2400572,FALSE
71,NA,NA,NA,NA,NA
72,PubChem,Compound TOC,PubChem Compound TOC,1749165,TRUE
73,NA,NA,NA,NA,NA
74,KEGG,br08613,Viruses,2431245,FALSE
75,KEGG,br08620,KEGG viruses in the NCBI taxonomy,2444563,FALSE
76,KEGG,br08904,BRITE table files,2457069,FALSE
77,NA,NA,NA,NA,NA
78,FDA Pharm Classes,FDA_pharm_tree,FDA Pharmacological Classification,1936306,TRUE
79,WHO ATC,ATCTree,ATC Code,1949731,TRUE
80,PubChem,PCAssay Tree,PubChem BioAssay Classification,1957004,FALSE
81,EPA Safer Choice,EPA_Safer_Choice_tree,EPA Safer Chemical Ingredients Classification,2955724,TRUE
82,KEGG,br08906,Br number,3069344,FALSE
83,UN Globally Harmonized System of Classification and Labelling of Chemicals (GHS),UN_GHS_tree,GHS Classification Tree,3069707,TRUE
84,ChemIDplus,ChemIDplus_tree,ChemIDplus Chemical Information Classification,3091656,TRUE
85,KEGG,br08907,KEGG Networks,3148118,FALSE
86,CAMEO Chemicals,CameoReactivityTree,CAMEO Chemical Reactivity Classification,3261951,TRUE
87,ChEMBL,Target Tree,Target Tree,3293437,TRUE
88,ENZYME,Enzyme Classification,Enzyme Classification,3308745,FALSE
89,Gene Ontology,Biological Process,Biological Process,3316465,FALSE
90,Gene Ontology,Cellular Component,Cellular Component,3346113,FALSE
91,Gene Ontology,Molecular Function,Molecular Function,3350282,FALSE
92,IUPHAR/BPS Guide to PHARMACOLOGY,Target Classification,Target Classification,3361437,TRUE
93,NCBI Taxonomy,Taxonomy,Taxonomy,3362181,FALSE
94,NA,NA,NA,NA,NA
95,"Collaborative Drug Discovery, Inc. (CDD)",CDD,CDD Classification Tree,3434831,FALSE
96,KEGG,br08330,Drug Classes,3439111,TRUE
97,KEGG,br08411,ICD-11 International Classification of Diseases,3455558,FALSE
98,NA,NA,NA,NA,NA
99,EPA Chemical and Products Database (CPDat),cpdat_tree,EPA CPDat Classification,3739864,TRUE
100,KEGG,br08021,Glycosides,3857767,TRUE
101,NORMAN Suspect List Exchange,norman_sle_tree,NORMAN Suspect List Exchange Classification,3981444,TRUE
102,Drug Enforcement Administration (DEA),dea_tree,DEA drug and controlled substance classification,4025044,TRUE
103,CCSBase,ccsbase_tree,CCSBase Classification,4112146,TRUE
104,NA,NA,NA,NA,NA
105,NA,NA,NA,NA,NA
