"hid","SourceName","SourceID","HNID","nCIDs","nodeNames","nodeHNID","nodeIDs","parentIDs","node_nCIDs","includeNode"
101,"NORMAN Suspect List Exchange","norman_sle_tree",3981444,132904,"S23 | EIUBASURF | Surfactant Suspect List from EI and UBA",4041105,"node_449","root",1145,TRUE
101,"NORMAN Suspect List Exchange","norman_sle_tree",3981444,132904,"S36 | UBAPMT | Potential Persistent, Mobile and Toxic (PMT) substances",4041044,"node_433","root",256,TRUE
101,"NORMAN Suspect List Exchange","norman_sle_tree",3981444,132904,"S63 | UBADWGW | Substances Detected in Drinking (DW) or Groundwater (GW)",4041161,"node_467","root",83,TRUE
