"hid","SourceName","SourceID","HNID","nCIDs","nodeNames","nodeHNID","nodeIDs","parentIDs","node_nCIDs","includeNode"
84,"ChemIDplus","ChemIDplus_tree",3091656,324487,"2007 CERCLA Priority List",3091664,"node_1140","node_1139",232,TRUE
84,"ChemIDplus","ChemIDplus_tree",3091656,324487,"2011 CERCLA Priority List",3091665,"node_1141","node_1139",233,TRUE
101,"NORMAN Suspect List Exchange","norman_sle_tree",3981444,132904,"S15 | NORMANPRI | NORMAN Network Priority Substances List",4041127,"node_453","root",922,TRUE
101,"NORMAN Suspect List Exchange","norman_sle_tree",3981444,132904,"S28 | EUBIOCIDES | Biocides from the NORMAN Priority List",4041086,"node_444","root",174,TRUE
101,"NORMAN Suspect List Exchange","norman_sle_tree",3981444,132904,"S54 | EFSAPRI | European Food Safety Authority Priority Substances",4041041,"node_430","root",209,TRUE
