PubChem_CID,Name,InChI,SMILES,InChIKey,Molecular_Formula,Exact_Mass,XlogP,Reference_Count,Patent_Count
3374,Flumequine,"InChI=1S/C14H12FNO3/c1-7-2-3-8-4-9(15)5-10-12(8)16(7)6-11(13(10)17)14(18)19/h4-7H,2-3H2,1H3,(H,18,19)",CC1CCC2=C3N1C=C(C(=O)C3=CC(=C2)F)C(=O)O,DPSPPJIUMHPXMA-UHFFFAOYSA-N,C14H12FNO3,261.08,2.9,943,6948
14145,Dichlofluanid,"InChI=1S/C9H11Cl2FN2O2S2/c1-13(2)18(15,16)14(17-9(10,11)12)8-6-4-3-5-7-8/h3-7H,1-2H3",CN(C)S(=O)(=O)N(C1=CC=CC=C1)SC(F)(Cl)Cl,WURGXGVFSMYFCG-UHFFFAOYSA-N,C9H11Cl2FN2O2S2,331.962,3.6,522,33473
216239,Sorafenib,"InChI=1S/C21H16ClF3N4O3/c1-26-19(30)18-11-15(8-9-27-18)32-14-5-2-12(3-6-14)28-20(31)29-13-4-7-17(22)16(10-13)21(23,24)25/h2-11H,1H3,(H,26,30)(H2,28,29,31)",CNC(=O)C1=NC=CC(=C1)OC2=CC=C(C=C2)NC(=O)NC3=CC(=C(C=C3)Cl)C(F)(F)F,MLDQJTXFUGDVEO-UHFFFAOYSA-N,C21H16ClF3N4O3,464.086,4.1,8249,48059
9782,Betamethasone,"InChI=1S/C22H29FO5/c1-12-8-16-15-5-4-13-9-14(25)6-7-19(13,2)21(15,23)17(26)10-20(16,3)22(12,28)18(27)11-24/h6-7,9,12,15-17,24,26,28H,4-5,8,10-11H2,1-3H3/t12-,15-,16-,17-,19-,20-,21-,22-/m0/s1",C[C@H]1C[C@H]2[C@@H]3CCC4=CC(=O)C=C[C@@]4([C@]3([C@H](C[C@@]2([C@]1(C(=O)CO)O)C)O)F)C,UREBDLICKHMUKA-DVTGEIKXSA-N,C22H29FO5,392.2,1.9,13832,100935
62276,Lactofen,"InChI=1S/C19H15ClF3NO7/c1-3-29-17(25)10(2)30-18(26)13-9-12(5-6-15(13)24(27)28)31-16-7-4-11(8-14(16)20)19(21,22)23/h4-10H,3H2,1-2H3",CCOC(=O)C(C)OC(=O)C1=C(C=CC(=C1)OC2=C(C=C(C=C2)C(F)(F)F)Cl)[N+](=O)[O-],CONWAEURSVPLRM-UHFFFAOYSA-N,C19H15ClF3NO7,461.049,4.1,141,26620
91759,Flumetsulam,"InChI=1S/C12H9F2N5O2S/c1-7-5-6-19-11(15-7)16-12(17-19)22(20,21)18-10-8(13)3-2-4-9(10)14/h2-6,18H,1H3",CC1=NC2=NC(=NN2C=C1)S(=O)(=O)NC3=C(C=CC=C3F)F,RXCPQSJAVKGONC-UHFFFAOYSA-N,C12H9F2N5O2S,325.045,1.6,108,23904
73864,Bisphenol AF,"InChI=1S/C15H10F6O2/c16-14(17,18)13(15(19,20)21,9-1-5-11(22)6-2-9)10-3-7-12(23)8-4-10/h1-8,22-23H",C1=CC(=CC=C1C(C2=CC=C(C=C2)O)(C(F)(F)F)C(F)(F)F)O,ZFVMWEVVKGLCIJ-UHFFFAOYSA-N,C15H10F6O2,336.058,4.5,454,28816
9554,Perfluorooctanoic acid,"InChI=1S/C8HF15O2/c9-2(10,1(24)25)3(11,12)4(13,14)5(15,16)6(17,18)7(19,20)8(21,22)23/h(H,24,25)",C(=O)(C(C(C(C(C(C(C(F)(F)F)(F)F)(F)F)(F)F)(F)F)(F)F)(F)F)O,SNGREZUHAYWORS-UHFFFAOYSA-N,C8HF15O2,413.974,4.9,4087,10339
12898,Tolylfluanid,"InChI=1S/C10H13Cl2FN2O2S2/c1-8-4-6-9(7-5-8)15(18-10(11,12)13)19(16,17)14(2)3/h4-7H,1-3H3",CC1=CC=C(C=C1)N(SC(F)(Cl)Cl)S(=O)(=O)N(C)C,HYVWIQDYBVKITD-UHFFFAOYSA-N,C10H13Cl2FN2O2S2,345.978,3.9,226,30760
8301,Tetrafluoroethylene,InChI=1S/C2F4/c3-1(4)2(5)6,C(=C(F)F)(F)F,BFKJFAAPBSQJPD-UHFFFAOYSA-N,C2F4,99.9936,1.3,2942,238
74483,Perfluorooctanesulfonic acid,"InChI=1S/C8HF17O3S/c9-1(10,3(13,14)5(17,18)7(21,22)23)2(11,12)4(15,16)6(19,20)8(24,25)29(26,27)28/h(H,26,27,28)",C(C(C(C(C(F)(F)S(=O)(=O)O)(F)F)(F)F)(F)F)(C(C(C(F)(F)F)(F)F)(F)F)(F)F,YFSUTJLHUFNCNZ-UHFFFAOYSA-N,C8HF17O3S,499.937,5,3145,28383
6422,Trifluoroacetic Acid,"InChI=1S/C2HF3O2/c3-2(4,5)1(6)7/h(H,6,7)",C(=O)(C(F)(F)F)O,DTQVDTLACAAQTR-UHFFFAOYSA-N,C2HF3O2,113.993,0.9,34143,4320
9731,4-Fluoroaniline,"InChI=1S/C6H6FN/c7-5-1-3-6(8)4-2-5/h1-4H,8H2",C1=CC(=CC=C1N)F,KRZCOLNOCZKSDF-UHFFFAOYSA-N,C6H6FN,111.048,1.1,559,20721
11167602,Regorafenib,"InChI=1S/C21H15ClF4N4O3/c1-27-19(31)18-10-13(6-7-28-18)33-12-3-5-17(16(23)9-12)30-20(32)29-11-2-4-15(22)14(8-11)21(24,25)26/h2-10H,1H3,(H,27,31)(H2,29,30,32)",CNC(=O)C1=NC=CC(=C1)OC2=CC(=C(C=C2)NC(=O)NC3=CC(=C(C=C3)Cl)C(F)(F)F)F,FNHKPVJBJVTLMP-UHFFFAOYSA-N,C21H15ClF4N4O3,482.077,4.2,3276,14734
67542,Perfluorohexanoic acid,"InChI=1S/C6HF11O2/c7-2(8,1(18)19)3(9,10)4(11,12)5(13,14)6(15,16)17/h(H,18,19)",C(=O)(C(C(C(C(C(F)(F)F)(F)F)(F)F)(F)F)(F)F)O,PXUULQAPEKKVAH-UHFFFAOYSA-N,C6HF11O2,313.98,3.6,487,2162
16562,Fluometuron,"InChI=1S/C10H11F3N2O/c1-15(2)9(16)14-8-5-3-4-7(6-8)10(11,12)13/h3-6H,1-2H3,(H,14,16)",CN(C)C(=O)NC1=CC=CC(=C1)C(F)(F)F,RZILCCPWPBTYDO-UHFFFAOYSA-N,C10H11F3N2O,232.082,2.4,395,27915
11826859,Butafenacil,"InChI=1S/C20H18ClF3N2O6/c1-5-8-31-17(29)19(2,3)32-16(28)12-9-11(6-7-13(12)21)26-15(27)10-14(20(22,23)24)25(4)18(26)30/h5-7,9-10H,1,8H2,2-4H3",CC(C)(C(=O)OCC=C)OC(=O)C1=C(C=CC(=C1)N2C(=O)C=C(N(C2=O)C)C(F)(F)F)Cl,JEDYYFXHPAIBGR-UHFFFAOYSA-N,C20H18ClF3N2O6,474.081,3.5,45,18492
6391,Dichlorodifluoromethane,"InChI=1S/CCl2F2/c2-1(3,4)5",C(F)(F)(Cl)Cl,PXBRQCKWGAHEHS-UHFFFAOYSA-N,CCl2F2,119.935,2.3,2267,17
11556911,Tembotrione,"InChI=1S/C17H16ClF3O6S/c1-28(25,26)13-6-5-9(15(18)10(13)7-27-8-17(19,20)21)16(24)14-11(22)3-2-4-12(14)23/h5-6,14H,2-4,7-8H2,1H3",CS(=O)(=O)C1=C(C(=C(C=C1)C(=O)C2C(=O)CCCC2=O)Cl)COCC(F)(F)F,IUQAXCIUEPFPSF-UHFFFAOYSA-N,C17H16ClF3O6S,440.031,2.2,86,17319
67815,Perfluorobutanesulfonic acid,"InChI=1S/C4HF9O3S/c5-1(6,3(9,10)11)2(7,8)4(12,13)17(14,15)16/h(H,14,15,16)",C(C(C(F)(F)S(=O)(=O)O)(F)F)(C(F)(F)F)(F)F,JGTNAGYHADQMCM-UHFFFAOYSA-N,C4HF9O3S,299.95,2.3,344,29853
67734,Perfluorohexanesulfonic acid,"InChI=1S/C6HF13O3S/c7-1(8,3(11,12)5(15,16)17)2(9,10)4(13,14)6(18,19)23(20,21)22/h(H,20,21,22)",C(C(C(C(F)(F)S(=O)(=O)O)(F)F)(F)F)(C(C(F)(F)F)(F)F)(F)F,QZHDEAJFRJCDMF-UHFFFAOYSA-N,C6HF13O3S,399.944,3.7,541,3373
9732,4-Fluorophenol,"InChI=1S/C6H5FO/c7-5-1-3-6(8)4-2-5/h1-4,8H",C1=CC(=CC=C1O)F,RHMPLDJJXGPMEX-UHFFFAOYSA-N,C6H5FO,112.032,1.8,428,18652
6409,"2,2,2-Trifluoroethanol","InChI=1S/C2H3F3O/c3-2(4,5)1-6/h6H,1H2",C(C(F)(F)F)O,RHQDFWAXVIIEBN-UHFFFAOYSA-N,C2H3F3O,100.014,0.4,2735,76510
62406,Trifluoromethanesulfonic acid,"InChI=1S/CHF3O3S/c2-1(3,4)8(5,6)7/h(H,5,6,7)",C(F)(F)(F)S(=O)(=O)O,ITMCEJHCFYSIIV-UHFFFAOYSA-N,CHF3O3S,149.96,0.3,4554,4271
9053,Fluocortolone,"InChI=1S/C22H29FO4/c1-11-6-14-13-8-16(23)15-7-12(25)4-5-21(15,2)20(13)17(26)9-22(14,3)19(11)18(27)10-24/h4-5,7,11,13-14,16-17,19-20,24,26H,6,8-10H2,1-3H3/t11-,13+,14+,16+,17+,19-,20-,21+,22+/m1/s1",C[C@@H]1C[C@H]2[C@@H]3C[C@@H](C4=CC(=O)C=C[C@@]4([C@H]3[C@H](C[C@@]2([C@H]1C(=O)CO)C)O)C)F,GAKMQHDJQHZUTJ-ULHLPKEOSA-N,C22H29FO4,376.205,2.4,677,18021
13529,"1,1,1,3,3,3-Hexafluoro-2-propanol","InChI=1S/C3H2F6O/c4-2(5,6)1(10)3(7,8)9/h1,10H",C(C(F)(F)F)(C(F)(F)F)O,BYEAHWXPCBROCE-UHFFFAOYSA-N,C3H2F6O,168.001,1.7,2181,14241
6356,Boron trifluoride,InChI=1S/BF3/c2-1(3)4,B(F)(F)F,WTEOIRVLGSZEPR-UHFFFAOYSA-N,BF3,68.0045,NULL,3981,3679
11693711,Pyrasulfotole,"InChI=1S/C14H13F3N2O4S/c1-7-11(13(21)19(2)18-7)12(20)9-5-4-8(14(15,16)17)6-10(9)24(3,22)23/h4-6,18H,1-3H3",CC1=C(C(=O)N(N1)C)C(=O)C2=C(C=C(C=C2)C(F)(F)F)S(=O)(=O)C,CZRVDACSCJKRFL-UHFFFAOYSA-N,C14H13F3N2O4S,362.055,2,18,12604
9582,"4,4'-Difluorobenzophenone",InChI=1S/C13H8F2O/c14-11-5-1-9(2-6-11)13(16)10-3-7-12(15)8-4-10/h1-8H,C1=CC(=CC=C1C(=O)C2=CC=C(C=C2)F)F,LSQARZALBDFYQZ-UHFFFAOYSA-N,C13H8F2O,218.054,3.8,146,7538
4156734,Methyl perfluoroisobutyl ether,"InChI=1S/C5H3F9O/c1-15-5(13,14)2(6,3(7,8)9)4(10,11)12/h1H3",COC(C(C(F)(F)F)(C(F)(F)F)F)(F)F,DJXNLVJQMJNEMN-UHFFFAOYSA-N,C5H3F9O,250.004,3.3,7,2316
9930667,Ethiprole,"InChI=1S/C13H9Cl2F3N4OS/c1-2-24(23)11-9(5-19)21-22(12(11)20)10-7(14)3-6(4-8(10)15)13(16,17)18/h3-4H,2,20H2,1H3",CCS(=O)C1=C(N(N=C1C#N)C2=C(C=C(C=C2Cl)C(F)(F)F)Cl)N,FNELVJVBIYMIMC-UHFFFAOYSA-N,C13H9Cl2F3N4OS,395.983,3.7,82,25336
9845,Trifluoroacetic anhydride,"InChI=1S/C4F6O3/c5-3(6,7)1(11)13-2(12)4(8,9)10",C(=O)(C(F)(F)F)OC(=O)C(F)(F)F,QAEDZJGFFMLHHQ-UHFFFAOYSA-N,C4F6O3,209.975,2.1,2788,37243
9883,Hexafluoropropylene oxide,"InChI=1S/C3F6O/c4-1(2(5,6)7)3(8,9)10-1",C1(C(O1)(F)F)(C(F)(F)F)F,PGFXOWRDDHCDTE-UHFFFAOYSA-N,C3F6O,165.985,2.1,272,10915
16843,Trifluoroiodomethane,"InChI=1S/CF3I/c2-1(3,4)5",C(F)(F)(F)I,VPAYJEUHKVESSD-UHFFFAOYSA-N,CF3I,195.9,2.1,667,10053
44146693,Indaziflam,"InChI=1S/C16H20FN5/c1-8-4-5-11-7-9(2)13(12(11)6-8)19-16-21-14(10(3)17)20-15(18)22-16/h4-6,9-10,13H,7H2,1-3H3,(H3,18,19,20,21,22)/t9-,10?,13+/m0/s1",C[C@H]1CC2=C([C@@H]1NC3=NC(=NC(=N3)N)C(C)F)C=C(C=C2)C,YFONKFDEZLYQDH-BOURZNODSA-N,C16H20FN5,301.17,3.2,44,8456
114481,"2,3,3,3-Tetrafluoro-2-(heptafluoropropoxy)propanoic acid","InChI=1S/C6HF11O3/c7-2(1(18)19,4(10,11)12)20-6(16,17)3(8,9)5(13,14)15/h(H,18,19)",C(=O)(C(C(F)(F)F)(OC(C(C(F)(F)F)(F)F)(F)F)F)O,CSEBNABAWMZWIF-UHFFFAOYSA-N,C6HF11O3,329.975,3.6,75,232
119688,"1-Octanesulfonic acid, 3,3,4,4,5,5,6,6,7,7,8,8,8-tridecafluoro-","InChI=1S/C8H5F13O3S/c9-3(10,1-2-25(22,23)24)4(11,12)5(13,14)6(15,16)7(17,18)8(19,20)21/h1-2H2,(H,22,23,24)",C(CS(=O)(=O)O)C(C(C(C(C(C(F)(F)F)(F)F)(F)F)(F)F)(F)F)(F)F,VIONGDJUYAYOPU-UHFFFAOYSA-N,C8H5F13O3S,427.975,3.9,32,393
9387,Perfluorooctane,"InChI=1S/C8F18/c9-1(10,3(13,14)5(17,18)7(21,22)23)2(11,12)4(15,16)6(19,20)8(24,25)26",C(C(C(C(C(F)(F)F)(F)F)(F)F)(F)F)(C(C(C(F)(F)F)(F)F)(F)F)(F)F,YVBBRRALBYAZBM-UHFFFAOYSA-N,C8F18,437.971,6.5,817,17210
9794,Ethyl trifluoroacetate,"InChI=1S/C4H5F3O2/c1-2-9-3(8)4(5,6)7/h2H2,1H3",CCOC(=O)C(F)(F)F,STSCVKRWJPWALQ-UHFFFAOYSA-N,C4H5F3O2,142.024,1.2,258,14607
67717,Trifluoroacetamide,"InChI=1S/C2H2F3NO/c3-2(4,5)1(6)7/h(H2,6,7)",C(=O)(C(F)(F)F)N,NRKYWOKHZRQRJR-UHFFFAOYSA-N,C2H2F3NO,113.009,0.1,885,26584
67749,Trifluoromethanesulfonic anhydride,"InChI=1S/C2F6O5S2/c3-1(4,5)14(9,10)13-15(11,12)2(6,7)8",C(F)(F)(F)S(=O)(=O)OS(=O)(=O)C(F)(F)F,WJKHJLXJJJATHN-UHFFFAOYSA-N,C2F6O5S2,281.909,1.6,776,75563
520213,Methyl 3-(trifluoromethyl)benzoate,"InChI=1S/C9H7F3O2/c1-14-8(13)6-3-2-4-7(5-6)9(10,11)12/h2-5H,1H3",COC(=O)C1=CC(=CC=C1)C(F)(F)F,QQHNNQCWKYFNAC-UHFFFAOYSA-N,C9H7F3O2,204.04,3.3,6,389
67793,"Ethyl 4,4,4-trifluoroacetoacetate","InChI=1S/C6H7F3O3/c1-2-12-5(11)3-4(10)6(7,8)9/h2-3H2,1H3",CCOC(=O)CC(=O)C(F)(F)F,OCJKUQIPRNZDTK-UHFFFAOYSA-N,C6H7F3O3,184.035,1.4,172,4253
6922,2-(Trifluoromethyl)aniline,"InChI=1S/C7H6F3N/c8-7(9,10)5-3-1-2-4-6(5)11/h1-4H,11H2",C1=CC=C(C(=C1)C(F)(F)F)N,VBLXCTYLWZJBKA-UHFFFAOYSA-N,C7H6F3N,161.045,2.4,69,4996
67820,Perfluoroheptanesulfonic acid,"InChI=1S/C7HF15O3S/c8-1(9,2(10,11)4(14,15)6(18,19)20)3(12,13)5(16,17)7(21,22)26(23,24)25/h(H,23,24,25)",C(C(C(C(F)(F)F)(F)F)(F)F)(C(C(C(F)(F)S(=O)(=O)O)(F)F)(F)F)(F)F,OYGQVDSRYXATEL-UHFFFAOYSA-N,C7HF15O3S,449.941,4.3,37,1121
14474,Trifluoromethyl trifluorovinyl ether,"InChI=1S/C3F6O/c4-1(5)2(6)10-3(7,8)9",C(=C(F)F)(OC(F)(F)F)F,BLTXWCKMNMYXEA-UHFFFAOYSA-N,C3F6O,165.985,2.4,85,11867
87149,"3,3,4,4,5,5,6,6,7,7,8,8,8-Tridecafluorooctyl acrylate","InChI=1S/C11H7F13O2/c1-2-5(25)26-4-3-6(12,13)7(14,15)8(16,17)9(18,19)10(20,21)11(22,23)24/h2H,1,3-4H2",C=CC(=O)OCCC(C(C(C(C(C(F)(F)F)(F)F)(F)F)(F)F)(F)F)(F)F,VPKQPPJQTZJZDB-UHFFFAOYSA-N,C11H7F13O2,418.024,5.5,31,2762
112234,"2,3-Dichloro-5-(trifluoromethyl)pyridine","InChI=1S/C6H2Cl2F3N/c7-4-1-3(6(9,10)11)2-12-5(4)8/h1-2H",C1=C(C=NC(=C1Cl)Cl)C(F)(F)F,ABNQGNFVSFKJGI-UHFFFAOYSA-N,C6H2Cl2F3N,214.952,3.3,16,1991
91733,Fluazifop-P,"InChI=1S/C15H12F3NO4/c1-9(14(20)21)22-11-3-5-12(6-4-11)23-13-7-2-10(8-19-13)15(16,17)18/h2-9H,1H3,(H,20,21)/t9-/m1/s1",C[C@H](C(=O)O)OC1=CC=C(C=C1)OC2=NC=C(C=C2)C(F)(F)F,YUVKUEAFAVKILW-SECBINFHSA-N,C15H12F3NO4,327.072,2.9,36,12868
91384,(Perfluorohexyl)ethylene,"InChI=1S/C8H3F13/c1-2-3(9,10)4(11,12)5(13,14)6(15,16)7(17,18)8(19,20)21/h2H,1H2",C=CC(C(C(C(C(C(F)(F)F)(F)F)(F)F)(F)F)(F)F)(F)F,FYQFWFHDPNXORA-UHFFFAOYSA-N,C8H3F13,346.003,5.3,15,1461
2774943,Heptafluoro-1-methoxypropane,"InChI=1S/C4H3F7O/c1-12-4(10,11)2(5,6)3(7,8)9/h1H3",COC(C(C(F)(F)F)(F)F)(F)F,NOPJRYAFUXTDLX-UHFFFAOYSA-N,C4H3F7O,200.007,2.6,18,2376
164514,"Butane, 1,1,1,2,2,3,3,4,4-nonafluoro-4-methoxy-","InChI=1S/C5H3F9O/c1-15-5(13,14)3(8,9)2(6,7)4(10,11)12/h1H3",COC(C(C(C(F)(F)F)(F)F)(F)F)(F)F,OKIYQFLILPKULA-UHFFFAOYSA-N,C5H3F9O,250.004,3.3,54,6863
26255,Tetrafluoroborate,"InChI=1S/BF4/c2-1(3,4)5/q-1",[B-](F)(F)(F)F,ODGCEQLVLXJUCC-UHFFFAOYSA-N,BF4-,87.0029,NULL,129,98819
45459,"2-[Difluoro(methoxy)methyl]-1,1,1,3,3,3-hexafluoropropane","InChI=1S/C5H4F8O/c1-14-5(12,13)2(3(6,7)8)4(9,10)11/h2H,1H3",COC(C(C(F)(F)F)C(F)(F)F)(F)F,AQHKYFLVHBIQMS-UHFFFAOYSA-N,C5H4F8O,232.013,3.3,1,398
75922,"1-Pentanesulfonic acid, 1,1,2,2,3,3,4,4,5,5,5-undecafluoro-","InChI=1S/C5HF11O3S/c6-1(7,2(8,9)4(12,13)14)3(10,11)5(15,16)20(17,18)19/h(H,17,18,19)",C(C(C(F)(F)F)(F)F)(C(C(F)(F)S(=O)(=O)O)(F)F)(F)F,ACEKLXZRZOWKRY-UHFFFAOYSA-N,C5HF11O3S,349.947,3,11,658
52915299,"2,2,3-Trifluoro-3-(1,1,2,2,3,3-hexafluoro-3-(trifluoromethoxy)propoxy)propanoic acid","InChI=1S/C7H2F12O4/c8-1(3(9,10)2(20)21)22-5(13,14)4(11,12)6(15,16)23-7(17,18)19/h1H,(H,20,21)",C(C(C(=O)O)(F)F)(OC(C(C(OC(F)(F)F)(F)F)(F)F)(F)F)F,AFDRCEOKCOUICI-UHFFFAOYSA-N,C7H2F12O4,377.976,4.1,1,24
588007,N-Fluorobenzenesulfonimide,"InChI=1S/C12H10FNO4S2/c13-14(19(15,16)11-7-3-1-4-8-11)20(17,18)12-9-5-2-6-10-12/h1-10H",C1=CC=C(C=C1)S(=O)(=O)N(F)S(=O)(=O)C2=CC=CC=C2,RLKHFSNWQCZBDC-UHFFFAOYSA-N,C12H10FNO4S2,315.004,2.6,325,9735
607248,2-Amino-3-chloro-5-(trifluoromethyl)pyridine,"InChI=1S/C6H4ClF3N2/c7-4-1-3(6(8,9)10)2-12-5(4)11/h1-2H,(H2,11,12)",C1=C(C=NC(=C1Cl)N)C(F)(F)F,WXNPZQIRDCDLJD-UHFFFAOYSA-N,C6H4ClF3N2,196.002,2,11,511
12002825,3-(4-methyl-1H-imidazol-1-yl)-5-(trifluoromethyl)aniline,"InChI=1S/C11H10F3N3/c1-7-5-17(6-16-7)10-3-8(11(12,13)14)2-9(15)4-10/h2-6H,15H2,1H3",CC1=CN(C=N1)C2=CC(=CC(=C2)N)C(F)(F)F,WWTGXYAJVXKEKL-UHFFFAOYSA-N,C11H10F3N3,241.083,2.3,9,532
272696,"2-Bromo-3,3,3-trifluoroprop-1-ene","InChI=1S/C3H2BrF3/c1-2(4)3(5,6)7/h1H2",C=C(C(F)(F)F)Br,QKBKGNDTLQFSEU-UHFFFAOYSA-N,C3H2BrF3,173.929,2.4,37,1412
2782408,"3-Pentanone, 1,1,1,2,2,4,5,5,5-nonafluoro-4-(trifluoromethyl)-","InChI=1S/C6F12O/c7-2(4(10,11)12,5(13,14)15)1(19)3(8,9)6(16,17)18",C(=O)(C(C(F)(F)F)(C(F)(F)F)F)C(C(F)(F)F)(F)F,RMLFHPWPTXWZNJ-UHFFFAOYSA-N,C6F12O,315.976,4.2,25,1943
2782436,3-Ethoxyperfluoro(2-methylhexane),"InChI=1S/C9H5F15O/c1-2-25-6(15,3(10,7(16,17)18)8(19,20)21)4(11,12)5(13,14)9(22,23)24/h2H2,1H3",CCOC(C(C(F)(F)F)(C(F)(F)F)F)(C(C(C(F)(F)F)(F)F)(F)F)F,HHBBIOLEJRWIGU-UHFFFAOYSA-N,C9H5F15O,414.01,5.7,10,1122
14175377,"1,1,1,3,4,4,4-Heptafluoro-3-(trifluoromethyl)butan-2-one","InChI=1S/C5F10O/c6-2(4(10,11)12,5(13,14)15)1(16)3(7,8)9",C(=O)(C(C(F)(F)F)(C(F)(F)F)F)C(F)(F)F,ABQIAHFCJGVSDJ-UHFFFAOYSA-N,C5F10O,265.979,3.5,2,374
109160,"N-(2,3-Dihydro-2-oxo-1H-benzimidazol-5-yl)-3-oxo-2-[[2-(trifluoromethyl)phenyl]azo]butyramide","InChI=1S/C18H14F3N5O3/c1-9(27)15(26-25-12-5-3-2-4-11(12)18(19,20)21)16(28)22-10-6-7-13-14(8-10)24-17(29)23-13/h2-8,15H,1H3,(H,22,28)(H2,23,24,29)",CC(=O)C(C(=O)NC1=CC2=C(C=C1)NC(=O)N2)N=NC3=CC=CC=C3C(F)(F)F,VBNVBMNKUIJLPP-UHFFFAOYSA-N,C18H14F3N5O3,405.105,3.1,1,7550
12633773,"2,3,3,3-Tetrafluoro-2-(trifluoromethyl)propanenitrile","InChI=1S/C4F7N/c5-2(1-12,3(6,7)8)4(9,10)11",C(#N)C(C(F)(F)F)(C(F)(F)F)F,AASDJASZOZGYMM-UHFFFAOYSA-N,C4F7N,194.992,2.4,6,362
57257889,6:2 Fluorotelomer thioether amido sulfonic acid,"InChI=1S/C15H18F13NO4S2/c1-9(2,7-35(31,32)33)29-8(30)3-5-34-6-4-10(16,17)11(18,19)12(20,21)13(22,23)14(24,25)15(26,27)28/h3-7H2,1-2H3,(H,29,30)(H,31,32,33)",CC(C)(CS(=O)(=O)O)NC(=O)CCSCCC(C(C(C(C(C(F)(F)F)(F)F)(F)F)(F)F)(F)F)(F)F,DKVATWZCDNHYCW-UHFFFAOYSA-N,C15H18F13NO4S2,587.047,4.5,2,4
11403991,"Methyl 2,2,3,3,4,4-hexafluoro-4-(trifluoroethenyloxy)butanoa TE","InChI=1S/C7H3F9O3/c1-18-4(17)5(11,12)6(13,14)7(15,16)19-3(10)2(8)9/h1H3",COC(=O)C(C(C(OC(=C(F)F)F)(F)F)(F)F)(F)F,MBDQOIDXSFHMFM-UHFFFAOYSA-N,C7H3F9O3,305.994,3.2,4,47
2735919,4-Amino-3-fluorophenol,"InChI=1S/C6H6FNO/c7-5-3-4(9)1-2-6(5)8/h1-3,9H,8H2",C1=CC(=C(C=C1O)F)N,MNPLTKHJEAFOCA-UHFFFAOYSA-N,C6H6FNO,127.043,1.1,6,9818
2783248,"5-Chloro-2,3-difluoropyridine",InChI=1S/C5H2ClF2N/c6-3-1-4(7)5(8)9-2-3/h1-2H,C1=C(C=NC(=C1F)F)Cl,PERMDYZFNQIKBL-UHFFFAOYSA-N,C5H2ClF2N,148.984,2,4,353
154403,4-Fluoro-N-isopropylaniline,"InChI=1S/C9H12FN/c1-7(2)11-9-5-3-8(10)4-6-9/h3-7,11H,1-2H3",CC(C)NC1=CC=C(C=C1)F,RMXBOQCXULAXBO-UHFFFAOYSA-N,C9H12FN,153.095,2.8,2,291
611409,"1-Bromo-3,4,5-trifluorobenzene",InChI=1S/C6H2BrF3/c7-3-1-4(8)6(10)5(9)2-3/h1-2H,C1=C(C=C(C(=C1F)F)F)Br,HKJCELUUIFFSIN-UHFFFAOYSA-N,C6H2BrF3,209.929,3,5,1106
9955886,Trifloxysulfuron,"InChI=1S/C14H14F3N5O6S/c1-26-9-6-10(27-2)20-12(19-9)21-13(23)22-29(24,25)11-8(4-3-5-18-11)28-7-14(15,16)17/h3-6H,7H2,1-2H3,(H2,19,20,21,22,23)",COC1=CC(=NC(=N1)NC(=O)NS(=O)(=O)C2=C(C=CC=N2)OCC(F)(F)F)OC,AIMMSOZBPYFASU-UHFFFAOYSA-N,C14H14F3N5O6S,437.062,2.2,20,19404
141094,"4-Amino-3,5-dichlorobenzotrifluoride","InChI=1S/C7H4Cl2F3N/c8-4-1-3(7(10,11)12)2-5(9)6(4)13/h1-2H,13H2",C1=C(C=C(C(=C1Cl)N)Cl)C(F)(F)F,ITNMAZSPBLRJLU-UHFFFAOYSA-N,C7H4Cl2F3N,228.967,3.4,7,719
5140913,"Ethyl 1-ethyl-6,7,8-trifluoro-1,4-dihydro-4-oxoquinoline-3-carboxylate","InChI=1S/C14H12F3NO3/c1-3-18-6-8(14(20)21-4-2)13(19)7-5-9(15)10(16)11(17)12(7)18/h5-6H,3-4H2,1-2H3",CCN1C=C(C(=O)C2=CC(=C(C(=C21)F)F)F)C(=O)OCC,LWLLHOVWIFISMG-UHFFFAOYSA-N,C14H12F3NO3,299.077,1.9,1,52
5463763,"3,5-Dichloro-4-(1,1,2,2-tetrafluoroethoxy)aniline","InChI=1S/C8H5Cl2F4NO/c9-4-1-3(15)2-5(10)6(4)16-8(13,14)7(11)12/h1-2,7H,15H2",C1=C(C=C(C(=C1Cl)OC(C(F)F)(F)F)Cl)N,JIPDPVQPKLVDIU-UHFFFAOYSA-N,C8H5Cl2F4NO,276.968,4.1,1,15
67839,"2,2,3,3,5,5,6,6-Octafluoro-4-(trifluoromethyl)morpholine","InChI=1S/C5F11NO/c6-1(7)3(10,11)18-4(12,13)2(8,9)17(1)5(14,15)16",C1(C(OC(C(N1C(F)(F)F)(F)F)(F)F)(F)F)(F)F,PQMAKJUXOOVROI-UHFFFAOYSA-N,C5F11NO,298.98,4.2,5,2834
9886,Hexafluorophosphate,"InChI=1S/F6P/c1-7(2,3,4,5)6/q-1",F[P-](F)(F)(F)(F)F,LJQLCJWAZJINEB-UHFFFAOYSA-N,F6P-,144.964,3.2,9,1931
10176880,4-(4-Fluorophenyl)-3-hydroxymethyl-1-methyl-piperidine,"InChI=1S/C13H18FNO/c1-15-7-6-13(11(8-15)9-16)10-2-4-12(14)5-3-10/h2-5,11,13,16H,6-9H2,1H3",CN1CCC(C(C1)CO)C2=CC=C(C=C2)F,CXRHUYYZISIIMT-UHFFFAOYSA-N,C13H18FNO,223.137,1.8,3,135
11567168,"Perfluoro-3,6-dioxaoctanoic acid","InChI=1S/C6HF11O4/c7-2(8,1(18)19)20-5(14,15)6(16,17)21-4(12,13)3(9,10)11/h(H,18,19)",C(=O)(C(OC(C(OC(C(F)(F)F)(F)F)(F)F)(F)F)(F)F)O,HDLFODOGTBJVKF-UHFFFAOYSA-N,C6HF11O4,345.97,3.7,0,43
2782939,"1-Butoxy-2,3-Difluorobenzene","InChI=1S/C10H12F2O/c1-2-3-7-13-9-6-4-5-8(11)10(9)12/h4-6H,2-3,7H2,1H3",CCCCOC1=C(C(=CC=C1)F)F,HYDIPEHDSUNHPA-UHFFFAOYSA-N,C10H12F2O,186.086,3.3,0,58
2736501,2-Fluoro-6-Trifluoromethylpyridine,"InChI=1S/C6H3F4N/c7-5-3-1-2-4(11-5)6(8,9)10/h1-3H",C1=CC(=NC(=C1)F)C(F)(F)F,IZOIOCQPMHHDHN-UHFFFAOYSA-N,C6H3F4N,165.02,2.2,0,447
54721880,"2-(1-Amino-1-methylethyl)-N-(4-fluorobenzyl)-5-hydroxy-1-methyl-6-oxo-1,6-dihydropyrimidine-4-carboxamide","InChI=1S/C16H19FN4O3/c1-16(2,18)15-20-11(12(22)14(24)21(15)3)13(23)19-8-9-4-6-10(17)7-5-9/h4-7,22H,8,18H2,1-3H3,(H,19,23)",CC(C)(C1=NC(=C(C(=O)N1C)O)C(=O)NCC2=CC=C(C=C2)F)N,AQLZTHZLYFFVIJ-UHFFFAOYSA-N,C16H19FN4O3,334.144,0.6,1,1923
56602311,Tetraniliprole,"InChI=1S/C22H16ClF3N10O2/c1-11-6-12(9-27)7-14(19(37)28-2)17(11)30-20(38)16-8-13(10-35-33-21(31-34-35)22(24,25)26)32-36(16)18-15(23)4-3-5-29-18/h3-8H,10H2,1-2H3,(H,28,37)(H,30,38)",CC1=CC(=CC(=C1NC(=O)C2=CC(=NN2C3=C(C=CC=N3)Cl)CN4N=C(N=N4)C(F)(F)F)C(=O)NC)C#N,KNDVJPKNBVIKML-UHFFFAOYSA-N,C22H16ClF3N10O2,544.11,3.6,17,4505
10192570,"2,2,3,3-Tetrafluorooxetane","InChI=1S/C3H2F4O/c4-2(5)1-8-3(2,6)7/h1H2",C1C(C(O1)(F)F)(F)F,OFWDLJKVZZRPOX-UHFFFAOYSA-N,C3H2F4O,130.004,1.3,7,1297
84468,Trifluoroacetate,"InChI=1S/C2HF3O2/c3-2(4,5)1(6)7/h(H,6,7)/p-1",C(=O)(C(F)(F)F)[O-],DTQVDTLACAAQTR-UHFFFAOYSA-M,C2F3O2-,112.985,1.6,1342,1587
12127911,N-(Trifluoromethanesulfonyl)trifluoroacetamide,"InChI=1S/C3HF6NO3S/c4-2(5,6)1(11)10-14(12,13)3(7,8)9/h(H,10,11)",C(=O)(C(F)(F)F)NS(=O)(=O)C(F)(F)F,CFYBHDCZEADVJH-UHFFFAOYSA-N,C3HF6NO3S,244.958,1.4,3,536
4306514,Tris[(trifluoromethyl)sulfonyl]methane,"InChI=1S/C4HF9O6S3/c5-2(6,7)20(14,15)1(21(16,17)3(8,9)10)22(18,19)4(11,12)13/h1H",C(S(=O)(=O)C(F)(F)F)(S(=O)(=O)C(F)(F)F)S(=O)(=O)C(F)(F)F,MYIAPBDBTMDUDP-UHFFFAOYSA-N,C4HF9O6S3,411.879,2.2,4,964
14169491,Bis(nonafluorobutyl)phosphinic acid,"InChI=1S/C8HF18O2P/c9-1(10,5(17,18)19)3(13,14)7(23,24)29(27,28)8(25,26)4(15,16)2(11,12)6(20,21)22/h(H,27,28)",C(C(C(F)(F)P(=O)(C(C(C(C(F)(F)F)(F)F)(F)F)(F)F)O)(F)F)(C(F)(F)F)(F)F,WAZIDHPTVNFDQG-UHFFFAOYSA-N,C8HF18O2P,501.943,5.3,1,55
104133,"N,N'-(2,5-dichloro-1,4-phenylene)bis[4-[[2-chloro-5-(trifluoromethyl)phenyl]azo]-3-hydroxynaphthalene-2-carboxamide]","InChI=1S/C42H22Cl4F6N6O4/c43-27-11-9-21(41(47,48)49)15-33(27)55-57-35-23-7-3-1-5-19(23)13-25(37(35)59)39(61)53-31-17-30(46)32(18-29(31)45)54-40(62)26-14-20-6-2-4-8-24(20)36(38(26)60)58-56-34-16-22(42(50,51)52)10-12-28(34)44/h1-18,59-60H,(H,53,61)(H,54,62)",C1=CC=C2C(=C1)C=C(C(=C2N=NC3=C(C=CC(=C3)C(F)(F)F)Cl)O)C(=O)NC4=CC(=C(C=C4Cl)NC(=O)C5=CC6=CC=CC=C6C(=C5O)N=NC7=C(C=CC(=C7)C(F)(F)F)Cl)Cl,GEVPMCITMSGJKL-UHFFFAOYSA-N,C42H22Cl4F6N6O4,930.033,14.3,0,7
51347655,Solatenol,"InChI=1S/C18H15Cl2F2N3O/c1-25-7-11(15(24-25)17(21)22)18(26)23-12-4-2-3-8-9-5-6-10(13(8)12)14(9)16(19)20/h2-4,7,9-10,17H,5-6H2,1H3,(H,23,26)/t9-,10+/m1/s1",CN1C=C(C(=N1)C(F)F)C(=O)NC2=CC=CC3=C2[C@@H]4CC[C@H]3C4=C(Cl)Cl,CCCGEKHKTPTUHJ-ZJUUUORDSA-N,C18H15Cl2F2N3O,397.056,4,22,6698
105447,"2-Propenoic acid, 2-[methyl[(nonafluorobutyl)sulfonyl]amino]ethyl ester","InChI=1S/C10H10F9NO4S/c1-3-6(21)24-5-4-20(2)25(22,23)10(18,19)8(13,14)7(11,12)9(15,16)17/h3H,1,4-5H2,2H3",CN(CCOC(=O)C=C)S(=O)(=O)C(C(C(C(F)(F)F)(F)F)(F)F)(F)F,KEMCLRGAIUJRAN-UHFFFAOYSA-N,C10H10F9NO4S,411.019,3.2,0,74
3736298,Perfluorooctanesulfonate,"InChI=1S/C8HF17O3S/c9-1(10,3(13,14)5(17,18)7(21,22)23)2(11,12)4(15,16)6(19,20)8(24,25)29(26,27)28/h(H,26,27,28)/p-1",C(C(C(C(C(F)(F)S(=O)(=O)[O-])(F)F)(F)F)(F)F)(C(C(C(F)(F)F)(F)F)(F)F)(F)F,YFSUTJLHUFNCNZ-UHFFFAOYSA-M,C8F17O3S-,498.93,4.9,2113,7638
3868826,Hexafluoroantimonate ion,InChI=1S/6FH.Sb/h6*1H;/q;;;;;;+5/p-6,F[Sb-](F)(F)(F)(F)F,MBAKFIZHTUAVJN-UHFFFAOYSA-H,F6Sb-,234.894,NULL,0,34029
5257894,Bis(fluorosulfonyl)amine,"InChI=1S/F2HNO4S2/c1-8(4,5)3-9(2,6)7/h3H",N(S(=O)(=O)F)S(=O)(=O)F,KTQDYGVEEFGIIL-UHFFFAOYSA-N,F2HNO4S2,180.932,0,95,52
103305,"2-Naphthalenesulfonic acid, 6-amino-4-hydroxy-5-((2-(trifluoromethyl)phenyl)azo)-","InChI=1S/C17H12F3N3O4S/c18-17(19,20)11-3-1-2-4-13(11)22-23-16-12(21)6-5-9-7-10(28(25,26)27)8-14(24)15(9)16/h1-8,24H,21H2,(H,25,26,27)",C1=CC=C(C(=C1)C(F)(F)F)N=NC2=C(C=CC3=CC(=CC(=C32)O)S(=O)(=O)O)N,DIAXRUOBYBLEJE-UHFFFAOYSA-N,C17H12F3N3O4S,411.05,3.5,0,7
131727912,"Methyl 2,2,3-trifluoro-3-(1,1,2,2,3,3-hexafluoro-3-(trifluoromethoxy)propoxy)propanoate","InChI=1S/C8H4F12O4/c1-22-3(21)4(10,11)2(9)23-6(14,15)5(12,13)7(16,17)24-8(18,19)20/h2H,1H3",COC(=O)C(C(OC(C(C(OC(F)(F)F)(F)F)(F)F)(F)F)F)(F)F,VOKIUIIBMBYXNU-UHFFFAOYSA-N,C8H4F12O4,391.992,4.4,0,16
11178283,Tris(pentafluoroethyl)trifluorophosphate,"InChI=1S/C6F18P/c7-1(8,9)4(16,17)25(22,23,24,5(18,19)2(10,11)12)6(20,21)3(13,14)15/q-1",C(C(F)(F)[P-](C(C(F)(F)F)(F)F)(C(C(F)(F)F)(F)F)(F)(F)F)(F)(F)F,OXDZSRZJFHVGGS-UHFFFAOYSA-N,C6F18P-,444.945,7.2,0,5
2782928,"1-Ethoxy-2,3-Difluorobenzene","InChI=1S/C8H8F2O/c1-2-11-7-5-3-4-6(9)8(7)10/h3-5H,2H2,1H3",CCOC1=C(C(=CC=C1)F)F,AVOGLGBKOFOSBN-UHFFFAOYSA-N,C8H8F2O,158.054,2.5,0,379
22467566,2-Fluoro-5-(methylsulfonyl)benzoic acid,"InChI=1S/C8H7FO4S/c1-14(12,13)5-2-3-7(9)6(4-5)8(10)11/h2-4H,1H3,(H,10,11)",CS(=O)(=O)C1=CC(=C(C=C1)F)C(=O)O,ACBAHAXPEQHVHO-UHFFFAOYSA-N,C8H7FO4S,218.005,0.8,0,184
11732152,"Ethyl 7-bromo-1-cyclopropyl-8-(difluoromethoxy)-4-oxo-1,4-dihydroquinoline-3-carboxylate","InChI=1S/C16H14BrF2NO4/c1-2-23-15(22)10-7-20(8-3-4-8)12-9(13(10)21)5-6-11(17)14(12)24-16(18)19/h5-8,16H,2-4H2,1H3",CCOC(=O)C1=CN(C2=C(C1=O)C=CC(=C2OC(F)F)Br)C3CC3,ZVUUANRFLJIZGV-UHFFFAOYSA-N,C16H14BrF2NO4,401.007,4.3,1,75
9817544,"Ethyl 1-cyclopropyl-6,7-difluoro-4-oxo-1,4-dihydroquinoline-3-carboxylate","InChI=1S/C15H13F2NO3/c1-2-21-15(20)10-7-18(8-3-4-8)13-6-12(17)11(16)5-9(13)14(10)19/h5-8H,2-4H2,1H3",CCOC(=O)C1=CN(C2=CC(=C(C=C2C1=O)F)F)C3CC3,QYGNYHKBMNUIJN-UHFFFAOYSA-N,C15H13F2NO3,293.086,2,1,138
24264941,3-(4-Fluorophenyl)-2-methylpropionylchloride,"InChI=1S/C10H10ClFO/c1-7(10(11)13)6-8-2-4-9(12)5-3-8/h2-5,7H,6H2,1H3",CC(CC1=CC=C(C=C1)F)C(=O)Cl,HJOAOPVBPDCOFZ-UHFFFAOYSA-N,C10H10ClFO,200.04,3.3,0,0
596718,Trifluoromethanesulfinic acid,"InChI=1S/CHF3O2S/c2-1(3,4)7(5)6/h(H,5,6)",C(F)(F)(F)S(=O)O,SFEBPWPPVGRFOA-UHFFFAOYSA-N,CHF3O2S,133.965,0.6,18,525
4176748,N-Propyl-Methyl Piperidinium Bis(trifluoroMethylsulfonyl)Imide,"InChI=1S/C2HF6NO4S2/c3-1(4,5)14(10,11)9-15(12,13)2(6,7)8/h(H,9,10,11)/p-1",C(F)(F)(F)S(=NS(=O)(=O)C(F)(F)F)(=O)[O-],AHXNYDBSLAVPLY-UHFFFAOYSA-M,C2F6NO4S2-,279.917,1.9,8,7937
11027846,"[2-Hydroxy-3-(3,3,4,4,5,5,6,6,7,7,8,8,8-tridecafluorooctylsulfanyl)propyl]-trimethylazanium","InChI=1S/C14H19F13NOS/c1-28(2,3)6-8(29)7-30-5-4-9(15,16)10(17,18)11(19,20)12(21,22)13(23,24)14(25,26)27/h8,29H,4-7H2,1-3H3/q+1",C[N+](C)(C)CC(CSCCC(C(C(C(C(C(F)(F)F)(F)F)(F)F)(F)F)(F)F)(F)F)O,CNMMRRVECJZEIU-UHFFFAOYSA-N,C14H19F13NOS+,496.098,5.1,0,4
138402797,"N,N,N,-Triethylethanaminium 1,1,2,2,3,3,4,4,4-nonafluorobutane-1-sulfonate","InChI=1S/C12H19F9NO3S/c1-5-22(6-2,7-3)8(4)25-26(23,24)12(20,21)10(15,16)9(13,14)11(17,18)19/h8H,5-7H2,1-4H3/q+1",CC[N+](CC)(CC)C(C)OS(=O)(=O)C(C(C(C(F)(F)F)(F)F)(F)F)(F)F,YHJYQOPSLSJYOP-UHFFFAOYSA-N,C12H19F9NO3S+,428.094,4.6,0,0
4067273,Bis(perfluoroethylsulfonyl)imide,"InChI=1S/C4F10NO4S2/c5-1(6,7)3(11,12)20(16,17)15-21(18,19)4(13,14)2(8,9)10/q-1",C(C(F)(F)S(=O)(=O)[N-]S(=O)(=O)C(C(F)(F)F)(F)F)(F)(F)F,SLSPYQCCSCAKIB-UHFFFAOYSA-N,C4F10NO4S2-,379.911,2.7,0,1172
3646715,"2,3,3,3-Tetrafluoro-2-(1,1,2,2,3,3,3-heptafluoropropoxy)propanoate","InChI=1S/C6HF11O3/c7-2(1(18)19,4(10,11)12)20-6(16,17)3(8,9)5(13,14)15/h(H,18,19)/p-1",C(=O)(C(C(F)(F)F)(OC(C(C(F)(F)F)(F)F)(F)F)F)[O-],CSEBNABAWMZWIF-UHFFFAOYSA-M,C6F11O3-,328.967,4.3,35,52
20445477,1-[2-(Tridecafluorohexyl)ethyl]pyridinium,"InChI=1S/C13H9F13N/c14-8(15,4-7-27-5-2-1-3-6-27)9(16,17)10(18,19)11(20,21)12(22,23)13(24,25)26/h1-3,5-6H,4,7H2/q+1",C1=CC=[N+](C=C1)CCC(C(C(C(C(C(F)(F)F)(F)F)(F)F)(F)F)(F)F)(F)F,IWKHPOSBTVOEFD-UHFFFAOYSA-N,C13H9F13N+,426.053,5.7,2,2
11525234,"2,2,3,3,4,4,5,5-Octafluoropentylsulfate","InChI=1S/C5H4F8O4S/c6-2(7)4(10,11)5(12,13)3(8,9)1-17-18(14,15)16/h2H,1H2,(H,14,15,16)",C(C(C(C(C(F)F)(F)F)(F)F)(F)F)OS(=O)(=O)O,IIAOVMCGUVEGDU-UHFFFAOYSA-N,C5H4F8O4S,311.97,2,0,2
1235118,"N-[2-chloro-5-(trifluoromethyl)phenyl]-2-(3-nitro-1,2,4-triazol-1-yl)acetamide","InChI=1S/C11H7ClF3N5O3/c12-7-2-1-6(11(13,14)15)3-8(7)17-9(21)4-19-5-16-10(18-19)20(22)23/h1-3,5H,4H2,(H,17,21)",C1=CC(=C(C=C1C(F)(F)F)NC(=O)CN2C=NC(=N2)[N+](=O)[O-])Cl,MXAJYGSMFXDTIF-UHFFFAOYSA-N,C11H7ClF3N5O3,349.019,2.7,0,72
11073469,Vinyltrifluoroborate,"InChI=1S/C2H3BF3/c1-2-3(4,5)6/h2H,1H2/q-1",[B-](C=C)(F)(F)F,JXNIXNJQEBMELS-UHFFFAOYSA-N,C2H3BF3-,95.028,NULL,1,327
118692,"Carboxymethyldimethyl-3-[[(3,3,4,4,5,5,6,6,7,7,8,8,8-tridecafluorooctyl)sulphonyl]amino]propylammonium hydroxide","InChI=1S/C15H19F13N2O4S/c1-30(2,8-9(31)32)6-3-5-29-35(33,34)7-4-10(16,17)11(18,19)12(20,21)13(22,23)14(24,25)15(26,27)28/h29H,3-8H2,1-2H3/p+1",C[N+](C)(CCCNS(=O)(=O)CCC(C(C(C(C(C(F)(F)F)(F)F)(F)F)(F)F)(F)F)(F)F)CC(=O)O,OKOCIUJVPQKDLL-UHFFFAOYSA-O,C15H20F13N2O4S+,571.094,4.2,0,2
4354960,"1-[2-amino-6-[(2,2,2-trifluoroacetyl)amino]hexanoyl]pyrrolidine-2-carboxylic Acid","InChI=1S/C13H20F3N3O4/c14-13(15,16)12(23)18-6-2-1-4-8(17)10(20)19-7-3-5-9(19)11(21)22/h8-9H,1-7,17H2,(H,18,23)(H,21,22)",C1CC(N(C1)C(=O)C(CCCCNC(=O)C(F)(F)F)N)C(=O)O,MUYCUFZXUZRHSL-UHFFFAOYSA-N,C13H20F3N3O4,339.141,-1.9,0,2
12104944,Heptafluoropropyltrifluoroboronanion,"InChI=1S/C3BF10/c5-1(6,3(9,10)11)2(7,8)4(12,13)14/q-1",[B-](C(C(C(F)(F)F)(F)F)(F)F)(F)(F)F,BSEXUSFORPDNSU-UHFFFAOYSA-N,C3BF10-,236.993,NULL,0,16
20395353,"N-(Pentafluorophenyl)-1,1,2,2,3,3,4,4,4-nonafluorobutane-1-sulfonamide","InChI=1S/C10HF14NO2S/c11-1-2(12)4(14)6(5(15)3(1)13)25-28(26,27)10(23,24)8(18,19)7(16,17)9(20,21)22/h25H",C1(=C(C(=C(C(=C1F)F)F)F)F)NS(=O)(=O)C(C(C(C(F)(F)F)(F)F)(F)F)(F)F,GZGDCCBHZJSYLK-UHFFFAOYSA-N,C10HF14NO2S,464.95,4.6,0,8
14019395,N2-1[(1S)-Ethoxycarbonyl-3-phenylpropyl]-N6-trifluoroacetyl-L-lysyl-L-proline,"InChI=1S/C25H34F3N3O6/c1-2-37-23(35)19(14-13-17-9-4-3-5-10-17)30-18(11-6-7-15-29-24(36)25(26,27)28)21(32)31-16-8-12-20(31)22(33)34/h3-5,9-10,18-20,30H,2,6-8,11-16H2,1H3,(H,29,36)(H,33,34)",CCOC(=O)C(CCC1=CC=CC=C1)NC(CCCCNC(=O)C(F)(F)F)C(=O)N2CCCC2C(=O)O,WEPXGLCNGPXOQG-UHFFFAOYSA-N,C25H34F3N3O6,529.24,1.1,0,0
57414498,"2-hydroxy-4-oxo-1-(5-pyrimidinylmethyl)-3-[3-(trifluoromethyl)phenyl]-4H-pyrido[1,2-a]pyrimidinium","InChI=1S/C20H13F3N4O2/c21-20(22,23)15-5-3-4-14(8-15)17-18(28)26-7-2-1-6-16(26)27(19(17)29)11-13-9-24-12-25-10-13/h1-10,12H,11H2/p+1",C1=CC2=[N+](C(=C(C(=O)N2C=C1)C3=CC(=CC=C3)C(F)(F)F)O)CC4=CN=CN=C4,LHZOTJOOBRODLL-UHFFFAOYSA-O,C20H14F3N4O2+,399.107,2.3,0,51
102269401,"(4S)-3-[(S)-1-(Ethoxycarbonyl)-3-phenylpropyl]-4-[4-[(trifluoroacetyl)amino]butyl]-2,5-dioxooxazolidine","InChI=1S/C21H25F3N2O6/c1-2-31-17(27)16(12-11-14-8-4-3-5-9-14)26-15(18(28)32-20(26)30)10-6-7-13-25-19(29)21(22,23)24/h3-5,8-9,15-16H,2,6-7,10-13H2,1H3,(H,25,29)/t15-,16-/m0/s1",CCOC(=O)[C@H](CCC1=CC=CC=C1)N2[C@H](C(=O)OC2=O)CCCCNC(=O)C(F)(F)F,MFBPXWZWNNBFOR-HOTGVXAUSA-N,C21H25F3N2O6,458.166,3.9,0,0
11252298,Trifluoromethyltrifluoroboronanion,"InChI=1S/CBF6/c3-1(4,5)2(6,7)8/q-1",[B-](C(F)(F)F)(F)(F)F,ZJXKJUZXUHPNNH-UHFFFAOYSA-N,CBF6-,137,NULL,0,96
12104942,Pentafluoroethyltrifluoroboronanion,"InChI=1S/C2BF8/c4-1(5,2(6,7)8)3(9,10)11/q-1",[B-](C(C(F)(F)F)(F)F)(F)(F)F,ZXGDRPWPOZQRQY-UHFFFAOYSA-N,C2BF8-,186.997,NULL,0,66
11600680,Ethyltrifluoroborate,"InChI=1S/C2H5BF3/c1-2-3(4,5)6/h2H2,1H3/q-1",[B-](CC)(F)(F)F,JUMPZTUFDIFDLI-UHFFFAOYSA-N,C2H5BF3-,97.0436,NULL,0,33
5257871,Methyltrifluoroboronanion,"InChI=1S/CH3BF3/c1-2(3,4)5/h1H3/q-1",[B-](C)(F)(F)F,LWDVCEGDWIJDJC-UHFFFAOYSA-N,CH3BF3-,83.028,NULL,0,157
11389580,Butyltrifluoroboronanion,"InChI=1S/C4H9BF3/c1-2-3-4-5(6,7)8/h2-4H2,1H3/q-1",[B-](CCCC)(F)(F)F,UWOFMFGSQUDOTD-UHFFFAOYSA-N,C4H9BF3-,125.075,NULL,0,15
86233917,"4,4,5,5,5-Pentafluoropentylsulfate","InChI=1S/C5H7F5O4S/c6-4(7,5(8,9)10)2-1-3-14-15(11,12)13/h1-3H2,(H,11,12,13)",C(CC(C(F)(F)F)(F)F)COS(=O)(=O)O,SZNKTIUSIMCHRA-UHFFFAOYSA-N,C5H7F5O4S,257.999,1.7,0,1
135666641,"4-Amino-6-[[5-[(5-chloro-2,6-difluoro-4-pyrimidinyl)amino]-2-sulfophenyl]azo]-5-hydroxy-3-[[4-[[2-(sulfooxy)ethyl]sulfonyl]phenyl]azo]-2,7-naphthalenedisulfonic acid","InChI=1S/C28H21ClF2N8O16S5/c29-21-26(30)34-28(31)35-27(21)33-14-3-6-17(57(43,44)45)16(11-14)37-39-24-19(59(49,50)51)10-12-9-18(58(46,47)48)23(22(32)20(12)25(24)40)38-36-13-1-4-15(5-2-13)56(41,42)8-7-55-60(52,53)54/h1-6,9-11,40H,7-8,32H2,(H,33,34,35)(H,43,44,45)(H,46,47,48)(H,49,50,51)(H,52,53,54)",C1=CC(=CC=C1N=NC2=C(C=C3C=C(C(=C(C3=C2N)O)N=NC4=C(C=CC(=C4)NC5=C(C(=NC(=N5)F)F)Cl)S(=O)(=O)O)S(=O)(=O)O)S(=O)(=O)O)S(=O)(=O)CCOS(=O)(=O)O,LBWKOUMCXLSLPR-UHFFFAOYSA-N,C28H21ClF2N8O16S5,957.934,2.3,0,13
12117503,"3-(1,1,2,2,3,3,4,4,5,5,6,6,7,7,8,8,8-Heptadecafluorooctyl)-1,4,5-trimethyl-1,2,4-triazol-4-ium","InChI=1S/C13H9F17N3/c1-4-32(2)5(31-33(4)3)6(14,15)7(16,17)8(18,19)9(20,21)10(22,23)11(24,25)12(26,27)13(28,29)30/h1-3H3/q+1",CC1=[N+](C(=NN1C)C(C(C(C(C(C(C(C(F)(F)F)(F)F)(F)F)(F)F)(F)F)(F)F)(F)F)(F)F)C,FIKDSGKREKIYRC-UHFFFAOYSA-N,C13H9F17N3+,530.053,6.2,1,0
91431739,"1,4,5-Trimethyl-3-(trifluoromethyl)-1,2,4-triazol-4-ium","InChI=1S/C6H9F3N3/c1-4-11(2)5(6(7,8)9)10-12(4)3/h1-3H3/q+1",CC1=[N+](C(=NN1C)C(F)(F)F)C,DJGGLWKWITYNIN-UHFFFAOYSA-N,C6H9F3N3+,180.075,1.5,1,0
145865716,"Acetic acid, 2,2-difluoro-2-[[2,2,4,5-tetrafluoro-5-(trifluoromethoxy)-1,3-dioxolan-4-yl]oxy]-","InChI=1S/C6HF9O6/c7-2(8,1(16)17)18-3(9)4(10,19-5(11,12)13)21-6(14,15)20-3/h(H,16,17)",C(=O)(C(OC1(C(OC(O1)(F)F)(OC(F)(F)F)F)F)(F)F)O,CJAXBZSIMAURNW-UHFFFAOYSA-N,C6HF9O6,339.963,2.7,0,0
12104946,Nonafluorobutyltrifluoroboronanion,"InChI=1S/C4BF12/c6-1(7,2(8,9)4(12,13)14)3(10,11)5(15,16)17/q-1",[B-](C(C(C(C(F)(F)F)(F)F)(F)F)(F)F)(F)(F)F,GVHUPPZWFMURCW-UHFFFAOYSA-N,C4BF12-,286.99,NULL,0,0
11248060,"1-(2,2,2-Trifluoroethyl)-4-methylpyridinium","InChI=1S/C8H9F3N/c1-7-2-4-12(5-3-7)6-8(9,10)11/h2-5H,6H2,1H3/q+1",CC1=CC=[N+](C=C1)CC(F)(F)F,IRUGCXXVGUORCY-UHFFFAOYSA-N,C8H9F3N+,176.069,2.4,0,0
63701728,Propyltrifluoroboronanion,"InChI=1S/C3H7BF3/c1-2-3-4(5,6)7/h2-3H2,1H3/q-1",[B-](CCC)(F)(F)F,UHUCOXBNSICWFZ-UHFFFAOYSA-N,C3H7BF3-,111.059,NULL,0,0
46318059,Pentyltrifluoroboronanion,"InChI=1S/C5H11BF3/c1-2-3-4-5-6(7,8)9/h2-5H2,1H3/q-1",[B-](CCCCC)(F)(F)F,VWAVGHJLXBYGIW-UHFFFAOYSA-N,C5H11BF3-,139.091,NULL,0,0
12138834,"1-(3,3,3-Trifluoropropyl)pyrazine-1-ium","InChI=1S/C7H8F3N2/c8-7(9,10)1-4-12-5-2-11-3-6-12/h2-3,5-6H,1,4H2/q+1",C1=C[N+](=CC=N1)CCC(F)(F)F,IEYNVNRCHCFXEA-UHFFFAOYSA-N,C7H8F3N2+,177.064,1.3,0,0
12138822,"1-(3,3,3-Trifluoropropyl)pyridazine-1-ium","InChI=1S/C7H8F3N2/c8-7(9,10)3-6-12-5-2-1-4-11-12/h1-2,4-5H,3,6H2/q+1",C1=CC=[N+](N=C1)CCC(F)(F)F,MUSBCODIBLMUEY-UHFFFAOYSA-N,C7H8F3N2+,177.064,2,0,0
85813076,"3,3,4,4,5,5,6,6,6-Nonafluorohexyltributylaminium","InChI=1S/C18H31F9N/c1-4-7-11-28(12-8-5-2,13-9-6-3)14-10-15(19,20)16(21,22)17(23,24)18(25,26)27/h4-14H2,1-3H3/q+1",CCCC[N+](CCCC)(CCCC)CCC(C(C(C(F)(F)F)(F)F)(F)F)(F)F,VWODYIFWWHAACY-UHFFFAOYSA-N,C18H31F9N+,432.231,7.5,0,0
85879365,"1,1'-Bis(3,3,3-trifluoropropyl)-4,4'-bipyridinium","InChI=1S/C16H16F6N2/c17-15(18,19)5-11-23-7-1-13(2-8-23)14-3-9-24(10-4-14)12-6-16(20,21)22/h1-4,7-10H,5-6,11-12H2/q+2",C1=C[N+](=CC=C1C2=CC=[N+](C=C2)CCC(F)(F)F)CCC(F)(F)F,AAIGLDHMTQNWHC-UHFFFAOYSA-N,C16H16F6N2+2,350.122,4.5,0,0
101731127,"4-[2-(2,2,2-Trifluoroethoxy)ethyl]-4-methylmorpholinium","InChI=1S/C9H17F3NO2/c1-13(2-5-14-6-3-13)4-7-15-8-9(10,11)12/h2-8H2,1H3/q+1",C[N+]1(CCOCC1)CCOCC(F)(F)F,FYEKZBJDOPQHCJ-UHFFFAOYSA-N,C9H17F3NO2+,228.121,0.9,0,0
101757814,"4-Pyridinio-1,1,2,2-tetrafluorobutylpentafluorosulfur(VI)","InChI=1S/C9H9F9NS/c10-8(11,4-7-19-5-2-1-3-6-19)9(12,13)20(14,15,16,17)18/h1-3,5-6H,4,7H2/q+1",C1=CC=[N+](C=C1)CCC(C(F)(F)S(F)(F)(F)(F)F)(F)F,PAPGTILUXIAAQS-UHFFFAOYSA-N,C9H9F9NS+,334.031,6.1,0,0
101757815,"6-Pyridinio-1,1,2,2-tetrafluorohexylpentafluorosulfur(VI)","InChI=1S/C11H13F9NS/c12-10(13,11(14,15)22(16,17,18,19)20)6-2-5-9-21-7-3-1-4-8-21/h1,3-4,7-8H,2,5-6,9H2/q+1",C1=CC=[N+](C=C1)CCCCC(C(F)(F)S(F)(F)(F)(F)F)(F)F,ADDNNJMCKPIAMT-UHFFFAOYSA-N,C11H13F9NS+,362.062,6.8,0,0
101757818,"6-Pyridinio-1,1,2,2,3,3,4,4-octafluorohexylpentafluorosulfur(VI)","InChI=1S/C11H9F13NS/c12-8(13,4-7-25-5-2-1-3-6-25)9(14,15)10(16,17)11(18,19)26(20,21,22,23)24/h1-3,5-6H,4,7H2/q+1",C1=CC=[N+](C=C1)CCC(C(C(C(F)(F)S(F)(F)(F)(F)F)(F)F)(F)F)(F)F,SZFAAOVOWJIWIK-UHFFFAOYSA-N,C11H9F13NS+,434.025,7.5,0,0
12138824,"1-(3,3,4,4,5,5,6,6,7,7,8,8,8-Tridecafluorooctyl)pyridazine-1-ium","InChI=1S/C12H8F13N2/c13-7(14,3-6-27-5-2-1-4-26-27)8(15,16)9(17,18)10(19,20)11(21,22)12(23,24)25/h1-2,4-5H,3,6H2/q+1",C1=CC=[N+](N=C1)CCC(C(C(C(C(C(F)(F)F)(F)F)(F)F)(F)F)(F)F)(F)F,QFTYYPQROVABFX-UHFFFAOYSA-N,C12H8F13N2+,427.048,5.3,0,0
101731129,"4-[2-(2,2,3,3,4,4,5,5-Octafluoropentyloxy)ethyl]-4-methylmorpholinium","InChI=1S/C12H18F8NO2/c1-21(2-5-22-6-3-21)4-7-23-8-10(15,16)12(19,20)11(17,18)9(13)14/h9H,2-8H2,1H3/q+1",C[N+]1(CCOCC1)CCOCC(C(C(C(F)F)(F)F)(F)F)(F)F,JGSXNNAJEDSMKH-UHFFFAOYSA-N,C12H18F8NO2+,360.121,2.6,0,0
101757817,"4-[(Pyridazine-1-ium)-1-yl]-1,1,2,2-tetrafluorobutylpentafluorosulfur(VI)","InChI=1S/C8H8F9N2S/c9-7(10,3-6-19-5-2-1-4-18-19)8(11,12)20(13,14,15,16)17/h1-2,4-5H,3,6H2/q+1",C1=CC=[N+](N=C1)CCC(C(F)(F)S(F)(F)(F)(F)F)(F)F,JBBILWNFQVLZQB-UHFFFAOYSA-N,C8H8F9N2S+,335.026,5.7,0,0
101757812,"6-[(3-Methyl-1H-imidazole-3-ium)-1-yl]-1,1,2,2-tetrafluorohexylpentafluorosulfur(VI)","InChI=1S/C10H14F9N2S/c1-20-6-7-21(8-20)5-3-2-4-9(11,12)10(13,14)22(15,16,17,18)19/h6-8H,2-5H2,1H3/q+1",C[N+]1=CN(C=C1)CCCCC(C(F)(F)S(F)(F)(F)(F)F)(F)F,JMWNXFITAHIDAT-UHFFFAOYSA-N,C10H14F9N2S+,365.073,6,0,0
101757816,"4-[(3-Methyl-1H-imidazole-3-ium)-1-yl]-1,1,2,2-tetrafluorobutylpentafluorosulfur(VI)","InChI=1S/C8H10F9N2S/c1-18-4-5-19(6-18)3-2-7(9,10)8(11,12)20(13,14,15,16)17/h4-6H,2-3H2,1H3/q+1",C[N+]1=CN(C=C1)CCC(C(F)(F)S(F)(F)(F)(F)F)(F)F,IUWRKXFQGZDRNY-UHFFFAOYSA-N,C8H10F9N2S+,337.042,5.3,0,0
101757813,"6-[(1-Propyl-1H-1,2,4-triazole-4-ium)-4-yl]-1,1,2,2-tetrafluorohexylpentafluorosulfur(VI)","InChI=1S/C11H17F9N3S/c1-2-6-23-9-22(8-21-23)7-4-3-5-10(12,13)11(14,15)24(16,17,18,19)20/h8-9H,2-7H2,1H3/q+1",CCCN1C=[N+](C=N1)CCCCC(C(F)(F)S(F)(F)(F)(F)F)(F)F,VJJNSQILMAYIMS-UHFFFAOYSA-N,C11H17F9N3S+,394.1,6.8,0,0
101757819,"6-[(3-Methyl-1H-imidazole-3-ium)-1-yl]-1,1,2,2,3,3,4,4-octafluorohexylpentafluorosulfur(VI)","InChI=1S/C10H10F13N2S/c1-24-4-5-25(6-24)3-2-7(11,12)8(13,14)9(15,16)10(17,18)26(19,20,21,22)23/h4-6H,2-3H2,1H3/q+1",C[N+]1=CN(C=C1)CCC(C(C(C(F)(F)S(F)(F)(F)(F)F)(F)F)(F)F)(F)F,DIJGUPHGRNDVFI-UHFFFAOYSA-N,C10H10F13N2S+,437.036,6.6,0,0
6125183,"2-[(Z)-N-[(3,5-difluorophenyl)carbamoylamino]-C-methylcarbonimidoyl]pyridine-3-carboxylate","InChI=1S/C15H12F2N4O3/c1-8(13-12(14(22)23)3-2-4-18-13)20-21-15(24)19-11-6-9(16)5-10(17)7-11/h2-7H,1H3,(H,22,23)(H2,19,21,24)/p-1/b20-8-",C/C(=N/NC(=O)NC1=CC(=CC(=C1)F)F)/C2=C(C=CC=N2)C(=O)[O-],IRJQWZWMQCVOLA-ZBKNUEDVSA-M,C15H11F2N4O3-,333.08,2.4,0,0
12161087,"2,3,3,3-Tetrafluoro-2-[1,1,2,2,3,3-hexafluoro-3-(trifluoromethoxy)propoxy]propanoic acid","InChI=1S/C7HF13O4/c8-2(1(21)22,4(11,12)13)23-5(14,15)3(9,10)6(16,17)24-7(18,19)20/h(H,21,22)",C(=O)(C(C(F)(F)F)(OC(C(C(OC(F)(F)F)(F)F)(F)F)(F)F)F)O,USVVTMVTMWPCOI-UHFFFAOYSA-N,C7HF13O4,395.967,4.4,0,0
71377731,"3,3,4,4,5,5,6,6,6-Nonafluorohexyl(tripropyl)azanium","InChI=1S/C15H25F9N/c1-4-8-25(9-5-2,10-6-3)11-7-12(16,17)13(18,19)14(20,21)15(22,23)24/h4-11H2,1-3H3/q+1",CCC[N+](CCC)(CCC)CCC(C(C(C(F)(F)F)(F)F)(F)F)(F)F,WIWXQAJUJWSYJL-UHFFFAOYSA-N,C15H25F9N+,390.184,6.4,0,0
102278653,"Hydroxy(3,3,4,4,5,5,6,6,7,7,8,8,8-tridecafluorooctyl)phosphinate","InChI=1S/C8H6F13O3P/c9-3(10,1-2-25(22,23)24)4(11,12)5(13,14)6(15,16)7(17,18)8(19,20)21/h1-2H2,(H2,22,23,24)/p-1",C(CP(=O)(O)[O-])C(C(C(C(C(C(F)(F)F)(F)F)(F)F)(F)F)(F)F)(F)F,DEXIXSRZQUFPIK-UHFFFAOYSA-M,C8H5F13O3P-,426.977,3.1,0,0
151251909,"1-(3,3,3-Trifluoropropyl)pyridin-1-ium","InChI=1S/C8H9F3N/c9-8(10,11)4-7-12-5-2-1-3-6-12/h1-3,5-6H,4,7H2/q+1",C1=CC=[N+](C=C1)CCC(F)(F)F,NSMXUXUWPNRQEN-UHFFFAOYSA-N,C8H9F3N+,176.069,2.4,0,0
156599995,"4-Decyl-1-(3,3,4,4,5,5,6,6,6-nonafluorohexyl)-1,2,4-triazol-4-ium","InChI=1S/C18H27F9N3/c1-2-3-4-5-6-7-8-9-11-29-13-28-30(14-29)12-10-15(19,20)16(21,22)17(23,24)18(25,26)27/h13-14H,2-12H2,1H3/q+1",CCCCCCCCCC[N+]1=CN(N=C1)CCC(C(C(C(F)(F)F)(F)F)(F)F)(F)F,AEPGXQFCKSTJDJ-UHFFFAOYSA-N,C18H27F9N3+,456.206,8,0,0
156600008,"2,2-Difluoro-2-[[2,2,4,5-tetrafluoro-5-(trifluoromethoxy)-1,3-dioxolan-4-yl]oxy]acetate","InChI=1S/C6HF9O6/c7-2(8,1(16)17)18-3(9)4(10,19-5(11,12)13)21-6(14,15)20-3/h(H,16,17)/p-1",C(=O)(C(OC1(C(OC(O1)(F)F)(OC(F)(F)F)F)F)(F)F)[O-],CJAXBZSIMAURNW-UHFFFAOYSA-M,C6F9O6-,338.955,3.3,0,0
156600012,"Pentafluoro-[1,1,2,2,3,3,4,4-octafluoro-6-(1-propyl-1,2,4-triazol-4-ium-4-yl)hexyl]-lambda6-sulfane","InChI=1S/C11H13F13N3S/c1-2-4-27-7-26(6-25-27)5-3-8(12,13)9(14,15)10(16,17)11(18,19)28(20,21,22,23)24/h6-7H,2-5H2,1H3/q+1",CCCN1C=[N+](C=N1)CCC(C(C(C(F)(F)S(F)(F)(F)(F)F)(F)F)(F)F)(F)F,DQNHBUABUFMNIQ-UHFFFAOYSA-N,C11H13F13N3S+,466.062,7.4,0,0
156600022,"3,3,4,4,5,5,6,6,7,7,8,8,8-Tridecafluorooctyl 2-hydroxyprop-2-enoate","InChI=1S/C11H7F13O3/c1-4(25)5(26)27-3-2-6(12,13)7(14,15)8(16,17)9(18,19)10(20,21)11(22,23)24/h25H,1-3H2",C=C(C(=O)OCCC(C(C(C(C(C(F)(F)F)(F)F)(F)F)(F)F)(F)F)(F)F)O,HWADLCQYVUOOTE-UHFFFAOYSA-N,C11H7F13O3,434.019,5.4,0,0
156600023,"4-Decyl-1-(3,3,4,4,5,5,6,6,7,7,8,8,8-tridecafluorooctyl)-1,2,4-triazol-4-ium","InChI=1S/C20H27F13N3/c1-2-3-4-5-6-7-8-9-11-35-13-34-36(14-35)12-10-15(21,22)16(23,24)17(25,26)18(27,28)19(29,30)20(31,32)33/h13-14H,2-12H2,1H3/q+1",CCCCCCCCCC[N+]1=CN(N=C1)CCC(C(C(C(C(C(F)(F)F)(F)F)(F)F)(F)F)(F)F)(F)F,HYPXOGWDTVPVFD-UHFFFAOYSA-N,C20H27F13N3+,556.2,9.3,0,0
156600025,"4-Butyl-1-(3,3,4,4,5,5,6,6,7,7,8,8,8-tridecafluorooctyl)-1,2,4-triazol-4-ium","InChI=1S/C14H15F13N3/c1-2-3-5-29-7-28-30(8-29)6-4-9(15,16)10(17,18)11(19,20)12(21,22)13(23,24)14(25,26)27/h7-8H,2-6H2,1H3/q+1",CCCC[N+]1=CN(N=C1)CCC(C(C(C(C(C(F)(F)F)(F)F)(F)F)(F)F)(F)F)(F)F,IRJKSKZWUPLERA-UHFFFAOYSA-N,C14H15F13N3+,472.106,6.1,0,0
156600027,"1-(3,3,4,4,5,5,6,6,7,7,8,8,9,9,10,10,10-Heptadecafluorodecyl)-4-pyridin-1-ium-4-ylpyridin-1-ium","InChI=1S/C20H12F17N2/c21-13(22,5-10-39-8-3-12(4-9-39)11-1-6-38-7-2-11)14(23,24)15(25,26)16(27,28)17(29,30)18(31,32)19(33,34)20(35,36)37/h1-4,6-9H,5,10H2/q+1/p+1",C1=C[NH+]=CC=C1C2=CC=[N+](C=C2)CCC(C(C(C(C(C(C(C(F)(F)F)(F)F)(F)F)(F)F)(F)F)(F)F)(F)F)(F)F,JIDBBTSSEGCAGV-UHFFFAOYSA-O,C20H13F17N2+2,604.081,7.8,0,0
156600033,"3,3,4,4,5,5,6,6,7,7,8,8,9,9,10,10,10-Heptadecafluorodecyl(tripropyl)azanium","InChI=1S/C19H25F17N/c1-4-8-37(9-5-2,10-6-3)11-7-12(20,21)13(22,23)14(24,25)15(26,27)16(28,29)17(30,31)18(32,33)19(34,35)36/h4-11H2,1-3H3/q+1",CCC[N+](CCC)(CCC)CCC(C(C(C(C(C(C(C(F)(F)F)(F)F)(F)F)(F)F)(F)F)(F)F)(F)F)(F)F,LPLOEEPYBVCXIX-UHFFFAOYSA-N,C19H25F17N+,590.172,9.1,0,0
156600037,"4-Heptyl-1-(3,3,4,4,5,5,6,6,7,7,8,8,8-tridecafluorooctyl)-1,2,4-triazol-4-ium","InChI=1S/C17H21F13N3/c1-2-3-4-5-6-8-32-10-31-33(11-32)9-7-12(18,19)13(20,21)14(22,23)15(24,25)16(26,27)17(28,29)30/h10-11H,2-9H2,1H3/q+1",CCCCCCC[N+]1=CN(N=C1)CCC(C(C(C(C(C(F)(F)F)(F)F)(F)F)(F)F)(F)F)(F)F,MGTADQAPELIOHD-UHFFFAOYSA-N,C17H21F13N3+,514.153,7.7,0,0
156600039,"3-Amino-4-[[4-[[4-[2-(2-ethenylsulfonylethoxy)ethylamino]-6-fluoro-1,3,5-triazin-2-yl]amino]-2-sulfonatophenyl]diazenyl]-5-hydroxynaphthalene-2,7-disulfonate","InChI=1S/C25H25FN8O13S4/c1-2-48(36,37)8-7-47-6-5-28-24-30-23(26)31-25(32-24)29-14-3-4-16(18(11-14)50(41,42)43)33-34-22-20-13(10-19(21(22)27)51(44,45)46)9-15(12-17(20)35)49(38,39)40/h2-4,9-12,35H,1,5-8,27H2,(H,38,39,40)(H,41,42,43)(H,44,45,46)(H2,28,29,30,31,32)/p-3",C=CS(=O)(=O)CCOCCNC1=NC(=NC(=N1)F)NC2=CC(=C(C=C2)N=NC3=C(C(=CC4=CC(=CC(=C43)O)S(=O)(=O)[O-])S(=O)(=O)[O-])N)S(=O)(=O)[O-],HLEIAOWHJCRAPS-UHFFFAOYSA-K,C25H22FN8O13S4-3,789.017,0.9,0,0
156600041,"4-Decyl-1-(3,3,3-trifluoropropyl)-1,2,4-triazol-4-ium","InChI=1S/C15H27F3N3/c1-2-3-4-5-6-7-8-9-11-20-13-19-21(14-20)12-10-15(16,17)18/h13-14H,2-12H2,1H3/q+1",CCCCCCCCCC[N+]1=CN(N=C1)CCC(F)(F)F,PFLBTZDUXKLESB-UHFFFAOYSA-N,C15H27F3N3+,306.216,6,0,0
156600042,"4-Methyl-1-(3,3,4,4,5,5,6,6,6-nonafluorohexyl)-1,2,4-triazol-4-ium","InChI=1S/C9H9F9N3/c1-20-4-19-21(5-20)3-2-6(10,11)7(12,13)8(14,15)9(16,17)18/h4-5H,2-3H2,1H3/q+1",C[N+]1=CN(N=C1)CCC(C(C(C(F)(F)F)(F)F)(F)F)(F)F,PNDPBWXMSPDXNO-UHFFFAOYSA-N,C9H9F9N3+,330.065,3.6,0,0
156600045,"1-Propyl-4-(3,3,4,4,5,5,6,6,7,7,8,8,8-tridecafluorooctyl)-1,2,4-triazol-4-ium","InChI=1S/C13H13F13N3/c1-2-4-29-7-28(6-27-29)5-3-8(14,15)9(16,17)10(18,19)11(20,21)12(22,23)13(24,25)26/h6-7H,2-5H2,1H3/q+1",CCCN1C=[N+](C=N1)CCC(C(C(C(C(C(F)(F)F)(F)F)(F)F)(F)F)(F)F)(F)F,QCNBSNPDMKXQNG-UHFFFAOYSA-N,C13H13F13N3+,458.09,5.7,0,0
156600048,"2-[[Cyclohexa-2,4-dien-1-ylidene-[[3-[[4-[2-(2-ethenylsulfonylethoxy)ethylamino]-6-fluoro-1,3,5-triazin-2-yl]amino]-2-hydroxy-5-sulfophenyl]methylideneamino]methyl]diazenyl]-4-sulfobenzoic acid","InChI=1S/C30H29FN8O12S3/c1-2-52(43,44)13-12-51-11-10-32-29-35-28(31)36-30(37-29)34-24-16-21(54(48,49)50)14-19(25(24)40)17-33-26(18-6-4-3-5-7-18)39-38-23-15-20(53(45,46)47)8-9-22(23)27(41)42/h2-6,8-9,14-17,40H,1,7,10-13H2,(H,41,42)(H,45,46,47)(H,48,49,50)(H2,32,34,35,36,37)",C=CS(=O)(=O)CCOCCNC1=NC(=NC(=N1)F)NC2=CC(=CC(=C2O)C=NC(=C3CC=CC=C3)N=NC4=C(C=CC(=C4)S(=O)(=O)O)C(=O)O)S(=O)(=O)O,IMXKZQNVANUPTG-UHFFFAOYSA-N,C30H29FN8O12S3,808.105,2.3,0,0
156600052,"4-Pyridin-1-ium-4-yl-1-(3,3,3-trifluoropropyl)pyridin-1-ium","InChI=1S/C13H12F3N2/c14-13(15,16)5-10-18-8-3-12(4-9-18)11-1-6-17-7-2-11/h1-4,6-9H,5,10H2/q+1/p+1",C1=C[NH+]=CC=C1C2=CC=[N+](C=C2)CCC(F)(F)F,RNZRIVNEOXCIKB-UHFFFAOYSA-O,C13H13F3N2+2,254.103,3.1,0,0
156600054,"4-Methyl-1-(3,3,4,4,5,5,6,6,7,7,8,8,8-tridecafluorooctyl)-1,2,4-triazol-4-ium","InChI=1S/C11H9F13N3/c1-26-4-25-27(5-26)3-2-6(12,13)7(14,15)8(16,17)9(18,19)10(20,21)11(22,23)24/h4-5H,2-3H2,1H3/q+1",C[N+]1=CN(N=C1)CCC(C(C(C(C(C(F)(F)F)(F)F)(F)F)(F)F)(F)F)(F)F,RXKWWEMRIZQMEI-UHFFFAOYSA-N,C11H9F13N3+,430.059,4.9,0,0
156600059,"4-Butyl-1-(3,3,4,4,5,5,6,6,6-nonafluorohexyl)-1,2,4-triazol-4-ium","InChI=1S/C12H15F9N3/c1-2-3-5-23-7-22-24(8-23)6-4-9(13,14)10(15,16)11(17,18)12(19,20)21/h7-8H,2-6H2,1H3/q+1",CCCC[N+]1=CN(N=C1)CCC(C(C(C(F)(F)F)(F)F)(F)F)(F)F,SQCRQABCVIBMBQ-UHFFFAOYSA-N,C12H15F9N3+,372.112,4.7,0,0
156600060,"Pentafluoro-(1,1,2,2,3,3,4,4-octafluoro-6-pyridazin-1-ium-1-ylhexyl)-lambda6-sulfane","InChI=1S/C10H8F13N2S/c11-7(12,3-6-25-5-2-1-4-24-25)8(13,14)9(15,16)10(17,18)26(19,20,21,22)23/h1-2,4-5H,3,6H2/q+1",C1=CC=[N+](N=C1)CCC(C(C(C(F)(F)S(F)(F)(F)(F)F)(F)F)(F)F)(F)F,SSXOGJZLONHPEH-UHFFFAOYSA-N,C10H8F13N2S+,435.02,7,0,0
156600063,"4-Heptyl-1-(3,3,3-trifluoropropyl)-1,2,4-triazol-4-ium","InChI=1S/C12H21F3N3/c1-2-3-4-5-6-8-17-10-16-18(11-17)9-7-12(13,14)15/h10-11H,2-9H2,1H3/q+1",CCCCCCC[N+]1=CN(N=C1)CCC(F)(F)F,TXTXNJHIGOSHJZ-UHFFFAOYSA-N,C12H21F3N3+,264.169,4.3,0,0
156600067,"Pentafluoro-[1,1,2,2-tetrafluoro-4-(1-propyl-1,2,4-triazol-4-ium-4-yl)butyl]-lambda6-sulfane","InChI=1S/C9H13F9N3S/c1-2-4-21-7-20(6-19-21)5-3-8(10,11)9(12,13)22(14,15,16,17)18/h6-7H,2-5H2,1H3/q+1",CCCN1C=[N+](C=N1)CCC(C(F)(F)S(F)(F)(F)(F)F)(F)F,ULVNFAQSXACVAJ-UHFFFAOYSA-N,C9H13F9N3S+,366.069,6.1,0,0
156600070,"4-Methyl-1-(3,3,3-trifluoropropyl)-1,2,4-triazol-4-ium","InChI=1S/C6H9F3N3/c1-11-4-10-12(5-11)3-2-6(7,8)9/h4-5H,2-3H2,1H3/q+1",C[N+]1=CN(N=C1)CCC(F)(F)F,VCQVEVBUVJAQLX-UHFFFAOYSA-N,C6H9F3N3+,180.075,1.5,0,0
156600071,"4-Heptyl-1-(3,3,4,4,5,5,6,6,6-nonafluorohexyl)-1,2,4-triazol-4-ium","InChI=1S/C15H21F9N3/c1-2-3-4-5-6-8-26-10-25-27(11-26)9-7-12(16,17)13(18,19)14(20,21)15(22,23)24/h10-11H,2-9H2,1H3/q+1",CCCCCCC[N+]1=CN(N=C1)CCC(C(C(C(F)(F)F)(F)F)(F)F)(F)F,WBKKHBIUSSRYCC-UHFFFAOYSA-N,C15H21F9N3+,414.159,6.4,0,0
156600072,"Pentafluoro-(1,1,2,2-tetrafluoro-6-pyridazin-1-ium-1-ylhexyl)-lambda6-sulfane","InChI=1S/C10H12F9N2S/c11-9(12,10(13,14)22(15,16,17,18)19)5-1-3-7-21-8-4-2-6-20-21/h2,4,6,8H,1,3,5,7H2/q+1",C1=CC=[N+](N=C1)CCCCC(C(F)(F)S(F)(F)(F)(F)F)(F)F,WLQPMYOVVVQZBV-UHFFFAOYSA-N,C10H12F9N2S+,363.058,6.4,0,0
156600082,"4-Pyridin-1-ium-4-yl-1-(3,3,4,4,5,5,6,6,7,7,8,8,8-tridecafluorooctyl)pyridin-1-ium","InChI=1S/C18H12F13N2/c19-13(20,5-10-33-8-3-12(4-9-33)11-1-6-32-7-2-11)14(21,22)15(23,24)16(25,26)17(27,28)18(29,30)31/h1-4,6-9H,5,10H2/q+1/p+1",C1=C[NH+]=CC=C1C2=CC=[N+](C=C2)CCC(C(C(C(C(C(F)(F)F)(F)F)(F)F)(F)F)(F)F)(F)F,YWWAGWXFPJDFDR-UHFFFAOYSA-O,C18H13F13N2+2,504.087,6.5,0,0
156600083,"1-Propyl-4-(3,3,3-trifluoropropyl)-1,2,4-triazol-4-ium","InChI=1S/C8H13F3N3/c1-2-4-14-7-13(6-12-14)5-3-8(9,10)11/h6-7H,2-5H2,1H3/q+1",CCCN1C=[N+](C=N1)CCC(F)(F)F,ZBBZQMKRFQTLDK-UHFFFAOYSA-N,C8H13F3N3+,208.106,2.4,0,0
156600088,"4-Butyl-1-(3,3,3-trifluoropropyl)-1,2,4-triazol-4-ium","InChI=1S/C9H15F3N3/c1-2-3-5-14-7-13-15(8-14)6-4-9(10,11)12/h7-8H,2-6H2,1H3/q+1",CCCC[N+]1=CN(N=C1)CCC(F)(F)F,ZNPVLQJPDRNCLA-UHFFFAOYSA-N,C9H15F3N3+,222.122,2.7,0,0
163184941,"[2-[(6S,11S,16R)-6-fluoro-11-hydroxy-10,13,16-trimethyl-3-oxo-1,2,6,7,8,9,11,12,14,15,16,17-dodecahydrocyclopenta[a]phenanthren-17-yl]-2-oxoethyl] acetate","InChI=1S/C24H33FO5/c1-12-7-16-15-9-18(25)17-8-14(27)5-6-23(17,3)22(15)19(28)10-24(16,4)21(12)20(29)11-30-13(2)26/h8,12,15-16,18-19,21-22,28H,5-7,9-11H2,1-4H3/t12-,15?,16?,18+,19+,21?,22?,23?,24?/m1/s1",C[C@@H]1CC2C3C[C@@H](C4=CC(=O)CCC4(C3[C@H](CC2(C1C(=O)COC(=O)C)C)O)C)F,JXJAJSNUTGVHEG-FABGEXBVSA-N,C24H33FO5,420.231,2.7,0,0
