DTXSID2044397
DTXSID30870511
DTXSID30870531
DTXSID5030030
DTXSID8062600
DTXSID7040150
DTXSID8059920
DTXSID3031864
DTXSID9041578
DTXSID8059970
DTXSID4059916
DTXSID6062599
DTXSID3031862
DTXSID1037303
DTXSID8031865
DTXSID6067331
DTXSID70880215
DTXSID90880131
DTXSID2045026
DTXSID70275965
DTXSID40881350
DTXSID80892506
DTXSID30891564
DTXSID6020802
DTXSID7024873
DTXSID1023869
DTXSID3060950
DTXSID1020142
DTXSID10214757
DTXSID6026799
DTXSID2066012
DTXSID3045067
DTXSID9020112
DTXSID6020147
DTXSID6027131
DTXSID50274037
DTXSID1038743
