DTXSID2025680
DTXSID1021952
DTXSID9022522
DTXSID2021781
DTXSID1021956
DTXSID0020606
DTXSID5020607
DTXSID4021391
DTXSID7020182
DTXSID7027625
DTXSID5024689
DTXSID7021780
DTXSID4022521
DTXSID7029249
DTXSID5027512
DTXSID5052173
DTXSID3020205
DTXSID0022016
DTXSID1025300
DTXSID4025082
DTXSID0027933
DTXSID5021411
DTXSID4027527
DTXSID9020376
DTXSID3021986
DTXSID2021284
DTXSID3020596
DTXSID8027036
DTXSID1027635
DTXSID7029241
DTXSID2026446
DTXSID9036690
DTXSID40861657
DTXSID5051442
DTXSID0026967
DTXSID70883105
DTXSID8026228
DTXSID5027982
DTXSID2021602
DTXSID6027921
DTXSID9026265
DTXSID0047533
DTXSID8020462
DTXSID0021414
DTXSID0021961
DTXSID3022455
DTXSID7025502
DTXSID1041847
DTXSID6020515
DTXSID8024236
DTXSID8052693
DTXSID2020216
DTXSID7026863
DTXSID6022422
DTXSID1024598
DTXSID1024627
DTXSID7025180
DTXSID4030047
DTXSID4020533
DTXSID6021828
DTXSID5021124
DTXSID8021519
DTXSID2022333
DTXSID9026261
DTXSID8020597
DTXSID9030048
DTXSID8020913
DTXSID3021437
DTXSID3030056
DTXSID4020161
DTXSID3052692
DTXSID7021863
DTXSID6021402
DTXSID1021827
DTXSID4020828
DTXSID2021286
DTXSID7037717
DTXSID6022056
DTXSID5031131
DTXSID3042219
DTXSID7021318
DTXSID7021360
DTXSID8020759
DTXSID4022529
DTXSID1020431
DTXSID2052732
DTXSID4022527
DTXSID6020430
DTXSID2020844
DTXSID2024161
DTXSID5023879
DTXSID1023940
DTXSID2024169
DTXSID2020925
DTXSID1049801
DTXSID4023886
DTXSID2023985
DTXSID1031040
DTXSID7035012
DTXSID4020240
DTXSID1027184
DTXSID7027205
DTXSID5020152
DTXSID5020023
DTXSID6020438
DTXSID6026797
DTXSID4020298
DTXSID3024366
DTXSID2021658
DTXSID6024127
DTXSID2020422
DTXSID3021857
DTXSID7020637
DTXSID6027183
DTXSID1020778
DTXSID1020306
DTXSID3039242
DTXSID5039224
DTXSID0020868
DTXSID1020437
DTXSID8021438
DTXSID0020448
DTXSID3021516
DTXSID1024172
DTXSID5026259
DTXSID90873927
