DTXSID9021390
DTXSID4020533
DTXSID5020576
DTXSID0020523
DTXSID1026164
DTXSID6037807
DTXSID5033836
DTXSID00864306
DTXSID9073125
DTXSID1037806
DTXSID8023846
DTXSID5020023
DTXSID2020684
DTXSID3020095
DTXSID9032329
DTXSID7020182
DTXSID3023922
DTXSID3022162
DTXSID9020247
DTXSID4024729
DTXSID1020770
DTXSID4020458
DTXSID1031040
DTXSID5037494
DTXSID0037495
DTXSID40869118
DTXSID9020407
DTXSID9023914
DTXSID9020453
DTXSID7020479
DTXSID0020446
DTXSID8032386
DTXSID4032611
DTXSID4034609
DTXSID3020627
DTXSID2032552
DTXSID8020628
DTXSID3024154
DTXSID5036761
DTXSID4020791
DTXSID2024169
DTXSID1022267
DTXSID3020833
DTXSID9024198
DTXSID1024207
DTXSID8024234
DTXSID7024241
DTXSID8022292
DTXSID4032459
DTXSID5024261
DTXSID1032482
DTXSID3032464
DTXSID4024274
DTXSID8022111
DTXSID4024276
DTXSID3021196
DTXSID7021948
DTXSID1021798
DTXSID9032113
DTXSID2022254
DTXSID2034962
DTXSID5024344
DTXSID1024174
DTXSID3021986
DTXSID6021402
DTXSID5021411
DTXSID8052481
DTXSID2040282
DTXSID4024642
DTXSID4024644
DTXSID3031151
DTXSID6021668
DTXSID3021562
DTXSID3024940
DTXSID4021509
DTXSID0020315
DTXSID00152114
DTXSID9021502
DTXSID70204235
DTXSID20213251
DTXSID60208040
DTXSID7021570
DTXSID4020743
DTXSID2021026
DTXSID2021028
DTXSID7021029
DTXSID6021032
DTXSID6021030
DTXSID8021062
DTXSID3073137
DTXSID7020637
DTXSID50867064
DTXSID2031083
DTXSID3074313
