PubChem_CID,Name,SMILES,InChIKey,Synonym,DTXSID
13101,6PPD,CC(C)CC(C)NC1=CC=C(C=C1)NC2=CC=CC=C2,ZZMVLMVFYMGSMY-UHFFFAOYSA-N,"N-(1,3-dimethylbutyl)-N'-phenyl-p-phenylenediamine",DTXSID9025114
154926030,6PPD-quinone,CC(C)CC(C)NC1=CC(=O)C(NC2=CC=CC=C2)=CC1(=O),UBMGKRIXKUIXFQ-UHFFFAOYSA-N,,
67215,Leucomalachite green,CN(C)C1=CC=C(C=C1)C(C2=CC=CC=C2)C3=CC=C(C=C3)N(C)C,WZKXBGJNNCGHIC-UHFFFAOYSA-N,,DTXSID7031531
11294,Malachite green,CN(C)C1=CC=C(C=C1)C(=C2C=CC(=[N+](C)C)C=C2)C3=CC=CC=C3.[Cl-],FDZZZRQASAIRJF-UHFFFAOYSA-M,,DTXSID1025512
11295,Malachite green cation,CN(C)C1=CC=C(C=C1)C(=C2C=CC(=[N+](C)C)C=C2)C3=CC=CC=C3,VFCNQNZNPKRXIT-UHFFFAOYSA-N,,DTXSID3043784
71091427,4-[[4-(Dimethylamino) phenyl]-phenylmethyl]-N-methylaniline,CNC1=CC=C(C=C1)C(C2=CC=CC=C2)C3=CC=C(C=C3)N(C)C,MCEWFWVFARJELO-UHFFFAOYSA-N,,
12421730,"4,4'-(Phenylmethylene)bis(N-methylaniline)",CNC1=CC=C(C=C1)C(C2=CC=CC=C2)C3=CC=C(C=C3)NC,OPQNVMBGRKGHPG-UHFFFAOYSA-N,,
19064224,4-(Methylamino)benzophenone,CNC1=CC=C(C=C1)C(=O)C2=CC=CC=C2,REYZVMWSJNEXKO-UHFFFAOYSA-N,,DTXSID00597743
74483,PFOS,C(C(C(C(C(F)(F)S(=O)(=O)O)(F)F)(F)F)(F)F)(C(C(C(F)(F)F)(F)F)(F)F)(F)F,YFSUTJLHUFNCNZ-UHFFFAOYSA-N,,DTXSID3031864
14571268,Perfluorooctanol,C(C(C(C(C(F)(F)F)(F)F)(F)F)(F)F)(C(C(C(O)(F)F)(F)F)(F)F)(F)F,UQDUPHDELLQMOV-UHFFFAOYSA-N,,DTXSID90561796
67634,Perfluorooctanoyl fluoride,C(=O)(C(C(C(C(C(C(C(F)(F)F)(F)F)(F)F)(F)F)(F)F)(F)F)(F)F)F,ZILWJLIFAGWGLE-UHFFFAOYSA-N,,DTXSID0059829
9554,PFOA,C(=O)(C(C(C(C(C(C(C(F)(F)F)(F)F)(F)F)(F)F)(F)F)(F)F)(F)F)O,SNGREZUHAYWORS-UHFFFAOYSA-N,,DTXSID8031865
22160290,Perfluoroheptanol,C(C(C(C(O)(F)F)(F)F)(F)F)(C(C(C(F)(F)F)(F)F)(F)F)(F)F,XCWMATKNFUWXCN-UHFFFAOYSA-N,,DTXSID70623043
67817,Perfluoroheptanoyl fluoride,C(=O)(C(C(C(C(C(C(F)(F)F)(F)F)(F)F)(F)F)(F)F)(F)F)F,XLIFBQWTSCGUEB-UHFFFAOYSA-N,,DTXSID4059918
67542,PFHxA,C(=O)(C(C(C(C(C(F)(F)F)(F)F)(F)F)(F)F)(F)F)O,PXUULQAPEKKVAH-UHFFFAOYSA-N,,DTXSID3031862
75921,PFPeA,C(=O)(C(C(C(C(F)(F)F)(F)F)(F)F)(F)F)O,CXZGQIAOTKWCDB-UHFFFAOYSA-N,,DTXSID6062599
9777,PFBA,C(=O)(C(C(C(F)(F)F)(F)F)(F)F)O,YPJUNDFVDDCYIH-UHFFFAOYSA-N,,DTXSID4059916
62356,PFPA,C(=O)(C(C(F)(F)F)(F)F)O,LRMSQVBRUNSOJL-UHFFFAOYSA-N,,DTXSID8059970
67734,PFHxS,C(C(C(C(F)(F)S(=O)(=O)O)(F)F)(F)F)(C(C(F)(F)F)(F)F)(F)F,QZHDEAJFRJCDMF-UHFFFAOYSA-N,,DTXSID7040150
67815,PFBS,C(C(C(F)(F)S(=O)(=O)O)(F)F)(C(F)(F)F)(F)F,JGTNAGYHADQMCM-UHFFFAOYSA-N,,DTXSID5030030
67818,PFHpA,C(=O)(C(C(C(C(C(C(F)(F)F)(F)F)(F)F)(F)F)(F)F)(F)F)O,ZWBAMYVPMDSJGQ-UHFFFAOYSA-N,,DTXSID1037303
280,Carbon dioxide,C(=O)=O,CURLTUGMZLYLDI-UHFFFAOYSA-N,,DTXSID4027028
962,Water,O,XLYOFNOQVPJJNP-UHFFFAOYSA-N,,DTXSID6026296
28179,Fluoride,[F-],KRHYYFGTRYWZRS-UHFFFAOYSA-M,,DTXSID9049617
1117,Sulphate,[O-]S(=O)(=O)[O-],QAOWNCQODCNURD-UHFFFAOYSA-L,,DTXSID3042425
23234364,Perfluorocyclooctane,C1(C(C(C(C(C(C(C1(F)F)(F)F)(F)F)(F)F)(F)F)(F)F)(F)F)(F)F,BCLLRNVMLZXSMM-UHFFFAOYSA-N,,
10132570,Perfluorocycloheptane,C1(C(C(C(C(C(C1(F)F)(F)F)(F)F)(F)F)(F)F)(F)F)(F)F,FNVLGCVAWPSVSK-UHFFFAOYSA-N,,DTXSID10436078
9640,Perfluorocyclohexane,C1(C(C(C(C(C1(F)F)(F)F)(F)F)(F)F)(F)F)(F)F,RKIMETXDACNTIE-UHFFFAOYSA-N,,DTXSID5075232
67828,Perfluorocyclopentane,C1(C(C(C(C1(F)F)(F)F)(F)F)(F)F)(F)F,PWMJXZJISGDARB-UHFFFAOYSA-N,,DTXSID10191039
8263,Perfluorocyclobutane,C1(C(C(C1(F)F)(F)F)(F)F)(F)F,BCCOBQSFUDVTJQ-UHFFFAOYSA-N,,DTXSID9041811
62479,Hexa(methoxymethyl)melamine,COCN(COC)C1=NC(=NC(=N1)N(COC)COC)N(COC)COC,BNCADMBVWNPPIZ-UHFFFAOYSA-N,hexamethoxymethylmelamine (HMMM),DTXSID9027520
18785363,Penta(methoxymethyl)melamine,COCN(COC)C1=NC(=NC(=N1)N(COC)COC)N(COC),LEVZZYOVVQKGOM-UHFFFAOYSA-N,PMMM ,DTXSID30596249
83757,HMMM TP377,COCN(COC)C1=NC(=NC(=N1)N(COC)COC)N(COC)CO,JQALNNOQTGZTJZ-UHFFFAOYSA-N,HMMM TP377,DTXSID90930024
156601178,HMMM TP375,COCN(COC)C1=NC(=NC(=N1)N(COC)COC)N(COC)C=O,UPFQVJAGBXCQOE-UHFFFAOYSA-N,HMMM TP375,
19596821,Tetra(methoxymethyl)melamine,COCN(COC)C1=NC(=NC(=N1)N(COC)COC)N,GDXYMSLKTXSGBS-UHFFFAOYSA-N,TetraMMM ,DTXSID30598925
20318181,HMMM TP363,COCN(COC)C1=NC(=NC(=N1)N(COC)COC)N(CO)CO,GSRBPSZSSSOAHJ-UHFFFAOYSA-N,HMMM TP363,
156601175,HMMM TP383,COCN(COC)C1=NC(=NC(=N1)N(COC)COC)N(C=O)CO,PRDOSDUGXKTFET-UHFFFAOYSA-N,HMMM TP383,
156601177,HMMM TP353,COCN(COC)C1=NC(=NC(=N1)N(COC)COC)N(C=O),TXFCZCYWLIIXLR-UHFFFAOYSA-N,HMMM TP353,
20067384,Tri(methoxymethyl)melamine,COCN(COC)C1=NC(=NC(=N1)N(COC))N,QRUPLLGJMSYASL-UHFFFAOYSA-N,TriMMM ,
20463987,HMMM TP311,COCN(COC)C1=NC(=NC(=N1)N(COC)CO)N,QMMGPJGNVGPLON-UHFFFAOYSA-N,HMMM TP311,
156601179,HMMM TP287,COCN(COC)C1=NC(=NC(=N1)N(COC)C=O)N,VASSCAPEVQZJKA-UHFFFAOYSA-N,HMMM TP287,
20484942,HMMM TP349,COCN(COC)C1=NC(=NC(=N1)N(COC)CO)N(CO)CO,JFPDYZRUBOUZEV-UHFFFAOYSA-N,HMMM TP349,
156601173,HMMM TP339,COCN(COC)C1=NC(=NC(=N1)N(C=O)CO)N(COC),DSPHGRWZRGBFBS-UHFFFAOYSA-N,HMMM TP339,
156601180,HMMM TP315,COCN(COC)C1=NC(=NC(=N1)N(C=O)C=O)N(COC),ZEDNIDNOYZSSMO-UHFFFAOYSA-N,HMMM TP315,
19596820,Bis(methoxymethyl)melamine,COCN(COC)C1=NC(=NC(=N1)N)N,ZZQSSGSSJLWADI-UHFFFAOYSA-N,DiMMM ,
53965793,HMMM TP245,COCN(COC)C1=NC(=NC(=N1)N(CO))N,JOCMJNZFQXOCOZ-UHFFFAOYSA-N,HMMM TP245,
156601176,HMMM TP243,COCN(COC)C1=NC(=NC(=N1)N(C=O))N,QJQMZQYWVWCKJV-UHFFFAOYSA-N,HMMM TP243,
156601174,HMMM TP325,COCN(COC)C1=NC(=NC(=N1)N(CO)CO)N(C=O),FEWJLIJJJNSFNR-UHFFFAOYSA-N,HMMM TP325,
77943,Methoxymethylmelamine,COCNC1=NC(=NC(=N1)N)N,KFVIYKFKUYBKTP-UHFFFAOYSA-N,MonoMMM ,DTXSID20962611
7955,Melamine,NC1=NC(=NC(=N1)N)N,JDSHMPZPIAZGSV-UHFFFAOYSA-N,Melamine ,DTXSID6020802
70300,"[(4,6-Diamino-1,3,5-triazin-2-yl)amino]methanol",OCNC1=NC(=NC(=N1)N)N,MBHRHUJRKGNOKX-UHFFFAOYSA-N,HMMM TP157,DTXSID30918200
25796,"N-(4,6-Diamino-1,3,5-triazin-2-yl)formamide",O=CNC1=NC(=NC(=N1)N)N,BPISYIZLDVUTAP-UHFFFAOYSA-N,HMMM TP155,DTXSID20157505
14550408,6:2 diPAP,C(COP(=O)(O)OCCC(C(C(C(C(C(F)(F)F)(F)F)(F)F)(F)F)(F)F)(F)F)C(C(C(C(C(C(F)(F)F)(F)F)(F)F)(F)F)(F)F)(F)F,ZDYYWMSLMLTXDM-UHFFFAOYSA-N,6:2 Fluorotelomer phosphate diester,DTXSID50561590
156620404,6:2 FTMAP,O=P1(O)OCC(CSCCC(F)(F)C(F)(F)C(F)(F)C(F)(F)C(F)(F)C(F)(F)F)(CO1)CSCCC(F)(F)C(F)(F)C(F)(F)C(F)(F)C(F)(F)C(F)(F)F,IPWHZYSPFHBGAW-UHFFFAOYSA-N,,
102352,diSAmPAP,OP(=O)(OCCN(CC)S(=O)(=O)C(F)(F)C(F)(F)C(F)(F)C(F)(F)C(F)(F)C(F)(F)C(F)(F)C(F)(F)F)OCCN(CC)S(=O)(=O)C(F)(F)C(F)(F)C(F)(F)C(F)(F)C(F)(F)C(F)(F)C(F)(F)C(F)(F)F,BZZAKKWGRKFWJJ-UHFFFAOYSA-N,Bis(2-{ethyl[(perfluorooctyl)sulfonyl]amino}ethyl) hydrogen phosphate,DTXSID2062747
18134,EtFOSAA,CCN(CC(=O)O)S(=O)(=O)C(C(C(C(C(C(C(C(F)(F)F)(F)F)(F)F)(F)F)(F)F)(F)F)(F)F)(F)F,CKRXVVGETMYFIO-UHFFFAOYSA-N,2-(N-Ethylperfluorooctanesulfonamido)acetic acid,DTXSID5062760
10507011,FOSAA,C(C(=O)O)NS(=O)(=O)C(C(C(C(C(C(C(C(F)(F)F)(F)F)(F)F)(F)F)(F)F)(F)F)(F)F)(F)F,AYLOUUCBACYHAB-UHFFFAOYSA-N,"N-[(1,1,2,2,3,3,4,4,5,5,6,6,7,7,8,8,8-Heptadecafluorooctyl)sulfonyl]glycine",DTXSID40440941
69785,FOSA,C(C(C(C(C(F)(F)S(=O)(=O)N)(F)F)(F)F)(F)F)(C(C(C(F)(F)F)(F)F)(F)F)(F)F,RRRXPPIDPYTNJG-UHFFFAOYSA-N,Perfluorooctanesulfonamide,DTXSID3038939
119688,6:2 FTSA,OS(=O)(=O)CCC(F)(F)C(F)(F)C(F)(F)C(F)(F)C(F)(F)C(F)(F)F,VIONGDJUYAYOPU-UHFFFAOYSA-N,6:2 Fluorotelomer sulfonic acid,DTXSID6067331
3022253,8:2 diPAPS,OP(=O)(OCCC(F)(F)C(F)(F)C(F)(F)C(F)(F)C(F)(F)C(F)(F)C(F)(F)C(F)(F)F)OCCC(F)(F)C(F)(F)C(F)(F)C(F)(F)C(F)(F)C(F)(F)C(F)(F)C(F)(F)F,AFWOYEYXUDHGHF-UHFFFAOYSA-N,8:2 Fluorotelomer phosphate diester,DTXSID90218051
10143739,8:2 monoPAPS,OP(O)(=O)OCCC(F)(F)C(F)(F)C(F)(F)C(F)(F)C(F)(F)C(F)(F)C(F)(F)C(F)(F)F,MIABSAQIFYEDJP-UHFFFAOYSA-N,8:2 Fluorotelomer phosphate monoester,DTXSID60874027
69619,8:2 FTOH,OCCC(F)(F)C(F)(F)C(F)(F)C(F)(F)C(F)(F)C(F)(F)C(F)(F)C(F)(F)F,JJUBFBTUBACDHW-UHFFFAOYSA-N,8:2 Fluorotelomer alcohol,DTXSID7029904
71750812,8:2 FTOH-Gluc,C(CO[C@H]1[C@@H]([C@H]([C@@H]([C@H](O1)C(=O)O)O)O)O)C(C(C(C(C(C(C(C(F)(F)F)(F)F)(F)F)(F)F)(F)F)(F)F)(F)F)(F)F,UZMXIMHOMUBIEV-UQGZVRACSA-N,8:2 Fluorotelomer alcohol glucuronide,DTXSID50858139
15936172,8:2 FTOH-Sulfate,C(COS(=O)(=O)O)C(C(C(C(C(C(C(C(F)(F)F)(F)F)(F)F)(F)F)(F)F)(F)F)(F)F)(F)F,UWHCRBKABHKUTC-UHFFFAOYSA-N,8:2 Fluorotelomer alcohol sulfate,DTXSID001034664
10095866,8:2 FTAL,C(C=O)C(C(C(C(C(C(C(C(F)(F)F)(F)F)(F)F)(F)F)(F)F)(F)F)(F)F)(F)F,KDGIOTBLYAPNRR-UHFFFAOYSA-N,8:2 Fluorotelomer aldehyde,DTXSID10895489
10994425,8:2 FTCA,C(C(=O)O)C(C(C(C(C(C(C(C(F)(F)F)(F)F)(F)F)(F)F)(F)F)(F)F)(F)F)(F)F,XTBXSCIWOVSSGB-UHFFFAOYSA-N,8:2 Fluorotelomer carboxylic acid,DTXSID50451109
67821,PFNA,C(=O)(C(C(C(C(C(C(C(C(F)(F)F)(F)F)(F)F)(F)F)(F)F)(F)F)(F)F)(F)F)O,UZUFPBIDKMEQEQ-UHFFFAOYSA-N,Perfluorononanoic acid,DTXSID8031863
20111612,(Z)-8:2 FTUAL,C(=C(/C(C(C(C(C(C(C(F)(F)F)(F)F)(F)F)(F)F)(F)F)(F)F)(F)F)\F)\C=O,LQERGGUGOIACQD-IWQZZHSRSA-N,(Z)-8:2 Fluorotelomer unsaturated aldehyde,DTXSID10895626
92017308,(E)-8:2 FTUAL,C(=C(\C(C(C(C(C(C(C(F)(F)F)(F)F)(F)F)(F)F)(F)F)(F)F)(F)F)/F)\C=O,LQERGGUGOIACQD-HNQUOIGGSA-N,(E)-8:2 Fluorotelomer unsaturated aldehyde,DTXSID80794091
11733192,(Z)-8:2 FTUCA,C(=C(/C(C(C(C(C(C(C(F)(F)F)(F)F)(F)F)(F)F)(F)F)(F)F)(F)F)\F)\C(=O)O,WHZXTVOEGZRRJM-UPHRSURJSA-N,(Z)-8:2 Fluorotelomer unsaturated carboxylic acid,DTXSID001019143
11282540,(E)-8:2 FTUCA,C(=C(\C(C(C(C(C(C(C(F)(F)F)(F)F)(F)F)(F)F)(F)F)(F)F)(F)F)/F)\C(=O)O,WHZXTVOEGZRRJM-OWOJBTEDSA-N,(E)-8:2 Fluorotelomer unsaturated carboxylic acid,
162393340,GS-(Z)-8:2 FTUAL,FC(F)(C(=C\C=O)\SCC(NC(=O)CCC(N)C(=O)O)C(=O)NCC(=O)O)C(F)(F)C(F)(F)C(F)(F)C(F)(F)C(F)(F)C(F)(F)F,OQCMXQJHGOIKKP-OQFOIZHKSA-N,(Z)-8:2 Fluorotelomer unsaturated aldehyde glutathione conjugate,
162393341,GS-(Z)-8:2 FTUCA,FC(F)(C(=C/C(=O)O)/SCC(NC(=O)CCC(N)C(=O)O)C(=O)NCC(=O)O)C(F)(F)C(F)(F)C(F)(F)C(F)(F)C(F)(F)C(F)(F)F,ZOYZDBBMBCZXPK-BAQGIRSFSA-N,(Z)-8:2 Fluorotelomer unsaturated carboxylic acid glutathione conjugate,
69537,6:2 FTOH,OCCC(F)(F)C(F)(F)C(F)(F)C(F)(F)C(F)(F)C(F)(F)F,GRJRKPMIRMSBNK-UHFFFAOYSA-N,6:2 Fluorotelomer alcohol,DTXSID5044572
91350838,6:2 FTOH-Sulfate,C(COS(=O)(=O)O)C(C(C(C(C(C(F)(F)F)(F)F)(F)F)(F)F)(F)F)(F)F,BGJBRLCWYHDOSY-UHFFFAOYSA-N,6:2 Fluorotelomer alcohol sulfate,DTXSID301023145
162396675,6:2 FTOH-Gluc,C(CO[C@H]1[C@@H]([C@H]([C@@H]([C@H](O1)C(=O)O)O)O)O)C(C(C(C(C(C(F)(F)F)(F)F)(F)F)(F)F)(F)F)(F)F,QGCRDEVAWUFVFN-UQGZVRACSA-N,6:2 Fluorotelomer alcohol glucuronide,
2776269,6:2 FTAL,C(C=O)C(C(C(C(C(C(F)(F)F)(F)F)(F)F)(F)F)(F)F)(F)F,WJSFZGPTEQNWCB-UHFFFAOYSA-N,6:2 Fluorotelomer aldehyde,DTXSID20895379
11783764,6:2 FTCA,C(C(=O)O)C(C(C(C(C(C(F)(F)F)(F)F)(F)F)(F)F)(F)F)(F)F,LRWIIEJPCFNNCZ-UHFFFAOYSA-N,6:2 Fluorotelomer carboxylic acid,DTXSID50472556
146171053,(Z)-6:2 FTUAL,C(=C(/C(C(C(C(C(F)(F)F)(F)F)(F)F)(F)F)(F)F)\F)\C=O,IRFCYNBOXLFPAS-IWQZZHSRSA-N,(Z)-6:2 Fluorotelomer unsaturated aldehyde,
162396673,(E)-6:2 FTUAL,C(=C(\C(C(C(C(C(F)(F)F)(F)F)(F)F)(F)F)(F)F)/F)\C=O,IRFCYNBOXLFPAS-HNQUOIGGSA-N,(E)-6:2 Fluorotelomer unsaturated aldehyde,
86290106,(Z)-6:2 FTUCA,C(=C(/C(C(C(C(C(F)(F)F)(F)F)(F)F)(F)F)(F)F)\F)\C(=O)O,BKOBFLVYTXYFQZ-UPHRSURJSA-N,(Z)-6:2 Fluorotelomer unsaturated carboxylic acid,DTXSID201036280
129411141,(E)-6:2 FTUCA,C(=C(\C(C(C(C(C(F)(F)F)(F)F)(F)F)(F)F)(F)F)/F)\C(=O)O,BKOBFLVYTXYFQZ-OWOJBTEDSA-N,(E)-6:2 Fluorotelomer unsaturated carboxylic acid,DTXSID30891463
74883,4:2 FTOH,OCCC(F)(F)C(F)(F)C(F)(F)C(F)(F)F,JCMNMOBHVPONLD-UHFFFAOYSA-N,4:2 Fluorotelomer alcohol,DTXSID1062122
162396679,4:2 FTOH-Sulfate,C(COS(=O)(=O)O)C(C(C(C(F)(F)F)(F)F)(F)F)(F)F,ZMKOLQPMWYJIKZ-UHFFFAOYSA-N,4:2 Fluorotelomer alcohol sulfate,DTXSID601034662
162396677,4:2 FTOH-Gluc,C(CO[C@H]1[C@@H]([C@H]([C@@H]([C@H](O1)C(=O)O)O)O)O)C(C(C(C(F)(F)F)(F)F)(F)F)(F)F,TYGAIOOXICPGHG-UQGZVRACSA-N,4:2 Fluorotelomer alcohol glucuronide,
10422795,4:2 FTAL,C(C=O)C(C(C(C(F)(F)F)(F)F)(F)F)(F)F,PLXBWBKXCKSJRL-UHFFFAOYSA-N,4:2 Fluorotelomer aldehyde,DTXSID80895239
15544178,4:2 FTCA,C(C(=O)O)C(C(C(C(F)(F)F)(F)F)(F)F)(F)F,PMNVMTIBUIRJHZ-UHFFFAOYSA-N,4:2 Fluorotelomer carboxylic acid,DTXSID401033501
162396670,(E)-4:2 FTUAL,C(=C(\C(C(C(F)(F)F)(F)F)(F)F)/F)\C=O,HFHWKEZNQKNBEL-HNQUOIGGSA-N,(E)-4:2 Fluorotelomer unsaturated aldehyde,
146171041,(Z)-4:2 FTUAL,C(=C(/C(C(C(F)(F)F)(F)F)(F)F)\F)\C=O,HFHWKEZNQKNBEL-IWQZZHSRSA-N,(Z)-4:2 Fluorotelomer unsaturated aldehyde,
87587204,(Z)-4:2 FTUCA,C(=C(/C(C(C(F)(F)F)(F)F)(F)F)\F)\C(=O)O,CMFAKTRZLATJOA-UPHRSURJSA-N,(Z)-4:2 Fluorotelomer unsaturated carboxylic acid,
162396669,(E)-4:2 FTUCA,C(=C(\C(C(C(F)(F)F)(F)F)(F)F)/F)\C(=O)O,CMFAKTRZLATJOA-OWOJBTEDSA-N,(E)-4:2 Fluorotelomer unsaturated carboxylic acid,
108644,2:2 FTOH,C(CO)C(C(F)(F)F)(F)F,JPMHUDBOKDBBLG-UHFFFAOYSA-N,2:2 Fluorotelomer alcohol,DTXSID6068985
162396676,2:2 FTOH-Sulfate,C(COS(=O)(=O)O)C(C(F)(F)F)(F)F,QXFRKSXYXQTUIP-UHFFFAOYSA-N,2:2 Fluorotelomer alcohol sulfate,DTXSID201034660
162396674,2:2 FTOH-Gluc,C(CO[C@H]1[C@@H]([C@H]([C@@H]([C@H](O1)C(=O)O)O)O)O)C(C(F)(F)F)(F)F,NFZAQCCKOVPTTE-UQGZVRACSA-N,2:2 Fluorotelomer alcohol glucuronide,
10374737,2:2 FTAL,C(C=O)C(C(F)(F)F)(F)F,UNBXLINXSUCFBI-UHFFFAOYSA-N,2:2 Fluorotelomer aldehyde,DTXSID601032654
11148047,2:2 FTCA,C(C(=O)O)C(C(F)(F)F)(F)F,UVLNQGHDUGHTGV-UHFFFAOYSA-N,2:2 Fluorotelomer carboxylic acid,DTXSID301032879
162396672,(Z)-2:2 FTUAL,C(=C(/C(F)(F)F)\F)\C=O,HSUJHGMYGPOOSW-IWQZZHSRSA-N,(Z)-2:2 Fluorotelomer unsaturated aldehyde,
162396671,(E)-2:2 FTUAL,C(=C(\C(F)(F)F)/F)\C=O,HSUJHGMYGPOOSW-HNQUOIGGSA-N,(E)-2:2 Fluorotelomer unsaturated aldehyde,
23116759,(Z)-2:2 FTUCA,C(=C(/C(F)(F)F)\F)\C(=O)O,WKAYWQKZZYEPTI-UPHRSURJSA-N,(Z)-2:2 Fluorotelomer unsaturated carboxylic acid,
162396678,(E)-2:2 FTUCA,C(=C(\C(F)(F)F)/F)\C(=O)O,WKAYWQKZZYEPTI-OWOJBTEDSA-N,(E)-2:2 Fluorotelomer unsaturated carboxylic acid,
6422,TFA,C(=O)(C(F)(F)F)O,DTQVDTLACAAQTR-UHFFFAOYSA-N,Trifluoroacetic acid,DTXSID9041578
12040286,"2,2,3,3,4,4,5,5,6,6,7,7,8,8,8-pentadecafluoro-N-(2-hydroxyethyl)octanamide",C(CO)NC(=O)C(C(C(C(C(C(C(F)(F)F)(F)F)(F)F)(F)F)(F)F)(F)F)(F)F,ZATOFJIVPAZTIE-UHFFFAOYSA-N,,
3021063,"N-(3-Aminopropyl)-2,2,3,3,4,4,5,5,6,6,7,7,8,8,8-pentadecafluorooctanamide",C(CN)CNC(=O)C(C(C(C(C(C(C(F)(F)F)(F)F)(F)F)(F)F)(F)F)(F)F)(F)F,YIQVOMZDSOSAQY-UHFFFAOYSA-N,,DTXSID30235262
71325636,"N-ethyl-2,2,3,3,4,4,5,5,6,6,7,7,8,8,8-pentadecafluorooctanamide",CCNC(=O)C(C(C(C(C(C(C(F)(F)F)(F)F)(F)F)(F)F)(F)F)(F)F)(F)F,XSXMZXBMPHWDLH-UHFFFAOYSA-N,,DTXSID10754941
54479698,"3-(1,1,2,2,3,3,4,4,5,5,6,6,7,7,8,8,8-heptadecafluorooctylsulfonylamino)propanoic acid",C(CNS(=O)(=O)C(C(C(C(C(C(C(C(F)(F)F)(F)F)(F)F)(F)F)(F)F)(F)F)(F)F)(F)F)C(=O)O,XODISSAMZUDOQA-UHFFFAOYSA-N,,
138394414,8:2 FtSOAoS,CC(C)(CS(=O)(=O)O)NC(=O)CCS(=O)CCC(C(C(C(C(C(C(C(F)(F)F)(F)F)(F)F)(F)F)(F)F)(F)F)(F)F)(F)F,XKGMPVQXAFQLEK-UHFFFAOYSA-N,,DTXSID60892605
15333596,"3-(3,3,4,4,5,5,6,6,7,7,8,8,8-tridecafluorooctylsulfanyl)propanoic acid",C(CSCCC(C(C(C(C(C(F)(F)F)(F)F)(F)F)(F)F)(F)F)(F)F)C(=O)O,XAZKWGLYRRMFFE-UHFFFAOYSA-N,FtTP,DTXSID40571648
139597752,4:2 FtSOAoS,CC(C)(CS(=O)(=O)O)NC(=O)CCS(=O)CCC(C(C(C(F)(F)F)(F)F)(F)F)(F)F,WVSBUXQVQMSEID-UHFFFAOYSA-N,,
71404795,8:2 FtUCA,C(=C(C(C(C(C(C(C(C(F)(F)F)(F)F)(F)F)(F)F)(F)F)(F)F)(F)F)F)C(=O)O,WHZXTVOEGZRRJM-UHFFFAOYSA-N,,DTXSID60825615
15579285,PFOAAmS,C[N+](C)(C)CCCNC(=O)C(C(C(C(C(C(C(F)(F)F)(F)F)(F)F)(F)F)(F)F)(F)F)(F)F,VJAUUPGCVZMKLX-UHFFFAOYSA-O,,DTXSID10892574
138394388,4:2 FtTAoS ion,CC(C)(CS(=O)(=O)[O-])NC(=O)CCSCCC(C(C(C(F)(F)F)(F)F)(F)F)(F)F,VIHJAWYQCFERKN-UHFFFAOYSA-M,,DTXSID40892527
67919,Perfluorooctanamide,C(=O)(C(C(C(C(C(C(C(F)(F)F)(F)F)(F)F)(F)F)(F)F)(F)F)(F)F)N,UGMUDSKJLAUMTC-UHFFFAOYSA-N,,DTXSID60195123
20734543,4:2 FtS ,C(CS(=O)(=O)O)C(C(C(C(F)(F)F)(F)F)(F)F)(F)F,TXGIGTRUEITPSC-UHFFFAOYSA-N,,DTXSID30891564
15579283,PFOAAm,CN(C)CCCNC(=O)C(C(C(C(C(C(C(F)(F)F)(F)F)(F)F)(F)F)(F)F)(F)F)(F)F,STMOMAISLIDGHH-UHFFFAOYSA-N,,DTXSID90892572
163201607,dehydroxy-demethylene-TFHFESE,[CH2]SC(C(OC(C(C(F)(F)F)(F)F)(F)F)F)(F)F,SQCDMAHMWJWARM-UHFFFAOYSA-N,,
138394570,"2-methyl-2-[3-(3,3,4,4,5,5,6,6,7,7,8,8,8-tridecafluorooctylsulfonyl)propanoylamino]propane-1-sulfonic acid",CC(C)(CS(=O)(=O)O)NC(=O)CCS(=O)(=O)CCC(C(C(C(C(C(F)(F)F)(F)F)(F)F)(F)F)(F)F)(F)F,RZBHYDQKJKDSNP-UHFFFAOYSA-N,FtSO2AoS,DTXSID90894132
163198788,"(Z)-1,2-difluoro-2-(hydroxymethylsulfanyl)ethenol",F/C(=C(/F)\SCO)/O,QNWCDOKEOSCYJA-NSCUHMNNSA-N,,
163201608,dehydroxy-TFHFESE,[CH2]CSC(C(OC(C(C(F)(F)F)(F)F)(F)F)F)(F)F,PUJWVXUDMXVDKW-UHFFFAOYSA-N,,
88708330,"1,1,2,2,3,3,4,4,5,5,6,6,7,7,8,8,8-heptadecafluoro-N-[3-(methylamino)propyl]octane-1-sulfonamide",CNCCCNS(=O)(=O)C(C(C(C(C(C(C(C(F)(F)F)(F)F)(F)F)(F)F)(F)F)(F)F)(F)F)(F)F,OKSQBKOGKKWDQV-UHFFFAOYSA-N,,
2759276,pentafluoroethanol,C(C(F)(F)F)(O)(F)F,NNZZMYIWZFZLHU-UHFFFAOYSA-N,,
83421,"N-[3-(dimethylamino)propyl]-1,1,2,2,3,3,4,4,5,5,6,6,7,7,8,8,8-heptadecafluorooctane-1-sulfonamide",CN(C)CCCNS(=O)(=O)C(C(C(C(C(C(C(C(F)(F)F)(F)F)(F)F)(F)F)(F)F)(F)F)(F)F)(F)F,MSJXTBMNRCTIDR-UHFFFAOYSA-N,,DTXSID9065443
139596029,4:2 FtSO2AoS,CC(C)(CS(=O)(=O)O)NC(=O)CCS(=O)(=O)CCC(C(C(C(F)(F)F)(F)F)(F)F)(F)F,MDGZRVCSTWUTMU-UHFFFAOYSA-N,,DTXSID101035908
121432785,TFHFESE,C(CSC(C(OC(C(C(F)(F)F)(F)F)(F)F)F)(F)F)O,LHDNIAQMOXWLLQ-UHFFFAOYSA-N,,
54022570,"2-(2,2,3,3,4,4,5,5,6,6,7,7,8,8,8-Pentadecafluorooctanoylamino)acetic acid",C(C(=O)O)NC(=O)C(C(C(C(C(C(C(F)(F)F)(F)F)(F)F)(F)F)(F)F)(F)F)(F)F,KZYDHGQYENTJQK-UHFFFAOYSA-N,,
15936166,8:2 FtTAoS,CC(C)(CS(=O)(=O)O)NC(=O)CCSCCC(C(C(C(C(C(C(C(F)(F)F)(F)F)(F)F)(F)F)(F)F)(F)F)(F)F)(F)F,JPUVFTMCVQSFAF-UHFFFAOYSA-N,,DTXSID30892334
20436299,"N-(3-aminopropyl)-1,1,2,2,3,3,4,4,5,5,6,6,7,7,8,8,8-heptadecafluorooctane-1-sulfonamide",C(CN)CNS(=O)(=O)C(C(C(C(C(C(C(C(F)(F)F)(F)F)(F)F)(F)F)(F)F)(F)F)(F)F)(F)F,IOOWGYMOCNYMST-UHFFFAOYSA-N,,
2783376,7:3 FtCA,C(CC(C(C(C(C(C(C(F)(F)F)(F)F)(F)F)(F)F)(F)F)(F)F)(F)F)C(=O)O,HLBRGVKRZQSQHB-UHFFFAOYSA-N,,DTXSID90382620
84097,"3-(1,1,2,2,3,3,4,4,5,5,6,6,7,7,8,8,8-heptadecafluorooctylsulfonylamino)propyl-trimethylazanium",C[N+](C)(C)CCCNS(=O)(=O)C(C(C(C(C(C(C(C(F)(F)F)(F)F)(F)F)(F)F)(F)F)(F)F)(F)F)(F)F,FGTDPZOJJFPWCB-UHFFFAOYSA-N,,DTXSID10859667
101895126,"1,1,2,2,3,3,4,4,5,5,6,6,7,7,8,8,8-heptadecafluoro-N-(2-oxoethyl)octane-1-sulfonamide",C(C=O)NS(=O)(=O)C(C(C(C(C(C(C(C(F)(F)F)(F)F)(F)F)(F)F)(F)F)(F)F)(F)F)(F)F,DTKWOQZHQQMDSO-UHFFFAOYSA-N,,
138395016,"3-(3,3,4,4,5,5,6,6,7,7,8,8,8-tridecafluorooctylsulfinyl)propanoic acid",C(CS(=O)CCC(C(C(C(C(C(F)(F)F)(F)F)(F)F)(F)F)(F)F)(F)F)C(=O)O,DSUSHOGHCDVRGM-UHFFFAOYSA-N,FtSOPA,DTXSID30894131
57257889,"2-methyl-2-[3-(3,3,4,4,5,5,6,6,7,7,8,8,8-tridecafluorooctylsulfanyl)propanoylamino]propane-1-sulfonic acid",CC(C)(CS(=O)(=O)O)NC(=O)CCSCCC(C(C(C(C(C(F)(F)F)(F)F)(F)F)(F)F)(F)F)(F)F,DKVATWZCDNHYCW-UHFFFAOYSA-N,FtTAoS,DTXSID90892330
139594731,"3-(3,3,4,4,5,5,6,6,7,7,8,8,8-tridecafluorooctylsulfonyl)propanoic acid",C(CS(=O)(=O)CCC(C(C(C(C(C(F)(F)F)(F)F)(F)F)(F)F)(F)F)(F)F)C(=O)O,DJIXHYAJLARCOP-UHFFFAOYSA-N,FtSO2PA,DTXSID501035900
139594692,8:2 FtSO2AoS,CC(C)(CS(=O)(=O)O)NC(=O)CCS(=O)(=O)CCC(C(C(C(C(C(C(C(F)(F)F)(F)F)(F)F)(F)F)(F)F)(F)F)(F)F)(F)F,DEONGGUSFBJEHM-UHFFFAOYSA-N,,DTXSID801035911
53722673,"2,2,3,3,4,4,5,5,6,6,7,7,8,8,8-pentadecafluoro-N-[3-(methylamino)propyl]octanamide",CNCCCNC(=O)C(C(C(C(C(C(C(F)(F)F)(F)F)(F)F)(F)F)(F)F)(F)F)(F)F,CIHUQYRKXMQLDI-UHFFFAOYSA-N,,
77797,"N-ethyl-1,1,2,2,3,3,4,4,5,5,6,6,7,7,8,8,8-heptadecafluorooctane-1-sulfonamide",CCNS(=O)(=O)C(C(C(C(C(C(C(C(F)(F)F)(F)F)(F)F)(F)F)(F)F)(F)F)(F)F)(F)F,CCEKAJIANROZEO-UHFFFAOYSA-N,,DTXSID1032646
85976247,"3,4,4,5,5,6,6,7,7,8,8,8-Dodecafluorooct-2-enoic acid",C(=C(C(C(C(C(C(F)(F)F)(F)F)(F)F)(F)F)(F)F)F)C(=O)O,BKOBFLVYTXYFQZ-UHFFFAOYSA-N,,DTXSID00892326
14496522,"1,1,2,2,3,3,4,4,5,5,6,6,7,7,8,8,8-heptadecafluoro-N-(2-hydroxyethyl)octane-1-sulfonamide",C(CO)NS(=O)(=O)C(C(C(C(C(C(C(C(F)(F)F)(F)F)(F)F)(F)F)(F)F)(F)F)(F)F)(F)F,AZJIYAIYELWMPL-UHFFFAOYSA-N,,DTXSID80892329
138394405,"2-methyl-2-[3-(3,3,4,4,5,5,6,6,7,7,8,8,8-tridecafluorooctylsulfinyl)propanoylamino]propane-1-sulfonic acid",CC(C)(CS(=O)(=O)O)NC(=O)CCS(=O)CCC(C(C(C(C(C(F)(F)F)(F)F)(F)F)(F)F)(F)F)(F)F,AQNDOJSDPBVJMJ-UHFFFAOYSA-N,FtSOAoS,DTXSID90892592
3016044,8:2 FtS,C(CS(=O)(=O)O)C(C(C(C(C(C(C(C(F)(F)F)(F)F)(F)F)(F)F)(F)F)(F)F)(F)F)(F)F,ALVYVCQIFHTIRD-UHFFFAOYSA-N,,DTXSID00192353
14632790,5:3 FTCA,C(CC(C(C(C(C(F)(F)F)(F)F)(F)F)(F)F)(F)F)C(=O)O,ABFCFCPCGMHSRX-UHFFFAOYSA-N,5:3 FtCA,DTXSID20874028
163198785,"N-(3-Aminopropyl)-2,2,3,3,4,4,5,5,6,6,7,7,8,8,8-pentadecafluorooctanamide",O=CCCNC(=O)C(C(C(C(C(C(C(F)(F)F)(F)F)(F)F)(F)F)(F)F)(F)F)(F)F,KOYKTJBGTDDHHT-UHFFFAOYSA-N,,
163198790,"2,2,3,3,4,4,5,5,6,6,7,7,8,8,8-pentadecafluoro-N-(2-hydroxyethyl)octanamide",O=CCNC(=O)C(C(C(C(C(C(C(F)(F)F)(F)F)(F)F)(F)F)(F)F)(F)F)(F)F,VCWMBPUCYNETON-UHFFFAOYSA-N,,
163198791,"3-(2,2,3,3,4,4,5,5,6,6,7,7,8,8,8-Pentadecafluorooctanoylamino)propanoic acid",O=C(O)CCNC(=O)C(C(C(C(C(C(C(F)(F)F)(F)F)(F)F)(F)F)(F)F)(F)F)(F)F,WIPMNTYSSRXAND-UHFFFAOYSA-N,,
163198784,"1,1,2,2,3,3,4,4,5,5,6,6,7,7,8,8,8-heptadecafluoro-N-(3-oxopropyl)octane-1-sulfonamide",C(C=O)CNS(=O)(=O)C(C(C(C(C(C(C(C(F)(F)F)(F)F)(F)F)(F)F)(F)F)(F)F)(F)F)(F)F,HMCSAZUDQOWRDW-UHFFFAOYSA-N,,
163408226,"1,1,1,5,5,5-Hexafluoro-4-hydroxy-3-oxo-2,4-bis(trifluoromethyl)pentan-2-olate",C(=O)(C(C(F)(F)F)(C(F)(F)F)[O-])C(C(F)(F)F)(C(F)(F)F)O,NQERWJOAWSKYKJ-UHFFFAOYSA-N,,
163408223,"4-[1,1,1,4,5,5,5-Heptafluoro-3-(1,1,1,2,3,3,3-heptafluoropropan-2-yl)-4-(trifluoromethyl)pent-2-en-2-yl]oxy-2-hydroperoxybenzenesulfonate",O=S([O-])(=O)c1ccc(cc1OO)O/C(=C(/C(F)(C(F)(F)F)C(F)(F)F)C(F)(C(F)(F)F)C(F)(F)F)C(F)(F)F,MJNHTLSHQQMWTD-UHFFFAOYSA-M,,
163408237,"4-[3,4,4,4-Tetrafluoro-2-(1,1,1,2,3,3,3-heptafluoropropan-2-yl)-1-hydroxy-3-(trifluoromethyl)but-1-enoxy]benzenesulfonate",O=S([O-])(=O)c1ccc(OC(/O)=C(/C(F)(C(F)(F)F)C(F)(F)F)C(F)(C(F)(F)F)C(F)(F)F)cc1,RECRNGWKCQHIMZ-UHFFFAOYSA-M,,
163408265,"4-[1,1,1,4,5,5,5-Heptafluoro-3-(1,1,1,2,3,3,3-heptafluoropropan-2-yl)-4-(trifluoromethyl)pent-2-en-2-yl]oxy-3-hydroperoxybenzenesulfonate",O=S([O-])(=O)c1cc(OO)c(O/C(=C(/C(F)(C(F)(F)F)C(F)(F)F)C(F)(C(F)(F)F)C(F)(F)F)C(F)(F)F)cc1,ZWMNIZJCWLACKU-UHFFFAOYSA-M,,
163408215,"4-[3-[Difluoro(hydroxy)methyl]-3,4,4,4-tetrafluoro-2-(1,1,1,2,3,3,3-heptafluoropropan-2-yl)-2-hydroxybutanoyl]oxybenzenesulfonate",O=S([O-])(=O)c1ccc(OC(=O)C(O)(C(F)(C(F)(F)F)C(F)(F)F)C(F)(C(F)(F)F)C(F)(F)O)cc1,KJOOPPPSVDEWRH-UHFFFAOYSA-M,,
163408267,"4-[1,1,1,4,5,5,5-Heptafluoro-3-(1,1,1,2,3,3,3-heptafluoropropan-2-yl)-4-(trifluoromethyl)pent-2-en-2-yl]oxy-5-oxocyclohexa-1,3-diene-1-sulfonate",O=C1CC(=CC=C1O\C(=C(\C(F)(C(F)(F)F)C(F)(F)F)C(F)(C(F)(F)F)C(F)(F)F)C(F)(F)F)S([O-])(=O)=O,ZYZGALCOFODUFO-UHFFFAOYSA-M,,
163408195,"4-[4,4-Bis(1,1,1,2,3,3,3-heptafluoropropan-2-yl)-3-hydroxydioxetan-3-yl]oxybenzenesulfonate",OC1(Oc2ccc(cc2)S([O-])(=O)=O)OOC1(C(F)(C(F)(F)F)C(F)(F)F)C(F)(C(F)(F)F)C(F)(F)F,DQSZWKOBCCNSDY-UHFFFAOYSA-M,,
163408262,"4-[1,1,1,4,5,5,5-Heptafluoro-3-(1,1,1,2,3,3,3-heptafluoropropan-2-yl)-2,3-dihydroxy-4-(trifluoromethyl)pentan-2-yl]oxy-2-hydroxybenzenesulfonate",Oc1cc(ccc1S(=O)([O-])=O)OC(O)(C(O)(C(F)(C(F)(F)F)C(F)(F)F)C(F)(C(F)(F)F)C(F)(F)F)C(F)(F)F,ZDPZOLZKTVLQIZ-UHFFFAOYSA-M,,
163408257,"4-[1,1,1,5,5,5-Hexafluoro-3-(1,1,1,3,3,3-hexafluoro-2-hydroxypropan-2-yl)-4-hydroxy-4-(trifluoromethyl)pent-2-en-2-yl]oxy-2-hydroxybenzenesulfonate",Oc1cc(ccc1S(=O)([O-])=O)O/C(=C(/C(O)(C(F)(F)F)C(F)(F)F)C(O)(C(F)(F)F)C(F)(F)F)C(F)(F)F,VQPUEHPJJALVKX-UHFFFAOYSA-M,,
163408229,"4-[1,1,1,5,5,5-Hexafluoro-3-(1,1,1,3,3,3-hexafluoro-2-hydroxypropan-2-yl)-4-hydroxy-4-(trifluoromethyl)pent-2-en-2-yl]oxy-3-hydroxybenzenesulfonate",O=S([O-])(=O)c1cc(O)c(O/C(=C(/C(O)(C(F)(F)F)C(F)(F)F)C(O)(C(F)(F)F)C(F)(F)F)C(F)(F)F)cc1,OIIGVPHPJMRHCB-UHFFFAOYSA-M,,
163408227,"[1,1,1,5,5,5-Hexafluoro-3-(1,1,1,3,3,3-hexafluoro-2-hydroxypropan-2-yl)-4-hydroxy-4-(trifluoromethyl)pent-2-en-2-yl] carbonate",O=C([O-])O\C(=C(/C(O)(C(F)(F)F)C(F)(F)F)C(O)(C(F)(F)F)C(F)(F)F)C(F)(F)F,OCHPDPULPJVESI-UHFFFAOYSA-M,,
163408260,"4-[1,1,1,5,5,5-Hexafluoro-3-(1,1,1,3,3,3-hexafluoro-2-hydroxypropan-2-yl)-4-hydroxy-4-(trifluoromethyl)pent-2-en-2-yl]oxybenzenesulfonate",O=S([O-])(=O)c1ccc(O/C(=C(/C(O)(C(F)(F)F)C(F)(F)F)C(O)(C(F)(F)F)C(F)(F)F)C(F)(F)F)cc1,YPNAJOLGHADAFU-UHFFFAOYSA-M,,
163408219,"4-[1,1,1,4,5,5,5-Heptafluoro-3-(1,1,1,2,3,3,3-heptafluoropropan-2-yl)-4-(trifluoromethyl)pent-2-en-2-yl]oxy-3-hydroxybenzenesulfonate",O=S([O-])(=O)c1cc(O)c(O/C(=C(/C(F)(C(F)(F)F)C(F)(F)F)C(F)(C(F)(F)F)C(F)(F)F)C(F)(F)F)cc1,KNLGHLQRMPJMAL-UHFFFAOYSA-M,,
163408239,"4-[1,1,1,4,5,5,5-Heptafluoro-3-(1,1,1,2,3,3,3-heptafluoropropan-2-yl)-4-(trifluoromethyl)pent-2-en-2-yl]oxy-2-hydroxybenzenesulfonate",O=S([O-])(=O)c1ccc(cc1O)O/C(=C(/C(F)(C(F)(F)F)C(F)(F)F)C(F)(C(F)(F)F)C(F)(F)F)C(F)(F)F,RJPWWQOSLHTLBN-UHFFFAOYSA-M,,
163408209,"4-[1,1,1,4,5,5,5-Heptafluoro-3-(1,1,1,2,3,3,3-heptafluoropropan-2-yl)-4-(trifluoromethyl)pent-2-en-2-yl]oxy-6-oxocyclohexa-1,3-diene-1-sulfonate",O=S([O-])(=O)C1=CC=C(O/C(=C(/C(F)(C(F)(F)F)C(F)(F)F)C(F)(C(F)(F)F)C(F)(F)F)C(F)(F)F)CC1=O,JWHLEGSEINNPFA-UHFFFAOYSA-M,,
163408199,"4-[1,1,1,4,5,5,5-Heptafluoro-3-(1,1,1,2,3,3,3-heptafluoropropan-2-yl)-2,3-dihydroxy-4-(trifluoromethyl)pentan-2-yl]oxy-3-hydroxybenzenesulfonate",[O-]S(=O)(=O)c1cc(O)c(OC(O)(C(O)(C(F)(C(F)(F)F)C(F)(F)F)C(F)(C(F)(F)F)C(F)(F)F)C(F)(F)F)cc1,HSUCVUMMOWEIDO-UHFFFAOYSA-M,,
163408231,"4-[3,3-Bis(1,1,1,2,3,3,3-heptafluoropropan-2-yl)-2-hydroxyoxiran-2-yl]oxy-3-hydroxybenzenesulfonate",FC(F)(F)C(F)(C1(OC1(O)Oc1ccc(cc1O)S(=O)(=O)[O-])C(F)(C(F)(F)F)C(F)(F)F)C(F)(F)F,OMHCXJVKIYEYKY-UHFFFAOYSA-M,,
163408217,"1,1,1,5,5,5-Hexafluoro-3,3,4-trihydroxy-2,4-bis(trifluoromethyl)pentan-2-olate",FC(F)(F)C(O)(C(O)(O)C([O-])(C(F)(F)F)C(F)(F)F)C(F)(F)F,KLILKMJOEDUCQL-UHFFFAOYSA-N,,
163408192,"(2,2,2-Trifluoro-1-hydroxyethyl) carbonate",FC(F)(F)C(O)OC(=O)[O-],CHSVLBAGSYHIQD-UHFFFAOYSA-M,,
163408208,"3,3,3-Trifluoro-2-hydroxy-2-(trifluoromethyl)propan-1-olate",FC(F)(F)C(O)(C[O-])C(F)(F)F,JVYKDAIZTBWEJT-UHFFFAOYSA-N,,
163408244,"1,1,1,4,5,5,5-Heptafluoro-3-(1,1,1,2,3,3,3-heptafluoropropan-2-yl)-4-(trifluoromethyl)pent-2-en-2-olate",FC(F)(F)C(F)(/C(=C(/[O-])\C(F)(F)F)/C(F)(C(F)(F)F)C(F)(F)F)C(F)(F)F,SDVYANXQEWXRTA-UHFFFAOYSA-M,,
163408264,"1,1,1,2,4,5,5,5-Octafluoro-2,4-bis(trifluoromethyl)pentan-3-olate",FC(F)(F)C(F)(C([O-])C(F)(C(F)(F)F)C(F)(F)F)C(F)(F)F,ZFPOWMOLBJOCSX-UHFFFAOYSA-N,,
163408190,"4-(2,2,2-Trifluoroethoxy)benzenesulfonate",O=S(=O)([O-])c1ccc(OCC(F)(F)F)cc1,CGBZVWQAEVAMAH-UHFFFAOYSA-M,,
163408221,"4-Carboxyoxy-2,3,5,6-tetrahydroxybenzenesulfonate",Oc1c(O)c(OC(=O)O)c(O)c(O)c1S(=O)(=O)[O-],KUUUAHOAIMQSJB-UHFFFAOYSA-M,,
163408253,"4-Carboxyoxy-2-hydroperoxy-3,5,6-trihydroxybenzenesulfonate",O=S(=O)([O-])c1c(O)c(O)c(OC(=O)O)c(O)c1OO,UPVGUMACLZFNHJ-UHFFFAOYSA-M,,
163408255,"4-Carboxyoxy-3-hydroperoxy-2,5,6-trihydroxybenzenesulfonate",Oc1c(OO)c(OC(=O)O)c(O)c(O)c1S(=O)(=O)[O-],VDDMOKOMIADFKA-UHFFFAOYSA-M,,
163408246,"(2,3,6-Trihydroxyphenyl) hydrogen carbonate",OC(=O)Oc1c(O)c(O)ccc1O,SLLKGOCZACATGP-UHFFFAOYSA-N,,
163408225,"(2,3,4,6-Tetrahydroxyphenyl) hydrogen carbonate",OC(=O)Oc1c(O)c(O)c(O)cc1O,MPPWMCBIWQGKGQ-UHFFFAOYSA-N,,
163408204,"(2,3,4,5,6-Pentahydroxyphenyl) hydrogen carbonate",OC(=O)Oc1c(O)c(O)c(O)c(O)c1O,IMFNAFFYABOJDO-UHFFFAOYSA-N,,
163408203,"2,3,4,5,6-Pentahydroxybenzenesulfonic acid",Oc1c(O)c(O)c(O)c(O)c1S(=O)(=O)O,IEPQCSLNUZCJRF-UHFFFAOYSA-N,,
101755896,"4-[1,1,1,4,5,5,5-heptafluoro-3-(1,1,1,2,3,3,3-heptafluoropropan-2-yl)-4-(trifluoromethyl)pent-2-en-2-yl]oxybenzenesulfonate",C1=CC(=CC=C1OC(=C(C(C(F)(F)F)(C(F)(F)F)F)C(C(F)(F)F)(C(F)(F)F)F)C(F)(F)F)S(=O)(=O)[O-],QGTOYUMAYUVGTO-UHFFFAOYSA-M,,
53945206,"(2,6-dihydroxyphenyl) hydrogen carbonate",C1=CC(=C(C(=C1)O)OC(=O)O)O,JAPFWXFJJPJNKH-UHFFFAOYSA-N,,
51401841,"1,1,1,3,3,3-hexafluoro-2-hydroxypropan-2-olate",C(C(F)(F)F)(C(F)(F)F)(O)[O-],GGDYXYSALGVDSV-UHFFFAOYSA-N,,
23183370,"2,3,3,3-tetrafluoro-2-(trifluoromethyl)propanoate",C(=O)(C(C(F)(F)F)(C(F)(F)F)F)[O-],YJDMCDWHXOSSHI-UHFFFAOYSA-M,,
18612373,(4-sulfophenyl) carbonate,O=S([O-])(=O)c1ccc(OC(=O)O)cc1,RDJHUDQNEKGTSS-UHFFFAOYSA-M,,
13269093,(2-hydroxyphenyl) hydrogen carbonate,C1=CC=C(C(=C1)O)OC(=O)O,PCCSWTQMTKSYSH-UHFFFAOYSA-N,,
7145365,"3,3,3-trifluoro-2-hydroxy-2-(trifluoromethyl)propanoate",FC(F)(F)C(O)(C([O-])=O)C(F)(F)F,CMQUGOHGJUTDGZ-UHFFFAOYSA-M,,
3010347,4-hydroxybenzenesulfonate,C1=CC(=CC=C1O)S(=O)(=O)[O-],FEPBITJSIHRMRT-UHFFFAOYSA-M,,
588355,"benzene-1,2,3,4-tetrol",C1=CC(=C(C(=C1O)O)O)O,VERMEZLHWFHDLK-UHFFFAOYSA-N,,
316180,"benzene-1,2,3,4,5-pentol",C1=C(C(=C(C(=C1O)O)O)O)O,RUFWIGMRKSSQJC-UHFFFAOYSA-N,,
84468,"2,2,2-trifluoroacetate",C(=O)(C(F)(F)F)[O-],DTQVDTLACAAQTR-UHFFFAOYSA-M,,
69102,"benzene-1,2,3,4,5,6-hexol",C1(=C(C(=C(C(=C1O)O)O)O)O)O,VWPUAXALDFFXJW-UHFFFAOYSA-N,,
1057,"benzene-1,2,3-triol",C1=CC(=C(C(=C1)O)O)O,WQGWDDDVZFFDIG-UHFFFAOYSA-N,,
996,phenol,C1=CC=C(C=C1)O,ISWSIDIOOBJBQZ-UHFFFAOYSA-N,,
289,"benzene-1,2-diol",C1=CC=C(C(=C1)O)O,YCIMNLLNPGFGHC-UHFFFAOYSA-N,,
163408207,"2-Chloro-1,1,2,3,3,3-hexafluoropropan-1-olate",FC(F)(F)C(Cl)(F)C(F)(F)[O-],JJSRGBOLRWIRAS-UHFFFAOYSA-N,,
163408213,"1-(2-Chloro-1,1,2,3,3,3-hexafluoropropoxy)-1,1,2,3,3,3-hexafluoropropan-2-olate",FC(F)(OC(F)(F)C([O-])(F)C(F)(F)F)C(Cl)(F)C(F)(F)F,KFKPJXNBTDJTIH-UHFFFAOYSA-N,,
163408194,"1-[1-(2-Chloro-1,1,2,3,3,3-hexafluoropropoxy)-1,1,2,3,3,3-hexafluoropropan-2-yl]oxy-1,1,2,3,3,3-hexafluoropropan-2-olate",FC(F)(OC(F)(F)C(Cl)(F)C(F)(F)F)C(F)(OC(F)(F)C(F)([O-])C(F)(F)F)C(F)(F)F,CZEYBDGAZVKJKJ-UHFFFAOYSA-N,,
163408211,"1-(2-Chloro-1,1,2,3,3,3-hexafluoropropoxy)-1,2,2,2-tetrafluoroethanolate",FC(F)(OC(F)([O-])C(F)(F)F)C(Cl)(F)C(F)(F)F,KFKKVGCHZDSKAF-UHFFFAOYSA-N,,
163408247,"1-[1-(2-Chloro-1,1,2,3,3,3-hexafluoropropoxy)-1,2,2,2-tetrafluoroethoxy]-1,1,2,3,3,3-hexafluoropropan-2-olate",FC(OC(F)(F)C(Cl)(F)C(F)(F)F)(OC(F)(F)C(F)([O-])C(F)(F)F)C(F)(F)F,STQZSJCPQPDJFF-UHFFFAOYSA-N,,
163408242,"1-[1-(2-Chloro-1,1,2,3,3,3-hexafluoropropoxy)-1,2,2,2-tetrafluoroethoxy]-1,2,2,2-tetrafluoroethanolate",FC(OC(F)(F)C(Cl)(F)C(F)(F)F)(OC([O-])(F)C(F)(F)F)C(F)(F)F,SBQCOQAHYJIUKJ-UHFFFAOYSA-N,,
163408241,"1-[1-[1-(2-Chloro-1,1,2,3,3,3-hexafluoropropoxy)-1,1,2,3,3,3-hexafluoropropan-2-yl]oxy-1,1,2,3,3,3-hexafluoropropan-2-yl]oxy-1,1,2,3,3,3-hexafluoropropan-2-olate",FC(F)(OC(F)(F)C(Cl)(F)C(F)(F)F)C(F)(OC(F)(F)C(F)(OC(F)(F)C(F)([O-])C(F)(F)F)C(F)(F)F)C(F)(F)F,RSBHTONXJQJJBF-UHFFFAOYSA-N,,
163408197,"2-Chloro-1-[1-(difluoromethoxy)-1,2,2,2-tetrafluoroethoxy]-1,1,2,3,3,3-hexafluoropropane",FC(OC(F)(F)C(Cl)(F)C(F)(F)F)(O[C-](F)F)C(F)(F)F,HRSOGCIQYROFKC-UHFFFAOYSA-N,,
163408205,"1-[1-[1-(2-Chloro-1,1,2,3,3,3-hexafluoropropoxy)-1,2,2,2-tetrafluoroethoxy]-1,2,2,2-tetrafluoroethoxy]-1,2,2,2-tetrafluoroethanolate",FC(F)(OC(F)(OC(F)(OC([O-])(F)C(F)(F)F)C(F)(F)F)C(F)(F)F)C(Cl)(F)C(F)(F)F,IMIJRXYLVVSTPX-UHFFFAOYSA-N,,
163408249,"1-[1-[1-[1-(2-Chloro-1,1,2,3,3,3-hexafluoropropoxy)-1,2,2,2-tetrafluoroethoxy]-1,2,2,2-tetrafluoroethoxy]-1,2,2,2-tetrafluoroethoxy]-1,2,2,2-tetrafluoroethanolate",FC(F)(OC(F)(OC(F)(OC(F)(OC(F)([O-])C(F)(F)F)C(F)(F)F)C(F)(F)F)C(F)(F)F)C(Cl)(F)C(F)(F)F,UCZAGBRPXHHMJE-UHFFFAOYSA-N,,
163408251,"1-[1-(2-Chloro-1,1,2,3,3,3-hexafluoropropoxy)-1,1,2,3,3,3-hexafluoropropan-2-yl]oxy-1,2,2,2-tetrafluoroethanolate",FC(F)(OC(F)(F)C(Cl)(F)C(F)(F)F)C(F)(OC(F)([O-])C(F)(F)F)C(F)(F)F,UMGSLTBDYFIFGH-UHFFFAOYSA-N,,
163408201,"1-[1-[1-(2-Chloro-1,1,2,3,3,3-hexafluoropropoxy)-1,1,2,3,3,3-hexafluoropropan-2-yl]oxy-1,2,2,2-tetrafluoroethoxy]-1,1,2,3,3,3-hexafluoropropan-2-olate",FC(OC(F)(C(F)(F)F)C(F)(F)OC(F)(F)C(Cl)(F)C(F)(F)F)(OC(F)(F)C(F)([O-])C(F)(F)F)C(F)(F)F,ICTDYAXHOHINRN-UHFFFAOYSA-N,,
163408233,"1-[1-[1-(2-Chloro-1,1,2,3,3,3-hexafluoropropoxy)-1,2,2,2-tetrafluoroethoxy]-1,2,2,2-tetrafluoroethoxy]-1,1,2,3,3,3-hexafluoropropan-2-olate",FC(F)(OC(F)(OC(F)(OC(F)(F)C(F)([O-])C(F)(F)F)C(F)(F)F)C(F)(F)F)C(Cl)(F)C(F)(F)F,PTKXRHPTTUXXMY-UHFFFAOYSA-N,,
102331873,"2-[1-[1-(2-chloro-1,1,2,3,3,3-hexafluoropropoxy)-1,1,2,3,3,3-hexafluoropropan-2-yl]oxy-1,1,2,3,3,3-hexafluoropropan-2-yl]oxy-2,2-difluoroacetic acid",C(=O)(C(OC(C(OC(C(OC(C(C(F)(F)F)(F)Cl)(F)F)(F)F)(C(F)(F)F)F)(F)F)(C(F)(F)F)F)(F)F)O,JGRBOYAJYKVCOB-UHFFFAOYSA-N,,
163325054,Chloro-perfluoro dimethyl triether undecanoic acid,FC(OC(F)(F)C(Cl)(F)C(F)(F)F)(OC(F)(F)C(F)(OC(F)(F)C(=O)O)C(F)(F)F)C(F)(F)F,GEXXADHKKGBLLH-UHFFFAOYSA-N,,
163325055,Chloro-perfluoro dimethyl triether decanoic acid,FC(F)(OC(F)(OC(F)(OC(F)(F)C(Cl)(F)C(F)(F)F)C(F)(F)F)C(F)(F)F)C(=O)O,APCMCTBTFIFLHC-UHFFFAOYSA-N,,
102331880,"2-[1-(2-chloro-1,1,2,3,3,3-hexafluoropropoxy)-1,1,2,3,3,3-hexafluoropropan-2-yl]oxy-2,2-difluoroacetic acid",C(=O)(C(OC(C(OC(C(C(F)(F)F)(F)Cl)(F)F)(F)F)(C(F)(F)F)F)(F)F)O,JZLICTXOXFCCDU-UHFFFAOYSA-N,,
102331878,"2-[1-[1-[1-(2-chloro-1,1,2,3,3,3-hexafluoropropoxy)-1,1,2,3,3,3-hexafluoropropan-2-yl]oxy-1,1,2,3,3,3-hexafluoropropan-2-yl]oxy-1,1,2,3,3,3-hexafluoropropan-2-yl]oxy-2,2-difluoroacetic acid",C(=O)(C(OC(C(OC(C(OC(C(OC(C(C(F)(F)F)(F)Cl)(F)F)(F)F)(C(F)(F)F)F)(F)F)(C(F)(F)F)F)(F)F)(C(F)(F)F)F)(F)F)O,VWBHFMHYSNPDBL-UHFFFAOYSA-N,,
163325038,Chloro-perfluoro tetramethyl pentaether tetradecanoic acid,FC(F)(OC(F)(OC(F)(OC(F)(OC(F)(OC(F)(F)C(=O)O)C(F)(F)F)C(F)(F)F)C(F)(F)F)C(F)(F)F)C(Cl)(F)C(F)(F)F,NWHFHIOCZRMXSU-UHFFFAOYSA-N,,
163408235,Chloro-perfluoro trimethyl tetraether tetradecanoic acid,FC(OC(F)(C(F)(F)F)C(F)(F)OC(F)(F)C(Cl)(F)C(F)(F)F)(OC(F)(F)C(F)(OC(F)(F)C(=O)O)C(F)(F)F)C(F)(F)F,PUXLFZBNOPSOLP-UHFFFAOYSA-N,,
163325034,Chloro-perfluoro trimethyl tetraether tridecanoic acid,FC(F)(OC(F)(OC(F)(OC(F)(F)C(F)(OC(F)(F)C(=O)O)C(F)(F)F)C(F)(F)F)C(F)(F)F)C(Cl)(F)C(F)(F)F,KOCZMHDAWFCDQS-UHFFFAOYSA-N,,
163325037,Chloro-perfluoro trimethyl tetraether dodecanoic acid,FC(F)(OC(F)(OC(F)(OC(F)(OC(F)(F)C(Cl)(F)C(F)(F)F)C(F)(F)F)C(F)(F)F)C(F)(F)F)C(=O)O,HVFQTAZFUIOKCW-UHFFFAOYSA-N,,
163408214,"3,3,4,4,5,5,6,6,7,7,8,8,8-tridecafluoro-N-[3-[hydroxymethyl(methyl)amino]propyl]octane-1-sulfonamide",FC(F)(F)C(F)(F)C(F)(F)C(F)(F)C(F)(F)C(F)(F)CCS(=O)(=O)NCCCN(C)CO,KGQBAPGQJSLZSK-UHFFFAOYSA-N,,
163408259,"3,3,4,4,5,5,6,6,7,7,8,8,8-tridecafluoro-N-(3-hydroxypropyl)octane-1-sulfonamide",OCCCNS(=O)(=O)CCC(F)(F)C(F)(F)C(F)(F)C(F)(F)C(F)(F)C(F)(F)F,WCTIWFIWSNWSMQ-UHFFFAOYSA-N,,
102598504,6:2 fluorotelomer sulfonamido propyl methyl amine,CNCCCNS(=O)(=O)CCC(C(C(C(C(C(F)(F)F)(F)F)(F)F)(F)F)(F)F)(F)F,ATVLXKVTLCASLQ-UHFFFAOYSA-N,"3,3,4,4,5,5,6,6,7,7,8,8,8-tridecafluoro-N-[3-(methylamino)propyl]octane-1-sulfonamide",DTXSID001034707
49869204,6:2 fluorotelomer sulfonamido propyl amine,C(CN)CNS(=O)(=O)CCC(C(C(C(C(C(F)(F)F)(F)F)(F)F)(F)F)(F)F)(F)F,DLNFICFQUIYVBX-UHFFFAOYSA-N,"N-(3-aminopropyl)-3,3,4,4,5,5,6,6,7,7,8,8,8-tridecafluorooctane-1-sulfonamide",DTXSID101034724
11669093,6:2 FTSAm,C(CS(=O)(=O)N)C(C(C(C(C(C(F)(F)F)(F)F)(F)F)(F)F)(F)F)(F)F,SQAFCSVGKMMETM-UHFFFAOYSA-N,"3,3,4,4,5,5,6,6,7,7,8,8,8-tridecafluorooctane-1-sulfonamide",DTXSID30895724
163324818,6:2 Fluorotelomer sulfonamido propionaldehyde,C(CNS(=O)(=O)CCC(C(C(C(C(C(F)(F)F)(F)F)(F)F)(F)F)(F)F)(F)F)C=O,JOZNZKNHTRLKIW-UHFFFAOYSA-N,"3,3,4,4,5,5,6,6,7,7,8,8,8-tridecafluoro-N-(3-oxopropyl)octane-1-sulfonamide",
163324817,"3-(3,3,4,4,5,5,6,6,7,7,8,8,8-Tridecafluorooctylsulfonylamino)propanoic acid",C(CNS(=O)(=O)CCC(C(C(C(C(C(F)(F)F)(F)F)(F)F)(F)F)(F)F)(F)F)C(=O)O,PFQMXWGWLBXTCF-UHFFFAOYSA-N,"3-(3,3,4,4,5,5,6,6,7,7,8,8,8-tridecafluorooctylsulfonylamino)propanoic acid",
20734544,6:2 FTSA ion,C(CS(=O)(=O)[O-])C(C(C(C(C(C(F)(F)F)(F)F)(F)F)(F)F)(F)F)(F)F,VIONGDJUYAYOPU-UHFFFAOYSA-M,"3,3,4,4,5,5,6,6,7,7,8,8,8-tridecafluorooctane-1-sulfonate",DTXSID40873417
85649173,6:2 FTUAL,C(=C(C(C(C(C(C(F)(F)F)(F)F)(F)F)(F)F)(F)F)F)C=O,IRFCYNBOXLFPAS-UHFFFAOYSA-N,"3,4,4,5,5,6,6,7,7,8,8,8-dodecafluorooct-2-enal",DTXSID40895533
4086645,PFHpA ion,C(=O)(C(C(C(C(C(C(F)(F)F)(F)F)(F)F)(F)F)(F)F)(F)F)[O-],ZWBAMYVPMDSJGQ-UHFFFAOYSA-M,"2,2,3,3,4,4,5,5,6,6,7,7,7-tridecafluoroheptanoate",DTXSID60892483
15859812,5:2 ketone,CC(=O)C(C(C(C(C(F)(F)F)(F)F)(F)F)(F)F)(F)F,HWGNOHFZECDUBX-UHFFFAOYSA-N,"3,3,4,4,5,5,6,6,7,7,7-undecafluoroheptan-2-one",DTXSID00578936
18994450,5:2 sFTOH,CC(C(C(C(C(C(F)(F)F)(F)F)(F)F)(F)F)(F)F)O,QOYNEVFKTZVANM-UHFFFAOYSA-N,"3,3,4,4,5,5,6,6,7,7,7-undecafluoroheptan-2-ol",DTXSID80597206
22182348,PFHxA ion,C(=O)(C(C(C(C(C(F)(F)F)(F)F)(F)F)(F)F)(F)F)[O-],PXUULQAPEKKVAH-UHFFFAOYSA-M,"2,2,3,3,4,4,5,5,6,6,6-undecafluorohexanoate",DTXSID20892484
5111819,PFPeA ion,C(=O)(C(C(C(C(F)(F)F)(F)F)(F)F)(F)F)[O-],CXZGQIAOTKWCDB-UHFFFAOYSA-M,"2,2,3,3,4,4,5,5,5-nonafluoropentanoate",DTXSID00892487
101567675,5:3 FTUCA,C(=C/C(C(C(C(C(F)(F)F)(F)F)(F)F)(F)F)(F)F)\C(=O)O,UGMLUHQLUFIGNF-OWOJBTEDSA-N,"(E)-4,4,5,5,6,6,7,7,8,8,8-undecafluorooct-2-enoic acid",DTXSID401026580
4342798,PFBA ion,C(=O)(C(C(C(F)(F)F)(F)F)(F)F)[O-],YPJUNDFVDDCYIH-UHFFFAOYSA-M,"2,2,3,3,4,4,4-heptafluorobutanoate",DTXSID80892480
89927646,6:2 FTAA,CN(C)CCCNS(=O)(=O)CCC(C(C(C(C(C(F)(F)F)(F)F)(F)F)(F)F)(F)F)(F)F,TZIPMEZQXPAKPK-UHFFFAOYSA-N,"N-[3-(dimethylamino)propyl]-3,3,4,4,5,5,6,6,7,7,8,8,8-tridecafluorooctane-1-sulfonamide",DTXSID30880433
173976,"3-Amino-N,N,N-trimethyl-1-propanaminium",C[N+](C)(C)CCCN,PTTKEPPCFIOMEC-UHFFFAOYSA-N,,
166001338,(Z)-dehydroxy-demethylene-dehydrofluoro-TFHFESE,[CH2]S/C(=C(/OC(C(C(F)(F)F)(F)F)(F)F)\F)/F,KRXBVVQHPXKQNV-NSCUHMNNSA-N,,
1983,Acetaminophen,CC(=O)Nc1ccc(O)cc1,RZVAJINKPMORJF-UHFFFAOYSA-N,,
39763,Acetimidoquinone,CC(=O)N=C1C=CC(=O)C=C1,URNSECGXFRDEDC-UHFFFAOYSA-N,,
77579,4-acetamido-2-chlorophenol,CC(=O)NC1=CC(=C(C=C1)O)Cl,JULKJDRBSRRBHT-UHFFFAOYSA-N,,
130451,"Acetaminophen TP mz 301, RT 3.50",Oc1ccc(cc1c1cc(NC(C)=O)ccc1O)NC(C)=O,PHJCCQZHFLRCAA-UHFFFAOYSA-N,,
163339065,"Acetaminophen TP mz 301, RT 4.17",CC(=O)NC1=CC=C(C=C1)OC2=C(C=CC(=C2)NC(=O)C)O,XGACQADXFCSLEB-UHFFFAOYSA-N,,
166174208,"Acetaminophen TP mz 450, RT 4.80",Oc1c(cc(cc1Oc1ccc(NC(C)=O)cc1)NC(C)=O)Oc1ccc(NC(C)=O)cc1,MDCDDGWQBIHADH-UHFFFAOYSA-N,,
166174213,"Acetaminophen TP mz 450, RT 3.91",Oc1c(cc(cc1c1cc(NC(C)=O)ccc1O)NC(C)=O)c1cc(NC(C)=O)ccc1O,YPYHANKVQVSZAK-UHFFFAOYSA-N,,
166174201,"Acetaminophen TP mz 450, RT 4.25",CC(=O)Nc3cc(c2cc(cc(Oc1cc(NC(C)=O)ccc1O)c2O)NC(C)=O)c(O)cc3,CNFVGOLWYZMLJH-UHFFFAOYSA-N,,
166174203,"Acetaminophen TP mz 599, RT 4.50",CC(=O)Nc1cc(c(O)cc1)c1cc(NC(C)=O)cc(c2cc(cc(Oc3ccc(NC(C)=O)cc3)c2O)NC(C)=O)c1O,DAIQBPXSVPPFOA-UHFFFAOYSA-N,,
166174211,"Acetaminophen TP mz 335, RT 4.34",Oc1c(cc(cc1Cl)NC(C)=O)c1cc(NC(C)=O)ccc1O,UGUVYJGAOQLCRZ-UHFFFAOYSA-N,,
166174210,"Acetaminophen TP mz 369, RT 4.81",Oc1c(cc(cc1Cl)NC(C)=O)c1cc(NC(C)=O)cc(Cl)c1O,PIYNAUYVMJGRPP-UHFFFAOYSA-N,,
166174205,"Acetaminophen TP mz 484, RT 4.50",Oc1c(cc(cc1Cl)NC(C)=O)c1cc(NC(C)=O)cc(c2cc(NC(C)=O)ccc2O)c1O,FBKOEXHEBKYWAY-UHFFFAOYSA-N,,
166174206,"Acetaminophen TP mz 337, RT 4.85 a",Clc1cc(ccc1Oc1cc(NC(C)=O)ccc1O)NC(C)=O,ITBKYRQFFMFTAS-UHFFFAOYSA-N,,
166174207,"Acetaminophen TP mz 337, RT 4.85 b",Clc1cc(ccc1NC(C)=O)Oc1cc(NC(C)=O)ccc1O,JYJYUYGFHKRXJS-UHFFFAOYSA-N,,
166174212,"Acetaminophen TP mz 486, RT 4.84 a",Clc1cc(ccc1Oc1cc(NC(C)=O)cc(c2cc(NC(C)=O)ccc2O)c1O)NC(C)=O,XVCUFNQXBWSZDN-UHFFFAOYSA-N,,
166174200,"Acetaminophen TP mz 486, RT 4.84 b",Clc1cc(ccc1NC(C)=O)Oc1cc(NC(C)=O)cc(c2cc(NC(C)=O)ccc2O)c1O,CFNGOXKFBVZFDW-UHFFFAOYSA-N,,
166174204,"Acetaminophen TP mz 518, RT 5.10",Oc1c(cc(cc1Cl)NC(C)=O)c1cc(NC(C)=O)cc(c2cc(NC(C)=O)cc(Cl)c2O)c1O,DRKIXHMLSAXVLI-UHFFFAOYSA-N,,
166174209,"Acetaminophen TP mz 486, RT 5.02 a",Clc1cc(ccc1Oc1cc(NC(C)=O)cc(Oc2ccc(NC(C)=O)cc2)c1O)NC(C)=O,OUXVUYWXBURFDY-UHFFFAOYSA-N,,
166174202,"Acetaminophen TP mz 486, RT 5.02 b",Clc1cc(ccc1NC(C)=O)Oc1cc(NC(C)=O)cc(Oc2ccc(NC(C)=O)cc2)c1O,CTTGLUOHXUDYPX-UHFFFAOYSA-N,,
135828,Acetaminophen radical a,CC(=O)NC1=CC=C([O])C=C1,SXODILNMSPEPBT-UHFFFAOYSA-N,,
166174054,4-acetamido-2-chlorophenol radical b,CC(=O)NC1=C[CH]C(=O)C(Cl)=C1,RFJHRKGNDBOXEV-UHFFFAOYSA-N,,
166637318,(hydroxy-tert-butyl)-irgarol,C(O)C(C)(C)NC1=NC(=NC(=N1)NC2CC2)SC,HFCMSBLJLJOGGL-UHFFFAOYSA-N,,
91590,Irgarol,CC(C)(C)NC1=NC(=NC(=N1)NC2CC2)SC,HDHLIWCXDDZUFH-UHFFFAOYSA-N,,
57709734,4:2 FtTAoS,CC(C)(CS(=O)(=O)O)NC(=O)CCSCCC(C(C(C(F)(F)F)(F)F)(F)F)(F)F,VIHJAWYQCFERKN-UHFFFAOYSA-N,,DTXSID00892528
91497,Galaxolide,CC1COCC2=CC3=C(C=C12)C(C(C3(C)C)C)(C)C,ONKNPOPIGWHAQC-UHFFFAOYSA-N,,
69131857,Galaxolidone,CC1COC(=O)C2=CC3=C(C=C12)C(C(C3(C)C)C)(C)C,PGMHPYRIXBRRQD-UHFFFAOYSA-N,,
134206366,H-PFOS,O=S(C(F)([H])C(F)(F)C(F)(F)C(F)(F)C(F)(F)C(F)(F)C(F)(F)C(F)(F)F)(O)=O,AUKDNQZDSZEYCA-UHFFFAOYSA-N,,
168509887,Hydroxy-6:2/6:2 diPAP,OC(COP(O)(=O)OCCC(F)(F)C(F)(F)C(F)(F)C(F)(F)C(F)(F)C(F)(F)F)C(F)(F)C(F)(F)C(F)(F)C(F)(F)C(F)(F)C(F)(F)F,JDGHPNPIEDPULE-UHFFFAOYSA-N,,
168509892,6:2/6:2 FTMAP sulfoxide,FC(F)(F)C(F)(F)C(F)(F)C(F)(F)C(F)(F)C(F)(F)CCSCC1(CS(=O)CCC(F)(F)C(F)(F)C(F)(F)C(F)(F)C(F)(F)C(F)(F)F)COP(O)(=O)OC1,OYSUYMRFKUUMHB-UHFFFAOYSA-N,,
168509895,6:2 monoFTMAP sulfone,FC(F)(F)C(F)(F)C(F)(F)C(F)(F)C(F)(F)C(F)(F)CCS(=O)(=O)CC1(C)COP(O)(=O)OC1,QYPJSMXYWIRMLJ-UHFFFAOYSA-N,,
168509884,6:2 monoFTMAP sulfoxide,FC(F)(F)C(F)(F)C(F)(F)C(F)(F)C(F)(F)C(F)(F)CCS(=O)CC1(C)COP(O)(=O)OC1,IJTWKOFJLPDPRP-UHFFFAOYSA-N,,
168509893,6:2/6:2 FTMAP sulfoxide-sulfone,FC(F)(F)C(F)(F)C(F)(F)C(F)(F)C(F)(F)C(F)(F)CCS(=O)(=O)CC1(CS(=O)CCC(F)(F)C(F)(F)C(F)(F)C(F)(F)C(F)(F)C(F)(F)F)COP(O)(=O)OC1,PCHTZKWWBMTNMQ-UHFFFAOYSA-N,,
168509882,6:2/6:2 FTMAP sulfone,FC(F)(F)C(F)(F)C(F)(F)C(F)(F)C(F)(F)C(F)(F)CCS(=O)(=O)CC1(CSCCC(F)(F)C(F)(F)C(F)(F)C(F)(F)C(F)(F)C(F)(F)F)COP(O)(=O)OC1,HDAAYYKYMTUWKT-UHFFFAOYSA-N,,
139596679,SF5-PFSA,C(C(C(C(C(F)(F)S(F)(F)(F)(F)F)(F)F)(F)F)(F)F)(C(C(C(F)(F)S(=O)(=O)O)(F)F)(F)F)(F)F,PTFLVXXNVSLTOC-UHFFFAOYSA-N,,DTXSID301031788
168509879,U-PFSA,C(=C(C(C(F)(F)S(=O)(=O)O)(F)F)F)(C(C(C(C(F)(F)F)(F)F)(F)F)(F)F)F,BMIHYCXJXROAAO-UHFFFAOYSA-N,,
168509890,U-SF5-PFSA,C(=C(/F)\S(=O)(=O)O)(/C(C(C(C(C(C(C(F)(F)S(F)(F)(F)(F)F)(F)F)(F)F)(F)F)(F)F)(F)F)(F)F)\F,NLRUMJOYPPRIFY-UPHRSURJSA-N,,
168509881,Ether-PFSA,O=S(C(F)(F)C(F)(F)C(F)(F)C(OC(F)(F)F)(F)C(F)(F)C(F)(F)C(F)(F)C(F)(F)F)(O)=O,FRDXFFRWOXXDQG-UHFFFAOYSA-N,,
168509894,di-U-PFSA,C(=C(\C(C(C(C(C(C(F)(F)F)(F)F)(F)F)(F)F)(F)F)(F)F)/F)(/C(=C(/C(C(C(C(F)(F)S(=O)(=O)O)(F)F)(F)F)(F)F)\F)/F)\F,PIDRVQMVXCHCSF-ZPUQHVIOSA-N,,
168509899,U-Ether-SF5,C(=C(/F)\OC(C(C(F)(F)S(=O)(=O)O)(F)F)(F)F)(/C(C(C(C(F)(F)S(F)(F)(F)(F)F)(F)F)(F)F)(F)F)\F,ZFMFOUYKSHPZMG-UPHRSURJSA-N,,
19027325,H2-PFOS,O=S(C([H])([H])C(F)(F)C(F)(F)C(F)(F)C(F)(F)C(F)(F)C(F)(F)C(F)(F)F)(O)=O,FSVJFJWJQWUNCW-UHFFFAOYSA-N,,DTXSID301033691
168509883,H-U-PFOS,O=S(/C([H])=C(F)/C(F)(F)C(F)(F)C(F)(F)C(F)(F)C(F)(F)C(F)(F)F)(O)=O,HUYNMWRJZUQGBR-UPHRSURJSA-N,,
15564880,Cl-PFOS,C(C(C(C(C(F)(F)S(=O)(=O)O)(F)F)(F)F)(F)F)(C(C(C(Cl)(F)F)(F)F)(F)F)(F)F,TXNZTTQBKZRWQR-UHFFFAOYSA-N,,DTXSID30892935
168509891,H3-U-PFOS,O=S(C([H])([H])C(F)([H])C(F)(F)C(F)(F)/C(F)=C(F)/C(F)(F)C(F)(F)F)(O)=O,NOYUOSMINGYRLW-ONEGZZNKSA-N,,
168509885,H2-U-PFOS,O=S(C([H])(F)C(F)(F)C([H])(F)C(F)(F)/C(F)=C(F)/C(F)(F)C(F)(F)F)(O)=O,IKMVRXDXSWPVNW-OWOJBTEDSA-N,,
168509889,H-di-unsaturated-PFOS,O=S(C(F)(F)C(F)(F)C(F)([H])/C(F)=C(F)/C(F)=C(F)/C(F)(F)F)(O)=O,LNGRXZMPSVBCIP-NRNIAZNESA-N,,
168509886,PFSA-SF5-Ether,C(C(C(C(C(F)(F)S(=O)(=O)O)(F)F)(F)F)(F)F)(C(C(C(F)(F)OS(F)(F)(F)(F)F)(F)F)(F)F)(F)F,JANYWYLVAKINMO-UHFFFAOYSA-N,,
168509880,di-U-Ether-PFSA,O=S(C(F)(F)C(F)(F)C(F)(F)C(F)(F)/C(F)=C(F)/C(F)=C(F)/C(F)(C(F)(F)C(F)(OC(F)(F)F)F)F)(O)=O,DYGCZPZHGNZFFN-ZPUQHVIOSA-N,,
168509897,U-Ether-PFSA,C(=C(/F)\OC(F)(F)F)(/C(C(C(C(C(C(F)(F)S(=O)(=O)O)(F)F)(F)F)(F)F)(F)F)(F)F)\F,VIRCPDKGBHOIBS-UPHRSURJSA-N,,
168509888,Ether-PFCA,C(=O)(C(C(C(C(C(C(C(C(C(C(C(C(C(C(F)(F)F)(F)F)(F)F)(F)F)(F)F)(F)F)(F)OC(F)(F)F)(F)F)(F)F)(F)F)(F)F)(F)F)(F)F)(F)F)O,KIJBPVGSTXPUKE-UHFFFAOYSA-N,,
168509896,Hydroxy-6:2/8:2 diPAP,C(COP(=O)(O)OCC(C(C(C(C(C(C(F)(F)F)(F)F)(F)F)(F)F)(F)F)(F)F)O)C(C(C(C(C(C(C(C(F)(F)F)(F)F)(F)F)(F)F)(F)F)(F)F)(F)F)(F)F,TVWJSBMPGCPQEB-UHFFFAOYSA-N,,
168509900,6:2/8:2 FTMAP sulfoxide,C(CSCC1(COP(=O)(O)OC1)CS(=O)CCC(C(C(C(C(C(C(C(F)(F)F)(F)F)(F)F)(F)F)(F)F)(F)F)(F)F)(F)F)C(C(C(C(C(C(F)(F)F)(F)F)(F)F)(F)F)(F)F)(F)F,ZMTKQHCUHUPFKT-UHFFFAOYSA-N,,
168509898,6:2/8:2 FTMAP disulfoxide/sulfone,C(CS(=O)CC1(COP(=O)(O)OC1)CS(=O)CCC(C(C(C(C(C(F)(F)F)(F)F)(F)F)(F)F)(F)F)(F)F)C(C(C(C(C(C(C(C(F)(F)F)(F)F)(F)F)(F)F)(F)F)(F)F)(F)F)(F)F,WJUIIURMQNYLKB-UHFFFAOYSA-N,,
441300,abacavir,C1CC1NC2=C3C(=NC(=N2)N)N(C=N3)[C@@H]4C[C@@H](C=C4)CO,MCGSCOLBFJQGHM-SCZZXKLOSA-N,,
135398513,acyclovir,C1=NC2=C(N1COCCO)N=C(NC2=O)N,MKUXAQIIEYXACX-UHFFFAOYSA-N,,
33613,amoxicillin,CC1([C@@H](N2[C@H](S1)[C@@H](C2=O)NC(=O)[C@@H](C3=CC=C(C=C3)O)N)C(=O)O)C,LSQZJLSUYDQPKJ-NJBDSQKTSA-N,,
447043,azithromycin,CC[C@@H]1[C@@]([C@@H]([C@H](N(C[C@@H](C[C@@]([C@@H]([C@H]([C@@H]([C@H](C(=O)O1)C)O[C@H]2C[C@@]([C@H]([C@@H](O2)C)O)(C)OC)C)O[C@H]3[C@@H]([C@H](C[C@H](O3)C)N(C)C)O)(C)O)C)C)C)O)(C)O,MQTOSJVFKKJCRP-BICOPXKESA-N,,
54675777,chlortetracycline,C[C@@]1([C@H]2C[C@H]3[C@@H](C(=O)C(=C([C@]3(C(=O)C2=C(C4=C(C=CC(=C41)Cl)O)O)O)O)C(=O)N)N(C)C)O,DHPRQBPJLMKORJ-XRNKAMNCSA-N,,
84029,clarithromycin,CC[C@@H]1[C@@]([C@@H]([C@H](C(=O)[C@@H](C[C@@]([C@@H]([C@H]([C@@H]([C@H](C(=O)O1)C)O[C@H]2C[C@@]([C@H]([C@@H](O2)C)O)(C)OC)C)O[C@H]3[C@@H]([C@H](C[C@H](O3)C)N(C)C)O)(C)OC)C)C)O)(C)O,AGOYDEPGAOXOCK-KCBOHYOISA-N,,
446598,clindamycin,CCC[C@@H]1C[C@H](N(C1)C)C(=O)N[C@@H]([C@@H]2[C@@H]([C@@H]([C@H]([C@H](O2)SC)O)O)O)[C@H](C)Cl,KDLRVYVGXIQJDK-AWPVFWJPSA-N,,
64139,efavirenz,C1CC1C#C[C@]2(C3=C(C=CC(=C3)Cl)NC(=O)O2)C(F)(F)F,XPOQHMRABVBWPR-ZDUSSCGKSA-N,,
60877,emtricitabine,C1[C@H](O[C@H](S1)CO)N2C=C(C(=NC2=O)N)F,XQSPYNMVSIKCOC-NTSWFWBYSA-N,,
12560,erythromycin,CC[C@@H]1[C@@]([C@@H]([C@H](C(=O)[C@@H](C[C@@]([C@@H]([C@H]([C@@H]([C@H](C(=O)O1)C)O[C@H]2C[C@@]([C@H]([C@@H](O2)C)O)(C)OC)C)O[C@H]3[C@@H]([C@H](C[C@H](O3)C)N(C)C)O)(C)O)C)C)O)(C)O,ULGZDMOVFRHVEP-RWJQBGPGSA-N,,
60825,lamivudine,C1[C@H](O[C@H](S1)CO)N2C=CC(=NC2=O)N,JTEGQNOMFQHVDC-NKWVEPMBSA-N,,
4173,metronidazole,CC1=NC=C(N1CCO)[N+](=O)[O-],VAOCPAMSLUNLGC-UHFFFAOYSA-N,,
4463,nevirapine,CC1=C2C(=NC=C1)N(C3=C(C=CC=N3)C(=O)N2)C4CC4,NQDJXKOVJZTUJA-UHFFFAOYSA-N,,
65028,oseltamivir,CCC(CC)O[C@@H]1C=C(C[C@@H]([C@H]1NC(=O)C)N)C(=O)OCC,VSZGPKBBMSAYNT-RRFJBIMHSA-N,,
54675779,oxytetracycline,C[C@@]1([C@H]2[C@@H]([C@H]3[C@@H](C(=O)C(=C([C@]3(C(=O)C2=C(C4=C1C=CC=C4O)O)O)O)C(=O)N)N(C)C)O)O,OWFJMIVZYSDULZ-PXOLEDIWSA-N,,
5904,benzylpenicillin,CC1([C@@H](N2[C@H](S1)[C@@H](C2=O)NC(=O)CC3=CC=CC=C3)C(=O)O)C,JGSARLDLIJGVTE-MBNYWOFBSA-N,,
5215,sulfadiazine,C1=CN=C(N=C1)NS(=O)(=O)C2=CC=C(C=C2)N,SEEPANYCNGTZFQ-UHFFFAOYSA-N,,
5325,sulfamerazine,CC1=NC(=NC=C1)NS(=O)(=O)C2=CC=C(C=C2)N,QPPBRPIAZZHUNT-UHFFFAOYSA-N,,
5327,sulfamethazine,CC1=CC(=NC(=N1)NS(=O)(=O)C2=CC=C(C=C2)N)C,ASWVTGNCAZCNNR-UHFFFAOYSA-N,,
5329,sulfamethoxazole,CC1=CC(=NO1)NS(=O)(=O)C2=CC=C(C=C2)N,JLKIGFTWXXRPMT-UHFFFAOYSA-N,,
5336,sulfapyridine,C1=CC=NC(=C1)NS(=O)(=O)C2=CC=C(C=C2)N,GECHUMIMRBOMGK-UHFFFAOYSA-N,,
54675776,tetracycline,C[C@@]1([C@H]2C[C@H]3[C@@H](C(=O)C(=C([C@]3(C(=O)C2=C(C4=C1C=CC=C4O)O)O)O)C(=O)N)N(C)C)O,NWXMGUDVXFXRIG-WESIUVDSSA-N,,
7547,triclocarban,C1=CC(=CC=C1NC(=O)NC2=CC(=C(C=C2)Cl)Cl)Cl,ICUTUKXCWQYESQ-UHFFFAOYSA-N,,
5564,triclosan,C1=CC(=C(C=C1Cl)O)OC2=C(C=C(C=C2)Cl)Cl,XEFQLINVKFYRCS-UHFFFAOYSA-N,,
56927907,carboxy-abacavir,C1CC1NC2=C3C(=NC(=N2)N)N(C=N3)[C@@H]4C[C@@H](C=C4)C(=O)O,OCSMNHMMTKMVCP-APPZFPTMSA-N,,
135508007,carboxy-acyclovir,C1=NC2=C(N1COCC(=O)O)N=C(NC2=O)N,MICNQLKUSOVNNG-UHFFFAOYSA-N,,
135564758,3-(4-hydroxyphenyl)pyrazinol,OC1=CC=C(C=C1)C1=C(O)N=CC=N1,KNKDJXWCPVPHPA-UHFFFAOYSA-N,,
132583458,amoxicillin penicilloic acid,CC1([C@@H](NC(S1)[C@@H](C(=O)O)NC(=O)[C@H](C2=CC=C(C=C2)O)N)C(=O)O)C,LHHKJQFIKHAUIA-BGJXXYSSSA-N,,
71313270,amoxicillin penilloic acid,CC1([C@@H](NC(S1)CNC(=O)[C@@H](C2=CC=C(C=C2)O)N)C(=O)O)C,HLJHSXSJKLJNKE-SAIIYOCFSA-N,,
12087378,amoxicillin-diketopiperazine-2'5',CC1([C@@H](N[C@H](S1)C2C(=O)NC(C(=O)N2)C3=CC=C(C=C3)O)C(=O)O)C,IIZCCQJEPBWGJU-YXLKDIQASA-N,,
9987533,N-desmethyl azithromycin,CC[C@@H]1[C@@]([C@@H]([C@H](N(C[C@@H](C[C@@]([C@@H]([C@H]([C@@H]([C@H](C(=O)O1)C)O[C@H]2C[C@@]([C@H]([C@@H](O2)C)O)(C)OC)C)O[C@H]3[C@@H]([C@H](C[C@H](O3)C)NC)O)(C)O)C)C)C)O)(C)O,FZYUKBLYECHAGN-HOQMJRDDSA-N,,
9851445,descladinosyl azithromycin,CC[C@@H]1[C@@]([C@@H]([C@H](N(C[C@@H](C[C@@]([C@@H]([C@H]([C@@H]([C@H](C(=O)O1)C)O)C)O[C@H]2[C@@H]([C@H](C[C@H](O2)C)N(C)C)O)(C)O)C)C)C)O)(C)O,PXDYILJJHOVNLO-NZMWSZMZSA-N,,
,phosphorylated azithromycin,CC[C@H]1OC(=O)[C@H](C)[C@@H](O[C@H]2C[C@@](C)(OC)[C@@H](O)[C@H](C)O2)[C@H](C)[C@@H](O[C@@H]2O[C@H](C)C[C@@H]([C@H]2OP(O)(O)=O)N(C)C)[C@](C)(O)C[C@@H](C)CN(C)[C@H](C)[C@@H](O)[C@]1(C)O,RIQRARZRTBKKDH-GUWUEPHNSA-N,,
54678407,4-epichlortetracycline,C[C@@]1([C@H]2C[C@H]3[C@H](C(=O)C(=C([C@]3(C(=O)C2=C(C4=C(C=CC(=C41)Cl)O)O)O)O)C(=O)N)N(C)C)O,DHPRQBPJLMKORJ-XRZQSNOTSA-N,,
54678405,iso-chlortetracycline,C[C@@]1(C2=C(C=CC(=C2C(=O)O1)O)Cl)[C@H]3C[C@H]4[C@@H](C(=O)C(=C([C@]4(C(=O)C3)O)O)C(=O)N)N(C)C,ZDCFZNSICAQKSV-AXVXPIMKSA-N,,
84020,14-hydroxy-clarithromycin,C[C@@H]1C[C@@H]([C@H]([C@@H](O1)O[C@@H]2[C@H]([C@@H]([C@H](C(=O)O[C@@H]([C@@]([C@@H]([C@H](C(=O)[C@@H](C[C@@]2(C)OC)C)C)O)(C)O)C(C)O)C)O[C@H]3C[C@@]([C@H]([C@@H](O3)C)O)(C)OC)C)O)N(C)C,BLPFDXNVUDZBII-KNPZYKNQSA-N,,
11072636,N'-demethyl clarithromycin,CC[C@@H]1[C@@]([C@@H]([C@H](C(=O)[C@@H](C[C@@]([C@@H]([C@H]([C@@H]([C@H](C(=O)O1)C)O[C@H]2C[C@@]([C@H]([C@@H](O2)C)O)(C)OC)C)O[C@H]3[C@@H]([C@H](C[C@H](O3)C)NC)O)(C)OC)C)C)O)(C)O,CIJTVUQEURKBDL-RWJQBGPGSA-N,,
73046007,clindamycin sulfoxide,CCCC1CC(N(C1)C)C(=O)NC(C2C(C(C(C(O2)S(=O)C)O)O)O)C(C)Cl,XSLGFIQRVCXUEU-UHFFFAOYSA-N,,
46781323,"8,14-dihydroxy-efavirenz",C1CC1(C#CC2(C3=C(C(=CC(=C3)Cl)O)NC(=O)O2)C(F)(F)F)O,WILFXLMJFSKQRP-UHFFFAOYSA-N,,
56637813,carboxy-emtricitabine,C1[C@H](O[C@H](S1)C(=O)O)N2C=C(C(=NC2=O)N)F,GQHACZWRCOKKIZ-MHTLYPKNSA-N,,
10038386,emtricitabine S-oxide,C1[C@H](O[C@H](S1=O)CO)N2C=C(C(=NC2=O)N)F,DMOMZPWPIDCLMB-YGFFCSEESA-N,,
83949,anhydro-erythromycin,CC[C@@H]1[C@@]2([C@@H]([C@H]([C@@]3(O2)[C@@H](C[C@@](O3)([C@@H]([C@H]([C@@H]([C@H](C(=O)O1)C)O[C@H]4C[C@@]([C@H]([C@@H](O4)C)O)(C)OC)C)O[C@H]5[C@@H]([C@H](C[C@H](O5)C)N(C)C)O)C)C)C)O)C,YKAVHPRGGAUFDN-JTQLBUQXSA-N,,
83954,erythromycin A enol ether,CC[C@@H]1[C@@]([C@@H]([C@H](C2=C(C[C@@](O2)([C@@H]([C@H]([C@@H]([C@H](C(=O)O1)C)O[C@H]3C[C@@]([C@H]([C@@H](O3)C)O)(C)OC)C)O[C@H]4[C@@H]([C@H](C[C@H](O4)C)N(C)C)O)C)C)C)O)(C)O,JFVYXJKGJMUGRG-KJPZRSJGSA-N,,
6537896,erythromycin oxime,CC[C@@H]1[C@@]([C@@H]([C@H](/C(=N/O)/[C@@H](C[C@@]([C@@H]([C@H]([C@@H]([C@H](C(=O)O1)C)O[C@H]2C[C@@]([C@H]([C@@H](O2)C)O)(C)OC)C)O[C@H]3[C@@H]([C@H](C[C@H](O3)C)N(C)C)O)(C)O)C)C)O)(C)O,KYTWXIARANQMCA-ZTILBQITSA-N,,
71749724,carboxy-lamivudine,C1[C@@H](O[C@@H](S1)C(=O)O)N2C=CC(=NC2=O)N,PIIRVEZNDVLYQA-VDTYLAMSSA-N,,
121858,hydroxy metronidazole,C1=C(N(C(=N1)CO)CCO)[N+](=O)[O-],AEHPOYAOLCAMIU-UHFFFAOYSA-N,,
453338,12-hydroxy-nevirapine,C1CC1N2C3=C(C=CC=N3)C(=O)NC4=C(C=CN=C42)CO,SEBABOMFNCVZGF-UHFFFAOYSA-N,,
449381,oseltamivir carboxylate,CCC(CC)O[C@@H]1C=C(C[C@@H]([C@H]1NC(=O)C)N)C(=O)O,NENPYTRHICXVCS-YNEHKIRRSA-N,,
54678403,4-epioxytetracycline,C[C@@]1([C@H]2[C@@H]([C@H]3[C@H](C(=O)C(=C([C@]3(C(=O)C2=C(C4=C1C=CC=C4O)O)O)O)C(=O)N)N(C)C)O)O,OWFJMIVZYSDULZ-DVJPNYBFSA-N,,
71460627,apo-oxytetracycline,CC1=C2C=CC=C(C2=C(C3=C1[C@@H](OC3=O)[C@H]4[C@@H](C(=C(C(=O)[C@H]4O)C(=O)N)O)N(C)C)O)O,DRKMHDAKULCOKQ-SECMTKEISA-N,,
13751905,benzylpenicilloaldehyde,C1=CC=C(C=C1)CC(=O)NCC=O,ZBDOVHVJWVWSPQ-UHFFFAOYSA-N,,
98994,benzylpenicilloic acid,CC1(C(NC(S1)C(C(=O)O)NC(=O)CC2=CC=CC=C2)C(=O)O)C,HCYWNSXLUZRKJX-UHFFFAOYSA-N,,
253302,benzylpenillic acid,CC1(C(N2C(S1)C(N=C2CC3=CC=CC=C3)C(=O)O)C(=O)O)C,PSPRNQOVLYLHSA-UHFFFAOYSA-N,,
2825766,benzylpenilloic acid,CC1([C@@H](N[C@H](S1)CNC(=O)CC2=CC=CC=C2)C(=O)O)C,LRWFMQCGNBOTQP-OLZOCXBDSA-N,,
13751903,isopenillic acid,CC(C)(S)[C@H](C(O)=O)N1C=C(N=C1CC1C=CC=CC=1)C(O)=O,QLTUFLACBYWAET-ZDUSSCGKSA-N,,
74368,4-formamido-N-(2-pyrimidinyl)benzenesulfonamide,CNS(=O)(=O)C1=CC=C(N)C=C1,OISQSDKFWKJEBA-UHFFFAOYSA-N,,
101436677,4-amino-N-methyl-benzenesulfonamide,O=CNC1=CC=C(C=C1)S(=O)(=O)NC1=NC=CC=N1,OVELYWMMDNFICW-UHFFFAOYSA-N,,
462434,5-hydroxy-sulfadiazine,NC1=CC=C(C=C1)S(=O)(=O)NC1=NC=C(O)C=N1,VBMYFGQAZZYDIY-UHFFFAOYSA-N,,
64952,N-acetyl-sulfadiazine,CC(=O)NC1=CC=C(C=C1)S(=O)(=O)NC1=NC=CC=N1,NJIZUWGMNCUKGU-UHFFFAOYSA-N,,
7371,benzensulfonic acid,C1=CC=C(C=C1)S(=O)(=O)O,SRSXLGNVWSONIS-UHFFFAOYSA-N,,
67181,N-acetyl-sulfamerazine,CC1=NC(=NC=C1)NS(=O)(=O)C2=CC=C(C=C2)NC(=O)C,PHFJZKMLXDFUNB-UHFFFAOYSA-N,,
66855,N-acetyl-sulfamethazine,CC1=CC(=NC(=N1)NS(=O)(=O)C2=CC=C(C=C2)NC(=O)C)C,LJKAKWDUZRJNPJ-UHFFFAOYSA-N,,
43154654,4-N-methyl-sulfamethoxazole,CC1=CC(=NO1)NS(=O)(=O)C2=CC=C(C=C2)NC,ZRXDSRHCGYXVTI-UHFFFAOYSA-N,,
,4-amino-N-[(1E)-1-amino-3-oxobut-1-en-1-yl]-2-hydroxybenzene-1-sulfonamide,CC(=O)\C=C(/N)NS(=O)(=O)C1=C(O)C=C(N)C=C1,SDUSBQGOWFLSPH-ONNFQVAWSA-N,,
,4-amino-N-[(1E)-1-amino-3-oxobut-1-en-1-yl]benzene-1-sulfonamide,CC(=O)\C=C(/N)NS(=O)(=O)C1=CC=C(N)C=C1,AQWFGIMMOKOFEB-UXBLZVDNSA-N,,
125483,4-nitroso-sulfamethoxazole,CC1=CC(=NO1)NS(=O)(=O)C2=CC=C(C=C2)N=O,GHNQGDUYHCZZPT-UHFFFAOYSA-N,,
162661006,N-dimethyl-sulfamethoxazole,CN(C)C1=CC=C(C=C1)S(=O)(=O)NC1=NOC(C)=C1,HLKGYQLPLBQMTR-UHFFFAOYSA-N,,
75213081,sulfamethoxazole beta-D-glucuronide,CC1=CC(=NO1)N(C2C(C(C(C(O2)C(=O)O)O)O)O)S(=O)(=O)C3=CC=C(C=C3)N,BLFOMTRQSZIMKK-UHFFFAOYSA-N,,
65280,N-acetyl-sulfamethoxazole,CC(=O)NC1=CC=C(C=C1)S(=O)(=O)NC1=NOC(C)=C1,GXPIUNZCALHVBA-UHFFFAOYSA-N,,
,carboxy-sulfamethoxazole,CC(=O)C1=CC(NS(=O)(=O)C2=CC=C(N)C=C2)=NO1,IKRDIJZZCVWWKQ-UHFFFAOYSA-N,,
,5-[4-(acetylamino)benzenesulf-onyloxy]sulfapyridine acetate,CC(=O)NC1=CC=C(C=C1)S(=O)(=O)NC1=CC=C(OS(=O)(=O)C2=CC=C(NC(C)=O)C=C2)C=N1,JPIUMBXLXMOUNV-UHFFFAOYSA-N,,
148510,5-hydroxy-sulfapyridine,NC1=CC=C(C=C1)S(=O)(=O)NC1=CC=C(O)C=N1,XMCHHHBDBWYWSU-UHFFFAOYSA-N,,
58638,N-acetyl-sulfapyridine,CC(=O)NC1=CC=C(C=C1)S(=O)(=O)NC2=CC=CC=N2,CYLYVXPHAQLXFG-UHFFFAOYSA-N,,
54678401,4-epianhydrotetracycline,CC1=C2C=CC=C(C2=C(C3=C1C[C@H]4[C@H](C(=O)C(=C([C@]4(C3=O)O)O)C(=O)N)N(C)C)O)O,KTTKGQINVKPHLY-WPINSWFRSA-N,,
54682506,4-epitetracycline,C[C@@]1([C@H]2C[C@H]3[C@H](C(=O)C(=C([C@]3(C(=O)C2=C(C4=C1C=CC=C4O)O)O)O)C(=O)N)N(C)C)O,NWXMGUDVXFXRIG-PMXORCKASA-N,,
51527838,anhydrotetracycline,CC1=C2C=CC=C(C2=C(C3=C1C[C@H]4[C@@H](C(=O)C(=C([C@]4(C3=O)O)O)C(=O)N)N(C)C)O)O,KTTKGQINVKPHLY-DOCRCCHOSA-N,,
95783,"1,3-bis(3,4-dichlorophenyl)urea",C1=CC(=C(C=C1NC(=O)NC2=CC(=C(C=C2)Cl)Cl)Cl)Cl,ZDPIZPXVHVYTOK-UHFFFAOYSA-N,,
7595,carbanilide,C1=CC=C(C=C1)NC(=O)NC2=CC=CC=C2,GWEHVDNNLFDJLR-UHFFFAOYSA-N,,
791964,dichlorocarbanilide,C1=CC(=CC(=C1)Cl)NC(=O)NC2=CC=C(C=C2)Cl,WEGKFRNBRWVJKT-UHFFFAOYSA-N,,
627458,methyl triclosan,COC1=C(C=CC(=C1)Cl)OC2=C(C=C(C=C2)Cl)Cl,NLYDHBBTVWMLFD-UHFFFAOYSA-N,,
