DOI,Internal,External
10.1016/j.jhazmat.2021.128194,TRUE,FALSE
10.1016/j.envint.2021.106885,TRUE,FALSE
10.1016/j.watres.2021.117017,TRUE,FALSE
10.1021/acs.est.0c05713,TRUE,FALSE
10.1093/exposome/osab006,TRUE,FALSE
10.1186/s13321-021-00489-0,TRUE,FALSE
10.1016/j.watres.2021.116994,TRUE,FALSE
10.1039/C9EM00068B,TRUE,FALSE
10.1021/acsenvironau.1c00008,TRUE,FALSE
10.1038/s41592-021-01307-z,FALSE,TRUE
10.3390/f12111591,FALSE,TRUE
10.3390/metabo11110745,FALSE,TRUE
10.1016/j.chemosphere.2021.132830,FALSE,TRUE
10.1021/acs.est.0c06685,FALSE,TRUE
10.1021/acs.analchem.1c02348,TRUE,FALSE
10.1038/s41597-019-0145-z,TRUE,FALSE
10.3390/metabo12030199,TRUE,FALSE
10.1016/j.foodchem.2021.130130,FALSE,TRUE
10.1016/j.chroma.2021.461899,FALSE,TRUE
