DTXSID7034624
DTXSID1057955
DTXSID8057930
DTXSID6058134
DTXSID40894940
DTXSID9058151
DTXSID8024109
DTXSID6058215
DTXSID10894937
DTXSID301023707
DTXSID7058208
DTXSID9058107
DTXSID6058005
DTXSID60894826
DTXSID701020474
DTXSID10896895
DTXSID2058207
DTXSID6057954
DTXSID6058219
DTXSID2034625
DTXSID9047542
DTXSID4032580
DTXSID9058494
DTXSID0058063
DTXSID80921007
DTXSID501026957
DTXSID7032551
DTXSID2034881
DTXSID2032398
DTXSID601020764
DTXSID30893604
DTXSID1040372
DTXSID80185182
DTXSID5057965
DTXSID3024235
DTXSID8040727
DTXSID3057937
DTXSID8057936
DTXSID101023470
DTXSID40894945
DTXSID2042220
DTXSID8057980
DTXSID8034956
DTXSID2032500
DTXSID7058096
DTXSID9058232
DTXSID5058018
DTXSID401020382
DTXSID9057929
DTXSID30431727
DTXSID0058225
DTXSID701020381
DTXSID60894907
DTXSID80165520
DTXSID701001113
DTXSID201023916
DTXSID5041851
DTXSID7058092
DTXSID8042478
DTXSID6032354
DTXSID9042332
DTXSID1034503
DTXSID701022032
DTXSID001016587
DTXSID201016583
DTXSID0034855
DTXSID3058163
DTXSID3034612
DTXSID10989039
DTXSID0058194
DTXSID8058249
DTXSID7042019
DTXSID9058492
DTXSID6024123
DTXSID90904725
DTXSID3058038
DTXSID10886276
DTXSID50974146
DTXSID60992851
DTXSID8034372
DTXSID60166671
DTXSID4034528
DTXSID3034610
DTXSID7044340
DTXSID0043979
DTXSID2058095
DTXSID4032615
DTXSID8057982
DTXSID80162796
DTXSID0034803
DTXSID8032463
DTXSID40150270
DTXSID9034868
DTXSID4058021
DTXSID7044344
DTXSID70236339
DTXSID0043971
DTXSID2032502
DTXSID9057975
DTXSID10159614
DTXSID20145841
DTXSID60187083
DTXSID9042255
DTXSID4042460
DTXSID20180010
DTXSID8020628
DTXSID0020022
DTXSID8041583
DTXSID2057998
DTXSID7057991
DTXSID9034365
DTXSID4032532
DTXSID10869766
DTXSID6058504
DTXSID60172237
DTXSID7057999
DTXSID3034618
DTXSID6058007
DTXSID2032554
DTXSID50236453
DTXSID7032555
DTXSID90868818
DTXSID7037553
DTXSID0041983
DTXSID00868440
DTXSID5041984
DTXSID90153054
DTXSID2032556
DTXSID80869975
DTXSID7024112
DTXSID9057923
DTXSID90868555
DTXSID6058180
DTXSID7024160
DTXSID4073752
DTXSID9042205
DTXSID7024241
DTXSID3057933
DTXSID6058009
DTXSID8034871
DTXSID1057953
DTXSID9058072
DTXSID6032645
DTXSID7057947
DTXSID20873394
DTXSID001020461
DTXSID4041494
DTXSID30229348
DTXSID50865222
DTXSID8024107
DTXSID0041987
DTXSID5058228
DTXSID8042133
DTXSID8024234
DTXSID8044339
DTXSID5058064
DTXSID5034723
DTXSID2044343
DTXSID5047037
DTXSID3023899
DTXSID9040265
DTXSID9032379
DTXSID8032386
DTXSID9032614
DTXSID7032553
DTXSID60206501
DTXSID1034210
DTXSID2044559
DTXSID1032488
DTXSID4021395
DTXSID2032552
DTXSID0058019
DTXSID4058104
DTXSID7034709
DTXSID3034298
DTXSID7057943
DTXSID0058223
DTXSID30895800
DTXSID6057956
DTXSID7058177
DTXSID00894941
DTXSID50873862
DTXSID2034627
DTXSID20870025
DTXSID5034303
DTXSID10241447
DTXSID50241446
DTXSID8034538
DTXSID4058445
DTXSID8058245
DTXSID0041773
DTXSID5057963
DTXSID2042018
DTXSID3042267
DTXSID50218815
DTXSID1058137
DTXSID6041977
DTXSID6058213
DTXSID8040353
DTXSID5041980
DTXSID3024108
DTXSID5052468
DTXSID5044998
DTXSID50187794
DTXSID8041870
DTXSID5042160
DTXSID3058294
DTXSID0058017
DTXSID6058003
DTXSID4034609
DTXSID401024041
DTXSID50185417
DTXSID20192613
DTXSID9057977
DTXSID3041584
DTXSID9020160
DTXSID20891316
DTXSID2057992
DTXSID5035957
DTXSID8032330
DTXSID6023997
DTXSID1034501
DTXSID7032559
DTXSID2058043
DTXSID1041972
DTXSID0022301
DTXSID3057931
DTXSID8058166
DTXSID7024110
DTXSID7037555
DTXSID3057935
DTXSID3057939
DTXSID6058217
DTXSID301024286
DTXSID4034738
DTXSID901024246
DTXSID90897320
DTXSID301024250
DTXSID4058023
DTXSID2057944
DTXSID4057924
DTXSID5032577
DTXSID601024328
DTXSID5058199
DTXSID4046812
DTXSID9042253
DTXSID901015150
DTXSID0074687
DTXSID10872811
DTXSID90155139
DTXSID9034945
DTXSID8060329
DTXSID6058057
DTXSID7057993
DTXSID8034586
DTXSID9032533
DTXSID00622963
DTXSID1032646
DTXSID6041503
DTXSID2032421
DTXSID0058013
DTXSID5041772
DTXSID1024049
DTXSID1046556
DTXSID0034356
DTXSID1041978
DTXSID3032620
DTXSID5034357
DTXSID5034773
DTXSID0034774
DTXSID8042262
DTXSID6042440
DTXSID5034355
DTXSID6023868
DTXSID4058027
DTXSID701024169
DTXSID00937726
DTXSID1032690
DTXSID6040373
DTXSID8058089
DTXSID301024193
DTXSID701023909
DTXSID4047672
DTXSID40894829
DTXSID8034611
DTXSID50148921
DTXSID90235581
DTXSID901024046
DTXSID701027551
DTXSID50894815
DTXSID50891521
DTXSID8034875
DTXSID401024253
DTXSID20894948
DTXSID2041969
DTXSID1034767
DTXSID9057842
DTXSID0040331
DTXSID4058079
DTXSID9058103
DTXSID6041979
DTXSID1058139
DTXSID1058054
DTXSID30894878
DTXSID8032590
DTXSID1058212
DTXSID2034255
DTXSID0041981
DTXSID5058191
DTXSID001008318
DTXSID7048958
DTXSID90219063