DTXSID0021834
DTXSID60872503
DTXSID5064912
DTXSID2021284
DTXSID1020194
DTXSID0020153
DTXSID901029434
DTXSID8021147
DTXSID601018262
DTXSID9034650
DTXSID0027721
DTXSID2035069
DTXSID50143658
DTXSID6020226
DTXSID5020865
DTXSID1020229
DTXSID1031042
DTXSID601027310
DTXSID201029445
DTXSID301027335
DTXSID001027336
DTXSID401026409
DTXSID901027345
DTXSID701027337
DTXSID901020349
DTXSID9064970
DTXSID5020869
DTXSID901029446
DTXSID6022422
DTXSID401027338
DTXSID0021094
DTXSID2020470
DTXSID601029447
DTXSID301029448
DTXSID001029449
DTXSID001029437
DTXSID6041268
DTXSID70869383
DTXSID7044504
DTXSID9035676
DTXSID8020123
DTXSID2046703
DTXSID20889591
DTXSID4058601
DTXSID5033836
DTXSID4037033
DTXSID4057924
DTXSID8021274
DTXSID9020295
DTXSID401029439
DTXSID7061437
DTXSID5027356
DTXSID1020566
DTXSID0025361
DTXSID3020415
DTXSID6021874
DTXSID3020203
DTXSID6020438
DTXSID5020029
DTXSID5021881
DTXSID0061458
DTXSID6020307
DTXSID001029451
DTXSID2021238
DTXSID6020802
DTXSID501028884
DTXSID5024182
DTXSID6020646
DTXSID2025553
DTXSID0021917
DTXSID0025286
DTXSID7024087
DTXSID301015445
DTXSID2026313
DTXSID101014603
DTXSID90274011
DTXSID801014466
DTXSID9021928
DTXSID4027733
DTXSID6025355

DTXSID5049782
DTXSID7025423
DTXSID7021027
DTXSID1024621
DTXSID8021195
DTXSID8026224
DTXSID801028883
DTXSID5020813
DTXSID2026941
DTXSID1021952
DTXSID5021411
DTXSID9020376
DTXSID5020607
DTXSID8025094
DTXSID1021956
DTXSID401029477
DTXSID2020682
DTXSID6021959
DTXSID5044786
DTXSID4020870
DTXSID0021961
DTXSID3058290
DTXSID3025091
DTXSID5024059
DTXSID5030743
DTXSID0030742
DTXSID60893152
DTXSID4065155
DTXSID401010200
DTXSID501010203
DTXSID6034390
DTXSID0023878
DTXSID301014209
DTXSID601014246
DTXSID101028882
DTXSID7093959
DTXSID701014249
DTXSID601186912
DTXSID2025711
DTXSID9029722
DTXSID70923474
DTXSID1093963
DTXSID4029723
DTXSID401028881
DTXSID1020350
DTXSID3020257
DTXSID0021965
DTXSID0020529
DTXSID9029853
DTXSID5021465
DTXSID501028408
DTXSID4029725
DTXSID001014286
DTXSID301029450
DTXSID5030741
DTXSID7034389
DTXSID401014290
DTXSID9029726
DTXSID8027373
DTXSID701028880
DTXSID8021145
DTXSID7020710
DTXSID901028874
DTXSID1034391
DTXSID0025608
DTXSID0024553
DTXSID4020533
DTXSID40872384
DTXSID601028875
DTXSID4029727
DTXSID7051638
DTXSID801055070
DTXSID00893914
DTXSID20890622
DTXSID9051321
DTXSID301319201
DTXSID5020316
DTXSID0049733
DTXSID2021319
DTXSID5020499
DTXSID30890678
DTXSID2020216
DTXSID3024289
DTXSID2023779
DTXSID1034343
DTXSID7034387
DTXSID2034384
DTXSID30872818
DTXSID0024715
DTXSID30893280
DTXSID4023880
DTXSID5031131
DTXSID70872958
DTXSID7025710
DTXSID801316876
DTXSID00157023
DTXSID60893854
DTXSID5029637
DTXSID001026621
DTXSID5041306
DTXSID8022406
DTXSID3022405
DTXSID30635586
DTXSID0029638
DTXSID9029641
DTXSID1030319
DTXSID70880215
DTXSID0020103
DTXSID2034388
DTXSID4023888
DTXSID1049776
DTXSID0040125
DTXSID3044540
DTXSID1020774
DTXSID6065420
DTXSID00873771
DTXSID60873772
DTXSID20873773
DTXSID4065448
DTXSID8051336
DTXSID40928693
DTXSID1065479
DTXSID0024212
DTXSID0065484
DTXSID8027747
DTXSID00158939
DTXSID30872954
DTXSID7027750
DTXSID5065566
DTXSID20929461
DTXSID5026259
DTXSID9026261
DTXSID30929573
DTXSID9021398
DTXSID5021332
DTXSID901018497
DTXSID0021464
DTXSID2029167
DTXSID0024717
DTXSID2065622
DTXSID20929885
DTXSID9065651
DTXSID901011027
DTXSID40930110
DTXSID9021344
DTXSID9022360
DTXSID5065720
DTXSID50893984
DTXSID101015049
DTXSID301028876
DTXSID90891702
DTXSID7044396
DTXSID90931819
DTXSID20869934
DTXSID00858720
DTXSID40881875
DTXSID80889633
DTXSID70108724
DTXSID60163084
DTXSID3027403
DTXSID0041307
DTXSID00884766
DTXSID201027437
DTXSID5020730
DTXSID001028877
DTXSID6034928
DTXSID30933473
DTXSID30894858
DTXSID001015715
DTXSID7041544
DTXSID10934009
DTXSID90864552
DTXSID501018514
DTXSID8020599
DTXSID20721700
DTXSID10890757
DTXSID8029735
DTXSID701028878
DTXSID20166036
DTXSID301029274
DTXSID20890763
DTXSID001029275
DTXSID801029279
DTXSID70935936
DTXSID80935942
DTXSID5049441
DTXSID80328153
DTXSID3020201
DTXSID90936420
DTXSID901333984
DTXSID3020833
DTXSID301029286
DTXSID5036921
DTXSID0094025
DTXSID60872583
DTXSID50890776
DTXSID3031864
DTXSID001029287
DTXSID701029288
DTXSID401029289
DTXSID701029290
DTXSID401029291
DTXSID501029294
DTXSID9059751
DTXSID5023908
DTXSID3023764
DTXSID9094034
DTXSID7020184
DTXSID8044333
DTXSID2037714
DTXSID901010948
DTXSID90439401
DTXSID60889393
DTXSID1047738
DTXSID9058600
DTXSID901029296
DTXSID8052691
DTXSID8047553
DTXSID0023907
DTXSID60862823
DTXSID3024104
DTXSID0023909
DTXSID30894156
DTXSID9066671
DTXSID50896632
DTXSID8029864
DTXSID2043905
DTXSID601029297
DTXSID4021399
DTXSID0022432
DTXSID90881840
DTXSID2029321
DTXSID40881850
DTXSID90890558
DTXSID3031444
DTXSID201028885
DTXSID20889394
DTXSID00177327
DTXSID3075044
DTXSID1058680
DTXSID4026262
DTXSID10894154
DTXSID7020188
DTXSID60179685
DTXSID7020215
DTXSID3021857
DTXSID9026267
DTXSID801011036
DTXSID5027859
DTXSID9027869
DTXSID1029330
DTXSID601036187
DTXSID30880236
DTXSID8025383
DTXSID0058695
DTXSID0038889
DTXSID60885315
DTXSID2027886
DTXSID2020185
DTXSID2036588
DTXSID7027887
DTXSID30885327
DTXSID8027903
DTXSID60274048
DTXSID3044413
DTXSID9067273
DTXSID401095727
DTXSID6027925
DTXSID70950068
DTXSID70472472
DTXSID60950294
DTXSID80182217
DTXSID8037706
DTXSID4022521
DTXSID2029616
DTXSID301029298
DTXSID6027131
DTXSID9067435
DTXSID00951841
DTXSID0062715
DTXSID501065141
DTXSID3037707
DTXSID2032421
DTXSID9021552
DTXSID2062747
DTXSID6020773
DTXSID3020702
DTXSID0057706
DTXSID1044643
DTXSID60872866
DTXSID0059794
DTXSID8031861
DTXSID001029299
DTXSID90184803
DTXSID801029300
DTXSID501029301
DTXSID301020377
DTXSID60880027
DTXSID9027522
DTXSID201029302
DTXSID0020288
DTXSID601029304
DTXSID4027527
DTXSID8024236
DTXSID9020164
DTXSID901029315
DTXSID601015701
DTXSID3025708
DTXSID0024008
DTXSID40890523
DTXSID30955115
DTXSID8031865
DTXSID3031860
DTXSID3040148
DTXSID5032498
DTXSID9059834
DTXSID90858719
DTXSID001033642
DTXSID7040150
DTXSID301029317
DTXSID7027540
DTXSID70189876
DTXSID9044661
DTXSID5052044
DTXSID7025215
DTXSID40893054
DTXSID8047896
DTXSID9074274
DTXSID00872608
DTXSID7044423
DTXSID7020926
DTXSID00885672
DTXSID5030030
DTXSID8031863
DTXSID3059921
DTXSID1024627
DTXSID401029322
DTXSID1073494
DTXSID7059933
DTXSID8037708
DTXSID20880028
DTXSID4052059
DTXSID4038893
DTXSID0063230
DTXSID7020398
DTXSID10960383
DTXSID60192950
DTXSID40611715
DTXSID20880205
DTXSID1032646
DTXSID40890588
DTXSID501029325
DTXSID70964009
DTXSID30197957
DTXSID90890593
DTXSID7020637
DTXSID20380851
DTXSID2020139
DTXSID40380878
DTXSID60883417
DTXSID7052151
DTXSID2094922
DTXSID3036286
DTXSID501014417
DTXSID9021427
DTXSID90966146
DTXSID60966390
DTXSID2027593
DTXSID20872584
DTXSID9052713
DTXSID201029326
DTXSID1068774
DTXSID7020138
DTXSID9020409
DTXSID0041228
DTXSID9068908
DTXSID6027183
DTXSID1027184
DTXSID3020750
DTXSID8020173
DTXSID1025302
DTXSID6041058
DTXSID5060277
DTXSID5020653
DTXSID7026235
DTXSID00970618
DTXSID30970621
DTXSID50873382
DTXSID80859119
DTXSID4020666
DTXSID7027205
DTXSID30427741
DTXSID60971065
DTXSID4052219
DTXSID00204642
DTXSID8020250
DTXSID8052859
DTXSID9020166
DTXSID5023902
DTXSID4095003
DTXSID1021247
DTXSID40904710
DTXSID7029378
DTXSID1020516
DTXSID4022816
DTXSID0029765
DTXSID8021197
DTXSID2073198
DTXSID90942521
DTXSID1025568
DTXSID8021432
DTXSID801020203
DTXSID3021148
DTXSID6024460
DTXSID4027236
DTXSID8024280
DTXSID3020960
DTXSID4020874
DTXSID80209236
DTXSID5020528
DTXSID8027240
DTXSID1022425
DTXSID20976713
DTXSID6020511
DTXSID1020433
DTXSID9036854
DTXSID5041358
DTXSID20474926
DTXSID3028051
DTXSID7028061
DTXSID5029768
DTXSID40210803
DTXSID8027248
DTXSID40108559
DTXSID9022445
DTXSID6021032
DTXSID201018208
DTXSID8020090
DTXSID1031591
DTXSID9021340
DTXSID7021029
DTXSID5025285
DTXSID5027273
DTXSID1033325
DTXSID2040733
DTXSID1074672
DTXSID30496952
DTXSID901029327
DTXSID1024045
DTXSID4028127
DTXSID9028128
DTXSID8028131
DTXSID3028132
DTXSID8028133
DTXSID3028134
DTXSID3028136
DTXSID8028137
DTXSID3028138
DTXSID8028139
DTXSID7028140
DTXSID2028141
DTXSID2028143
DTXSID2028145
DTXSID7028146
DTXSID2028147
DTXSID7028148
DTXSID2028149
DTXSID1028150
DTXSID1028152
DTXSID6028153
DTXSID1028154
DTXSID6028155
DTXSID1028156
DTXSID1028158
DTXSID6028159
DTXSID5028160
DTXSID5028162
DTXSID5028164
DTXSID0028165
DTXSID5028166
DTXSID0028167
DTXSID5028168
DTXSID9028170
DTXSID4028171
DTXSID9028172
DTXSID4028173
DTXSID4028177
DTXSID9028178
DTXSID4028179
DTXSID3028182
DTXSID3028184
DTXSID8028185
DTXSID8028189
DTXSID5029390
DTXSID3028211
DTXSID3028213
DTXSID8028214
DTXSID3028217
DTXSID8028218
DTXSID3028219
DTXSID2028220
DTXSID7028221
DTXSID2028222
DTXSID2028224
DTXSID2028226
DTXSID7028227
DTXSID7028229
DTXSID101020321
DTXSID6028230
DTXSID6028232
DTXSID1028233
DTXSID1028235
DTXSID6028236
DTXSID1028237
DTXSID6028238
DTXSID0028240
DTXSID5028241
DTXSID5028243
DTXSID0028246
DTXSID5028247
DTXSID4028252
DTXSID4028256
DTXSID80215079
DTXSID5024845
DTXSID80886703
DTXSID20983528
DTXSID4095423
DTXSID7029879
DTXSID80983948
DTXSID401019919
DTXSID7028275
DTXSID1028285
DTXSID6024882
DTXSID9058153
DTXSID00896647
DTXSID1020306
DTXSID90218051
DTXSID4064474
DTXSID90890957
DTXSID80894222
DTXSID6020694
DTXSID6043913
DTXSID2034205
DTXSID8029282
DTXSID6020515
DTXSID7096838
DTXSID40894480
DTXSID4028389
DTXSID601029328
DTXSID5097375
DTXSID3071355
DTXSID8027292
DTXSID1028441
DTXSID1028443
DTXSID4028462
DTXSID4028464
DTXSID4028466
DTXSID8028470
DTXSID3028471
DTXSID8028472
DTXSID60894503
DTXSID3028477
DTXSID90858693
DTXSID2028517
DTXSID3029786
DTXSID7028518
DTXSID2028519
DTXSID1028522
DTXSID6028525
DTXSID1028528
DTXSID6028529
DTXSID0028531
DTXSID5028536
DTXSID5028538
DTXSID0028539
DTXSID9028542
DTXSID9028546
DTXSID4028547
DTXSID8028553
DTXSID8028555
DTXSID0098895
DTXSID7098903
DTXSID8029789
DTXSID2028565
DTXSID2028567
DTXSID1028572
DTXSID6028577
DTXSID5028580
DTXSID0028583
DTXSID1028603
DTXSID4028622
DTXSID4028624
DTXSID9028625
DTXSID4028626
DTXSID3028639
DTXSID7028641
DTXSID6028656
DTXSID90107638
DTXSID5028665
DTXSID4025082
DTXSID5028667
DTXSID50892134
DTXSID9099290
DTXSID4028674
DTXSID9028704
DTXSID7029459
DTXSID9028708
DTXSID4028709
DTXSID3028716
DTXSID1028730
DTXSID1028736
DTXSID5028748
DTXSID0028749
DTXSID9028752
DTXSID3028762
DTXSID60100474
DTXSID301029329
DTXSID50100862
DTXSID5028796
DTXSID0028797
DTXSID5028798
DTXSID7028805
DTXSID2028806
DTXSID60100974
DTXSID1028819
DTXSID00101041
DTXSID0040709
DTXSID6028862
DTXSID1028869
DTXSID5028873
DTXSID0028874
DTXSID4028919
DTXSID3028920
DTXSID8028921
DTXSID3028924
DTXSID1028944
DTXSID5028950
DTXSID9028962
DTXSID20102878
DTXSID4022107
DTXSID2072049
DTXSID2020846
DTXSID2028985
DTXSID7028988
DTXSID2028989
DTXSID1028990
DTXSID5041433
DTXSID40990931
DTXSID601029330
DTXSID1048205
DTXSID3039242
DTXSID6026373
DTXSID0021381
DTXSID30992328
DTXSID401016727
DTXSID8038857
DTXSID9029017
DTXSID301029331
DTXSID00222240
DTXSID30888131
DTXSID7029033
DTXSID2029034
DTXSID7029035
DTXSID2029036
DTXSID90868151
DTXSID001029332
DTXSID0064624
DTXSID2021311
DTXSID4072780
DTXSID901028505
DTXSID2024161
DTXSID1024172
DTXSID4023913
DTXSID1023940
DTXSID1031040
DTXSID5064706
DTXSID6029044
DTXSID401028405
DTXSID80225734
DTXSID901026373
DTXSID8021434
DTXSID5039224
DTXSID801029336
DTXSID8025337
DTXSID6023947
DTXSID70226154
DTXSID30226155
DTXSID0020600
DTXSID7030197
DTXSID8024286
DTXSID5021207
DTXSID0026123
DTXSID8029288
DTXSID9041578
DTXSID60226981
DTXSID4042414
DTXSID9027310
DTXSID9040180
DTXSID1021409
DTXSID0021125
DTXSID7040316
DTXSID8034455
DTXSID4022442
DTXSID40108998
DTXSID00108999
DTXSID701026177
DTXSID80228245
DTXSID6020195
DTXSID6024961
DTXSID1041059
DTXSID1064792
DTXSID90998846
DTXSID7032056
DTXSID5024055
DTXSID1034341
DTXSID6058182
DTXSID5025948
DTXSID4042092
DTXSID6023787
DTXSID8064858
DTXSID70872832
DTXSID70872953
DTXSID6032061
DTXSID6064878
DTXSID7023801
DTXSID9037240
DTXSID1026457
DTXSID2020761
DTXSID0020448
DTXSID0021383
DTXSID5020027
DTXSID0047167
DTXSID1020512
DTXSID6020981
DTXSID1026081
DTXSID7020182
DTXSID7027679
DTXSID6027686
DTXSID3022409
DTXSID6093702
DTXSID5027697
DTXSID5027699
DTXSID90868570
DTXSID1025017
DTXSID9026500
DTXSID1021405
DTXSID5023742
DTXSID9022441
DTXSID6072893
DTXSID5020867
DTXSID20872665
DTXSID501029337
DTXSID5025021
DTXSID3020095
DTXSID7021780
DTXSID9022522
DTXSID2021781
DTXSID6025068
DTXSID80872666
DTXSID40872667
DTXSID901029339
DTXSID30107652
DTXSID5029055
DTXSID201029340
DTXSID601029342
DTXSID401005130
DTXSID001029344
DTXSID2052732
DTXSID701029345
DTXSID401029346
DTXSID801029348
DTXSID6024254
DTXSID00872668
DTXSID201027306
DTXSID701027375
DTXSID901027321
DTXSID001029356
DTXSID701029357
DTXSID401029358
DTXSID3029813
DTXSID8026515
DTXSID101029359
DTXSID101029361
DTXSID80234720
DTXSID201006075
DTXSID801029362
DTXSID201029364
DTXSID3024235
DTXSID40105260
DTXSID2040313
DTXSID901029365
DTXSID30872671
DTXSID601029366
DTXSID60881291
DTXSID3020205
DTXSID301029367
DTXSID701029369
DTXSID001029370
DTXSID50105296
DTXSID6020856
DTXSID8026193
DTXSID7020683
DTXSID901020325
DTXSID7021106
DTXSID4025791
DTXSID3020207
DTXSID8034085
DTXSID1058212
DTXSID5023877
DTXSID6021408
DTXSID1027718
DTXSID2042309
DTXSID60891517
DTXSID701026391
DTXSID9029067
DTXSID701020329
DTXSID001020330
DTXSID701029371
DTXSID4029068
DTXSID801027411
DTXSID701027313
DTXSID001027348
DTXSID2020894
DTXSID401029372
DTXSID101029373
DTXSID901018209
DTXSID801029374
DTXSID501029375
DTXSID401029396
DTXSID8020913
DTXSID1021798
DTXSID3020962
DTXSID2020921
DTXSID601067990
DTXSID801029398
DTXSID501027412
DTXSID6020432
DTXSID2036827
DTXSID701020331
DTXSID401020332
DTXSID601027322
DTXSID301027323
DTXSID401027340
DTXSID301029400
DTXSID701029402
DTXSID001027324
DTXSID301027311
DTXSID101027315
DTXSID001020342
DTXSID301027309
DTXSID701027325
DTXSID401020344
DTXSID2029826
DTXSID401029403
DTXSID7029827
DTXSID401027326
DTXSID101027327
DTXSID101029404
DTXSID801027328
DTXSID501027329
DTXSID601027346
DTXSID101020345
DTXSID801027316
DTXSID00105382
DTXSID801029405
DTXSID501029406
DTXSID5020071
DTXSID2020137
DTXSID9041522
DTXSID801027330
DTXSID501027331
DTXSID00109007
DTXSID201027332
DTXSID901027333
DTXSID101027341
DTXSID601027334
DTXSID201029407
DTXSID501027317
DTXSID60917089
DTXSID00917088
DTXSID001027312
DTXSID001027350
DTXSID901029408
DTXSID30240179
DTXSID701027351
DTXSID4022527
DTXSID3020209
DTXSID601029409
DTXSID0021254
DTXSID601029411
DTXSID801027342
DTXSID501027343
DTXSID401027352
DTXSID6020430
DTXSID1026164
DTXSID1041508
DTXSID4020402
DTXSID2021286
DTXSID3020413
DTXSID7021817
DTXSID9021390
DTXSID6025010
DTXSID1021821
DTXSID5020601
DTXSID30109297
DTXSID1020069
DTXSID60872669
DTXSID401024358
DTXSID301018213
DTXSID1029128
DTXSID1020148
DTXSID001029413
DTXSID101029416
DTXSID1020221
DTXSID0040703
DTXSID3020964
DTXSID801029417