DTXSID1020302
DTXSID6020802
DTXSID0020448
DTXSID8021438
DTXSID4020371
DTXSID5021255
DTXSID3020415
DTXSID3031862
DTXSID6020147
DTXSID0020523
DTXSID7024873
DTXSID7044396
DTXSID3025178
DTXSID7023227
DTXSID4021898
DTXSID1023869
DTXSID0021961
DTXSID6022056
DTXSID9026261
DTXSID8020204
DTXSID8026228
DTXSID9041578
DTXSID5027512
DTXSID1020142
DTXSID40158150
DTXSID2044397
DTXSID3040728
DTXSID2026606
DTXSID6020436
DTXSID1020354
DTXSID6067331
DTXSID5027770
DTXSID2023270
DTXSID5021754
DTXSID8047977
DTXSID4026975
DTXSID7027540
DTXSID8024991
DTXSID4020298
DTXSID9024142
DTXSID4021890
DTXSID6027503
DTXSID4020533
DTXSID6020430
DTXSID3022405
DTXSID2026602
DTXSID8027373
DTXSID6046555
DTXSID0043971
DTXSID4021761
DTXSID6021325
DTXSID9024693
DTXSID40470389
DTXSID7058969
DTXSID9034365
DTXSID3044962
DTXSID9039232
DTXSID0023826
DTXSID80870021
DTXSID501005319
DTXSID8040145
DTXSID9021348
DTXSID4027284
DTXSID4021137
DTXSID60229992
DTXSID5020316
DTXSID9020168
DTXSID1026118
DTXSID4027315
DTXSID8024862
DTXSID1025485
DTXSID4041816
DTXSID80883575
DTXSID4026769
DTXSID2062325
DTXSID5023792
DTXSID5026548
DTXSID60882627
DTXSID8034665
DTXSID5052703
DTXSID0027775
DTXSID20865032
DTXSID9027601
DTXSID3061689
DTXSID1021453
DTXSID2034962
DTXSID7044843
DTXSID1026457
DTXSID8024151
DTXSID0023117
DTXSID7068009
DTXSID9044376
DTXSID9058105
DTXSID7029249
DTXSID60863411
DTXSID501014629
DTXSID1022055
DTXSID50957156
DTXSID9042170
DTXSID90892532
DTXSID90892330
DTXSID70868876
DTXSID1021451
DTXSID90872910
DTXSID40894829
DTXSID00896889
DTXSID7034254
DTXSID00275670
DTXSID2070473
DTXSID0063103
DTXSID6032562
DTXSID5032365
DTXSID2042436
DTXSID3022114
DTXSID3024499
DTXSID4072780
DTXSID7026102
DTXSID40176011
DTXSID9051953
DTXSID30188062
DTXSID0029719
DTXSID101037447
DTXSID6021959
DTXSID3027584
DTXSID5044992
DTXSID4021975
DTXSID30173534
DTXSID9024986
DTXSID90873442
DTXSID1024912
DTXSID10556280
DTXSID1038795
DTXSID7037717
DTXSID4024276
DTXSID5074921
DTXSID0046981
DTXSID7026526
DTXSID4025791
DTXSID20880982
DTXSID8067076
DTXSID5024479
DTXSID7041128
DTXSID0020280
DTXSID2068507
DTXSID9060732
DTXSID8020541
DTXSID6022923
DTXSID5042326
DTXSID4027236
DTXSID4064715
DTXSID70458716
DTXSID3025881
DTXSID0026547
DTXSID3020916
DTXSID7026520
DTXSID0021751
DTXSID20243932
DTXSID1051565
DTXSID4073120
DTXSID0061458
DTXSID0024761
DTXSID7044390
DTXSID9020295
DTXSID5024926
DTXSID7044130
DTXSID90885424
DTXSID5021380
DTXSID6059497
DTXSID70239744
DTXSID3021196
DTXSID10475604
DTXSID30216258
DTXSID6024462
DTXSID8021775
DTXSID40880146
DTXSID3021437
DTXSID2037712
DTXSID5020281
DTXSID00861835
DTXSID80627097
DTXSID5044152
DTXSID1020439
DTXSID0051607
DTXSID9021184
DTXSID30350742
DTXSID8026193
DTXSID5022510
DTXSID7021815
DTXSID3061001
DTXSID6027474
DTXSID8022113
DTXSID90205461
DTXSID3031864
DTXSID9040718
DTXSID0059794
DTXSID20275091
DTXSID40881350
DTXSID6021290
DTXSID1022134
DTXSID4045056
DTXSID70867869
DTXSID9038717
DTXSID0022725
DTXSID8062818
DTXSID9022027
DTXSID40885515
DTXSID3068253
DTXSID5029186
DTXSID6023157
DTXSID60182457
DTXSID3034329
DTXSID0074639
DTXSID301034825
DTXSID101023999
DTXSID4069761
DTXSID6021117
DTXSID60893410
DTXSID2040571
DTXSID701031128
DTXSID0044521
DTXSID301020191
DTXSID9034573
DTXSID801019616
DTXSID30652652
DTXSID5026259
DTXSID0023955
DTXSID6045165
DTXSID10861568
DTXSID0021381
DTXSID5020732
DTXSID3024572
DTXSID6027131
DTXSID8023470
DTXSID1021164
DTXSID5023742
DTXSID8026307
DTXSID6020278
DTXSID7040732
DTXSID2023016
DTXSID60226441
DTXSID70346346
DTXSID3037125
DTXSID7074909
DTXSID4030384
DTXSID3024998
DTXSID2059067
DTXSID9023380
DTXSID3021774
DTXSID5040702
DTXSID2033314
DTXSID6020432
DTXSID0021965
DTXSID8021434
DTXSID3020833
DTXSID9021390
DTXSID70880215
DTXSID0021094
DTXSID5030030
DTXSID3020964
DTXSID9020112
DTXSID1024621
DTXSID8020250
DTXSID0020868
DTXSID1021378
DTXSID2021319
DTXSID1020306
DTXSID5021411
DTXSID8038857
DTXSID3020207
DTXSID70964009
DTXSID5032498
DTXSID0020446
DTXSID30880236
DTXSID6020438
DTXSID0021383
DTXSID1020350
DTXSID9022360
DTXSID00204642
DTXSID0023878
