"","mode","group","neutralMass.x","SMILES","InChIKey","InChI","identifier","neutral_formula","compoundName","compoundName2","individualMoNAScore","IDlevel","...12","ret","mz","LUX_SW_pos_05193","LUX_SW_pos_05196","LUX_SW_pos_05283","LUX_SW_pos_05284","LUX_SW_pos_05285","LUX_SW_pos_05286","adduct","neutralMass.y","LUX_SW_neg_05193","LUX_SW_neg_05196","LUX_SW_neg_05283","LUX_SW_neg_05284","LUX_SW_neg_05285","LUX_SW_neg_05286"
"1","1","M75_R152_55",75.068413911,"C[N+](C)(C)[O-]","UYPYRKYUKCHHIB-UHFFFAOYSA-N","InChI=1S/C3H9NO/c1-4(2,3)5/h1-3H3",1145,"C3H9NO","N,N-dimethylmethanamine oxide","TRIMETHYLAMINE N-OXIDE",0.4598,"3b",28,151.824822,76.0641534787096,0,0,2835378,0,1799074.5,2908210.75,"[M+H]+",75.0568770266188,NA,NA,NA,NA,NA,NA
"2","1","M107_R354_264",107.073499291,"CC1=CC=CC=C1N","RNVCVTLRINQCPJ-UHFFFAOYSA-N","InChI=1S/C7H9N/c1-6-4-2-3-5-7(6)8/h2-5H,8H2,1H3",7242,"C7H9N","2-methylaniline","o-Toluidine",0.96378,"2",102,354.056988,108.080499010723,337787.875,0,0,0,0,741601.75,"[M+H]+",107.073222558632,NA,NA,NA,NA,NA,NA
"3","1","M107_R354_264",107.073499291,"C1=CC=C(C=C1)CN","WGQKYBSKWIADBV-UHFFFAOYSA-N","InChI=1S/C7H9N/c8-6-7-4-2-1-3-5-7/h1-5H,6,8H2",7504,"C7H9N","phenylmethanamine","BENZYLAMINE",0.62628,"3b",102,354.056988,108.080499010723,337787.875,0,0,0,0,741601.75,"[M+H]+",107.073222558632,NA,NA,NA,NA,NA,NA
"4","1","M107_R354_264",107.073499291,"CNC1=CC=CC=C1","AFBPFSWMIHJQDM-UHFFFAOYSA-N","InChI=1S/C7H9N/c1-8-7-5-3-2-4-6-7/h2-6,8H,1H3",7515,"C7H9N","N-methylaniline","N-METHYLANILINE",0.74009,"3a",102,354.056988,108.080499010723,337787.875,0,0,0,0,741601.75,"[M+H]+",107.073222558632,NA,NA,NA,NA,NA,NA
"5","1","M107_R354_264",107.073499291,"CC1=NC(=CC=C1)C","OISVCGZHLKNMSJ-UHFFFAOYSA-N","InChI=1S/C7H9N/c1-6-4-3-5-7(2)8-6/h3-5H,1-2H3",7937,"C7H9N","2,6-dimethylpyridine","2,6-Dimethylpyridine",0.42141,"3b",102,354.056988,108.080499010723,337787.875,0,0,0,0,741601.75,"[M+H]+",107.073222558632,NA,NA,NA,NA,NA,NA
"6","1","M119_R722_363",119.048347172,"C1=CC2=NNN=C2C=C1","QRUDEWIWKLJBPS-UHFFFAOYSA-N","InChI=1S/C6H5N3/c1-2-4-6-5(3-1)7-9-8-6/h1-4H,(H,7,8,9)",7220,"C6H5N3","2H-benzotriazole","1H-Benzotriazole",0.97578,"2",146,721.9746,120.055524595066,75347736,0,2124857.25,3307366,3493360.5,11480002,"[M+H]+",119.048248142976,NA,NA,NA,NA,NA,NA
"7","1","M133_R841_504",133.063997236,"CC1=CC2=NNN=C2C=C1","LRUDIIUSNGCQKF-UHFFFAOYSA-N","InChI=1S/C7H7N3/c1-5-2-3-6-7(4-5)9-10-8-6/h2-4H,1H3,(H,8,9,10)",8705,"C7H7N3","5-methyl-2H-benzotriazole","5-Methyl-1H-benzotriazole",0.91631,"2",195,840.86898,134.070939127477,0,0,4063584.5,8252797,0,0,"[M+H]+",133.063662675386,NA,NA,NA,NA,NA,NA
"8","1","M133_R841_504",133.063997236,"CC1=CC=CC2=NNN=C12","CMGDVUCDZOBDNL-UHFFFAOYSA-N","InChI=1S/C7H7N3/c1-5-3-2-4-6-7(5)9-10-8-6/h2-4H,1H3,(H,8,9,10)",122499,"C7H7N3","4-methyl-2H-benzotriazole","29878-31-7",0.941335,"2",195,840.86898,134.070939127477,0,0,4063584.5,8252797,0,0,"[M+H]+",133.063662675386,NA,NA,NA,NA,NA,NA
"9","1","M164_R1125_828",164.047344113,"C1=CC=C(C(=C1)/C=C/C(=O)O)O","PMOWTIHVNWZYFI-AATRIKPKSA-N","InChI=1S/C9H8O3/c10-8-4-2-1-3-7(8)5-6-9(11)12/h1-6,10H,(H,11,12)/b6-5+",637540,"C9H8O3","(E)-3-(2-hydroxyphenyl)prop-2-enoic acid","2-Hydroxycinnamic acid",0.41039,"3b",291,1125.28815,165.054107984712,807622.125,0,0,0,0,0,"[M+H]+",164.046831532621,NA,NA,NA,NA,NA,NA
"10","1","M164_R1025_831",164.047344113,"C1=CC(=CC=C1/C=C/C(=O)O)O","NGSWKAQJJWESNS-ZZXKWVIFSA-N","InChI=1S/C9H8O3/c10-8-4-1-7(2-5-8)3-6-9(11)12/h1-6,10H,(H,11,12)/b6-3+",637542,"C9H8O3","(E)-3-(4-hydroxyphenyl)prop-2-enoic acid","4-Hydroxycinnamic acid",0.498545,"3b",292,1024.5681,165.054591601572,0,0,1739974.625,1164263.75,1298739.625,0,"[M+H]+",164.047315149481,NA,NA,NA,NA,NA,NA
"11","1","M164_R1025_831",164.047344113,"C1=CC=C(C(=C1)/C=C/C(=O)O)O","PMOWTIHVNWZYFI-AATRIKPKSA-N","InChI=1S/C9H8O3/c10-8-4-2-1-3-7(8)5-6-9(11)12/h1-6,10H,(H,11,12)/b6-5+",637540,"C9H8O3","(E)-3-(2-hydroxyphenyl)prop-2-enoic acid","2-Hydroxycinnamic acid",0.673585,"3b",292,1024.5681,165.054591601572,0,0,1739974.625,1164263.75,1298739.625,0,"[M+H]+",164.047315149481,NA,NA,NA,NA,NA,NA
"12","1","M164_R1025_831",164.047344113,"C1=CC(=CC(=C1)O)/C=C/C(=O)O","KKSDGJDHHZEWEP-SNAWJCMRSA-N","InChI=1S/C9H8O3/c10-8-3-1-2-7(6-8)4-5-9(11)12/h1-6,10H,(H,11,12)/b5-4+",637541,"C9H8O3","(E)-3-(3-hydroxyphenyl)prop-2-enoic acid","3-Hydroxycinnamic acid",0.499755,"3b",292,1024.5681,165.054591601572,0,0,1739974.625,1164263.75,1298739.625,0,"[M+H]+",164.047315149481,NA,NA,NA,NA,NA,NA
"13","1","M180_R987_1032",180.04225873,"CC(=O)OC1=CC=CC=C1C(=O)O","BSYNRYMUTXBXSQ-UHFFFAOYSA-N","InChI=1S/C9H8O4/c1-6(10)13-8-5-3-2-4-7(8)9(11)12/h2-5H,1H3,(H,11,12)",2244,"C9H8O4","2-acetyloxybenzoic acid","aspirin",0.98411,"2",348,987.37221,181.097184967475,0,0,0,0,0,1230366.25,"[M+H]+",180.089908515384,NA,NA,NA,NA,NA,NA
"14","1","M181_R1063_1040",181.00199157,"CSC1=NC2=CC=CC=C2S1","UTBVIMLZIRIFFR-UHFFFAOYSA-N","InChI=1S/C8H7NS2/c1-10-8-9-6-4-2-3-5-7(6)11-8/h2-5H,1H3",11989,"C8H7NS2","2-methylsulfanyl-1,3-benzothiazole","2-(Methylthio)benzothiazole",0.76207,"3a",350,1063.31781,182.008591789059,557918.5625,0,181151.828125,105169.7421875,129395.5390625,515154.84375,"[M+H]+",181.001315336968,NA,NA,NA,NA,NA,NA
"15","1","M191_R619_1169",191.069476538,"COC(=O)NC1=NC2=CC=CC=C2N1","TWFZGCMQGLPBSX-UHFFFAOYSA-N","InChI=1S/C9H9N3O2/c1-14-9(13)12-8-10-6-4-2-3-5-7(6)11-8/h2-5H,1H3,(H2,10,11,12,13)",25429,"C9H9N3O2","methyl N-(1H-benzimidazol-2-yl)carbamate","Carbendazim",0.99928,"2",390,618.82455,192.076227720963,2426394.5,0,0,0,0,4163730,"[M+H]+",191.068951268872,NA,NA,NA,NA,NA,NA
"16","1","M204_R572_1340",204.07211956,"C1CSC2=N[C@H](CN21)C3=CC=CC=C3","HLFSDGLLUJUHTE-SNVBAGLBSA-N","InChI=1S/C11H12N2S/c1-2-4-9(5-3-1)10-8-13-6-7-14-11(13)12-10/h1-5,10H,6-8H2/t10-/m1/s1",26879,"C11H12N2S","(6S)-6-phenyl-2,3,5,6-tetrahydroimidazo[2,1-b][1,3]thiazole","levamisole",0.9374,"2",435,572.122989,205.078962006428,3941387.75,0,0,0,0,0,"[M+H]+",204.071685554338,NA,NA,NA,NA,NA,NA
"17","1","M211_R767_1417",211.14331018,"CCNC1=NC(=O)NC(=N1)NC(C)(C)C","OYTCZOJKXCTBHG-UHFFFAOYSA-N","InChI=1S/C9H17N5O/c1-5-10-6-11-7(13-8(15)12-6)14-9(2,3)4/h5H2,1-4H3,(H3,10,11,12,13,14,15)",135495928,"C9H17N5O","6-(tert-butylamino)-4-(ethylamino)-1H-1,3,5-triazin-2-one","Terbutylazine-2-hydroxy",0.99923,"2",453,766.5156,212.127614716389,0,0,0,0,0,2869781,"[M+H]+",211.120338264298,NA,NA,NA,NA,NA,NA
"18","1","M232_R865_1694",232.157563266,"CCC(=O)N(C1CCNCC1)C2=CC=CC=C2","PMCBDBWCQQBSRJ-UHFFFAOYSA-N","InChI=1S/C14H20N2O/c1-2-14(17)16(12-6-4-3-5-7-12)13-8-10-15-11-9-13/h3-7,13,15H,2,8-11H2,1H3",259381,"C14H20N2O","N-phenyl-N-piperidin-4-ylpropanamide","Norfentanyl",0.97917,"2",545,864.9045,233.163946282343,453231.59375,178367.171875,0,57421.984375,98332.9296875,474447.0625,"[M+H]+",232.156669830252,NA,NA,NA,NA,NA,NA
"19","1","M236_R947_1738",236.094963011,"C1=CC=C2C(=C1)C=CC3=CC=CC=C3N2C(=O)N","FFGPTBGBLSHEPO-UHFFFAOYSA-N","InChI=1S/C15H12N2O/c16-15(18)17-13-7-3-1-5-11(13)9-10-12-6-2-4-8-14(12)17/h1-10H,(H2,16,18)",2554,"C15H12N2O","benzo[b][1]benzazepine-11-carboxamide","carbamazepine",0.99971,"2",560,946.7241,237.117275923357,15018278,6118328.5,0,0,3197295.5,5523062,"[M+H]+",236.109999471266,NA,NA,NA,NA,NA,NA
"20","1","M245_R653_1868",245.11642673,"CC1=C(C(=O)N(N1C)C2=CC=CC=C2)NC(=O)C","OIAGWXKSCXPNNZ-UHFFFAOYSA-N","InChI=1S/C13H15N3O2/c1-9-12(14-10(2)17)13(18)16(15(9)3)11-7-5-4-6-8-11/h4-8H,1-3H3,(H,14,17)",65743,"C13H15N3O2","N-(1,5-dimethyl-3-oxo-2-phenylpyrazol-4-yl)acetamide","4-Acetamidoantipyrine",0.99703,"2",590,652.5933,246.122744960429,5448037.5,2327229,930429.5625,655701.875,1024504.375,2682182.75,"[M+H]+",245.115468508338,NA,NA,NA,NA,NA,NA
"21","1","M252_R802_1963",252.0236452,"C1CSC(=NC#N)N1CC2=CN=C(C=C2)Cl","HOKKPVIRMVDYPB-UHFFFAOYSA-N","InChI=1S/C10H9ClN4S/c11-9-2-1-8(5-13-9)6-15-3-4-16-10(15)14-7-12/h1-2,5H,3-4,6H2",115224,"C10H9ClN4S","[3-[(6-chloropyridin-3-yl)methyl]-1,3-thiazolidin-2-ylidene]cyanamide","Thiacloprid",0.99808,"2",619,801.98445,252.988092837563,0,871422.5,0,0,0,0,"[M+H]+",251.980816385472,NA,NA,NA,NA,NA,NA
"22","1","M252_R861_1967",252.08987763,"C1=CC=C(C=C1)C2(C(=O)NC(=O)N2)C3=CC=CC=C3","CXOFVDLJLONNDW-UHFFFAOYSA-N","InChI=1S/C15H12N2O2/c18-13-15(17-14(19)16-13,11-7-3-1-4-8-11)12-9-5-2-6-10-12/h1-10H,(H2,16,17,18,19)",1775,"C15H12N2O2","5,5-diphenylimidazolidine-2,4-dione","phenytoin",0.41885,"3b",621,860.50776,253.097048833404,1403333.375,0,0,0,0,0,"[M+H]+",252.089772381314,NA,NA,NA,NA,NA,NA
"23","1","M255_R770_1999",255.0078506,"C1=CC(=C(C(=C1)Cl)Cl)C2=C(N=C(N=N2)N)N","PYZRQGJRPPTADH-UHFFFAOYSA-N","InChI=1S/C9H7Cl2N5/c10-5-3-1-2-4(6(5)11)7-8(12)14-9(13)16-15-7/h1-3H,(H4,12,13,14,16)",3878,"C9H7Cl2N5","6-(2,3-dichlorophenyl)-1,2,4-triazine-3,5-diamine","lamotrigine",0.77499,"3a",626,769.84755,256.093363981046,0,0,0,3337423,7423465.5,0,"[M+H]+",255.086087528955,NA,NA,NA,NA,NA,NA
"24","1","M263_R745_2101",263.18852904,"CN(C)C[C@H]1CCCC[C@@]1(C2=CC(=CC=C2)OC)O","TVYLLZQTGLZFBW-ZBFHGGJFSA-N","InChI=1S/C16H25NO2/c1-17(2)12-14-7-4-5-10-16(14,18)13-8-6-9-15(11-13)19-3/h6,8-9,11,14,18H,4-5,7,10,12H2,1-3H3/t14-,16+/m1/s1",33741,"C16H25NO2","(1R,2R)-2-[(dimethylamino)methyl]-1-(3-methoxyphenyl)cyclohexan-1-ol","Tramadol",0.99998,"2",653,745.43553,264.158441567199,54998528,11462034,0,4475996,7266747.5,0,"[M+H]+",263.151165115109,NA,NA,NA,NA,NA,NA
"25","1","M263_R745_2101",263.18852904,"CN(C)CC(C1=CC=C(C=C1)O)C2(CCCCC2)O","KYYIDSXMWOZKMP-UHFFFAOYSA-N","InChI=1S/C16H25NO2/c1-17(2)12-15(13-6-8-14(18)9-7-13)16(19)10-4-3-5-11-16/h6-9,15,18-19H,3-5,10-12H2,1-2H3",125017,"C16H25NO2","4-[2-(dimethylamino)-1-(1-hydroxycyclohexyl)ethyl]phenol","Desvenlafaxine",0.96159,"2",653,745.43553,264.158441567199,54998528,11462034,0,4475996,7266747.5,0,"[M+H]+",263.151165115109,NA,NA,NA,NA,NA,NA
"26","1","M265_R741_2124",265.157897619,"CN1CCN2C(C1)C3=CC=CC=C3CC4=C2N=CC=C4","RONZAEMNMFQXRA-UHFFFAOYSA-N","InChI=1S/C17H19N3/c1-19-9-10-20-16(12-19)15-7-3-2-5-13(15)11-14-6-4-8-18-17(14)20/h2-8,16H,9-12H2,1H3",4205,"C17H19N3","5-methyl-2,5,19-triazatetracyclo[13.4.0.02,7.08,13]nonadeca-1(15),8,10,12,16,18-hexaene","mirtazapine",0.99843,"2",658,741.31494,266.140357960785,2550846.75,0,0,0,0,0,"[M+H]+",265.133081508694,NA,NA,NA,NA,NA,NA
"27","1","M268_R713_2167",268.0978555,"C1COCCN1CCNC(=O)C2=CC=C(C=C2)Cl","YHXISWVBGDMDLQ-UHFFFAOYSA-N","InChI=1S/C13H17ClN2O2/c14-12-3-1-11(2-4-12)13(17)15-5-6-16-7-9-18-10-8-16/h1-4H,5-10H2,(H,15,17)",4235,"C13H17ClN2O2","4-chloro-N-(2-morpholin-4-ylethyl)benzamide","moclobemide",0.99988,"2",661,712.70601,269.127412877561,992997.375,0,451600.09375,317869.40625,0,593834.4375,"[M+H]+",268.12013642547,NA,NA,NA,NA,NA,NA
"28","1","M278_R1016_2284",278.086052095,"C1=CC=C(C=C1)P(=O)(C2=CC=CC=C2)C3=CC=CC=C3","FIQMHBFVRAXMOP-UHFFFAOYSA-N","InChI=1S/C18H15OP/c19-20(16-10-4-1-5-11-16,17-12-6-2-7-13-17)18-14-8-3-9-15-18/h1-15H",13097,"C18H15OP","diphenylphosphorylbenzene","TRIPHENYLPHOSPHINE OXIDE",0.79973,"3a",690,1016.21304,279.12623500197,4554461.5,0,6004825.5,0,0,0,"[M+H]+",278.118958549879,NA,NA,NA,NA,NA,NA
"29","1","M278_R1144_2286",278.15180918,"CCCCOC(=O)C1=CC=CC=C1C(=O)OCCCC","DOIRQSBPFJWKBE-UHFFFAOYSA-N","InChI=1S/C16H22O4/c1-3-5-11-19-15(17)13-9-7-8-10-14(13)16(18)20-12-6-4-2/h7-10H,3-6,11-12H2,1-2H3",3026,"C16H22O4","dibutyl benzene-1,2-dicarboxylate","dibutyl phthalate",0.99506,"2",691,1144.22148,279.157972352185,11001477,0,7738589,0,0,0,"[M+H]+",278.150695900094,NA,NA,NA,NA,NA,NA
"30","1","M290_R650_2450",290.13789045,"COC1=CC(=CC(=C1OC)OC)CC2=CN=C(N=C2N)N","IEDVJHCEMCRBQM-UHFFFAOYSA-N","InChI=1S/C14H18N4O3/c1-19-10-5-8(6-11(20-2)12(10)21-3)4-9-7-17-14(16)18-13(9)15/h5-7H,4H2,1-3H3,(H4,15,16,17,18)",5578,"C14H18N4O3","5-[(3,4,5-trimethoxyphenyl)methyl]pyrimidine-2,4-diamine","trimethoprim",0.95945,"2",729,650.13753,291.143930735965,2252134.5,0,0,0,0,0,"[M+H]+",290.136654283874,NA,NA,NA,NA,NA,NA
"31","1","M290_R847_2451",290.199428076,"CC(C)C(CCCNC)(C#N)C1=CC(=C(C=C1)OC)OC","WLOBUUJURNEQCL-UHFFFAOYSA-N","InChI=1S/C17H26N2O2/c1-13(2)17(12-18,9-6-10-19-3)14-7-8-15(20-4)16(11-14)21-5/h7-8,11,13,19H,6,9-10H2,1-5H3",93168,"C17H26N2O2","2-(3,4-dimethoxyphenyl)-5-(methylamino)-2-propan-2-ylpentanenitrile","D-617",0.98164,"2",730,846.64464,291.20533967861,2958826.25,0,0,0,0,1211770.875,"[M+H]+",290.198063226519,NA,NA,NA,NA,NA,NA
"32","1","M306_R783_2685",306.10406535,"C1=CC(=C(C=C1F)F)C(CN2C=NC=N2)(CN3C=NC=N3)O","RFHAOTPXVQNOHP-UHFFFAOYSA-N","InChI=1S/C13H12F2N6O/c14-10-1-2-11(12(15)3-10)13(22,4-20-8-16-6-18-20)5-21-9-17-7-19-21/h1-3,6-9,22H,4-5H2",3365,"C13H12F2N6O","2-(2,4-difluorophenyl)-1,3-bis(1,2,4-triazol-1-yl)propan-2-ol","fluconazole",0.99438,"2",796,782.6637,307.111446022077,2376236.75,0,0,0,0,0,"[M+H]+",306.104169569986,NA,NA,NA,NA,NA,NA
"33","1","M320_R993_2872",320.011933,"C1=CC=C(C(=C1)C2=NC(C(=O)NC3=C2C=C(C=C3)Cl)O)Cl","DIWRORZWFLOCLC-UHFFFAOYSA-N","InChI=1S/C15H10Cl2N2O2/c16-8-5-6-12-10(7-8)13(19-15(21)14(20)18-12)9-3-1-2-4-11(9)17/h1-7,15,21H,(H,18,20)",3958,"C15H10Cl2N2O2","7-chloro-5-(2-chlorophenyl)-3-hydroxy-1,3-dihydro-1,4-benzodiazepin-2-one","lorazepam",0.92956,"2",850,992.56587,321.018022335543,537630.125,0,0,0,0,0,"[M+H]+",320.010745883452,NA,NA,NA,NA,NA,NA
"34","1","M369_R644_3575",369.17222752,"CCN1CCCC1CNC(=O)C2=CC(=C(C=C2OC)N)S(=O)(=O)CC","NTJOBXMMWNYJFB-UHFFFAOYSA-N","InChI=1S/C17H27N3O4S/c1-4-20-8-6-7-12(20)11-19-17(21)13-9-16(25(22,23)5-2)14(18)10-15(13)24-3/h9-10,12H,4-8,11,18H2,1-3H3,(H,19,21)",2159,"C17H27N3O4S","4-amino-N-[(1-ethylpyrrolidin-2-yl)methyl]-5-ethylsulfonyl-2-methoxybenzamide","amisulpride",0.99526,"2",1040,643.54515,370.178143137452,14312234,0,0,0,0,0,"[M+H]+",369.170866685362,NA,NA,NA,NA,NA,NA
"35","1","M379_R789_3709",379.24710654,"CCN(CC)C(=O)NC1=CC(=C(C=C1)OCC(CNC(C)(C)C)O)C(=O)C","JOATXPAWOHTVSZ-UHFFFAOYSA-N","InChI=1S/C20H33N3O4/c1-7-23(8-2)19(26)22-15-9-10-18(17(11-15)14(3)24)27-13-16(25)12-21-20(4,5)6/h9-11,16,21,25H,7-8,12-13H2,1-6H3,(H,22,26)",2663,"C20H33N3O4","3-[3-acetyl-4-[3-(tert-butylamino)-2-hydroxypropoxy]phenyl]-1,1-diethylurea","celiprolol",0.99429,"2",1091,788.54691,380.25307639339,5543083.5,0,0,0,0,8652887,"[M+H]+",379.2457999413,NA,NA,NA,NA,NA,NA
"36","1","M407_R771_4125",407.11807909,"C1CN2C(=NN=C2C(F)(F)F)CN1C(=O)C[C@@H](CC3=CC(=C(C=C3F)F)F)N","MFFMDFFZMYYVKS-SECBINFHSA-N","InChI=1S/C16H15F6N5O/c17-10-6-12(19)11(18)4-8(10)3-9(23)5-14(28)26-1-2-27-13(7-26)24-25-15(27)16(20,21)22/h4,6,9H,1-3,5,7,23H2/t9-/m1/s1",4369359,"C16H15F6N5O","(3R)-3-amino-1-[3-(trifluoromethyl)-6,8-dihydro-5H-[1,2,4]triazolo[4,3-a]pyrazin-7-yl]-4-(2,4,5-trifluorophenyl)butan-1-one","Sitagliptin",0.9888,"2",1235,770.97624,408.169947536839,7561229,0,0,0,0,0,"[M+H]+",407.162671084748,NA,NA,NA,NA,NA,NA
"37","1","M414_R862_4235",414.13781148,"C1CCNC(C1)CNC(=O)C2=C(C=CC(=C2)OCC(F)(F)F)OCC(F)(F)F","DJBNUMBKLMJRSA-UHFFFAOYSA-N","InChI=1S/C17H20F6N2O3/c18-16(19,20)9-27-12-4-5-14(28-10-17(21,22)23)13(7-12)15(26)25-8-11-3-1-2-6-24-11/h4-5,7,11,24H,1-3,6,8-10H2,(H,25,26)",3356,"C17H20F6N2O3","N-(piperidin-2-ylmethyl)-2,5-bis(2,2,2-trifluoroethoxy)benzamide","flecainide",0.99712,"2",1281,862.1097,415.167630938553,9881253,0,0,0,0,8306380.5,"[M+H]+",414.160354486463,NA,NA,NA,NA,NA,NA
"38","1","M424_R874_4394",424.179871,"CCC[C@@H]1C[C@H](N(C1)C)C(=O)N[C@@H]([C@@H]2[C@@H]([C@@H]([C@H]([C@H](O2)SC)O)O)O)[C@H](C)Cl","KDLRVYVGXIQJDK-AWPVFWJPSA-N","InChI=1S/C18H33ClN2O5S/c1-5-6-10-7-11(21(3)8-10)17(25)20-12(9(2)19)16-14(23)13(22)15(24)18(26-16)27-4/h9-16,18,22-24H,5-8H2,1-4H3,(H,20,25)/t9-,10+,11-,12+,13-,14+,15+,16+,18+/m0/s1",446598,"C18H33ClN2O5S","(2S,4R)-N-[(1S,2S)-2-chloro-1-[(2R,3R,4S,5R,6R)-3,4,5-trihydroxy-6-methylsulfanyloxan-2-yl]propyl]-1-methyl-4-propylpyrrolidine-2-carboxamide","clindamycin",0.99908,"2",1354,874.18218,425.185822453933,505627.625,0,0,0,0,0,"[M+H]+",424.178546001843,NA,NA,NA,NA,NA,NA
"39","1","M436_R1092_4564",435.9387063,"C1=C(C=C(C(=C1Cl)N2C(=C(C(=N2)C#N)S(=O)C(F)(F)F)N)Cl)C(F)(F)F","ZOCSXAVNDGMNBV-UHFFFAOYSA-N","InChI=1S/C12H4Cl2F6N4OS/c13-5-1-4(11(15,16)17)2-6(14)8(5)24-10(22)9(7(3-21)23-24)26(25)12(18,19)20/h1-2H,22H2",3352,"C12H4Cl2F6N4OS","5-amino-1-[2,6-dichloro-4-(trifluoromethyl)phenyl]-4-(trifluoromethylsulfinyl)pyrazole-3-carbonitrile","fipronil",0.94977,"2",1432,1091.90442,436.945676952925,61089.20703125,174337.640625,0,0,0,0,"[M+H]+",435.938400500835,NA,NA,NA,NA,NA,NA
"40","2","M119_R722_363",119.048347172,"C1=CC2=NNN=C2C=C1","QRUDEWIWKLJBPS-UHFFFAOYSA-N","InChI=1S/C6H5N3/c1-2-4-6-5(3-1)7-9-8-6/h1-4H,(H,7,8,9)",7220,"C6H5N3","2H-benzotriazole","1H-Benzotriazole",0.97578,"2",54,721.9746,118.040971690885,NA,NA,NA,NA,NA,NA,"[M-H]-",119.048248142976,0,0,1086578.375,1737112.875,1722698.75,0
"41","2","M122_R697_395",122.03677943,"C1=CC(=CC=C1C=O)O","RGHHSNMVTDWUBI-UHFFFAOYSA-N","InChI=1S/C7H6O2/c8-5-6-1-3-7(9)4-2-6/h1-5,9H",126,"C7H6O2","4-hydroxybenzaldehyde","4-hydroxybenzaldehyde",0.97024,"2",60,697.32471,121.029460416881,NA,NA,NA,NA,NA,NA,"[M-H]-",122.036736868972,2236201.25,1216408.125,780645.875,827960.8125,1125469.125,970811.4375
"42","2","M133_R841_504",133.063997236,"CC1=CC2=NNN=C2C=C1","LRUDIIUSNGCQKF-UHFFFAOYSA-N","InChI=1S/C7H7N3/c1-5-2-3-6-7(4-5)9-10-8-6/h2-4H,1H3,(H,8,9,10)",8705,"C7H7N3","5-methyl-2H-benzotriazole","5-Methyl-1H-benzotriazole",0.91631,"2",72,840.86898,132.056386223295,NA,NA,NA,NA,NA,NA,"[M-H]-",133.063662675386,0,0,989480.375,2738661,2191992.25,0
"43","2","M133_R841_504",133.063997236,"CC1=CC=CC2=NNN=C12","CMGDVUCDZOBDNL-UHFFFAOYSA-N","InChI=1S/C7H7N3/c1-5-3-2-4-6-7(5)9-10-8-6/h2-4H,1H3,(H,8,9,10)",122499,"C7H7N3","4-methyl-2H-benzotriazole","29878-31-7",0.941335,"2",72,840.86898,132.056386223295,NA,NA,NA,NA,NA,NA,"[M-H]-",133.063662675386,0,0,989480.375,2738661,2191992.25,0
"44","2","M138_R120_553",138.042927438,"C1=C(NC=N1)/C=C/C(=O)O","LOIYMIARKYCTBW-OWOJBTEDSA-N","InChI=1S/C6H6N2O2/c9-6(10)2-1-5-3-7-4-8-5/h1-4H,(H,7,8)(H,9,10)/b2-1+",736715,"C6H6N2O2","(E)-3-(1H-imidazol-5-yl)prop-2-enoic acid","urocanic acid",0.99906,"2",80,119.532978,137.039563194654,NA,NA,NA,NA,NA,NA,"[M-H]-",138.046839646744,0,0,688021.25,1717443.875,0,779636.9375
"45","2","M138_R1173_559",138.031694049,"C1=CC=C(C(=C1)C(=O)O)O","YGSDEFSMJLZEOE-UHFFFAOYSA-N","InChI=1S/C7H6O3/c8-6-4-2-1-3-5(6)7(9)10/h1-4,8H,(H,9,10)",338,"C7H6O3","2-hydroxybenzoic acid","salicylic acid",0.99798,"2",81,1173.3246,137.133365937949,NA,NA,NA,NA,NA,NA,"[M-H]-",138.140642390039,0,0,0,277922.28125,0,0
"46","2","M138_R1173_559",138.031694049,"C1=CC(=CC=C1C(=O)O)O","FJKROLUGYXJWQN-UHFFFAOYSA-N","InChI=1S/C7H6O3/c8-6-3-1-5(2-4-6)7(9)10/h1-4,8H,(H,9,10)",135,"C7H6O3","4-hydroxybenzoic acid","4-HYDROXYBENZOIC ACID",0.99798,"2",81,1173.3246,137.133365937949,NA,NA,NA,NA,NA,NA,"[M-H]-",138.140642390039,0,0,0,277922.28125,0,0
"47","2","M138_R1173_559",138.031694049,"C1=CC(=CC(=C1)O)C(=O)O","IJFXRHURBJZNAO-UHFFFAOYSA-N","InChI=1S/C7H6O3/c8-6-3-1-2-5(4-6)7(9)10/h1-4,8H,(H,9,10)",7420,"C7H6O3","3-hydroxybenzoic acid","3-Hydroxybenzoic acid",0.99781,"2",81,1173.3246,137.133365937949,NA,NA,NA,NA,NA,NA,"[M-H]-",138.140642390039,0,0,0,277922.28125,0,0
"48","2","M151_R889_677",151.00918496,"C1=CC=C2C(=C1)NC(=O)S2","YEDUAINPPJYDJZ-UHFFFAOYSA-N","InChI=1S/C7H5NOS/c9-7-8-5-3-1-2-4-6(5)10-7/h1-4H,(H,8,9)",13625,"C7H5NOS","3H-1,3-benzothiazol-2-one","Benzothiazolone",0.87084,"3a",95,888.82632,150.001622379988,NA,NA,NA,NA,NA,NA,"[M-H]-",151.008898832079,3668163.75,2900405.5,0,0,0,3904901.25
"49","2","M164_R1025_831",164.047344113,"C1=CC(=CC=C1/C=C/C(=O)O)O","NGSWKAQJJWESNS-ZZXKWVIFSA-N","InChI=1S/C9H8O3/c10-8-4-1-7(2-5-8)3-6-9(11)12/h1-6,10H,(H,11,12)/b6-3+",637542,"C9H8O3","(E)-3-(4-hydroxyphenyl)prop-2-enoic acid","4-Hydroxycinnamic acid",0.498545,"3b",115,1024.5681,163.040038697391,NA,NA,NA,NA,NA,NA,"[M-H]-",164.047315149481,0,1249048.125,0,0,0,0
"50","2","M164_R1025_831",164.047344113,"C1=CC=C(C(=C1)/C=C/C(=O)O)O","PMOWTIHVNWZYFI-AATRIKPKSA-N","InChI=1S/C9H8O3/c10-8-4-2-1-3-7(8)5-6-9(11)12/h1-6,10H,(H,11,12)/b6-5+",637540,"C9H8O3","(E)-3-(2-hydroxyphenyl)prop-2-enoic acid","2-Hydroxycinnamic acid",0.673585,"3b",115,1024.5681,163.040038697391,NA,NA,NA,NA,NA,NA,"[M-H]-",164.047315149481,0,1249048.125,0,0,0,0
"51","2","M164_R1025_831",164.047344113,"C1=CC(=CC(=C1)O)/C=C/C(=O)O","KKSDGJDHHZEWEP-SNAWJCMRSA-N","InChI=1S/C9H8O3/c10-8-3-1-2-7(6-8)4-5-9(11)12/h1-6,10H,(H,11,12)/b5-4+",637541,"C9H8O3","(E)-3-(3-hydroxyphenyl)prop-2-enoic acid","3-Hydroxycinnamic acid",0.499755,"3b",115,1024.5681,163.040038697391,NA,NA,NA,NA,NA,NA,"[M-H]-",164.047315149481,0,1249048.125,0,0,0,0
"52","2","M178_R680_1010",178.02660867,"C1=CC(=O)OC2=CC(=C(C=C21)O)O","ILEDWLMCKZNDJK-UHFFFAOYSA-N","InChI=1S/C9H6O4/c10-6-3-5-1-2-9(12)13-8(5)4-7(6)11/h1-4,10-11H",5281416,"C9H6O4","6,7-dihydroxychromen-2-one","Esculetin",0.99867,"2",147,679.5447,177.038539076397,NA,NA,NA,NA,NA,NA,"[M-H]-",178.045815528488,2853305,0,1688579,0,0,1932715.875
"53","2","M178_R680_1010",178.02660867,"C1=CC(=C(C2=C1C=CC(=O)O2)O)O","ATEFPOUAMCWAQS-UHFFFAOYSA-N","InChI=1S/C9H6O4/c10-6-3-1-5-2-4-7(11)13-9(5)8(6)12/h1-4,10,12H",5280569,"C9H6O4","7,8-dihydroxychromen-2-one","daphnetin",0.44925,"3b",147,679.5447,177.038539076397,NA,NA,NA,NA,NA,NA,"[M-H]-",178.045815528488,2853305,0,1688579,0,0,1932715.875
"54","2","M198_R966_1263",198.0276713,"CC1=CC(=CC(=C1O)[N+](=O)[O-])[N+](=O)[O-]","ZXVONLUNISGICL-UHFFFAOYSA-N","InChI=1S/C7H6N2O5/c1-4-2-5(8(11)12)3-6(7(4)10)9(13)14/h2-3,10H,1H3",10800,"C7H6N2O5","2-methyl-4,6-dinitrophenol","2-Methyl-4,6-dinitrophenol",0.43037,"3b",207,966.12462,197.020258501242,NA,NA,NA,NA,NA,NA,"[M-H]-",198.027534953333,0,0,0,0,0,1386932.625
"55","2","M214_R1067_1466",214.0396719,"CC1=C(C=CC(=C1)Cl)OC(C)C(=O)O","WNTGYJSOUMFZEP-UHFFFAOYSA-N","InChI=1S/C10H11ClO3/c1-6-5-8(11)3-4-9(6)14-7(2)10(12)13/h3-5,7H,1-2H3,(H,12,13)",7153,"C10H11ClO3","2-(4-chloro-2-methylphenoxy)propanoic acid","MECOPROP",0.99981,"2",240,1066.67886,213.092063625256,NA,NA,NA,NA,NA,NA,"[M-H]-",214.099340077347,0,0,0,0,0,3725494.5
"56","2","M252_R802_1963",252.0236452,"C1CSC(=NC#N)N1CC2=CN=C(C=C2)Cl","HOKKPVIRMVDYPB-UHFFFAOYSA-N","InChI=1S/C10H9ClN4S/c11-9-2-1-8(5-13-9)6-15-3-4-16-10(15)14-7-12/h1-2,5H,3-4,6H2",115224,"C10H9ClN4S","[3-[(6-chloropyridin-3-yl)methyl]-1,3-thiazolidin-2-ylidene]cyanamide","Thiacloprid",0.99808,"2",339,801.98445,250.973539933381,NA,NA,NA,NA,NA,NA,"[M-H]-",251.980816385472,0,0,0,0,0,78121.3828125
"57","2","M252_R861_1967",252.08987763,"C1=CC=C(C=C1)C2(C(=O)NC(=O)N2)C3=CC=CC=C3","CXOFVDLJLONNDW-UHFFFAOYSA-N","InChI=1S/C15H12N2O2/c18-13-15(17-14(19)16-13,11-7-3-1-4-8-11)12-9-5-2-6-10-12/h1-10H,(H2,16,17,18,19)",1775,"C15H12N2O2","5,5-diphenylimidazolidine-2,4-dione","phenytoin",0.41885,"3b",341,860.50776,251.082495929223,NA,NA,NA,NA,NA,NA,"[M-H]-",252.089772381314,740792.3125,0,0,0,0,0
"58","2","M253_R723_1974",253.05211239,"CC1=CC(=NO1)NS(=O)(=O)C2=CC=C(C=C2)N","JLKIGFTWXXRPMT-UHFFFAOYSA-N","InChI=1S/C10H11N3O3S/c1-7-6-10(12-16-7)13-17(14,15)9-4-2-8(11)3-5-9/h2-6H,11H2,1H3,(H,12,13)",5329,"C10H11N3O3S","4-amino-N-(5-methyl-1,2-oxazol-3-yl)benzenesulfonamide","sulfamethoxazole",0.66222,"3b",344,723.15099,252.059586942607,NA,NA,NA,NA,NA,NA,"[M-H]-",253.066863394697,0,0,0,0,0,849796.25
"59","2","M295_R1115_2512",295.016684,"C1=CC=C(C(=C1)CC(=O)O)NC2=C(C=CC=C2Cl)Cl","DCOPUUMXTXDBNB-UHFFFAOYSA-N","InChI=1S/C14H11Cl2NO2/c15-10-5-3-6-11(16)14(10)17-12-7-2-1-4-9(12)8-13(18)19/h1-7,17H,8H2,(H,18,19)",3033,"C14H11Cl2NO2","2-[2-(2,6-dichloroanilino)phenyl]acetic acid","diclofenac",0.99663,"2",481,1115.30112,294.009236551209,NA,NA,NA,NA,NA,NA,"[M-H]-",295.016513003299,11807106,0,0,0,0,0
"60","2","M297_R490_2543",296.9644758,"C1NC2=CC(=C(C=C2S(=O)(=O)N1)S(=O)(=O)N)Cl","JZUFKLXOESDKRF-UHFFFAOYSA-N","InChI=1S/C7H8ClN3O4S2/c8-4-1-5-7(2-6(4)16(9,12)13)17(14,15)11-3-10-5/h1-2,10-11H,3H2,(H2,9,12,13)",3639,"C7H8ClN3O4S2","6-chloro-1,1-dioxo-3,4-dihydro-2H-1lambda6,2,4-benzothiadiazine-7-sulfonamide","hydrochlorothiazide",0.99301,"2",487,489.722145,295.957061248619,NA,NA,NA,NA,NA,NA,"[M-H]-",296.96433770071,2197261,0,0,0,0,0
"61","2","M300_R967_2585",299.95026852,"C(C(C(F)(F)S(=O)(=O)O)(F)F)(C(F)(F)F)(F)F","JGTNAGYHADQMCM-UHFFFAOYSA-N","InChI=1S/C4HF9O3S/c5-1(6,3(9,10)11)2(7,8)4(12,13)17(14,15)16/h(H,14,15,16)",67815,"C4HF9O3S","1,1,2,2,3,3,4,4,4-nonafluorobutane-1-sulfonic acid","perfluorobutanesulfonic acid",0.45039,"3b",503,966.9168,298.942940875085,NA,NA,NA,NA,NA,NA,"[M-H]-",299.950217327176,0,0,0,1079973.25,0,0
"62","2","M320_R993_2872",320.011933,"C1=CC=C(C(=C1)C2=NC(C(=O)NC3=C2C=C(C=C3)Cl)O)Cl","DIWRORZWFLOCLC-UHFFFAOYSA-N","InChI=1S/C15H10Cl2N2O2/c16-8-5-6-12-10(7-8)13(19-15(21)14(20)18-12)9-3-1-2-4-11(9)17/h1-7,15,21H,(H,18,20)",3958,"C15H10Cl2N2O2","7-chloro-5-(2-chlorophenyl)-3-hydroxy-1,3-dihydro-1,4-benzodiazepin-2-one","lorazepam",0.92956,"2",576,992.56587,319.003469431362,NA,NA,NA,NA,NA,NA,"[M-H]-",320.010745883452,491150.6875,0,0,0,0,0
"63","2","M330_R886_3026",330.0077203,"C1=COC(=C1)CNC2=CC(=C(C=C2C(=O)O)S(=O)(=O)N)Cl","ZZUFCTLCJUWOSV-UHFFFAOYSA-N","InChI=1S/C12H11ClN2O5S/c13-9-5-10(15-6-7-2-1-3-20-7)8(12(16)17)4-11(9)21(14,18)19/h1-5,15H,6H2,(H,16,17)(H2,14,18,19)",3440,"C12H11ClN2O5S","4-chloro-2-(furan-2-ylmethylamino)-5-sulfamoylbenzoic acid","furosemide",0.93245,"2",605,885.68781,329.00034366302,NA,NA,NA,NA,NA,NA,"[M-H]-",330.007620115111,1720611.125,0,0,0,0,0
"64","2","M436_R1092_4564",435.9387063,"C1=C(C=C(C(=C1Cl)N2C(=C(C(=N2)C#N)S(=O)C(F)(F)F)N)Cl)C(F)(F)F","ZOCSXAVNDGMNBV-UHFFFAOYSA-N","InChI=1S/C12H4Cl2F6N4OS/c13-5-1-4(11(15,16)17)2-6(14)8(5)24-10(22)9(7(3-21)23-24)26(25)12(18,19)20/h1-2H,22H2",3352,"C12H4Cl2F6N4OS","5-amino-1-[2,6-dichloro-4-(trifluoromethyl)phenyl]-4-(trifluoromethylsulfinyl)pyrazole-3-carbonitrile","fipronil",0.94977,"2",906,1091.90442,434.931124048744,NA,NA,NA,NA,NA,NA,"[M-H]-",435.938400500835,398508.15625,263309.5,89184.234375,243405.046875,188734.84375,319414.75
"65","2","M440_R977_4631",440.15968852,"CCOC1=NC2=CC=CC(=C2N1CC3=CC=C(C=C3)C4=CC=CC=C4C5=NNN=N5)C(=O)O","HTQMVQVXFRQIKW-UHFFFAOYSA-N","InChI=1S/C24H20N6O3/c1-2-33-24-25-20-9-5-8-19(23(31)32)21(20)30(24)14-15-10-12-16(13-11-15)17-6-3-4-7-18(17)22-26-28-29-27-22/h3-13H,2,14H2,1H3,(H,31,32)(H,26,27,28,29)",2541,"C24H20N6O3","2-ethoxy-3-[[4-[2-(2H-tetrazol-5-yl)phenyl]phenyl]methyl]benzimidazole-4-carboxylic acid","candesartan",0.9895,"2",921,976.90635,439.148718856683,NA,NA,NA,NA,NA,NA,"[M-H]-",440.155995308774,0,0,288231.3125,0,0,0
