"","mode","group","neutralMass.x","SMILES","InChIKey","InChI","identifier","neutral_formula","compoundName","compoundName2","individualMoNAScore","IDlevel","...12","ret","mz","LUX_SW_pos_03858","LUX_SW_pos_03859","LUX_SW_pos_03860","LUX_SW_pos_03861","LUX_SW_pos_03971","LUX_SW_pos_03972","LUX_SW_pos_03973","LUX_SW_pos_03974","adduct","neutralMass.y","LUX_SW_neg_03858","LUX_SW_neg_03859","LUX_SW_neg_03860","LUX_SW_neg_03861","LUX_SW_neg_03971","LUX_SW_neg_03972","LUX_SW_neg_03973","LUX_SW_neg_03974"
"1","1","M107_R151_265",107.073499291,"CC1=CC=CC=C1N","RNVCVTLRINQCPJ-UHFFFAOYSA-N","InChI=1S/C7H9N/c1-6-4-2-3-5-7(6)8/h2-5H,8H2,1H3",7242,"C7H9N","2-methylaniline","o-Toluidine",0.81079,"3a",123,150.70752,108.041865214133,53940.4765625,618624.375,101001.1484375,406835.625,1036936.125,0,0,1150959.375,"[M+H]+",107.034588762042,NA,NA,NA,NA,NA,NA,NA,NA
"2","1","M107_R151_265",107.073499291,"CNC1=CC=CC=C1","AFBPFSWMIHJQDM-UHFFFAOYSA-N","InChI=1S/C7H9N/c1-8-7-5-3-2-4-6-7/h2-6,8H,1H3",7515,"C7H9N","N-methylaniline","N-METHYLANILINE",0.76407,"3a",123,150.70752,108.041865214133,53940.4765625,618624.375,101001.1484375,406835.625,1036936.125,0,0,1150959.375,"[M+H]+",107.034588762042,NA,NA,NA,NA,NA,NA,NA,NA
"3","1","M107_R151_265",107.073499291,"CC1=NC(=CC=C1)C","OISVCGZHLKNMSJ-UHFFFAOYSA-N","InChI=1S/C7H9N/c1-6-4-3-5-7(2)8-6/h3-5H,1-2H3",7937,"C7H9N","2,6-dimethylpyridine","2,6-Dimethylpyridine",0.54433,"3b",123,150.70752,108.041865214133,53940.4765625,618624.375,101001.1484375,406835.625,1036936.125,0,0,1150959.375,"[M+H]+",107.034588762042,NA,NA,NA,NA,NA,NA,NA,NA
"4","1","M119_R103_367",119.058243149,"C([C@@H](CO)N)C(=O)O","BUZICZZQJDLXJN-VKHMYHEASA-N","InChI=1S/C4H9NO3/c5-3(2-6)1-4(7)8/h3,6H,1-2,5H2,(H,7,8)/t3-/m0/s1",1502045,"C4H9NO3","(3S)-3-amino-4-hydroxybutanoic acid","D-beta-homoserine",0.61986,"3b",178,102.657873,120.065405092113,0,4630885,0,0,2967559.75,4579595.5,0,0,"[M+H]+",119.058128640022,NA,NA,NA,NA,NA,NA,NA,NA
"5","1","M119_R1744_369",119.058243149,"C([C@@H](CO)N)C(=O)O","BUZICZZQJDLXJN-VKHMYHEASA-N","InChI=1S/C4H9NO3/c5-3(2-6)1-4(7)8/h3,6H,1-2,5H2,(H,7,8)/t3-/m0/s1",1502045,"C4H9NO3","(3S)-3-amino-4-hydroxybutanoic acid","D-beta-homoserine",0.59932,"3b",180,1744.18086,120.065397959683,0,0,3264478.75,0,6928090.5,0,0,0,"[M+H]+",119.058121507592,NA,NA,NA,NA,NA,NA,NA,NA
"6","1","M119_R418_370",119.058243149,"C([C@@H](CO)N)C(=O)O","BUZICZZQJDLXJN-VKHMYHEASA-N","InChI=1S/C4H9NO3/c5-3(2-6)1-4(7)8/h3,6H,1-2,5H2,(H,7,8)/t3-/m0/s1",1502045,"C4H9NO3","(3S)-3-amino-4-hydroxybutanoic acid","D-beta-homoserine",0.61569,"3b",181,417.951798,120.065369526393,0,1613297.625,0,0,3148859.75,0,0,0,"[M+H]+",119.058093074302,NA,NA,NA,NA,NA,NA,NA,NA
"7","1","M119_R721_371",119.048347172,"C1=CC2=NNN=C2C=C1","QRUDEWIWKLJBPS-UHFFFAOYSA-N","InChI=1S/C6H5N3/c1-2-4-6-5(3-1)7-9-8-6/h1-4H,(H,7,8,9)",7220,"C6H5N3","2H-benzotriazole","1H-Benzotriazole",0.95254,"2",182,720.88275,120.079469091471,57968932,139629.40625,1331809.625,136224.890625,577842.5625,3435429.75,3686836.5,12926737,"[M+H]+",119.07219263938,NA,NA,NA,NA,NA,NA,NA,NA
"8","1","M119_R1619_372",119.058243149,"C([C@@H](CO)N)C(=O)O","BUZICZZQJDLXJN-VKHMYHEASA-N","InChI=1S/C4H9NO3/c5-3(2-6)1-4(7)8/h3,6H,1-2,5H2,(H,7,8)/t3-/m0/s1",1502045,"C4H9NO3","(3S)-3-amino-4-hydroxybutanoic acid","D-beta-homoserine",0.61343,"3b",183,1619.44815,120.06537302771,8535587,4025314.25,1405642.75,0,0,1311728.5,0,1299313.75,"[M+H]+",119.05809657562,NA,NA,NA,NA,NA,NA,NA,NA
"9","1","M133_R841_520",133.063997236,"CC1=CC2=NNN=C2C=C1","LRUDIIUSNGCQKF-UHFFFAOYSA-N","InChI=1S/C7H7N3/c1-5-2-3-6-7(4-5)9-10-8-6/h2-4H,1H3,(H,8,9,10)",8705,"C7H7N3","5-methyl-2H-benzotriazole","5-Methyl-1H-benzotriazole",0.97394,"2",260,841.0227,134.071142144084,868454.4375,129180800,0,270645.84375,1194724.875,0,0,1963130.75,"[M+H]+",133.063865691993,NA,NA,NA,NA,NA,NA,NA,NA
"10","1","M133_R841_520",133.063997236,"CC1=CC=CC2=NNN=C12","CMGDVUCDZOBDNL-UHFFFAOYSA-N","InChI=1S/C7H7N3/c1-5-3-2-4-6-7(5)9-10-8-6/h2-4H,1H3,(H,8,9,10)",122499,"C7H7N3","4-methyl-2H-benzotriazole","29878-31-7",0.9995,"2",260,841.0227,134.071142144084,868454.4375,129180800,0,270645.84375,1194724.875,0,0,1963130.75,"[M+H]+",133.063865691993,NA,NA,NA,NA,NA,NA,NA,NA
"11","1","M133_R1582_521",133.063997236,"CC1=CC2=NNN=C2C=C1","LRUDIIUSNGCQKF-UHFFFAOYSA-N","InChI=1S/C7H7N3/c1-5-2-3-6-7(4-5)9-10-8-6/h2-4H,1H3,(H,8,9,10)",8705,"C7H7N3","5-methyl-2H-benzotriazole","5-Methyl-1H-benzotriazole",0.68783,"3b",261,1582.11684,134.071088440207,4197838,2243924,703092.75,2158463.5,210597.890625,288818.8125,2787108.75,3105030.75,"[M+H]+",133.063811988116,NA,NA,NA,NA,NA,NA,NA,NA
"12","1","M133_R1582_521",133.063997236,"CC1=CC=CC2=NNN=C12","CMGDVUCDZOBDNL-UHFFFAOYSA-N","InChI=1S/C7H7N3/c1-5-3-2-4-6-7(5)9-10-8-6/h2-4H,1H3,(H,8,9,10)",122499,"C7H7N3","4-methyl-2H-benzotriazole","29878-31-7",0.71253,"3a",261,1582.11684,134.071088440207,4197838,2243924,703092.75,2158463.5,210597.890625,288818.8125,2787108.75,3105030.75,"[M+H]+",133.063811988116,NA,NA,NA,NA,NA,NA,NA,NA
"13","1","M133_R1582_521",133.063997236,"CN1C2=CC=CC=C2N=N1","HXQHRUJXQJEGER-UHFFFAOYSA-N","InChI=1S/C7H7N3/c1-10-7-5-3-2-4-6(7)8-9-10/h2-5H,1H3",25902,"C7H7N3","1-methylbenzotriazole","1-METHYLBENZOTRIAZOLE",0.54707,"3b",261,1582.11684,134.071088440207,4197838,2243924,703092.75,2158463.5,210597.890625,288818.8125,2787108.75,3105030.75,"[M+H]+",133.063811988116,NA,NA,NA,NA,NA,NA,NA,NA
"14","1","M135_R559_540",135.01427034,"C1=CC=C2C(=C1)N=CS2","IOJUPLGTWVMSFF-UHFFFAOYSA-N","InChI=1S/C7H5NS/c1-2-4-7-6(3-1)8-5-9-7/h1-5H",7222,"C7H5NS","1,3-benzothiazole","BENZOTHIAZOLE",0.42408,"3b",273,558.536178,136.0213980627,0,0,0,0,0,1487570.75,0,0,"[M+H]+",135.014121610609,NA,NA,NA,NA,NA,NA,NA,NA
"15","1","M135_R1746_541",135.01427034,"C1=CC=C2C(=C1)N=CS2","IOJUPLGTWVMSFF-UHFFFAOYSA-N","InChI=1S/C7H5NS/c1-2-4-7-6(3-1)8-5-9-7/h1-5H",7222,"C7H5NS","1,3-benzothiazole","BENZOTHIAZOLE",0.56051,"3b",274,1746.4446,136.02140568415,2046713.375,0,0,0,0,2530845.25,0,0,"[M+H]+",135.014129232059,NA,NA,NA,NA,NA,NA,NA,NA
"16","1","M136_R147_554",136.03851076,"C1=NNC2=C1C(=O)NC=N2","OFCNXPDARWKPPY-UHFFFAOYSA-N","InChI=1S/C5H4N4O/c10-5-3-1-8-9-4(3)6-2-7-5/h1-2H,(H2,6,7,8,9,10)",135401907,"C5H4N4O","1,5-dihydropyrazolo[3,4-d]pyrimidin-4-one","allopurinol",0.99431,"2",279,146.753952,137.045749954135,1167815.125,172721.3125,43638.796875,62092.32421875,0,0,34029.03515625,82260.75,"[M+H]+",136.038473502045,NA,NA,NA,NA,NA,NA,NA,NA
"17","1","M145_R818_633",145.052763847,"C1=CC=C2C(=C1)C(=CN2)C=O","OLNJUISKUQQNIM-UHFFFAOYSA-N","InChI=1S/C9H7NO/c11-6-7-5-10-9-4-2-1-3-8(7)9/h1-6,10H",10256,"C9H7NO","1H-indole-3-carbaldehyde","INDOLE-3-CARBOXALDEHYDE",0.458155,"3b",318,818.29926,146.059884169437,1580673.25,0,0,0,1773300.125,0,0,2140827.25,"[M+H]+",145.052607717346,NA,NA,NA,NA,NA,NA,NA,NA
"18","1","M146_R689_644",146.0579088,"C(CCC(=O)O)CC(=O)O","WNLRTRBMVRJNCN-UHFFFAOYSA-N","InChI=1S/C6H10O4/c7-5(8)3-1-2-4-6(9)10/h1-4H2,(H,7,8)(H,9,10)",196,"C6H10O4","hexanedioic acid","adipic acid",0.71867,"3a",324,688.5045,147.055181433864,223221.71875,989982.8125,187238.53125,107477.4765625,145836.84375,121003.7421875,34993.84765625,761516.125,"[M+H]+",146.047904981774,NA,NA,NA,NA,NA,NA,NA,NA
"19","1","M146_R689_644",146.0579088,"CC(CCC(=O)O)C(=O)O","AQYCMVICBNBXNA-UHFFFAOYSA-N","InChI=1S/C6H10O4/c1-4(6(9)10)2-3-5(7)8/h4H,2-3H2,1H3,(H,7,8)(H,9,10)",12046,"C6H10O4","2-methylpentanedioic acid","2-METHYLGLUTARIC ACID",0.98601,"2",324,688.5045,147.055181433864,223221.71875,989982.8125,187238.53125,107477.4765625,145836.84375,121003.7421875,34993.84765625,761516.125,"[M+H]+",146.047904981774,NA,NA,NA,NA,NA,NA,NA,NA
"20","1","M157_R961_756",157.01974964,"C1=CC=C(C=C1)S(=O)(=O)N","KHBQMWCZKVMBLN-UHFFFAOYSA-N","InChI=1S/C6H7NO2S/c7-10(8,9)6-4-2-1-3-5-6/h1-5H,(H2,7,8,9)",7370,"C6H7NO2S","benzenesulfonamide","BENZENESULFONAMIDE",0.94193,"2",384,961.0605,158.026747254946,0,0,0,448935.78125,0,0,0,0,"[M+H]+",157.019470802855,NA,NA,NA,NA,NA,NA,NA,NA
"21","1","M161_R826_797",161.047678466,"C1=CC=C2C(=C1)C(=CN2)C(=O)O","KMAKOBLIOCQGJP-UHFFFAOYSA-N","InChI=1S/C9H7NO2/c11-9(12)7-5-10-8-4-2-1-3-6(7)8/h1-5,10H,(H,11,12)",69867,"C9H7NO2","1H-indole-3-carboxylic acid","Indole-3-carboxylic acid",0.99812,"2",405,826.40478,162.054819346206,316548.0625,265073.78125,253967.109375,347584.59375,151246.9375,0,0,0,"[M+H]+",161.047542894115,NA,NA,NA,NA,NA,NA,NA,NA
"22","1","M181_R1063_1022",181.00199157,"CSC1=NC2=CC=CC=C2S1","UTBVIMLZIRIFFR-UHFFFAOYSA-N","InChI=1S/C8H7NS2/c1-10-8-9-6-4-2-3-5-7(6)11-8/h2-5H,1H3",11989,"C8H7NS2","2-methylsulfanyl-1,3-benzothiazole","2-(Methylthio)benzothiazole",0.94979,"2",500,1062.56343,182.008867554775,1533995.5,565832.6875,1078311.25,1789856.125,703672.5,434405.90625,391683.8125,475694.75,"[M+H]+",181.001591102684,NA,NA,NA,NA,NA,NA,NA,NA
"23","1","M182_R917_1035",182.07079595,"CCOP(=O)(OCC)OCC","DQWPFSLDHJDLRL-UHFFFAOYSA-N","InChI=1S/C6H15O4P/c1-4-8-11(7,9-5-2)10-6-3/h4-6H2,1-3H3",6535,"C6H15O4P","triethyl phosphate","TRIETHYL PHOSPHATE",0.9957,"2",510,917.25834,183.084399249429,5259666,5786959,3855458,3111889.5,0,0,0,2009273.375,"[M+H]+",182.077122797339,NA,NA,NA,NA,NA,NA,NA,NA
"24","1","M200_R1030_1232",200.0240218,"CC1=C(C=CC(=C1)Cl)OCC(=O)O","WHKUVVPPKQRRBV-UHFFFAOYSA-N","InChI=1S/C9H9ClO3/c1-6-4-7(10)2-3-8(6)13-5-9(11)12/h2-4H,5H2,1H3,(H,11,12)",7204,"C9H9ClO3","2-(4-chloro-2-methylphenoxy)acetic acid","MCPA",0.99441,"2",579,1029.61164,201.090833286888,179117.25,0,0,0,0,0,0,0,"[M+H]+",200.083556834797,NA,NA,NA,NA,NA,NA,NA,NA
"25","1","M202_R882_1257",202.12050905,"C(CCCCC(=O)O)CCCC(=O)O","CXMXRPHRNRROMY-UHFFFAOYSA-N","InChI=1S/C10H18O4/c11-9(12)7-5-3-1-2-4-6-8-10(13)14/h1-8H2,(H,11,12)(H,13,14)",5192,"C10H18O4","decanedioic acid","sebacic acid",0.60271,"3b",585,882.10512,203.090933975229,0,0,0,810510,0,0,0,0,"[M+H]+",202.083657523138,NA,NA,NA,NA,NA,NA,NA,NA
"26","1","M203_R1049_1267",203.131014166,"CCN(C1=CC=CC=C1C)C(=O)/C=C/C","DNTGGZPQPQTDQF-XBXARRHUSA-N","InChI=1S/C13H17NO/c1-4-8-13(15)14(5-2)12-10-7-6-9-11(12)3/h4,6-10H,5H2,1-3H3/b8-4+",688020,"C13H17NO","(E)-N-ethyl-N-(2-methylphenyl)but-2-enamide","crotamiton",0.96046,"2",588,1049.12442,204.080375318755,0,218228.28125,0,255491.140625,0,0,0,0,"[M+H]+",203.073098866664,NA,NA,NA,NA,NA,NA,NA,NA
"27","1","M203_R783_1268",203.11709544,"CC(=CCNC1=NC=NC2=C1NC=N2)C","HYVABZIGRDEKCD-UHFFFAOYSA-N","InChI=1S/C10H13N5/c1-7(2)3-4-11-9-8-10(13-5-12-8)15-6-14-9/h3,5-6H,4H2,1-2H3,(H2,11,12,13,14,15)",92180,"C10H13N5","N-(3-methylbut-2-enyl)-7H-purin-6-amine","2365-40-4",0.90741,"2",589,782.71047,204.124024426501,438286.375,0,0,0,0,0,0,0,"[M+H]+",203.116747974411,NA,NA,NA,NA,NA,NA,NA,NA
"28","1","M211_R765_1347",211.14331018,"CCNC1=NC(=O)NC(=N1)NC(C)(C)C","OYTCZOJKXCTBHG-UHFFFAOYSA-N","InChI=1S/C9H17N5O/c1-5-10-6-11-7(13-8(15)12-6)14-9(2,3)4/h5H2,1-4H3,(H3,10,11,12,13,14,15)",135495928,"C9H17N5O","6-(tert-butylamino)-4-(ethylamino)-1H-1,3,5-triazin-2-one","Terbutylazine-2-hydroxy",0.49759,"3b",627,764.5707,212.150293706804,940350.625,1548876.625,135889.34375,1052289,296352.375,217482.5,364551.5625,1736132.5,"[M+H]+",211.143017254713,NA,NA,NA,NA,NA,NA,NA,NA
"29","1","M232_R1059_1567",232.0170183,"CN(C)C(=O)NC1=CC(=C(C=C1)Cl)Cl","XMTQQYYKAHVGBJ-UHFFFAOYSA-N","InChI=1S/C9H10Cl2N2O/c1-13(2)9(14)12-6-3-4-7(10)8(11)5-6/h3-5H,1-2H3,(H,12,14)",3120,"C9H10Cl2N2O","3-(3,4-dichlorophenyl)-1,1-dimethylurea","diuron",0.56101,"3b",716,1058.8461,233.036099524617,397161.21875,369899.90625,138055.09375,254131.46875,0,0,0,123602.4453125,"[M+H]+",232.028823072527,NA,NA,NA,NA,NA,NA,NA,NA
"30","1","M236_R975_1616",236.094963011,"C1=CC=C2C(=C1)C=CC3=CC=CC=C3N2C(=O)N","FFGPTBGBLSHEPO-UHFFFAOYSA-N","InChI=1S/C15H12N2O/c16-15(18)17-13-7-3-1-5-11(13)9-10-12-6-2-4-8-14(12)17/h1-10H,(H2,16,18)",2554,"C15H12N2O","benzo[b][1]benzazepine-11-carboxamide","carbamazepine",0.98717,"2",738,974.60286,237.101721309375,0,0,0,0,918461.25,0,0,0,"[M+H]+",236.094444857284,NA,NA,NA,NA,NA,NA,NA,NA
"31","1","M241_R942_1664",241.1361168,"CCNC1=NC(=NC(=N1)SC)NC(C)(C)C","IROINLKCQGIITA-UHFFFAOYSA-N","InChI=1S/C10H19N5S/c1-6-11-7-12-8(15-10(2,3)4)14-9(13-7)16-5/h6H2,1-5H3,(H2,11,12,13,14,15)",13450,"C10H19N5S","2-N-tert-butyl-4-N-ethyl-6-methylsulfanyl-1,3,5-triazine-2,4-diamine","Terbutryn",0.99997,"2",758,941.6475,242.080903935138,2876173.25,3467873.5,0,915948.9375,121718.140625,741210.5625,362521.3125,1557639.625,"[M+H]+",241.073627483048,NA,NA,NA,NA,NA,NA,NA,NA
"32","1","M245_R627_1716",245.11642673,"CC1=C(C(=O)N(N1C)C2=CC=CC=C2)NC(=O)C","OIAGWXKSCXPNNZ-UHFFFAOYSA-N","InChI=1S/C13H15N3O2/c1-9-12(14-10(2)17)13(18)16(15(9)3)11-7-5-4-6-8-11/h4-8H,1-3H3,(H,14,17)",65743,"C13H15N3O2","N-(1,5-dimethyl-3-oxo-2-phenylpyrazol-4-yl)acetamide","4-Acetamidoantipyrine",0.99667,"2",775,626.8431,246.042752832782,4157860.75,1520055.875,317286.4375,988256.625,246527.671875,389543.25,506351.46875,2309693.5,"[M+H]+",245.035476380691,NA,NA,NA,NA,NA,NA,NA,NA
"33","1","M250_R777_1768",250.13174244,"CC(=O)N[C@H](COC)C(=O)NCC1=CC=CC=C1","VPPJLAIAVCUEMN-GFCCVEGCSA-N","InChI=1S/C13H18N2O3/c1-10(16)15-12(9-18-2)13(17)14-8-11-6-4-3-5-7-11/h3-7,12H,8-9H2,1-2H3,(H,14,17)(H,15,16)/t12-/m1/s1",219078,"C13H18N2O3","(2R)-2-acetamido-N-benzyl-3-methoxypropanamide","Lacosamide",0.87359,"3a",802,776.85468,251.138706977349,401552.6875,164400.71875,76425.203125,332257.875,34719.56640625,197015.484375,177315.859375,363718.09375,"[M+H]+",250.131430525259,NA,NA,NA,NA,NA,NA,NA,NA
"34","1","M252_R860_1792",252.08987763,"C1=CC=C2C(=C1)C3C(O3)C4=CC=CC=C4N2C(=O)N","ZRWWEEVEIOGMMT-UHFFFAOYSA-N","InChI=1S/C15H12N2O2/c16-15(18)17-11-7-3-1-5-9(11)13-14(19-13)10-6-2-4-8-12(10)17/h1-8,13-14H,(H2,16,18)",2555,"C15H12N2O2","3-oxa-11-azatetracyclo[10.4.0.02,4.05,10]hexadeca-1(16),5,7,9,12,14-hexaene-11-carboxamide","36507-30-9",0.79506,"3a",814,859.67766,253.097099730901,1098485.875,385180.75,0,0,0,0,0,385943.71875,"[M+H]+",252.08982327881,NA,NA,NA,NA,NA,NA,NA,NA
"35","1","M252_R860_1792",252.08987763,"C1=CC=C2C(=C1)C=CC3=C(N2C(=O)N)C=CC(=C3)O","VPZIYMMSJFWLSP-UHFFFAOYSA-N","InChI=1S/C15H12N2O2/c16-15(19)17-13-4-2-1-3-10(13)5-6-11-9-12(18)7-8-14(11)17/h1-9,18H,(H2,16,19)",129274,"C15H12N2O2","3-hydroxybenzo[b][1]benzazepine-11-carboxamide","2-Hydroxycarbamazepine",0.48075,"3b",814,859.67766,253.097099730901,1098485.875,385180.75,0,0,0,0,0,385943.71875,"[M+H]+",252.08982327881,NA,NA,NA,NA,NA,NA,NA,NA
"36","1","M253_R725_1803",253.05211239,"CC1=CC(=NO1)NS(=O)(=O)C2=CC=C(C=C2)N","JLKIGFTWXXRPMT-UHFFFAOYSA-N","InChI=1S/C10H11N3O3S/c1-7-6-10(12-16-7)13-17(14,15)9-4-2-8(11)3-5-9/h2-6H,11H2,1H3,(H,12,13)",5329,"C10H11N3O3S","4-amino-N-(5-methyl-1,2-oxazol-3-yl)benzenesulfonamide","sulfamethoxazole",0.96406,"2",820,724.62594,254.059245083661,1588947.625,450489.8125,0,216285.21875,0,135818.375,105327.015625,626759.5625,"[M+H]+",253.05196863157,NA,NA,NA,NA,NA,NA,NA,NA
"37","1","M255_R783_1821",255.0078506,"C1=CC(=C(C(=C1)Cl)Cl)C2=C(N=C(N=N2)N)N","PYZRQGJRPPTADH-UHFFFAOYSA-N","InChI=1S/C9H7Cl2N5/c10-5-3-1-2-4(6(5)11)7-8(12)14-9(13)16-15-7/h1-3H,(H4,12,13,14,16)",3878,"C9H7Cl2N5","6-(2,3-dichlorophenyl)-1,2,4-triazine-3,5-diamine","lamotrigine",0.91342,"2",827,782.59374,256.014404580057,18479960,7721177.5,91411.359375,5062049,76232.25,2223408.75,4724348,29636.505859375,"[M+H]+",255.007128127967,NA,NA,NA,NA,NA,NA,NA,NA
"38","1","M259_R852_1869",259.157228913,"CC(C)NCC(COC1=CC=CC2=CC=CC=C21)O","AQHHHDLHHXJYJD-UHFFFAOYSA-N","InChI=1S/C16H21NO2/c1-12(2)17-10-14(18)11-19-16-9-5-7-13-6-3-4-8-15(13)16/h3-9,12,14,17-18H,10-11H2,1-2H3",4946,"C16H21NO2","1-naphthalen-1-yloxy-3-(propan-2-ylamino)propan-2-ol","propranolol",0.99506,"2",844,851.75736,260.091057420456,1857047.5,590756.5625,0,248882.390625,0,0,0,757268.9375,"[M+H]+",259.083780968365,NA,NA,NA,NA,NA,NA,NA,NA
"39","1","M263_R745_1920",263.18852904,"CN(C)C[C@H]1CCCC[C@@]1(C2=CC(=CC=C2)OC)O","TVYLLZQTGLZFBW-ZBFHGGJFSA-N","InChI=1S/C16H25NO2/c1-17(2)12-14-7-4-5-10-16(14,18)13-8-6-9-15(11-13)19-3/h6,8-9,11,14,18H,4-5,7,10,12H2,1-3H3/t14-,16+/m1/s1",33741,"C16H25NO2","(1R,2R)-2-[(dimethylamino)methyl]-1-(3-methoxyphenyl)cyclohexan-1-ol","Tramadol",0.99986,"2",867,745.36452,264.194954844855,42667768,10311290,442897.21875,5306404.5,248082.34375,3331371.25,4715567,20985912,"[M+H]+",263.187678392764,NA,NA,NA,NA,NA,NA,NA,NA
"40","1","M263_R745_1920",263.18852904,"CN(C)CC(C1=CC=C(C=C1)O)C2(CCCCC2)O","KYYIDSXMWOZKMP-UHFFFAOYSA-N","InChI=1S/C16H25NO2/c1-17(2)12-15(13-6-8-14(18)9-7-13)16(19)10-4-3-5-11-16/h6-9,15,18-19H,3-5,10-12H2,1-2H3",125017,"C16H25NO2","4-[2-(dimethylamino)-1-(1-hydroxycyclohexyl)ethyl]phenol","Desvenlafaxine",0.96142,"2",867,745.36452,264.194954844855,42667768,10311290,442897.21875,5306404.5,248082.34375,3331371.25,4715567,20985912,"[M+H]+",263.187678392764,NA,NA,NA,NA,NA,NA,NA,NA
"41","1","M270_R870_1996",270.10044231,"C1=CC=C2C(=C1)[C@@H]([C@H](C3=CC=CC=C3N2C(=O)N)O)O","PRGQOPPDPVELEG-KBPBESRZSA-N","InChI=1S/C15H14N2O3/c16-15(20)17-11-7-3-1-5-9(11)13(18)14(19)10-6-2-4-8-12(10)17/h1-8,13-14,18-19H,(H2,16,20)/t13-,14-/m0/s1",114725,"C15H14N2O3","(5S,6S)-5,6-dihydroxy-5,6-dihydrobenzo[b][1]benzazepine-11-carboxamide","58955-93-4",0.80254,"3a",890,870.10482,271.10119307708,179014.828125,413691.875,110112.9296875,281383.40625,84528.0078125,67904.6953125,137977.40625,0,"[M+H]+",270.093916624989,NA,NA,NA,NA,NA,NA,NA,NA
"42","1","M272_R368_2014",272.11946368,"CC(C)NCC(C1=CC=C(C=C1)NS(=O)(=O)C)O","ZBMZVLHSJCTVON-UHFFFAOYSA-N","InChI=1S/C12H20N2O3S/c1-9(2)13-8-12(15)10-4-6-11(7-5-10)14-18(3,16)17/h4-7,9,12-15H,8H2,1-3H3",5253,"C12H20N2O3S","N-[4-[1-hydroxy-2-(propan-2-ylamino)ethyl]phenyl]methanesulfonamide","sotalol",0.95775,"2",897,368.488464,273.126627723436,185389.296875,53415.40234375,0,0,0,0,0,68232.046875,"[M+H]+",272.119351271345,NA,NA,NA,NA,NA,NA,NA,NA
"43","1","M272_R1174_2016",272.177630004,"C[C@]12CC[C@H]3[C@H]([C@@H]1CC[C@@H]2O)CCC4=C3C=CC(=C4)O","VOXZDWNPVJITMN-ZBRFXRBCSA-N","InChI=1S/C18H24O2/c1-18-9-8-14-13-5-3-12(19)10-11(13)2-4-15(14)16(18)6-7-17(18)20/h3,5,10,14-17,19-20H,2,4,6-9H2,1H3/t14-,15-,16+,17+,18+/m1/s1",5757,"C18H24O2","(8R,9S,13S,14S,17S)-13-methyl-6,7,8,9,11,12,14,15,16,17-decahydrocyclopenta[a]phenanthrene-3,17-diol","estradiol",0.41765,"3b",898,1173.78594,273.220735002049,13084331,7157261.5,2313879.25,1480404.5,1895525.375,2878915.5,2949108.5,8394820,"[M+H]+",272.213458549959,NA,NA,NA,NA,NA,NA,NA,NA
"44","1","M275_R992_2043",275.0746777,"CC1=CSC(=C1N(C(C)COC)C(=O)CCl)C","JLYFCTQDENRSOL-UHFFFAOYSA-N","InChI=1S/C12H18ClNO2S/c1-8-7-17-10(3)12(8)14(11(15)5-13)9(2)6-16-4/h7,9H,5-6H2,1-4H3",91744,"C12H18ClNO2S","2-chloro-N-(2,4-dimethylthiophen-3-yl)-N-(1-methoxypropan-2-yl)acetamide","Dimethenamid",0.99903,"2",908,992.10186,276.134539592248,0,0,642316.0625,0,0,0,0,0,"[M+H]+",275.127263140158,NA,NA,NA,NA,NA,NA,NA,NA
"45","1","M278_R1167_2076",278.15180918,"CCCCOC(=O)C1=CC=CC=C1C(=O)OCCCC","DOIRQSBPFJWKBE-UHFFFAOYSA-N","InChI=1S/C16H22O4/c1-3-5-11-19-15(17)13-9-7-8-10-14(13)16(18)20-12-6-4-2/h7-10H,3-6,11-12H2,1-2H3",3026,"C16H22O4","dibutyl benzene-1,2-dicarboxylate","dibutyl phthalate",0.97063,"2",926,1166.92932,279.158219462474,0,8965870,14777625,13779156,0,0,0,0,"[M+H]+",278.150943010384,NA,NA,NA,NA,NA,NA,NA,NA
"46","1","M278_R1028_2078",278.086052095,"C1=CC=C(C=C1)P(=O)(C2=CC=CC=C2)C3=CC=CC=C3","FIQMHBFVRAXMOP-UHFFFAOYSA-N","InChI=1S/C18H15OP/c19-20(16-10-4-1-5-11-16,17-12-6-2-7-13-17)18-14-8-3-9-15-18/h1-15H",13097,"C18H15OP","diphenylphosphorylbenzene","TRIPHENYLPHOSPHINE OXIDE",0.79783,"3a",928,1028.1012,279.148180912036,2777007,1928487.25,0,2020454.875,0,3035311,0,0,"[M+H]+",278.140904459946,NA,NA,NA,NA,NA,NA,NA,NA
"47","1","M283_R1086_2138",283.1339066,"CCC1=CC=CC(=C1N(C(C)COC)C(=O)CCl)C","WVQBLGZPHOPPFO-UHFFFAOYSA-N","InChI=1S/C15H22ClNO2/c1-5-13-8-6-7-11(2)15(13)17(14(18)9-16)12(3)10-19-4/h6-8,12H,5,9-10H2,1-4H3",4169,"C15H22ClNO2","2-chloro-N-(2-ethyl-6-methylphenyl)-N-(1-methoxypropan-2-yl)acetamide","metolachlor",0.99913,"2",949,1086.49842,284.135542342635,899167.5,0,0,0,0,0,0,442025.96875,"[M+H]+",283.128265890544,NA,NA,NA,NA,NA,NA,NA,NA
"48","1","M284_R919_2149",283.953879,"C(CCl)OP(=O)(OCCCl)OCCCl","HQUQLFOMPYWACS-UHFFFAOYSA-N","InChI=1S/C6H12Cl3O4P/c7-1-4-11-14(10,12-5-2-8)13-6-3-9/h1-6H2",8295,"C6H12Cl3O4P","tris(2-chloroethyl) phosphate","115-96-8",0.52453,"3b",955,919.17792,284.960168396921,728898.5625,453410.71875,164197.8125,209605.640625,0,139243.125,77120.125,219949.640625,"[M+H]+",283.95289194483,NA,NA,NA,NA,NA,NA,NA,NA
"49","1","M286_R990_2175",286.0509053,"C1=CC=C(C=C1)C2=NC(C(=O)NC3=C2C=C(C=C3)Cl)O","ADIMAYPTOBDMTL-UHFFFAOYSA-N","InChI=1S/C15H11ClN2O2/c16-10-6-7-12-11(8-10)13(9-4-2-1-3-5-9)18-15(20)14(19)17-12/h1-8,15,20H,(H,17,19)",4616,"C15H11ClN2O2","7-chloro-3-hydroxy-5-phenyl-1,3-dihydro-1,4-benzodiazepin-2-one","oxazepam",0.95759,"2",965,990.37623,287.111144652065,831334.125,0,0,0,0,0,0,221888.5,"[M+H]+",286.103868199974,NA,NA,NA,NA,NA,NA,NA,NA
"50","1","M290_R678_2214",290.13789045,"COC1=CC(=CC(=C1OC)OC)CC2=CN=C(N=C2N)N","IEDVJHCEMCRBQM-UHFFFAOYSA-N","InChI=1S/C14H18N4O3/c1-19-10-5-8(6-11(20-2)12(10)21-3)4-9-7-17-14(16)18-13(9)15/h5-7H,4H2,1-3H3,(H4,15,16,17,18)",5578,"C14H18N4O3","5-[(3,4,5-trimethoxyphenyl)methyl]pyrimidine-2,4-diamine","trimethoprim",0.95078,"2",973,677.94132,291.144119835226,2488937.5,580995.4375,0,289841.34375,0,253949.3125,93038.40625,408583.3125,"[M+H]+",290.136843383136,NA,NA,NA,NA,NA,NA,NA,NA
"51","1","M299_R490_2322",299.15214353,"CN1CC[C@]23[C@@H]4[C@H]1CC5=C2C(=C(C=C5)OC)O[C@H]3[C@H](C=C4)O","OROGSEYTTFOCAN-DNJOTXNNSA-N","InChI=1S/C18H21NO3/c1-19-8-7-18-11-4-5-13(20)17(18)22-16-14(21-2)6-3-10(15(16)18)9-12(11)19/h3-6,11-13,17,20H,7-9H2,1-2H3/t11-,12+,13-,17-,18-/m0/s1",5284371,"C18H21NO3","(4R,4aR,7S,7aR,12bS)-9-methoxy-3-methyl-2,4,4a,7,7a,13-hexahydro-1H-4,12-methanobenzofuro[3,2-e]isoquinolin-7-ol","codeine",0.94777,"2",1012,490.100034,299.968435432651,828759.875,294633.9375,0,70118.21875,0,114992.828125,55173.4375,224924.171875,"[M+H]+",298.96115898056,NA,NA,NA,NA,NA,NA,NA,NA
"52","1","M300_R967_2334",299.95026852,"C(C(C(F)(F)S(=O)(=O)O)(F)F)(C(F)(F)F)(F)F","JGTNAGYHADQMCM-UHFFFAOYSA-N","InChI=1S/C4HF9O3S/c5-1(6,3(9,10)11)2(7,8)4(12,13)17(14,15)16/h(H,14,15,16)",67815,"C4HF9O3S","1,1,2,2,3,3,4,4,4-nonafluorobutane-1-sulfonic acid","perfluorobutanesulfonic acid",0.71641,"3a",1017,966.75192,300.957388577489,0,0,0,0,0,0,0,113541.4765625,"[M+H]+",299.950112125398,NA,NA,NA,NA,NA,NA,NA,NA
"53","1","M307_R1095_2418",307.14514,"CC(C)(C)C(CCC1=CC=C(C=C1)Cl)(CN2C=NC=N2)O","PXMNMQRDXWABCY-UHFFFAOYSA-N","InChI=1S/C16H22ClN3O/c1-15(2,3)16(21,10-20-12-18-11-19-20)9-8-13-4-6-14(17)7-5-13/h4-7,11-12,21H,8-10H2,1-3H3",86102,"C16H22ClN3O","1-(4-chlorophenyl)-4,4-dimethyl-3-(1,2,4-triazol-1-ylmethyl)pentan-3-ol","Tebuconazole",0.99938,"2",1044,1095.3888,308.091544862362,336588.375,840319.25,216399.578125,0,0,0,0,0,"[M+H]+",307.084268410271,NA,NA,NA,NA,NA,NA,NA,NA
"54","1","M308_R907_2426",308.03545927,"COC1=C(C=C(C(=C1)O)C(=O)C2=CC=CC=C2)S(=O)(=O)O","CXVGEDCSTKKODG-UHFFFAOYSA-N","InChI=1S/C14H12O6S/c1-20-12-8-11(15)10(7-13(12)21(17,18)19)14(16)9-5-3-2-4-6-9/h2-8,15H,1H3,(H,17,18,19)",19988,"C14H12O6S","5-benzoyl-4-hydroxy-2-methoxybenzenesulfonic acid","Sulisobenzone",0.86149,"3a",1049,906.78516,309.042626254198,58686.91796875,83247.65625,0,50126.27734375,0,32629.60546875,0,66003.7734375,"[M+H]+",308.035349802108,NA,NA,NA,NA,NA,NA,NA,NA
"55","1","M323_R816_2610",323.09397721,"CC1=C(C(=CC=C1)C)N(CN2C=CC=N2)C(=O)CS(=O)(=O)O","IPVCSECPEVHQOV-UHFFFAOYSA-N","InChI=1S/C14H17N3O4S/c1-11-5-3-6-12(2)14(11)17(10-16-8-4-7-15-16)13(18)9-22(19,20)21/h3-8H,9-10H2,1-2H3,(H,19,20,21)",86290102,"C14H17N3O4S","2-[2,6-dimethyl-N-(pyrazol-1-ylmethyl)anilino]-2-oxoethanesulfonic acid","metazachlor ESA",0.97826,"2",1122,815.53242,324.10100135861,56758.8828125,78734.375,0,0,0,95556.5546875,64999.10546875,45744.1328125,"[M+H]+",323.093724906519,NA,NA,NA,NA,NA,NA,NA,NA
"56","1","M326_R1043_2645",326.000829,"CC(CCl)OP(=O)(OC(C)CCl)OC(C)CCl","KVMPUXDNESXNOH-UHFFFAOYSA-N","InChI=1S/C9H18Cl3O4P/c1-7(4-10)14-17(13,15-8(2)5-11)16-9(3)6-12/h7-9H,4-6H2,1-3H3",26176,"C9H18Cl3O4P","tris(1-chloropropan-2-yl) phosphate","13674-84-5",0.98937,"2",1136,1043.07054,327.125950874656,0,0,5596387.5,12357206,3484116,4782259.5,3970085.75,5987292.5,"[M+H]+",326.118674422565,NA,NA,NA,NA,NA,NA,NA,NA
"57","1","M328_R546_2675",328.14567842,"CCN(CC)CCNC(=O)C1=C(C=CC(=C1)S(=O)(=O)C)OC","JTVPZMFULRWINT-UHFFFAOYSA-N","InChI=1S/C15H24N2O4S/c1-5-17(6-2)10-9-16-15(18)13-11-12(22(4,19)20)7-8-14(13)21-3/h7-8,11H,5-6,9-10H2,1-4H3,(H,16,18)",5467,"C15H24N2O4S","N-[2-(diethylamino)ethyl]-2-methoxy-5-methylsulfonylbenzamide","tiapride",0.99482,"2",1148,545.662392,329.151812588739,800854.5625,283346.25,0,100891.03125,0,0,243473.234375,56894.22265625,"[M+H]+",328.144536136648,NA,NA,NA,NA,NA,NA,NA,NA
"58","1","M329_R1006_2684",329.12969401,"CCC1=CC=CC(=C1N(C(C)COC)C(=O)CS(=O)(=O)O)C","CIGKZVUEZXGYSV-UHFFFAOYSA-N","InChI=1S/C15H23NO5S/c1-5-13-8-6-7-11(2)15(13)16(12(3)9-21-4)14(17)10-22(18,19)20/h6-8,12H,5,9-10H2,1-4H3,(H,18,19,20)",6426849,"C15H23NO5S","2-[2-ethyl-N-(1-methoxypropan-2-yl)-6-methylanilino]-2-oxoethanesulfonic acid","Metolachlor esa",0.96785,"2",1154,1005.97986,330.136850937882,0,668315.875,401629.78125,889410.9375,279225.21875,373394.1875,0,418101.9375,"[M+H]+",329.129574485792,NA,NA,NA,NA,NA,NA,NA,NA
"59","1","M341_R436_2828",341.1409274,"CCN1CCCC1CNC(=O)C2=C(C=CC(=C2)S(=O)(=O)N)OC","BGRJTUBHPOOWDU-UHFFFAOYSA-N","InChI=1S/C15H23N3O4S/c1-3-18-8-4-5-11(18)10-17-15(19)13-9-12(23(16,20)21)6-7-14(13)22-2/h6-7,9,11H,3-5,8,10H2,1-2H3,(H,17,19)(H2,16,20,21)",5355,"C15H23N3O4S","N-[(1-ethylpyrrolidin-2-yl)methyl]-2-methoxy-5-sulfamoylbenzamide","sulpiride",0.99091,"2",1215,435.56145,342.147019591394,222482.828125,61734.54296875,0,30951.689453125,0,0,0,153943.90625,"[M+H]+",341.139743139303,NA,NA,NA,NA,NA,NA,NA,NA
"60","1","M363_R1115_3082",363.06646049,"CC(C)N(C1=CC=C(C=C1)F)C(=O)COC2=NN=C(S2)C(F)(F)F","IANUJLZYFUDJIH-UHFFFAOYSA-N","InChI=1S/C14H13F4N3O2S/c1-8(2)21(10-5-3-9(15)4-6-10)11(22)7-23-13-20-19-12(24-13)14(16,17)18/h3-6,8H,7H2,1-2H3",86429,"C14H13F4N3O2S","N-(4-fluorophenyl)-N-propan-2-yl-2-[[5-(trifluoromethyl)-1,3,4-thiadiazol-2-yl]oxy]acetamide","Flufenacet",0.6061,"3b",1335,1114.79568,364.011242119792,0,376389.375,296571.59375,173139.609375,0,62265.82421875,0,88617.984375,"[M+H]+",363.003965667702,NA,NA,NA,NA,NA,NA,NA,NA
"61","1","M368_R908_3143",368.23112213,"CCC[C@@H](C(=O)OCC)N[C@@H](C)C(=O)N1[C@H]2CCCC[C@H]2C[C@H]1C(=O)O","IPVQLZZIHOAWMC-QXKUPLGCSA-N","InChI=1S/C19H32N2O5/c1-4-8-14(19(25)26-5-2)20-12(3)17(22)21-15-10-7-6-9-13(15)11-16(21)18(23)24/h12-16,20H,4-11H2,1-3H3,(H,23,24)/t12-,13-,14-,15-,16-/m0/s1",107807,"C19H32N2O5","(2S,3aS,7aS)-1-[(2S)-2-[[(2S)-1-ethoxy-1-oxopentan-2-yl]amino]propanoyl]-2,3,3a,4,5,6,7,7a-octahydroindole-2-carboxylic acid","PERINDOPRIL",0.99834,"2",1361,908.37576,369.226876492061,446195.96875,181901.578125,0,124092.21875,0,47416.8984375,58668.31640625,283720.4375,"[M+H]+",368.21960003997,NA,NA,NA,NA,NA,NA,NA,NA
"62","1","M369_R642_3154",369.17222752,"CCN1CCCC1CNC(=O)C2=CC(=C(C=C2OC)N)S(=O)(=O)CC","NTJOBXMMWNYJFB-UHFFFAOYSA-N","InChI=1S/C17H27N3O4S/c1-4-20-8-6-7-12(20)11-19-17(21)13-9-16(25(22,23)5-2)14(18)10-15(13)24-3/h9-10,12H,4-8,11,18H2,1-3H3,(H,19,21)",2159,"C17H27N3O4S","4-amino-N-[(1-ethylpyrrolidin-2-yl)methyl]-5-ethylsulfonyl-2-methoxybenzamide","amisulpride",0.99568,"2",1367,642.37386,370.178541027448,8170409.5,980337.0625,0,409613.8125,62384.37890625,66815.53125,179725.921875,694448.0625,"[M+H]+",369.171264575357,NA,NA,NA,NA,NA,NA,NA,NA
"63","1","M379_R815_3265",379.24710654,"CCN(CC)C(=O)NC1=CC(=C(C=C1)OCC(CNC(C)(C)C)O)C(=O)C","JOATXPAWOHTVSZ-UHFFFAOYSA-N","InChI=1S/C20H33N3O4/c1-7-23(8-2)19(26)22-15-9-10-18(17(11-15)14(3)24)27-13-16(25)12-21-20(4,5)6/h9-11,16,21,25H,7-8,12-13H2,1-6H3,(H,22,26)",2663,"C20H33N3O4","3-[3-acetyl-4-[3-(tert-butylamino)-2-hydroxypropoxy]phenyl]-1,1-diethylurea","celiprolol",0.99653,"2",1418,814.58538,380.250808660672,0,0,0,943492.875,0,0,0,5975369,"[M+H]+",379.243532208582,NA,NA,NA,NA,NA,NA,NA,NA
"64","1","M414_R815_3658",414.13781148,"C1CCNC(C1)CNC(=O)C2=C(C=CC(=C2)OCC(F)(F)F)OCC(F)(F)F","DJBNUMBKLMJRSA-UHFFFAOYSA-N","InChI=1S/C17H20F6N2O3/c18-16(19,20)9-27-12-4-5-14(28-10-17(21,22)23)13(7-12)15(26)25-8-11-3-1-2-6-24-11/h4-5,7,11,24H,1-3,6,8-10H2,(H,25,26)",3356,"C17H20F6N2O3","N-(piperidin-2-ylmethyl)-2,5-bis(2,2,2-trifluoroethoxy)benzamide","flecainide",0.99892,"2",1606,815.2113,415.150395852151,440940.65625,127298.796875,789747,0,588278.9375,1241715.875,0,143885.703125,"[M+H]+",414.143119400061,NA,NA,NA,NA,NA,NA,NA,NA
"65","1","M428_R1001_3823",428.23245954,"CCCCC1=NC2(CCCC2)C(=O)N1CC3=CC=C(C=C3)C4=CC=CC=C4C5=NNN=N5","YOSHYTLCDANDAN-UHFFFAOYSA-N","InChI=1S/C25H28N6O/c1-2-3-10-22-26-25(15-6-7-16-25)24(32)31(22)17-18-11-13-19(14-12-18)20-8-4-5-9-21(20)23-27-29-30-28-23/h4-5,8-9,11-14H,2-3,6-7,10,15-17H2,1H3,(H,27,28,29,30)",3749,"C25H28N6O","2-butyl-3-[[4-[2-(2H-tetrazol-5-yl)phenyl]phenyl]methyl]-1,3-diazaspiro[4.4]non-1-en-4-one","irbesartan",0.99554,"2",1696,1001.48664,429.239467771513,10984395,8002012,1607495.75,5217505.5,341816.5,2263543,2488071.75,12840543,"[M+H]+",428.232191319422,NA,NA,NA,NA,NA,NA,NA,NA
"66","1","M430_R1001_3843",430.06104075,"CC(CS(=O)(=O)C1=CC=C(C=C1)F)(C(=O)NC2=CC(=C(C=C2)C#N)C(F)(F)F)O","LKJPYSCBVHEWIU-UHFFFAOYSA-N","InChI=1S/C18H14F4N2O4S/c1-17(26,10-29(27,28)14-6-3-12(19)4-7-14)16(25)24-13-5-2-11(9-23)15(8-13)18(20,21)22/h2-8,26H,10H2,1H3,(H,24,25)",2375,"C18H14F4N2O4S","N-[4-cyano-3-(trifluoromethyl)phenyl]-3-(4-fluorophenyl)sulfonyl-2-hydroxy-2-methylpropanamide","bicalutamide",0.97656,"2",1712,1000.93224,431.152223441694,192044.953125,196256.75,0,159345.875,0,0,0,420524.3125,"[M+H]+",430.144946989603,NA,NA,NA,NA,NA,NA,NA,NA
"67","1","M435_R1046_3914",435.2270398,"CCCCC(=O)N(CC1=CC=C(C=C1)C2=CC=CC=C2C3=NNN=N3)[C@@H](C(C)C)C(=O)O","ACWBQPMHZXGDFX-QFIPXVFZSA-N","InChI=1S/C24H29N5O3/c1-4-5-10-21(30)29(22(16(2)3)24(31)32)15-17-11-13-18(14-12-17)19-8-6-7-9-20(19)23-25-27-28-26-23/h6-9,11-14,16,22H,4-5,10,15H2,1-3H3,(H,31,32)(H,25,26,27,28)/t22-/m0/s1",60846,"C24H29N5O3","(2S)-3-methyl-2-[pentanoyl-[[4-[2-(2H-tetrazol-5-yl)phenyl]phenyl]methyl]amino]butanoic acid","valsartan",0.98237,"2",1749,1045.85775,436.23316723807,1210811.125,350201.53125,0,0,0,0,0,237936.46875,"[M+H]+",435.225890785979,NA,NA,NA,NA,NA,NA,NA,NA
"68","1","M436_R1092_3921",435.9387063,"C1=C(C=C(C(=C1Cl)N2C(=C(C(=N2)C#N)S(=O)C(F)(F)F)N)Cl)C(F)(F)F","ZOCSXAVNDGMNBV-UHFFFAOYSA-N","InChI=1S/C12H4Cl2F6N4OS/c13-5-1-4(11(15,16)17)2-6(14)8(5)24-10(22)9(7(3-21)23-24)26(25)12(18,19)20/h1-2H,22H2",3352,"C12H4Cl2F6N4OS","5-amino-1-[2,6-dichloro-4-(trifluoromethyl)phenyl]-4-(trifluoromethylsulfinyl)pyrazole-3-carbonitrile","fipronil",0.9625,"2",1754,1092.37494,436.945620633676,51528.59765625,0,0,0,0,0,0,0,"[M+H]+",435.938344181585,NA,NA,NA,NA,NA,NA,NA,NA
"69","1","M501_R933_4696",501.28790873,"CC(C)(C1=CC=C(C=C1)C(CCCN2CCC(CC2)C(C3=CC=CC=C3)(C4=CC=CC=C4)O)O)C(=O)O","RWTNPBWLLIMQHL-UHFFFAOYSA-N","InChI=1S/C32H39NO4/c1-31(2,30(35)36)25-17-15-24(16-18-25)29(34)14-9-21-33-22-19-28(20-23-33)32(37,26-10-5-3-6-11-26)27-12-7-4-8-13-27/h3-8,10-13,15-18,28-29,34,37H,9,14,19-23H2,1-2H3,(H,35,36)",3348,"C32H39NO4","2-[4-[1-hydroxy-4-[4-[hydroxy(diphenyl)methyl]piperidin-1-yl]butyl]phenyl]-2-methylpropanoic acid","fexofenadine",0.980385,"2",2158,932.81442,502.294934942972,2124976.25,1606660,193435.5,947426.5,0,567766.625,656767.875,3828939,"[M+H]+",501.287658490881,NA,NA,NA,NA,NA,NA,NA,NA
"70","1","M514_R986_4852",514.23687621,"CCCC1=NC2=C(N1CC3=CC=C(C=C3)C4=CC=CC=C4C(=O)O)C=C(C=C2C)C5=NC6=CC=CC=C6N5C","RMMXLENWKUUMAY-UHFFFAOYSA-N","InChI=1S/C33H30N4O2/c1-4-9-30-35-31-21(2)18-24(32-34-27-12-7-8-13-28(27)36(32)3)19-29(31)37(30)20-22-14-16-23(17-15-22)25-10-5-6-11-26(25)33(38)39/h5-8,10-19H,4,9,20H2,1-3H3,(H,38,39)",65999,"C33H30N4O2","2-[4-[[4-methyl-6-(1-methylbenzimidazol-2-yl)-2-propylbenzimidazol-1-yl]methyl]phenyl]benzoic acid","Telmisartan",0.950345,"2",2259,986.14641,515.243425097993,7149954,5267484.5,247193.4375,3279302.25,0,1191956.625,1634469.625,8255495,"[M+H]+",514.236148645902,NA,NA,NA,NA,NA,NA,NA,NA
"71","1","M733_R935_6856",733.46124119,"CC[C@@H]1[C@@]([C@@H]([C@H](C(=O)[C@@H](C[C@@]([C@@H]([C@H]([C@@H]([C@H](C(=O)O1)C)O[C@H]2C[C@@]([C@H]([C@@H](O2)C)O)(C)OC)C)O[C@H]3[C@@H]([C@H](C[C@H](O3)C)N(C)C)O)(C)O)C)C)O)(C)O","ULGZDMOVFRHVEP-RWJQBGPGSA-N","InChI=1S/C37H67NO13/c1-14-25-37(10,45)30(41)20(4)27(39)18(2)16-35(8,44)32(51-34-28(40)24(38(11)12)15-19(3)47-34)21(5)29(22(6)33(43)49-25)50-26-17-36(9,46-13)31(42)23(7)48-26/h18-26,28-32,34,40-42,44-45H,14-17H2,1-13H3/t18-,19-,20+,21+,22-,23+,24+,25-,26+,28-,29+,30-,31+,32-,34+,35-,36-,37-/m1/s1",12560,"C37H67NO13","(3R,4S,5S,6R,7R,9R,11R,12R,13S,14R)-6-[(2S,3R,4S,6R)-4-(dimethylamino)-3-hydroxy-6-methyloxan-2-yl]oxy-14-ethyl-7,12,13-trihydroxy-4-[(2R,4R,5S,6S)-5-hydroxy-4-methoxy-4,6-dimethyloxan-2-yl]oxy-3,5,7,9,11,13-hexamethyl-oxacyclotetradecane-2,10-dione","erythromycin",0.97362,"2",3604,934.92516,734.466959226511,93804.5859375,46580.44140625,0,0,0,0,0,252160.4375,"[M+H]+",733.459682774421,NA,NA,NA,NA,NA,NA,NA,NA
"72","1","M747_R983_6935",747.47689126,"CC[C@@H]1[C@@]([C@@H]([C@H](C(=O)[C@@H](C[C@@]([C@@H]([C@H]([C@@H]([C@H](C(=O)O1)C)O[C@H]2C[C@@]([C@H]([C@@H](O2)C)O)(C)OC)C)O[C@H]3[C@@H]([C@H](C[C@H](O3)C)N(C)C)O)(C)OC)C)C)O)(C)O","AGOYDEPGAOXOCK-KCBOHYOISA-N","InChI=1S/C38H69NO13/c1-15-26-38(10,45)31(42)21(4)28(40)19(2)17-37(9,47-14)33(52-35-29(41)25(39(11)12)16-20(3)48-35)22(5)30(23(6)34(44)50-26)51-27-18-36(8,46-13)32(43)24(7)49-27/h19-27,29-33,35,41-43,45H,15-18H2,1-14H3/t19-,20-,21+,22+,23-,24+,25+,26-,27+,29-,30+,31-,32+,33-,35+,36-,37-,38-/m1/s1",84029,"C38H69NO13","(3R,4S,5S,6R,7R,9R,11R,12R,13S,14R)-6-[(2S,3R,4S,6R)-4-(dimethylamino)-3-hydroxy-6-methyloxan-2-yl]oxy-14-ethyl-12,13-dihydroxy-4-[(2R,4R,5S,6S)-5-hydroxy-4-methoxy-4,6-dimethyloxan-2-yl]oxy-7-methoxy-3,5,7,9,11,13-hexamethyl-oxacyclotetradecane-2,10-dione","clarithromycin",0.99743,"2",3655,982.83972,748.481917935414,473765.6875,200751.984375,59273.30078125,134468.765625,0,131532.921875,56927.84375,248467.140625,"[M+H]+",747.474641483323,NA,NA,NA,NA,NA,NA,NA,NA
"73","2","M107_R151_265",107.073499291,"CC1=CC=CC=C1N","RNVCVTLRINQCPJ-UHFFFAOYSA-N","InChI=1S/C7H9N/c1-6-4-2-3-5-7(6)8/h2-5H,8H2,1H3",7242,"C7H9N","2-methylaniline","o-Toluidine",0.81079,"3a",47,150.70752,106.027312309952,NA,NA,NA,NA,NA,NA,NA,NA,"[M-H]-",107.034588762042,0,0,92377.96875,0,0,0,0,0
"74","2","M107_R151_265",107.073499291,"CNC1=CC=CC=C1","AFBPFSWMIHJQDM-UHFFFAOYSA-N","InChI=1S/C7H9N/c1-8-7-5-3-2-4-6-7/h2-6,8H,1H3",7515,"C7H9N","N-methylaniline","N-METHYLANILINE",0.76407,"3a",47,150.70752,106.027312309952,NA,NA,NA,NA,NA,NA,NA,NA,"[M-H]-",107.034588762042,0,0,92377.96875,0,0,0,0,0
"75","2","M107_R151_265",107.073499291,"CC1=NC(=CC=C1)C","OISVCGZHLKNMSJ-UHFFFAOYSA-N","InChI=1S/C7H9N/c1-6-4-3-5-7(2)8-6/h3-5H,1-2H3",7937,"C7H9N","2,6-dimethylpyridine","2,6-Dimethylpyridine",0.54433,"3b",47,150.70752,106.027312309952,NA,NA,NA,NA,NA,NA,NA,NA,"[M-H]-",107.034588762042,0,0,92377.96875,0,0,0,0,0
"76","2","M119_R721_371",119.048347172,"C1=CC2=NNN=C2C=C1","QRUDEWIWKLJBPS-UHFFFAOYSA-N","InChI=1S/C6H5N3/c1-2-4-6-5(3-1)7-9-8-6/h1-4H,(H,7,8,9)",7220,"C6H5N3","2H-benzotriazole","1H-Benzotriazole",0.95254,"2",68,720.88275,118.06491618729,NA,NA,NA,NA,NA,NA,NA,NA,"[M-H]-",119.07219263938,185563.546875,22390.103515625,555357.6875,132281.140625,295515.40625,16862.642578125,2177116.5,49052.37890625
"77","2","M122_R696_413",122.03677943,"C1=CC(=CC=C1C=O)O","RGHHSNMVTDWUBI-UHFFFAOYSA-N","InChI=1S/C7H6O2/c8-5-6-1-3-7(9)4-2-6/h1-5,9H",126,"C7H6O2","4-hydroxybenzaldehyde","4-hydroxybenzaldehyde",0.93151,"2",74,696.42012,121.029448950436,NA,NA,NA,NA,NA,NA,NA,NA,"[M-H]-",122.036725402526,0,954244.125,1535515.625,1134358.375,0,0,0,1062714.25
"78","2","M133_R841_520",133.063997236,"CC1=CC2=NNN=C2C=C1","LRUDIIUSNGCQKF-UHFFFAOYSA-N","InChI=1S/C7H7N3/c1-5-2-3-6-7(4-5)9-10-8-6/h2-4H,1H3,(H,8,9,10)",8705,"C7H7N3","5-methyl-2H-benzotriazole","5-Methyl-1H-benzotriazole",0.97394,"2",99,841.0227,132.056589239902,NA,NA,NA,NA,NA,NA,NA,NA,"[M-H]-",133.063865691993,51326352,368639.90625,4855235,30586550,287048.15625,0,0,902054.625
"79","2","M133_R841_520",133.063997236,"CC1=CC=CC2=NNN=C12","CMGDVUCDZOBDNL-UHFFFAOYSA-N","InChI=1S/C7H7N3/c1-5-3-2-4-6-7(5)9-10-8-6/h2-4H,1H3,(H,8,9,10)",122499,"C7H7N3","4-methyl-2H-benzotriazole","29878-31-7",0.9995,"2",99,841.0227,132.056589239902,NA,NA,NA,NA,NA,NA,NA,NA,"[M-H]-",133.063865691993,51326352,368639.90625,4855235,30586550,287048.15625,0,0,902054.625
"80","2","M133_R1582_521",133.063997236,"CC1=CC2=NNN=C2C=C1","LRUDIIUSNGCQKF-UHFFFAOYSA-N","InChI=1S/C7H7N3/c1-5-2-3-6-7(4-5)9-10-8-6/h2-4H,1H3,(H,8,9,10)",8705,"C7H7N3","5-methyl-2H-benzotriazole","5-Methyl-1H-benzotriazole",0.68783,"3b",100,1582.11684,132.056535536025,NA,NA,NA,NA,NA,NA,NA,NA,"[M-H]-",133.063811988116,0,0,0,65272.92578125,67556.3515625,0,0,0
"81","2","M133_R1582_521",133.063997236,"CC1=CC=CC2=NNN=C12","CMGDVUCDZOBDNL-UHFFFAOYSA-N","InChI=1S/C7H7N3/c1-5-3-2-4-6-7(5)9-10-8-6/h2-4H,1H3,(H,8,9,10)",122499,"C7H7N3","4-methyl-2H-benzotriazole","29878-31-7",0.71253,"3a",100,1582.11684,132.056535536025,NA,NA,NA,NA,NA,NA,NA,NA,"[M-H]-",133.063811988116,0,0,0,65272.92578125,67556.3515625,0,0,0
"82","2","M133_R1582_521",133.063997236,"CN1C2=CC=CC=C2N=N1","HXQHRUJXQJEGER-UHFFFAOYSA-N","InChI=1S/C7H7N3/c1-10-7-5-3-2-4-6(7)8-9-10/h2-5H,1H3",25902,"C7H7N3","1-methylbenzotriazole","1-METHYLBENZOTRIAZOLE",0.54707,"3b",100,1582.11684,132.056535536025,NA,NA,NA,NA,NA,NA,NA,NA,"[M-H]-",133.063811988116,0,0,0,65272.92578125,67556.3515625,0,0,0
"83","2","M136_R147_554",136.03851076,"C1=NNC2=C1C(=O)NC=N2","OFCNXPDARWKPPY-UHFFFAOYSA-N","InChI=1S/C5H4N4O/c10-5-3-1-8-9-4(3)6-2-7-5/h1-2H,(H2,6,7,8,9,10)",135401907,"C5H4N4O","1,5-dihydropyrazolo[3,4-d]pyrimidin-4-one","allopurinol",0.99431,"2",107,146.753952,135.031197049954,NA,NA,NA,NA,NA,NA,NA,NA,"[M-H]-",136.038473502045,726351.5625,120585.84375,0,17010.900390625,0,0,0,21032.3515625
"84","2","M138_R896_567",138.031694049,"C1=CC=C(C(=C1)C(=O)O)O","YGSDEFSMJLZEOE-UHFFFAOYSA-N","InChI=1S/C7H6O3/c8-6-4-2-1-3-5(6)7(9)10/h1-4,8H,(H,9,10)",338,"C7H6O3","2-hydroxybenzoic acid","salicylic acid",0.99959,"2",112,895.6128,137.035560712842,NA,NA,NA,NA,NA,NA,NA,NA,"[M-H]-",138.042837164933,0,0,4693407,0,2170590,0,0,0
"85","2","M138_R896_567",138.031694049,"C1=CC(=CC=C1C(=O)O)O","FJKROLUGYXJWQN-UHFFFAOYSA-N","InChI=1S/C7H6O3/c8-6-3-1-5(2-4-6)7(9)10/h1-4,8H,(H,9,10)",135,"C7H6O3","4-hydroxybenzoic acid","4-HYDROXYBENZOIC ACID",0.99959,"2",112,895.6128,137.035560712842,NA,NA,NA,NA,NA,NA,NA,NA,"[M-H]-",138.042837164933,0,0,4693407,0,2170590,0,0,0
"86","2","M138_R896_567",138.031694049,"C1=CC(=CC(=C1)O)C(=O)O","IJFXRHURBJZNAO-UHFFFAOYSA-N","InChI=1S/C7H6O3/c8-6-3-1-2-5(4-6)7(9)10/h1-4,8H,(H,9,10)",7420,"C7H6O3","3-hydroxybenzoic acid","3-Hydroxybenzoic acid",0.99942,"2",112,895.6128,137.035560712842,NA,NA,NA,NA,NA,NA,NA,NA,"[M-H]-",138.042837164933,0,0,4693407,0,2170590,0,0,0
"87","2","M138_R638_569",138.031694049,"C1=CC=C(C(=C1)C(=O)O)O","YGSDEFSMJLZEOE-UHFFFAOYSA-N","InChI=1S/C7H6O3/c8-6-4-2-1-3-5(6)7(9)10/h1-4,8H,(H,9,10)",338,"C7H6O3","2-hydroxybenzoic acid","salicylic acid",0.99621,"2",114,637.98594,137.024271294068,NA,NA,NA,NA,NA,NA,NA,NA,"[M-H]-",138.031547746159,0,0,0,0,508341.90625,0,0,0
"88","2","M138_R638_569",138.031694049,"C1=CC(=CC=C1C(=O)O)O","FJKROLUGYXJWQN-UHFFFAOYSA-N","InChI=1S/C7H6O3/c8-6-3-1-5(2-4-6)7(9)10/h1-4,8H,(H,9,10)",135,"C7H6O3","4-hydroxybenzoic acid","4-HYDROXYBENZOIC ACID",0.99621,"2",114,637.98594,137.024271294068,NA,NA,NA,NA,NA,NA,NA,NA,"[M-H]-",138.031547746159,0,0,0,0,508341.90625,0,0,0
"89","2","M138_R638_569",138.031694049,"C1=CC(=CC(=C1)O)C(=O)O","IJFXRHURBJZNAO-UHFFFAOYSA-N","InChI=1S/C7H6O3/c8-6-3-1-2-5(4-6)7(9)10/h1-4,8H,(H,9,10)",7420,"C7H6O3","3-hydroxybenzoic acid","3-Hydroxybenzoic acid",0.99603,"2",114,637.98594,137.024271294068,NA,NA,NA,NA,NA,NA,NA,NA,"[M-H]-",138.031547746159,0,0,0,0,508341.90625,0,0,0
"90","2","M139_R834_576",139.026943022,"C1=CC(=CC=C1[N+](=O)[O-])O","BTJIUGUIPKRLHP-UHFFFAOYSA-N","InChI=1S/C6H5NO3/c8-6-3-1-5(2-4-6)7(9)10/h1-4,8H",980,"C6H5NO3","4-nitrophenol","4-Nitrophenol",0.99414,"2",116,834.10218,138.027633551041,NA,NA,NA,NA,NA,NA,NA,NA,"[M-H]-",139.034910003132,0,3537474.5,0,0,0,0,0,4237494
"91","2","M145_R818_633",145.052763847,"C1=CC=C2C(=C1)C(=CN2)C=O","OLNJUISKUQQNIM-UHFFFAOYSA-N","InChI=1S/C9H7NO/c11-6-7-5-10-9-4-2-1-3-8(7)9/h1-6,10H",10256,"C9H7NO","1H-indole-3-carbaldehyde","INDOLE-3-CARBOXALDEHYDE",0.458155,"3b",137,818.29926,144.045331265256,NA,NA,NA,NA,NA,NA,NA,NA,"[M-H]-",145.052607717346,3377227.25,768729.125,1468003.625,731690.8125,4650339.5,945689.25,834849.875,929678
"92","2","M146_R689_644",146.0579088,"C(CCC(=O)O)CC(=O)O","WNLRTRBMVRJNCN-UHFFFAOYSA-N","InChI=1S/C6H10O4/c7-5(8)3-1-2-4-6(9)10/h1-4H2,(H,7,8)(H,9,10)",196,"C6H10O4","hexanedioic acid","adipic acid",0.71867,"3a",140,688.5045,145.040628529683,NA,NA,NA,NA,NA,NA,NA,NA,"[M-H]-",146.047904981774,89812.9140625,55941.734375,273263.59375,16177.0234375,375500.1875,0,0,47091.30078125
"93","2","M146_R689_644",146.0579088,"CC(CCC(=O)O)C(=O)O","AQYCMVICBNBXNA-UHFFFAOYSA-N","InChI=1S/C6H10O4/c1-4(6(9)10)2-3-5(7)8/h4H,2-3H2,1H3,(H,7,8)(H,9,10)",12046,"C6H10O4","2-methylpentanedioic acid","2-METHYLGLUTARIC ACID",0.98601,"2",140,688.5045,145.040628529683,NA,NA,NA,NA,NA,NA,NA,NA,"[M-H]-",146.047904981774,89812.9140625,55941.734375,273263.59375,16177.0234375,375500.1875,0,0,47091.30078125
"94","2","M151_R888_696",151.00918496,"C1=CC=C2C(=C1)NC(=O)S2","YEDUAINPPJYDJZ-UHFFFAOYSA-N","InChI=1S/C7H5NOS/c9-7-8-5-3-1-2-4-6(5)10-7/h1-4H,(H,8,9)",13625,"C7H5NOS","3H-1,3-benzothiazol-2-one","Benzothiazolone",0.57373,"3b",156,887.94963,150.001750713268,NA,NA,NA,NA,NA,NA,NA,NA,"[M-H]-",151.009027165359,3099369.75,3613989.75,0,0,0,0,0,1876230.25
"95","2","M152_R982_709",152.047344113,"C1=CC=C(C=C1)[C@@H](C(=O)O)O","IWYDHOAUDWTVEP-ZETCQYMHSA-N","InChI=1S/C8H8O3/c9-7(8(10)11)6-4-2-1-3-5-6/h1-5,7,9H,(H,10,11)/t7-/m0/s1",439616,"C8H8O3","(2S)-2-hydroxy-2-phenylacetic acid","17199-29-0",0.99925,"2",163,982.22526,151.039911267845,NA,NA,NA,NA,NA,NA,NA,NA,"[M-H]-",152.047187719935,0,0,294137.90625,0,0,0,0,0
"96","2","M152_R982_709",152.047344113,"C1=CC=C(C(=C1)CC(=O)O)O","CCVYRRGZDBSHFU-UHFFFAOYSA-N","InChI=1S/C8H8O3/c9-7-4-2-1-3-6(7)5-8(10)11/h1-4,9H,5H2,(H,10,11)",11970,"C8H8O3","2-(2-hydroxyphenyl)acetic acid","2-Hydroxyphenylacetic acid",0.99925,"2",163,982.22526,151.039911267845,NA,NA,NA,NA,NA,NA,NA,NA,"[M-H]-",152.047187719935,0,0,294137.90625,0,0,0,0,0
"97","2","M161_R826_797",161.047678466,"C1=CC=C2C(=C1)C(=CN2)C(=O)O","KMAKOBLIOCQGJP-UHFFFAOYSA-N","InChI=1S/C9H7NO2/c11-9(12)7-5-10-8-4-2-1-3-6(7)8/h1-5,10H,(H,11,12)",69867,"C9H7NO2","1H-indole-3-carboxylic acid","Indole-3-carboxylic acid",0.99812,"2",194,826.40478,160.040266442025,NA,NA,NA,NA,NA,NA,NA,NA,"[M-H]-",161.047542894115,246859.5625,102618.1015625,184987.296875,0,173043.65625,153682.953125,135956.515625,168832.75
"98","2","M198_R982_1202",198.0276713,"CC1=CC(=CC(=C1O)[N+](=O)[O-])[N+](=O)[O-]","ZXVONLUNISGICL-UHFFFAOYSA-N","InChI=1S/C7H6N2O5/c1-4-2-5(8(11)12)3-6(7(4)10)9(13)14/h2-3,10H,1H3",10800,"C7H6N2O5","2-methyl-4,6-dinitrophenol","2-Methyl-4,6-dinitrophenol",0.97031,"2",358,982.46118,197.020114537168,NA,NA,NA,NA,NA,NA,NA,NA,"[M-H]-",198.027390989259,0,4045186.75,519010.90625,1667827,350800.84375,0,0,215038.046875
"99","2","M200_R1030_1232",200.0240218,"CC1=C(C=CC(=C1)Cl)OCC(=O)O","WHKUVVPPKQRRBV-UHFFFAOYSA-N","InChI=1S/C9H9ClO3/c1-6-4-7(10)2-3-8(6)13-5-9(11)12/h2-4H,5H2,1H3,(H,11,12)",7204,"C9H9ClO3","2-(4-chloro-2-methylphenoxy)acetic acid","MCPA",0.99441,"2",372,1029.61164,199.076280382707,NA,NA,NA,NA,NA,NA,NA,NA,"[M-H]-",200.083556834797,504716.5,633478.625,866125.8125,0,252649.09375,292817.40625,0,424285.09375
"100","2","M202_R882_1257",202.12050905,"C(CCCCC(=O)O)CCCC(=O)O","CXMXRPHRNRROMY-UHFFFAOYSA-N","InChI=1S/C10H18O4/c11-9(12)7-5-3-1-2-4-6-8-10(13)14/h1-8H2,(H,11,12)(H,13,14)",5192,"C10H18O4","decanedioic acid","sebacic acid",0.60271,"3b",382,882.10512,201.076381071047,NA,NA,NA,NA,NA,NA,NA,NA,"[M-H]-",202.083657523138,0,0,0,0,654660.6875,0,0,0
"101","2","M211_R765_1347",211.14331018,"CCNC1=NC(=O)NC(=N1)NC(C)(C)C","OYTCZOJKXCTBHG-UHFFFAOYSA-N","InChI=1S/C9H17N5O/c1-5-10-6-11-7(13-8(15)12-6)14-9(2,3)4/h5H2,1-4H3,(H3,10,11,12,13,14,15)",135495928,"C9H17N5O","6-(tert-butylamino)-4-(ethylamino)-1H-1,3,5-triazin-2-one","Terbutylazine-2-hydroxy",0.49759,"3b",421,764.5707,210.135740802622,NA,NA,NA,NA,NA,NA,NA,NA,"[M-H]-",211.143017254713,307620.8125,540652.75,33742.65234375,381868.1875,115633.5,76621.046875,108949.484375,566445.8125
"102","2","M220_R987_1436",219.9693994,"COC1=C(C=CC(=C1C(=O)O)Cl)Cl","IWEDIXLBFLAXBO-UHFFFAOYSA-N","InChI=1S/C8H6Cl2O3/c1-13-7-5(10)3-2-4(9)6(7)8(11)12/h2-3H,1H3,(H,11,12)",3030,"C8H6Cl2O3","3,6-dichloro-2-methoxybenzoic acid","dicamba",0.95021,"2",456,986.96778,218.986083734241,NA,NA,NA,NA,NA,NA,NA,NA,"[M-H]-",219.993360186331,363368.0625,405882.5625,0,218395.21875,205977.171875,0,0,359035.8125
"103","2","M232_R1059_1567",232.0170183,"CN(C)C(=O)NC1=CC(=C(C=C1)Cl)Cl","XMTQQYYKAHVGBJ-UHFFFAOYSA-N","InChI=1S/C9H10Cl2N2O/c1-13(2)9(14)12-6-3-4-7(10)8(11)5-6/h3-5H,1-2H3,(H,12,14)",3120,"C9H10Cl2N2O","3-(3,4-dichlorophenyl)-1,1-dimethylurea","diuron",0.56101,"3b",519,1058.8461,231.021546620436,NA,NA,NA,NA,NA,NA,NA,NA,"[M-H]-",232.028823072527,12705864,223579.21875,0,139814.515625,0,214070.484375,0,235157.28125
"104","2","M236_R975_1616",236.094963011,"C1=CC=C2C(=C1)C=CC3=CC=CC=C3N2C(=O)N","FFGPTBGBLSHEPO-UHFFFAOYSA-N","InChI=1S/C15H12N2O/c16-15(18)17-13-7-3-1-5-11(13)9-10-12-6-2-4-8-14(12)17/h1-10H,(H2,16,18)",2554,"C15H12N2O","benzo[b][1]benzazepine-11-carboxamide","carbamazepine",0.98717,"2",543,974.60286,235.087168405194,NA,NA,NA,NA,NA,NA,NA,NA,"[M-H]-",236.094444857284,2895467.5,884328.4375,0,509078.96875,0,0,0,1065579.5
"105","2","M240_R1137_1651",240.07462149,"CC(C)(C)C1=C(C(=CC(=C1)[N+](=O)[O-])[N+](=O)[O-])O","IIPZYDQGBIWLBU-UHFFFAOYSA-N","InChI=1S/C10H12N2O5/c1-10(2,3)7-4-6(11(14)15)5-8(9(7)13)12(16)17/h4-5,13H,1-3H3",14994,"C10H12N2O5","2-tert-butyl-4,6-dinitrophenol","DINOTERB",0.71652,"3a",556,1137.07728,239.087516083788,NA,NA,NA,NA,NA,NA,NA,NA,"[M-H]-",240.094792535879,0,0,0,0,0,2912494,0,0
"106","2","M241_R942_1664",241.1361168,"CCNC1=NC(=NC(=N1)SC)NC(C)(C)C","IROINLKCQGIITA-UHFFFAOYSA-N","InChI=1S/C10H19N5S/c1-6-11-7-12-8(15-10(2,3)4)14-9(13-7)16-5/h6H2,1-5H3,(H2,11,12,13,14,15)",13450,"C10H19N5S","2-N-tert-butyl-4-N-ethyl-6-methylsulfanyl-1,3,5-triazine-2,4-diamine","Terbutryn",0.99997,"2",563,941.6475,240.066351030957,NA,NA,NA,NA,NA,NA,NA,NA,"[M-H]-",241.073627483048,0,464380.21875,177183,166899.1875,110189.21875,133018.609375,215511.46875,563411.375
"107","2","M245_R627_1716",245.11642673,"CC1=C(C(=O)N(N1C)C2=CC=CC=C2)NC(=O)C","OIAGWXKSCXPNNZ-UHFFFAOYSA-N","InChI=1S/C13H15N3O2/c1-9-12(14-10(2)17)13(18)16(15(9)3)11-7-5-4-6-8-11/h4-8H,1-3H3,(H,14,17)",65743,"C13H15N3O2","N-(1,5-dimethyl-3-oxo-2-phenylpyrazol-4-yl)acetamide","4-Acetamidoantipyrine",0.99667,"2",591,626.8431,244.0281999286,NA,NA,NA,NA,NA,NA,NA,NA,"[M-H]-",245.035476380691,116289.4921875,0,0,0,0,0,0,0
"108","2","M250_R777_1768",250.13174244,"CC(=O)N[C@H](COC)C(=O)NCC1=CC=CC=C1","VPPJLAIAVCUEMN-GFCCVEGCSA-N","InChI=1S/C13H18N2O3/c1-10(16)15-12(9-18-2)13(17)14-8-11-6-4-3-5-7-11/h3-7,12H,8-9H2,1-2H3,(H,14,17)(H,15,16)/t12-/m1/s1",219078,"C13H18N2O3","(2R)-2-acetamido-N-benzyl-3-methoxypropanamide","Lacosamide",0.87359,"3a",613,776.85468,249.124154073168,NA,NA,NA,NA,NA,NA,NA,NA,"[M-H]-",250.131430525259,78725.71875,47929.234375,185550.34375,0,56514.71875,44813.22265625,0,46635.83984375
"109","2","M252_R860_1792",252.08987763,"C1=CC=C2C(=C1)C3C(O3)C4=CC=CC=C4N2C(=O)N","ZRWWEEVEIOGMMT-UHFFFAOYSA-N","InChI=1S/C15H12N2O2/c16-15(18)17-11-7-3-1-5-9(11)13-14(19-13)10-6-2-4-8-12(10)17/h1-8,13-14H,(H2,16,18)",2555,"C15H12N2O2","3-oxa-11-azatetracyclo[10.4.0.02,4.05,10]hexadeca-1(16),5,7,9,12,14-hexaene-11-carboxamide","36507-30-9",0.79506,"3a",624,859.67766,251.082546826719,NA,NA,NA,NA,NA,NA,NA,NA,"[M-H]-",252.08982327881,654378.0625,0,0,0,484147.3125,0,0,0
"110","2","M252_R860_1792",252.08987763,"C1=CC=C2C(=C1)C=CC3=C(N2C(=O)N)C=CC(=C3)O","VPZIYMMSJFWLSP-UHFFFAOYSA-N","InChI=1S/C15H12N2O2/c16-15(19)17-13-4-2-1-3-10(13)5-6-11-9-12(18)7-8-14(11)17/h1-9,18H,(H2,16,19)",129274,"C15H12N2O2","3-hydroxybenzo[b][1]benzazepine-11-carboxamide","2-Hydroxycarbamazepine",0.48075,"3b",624,859.67766,251.082546826719,NA,NA,NA,NA,NA,NA,NA,NA,"[M-H]-",252.08982327881,654378.0625,0,0,0,484147.3125,0,0,0
"111","2","M253_R725_1803",253.05211239,"CC1=CC(=NO1)NS(=O)(=O)C2=CC=C(C=C2)N","JLKIGFTWXXRPMT-UHFFFAOYSA-N","InChI=1S/C10H11N3O3S/c1-7-6-10(12-16-7)13-17(14,15)9-4-2-8(11)3-5-9/h2-6H,11H2,1H3,(H,12,13)",5329,"C10H11N3O3S","4-amino-N-(5-methyl-1,2-oxazol-3-yl)benzenesulfonamide","sulfamethoxazole",0.96406,"2",630,724.62594,252.044692179479,NA,NA,NA,NA,NA,NA,NA,NA,"[M-H]-",253.05196863157,42697.79296875,208068.5625,24275.0703125,127517.546875,26751.5546875,61823.828125,53147.75,283093.59375
"112","2","M270_R1191_1994",270.05282342,"C1=CC(=CC=C1C2=COC3=CC(=CC(=C3C2=O)O)O)O","TZBJGXHYKVUXJN-UHFFFAOYSA-N","InChI=1S/C15H10O5/c16-9-3-1-8(2-4-9)11-7-20-13-6-10(17)5-12(18)14(13)15(11)19/h1-7,16-18H",5280961,"C15H10O5","5,7-dihydroxy-3-(4-hydroxyphenyl)chromen-4-one","genistein",0.58476,"3b",731,1190.89332,269.175155732961,NA,NA,NA,NA,NA,NA,NA,NA,"[M-H]-",270.182432185052,1579215.875,1566383.875,597028.125,1223102,867087.0625,1483796,749929.4375,4357252.5
"113","2","M270_R870_1996",270.10044231,"C1=CC=C2C(=C1)[C@@H]([C@H](C3=CC=CC=C3N2C(=O)N)O)O","PRGQOPPDPVELEG-KBPBESRZSA-N","InChI=1S/C15H14N2O3/c16-15(20)17-11-7-3-1-5-9(11)13(18)14(19)10-6-2-4-8-12(10)17/h1-8,13-14,18-19H,(H2,16,20)/t13-,14-/m0/s1",114725,"C15H14N2O3","(5S,6S)-5,6-dihydroxy-5,6-dihydrobenzo[b][1]benzazepine-11-carboxamide","58955-93-4",0.80254,"3a",733,870.10482,269.086640172898,NA,NA,NA,NA,NA,NA,NA,NA,"[M-H]-",270.093916624989,2772581.75,1275002.875,200512.234375,1326320.125,130922.046875,805123.5625,500030.15625,2301332
"114","2","M272_R368_2014",272.11946368,"CC(C)NCC(C1=CC=C(C=C1)NS(=O)(=O)C)O","ZBMZVLHSJCTVON-UHFFFAOYSA-N","InChI=1S/C12H20N2O3S/c1-9(2)13-8-12(15)10-4-6-11(7-5-10)14-18(3,16)17/h4-7,9,12-15H,8H2,1-3H3",5253,"C12H20N2O3S","N-[4-[1-hydroxy-2-(propan-2-ylamino)ethyl]phenyl]methanesulfonamide","sotalol",0.95775,"2",744,368.488464,271.112074819254,NA,NA,NA,NA,NA,NA,NA,NA,"[M-H]-",272.119351271345,28010.01171875,0,0,0,0,0,0,0
"115","2","M275_R992_2043",275.0746777,"CC1=CSC(=C1N(C(C)COC)C(=O)CCl)C","JLYFCTQDENRSOL-UHFFFAOYSA-N","InChI=1S/C12H18ClNO2S/c1-8-7-17-10(3)12(8)14(11(15)5-13)9(2)6-16-4/h7,9H,5-6H2,1-4H3",91744,"C12H18ClNO2S","2-chloro-N-(2,4-dimethylthiophen-3-yl)-N-(1-methoxypropan-2-yl)acetamide","Dimethenamid",0.99903,"2",762,992.10186,274.119986688067,NA,NA,NA,NA,NA,NA,NA,NA,"[M-H]-",275.127263140158,0,0,0,0,0,0,0,448754.0625
"116","2","M278_R1028_2078",278.086052095,"C1=CC=C(C=C1)P(=O)(C2=CC=CC=C2)C3=CC=CC=C3","FIQMHBFVRAXMOP-UHFFFAOYSA-N","InChI=1S/C18H15OP/c19-20(16-10-4-1-5-11-16,17-12-6-2-7-13-17)18-14-8-3-9-15-18/h1-15H",13097,"C18H15OP","diphenylphosphorylbenzene","TRIPHENYLPHOSPHINE OXIDE",0.79783,"3a",784,1028.1012,277.133628007855,NA,NA,NA,NA,NA,NA,NA,NA,"[M-H]-",278.140904459946,0,0,0,0,0,0,0,1451262.25
"117","2","M281_R1155_2115",281.06636305,"C1=CC=C(C(=C1)C(=O)O)NC2=CC=CC(=C2)C(F)(F)F","LPEPZBJOKDYZAD-UHFFFAOYSA-N","InChI=1S/C14H10F3NO2/c15-14(16,17)9-4-3-5-10(8-9)18-12-7-2-1-6-11(12)13(19)20/h1-8,18H,(H,19,20)",3371,"C14H10F3NO2","2-[3-(trifluoromethyl)anilino]benzoic acid","flufenamic acid",0.99995,"2",806,1155.26985,280.157485399153,NA,NA,NA,NA,NA,NA,NA,NA,"[M-H]-",281.164761851244,5178317,1092375.75,0,0,0,0,0,4238945
"118","2","M283_R1086_2138",283.1339066,"CCC1=CC=CC(=C1N(C(C)COC)C(=O)CCl)C","WVQBLGZPHOPPFO-UHFFFAOYSA-N","InChI=1S/C15H22ClNO2/c1-5-13-8-6-7-11(2)15(13)17(14(18)9-16)12(3)10-19-4/h6-8,12H,5,9-10H2,1-4H3",4169,"C15H22ClNO2","2-chloro-N-(2-ethyl-6-methylphenyl)-N-(1-methoxypropan-2-yl)acetamide","metolachlor",0.99913,"2",817,1086.49842,282.120989438453,NA,NA,NA,NA,NA,NA,NA,NA,"[M-H]-",283.128265890544,0,0,0,330245.0625,0,0,0,0
"119","2","M286_R990_2175",286.0509053,"C1=CC=C(C=C1)C2=NC(C(=O)NC3=C2C=C(C=C3)Cl)O","ADIMAYPTOBDMTL-UHFFFAOYSA-N","InChI=1S/C15H11ClN2O2/c16-10-6-7-12-11(8-10)13(9-4-2-1-3-5-9)18-15(20)14(19)17-12/h1-8,15,20H,(H,17,19)",4616,"C15H11ClN2O2","7-chloro-3-hydroxy-5-phenyl-1,3-dihydro-1,4-benzodiazepin-2-one","oxazepam",0.95759,"2",838,990.37623,285.096591747883,NA,NA,NA,NA,NA,NA,NA,NA,"[M-H]-",286.103868199974,1053389.125,1174595.375,1847666,362851.78125,1678830.75,0,0,617609.8125
"120","2","M290_R678_2214",290.13789045,"COC1=CC(=CC(=C1OC)OC)CC2=CN=C(N=C2N)N","IEDVJHCEMCRBQM-UHFFFAOYSA-N","InChI=1S/C14H18N4O3/c1-19-10-5-8(6-11(20-2)12(10)21-3)4-9-7-17-14(16)18-13(9)15/h5-7H,4H2,1-3H3,(H4,15,16,17,18)",5578,"C14H18N4O3","5-[(3,4,5-trimethoxyphenyl)methyl]pyrimidine-2,4-diamine","trimethoprim",0.95078,"2",859,677.94132,289.129566931045,NA,NA,NA,NA,NA,NA,NA,NA,"[M-H]-",290.136843383136,0,64107.2578125,0,0,0,0,0,0
"121","2","M297_R489_2297",296.9644758,"C1NC2=CC(=C(C=C2S(=O)(=O)N1)S(=O)(=O)N)Cl","JZUFKLXOESDKRF-UHFFFAOYSA-N","InChI=1S/C7H8ClN3O4S2/c8-4-1-5-7(2-6(4)16(9,12)13)17(14,15)11-3-10-5/h1-2,10-11H,3H2,(H2,9,12,13)",3639,"C7H8ClN3O4S2","6-chloro-1,1-dioxo-3,4-dihydro-2H-1lambda6,2,4-benzothiadiazine-7-sulfonamide","hydrochlorothiazide",0.9921,"2",903,489.332814,295.956901583993,NA,NA,NA,NA,NA,NA,NA,NA,"[M-H]-",296.964178036083,1737189.625,289649.75,0,315284.03125,39572.7890625,87602.9375,140096.859375,346962.15625
"122","2","M299_R490_2322",299.15214353,"CN1CC[C@]23[C@@H]4[C@H]1CC5=C2C(=C(C=C5)OC)O[C@H]3[C@H](C=C4)O","OROGSEYTTFOCAN-DNJOTXNNSA-N","InChI=1S/C18H21NO3/c1-19-8-7-18-11-4-5-13(20)17(18)22-16-14(21-2)6-3-10(15(16)18)9-12(11)19/h3-6,11-13,17,20H,7-9H2,1-2H3/t11-,12+,13-,17-,18-/m0/s1",5284371,"C18H21NO3","(4R,4aR,7S,7aR,12bS)-9-methoxy-3-methyl-2,4,4a,7,7a,13-hexahydro-1H-4,12-methanobenzofuro[3,2-e]isoquinolin-7-ol","codeine",0.94777,"2",916,490.100034,297.95388252847,NA,NA,NA,NA,NA,NA,NA,NA,"[M-H]-",298.96115898056,526279.6875,108727.578125,0,83495.1015625,0,33362.078125,54582.23046875,98337.375
"123","2","M300_R967_2334",299.95026852,"C(C(C(F)(F)S(=O)(=O)O)(F)F)(C(F)(F)F)(F)F","JGTNAGYHADQMCM-UHFFFAOYSA-N","InChI=1S/C4HF9O3S/c5-1(6,3(9,10)11)2(7,8)4(12,13)17(14,15)16/h(H,14,15,16)",67815,"C4HF9O3S","1,1,2,2,3,3,4,4,4-nonafluorobutane-1-sulfonic acid","perfluorobutanesulfonic acid",0.71641,"3a",922,966.75192,298.942835673308,NA,NA,NA,NA,NA,NA,NA,NA,"[M-H]-",299.950112125398,489222,504011.1875,192020.59375,365866.875,0,1616518.5,152794.90625,457171.15625
"124","2","M307_R1095_2418",307.14514,"CC(C)(C)C(CCC1=CC=C(C=C1)Cl)(CN2C=NC=N2)O","PXMNMQRDXWABCY-UHFFFAOYSA-N","InChI=1S/C16H22ClN3O/c1-15(2,3)16(21,10-20-12-18-11-19-20)9-8-13-4-6-14(17)7-5-13/h4-7,11-12,21H,8-10H2,1-3H3",86102,"C16H22ClN3O","1-(4-chlorophenyl)-4,4-dimethyl-3-(1,2,4-triazol-1-ylmethyl)pentan-3-ol","Tebuconazole",0.99938,"2",969,1095.3888,306.07699195818,NA,NA,NA,NA,NA,NA,NA,NA,"[M-H]-",307.084268410271,1680711.5,2594433.5,1274125.625,1940741.25,559525,1160057.625,837509.0625,4414321
"125","2","M308_R907_2426",308.03545927,"COC1=C(C=C(C(=C1)O)C(=O)C2=CC=CC=C2)S(=O)(=O)O","CXVGEDCSTKKODG-UHFFFAOYSA-N","InChI=1S/C14H12O6S/c1-20-12-8-11(15)10(7-13(12)21(17,18)19)14(16)9-5-3-2-4-6-9/h2-8,15H,1H3,(H,17,18,19)",19988,"C14H12O6S","5-benzoyl-4-hydroxy-2-methoxybenzenesulfonic acid","Sulisobenzone",0.86149,"3a",973,906.78516,307.028073350017,NA,NA,NA,NA,NA,NA,NA,NA,"[M-H]-",308.035349802108,6558771,2921719.75,376645.625,1485140.75,306806.65625,873559.5,451113.96875,2231486
"126","2","M323_R816_2610",323.09397721,"CC1=C(C(=CC=C1)C)N(CN2C=CC=N2)C(=O)CS(=O)(=O)O","IPVCSECPEVHQOV-UHFFFAOYSA-N","InChI=1S/C14H17N3O4S/c1-11-5-3-6-12(2)14(11)17(10-16-8-4-7-15-16)13(18)9-22(19,20)21/h3-8H,9-10H2,1-2H3,(H,19,20,21)",86290102,"C14H17N3O4S","2-[2,6-dimethyl-N-(pyrazol-1-ylmethyl)anilino]-2-oxoethanesulfonic acid","metazachlor ESA",0.97826,"2",1068,815.53242,322.086448454428,NA,NA,NA,NA,NA,NA,NA,NA,"[M-H]-",323.093724906519,40821.28515625,208647.484375,119249.9609375,39526.83203125,37424.59765625,130000.4609375,169643.8125,203114.015625
"127","2","M326_R1043_2645",326.000829,"CC(CCl)OP(=O)(OC(C)CCl)OC(C)CCl","KVMPUXDNESXNOH-UHFFFAOYSA-N","InChI=1S/C9H18Cl3O4P/c1-7(4-10)14-17(13,15-8(2)5-11)16-9(3)6-12/h7-9H,4-6H2,1-3H3",26176,"C9H18Cl3O4P","tris(1-chloropropan-2-yl) phosphate","13674-84-5",0.98937,"2",1084,1043.07054,325.111397970474,NA,NA,NA,NA,NA,NA,NA,NA,"[M-H]-",326.118674422565,6717486,0,0,0,0,0,0,4590383
"128","2","M329_R1006_2684",329.12969401,"CCC1=CC=CC(=C1N(C(C)COC)C(=O)CS(=O)(=O)O)C","CIGKZVUEZXGYSV-UHFFFAOYSA-N","InChI=1S/C15H23NO5S/c1-5-13-8-6-7-11(2)15(13)16(12(3)9-21-4)14(17)10-22(18,19)20/h6-8,12H,5,9-10H2,1-4H3,(H,18,19,20)",6426849,"C15H23NO5S","2-[2-ethyl-N-(1-methoxypropan-2-yl)-6-methylanilino]-2-oxoethanesulfonic acid","Metolachlor esa",0.96785,"2",1104,1005.97986,328.122298033701,NA,NA,NA,NA,NA,NA,NA,NA,"[M-H]-",329.129574485792,0,264516.75,0,0,422312.21875,0,0,0
"129","2","M330_R885_2696",330.0077203,"C1=COC(=C1)CNC2=CC(=C(C=C2C(=O)O)S(=O)(=O)N)Cl","ZZUFCTLCJUWOSV-UHFFFAOYSA-N","InChI=1S/C12H11ClN2O5S/c13-9-5-10(15-6-7-2-1-3-20-7)8(12(16)17)4-11(9)21(14,18)19/h1-5,15H,6H2,(H,16,17)(H2,14,18,19)",3440,"C12H11ClN2O5S","4-chloro-2-(furan-2-ylmethylamino)-5-sulfamoylbenzoic acid","furosemide",0.91643,"2",1111,885.00249,329.000353427679,NA,NA,NA,NA,NA,NA,NA,NA,"[M-H]-",330.00762987977,3089045.25,41594.18359375,0,0,78898.4296875,0,0,63243.2734375
"130","2","M363_R1115_3082",363.06646049,"CC(C)N(C1=CC=C(C=C1)F)C(=O)COC2=NN=C(S2)C(F)(F)F","IANUJLZYFUDJIH-UHFFFAOYSA-N","InChI=1S/C14H13F4N3O2S/c1-8(2)21(10-5-3-9(15)4-6-10)11(22)7-23-13-20-19-12(24-13)14(16,17)18/h3-6,8H,7H2,1-2H3",86429,"C14H13F4N3O2S","N-(4-fluorophenyl)-N-propan-2-yl-2-[[5-(trifluoromethyl)-1,3,4-thiadiazol-2-yl]oxy]acetamide","Flufenacet",0.6061,"3b",1299,1114.79568,361.996689215611,NA,NA,NA,NA,NA,NA,NA,NA,"[M-H]-",363.003965667702,546254.8125,152116.9375,0,326751.3125,0,247722.4375,395147.125,349447.4375
"131","2","M368_R908_3143",368.23112213,"CCC[C@@H](C(=O)OCC)N[C@@H](C)C(=O)N1[C@H]2CCCC[C@H]2C[C@H]1C(=O)O","IPVQLZZIHOAWMC-QXKUPLGCSA-N","InChI=1S/C19H32N2O5/c1-4-8-14(19(25)26-5-2)20-12(3)17(22)21-15-10-7-6-9-13(15)11-16(21)18(23)24/h12-16,20H,4-11H2,1-3H3,(H,23,24)/t12-,13-,14-,15-,16-/m0/s1",107807,"C19H32N2O5","(2S,3aS,7aS)-1-[(2S)-2-[[(2S)-1-ethoxy-1-oxopentan-2-yl]amino]propanoyl]-2,3,3a,4,5,6,7,7a-octahydroindole-2-carboxylic acid","PERINDOPRIL",0.99834,"2",1324,908.37576,367.212323587879,NA,NA,NA,NA,NA,NA,NA,NA,"[M-H]-",368.21960003997,123625.109375,53863.3671875,0,144693.5,595139,131986.75,26898.732421875,65881.578125
"132","2","M369_R642_3154",369.17222752,"CCN1CCCC1CNC(=O)C2=CC(=C(C=C2OC)N)S(=O)(=O)CC","NTJOBXMMWNYJFB-UHFFFAOYSA-N","InChI=1S/C17H27N3O4S/c1-4-20-8-6-7-12(20)11-19-17(21)13-9-16(25(22,23)5-2)14(18)10-15(13)24-3/h9-10,12H,4-8,11,18H2,1-3H3,(H,19,21)",2159,"C17H27N3O4S","4-amino-N-[(1-ethylpyrrolidin-2-yl)methyl]-5-ethylsulfonyl-2-methoxybenzamide","amisulpride",0.99568,"2",1330,642.37386,368.163988123266,NA,NA,NA,NA,NA,NA,NA,NA,"[M-H]-",369.171264575357,50253.66796875,0,0,0,0,0,0,0
"133","2","M414_R815_3658",414.13781148,"C1CCNC(C1)CNC(=O)C2=C(C=CC(=C2)OCC(F)(F)F)OCC(F)(F)F","DJBNUMBKLMJRSA-UHFFFAOYSA-N","InChI=1S/C17H20F6N2O3/c18-16(19,20)9-27-12-4-5-14(28-10-17(21,22)23)13(7-12)15(26)25-8-11-3-1-2-6-24-11/h4-5,7,11,24H,1-3,6,8-10H2,(H,25,26)",3356,"C17H20F6N2O3","N-(piperidin-2-ylmethyl)-2,5-bis(2,2,2-trifluoroethoxy)benzamide","flecainide",0.99892,"2",1546,815.2113,413.13584294797,NA,NA,NA,NA,NA,NA,NA,NA,"[M-H]-",414.143119400061,167317.53125,0,131615.453125,0,143803.59375,0,0,0
"134","2","M428_R1001_3823",428.23245954,"CCCCC1=NC2(CCCC2)C(=O)N1CC3=CC=C(C=C3)C4=CC=CC=C4C5=NNN=N5","YOSHYTLCDANDAN-UHFFFAOYSA-N","InChI=1S/C25H28N6O/c1-2-3-10-22-26-25(15-6-7-16-25)24(32)31(22)17-18-11-13-19(14-12-18)20-8-4-5-9-21(20)23-27-29-30-28-23/h4-5,8-9,11-14H,2-3,6-7,10,15-17H2,1H3,(H,27,28,29,30)",3749,"C25H28N6O","2-butyl-3-[[4-[2-(2H-tetrazol-5-yl)phenyl]phenyl]methyl]-1,3-diazaspiro[4.4]non-1-en-4-one","irbesartan",0.99554,"2",1617,1001.48664,427.224914867331,NA,NA,NA,NA,NA,NA,NA,NA,"[M-H]-",428.232191319422,2931062,3105404.25,480137.78125,2247019.75,215193.46875,948595.3125,1044859.6875,5318105
"135","2","M430_R1001_3843",430.06104075,"CC(CS(=O)(=O)C1=CC=C(C=C1)F)(C(=O)NC2=CC(=C(C=C2)C#N)C(F)(F)F)O","LKJPYSCBVHEWIU-UHFFFAOYSA-N","InChI=1S/C18H14F4N2O4S/c1-17(26,10-29(27,28)14-6-3-12(19)4-7-14)16(25)24-13-5-2-11(9-23)15(8-13)18(20,21)22/h2-8,26H,10H2,1H3,(H,24,25)",2375,"C18H14F4N2O4S","N-[4-cyano-3-(trifluoromethyl)phenyl]-3-(4-fluorophenyl)sulfonyl-2-hydroxy-2-methylpropanamide","bicalutamide",0.97656,"2",1624,1000.93224,429.137670537513,NA,NA,NA,NA,NA,NA,NA,NA,"[M-H]-",430.144946989603,1593380.25,0,233751.796875,567284.5625,0,0,177859.21875,434326.8125
"136","2","M435_R1046_3914",435.2270398,"CCCCC(=O)N(CC1=CC=C(C=C1)C2=CC=CC=C2C3=NNN=N3)[C@@H](C(C)C)C(=O)O","ACWBQPMHZXGDFX-QFIPXVFZSA-N","InChI=1S/C24H29N5O3/c1-4-5-10-21(30)29(22(16(2)3)24(31)32)15-17-11-13-18(14-12-17)19-8-6-7-9-20(19)23-25-27-28-26-23/h6-9,11-14,16,22H,4-5,10,15H2,1-3H3,(H,31,32)(H,25,26,27,28)/t22-/m0/s1",60846,"C24H29N5O3","(2S)-3-methyl-2-[pentanoyl-[[4-[2-(2H-tetrazol-5-yl)phenyl]phenyl]methyl]amino]butanoic acid","valsartan",0.98237,"2",1647,1045.85775,434.218614333888,NA,NA,NA,NA,NA,NA,NA,NA,"[M-H]-",435.225890785979,2435277.75,859273.5,0,167831.125,156189.53125,0,0,700179.0625
"137","2","M436_R1092_3921",435.9387063,"C1=C(C=C(C(=C1Cl)N2C(=C(C(=N2)C#N)S(=O)C(F)(F)F)N)Cl)C(F)(F)F","ZOCSXAVNDGMNBV-UHFFFAOYSA-N","InChI=1S/C12H4Cl2F6N4OS/c13-5-1-4(11(15,16)17)2-6(14)8(5)24-10(22)9(7(3-21)23-24)26(25)12(18,19)20/h1-2H,22H2",3352,"C12H4Cl2F6N4OS","5-amino-1-[2,6-dichloro-4-(trifluoromethyl)phenyl]-4-(trifluoromethylsulfinyl)pyrazole-3-carbonitrile","fipronil",0.9625,"2",1650,1092.37494,434.931067729495,NA,NA,NA,NA,NA,NA,NA,NA,"[M-H]-",435.938344181585,381045.125,266499.03125,0,89409.390625,0,121055.78125,149255.875,783232.5
"138","2","M445_R1034_4026",445.02794393,"COC1=NC(=NC(=N1)NC(=O)NS(=O)(=O)C2=CC=CC=C2C(F)(F)F)C(F)(F)F","KVEQCVKVIFQSGC-UHFFFAOYSA-N","InChI=1S/C13H9F6N5O4S/c1-28-11-21-8(13(17,18)19)20-9(23-11)22-10(25)24-29(26,27)7-5-3-2-4-6(7)12(14,15)16/h2-5H,1H3,(H2,20,21,22,23,24,25)",11657899,"C13H9F6N5O4S","1-[4-methoxy-6-(trifluoromethyl)-1,3,5-triazin-2-yl]-3-[2-(trifluoromethyl)phenyl]sulfonylurea","Tritosulfuron",0.99918,"2",1696,1033.74498,444.020354040303,NA,NA,NA,NA,NA,NA,NA,NA,"[M-H]-",445.027630492394,0,223261.859375,373648.8125,297580.71875,106073.4921875,170835.875,124080.578125,449594.34375
"139","2","M501_R933_4696",501.28790873,"CC(C)(C1=CC=C(C=C1)C(CCCN2CCC(CC2)C(C3=CC=CC=C3)(C4=CC=CC=C4)O)O)C(=O)O","RWTNPBWLLIMQHL-UHFFFAOYSA-N","InChI=1S/C32H39NO4/c1-31(2,30(35)36)25-17-15-24(16-18-25)29(34)14-9-21-33-22-19-28(20-23-33)32(37,26-10-5-3-6-11-26)27-12-7-4-8-13-27/h3-8,10-13,15-18,28-29,34,37H,9,14,19-23H2,1-2H3,(H,35,36)",3348,"C32H39NO4","2-[4-[1-hydroxy-4-[4-[hydroxy(diphenyl)methyl]piperidin-1-yl]butyl]phenyl]-2-methylpropanoic acid","fexofenadine",0.980385,"2",1978,932.81442,500.28038203879,NA,NA,NA,NA,NA,NA,NA,NA,"[M-H]-",501.287658490881,612904.125,293353.53125,0,265043.78125,0,183696.5625,197454.265625,689238.6875
"140","2","M514_R986_4852",514.23687621,"CCCC1=NC2=C(N1CC3=CC=C(C=C3)C4=CC=CC=C4C(=O)O)C=C(C=C2C)C5=NC6=CC=CC=C6N5C","RMMXLENWKUUMAY-UHFFFAOYSA-N","InChI=1S/C33H30N4O2/c1-4-9-30-35-31-21(2)18-24(32-34-27-12-7-8-13-28(27)36(32)3)19-29(31)37(30)20-22-14-16-23(17-15-22)25-10-5-6-11-26(25)33(38)39/h5-8,10-19H,4,9,20H2,1-3H3,(H,38,39)",65999,"C33H30N4O2","2-[4-[[4-methyl-6-(1-methylbenzimidazol-2-yl)-2-propylbenzimidazol-1-yl]methyl]phenyl]benzoic acid","Telmisartan",0.950345,"2",2041,986.14641,513.228872193811,NA,NA,NA,NA,NA,NA,NA,NA,"[M-H]-",514.236148645902,533565.5,531809.8125,0,436788.3125,0,0,0,496947.5
