{
  "file_generated_by": "FlutterFire CLI",
  "purpose": "FirebaseAppID & ProjectID for this Firebase app in this directory",
  "GOOGLE_APP_ID": "1:1577914464:ios:f586df1be4ebde7932b305",
  "FIREBASE_PROJECT_ID": "chatzoom-73b06",
  "GCM_SENDER_ID": "1577914464"
}