-- Merging decision tree log ---
manifest
ADDED from C:\Users\va200\AppData\Local\Pub\Cache\hosted\pub.dev\geocoding_android-2.1.2\android\src\main\AndroidManifest.xml:1:1-2:12
INJECTED from C:\Users\va200\AppData\Local\Pub\Cache\hosted\pub.dev\geocoding_android-2.1.2\android\src\main\AndroidManifest.xml:1:1-2:12
INJECTED from C:\Users\va200\AppData\Local\Pub\Cache\hosted\pub.dev\geocoding_android-2.1.2\android\src\main\AndroidManifest.xml:1:1-2:12
	package
		INJECTED from C:\Users\va200\AppData\Local\Pub\Cache\hosted\pub.dev\geocoding_android-2.1.2\android\src\main\AndroidManifest.xml
		ADDED from C:\Users\va200\AppData\Local\Pub\Cache\hosted\pub.dev\geocoding_android-2.1.2\android\src\main\AndroidManifest.xml:1:1-2:12
		INJECTED from C:\Users\va200\AppData\Local\Pub\Cache\hosted\pub.dev\geocoding_android-2.1.2\android\src\main\AndroidManifest.xml
	xmlns:android
		ADDED from C:\Users\va200\AppData\Local\Pub\Cache\hosted\pub.dev\geocoding_android-2.1.2\android\src\main\AndroidManifest.xml:1:11-69
uses-sdk
INJECTED from C:\Users\va200\AppData\Local\Pub\Cache\hosted\pub.dev\geocoding_android-2.1.2\android\src\main\AndroidManifest.xml reason: use-sdk injection requested
INJECTED from C:\Users\va200\AppData\Local\Pub\Cache\hosted\pub.dev\geocoding_android-2.1.2\android\src\main\AndroidManifest.xml
INJECTED from C:\Users\va200\AppData\Local\Pub\Cache\hosted\pub.dev\geocoding_android-2.1.2\android\src\main\AndroidManifest.xml
INJECTED from C:\Users\va200\AppData\Local\Pub\Cache\hosted\pub.dev\geocoding_android-2.1.2\android\src\main\AndroidManifest.xml
INJECTED from C:\Users\va200\AppData\Local\Pub\Cache\hosted\pub.dev\geocoding_android-2.1.2\android\src\main\AndroidManifest.xml
	android:targetSdkVersion
		INJECTED from C:\Users\va200\AppData\Local\Pub\Cache\hosted\pub.dev\geocoding_android-2.1.2\android\src\main\AndroidManifest.xml
		ADDED from C:\Users\va200\AppData\Local\Pub\Cache\hosted\pub.dev\geocoding_android-2.1.2\android\src\main\AndroidManifest.xml
		INJECTED from C:\Users\va200\AppData\Local\Pub\Cache\hosted\pub.dev\geocoding_android-2.1.2\android\src\main\AndroidManifest.xml
	android:minSdkVersion
		INJECTED from C:\Users\va200\AppData\Local\Pub\Cache\hosted\pub.dev\geocoding_android-2.1.2\android\src\main\AndroidManifest.xml
		ADDED from C:\Users\va200\AppData\Local\Pub\Cache\hosted\pub.dev\geocoding_android-2.1.2\android\src\main\AndroidManifest.xml
		INJECTED from C:\Users\va200\AppData\Local\Pub\Cache\hosted\pub.dev\geocoding_android-2.1.2\android\src\main\AndroidManifest.xml
