<svg width="48" height="94" viewBox="0 0 48 94" fill="none" xmlns="http://www.w3.org/2000/svg">
<path d="M46 1.99999L4.22538 41.1637C0.854087 44.3243 0.854084 49.6757 4.22538 52.8363L46 92" stroke="#EE2624" stroke-width="3"/>
</svg>
