1 0.578983
1 0.3826
1 0.309909
1 0.306675
1 0.493372
1 0.460667
1 0.374674
1 0.391293
1 0.443113
1 0.447862
1 0.489258
1 0.453578
1 0.474864
1 0.693618
1 0.414745
1 0.485823
1 0.455884
1 0.406748
1 0.386795
1 0.477305
1 0.485027
1 0.394203
1 0.399175
1 0.301812
1 0.3392
1 0.458602
1 0.489651
1 0.498243
1 0.454426
1 0.278871
1 0.482437
1 0.329546
1 0.453379
1 0.450416
1 0.490656
1 0.432154
1 0.468016
1 0.448451
1 0.448608
1 0.447306
1 0.453977
1 0.444147
1 0.448651
1 0.501698
1 0.497751
1 0.465062
1 0.446047
1 0.419479
1 0.449782
1 0.481666
1 0.465621
1 0.477263
1 0.492734
1 0.539677
1 0.487314
1 0.432317
1 0.444864
1 0.483067
1 0.414655
1 0.426024
1 0.42206
1 0.400672
1 0.346248
1 0.399579
1 0.394289
1 0.51241
1 0.444613
1 0.443339
1 0.451592
1 0.674832
1 0.338934
1 0.483369
1 0.448121
1 0.469953
1 0.358242
1 0.3906
1 0.488142
1 0.368618
1 0.437105
1 0.520074
1 0.384008
1 0.424387
1 0.451229
1 0.295458
1 0.275547
1 0.444395
1 0.407849
1 0.422534
1 0.555914
1 0.391011
1 0.408609
1 0.443685
1 0.493172
1 0.436
1 0.510298
1 0.402453
1 0.458568
1 0.471504
1 0.491413
1 0.474947
2 0.698632
2 0.566714
2 0.488207
2 0.590941
2 0.605097
2 0.338898
2 0.446665
2 0.479451
2 0.463582
2 0.48172
2 0.423255
2 0.350797
2 0.338417
2 0.35763
2 0.306097
2 0.423526
2 0.325105
2 0.401476
2 0.548468
2 0.424407
2 0.332611
2 0.359296
2 0.378922
2 0.395633
2 0.453962
2 0.515488
2 0.581011
2 0.566496
2 0.702069
2 0.465808
2 0.528629
2 0.551229
2 0.359747
2 0.548791
2 0.505222
2 0.584811
2 0.463542
2 0.637982
2 0.521972
2 0.559484
2 0.506589
2 0.574694
2 0.569423
2 0.497017
2 0.588548
2 0.483362
2 0.57263
2 0.572387
2 0.515457
2 0.508442
2 0.486325
2 0.516016
2 0.504632
2 0.594169
2 0.547786
2 0.552122
2 0.564853
2 0.587045
2 0.494425
2 0.495812
2 0.494982
2 0.554299
2 0.541505
2 0.588369
2 0.506823
2 0.463811
2 0.553127
2 0.600822
2 0.548006
2 0.522802
2 0.49835
2 0.560366
2 0.557444
2 0.495878
2 0.389581
2 0.50646
2 0.531752
2 0.457115
2 0.48716
2 0.382572
2 0.356552
2 0.319482
2 0.301208
2 0.409874
2 0.415638
2 0.537024
2 0.629278
2 0.351158
2 0.48711
2 0.497426
2 0.577661
2 0.512922
2 0.564643
2 0.665392
2 0.479586
2 0.539236
2 0.495963
2 0.569451
2 0.56909
2 0.538587
3 2.42301
3 4.11881
3 1.34814
3 1.2238
3 1.2937
3 1.36905
3 1.47698
3 1.63425
3 1.60882
3 1.63009
3 1.59372
3 1.49699
3 1.6334
3 1.58945
3 1.63454
3 1.8571
3 1.5905
3 1.50015
3 1.44313
3 1.41795
3 1.33733
3 1.65019
3 1.57958
3 1.53292
3 1.51738
3 1.62537
3 1.71366
3 1.51746
3 1.60024
3 1.79311
3 1.27964
3 1.29162
3 1.5642
3 1.29436
3 1.7259
3 1.75751
3 1.56976
3 1.53213
3 1.66812
3 1.49402
3 1.38031
3 1.65349
3 1.72435
3 1.45332
3 1.3584
3 1.56372
3 1.59044
3 1.33003
3 1.26709
3 1.36373
3 1.38217
3 1.63102
3 1.68775
3 1.50436
3 1.41885
3 1.65326
3 1.53561
3 1.7635
3 1.6076
3 1.6456
3 1.68133
3 1.49744
3 1.76402
3 2.22145
3 2.39883
3 2.25187
3 2.3344
3 2.1468
3 2.61353
3 2.16467
3 2.02391
3 1.6193
3 1.69266
3 1.45551
3 1.71145
3 1.74574
3 1.61051
3 1.52578
3 1.58507
3 1.50046
3 1.65015
3 1.42504
3 1.7247
3 1.59954
3 1.80861
3 1.45452
3 1.73581
3 1.5339
3 2.26249
3 1.39733
3 1.63589
3 1.60744
3 1.64005
3 1.54403
3 1.34274
3 1.64157
3 1.53436
3 1.59398
3 1.78841
3 1.71737
4 0.441061
4 0.341668
4 0.288434
4 0.389185
4 0.431071
4 0.464127
4 0.494737
4 0.604242
4 0.489209
4 0.428549
4 0.632696
4 0.521218
4 0.479256
4 0.474261
4 0.460243
4 0.535281
4 0.429916
4 0.634321
4 0.493943
4 0.537713
4 0.4117
4 0.539792
4 0.478237
4 0.532873
4 0.551357
4 0.456041
4 0.494821
4 0.512658
4 0.423694
4 0.324324
4 0.380178
4 0.314535
4 0.363405
4 0.373778
4 0.372628
4 0.335011
4 0.354646
4 0.340152
4 0.398546
4 0.370619
4 0.339494
4 0.327948
4 0.517039
4 0.432935
4 0.381735
4 0.394261
4 0.396971
4 0.347859
4 0.318812
4 0.312379
4 0.407709
4 0.379525
4 0.35672
4 0.561043
4 0.298194
4 0.350913
4 0.394115
4 0.387419
4 0.430102
4 0.55291
4 0.690768
4 0.331577
4 0.534892
4 0.507912
4 0.521902
4 0.518618
4 0.518138
4 0.556322
4 0.466615
4 0.501112
4 0.554906
4 0.606074
4 0.356959
4 0.446992
4 0.464284
4 0.409808
4 0.560532
4 0.510719
4 0.422044
4 0.517177
4 0.483059
4 0.344035
4 0.44096
4 0.580837
4 0.528776
4 0.445176
4 0.451365
4 0.495025
4 0.496691
4 0.534684
4 0.329074
4 0.345581
4 0.867252
4 0.544504
4 0.535776
4 0.533213
4 0.510909
4 0.580801
4 0.497552
4 0.492668
5 4.3783
5 3.64656
5 3.19269
5 3.17106
5 9.88606
5 3.36651
5 3.2098
5 3.48879
5 6.85692
5 3.04824
5 3.78231
5 2.5748
5 3.56206
5 3.56089
5 3.53518
5 3.08687
5 3.23431
5 3.82529
5 3.2304
5 3.40678
5 3.73794
5 3.69787
5 2.93657
5 3.11082
5 3.54879
5 3.07596
5 3.49514
5 3.29671
5 1.93913
5 2.65488
5 1.7665
5 1.988
5 2.32453
5 2.16044
5 2.27708
5 3.44404
5 4.19621
5 3.15861
5 3.48546
5 3.82255
5 3.05162
5 12.6421
5 3.05192
5 3.95122
5 3.49048
5 3.74292
5 2.92406
5 3.34105
5 2.04751
5 4.04684
5 2.25618
5 2.40232
5 3.87082
5 3.42033
5 1.8373
5 3.83743
5 3.30068
5 3.74036
5 2.76127
5 3.39157
5 4.27605
5 3.612
5 4.01061
5 1.78344
5 2.25888
5 2.06101
5 2.27717
5 2.00671
5 3.19624
5 2.28815
5 1.80748
5 2.19931
5 2.07205
5 3.34381
5 3.41248
5 2.74512
5 2.94047
5 3.30597
5 3.26501
5 3.47097
5 2.52297
5 3.75745
5 3.07255
5 3.18545
5 3.761
5 4.02393
5 2.25036
5 4.00389
5 3.64103
5 3.26061
5 3.69038
5 3.75466
5 3.64674
5 3.34617
5 4.56545
5 3.93504
5 3.80513
5 3.71626
5 3.23879
5 2.30932
6 0.930217
6 0.614972
6 0.692531
6 0.953568
6 0.948927
6 1.08461
6 1.06862
6 0.793764
6 1.2282
6 1.06284
6 1.25872
6 1.05467
6 0.526013
6 1.02072
6 1.13236
6 1.01708
6 1.06957
6 1.15833
6 1.12938
6 1.07655
6 1.14054
6 1.20578
6 1.0776
6 0.9942
6 1.17683
6 1.04232
6 1.01769
6 1.17916
6 1.09831
6 1.19847
6 1.16447
6 1.20063
6 1.10372
6 1.16929
6 1.03068
6 1.19634
6 1.14136
6 1.22606
6 1.10936
6 0.918049
6 0.816611
6 1.02164
6 0.932927
6 1.28136
6 1.20706
6 1.12422
6 1.04411
6 0.98739
6 1.27385
6 1.09169
6 1.25444
6 0.607927
6 1.00385
6 1.22655
6 0.980668
6 1.06387
6 1.22542
6 0.968215
6 0.844149
6 0.801713
6 0.840945
6 0.627364
6 1.23992
6 1.21553
6 1.05753
6 1.09621
6 1.09167
6 1.04388
6 0.643703
6 0.794429
6 1.04581
6 0.806216
6 1.06365
6 1.3081
6 0.716523
6 1.21583
6 1.09362
6 1.22184
6 1.18999
6 1.09719
6 1.17273
6 1.0772
6 0.881787
6 0.978932
6 1.1376
6 1.20362
6 1.08157
6 1.20673
6 1.08717
6 1.19433
6 1.19131
6 0.918755
6 0.997255
6 1.23321
6 0.833323
6 1.15387
6 1.12704
6 1.23269
6 1.27695
6 1.35102
