1.30743
0.864807
1.3008
1.29562
1.32074
1.27607
1.33437
1.20737
1.3555
1.29015
1.34771
1.33114
1.26209
1.19595
1.27426
1.33854
1.33654
1.17826
1.30888
0.853987
1.37286
1.0047
0.85868
1.1449
1.38723
1.15592
1.40906
1.15023
1.08498
1.11378
1.13852
1.40415
0.970032
1.29818
1.34778
1.35816
1.30098
1.44251
1.35131
1.35124
1.32566
1.33296
1.43911
1.17244
1.42822
1.07966
1.03076
0.987997
0.990213
1.2942
0.740502
0.814406
1.187
1.34663
1.27584
1.30174
1.36443
1.33756
1.30552
1.30499
1.39168
1.31382
1.34875
1.34213
1.44062
1.32962
0.913749
1.19919
1.29036
0.856246
1.14347
1.12581
1.23724
1.31555
1.14913
1.29797
1.26204
1.30764
1.45355
1.36288
1.27904
1.35414
1.39344
1.38184
1.33175
0.64203
1.31101
1.31095
1.33066
1.40272
1.34369
1.34901
1.30791
1.36139
1.15552
1.18212
1.25889
1.38989
1.21818
1.37625
