\babel@toc {spanish}{}
\contentsline {section}{\numberline {1}Cap\IeC {\'\i }tulo 1. Introducci\'on}{2}
\contentsline {section}{\numberline {2}Marco te\'orico}{2}
\contentsline {section}{\numberline {3}soluci\'on}{3}
\contentsline {section}{\numberline {4}Funciones}{6}
\contentsline {section}{\numberline {5}An\'alisis de los resultados}{8}
\contentsline {section}{\numberline {6}Complejidad temporal}{9}
\contentsline {section}{\numberline {7}Conclusiones}{9}
