Method,Name,Error,Occurrences
POST,/cart,"""HTTPError('500 Server Error: Internal Server Error for url: /cart')""",772
POST,/orders,"""HTTPError('406 Client Error: Not Acceptable for url: /orders')""",1934
