Method,Name,Error,Occurrences
GET,/detail.html?id=a0a4f044-b040-410d-8ead-4de0446aec7e,"""ConnectionRefusedError(111, 'Connection refused')""",9
GET,/detail.html?id=d3588630-ad8e-49df-bbd7-3167f7efb246,"""ConnectionRefusedError(111, 'Connection refused')""",6
GET,/detail.html?id=d3588630-ad8e-49df-bbd7-3167f7efb246,"""ConnectionResetError(104, 'Connection reset by peer')""",2
POST,/orders,"""RemoteDisconnected('Remote end closed connection without response')""",31
POST,/cart,"""HTTPError('500 Server Error: Internal Server Error for url: /cart')""",1012
GET,/detail.html?id=3395a43e-2d88-40de-b95f-e00e1502085b,"""RemoteDisconnected('Remote end closed connection without response')""",2
GET,/basket.html,"""ConnectionRefusedError(111, 'Connection refused')""",98
GET,/login,"""ConnectionRefusedError(111, 'Connection refused')""",27
GET,/,"""RemoteDisconnected('Remote end closed connection without response')""",17
POST,/cart,"""ConnectionRefusedError(111, 'Connection refused')""",74
POST,/orders,"""HTTPError('406 Client Error: Not Acceptable for url: /orders')""",1144
GET,/detail.html?id=3395a43e-2d88-40de-b95f-e00e1502085b,"""ConnectionResetError(104, 'Connection reset by peer')""",1
GET,/detail.html?id=510a0d7e-8e83-4193-b483-e27e09ddc34d,"""ConnectionRefusedError(111, 'Connection refused')""",6
GET,/catalogue,"""ConnectionResetError(104, 'Connection reset by peer')""",5
GET,/detail.html?id=808a2de1-1aaa-4c25-a9b9-6612e8f29a38,"""ConnectionResetError(104, 'Connection reset by peer')""",1
GET,/detail.html?id=a0a4f044-b040-410d-8ead-4de0446aec7e,"""ConnectionResetError(104, 'Connection reset by peer')""",1
DELETE,/cart,"""ConnectionRefusedError(111, 'Connection refused')""",74
GET,/detail.html?id=819e1fbf-8b7e-4f6d-811f-693534916a8b,"""ConnectionRefusedError(111, 'Connection refused')""",5
GET,/detail.html?id=zzz4f044-b040-410d-8ead-4de0446aec7e,"""RemoteDisconnected('Remote end closed connection without response')""",3
GET,/basket.html,"""RemoteDisconnected('Remote end closed connection without response')""",8
GET,/,"""ConnectionResetError(104, 'Connection reset by peer')""",10
GET,/detail.html?id=a0a4f044-b040-410d-8ead-4de0446aec7e,"""RemoteDisconnected('Remote end closed connection without response')""",1
GET,/detail.html?id=03fef6ac-1896-4ce8-bd69-b798f85c6e0b,"""RemoteDisconnected('Remote end closed connection without response')""",3
GET,/category.html,"""ConnectionResetError(104, 'Connection reset by peer')""",5
GET,/detail.html?id=3395a43e-2d88-40de-b95f-e00e1502085b,"""ConnectionRefusedError(111, 'Connection refused')""",7
POST,/orders,"""ConnectionResetError(104, 'Connection reset by peer')""",7
GET,/detail.html?id=510a0d7e-8e83-4193-b483-e27e09ddc34d,"""RemoteDisconnected('Remote end closed connection without response')""",3
GET,/login,"""RemoteDisconnected('Remote end closed connection without response')""",43
GET,/category.html,"""ConnectionRefusedError(111, 'Connection refused')""",69
GET,/catalogue,"""RemoteDisconnected('Remote end closed connection without response')""",23
GET,/category.html,"""RemoteDisconnected('Remote end closed connection without response')""",7
GET,/detail.html?id=03fef6ac-1896-4ce8-bd69-b798f85c6e0b,"""ConnectionRefusedError(111, 'Connection refused')""",8
DELETE,/cart,"""RemoteDisconnected('Remote end closed connection without response')""",15
DELETE,/cart,"""ConnectionResetError(104, 'Connection reset by peer')""",3
GET,/login,"""ConnectionResetError(104, 'Connection reset by peer')""",8
GET,/detail.html?id=zzz4f044-b040-410d-8ead-4de0446aec7e,"""ConnectionResetError(104, 'Connection reset by peer')""",2
POST,/cart,"""ConnectionResetError(104, 'Connection reset by peer')""",7
POST,/orders,"""ConnectionRefusedError(111, 'Connection refused')""",96
GET,/detail.html?id=837ab141-399e-4c1f-9abc-bace40296bac,"""ConnectionRefusedError(111, 'Connection refused')""",10
GET,/detail.html?id=837ab141-399e-4c1f-9abc-bace40296bac,"""RemoteDisconnected('Remote end closed connection without response')""",2
GET,/detail.html?id=808a2de1-1aaa-4c25-a9b9-6612e8f29a38,"""ConnectionRefusedError(111, 'Connection refused')""",7
POST,/cart,"""RemoteDisconnected('Remote end closed connection without response')""",31
GET,/catalogue,"""ConnectionRefusedError(111, 'Connection refused')""",379
GET,/detail.html?id=zzz4f044-b040-410d-8ead-4de0446aec7e,"""ConnectionRefusedError(111, 'Connection refused')""",6
GET,/basket.html,"""ConnectionResetError(104, 'Connection reset by peer')""",10
