Type,Name,Request Count,Failure Count,Median Response Time,Average Response Time,Min Response Time,Max Response Time,Average Content Size,Requests/s,Failures/s,50%,66%,75%,80%,90%,95%,98%,99%,99.9%,99.99%,100%
GET,/,16439,24,750.0,720.8578709547628,14.927428972441703,2065.4588869656436,8675.454711357139,18.167469931958014,0.02652346726485749,750,840,950,980,1000,1200,1300,1400,1700,1800,2100
GET,/basket.html,16334,308,740.0,725.710876377008,5.5957300355657935,32176.44956096774,22587.636708705766,18.05142976267426,0.3403844965656711,740,850,950,980,1100,1200,1300,1500,1800,16000,32000
DELETE,/cart,16368,152,1300.0,1232.3734077268907,12.696179037448019,32958.86946702376,1.133003421309873,18.089004674632807,0.16798195934409743,1300,1500,1500,1600,1700,1900,2000,2200,2700,8800,33000
POST,/cart,16339,1898,2400.0,2259.6972519399637,31.421487976331264,67567.46685696999,8.381051471938306,18.056955485021106,2.09756420286248,2400,2600,2700,2800,3000,3300,4900,5700,6600,67000,68000
GET,/catalogue,34553,6151,1200.0,1202.1048018649994,19.903798995073885,65987.70167399198,1391.0608919630713,38.1860568501092,6.797743631089101,1200,1500,1600,1700,2000,2200,2500,3000,3500,33000,66000
GET,/category.html,16407,97,740.0,733.1634918838843,11.085778998676687,65436.753857997246,11449.723715487293,18.1321053089382,0.10719901352879903,740,820,940,970,1000,1200,1300,1400,1800,65000,65000
GET,/detail.html?id=03fef6ac-1896-4ce8-bd69-b798f85c6e0b,1780,16,750.0,745.9462000585876,42.651397990994155,31937.786634021904,10271.843258426967,1.9671571554769305,0.017682311509904992,750,840,950,970,1100,1200,1300,1500,3400,32000,32000
GET,/detail.html?id=3395a43e-2d88-40de-b95f-e00e1502085b,1796,13,760.0,729.652037275338,37.680667999666184,2863.2600490236655,10284.614699331849,1.9848394669868354,0.014366878101797808,760,840,940,970,1100,1200,1300,1400,1700,2900,2900
GET,/detail.html?id=510a0d7e-8e83-4193-b483-e27e09ddc34d,1790,6,750.0,754.1621801595259,15.018859005067497,65013.31372797722,10329.746368715083,1.9782086001706212,0.006630866816214372,750,830,940,970,1100,1200,1300,1400,2000,65000,65000
GET,/detail.html?id=808a2de1-1aaa-4c25-a9b9-6612e8f29a38,1859,20,750.0,754.0703451129667,42.99673700006679,65067.40483501926,10253.8224852071,2.0544635685570865,0.022102889387381242,750,830,940,970,1100,1200,1300,1400,7300,65000,65000
GET,/detail.html?id=819e1fbf-8b7e-4f6d-811f-693534916a8b,1853,16,760.0,746.0359667093104,22.571839042939246,31962.961226992775,10275.473826227739,2.047832701740872,0.017682311509904992,760,860,950,980,1100,1200,1300,1400,1800,32000,32000
GET,/detail.html?id=837ab141-399e-4c1f-9abc-bace40296bac,1812,15,750.0,749.8667498160486,44.36199797783047,32991.83961399831,10279.298013245034,2.0025217784967406,0.016577167040535933,750,850,960,980,1100,1200,1300,1400,1900,33000,33000
GET,/detail.html?id=a0a4f044-b040-410d-8ead-4de0446aec7e,1891,10,750.0,729.4923269801152,44.845568016171455,2012.02620199183,10309.88313061872,2.0898281915768964,0.011051444693690621,750,860,950,980,1100,1200,1300,1400,1900,2000,2000
GET,/detail.html?id=d3588630-ad8e-49df-bbd7-3167f7efb246,1773,11,750.0,758.3951056703835,44.54149800585583,65195.39218704449,10300.543147208122,1.9594211441913472,0.012156589163059683,750,840,950,970,1100,1200,1300,1400,2000,65000,65000
GET,/detail.html?id=zzz4f044-b040-410d-8ead-4de0446aec7e,1842,8,760.0,738.9760477978463,48.69905801024288,7185.943422024138,10319.484799131378,2.0356761125778124,0.008841155754952496,760,860,950,970,1100,1200,1300,1400,2100,7200,7200
GET,/login,16408,66,2300.0,2069.6946334357485,62.52531596692279,4848.348169995006,13.40193807898586,18.13321045340757,0.0729395349783581,2300,2500,2600,2700,2800,3000,3300,3400,4000,4800,4800
POST,/orders,16224,3363,3300.0,2964.4940042574553,30.26470897020772,5760.978272010107,555.5235453648916,17.929863871043665,3.716600850488156,3300,3500,3700,3800,4100,4400,4800,5000,5300,5600,5800
,Aggregated,165468,12174,1100.0,1381.7410870497768,5.5957300355657935,67567.46685696999,5593.905969734329,182.86604505755997,13.454028770098962,1100,1500,1800,2200,2800,3400,3900,4300,5800,32000,68000
