Type,Name,Request Count,Failure Count,Median Response Time,Average Response Time,Min Response Time,Max Response Time,Average Content Size,Requests/s,Failures/s,50%,66%,75%,80%,90%,95%,98%,99%,99.9%,99.99%,100%
GET,/,16599,0,230.0,216.74050275724906,12.520638993009925,733.4893689840101,8688.0,18.06124093464393,0.0,230,250,260,270,310,410,450,470,540,690,730
GET,/basket.html,16548,0,210.0,183.82255301588438,2.986569015774876,714.6526100113988,23020.0,18.005748237031614,0.0,210,230,240,250,280,350,430,450,520,700,710
DELETE,/cart,16577,0,290.0,319.61586927351186,12.266980018466711,971.1997240083292,0.0,18.03730290822293,0.0,290,400,440,450,490,510,650,690,910,970,970
POST,/cart,16553,1134,540.0,551.2356175729686,33.06025802157819,1530.8245249907486,4.384462031051773,18.01118869758184,1.2338964527915066,540,680,710,730,770,910,970,1000,1300,1500,1500
GET,/catalogue,16599,0,430.0,400.6760882108604,26.758587977383286,2252.183994045481,2795.0,18.06124093464393,0.0,430,470,490,510,580,690,740,780,990,2200,2300
GET,/category.html,16587,0,230.0,215.1366357351422,8.375940029509366,729.9937850330025,11518.0,18.048183829323385,0.0,230,250,260,270,300,410,440,460,520,670,730
GET,/detail.html?id=03fef6ac-1896-4ce8-bd69-b798f85c6e0b,1849,0,240.0,226.1603283630397,10.379020008258522,522.6382809923962,10364.0,2.011882311473982,0.0,240,260,270,280,390,420,450,480,510,520,520
GET,/detail.html?id=3395a43e-2d88-40de-b95f-e00e1502085b,1807,0,240.0,222.63421143220756,17.93720998102799,641.6691799531691,10364.0,1.9661824428520744,0.0,240,250,270,270,330,410,450,480,530,640,640
GET,/detail.html?id=510a0d7e-8e83-4193-b483-e27e09ddc34d,1896,0,240.0,223.7358880707911,25.540557981003076,707.1778870304115,10364.0,2.0630226406461167,0.0,240,260,270,280,380,420,450,470,520,710,710
GET,/detail.html?id=808a2de1-1aaa-4c25-a9b9-6612e8f29a38,1905,0,240.0,226.43671101133347,20.97875898471102,584.870635997504,10364.0,2.0728154696365255,0.0,240,260,270,280,390,420,450,470,560,580,580
GET,/detail.html?id=819e1fbf-8b7e-4f6d-811f-693534916a8b,1757,0,240.0,221.6499839285158,26.4460890321061,682.8626080532558,10364.0,1.9117778373498033,0.0,240,250,270,280,340,410,450,460,640,680,680
GET,/detail.html?id=837ab141-399e-4c1f-9abc-bace40296bac,1969,0,240.0,224.58466060289692,26.427009026519954,633.1213800003752,10364.0,2.1424533646794326,0.0,240,260,270,280,340,410,450,480,560,630,630
GET,/detail.html?id=a0a4f044-b040-410d-8ead-4de0446aec7e,1865,0,240.0,219.0694378930189,8.010139979887754,724.2562469909899,10364.0,2.029291785234709,0.0,240,250,260,270,340,410,450,470,520,720,720
GET,/detail.html?id=d3588630-ad8e-49df-bbd7-3167f7efb246,1769,0,240.0,224.5866955037691,14.439658960327506,634.5636899932288,10364.0,1.9248349426703484,0.0,240,260,270,280,320,410,450,480,550,630,630
GET,/detail.html?id=zzz4f044-b040-410d-8ead-4de0446aec7e,1765,0,240.0,220.0623122494069,7.411540020257235,519.5065310108475,10364.0,1.9204825742301668,0.0,240,250,270,280,380,420,450,470,510,520,520
GET,/login,16589,0,570.0,570.2168400085428,68.8248070073314,1450.090529047884,13.0,18.050360013543475,0.0,570,680,720,740,780,910,970,1000,1200,1400,1500
POST,/orders,16540,2057,870.0,836.6866066396199,112.06065397709608,3256.087686982937,588.510338573156,17.99704350015125,2.2382054703634293,870,990,1000,1000,1200,1200,1400,1500,1700,3200,3300
,Aggregated,149174,3191,290.0,390.69686583563566,2.986569015774876,3256.087686982937,6331.320370842104,162.31505242391552,3.472101923154936,290,450,520,570,770,960,1100,1200,1500,1700,3300
