run: 1 / 10
runtime: 15205.7988648
run: 2 / 10
runtime: 14415.050704
run: 3 / 10
runtime: 13383.672199
run: 4 / 10
runtime: 14714.4359939
run: 5 / 10
runtime: 10322.5892439
run: 6 / 10
runtime: 13834.6198211
run: 7 / 10
runtime: 9373.35256195
run: 8 / 10
runtime: 7612.56508994
run: 9 / 10
runtime: 7502.10562611
run: 10 / 10
runtime: 7951.59892702
