n,c,m,k,climit,width,word,crate,usize,psize,csize,cfactor,minfill,maxfill,avgfill,maxc,fp,b16,b17,b18,b19,b20,b21,b22,b23,b24,b25,b26,b27,b28,b29,b30,b31,b32,b33,b34,b35,b36,b37,b38,b39,b40,b41,b42,b43,b44,b45,b46,b47,b48,b49,b50,b51,b52,b53,b54,b55,b56,b57,b58,b59,b60,b61,b62,b63,b64,c0,c1,c2,c3,c4,c5,c6,c7,c8,c9,t0,t1,t2,t3,t4,camsize
1000000,3.2,4194304,3,4,4,64,24,12582912.0,9942080,11184832,0.11110941569,27,63,40.9929275648,9,0.133380367112,0,0,0,0,0,0,0,0,0,0,0,6,39,73,227,552,1201,2242,3771,5890,8651,11297,14043,15984,17066,17361,16330,14632,12377,9887,7485,5599,3802,2512,1574,918,570,347,165,88,34,23,12,3,1,0,0,1,0,2050324,1468933,524331,124845,22259,3197,362,46,6,1,3204716,979319,10269,0,0,44
1000000,3.2,4194304,3,4,4,64,25,12582912.0,9942080,10737472,0.146662394206,7,64,42.6995046879,8,0.133380367112,0,0,0,0,0,0,0,0,0,0,0,0,2,6,40,134,322,728,1445,2563,4421,6690,9091,11698,13977,15459,16255,16172,14981,13410,11019,8835,6766,4820,3427,2112,1474,866,446,309,147,80,34,27,8,5,1,1,1,2051970,1466421,524640,125277,22319,3269,373,34,1,0,3204834,979118,10352,0,0,57
1000000,3.2,4194304,3,4,4,64,26,12582912.0,9942080,10324480,0.179484049479,16,64,44.407364245,8,0.133380367112,1,0,0,0,0,0,0,0,0,0,0,0,0,2,8,27,86,201,447,1055,1789,3193,4995,7011,9306,11987,13687,15012,15304,15069,13807,12281,9962,7733,5973,4228,3059,2049,1283,781,451,259,117,81,48,15,7,4,2,2050406,1468962,524278,124703,22261,3275,367,48,4,0,3204605,979572,10126,1,0,46
1000000,3.2,4194304,3,4,4,64,25,12582912.0,9942080,10737472,0.146662394206,9,61,42.7007683,8,0.133380367112,0,0,0,0,0,0,0,0,0,0,0,0,4,19,36,134,355,790,1479,2679,4332,6571,9041,11738,13709,15588,16493,15856,15057,13253,11230,8842,6546,5018,3479,2182,1432,849,482,268,144,92,45,14,9,6,0,0,0,2051752,1466656,524612,125401,22265,3214,361,41,2,0,3204894,978972,10438,0,0,46
1000000,3.2,4194304,3,4,4,64,25,12582912.0,9942080,10737472,0.146662394206,5,64,42.7012570557,10,0.133380367112,0,0,0,0,0,0,0,0,0,0,1,1,0,12,53,119,363,749,1482,2670,4333,6598,9090,11640,13999,15564,16400,15834,14883,13271,11053,8962,6733,4948,3337,2383,1415,857,465,267,141,85,35,16,5,5,2,0,1,2050757,1468557,523713,125481,22180,3184,385,40,5,1,3204643,979471,10189,1,0,53
1000000,3.2,4194304,3,4,4,64,23,12582912.0,9942080,11671168,0.0724589029948,4,60,39.2854542065,9,0.133380367112,0,0,0,0,0,0,0,0,0,4,12,48,122,346,857,1826,3107,5491,8082,10884,14039,16302,17941,18531,17894,15913,13654,11119,8570,6341,4259,2806,1850,1019,668,312,198,83,46,16,12,3,3,2,1,0,0,0,0,2052349,1465796,524403,126014,22139,3180,388,30,4,1,3204652,979455,10197,0,0,44
1000000,3.2,4194304,3,4,4,64,24,12582912.0,9942080,11184832,0.11110941569,26,62,40.9914398357,9,0.133380367112,0,0,0,0,0,0,0,0,0,0,2,3,23,75,218,537,1168,2149,3922,6000,8600,11355,13855,16066,17026,17238,16511,14777,12382,9802,7514,5465,3857,2488,1569,955,585,316,145,83,41,22,9,0,4,0,1,0,0,2050621,1468567,524432,124609,22457,3181,376,57,3,1,3204507,979745,10051,1,0,43
1000000,3.2,4194304,3,4,4,64,25,12582912.0,9942080,10737472,0.146662394206,6,62,42.7035041395,8,0.133380367112,0,0,0,0,0,0,0,0,0,0,0,2,3,12,50,125,301,761,1530,2720,4437,6651,9113,11420,13825,15348,16098,16185,15061,13437,11200,9053,6767,4808,3249,2281,1393,851,533,270,136,79,32,20,10,6,5,0,0,2050367,1467813,525994,124665,21914,3141,370,36,4,0,3204585,979596,10123,0,0,45
1000000,3.2,4194304,3,4,4,64,23,12582912.0,9942080,11671168,0.0724589029948,2,64,39.2847413387,9,0.133380367112,0,0,0,0,0,0,0,0,1,3,11,36,136,361,856,1770,3338,5419,8002,10993,13764,16393,17963,18466,17687,15960,13800,11396,8524,6062,4403,2922,1830,1017,583,330,176,79,39,25,7,4,1,2,1,0,0,0,1,2051920,1466267,524878,125369,22311,3135,377,43,2,2,3204600,979572,10132,0,0,46
1000000,3.2,4194304,3,4,4,64,26,12582912.0,9942080,10324480,0.179484049479,20,63,44.4095028515,8,0.133380367112,0,0,0,0,1,0,0,0,0,0,0,0,0,3,7,31,74,199,472,1026,1878,3164,4978,7214,9385,11548,13660,15113,15477,14902,13854,12004,9920,7941,5917,4476,3017,2030,1252,762,474,265,144,65,38,18,7,4,0,2051873,1466155,525146,125432,22083,3156,410,43,6,0,3204677,979412,10215,0,0,46
