run: 1 / 10
runtime: 10878.5886948
run: 2 / 10
runtime: 9478.28228188
run: 3 / 10
runtime: 11234.813282
run: 4 / 10
runtime: 10684.8115089
run: 5 / 10
runtime: 9690.59439301
run: 6 / 10
runtime: 7503.17331791
run: 7 / 10
runtime: 11091.1604581
run: 8 / 10
runtime: 8047.37942195
run: 9 / 10
runtime: 6257.86266994
run: 10 / 10
runtime: 6441.52084208
