n,c,m,k,climit,width,word,crate,usize,psize,csize,cfactor,minfill,maxfill,avgfill,maxc,fp,b16,b17,b18,b19,b20,b21,b22,b23,b24,b25,b26,b27,b28,b29,b30,b31,b32,b33,b34,b35,b36,b37,b38,b39,b40,b41,b42,b43,b44,b45,b46,b47,b48,b49,b50,b51,b52,b53,b54,b55,b56,b57,b58,b59,b60,b61,b62,b63,b64,c0,c1,c2,c3,c4,c5,c6,c7,c8,c9,t0,t1,t2,t3,t4,camsize
1000000,0.8,1048576,1,4,4,64,23,3145728.0,2485568,2917824,0.0724487304688,15,63,44.477155579,9,0.614677553234,0,0,0,0,0,0,0,0,0,0,0,1,0,3,3,16,43,100,213,356,639,1042,1401,2012,2565,3196,3653,4015,4090,3931,3770,3481,2871,2316,1829,1365,949,695,418,264,155,86,56,30,14,7,2,3,0,404044,385414,183586,58442,13976,2670,389,48,6,1,421134,385414,183586,58442,0,71981
1000000,0.8,1048576,1,4,4,64,23,3145728.0,2485568,2917824,0.0724487304688,11,64,44.4738215876,8,0.614677553234,0,0,0,0,0,0,0,0,0,0,0,0,0,2,8,24,46,100,203,389,601,946,1440,2017,2652,3129,3689,3962,4140,4132,3761,3292,2854,2309,1859,1366,960,654,432,262,145,96,57,31,15,12,4,0,1,404240,385380,183218,58644,13898,2694,450,49,3,0,421334,385380,183218,58644,0,72129
1000000,0.8,1048576,1,4,4,64,22,3145728.0,2485568,3050432,0.0302937825521,24,62,42.5480771248,9,0.614677553234,0,0,0,0,0,0,0,0,1,0,0,2,5,18,49,90,172,347,565,942,1433,2030,2665,3234,3778,4300,4432,4448,4036,3522,3101,2462,1892,1400,961,736,437,273,155,73,55,35,7,5,1,0,1,0,0,404151,385288,183306,58936,13862,2556,416,55,3,3,421046,385288,183306,58936,0,71160
1000000,0.8,1048576,1,4,4,64,23,3145728.0,2485568,2917824,0.0724487304688,11,63,44.4748305587,9,0.614677553234,0,0,0,0,0,0,0,0,0,0,0,0,1,2,7,21,40,94,187,399,587,977,1518,2011,2652,3157,3641,3932,4120,4096,3752,3299,2917,2364,1795,1307,921,662,466,274,170,88,65,40,17,5,5,1,0,404131,385065,184129,58128,14016,2597,458,40,10,2,421254,385065,184129,58128,0,72175
1000000,0.8,1048576,1,4,4,64,22,3145728.0,2485568,3050432,0.0302937825521,25,63,42.5415311667,8,0.614677553234,0,0,0,0,0,0,0,0,0,1,0,0,5,16,32,89,184,331,600,991,1420,2029,2724,3254,3831,4209,4484,4237,3895,3663,3126,2480,1946,1343,1062,670,434,288,144,90,38,19,16,4,5,2,0,1,0,404035,385610,183322,58501,13930,2722,395,51,10,0,421143,385610,183322,58501,0,72137
1000000,0.8,1048576,1,4,4,64,22,3145728.0,2485568,3050432,0.0302937825521,22,61,42.5452867004,8,0.614677553234,0,0,0,0,0,0,1,0,0,0,1,0,5,12,29,76,202,321,591,972,1407,1994,2629,3311,3911,4268,4342,4439,3970,3553,3159,2409,1927,1484,992,636,417,268,168,72,57,22,11,3,2,2,0,0,0,404530,384504,183870,58686,13877,2650,400,50,9,0,421516,384504,183870,58686,0,71580
1000000,0.8,1048576,1,4,4,64,22,3145728.0,2485568,3050432,0.0302937825521,22,64,42.5470071124,8,0.614677553234,0,0,0,0,0,0,1,0,0,0,0,1,4,10,36,81,184,342,631,921,1428,2041,2641,3310,3835,4188,4428,4339,3990,3633,3110,2506,1870,1421,988,687,415,274,169,77,50,32,12,2,4,1,0,0,1,404070,385214,183748,58557,13937,2597,390,59,4,0,421057,385214,183748,58557,0,71518
1000000,0.8,1048576,1,4,4,64,22,3145728.0,2485568,3050432,0.0302937825521,20,64,42.5386778004,9,0.614677553234,0,0,0,0,1,0,0,0,0,0,0,2,4,6,29,87,170,357,625,942,1466,2114,2607,3268,3842,4251,4307,4273,4161,3598,3038,2456,1971,1358,952,709,434,271,184,93,45,16,8,10,6,0,1,0,1,404453,385203,183018,58702,14030,2661,446,52,10,1,421653,385203,183018,58702,0,72554
1000000,0.8,1048576,1,4,4,64,22,3145728.0,2485568,3050432,0.0302937825521,26,61,42.5447202232,9,0.614677553234,0,0,0,0,0,0,0,0,0,0,2,3,6,11,24,72,188,308,586,925,1460,2066,2633,3324,3843,4338,4390,4231,4061,3569,3097,2585,1895,1382,958,680,433,261,149,86,40,28,14,6,5,4,0,0,0,403880,385518,183819,58417,13793,2662,422,56,8,1,420822,385518,183819,58417,0,71479
1000000,0.8,1048576,1,4,4,64,22,3145728.0,2485568,3050432,0.0302937825521,24,61,42.5431047143,9,0.614677553234,0,0,0,0,0,0,0,0,2,0,0,1,3,6,36,80,171,317,597,1008,1483,2067,2597,3341,3819,4265,4391,4283,4040,3552,3007,2492,1908,1458,987,658,466,273,143,106,51,32,14,6,2,1,0,0,0,403797,385856,183469,58473,13808,2687,418,59,8,1,420778,385856,183469,58473,0,71661
