n,c,m,k,climit,width,word,crate,usize,psize,csize,cfactor,minfill,maxfill,avgfill,maxc,fp,b25,b26,b27,b28,b29,b30,b31,b32,b33,b34,b35,b36,b37,b38,b39,b40,b41,b42,b43,b44,b45,b46,b47,b48,b49,b50,b51,b52,b53,b54,b55,b56,b57,b58,b59,b60,b61,b62,b63,b64,b65,b66,b67,b68,b69,b70,b71,b72,b73,b74,b75,b76,b77,b78,b79,b80,b81,b82,b83,b84,b85,b86,b87,b88,b89,b90,b91,b92,b93,b94,b95,b96,b97,b98,b99,b100,b101,b102,b103,b104,b105,b106,b107,b108,b109,b110,b111,b112,b113,b114,b115,b116,b117,b118,b119,b120,b121,b122,b123,b124,b125,b126,b127,b128,c0,c1,c2,c3,c4,c5,c6,c7,c8,c9,t0,t1,t2,t3,t4,camsize
1000000,6.4,8388608,6,5,4,128,55,25165824.0,21913216,19522688,0.224238077799,16,124,94.2799155526,8,0.017790317975,0,0,0,0,0,0,0,0,0,0,0,0,0,0,0,0,0,0,0,0,0,0,0,0,0,0,0,0,0,0,0,0,0,0,0,0,0,0,0,0,0,1,0,0,0,1,2,8,10,16,58,83,130,254,376,611,889,1298,1800,2454,3463,4147,5253,6234,7171,8032,8764,9417,9743,9884,9510,9200,8577,7858,7133,5887,5218,4325,3561,2810,2209,1664,1306,969,687,487,341,221,164,123,58,38,25,24,11,5,6,1,2,1,0,0,0,0,4102773,2934436,1049689,249595,44880,6410,739,83,3,0,7388920,999508,180,0,0,0
1000000,6.4,8388608,6,5,4,128,56,25165824.0,21913216,19174016,0.238093058268,55,126,95.9961013905,8,0.017790317975,0,0,0,0,0,0,0,0,0,0,0,0,0,0,0,0,0,0,0,0,0,0,0,0,0,0,0,0,0,0,1,0,0,0,0,0,0,0,0,0,0,0,0,0,0,0,0,2,3,4,17,31,55,91,166,299,439,709,1086,1466,1982,2816,3544,4378,5374,6466,7210,8036,8816,9252,9336,9576,9270,8860,8140,7524,6399,5848,4884,4003,3324,2650,2152,1521,1191,848,660,429,308,229,144,103,62,25,26,16,9,10,4,2,0,1,0,0,4101755,2936247,1048793,249765,44888,6353,738,62,7,0,7388864,999594,150,0,0,0
1000000,6.4,8388608,6,5,4,128,56,25165824.0,21913216,19174016,0.238093058268,53,127,95.9940452746,9,0.017790317975,0,0,0,0,0,0,0,0,0,0,0,0,0,0,0,0,0,0,0,0,0,0,0,0,0,0,0,0,1,0,0,0,0,0,0,0,0,0,0,0,0,0,0,0,0,1,0,0,4,4,13,26,48,112,148,252,443,703,1088,1509,2052,2737,3546,4463,5395,6348,7461,8022,8738,9184,9542,9501,9214,8753,8256,7290,6476,5655,4915,4087,3354,2743,2007,1621,1251,859,568,457,316,220,134,103,59,34,36,18,14,6,5,3,1,0,1,0,4103253,2934070,1049142,249914,45014,6352,771,76,14,2,7388910,999529,169,0,0,0
1000000,6.4,8388608,6,5,4,128,55,25165824.0,21913216,19522688,0.224238077799,12,124,94.2809842579,8,0.017790317975,0,0,0,0,0,0,0,0,0,0,0,0,0,0,0,0,0,0,0,0,0,0,0,0,0,0,0,0,0,0,0,0,0,0,0,0,0,0,0,0,0,0,0,1,1,0,3,6,8,26,60,59,135,225,365,582,931,1325,1869,2473,3373,4191,5303,6240,7219,8101,8711,9369,9785,9787,9472,9112,8510,7831,7018,6054,5289,4383,3436,2816,2218,1761,1291,975,748,468,332,225,142,111,69,42,19,19,16,3,9,2,0,1,0,0,0,0,4103615,2932702,1050143,250358,44599,6373,740,71,7,0,7388880,999570,158,0,0,0
1000000,6.4,8388608,6,5,4,128,56,25165824.0,21913216,19174016,0.238093058268,58,125,95.9951200625,10,0.017790317975,0,0,0,0,0,0,0,0,0,0,0,0,0,0,0,0,0,0,0,0,0,0,0,0,0,0,0,0,0,0,0,0,0,1,0,0,0,0,0,0,0,0,0,0,0,0,1,0,5,7,13,24,48,99,185,309,495,745,1034,1481,1972,2656,3567,4385,5347,6384,7349,8111,8747,9210,9583,9473,9280,8692,8199,7451,6591,5760,4822,4155,3285,2682,2019,1544,1179,917,589,442,314,230,151,104,63,35,23,17,7,6,4,2,3,0,0,0,4102977,2933716,1049770,250663,44303,6324,771,75,7,1,7388895,999542,171,0,0,0
1000000,6.4,8388608,6,5,4,128,58,25165824.0,21913216,18512896,0.264363606771,18,128,99.4234470933,8,0.017790317975,0,0,0,0,0,0,0,0,0,0,0,0,0,0,0,0,0,0,0,0,0,0,0,0,0,0,0,0,0,0,0,0,0,0,0,0,0,0,0,0,0,0,0,0,0,0,0,0,0,0,0,2,12,12,29,43,98,137,259,417,596,906,1331,1823,2432,3094,4019,4762,5696,6588,7532,8122,8822,8706,8876,8982,8653,8026,7515,6598,5893,5089,4297,3514,2862,2262,1763,1365,980,769,557,375,267,196,115,84,71,34,20,17,7,3,2,1,4103136,2933296,1050533,249730,44724,6362,738,83,6,0,7388873,999584,151,0,0,0
1000000,6.4,8388608,6,5,4,128,56,25165824.0,21913216,19174016,0.238093058268,57,128,95.9940653017,8,0.017790317975,0,0,0,0,0,0,0,0,0,0,0,0,0,0,0,0,0,0,0,0,0,0,0,0,0,0,0,0,0,0,0,0,1,0,0,0,0,0,0,0,0,0,0,0,0,0,1,2,5,7,14,31,63,81,176,294,406,712,1029,1489,2101,2869,3572,4270,5471,6298,7318,7887,8810,9367,9501,9447,9277,8721,8214,7392,6635,5786,4801,4096,3243,2653,2031,1595,1161,919,658,481,296,219,150,101,61,31,23,11,5,6,2,3,2,1,0,1,4101112,2936724,1049687,249423,44339,6470,763,85,5,0,7388875,999585,148,0,0,0
1000000,6.4,8388608,6,5,4,128,56,25165824.0,21913216,19174016,0.238093058268,59,128,95.9964151485,8,0.017790317975,0,0,0,0,0,0,0,0,0,0,0,0,0,0,0,0,0,0,0,0,0,0,0,0,0,0,0,0,0,0,0,0,0,0,1,0,0,0,0,0,0,0,0,0,0,0,0,0,3,6,13,16,60,107,184,291,467,738,1046,1504,2098,2726,3580,4531,5250,6337,7372,7875,8801,9330,9364,9342,9212,8859,8215,7436,6537,5748,4949,4028,3305,2682,2046,1595,1210,866,672,439,302,242,155,95,80,30,16,14,8,5,4,2,1,1,0,1,4102559,2933855,1050482,250300,44348,6250,751,58,5,0,7388894,999542,172,0,0,0
1000000,6.4,8388608,6,5,4,128,55,25165824.0,21913216,19522688,0.224238077799,16,124,94.2811153874,9,0.017790317975,0,0,0,0,0,0,0,0,0,0,0,0,0,0,0,0,0,0,0,0,0,0,0,0,0,0,0,0,0,0,0,0,0,0,0,0,0,0,0,0,0,0,0,0,0,1,1,2,6,18,35,69,142,229,380,555,923,1289,1909,2585,3342,4178,5117,6303,7139,8150,8688,9367,9738,9765,9725,9115,8522,7907,6959,6080,5228,4392,3534,2879,2263,1665,1247,917,697,486,337,212,137,102,66,48,19,24,14,9,2,2,0,1,0,0,0,0,4102928,2934449,1048955,250221,44865,6364,737,82,4,3,7388867,999589,152,0,0,0
1000000,6.4,8388608,6,5,4,128,57,25165824.0,21913216,18837632,0.251459757487,55,127,97.7085119828,10,0.017790317975,0,0,0,0,0,0,0,0,0,0,0,0,0,0,0,0,0,0,0,0,0,0,0,0,0,0,0,0,0,0,1,0,0,0,0,0,0,0,0,0,0,0,0,0,0,0,1,0,1,6,4,13,22,35,66,113,193,331,536,808,1122,1691,2287,2867,3781,4617,5491,6498,7478,8081,8801,9064,9176,9203,8903,8516,7920,7052,6100,5410,4662,3776,3004,2408,1921,1486,1073,761,593,381,312,202,154,93,52,45,22,11,8,8,5,1,3,0,4102234,2935330,1049192,250066,44502,6423,769,86,4,1,7388899,999534,175,0,0,0
