n,c,m,k,climit,width,word,crate,usize,psize,csize,cfactor,minfill,maxfill,avgfill,maxc,fp,b32,b33,b34,b35,b36,b37,b38,b39,b40,b41,b42,b43,b44,b45,b46,b47,b48,b49,b50,b51,b52,b53,b54,b55,b56,b57,b58,b59,b60,b61,b62,b63,b64,b65,b66,b67,b68,b69,b70,b71,b72,b73,b74,b75,b76,b77,b78,b79,b80,b81,b82,b83,b84,b85,b86,b87,b88,b89,b90,b91,b92,b93,b94,b95,b96,b97,b98,b99,b100,b101,b102,b103,b104,b105,b106,b107,b108,b109,b110,b111,b112,b113,b114,b115,b116,b117,b118,b119,b120,b121,b122,b123,b124,b125,b126,b127,b128,c0,c1,c2,c3,c4,c5,c6,c7,c8,c9,t0,t1,t2,t3,t4,camsize
100000,1.6,262144,2,4,4,128,59,786432.0,610176,568832,0.276692708333,9,127,103.443519352,7,0.284843072878,0,0,0,0,0,0,0,0,0,0,0,0,0,0,0,0,0,0,0,0,0,0,0,0,0,0,0,0,0,0,0,0,0,0,0,0,0,0,0,0,0,0,0,0,0,0,0,0,0,1,0,3,2,6,3,6,14,21,31,46,49,70,115,108,158,152,231,218,256,285,252,270,241,256,252,212,221,176,156,114,117,91,76,59,46,48,28,20,9,5,7,5,2,1,3,1,0,122121,93547,35416,8963,1796,264,31,6,0,0,167489,89534,5106,15,0,209
100000,1.6,262144,2,4,4,128,59,786432.0,610176,568832,0.276692708333,11,127,103.465346535,7,0.284843072878,0,0,0,0,0,0,0,0,0,0,0,0,0,0,0,0,0,0,0,0,0,0,0,0,0,0,0,0,0,0,0,0,0,0,0,0,0,0,0,0,0,0,0,0,0,0,0,0,0,0,0,1,2,4,6,9,18,18,25,37,55,74,112,129,173,165,175,208,259,252,258,275,267,265,262,237,181,187,171,131,101,90,78,53,44,42,12,17,13,17,4,5,7,2,1,1,0,122129,93453,35483,9049,1755,239,35,1,0,0,167566,89367,5196,15,0,195
100000,1.6,262144,2,4,4,128,59,786432.0,610176,568832,0.276692708333,13,127,103.451170117,8,0.284843072878,0,0,0,0,0,0,0,0,0,0,0,0,0,0,0,0,0,0,0,0,0,0,0,0,0,0,0,0,0,0,0,0,0,0,0,0,0,0,0,0,0,0,0,0,0,0,0,0,0,0,1,0,0,4,3,7,16,18,31,52,70,66,107,121,155,166,192,204,248,248,276,289,250,281,231,204,247,176,161,136,98,79,76,67,43,36,27,23,15,5,6,2,4,1,0,1,0,122301,93254,35428,9091,1771,269,25,4,1,0,167472,89547,5111,14,0,188
100000,1.6,262144,2,4,4,128,59,786432.0,610176,568832,0.276692708333,11,127,103.479522952,7,0.284843072878,0,0,0,0,0,0,0,0,0,0,0,0,0,0,0,0,0,0,0,0,0,0,0,0,0,0,0,0,0,0,0,0,0,0,0,0,0,0,0,0,0,0,0,0,0,0,0,0,1,0,0,2,2,3,6,12,21,22,33,47,48,86,83,108,151,166,195,239,254,235,256,260,261,269,270,238,191,175,179,132,113,99,67,61,38,41,23,16,15,10,6,6,0,1,0,2,0,122185,93260,35638,9091,1690,253,25,2,0,0,167530,89387,5213,14,0,144
100000,1.6,262144,2,4,4,128,57,786432.0,610176,588800,0.251302083333,1,125,99.932826087,7,0.284843072878,0,0,0,0,0,0,0,0,0,0,0,0,0,0,0,0,0,0,0,0,0,0,0,0,0,0,0,0,0,0,0,0,0,0,0,0,0,0,0,0,0,0,0,0,0,1,0,2,1,1,3,6,9,20,26,35,47,66,83,109,147,144,211,223,249,250,294,293,283,262,281,228,230,200,178,168,132,103,87,56,44,38,21,28,8,11,8,6,1,2,1,1,1,1,0,0,0,122393,93080,35546,9052,1740,293,37,3,0,0,167616,89258,5255,15,0,185
100000,1.6,262144,2,4,4,128,58,786432.0,610176,578560,0.264322916667,68,126,101.715486726,7,0.284843072878,0,0,0,0,0,0,0,0,0,0,0,0,0,0,0,0,0,0,0,0,0,0,0,0,0,0,0,0,0,0,0,0,0,0,0,0,1,0,0,0,0,0,0,0,0,0,0,0,1,0,0,1,3,8,13,20,23,43,52,85,85,112,131,179,215,235,257,271,266,287,264,259,230,234,202,183,169,148,109,103,77,50,66,41,21,25,14,16,6,7,4,3,0,0,1,0,0,122275,93145,35707,9005,1685,284,36,7,0,0,167617,89231,5280,16,0,161
100000,1.6,262144,2,4,4,128,60,786432.0,610176,559360,0.288736979167,6,127,105.187414188,7,0.284843072878,0,0,0,0,0,0,0,0,0,0,0,0,0,0,0,0,0,0,0,0,0,0,0,0,0,0,0,0,0,0,0,0,0,0,0,0,0,0,0,0,0,0,0,0,0,0,0,0,0,0,0,0,1,0,2,3,3,14,15,27,27,48,67,72,101,106,153,173,223,222,223,283,276,275,262,243,232,230,183,187,151,123,114,66,66,46,48,46,11,12,12,10,7,3,1,2,0,122446,93008,35553,9006,1828,265,35,3,0,0,167607,89261,5267,9,0,178
100000,1.6,262144,2,4,4,128,58,786432.0,610176,578560,0.264322916667,66,124,101.722123894,8,0.284843072878,0,0,0,0,0,0,0,0,0,0,0,0,0,0,0,0,0,0,0,0,0,0,0,0,0,0,0,0,0,0,0,0,0,0,1,0,0,0,0,0,0,0,0,0,0,0,1,0,0,0,1,7,2,11,11,13,25,31,52,74,94,111,146,166,202,215,238,273,263,295,291,276,224,238,235,209,156,150,128,82,71,67,54,32,22,15,11,7,8,8,1,2,1,0,0,0,0,122298,93121,35656,9069,1687,271,38,3,1,0,167575,89332,5221,16,0,178
100000,1.6,262144,2,4,4,128,60,786432.0,610176,559360,0.288736979167,7,128,105.200228833,7,0.284843072878,0,0,0,0,0,0,0,0,0,0,0,0,0,0,0,0,0,0,0,0,0,0,0,0,0,0,0,0,0,0,0,0,0,0,0,0,0,0,0,0,0,0,0,0,0,0,0,0,0,0,0,0,1,2,2,4,11,6,11,24,34,41,72,80,102,125,176,176,213,208,235,259,258,267,261,265,201,217,182,164,157,123,110,95,66,72,44,31,21,14,15,10,4,3,3,2,2,122253,93243,35606,8990,1731,282,34,5,0,0,167558,89359,5217,10,0,176
100000,1.6,262144,2,4,4,128,59,786432.0,610176,568832,0.276692708333,11,128,103.449819982,7,0.284843072878,0,0,0,0,0,0,0,0,0,0,0,0,0,0,0,0,0,0,0,0,0,0,0,0,0,0,0,0,0,0,0,0,0,0,0,0,0,0,0,0,0,0,0,0,0,0,0,0,0,0,0,3,1,2,5,14,18,20,29,41,50,73,80,124,135,182,192,235,262,240,275,293,266,279,268,212,210,197,148,113,102,80,66,58,49,31,21,26,14,9,7,3,4,3,2,0,1,122417,93019,35556,9109,1717,286,36,4,0,0,167547,89389,5190,18,0,177
