n,c,m,k,climit,width,word,crate,usize,psize,csize,cfactor,minfill,maxfill,avgfill,maxc,fp,b16,b17,b18,b19,b20,b21,b22,b23,b24,b25,b26,b27,b28,b29,b30,b31,b32,b33,b34,b35,b36,b37,b38,b39,b40,b41,b42,b43,b44,b45,b46,b47,b48,b49,b50,b51,b52,b53,b54,b55,b56,b57,b58,b59,b60,b61,b62,b63,b64,c0,c1,c2,c3,c4,c5,c6,c7,c8,c9,t0,t1,t2,t3,t4,camsize
100000,12.8,2097152,15,4,4,64,26,6291456.0,4971072,5162240,0.179484049479,29,64,44.4070666997,8,4.22143468146e-05,0,0,0,0,0,0,0,0,0,0,0,0,0,1,4,11,40,105,226,517,1003,1538,2445,3636,4753,5795,6857,7597,7689,7353,6915,6017,4976,3879,3045,2128,1513,1024,672,393,251,139,65,39,18,11,3,1,1,1026066,733022,262492,62373,11365,1620,194,17,3,0,1997152,100000,0,0,0,0
100000,12.8,2097152,15,4,4,64,26,6291456.0,4971072,5162240,0.179484049479,29,62,44.4069551203,8,4.22143468146e-05,0,0,0,0,0,0,0,0,0,0,0,0,0,1,5,10,47,89,252,524,983,1575,2500,3533,4715,5928,6905,7312,7631,7540,6864,5936,5032,3995,3014,2180,1549,1000,686,373,230,124,62,37,16,6,6,0,0,1026521,732228,262724,62541,11276,1629,202,30,1,0,1997153,99999,0,0,0,0
100000,12.8,2097152,15,4,4,64,25,6291456.0,4971072,5368768,0.146657307943,5,61,42.7000131129,8,4.22143468146e-05,0,0,0,0,0,0,0,0,0,0,0,0,2,6,14,56,164,386,751,1318,2201,3297,4506,5813,6944,7869,8216,8102,7474,6460,5468,4448,3393,2473,1741,1130,688,418,259,154,70,32,17,10,5,1,0,0,0,1025813,733463,262267,62522,11249,1621,192,24,1,0,1997152,100000,0,0,0,0
100000,12.8,2097152,15,4,4,64,26,6291456.0,4971072,5162240,0.179484049479,30,64,44.4107240268,9,4.22143468146e-05,0,0,0,0,0,0,0,0,0,0,0,0,0,0,5,15,36,105,232,515,950,1574,2446,3566,4751,5871,6822,7542,7487,7506,6917,6100,5039,4031,3078,2123,1450,996,580,415,227,144,63,37,18,13,3,2,1,1025901,733221,262294,62817,11082,1636,181,18,1,1,1997152,100000,0,0,0,0
100000,12.8,2097152,15,4,4,64,26,6291456.0,4971072,5162240,0.179484049479,30,64,44.4078601537,8,4.22143468146e-05,0,0,0,0,0,0,0,0,0,0,0,0,0,0,3,14,38,109,240,499,909,1599,2565,3561,4800,5899,6697,7317,7767,7517,6836,6048,5019,3936,3056,2232,1503,984,623,393,236,129,71,27,24,3,4,1,1,1025268,734027,262812,61986,11181,1653,197,24,4,0,1997153,99999,0,0,0,0
100000,12.8,2097152,15,4,4,64,25,6291456.0,4971072,5368768,0.146657307943,4,64,42.699119053,8,4.22143468146e-05,0,0,0,0,0,0,0,0,0,0,1,0,1,6,19,68,135,405,758,1407,2240,3332,4581,5803,6881,7701,8108,8025,7424,6527,5672,4379,3363,2416,1766,1148,731,437,263,124,76,33,33,11,5,5,1,0,1,1026023,732952,262734,62349,11228,1637,204,21,4,0,1997154,99998,0,0,0,0
100000,12.8,2097152,15,4,4,64,24,6291456.0,4971072,5592448,0.111104329427,15,60,40.9909592365,9,4.22143468146e-05,0,0,0,0,0,0,0,0,0,0,0,2,12,52,100,257,586,1100,1845,2891,4404,5895,6965,8073,8390,8636,8107,7319,6231,5003,3712,2747,1978,1283,734,445,281,156,88,50,20,13,3,1,2,0,0,0,0,1025342,734428,261854,62337,11353,1621,190,24,2,1,1997152,100000,0,0,0,0
100000,12.8,2097152,15,4,4,64,25,6291456.0,4971072,5368768,0.146657307943,5,61,42.7031244412,8,4.22143468146e-05,0,0,0,0,0,0,0,0,0,0,0,0,1,10,26,53,181,352,767,1377,2227,3326,4533,5674,6964,7713,8230,8006,7536,6479,5652,4370,3434,2462,1654,1152,720,455,228,144,85,36,22,14,2,1,0,0,0,1025566,733519,262635,62604,10995,1610,199,22,2,0,1997152,100000,0,0,0,0
100000,12.8,2097152,15,4,4,64,25,6291456.0,4971072,5368768,0.146657307943,2,61,42.7009548559,8,4.22143468146e-05,0,0,0,0,0,0,0,0,0,0,0,0,2,4,15,62,157,394,784,1365,2214,3315,4442,5815,7020,7653,8189,7975,7458,6646,5621,4444,3380,2388,1707,1135,742,417,254,131,82,39,18,13,4,1,0,0,0,1026024,732998,262485,62627,11211,1589,201,16,1,0,1997154,99998,0,0,0,0
100000,12.8,2097152,15,4,4,64,25,6291456.0,4971072,5368768,0.146657307943,3,62,42.7011455887,7,4.22143468146e-05,0,0,0,0,0,0,0,0,0,0,0,0,2,5,18,57,149,349,780,1341,2292,3307,4492,5826,6957,7630,8146,8140,7521,6506,5627,4459,3287,2427,1716,1160,722,449,253,128,74,29,22,9,5,0,1,0,0,1024743,735157,261994,62205,11308,1544,181,20,0,0,1997156,99996,0,0,0,0
