{
 "config": [
  {
   "id": 0,
   "url": "rtmp://127.0.0.1:1935/live/test",
   "enabled": true
  },
  {
   "id": 1,
   "url": "rtmp://127.0.0.1:1935/live/test",
   "enabled": true
  },
  {
   "id": 2,
   "url": "rtmp://127.0.0.1:1935/live/test",
   "enabled": false
  }
 ]
}