[
    {
        "name": "TA",
        "type": 1,
        "choices": [
            {
                "name": "CS 410 (Python)",
                "type": 0,
                "roles": {
                    "online": [
                        {
                            "name": "ta:online",
                            "required": false
                        },
                        {
                            "name": "ta/cs410p:online",
                            "required": true
                        }
                    ],
                    "offline": [
                        {
                            "name": "ta:offline",
                            "required": false
                        },
                        {
                            "name": "ta/cs410p:offline",
                            "required": true
                        }
                    ]
                }
            },
            {
                "name": "CS 414",
                "type": 0,
                "roles": {
                    "online": [
                        {
                            "name": "ta:online",
                            "required": false
                        },
                        {
                            "name": "ta/cs414:online",
                            "required": true
                        }
                    ],
                    "offline": [
                        {
                            "name": "ta:offline",
                            "required": false
                        },
                        {
                            "name": "ta/cs414:offline",
                            "required": true
                        }
                    ]
                }
            },
            {
                "name": "CS 415",
                "type": 0,
                "roles": {
                    "online": [
                        {
                            "name": "ta:online",
                            "required": false
                        },
                        {
                            "name": "ta/cs415:online",
                            "required": true
                        }
                    ],
                    "offline": [
                        {
                            "name": "ta:offline",
                            "required": false
                        },
                        {
                            "name": "ta/cs415:offline",
                            "required": true
                        }
                    ]
                }
            },
            {
                "name": "CS 416",
                "type": 0,
                "roles": {
                    "online": [
                        {
                            "name": "ta:online",
                            "required": false
                        },
                        {
                            "name": "ta/cs416:online",
                            "required": true
                        }
                    ],
                    "offline": [
                        {
                            "name": "ta:offline",
                            "required": false
                        },
                        {
                            "name": "ta/cs416:offline",
                            "required": true
                        }
                    ]
                }
            },
            {
                "name": "CS 417",
                "type": 0,
                "roles": {
                    "online": [
                        {
                            "name": "ta:online",
                            "required": false
                        },
                        {
                            "name": "ta/cs417:online",
                            "required": true
                        }
                    ],
                    "offline": [
                        {
                            "name": "ta:offline",
                            "required": false
                        },
                        {
                            "name": "ta/cs417:offline",
                            "required": true
                        }
                    ]
                }
            },
            {
                "name": "CS 420",
                "type": 0,
                "roles": {
                    "online": [
                        {
                            "name": "ta:online",
                            "required": false
                        },
                        {
                            "name": "ta/cs420:online",
                            "required": true
                        }
                    ],
                    "offline": [
                        {
                            "name": "ta:offline",
                            "required": false
                        },
                        {
                            "name": "ta/cs420:offline",
                            "required": true
                        }
                    ]
                }
            },
            {
                "name": "CS 515",
                "type": 0,
                "roles": {
                    "online": [
                        {
                            "name": "ta:online",
                            "required": false
                        },
                        {
                            "name": "ta/cs515:online",
                            "required": true
                        }
                    ],
                    "offline": [
                        {
                            "name": "ta:offline",
                            "required": false
                        },
                        {
                            "name": "ta/cs515:offline",
                            "required": true
                        }
                    ]
                }
            },
            {
                "name": "CS 518",
                "type": 0,
                "roles": {
                    "online": [
                        {
                            "name": "ta:online",
                            "required": false
                        },
                        {
                            "name": "ta/cs518:online",
                            "required": true
                        }
                    ],
                    "offline": [
                        {
                            "name": "ta:offline",
                            "required": false
                        },
                        {
                            "name": "ta/cs518:offline",
                            "required": true
                        }
                    ]
                }
            },
            {
                "name": "CS 520",
                "type": 0,
                "roles": {
                    "online": [
                        {
                            "name": "ta:online",
                            "required": false
                        },
                        {
                            "name": "ta/cs520:online",
                            "required": true
                        }
                    ],
                    "offline": [
                        {
                            "name": "ta:offline",
                            "required": false
                        },
                        {
                            "name": "ta/cs520:offline",
                            "required": true
                        }
                    ]
                }
            },
            {
                "name": "CS 619",
                "type": 0,
                "roles": {
                    "online": [
                        {
                            "name": "ta:online",
                            "required": false
                        },
                        {
                            "name": "ta/cs619:online",
                            "required": true
                        }
                    ],
                    "offline": [
                        {
                            "name": "ta:offline",
                            "required": false
                        },
                        {
                            "name": "ta/cs619:offline",
                            "required": true
                        }
                    ]
                }
            },
            {
                "name": "IT 403",
                "type": 0,
                "roles": {
                    "online": [
                        {
                            "name": "ta:online",
                            "required": false
                        },
                        {
                            "name": "ta/it403:online",
                            "required": true
                        }
                    ],
                    "offline": [
                        {
                            "name": "ta:offline",
                            "required": false
                        },
                        {
                            "name": "ta/it403:offline",
                            "required": true
                        }
                    ]
                }
            },
            {
                "name": "IT 775",
                "type": 0,
                "roles": {
                    "online": [
                        {
                            "name": "ta:online",
                            "required": false
                        },
                        {
                            "name": "ta/it775:online",
                            "required": true
                        }
                    ],
                    "offline": [
                        {
                            "name": "ta:offline",
                            "required": false
                        },
                        {
                            "name": "ta/it775:offline",
                            "required": true
                        }
                    ]
                }
            }
        ]
    },
    {
        "name": "Admin",
        "type": 0,
        "roles": {
            "online": [
                {
                    "name": "admin:online",
                    "required": true
                }
            ],
            "offline": [
                {
                    "name": "admin:offline",
                    "required": true
                }
            ]
        }
    },
    {
        "name": "Instructor",
        "type": 0,
        "roles": {
            "online": [
                {
                    "name": "instructor:online",
                    "required": true
                }
            ],
            "offline": [
                {
                    "name": "instructor:offline",
                    "required": true
                }
            ]
        }
    },
    {
        "name": "PAC Consultant",
        "type": 0,
        "roles": {
            "online": [
                {
                    "name": "pac:online",
                    "required": true
                }
            ],
            "offline": [
                {
                    "name": "pac:offline",
                    "required": true
                }
            ]
        }
    }
]