<?xml version="1.0" standalone="no"?>
<!DOCTYPE svg PUBLIC "-//W3C//DTD SVG 1.1//EN" "http://www.w3.org/Graphics/SVG/1.1/DTD/svg11.dtd">
<svg xmlns="http://www.w3.org/2000/svg" id="Layer_2" data-name="Layer 2" viewBox="0 0 500.15 340.3" width="500.1499938964844" height="340.29998779296875">
  <defs>
    <style>
      .cls-1 {
        fill: #f3f1e5;
      }
    </style>
  </defs>
  <g id="Layer_1-2" data-name="Layer 1">
    <polygon class="cls-1" points="500.15 272.24 476.41 272.24 408.35 272.24 340.3 272.24 340.3 204.18 272.24 204.18 204.18 204.18 204.18 136.12 136.12 136.12 136.12 68.06 68.06 68.06 68.06 0 0 0 0 340.3 500.15 340.3 500.15 272.24"/>
  </g>
</svg>