{
  "build": "hfd8a6a1_0",
  "build_number": 0,
  "channel": "https://conda.anaconda.org/conda-forge/linux-64",
  "constrains": [],
  "depends": [],
  "extracted_package_dir": "/opt/anaconda/pkgs/libstdcxx-ng-13.1.0-hfd8a6a1_0",
  "files": [
    "lib/libstdc++.so",
    "lib/libstdc++.so.6",
    "lib/libstdc++.so.6.0.31",
    "share/licenses/libstdc++/RUNTIME.LIBRARY.EXCEPTION"
  ],
  "fn": "libstdcxx-ng-13.1.0-hfd8a6a1_0.conda",
  "license": "GPL-3.0-only WITH GCC-exception-3.1",
  "license_family": "GPL",
  "link": {
    "source": "/opt/anaconda/pkgs/libstdcxx-ng-13.1.0-hfd8a6a1_0",
    "type": 1
  },
  "md5": "067bcc23164642f4c226da631f2a2e1d",
  "name": "libstdcxx-ng",
  "package_tarball_full_path": "/opt/anaconda/pkgs/libstdcxx-ng-13.1.0-hfd8a6a1_0.conda",
  "paths_data": {
    "paths": [
      {
        "_path": "lib/libstdc++.so",
        "path_type": "softlink",
        "sha256": "2d455ecd92a49aeab8550575b3e5a9f8282b964509fe0fd53fc9512e7150dfab",
        "size_in_bytes": 13799960
      },
      {
        "_path": "lib/libstdc++.so.6",
        "path_type": "softlink",
        "sha256": "2d455ecd92a49aeab8550575b3e5a9f8282b964509fe0fd53fc9512e7150dfab",
        "size_in_bytes": 13799960
      },
      {
        "_path": "lib/libstdc++.so.6.0.31",
        "path_type": "hardlink",
        "sha256": "2d455ecd92a49aeab8550575b3e5a9f8282b964509fe0fd53fc9512e7150dfab",
        "sha256_in_prefix": "2d455ecd92a49aeab8550575b3e5a9f8282b964509fe0fd53fc9512e7150dfab",
        "size_in_bytes": 13799960
      },
      {
        "_path": "share/licenses/libstdc++/RUNTIME.LIBRARY.EXCEPTION",
        "path_type": "hardlink",
        "sha256": "9d6b43ce4d8de0c878bf16b54d8e7a10d9bd42b75178153e3af6a815bdc90f74",
        "sha256_in_prefix": "9d6b43ce4d8de0c878bf16b54d8e7a10d9bd42b75178153e3af6a815bdc90f74",
        "size_in_bytes": 3324
      }
    ],
    "paths_version": 1
  },
  "requested_spec": "None",
  "sha256": "6f9eb2d7a96687938c0001166a3b308460a8eb02b10e9d0dd9e251f0219ea05c",
  "size": 3847887,
  "subdir": "linux-64",
  "timestamp": 1685816251278,
  "url": "https://conda.anaconda.org/conda-forge/linux-64/libstdcxx-ng-13.1.0-hfd8a6a1_0.conda",
  "version": "13.1.0"
}