{
  "build": "h41732ed_0",
  "build_number": 0,
  "channel": "https://conda.anaconda.org/conda-forge/linux-64",
  "constrains": [
    "binutils_impl_linux-64 2.40"
  ],
  "depends": [],
  "extracted_package_dir": "/opt/anaconda/pkgs/ld_impl_linux-64-2.40-h41732ed_0",
  "files": [
    "bin/x86_64-conda-linux-gnu-ld",
    "bin/x86_64-conda_cos6-linux-gnu-ld",
    "x86_64-conda-linux-gnu/bin/ld",
    "x86_64-conda_cos6-linux-gnu/bin/ld"
  ],
  "fn": "ld_impl_linux-64-2.40-h41732ed_0.conda",
  "license": "GPL-3.0-only",
  "license_family": "GPL",
  "link": {
    "source": "/opt/anaconda/pkgs/ld_impl_linux-64-2.40-h41732ed_0",
    "type": 1
  },
  "md5": "7aca3059a1729aa76c597603f10b0dd3",
  "name": "ld_impl_linux-64",
  "package_tarball_full_path": "/opt/anaconda/pkgs/ld_impl_linux-64-2.40-h41732ed_0.conda",
  "paths_data": {
    "paths": [
      {
        "_path": "bin/x86_64-conda-linux-gnu-ld",
        "path_type": "hardlink",
        "sha256": "df0752f24033ca8ea219295a7b8c9acbaa0be0393daa423300aa7845fda30d96",
        "sha256_in_prefix": "df0752f24033ca8ea219295a7b8c9acbaa0be0393daa423300aa7845fda30d96",
        "size_in_bytes": 2442288
      },
      {
        "_path": "bin/x86_64-conda_cos6-linux-gnu-ld",
        "path_type": "softlink",
        "sha256": "df0752f24033ca8ea219295a7b8c9acbaa0be0393daa423300aa7845fda30d96",
        "size_in_bytes": 2442288
      },
      {
        "_path": "x86_64-conda-linux-gnu/bin/ld",
        "path_type": "softlink",
        "sha256": "df0752f24033ca8ea219295a7b8c9acbaa0be0393daa423300aa7845fda30d96",
        "size_in_bytes": 2442288
      },
      {
        "_path": "x86_64-conda_cos6-linux-gnu/bin/ld",
        "path_type": "softlink",
        "sha256": "df0752f24033ca8ea219295a7b8c9acbaa0be0393daa423300aa7845fda30d96",
        "size_in_bytes": 2442288
      }
    ],
    "paths_version": 1
  },
  "requested_spec": "None",
  "sha256": "f6cc89d887555912d6c61b295d398cff9ec982a3417d38025c45d5dd9b9e79cd",
  "size": 704696,
  "subdir": "linux-64",
  "timestamp": 1674833944779,
  "url": "https://conda.anaconda.org/conda-forge/linux-64/ld_impl_linux-64-2.40-h41732ed_0.conda",
  "version": "2.40"
}