@startuml

skinparam sequence {
ParticipantBackgroundColor #1267c1
ParticipantFontColor #A9DCDF
}

skinparam ParticipantPadding 20
skinparam BoxPadding 20

box "alpha_py" #438dd4
participant WSController
participant Vehicle
end box

box "sw_server" #ffffff
participant WSServerWrapper
participant Protocol
end box

WSController -> Vehicle: get_steering_wheel_angle()
Vehicle     --> WSController

WSController -> WSController: create_msg()

WSController -> WSServerWrapper: send request [websocket] 

WSServerWrapper -> Protocol: process_request(msg)

alt request is correct
    
    Protocol -> Protocol: save angles

    WSServerWrapper -> Protocol: create_response()

    Protocol --> WSServerWrapper

end

    WSServerWrapper -> WSController: send response [websocket]

@enduml
