{
    "controller_name": "RemoteController",
    "alpha_port": "/dev/ALPHA_TEST_PC_SIDE",
    "controller_params": 
    {
        "ip": "localhost",
        "port": "8687",
        "send_rate": 50
    }
}