module gitlab.com/unboundsoftware/sloth/amqp

go 1.22.2

require (
	github.com/alecthomas/kong v1.8.1
	github.com/hashicorp/go-hclog v1.6.3
	github.com/hashicorp/go-plugin v1.6.3
	github.com/sanity-io/litter v1.5.8
	github.com/sparetimecoders/goamqp v0.3.1
	github.com/stretchr/testify v1.10.0
	gitlab.com/unboundsoftware/sloth/model v0.2.0
)

require (
	github.com/davecgh/go-spew v1.1.1 // indirect
	github.com/fatih/color v1.13.0 // indirect
	github.com/golang/protobuf v1.5.3 // indirect
	github.com/google/uuid v1.6.0 // indirect
	github.com/hashicorp/yamux v0.1.1 // indirect
	github.com/kr/pretty v0.2.0 // indirect
	github.com/mattn/go-colorable v0.1.12 // indirect
	github.com/mattn/go-isatty v0.0.19 // indirect
	github.com/oklog/run v1.0.0 // indirect
	github.com/pkg/errors v0.9.1 // indirect
	github.com/pmezard/go-difflib v1.0.0 // indirect
	github.com/rabbitmq/amqp091-go v1.10.0 // indirect
	golang.org/x/net v0.34.0 // indirect
	golang.org/x/sys v0.29.0 // indirect
	golang.org/x/text v0.21.0 // indirect
	google.golang.org/genproto/googleapis/rpc v0.0.0-20230711160842-782d3b101e98 // indirect
	google.golang.org/grpc v1.58.3 // indirect
	google.golang.org/protobuf v1.36.1 // indirect
	gopkg.in/check.v1 v1.0.0-20190902080502-41f04d3bba15 // indirect
	gopkg.in/yaml.v3 v3.0.1 // indirect
)
