{
  "Deploy": {
    "Project": {
      "Name": "fake payment gateway",
      "Alias": "fake-payment-gateway",
      "Id": "10717a2b-a2c4-49ec-8f3a-7455fb1833b0",
      "Workspaces": [
        {
          "Id": "deaf01fb-149f-4e50-94d3-3c876dd39ecf",
          "Name": "Live",
          "Type": "live",
          "Url": "https://fake-payment-gateway.euwest01.umbraco.io"
        }
      ]
    },
    "Settings": {
      "ApiKey": "718A91A784C3150ADB1DC2CDFE34AB50E87465B2"
    }
  },
  "Identity": {
    "ClientId": "0297c0f6-83ad-4481-9ae2-07a3f5475333",
    "ClientSecret": "Q5~T526ixOHlj47lg7Mu7_.zN1fK.7ua.9",
    "EnvironmentId": "deaf01fb-149f-4e50-94d3-3c876dd39ecf",
    "LocalLoginRedirectUri": "https://redirect.identity.umbraco.com"
  }
}