[
    {
        "id": 1,
        "name": "Nokia Smart Tv Qled 6500D",
        "price": "12300",
        "img_url": "./img/NokiaSmartTV6500D.jpg",
        "articul": "123456",
        "color": "red"
    },
    {
        "id": 2,
        "name": "TCL 55C715",
        "price": "32100",
        "img_url": "./img/TCL55C715.jpg",
        "articul": "543425",
        "color": "yellow"
    },
    {
        "id": 3,
        "name": "TCL 43C725",
        "price": "23400",
        "img_url": "./img/TCL43C725.jpg",
        "articul": "436254",
        "color": "green"
    },
    {
        "id": 4,
        "name": "Hisense 50E7HQ",
        "price": "43000",
        "img_url": "./img/Hisense50E7HQ.jpg",
        "articul": "253645",
        "color": "purple"
    },
    {
        "id": 5,
        "name": "Samsung QE75QN700BUXUA",
        "price": "22300",
        "img_url": "./img/SamsungQE75QN700BUXUA.jpg",
        "articul": "435263",
        "color": "blue"
    },
    {
        "id": 6,
        "name": "Samsung QE55QN85BAUXUA",
        "price": "12500",
        "img_url": "./img/SamsungQE55QN85BAUXUA.jpg",
        "articul": "645342",
        "color": "red"
    },
    {
        "id": 7,
        "name": "LG 50UQ91006LA",
        "price": "13850",
        "img_url": "./img/LG50UQ91006LA.jpg",
        "articul": "534164",
        "color": "yellow"
    },
    {
        "id": 8,
        "name": "Philips 32PHS5527",
        "price": "13400",
        "img_url": "./img/Philips32PHS5527.jpg",
        "articul": "615243",
        "color": "green"
    },
    {
        "id": 9,
        "name": "Sony KD43X85TKR",
        "price": "25000",
        "img_url": "./img/SonyKD43X85TKR.jpg",
        "articul": "435261",
        "color": "purple"
    },
    {
        "id": 10,
        "name": "Xiaomi Mi TV P1 55",
        "price": "32000",
        "img_url": "./img/XiaomiMiTVP155Black.jpg",
        "articul": "434261",
        "color": "red"
    }
]