PI 0 011100100101101110011111000010100
PI 4000 111100100101101110011111000010100
PI 8000 011100100101101110011111000010100
PI 12000 111100100101101110011111000010100
PI 16000 011100100101101110011111000010100
