PI 0 001001011000110111011101001111001
PI 4000 101001011000110111011101001111001
PI 8000 001001011000110111011101001111001
PI 12000 101001011000110111011101001111001
PI 16000 001001011000110111011101001111001
