PI 0 000101001110011001100111001110011
PI 4000 100101001110011001100111001110011
PI 8000 000101001110011001100111001110011
PI 12000 100101001110011001100111001110011
PI 16000 000101001110011001100111001110011
