PI 0 001011111110011110110001101011110
PI 4000 101011111110011110110001101011110
PI 8000 001011111110011110110001101011110
PI 12000 101011111110011110110001101011110
PI 16000 001011111110011110110001101011110
