PI 0 001110000110111000011001110101000
PI 4000 101110000110111000011001110101000
PI 8000 001110000110111000011001110101000
PI 12000 101110000110111000011001110101000
PI 16000 001110000110111000011001110101000
