PI 0 011100011001011011101110010101010
PI 4000 111100011001011011101110010101010
PI 8000 011100011001011011101110010101010
PI 12000 111100011001011011101110010101010
PI 16000 011100011001011011101110010101010
