PI 0 010111100100011100110000101110001
PI 4000 110111100100011100110000101110001
PI 8000 010111100100011100110000101110001
PI 12000 110111100100011100110000101110001
PI 16000 010111100100011100110000101110001
