PI 0 000101001101001100100011100110001
PI 4000 100101001101001100100011100110001
PI 8000 000101001101001100100011100110001
PI 12000 100101001101001100100011100110001
PI 16000 000101001101001100100011100110001
