PI 0 011000110001001100000000011010111
PI 4000 111000110001001100000000011010111
PI 8000 011000110001001100000000011010111
PI 12000 111000110001001100000000011010111
PI 16000 011000110001001100000000011010111
