PI 0 000000001101100011011100011110111
PI 4000 100000001101100011011100011110111
PI 8000 000000001101100011011100011110111
PI 12000 100000001101100011011100011110111
PI 16000 000000001101100011011100011110111
