PI 0 001000101101001010000100111111110
PI 4000 101000101101001010000100111111110
PI 8000 001000101101001010000100111111110
PI 12000 101000101101001010000100111111110
PI 16000 001000101101001010000100111111110
