PI 0 010001100010100011001001110010101
PI 4000 110001100010100011001001110010101
PI 8000 010001100010100011001001110010101
PI 12000 110001100010100011001001110010101
PI 16000 010001100010100011001001110010101
