PI 0 011111111110010000010110011010111
PI 4000 111111111110010000010110011010111
PI 8000 011111111110010000010110011010111
PI 12000 111111111110010000010110011010111
PI 16000 011111111110010000010110011010111
