PI 0 010100010000001110100100011100110
PI 4000 110100010000001110100100011100110
PI 8000 010100010000001110100100011100110
PI 12000 110100010000001110100100011100110
PI 16000 010100010000001110100100011100110
