PI 0 011110001100000101010110000000010
PI 4000 111110001100000101010110000000010
PI 8000 011110001100000101010110000000010
PI 12000 111110001100000101010110000000010
PI 16000 011110001100000101010110000000010
