PI 0 011110011001001110010100010001110
PI 4000 111110011001001110010100010001110
PI 8000 011110011001001110010100010001110
PI 12000 111110011001001110010100010001110
PI 16000 011110011001001110010100010001110
