PI 0 001011100011111011010000110010100
PI 4000 101011100011111011010000110010100
PI 8000 001011100011111011010000110010100
PI 12000 101011100011111011010000110010100
PI 16000 001011100011111011010000110010100
