PI 0 011100111111001100110110100100100
PI 4000 111100111111001100110110100100100
PI 8000 011100111111001100110110100100100
PI 12000 111100111111001100110110100100100
PI 16000 011100111111001100110110100100100
