PI 0 001111001111110000101101100001100
PI 4000 101111001111110000101101100001100
PI 8000 001111001111110000101101100001100
PI 12000 101111001111110000101101100001100
PI 16000 001111001111110000101101100001100
