PI 0 011000011101100101111001111111000
PI 4000 111000011101100101111001111111000
PI 8000 011000011101100101111001111111000
PI 12000 111000011101100101111001111111000
PI 16000 011000011101100101111001111111000
