PI 0 001101001100000011100010011100101
PI 4000 101101001100000011100010011100101
PI 8000 001101001100000011100010011100101
PI 12000 101101001100000011100010011100101
PI 16000 001101001100000011100010011100101
