PI 0 011000000111101100101111111111011
PI 4000 111000000111101100101111111111011
PI 8000 011000000111101100101111111111011
PI 12000 111000000111101100101111111111011
PI 16000 011000000111101100101111111111011
