PI 0 011111001110010000111110010101111
PI 4000 111111001110010000111110010101111
PI 8000 011111001110010000111110010101111
PI 12000 111111001110010000111110010101111
PI 16000 011111001110010000111110010101111
