PI 0 010011001100011001001001011011111
PI 4000 110011001100011001001001011011111
PI 8000 010011001100011001001001011011111
PI 12000 110011001100011001001001011011111
PI 16000 010011001100011001001001011011111
