PI 0 000000011010101010111110001100000
PI 4000 100000011010101010111110001100000
PI 8000 000000011010101010111110001100000
PI 12000 100000011010101010111110001100000
PI 16000 000000011010101010111110001100000
