PI 0 001000011110101100011011001111011
PI 4000 101000011110101100011011001111011
PI 8000 001000011110101100011011001111011
PI 12000 101000011110101100011011001111011
PI 16000 001000011110101100011011001111011
