PI 0 001001001011110110101110011001100
PI 4000 101001001011110110101110011001100
PI 8000 001001001011110110101110011001100
PI 12000 101001001011110110101110011001100
PI 16000 001001001011110110101110011001100
