PI 0 011011100010000100100100111101001
PI 4000 111011100010000100100100111101001
PI 8000 011011100010000100100100111101001
PI 12000 111011100010000100100100111101001
PI 16000 011011100010000100100100111101001
