PI 0 000010001111010001110000001011111
PI 4000 100010001111010001110000001011111
PI 8000 000010001111010001110000001011111
PI 12000 100010001111010001110000001011111
PI 16000 000010001111010001110000001011111
