PI 0 011100011000000000011101011111000
PI 4000 111100011000000000011101011111000
PI 8000 011100011000000000011101011111000
PI 12000 111100011000000000011101011111000
PI 16000 011100011000000000011101011111000
