PI 0 011011101101100010101111001110101
PI 4000 111011101101100010101111001110101
PI 8000 011011101101100010101111001110101
PI 12000 111011101101100010101111001110101
PI 16000 011011101101100010101111001110101
