PI 0 000100111111110101010010000010111
PI 4000 100100111111110101010010000010111
PI 8000 000100111111110101010010000010111
PI 12000 100100111111110101010010000010111
PI 16000 000100111111110101010010000010111
