PI 0 010101100110101111011111101010100
PI 4000 110101100110101111011111101010100
PI 8000 010101100110101111011111101010100
PI 12000 110101100110101111011111101010100
PI 16000 010101100110101111011111101010100
