PI 0 011101010101010111111000011110100
PI 4000 111101010101010111111000011110100
PI 8000 011101010101010111111000011110100
PI 12000 111101010101010111111000011110100
PI 16000 011101010101010111111000011110100
