PI 0 000110010000011100000111101101101
PI 4000 100110010000011100000111101101101
PI 8000 000110010000011100000111101101101
PI 12000 100110010000011100000111101101101
PI 16000 000110010000011100000111101101101
