PI 0 001010011100001101000010001100001
PI 4000 101010011100001101000010001100001
PI 8000 001010011100001101000010001100001
PI 12000 101010011100001101000010001100001
PI 16000 001010011100001101000010001100001
