PI 0 010011101010011111111010110011110
PI 4000 110011101010011111111010110011110
PI 8000 010011101010011111111010110011110
PI 12000 110011101010011111111010110011110
PI 16000 010011101010011111111010110011110
