PI 0 010001101010010100101011010000000
PI 4000 110001101010010100101011010000000
PI 8000 010001101010010100101011010000000
PI 12000 110001101010010100101011010000000
PI 16000 010001101010010100101011010000000
