PI 0 010010101111011101010111000010101
PI 4000 110010101111011101010111000010101
PI 8000 010010101111011101010111000010101
PI 12000 110010101111011101010111000010101
PI 16000 010010101111011101010111000010101
