PI 0 000100110110011101101110100011010
PI 4000 100100110110011101101110100011010
PI 8000 000100110110011101101110100011010
PI 12000 100100110110011101101110100011010
PI 16000 000100110110011101101110100011010
