PI 0 001011011100101000111010010110111
PI 4000 101011011100101000111010010110111
PI 8000 001011011100101000111010010110111
PI 12000 101011011100101000111010010110111
PI 16000 001011011100101000111010010110111
