PI 0 001111110010100100101111000001011
PI 4000 101111110010100100101111000001011
PI 8000 001111110010100100101111000001011
PI 12000 101111110010100100101111000001011
PI 16000 001111110010100100101111000001011
