PI 0 001111110001110011100011111100000
PI 4000 101111110001110011100011111100000
PI 8000 001111110001110011100011111100000
PI 12000 101111110001110011100011111100000
PI 16000 001111110001110011100011111100000
