PI 0 010000000010111011000011111011100
PI 4000 110000000010111011000011111011100
PI 8000 010000000010111011000011111011100
PI 12000 110000000010111011000011111011100
PI 16000 010000000010111011000011111011100
