PI 0 000110101010001011101111010110001
PI 4000 100110101010001011101111010110001
PI 8000 000110101010001011101111010110001
PI 12000 100110101010001011101111010110001
PI 16000 000110101010001011101111010110001
