PI 0 010001100011110100100110000000111
PI 4000 110001100011110100100110000000111
PI 8000 010001100011110100100110000000111
PI 12000 110001100011110100100110000000111
PI 16000 010001100011110100100110000000111
