PI 0 001111011010110111010000001101101
PI 4000 101111011010110111010000001101101
PI 8000 001111011010110111010000001101101
PI 12000 101111011010110111010000001101101
PI 16000 001111011010110111010000001101101
