PI 0 010001011100011110110111001010110
PI 4000 110001011100011110110111001010110
PI 8000 010001011100011110110111001010110
PI 12000 110001011100011110110111001010110
PI 16000 010001011100011110110111001010110
