PI 0 001000011001000101010110001010000
PI 4000 101000011001000101010110001010000
PI 8000 001000011001000101010110001010000
PI 12000 101000011001000101010110001010000
PI 16000 001000011001000101010110001010000
