PI 0 011100011101011110101100011001100
PI 4000 111100011101011110101100011001100
PI 8000 011100011101011110101100011001100
PI 12000 111100011101011110101100011001100
PI 16000 011100011101011110101100011001100
