PI 0 000110110110011000110011010010010
PI 4000 100110110110011000110011010010010
PI 8000 000110110110011000110011010010010
PI 12000 100110110110011000110011010010010
PI 16000 000110110110011000110011010010010
