PI 0 010010000110111000010010001000010
PI 4000 110010000110111000010010001000010
PI 8000 010010000110111000010010001000010
PI 12000 110010000110111000010010001000010
PI 16000 010010000110111000010010001000010
