PI 0 010001011101001111000000000111101
PI 4000 110001011101001111000000000111101
PI 8000 010001011101001111000000000111101
PI 12000 110001011101001111000000000111101
PI 16000 010001011101001111000000000111101
