PI 0 001011001101101011000011100000110
PI 4000 101011001101101011000011100000110
PI 8000 001011001101101011000011100000110
PI 12000 101011001101101011000011100000110
PI 16000 001011001101101011000011100000110
