PI 0 001101011110010011000000101001010
PI 4000 101101011110010011000000101001010
PI 8000 001101011110010011000000101001010
PI 12000 101101011110010011000000101001010
PI 16000 001101011110010011000000101001010
