PI 0 000001111111110100010110010111100
PI 4000 100001111111110100010110010111100
PI 8000 000001111111110100010110010111100
PI 12000 100001111111110100010110010111100
PI 16000 000001111111110100010110010111100
