PI 0 001110010110000011100100001101000
PI 4000 101110010110000011100100001101000
PI 8000 001110010110000011100100001101000
PI 12000 101110010110000011100100001101000
PI 16000 001110010110000011100100001101000
