PI 0 001011010100111100000110111000010
PI 4000 101011010100111100000110111000010
PI 8000 001011010100111100000110111000010
PI 12000 101011010100111100000110111000010
PI 16000 001011010100111100000110111000010
