PI 0 011001101000010101110010001011101
PI 4000 111001101000010101110010001011101
PI 8000 011001101000010101110010001011101
PI 12000 111001101000010101110010001011101
PI 16000 011001101000010101110010001011101
