PI 0 010010101000101010000000000111111
PI 4000 110010101000101010000000000111111
PI 8000 010010101000101010000000000111111
PI 12000 110010101000101010000000000111111
PI 16000 010010101000101010000000000111111
