PI 0 000110100111100011101000111011000
PI 4000 100110100111100011101000111011000
PI 8000 000110100111100011101000111011000
PI 12000 100110100111100011101000111011000
PI 16000 000110100111100011101000111011000
