PI 0 010111111001001001101100010101101
PI 4000 110111111001001001101100010101101
PI 8000 010111111001001001101100010101101
PI 12000 110111111001001001101100010101101
PI 16000 010111111001001001101100010101101
