PI 0 010100011011011011111101010111010
PI 4000 110100011011011011111101010111010
PI 8000 010100011011011011111101010111010
PI 12000 110100011011011011111101010111010
PI 16000 010100011011011011111101010111010
