PI 0 011000011111100111110110001001010
PI 4000 111000011111100111110110001001010
PI 8000 011000011111100111110110001001010
PI 12000 111000011111100111110110001001010
PI 16000 011000011111100111110110001001010
