PI 0 011101101001000010100110000011111
PI 4000 111101101001000010100110000011111
PI 8000 011101101001000010100110000011111
PI 12000 111101101001000010100110000011111
PI 16000 011101101001000010100110000011111
