PI 0 011101100000010111000011010101110
PI 4000 111101100000010111000011010101110
PI 8000 011101100000010111000011010101110
PI 12000 111101100000010111000011010101110
PI 16000 011101100000010111000011010101110
