PI 0 011111001011110101000101010111101
PI 4000 111111001011110101000101010111101
PI 8000 011111001011110101000101010111101
PI 12000 111111001011110101000101010111101
PI 16000 011111001011110101000101010111101
