PI 0 000000000000101010101110111001011
PI 4000 100000000000101010101110111001011
PI 8000 000000000000101010101110111001011
PI 12000 100000000000101010101110111001011
PI 16000 000000000000101010101110111001011
