PI 0 001110111111011001010110101001111
PI 4000 101110111111011001010110101001111
PI 8000 001110111111011001010110101001111
PI 12000 101110111111011001010110101001111
PI 16000 001110111111011001010110101001111
