PI 0 011011101010110100001110001101100
PI 4000 111011101010110100001110001101100
PI 8000 011011101010110100001110001101100
PI 12000 111011101010110100001110001101100
PI 16000 011011101010110100001110001101100
