PI 0 000110100101010110010100011111000
PI 4000 100110100101010110010100011111000
PI 8000 000110100101010110010100011111000
PI 12000 100110100101010110010100011111000
PI 16000 000110100101010110010100011111000
