PI 0 000111001110100001101011101100010
PI 4000 100111001110100001101011101100010
PI 8000 000111001110100001101011101100010
PI 12000 100111001110100001101011101100010
PI 16000 000111001110100001101011101100010
