PI 0 001101001101111101100010011110001
PI 4000 101101001101111101100010011110001
PI 8000 001101001101111101100010011110001
PI 12000 101101001101111101100010011110001
PI 16000 001101001101111101100010011110001
