PI 0 010011010010110001100010001100100
PI 4000 110011010010110001100010001100100
PI 8000 010011010010110001100010001100100
PI 12000 110011010010110001100010001100100
PI 16000 010011010010110001100010001100100
