PI 0 001000101110000101000000011010110
PI 4000 101000101110000101000000011010110
PI 8000 001000101110000101000000011010110
PI 12000 101000101110000101000000011010110
PI 16000 001000101110000101000000011010110
