PI 0 010110000100001101101110000001001
PI 4000 110110000100001101101110000001001
PI 8000 010110000100001101101110000001001
PI 12000 110110000100001101101110000001001
PI 16000 010110000100001101101110000001001
