PI 0 010100011000100110000111000010001
PI 4000 110100011000100110000111000010001
PI 8000 010100011000100110000111000010001
PI 12000 110100011000100110000111000010001
PI 16000 010100011000100110000111000010001
