PI 0 000011111110011010111000100110101
PI 4000 100011111110011010111000100110101
PI 8000 000011111110011010111000100110101
PI 12000 100011111110011010111000100110101
PI 16000 000011111110011010111000100110101
