PI 0 011000100010110011010110000100001
PI 4000 111000100010110011010110000100001
PI 8000 011000100010110011010110000100001
PI 12000 111000100010110011010110000100001
PI 16000 011000100010110011010110000100001
