PI 0 010101100000110011001100100111110
PI 4000 110101100000110011001100100111110
PI 8000 010101100000110011001100100111110
PI 12000 110101100000110011001100100111110
PI 16000 010101100000110011001100100111110
