PI 0 001010100000100010001010111001100
PI 4000 101010100000100010001010111001100
PI 8000 001010100000100010001010111001100
PI 12000 101010100000100010001010111001100
PI 16000 001010100000100010001010111001100
