PI 0 011011110011010101001011010011001
PI 4000 111011110011010101001011010011001
PI 8000 011011110011010101001011010011001
PI 12000 111011110011010101001011010011001
PI 16000 011011110011010101001011010011001
