PI 0 010110101111011011010101011101001
PI 4000 110110101111011011010101011101001
PI 8000 010110101111011011010101011101001
PI 12000 110110101111011011010101011101001
PI 16000 010110101111011011010101011101001
