PI 0 001110100010110011100100111011110
PI 4000 101110100010110011100100111011110
PI 8000 001110100010110011100100111011110
PI 12000 101110100010110011100100111011110
PI 16000 001110100010110011100100111011110
