PI 0 001011010001100101000101110110001
PI 4000 101011010001100101000101110110001
PI 8000 001011010001100101000101110110001
PI 12000 101011010001100101000101110110001
PI 16000 001011010001100101000101110110001
