PI 0 000100100000010010001111011010110
PI 4000 100100100000010010001111011010110
PI 8000 000100100000010010001111011010110
PI 12000 100100100000010010001111011010110
PI 16000 000100100000010010001111011010110
