PI 0 000001010110010100110011101101100
PI 4000 100001010110010100110011101101100
PI 8000 000001010110010100110011101101100
PI 12000 100001010110010100110011101101100
PI 16000 000001010110010100110011101101100
