PI 0 011010001011011101010010111100101
PI 4000 111010001011011101010010111100101
PI 8000 011010001011011101010010111100101
PI 12000 111010001011011101010010111100101
PI 16000 011010001011011101010010111100101
