PI 0 001111000111000100111001010111101
PI 4000 101111000111000100111001010111101
PI 8000 001111000111000100111001010111101
PI 12000 101111000111000100111001010111101
PI 16000 001111000111000100111001010111101
