PI 0 010001011011001111000110000110111
PI 4000 110001011011001111000110000110111
PI 8000 010001011011001111000110000110111
PI 12000 110001011011001111000110000110111
PI 16000 010001011011001111000110000110111
