PI 0 001010001101110001011111001001111
PI 4000 101010001101110001011111001001111
PI 8000 001010001101110001011111001001111
PI 12000 101010001101110001011111001001111
PI 16000 001010001101110001011111001001111
