PI 0 010010101000000000110101111110101
PI 4000 110010101000000000110101111110101
PI 8000 010010101000000000110101111110101
PI 12000 110010101000000000110101111110101
PI 16000 010010101000000000110101111110101
