PI 0 011111000101110010101110010010101
PI 4000 111111000101110010101110010010101
PI 8000 011111000101110010101110010010101
PI 12000 111111000101110010101110010010101
PI 16000 011111000101110010101110010010101
