PI 0 011111010101111010101101010001011
PI 4000 111111010101111010101101010001011
PI 8000 011111010101111010101101010001011
PI 12000 111111010101111010101101010001011
PI 16000 011111010101111010101101010001011
