PI 0 000000111111111101100111001100011
PI 4000 100000111111111101100111001100011
PI 8000 000000111111111101100111001100011
PI 12000 100000111111111101100111001100011
PI 16000 000000111111111101100111001100011
