PI 0 000000111101100000011101100100001
PI 4000 100000111101100000011101100100001
PI 8000 000000111101100000011101100100001
PI 12000 100000111101100000011101100100001
PI 16000 000000111101100000011101100100001
