PI 0 010101001001010011000000101011001
PI 4000 110101001001010011000000101011001
PI 8000 010101001001010011000000101011001
PI 12000 110101001001010011000000101011001
PI 16000 010101001001010011000000101011001
