PI 0 010100001110110001100000010100111
PI 4000 110100001110110001100000010100111
PI 8000 010100001110110001100000010100111
PI 12000 110100001110110001100000010100111
PI 16000 010100001110110001100000010100111
