PI 0 011111100010000101111000101001000
PI 4000 111111100010000101111000101001000
PI 8000 011111100010000101111000101001000
PI 12000 111111100010000101111000101001000
PI 16000 011111100010000101111000101001000
