PI 0 010101100011010111000110000101010
PI 4000 110101100011010111000110000101010
PI 8000 010101100011010111000110000101010
PI 12000 110101100011010111000110000101010
PI 16000 010101100011010111000110000101010
