PI 0 010100111010101100101001001000110
PI 4000 110100111010101100101001001000110
PI 8000 010100111010101100101001001000110
PI 12000 110100111010101100101001001000110
PI 16000 010100111010101100101001001000110
