PI 0 011000111001000001001110001111000
PI 4000 111000111001000001001110001111000
PI 8000 011000111001000001001110001111000
PI 12000 111000111001000001001110001111000
PI 16000 011000111001000001001110001111000
