PI 0 001010110001111110011110001011001
PI 4000 101010110001111110011110001011001
PI 8000 001010110001111110011110001011001
PI 12000 101010110001111110011110001011001
PI 16000 001010110001111110011110001011001
