PI 0 011100010101000101010001010000001
PI 4000 111100010101000101010001010000001
PI 8000 011100010101000101010001010000001
PI 12000 111100010101000101010001010000001
PI 16000 011100010101000101010001010000001
