PI 0 001101101101110001100110000011001
PI 4000 101101101101110001100110000011001
PI 8000 001101101101110001100110000011001
PI 12000 101101101101110001100110000011001
PI 16000 001101101101110001100110000011001
