PI 0 000010010010100010000110010110010
PI 4000 100010010010100010000110010110010
PI 8000 000010010010100010000110010110010
PI 12000 100010010010100010000110010110010
PI 16000 000010010010100010000110010110010
