PI 0 011010100000010100111100111001100
PI 4000 111010100000010100111100111001100
PI 8000 011010100000010100111100111001100
PI 12000 111010100000010100111100111001100
PI 16000 011010100000010100111100111001100
