PI 0 000100000100011010100110011011001
PI 4000 100100000100011010100110011011001
PI 8000 000100000100011010100110011011001
PI 12000 100100000100011010100110011011001
PI 16000 000100000100011010100110011011001
