PI 0 000100110001001101101011101001101
PI 4000 100100110001001101101011101001101
PI 8000 000100110001001101101011101001101
PI 12000 100100110001001101101011101001101
PI 16000 000100110001001101101011101001101
