PI 0 010000011111111011011110101110110
PI 4000 110000011111111011011110101110110
PI 8000 010000011111111011011110101110110
PI 12000 110000011111111011011110101110110
PI 16000 010000011111111011011110101110110
