PI 0 001111001010001100010100101011000
PI 4000 101111001010001100010100101011000
PI 8000 001111001010001100010100101011000
PI 12000 101111001010001100010100101011000
PI 16000 001111001010001100010100101011000
