PI 0 010000101010101001000110100001101
PI 4000 110000101010101001000110100001101
PI 8000 010000101010101001000110100001101
PI 12000 110000101010101001000110100001101
PI 16000 010000101010101001000110100001101
