<?xml version="1.0" encoding="UTF-8" standalone="no"?>
<svg
   xmlns:dc="http://purl.org/dc/elements/1.1/"
   xmlns:cc="http://creativecommons.org/ns#"
   xmlns:rdf="http://www.w3.org/1999/02/22-rdf-syntax-ns#"
   xmlns:svg="http://www.w3.org/2000/svg"
   xmlns="http://www.w3.org/2000/svg"
   xmlns:xlink="http://www.w3.org/1999/xlink"
   width="512"
   height="512"
   viewBox="0 0 135.46666 135.46668"
   version="1.1"
   id="svg8">
  <title
     id="title83875">UM FTL Lab Logo</title>
  <defs
     id="defs2">
    <linearGradient
       id="linearGradient167099">
      <stop
         id="stop167095"
         offset="0"
         style="stop-color:#c7f6ff;stop-opacity:1;" />
      <stop
         id="stop167097"
         offset="1"
         style="stop-color:#c7f6ff;stop-opacity:0;" />
    </linearGradient>
    <linearGradient
       gradientUnits="userSpaceOnUse"
       y2="344.17755"
       x2="270.28525"
       y1="137.15683"
       x1="453.96863"
       id="linearGradient167101"
       xlink:href="#linearGradient167099" />
  </defs>
  <metadata
     id="metadata5">
    <rdf:RDF>
      <cc:Work
         rdf:about="">
        <dc:format>image/svg+xml</dc:format>
        <dc:type
           rdf:resource="http://purl.org/dc/dcmitype/StillImage" />
        <dc:title>UM FTL Lab Logo</dc:title>
        <dc:creator>
          <cc:Agent>
            <dc:title>Barry Muldrey</dc:title>
          </cc:Agent>
        </dc:creator>
        <dc:rights>
          <cc:Agent>
            <dc:title />
          </cc:Agent>
        </dc:rights>
        <cc:license
           rdf:resource="http://creativecommons.org/licenses/by-nc-nd/4.0/" />
      </cc:Work>
      <cc:License
         rdf:about="http://creativecommons.org/licenses/by-nc-nd/4.0/">
        <cc:permits
           rdf:resource="http://creativecommons.org/ns#Reproduction" />
        <cc:permits
           rdf:resource="http://creativecommons.org/ns#Distribution" />
        <cc:requires
           rdf:resource="http://creativecommons.org/ns#Notice" />
        <cc:requires
           rdf:resource="http://creativecommons.org/ns#Attribution" />
        <cc:prohibits
           rdf:resource="http://creativecommons.org/ns#CommercialUse" />
      </cc:License>
    </rdf:RDF>
  </metadata>
  <g
     transform="translate(-72.639334,-163.29867)"
     id="layer1">
    <path
       id="path83829"
       d="m 166.10282,294.4794 c -0.2607,-0.51099 -10.96864,-22.42097 -11.02492,-22.55853 -0.0358,-0.0879 4.11604,-0.10993 20.58731,-0.10993 h 20.63226 l -5.62929,11.52112 -5.62935,11.52114 h -9.37265 -9.37267 z"
       style="opacity:1;fill:#7d3e00;fill-opacity:1;stroke:none;stroke-width:0.26458329;stroke-linecap:round;stroke-linejoin:miter;stroke-miterlimit:4;stroke-dasharray:0.26458331, 0.79374993;stroke-dashoffset:0;stroke-opacity:1" />
    <g
       style="stroke-width:0.90245414"
       transform="matrix(1.1080288,0,0,1.1081504,-13.042566,-11.182365)"
       id="g88219">
      <g
         style="stroke-width:0.90245414"
         id="g88205">
        <flowRoot
           transform="matrix(-0.13575633,-0.21432829,0.21398863,-0.13597181,54.801024,345.75569)"
           style="line-height:0.01%;font-family:'Bitstream Vera Sans';fill:#007d1c;fill-opacity:1;stroke:none;stroke-width:0.94146675;stroke-opacity:1"
           xml:space="preserve"
           id="flowRoot2824">
      <flowRegion
   id="flowRegion2826"
   style="fill:#007d1c;fill-opacity:1;stroke:none;stroke-width:0.94146675;stroke-opacity:1">
        <rect
   height="212.13"
   x="82.833"
   width="27.274"
   y="445.26001"
   id="rect2828"
   style="fill:#007d1c;fill-opacity:1;stroke:none;stroke-width:0.94146675;stroke-opacity:1" />
      </flowRegion>
      <flowPara
   style="font-size:40px;line-height:1.25;fill:#007d1c;fill-opacity:1;stroke:none;stroke-width:0.94146675;stroke-opacity:1"
   id="flowPara2830" />
    </flowRoot>        <path
           id="path2842"
           style="fill:#007d1c;fill-opacity:1;stroke:none;stroke-width:0.23877433;stroke-opacity:1"
           d="m 107.79668,274.46857 c 2.13634,-7.76034 6.23713,-16.65229 13.54052,-21.73183 8.84337,-6.15067 19.61001,-10.50867 25.56775,-19.94102 4.92719,-7.80048 4.90937,-20.57175 -2.63558,-25.61798 -10.27028,-6.86899 -25.38752,-0.79459 -33.81186,8.0389 -10.372,10.87575 -13.309064,28.29754 -6.42678,41.91595 1.60571,3.17714 7.7494,7.69949 4.78924,9.81247 -1.80591,1.28913 -2.19353,-0.86792 -4.69638,-4.71967 -2.5029,-3.8518 -7.363971,-12.18962 -7.553709,-19.49424 -0.314332,-12.10131 4.837189,-24.30941 13.932909,-32.19762 8.69887,-7.5439 21.95268,-10.30593 32.47717,-4.90573 5.59822,2.87303 9.46004,8.52457 10.16176,14.79807 1.00673,8.99933 -3.65665,17.93554 -11.1115,23.01665 -8.75261,5.9656 -19.40705,10.06721 -25.40607,19.27708 -2.47279,3.79594 -3.94665,10.48993 -6.38603,12.00178 -2.43937,1.51185 -2.66354,0.55809 -2.44019,-0.25306 z" />
        <path
           id="path2907"
           style="fill:#007d1c;fill-opacity:1;stroke:none;stroke-width:0.23877433;stroke-opacity:1"
           d="m 109.0139,257.74582 c -0.0234,-5.09064 2.52409,-9.67169 4.67897,-14.09462 2.80264,-5.75225 7.17734,-10.58142 11.09349,-15.61099 2.62136,-3.36663 5.42157,-6.60536 7.68243,-10.24076 1.35556,-2.17956 4.00587,-3.29305 5.22608,-5.60865 0.88022,-1.67031 3.56204,-0.80266 2.09673,0.99526 -1.4886,1.82658 -3.60254,2.94951 -5.0461,4.83762 -2.16871,2.83658 -3.89257,5.97888 -6.34953,8.61528 -3.77105,4.04616 -6.84734,8.68693 -10.09776,13.15942 -3.85881,5.3096 -6.42431,11.50969 -7.75574,17.93105 -0.25567,0.65281 -1.25507,0.65591 -1.5286,0.0165 z" />
        <path
           id="path2926"
           style="fill:#007d1c;fill-opacity:1;stroke:none;stroke-width:0.23877433;stroke-opacity:1"
           d="m 116.91505,248.5952 c -0.62498,-2.37772 0.3791,-5.15403 0.51065,-7.70818 0.0538,-1.0441 1.64535,-3.99592 1.19762,-2.91841 -0.61621,1.48318 -6.07669,3.26883 -8.00051,4.32007 -1.92372,1.05118 -3.34619,-0.30074 -1.33172,-1.079 1.81868,-0.70262 3.42866,-1.84713 5.23606,-2.59841 1.37514,-0.57158 3.9828,-2.11036 4.61628,-0.20054 0.63358,1.90977 -0.50641,3.44462 -0.55628,5.09558 -0.0498,1.65119 -0.65766,3.21623 -0.455,4.72101 0.19825,1.47194 -0.99222,1.22369 -1.21715,0.3679 z" />
        <path
           id="path2930"
           style="fill:#007d1c;fill-opacity:1;stroke:none;stroke-width:0.23877433;stroke-opacity:1"
           d="m 125.89438,239.55003 c -0.54223,-4.12103 1.1908,-8.98922 1.24916,-13.38786 0.0232,-1.75069 2.50198,-0.27856 0.47059,0.30222 -4.55699,1.30288 -8.84332,3.94469 -13.13486,6.18784 -1.5838,0.82783 -2.3738,-0.73899 -0.52564,-1.51551 3.81149,-1.60142 7.98003,-4.37943 11.35237,-5.48063 1.80947,-0.59088 3.98799,-0.6144 3.52353,1.76014 -0.48093,2.458 -0.90801,4.94634 -1.05036,7.46827 -0.10034,1.77673 0.21708,4.0574 -0.22303,5.3341 -0.15188,0.44051 -1.58943,-0.11855 -1.66183,-0.6688 z" />
        <path
           id="path2932"
           style="fill:#007d1c;fill-opacity:1;stroke:none;stroke-width:0.23877433;stroke-opacity:1"
           d="m 135.34616,227.18072 c -0.53067,-3.3817 0.32221,-7.5731 -0.0123,-10.94267 -0.13697,-1.37912 2.28412,-1.39544 0.79351,-0.63793 -2.39227,1.21571 -5.12052,2.03979 -7.35559,3.48899 -1.01362,0.65724 -4.29097,1.88443 -3.55824,0.24007 0.62031,-1.39214 3.18055,-1.78872 4.79609,-2.61595 1.72751,-0.88457 3.44988,-1.91788 5.30989,-2.41647 1.74817,-0.46863 2.26737,1.95776 1.82195,3.27631 -0.58575,1.73378 -0.3274,3.62124 -0.32462,5.42482 0.002,1.54568 0.55204,3.31793 0.22544,4.63373 -0.14357,0.57854 -1.61782,0.048 -1.69608,-0.45082 z" />
        <path
           id="path83751"
           d="m 109.98467,266.41551 c -0.3772,-0.2022 -0.45708,-0.28874 -0.37345,-0.40457 0.0585,-0.081 0.0773,-0.42147 0.0416,-0.7565 -0.0993,-0.93465 -0.90255,-2.22361 -2.70413,-4.33954 -2.63132,-3.09045 -3.79801,-5.23314 -4.99603,-9.17549 -3.68044,-12.11128 -0.67814,-26.00647 7.66483,-35.47428 5.63278,-6.39222 14.00309,-10.93722 21.76512,-11.81826 3.05654,-0.34694 6.61816,0.0387 9.27983,1.00466 1.55656,0.56492 3.65256,1.77562 4.8665,2.811 0.80897,0.68998 1.02383,0.95264 2.01936,2.46865 0.98178,1.49509 1.16751,1.8516 1.56424,3.00266 1.70117,4.9357 1.42864,10.86396 -0.73566,16.00289 -1.56656,3.71965 -4.22088,7.0842 -8.45886,10.72227 -1.14555,0.98339 -2.00475,1.56905 -7.16785,4.88585 -11.89004,7.63821 -12.83144,8.27194 -14.19834,9.55805 -2.91086,2.73882 -5.44042,6.27621 -7.40755,10.35888 l -0.67982,1.41094 z m 0.91963,-9.89703 c 0.82217,-3.60405 2.14192,-7.29287 3.8087,-10.64563 0.70325,-1.41459 2.42336,-4.35477 2.53406,-4.33147 0.0399,0.008 -0.0547,0.81448 -0.2103,1.79129 -0.37104,2.32946 -0.44656,3.34744 -0.32756,4.41515 0.10866,0.97487 0.36245,1.47683 0.79246,1.56734 0.52088,0.10963 0.68024,-0.23621 0.69777,-1.51426 0.009,-0.67286 0.0901,-1.61234 0.17983,-2.08774 0.0897,-0.47539 0.20464,-1.29402 0.25545,-1.81916 0.0508,-0.52515 0.26082,-1.71951 0.46668,-2.65414 0.23951,-1.08746 0.33233,-1.87036 0.25778,-2.17432 l -0.11649,-0.475 2.11421,-2.92965 c 2.3316,-3.23088 5.16854,-6.89876 5.40448,-6.98744 0.0832,-0.0313 -0.0527,1.20177 -0.30209,2.74014 -0.58299,3.59621 -0.8056,5.80665 -0.72435,7.19248 0.0604,1.03055 0.0898,1.12737 0.42388,1.39447 0.3949,0.31578 1.15672,0.55259 1.35683,0.42176 0.23533,-0.15384 0.37121,-1.51365 0.34011,-3.40369 -0.0384,-2.33679 0.16543,-4.54814 0.71626,-7.76904 0.23537,-1.37628 0.39741,-2.61242 0.36009,-2.74698 -0.0492,-0.17735 0.18598,-0.56363 0.85497,-1.40437 0.50755,-0.63785 1.67935,-2.26044 2.60401,-3.60577 1.79914,-2.61767 2.83875,-4.03649 2.89471,-3.95063 0.0638,0.0979 0.0418,1.31459 -0.0594,3.29072 -0.1464,2.85672 -0.15342,4.58625 -0.023,5.66671 l 0.11517,0.95406 0.46535,0.25311 c 0.25594,0.1392 0.64808,0.23802 0.87141,0.21959 0.39809,-0.0328 0.40785,-0.0463 0.49789,-0.68698 0.0505,-0.3594 0.0164,-1.36005 -0.0759,-2.22366 -0.28931,-2.70844 -0.28155,-5.29316 0.021,-6.9938 0.15326,-0.8615 0.26121,-1.75767 0.23989,-1.99147 -0.0367,-0.40272 0.01,-0.46645 0.88457,-1.21026 1.19219,-1.01377 2.04764,-2.04472 2.06204,-2.48507 0.0404,-1.23631 -1.65024,-1.49851 -2.46471,-0.38224 -1.47887,2.02687 -1.62749,2.17403 -2.26423,2.24213 -0.64563,0.0691 -2.05911,0.65424 -4.17441,1.72824 -1.11268,0.56494 -2.51765,1.20204 -3.12216,1.41578 -0.65163,0.2304 -1.47663,0.62877 -2.02645,0.97852 -0.78691,0.50059 -0.95075,0.65355 -1.08184,1.01008 -0.19998,0.5439 -0.0961,0.77673 0.38364,0.86009 0.63671,0.11061 1.93355,-0.33599 3.50199,-1.20601 1.26302,-0.70061 3.57185,-1.80829 3.709,-1.77942 0.16196,0.0341 -3.27246,4.84131 -5.09405,7.13026 l -0.68205,0.85704 -0.89139,0.21133 c -1.5821,0.37509 -3.3829,1.18869 -7.63339,3.44875 -1.08159,0.5751 -2.68407,1.37952 -3.56107,1.78761 -1.41319,0.65758 -1.62455,0.78621 -1.85846,1.13106 -0.4453,0.65652 -0.0502,1.24308 0.77849,1.15587 0.22719,-0.0239 1.28115,-0.52292 2.56942,-1.21653 4.76016,-2.5629 8.60523,-4.44156 8.72244,-4.2617 0.0257,0.0394 -1.14776,1.55584 -2.60763,3.36988 -1.45986,1.81404 -3.22542,4.06094 -3.92345,4.99311 -0.80829,1.0794 -1.34574,1.70008 -1.48008,1.70925 -0.3623,0.0247 -3.53021,1.44735 -5.05397,2.26959 -0.80041,0.43191 -1.77603,0.925 -2.16803,1.09576 -1.50059,0.65365 -1.97528,1.30266 -1.23564,1.68943 0.56657,0.29626 1.13157,0.17869 2.79674,-0.58197 0.86576,-0.39548 2.13107,-0.9609 2.8118,-1.25648 l 1.23768,-0.53742 -0.79637,1.44681 c -0.80039,1.45409 -2.28298,4.4331 -3.27558,6.58173 -1.38322,2.99416 -2.331,6.2946 -2.41925,8.42451 -0.0454,1.09493 0.11589,1.53132 0.59035,1.59749 0.77656,0.10832 0.9705,-0.14336 1.33218,-1.72883 z"
           style="opacity:1;fill:#60be8c;fill-opacity:1;stroke:none;stroke-width:0.2387743;stroke-linecap:round;stroke-linejoin:miter;stroke-miterlimit:4;stroke-dasharray:0.23877431, 0.7163229;stroke-dashoffset:0;stroke-opacity:1" />
      </g>
      <path
         d="m 145.67193,203.4632 c 0.8597,0.43293 1.77518,0.65129 2.72733,0.74188 2.96376,-0.21332 -0.18769,0.0253 -6.85907,-0.0545 -0.16337,-0.002 0.32558,-0.032 0.48626,-0.0615 0.5446,-0.1001 1.05213,-0.30413 1.56422,-0.50663 1.30555,-0.58715 2.47682,-1.40316 3.61816,-2.25613 1.27574,-0.91663 2.30725,-2.10206 3.34103,-3.2712 1.22122,-1.37469 2.33251,-2.83659 3.38064,-4.34572 0.70873,-1.03828 1.30482,-2.15955 1.73441,-3.34159 0.25193,-0.79062 0.30475,-1.61731 0.31203,-2.44099 0.0448,-0.52029 -0.0403,-1.00104 -0.17705,-1.49485 -0.062,-0.27425 -0.12259,-0.51056 -0.28298,-0.74209 -0.25202,-0.2397 -0.15182,-0.66931 -0.0225,-0.95691 1.66464,-2.24155 0.14447,-0.22623 8.20544,0.40213 0.062,0.005 0.0131,0.12561 0.0376,0.18275 0.006,0.0152 0.0381,9.1e-4 0.0474,0.015 0.0426,0.0627 0.0774,0.2496 0.0909,0.30765 0.10695,0.42518 -0.0254,0.89157 -0.12573,1.30975 -0.21715,0.63506 -0.254,1.30735 -0.35412,1.96563 -0.20822,1.10641 -0.26356,2.23241 -0.31647,3.35456 -0.0732,1.64076 -0.0886,3.28386 -0.11414,4.92599 -0.0766,2.09606 0.0759,4.18334 0.36792,6.25718 0.31358,2.08558 0.82601,4.13028 1.41469,6.15281 0.50368,1.63435 1.08231,3.24571 1.66069,4.85506 0.64848,1.78107 1.58847,3.41148 2.66705,4.96143 0.87484,1.32306 1.96302,2.4773 2.98156,3.68565 1.04858,1.28069 1.98577,2.64506 2.94607,3.99134 1.02873,1.37864 2.12483,2.70394 3.22131,4.0286 1.07131,1.2598 2.12411,2.53632 3.0741,3.89065 1.02052,1.5019 1.81704,3.1336 2.42803,4.8394 0.51154,1.43062 0.79387,2.90756 0.8976,4.41885 0.17587,1.91547 -0.0779,3.80692 -0.46303,5.6788 -0.34496,1.56656 -0.70822,3.12759 -1.12633,4.67616 0,0 -7.40386,-0.17992 -7.40386,-0.17992 v 0 c 0.34804,-1.54312 0.73081,-3.07933 1.01091,-4.63691 0.10717,-0.62204 0.2547,-1.40109 0.31355,-2.03458 0.10629,-1.14408 0.0218,-2.2933 -0.0584,-3.43559 -0.15572,-1.43349 -0.39898,-2.8507 -0.85804,-4.22265 -0.58353,-1.63406 -1.30374,-3.21811 -2.3415,-4.62066 -1.01841,-1.31923 -2.12637,-2.56118 -3.18261,-3.84959 -1.05321,-1.34124 -2.08041,-2.70164 -3.09573,-4.07172 -1.00277,-1.32888 -2.02678,-2.6407 -3.08704,-3.92442 -1.03607,-1.19232 -1.99801,-2.44117 -2.83483,-3.78372 -1.06386,-1.63183 -2.05051,-3.31314 -2.75004,-5.13866 -0.61694,-1.61128 -1.1464,-3.25542 -1.58571,-4.92424 -0.53283,-2.06398 -1.00838,-4.14495 -1.34294,-6.25119 -0.29561,-2.10838 -0.46658,-4.23213 -0.47287,-6.36237 -0.0244,-1.64923 -0.046,-3.29834 -0.0551,-4.94773 0.0111,-1.14715 0.0459,-2.29427 0.15915,-3.43654 0.0751,-0.68795 0.0907,-1.38387 0.24701,-2.06133 0.0703,-0.25783 0.14777,-0.57208 0.0704,-0.83284 -1.75553,-2.86111 9.02702,2.42502 7.83698,-0.12809 -0.0393,-0.14232 -0.14717,-1.11192 0.0316,-0.47824 0.11288,0.30179 0.18911,0.60982 0.24019,0.92789 0.12051,0.56807 0.10333,1.13523 0.0649,1.71271 -0.0483,0.90809 -0.10599,1.82477 -0.41311,2.68975 -0.46066,1.27054 -1.17248,2.44211 -1.94975,3.54301 -1.09732,1.49265 -2.21858,2.96661 -3.37643,4.41278 -1.01384,1.22611 -2.02479,2.47263 -3.30619,3.43468 -1.1259,0.88926 -2.26884,1.74548 -3.52848,2.44034 -3.28368,1.735 -7.0548,1.50063 -10.7844,0.84976 -0.99682,-0.21023 -1.95878,-0.55152 -2.88622,-0.97242 0,0 7.97548,-0.88663 7.97548,-0.88663 z"
         id="path88141"
         style="opacity:1;fill:#007d1c;fill-opacity:1;stroke:none;stroke-width:4.51227045;stroke-linecap:round;stroke-linejoin:miter;stroke-miterlimit:4;stroke-dasharray:none;stroke-dashoffset:0;stroke-opacity:1" />
    </g>
    <g
       style="stroke-width:0.90245414"
       transform="matrix(1.1080288,0,0,1.1081504,-13.042566,-11.182365)"
       id="g88193">
      <path
         style="opacity:1;fill:#bc3737;fill-opacity:0;stroke:#338ab2;stroke-width:4.51226997;stroke-linecap:round;stroke-linejoin:miter;stroke-miterlimit:4;stroke-dasharray:none;stroke-dashoffset:0;stroke-opacity:1"
         id="path83831"
         d="m 195.61457,-231.62282 a 56.829399,56.919601 0 0 1 -28.4147,49.29382 56.829399,56.919601 0 0 1 -56.8294,0 56.829399,56.919601 0 0 1 -28.414698,-49.29382"
         transform="scale(1,-1)" />
      <path
         style="fill:#bc3737;fill-opacity:0;stroke:#338ab2;stroke-width:4.51226997;stroke-linecap:butt;stroke-linejoin:miter;stroke-miterlimit:4;stroke-dasharray:none;stroke-opacity:1"
         d="m 81.955766,231.62281 v 46.32716"
         id="path83833" />
      <path
         id="path83835"
         d="m 195.61457,231.6228 v 46.32717"
         style="fill:#bc3737;fill-opacity:0;stroke:#338ab2;stroke-width:4.51226997;stroke-linecap:butt;stroke-linejoin:miter;stroke-miterlimit:4;stroke-dasharray:none;stroke-opacity:1" />
      <path
         transform="scale(1,-1)"
         d="m 147.15368,-172.83667 a 8.8062792,6.8541508 0 0 1 -4.40314,5.93587 8.8062792,6.8541508 0 0 1 -8.80628,0 8.8062792,6.8541508 0 0 1 -4.40314,-5.93587"
         id="path83630"
         style="opacity:1;fill:none;fill-opacity:1;stroke:#338ab2;stroke-width:4.51226997;stroke-linecap:round;stroke-linejoin:miter;stroke-miterlimit:4;stroke-dasharray:none;stroke-dashoffset:0;stroke-opacity:1" />
    </g>
  </g>
</svg>
