Flattening unmatched subcell minvaractor in circuit twovaract (1)(2 instances)
Flattening unmatched subcell minvaractor in circuit onebit (1)(1 instance)
Flattening unmatched subcell onebitp in circuit onebit (1)(1 instance)
Flattening unmatched subcell twovaract in circuit twobits (1)(1 instance)
Flattening unmatched subcell onebit in circuit twobits (1)(2 instances)
Flattening unmatched subcell pmos_7x5ux150nm in circuit diffpairandbias (1)(2 instances)
Flattening unmatched subcell twobits in circuit fourbits (1)(2 instances)
Flattening unmatched subcell pmos_7x5ux150nm in circuit FGbiaspair (1)(2 instances)
Flattening unmatched subcell twovaract in circuit FGbiaspair (1)(1 instance)
Flattening unmatched subcell pmirror_1e5ux150nm in circuit dopamp (1)(1 instance)
Flattening unmatched subcell cascbiasnblock in circuit dopamp (1)(1 instance)
Flattening unmatched subcell diffpairandbias in circuit dopamp (1)(1 instance)
Flattening unmatched subcell nmirror_1e5ux150nm in circuit dopamp (1)(2 instances)
Flattening unmatched subcell cascbiaspblock in circuit dopamp (1)(1 instance)
Flattening unmatched subcell pcasc_4x5ux400nm in circuit dopamp (1)(1 instance)
Flattening unmatched subcell ncasc_4x5ux400nm in circuit dopamp (1)(1 instance)
Flattening unmatched subcell fourbits in circuit allbits (1)(3 instances)
Flattening unmatched subcell pmirror_1e5ux150nm in circuit fopamp (1)(1 instance)
Flattening unmatched subcell nmirror_1e5ux150nm in circuit fopamp (1)(2 instances)
Flattening unmatched subcell FGbiaspair in circuit fopamp (1)(1 instance)
Flattening unmatched subcell dopamp in circuit DAClvs.spice (1)(1 instance)
Flattening unmatched subcell allbits in circuit DAClvs.spice (1)(1 instance)
Flattening unmatched subcell fopamp in circuit DAClvs.spice (1)(1 instance)
Equate elements:  no current cell.
Equate elements:  no current cell.
Equate elements:  no current cell.
Class DAClvs.spice:  Merged 24 devices.

Subcircuit summary:
Circuit 1: DACxlvs.spice                   |Circuit 2: DAClvs.spice                    
-------------------------------------------|-------------------------------------------
sky130_fd_pr__nfet_01v8 (23)               |sky130_fd_pr__nfet_01v8 (23)               
sky130_fd_pr__pfet_01v8 (74)               |sky130_fd_pr__pfet_01v8 (74)               
sky130_fd_pr__cap_var (26)                 |sky130_fd_pr__cap_var (26)                 
Number of devices: 123                     |Number of devices: 123                     
Number of nets: 86                         |Number of nets: 86                         
---------------------------------------------------------------------------------------
Resolving automorphisms by property value.
Resolving automorphisms by pin name.
Netlists match with 15 symmetries.
Circuits match correctly.
There were property errors.
sky130_fd_pr__cap_varC3 vs. allbits_0//fourbits_2//twobits_0//twovaract_0//minvaractor_0/sky130_fd_pr__cap_var0:
Property VM in circuit1 has no matching property in circuit2
sky130_fd_pr__cap_varC4 vs. allbits_0//fourbits_2//twobits_0//twovaract_0//minvaractor_1/sky130_fd_pr__cap_var0:
Property VM in circuit1 has no matching property in circuit2
sky130_fd_pr__cap_varC7 vs. allbits_0//fourbits_2//twobits_1//twovaract_0//minvaractor_0/sky130_fd_pr__cap_var0:
Property VM in circuit1 has no matching property in circuit2
sky130_fd_pr__cap_varC8 vs. allbits_0//fourbits_2//twobits_1//twovaract_0//minvaractor_1/sky130_fd_pr__cap_var0:
Property VM in circuit1 has no matching property in circuit2
sky130_fd_pr__cap_varC11 vs. allbits_0//fourbits_0//twobits_0//twovaract_0//minvaractor_0/sky130_fd_pr__cap_var0:
Property VM in circuit1 has no matching property in circuit2
sky130_fd_pr__cap_varC12 vs. allbits_0//fourbits_0//twobits_0//twovaract_0//minvaractor_1/sky130_fd_pr__cap_var0:
Property VM in circuit1 has no matching property in circuit2
sky130_fd_pr__cap_varC15 vs. allbits_0//fourbits_0//twobits_1//twovaract_0//minvaractor_0/sky130_fd_pr__cap_var0:
Property VM in circuit1 has no matching property in circuit2
sky130_fd_pr__cap_varC16 vs. allbits_0//fourbits_0//twobits_1//twovaract_0//minvaractor_1/sky130_fd_pr__cap_var0:
Property VM in circuit1 has no matching property in circuit2
sky130_fd_pr__cap_varC19 vs. allbits_0//fourbits_1//twobits_0//twovaract_0//minvaractor_0/sky130_fd_pr__cap_var0:
Property VM in circuit1 has no matching property in circuit2
sky130_fd_pr__cap_varC20 vs. allbits_0//fourbits_1//twobits_0//twovaract_0//minvaractor_1/sky130_fd_pr__cap_var0:
Property VM in circuit1 has no matching property in circuit2
sky130_fd_pr__cap_varC23 vs. allbits_0//fourbits_1//twobits_1//twovaract_0//minvaractor_0/sky130_fd_pr__cap_var0:
Property VM in circuit1 has no matching property in circuit2
sky130_fd_pr__cap_varC24 vs. allbits_0//fourbits_1//twobits_1//twovaract_0//minvaractor_1/sky130_fd_pr__cap_var0:
Property VM in circuit1 has no matching property in circuit2
sky130_fd_pr__cap_varC5 vs. allbits_0//fourbits_2//twobits_0//onebit_1//minvaractor_0/sky130_fd_pr__cap_var0:
Property VM in circuit1 has no matching property in circuit2
sky130_fd_pr__cap_varC6 vs. allbits_0//fourbits_2//twobits_0//onebit_0//minvaractor_0/sky130_fd_pr__cap_var0:
Property VM in circuit1 has no matching property in circuit2
sky130_fd_pr__cap_varC9 vs. allbits_0//fourbits_2//twobits_1//onebit_1//minvaractor_0/sky130_fd_pr__cap_var0:
Property VM in circuit1 has no matching property in circuit2
sky130_fd_pr__cap_varC10 vs. allbits_0//fourbits_2//twobits_1//onebit_0//minvaractor_0/sky130_fd_pr__cap_var0:
Property VM in circuit1 has no matching property in circuit2
sky130_fd_pr__cap_varC13 vs. allbits_0//fourbits_0//twobits_0//onebit_1//minvaractor_0/sky130_fd_pr__cap_var0:
Property VM in circuit1 has no matching property in circuit2
sky130_fd_pr__cap_varC14 vs. allbits_0//fourbits_0//twobits_0//onebit_0//minvaractor_0/sky130_fd_pr__cap_var0:
Property VM in circuit1 has no matching property in circuit2
sky130_fd_pr__cap_varC17 vs. allbits_0//fourbits_0//twobits_1//onebit_1//minvaractor_0/sky130_fd_pr__cap_var0:
Property VM in circuit1 has no matching property in circuit2
sky130_fd_pr__cap_varC18 vs. allbits_0//fourbits_0//twobits_1//onebit_0//minvaractor_0/sky130_fd_pr__cap_var0:
Property VM in circuit1 has no matching property in circuit2
sky130_fd_pr__cap_varC21 vs. allbits_0//fourbits_1//twobits_0//onebit_1//minvaractor_0/sky130_fd_pr__cap_var0:
Property VM in circuit1 has no matching property in circuit2
sky130_fd_pr__cap_varC22 vs. allbits_0//fourbits_1//twobits_0//onebit_0//minvaractor_0/sky130_fd_pr__cap_var0:
Property VM in circuit1 has no matching property in circuit2
sky130_fd_pr__cap_varC26 vs. allbits_0//fourbits_1//twobits_1//onebit_0//minvaractor_0/sky130_fd_pr__cap_var0:
Property VM in circuit1 has no matching property in circuit2
sky130_fd_pr__cap_varC25 vs. allbits_0//fourbits_1//twobits_1//onebit_1//minvaractor_0/sky130_fd_pr__cap_var0:
Property VM in circuit1 has no matching property in circuit2
sky130_fd_pr__cap_varC1 vs. fopamp_0//FGbiaspair_0//twovaract_0//minvaractor_0/sky130_fd_pr__cap_var0:
Property VM in circuit1 has no matching property in circuit2
sky130_fd_pr__cap_varC2 vs. fopamp_0//FGbiaspair_0//twovaract_0//minvaractor_1/sky130_fd_pr__cap_var0:
Property VM in circuit1 has no matching property in circuit2
Cells have no pins;  pin matching not needed.
Device classes DACxlvs.spice and DAClvs.spice are equivalent.
Circuits match uniquely.
Property errors were found.
The following cells had property errors: DACxlvs.spice
