v {xschem version=2.9.9 file_version=1.2 }
G {}
K {}
V {}
S {}
E {}
N -450 -220 -450 -200 { lab=#net2}
N -380 -40 -380 -20 { lab=#net4}
N -450 -40 -450 -20 { lab=#net5}
N -500 -40 -500 -20 { lab=#net6}
N 18970 -220 18970 -180 { lab=#net7}
N 19030 -220 19030 -180 { lab=#net8}
N 19070 -220 19070 -180 { lab=#net9}
N 19150 -220 19150 -180 { lab=#net10}
N 19190 -220 19190 -180 { lab=#net11}
N 19230 -230 19230 -150 { lab=#net12}
N 19230 -230 19270 -230 { lab=#net12}
N 19230 -130 19250 -130 { lab=#net13}
N 19250 -210 19250 -130 { lab=#net13}
N 19250 -210 19270 -210 { lab=#net13}
N 19260 -190 19270 -190 { lab=#net14}
N 19260 -190 19260 -110 { lab=#net14}
N 19230 -110 19260 -110 { lab=#net14}
N 19230 -90 19270 -90 { lab=#net15}
N 19270 -170 19270 -90 { lab=#net15}
N 19620 -230 19620 -210 { lab=#net16}
N 19570 -230 19620 -230 { lab=#net16}
N 19570 -210 19600 -210 { lab=#net17}
N 19600 -210 19600 -190 { lab=#net17}
N 19600 -190 19620 -190 { lab=#net17}
N 19570 -190 19590 -190 { lab=#net18}
N 19590 -190 19590 -180 { lab=#net18}
N 19590 -180 19610 -180 { lab=#net18}
N 19610 -180 19610 -170 { lab=#net18}
N 19610 -170 19620 -170 { lab=#net18}
N 19570 -170 19600 -170 { lab=#net19}
N 19600 -170 19600 -160 { lab=#net19}
N 19600 -160 19620 -160 { lab=#net19}
N 19620 -160 19620 -150 { lab=#net19}
N 19610 -130 19620 -130 { lab=#net20}
N 19610 -150 19610 -130 { lab=#net20}
N 19570 -150 19610 -150 { lab=#net20}
N 19570 -130 19600 -130 { lab=#net21}
N 19600 -130 19600 -110 { lab=#net21}
N 19600 -110 19620 -110 { lab=#net21}
N 19570 -110 19590 -110 { lab=#net22}
N 19590 -110 19590 -90 { lab=#net22}
N 19590 -90 19620 -90 { lab=#net22}
N 19570 -70 19620 -70 { lab=#net23}
N 19570 -90 19570 -70 { lab=#net23}
N 19650 -300 19650 -260 { lab=#net24}
N 19670 -300 19670 -260 { lab=#net25}
N 19690 -300 19690 -260 { lab=#net26}
N 19720 -300 19720 -260 { lab=#net27}
N 19750 -300 19750 -260 { lab=#net28}
N 19800 -300 19800 -270 { lab=#net29}
N 19800 -270 19800 -260 { lab=#net29}
N 19870 -300 19870 -260 { lab=#net30}
N 19190 -300 19190 -220 { lab=#net11}
N 19150 -300 19150 -220 { lab=#net10}
N 19110 -300 19110 -210 { lab=#net31}
N 19070 -300 19070 -220 { lab=#net9}
N 19030 -300 19030 -220 { lab=#net8}
N 18970 -300 18970 -220 { lab=#net7}
N 19110 -210 19110 -180 { lab=#net31}
N 18670 -220 18670 -180 { lab=#net32}
N 18730 -220 18730 -180 { lab=#net33}
N 18770 -220 18770 -180 { lab=#net34}
N 18850 -220 18850 -180 { lab=#net35}
N 18890 -220 18890 -180 { lab=#net36}
N 18890 -300 18890 -220 { lab=#net36}
N 18850 -300 18850 -220 { lab=#net35}
N 18810 -300 18810 -210 { lab=#net37}
N 18770 -300 18770 -220 { lab=#net34}
N 18730 -300 18730 -220 { lab=#net33}
N 18670 -300 18670 -220 { lab=#net32}
N 18810 -210 18810 -180 { lab=#net37}
N 18370 -220 18370 -180 { lab=#net38}
N 18430 -220 18430 -180 { lab=#net39}
N 18470 -220 18470 -180 { lab=#net40}
N 18550 -220 18550 -180 { lab=#net41}
N 18590 -220 18590 -180 { lab=#net42}
N 18590 -300 18590 -220 { lab=#net42}
N 18550 -300 18550 -220 { lab=#net41}
N 18510 -300 18510 -210 { lab=#net43}
N 18470 -300 18470 -220 { lab=#net40}
N 18430 -300 18430 -220 { lab=#net39}
N 18370 -300 18370 -220 { lab=#net38}
N 18510 -210 18510 -180 { lab=#net43}
N 18070 -220 18070 -180 { lab=#net44}
N 18130 -220 18130 -180 { lab=#net45}
N 18170 -220 18170 -180 { lab=#net46}
N 18250 -220 18250 -180 { lab=#net47}
N 18290 -220 18290 -180 { lab=#net48}
N 18290 -300 18290 -220 { lab=#net48}
N 18250 -300 18250 -220 { lab=#net47}
N 18210 -300 18210 -210 { lab=#net49}
N 18170 -300 18170 -220 { lab=#net46}
N 18130 -300 18130 -220 { lab=#net45}
N 18070 -300 18070 -220 { lab=#net44}
N 18210 -210 18210 -180 { lab=#net49}
N 17770 -220 17770 -180 { lab=#net50}
N 17830 -220 17830 -180 { lab=#net51}
N 17870 -220 17870 -180 { lab=#net52}
N 17950 -220 17950 -180 { lab=#net53}
N 17990 -220 17990 -180 { lab=#net54}
N 17990 -300 17990 -220 { lab=#net54}
N 17950 -300 17950 -220 { lab=#net53}
N 17910 -300 17910 -210 { lab=#net55}
N 17870 -300 17870 -220 { lab=#net52}
N 17830 -300 17830 -220 { lab=#net51}
N 17770 -300 17770 -220 { lab=#net50}
N 17910 -210 17910 -180 { lab=#net55}
N 17470 -220 17470 -180 { lab=#net56}
N 17530 -220 17530 -180 { lab=#net57}
N 17570 -220 17570 -180 { lab=#net58}
N 17650 -220 17650 -180 { lab=#net59}
N 17690 -220 17690 -180 { lab=#net60}
N 17690 -300 17690 -220 { lab=#net60}
N 17650 -300 17650 -220 { lab=#net59}
N 17610 -300 17610 -210 { lab=#net61}
N 17570 -300 17570 -220 { lab=#net58}
N 17530 -300 17530 -220 { lab=#net57}
N 17470 -300 17470 -220 { lab=#net56}
N 17610 -210 17610 -180 { lab=#net61}
N 17170 -220 17170 -180 { lab=#net62}
N 17230 -220 17230 -180 { lab=#net63}
N 17270 -220 17270 -180 { lab=#net64}
N 17350 -220 17350 -180 { lab=#net65}
N 17390 -220 17390 -180 { lab=#net66}
N 17390 -300 17390 -220 { lab=#net66}
N 17350 -300 17350 -220 { lab=#net65}
N 17310 -300 17310 -210 { lab=#net67}
N 17270 -300 17270 -220 { lab=#net64}
N 17230 -300 17230 -220 { lab=#net63}
N 17170 -300 17170 -220 { lab=#net62}
N 17310 -210 17310 -180 { lab=#net67}
N 16870 -220 16870 -180 { lab=#net68}
N 16930 -220 16930 -180 { lab=#net69}
N 16970 -220 16970 -180 { lab=#net70}
N 17050 -220 17050 -180 { lab=#net71}
N 17090 -220 17090 -180 { lab=#net72}
N 17090 -300 17090 -220 { lab=#net72}
N 17050 -300 17050 -220 { lab=#net71}
N 17010 -300 17010 -210 { lab=#net73}
N 16970 -300 16970 -220 { lab=#net70}
N 16930 -300 16930 -220 { lab=#net69}
N 16870 -300 16870 -220 { lab=#net68}
N 17010 -210 17010 -180 { lab=#net73}
N 16570 -220 16570 -180 { lab=#net7}
N 16630 -220 16630 -180 { lab=#net8}
N 16670 -220 16670 -180 { lab=#net9}
N 16750 -220 16750 -180 { lab=#net10}
N 16790 -220 16790 -180 { lab=#net11}
N 16790 -300 16790 -220 { lab=#net11}
N 16750 -300 16750 -220 { lab=#net10}
N 16710 -300 16710 -210 { lab=#net31}
N 16670 -300 16670 -220 { lab=#net9}
N 16630 -300 16630 -220 { lab=#net8}
N 16570 -300 16570 -220 { lab=#net7}
N 16710 -210 16710 -180 { lab=#net31}
N 16270 -220 16270 -180 { lab=#net32}
N 16330 -220 16330 -180 { lab=#net33}
N 16370 -220 16370 -180 { lab=#net34}
N 16450 -220 16450 -180 { lab=#net35}
N 16490 -220 16490 -180 { lab=#net36}
N 16490 -300 16490 -220 { lab=#net36}
N 16450 -300 16450 -220 { lab=#net35}
N 16410 -300 16410 -210 { lab=#net37}
N 16370 -300 16370 -220 { lab=#net34}
N 16330 -300 16330 -220 { lab=#net33}
N 16270 -300 16270 -220 { lab=#net32}
N 16410 -210 16410 -180 { lab=#net37}
N 15970 -220 15970 -180 { lab=#net38}
N 16030 -220 16030 -180 { lab=#net39}
N 16070 -220 16070 -180 { lab=#net40}
N 16150 -220 16150 -180 { lab=#net41}
N 16190 -220 16190 -180 { lab=#net42}
N 16190 -300 16190 -220 { lab=#net42}
N 16150 -300 16150 -220 { lab=#net41}
N 16110 -300 16110 -210 { lab=#net43}
N 16070 -300 16070 -220 { lab=#net40}
N 16030 -300 16030 -220 { lab=#net39}
N 15970 -300 15970 -220 { lab=#net38}
N 16110 -210 16110 -180 { lab=#net43}
N 15670 -220 15670 -180 { lab=#net44}
N 15730 -220 15730 -180 { lab=#net45}
N 15770 -220 15770 -180 { lab=#net46}
N 15850 -220 15850 -180 { lab=#net47}
N 15890 -220 15890 -180 { lab=#net48}
N 15890 -300 15890 -220 { lab=#net48}
N 15850 -300 15850 -220 { lab=#net47}
N 15810 -300 15810 -210 { lab=#net49}
N 15770 -300 15770 -220 { lab=#net46}
N 15730 -300 15730 -220 { lab=#net45}
N 15670 -300 15670 -220 { lab=#net44}
N 15810 -210 15810 -180 { lab=#net49}
N 15370 -220 15370 -180 { lab=#net50}
N 15430 -220 15430 -180 { lab=#net51}
N 15470 -220 15470 -180 { lab=#net52}
N 15550 -220 15550 -180 { lab=#net53}
N 15590 -220 15590 -180 { lab=#net54}
N 15590 -300 15590 -220 { lab=#net54}
N 15550 -300 15550 -220 { lab=#net53}
N 15510 -300 15510 -210 { lab=#net55}
N 15470 -300 15470 -220 { lab=#net52}
N 15430 -300 15430 -220 { lab=#net51}
N 15370 -300 15370 -220 { lab=#net50}
N 15510 -210 15510 -180 { lab=#net55}
N 15070 -220 15070 -180 { lab=#net56}
N 15130 -220 15130 -180 { lab=#net57}
N 15170 -220 15170 -180 { lab=#net58}
N 15250 -220 15250 -180 { lab=#net59}
N 15290 -220 15290 -180 { lab=#net60}
N 15290 -300 15290 -220 { lab=#net60}
N 15250 -300 15250 -220 { lab=#net59}
N 15210 -300 15210 -210 { lab=#net61}
N 15170 -300 15170 -220 { lab=#net58}
N 15130 -300 15130 -220 { lab=#net57}
N 15070 -300 15070 -220 { lab=#net56}
N 15210 -210 15210 -180 { lab=#net61}
N 14770 -220 14770 -180 { lab=#net62}
N 14830 -220 14830 -180 { lab=#net63}
N 14870 -220 14870 -180 { lab=#net64}
N 14950 -220 14950 -180 { lab=#net65}
N 14990 -220 14990 -180 { lab=#net66}
N 14990 -300 14990 -220 { lab=#net66}
N 14950 -300 14950 -220 { lab=#net65}
N 14910 -300 14910 -210 { lab=#net67}
N 14870 -300 14870 -220 { lab=#net64}
N 14830 -300 14830 -220 { lab=#net63}
N 14770 -300 14770 -220 { lab=#net62}
N 14910 -210 14910 -180 { lab=#net67}
N 14470 -220 14470 -180 { lab=#net68}
N 14530 -220 14530 -180 { lab=#net69}
N 14570 -220 14570 -180 { lab=#net70}
N 14650 -220 14650 -180 { lab=#net71}
N 14690 -220 14690 -180 { lab=#net72}
N 14690 -300 14690 -220 { lab=#net72}
N 14650 -300 14650 -220 { lab=#net71}
N 14610 -300 14610 -210 { lab=#net73}
N 14570 -300 14570 -220 { lab=#net70}
N 14530 -300 14530 -220 { lab=#net69}
N 14470 -300 14470 -220 { lab=#net68}
N 14610 -210 14610 -180 { lab=#net73}
N 14170 -220 14170 -180 { lab=#net7}
N 14230 -220 14230 -180 { lab=#net8}
N 14270 -220 14270 -180 { lab=#net9}
N 14350 -220 14350 -180 { lab=#net10}
N 14390 -220 14390 -180 { lab=#net11}
N 14390 -300 14390 -220 { lab=#net11}
N 14350 -300 14350 -220 { lab=#net10}
N 14310 -300 14310 -210 { lab=#net31}
N 14270 -300 14270 -220 { lab=#net9}
N 14230 -300 14230 -220 { lab=#net8}
N 14170 -300 14170 -220 { lab=#net7}
N 14310 -210 14310 -180 { lab=#net31}
N 13870 -220 13870 -180 { lab=#net32}
N 13930 -220 13930 -180 { lab=#net33}
N 13970 -220 13970 -180 { lab=#net34}
N 14050 -220 14050 -180 { lab=#net35}
N 14090 -220 14090 -180 { lab=#net36}
N 14090 -300 14090 -220 { lab=#net36}
N 14050 -300 14050 -220 { lab=#net35}
N 14010 -300 14010 -210 { lab=#net37}
N 13970 -300 13970 -220 { lab=#net34}
N 13930 -300 13930 -220 { lab=#net33}
N 13870 -300 13870 -220 { lab=#net32}
N 14010 -210 14010 -180 { lab=#net37}
N 13570 -220 13570 -180 { lab=#net38}
N 13630 -220 13630 -180 { lab=#net39}
N 13670 -220 13670 -180 { lab=#net40}
N 13750 -220 13750 -180 { lab=#net41}
N 13790 -220 13790 -180 { lab=#net42}
N 13790 -300 13790 -220 { lab=#net42}
N 13750 -300 13750 -220 { lab=#net41}
N 13710 -300 13710 -210 { lab=#net43}
N 13670 -300 13670 -220 { lab=#net40}
N 13630 -300 13630 -220 { lab=#net39}
N 13570 -300 13570 -220 { lab=#net38}
N 13710 -210 13710 -180 { lab=#net43}
N 13270 -220 13270 -180 { lab=#net44}
N 13330 -220 13330 -180 { lab=#net45}
N 13370 -220 13370 -180 { lab=#net46}
N 13450 -220 13450 -180 { lab=#net47}
N 13490 -220 13490 -180 { lab=#net48}
N 13490 -300 13490 -220 { lab=#net48}
N 13450 -300 13450 -220 { lab=#net47}
N 13410 -300 13410 -210 { lab=#net49}
N 13370 -300 13370 -220 { lab=#net46}
N 13330 -300 13330 -220 { lab=#net45}
N 13270 -300 13270 -220 { lab=#net44}
N 13410 -210 13410 -180 { lab=#net49}
N 12970 -220 12970 -180 { lab=#net50}
N 13030 -220 13030 -180 { lab=#net51}
N 13070 -220 13070 -180 { lab=#net52}
N 13150 -220 13150 -180 { lab=#net53}
N 13190 -220 13190 -180 { lab=#net54}
N 13190 -300 13190 -220 { lab=#net54}
N 13150 -300 13150 -220 { lab=#net53}
N 13110 -300 13110 -210 { lab=#net55}
N 13070 -300 13070 -220 { lab=#net52}
N 13030 -300 13030 -220 { lab=#net51}
N 12970 -300 12970 -220 { lab=#net50}
N 13110 -210 13110 -180 { lab=#net55}
N 12670 -220 12670 -180 { lab=#net56}
N 12730 -220 12730 -180 { lab=#net57}
N 12770 -220 12770 -180 { lab=#net58}
N 12850 -220 12850 -180 { lab=#net59}
N 12890 -220 12890 -180 { lab=#net60}
N 12890 -300 12890 -220 { lab=#net60}
N 12850 -300 12850 -220 { lab=#net59}
N 12810 -300 12810 -210 { lab=#net61}
N 12770 -300 12770 -220 { lab=#net58}
N 12730 -300 12730 -220 { lab=#net57}
N 12670 -300 12670 -220 { lab=#net56}
N 12810 -210 12810 -180 { lab=#net61}
N 12370 -220 12370 -180 { lab=#net62}
N 12430 -220 12430 -180 { lab=#net63}
N 12470 -220 12470 -180 { lab=#net64}
N 12550 -220 12550 -180 { lab=#net65}
N 12590 -220 12590 -180 { lab=#net66}
N 12590 -300 12590 -220 { lab=#net66}
N 12550 -300 12550 -220 { lab=#net65}
N 12510 -300 12510 -210 { lab=#net67}
N 12470 -300 12470 -220 { lab=#net64}
N 12430 -300 12430 -220 { lab=#net63}
N 12370 -300 12370 -220 { lab=#net62}
N 12510 -210 12510 -180 { lab=#net67}
N 12070 -220 12070 -180 { lab=#net68}
N 12130 -220 12130 -180 { lab=#net69}
N 12170 -220 12170 -180 { lab=#net70}
N 12250 -220 12250 -180 { lab=#net71}
N 12290 -220 12290 -180 { lab=#net72}
N 12290 -300 12290 -220 { lab=#net72}
N 12250 -300 12250 -220 { lab=#net71}
N 12210 -300 12210 -210 { lab=#net73}
N 12170 -300 12170 -220 { lab=#net70}
N 12130 -300 12130 -220 { lab=#net69}
N 12070 -300 12070 -220 { lab=#net68}
N 12210 -210 12210 -180 { lab=#net73}
N 11770 -220 11770 -180 { lab=#net7}
N 11830 -220 11830 -180 { lab=#net8}
N 11870 -220 11870 -180 { lab=#net9}
N 11950 -220 11950 -180 { lab=#net10}
N 11990 -220 11990 -180 { lab=#net11}
N 11990 -300 11990 -220 { lab=#net11}
N 11950 -300 11950 -220 { lab=#net10}
N 11910 -300 11910 -210 { lab=#net31}
N 11870 -300 11870 -220 { lab=#net9}
N 11830 -300 11830 -220 { lab=#net8}
N 11770 -300 11770 -220 { lab=#net7}
N 11910 -210 11910 -180 { lab=#net31}
N 11470 -220 11470 -180 { lab=#net32}
N 11530 -220 11530 -180 { lab=#net33}
N 11570 -220 11570 -180 { lab=#net34}
N 11650 -220 11650 -180 { lab=#net35}
N 11690 -220 11690 -180 { lab=#net36}
N 11690 -300 11690 -220 { lab=#net36}
N 11650 -300 11650 -220 { lab=#net35}
N 11610 -300 11610 -210 { lab=#net37}
N 11570 -300 11570 -220 { lab=#net34}
N 11530 -300 11530 -220 { lab=#net33}
N 11470 -300 11470 -220 { lab=#net32}
N 11610 -210 11610 -180 { lab=#net37}
N 11170 -220 11170 -180 { lab=#net38}
N 11230 -220 11230 -180 { lab=#net39}
N 11270 -220 11270 -180 { lab=#net40}
N 11350 -220 11350 -180 { lab=#net41}
N 11390 -220 11390 -180 { lab=#net42}
N 11390 -300 11390 -220 { lab=#net42}
N 11350 -300 11350 -220 { lab=#net41}
N 11310 -300 11310 -210 { lab=#net43}
N 11270 -300 11270 -220 { lab=#net40}
N 11230 -300 11230 -220 { lab=#net39}
N 11170 -300 11170 -220 { lab=#net38}
N 11310 -210 11310 -180 { lab=#net43}
N 10870 -220 10870 -180 { lab=#net44}
N 10930 -220 10930 -180 { lab=#net45}
N 10970 -220 10970 -180 { lab=#net46}
N 11050 -220 11050 -180 { lab=#net47}
N 11090 -220 11090 -180 { lab=#net48}
N 11090 -300 11090 -220 { lab=#net48}
N 11050 -300 11050 -220 { lab=#net47}
N 11010 -300 11010 -210 { lab=#net49}
N 10970 -300 10970 -220 { lab=#net46}
N 10930 -300 10930 -220 { lab=#net45}
N 10870 -300 10870 -220 { lab=#net44}
N 11010 -210 11010 -180 { lab=#net49}
N 10570 -220 10570 -180 { lab=#net50}
N 10630 -220 10630 -180 { lab=#net51}
N 10670 -220 10670 -180 { lab=#net52}
N 10750 -220 10750 -180 { lab=#net53}
N 10790 -220 10790 -180 { lab=#net54}
N 10790 -300 10790 -220 { lab=#net54}
N 10750 -300 10750 -220 { lab=#net53}
N 10710 -300 10710 -210 { lab=#net55}
N 10670 -300 10670 -220 { lab=#net52}
N 10630 -300 10630 -220 { lab=#net51}
N 10570 -300 10570 -220 { lab=#net50}
N 10710 -210 10710 -180 { lab=#net55}
N 10270 -220 10270 -180 { lab=#net56}
N 10330 -220 10330 -180 { lab=#net57}
N 10370 -220 10370 -180 { lab=#net58}
N 10450 -220 10450 -180 { lab=#net59}
N 10490 -220 10490 -180 { lab=#net60}
N 10490 -300 10490 -220 { lab=#net60}
N 10450 -300 10450 -220 { lab=#net59}
N 10410 -300 10410 -210 { lab=#net61}
N 10370 -300 10370 -220 { lab=#net58}
N 10330 -300 10330 -220 { lab=#net57}
N 10270 -300 10270 -220 { lab=#net56}
N 10410 -210 10410 -180 { lab=#net61}
N 9970 -220 9970 -180 { lab=#net62}
N 10030 -220 10030 -180 { lab=#net63}
N 10070 -220 10070 -180 { lab=#net64}
N 10150 -220 10150 -180 { lab=#net65}
N 10190 -220 10190 -180 { lab=#net66}
N 10190 -300 10190 -220 { lab=#net66}
N 10150 -300 10150 -220 { lab=#net65}
N 10110 -300 10110 -210 { lab=#net67}
N 10070 -300 10070 -220 { lab=#net64}
N 10030 -300 10030 -220 { lab=#net63}
N 9970 -300 9970 -220 { lab=#net62}
N 10110 -210 10110 -180 { lab=#net67}
N 9670 -220 9670 -180 { lab=#net68}
N 9730 -220 9730 -180 { lab=#net69}
N 9770 -220 9770 -180 { lab=#net70}
N 9850 -220 9850 -180 { lab=#net71}
N 9890 -220 9890 -180 { lab=#net72}
N 9890 -300 9890 -220 { lab=#net72}
N 9850 -300 9850 -220 { lab=#net71}
N 9810 -300 9810 -210 { lab=#net73}
N 9770 -300 9770 -220 { lab=#net70}
N 9730 -300 9730 -220 { lab=#net69}
N 9670 -300 9670 -220 { lab=#net68}
N 9810 -210 9810 -180 { lab=#net73}
N 9370 -220 9370 -180 { lab=#net7}
N 9430 -220 9430 -180 { lab=#net8}
N 9470 -220 9470 -180 { lab=#net9}
N 9550 -220 9550 -180 { lab=#net10}
N 9590 -220 9590 -180 { lab=#net11}
N 9590 -300 9590 -220 { lab=#net11}
N 9550 -300 9550 -220 { lab=#net10}
N 9510 -300 9510 -210 { lab=#net31}
N 9470 -300 9470 -220 { lab=#net9}
N 9430 -300 9430 -220 { lab=#net8}
N 9370 -300 9370 -220 { lab=#net7}
N 9510 -210 9510 -180 { lab=#net31}
N 9070 -220 9070 -180 { lab=#net32}
N 9130 -220 9130 -180 { lab=#net33}
N 9170 -220 9170 -180 { lab=#net34}
N 9250 -220 9250 -180 { lab=#net35}
N 9290 -220 9290 -180 { lab=#net36}
N 9290 -300 9290 -220 { lab=#net36}
N 9250 -300 9250 -220 { lab=#net35}
N 9210 -300 9210 -210 { lab=#net37}
N 9170 -300 9170 -220 { lab=#net34}
N 9130 -300 9130 -220 { lab=#net33}
N 9070 -300 9070 -220 { lab=#net32}
N 9210 -210 9210 -180 { lab=#net37}
N 8770 -220 8770 -180 { lab=#net38}
N 8830 -220 8830 -180 { lab=#net39}
N 8870 -220 8870 -180 { lab=#net40}
N 8950 -220 8950 -180 { lab=#net41}
N 8990 -220 8990 -180 { lab=#net42}
N 8990 -300 8990 -220 { lab=#net42}
N 8950 -300 8950 -220 { lab=#net41}
N 8910 -300 8910 -210 { lab=#net43}
N 8870 -300 8870 -220 { lab=#net40}
N 8830 -300 8830 -220 { lab=#net39}
N 8770 -300 8770 -220 { lab=#net38}
N 8910 -210 8910 -180 { lab=#net43}
N 8470 -220 8470 -180 { lab=#net44}
N 8530 -220 8530 -180 { lab=#net45}
N 8570 -220 8570 -180 { lab=#net46}
N 8650 -220 8650 -180 { lab=#net47}
N 8690 -220 8690 -180 { lab=#net48}
N 8690 -300 8690 -220 { lab=#net48}
N 8650 -300 8650 -220 { lab=#net47}
N 8610 -300 8610 -210 { lab=#net49}
N 8570 -300 8570 -220 { lab=#net46}
N 8530 -300 8530 -220 { lab=#net45}
N 8470 -300 8470 -220 { lab=#net44}
N 8610 -210 8610 -180 { lab=#net49}
N 8170 -220 8170 -180 { lab=#net50}
N 8230 -220 8230 -180 { lab=#net51}
N 8270 -220 8270 -180 { lab=#net52}
N 8350 -220 8350 -180 { lab=#net53}
N 8390 -220 8390 -180 { lab=#net54}
N 8390 -300 8390 -220 { lab=#net54}
N 8350 -300 8350 -220 { lab=#net53}
N 8310 -300 8310 -210 { lab=#net55}
N 8270 -300 8270 -220 { lab=#net52}
N 8230 -300 8230 -220 { lab=#net51}
N 8170 -300 8170 -220 { lab=#net50}
N 8310 -210 8310 -180 { lab=#net55}
N 7870 -220 7870 -180 { lab=#net56}
N 7930 -220 7930 -180 { lab=#net57}
N 7970 -220 7970 -180 { lab=#net58}
N 8050 -220 8050 -180 { lab=#net59}
N 8090 -220 8090 -180 { lab=#net60}
N 8090 -300 8090 -220 { lab=#net60}
N 8050 -300 8050 -220 { lab=#net59}
N 8010 -300 8010 -210 { lab=#net61}
N 7970 -300 7970 -220 { lab=#net58}
N 7930 -300 7930 -220 { lab=#net57}
N 7870 -300 7870 -220 { lab=#net56}
N 8010 -210 8010 -180 { lab=#net61}
N 7570 -220 7570 -180 { lab=#net62}
N 7630 -220 7630 -180 { lab=#net63}
N 7670 -220 7670 -180 { lab=#net64}
N 7750 -220 7750 -180 { lab=#net65}
N 7790 -220 7790 -180 { lab=#net66}
N 7790 -300 7790 -220 { lab=#net66}
N 7750 -300 7750 -220 { lab=#net65}
N 7710 -300 7710 -210 { lab=#net67}
N 7670 -300 7670 -220 { lab=#net64}
N 7630 -300 7630 -220 { lab=#net63}
N 7570 -300 7570 -220 { lab=#net62}
N 7710 -210 7710 -180 { lab=#net67}
N 7270 -220 7270 -180 { lab=#net68}
N 7330 -220 7330 -180 { lab=#net69}
N 7370 -220 7370 -180 { lab=#net70}
N 7450 -220 7450 -180 { lab=#net71}
N 7490 -220 7490 -180 { lab=#net72}
N 7490 -300 7490 -220 { lab=#net72}
N 7450 -300 7450 -220 { lab=#net71}
N 7410 -300 7410 -210 { lab=#net73}
N 7370 -300 7370 -220 { lab=#net70}
N 7330 -300 7330 -220 { lab=#net69}
N 7270 -300 7270 -220 { lab=#net68}
N 7410 -210 7410 -180 { lab=#net73}
N 6970 -220 6970 -180 { lab=#net7}
N 7030 -220 7030 -180 { lab=#net8}
N 7070 -220 7070 -180 { lab=#net9}
N 7150 -220 7150 -180 { lab=#net10}
N 7190 -220 7190 -180 { lab=#net11}
N 7190 -300 7190 -220 { lab=#net11}
N 7150 -300 7150 -220 { lab=#net10}
N 7110 -300 7110 -210 { lab=#net31}
N 7070 -300 7070 -220 { lab=#net9}
N 7030 -300 7030 -220 { lab=#net8}
N 6970 -300 6970 -220 { lab=#net7}
N 7110 -210 7110 -180 { lab=#net31}
N 6670 -220 6670 -180 { lab=#net32}
N 6730 -220 6730 -180 { lab=#net33}
N 6770 -220 6770 -180 { lab=#net34}
N 6850 -220 6850 -180 { lab=#net35}
N 6890 -220 6890 -180 { lab=#net36}
N 6890 -300 6890 -220 { lab=#net36}
N 6850 -300 6850 -220 { lab=#net35}
N 6810 -300 6810 -210 { lab=#net37}
N 6770 -300 6770 -220 { lab=#net34}
N 6730 -300 6730 -220 { lab=#net33}
N 6670 -300 6670 -220 { lab=#net32}
N 6810 -210 6810 -180 { lab=#net37}
N 6370 -220 6370 -180 { lab=#net38}
N 6430 -220 6430 -180 { lab=#net39}
N 6470 -220 6470 -180 { lab=#net40}
N 6550 -220 6550 -180 { lab=#net41}
N 6590 -220 6590 -180 { lab=#net42}
N 6590 -300 6590 -220 { lab=#net42}
N 6550 -300 6550 -220 { lab=#net41}
N 6510 -300 6510 -210 { lab=#net43}
N 6470 -300 6470 -220 { lab=#net40}
N 6430 -300 6430 -220 { lab=#net39}
N 6370 -300 6370 -220 { lab=#net38}
N 6510 -210 6510 -180 { lab=#net43}
N 6070 -220 6070 -180 { lab=#net44}
N 6130 -220 6130 -180 { lab=#net45}
N 6170 -220 6170 -180 { lab=#net46}
N 6250 -220 6250 -180 { lab=#net47}
N 6290 -220 6290 -180 { lab=#net48}
N 6290 -300 6290 -220 { lab=#net48}
N 6250 -300 6250 -220 { lab=#net47}
N 6210 -300 6210 -210 { lab=#net49}
N 6170 -300 6170 -220 { lab=#net46}
N 6130 -300 6130 -220 { lab=#net45}
N 6070 -300 6070 -220 { lab=#net44}
N 6210 -210 6210 -180 { lab=#net49}
N 5770 -220 5770 -180 { lab=#net50}
N 5830 -220 5830 -180 { lab=#net51}
N 5870 -220 5870 -180 { lab=#net52}
N 5950 -220 5950 -180 { lab=#net53}
N 5990 -220 5990 -180 { lab=#net54}
N 5990 -300 5990 -220 { lab=#net54}
N 5950 -300 5950 -220 { lab=#net53}
N 5910 -300 5910 -210 { lab=#net55}
N 5870 -300 5870 -220 { lab=#net52}
N 5830 -300 5830 -220 { lab=#net51}
N 5770 -300 5770 -220 { lab=#net50}
N 5910 -210 5910 -180 { lab=#net55}
N 5470 -220 5470 -180 { lab=#net56}
N 5530 -220 5530 -180 { lab=#net57}
N 5570 -220 5570 -180 { lab=#net58}
N 5650 -220 5650 -180 { lab=#net59}
N 5690 -220 5690 -180 { lab=#net60}
N 5690 -300 5690 -220 { lab=#net60}
N 5650 -300 5650 -220 { lab=#net59}
N 5610 -300 5610 -210 { lab=#net61}
N 5570 -300 5570 -220 { lab=#net58}
N 5530 -300 5530 -220 { lab=#net57}
N 5470 -300 5470 -220 { lab=#net56}
N 5610 -210 5610 -180 { lab=#net61}
N 5170 -220 5170 -180 { lab=#net62}
N 5230 -220 5230 -180 { lab=#net63}
N 5270 -220 5270 -180 { lab=#net64}
N 5350 -220 5350 -180 { lab=#net65}
N 5390 -220 5390 -180 { lab=#net66}
N 5390 -300 5390 -220 { lab=#net66}
N 5350 -300 5350 -220 { lab=#net65}
N 5310 -300 5310 -210 { lab=#net67}
N 5270 -300 5270 -220 { lab=#net64}
N 5230 -300 5230 -220 { lab=#net63}
N 5170 -300 5170 -220 { lab=#net62}
N 5310 -210 5310 -180 { lab=#net67}
N 4870 -220 4870 -180 { lab=#net68}
N 4930 -220 4930 -180 { lab=#net69}
N 4970 -220 4970 -180 { lab=#net70}
N 5050 -220 5050 -180 { lab=#net71}
N 5090 -220 5090 -180 { lab=#net72}
N 5090 -300 5090 -220 { lab=#net72}
N 5050 -300 5050 -220 { lab=#net71}
N 5010 -300 5010 -210 { lab=#net73}
N 4970 -300 4970 -220 { lab=#net70}
N 4930 -300 4930 -220 { lab=#net69}
N 4870 -300 4870 -220 { lab=#net68}
N 5010 -210 5010 -180 { lab=#net73}
N 4570 -220 4570 -180 { lab=#net7}
N 4630 -220 4630 -180 { lab=#net8}
N 4670 -220 4670 -180 { lab=#net9}
N 4750 -220 4750 -180 { lab=#net10}
N 4790 -220 4790 -180 { lab=#net11}
N 4790 -300 4790 -220 { lab=#net11}
N 4750 -300 4750 -220 { lab=#net10}
N 4710 -300 4710 -210 { lab=#net31}
N 4670 -300 4670 -220 { lab=#net9}
N 4630 -300 4630 -220 { lab=#net8}
N 4570 -300 4570 -220 { lab=#net7}
N 4710 -210 4710 -180 { lab=#net31}
N 4270 -220 4270 -180 { lab=#net32}
N 4330 -220 4330 -180 { lab=#net33}
N 4370 -220 4370 -180 { lab=#net34}
N 4450 -220 4450 -180 { lab=#net35}
N 4490 -220 4490 -180 { lab=#net36}
N 4490 -300 4490 -220 { lab=#net36}
N 4450 -300 4450 -220 { lab=#net35}
N 4410 -300 4410 -210 { lab=#net37}
N 4370 -300 4370 -220 { lab=#net34}
N 4330 -300 4330 -220 { lab=#net33}
N 4270 -300 4270 -220 { lab=#net32}
N 4410 -210 4410 -180 { lab=#net37}
N 3970 -220 3970 -180 { lab=#net38}
N 4030 -220 4030 -180 { lab=#net39}
N 4070 -220 4070 -180 { lab=#net40}
N 4150 -220 4150 -180 { lab=#net41}
N 4190 -220 4190 -180 { lab=#net42}
N 4190 -300 4190 -220 { lab=#net42}
N 4150 -300 4150 -220 { lab=#net41}
N 4110 -300 4110 -210 { lab=#net43}
N 4070 -300 4070 -220 { lab=#net40}
N 4030 -300 4030 -220 { lab=#net39}
N 3970 -300 3970 -220 { lab=#net38}
N 4110 -210 4110 -180 { lab=#net43}
N 3670 -220 3670 -180 { lab=#net44}
N 3730 -220 3730 -180 { lab=#net45}
N 3770 -220 3770 -180 { lab=#net46}
N 3850 -220 3850 -180 { lab=#net47}
N 3890 -220 3890 -180 { lab=#net48}
N 3890 -300 3890 -220 { lab=#net48}
N 3850 -300 3850 -220 { lab=#net47}
N 3810 -300 3810 -210 { lab=#net49}
N 3770 -300 3770 -220 { lab=#net46}
N 3730 -300 3730 -220 { lab=#net45}
N 3670 -300 3670 -220 { lab=#net44}
N 3810 -210 3810 -180 { lab=#net49}
N 3370 -220 3370 -180 { lab=#net50}
N 3430 -220 3430 -180 { lab=#net51}
N 3470 -220 3470 -180 { lab=#net52}
N 3550 -220 3550 -180 { lab=#net53}
N 3590 -220 3590 -180 { lab=#net54}
N 3590 -300 3590 -220 { lab=#net54}
N 3550 -300 3550 -220 { lab=#net53}
N 3510 -300 3510 -210 { lab=#net55}
N 3470 -300 3470 -220 { lab=#net52}
N 3430 -300 3430 -220 { lab=#net51}
N 3370 -300 3370 -220 { lab=#net50}
N 3510 -210 3510 -180 { lab=#net55}
N 3070 -220 3070 -180 { lab=#net56}
N 3130 -220 3130 -180 { lab=#net57}
N 3170 -220 3170 -180 { lab=#net58}
N 3250 -220 3250 -180 { lab=#net59}
N 3290 -220 3290 -180 { lab=#net60}
N 3290 -300 3290 -220 { lab=#net60}
N 3250 -300 3250 -220 { lab=#net59}
N 3210 -300 3210 -210 { lab=#net61}
N 3170 -300 3170 -220 { lab=#net58}
N 3130 -300 3130 -220 { lab=#net57}
N 3070 -300 3070 -220 { lab=#net56}
N 3210 -210 3210 -180 { lab=#net61}
N 2770 -220 2770 -180 { lab=#net62}
N 2830 -220 2830 -180 { lab=#net63}
N 2870 -220 2870 -180 { lab=#net64}
N 2950 -220 2950 -180 { lab=#net65}
N 2990 -220 2990 -180 { lab=#net66}
N 2990 -300 2990 -220 { lab=#net66}
N 2950 -300 2950 -220 { lab=#net65}
N 2910 -300 2910 -210 { lab=#net67}
N 2870 -300 2870 -220 { lab=#net64}
N 2830 -300 2830 -220 { lab=#net63}
N 2770 -300 2770 -220 { lab=#net62}
N 2910 -210 2910 -180 { lab=#net67}
N 2470 -220 2470 -180 { lab=#net68}
N 2530 -220 2530 -180 { lab=#net69}
N 2570 -220 2570 -180 { lab=#net70}
N 2650 -220 2650 -180 { lab=#net71}
N 2690 -220 2690 -180 { lab=#net72}
N 2690 -300 2690 -220 { lab=#net72}
N 2650 -300 2650 -220 { lab=#net71}
N 2610 -300 2610 -210 { lab=#net73}
N 2570 -300 2570 -220 { lab=#net70}
N 2530 -300 2530 -220 { lab=#net69}
N 2470 -300 2470 -220 { lab=#net68}
N 2610 -210 2610 -180 { lab=#net73}
N 2170 -220 2170 -180 { lab=#net7}
N 2230 -220 2230 -180 { lab=#net8}
N 2270 -220 2270 -180 { lab=#net9}
N 2350 -220 2350 -180 { lab=#net10}
N 2390 -220 2390 -180 { lab=#net11}
N 2390 -300 2390 -220 { lab=#net11}
N 2350 -300 2350 -220 { lab=#net10}
N 2310 -300 2310 -210 { lab=#net31}
N 2270 -300 2270 -220 { lab=#net9}
N 2230 -300 2230 -220 { lab=#net8}
N 2170 -300 2170 -220 { lab=#net7}
N 2310 -210 2310 -180 { lab=#net31}
N 1870 -220 1870 -180 { lab=#net32}
N 1930 -220 1930 -180 { lab=#net33}
N 1970 -220 1970 -180 { lab=#net34}
N 2050 -220 2050 -180 { lab=#net35}
N 2090 -220 2090 -180 { lab=#net36}
N 2090 -300 2090 -220 { lab=#net36}
N 2050 -300 2050 -220 { lab=#net35}
N 2010 -300 2010 -210 { lab=#net37}
N 1970 -300 1970 -220 { lab=#net34}
N 1930 -300 1930 -220 { lab=#net33}
N 1870 -300 1870 -220 { lab=#net32}
N 2010 -210 2010 -180 { lab=#net37}
N 1570 -220 1570 -180 { lab=#net38}
N 1630 -220 1630 -180 { lab=#net39}
N 1670 -220 1670 -180 { lab=#net40}
N 1750 -220 1750 -180 { lab=#net41}
N 1790 -220 1790 -180 { lab=#net42}
N 1790 -300 1790 -220 { lab=#net42}
N 1750 -300 1750 -220 { lab=#net41}
N 1710 -300 1710 -210 { lab=#net43}
N 1670 -300 1670 -220 { lab=#net40}
N 1630 -300 1630 -220 { lab=#net39}
N 1570 -300 1570 -220 { lab=#net38}
N 1710 -210 1710 -180 { lab=#net43}
N 1270 -220 1270 -180 { lab=#net44}
N 1330 -220 1330 -180 { lab=#net45}
N 1370 -220 1370 -180 { lab=#net46}
N 1450 -220 1450 -180 { lab=#net47}
N 1490 -220 1490 -180 { lab=#net48}
N 1490 -300 1490 -220 { lab=#net48}
N 1450 -300 1450 -220 { lab=#net47}
N 1410 -300 1410 -210 { lab=#net49}
N 1370 -300 1370 -220 { lab=#net46}
N 1330 -300 1330 -220 { lab=#net45}
N 1270 -300 1270 -220 { lab=#net44}
N 1410 -210 1410 -180 { lab=#net49}
N 970 -220 970 -180 { lab=#net50}
N 1030 -220 1030 -180 { lab=#net51}
N 1070 -220 1070 -180 { lab=#net52}
N 1150 -220 1150 -180 { lab=#net53}
N 1190 -220 1190 -180 { lab=#net54}
N 1190 -300 1190 -220 { lab=#net54}
N 1150 -300 1150 -220 { lab=#net53}
N 1110 -300 1110 -210 { lab=#net55}
N 1070 -300 1070 -220 { lab=#net52}
N 1030 -300 1030 -220 { lab=#net51}
N 970 -300 970 -220 { lab=#net50}
N 1110 -210 1110 -180 { lab=#net55}
N 670 -220 670 -180 { lab=#net56}
N 730 -220 730 -180 { lab=#net57}
N 770 -220 770 -180 { lab=#net58}
N 850 -220 850 -180 { lab=#net59}
N 890 -220 890 -180 { lab=#net60}
N 890 -300 890 -220 { lab=#net60}
N 850 -300 850 -220 { lab=#net59}
N 810 -300 810 -210 { lab=#net61}
N 770 -300 770 -220 { lab=#net58}
N 730 -300 730 -220 { lab=#net57}
N 670 -300 670 -220 { lab=#net56}
N 810 -210 810 -180 { lab=#net61}
N 370 -220 370 -180 { lab=#net62}
N 430 -220 430 -180 { lab=#net63}
N 470 -220 470 -180 { lab=#net64}
N 550 -220 550 -180 { lab=#net65}
N 590 -220 590 -180 { lab=#net66}
N 590 -300 590 -220 { lab=#net66}
N 550 -300 550 -220 { lab=#net65}
N 510 -300 510 -210 { lab=#net67}
N 470 -300 470 -220 { lab=#net64}
N 430 -300 430 -220 { lab=#net63}
N 370 -300 370 -220 { lab=#net62}
N 510 -210 510 -180 { lab=#net67}
N 70 -220 70 -180 { lab=#net68}
N 130 -220 130 -180 { lab=#net69}
N 170 -220 170 -180 { lab=#net70}
N 250 -220 250 -180 { lab=#net71}
N 290 -220 290 -180 { lab=#net72}
N 290 -300 290 -220 { lab=#net72}
N 250 -300 250 -220 { lab=#net71}
N 210 -300 210 -210 { lab=#net73}
N 170 -300 170 -220 { lab=#net70}
N 130 -300 130 -220 { lab=#net69}
N 70 -300 70 -220 { lab=#net68}
N 210 -210 210 -180 { lab=#net73}
N -50 -300 -50 -220 {}
N -90 -300 -90 -220 {}
N -140 -300 -140 -220 {}
N -190 -300 -190 -220 {}
N -450 -290 -450 -220 {}
N -380 -300 -380 -200 {}
N -500 -300 -500 -200 {}
N -450 -300 -450 -290 {}
C {/home/hilas/alice/xschem/sky130_hilas_swc4x2celld3.sym} 180 -100 0 0 {name=x1}
C {/home/hilas/alice/xschem/sky130_hilas_swc4x2celld3.sym} 480 -100 0 0 {name=x2}
C {/home/hilas/alice/xschem/sky130_hilas_swc4x2celld3.sym} 780 -100 0 0 {name=x3}
C {/home/hilas/alice/xschem/sky130_hilas_swc4x2celld3.sym} 1080 -100 0 0 {name=x4}
C {/home/hilas/alice/xschem/sky130_hilas_swc4x2celld3.sym} 1380 -100 0 0 {name=x5}
C {/home/hilas/alice/xschem/sky130_hilas_swc4x2celld3.sym} 1680 -100 0 0 {name=x6}
C {/home/hilas/alice/xschem/sky130_hilas_swc4x2celld3.sym} 1980 -100 0 0 {name=x7}
C {/home/hilas/alice/xschem/sky130_hilas_swc4x2celld3.sym} 2280 -100 0 0 {name=x8}
C {/home/hilas/alice/xschem/sky130_hilas_swc4x2celld3.sym} 2580 -100 0 0 {name=x9}
C {/home/hilas/alice/xschem/sky130_hilas_swc4x2celld3.sym} 2880 -100 0 0 {name=x10}
C {/home/hilas/alice/xschem/sky130_hilas_swc4x2celld3.sym} 3180 -100 0 0 {name=x11}
C {/home/hilas/alice/xschem/sky130_hilas_swc4x2celld3.sym} 3480 -100 0 0 {name=x12}
C {/home/hilas/alice/xschem/sky130_hilas_swc4x2celld3.sym} 3780 -100 0 0 {name=x13}
C {/home/hilas/alice/xschem/sky130_hilas_swc4x2celld3.sym} 4080 -100 0 0 {name=x14}
C {/home/hilas/alice/xschem/sky130_hilas_swc4x2celld3.sym} 4380 -100 0 0 {name=x15}
C {/home/hilas/alice/xschem/sky130_hilas_swc4x2celld3.sym} 4680 -100 0 0 {name=x16}
C {/home/hilas/alice/xschem/sky130_hilas_swc4x2celld3.sym} 4980 -100 0 0 {name=x17}
C {/home/hilas/alice/xschem/sky130_hilas_swc4x2celld3.sym} 5280 -100 0 0 {name=x18}
C {/home/hilas/alice/xschem/sky130_hilas_swc4x2celld3.sym} 5580 -100 0 0 {name=x19}
C {/home/hilas/alice/xschem/sky130_hilas_swc4x2celld3.sym} 5880 -100 0 0 {name=x20}
C {/home/hilas/alice/xschem/sky130_hilas_swc4x2celld3.sym} 6180 -100 0 0 {name=x21}
C {/home/hilas/alice/xschem/sky130_hilas_swc4x2celld3.sym} 6480 -100 0 0 {name=x22}
C {/home/hilas/alice/xschem/sky130_hilas_swc4x2celld3.sym} 6780 -100 0 0 {name=x23}
C {/home/hilas/alice/xschem/sky130_hilas_swc4x2celld3.sym} 7080 -100 0 0 {name=x24}
C {/home/hilas/alice/xschem/sky130_hilas_swc4x2celld3.sym} 7380 -100 0 0 {name=x25}
C {/home/hilas/alice/xschem/sky130_hilas_swc4x2celld3.sym} 7680 -100 0 0 {name=x26}
C {/home/hilas/alice/xschem/sky130_hilas_swc4x2celld3.sym} 7980 -100 0 0 {name=x27}
C {/home/hilas/alice/xschem/sky130_hilas_swc4x2celld3.sym} 8280 -100 0 0 {name=x28}
C {/home/hilas/alice/xschem/sky130_hilas_swc4x2celld3.sym} 8580 -100 0 0 {name=x29}
C {/home/hilas/alice/xschem/sky130_hilas_swc4x2celld3.sym} 8880 -100 0 0 {name=x30}
C {/home/hilas/alice/xschem/sky130_hilas_swc4x2celld3.sym} 9180 -100 0 0 {name=x31}
C {/home/hilas/alice/xschem/sky130_hilas_swc4x2celld3.sym} 9480 -100 0 0 {name=x32}
C {/home/hilas/alice/xschem/sky130_hilas_swc4x2celld3.sym} 9780 -100 0 0 {name=x33}
C {/home/hilas/alice/xschem/sky130_hilas_swc4x2celld3.sym} 10080 -100 0 0 {name=x34}
C {/home/hilas/alice/xschem/sky130_hilas_swc4x2celld3.sym} 10380 -100 0 0 {name=x35}
C {/home/hilas/alice/xschem/sky130_hilas_swc4x2celld3.sym} 10680 -100 0 0 {name=x36}
C {/home/hilas/alice/xschem/sky130_hilas_swc4x2celld3.sym} 10980 -100 0 0 {name=x37}
C {/home/hilas/alice/xschem/sky130_hilas_swc4x2celld3.sym} 11280 -100 0 0 {name=x38}
C {/home/hilas/alice/xschem/sky130_hilas_swc4x2celld3.sym} 11580 -100 0 0 {name=x39}
C {/home/hilas/alice/xschem/sky130_hilas_swc4x2celld3.sym} 11880 -100 0 0 {name=x40}
C {/home/hilas/alice/xschem/sky130_hilas_swc4x2celld3.sym} 12180 -100 0 0 {name=x41}
C {/home/hilas/alice/xschem/sky130_hilas_swc4x2celld3.sym} 12480 -100 0 0 {name=x42}
C {/home/hilas/alice/xschem/sky130_hilas_swc4x2celld3.sym} 12780 -100 0 0 {name=x43}
C {/home/hilas/alice/xschem/sky130_hilas_swc4x2celld3.sym} 13080 -100 0 0 {name=x44}
C {/home/hilas/alice/xschem/sky130_hilas_swc4x2celld3.sym} 13380 -100 0 0 {name=x45}
C {/home/hilas/alice/xschem/sky130_hilas_swc4x2celld3.sym} 13680 -100 0 0 {name=x46}
C {/home/hilas/alice/xschem/sky130_hilas_swc4x2celld3.sym} 13980 -100 0 0 {name=x47}
C {/home/hilas/alice/xschem/sky130_hilas_swc4x2celld3.sym} 14280 -100 0 0 {name=x48}
C {/home/hilas/alice/xschem/sky130_hilas_swc4x2celld3.sym} 14580 -100 0 0 {name=x49}
C {/home/hilas/alice/xschem/sky130_hilas_swc4x2celld3.sym} 14880 -100 0 0 {name=x50}
C {/home/hilas/alice/xschem/sky130_hilas_swc4x2celld3.sym} 15180 -100 0 0 {name=x51}
C {/home/hilas/alice/xschem/sky130_hilas_swc4x2celld3.sym} 15480 -100 0 0 {name=x52}
C {/home/hilas/alice/xschem/sky130_hilas_swc4x2celld3.sym} 15780 -100 0 0 {name=x53}
C {/home/hilas/alice/xschem/sky130_hilas_swc4x2celld3.sym} 16080 -100 0 0 {name=x54}
C {/home/hilas/alice/xschem/sky130_hilas_swc4x2celld3.sym} 16380 -100 0 0 {name=x55}
C {/home/hilas/alice/xschem/sky130_hilas_swc4x2celld3.sym} 16680 -100 0 0 {name=x56}
C {/home/hilas/alice/xschem/sky130_hilas_swc4x2celld3.sym} 16980 -100 0 0 {name=x57}
C {/home/hilas/alice/xschem/sky130_hilas_swc4x2celld3.sym} 17280 -100 0 0 {name=x58}
C {/home/hilas/alice/xschem/sky130_hilas_swc4x2celld3.sym} 17580 -100 0 0 {name=x59}
C {/home/hilas/alice/xschem/sky130_hilas_swc4x2celld3.sym} 17880 -100 0 0 {name=x60}
C {/home/hilas/alice/xschem/sky130_hilas_swc4x2celld3.sym} 18180 -100 0 0 {name=x61}
C {/home/hilas/alice/xschem/sky130_hilas_swc4x2celld3.sym} 18480 -100 0 0 {name=x62}
C {/home/hilas/alice/xschem/sky130_hilas_swc4x2celld3.sym} 18780 -100 0 0 {name=x63}
C {/home/hilas/alice/xschem/sky130_hilas_swc4x2celld3.sym} 19080 -100 0 0 {name=x64}
C {/home/hilas/alice/xschem/sky130_hilas_FourTgateDouble_ThickOx.sym} 19420 -160 0 0 {name=x65}
C {/home/hilas/alice/xschem/sky130_hilas_WTA4Stage01.sym} 19770 -140 0 0 {name=x66}
C {/home/hilas/alice/xschem/sky130_hilas_FourTgate_ThickOx.sym} -120 -120 0 0 {name=x67}
C {/home/hilas/alice/xschem/sky130_hilas_drainSelect01d3.sym} -420 -120 0 0 {name=x68}
