v {xschem version=2.9.9 file_version=1.2 }
G {}
K {}
V {}
S {}
E {}
N 1260 -1370 1300 -1370 { lab=GATE2}
N 1140 -1370 1180 -1370 { lab=VTUN}
N 1140 -1380 1140 -1370 { lab=VTUN}
N 1110 -1430 1330 -1430 { lab=VIN12}
N 1070 -1480 1070 -1460 { lab=#net1}
N 1370 -1400 1370 -1320 { lab=#net2}
N 1070 -1400 1070 -1340 { lab=DRAIN1}
N 1070 -1340 1450 -1340 { lab=DRAIN1}
N 1000 -1350 1000 -1300 { lab=VINJ}
N 1260 -1630 1300 -1630 { lab=GATE2}
N 1140 -1630 1180 -1630 { lab=VTUN}
N 1140 -1640 1140 -1630 { lab=VTUN}
N 1110 -1690 1330 -1690 { lab=VIN11}
N 1070 -1740 1070 -1720 { lab=#net3}
N 1260 -1630 1260 -1370 { lab=GATE2}
N 1180 -1640 1180 -1630 { lab=VTUN}
N 1180 -1630 1180 -1370 { lab=VTUN}
N 1030 -1820 1030 -1300 { lab=COLSEL2}
N 1070 -1660 1070 -1600 { lab=DRAIN1}
N 1070 -1600 1450 -1600 { lab=DRAIN1}
N 1000 -1610 1000 -1540 { lab=VINJ}
N 750 -1370 790 -1370 { lab=GATE1}
N 630 -1370 670 -1370 { lab=VTUN}
N 630 -1380 630 -1370 { lab=VTUN}
N 600 -1430 820 -1430 { lab=#net4}
N 560 -1480 560 -1460 { lab=#net5}
N 900 -1460 900 -1300 { lab=VPWR}
N 860 -1400 860 -1290 { lab=#net6}
N 750 -1370 750 -1300 { lab=GATE1}
N 670 -1370 670 -1280 { lab=VTUN}
N 560 -1400 560 -1340 { lab=DRAIN1}
N 560 -1340 1070 -1340 { lab=DRAIN1}
N 490 -1350 490 -1300 { lab=VINJ}
N 750 -1630 790 -1630 { lab=GATE1}
N 630 -1630 670 -1630 { lab=VTUN}
N 630 -1640 630 -1630 { lab=VTUN}
N 600 -1690 820 -1690 { lab=#net7}
N 560 -1740 560 -1720 { lab=#net8}
N 900 -1720 900 -1460 { lab=VPWR}
N 860 -1660 860 -1580 { lab=#net9}
N 750 -1630 750 -1370 { lab=GATE1}
N 670 -1630 670 -1370 { lab=VTUN}
N 560 -1660 560 -1600 { lab=DRAIN1}
N 560 -1600 1070 -1600 { lab=DRAIN1}
N 490 -1610 490 -1540 { lab=VINJ}
N 490 -1800 560 -1800 { lab=VINJ}
N 420 -1600 560 -1600 { lab=DRAIN1}
N 490 -1830 490 -1800 { lab=VINJ}
N 480 -1850 490 -1830 { lab=VINJ}
N 560 -1780 560 -1770 { lab=VINJ}
N 560 -1780 570 -1780 { lab=VINJ}
N 570 -1800 570 -1780 { lab=VINJ}
N 560 -1800 570 -1800 { lab=VINJ}
N 490 -1690 560 -1690 { lab=VINJ}
N 490 -1430 560 -1430 { lab=VINJ}
N 560 -1510 570 -1510 { lab=VINJ}
N 570 -1540 570 -1510 { lab=VINJ}
N 1000 -1690 1070 -1690 { lab=VINJ}
N 1070 -1770 1080 -1770 { lab=VINJ}
N 1080 -1800 1080 -1770 { lab=VINJ}
N 1000 -1430 1080 -1430 { lab=VINJ}
N 1070 -1510 1080 -1510 { lab=VINJ}
N 1080 -1540 1080 -1510 { lab=VINJ}
N 1000 -1350 1390 -1350 { lab=VINJ}
N 1390 -1430 1390 -1350 { lab=VINJ}
N 1370 -1430 1390 -1430 { lab=VINJ}
N 1370 -1690 1390 -1690 { lab=VINJ}
N 1390 -1690 1390 -1610 { lab=VINJ}
N 1000 -1610 1390 -1610 { lab=VINJ}
N 860 -1430 880 -1430 { lab=VINJ}
N 880 -1430 880 -1350 { lab=VINJ}
N 490 -1350 880 -1350 { lab=VINJ}
N 860 -1690 880 -1690 { lab=VINJ}
N 880 -1690 880 -1610 { lab=VINJ}
N 490 -1610 880 -1610 { lab=VINJ}
N 520 -1840 520 -1300 { lab=COLSEL1}
N 520 -1840 550 -1840 { lab=COLSEL1}
N 900 -1830 920 -1830 { lab=VPWR}
N 670 -1840 670 -1630 { lab=VTUN}
N 670 -1840 680 -1840 { lab=VTUN}
N 1000 -1880 1000 -1800 { lab=VINJ}
N 470 -1880 1000 -1880 { lab=VINJ}
N 470 -1850 470 -1820 { lab=VINJ}
N 470 -1850 480 -1850 { lab=VINJ}
N 1810 -1780 1830 -1780 { lab=#net10}
N 1870 -1780 1890 -1780 { lab=VPWR}
N 1890 -1810 1890 -1780 { lab=VPWR}
N 1740 -1810 1890 -1810 { lab=VPWR}
N 1740 -1810 1740 -1780 { lab=VPWR}
N 1740 -1780 1760 -1780 { lab=VPWR}
N 1870 -1740 1870 -1720 { lab=OUTPUT1}
N 1870 -1740 1910 -1740 { lab=OUTPUT1}
N 1760 -1730 1760 -1670 { lab=#net10}
N 1710 -1690 1830 -1690 { lab=#net11}
N 1710 -1720 1710 -1690 { lab=#net11}
N 1640 -1640 1720 -1640 { lab=#net2}
N 1640 -1670 1640 -1640 { lab=#net2}
N 1590 -1640 1600 -1640 { lab=VGND}
N 1590 -1640 1590 -1610 { lab=VGND}
N 1590 -1610 1660 -1610 { lab=VGND}
N 1660 -1610 1770 -1610 { lab=VGND}
N 1770 -1640 1770 -1610 { lab=VGND}
N 1760 -1640 1770 -1640 { lab=VGND}
N 1870 -1690 1880 -1690 { lab=VGND}
N 1880 -1690 1880 -1660 { lab=VGND}
N 1770 -1660 1880 -1660 { lab=VGND}
N 1770 -1660 1770 -1640 { lab=VGND}
N 1660 -1690 1670 -1690 { lab=VGND}
N 1660 -1660 1660 -1610 { lab=VGND}
N 1660 -1660 1670 -1660 { lab=VGND}
N 1920 -1500 1940 -1500 { lab=#net12}
N 1980 -1500 2000 -1500 { lab=VPWR}
N 2000 -1530 2000 -1500 { lab=VPWR}
N 1850 -1530 2000 -1530 { lab=VPWR}
N 1850 -1530 1850 -1500 { lab=VPWR}
N 1850 -1500 1870 -1500 { lab=VPWR}
N 1980 -1460 1980 -1440 { lab=OUTPUT2}
N 1980 -1460 2020 -1460 { lab=OUTPUT2}
N 1870 -1440 1870 -1390 { lab=#net12}
N 1820 -1410 1940 -1410 { lab=#net13}
N 1820 -1440 1820 -1410 { lab=#net13}
N 1750 -1360 1830 -1360 { lab=#net14}
N 1750 -1390 1750 -1360 { lab=#net14}
N 1700 -1360 1710 -1360 { lab=VGND}
N 1700 -1360 1700 -1330 { lab=VGND}
N 1700 -1330 1770 -1330 { lab=VGND}
N 1840 -1330 1880 -1330 { lab=VGND}
N 1880 -1360 1880 -1330 { lab=VGND}
N 1870 -1360 1880 -1360 { lab=VGND}
N 1980 -1410 1990 -1410 { lab=VGND}
N 1990 -1410 1990 -1380 { lab=VGND}
N 1880 -1380 1990 -1380 { lab=VGND}
N 1880 -1380 1880 -1360 { lab=VGND}
N 1770 -1410 1780 -1410 { lab=VGND}
N 1770 -1380 1770 -1330 { lab=VGND}
N 1770 -1380 1780 -1380 { lab=VGND}
N 670 -1280 1180 -1280 { lab=VTUN}
N 860 -1580 860 -1570 { lab=#net9}
N 860 -1290 1500 -1290 { lab=#net6}
N 1370 -1580 1370 -1460 { lab=#net9}
N 860 -1580 1370 -1580 { lab=#net9}
N 1370 -1320 1470 -1320 { lab=#net2}
N 900 -1860 900 -1830 { lab=VPWR}
N 900 -1860 1740 -1860 { lab=VPWR}
N 1740 -1860 1740 -1810 { lab=VPWR}
N 1470 -1670 1640 -1670 { lab=#net2}
N 1680 -1440 1820 -1440 { lab=#net13}
N 1600 -1390 1750 -1390 { lab=#net14}
N 1720 -1470 1730 -1470 { lab=VIN22}
N 1540 -1420 1560 -1420 { lab=VIN21}
N 1540 -1420 1540 -1360 { lab=VIN21}
N 1540 -1360 1550 -1360 { lab=VIN21}
N 1500 -1500 1500 -1290 { lab=#net6}
N 1600 -1500 1680 -1500 { lab=#net6}
N 1600 -1500 1600 -1450 { lab=#net6}
N 1390 -1610 1510 -1610 { lab=VINJ}
N 1510 -1610 1510 -1520 { lab=VINJ}
N 1620 -1520 1660 -1520 { lab=VINJ}
N 1660 -1520 1660 -1470 { lab=VINJ}
N 1660 -1470 1680 -1470 { lab=VINJ}
N 1600 -1420 1620 -1420 { lab=VINJ}
N 1620 -1520 1620 -1420 { lab=VINJ}
N 2000 -1530 2060 -1530 { lab=VPWR}
N 2060 -1810 2060 -1530 { lab=VPWR}
N 1890 -1810 2060 -1810 { lab=VPWR}
N 1760 -1730 1810 -1730 { lab=#net10}
N 1810 -1780 1810 -1730 { lab=#net10}
N 1870 -1440 1920 -1440 { lab=#net12}
N 1920 -1500 1920 -1440 { lab=#net12}
N 1160 -1770 1160 -1750 { lab=VIN11}
N 1120 -1540 1120 -1490 { lab=VIN12}
N 1840 -1330 1840 -1290 { lab=VGND}
N 1260 -1820 1260 -1630 { lab=GATE2}
N 420 -1340 560 -1340 { lab=DRAIN1}
N 900 -1830 900 -1720 { lab=VPWR}
N 490 -1850 490 -1830 { lab=VINJ}
N 560 -1800 560 -1780 { lab=VINJ}
N 490 -1800 490 -1690 { lab=VINJ}
N 490 -1540 490 -1430 { lab=VINJ}
N 1000 -1800 1000 -1690 { lab=VINJ}
N 1000 -1540 1000 -1430 { lab=VINJ}
N 1000 -1430 1000 -1350 { lab=VINJ}
N 1000 -1690 1000 -1610 { lab=VINJ}
N 490 -1430 490 -1350 { lab=VINJ}
N 490 -1690 490 -1610 { lab=VINJ}
N 470 -1880 470 -1850 { lab=VINJ}
N 1870 -1750 1870 -1740 { lab=OUTPUT1}
N 1660 -1690 1660 -1660 { lab=VGND}
N 1980 -1470 1980 -1460 { lab=OUTPUT2}
N 1770 -1410 1770 -1380 { lab=VGND}
N 1470 -1670 1470 -1320 { lab=#net2}
N 1500 -1500 1600 -1500 { lab=#net6}
N 1510 -1520 1620 -1520 { lab=VINJ}
N 1760 -1750 1760 -1730 { lab=#net10}
N 1800 -1780 1810 -1780 { lab=#net10}
N 1870 -1470 1870 -1440 { lab=#net12}
N 1910 -1500 1920 -1500 { lab=#net12}
N 1770 -1330 1840 -1330 { lab=VGND}
N 1180 -1370 1180 -1280 { lab=VTUN}
N 1000 -1540 1080 -1540 { lab=VINJ}
N 1370 -1660 1370 -1580 { lab=#net9}
N 1370 -1720 1710 -1720 { lab=#net11}
N 1000 -1800 1080 -1800 { lab=VINJ}
N 490 -1540 570 -1540 { lab=VINJ}
N 750 -1830 750 -1630 { lab=GATE1}
N 1880 -1570 1980 -1570 { lab=#net15}
N 1160 -1750 1160 -1690 { lab=VIN11}
N 1120 -1490 1160 -1490 { lab=VIN12}
N 1160 -1490 1160 -1430 { lab=VIN12}
N 1980 -1630 2000 -1630 { lab=OUTPUT2}
N 2000 -1630 2010 -1630 { lab=OUTPUT2}
N 2010 -1630 2010 -1460 { lab=OUTPUT2}
N 860 -1880 860 -1720 { lab=VINJ}
N 860 -1460 890 -1460 { lab=VINJ}
N 890 -1880 890 -1460 { lab=VINJ}
N 2030 -1460 2030 -1260 { lab=VIN12}
N 1210 -1270 2030 -1260 { lab=VIN12}
N 1210 -1480 1210 -1270 { lab=VIN12}
N 1160 -1480 1210 -1480 { lab=VIN12}
N 1200 -1900 1900 -1900 { lab=OUTPUT1}
N 1900 -1900 1900 -1740 { lab=OUTPUT1}
N 1860 -1630 1880 -1630 { lab=VIN}
N 1170 -1900 1170 -1770 { lab=OUTPUT1}
N 1170 -1900 1200 -1900 { lab=OUTPUT1}
N 1930 -1570 1930 -1550 { lab=#net15}
N 1740 -1550 1930 -1550 { lab=#net15}
N 1740 -1550 1740 -1470 { lab=#net15}
N 1930 -1550 1950 -1550 { lab=#net15}
N 1950 -1740 1950 -1550 { lab=#net15}
N 1920 -1740 1950 -1740 { lab=#net15}
C {sky130_fd_pr/pfet_g5v0d10v5.sym} 1350 -1430 0 0 {name=M3
L=0.5
W=1
nf=1
mult=1
ad="'int((nf+1)/2) * W/nf * 0.29'" 
pd="'2*int((nf+1)/2) * (W/nf + 0.29)'"
as="'int((nf+2)/2) * W/nf * 0.29'" 
ps="'2*int((nf+2)/2) * (W/nf + 0.29)'"
nrd="'0.29 / W'" nrs="'0.29 / W'"
sa=0 sb=0 sd=0
model=pfet_g5v0d10v5
spiceprefix=X
}
C {sky130_fd_pr/cap_var_hvt.sym} 1300 -1400 0 0 {name=C1 model=cap_var_hvt W=0.5 L=0.5 VM=1 spiceprefix=X}
C {sky130_fd_pr/pfet_g5v0d10v5.sym} 1090 -1430 0 1 {name=M5
L=0.5
W=1
nf=1
mult=1
ad="'int((nf+1)/2) * W/nf * 0.29'" 
pd="'2*int((nf+1)/2) * (W/nf + 0.29)'"
as="'int((nf+2)/2) * W/nf * 0.29'" 
ps="'2*int((nf+2)/2) * (W/nf + 0.29)'"
nrd="'0.29 / W'" nrs="'0.29 / W'"
sa=0 sb=0 sd=0
model=pfet_g5v0d10v5
spiceprefix=X
}
C {sky130_fd_pr/cap_var_hvt.sym} 1140 -1400 0 1 {name=C2 model=cap_var_hvt W=0.5 L=0.5 VM=1 spiceprefix=X}
C {sky130_fd_pr/pfet_g5v0d10v5.sym} 1050 -1510 0 0 {name=M1
L=0.5
W=1
nf=1
mult=1
ad="'int((nf+1)/2) * W/nf * 0.29'" 
pd="'2*int((nf+1)/2) * (W/nf + 0.29)'"
as="'int((nf+2)/2) * W/nf * 0.29'" 
ps="'2*int((nf+2)/2) * (W/nf + 0.29)'"
nrd="'0.29 / W'" nrs="'0.29 / W'"
sa=0 sb=0 sd=0
model=pfet_g5v0d10v5
spiceprefix=X
}
C {sky130_fd_pr/pfet_g5v0d10v5.sym} 1350 -1690 0 0 {name=M2
L=0.5
W=1
nf=1
mult=1
ad="'int((nf+1)/2) * W/nf * 0.29'" 
pd="'2*int((nf+1)/2) * (W/nf + 0.29)'"
as="'int((nf+2)/2) * W/nf * 0.29'" 
ps="'2*int((nf+2)/2) * (W/nf + 0.29)'"
nrd="'0.29 / W'" nrs="'0.29 / W'"
sa=0 sb=0 sd=0
model=pfet_g5v0d10v5
spiceprefix=X
}
C {sky130_fd_pr/cap_var_hvt.sym} 1300 -1660 0 0 {name=C3 model=cap_var_hvt W=0.5 L=0.5 VM=1 spiceprefix=X}
C {sky130_fd_pr/pfet_g5v0d10v5.sym} 1090 -1690 0 1 {name=M4
L=0.5
W=1
nf=1
mult=1
ad="'int((nf+1)/2) * W/nf * 0.29'" 
pd="'2*int((nf+1)/2) * (W/nf + 0.29)'"
as="'int((nf+2)/2) * W/nf * 0.29'" 
ps="'2*int((nf+2)/2) * (W/nf + 0.29)'"
nrd="'0.29 / W'" nrs="'0.29 / W'"
sa=0 sb=0 sd=0
model=pfet_g5v0d10v5
spiceprefix=X
}
C {sky130_fd_pr/cap_var_hvt.sym} 1140 -1660 0 1 {name=C4 model=cap_var_hvt W=0.5 L=0.5 VM=1 spiceprefix=X}
C {sky130_fd_pr/pfet_g5v0d10v5.sym} 1050 -1770 0 0 {name=M6
L=0.5
W=1
nf=1
mult=1
ad="'int((nf+1)/2) * W/nf * 0.29'" 
pd="'2*int((nf+1)/2) * (W/nf + 0.29)'"
as="'int((nf+2)/2) * W/nf * 0.29'" 
ps="'2*int((nf+2)/2) * (W/nf + 0.29)'"
nrd="'0.29 / W'" nrs="'0.29 / W'"
sa=0 sb=0 sd=0
model=pfet_g5v0d10v5
spiceprefix=X
}
C {sky130_fd_pr/pfet_g5v0d10v5.sym} 840 -1430 0 0 {name=M7
L=0.5
W=1
nf=1
mult=1
ad="'int((nf+1)/2) * W/nf * 0.29'" 
pd="'2*int((nf+1)/2) * (W/nf + 0.29)'"
as="'int((nf+2)/2) * W/nf * 0.29'" 
ps="'2*int((nf+2)/2) * (W/nf + 0.29)'"
nrd="'0.29 / W'" nrs="'0.29 / W'"
sa=0 sb=0 sd=0
model=pfet_g5v0d10v5
spiceprefix=X
}
C {sky130_fd_pr/cap_var_hvt.sym} 790 -1400 0 0 {name=C5 model=cap_var_hvt W=0.5 L=0.5 VM=1 spiceprefix=X}
C {sky130_fd_pr/pfet_g5v0d10v5.sym} 580 -1430 0 1 {name=M8
L=0.5
W=1
nf=1
mult=1
ad="'int((nf+1)/2) * W/nf * 0.29'" 
pd="'2*int((nf+1)/2) * (W/nf + 0.29)'"
as="'int((nf+2)/2) * W/nf * 0.29'" 
ps="'2*int((nf+2)/2) * (W/nf + 0.29)'"
nrd="'0.29 / W'" nrs="'0.29 / W'"
sa=0 sb=0 sd=0
model=pfet_g5v0d10v5
spiceprefix=X
}
C {sky130_fd_pr/cap_var_hvt.sym} 630 -1400 0 1 {name=C6 model=cap_var_hvt W=0.5 L=0.5 VM=1 spiceprefix=X}
C {sky130_fd_pr/pfet_g5v0d10v5.sym} 540 -1510 0 0 {name=M9
L=0.5
W=1
nf=1
mult=1
ad="'int((nf+1)/2) * W/nf * 0.29'" 
pd="'2*int((nf+1)/2) * (W/nf + 0.29)'"
as="'int((nf+2)/2) * W/nf * 0.29'" 
ps="'2*int((nf+2)/2) * (W/nf + 0.29)'"
nrd="'0.29 / W'" nrs="'0.29 / W'"
sa=0 sb=0 sd=0
model=pfet_g5v0d10v5
spiceprefix=X
}
C {sky130_fd_pr/pfet_g5v0d10v5.sym} 840 -1690 0 0 {name=M10
L=0.5
W=1
nf=1
mult=1
ad="'int((nf+1)/2) * W/nf * 0.29'" 
pd="'2*int((nf+1)/2) * (W/nf + 0.29)'"
as="'int((nf+2)/2) * W/nf * 0.29'" 
ps="'2*int((nf+2)/2) * (W/nf + 0.29)'"
nrd="'0.29 / W'" nrs="'0.29 / W'"
sa=0 sb=0 sd=0
model=pfet_g5v0d10v5
spiceprefix=X
}
C {sky130_fd_pr/cap_var_hvt.sym} 790 -1660 0 0 {name=C7 model=cap_var_hvt W=0.5 L=0.5 VM=1 spiceprefix=X}
C {sky130_fd_pr/pfet_g5v0d10v5.sym} 580 -1690 0 1 {name=M11
L=0.5
W=1
nf=1
mult=1
ad="'int((nf+1)/2) * W/nf * 0.29'" 
pd="'2*int((nf+1)/2) * (W/nf + 0.29)'"
as="'int((nf+2)/2) * W/nf * 0.29'" 
ps="'2*int((nf+2)/2) * (W/nf + 0.29)'"
nrd="'0.29 / W'" nrs="'0.29 / W'"
sa=0 sb=0 sd=0
model=pfet_g5v0d10v5
spiceprefix=X
}
C {sky130_fd_pr/cap_var_hvt.sym} 630 -1660 0 1 {name=C8 model=cap_var_hvt W=0.5 L=0.5 VM=1 spiceprefix=X}
C {sky130_fd_pr/pfet_g5v0d10v5.sym} 540 -1770 0 0 {name=M12
L=0.5
W=1
nf=1
mult=1
ad="'int((nf+1)/2) * W/nf * 0.29'" 
pd="'2*int((nf+1)/2) * (W/nf + 0.29)'"
as="'int((nf+2)/2) * W/nf * 0.29'" 
ps="'2*int((nf+2)/2) * (W/nf + 0.29)'"
nrd="'0.29 / W'" nrs="'0.29 / W'"
sa=0 sb=0 sd=0
model=pfet_g5v0d10v5
spiceprefix=X
}
C {devices/iopin.sym} 920 -1830 0 0 {name=VPWR lab=VPWR}
C {devices/iopin.sym} 750 -1830 0 0 {name=GATE1 lab=GATE1}
C {devices/iopin.sym} 680 -1840 0 0 {name=VTUN lab=VTUN}
C {devices/iopin.sym} 550 -1840 0 0 {name=COLSEL1 lab=COLSEL1}
C {devices/iopin.sym} 480 -1850 0 0 {name=VINJ lab=VINJ}
C {devices/iopin.sym} 1030 -1820 0 0 {name=COLSEL2 lab=COLSEL2}
C {devices/iopin.sym} 1260 -1820 0 0 {name=GATE2 lab=GATE2}
C {sky130_fd_pr/pfet_01v8.sym} 1850 -1780 0 0 {name=M18
L=0.15
W=1
nf=1
mult=1
ad="'int((nf+1)/2) * W/nf * 0.29'" 
pd="'2*int((nf+1)/2) * (W/nf + 0.29)'"
as="'int((nf+2)/2) * W/nf * 0.29'" 
ps="'2*int((nf+2)/2) * (W/nf + 0.29)'"
nrd="'0.29 / W'" nrs="'0.29 / W'"
sa=0 sb=0 sd=0
model=pfet_01v8
spiceprefix=X
}
C {sky130_fd_pr/pfet_01v8.sym} 1780 -1780 0 1 {name=M19
L=0.15
W=1
nf=1
mult=1
ad="'int((nf+1)/2) * W/nf * 0.29'" 
pd="'2*int((nf+1)/2) * (W/nf + 0.29)'"
as="'int((nf+2)/2) * W/nf * 0.29'" 
ps="'2*int((nf+2)/2) * (W/nf + 0.29)'"
nrd="'0.29 / W'" nrs="'0.29 / W'"
sa=0 sb=0 sd=0
model=pfet_01v8
spiceprefix=X
}
C {sky130_fd_pr/nfet_01v8.sym} 1850 -1690 0 0 {name=M20
L=0.15
W=1
nf=1 
mult=1
ad="'int((nf+1)/2) * W/nf * 0.29'" 
pd="'2*int((nf+1)/2) * (W/nf + 0.29)'"
as="'int((nf+2)/2) * W/nf * 0.29'" 
ps="'2*int((nf+2)/2) * (W/nf + 0.29)'"
nrd="'0.29 / W'" nrs="'0.29 / W'"
sa=0 sb=0 sd=0
model=nfet_01v8
spiceprefix=X
}
C {sky130_fd_pr/nfet_01v8.sym} 1740 -1640 0 0 {name=M21
L=0.15
W=1
nf=1 
mult=1
ad="'int((nf+1)/2) * W/nf * 0.29'" 
pd="'2*int((nf+1)/2) * (W/nf + 0.29)'"
as="'int((nf+2)/2) * W/nf * 0.29'" 
ps="'2*int((nf+2)/2) * (W/nf + 0.29)'"
nrd="'0.29 / W'" nrs="'0.29 / W'"
sa=0 sb=0 sd=0
model=nfet_01v8
spiceprefix=X
}
C {sky130_fd_pr/nfet_01v8.sym} 1620 -1640 0 1 {name=M22
L=0.15
W=1
nf=1 
mult=1
ad="'int((nf+1)/2) * W/nf * 0.29'" 
pd="'2*int((nf+1)/2) * (W/nf + 0.29)'"
as="'int((nf+2)/2) * W/nf * 0.29'" 
ps="'2*int((nf+2)/2) * (W/nf + 0.29)'"
nrd="'0.29 / W'" nrs="'0.29 / W'"
sa=0 sb=0 sd=0
model=nfet_01v8
spiceprefix=X
}
C {sky130_fd_pr/nfet_01v8.sym} 1690 -1690 0 1 {name=M23
L=0.15
W=1
nf=1 
mult=1
ad="'int((nf+1)/2) * W/nf * 0.29'" 
pd="'2*int((nf+1)/2) * (W/nf + 0.29)'"
as="'int((nf+2)/2) * W/nf * 0.29'" 
ps="'2*int((nf+2)/2) * (W/nf + 0.29)'"
nrd="'0.29 / W'" nrs="'0.29 / W'"
sa=0 sb=0 sd=0
model=nfet_01v8
spiceprefix=X
}
C {devices/iopin.sym} 1910 -1740 0 0 {name=OUTPUT1 lab=OUTPUT1}
C {sky130_fd_pr/pfet_01v8.sym} 1960 -1500 0 0 {name=M24
L=0.15
W=1
nf=1
mult=1
ad="'int((nf+1)/2) * W/nf * 0.29'" 
pd="'2*int((nf+1)/2) * (W/nf + 0.29)'"
as="'int((nf+2)/2) * W/nf * 0.29'" 
ps="'2*int((nf+2)/2) * (W/nf + 0.29)'"
nrd="'0.29 / W'" nrs="'0.29 / W'"
sa=0 sb=0 sd=0
model=pfet_01v8
spiceprefix=X
}
C {sky130_fd_pr/pfet_01v8.sym} 1890 -1500 0 1 {name=M25
L=0.15
W=1
nf=1
mult=1
ad="'int((nf+1)/2) * W/nf * 0.29'" 
pd="'2*int((nf+1)/2) * (W/nf + 0.29)'"
as="'int((nf+2)/2) * W/nf * 0.29'" 
ps="'2*int((nf+2)/2) * (W/nf + 0.29)'"
nrd="'0.29 / W'" nrs="'0.29 / W'"
sa=0 sb=0 sd=0
model=pfet_01v8
spiceprefix=X
}
C {sky130_fd_pr/nfet_01v8.sym} 1960 -1410 0 0 {name=M26
L=0.15
W=1
nf=1 
mult=1
ad="'int((nf+1)/2) * W/nf * 0.29'" 
pd="'2*int((nf+1)/2) * (W/nf + 0.29)'"
as="'int((nf+2)/2) * W/nf * 0.29'" 
ps="'2*int((nf+2)/2) * (W/nf + 0.29)'"
nrd="'0.29 / W'" nrs="'0.29 / W'"
sa=0 sb=0 sd=0
model=nfet_01v8
spiceprefix=X
}
C {sky130_fd_pr/nfet_01v8.sym} 1850 -1360 0 0 {name=M27
L=0.15
W=1
nf=1 
mult=1
ad="'int((nf+1)/2) * W/nf * 0.29'" 
pd="'2*int((nf+1)/2) * (W/nf + 0.29)'"
as="'int((nf+2)/2) * W/nf * 0.29'" 
ps="'2*int((nf+2)/2) * (W/nf + 0.29)'"
nrd="'0.29 / W'" nrs="'0.29 / W'"
sa=0 sb=0 sd=0
model=nfet_01v8
spiceprefix=X
}
C {sky130_fd_pr/nfet_01v8.sym} 1730 -1360 0 1 {name=M28
L=0.15
W=1
nf=1 
mult=1
ad="'int((nf+1)/2) * W/nf * 0.29'" 
pd="'2*int((nf+1)/2) * (W/nf + 0.29)'"
as="'int((nf+2)/2) * W/nf * 0.29'" 
ps="'2*int((nf+2)/2) * (W/nf + 0.29)'"
nrd="'0.29 / W'" nrs="'0.29 / W'"
sa=0 sb=0 sd=0
model=nfet_01v8
spiceprefix=X
}
C {sky130_fd_pr/nfet_01v8.sym} 1800 -1410 0 1 {name=M29
L=0.15
W=1
nf=1 
mult=1
ad="'int((nf+1)/2) * W/nf * 0.29'" 
pd="'2*int((nf+1)/2) * (W/nf + 0.29)'"
as="'int((nf+2)/2) * W/nf * 0.29'" 
ps="'2*int((nf+2)/2) * (W/nf + 0.29)'"
nrd="'0.29 / W'" nrs="'0.29 / W'"
sa=0 sb=0 sd=0
model=nfet_01v8
spiceprefix=X
}
C {devices/iopin.sym} 2020 -1460 0 0 {name=OUTPUT2 lab=OUTPUT2}
C {devices/iopin.sym} 1160 -1770 0 0 {name=VIN11 lab=VIN11}
C {devices/iopin.sym} 1550 -1360 0 0 {name=VIN21 lab=VIN21}
C {devices/iopin.sym} 1120 -1540 0 0 {name=VIN12 lab=VIN12}
C {devices/iopin.sym} 1730 -1470 0 0 {name=VIN22 lab=VIN22}
C {sky130_fd_pr/pfet_g5v0d10v5.sym} 1580 -1420 0 0 {name=M13
L=0.5
W=1
nf=1
mult=1
ad="'int((nf+1)/2) * W/nf * 0.29'" 
pd="'2*int((nf+1)/2) * (W/nf + 0.29)'"
as="'int((nf+2)/2) * W/nf * 0.29'" 
ps="'2*int((nf+2)/2) * (W/nf + 0.29)'"
nrd="'0.29 / W'" nrs="'0.29 / W'"
sa=0 sb=0 sd=0
model=pfet_g5v0d10v5
spiceprefix=X
}
C {sky130_fd_pr/pfet_g5v0d10v5.sym} 1700 -1470 0 1 {name=M14
L=0.5
W=1
nf=1
mult=1
ad="'int((nf+1)/2) * W/nf * 0.29'" 
pd="'2*int((nf+1)/2) * (W/nf + 0.29)'"
as="'int((nf+2)/2) * W/nf * 0.29'" 
ps="'2*int((nf+2)/2) * (W/nf + 0.29)'"
nrd="'0.29 / W'" nrs="'0.29 / W'"
sa=0 sb=0 sd=0
model=pfet_g5v0d10v5
spiceprefix=X
}
C {devices/gnd.sym} 1800 -1330 0 0 {name=l1 lab=VGND}
C {devices/gnd.sym} 1710 -1610 0 0 {name=l2 lab=VGND}
C {devices/iopin.sym} 1840 -1290 0 0 {name=p1 lab=VGND}
C {sky130_fd_pr/cap_mim_m3_1.sym} 1880 -1600 0 0 {name=C11 model=cap_mim_m3_1 W=8 L=5 MF=1 spiceprefix=X}
C {/home/hilas/fastlane/pdks/open_pdks/sky130/sky130A/libs.tech/xschem/sky130_fd_pr/cap_mim_m3_1.sym} 1980 -1600 0 0 {name=C12 model=cap_mim_m3_1 W=2 L=2 MF=1 spiceprefix=X}
C {devices/iopin.sym} 1860 -1630 2 0 {name=VIN lab=VIN}
C {devices/iopin.sym} 430 -1600 2 0 {name=DRAIN1 lab=DRAIN1}
C {devices/iopin.sym} 430 -1340 2 0 {name=DRAIN2 lab=DRAIN2}
