v {xschem version=2.9.9 file_version=1.2 }
G {}
K {}
V {}
S {}
E {}
N 950 -240 1160 -240 { lab=#net1}
N 950 -210 1160 -210 { lab=#net2}
N 950 -180 1160 -180 { lab=#net3}
N 980 -420 1160 -420 { lab=#net4}
N 980 -420 980 -350 { lab=#net4}
N 950 -350 980 -350 { lab=#net4}
N 970 -450 1160 -450 { lab=#net5}
N 970 -450 970 -380 { lab=#net5}
N 950 -380 970 -380 { lab=#net5}
N 960 -480 1160 -480 { lab=#net6}
N 960 -480 960 -410 { lab=#net6}
N 950 -410 960 -410 { lab=#net6}
N 1730 -720 1800 -720 { lab=#net7}
N 1160 -240 1340 -240 { lab=#net1}
N 1160 -210 1340 -210 { lab=#net2}
N 1160 -180 1340 -180 { lab=#net3}
N 1160 -480 1340 -480 { lab=#net6}
N 1160 -450 1340 -450 { lab=#net5}
N 1160 -420 1340 -420 { lab=#net4}
N 1160 -660 1340 -660 { lab=#net8}
N 1160 -690 1340 -690 { lab=#net9}
N 1090 -720 1270 -720 { lab=#net7}
N 950 -520 980 -520 { lab=#net8}
N 950 -550 970 -550 { lab=#net9}
N 950 -580 960 -580 { lab=#net7}
N 980 -760 980 -690 { lab=#net10}
N 950 -690 980 -690 { lab=#net10}
N 970 -790 970 -720 { lab=#net11}
N 950 -720 970 -720 { lab=#net11}
N 960 -820 960 -750 { lab=#net12}
N 950 -750 960 -750 { lab=#net12}
N 1000 -660 1160 -660 { lab=#net8}
N 1000 -660 1000 -590 { lab=#net8}
N 1020 -690 1160 -690 { lab=#net9}
N 1020 -690 1020 -620 { lab=#net9}
N 990 -720 1090 -720 { lab=#net7}
N 990 -720 990 -650 { lab=#net7}
N 1000 -590 1000 -520 { lab=#net8}
N 980 -520 1000 -520 { lab=#net8}
N 1020 -620 1020 -550 { lab=#net9}
N 970 -550 1020 -550 { lab=#net9}
N 990 -650 990 -580 { lab=#net7}
N 960 -580 990 -580 { lab=#net7}
N 980 -900 1340 -900 { lab=#net10}
N 980 -900 980 -760 { lab=#net10}
N 970 -930 1340 -930 { lab=#net11}
N 970 -930 970 -790 { lab=#net11}
N 960 -820 990 -820 { lab=#net12}
N 990 -950 990 -820 { lab=#net12}
N 990 -960 990 -950 { lab=#net12}
N 990 -960 1340 -960 { lab=#net12}
N 1060 -1200 1340 -1200 { lab=#net13}
N 1020 -1140 1340 -1140 { lab=#net14}
N 1020 -1140 1020 -890 { lab=#net14}
N 1030 -1170 1340 -1170 { lab=#net15}
N 1020 -890 1020 -860 { lab=#net14}
N 950 -860 1020 -860 { lab=#net14}
N 950 -910 950 -890 { lab=#net15}
N 950 -910 1030 -910 { lab=#net15}
N 1030 -1170 1030 -910 { lab=#net15}
N 1010 -1200 1060 -1200 { lab=#net13}
N 1010 -1200 1010 -920 { lab=#net13}
N 950 -920 1010 -920 { lab=#net13}
N 2300 -240 2560 -240 { lab=#net16}
N 2300 -210 2560 -210 { lab=#net17}
N 2300 -180 2560 -180 { lab=#net18}
N 2230 -310 3060 -310 { lab=#net19}
N 2230 -290 2230 -280 { lab=#net19}
N 2300 -480 2560 -480 { lab=#net20}
N 2300 -450 2560 -450 { lab=#net21}
N 2300 -420 2560 -420 { lab=#net22}
N 2230 -530 3060 -530 { lab=#net23}
N 2230 -530 2230 -520 { lab=#net23}
N 2300 -720 2560 -720 { lab=#net24}
N 2300 -690 2560 -690 { lab=#net25}
N 2300 -660 2560 -660 { lab=#net26}
N 2230 -770 3060 -770 { lab=#net27}
N 2230 -770 2230 -760 { lab=#net27}
N 2300 -960 2560 -960 { lab=#net28}
N 2300 -930 2560 -930 { lab=#net29}
N 2300 -900 2560 -900 { lab=#net30}
N 2230 -1010 3060 -1010 { lab=#net31}
N 2230 -1010 2230 -1000 { lab=#net31}
N 2300 -1200 2560 -1200 { lab=#net32}
N 2300 -1170 2560 -1170 { lab=#net33}
N 2300 -1140 2560 -1140 { lab=#net34}
N 2230 -1250 3060 -1250 { lab=#net35}
N 2230 -1250 2230 -1240 { lab=#net35}
N 2300 -1440 2560 -1440 { lab=#net36}
N 2300 -1410 2560 -1410 { lab=#net37}
N 2300 -1380 2560 -1380 { lab=#net38}
N 2230 -1490 3060 -1490 { lab=#net39}
N 2230 -1490 2230 -1480 { lab=#net39}
N 2300 -1680 2560 -1680 { lab=#net40}
N 2300 -1650 2560 -1650 { lab=#net41}
N 2300 -1620 2560 -1620 { lab=#net42}
N 2230 -1730 3060 -1730 { lab=#net43}
N 2230 -1730 2230 -1720 { lab=#net43}
N 2300 -1920 2560 -1920 { lab=#net44}
N 2300 -1890 2560 -1890 { lab=#net45}
N 2300 -1860 2560 -1860 { lab=#net46}
N 2230 -1970 3060 -1970 { lab=#net47}
N 2230 -1970 2230 -1960 { lab=#net47}
N 2300 -2160 2560 -2160 { lab=#net48}
N 2300 -2130 2560 -2130 { lab=#net49}
N 2300 -2100 2560 -2100 { lab=#net50}
N 3060 -2210 3060 -2160 { lab=#net51}
N 2230 -2210 3060 -2210 { lab=#net51}
N 2230 -2210 2230 -2200 { lab=#net51}
N 2300 -2400 2560 -2400 { lab=#net52}
N 2300 -2370 2560 -2370 { lab=#net53}
N 2300 -2340 2560 -2340 { lab=#net54}
N 3060 -2450 3060 -2400 { lab=#net55}
N 2230 -2450 3060 -2450 { lab=#net55}
N 2230 -2450 2230 -2440 { lab=#net55}
N 2300 -2640 2560 -2640 { lab=#net56}
N 2300 -2610 2560 -2610 { lab=#net57}
N 2300 -2580 2560 -2580 { lab=#net58}
N 3060 -2690 3060 -2640 { lab=#net59}
N 2230 -2690 3060 -2690 { lab=#net59}
N 2230 -2690 2230 -2680 { lab=#net59}
N 2300 -2880 2560 -2880 { lab=#net60}
N 2300 -2850 2560 -2850 { lab=#net61}
N 2300 -2820 2560 -2820 { lab=#net62}
N 3060 -2930 3060 -2880 { lab=#net63}
N 2230 -2930 3060 -2930 { lab=#net63}
N 2230 -2930 2230 -2920 { lab=#net63}
N 2300 -3120 2560 -3120 { lab=#net64}
N 2300 -3090 2560 -3090 { lab=#net65}
N 2300 -3060 2560 -3060 { lab=#net66}
N 3060 -3170 3060 -3120 { lab=#net67}
N 2230 -3170 3060 -3170 { lab=#net67}
N 2230 -3170 2230 -3160 { lab=#net67}
N 2300 -3360 2560 -3360 { lab=#net68}
N 2300 -3330 2560 -3330 { lab=#net69}
N 2300 -3300 2560 -3300 { lab=#net70}
N 3060 -3410 3060 -3360 { lab=#net71}
N 2230 -3410 3060 -3410 { lab=#net71}
N 2230 -3410 2230 -3400 { lab=#net71}
N 2300 -3600 2560 -3600 { lab=#net72}
N 2300 -3570 2560 -3570 { lab=#net73}
N 2300 -3540 2560 -3540 { lab=#net74}
N 3060 -3650 3060 -3600 { lab=#net75}
N 2230 -3650 3060 -3650 { lab=#net75}
N 2230 -3650 2230 -3640 { lab=#net75}
N 2300 -3840 2560 -3840 { lab=#net76}
N 2300 -3810 2560 -3810 { lab=#net77}
N 2300 -3780 2560 -3780 { lab=#net78}
N 3060 -3890 3060 -3840 { lab=#net79}
N 2230 -3890 3060 -3890 { lab=#net79}
N 2230 -3890 2230 -3880 { lab=#net79}
N 2230 -310 2230 -290 { lab=#net19}
N 3060 -240 3320 -240 { lab=#net19}
N 3060 -210 3320 -210 { lab=#net80}
N 3060 -180 3320 -180 { lab=#net81}
N 2990 -280 3040 -280 { lab=#net82}
N 3040 -280 3040 -260 { lab=#net82}
N 3040 -260 3820 -260 { lab=#net82}
N 3820 -260 3820 -240 { lab=#net82}
N 3060 -480 3320 -480 { lab=#net23}
N 3060 -450 3320 -450 { lab=#net83}
N 3060 -420 3320 -420 { lab=#net84}
N 2990 -520 3040 -520 { lab=#net85}
N 3040 -520 3040 -500 { lab=#net85}
N 3040 -500 3820 -500 { lab=#net85}
N 3820 -500 3820 -480 { lab=#net85}
N 3060 -720 3320 -720 { lab=#net27}
N 3060 -690 3320 -690 { lab=#net86}
N 3060 -660 3320 -660 { lab=#net87}
N 2990 -760 3040 -760 { lab=#net88}
N 3040 -760 3040 -740 { lab=#net88}
N 3040 -740 3820 -740 { lab=#net88}
N 3820 -740 3820 -720 { lab=#net88}
N 3060 -960 3320 -960 { lab=#net31}
N 3060 -930 3320 -930 { lab=#net89}
N 3060 -900 3320 -900 { lab=#net90}
N 2990 -1000 3040 -1000 { lab=#net91}
N 3040 -1000 3040 -980 { lab=#net91}
N 3040 -980 3820 -980 { lab=#net91}
N 3820 -980 3820 -960 { lab=#net91}
N 3060 -1200 3320 -1200 { lab=#net35}
N 3060 -1170 3320 -1170 { lab=#net92}
N 3060 -1140 3320 -1140 { lab=#net93}
N 2990 -1240 3040 -1240 { lab=#net94}
N 3040 -1240 3040 -1220 { lab=#net94}
N 3040 -1220 3820 -1220 { lab=#net94}
N 3820 -1220 3820 -1200 { lab=#net94}
N 3060 -1440 3320 -1440 { lab=#net39}
N 3060 -1410 3320 -1410 { lab=#net95}
N 3060 -1380 3320 -1380 { lab=#net96}
N 2990 -1480 3040 -1480 { lab=#net97}
N 3040 -1480 3040 -1460 { lab=#net97}
N 3040 -1460 3820 -1460 { lab=#net97}
N 3820 -1460 3820 -1440 { lab=#net97}
N 3060 -1680 3320 -1680 { lab=#net43}
N 3060 -1650 3320 -1650 { lab=#net98}
N 3060 -1620 3320 -1620 { lab=#net99}
N 2990 -1720 3040 -1720 { lab=#net100}
N 3040 -1720 3040 -1700 { lab=#net100}
N 3040 -1700 3820 -1700 { lab=#net100}
N 3820 -1700 3820 -1680 { lab=#net100}
N 3060 -1920 3320 -1920 { lab=#net47}
N 3060 -1890 3320 -1890 { lab=#net101}
N 3060 -1860 3320 -1860 { lab=#net102}
N 2990 -1960 3040 -1960 { lab=#net103}
N 3040 -1960 3040 -1940 { lab=#net103}
N 3040 -1940 3820 -1940 { lab=#net103}
N 3820 -1940 3820 -1920 { lab=#net103}
N 3060 -2160 3320 -2160 { lab=#net51}
N 3060 -2130 3320 -2130 { lab=#net104}
N 3060 -2100 3320 -2100 { lab=#net105}
N 2990 -2200 3040 -2200 { lab=#net106}
N 3040 -2200 3040 -2180 { lab=#net106}
N 3040 -2180 3820 -2180 { lab=#net106}
N 3820 -2180 3820 -2160 { lab=#net106}
N 3060 -2400 3320 -2400 { lab=#net55}
N 3060 -2370 3320 -2370 { lab=#net107}
N 3060 -2340 3320 -2340 { lab=#net108}
N 2990 -2440 3040 -2440 { lab=#net109}
N 3040 -2440 3040 -2420 { lab=#net109}
N 3040 -2420 3820 -2420 { lab=#net109}
N 3820 -2420 3820 -2400 { lab=#net109}
N 3060 -2640 3320 -2640 { lab=#net59}
N 3060 -2610 3320 -2610 { lab=#net110}
N 3060 -2580 3320 -2580 { lab=#net111}
N 2990 -2680 3040 -2680 { lab=#net112}
N 3040 -2680 3040 -2660 { lab=#net112}
N 3040 -2660 3820 -2660 { lab=#net112}
N 3820 -2660 3820 -2640 { lab=#net112}
N 3060 -2880 3320 -2880 { lab=#net63}
N 3060 -2850 3320 -2850 { lab=#net113}
N 3060 -2820 3320 -2820 { lab=#net114}
N 2990 -2920 3040 -2920 { lab=#net115}
N 3040 -2920 3040 -2900 { lab=#net115}
N 3040 -2900 3820 -2900 { lab=#net115}
N 3820 -2900 3820 -2880 { lab=#net115}
N 3060 -3120 3320 -3120 { lab=#net67}
N 3060 -3090 3320 -3090 { lab=#net116}
N 3060 -3060 3320 -3060 { lab=#net117}
N 2990 -3160 3040 -3160 { lab=#net118}
N 3040 -3160 3040 -3140 { lab=#net118}
N 3040 -3140 3820 -3140 { lab=#net118}
N 3820 -3140 3820 -3120 { lab=#net118}
N 3060 -3360 3320 -3360 { lab=#net71}
N 3060 -3330 3320 -3330 { lab=#net119}
N 3060 -3300 3320 -3300 { lab=#net120}
N 2990 -3400 3040 -3400 { lab=#net121}
N 3040 -3400 3040 -3380 { lab=#net121}
N 3040 -3380 3820 -3380 { lab=#net121}
N 3820 -3380 3820 -3360 { lab=#net121}
N 3060 -3600 3320 -3600 { lab=#net75}
N 3060 -3570 3320 -3570 { lab=#net122}
N 3060 -3540 3320 -3540 { lab=#net123}
N 2990 -3640 3040 -3640 { lab=#net124}
N 3040 -3640 3040 -3620 { lab=#net124}
N 3040 -3620 3820 -3620 { lab=#net124}
N 3820 -3620 3820 -3600 { lab=#net124}
N 3060 -3840 3320 -3840 { lab=#net79}
N 3060 -3810 3320 -3810 { lab=#net125}
N 3060 -3780 3320 -3780 { lab=#net126}
N 2990 -3880 3040 -3880 { lab=#net127}
N 3040 -3880 3040 -3860 { lab=#net127}
N 3040 -3860 3820 -3860 { lab=#net127}
N 3820 -3860 3820 -3840 { lab=#net127}
N 3060 -310 3060 -240 { lab=#net19}
N 3060 -530 3060 -480 { lab=#net23}
N 3060 -770 3060 -720 { lab=#net27}
N 3060 -1010 3060 -960 { lab=#net31}
N 3060 -1250 3060 -1200 { lab=#net35}
N 3060 -1490 3060 -1440 { lab=#net39}
N 3060 -1730 3060 -1680 { lab=#net43}
N 3060 -1970 3060 -1920 { lab=#net47}
N 3820 -240 4080 -240 { lab=#net82}
N 3820 -210 4080 -210 { lab=#net128}
N 3820 -180 4080 -180 { lab=#net129}
N 3750 -310 4580 -310 { lab=#net130}
N 3750 -290 3750 -280 { lab=#net130}
N 3820 -480 4080 -480 { lab=#net85}
N 3820 -450 4080 -450 { lab=#net131}
N 3820 -420 4080 -420 { lab=#net132}
N 3750 -530 4580 -530 { lab=#net133}
N 3750 -530 3750 -520 { lab=#net133}
N 3820 -720 4080 -720 { lab=#net88}
N 3820 -690 4080 -690 { lab=#net134}
N 3820 -660 4080 -660 { lab=#net135}
N 3750 -770 4580 -770 { lab=#net136}
N 3750 -770 3750 -760 { lab=#net136}
N 3820 -960 4080 -960 { lab=#net91}
N 3820 -930 4080 -930 { lab=#net137}
N 3820 -900 4080 -900 { lab=#net138}
N 3750 -1010 4580 -1010 { lab=#net139}
N 3750 -1010 3750 -1000 { lab=#net139}
N 3820 -1200 4080 -1200 { lab=#net94}
N 3820 -1170 4080 -1170 { lab=#net140}
N 3820 -1140 4080 -1140 { lab=#net141}
N 3750 -1250 4580 -1250 { lab=#net142}
N 3750 -1250 3750 -1240 { lab=#net142}
N 3820 -1440 4080 -1440 { lab=#net97}
N 3820 -1410 4080 -1410 { lab=#net143}
N 3820 -1380 4080 -1380 { lab=#net144}
N 3750 -1490 4580 -1490 { lab=#net145}
N 3750 -1490 3750 -1480 { lab=#net145}
N 3820 -1680 4080 -1680 { lab=#net100}
N 3820 -1650 4080 -1650 { lab=#net146}
N 3820 -1620 4080 -1620 { lab=#net147}
N 3750 -1730 4580 -1730 { lab=#net148}
N 3750 -1730 3750 -1720 { lab=#net148}
N 3820 -1920 4080 -1920 { lab=#net103}
N 3820 -1890 4080 -1890 { lab=#net149}
N 3820 -1860 4080 -1860 { lab=#net150}
N 3750 -1970 4580 -1970 { lab=#net151}
N 3750 -1970 3750 -1960 { lab=#net151}
N 3820 -2160 4080 -2160 { lab=#net106}
N 3820 -2130 4080 -2130 { lab=#net152}
N 3820 -2100 4080 -2100 { lab=#net153}
N 4580 -2210 4580 -2160 { lab=#net154}
N 3750 -2210 4580 -2210 { lab=#net154}
N 3750 -2210 3750 -2200 { lab=#net154}
N 3820 -2400 4080 -2400 { lab=#net109}
N 3820 -2370 4080 -2370 { lab=#net155}
N 3820 -2340 4080 -2340 { lab=#net156}
N 4580 -2450 4580 -2400 { lab=#net157}
N 3750 -2450 4580 -2450 { lab=#net157}
N 3750 -2450 3750 -2440 { lab=#net157}
N 3820 -2640 4080 -2640 { lab=#net112}
N 3820 -2610 4080 -2610 { lab=#net158}
N 3820 -2580 4080 -2580 { lab=#net159}
N 4580 -2690 4580 -2640 { lab=#net160}
N 3750 -2690 4580 -2690 { lab=#net160}
N 3750 -2690 3750 -2680 { lab=#net160}
N 3820 -2880 4080 -2880 { lab=#net115}
N 3820 -2850 4080 -2850 { lab=#net161}
N 3820 -2820 4080 -2820 { lab=#net162}
N 4580 -2930 4580 -2880 { lab=#net163}
N 3750 -2930 4580 -2930 { lab=#net163}
N 3750 -2930 3750 -2920 { lab=#net163}
N 3820 -3120 4080 -3120 { lab=#net118}
N 3820 -3090 4080 -3090 { lab=#net164}
N 3820 -3060 4080 -3060 { lab=#net165}
N 4580 -3170 4580 -3120 { lab=#net166}
N 3750 -3170 4580 -3170 { lab=#net166}
N 3750 -3170 3750 -3160 { lab=#net166}
N 3820 -3360 4080 -3360 { lab=#net121}
N 3820 -3330 4080 -3330 { lab=#net167}
N 3820 -3300 4080 -3300 { lab=#net168}
N 4580 -3410 4580 -3360 { lab=#net169}
N 3750 -3410 4580 -3410 { lab=#net169}
N 3750 -3410 3750 -3400 { lab=#net169}
N 3820 -3600 4080 -3600 { lab=#net124}
N 3820 -3570 4080 -3570 { lab=#net170}
N 3820 -3540 4080 -3540 { lab=#net171}
N 4580 -3650 4580 -3600 { lab=#net172}
N 3750 -3650 4580 -3650 { lab=#net172}
N 3750 -3650 3750 -3640 { lab=#net172}
N 3820 -3840 4080 -3840 { lab=#net127}
N 3820 -3810 4080 -3810 { lab=#net173}
N 3820 -3780 4080 -3780 { lab=#net174}
N 4580 -3890 4580 -3840 { lab=#net175}
N 3750 -3890 4580 -3890 { lab=#net175}
N 3750 -3890 3750 -3880 { lab=#net175}
N 3750 -310 3750 -290 { lab=#net130}
N 4580 -240 4840 -240 { lab=#net130}
N 4580 -210 4840 -210 { lab=#net176}
N 4580 -180 4840 -180 { lab=#net177}
N 4510 -280 4560 -280 { lab=#net178}
N 4560 -280 4560 -260 { lab=#net178}
N 4560 -260 5340 -260 { lab=#net178}
N 5340 -260 5340 -240 { lab=#net178}
N 4580 -480 4840 -480 { lab=#net133}
N 4580 -450 4840 -450 { lab=#net179}
N 4580 -420 4840 -420 { lab=#net180}
N 4510 -520 4560 -520 { lab=#net181}
N 4560 -520 4560 -500 { lab=#net181}
N 4560 -500 5340 -500 { lab=#net181}
N 5340 -500 5340 -480 { lab=#net181}
N 4580 -720 4840 -720 { lab=#net136}
N 4580 -690 4840 -690 { lab=#net182}
N 4580 -660 4840 -660 { lab=#net183}
N 4510 -760 4560 -760 { lab=#net184}
N 4560 -760 4560 -740 { lab=#net184}
N 4560 -740 5340 -740 { lab=#net184}
N 5340 -740 5340 -720 { lab=#net184}
N 4580 -960 4840 -960 { lab=#net139}
N 4580 -930 4840 -930 { lab=#net185}
N 4580 -900 4840 -900 { lab=#net186}
N 4510 -1000 4560 -1000 { lab=#net187}
N 4560 -1000 4560 -980 { lab=#net187}
N 4560 -980 5340 -980 { lab=#net187}
N 5340 -980 5340 -960 { lab=#net187}
N 4580 -1200 4840 -1200 { lab=#net142}
N 4580 -1170 4840 -1170 { lab=#net188}
N 4580 -1140 4840 -1140 { lab=#net189}
N 4510 -1240 4560 -1240 { lab=#net190}
N 4560 -1240 4560 -1220 { lab=#net190}
N 4560 -1220 5340 -1220 { lab=#net190}
N 5340 -1220 5340 -1200 { lab=#net190}
N 4580 -1440 4840 -1440 { lab=#net145}
N 4580 -1410 4840 -1410 { lab=#net191}
N 4580 -1380 4840 -1380 { lab=#net192}
N 4510 -1480 4560 -1480 { lab=#net193}
N 4560 -1480 4560 -1460 { lab=#net193}
N 4560 -1460 5340 -1460 { lab=#net193}
N 5340 -1460 5340 -1440 { lab=#net193}
N 4580 -1680 4840 -1680 { lab=#net148}
N 4580 -1650 4840 -1650 { lab=#net194}
N 4580 -1620 4840 -1620 { lab=#net195}
N 4510 -1720 4560 -1720 { lab=#net196}
N 4560 -1720 4560 -1700 { lab=#net196}
N 4560 -1700 5340 -1700 { lab=#net196}
N 5340 -1700 5340 -1680 { lab=#net196}
N 4580 -1920 4840 -1920 { lab=#net151}
N 4580 -1890 4840 -1890 { lab=#net197}
N 4580 -1860 4840 -1860 { lab=#net198}
N 4510 -1960 4560 -1960 { lab=#net199}
N 4560 -1960 4560 -1940 { lab=#net199}
N 4560 -1940 5340 -1940 { lab=#net199}
N 5340 -1940 5340 -1920 { lab=#net199}
N 4580 -2160 4840 -2160 { lab=#net154}
N 4580 -2130 4840 -2130 { lab=#net200}
N 4580 -2100 4840 -2100 { lab=#net201}
N 4510 -2200 4560 -2200 { lab=#net202}
N 4560 -2200 4560 -2180 { lab=#net202}
N 4560 -2180 5340 -2180 { lab=#net202}
N 5340 -2180 5340 -2160 { lab=#net202}
N 4580 -2400 4840 -2400 { lab=#net157}
N 4580 -2370 4840 -2370 { lab=#net203}
N 4580 -2340 4840 -2340 { lab=#net204}
N 4510 -2440 4560 -2440 { lab=#net205}
N 4560 -2440 4560 -2420 { lab=#net205}
N 4560 -2420 5340 -2420 { lab=#net205}
N 5340 -2420 5340 -2400 { lab=#net205}
N 4580 -2640 4840 -2640 { lab=#net160}
N 4580 -2610 4840 -2610 { lab=#net206}
N 4580 -2580 4840 -2580 { lab=#net207}
N 4510 -2680 4560 -2680 { lab=#net208}
N 4560 -2680 4560 -2660 { lab=#net208}
N 4560 -2660 5340 -2660 { lab=#net208}
N 5340 -2660 5340 -2640 { lab=#net208}
N 4580 -2880 4840 -2880 { lab=#net163}
N 4580 -2850 4840 -2850 { lab=#net209}
N 4580 -2820 4840 -2820 { lab=#net210}
N 4510 -2920 4560 -2920 { lab=#net211}
N 4560 -2920 4560 -2900 { lab=#net211}
N 4560 -2900 5340 -2900 { lab=#net211}
N 5340 -2900 5340 -2880 { lab=#net211}
N 4580 -3120 4840 -3120 { lab=#net166}
N 4580 -3090 4840 -3090 { lab=#net212}
N 4580 -3060 4840 -3060 { lab=#net213}
N 4510 -3160 4560 -3160 { lab=#net214}
N 4560 -3160 4560 -3140 { lab=#net214}
N 4560 -3140 5340 -3140 { lab=#net214}
N 5340 -3140 5340 -3120 { lab=#net214}
N 4580 -3360 4840 -3360 { lab=#net169}
N 4580 -3330 4840 -3330 { lab=#net215}
N 4580 -3300 4840 -3300 { lab=#net216}
N 4510 -3400 4560 -3400 { lab=#net217}
N 4560 -3400 4560 -3380 { lab=#net217}
N 4560 -3380 5340 -3380 { lab=#net217}
N 5340 -3380 5340 -3360 { lab=#net217}
N 4580 -3600 4840 -3600 { lab=#net172}
N 4580 -3570 4840 -3570 { lab=#net218}
N 4580 -3540 4840 -3540 { lab=#net219}
N 4510 -3640 4560 -3640 { lab=#net220}
N 4560 -3640 4560 -3620 { lab=#net220}
N 4560 -3620 5340 -3620 { lab=#net220}
N 5340 -3620 5340 -3600 { lab=#net220}
N 4580 -3840 4840 -3840 { lab=#net175}
N 4580 -3810 4840 -3810 { lab=#net221}
N 4580 -3780 4840 -3780 { lab=#net222}
N 4510 -3880 4560 -3880 { lab=#net223}
N 4560 -3880 4560 -3860 { lab=#net223}
N 4560 -3860 5340 -3860 { lab=#net223}
N 5340 -3860 5340 -3840 { lab=#net223}
N 4580 -310 4580 -240 { lab=#net130}
N 4580 -530 4580 -480 { lab=#net133}
N 4580 -770 4580 -720 { lab=#net136}
N 4580 -1010 4580 -960 { lab=#net139}
N 4580 -1250 4580 -1200 { lab=#net142}
N 4580 -1490 4580 -1440 { lab=#net145}
N 4580 -1730 4580 -1680 { lab=#net148}
N 4580 -1970 4580 -1920 { lab=#net151}
N 5340 -240 5600 -240 { lab=#net178}
N 5340 -210 5600 -210 { lab=#net224}
N 5340 -180 5600 -180 { lab=#net225}
N 5270 -310 6100 -310 { lab=#net226}
N 5270 -290 5270 -280 { lab=#net226}
N 5340 -480 5600 -480 { lab=#net181}
N 5340 -450 5600 -450 { lab=#net227}
N 5340 -420 5600 -420 { lab=#net228}
N 5270 -530 6100 -530 { lab=#net229}
N 5270 -530 5270 -520 { lab=#net229}
N 5340 -720 5600 -720 { lab=#net184}
N 5340 -690 5600 -690 { lab=#net230}
N 5340 -660 5600 -660 { lab=#net231}
N 5270 -770 6100 -770 { lab=#net232}
N 5270 -770 5270 -760 { lab=#net232}
N 5340 -960 5600 -960 { lab=#net187}
N 5340 -930 5600 -930 { lab=#net233}
N 5340 -900 5600 -900 { lab=#net234}
N 5270 -1010 6100 -1010 { lab=#net235}
N 5270 -1010 5270 -1000 { lab=#net235}
N 5340 -1200 5600 -1200 { lab=#net190}
N 5340 -1170 5600 -1170 { lab=#net236}
N 5340 -1140 5600 -1140 { lab=#net237}
N 5270 -1250 6100 -1250 { lab=#net238}
N 5270 -1250 5270 -1240 { lab=#net238}
N 5340 -1440 5600 -1440 { lab=#net193}
N 5340 -1410 5600 -1410 { lab=#net239}
N 5340 -1380 5600 -1380 { lab=#net240}
N 5270 -1490 6100 -1490 { lab=#net241}
N 5270 -1490 5270 -1480 { lab=#net241}
N 5340 -1680 5600 -1680 { lab=#net196}
N 5340 -1650 5600 -1650 { lab=#net242}
N 5340 -1620 5600 -1620 { lab=#net243}
N 5270 -1730 6100 -1730 { lab=#net244}
N 5270 -1730 5270 -1720 { lab=#net244}
N 5340 -1920 5600 -1920 { lab=#net199}
N 5340 -1890 5600 -1890 { lab=#net245}
N 5340 -1860 5600 -1860 { lab=#net246}
N 5270 -1970 6100 -1970 { lab=#net247}
N 5270 -1970 5270 -1960 { lab=#net247}
N 5340 -2160 5600 -2160 { lab=#net202}
N 5340 -2130 5600 -2130 { lab=#net248}
N 5340 -2100 5600 -2100 { lab=#net249}
N 6100 -2210 6100 -2160 { lab=#net250}
N 5270 -2210 6100 -2210 { lab=#net250}
N 5270 -2210 5270 -2200 { lab=#net250}
N 5340 -2400 5600 -2400 { lab=#net205}
N 5340 -2370 5600 -2370 { lab=#net251}
N 5340 -2340 5600 -2340 { lab=#net252}
N 6100 -2450 6100 -2400 { lab=#net253}
N 5270 -2450 6100 -2450 { lab=#net253}
N 5270 -2450 5270 -2440 { lab=#net253}
N 5340 -2640 5600 -2640 { lab=#net208}
N 5340 -2610 5600 -2610 { lab=#net254}
N 5340 -2580 5600 -2580 { lab=#net255}
N 6100 -2690 6100 -2640 { lab=#net256}
N 5270 -2690 6100 -2690 { lab=#net256}
N 5270 -2690 5270 -2680 { lab=#net256}
N 5340 -2880 5600 -2880 { lab=#net211}
N 5340 -2850 5600 -2850 { lab=#net257}
N 5340 -2820 5600 -2820 { lab=#net258}
N 6100 -2930 6100 -2880 { lab=#net259}
N 5270 -2930 6100 -2930 { lab=#net259}
N 5270 -2930 5270 -2920 { lab=#net259}
N 5340 -3120 5600 -3120 { lab=#net214}
N 5340 -3090 5600 -3090 { lab=#net260}
N 5340 -3060 5600 -3060 { lab=#net261}
N 6100 -3170 6100 -3120 { lab=#net262}
N 5270 -3170 6100 -3170 { lab=#net262}
N 5270 -3170 5270 -3160 { lab=#net262}
N 5340 -3360 5600 -3360 { lab=#net217}
N 5340 -3330 5600 -3330 { lab=#net263}
N 5340 -3300 5600 -3300 { lab=#net264}
N 6100 -3410 6100 -3360 { lab=#net265}
N 5270 -3410 6100 -3410 { lab=#net265}
N 5270 -3410 5270 -3400 { lab=#net265}
N 5340 -3600 5600 -3600 { lab=#net220}
N 5340 -3570 5600 -3570 { lab=#net266}
N 5340 -3540 5600 -3540 { lab=#net267}
N 6100 -3650 6100 -3600 { lab=#net268}
N 5270 -3650 6100 -3650 { lab=#net268}
N 5270 -3650 5270 -3640 { lab=#net268}
N 5340 -3840 5600 -3840 { lab=#net223}
N 5340 -3810 5600 -3810 { lab=#net269}
N 5340 -3780 5600 -3780 { lab=#net270}
N 6100 -3890 6100 -3840 { lab=#net271}
N 5270 -3890 6100 -3890 { lab=#net271}
N 5270 -3890 5270 -3880 { lab=#net271}
N 5270 -310 5270 -290 { lab=#net226}
N 6100 -240 6360 -240 { lab=#net226}
N 6100 -210 6360 -210 { lab=#net272}
N 6100 -180 6360 -180 { lab=#net273}
N 6030 -280 6080 -280 { lab=#net274}
N 6080 -280 6080 -260 { lab=#net274}
N 6080 -260 6860 -260 { lab=#net274}
N 6860 -260 6860 -240 { lab=#net274}
N 6100 -480 6360 -480 { lab=#net229}
N 6100 -450 6360 -450 { lab=#net275}
N 6100 -420 6360 -420 { lab=#net276}
N 6030 -520 6080 -520 { lab=#net277}
N 6080 -520 6080 -500 { lab=#net277}
N 6080 -500 6860 -500 { lab=#net277}
N 6860 -500 6860 -480 { lab=#net277}
N 6100 -720 6360 -720 { lab=#net232}
N 6100 -690 6360 -690 { lab=#net278}
N 6100 -660 6360 -660 { lab=#net279}
N 6030 -760 6080 -760 { lab=#net280}
N 6080 -760 6080 -740 { lab=#net280}
N 6080 -740 6860 -740 { lab=#net280}
N 6860 -740 6860 -720 { lab=#net280}
N 6100 -960 6360 -960 { lab=#net235}
N 6100 -930 6360 -930 { lab=#net281}
N 6100 -900 6360 -900 { lab=#net282}
N 6030 -1000 6080 -1000 { lab=#net283}
N 6080 -1000 6080 -980 { lab=#net283}
N 6080 -980 6860 -980 { lab=#net283}
N 6860 -980 6860 -960 { lab=#net283}
N 6100 -1200 6360 -1200 { lab=#net238}
N 6100 -1170 6360 -1170 { lab=#net284}
N 6100 -1140 6360 -1140 { lab=#net285}
N 6030 -1240 6080 -1240 { lab=#net286}
N 6080 -1240 6080 -1220 { lab=#net286}
N 6080 -1220 6860 -1220 { lab=#net286}
N 6860 -1220 6860 -1200 { lab=#net286}
N 6100 -1440 6360 -1440 { lab=#net241}
N 6100 -1410 6360 -1410 { lab=#net287}
N 6100 -1380 6360 -1380 { lab=#net288}
N 6030 -1480 6080 -1480 { lab=#net289}
N 6080 -1480 6080 -1460 { lab=#net289}
N 6080 -1460 6860 -1460 { lab=#net289}
N 6860 -1460 6860 -1440 { lab=#net289}
N 6100 -1680 6360 -1680 { lab=#net244}
N 6100 -1650 6360 -1650 { lab=#net290}
N 6100 -1620 6360 -1620 { lab=#net291}
N 6030 -1720 6080 -1720 { lab=#net292}
N 6080 -1720 6080 -1700 { lab=#net292}
N 6080 -1700 6860 -1700 { lab=#net292}
N 6860 -1700 6860 -1680 { lab=#net292}
N 6100 -1920 6360 -1920 { lab=#net247}
N 6100 -1890 6360 -1890 { lab=#net293}
N 6100 -1860 6360 -1860 { lab=#net294}
N 6030 -1960 6080 -1960 { lab=#net295}
N 6080 -1960 6080 -1940 { lab=#net295}
N 6080 -1940 6860 -1940 { lab=#net295}
N 6860 -1940 6860 -1920 { lab=#net295}
N 6100 -2160 6360 -2160 { lab=#net250}
N 6100 -2130 6360 -2130 { lab=#net296}
N 6100 -2100 6360 -2100 { lab=#net297}
N 6030 -2200 6080 -2200 { lab=#net298}
N 6080 -2200 6080 -2180 { lab=#net298}
N 6080 -2180 6860 -2180 { lab=#net298}
N 6860 -2180 6860 -2160 { lab=#net298}
N 6100 -2400 6360 -2400 { lab=#net253}
N 6100 -2370 6360 -2370 { lab=#net299}
N 6100 -2340 6360 -2340 { lab=#net300}
N 6030 -2440 6080 -2440 { lab=#net301}
N 6080 -2440 6080 -2420 { lab=#net301}
N 6080 -2420 6860 -2420 { lab=#net301}
N 6860 -2420 6860 -2400 { lab=#net301}
N 6100 -2640 6360 -2640 { lab=#net256}
N 6100 -2610 6360 -2610 { lab=#net302}
N 6100 -2580 6360 -2580 { lab=#net303}
N 6030 -2680 6080 -2680 { lab=#net304}
N 6080 -2680 6080 -2660 { lab=#net304}
N 6080 -2660 6860 -2660 { lab=#net304}
N 6860 -2660 6860 -2640 { lab=#net304}
N 6100 -2880 6360 -2880 { lab=#net259}
N 6100 -2850 6360 -2850 { lab=#net305}
N 6100 -2820 6360 -2820 { lab=#net306}
N 6030 -2920 6080 -2920 { lab=#net307}
N 6080 -2920 6080 -2900 { lab=#net307}
N 6080 -2900 6860 -2900 { lab=#net307}
N 6860 -2900 6860 -2880 { lab=#net307}
N 6100 -3120 6360 -3120 { lab=#net262}
N 6100 -3090 6360 -3090 { lab=#net308}
N 6100 -3060 6360 -3060 { lab=#net309}
N 6030 -3160 6080 -3160 { lab=#net310}
N 6080 -3160 6080 -3140 { lab=#net310}
N 6080 -3140 6860 -3140 { lab=#net310}
N 6860 -3140 6860 -3120 { lab=#net310}
N 6100 -3360 6360 -3360 { lab=#net265}
N 6100 -3330 6360 -3330 { lab=#net311}
N 6100 -3300 6360 -3300 { lab=#net312}
N 6030 -3400 6080 -3400 { lab=#net313}
N 6080 -3400 6080 -3380 { lab=#net313}
N 6080 -3380 6860 -3380 { lab=#net313}
N 6860 -3380 6860 -3360 { lab=#net313}
N 6100 -3600 6360 -3600 { lab=#net268}
N 6100 -3570 6360 -3570 { lab=#net314}
N 6100 -3540 6360 -3540 { lab=#net315}
N 6030 -3640 6080 -3640 { lab=#net316}
N 6080 -3640 6080 -3620 { lab=#net316}
N 6080 -3620 6860 -3620 { lab=#net316}
N 6860 -3620 6860 -3600 { lab=#net316}
N 6100 -3840 6360 -3840 { lab=#net271}
N 6100 -3810 6360 -3810 { lab=#net317}
N 6100 -3780 6360 -3780 { lab=#net318}
N 6030 -3880 6080 -3880 { lab=#net319}
N 6080 -3880 6080 -3860 { lab=#net319}
N 6080 -3860 6860 -3860 { lab=#net319}
N 6860 -3860 6860 -3840 { lab=#net319}
N 6100 -310 6100 -240 { lab=#net226}
N 6100 -530 6100 -480 { lab=#net229}
N 6100 -770 6100 -720 { lab=#net232}
N 6100 -1010 6100 -960 { lab=#net235}
N 6100 -1250 6100 -1200 { lab=#net238}
N 6100 -1490 6100 -1440 { lab=#net241}
N 6100 -1730 6100 -1680 { lab=#net244}
N 6100 -1970 6100 -1920 { lab=#net247}
N 1340 -240 1780 -240 { lab=#net1}
N 1780 -240 1800 -240 { lab=#net1}
N 1340 -210 1800 -210 { lab=#net2}
N 1340 -180 1800 -180 { lab=#net3}
N 1340 -480 1800 -480 { lab=#net6}
N 1340 -450 1800 -450 { lab=#net5}
N 1340 -420 1800 -420 { lab=#net4}
N 1270 -720 1730 -720 { lab=#net7}
N 1340 -690 1800 -690 { lab=#net9}
N 1340 -660 1800 -660 { lab=#net8}
N 1340 -960 1800 -960 { lab=#net12}
N 1340 -930 1800 -930 { lab=#net11}
N 1340 -900 1800 -900 { lab=#net10}
N 1340 -1200 1790 -1200 { lab=#net13}
N 1790 -1200 1800 -1200 { lab=#net13}
N 1340 -1170 1800 -1170 { lab=#net15}
N 1340 -1140 1800 -1140 { lab=#net14}
N 1070 -1440 1800 -1440 { lab=#net320}
N 1040 -1440 1070 -1440 { lab=#net320}
N 1040 -1440 1040 -1090 { lab=#net320}
N 950 -1090 1040 -1090 { lab=#net320}
N 950 -1060 1050 -1060 { lab=#net321}
N 1050 -1410 1050 -1060 { lab=#net321}
N 1050 -1410 1800 -1410 { lab=#net321}
N 1070 -1380 1800 -1380 { lab=#net322}
N 1070 -1380 1070 -1030 { lab=#net322}
N 950 -1030 1070 -1030 { lab=#net322}
N 1000 -1680 1800 -1680 { lab=#net323}
N 980 -1680 1000 -1680 { lab=#net323}
N 980 -1680 980 -1260 { lab=#net323}
N 950 -1260 980 -1260 { lab=#net323}
N 990 -1650 1800 -1650 { lab=#net324}
N 990 -1650 990 -1230 { lab=#net324}
N 950 -1230 990 -1230 { lab=#net324}
N 1000 -1620 1800 -1620 { lab=#net325}
N 1000 -1620 1000 -1200 { lab=#net325}
N 950 -1200 1000 -1200 { lab=#net325}
N 1010 -1920 1800 -1920 { lab=#net326}
N 1010 -1920 1010 -1430 { lab=#net326}
N 950 -1430 1010 -1430 { lab=#net326}
N 1020 -1890 1800 -1890 { lab=#net327}
N 1020 -1890 1020 -1400 { lab=#net327}
N 960 -1400 1020 -1400 { lab=#net327}
N 950 -1400 960 -1400 { lab=#net327}
N 950 -1370 1030 -1370 { lab=#net328}
N 1030 -1860 1030 -1370 { lab=#net328}
N 1030 -1860 1800 -1860 { lab=#net328}
N 1090 -2020 1090 -1600 { lab=#net323}
N 1060 -1600 1090 -1600 { lab=#net323}
N 1100 -1990 1100 -1570 { lab=#net324}
N 1060 -1570 1100 -1570 { lab=#net324}
N 1110 -1960 1110 -1540 { lab=#net325}
N 1060 -1540 1110 -1540 { lab=#net325}
N 1120 -2260 1120 -1770 { lab=#net326}
N 1060 -1770 1120 -1770 { lab=#net326}
N 1130 -2230 1130 -1740 { lab=#net327}
N 1070 -1740 1130 -1740 { lab=#net327}
N 1060 -1740 1070 -1740 { lab=#net327}
N 1060 -1710 1140 -1710 { lab=#net328}
N 1140 -2200 1140 -1710 { lab=#net328}
N 950 -1600 1060 -1600 {}
N 950 -1570 1060 -1570 {}
N 950 -1540 1060 -1540 {}
N 950 -1770 1060 -1770 {}
N 950 -1740 1060 -1740 {}
N 950 -1710 1060 -1710 {}
N 1090 -2160 1090 -2020 {}
N 1100 -2130 1100 -1990 {}
N 1110 -2100 1110 -1960 {}
N 1090 -2160 1800 -2160 {}
N 1100 -2130 1800 -2130 {}
N 1110 -2100 1800 -2100 {}
N 1120 -2400 1120 -2260 {}
N 1130 -2370 1130 -2230 {}
N 1140 -2340 1140 -2200 {}
N 1120 -2400 1800 -2400 {}
N 1130 -2370 1800 -2370 {}
N 1140 -2340 1800 -2340 {}
N 950 -1940 970 -1940 {}
N 970 -2000 970 -1940 {}
N 950 -1880 1000 -1880 {}
N 1000 -2040 1000 -1880 {}
N 950 -1910 990 -1910 {}
N 990 -2010 990 -1910 {}
N 1000 -2530 1000 -2040 {}
N 990 -2530 990 -2010 {}
N 970 -2550 970 -2000 {}
N 970 -2640 1800 -2640 {}
N 970 -2640 970 -2550 {}
N 990 -2610 990 -2530 {}
N 990 -2610 1800 -2610 {}
N 1000 -2580 1800 -2580 {}
N 1000 -2580 1000 -2530 {}
N 950 -2110 1010 -2110 {}
N 950 -2080 1020 -2080 {}
N 950 -2050 1030 -2050 {}
N 1010 -2840 1010 -2110 {}
N 1020 -2820 1020 -2080 {}
N 1010 -2880 1800 -2880 {}
N 1010 -2880 1010 -2840 {}
N 1020 -2850 1800 -2850 {}
N 1020 -2850 1020 -2820 {}
N 1030 -2820 1800 -2820 {}
N 1030 -2820 1030 -2050 {}
N 950 -2280 1040 -2280 {}
N 950 -2250 1060 -2250 {}
N 950 -2220 1070 -2220 {}
N 1040 -3120 1040 -2280 {}
N 1040 -3120 1800 -3120 {}
N 1060 -3090 1060 -2250 {}
N 1060 -3090 1800 -3090 {}
N 1070 -3060 1800 -3060 {}
N 1070 -3060 1070 -3040 {}
N 1070 -3040 1070 -2220 {}
N 950 -2450 1080 -2450 {}
N 950 -2420 1090 -2420 {}
N 950 -2390 1100 -2390 {}
N 1120 -3360 1800 -3360 {}
N 1080 -3360 1080 -2450 {}
N 1080 -3360 1120 -3360 {}
N 1100 -3330 1800 -3330 {}
N 1090 -3330 1090 -2420 {}
N 1090 -3330 1100 -3330 {}
N 1110 -3300 1800 -3300 {}
N 1100 -3300 1100 -2390 {}
N 1100 -3300 1110 -3300 {}
N 950 -2620 980 -2620 {}
N 980 -3600 1800 -3600 {}
N 980 -3600 980 -2620 {}
N 950 -2590 1000 -2590 {}
N 1000 -3560 1000 -2590 {}
N 1000 -3560 1800 -3560 {}
N 1800 -3570 1800 -3560 {}
N 950 -2560 1050 -2560 {}
N 1050 -3500 1050 -2560 {}
N 1050 -3540 1800 -3540 {}
N 1050 -3540 1050 -3500 {}
N 950 -3840 950 -2790 {}
N 950 -3840 1800 -3840 {}
N 950 -2760 960 -2760 {}
N 960 -3800 960 -2760 {}
N 960 -3800 1800 -3800 {}
N 1800 -3810 1800 -3800 {}
N 980 -3780 1800 -3780 {}
N 950 -2730 970 -2730 {}
N 970 -3780 970 -2730 {}
N 970 -3780 980 -3780 {}
C {sky130_hilas_AmpDetect01.sym} 630 -240 0 0 {name=x1}
C {sky130_hilas_AmpDetect01.sym} 630 -410 0 0 {name=x2}
C {sky130_hilas_AmpDetect01.sym} 630 -580 0 0 {name=x3}
C {sky130_hilas_AmpDetect01.sym} 630 -750 0 0 {name=x4}
C {sky130_hilas_AmpDetect01.sym} 630 -920 0 0 {name=x5}
C {sky130_hilas_AmpDetect01.sym} 630 -1090 0 0 {name=x6}
C {sky130_hilas_AmpDetect01.sym} 630 -1260 0 0 {name=x7}
C {sky130_hilas_AmpDetect01.sym} 630 -1430 0 0 {name=x8}
C {sky130_hilas_AmpDetect01.sym} 630 -1600 0 0 {name=x9}
C {sky130_hilas_AmpDetect01.sym} 630 -1770 0 0 {name=x10}
C {sky130_hilas_AmpDetect01.sym} 630 -1940 0 0 {name=x11}
C {sky130_hilas_AmpDetect01.sym} 630 -2110 0 0 {name=x12}
C {sky130_hilas_AmpDetect01.sym} 630 -2280 0 0 {name=x13}
C {sky130_hilas_AmpDetect01.sym} 630 -2450 0 0 {name=x14}
C {sky130_hilas_AmpDetect01.sym} 630 -2620 0 0 {name=x15}
C {sky130_hilas_AmpDetect01.sym} 630 -2790 0 0 {name=x16}
C {sky130_hilas_Alice_BPF.sym} 450 -200 0 0 {name=x17}
C {sky130_hilas_Alice_BPF.sym} 450 -370 0 0 {name=x18}
C {sky130_hilas_Alice_BPF.sym} 450 -540 0 0 {name=x19}
C {sky130_hilas_Alice_BPF.sym} 450 -710 0 0 {name=x20}
C {sky130_hilas_Alice_BPF.sym} 450 -880 0 0 {name=x21}
C {sky130_hilas_Alice_BPF.sym} 450 -1050 0 0 {name=x22}
C {sky130_hilas_Alice_BPF.sym} 450 -1220 0 0 {name=x23}
C {sky130_hilas_Alice_BPF.sym} 450 -1390 0 0 {name=x24}
C {sky130_hilas_Alice_BPF.sym} 450 -1560 0 0 {name=x25}
C {sky130_hilas_Alice_BPF.sym} 450 -1730 0 0 {name=x26}
C {sky130_hilas_Alice_BPF.sym} 450 -1900 0 0 {name=x27}
C {sky130_hilas_Alice_BPF.sym} 450 -2070 0 0 {name=x28}
C {sky130_hilas_Alice_BPF.sym} 450 -2240 0 0 {name=x29}
C {sky130_hilas_Alice_BPF.sym} 450 -2410 0 0 {name=x30}
C {sky130_hilas_Alice_BPF.sym} 450 -2580 0 0 {name=x31}
C {sky130_hilas_Alice_BPF.sym} 450 -2750 0 0 {name=x32}
C {sky130_hilas_Alice_Delayblock.sym} 1530 280 0 0 {}
C {sky130_hilas_Alice_Delayblock.sym} 1530 40 0 0 {}
C {sky130_hilas_Alice_Delayblock.sym} 1530 -200 0 0 {}
C {sky130_hilas_Alice_Delayblock.sym} 1530 -440 0 0 {}
C {sky130_hilas_Alice_Delayblock.sym} 1530 -680 0 0 {}
C {sky130_hilas_Alice_Delayblock.sym} 1530 -920 0 0 {}
C {sky130_hilas_Alice_Delayblock.sym} 1530 -1160 0 0 {}
C {sky130_hilas_Alice_Delayblock.sym} 1530 -1400 0 0 {}
C {sky130_hilas_Alice_Delayblock.sym} 1530 -1640 0 0 {}
C {sky130_hilas_Alice_Delayblock.sym} 1530 -1880 0 0 {}
C {sky130_hilas_Alice_Delayblock.sym} 1530 -2120 0 0 {}
C {sky130_hilas_Alice_Delayblock.sym} 1530 -2360 0 0 {}
C {sky130_hilas_Alice_Delayblock.sym} 1530 -2600 0 0 {}
C {sky130_hilas_Alice_Delayblock.sym} 1530 -2840 0 0 {}
C {sky130_hilas_Alice_Delayblock.sym} 1530 -3080 0 0 {}
C {sky130_hilas_Alice_Delayblock.sym} 1530 -3320 0 0 {}
C {sky130_hilas_Alice_Delayblock.sym} 2290 280 0 0 {}
C {sky130_hilas_Alice_Delayblock.sym} 2290 40 0 0 {}
C {sky130_hilas_Alice_Delayblock.sym} 2290 -200 0 0 {}
C {sky130_hilas_Alice_Delayblock.sym} 2290 -440 0 0 {}
C {sky130_hilas_Alice_Delayblock.sym} 2290 -680 0 0 {}
C {sky130_hilas_Alice_Delayblock.sym} 2290 -920 0 0 {}
C {sky130_hilas_Alice_Delayblock.sym} 2290 -1160 0 0 {}
C {sky130_hilas_Alice_Delayblock.sym} 2290 -1400 0 0 {}
C {sky130_hilas_Alice_Delayblock.sym} 2290 -1640 0 0 {}
C {sky130_hilas_Alice_Delayblock.sym} 2290 -1880 0 0 {}
C {sky130_hilas_Alice_Delayblock.sym} 2290 -2120 0 0 {}
C {sky130_hilas_Alice_Delayblock.sym} 2290 -2360 0 0 {}
C {sky130_hilas_Alice_Delayblock.sym} 2290 -2600 0 0 {}
C {sky130_hilas_Alice_Delayblock.sym} 2290 -2840 0 0 {}
C {sky130_hilas_Alice_Delayblock.sym} 2290 -3080 0 0 {}
C {sky130_hilas_Alice_Delayblock.sym} 2290 -3320 0 0 {}
C {sky130_hilas_Alice_Delayblock.sym} 3050 280 0 0 {}
C {sky130_hilas_Alice_Delayblock.sym} 3050 40 0 0 {}
C {sky130_hilas_Alice_Delayblock.sym} 3050 -200 0 0 {}
C {sky130_hilas_Alice_Delayblock.sym} 3050 -440 0 0 {}
C {sky130_hilas_Alice_Delayblock.sym} 3050 -680 0 0 {}
C {sky130_hilas_Alice_Delayblock.sym} 3050 -920 0 0 {}
C {sky130_hilas_Alice_Delayblock.sym} 3050 -1160 0 0 {}
C {sky130_hilas_Alice_Delayblock.sym} 3050 -1400 0 0 {}
C {sky130_hilas_Alice_Delayblock.sym} 3050 -1640 0 0 {}
C {sky130_hilas_Alice_Delayblock.sym} 3050 -1880 0 0 {}
C {sky130_hilas_Alice_Delayblock.sym} 3050 -2120 0 0 {}
C {sky130_hilas_Alice_Delayblock.sym} 3050 -2360 0 0 {}
C {sky130_hilas_Alice_Delayblock.sym} 3050 -2600 0 0 {}
C {sky130_hilas_Alice_Delayblock.sym} 3050 -2840 0 0 {}
C {sky130_hilas_Alice_Delayblock.sym} 3050 -3080 0 0 {}
C {sky130_hilas_Alice_Delayblock.sym} 3050 -3320 0 0 {}
C {sky130_hilas_Alice_Delayblock.sym} 3810 280 0 0 {}
C {sky130_hilas_Alice_Delayblock.sym} 3810 40 0 0 {}
C {sky130_hilas_Alice_Delayblock.sym} 3810 -200 0 0 {}
C {sky130_hilas_Alice_Delayblock.sym} 3810 -440 0 0 {}
C {sky130_hilas_Alice_Delayblock.sym} 3810 -680 0 0 {}
C {sky130_hilas_Alice_Delayblock.sym} 3810 -920 0 0 {}
C {sky130_hilas_Alice_Delayblock.sym} 3810 -1160 0 0 {}
C {sky130_hilas_Alice_Delayblock.sym} 3810 -1400 0 0 {}
C {sky130_hilas_Alice_Delayblock.sym} 3810 -1640 0 0 {}
C {sky130_hilas_Alice_Delayblock.sym} 3810 -1880 0 0 {}
C {sky130_hilas_Alice_Delayblock.sym} 3810 -2120 0 0 {}
C {sky130_hilas_Alice_Delayblock.sym} 3810 -2360 0 0 {}
C {sky130_hilas_Alice_Delayblock.sym} 3810 -2600 0 0 {}
C {sky130_hilas_Alice_Delayblock.sym} 3810 -2840 0 0 {}
C {sky130_hilas_Alice_Delayblock.sym} 3810 -3080 0 0 {}
C {sky130_hilas_Alice_Delayblock.sym} 3810 -3320 0 0 {}
C {sky130_hilas_Alice_Delayblock.sym} 4570 280 0 0 {}
C {sky130_hilas_Alice_Delayblock.sym} 4570 40 0 0 {}
C {sky130_hilas_Alice_Delayblock.sym} 4570 -200 0 0 {}
C {sky130_hilas_Alice_Delayblock.sym} 4570 -440 0 0 {}
C {sky130_hilas_Alice_Delayblock.sym} 4570 -680 0 0 {}
C {sky130_hilas_Alice_Delayblock.sym} 4570 -920 0 0 {}
C {sky130_hilas_Alice_Delayblock.sym} 4570 -1160 0 0 {}
C {sky130_hilas_Alice_Delayblock.sym} 4570 -1400 0 0 {}
C {sky130_hilas_Alice_Delayblock.sym} 4570 -1640 0 0 {}
C {sky130_hilas_Alice_Delayblock.sym} 4570 -1880 0 0 {}
C {sky130_hilas_Alice_Delayblock.sym} 4570 -2120 0 0 {}
C {sky130_hilas_Alice_Delayblock.sym} 4570 -2360 0 0 {}
C {sky130_hilas_Alice_Delayblock.sym} 4570 -2600 0 0 {}
C {sky130_hilas_Alice_Delayblock.sym} 4570 -2840 0 0 {}
C {sky130_hilas_Alice_Delayblock.sym} 4570 -3080 0 0 {}
C {sky130_hilas_Alice_Delayblock.sym} 4570 -3320 0 0 {}
C {sky130_hilas_Alice_Delayblock.sym} 5330 280 0 0 {}
C {sky130_hilas_Alice_Delayblock.sym} 5330 40 0 0 {}
C {sky130_hilas_Alice_Delayblock.sym} 5330 -200 0 0 {}
C {sky130_hilas_Alice_Delayblock.sym} 5330 -440 0 0 {}
C {sky130_hilas_Alice_Delayblock.sym} 5330 -680 0 0 {}
C {sky130_hilas_Alice_Delayblock.sym} 5330 -920 0 0 {}
C {sky130_hilas_Alice_Delayblock.sym} 5330 -1160 0 0 {}
C {sky130_hilas_Alice_Delayblock.sym} 5330 -1400 0 0 {}
C {sky130_hilas_Alice_Delayblock.sym} 5330 -1640 0 0 {}
C {sky130_hilas_Alice_Delayblock.sym} 5330 -1880 0 0 {}
C {sky130_hilas_Alice_Delayblock.sym} 5330 -2120 0 0 {}
C {sky130_hilas_Alice_Delayblock.sym} 5330 -2360 0 0 {}
C {sky130_hilas_Alice_Delayblock.sym} 5330 -2600 0 0 {}
C {sky130_hilas_Alice_Delayblock.sym} 5330 -2840 0 0 {}
C {sky130_hilas_Alice_Delayblock.sym} 5330 -3080 0 0 {}
C {sky130_hilas_Alice_Delayblock.sym} 5330 -3320 0 0 {}
C {sky130_hilas_Alice_Delayblock.sym} 6090 280 0 0 {}
C {sky130_hilas_Alice_Delayblock.sym} 6090 40 0 0 {}
C {sky130_hilas_Alice_Delayblock.sym} 6090 -200 0 0 {}
C {sky130_hilas_Alice_Delayblock.sym} 6090 -440 0 0 {}
C {sky130_hilas_Alice_Delayblock.sym} 6090 -680 0 0 {}
C {sky130_hilas_Alice_Delayblock.sym} 6090 -920 0 0 {}
C {sky130_hilas_Alice_Delayblock.sym} 6090 -1160 0 0 {}
C {sky130_hilas_Alice_Delayblock.sym} 6090 -1400 0 0 {}
C {sky130_hilas_Alice_Delayblock.sym} 6090 -1640 0 0 {}
C {sky130_hilas_Alice_Delayblock.sym} 6090 -1880 0 0 {}
C {sky130_hilas_Alice_Delayblock.sym} 6090 -2120 0 0 {}
C {sky130_hilas_Alice_Delayblock.sym} 6090 -2360 0 0 {}
C {sky130_hilas_Alice_Delayblock.sym} 6090 -2600 0 0 {}
C {sky130_hilas_Alice_Delayblock.sym} 6090 -2840 0 0 {}
C {sky130_hilas_Alice_Delayblock.sym} 6090 -3080 0 0 {}
C {sky130_hilas_Alice_Delayblock.sym} 6090 -3320 0 0 {}
