v {xschem version=2.9.9 file_version=1.2 }
G {}
K {type=subcircuit
format="@name @pinlist @symname"
template="name=x1"
}
V {}
S {}
E {}
L 4 -130 -80 130 -80 {}
L 4 -130 80 130 80 {}
L 4 -130 -80 -130 80 {}
L 4 130 -80 130 80 {}
L 4 -70 -100 -70 -80 {}
L 4 -150 -30 -130 -30 {}
L 4 30 -100 30 -80 {}
L 4 -20 -100 -20 -80 {}
L 4 130 -30 150 -30 {}
L 4 -150 -10 -130 -10 {}
L 4 130 -10 150 -10 {}
L 4 -150 10 -130 10 {}
L 4 130 10 150 10 {}
L 4 -150 30 -130 30 {}
L 4 130 30 150 30 {}
L 4 70 -100 70 -80 {}
L 4 -70 80 -70 100 {}
L 4 30 80 30 100 {}
L 4 -20 80 -20 100 {}
L 4 70 80 70 100 {}
B 5 -72.5 -102.5 -67.5 -97.5 {name=VINJ dir=in }
B 5 -152.5 -32.5 -147.5 -27.5 {name=IN1 dir=in }
B 5 27.5 -102.5 32.5 -97.5 {name=RUN dir=in }
B 5 -22.5 -102.5 -17.5 -97.5 {name=PROG dir=in }
B 5 147.5 -32.5 152.5 -27.5 {name=OUT1 dir=out }
B 5 -152.5 -12.5 -147.5 -7.5 {name=IN2 dir=in }
B 5 147.5 -12.5 152.5 -7.5 {name=OUT2 dir=out }
B 5 -152.5 7.5 -147.5 12.5 {name=IN3 dir=in }
B 5 147.5 7.5 152.5 12.5 {name=OUT3 dir=out }
B 5 -152.5 27.5 -147.5 32.5 {name=IN4 dir=in }
B 5 147.5 27.5 152.5 32.5 {name=OUT4 dir=out }
B 5 67.5 -102.5 72.5 -97.5 {name=VGND dir=in }
B 5 -72.5 97.5 -67.5 102.5 {name=VINJ dir=in }
B 5 27.5 97.5 32.5 102.5 {name=RUN dir=in }
B 5 -22.5 97.5 -17.5 102.5 {name=PROG dir=in }
B 5 67.5 97.5 72.5 102.5 {name=VGND dir=in }
T {@symname} -63 24 0 0 0.3 0.3 {}
T {@name} 135 -92 0 0 0.2 0.2 {}
T {VINJ} -75 -74 0 0 0.2 0.2 {}
T {IN1} -125 -34 0 0 0.2 0.2 {}
T {RUN} 15 -74 0 0 0.2 0.2 {}
T {PROG} -35 -74 0 0 0.2 0.2 {}
T {OUT1} 125 -34 0 1 0.2 0.2 {}
T {IN2} -125 -14 0 0 0.2 0.2 {}
T {OUT2} 125 -14 0 1 0.2 0.2 {}
T {IN3} -125 6 0 0 0.2 0.2 {}
T {OUT3} 125 6 0 1 0.2 0.2 {}
T {IN4} -125 26 0 0 0.2 0.2 {}
T {OUT4} 125 26 0 1 0.2 0.2 {}
T {VGND} 55 -74 0 0 0.2 0.2 {}
