v {xschem version=2.9.9 file_version=1.2 }
G {}
K {}
V {}
S {}
E {}
N 750 -1370 790 -1370 { lab=GATE1}
N 630 -1370 670 -1370 { lab=VTUN}
N 630 -1380 630 -1370 { lab=VTUN}
N 600 -1430 820 -1430 { lab=#net1}
N 560 -1480 560 -1460 { lab=#net2}
N 860 -1400 860 -1290 { lab=OUTPUT}
N 860 -1460 900 -1460 { lab=VINJ}
N 750 -1370 750 -1300 { lab=GATE1}
N 670 -1370 670 -1280 { lab=VTUN}
N 560 -1400 560 -1340 { lab=DRAIN1}
N 560 -1340 960 -1340 { lab=DRAIN1}
N 490 -1350 490 -1300 { lab=VINJ}
N 750 -1630 790 -1630 { lab=GATE1}
N 630 -1630 670 -1630 { lab=VTUN}
N 630 -1640 630 -1630 { lab=VTUN}
N 600 -1690 820 -1690 { lab=#net3}
N 560 -1740 560 -1720 { lab=#net4}
N 900 -1720 900 -1460 { lab=VINJ}
N 860 -1660 860 -1580 { lab=#net5}
N 860 -1720 900 -1720 { lab=VINJ}
N 750 -1630 750 -1370 { lab=GATE1}
N 670 -1630 670 -1370 { lab=VTUN}
N 560 -1660 560 -1600 { lab=DRAIN1}
N 560 -1600 960 -1600 { lab=DRAIN1}
N 490 -1610 490 -1540 { lab=VINJ}
N 490 -1800 560 -1800 { lab=VINJ}
N 420 -1600 560 -1600 { lab=DRAIN1}
N 490 -1830 490 -1800 { lab=VINJ}
N 480 -1850 490 -1830 { lab=VINJ}
N 560 -1780 560 -1770 { lab=VINJ}
N 560 -1780 570 -1780 { lab=VINJ}
N 570 -1800 570 -1780 { lab=VINJ}
N 560 -1800 570 -1800 { lab=VINJ}
N 490 -1690 560 -1690 { lab=VINJ}
N 490 -1430 560 -1430 { lab=VINJ}
N 560 -1510 570 -1510 { lab=VINJ}
N 570 -1540 570 -1510 { lab=VINJ}
N 860 -1430 880 -1430 { lab=VINJ}
N 880 -1430 880 -1350 { lab=VINJ}
N 490 -1350 880 -1350 { lab=VINJ}
N 860 -1690 880 -1690 { lab=VINJ}
N 880 -1690 880 -1610 { lab=VINJ}
N 490 -1610 880 -1610 { lab=VINJ}
N 520 -1840 520 -1300 { lab=COLSEL1}
N 520 -1840 550 -1840 { lab=COLSEL1}
N 670 -1840 670 -1630 { lab=VTUN}
N 670 -1840 680 -1840 { lab=VTUN}
N 470 -1880 1280 -1880 { lab=VINJ}
N 470 -1850 470 -1820 { lab=VINJ}
N 470 -1850 480 -1850 { lab=VINJ}
N 1810 -1780 1830 -1780 { lab=#net6}
N 1870 -1780 1890 -1780 { lab=VPWR}
N 1890 -1810 1890 -1780 { lab=VPWR}
N 1740 -1810 1890 -1810 { lab=VPWR}
N 1740 -1810 1740 -1780 { lab=VPWR}
N 1740 -1780 1760 -1780 { lab=VPWR}
N 1870 -1740 1870 -1720 { lab=#net7}
N 1870 -1740 1910 -1740 { lab=#net7}
N 1760 -1730 1760 -1670 { lab=#net6}
N 1710 -1690 1830 -1690 { lab=#net8}
N 1710 -1720 1710 -1690 { lab=#net8}
N 1640 -1640 1720 -1640 { lab=#net9}
N 1640 -1670 1640 -1640 { lab=#net9}
N 1590 -1640 1600 -1640 { lab=VGND}
N 1590 -1640 1590 -1610 { lab=VGND}
N 1590 -1610 1660 -1610 { lab=VGND}
N 1660 -1610 1770 -1610 { lab=VGND}
N 1770 -1640 1770 -1610 { lab=VGND}
N 1760 -1640 1770 -1640 { lab=VGND}
N 1870 -1690 1880 -1690 { lab=VGND}
N 1880 -1690 1880 -1660 { lab=VGND}
N 1770 -1660 1880 -1660 { lab=VGND}
N 1770 -1660 1770 -1640 { lab=VGND}
N 1660 -1690 1670 -1690 { lab=VGND}
N 1660 -1660 1660 -1610 { lab=VGND}
N 1660 -1660 1670 -1660 { lab=VGND}
N 860 -1580 860 -1570 { lab=#net5}
N 1200 -1420 1220 -1420 { lab=#net7}
N 1200 -1420 1200 -1360 { lab=#net7}
N 1200 -1360 1210 -1360 { lab=#net7}
N 1260 -1500 1260 -1450 { lab=OUTPUT}
N 1260 -1420 1280 -1420 { lab=VINJ}
N 1280 -1520 1280 -1420 { lab=VINJ}
N 1760 -1730 1810 -1730 { lab=#net6}
N 1810 -1780 1810 -1730 { lab=#net6}
N 1410 -1670 1640 -1670 { lab=#net9}
N 1530 -1750 1540 -1750 { lab=OUTPUT}
N 1410 -1780 1490 -1780 { lab=#net5}
N 1410 -1780 1410 -1730 { lab=#net5}
N 1430 -1800 1470 -1800 { lab=VINJ}
N 1470 -1800 1470 -1750 { lab=VINJ}
N 1470 -1750 1490 -1750 { lab=VINJ}
N 1410 -1700 1430 -1700 { lab=VINJ}
N 1430 -1800 1430 -1700 { lab=VINJ}
N 1160 -1500 1160 -1290 { lab=OUTPUT}
N 1310 -1780 1310 -1580 { lab=#net5}
N 1280 -1800 1280 -1520 { lab=VINJ}
N 1280 -1800 1430 -1800 { lab=VINJ}
N 420 -1340 560 -1340 { lab=DRAIN1}
N 490 -1850 490 -1830 { lab=VINJ}
N 560 -1800 560 -1780 { lab=VINJ}
N 490 -1800 490 -1690 { lab=VINJ}
N 490 -1540 490 -1430 { lab=VINJ}
N 490 -1430 490 -1350 { lab=VINJ}
N 490 -1690 490 -1610 { lab=VINJ}
N 470 -1880 470 -1850 { lab=VINJ}
N 1870 -1750 1870 -1740 { lab=#net7}
N 1480 -1720 1710 -1720 { lab=#net8}
N 1660 -1690 1660 -1660 { lab=VGND}
N 1160 -1500 1260 -1500 { lab=OUTPUT}
N 1760 -1750 1760 -1730 { lab=#net6}
N 1800 -1780 1810 -1780 { lab=#net6}
N 1310 -1780 1410 -1780 { lab=#net5}
N 860 -1580 1310 -1580 { lab=#net5}
N 1280 -1880 1280 -1800 { lab=VINJ}
N 490 -1540 570 -1540 { lab=VINJ}
N 750 -1830 750 -1630 { lab=GATE1}
N 900 -1880 900 -1720 { lab=VINJ}
N 1740 -1610 1740 -1390 { lab=VGND}
N 1260 -1390 1610 -1390 { lab=VGND}
N 860 -1290 1160 -1290 { lab=OUTPUT}
N 1160 -1290 1190 -1290 { lab=OUTPUT}
N 1540 -1750 1550 -1750 { lab=OUTPUT}
N 1210 -1360 1930 -1360 { lab=#net7}
N 1930 -1740 1930 -1360 { lab=#net7}
N 1910 -1740 1930 -1740 { lab=#net7}
N 1260 -1500 1350 -1500 { lab=OUTPUT}
N 1610 -1390 1740 -1390 { lab=VGND}
N 1740 -1390 1760 -1390 { lab=VGND}
N 1340 -1700 1370 -1700 { lab=VIN}
N 1550 -1750 1550 -1500 { lab=OUTPUT}
N 1350 -1500 1550 -1500 { lab=OUTPUT}
N 1740 -1850 1740 -1810 { lab=VPWR}
C {sky130_fd_pr/pfet_g5v0d10v5.sym} 840 -1430 0 0 {name=M7
L=0.5
W=1
nf=1
mult=1
ad="'int((nf+1)/2) * W/nf * 0.29'" 
pd="'2*int((nf+1)/2) * (W/nf + 0.29)'"
as="'int((nf+2)/2) * W/nf * 0.29'" 
ps="'2*int((nf+2)/2) * (W/nf + 0.29)'"
nrd="'0.29 / W'" nrs="'0.29 / W'"
sa=0 sb=0 sd=0
model=pfet_g5v0d10v5
spiceprefix=X
}
C {sky130_fd_pr/cap_var_hvt.sym} 790 -1400 0 0 {name=C5 model=cap_var_hvt W=0.5 L=0.5 VM=1 spiceprefix=X}
C {sky130_fd_pr/pfet_g5v0d10v5.sym} 580 -1430 0 1 {name=M8
L=0.5
W=1
nf=1
mult=1
ad="'int((nf+1)/2) * W/nf * 0.29'" 
pd="'2*int((nf+1)/2) * (W/nf + 0.29)'"
as="'int((nf+2)/2) * W/nf * 0.29'" 
ps="'2*int((nf+2)/2) * (W/nf + 0.29)'"
nrd="'0.29 / W'" nrs="'0.29 / W'"
sa=0 sb=0 sd=0
model=pfet_g5v0d10v5
spiceprefix=X
}
C {sky130_fd_pr/cap_var_hvt.sym} 630 -1400 0 1 {name=C6 model=cap_var_hvt W=0.5 L=0.5 VM=1 spiceprefix=X}
C {sky130_fd_pr/pfet_g5v0d10v5.sym} 540 -1510 0 0 {name=M9
L=0.5
W=1
nf=1
mult=1
ad="'int((nf+1)/2) * W/nf * 0.29'" 
pd="'2*int((nf+1)/2) * (W/nf + 0.29)'"
as="'int((nf+2)/2) * W/nf * 0.29'" 
ps="'2*int((nf+2)/2) * (W/nf + 0.29)'"
nrd="'0.29 / W'" nrs="'0.29 / W'"
sa=0 sb=0 sd=0
model=pfet_g5v0d10v5
spiceprefix=X
}
C {sky130_fd_pr/pfet_g5v0d10v5.sym} 840 -1690 0 0 {name=M10
L=0.5
W=1
nf=1
mult=1
ad="'int((nf+1)/2) * W/nf * 0.29'" 
pd="'2*int((nf+1)/2) * (W/nf + 0.29)'"
as="'int((nf+2)/2) * W/nf * 0.29'" 
ps="'2*int((nf+2)/2) * (W/nf + 0.29)'"
nrd="'0.29 / W'" nrs="'0.29 / W'"
sa=0 sb=0 sd=0
model=pfet_g5v0d10v5
spiceprefix=X
}
C {sky130_fd_pr/cap_var_hvt.sym} 790 -1660 0 0 {name=C7 model=cap_var_hvt W=0.5 L=0.5 VM=1 spiceprefix=X}
C {sky130_fd_pr/pfet_g5v0d10v5.sym} 580 -1690 0 1 {name=M11
L=0.5
W=1
nf=1
mult=1
ad="'int((nf+1)/2) * W/nf * 0.29'" 
pd="'2*int((nf+1)/2) * (W/nf + 0.29)'"
as="'int((nf+2)/2) * W/nf * 0.29'" 
ps="'2*int((nf+2)/2) * (W/nf + 0.29)'"
nrd="'0.29 / W'" nrs="'0.29 / W'"
sa=0 sb=0 sd=0
model=pfet_g5v0d10v5
spiceprefix=X
}
C {sky130_fd_pr/cap_var_hvt.sym} 630 -1660 0 1 {name=C8 model=cap_var_hvt W=0.5 L=0.5 VM=1 spiceprefix=X}
C {sky130_fd_pr/pfet_g5v0d10v5.sym} 540 -1770 0 0 {name=M12
L=0.5
W=1
nf=1
mult=1
ad="'int((nf+1)/2) * W/nf * 0.29'" 
pd="'2*int((nf+1)/2) * (W/nf + 0.29)'"
as="'int((nf+2)/2) * W/nf * 0.29'" 
ps="'2*int((nf+2)/2) * (W/nf + 0.29)'"
nrd="'0.29 / W'" nrs="'0.29 / W'"
sa=0 sb=0 sd=0
model=pfet_g5v0d10v5
spiceprefix=X
}
C {devices/iopin.sym} 1740 -1850 0 0 {name=VPWR lab=VPWR}
C {devices/iopin.sym} 750 -1830 0 0 {name=GATE1 lab=GATE1}
C {devices/iopin.sym} 680 -1840 0 0 {name=VTUN lab=VTUN}
C {devices/iopin.sym} 550 -1840 0 0 {name=COLSEL1 lab=COLSEL1}
C {devices/iopin.sym} 480 -1850 0 0 {name=VINJ lab=VINJ}
C {sky130_fd_pr/pfet_01v8.sym} 1850 -1780 0 0 {name=M18
L=0.15
W=1
nf=1
mult=1
ad="'int((nf+1)/2) * W/nf * 0.29'" 
pd="'2*int((nf+1)/2) * (W/nf + 0.29)'"
as="'int((nf+2)/2) * W/nf * 0.29'" 
ps="'2*int((nf+2)/2) * (W/nf + 0.29)'"
nrd="'0.29 / W'" nrs="'0.29 / W'"
sa=0 sb=0 sd=0
model=pfet_01v8
spiceprefix=X
}
C {sky130_fd_pr/pfet_01v8.sym} 1780 -1780 0 1 {name=M19
L=0.15
W=1
nf=1
mult=1
ad="'int((nf+1)/2) * W/nf * 0.29'" 
pd="'2*int((nf+1)/2) * (W/nf + 0.29)'"
as="'int((nf+2)/2) * W/nf * 0.29'" 
ps="'2*int((nf+2)/2) * (W/nf + 0.29)'"
nrd="'0.29 / W'" nrs="'0.29 / W'"
sa=0 sb=0 sd=0
model=pfet_01v8
spiceprefix=X
}
C {sky130_fd_pr/nfet_01v8.sym} 1850 -1690 0 0 {name=M20
L=0.15
W=1
nf=1 
mult=1
ad="'int((nf+1)/2) * W/nf * 0.29'" 
pd="'2*int((nf+1)/2) * (W/nf + 0.29)'"
as="'int((nf+2)/2) * W/nf * 0.29'" 
ps="'2*int((nf+2)/2) * (W/nf + 0.29)'"
nrd="'0.29 / W'" nrs="'0.29 / W'"
sa=0 sb=0 sd=0
model=nfet_01v8
spiceprefix=X
}
C {sky130_fd_pr/nfet_01v8.sym} 1740 -1640 0 0 {name=M21
L=0.15
W=1
nf=1 
mult=1
ad="'int((nf+1)/2) * W/nf * 0.29'" 
pd="'2*int((nf+1)/2) * (W/nf + 0.29)'"
as="'int((nf+2)/2) * W/nf * 0.29'" 
ps="'2*int((nf+2)/2) * (W/nf + 0.29)'"
nrd="'0.29 / W'" nrs="'0.29 / W'"
sa=0 sb=0 sd=0
model=nfet_01v8
spiceprefix=X
}
C {sky130_fd_pr/nfet_01v8.sym} 1620 -1640 0 1 {name=M22
L=0.15
W=1
nf=1 
mult=1
ad="'int((nf+1)/2) * W/nf * 0.29'" 
pd="'2*int((nf+1)/2) * (W/nf + 0.29)'"
as="'int((nf+2)/2) * W/nf * 0.29'" 
ps="'2*int((nf+2)/2) * (W/nf + 0.29)'"
nrd="'0.29 / W'" nrs="'0.29 / W'"
sa=0 sb=0 sd=0
model=nfet_01v8
spiceprefix=X
}
C {sky130_fd_pr/nfet_01v8.sym} 1690 -1690 0 1 {name=M23
L=0.15
W=1
nf=1 
mult=1
ad="'int((nf+1)/2) * W/nf * 0.29'" 
pd="'2*int((nf+1)/2) * (W/nf + 0.29)'"
as="'int((nf+2)/2) * W/nf * 0.29'" 
ps="'2*int((nf+2)/2) * (W/nf + 0.29)'"
nrd="'0.29 / W'" nrs="'0.29 / W'"
sa=0 sb=0 sd=0
model=nfet_01v8
spiceprefix=X
}
C {devices/iopin.sym} 1190 -1290 0 0 {name=OUTPUT lab=OUTPUT}
C {devices/iopin.sym} 1350 -1700 2 0 {name=VIN21 lab=VIN}
C {sky130_fd_pr/pfet_g5v0d10v5.sym} 1240 -1420 0 0 {name=M13
L=0.5
W=1
nf=1
mult=1
ad="'int((nf+1)/2) * W/nf * 0.29'" 
pd="'2*int((nf+1)/2) * (W/nf + 0.29)'"
as="'int((nf+2)/2) * W/nf * 0.29'" 
ps="'2*int((nf+2)/2) * (W/nf + 0.29)'"
nrd="'0.29 / W'" nrs="'0.29 / W'"
sa=0 sb=0 sd=0
model=pfet_g5v0d10v5
spiceprefix=X
}
C {devices/gnd.sym} 1710 -1610 0 0 {name=l2 lab=VGND}
C {sky130_fd_pr/pfet_g5v0d10v5.sym} 1390 -1700 0 0 {name=M1
L=0.5
W=1
nf=1
mult=1
ad="'int((nf+1)/2) * W/nf * 0.29'" 
pd="'2*int((nf+1)/2) * (W/nf + 0.29)'"
as="'int((nf+2)/2) * W/nf * 0.29'" 
ps="'2*int((nf+2)/2) * (W/nf + 0.29)'"
nrd="'0.29 / W'" nrs="'0.29 / W'"
sa=0 sb=0 sd=0
model=pfet_g5v0d10v5
spiceprefix=X
}
C {sky130_fd_pr/pfet_g5v0d10v5.sym} 1510 -1750 0 1 {name=M2
L=0.5
W=1
nf=1
mult=1
ad="'int((nf+1)/2) * W/nf * 0.29'" 
pd="'2*int((nf+1)/2) * (W/nf + 0.29)'"
as="'int((nf+2)/2) * W/nf * 0.29'" 
ps="'2*int((nf+2)/2) * (W/nf + 0.29)'"
nrd="'0.29 / W'" nrs="'0.29 / W'"
sa=0 sb=0 sd=0
model=pfet_g5v0d10v5
spiceprefix=X
}
C {devices/iopin.sym} 1750 -1390 0 0 {name=p1 lab=VGND}
C {devices/iopin.sym} 430 -1600 2 0 {name=DRAIN1 lab=DRAIN1}
C {devices/iopin.sym} 430 -1340 2 0 {name=DRAIN2 lab=DRAIN2}
