v {xschem version=2.9.9 file_version=1.2 }
G {}
K {type=subcircuit
format="@name @pinlist @symname"
template="name=x1"}
V {}
S {type=subcircuit
format="@name @pinlist @symname"
template="name=x1"}
E {}
L 4 320 -540 320 -380 {}
L 4 320 -540 720 -540 {}
L 4 720 -540 720 -380 {}
L 4 320 -380 720 -380 {}
L 4 340 -380 340 -340 {}
L 4 370 -380 370 -340 {}
L 4 400 -380 400 -340 {}
L 4 430 -380 430 -340 {}
L 4 460 -380 460 -340 {}
L 4 340 -580 340 -540 {}
L 4 490 -380 490 -340 {}
L 4 520 -380 520 -340 {}
L 4 550 -380 550 -340 {}
L 4 580 -380 580 -340 {}
L 4 610 -380 610 -340 {}
L 4 640 -380 640 -340 {}
L 4 670 -380 670 -340 {}
L 4 720 -400 770 -400 {}
L 4 720 -430 770 -430 {}
L 4 720 -520 770 -520 {}
L 4 720 -490 770 -490 {}
L 4 720 -460 770 -460 {}
L 4 370 -580 370 -540 {}
L 4 400 -580 400 -540 {}
L 4 430 -580 430 -540 {}
L 4 460 -580 460 -540 {}
L 4 490 -580 490 -540 {}
L 4 520 -580 520 -540 {}
L 4 550 -580 550 -540 {}
L 4 580 -580 580 -540 {}
L 4 610 -580 610 -540 {}
L 4 640 -580 640 -540 {}
L 4 670 -580 670 -540 {}
L 4 280 -520 320 -520 {}
L 4 280 -490 320 -490 {}
L 4 270 -460 320 -460 {}
L 4 270 -520 280 -520 {}
L 4 270 -490 280 -490 {}
L 4 270 -430 320 -430 {}
L 4 270 -400 320 -400 {}
L 4 700 -560 700 -540 {}
L 4 700 -380 700 -360 {}
B 5 267.5 -522.5 272.5 -517.5 {name=VIN
dir=inout}
B 5 267.5 -492.5 272.5 -487.5 {name=DRAIN1
dir=inout}
B 5 267.5 -462.5 272.5 -457.5 {name=DRAIN2
dir=inout}
B 5 267.5 -432.5 272.5 -427.5 {name=VINbuff1
dir=inout}
B 5 267.5 -402.5 272.5 -397.5 {name=VOUTbuff1
dir=inout}
B 5 767.5 -522.5 772.5 -517.5 {name=VOUT1
dir=inout}
B 5 767.5 -492.5 772.5 -487.5 {name=DRAIN1
dir=inout}
B 5 767.5 -462.5 772.5 -457.5 {name=DRAIN2
dir=inout}
B 5 767.5 -432.5 772.5 -427.5 {name=VINbuff2
dir=inout}
B 5 767.5 -402.5 772.5 -397.5 {name=VOUTbuff2
dir=inout}
B 5 427.5 -582.5 432.5 -577.5 {name=COLSEL1
dir=inout}
B 5 397.5 -582.5 402.5 -577.5 {name=GATE1
dir=inout}
B 5 367.5 -582.5 372.5 -577.5 {name=VTUN
dir=inout}
B 5 337.5 -582.5 342.5 -577.5 {name=VINJ
dir=inout}
B 5 487.5 -582.5 492.5 -577.5 {name=COLSEL2
dir=inout}
B 5 457.5 -582.5 462.5 -577.5 {name=GATE2
dir=inout}
B 5 547.5 -582.5 552.5 -577.5 {name=COLSEL3
dir=inout}
B 5 517.5 -582.5 522.5 -577.5 {name=GATE3
dir=inout}
B 5 607.5 -582.5 612.5 -577.5 {name=COLSEL4
dir=inout}
B 5 577.5 -582.5 582.5 -577.5 {name=GATE4
dir=inout}
B 5 637.5 -582.5 642.5 -577.5 {name=VPWR
dir=inout}
B 5 697.5 -562.5 702.5 -557.5 {name=V2-
dir=inout}
B 5 667.5 -582.5 672.5 -577.5 {name=VGND
dir=inout}
B 5 427.5 -342.5 432.5 -337.5 {name=COLSEL1
dir=inout}
B 5 397.5 -342.5 402.5 -337.5 {name=GATE1
dir=inout}
B 5 367.5 -342.5 372.5 -337.5 {name=VTUN
dir=inout}
B 5 337.5 -342.5 342.5 -337.5 {name=VINJ
dir=inout}
B 5 487.5 -342.5 492.5 -337.5 {name=COLSEL2
dir=inout}
B 5 457.5 -342.5 462.5 -337.5 {name=GATE2
dir=inout}
B 5 547.5 -342.5 552.5 -337.5 {name=COLSEL3
dir=inout}
B 5 517.5 -342.5 522.5 -337.5 {name=GATE3
dir=inout}
B 5 607.5 -342.5 612.5 -337.5 {name=COLSEL4
dir=inout}
B 5 577.5 -342.5 582.5 -337.5 {name=GATE4
dir=inout}
B 5 637.5 -342.5 642.5 -337.5 {name=VPWR
dir=inout}
B 5 697.5 -362.5 702.5 -357.5 {name=V2-
dir=inout}
B 5 667.5 -342.5 672.5 -337.5 {name=VGND
dir=inout}
T {Delay Block} 450 -470 0 0 0.4 0.4 {}
T {VIN} 325 -514 0 0 0.15 0.15 {}
T {DRAIN1} 325 -494 0 0 0.15 0.15 {}
T {DRAIN2} 325 -464 0 0 0.15 0.15 {}
T {VINbuffer1} 325 -434 0 0 0.15 0.15 {}
T {VOUTbuffer1} 325 -404 0 0 0.15 0.15 {}
T {VOUT1} 685 -514 0 0 0.15 0.15 {}
T {DRAIN1} 685 -494 0 0 0.15 0.15 {}
T {DRAIN2} 685 -464 0 0 0.15 0.15 {}
T {VINbuffer2} 675 -434 0 0 0.15 0.15 {}
T {VOUTbuffer2} 665 -404 0 0 0.15 0.15 {}
T {VINJ} 335 -534 0 0 0.15 0.15 {}
T {VTUN} 365 -534 0 0 0.15 0.15 {}
T {GATE1} 395 -534 0 0 0.15 0.15 {}
T {COLSEL1} 425 -524 0 0 0.15 0.15 {}
T {GATE2} 455 -534 0 0 0.15 0.15 {}
T {GATE3} 515 -534 0 0 0.15 0.15 {}
T {COLSEL3} 545 -524 0 0 0.15 0.15 {}
T {GATE3} 575 -534 0 0 0.15 0.15 {}
T {COLSEL2} 485 -524 0 0 0.15 0.15 {}
T {COLSEL4} 605 -524 0 0 0.15 0.15 {}
T {VPWR} 625 -534 0 0 0.15 0.15 {}
T {VGND} 665 -534 0 0 0.15 0.15 {}
T {V2-} 695 -534 0 0 0.15 0.15 {}
