v {xschem version=3.0.0 file_version=1.2 }
G {}
K {type=subcircuit
format="@name @pinlist @VGND @VPWR @symname"
template="name=x1 VGND=VGND VPWR=VPWR"
extra="VGND VPWR"}
V {}
S {}
E {}
L 4 -70 -20 -70 20 {}
L 4 40 -20 40 20 {}
L 4 -90 -10 -70 -10 {}
L 4 40 -10 60 -10 {}
L 4 -90 10 -70 10 {}
L 4 -70 -20 40 -20 {}
L 4 -70 20 40 20 {}
B 5 -92.5 7.5 -87.5 12.5 {name=VC dir=in }
B 5 57.5 -12.5 62.5 -7.5 {name=VOUT dir=out }
B 5 -92.5 -12.5 -87.5 -7.5 {name=VIN dir=in }
T {@symname} -31.5 -6 0 0 0.3 0.3 {}
T {@name} 45 -32 0 0 0.2 0.2 {}
T {VC} -65 6 0 0 0.2 0.2 {}
T {VOUT} 35 -14 0 1 0.2 0.2 {}
T {VIN} -65 -14 0 0 0.2 0.2 {}
