.title KiCad schematic
.include models/NE5534.lib
V1 VCC 0 36
V2 VEE 0 -36
R1 VCC Net-_R1-Pad2_ 22k
R3 Net-_R1-Pad2_ vcb 50k
R2 Net-_R1-Pad2_ vbal 50k
C1 vcomp vcb 10n
I1 vin 0 dc(0) ac 100n sin(0 100n 1k)
R8 vin 0 10
R6 vin 0 0.1
R7 vin_n 0 1k
R5 vin_p vin 1k
X1 vin_p vin_n VCC VEE vout vcomp vbal NE5534
R4 0 vin_p 100k
R10 vout vin_n 100k
R9 vout 0 10k
.control
set ngbehavior=ki
.endc
.end
