\beamer@sectionintoc {2}{Introduction: What is ``simulation?''}{3}{0}{1}
\beamer@subsectionintoc {2}{1}{System Behavior}{3}{0}{1}
\beamer@subsectionintoc {2}{2}{Overview of Electrical Models}{12}{0}{1}
\beamer@sectionintoc {3}{Usage}{19}{0}{2}
\beamer@subsectionintoc {3}{1}{Capturing Connectivity}{19}{0}{2}
\beamer@subsectionintoc {3}{2}{Interacting with the Simulator}{21}{0}{2}
