<svg width="36" height="19" viewBox="0 0 36 19" fill="none" xmlns="http://www.w3.org/2000/svg">
<line y1="1.5" x2="36" y2="1.5" stroke="white" stroke-width="3"/>
<line y1="9.5" x2="17" y2="9.5" stroke="white" stroke-width="3"/>
<line x1="19" y1="9.5" x2="36" y2="9.5" stroke="white" stroke-width="3"/>
<line y1="17.5" x2="36" y2="17.5" stroke="white" stroke-width="3"/>
</svg>