<svg width="450" height="92" viewBox="0 0 450 92" fill="none" xmlns="http://www.w3.org/2000/svg">
<g clip-path="url(#clip0)">
<path d="M255.829 34.1425H237.575V36.0966C243.284 36.0966 244.202 37.3233 244.202 44.5806V57.6649C244.202 64.9222 243.284 66.2521 237.575 66.2521C233.192 65.6387 230.233 63.2856 226.156 58.7885L221.464 53.678C227.786 52.5544 231.151 48.5675 231.151 44.0676C231.151 38.4469 226.359 34.1533 217.387 34.1533H199.441V36.0966C205.151 36.0966 206.068 37.3233 206.068 44.5806V57.6649C206.068 64.9222 205.151 66.2521 199.441 66.2521V68.1926H219.732V66.2521C214.022 66.2521 213.104 64.9222 213.104 57.6649V53.9738H214.837L226.156 68.1817H255.829C270.41 68.1817 276.732 60.4142 276.732 51.1105C276.732 41.8069 270.408 34.1425 255.829 34.1425ZM213.104 50.8038V37.2093H217.284C221.887 37.2093 223.912 40.3793 223.912 44.0568C223.912 47.6366 221.873 50.8038 217.284 50.8038H213.104ZM256.133 65.0145H255.418C251.747 65.0145 251.238 64.0944 251.238 59.391V37.2093H256.133C266.737 37.2093 268.672 44.9768 268.672 51.0101C268.672 57.2442 266.737 65.0145 256.133 65.0145Z" fill="#1C1D1D"/>
<path d="M142.65 54.5872L149.689 33.7326C151.73 27.7021 150.812 25.9651 144.274 25.9651V23.9214H163.444V25.9651C157.022 25.9651 155.493 27.4985 152.943 34.9621L141.315 69.9214H139.991L129.599 37.9258L118.994 69.9214H117.668L106.349 34.9621C103.913 27.4985 102.272 25.9651 96.3569 25.9651V23.9214H118.994V25.9651C112.976 25.9651 111.347 27.3954 113.488 33.7326L120.318 54.5872L130.606 23.9187H132.544L142.65 54.5872Z" fill="#1C1D1D"/>
<path d="M177.321 69.5117C166.105 69.5117 156.928 61.2312 156.928 51.1106C156.928 41.0931 166.105 32.8126 177.321 32.8126C188.537 32.8126 197.714 41.0931 197.714 51.1106C197.709 61.2312 188.531 69.5117 177.321 69.5117ZM177.321 35.9826C167.94 35.9826 164.676 44.4666 164.676 51.1106C164.676 57.8576 167.94 66.2413 177.321 66.2413C186.796 66.2413 190.066 57.8576 190.066 51.1106C190.061 44.4666 186.796 35.9826 177.321 35.9826Z" fill="#1C1D1D"/>
<path d="M301.911 66.138V68.1817H278.57V66.138C285.403 66.138 286.626 64.4011 286.626 54.1773V37.8226C286.626 27.5989 285.403 25.965 278.57 25.965V23.9214H299.686C310.187 23.9214 315.999 29.3494 315.999 36.5959C315.999 43.6523 310.187 49.17 299.686 49.17H293.874V54.1773C293.857 64.4011 295.084 66.138 301.911 66.138ZM299.67 27.5989H293.857V45.3866H299.67C305.379 45.3866 308.029 41.3997 308.029 36.5959C308.029 31.6916 305.371 27.5989 299.67 27.5989Z" fill="#1C1D1D"/>
<path d="M386.045 58.5741L385.534 60.4142C384.616 63.7878 383.495 65.0281 376.256 65.0281H374.827C369.526 65.0281 368.6 63.8013 368.6 56.544V51.8379C376.554 51.8379 377.166 52.5544 377.166 57.8685H379.104V42.6265H377.166C377.166 47.9433 376.554 48.6571 368.6 48.6571V37.2093H374.207C381.449 37.2093 382.569 38.4361 383.487 41.8232L383.999 43.7637H385.623L384.908 34.156H354.932V36.0966C360.641 36.0966 361.559 37.3233 361.559 44.5806V57.6649C361.559 64.3034 360.779 65.978 356.277 66.2141C352 65.56 349.062 63.2287 345.042 58.7885L340.353 53.678C346.675 52.5544 350.04 48.5675 350.04 44.0677C350.04 38.4469 345.248 34.1533 336.274 34.1533H318.328V36.0966C324.037 36.0966 324.955 37.3233 324.955 44.5806V57.6649C324.955 64.9222 324.037 66.2521 318.328 66.2521V68.1926H338.632V66.2521C332.922 66.2521 332.007 64.9222 332.007 57.6649V53.9738H333.74L345.056 68.1818H386.963L387.575 58.5741H386.045ZM332.007 50.8039V37.2093H336.187C340.773 37.2093 342.814 40.3793 342.814 44.0568C342.814 47.6366 340.773 50.8039 336.187 50.8039H332.007Z" fill="#1C1D1D"/>
<path d="M406.728 69.5115C402.651 69.5115 399.08 67.3647 397.551 66.0349C396.712 67.0292 396.151 68.229 395.926 69.5115H393.988V55.3986H396.027C396.839 62.1457 401.533 66.1326 407.551 66.1326C410.8 66.1326 413.464 64.2925 413.464 61.2256C413.464 58.5686 411.119 56.5249 406.939 54.5817L401.122 51.8378C397.042 49.8946 393.983 46.521 393.983 42.0239C393.983 37.1197 398.585 32.9265 404.895 32.9265C408.258 32.9265 411.122 34.1532 412.846 35.5862C413.355 35.1764 413.867 34.0501 414.173 32.8234H416.109V44.8872H413.967C413.255 40.0834 410.605 36.0965 405.201 36.0965C402.345 36.0965 399.692 37.7249 399.692 40.2869C399.692 42.944 401.834 44.3742 406.731 46.6242L412.34 49.3843C417.235 51.7347 419.17 55.518 419.17 58.5849C419.168 65.0144 413.561 69.5115 406.728 69.5115Z" fill="#1C1D1D"/>
<path d="M437.56 69.5115C433.481 69.5115 429.913 67.3647 428.383 66.0349C427.544 67.0292 426.984 68.229 426.759 69.5115H424.82V55.3986H426.859C427.671 62.1457 432.365 66.1326 438.381 66.1326C441.629 66.1326 444.296 64.2925 444.296 61.2256C444.296 58.5686 441.949 56.5249 437.769 54.5817L431.951 51.8378C427.874 49.8946 424.815 46.521 424.815 42.0239C424.815 37.1197 429.417 32.9265 435.725 32.9265C439.09 32.9265 441.951 34.1532 443.679 35.5862C444.188 35.1764 444.697 34.0501 445.002 32.8234H446.941V44.8872H444.791C444.077 40.0834 441.426 36.0965 436.023 36.0965C433.167 36.0965 430.516 37.7249 430.516 40.2869C430.516 42.944 432.658 44.3742 437.555 46.6242L443.167 49.3735C448.062 51.7238 450 55.5072 450 58.574C450 65.0144 444.391 69.5115 437.56 69.5115Z" fill="#1C1D1D"/>
<path d="M45.8859 2.76016C54.4791 2.74763 62.8786 5.31912 69.9988 10.1423C76.9347 14.8365 82.3644 21.4459 85.6301 29.1703C88.4276 35.7959 89.5291 43.0173 88.8346 50.1783C88.14 57.3392 85.6715 64.2126 81.6533 70.1738C76.9709 77.1272 70.3781 82.5706 62.6731 85.8446C56.0642 88.6491 48.861 89.7534 41.7181 89.0571C34.5752 88.3608 27.7191 85.886 21.7729 81.8577C17.1784 78.7462 13.2221 74.7799 10.1185 70.1738C5.30923 63.0339 2.73951 54.6153 2.73951 46C2.73951 37.3846 5.30923 28.9661 10.1185 21.8262C14.7992 14.8719 21.3926 9.4291 29.0986 6.15812C34.4082 3.90436 40.1172 2.74862 45.8831 2.76016H45.8859ZM45.8831 3.20287e-07C36.8085 0.00161061 27.938 2.70083 20.3935 7.75635C12.8489 12.8119 6.96911 19.9967 3.49749 28.4022C0.0258757 36.8077 -0.881625 46.0565 0.889743 54.9791C2.66111 63.9017 7.03179 72.0974 13.4491 78.5298C19.8665 84.9622 28.0423 89.3424 36.9427 91.1167C45.8431 92.891 55.0685 91.9795 63.4523 88.4977C71.836 85.0158 79.0017 79.1199 84.0431 71.5554C89.0846 63.9909 91.7754 55.0976 91.7754 46C91.7754 39.9587 90.5884 33.9766 88.2822 28.3953C85.976 22.814 82.5957 17.7427 78.3344 13.4712C74.0731 9.1996 69.0142 5.81138 63.4466 3.49998C57.8791 1.18859 51.9119 -0.000712555 45.8859 3.20287e-07H45.8831Z" fill="#1C1D1D"/>
<path d="M7.64772 46C7.64675 53.1988 9.66768 60.2525 13.4792 66.3536C17.2907 72.4546 22.7387 77.3564 29.1997 80.4979L10.9586 30.3971C8.77098 35.3062 7.64271 40.6233 7.64772 46ZM71.6971 44.0649C71.6971 39.3262 69.9997 36.0477 68.546 33.4802C66.6076 30.3211 64.7884 27.6477 64.7884 24.4886C64.7884 20.9604 67.455 17.6873 71.2099 17.6873C71.3804 17.6873 71.5401 17.7063 71.7053 17.7171C67.6221 13.9691 62.7756 11.1548 57.5009 9.46905C52.2262 7.78326 46.6493 7.26614 41.1557 7.95344C35.6621 8.64075 30.3829 10.5161 25.6833 13.4498C20.9836 16.3834 16.9757 20.3054 13.9365 24.9446C14.8353 24.9717 15.68 24.9907 16.3974 24.9907C20.3959 24.9907 26.5872 24.5022 26.5872 24.5022C28.6474 24.3828 28.891 27.4171 26.8336 27.6613C26.8336 27.6613 24.7599 27.9056 22.4561 28.0277L36.3818 69.5523L44.7498 44.3933L38.7939 28.0304C36.7338 27.9083 34.7819 27.664 34.7819 27.664C32.7217 27.5419 32.9627 24.3855 35.0255 24.5049C35.0255 24.5049 41.3387 24.9934 45.0963 24.9934C49.0948 24.9934 55.2862 24.5049 55.2862 24.5049C57.349 24.3855 57.59 27.4198 55.5298 27.664C55.5298 27.664 53.4561 27.9083 51.155 28.0304L64.9617 69.2347L68.906 56.7041C70.6711 51.2245 71.6971 47.3461 71.6971 44.0649ZM46.5636 49.3518L35.0824 82.7777C42.7861 85.0499 51.0075 84.8363 58.5835 82.1671C58.4782 81.9941 58.3877 81.8125 58.3128 81.6243L46.5636 49.3518ZM79.4478 27.6098C79.6206 28.9162 79.7065 30.2327 79.705 31.5505C79.705 35.4397 78.9768 39.812 76.7948 45.2808L65.1078 79.1328C73.721 74.1088 80.0382 65.9132 82.7149 56.2903C85.3917 46.6674 84.2166 36.3772 79.4397 27.6098H79.4478Z" fill="#1C1D1D"/>
</g>
<defs>
<clipPath id="clip0">
<rect width="450" height="92" fill="white"/>
</clipPath>
</defs>
</svg>
