{
  "4340":
  {
    "book": "4340",
    "full_res_image": "JPEG_1200px\/opna0001.jpg",
    "full_res_pdf": "HQ_PDF\/opna0001.pdf",
    "full_value": "4340\/opna0001.html",
    "text": "B\u00f3k 28-08-1947 til 30-06-1950 A\u00f0fnr. 4340 ",
    "type": "dagsetning",
    "register_pages":
    {
      "K\u00e1pa": [
      {
        "page_number": 1,
        "html_page": "opna0001.html",
        "image": "opna0001.jpg",
        "pdf": "opna0001.pdf"
      }],
      "B\u00f3k 4340": [
      {
        "page_number": 2,
        "html_page": "opna0002.html",
        "image": "opna0002.jpg",
        "pdf": "opna0002.pdf"
      }],
      "24.10.1947": [
      {
        "page_number": 3,
        "html_page": "opna0003.html",
        "image": "opna0003.jpg",
        "pdf": "opna0003.pdf"
      }],
      "28.08.1947": [
      {
        "page_number": 4,
        "html_page": "opna0004.html",
        "image": "opna0004.jpg",
        "pdf": "opna0004.pdf"
      },
      {
        "page_number": 5,
        "html_page": "opna0005.html",
        "image": "opna0005.jpg",
        "pdf": "opna0005.pdf"
      },
      {
        "page_number": 6,
        "html_page": "opna0006.html",
        "image": "opna0006.jpg",
        "pdf": "opna0006.pdf"
      },
      {
        "page_number": 7,
        "html_page": "opna0007.html",
        "image": "opna0007.jpg",
        "pdf": "opna0007.pdf"
      },
      {
        "page_number": 8,
        "html_page": "opna0008.html",
        "image": "opna0008.jpg",
        "pdf": "opna0008.pdf"
      },
      {
        "page_number": 9,
        "html_page": "opna0009.html",
        "image": "opna0009.jpg",
        "pdf": "opna0009.pdf"
      }],
      "29.09.1947": [
      {
        "page_number": 10,
        "html_page": "opna0010.html",
        "image": "opna0010.jpg",
        "pdf": "opna0010.pdf"
      },
      {
        "page_number": 11,
        "html_page": "opna0011.html",
        "image": "opna0011.jpg",
        "pdf": "opna0011.pdf"
      },
      {
        "page_number": 12,
        "html_page": "opna0012.html",
        "image": "opna0012.jpg",
        "pdf": "opna0012.pdf"
      },
      {
        "page_number": 13,
        "html_page": "opna0013.html",
        "image": "opna0013.jpg",
        "pdf": "opna0013.pdf"
      },
      {
        "page_number": 14,
        "html_page": "opna0014.html",
        "image": "opna0014.jpg",
        "pdf": "opna0014.pdf"
      },
      {
        "page_number": 15,
        "html_page": "opna0015.html",
        "image": "opna0015.jpg",
        "pdf": "opna0015.pdf"
      },
      {
        "page_number": 16,
        "html_page": "opna0016.html",
        "image": "opna0016.jpg",
        "pdf": "opna0016.pdf"
      },
      {
        "page_number": 17,
        "html_page": "opna0017.html",
        "image": "opna0017.jpg",
        "pdf": "opna0017.pdf"
      },
      {
        "page_number": 18,
        "html_page": "opna0018.html",
        "image": "opna0018.jpg",
        "pdf": "opna0018.pdf"
      }],
      "20.10.1947": [
      {
        "page_number": 19,
        "html_page": "opna0019.html",
        "image": "opna0019.jpg",
        "pdf": "opna0019.pdf"
      },
      {
        "page_number": 20,
        "html_page": "opna0020.html",
        "image": "opna0020.jpg",
        "pdf": "opna0020.pdf"
      },
      {
        "page_number": 21,
        "html_page": "opna0021.html",
        "image": "opna0021.jpg",
        "pdf": "opna0021.pdf"
      },
      {
        "page_number": 22,
        "html_page": "opna0022.html",
        "image": "opna0022.jpg",
        "pdf": "opna0022.pdf"
      },
      {
        "page_number": 23,
        "html_page": "opna0023.html",
        "image": "opna0023.jpg",
        "pdf": "opna0023.pdf"
      },
      {
        "page_number": 24,
        "html_page": "opna0024.html",
        "image": "opna0024.jpg",
        "pdf": "opna0024.pdf"
      },
      {
        "page_number": 25,
        "html_page": "opna0025.html",
        "image": "opna0025.jpg",
        "pdf": "opna0025.pdf"
      },
      {
        "page_number": 26,
        "html_page": "opna0026.html",
        "image": "opna0026.jpg",
        "pdf": "opna0026.pdf"
      },
      {
        "page_number": 27,
        "html_page": "opna0027.html",
        "image": "opna0027.jpg",
        "pdf": "opna0027.pdf"
      }],
      "24.11.1947": [
      {
        "page_number": 28,
        "html_page": "opna0028.html",
        "image": "opna0028.jpg",
        "pdf": "opna0028.pdf"
      },
      {
        "page_number": 29,
        "html_page": "opna0029.html",
        "image": "opna0029.jpg",
        "pdf": "opna0029.pdf"
      },
      {
        "page_number": 30,
        "html_page": "opna0030.html",
        "image": "opna0030.jpg",
        "pdf": "opna0030.pdf"
      }],
      "10.12.1947": [
      {
        "page_number": 31,
        "html_page": "opna0031.html",
        "image": "opna0031.jpg",
        "pdf": "opna0031.pdf"
      },
      {
        "page_number": 32,
        "html_page": "opna0032.html",
        "image": "opna0032.jpg",
        "pdf": "opna0032.pdf"
      },
      {
        "page_number": 33,
        "html_page": "opna0033.html",
        "image": "opna0033.jpg",
        "pdf": "opna0033.pdf"
      },
      {
        "page_number": 34,
        "html_page": "opna0034.html",
        "image": "opna0034.jpg",
        "pdf": "opna0034.pdf"
      },
      {
        "page_number": 35,
        "html_page": "opna0035.html",
        "image": "opna0035.jpg",
        "pdf": "opna0035.pdf"
      },
      {
        "page_number": 36,
        "html_page": "opna0036.html",
        "image": "opna0036.jpg",
        "pdf": "opna0036.pdf"
      },
      {
        "page_number": 37,
        "html_page": "opna0037.html",
        "image": "opna0037.jpg",
        "pdf": "opna0037.pdf"
      },
      {
        "page_number": 38,
        "html_page": "opna0038.html",
        "image": "opna0038.jpg",
        "pdf": "opna0038.pdf"
      },
      {
        "page_number": 39,
        "html_page": "opna0039.html",
        "image": "opna0039.jpg",
        "pdf": "opna0039.pdf"
      }],
      "20.01.1948": [
      {
        "page_number": 40,
        "html_page": "opna0040.html",
        "image": "opna0040.jpg",
        "pdf": "opna0040.pdf"
      },
      {
        "page_number": 41,
        "html_page": "opna0041.html",
        "image": "opna0041.jpg",
        "pdf": "opna0041.pdf"
      },
      {
        "page_number": 42,
        "html_page": "opna0042.html",
        "image": "opna0042.jpg",
        "pdf": "opna0042.pdf"
      },
      {
        "page_number": 43,
        "html_page": "opna0043.html",
        "image": "opna0043.jpg",
        "pdf": "opna0043.pdf"
      },
      {
        "page_number": 44,
        "html_page": "opna0044.html",
        "image": "opna0044.jpg",
        "pdf": "opna0044.pdf"
      },
      {
        "page_number": 45,
        "html_page": "opna0045.html",
        "image": "opna0045.jpg",
        "pdf": "opna0045.pdf"
      },
      {
        "page_number": 46,
        "html_page": "opna0046.html",
        "image": "opna0046.jpg",
        "pdf": "opna0046.pdf"
      },
      {
        "page_number": 47,
        "html_page": "opna0047.html",
        "image": "opna0047.jpg",
        "pdf": "opna0047.pdf"
      },
      {
        "page_number": 48,
        "html_page": "opna0048.html",
        "image": "opna0048.jpg",
        "pdf": "opna0048.pdf"
      },
      {
        "page_number": 49,
        "html_page": "opna0049.html",
        "image": "opna0049.jpg",
        "pdf": "opna0049.pdf"
      },
      {
        "page_number": 50,
        "html_page": "opna0050.html",
        "image": "opna0050.jpg",
        "pdf": "opna0050.pdf"
      },
      {
        "page_number": 51,
        "html_page": "opna0051.html",
        "image": "opna0051.jpg",
        "pdf": "opna0051.pdf"
      }],
      "06.02.1948": [
      {
        "page_number": 52,
        "html_page": "opna0052.html",
        "image": "opna0052.jpg",
        "pdf": "opna0052.pdf"
      },
      {
        "page_number": 53,
        "html_page": "opna0053.html",
        "image": "opna0053.jpg",
        "pdf": "opna0053.pdf"
      },
      {
        "page_number": 54,
        "html_page": "opna0054.html",
        "image": "opna0054.jpg",
        "pdf": "opna0054.pdf"
      },
      {
        "page_number": 55,
        "html_page": "opna0055.html",
        "image": "opna0055.jpg",
        "pdf": "opna0055.pdf"
      },
      {
        "page_number": 56,
        "html_page": "opna0056.html",
        "image": "opna0056.jpg",
        "pdf": "opna0056.pdf"
      },
      {
        "page_number": 57,
        "html_page": "opna0057.html",
        "image": "opna0057.jpg",
        "pdf": "opna0057.pdf"
      },
      {
        "page_number": 58,
        "html_page": "opna0058.html",
        "image": "opna0058.jpg",
        "pdf": "opna0058.pdf"
      },
      {
        "page_number": 59,
        "html_page": "opna0059.html",
        "image": "opna0059.jpg",
        "pdf": "opna0059.pdf"
      },
      {
        "page_number": 60,
        "html_page": "opna0060.html",
        "image": "opna0060.jpg",
        "pdf": "opna0060.pdf"
      }],
      "09.03.1948": [
      {
        "page_number": 61,
        "html_page": "opna0061.html",
        "image": "opna0061.jpg",
        "pdf": "opna0061.pdf"
      },
      {
        "page_number": 62,
        "html_page": "opna0062.html",
        "image": "opna0062.jpg",
        "pdf": "opna0062.pdf"
      },
      {
        "page_number": 63,
        "html_page": "opna0063.html",
        "image": "opna0063.jpg",
        "pdf": "opna0063.pdf"
      },
      {
        "page_number": 64,
        "html_page": "opna0064.html",
        "image": "opna0064.jpg",
        "pdf": "opna0064.pdf"
      },
      {
        "page_number": 65,
        "html_page": "opna0065.html",
        "image": "opna0065.jpg",
        "pdf": "opna0065.pdf"
      },
      {
        "page_number": 66,
        "html_page": "opna0066.html",
        "image": "opna0066.jpg",
        "pdf": "opna0066.pdf"
      },
      {
        "page_number": 67,
        "html_page": "opna0067.html",
        "image": "opna0067.jpg",
        "pdf": "opna0067.pdf"
      },
      {
        "page_number": 68,
        "html_page": "opna0068.html",
        "image": "opna0068.jpg",
        "pdf": "opna0068.pdf"
      },
      {
        "page_number": 70,
        "html_page": "opna0070.html",
        "image": "opna0070.jpg",
        "pdf": "opna0070.pdf"
      },
      {
        "page_number": 71,
        "html_page": "opna0071.html",
        "image": "opna0071.jpg",
        "pdf": "opna0071.pdf"
      },
      {
        "page_number": 72,
        "html_page": "opna0072.html",
        "image": "opna0072.jpg",
        "pdf": "opna0072.pdf"
      },
      {
        "page_number": 73,
        "html_page": "opna0073.html",
        "image": "opna0073.jpg",
        "pdf": "opna0073.pdf"
      },
      {
        "page_number": 74,
        "html_page": "opna0074.html",
        "image": "opna0074.jpg",
        "pdf": "opna0074.pdf"
      },
      {
        "page_number": 75,
        "html_page": "opna0075.html",
        "image": "opna0075.jpg",
        "pdf": "opna0075.pdf"
      },
      {
        "page_number": 76,
        "html_page": "opna0076.html",
        "image": "opna0076.jpg",
        "pdf": "opna0076.pdf"
      },
      {
        "page_number": 77,
        "html_page": "opna0077.html",
        "image": "opna0077.jpg",
        "pdf": "opna0077.pdf"
      }],
      "20.04.1948": [
      {
        "page_number": 69,
        "html_page": "opna0069.html",
        "image": "opna0069.jpg",
        "pdf": "opna0069.pdf"
      }],
      "29.05.1948": [
      {
        "page_number": 78,
        "html_page": "opna0078.html",
        "image": "opna0078.jpg",
        "pdf": "opna0078.pdf"
      },
      {
        "page_number": 79,
        "html_page": "opna0079.html",
        "image": "opna0079.jpg",
        "pdf": "opna0079.pdf"
      },
      {
        "page_number": 80,
        "html_page": "opna0080.html",
        "image": "opna0080.jpg",
        "pdf": "opna0080.pdf"
      },
      {
        "page_number": 81,
        "html_page": "opna0081.html",
        "image": "opna0081.jpg",
        "pdf": "opna0081.pdf"
      },
      {
        "page_number": 82,
        "html_page": "opna0082.html",
        "image": "opna0082.jpg",
        "pdf": "opna0082.pdf"
      }],
      "24.06.1948": [
      {
        "page_number": 83,
        "html_page": "opna0083.html",
        "image": "opna0083.jpg",
        "pdf": "opna0083.pdf"
      },
      {
        "page_number": 84,
        "html_page": "opna0084.html",
        "image": "opna0084.jpg",
        "pdf": "opna0084.pdf"
      },
      {
        "page_number": 85,
        "html_page": "opna0085.html",
        "image": "opna0085.jpg",
        "pdf": "opna0085.pdf"
      },
      {
        "page_number": 86,
        "html_page": "opna0086.html",
        "image": "opna0086.jpg",
        "pdf": "opna0086.pdf"
      },
      {
        "page_number": 87,
        "html_page": "opna0087.html",
        "image": "opna0087.jpg",
        "pdf": "opna0087.pdf"
      },
      {
        "page_number": 88,
        "html_page": "opna0088.html",
        "image": "opna0088.jpg",
        "pdf": "opna0088.pdf"
      },
      {
        "page_number": 89,
        "html_page": "opna0089.html",
        "image": "opna0089.jpg",
        "pdf": "opna0089.pdf"
      },
      {
        "page_number": 90,
        "html_page": "opna0090.html",
        "image": "opna0090.jpg",
        "pdf": "opna0090.pdf"
      },
      {
        "page_number": 91,
        "html_page": "opna0091.html",
        "image": "opna0091.jpg",
        "pdf": "opna0091.pdf"
      },
      {
        "page_number": 92,
        "html_page": "opna0092.html",
        "image": "opna0092.jpg",
        "pdf": "opna0092.pdf"
      },
      {
        "page_number": 93,
        "html_page": "opna0093.html",
        "image": "opna0093.jpg",
        "pdf": "opna0093.pdf"
      }],
      "10.08.1948": [
      {
        "page_number": 94,
        "html_page": "opna0094.html",
        "image": "opna0094.jpg",
        "pdf": "opna0094.pdf"
      },
      {
        "page_number": 95,
        "html_page": "opna0095.html",
        "image": "opna0095.jpg",
        "pdf": "opna0095.pdf"
      },
      {
        "page_number": 96,
        "html_page": "opna0096.html",
        "image": "opna0096.jpg",
        "pdf": "opna0096.pdf"
      },
      {
        "page_number": 97,
        "html_page": "opna0097.html",
        "image": "opna0097.jpg",
        "pdf": "opna0097.pdf"
      },
      {
        "page_number": 98,
        "html_page": "opna0098.html",
        "image": "opna0098.jpg",
        "pdf": "opna0098.pdf"
      },
      {
        "page_number": 99,
        "html_page": "opna0099.html",
        "image": "opna0099.jpg",
        "pdf": "opna0099.pdf"
      },
      {
        "page_number": 100,
        "html_page": "opna0100.html",
        "image": "opna0100.jpg",
        "pdf": "opna0100.pdf"
      }],
      "28.09.1948": [
      {
        "page_number": 101,
        "html_page": "opna0101.html",
        "image": "opna0101.jpg",
        "pdf": "opna0101.pdf"
      },
      {
        "page_number": 102,
        "html_page": "opna0102.html",
        "image": "opna0102.jpg",
        "pdf": "opna0102.pdf"
      },
      {
        "page_number": 103,
        "html_page": "opna0103.html",
        "image": "opna0103.jpg",
        "pdf": "opna0103.pdf"
      },
      {
        "page_number": 104,
        "html_page": "opna0104.html",
        "image": "opna0104.jpg",
        "pdf": "opna0104.pdf"
      },
      {
        "page_number": 105,
        "html_page": "opna0105.html",
        "image": "opna0105.jpg",
        "pdf": "opna0105.pdf"
      },
      {
        "page_number": 106,
        "html_page": "opna0106.html",
        "image": "opna0106.jpg",
        "pdf": "opna0106.pdf"
      },
      {
        "page_number": 107,
        "html_page": "opna0107.html",
        "image": "opna0107.jpg",
        "pdf": "opna0107.pdf"
      },
      {
        "page_number": 108,
        "html_page": "opna0108.html",
        "image": "opna0108.jpg",
        "pdf": "opna0108.pdf"
      },
      {
        "page_number": 109,
        "html_page": "opna0109.html",
        "image": "opna0109.jpg",
        "pdf": "opna0109.pdf"
      },
      {
        "page_number": 110,
        "html_page": "opna0110.html",
        "image": "opna0110.jpg",
        "pdf": "opna0110.pdf"
      },
      {
        "page_number": 111,
        "html_page": "opna0111.html",
        "image": "opna0111.jpg",
        "pdf": "opna0111.pdf"
      }],
      "06.11.1948": [
      {
        "page_number": 112,
        "html_page": "opna0112.html",
        "image": "opna0112.jpg",
        "pdf": "opna0112.pdf"
      },
      {
        "page_number": 113,
        "html_page": "opna0113.html",
        "image": "opna0113.jpg",
        "pdf": "opna0113.pdf"
      },
      {
        "page_number": 114,
        "html_page": "opna0114.html",
        "image": "opna0114.jpg",
        "pdf": "opna0114.pdf"
      },
      {
        "page_number": 115,
        "html_page": "opna0115.html",
        "image": "opna0115.jpg",
        "pdf": "opna0115.pdf"
      },
      {
        "page_number": 116,
        "html_page": "opna0116.html",
        "image": "opna0116.jpg",
        "pdf": "opna0116.pdf"
      },
      {
        "page_number": 117,
        "html_page": "opna0117.html",
        "image": "opna0117.jpg",
        "pdf": "opna0117.pdf"
      },
      {
        "page_number": 118,
        "html_page": "opna0118.html",
        "image": "opna0118.jpg",
        "pdf": "opna0118.pdf"
      },
      {
        "page_number": 119,
        "html_page": "opna0119.html",
        "image": "opna0119.jpg",
        "pdf": "opna0119.pdf"
      }],
      "10.12.1948": [
      {
        "page_number": 120,
        "html_page": "opna0120.html",
        "image": "opna0120.jpg",
        "pdf": "opna0120.pdf"
      },
      {
        "page_number": 121,
        "html_page": "opna0121.html",
        "image": "opna0121.jpg",
        "pdf": "opna0121.pdf"
      },
      {
        "page_number": 122,
        "html_page": "opna0122.html",
        "image": "opna0122.jpg",
        "pdf": "opna0122.pdf"
      },
      {
        "page_number": 123,
        "html_page": "opna0123.html",
        "image": "opna0123.jpg",
        "pdf": "opna0123.pdf"
      }],
      "28.12.1948": [
      {
        "page_number": 124,
        "html_page": "opna0124.html",
        "image": "opna0124.jpg",
        "pdf": "opna0124.pdf"
      },
      {
        "page_number": 125,
        "html_page": "opna0125.html",
        "image": "opna0125.jpg",
        "pdf": "opna0125.pdf"
      },
      {
        "page_number": 126,
        "html_page": "opna0126.html",
        "image": "opna0126.jpg",
        "pdf": "opna0126.pdf"
      },
      {
        "page_number": 127,
        "html_page": "opna0127.html",
        "image": "opna0127.jpg",
        "pdf": "opna0127.pdf"
      },
      {
        "page_number": 128,
        "html_page": "opna0128.html",
        "image": "opna0128.jpg",
        "pdf": "opna0128.pdf"
      },
      {
        "page_number": 129,
        "html_page": "opna0129.html",
        "image": "opna0129.jpg",
        "pdf": "opna0129.pdf"
      }],
      "31.01.1949": [
      {
        "page_number": 130,
        "html_page": "opna0130.html",
        "image": "opna0130.jpg",
        "pdf": "opna0130.pdf"
      },
      {
        "page_number": 131,
        "html_page": "opna0131.html",
        "image": "opna0131.jpg",
        "pdf": "opna0131.pdf"
      },
      {
        "page_number": 132,
        "html_page": "opna0132.html",
        "image": "opna0132.jpg",
        "pdf": "opna0132.pdf"
      },
      {
        "page_number": 133,
        "html_page": "opna0133.html",
        "image": "opna0133.jpg",
        "pdf": "opna0133.pdf"
      },
      {
        "page_number": 134,
        "html_page": "opna0134.html",
        "image": "opna0134.jpg",
        "pdf": "opna0134.pdf"
      },
      {
        "page_number": 135,
        "html_page": "opna0135.html",
        "image": "opna0135.jpg",
        "pdf": "opna0135.pdf"
      },
      {
        "page_number": 136,
        "html_page": "opna0136.html",
        "image": "opna0136.jpg",
        "pdf": "opna0136.pdf"
      },
      {
        "page_number": 137,
        "html_page": "opna0137.html",
        "image": "opna0137.jpg",
        "pdf": "opna0137.pdf"
      }],
      "28.02.1949": [
      {
        "page_number": 138,
        "html_page": "opna0138.html",
        "image": "opna0138.jpg",
        "pdf": "opna0138.pdf"
      },
      {
        "page_number": 139,
        "html_page": "opna0139.html",
        "image": "opna0139.jpg",
        "pdf": "opna0139.pdf"
      },
      {
        "page_number": 140,
        "html_page": "opna0140.html",
        "image": "opna0140.jpg",
        "pdf": "opna0140.pdf"
      },
      {
        "page_number": 141,
        "html_page": "opna0141.html",
        "image": "opna0141.jpg",
        "pdf": "opna0141.pdf"
      },
      {
        "page_number": 142,
        "html_page": "opna0142.html",
        "image": "opna0142.jpg",
        "pdf": "opna0142.pdf"
      }],
      "12.04.1949": [
      {
        "page_number": 143,
        "html_page": "opna0143.html",
        "image": "opna0143.jpg",
        "pdf": "opna0143.pdf"
      },
      {
        "page_number": 144,
        "html_page": "opna0144.html",
        "image": "opna0144.jpg",
        "pdf": "opna0144.pdf"
      },
      {
        "page_number": 145,
        "html_page": "opna0145.html",
        "image": "opna0145.jpg",
        "pdf": "opna0145.pdf"
      },
      {
        "page_number": 146,
        "html_page": "opna0146.html",
        "image": "opna0146.jpg",
        "pdf": "opna0146.pdf"
      },
      {
        "page_number": 147,
        "html_page": "opna0147.html",
        "image": "opna0147.jpg",
        "pdf": "opna0147.pdf"
      },
      {
        "page_number": 148,
        "html_page": "opna0148.html",
        "image": "opna0148.jpg",
        "pdf": "opna0148.pdf"
      },
      {
        "page_number": 149,
        "html_page": "opna0149.html",
        "image": "opna0149.jpg",
        "pdf": "opna0149.pdf"
      },
      {
        "page_number": 150,
        "html_page": "opna0150.html",
        "image": "opna0150.jpg",
        "pdf": "opna0150.pdf"
      },
      {
        "page_number": 151,
        "html_page": "opna0151.html",
        "image": "opna0151.jpg",
        "pdf": "opna0151.pdf"
      },
      {
        "page_number": 152,
        "html_page": "opna0152.html",
        "image": "opna0152.jpg",
        "pdf": "opna0152.pdf"
      },
      {
        "page_number": 153,
        "html_page": "opna0153.html",
        "image": "opna0153.jpg",
        "pdf": "opna0153.pdf"
      }],
      "24.05.1949": [
      {
        "page_number": 154,
        "html_page": "opna0154.html",
        "image": "opna0154.jpg",
        "pdf": "opna0154.pdf"
      },
      {
        "page_number": 155,
        "html_page": "opna0155.html",
        "image": "opna0155.jpg",
        "pdf": "opna0155.pdf"
      },
      {
        "page_number": 156,
        "html_page": "opna0156.html",
        "image": "opna0156.jpg",
        "pdf": "opna0156.pdf"
      },
      {
        "page_number": 157,
        "html_page": "opna0157.html",
        "image": "opna0157.jpg",
        "pdf": "opna0157.pdf"
      },
      {
        "page_number": 158,
        "html_page": "opna0158.html",
        "image": "opna0158.jpg",
        "pdf": "opna0158.pdf"
      },
      {
        "page_number": 159,
        "html_page": "opna0159.html",
        "image": "opna0159.jpg",
        "pdf": "opna0159.pdf"
      },
      {
        "page_number": 160,
        "html_page": "opna0160.html",
        "image": "opna0160.jpg",
        "pdf": "opna0160.pdf"
      },
      {
        "page_number": 161,
        "html_page": "opna0161.html",
        "image": "opna0161.jpg",
        "pdf": "opna0161.pdf"
      }],
      "05.07.1949": [
      {
        "page_number": 162,
        "html_page": "opna0162.html",
        "image": "opna0162.jpg",
        "pdf": "opna0162.pdf"
      },
      {
        "page_number": 163,
        "html_page": "opna0163.html",
        "image": "opna0163.jpg",
        "pdf": "opna0163.pdf"
      },
      {
        "page_number": 164,
        "html_page": "opna0164.html",
        "image": "opna0164.jpg",
        "pdf": "opna0164.pdf"
      },
      {
        "page_number": 165,
        "html_page": "opna0165.html",
        "image": "opna0165.jpg",
        "pdf": "opna0165.pdf"
      },
      {
        "page_number": 166,
        "html_page": "opna0166.html",
        "image": "opna0166.jpg",
        "pdf": "opna0166.pdf"
      },
      {
        "page_number": 167,
        "html_page": "opna0167.html",
        "image": "opna0167.jpg",
        "pdf": "opna0167.pdf"
      },
      {
        "page_number": 168,
        "html_page": "opna0168.html",
        "image": "opna0168.jpg",
        "pdf": "opna0168.pdf"
      }],
      "20.08.1949": [
      {
        "page_number": 169,
        "html_page": "opna0169.html",
        "image": "opna0169.jpg",
        "pdf": "opna0169.pdf"
      },
      {
        "page_number": 170,
        "html_page": "opna0170.html",
        "image": "opna0170.jpg",
        "pdf": "opna0170.pdf"
      },
      {
        "page_number": 171,
        "html_page": "opna0171.html",
        "image": "opna0171.jpg",
        "pdf": "opna0171.pdf"
      },
      {
        "page_number": 172,
        "html_page": "opna0172.html",
        "image": "opna0172.jpg",
        "pdf": "opna0172.pdf"
      },
      {
        "page_number": 173,
        "html_page": "opna0173.html",
        "image": "opna0173.jpg",
        "pdf": "opna0173.pdf"
      },
      {
        "page_number": 174,
        "html_page": "opna0174.html",
        "image": "opna0174.jpg",
        "pdf": "opna0174.pdf"
      },
      {
        "page_number": 175,
        "html_page": "opna0175.html",
        "image": "opna0175.jpg",
        "pdf": "opna0175.pdf"
      }],
      "23.09.1949": [
      {
        "page_number": 176,
        "html_page": "opna0176.html",
        "image": "opna0176.jpg",
        "pdf": "opna0176.pdf"
      },
      {
        "page_number": 177,
        "html_page": "opna0177.html",
        "image": "opna0177.jpg",
        "pdf": "opna0177.pdf"
      },
      {
        "page_number": 178,
        "html_page": "opna0178.html",
        "image": "opna0178.jpg",
        "pdf": "opna0178.pdf"
      },
      {
        "page_number": 179,
        "html_page": "opna0179.html",
        "image": "opna0179.jpg",
        "pdf": "opna0179.pdf"
      }],
      "24.10.1949": [
      {
        "page_number": 180,
        "html_page": "opna0180.html",
        "image": "opna0180.jpg",
        "pdf": "opna0180.pdf"
      },
      {
        "page_number": 181,
        "html_page": "opna0181.html",
        "image": "opna0181.jpg",
        "pdf": "opna0181.pdf"
      },
      {
        "page_number": 182,
        "html_page": "opna0182.html",
        "image": "opna0182.jpg",
        "pdf": "opna0182.pdf"
      },
      {
        "page_number": 183,
        "html_page": "opna0183.html",
        "image": "opna0183.jpg",
        "pdf": "opna0183.pdf"
      },
      {
        "page_number": 184,
        "html_page": "opna0184.html",
        "image": "opna0184.jpg",
        "pdf": "opna0184.pdf"
      },
      {
        "page_number": 185,
        "html_page": "opna0185.html",
        "image": "opna0185.jpg",
        "pdf": "opna0185.pdf"
      }],
      "25.11.1949": [
      {
        "page_number": 186,
        "html_page": "opna0186.html",
        "image": "opna0186.jpg",
        "pdf": "opna0186.pdf"
      },
      {
        "page_number": 187,
        "html_page": "opna0187.html",
        "image": "opna0187.jpg",
        "pdf": "opna0187.pdf"
      },
      {
        "page_number": 188,
        "html_page": "opna0188.html",
        "image": "opna0188.jpg",
        "pdf": "opna0188.pdf"
      },
      {
        "page_number": 189,
        "html_page": "opna0189.html",
        "image": "opna0189.jpg",
        "pdf": "opna0189.pdf"
      },
      {
        "page_number": 190,
        "html_page": "opna0190.html",
        "image": "opna0190.jpg",
        "pdf": "opna0190.pdf"
      },
      {
        "page_number": 191,
        "html_page": "opna0191.html",
        "image": "opna0191.jpg",
        "pdf": "opna0191.pdf"
      },
      {
        "page_number": 192,
        "html_page": "opna0192.html",
        "image": "opna0192.jpg",
        "pdf": "opna0192.pdf"
      }],
      "20.12.1949": [
      {
        "page_number": 193,
        "html_page": "opna0193.html",
        "image": "opna0193.jpg",
        "pdf": "opna0193.pdf"
      },
      {
        "page_number": 194,
        "html_page": "opna0194.html",
        "image": "opna0194.jpg",
        "pdf": "opna0194.pdf"
      },
      {
        "page_number": 195,
        "html_page": "opna0195.html",
        "image": "opna0195.jpg",
        "pdf": "opna0195.pdf"
      },
      {
        "page_number": 196,
        "html_page": "opna0196.html",
        "image": "opna0196.jpg",
        "pdf": "opna0196.pdf"
      }],
      "16.01.1950": [
      {
        "page_number": 197,
        "html_page": "opna0197.html",
        "image": "opna0197.jpg",
        "pdf": "opna0197.pdf"
      },
      {
        "page_number": 198,
        "html_page": "opna0198.html",
        "image": "opna0198.jpg",
        "pdf": "opna0198.pdf"
      },
      {
        "page_number": 199,
        "html_page": "opna0199.html",
        "image": "opna0199.jpg",
        "pdf": "opna0199.pdf"
      },
      {
        "page_number": 200,
        "html_page": "opna0200.html",
        "image": "opna0200.jpg",
        "pdf": "opna0200.pdf"
      },
      {
        "page_number": 201,
        "html_page": "opna0201.html",
        "image": "opna0201.jpg",
        "pdf": "opna0201.pdf"
      },
      {
        "page_number": 202,
        "html_page": "opna0202.html",
        "image": "opna0202.jpg",
        "pdf": "opna0202.pdf"
      },
      {
        "page_number": 203,
        "html_page": "opna0203.html",
        "image": "opna0203.jpg",
        "pdf": "opna0203.pdf"
      },
      {
        "page_number": 204,
        "html_page": "opna0204.html",
        "image": "opna0204.jpg",
        "pdf": "opna0204.pdf"
      }],
      "15.02.1950": [
      {
        "page_number": 205,
        "html_page": "opna0205.html",
        "image": "opna0205.jpg",
        "pdf": "opna0205.pdf"
      },
      {
        "page_number": 206,
        "html_page": "opna0206.html",
        "image": "opna0206.jpg",
        "pdf": "opna0206.pdf"
      },
      {
        "page_number": 207,
        "html_page": "opna0207.html",
        "image": "opna0207.jpg",
        "pdf": "opna0207.pdf"
      },
      {
        "page_number": 208,
        "html_page": "opna0208.html",
        "image": "opna0208.jpg",
        "pdf": "opna0208.pdf"
      }],
      "09.03.1950": [
      {
        "page_number": 209,
        "html_page": "opna0209.html",
        "image": "opna0209.jpg",
        "pdf": "opna0209.pdf"
      },
      {
        "page_number": 210,
        "html_page": "opna0210.html",
        "image": "opna0210.jpg",
        "pdf": "opna0210.pdf"
      },
      {
        "page_number": 211,
        "html_page": "opna0211.html",
        "image": "opna0211.jpg",
        "pdf": "opna0211.pdf"
      },
      {
        "page_number": 212,
        "html_page": "opna0212.html",
        "image": "opna0212.jpg",
        "pdf": "opna0212.pdf"
      }],
      "14.04.1950": [
      {
        "page_number": 213,
        "html_page": "opna0213.html",
        "image": "opna0213.jpg",
        "pdf": "opna0213.pdf"
      },
      {
        "page_number": 214,
        "html_page": "opna0214.html",
        "image": "opna0214.jpg",
        "pdf": "opna0214.pdf"
      },
      {
        "page_number": 215,
        "html_page": "opna0215.html",
        "image": "opna0215.jpg",
        "pdf": "opna0215.pdf"
      },
      {
        "page_number": 216,
        "html_page": "opna0216.html",
        "image": "opna0216.jpg",
        "pdf": "opna0216.pdf"
      },
      {
        "page_number": 217,
        "html_page": "opna0217.html",
        "image": "opna0217.jpg",
        "pdf": "opna0217.pdf"
      },
      {
        "page_number": 218,
        "html_page": "opna0218.html",
        "image": "opna0218.jpg",
        "pdf": "opna0218.pdf"
      },
      {
        "page_number": 219,
        "html_page": "opna0219.html",
        "image": "opna0219.jpg",
        "pdf": "opna0219.pdf"
      },
      {
        "page_number": 220,
        "html_page": "opna0220.html",
        "image": "opna0220.jpg",
        "pdf": "opna0220.pdf"
      },
      {
        "page_number": 221,
        "html_page": "opna0221.html",
        "image": "opna0221.jpg",
        "pdf": "opna0221.pdf"
      }],
      "17.05.1950": [
      {
        "page_number": 222,
        "html_page": "opna0222.html",
        "image": "opna0222.jpg",
        "pdf": "opna0222.pdf"
      },
      {
        "page_number": 223,
        "html_page": "opna0223.html",
        "image": "opna0223.jpg",
        "pdf": "opna0223.pdf"
      },
      {
        "page_number": 224,
        "html_page": "opna0224.html",
        "image": "opna0224.jpg",
        "pdf": "opna0224.pdf"
      },
      {
        "page_number": 225,
        "html_page": "opna0225.html",
        "image": "opna0225.jpg",
        "pdf": "opna0225.pdf"
      },
      {
        "page_number": 226,
        "html_page": "opna0226.html",
        "image": "opna0226.jpg",
        "pdf": "opna0226.pdf"
      }],
      "30.06.1950": [
      {
        "page_number": 227,
        "html_page": "opna0227.html",
        "image": "opna0227.jpg",
        "pdf": "opna0227.pdf"
      },
      {
        "page_number": 228,
        "html_page": "opna0228.html",
        "image": "opna0228.jpg",
        "pdf": "opna0228.pdf"
      },
      {
        "page_number": 229,
        "html_page": "opna0229.html",
        "image": "opna0229.jpg",
        "pdf": "opna0229.pdf"
      },
      {
        "page_number": 230,
        "html_page": "opna0230.html",
        "image": "opna0230.jpg",
        "pdf": "opna0230.pdf"
      },
      {
        "page_number": 231,
        "html_page": "opna0231.html",
        "image": "opna0231.jpg",
        "pdf": "opna0231.pdf"
      }],
      "Bak": [
      {
        "page_number": 232,
        "html_page": "opna0232.html",
        "image": "opna0232.jpg",
        "pdf": "opna0232.pdf"
      }]
    }
  }
}