{
	"737":
  {
    "book": "737",
    "full_res_image": "JPEG_1200px\/opna0001.jpg",
    "full_res_pdf": "HQ_PDF\/opna0001.pdf",
    "full_value": "737\/opna0001.html",
    "text": "B\u00f3k 04-04-1911 til 20-05-1915 A\u00f0fnr. 737 ",
    "type": "dagsetning",
    "register_pages":
    {
      "K\u00e1pa": [
      {
        "page_number": 1,
        "html_page": "opna0001.html",
        "image": "opna0001.jpg",
        "pdf": "opna0001.pdf"
      }],
      "B\u00f3k 737": [
      {
        "page_number": 2,
        "html_page": "opna0002.html",
        "image": "opna0002.jpg",
        "pdf": "opna0002.pdf"
      }],
      "1911-1915": [
      {
        "page_number": 3,
        "html_page": "opna0003.html",
        "image": "opna0003.jpg",
        "pdf": "opna0003.pdf"
      }],
      "04.04.1911": [
      {
        "page_number": 4,
        "html_page": "opna0004.html",
        "image": "opna0004.jpg",
        "pdf": "opna0004.pdf"
      }],
      "02.05.1911": [
      {
        "page_number": 5,
        "html_page": "opna0005.html",
        "image": "opna0005.jpg",
        "pdf": "opna0005.pdf"
      }],
      "08.05.1911": [
      {
        "page_number": 6,
        "html_page": "opna0006.html",
        "image": "opna0006.jpg",
        "pdf": "opna0006.pdf"
      }],
      "29.05.1911": [
      {
        "page_number": 7,
        "html_page": "opna0007.html",
        "image": "opna0007.jpg",
        "pdf": "opna0007.pdf"
      }],
      "21.05.1911": [
      {
        "page_number": 8,
        "html_page": "opna0008.html",
        "image": "opna0008.jpg",
        "pdf": "opna0008.pdf"
      }],
      "17.07.1911": [
      {
        "page_number": 9,
        "html_page": "opna0009.html",
        "image": "opna0009.jpg",
        "pdf": "opna0009.pdf"
      }],
      "01.08.1911": [
      {
        "page_number": 10,
        "html_page": "opna0010.html",
        "image": "opna0010.jpg",
        "pdf": "opna0010.pdf"
      },
      {
        "page_number": 11,
        "html_page": "opna0011.html",
        "image": "opna0011.jpg",
        "pdf": "opna0011.pdf"
      }],
      "21.08.1911": [
      {
        "page_number": 12,
        "html_page": "opna0012.html",
        "image": "opna0012.jpg",
        "pdf": "opna0012.pdf"
      },
      {
        "page_number": 13,
        "html_page": "opna0013.html",
        "image": "opna0013.jpg",
        "pdf": "opna0013.pdf"
      }],
      "02.09.1911": [
      {
        "page_number": 14,
        "html_page": "opna0014.html",
        "image": "opna0014.jpg",
        "pdf": "opna0014.pdf"
      }],
      "15.09.1911": [
      {
        "page_number": 15,
        "html_page": "opna0015.html",
        "image": "opna0015.jpg",
        "pdf": "opna0015.pdf"
      },
      {
        "page_number": 16,
        "html_page": "opna0016.html",
        "image": "opna0016.jpg",
        "pdf": "opna0016.pdf"
      }],
      "25.09.1911": [
      {
        "page_number": 17,
        "html_page": "opna0017.html",
        "image": "opna0017.jpg",
        "pdf": "opna0017.pdf"
      }],
      "27.10.1911": [
      {
        "page_number": 18,
        "html_page": "opna0018.html",
        "image": "opna0018.jpg",
        "pdf": "opna0018.pdf"
      }],
      "30.10.1911": [
      {
        "page_number": 19,
        "html_page": "opna0019.html",
        "image": "opna0019.jpg",
        "pdf": "opna0019.pdf"
      }],
      "06.11.1911": [
      {
        "page_number": 20,
        "html_page": "opna0020.html",
        "image": "opna0020.jpg",
        "pdf": "opna0020.pdf"
      }],
      "02.12.1911": [
      {
        "page_number": 21,
        "html_page": "opna0021.html",
        "image": "opna0021.jpg",
        "pdf": "opna0021.pdf"
      }],
      "05.12.1911": [
      {
        "page_number": 22,
        "html_page": "opna0022.html",
        "image": "opna0022.jpg",
        "pdf": "opna0022.pdf"
      }],
      "18.12.1911": [
      {
        "page_number": 23,
        "html_page": "opna0023.html",
        "image": "opna0023.jpg",
        "pdf": "opna0023.pdf"
      }],
      "29.12.1911": [
      {
        "page_number": 24,
        "html_page": "opna0024.html",
        "image": "opna0024.jpg",
        "pdf": "opna0024.pdf"
      }],
      "03.02.1912": [
      {
        "page_number": 25,
        "html_page": "opna0025.html",
        "image": "opna0025.jpg",
        "pdf": "opna0025.pdf"
      }],
      "12.01.1912": [
      {
        "page_number": 26,
        "html_page": "opna0026.html",
        "image": "opna0026.jpg",
        "pdf": "opna0026.pdf"
      }],
      "25.01.1912": [
      {
        "page_number": 27,
        "html_page": "opna0027.html",
        "image": "opna0027.jpg",
        "pdf": "opna0027.pdf"
      }],
      "30.01.1912": [
      {
        "page_number": 28,
        "html_page": "opna0028.html",
        "image": "opna0028.jpg",
        "pdf": "opna0028.pdf"
      }],
      "09.02.1912": [
      {
        "page_number": 29,
        "html_page": "opna0029.html",
        "image": "opna0029.jpg",
        "pdf": "opna0029.pdf"
      }],
      "27.02.1912": [
      {
        "page_number": 30,
        "html_page": "opna0030.html",
        "image": "opna0030.jpg",
        "pdf": "opna0030.pdf"
      }],
      "23.04.1912": [
      {
        "page_number": 31,
        "html_page": "opna0031.html",
        "image": "opna0031.jpg",
        "pdf": "opna0031.pdf"
      }],
      "27.04.1912": [
      {
        "page_number": 32,
        "html_page": "opna0032.html",
        "image": "opna0032.jpg",
        "pdf": "opna0032.pdf"
      },
      {
        "page_number": 33,
        "html_page": "opna0033.html",
        "image": "opna0033.jpg",
        "pdf": "opna0033.pdf"
      }],
      "08.05.1912": [
      {
        "page_number": 34,
        "html_page": "opna0034.html",
        "image": "opna0034.jpg",
        "pdf": "opna0034.pdf"
      }],
      "11.05.1912": [
      {
        "page_number": 35,
        "html_page": "opna0035.html",
        "image": "opna0035.jpg",
        "pdf": "opna0035.pdf"
      }],
      "20.05.1912": [
      {
        "page_number": 36,
        "html_page": "opna0036.html",
        "image": "opna0036.jpg",
        "pdf": "opna0036.pdf"
      }],
      "22.05.1912": [
      {
        "page_number": 37,
        "html_page": "opna0037.html",
        "image": "opna0037.jpg",
        "pdf": "opna0037.pdf"
      }],
      "29.06.1912": [
      {
        "page_number": 38,
        "html_page": "opna0038.html",
        "image": "opna0038.jpg",
        "pdf": "opna0038.pdf"
      }],
      "09.07.1912": [
      {
        "page_number": 39,
        "html_page": "opna0039.html",
        "image": "opna0039.jpg",
        "pdf": "opna0039.pdf"
      }],
      "19.07.1912": [
      {
        "page_number": 40,
        "html_page": "opna0040.html",
        "image": "opna0040.jpg",
        "pdf": "opna0040.pdf"
      }],
      "26.08.1912": [
      {
        "page_number": 41,
        "html_page": "opna0041.html",
        "image": "opna0041.jpg",
        "pdf": "opna0041.pdf"
      }],
      "03.09.1912": [
      {
        "page_number": 42,
        "html_page": "opna0042.html",
        "image": "opna0042.jpg",
        "pdf": "opna0042.pdf"
      }],
      "05.09.1912": [
      {
        "page_number": 43,
        "html_page": "opna0043.html",
        "image": "opna0043.jpg",
        "pdf": "opna0043.pdf"
      }],
      "23.07.1912": [
      {
        "page_number": 44,
        "html_page": "opna0044.html",
        "image": "opna0044.jpg",
        "pdf": "opna0044.pdf"
      }],
      "13.09.1912": [
      {
        "page_number": 45,
        "html_page": "opna0045.html",
        "image": "opna0045.jpg",
        "pdf": "opna0045.pdf"
      }],
      "16.09.1912": [
      {
        "page_number": 46,
        "html_page": "opna0046.html",
        "image": "opna0046.jpg",
        "pdf": "opna0046.pdf"
      }],
      "17.09.1912": [
      {
        "page_number": 47,
        "html_page": "opna0047.html",
        "image": "opna0047.jpg",
        "pdf": "opna0047.pdf"
      }],
      "26.09.1912": [
      {
        "page_number": 48,
        "html_page": "opna0048.html",
        "image": "opna0048.jpg",
        "pdf": "opna0048.pdf"
      }],
      "05.10.1912": [
      {
        "page_number": 49,
        "html_page": "opna0049.html",
        "image": "opna0049.jpg",
        "pdf": "opna0049.pdf"
      },
      {
        "page_number": 50,
        "html_page": "opna0050.html",
        "image": "opna0050.jpg",
        "pdf": "opna0050.pdf"
      }],
      "15.10.1912": [
      {
        "page_number": 51,
        "html_page": "opna0051.html",
        "image": "opna0051.jpg",
        "pdf": "opna0051.pdf"
      }],
      "24.10.1912": [
      {
        "page_number": 52,
        "html_page": "opna0052.html",
        "image": "opna0052.jpg",
        "pdf": "opna0052.pdf"
      },
      {
        "page_number": 53,
        "html_page": "opna0053.html",
        "image": "opna0053.jpg",
        "pdf": "opna0053.pdf"
      }],
      "31.10.1912": [
      {
        "page_number": 54,
        "html_page": "opna0054.html",
        "image": "opna0054.jpg",
        "pdf": "opna0054.pdf"
      }],
      "11.11.1912": [
      {
        "page_number": 55,
        "html_page": "opna0055.html",
        "image": "opna0055.jpg",
        "pdf": "opna0055.pdf"
      }],
      "19.11.1912": [
      {
        "page_number": 56,
        "html_page": "opna0056.html",
        "image": "opna0056.jpg",
        "pdf": "opna0056.pdf"
      }],
      "20.11.1912": [
      {
        "page_number": 57,
        "html_page": "opna0057.html",
        "image": "opna0057.jpg",
        "pdf": "opna0057.pdf"
      }],
      "03.12.1912": [
      {
        "page_number": 58,
        "html_page": "opna0058.html",
        "image": "opna0058.jpg",
        "pdf": "opna0058.pdf"
      }],
      "17.12.1912": [
      {
        "page_number": 59,
        "html_page": "opna0059.html",
        "image": "opna0059.jpg",
        "pdf": "opna0059.pdf"
      },
      {
        "page_number": 60,
        "html_page": "opna0060.html",
        "image": "opna0060.jpg",
        "pdf": "opna0060.pdf"
      }],
      "19.12.1912": [
      {
        "page_number": 61,
        "html_page": "opna0061.html",
        "image": "opna0061.jpg",
        "pdf": "opna0061.pdf"
      }],
      "24.12.1912": [
      {
        "page_number": 62,
        "html_page": "opna0062.html",
        "image": "opna0062.jpg",
        "pdf": "opna0062.pdf"
      }],
      "10.01.1913": [
      {
        "page_number": 63,
        "html_page": "opna0063.html",
        "image": "opna0063.jpg",
        "pdf": "opna0063.pdf"
      }],
      "20.01.1913": [
      {
        "page_number": 64,
        "html_page": "opna0064.html",
        "image": "opna0064.jpg",
        "pdf": "opna0064.pdf"
      }],
      "21.01.1913": [
      {
        "page_number": 65,
        "html_page": "opna0065.html",
        "image": "opna0065.jpg",
        "pdf": "opna0065.pdf"
      }],
      "22.01.1913": [
      {
        "page_number": 66,
        "html_page": "opna0066.html",
        "image": "opna0066.jpg",
        "pdf": "opna0066.pdf"
      }],
      "30.01.1913": [
      {
        "page_number": 67,
        "html_page": "opna0067.html",
        "image": "opna0067.jpg",
        "pdf": "opna0067.pdf"
      }],
      "04.02.1913": [
      {
        "page_number": 68,
        "html_page": "opna0068.html",
        "image": "opna0068.jpg",
        "pdf": "opna0068.pdf"
      },
      {
        "page_number": 69,
        "html_page": "opna0069.html",
        "image": "opna0069.jpg",
        "pdf": "opna0069.pdf"
      }],
      "10.02.1913": [
      {
        "page_number": 70,
        "html_page": "opna0070.html",
        "image": "opna0070.jpg",
        "pdf": "opna0070.pdf"
      }],
      "11.02.1913": [
      {
        "page_number": 71,
        "html_page": "opna0071.html",
        "image": "opna0071.jpg",
        "pdf": "opna0071.pdf"
      }],
      "18.02.1913": [
      {
        "page_number": 72,
        "html_page": "opna0072.html",
        "image": "opna0072.jpg",
        "pdf": "opna0072.pdf"
      }],
      "22.05.1913": [
      {
        "page_number": 73,
        "html_page": "opna0073.html",
        "image": "opna0073.jpg",
        "pdf": "opna0073.pdf"
      }],
      "15.04.1913": [
      {
        "page_number": 74,
        "html_page": "opna0074.html",
        "image": "opna0074.jpg",
        "pdf": "opna0074.pdf"
      }],
      "29.04.1913": [
      {
        "page_number": 75,
        "html_page": "opna0075.html",
        "image": "opna0075.jpg",
        "pdf": "opna0075.pdf"
      },
      {
        "page_number": 76,
        "html_page": "opna0076.html",
        "image": "opna0076.jpg",
        "pdf": "opna0076.pdf"
      }],
      "02.05.1913": [
      {
        "page_number": 77,
        "html_page": "opna0077.html",
        "image": "opna0077.jpg",
        "pdf": "opna0077.pdf"
      }],
      "06.05.1913": [
      {
        "page_number": 78,
        "html_page": "opna0078.html",
        "image": "opna0078.jpg",
        "pdf": "opna0078.pdf"
      }],
      "13.05.1913": [
      {
        "page_number": 79,
        "html_page": "opna0079.html",
        "image": "opna0079.jpg",
        "pdf": "opna0079.pdf"
      },
      {
        "page_number": 80,
        "html_page": "opna0080.html",
        "image": "opna0080.jpg",
        "pdf": "opna0080.pdf"
      }],
      "21.05.1913": [
      {
        "page_number": 81,
        "html_page": "opna0081.html",
        "image": "opna0081.jpg",
        "pdf": "opna0081.pdf"
      }],
      "26.05.1913": [
      {
        "page_number": 82,
        "html_page": "opna0082.html",
        "image": "opna0082.jpg",
        "pdf": "opna0082.pdf"
      }],
      "03.06.1913": [
      {
        "page_number": 83,
        "html_page": "opna0083.html",
        "image": "opna0083.jpg",
        "pdf": "opna0083.pdf"
      }],
      "11.06.1913": [
      {
        "page_number": 84,
        "html_page": "opna0084.html",
        "image": "opna0084.jpg",
        "pdf": "opna0084.pdf"
      }],
      "16.06.1913": [
      {
        "page_number": 85,
        "html_page": "opna0085.html",
        "image": "opna0085.jpg",
        "pdf": "opna0085.pdf"
      }],
      "25.06.1913": [
      {
        "page_number": 86,
        "html_page": "opna0086.html",
        "image": "opna0086.jpg",
        "pdf": "opna0086.pdf"
      }],
      "16.07.1913": [
      {
        "page_number": 87,
        "html_page": "opna0087.html",
        "image": "opna0087.jpg",
        "pdf": "opna0087.pdf"
      }],
      "22.07.1913": [
      {
        "page_number": 88,
        "html_page": "opna0088.html",
        "image": "opna0088.jpg",
        "pdf": "opna0088.pdf"
      }],
      "14.08.1913": [
      {
        "page_number": 89,
        "html_page": "opna0089.html",
        "image": "opna0089.jpg",
        "pdf": "opna0089.pdf"
      },
      {
        "page_number": 90,
        "html_page": "opna0090.html",
        "image": "opna0090.jpg",
        "pdf": "opna0090.pdf"
      },
      {
        "page_number": 91,
        "html_page": "opna0091.html",
        "image": "opna0091.jpg",
        "pdf": "opna0091.pdf"
      }],
      "02.09.1913": [
      {
        "page_number": 92,
        "html_page": "opna0092.html",
        "image": "opna0092.jpg",
        "pdf": "opna0092.pdf"
      }],
      "06.09.1913": [
      {
        "page_number": 93,
        "html_page": "opna0093.html",
        "image": "opna0093.jpg",
        "pdf": "opna0093.pdf"
      }],
      "15.09.1913": [
      {
        "page_number": 94,
        "html_page": "opna0094.html",
        "image": "opna0094.jpg",
        "pdf": "opna0094.pdf"
      }],
      "27.09.1913": [
      {
        "page_number": 95,
        "html_page": "opna0095.html",
        "image": "opna0095.jpg",
        "pdf": "opna0095.pdf"
      },
      {
        "page_number": 96,
        "html_page": "opna0096.html",
        "image": "opna0096.jpg",
        "pdf": "opna0096.pdf"
      }],
      "30.09.1913": [
      {
        "page_number": 97,
        "html_page": "opna0097.html",
        "image": "opna0097.jpg",
        "pdf": "opna0097.pdf"
      }],
      "03.10.1913": [
      {
        "page_number": 98,
        "html_page": "opna0098.html",
        "image": "opna0098.jpg",
        "pdf": "opna0098.pdf"
      }],
      "14.10.1913": [
      {
        "page_number": 99,
        "html_page": "opna0099.html",
        "image": "opna0099.jpg",
        "pdf": "opna0099.pdf"
      },
      {
        "page_number": 100,
        "html_page": "opna0100.html",
        "image": "opna0100.jpg",
        "pdf": "opna0100.pdf"
      }],
      "24.10.1913": [
      {
        "page_number": 101,
        "html_page": "opna0101.html",
        "image": "opna0101.jpg",
        "pdf": "opna0101.pdf"
      }],
      "28.10.1913": [
      {
        "page_number": 102,
        "html_page": "opna0102.html",
        "image": "opna0102.jpg",
        "pdf": "opna0102.pdf"
      }],
      "30.10.1913": [
      {
        "page_number": 103,
        "html_page": "opna0103.html",
        "image": "opna0103.jpg",
        "pdf": "opna0103.pdf"
      }],
      "04.11.1913": [
      {
        "page_number": 104,
        "html_page": "opna0104.html",
        "image": "opna0104.jpg",
        "pdf": "opna0104.pdf"
      },
      {
        "page_number": 105,
        "html_page": "opna0105.html",
        "image": "opna0105.jpg",
        "pdf": "opna0105.pdf"
      }],
      "01.11.1913": [
      {
        "page_number": 106,
        "html_page": "opna0106.html",
        "image": "opna0106.jpg",
        "pdf": "opna0106.pdf"
      }],
      "23.11.1913": [
      {
        "page_number": 107,
        "html_page": "opna0107.html",
        "image": "opna0107.jpg",
        "pdf": "opna0107.pdf"
      }],
      "27.11.1913": [
      {
        "page_number": 108,
        "html_page": "opna0108.html",
        "image": "opna0108.jpg",
        "pdf": "opna0108.pdf"
      },
      {
        "page_number": 109,
        "html_page": "opna0109.html",
        "image": "opna0109.jpg",
        "pdf": "opna0109.pdf"
      },
      {
        "page_number": 110,
        "html_page": "opna0110.html",
        "image": "opna0110.jpg",
        "pdf": "opna0110.pdf"
      }],
      "15.12.1913": [
      {
        "page_number": 111,
        "html_page": "opna0111.html",
        "image": "opna0111.jpg",
        "pdf": "opna0111.pdf"
      }],
      "30.12.1913": [
      {
        "page_number": 112,
        "html_page": "opna0112.html",
        "image": "opna0112.jpg",
        "pdf": "opna0112.pdf"
      }],
      "06.01.1914": [
      {
        "page_number": 113,
        "html_page": "opna0113.html",
        "image": "opna0113.jpg",
        "pdf": "opna0113.pdf"
      }],
      "20.01.1914": [
      {
        "page_number": 114,
        "html_page": "opna0114.html",
        "image": "opna0114.jpg",
        "pdf": "opna0114.pdf"
      }],
      "03.02.1914": [
      {
        "page_number": 115,
        "html_page": "opna0115.html",
        "image": "opna0115.jpg",
        "pdf": "opna0115.pdf"
      }],
      "20.02.1914": [
      {
        "page_number": 116,
        "html_page": "opna0116.html",
        "image": "opna0116.jpg",
        "pdf": "opna0116.pdf"
      }],
      "20.04.1914": [
      {
        "page_number": 117,
        "html_page": "opna0117.html",
        "image": "opna0117.jpg",
        "pdf": "opna0117.pdf"
      }],
      "20.05.1914": [
      {
        "page_number": 118,
        "html_page": "opna0118.html",
        "image": "opna0118.jpg",
        "pdf": "opna0118.pdf"
      }],
      "27.05.1914": [
      {
        "page_number": 119,
        "html_page": "opna0119.html",
        "image": "opna0119.jpg",
        "pdf": "opna0119.pdf"
      }],
      "16.06.1914": [
      {
        "page_number": 120,
        "html_page": "opna0120.html",
        "image": "opna0120.jpg",
        "pdf": "opna0120.pdf"
      },
      {
        "page_number": 121,
        "html_page": "opna0121.html",
        "image": "opna0121.jpg",
        "pdf": "opna0121.pdf"
      }],
      "27.06.1914": [
      {
        "page_number": 122,
        "html_page": "opna0122.html",
        "image": "opna0122.jpg",
        "pdf": "opna0122.pdf"
      }],
      "16.07.1914": [
      {
        "page_number": 123,
        "html_page": "opna0123.html",
        "image": "opna0123.jpg",
        "pdf": "opna0123.pdf"
      }],
      "11.08.1914": [
      {
        "page_number": 124,
        "html_page": "opna0124.html",
        "image": "opna0124.jpg",
        "pdf": "opna0124.pdf"
      },
      {
        "page_number": 125,
        "html_page": "opna0125.html",
        "image": "opna0125.jpg",
        "pdf": "opna0125.pdf"
      }],
      "13.08.1914": [
      {
        "page_number": 126,
        "html_page": "opna0126.html",
        "image": "opna0126.jpg",
        "pdf": "opna0126.pdf"
      }],
      "29.08.1914": [
      {
        "page_number": 127,
        "html_page": "opna0127.html",
        "image": "opna0127.jpg",
        "pdf": "opna0127.pdf"
      }],
      "11.09.1914": [
      {
        "page_number": 128,
        "html_page": "opna0128.html",
        "image": "opna0128.jpg",
        "pdf": "opna0128.pdf"
      }],
      "15.09.1914": [
      {
        "page_number": 129,
        "html_page": "opna0129.html",
        "image": "opna0129.jpg",
        "pdf": "opna0129.pdf"
      }],
      "22.09.1914": [
      {
        "page_number": 130,
        "html_page": "opna0130.html",
        "image": "opna0130.jpg",
        "pdf": "opna0130.pdf"
      }],
      "29.09.1914": [
      {
        "page_number": 131,
        "html_page": "opna0131.html",
        "image": "opna0131.jpg",
        "pdf": "opna0131.pdf"
      },
      {
        "page_number": 132,
        "html_page": "opna0132.html",
        "image": "opna0132.jpg",
        "pdf": "opna0132.pdf"
      }],
      "10.10.1914": [
      {
        "page_number": 133,
        "html_page": "opna0133.html",
        "image": "opna0133.jpg",
        "pdf": "opna0133.pdf"
      }],
      "12.10.1914": [
      {
        "page_number": 134,
        "html_page": "opna0134.html",
        "image": "opna0134.jpg",
        "pdf": "opna0134.pdf"
      }],
      "13.10.1914": [
      {
        "page_number": 135,
        "html_page": "opna0135.html",
        "image": "opna0135.jpg",
        "pdf": "opna0135.pdf"
      }],
      "20.10.1914": [
      {
        "page_number": 136,
        "html_page": "opna0136.html",
        "image": "opna0136.jpg",
        "pdf": "opna0136.pdf"
      }],
      "02.11.1914": [
      {
        "page_number": 137,
        "html_page": "opna0137.html",
        "image": "opna0137.jpg",
        "pdf": "opna0137.pdf"
      }],
      "17.11.1914": [
      {
        "page_number": 138,
        "html_page": "opna0138.html",
        "image": "opna0138.jpg",
        "pdf": "opna0138.pdf"
      }],
      "24.11.1914": [
      {
        "page_number": 139,
        "html_page": "opna0139.html",
        "image": "opna0139.jpg",
        "pdf": "opna0139.pdf"
      }],
      "01.12.1914": [
      {
        "page_number": 140,
        "html_page": "opna0140.html",
        "image": "opna0140.jpg",
        "pdf": "opna0140.pdf"
      }],
      "15.12.1914": [
      {
        "page_number": 141,
        "html_page": "opna0141.html",
        "image": "opna0141.jpg",
        "pdf": "opna0141.pdf"
      }],
      "20.01.1915": [
      {
        "page_number": 142,
        "html_page": "opna0142.html",
        "image": "opna0142.jpg",
        "pdf": "opna0142.pdf"
      }],
      "29.03.1915": [
      {
        "page_number": 143,
        "html_page": "opna0143.html",
        "image": "opna0143.jpg",
        "pdf": "opna0143.pdf"
      }],
      "26.04.1915": [
      {
        "page_number": 144,
        "html_page": "opna0144.html",
        "image": "opna0144.jpg",
        "pdf": "opna0144.pdf"
      }],
      "01.05.1915": [
      {
        "page_number": 145,
        "html_page": "opna0145.html",
        "image": "opna0145.jpg",
        "pdf": "opna0145.pdf"
      }],
      "08.05.1915": [
      {
        "page_number": 146,
        "html_page": "opna0146.html",
        "image": "opna0146.jpg",
        "pdf": "opna0146.pdf"
      },
      {
        "page_number": 147,
        "html_page": "opna0147.html",
        "image": "opna0147.jpg",
        "pdf": "opna0147.pdf"
      }],
      "11.05.1915": [
      {
        "page_number": 148,
        "html_page": "opna0148.html",
        "image": "opna0148.jpg",
        "pdf": "opna0148.pdf"
      },
      {
        "page_number": 149,
        "html_page": "opna0149.html",
        "image": "opna0149.jpg",
        "pdf": "opna0149.pdf"
      },
      {
        "page_number": 150,
        "html_page": "opna0150.html",
        "image": "opna0150.jpg",
        "pdf": "opna0150.pdf"
      },
      {
        "page_number": 151,
        "html_page": "opna0151.html",
        "image": "opna0151.jpg",
        "pdf": "opna0151.pdf"
      }],
      "20.05.1915": [
      {
        "page_number": 152,
        "html_page": "opna0152.html",
        "image": "opna0152.jpg",
        "pdf": "opna0152.pdf"
      },
      {
        "page_number": 153,
        "html_page": "opna0153.html",
        "image": "opna0153.jpg",
        "pdf": "opna0153.pdf"
      },
      {
        "page_number": 154,
        "html_page": "opna0154.html",
        "image": "opna0154.jpg",
        "pdf": "opna0154.pdf"
      }],
      "Bak": [
      {
        "page_number": 155,
        "html_page": "opna0155.html",
        "image": "opna0155.jpg",
        "pdf": "opna0155.pdf"
      }]
    }
  }
}