{
  "752":
  {
    "book": "752",
    "full_res_image": "JPEG_1200px\/opna0001.jpg",
    "full_res_pdf": "HQ_PDF\/opna0001.pdf",
    "full_value": "752\/opna0001.html",
    "text": "Brunab\u00f3tatrygging h\u00fasa - Nr. 384-762 A\u00f0fnr. 752 ",
    "type": "numer",
    "register_pages":
    {
      "K\u00e1pa": [
      {
        "page_number": 1,
        "html_page": "opna0001.html",
        "image": "opna0001.jpg",
        "pdf": "opna0001.pdf"
      }],
      "Opna": [
      {
        "page_number": 2,
        "html_page": "opna0002.html",
        "image": "opna0002.jpg",
        "pdf": "opna0002.pdf"
      },
      {
        "page_number": 476,
        "html_page": "opna0476.html",
        "image": "opna0476.jpg",
        "pdf": "opna0476.pdf"
      },
      {
        "page_number": 477,
        "html_page": "opna0477.html",
        "image": "opna0477.jpg",
        "pdf": "opna0477.pdf"
      }],
      "B\u00f3k 752": [
      {
        "page_number": 3,
        "html_page": "opna0003.html",
        "image": "opna0003.jpg",
        "pdf": "opna0003.pdf"
      }],
      "384": [
      {
        "page_number": 4,
        "html_page": "opna0004.html",
        "image": "opna0004.jpg",
        "pdf": "opna0004.pdf"
      }],
      "385": [
      {
        "page_number": 5,
        "html_page": "opna0005.html",
        "image": "opna0005.jpg",
        "pdf": "opna0005.pdf"
      }],
      "386": [
      {
        "page_number": 6,
        "html_page": "opna0006.html",
        "image": "opna0006.jpg",
        "pdf": "opna0006.pdf"
      }],
      "387": [
      {
        "page_number": 7,
        "html_page": "opna0007.html",
        "image": "opna0007.jpg",
        "pdf": "opna0007.pdf"
      }],
      "388": [
      {
        "page_number": 8,
        "html_page": "opna0008.html",
        "image": "opna0008.jpg",
        "pdf": "opna0008.pdf"
      }],
      "389": [
      {
        "page_number": 9,
        "html_page": "opna0009.html",
        "image": "opna0009.jpg",
        "pdf": "opna0009.pdf"
      }],
      "390": [
      {
        "page_number": 10,
        "html_page": "opna0010.html",
        "image": "opna0010.jpg",
        "pdf": "opna0010.pdf"
      }],
      "391": [
      {
        "page_number": 11,
        "html_page": "opna0011.html",
        "image": "opna0011.jpg",
        "pdf": "opna0011.pdf"
      }],
      "392": [
      {
        "page_number": 12,
        "html_page": "opna0012.html",
        "image": "opna0012.jpg",
        "pdf": "opna0012.pdf"
      }],
      "393": [
      {
        "page_number": 13,
        "html_page": "opna0013.html",
        "image": "opna0013.jpg",
        "pdf": "opna0013.pdf"
      }],
      "394": [
      {
        "page_number": 14,
        "html_page": "opna0014.html",
        "image": "opna0014.jpg",
        "pdf": "opna0014.pdf"
      }],
      "395": [
      {
        "page_number": 15,
        "html_page": "opna0015.html",
        "image": "opna0015.jpg",
        "pdf": "opna0015.pdf"
      }],
      "396": [
      {
        "page_number": 16,
        "html_page": "opna0016.html",
        "image": "opna0016.jpg",
        "pdf": "opna0016.pdf"
      }],
      "397": [
      {
        "page_number": 17,
        "html_page": "opna0017.html",
        "image": "opna0017.jpg",
        "pdf": "opna0017.pdf"
      }],
      "398": [
      {
        "page_number": 18,
        "html_page": "opna0018.html",
        "image": "opna0018.jpg",
        "pdf": "opna0018.pdf"
      }],
      "399": [
      {
        "page_number": 19,
        "html_page": "opna0019.html",
        "image": "opna0019.jpg",
        "pdf": "opna0019.pdf"
      }],
      "400": [
      {
        "page_number": 20,
        "html_page": "opna0020.html",
        "image": "opna0020.jpg",
        "pdf": "opna0020.pdf"
      }],
      "401": [
      {
        "page_number": 21,
        "html_page": "opna0021.html",
        "image": "opna0021.jpg",
        "pdf": "opna0021.pdf"
      }],
      "402": [
      {
        "page_number": 22,
        "html_page": "opna0022.html",
        "image": "opna0022.jpg",
        "pdf": "opna0022.pdf"
      }],
      "403": [
      {
        "page_number": 23,
        "html_page": "opna0023.html",
        "image": "opna0023.jpg",
        "pdf": "opna0023.pdf"
      }],
      "404": [
      {
        "page_number": 24,
        "html_page": "opna0024.html",
        "image": "opna0024.jpg",
        "pdf": "opna0024.pdf"
      }],
      "405": [
      {
        "page_number": 25,
        "html_page": "opna0025.html",
        "image": "opna0025.jpg",
        "pdf": "opna0025.pdf"
      }],
      "406": [
      {
        "page_number": 26,
        "html_page": "opna0026.html",
        "image": "opna0026.jpg",
        "pdf": "opna0026.pdf"
      }],
      "407": [
      {
        "page_number": 27,
        "html_page": "opna0027.html",
        "image": "opna0027.jpg",
        "pdf": "opna0027.pdf"
      },
      {
        "page_number": 28,
        "html_page": "opna0028.html",
        "image": "opna0028.jpg",
        "pdf": "opna0028.pdf"
      },
      {
        "page_number": 29,
        "html_page": "opna0029.html",
        "image": "opna0029.jpg",
        "pdf": "opna0029.pdf"
      },
      {
        "page_number": 30,
        "html_page": "opna0030.html",
        "image": "opna0030.jpg",
        "pdf": "opna0030.pdf"
      }],
      "408": [
      {
        "page_number": 31,
        "html_page": "opna0031.html",
        "image": "opna0031.jpg",
        "pdf": "opna0031.pdf"
      }],
      "409": [
      {
        "page_number": 32,
        "html_page": "opna0032.html",
        "image": "opna0032.jpg",
        "pdf": "opna0032.pdf"
      }],
      "410": [
      {
        "page_number": 33,
        "html_page": "opna0033.html",
        "image": "opna0033.jpg",
        "pdf": "opna0033.pdf"
      }],
      "411": [
      {
        "page_number": 34,
        "html_page": "opna0034.html",
        "image": "opna0034.jpg",
        "pdf": "opna0034.pdf"
      }],
      "412": [
      {
        "page_number": 35,
        "html_page": "opna0035.html",
        "image": "opna0035.jpg",
        "pdf": "opna0035.pdf"
      }],
      "413": [
      {
        "page_number": 36,
        "html_page": "opna0036.html",
        "image": "opna0036.jpg",
        "pdf": "opna0036.pdf"
      }],
      "414": [
      {
        "page_number": 37,
        "html_page": "opna0037.html",
        "image": "opna0037.jpg",
        "pdf": "opna0037.pdf"
      }],
      "415": [
      {
        "page_number": 38,
        "html_page": "opna0038.html",
        "image": "opna0038.jpg",
        "pdf": "opna0038.pdf"
      }],
      "416": [
      {
        "page_number": 39,
        "html_page": "opna0039.html",
        "image": "opna0039.jpg",
        "pdf": "opna0039.pdf"
      },
      {
        "page_number": 40,
        "html_page": "opna0040.html",
        "image": "opna0040.jpg",
        "pdf": "opna0040.pdf"
      }],
      "417": [
      {
        "page_number": 41,
        "html_page": "opna0041.html",
        "image": "opna0041.jpg",
        "pdf": "opna0041.pdf"
      }],
      "418": [
      {
        "page_number": 42,
        "html_page": "opna0042.html",
        "image": "opna0042.jpg",
        "pdf": "opna0042.pdf"
      }],
      "419": [
      {
        "page_number": 43,
        "html_page": "opna0043.html",
        "image": "opna0043.jpg",
        "pdf": "opna0043.pdf"
      }],
      "420": [
      {
        "page_number": 44,
        "html_page": "opna0044.html",
        "image": "opna0044.jpg",
        "pdf": "opna0044.pdf"
      }],
      "421": [
      {
        "page_number": 45,
        "html_page": "opna0045.html",
        "image": "opna0045.jpg",
        "pdf": "opna0045.pdf"
      }],
      "422": [
      {
        "page_number": 46,
        "html_page": "opna0046.html",
        "image": "opna0046.jpg",
        "pdf": "opna0046.pdf"
      },
      {
        "page_number": 47,
        "html_page": "opna0047.html",
        "image": "opna0047.jpg",
        "pdf": "opna0047.pdf"
      },
      {
        "page_number": 48,
        "html_page": "opna0048.html",
        "image": "opna0048.jpg",
        "pdf": "opna0048.pdf"
      }],
      "423": [
      {
        "page_number": 49,
        "html_page": "opna0049.html",
        "image": "opna0049.jpg",
        "pdf": "opna0049.pdf"
      }],
      "424": [
      {
        "page_number": 50,
        "html_page": "opna0050.html",
        "image": "opna0050.jpg",
        "pdf": "opna0050.pdf"
      }],
      "425": [
      {
        "page_number": 51,
        "html_page": "opna0051.html",
        "image": "opna0051.jpg",
        "pdf": "opna0051.pdf"
      }],
      "426": [
      {
        "page_number": 52,
        "html_page": "opna0052.html",
        "image": "opna0052.jpg",
        "pdf": "opna0052.pdf"
      }],
      "427": [
      {
        "page_number": 53,
        "html_page": "opna0053.html",
        "image": "opna0053.jpg",
        "pdf": "opna0053.pdf"
      }],
      "428": [
      {
        "page_number": 54,
        "html_page": "opna0054.html",
        "image": "opna0054.jpg",
        "pdf": "opna0054.pdf"
      }],
      "429": [
      {
        "page_number": 55,
        "html_page": "opna0055.html",
        "image": "opna0055.jpg",
        "pdf": "opna0055.pdf"
      }],
      "430": [
      {
        "page_number": 56,
        "html_page": "opna0056.html",
        "image": "opna0056.jpg",
        "pdf": "opna0056.pdf"
      },
      {
        "page_number": 57,
        "html_page": "opna0057.html",
        "image": "opna0057.jpg",
        "pdf": "opna0057.pdf"
      },
      {
        "page_number": 58,
        "html_page": "opna0058.html",
        "image": "opna0058.jpg",
        "pdf": "opna0058.pdf"
      }],
      "431": [
      {
        "page_number": 59,
        "html_page": "opna0059.html",
        "image": "opna0059.jpg",
        "pdf": "opna0059.pdf"
      }],
      "432": [
      {
        "page_number": 60,
        "html_page": "opna0060.html",
        "image": "opna0060.jpg",
        "pdf": "opna0060.pdf"
      }],
      "433": [
      {
        "page_number": 61,
        "html_page": "opna0061.html",
        "image": "opna0061.jpg",
        "pdf": "opna0061.pdf"
      }],
      "434": [
      {
        "page_number": 62,
        "html_page": "opna0062.html",
        "image": "opna0062.jpg",
        "pdf": "opna0062.pdf"
      }],
      "435": [
      {
        "page_number": 63,
        "html_page": "opna0063.html",
        "image": "opna0063.jpg",
        "pdf": "opna0063.pdf"
      }],
      "436": [
      {
        "page_number": 64,
        "html_page": "opna0064.html",
        "image": "opna0064.jpg",
        "pdf": "opna0064.pdf"
      }],
      "437": [
      {
        "page_number": 65,
        "html_page": "opna0065.html",
        "image": "opna0065.jpg",
        "pdf": "opna0065.pdf"
      }],
      "438": [
      {
        "page_number": 66,
        "html_page": "opna0066.html",
        "image": "opna0066.jpg",
        "pdf": "opna0066.pdf"
      }],
      "439": [
      {
        "page_number": 67,
        "html_page": "opna0067.html",
        "image": "opna0067.jpg",
        "pdf": "opna0067.pdf"
      }],
      "440": [
      {
        "page_number": 68,
        "html_page": "opna0068.html",
        "image": "opna0068.jpg",
        "pdf": "opna0068.pdf"
      }],
      "441": [
      {
        "page_number": 69,
        "html_page": "opna0069.html",
        "image": "opna0069.jpg",
        "pdf": "opna0069.pdf"
      }],
      "442": [
      {
        "page_number": 70,
        "html_page": "opna0070.html",
        "image": "opna0070.jpg",
        "pdf": "opna0070.pdf"
      },
      {
        "page_number": 71,
        "html_page": "opna0071.html",
        "image": "opna0071.jpg",
        "pdf": "opna0071.pdf"
      },
      {
        "page_number": 72,
        "html_page": "opna0072.html",
        "image": "opna0072.jpg",
        "pdf": "opna0072.pdf"
      }],
      "443": [
      {
        "page_number": 73,
        "html_page": "opna0073.html",
        "image": "opna0073.jpg",
        "pdf": "opna0073.pdf"
      }],
      "444": [
      {
        "page_number": 74,
        "html_page": "opna0074.html",
        "image": "opna0074.jpg",
        "pdf": "opna0074.pdf"
      }],
      "445": [
      {
        "page_number": 75,
        "html_page": "opna0075.html",
        "image": "opna0075.jpg",
        "pdf": "opna0075.pdf"
      }],
      "446": [
      {
        "page_number": 76,
        "html_page": "opna0076.html",
        "image": "opna0076.jpg",
        "pdf": "opna0076.pdf"
      }],
      "447": [
      {
        "page_number": 77,
        "html_page": "opna0077.html",
        "image": "opna0077.jpg",
        "pdf": "opna0077.pdf"
      }],
      "448": [
      {
        "page_number": 78,
        "html_page": "opna0078.html",
        "image": "opna0078.jpg",
        "pdf": "opna0078.pdf"
      }],
      "449": [
      {
        "page_number": 79,
        "html_page": "opna0079.html",
        "image": "opna0079.jpg",
        "pdf": "opna0079.pdf"
      }],
      "450": [
      {
        "page_number": 80,
        "html_page": "opna0080.html",
        "image": "opna0080.jpg",
        "pdf": "opna0080.pdf"
      }],
      "451": [
      {
        "page_number": 81,
        "html_page": "opna0081.html",
        "image": "opna0081.jpg",
        "pdf": "opna0081.pdf"
      }],
      "452": [
      {
        "page_number": 82,
        "html_page": "opna0082.html",
        "image": "opna0082.jpg",
        "pdf": "opna0082.pdf"
      }],
      "453": [
      {
        "page_number": 83,
        "html_page": "opna0083.html",
        "image": "opna0083.jpg",
        "pdf": "opna0083.pdf"
      }],
      "454": [
      {
        "page_number": 84,
        "html_page": "opna0084.html",
        "image": "opna0084.jpg",
        "pdf": "opna0084.pdf"
      }],
      "455": [
      {
        "page_number": 85,
        "html_page": "opna0085.html",
        "image": "opna0085.jpg",
        "pdf": "opna0085.pdf"
      },
      {
        "page_number": 86,
        "html_page": "opna0086.html",
        "image": "opna0086.jpg",
        "pdf": "opna0086.pdf"
      },
      {
        "page_number": 87,
        "html_page": "opna0087.html",
        "image": "opna0087.jpg",
        "pdf": "opna0087.pdf"
      }],
      "456": [
      {
        "page_number": 88,
        "html_page": "opna0088.html",
        "image": "opna0088.jpg",
        "pdf": "opna0088.pdf"
      }],
      "457": [
      {
        "page_number": 89,
        "html_page": "opna0089.html",
        "image": "opna0089.jpg",
        "pdf": "opna0089.pdf"
      },
      {
        "page_number": 90,
        "html_page": "opna0090.html",
        "image": "opna0090.jpg",
        "pdf": "opna0090.pdf"
      },
      {
        "page_number": 91,
        "html_page": "opna0091.html",
        "image": "opna0091.jpg",
        "pdf": "opna0091.pdf"
      }],
      "458": [
      {
        "page_number": 92,
        "html_page": "opna0092.html",
        "image": "opna0092.jpg",
        "pdf": "opna0092.pdf"
      }],
      "459": [
      {
        "page_number": 93,
        "html_page": "opna0093.html",
        "image": "opna0093.jpg",
        "pdf": "opna0093.pdf"
      },
      {
        "page_number": 94,
        "html_page": "opna0094.html",
        "image": "opna0094.jpg",
        "pdf": "opna0094.pdf"
      },
      {
        "page_number": 95,
        "html_page": "opna0095.html",
        "image": "opna0095.jpg",
        "pdf": "opna0095.pdf"
      }],
      "460": [
      {
        "page_number": 96,
        "html_page": "opna0096.html",
        "image": "opna0096.jpg",
        "pdf": "opna0096.pdf"
      }],
      "461": [
      {
        "page_number": 97,
        "html_page": "opna0097.html",
        "image": "opna0097.jpg",
        "pdf": "opna0097.pdf"
      }],
      "462": [
      {
        "page_number": 98,
        "html_page": "opna0098.html",
        "image": "opna0098.jpg",
        "pdf": "opna0098.pdf"
      }],
      "463": [
      {
        "page_number": 99,
        "html_page": "opna0099.html",
        "image": "opna0099.jpg",
        "pdf": "opna0099.pdf"
      }],
      "464": [
      {
        "page_number": 100,
        "html_page": "opna0100.html",
        "image": "opna0100.jpg",
        "pdf": "opna0100.pdf"
      }],
      "465": [
      {
        "page_number": 101,
        "html_page": "opna0101.html",
        "image": "opna0101.jpg",
        "pdf": "opna0101.pdf"
      }],
      "466": [
      {
        "page_number": 102,
        "html_page": "opna0102.html",
        "image": "opna0102.jpg",
        "pdf": "opna0102.pdf"
      }],
      "467": [
      {
        "page_number": 103,
        "html_page": "opna0103.html",
        "image": "opna0103.jpg",
        "pdf": "opna0103.pdf"
      }],
      "468": [
      {
        "page_number": 104,
        "html_page": "opna0104.html",
        "image": "opna0104.jpg",
        "pdf": "opna0104.pdf"
      }],
      "469": [
      {
        "page_number": 105,
        "html_page": "opna0105.html",
        "image": "opna0105.jpg",
        "pdf": "opna0105.pdf"
      }],
      "470": [
      {
        "page_number": 106,
        "html_page": "opna0106.html",
        "image": "opna0106.jpg",
        "pdf": "opna0106.pdf"
      }],
      "471": [
      {
        "page_number": 107,
        "html_page": "opna0107.html",
        "image": "opna0107.jpg",
        "pdf": "opna0107.pdf"
      },
      {
        "page_number": 108,
        "html_page": "opna0108.html",
        "image": "opna0108.jpg",
        "pdf": "opna0108.pdf"
      },
      {
        "page_number": 109,
        "html_page": "opna0109.html",
        "image": "opna0109.jpg",
        "pdf": "opna0109.pdf"
      }],
      "472": [
      {
        "page_number": 110,
        "html_page": "opna0110.html",
        "image": "opna0110.jpg",
        "pdf": "opna0110.pdf"
      }],
      "473": [
      {
        "page_number": 111,
        "html_page": "opna0111.html",
        "image": "opna0111.jpg",
        "pdf": "opna0111.pdf"
      }],
      "474": [
      {
        "page_number": 112,
        "html_page": "opna0112.html",
        "image": "opna0112.jpg",
        "pdf": "opna0112.pdf"
      }],
      "475": [
      {
        "page_number": 113,
        "html_page": "opna0113.html",
        "image": "opna0113.jpg",
        "pdf": "opna0113.pdf"
      }],
      "476": [
      {
        "page_number": 114,
        "html_page": "opna0114.html",
        "image": "opna0114.jpg",
        "pdf": "opna0114.pdf"
      }],
      "477": [
      {
        "page_number": 115,
        "html_page": "opna0115.html",
        "image": "opna0115.jpg",
        "pdf": "opna0115.pdf"
      }],
      "478": [
      {
        "page_number": 116,
        "html_page": "opna0116.html",
        "image": "opna0116.jpg",
        "pdf": "opna0116.pdf"
      }],
      "479": [
      {
        "page_number": 117,
        "html_page": "opna0117.html",
        "image": "opna0117.jpg",
        "pdf": "opna0117.pdf"
      }],
      "480": [
      {
        "page_number": 118,
        "html_page": "opna0118.html",
        "image": "opna0118.jpg",
        "pdf": "opna0118.pdf"
      }],
      "481": [
      {
        "page_number": 119,
        "html_page": "opna0119.html",
        "image": "opna0119.jpg",
        "pdf": "opna0119.pdf"
      }],
      "482": [
      {
        "page_number": 120,
        "html_page": "opna0120.html",
        "image": "opna0120.jpg",
        "pdf": "opna0120.pdf"
      }],
      "483": [
      {
        "page_number": 121,
        "html_page": "opna0121.html",
        "image": "opna0121.jpg",
        "pdf": "opna0121.pdf"
      }],
      "484": [
      {
        "page_number": 122,
        "html_page": "opna0122.html",
        "image": "opna0122.jpg",
        "pdf": "opna0122.pdf"
      }],
      "485": [
      {
        "page_number": 123,
        "html_page": "opna0123.html",
        "image": "opna0123.jpg",
        "pdf": "opna0123.pdf"
      }],
      "486": [
      {
        "page_number": 124,
        "html_page": "opna0124.html",
        "image": "opna0124.jpg",
        "pdf": "opna0124.pdf"
      }],
      "487": [
      {
        "page_number": 125,
        "html_page": "opna0125.html",
        "image": "opna0125.jpg",
        "pdf": "opna0125.pdf"
      }],
      "488": [
      {
        "page_number": 126,
        "html_page": "opna0126.html",
        "image": "opna0126.jpg",
        "pdf": "opna0126.pdf"
      }],
      "489": [
      {
        "page_number": 127,
        "html_page": "opna0127.html",
        "image": "opna0127.jpg",
        "pdf": "opna0127.pdf"
      }],
      "490": [
      {
        "page_number": 128,
        "html_page": "opna0128.html",
        "image": "opna0128.jpg",
        "pdf": "opna0128.pdf"
      }],
      "491": [
      {
        "page_number": 129,
        "html_page": "opna0129.html",
        "image": "opna0129.jpg",
        "pdf": "opna0129.pdf"
      }],
      "492": [
      {
        "page_number": 130,
        "html_page": "opna0130.html",
        "image": "opna0130.jpg",
        "pdf": "opna0130.pdf"
      }],
      "493": [
      {
        "page_number": 131,
        "html_page": "opna0131.html",
        "image": "opna0131.jpg",
        "pdf": "opna0131.pdf"
      }],
      "494": [
      {
        "page_number": 132,
        "html_page": "opna0132.html",
        "image": "opna0132.jpg",
        "pdf": "opna0132.pdf"
      }],
      "495": [
      {
        "page_number": 133,
        "html_page": "opna0133.html",
        "image": "opna0133.jpg",
        "pdf": "opna0133.pdf"
      }],
      "496": [
      {
        "page_number": 134,
        "html_page": "opna0134.html",
        "image": "opna0134.jpg",
        "pdf": "opna0134.pdf"
      }],
      "497": [
      {
        "page_number": 135,
        "html_page": "opna0135.html",
        "image": "opna0135.jpg",
        "pdf": "opna0135.pdf"
      }],
      "498": [
      {
        "page_number": 136,
        "html_page": "opna0136.html",
        "image": "opna0136.jpg",
        "pdf": "opna0136.pdf"
      }],
      "499": [
      {
        "page_number": 137,
        "html_page": "opna0137.html",
        "image": "opna0137.jpg",
        "pdf": "opna0137.pdf"
      }],
      "500": [
      {
        "page_number": 138,
        "html_page": "opna0138.html",
        "image": "opna0138.jpg",
        "pdf": "opna0138.pdf"
      }],
      "501": [
      {
        "page_number": 139,
        "html_page": "opna0139.html",
        "image": "opna0139.jpg",
        "pdf": "opna0139.pdf"
      }],
      "502": [
      {
        "page_number": 140,
        "html_page": "opna0140.html",
        "image": "opna0140.jpg",
        "pdf": "opna0140.pdf"
      }],
      "503": [
      {
        "page_number": 141,
        "html_page": "opna0141.html",
        "image": "opna0141.jpg",
        "pdf": "opna0141.pdf"
      }],
      "504": [
      {
        "page_number": 142,
        "html_page": "opna0142.html",
        "image": "opna0142.jpg",
        "pdf": "opna0142.pdf"
      },
      {
        "page_number": 143,
        "html_page": "opna0143.html",
        "image": "opna0143.jpg",
        "pdf": "opna0143.pdf"
      },
      {
        "page_number": 144,
        "html_page": "opna0144.html",
        "image": "opna0144.jpg",
        "pdf": "opna0144.pdf"
      }],
      "505": [
      {
        "page_number": 145,
        "html_page": "opna0145.html",
        "image": "opna0145.jpg",
        "pdf": "opna0145.pdf"
      }],
      "506": [
      {
        "page_number": 146,
        "html_page": "opna0146.html",
        "image": "opna0146.jpg",
        "pdf": "opna0146.pdf"
      }],
      "507": [
      {
        "page_number": 147,
        "html_page": "opna0147.html",
        "image": "opna0147.jpg",
        "pdf": "opna0147.pdf"
      }],
      "508": [
      {
        "page_number": 148,
        "html_page": "opna0148.html",
        "image": "opna0148.jpg",
        "pdf": "opna0148.pdf"
      }],
      "509": [
      {
        "page_number": 149,
        "html_page": "opna0149.html",
        "image": "opna0149.jpg",
        "pdf": "opna0149.pdf"
      },
      {
        "page_number": 150,
        "html_page": "opna0150.html",
        "image": "opna0150.jpg",
        "pdf": "opna0150.pdf"
      },
      {
        "page_number": 151,
        "html_page": "opna0151.html",
        "image": "opna0151.jpg",
        "pdf": "opna0151.pdf"
      }],
      "510": [
      {
        "page_number": 152,
        "html_page": "opna0152.html",
        "image": "opna0152.jpg",
        "pdf": "opna0152.pdf"
      }],
      "511": [
      {
        "page_number": 153,
        "html_page": "opna0153.html",
        "image": "opna0153.jpg",
        "pdf": "opna0153.pdf"
      }],
      "512": [
      {
        "page_number": 154,
        "html_page": "opna0154.html",
        "image": "opna0154.jpg",
        "pdf": "opna0154.pdf"
      }],
      "513": [
      {
        "page_number": 155,
        "html_page": "opna0155.html",
        "image": "opna0155.jpg",
        "pdf": "opna0155.pdf"
      }],
      "514": [
      {
        "page_number": 156,
        "html_page": "opna0156.html",
        "image": "opna0156.jpg",
        "pdf": "opna0156.pdf"
      },
      {
        "page_number": 157,
        "html_page": "opna0157.html",
        "image": "opna0157.jpg",
        "pdf": "opna0157.pdf"
      },
      {
        "page_number": 158,
        "html_page": "opna0158.html",
        "image": "opna0158.jpg",
        "pdf": "opna0158.pdf"
      },
      {
        "page_number": 159,
        "html_page": "opna0159.html",
        "image": "opna0159.jpg",
        "pdf": "opna0159.pdf"
      },
      {
        "page_number": 160,
        "html_page": "opna0160.html",
        "image": "opna0160.jpg",
        "pdf": "opna0160.pdf"
      }],
      "515": [
      {
        "page_number": 161,
        "html_page": "opna0161.html",
        "image": "opna0161.jpg",
        "pdf": "opna0161.pdf"
      }],
      "516": [
      {
        "page_number": 162,
        "html_page": "opna0162.html",
        "image": "opna0162.jpg",
        "pdf": "opna0162.pdf"
      }],
      "517": [
      {
        "page_number": 163,
        "html_page": "opna0163.html",
        "image": "opna0163.jpg",
        "pdf": "opna0163.pdf"
      }],
      "518": [
      {
        "page_number": 164,
        "html_page": "opna0164.html",
        "image": "opna0164.jpg",
        "pdf": "opna0164.pdf"
      }],
      "519": [
      {
        "page_number": 165,
        "html_page": "opna0165.html",
        "image": "opna0165.jpg",
        "pdf": "opna0165.pdf"
      }],
      "520": [
      {
        "page_number": 166,
        "html_page": "opna0166.html",
        "image": "opna0166.jpg",
        "pdf": "opna0166.pdf"
      }],
      "521": [
      {
        "page_number": 167,
        "html_page": "opna0167.html",
        "image": "opna0167.jpg",
        "pdf": "opna0167.pdf"
      }],
      "523": [
      {
        "page_number": 168,
        "html_page": "opna0168.html",
        "image": "opna0168.jpg",
        "pdf": "opna0168.pdf"
      }],
      "524": [
      {
        "page_number": 169,
        "html_page": "opna0169.html",
        "image": "opna0169.jpg",
        "pdf": "opna0169.pdf"
      }],
      "525": [
      {
        "page_number": 170,
        "html_page": "opna0170.html",
        "image": "opna0170.jpg",
        "pdf": "opna0170.pdf"
      }],
      "526": [
      {
        "page_number": 171,
        "html_page": "opna0171.html",
        "image": "opna0171.jpg",
        "pdf": "opna0171.pdf"
      }],
      "527": [
      {
        "page_number": 172,
        "html_page": "opna0172.html",
        "image": "opna0172.jpg",
        "pdf": "opna0172.pdf"
      }],
      "528": [
      {
        "page_number": 173,
        "html_page": "opna0173.html",
        "image": "opna0173.jpg",
        "pdf": "opna0173.pdf"
      }],
      "529": [
      {
        "page_number": 174,
        "html_page": "opna0174.html",
        "image": "opna0174.jpg",
        "pdf": "opna0174.pdf"
      }],
      "530": [
      {
        "page_number": 175,
        "html_page": "opna0175.html",
        "image": "opna0175.jpg",
        "pdf": "opna0175.pdf"
      }],
      "531": [
      {
        "page_number": 176,
        "html_page": "opna0176.html",
        "image": "opna0176.jpg",
        "pdf": "opna0176.pdf"
      }],
      "532": [
      {
        "page_number": 177,
        "html_page": "opna0177.html",
        "image": "opna0177.jpg",
        "pdf": "opna0177.pdf"
      }],
      "533": [
      {
        "page_number": 178,
        "html_page": "opna0178.html",
        "image": "opna0178.jpg",
        "pdf": "opna0178.pdf"
      }],
      "534": [
      {
        "page_number": 179,
        "html_page": "opna0179.html",
        "image": "opna0179.jpg",
        "pdf": "opna0179.pdf"
      }],
      "535": [
      {
        "page_number": 180,
        "html_page": "opna0180.html",
        "image": "opna0180.jpg",
        "pdf": "opna0180.pdf"
      }],
      "536": [
      {
        "page_number": 181,
        "html_page": "opna0181.html",
        "image": "opna0181.jpg",
        "pdf": "opna0181.pdf"
      }],
      "537": [
      {
        "page_number": 182,
        "html_page": "opna0182.html",
        "image": "opna0182.jpg",
        "pdf": "opna0182.pdf"
      }],
      "538": [
      {
        "page_number": 183,
        "html_page": "opna0183.html",
        "image": "opna0183.jpg",
        "pdf": "opna0183.pdf"
      }],
      "539": [
      {
        "page_number": 184,
        "html_page": "opna0184.html",
        "image": "opna0184.jpg",
        "pdf": "opna0184.pdf"
      }],
      "540": [
      {
        "page_number": 185,
        "html_page": "opna0185.html",
        "image": "opna0185.jpg",
        "pdf": "opna0185.pdf"
      },
      {
        "page_number": 186,
        "html_page": "opna0186.html",
        "image": "opna0186.jpg",
        "pdf": "opna0186.pdf"
      }],
      "541": [
      {
        "page_number": 187,
        "html_page": "opna0187.html",
        "image": "opna0187.jpg",
        "pdf": "opna0187.pdf"
      }],
      "542": [
      {
        "page_number": 188,
        "html_page": "opna0188.html",
        "image": "opna0188.jpg",
        "pdf": "opna0188.pdf"
      }],
      "543": [
      {
        "page_number": 189,
        "html_page": "opna0189.html",
        "image": "opna0189.jpg",
        "pdf": "opna0189.pdf"
      }],
      "544": [
      {
        "page_number": 190,
        "html_page": "opna0190.html",
        "image": "opna0190.jpg",
        "pdf": "opna0190.pdf"
      }],
      "545": [
      {
        "page_number": 191,
        "html_page": "opna0191.html",
        "image": "opna0191.jpg",
        "pdf": "opna0191.pdf"
      }],
      "546": [
      {
        "page_number": 192,
        "html_page": "opna0192.html",
        "image": "opna0192.jpg",
        "pdf": "opna0192.pdf"
      },
      {
        "page_number": 193,
        "html_page": "opna0193.html",
        "image": "opna0193.jpg",
        "pdf": "opna0193.pdf"
      },
      {
        "page_number": 194,
        "html_page": "opna0194.html",
        "image": "opna0194.jpg",
        "pdf": "opna0194.pdf"
      }],
      "547": [
      {
        "page_number": 195,
        "html_page": "opna0195.html",
        "image": "opna0195.jpg",
        "pdf": "opna0195.pdf"
      }],
      "548": [
      {
        "page_number": 196,
        "html_page": "opna0196.html",
        "image": "opna0196.jpg",
        "pdf": "opna0196.pdf"
      }],
      "549": [
      {
        "page_number": 197,
        "html_page": "opna0197.html",
        "image": "opna0197.jpg",
        "pdf": "opna0197.pdf"
      }],
      "550": [
      {
        "page_number": 198,
        "html_page": "opna0198.html",
        "image": "opna0198.jpg",
        "pdf": "opna0198.pdf"
      }],
      "551": [
      {
        "page_number": 199,
        "html_page": "opna0199.html",
        "image": "opna0199.jpg",
        "pdf": "opna0199.pdf"
      }],
      "552": [
      {
        "page_number": 200,
        "html_page": "opna0200.html",
        "image": "opna0200.jpg",
        "pdf": "opna0200.pdf"
      }],
      "553": [
      {
        "page_number": 201,
        "html_page": "opna0201.html",
        "image": "opna0201.jpg",
        "pdf": "opna0201.pdf"
      }],
      "554": [
      {
        "page_number": 202,
        "html_page": "opna0202.html",
        "image": "opna0202.jpg",
        "pdf": "opna0202.pdf"
      }],
      "555": [
      {
        "page_number": 203,
        "html_page": "opna0203.html",
        "image": "opna0203.jpg",
        "pdf": "opna0203.pdf"
      },
      {
        "page_number": 204,
        "html_page": "opna0204.html",
        "image": "opna0204.jpg",
        "pdf": "opna0204.pdf"
      },
      {
        "page_number": 205,
        "html_page": "opna0205.html",
        "image": "opna0205.jpg",
        "pdf": "opna0205.pdf"
      }],
      "557": [
      {
        "page_number": 206,
        "html_page": "opna0206.html",
        "image": "opna0206.jpg",
        "pdf": "opna0206.pdf"
      }],
      "556": [
      {
        "page_number": 207,
        "html_page": "opna0207.html",
        "image": "opna0207.jpg",
        "pdf": "opna0207.pdf"
      }],
      "558": [
      {
        "page_number": 208,
        "html_page": "opna0208.html",
        "image": "opna0208.jpg",
        "pdf": "opna0208.pdf"
      }],
      "559": [
      {
        "page_number": 209,
        "html_page": "opna0209.html",
        "image": "opna0209.jpg",
        "pdf": "opna0209.pdf"
      }],
      "560": [
      {
        "page_number": 210,
        "html_page": "opna0210.html",
        "image": "opna0210.jpg",
        "pdf": "opna0210.pdf"
      },
      {
        "page_number": 211,
        "html_page": "opna0211.html",
        "image": "opna0211.jpg",
        "pdf": "opna0211.pdf"
      },
      {
        "page_number": 212,
        "html_page": "opna0212.html",
        "image": "opna0212.jpg",
        "pdf": "opna0212.pdf"
      }],
      "561": [
      {
        "page_number": 213,
        "html_page": "opna0213.html",
        "image": "opna0213.jpg",
        "pdf": "opna0213.pdf"
      }],
      "562": [
      {
        "page_number": 214,
        "html_page": "opna0214.html",
        "image": "opna0214.jpg",
        "pdf": "opna0214.pdf"
      }],
      "563": [
      {
        "page_number": 215,
        "html_page": "opna0215.html",
        "image": "opna0215.jpg",
        "pdf": "opna0215.pdf"
      }],
      "564": [
      {
        "page_number": 216,
        "html_page": "opna0216.html",
        "image": "opna0216.jpg",
        "pdf": "opna0216.pdf"
      },
      {
        "page_number": 217,
        "html_page": "opna0217.html",
        "image": "opna0217.jpg",
        "pdf": "opna0217.pdf"
      },
      {
        "page_number": 218,
        "html_page": "opna0218.html",
        "image": "opna0218.jpg",
        "pdf": "opna0218.pdf"
      },
      {
        "page_number": 219,
        "html_page": "opna0219.html",
        "image": "opna0219.jpg",
        "pdf": "opna0219.pdf"
      },
      {
        "page_number": 220,
        "html_page": "opna0220.html",
        "image": "opna0220.jpg",
        "pdf": "opna0220.pdf"
      }],
      "565": [
      {
        "page_number": 221,
        "html_page": "opna0221.html",
        "image": "opna0221.jpg",
        "pdf": "opna0221.pdf"
      }],
      "566": [
      {
        "page_number": 222,
        "html_page": "opna0222.html",
        "image": "opna0222.jpg",
        "pdf": "opna0222.pdf"
      }],
      "567": [
      {
        "page_number": 223,
        "html_page": "opna0223.html",
        "image": "opna0223.jpg",
        "pdf": "opna0223.pdf"
      }],
      "568": [
      {
        "page_number": 224,
        "html_page": "opna0224.html",
        "image": "opna0224.jpg",
        "pdf": "opna0224.pdf"
      },
      {
        "page_number": 225,
        "html_page": "opna0225.html",
        "image": "opna0225.jpg",
        "pdf": "opna0225.pdf"
      },
      {
        "page_number": 226,
        "html_page": "opna0226.html",
        "image": "opna0226.jpg",
        "pdf": "opna0226.pdf"
      }],
      "569": [
      {
        "page_number": 227,
        "html_page": "opna0227.html",
        "image": "opna0227.jpg",
        "pdf": "opna0227.pdf"
      },
      {
        "page_number": 228,
        "html_page": "opna0228.html",
        "image": "opna0228.jpg",
        "pdf": "opna0228.pdf"
      },
      {
        "page_number": 229,
        "html_page": "opna0229.html",
        "image": "opna0229.jpg",
        "pdf": "opna0229.pdf"
      }],
      "570": [
      {
        "page_number": 230,
        "html_page": "opna0230.html",
        "image": "opna0230.jpg",
        "pdf": "opna0230.pdf"
      }],
      "571": [
      {
        "page_number": 231,
        "html_page": "opna0231.html",
        "image": "opna0231.jpg",
        "pdf": "opna0231.pdf"
      }],
      "572": [
      {
        "page_number": 232,
        "html_page": "opna0232.html",
        "image": "opna0232.jpg",
        "pdf": "opna0232.pdf"
      }],
      "574": [
      {
        "page_number": 233,
        "html_page": "opna0233.html",
        "image": "opna0233.jpg",
        "pdf": "opna0233.pdf"
      }],
      "575": [
      {
        "page_number": 234,
        "html_page": "opna0234.html",
        "image": "opna0234.jpg",
        "pdf": "opna0234.pdf"
      }],
      "576": [
      {
        "page_number": 235,
        "html_page": "opna0235.html",
        "image": "opna0235.jpg",
        "pdf": "opna0235.pdf"
      },
      {
        "page_number": 236,
        "html_page": "opna0236.html",
        "image": "opna0236.jpg",
        "pdf": "opna0236.pdf"
      },
      {
        "page_number": 237,
        "html_page": "opna0237.html",
        "image": "opna0237.jpg",
        "pdf": "opna0237.pdf"
      }],
      "577": [
      {
        "page_number": 238,
        "html_page": "opna0238.html",
        "image": "opna0238.jpg",
        "pdf": "opna0238.pdf"
      }],
      "578": [
      {
        "page_number": 239,
        "html_page": "opna0239.html",
        "image": "opna0239.jpg",
        "pdf": "opna0239.pdf"
      }],
      "579": [
      {
        "page_number": 240,
        "html_page": "opna0240.html",
        "image": "opna0240.jpg",
        "pdf": "opna0240.pdf"
      }],
      "580": [
      {
        "page_number": 241,
        "html_page": "opna0241.html",
        "image": "opna0241.jpg",
        "pdf": "opna0241.pdf"
      },
      {
        "page_number": 250,
        "html_page": "opna0250.html",
        "image": "opna0250.jpg",
        "pdf": "opna0250.pdf"
      },
      {
        "page_number": 251,
        "html_page": "opna0251.html",
        "image": "opna0251.jpg",
        "pdf": "opna0251.pdf"
      },
      {
        "page_number": 252,
        "html_page": "opna0252.html",
        "image": "opna0252.jpg",
        "pdf": "opna0252.pdf"
      },
      {
        "page_number": 253,
        "html_page": "opna0253.html",
        "image": "opna0253.jpg",
        "pdf": "opna0253.pdf"
      },
      {
        "page_number": 254,
        "html_page": "opna0254.html",
        "image": "opna0254.jpg",
        "pdf": "opna0254.pdf"
      }],
      "581": [
      {
        "page_number": 242,
        "html_page": "opna0242.html",
        "image": "opna0242.jpg",
        "pdf": "opna0242.pdf"
      }],
      "582": [
      {
        "page_number": 243,
        "html_page": "opna0243.html",
        "image": "opna0243.jpg",
        "pdf": "opna0243.pdf"
      },
      {
        "page_number": 244,
        "html_page": "opna0244.html",
        "image": "opna0244.jpg",
        "pdf": "opna0244.pdf"
      },
      {
        "page_number": 245,
        "html_page": "opna0245.html",
        "image": "opna0245.jpg",
        "pdf": "opna0245.pdf"
      },
      {
        "page_number": 246,
        "html_page": "opna0246.html",
        "image": "opna0246.jpg",
        "pdf": "opna0246.pdf"
      }],
      "583": [
      {
        "page_number": 247,
        "html_page": "opna0247.html",
        "image": "opna0247.jpg",
        "pdf": "opna0247.pdf"
      }],
      "584": [
      {
        "page_number": 248,
        "html_page": "opna0248.html",
        "image": "opna0248.jpg",
        "pdf": "opna0248.pdf"
      }],
      "585": [
      {
        "page_number": 249,
        "html_page": "opna0249.html",
        "image": "opna0249.jpg",
        "pdf": "opna0249.pdf"
      }],
      "586": [
      {
        "page_number": 255,
        "html_page": "opna0255.html",
        "image": "opna0255.jpg",
        "pdf": "opna0255.pdf"
      }],
      "587": [
      {
        "page_number": 256,
        "html_page": "opna0256.html",
        "image": "opna0256.jpg",
        "pdf": "opna0256.pdf"
      },
      {
        "page_number": 257,
        "html_page": "opna0257.html",
        "image": "opna0257.jpg",
        "pdf": "opna0257.pdf"
      },
      {
        "page_number": 258,
        "html_page": "opna0258.html",
        "image": "opna0258.jpg",
        "pdf": "opna0258.pdf"
      }],
      "588": [
      {
        "page_number": 259,
        "html_page": "opna0259.html",
        "image": "opna0259.jpg",
        "pdf": "opna0259.pdf"
      }],
      "589": [
      {
        "page_number": 260,
        "html_page": "opna0260.html",
        "image": "opna0260.jpg",
        "pdf": "opna0260.pdf"
      }],
      "590": [
      {
        "page_number": 261,
        "html_page": "opna0261.html",
        "image": "opna0261.jpg",
        "pdf": "opna0261.pdf"
      }],
      "591": [
      {
        "page_number": 262,
        "html_page": "opna0262.html",
        "image": "opna0262.jpg",
        "pdf": "opna0262.pdf"
      }],
      "592": [
      {
        "page_number": 263,
        "html_page": "opna0263.html",
        "image": "opna0263.jpg",
        "pdf": "opna0263.pdf"
      }],
      "593": [
      {
        "page_number": 264,
        "html_page": "opna0264.html",
        "image": "opna0264.jpg",
        "pdf": "opna0264.pdf"
      }],
      "594": [
      {
        "page_number": 265,
        "html_page": "opna0265.html",
        "image": "opna0265.jpg",
        "pdf": "opna0265.pdf"
      }],
      "595": [
      {
        "page_number": 266,
        "html_page": "opna0266.html",
        "image": "opna0266.jpg",
        "pdf": "opna0266.pdf"
      }],
      "596": [
      {
        "page_number": 267,
        "html_page": "opna0267.html",
        "image": "opna0267.jpg",
        "pdf": "opna0267.pdf"
      },
      {
        "page_number": 268,
        "html_page": "opna0268.html",
        "image": "opna0268.jpg",
        "pdf": "opna0268.pdf"
      },
      {
        "page_number": 269,
        "html_page": "opna0269.html",
        "image": "opna0269.jpg",
        "pdf": "opna0269.pdf"
      }],
      "597": [
      {
        "page_number": 270,
        "html_page": "opna0270.html",
        "image": "opna0270.jpg",
        "pdf": "opna0270.pdf"
      }],
      "598": [
      {
        "page_number": 271,
        "html_page": "opna0271.html",
        "image": "opna0271.jpg",
        "pdf": "opna0271.pdf"
      }],
      "599": [
      {
        "page_number": 272,
        "html_page": "opna0272.html",
        "image": "opna0272.jpg",
        "pdf": "opna0272.pdf"
      }],
      "600": [
      {
        "page_number": 273,
        "html_page": "opna0273.html",
        "image": "opna0273.jpg",
        "pdf": "opna0273.pdf"
      }],
      "601": [
      {
        "page_number": 274,
        "html_page": "opna0274.html",
        "image": "opna0274.jpg",
        "pdf": "opna0274.pdf"
      },
      {
        "page_number": 275,
        "html_page": "opna0275.html",
        "image": "opna0275.jpg",
        "pdf": "opna0275.pdf"
      },
      {
        "page_number": 276,
        "html_page": "opna0276.html",
        "image": "opna0276.jpg",
        "pdf": "opna0276.pdf"
      }],
      "602": [
      {
        "page_number": 277,
        "html_page": "opna0277.html",
        "image": "opna0277.jpg",
        "pdf": "opna0277.pdf"
      }],
      "603": [
      {
        "page_number": 278,
        "html_page": "opna0278.html",
        "image": "opna0278.jpg",
        "pdf": "opna0278.pdf"
      }],
      "604": [
      {
        "page_number": 279,
        "html_page": "opna0279.html",
        "image": "opna0279.jpg",
        "pdf": "opna0279.pdf"
      }],
      "605": [
      {
        "page_number": 280,
        "html_page": "opna0280.html",
        "image": "opna0280.jpg",
        "pdf": "opna0280.pdf"
      }],
      "606": [
      {
        "page_number": 281,
        "html_page": "opna0281.html",
        "image": "opna0281.jpg",
        "pdf": "opna0281.pdf"
      }],
      "607": [
      {
        "page_number": 282,
        "html_page": "opna0282.html",
        "image": "opna0282.jpg",
        "pdf": "opna0282.pdf"
      }],
      "608": [
      {
        "page_number": 283,
        "html_page": "opna0283.html",
        "image": "opna0283.jpg",
        "pdf": "opna0283.pdf"
      }],
      "609": [
      {
        "page_number": 284,
        "html_page": "opna0284.html",
        "image": "opna0284.jpg",
        "pdf": "opna0284.pdf"
      }],
      "610": [
      {
        "page_number": 285,
        "html_page": "opna0285.html",
        "image": "opna0285.jpg",
        "pdf": "opna0285.pdf"
      }],
      "611": [
      {
        "page_number": 286,
        "html_page": "opna0286.html",
        "image": "opna0286.jpg",
        "pdf": "opna0286.pdf"
      }],
      "612": [
      {
        "page_number": 287,
        "html_page": "opna0287.html",
        "image": "opna0287.jpg",
        "pdf": "opna0287.pdf"
      }],
      "613": [
      {
        "page_number": 288,
        "html_page": "opna0288.html",
        "image": "opna0288.jpg",
        "pdf": "opna0288.pdf"
      }],
      "614": [
      {
        "page_number": 289,
        "html_page": "opna0289.html",
        "image": "opna0289.jpg",
        "pdf": "opna0289.pdf"
      }],
      "615": [
      {
        "page_number": 290,
        "html_page": "opna0290.html",
        "image": "opna0290.jpg",
        "pdf": "opna0290.pdf"
      }],
      "616": [
      {
        "page_number": 291,
        "html_page": "opna0291.html",
        "image": "opna0291.jpg",
        "pdf": "opna0291.pdf"
      }],
      "617": [
      {
        "page_number": 292,
        "html_page": "opna0292.html",
        "image": "opna0292.jpg",
        "pdf": "opna0292.pdf"
      }],
      "618": [
      {
        "page_number": 293,
        "html_page": "opna0293.html",
        "image": "opna0293.jpg",
        "pdf": "opna0293.pdf"
      }],
      "619": [
      {
        "page_number": 294,
        "html_page": "opna0294.html",
        "image": "opna0294.jpg",
        "pdf": "opna0294.pdf"
      }],
      "620": [
      {
        "page_number": 295,
        "html_page": "opna0295.html",
        "image": "opna0295.jpg",
        "pdf": "opna0295.pdf"
      }],
      "636": [
      {
        "page_number": 296,
        "html_page": "opna0296.html",
        "image": "opna0296.jpg",
        "pdf": "opna0296.pdf"
      }],
      "621": [
      {
        "page_number": 297,
        "html_page": "opna0297.html",
        "image": "opna0297.jpg",
        "pdf": "opna0297.pdf"
      }],
      "622": [
      {
        "page_number": 298,
        "html_page": "opna0298.html",
        "image": "opna0298.jpg",
        "pdf": "opna0298.pdf"
      }],
      "623": [
      {
        "page_number": 299,
        "html_page": "opna0299.html",
        "image": "opna0299.jpg",
        "pdf": "opna0299.pdf"
      }],
      "624": [
      {
        "page_number": 300,
        "html_page": "opna0300.html",
        "image": "opna0300.jpg",
        "pdf": "opna0300.pdf"
      }],
      "625": [
      {
        "page_number": 301,
        "html_page": "opna0301.html",
        "image": "opna0301.jpg",
        "pdf": "opna0301.pdf"
      },
      {
        "page_number": 302,
        "html_page": "opna0302.html",
        "image": "opna0302.jpg",
        "pdf": "opna0302.pdf"
      },
      {
        "page_number": 303,
        "html_page": "opna0303.html",
        "image": "opna0303.jpg",
        "pdf": "opna0303.pdf"
      }],
      "626": [
      {
        "page_number": 304,
        "html_page": "opna0304.html",
        "image": "opna0304.jpg",
        "pdf": "opna0304.pdf"
      }],
      "627": [
      {
        "page_number": 305,
        "html_page": "opna0305.html",
        "image": "opna0305.jpg",
        "pdf": "opna0305.pdf"
      }],
      "628": [
      {
        "page_number": 306,
        "html_page": "opna0306.html",
        "image": "opna0306.jpg",
        "pdf": "opna0306.pdf"
      }],
      "629": [
      {
        "page_number": 307,
        "html_page": "opna0307.html",
        "image": "opna0307.jpg",
        "pdf": "opna0307.pdf"
      },
      {
        "page_number": 308,
        "html_page": "opna0308.html",
        "image": "opna0308.jpg",
        "pdf": "opna0308.pdf"
      },
      {
        "page_number": 309,
        "html_page": "opna0309.html",
        "image": "opna0309.jpg",
        "pdf": "opna0309.pdf"
      }],
      "630": [
      {
        "page_number": 310,
        "html_page": "opna0310.html",
        "image": "opna0310.jpg",
        "pdf": "opna0310.pdf"
      }],
      "631": [
      {
        "page_number": 311,
        "html_page": "opna0311.html",
        "image": "opna0311.jpg",
        "pdf": "opna0311.pdf"
      }],
      "632": [
      {
        "page_number": 312,
        "html_page": "opna0312.html",
        "image": "opna0312.jpg",
        "pdf": "opna0312.pdf"
      }],
      "633": [
      {
        "page_number": 313,
        "html_page": "opna0313.html",
        "image": "opna0313.jpg",
        "pdf": "opna0313.pdf"
      },
      {
        "page_number": 314,
        "html_page": "opna0314.html",
        "image": "opna0314.jpg",
        "pdf": "opna0314.pdf"
      },
      {
        "page_number": 315,
        "html_page": "opna0315.html",
        "image": "opna0315.jpg",
        "pdf": "opna0315.pdf"
      }],
      "634": [
      {
        "page_number": 316,
        "html_page": "opna0316.html",
        "image": "opna0316.jpg",
        "pdf": "opna0316.pdf"
      }],
      "635": [
      {
        "page_number": 317,
        "html_page": "opna0317.html",
        "image": "opna0317.jpg",
        "pdf": "opna0317.pdf"
      }],
      "637": [
      {
        "page_number": 318,
        "html_page": "opna0318.html",
        "image": "opna0318.jpg",
        "pdf": "opna0318.pdf"
      }],
      "638": [
      {
        "page_number": 319,
        "html_page": "opna0319.html",
        "image": "opna0319.jpg",
        "pdf": "opna0319.pdf"
      },
      {
        "page_number": 320,
        "html_page": "opna0320.html",
        "image": "opna0320.jpg",
        "pdf": "opna0320.pdf"
      },
      {
        "page_number": 321,
        "html_page": "opna0321.html",
        "image": "opna0321.jpg",
        "pdf": "opna0321.pdf"
      }],
      "639": [
      {
        "page_number": 322,
        "html_page": "opna0322.html",
        "image": "opna0322.jpg",
        "pdf": "opna0322.pdf"
      }],
      "640": [
      {
        "page_number": 323,
        "html_page": "opna0323.html",
        "image": "opna0323.jpg",
        "pdf": "opna0323.pdf"
      }],
      "641": [
      {
        "page_number": 324,
        "html_page": "opna0324.html",
        "image": "opna0324.jpg",
        "pdf": "opna0324.pdf"
      }],
      "642": [
      {
        "page_number": 325,
        "html_page": "opna0325.html",
        "image": "opna0325.jpg",
        "pdf": "opna0325.pdf"
      }],
      "643": [
      {
        "page_number": 326,
        "html_page": "opna0326.html",
        "image": "opna0326.jpg",
        "pdf": "opna0326.pdf"
      }],
      "644": [
      {
        "page_number": 327,
        "html_page": "opna0327.html",
        "image": "opna0327.jpg",
        "pdf": "opna0327.pdf"
      }],
      "645": [
      {
        "page_number": 328,
        "html_page": "opna0328.html",
        "image": "opna0328.jpg",
        "pdf": "opna0328.pdf"
      }],
      "646": [
      {
        "page_number": 329,
        "html_page": "opna0329.html",
        "image": "opna0329.jpg",
        "pdf": "opna0329.pdf"
      }],
      "647": [
      {
        "page_number": 330,
        "html_page": "opna0330.html",
        "image": "opna0330.jpg",
        "pdf": "opna0330.pdf"
      }],
      "648": [
      {
        "page_number": 331,
        "html_page": "opna0331.html",
        "image": "opna0331.jpg",
        "pdf": "opna0331.pdf"
      }],
      "649": [
      {
        "page_number": 332,
        "html_page": "opna0332.html",
        "image": "opna0332.jpg",
        "pdf": "opna0332.pdf"
      }],
      "650": [
      {
        "page_number": 333,
        "html_page": "opna0333.html",
        "image": "opna0333.jpg",
        "pdf": "opna0333.pdf"
      }],
      "651": [
      {
        "page_number": 334,
        "html_page": "opna0334.html",
        "image": "opna0334.jpg",
        "pdf": "opna0334.pdf"
      },
      {
        "page_number": 335,
        "html_page": "opna0335.html",
        "image": "opna0335.jpg",
        "pdf": "opna0335.pdf"
      },
      {
        "page_number": 336,
        "html_page": "opna0336.html",
        "image": "opna0336.jpg",
        "pdf": "opna0336.pdf"
      }],
      "652": [
      {
        "page_number": 337,
        "html_page": "opna0337.html",
        "image": "opna0337.jpg",
        "pdf": "opna0337.pdf"
      }],
      "653": [
      {
        "page_number": 338,
        "html_page": "opna0338.html",
        "image": "opna0338.jpg",
        "pdf": "opna0338.pdf"
      }],
      "654": [
      {
        "page_number": 339,
        "html_page": "opna0339.html",
        "image": "opna0339.jpg",
        "pdf": "opna0339.pdf"
      }],
      "655": [
      {
        "page_number": 340,
        "html_page": "opna0340.html",
        "image": "opna0340.jpg",
        "pdf": "opna0340.pdf"
      }],
      "656": [
      {
        "page_number": 341,
        "html_page": "opna0341.html",
        "image": "opna0341.jpg",
        "pdf": "opna0341.pdf"
      }],
      "657": [
      {
        "page_number": 342,
        "html_page": "opna0342.html",
        "image": "opna0342.jpg",
        "pdf": "opna0342.pdf"
      }],
      "658": [
      {
        "page_number": 343,
        "html_page": "opna0343.html",
        "image": "opna0343.jpg",
        "pdf": "opna0343.pdf"
      }],
      "659": [
      {
        "page_number": 344,
        "html_page": "opna0344.html",
        "image": "opna0344.jpg",
        "pdf": "opna0344.pdf"
      }],
      "660": [
      {
        "page_number": 345,
        "html_page": "opna0345.html",
        "image": "opna0345.jpg",
        "pdf": "opna0345.pdf"
      },
      {
        "page_number": 346,
        "html_page": "opna0346.html",
        "image": "opna0346.jpg",
        "pdf": "opna0346.pdf"
      },
      {
        "page_number": 347,
        "html_page": "opna0347.html",
        "image": "opna0347.jpg",
        "pdf": "opna0347.pdf"
      }],
      "661": [
      {
        "page_number": 348,
        "html_page": "opna0348.html",
        "image": "opna0348.jpg",
        "pdf": "opna0348.pdf"
      }],
      "662": [
      {
        "page_number": 349,
        "html_page": "opna0349.html",
        "image": "opna0349.jpg",
        "pdf": "opna0349.pdf"
      }],
      "663": [
      {
        "page_number": 350,
        "html_page": "opna0350.html",
        "image": "opna0350.jpg",
        "pdf": "opna0350.pdf"
      }],
      "664": [
      {
        "page_number": 351,
        "html_page": "opna0351.html",
        "image": "opna0351.jpg",
        "pdf": "opna0351.pdf"
      }],
      "665": [
      {
        "page_number": 352,
        "html_page": "opna0352.html",
        "image": "opna0352.jpg",
        "pdf": "opna0352.pdf"
      }],
      "666": [
      {
        "page_number": 353,
        "html_page": "opna0353.html",
        "image": "opna0353.jpg",
        "pdf": "opna0353.pdf"
      }],
      "667": [
      {
        "page_number": 354,
        "html_page": "opna0354.html",
        "image": "opna0354.jpg",
        "pdf": "opna0354.pdf"
      }],
      "668": [
      {
        "page_number": 355,
        "html_page": "opna0355.html",
        "image": "opna0355.jpg",
        "pdf": "opna0355.pdf"
      }],
      "669": [
      {
        "page_number": 356,
        "html_page": "opna0356.html",
        "image": "opna0356.jpg",
        "pdf": "opna0356.pdf"
      }],
      "670": [
      {
        "page_number": 357,
        "html_page": "opna0357.html",
        "image": "opna0357.jpg",
        "pdf": "opna0357.pdf"
      }],
      "671": [
      {
        "page_number": 358,
        "html_page": "opna0358.html",
        "image": "opna0358.jpg",
        "pdf": "opna0358.pdf"
      }],
      "672": [
      {
        "page_number": 359,
        "html_page": "opna0359.html",
        "image": "opna0359.jpg",
        "pdf": "opna0359.pdf"
      }],
      "673": [
      {
        "page_number": 360,
        "html_page": "opna0360.html",
        "image": "opna0360.jpg",
        "pdf": "opna0360.pdf"
      }],
      "674": [
      {
        "page_number": 361,
        "html_page": "opna0361.html",
        "image": "opna0361.jpg",
        "pdf": "opna0361.pdf"
      }],
      "675": [
      {
        "page_number": 362,
        "html_page": "opna0362.html",
        "image": "opna0362.jpg",
        "pdf": "opna0362.pdf"
      },
      {
        "page_number": 363,
        "html_page": "opna0363.html",
        "image": "opna0363.jpg",
        "pdf": "opna0363.pdf"
      },
      {
        "page_number": 364,
        "html_page": "opna0364.html",
        "image": "opna0364.jpg",
        "pdf": "opna0364.pdf"
      }],
      "676": [
      {
        "page_number": 365,
        "html_page": "opna0365.html",
        "image": "opna0365.jpg",
        "pdf": "opna0365.pdf"
      }],
      "677": [
      {
        "page_number": 366,
        "html_page": "opna0366.html",
        "image": "opna0366.jpg",
        "pdf": "opna0366.pdf"
      }],
      "678": [
      {
        "page_number": 367,
        "html_page": "opna0367.html",
        "image": "opna0367.jpg",
        "pdf": "opna0367.pdf"
      }],
      "679": [
      {
        "page_number": 368,
        "html_page": "opna0368.html",
        "image": "opna0368.jpg",
        "pdf": "opna0368.pdf"
      }],
      "680": [
      {
        "page_number": 369,
        "html_page": "opna0369.html",
        "image": "opna0369.jpg",
        "pdf": "opna0369.pdf"
      }],
      "681": [
      {
        "page_number": 370,
        "html_page": "opna0370.html",
        "image": "opna0370.jpg",
        "pdf": "opna0370.pdf"
      }],
      "682": [
      {
        "page_number": 371,
        "html_page": "opna0371.html",
        "image": "opna0371.jpg",
        "pdf": "opna0371.pdf"
      }],
      "683": [
      {
        "page_number": 372,
        "html_page": "opna0372.html",
        "image": "opna0372.jpg",
        "pdf": "opna0372.pdf"
      }],
      "684": [
      {
        "page_number": 373,
        "html_page": "opna0373.html",
        "image": "opna0373.jpg",
        "pdf": "opna0373.pdf"
      },
      {
        "page_number": 374,
        "html_page": "opna0374.html",
        "image": "opna0374.jpg",
        "pdf": "opna0374.pdf"
      },
      {
        "page_number": 375,
        "html_page": "opna0375.html",
        "image": "opna0375.jpg",
        "pdf": "opna0375.pdf"
      }],
      "685": [
      {
        "page_number": 376,
        "html_page": "opna0376.html",
        "image": "opna0376.jpg",
        "pdf": "opna0376.pdf"
      }],
      "686": [
      {
        "page_number": 377,
        "html_page": "opna0377.html",
        "image": "opna0377.jpg",
        "pdf": "opna0377.pdf"
      }],
      "687": [
      {
        "page_number": 378,
        "html_page": "opna0378.html",
        "image": "opna0378.jpg",
        "pdf": "opna0378.pdf"
      }],
      "688": [
      {
        "page_number": 379,
        "html_page": "opna0379.html",
        "image": "opna0379.jpg",
        "pdf": "opna0379.pdf"
      },
      {
        "page_number": 380,
        "html_page": "opna0380.html",
        "image": "opna0380.jpg",
        "pdf": "opna0380.pdf"
      },
      {
        "page_number": 381,
        "html_page": "opna0381.html",
        "image": "opna0381.jpg",
        "pdf": "opna0381.pdf"
      }],
      "689": [
      {
        "page_number": 382,
        "html_page": "opna0382.html",
        "image": "opna0382.jpg",
        "pdf": "opna0382.pdf"
      }],
      "690": [
      {
        "page_number": 383,
        "html_page": "opna0383.html",
        "image": "opna0383.jpg",
        "pdf": "opna0383.pdf"
      },
      {
        "page_number": 384,
        "html_page": "opna0384.html",
        "image": "opna0384.jpg",
        "pdf": "opna0384.pdf"
      },
      {
        "page_number": 385,
        "html_page": "opna0385.html",
        "image": "opna0385.jpg",
        "pdf": "opna0385.pdf"
      }],
      "691": [
      {
        "page_number": 386,
        "html_page": "opna0386.html",
        "image": "opna0386.jpg",
        "pdf": "opna0386.pdf"
      }],
      "692": [
      {
        "page_number": 387,
        "html_page": "opna0387.html",
        "image": "opna0387.jpg",
        "pdf": "opna0387.pdf"
      }],
      "693": [
      {
        "page_number": 388,
        "html_page": "opna0388.html",
        "image": "opna0388.jpg",
        "pdf": "opna0388.pdf"
      }],
      "694": [
      {
        "page_number": 389,
        "html_page": "opna0389.html",
        "image": "opna0389.jpg",
        "pdf": "opna0389.pdf"
      }],
      "695": [
      {
        "page_number": 390,
        "html_page": "opna0390.html",
        "image": "opna0390.jpg",
        "pdf": "opna0390.pdf"
      }],
      "696": [
      {
        "page_number": 391,
        "html_page": "opna0391.html",
        "image": "opna0391.jpg",
        "pdf": "opna0391.pdf"
      },
      {
        "page_number": 392,
        "html_page": "opna0392.html",
        "image": "opna0392.jpg",
        "pdf": "opna0392.pdf"
      },
      {
        "page_number": 393,
        "html_page": "opna0393.html",
        "image": "opna0393.jpg",
        "pdf": "opna0393.pdf"
      }],
      "697": [
      {
        "page_number": 394,
        "html_page": "opna0394.html",
        "image": "opna0394.jpg",
        "pdf": "opna0394.pdf"
      }],
      "698": [
      {
        "page_number": 395,
        "html_page": "opna0395.html",
        "image": "opna0395.jpg",
        "pdf": "opna0395.pdf"
      }],
      "699": [
      {
        "page_number": 396,
        "html_page": "opna0396.html",
        "image": "opna0396.jpg",
        "pdf": "opna0396.pdf"
      }],
      "700": [
      {
        "page_number": 397,
        "html_page": "opna0397.html",
        "image": "opna0397.jpg",
        "pdf": "opna0397.pdf"
      }],
      "701": [
      {
        "page_number": 398,
        "html_page": "opna0398.html",
        "image": "opna0398.jpg",
        "pdf": "opna0398.pdf"
      }],
      "702": [
      {
        "page_number": 399,
        "html_page": "opna0399.html",
        "image": "opna0399.jpg",
        "pdf": "opna0399.pdf"
      }],
      "703": [
      {
        "page_number": 400,
        "html_page": "opna0400.html",
        "image": "opna0400.jpg",
        "pdf": "opna0400.pdf"
      }],
      "704": [
      {
        "page_number": 401,
        "html_page": "opna0401.html",
        "image": "opna0401.jpg",
        "pdf": "opna0401.pdf"
      }],
      "705": [
      {
        "page_number": 402,
        "html_page": "opna0402.html",
        "image": "opna0402.jpg",
        "pdf": "opna0402.pdf"
      }],
      "706": [
      {
        "page_number": 403,
        "html_page": "opna0403.html",
        "image": "opna0403.jpg",
        "pdf": "opna0403.pdf"
      }],
      "707": [
      {
        "page_number": 404,
        "html_page": "opna0404.html",
        "image": "opna0404.jpg",
        "pdf": "opna0404.pdf"
      },
      {
        "page_number": 405,
        "html_page": "opna0405.html",
        "image": "opna0405.jpg",
        "pdf": "opna0405.pdf"
      },
      {
        "page_number": 406,
        "html_page": "opna0406.html",
        "image": "opna0406.jpg",
        "pdf": "opna0406.pdf"
      },
      {
        "page_number": 407,
        "html_page": "opna0407.html",
        "image": "opna0407.jpg",
        "pdf": "opna0407.pdf"
      }],
      "708": [
      {
        "page_number": 408,
        "html_page": "opna0408.html",
        "image": "opna0408.jpg",
        "pdf": "opna0408.pdf"
      }],
      "709": [
      {
        "page_number": 409,
        "html_page": "opna0409.html",
        "image": "opna0409.jpg",
        "pdf": "opna0409.pdf"
      }],
      "710": [
      {
        "page_number": 410,
        "html_page": "opna0410.html",
        "image": "opna0410.jpg",
        "pdf": "opna0410.pdf"
      }],
      "711": [
      {
        "page_number": 411,
        "html_page": "opna0411.html",
        "image": "opna0411.jpg",
        "pdf": "opna0411.pdf"
      }],
      "712": [
      {
        "page_number": 412,
        "html_page": "opna0412.html",
        "image": "opna0412.jpg",
        "pdf": "opna0412.pdf"
      }],
      "713": [
      {
        "page_number": 413,
        "html_page": "opna0413.html",
        "image": "opna0413.jpg",
        "pdf": "opna0413.pdf"
      }],
      "714": [
      {
        "page_number": 414,
        "html_page": "opna0414.html",
        "image": "opna0414.jpg",
        "pdf": "opna0414.pdf"
      }],
      "715": [
      {
        "page_number": 415,
        "html_page": "opna0415.html",
        "image": "opna0415.jpg",
        "pdf": "opna0415.pdf"
      }],
      "716": [
      {
        "page_number": 416,
        "html_page": "opna0416.html",
        "image": "opna0416.jpg",
        "pdf": "opna0416.pdf"
      }],
      "717": [
      {
        "page_number": 417,
        "html_page": "opna0417.html",
        "image": "opna0417.jpg",
        "pdf": "opna0417.pdf"
      }],
      "718": [
      {
        "page_number": 418,
        "html_page": "opna0418.html",
        "image": "opna0418.jpg",
        "pdf": "opna0418.pdf"
      }],
      "719": [
      {
        "page_number": 419,
        "html_page": "opna0419.html",
        "image": "opna0419.jpg",
        "pdf": "opna0419.pdf"
      }],
      "720": [
      {
        "page_number": 420,
        "html_page": "opna0420.html",
        "image": "opna0420.jpg",
        "pdf": "opna0420.pdf"
      }],
      "721": [
      {
        "page_number": 421,
        "html_page": "opna0421.html",
        "image": "opna0421.jpg",
        "pdf": "opna0421.pdf"
      }],
      "722": [
      {
        "page_number": 422,
        "html_page": "opna0422.html",
        "image": "opna0422.jpg",
        "pdf": "opna0422.pdf"
      }],
      "723": [
      {
        "page_number": 423,
        "html_page": "opna0423.html",
        "image": "opna0423.jpg",
        "pdf": "opna0423.pdf"
      }],
      "724": [
      {
        "page_number": 424,
        "html_page": "opna0424.html",
        "image": "opna0424.jpg",
        "pdf": "opna0424.pdf"
      }],
      "725": [
      {
        "page_number": 425,
        "html_page": "opna0425.html",
        "image": "opna0425.jpg",
        "pdf": "opna0425.pdf"
      }],
      "726": [
      {
        "page_number": 426,
        "html_page": "opna0426.html",
        "image": "opna0426.jpg",
        "pdf": "opna0426.pdf"
      },
      {
        "page_number": 427,
        "html_page": "opna0427.html",
        "image": "opna0427.jpg",
        "pdf": "opna0427.pdf"
      },
      {
        "page_number": 428,
        "html_page": "opna0428.html",
        "image": "opna0428.jpg",
        "pdf": "opna0428.pdf"
      },
      {
        "page_number": 429,
        "html_page": "opna0429.html",
        "image": "opna0429.jpg",
        "pdf": "opna0429.pdf"
      }],
      "727": [
      {
        "page_number": 430,
        "html_page": "opna0430.html",
        "image": "opna0430.jpg",
        "pdf": "opna0430.pdf"
      }],
      "728": [
      {
        "page_number": 431,
        "html_page": "opna0431.html",
        "image": "opna0431.jpg",
        "pdf": "opna0431.pdf"
      }],
      "729": [
      {
        "page_number": 432,
        "html_page": "opna0432.html",
        "image": "opna0432.jpg",
        "pdf": "opna0432.pdf"
      }],
      "730": [
      {
        "page_number": 433,
        "html_page": "opna0433.html",
        "image": "opna0433.jpg",
        "pdf": "opna0433.pdf"
      }],
      "731": [
      {
        "page_number": 434,
        "html_page": "opna0434.html",
        "image": "opna0434.jpg",
        "pdf": "opna0434.pdf"
      }],
      "732": [
      {
        "page_number": 435,
        "html_page": "opna0435.html",
        "image": "opna0435.jpg",
        "pdf": "opna0435.pdf"
      }],
      "733": [
      {
        "page_number": 436,
        "html_page": "opna0436.html",
        "image": "opna0436.jpg",
        "pdf": "opna0436.pdf"
      }],
      "734": [
      {
        "page_number": 437,
        "html_page": "opna0437.html",
        "image": "opna0437.jpg",
        "pdf": "opna0437.pdf"
      }],
      "735": [
      {
        "page_number": 438,
        "html_page": "opna0438.html",
        "image": "opna0438.jpg",
        "pdf": "opna0438.pdf"
      },
      {
        "page_number": 439,
        "html_page": "opna0439.html",
        "image": "opna0439.jpg",
        "pdf": "opna0439.pdf"
      },
      {
        "page_number": 440,
        "html_page": "opna0440.html",
        "image": "opna0440.jpg",
        "pdf": "opna0440.pdf"
      }],
      "736": [
      {
        "page_number": 441,
        "html_page": "opna0441.html",
        "image": "opna0441.jpg",
        "pdf": "opna0441.pdf"
      }],
      "737": [
      {
        "page_number": 442,
        "html_page": "opna0442.html",
        "image": "opna0442.jpg",
        "pdf": "opna0442.pdf"
      },
      {
        "page_number": 443,
        "html_page": "opna0443.html",
        "image": "opna0443.jpg",
        "pdf": "opna0443.pdf"
      },
      {
        "page_number": 444,
        "html_page": "opna0444.html",
        "image": "opna0444.jpg",
        "pdf": "opna0444.pdf"
      }],
      "738": [
      {
        "page_number": 445,
        "html_page": "opna0445.html",
        "image": "opna0445.jpg",
        "pdf": "opna0445.pdf"
      }],
      "739": [
      {
        "page_number": 446,
        "html_page": "opna0446.html",
        "image": "opna0446.jpg",
        "pdf": "opna0446.pdf"
      }],
      "740": [
      {
        "page_number": 447,
        "html_page": "opna0447.html",
        "image": "opna0447.jpg",
        "pdf": "opna0447.pdf"
      }],
      "741": [
      {
        "page_number": 448,
        "html_page": "opna0448.html",
        "image": "opna0448.jpg",
        "pdf": "opna0448.pdf"
      }],
      "742": [
      {
        "page_number": 449,
        "html_page": "opna0449.html",
        "image": "opna0449.jpg",
        "pdf": "opna0449.pdf"
      }],
      "743": [
      {
        "page_number": 450,
        "html_page": "opna0450.html",
        "image": "opna0450.jpg",
        "pdf": "opna0450.pdf"
      }],
      "744": [
      {
        "page_number": 451,
        "html_page": "opna0451.html",
        "image": "opna0451.jpg",
        "pdf": "opna0451.pdf"
      }],
      "745": [
      {
        "page_number": 452,
        "html_page": "opna0452.html",
        "image": "opna0452.jpg",
        "pdf": "opna0452.pdf"
      },
      {
        "page_number": 453,
        "html_page": "opna0453.html",
        "image": "opna0453.jpg",
        "pdf": "opna0453.pdf"
      },
      {
        "page_number": 454,
        "html_page": "opna0454.html",
        "image": "opna0454.jpg",
        "pdf": "opna0454.pdf"
      }],
      "746": [
      {
        "page_number": 455,
        "html_page": "opna0455.html",
        "image": "opna0455.jpg",
        "pdf": "opna0455.pdf"
      }],
      "747": [
      {
        "page_number": 456,
        "html_page": "opna0456.html",
        "image": "opna0456.jpg",
        "pdf": "opna0456.pdf"
      }],
      "748": [
      {
        "page_number": 457,
        "html_page": "opna0457.html",
        "image": "opna0457.jpg",
        "pdf": "opna0457.pdf"
      }],
      "749": [
      {
        "page_number": 458,
        "html_page": "opna0458.html",
        "image": "opna0458.jpg",
        "pdf": "opna0458.pdf"
      }],
      "750": [
      {
        "page_number": 459,
        "html_page": "opna0459.html",
        "image": "opna0459.jpg",
        "pdf": "opna0459.pdf"
      }],
      "751": [
      {
        "page_number": 460,
        "html_page": "opna0460.html",
        "image": "opna0460.jpg",
        "pdf": "opna0460.pdf"
      }],
      "752": [
      {
        "page_number": 461,
        "html_page": "opna0461.html",
        "image": "opna0461.jpg",
        "pdf": "opna0461.pdf"
      }],
      "753": [
      {
        "page_number": 462,
        "html_page": "opna0462.html",
        "image": "opna0462.jpg",
        "pdf": "opna0462.pdf"
      }],
      "754": [
      {
        "page_number": 463,
        "html_page": "opna0463.html",
        "image": "opna0463.jpg",
        "pdf": "opna0463.pdf"
      }],
      "755": [
      {
        "page_number": 464,
        "html_page": "opna0464.html",
        "image": "opna0464.jpg",
        "pdf": "opna0464.pdf"
      }],
      "756": [
      {
        "page_number": 465,
        "html_page": "opna0465.html",
        "image": "opna0465.jpg",
        "pdf": "opna0465.pdf"
      },
      {
        "page_number": 466,
        "html_page": "opna0466.html",
        "image": "opna0466.jpg",
        "pdf": "opna0466.pdf"
      },
      {
        "page_number": 467,
        "html_page": "opna0467.html",
        "image": "opna0467.jpg",
        "pdf": "opna0467.pdf"
      }],
      "757": [
      {
        "page_number": 468,
        "html_page": "opna0468.html",
        "image": "opna0468.jpg",
        "pdf": "opna0468.pdf"
      }],
      "758": [
      {
        "page_number": 469,
        "html_page": "opna0469.html",
        "image": "opna0469.jpg",
        "pdf": "opna0469.pdf"
      },
      {
        "page_number": 470,
        "html_page": "opna0470.html",
        "image": "opna0470.jpg",
        "pdf": "opna0470.pdf"
      },
      {
        "page_number": 471,
        "html_page": "opna0471.html",
        "image": "opna0471.jpg",
        "pdf": "opna0471.pdf"
      }],
      "759": [
      {
        "page_number": 472,
        "html_page": "opna0472.html",
        "image": "opna0472.jpg",
        "pdf": "opna0472.pdf"
      }],
      "760": [
      {
        "page_number": 473,
        "html_page": "opna0473.html",
        "image": "opna0473.jpg",
        "pdf": "opna0473.pdf"
      }],
      "761": [
      {
        "page_number": 474,
        "html_page": "opna0474.html",
        "image": "opna0474.jpg",
        "pdf": "opna0474.pdf"
      }],
      "762": [
      {
        "page_number": 475,
        "html_page": "opna0475.html",
        "image": "opna0475.jpg",
        "pdf": "opna0475.pdf"
      }],
      "Bak": [
      {
        "page_number": 478,
        "html_page": "opna0478.html",
        "image": "opna0478.jpg",
        "pdf": "opna0478.pdf"
      }]
    }
  }
}