,Age,TB,DB,Alkphos,Sgpt,Sgot,TP,ALB,AG,Disease,g_Female,g_Male
0,62,10.9,5.5,699,64,100,7.5,3.2,0.74,1,0,1
1,62,7.3,4.1,490,60,68,7.0,3.3,0.89,1,0,1
2,58,1.0,0.4,182,14,20,6.8,3.4,1.0,1,0,1
3,72,3.9,2.0,195,27,59,7.3,2.4,0.4,1,0,1
4,46,1.8,0.7,208,19,14,7.6,4.4,1.3,1,0,1
5,26,0.9,0.2,154,16,12,7.0,3.5,1.0,1,1,0
6,29,0.9,0.3,202,14,11,6.7,3.6,1.1,1,1,0
7,17,0.9,0.3,202,22,19,7.4,4.1,1.2,0,0,1
8,55,0.7,0.2,290,53,58,6.8,3.4,1.0,1,0,1
9,57,0.6,0.1,210,51,59,5.9,2.7,0.8,1,0,1
10,72,2.7,1.3,260,31,56,7.4,3.0,0.6,1,0,1
11,64,0.9,0.3,310,61,58,7.0,3.4,0.9,0,0,1
12,74,1.1,0.4,214,22,30,8.1,4.1,1.0,1,1,0
13,61,0.7,0.2,145,53,41,5.8,2.7,0.87,1,0,1
14,25,0.6,0.1,183,91,53,5.5,2.3,0.7,0,0,1
15,38,1.8,0.8,342,168,441,7.6,4.4,1.3,1,0,1
16,33,1.6,0.5,165,15,23,7.3,3.5,0.92,0,0,1
17,40,0.9,0.3,293,232,245,6.8,3.1,0.8,1,1,0
18,40,0.9,0.3,293,232,245,6.8,3.1,0.8,1,1,0
19,51,2.2,1.0,610,17,28,7.3,2.6,0.55,1,0,1
20,51,2.9,1.3,482,22,34,7.0,2.4,0.5,1,0,1
21,62,6.8,3.0,542,116,66,6.4,3.1,0.9,1,0,1
22,40,1.9,1.0,231,16,55,4.3,1.6,0.6,1,0,1
23,63,0.9,0.2,194,52,45,6.0,3.9,1.85,0,0,1
24,34,4.1,2.0,289,875,731,5.0,2.7,1.1,1,0,1
25,34,4.1,2.0,289,875,731,5.0,2.7,1.1,1,0,1
26,34,6.2,3.0,240,1680,850,7.2,4.0,1.2,1,0,1
27,20,1.1,0.5,128,20,30,3.9,1.9,0.95,0,0,1
28,84,0.7,0.2,188,13,21,6.0,3.2,1.1,0,1,0
29,57,4.0,1.9,190,45,111,5.2,1.5,0.4,1,0,1
30,52,0.9,0.2,156,35,44,4.9,2.9,1.4,1,0,1
31,57,1.0,0.3,187,19,23,5.2,2.9,1.2,0,0,1
32,38,2.6,1.2,410,59,57,5.6,3.0,0.8,0,1,0
33,38,2.6,1.2,410,59,57,5.6,3.0,0.8,0,1,0
34,30,1.3,0.4,482,102,80,6.9,3.3,0.9,1,0,1
35,17,0.7,0.2,145,18,36,7.2,3.9,1.18,0,1,0
36,46,14.2,7.8,374,38,77,4.3,2.0,0.8,1,1,0
37,48,1.4,0.6,263,38,66,5.8,2.2,0.61,1,0,1
38,47,2.7,1.3,275,123,73,6.2,3.3,1.1,1,0,1
39,45,2.4,1.1,168,33,50,5.1,2.6,1.0,1,0,1
40,62,0.6,0.1,160,42,110,4.9,2.6,1.1,0,0,1
41,42,6.8,3.2,630,25,47,6.1,2.3,0.6,0,0,1
42,50,2.6,1.2,415,407,576,6.4,3.2,1.0,1,0,1
43,85,1.0,0.3,208,17,15,7.0,3.6,1.0,0,1,0
44,35,1.8,0.6,275,48,178,6.5,3.2,0.9,0,0,1
45,21,3.9,1.8,150,36,27,6.8,3.9,1.34,1,0,1
46,40,1.1,0.3,230,1630,960,4.9,2.8,1.3,1,0,1
47,32,0.6,0.1,176,39,28,6.0,3.0,1.0,1,1,0
48,55,18.4,8.8,206,64,178,6.2,1.8,0.4,1,0,1
49,45,0.7,0.2,170,21,14,5.7,2.5,0.7,1,1,0
50,34,0.6,0.1,161,15,19,6.6,3.4,1.0,1,1,0
51,38,3.1,1.6,253,80,406,6.8,3.9,1.3,1,0,1
52,38,1.1,0.3,198,86,150,6.3,3.5,1.2,1,0,1
53,42,8.9,4.5,272,31,61,5.8,2.0,0.5,1,0,1
54,42,8.9,4.5,272,31,61,5.8,2.0,0.5,1,0,1
55,33,0.8,0.2,198,26,23,8.0,4.0,1.0,0,0,1
56,48,0.9,0.2,175,24,54,5.5,2.7,0.9,0,1,0
57,51,0.8,0.2,367,42,18,5.2,2.0,0.6,1,0,1
58,64,1.1,0.5,145,20,24,5.5,3.2,1.39,0,0,1
59,31,0.8,0.2,158,21,16,6.0,3.0,1.0,1,1,0
60,58,1.0,0.5,158,37,43,7.2,3.6,1.0,1,0,1
61,58,1.0,0.5,158,37,43,7.2,3.6,1.0,1,0,1
62,57,0.7,0.2,208,35,97,5.1,2.1,0.7,1,0,1
63,57,1.3,0.4,259,40,86,6.5,2.5,0.6,1,0,1
64,57,1.4,0.7,470,62,88,5.6,2.5,0.8,1,0,1
65,54,2.2,1.2,195,55,95,6.0,3.7,1.6,1,0,1
66,37,1.8,0.8,215,53,58,6.4,3.8,1.4,1,0,1
67,66,0.7,0.2,239,27,26,6.3,3.7,1.4,1,0,1
68,60,0.8,0.2,215,24,17,6.3,3.0,0.9,0,0,1
69,19,0.7,0.2,186,166,397,5.5,3.0,1.2,1,1,0
70,75,0.8,0.2,188,20,29,4.4,1.8,0.6,1,1,0
71,75,0.8,0.2,205,27,24,4.4,2.0,0.8,1,1,0
72,52,0.6,0.1,171,22,16,6.6,3.6,1.2,1,0,1
73,68,0.7,0.1,145,20,22,5.8,2.9,1.0,1,0,1
74,29,0.7,0.1,162,52,41,5.2,2.5,0.9,0,1,0
75,31,0.9,0.2,518,189,17,5.3,2.3,0.7,1,0,1
76,68,0.6,0.1,1620,95,127,4.6,2.1,0.8,1,1,0
77,70,1.4,0.6,146,12,24,6.2,3.8,1.58,0,0,1
78,58,2.8,1.3,670,48,79,4.7,1.6,0.5,1,1,0
79,58,2.4,1.1,915,60,142,4.7,1.8,0.6,1,1,0
80,29,1.0,0.3,75,25,26,5.1,2.9,1.3,1,0,1
81,49,0.7,0.1,148,14,12,5.4,2.8,1.0,0,0,1
82,33,2.0,1.0,258,194,152,5.4,3.0,1.25,1,0,1
83,32,0.6,0.1,237,45,31,7.5,4.3,1.34,1,0,1
84,14,1.4,0.5,269,58,45,6.7,3.9,1.4,1,0,1
85,13,0.6,0.1,320,28,56,7.2,3.6,1.0,0,0,1
86,58,0.8,0.2,298,33,59,6.2,3.1,1.0,1,0,1
87,18,0.6,0.2,538,33,34,7.5,3.2,0.7,1,0,1
88,60,4.0,1.9,238,119,350,7.1,3.3,0.8,1,0,1
89,60,5.7,2.8,214,412,850,7.3,3.2,0.78,1,0,1
90,60,6.8,3.2,308,404,794,6.8,3.0,0.7,1,0,1
91,60,8.6,4.0,298,412,850,7.4,3.0,0.6,1,0,1
92,60,5.8,2.7,204,220,400,7.0,3.0,0.7,1,0,1
93,60,5.2,2.4,168,126,202,6.8,2.9,0.7,1,0,1
94,75,0.9,0.2,282,25,23,4.4,2.2,1.0,1,0,1
95,39,3.8,1.5,298,102,630,7.1,3.3,0.8,1,0,1
96,39,6.6,3.0,215,190,950,4.0,1.7,0.7,1,0,1
97,18,0.6,0.1,265,97,161,5.9,3.1,1.1,1,0,1
98,18,0.7,0.1,312,308,405,6.9,3.7,1.1,1,0,1
99,27,0.6,0.2,161,27,28,3.7,1.6,0.76,0,0,1
100,27,0.7,0.2,243,21,23,5.3,2.3,0.7,0,0,1
101,17,0.9,0.2,224,36,45,6.9,4.2,1.55,1,0,1
102,55,0.8,0.2,225,14,23,6.1,3.3,1.2,0,1,0
103,63,0.5,0.1,170,21,28,5.5,2.5,0.8,1,0,1
104,36,5.3,2.3,145,32,92,5.1,2.6,1.0,0,0,1
105,36,5.3,2.3,145,32,92,5.1,2.6,1.0,0,0,1
106,36,0.8,0.2,158,29,39,6.0,2.2,0.5,0,0,1
107,36,0.8,0.2,158,29,39,6.0,2.2,0.5,0,0,1
108,36,0.9,0.1,486,25,34,5.9,2.8,0.9,0,0,1
109,24,0.7,0.2,188,11,10,5.5,2.3,0.71,0,1,0
110,48,3.2,1.6,257,33,116,5.7,2.2,0.62,1,0,1
111,27,1.2,0.4,179,63,39,6.1,3.3,1.1,0,0,1
112,74,0.6,0.1,272,24,98,5.0,2.0,0.6,1,0,1
113,50,5.8,3.0,661,181,285,5.7,2.3,0.67,0,0,1
114,50,7.3,3.6,1580,88,64,5.6,2.3,0.6,0,0,1
115,48,0.7,0.1,1630,74,149,5.3,2.0,0.6,1,0,1
116,32,12.7,6.2,194,2000,2946,5.7,3.3,1.3,1,0,1
117,32,15.9,7.0,280,1350,1600,5.6,2.8,1.0,1,0,1
118,32,18.0,8.2,298,1250,1050,5.4,2.6,0.9,1,0,1
119,32,23.0,11.3,300,482,275,7.1,3.5,0.9,1,0,1
120,32,22.7,10.2,290,322,113,6.6,2.8,0.7,1,0,1
121,58,1.7,0.8,188,60,84,5.9,3.5,1.4,0,0,1
122,64,0.8,0.2,178,17,18,6.3,3.1,0.9,1,1,0
123,28,0.6,0.1,177,36,29,6.9,4.1,1.4,0,0,1
124,60,1.8,0.5,201,45,25,3.9,1.7,0.7,0,0,1
125,48,5.8,2.5,802,133,88,6.0,2.8,0.8,1,0,1
126,64,3.0,1.4,248,46,40,6.5,3.2,0.9,1,0,1
127,58,1.7,0.8,1896,61,83,8.0,3.9,0.95,1,1,0
128,45,2.8,1.7,263,57,65,5.1,2.3,0.8,1,0,1
129,45,3.2,1.4,512,50,58,6.0,2.7,0.8,1,0,1
130,70,0.7,0.2,237,18,28,5.8,2.5,0.75,0,1,0
131,18,0.8,0.2,199,34,31,6.5,3.5,1.16,0,1,0
132,53,0.9,0.4,238,17,14,6.6,2.9,0.8,1,0,1
133,18,1.8,0.7,178,35,36,6.8,3.6,1.1,1,0,1
134,66,11.3,5.6,1110,1250,4929,7.0,2.4,0.5,1,0,1
135,46,4.7,2.2,310,62,90,6.4,2.5,0.6,1,1,0
136,18,0.8,0.2,282,72,140,5.5,2.5,0.8,1,0,1
137,18,0.8,0.2,282,72,140,5.5,2.5,0.8,1,0,1
138,15,0.8,0.2,380,25,66,6.1,3.7,1.5,1,0,1
139,60,0.6,0.1,186,20,21,6.2,3.3,1.1,0,0,1
140,66,4.2,2.1,159,15,30,7.1,2.2,0.4,1,1,0
141,30,1.6,0.4,332,84,139,5.6,2.7,0.9,1,0,1
142,30,1.6,0.4,332,84,139,5.6,2.7,0.9,1,0,1
143,45,3.5,1.5,189,63,87,5.6,2.9,1.0,1,1,0
144,65,0.8,0.2,201,18,22,5.4,2.9,1.1,0,0,1
145,66,2.9,1.3,168,21,38,5.5,1.8,0.4,1,1,0
146,65,0.7,0.1,392,20,30,5.3,2.8,1.1,1,0,1
147,50,0.9,0.2,202,20,26,7.2,4.5,1.66,1,0,1
148,60,0.8,0.2,286,21,27,7.1,4.0,1.2,1,0,1
149,56,1.1,0.5,180,30,42,6.9,3.8,1.2,0,0,1
150,50,1.6,0.8,218,18,20,5.9,2.9,0.96,1,0,1
151,46,0.8,0.2,182,20,40,6.0,2.9,0.9,1,1,0
152,52,0.6,0.1,178,26,27,6.5,3.6,1.2,0,0,1
153,34,5.9,2.5,290,45,233,5.6,2.7,0.9,1,0,1
154,34,8.7,4.0,298,58,138,5.8,2.4,0.7,1,0,1
155,32,0.9,0.3,462,70,82,6.2,3.1,1.0,1,0,1
156,72,0.7,0.1,196,20,35,5.8,2.0,0.5,1,0,1
157,72,0.7,0.1,196,20,35,5.8,2.0,0.5,1,0,1
158,50,1.2,0.4,282,36,32,7.2,3.9,1.1,1,0,1
159,60,11.0,4.9,750,140,350,5.5,2.1,0.6,1,0,1
160,60,11.5,5.0,1050,99,187,6.2,2.8,0.8,1,0,1
161,60,5.8,2.7,599,43,66,5.4,1.8,0.5,1,0,1
162,39,1.9,0.9,180,42,62,7.4,4.3,1.38,1,0,1
163,39,1.9,0.9,180,42,62,7.4,4.3,1.38,1,0,1
164,48,4.5,2.3,282,13,74,7.0,2.4,0.52,1,0,1
165,55,75.0,3.6,332,40,66,6.2,2.5,0.6,1,0,1
166,47,3.0,1.5,292,64,67,5.6,1.8,0.47,1,1,0
167,60,22.8,12.6,962,53,41,6.9,3.3,0.9,1,0,1
168,60,8.9,4.0,950,33,32,6.8,3.1,0.8,1,0,1
169,72,1.7,0.8,200,28,37,6.2,3.0,0.93,1,0,1
170,44,1.9,0.6,298,378,602,6.6,3.3,1.0,1,1,0
171,55,14.1,7.6,750,35,63,5.0,1.6,0.47,1,0,1
172,31,0.6,0.1,175,48,34,6.0,3.7,1.6,1,0,1
173,31,0.6,0.1,175,48,34,6.0,3.7,1.6,1,0,1
174,31,0.8,0.2,198,43,31,7.3,4.0,1.2,1,0,1
175,55,0.8,0.2,482,112,99,5.7,2.6,0.8,1,0,1
176,75,14.8,9.0,1020,71,42,5.3,2.2,0.7,1,0,1
177,75,10.6,5.0,562,37,29,5.1,1.8,0.5,1,0,1
178,75,8.0,4.6,386,30,25,5.5,1.8,0.48,1,0,1
179,75,2.8,1.3,250,23,29,2.7,0.9,0.5,1,0,1
180,75,2.9,1.3,218,33,37,3.0,1.5,1.0,1,0,1
181,65,1.9,0.8,170,36,43,3.8,1.4,0.58,0,0,1
182,40,0.6,0.1,171,20,17,5.4,2.5,0.8,1,0,1
183,64,1.1,0.4,201,18,19,6.9,4.1,1.4,1,0,1
184,38,1.5,0.4,298,60,103,6.0,3.0,1.0,0,0,1
185,60,3.2,1.8,750,79,145,7.8,3.2,0.69,1,0,1
186,60,2.1,1.0,191,114,247,4.0,1.6,0.6,1,0,1
187,60,1.9,0.8,614,42,38,4.5,1.8,0.6,1,0,1
188,48,0.8,0.2,218,32,28,5.2,2.5,0.9,0,1,0
189,60,6.3,3.2,314,118,114,6.6,3.7,1.27,1,0,1
190,60,5.8,3.0,257,107,104,6.6,3.5,1.12,1,0,1
191,60,2.3,0.6,272,79,51,6.6,3.5,1.1,1,0,1
192,49,1.3,0.4,206,30,25,6.0,3.1,1.06,0,0,1
193,49,2.0,0.6,209,48,32,5.7,3.0,1.1,0,0,1
194,60,2.4,1.0,1124,30,54,5.2,1.9,0.5,1,0,1
195,60,2.0,1.1,664,52,104,6.0,2.1,0.53,1,0,1
196,26,0.6,0.2,142,12,32,5.7,2.4,0.75,1,1,0
197,41,0.9,0.2,169,22,18,6.1,3.0,0.9,0,0,1
198,7,27.2,11.8,1420,790,1050,6.1,2.0,0.4,1,1,0
199,49,0.6,0.1,218,50,53,5.0,2.4,0.9,1,0,1
200,49,0.6,0.1,218,50,53,5.0,2.4,0.9,1,0,1
201,38,0.8,0.2,145,19,23,6.1,3.1,1.03,0,1,0
202,21,1.0,0.3,142,27,21,6.4,3.5,1.2,0,0,1
203,21,0.7,0.2,135,27,26,6.4,3.3,1.0,0,0,1
204,45,2.5,1.2,163,28,22,7.6,4.0,1.1,1,0,1
205,40,3.6,1.8,285,50,60,7.0,2.9,0.7,1,0,1
206,40,3.9,1.7,350,950,1500,6.7,3.8,1.3,1,0,1
207,70,0.9,0.3,220,53,95,6.1,2.8,0.68,1,1,0
209,28,0.8,0.3,190,20,14,4.1,2.4,1.4,1,0,1
210,42,2.7,1.3,219,60,180,7.0,3.2,0.8,1,0,1
211,22,2.7,1.0,160,82,127,5.5,3.1,1.2,0,0,1
212,8,0.9,0.2,401,25,58,7.5,3.4,0.8,1,1,0
213,38,1.7,1.0,180,18,34,7.2,3.6,1.0,1,0,1
214,66,0.6,0.2,100,17,148,5.0,3.3,1.9,0,0,1
215,55,0.9,0.2,116,36,16,6.2,3.2,1.0,0,0,1
216,49,1.1,0.5,159,30,31,7.0,4.3,1.5,1,0,1
217,6,0.6,0.1,289,38,30,4.8,2.0,0.7,0,0,1
218,37,0.8,0.2,125,41,39,6.4,3.4,1.1,1,0,1
219,37,0.8,0.2,147,27,46,5.0,2.5,1.0,1,0,1
220,47,0.9,0.2,192,38,24,7.3,4.3,1.4,1,0,1
221,47,0.9,0.2,265,40,28,8.0,4.0,1.0,1,0,1
222,50,1.1,0.3,175,20,19,7.1,4.5,1.7,0,0,1
223,70,1.7,0.5,400,56,44,5.7,3.1,1.1,1,0,1
224,26,0.6,0.2,120,45,51,7.9,4.0,1.0,1,0,1
225,26,1.3,0.4,173,38,62,8.0,4.0,1.0,1,0,1
226,68,0.7,0.2,186,18,15,6.4,3.8,1.4,1,1,0
227,65,1.0,0.3,202,26,13,5.3,2.6,0.9,0,1,0
228,46,0.6,0.2,290,26,21,6.0,3.0,1.0,1,0,1
229,61,1.5,0.6,196,61,85,6.7,3.8,1.3,0,0,1
230,61,0.8,0.1,282,85,231,8.5,4.3,1.0,1,0,1
231,50,2.7,1.6,157,149,156,7.9,3.1,0.6,1,0,1
232,33,2.0,1.4,2110,48,89,6.2,3.0,0.9,1,0,1
233,40,0.9,0.2,285,32,27,7.7,3.5,0.8,1,1,0
234,60,1.5,0.6,360,230,298,4.5,2.0,0.8,1,0,1
235,22,0.8,0.2,300,57,40,7.9,3.8,0.9,0,0,1
236,35,0.9,0.3,158,20,16,8.0,4.0,1.0,1,1,0
237,35,0.9,0.2,190,40,35,7.3,4.7,1.8,0,1,0
238,40,0.9,0.3,196,69,48,6.8,3.1,0.8,1,0,1
239,48,0.7,0.2,165,32,30,8.0,4.0,1.0,0,0,1
241,29,0.8,0.2,205,30,23,8.2,4.1,1.0,1,1,0
242,28,0.9,0.2,316,25,23,8.5,5.5,1.8,1,1,0
243,54,0.8,0.2,218,20,19,6.3,2.5,0.6,1,0,1
244,54,0.9,0.2,290,15,18,6.1,2.8,0.8,1,0,1
245,55,1.8,9.0,272,22,79,6.1,2.7,0.7,1,0,1
246,55,0.9,0.2,190,25,28,5.9,2.7,0.8,1,0,1
247,40,0.7,0.1,202,37,29,5.0,2.6,1.0,1,0,1
248,33,1.2,0.3,498,28,25,7.0,3.0,0.7,1,0,1
249,33,2.1,1.3,480,38,22,6.5,3.0,0.8,1,0,1
250,33,0.9,0.8,680,37,40,5.9,2.6,0.8,1,0,1
251,65,1.1,0.3,258,48,40,7.0,3.9,1.2,0,0,1
253,38,0.7,0.1,152,90,21,7.1,4.2,1.4,0,1,0
254,38,1.7,0.7,859,89,48,6.0,3.0,1.0,1,0,1
255,50,0.9,0.3,901,23,17,6.2,3.5,1.2,1,0,1
256,44,0.8,0.2,335,148,86,5.6,3.0,1.1,1,0,1
257,36,0.8,0.2,182,31,34,6.4,3.8,1.4,0,0,1
258,42,30.5,14.2,285,65,130,5.2,2.1,0.6,1,0,1
259,42,16.4,8.9,245,56,87,5.4,2.0,0.5,1,0,1
260,33,1.5,7.0,505,205,140,7.5,3.9,1.0,1,0,1
261,18,0.8,0.2,228,55,54,6.9,4.0,1.3,1,0,1
262,38,0.8,0.2,185,25,21,7.0,3.0,0.7,1,1,0
263,38,0.8,0.2,247,55,92,7.4,4.3,1.38,0,0,1
264,4,0.9,0.2,348,30,34,8.0,4.0,1.0,0,0,1
265,62,1.2,0.4,195,38,54,6.3,3.8,1.5,1,0,1
266,43,0.9,0.3,140,12,29,7.4,3.5,1.8,1,1,0
267,40,14.5,6.4,358,50,75,5.7,2.1,0.5,1,0,1
268,26,0.6,0.1,110,15,20,2.8,1.6,1.3,1,0,1
269,37,0.7,0.2,235,96,54,9.5,4.9,1.0,1,0,1
270,4,0.8,0.2,460,152,231,6.5,3.2,0.9,0,0,1
271,21,18.5,9.5,380,390,500,8.2,4.1,1.0,1,0,1
272,30,0.7,0.2,262,15,18,9.6,4.7,1.2,1,0,1
273,33,1.8,0.8,196,25,22,8.0,4.0,1.0,1,0,1
274,26,1.9,0.8,180,22,19,8.2,4.1,1.0,0,0,1
275,35,0.9,0.2,190,25,20,6.4,3.6,1.2,0,0,1
276,60,2.0,0.8,190,45,40,6.0,2.8,0.8,1,0,1
277,45,2.2,0.8,209,25,20,8.0,4.0,1.0,1,0,1
278,48,1.0,1.4,144,18,14,8.3,4.2,1.0,1,1,0
279,58,0.8,0.2,123,56,48,6.0,3.0,1.0,1,0,1
280,50,0.7,0.2,192,18,15,7.4,4.2,1.3,0,0,1
281,50,0.7,0.2,188,12,14,7.0,3.4,0.9,1,0,1
282,18,1.3,0.7,316,10,21,6.0,2.1,0.5,0,0,1
283,18,0.9,0.3,300,30,48,8.0,4.0,1.0,1,0,1
284,13,1.5,0.5,575,29,24,7.9,3.9,0.9,1,0,1
285,34,0.8,0.2,192,15,12,8.6,4.7,1.2,1,1,0
286,43,1.3,0.6,155,15,20,8.0,4.0,1.0,0,0,1
287,50,1.0,0.5,239,16,39,7.5,3.7,0.9,1,1,0
288,57,4.5,2.3,315,120,105,7.0,4.0,1.3,1,0,1
289,45,1.0,0.3,250,48,44,8.6,4.3,1.0,1,1,0
290,60,0.7,0.2,174,32,14,7.8,4.2,1.1,0,0,1
291,45,0.6,0.2,245,22,24,7.1,3.4,0.9,1,0,1
292,23,1.1,0.5,191,37,41,7.7,4.3,1.2,0,0,1
293,22,2.4,1.0,340,25,21,8.3,4.5,1.1,1,0,1
294,22,0.6,0.2,202,78,41,8.0,3.9,0.9,1,0,1
295,74,0.9,0.3,234,16,19,7.9,4.0,1.0,1,1,0
296,25,0.9,0.3,159,24,25,6.9,4.4,1.7,0,1,0
297,31,1.1,0.3,190,26,15,7.9,3.8,0.9,1,1,0
298,24,0.9,0.2,195,40,35,7.4,4.1,1.2,0,1,0
299,58,0.8,0.2,180,32,25,8.2,4.4,1.1,0,0,1
300,51,0.9,0.2,280,21,30,6.7,3.2,0.8,1,1,0
301,50,1.7,0.6,430,28,32,6.8,3.5,1.0,1,1,0
302,50,0.7,0.2,206,18,17,8.4,4.2,1.0,0,0,1
303,55,0.8,0.2,155,21,17,6.9,3.8,1.4,1,1,0
304,54,1.4,0.7,195,36,16,7.9,3.7,0.9,0,1,0
305,48,1.6,1.0,588,74,113,7.3,2.4,0.4,1,0,1
306,30,0.8,0.2,174,21,47,4.6,2.3,1.0,1,0,1
307,45,0.8,0.2,165,22,18,8.2,4.1,1.0,1,1,0
308,48,1.1,0.7,527,178,250,8.0,4.2,1.1,1,1,0
309,51,0.8,0.2,175,48,22,8.1,4.6,1.3,1,0,1
310,54,23.2,12.6,574,43,47,7.2,3.5,0.9,1,1,0
312,30,0.8,0.2,158,25,22,7.9,4.5,1.3,0,1,0
313,26,2.0,0.9,195,24,65,7.8,4.3,1.2,1,0,1
314,22,0.9,0.3,179,18,21,6.7,3.7,1.2,0,0,1
315,44,0.9,0.2,182,29,82,7.1,3.7,1.0,0,0,1
316,35,0.7,0.2,198,42,30,6.8,3.4,1.0,1,0,1
317,38,3.7,2.2,216,179,232,7.8,4.5,1.3,1,0,1
318,14,0.9,0.3,310,21,16,8.1,4.2,1.0,0,0,1
319,30,0.7,0.2,63,31,27,5.8,3.4,1.4,1,1,0
320,30,0.8,0.2,198,30,58,5.2,2.8,1.1,1,1,0
321,36,1.7,0.5,205,36,34,7.1,3.9,1.2,1,0,1
322,12,0.8,0.2,302,47,67,6.7,3.5,1.1,0,0,1
323,60,2.6,1.2,171,42,37,5.4,2.7,1.0,1,0,1
324,42,0.8,0.2,158,27,23,6.7,3.1,0.8,0,0,1
325,36,1.2,0.4,358,160,90,8.3,4.4,1.1,0,1,0
326,24,3.3,1.6,174,11,33,7.6,3.9,1.0,0,0,1
327,43,0.8,0.2,192,29,20,6.0,2.9,0.9,0,0,1
328,21,0.7,0.2,211,14,23,7.3,4.1,1.2,0,0,1
329,26,2.0,0.9,157,54,68,6.1,2.7,0.8,1,0,1
330,26,1.7,0.6,210,62,56,5.4,2.2,0.6,1,0,1
331,26,7.1,3.3,258,80,113,6.2,2.9,0.8,1,0,1
332,36,0.7,0.2,152,21,25,5.9,3.1,1.1,0,1,0
333,13,0.7,0.2,350,17,24,7.4,4.0,1.1,1,1,0
334,13,0.7,0.1,182,24,19,8.9,4.9,1.2,1,1,0
335,75,6.7,3.6,458,198,143,6.2,3.2,1.0,1,0,1
336,75,2.5,1.2,375,85,68,6.4,2.9,0.8,1,0,1
337,75,1.8,0.8,405,79,50,6.1,2.9,0.9,1,0,1
338,75,1.4,0.4,215,50,30,5.9,2.6,0.7,1,0,1
339,75,0.9,0.2,206,44,33,6.2,2.9,0.8,1,0,1
340,36,0.8,0.2,650,70,138,6.6,3.1,0.8,1,1,0
341,35,0.8,0.2,198,36,32,7.0,4.0,1.3,0,0,1
342,70,3.1,1.6,198,40,28,5.6,2.0,0.5,1,0,1
343,37,0.8,0.2,195,60,40,8.2,5.0,1.5,0,0,1
344,60,2.9,1.3,230,32,44,5.6,2.0,0.5,1,0,1
345,46,0.6,0.2,115,14,11,6.9,3.4,0.9,1,0,1
346,38,0.7,0.2,216,349,105,7.0,3.5,1.0,1,0,1
347,70,1.3,0.4,358,19,14,6.1,2.8,0.8,1,0,1
348,49,0.8,0.2,158,19,15,6.6,3.6,1.2,0,1,0
349,37,1.8,0.8,145,62,58,5.7,2.9,1.0,1,0,1
350,37,1.3,0.4,195,41,38,5.3,2.1,0.6,1,0,1
351,26,0.7,0.2,144,36,33,8.2,4.3,1.1,1,1,0
352,48,1.4,0.8,621,110,176,7.2,3.9,1.1,1,1,0
353,48,0.8,0.2,150,25,23,7.5,3.9,1.0,1,1,0
354,19,1.4,0.8,178,13,26,8.0,4.6,1.3,0,0,1
355,33,0.7,0.2,256,21,30,8.5,3.9,0.8,1,0,1
356,33,2.1,0.7,205,50,38,6.8,3.0,0.7,1,0,1
357,37,0.7,0.2,176,28,34,5.6,2.6,0.8,1,0,1
358,69,0.8,0.2,146,42,70,8.4,4.9,1.4,0,1,0
359,24,0.7,0.2,218,47,26,6.6,3.3,1.0,1,0,1
360,65,0.7,0.2,182,23,28,6.8,2.9,0.7,0,1,0
361,55,1.1,0.3,215,21,15,6.2,2.9,0.8,0,0,1
362,42,0.9,0.2,165,26,29,8.5,4.4,1.0,0,1,0
363,21,0.8,0.2,183,33,57,6.8,3.5,1.0,0,0,1
364,40,0.7,0.2,176,28,43,5.3,2.4,0.8,0,0,1
365,16,0.7,0.2,418,28,35,7.2,4.1,1.3,0,0,1
366,60,2.2,1.0,271,45,52,6.1,2.9,0.9,0,0,1
367,42,0.8,0.2,182,22,20,7.2,3.9,1.1,1,1,0
368,58,0.8,0.2,130,24,25,7.0,4.0,1.3,1,1,0
369,54,22.6,11.4,558,30,37,7.8,3.4,0.8,1,1,0
370,33,0.8,0.2,135,30,29,7.2,4.4,1.5,0,0,1
371,48,0.7,0.2,326,29,17,8.7,5.5,1.7,1,0,1
372,25,0.7,0.1,140,32,25,7.6,4.3,1.3,0,1,0
373,56,0.7,0.1,145,26,23,7.0,4.0,1.3,0,1,0
374,47,3.5,1.6,206,32,31,6.8,3.4,1.0,1,0,1
375,33,0.7,0.1,168,35,33,7.0,3.7,1.1,1,0,1
376,20,0.6,0.2,202,12,13,6.1,3.0,0.9,0,1,0
377,50,0.7,0.1,192,20,41,7.3,3.3,0.8,1,1,0
378,72,0.7,0.2,185,16,22,7.3,3.7,1.0,0,0,1
379,50,1.7,0.8,331,36,53,7.3,3.4,0.9,1,0,1
380,39,0.6,0.2,188,28,43,8.1,3.3,0.6,1,0,1
381,58,0.7,0.1,172,27,22,6.7,3.2,0.9,1,1,0
382,60,1.4,0.7,159,10,12,4.9,2.5,1.0,0,1,0
383,34,3.7,2.1,490,115,91,6.5,2.8,0.7,1,0,1
384,50,0.8,0.2,152,29,30,7.4,4.1,1.3,1,0,1
385,38,2.7,1.4,105,25,21,7.5,4.2,1.2,0,0,1
386,51,0.8,0.2,160,34,20,6.9,3.7,1.1,1,0,1
387,46,0.8,0.2,160,31,40,7.3,3.8,1.1,1,0,1
388,72,0.6,0.1,102,31,35,6.3,3.2,1.0,1,0,1
389,72,0.8,0.2,148,23,35,6.0,3.0,1.0,1,0,1
390,75,0.9,0.2,162,25,20,6.9,3.7,1.1,1,0,1
391,41,7.5,4.3,149,94,92,6.3,3.1,0.9,1,0,1
392,41,2.7,1.3,580,142,68,8.0,4.0,1.0,1,0,1
393,48,1.0,0.3,310,37,56,5.9,2.5,0.7,1,1,0
394,45,0.8,0.2,140,24,20,6.3,3.2,1.0,0,0,1
395,74,1.0,0.3,175,30,32,6.4,3.4,1.1,1,0,1
396,78,1.0,0.3,152,28,70,6.3,3.1,0.9,1,0,1
397,38,0.8,0.2,208,25,50,7.1,3.7,1.0,1,0,1
398,27,1.0,0.2,205,137,145,6.0,3.0,1.0,1,0,1
399,66,0.7,0.2,162,24,20,6.4,3.2,1.0,0,1,0
400,50,7.3,3.7,92,44,236,6.8,1.6,0.3,1,0,1
401,42,0.5,0.1,162,155,108,8.1,4.0,0.9,1,1,0
402,65,0.7,0.2,199,19,22,6.3,3.6,1.3,0,0,1
403,22,0.8,0.2,198,20,26,6.8,3.9,1.3,1,0,1
404,31,0.8,0.2,215,15,21,7.6,4.0,1.1,1,1,0
405,45,0.7,0.2,180,18,58,6.7,3.7,1.2,0,0,1
406,12,1.0,0.2,719,157,108,7.2,3.7,1.0,1,0,1
407,48,2.4,1.1,554,141,73,7.5,3.6,0.9,1,0,1
408,48,5.0,2.6,555,284,190,6.5,3.3,1.0,1,0,1
409,18,1.4,0.6,215,440,850,5.0,1.9,0.6,1,0,1
410,23,2.3,0.8,509,28,44,6.9,2.9,0.7,0,1,0
411,65,4.9,2.7,190,33,71,7.1,2.9,0.7,1,0,1
412,48,0.7,0.2,208,15,30,4.6,2.1,0.8,0,0,1
413,65,1.4,0.6,260,28,24,5.2,2.2,0.7,0,0,1
414,70,1.3,0.3,690,93,40,3.6,2.7,0.7,1,0,1
415,70,0.6,0.1,862,76,180,6.3,2.7,0.75,1,0,1
416,11,0.7,0.1,592,26,29,7.1,4.2,1.4,0,0,1
417,50,4.2,2.3,450,69,50,7.0,3.0,0.7,1,0,1
418,55,8.2,3.9,1350,52,65,6.7,2.9,0.7,1,1,0
419,55,10.9,5.1,1350,48,57,6.4,2.3,0.5,1,1,0
420,26,1.0,0.3,163,48,71,7.1,3.7,1.0,0,0,1
421,41,1.2,0.5,246,34,42,6.9,3.4,0.97,1,0,1
422,53,1.6,0.9,178,44,59,6.5,3.9,1.5,0,0,1
423,32,0.7,0.1,240,12,15,7.0,3.0,0.7,1,1,0
424,58,0.4,0.1,100,59,126,4.3,2.5,1.4,1,0,1
425,45,1.3,0.6,166,49,42,5.6,2.5,0.8,0,0,1
426,65,0.9,0.2,170,33,66,7.0,3.0,0.75,1,0,1
427,52,0.6,0.1,194,10,12,6.9,3.3,0.9,0,1,0
428,73,1.9,0.7,1750,102,141,5.5,2.0,0.5,1,0,1
429,53,0.7,0.1,182,20,33,4.8,1.9,0.6,1,1,0
430,47,0.8,0.2,236,10,13,6.7,2.9,0.76,0,1,0
431,29,0.7,0.2,165,55,87,7.5,4.6,1.58,1,0,1
432,41,0.9,0.2,201,31,24,7.6,3.8,1.0,0,1,0
433,30,0.7,0.2,194,32,36,7.5,3.6,0.92,0,1,0
434,17,0.5,0.1,206,28,21,7.1,4.5,1.7,0,1,0
435,23,1.0,0.3,212,41,80,6.2,3.1,1.0,1,0,1
436,35,1.6,0.7,157,15,44,5.2,2.5,0.9,1,0,1
437,65,0.8,0.2,162,30,90,3.8,1.4,0.5,1,0,1
438,42,0.8,0.2,168,25,18,6.2,3.1,1.0,1,1,0
439,49,0.8,0.2,198,23,20,7.0,4.3,1.5,1,1,0
440,42,2.3,1.1,292,29,39,4.1,1.8,0.7,1,1,0
441,42,7.4,3.6,298,52,102,4.6,1.9,0.7,1,1,0
442,42,0.7,0.2,152,35,81,6.2,3.2,1.06,1,1,0
443,61,0.8,0.2,163,18,19,6.3,2.8,0.8,0,0,1
444,17,0.9,0.2,279,40,46,7.3,4.0,1.2,0,0,1
445,54,0.8,0.2,181,35,20,5.5,2.7,0.96,1,0,1
446,45,23.3,12.8,1550,425,511,7.7,3.5,0.8,1,1,0
447,48,0.8,0.2,142,26,25,6.0,2.6,0.7,1,1,0
448,48,0.9,0.2,173,26,27,6.2,3.1,1.0,1,1,0
449,65,7.9,4.3,282,50,72,6.0,3.0,1.0,1,0,1
450,35,0.8,0.2,279,20,25,7.2,3.2,0.8,1,0,1
451,58,0.9,0.2,1100,25,36,7.1,3.5,0.9,1,0,1
452,46,0.7,0.2,224,40,23,7.1,3.0,0.7,1,0,1
453,28,0.6,0.2,159,15,16,7.0,3.5,1.0,0,0,1
454,21,0.6,0.1,186,25,22,6.8,3.4,1.0,1,1,0
455,32,0.7,0.2,189,22,43,7.4,3.1,0.7,0,0,1
456,61,0.8,0.2,192,28,35,6.9,3.4,0.9,0,0,1
457,26,6.8,3.2,140,37,19,3.6,0.9,0.3,1,0,1
458,65,1.1,0.5,686,16,46,5.7,1.5,0.35,1,0,1
459,22,2.2,1.0,215,159,51,5.5,2.5,0.8,1,1,0
460,28,0.8,0.2,309,55,23,6.8,4.1,1.51,1,1,0
461,38,0.7,0.2,110,22,18,6.4,2.5,0.64,1,0,1
462,25,0.8,0.1,130,23,42,8.0,4.0,1.0,1,0,1
463,45,0.7,0.2,164,21,53,4.5,1.4,0.45,0,1,0
464,45,0.6,0.1,270,23,42,5.1,2.0,0.5,0,1,0
465,28,0.6,0.1,137,22,16,4.9,1.9,0.6,0,1,0
466,28,1.0,0.3,90,18,108,6.8,3.1,0.8,0,1,0
467,66,1.0,0.3,190,30,54,5.3,2.1,0.6,1,0,1
468,66,0.8,0.2,165,22,32,4.4,2.0,0.8,1,0,1
469,66,1.1,0.5,167,13,56,7.1,4.1,1.36,1,0,1
470,49,0.6,0.1,185,17,26,6.6,2.9,0.7,0,1,0
471,42,0.7,0.2,197,64,33,5.8,2.4,0.7,0,0,1
472,42,1.0,0.3,154,38,21,6.8,3.9,1.3,0,0,1
473,35,2.0,1.1,226,33,135,6.0,2.7,0.8,0,0,1
474,38,2.2,1.0,310,119,42,7.9,4.1,1.0,0,0,1
475,38,0.9,0.3,310,15,25,5.5,2.7,1.0,1,0,1
476,55,0.6,0.2,220,24,32,5.1,2.4,0.88,1,0,1
477,33,7.1,3.7,196,622,497,6.9,3.6,1.09,1,0,1
478,33,3.4,1.6,186,779,844,7.3,3.2,0.7,1,0,1
479,7,0.5,0.1,352,28,51,7.9,4.2,1.1,0,0,1
480,45,2.3,1.3,282,132,368,7.3,4.0,1.2,1,0,1
481,45,1.1,0.4,92,91,188,7.2,3.8,1.11,1,0,1
482,30,0.8,0.2,182,46,57,7.8,4.3,1.2,0,0,1
483,62,5.0,2.1,103,18,40,5.0,2.1,1.72,1,0,1
484,22,6.7,3.2,850,154,248,6.2,2.8,0.8,1,1,0
485,42,0.8,0.2,195,18,15,6.7,3.0,0.8,1,1,0
486,32,0.7,0.2,276,102,190,6.0,2.9,0.93,1,0,1
487,60,0.7,0.2,171,31,26,7.0,3.5,1.0,0,0,1
488,65,0.8,0.1,146,17,29,5.9,3.2,1.18,0,0,1
489,53,0.8,0.2,193,96,57,6.7,3.6,1.16,1,1,0
490,27,1.0,0.3,180,56,111,6.8,3.9,1.85,0,0,1
491,35,1.0,0.3,805,133,103,7.9,3.3,0.7,1,1,0
492,65,0.7,0.2,265,30,28,5.2,1.8,0.52,0,0,1
493,25,0.7,0.2,185,196,401,6.5,3.9,1.5,1,0,1
494,32,0.7,0.2,165,31,29,6.1,3.0,0.96,0,0,1
495,24,1.0,0.2,189,52,31,8.0,4.8,1.5,1,0,1
496,67,2.2,1.1,198,42,39,7.2,3.0,0.7,1,0,1
497,68,1.8,0.5,151,18,22,6.5,4.0,1.6,1,0,1
498,55,3.6,1.6,349,40,70,7.2,2.9,0.6,1,0,1
499,70,2.7,1.2,365,62,55,6.0,2.4,0.6,1,0,1
500,36,2.8,1.5,305,28,76,5.9,2.5,0.7,1,0,1
501,42,0.8,0.2,127,29,30,4.9,2.7,1.2,1,0,1
502,53,19.8,10.4,238,39,221,8.1,2.5,0.4,1,0,1
503,32,30.5,17.1,218,39,79,5.5,2.7,0.9,1,0,1
504,32,32.6,14.1,219,95,235,5.8,3.1,1.1,1,0,1
505,56,17.7,8.8,239,43,185,5.6,2.4,0.7,1,0,1
506,50,0.9,0.3,194,190,73,7.5,3.9,1.0,1,0,1
507,46,18.4,8.5,450,119,230,7.5,3.3,0.7,1,0,1
508,46,20.0,10.0,254,140,540,5.4,3.0,1.2,1,0,1
509,37,0.8,0.2,205,31,36,9.2,4.6,1.0,0,1,0
510,45,2.2,1.6,320,37,48,6.8,3.4,1.0,1,0,1
511,56,1.0,0.3,195,22,28,5.8,2.6,0.8,0,0,1
512,69,0.9,0.2,215,32,24,6.9,3.0,0.7,1,0,1
513,49,1.0,0.3,230,48,58,8.4,4.2,1.0,1,0,1
514,49,3.9,2.1,189,65,181,6.9,3.0,0.7,1,0,1
515,60,0.9,0.3,168,16,24,6.7,3.0,0.8,1,0,1
516,28,0.9,0.2,215,50,28,8.0,4.0,1.0,1,0,1
517,45,2.9,1.4,210,74,68,7.2,3.6,1.0,1,0,1
518,35,26.3,12.1,108,168,630,9.2,2.0,0.3,1,0,1
519,62,1.8,0.9,224,69,155,8.6,4.0,0.8,1,0,1
520,55,4.4,2.9,230,14,25,7.1,2.1,0.4,1,0,1
521,46,0.8,0.2,185,24,15,7.9,3.7,0.8,1,1,0
522,50,0.6,0.2,137,15,16,4.8,2.6,1.1,1,0,1
523,29,0.8,0.2,156,12,15,6.8,3.7,1.1,0,0,1
524,53,0.9,0.2,210,35,32,8.0,3.9,0.9,0,1,0
525,46,9.4,5.2,268,21,63,6.4,2.8,0.8,1,0,1
526,40,3.5,1.6,298,68,200,7.1,3.4,0.9,1,0,1
527,45,1.7,0.8,315,12,38,6.3,2.1,0.5,1,0,1
528,55,3.3,1.5,214,54,152,5.1,1.8,0.5,1,0,1
529,22,1.1,0.3,138,14,21,7.0,3.8,1.1,0,1,0
530,40,30.8,18.3,285,110,186,7.9,2.7,0.5,1,0,1
531,62,0.7,0.2,162,12,17,8.2,3.2,0.6,0,0,1
532,46,1.4,0.4,298,509,623,3.6,1.0,0.3,1,1,0
533,39,1.6,0.8,230,88,74,8.0,4.0,1.0,0,0,1
534,60,19.6,9.5,466,46,52,6.1,2.0,0.4,1,0,1
535,46,15.8,7.2,227,67,220,6.9,2.6,0.6,1,0,1
536,10,0.8,0.1,395,25,75,7.6,3.6,0.9,1,1,0
537,52,1.8,0.8,97,85,78,6.4,2.7,0.7,1,0,1
538,65,0.7,0.2,406,24,45,7.2,3.5,0.9,0,1,0
539,42,0.8,0.2,114,21,23,7.0,3.0,0.7,0,0,1
540,42,0.8,0.2,198,29,19,6.6,3.0,0.8,0,0,1
541,62,0.7,0.2,173,46,47,7.3,4.1,1.2,0,0,1
542,40,1.2,0.6,204,23,27,7.6,4.0,1.1,1,0,1
543,54,5.5,3.2,350,67,42,7.0,3.2,0.8,1,1,0
544,45,0.7,0.2,153,41,42,4.5,2.2,0.9,0,1,0
545,45,20.2,11.7,188,47,32,5.4,2.3,0.7,1,0,1
546,50,27.7,10.8,380,39,348,7.1,2.3,0.4,1,1,0
547,42,11.1,6.1,214,60,186,6.9,2.8,2.8,1,0,1
548,40,2.1,1.0,768,74,141,7.8,4.9,1.6,1,1,0
549,46,3.3,1.5,172,25,41,5.6,2.4,0.7,1,0,1
550,29,1.2,0.4,160,20,22,6.2,3.0,0.9,0,0,1
551,45,0.6,0.1,196,29,30,5.8,2.9,1.0,1,0,1
552,46,10.2,4.2,232,58,140,7.0,2.7,0.6,1,0,1
553,73,1.8,0.9,220,20,43,6.5,3.0,0.8,1,0,1
554,55,0.8,0.2,290,139,87,7.0,3.0,0.7,1,0,1
555,51,0.7,0.1,180,25,27,6.1,3.1,1.0,1,0,1
556,51,2.9,1.2,189,80,125,6.2,3.1,1.0,1,0,1
557,51,4.0,2.5,275,382,330,7.5,4.0,1.1,1,0,1
558,26,42.8,19.7,390,75,138,7.5,2.6,0.5,1,0,1
559,66,15.2,7.7,356,321,562,6.5,2.2,0.4,1,0,1
560,66,16.6,7.6,315,233,384,6.9,2.0,0.4,1,0,1
561,66,17.3,8.5,388,173,367,7.8,2.6,0.5,1,0,1
562,64,1.4,0.5,298,31,83,7.2,2.6,0.5,1,0,1
563,38,0.6,0.1,165,22,34,5.9,2.9,0.9,0,1,0
564,43,22.5,11.8,143,22,143,6.6,2.1,0.46,1,0,1
565,50,1.0,0.3,191,22,31,7.8,4.0,1.0,0,1,0
566,52,2.7,1.4,251,20,40,6.0,1.7,0.39,1,0,1
567,20,16.7,8.4,200,91,101,6.9,3.5,1.02,1,1,0
568,16,7.7,4.1,268,213,168,7.1,4.0,1.2,1,0,1
569,16,2.6,1.2,236,131,90,5.4,2.6,0.9,1,0,1
570,90,1.1,0.3,215,46,134,6.9,3.0,0.7,1,0,1
571,32,15.6,9.5,134,54,125,5.6,4.0,2.5,1,0,1
572,32,3.7,1.6,612,50,88,6.2,1.9,0.4,1,0,1
573,32,12.1,6.0,515,48,92,6.6,2.4,0.5,1,0,1
574,32,25.0,13.7,560,41,88,7.9,2.5,2.5,1,0,1
575,32,15.0,8.2,289,58,80,5.3,2.2,0.7,1,0,1
576,32,12.7,8.4,190,28,47,5.4,2.6,0.9,1,0,1
577,60,0.5,0.1,500,20,34,5.9,1.6,0.37,0,0,1
578,40,0.6,0.1,98,35,31,6.0,3.2,1.1,1,0,1
579,52,0.8,0.2,245,48,49,6.4,3.2,1.0,1,0,1
580,31,1.3,0.5,184,29,32,6.8,3.4,1.0,1,0,1
581,38,1.0,0.3,216,21,24,7.3,4.4,1.5,0,0,1
