Acc,Arg
0.9435384615384615,"{'activation': 'relu', 'max_iter': 2000, 'solver': 'adam'}"
0.9410769230769231,"{'activation': 'identity', 'max_iter': 2000, 'solver': 'adam'}"
0.9404615384615385,"{'activation': 'logistic', 'max_iter': 2000, 'solver': 'adam'}"