00:02:46,984 --> 00:02:50,384
00:20:13,984 --> 00:20:17,084
00:28:36,884 --> 00:28:39,284
00:30:01,884 --> 00:30:05,984
00:33:17,184 --> 00:33:19,984
00:37:12,484 --> 00:37:14,284
00:37:14,484 --> 00:37:17,584
00:47:04,084 --> 00:47:05,284
00:54:43,484 --> 00:54:44,584
00:56:17,941 --> 00:56:19,541
00:56:19,641 --> 00:56:21,541
00:56:24,941 --> 00:56:27,641
00:58:27,041 --> 00:58:29,341
00:58:39,241 --> 00:58:41,441
00:59:51,241 --> 00:59:54,841
01:07:44,841 --> 01:07:46,841
01:07:55,241 --> 01:07:57,841
01:08:03,741 --> 01:08:06,441
01:08:13,241 --> 01:08:16,441
01:13:25,241 --> 01:13:26,841
01:13:32,941 --> 01:13:35,741
01:17:23,841 --> 01:17:26,441
01:17:40,941 --> 01:17:43,041
01:19:54,241 --> 01:19:56,041
01:22:43,141 --> 01:22:45,341
01:23:02,341 --> 01:23:05,741
01:25:30,441 --> 01:25:33,541
01:27:18,141 --> 01:27:22,741
01:29:09,041 --> 01:29:10,041
01:35:05,841 --> 01:35:08,241
01:41:10,741 --> 01:41:13,141