
/(data-type="1" data-item-id="\d+" class="gallery-item">)/gm
data-type="1" data-item-id="3696164" class="gallery-item">

/id="\d+/g

/\id+/

//get the name
/memes/detail/3696164

/(memes\/detail\/3696164\/.*>)/g