PCBNEW-LibModule-V1
$INDEX

$EndINDEX
#
# 
# pixmap w = 413, h = 413
#
$MODULE 
Po 0 0 0 15 00000000 00000000 ~~
Li 
T0 0 0 450 450 0 70 N I 21 "VAL"
T1 0 0 450 450 0 70 N I 21 ""
DP 0 0 0 0 112 1 21
Dl -160 534
Dl -160 553
Dl -161 566
Dl -162 576
Dl -163 584
Dl -166 591
Dl -168 594
Dl -177 607
Dl -188 615
Dl -193 617
Dl -198 619
Dl -204 620
Dl -213 621
Dl -224 621
Dl -240 622
Dl -260 622
Dl -286 622
Dl -293 622
Dl -325 623
Dl -351 622
Dl -370 622
Dl -385 621
Dl -396 620
Dl -400 619
Dl -420 611
Dl -434 599
Dl -443 585
Dl -446 579
Dl -447 573
Dl -449 565
Dl -449 555
Dl -450 541
Dl -450 522
Dl -450 510
Dl -450 485
Dl -449 466
Dl -448 451
Dl -445 440
Dl -442 431
Dl -437 423
Dl -431 416
Dl -425 410
Dl -418 405
Dl -409 402
Dl -399 399
Dl -385 397
Dl -367 396
Dl -345 395
Dl -317 395
Dl -302 395
Dl -272 395
Dl -248 396
Dl -229 396
Dl -214 398
Dl -202 400
Dl -193 403
Dl -186 407
Dl -180 412
Dl -176 416
Dl -168 427
Dl -163 443
Dl -160 461
Dl -160 466
Dl -160 477
Dl -194 477
Dl -229 477
Dl -232 467
Dl -235 461
Dl -240 456
Dl -248 453
Dl -259 451
Dl -275 450
Dl -296 450
Dl -299 450
Dl -325 451
Dl -344 452
Dl -358 454
Dl -368 458
Dl -373 462
Dl -373 463
Dl -376 472
Dl -378 486
Dl -379 502
Dl -379 519
Dl -378 529
Dl -376 543
Dl -373 553
Dl -368 559
Dl -365 562
Dl -362 564
Dl -357 565
Dl -350 566
Dl -340 567
Dl -326 567
Dl -306 566
Dl -300 566
Dl -280 566
Dl -262 565
Dl -249 564
Dl -240 563
Dl -237 562
Dl -234 556
Dl -232 549
Dl -229 540
Dl -273 540
Dl -317 540
Dl -316 516
Dl -315 492
Dl -238 491
Dl -160 490
Dl -160 534
Dl -160 534
DP 0 0 0 0 134 1 21
Dl 455 553
Dl 454 574
Dl 452 589
Dl 447 599
Dl 439 608
Dl 428 614
Dl 427 615
Dl 422 617
Dl 417 618
Dl 411 620
Dl 403 621
Dl 392 621
Dl 378 622
Dl 359 622
Dl 334 622
Dl 318 622
Dl 289 623
Dl 265 623
Dl 247 622
Dl 233 622
Dl 222 621
Dl 214 620
Dl 210 618
Dl 199 614
Dl 190 608
Dl 188 606
Dl 181 595
Dl 176 580
Dl 173 563
Dl 173 559
Dl 173 547
Dl 210 547
Dl 226 547
Dl 237 547
Dl 243 548
Dl 246 550
Dl 247 552
Dl 247 554
Dl 247 560
Dl 249 564
Dl 253 566
Dl 260 568
Dl 271 569
Dl 286 570
Dl 307 570
Dl 315 570
Dl 338 570
Dl 355 570
Dl 368 569
Dl 376 567
Dl 380 565
Dl 383 561
Dl 383 556
Dl 383 555
Dl 383 550
Dl 382 546
Dl 379 543
Dl 373 540
Dl 364 539
Dl 350 538
Dl 332 537
Dl 309 536
Dl 280 535
Dl 257 534
Dl 239 533
Dl 225 532
Dl 215 530
Dl 207 528
Dl 200 525
Dl 197 523
Dl 188 516
Dl 181 508
Dl 177 498
Dl 175 483
Dl 175 467
Dl 176 449
Dl 178 434
Dl 183 422
Dl 191 412
Dl 202 405
Dl 217 400
Dl 237 397
Dl 262 395
Dl 293 394
Dl 313 393
Dl 334 394
Dl 354 394
Dl 372 395
Dl 385 396
Dl 391 397
Dl 413 402
Dl 429 410
Dl 440 422
Dl 445 438
Dl 447 453
Dl 447 470
Dl 412 470
Dl 396 470
Dl 386 470
Dl 380 469
Dl 378 467
Dl 376 464
Dl 376 463
Dl 374 457
Dl 370 453
Dl 362 450
Dl 349 448
Dl 332 447
Dl 311 447
Dl 289 447
Dl 272 448
Dl 260 449
Dl 253 452
Dl 249 455
Dl 247 460
Dl 247 463
Dl 247 469
Dl 250 473
Dl 255 476
Dl 264 478
Dl 277 479
Dl 294 480
Dl 318 480
Dl 352 481
Dl 380 482
Dl 403 484
Dl 420 488
Dl 434 494
Dl 443 502
Dl 450 513
Dl 453 526
Dl 455 542
Dl 455 553
Dl 455 553
DP 0 0 0 0 55 1 21
Dl 143 469
Dl 143 486
Dl 141 508
Dl 138 525
Dl 134 538
Dl 126 548
Dl 116 556
Dl 102 565
Dl 70 565
Dl 70 481
Dl 70 470
Dl 67 464
Dl 64 460
Dl 58 459
Dl 47 458
Dl 31 457
Dl 12 457
Dl 2 457
Dl -53 457
Dl -53 482
Dl -53 507
Dl 4 507
Dl 28 507
Dl 46 506
Dl 58 505
Dl 65 504
Dl 66 503
Dl 68 497
Dl 70 488
Dl 70 481
Dl 70 565
Dl 24 566
Dl -53 567
Dl -53 594
Dl -53 620
Dl -88 620
Dl -123 620
Dl -123 508
Dl -123 397
Dl -21 397
Dl 11 397
Dl 37 397
Dl 58 398
Dl 74 398
Dl 87 400
Dl 97 402
Dl 105 404
Dl 112 407
Dl 118 411
Dl 120 413
Dl 130 422
Dl 137 434
Dl 141 450
Dl 143 469
Dl 143 469
DP 0 0 0 0 127 1 21
Dl -275 47
Dl -276 53
Dl -277 61
Dl -279 70
Dl -283 81
Dl -289 95
Dl -297 114
Dl -307 138
Dl -308 142
Dl -318 165
Dl -327 187
Dl -335 206
Dl -335 42
Dl -339 39
Dl -348 35
Dl -360 29
Dl -375 22
Dl -392 14
Dl -409 7
Dl -425 1
Dl -439 -4
Dl -450 -7
Dl -456 -9
Dl -457 -8
Dl -461 -4
Dl -466 4
Dl -467 6
Dl -470 12
Dl -475 24
Dl -482 40
Dl -490 59
Dl -499 80
Dl -508 102
Dl -520 130
Dl -529 152
Dl -535 168
Dl -539 180
Dl -541 188
Dl -541 192
Dl -541 192
Dl -537 195
Dl -528 200
Dl -516 206
Dl -501 213
Dl -484 220
Dl -468 227
Dl -452 234
Dl -439 239
Dl -430 242
Dl -426 243
Dl -420 241
Dl -415 236
Dl -412 230
Dl -407 218
Dl -400 203
Dl -392 185
Dl -383 166
Dl -375 144
Dl -366 123
Dl -357 102
Dl -350 83
Dl -344 67
Dl -339 54
Dl -336 46
Dl -335 42
Dl -335 206
Dl -336 208
Dl -344 226
Dl -350 240
Dl -352 246
Dl -364 268
Dl -377 284
Dl -392 295
Dl -403 300
Dl -416 302
Dl -430 303
Dl -442 302
Dl -447 301
Dl -451 299
Dl -461 295
Dl -475 289
Dl -491 282
Dl -510 275
Dl -510 274
Dl -534 264
Dl -552 256
Dl -566 248
Dl -575 242
Dl -581 238
Dl -593 222
Dl -600 204
Dl -603 185
Dl -602 179
Dl -600 172
Dl -596 160
Dl -590 144
Dl -583 125
Dl -573 102
Dl -563 78
Dl -557 63
Dl -545 35
Dl -535 12
Dl -527 -6
Dl -521 -20
Dl -515 -30
Dl -511 -38
Dl -507 -44
Dl -503 -48
Dl -500 -50
Dl -484 -62
Dl -465 -68
Dl -446 -69
Dl -444 -69
Dl -436 -67
Dl -423 -63
Dl -406 -57
Dl -388 -49
Dl -368 -41
Dl -349 -32
Dl -331 -24
Dl -316 -17
Dl -306 -12
Dl -301 -9
Dl -287 7
Dl -278 26
Dl -275 47
Dl -275 47
DP 0 0 0 0 39 1 21
Dl 487 140
Dl 486 160
Dl 483 177
Dl 477 200
Dl 466 223
Dl 453 245
Dl 439 264
Dl 435 268
Dl 421 280
Dl 410 286
Dl 401 286
Dl 392 281
Dl 392 281
Dl 387 270
Dl 387 259
Dl 393 249
Dl 397 246
Dl 408 235
Dl 420 219
Dl 430 200
Dl 437 183
Dl 440 171
Dl 442 160
Dl 443 148
Dl 442 132
Dl 442 131
Dl 442 116
Dl 442 106
Dl 443 100
Dl 445 95
Dl 447 93
Dl 457 87
Dl 467 87
Dl 476 93
Dl 482 103
Dl 483 106
Dl 486 121
Dl 487 140
Dl 487 140
DP 0 0 0 0 39 1 21
Dl 343 52
Dl 341 71
Dl 340 77
Dl 333 111
Dl 321 144
Dl 306 175
Dl 288 203
Dl 268 227
Dl 249 244
Dl 238 251
Dl 229 253
Dl 222 251
Dl 217 248
Dl 211 242
Dl 209 234
Dl 213 225
Dl 222 213
Dl 234 199
Dl 258 171
Dl 277 138
Dl 291 102
Dl 293 92
Dl 297 72
Dl 299 50
Dl 300 29
Dl 299 10
Dl 297 -1
Dl 296 -13
Dl 299 -23
Dl 306 -30
Dl 314 -33
Dl 323 -32
Dl 331 -25
Dl 336 -18
Dl 339 -5
Dl 341 12
Dl 343 32
Dl 343 52
Dl 343 52
DP 0 0 0 0 48 1 21
Dl 168 -75
Dl 168 -51
Dl 167 -27
Dl 164 -6
Dl 161 12
Dl 161 13
Dl 147 60
Dl 129 103
Dl 108 142
Dl 83 176
Dl 56 205
Dl 49 210
Dl 34 221
Dl 22 226
Dl 12 226
Dl 5 221
Dl 0 212
Dl 1 202
Dl 7 191
Dl 11 188
Dl 43 156
Dl 71 120
Dl 93 80
Dl 111 35
Dl 116 18
Dl 119 4
Dl 122 -7
Dl 123 -19
Dl 124 -31
Dl 124 -48
Dl 124 -65
Dl 124 -84
Dl 124 -102
Dl 123 -118
Dl 123 -129
Dl 123 -132
Dl 122 -142
Dl 124 -148
Dl 128 -152
Dl 131 -153
Dl 141 -156
Dl 151 -153
Dl 158 -143
Dl 163 -132
Dl 166 -117
Dl 167 -97
Dl 168 -75
Dl 168 -75
DP 0 0 0 0 38 1 21
Dl -48 -140
Dl -49 -136
Dl -52 -127
Dl -57 -114
Dl -64 -98
Dl -72 -79
Dl -81 -58
Dl -91 -37
Dl -100 -16
Dl -109 4
Dl -117 22
Dl -125 37
Dl -130 49
Dl -134 55
Dl -135 57
Dl -140 55
Dl -148 50
Dl -152 47
Dl -166 36
Dl -176 24
Dl -185 10
Dl -189 2
Dl -196 -22
Dl -198 -47
Dl -194 -71
Dl -185 -93
Dl -171 -112
Dl -154 -129
Dl -132 -141
Dl -108 -148
Dl -102 -149
Dl -90 -149
Dl -77 -148
Dl -64 -146
Dl -54 -143
Dl -48 -140
Dl -48 -140
Dl -48 -140
DP 0 0 0 0 43 1 21
Dl -218 -168
Dl -219 -152
Dl -220 -141
Dl -223 -131
Dl -227 -122
Dl -240 -101
Dl -258 -84
Dl -278 -70
Dl -278 -70
Dl -291 -66
Dl -308 -62
Dl -326 -61
Dl -342 -61
Dl -353 -63
Dl -377 -74
Dl -398 -90
Dl -415 -109
Dl -424 -126
Dl -430 -146
Dl -432 -168
Dl -429 -191
Dl -423 -210
Dl -411 -232
Dl -395 -248
Dl -375 -262
Dl -371 -264
Dl -358 -270
Dl -347 -273
Dl -335 -275
Dl -324 -275
Dl -305 -274
Dl -290 -271
Dl -283 -268
Dl -264 -257
Dl -247 -241
Dl -232 -224
Dl -227 -215
Dl -223 -206
Dl -220 -197
Dl -219 -187
Dl -218 -173
Dl -218 -168
Dl -218 -168
DP 0 0 0 0 130 1 21
Dl -44 -500
Dl -44 -494
Dl -45 -487
Dl -47 -480
Dl -50 -469
Dl -55 -456
Dl -62 -440
Dl -71 -418
Dl -82 -392
Dl -83 -391
Dl -93 -367
Dl -103 -345
Dl -104 -343
Dl -104 -503
Dl -105 -506
Dl -108 -509
Dl -114 -513
Dl -123 -518
Dl -137 -524
Dl -155 -532
Dl -160 -534
Dl -181 -543
Dl -197 -549
Dl -209 -553
Dl -217 -556
Dl -223 -556
Dl -227 -555
Dl -229 -553
Dl -232 -547
Dl -237 -537
Dl -243 -523
Dl -251 -506
Dl -259 -487
Dl -268 -467
Dl -276 -446
Dl -284 -427
Dl -291 -409
Dl -297 -394
Dl -301 -383
Dl -303 -377
Dl -303 -376
Dl -302 -374
Dl -300 -371
Dl -297 -369
Dl -291 -365
Dl -282 -361
Dl -270 -355
Dl -252 -348
Dl -230 -338
Dl -223 -335
Dl -208 -329
Dl -197 -325
Dl -190 -323
Dl -185 -323
Dl -182 -325
Dl -178 -329
Dl -173 -339
Dl -165 -354
Dl -156 -374
Dl -146 -397
Dl -139 -412
Dl -130 -434
Dl -121 -455
Dl -114 -473
Dl -109 -488
Dl -105 -498
Dl -104 -503
Dl -104 -343
Dl -112 -325
Dl -120 -309
Dl -126 -296
Dl -131 -289
Dl -131 -288
Dl -146 -275
Dl -165 -266
Dl -185 -262
Dl -200 -263
Dl -207 -265
Dl -219 -270
Dl -234 -275
Dl -251 -282
Dl -270 -290
Dl -287 -297
Dl -303 -304
Dl -316 -310
Dl -318 -311
Dl -338 -324
Dl -353 -340
Dl -361 -359
Dl -363 -378
Dl -363 -384
Dl -362 -391
Dl -360 -399
Dl -357 -409
Dl -352 -422
Dl -345 -439
Dl -336 -460
Dl -325 -486
Dl -315 -509
Dl -305 -531
Dl -297 -551
Dl -289 -567
Dl -284 -579
Dl -280 -585
Dl -280 -586
Dl -273 -594
Dl -264 -603
Dl -260 -606
Dl -251 -611
Dl -243 -614
Dl -233 -615
Dl -220 -615
Dl -211 -615
Dl -203 -614
Dl -196 -613
Dl -187 -610
Dl -175 -606
Dl -161 -600
Dl -141 -592
Dl -135 -589
Dl -116 -580
Dl -98 -572
Dl -83 -564
Dl -72 -558
Dl -66 -554
Dl -65 -554
Dl -53 -538
Dl -46 -518
Dl -44 -500
Dl -44 -500
$EndMODULE 
$EndLIBRARY
