PCBNEW-LibModule-V1
$INDEX
mpng2.mod
$EndINDEX
#
# mpng2.mod
# pixmap w = 583, h = 576
#
$MODULE mpng2.mod
Po 0 0 0 15 00000000 00000000 ~~
Li mpng2.mod
T0 0 0 450 450 0 70 N I 21 "VAL"
T1 0 0 450 450 0 70 N I 21 "mpng2.mod"
DP 0 0 0 0 183 1 21
Dl -1019 3482
Dl -1024 3513
Dl -1040 3561
Dl -1078 3641
Dl -1139 3734
Dl -1218 3835
Dl -1310 3939
Dl -1410 4040
Dl -1513 4134
Dl -1615 4213
Dl -1653 4239
Dl -1715 4279
Dl -1767 4310
Dl -1804 4329
Dl -1816 4333
Dl -1843 4343
Dl -1879 4366
Dl -1879 4367
Dl -1917 4390
Dl -1949 4400
Dl -1981 4407
Dl -2026 4425
Dl -2042 4433
Dl -2091 4454
Dl -2134 4466
Dl -2144 4467
Dl -2181 4472
Dl -2233 4487
Dl -2253 4494
Dl -2299 4505
Dl -2370 4514
Dl -2459 4521
Dl -2557 4526
Dl -2656 4529
Dl -2749 4528
Dl -2827 4525
Dl -2875 4519
Dl -2928 4506
Dl -2973 4489
Dl -2979 4487
Dl -3022 4472
Dl -3070 4467
Dl -3123 4458
Dl -3176 4436
Dl -3180 4433
Dl -3224 4411
Dl -3261 4400
Dl -3265 4400
Dl -3300 4390
Dl -3338 4367
Dl -3375 4343
Dl -3405 4333
Dl -3434 4323
Dl -3467 4300
Dl -3499 4276
Dl -3521 4267
Dl -3533 4263
Dl -3553 4252
Dl -3585 4228
Dl -3635 4189
Dl -3699 4138
Dl -3766 4079
Dl -3838 4008
Dl -3911 3931
Dl -3980 3851
Dl -4043 3773
Dl -4095 3703
Dl -4132 3645
Dl -4149 3603
Dl -4150 3595
Dl -4159 3566
Dl -4173 3541
Dl -4199 3493
Dl -4229 3420
Dl -4261 3330
Dl -4291 3232
Dl -4315 3140
Dl -4332 3046
Dl -4344 2938
Dl -4351 2823
Dl -4352 2709
Dl -4347 2606
Dl -4337 2522
Dl -4327 2480
Dl -4309 2417
Dl -4294 2353
Dl -4292 2342
Dl -4277 2280
Dl -4248 2198
Dl -4210 2105
Dl -4167 2010
Dl -4121 1921
Dl -4095 1875
Dl -3985 1717
Dl -3849 1564
Dl -3699 1429
Dl -3630 1374
Dl -3582 1336
Dl -3551 1314
Dl -3532 1303
Dl -3522 1300
Dl -3500 1289
Dl -3476 1267
Dl -3445 1242
Dl -3422 1233
Dl -3392 1225
Dl -3358 1207
Dl -3316 1189
Dl -3283 1194
Dl -3267 1219
Dl -3267 1224
Dl -3279 1244
Dl -3310 1282
Dl -3356 1333
Dl -3413 1391
Dl -3425 1403
Dl -3484 1462
Dl -3533 1513
Dl -3568 1553
Dl -3583 1575
Dl -3584 1577
Dl -3595 1601
Dl -3614 1622
Dl -3636 1651
Dl -3668 1704
Dl -3704 1773
Dl -3743 1851
Dl -3779 1931
Dl -3810 2005
Dl -3814 2017
Dl -3841 2107
Dl -3863 2218
Dl -3880 2339
Dl -3890 2457
Dl -3891 2508
Dl -3888 2584
Dl -3882 2670
Dl -3871 2760
Dl -3859 2843
Dl -3845 2913
Dl -3831 2962
Dl -3825 2975
Dl -3807 3016
Dl -3794 3061
Dl -3786 3087
Dl -3774 3118
Dl -3755 3159
Dl -3725 3216
Dl -3683 3294
Dl -3661 3335
Dl -3568 3474
Dl -3448 3609
Dl -3307 3734
Dl -3151 3843
Dl -2987 3933
Dl -2867 3982
Dl -2770 4012
Dl -2659 4038
Dl -2544 4060
Dl -2434 4074
Dl -2339 4081
Dl -2282 4079
Dl -2195 4069
Dl -2104 4056
Dl -2017 4042
Dl -1944 4027
Dl -1894 4014
Dl -1892 4014
Dl -1817 3988
Dl -1762 3967
Dl -1714 3948
Dl -1661 3924
Dl -1650 3919
Dl -1505 3838
Dl -1363 3733
Dl -1224 3604
Dl -1154 3536
Dl -1099 3490
Dl -1062 3468
Dl -1053 3467
Dl -1029 3469
Dl -1019 3482
Dl -1019 3482
DP 0 0 0 0 188 1 21
Dl 4289 2901
Dl 4288 2992
Dl 4286 3061
Dl 4281 3113
Dl 4275 3155
Dl 4265 3193
Dl 4253 3229
Dl 4234 3287
Dl 4221 3336
Dl 4217 3363
Dl 4208 3396
Dl 4186 3438
Dl 4183 3442
Dl 4161 3481
Dl 4150 3510
Dl 4150 3513
Dl 4141 3540
Dl 4115 3592
Dl 4074 3665
Dl 4028 3741
Dl 3969 3827
Dl 3890 3921
Dl 3800 4017
Dl 3708 4106
Dl 3620 4178
Dl 3581 4206
Dl 3532 4239
Dl 3487 4269
Dl 3484 4271
Dl 3437 4299
Dl 3389 4325
Dl 3350 4346
Dl 3327 4364
Dl 3326 4365
Dl 3304 4379
Dl 3265 4392
Dl 3262 4393
Dl 3210 4409
Dl 3155 4433
Dl 3150 4436
Dl 3102 4456
Dl 3059 4466
Dl 3054 4467
Dl 3013 4475
Dl 2965 4494
Dl 2962 4496
Dl 2937 4506
Dl 2904 4514
Dl 2858 4520
Dl 2794 4524
Dl 2706 4526
Dl 2600 4528
Dl 2498 4528
Dl 2405 4527
Dl 2327 4525
Dl 2270 4521
Dl 2242 4517
Dl 2193 4503
Dl 2134 4487
Dl 2117 4482
Dl 2044 4460
Dl 1958 4428
Dl 1867 4391
Dl 1781 4352
Dl 1708 4315
Dl 1657 4285
Dl 1656 4284
Dl 1613 4254
Dl 1583 4233
Dl 1498 4170
Dl 1404 4090
Dl 1309 3999
Dl 1222 3907
Dl 1150 3820
Dl 1120 3778
Dl 1086 3728
Dl 1055 3681
Dl 1046 3668
Dl 1001 3588
Dl 977 3513
Dl 973 3480
Dl 986 3468
Dl 1003 3467
Dl 1037 3480
Dl 1087 3519
Dl 1149 3579
Dl 1236 3665
Dl 1314 3736
Dl 1393 3797
Dl 1478 3852
Dl 1576 3906
Dl 1696 3963
Dl 1771 3998
Dl 1826 4019
Dl 1875 4031
Dl 1894 4033
Dl 1933 4037
Dl 1990 4048
Dl 2039 4060
Dl 2116 4073
Dl 2216 4079
Dl 2329 4079
Dl 2444 4073
Dl 2552 4061
Dl 2608 4051
Dl 2789 4000
Dl 2981 3920
Dl 3131 3842
Dl 3202 3795
Dl 3281 3729
Dl 3365 3651
Dl 3447 3565
Dl 3523 3478
Dl 3587 3395
Dl 3634 3322
Dl 3657 3271
Dl 3677 3233
Dl 3692 3216
Dl 3713 3185
Dl 3717 3169
Dl 3724 3137
Dl 3743 3093
Dl 3750 3079
Dl 3771 3033
Dl 3783 2994
Dl 3783 2986
Dl 3788 2955
Dl 3801 2904
Dl 3818 2847
Dl 3838 2748
Dl 3848 2627
Dl 3849 2492
Dl 3839 2351
Dl 3821 2213
Dl 3795 2086
Dl 3761 1979
Dl 3752 1958
Dl 3697 1839
Dl 3647 1743
Dl 3598 1662
Dl 3545 1589
Dl 3481 1515
Dl 3402 1432
Dl 3397 1427
Dl 3325 1351
Dl 3278 1295
Dl 3254 1256
Dl 3250 1239
Dl 3255 1209
Dl 3265 1200
Dl 3299 1208
Dl 3346 1229
Dl 3390 1253
Dl 3416 1274
Dl 3443 1296
Dl 3458 1300
Dl 3488 1311
Dl 3535 1343
Dl 3595 1391
Dl 3664 1449
Dl 3737 1516
Dl 3809 1585
Dl 3875 1652
Dl 3931 1714
Dl 3972 1766
Dl 3977 1774
Dl 4011 1824
Dl 4041 1871
Dl 4050 1883
Dl 4079 1933
Dl 4114 2002
Dl 4150 2079
Dl 4183 2156
Dl 4209 2224
Dl 4223 2272
Dl 4224 2274
Dl 4239 2333
Dl 4260 2386
Dl 4262 2391
Dl 4272 2415
Dl 4279 2449
Dl 4284 2497
Dl 4287 2564
Dl 4288 2655
Dl 4289 2775
Dl 4289 2783
Dl 4289 2901
Dl 4289 2901
DP 0 0 0 0 89 1 21
Dl -1092 1691
Dl -1100 1715
Dl -1116 1736
Dl -1153 1776
Dl -1206 1833
Dl -1273 1901
Dl -1349 1978
Dl -1392 2021
Dl -1491 2121
Dl -1569 2203
Dl -1625 2266
Dl -1658 2309
Dl -1667 2329
Dl -1679 2367
Dl -1692 2383
Dl -1713 2410
Dl -1717 2423
Dl -1724 2445
Dl -1744 2489
Dl -1772 2549
Dl -1806 2617
Dl -1842 2687
Dl -1875 2751
Dl -1904 2803
Dl -1918 2825
Dl -1948 2875
Dl -1980 2929
Dl -1983 2933
Dl -2061 3041
Dl -2157 3128
Dl -2267 3192
Dl -2385 3232
Dl -2505 3245
Dl -2623 3228
Dl -2652 3219
Dl -2775 3158
Dl -2881 3071
Dl -2964 2961
Dl -3023 2834
Dl -3034 2797
Dl -3049 2735
Dl -3055 2690
Dl -3052 2648
Dl -3040 2593
Dl -3034 2570
Dl -3000 2469
Dl -2953 2382
Dl -2888 2302
Dl -2800 2224
Dl -2686 2143
Dl -2676 2137
Dl -2612 2097
Dl -2542 2058
Dl -2509 2041
Dl -2458 2015
Dl -2416 1993
Dl -2400 1984
Dl -2373 1969
Dl -2325 1947
Dl -2275 1925
Dl -2220 1900
Dl -2174 1878
Dl -2150 1866
Dl -2115 1846
Dl -2090 1834
Dl -2069 1819
Dl -2028 1783
Dl -1971 1729
Dl -1901 1662
Dl -1822 1585
Dl -1747 1509
Dl -1650 1412
Dl -1572 1336
Dl -1513 1280
Dl -1468 1241
Dl -1434 1216
Dl -1410 1203
Dl -1395 1200
Dl -1354 1211
Dl -1340 1229
Dl -1312 1298
Dl -1271 1382
Dl -1223 1471
Dl -1175 1553
Dl -1132 1616
Dl -1129 1621
Dl -1100 1662
Dl -1092 1691
Dl -1092 1691
DP 0 0 0 0 102 1 21
Dl 3016 2665
Dl 3014 2745
Dl 3007 2805
Dl 2991 2857
Dl 2976 2891
Dl 2927 2973
Dl 2860 3054
Dl 2786 3124
Dl 2712 3175
Dl 2693 3184
Dl 2607 3211
Dl 2506 3225
Dl 2404 3226
Dl 2316 3212
Dl 2316 3212
Dl 2204 3166
Dl 2106 3095
Dl 2056 3043
Dl 1997 2975
Dl 1954 2920
Dl 1920 2869
Dl 1886 2810
Dl 1851 2742
Dl 1827 2695
Dl 1807 2658
Dl 1803 2650
Dl 1783 2615
Dl 1770 2592
Dl 1744 2544
Dl 1714 2483
Dl 1683 2417
Dl 1658 2360
Dl 1642 2320
Dl 1641 2317
Dl 1626 2293
Dl 1591 2250
Dl 1539 2192
Dl 1474 2122
Dl 1398 2043
Dl 1352 1996
Dl 1274 1917
Dl 1204 1845
Dl 1145 1784
Dl 1101 1738
Dl 1076 1710
Dl 1070 1703
Dl 1077 1684
Dl 1099 1644
Dl 1132 1589
Dl 1158 1549
Dl 1197 1489
Dl 1228 1439
Dl 1246 1405
Dl 1250 1395
Dl 1258 1373
Dl 1280 1334
Dl 1296 1307
Dl 1327 1263
Dl 1355 1241
Dl 1390 1234
Dl 1398 1234
Dl 1417 1236
Dl 1438 1243
Dl 1463 1258
Dl 1496 1284
Dl 1539 1323
Dl 1597 1379
Dl 1672 1453
Dl 1751 1533
Dl 1832 1615
Dl 1907 1688
Dl 1971 1750
Dl 2022 1797
Dl 2055 1826
Dl 2067 1833
Dl 2093 1843
Dl 2128 1866
Dl 2129 1867
Dl 2165 1890
Dl 2193 1900
Dl 2193 1900
Dl 2221 1907
Dl 2268 1926
Dl 2324 1952
Dl 2381 1982
Dl 2383 1983
Dl 2410 1998
Dl 2457 2022
Dl 2513 2051
Dl 2517 2053
Dl 2630 2117
Dl 2735 2186
Dl 2826 2258
Dl 2897 2327
Dl 2943 2389
Dl 2951 2404
Dl 2973 2448
Dl 2992 2483
Dl 3007 2531
Dl 3015 2608
Dl 3016 2665
Dl 3016 2665
DP 0 0 0 0 81 1 21
Dl 949 1748
Dl 948 1803
Dl 946 1852
Dl 940 1931
Dl 930 1986
Dl 916 2029
Dl 895 2065
Dl 852 2117
Dl 793 2173
Dl 724 2228
Dl 654 2276
Dl 589 2313
Dl 536 2332
Dl 522 2333
Dl 485 2343
Dl 453 2359
Dl 413 2376
Dl 345 2392
Dl 257 2404
Dl 155 2415
Dl 46 2422
Dl -64 2425
Dl -169 2424
Dl -261 2418
Dl -292 2415
Dl -365 2403
Dl -437 2387
Dl -484 2373
Dl -543 2354
Dl -600 2337
Dl -614 2334
Dl -662 2316
Dl -699 2293
Dl -728 2272
Dl -745 2267
Dl -772 2254
Dl -813 2222
Dl -859 2177
Dl -905 2127
Dl -944 2077
Dl -968 2037
Dl -995 1952
Dl -1004 1865
Dl -997 1783
Dl -975 1712
Dl -940 1658
Dl -892 1629
Dl -885 1628
Dl -800 1626
Dl -699 1651
Dl -587 1701
Dl -465 1774
Dl -338 1870
Dl -333 1873
Dl -316 1886
Dl -295 1895
Dl -267 1901
Dl -224 1905
Dl -162 1907
Dl -76 1907
Dl -7 1907
Dl 98 1906
Dl 175 1904
Dl 230 1901
Dl 268 1896
Dl 296 1888
Dl 319 1877
Dl 335 1866
Dl 404 1819
Dl 457 1785
Dl 506 1756
Dl 561 1725
Dl 609 1700
Dl 715 1652
Dl 803 1632
Dl 872 1640
Dl 919 1669
Dl 936 1689
Dl 946 1713
Dl 949 1748
Dl 949 1748
DP 0 0 0 0 361 1 21
Dl 1699 -221
Dl 1691 -171
Dl 1683 -159
Dl 1671 -134
Dl 1677 -99
Dl 1684 -83
Dl 1697 -21
Dl 1697 65
Dl 1686 167
Dl 1664 279
Dl 1635 395
Dl 1598 508
Dl 1585 537
Dl 1585 -110
Dl 1581 -122
Dl 1555 -141
Dl 1517 -164
Dl 1474 -184
Dl 1437 -198
Dl 1420 -200
Dl 1388 -208
Dl 1342 -227
Dl 1329 -234
Dl 1286 -255
Dl 1254 -266
Dl 1248 -267
Dl 1222 -274
Dl 1179 -290
Dl 1152 -302
Dl 1090 -331
Dl 1026 -359
Dl 1008 -368
Dl 912 -412
Dl 817 -458
Dl 732 -502
Dl 666 -537
Dl 658 -542
Dl 605 -573
Dl 553 -602
Dl 542 -608
Dl 473 -646
Dl 425 -676
Dl 391 -702
Dl 386 -706
Dl 359 -727
Dl 344 -734
Dl 327 -743
Dl 288 -767
Dl 233 -803
Dl 167 -847
Dl 162 -851
Dl 61 -920
Dl -17 -973
Dl -78 -1016
Dl -126 -1049
Dl -165 -1078
Dl -202 -1106
Dl -240 -1136
Dl -277 -1165
Dl -312 -1189
Dl -345 -1204
Dl -365 -1207
Dl -367 -1203
Dl -355 -1187
Dl -322 -1153
Dl -271 -1105
Dl -207 -1047
Dl -135 -982
Dl -58 -915
Dl 20 -849
Dl 93 -788
Dl 158 -736
Dl 158 -736
Dl 219 -689
Dl 272 -646
Dl 311 -615
Dl 325 -603
Dl 365 -574
Dl 392 -558
Dl 416 -528
Dl 421 -485
Dl 407 -441
Dl 388 -417
Dl 361 -388
Dl 329 -343
Dl 318 -325
Dl 300 -291
Dl 288 -255
Dl 281 -210
Dl 278 -147
Dl 278 -84
Dl 278 -5
Dl 280 50
Dl 287 89
Dl 299 120
Dl 319 152
Dl 329 167
Dl 414 272
Dl 504 346
Dl 603 392
Dl 715 410
Dl 775 410
Dl 866 400
Dl 945 380
Dl 967 372
Dl 1025 340
Dl 1080 300
Dl 1094 287
Dl 1143 228
Dl 1189 158
Dl 1225 86
Dl 1246 23
Dl 1250 -7
Dl 1259 -58
Dl 1281 -102
Dl 1298 -121
Dl 1317 -131
Dl 1345 -133
Dl 1391 -128
Dl 1441 -120
Dl 1504 -112
Dl 1554 -108
Dl 1583 -109
Dl 1585 -110
Dl 1585 537
Dl 1554 611
Dl 1533 654
Dl 1499 715
Dl 1472 762
Dl 1443 810
Dl 1423 842
Dl 1389 891
Dl 1344 949
Dl 1295 1010
Dl 1247 1066
Dl 1206 1110
Dl 1178 1135
Dl 1176 1137
Dl 1160 1157
Dl 1138 1200
Dl 1112 1257
Dl 1108 1267
Dl 1044 1388
Dl 962 1481
Dl 860 1547
Dl 739 1586
Dl 598 1598
Dl 562 1596
Dl 477 1588
Dl 405 1573
Dl 365 1559
Dl 328 1543
Dl 300 1539
Dl 266 1549
Dl 230 1564
Dl 230 690
Dl 224 647
Dl 212 590
Dl 211 585
Dl 197 520
Dl 187 461
Dl 183 424
Dl 170 370
Dl 137 312
Dl 93 262
Dl 50 233
Dl -13 223
Dl -70 244
Dl -119 295
Dl -160 375
Dl -191 482
Dl -195 499
Dl -213 592
Dl -225 657
Dl -231 699
Dl -231 722
Dl -226 730
Dl -216 730
Dl -207 726
Dl -173 717
Dl -120 705
Dl -84 699
Dl 39 693
Dl 113 702
Dl 169 710
Dl 211 713
Dl 229 710
Dl 230 690
Dl 230 1564
Dl 229 1565
Dl 159 1587
Dl 72 1599
Dl -22 1601
Dl -111 1595
Dl -185 1579
Dl -217 1565
Dl -251 1549
Dl -279 1541
Dl -279 -81
Dl -280 -160
Dl -283 -213
Dl -291 -250
Dl -303 -277
Dl -315 -293
Dl -339 -329
Dl -351 -355
Dl -351 -357
Dl -364 -386
Dl -397 -425
Dl -406 -434
Dl -406 -1244
Dl -409 -1250
Dl -424 -1266
Dl -426 -1267
Dl -434 -1254
Dl -434 -1250
Dl -421 -1234
Dl -416 -1234
Dl -406 -1244
Dl -406 -434
Dl -441 -466
Dl -476 -492
Dl -524 -517
Dl -587 -543
Dl -655 -567
Dl -719 -584
Dl -770 -593
Dl -791 -592
Dl -926 -549
Dl -1033 -499
Dl -1117 -438
Dl -1185 -362
Dl -1212 -321
Dl -1234 -280
Dl -1248 -243
Dl -1255 -200
Dl -1258 -140
Dl -1259 -84
Dl -1258 -7
Dl -1254 47
Dl -1245 87
Dl -1229 123
Dl -1213 150
Dl -1166 221
Dl -1124 272
Dl -1079 311
Dl -1059 325
Dl -947 381
Dl -825 409
Dl -700 410
Dl -596 386
Dl -550 364
Dl -496 331
Dl -441 292
Dl -394 253
Dl -361 219
Dl -350 198
Dl -341 175
Dl -319 139
Dl -315 134
Dl -299 107
Dl -288 75
Dl -282 30
Dl -280 -37
Dl -279 -81
Dl -279 1541
Dl -287 1540
Dl -333 1539
Dl -396 1544
Dl -481 1557
Dl -525 1565
Dl -588 1573
Dl -644 1572
Dl -707 1561
Dl -745 1552
Dl -807 1533
Dl -860 1514
Dl -891 1499
Dl -892 1498
Dl -986 1408
Dl -1056 1309
Dl -1085 1254
Dl -1125 1182
Dl -1178 1105
Dl -1225 1047
Dl -1362 875
Dl -1475 681
Dl -1562 466
Dl -1623 232
Dl -1644 110
Dl -1656 19
Dl -1662 -50
Dl -1664 -109
Dl -1661 -169
Dl -1652 -241
Dl -1644 -299
Dl -1600 -520
Dl -1534 -723
Dl -1447 -902
Dl -1383 -1000
Dl -1342 -1059
Dl -1302 -1116
Dl -1277 -1152
Dl -1234 -1206
Dl -1171 -1270
Dl -1096 -1339
Dl -1015 -1406
Dl -935 -1468
Dl -861 -1518
Dl -802 -1552
Dl -782 -1559
Dl -744 -1578
Dl -726 -1594
Dl -713 -1605
Dl -691 -1618
Dl -654 -1634
Dl -599 -1655
Dl -520 -1682
Dl -425 -1714
Dl -377 -1730
Dl -334 -1741
Dl -291 -1749
Dl -240 -1754
Dl -176 -1757
Dl -92 -1758
Dl 19 -1758
Dl 25 -1758
Dl 140 -1758
Dl 227 -1756
Dl 294 -1753
Dl 347 -1747
Dl 392 -1739
Dl 435 -1728
Dl 458 -1720
Dl 563 -1685
Dl 654 -1651
Dl 726 -1621
Dl 774 -1596
Dl 785 -1589
Dl 813 -1571
Dl 825 -1567
Dl 850 -1557
Dl 895 -1530
Dl 954 -1489
Dl 1020 -1440
Dl 1089 -1386
Dl 1154 -1332
Dl 1190 -1300
Dl 1249 -1239
Dl 1317 -1157
Dl 1387 -1063
Dl 1454 -965
Dl 1510 -873
Dl 1544 -807
Dl 1588 -702
Dl 1627 -592
Dl 1658 -484
Dl 1681 -383
Dl 1695 -293
Dl 1699 -221
Dl 1699 -221
DP 0 0 0 0 144 1 21
Dl 4290 -2675
Dl 4289 -2555
Dl 4287 -2462
Dl 4283 -2393
Dl 4278 -2341
Dl 4270 -2301
Dl 4260 -2268
Dl 4260 -2267
Dl 4239 -2208
Dl 4222 -2149
Dl 4218 -2134
Dl 4204 -2092
Dl 4179 -2030
Dl 4144 -1953
Dl 4105 -1871
Dl 4064 -1791
Dl 4035 -1739
Dl 3975 -1649
Dl 3892 -1549
Dl 3794 -1445
Dl 3687 -1345
Dl 3577 -1253
Dl 3472 -1178
Dl 3420 -1147
Dl 3353 -1111
Dl 3306 -1092
Dl 3271 -1087
Dl 3241 -1094
Dl 3238 -1095
Dl 3218 -1112
Dl 3217 -1118
Dl 3228 -1135
Dl 3259 -1170
Dl 3305 -1220
Dl 3363 -1279
Dl 3388 -1305
Dl 3478 -1397
Dl 3547 -1478
Dl 3602 -1554
Dl 3638 -1615
Dl 3672 -1676
Dl 3699 -1728
Dl 3714 -1761
Dl 3717 -1770
Dl 3724 -1793
Dl 3741 -1833
Dl 3748 -1847
Dl 3770 -1904
Dl 3787 -1970
Dl 3791 -1989
Dl 3803 -2051
Dl 3820 -2110
Dl 3826 -2126
Dl 3840 -2180
Dl 3848 -2258
Dl 3852 -2352
Dl 3850 -2453
Dl 3844 -2552
Dl 3833 -2641
Dl 3818 -2712
Dl 3817 -2717
Dl 3799 -2779
Dl 3787 -2835
Dl 3783 -2867
Dl 3775 -2909
Dl 3759 -2933
Dl 3739 -2963
Dl 3724 -3004
Dl 3696 -3084
Dl 3647 -3178
Dl 3581 -3280
Dl 3502 -3383
Dl 3416 -3480
Dl 3366 -3529
Dl 3241 -3637
Dl 3113 -3726
Dl 2975 -3801
Dl 2818 -3866
Dl 2710 -3904
Dl 2663 -3918
Dl 2617 -3928
Dl 2567 -3935
Dl 2505 -3939
Dl 2425 -3941
Dl 2320 -3942
Dl 2300 -3942
Dl 2174 -3941
Dl 2072 -3937
Dl 1987 -3928
Dl 1910 -3914
Dl 1832 -3892
Dl 1745 -3861
Dl 1683 -3837
Dl 1582 -3793
Dl 1494 -3747
Dl 1411 -3691
Dl 1324 -3622
Dl 1226 -3534
Dl 1205 -3514
Dl 1124 -3440
Dl 1062 -3392
Dl 1019 -3369
Dl 993 -3371
Dl 983 -3397
Dl 983 -3402
Dl 994 -3449
Dl 1026 -3513
Dl 1081 -3596
Dl 1159 -3700
Dl 1185 -3734
Dl 1310 -3880
Dl 1434 -4000
Dl 1563 -4102
Dl 1707 -4192
Dl 1808 -4245
Dl 2024 -4334
Dl 2250 -4391
Dl 2482 -4417
Dl 2718 -4411
Dl 2892 -4385
Dl 3093 -4336
Dl 3276 -4267
Dl 3448 -4175
Dl 3620 -4056
Dl 3650 -4033
Dl 3759 -3941
Dl 3851 -3849
Dl 3935 -3748
Dl 4020 -3629
Dl 4049 -3584
Dl 4091 -3509
Dl 4138 -3411
Dl 4186 -3300
Dl 4231 -3183
Dl 4251 -3125
Dl 4265 -3083
Dl 4275 -3043
Dl 4282 -3000
Dl 4286 -2948
Dl 4289 -2880
Dl 4290 -2792
Dl 4290 -2676
Dl 4290 -2675
Dl 4290 -2675
DP 0 0 0 0 128 1 21
Dl -1014 -3391
Dl -1017 -3367
Dl -1043 -3352
Dl -1084 -3363
Dl -1134 -3399
Dl -1191 -3457
Dl -1195 -3462
Dl -1253 -3528
Dl -1297 -3576
Dl -1334 -3610
Dl -1353 -3626
Dl -1545 -3754
Dl -1750 -3852
Dl -1967 -3919
Dl -2155 -3951
Dl -2386 -3960
Dl -2610 -3938
Dl -2826 -3886
Dl -3030 -3805
Dl -3220 -3696
Dl -3393 -3559
Dl -3436 -3518
Dl -3510 -3437
Dl -3584 -3344
Dl -3653 -3244
Dl -3713 -3146
Dl -3760 -3055
Dl -3789 -2980
Dl -3792 -2966
Dl -3805 -2921
Dl -3820 -2889
Dl -3821 -2888
Dl -3835 -2857
Dl -3849 -2800
Dl -3862 -2725
Dl -3874 -2638
Dl -3884 -2549
Dl -3890 -2463
Dl -3892 -2409
Dl -3887 -2289
Dl -3875 -2169
Dl -3856 -2058
Dl -3832 -1966
Dl -3815 -1924
Dl -3796 -1877
Dl -3785 -1840
Dl -3784 -1832
Dl -3782 -1818
Dl -3774 -1797
Dl -3758 -1764
Dl -3732 -1714
Dl -3694 -1642
Dl -3661 -1583
Dl -3608 -1501
Dl -3535 -1412
Dl -3451 -1324
Dl -3427 -1301
Dl -3365 -1244
Dl -3324 -1205
Dl -3300 -1178
Dl -3288 -1161
Dl -3286 -1147
Dl -3287 -1137
Dl -3306 -1112
Dl -3348 -1107
Dl -3407 -1124
Dl -3417 -1128
Dl -3457 -1148
Dl -3482 -1163
Dl -3484 -1165
Dl -3501 -1179
Dl -3538 -1205
Dl -3588 -1238
Dl -3589 -1239
Dl -3650 -1284
Dl -3723 -1347
Dl -3802 -1421
Dl -3879 -1498
Dl -3947 -1572
Dl -4000 -1635
Dl -4014 -1655
Dl -4047 -1705
Dl -4078 -1752
Dl -4087 -1766
Dl -4113 -1809
Dl -4143 -1863
Dl -4173 -1921
Dl -4198 -1973
Dl -4214 -2010
Dl -4217 -2022
Dl -4224 -2046
Dl -4240 -2088
Dl -4249 -2107
Dl -4293 -2231
Dl -4326 -2378
Dl -4345 -2539
Dl -4351 -2704
Dl -4344 -2867
Dl -4321 -3016
Dl -4315 -3042
Dl -4246 -3273
Dl -4154 -3484
Dl -4036 -3678
Dl -3889 -3861
Dl -3818 -3936
Dl -3652 -4081
Dl -3464 -4203
Dl -3259 -4302
Dl -3042 -4375
Dl -2818 -4419
Dl -2599 -4434
Dl -2508 -4429
Dl -2400 -4417
Dl -2286 -4398
Dl -2175 -4375
Dl -2077 -4349
Dl -2007 -4324
Dl -1811 -4232
Dl -1642 -4133
Dl -1492 -4023
Dl -1356 -3895
Dl -1225 -3744
Dl -1172 -3675
Dl -1109 -3586
Dl -1061 -3506
Dl -1028 -3440
Dl -1014 -3391
Dl -1014 -3391
DP 0 0 0 0 96 1 21
Dl -1117 -1588
Dl -1129 -1566
Dl -1160 -1527
Dl -1205 -1476
Dl -1255 -1426
Dl -1316 -1366
Dl -1373 -1307
Dl -1418 -1257
Dl -1441 -1230
Dl -1476 -1187
Dl -1505 -1171
Dl -1537 -1176
Dl -1559 -1187
Dl -1580 -1204
Dl -1621 -1241
Dl -1677 -1295
Dl -1745 -1360
Dl -1819 -1435
Dl -1843 -1458
Dl -1936 -1550
Dl -2010 -1621
Dl -2070 -1675
Dl -2120 -1714
Dl -2163 -1742
Dl -2193 -1757
Dl -2347 -1831
Dl -2474 -1895
Dl -2579 -1950
Dl -2665 -2000
Dl -2737 -2045
Dl -2797 -2090
Dl -2851 -2135
Dl -2897 -2179
Dl -2987 -2290
Dl -3045 -2407
Dl -3071 -2531
Dl -3073 -2567
Dl -3068 -2654
Dl -3050 -2712
Dl -3047 -2717
Dl -3024 -2764
Dl -3011 -2801
Dl -2991 -2843
Dl -2950 -2897
Dl -2894 -2954
Dl -2833 -3009
Dl -2771 -3053
Dl -2759 -3060
Dl -2718 -3082
Dl -2682 -3096
Dl -2640 -3104
Dl -2585 -3107
Dl -2505 -3108
Dl -2505 -3108
Dl -2424 -3106
Dl -2368 -3103
Dl -2330 -3095
Dl -2302 -3082
Dl -2288 -3073
Dl -2246 -3046
Dl -2208 -3028
Dl -2207 -3028
Dl -2174 -3008
Dl -2129 -2970
Dl -2085 -2925
Dl -2050 -2880
Dl -2044 -2871
Dl -2024 -2838
Dl -1994 -2792
Dl -1976 -2765
Dl -1946 -2720
Dl -1921 -2682
Dl -1899 -2644
Dl -1874 -2597
Dl -1843 -2536
Dl -1801 -2452
Dl -1800 -2450
Dl -1765 -2379
Dl -1734 -2317
Dl -1710 -2272
Dl -1699 -2250
Dl -1681 -2218
Dl -1660 -2175
Dl -1641 -2149
Dl -1602 -2104
Dl -1547 -2044
Dl -1480 -1974
Dl -1404 -1897
Dl -1377 -1871
Dl -1301 -1795
Dl -1233 -1725
Dl -1178 -1666
Dl -1139 -1621
Dl -1119 -1593
Dl -1117 -1588
Dl -1117 -1588
DP 0 0 0 0 87 1 21
Dl 3006 -2544
Dl 2982 -2421
Dl 2928 -2302
Dl 2874 -2224
Dl 2815 -2164
Dl 2726 -2096
Dl 2613 -2020
Dl 2477 -1940
Dl 2321 -1856
Dl 2183 -1787
Dl 2120 -1756
Dl 2068 -1728
Dl 2023 -1699
Dl 1978 -1665
Dl 1927 -1620
Dl 1865 -1561
Dl 1786 -1482
Dl 1780 -1477
Dl 1693 -1391
Dl 1625 -1328
Dl 1575 -1285
Dl 1539 -1260
Dl 1515 -1251
Dl 1512 -1250
Dl 1476 -1262
Dl 1430 -1299
Dl 1391 -1340
Dl 1338 -1396
Dl 1280 -1451
Dl 1237 -1486
Dl 1174 -1536
Dl 1133 -1572
Dl 1110 -1599
Dl 1101 -1623
Dl 1100 -1636
Dl 1113 -1663
Dl 1151 -1711
Dl 1215 -1780
Dl 1304 -1871
Dl 1333 -1899
Dl 1438 -2002
Dl 1519 -2087
Dl 1579 -2155
Dl 1620 -2209
Dl 1643 -2250
Dl 1650 -2282
Dl 1650 -2282
Dl 1660 -2316
Dl 1683 -2355
Dl 1707 -2389
Dl 1717 -2414
Dl 1717 -2414
Dl 1724 -2439
Dl 1744 -2483
Dl 1770 -2534
Dl 1797 -2583
Dl 1821 -2620
Dl 1829 -2631
Dl 1847 -2660
Dl 1850 -2673
Dl 1859 -2700
Dl 1882 -2738
Dl 1888 -2746
Dl 1920 -2791
Dl 1948 -2832
Dl 1950 -2834
Dl 2011 -2916
Dl 2075 -2986
Dl 2135 -3037
Dl 2148 -3046
Dl 2190 -3071
Dl 2222 -3087
Dl 2256 -3099
Dl 2306 -3111
Dl 2321 -3115
Dl 2387 -3128
Dl 2442 -3132
Dl 2499 -3126
Dl 2573 -3110
Dl 2586 -3107
Dl 2703 -3061
Dl 2809 -2987
Dl 2899 -2889
Dl 2962 -2784
Dl 3000 -2666
Dl 3006 -2544
Dl 3006 -2544
$EndMODULE mpng2.mod
$EndLIBRARY
