PCBNEW-LibModule-V1
$INDEX

$EndINDEX
#
# 
# pixmap w = 572, h = 572
#
$MODULE 
Po 0 0 0 15 00000000 00000000 ~~
Li 
T0 0 0 450 450 0 70 N I 21 "VAL"
T1 0 0 450 450 0 70 N I 21 ""
DP 0 0 0 0 392 1 21
Dl 1150 1150
Dl 993 1150
Dl 993 925
Dl 993 856
Dl 925 856
Dl 925 788
Dl 993 788
Dl 993 651
Dl 925 651
Dl 925 720
Dl 856 720
Dl 856 788
Dl 788 788
Dl 788 856
Dl 720 856
Dl 720 788
Dl 515 788
Dl 515 720
Dl 720 720
Dl 720 651
Dl 788 651
Dl 788 583
Dl 856 583
Dl 856 515
Dl 788 515
Dl 788 446
Dl 993 446
Dl 993 378
Dl 788 378
Dl 788 446
Dl 720 446
Dl 720 378
Dl 651 378
Dl 651 241
Dl 925 241
Dl 925 310
Dl 993 310
Dl 993 173
Dl 993 105
Dl 993 36
Dl 925 36
Dl 925 105
Dl 993 105
Dl 993 173
Dl 856 173
Dl 856 -32
Dl 993 -32
Dl 993 -169
Dl 993 -511
Dl 993 -989
Dl 515 -989
Dl 515 -511
Dl 993 -511
Dl 993 -169
Dl 925 -169
Dl 925 -100
Dl 788 -100
Dl 788 173
Dl 515 173
Dl 515 241
Dl 583 241
Dl 583 310
Dl 378 310
Dl 378 241
Dl 446 241
Dl 446 173
Dl 241 173
Dl 241 310
Dl 378 310
Dl 378 378
Dl 310 378
Dl 310 446
Dl 173 446
Dl 173 515
Dl 36 515
Dl 36 378
Dl -237 378
Dl -237 310
Dl -169 310
Dl -169 241
Dl -237 241
Dl -237 173
Dl -306 173
Dl -306 36
Dl -237 36
Dl -237 105
Dl -169 105
Dl -169 36
Dl -32 36
Dl -32 -32
Dl -100 -32
Dl -100 -100
Dl -32 -100
Dl -32 -169
Dl -100 -169
Dl -100 -237
Dl -32 -237
Dl -32 -306
Dl -100 -306
Dl -100 -442
Dl -169 -442
Dl -169 -511
Dl -100 -511
Dl -100 -647
Dl -32 -647
Dl -32 -374
Dl 36 -374
Dl 36 -169
Dl 105 -169
Dl 105 -100
Dl 36 -100
Dl 36 36
Dl 105 36
Dl 105 105
Dl -32 105
Dl -32 173
Dl -100 173
Dl -100 241
Dl -32 241
Dl -32 173
Dl 36 173
Dl 36 310
Dl 105 310
Dl 105 378
Dl 173 378
Dl 173 310
Dl 105 310
Dl 105 241
Dl 173 241
Dl 173 173
Dl 105 173
Dl 105 105
Dl 173 105
Dl 173 36
Dl 241 36
Dl 241 105
Dl 310 105
Dl 310 -32
Dl 378 -32
Dl 378 105
Dl 515 105
Dl 515 -32
Dl 583 -32
Dl 583 105
Dl 720 105
Dl 720 -100
Dl 583 -100
Dl 583 -169
Dl 720 -169
Dl 720 -374
Dl 788 -374
Dl 788 -306
Dl 925 -306
Dl 925 -374
Dl 788 -374
Dl 788 -442
Dl 651 -442
Dl 651 -237
Dl 583 -237
Dl 583 -306
Dl 515 -306
Dl 515 -32
Dl 446 -32
Dl 446 -237
Dl 310 -237
Dl 310 -169
Dl 378 -169
Dl 378 -100
Dl 310 -100
Dl 310 -32
Dl 173 -32
Dl 173 -100
Dl 241 -100
Dl 241 -169
Dl 173 -169
Dl 173 -237
Dl 241 -237
Dl 241 -306
Dl 378 -306
Dl 378 -374
Dl 446 -374
Dl 446 -921
Dl 378 -921
Dl 378 -716
Dl 310 -716
Dl 310 -647
Dl 173 -647
Dl 173 -716
Dl 241 -716
Dl 241 -784
Dl 310 -784
Dl 310 -852
Dl 310 -921
Dl 310 -989
Dl 241 -989
Dl 241 -921
Dl 310 -921
Dl 310 -852
Dl 241 -852
Dl 241 -784
Dl 173 -784
Dl 173 -921
Dl 105 -921
Dl 105 -852
Dl 36 -852
Dl 36 -989
Dl -32 -989
Dl -32 -852
Dl 36 -852
Dl 36 -784
Dl -100 -784
Dl -100 -921
Dl -169 -921
Dl -169 -784
Dl -100 -784
Dl -100 -647
Dl -169 -647
Dl -169 -716
Dl -237 -716
Dl -237 -647
Dl -306 -647
Dl -306 -852
Dl -237 -852
Dl -237 -989
Dl -374 -989
Dl -374 -921
Dl -306 -921
Dl -306 -852
Dl -374 -852
Dl -374 -784
Dl -442 -784
Dl -442 -647
Dl -374 -647
Dl -374 -579
Dl -442 -579
Dl -442 -511
Dl -374 -511
Dl -374 -579
Dl -306 -579
Dl -306 -511
Dl -237 -511
Dl -237 -374
Dl -306 -374
Dl -306 -442
Dl -374 -442
Dl -374 -306
Dl -306 -306
Dl -306 -237
Dl -374 -237
Dl -374 -169
Dl -511 -169
Dl -511 -237
Dl -511 -306
Dl -579 -306
Dl -579 -237
Dl -511 -237
Dl -511 -169
Dl -579 -169
Dl -579 -100
Dl -647 -100
Dl -647 -374
Dl -442 -374
Dl -442 -442
Dl -511 -442
Dl -511 -511
Dl -511 -989
Dl -989 -989
Dl -989 -511
Dl -511 -511
Dl -511 -442
Dl -647 -442
Dl -647 -374
Dl -784 -374
Dl -784 -306
Dl -852 -306
Dl -852 -374
Dl -852 -442
Dl -989 -442
Dl -989 -237
Dl -921 -237
Dl -921 -374
Dl -852 -374
Dl -852 -306
Dl -852 -169
Dl -784 -169
Dl -784 -100
Dl -852 -100
Dl -852 36
Dl -921 36
Dl -921 -100
Dl -989 -100
Dl -989 36
Dl -921 36
Dl -921 173
Dl -989 173
Dl -989 446
Dl -921 446
Dl -921 310
Dl -784 310
Dl -784 173
Dl -716 173
Dl -716 378
Dl -784 378
Dl -784 446
Dl -647 446
Dl -647 378
Dl -579 378
Dl -579 446
Dl -442 446
Dl -442 651
Dl -306 651
Dl -306 788
Dl -374 788
Dl -374 856
Dl -442 856
Dl -442 993
Dl -374 993
Dl -374 925
Dl -306 925
Dl -306 993
Dl -237 993
Dl -237 925
Dl -169 925
Dl -169 993
Dl -100 993
Dl -100 925
Dl -169 925
Dl -169 856
Dl -100 856
Dl -100 788
Dl -169 788
Dl -169 856
Dl -237 856
Dl -237 720
Dl -100 720
Dl -100 583
Dl -237 583
Dl -237 515
Dl -100 515
Dl -100 446
Dl -32 446
Dl -32 651
Dl 105 651
Dl 105 720
Dl -32 720
Dl -32 993
Dl 241 993
Dl 241 925
Dl 36 925
Dl 36 856
Dl 105 856
Dl 105 720
Dl 173 720
Dl 173 583
Dl 241 583
Dl 241 651
Dl 310 651
Dl 310 720
Dl 241 720
Dl 241 788
Dl 310 788
Dl 310 856
Dl 446 856
Dl 446 925
Dl 515 925
Dl 515 856
Dl 583 856
Dl 583 925
Dl 651 925
Dl 651 993
Dl 720 993
Dl 720 925
Dl 788 925
Dl 788 993
Dl 856 993
Dl 856 856
Dl 925 856
Dl 925 925
Dl 993 925
Dl 993 1150
Dl -511 1150
Dl -511 993
Dl -511 515
Dl -989 515
Dl -989 993
Dl -511 993
Dl -511 1150
Dl -1150 1150
Dl -1150 -1150
Dl 1150 -1150
Dl 1150 1150
Dl 1150 1150
DP 0 0 0 0 13 1 21
Dl -579 925
Dl -647 925
Dl -647 856
Dl -647 651
Dl -852 651
Dl -852 856
Dl -647 856
Dl -647 925
Dl -921 925
Dl -921 583
Dl -579 583
Dl -579 925
Dl -579 925
DP 0 0 0 0 6 1 21
Dl -237 925
Dl -306 925
Dl -306 856
Dl -237 856
Dl -237 925
Dl -237 925
DP 0 0 0 0 6 1 21
Dl 720 925
Dl 651 925
Dl 651 856
Dl 720 856
Dl 720 925
Dl 720 925
DP 0 0 0 0 6 1 21
Dl -306 446
Dl -442 446
Dl -442 378
Dl -306 378
Dl -306 446
Dl -306 446
DP 0 0 0 0 6 1 21
Dl -306 583
Dl -374 583
Dl -374 515
Dl -306 515
Dl -306 583
Dl -306 583
DP 0 0 0 0 6 1 21
Dl -237 515
Dl -306 515
Dl -306 446
Dl -237 446
Dl -237 515
Dl -237 515
DP 0 0 0 0 6 1 21
Dl -237 651
Dl -306 651
Dl -306 583
Dl -237 583
Dl -237 651
Dl -237 651
DP 0 0 0 0 13 1 21
Dl 651 651
Dl 583 651
Dl 583 583
Dl 583 515
Dl 515 515
Dl 515 583
Dl 583 583
Dl 583 651
Dl 446 651
Dl 446 446
Dl 651 446
Dl 651 651
Dl 651 651
DP 0 0 0 0 6 1 21
Dl 310 583
Dl 241 583
Dl 241 515
Dl 310 515
Dl 310 583
Dl 310 583
DP 0 0 0 0 6 1 21
Dl 378 515
Dl 310 515
Dl 310 446
Dl 378 446
Dl 378 515
Dl 378 515
DP 0 0 0 0 6 1 21
Dl -511 378
Dl -579 378
Dl -579 310
Dl -511 310
Dl -511 378
Dl -511 378
DP 0 0 0 0 8 1 21
Dl -716 105
Dl -784 105
Dl -784 173
Dl -852 173
Dl -852 36
Dl -716 36
Dl -716 105
Dl -716 105
DP 0 0 0 0 6 1 21
Dl -442 -32
Dl -579 -32
Dl -579 -100
Dl -442 -100
Dl -442 -32
Dl -442 -32
DP 0 0 0 0 10 1 21
Dl -442 105
Dl -579 105
Dl -579 173
Dl -716 173
Dl -716 105
Dl -647 105
Dl -647 36
Dl -442 36
Dl -442 105
Dl -442 105
DP 0 0 0 0 6 1 21
Dl -374 36
Dl -442 36
Dl -442 -32
Dl -374 -32
Dl -374 36
Dl -374 36
DP 0 0 0 0 6 1 21
Dl -374 241
Dl -579 241
Dl -579 173
Dl -374 173
Dl -374 241
Dl -374 241
DP 0 0 0 0 6 1 21
Dl -306 310
Dl -374 310
Dl -374 241
Dl -306 241
Dl -306 310
Dl -306 310
DP 0 0 0 0 6 1 21
Dl -169 36
Dl -237 36
Dl -237 -32
Dl -169 -32
Dl -169 36
Dl -169 36
DP 0 0 0 0 12 1 21
Dl -100 -237
Dl -169 -237
Dl -169 -169
Dl -237 -169
Dl -237 -32
Dl -306 -32
Dl -306 -237
Dl -237 -237
Dl -237 -306
Dl -100 -306
Dl -100 -237
Dl -100 -237
DP 0 0 0 0 6 1 21
Dl -100 -100
Dl -169 -100
Dl -169 -169
Dl -100 -169
Dl -100 -100
Dl -100 -100
DP 0 0 0 0 6 1 21
Dl -647 -32
Dl -784 -32
Dl -784 -100
Dl -647 -100
Dl -647 -32
Dl -647 -32
DP 0 0 0 0 6 1 21
Dl -716 -169
Dl -784 -169
Dl -784 -306
Dl -716 -306
Dl -716 -169
Dl -716 -169
DP 0 0 0 0 6 1 21
Dl 173 -237
Dl 105 -237
Dl 105 -374
Dl 173 -374
Dl 173 -237
Dl 173 -237
DP 0 0 0 0 12 1 21
Dl 378 -374
Dl 310 -374
Dl 310 -442
Dl 173 -442
Dl 173 -579
Dl 241 -579
Dl 241 -511
Dl 310 -511
Dl 310 -647
Dl 378 -647
Dl 378 -374
Dl 378 -374
DP 0 0 0 0 10 1 21
Dl 105 -442
Dl 36 -442
Dl 36 -647
Dl -32 -647
Dl -32 -716
Dl 36 -716
Dl 36 -784
Dl 105 -784
Dl 105 -442
Dl 105 -442
DP 0 0 0 0 6 1 21
Dl -169 -511
Dl -237 -511
Dl -237 -647
Dl -169 -647
Dl -169 -511
Dl -169 -511
DP 0 0 0 0 13 1 21
Dl -579 -579
Dl -647 -579
Dl -647 -647
Dl -647 -852
Dl -852 -852
Dl -852 -647
Dl -647 -647
Dl -647 -579
Dl -921 -579
Dl -921 -921
Dl -579 -921
Dl -579 -579
Dl -579 -579
DP 0 0 0 0 13 1 21
Dl 925 -579
Dl 856 -579
Dl 856 -647
Dl 856 -852
Dl 651 -852
Dl 651 -647
Dl 856 -647
Dl 856 -579
Dl 583 -579
Dl 583 -921
Dl 925 -921
Dl 925 -579
Dl 925 -579
$EndMODULE 
$EndLIBRARY
