PCBNEW-LibModule-V1
$INDEX

$EndINDEX
#
# 
# pixmap w = 600, h = 600
#
$MODULE 
Po 0 0 0 15 00000000 00000000 ~~
Li 
T0 0 0 450 450 0 70 N I 21 "VAL"
T1 0 0 450 450 0 70 N I 21 ""
DP 0 0 0 0 204 1 21
Dl 1216 -1197
Dl 1213 -1188
Dl 1207 -1176
Dl 1205 -1172
Dl 1194 -1152
Dl 1179 -1125
Dl 1162 -1092
Dl 1141 -1052
Dl 1117 -1007
Dl 1091 -957
Dl 1063 -901
Dl 1033 -841
Dl 1000 -778
Dl 992 -761
Dl 942 -663
Dl 896 -571
Dl 851 -482
Dl 806 -395
Dl 762 -307
Dl 716 -217
Dl 710 -206
Dl 697 -181
Dl 681 -149
Dl 663 -112
Dl 642 -72
Dl 620 -29
Dl 598 16
Dl 576 60
Dl 554 103
Dl 552 106
Dl 531 147
Dl 511 188
Dl 491 227
Dl 472 265
Dl 454 299
Dl 439 329
Dl 426 354
Dl 417 373
Dl 415 377
Dl 400 405
Dl 383 439
Dl 362 479
Dl 340 524
Dl 315 572
Dl 290 623
Dl 263 675
Dl 236 729
Dl 209 782
Dl 183 833
Dl 158 883
Dl 135 930
Dl 113 972
Dl 95 1010
Dl 87 1026
Dl 70 1059
Dl 55 1089
Dl 42 1115
Dl 30 1138
Dl 21 1156
Dl 15 1169
Dl 11 1175
Dl 11 1175
Dl 9 1171
Dl 3 1162
Dl -4 1147
Dl -14 1129
Dl -20 1116
Dl -30 1096
Dl -43 1071
Dl -58 1041
Dl -75 1010
Dl -92 977
Dl -108 945
Dl -110 942
Dl -128 907
Dl -147 870
Dl -167 831
Dl -186 794
Dl -204 760
Dl -217 735
Dl -230 709
Dl -243 685
Dl -254 664
Dl -262 647
Dl -269 635
Dl -271 631
Dl -275 624
Dl -282 610
Dl -292 592
Dl -303 570
Dl -316 546
Dl -321 535
Dl -341 497
Dl -359 461
Dl -377 427
Dl -395 392
Dl -415 353
Dl -438 310
Dl -440 306
Dl -451 285
Dl -465 258
Dl -479 230
Dl -494 202
Dl -500 190
Dl -512 167
Dl -527 138
Dl -543 107
Dl -560 74
Dl -577 41
Dl -588 21
Dl -602 -6
Dl -618 -39
Dl -638 -76
Dl -658 -116
Dl -680 -157
Dl -701 -199
Dl -722 -238
Dl -727 -248
Dl -761 -313
Dl -796 -381
Dl -832 -450
Dl -868 -519
Dl -904 -588
Dl -938 -654
Dl -971 -717
Dl -1001 -775
Dl -1028 -827
Dl -1033 -838
Dl -1066 -899
Dl -1095 -956
Dl -1122 -1008
Dl -1146 -1054
Dl -1166 -1094
Dl -1184 -1129
Dl -1198 -1157
Dl -1209 -1178
Dl -1216 -1193
Dl -1220 -1201
Dl -1220 -1202
Dl -1216 -1202
Dl -1205 -1200
Dl -1187 -1196
Dl -1166 -1191
Dl -1140 -1185
Dl -1119 -1179
Dl -1090 -1173
Dl -1056 -1164
Dl -1017 -1155
Dl -975 -1145
Dl -932 -1135
Dl -890 -1126
Dl -861 -1119
Dl -831 -1112
Dl -794 -1104
Dl -752 -1094
Dl -704 -1083
Dl -652 -1071
Dl -597 -1058
Dl -540 -1045
Dl -481 -1032
Dl -423 -1018
Dl -365 -1005
Dl -353 -1002
Dl -4 -922
Dl 22 -928
Dl 29 -930
Dl 44 -933
Dl 66 -938
Dl 94 -944
Dl 127 -952
Dl 165 -961
Dl 207 -970
Dl 253 -981
Dl 302 -992
Dl 352 -1004
Dl 405 -1016
Dl 458 -1028
Dl 512 -1040
Dl 565 -1053
Dl 616 -1064
Dl 667 -1076
Dl 714 -1087
Dl 759 -1097
Dl 800 -1107
Dl 837 -1115
Dl 868 -1122
Dl 890 -1127
Dl 919 -1134
Dl 950 -1141
Dl 980 -1148
Dl 1007 -1154
Dl 1025 -1158
Dl 1050 -1164
Dl 1077 -1170
Dl 1104 -1176
Dl 1131 -1182
Dl 1157 -1188
Dl 1179 -1193
Dl 1198 -1197
Dl 1210 -1199
Dl 1216 -1200
Dl 1216 -1200
Dl 1216 -1197
Dl 1216 -1197
$EndMODULE 
$EndLIBRARY
