PCBNEW-LibModule-V1
$INDEX
LOGO
$EndINDEX
#
# LOGO
# pixmap w = 70, h = 94
#
$MODULE LOGO
Po 0 0 0 15 00000000 00000000 ~~
Li LOGO
T0 0 1866 600 600 0 120 N I 21 "G***"
T1 0 -1866 600 600 0 120 N I 21 "LOGO"
DP 0 0 0 0 85 1 21
Dl 1167 1567
Dl 867 1566
Dl 867 1267
Dl 867 900
Dl 867 534
Dl 784 534
Dl 700 534
Dl 700 900
Dl 700 1267
Dl 784 1267
Dl 867 1267
Dl 867 1566
Dl 567 1566
Dl 567 1267
Dl 567 900
Dl 567 534
Dl 484 534
Dl 400 534
Dl 400 900
Dl 400 1267
Dl 484 1267
Dl 567 1267
Dl 567 1566
Dl 267 1566
Dl 267 1267
Dl 267 900
Dl 267 534
Dl 184 534
Dl 100 534
Dl 100 900
Dl 100 1267
Dl 184 1267
Dl 267 1267
Dl 267 1566
Dl 209 1566
Dl -33 1565
Dl -33 1267
Dl -33 900
Dl -33 534
Dl -116 534
Dl -200 534
Dl -200 900
Dl -200 1267
Dl -116 1267
Dl -33 1267
Dl -33 1565
Dl -420 1565
Dl -420 767
Dl -650 767
Dl -880 767
Dl -766 884
Dl -701 951
Dl -658 993
Dl -650 1000
Dl -627 979
Dl -572 924
Dl -533 884
Dl -420 767
Dl -420 1565
Dl -750 1565
Dl -933 1382
Dl -1147 868
Dl -1148 624
Dl -1149 346
Dl -1150 39
Dl -1150 12
Dl -1150 -1560
Dl -1016 -1548
Dl -950 -1545
Dl -827 -1542
Dl -655 -1540
Dl -446 -1538
Dl -208 -1536
Dl 49 -1535
Dl 142 -1535
Dl 1167 -1533
Dl 1167 17
Dl 1167 1567
Dl 1167 1567
$EndMODULE LOGO
$EndLIBRARY
