PCBNEW-LibModule-V1
$INDEX

$EndINDEX
#
# 
# pixmap w = 279, h = 251
#
$MODULE 
Po 0 0 0 15 00000000 00000000 ~~
Li 
T0 0 0 450 450 0 70 N I 21 "VAL"
T1 0 0 450 450 0 70 N I 21 ""
DP 0 0 0 0 106 1 21
Dl 826 379
Dl 826 427
Dl 825 466
Dl 825 496
Dl 824 519
Dl 822 536
Dl 820 549
Dl 818 559
Dl 816 565
Dl 798 596
Dl 770 623
Dl 736 641
Dl 719 646
Dl 707 647
Dl 683 648
Dl 649 649
Dl 604 650
Dl 550 651
Dl 488 651
Dl 419 652
Dl 345 652
Dl 266 652
Dl 183 653
Dl 98 653
Dl 12 653
Dl -75 653
Dl -160 653
Dl -244 652
Dl -325 652
Dl -402 652
Dl -473 651
Dl -539 651
Dl -597 650
Dl -646 649
Dl -686 648
Dl -716 647
Dl -733 646
Dl -737 646
Dl -759 638
Dl -782 624
Dl -792 616
Dl -803 607
Dl -812 597
Dl -820 587
Dl -826 575
Dl -831 560
Dl -834 540
Dl -837 514
Dl -838 481
Dl -839 440
Dl -839 390
Dl -839 328
Dl -839 255
Dl -839 250
Dl -837 -37
Dl -517 -38
Dl -453 -39
Dl -393 -39
Dl -338 -38
Dl -290 -38
Dl -251 -37
Dl -220 -37
Dl -200 -36
Dl -192 -35
Dl -191 -26
Dl -195 -9
Dl -200 6
Dl -214 60
Dl -218 119
Dl -212 181
Dl -195 241
Dl -178 280
Dl -154 319
Dl -122 358
Dl -84 394
Dl -46 422
Dl -30 431
Dl 34 458
Dl 98 472
Dl 163 473
Dl 225 464
Dl 284 444
Dl 339 413
Dl 388 373
Dl 430 324
Dl 464 267
Dl 488 202
Dl 491 193
Dl 498 145
Dl 498 92
Dl 491 40
Dl 481 5
Dl 474 -18
Dl 472 -32
Dl 475 -37
Dl 484 -38
Dl 504 -38
Dl 534 -39
Dl 571 -39
Dl 614 -39
Dl 653 -38
Dl 823 -37
Dl 825 250
Dl 826 321
Dl 826 379
Dl 826 379
DP 0 0 0 0 48 1 21
Dl 370 117
Dl 370 149
Dl 368 173
Dl 364 190
Dl 358 206
Dl 354 213
Dl 321 263
Dl 282 302
Dl 237 330
Dl 187 346
Dl 135 350
Dl 93 344
Dl 39 326
Dl -7 298
Dl -46 258
Dl -74 213
Dl -82 196
Dl -87 179
Dl -89 157
Dl -90 127
Dl -90 120
Dl -89 88
Dl -87 64
Dl -83 45
Dl -75 26
Dl -72 19
Dl -45 -25
Dl -9 -63
Dl 33 -93
Dl 45 -99
Dl 68 -108
Dl 89 -114
Dl 114 -116
Dl 140 -117
Dl 172 -116
Dl 195 -113
Dl 216 -107
Dl 234 -99
Dl 282 -70
Dl 320 -33
Dl 347 8
Dl 358 28
Dl 364 45
Dl 368 62
Dl 370 83
Dl 370 114
Dl 370 117
Dl 370 117
DP 0 0 0 0 61 1 21
Dl 827 -67
Dl 637 -67
Dl 582 -67
Dl 539 -67
Dl 505 -67
Dl 481 -68
Dl 464 -69
Dl 453 -71
Dl 446 -73
Dl 442 -76
Dl 440 -80
Dl 439 -81
Dl 425 -102
Dl 402 -127
Dl 376 -153
Dl 347 -176
Dl 330 -188
Dl 272 -218
Dl 210 -236
Dl 146 -243
Dl 82 -238
Dl 19 -221
Dl -40 -194
Dl -94 -155
Dl -100 -149
Dl -121 -128
Dl -140 -107
Dl -153 -91
Dl -154 -89
Dl -168 -67
Dl -504 -67
Dl -841 -67
Dl -839 -192
Dl -838 -236
Dl -837 -269
Dl -836 -292
Dl -834 -309
Dl -831 -321
Dl -827 -331
Dl -821 -340
Dl -818 -344
Dl -801 -364
Dl -781 -383
Dl -776 -387
Dl -751 -403
Dl -7 -403
Dl 738 -403
Dl 764 -385
Dl 784 -368
Dl 803 -348
Dl 807 -342
Dl 812 -333
Dl 817 -324
Dl 820 -313
Dl 822 -297
Dl 823 -275
Dl 824 -244
Dl 825 -203
Dl 825 -192
Dl 827 -67
Dl 827 -67
DP 0 0 0 0 24 1 21
Dl -478 -425
Dl -478 -425
Dl -485 -423
Dl -503 -421
Dl -529 -420
Dl -554 -420
Dl -587 -420
Dl -608 -421
Dl -621 -424
Dl -626 -427
Dl -627 -430
Dl -624 -443
Dl -620 -456
Dl -617 -464
Dl -611 -469
Dl -601 -472
Dl -584 -473
Dl -557 -473
Dl -550 -473
Dl -487 -473
Dl -481 -452
Dl -478 -435
Dl -478 -425
Dl -478 -425
DP 0 0 0 0 46 1 21
Dl 267 -425
Dl 260 -424
Dl 242 -423
Dl 213 -422
Dl 175 -421
Dl 129 -421
Dl 76 -420
Dl 60 -420
Dl 60 -484
Dl 60 -513
Dl -7 -513
Dl -73 -513
Dl -73 -484
Dl -73 -454
Dl -12 -452
Dl 16 -451
Dl 38 -451
Dl 52 -452
Dl 55 -452
Dl 58 -459
Dl 60 -475
Dl 60 -484
Dl 60 -420
Dl 19 -420
Dl -14 -420
Dl -74 -420
Dl -129 -420
Dl -178 -421
Dl -220 -422
Dl -254 -422
Dl -278 -423
Dl -291 -424
Dl -292 -425
Dl -288 -432
Dl -278 -448
Dl -263 -470
Dl -251 -488
Dl -211 -547
Dl -8 -545
Dl 196 -543
Dl 231 -487
Dl 246 -463
Dl 258 -442
Dl 265 -429
Dl 267 -425
Dl 267 -425
DP 0 0 0 0 22 1 21
Dl 655 -428
Dl 655 -424
Dl 647 -422
Dl 629 -421
Dl 604 -421
Dl 573 -420
Dl 540 -420
Dl 508 -420
Dl 478 -421
Dl 454 -421
Dl 438 -423
Dl 433 -424
Dl 436 -431
Dl 442 -447
Dl 447 -460
Dl 462 -493
Dl 547 -493
Dl 632 -493
Dl 645 -460
Dl 652 -442
Dl 655 -428
Dl 655 -428
$EndMODULE 
$EndLIBRARY
