EESchema Schematic File Version 2  date 10/06/2013 12:32:57
LIBS:power
LIBS:device
LIBS:transistors
LIBS:conn
LIBS:linear
LIBS:regul
LIBS:74xx
LIBS:cmos4000
LIBS:adc-dac
LIBS:memory
LIBS:xilinx
LIBS:special
LIBS:microcontrollers
LIBS:dsp
LIBS:microchip
LIBS:analog_switches
LIBS:motorola
LIBS:texas
LIBS:intel
LIBS:audio
LIBS:interface
LIBS:digital-audio
LIBS:philips
LIBS:display
LIBS:cypress
LIBS:siliconi
LIBS:opto
LIBS:atmel
LIBS:contrib
LIBS:valves
LIBS:MEMS
LIBS:mcp1702
LIBS:rcnet-cache
EELAYER 25  0
EELAYER END
$Descr A4 11700 8267
encoding utf-8
Sheet 1 1
Title ""
Date "7 jun 2013"
Rev ""
Comp ""
Comment1 ""
Comment2 ""
Comment3 ""
Comment4 ""
$EndDescr
Wire Wire Line
	900  5950 900  6000
Wire Wire Line
	6250 7450 6750 7450
Wire Wire Line
	8250 6000 8300 6000
Wire Wire Line
	9450 4400 9450 4450
Wire Wire Line
	9250 4400 9250 4450
Wire Wire Line
	2700 6400 2700 6600
Wire Wire Line
	8150 2250 8000 2250
Wire Wire Line
	9600 6250 9550 6250
Wire Wire Line
	10650 6250 10750 6250
Wire Wire Line
	10650 2250 10650 2300
Wire Wire Line
	10450 2250 10450 2300
Wire Wire Line
	10250 2250 10250 2300
Wire Wire Line
	10050 2250 10050 2300
Wire Wire Line
	8800 3500 8800 3550
Wire Wire Line
	8600 3500 8600 3550
Wire Wire Line
	8400 3500 8400 3550
Wire Wire Line
	8200 3500 8200 3550
Wire Wire Line
	9050 1000 9050 1400
Wire Wire Line
	9150 1600 9150 1000
Wire Wire Line
	11050 4800 11050 5050
Wire Wire Line
	10600 4400 11050 4400
Wire Wire Line
	10100 4400 9950 4400
Wire Wire Line
	8650 6700 8750 6700
Wire Wire Line
	8150 6700 8100 6700
Wire Wire Line
	7700 6850 7600 6850
Wire Wire Line
	9350 4950 9350 5050
Wire Wire Line
	2600 6400 2600 6600
Wire Wire Line
	2400 6400 2400 6600
Connection ~ 4200 2150
Wire Wire Line
	4400 2150 4400 2200
Wire Wire Line
	4400 2150 4100 2150
Connection ~ 4200 2550
Wire Wire Line
	4350 2550 4350 2500
Wire Wire Line
	4350 2550 4050 2550
Wire Wire Line
	800  850  1450 850 
Wire Wire Line
	7650 3500 7650 3550
Wire Wire Line
	7450 3500 7450 3550
Wire Wire Line
	7250 3500 7250 3550
Wire Wire Line
	6500 2550 6600 2550
Wire Wire Line
	2950 850  2250 850 
Wire Wire Line
	1550 950  1450 950 
Wire Wire Line
	1450 950  1450 850 
Wire Wire Line
	9000 3500 9000 3650
Connection ~ 10650 4250
Wire Wire Line
	10700 4250 9950 4250
Connection ~ 10450 4250
Connection ~ 10250 4250
Connection ~ 10050 4250
Connection ~ 10700 3650
Wire Wire Line
	10750 3650 10000 3650
Connection ~ 10500 3650
Connection ~ 10300 3650
Connection ~ 10100 3650
Wire Wire Line
	3900 6400 3900 6750
Wire Wire Line
	4800 6400 4800 6750
Connection ~ 1950 1350
Wire Wire Line
	5300 6400 5300 6750
Wire Wire Line
	5100 6400 5100 6750
Wire Wire Line
	9950 6800 10050 6800
Wire Wire Line
	10050 6800 10050 6550
Wire Wire Line
	10050 6550 10000 6550
Wire Wire Line
	2800 3800 2800 3550
Wire Wire Line
	4200 3550 4200 3800
Wire Wire Line
	9550 3350 9550 3450
Wire Wire Line
	9350 3350 9350 3450
Wire Wire Line
	9700 2250 9700 2350
Wire Wire Line
	9400 2250 9400 2350
Wire Wire Line
	9500 2250 9500 2350
Wire Wire Line
	8100 4050 8100 4200
Wire Wire Line
	8200 4050 8200 4200
Wire Wire Line
	8400 4050 8400 4200
Wire Wire Line
	8300 4050 8300 4200
Wire Wire Line
	8700 4050 8700 4200
Wire Wire Line
	8800 4050 8800 4200
Wire Wire Line
	8600 4050 8600 4200
Wire Wire Line
	8500 4050 8500 4200
Wire Wire Line
	9950 1000 9950 1100
Wire Wire Line
	10650 2800 10650 2950
Wire Wire Line
	10450 2800 10450 2950
Wire Wire Line
	10250 2800 10250 2950
Wire Wire Line
	10050 2800 10050 2950
Wire Wire Line
	5900 3550 5900 3800
Wire Wire Line
	4100 3550 4100 3800
Wire Wire Line
	3600 3550 3600 3800
Wire Wire Line
	7550 4500 7550 4600
Wire Wire Line
	7350 4500 7350 4600
Wire Wire Line
	7150 4500 7150 4600
Wire Wire Line
	750  7050 800  7050
Wire Wire Line
	4900 3550 4900 3800
Wire Wire Line
	9250 1000 9250 1100
Wire Wire Line
	8850 1000 8750 1000
Wire Wire Line
	2500 3550 2500 3800
Wire Wire Line
	2300 3550 2300 3800
Wire Wire Line
	4000 3550 4000 3800
Wire Wire Line
	5300 3550 5300 3800
Wire Wire Line
	5100 3550 5100 3800
Wire Wire Line
	3400 6400 3400 6750
Wire Wire Line
	3500 6400 3500 6750
Wire Wire Line
	3700 6400 3700 6750
Wire Wire Line
	3600 6400 3600 6750
Wire Wire Line
	3200 6400 3200 6750
Wire Wire Line
	3300 6400 3300 6750
Wire Wire Line
	3100 6400 3100 6750
Wire Notes Line
	3850 2950 3850 650 
Wire Notes Line
	3850 2950 8350 2950
Wire Notes Line
	8350 2950 8350 650 
Wire Notes Line
	8350 650  3850 650 
Wire Wire Line
	6600 2400 6500 2400
Wire Wire Line
	8150 2550 8000 2550
Wire Wire Line
	7000 1550 6850 1550
Wire Wire Line
	6850 1400 6800 1400
Wire Wire Line
	7450 1350 7450 1550
Wire Wire Line
	5650 2500 5750 2500
Wire Wire Line
	5650 2200 5750 2200
Wire Wire Line
	4450 2400 4450 2500
Wire Wire Line
	4450 2300 4450 2200
Connection ~ 2150 1350
Wire Wire Line
	2250 1350 1400 1350
Connection ~ 2750 850 
Connection ~ 1550 1350
Connection ~ 900  850 
Wire Notes Line
	600  3050 600  1700
Wire Notes Line
	600  3050 3700 3050
Wire Notes Line
	3700 3050 3700 1700
Wire Notes Line
	3700 1700 600  1700
Connection ~ 3150 1800
Wire Wire Line
	3150 1900 3150 1800
Connection ~ 1850 1800
Wire Wire Line
	1850 1800 1850 2600
Connection ~ 1300 1800
Wire Wire Line
	1550 1800 1550 1900
Connection ~ 1550 2550
Wire Wire Line
	1550 2400 1550 2550
Wire Wire Line
	1300 1800 1300 1900
Connection ~ 2900 2900
Wire Wire Line
	2900 2400 2900 2900
Wire Wire Line
	3350 2550 2550 2550
Wire Wire Line
	2150 2550 950  2550
Wire Wire Line
	1850 1400 1850 1150
Wire Wire Line
	6400 6400 6400 6500
Connection ~ 6700 5150
Connection ~ 900  5350
Connection ~ 1650 7450
Wire Wire Line
	1650 7450 1650 7550
Connection ~ 1950 6800
Wire Wire Line
	1950 7050 1950 6500
Connection ~ 1350 6800
Wire Wire Line
	1350 7050 1350 6500
Wire Wire Line
	1500 6400 1500 6500
Wire Wire Line
	1500 6500 1350 6500
Wire Wire Line
	1800 6400 1800 6500
Wire Wire Line
	1800 6500 1950 6500
Wire Wire Line
	1350 7450 1950 7450
Connection ~ 900  5450
Connection ~ 6700 5050
Wire Wire Line
	6700 5350 6700 4950
Connection ~ 6700 5250
Wire Wire Line
	900  4950 900  5550
Connection ~ 900  5250
Connection ~ 1850 1350
Wire Notes Line
	600  650  600  1500
Wire Wire Line
	1650 2900 950  2900
Wire Wire Line
	3350 2900 2050 2900
Wire Wire Line
	3150 2400 3150 2550
Connection ~ 3150 2550
Wire Wire Line
	1300 2400 1300 2900
Connection ~ 1300 2900
Wire Wire Line
	900  1800 2350 1800
Wire Wire Line
	2350 1800 2350 2250
Connection ~ 1550 1800
Wire Wire Line
	2900 1900 2900 1800
Wire Wire Line
	2900 1800 3350 1800
Wire Wire Line
	900  1350 1000 1350
Wire Wire Line
	2750 1350 2650 1350
Wire Notes Line
	600  650  3150 650 
Wire Notes Line
	3150 650  3150 1500
Wire Notes Line
	3150 1500 600  1500
Wire Wire Line
	4450 2200 4400 2200
Wire Wire Line
	4450 2500 4350 2500
Wire Wire Line
	5650 2300 5750 2300
Wire Wire Line
	7450 850  7450 950 
Wire Wire Line
	7450 1400 7500 1400
Connection ~ 7450 1400
Wire Wire Line
	6850 850  6850 950 
Connection ~ 6850 1400
Wire Wire Line
	6850 1550 6850 1350
Wire Wire Line
	7300 1400 7300 1550
Wire Wire Line
	7150 1350 7150 1550
Wire Wire Line
	7150 850  7150 950 
Wire Wire Line
	7600 1550 7750 1550
Wire Wire Line
	7750 1550 7750 1350
Wire Wire Line
	7750 850  7750 950 
Wire Wire Line
	6600 2250 6500 2250
Wire Wire Line
	8000 2550 8000 2700
Wire Wire Line
	3000 6400 3000 6750
Wire Wire Line
	5200 3800 5200 3550
Wire Wire Line
	3900 3550 3900 3800
Wire Wire Line
	2200 3550 2200 3800
Wire Wire Line
	2400 3550 2400 3800
Wire Wire Line
	8750 1000 8750 1100
Wire Wire Line
	8950 1000 8950 1100
Wire Wire Line
	4800 3550 4800 3800
Wire Wire Line
	1200 7050 1200 6400
Connection ~ 1200 6800
Wire Wire Line
	7050 4500 7050 4600
Wire Wire Line
	7250 4500 7250 4600
Wire Wire Line
	7450 4500 7450 4600
Wire Wire Line
	5700 3550 5700 3800
Wire Wire Line
	3700 3800 3700 3550
Wire Wire Line
	9950 2800 9950 2950
Wire Wire Line
	10150 2800 10150 2950
Wire Wire Line
	10350 2800 10350 2950
Wire Wire Line
	10550 2800 10550 2950
Wire Wire Line
	9850 1000 9850 1100
Wire Wire Line
	9600 2250 9600 2350
Wire Wire Line
	9250 3350 9250 3450
Wire Wire Line
	9450 3350 9450 3450
Wire Wire Line
	9300 6550 9500 6550
Wire Wire Line
	9550 6800 9350 6800
Wire Wire Line
	5200 6400 5200 6750
Wire Wire Line
	5400 6400 5400 6750
Wire Wire Line
	4900 6400 4900 6750
Wire Wire Line
	4000 6400 4000 6750
Connection ~ 10200 3650
Connection ~ 10400 3650
Connection ~ 10600 3650
Connection ~ 10150 4250
Connection ~ 10350 4250
Connection ~ 10550 4250
Wire Wire Line
	8900 3500 8900 3650
Wire Wire Line
	2150 950  2250 950 
Wire Wire Line
	2250 950  2250 850 
Wire Wire Line
	6500 2700 6600 2700
Wire Wire Line
	7350 3500 7350 3550
Wire Wire Line
	7550 3500 7550 3550
Wire Wire Line
	7750 3500 7750 3550
Wire Wire Line
	3500 3800 3500 3550
Wire Wire Line
	2500 6400 2500 6600
Wire Wire Line
	9250 4950 9250 5050
Wire Wire Line
	9450 4950 9450 5050
Wire Wire Line
	2100 3800 2100 3550
Wire Wire Line
	8100 6850 7900 6850
Wire Wire Line
	8100 6700 8100 7000
Wire Wire Line
	8100 7000 8150 7000
Connection ~ 8100 6850
Wire Wire Line
	8650 7000 8750 7000
Wire Wire Line
	10100 4500 9950 4500
Wire Wire Line
	10600 4500 10800 4500
Wire Wire Line
	10800 4900 10800 5050
Wire Wire Line
	8650 1600 8550 1600
Wire Wire Line
	8100 3500 8100 3550
Wire Wire Line
	8300 3500 8300 3550
Wire Wire Line
	8500 3500 8500 3550
Wire Wire Line
	8700 3500 8700 3550
Wire Wire Line
	9950 2250 9950 2300
Wire Wire Line
	10150 2250 10150 2300
Wire Wire Line
	10350 2250 10350 2300
Wire Wire Line
	10550 2250 10550 2300
Wire Wire Line
	6400 3550 6400 3800
Wire Wire Line
	10000 6250 10150 6250
Wire Wire Line
	10100 6250 10100 6050
Connection ~ 10100 6250
Wire Wire Line
	8000 2400 8050 2400
Wire Wire Line
	9650 3350 9650 3450
Wire Wire Line
	9350 4400 9350 4450
Wire Wire Line
	8800 6000 8850 6000
Wire Wire Line
	900  5550 850  5550
$Comp
L GND #PWR01
U 1 1 51B078BF
P 900 6000
F 0 "#PWR01" H 900 6000 30  0001 C CNN
F 1 "GND" H 900 5930 30  0001 C CNN
	1    900  6000
	1    0    0    -1  
$EndComp
$Comp
L C C8
U 1 1 51B078B5
P 900 5750
F 0 "C8" H 950 5850 50  0000 L CNN
F 1 "0.1µF" H 950 5650 50  0000 L CNN
	1    900  5750
	1    0    0    -1  
$EndComp
Text GLabel 6250 7450 0    40   Input ~ 0
GNDP
$Comp
L GND #PWR02
U 1 1 51AF20C9
P 6750 7450
F 0 "#PWR02" H 6750 7450 30  0001 C CNN
F 1 "GND" H 6750 7380 30  0001 C CNN
	1    6750 7450
	0    -1   -1   0   
$EndComp
Text GLabel 10700 4250 2    40   Input ~ 0
GNDP
Text GLabel 8900 3650 3    40   Input ~ 0
GNDP
$Comp
L CONN_6 P1
U 1 1 51AF1ED4
P 10100 650
F 0 "P1" V 10050 650 60  0000 C CNN
F 1 "UARTS" V 10150 650 60  0000 C CNN
	1    10100 650 
	0    -1   -1   0   
$EndComp
$Comp
L PWR_FLAG #FLG03
U 1 1 51AF1D9F
P 8850 6000
F 0 "#FLG03" H 8850 6095 30  0001 C CNN
F 1 "PWR_FLAG" H 8850 6180 30  0000 C CNN
	1    8850 6000
	0    1    1    0   
$EndComp
Text GLabel 700  6800 0    40   Input ~ 0
F5V
Text GLabel 3350 1800 2    40   Input ~ 0
F5V
Text GLabel 9950 1100 3    40   Input ~ 0
F5V
Text GLabel 800  850  0    40   Input ~ 0
F5V
Text GLabel 850  5550 0    40   Input ~ 0
F5V
Text GLabel 8250 6000 0    40   Output ~ 0
F5V
$Comp
L +5V #PWR04
U 1 1 51AF1C86
P 8850 6000
F 0 "#PWR04" H 8850 6090 20  0001 C CNN
F 1 "+5V" H 8850 6090 30  0000 C CNN
	1    8850 6000
	0    1    1    0   
$EndComp
$Comp
L FUSE F1
U 1 1 51AF1C58
P 8550 6000
F 0 "F1" H 8650 6050 40  0000 C CNN
F 1 "FUSE" H 8450 5950 40  0000 C CNN
F 3 "http://fr.mouser.com/ProductDetail/Littelfuse/0603L075SLYR/?qs=sGAEpiMZZMsxR%252bBXi4wRUM0ZZQWaZ4n0%2fXJ3vIuEau0%3d" H 8550 6000 60  0001 C CNN
	1    8550 6000
	1    0    0    -1  
$EndComp
$Comp
L R R37
U 1 1 51AF1A54
P 10050 1250
F 0 "R37" V 10130 1250 50  0000 C CNN
F 1 "2k" V 10050 1250 50  0000 C CNN
	1    10050 1250
	1    0    0    -1  
$EndComp
$Comp
L R R38
U 1 1 51AF1A53
P 10150 1250
F 0 "R38" V 10230 1250 50  0000 C CNN
F 1 "2k" V 10150 1250 50  0000 C CNN
	1    10150 1250
	1    0    0    -1  
$EndComp
$Comp
L R R36
U 1 1 51AF1A52
P 10350 1250
F 0 "R36" V 10430 1250 50  0000 C CNN
F 1 "2k" V 10350 1250 50  0000 C CNN
	1    10350 1250
	1    0    0    -1  
$EndComp
$Comp
L R R35
U 1 1 51AF1A51
P 10250 1250
F 0 "R35" V 10330 1250 50  0000 C CNN
F 1 "2k" V 10250 1250 50  0000 C CNN
	1    10250 1250
	1    0    0    -1  
$EndComp
$Comp
L R R32
U 1 1 51AF1A0C
P 9250 4700
F 0 "R32" V 9330 4700 50  0000 C CNN
F 1 "2k" V 9250 4700 50  0000 C CNN
	1    9250 4700
	1    0    0    -1  
$EndComp
$Comp
L R R33
U 1 1 51AF1A0B
P 9350 4700
F 0 "R33" V 9430 4700 50  0000 C CNN
F 1 "2k" V 9350 4700 50  0000 C CNN
	1    9350 4700
	1    0    0    -1  
$EndComp
$Comp
L R R34
U 1 1 51AF1A0A
P 9450 4700
F 0 "R34" V 9530 4700 50  0000 C CNN
F 1 "2k" V 9450 4700 50  0000 C CNN
	1    9450 4700
	1    0    0    -1  
$EndComp
Text GLabel 9650 3450 3    40   Input ~ 0
STABLE
$Comp
L CONN_5 P3
U 1 1 51ADA94E
P 9450 2950
F 0 "P3" V 9400 2950 50  0000 C CNN
F 1 "AUX" V 9500 2950 50  0000 C CNN
	1    9450 2950
	0    -1   -1   0   
$EndComp
Text GLabel 2700 6600 3    40   Input ~ 0
MPU_INT
Text GLabel 8050 2400 2    40   Output ~ 0
MPU_INT
$Comp
L GND #PWR05
U 1 1 51ADA86B
P 8150 2250
F 0 "#PWR05" H 8150 2250 30  0001 C CNN
F 1 "GND" H 8150 2180 30  0001 C CNN
	1    8150 2250
	0    -1   -1   0   
$EndComp
$Comp
L GND #PWR06
U 1 1 51ADA839
P 9550 6250
F 0 "#PWR06" H 9550 6250 30  0001 C CNN
F 1 "GND" H 9550 6180 30  0001 C CNN
	1    9550 6250
	0    1    1    0   
$EndComp
Text GLabel 10100 6050 1    40   Input ~ 0
RSSI
$Comp
L C C7
U 1 1 51ADA810
P 9800 6250
F 0 "C7" H 9850 6350 50  0000 L CNN
F 1 "0.1µF" H 9850 6150 50  0000 L CNN
	1    9800 6250
	0    -1   -1   0   
$EndComp
$Comp
L R R28
U 1 1 51ADA80B
P 10400 6250
F 0 "R28" V 10480 6250 50  0000 C CNN
F 1 "10k" V 10400 6250 50  0000 C CNN
	1    10400 6250
	0    -1   -1   0   
$EndComp
$Comp
L CONN_1 RSSI1
U 1 1 51ADA7FC
P 10900 6250
F 0 "RSSI1" H 10980 6250 40  0000 L CNN
F 1 "CONN_1" H 10900 6305 30  0001 C CNN
	1    10900 6250
	1    0    0    -1  
$EndComp
Text GLabel 6400 3550 1    40   Input ~ 0
RSSI
$Comp
L R R23
U 1 1 51ADA758
P 9950 2550
F 0 "R23" V 10030 2550 50  0000 C CNN
F 1 "2k" V 9950 2550 50  0000 C CNN
	1    9950 2550
	1    0    0    -1  
$EndComp
$Comp
L R R24
U 1 1 51ADA757
P 10050 2550
F 0 "R24" V 10130 2550 50  0000 C CNN
F 1 "2k" V 10050 2550 50  0000 C CNN
	1    10050 2550
	1    0    0    -1  
$EndComp
$Comp
L R R26
U 1 1 51ADA756
P 10250 2550
F 0 "R26" V 10330 2550 50  0000 C CNN
F 1 "2k" V 10250 2550 50  0000 C CNN
	1    10250 2550
	1    0    0    -1  
$EndComp
$Comp
L R R25
U 1 1 51ADA755
P 10150 2550
F 0 "R25" V 10230 2550 50  0000 C CNN
F 1 "2k" V 10150 2550 50  0000 C CNN
	1    10150 2550
	1    0    0    -1  
$EndComp
$Comp
L R R30
U 1 1 51ADA754
P 10550 2550
F 0 "R30" V 10630 2550 50  0000 C CNN
F 1 "2k" V 10550 2550 50  0000 C CNN
	1    10550 2550
	1    0    0    -1  
$EndComp
$Comp
L R R31
U 1 1 51ADA753
P 10650 2550
F 0 "R31" V 10730 2550 50  0000 C CNN
F 1 "2k" V 10650 2550 50  0000 C CNN
	1    10650 2550
	1    0    0    -1  
$EndComp
$Comp
L R R29
U 1 1 51ADA752
P 10450 2550
F 0 "R29" V 10530 2550 50  0000 C CNN
F 1 "2k" V 10450 2550 50  0000 C CNN
	1    10450 2550
	1    0    0    -1  
$EndComp
$Comp
L R R27
U 1 1 51ADA751
P 10350 2550
F 0 "R27" V 10430 2550 50  0000 C CNN
F 1 "2k" V 10350 2550 50  0000 C CNN
	1    10350 2550
	1    0    0    -1  
$EndComp
$Comp
L R R19
U 1 1 51ADA705
P 8500 3800
F 0 "R19" V 8580 3800 50  0000 C CNN
F 1 "2k" V 8500 3800 50  0000 C CNN
	1    8500 3800
	1    0    0    -1  
$EndComp
$Comp
L R R20
U 1 1 51ADA704
P 8600 3800
F 0 "R20" V 8680 3800 50  0000 C CNN
F 1 "2k" V 8600 3800 50  0000 C CNN
	1    8600 3800
	1    0    0    -1  
$EndComp
$Comp
L R R22
U 1 1 51ADA703
P 8800 3800
F 0 "R22" V 8880 3800 50  0000 C CNN
F 1 "2k" V 8800 3800 50  0000 C CNN
	1    8800 3800
	1    0    0    -1  
$EndComp
$Comp
L R R21
U 1 1 51ADA702
P 8700 3800
F 0 "R21" V 8780 3800 50  0000 C CNN
F 1 "2k" V 8700 3800 50  0000 C CNN
	1    8700 3800
	1    0    0    -1  
$EndComp
$Comp
L R R17
U 1 1 51ADA6FD
P 8300 3800
F 0 "R17" V 8380 3800 50  0000 C CNN
F 1 "2k" V 8300 3800 50  0000 C CNN
	1    8300 3800
	1    0    0    -1  
$EndComp
$Comp
L R R18
U 1 1 51ADA6FC
P 8400 3800
F 0 "R18" V 8480 3800 50  0000 C CNN
F 1 "2k" V 8400 3800 50  0000 C CNN
	1    8400 3800
	1    0    0    -1  
$EndComp
$Comp
L R R16
U 1 1 51ADA2B1
P 8200 3800
F 0 "R16" V 8280 3800 50  0000 C CNN
F 1 "2k" V 8200 3800 50  0000 C CNN
	1    8200 3800
	1    0    0    -1  
$EndComp
$Comp
L R R15
U 1 1 51ADA29B
P 8100 3800
F 0 "R15" V 8180 3800 50  0000 C CNN
F 1 "2k" V 8100 3800 50  0000 C CNN
	1    8100 3800
	1    0    0    -1  
$EndComp
$Comp
L +3.3V #PWR07
U 1 1 50AE2A82
P 1900 3550
F 0 "#PWR07" H 1900 3510 30  0001 C CNN
F 1 "+3.3V" H 1900 3660 30  0000 C CNN
	1    1900 3550
	-1   0    0    1   
$EndComp
$Comp
L CONN_2 P13
U 1 1 50AE2A62
P 2000 3200
F 0 "P13" V 1950 3200 40  0000 C CNN
F 1 "CONN_2" V 2050 3200 40  0000 C CNN
	1    2000 3200
	0    1    -1   0   
$EndComp
$Comp
L R R14
U 1 1 50AE1ED2
P 8900 1600
F 0 "R14" V 8980 1600 50  0000 C CNN
F 1 "2k" V 8900 1600 50  0000 C CNN
	1    8900 1600
	0    -1   -1   0   
$EndComp
$Comp
L R R13
U 1 1 50AE1ECD
P 8800 1400
F 0 "R13" V 8880 1400 50  0000 C CNN
F 1 "2k" V 8800 1400 50  0000 C CNN
	1    8800 1400
	0    -1   -1   0   
$EndComp
$Comp
L GND #PWR08
U 1 1 50ADF90E
P 10800 5050
F 0 "#PWR08" H 10800 5050 30  0001 C CNN
F 1 "GND" H 10800 4980 30  0001 C CNN
	1    10800 5050
	1    0    0    -1  
$EndComp
$Comp
L GND #PWR09
U 1 1 50ADF909
P 11050 5050
F 0 "#PWR09" H 11050 5050 30  0001 C CNN
F 1 "GND" H 11050 4980 30  0001 C CNN
	1    11050 5050
	1    0    0    -1  
$EndComp
$Comp
L LED D4
U 1 1 50ADF8EE
P 10800 4700
F 0 "D4" H 10800 4800 50  0000 C CNN
F 1 "LED" H 10800 4600 50  0000 C CNN
	1    10800 4700
	0    1    1    0   
$EndComp
$Comp
L LED D5
U 1 1 50ADF8E8
P 11050 4600
F 0 "D5" H 11050 4700 50  0000 C CNN
F 1 "LED" H 11050 4500 50  0000 C CNN
	1    11050 4600
	0    1    1    0   
$EndComp
$Comp
L R R12
U 1 1 50ADF8E1
P 10350 4500
F 0 "R12" V 10430 4500 50  0000 C CNN
F 1 "320" V 10350 4500 50  0000 C CNN
	1    10350 4500
	0    -1   -1   0   
$EndComp
$Comp
L R R11
U 1 1 50ADF8DD
P 10350 4400
F 0 "R11" V 10430 4400 50  0000 C CNN
F 1 "320" V 10350 4400 50  0000 C CNN
	1    10350 4400
	0    -1   -1   0   
$EndComp
$Comp
L GND #PWR010
U 1 1 50ACCF00
P 8750 7000
F 0 "#PWR010" H 8750 7000 30  0001 C CNN
F 1 "GND" H 8750 6930 30  0001 C CNN
	1    8750 7000
	0    -1   -1   0   
$EndComp
$Comp
L +BATT #PWR011
U 1 1 50ACCEFA
P 8750 6700
F 0 "#PWR011" H 8750 6650 20  0001 C CNN
F 1 "+BATT" H 8750 6800 30  0000 C CNN
	1    8750 6700
	1    0    0    -1  
$EndComp
$Comp
L R R10
U 1 1 50ACCECD
P 8400 7000
F 0 "R10" V 8480 7000 50  0000 C CNN
F 1 "32.4k" V 8400 7000 50  0000 C CNN
	1    8400 7000
	0    -1   -1   0   
$EndComp
$Comp
L R R9
U 1 1 50ACCEC6
P 8400 6700
F 0 "R9" V 8480 6700 50  0000 C CNN
F 1 "76.8k" V 8400 6700 50  0000 C CNN
	1    8400 6700
	0    -1   -1   0   
$EndComp
Text GLabel 7600 6850 0    40   Input ~ 0
VBAT
$Comp
L CONN_2 P14
U 1 1 50ACCEA9
P 7800 6500
F 0 "P14" V 7750 6500 40  0000 C CNN
F 1 "CONN_2" V 7850 6500 40  0000 C CNN
	1    7800 6500
	0    -1   -1   0   
$EndComp
$Comp
L +3.3V #PWR012
U 1 1 508448A3
P 9500 2350
F 0 "#PWR012" H 9500 2310 30  0001 C CNN
F 1 "+3.3V" H 9500 2460 30  0000 C CNN
	1    9500 2350
	-1   0    0    1   
$EndComp
Text GLabel 9950 4500 0    40   Input ~ 0
STATUS
Text GLabel 9450 5050 3    40   Input ~ 0
C_PITCH
Text GLabel 9350 5050 3    40   Input ~ 0
C_ROLL
Text GLabel 9250 5050 3    40   Input ~ 0
C_TRIG
$Comp
L CONN_3 K1
U 1 1 5084429B
P 9350 4050
F 0 "K1" V 9300 4050 40  0000 C CNN
F 1 "CAM" V 9400 4050 40  0000 C CNN
	1    9350 4050
	0    -1   -1   0   
$EndComp
Text GLabel 2600 6600 3    40   Input ~ 0
C_PITCH
Text GLabel 2500 6600 3    40   Input ~ 0
C_ROLL
Text GLabel 2400 6600 3    40   Input ~ 0
C_TRIG
Text GLabel 3500 3550 1    40   Input ~ 0
STATUS
$Comp
L +3.3V #PWR013
U 1 1 5084259E
P 7350 3550
F 0 "#PWR013" H 7350 3510 30  0001 C CNN
F 1 "+3.3V" H 7350 3660 30  0000 C CNN
	1    7350 3550
	-1   0    0    1   
$EndComp
$Comp
L C C6
U 1 1 508400D7
P 4200 2350
F 0 "C6" H 4250 2450 50  0000 L CNN
F 1 "0.1µF" H 4250 2250 50  0000 L CNN
	1    4200 2350
	1    0    0    -1  
$EndComp
Text GLabel 8100 4200 3    40   Input ~ 0
THR
Text GLabel 7750 3550 3    40   Input ~ 0
TXD2
Text GLabel 7650 3550 3    40   Input ~ 0
RXD2
Text GLabel 7550 3550 3    40   Input ~ 0
MAG_DA
Text GLabel 7450 3550 3    40   Input ~ 0
MAG_CL
$Comp
L GND #PWR014
U 1 1 50830081
P 7250 3550
F 0 "#PWR014" H 7250 3550 30  0001 C CNN
F 1 "GND" H 7250 3480 30  0001 C CNN
	1    7250 3550
	1    0    0    -1  
$EndComp
$Comp
L CONN_6 P9
U 1 1 50830072
P 7500 3150
F 0 "P9" V 7450 3150 60  0000 C CNN
F 1 "EXTENTION" V 7550 3150 60  0000 C CNN
	1    7500 3150
	0    -1   -1   0   
$EndComp
Text GLabel 6500 2700 0    60   Input ~ 0
MAG_DA
Text GLabel 6500 2550 0    60   Input ~ 0
MAG_CL
$Comp
L MCP1702 IC1
U 1 1 5082FE50
P 1850 900
F 0 "IC1" H 2000 704 60  0000 C CNN
F 1 "MCP1702" H 1850 1100 60  0000 C CNN
	1    1850 900 
	1    0    0    -1  
$EndComp
$Comp
L +5V #PWR015
U 1 1 5082D23E
P 9000 3650
F 0 "#PWR015" H 9000 3740 20  0001 C CNN
F 1 "+5V" H 9000 3740 30  0000 C CNN
	1    9000 3650
	-1   0    0    1   
$EndComp
$Comp
L CONN_10 P7
U 1 1 5082D218
P 8550 3150
F 0 "P7" V 8500 3150 60  0000 C CNN
F 1 "RX" V 8600 3150 60  0000 C CNN
	1    8550 3150
	0    -1   -1   0   
$EndComp
$Comp
L +5V #PWR016
U 1 1 5082A2A7
P 10750 3650
F 0 "#PWR016" H 10750 3740 20  0001 C CNN
F 1 "+5V" H 10750 3740 30  0000 C CNN
	1    10750 3650
	1    0    0    -1  
$EndComp
$Comp
L CONN_8 P11
U 1 1 50829E62
P 10300 3900
F 0 "P11" V 10250 3900 60  0000 C CNN
F 1 "MOTEURSGND" V 10350 3900 60  0000 C CNN
	1    10300 3900
	0    -1   -1   0   
$EndComp
$Comp
L CONN_8 P12
U 1 1 50829E50
P 10350 3300
F 0 "P12" V 10300 3300 60  0000 C CNN
F 1 "MOTEURS5V" V 10400 3300 60  0000 C CNN
	1    10350 3300
	0    -1   -1   0   
$EndComp
$Comp
L C C5
U 1 1 508297C4
P 2150 1150
F 0 "C5" H 2200 1250 50  0000 L CNN
F 1 "1µF" H 2200 1050 50  0000 L CNN
	1    2150 1150
	1    0    0    -1  
$EndComp
$Comp
L C C3
U 1 1 508297AC
P 1550 1150
F 0 "C3" H 1600 1250 50  0000 L CNN
F 1 "1µF" H 1600 1050 50  0000 L CNN
	1    1550 1150
	1    0    0    -1  
$EndComp
$Comp
L PWR_FLAG #FLG017
U 1 1 506F4189
P 8900 2250
F 0 "#FLG017" H 8900 2345 30  0001 C CNN
F 1 "PWR_FLAG" H 8900 2430 30  0000 C CNN
	1    8900 2250
	0    1    1    0   
$EndComp
$Comp
L +BATT #PWR018
U 1 1 506E0B42
P 8900 2250
F 0 "#PWR018" H 8900 2200 20  0001 C CNN
F 1 "+BATT" H 8900 2350 30  0000 C CNN
	1    8900 2250
	1    0    0    1   
$EndComp
$Comp
L GND #PWR019
U 1 1 506E0AF9
P 8700 2250
F 0 "#PWR019" H 8700 2250 30  0001 C CNN
F 1 "GND" H 8700 2180 30  0001 C CNN
	1    8700 2250
	1    0    0    -1  
$EndComp
$Comp
L CONN_2 P8
U 1 1 506E0A78
P 8800 1900
F 0 "P8" V 8750 1900 50  0000 C CNN
F 1 "LIPO" V 8850 1900 50  0000 C CNN
	1    8800 1900
	0    -1   -1   0   
$EndComp
Text GLabel 10150 1500 3    40   Input ~ 0
TXD3
Text GLabel 10050 1500 3    40   Input ~ 0
RXD3
Text GLabel 3900 6750 3    40   Input ~ 0
RXD3
Text GLabel 4000 6750 3    40   Input ~ 0
TXD3
Text GLabel 4800 6750 3    40   Input ~ 0
RXD2
Text GLabel 4900 6750 3    40   Input ~ 0
TXD2
$Comp
L PWR_FLAG #FLG020
U 1 1 5015437E
P 1950 1350
F 0 "#FLG020" H 1950 1445 30  0001 C CNN
F 1 "PWR_FLAG" H 1950 1530 30  0000 C CNN
	1    1950 1350
	1    0    0    -1  
$EndComp
$Comp
L PWR_FLAG #FLG021
U 1 1 50154376
P 900 850
F 0 "#FLG021" H 900 945 30  0001 C CNN
F 1 "PWR_FLAG" H 900 1030 30  0000 C CNN
	1    900  850 
	1    0    0    -1  
$EndComp
Text GLabel 9300 6550 0    40   Input ~ 0
FLED
$Comp
L GND #PWR022
U 1 1 5015425A
P 9350 6800
F 0 "#PWR022" H 9350 6800 30  0001 C CNN
F 1 "GND" H 9350 6730 30  0001 C CNN
	1    9350 6800
	0    1    1    0   
$EndComp
$Comp
L LED D3
U 1 1 50154242
P 9750 6800
F 0 "D3" H 9750 6900 50  0000 C CNN
F 1 "LED" H 9750 6700 50  0000 C CNN
	1    9750 6800
	-1   0    0    1   
$EndComp
$Comp
L R R8
U 1 1 50154235
P 9750 6550
F 0 "R8" V 9830 6550 50  0000 C CNN
F 1 "580" V 9750 6550 50  0000 C CNN
	1    9750 6550
	0    -1   -1   0   
$EndComp
Text GLabel 2800 3550 1    40   Input ~ 0
FLED
NoConn ~ 2100 6400
NoConn ~ 2200 6400
NoConn ~ 2300 6400
NoConn ~ 2800 6400
NoConn ~ 5000 6400
NoConn ~ 6300 3800
NoConn ~ 6200 3800
NoConn ~ 6100 3800
NoConn ~ 6000 3800
NoConn ~ 5800 3800
NoConn ~ 4600 3800
NoConn ~ 3400 3800
NoConn ~ 3300 3800
NoConn ~ 3200 3800
NoConn ~ 3100 3800
NoConn ~ 3000 3800
NoConn ~ 2700 3800
NoConn ~ 2600 3800
NoConn ~ 1900 3800
NoConn ~ 1800 3800
NoConn ~ 1700 3800
NoConn ~ 1600 3800
NoConn ~ 1500 3800
NoConn ~ 1400 3800
NoConn ~ 1300 3800
NoConn ~ 1200 3800
Text GLabel 10350 1500 3    40   Input ~ 0
TXD1
Text GLabel 10250 1500 3    40   Input ~ 0
PPM_INT
Text GLabel 4200 3550 1    40   Input ~ 0
TXD1
NoConn ~ 6200 6400
NoConn ~ 5900 6400
NoConn ~ 5800 6400
NoConn ~ 5700 6400
Text GLabel 9950 4400 0    40   Input ~ 0
STABLE
Text GLabel 9550 3450 3    40   Input ~ 0
BUZZER
Text GLabel 9450 3450 3    40   Input ~ 0
PPM_INT
Text GLabel 9350 3450 3    40   Input ~ 0
SENSOR
Text GLabel 9250 3450 3    40   Input ~ 0
VBAT
$Comp
L GND #PWR023
U 1 1 50153D54
P 9400 2350
F 0 "#PWR023" H 9400 2350 30  0001 C CNN
F 1 "GND" H 9400 2280 30  0001 C CNN
	1    9400 2350
	1    0    0    -1  
$EndComp
Text GLabel 9700 2350 3    40   Input ~ 0
SDA_3v
Text GLabel 9600 2350 3    40   Input ~ 0
SCL_3v
$Comp
L CONN_4 P4
U 1 1 50153D21
P 9550 1900
F 0 "P4" V 9500 1900 50  0000 C CNN
F 1 "I2C" V 9600 1900 50  0000 C CNN
	1    9550 1900
	0    -1   -1   0   
$EndComp
Text GLabel 8200 4200 3    40   Input ~ 0
ROLL
Text GLabel 8300 4200 3    40   Input ~ 0
PITCH
Text GLabel 8400 4200 3    40   Input ~ 0
YAW
Text GLabel 8500 4200 3    40   Input ~ 0
AUX1
Text GLabel 8600 4200 3    40   Input ~ 0
AUX2
Text GLabel 8700 4200 3    40   Input ~ 0
AUX3
Text GLabel 8800 4200 3    40   Input ~ 0
AUX4
$Comp
L GND #PWR024
U 1 1 50153C40
P 9850 1100
F 0 "#PWR024" H 9850 1100 30  0001 C CNN
F 1 "GND" H 9850 1030 30  0001 C CNN
	1    9850 1100
	1    0    0    -1  
$EndComp
Text GLabel 10650 2950 3    40   Input ~ 0
PWM8
Text GLabel 10550 2950 3    40   Input ~ 0
PWM7
Text GLabel 10450 2950 3    40   Input ~ 0
PWM6
Text GLabel 10350 2950 3    40   Input ~ 0
PWM5
Text GLabel 10250 2950 3    40   Input ~ 0
PWM4
Text GLabel 10150 2950 3    40   Input ~ 0
PWM3
Text GLabel 10050 2950 3    40   Input ~ 0
PWM2
Text GLabel 9950 2950 3    40   Input ~ 0
PWM1
$Comp
L CONN_8 P6
U 1 1 501538E0
P 10300 1900
F 0 "P6" V 10250 1900 60  0000 C CNN
F 1 "MOTEURS" V 10350 1900 60  0000 C CNN
	1    10300 1900
	0    -1   -1   0   
$EndComp
NoConn ~ 5000 3800
NoConn ~ 5500 3800
NoConn ~ 5400 3800
NoConn ~ 6100 6400
NoConn ~ 6000 6400
NoConn ~ 5500 6400
NoConn ~ 4500 3800
NoConn ~ 4400 3800
NoConn ~ 4300 3800
NoConn ~ 4600 6400
NoConn ~ 4500 6400
NoConn ~ 4400 6400
NoConn ~ 4300 6400
NoConn ~ 4200 6400
NoConn ~ 4100 6400
Text GLabel 5900 3550 1    40   Input ~ 0
SENSOR
Text GLabel 3700 3550 1    40   Input ~ 0
STABLE
Text GLabel 4100 3550 1    40   Input ~ 0
PPM_INT
Text GLabel 5700 3550 1    40   Input ~ 0
VBAT
Text GLabel 3600 3550 1    40   Input ~ 0
BUZZER
$Comp
L GND #PWR025
U 1 1 50144EDC
P 7550 4600
F 0 "#PWR025" H 7550 4600 30  0001 C CNN
F 1 "GND" H 7550 4530 30  0001 C CNN
	1    7550 4600
	1    0    0    -1  
$EndComp
Text GLabel 7450 4600 3    40   Input ~ 0
RESET
Text GLabel 7350 4600 3    40   Input ~ 0
MOSI
Text GLabel 7250 4600 3    40   Input ~ 0
SCK
$Comp
L +5V #PWR026
U 1 1 50144EAA
P 7150 4600
F 0 "#PWR026" H 7150 4690 20  0001 C CNN
F 1 "+5V" H 7150 4690 30  0000 C CNN
	1    7150 4600
	-1   0    0    1   
$EndComp
Text GLabel 7050 4600 3    40   Input ~ 0
MISO
$Comp
L CONN_6 P5
U 1 1 50144E5F
P 7300 4150
F 0 "P5" V 7250 4150 60  0000 C CNN
F 1 "ICSP" V 7350 4150 60  0000 C CNN
	1    7300 4150
	0    -1   -1   0   
$EndComp
Text GLabel 750  7050 0    40   Input ~ 0
DTR
$Comp
L C C1
U 1 1 50144D7D
P 1000 7050
F 0 "C1" H 1050 7150 50  0000 L CNN
F 1 "0.1µF" H 900 6950 50  0000 L CNN
	1    1000 7050
	0    -1   -1   0   
$EndComp
Text GLabel 4900 3550 1    40   Input ~ 0
TX0
Text GLabel 4800 3550 1    40   Input ~ 0
RXI
Text GLabel 9250 1100 3    40   Input ~ 0
DTR
Text GLabel 8550 1600 0    40   Input ~ 0
TX0
Text GLabel 8550 1400 0    40   Input ~ 0
RXI
$Comp
L +5V #PWR027
U 1 1 50144C64
P 8950 1100
F 0 "#PWR027" H 8950 1190 20  0001 C CNN
F 1 "+5V" H 8950 1190 30  0000 C CNN
	1    8950 1100
	-1   0    0    1   
$EndComp
$Comp
L GND #PWR028
U 1 1 50144C51
P 8750 1100
F 0 "#PWR028" H 8750 1100 30  0001 C CNN
F 1 "GND" H 8750 1030 30  0001 C CNN
	1    8750 1100
	1    0    0    -1  
$EndComp
$Comp
L CONN_6 P2
U 1 1 50144C31
P 9000 650
F 0 "P2" V 8950 650 60  0000 C CNN
F 1 "FTDI" V 9050 650 60  0000 C CNN
	1    9000 650 
	0    -1   -1   0   
$EndComp
Text GLabel 2500 3550 1    40   Input ~ 0
PWM8
Text GLabel 5400 6750 3    40   Input ~ 0
PWM7
Text GLabel 5300 6750 3    40   Input ~ 0
PWM6
Text GLabel 5200 6750 3    40   Input ~ 0
PWM5
Text GLabel 5200 3550 1    40   Input ~ 0
PWM4
Text GLabel 5100 6750 3    40   Input ~ 0
PWM3
Text GLabel 5100 3550 1    40   Input ~ 0
PWM2
Text GLabel 5300 3550 1    40   Input ~ 0
PWM1
Text GLabel 3700 6750 3    40   Input ~ 0
AUX4
Text GLabel 3600 6750 3    40   Input ~ 0
AUX3
Text GLabel 3500 6750 3    40   Input ~ 0
AUX2
Text GLabel 3400 6750 3    40   Input ~ 0
AUX1
Text GLabel 3300 6750 3    40   Input ~ 0
YAW
Text GLabel 3200 6750 3    40   Input ~ 0
PITCH
Text GLabel 3100 6750 3    40   Input ~ 0
ROLL
Text GLabel 3000 6750 3    40   Input ~ 0
THR
Text Notes 4450 3050 0    60   ~ 0
Capteurs I2C
Text GLabel 6500 2400 0    40   Input ~ 0
SCL_3v
Text GLabel 6500 2250 0    40   Input ~ 0
SDA_3v
$Comp
L GND #PWR029
U 1 1 5012F8C4
P 8150 2550
F 0 "#PWR029" H 8150 2550 30  0001 C CNN
F 1 "GND" H 8150 2480 30  0001 C CNN
	1    8150 2550
	0    -1   -1   0   
$EndComp
$Comp
L GND #PWR030
U 1 1 5012F8A0
P 7750 850
F 0 "#PWR030" H 7750 850 30  0001 C CNN
F 1 "GND" H 7750 780 30  0001 C CNN
	1    7750 850 
	-1   0    0    1   
$EndComp
$Comp
L C C13
U 1 1 5012F88D
P 7750 1150
F 0 "C13" H 7800 1250 50  0000 L CNN
F 1 "0.1µF" H 7750 1050 50  0000 L CNN
	1    7750 1150
	1    0    0    -1  
$EndComp
$Comp
L GND #PWR031
U 1 1 5012F84A
P 7150 850
F 0 "#PWR031" H 7150 850 30  0001 C CNN
F 1 "GND" H 7150 780 30  0001 C CNN
	1    7150 850 
	-1   0    0    1   
$EndComp
$Comp
L C C11
U 1 1 5012F82A
P 7150 1150
F 0 "C11" H 7200 1250 50  0000 L CNN
F 1 "2.2nF" H 7050 1050 50  0000 L CNN
	1    7150 1150
	1    0    0    -1  
$EndComp
$Comp
L GND #PWR032
U 1 1 5012F7EE
P 7300 1400
F 0 "#PWR032" H 7300 1400 30  0001 C CNN
F 1 "GND" H 7300 1330 30  0001 C CNN
	1    7300 1400
	-1   0    0    1   
$EndComp
$Comp
L +3.3V #PWR033
U 1 1 5012F7C3
P 6800 1400
F 0 "#PWR033" H 6800 1360 30  0001 C CNN
F 1 "+3.3V" H 6800 1510 30  0000 C CNN
	1    6800 1400
	0    -1   -1   0   
$EndComp
$Comp
L GND #PWR034
U 1 1 5012F7B9
P 6850 850
F 0 "#PWR034" H 6850 850 30  0001 C CNN
F 1 "GND" H 6850 780 30  0001 C CNN
	1    6850 850 
	-1   0    0    1   
$EndComp
$Comp
L +3.3V #PWR035
U 1 1 5012F781
P 7500 1400
F 0 "#PWR035" H 7500 1360 30  0001 C CNN
F 1 "+3.3V" H 7500 1510 30  0000 C CNN
	1    7500 1400
	0    1    1    0   
$EndComp
$Comp
L GND #PWR036
U 1 1 5012F763
P 7450 850
F 0 "#PWR036" H 7450 850 30  0001 C CNN
F 1 "GND" H 7450 780 30  0001 C CNN
	1    7450 850 
	-1   0    0    1   
$EndComp
$Comp
L C C10
U 1 1 5012F639
P 6850 1150
F 0 "C10" H 6900 1250 50  0000 L CNN
F 1 "0.1µF" H 6650 1050 50  0000 L CNN
	1    6850 1150
	1    0    0    -1  
$EndComp
$Comp
L C C12
U 1 1 5012F5D9
P 7450 1150
F 0 "C12" H 7500 1250 50  0000 L CNN
F 1 "10nF" H 7500 1050 50  0000 L CNN
	1    7450 1150
	1    0    0    -1  
$EndComp
NoConn ~ 5650 2400
Text GLabel 5750 2200 2    40   Input ~ 0
SCL_3v
Text GLabel 5750 2300 2    40   BiDi ~ 0
SDA_3v
$Comp
L GND #PWR037
U 1 1 5012F432
P 5750 2500
F 0 "#PWR037" H 5750 2500 30  0001 C CNN
F 1 "GND" H 5750 2430 30  0001 C CNN
	1    5750 2500
	0    -1   -1   0   
$EndComp
$Comp
L GND #PWR038
U 1 1 5012F417
P 4050 2550
F 0 "#PWR038" H 4050 2550 30  0001 C CNN
F 1 "GND" H 4050 2480 30  0001 C CNN
	1    4050 2550
	0    1    1    0   
$EndComp
$Comp
L +3.3V #PWR039
U 1 1 5012F3DD
P 4100 2150
F 0 "#PWR039" H 4100 2110 30  0001 C CNN
F 1 "+3.3V" H 4100 2260 30  0000 C CNN
	1    4100 2150
	0    -1   -1   0   
$EndComp
$Comp
L MS5611 U1
U 1 1 5012F333
P 5000 2650
F 0 "U1" H 5000 2650 60  0000 C CNN
F 1 "MS5611" V 5050 2950 60  0000 C CNN
	1    5000 2650
	1    0    0    -1  
$EndComp
$Comp
L MPU6050 U3
U 1 1 5012F326
P 7400 1500
F 0 "U3" H 8050 2850 60  0000 C CNN
F 1 "MPU6050" V 7500 2400 60  0000 C CNN
	1    7400 1500
	-1   0    0    1   
$EndComp
$Comp
L LED D2
U 1 1 5011A71B
P 2450 1350
F 0 "D2" H 2450 1450 50  0000 C CNN
F 1 "LED" H 2450 1250 50  0000 C CNN
	1    2450 1350
	-1   0    0    1   
$EndComp
$Comp
L R R5
U 1 1 5011A715
P 2750 1100
F 0 "R5" V 2830 1100 50  0000 C CNN
F 1 "240" V 2750 1100 50  0000 C CNN
	1    2750 1100
	1    0    0    -1  
$EndComp
$Comp
L LED D1
U 1 1 5011A6C5
P 1200 1350
F 0 "D1" H 1200 1450 50  0000 C CNN
F 1 "LED" H 1200 1250 50  0000 C CNN
	1    1200 1350
	1    0    0    -1  
$EndComp
$Comp
L R R1
U 1 1 5011A693
P 900 1100
F 0 "R1" H 980 1100 50  0000 C CNN
F 1 "580" V 900 1100 50  0000 C CNN
	1    900  1100
	1    0    0    -1  
$EndComp
Text Notes 1400 3150 2    40   ~ 0
Conversion niveau I2C
$Comp
L +3.3V #PWR040
U 1 1 5011A477
P 900 1800
F 0 "#PWR040" H 900 1760 30  0001 C CNN
F 1 "+3.3V" H 900 1910 30  0000 C CNN
	1    900  1800
	0    -1   -1   0   
$EndComp
Text GLabel 950  2900 0    40   BiDi ~ 0
SCL_3v
Text GLabel 950  2550 0    40   BiDi ~ 0
SDA_3v
Text GLabel 3350 2900 2    40   BiDi ~ 0
SCL_5v
Text GLabel 3350 2550 2    40   BiDi ~ 0
SDA_5v
$Comp
L R R6
U 1 1 5011A3CA
P 2900 2150
F 0 "R6" V 2980 2150 50  0000 C CNN
F 1 "10k" V 2900 2150 50  0000 C CNN
	1    2900 2150
	1    0    0    -1  
$EndComp
$Comp
L R R7
U 1 1 5011A3C9
P 3150 2150
F 0 "R7" V 3230 2150 50  0000 C CNN
F 1 "10k" V 3150 2150 50  0000 C CNN
	1    3150 2150
	1    0    0    -1  
$EndComp
$Comp
L R R4
U 1 1 5011A3BF
P 1550 2150
F 0 "R4" V 1630 2150 50  0000 C CNN
F 1 "10k" V 1550 2150 50  0000 C CNN
	1    1550 2150
	1    0    0    -1  
$EndComp
$Comp
L R R3
U 1 1 5011A3B4
P 1300 2150
F 0 "R3" V 1380 2150 50  0000 C CNN
F 1 "10k" V 1300 2150 50  0000 C CNN
	1    1300 2150
	1    0    0    -1  
$EndComp
$Comp
L CEMFET Q2
U 1 1 5011A364
P 2350 2450
F 0 "Q2" H 2360 2620 60  0000 R CNN
F 1 "2N7002" H 2360 2300 60  0000 R CNN
	1    2350 2450
	0    1    1    0   
$EndComp
$Comp
L CEMFET Q1
U 1 1 5011A348
P 1850 2800
F 0 "Q1" H 1860 2970 60  0000 R CNN
F 1 "2N7002" H 1860 2650 60  0000 R CNN
	1    1850 2800
	0    1    1    0   
$EndComp
Text GLabel 4000 3550 1    40   BiDi ~ 0
SDA_5v
Text GLabel 3900 3550 1    40   Output ~ 0
SCL_5v
Text Notes 750  1650 0    60   ~ 0
Alimentation 3.3v
$Comp
L +3.3V #PWR041
U 1 1 50119A68
P 2950 850
F 0 "#PWR041" H 2950 810 30  0001 C CNN
F 1 "+3.3V" H 2950 960 30  0000 C CNN
	1    2950 850 
	1    0    0    -1  
$EndComp
$Comp
L GND #PWR042
U 1 1 50119A51
P 1850 1400
F 0 "#PWR042" H 1850 1400 30  0001 C CNN
F 1 "GND" H 1850 1330 30  0001 C CNN
	1    1850 1400
	1    0    0    -1  
$EndComp
Text GLabel 2200 3550 1    40   Input ~ 0
SCK
Text GLabel 2300 3550 1    40   BiDi ~ 0
MOSI
Text GLabel 2400 3550 1    40   BiDi ~ 0
MISO
$Comp
L GND #PWR043
U 1 1 500F052A
P 6400 6900
F 0 "#PWR043" H 6400 6900 30  0001 C CNN
F 1 "GND" H 6400 6830 30  0001 C CNN
	1    6400 6900
	1    0    0    -1  
$EndComp
$Comp
L C C9
U 1 1 500F050F
P 6400 6700
F 0 "C9" H 6450 6800 50  0000 L CNN
F 1 "0.1µF" H 6450 6600 50  0000 L CNN
	1    6400 6700
	1    0    0    -1  
$EndComp
Text Label 1200 6750 1    60   ~ 0
RESET
$Comp
L R R2
U 1 1 500F03CF
P 950 6800
F 0 "R2" V 1030 6800 50  0000 C CNN
F 1 "10k" V 950 6800 50  0000 C CNN
	1    950  6800
	0    1    1    0   
$EndComp
$Comp
L GND #PWR044
U 1 1 500F0332
P 6700 5350
F 0 "#PWR044" H 6700 5350 30  0001 C CNN
F 1 "GND" H 6700 5280 30  0001 C CNN
	1    6700 5350
	1    0    0    -1  
$EndComp
$Comp
L GND #PWR045
U 1 1 500F02F6
P 1650 7550
F 0 "#PWR045" H 1650 7550 30  0001 C CNN
F 1 "GND" H 1650 7480 30  0001 C CNN
	1    1650 7550
	1    0    0    -1  
$EndComp
$Comp
L C C4
U 1 1 500F02CC
P 1950 7250
F 0 "C4" H 2000 7350 50  0000 L CNN
F 1 "22pF" H 2000 7150 50  0000 L CNN
	1    1950 7250
	1    0    0    -1  
$EndComp
$Comp
L C C2
U 1 1 500F02C9
P 1350 7250
F 0 "C2" H 1400 7350 50  0000 L CNN
F 1 "22pF" H 1400 7150 50  0000 L CNN
	1    1350 7250
	1    0    0    -1  
$EndComp
$Comp
L CRYSTAL X1
U 1 1 500F02B9
P 1650 6800
F 0 "X1" H 1650 6950 60  0000 C CNN
F 1 "16MHz" H 1650 6650 60  0000 C CNN
	1    1650 6800
	1    0    0    -1  
$EndComp
$Comp
L ATMEGA2560-A IC2
U 1 1 500F0096
P 3800 5100
F 0 "IC2" H 2700 7850 50  0000 L BNN
F 1 "ATMEGA2560-A" H 4300 2300 50  0000 L BNN
F 2 "TQFP100" H 2850 2350 50  0001 C CNN
	1    3800 5100
	0    -1   -1   0   
$EndComp
$EndSCHEMATC
