PCBNEW-LibModule-V1
$INDEX
LOGO
$EndINDEX
#
# LOGO
# pixmap w = 279, h = 251
#
$MODULE LOGO
Po 0 0 0 15 00000000 00000000 ~~
Li LOGO
T0 0 4466 600 600 0 120 N I 21 "G***"
T1 0 -4466 600 600 0 120 N I 21 "LOGO"
DP 0 0 0 0 106 1 21
Dl 4129 1897
Dl 4128 2137
Dl 4127 2329
Dl 4123 2479
Dl 4118 2595
Dl 4111 2682
Dl 4102 2747
Dl 4091 2796
Dl 4081 2825
Dl 3990 2981
Dl 3850 3113
Dl 3682 3205
Dl 3594 3232
Dl 3537 3237
Dl 3417 3242
Dl 3243 3246
Dl 3018 3250
Dl 2748 3253
Dl 2438 3256
Dl 2095 3258
Dl 1724 3260
Dl 1329 3262
Dl 916 3263
Dl 492 3264
Dl 60 3264
Dl -373 3264
Dl -801 3263
Dl -1220 3262
Dl -1625 3260
Dl -2008 3258
Dl -2366 3256
Dl -2693 3253
Dl -2983 3249
Dl -3230 3246
Dl -3431 3241
Dl -3578 3237
Dl -3666 3232
Dl -3687 3229
Dl -3795 3188
Dl -3912 3119
Dl -3959 3082
Dl -4015 3034
Dl -4061 2987
Dl -4099 2937
Dl -4130 2876
Dl -4153 2799
Dl -4171 2699
Dl -4183 2571
Dl -4191 2407
Dl -4195 2202
Dl -4196 1949
Dl -4195 1642
Dl -4193 1275
Dl -4193 1250
Dl -4183 -183
Dl -2585 -192
Dl -2265 -193
Dl -1965 -193
Dl -1692 -192
Dl -1452 -190
Dl -1253 -187
Dl -1100 -184
Dl -1001 -179
Dl -961 -174
Dl -957 -131
Dl -976 -47
Dl -1001 28
Dl -1071 300
Dl -1090 597
Dl -1058 903
Dl -976 1204
Dl -892 1400
Dl -771 1593
Dl -608 1789
Dl -420 1968
Dl -228 2112
Dl -150 2157
Dl 169 2289
Dl 492 2358
Dl 813 2367
Dl 1125 2319
Dl 1421 2218
Dl 1696 2066
Dl 1942 1866
Dl 2152 1621
Dl 2322 1334
Dl 2442 1009
Dl 2453 967
Dl 2490 727
Dl 2489 461
Dl 2454 199
Dl 2405 23
Dl 2369 -92
Dl 2360 -159
Dl 2377 -186
Dl 2420 -189
Dl 2521 -192
Dl 2669 -194
Dl 2856 -194
Dl 3072 -194
Dl 3267 -192
Dl 4117 -183
Dl 4126 1250
Dl 4128 1604
Dl 4129 1897
Dl 4129 1897
DP 0 0 0 0 48 1 21
Dl 1850 584
Dl 1848 747
Dl 1839 863
Dl 1821 951
Dl 1789 1029
Dl 1770 1067
Dl 1607 1314
Dl 1410 1508
Dl 1185 1648
Dl 937 1729
Dl 673 1749
Dl 467 1722
Dl 196 1631
Dl -35 1488
Dl -229 1290
Dl -371 1067
Dl -410 982
Dl -433 896
Dl -446 787
Dl -450 636
Dl -450 600
Dl -447 439
Dl -437 321
Dl -415 225
Dl -377 128
Dl -361 94
Dl -227 -123
Dl -45 -314
Dl 167 -464
Dl 227 -494
Dl 339 -541
Dl 444 -568
Dl 568 -581
Dl 700 -583
Dl 858 -579
Dl 977 -564
Dl 1081 -534
Dl 1171 -495
Dl 1408 -352
Dl 1600 -166
Dl 1737 41
Dl 1789 142
Dl 1822 224
Dl 1840 308
Dl 1848 416
Dl 1850 568
Dl 1850 584
Dl 1850 584
DP 0 0 0 0 61 1 21
Dl 4137 -333
Dl 3186 -333
Dl 2910 -333
Dl 2693 -334
Dl 2527 -336
Dl 2406 -339
Dl 2321 -345
Dl 2266 -354
Dl 2232 -366
Dl 2212 -382
Dl 2199 -402
Dl 2196 -406
Dl 2124 -510
Dl 2012 -634
Dl 1878 -763
Dl 1737 -879
Dl 1652 -939
Dl 1360 -1091
Dl 1050 -1182
Dl 730 -1215
Dl 409 -1190
Dl 96 -1107
Dl -199 -968
Dl -468 -773
Dl -501 -743
Dl -606 -640
Dl -700 -537
Dl -764 -454
Dl -768 -447
Dl -839 -333
Dl -2522 -333
Dl -4205 -333
Dl -4194 -961
Dl -4190 -1180
Dl -4186 -1344
Dl -4180 -1462
Dl -4170 -1546
Dl -4156 -1606
Dl -4135 -1653
Dl -4107 -1698
Dl -4092 -1719
Dl -4006 -1821
Dl -3905 -1914
Dl -3878 -1933
Dl -3755 -2016
Dl -33 -2016
Dl 3689 -2016
Dl 3819 -1925
Dl 3921 -1839
Dl 4014 -1738
Dl 4033 -1711
Dl 4062 -1666
Dl 4084 -1620
Dl 4099 -1563
Dl 4110 -1485
Dl 4117 -1375
Dl 4122 -1222
Dl 4126 -1016
Dl 4127 -961
Dl 4137 -333
Dl 4137 -333
DP 0 0 0 0 24 1 21
Dl -2389 -2127
Dl -2390 -2125
Dl -2427 -2115
Dl -2517 -2107
Dl -2644 -2101
Dl -2769 -2100
Dl -2934 -2101
Dl -3042 -2107
Dl -3105 -2118
Dl -3131 -2136
Dl -3133 -2148
Dl -3122 -2214
Dl -3101 -2281
Dl -3083 -2321
Dl -3056 -2346
Dl -3007 -2359
Dl -2922 -2365
Dl -2787 -2366
Dl -2752 -2366
Dl -2435 -2366
Dl -2406 -2258
Dl -2390 -2177
Dl -2389 -2127
Dl -2389 -2127
DP 0 0 0 0 46 1 21
Dl 1333 -2126
Dl 1301 -2121
Dl 1209 -2116
Dl 1064 -2111
Dl 873 -2107
Dl 643 -2104
Dl 381 -2101
Dl 300 -2101
Dl 300 -2418
Dl 300 -2566
Dl -33 -2566
Dl -367 -2566
Dl -367 -2418
Dl -367 -2269
Dl -58 -2259
Dl 79 -2256
Dl 191 -2256
Dl 261 -2258
Dl 275 -2260
Dl 290 -2297
Dl 299 -2376
Dl 300 -2418
Dl 300 -2101
Dl 93 -2100
Dl -70 -2100
Dl -368 -2100
Dl -644 -2102
Dl -890 -2105
Dl -1102 -2108
Dl -1270 -2112
Dl -1390 -2117
Dl -1453 -2122
Dl -1461 -2125
Dl -1439 -2161
Dl -1388 -2240
Dl -1316 -2349
Dl -1253 -2442
Dl -1056 -2734
Dl -38 -2725
Dl 980 -2716
Dl 1157 -2435
Dl 1231 -2313
Dl 1290 -2212
Dl 1326 -2145
Dl 1333 -2126
Dl 1333 -2126
DP 0 0 0 0 22 1 21
Dl 3277 -2140
Dl 3275 -2119
Dl 3237 -2112
Dl 3147 -2107
Dl 3019 -2103
Dl 2866 -2101
Dl 2701 -2100
Dl 2538 -2101
Dl 2389 -2103
Dl 2269 -2107
Dl 2191 -2113
Dl 2167 -2119
Dl 2179 -2157
Dl 2210 -2237
Dl 2237 -2302
Dl 2308 -2466
Dl 2733 -2466
Dl 3158 -2466
Dl 3226 -2302
Dl 3261 -2208
Dl 3277 -2140
Dl 3277 -2140
$EndMODULE LOGO
$EndLIBRARY
