PCBNEW-LibModule-V1
$INDEX
qrcode2.mod
$EndINDEX
#
# qrcode2.mod
# pixmap w = 1015, h = 1015
#
$MODULE qrcode2.mod
Po 0 0 0 15 00000000 00000000 ~~
Li qrcode2.mod
T0 0 0 450 450 0 70 N I 21 "VAL"
T1 0 0 450 450 0 70 N I 21 "qrcode2.mod"
DP 0 0 0 0 13 1 21
Dl -567 1295
Dl -671 1295
Dl -671 1191
Dl -671 674
Dl -1188 674
Dl -1188 1191
Dl -671 1191
Dl -671 1295
Dl -1292 1295
Dl -1292 570
Dl -567 570
Dl -567 1295
Dl -567 1295
DP 0 0 0 0 6 1 21
Dl -981 -257
Dl -1188 -257
Dl -1188 -361
Dl -981 -361
Dl -981 -257
Dl -981 -257
DP 0 0 0 0 16 1 21
Dl -878 -50
Dl -981 -50
Dl -981 157
Dl -1085 157
Dl -1085 260
Dl -1188 260
Dl -1188 467
Dl -1292 467
Dl -1292 53
Dl -1188 53
Dl -1188 -50
Dl -1085 -50
Dl -1085 -154
Dl -878 -154
Dl -878 -50
Dl -878 -50
DP 0 0 0 0 6 1 21
Dl -774 -361
Dl -981 -361
Dl -981 -464
Dl -774 -464
Dl -774 -361
Dl -774 -361
DP 0 0 0 0 6 1 21
Dl -774 -154
Dl -878 -154
Dl -878 -257
Dl -774 -257
Dl -774 -154
Dl -774 -154
DP 0 0 0 0 6 1 21
Dl -774 53
Dl -878 53
Dl -878 -50
Dl -774 -50
Dl -774 53
Dl -774 53
DP 0 0 0 0 6 1 21
Dl -671 -257
Dl -774 -257
Dl -774 -361
Dl -671 -361
Dl -671 -257
Dl -671 -257
DP 0 0 0 0 6 1 21
Dl -671 157
Dl -774 157
Dl -774 53
Dl -671 53
Dl -671 157
Dl -671 157
DP 0 0 0 0 6 1 21
Dl -567 -154
Dl -671 -154
Dl -671 -257
Dl -567 -257
Dl -567 -154
Dl -567 -154
DP 0 0 0 0 6 1 21
Dl -567 53
Dl -671 53
Dl -671 -50
Dl -567 -50
Dl -567 53
Dl -567 53
DP 0 0 0 0 6 1 21
Dl -567 260
Dl -671 260
Dl -671 157
Dl -567 157
Dl -567 260
Dl -567 260
DP 0 0 0 0 6 1 21
Dl -464 -361
Dl -671 -361
Dl -671 -464
Dl -464 -464
Dl -464 -361
Dl -464 -361
DP 0 0 0 0 6 1 21
Dl -464 157
Dl -567 157
Dl -567 53
Dl -464 53
Dl -464 157
Dl -464 157
DP 0 0 0 0 6 1 21
Dl -361 -878
Dl -464 -878
Dl -464 -1085
Dl -361 -1085
Dl -361 -878
Dl -361 -878
DP 0 0 0 0 6 1 21
Dl -361 -567
Dl -464 -567
Dl -464 -671
Dl -361 -671
Dl -361 -567
Dl -361 -567
DP 0 0 0 0 6 1 21
Dl -257 -671
Dl -361 -671
Dl -361 -878
Dl -257 -878
Dl -257 -671
Dl -257 -671
DP 0 0 0 0 6 1 21
Dl -154 -1085
Dl -361 -1085
Dl -361 -1188
Dl -154 -1188
Dl -154 -1085
Dl -154 -1085
DP 0 0 0 0 6 1 21
Dl -154 -878
Dl -257 -878
Dl -257 -981
Dl -154 -981
Dl -154 -878
Dl -154 -878
DP 0 0 0 0 8 1 21
Dl -154 1088
Dl -257 1088
Dl -257 1191
Dl -361 1191
Dl -361 984
Dl -154 984
Dl -154 1088
Dl -154 1088
DP 0 0 0 0 8 1 21
Dl -50 -464
Dl -257 -464
Dl -257 -671
Dl -154 -671
Dl -154 -567
Dl -50 -567
Dl -50 -464
Dl -50 -464
DP 0 0 0 0 6 1 21
Dl -50 364
Dl -257 364
Dl -257 260
Dl -50 260
Dl -50 364
Dl -50 364
DP 0 0 0 0 6 1 21
Dl 53 -567
Dl -50 -567
Dl -50 -671
Dl 53 -671
Dl 53 -567
Dl 53 -567
DP 0 0 0 0 30 1 21
Dl 53 674
Dl -50 674
Dl -50 570
Dl -154 570
Dl -154 674
Dl -257 674
Dl -257 777
Dl -50 777
Dl -50 881
Dl -361 881
Dl -361 984
Dl -464 984
Dl -464 777
Dl -361 777
Dl -361 674
Dl -464 674
Dl -464 467
Dl -878 467
Dl -878 364
Dl -981 364
Dl -981 157
Dl -774 157
Dl -774 364
Dl -361 364
Dl -361 467
Dl -50 467
Dl -50 364
Dl 53 364
Dl 53 674
Dl 53 674
DP 0 0 0 0 10 1 21
Dl 157 -671
Dl 53 -671
Dl 53 -774
Dl -154 -774
Dl -154 -878
Dl -50 -878
Dl -50 -981
Dl 157 -981
Dl 157 -671
Dl 157 -671
DP 0 0 0 0 8 1 21
Dl 260 -464
Dl 53 -464
Dl 53 -567
Dl 157 -567
Dl 157 -671
Dl 260 -671
Dl 260 -464
Dl 260 -464
DP 0 0 0 0 8 1 21
Dl 260 260
Dl -50 260
Dl -50 53
Dl 53 53
Dl 53 157
Dl 260 157
Dl 260 260
Dl 260 260
DP 0 0 0 0 16 1 21
Dl 260 1191
Dl 157 1191
Dl 157 1088
Dl 53 1088
Dl 53 1191
Dl 157 1191
Dl 157 1295
Dl -154 1295
Dl -154 1191
Dl -50 1191
Dl -50 881
Dl 53 881
Dl 53 984
Dl 260 984
Dl 260 1191
Dl 260 1191
DP 0 0 0 0 40 1 21
Dl 570 -50
Dl 467 -50
Dl 467 260
Dl 364 260
Dl 364 -50
Dl 157 -50
Dl 157 -154
Dl 260 -154
Dl 260 -257
Dl 157 -257
Dl 157 -154
Dl 53 -154
Dl 53 -50
Dl -50 -50
Dl -50 -154
Dl -154 -154
Dl -154 -50
Dl -50 -50
Dl -50 53
Dl -257 53
Dl -257 157
Dl -361 157
Dl -361 -154
Dl -464 -154
Dl -464 -257
Dl -361 -257
Dl -361 -464
Dl -257 -464
Dl -257 -257
Dl 53 -257
Dl 53 -361
Dl 364 -361
Dl 364 -464
Dl 467 -464
Dl 467 -257
Dl 364 -257
Dl 364 -154
Dl 570 -154
Dl 570 -50
Dl 570 -50
DP 0 0 0 0 6 1 21
Dl 674 53
Dl 570 53
Dl 570 -50
Dl 674 -50
Dl 674 53
Dl 674 53
DP 0 0 0 0 6 1 21
Dl 777 -50
Dl 674 -50
Dl 674 -154
Dl 777 -154
Dl 777 -50
Dl 777 -50
DP 0 0 0 0 16 1 21
Dl 1191 -257
Dl 1088 -257
Dl 1088 -50
Dl 984 -50
Dl 984 -257
Dl 881 -257
Dl 881 -154
Dl 777 -154
Dl 777 -361
Dl 881 -361
Dl 881 -464
Dl 1088 -464
Dl 1088 -361
Dl 1191 -361
Dl 1191 -257
Dl 1191 -257
DP 0 0 0 0 6 1 21
Dl 1295 -154
Dl 1191 -154
Dl 1191 -257
Dl 1295 -257
Dl 1295 -154
Dl 1295 -154
DP 0 0 0 0 6 1 21
Dl 1295 53
Dl 1191 53
Dl 1191 -50
Dl 1295 -50
Dl 1295 53
Dl 1295 53
DP 0 0 0 0 63 1 21
Dl 1295 260
Dl 1191 260
Dl 1191 364
Dl 1088 364
Dl 1088 260
Dl 1088 157
Dl 984 157
Dl 984 260
Dl 1088 260
Dl 1088 364
Dl 1088 570
Dl 984 570
Dl 984 364
Dl 881 364
Dl 881 570
Dl 984 570
Dl 984 881
Dl 777 881
Dl 777 777
Dl 777 467
Dl 467 467
Dl 467 777
Dl 777 777
Dl 777 881
Dl 674 881
Dl 674 984
Dl 570 984
Dl 570 1088
Dl 364 1088
Dl 364 984
Dl 260 984
Dl 260 881
Dl 157 881
Dl 157 777
Dl 53 777
Dl 53 674
Dl 260 674
Dl 260 777
Dl 364 777
Dl 364 674
Dl 260 674
Dl 260 570
Dl 364 570
Dl 364 364
Dl 467 364
Dl 467 260
Dl 570 260
Dl 570 364
Dl 674 364
Dl 674 260
Dl 881 260
Dl 881 157
Dl 777 157
Dl 777 53
Dl 881 53
Dl 881 -50
Dl 984 -50
Dl 984 53
Dl 1191 53
Dl 1191 157
Dl 1295 157
Dl 1295 260
Dl 1295 260
DP 0 0 0 0 6 1 21
Dl 1295 467
Dl 1191 467
Dl 1191 364
Dl 1295 364
Dl 1295 467
Dl 1295 467
DP 0 0 0 0 10 1 21
Dl 1295 777
Dl 1191 777
Dl 1191 881
Dl 1088 881
Dl 1088 674
Dl 1191 674
Dl 1191 570
Dl 1295 570
Dl 1295 777
Dl 1295 777
DP 0 0 0 0 22 1 21
Dl 1295 1295
Dl 1191 1295
Dl 1191 1191
Dl 984 1191
Dl 984 1295
Dl 881 1295
Dl 881 1191
Dl 777 1191
Dl 777 1088
Dl 674 1088
Dl 674 984
Dl 881 984
Dl 881 1088
Dl 984 1088
Dl 984 881
Dl 1088 881
Dl 1088 984
Dl 1191 984
Dl 1191 881
Dl 1295 881
Dl 1295 1295
Dl 1295 1295
DP 0 0 0 0 6 1 21
Dl 467 1295
Dl 364 1295
Dl 364 1191
Dl 467 1191
Dl 467 1295
Dl 467 1295
DP 0 0 0 0 13 1 21
Dl -567 -567
Dl -671 -567
Dl -671 -671
Dl -671 -1188
Dl -1188 -1188
Dl -1188 -671
Dl -671 -671
Dl -671 -567
Dl -1292 -567
Dl -1292 -1292
Dl -567 -1292
Dl -567 -567
Dl -567 -567
DP 0 0 0 0 6 1 21
Dl 364 -774
Dl 260 -774
Dl 260 -878
Dl 364 -878
Dl 364 -774
Dl 364 -774
DP 0 0 0 0 10 1 21
Dl 467 -878
Dl 364 -878
Dl 364 -981
Dl 260 -981
Dl 260 -1188
Dl 364 -1188
Dl 364 -1085
Dl 467 -1085
Dl 467 -878
Dl 467 -878
DP 0 0 0 0 6 1 21
Dl 467 -567
Dl 364 -567
Dl 364 -774
Dl 467 -774
Dl 467 -567
Dl 467 -567
DP 0 0 0 0 13 1 21
Dl 1295 -567
Dl 1191 -567
Dl 1191 -671
Dl 1191 -1188
Dl 674 -1188
Dl 674 -671
Dl 1191 -671
Dl 1191 -567
Dl 570 -567
Dl 570 -1292
Dl 1295 -1292
Dl 1295 -567
Dl 1295 -567
DP 0 0 0 0 6 1 21
Dl 53 -1085
Dl -50 -1085
Dl -50 -1188
Dl 53 -1188
Dl 53 -1085
Dl 53 -1085
DP 0 0 0 0 6 1 21
Dl -774 1088
Dl -1085 1088
Dl -1085 777
Dl -774 777
Dl -774 1088
Dl -774 1088
DP 0 0 0 0 6 1 21
Dl 260 570
Dl 157 570
Dl 157 364
Dl 260 364
Dl 260 570
Dl 260 570
DP 0 0 0 0 6 1 21
Dl 364 364
Dl 260 364
Dl 260 260
Dl 364 260
Dl 364 364
Dl 364 364
DP 0 0 0 0 6 1 21
Dl 674 260
Dl 570 260
Dl 570 157
Dl 674 157
Dl 674 260
Dl 674 260
DP 0 0 0 0 6 1 21
Dl 674 674
Dl 570 674
Dl 570 570
Dl 674 570
Dl 674 674
Dl 674 674
DP 0 0 0 0 6 1 21
Dl -774 -774
Dl -1085 -774
Dl -1085 -1085
Dl -774 -1085
Dl -774 -774
Dl -774 -774
DP 0 0 0 0 6 1 21
Dl 1088 -774
Dl 777 -774
Dl 777 -1085
Dl 1088 -1085
Dl 1088 -774
Dl 1088 -774
$EndMODULE qrcode2.mod
$EndLIBRARY
