PCBNEW-LibModule-V1
$INDEX

$EndINDEX
#
# 
# pixmap w = 600, h = 600
#
$MODULE 
Po 0 0 0 15 00000000 00000000 ~~
Li 
T0 0 0 450 450 0 70 N I 21 "VAL"
T1 0 0 450 450 0 70 N I 21 ""
DP 0 0 0 0 204 1 21
Dl 608 -599
Dl 607 -594
Dl 604 -588
Dl 603 -586
Dl 597 -576
Dl 590 -563
Dl 581 -546
Dl 571 -526
Dl 559 -504
Dl 546 -479
Dl 532 -451
Dl 517 -421
Dl 500 -389
Dl 496 -381
Dl 471 -332
Dl 448 -286
Dl 426 -241
Dl 403 -198
Dl 381 -154
Dl 358 -109
Dl 355 -103
Dl 349 -91
Dl 341 -75
Dl 332 -56
Dl 321 -36
Dl 310 -15
Dl 299 8
Dl 288 30
Dl 277 52
Dl 276 53
Dl 266 74
Dl 256 94
Dl 246 114
Dl 236 133
Dl 227 150
Dl 220 165
Dl 213 177
Dl 209 187
Dl 208 189
Dl 200 203
Dl 192 220
Dl 181 240
Dl 170 262
Dl 158 286
Dl 145 312
Dl 132 338
Dl 118 365
Dl 105 391
Dl 92 417
Dl 79 442
Dl 68 465
Dl 57 486
Dl 48 505
Dl 44 513
Dl 35 530
Dl 28 545
Dl 21 558
Dl 15 569
Dl 11 578
Dl 8 585
Dl 6 588
Dl 6 588
Dl 5 586
Dl 2 581
Dl -2 574
Dl -7 565
Dl -10 558
Dl -15 548
Dl -22 536
Dl -29 521
Dl -38 505
Dl -46 489
Dl -54 473
Dl -55 471
Dl -64 454
Dl -74 435
Dl -84 416
Dl -93 397
Dl -102 380
Dl -109 368
Dl -115 355
Dl -122 343
Dl -127 332
Dl -131 324
Dl -135 318
Dl -136 316
Dl -138 312
Dl -141 305
Dl -146 296
Dl -152 285
Dl -158 273
Dl -161 268
Dl -171 249
Dl -180 231
Dl -189 214
Dl -198 196
Dl -208 177
Dl -219 155
Dl -220 153
Dl -226 143
Dl -233 129
Dl -240 115
Dl -247 101
Dl -250 95
Dl -256 84
Dl -264 69
Dl -272 54
Dl -280 37
Dl -289 21
Dl -294 11
Dl -301 -3
Dl -309 -20
Dl -319 -38
Dl -329 -58
Dl -340 -79
Dl -351 -100
Dl -361 -119
Dl -364 -124
Dl -381 -157
Dl -398 -191
Dl -416 -225
Dl -434 -260
Dl -452 -294
Dl -469 -327
Dl -486 -359
Dl -501 -388
Dl -514 -414
Dl -517 -419
Dl -533 -450
Dl -548 -478
Dl -561 -504
Dl -573 -527
Dl -583 -547
Dl -592 -565
Dl -599 -579
Dl -605 -589
Dl -608 -597
Dl -610 -601
Dl -610 -601
Dl -608 -601
Dl -603 -600
Dl -594 -598
Dl -583 -596
Dl -570 -593
Dl -560 -590
Dl -545 -587
Dl -528 -582
Dl -509 -578
Dl -488 -573
Dl -466 -568
Dl -445 -563
Dl -431 -560
Dl -416 -556
Dl -397 -552
Dl -376 -547
Dl -352 -542
Dl -326 -536
Dl -299 -529
Dl -270 -523
Dl -241 -516
Dl -212 -509
Dl -183 -503
Dl -177 -501
Dl -2 -461
Dl 11 -464
Dl 15 -465
Dl 22 -467
Dl 33 -469
Dl 47 -472
Dl 64 -476
Dl 83 -481
Dl 104 -485
Dl 127 -491
Dl 151 -496
Dl 176 -502
Dl 203 -508
Dl 229 -514
Dl 256 -520
Dl 283 -527
Dl 308 -532
Dl 334 -538
Dl 357 -544
Dl 380 -549
Dl 400 -554
Dl 419 -558
Dl 434 -561
Dl 445 -564
Dl 460 -567
Dl 475 -571
Dl 490 -574
Dl 504 -577
Dl 513 -579
Dl 525 -582
Dl 539 -585
Dl 552 -588
Dl 566 -591
Dl 579 -594
Dl 590 -597
Dl 599 -599
Dl 605 -600
Dl 608 -600
Dl 608 -600
Dl 608 -599
Dl 608 -599
$EndMODULE 
$EndLIBRARY
