PCBNEW-LibModule-V1  15/10/2012 17:11:11
# encoding utf-8
$INDEX
0896BM15A0001
ADXL335
ADXL345
ADXL345_2
ADXL346
ARDUINO_SHIELD
ARDUINO_SHIELD_WO_MOUNTING_HOLES
BH1710FVC
BMA180
BMP085
Bluetooth_Mate_Gold
CC7V-T1A
CONN_10_100MIL_OVAL
CONN_12_100MIL_ROUND
CONN_13_100MIL_ROUND
CONN_14_100MIL_ROUND
CONN_14_50MIL
CONN_4_100MIL_OVAL
CONN_5_100MIL_OVAL
CONN_6_100MIL_OVAL
CONN_6_50MIL
CONN_7_100MIL_OVAL
CONN_8_100MIL_OVAL
CONN_8_100MIL_ROUND
CONN_8_50MIL
CONN_9_100MIL_OVAL
CSTCE_V
D2PAK
EVQPUK
FEMTODUINO_v0.2
FIDUCIAL_1.5mm
FIDUCIAL_1mm_noborder
FREEIMU_V035
FreeIMU_v0.3
HMC5843
HMC5883L
HMC5883L_bigpads
ITG3200
JST_Battery
JUMP_2
JUMP_2_SMALL_NO_PASTE
JUMP_2_WITH_PASTE
JUMP_2_WITH_PASTE_2
KSS241G
LibreBB_MS5611-01BA
LibreMini
LibreTooth
MFP106D
MOUNTING_HOLE
MOUNTING_HOLE_M3
MOUNTING_HOLE_M3_NPTH
MOUNTING_HOLE_NO_SILKSCREEN
MPU60X0
MS5611-01BA01
MULTIMEC-SMD-BUTTON
QFN44-05p
QFN64-CC430
Quartz_CMS1
R50RGB-4-0045
RN-42
SDR08540M3-01
SKQUCAA010
SMD_DUAL_SLIDE_SWITCH-JS202011SCQN
SMD_PUSHBUTTON_TOP-PTS525
SMTU2450N
SOLDER_JUMPER
SOLDER_JUMPER_NO_PASTE
SOT89
SPD125
TEMT6000
TPS6223X
TSX-3225
TantaleCMS
USB_MICRO_B_FEMALE-10118193-0001LF
VIBRAMOTOR_310-101
XF2M-1015-1A
c_0402
c_tant_A
mini_usb_tipo_b_smd
$EndINDEX
$MODULE 0896BM15A0001
Po 0 0 0 15 4F88267A 00000000 ~~
Li 0896BM15A0001
Sc 0
AR
Op 0 0 0
T0 0 571 118 118 0 30 N I 21 N "0896BM15A0001"
T1 0 -571 300 300 0 60 N V 21 N "VAL**"
DS 197 0 276 0 80 21
DS 394 -256 394 256 80 21
DS 394 256 -394 256 80 21
DS -394 256 -394 -256 80 21
DS -394 -256 394 -256 80 21
$PAD
Sh "6" R 118 177 0 0 0
Dr 0 0 0
At SMD N 00888000
Ne 0 ""
Po 256 236
$EndPAD
$PAD
Sh "5" R 118 177 0 0 0
Dr 0 0 0
At SMD N 00888000
Ne 0 ""
Po 0 236
$EndPAD
$PAD
Sh "4" R 118 177 0 0 0
Dr 0 0 0
At SMD N 00888000
Ne 0 ""
Po -256 236
$EndPAD
$PAD
Sh "3" R 118 177 0 0 0
Dr 0 0 0
At SMD N 00888000
Ne 0 ""
Po -256 -236
$EndPAD
$PAD
Sh "1" R 118 177 0 0 0
Dr 0 0 0
At SMD N 00888000
Ne 0 ""
Po 256 -236
$EndPAD
$PAD
Sh "2" R 118 177 0 0 0
Dr 0 0 0
At SMD N 00888000
Ne 0 ""
Po 0 -236
$EndPAD
$EndMODULE 0896BM15A0001
$MODULE ADXL335
Po 0 0 0 15 4F779B5D 00000000 ~~
Li ADXL335
Sc 0
AR ADXL335
Op 0 0 0
T0 0 1211 197 197 0 39 N I 21 N "ADXL335"
T1 -10 -1102 197 197 0 39 N V 21 N "VAL**"
DS 492 -394 394 -492 80 25
DS 394 -197 591 -492 80 25
DS -394 591 -197 295 80 25
DS -394 295 -197 591 80 25
DS 0 0 591 0 80 25
DS 591 0 492 -98 80 25
DS 492 -98 492 98 80 25
DS 492 98 591 0 80 25
DS 0 0 0 591 80 25
DS 0 591 -98 492 80 25
DS -98 492 98 492 80 25
DS 98 492 0 591 80 25
DC -885 -885 -984 -984 80 21
DS 787 787 787 -787 80 21
DS 787 -787 -787 -787 80 21
DS -787 -787 -787 0 80 21
DS -787 0 -787 787 80 21
DS -787 787 787 787 80 21
$PAD
Sh "13" R 138 197 0 0 0
Dr 0 0 0
At SMD N 00888000
Ne 0 ""
Po 1477 -709
$EndPAD
$PAD
Sh "14" R 138 197 0 0 0
Dr 0 0 0
At SMD N 00888000
Ne 0 ""
Po 965 -709
$EndPAD
$PAD
Sh "15" R 138 197 0 0 0
Dr 0 0 0
At SMD N 00888000
Ne 0 ""
Po 453 -709
$EndPAD
$PAD
Sh "16" R 138 197 0 0 0
Dr 0 0 0
At SMD N 00888000
Ne 0 ""
Po -57 -709
$EndPAD
$PAD
Sh "9" R 197 138 0 0 0
Dr 0 0 0
At SMD N 00888000
Ne 0 ""
Po 709 384
$EndPAD
$PAD
Sh "5" R 138 197 0 0 0
Dr 0 0 0
At SMD N 00888000
Ne 0 ""
Po -57 709
$EndPAD
$PAD
Sh "6" R 138 197 0 0 0
Dr 0 0 0
At SMD N 00888000
Ne 0 ""
Po -128 709
$EndPAD
$PAD
Sh "7" R 138 197 0 0 0
Dr 0 0 0
At SMD N 00888000
Ne 0 ""
Po 128 709
$EndPAD
$PAD
Sh "11" R 197 138 0 0 0
Dr 0 0 0
At SMD N 00888000
Ne 0 ""
Po 709 -128
$EndPAD
$PAD
Sh "10" R 197 138 0 0 0
Dr 0 0 0
At SMD N 00888000
Ne 0 ""
Po 2127 128
$EndPAD
$PAD
Sh "8" R 138 197 0 0 0
Dr 0 0 0
At SMD N 00888000
Ne 0 ""
Po 384 709
$EndPAD
$PAD
Sh "12" R 197 138 0 0 0
Dr 0 0 0
At SMD N 00888000
Ne 0 ""
Po 709 -384
$EndPAD
$PAD
Sh "0" R 768 768 0 0 0
Dr 0 0 0
At SMD N 00888000
Ne 0 ""
Po 0 0
$EndPAD
$PAD
Sh "2" R 197 138 0 0 0
Dr 0 0 0
At SMD N 00888000
Ne 0 ""
Po -709 -128
$EndPAD
$PAD
Sh "3" R 197 138 0 0 0
Dr 0 0 0
At SMD N 00888000
Ne 0 ""
Po -709 128
$EndPAD
$PAD
Sh "4" R 197 138 0 0 0
Dr 0 0 0
At SMD N 00888000
Ne 0 ""
Po -709 384
$EndPAD
$PAD
Sh "1" R 197 138 0 0 0
Dr 0 0 0
At SMD N 00888000
Ne 0 ""
Po -709 -384
$EndPAD
$EndMODULE ADXL335
$MODULE ADXL345
Po 0 0 0 15 4D385F9C 00000000 ~~
Li ADXL345
Sc 0
AR
Op 0 0 0
T0 0 1811 482 482 0 81 N I 21 N "ADXL345"
T1 0 -1890 403 403 0 79 N I 21 N "VAL**"
DC -866 -1417 -709 -1339 100 21
DS -709 -1024 -709 -1260 100 21
DS -709 -1260 -236 -1260 100 21
DS -236 1260 -709 1260 100 21
DS -709 1260 -709 1024 100 21
DS 709 1024 709 1260 100 21
DS 709 1260 236 1260 100 21
DS 236 -1260 709 -1260 100 21
DS 709 -1260 709 -1024 100 21
$PAD
Sh "14" T 217 591 0 0 0
Dr 0 0 0
At SMD N 00888000
Ne 0 ""
Po 0 -906
$EndPAD
$PAD
Sh "7" T 217 591 0 0 0
Dr 0 0 0
At SMD N 00888000
Ne 0 ""
Po 0 906
$EndPAD
$PAD
Sh "1" T 217 591 0 0 900
Dr 0 0 0
At SMD N 00888000
Ne 0 ""
Po -512 -787
$EndPAD
$PAD
Sh "2" T 217 591 0 0 900
Dr 0 0 0
At SMD N 00888000
Ne 0 ""
Po -512 -472
$EndPAD
$PAD
Sh "3" T 217 591 0 0 900
Dr 0 0 0
At SMD N 00888000
Ne 0 ""
Po -512 -157
$EndPAD
$PAD
Sh "4" T 217 591 0 0 900
Dr 0 0 0
At SMD N 00888000
Ne 0 ""
Po -512 157
$EndPAD
$PAD
Sh "5" T 217 591 0 0 900
Dr 0 0 0
At SMD N 00888000
Ne 0 ""
Po -512 472
$EndPAD
$PAD
Sh "6" T 217 591 0 0 900
Dr 0 0 0
At SMD N 00888000
Ne 0 ""
Po -512 787
$EndPAD
$PAD
Sh "8" T 217 591 0 0 900
Dr 0 0 0
At SMD N 00888000
Ne 0 ""
Po 512 787
$EndPAD
$PAD
Sh "9" T 217 591 0 0 900
Dr 0 0 0
At SMD N 00888000
Ne 0 ""
Po 512 472
$EndPAD
$PAD
Sh "10" T 217 591 0 0 900
Dr 0 0 0
At SMD N 00888000
Ne 0 ""
Po 512 157
$EndPAD
$PAD
Sh "11" T 217 591 0 0 900
Dr 0 0 0
At SMD N 00888000
Ne 0 ""
Po 512 -157
$EndPAD
$PAD
Sh "12" T 217 591 0 0 900
Dr 0 0 0
At SMD N 00888000
Ne 0 ""
Po 512 -472
$EndPAD
$PAD
Sh "13" T 217 591 0 0 900
Dr 0 0 0
At SMD N 00888000
Ne 0 ""
Po 512 -787
$EndPAD
$EndMODULE ADXL345
$MODULE ADXL345_2
Po 0 0 0 15 4D4745E9 00000000 ~~
Li ADXL345_2
Sc 0
AR
Op 0 0 0
T0 0 1811 482 482 0 81 N I 21 N "ADXL345"
T1 0 -1890 403 403 0 79 N I 21 N "VAL**"
DC -866 -1417 -709 -1339 100 21
DS -709 -1024 -709 -1260 100 21
DS -709 -1260 -236 -1260 100 21
DS -236 1260 -709 1260 100 21
DS -709 1260 -709 1024 100 21
DS 709 1024 709 1260 100 21
DS 709 1260 236 1260 100 21
DS 236 -1260 709 -1260 100 21
DS 709 -1260 709 -1024 100 21
$PAD
Sh "14" T 217 451 0 0 0
Dr 0 0 0
At SMD N 00888000
Ne 0 ""
Po 0 -846
$EndPAD
$PAD
Sh "7" T 217 451 0 0 0
Dr 0 0 0
At SMD N 00888000
Ne 0 ""
Po 0 846
$EndPAD
$PAD
Sh "1" T 217 451 0 0 900
Dr 0 0 0
At SMD N 00888000
Ne 0 ""
Po -433 -787
$EndPAD
$PAD
Sh "2" T 217 451 0 0 900
Dr 0 0 0
At SMD N 00888000
Ne 0 ""
Po -433 -472
$EndPAD
$PAD
Sh "3" T 217 451 0 0 900
Dr 0 0 0
At SMD N 00888000
Ne 0 ""
Po -433 -157
$EndPAD
$PAD
Sh "4" T 217 451 0 0 900
Dr 0 0 0
At SMD N 00888000
Ne 0 ""
Po -433 157
$EndPAD
$PAD
Sh "5" T 217 451 0 0 900
Dr 0 0 0
At SMD N 00888000
Ne 0 ""
Po -433 472
$EndPAD
$PAD
Sh "6" T 217 451 0 0 900
Dr 0 0 0
At SMD N 00888000
Ne 0 ""
Po -433 787
$EndPAD
$PAD
Sh "8" T 217 451 0 0 900
Dr 0 0 0
At SMD N 00888000
Ne 0 ""
Po 433 787
$EndPAD
$PAD
Sh "9" T 217 451 0 0 900
Dr 0 0 0
At SMD N 00888000
Ne 0 ""
Po 433 472
$EndPAD
$PAD
Sh "10" T 217 451 0 0 900
Dr 0 0 0
At SMD N 00888000
Ne 0 ""
Po 433 157
$EndPAD
$PAD
Sh "11" T 217 451 0 0 900
Dr 0 0 0
At SMD N 00888000
Ne 0 ""
Po 433 -157
$EndPAD
$PAD
Sh "12" T 217 451 0 0 900
Dr 0 0 0
At SMD N 00888000
Ne 0 ""
Po 433 -472
$EndPAD
$PAD
Sh "13" T 217 451 0 0 900
Dr 0 0 0
At SMD N 00888000
Ne 0 ""
Po 433 -787
$EndPAD
$EndMODULE ADXL345_2
$MODULE ADXL346
Po 0 0 0 15 4D4943CF 00000000 ~~
Li ADXL346
Sc 0
AR ADXL346
Op 0 0 0
T0 0 -1260 394 394 0 99 N I 21 N "ADXL346"
T1 0 1181 394 394 0 99 N I 21 N "VAL**"
DS -157 138 -217 197 39 25
DS -217 79 -157 138 39 25
DS -157 138 -98 79 39 25
DS 118 -118 197 -197 39 25
DS 118 -197 197 -118 39 25
DC 0 0 20 -20 39 25
DS -236 0 -177 39 39 25
DS 0 0 -236 0 39 25
DS -236 0 -177 -39 39 25
DS 0 -217 39 -157 39 25
DS 0 0 0 -217 39 25
DS 0 -217 -39 -157 39 25
DS -630 -492 -512 -630 80 21
DS -295 -630 -630 -630 80 21
DS -630 -630 -630 -492 80 21
DS -295 630 -630 630 80 21
DS -630 630 -630 492 80 21
DS 630 492 630 630 80 21
DS 630 630 295 630 80 21
DS 630 -630 295 -630 80 21
DS 630 -630 630 -492 80 21
$PAD
Sh "16" R 315 118 0 0 900
Dr 0 0 0
At SMD N 00888000
Ne 0 ""
Po -197 -512
$EndPAD
$PAD
Sh "14" R 315 118 0 0 900
Dr 0 0 0
At SMD N 00888000
Ne 0 ""
Po 197 -512
$EndPAD
$PAD
Sh "15" R 315 118 0 0 900
Dr 0 0 0
At SMD N 00888000
Ne 0 ""
Po 0 -512
$EndPAD
$PAD
Sh "7" R 315 118 0 0 900
Dr 0 0 0
At SMD N 00888000
Ne 0 ""
Po 0 512
$EndPAD
$PAD
Sh "8" R 315 118 0 0 900
Dr 0 0 0
At SMD N 00888000
Ne 0 ""
Po 197 512
$EndPAD
$PAD
Sh "6" R 315 118 0 0 900
Dr 0 0 0
At SMD N 00888000
Ne 0 ""
Po -197 512
$EndPAD
$PAD
Sh "11" R 315 118 0 0 0
Dr 0 0 0
At SMD N 00888000
Ne 0 ""
Po 512 0
$EndPAD
$PAD
Sh "12" R 315 118 0 0 0
Dr 0 0 0
At SMD N 00888000
Ne 0 ""
Po 512 -197
$EndPAD
$PAD
Sh "13" R 315 118 0 0 0
Dr 0 0 0
At SMD N 00888000
Ne 0 ""
Po 512 -394
$EndPAD
$PAD
Sh "10" R 315 118 0 0 0
Dr 0 0 0
At SMD N 00888000
Ne 0 ""
Po 512 197
$EndPAD
$PAD
Sh "9" R 315 118 0 0 0
Dr 0 0 0
At SMD N 00888000
Ne 0 ""
Po 512 394
$EndPAD
$PAD
Sh "3" R 315 118 0 0 0
Dr 0 0 0
At SMD N 00888000
Ne 0 ""
Po -512 0
$EndPAD
$PAD
Sh "2" R 315 118 0 0 0
Dr 0 0 0
At SMD N 00888000
Ne 0 ""
Po -512 -197
$EndPAD
$PAD
Sh "1" R 315 118 0 0 0
Dr 0 0 0
At SMD N 00888000
Ne 0 ""
Po -512 -394
$EndPAD
$PAD
Sh "4" R 315 118 0 0 0
Dr 0 0 0
At SMD N 00888000
Ne 0 ""
Po -512 197
$EndPAD
$PAD
Sh "5" R 315 118 0 0 0
Dr 0 0 0
At SMD N 00888000
Ne 0 ""
Po -512 394
$EndPAD
$EndMODULE ADXL346
$MODULE ARDUINO_SHIELD
Po 0 0 0 15 4E00C646 00000000 ~~
Li ARDUINO_SHIELD
Sc 0
AR ARDUINO_SHIELD
Op 0 0 0
T0 2250 -22500 600 600 0 120 N V 21 N "SHIELD**"
T1 4000 -21500 600 600 0 120 N I 21 N "ARDUINO_SHIELD"
DS 26000 -16000 26000 -20500 150 21
DS 26000 -20500 25500 -21000 150 21
DS 25500 -21000 0 -21000 150 21
DS 26000 0 0 0 150 21
DS 0 0 0 -21000 150 21
DS 26000 -16000 27000 -15000 150 21
DS 27000 -15000 27000 -2000 150 21
DS 27000 -2000 26000 -1000 150 21
DS 26000 -1000 26000 0 150 21
$PAD
Sh "AD5" O 1000 600 0 0 900
Dr 400 0 0
At STD N 00E0FFFF
Ne 0 ""
Po 25000 -1000
$EndPAD
$PAD
Sh "AD4" O 1000 600 0 0 900
Dr 400 0 0
At STD N 00E0FFFF
Ne 0 ""
Po 24000 -1000
$EndPAD
$PAD
Sh "AD3" O 1000 600 0 0 900
Dr 400 0 0
At STD N 00E0FFFF
Ne 0 ""
Po 23000 -1000
$EndPAD
$PAD
Sh "AD0" O 1000 600 0 0 900
Dr 400 0 0
At STD N 00E0FFFF
Ne 0 ""
Po 20000 -1000
$EndPAD
$PAD
Sh "AD1" O 1000 600 0 0 900
Dr 400 0 0
At STD N 00E0FFFF
Ne 0 ""
Po 21000 -1000
$EndPAD
$PAD
Sh "AD2" O 1000 600 0 0 900
Dr 400 0 0
At STD N 00E0FFFF
Ne 0 ""
Po 22000 -1000
$EndPAD
$PAD
Sh "V_IN" O 1000 600 0 0 900
Dr 400 0 0
At STD N 00E0FFFF
Ne 0 ""
Po 18000 -1000
$EndPAD
$PAD
Sh "GND2" O 1000 600 0 0 900
Dr 400 0 0
At STD N 00E0FFFF
Ne 0 ""
Po 17000 -1000
$EndPAD
$PAD
Sh "GND1" O 1000 600 0 0 900
Dr 400 0 0
At STD N 00E0FFFF
Ne 0 ""
Po 16000 -1000
$EndPAD
$PAD
Sh "3V3" O 1000 600 0 0 900
Dr 400 0 0
At STD N 00E0FFFF
Ne 0 ""
Po 14000 -1000
$EndPAD
$PAD
Sh "RST" O 1000 600 0 0 900
Dr 400 0 0
At STD N 00E0FFFF
Ne 0 ""
Po 13000 -1000
$EndPAD
$PAD
Sh "0" O 1000 600 0 0 900
Dr 400 0 0
At STD N 00E0FFFF
Ne 0 ""
Po 25000 -20000
$EndPAD
$PAD
Sh "1" O 1000 600 0 0 900
Dr 400 0 0
At STD N 00E0FFFF
Ne 0 ""
Po 24000 -20000
$EndPAD
$PAD
Sh "2" O 1000 600 0 0 900
Dr 400 0 0
At STD N 00E0FFFF
Ne 0 ""
Po 23000 -20000
$EndPAD
$PAD
Sh "3" O 1000 600 0 0 900
Dr 400 0 0
At STD N 00E0FFFF
Ne 0 ""
Po 22000 -20000
$EndPAD
$PAD
Sh "4" O 1000 600 0 0 900
Dr 400 0 0
At STD N 00E0FFFF
Ne 0 ""
Po 21000 -20000
$EndPAD
$PAD
Sh "5" O 1000 600 0 0 900
Dr 400 0 0
At STD N 00E0FFFF
Ne 0 ""
Po 20000 -20000
$EndPAD
$PAD
Sh "6" O 1000 600 0 0 900
Dr 400 0 0
At STD N 00E0FFFF
Ne 0 ""
Po 19000 -20000
$EndPAD
$PAD
Sh "7" O 1000 600 0 0 900
Dr 400 0 0
At STD N 00E0FFFF
Ne 0 ""
Po 18000 -20000
$EndPAD
$PAD
Sh "8" O 1000 600 0 0 900
Dr 400 0 0
At STD N 00E0FFFF
Ne 0 ""
Po 16400 -20000
$EndPAD
$PAD
Sh "9" O 1000 600 0 0 900
Dr 400 0 0
At STD N 00E0FFFF
Ne 0 ""
Po 15400 -20000
$EndPAD
$PAD
Sh "10" O 1000 600 0 0 900
Dr 400 0 0
At STD N 00E0FFFF
Ne 0 ""
Po 14400 -20000
$EndPAD
$PAD
Sh "11" O 1000 600 0 0 900
Dr 400 0 0
At STD N 00E0FFFF
Ne 0 ""
Po 13400 -20000
$EndPAD
$PAD
Sh "12" O 1000 600 0 0 900
Dr 400 0 0
At STD N 00E0FFFF
Ne 0 ""
Po 12400 -20000
$EndPAD
$PAD
Sh "13" O 1000 600 0 0 900
Dr 400 0 0
At STD N 00E0FFFF
Ne 0 ""
Po 11400 -20000
$EndPAD
$PAD
Sh "GND3" O 1000 600 0 0 900
Dr 400 0 0
At STD N 00E0FFFF
Ne 0 ""
Po 10400 -20000
$EndPAD
$PAD
Sh "AREF" O 1000 600 0 0 900
Dr 400 0 0
At STD N 00E0FFFF
Ne 0 ""
Po 9400 -20000
$EndPAD
$PAD
Sh "5V" O 1000 600 0 0 900
Dr 400 0 0
At STD N 00E0FFFF
Ne 0 ""
Po 15000 -1000
$EndPAD
$PAD
Sh "" C 1550 1550 0 0 900
Dr 1250 0 0
At STD N 00E0FFFF
Ne 0 ""
Po 26000 -3000
$EndPAD
$PAD
Sh "" C 1550 1550 0 0 900
Dr 1250 0 0
At STD N 00E0FFFF
Ne 0 ""
Po 26000 -14000
$EndPAD
$PAD
Sh "" C 1550 1550 0 0 900
Dr 1250 0 0
At STD N 00E0FFFF
Ne 0 ""
Po 6000 -20000
$EndPAD
$PAD
Sh "" C 1550 1550 0 0 900
Dr 1250 0 0
At STD N 00E0FFFF
Ne 0 ""
Po 5500 -1000
$EndPAD
$EndMODULE ARDUINO_SHIELD
$MODULE ARDUINO_SHIELD_WO_MOUNTING_HOLES
Po 0 0 0 15 4E00C8B3 00000000 ~~
Li ARDUINO_SHIELD_WO_MOUNTING_HOLES
Sc 0
AR ARDUINO_SHIELD
Op 0 0 0
T0 2250 -22500 600 600 0 120 N V 21 N "SHIELD**"
T1 9000 -21571 600 600 0 120 N I 21 N "ARDUINO_SHIELD_WO_MOUNTING_HOLES"
DS 26000 -16000 26000 -20500 150 21
DS 26000 -20500 25500 -21000 150 21
DS 25500 -21000 0 -21000 150 21
DS 26000 0 0 0 150 21
DS 0 0 0 -21000 150 21
DS 26000 -16000 27000 -15000 150 21
DS 27000 -15000 27000 -2000 150 21
DS 27000 -2000 26000 -1000 150 21
DS 26000 -1000 26000 0 150 21
$PAD
Sh "AD5" O 1000 600 0 0 900
Dr 400 0 0
At STD N 00E0FFFF
Ne 0 ""
Po 25000 -1000
$EndPAD
$PAD
Sh "AD4" O 1000 600 0 0 900
Dr 400 0 0
At STD N 00E0FFFF
Ne 0 ""
Po 24000 -1000
$EndPAD
$PAD
Sh "AD3" O 1000 600 0 0 900
Dr 400 0 0
At STD N 00E0FFFF
Ne 0 ""
Po 23000 -1000
$EndPAD
$PAD
Sh "AD0" O 1000 600 0 0 900
Dr 400 0 0
At STD N 00E0FFFF
Ne 0 ""
Po 20000 -1000
$EndPAD
$PAD
Sh "AD1" O 1000 600 0 0 900
Dr 400 0 0
At STD N 00E0FFFF
Ne 0 ""
Po 21000 -1000
$EndPAD
$PAD
Sh "AD2" O 1000 600 0 0 900
Dr 400 0 0
At STD N 00E0FFFF
Ne 0 ""
Po 22000 -1000
$EndPAD
$PAD
Sh "V_IN" O 1000 600 0 0 900
Dr 400 0 0
At STD N 00E0FFFF
Ne 0 ""
Po 18000 -1000
$EndPAD
$PAD
Sh "GND2" O 1000 600 0 0 900
Dr 400 0 0
At STD N 00E0FFFF
Ne 0 ""
Po 17000 -1000
$EndPAD
$PAD
Sh "GND1" O 1000 600 0 0 900
Dr 400 0 0
At STD N 00E0FFFF
Ne 0 ""
Po 16000 -1000
$EndPAD
$PAD
Sh "3V3" O 1000 600 0 0 900
Dr 400 0 0
At STD N 00E0FFFF
Ne 0 ""
Po 14000 -1000
$EndPAD
$PAD
Sh "RST" O 1000 600 0 0 900
Dr 400 0 0
At STD N 00E0FFFF
Ne 0 ""
Po 13000 -1000
$EndPAD
$PAD
Sh "0" O 1000 600 0 0 900
Dr 400 0 0
At STD N 00E0FFFF
Ne 0 ""
Po 25000 -20000
$EndPAD
$PAD
Sh "1" O 1000 600 0 0 900
Dr 400 0 0
At STD N 00E0FFFF
Ne 0 ""
Po 24000 -20000
$EndPAD
$PAD
Sh "2" O 1000 600 0 0 900
Dr 400 0 0
At STD N 00E0FFFF
Ne 0 ""
Po 23000 -20000
$EndPAD
$PAD
Sh "3" O 1000 600 0 0 900
Dr 400 0 0
At STD N 00E0FFFF
Ne 0 ""
Po 22000 -20000
$EndPAD
$PAD
Sh "4" O 1000 600 0 0 900
Dr 400 0 0
At STD N 00E0FFFF
Ne 0 ""
Po 21000 -20000
$EndPAD
$PAD
Sh "5" O 1000 600 0 0 900
Dr 400 0 0
At STD N 00E0FFFF
Ne 0 ""
Po 20000 -20000
$EndPAD
$PAD
Sh "6" O 1000 600 0 0 900
Dr 400 0 0
At STD N 00E0FFFF
Ne 0 ""
Po 19000 -20000
$EndPAD
$PAD
Sh "7" O 1000 600 0 0 900
Dr 400 0 0
At STD N 00E0FFFF
Ne 0 ""
Po 18000 -20000
$EndPAD
$PAD
Sh "8" O 1000 600 0 0 900
Dr 400 0 0
At STD N 00E0FFFF
Ne 0 ""
Po 16400 -20000
$EndPAD
$PAD
Sh "9" O 1000 600 0 0 900
Dr 400 0 0
At STD N 00E0FFFF
Ne 0 ""
Po 15400 -20000
$EndPAD
$PAD
Sh "10" O 1000 600 0 0 900
Dr 400 0 0
At STD N 00E0FFFF
Ne 0 ""
Po 14400 -20000
$EndPAD
$PAD
Sh "11" O 1000 600 0 0 900
Dr 400 0 0
At STD N 00E0FFFF
Ne 0 ""
Po 13400 -20000
$EndPAD
$PAD
Sh "12" O 1000 600 0 0 900
Dr 400 0 0
At STD N 00E0FFFF
Ne 0 ""
Po 12400 -20000
$EndPAD
$PAD
Sh "13" O 1000 600 0 0 900
Dr 400 0 0
At STD N 00E0FFFF
Ne 0 ""
Po 11400 -20000
$EndPAD
$PAD
Sh "GND3" O 1000 600 0 0 900
Dr 400 0 0
At STD N 00E0FFFF
Ne 0 ""
Po 10400 -20000
$EndPAD
$PAD
Sh "AREF" O 1000 600 0 0 900
Dr 400 0 0
At STD N 00E0FFFF
Ne 0 ""
Po 9400 -20000
$EndPAD
$PAD
Sh "5V" O 1000 600 0 0 900
Dr 400 0 0
At STD N 00E0FFFF
Ne 0 ""
Po 15000 -1000
$EndPAD
$EndMODULE ARDUINO_SHIELD_WO_MOUNTING_HOLES
$MODULE BH1710FVC
Po 0 0 0 15 4F8810E4 00000000 ~~
Li BH1710FVC
Sc 0
AR BH1710FVC
Op 0 0 0
T0 531 0 197 197 900 49 N I 21 N "BH1710FVC"
T1 -551 0 300 300 900 60 N V 21 N "VAL**"
DC 0 0 157 0 80 21
DS -157 373 -157 294 80 21
DS 295 -512 -295 -512 80 21
DS -295 -512 -295 512 80 21
DS -295 512 295 512 80 21
DS 295 512 295 -512 80 21
$PAD
Sh "4" R 110 110 0 0 0
Dr 0 0 0
At SMD N 00888000
Ne 0 ""
Po 197 -551
$EndPAD
$PAD
Sh "5" R 110 110 0 0 0
Dr 0 0 0
At SMD N 00888000
Ne 0 ""
Po 0 -551
$EndPAD
$PAD
Sh "6" R 110 110 0 0 0
Dr 0 0 0
At SMD N 00888000
Ne 0 ""
Po -197 -551
$EndPAD
$PAD
Sh "1" R 110 110 0 0 0
Dr 0 0 0
At SMD N 00888000
Ne 0 ""
Po -197 551
$EndPAD
$PAD
Sh "3" R 110 110 0 0 0
Dr 0 0 0
At SMD N 00888000
Ne 0 ""
Po 197 551
$EndPAD
$PAD
Sh "2" R 110 110 0 0 0
Dr 0 0 0
At SMD N 00888000
Ne 0 ""
Po 0 551
$EndPAD
$EndMODULE BH1710FVC
$MODULE BMA180
Po 0 0 0 15 4D79A0F8 00000000 ~~
Li BMA180
Sc 0
AR /4CFF491D/4D7966EB
Op 0 0 0
T0 0 -1260 394 394 0 99 N I 21 N "BMA180"
T1 0 1181 394 394 0 99 N I 21 N "VAL**"
DS -157 138 -217 197 39 25
DS -217 79 -157 138 39 25
DS -157 138 -98 79 39 25
DS 118 -118 197 -197 39 25
DS 118 -197 197 -118 39 25
DC 0 0 20 -20 39 25
DS -236 0 -177 39 39 25
DS 0 0 -236 0 39 25
DS -236 0 -177 -39 39 25
DS 0 -217 39 -157 39 25
DS 0 0 0 -217 39 25
DS 0 -217 -39 -157 39 25
DS -630 -511 -512 -649 80 21
DS -315 -650 -650 -650 80 21
DS -649 -639 -649 -501 80 21
DS -304 650 -639 650 80 21
DS -649 650 -649 512 80 21
DS 649 511 649 649 80 21
DS 650 649 315 649 80 21
DS 649 -649 314 -649 80 21
DS 649 -649 649 -511 80 21
$PAD
Sh "11" R 236 126 0 0 0
Dr 0 0 0
At SMD N 00888000
Ne 0 ""
Po 472 -393
$EndPAD
$PAD
Sh "1" R 236 126 0 0 0
Dr 0 0 0
At SMD N 00888000
Ne 0 ""
Po -472 -393
$EndPAD
$PAD
Sh "12" R 236 126 0 0 2700
Dr 0 0 0
At SMD N 00888000
Ne 0 ""
Po 0 -472
$EndPAD
$PAD
Sh "2" R 236 126 0 0 0
Dr 0 0 0
At SMD N 00888000
Ne 1 "+3.3V"
Po -472 -196
$EndPAD
$PAD
Sh "4" R 236 126 0 0 0
Dr 0 0 0
At SMD N 00888000
Ne 2 "/BMA180/INTA"
Po -472 197
$EndPAD
$PAD
Sh "3" R 236 126 0 0 0
Dr 0 0 0
At SMD N 00888000
Ne 5 "GND"
Po -472 0
$EndPAD
$PAD
Sh "5" R 236 126 0 0 0
Dr 0 0 0
At SMD N 00888000
Ne 1 "+3.3V"
Po -472 394
$EndPAD
$PAD
Sh "7" R 236 126 0 0 0
Dr 0 0 0
At SMD N 00888000
Ne 4 "/ITG3200/SCL"
Po 472 394
$EndPAD
$PAD
Sh "9" R 236 126 0 0 0
Dr 0 0 0
At SMD N 00888000
Ne 3 "/BMA180/SDA"
Po 472 0
$EndPAD
$PAD
Sh "8" R 236 126 0 0 0
Dr 0 0 0
At SMD N 00888000
Ne 5 "GND"
Po 472 197
$EndPAD
$PAD
Sh "10" R 236 126 0 0 0
Dr 0 0 0
At SMD N 00888000
Ne 1 "+3.3V"
Po 472 -196
$EndPAD
$PAD
Sh "6" R 236 126 0 0 2700
Dr 0 0 0
At SMD N 00888000
Ne 0 ""
Po 0 472
$EndPAD
$EndMODULE BMA180
$MODULE BMP085
Po 0 0 0 15 4DF4AB06 00000000 ~~
Li BMP085
Sc 0
AR
Op 0 0 0
T0 0 -1461 236 236 0 39 N I 21 N "BMP085"
T1 0 1512 236 236 0 39 N I 21 N "VAL**"
DC -984 -984 -984 -1181 150 21
DS 984 -984 984 984 150 21
DS 984 984 -984 984 150 21
DS -984 984 -984 -984 150 21
DS -984 -984 984 -984 150 21
$PAD
Sh "8" R 315 984 0 0 0
Dr 0 0 0
At SMD N 00888000
Ne 0 ""
Po 0 -689
$EndPAD
$PAD
Sh "4" R 315 657 0 0 0
Dr 0 0 0
At SMD N 00888000
Ne 0 ""
Po 0 827
$EndPAD
$PAD
Sh "5" R 315 657 0 0 900
Dr 0 0 0
At SMD N 00888000
Ne 0 ""
Po 823 500
$EndPAD
$PAD
Sh "6" R 315 657 0 0 900
Dr 0 0 0
At SMD N 00888000
Ne 0 ""
Po 823 0
$EndPAD
$PAD
Sh "7" R 315 657 0 0 900
Dr 0 0 0
At SMD N 00888000
Ne 0 ""
Po 823 -500
$EndPAD
$PAD
Sh "1" R 315 657 0 0 900
Dr 0 0 0
At SMD N 00888000
Ne 0 ""
Po -823 -500
$EndPAD
$PAD
Sh "2" R 315 657 0 0 900
Dr 0 0 0
At SMD N 00888000
Ne 0 ""
Po -823 0
$EndPAD
$PAD
Sh "3" R 315 657 0 0 900
Dr 0 0 0
At SMD N 00888000
Ne 0 ""
Po -819 500
$EndPAD
$EndMODULE BMP085
$MODULE Bluetooth_Mate_Gold
Po 0 0 0 15 4DE4BDAC 00000000 ~~
Li Bluetooth_Mate_Gold
Sc 0
AR
Op 0 0 0
T0 3250 1000 600 600 0 120 N I 21 N "Bluetooth_Mate_Gold"
T1 3250 -4500 600 600 0 120 N I 21 N "VAL**"
DS 0 0 0 -17750 150 21
DS 0 -17750 6500 -17750 150 21
DS 6500 -17750 6500 0 150 21
DS 0 0 6500 0 150 21
$PAD
Sh "1" O 600 1000 0 0 0
Dr 400 0 0
At STD N 00E0FFFF
Ne 0 ""
Po 750 -750
$EndPAD
$PAD
Sh "2" O 600 1000 0 0 0
Dr 400 0 0
At STD N 00E0FFFF
Ne 0 ""
Po 1750 -750
$EndPAD
$PAD
Sh "3" O 600 1000 0 0 0
Dr 400 0 0
At STD N 00E0FFFF
Ne 0 ""
Po 2750 -750
$EndPAD
$PAD
Sh "4" O 600 1000 0 0 0
Dr 400 0 0
At STD N 00E0FFFF
Ne 0 ""
Po 3750 -750
$EndPAD
$PAD
Sh "5" O 600 1000 0 0 0
Dr 400 0 0
At STD N 00E0FFFF
Ne 0 ""
Po 4750 -750
$EndPAD
$PAD
Sh "6" O 600 1000 0 0 0
Dr 400 0 0
At STD N 00E0FFFF
Ne 0 ""
Po 5750 -750
$EndPAD
$EndMODULE Bluetooth_Mate_Gold
$MODULE CC7V-T1A
Po 0 0 0 15 4F8828D2 00000000 ~~
Li CC7V-T1A
Sc 0
AR
Op 0 0 0
T0 0 492 197 197 0 39 N I 21 N "CC7V-T1A"
T1 20 -650 400 400 0 60 N V 21 N "VAL**"
DS 630 -295 630 295 80 21
DS 630 295 -630 295 80 21
DS -630 295 -630 -295 80 21
DS -630 -295 630 -295 80 21
$PAD
Sh "2" R 394 709 0 0 0
Dr 0 0 0
At SMD N 00888000
Ne 0 ""
Po -492 0
$EndPAD
$PAD
Sh "1" R 394 709 0 0 0
Dr 0 0 0
At SMD N 00888000
Ne 0 ""
Po 492 0
$EndPAD
$EndMODULE CC7V-T1A
$MODULE CONN_10_100MIL_OVAL
Po 0 0 0 15 4E2F2A40 00000000 ~~
Li CONN_10_100MIL_OVAL
Cd Connecteur 4 pibs
Kw CONN DEV
Sc 0
AR
Op 0 0 0
T0 0 1000 200 200 0 50 N I 21 N "CONN_10_100MIL_OVAL"
T1 0 -1000 600 400 0 100 N I 21 N "Val**"
$PAD
Sh "2" O 550 1000 0 0 0
Dr 400 0 0
At STD N 00E0FFFF
Ne 0 ""
Po -3500 0
$EndPAD
$PAD
Sh "3" O 550 1000 0 0 0
Dr 400 0 0
At STD N 00E0FFFF
Ne 0 ""
Po -2500 0
$EndPAD
$PAD
Sh "4" O 550 1000 0 0 0
Dr 400 0 0
At STD N 00E0FFFF
Ne 0 ""
Po -1500 0
$EndPAD
$PAD
Sh "5" O 550 1000 0 0 0
Dr 400 0 0
At STD N 00E0FFFF
Ne 0 ""
Po -500 0
$EndPAD
$PAD
Sh "6" O 550 1000 0 0 0
Dr 400 0 0
At STD N 00E0FFFF
Ne 0 ""
Po 500 0
$EndPAD
$PAD
Sh "1" O 550 1000 0 0 0
Dr 400 0 0
At STD N 00E0FFFF
Ne 0 ""
Po -4500 0
$EndPAD
$PAD
Sh "7" O 550 1000 0 0 0
Dr 400 0 0
At STD N 00E0FFFF
Ne 0 ""
Po 1500 0
$EndPAD
$PAD
Sh "8" O 550 1000 0 0 0
Dr 400 0 0
At STD N 00E0FFFF
Ne 0 ""
Po 2500 0
$EndPAD
$PAD
Sh "9" O 550 1000 0 0 0
Dr 400 0 0
At STD N 00E0FFFF
Ne 0 ""
Po 3500 0
$EndPAD
$PAD
Sh "10" O 550 1000 0 0 0
Dr 400 0 0
At STD N 00E0FFFF
Ne 0 ""
Po 4500 0
$EndPAD
$EndMODULE CONN_10_100MIL_OVAL
$MODULE CONN_12_100MIL_ROUND
Po 0 0 0 15 4E35250E 00000000 ~~
Li CONN_12_100MIL_ROUND
Cd Connecteur 14 pins
Kw CONN DEV
Sc 0
AR /4D1F5314
Op 0 0 0
T0 -4000 -1000 681 428 0 107 N I 21 N "VAL**"
T1 3000 -1000 600 400 0 100 N I 21 N "CONN_12_100MIL_ROUND"
DS -6000 -500 -6000 500 150 21
DS 6000 500 -6000 500 150 21
DS -6000 -500 6000 -500 150 21
DS 6000 -500 6000 500 150 21
$PAD
Sh "1" R 700 700 0 0 0
Dr 400 0 0
At STD N 00E0FFFF
Ne 0 ""
Po -5500 0
$EndPAD
$PAD
Sh "2" C 700 700 0 0 0
Dr 400 0 0
At STD N 00E0FFFF
Ne 0 ""
Po -4500 0
$EndPAD
$PAD
Sh "3" C 700 700 0 0 0
Dr 400 0 0
At STD N 00E0FFFF
Ne 0 ""
Po -3500 0
$EndPAD
$PAD
Sh "4" C 700 700 0 0 0
Dr 400 0 0
At STD N 00E0FFFF
Ne 0 ""
Po -2500 0
$EndPAD
$PAD
Sh "5" C 700 700 0 0 0
Dr 400 0 0
At STD N 00E0FFFF
Ne 0 ""
Po -1500 0
$EndPAD
$PAD
Sh "6" C 700 700 0 0 0
Dr 400 0 0
At STD N 00E0FFFF
Ne 0 ""
Po -500 0
$EndPAD
$PAD
Sh "7" C 700 700 0 0 0
Dr 400 0 0
At STD N 00E0FFFF
Ne 0 ""
Po 500 0
$EndPAD
$PAD
Sh "8" C 700 700 0 0 0
Dr 400 0 0
At STD N 00E0FFFF
Ne 0 ""
Po 1500 0
$EndPAD
$PAD
Sh "9" C 700 700 0 0 0
Dr 400 0 0
At STD N 00E0FFFF
Ne 0 ""
Po 2500 0
$EndPAD
$PAD
Sh "10" C 700 700 0 0 0
Dr 400 0 0
At STD N 00E0FFFF
Ne 0 ""
Po 3500 0
$EndPAD
$PAD
Sh "11" C 700 700 0 0 0
Dr 400 0 0
At STD N 00E0FFFF
Ne 0 ""
Po 4500 0
$EndPAD
$PAD
Sh "12" C 700 700 0 0 0
Dr 400 0 0
At STD N 00E0FFFF
Ne 0 ""
Po 5500 0
$EndPAD
$EndMODULE CONN_12_100MIL_ROUND
$MODULE CONN_13_100MIL_ROUND
Po 0 0 0 15 4FFC4069 00000000 ~~
Li CONN_13_100MIL_ROUND
Cd Connecteur 14 pins
Kw CONN DEV
Sc 0
AR /4D1F5314
Op 0 0 0
T0 -5500 -1000 680 427 0 107 N I 21 N "VAL**"
T1 3000 -1000 600 400 0 100 N I 21 N "CONN_13_100MIL_ROUND"
DS -6500 500 6500 500 120 21
DS -6500 -500 6500 -500 120 21
DS 6500 -500 6500 500 120 21
DS -6500 500 -6500 -500 120 21
$PAD
Sh "1" R 700 700 0 0 0
Dr 400 0 0
At STD N 00E0FFFF
Ne 0 ""
Po -6000 0
$EndPAD
$PAD
Sh "2" C 700 700 0 0 0
Dr 400 0 0
At STD N 00E0FFFF
Ne 0 ""
Po -5000 0
$EndPAD
$PAD
Sh "3" C 700 700 0 0 0
Dr 400 0 0
At STD N 00E0FFFF
Ne 0 ""
Po -4000 0
$EndPAD
$PAD
Sh "4" C 700 700 0 0 0
Dr 400 0 0
At STD N 00E0FFFF
Ne 0 ""
Po -3000 0
$EndPAD
$PAD
Sh "5" C 700 700 0 0 0
Dr 400 0 0
At STD N 00E0FFFF
Ne 0 ""
Po -2000 0
$EndPAD
$PAD
Sh "6" C 700 700 0 0 0
Dr 400 0 0
At STD N 00E0FFFF
Ne 0 ""
Po -1000 0
$EndPAD
$PAD
Sh "7" C 700 700 0 0 0
Dr 400 0 0
At STD N 00E0FFFF
Ne 0 ""
Po 0 0
$EndPAD
$PAD
Sh "8" C 700 700 0 0 0
Dr 400 0 0
At STD N 00E0FFFF
Ne 0 ""
Po 1000 0
$EndPAD
$PAD
Sh "9" C 700 700 0 0 0
Dr 400 0 0
At STD N 00E0FFFF
Ne 0 ""
Po 2000 0
$EndPAD
$PAD
Sh "10" C 700 700 0 0 0
Dr 400 0 0
At STD N 00E0FFFF
Ne 0 ""
Po 3000 0
$EndPAD
$PAD
Sh "11" C 700 700 0 0 0
Dr 400 0 0
At STD N 00E0FFFF
Ne 0 ""
Po 4000 0
$EndPAD
$PAD
Sh "12" C 700 700 0 0 0
Dr 400 0 0
At STD N 00E0FFFF
Ne 0 ""
Po 5000 0
$EndPAD
$PAD
Sh "13" C 700 700 0 0 0
Dr 400 0 0
At STD N 00E0FFFF
Ne 0 ""
Po 6000 0
$EndPAD
$EndMODULE CONN_13_100MIL_ROUND
$MODULE CONN_14_100MIL_ROUND
Po 0 0 0 15 4FF99EBD 00000000 ~~
Li CONN_14_100MIL_ROUND
Cd Connecteur 14 pins
Kw CONN DEV
Sc 0
AR /4D1F5314
Op 0 0 0
T0 -4000 -1000 681 428 0 107 N I 21 N "J4"
T1 3000 -1000 600 400 0 100 N I 21 N "CONN_14_100MIL_ROUND"
DS -7000 -500 7000 -500 120 21
DS 7000 -500 7000 500 120 21
DS 7000 500 -7000 500 120 21
DS -7000 500 -7000 -500 120 21
$PAD
Sh "1" R 700 700 0 0 0
Dr 400 0 0
At STD N 00E0FFFF
Ne 0 ""
Po -6500 0
$EndPAD
$PAD
Sh "2" C 700 700 0 0 0
Dr 400 0 0
At STD N 00E0FFFF
Ne 0 ""
Po -5500 0
$EndPAD
$PAD
Sh "3" C 700 700 0 0 0
Dr 400 0 0
At STD N 00E0FFFF
Ne 0 ""
Po -4500 0
$EndPAD
$PAD
Sh "4" C 700 700 0 0 0
Dr 400 0 0
At STD N 00E0FFFF
Ne 0 ""
Po -3500 0
$EndPAD
$PAD
Sh "5" C 700 700 0 0 0
Dr 400 0 0
At STD N 00E0FFFF
Ne 0 ""
Po -2500 0
$EndPAD
$PAD
Sh "6" C 700 700 0 0 0
Dr 400 0 0
At STD N 00E0FFFF
Ne 0 ""
Po -1500 0
$EndPAD
$PAD
Sh "7" C 700 700 0 0 0
Dr 400 0 0
At STD N 00E0FFFF
Ne 0 ""
Po -500 0
$EndPAD
$PAD
Sh "8" C 700 700 0 0 0
Dr 400 0 0
At STD N 00E0FFFF
Ne 0 ""
Po 500 0
$EndPAD
$PAD
Sh "9" C 700 700 0 0 0
Dr 400 0 0
At STD N 00E0FFFF
Ne 0 ""
Po 1500 0
$EndPAD
$PAD
Sh "10" C 700 700 0 0 0
Dr 400 0 0
At STD N 00E0FFFF
Ne 0 ""
Po 2500 0
$EndPAD
$PAD
Sh "11" C 700 700 0 0 0
Dr 400 0 0
At STD N 00E0FFFF
Ne 0 ""
Po 3500 0
$EndPAD
$PAD
Sh "12" C 700 700 0 0 0
Dr 400 0 0
At STD N 00E0FFFF
Ne 0 ""
Po 4500 0
$EndPAD
$PAD
Sh "13" C 700 700 0 0 0
Dr 400 0 0
At STD N 00E0FFFF
Ne 0 ""
Po 5500 0
$EndPAD
$PAD
Sh "14" C 700 700 0 0 0
Dr 400 0 0
At STD N 00E0FFFF
Ne 0 ""
Po 6500 0
$EndPAD
$EndMODULE CONN_14_100MIL_ROUND
$MODULE CONN_14_50MIL
Po 0 0 0 15 4D1AF0BC 00000000 ~~
Li CONN_14_50MIL
Sc 0
AR
Op 0 0 0
T0 0 -1000 600 600 0 120 N V 21 N "CONN_14_50MIL"
T1 0 1250 600 600 0 120 N V 21 N "VAL**"
$PAD
Sh "1" O 420 600 0 0 0
Dr 280 0 0
At STD N 00E0FFFF
Ne 0 ""
Po -3250 0
$EndPAD
$PAD
Sh "2" O 420 600 0 0 0
Dr 280 0 0
At STD N 00E0FFFF
Ne 0 ""
Po -2750 0
$EndPAD
$PAD
Sh "3" O 420 600 0 0 0
Dr 280 0 0
At STD N 00E0FFFF
Ne 0 ""
Po -2250 0
$EndPAD
$PAD
Sh "4" O 420 600 0 0 0
Dr 280 0 0
At STD N 00E0FFFF
Ne 0 ""
Po -1750 0
$EndPAD
$PAD
Sh "5" O 420 600 0 0 0
Dr 280 0 0
At STD N 00E0FFFF
Ne 0 ""
Po -1250 0
$EndPAD
$PAD
Sh "6" O 420 600 0 0 0
Dr 280 0 0
At STD N 00E0FFFF
Ne 0 ""
Po -750 0
$EndPAD
$PAD
Sh "7" O 420 600 0 0 0
Dr 280 0 0
At STD N 00E0FFFF
Ne 0 ""
Po -250 0
$EndPAD
$PAD
Sh "8" O 420 600 0 0 0
Dr 280 0 0
At STD N 00E0FFFF
Ne 0 ""
Po 250 0
$EndPAD
$PAD
Sh "9" O 420 600 0 0 0
Dr 280 0 0
At STD N 00E0FFFF
Ne 0 ""
Po 750 0
$EndPAD
$PAD
Sh "10" O 420 600 0 0 0
Dr 280 0 0
At STD N 00E0FFFF
Ne 0 ""
Po 1250 0
$EndPAD
$PAD
Sh "11" O 420 600 0 0 0
Dr 280 0 0
At STD N 00E0FFFF
Ne 0 ""
Po 1750 0
$EndPAD
$PAD
Sh "12" O 420 600 0 0 0
Dr 280 0 0
At STD N 00E0FFFF
Ne 0 ""
Po 2250 0
$EndPAD
$PAD
Sh "13" O 420 600 0 0 0
Dr 280 0 0
At STD N 00E0FFFF
Ne 0 ""
Po 2750 0
$EndPAD
$PAD
Sh "14" O 420 600 0 0 0
Dr 280 0 0
At STD N 00E0FFFF
Ne 0 ""
Po 3250 0
$EndPAD
$EndMODULE CONN_14_50MIL
$MODULE CONN_4_100MIL_OVAL
Po 0 0 0 15 4DA81D03 00000000 ~~
Li CONN_4_100MIL_OVAL
Cd Connecteur 4 pibs
Kw CONN DEV
Sc 0
AR /4D21BA89
Op 0 0 0
T0 0 886 200 200 0 50 N I 21 N "P2"
T1 0 -787 200 100 0 25 N I 21 N "CONN_4"
DS -2000 -600 2000 -600 150 25
DS 2000 -600 2000 600 150 25
DS 2000 600 -2000 600 150 25
DS -2000 600 -2000 -600 150 25
$PAD
Sh "1" O 550 1000 0 0 0
Dr 400 0 0
At STD N 00E0FFFF
Ne 4 "GND"
Po -1500 0
$EndPAD
$PAD
Sh "2" O 550 1000 0 0 0
Dr 400 0 0
At STD N 00E0FFFF
Ne 1 "+5V"
Po -500 0
$EndPAD
$PAD
Sh "3" O 550 1000 0 0 0
Dr 400 0 0
At STD N 00E0FFFF
Ne 3 "/I2C_Logic_Level_Converter/SDA_high"
Po 500 0
$EndPAD
$PAD
Sh "4" O 550 1000 0 0 0
Dr 400 0 0
At STD N 00E0FFFF
Ne 2 "/I2C_Logic_Level_Converter/SCL_high"
Po 1500 0
$EndPAD
$EndMODULE CONN_4_100MIL_OVAL
$MODULE CONN_5_100MIL_OVAL
Po 0 0 0 15 4D958380 00000000 ~~
Li CONN_5_100MIL_OVAL
Cd 5 pin oval connector
Kw CONN DEV
Sc 0
AR CONN_5_100MIL_OVAL
Op 0 0 0
T0 0 1000 200 200 0 50 N I 21 N "CONN_5_100MIL_OVAL"
T1 0 -1000 600 400 0 100 N I 21 N "Val**"
DS 0 -600 2500 -600 60 21
DS 2500 -600 2500 600 60 21
DS 2500 600 -2500 600 60 21
DS -2500 600 -2500 -600 60 21
DS -2500 -600 0 -600 60 21
$PAD
Sh "2" O 550 1000 0 0 0
Dr 400 0 0
At STD N 00E0FFFF
Ne 0 ""
Po -1000 0
$EndPAD
$PAD
Sh "3" O 550 1000 0 0 0
Dr 400 0 0
At STD N 00E0FFFF
Ne 0 ""
Po 0 0
$EndPAD
$PAD
Sh "4" O 550 1000 0 0 0
Dr 400 0 0
At STD N 00E0FFFF
Ne 0 ""
Po 1000 0
$EndPAD
$PAD
Sh "5" O 550 1000 0 0 0
Dr 400 0 0
At STD N 00E0FFFF
Ne 0 ""
Po 2000 0
$EndPAD
$PAD
Sh "1" O 550 1000 0 0 0
Dr 400 0 0
At STD N 00E0FFFF
Ne 0 ""
Po -2000 0
$EndPAD
$EndMODULE CONN_5_100MIL_OVAL
$MODULE CONN_6_100MIL_OVAL
Po 0 0 0 15 4D3D6C67 00000000 ~~
Li CONN_6_100MIL_OVAL
Cd Connecteur 4 pibs
Kw CONN DEV
Sc 0
AR
Op 0 0 0
T0 0 1000 200 200 0 50 N V 21 N "CONN_6_100MIL_OVAL"
T1 0 -1000 600 400 0 100 N I 21 N "Val**"
DS 3000 500 -3000 500 150 21
DS -3000 500 -3000 -500 150 21
DS -3000 -500 3000 -500 150 21
DS 3000 -500 3000 500 150 21
DS -2000 -500 -2000 -500 120 21
DS -2000 -500 -2000 -500 120 21
$PAD
Sh "2" O 550 800 0 0 0
Dr 400 0 0
At STD N 00E0FFFF
Ne 0 ""
Po -1500 0
$EndPAD
$PAD
Sh "3" O 550 800 0 0 0
Dr 400 0 0
At STD N 00E0FFFF
Ne 0 ""
Po -500 0
$EndPAD
$PAD
Sh "4" O 550 800 0 0 0
Dr 400 0 0
At STD N 00E0FFFF
Ne 0 ""
Po 500 0
$EndPAD
$PAD
Sh "5" O 550 800 0 0 0
Dr 400 0 0
At STD N 00E0FFFF
Ne 0 ""
Po 1500 0
$EndPAD
$PAD
Sh "6" O 550 800 0 0 0
Dr 400 0 0
At STD N 00E0FFFF
Ne 0 ""
Po 2500 0
$EndPAD
$PAD
Sh "1" O 550 800 0 0 0
Dr 400 0 0
At STD N 00E0FFFF
Ne 0 ""
Po -2500 0
$EndPAD
$EndMODULE CONN_6_100MIL_OVAL
$MODULE CONN_6_50MIL
Po 0 0 0 15 4D1AF252 00000000 ~~
Li CONN_6_50MIL
Sc 0
AR
Op 0 0 0
T0 0 -750 400 400 0 100 N V 21 N "CONN_6_50MIL"
T1 0 1000 600 600 0 120 N V 21 N "VAL**"
$PAD
Sh "1" O 420 600 0 0 0
Dr 280 0 0
At STD N 00E0FFFF
Ne 0 ""
Po -1250 0
$EndPAD
$PAD
Sh "2" O 420 600 0 0 0
Dr 280 0 0
At STD N 00E0FFFF
Ne 0 ""
Po -750 0
$EndPAD
$PAD
Sh "3" O 420 600 0 0 0
Dr 280 0 0
At STD N 00E0FFFF
Ne 0 ""
Po -250 0
$EndPAD
$PAD
Sh "4" O 420 600 0 0 0
Dr 280 0 0
At STD N 00E0FFFF
Ne 0 ""
Po 250 0
$EndPAD
$PAD
Sh "5" O 420 600 0 0 0
Dr 280 0 0
At STD N 00E0FFFF
Ne 0 ""
Po 750 0
$EndPAD
$PAD
Sh "6" O 420 600 0 0 0
Dr 280 0 0
At STD N 00E0FFFF
Ne 0 ""
Po 1250 0
$EndPAD
$EndMODULE CONN_6_50MIL
$MODULE CONN_7_100MIL_OVAL
Po 0 0 0 15 4D46AE09 00000000 ~~
Li CONN_7_100MIL_OVAL
Cd Connecteur 4 pibs
Kw CONN DEV
Sc 0
AR
Op 0 0 0
T0 0 1000 200 200 0 50 N I 21 N "CONN_7_100MIL_OVAL"
T1 0 -1000 600 400 0 100 N I 21 N "Val**"
DS 0 -600 3500 -600 150 21
DS 3500 -600 3500 600 150 21
DS 3500 600 -3500 600 150 21
DS -3500 600 -3500 -600 150 21
DS -3500 -600 0 -600 150 21
$PAD
Sh "2" O 550 800 0 0 0
Dr 400 0 0
At STD N 00E0FFFF
Ne 0 ""
Po -2000 0
$EndPAD
$PAD
Sh "3" O 550 800 0 0 0
Dr 400 0 0
At STD N 00E0FFFF
Ne 0 ""
Po -1000 0
$EndPAD
$PAD
Sh "4" O 550 800 0 0 0
Dr 400 0 0
At STD N 00E0FFFF
Ne 0 ""
Po 0 0
$EndPAD
$PAD
Sh "5" O 550 800 0 0 0
Dr 400 0 0
At STD N 00E0FFFF
Ne 0 ""
Po 1000 0
$EndPAD
$PAD
Sh "6" O 550 800 0 0 0
Dr 400 0 0
At STD N 00E0FFFF
Ne 0 ""
Po 2000 0
$EndPAD
$PAD
Sh "1" O 550 800 0 0 0
Dr 400 0 0
At STD N 00E0FFFF
Ne 0 ""
Po -3000 0
$EndPAD
$PAD
Sh "7" O 550 800 0 0 0
Dr 400 0 0
At STD N 00E0FFFF
Ne 0 ""
Po 3000 0
$EndPAD
$EndMODULE CONN_7_100MIL_OVAL
$MODULE CONN_8_100MIL_OVAL
Po 0 0 0 15 4D972987 00000000 ~~
Li CONN_8_100MIL_OVAL
Cd Connecteur 4 pibs
Kw CONN DEV
Sc 0
AR
Op 0 0 0
T0 0 1000 200 200 0 50 N I 21 N "CONN_8_100MIL_OVAL"
T1 0 -1000 600 400 0 100 N I 21 N "Val**"
$PAD
Sh "2" O 550 1000 0 0 0
Dr 400 0 0
At STD N 00E0FFFF
Ne 0 ""
Po -2500 0
$EndPAD
$PAD
Sh "3" O 550 1000 0 0 0
Dr 400 0 0
At STD N 00E0FFFF
Ne 0 ""
Po -1500 0
$EndPAD
$PAD
Sh "4" O 550 1000 0 0 0
Dr 400 0 0
At STD N 00E0FFFF
Ne 0 ""
Po -500 0
$EndPAD
$PAD
Sh "5" O 550 1000 0 0 0
Dr 400 0 0
At STD N 00E0FFFF
Ne 0 ""
Po 500 0
$EndPAD
$PAD
Sh "6" O 550 1000 0 0 0
Dr 400 0 0
At STD N 00E0FFFF
Ne 0 ""
Po 1500 0
$EndPAD
$PAD
Sh "1" O 550 1000 0 0 0
Dr 400 0 0
At STD N 00E0FFFF
Ne 0 ""
Po -3500 0
$EndPAD
$PAD
Sh "7" O 550 1000 0 0 0
Dr 400 0 0
At STD N 00E0FFFF
Ne 0 ""
Po 2500 0
$EndPAD
$PAD
Sh "8" O 550 1000 0 0 0
Dr 400 0 0
At STD N 00E0FFFF
Ne 0 ""
Po 3500 0
$EndPAD
$EndMODULE CONN_8_100MIL_OVAL
$MODULE CONN_8_100MIL_ROUND
Po 0 0 0 15 4E484E11 00000000 ~~
Li CONN_8_100MIL_ROUND
Cd Connecteur 4 pibs
Kw CONN DEV
Sc 0
AR
Op 0 0 0
T0 0 1000 200 200 0 50 N I 21 N "CONN_8_100MIL_OVAL"
T1 0 -1000 600 400 0 100 N I 21 N "Val**"
$PAD
Sh "2" C 700 700 0 0 0
Dr 400 0 0
At STD N 00E0FFFF
Ne 0 ""
Po -2500 0
$EndPAD
$PAD
Sh "3" C 700 700 0 0 0
Dr 400 0 0
At STD N 00E0FFFF
Ne 0 ""
Po -1500 0
$EndPAD
$PAD
Sh "4" C 700 700 0 0 0
Dr 400 0 0
At STD N 00E0FFFF
Ne 0 ""
Po -500 0
$EndPAD
$PAD
Sh "5" C 700 700 0 0 0
Dr 400 0 0
At STD N 00E0FFFF
Ne 0 ""
Po 500 0
$EndPAD
$PAD
Sh "6" C 700 700 0 0 0
Dr 400 0 0
At STD N 00E0FFFF
Ne 0 ""
Po 1500 0
$EndPAD
$PAD
Sh "1" C 700 700 0 0 0
Dr 400 0 0
At STD N 00E0FFFF
Ne 0 ""
Po -3500 0
$EndPAD
$PAD
Sh "7" C 700 700 0 0 0
Dr 400 0 0
At STD N 00E0FFFF
Ne 0 ""
Po 2500 0
$EndPAD
$PAD
Sh "8" C 700 700 0 0 0
Dr 400 0 0
At STD N 00E0FFFF
Ne 0 ""
Po 3500 0
$EndPAD
$EndMODULE CONN_8_100MIL_ROUND
$MODULE CONN_8_50MIL
Po 0 0 0 15 4D1B26FC 00000000 ~~
Li CONN_8_50MIL
Sc 0
AR
Op 0 0 0
T0 0 -750 400 400 0 100 N V 21 N "CONN_8_50MIL"
T1 0 1000 600 600 0 120 N V 21 N "VAL**"
$PAD
Sh "1" O 420 600 0 0 0
Dr 280 0 0
At STD N 00E0FFFF
Ne 0 ""
Po -1750 0
$EndPAD
$PAD
Sh "2" O 420 600 0 0 0
Dr 280 0 0
At STD N 00E0FFFF
Ne 0 ""
Po -1250 0
$EndPAD
$PAD
Sh "3" O 420 600 0 0 0
Dr 280 0 0
At STD N 00E0FFFF
Ne 0 ""
Po -750 0
$EndPAD
$PAD
Sh "4" O 420 600 0 0 0
Dr 280 0 0
At STD N 00E0FFFF
Ne 0 ""
Po -250 0
$EndPAD
$PAD
Sh "5" O 420 600 0 0 0
Dr 280 0 0
At STD N 00E0FFFF
Ne 0 ""
Po 250 0
$EndPAD
$PAD
Sh "6" O 420 600 0 0 0
Dr 280 0 0
At STD N 00E0FFFF
Ne 0 ""
Po 750 0
$EndPAD
$PAD
Sh "7" O 420 600 0 0 0
Dr 280 0 0
At STD N 00E0FFFF
Ne 0 ""
Po 1250 0
$EndPAD
$PAD
Sh "8" O 420 600 0 0 0
Dr 280 0 0
At STD N 00E0FFFF
Ne 0 ""
Po 1750 0
$EndPAD
$EndMODULE CONN_8_50MIL
$MODULE CONN_9_100MIL_OVAL
Po 0 0 0 15 4D3D6CB8 00000000 ~~
Li CONN_9_100MIL_OVAL
Cd Connecteur 4 pibs
Kw CONN DEV
Sc 0
AR
Op 0 0 0
T0 0 1000 200 200 0 50 N V 21 N "CONN_9_100MIL_OVAL"
T1 0 -1000 600 400 0 100 N I 21 N "Val**"
DS 4500 500 3500 500 150 21
DS 3500 -500 4500 -500 150 21
DS -4500 -500 3500 -500 150 21
DS 4500 -500 4500 500 150 21
DS 3500 500 -4500 500 150 21
DS -4500 500 -4500 -500 150 21
$PAD
Sh "2" O 550 800 0 0 0
Dr 400 0 0
At STD N 00E0FFFF
Ne 0 ""
Po -3000 0
$EndPAD
$PAD
Sh "3" O 550 800 0 0 0
Dr 400 0 0
At STD N 00E0FFFF
Ne 0 ""
Po -2000 0
$EndPAD
$PAD
Sh "4" O 550 800 0 0 0
Dr 400 0 0
At STD N 00E0FFFF
Ne 0 ""
Po -1000 0
$EndPAD
$PAD
Sh "5" O 550 800 0 0 0
Dr 400 0 0
At STD N 00E0FFFF
Ne 0 ""
Po 0 0
$EndPAD
$PAD
Sh "6" O 550 800 0 0 0
Dr 400 0 0
At STD N 00E0FFFF
Ne 0 ""
Po 1000 0
$EndPAD
$PAD
Sh "1" O 550 800 0 0 0
Dr 400 0 0
At STD N 00E0FFFF
Ne 0 ""
Po -4000 0
$EndPAD
$PAD
Sh "7" O 550 800 0 0 0
Dr 400 0 0
At STD N 00E0FFFF
Ne 0 ""
Po 2000 0
$EndPAD
$PAD
Sh "8" O 550 800 0 0 0
Dr 400 0 0
At STD N 00E0FFFF
Ne 0 ""
Po 3000 0
$EndPAD
$PAD
Sh "9" O 550 800 0 0 0
Dr 400 0 0
At STD N 00E0FFFF
Ne 0 ""
Po 4000 0
$EndPAD
$EndMODULE CONN_9_100MIL_OVAL
$MODULE CSTCE_V
Po 0 0 0 15 4D1A7963 00000000 ~~
Li CSTCE_V
Sc 0
AR
Op 0 0 0
T0 0 866 394 394 0 42 N V 21 N "CSTCE_V"
T1 0 -787 394 394 0 39 N V 21 N "VAL**"
$PAD
Sh "2" R 138 669 0 0 0
Dr 0 0 0
At SMD N 00888000
Ne 0 ""
Po 0 0
$EndPAD
$PAD
Sh "3" R 138 669 0 0 0
Dr 0 0 0
At SMD N 00888000
Ne 0 ""
Po 374 0
$EndPAD
$PAD
Sh "1" R 138 669 0 0 0
Dr 0 0 0
At SMD N 00888000
Ne 0 ""
Po -374 0
$EndPAD
$EndMODULE CSTCE_V
$MODULE EVQPUK
Po 0 0 0 15 4E352DCA 00000000 ~~
Li EVQPUK
Sc 0
AR EVQPUK
Op 0 0 0
T0 0 1496 394 394 0 39 N I 21 N "EVQPUK"
T1 20 -1043 394 394 0 39 N V 21 N "VAL**"
DS -512 689 -512 1083 150 21
DS -512 1083 512 1083 150 21
DS 512 1083 512 689 150 21
DS -925 -689 925 -689 150 21
DS 925 -689 925 689 150 21
DS 925 689 -925 689 150 21
DS -925 689 -925 -689 150 21
$PAD
Sh "1" R 551 394 0 0 0
Dr 0 0 0
At SMD N 00888000
Ne 0 ""
Po -1004 -335
$EndPAD
$PAD
Sh "2" R 551 394 0 0 0
Dr 0 0 0
At SMD N 00888000
Ne 0 ""
Po -1004 354
$EndPAD
$PAD
Sh "1" R 551 394 0 0 0
Dr 0 0 0
At SMD N 00888000
Ne 0 ""
Po 1004 -335
$EndPAD
$PAD
Sh "2" R 551 394 0 0 0
Dr 0 0 0
At SMD N 00888000
Ne 0 ""
Po 1004 354
$EndPAD
$EndMODULE EVQPUK
$MODULE FEMTODUINO_v0.2
Po 0 0 0 15 4DE391C2 00000000 ~~
Li FEMTODUINO_v0.2
Sc 0
AR FEMTODUINO_v0.2
Op 0 0 0
T0 0 3800 600 600 0 120 N I 21 N "FEMTODUINO_v0.2"
T1 0 0 600 600 0 120 N I 21 N "VAL**"
DS -4075 3000 -4075 -3000 150 21
DS -4075 3000 4075 3000 150 21
DS 4075 3000 4075 -2975 150 21
DS 4075 -3000 -4075 -3000 150 21
$PAD
Sh "1" O 420 600 0 0 0
Dr 280 0 0
At STD N 00E0FFFF
Ne 0 ""
Po -3425 -2550
$EndPAD
$PAD
Sh "2" O 420 600 0 0 0
Dr 280 0 0
At STD N 00E0FFFF
Ne 0 ""
Po -2925 -2550
$EndPAD
$PAD
Sh "5" O 420 600 0 0 0
Dr 280 0 0
At STD N 00E0FFFF
Ne 0 ""
Po -1425 -2550
$EndPAD
$PAD
Sh "7" O 420 600 0 0 0
Dr 280 0 0
At STD N 00E0FFFF
Ne 0 ""
Po -425 -2550
$EndPAD
$PAD
Sh "8" O 420 600 0 0 0
Dr 280 0 0
At STD N 00E0FFFF
Ne 0 ""
Po 75 -2550
$EndPAD
$PAD
Sh "9" O 420 600 0 0 0
Dr 280 0 0
At STD N 00E0FFFF
Ne 0 ""
Po 575 -2550
$EndPAD
$PAD
Sh "10" O 420 600 0 0 0
Dr 280 0 0
At STD N 00E0FFFF
Ne 0 ""
Po 1075 -2550
$EndPAD
$PAD
Sh "11" O 420 600 0 0 0
Dr 280 0 0
At STD N 00E0FFFF
Ne 0 ""
Po 1575 -2550
$EndPAD
$PAD
Sh "12" O 420 600 0 0 0
Dr 280 0 0
At STD N 00E0FFFF
Ne 0 ""
Po 2075 -2550
$EndPAD
$PAD
Sh "13" O 420 600 0 0 0
Dr 280 0 0
At STD N 00E0FFFF
Ne 0 ""
Po 2575 -2550
$EndPAD
$PAD
Sh "14" O 420 600 0 0 0
Dr 280 0 0
At STD N 00E0FFFF
Ne 0 ""
Po 3075 -2550
$EndPAD
$PAD
Sh "15" O 420 600 0 0 900
Dr 280 0 0
At STD N 00E0FFFF
Ne 0 ""
Po 3575 -2050
$EndPAD
$PAD
Sh "16" O 420 600 0 0 900
Dr 280 0 0
At STD N 00E0FFFF
Ne 0 ""
Po 3575 -1550
$EndPAD
$PAD
Sh "17" O 420 600 0 0 900
Dr 280 0 0
At STD N 00E0FFFF
Ne 0 ""
Po 3575 -1050
$EndPAD
$PAD
Sh "18" O 420 600 0 0 900
Dr 280 0 0
At STD N 00E0FFFF
Ne 0 ""
Po 3575 -550
$EndPAD
$PAD
Sh "19" O 420 600 0 0 900
Dr 280 0 0
At STD N 00E0FFFF
Ne 0 ""
Po 3575 -50
$EndPAD
$PAD
Sh "20" O 420 600 0 0 900
Dr 280 0 0
At STD N 00E0FFFF
Ne 0 ""
Po 3575 450
$EndPAD
$PAD
Sh "21" O 420 600 0 0 0
Dr 280 0 0
At STD N 00E0FFFF
Ne 0 ""
Po 2075 2450
$EndPAD
$PAD
Sh "22" O 420 600 0 0 0
Dr 280 0 0
At STD N 00E0FFFF
Ne 0 ""
Po 1575 2450
$EndPAD
$PAD
Sh "23" O 420 600 0 0 0
Dr 280 0 0
At STD N 00E0FFFF
Ne 0 ""
Po 1075 2450
$EndPAD
$PAD
Sh "24" O 420 600 0 0 0
Dr 280 0 0
At STD N 00E0FFFF
Ne 0 ""
Po 575 2450
$EndPAD
$PAD
Sh "25" O 420 600 0 0 0
Dr 280 0 0
At STD N 00E0FFFF
Ne 0 ""
Po 75 2450
$EndPAD
$PAD
Sh "26" O 420 600 0 0 0
Dr 280 0 0
At STD N 00E0FFFF
Ne 0 ""
Po -425 2450
$EndPAD
$PAD
Sh "27" O 420 600 0 0 0
Dr 280 0 0
At STD N 00E0FFFF
Ne 0 ""
Po -925 2450
$EndPAD
$PAD
Sh "28" O 420 600 0 0 0
Dr 280 0 0
At STD N 00E0FFFF
Ne 0 ""
Po -1425 2450
$EndPAD
$PAD
Sh "3" O 420 600 0 0 0
Dr 280 0 0
At STD N 00E0FFFF
Ne 0 ""
Po -2425 -2550
$EndPAD
$PAD
Sh "4" O 420 600 0 0 0
Dr 280 0 0
At STD N 00E0FFFF
Ne 0 ""
Po -1925 -2550
$EndPAD
$PAD
Sh "6" O 420 600 0 0 0
Dr 280 0 0
At STD N 00E0FFFF
Ne 0 ""
Po -925 -2550
$EndPAD
$EndMODULE FEMTODUINO_v0.2
$MODULE FIDUCIAL_1.5mm
Po 0 0 0 15 4E85DC42 00000000 ~~
Li FIDUCIAL_1.5mm
Sc 0
AR FIDUCIAL_1.5mm
Op 0 0 0
T0 0 -551 197 197 0 39 N I 21 N "FIDUCIAL_1.5mm"
T1 0 591 197 197 0 39 N I 21 N "VAL**"
$PAD
Sh "1" C 591 591 0 0 0
Dr 0 0 0
At SMD N 00808000
Ne 0 ""
Po 0 0
.SolderMask 591
.LocalClearance 591
$EndPAD
$EndMODULE FIDUCIAL_1.5mm
$MODULE FIDUCIAL_1mm_noborder
Po 0 0 0 15 4ED74F5B 00000000 ~~
Li FIDUCIAL_1mm_noborder
Sc 0
AR FIDUCIAL_1.5mm
Op 0 0 0
T0 0 -551 197 197 0 39 N I 21 N "FIDUCIAL_1mm_noborder"
T1 0 591 197 197 0 39 N I 21 N "VAL**"
$PAD
Sh "" C 591 591 0 0 0
Dr 0 0 0
At SMD N 00808000
Ne 0 ""
Po 0 0
$EndPAD
$EndMODULE FIDUCIAL_1mm_noborder
$MODULE FREEIMU_V035
Po 0 0 0 15 4E43D598 00000000 ~~
Li FREEIMU_V035
Cd FreeIMU v0.3.5
Kw CONN DEV
Sc 0
AR
Op 0 0 0
T0 0 1000 200 200 0 50 N I 21 N "FREEIMU_V035"
T1 0 -1000 600 400 0 100 N I 21 N "Val**"
DS 4350 0 4350 -6900 150 21
DS 4350 -6900 -4350 -6900 150 21
DS -4350 -6900 -4350 -350 150 21
DS 650 850 4350 850 150 21
DS 4350 850 4350 -500 150 21
DS -4350 -350 -4350 850 150 21
DS -4350 850 -50 850 150 21
DS 0 850 650 850 150 21
$PAD
Sh "2" O 550 1000 0 0 0
Dr 400 0 0
At STD N 00E0FFFF
Ne 0 ""
Po -2500 0
$EndPAD
$PAD
Sh "3" O 550 1000 0 0 0
Dr 400 0 0
At STD N 00E0FFFF
Ne 0 ""
Po -1500 0
$EndPAD
$PAD
Sh "4" O 550 1000 0 0 0
Dr 400 0 0
At STD N 00E0FFFF
Ne 0 ""
Po -500 0
$EndPAD
$PAD
Sh "5" O 550 1000 0 0 0
Dr 400 0 0
At STD N 00E0FFFF
Ne 0 ""
Po 500 0
$EndPAD
$PAD
Sh "6" O 550 1000 0 0 0
Dr 400 0 0
At STD N 00E0FFFF
Ne 0 ""
Po 1500 0
$EndPAD
$PAD
Sh "1" O 550 1000 0 0 0
Dr 400 0 0
At STD N 00E0FFFF
Ne 0 ""
Po -3500 0
$EndPAD
$PAD
Sh "7" O 550 1000 0 0 0
Dr 400 0 0
At STD N 00E0FFFF
Ne 0 ""
Po 2500 0
$EndPAD
$PAD
Sh "8" O 550 1000 0 0 0
Dr 400 0 0
At STD N 00E0FFFF
Ne 0 ""
Po 3500 0
$EndPAD
$EndMODULE FREEIMU_V035
$MODULE FreeIMU_v0.3
Po 0 0 0 15 4DE4DC79 00000000 ~~
Li FreeIMU_v0.3
Sc 0
AR FreeIMU_v0.3
Op 0 0 0
T0 7450 -4550 600 600 0 120 N V 21 N "FreeIMU_v0.3"
T1 7500 -3200 600 600 0 120 N V 21 N "VAL**"
DS 0 0 14750 0 150 21
DS 14750 0 14750 -7750 150 21
DS 14750 -7750 0 -7750 150 21
DS 0 -7750 0 0 150 21
$PAD
Sh "2" O 550 800 0 0 0
Dr 400 0 0
At STD N 00E0FFFF
Ne 0 ""
Po 2350 -1000
$EndPAD
$PAD
Sh "3" O 550 800 0 0 0
Dr 400 0 0
At STD N 00E0FFFF
Ne 0 ""
Po 3350 -1000
$EndPAD
$PAD
Sh "4" O 550 800 0 0 0
Dr 400 0 0
At STD N 00E0FFFF
Ne 0 ""
Po 4350 -1000
$EndPAD
$PAD
Sh "5" O 550 800 0 0 0
Dr 400 0 0
At STD N 00E0FFFF
Ne 0 ""
Po 5350 -1000
$EndPAD
$PAD
Sh "6" O 550 800 0 0 0
Dr 400 0 0
At STD N 00E0FFFF
Ne 0 ""
Po 6350 -1000
$EndPAD
$PAD
Sh "7" O 550 800 0 0 0
Dr 400 0 0
At STD N 00E0FFFF
Ne 0 ""
Po 7350 -1000
$EndPAD
$PAD
Sh "1" O 550 800 0 0 0
Dr 400 0 0
At STD N 00E0FFFF
Ne 0 ""
Po 1350 -1000
$EndPAD
$PAD
Sh "1" O 550 800 0 0 0
Dr 400 0 0
At STD N 00E0FFFF
Ne 0 ""
Po 10350 -1000
$EndPAD
$PAD
Sh "8" O 550 800 0 0 0
Dr 400 0 0
At STD N 00E0FFFF
Ne 0 ""
Po 11350 -1000
$EndPAD
$PAD
Sh "9" O 550 800 0 0 0
Dr 400 0 0
At STD N 00E0FFFF
Ne 0 ""
Po 12350 -1000
$EndPAD
$PAD
Sh "10" O 550 800 0 0 0
Dr 400 0 0
At STD N 00E0FFFF
Ne 0 ""
Po 13350 -1000
$EndPAD
$EndMODULE FreeIMU_v0.3
$MODULE HMC5843
Po 0 0 0 15 4D385FCF 00000000 ~~
Li HMC5843
Sc 0
AR
Op 0 0 0
T0 0 -1496 482 482 0 81 N I 21 N "HMC5843"
T1 0 1654 482 482 0 81 N I 21 N "VAL**"
DC 945 -945 1024 -1024 100 21
DS -866 -551 -866 -866 100 21
DS -866 -866 -551 -866 100 21
DS -551 866 -866 866 100 21
DS -866 866 -866 551 100 21
DS 866 551 866 866 100 21
DS 866 866 551 866 100 21
DS 551 -866 866 -866 100 21
DS 866 -866 866 -551 100 21
$PAD
Sh "16" R 354 98 0 0 0
Dr 0 0 0
At SMD N 00888000
Ne 0 ""
Po 807 398
$EndPAD
$PAD
Sh "18" R 354 98 0 0 0
Dr 0 0 0
At SMD N 00888000
Ne 0 ""
Po 807 0
$EndPAD
$PAD
Sh "19" R 354 98 0 0 0
Dr 0 0 0
At SMD N 00888000
Ne 0 ""
Po 807 -197
$EndPAD
$PAD
Sh "20" R 354 98 0 0 0
Dr 0 0 0
At SMD N 00888000
Ne 0 ""
Po 807 -394
$EndPAD
$PAD
Sh "17" R 354 98 0 0 0
Dr 0 0 0
At SMD N 00888000
Ne 0 ""
Po 807 197
$EndPAD
$PAD
Sh "8" R 354 98 0 0 0
Dr 0 0 0
At SMD N 00888000
Ne 0 ""
Po -807 0
$EndPAD
$PAD
Sh "9" R 354 98 0 0 0
Dr 0 0 0
At SMD N 00888000
Ne 0 ""
Po -807 197
$EndPAD
$PAD
Sh "10" R 354 98 0 0 0
Dr 0 0 0
At SMD N 00888000
Ne 0 ""
Po -807 394
$EndPAD
$PAD
Sh "7" R 354 98 0 0 0
Dr 0 0 0
At SMD N 00888000
Ne 0 ""
Po -807 -197
$EndPAD
$PAD
Sh "6" R 354 98 0 0 0
Dr 0 0 0
At SMD N 00888000
Ne 0 ""
Po -807 -394
$EndPAD
$PAD
Sh "13" R 354 98 0 0 900
Dr 0 0 0
At SMD N 00888000
Ne 0 ""
Po 0 807
$EndPAD
$PAD
Sh "14" R 354 98 0 0 900
Dr 0 0 0
At SMD N 00888000
Ne 0 ""
Po 197 807
$EndPAD
$PAD
Sh "15" R 354 98 0 0 900
Dr 0 0 0
At SMD N 00888000
Ne 0 ""
Po 394 807
$EndPAD
$PAD
Sh "12" R 354 98 0 0 900
Dr 0 0 0
At SMD N 00888000
Ne 0 ""
Po -197 807
$EndPAD
$PAD
Sh "11" R 354 98 0 0 900
Dr 0 0 0
At SMD N 00888000
Ne 0 ""
Po -394 807
$EndPAD
$PAD
Sh "3" R 354 98 0 0 900
Dr 0 0 0
At SMD N 00888000
Ne 0 ""
Po 0 -807
$EndPAD
$PAD
Sh "4" R 354 98 0 0 900
Dr 0 0 0
At SMD N 00888000
Ne 0 ""
Po -197 -807
$EndPAD
$PAD
Sh "5" R 354 98 0 0 900
Dr 0 0 0
At SMD N 00888000
Ne 0 ""
Po -394 -807
$EndPAD
$PAD
Sh "1" R 354 98 0 0 900
Dr 0 0 0
At SMD N 00888000
Ne 0 ""
Po 394 -807
$EndPAD
$PAD
Sh "2" R 354 98 0 0 900
Dr 0 0 0
At SMD N 00888000
Ne 0 ""
Po 197 -807
$EndPAD
$EndMODULE HMC5843
$MODULE HMC5883L
Po 0 0 0 15 4FF95EB5 00000000 ~~
Li HMC5883L
Sc 0
AR /4FE337EF/4D45A154
Op 0 0 0
At SMD
T0 -10 -20 196 196 0 39 N V 21 N "U201"
T1 0 974 197 197 0 39 N I 21 N "HMC5883"
DS -217 197 -138 295 39 25
DS 325 -217 217 -89 39 25
DS 207 -217 266 -148 39 25
DS -217 295 -128 197 39 25
DS 295 0 246 59 39 25
DS 295 0 246 -59 39 25
DC 0 0 30 -39 39 25
DS 0 295 -69 217 39 25
DS 0 295 59 217 39 25
DS 0 0 295 0 39 25
DS 0 0 0 285 39 25
DS -581 -374 -374 -581 60 21
DS 591 -581 591 -384 60 21
DS 591 591 591 384 60 21
DS -591 -591 -591 -374 60 21
DS -591 -591 -374 -591 60 21
DS -591 600 -374 600 60 21
DS -591 591 -591 384 60 21
DS 591 591 374 591 60 21
DS 591 -581 374 -581 60 21
$PAD
Sh "2" R 250 118 0 0 0
Dr 0 0 0
At SMD N 00888000
Ne 8 "VCC"
Po -541 -98
$EndPAD
$PAD
Sh "1" R 250 118 0 0 0
Dr 0 0 0
At SMD N 00888000
Ne 2 "/HMC5883L/SCL"
Po -541 -285
$EndPAD
$PAD
Sh "3" R 250 118 0 0 0
Dr 0 0 0
At SMD N 00888000
Ne 0 ""
Po -541 98
$EndPAD
$PAD
Sh "4" R 250 118 0 0 0
Dr 0 0 0
At SMD N 00888000
Ne 8 "VCC"
Po -541 295
$EndPAD
$PAD
Sh "11" R 250 118 0 0 0
Dr 0 0 0
At SMD N 00888000
Ne 6 "GND"
Po 531 -98
$EndPAD
$PAD
Sh "12" R 250 118 0 0 0
Dr 0 0 0
At SMD N 00888000
Ne 4 "/HMC5883L/SETC"
Po 531 -295
$EndPAD
$PAD
Sh "10" R 250 118 0 0 0
Dr 0 0 0
At SMD N 00888000
Ne 7 "N-000077"
Po 531 98
$EndPAD
$PAD
Sh "9" R 250 118 0 0 0
Dr 0 0 0
At SMD N 00888000
Ne 6 "GND"
Po 531 295
$EndPAD
$PAD
Sh "6" R 250 118 0 0 900
Dr 0 0 0
At SMD N 00888000
Ne 0 ""
Po -98 531
$EndPAD
$PAD
Sh "7" R 250 118 0 0 900
Dr 0 0 0
At SMD N 00888000
Ne 0 ""
Po 98 531
$EndPAD
$PAD
Sh "8" R 250 118 0 0 900
Dr 0 0 0
At SMD N 00888000
Ne 5 "/HMC5883L/SETP"
Po 285 531
$EndPAD
$PAD
Sh "5" R 250 118 0 0 900
Dr 0 0 0
At SMD N 00888000
Ne 0 ""
Po -285 531
$EndPAD
$PAD
Sh "13" R 250 118 0 0 900
Dr 0 0 0
At SMD N 00888000
Ne 8 "VCC"
Po 285 -541
$EndPAD
$PAD
Sh "14" R 250 118 0 0 900
Dr 0 0 0
At SMD N 00888000
Ne 0 ""
Po 98 -541
$EndPAD
$PAD
Sh "15" R 250 118 0 0 900
Dr 0 0 0
At SMD N 00888000
Ne 1 "/HMC5883L/DRDY"
Po -98 -541
$EndPAD
$PAD
Sh "16" R 250 118 0 0 900
Dr 0 0 0
At SMD N 00888000
Ne 3 "/HMC5883L/SDA"
Po -285 -541
$EndPAD
$EndMODULE HMC5883L
$MODULE HMC5883L_bigpads
Po 0 0 0 15 4DEE8368 00000000 ~~
Li HMC5883L_bigpads
Sc 0
AR HMC5883
Op 0 0 0
T0 0 -886 197 197 0 39 N I 21 N "HMC5883L"
T1 0 974 197 197 0 39 N I 21 N "VAL**"
DS -217 197 -138 295 39 25
DS 325 -217 217 -89 39 25
DS 207 -217 266 -148 39 25
DS -217 295 -128 197 39 25
DS 295 0 246 59 39 25
DS 295 0 246 -59 39 25
DC 0 0 30 -39 39 25
DS 0 295 -69 217 39 25
DS 0 295 59 217 39 25
DS 0 0 295 0 39 25
DS 0 0 0 285 39 25
DS -581 -374 -374 -581 60 21
DS 591 -581 591 -384 60 21
DS 591 591 591 384 60 21
DS -591 -591 -591 -374 60 21
DS -591 -591 -374 -591 60 21
DS -591 600 -374 600 60 21
DS -591 591 -591 384 60 21
DS 591 591 374 591 60 21
DS 591 -581 374 -581 60 21
$PAD
Sh "2" R 350 130 0 0 0
Dr 0 0 0
At SMD N 00888000
Ne 0 ""
Po -560 -100
$EndPAD
$PAD
Sh "1" R 350 130 0 0 0
Dr 0 0 0
At SMD N 00888000
Ne 0 ""
Po -560 -300
$EndPAD
$PAD
Sh "3" R 350 130 0 0 0
Dr 0 0 0
At SMD N 00888000
Ne 0 ""
Po -560 100
$EndPAD
$PAD
Sh "4" R 350 130 0 0 0
Dr 0 0 0
At SMD N 00888000
Ne 0 ""
Po -560 300
$EndPAD
$PAD
Sh "11" R 350 130 0 0 0
Dr 0 0 0
At SMD N 00888000
Ne 0 ""
Po 580 -100
$EndPAD
$PAD
Sh "12" R 350 130 0 0 0
Dr 0 0 0
At SMD N 00888000
Ne 0 ""
Po 580 -300
$EndPAD
$PAD
Sh "10" R 350 130 0 0 0
Dr 0 0 0
At SMD N 00888000
Ne 0 ""
Po 580 100
$EndPAD
$PAD
Sh "9" R 350 130 0 0 0
Dr 0 0 0
At SMD N 00888000
Ne 0 ""
Po 580 300
$EndPAD
$PAD
Sh "6" R 350 130 0 0 900
Dr 0 0 0
At SMD N 00888000
Ne 0 ""
Po -100 580
$EndPAD
$PAD
Sh "7" R 350 130 0 0 900
Dr 0 0 0
At SMD N 00888000
Ne 0 ""
Po 100 580
$EndPAD
$PAD
Sh "8" R 350 130 0 0 900
Dr 0 0 0
At SMD N 00888000
Ne 0 ""
Po 280 580
$EndPAD
$PAD
Sh "5" R 350 130 0 0 900
Dr 0 0 0
At SMD N 00888000
Ne 0 ""
Po -280 580
$EndPAD
$PAD
Sh "13" R 350 130 0 0 900
Dr 0 0 0
At SMD N 00888000
Ne 0 ""
Po 280 -600
$EndPAD
$PAD
Sh "14" R 350 130 0 0 900
Dr 0 0 0
At SMD N 00888000
Ne 0 ""
Po 100 -600
$EndPAD
$PAD
Sh "15" R 350 130 0 0 900
Dr 0 0 0
At SMD N 00888000
Ne 0 ""
Po -100 -600
$EndPAD
$PAD
Sh "16" R 350 130 0 0 900
Dr 0 0 0
At SMD N 00888000
Ne 0 ""
Po -280 -600
$EndPAD
$EndMODULE HMC5883L_bigpads
$MODULE ITG3200
Po 0 0 0 15 4D385A09 00000000 ~~
Li ITG3200
Sc 0
AR /4CC6DCC0
Op 0 0 0
T0 0 -1969 600 600 0 120 N I 21 N "U1"
T1 0 1969 482 482 0 120 N I 21 N "ITG3200"
DS -866 -630 -866 -866 100 21
DS -866 -866 -630 -866 100 21
DS -630 866 -866 866 100 21
DS -866 866 -866 630 100 21
DS 866 630 866 866 100 21
DS 866 866 630 866 100 21
DS 630 -866 866 -866 100 21
DS 866 -866 866 -630 100 21
T2 0 0 118 118 0 19 N I 21 N "no vias here!"
DC -993 -974 -866 -886 100 21
$PAD
Sh "5" R 394 98 0 0 0
Dr 0 0 0
At SMD N 00888000
Ne 0 ""
Po -846 295
.LocalClearance 49
$EndPAD
$PAD
Sh "3" R 394 98 0 0 0
Dr 0 0 0
At SMD N 00888000
Ne 0 ""
Po -846 -98
.LocalClearance 49
$EndPAD
$PAD
Sh "4" R 394 98 0 0 0
Dr 0 0 0
At SMD N 00888000
Ne 0 ""
Po -846 98
.LocalClearance 49
$EndPAD
$PAD
Sh "6" R 394 98 0 0 0
Dr 0 0 0
At SMD N 00888000
Ne 0 ""
Po -846 492
.LocalClearance 49
$EndPAD
$PAD
Sh "2" R 394 98 0 0 0
Dr 0 0 0
At SMD N 00888000
Ne 0 ""
Po -846 -295
.LocalClearance 49
$EndPAD
$PAD
Sh "1" R 394 98 0 0 0
Dr 0 0 0
At SMD N 00888000
Ne 3 "/GND"
Po -846 -492
.LocalClearance 49
$EndPAD
$PAD
Sh "24" R 394 98 0 0 900
Dr 0 0 0
At SMD N 00888000
Ne 6 "/SDA"
Po -492 -856
.LocalClearance 49
$EndPAD
$PAD
Sh "23" R 394 98 0 0 900
Dr 0 0 0
At SMD N 00888000
Ne 5 "/SCL"
Po -295 -856
.LocalClearance 49
$EndPAD
$PAD
Sh "22" R 394 98 0 0 900
Dr 0 0 0
At SMD N 00888000
Ne 0 ""
Po -98 -856
.LocalClearance 49
$EndPAD
$PAD
Sh "20" R 394 98 0 0 900
Dr 0 0 0
At SMD N 00888000
Ne 7 "N-000017"
Po 295 -856
.LocalClearance 49
$EndPAD
$PAD
Sh "21" R 394 98 0 0 900
Dr 0 0 0
At SMD N 00888000
Ne 0 ""
Po 98 -856
.LocalClearance 49
$EndPAD
$PAD
Sh "19" R 394 98 0 0 900
Dr 0 0 0
At SMD N 00888000
Ne 0 ""
Po 492 -856
.LocalClearance 49
$EndPAD
$PAD
Sh "18" R 394 98 0 0 0
Dr 0 0 0
At SMD N 00888000
Ne 3 "/GND"
Po 846 -492
.LocalClearance 49
$EndPAD
$PAD
Sh "17" R 394 98 0 0 0
Dr 0 0 0
At SMD N 00888000
Ne 0 ""
Po 846 -295
.LocalClearance 49
$EndPAD
$PAD
Sh "13" R 394 98 0 0 0
Dr 0 0 0
At SMD N 00888000
Ne 1 "/3.3V"
Po 846 492
.LocalClearance 49
$EndPAD
$PAD
Sh "15" R 394 98 0 0 0
Dr 0 0 0
At SMD N 00888000
Ne 0 ""
Po 846 98
.LocalClearance 49
$EndPAD
$PAD
Sh "16" R 394 98 0 0 0
Dr 0 0 0
At SMD N 00888000
Ne 0 ""
Po 846 -98
.LocalClearance 49
$EndPAD
$PAD
Sh "14" R 394 98 0 0 0
Dr 0 0 0
At SMD N 00888000
Ne 0 ""
Po 846 295
.LocalClearance 49
$EndPAD
$PAD
Sh "12" R 394 98 0 0 900
Dr 0 0 0
At SMD N 00888000
Ne 4 "/INT"
Po 492 856
.LocalClearance 49
$EndPAD
$PAD
Sh "10" R 394 98 0 0 900
Dr 0 0 0
At SMD N 00888000
Ne 8 "N-000021"
Po 98 856
.LocalClearance 49
$EndPAD
$PAD
Sh "11" R 394 98 0 0 900
Dr 0 0 0
At SMD N 00888000
Ne 3 "/GND"
Po 295 856
.LocalClearance 49
$EndPAD
$PAD
Sh "9" R 394 98 0 0 900
Dr 0 0 0
At SMD N 00888000
Ne 2 "/AD0"
Po -98 856
.LocalClearance 49
$EndPAD
$PAD
Sh "8" R 394 98 0 0 900
Dr 0 0 0
At SMD N 00888000
Ne 1 "/3.3V"
Po -295 856
.LocalClearance 49
$EndPAD
$PAD
Sh "7" R 394 98 0 0 900
Dr 0 0 0
At SMD N 00888000
Ne 0 ""
Po -492 856
.LocalClearance 49
$EndPAD
$EndMODULE ITG3200
$MODULE JST_Battery
Po 0 0 0 15 4FF94707 00000000 ~~
Li JST_Battery
Cd JST Connector for batteries Sparkfun style
Sc 0
AR
Op 0 0 0
At SMD
T0 -100 -580 160 160 0 35 N V 20 N "JST_Battery"
T1 -20 -80 160 160 0 35 N V 20 N "VAL**"
DS -1574 393 -1574 1771 80 21
DS -1574 1771 -1259 1771 80 21
DS -1259 1771 -1259 787 80 21
DS -1259 787 -787 787 80 21
DS 787 787 1259 787 80 21
DS 1259 787 1259 1771 80 21
DS 1259 1771 1574 1771 80 21
DS 1574 1771 1574 393 80 21
DS 787 -1181 -787 -1181 80 21
T2 1100 1500 500 500 0 35 N V 20 N "+"
T2 -900 1500 500 500 0 35 N V 20 N "-"
$PAD
Sh "2" R 392 1810 0 0 0
Dr 0 0 0
At SMD N 00888000
Ne 0 ""
Po -392 1455
$EndPAD
$PAD
Sh "1" R 392 1810 0 0 0
Dr 0 0 0
At SMD N 00888000
Ne 0 ""
Po 392 1455
$EndPAD
$PAD
Sh "NC1" R 1337 629 0 0 900
Dr 0 0 0
At SMD N 00888000
Ne 0 ""
Po -1337 -590
$EndPAD
$PAD
Sh "NC2" R 1337 629 0 0 900
Dr 0 0 0
At SMD N 00888000
Ne 0 ""
Po 1337 -590
$EndPAD
$EndMODULE JST_Battery
$MODULE JUMP_2
Po 0 0 0 15 4D377C53 00000000 ~~
Li JUMP_2
Sc 0
AR
Op 0 0 0
T0 0 -1102 197 197 0 41 N V 21 N "JUMP_2"
T1 0 1181 197 197 0 39 N V 21 N "VAL**"
$PAD
Sh "1" R 550 350 0 0 0
Dr 0 0 0
At SMD N 00888000
Ne 0 ""
Po 0 0
$EndPAD
$PAD
Sh "2" R 550 350 0 0 0
Dr 0 0 0
At SMD N 00888000
Ne 0 ""
Po 0 -630
$EndPAD
$PAD
Sh "3" R 550 350 0 0 0
Dr 0 0 0
At SMD N 00888000
Ne 0 ""
Po 0 630
$EndPAD
$EndMODULE JUMP_2
$MODULE JUMP_2_SMALL_NO_PASTE
Po 0 0 0 15 4E859293 00000000 ~~
Li JUMP_2_SMALL_NO_PASTE
Cd 2 ways solder jumper
Sc 0
AR
Op 0 0 0
T0 0 -1102 197 197 0 41 N I 21 N "JUMP_2_SMALL_NO_PASTE"
T1 0 900 197 197 0 39 N I 21 N "VAL**"
$PAD
Sh "1" R 550 350 0 0 0
Dr 0 0 0
At SMD N 00888000
Ne 0 ""
Po 0 -100
$EndPAD
$PAD
Sh "2" R 550 350 0 0 0
Dr 0 0 0
At SMD N 00888000
Ne 0 ""
Po 0 -560
$EndPAD
$PAD
Sh "3" R 550 350 0 0 0
Dr 0 0 0
At SMD N 00888000
Ne 0 ""
Po 0 350
$EndPAD
$EndMODULE JUMP_2_SMALL_NO_PASTE
$MODULE JUMP_2_WITH_PASTE
Po 0 0 0 15 4D38201C 00000000 ~~
Li JUMP_2_WITH_PASTE
Sc 0
AR
Op 0 0 0
T0 0 -1102 197 197 0 41 N I 21 N "JUMP_2_WITH_PASTE"
T1 0 1181 197 197 0 39 N V 21 N "VAL**"
$PAD
Sh "1" R 550 350 0 0 0
Dr 0 0 0
At SMD N 00888000
Ne 0 ""
Po 0 0
$EndPAD
$PAD
Sh "2" R 550 350 0 0 0
Dr 0 0 0
At SMD N 00888000
Ne 0 ""
Po 0 -630
$EndPAD
$PAD
Sh "3" R 550 350 0 0 0
Dr 0 0 0
At SMD N 00888000
Ne 0 ""
Po 0 630
$EndPAD
$PAD
Sh "" R 550 394 0 0 900
Dr 0 0 0
At SMD N 00080000
Ne 0 ""
Po 0 -315
$EndPAD
$EndMODULE JUMP_2_WITH_PASTE
$MODULE JUMP_2_WITH_PASTE_2
Po 0 0 0 15 4D476B3B 00000000 ~~
Li JUMP_2_WITH_PASTE_2
Sc 0
AR
Op 0 0 0
T0 0 -1102 197 197 0 41 N I 21 N "JUMP_2_WITH_PASTE_2"
T1 0 900 197 197 0 39 N I 21 N "VAL**"
$PAD
Sh "1" R 550 350 0 0 0
Dr 0 0 0
At SMD N 00888000
Ne 0 ""
Po 0 -100
$EndPAD
$PAD
Sh "2" R 550 350 0 0 0
Dr 0 0 0
At SMD N 00888000
Ne 0 ""
Po 0 -560
$EndPAD
$PAD
Sh "3" R 550 350 0 0 0
Dr 0 0 0
At SMD N 00888000
Ne 0 ""
Po 0 350
$EndPAD
$PAD
Sh "" R 550 394 0 0 900
Dr 0 0 0
At SMD N 00080000
Ne 0 ""
Po 0 -315
$EndPAD
$EndMODULE JUMP_2_WITH_PASTE_2
$MODULE KSS241G
Po 0 0 0 15 4F93B916 00000000 ~~
Li KSS241G
Sc 0
AR KSS241G
Op 0 0 0
T0 0 0 200 200 0 50 N I 21 N "KSS241G"
T1 0 -1024 400 400 0 60 N V 21 N "VAL**"
DS 492 925 -502 925 150 21
DS -502 925 -502 610 150 21
DS 492 925 492 610 150 21
DS 1083 -610 1083 610 150 21
DS 1083 610 -1083 610 150 21
DS -1083 610 -1083 -610 150 21
DS -1083 -610 1083 -610 150 21
$PAD
Sh "2" R 669 1457 0 0 0
Dr 0 0 0
At SMD N 00888000
Ne 0 ""
Po -1161 0
$EndPAD
$PAD
Sh "1" R 669 1457 0 0 0
Dr 0 0 0
At SMD N 00888000
Ne 0 ""
Po 1161 0
$EndPAD
$EndMODULE KSS241G
$MODULE LibreBB_MS5611-01BA
Po 0 0 0 15 4DE4DA1F 00000000 ~~
Li LibreBB_MS5611-01BA
Sc 0
AR
Op 0 0 0
T0 0 0 600 600 0 120 N V 21 N "LibreBB_MS5611-01BA"
T1 0 0 600 600 0 120 N V 21 N "VAL**"
DS 0 0 6000 0 150 21
DS 6000 0 6000 -4400 150 21
DS 6000 -4400 0 -4400 150 21
DS 0 -4400 0 0 150 21
$PAD
Sh "1" O 550 1000 0 0 900
Dr 400 0 0
At STD N 00E0FFFF
Ne 0 ""
Po 5250 -3700
$EndPAD
$PAD
Sh "2" O 550 1000 0 0 900
Dr 400 0 0
At STD N 00E0FFFF
Ne 0 ""
Po 5250 -2700
$EndPAD
$PAD
Sh "3" O 550 1000 0 0 900
Dr 400 0 0
At STD N 00E0FFFF
Ne 0 ""
Po 5250 -1700
$EndPAD
$PAD
Sh "4" O 550 1000 0 0 900
Dr 400 0 0
At STD N 00E0FFFF
Ne 0 ""
Po 5250 -700
$EndPAD
$EndMODULE LibreBB_MS5611-01BA
$MODULE LibreMini
Po 0 0 0 15 4E43DD2E 00000000 ~~
Li LibreMini
Sc 0
AR
Op 0 0 0
T0 0 -750 600 600 0 120 N V 21 N "LibreMini"
T1 0 750 600 600 0 120 N V 21 N "VAL**"
DS 13000 0 13000 -7000 150 21
DS 13000 -7000 0 -7000 150 21
DS 0 -7000 0 0 150 21
DS 0 0 13000 0 150 21
$PAD
Sh "1" C 700 700 0 0 0
Dr 400 0 0
At STD N 00E0FFFF
Ne 0 ""
Po 1500 -6500
$EndPAD
$PAD
Sh "2" C 700 700 0 0 0
Dr 400 0 0
At STD N 00E0FFFF
Ne 0 ""
Po 2500 -6500
$EndPAD
$PAD
Sh "3" C 700 700 0 0 0
Dr 400 0 0
At STD N 00E0FFFF
Ne 0 ""
Po 3500 -6500
$EndPAD
$PAD
Sh "4" C 700 700 0 0 0
Dr 400 0 0
At STD N 00E0FFFF
Ne 0 ""
Po 4500 -6500
$EndPAD
$PAD
Sh "5" C 700 700 0 0 0
Dr 400 0 0
At STD N 00E0FFFF
Ne 0 ""
Po 5500 -6500
$EndPAD
$PAD
Sh "6" C 700 700 0 0 0
Dr 400 0 0
At STD N 00E0FFFF
Ne 0 ""
Po 6500 -6500
$EndPAD
$PAD
Sh "7" C 700 700 0 0 0
Dr 400 0 0
At STD N 00E0FFFF
Ne 0 ""
Po 7500 -6500
$EndPAD
$PAD
Sh "8" C 700 700 0 0 0
Dr 400 0 0
At STD N 00E0FFFF
Ne 0 ""
Po 8500 -6500
$EndPAD
$PAD
Sh "9" C 700 700 0 0 0
Dr 400 0 0
At STD N 00E0FFFF
Ne 0 ""
Po 9500 -6500
$EndPAD
$PAD
Sh "10" C 700 700 0 0 0
Dr 400 0 0
At STD N 00E0FFFF
Ne 0 ""
Po 10500 -6500
$EndPAD
$PAD
Sh "11" C 700 700 0 0 0
Dr 400 0 0
At STD N 00E0FFFF
Ne 0 ""
Po 11500 -6500
$EndPAD
$PAD
Sh "12" C 700 700 0 0 0
Dr 400 0 0
At STD N 00E0FFFF
Ne 0 ""
Po 12500 -6500
$EndPAD
$PAD
Sh "13" C 700 700 0 0 0
Dr 400 0 0
At STD N 00E0FFFF
Ne 0 ""
Po 1500 -500
$EndPAD
$PAD
Sh "14" C 700 700 0 0 0
Dr 400 0 0
At STD N 00E0FFFF
Ne 0 ""
Po 2500 -500
$EndPAD
$PAD
Sh "3" C 700 700 0 0 0
Dr 400 0 0
At STD N 00E0FFFF
Ne 0 ""
Po 3500 -500
$EndPAD
$PAD
Sh "2" C 700 700 0 0 0
Dr 400 0 0
At STD N 00E0FFFF
Ne 0 ""
Po 4500 -500
$EndPAD
$PAD
Sh "15" C 700 700 0 0 0
Dr 400 0 0
At STD N 00E0FFFF
Ne 0 ""
Po 5500 -500
$EndPAD
$PAD
Sh "16" C 700 700 0 0 0
Dr 400 0 0
At STD N 00E0FFFF
Ne 0 ""
Po 6500 -500
$EndPAD
$PAD
Sh "17" C 700 700 0 0 0
Dr 400 0 0
At STD N 00E0FFFF
Ne 0 ""
Po 7500 -500
$EndPAD
$PAD
Sh "18" C 700 700 0 0 0
Dr 400 0 0
At STD N 00E0FFFF
Ne 0 ""
Po 8500 -500
$EndPAD
$PAD
Sh "19" C 700 700 0 0 0
Dr 400 0 0
At STD N 00E0FFFF
Ne 0 ""
Po 9500 -500
$EndPAD
$PAD
Sh "20" C 700 700 0 0 0
Dr 400 0 0
At STD N 00E0FFFF
Ne 0 ""
Po 10500 -500
$EndPAD
$PAD
Sh "21" C 700 700 0 0 0
Dr 400 0 0
At STD N 00E0FFFF
Ne 0 ""
Po 11500 -500
$EndPAD
$PAD
Sh "22" C 700 700 0 0 0
Dr 400 0 0
At STD N 00E0FFFF
Ne 0 ""
Po 12500 -500
$EndPAD
$PAD
Sh "27" C 700 700 0 0 0
Dr 400 0 0
At STD N 00E0FFFF
Ne 0 ""
Po 500 -6000
$EndPAD
$PAD
Sh "28" C 700 700 0 0 0
Dr 400 0 0
At STD N 00E0FFFF
Ne 0 ""
Po 500 -5000
$EndPAD
$PAD
Sh "29" C 700 700 0 0 0
Dr 400 0 0
At STD N 00E0FFFF
Ne 0 ""
Po 500 -4000
$EndPAD
$PAD
Sh "30" C 700 700 0 0 0
Dr 400 0 0
At STD N 00E0FFFF
Ne 0 ""
Po 500 -3000
$EndPAD
$PAD
Sh "31" C 700 700 0 0 0
Dr 400 0 0
At STD N 00E0FFFF
Ne 0 ""
Po 500 -2000
$EndPAD
$PAD
Sh "32" C 700 700 0 0 0
Dr 400 0 0
At STD N 00E0FFFF
Ne 0 ""
Po 500 -1000
$EndPAD
$PAD
Sh "24" C 700 700 0 0 0
Dr 400 0 0
At STD N 00E0FFFF
Ne 0 ""
Po 4920 -5320
$EndPAD
$PAD
Sh "23" C 700 700 0 0 0
Dr 400 0 0
At STD N 00E0FFFF
Ne 0 ""
Po 5920 -5320
$EndPAD
$PAD
Sh "25" C 700 700 0 0 0
Dr 400 0 0
At STD N 00E0FFFF
Ne 0 ""
Po 10860 -2990
$EndPAD
$PAD
Sh "26" C 700 700 0 0 0
Dr 400 0 0
At STD N 00E0FFFF
Ne 0 ""
Po 10860 -3990
$EndPAD
$EndMODULE LibreMini
$MODULE LibreTooth
Po 0 0 0 15 4E4F809E 00000000 ~~
Li LibreTooth
Sc 0
AR
Op 0 0 0
T0 3250 1000 600 600 0 120 N I 21 N "LibreTooth"
T1 3250 -4500 600 600 0 120 N I 21 N "VAL**"
DS 0 0 7500 0 150 21
DS 0 -15750 0 0 150 21
DS 7500 0 7500 -15750 150 21
DS 7500 -15750 0 -15750 150 21
$PAD
Sh "1" O 600 1000 0 0 0
Dr 400 0 0
At STD N 00E0FFFF
Ne 0 ""
Po 750 -750
$EndPAD
$PAD
Sh "2" O 600 1000 0 0 0
Dr 400 0 0
At STD N 00E0FFFF
Ne 0 ""
Po 1750 -750
$EndPAD
$PAD
Sh "3" O 600 1000 0 0 0
Dr 400 0 0
At STD N 00E0FFFF
Ne 0 ""
Po 2750 -750
$EndPAD
$PAD
Sh "4" O 600 1000 0 0 0
Dr 400 0 0
At STD N 00E0FFFF
Ne 0 ""
Po 3750 -750
$EndPAD
$PAD
Sh "5" O 600 1000 0 0 0
Dr 400 0 0
At STD N 00E0FFFF
Ne 0 ""
Po 4750 -750
$EndPAD
$PAD
Sh "6" O 600 1000 0 0 0
Dr 400 0 0
At STD N 00E0FFFF
Ne 0 ""
Po 5750 -750
$EndPAD
$PAD
Sh "7" O 600 1000 0 0 0
Dr 400 0 0
At STD N 00E0FFFF
Ne 0 ""
Po 6750 -750
$EndPAD
$EndMODULE LibreTooth
$MODULE MFP106D
Po 0 0 0 15 4DE3CADA 00000000 ~~
Li MFP106D
Sc 0
AR
Op 0 0 0
T0 0 -866 600 600 0 120 N I 21 N "MFP106D"
T1 0 984 600 600 0 120 N I 21 N "VAL**"
DS -2559 -1378 -2559 1378 150 21
DS -2559 1378 2520 1378 150 21
DS 2520 1378 2520 -1378 150 21
DS 2520 -1378 -2559 -1378 150 21
$PAD
Sh "1" C 787 787 0 0 0
Dr 354 0 0
At STD N 00E0FFFF
Ne 0 ""
Po -1811 0
$EndPAD
$PAD
Sh "2" C 787 787 0 0 0
Dr 354 0 0
At STD N 00E0FFFF
Ne 0 ""
Po 0 0
$EndPAD
$PAD
Sh "3" C 787 787 0 0 0
Dr 354 0 0
At STD N 00E0FFFF
Ne 0 ""
Po 1811 0
$EndPAD
$EndMODULE MFP106D
$MODULE MOUNTING_HOLE
Po 0 0 0 15 4D21ED7A 00000000 ~~
Li MOUNTING_HOLE
Sc 0
AR
Op 0 0 0
T0 0 2000 600 600 0 120 N I 21 N "MOUNTING_HOLE"
T1 0 -1750 600 600 0 120 N I 21 N "VAL**"
DC 0 0 -1250 0 150 21
$PAD
Sh "1" C 1700 1700 0 0 0
Dr 1300 0 0
At STD N 00E0FFFF
Ne 0 ""
Po 0 0
.LocalClearance 450
$EndPAD
$EndMODULE MOUNTING_HOLE
$MODULE MOUNTING_HOLE_M3
Po 0 0 0 15 4E484C2E 00000000 ~~
Li MOUNTING_HOLE_M3
Sc 0
AR MOUNTING_HOLE_M3
Op 0 0 0
T0 0 2000 600 600 0 120 N I 21 N "MOUNTING_HOLE"
T1 0 -1750 600 600 0 120 N I 21 N "VAL**"
DC 0 0 1600 0 150 21
$PAD
Sh "1" C 1700 1700 0 0 0
Dr 1220 0 0
At STD N 00E0FFFF
Ne 0 ""
Po 0 0
.LocalClearance 276
$EndPAD
$EndMODULE MOUNTING_HOLE_M3
$MODULE MOUNTING_HOLE_M3_NPTH
Po 0 0 0 15 4F7C1B5E 00000000 ~~
Li MOUNTING_HOLE_M3_NPTH
Sc 0
AR
Op 0 0 0
T0 0 1280 600 600 0 120 N V 21 N "MOUNTING_HOLE_M3_NPTH"
T1 0 -1378 600 600 0 120 N V 21 N "VAL**"
$PAD
Sh "" C 1496 1496 0 0 0
Dr 1220 0 0
At HOLE N 00E0FFFF
Ne 0 ""
Po 0 0
$EndPAD
$EndMODULE MOUNTING_HOLE_M3_NPTH
$MODULE MOUNTING_HOLE_NO_SILKSCREEN
Po 0 0 0 15 4D49585D 00000000 ~~
Li MOUNTING_HOLE_NO_SILKSCREEN
Sc 0
AR
Op 0 0 0
T0 0 2000 600 600 0 120 N I 21 N "MOUNTING_HOLE"
T1 0 -1750 600 600 0 120 N I 21 N "VAL**"
$PAD
Sh "1" C 1700 1700 0 0 0
Dr 1300 0 0
At STD N 00E0FFFF
Ne 0 ""
Po 0 0
.LocalClearance 276
$EndPAD
$EndMODULE MOUNTING_HOLE_NO_SILKSCREEN
$MODULE MPU60X0
Po 0 0 0 15 4FF95E7D 00000000 ~~
Li MPU60X0
Sc 0
AR /4FE33DA1/4D37370E
Op 0 0 0
At SMD
T0 0 -187 196 196 0 39 N V 21 N "U301"
T1 0 1280 197 197 0 39 N I 21 N "MPU60X0"
DS -630 -787 -787 -787 39 21
DS -787 -787 -787 -630 39 21
DS -630 787 -787 787 39 21
DS -787 787 -787 630 39 21
DS 787 630 787 787 39 21
DS 787 787 630 787 39 21
DS 630 -787 787 -787 39 21
DS 787 -787 787 -630 39 21
DC -850 -850 -850 -800 150 21
DS 394 315 512 157 39 25
DS 394 157 512 315 39 25
DS -295 236 -157 236 39 25
DS -157 236 -295 374 39 25
DS -295 374 -157 374 39 25
DS -236 -413 -157 -315 39 25
DS -157 -315 -79 -413 39 25
DS -79 -413 -236 -217 39 25
DC -433 453 -335 413 39 25
DS -433 -413 -512 -315 39 25
DS -433 -413 -354 -315 39 25
DS 335 571 433 453 39 25
DS 433 453 335 354 39 25
DS -433 -413 -433 453 39 25
DS -433 453 433 453 39 25
T2 0 0 79 79 0 20 N I 21 N "no vias here!"
$PAD
Sh "5" R 335 138 0 0 0
Dr 0 0 0
At SMD N 00888000
Ne 0 ""
Po -845 295
.LocalClearance 49
$EndPAD
$PAD
Sh "3" R 335 138 0 0 0
Dr 0 0 0
At SMD N 00888000
Ne 0 ""
Po -845 -98
.LocalClearance 49
$EndPAD
$PAD
Sh "4" R 335 138 0 0 0
Dr 0 0 0
At SMD N 00888000
Ne 0 ""
Po -845 98
.LocalClearance 49
$EndPAD
$PAD
Sh "6" R 335 138 0 0 0
Dr 0 0 0
At SMD N 00888000
Ne 2 "/HMC5883L/SDA"
Po -845 492
.LocalClearance 49
$EndPAD
$PAD
Sh "2" R 335 138 0 0 0
Dr 0 0 0
At SMD N 00888000
Ne 0 ""
Po -845 -295
.LocalClearance 49
$EndPAD
$PAD
Sh "1" R 335 138 0 0 0
Dr 0 0 0
At SMD N 00888000
Ne 6 "GND"
Po -845 -492
.LocalClearance 49
$EndPAD
$PAD
Sh "24" R 335 138 0 0 900
Dr 0 0 0
At SMD N 00888000
Ne 5 "/MPU6050/SDA"
Po -492 -797
.LocalClearance 49
$EndPAD
$PAD
Sh "23" R 335 138 0 0 900
Dr 0 0 0
At SMD N 00888000
Ne 4 "/MPU6050/SCL"
Po -295 -797
.LocalClearance 49
$EndPAD
$PAD
Sh "22" R 335 138 0 0 900
Dr 0 0 0
At SMD N 00888000
Ne 0 ""
Po -98 -797
.LocalClearance 49
$EndPAD
$PAD
Sh "20" R 335 138 0 0 900
Dr 0 0 0
At SMD N 00888000
Ne 8 "N-000085"
Po 295 -797
.LocalClearance 49
$EndPAD
$PAD
Sh "21" R 335 138 0 0 900
Dr 0 0 0
At SMD N 00888000
Ne 0 ""
Po 98 -797
.LocalClearance 49
$EndPAD
$PAD
Sh "19" R 335 138 0 0 900
Dr 0 0 0
At SMD N 00888000
Ne 0 ""
Po 492 -797
.LocalClearance 49
$EndPAD
$PAD
Sh "18" R 335 138 0 0 0
Dr 0 0 0
At SMD N 00888000
Ne 6 "GND"
Po 845 -492
.LocalClearance 49
$EndPAD
$PAD
Sh "17" R 335 138 0 0 0
Dr 0 0 0
At SMD N 00888000
Ne 0 ""
Po 845 -295
.LocalClearance 49
$EndPAD
$PAD
Sh "13" R 335 138 0 0 0
Dr 0 0 0
At SMD N 00888000
Ne 9 "VCC"
Po 845 492
.LocalClearance 49
$EndPAD
$PAD
Sh "15" R 335 138 0 0 0
Dr 0 0 0
At SMD N 00888000
Ne 0 ""
Po 845 98
.LocalClearance 49
$EndPAD
$PAD
Sh "16" R 335 138 0 0 0
Dr 0 0 0
At SMD N 00888000
Ne 0 ""
Po 845 -98
.LocalClearance 49
$EndPAD
$PAD
Sh "14" R 335 138 0 0 0
Dr 0 0 0
At SMD N 00888000
Ne 0 ""
Po 845 295
.LocalClearance 49
$EndPAD
$PAD
Sh "12" R 335 138 0 0 900
Dr 0 0 0
At SMD N 00888000
Ne 3 "/MPU6050/INTA"
Po 492 796
.LocalClearance 49
$EndPAD
$PAD
Sh "10" R 335 138 0 0 900
Dr 0 0 0
At SMD N 00888000
Ne 7 "N-000084"
Po 98 796
.LocalClearance 49
$EndPAD
$PAD
Sh "11" R 335 138 0 0 900
Dr 0 0 0
At SMD N 00888000
Ne 0 ""
Po 295 796
.LocalClearance 49
$EndPAD
$PAD
Sh "9" R 335 138 0 0 900
Dr 0 0 0
At SMD N 00888000
Ne 6 "GND"
Po -98 796
.LocalClearance 49
$EndPAD
$PAD
Sh "8" R 335 138 0 0 900
Dr 0 0 0
At SMD N 00888000
Ne 9 "VCC"
Po -295 796
.LocalClearance 49
$EndPAD
$PAD
Sh "7" R 335 138 0 0 900
Dr 0 0 0
At SMD N 00888000
Ne 1 "/HMC5883L/SCL"
Po -492 796
.LocalClearance 49
$EndPAD
$EndMODULE MPU60X0
$MODULE MS5611-01BA01
Po 0 0 0 15 4E859D86 00000000 ~~
Li MS5611-01BA01
Sc 0
AR
Op 0 0 0
At SMD
T0 984 0 197 197 900 39 N I 21 N "MS5611-01BA01"
T1 -984 0 197 197 900 39 N I 21 N "VAL**"
DS -630 -1024 630 -1024 100 21
DS 630 -1024 630 -906 100 21
DS -630 -1024 -630 -906 100 21
DS -630 1024 630 1024 100 21
DS 630 1024 630 906 100 21
DS -630 1024 -630 906 100 21
DC -709 -1142 -611 -1044 100 21
$PAD
Sh "1" R 197 394 0 0 900
Dr 0 0 0
At SMD N 00888000
Ne 0 ""
Po -492 -738
$EndPAD
$PAD
Sh "2" R 197 394 0 0 900
Dr 0 0 0
At SMD N 00888000
Ne 0 ""
Po -492 -246
$EndPAD
$PAD
Sh "3" R 197 394 0 0 900
Dr 0 0 0
At SMD N 00888000
Ne 0 ""
Po -492 246
$EndPAD
$PAD
Sh "4" R 197 394 0 0 900
Dr 0 0 0
At SMD N 00888000
Ne 0 ""
Po -492 738
$EndPAD
$PAD
Sh "5" R 197 394 0 0 900
Dr 0 0 0
At SMD N 00888000
Ne 0 ""
Po 492 738
$EndPAD
$PAD
Sh "6" R 197 394 0 0 900
Dr 0 0 0
At SMD N 00888000
Ne 0 ""
Po 492 246
$EndPAD
$PAD
Sh "7" R 197 394 0 0 900
Dr 0 0 0
At SMD N 00888000
Ne 0 ""
Po 496 -246
$EndPAD
$PAD
Sh "8" R 197 394 0 0 900
Dr 0 0 0
At SMD N 00888000
Ne 0 ""
Po 492 -738
$EndPAD
$EndMODULE MS5611-01BA01
$MODULE MULTIMEC-SMD-BUTTON
Po 0 0 0 15 4F8D6769 00000000 ~~
Li MULTIMEC-SMD-BUTTON
Sc 0
AR MULTIMEC-SMD-BUTTON
Op 0 0 0
T0 0 0 197 197 0 39 N I 21 N "MULTIMEC-SMD-BUTTON"
T1 -2441 0 600 600 900 120 N V 21 N "VAL**"
DC 0 0 1280 0 150 21
DS 1988 1988 -1988 1988 150 21
DS -1988 1988 -1988 -1988 150 21
DS -1988 -1988 1988 -1988 150 21
DS 1988 -1988 1988 1988 150 21
$PAD
Sh "2" R 984 472 0 0 0
Dr 0 0 0
At SMD N 00888000
Ne 0 ""
Po -2461 1500
$EndPAD
$PAD
Sh "2" R 984 472 0 0 0
Dr 0 0 0
At SMD N 00888000
Ne 0 ""
Po 2461 1500
$EndPAD
$PAD
Sh "1" R 984 472 0 0 0
Dr 0 0 0
At SMD N 00888000
Ne 0 ""
Po -2461 -1500
$EndPAD
$PAD
Sh "1" R 984 472 0 0 0
Dr 0 0 0
At SMD N 00888000
Ne 0 ""
Po 2461 -1500
$EndPAD
$EndMODULE MULTIMEC-SMD-BUTTON
$MODULE QFN44-05p
Po 0 0 0 15 4FF96814 00000000 ~~
Li QFN44-05p
Sc 0
AR
Op 0 0 0
T0 0 1742 196 196 0 39 N I 21 N "QFN44-05p"
T1 0 -1969 600 600 0 120 N V 21 N "VAL**"
DS -1377 -1377 -1092 -1377 118 21
DS 1092 -1377 1377 -1377 118 21
DS 1377 -1377 1377 -1092 118 21
DS 1377 1092 1377 1377 118 21
DS -1377 1377 -1092 1377 118 21
DS 1092 1377 1377 1377 118 21
DS -1377 -1377 -1377 -1092 118 21
DS -1377 1092 -1377 1377 118 21
DS -1377 1377 -1082 1082 118 21
$PAD
Sh "1" R 97 295 0 0 1800
Dr 0 0 0
At SMD N 00888000
Ne 0 ""
Po -984 1329
$EndPAD
$PAD
Sh "2" R 97 295 0 0 1800
Dr 0 0 0
At SMD N 00888000
Ne 0 ""
Po -787 1329
$EndPAD
$PAD
Sh "3" R 97 295 0 0 1800
Dr 0 0 0
At SMD N 00888000
Ne 0 ""
Po -590 1329
$EndPAD
$PAD
Sh "4" R 97 295 0 0 1800
Dr 0 0 0
At SMD N 00888000
Ne 0 ""
Po -392 1329
$EndPAD
$PAD
Sh "5" R 97 295 0 0 1800
Dr 0 0 0
At SMD N 00888000
Ne 0 ""
Po -195 1329
$EndPAD
$PAD
Sh "6" R 97 295 0 0 1800
Dr 0 0 0
At SMD N 00888000
Ne 0 ""
Po 0 1329
$EndPAD
$PAD
Sh "7" R 97 295 0 0 1800
Dr 0 0 0
At SMD N 00888000
Ne 0 ""
Po 195 1329
$EndPAD
$PAD
Sh "8" R 97 295 0 0 1800
Dr 0 0 0
At SMD N 00888000
Ne 0 ""
Po 392 1329
$EndPAD
$PAD
Sh "9" R 97 295 0 0 1800
Dr 0 0 0
At SMD N 00888000
Ne 0 ""
Po 590 1329
$EndPAD
$PAD
Sh "10" R 97 295 0 0 1800
Dr 0 0 0
At SMD N 00888000
Ne 0 ""
Po 787 1329
$EndPAD
$PAD
Sh "11" R 97 295 0 0 1800
Dr 0 0 0
At SMD N 00888000
Ne 0 ""
Po 984 1329
$EndPAD
$PAD
Sh "12" R 97 295 0 0 2700
Dr 0 0 0
At SMD N 00888000
Ne 0 ""
Po 1329 984
$EndPAD
$PAD
Sh "13" R 97 295 0 0 2700
Dr 0 0 0
At SMD N 00888000
Ne 0 ""
Po 1329 787
$EndPAD
$PAD
Sh "14" R 97 295 0 0 2700
Dr 0 0 0
At SMD N 00888000
Ne 0 ""
Po 1329 590
$EndPAD
$PAD
Sh "15" R 97 295 0 0 2700
Dr 0 0 0
At SMD N 00888000
Ne 0 ""
Po 1329 392
$EndPAD
$PAD
Sh "16" R 97 295 0 0 2700
Dr 0 0 0
At SMD N 00888000
Ne 0 ""
Po 1329 195
$EndPAD
$PAD
Sh "17" R 97 295 0 0 2700
Dr 0 0 0
At SMD N 00888000
Ne 0 ""
Po 1329 0
$EndPAD
$PAD
Sh "18" R 97 295 0 0 2700
Dr 0 0 0
At SMD N 00888000
Ne 0 ""
Po 1329 -195
$EndPAD
$PAD
Sh "19" R 97 295 0 0 2700
Dr 0 0 0
At SMD N 00888000
Ne 0 ""
Po 1329 -392
$EndPAD
$PAD
Sh "20" R 97 295 0 0 2700
Dr 0 0 0
At SMD N 00888000
Ne 0 ""
Po 1329 -590
$EndPAD
$PAD
Sh "21" R 97 295 0 0 2700
Dr 0 0 0
At SMD N 00888000
Ne 0 ""
Po 1329 -787
$EndPAD
$PAD
Sh "22" R 97 295 0 0 2700
Dr 0 0 0
At SMD N 00888000
Ne 0 ""
Po 1329 -984
$EndPAD
$PAD
Sh "23" R 97 295 0 0 0
Dr 0 0 0
At SMD N 00888000
Ne 0 ""
Po 984 -1329
$EndPAD
$PAD
Sh "24" R 97 295 0 0 0
Dr 0 0 0
At SMD N 00888000
Ne 0 ""
Po 787 -1329
$EndPAD
$PAD
Sh "25" R 97 295 0 0 0
Dr 0 0 0
At SMD N 00888000
Ne 0 ""
Po 590 -1329
$EndPAD
$PAD
Sh "26" R 97 295 0 0 0
Dr 0 0 0
At SMD N 00888000
Ne 0 ""
Po 392 -1329
$EndPAD
$PAD
Sh "27" R 97 295 0 0 0
Dr 0 0 0
At SMD N 00888000
Ne 0 ""
Po 195 -1329
$EndPAD
$PAD
Sh "28" R 97 295 0 0 0
Dr 0 0 0
At SMD N 00888000
Ne 0 ""
Po 0 -1329
$EndPAD
$PAD
Sh "29" R 97 295 0 0 0
Dr 0 0 0
At SMD N 00888000
Ne 0 ""
Po -195 -1329
$EndPAD
$PAD
Sh "30" R 97 295 0 0 0
Dr 0 0 0
At SMD N 00888000
Ne 0 ""
Po -392 -1329
$EndPAD
$PAD
Sh "31" R 97 295 0 0 0
Dr 0 0 0
At SMD N 00888000
Ne 0 ""
Po -590 -1329
$EndPAD
$PAD
Sh "32" R 97 295 0 0 0
Dr 0 0 0
At SMD N 00888000
Ne 0 ""
Po -787 -1329
$EndPAD
$PAD
Sh "33" R 97 295 0 0 0
Dr 0 0 0
At SMD N 00888000
Ne 0 ""
Po -984 -1329
$EndPAD
$PAD
Sh "34" R 97 295 0 0 900
Dr 0 0 0
At SMD N 00888000
Ne 0 ""
Po -1329 -984
$EndPAD
$PAD
Sh "35" R 97 295 0 0 900
Dr 0 0 0
At SMD N 00888000
Ne 0 ""
Po -1329 -787
$EndPAD
$PAD
Sh "36" R 97 295 0 0 900
Dr 0 0 0
At SMD N 00888000
Ne 0 ""
Po -1329 -590
$EndPAD
$PAD
Sh "37" R 97 295 0 0 900
Dr 0 0 0
At SMD N 00888000
Ne 0 ""
Po -1329 -392
$EndPAD
$PAD
Sh "38" R 97 295 0 0 900
Dr 0 0 0
At SMD N 00888000
Ne 0 ""
Po -1329 -195
$EndPAD
$PAD
Sh "39" R 97 295 0 0 900
Dr 0 0 0
At SMD N 00888000
Ne 0 ""
Po -1329 0
$EndPAD
$PAD
Sh "40" R 97 295 0 0 900
Dr 0 0 0
At SMD N 00888000
Ne 0 ""
Po -1329 195
$EndPAD
$PAD
Sh "41" R 97 295 0 0 900
Dr 0 0 0
At SMD N 00888000
Ne 0 ""
Po -1329 392
$EndPAD
$PAD
Sh "42" R 97 295 0 0 900
Dr 0 0 0
At SMD N 00888000
Ne 0 ""
Po -1329 590
$EndPAD
$PAD
Sh "43" R 97 295 0 0 900
Dr 0 0 0
At SMD N 00888000
Ne 0 ""
Po -1329 787
$EndPAD
$PAD
Sh "44" R 97 295 0 0 900
Dr 0 0 0
At SMD N 00888000
Ne 0 ""
Po -1329 984
$EndPAD
$PAD
Sh "45" R 1968 1968 0 0 0
Dr 0 0 0
At SMD N 00888000
Ne 0 ""
Po 0 0
$EndPAD
$EndMODULE QFN44-05p
$MODULE QFN64-CC430
Po 0 0 0 15 4F7F5737 00000000 ~~
Li QFN64-CC430
Sc 0
AR QFN64-CC430
Op 0 0 0
T0 0 1181 197 197 0 39 N I 21 N "QFN64-CC430"
T1 0 2657 600 600 0 120 N V 21 N "VAL**"
DC -1968 -1968 -1771 -1772 150 21
DS -1772 -1772 1772 -1772 150 21
DS 1772 -1772 1772 1772 150 21
DS 1772 1772 -1772 1772 150 21
DS -1772 1772 -1772 -1772 150 21
$PAD
Sh "34" R 110 335 0 0 900
Dr 0 0 0
At SMD N 00888000
Ne 0 ""
Po 1761 1280
$EndPAD
$PAD
Sh "33" R 110 335 0 0 900
Dr 0 0 0
At SMD N 00888000
Ne 0 ""
Po 1760 1476
$EndPAD
$PAD
Sh "35" R 110 335 0 0 900
Dr 0 0 0
At SMD N 00888000
Ne 0 ""
Po 1760 1083
$EndPAD
$PAD
Sh "36" R 110 335 0 0 900
Dr 0 0 0
At SMD N 00888000
Ne 0 ""
Po 1761 886
$EndPAD
$PAD
Sh "37" R 110 335 0 0 900
Dr 0 0 0
At SMD N 00888000
Ne 0 ""
Po 1761 689
$EndPAD
$PAD
Sh "38" R 110 335 0 0 900
Dr 0 0 0
At SMD N 00888000
Ne 0 ""
Po 1761 492
$EndPAD
$PAD
Sh "42" R 110 335 0 0 900
Dr 0 0 0
At SMD N 00888000
Ne 0 ""
Po 1761 -295
$EndPAD
$PAD
Sh "41" R 110 335 0 0 900
Dr 0 0 0
At SMD N 00888000
Ne 0 ""
Po 1761 -98
$EndPAD
$PAD
Sh "40" R 110 335 0 0 900
Dr 0 0 0
At SMD N 00888000
Ne 0 ""
Po 1761 98
$EndPAD
$PAD
Sh "39" R 110 335 0 0 900
Dr 0 0 0
At SMD N 00888000
Ne 0 ""
Po 1761 295
$EndPAD
$PAD
Sh "43" R 110 335 0 0 900
Dr 0 0 0
At SMD N 00888000
Ne 0 ""
Po 1761 -482
$EndPAD
$PAD
Sh "44" R 110 335 0 0 900
Dr 0 0 0
At SMD N 00888000
Ne 0 ""
Po 1761 -679
$EndPAD
$PAD
Sh "45" R 110 335 0 0 900
Dr 0 0 0
At SMD N 00888000
Ne 0 ""
Po 1761 -886
$EndPAD
$PAD
Sh "46" R 110 335 0 0 900
Dr 0 0 0
At SMD N 00888000
Ne 0 ""
Po 1761 -1083
$EndPAD
$PAD
Sh "47" R 110 335 0 0 900
Dr 0 0 0
At SMD N 00888000
Ne 0 ""
Po 1761 -1280
$EndPAD
$PAD
Sh "48" R 110 335 0 0 900
Dr 0 0 0
At SMD N 00888000
Ne 0 ""
Po 1761 -1476
$EndPAD
$PAD
Sh "1" R 110 335 0 0 900
Dr 0 0 0
At SMD N 00888000
Ne 0 ""
Po -1762 -1476
$EndPAD
$PAD
Sh "2" R 110 335 0 0 900
Dr 0 0 0
At SMD N 00888000
Ne 0 ""
Po -1762 -1280
$EndPAD
$PAD
Sh "3" R 110 335 0 0 900
Dr 0 0 0
At SMD N 00888000
Ne 0 ""
Po -1762 -1083
$EndPAD
$PAD
Sh "4" R 110 335 0 0 900
Dr 0 0 0
At SMD N 00888000
Ne 0 ""
Po -1762 -886
$EndPAD
$PAD
Sh "5" R 110 335 0 0 900
Dr 0 0 0
At SMD N 00888000
Ne 0 ""
Po -1762 -679
$EndPAD
$PAD
Sh "6" R 110 335 0 0 900
Dr 0 0 0
At SMD N 00888000
Ne 0 ""
Po -1762 -482
$EndPAD
$PAD
Sh "10" R 110 335 0 0 900
Dr 0 0 0
At SMD N 00888000
Ne 0 ""
Po -1762 295
$EndPAD
$PAD
Sh "9" R 110 335 0 0 900
Dr 0 0 0
At SMD N 00888000
Ne 0 ""
Po -1762 98
$EndPAD
$PAD
Sh "8" R 110 335 0 0 900
Dr 0 0 0
At SMD N 00888000
Ne 0 ""
Po -1762 -98
$EndPAD
$PAD
Sh "7" R 110 335 0 0 900
Dr 0 0 0
At SMD N 00888000
Ne 0 ""
Po -1762 -295
$EndPAD
$PAD
Sh "11" R 110 335 0 0 900
Dr 0 0 0
At SMD N 00888000
Ne 0 ""
Po -1762 492
$EndPAD
$PAD
Sh "12" R 110 335 0 0 900
Dr 0 0 0
At SMD N 00888000
Ne 0 ""
Po -1762 689
$EndPAD
$PAD
Sh "13" R 110 335 0 0 900
Dr 0 0 0
At SMD N 00888000
Ne 0 ""
Po -1762 886
$EndPAD
$PAD
Sh "14" R 110 335 0 0 900
Dr 0 0 0
At SMD N 00888000
Ne 0 ""
Po -1762 1083
$EndPAD
$PAD
Sh "16" R 110 335 0 0 900
Dr 0 0 0
At SMD N 00888000
Ne 0 ""
Po -1762 1476
$EndPAD
$PAD
Sh "15" R 110 335 0 0 900
Dr 0 0 0
At SMD N 00888000
Ne 0 ""
Po -1762 1280
$EndPAD
$PAD
Sh "32" R 110 335 0 0 0
Dr 0 0 0
At SMD N 00888000
Ne 0 ""
Po 1475 1761
$EndPAD
$PAD
Sh "31" R 110 335 0 0 0
Dr 0 0 0
At SMD N 00888000
Ne 0 ""
Po 1279 1761
$EndPAD
$PAD
Sh "30" R 110 335 0 0 0
Dr 0 0 0
At SMD N 00888000
Ne 0 ""
Po 1082 1761
$EndPAD
$PAD
Sh "29" R 110 335 0 0 0
Dr 0 0 0
At SMD N 00888000
Ne 0 ""
Po 885 1761
$EndPAD
$PAD
Sh "28" R 110 335 0 0 0
Dr 0 0 0
At SMD N 00888000
Ne 0 ""
Po 678 1761
$EndPAD
$PAD
Sh "27" R 110 335 0 0 0
Dr 0 0 0
At SMD N 00888000
Ne 0 ""
Po 491 1761
$EndPAD
$PAD
Sh "23" R 110 335 0 0 0
Dr 0 0 0
At SMD N 00888000
Ne 0 ""
Po -295 1761
$EndPAD
$PAD
Sh "24" R 110 335 0 0 0
Dr 0 0 0
At SMD N 00888000
Ne 0 ""
Po -98 1761
$EndPAD
$PAD
Sh "25" R 110 335 0 0 0
Dr 0 0 0
At SMD N 00888000
Ne 0 ""
Po 98 1761
$EndPAD
$PAD
Sh "26" R 110 335 0 0 0
Dr 0 0 0
At SMD N 00888000
Ne 0 ""
Po 294 1761
$EndPAD
$PAD
Sh "22" R 110 335 0 0 0
Dr 0 0 0
At SMD N 00888000
Ne 0 ""
Po -492 1761
$EndPAD
$PAD
Sh "21" R 110 335 0 0 0
Dr 0 0 0
At SMD N 00888000
Ne 0 ""
Po -689 1761
$EndPAD
$PAD
Sh "20" R 110 335 0 0 0
Dr 0 0 0
At SMD N 00888000
Ne 0 ""
Po -886 1761
$EndPAD
$PAD
Sh "19" R 110 335 0 0 0
Dr 0 0 0
At SMD N 00888000
Ne 0 ""
Po -1083 1761
$EndPAD
$PAD
Sh "17" R 110 335 0 0 0
Dr 0 0 0
At SMD N 00888000
Ne 0 ""
Po -1477 1762
$EndPAD
$PAD
Sh "18" R 110 335 0 0 0
Dr 0 0 0
At SMD N 00888000
Ne 0 ""
Po -1280 1761
$EndPAD
$PAD
Sh "63" R 110 335 0 0 0
Dr 0 0 0
At SMD N 00888000
Ne 0 ""
Po -1280 -1762
$EndPAD
$PAD
Sh "64" R 110 335 0 0 0
Dr 0 0 0
At SMD N 00888000
Ne 0 ""
Po -1477 -1762
$EndPAD
$PAD
Sh "62" R 110 335 0 0 0
Dr 0 0 0
At SMD N 00888000
Ne 0 ""
Po -1083 -1762
$EndPAD
$PAD
Sh "61" R 110 335 0 0 0
Dr 0 0 0
At SMD N 00888000
Ne 0 ""
Po -886 -1762
$EndPAD
$PAD
Sh "60" R 110 335 0 0 0
Dr 0 0 0
At SMD N 00888000
Ne 0 ""
Po -689 -1762
$EndPAD
$PAD
Sh "59" R 110 335 0 0 0
Dr 0 0 0
At SMD N 00888000
Ne 0 ""
Po -492 -1762
$EndPAD
$PAD
Sh "55" R 110 335 0 0 0
Dr 0 0 0
At SMD N 00888000
Ne 0 ""
Po 295 -1762
$EndPAD
$PAD
Sh "0" R 1673 1673 0 0 0
Dr 0 0 0
At SMD N 00888000
Ne 0 ""
Po 0 0
$EndPAD
$PAD
Sh "56" R 110 335 0 0 0
Dr 0 0 0
At SMD N 00888000
Ne 0 ""
Po 98 -1762
$EndPAD
$PAD
Sh "57" R 110 335 0 0 0
Dr 0 0 0
At SMD N 00888000
Ne 0 ""
Po -98 -1762
$EndPAD
$PAD
Sh "58" R 110 335 0 0 0
Dr 0 0 0
At SMD N 00888000
Ne 0 ""
Po -295 -1762
$EndPAD
$PAD
Sh "54" R 110 335 0 0 0
Dr 0 0 0
At SMD N 00888000
Ne 0 ""
Po 492 -1762
$EndPAD
$PAD
Sh "53" R 110 335 0 0 0
Dr 0 0 0
At SMD N 00888000
Ne 0 ""
Po 679 -1762
$EndPAD
$PAD
Sh "52" R 110 335 0 0 0
Dr 0 0 0
At SMD N 00888000
Ne 0 ""
Po 886 -1762
$EndPAD
$PAD
Sh "51" R 110 335 0 0 0
Dr 0 0 0
At SMD N 00888000
Ne 0 ""
Po 1083 -1762
$EndPAD
$PAD
Sh "50" R 110 335 0 0 0
Dr 0 0 0
At SMD N 00888000
Ne 0 ""
Po 1280 -1762
$EndPAD
$PAD
Sh "49" R 110 335 0 0 0
Dr 0 0 0
At SMD N 00888000
Ne 0 ""
Po 1476 -1762
$EndPAD
$SHAPE3D
Na "../../fv_kicad_lib/3d/simple_1x1x1.wrl"
Sc 1.7 1.7 0.25
Of 0 -0.17 0.025
Ro 0 0 0
$EndSHAPE3D
$EndMODULE QFN64-CC430
$MODULE R50RGB-4-0045
Po 0 0 0 15 4DE4D6B3 00000000 ~~
Li R50RGB-4-0045
Sc 0
AR
Op 0 0 0
T0 0 2000 400 400 0 100 N I 21 N "R50RGB-4-0045"
T1 0 0 400 400 0 100 N I 21 N "VAL**"
DC 1500 1500 1750 1500 150 21
DS -1500 -1500 1500 -1500 150 21
DS 1500 -1500 1500 1500 150 21
DS 1500 1500 -1500 1500 150 21
DS -1500 1500 -1500 -1500 150 21
$PAD
Sh "3" C 800 800 0 0 0
Dr 400 0 0
At STD N 00E0FFFF
Ne 0 ""
Po 1000 1000
$EndPAD
$PAD
Sh "4" C 800 800 0 0 0
Dr 400 0 0
At STD N 00E0FFFF
Ne 0 ""
Po 1000 -1000
$EndPAD
$PAD
Sh "1" C 800 800 0 0 0
Dr 400 0 0
At STD N 00E0FFFF
Ne 0 ""
Po -1000 -1000
$EndPAD
$PAD
Sh "2" C 800 800 0 0 0
Dr 400 0 0
At STD N 00E0FFFF
Ne 0 ""
Po -1000 1000
$EndPAD
$EndMODULE R50RGB-4-0045
$MODULE RN-42
Po 0 0 0 15 4E33ECED 00000000 ~~
Li RN-42
Sc 0
AR
Op 0 0 0
T0 0 -750 600 600 0 120 N V 21 N "RN-42"
T1 0 500 600 600 0 120 N V 21 N "VAL**"
T2 0 -3780 157 118 0 30 N I 21 I "Antenna Area: no traces, GND planes, parts here"
DS -2638 -2362 2638 -2362 150 21
DS -2638 5039 2638 5039 150 21
DS 2638 5039 2638 -5039 150 21
DS 2638 -5039 -2638 -5039 150 21
DS -2638 -5039 -2638 5039 150 21
$PAD
Sh "12" R 315 512 0 0 900
Dr 0 0 0
At SMD N 00888000
Ne 0 ""
Po -2638 3937
$EndPAD
$PAD
Sh "11" R 315 512 0 0 900
Dr 0 0 0
At SMD N 00888000
Ne 0 ""
Po -2638 3465
$EndPAD
$PAD
Sh "10" R 315 512 0 0 900
Dr 0 0 0
At SMD N 00888000
Ne 0 ""
Po -2638 2992
$EndPAD
$PAD
Sh "9" R 315 512 0 0 900
Dr 0 0 0
At SMD N 00888000
Ne 0 ""
Po -2638 2520
$EndPAD
$PAD
Sh "8" R 315 512 0 0 900
Dr 0 0 0
At SMD N 00888000
Ne 0 ""
Po -2638 2047
$EndPAD
$PAD
Sh "7" R 315 512 0 0 900
Dr 0 0 0
At SMD N 00888000
Ne 0 ""
Po -2638 1575
$EndPAD
$PAD
Sh "6" R 315 512 0 0 900
Dr 0 0 0
At SMD N 00888000
Ne 0 ""
Po -2638 1102
$EndPAD
$PAD
Sh "5" R 315 512 0 0 900
Dr 0 0 0
At SMD N 00888000
Ne 0 ""
Po -2638 630
$EndPAD
$PAD
Sh "4" R 315 512 0 0 900
Dr 0 0 0
At SMD N 00888000
Ne 0 ""
Po -2638 157
$EndPAD
$PAD
Sh "3" R 315 512 0 0 900
Dr 0 0 0
At SMD N 00888000
Ne 0 ""
Po -2638 -394
$EndPAD
$PAD
Sh "2" R 315 512 0 0 900
Dr 0 0 0
At SMD N 00888000
Ne 0 ""
Po -2638 -866
$EndPAD
$PAD
Sh "1" R 315 512 0 0 900
Dr 0 0 0
At SMD N 00888000
Ne 0 ""
Po -2638 -1339
$EndPAD
$PAD
Sh "24" R 315 512 0 0 900
Dr 0 0 0
At SMD N 00888000
Ne 0 ""
Po 2638 -1339
$EndPAD
$PAD
Sh "23" R 315 512 0 0 900
Dr 0 0 0
At SMD N 00888000
Ne 0 ""
Po 2638 -866
$EndPAD
$PAD
Sh "22" R 315 512 0 0 900
Dr 0 0 0
At SMD N 00888000
Ne 0 ""
Po 2638 -394
$EndPAD
$PAD
Sh "21" R 315 512 0 0 900
Dr 0 0 0
At SMD N 00888000
Ne 0 ""
Po 2638 157
$EndPAD
$PAD
Sh "20" R 315 512 0 0 900
Dr 0 0 0
At SMD N 00888000
Ne 0 ""
Po 2638 630
$EndPAD
$PAD
Sh "19" R 315 512 0 0 900
Dr 0 0 0
At SMD N 00888000
Ne 0 ""
Po 2638 1102
$EndPAD
$PAD
Sh "18" R 315 512 0 0 900
Dr 0 0 0
At SMD N 00888000
Ne 0 ""
Po 2638 1575
$EndPAD
$PAD
Sh "17" R 315 512 0 0 900
Dr 0 0 0
At SMD N 00888000
Ne 0 ""
Po 2638 2047
$EndPAD
$PAD
Sh "16" R 315 512 0 0 900
Dr 0 0 0
At SMD N 00888000
Ne 0 ""
Po 2638 2520
$EndPAD
$PAD
Sh "15" R 315 512 0 0 900
Dr 0 0 0
At SMD N 00888000
Ne 0 ""
Po 2638 2992
$EndPAD
$PAD
Sh "14" R 315 512 0 0 900
Dr 0 0 0
At SMD N 00888000
Ne 0 ""
Po 2638 3465
$EndPAD
$PAD
Sh "13" R 315 512 0 0 900
Dr 0 0 0
At SMD N 00888000
Ne 0 ""
Po 2638 3937
$EndPAD
$PAD
Sh "35" R 315 512 0 0 0
Dr 0 0 0
At SMD N 00888000
Ne 0 ""
Po -1614 5039
$EndPAD
$PAD
Sh "29" R 315 512 0 0 0
Dr 0 0 0
At SMD N 00888000
Ne 0 ""
Po -1220 5039
$EndPAD
$PAD
Sh "34" R 315 512 0 0 0
Dr 0 0 0
At SMD N 00888000
Ne 0 ""
Po -709 5039
$EndPAD
$PAD
Sh "33" R 315 512 0 0 0
Dr 0 0 0
At SMD N 00888000
Ne 0 ""
Po -236 5039
$EndPAD
$PAD
Sh "32" R 315 512 0 0 0
Dr 0 0 0
At SMD N 00888000
Ne 0 ""
Po 236 5039
$EndPAD
$PAD
Sh "31" R 315 512 0 0 0
Dr 0 0 0
At SMD N 00888000
Ne 0 ""
Po 709 5039
$EndPAD
$PAD
Sh "28" R 315 512 0 0 0
Dr 0 0 0
At SMD N 00888000
Ne 0 ""
Po 1220 5039
$EndPAD
$PAD
Sh "30" R 315 512 0 0 0
Dr 0 0 0
At SMD N 00888000
Ne 0 ""
Po 1614 5039
$EndPAD
$PAD
Sh "" R 315 512 0 0 900
Dr 0 0 0
At SMD N 00888000
Ne 0 ""
Po -2362 -2795
$EndPAD
$PAD
Sh "" R 315 512 0 0 900
Dr 0 0 0
At SMD N 00888000
Ne 0 ""
Po 2362 -2795
$EndPAD
$PAD
Sh "" R 315 512 0 0 900
Dr 0 0 0
At SMD N 00888000
Ne 0 ""
Po -2402 4764
$EndPAD
$PAD
Sh "" R 315 512 0 0 900
Dr 0 0 0
At SMD N 00888000
Ne 0 ""
Po 2402 4764
$EndPAD
$EndMODULE RN-42
$MODULE SDR08540M3-01
Po 0 0 0 15 4F7F67B3 00000000 ~~
Li SDR08540M3-01
Sc 0
AR
Op 0 0 0
T0 0 689 394 394 0 79 N I 21 N "SDR08540M3-01"
T1 0 0 600 600 0 120 N V 21 N "VAL**"
DC 2165 -2066 2559 -2165 150 21
DS 1673 -1673 1673 1673 150 21
DS 1673 1673 -1673 1673 150 21
DS -1673 1673 -1673 -1673 150 21
DS -1673 -1673 1673 -1673 150 21
$PAD
Sh "2" R 827 827 0 0 0
Dr 0 0 0
At SMD N 00888000
Ne 0 ""
Po -1378 -1378
$EndPAD
$PAD
Sh "1" R 827 827 0 0 0
Dr 0 0 0
At SMD N 00888000
Ne 0 ""
Po 1378 -1378
$EndPAD
$PAD
Sh "2" R 827 827 0 0 0
Dr 0 0 0
At SMD N 00888000
Ne 0 ""
Po -1378 1378
$EndPAD
$PAD
Sh "2" R 827 827 0 0 0
Dr 0 0 0
At SMD N 00888000
Ne 0 ""
Po 1378 1378
$EndPAD
$EndMODULE SDR08540M3-01
$MODULE SKQUCAA010
Po 0 0 0 15 4F78B3E4 00000000 ~~
Li SKQUCAA010
Sc 0
AR SKQUCAA010
Op 0 0 0
T0 0 2559 600 600 0 120 N I 21 N "SKQUCAA010"
T1 0 -1476 600 600 0 120 N V 21 N "VAL**"
DC 0 0 886 -591 150 21
DS 591 -591 591 591 150 21
DS 591 591 -591 591 150 21
DS -591 591 -591 -591 150 21
DS -591 -591 591 -591 150 21
DS -1969 1969 1969 1969 150 21
DS 1969 1969 1969 -1969 150 21
DS 1969 -1969 -1969 -1969 150 21
DS -1969 -1969 -1969 1969 150 21
$PAD
Sh "5" O 787 630 0 0 0
Dr 394 0 0
At STD N 00E0FFFF
Ne 0 ""
Po 2028 0
$EndPAD
$PAD
Sh "2" O 787 630 0 0 0
Dr 394 0 0
At STD N 00E0FFFF
Ne 0 ""
Po -2028 0
$EndPAD
$PAD
Sh "3" O 984 709 0 0 0
Dr 472 0 0
At STD N 00E0FFFF
Ne 0 ""
Po -2028 1280
$EndPAD
$PAD
Sh "4" O 984 709 0 0 0
Dr 472 0 0
At STD N 00E0FFFF
Ne 0 ""
Po 2028 1280
$EndPAD
$PAD
Sh "1" O 984 709 0 0 0
Dr 472 0 0
At STD N 00E0FFFF
Ne 0 ""
Po -2028 -1280
$EndPAD
$PAD
Sh "6" O 984 709 0 0 0
Dr 472 0 0
At STD N 00E0FFFF
Ne 0 ""
Po 2028 -1280
$EndPAD
$EndMODULE SKQUCAA010
$MODULE SMD_DUAL_SLIDE_SWITCH-JS202011SCQN
Po 0 0 0 15 4FF95399 00000000 ~~
Li SMD_DUAL_SLIDE_SWITCH-JS202011SCQN
Sc 0
AR
Op 0 0 0
T0 -1378 0 77 77 900 19 N I 21 N "SMD_DUAL_SLIDE_SWITCH-JS202011SCQN"
T1 0 0 600 600 0 120 N V 21 N "VAL**"
DS 1772 -591 1772 591 150 21
DS 1772 591 -1772 591 150 21
DS -1772 591 -1772 -591 150 21
DS -1772 -591 1772 -591 150 21
$PAD
Sh "5" R 472 984 0 0 0
Dr 0 0 0
At SMD N 00888000
Ne 0 ""
Po 0 1102
$EndPAD
$PAD
Sh "4" R 472 984 0 0 0
Dr 0 0 0
At SMD N 00888000
Ne 0 ""
Po -984 1102
$EndPAD
$PAD
Sh "6" R 472 984 0 0 0
Dr 0 0 0
At SMD N 00888000
Ne 0 ""
Po 984 1102
$EndPAD
$PAD
Sh "3" R 472 984 0 0 0
Dr 0 0 0
At SMD N 00888000
Ne 0 ""
Po 984 -1102
$EndPAD
$PAD
Sh "1" R 472 984 0 0 0
Dr 0 0 0
At SMD N 00888000
Ne 0 ""
Po -984 -1102
$EndPAD
$PAD
Sh "2" R 472 984 0 0 0
Dr 0 0 0
At SMD N 00888000
Ne 0 ""
Po 0 -1102
$EndPAD
$EndMODULE SMD_DUAL_SLIDE_SWITCH-JS202011SCQN
$MODULE SMD_PUSHBUTTON_TOP-PTS525
Po 0 0 0 15 4FF95192 00000000 ~~
Li SMD_PUSHBUTTON_TOP-PTS525
Sc 0
AR
Op 0 0 0
T0 0 -1181 118 118 0 30 N I 21 N "SMD_PUSHBUTTON_TOP-PTS525"
T1 0 0 600 600 0 120 N V 21 N "VAL**"
DC 0 0 433 0 150 21
DS 1033 -1033 1033 1033 150 21
DS 1033 1033 -1033 1033 150 21
DS -1033 1033 -1033 -1033 150 21
DS -1033 -1033 1033 -1033 150 21
$PAD
Sh "2" R 905 432 0 0 0
Dr 0 0 0
At SMD N 00888000
Ne 0 ""
Po 1142 747
$EndPAD
$PAD
Sh "2" R 905 432 0 0 0
Dr 0 0 0
At SMD N 00888000
Ne 0 ""
Po -1142 747
$EndPAD
$PAD
Sh "1" R 905 432 0 0 0
Dr 0 0 0
At SMD N 00888000
Ne 0 ""
Po -1142 -747
$EndPAD
$PAD
Sh "1" R 905 433 0 0 0
Dr 0 0 0
At SMD N 00888000
Ne 0 ""
Po 1142 -748
$EndPAD
$EndMODULE SMD_PUSHBUTTON_TOP-PTS525
$MODULE SMTU2450N
Po 0 0 0 15 4F7F5D12 00000000 ~~
Li SMTU2450N
Sc 0
AR SMTU2450N
Op 0 0 0
T0 0 984 600 600 0 120 N I 21 N "SMTU2450N"
T1 0 0 600 600 0 120 N V 21 N "VAL**"
DS 4724 1378 6496 1378 150 21
DS 6496 1378 6496 -1378 150 21
DS 6496 -1378 4724 -1378 150 21
DS -4724 -1378 -6496 -1378 150 21
DS -6496 -1378 -6496 1378 150 21
DS -6496 1378 -4724 1378 150 21
DC 0 0 4843 0 150 21
$PAD
Sh "1" R 1024 1378 0 0 0
Dr 0 0 0
At SMD N 00888000
Ne 0 ""
Po -6654 0
$EndPAD
$PAD
Sh "2" R 1024 1378 0 0 0
Dr 0 0 0
At SMD N 00888000
Ne 0 ""
Po 6654 0
$EndPAD
$EndMODULE SMTU2450N
$MODULE SOLDER_JUMPER
Po 0 0 0 15 4D46AD51 00000000 ~~
Li SOLDER_JUMPER
Cd Solder jumper
Sc 0
AR
Op 0 0 0
T0 0 -190 60 60 0 12 N V 21 N "SOLDER_JUMPER"
T1 0 190 60 60 0 12 N I 21 N "J***"
$PAD
Sh "1" R 315 275 0 0 0
Dr 0 0 0
At SMD N 00888000
Ne 0 ""
Po 216 0
$EndPAD
$PAD
Sh "2" R 315 275 0 0 0
Dr 0 0 0
At SMD N 00888000
Ne 0 ""
Po -216 0
$EndPAD
$PAD
Sh "" R 315 197 0 0 0
Dr 0 0 0
At SMD N 00080000
Ne 0 ""
Po 0 0
$EndPAD
$SHAPE3D
Na "walter/smd_cap/c_0402.wrl"
Sc 1 1 1
Of 0 0 0
Ro 0 0 0
$EndSHAPE3D
$EndMODULE SOLDER_JUMPER
$MODULE SOLDER_JUMPER_NO_PASTE
Po 0 0 0 15 4E858F1A 00000000 ~~
Li SOLDER_JUMPER_NO_PASTE
Cd Solder jumper
Sc 0
AR
Op 0 0 0
T0 0 -190 60 60 0 12 N V 21 N "SOLDER_JUMPER"
T1 0 190 60 60 0 12 N I 21 N "J***"
$PAD
Sh "1" R 315 275 0 0 0
Dr 0 0 0
At SMD N 00888000
Ne 0 ""
Po 216 0
$EndPAD
$PAD
Sh "2" R 315 275 0 0 0
Dr 0 0 0
At SMD N 00888000
Ne 0 ""
Po -216 0
$EndPAD
$SHAPE3D
Na "walter/smd_cap/c_0402.wrl"
Sc 1 1 1
Of 0 0 0
Ro 0 0 0
$EndSHAPE3D
$EndMODULE SOLDER_JUMPER_NO_PASTE
$MODULE SPD125
Po 0 0 0 15 4E483B6E 00000000 ~~
Li SPD125
Sc 0
AR
Op 0 0 0
T0 0 0 600 600 0 120 N V 21 N "SPD125"
T1 0 0 600 600 0 120 N V 21 N "VAL**"
DS -900 -1050 -900 -2500 150 21
DS -900 -2500 150 -2500 150 21
DS 3500 1100 3500 2150 150 21
DS 3500 2150 -850 2150 150 21
DS -850 2150 -850 1150 150 21
DS 0 -2500 3500 -2500 150 21
DS 3500 -2500 3500 -1250 150 21
$PAD
Sh "1" R 787 1969 0 0 0
Dr 0 0 0
At SMD N 00888000
Ne 0 ""
Po -500 0
$EndPAD
$PAD
Sh "2" R 787 1969 0 0 0
Dr 0 0 0
At SMD N 00888000
Ne 0 ""
Po 3250 0
$EndPAD
$EndMODULE SPD125
$MODULE TEMT6000
Po 0 0 0 15 4FF9427B 00000000 ~~
Li TEMT6000
Cd TEMT6000
Kw light sensors
Sc 0
AR
Op 0 0 0
T0 0 -591 196 196 0 39 N I 21 N "TEMT6000"
T1 0 945 511 511 0 97 N V 21 N "VAL**"
DS 787 -394 -787 -394 150 21
DS -787 -394 -787 394 150 21
DS -787 394 787 394 150 21
DS 787 394 787 -394 150 21
$PAD
Sh "1" R 432 314 0 0 0
Dr 0 0 0
At SMD N 00888000
Ne 0 ""
Po -697 -215
$EndPAD
$PAD
Sh "1" R 432 314 0 0 0
Dr 0 0 0
At SMD N 00888000
Ne 0 ""
Po -697 215
$EndPAD
$PAD
Sh "3" R 432 392 0 0 0
Dr 0 0 0
At SMD N 00888000
Ne 0 ""
Po 697 0
$EndPAD
$EndMODULE TEMT6000
$MODULE TPS6223X
Po 0 0 0 15 4F8807CA 00000000 ~~
Li TPS6223X
Sc 0
AR TPS6223X
Op 0 0 0
T0 0 -394 118 118 0 24 N I 21 N "TPS6223X"
T1 0 689 394 394 0 79 N V 21 N "VAL**"
DC -393 295 -492 295 79 21
DS 295 197 295 -197 79 21
DS 295 -197 -295 -197 79 21
DS -295 -197 -295 197 79 21
DS -295 197 295 197 79 21
$PAD
Sh "3" R 118 205 0 0 0
Dr 0 0 0
At SMD N 00888000
Ne 0 ""
Po 197 146
$EndPAD
$PAD
Sh "2" R 118 205 0 0 0
Dr 0 0 0
At SMD N 00888000
Ne 0 ""
Po 0 146
$EndPAD
$PAD
Sh "1" R 118 205 0 0 0
Dr 0 0 0
At SMD N 00888000
Ne 0 ""
Po -197 146
$EndPAD
$PAD
Sh "6" R 118 205 0 0 0
Dr 0 0 0
At SMD N 00888000
Ne 0 ""
Po -197 -146
$EndPAD
$PAD
Sh "4" R 118 205 0 0 0
Dr 0 0 0
At SMD N 00888000
Ne 0 ""
Po 197 -146
$EndPAD
$PAD
Sh "5" R 118 205 0 0 0
Dr 0 0 0
At SMD N 00888000
Ne 0 ""
Po 0 -146
$EndPAD
$EndMODULE TPS6223X
$MODULE TSX-3225
Po 0 0 0 15 4F8D57E4 00000000 ~~
Li TSX-3225
Sc 0
AR TSX-3225
Op 0 0 0
T0 -20 0 100 100 0 25 N I 21 N "TSX-3225"
T1 0 984 400 400 0 60 N V 21 N "VAL**"
DS -630 276 -394 276 150 21
DS -394 276 -394 492 150 21
DS 630 -492 630 492 150 21
DS 630 492 -630 492 150 21
DS -630 492 -630 -492 150 21
DS -630 -492 630 -492 150 21
$PAD
Sh "1" R 551 453 0 0 0
Dr 0 0 0
At SMD N 00888000
Ne 0 ""
Po -433 315
$EndPAD
$PAD
Sh "4" R 551 453 0 0 0
Dr 0 0 0
At SMD N 00888000
Ne 0 ""
Po -433 -315
$EndPAD
$PAD
Sh "2" R 551 453 0 0 0
Dr 0 0 0
At SMD N 00888000
Ne 0 ""
Po 433 315
$EndPAD
$PAD
Sh "3" R 551 453 0 0 0
Dr 0 0 0
At SMD N 00888000
Ne 0 ""
Po 433 -315
$EndPAD
$EndMODULE TSX-3225
$MODULE USB_MICRO_B_FEMALE-10118193-0001LF
Po 0 0 0 15 4FF9553F 00000000 ~~
Li USB_MICRO_B_FEMALE-10118193-0001LF
Sc 0
AR
Op 0 0 0
T0 39 512 78 78 0 19 N V 21 N "USB_MICRO_B_FEMALE-10118193-0001LF"
T1 0 -748 600 600 0 98 N V 21 N "VAL**"
T2 0 1614 118 118 0 30 N I 21 N "PCB Border"
DS -1575 1654 1575 1654 150 25
DS 1575 1654 1575 1890 150 21
DS 1575 1890 -1575 1890 150 21
DS -1575 1890 -1575 1654 150 21
DS 1575 1654 1575 -315 150 21
DS 1575 -315 -1575 -315 150 21
DS -1575 -315 -1575 1654 150 21
$PAD
Sh "0" C 787 787 0 0 0
Dr 472 0 0
At STD N 00E0FFFF
Ne 0 ""
Po -1337 1052
$EndPAD
$PAD
Sh "0" C 787 787 0 0 0
Dr 472 0 0
At STD N 00E0FFFF
Ne 0 ""
Po 1338 1052
$EndPAD
$PAD
Sh "0" R 747 669 0 0 0
Dr 0 0 0
At SMD N 00888000
Ne 0 ""
Po -433 1063
$EndPAD
$PAD
Sh "0" R 629 550 0 0 0
Dr 0 0 0
At SMD N 00888000
Ne 0 ""
Po -1299 79
$EndPAD
$PAD
Sh "5" R 157 530 0 0 0
Dr 0 0 0
At SMD N 00888000
Ne 0 ""
Po 510 0
$EndPAD
$PAD
Sh "1" R 157 530 0 0 0
Dr 0 0 0
At SMD N 00888000
Ne 0 ""
Po -511 0
$EndPAD
$PAD
Sh "2" R 157 530 0 0 0
Dr 0 0 0
At SMD N 00888000
Ne 0 ""
Po -255 0
$EndPAD
$PAD
Sh "4" R 157 530 0 0 0
Dr 0 0 0
At SMD N 00888000
Ne 0 ""
Po 255 0
$EndPAD
$PAD
Sh "3" R 157 531 0 0 0
Dr 0 0 0
At SMD N 00888000
Ne 0 ""
Po 0 0
$EndPAD
$PAD
Sh "0" R 629 550 0 0 0
Dr 0 0 0
At SMD N 00888000
Ne 0 ""
Po 1299 79
$EndPAD
$PAD
Sh "0" R 747 669 0 0 0
Dr 0 0 0
At SMD N 00888000
Ne 0 ""
Po 433 1063
$EndPAD
$EndMODULE USB_MICRO_B_FEMALE-10118193-0001LF
$MODULE VIBRAMOTOR_310-101
Po 0 0 0 15 4F7DBE47 00000000 ~~
Li VIBRAMOTOR_310-101
Sc 0
AR
Op 0 0 0
T0 984 -2362 400 400 0 100 N I 21 N "VIBRAMOTOR_310-101"
T1 0 0 600 600 0 120 N V 21 N "VAL**"
DS 1870 -591 3346 -591 150 21
DS 3346 -591 3346 591 150 21
DS 3346 591 1870 591 150 21
DC 0 0 1969 0 150 21
$PAD
Sh "1" C 600 600 0 0 0
Dr 320 0 0
At STD N 00E0FFFF
Ne 0 ""
Po 4134 -394
$EndPAD
$PAD
Sh "2" C 600 600 0 0 0
Dr 320 0 0
At STD N 00E0FFFF
Ne 0 ""
Po 4134 394
$EndPAD
$EndMODULE VIBRAMOTOR_310-101
$MODULE XF2M-1015-1A
Po 0 0 0 15 4F80B64E 00000000 ~~
Li XF2M-1015-1A
Sc 0
AR XF2M-1015-1A
Op 0 0 0
T0 0 787 157 157 0 39 N I 21 N "XF2M-1015-1A"
T1 0 197 600 600 0 120 N V 21 N "VAL**"
T2 0 -1083 118 118 0 30 N I 21 I "Pin numbering for flipped FPC"
DS -1280 -689 -1181 -689 150 21
DS -1181 -689 -1181 -591 150 21
DS -1181 -591 -984 -591 150 21
DS 984 -591 1181 -591 150 21
DS 1181 -591 1181 -689 150 21
DS 1181 -689 1575 -689 150 21
DS 1575 -689 1575 1280 150 21
DS 1575 1280 -1575 1280 150 21
DS -1575 1280 -1575 -689 150 21
DS -1575 -689 -1280 -689 150 21
$PAD
Sh "" R 591 591 0 0 0
Dr 0 0 0
At SMD N 00888000
Ne 0 ""
Po -1476 886
$EndPAD
$PAD
Sh "6" R 98 433 0 0 0
Dr 0 0 0
At SMD N 00888000
Ne 0 ""
Po -98 -689
$EndPAD
$PAD
Sh "7" R 98 433 0 0 0
Dr 0 0 0
At SMD N 00888000
Ne 0 ""
Po -295 -689
$EndPAD
$PAD
Sh "8" R 98 433 0 0 0
Dr 0 0 0
At SMD N 00888000
Ne 0 ""
Po -492 -689
$EndPAD
$PAD
Sh "9" R 98 433 0 0 0
Dr 0 0 0
At SMD N 00888000
Ne 0 ""
Po -689 -689
$EndPAD
$PAD
Sh "10" R 98 433 0 0 0
Dr 0 0 0
At SMD N 00888000
Ne 0 ""
Po -886 -689
$EndPAD
$PAD
Sh "5" R 98 433 0 0 0
Dr 0 0 0
At SMD N 00888000
Ne 0 ""
Po 98 -689
$EndPAD
$PAD
Sh "4" R 98 433 0 0 0
Dr 0 0 0
At SMD N 00888000
Ne 0 ""
Po 295 -689
$EndPAD
$PAD
Sh "3" R 98 433 0 0 0
Dr 0 0 0
At SMD N 00888000
Ne 0 ""
Po 492 -689
$EndPAD
$PAD
Sh "2" R 98 433 0 0 0
Dr 0 0 0
At SMD N 00888000
Ne 0 ""
Po 689 -689
$EndPAD
$PAD
Sh "1" R 98 433 0 0 0
Dr 0 0 0
At SMD N 00888000
Ne 0 ""
Po 886 -689
$EndPAD
$PAD
Sh "" R 591 591 0 0 0
Dr 0 0 0
At SMD N 00888000
Ne 0 ""
Po 1476 886
$EndPAD
$EndMODULE XF2M-1015-1A
$MODULE c_0402
Po 0 0 0 15 49047259 00000000 ~~
Li c_0402
Cd SMT capacitor, 0402
Sc 0
AR
Op 0 0 0
T0 0 -190 60 60 0 12 N V 21 N "c_0402"
T1 0 190 60 60 0 12 N I 21 N "C***"
DS 130 -110 130 110 50 21
DS -130 -110 -130 110 50 21
DS -210 -110 -210 110 50 21
DS -210 110 210 110 50 21
DS 210 110 210 -110 50 21
DS 210 -110 -210 -110 50 21
$PAD
Sh "1" R 315 275 0 0 0
Dr 0 0 0
At SMD N 00888000
Ne 0 ""
Po 216 0
$EndPAD
$PAD
Sh "2" R 315 275 0 0 0
Dr 0 0 0
At SMD N 00888000
Ne 0 ""
Po -216 0
$EndPAD
$SHAPE3D
Na "walter/smd_cap/c_0402.wrl"
Sc 1 1 1
Of 0 0 0
Ro 0 0 0
$EndSHAPE3D
$EndMODULE c_0402
$MODULE c_tant_A
Po 0 0 0 15 49F4C96B 00000000 ~~
Li c_tant_A
Cd SMT capacitor, tantalum size A
Sc 0
AR
Op 0 0 0
T0 10 -510 197 197 0 47 N V 21 N "c_tant_A"
T1 0 500 197 197 0 47 N I 21 N "C***"
DS -436 320 -436 -320 50 21
DS -630 -320 -630 320 50 21
DS -630 320 630 320 50 21
DS 630 320 630 -320 50 21
DS 630 -320 -630 -320 50 21
$PAD
Sh "2" R 768 591 0 0 0
Dr 0 0 0
At SMD N 00888000
Ne 0 ""
Po 541 0
$EndPAD
$PAD
Sh "1" R 768 591 0 0 0
Dr 0 0 0
At SMD N 00888000
Ne 0 ""
Po -541 0
$EndPAD
$SHAPE3D
Na "walter/smd_cap/c_tant_A.wrl"
Sc 1 1 1
Of 0 0 0
Ro 0 0 0
$EndSHAPE3D
$EndMODULE c_tant_A
$MODULE mini_usb_tipo_b_smd
Po 0 0 0 15 4E483721 00000000 ~~
Li mini_usb_tipo_b_smd
Cd USB SERIES MINI-B SURFACE MOUNTED
Kw USB SERIES MINI-B SURFACE MOUNTED
Sc 0
AR
Op 0 0 0
At SMD
T0 1808 -1875 500 500 900 35 N V 21 N ">NAME"
T1 0 0 400 400 0 120 N V 21 N "Val**"
DS -2342 -1515 -2342 1515 50 21
DS -2342 -1515 1299 -1515 50 21
DS 1299 -1515 1299 1515 50 21
DS 1299 1515 -2342 1515 50 21
DS -1816 -500 -566 -250 50 21
DS -566 -250 -566 250 50 21
DS -566 250 -1816 500 50 21
DS -816 1250 -1816 1125 50 21
DS -1816 1125 -1816 875 50 21
DS -1816 875 -816 750 50 21
DS -816 -1250 -1816 -1125 50 21
DS -1816 -1125 -1816 -875 50 21
DS -1816 -875 -816 -750 50 21
$PAD
Sh "3" R 984 196 0 0 0
Dr 0 0 0
At SMD N 00888000
Ne 0 ""
Po 984 0
$EndPAD
$PAD
Sh "2" R 984 196 0 0 0
Dr 0 0 0
At SMD N 00888000
Ne 0 ""
Po 984 -314
$EndPAD
$PAD
Sh "4" R 984 196 0 0 0
Dr 0 0 0
At SMD N 00888000
Ne 0 ""
Po 984 629
$EndPAD
$PAD
Sh "ID" R 984 196 0 0 0
Dr 0 0 0
At SMD N 00888000
Ne 0 ""
Po 984 314
$EndPAD
$PAD
Sh "4" R 984 787 0 0 0
Dr 0 0 0
At SMD N 00888000
Ne 0 ""
Po -1181 1771
$EndPAD
$PAD
Sh "4" R 984 787 0 0 0
Dr 0 0 0
At SMD N 00888000
Ne 0 ""
Po -1181 -1771
$EndPAD
$PAD
Sh "4" R 984 787 0 0 0
Dr 0 0 0
At SMD N 00888000
Ne 0 ""
Po 984 1732
$EndPAD
$PAD
Sh "4" R 984 787 0 0 0
Dr 0 0 0
At SMD N 00888000
Ne 0 ""
Po 984 -1771
$EndPAD
$PAD
Sh "1" R 984 196 0 0 0
Dr 0 0 0
At SMD N 00888000
Ne 0 ""
Po 984 -629
$EndPAD
$EndMODULE mini_usb_tipo_b_smd
$MODULE D2PAK
Po 0 0 0 15 42B2A79C 00000000 ~~
Li D2PAK
Sc 00000000
AR
Op 0 0 0
T0 60 -4290 500 500 0 80 N V 21 N "D2PAK"
T1 100 4000 500 500 0 80 N V 21 N "VAL**"
DS -820 1860 -820 3010 120 21
DS -1170 1850 -1170 3010 120 21
DS 810 1830 1150 1830 120 21
DS 1150 1850 1150 3010 120 21
DS 820 1830 820 3000 120 21
DS 840 3020 1130 3020 120 21
DS -1160 3020 -830 3020 120 21
DS 550 -3560 2150 -3410 120 21
DS -140 1180 130 1180 120 21
DS 1190 1830 1210 1820 120 21
DS 1210 730 1210 1810 120 21
DS 760 720 760 1820 120 21
DS -1210 1830 -800 1830 120 21
DS -770 1820 -770 700 120 21
DS -770 700 -780 700 120 21
DS -1240 1840 -1240 720 120 21
DS -140 710 -140 1180 120 21
DS 130 1180 130 740 120 21
DS -2140 -3410 -580 -3580 120 21
DS -2140 -3130 2140 -3140 120 21
DS -610 -3580 540 -3570 120 21
DS 2160 -3350 2160 680 120 21
DS 2160 680 -2140 690 120 21
DS -2140 690 -2140 -3420 120 21
$PAD
Sh "1" R 591 1260 0 0 0
Dr 0 0 0
At SMD N 00888000
Ne 0 ""
Po -990 2500
$EndPAD
$PAD
Sh "3" R 591 1260 0 0 0
Dr 0 0 0
At SMD N 00888000
Ne 0 ""
Po 990 2500
$EndPAD
$PAD
Sh "2" R 4331 4331 0 0 0
Dr 0 0 0
At SMD N 00888000
Ne 0 ""
Po 0 -1460
$EndPAD
$EndMODULE  D2PAK
$MODULE TantaleCMS
Po 0 0 0 15 50781EF6 00000000 ~~
Li TantaleCMS
Sc 00000000
AR
Op 0 0 0
T0 20 -1043 600 600 0 120 N V 21 N "TantaleCMS"
T1 98 1398 600 600 0 120 N V 21 N "VAL**"
DS -1161 -551 -1161 551 79 21
DS -1161 551 1161 551 79 21
DS 1161 551 1161 -551 79 21
DS 1161 -551 -1161 -551 79 21
$PAD
Sh "1" R 630 866 0 0 0
Dr 0 0 0
At SMD N 00888000
Ne 0 ""
Po -728 0
$EndPAD
$PAD
Sh "2" R 630 866 0 0 0
Dr 0 0 0
At SMD N 00888000
Ne 0 ""
Po 728 0
$EndPAD
$EndMODULE  TantaleCMS
$MODULE SOT89
Po 0 0 0 15 47C52E93 00000000 ~~
Li SOT89
Sc 00000000
AR 
Op 0 0 0
T0 1654 -866 394 394 0 99 N V 21 N "SOT89"
T1 2126 79 394 394 0 99 N V 21 N "VAL**"
DS 787 512 906 512 75 21
DS 157 512 394 512 75 21
DS -394 512 -197 512 75 21
DS -906 512 -787 512 75 21
DS -472 -512 -906 -512 75 21
DS 472 -512 906 -512 75 21
DS 906 512 906 -512 75 21
DS -906 -512 -906 512 75 21
$PAD
Sh "1" R 276 472 0 0 0
Dr 0 0 0
At SMD N 00888000
Ne 0 ""
Po -591 748
$EndPAD
$PAD
Sh "2" R 276 787 0 0 0
Dr 0 0 0
At SMD N 00888000
Ne 0 ""
Po 0 591
$EndPAD
$PAD
Sh "3" R 276 472 0 0 0
Dr 0 0 0
At SMD N 00888000
Ne 0 ""
Po 591 748
$EndPAD
$PAD
Sh "2" R 866 1103 0 0 0
Dr 0 0 0
At SMD N 00888000
Ne 0 ""
Po 0 -354
$EndPAD
$SHAPE3D
Na "LR/SOT89.wrl"
Sc 1.000000 1.000000 1.000000
Of 0.000000 0.000000 0.000000
Ro 0.000000 0.000000 0.000000
$EndSHAPE3D
$EndMODULE  SOT89
$EndLIBRARY
