PCBNEW-LibModule-V1
$INDEX

$EndINDEX
#
# 
# pixmap w = 70, h = 94
#
$MODULE 
Po 0 0 0 15 00000000 00000000 ~~
Li 
T0 0 0 450 450 0 70 N I 21 "VAL"
T1 0 0 450 450 0 70 N I 21 ""
DP 0 0 0 0 85 1 21
Dl 584 784
Dl 434 783
Dl 434 634
Dl 434 450
Dl 434 267
Dl 392 267
Dl 350 267
Dl 350 450
Dl 350 634
Dl 392 634
Dl 434 634
Dl 434 783
Dl 284 783
Dl 284 634
Dl 284 450
Dl 284 267
Dl 242 267
Dl 200 267
Dl 200 450
Dl 200 634
Dl 242 634
Dl 284 634
Dl 284 783
Dl 134 783
Dl 134 634
Dl 134 450
Dl 134 267
Dl 92 267
Dl 50 267
Dl 50 450
Dl 50 634
Dl 92 634
Dl 134 634
Dl 134 783
Dl 105 783
Dl -17 783
Dl -17 634
Dl -17 450
Dl -17 267
Dl -58 267
Dl -100 267
Dl -100 450
Dl -100 634
Dl -58 634
Dl -17 634
Dl -17 783
Dl -210 783
Dl -210 384
Dl -325 384
Dl -440 384
Dl -383 442
Dl -351 476
Dl -329 497
Dl -325 500
Dl -314 490
Dl -286 462
Dl -267 442
Dl -210 384
Dl -210 783
Dl -375 783
Dl -467 691
Dl -574 434
Dl -574 312
Dl -575 173
Dl -575 20
Dl -575 6
Dl -575 -780
Dl -508 -774
Dl -475 -773
Dl -414 -771
Dl -328 -770
Dl -223 -769
Dl -104 -768
Dl 25 -768
Dl 71 -768
Dl 584 -767
Dl 584 9
Dl 584 784
Dl 584 784
$EndMODULE 
$EndLIBRARY
