PCBNEW-LibModule-V1
$INDEX
LOGO
$EndINDEX
#
# LOGO
# pixmap w = 413, h = 413
#
$MODULE LOGO
Po 0 0 0 15 00000000 00000000 ~~
Li LOGO
T0 0 7166 600 600 0 120 N I 21 "G***"
T1 0 -7166 600 600 0 120 N I 21 "LOGO"
DP 0 0 0 0 112 1 21
Dl -1600 5342
Dl -1601 5529
Dl -1606 5664
Dl -1616 5762
Dl -1633 5837
Dl -1660 5905
Dl -1675 5935
Dl -1769 6069
Dl -1883 6150
Dl -1928 6170
Dl -1977 6186
Dl -2040 6198
Dl -2126 6207
Dl -2242 6213
Dl -2398 6218
Dl -2601 6221
Dl -2860 6223
Dl -2933 6224
Dl -3250 6225
Dl -3505 6224
Dl -3704 6219
Dl -3853 6211
Dl -3957 6199
Dl -4002 6189
Dl -4195 6111
Dl -4338 5994
Dl -4429 5851
Dl -4455 5791
Dl -4473 5728
Dl -4486 5651
Dl -4494 5548
Dl -4498 5407
Dl -4500 5218
Dl -4500 5099
Dl -4498 4850
Dl -4491 4657
Dl -4478 4509
Dl -4454 4396
Dl -4420 4307
Dl -4372 4231
Dl -4309 4159
Dl -4246 4101
Dl -4177 4054
Dl -4092 4018
Dl -3985 3991
Dl -3847 3972
Dl -3670 3960
Dl -3447 3953
Dl -3168 3950
Dl -3016 3950
Dl -2717 3951
Dl -2476 3955
Dl -2285 3964
Dl -2137 3978
Dl -2021 4000
Dl -1932 4029
Dl -1860 4069
Dl -1797 4120
Dl -1757 4159
Dl -1684 4272
Dl -1630 4429
Dl -1603 4605
Dl -1601 4659
Dl -1600 4767
Dl -1943 4767
Dl -2285 4767
Dl -2323 4667
Dl -2354 4607
Dl -2403 4562
Dl -2479 4532
Dl -2591 4513
Dl -2748 4503
Dl -2962 4500
Dl -2994 4500
Dl -3248 4505
Dl -3443 4518
Dl -3583 4541
Dl -3676 4575
Dl -3726 4622
Dl -3729 4627
Dl -3758 4720
Dl -3779 4858
Dl -3789 5022
Dl -3789 5191
Dl -3781 5291
Dl -3759 5432
Dl -3727 5526
Dl -3678 5592
Dl -3648 5620
Dl -3616 5640
Dl -3571 5654
Dl -3504 5662
Dl -3403 5665
Dl -3259 5665
Dl -3061 5662
Dl -3001 5661
Dl -2798 5655
Dl -2623 5647
Dl -2487 5637
Dl -2399 5626
Dl -2370 5617
Dl -2339 5561
Dl -2315 5492
Dl -2293 5400
Dl -2731 5400
Dl -3169 5400
Dl -3160 5159
Dl -3150 4917
Dl -2375 4908
Dl -1600 4899
Dl -1600 5342
Dl -1600 5342
DP 0 0 0 0 134 1 21
Dl 4550 5534
Dl 4543 5736
Dl 4519 5885
Dl 4471 5994
Dl 4394 6075
Dl 4282 6140
Dl 4273 6145
Dl 4223 6166
Dl 4172 6183
Dl 4110 6195
Dl 4029 6205
Dl 3920 6212
Dl 3775 6217
Dl 3586 6220
Dl 3343 6223
Dl 3184 6224
Dl 2889 6226
Dl 2653 6225
Dl 2469 6222
Dl 2327 6216
Dl 2222 6208
Dl 2144 6195
Dl 2099 6183
Dl 1990 6138
Dl 1899 6080
Dl 1877 6059
Dl 1808 5948
Dl 1758 5796
Dl 1734 5627
Dl 1734 5592
Dl 1734 5467
Dl 2100 5467
Dl 2260 5467
Dl 2365 5471
Dl 2427 5479
Dl 2457 5495
Dl 2466 5520
Dl 2467 5544
Dl 2471 5596
Dl 2488 5636
Dl 2527 5664
Dl 2597 5682
Dl 2705 5693
Dl 2861 5698
Dl 3072 5700
Dl 3150 5700
Dl 3381 5699
Dl 3553 5695
Dl 3675 5686
Dl 3756 5670
Dl 3803 5646
Dl 3826 5611
Dl 3833 5564
Dl 3833 5552
Dl 3830 5498
Dl 3817 5457
Dl 3786 5426
Dl 3729 5404
Dl 3637 5389
Dl 3502 5378
Dl 3316 5370
Dl 3090 5362
Dl 2801 5352
Dl 2570 5342
Dl 2390 5330
Dl 2251 5316
Dl 2146 5298
Dl 2065 5276
Dl 2001 5248
Dl 1973 5233
Dl 1877 5162
Dl 1812 5082
Dl 1773 4976
Dl 1754 4830
Dl 1750 4668
Dl 1757 4486
Dl 1782 4337
Dl 1830 4216
Dl 1907 4122
Dl 2019 4050
Dl 2171 3999
Dl 2369 3965
Dl 2619 3945
Dl 2926 3936
Dl 3134 3934
Dl 3341 3936
Dl 3540 3941
Dl 3716 3949
Dl 3852 3959
Dl 3913 3966
Dl 4130 4020
Dl 4290 4104
Dl 4397 4222
Dl 4454 4378
Dl 4467 4525
Dl 4467 4700
Dl 4119 4700
Dl 3964 4699
Dl 3863 4696
Dl 3804 4686
Dl 3775 4668
Dl 3763 4640
Dl 3761 4626
Dl 3741 4569
Dl 3696 4527
Dl 3616 4498
Dl 3494 4479
Dl 3321 4470
Dl 3111 4467
Dl 2886 4469
Dl 2719 4476
Dl 2603 4491
Dl 2528 4515
Dl 2486 4551
Dl 2469 4602
Dl 2467 4634
Dl 2473 4689
Dl 2498 4731
Dl 2550 4761
Dl 2636 4781
Dl 2765 4793
Dl 2944 4799
Dl 3177 4801
Dl 3519 4805
Dl 3800 4819
Dl 4026 4844
Dl 4203 4884
Dl 4336 4943
Dl 4431 5023
Dl 4495 5127
Dl 4532 5259
Dl 4548 5421
Dl 4550 5534
Dl 4550 5534
DP 0 0 0 0 55 1 21
Dl 1429 4692
Dl 1428 4861
Dl 1414 5083
Dl 1384 5251
Dl 1335 5378
Dl 1260 5478
Dl 1156 5561
Dl 1022 5650
Dl 700 5654
Dl 700 4811
Dl 695 4700
Dl 674 4636
Dl 636 4601
Dl 580 4589
Dl 468 4579
Dl 312 4571
Dl 124 4567
Dl 19 4567
Dl -533 4567
Dl -533 4817
Dl -533 5067
Dl 44 5067
Dl 283 5065
Dl 461 5059
Dl 581 5049
Dl 647 5035
Dl 660 5027
Dl 683 4972
Dl 697 4877
Dl 700 4811
Dl 700 5654
Dl 244 5661
Dl -533 5671
Dl -533 5936
Dl -533 6200
Dl -883 6200
Dl -1233 6200
Dl -1233 5084
Dl -1233 3967
Dl -208 3967
Dl 110 3968
Dl 370 3970
Dl 578 3975
Dl 743 3984
Dl 871 3997
Dl 971 4015
Dl 1050 4040
Dl 1116 4071
Dl 1177 4111
Dl 1196 4125
Dl 1299 4223
Dl 1370 4342
Dl 1412 4495
Dl 1429 4692
Dl 1429 4692
DP 0 0 0 0 127 1 21
Dl -2754 467
Dl -2758 533
Dl -2770 606
Dl -2794 695
Dl -2832 808
Dl -2888 954
Dl -2965 1143
Dl -3066 1382
Dl -3081 1417
Dl -3178 1646
Dl -3274 1872
Dl -3352 2056
Dl -3352 423
Dl -3389 393
Dl -3476 345
Dl -3602 285
Dl -3754 216
Dl -3922 144
Dl -4092 74
Dl -4252 11
Dl -4392 -39
Dl -4498 -73
Dl -4559 -85
Dl -4565 -84
Dl -4614 -43
Dl -4664 36
Dl -4674 59
Dl -4700 123
Dl -4749 238
Dl -4815 396
Dl -4895 586
Dl -4986 800
Dl -5081 1024
Dl -5196 1298
Dl -5285 1516
Dl -5348 1682
Dl -5389 1802
Dl -5408 1879
Dl -5408 1918
Dl -5407 1919
Dl -5369 1947
Dl -5281 1995
Dl -5156 2057
Dl -5005 2128
Dl -4841 2202
Dl -4676 2274
Dl -4523 2338
Dl -4393 2389
Dl -4299 2421
Dl -4259 2430
Dl -4199 2407
Dl -4152 2358
Dl -4118 2295
Dl -4065 2184
Dl -3998 2034
Dl -3920 1854
Dl -3834 1655
Dl -3746 1443
Dl -3658 1230
Dl -3574 1024
Dl -3498 834
Dl -3435 670
Dl -3386 540
Dl -3358 455
Dl -3352 423
Dl -3352 2056
Dl -3363 2082
Dl -3440 2263
Dl -3499 2403
Dl -3523 2459
Dl -3638 2681
Dl -3768 2844
Dl -3921 2952
Dl -4028 2995
Dl -4159 3021
Dl -4300 3030
Dl -4422 3021
Dl -4466 3009
Dl -4512 2991
Dl -4608 2951
Dl -4745 2894
Dl -4911 2824
Dl -5097 2745
Dl -5100 2744
Dl -5337 2641
Dl -5520 2556
Dl -5655 2484
Dl -5752 2422
Dl -5808 2376
Dl -5926 2221
Dl -6002 2037
Dl -6027 1848
Dl -6022 1785
Dl -6004 1720
Dl -5963 1603
Dl -5902 1442
Dl -5825 1245
Dl -5734 1021
Dl -5633 779
Dl -5570 630
Dl -5449 349
Dl -5350 121
Dl -5270 -58
Dl -5205 -197
Dl -5152 -301
Dl -5107 -379
Dl -5067 -436
Dl -5028 -480
Dl -5003 -504
Dl -4836 -616
Dl -4648 -682
Dl -4460 -694
Dl -4440 -692
Dl -4357 -671
Dl -4227 -627
Dl -4063 -565
Dl -3876 -490
Dl -3680 -408
Dl -3488 -324
Dl -3311 -244
Dl -3163 -172
Dl -3055 -115
Dl -3012 -86
Dl -2872 67
Dl -2784 255
Dl -2754 467
Dl -2754 467
DP 0 0 0 0 39 1 21
Dl 4865 1398
Dl 4856 1598
Dl 4830 1774
Dl 4765 1995
Dl 4661 2229
Dl 4532 2452
Dl 4391 2639
Dl 4348 2684
Dl 4213 2802
Dl 4100 2862
Dl 4005 2863
Dl 3924 2808
Dl 3922 2806
Dl 3870 2704
Dl 3874 2592
Dl 3934 2491
Dl 3969 2460
Dl 4082 2349
Dl 4196 2191
Dl 4298 2004
Dl 4368 1832
Dl 4404 1712
Dl 4424 1604
Dl 4430 1482
Dl 4424 1321
Dl 4423 1306
Dl 4416 1157
Dl 4417 1058
Dl 4427 996
Dl 4449 953
Dl 4469 931
Dl 4566 872
Dl 4667 872
Dl 4757 926
Dl 4822 1028
Dl 4832 1059
Dl 4857 1210
Dl 4865 1398
Dl 4865 1398
DP 0 0 0 0 39 1 21
Dl 3425 520
Dl 3410 712
Dl 3403 767
Dl 3327 1106
Dl 3210 1439
Dl 3059 1752
Dl 2879 2034
Dl 2679 2273
Dl 2488 2439
Dl 2378 2508
Dl 2294 2530
Dl 2215 2507
Dl 2174 2482
Dl 2110 2417
Dl 2094 2340
Dl 2129 2245
Dl 2216 2126
Dl 2343 1991
Dl 2580 1709
Dl 2769 1383
Dl 2907 1018
Dl 2934 920
Dl 2972 719
Dl 2994 500
Dl 2999 286
Dl 2986 97
Dl 2965 -8
Dl 2955 -132
Dl 2989 -231
Dl 3055 -299
Dl 3140 -329
Dl 3229 -315
Dl 3310 -253
Dl 3355 -177
Dl 3389 -53
Dl 3413 118
Dl 3425 316
Dl 3425 520
Dl 3425 520
DP 0 0 0 0 48 1 21
Dl 1681 -747
Dl 1678 -508
Dl 1666 -271
Dl 1644 -56
Dl 1613 120
Dl 1609 134
Dl 1469 601
Dl 1290 1031
Dl 1077 1420
Dl 832 1760
Dl 561 2045
Dl 493 2104
Dl 342 2212
Dl 219 2263
Dl 118 2258
Dl 53 2214
Dl 3 2123
Dl 10 2017
Dl 71 1912
Dl 109 1876
Dl 432 1560
Dl 706 1201
Dl 930 798
Dl 1106 349
Dl 1157 179
Dl 1194 42
Dl 1218 -73
Dl 1234 -186
Dl 1241 -314
Dl 1243 -475
Dl 1242 -650
Dl 1238 -841
Dl 1235 -1023
Dl 1231 -1179
Dl 1227 -1290
Dl 1226 -1315
Dl 1224 -1417
Dl 1240 -1476
Dl 1281 -1515
Dl 1309 -1532
Dl 1414 -1561
Dl 1508 -1528
Dl 1584 -1434
Dl 1630 -1315
Dl 1657 -1169
Dl 1674 -974
Dl 1681 -747
Dl 1681 -747
DP 0 0 0 0 38 1 21
Dl -482 -1397
Dl -489 -1360
Dl -521 -1271
Dl -574 -1140
Dl -642 -975
Dl -723 -785
Dl -812 -580
Dl -905 -368
Dl -1000 -158
Dl -1090 41
Dl -1174 221
Dl -1246 372
Dl -1303 485
Dl -1340 552
Dl -1353 567
Dl -1400 548
Dl -1477 502
Dl -1520 471
Dl -1661 357
Dl -1763 241
Dl -1849 97
Dl -1887 18
Dl -1964 -224
Dl -1980 -468
Dl -1941 -705
Dl -1850 -926
Dl -1713 -1122
Dl -1535 -1286
Dl -1322 -1408
Dl -1077 -1479
Dl -1024 -1487
Dl -903 -1491
Dl -769 -1482
Dl -641 -1461
Dl -540 -1433
Dl -484 -1400
Dl -482 -1397
Dl -482 -1397
DP 0 0 0 0 43 1 21
Dl -2184 -1683
Dl -2188 -1523
Dl -2200 -1406
Dl -2226 -1310
Dl -2266 -1216
Dl -2399 -1012
Dl -2575 -835
Dl -2776 -703
Dl -2782 -701
Dl -2914 -655
Dl -3080 -623
Dl -3256 -607
Dl -3417 -609
Dl -3533 -629
Dl -3766 -738
Dl -3976 -897
Dl -4147 -1094
Dl -4243 -1261
Dl -4301 -1459
Dl -4317 -1684
Dl -4291 -1910
Dl -4229 -2101
Dl -4105 -2318
Dl -3952 -2484
Dl -3754 -2616
Dl -3707 -2640
Dl -3576 -2700
Dl -3467 -2733
Dl -3349 -2746
Dl -3235 -2748
Dl -3049 -2737
Dl -2903 -2706
Dl -2827 -2676
Dl -2643 -2566
Dl -2468 -2412
Dl -2323 -2236
Dl -2272 -2151
Dl -2228 -2058
Dl -2201 -1971
Dl -2188 -1867
Dl -2184 -1725
Dl -2184 -1683
Dl -2184 -1683
DP 0 0 0 0 130 1 21
Dl -435 -5000
Dl -438 -4940
Dl -448 -4874
Dl -468 -4795
Dl -502 -4694
Dl -551 -4564
Dl -619 -4397
Dl -708 -4184
Dl -822 -3920
Dl -828 -3906
Dl -931 -3669
Dl -1031 -3448
Dl -1041 -3427
Dl -1041 -5028
Dl -1052 -5060
Dl -1081 -5092
Dl -1137 -5129
Dl -1229 -5177
Dl -1365 -5238
Dl -1553 -5319
Dl -1595 -5337
Dl -1810 -5426
Dl -1973 -5491
Dl -2091 -5533
Dl -2174 -5556
Dl -2230 -5560
Dl -2266 -5548
Dl -2292 -5525
Dl -2320 -5474
Dl -2369 -5373
Dl -2433 -5232
Dl -2508 -5061
Dl -2590 -4869
Dl -2675 -4666
Dl -2760 -4461
Dl -2839 -4266
Dl -2910 -4089
Dl -2967 -3940
Dl -3007 -3830
Dl -3026 -3767
Dl -3027 -3758
Dl -3020 -3735
Dl -3004 -3712
Dl -2970 -3686
Dl -2913 -3653
Dl -2824 -3609
Dl -2697 -3552
Dl -2524 -3477
Dl -2299 -3381
Dl -2233 -3353
Dl -2078 -3289
Dl -1971 -3249
Dl -1900 -3232
Dl -1852 -3232
Dl -1817 -3248
Dl -1783 -3292
Dl -1728 -3392
Dl -1653 -3543
Dl -1561 -3739
Dl -1456 -3974
Dl -1392 -4120
Dl -1297 -4343
Dl -1212 -4549
Dl -1141 -4729
Dl -1086 -4875
Dl -1052 -4978
Dl -1041 -5028
Dl -1041 -3427
Dl -1122 -3250
Dl -1201 -3085
Dl -1263 -2962
Dl -1305 -2889
Dl -1312 -2880
Dl -1460 -2745
Dl -1645 -2657
Dl -1849 -2621
Dl -2000 -2633
Dl -2069 -2653
Dl -2187 -2695
Dl -2339 -2752
Dl -2513 -2821
Dl -2695 -2895
Dl -2873 -2969
Dl -3032 -3039
Dl -3161 -3097
Dl -3183 -3108
Dl -3383 -3237
Dl -3525 -3398
Dl -3609 -3589
Dl -3633 -3782
Dl -3630 -3842
Dl -3620 -3908
Dl -3600 -3988
Dl -3567 -4088
Dl -3518 -4218
Dl -3450 -4385
Dl -3361 -4597
Dl -3248 -4860
Dl -3147 -5093
Dl -3052 -5312
Dl -2965 -5505
Dl -2893 -5666
Dl -2837 -5785
Dl -2803 -5852
Dl -2800 -5859
Dl -2732 -5942
Dl -2636 -6027
Dl -2595 -6057
Dl -2512 -6106
Dl -2432 -6135
Dl -2333 -6147
Dl -2202 -6150
Dl -2112 -6149
Dl -2034 -6142
Dl -1956 -6128
Dl -1866 -6102
Dl -1753 -6060
Dl -1606 -5999
Dl -1412 -5916
Dl -1350 -5889
Dl -1157 -5803
Dl -980 -5720
Dl -830 -5644
Dl -718 -5583
Dl -655 -5541
Dl -654 -5539
Dl -529 -5379
Dl -455 -5181
Dl -435 -5000
Dl -435 -5000
$EndMODULE LOGO
$EndLIBRARY
