PCBNEW-LibModule-V1
$INDEX
LOGO
$EndINDEX
#
# LOGO
# pixmap w = 78, h = 78
#
$MODULE LOGO
Po 0 0 0 15 00000000 00000000 ~~
Li LOGO
T0 0 1600 600 600 0 120 N I 21 "G***"
T1 0 -1600 600 600 0 120 N I 21 "LOGO"
DP 0 0 0 0 10 1 21
Dl 1316 -1285
Dl 25 -1276
Dl -1266 -1266
Dl -1276 25
Dl -1285 1316
Dl -1293 8
Dl -1300 -1300
Dl 8 -1293
Dl 1316 -1285
Dl 1316 -1285
DP 0 0 0 0 12 1 21
Dl -620 933
Dl -767 1083
Dl -846 1161
Dl -907 1215
Dl -934 1233
Dl -966 1211
Dl -1029 1154
Dl -1100 1083
Dl -1248 933
Dl -934 933
Dl -620 933
Dl -620 933
DP 0 0 0 0 28 1 21
Dl 622 1231
Dl 621 1233
Dl 581 1220
Dl 495 1184
Dl 378 1132
Dl 297 1095
Dl 0 956
Dl 0 804
Dl 0 651
Dl -304 950
Dl -416 1059
Dl -508 1144
Dl -571 1199
Dl -596 1215
Dl -596 1213
Dl -578 1169
Dl -539 1079
Dl -485 959
Dl -454 888
Dl -323 600
Dl -153 600
Dl 17 600
Dl 333 916
Dl 446 1032
Dl 537 1128
Dl 599 1198
Dl 622 1231
Dl 622 1231
DP 0 0 0 0 5 1 21
Dl 1249 933
Dl 933 1249
Dl 933 617
Dl 1249 933
Dl 1249 933
DP 0 0 0 0 33 1 21
Dl -600 -151
Dl -602 -82
Dl -610 -27
Dl -634 26
Dl -680 88
Dl -756 171
Dl -869 285
Dl -917 333
Dl -1033 446
Dl -1130 538
Dl -1199 600
Dl -1232 624
Dl -1234 623
Dl -1220 585
Dl -1182 500
Dl -1126 385
Dl -1083 299
Dl -933 0
Dl -793 0
Dl -652 0
Dl -943 -293
Dl -1054 -406
Dl -1146 -503
Dl -1209 -574
Dl -1234 -608
Dl -1234 -609
Dl -1206 -605
Dl -1131 -576
Dl -1022 -527
Dl -917 -476
Dl -601 -319
Dl -600 -151
Dl -600 -151
DP 0 0 0 0 28 1 21
Dl 1233 -592
Dl 1219 -554
Dl 1181 -470
Dl 1127 -356
Dl 1092 -284
Dl 951 0
Dl 801 0
Dl 651 0
Dl 950 300
Dl 1057 411
Dl 1140 504
Dl 1190 568
Dl 1202 597
Dl 1199 597
Dl 1147 582
Dl 1054 545
Dl 935 492
Dl 892 472
Dl 635 350
Dl 634 165
Dl 633 -19
Dl 933 -317
Dl 1045 -427
Dl 1138 -515
Dl 1204 -573
Dl 1232 -593
Dl 1233 -592
Dl 1233 -592
DP 0 0 0 0 14 1 21
Dl 479 298
Dl 400 382
Dl 342 438
Dl 302 466
Dl 300 466
Dl 264 444
Dl 207 390
Dl 199 382
Dl 120 298
Dl 210 208
Dl 300 118
Dl 389 208
Dl 479 298
Dl 479 298
DP 0 0 0 0 14 1 21
Dl -121 264
Dl -200 349
Dl -258 405
Dl -298 432
Dl -300 433
Dl -336 411
Dl -393 357
Dl -401 349
Dl -480 264
Dl -390 174
Dl -300 84
Dl -211 174
Dl -121 264
Dl -121 264
DP 0 0 0 0 14 1 21
Dl -121 -302
Dl -200 -218
Dl -258 -162
Dl -298 -134
Dl -300 -134
Dl -336 -156
Dl -393 -210
Dl -401 -218
Dl -480 -302
Dl -390 -392
Dl -300 -482
Dl -211 -392
Dl -121 -302
Dl -121 -302
DP 0 0 0 0 14 1 21
Dl 479 -302
Dl 400 -218
Dl 342 -162
Dl 302 -134
Dl 300 -134
Dl 264 -156
Dl 207 -210
Dl 199 -218
Dl 120 -302
Dl 210 -392
Dl 300 -482
Dl 389 -392
Dl 479 -302
Dl 479 -302
DP 0 0 0 0 13 1 21
Dl -934 -942
Dl -935 -808
Dl -937 -703
Dl -941 -643
Dl -944 -634
Dl -970 -656
Dl -1029 -713
Dl -1101 -784
Dl -1249 -935
Dl -1091 -1092
Dl -934 -1250
Dl -934 -942
Dl -934 -942
DP 0 0 0 0 27 1 21
Dl 639 -1250
Dl 486 -942
Dl 332 -634
Dl 141 -635
Dl -50 -636
Dl -350 -934
Dl -461 -1046
Dl -549 -1139
Dl -607 -1204
Dl -626 -1233
Dl -625 -1234
Dl -586 -1220
Dl -502 -1182
Dl -386 -1126
Dl -300 -1083
Dl 0 -933
Dl 0 -800
Dl 5 -717
Dl 18 -670
Dl 24 -667
Dl 56 -689
Dl 124 -750
Dl 220 -839
Dl 334 -949
Dl 344 -959
Dl 639 -1250
Dl 639 -1250
DP 0 0 0 0 5 1 21
Dl 1249 -934
Dl 617 -934
Dl 933 -1250
Dl 1249 -934
Dl 1249 -934
$EndMODULE LOGO
$EndLIBRARY
