<?xml version="1.0" encoding="utf-8"?>
<!DOCTYPE eagle SYSTEM "eagle.dtd">
<eagle version="7.1.0">
<drawing>
<settings>
<setting alwaysvectorfont="no"/>
<setting verticaltext="up"/>
</settings>
<grid distance="0.1" unitdist="inch" unit="inch" style="lines" multiple="1" display="yes" altdistance="0.01" altunitdist="inch" altunit="inch"/>
<layers>
<layer number="1" name="Top" color="4" fill="1" visible="no" active="no"/>
<layer number="16" name="Bottom" color="1" fill="1" visible="no" active="no"/>
<layer number="17" name="Pads" color="2" fill="1" visible="no" active="no"/>
<layer number="18" name="Vias" color="2" fill="1" visible="no" active="no"/>
<layer number="19" name="Unrouted" color="6" fill="1" visible="no" active="no"/>
<layer number="20" name="Dimension" color="15" fill="1" visible="no" active="no"/>
<layer number="21" name="tPlace" color="16" fill="1" visible="no" active="no"/>
<layer number="22" name="bPlace" color="14" fill="1" visible="no" active="no"/>
<layer number="23" name="tOrigins" color="15" fill="1" visible="no" active="no"/>
<layer number="24" name="bOrigins" color="15" fill="1" visible="no" active="no"/>
<layer number="25" name="tNames" color="7" fill="1" visible="no" active="no"/>
<layer number="26" name="bNames" color="7" fill="1" visible="no" active="no"/>
<layer number="27" name="tValues" color="7" fill="1" visible="no" active="no"/>
<layer number="28" name="bValues" color="7" fill="1" visible="no" active="no"/>
<layer number="29" name="tStop" color="7" fill="3" visible="no" active="no"/>
<layer number="30" name="bStop" color="7" fill="6" visible="no" active="no"/>
<layer number="31" name="tCream" color="7" fill="4" visible="no" active="no"/>
<layer number="32" name="bCream" color="7" fill="5" visible="no" active="no"/>
<layer number="33" name="tFinish" color="6" fill="3" visible="no" active="no"/>
<layer number="34" name="bFinish" color="6" fill="6" visible="no" active="no"/>
<layer number="35" name="tGlue" color="7" fill="4" visible="no" active="no"/>
<layer number="36" name="bGlue" color="7" fill="5" visible="no" active="no"/>
<layer number="37" name="tTest" color="7" fill="1" visible="no" active="no"/>
<layer number="38" name="bTest" color="7" fill="1" visible="no" active="no"/>
<layer number="39" name="tKeepout" color="4" fill="11" visible="no" active="no"/>
<layer number="40" name="bKeepout" color="1" fill="11" visible="no" active="no"/>
<layer number="41" name="tRestrict" color="4" fill="10" visible="no" active="no"/>
<layer number="42" name="bRestrict" color="1" fill="10" visible="no" active="no"/>
<layer number="43" name="vRestrict" color="2" fill="10" visible="no" active="no"/>
<layer number="44" name="Drills" color="7" fill="1" visible="no" active="no"/>
<layer number="45" name="Holes" color="7" fill="1" visible="no" active="no"/>
<layer number="46" name="Milling" color="3" fill="1" visible="no" active="no"/>
<layer number="47" name="Measures" color="7" fill="1" visible="no" active="no"/>
<layer number="48" name="Document" color="7" fill="1" visible="no" active="no"/>
<layer number="49" name="Reference" color="7" fill="1" visible="no" active="no"/>
<layer number="50" name="dxf" color="7" fill="1" visible="no" active="no"/>
<layer number="51" name="tDocu" color="7" fill="1" visible="no" active="no"/>
<layer number="52" name="bDocu" color="7" fill="1" visible="no" active="no"/>
<layer number="53" name="tGND_GNDA" color="7" fill="9" visible="no" active="no"/>
<layer number="54" name="bGND_GNDA" color="1" fill="9" visible="no" active="no"/>
<layer number="56" name="wert" color="7" fill="1" visible="no" active="no"/>
<layer number="57" name="tCAD" color="7" fill="1" visible="no" active="no"/>
<layer number="90" name="Modules" color="5" fill="1" visible="yes" active="yes"/>
<layer number="91" name="Nets" color="2" fill="1" visible="yes" active="yes"/>
<layer number="92" name="Busses" color="1" fill="1" visible="yes" active="yes"/>
<layer number="93" name="Pins" color="2" fill="1" visible="no" active="yes"/>
<layer number="94" name="Symbols" color="4" fill="1" visible="yes" active="yes"/>
<layer number="95" name="Names" color="7" fill="1" visible="yes" active="yes"/>
<layer number="96" name="Values" color="7" fill="1" visible="yes" active="yes"/>
<layer number="97" name="Info" color="7" fill="1" visible="yes" active="yes"/>
<layer number="98" name="Guide" color="6" fill="1" visible="yes" active="yes"/>
<layer number="99" name="SpiceOrder" color="7" fill="1" visible="yes" active="yes"/>
<layer number="100" name="Muster" color="7" fill="1" visible="no" active="no"/>
<layer number="101" name="Patch_Top" color="12" fill="4" visible="yes" active="yes"/>
<layer number="102" name="Vscore" color="7" fill="1" visible="yes" active="yes"/>
<layer number="103" name="tMap" color="7" fill="1" visible="yes" active="yes"/>
<layer number="104" name="Name" color="16" fill="1" visible="yes" active="yes"/>
<layer number="105" name="tPlate" color="7" fill="1" visible="yes" active="yes"/>
<layer number="106" name="bPlate" color="7" fill="1" visible="yes" active="yes"/>
<layer number="107" name="Crop" color="7" fill="1" visible="yes" active="yes"/>
<layer number="108" name="tplace-old" color="10" fill="1" visible="yes" active="yes"/>
<layer number="109" name="ref-old" color="11" fill="1" visible="yes" active="yes"/>
<layer number="110" name="fp0" color="7" fill="1" visible="yes" active="yes"/>
<layer number="111" name="LPC17xx" color="7" fill="1" visible="yes" active="yes"/>
<layer number="112" name="tSilk" color="7" fill="1" visible="yes" active="yes"/>
<layer number="113" name="IDFDebug" color="4" fill="1" visible="yes" active="yes"/>
<layer number="116" name="Patch_BOT" color="9" fill="4" visible="yes" active="yes"/>
<layer number="121" name="_tsilk" color="7" fill="1" visible="yes" active="yes"/>
<layer number="122" name="_bsilk" color="7" fill="1" visible="yes" active="yes"/>
<layer number="123" name="tTestmark" color="7" fill="1" visible="yes" active="yes"/>
<layer number="124" name="bTestmark" color="7" fill="1" visible="yes" active="yes"/>
<layer number="125" name="_tNames" color="7" fill="1" visible="yes" active="yes"/>
<layer number="126" name="_bNames" color="7" fill="1" visible="yes" active="yes"/>
<layer number="127" name="_tValues" color="7" fill="1" visible="yes" active="yes"/>
<layer number="128" name="_bValues" color="7" fill="1" visible="yes" active="yes"/>
<layer number="131" name="tAdjust" color="7" fill="1" visible="yes" active="yes"/>
<layer number="132" name="bAdjust" color="7" fill="1" visible="yes" active="yes"/>
<layer number="144" name="Drill_legend" color="7" fill="1" visible="yes" active="yes"/>
<layer number="150" name="Notes" color="7" fill="1" visible="yes" active="yes"/>
<layer number="151" name="HeatSink" color="7" fill="1" visible="yes" active="yes"/>
<layer number="152" name="_bDocu" color="7" fill="1" visible="yes" active="yes"/>
<layer number="153" name="FabDoc1" color="7" fill="1" visible="yes" active="yes"/>
<layer number="154" name="FabDoc2" color="7" fill="1" visible="yes" active="yes"/>
<layer number="155" name="FabDoc3" color="7" fill="1" visible="yes" active="yes"/>
<layer number="199" name="Contour" color="7" fill="1" visible="yes" active="yes"/>
<layer number="200" name="200bmp" color="1" fill="10" visible="yes" active="yes"/>
<layer number="201" name="201bmp" color="2" fill="10" visible="yes" active="yes"/>
<layer number="202" name="202bmp" color="3" fill="10" visible="yes" active="yes"/>
<layer number="203" name="203bmp" color="4" fill="10" visible="yes" active="yes"/>
<layer number="204" name="204bmp" color="5" fill="10" visible="yes" active="yes"/>
<layer number="205" name="205bmp" color="6" fill="10" visible="yes" active="yes"/>
<layer number="206" name="206bmp" color="7" fill="10" visible="yes" active="yes"/>
<layer number="207" name="207bmp" color="8" fill="10" visible="yes" active="yes"/>
<layer number="208" name="208bmp" color="9" fill="10" visible="yes" active="yes"/>
<layer number="209" name="209bmp" color="7" fill="1" visible="yes" active="yes"/>
<layer number="210" name="210bmp" color="7" fill="1" visible="yes" active="yes"/>
<layer number="211" name="211bmp" color="7" fill="1" visible="yes" active="yes"/>
<layer number="212" name="212bmp" color="7" fill="1" visible="yes" active="yes"/>
<layer number="213" name="213bmp" color="7" fill="1" visible="yes" active="yes"/>
<layer number="214" name="214bmp" color="7" fill="1" visible="yes" active="yes"/>
<layer number="215" name="215bmp" color="7" fill="1" visible="yes" active="yes"/>
<layer number="216" name="216bmp" color="7" fill="1" visible="yes" active="yes"/>
<layer number="217" name="217bmp" color="18" fill="1" visible="no" active="no"/>
<layer number="218" name="218bmp" color="19" fill="1" visible="no" active="no"/>
<layer number="219" name="219bmp" color="20" fill="1" visible="no" active="no"/>
<layer number="220" name="220bmp" color="21" fill="1" visible="no" active="no"/>
<layer number="221" name="221bmp" color="22" fill="1" visible="no" active="no"/>
<layer number="222" name="222bmp" color="23" fill="1" visible="no" active="no"/>
<layer number="223" name="223bmp" color="24" fill="1" visible="no" active="no"/>
<layer number="224" name="224bmp" color="25" fill="1" visible="no" active="no"/>
<layer number="248" name="Housing" color="7" fill="1" visible="yes" active="yes"/>
<layer number="249" name="Edge" color="7" fill="1" visible="yes" active="yes"/>
<layer number="250" name="Descript" color="3" fill="1" visible="no" active="no"/>
<layer number="251" name="SMDround" color="12" fill="11" visible="no" active="no"/>
<layer number="254" name="cooling" color="7" fill="1" visible="yes" active="yes"/>
</layers>
<schematic xreflabel="%F%N/%S.%C%R" xrefpart="/%S.%C%R">
<libraries>
<library name="pinhead">
<description>&lt;b&gt;Pin Header Connectors&lt;/b&gt;&lt;p&gt;
&lt;author&gt;Created by librarian@cadsoft.de&lt;/author&gt;</description>
<packages>
<package name="1X04">
<description>&lt;b&gt;PIN HEADER&lt;/b&gt;</description>
<wire x1="0" y1="0.635" x2="0.635" y2="1.27" width="0.1524" layer="21"/>
<wire x1="0.635" y1="1.27" x2="1.905" y2="1.27" width="0.1524" layer="21"/>
<wire x1="1.905" y1="1.27" x2="2.54" y2="0.635" width="0.1524" layer="21"/>
<wire x1="2.54" y1="0.635" x2="2.54" y2="-0.635" width="0.1524" layer="21"/>
<wire x1="2.54" y1="-0.635" x2="1.905" y2="-1.27" width="0.1524" layer="21"/>
<wire x1="1.905" y1="-1.27" x2="0.635" y2="-1.27" width="0.1524" layer="21"/>
<wire x1="0.635" y1="-1.27" x2="0" y2="-0.635" width="0.1524" layer="21"/>
<wire x1="-4.445" y1="1.27" x2="-3.175" y2="1.27" width="0.1524" layer="21"/>
<wire x1="-3.175" y1="1.27" x2="-2.54" y2="0.635" width="0.1524" layer="21"/>
<wire x1="-2.54" y1="0.635" x2="-2.54" y2="-0.635" width="0.1524" layer="21"/>
<wire x1="-2.54" y1="-0.635" x2="-3.175" y2="-1.27" width="0.1524" layer="21"/>
<wire x1="-2.54" y1="0.635" x2="-1.905" y2="1.27" width="0.1524" layer="21"/>
<wire x1="-1.905" y1="1.27" x2="-0.635" y2="1.27" width="0.1524" layer="21"/>
<wire x1="-0.635" y1="1.27" x2="0" y2="0.635" width="0.1524" layer="21"/>
<wire x1="0" y1="0.635" x2="0" y2="-0.635" width="0.1524" layer="21"/>
<wire x1="0" y1="-0.635" x2="-0.635" y2="-1.27" width="0.1524" layer="21"/>
<wire x1="-0.635" y1="-1.27" x2="-1.905" y2="-1.27" width="0.1524" layer="21"/>
<wire x1="-1.905" y1="-1.27" x2="-2.54" y2="-0.635" width="0.1524" layer="21"/>
<wire x1="-5.08" y1="0.635" x2="-5.08" y2="-0.635" width="0.1524" layer="21"/>
<wire x1="-4.445" y1="1.27" x2="-5.08" y2="0.635" width="0.1524" layer="21"/>
<wire x1="-5.08" y1="-0.635" x2="-4.445" y2="-1.27" width="0.1524" layer="21"/>
<wire x1="-3.175" y1="-1.27" x2="-4.445" y2="-1.27" width="0.1524" layer="21"/>
<wire x1="3.175" y1="1.27" x2="4.445" y2="1.27" width="0.1524" layer="21"/>
<wire x1="4.445" y1="1.27" x2="5.08" y2="0.635" width="0.1524" layer="21"/>
<wire x1="5.08" y1="0.635" x2="5.08" y2="-0.635" width="0.1524" layer="21"/>
<wire x1="5.08" y1="-0.635" x2="4.445" y2="-1.27" width="0.1524" layer="21"/>
<wire x1="3.175" y1="1.27" x2="2.54" y2="0.635" width="0.1524" layer="21"/>
<wire x1="2.54" y1="-0.635" x2="3.175" y2="-1.27" width="0.1524" layer="21"/>
<wire x1="4.445" y1="-1.27" x2="3.175" y2="-1.27" width="0.1524" layer="21"/>
<pad name="1" x="-3.81" y="0" drill="1.016" shape="long" rot="R90"/>
<pad name="2" x="-1.27" y="0" drill="1.016" shape="long" rot="R90"/>
<pad name="3" x="1.27" y="0" drill="1.016" shape="long" rot="R90"/>
<pad name="4" x="3.81" y="0" drill="1.016" shape="long" rot="R90"/>
<text x="-5.08" y="-3.175" size="1.27" layer="27">&gt;VALUE</text>
<rectangle x1="1.016" y1="-0.254" x2="1.524" y2="0.254" layer="51"/>
<rectangle x1="-1.524" y1="-0.254" x2="-1.016" y2="0.254" layer="51"/>
<rectangle x1="-4.064" y1="-0.254" x2="-3.556" y2="0.254" layer="51"/>
<rectangle x1="3.556" y1="-0.254" x2="4.064" y2="0.254" layer="51"/>
</package>
<package name="1X04/90">
<description>&lt;b&gt;PIN HEADER&lt;/b&gt;</description>
<wire x1="-5.08" y1="-1.905" x2="-2.54" y2="-1.905" width="0.1524" layer="21"/>
<wire x1="-2.54" y1="-1.905" x2="-2.54" y2="0.635" width="0.1524" layer="21"/>
<wire x1="-2.54" y1="0.635" x2="-5.08" y2="0.635" width="0.1524" layer="21"/>
<wire x1="-5.08" y1="0.635" x2="-5.08" y2="-1.905" width="0.1524" layer="21"/>
<wire x1="-3.81" y1="6.985" x2="-3.81" y2="1.27" width="0.762" layer="21"/>
<wire x1="-2.54" y1="-1.905" x2="0" y2="-1.905" width="0.1524" layer="21"/>
<wire x1="0" y1="-1.905" x2="0" y2="0.635" width="0.1524" layer="21"/>
<wire x1="0" y1="0.635" x2="-2.54" y2="0.635" width="0.1524" layer="21"/>
<wire x1="-1.27" y1="6.985" x2="-1.27" y2="1.27" width="0.762" layer="21"/>
<wire x1="0" y1="-1.905" x2="2.54" y2="-1.905" width="0.1524" layer="21"/>
<wire x1="2.54" y1="-1.905" x2="2.54" y2="0.635" width="0.1524" layer="21"/>
<wire x1="2.54" y1="0.635" x2="0" y2="0.635" width="0.1524" layer="21"/>
<wire x1="1.27" y1="6.985" x2="1.27" y2="1.27" width="0.762" layer="21"/>
<wire x1="2.54" y1="-1.905" x2="5.08" y2="-1.905" width="0.1524" layer="21"/>
<wire x1="5.08" y1="-1.905" x2="5.08" y2="0.635" width="0.1524" layer="21"/>
<wire x1="5.08" y1="0.635" x2="2.54" y2="0.635" width="0.1524" layer="21"/>
<wire x1="3.81" y1="6.985" x2="3.81" y2="1.27" width="0.762" layer="21"/>
<pad name="1" x="-3.81" y="-3.81" drill="1.016" shape="long" rot="R90"/>
<pad name="2" x="-1.27" y="-3.81" drill="1.016" shape="long" rot="R90"/>
<pad name="3" x="1.27" y="-3.81" drill="1.016" shape="long" rot="R90"/>
<pad name="4" x="3.81" y="-3.81" drill="1.016" shape="long" rot="R90"/>
<text x="-5.715" y="-3.81" size="1.27" layer="25" ratio="10" rot="R90">&gt;NAME</text>
<text x="6.985" y="-4.445" size="1.27" layer="27" rot="R90">&gt;VALUE</text>
<rectangle x1="-4.191" y1="0.635" x2="-3.429" y2="1.143" layer="21"/>
<rectangle x1="-1.651" y1="0.635" x2="-0.889" y2="1.143" layer="21"/>
<rectangle x1="0.889" y1="0.635" x2="1.651" y2="1.143" layer="21"/>
<rectangle x1="3.429" y1="0.635" x2="4.191" y2="1.143" layer="21"/>
<rectangle x1="-4.191" y1="-2.921" x2="-3.429" y2="-1.905" layer="21"/>
<rectangle x1="-1.651" y1="-2.921" x2="-0.889" y2="-1.905" layer="21"/>
<rectangle x1="0.889" y1="-2.921" x2="1.651" y2="-1.905" layer="21"/>
<rectangle x1="3.429" y1="-2.921" x2="4.191" y2="-1.905" layer="21"/>
</package>
<package name="1X03">
<description>&lt;b&gt;PIN HEADER&lt;/b&gt;</description>
<wire x1="-3.175" y1="1.27" x2="-1.905" y2="1.27" width="0.1524" layer="21"/>
<wire x1="-1.905" y1="1.27" x2="-1.27" y2="0.635" width="0.1524" layer="21"/>
<wire x1="-1.27" y1="0.635" x2="-1.27" y2="-0.635" width="0.1524" layer="21"/>
<wire x1="-1.27" y1="-0.635" x2="-1.905" y2="-1.27" width="0.1524" layer="21"/>
<wire x1="-1.27" y1="0.635" x2="-0.635" y2="1.27" width="0.1524" layer="21"/>
<wire x1="-0.635" y1="1.27" x2="0.635" y2="1.27" width="0.1524" layer="21"/>
<wire x1="0.635" y1="1.27" x2="1.27" y2="0.635" width="0.1524" layer="21"/>
<wire x1="1.27" y1="0.635" x2="1.27" y2="-0.635" width="0.1524" layer="21"/>
<wire x1="1.27" y1="-0.635" x2="0.635" y2="-1.27" width="0.1524" layer="21"/>
<wire x1="0.635" y1="-1.27" x2="-0.635" y2="-1.27" width="0.1524" layer="21"/>
<wire x1="-0.635" y1="-1.27" x2="-1.27" y2="-0.635" width="0.1524" layer="21"/>
<wire x1="-3.81" y1="0.635" x2="-3.81" y2="-0.635" width="0.1524" layer="21"/>
<wire x1="-3.175" y1="1.27" x2="-3.81" y2="0.635" width="0.1524" layer="21"/>
<wire x1="-3.81" y1="-0.635" x2="-3.175" y2="-1.27" width="0.1524" layer="21"/>
<wire x1="-1.905" y1="-1.27" x2="-3.175" y2="-1.27" width="0.1524" layer="21"/>
<wire x1="1.27" y1="0.635" x2="1.905" y2="1.27" width="0.1524" layer="21"/>
<wire x1="1.905" y1="1.27" x2="3.175" y2="1.27" width="0.1524" layer="21"/>
<wire x1="3.175" y1="1.27" x2="3.81" y2="0.635" width="0.1524" layer="21"/>
<wire x1="3.81" y1="0.635" x2="3.81" y2="-0.635" width="0.1524" layer="21"/>
<wire x1="3.81" y1="-0.635" x2="3.175" y2="-1.27" width="0.1524" layer="21"/>
<wire x1="3.175" y1="-1.27" x2="1.905" y2="-1.27" width="0.1524" layer="21"/>
<wire x1="1.905" y1="-1.27" x2="1.27" y2="-0.635" width="0.1524" layer="21"/>
<pad name="1" x="-2.54" y="0" drill="1.016" shape="long" rot="R90"/>
<pad name="2" x="0" y="0" drill="1.016" shape="long" rot="R90"/>
<pad name="3" x="2.54" y="0" drill="1.016" shape="long" rot="R90"/>
<text x="-3.8862" y="1.8288" size="1.27" layer="25" ratio="10">&gt;NAME</text>
<text x="-3.81" y="-3.175" size="1.27" layer="27">&gt;VALUE</text>
<rectangle x1="-0.254" y1="-0.254" x2="0.254" y2="0.254" layer="51"/>
<rectangle x1="-2.794" y1="-0.254" x2="-2.286" y2="0.254" layer="51"/>
<rectangle x1="2.286" y1="-0.254" x2="2.794" y2="0.254" layer="51"/>
</package>
<package name="1X03/90">
<description>&lt;b&gt;PIN HEADER&lt;/b&gt;</description>
<wire x1="-3.81" y1="-1.905" x2="-1.27" y2="-1.905" width="0.1524" layer="21"/>
<wire x1="-1.27" y1="-1.905" x2="-1.27" y2="0.635" width="0.1524" layer="21"/>
<wire x1="-1.27" y1="0.635" x2="-3.81" y2="0.635" width="0.1524" layer="21"/>
<wire x1="-3.81" y1="0.635" x2="-3.81" y2="-1.905" width="0.1524" layer="21"/>
<wire x1="-2.54" y1="6.985" x2="-2.54" y2="1.27" width="0.762" layer="21"/>
<wire x1="-1.27" y1="-1.905" x2="1.27" y2="-1.905" width="0.1524" layer="21"/>
<wire x1="1.27" y1="-1.905" x2="1.27" y2="0.635" width="0.1524" layer="21"/>
<wire x1="1.27" y1="0.635" x2="-1.27" y2="0.635" width="0.1524" layer="21"/>
<wire x1="0" y1="6.985" x2="0" y2="1.27" width="0.762" layer="21"/>
<wire x1="1.27" y1="-1.905" x2="3.81" y2="-1.905" width="0.1524" layer="21"/>
<wire x1="3.81" y1="-1.905" x2="3.81" y2="0.635" width="0.1524" layer="21"/>
<wire x1="3.81" y1="0.635" x2="1.27" y2="0.635" width="0.1524" layer="21"/>
<wire x1="2.54" y1="6.985" x2="2.54" y2="1.27" width="0.762" layer="21"/>
<pad name="1" x="-2.54" y="-3.81" drill="1.016" shape="long" rot="R90"/>
<pad name="2" x="0" y="-3.81" drill="1.016" shape="long" rot="R90"/>
<pad name="3" x="2.54" y="-3.81" drill="1.016" shape="long" rot="R90"/>
<text x="-4.445" y="-3.81" size="1.27" layer="25" ratio="10" rot="R90">&gt;NAME</text>
<text x="5.715" y="-3.81" size="1.27" layer="27" rot="R90">&gt;VALUE</text>
<rectangle x1="-2.921" y1="0.635" x2="-2.159" y2="1.143" layer="21"/>
<rectangle x1="-0.381" y1="0.635" x2="0.381" y2="1.143" layer="21"/>
<rectangle x1="2.159" y1="0.635" x2="2.921" y2="1.143" layer="21"/>
<rectangle x1="-2.921" y1="-2.921" x2="-2.159" y2="-1.905" layer="21"/>
<rectangle x1="-0.381" y1="-2.921" x2="0.381" y2="-1.905" layer="21"/>
<rectangle x1="2.159" y1="-2.921" x2="2.921" y2="-1.905" layer="21"/>
</package>
<package name="1X02">
<description>&lt;b&gt;PIN HEADER&lt;/b&gt;</description>
<wire x1="-1.905" y1="1.27" x2="-0.635" y2="1.27" width="0.1524" layer="21"/>
<wire x1="-0.635" y1="1.27" x2="0" y2="0.635" width="0.1524" layer="21"/>
<wire x1="0" y1="0.635" x2="0" y2="-0.635" width="0.1524" layer="21"/>
<wire x1="0" y1="-0.635" x2="-0.635" y2="-1.27" width="0.1524" layer="21"/>
<wire x1="-2.54" y1="0.635" x2="-2.54" y2="-0.635" width="0.1524" layer="21"/>
<wire x1="-1.905" y1="1.27" x2="-2.54" y2="0.635" width="0.1524" layer="21"/>
<wire x1="-2.54" y1="-0.635" x2="-1.905" y2="-1.27" width="0.1524" layer="21"/>
<wire x1="-0.635" y1="-1.27" x2="-1.905" y2="-1.27" width="0.1524" layer="21"/>
<wire x1="0" y1="0.635" x2="0.635" y2="1.27" width="0.1524" layer="21"/>
<wire x1="0.635" y1="1.27" x2="1.905" y2="1.27" width="0.1524" layer="21"/>
<wire x1="1.905" y1="1.27" x2="2.54" y2="0.635" width="0.1524" layer="21"/>
<wire x1="2.54" y1="0.635" x2="2.54" y2="-0.635" width="0.1524" layer="21"/>
<wire x1="2.54" y1="-0.635" x2="1.905" y2="-1.27" width="0.1524" layer="21"/>
<wire x1="1.905" y1="-1.27" x2="0.635" y2="-1.27" width="0.1524" layer="21"/>
<wire x1="0.635" y1="-1.27" x2="0" y2="-0.635" width="0.1524" layer="21"/>
<pad name="1" x="-1.27" y="0" drill="1.016" shape="long" rot="R90"/>
<pad name="2" x="1.27" y="0" drill="1.016" shape="long" rot="R90"/>
<text x="-2.54" y="-3.175" size="1.27" layer="27">&gt;VALUE</text>
<rectangle x1="-1.524" y1="-0.254" x2="-1.016" y2="0.254" layer="51"/>
<rectangle x1="1.016" y1="-0.254" x2="1.524" y2="0.254" layer="51"/>
</package>
<package name="1X02/90">
<description>&lt;b&gt;PIN HEADER&lt;/b&gt;</description>
<wire x1="-2.54" y1="-1.905" x2="0" y2="-1.905" width="0.1524" layer="21"/>
<wire x1="0" y1="-1.905" x2="0" y2="0.635" width="0.1524" layer="21"/>
<wire x1="0" y1="0.635" x2="-2.54" y2="0.635" width="0.1524" layer="21"/>
<wire x1="-2.54" y1="0.635" x2="-2.54" y2="-1.905" width="0.1524" layer="21"/>
<wire x1="-1.27" y1="6.985" x2="-1.27" y2="1.27" width="0.762" layer="21"/>
<wire x1="0" y1="-1.905" x2="2.54" y2="-1.905" width="0.1524" layer="21"/>
<wire x1="2.54" y1="-1.905" x2="2.54" y2="0.635" width="0.1524" layer="21"/>
<wire x1="2.54" y1="0.635" x2="0" y2="0.635" width="0.1524" layer="21"/>
<wire x1="1.27" y1="6.985" x2="1.27" y2="1.27" width="0.762" layer="21"/>
<pad name="1" x="-1.27" y="-3.81" drill="1.016" shape="long" rot="R90"/>
<pad name="2" x="1.27" y="-3.81" drill="1.016" shape="long" rot="R90"/>
<text x="-3.175" y="-3.81" size="1.27" layer="25" ratio="10" rot="R90">&gt;NAME</text>
<text x="4.445" y="-3.81" size="1.27" layer="27" rot="R90">&gt;VALUE</text>
<rectangle x1="-1.651" y1="0.635" x2="-0.889" y2="1.143" layer="21"/>
<rectangle x1="0.889" y1="0.635" x2="1.651" y2="1.143" layer="21"/>
<rectangle x1="-1.651" y1="-2.921" x2="-0.889" y2="-1.905" layer="21"/>
<rectangle x1="0.889" y1="-2.921" x2="1.651" y2="-1.905" layer="21"/>
</package>
</packages>
<symbols>
<symbol name="PINHD4">
<wire x1="-6.35" y1="-5.08" x2="1.27" y2="-5.08" width="0.4064" layer="94"/>
<wire x1="1.27" y1="-5.08" x2="1.27" y2="7.62" width="0.4064" layer="94"/>
<wire x1="1.27" y1="7.62" x2="-6.35" y2="7.62" width="0.4064" layer="94"/>
<wire x1="-6.35" y1="7.62" x2="-6.35" y2="-5.08" width="0.4064" layer="94"/>
<text x="-6.35" y="8.255" size="1.778" layer="95">&gt;NAME</text>
<text x="-6.35" y="-7.62" size="1.778" layer="96">&gt;VALUE</text>
<pin name="1" x="-2.54" y="5.08" visible="pad" length="short" direction="pas" function="dot"/>
<pin name="2" x="-2.54" y="2.54" visible="pad" length="short" direction="pas" function="dot"/>
<pin name="3" x="-2.54" y="0" visible="pad" length="short" direction="pas" function="dot"/>
<pin name="4" x="-2.54" y="-2.54" visible="pad" length="short" direction="pas" function="dot"/>
</symbol>
<symbol name="PINHD3">
<wire x1="-6.35" y1="-5.08" x2="1.27" y2="-5.08" width="0.4064" layer="94"/>
<wire x1="1.27" y1="-5.08" x2="1.27" y2="5.08" width="0.4064" layer="94"/>
<wire x1="1.27" y1="5.08" x2="-6.35" y2="5.08" width="0.4064" layer="94"/>
<wire x1="-6.35" y1="5.08" x2="-6.35" y2="-5.08" width="0.4064" layer="94"/>
<text x="-6.35" y="5.715" size="1.778" layer="95">&gt;NAME</text>
<text x="-6.35" y="-7.62" size="1.778" layer="96">&gt;VALUE</text>
<pin name="1" x="-2.54" y="2.54" visible="pad" length="short" direction="pas" function="dot"/>
<pin name="2" x="-2.54" y="0" visible="pad" length="short" direction="pas" function="dot"/>
<pin name="3" x="-2.54" y="-2.54" visible="pad" length="short" direction="pas" function="dot"/>
</symbol>
<symbol name="PINHD2">
<wire x1="-6.35" y1="-2.54" x2="1.27" y2="-2.54" width="0.4064" layer="94"/>
<wire x1="1.27" y1="-2.54" x2="1.27" y2="5.08" width="0.4064" layer="94"/>
<wire x1="1.27" y1="5.08" x2="-6.35" y2="5.08" width="0.4064" layer="94"/>
<wire x1="-6.35" y1="5.08" x2="-6.35" y2="-2.54" width="0.4064" layer="94"/>
<text x="-6.35" y="5.715" size="1.778" layer="95">&gt;NAME</text>
<text x="-6.35" y="-5.08" size="1.778" layer="96">&gt;VALUE</text>
<pin name="1" x="-2.54" y="2.54" visible="pad" length="short" direction="pas" function="dot"/>
<pin name="2" x="-2.54" y="0" visible="pad" length="short" direction="pas" function="dot"/>
</symbol>
</symbols>
<devicesets>
<deviceset name="PINHD-1X4" prefix="JP" uservalue="yes">
<description>&lt;b&gt;PIN HEADER&lt;/b&gt;</description>
<gates>
<gate name="A" symbol="PINHD4" x="0" y="0"/>
</gates>
<devices>
<device name="" package="1X04">
<connects>
<connect gate="A" pin="1" pad="1"/>
<connect gate="A" pin="2" pad="2"/>
<connect gate="A" pin="3" pad="3"/>
<connect gate="A" pin="4" pad="4"/>
</connects>
<technologies>
<technology name=""/>
</technologies>
</device>
<device name="/90" package="1X04/90">
<connects>
<connect gate="A" pin="1" pad="1"/>
<connect gate="A" pin="2" pad="2"/>
<connect gate="A" pin="3" pad="3"/>
<connect gate="A" pin="4" pad="4"/>
</connects>
<technologies>
<technology name=""/>
</technologies>
</device>
</devices>
</deviceset>
<deviceset name="PINHD-1X3" prefix="JP" uservalue="yes">
<description>&lt;b&gt;PIN HEADER&lt;/b&gt;</description>
<gates>
<gate name="A" symbol="PINHD3" x="0" y="0"/>
</gates>
<devices>
<device name="" package="1X03">
<connects>
<connect gate="A" pin="1" pad="1"/>
<connect gate="A" pin="2" pad="2"/>
<connect gate="A" pin="3" pad="3"/>
</connects>
<technologies>
<technology name=""/>
</technologies>
</device>
<device name="/90" package="1X03/90">
<connects>
<connect gate="A" pin="1" pad="1"/>
<connect gate="A" pin="2" pad="2"/>
<connect gate="A" pin="3" pad="3"/>
</connects>
<technologies>
<technology name=""/>
</technologies>
</device>
</devices>
</deviceset>
<deviceset name="PINHD-1X2" prefix="JP" uservalue="yes">
<description>&lt;b&gt;PIN HEADER&lt;/b&gt;</description>
<gates>
<gate name="G$1" symbol="PINHD2" x="0" y="0"/>
</gates>
<devices>
<device name="" package="1X02">
<connects>
<connect gate="G$1" pin="1" pad="1"/>
<connect gate="G$1" pin="2" pad="2"/>
</connects>
<technologies>
<technology name=""/>
</technologies>
</device>
<device name="/90" package="1X02/90">
<connects>
<connect gate="G$1" pin="1" pad="1"/>
<connect gate="G$1" pin="2" pad="2"/>
</connects>
<technologies>
<technology name=""/>
</technologies>
</device>
</devices>
</deviceset>
</devicesets>
</library>
<library name="supply1">
<description>&lt;b&gt;Supply Symbols&lt;/b&gt;&lt;p&gt;
 GND, VCC, 0V, +5V, -5V, etc.&lt;p&gt;
 Please keep in mind, that these devices are necessary for the
 automatic wiring of the supply signals.&lt;p&gt;
 The pin name defined in the symbol is identical to the net which is to be wired automatically.&lt;p&gt;
 In this library the device names are the same as the pin names of the symbols, therefore the correct signal names appear next to the supply symbols in the schematic.&lt;p&gt;
 &lt;author&gt;Created by librarian@cadsoft.de&lt;/author&gt;</description>
<packages>
</packages>
<symbols>
<symbol name="+5V">
<wire x1="1.27" y1="-1.905" x2="0" y2="0" width="0.254" layer="94"/>
<wire x1="0" y1="0" x2="-1.27" y2="-1.905" width="0.254" layer="94"/>
<text x="-2.54" y="-5.08" size="1.778" layer="96" rot="R90">&gt;VALUE</text>
<pin name="+5V" x="0" y="-2.54" visible="off" length="short" direction="sup" rot="R90"/>
</symbol>
<symbol name="GND">
<wire x1="-1.905" y1="0" x2="1.905" y2="0" width="0.254" layer="94"/>
<text x="-2.54" y="-2.54" size="1.778" layer="96">&gt;VALUE</text>
<pin name="GND" x="0" y="2.54" visible="off" length="short" direction="sup" rot="R270"/>
</symbol>
<symbol name="0V">
<wire x1="-1.905" y1="0" x2="1.905" y2="0" width="0.254" layer="94"/>
<text x="-1.905" y="-2.54" size="1.778" layer="96">&gt;VALUE</text>
<pin name="0V" x="0" y="2.54" visible="off" length="short" direction="sup" rot="R270"/>
</symbol>
</symbols>
<devicesets>
<deviceset name="+5V" prefix="P+">
<description>&lt;b&gt;SUPPLY SYMBOL&lt;/b&gt;</description>
<gates>
<gate name="1" symbol="+5V" x="0" y="0"/>
</gates>
<devices>
<device name="">
<technologies>
<technology name=""/>
</technologies>
</device>
</devices>
</deviceset>
<deviceset name="GND" prefix="GND">
<description>&lt;b&gt;SUPPLY SYMBOL&lt;/b&gt;</description>
<gates>
<gate name="1" symbol="GND" x="0" y="0"/>
</gates>
<devices>
<device name="">
<technologies>
<technology name=""/>
</technologies>
</device>
</devices>
</deviceset>
<deviceset name="0V" prefix="GND">
<description>&lt;b&gt;SUPPLY SYMBOL&lt;/b&gt;</description>
<gates>
<gate name="1" symbol="0V" x="0" y="0"/>
</gates>
<devices>
<device name="">
<technologies>
<technology name=""/>
</technologies>
</device>
</devices>
</deviceset>
</devicesets>
</library>
<library name="EasyDriver">
<packages>
<package name="EASYDRIVER_V44">
<wire x1="-24.13" y1="-10.16" x2="24.13" y2="-10.16" width="0.254" layer="21"/>
<wire x1="24.13" y1="-10.16" x2="24.13" y2="10.16" width="0.254" layer="21"/>
<wire x1="-24.13" y1="10.16" x2="-24.13" y2="-10.16" width="0.254" layer="21"/>
<wire x1="-16.51" y1="9.398" x2="-15.875" y2="9.398" width="0.2032" layer="21"/>
<wire x1="-16.51" y1="9.398" x2="-16.51" y2="8.763" width="0.2032" layer="21"/>
<wire x1="-13.97" y1="9.398" x2="-14.605" y2="9.398" width="0.2032" layer="21"/>
<wire x1="-13.97" y1="9.398" x2="-13.97" y2="8.763" width="0.2032" layer="21"/>
<wire x1="-10.795" y1="9.398" x2="-11.43" y2="9.398" width="0.2032" layer="21"/>
<wire x1="-11.43" y1="9.398" x2="-11.43" y2="8.763" width="0.2032" layer="21"/>
<wire x1="-8.89" y1="9.398" x2="-9.525" y2="9.398" width="0.2032" layer="21"/>
<wire x1="-8.89" y1="9.398" x2="-8.89" y2="8.763" width="0.2032" layer="21"/>
<wire x1="24.13" y1="10.16" x2="-24.13" y2="10.16" width="0.254" layer="21"/>
<wire x1="19.05" y1="6.477" x2="19.05" y2="5.842" width="0.2032" layer="21"/>
<wire x1="21.59" y1="6.477" x2="21.59" y2="5.842" width="0.2032" layer="21"/>
<wire x1="21.59" y1="5.842" x2="19.05" y2="5.842" width="0.2032" layer="21"/>
<wire x1="-16.51" y1="6.35" x2="-16.51" y2="5.842" width="0.254" layer="21"/>
<wire x1="-16.51" y1="5.842" x2="-8.89" y2="5.842" width="0.254" layer="21"/>
<wire x1="-8.89" y1="5.842" x2="-8.89" y2="6.35" width="0.254" layer="21"/>
<pad name="B1" x="-8.89" y="7.62" drill="1.016" diameter="1.8796"/>
<pad name="B2" x="-11.43" y="7.62" drill="1.016" diameter="1.8796"/>
<pad name="A2" x="-13.97" y="7.62" drill="1.016" diameter="1.8796"/>
<pad name="A1" x="-16.51" y="7.62" drill="1.016" diameter="1.8796"/>
<pad name="M+" x="21.59" y="7.62" drill="1.016" diameter="1.8796"/>
<pad name="GND1" x="19.05" y="7.62" drill="1.016" diameter="1.8796"/>
<pad name="DIR" x="21.59" y="-7.62" drill="1.016" diameter="1.8796"/>
<pad name="STEP" x="19.05" y="-7.62" drill="1.016" diameter="1.8796"/>
<pad name="GND2" x="16.51" y="-7.62" drill="1.016" diameter="1.8796"/>
<pad name="GND3" x="-16.51" y="-7.62" drill="1.016" diameter="1.8796"/>
<pad name="P$11" x="-13.97" y="-7.62" drill="1.016" diameter="1.8796"/>
<pad name="SLEEP" x="-3.81" y="-7.62" drill="1.016" diameter="1.8796"/>
<pad name="MS1" x="-1.27" y="-7.62" drill="1.016" diameter="1.8796"/>
<pad name="MS2" x="11.43" y="7.62" drill="1.016" diameter="1.8796"/>
<pad name="ENABLE" x="8.89" y="7.62" drill="1.016" diameter="1.8796"/>
<pad name="RST" x="-1.27" y="7.62" drill="1.016" diameter="1.8796"/>
<pad name="PFD" x="-3.81" y="7.62" drill="1.016" diameter="1.8796"/>
<text x="20.701" y="-9.652" size="0.8128" layer="21" font="vector" ratio="18">DIR</text>
<text x="18.034" y="8.89" size="0.8128" layer="21" font="vector" ratio="18">GND</text>
<text x="21.082" y="8.89" size="0.8128" layer="21" font="vector" ratio="18">M+</text>
<text x="17.78" y="-6.35" size="0.8128" layer="21" font="vector" ratio="18">STEP</text>
<text x="-14.986" y="4.445" size="1.016" layer="21" font="vector" ratio="18">MOTOR</text>
<text x="-15.494" y="8.89" size="0.8128" layer="21" font="vector" ratio="18">A</text>
<text x="-10.414" y="8.89" size="0.8128" layer="21" font="vector" ratio="18">B</text>
<text x="-17.526" y="-9.652" size="0.8128" layer="21" font="vector" ratio="18">GND</text>
<text x="-15.113" y="-9.652" size="0.8128" layer="21" font="vector" ratio="18">+5V</text>
<text x="15.494" y="-9.652" size="0.8128" layer="21" font="vector" ratio="18">GND</text>
<text x="-2.286" y="-9.652" size="0.8128" layer="21" font="vector" ratio="18">MS1</text>
<text x="-4.826" y="-9.652" size="0.8128" layer="21" font="vector" ratio="18">SLP</text>
<text x="-4.826" y="8.89" size="0.8128" layer="21" font="vector" ratio="18">PFD</text>
<text x="-2.286" y="8.89" size="0.8128" layer="21" font="vector" ratio="18">RST</text>
<text x="5.588" y="8.89" size="0.8128" layer="21" font="vector" ratio="18">ENABLE</text>
<text x="10.414" y="8.89" size="0.8128" layer="21" font="vector" ratio="18">MS2</text>
<text x="18.288" y="4.699" size="0.8128" layer="21" font="vector" ratio="18">PWR IN</text>
<text x="-24.13" y="-12.7" size="1.27" layer="27">&gt;VALUE</text>
<text x="-24.13" y="11.43" size="1.27" layer="25">&gt;NAME</text>
</package>
</packages>
<symbols>
<symbol name="EASYDRIVER_V44">
<wire x1="-17.78" y1="12.7" x2="-17.78" y2="-10.16" width="0.254" layer="94"/>
<wire x1="-17.78" y1="-10.16" x2="20.32" y2="-10.16" width="0.254" layer="94"/>
<wire x1="20.32" y1="-10.16" x2="20.32" y2="12.7" width="0.254" layer="94"/>
<wire x1="20.32" y1="12.7" x2="-17.78" y2="12.7" width="0.254" layer="94"/>
<text x="22.86" y="-2.54" size="1.27" layer="96">&gt;VALUE</text>
<text x="22.86" y="2.54" size="1.27" layer="95">&gt;NAME</text>
<pin name="A1" x="-15.24" y="15.24" visible="pin" length="short" rot="R270"/>
<pin name="A2" x="-12.7" y="15.24" visible="pin" length="short" rot="R270"/>
<pin name="B2" x="-10.16" y="15.24" visible="pin" length="short" rot="R270"/>
<pin name="B1" x="-7.62" y="15.24" visible="pin" length="short" rot="R270"/>
<pin name="PFD" x="0" y="15.24" visible="pin" length="short" rot="R270"/>
<pin name="RST" x="2.54" y="15.24" visible="pin" length="short" rot="R270"/>
<pin name="ENABLE" x="7.62" y="15.24" visible="pin" length="short" rot="R270"/>
<pin name="MS2" x="10.16" y="15.24" visible="pin" length="short" rot="R270"/>
<pin name="GND1" x="15.24" y="15.24" visible="pin" length="short" rot="R270"/>
<pin name="M+" x="17.78" y="15.24" visible="pin" length="short" rot="R270"/>
<pin name="DIR" x="17.78" y="-12.7" visible="pin" length="short" rot="R90"/>
<pin name="STEP" x="15.24" y="-12.7" visible="pin" length="short" rot="R90"/>
<pin name="GND2" x="12.7" y="-12.7" visible="pin" length="short" rot="R90"/>
<pin name="MS1" x="2.54" y="-12.7" visible="pin" length="short" rot="R90"/>
<pin name="SLP" x="0" y="-12.7" visible="pin" length="short" rot="R90"/>
<pin name="+5V_OUT" x="-12.7" y="-12.7" visible="pin" length="short" rot="R90"/>
<pin name="GND3" x="-15.24" y="-12.7" visible="pin" length="short" rot="R90"/>
</symbol>
</symbols>
<devicesets>
<deviceset name="EASYDRIVER_V44">
<description>EasyDriver version 4.4 - http://www.schmalzhaus.com/EasyDriver</description>
<gates>
<gate name="G$1" symbol="EASYDRIVER_V44" x="-2.54" y="0"/>
</gates>
<devices>
<device name="" package="EASYDRIVER_V44">
<connects>
<connect gate="G$1" pin="+5V_OUT" pad="P$11"/>
<connect gate="G$1" pin="A1" pad="A1"/>
<connect gate="G$1" pin="A2" pad="A2"/>
<connect gate="G$1" pin="B1" pad="B1"/>
<connect gate="G$1" pin="B2" pad="B2"/>
<connect gate="G$1" pin="DIR" pad="DIR"/>
<connect gate="G$1" pin="ENABLE" pad="ENABLE"/>
<connect gate="G$1" pin="GND1" pad="GND1"/>
<connect gate="G$1" pin="GND2" pad="GND2"/>
<connect gate="G$1" pin="GND3" pad="GND3"/>
<connect gate="G$1" pin="M+" pad="M+"/>
<connect gate="G$1" pin="MS1" pad="MS1"/>
<connect gate="G$1" pin="MS2" pad="MS2"/>
<connect gate="G$1" pin="PFD" pad="PFD"/>
<connect gate="G$1" pin="RST" pad="RST"/>
<connect gate="G$1" pin="SLP" pad="SLEEP"/>
<connect gate="G$1" pin="STEP" pad="STEP"/>
</connects>
<technologies>
<technology name=""/>
</technologies>
</device>
</devices>
</deviceset>
</devicesets>
</library>
</libraries>
<attributes>
</attributes>
<variantdefs>
</variantdefs>
<classes>
<class number="0" name="default" width="0" drill="0">
</class>
</classes>
<parts>
<part name="JP2" library="pinhead" deviceset="PINHD-1X3" device=""/>
<part name="GND3" library="supply1" deviceset="GND" device=""/>
<part name="JP3" library="pinhead" deviceset="PINHD-1X2" device=""/>
<part name="P+3" library="supply1" deviceset="+5V" device=""/>
<part name="GND4" library="supply1" deviceset="GND" device=""/>
<part name="JP4" library="pinhead" deviceset="PINHD-1X4" device=""/>
<part name="JP6" library="pinhead" deviceset="PINHD-1X2" device=""/>
<part name="JP9" library="pinhead" deviceset="PINHD-1X2" device=""/>
<part name="JP10" library="pinhead" deviceset="PINHD-1X2" device=""/>
<part name="GND1" library="supply1" deviceset="GND" device=""/>
<part name="GND2" library="supply1" deviceset="GND" device=""/>
<part name="M1" library="EasyDriver" deviceset="EASYDRIVER_V44" device=""/>
<part name="GND5" library="supply1" deviceset="GND" device=""/>
<part name="P+1" library="supply1" deviceset="+5V" device=""/>
<part name="GND6" library="supply1" deviceset="GND" device=""/>
<part name="GND7" library="supply1" deviceset="0V" device=""/>
<part name="GND8" library="supply1" deviceset="0V" device=""/>
</parts>
<sheets>
<sheet>
<plain>
</plain>
<instances>
<instance part="JP2" gate="A" x="5.08" y="12.7" rot="MR0"/>
<instance part="GND3" gate="1" x="15.24" y="5.08" rot="MR0"/>
<instance part="JP3" gate="G$1" x="5.08" y="53.34" rot="MR0"/>
<instance part="P+3" gate="1" x="15.24" y="60.96" rot="MR0"/>
<instance part="GND4" gate="1" x="15.24" y="48.26"/>
<instance part="JP4" gate="A" x="71.12" y="50.8"/>
<instance part="JP6" gate="G$1" x="86.36" y="10.16"/>
<instance part="JP9" gate="G$1" x="5.08" y="35.56" rot="MR0"/>
<instance part="JP10" gate="G$1" x="86.36" y="27.94"/>
<instance part="GND1" gate="1" x="76.2" y="22.86" rot="MR0"/>
<instance part="GND2" gate="1" x="15.24" y="30.48"/>
<instance part="M1" gate="G$1" x="43.18" y="40.64" rot="R270"/>
<instance part="GND5" gate="1" x="27.94" y="17.78"/>
<instance part="P+1" gate="1" x="22.86" y="53.34" rot="MR270"/>
<instance part="GND6" gate="1" x="27.94" y="48.26"/>
<instance part="GND7" gate="1" x="60.96" y="17.78"/>
<instance part="GND8" gate="1" x="76.2" y="5.08"/>
</instances>
<busses>
</busses>
<nets>
<net name="+5V" class="0">
<segment>
<pinref part="JP3" gate="G$1" pin="1"/>
<pinref part="P+3" gate="1" pin="+5V"/>
<wire x1="15.24" y1="58.42" x2="15.24" y2="55.88" width="0.1524" layer="91"/>
<wire x1="15.24" y1="55.88" x2="7.62" y2="55.88" width="0.1524" layer="91"/>
</segment>
<segment>
<pinref part="M1" gate="G$1" pin="+5V_OUT"/>
<pinref part="P+1" gate="1" pin="+5V"/>
<wire x1="30.48" y1="53.34" x2="25.4" y2="53.34" width="0.1524" layer="91"/>
</segment>
</net>
<net name="GND" class="0">
<segment>
<pinref part="JP2" gate="A" pin="3"/>
<pinref part="GND3" gate="1" pin="GND"/>
<wire x1="7.62" y1="10.16" x2="15.24" y2="10.16" width="0.1524" layer="91"/>
<wire x1="15.24" y1="10.16" x2="15.24" y2="7.62" width="0.1524" layer="91"/>
</segment>
<segment>
<pinref part="JP3" gate="G$1" pin="2"/>
<pinref part="GND4" gate="1" pin="GND"/>
<wire x1="7.62" y1="53.34" x2="15.24" y2="53.34" width="0.1524" layer="91"/>
<wire x1="15.24" y1="53.34" x2="15.24" y2="50.8" width="0.1524" layer="91"/>
</segment>
<segment>
<pinref part="JP10" gate="G$1" pin="2"/>
<pinref part="GND1" gate="1" pin="GND"/>
<wire x1="83.82" y1="27.94" x2="76.2" y2="27.94" width="0.1524" layer="91"/>
<wire x1="76.2" y1="27.94" x2="76.2" y2="25.4" width="0.1524" layer="91"/>
</segment>
<segment>
<pinref part="JP9" gate="G$1" pin="2"/>
<pinref part="GND2" gate="1" pin="GND"/>
<wire x1="7.62" y1="35.56" x2="15.24" y2="35.56" width="0.1524" layer="91"/>
<wire x1="15.24" y1="35.56" x2="15.24" y2="33.02" width="0.1524" layer="91"/>
</segment>
<segment>
<pinref part="M1" gate="G$1" pin="GND2"/>
<pinref part="GND5" gate="1" pin="GND"/>
<wire x1="30.48" y1="27.94" x2="27.94" y2="27.94" width="0.1524" layer="91"/>
<wire x1="27.94" y1="27.94" x2="27.94" y2="20.32" width="0.1524" layer="91"/>
</segment>
<segment>
<pinref part="M1" gate="G$1" pin="GND3"/>
<pinref part="GND6" gate="1" pin="GND"/>
<wire x1="30.48" y1="55.88" x2="27.94" y2="55.88" width="0.1524" layer="91"/>
<wire x1="27.94" y1="55.88" x2="27.94" y2="50.8" width="0.1524" layer="91"/>
</segment>
</net>
<net name="DIR" class="0">
<segment>
<pinref part="JP2" gate="A" pin="1"/>
<wire x1="20.32" y1="15.24" x2="7.62" y2="15.24" width="0.1524" layer="91"/>
<label x="20.32" y="15.24" size="1.778" layer="95" rot="MR0"/>
</segment>
<segment>
<pinref part="M1" gate="G$1" pin="DIR"/>
<wire x1="22.86" y1="22.86" x2="30.48" y2="22.86" width="0.1524" layer="91"/>
<label x="22.86" y="22.86" size="1.778" layer="95"/>
</segment>
</net>
<net name="STP" class="0">
<segment>
<pinref part="JP2" gate="A" pin="2"/>
<wire x1="20.32" y1="12.7" x2="7.62" y2="12.7" width="0.1524" layer="91"/>
<label x="20.32" y="12.7" size="1.778" layer="95" rot="MR0"/>
</segment>
<segment>
<pinref part="M1" gate="G$1" pin="STEP"/>
<wire x1="22.86" y1="25.4" x2="30.48" y2="25.4" width="0.1524" layer="91"/>
<label x="22.86" y="25.4" size="1.778" layer="95"/>
</segment>
</net>
<net name="MS2" class="0">
<segment>
<pinref part="JP10" gate="G$1" pin="1"/>
<wire x1="83.82" y1="30.48" x2="71.12" y2="30.48" width="0.1524" layer="91"/>
<label x="76.2" y="30.48" size="1.778" layer="95" rot="MR0"/>
</segment>
<segment>
<pinref part="M1" gate="G$1" pin="MS2"/>
<wire x1="68.58" y1="30.48" x2="58.42" y2="30.48" width="0.1524" layer="91"/>
<label x="63.5" y="30.48" size="1.778" layer="95"/>
</segment>
</net>
<net name="MS1" class="0">
<segment>
<pinref part="JP9" gate="G$1" pin="1"/>
<wire x1="20.32" y1="38.1" x2="7.62" y2="38.1" width="0.1524" layer="91"/>
<label x="15.24" y="38.1" size="1.778" layer="95"/>
</segment>
<segment>
<pinref part="M1" gate="G$1" pin="MS1"/>
<wire x1="22.86" y1="38.1" x2="30.48" y2="38.1" width="0.1524" layer="91"/>
<label x="22.86" y="38.1" size="1.778" layer="95"/>
</segment>
</net>
<net name="N$1" class="0">
<segment>
<pinref part="M1" gate="G$1" pin="A1"/>
<pinref part="JP4" gate="A" pin="1"/>
<wire x1="68.58" y1="55.88" x2="58.42" y2="55.88" width="0.1524" layer="91"/>
</segment>
</net>
<net name="N$2" class="0">
<segment>
<pinref part="M1" gate="G$1" pin="A2"/>
<pinref part="JP4" gate="A" pin="2"/>
<wire x1="68.58" y1="53.34" x2="58.42" y2="53.34" width="0.1524" layer="91"/>
</segment>
</net>
<net name="N$3" class="0">
<segment>
<pinref part="M1" gate="G$1" pin="B2"/>
<pinref part="JP4" gate="A" pin="3"/>
<wire x1="68.58" y1="50.8" x2="58.42" y2="50.8" width="0.1524" layer="91"/>
</segment>
</net>
<net name="N$4" class="0">
<segment>
<pinref part="M1" gate="G$1" pin="B1"/>
<pinref part="JP4" gate="A" pin="4"/>
<wire x1="68.58" y1="48.26" x2="58.42" y2="48.26" width="0.1524" layer="91"/>
</segment>
</net>
<net name="M+" class="0">
<segment>
<pinref part="M1" gate="G$1" pin="M+"/>
<wire x1="68.58" y1="22.86" x2="58.42" y2="22.86" width="0.1524" layer="91"/>
<label x="63.5" y="22.86" size="1.778" layer="95"/>
</segment>
<segment>
<pinref part="JP6" gate="G$1" pin="1"/>
<wire x1="71.12" y1="12.7" x2="83.82" y2="12.7" width="0.1524" layer="91"/>
<label x="71.12" y="12.7" size="1.778" layer="95"/>
</segment>
</net>
<net name="0V" class="0">
<segment>
<pinref part="M1" gate="G$1" pin="GND1"/>
<wire x1="58.42" y1="25.4" x2="60.96" y2="25.4" width="0.1524" layer="91"/>
<wire x1="60.96" y1="25.4" x2="60.96" y2="20.32" width="0.1524" layer="91"/>
<pinref part="GND7" gate="1" pin="0V"/>
</segment>
<segment>
<pinref part="JP6" gate="G$1" pin="2"/>
<wire x1="83.82" y1="10.16" x2="76.2" y2="10.16" width="0.1524" layer="91"/>
<wire x1="76.2" y1="10.16" x2="76.2" y2="7.62" width="0.1524" layer="91"/>
<pinref part="GND8" gate="1" pin="0V"/>
</segment>
</net>
</nets>
</sheet>
</sheets>
</schematic>
</drawing>
</eagle>
