,Accuracy,Recall,Precision,F1,Specificity
count,100.0,100.0,100.0,100.0,100.0
mean,0.5485245901639345,0.5148648648648649,0.34017376528177296,0.4049725267373171,0.5631764705882353
std,0.047846912383279636,0.11780025047526065,0.041614005261591064,0.056968325071388846,0.09311190198136615
min,0.4344262295081967,0.2162162162162162,0.2391304347826087,0.2650602409638554,0.4
25%,0.5163934426229508,0.4324324324324324,0.31003134796238246,0.3718532725964996,0.4941176470588235
50%,0.5450819672131149,0.5135135135135135,0.34351679104477606,0.40632882366429723,0.5411764705882353
75%,0.5737704918032787,0.5945945945945946,0.375,0.4408015451472718,0.6352941176470588
max,0.6557377049180327,0.7567567567567568,0.4464285714285714,0.5376344086021506,0.8470588235294118
