Accuracy,Sensitivity,Precision,F1,Specificity,G-Mean
0.8032786885245902,0.8918918918918919,0.6226415094339622,0.7333333333333333,0.7647058823529411,0.8258540888998632
0.8360655737704918,0.7567567567567568,0.717948717948718,0.736842105263158,0.8705882352941177,0.8116794499134279
0.8032786885245902,0.8378378378378378,0.6326530612244898,0.7209302325581396,0.788235294117647,0.8126582027710061
0.7868852459016393,0.7837837837837838,0.6170212765957447,0.6904761904761905,0.788235294117647,0.7860063875920176
0.7786885245901639,0.8918918918918919,0.5892857142857143,0.7096774193548389,0.7294117647058823,0.8065707896965603
0.8360655737704918,0.8378378378378378,0.6888888888888889,0.7560975609756098,0.8352941176470589,0.8365650109155154
0.7540983606557377,0.8918918918918919,0.559322033898305,0.6874999999999999,0.6941176470588235,0.7868150363527903
0.7459016393442623,0.8378378378378378,0.5535714285714286,0.6666666666666666,0.7058823529411765,0.7690350735539445
0.819672131147541,0.8108108108108109,0.6666666666666666,0.7317073170731707,0.8235294117647058,0.8171453665532781
0.819672131147541,0.8648648648648649,0.6530612244897959,0.7441860465116279,0.8,0.8318003918560581
0.7868852459016393,0.7567567567567568,0.6222222222222222,0.6829268292682927,0.8,0.7780780201274198
0.7622950819672131,0.8108108108108109,0.5769230769230769,0.6741573033707865,0.7411764705882353,0.7752121613284599
0.7459016393442623,0.7297297297297297,0.5625,0.6352941176470588,0.7529411764705882,0.7412446028189797
0.8114754098360656,0.8648648648648649,0.64,0.7356321839080459,0.788235294117647,0.8256615596773147
0.7950819672131147,0.8648648648648649,0.6153846153846154,0.7191011235955056,0.7647058823529411,0.8132448890725005
0.819672131147541,0.8918918918918919,0.6470588235294118,0.7499999999999999,0.788235294117647,0.8384632775062663
0.8114754098360656,0.8378378378378378,0.6458333333333334,0.7294117647058824,0.8,0.818700354385089
0.7786885245901639,0.6756756756756757,0.625,0.6493506493506493,0.8235294117647058,0.7459482500367631
0.7868852459016393,0.8918918918918919,0.6,0.7173913043478262,0.7411764705882353,0.8130493740103958
0.7950819672131147,0.8108108108108109,0.625,0.7058823529411764,0.788235294117647,0.7994433675584702
0.7786885245901639,0.8648648648648649,0.5925925925925926,0.7032967032967032,0.7411764705882353,0.800635677494022
0.7868852459016393,0.7837837837837838,0.6170212765957447,0.6904761904761905,0.788235294117647,0.7860063875920176
0.7213114754098361,0.8108108108108109,0.5263157894736842,0.6382978723404256,0.6823529411764706,0.7438139159053396
0.7131147540983607,0.8108108108108109,0.5172413793103449,0.631578947368421,0.6705882352941176,0.7373738473657812
0.819672131147541,0.7297297297297297,0.6923076923076923,0.7105263157894737,0.8588235294117647,0.791649582835221
0.8032786885245902,0.8378378378378378,0.6326530612244898,0.7209302325581396,0.788235294117647,0.8126582027710061
0.7622950819672131,0.7567567567567568,0.5833333333333334,0.6588235294117648,0.7647058823529411,0.7607209366135691
0.8442622950819673,0.918918918918919,0.68,0.7816091954022989,0.8117647058823529,0.8636816230220173
0.7213114754098361,0.6756756756756757,0.5319148936170213,0.5952380952380952,0.7411764705882353,0.7076686460198859
0.7377049180327869,0.8378378378378378,0.543859649122807,0.6595744680851063,0.6941176470588235,0.762599520467232
0.819672131147541,0.8378378378378378,0.6595744680851063,0.7380952380952381,0.8117647058823529,0.824698239363671
0.8360655737704918,0.8648648648648649,0.6808510638297872,0.7619047619047619,0.8235294117647058,0.8439441056243737
0.7540983606557377,0.7027027027027027,0.5777777777777777,0.6341463414634145,0.7764705882352941,0.7386663529104995
0.7459016393442623,0.7837837837837838,0.5576923076923077,0.651685393258427,0.7294117647058823,0.756109193752849
0.8442622950819673,0.9459459459459459,0.6730769230769231,0.7865168539325843,0.8,0.86991767240168
0.7950819672131147,0.918918918918919,0.6071428571428571,0.7311827956989247,0.7411764705882353,0.8252763664864523
0.7622950819672131,0.8378378378378378,0.5740740740740741,0.6813186813186813,0.7294117647058823,0.7817472582840685
0.7868852459016393,0.8378378378378378,0.6078431372549019,0.7045454545454545,0.7647058823529411,0.8004370825070913
0.7950819672131147,0.8108108108108109,0.625,0.7058823529411764,0.788235294117647,0.7994433675584702
0.7786885245901639,0.8378378378378378,0.5961538461538461,0.6966292134831461,0.7529411764705882,0.7942560086730195
0.7622950819672131,0.9459459459459459,0.5645161290322581,0.7070707070707071,0.6823529411764706,0.8034108528083094
0.7868852459016393,0.8918918918918919,0.6,0.7173913043478262,0.7411764705882353,0.8130493740103958
0.8278688524590164,0.918918918918919,0.6538461538461539,0.7640449438202248,0.788235294117647,0.851072455390447
0.7213114754098361,0.8108108108108109,0.5263157894736842,0.6382978723404256,0.6823529411764706,0.7438139159053396
0.8524590163934426,0.8648648648648649,0.7111111111111111,0.7804878048780488,0.8470588235294118,0.8559155419457904
0.8278688524590164,0.7837837837837838,0.6904761904761905,0.7341772151898734,0.8470588235294118,0.8148073206552103
0.7950819672131147,0.7837837837837838,0.6304347826086957,0.6987951807228915,0.8,0.7918503817180536
0.7295081967213115,0.8918918918918919,0.532258064516129,0.6666666666666666,0.6588235294117647,0.7665503010696377
0.8032786885245902,0.7837837837837838,0.6444444444444445,0.7073170731707318,0.8117647058823529,0.7976515609704534
0.7950819672131147,0.7837837837837838,0.6304347826086957,0.6987951807228915,0.8,0.7918503817180536
0.8442622950819673,0.8108108108108109,0.7142857142857143,0.759493670886076,0.8588235294117647,0.8344719301604789
0.8442622950819673,0.8378378378378378,0.7045454545454546,0.7654320987654323,0.8470588235294118,0.8424357145962801
0.7786885245901639,0.7837837837837838,0.6041666666666666,0.6823529411764706,0.7764705882352941,0.7801186163936092
0.8278688524590164,0.8648648648648649,0.6666666666666666,0.7529411764705882,0.8117647058823529,0.8378942490881579
0.8032786885245902,0.8648648648648649,0.6274509803921569,0.7272727272727273,0.7764705882352941,0.8194767418088569
0.7950819672131147,0.8648648648648649,0.6153846153846154,0.7191011235955056,0.7647058823529411,0.8132448890725005
0.8032786885245902,0.8378378378378378,0.6326530612244898,0.7209302325581396,0.788235294117647,0.8126582027710061
0.7295081967213115,0.8378378378378378,0.5344827586206896,0.6526315789473685,0.6823529411764706,0.7561091937528491
0.8032786885245902,0.8918918918918919,0.6226415094339622,0.7333333333333333,0.7647058823529411,0.8258540888998632
0.8032786885245902,0.8378378378378378,0.6326530612244898,0.7209302325581396,0.788235294117647,0.8126582027710061
0.7622950819672131,0.7837837837837838,0.58,0.6666666666666666,0.7529411764705882,0.7682077090609878
0.7950819672131147,0.8648648648648649,0.6153846153846154,0.7191011235955056,0.7647058823529411,0.8132448890725005
0.8278688524590164,0.8918918918918919,0.66,0.7586206896551725,0.8,0.8446972910537321
0.8032786885245902,0.918918918918919,0.6181818181818182,0.7391304347826088,0.7529411764705882,0.8318003918560581
0.819672131147541,0.8918918918918919,0.6470588235294118,0.7499999999999999,0.788235294117647,0.8384632775062663
0.819672131147541,0.8108108108108109,0.6666666666666666,0.7317073170731707,0.8235294117647058,0.8171453665532781
0.8032786885245902,0.7567567567567568,0.6511627906976745,0.7000000000000001,0.8235294117647058,0.7894374242084413
0.819672131147541,0.8918918918918919,0.6470588235294118,0.7499999999999999,0.788235294117647,0.8384632775062663
0.860655737704918,0.918918918918919,0.7083333333333334,0.8000000000000002,0.8352941176470589,0.8761093353957413
0.7868852459016393,0.8918918918918919,0.6,0.7173913043478262,0.7411764705882353,0.8130493740103958
0.8770491803278688,0.8918918918918919,0.75,0.8148148148148148,0.8705882352941177,0.881175685227012
0.7704918032786885,0.7837837837837838,0.5918367346938775,0.6744186046511628,0.7647058823529411,0.7741860693349534
0.8032786885245902,0.8378378378378378,0.6326530612244898,0.7209302325581396,0.788235294117647,0.8126582027710061
0.8032786885245902,0.7837837837837838,0.6444444444444445,0.7073170731707318,0.8117647058823529,0.7976515609704534
0.8114754098360656,0.8378378378378378,0.6458333333333334,0.7294117647058824,0.8,0.818700354385089
0.7786885245901639,0.918918918918919,0.5862068965517241,0.7157894736842105,0.7176470588235294,0.8120710926141008
0.7131147540983607,0.8648648648648649,0.5161290322580645,0.6464646464646465,0.6470588235294118,0.7480764947325796
0.8032786885245902,0.8108108108108109,0.6382978723404256,0.7142857142857143,0.8,0.8053872662568292
0.7950819672131147,0.7567567567567568,0.6363636363636364,0.691358024691358,0.8117647058823529,0.7837783016090277
0.7704918032786885,0.8918918918918919,0.5789473684210527,0.7021276595744681,0.7176470588235294,0.8000397446407082
0.7704918032786885,0.7837837837837838,0.5918367346938775,0.6744186046511628,0.7647058823529411,0.7741860693349534
0.7950819672131147,0.918918918918919,0.6071428571428571,0.7311827956989247,0.7411764705882353,0.8252763664864523
0.7295081967213115,0.8648648648648649,0.5333333333333333,0.6597938144329898,0.6705882352941176,0.7615564348737494
0.819672131147541,0.8108108108108109,0.6666666666666666,0.7317073170731707,0.8235294117647058,0.8171453665532781
0.860655737704918,0.918918918918919,0.7083333333333334,0.8000000000000002,0.8352941176470589,0.8761093353957413
0.7786885245901639,0.7567567567567568,0.6086956521739131,0.674698795180723,0.788235294117647,0.7723356684354795
0.7786885245901639,0.8108108108108109,0.6,0.6896551724137931,0.7647058823529411,0.7874209779415232
0.8278688524590164,0.9459459459459459,0.6481481481481481,0.7692307692307693,0.7764705882352941,0.8570292906823199
0.7950819672131147,0.7027027027027027,0.65,0.6753246753246753,0.8352941176470589,0.7661353888329775
0.7950819672131147,0.7567567567567568,0.6363636363636364,0.691358024691358,0.8117647058823529,0.7837783016090277
0.7950819672131147,0.7297297297297297,0.6428571428571429,0.6835443037974683,0.8235294117647058,0.7752121613284598
0.8524590163934426,0.8378378378378378,0.7209302325581395,0.7749999999999999,0.8588235294117647,0.848265789105404
0.8114754098360656,0.918918918918919,0.6296296296296297,0.7472527472527473,0.7647058823529411,0.8382736442849094
0.7950819672131147,0.8648648648648649,0.6153846153846154,0.7191011235955056,0.7647058823529411,0.8132448890725005
0.7868852459016393,0.8378378378378378,0.6078431372549019,0.7045454545454545,0.7647058823529411,0.8004370825070913
0.7622950819672131,0.7297297297297297,0.5869565217391305,0.6506024096385542,0.7764705882352941,0.7527374525663151
0.860655737704918,0.972972972972973,0.6923076923076923,0.8089887640449438,0.8117647058823529,0.88872105817117
0.7950819672131147,0.7837837837837838,0.6304347826086957,0.6987951807228915,0.8,0.7918503817180536
0.8114754098360656,0.8648648648648649,0.64,0.7356321839080459,0.788235294117647,0.8256615596773147
0.8114754098360656,0.8108108108108109,0.6521739130434783,0.7228915662650603,0.8117647058823529,0.8112876181503512
