,Accuracy,Sensitivity,Precision,F1,Specificity,G-Mean
count,100.0,100.0,100.0,100.0,100.0,100.0
mean,0.7913934426229506,0.8356756756756759,0.6175834137446564,0.7088709534405732,0.7721176470588234,0.8023502079390833
std,0.034587401369322854,0.05984290526790158,0.04826441020926614,0.04326846674706213,0.044482507904673695,0.03560177538785943
min,0.7295081967213115,0.6486486486486487,0.5333333333333333,0.6233766233766234,0.6588235294117647,0.725637705395231
25%,0.7684426229508197,0.8040540540540541,0.5818181818181818,0.680989010989011,0.7411764705882353,0.7780780201274198
50%,0.7950819672131147,0.8378378378378378,0.62,0.7126436781609196,0.7764705882352941,0.8053872662568292
75%,0.8114754098360656,0.8648648648648649,0.6470588235294118,0.7374141876430207,0.8,0.8270537708284029
max,0.8688524590163934,0.972972972972973,0.7333333333333333,0.8048780487804879,0.8705882352941177,0.8761093353957413
