Accuracy,Sensitivity,Precision,F1,Specificity,G-Mean
0.7868852459016393,0.7966101694915254,0.7704918032786885,0.7833333333333333,0.7777777777777778,0.7871376546591439
0.7868852459016393,0.8064516129032258,0.78125,0.7936507936507936,0.7666666666666667,0.7863075542638981
0.7049180327868853,0.7571428571428571,0.7361111111111112,0.7464788732394366,0.6346153846153846,0.6931771097594794
0.7213114754098361,0.684931506849315,0.819672131147541,0.7462686567164178,0.7755102040816326,0.7288150469485742
0.7704918032786885,0.7538461538461538,0.8032786885245902,0.7777777777777778,0.7894736842105263,0.7714542762891773
0.7213114754098361,0.7903225806451613,0.7,0.7424242424242423,0.65,0.7167354305595299
0.7622950819672131,0.75,0.7627118644067796,0.7563025210084034,0.7741935483870968,0.762000762001143
0.6885245901639344,0.6666666666666666,0.6896551724137931,0.6779661016949153,0.7096774193548387,0.6878359394287947
0.7377049180327869,0.6716417910447762,0.8181818181818182,0.7377049180327869,0.8181818181818182,0.7412996032400853
0.7704918032786885,0.6923076923076923,0.8490566037735849,0.7627118644067797,0.8596491228070176,0.7714542762891773
0.7950819672131147,0.8125,0.8,0.8062015503875969,0.7758620689655172,0.7939697292935561
0.7459016393442623,0.6875,0.8,0.7394957983193278,0.8103448275862069,0.7463994031117102
0.7295081967213115,0.6716417910447762,0.8035714285714286,0.7317073170731707,0.8,0.7330166661378315
0.7540983606557377,0.7586206896551724,0.7333333333333333,0.7457627118644068,0.75,0.7542980294561157
0.7786885245901639,0.8275862068965517,0.7384615384615385,0.7804878048780489,0.734375,0.779588751002511
0.6967213114754098,0.6774193548387096,0.711864406779661,0.6942148760330579,0.7166666666666667,0.696766726363811
0.7704918032786885,0.7301587301587301,0.8070175438596491,0.7666666666666667,0.8135593220338984,0.7707317571535953
0.7786885245901639,0.8166666666666667,0.7538461538461538,0.784,0.7419354838709677,0.7784047652054962
0.7622950819672131,0.8421052631578947,0.7058823529411765,0.7679999999999999,0.6923076923076923,0.7635417155709333
0.7295081967213115,0.7419354838709677,0.7301587301587301,0.736,0.7166666666666667,0.7291916278369678
0.7704918032786885,0.75,0.84375,0.7941176470588235,0.8,0.7745966692414834
0.7540983606557377,0.864406779661017,0.6986301369863014,0.7727272727272728,0.6507936507936508,0.7500336285169993
0.7950819672131147,0.7857142857142857,0.7719298245614035,0.7787610619469025,0.803030303030303,0.7943251103624894
0.7950819672131147,0.7741935483870968,0.8135593220338984,0.7933884297520662,0.8166666666666667,0.7951465679458907
0.7295081967213115,0.7272727272727273,0.7619047619047619,0.7441860465116279,0.7321428571428571,0.7297037292405271
0.7540983606557377,0.7058823529411765,0.8275862068965517,0.7619047619047619,0.8148148148148148,0.7583952786593614
0.7459016393442623,0.7714285714285715,0.782608695652174,0.7769784172661871,0.7115384615384616,0.740878599300249
0.8032786885245902,0.8135593220338984,0.7868852459016393,0.8,0.7936507936507936,0.8035434036903079
0.7868852459016393,0.75,0.85,0.7968749999999999,0.8333333333333334,0.7905694150420949
0.860655737704918,0.8571428571428571,0.8955223880597015,0.8759124087591241,0.8653846153846154,0.8612538776448219
0.7295081967213115,0.6307692307692307,0.82,0.7130434782608696,0.8421052631578947,0.7288169105261114
0.7868852459016393,0.7230769230769231,0.8545454545454545,0.7833333333333332,0.8596491228070176,0.788411341017539
0.7049180327868853,0.7352941176470589,0.7352941176470589,0.735294117647059,0.6666666666666666,0.7001400420140049
0.7786885245901639,0.8076923076923077,0.711864406779661,0.7567567567567568,0.7571428571428571,0.7820092464533023
0.7950819672131147,0.7692307692307693,0.8333333333333334,0.8,0.8245614035087719,0.7964157222826879
0.8114754098360656,0.765625,0.8596491228070176,0.8099173553719009,0.8620689655172413,0.8124171045246019
0.7622950819672131,0.7142857142857143,0.8035714285714286,0.7563025210084034,0.8135593220338984,0.7623082063396567
0.7377049180327869,0.7605633802816901,0.782608695652174,0.7714285714285714,0.7058823529411765,0.732712950911975
0.7704918032786885,0.7794117647058824,0.803030303030303,0.7910447761194029,0.7592592592592593,0.7692695230727267
0.6967213114754098,0.6984126984126984,0.7096774193548387,0.704,0.6949152542372882,0.696661781555448
0.7704918032786885,0.8225806451612904,0.75,0.7846153846153845,0.7166666666666667,0.7677995370096664
0.7295081967213115,0.7611940298507462,0.75,0.7555555555555554,0.6909090909090909,0.7252005758199634
0.7131147540983607,0.7096774193548387,0.7213114754098361,0.7154471544715446,0.7166666666666667,0.713163480933814
0.7704918032786885,0.7377049180327869,0.7894736842105263,0.7627118644067797,0.8032786885245902,0.7697938938933703
0.7704918032786885,0.7192982456140351,0.7735849056603774,0.7454545454545455,0.8153846153846154,0.7658359637329841
0.7622950819672131,0.8360655737704918,0.7285714285714285,0.7786259541984734,0.6885245901639344,0.7587171452725334
0.7459016393442623,0.796875,0.7391304347826086,0.7669172932330827,0.6896551724137931,0.7413291883618515
0.7459016393442623,0.696969696969697,0.8070175438596491,0.7479674796747967,0.8035714285714286,0.7483748626623794
0.7950819672131147,0.7833333333333333,0.7966101694915254,0.7899159663865546,0.8064516129032258,0.7948084235257744
0.7377049180327869,0.7586206896551724,0.7096774193548387,0.7333333333333333,0.71875,0.7384162922699194
0.7622950819672131,0.7241379310344828,0.7636363636363637,0.7433628318584072,0.796875,0.7596363694512681
0.7213114754098361,0.7049180327868853,0.7288135593220338,0.7166666666666666,0.7377049180327869,0.7211251622269761
0.7786885245901639,0.7936507936507936,0.78125,0.7874015748031497,0.7627118644067796,0.7780275551118464
0.7950819672131147,0.8125,0.8,0.8062015503875969,0.7758620689655172,0.7939697292935561
0.7377049180327869,0.734375,0.7580645161290323,0.7460317460317459,0.7413793103448276,0.7378688440600286
0.680327868852459,0.696969696969697,0.7076923076923077,0.702290076335878,0.6607142857142857,0.6785999082654193
0.7459016393442623,0.6865671641791045,0.8214285714285714,0.7479674796747967,0.8181818181818182,0.7494910077459199
0.7459016393442623,0.78,0.6610169491525424,0.7155963302752293,0.7222222222222222,0.7505553499465135
0.7622950819672131,0.78125,0.7692307692307693,0.7751937984496126,0.7413793103448276,0.7610536027159299
0.7704918032786885,0.8392857142857143,0.7121212121212122,0.7704918032786886,0.7121212121212122,0.7730932415777285
0.7377049180327869,0.75,0.75,0.75,0.7241379310344828,0.7369555266607762
0.7377049180327869,0.7391304347826086,0.7846153846153846,0.7611940298507462,0.7358490566037735,0.7374879206752606
0.7540983606557377,0.7166666666666667,0.7678571428571429,0.7413793103448276,0.7903225806451613,0.7525940801403939
0.7540983606557377,0.8153846153846154,0.7464788732394366,0.7794117647058824,0.6842105263157895,0.746923514720286
0.7213114754098361,0.6774193548387096,0.75,0.7118644067796611,0.7666666666666667,0.7206627773859821
0.7868852459016393,0.8448275862068966,0.7424242424242424,0.7903225806451614,0.734375,0.7876676066848819
0.7213114754098361,0.7142857142857143,0.6896551724137931,0.7017543859649122,0.7272727272727273,0.7207499701564473
0.7540983606557377,0.7142857142857143,0.7894736842105263,0.7500000000000001,0.7966101694915254,0.7543257014861141
0.7377049180327869,0.7611940298507462,0.7611940298507462,0.7611940298507462,0.7090909090909091,0.7346807242751359
0.7377049180327869,0.796875,0.7285714285714285,0.7611940298507462,0.6724137931034483,0.7320039216966739
0.7868852459016393,0.7741935483870968,0.8,0.7868852459016393,0.8,0.7869910029407435
0.7786885245901639,0.8032786885245902,0.765625,0.784,0.7540983606557377,0.7783001619979816
0.7622950819672131,0.7941176470588235,0.782608695652174,0.7883211678832117,0.7222222222222222,0.7573172464461019
0.7295081967213115,0.6935483870967742,0.7543859649122807,0.7226890756302521,0.7666666666666667,0.7291916278369679
0.7377049180327869,0.6956521739130435,0.8135593220338984,0.75,0.7924528301886793,0.742476621884015
0.7131147540983607,0.7068965517241379,0.6949152542372882,0.7008547008547009,0.71875,0.7127986367493446
0.7377049180327869,0.6909090909090909,0.7169811320754716,0.7037037037037037,0.7761194029850746,0.7322758709348031
0.7950819672131147,0.8032786885245902,0.7903225806451613,0.7967479674796747,0.7868852459016393,0.7950397149496486
0.7213114754098361,0.7213114754098361,0.7213114754098361,0.7213114754098362,0.7213114754098361,0.7213114754098361
0.7868852459016393,0.78125,0.8064516129032258,0.7936507936507936,0.7931034482758621,0.7871544124030032
0.7950819672131147,0.8125,0.8,0.8062015503875969,0.7758620689655172,0.7939697292935561
0.8032786885245902,0.8125,0.8125,0.8125,0.7931034482758621,0.8027431418107152
0.7131147540983607,0.65,0.7358490566037735,0.6902654867256638,0.7741935483870968,0.7093841036079205
0.819672131147541,0.7796610169491526,0.8363636363636363,0.8070175438596492,0.8571428571428571,0.8174844779386958
0.6967213114754098,0.6271186440677966,0.7115384615384616,0.6666666666666666,0.7619047619047619,0.6912341724730569
0.7213114754098361,0.734375,0.734375,0.734375,0.7068965517241379,0.7205047919149559
0.7377049180327869,0.7413793103448276,0.7166666666666667,0.728813559322034,0.734375,0.7378688440600286
0.7377049180327869,0.6956521739130435,0.8135593220338984,0.75,0.7924528301886793,0.742476621884015
0.7950819672131147,0.8142857142857143,0.8260869565217391,0.8201438848920863,0.7692307692307693,0.7914376958255314
0.7377049180327869,0.7432432432432432,0.8088235294117647,0.7746478873239436,0.7291666666666666,0.7361713103607055
0.7213114754098361,0.75,0.7272727272727273,0.7384615384615384,0.6896551724137931,0.7191949522280763
0.7377049180327869,0.6865671641791045,0.8070175438596491,0.7419354838709676,0.8,0.7411165436982794
0.7377049180327869,0.7213114754098361,0.7457627118644068,0.7333333333333334,0.7540983606557377,0.7375227461771798
0.7622950819672131,0.6865671641791045,0.8518518518518519,0.7603305785123967,0.8545454545454545,0.7659653056042529
0.7131147540983607,0.765625,0.7101449275362319,0.736842105263158,0.6551724137931034,0.708248811725332
0.7295081967213115,0.6896551724137931,0.7272727272727273,0.7079646017699116,0.765625,0.7266479487202248
0.8032786885245902,0.8181818181818182,0.7627118644067796,0.7894736842105264,0.7910447761194029,0.8044988832736827
0.7540983606557377,0.7931034482758621,0.71875,0.7540983606557378,0.71875,0.7550119889434047
0.7786885245901639,0.7894736842105263,0.75,0.7692307692307692,0.7692307692307693,0.7792865001991968
0.819672131147541,0.8208955223880597,0.8461538461538461,0.8333333333333334,0.8181818181818182,0.8195375470622296
