,Accuracy,Sensitivity,Precision,F1,Specificity,G-Mean
count,100.0,100.0,100.0,100.0,100.0,100.0
mean,0.7788524590163936,0.7542944012750944,0.8042125422752917,0.7769078485730083,0.8062010748528688,0.7789698724600087
std,0.033116000101161065,0.04871140759836455,0.05308234339973608,0.03736744282217971,0.049030702785326556,0.03261537445957601
min,0.7049180327868853,0.6231884057971014,0.6551724137931034,0.6972477064220183,0.6774193548387096,0.705581198435876
25%,0.7540983606557377,0.7169025157232705,0.7701765447667087,0.7494565217391305,0.7772988505747127,0.7594979598541965
50%,0.7786885245901639,0.7555713608345187,0.8114224137931034,0.7758620689655173,0.8058069381598794,0.7803403443344388
75%,0.7971311475409836,0.7848901098901099,0.8467365967365967,0.8034188034188032,0.839781746031746,0.7993248919396612
max,0.8688524590163934,0.9032258064516128,0.9090909090909092,0.875,0.912280701754386,0.8675760324277122
