,Accuracy,Sensitivity,Precision,F1,Specificity,G-Mean
count,100.0,100.0,100.0,100.0,100.0,100.0
mean,0.7530327868852459,0.7910810810810811,0.5686863345078161,0.6601276991410662,0.7364705882352942,0.7619705767176543
std,0.03498305779261826,0.07050455494639737,0.044179487937254736,0.044263789573766,0.045732956038002356,0.03795634678263718
min,0.6639344262295082,0.5675675675675675,0.4696969696969697,0.5454545454545454,0.5882352941176471,0.6638520340049161
25%,0.7295081967213115,0.7567567567567568,0.5370370370370371,0.6313100503278939,0.7058823529411765,0.7346732257616011
50%,0.7540983606557377,0.7837837837837838,0.5663522012578617,0.6592157842157842,0.7294117647058823,0.7618694462027561
75%,0.7786885245901639,0.8378378378378378,0.6035296031229668,0.6958964338055691,0.7676470588235293,0.7934549434075044
max,0.8360655737704918,0.945945945945946,0.6829268292682927,0.7727272727272727,0.8470588235294118,0.857400218763172
