Accuracy,Sensitivity,Precision,F1,Specificity,G-Mean
0.8032786885245902,0.8378378378378378,0.6326530612244898,0.7209302325581396,0.788235294117647,0.8126582027710061
0.7377049180327869,0.7567567567567568,0.5490196078431373,0.6363636363636364,0.7294117647058823,0.7429584654602477
0.7622950819672131,0.8108108108108109,0.5769230769230769,0.6741573033707865,0.7411764705882353,0.7752121613284599
0.7704918032786885,0.7567567567567568,0.5957446808510638,0.6666666666666666,0.7764705882352941,0.7665503010696378
0.7704918032786885,0.8378378378378378,0.5849056603773585,0.6888888888888889,0.7411764705882353,0.7880264536003388
0.7540983606557377,0.7567567567567568,0.5714285714285714,0.6511627906976745,0.7529411764705882,0.7548465557545448
0.8032786885245902,0.9459459459459459,0.6140350877192983,0.7446808510638299,0.7411764705882353,0.8373248339703451
0.6721311475409836,0.6486486486486487,0.47058823529411764,0.5454545454545454,0.6823529411764706,0.6652873914298606
0.7704918032786885,0.8648648648648649,0.5818181818181818,0.6956521739130435,0.7294117647058823,0.7942560086730195
0.7950819672131147,0.9459459459459459,0.603448275862069,0.7368421052631577,0.7294117647058823,0.8306528166140218
0.7213114754098361,0.7567567567567568,0.5283018867924528,0.6222222222222221,0.7058823529411765,0.7308770348448451
0.6721311475409836,0.7297297297297297,0.47368421052631576,0.5744680851063829,0.6470588235294118,0.6871521377492429
0.8032786885245902,0.8108108108108109,0.6382978723404256,0.7142857142857143,0.8,0.8053872662568292
0.7786885245901639,0.7837837837837838,0.6041666666666666,0.6823529411764706,0.7764705882352941,0.7801186163936092
0.7459016393442623,0.7027027027027027,0.5652173913043478,0.6265060240963856,0.7647058823529411,0.7330490367649812
0.6967213114754098,0.7567567567567568,0.5,0.6021505376344086,0.6705882352941176,0.7123708149976481
0.7704918032786885,0.8378378378378378,0.5849056603773585,0.6888888888888889,0.7411764705882353,0.7880264536003388
0.7540983606557377,0.9459459459459459,0.5555555555555556,0.7000000000000001,0.6705882352941176,0.7964547837608338
0.6967213114754098,0.7567567567567568,0.5,0.6021505376344086,0.6705882352941176,0.7123708149976481
0.7622950819672131,0.918918918918919,0.5666666666666667,0.7010309278350515,0.6941176470588235,0.7986475053725755
0.7622950819672131,0.8108108108108109,0.5769230769230769,0.6741573033707865,0.7411764705882353,0.7752121613284599
0.7868852459016393,0.8378378378378378,0.6078431372549019,0.7045454545454545,0.7647058823529411,0.8004370825070913
0.7295081967213115,0.7837837837837838,0.5370370370370371,0.6373626373626374,0.7058823529411765,0.7438139159053396
0.8032786885245902,0.8378378378378378,0.6326530612244898,0.7209302325581396,0.788235294117647,0.8126582027710061
0.8032786885245902,0.8648648648648649,0.6274509803921569,0.7272727272727273,0.7764705882352941,0.8194767418088569
0.7540983606557377,0.8108108108108109,0.5660377358490566,0.6666666666666667,0.7294117647058823,0.7690350735539445
0.7622950819672131,0.8648648648648649,0.5714285714285714,0.6881720430107527,0.7176470588235294,0.7878246800843951
0.6967213114754098,0.7297297297297297,0.5,0.5934065934065933,0.6823529411764706,0.7056438388769452
0.7377049180327869,0.8378378378378378,0.543859649122807,0.6595744680851063,0.6941176470588235,0.762599520467232
0.6639344262295082,0.8378378378378378,0.4696969696969697,0.6019417475728156,0.5882352941176471,0.7020297621635667
0.7704918032786885,0.8108108108108109,0.5882352941176471,0.6818181818181819,0.7529411764705882,0.7813404160716144
0.7377049180327869,0.7027027027027027,0.5531914893617021,0.6190476190476191,0.7529411764705882,0.7273883417281548
0.7377049180327869,0.7567567567567568,0.5490196078431373,0.6363636363636364,0.7294117647058823,0.7429584654602477
0.7950819672131147,0.9459459459459459,0.603448275862069,0.7368421052631577,0.7294117647058823,0.8306528166140218
0.7459016393442623,0.7837837837837838,0.5576923076923077,0.651685393258427,0.7294117647058823,0.756109193752849
0.6967213114754098,0.7567567567567568,0.5,0.6021505376344086,0.6705882352941176,0.7123708149976481
0.7868852459016393,0.8648648648648649,0.6037735849056604,0.7111111111111112,0.7529411764705882,0.8069649117771031
0.7622950819672131,0.918918918918919,0.5666666666666667,0.7010309278350515,0.6941176470588235,0.7986475053725755
0.7622950819672131,0.7837837837837838,0.58,0.6666666666666666,0.7529411764705882,0.7682077090609878
0.7950819672131147,0.7297297297297297,0.6428571428571429,0.6835443037974683,0.8235294117647058,0.7752121613284598
0.7459016393442623,0.7837837837837838,0.5576923076923077,0.651685393258427,0.7294117647058823,0.756109193752849
0.7540983606557377,0.8378378378378378,0.5636363636363636,0.6739130434782609,0.7176470588235294,0.7754172167906703
0.8032786885245902,0.8108108108108109,0.6382978723404256,0.7142857142857143,0.8,0.8053872662568292
0.7540983606557377,0.7297297297297297,0.574468085106383,0.6428571428571429,0.7647058823529411,0.7470131303077251
0.7540983606557377,0.7837837837837838,0.5686274509803921,0.6590909090909091,0.7411764705882353,0.7621824575317628
0.7459016393442623,0.8378378378378378,0.5535714285714286,0.6666666666666666,0.7058823529411765,0.7690350735539445
0.7295081967213115,0.7837837837837838,0.5370370370370371,0.6373626373626374,0.7058823529411765,0.7438139159053396
0.7868852459016393,0.8378378378378378,0.6078431372549019,0.7045454545454545,0.7647058823529411,0.8004370825070913
0.7786885245901639,0.6756756756756757,0.625,0.6493506493506493,0.8235294117647058,0.7459482500367631
0.7704918032786885,0.7837837837837838,0.5918367346938775,0.6744186046511628,0.7647058823529411,0.7741860693349534
0.7213114754098361,0.7567567567567568,0.5283018867924528,0.6222222222222221,0.7058823529411765,0.7308770348448451
0.7950819672131147,0.7567567567567568,0.6363636363636364,0.691358024691358,0.8117647058823529,0.7837783016090277
0.7049180327868853,0.8108108108108109,0.5084745762711864,0.6249999999999999,0.6588235294117647,0.7308770348448451
0.7786885245901639,0.7027027027027027,0.6190476190476191,0.6582278481012659,0.8117647058823529,0.7552676696259374
0.7295081967213115,0.8648648648648649,0.5333333333333333,0.6597938144329898,0.6705882352941176,0.7615564348737494
0.7622950819672131,0.8378378378378378,0.5740740740740741,0.6813186813186813,0.7294117647058823,0.7817472582840685
0.7540983606557377,0.8108108108108109,0.5660377358490566,0.6666666666666667,0.7294117647058823,0.7690350735539445
0.7950819672131147,0.8378378378378378,0.62,0.7126436781609196,0.7764705882352941,0.8065707896965604
0.7131147540983607,0.7567567567567568,0.5185185185185185,0.6153846153846154,0.6941176470588235,0.7247608015034108
0.7868852459016393,0.8108108108108109,0.6122448979591837,0.6976744186046512,0.7764705882352941,0.7934549434075044
0.7459016393442623,0.8648648648648649,0.5517241379310345,0.6736842105263158,0.6941176470588235,0.7748018875969827
0.7213114754098361,0.7567567567567568,0.5283018867924528,0.6222222222222221,0.7058823529411765,0.7308770348448451
0.7131147540983607,0.5675675675675675,0.525,0.5454545454545455,0.7764705882352941,0.6638520340049161
0.7950819672131147,0.8648648648648649,0.6153846153846154,0.7191011235955056,0.7647058823529411,0.8132448890725005
0.8360655737704918,0.918918918918919,0.6666666666666666,0.7727272727272727,0.8,0.857400218763172
0.7704918032786885,0.8918918918918919,0.5789473684210527,0.7021276595744681,0.7176470588235294,0.8000397446407082
0.7295081967213115,0.8108108108108109,0.5357142857142857,0.6451612903225806,0.6941176470588235,0.7501987018182962
0.7377049180327869,0.7567567567567568,0.5490196078431373,0.6363636363636364,0.7294117647058823,0.7429584654602477
0.8114754098360656,0.8918918918918919,0.6346153846153846,0.7415730337078652,0.7764705882352941,0.8321825652701375
0.7459016393442623,0.7567567567567568,0.56,0.6436781609195402,0.7411764705882353,0.7489260992025667
0.7213114754098361,0.7027027027027027,0.5306122448979592,0.6046511627906977,0.7294117647058823,0.7159326912789856
0.7868852459016393,0.7567567567567568,0.6222222222222222,0.6829268292682927,0.8,0.7780780201274198
0.7213114754098361,0.7567567567567568,0.5283018867924528,0.6222222222222221,0.7058823529411765,0.7308770348448451
0.7704918032786885,0.8918918918918919,0.5789473684210527,0.7021276595744681,0.7176470588235294,0.8000397446407082
0.7213114754098361,0.7027027027027027,0.5306122448979592,0.6046511627906977,0.7294117647058823,0.7159326912789856
0.7459016393442623,0.7837837837837838,0.5576923076923077,0.651685393258427,0.7294117647058823,0.756109193752849
0.7704918032786885,0.7027027027027027,0.6046511627906976,0.6499999999999999,0.8,0.7497747409470141
0.6885245901639344,0.7837837837837838,0.4915254237288136,0.6041666666666666,0.6470588235294118,0.7121476062141654
0.7868852459016393,0.8108108108108109,0.6122448979591837,0.6976744186046512,0.7764705882352941,0.7934549434075044
0.819672131147541,0.7567567567567568,0.6829268292682927,0.7179487179487181,0.8470588235294118,0.800635677494022
0.7131147540983607,0.7567567567567568,0.5185185185185185,0.6153846153846154,0.6941176470588235,0.7247608015034108
0.7622950819672131,0.6756756756756757,0.5952380952380952,0.6329113924050633,0.8,0.7352146220938077
0.7459016393442623,0.7027027027027027,0.5652173913043478,0.6265060240963856,0.7647058823529411,0.7330490367649812
0.7786885245901639,0.8378378378378378,0.5961538461538461,0.6966292134831461,0.7529411764705882,0.7942560086730195
0.7622950819672131,0.7027027027027027,0.5909090909090909,0.6419753086419754,0.788235294117647,0.7442412723990321
0.7377049180327869,0.7837837837837838,0.5471698113207547,0.6444444444444444,0.7176470588235294,0.7499867513403217
0.7540983606557377,0.7297297297297297,0.574468085106383,0.6428571428571429,0.7647058823529411,0.7470131303077251
0.7377049180327869,0.8108108108108109,0.5454545454545454,0.6521739130434782,0.7058823529411765,0.7565296047910341
0.7377049180327869,0.8378378378378378,0.543859649122807,0.6595744680851063,0.6941176470588235,0.762599520467232
0.7459016393442623,0.7837837837837838,0.5576923076923077,0.651685393258427,0.7294117647058823,0.756109193752849
0.7868852459016393,0.7567567567567568,0.6222222222222222,0.6829268292682927,0.8,0.7780780201274198
0.6721311475409836,0.7297297297297297,0.47368421052631576,0.5744680851063829,0.6470588235294118,0.6871521377492429
0.7868852459016393,0.8108108108108109,0.6122448979591837,0.6976744186046512,0.7764705882352941,0.7934549434075044
0.7295081967213115,0.6486486486486487,0.5454545454545454,0.5925925925925926,0.7647058823529411,0.7042907334346433
0.7295081967213115,0.8108108108108109,0.5357142857142857,0.6451612903225806,0.6941176470588235,0.7501987018182962
0.7459016393442623,0.7837837837837838,0.5576923076923077,0.651685393258427,0.7294117647058823,0.756109193752849
0.7213114754098361,0.7567567567567568,0.5283018867924528,0.6222222222222221,0.7058823529411765,0.7308770348448451
0.7540983606557377,0.7027027027027027,0.5777777777777777,0.6341463414634145,0.7764705882352941,0.7386663529104995
0.7459016393442623,0.8108108108108109,0.5555555555555556,0.6593406593406594,0.7176470588235294,0.7628079664245121
0.7213114754098361,0.7027027027027027,0.5306122448979592,0.6046511627906977,0.7294117647058823,0.7159326912789856
