,Accuracy,Sensitivity,Precision,F1,Specificity,G-Mean
count,100.0,100.0,100.0,100.0,100.0,100.0
mean,0.7913934426229509,0.8318918918918919,0.6190137151154187,0.7078366795552077,0.773764705882353,0.8010328635942205
std,0.032711766073762895,0.06411662349374542,0.04932316096056038,0.04052340625568833,0.04752752330305272,0.03313897805107992
min,0.7131147540983607,0.6756756756756757,0.5185185185185185,0.6153846153846154,0.6823529411764706,0.7247608015034108
25%,0.7704918032786885,0.7837837837837838,0.5829545454545455,0.6823529411764706,0.7411764705882353,0.7810349661521131
50%,0.7950819672131147,0.8378378378378378,0.6131399928392409,0.7027121814355857,0.7764705882352941,0.8000397446407082
75%,0.8114754098360656,0.8918918918918919,0.6436011904761905,0.7333333333333333,0.8,0.8248427711443663
max,0.8770491803278688,0.945945945945946,0.7647058823529411,0.810126582278481,0.9058823529411764,0.8826178722562065
