,Accuracy,Sensitivity,Precision,F1,Specificity,G-Mean
count,100.0,100.0,100.0,100.0,100.0,100.0
mean,0.769344262295082,0.7640540540540541,0.5949321475192327,0.6671561482408468,0.7716470588235294,0.7663892219421297
std,0.031756879549431204,0.07506628395157401,0.045058528414076794,0.04595625616917864,0.040962690954823626,0.03850633232016273
min,0.680327868852459,0.5675675675675675,0.4791666666666667,0.5316455696202531,0.6823529411764706,0.6537162932426225
25%,0.7459016393442623,0.7027027027027027,0.5633522727272727,0.6368455074337428,0.7411764705882353,0.7412446028189797
50%,0.7704918032786885,0.7837837837837838,0.5952380952380952,0.6742879540109746,0.7764705882352941,0.7741860693349534
75%,0.7950819672131147,0.8108108108108109,0.6290372670807454,0.6987951807228915,0.8,0.7934549434075044
max,0.8442622950819673,0.945945945945946,0.7368421052631579,0.7560975609756098,0.8823529411764706,0.8446972910537321
