,Accuracy,Sensitivity,Precision,F1,Specificity,G-Mean
count,100.0,100.0,100.0,100.0,100.0,100.0
mean,0.7574590163934425,0.8124324324324326,0.5723730359602495,0.6702625700161348,0.7335294117647058,0.770838319707482
std,0.0338480172555613,0.06471682077303856,0.04292253415591262,0.042106158451491,0.044536533863276245,0.035919147150805346
min,0.6475409836065574,0.5945945945945946,0.44,0.5057471264367815,0.611764705882353,0.6314492377892387
25%,0.7377049180327869,0.7837837837837838,0.5450558213716108,0.6382978723404256,0.7058823529411765,0.7438139159053396
50%,0.7622950819672131,0.8108108108108109,0.5714285714285714,0.6777749295052551,0.7294117647058823,0.7780734860147943
75%,0.7786885245901639,0.8648648648648649,0.5971153846153846,0.7021276595744681,0.7647058823529411,0.8000397446407082
max,0.819672131147541,0.945945945945946,0.6595744680851063,0.7380952380952381,0.8352941176470589,0.8306528166140218
