Accuracy,Sensitivity,Precision,F1,Specificity,G-Mean
0.5655737704918032,0.5675675675675675,0.3620689655172414,0.4421052631578948,0.5647058823529412,0.5661349168159087
0.6311475409836066,0.7027027027027027,0.43333333333333335,0.5360824742268041,0.6,0.6493239727760108
0.5245901639344263,0.5675675675675675,0.3333333333333333,0.42,0.5058823529411764,0.5358380506591345
0.5819672131147541,0.5945945945945946,0.3793103448275862,0.4631578947368421,0.5764705882352941,0.585462463107134
0.5,0.6216216216216216,0.32857142857142857,0.42990654205607476,0.4470588235294118,0.5271635712400918
0.639344262295082,0.2972972972972973,0.3793103448275862,0.33333333333333337,0.788235294117647,0.4840869989738587
0.5409836065573771,0.43243243243243246,0.3137254901960784,0.36363636363636365,0.5882352941176471,0.5043530698606894
0.6721311475409836,0.32432432432432434,0.4444444444444444,0.375,0.8235294117647058,0.5168081075523066
0.5901639344262295,0.35135135135135137,0.3333333333333333,0.34210526315789475,0.6941176470588235,0.49384124300319227
0.5983606557377049,0.5135135135135135,0.38,0.4367816091954023,0.6352941176470588,0.571167326155312
0.5655737704918032,0.5675675675675675,0.3620689655172414,0.4421052631578948,0.5647058823529412,0.5661349168159087
0.5491803278688525,0.3783783783783784,0.30434782608695654,0.3373493975903615,0.6235294117647059,0.4857263094529198
0.5327868852459017,0.6756756756756757,0.35714285714285715,0.46728971962616817,0.47058823529411764,0.563883874434601
0.6147540983606558,0.3783783783783784,0.3684210526315789,0.37333333333333335,0.7176470588235294,0.5210970450555825
0.5573770491803278,0.6486486486486487,0.36923076923076925,0.47058823529411764,0.5176470588235295,0.5794575611577003
0.6721311475409836,0.43243243243243246,0.45714285714285713,0.4444444444444445,0.7764705882352941,0.5794575611577002
0.5409836065573771,0.4864864864864865,0.32727272727272727,0.391304347826087,0.5647058823529412,0.5241390851712296
0.5655737704918032,0.6216216216216216,0.3709677419354839,0.46464646464646464,0.5411764705882353,0.5800060303397927
0.5,0.5405405405405406,0.3125,0.396039603960396,0.4823529411764706,0.5106185656190431
0.5901639344262295,0.6486486486486487,0.39344262295081966,0.4897959183673469,0.5647058823529412,0.6052236838328273
0.6147540983606558,0.40540540540540543,0.375,0.3896103896103896,0.7058823529411765,0.5349472137161191
0.6147540983606558,0.35135135135135137,0.3611111111111111,0.3561643835616438,0.7294117647058823,0.5062408608765058
0.6065573770491803,0.4594594594594595,0.37777777777777777,0.41463414634146345,0.6705882352941176,0.5550748671198401
0.5327868852459017,0.35135135135135137,0.2826086956521739,0.3132530120481928,0.611764705882353,0.46362091855396986
0.5819672131147541,0.5405405405405406,0.37037037037037035,0.4395604395604396,0.6,0.5694947974514994
0.5409836065573771,0.5135135135135135,0.3333333333333333,0.4042553191489361,0.5529411764705883,0.5328628025070876
0.5983606557377049,0.2702702702702703,0.3125,0.2898550724637681,0.7411764705882353,0.44756895002205793
0.5491803278688525,0.3783783783783784,0.30434782608695654,0.3373493975903615,0.6235294117647059,0.4857263094529198
0.6311475409836066,0.2972972972972973,0.36666666666666664,0.3283582089552239,0.7764705882352941,0.4804608280736272
0.6147540983606558,0.5135135135135135,0.3958333333333333,0.44705882352941173,0.6588235294117647,0.5816483347982773
0.5983606557377049,0.6216216216216216,0.39655172413793105,0.48421052631578954,0.5882352941176471,0.6046980878293591
0.5491803278688525,0.6486486486486487,0.36363636363636365,0.4660194174757281,0.5058823529411764,0.5728349715323715
0.5737704918032787,0.40540540540540543,0.3333333333333333,0.36585365853658536,0.6470588235294118,0.5121729636305355
0.5081967213114754,0.5945945945945946,0.3283582089552239,0.42307692307692313,0.47058823529411764,0.5289699622716696
0.6311475409836066,0.5945945945945946,0.4230769230769231,0.49438202247191015,0.6470588235294118,0.6202722618780611
0.5081967213114754,0.40540540540540543,0.2830188679245283,0.33333333333333337,0.5529411764705883,0.4734610245969574
0.5245901639344263,0.5135135135135135,0.3220338983050847,0.3958333333333333,0.5294117647058824,0.5214020477419581
0.6229508196721312,0.43243243243243246,0.3902439024390244,0.4102564102564103,0.7058823529411765,0.5524911066193571
0.5819672131147541,0.5405405405405406,0.37037037037037035,0.4395604395604396,0.6,0.5694947974514994
0.6229508196721312,0.3783783783783784,0.3783783783783784,0.37837837837837834,0.7294117647058823,0.5253509690668925
0.5573770491803278,0.3783783783783784,0.3111111111111111,0.34146341463414637,0.6352941176470588,0.4902872199319669
0.5081967213114754,0.5675675675675675,0.3230769230769231,0.411764705882353,0.4823529411764706,0.5232283302083245
0.5327868852459017,0.32432432432432434,0.2727272727272727,0.2962962962962963,0.6235294117647059,0.4496951802798554
0.5,0.6216216216216216,0.32857142857142857,0.42990654205607476,0.4470588235294118,0.5271635712400918
0.5409836065573771,0.4594594594594595,0.32075471698113206,0.37777777777777777,0.5764705882352941,0.5146502354656655
0.5655737704918032,0.4594594594594595,0.34,0.39080459770114945,0.611764705882353,0.5301708036860207
0.5245901639344263,0.40540540540540543,0.29411764705882354,0.34090909090909094,0.5764705882352941,0.48342971829193737
0.6065573770491803,0.5135135135135135,0.3877551020408163,0.441860465116279,0.6470588235294118,0.5764316524276827
0.6065573770491803,0.5675675675675675,0.39622641509433965,0.4666666666666667,0.6235294117647059,0.5948908064024274
0.48360655737704916,0.7027027027027027,0.3333333333333333,0.4521739130434782,0.38823529411764707,0.5223159871773497
0.5327868852459017,0.35135135135135137,0.2826086956521739,0.3132530120481928,0.611764705882353,0.46362091855396986
0.5409836065573771,0.4864864864864865,0.32727272727272727,0.391304347826087,0.5647058823529412,0.5241390851712296
0.5245901639344263,0.5945945945945946,0.3384615384615385,0.43137254901960786,0.49411764705882355,0.5420329160069305
0.5491803278688525,0.6486486486486487,0.36363636363636365,0.4660194174757281,0.5058823529411764,0.5728349715323715
0.5327868852459017,0.6216216216216216,0.3484848484848485,0.44660194174757284,0.49411764705882355,0.5542149520146186
0.5655737704918032,0.5405405405405406,0.35714285714285715,0.4301075268817204,0.5764705882352941,0.55821655598023
0.5573770491803278,0.5135135135135135,0.34545454545454546,0.4130434782608695,0.5764705882352941,0.5440821971006842
0.5573770491803278,0.4864864864864865,0.33962264150943394,0.39999999999999997,0.5882352941176471,0.5349472137161191
0.5327868852459017,0.4594594594594595,0.3148148148148148,0.37362637362637363,0.5647058823529412,0.5093716319736107
0.5655737704918032,0.5135135135135135,0.35185185185185186,0.4175824175824176,0.5882352941176471,0.5496060158468136
0.5819672131147541,0.35135135135135137,0.325,0.33766233766233766,0.6823529411764706,0.48963826237429825
0.5655737704918032,0.3783783783783784,0.3181818181818182,0.345679012345679,0.6470588235294118,0.49480609167883144
0.5983606557377049,0.2702702702702703,0.3125,0.2898550724637681,0.7411764705882353,0.44756895002205793
0.5,0.5675675675675675,0.3181818181818182,0.4077669902912622,0.47058823529411764,0.5168081075523066
0.5,0.2972972972972973,0.2391304347826087,0.26506024096385544,0.5882352941176471,0.41818747364795283
0.5327868852459017,0.4864864864864865,0.32142857142857145,0.3870967741935484,0.5529411764705883,0.5186505665425237
0.6229508196721312,0.3783783783783784,0.3783783783783784,0.37837837837837834,0.7294117647058823,0.5253509690668925
0.5163934426229508,0.6216216216216216,0.3382352941176471,0.4380952380952381,0.47058823529411764,0.5408584121002341
0.5573770491803278,0.35135135135135137,0.3023255813953488,0.32499999999999996,0.6470588235294118,0.4768070805376892
0.5327868852459017,0.6486486486486487,0.35294117647058826,0.4571428571428572,0.4823529411764706,0.5593546133409635
0.5081967213114754,0.4594594594594595,0.2982456140350877,0.36170212765957444,0.5294117647058824,0.4931969619160719
0.5655737704918032,0.4864864864864865,0.34615384615384615,0.4044943820224719,0.6,0.5402702026688978
0.639344262295082,0.43243243243243246,0.41025641025641024,0.42105263157894735,0.7294117647058823,0.5616238097308534
0.5163934426229508,0.6486486486486487,0.34285714285714286,0.4485981308411215,0.4588235294117647,0.5455412562961162
0.5327868852459017,0.6216216216216216,0.3484848484848485,0.44660194174757284,0.49411764705882355,0.5542149520146186
0.5163934426229508,0.5945945945945946,0.3333333333333333,0.42718446601941745,0.4823529411764706,0.5355412696612035
0.5819672131147541,0.5405405405405406,0.37037037037037035,0.4395604395604396,0.6,0.5694947974514994
0.4426229508196721,0.5405405405405406,0.28169014084507044,0.37037037037037035,0.4,0.46499055497527714
0.6147540983606558,0.3783783783783784,0.3684210526315789,0.37333333333333335,0.7176470588235294,0.5210970450555825
0.4918032786885246,0.5945945945945946,0.3188405797101449,0.4150943396226415,0.4470588235294118,0.515576143684332
0.6311475409836066,0.5405405405405406,0.4166666666666667,0.47058823529411764,0.6705882352941176,0.6020632252396833
0.6065573770491803,0.3783783783783784,0.358974358974359,0.368421052631579,0.7058823529411765,0.5168081075523066
0.5819672131147541,0.40540540540540543,0.3409090909090909,0.37037037037037035,0.6588235294117647,0.5168081075523066
0.5655737704918032,0.40540540540540543,0.32608695652173914,0.3614457831325302,0.6352941176470588,0.5074954869911408
0.5983606557377049,0.6216216216216216,0.39655172413793105,0.48421052631578954,0.5882352941176471,0.6046980878293591
0.5,0.5405405405405406,0.3125,0.396039603960396,0.4823529411764706,0.5106185656190431
0.45901639344262296,0.5675675675675675,0.29577464788732394,0.38888888888888884,0.4117647058823529,0.48342971829193737
0.48360655737704916,0.5135135135135135,0.296875,0.37623762376237624,0.47058823529411764,0.49158256491052077
0.5819672131147541,0.43243243243243246,0.34782608695652173,0.38554216867469876,0.6470588235294118,0.5289699622716696
0.5081967213114754,0.6486486486486487,0.3380281690140845,0.4444444444444444,0.4470588235294118,0.5385017193554795
0.5901639344262295,0.6216216216216216,0.3898305084745763,0.4791666666666667,0.5764705882352941,0.5986205658645496
0.5409836065573771,0.4864864864864865,0.32727272727272727,0.391304347826087,0.5647058823529412,0.5241390851712296
0.5901639344262295,0.35135135135135137,0.3333333333333333,0.34210526315789475,0.6941176470588235,0.49384124300319227
0.5655737704918032,0.2972972972972973,0.2894736842105263,0.29333333333333333,0.6823529411764706,0.4504016931746887
0.5491803278688525,0.4594594594594595,0.3269230769230769,0.3820224719101124,0.5882352941176471,0.5198752449100363
0.5245901639344263,0.6216216216216216,0.34328358208955223,0.4423076923076923,0.4823529411764706,0.5475774077590092
0.5491803278688525,0.5675675675675675,0.35,0.43298969072164945,0.5411764705882353,0.5542149520146186
0.6065573770491803,0.4594594594594595,0.37777777777777777,0.41463414634146345,0.6705882352941176,0.5550748671198401
0.5163934426229508,0.5405405405405406,0.3225806451612903,0.4040404040404041,0.5058823529411764,0.5229243927268492
0.5491803278688525,0.3783783783783784,0.30434782608695654,0.3373493975903615,0.6235294117647059,0.4857263094529198
