Accuracy,Sensitivity,Precision,F1,Specificity,G-Mean
0.6967213114754098,0.7297297297297297,0.5,0.5934065934065933,0.6823529411764706,0.7056438388769452
0.7704918032786885,0.7027027027027027,0.6046511627906976,0.6499999999999999,0.8,0.7497747409470141
0.8032786885245902,0.8378378378378378,0.6326530612244898,0.7209302325581396,0.788235294117647,0.8126582027710061
0.7786885245901639,0.8918918918918919,0.5892857142857143,0.7096774193548389,0.7294117647058823,0.8065707896965603
0.7622950819672131,0.6486486486486487,0.6,0.6233766233766234,0.8117647058823529,0.725637705395231
0.7295081967213115,0.8108108108108109,0.5357142857142857,0.6451612903225806,0.6941176470588235,0.7501987018182962
0.7213114754098361,0.7027027027027027,0.5306122448979592,0.6046511627906977,0.7294117647058823,0.7159326912789856
0.7540983606557377,0.8378378378378378,0.5636363636363636,0.6739130434782609,0.7176470588235294,0.7754172167906703
0.7704918032786885,0.8918918918918919,0.5789473684210527,0.7021276595744681,0.7176470588235294,0.8000397446407082
0.7868852459016393,0.8108108108108109,0.6122448979591837,0.6976744186046512,0.7764705882352941,0.7934549434075044
0.7459016393442623,0.6486486486486487,0.5714285714285714,0.6075949367088608,0.788235294117647,0.7150438856088358
0.7540983606557377,0.7837837837837838,0.5686274509803921,0.6590909090909091,0.7411764705882353,0.7621824575317628
0.7786885245901639,0.7837837837837838,0.6041666666666666,0.6823529411764706,0.7764705882352941,0.7801186163936092
0.7950819672131147,0.7837837837837838,0.6304347826086957,0.6987951807228915,0.8,0.7918503817180536
0.8032786885245902,0.7567567567567568,0.6511627906976745,0.7000000000000001,0.8235294117647058,0.7894374242084413
0.7704918032786885,0.8378378378378378,0.5849056603773585,0.6888888888888889,0.7411764705882353,0.7880264536003388
0.8032786885245902,0.8648648648648649,0.6274509803921569,0.7272727272727273,0.7764705882352941,0.8194767418088569
0.7868852459016393,0.7027027027027027,0.6341463414634146,0.6666666666666667,0.8235294117647058,0.7607209366135691
0.7786885245901639,0.6756756756756757,0.625,0.6493506493506493,0.8235294117647058,0.7459482500367631
0.7377049180327869,0.7297297297297297,0.5510204081632653,0.6279069767441859,0.7411764705882353,0.7354308298979504
0.7786885245901639,0.8648648648648649,0.5925925925925926,0.7032967032967032,0.7411764705882353,0.800635677494022
0.7540983606557377,0.7567567567567568,0.5714285714285714,0.6511627906976745,0.7529411764705882,0.7548465557545448
0.7622950819672131,0.6756756756756757,0.5952380952380952,0.6329113924050633,0.8,0.7352146220938077
0.7704918032786885,0.7837837837837838,0.5918367346938775,0.6744186046511628,0.7647058823529411,0.7741860693349534
0.7459016393442623,0.7567567567567568,0.56,0.6436781609195402,0.7411764705882353,0.7489260992025667
0.8114754098360656,0.7567567567567568,0.6666666666666666,0.7088607594936708,0.8352941176470589,0.7950562668192642
0.7377049180327869,0.7297297297297297,0.5510204081632653,0.6279069767441859,0.7411764705882353,0.7354308298979504
0.7213114754098361,0.8108108108108109,0.5263157894736842,0.6382978723404256,0.6823529411764706,0.7438139159053396
0.7786885245901639,0.7837837837837838,0.6041666666666666,0.6823529411764706,0.7764705882352941,0.7801186163936092
0.8360655737704918,0.8378378378378378,0.6888888888888889,0.7560975609756098,0.8352941176470589,0.8365650109155154
0.7950819672131147,0.7837837837837838,0.6304347826086957,0.6987951807228915,0.8,0.7918503817180536
0.7622950819672131,0.8108108108108109,0.5769230769230769,0.6741573033707865,0.7411764705882353,0.7752121613284599
0.7950819672131147,0.7567567567567568,0.6363636363636364,0.691358024691358,0.8117647058823529,0.7837783016090277
0.7295081967213115,0.7027027027027027,0.5416666666666666,0.611764705882353,0.7411764705882353,0.7216832470426366
0.7622950819672131,0.6756756756756757,0.5952380952380952,0.6329113924050633,0.8,0.7352146220938077
0.7295081967213115,0.5945945945945946,0.55,0.5714285714285715,0.788235294117647,0.6846023993173216
0.7459016393442623,0.7837837837837838,0.5576923076923077,0.651685393258427,0.7294117647058823,0.756109193752849
0.8278688524590164,0.8108108108108109,0.6818181818181818,0.7407407407407407,0.8352941176470589,0.8229614212069194
0.7622950819672131,0.7837837837837838,0.58,0.6666666666666666,0.7529411764705882,0.7682077090609878
0.6885245901639344,0.6216216216216216,0.48936170212765956,0.5476190476190476,0.7176470588235294,0.6679108686478081
0.7950819672131147,0.7027027027027027,0.65,0.6753246753246753,0.8352941176470589,0.7661353888329775
0.7950819672131147,0.8378378378378378,0.62,0.7126436781609196,0.7764705882352941,0.8065707896965604
0.7540983606557377,0.8378378378378378,0.5636363636363636,0.6739130434782609,0.7176470588235294,0.7754172167906703
0.7459016393442623,0.7837837837837838,0.5576923076923077,0.651685393258427,0.7294117647058823,0.756109193752849
0.7459016393442623,0.7297297297297297,0.5625,0.6352941176470588,0.7529411764705882,0.7412446028189797
0.7868852459016393,0.7567567567567568,0.6222222222222222,0.6829268292682927,0.8,0.7780780201274198
0.680327868852459,0.6216216216216216,0.4791666666666667,0.5411764705882353,0.7058823529411765,0.6624135663687603
0.7295081967213115,0.7837837837837838,0.5370370370370371,0.6373626373626374,0.7058823529411765,0.7438139159053396
0.8032786885245902,0.8108108108108109,0.6382978723404256,0.7142857142857143,0.8,0.8053872662568292
0.7295081967213115,0.7567567567567568,0.5384615384615384,0.6292134831460674,0.7176470588235294,0.7369425084301485
0.8114754098360656,0.8378378378378378,0.6458333333333334,0.7294117647058824,0.8,0.818700354385089
0.819672131147541,0.8378378378378378,0.6595744680851063,0.7380952380952381,0.8117647058823529,0.824698239363671
0.8114754098360656,0.8108108108108109,0.6521739130434783,0.7228915662650603,0.8117647058823529,0.8112876181503512
0.7704918032786885,0.6756756756756757,0.6097560975609756,0.6410256410256411,0.8117647058823529,0.7406008818093082
0.7950819672131147,0.7567567567567568,0.6363636363636364,0.691358024691358,0.8117647058823529,0.7837783016090277
0.7868852459016393,0.6756756756756757,0.6410256410256411,0.6578947368421052,0.8352941176470589,0.7512575572525668
0.7377049180327869,0.7027027027027027,0.5531914893617021,0.6190476190476191,0.7529411764705882,0.7273883417281548
0.7377049180327869,0.6216216216216216,0.5609756097560976,0.5897435897435899,0.788235294117647,0.6999886440141779
0.7950819672131147,0.7567567567567568,0.6363636363636364,0.691358024691358,0.8117647058823529,0.7837783016090277
0.819672131147541,0.918918918918919,0.6415094339622641,0.7555555555555555,0.7764705882352941,0.8446972910537321
0.8032786885245902,0.7567567567567568,0.6511627906976745,0.7000000000000001,0.8235294117647058,0.7894374242084413
0.7459016393442623,0.7297297297297297,0.5625,0.6352941176470588,0.7529411764705882,0.7412446028189797
0.7540983606557377,0.7297297297297297,0.574468085106383,0.6428571428571429,0.7647058823529411,0.7470131303077251
0.7622950819672131,0.7567567567567568,0.5833333333333334,0.6588235294117648,0.7647058823529411,0.7607209366135691
0.7213114754098361,0.7837837837837838,0.5272727272727272,0.6304347826086956,0.6941176470588235,0.7375894222417114
0.7704918032786885,0.7027027027027027,0.6046511627906976,0.6499999999999999,0.8,0.7497747409470141
0.8114754098360656,0.8108108108108109,0.6521739130434783,0.7228915662650603,0.8117647058823529,0.8112876181503512
0.7704918032786885,0.7837837837837838,0.5918367346938775,0.6744186046511628,0.7647058823529411,0.7741860693349534
0.7295081967213115,0.7027027027027027,0.5416666666666666,0.611764705882353,0.7411764705882353,0.7216832470426366
0.7868852459016393,0.8108108108108109,0.6122448979591837,0.6976744186046512,0.7764705882352941,0.7934549434075044
0.7213114754098361,0.6756756756756757,0.5319148936170213,0.5952380952380952,0.7411764705882353,0.7076686460198859
0.7622950819672131,0.7027027027027027,0.5909090909090909,0.6419753086419754,0.788235294117647,0.7442412723990321
0.6967213114754098,0.5675675675675675,0.5,0.5316455696202531,0.7529411764705882,0.6537162932426225
0.8032786885245902,0.7027027027027027,0.6666666666666666,0.6842105263157895,0.8470588235294118,0.7715118434880242
0.7868852459016393,0.7837837837837838,0.6170212765957447,0.6904761904761905,0.788235294117647,0.7860063875920176
0.8114754098360656,0.8648648648648649,0.64,0.7356321839080459,0.788235294117647,0.8256615596773147
0.7950819672131147,0.7297297297297297,0.6428571428571429,0.6835443037974683,0.8235294117647058,0.7752121613284598
0.7786885245901639,0.8378378378378378,0.5961538461538461,0.6966292134831461,0.7529411764705882,0.7942560086730195
0.7868852459016393,0.8918918918918919,0.6,0.7173913043478262,0.7411764705882353,0.8130493740103958
0.7459016393442623,0.7837837837837838,0.5576923076923077,0.651685393258427,0.7294117647058823,0.756109193752849
0.7622950819672131,0.6486486486486487,0.6,0.6233766233766234,0.8117647058823529,0.725637705395231
0.7622950819672131,0.6756756756756757,0.5952380952380952,0.6329113924050633,0.8,0.7352146220938077
0.7704918032786885,0.5945945945945946,0.6285714285714286,0.611111111111111,0.8470588235294118,0.7096876762169714
0.7704918032786885,0.8108108108108109,0.5882352941176471,0.6818181818181819,0.7529411764705882,0.7813404160716144
0.7704918032786885,0.8108108108108109,0.5882352941176471,0.6818181818181819,0.7529411764705882,0.7813404160716144
0.7868852459016393,0.9459459459459459,0.5932203389830508,0.7291666666666666,0.7176470588235294,0.8239267721795119
0.7704918032786885,0.8648648648648649,0.5818181818181818,0.6956521739130435,0.7294117647058823,0.7942560086730195
0.7868852459016393,0.8108108108108109,0.6122448979591837,0.6976744186046512,0.7764705882352941,0.7934549434075044
0.7950819672131147,0.8108108108108109,0.625,0.7058823529411764,0.788235294117647,0.7994433675584702
0.7786885245901639,0.8378378378378378,0.5961538461538461,0.6966292134831461,0.7529411764705882,0.7942560086730195
0.7295081967213115,0.6756756756756757,0.5434782608695652,0.6024096385542168,0.7529411764705882,0.713262951621492
0.7622950819672131,0.8108108108108109,0.5769230769230769,0.6741573033707865,0.7411764705882353,0.7752121613284599
0.7704918032786885,0.7027027027027027,0.6046511627906976,0.6499999999999999,0.8,0.7497747409470141
0.8442622950819673,0.7567567567567568,0.7368421052631579,0.7466666666666667,0.8823529411764706,0.8171453665532781
0.7540983606557377,0.8108108108108109,0.5660377358490566,0.6666666666666667,0.7294117647058823,0.7690350735539445
0.7868852459016393,0.8378378378378378,0.6078431372549019,0.7045454545454545,0.7647058823529411,0.8004370825070913
0.7950819672131147,0.7837837837837838,0.6304347826086957,0.6987951807228915,0.8,0.7918503817180536
0.7704918032786885,0.8108108108108109,0.5882352941176471,0.6818181818181819,0.7529411764705882,0.7813404160716144
0.7786885245901639,0.7837837837837838,0.6041666666666666,0.6823529411764706,0.7764705882352941,0.7801186163936092
0.7704918032786885,0.7837837837837838,0.5918367346938775,0.6744186046511628,0.7647058823529411,0.7741860693349534
