,Accuracy,Recall,Precision,F1,Specificity
count,100.0,100.0,100.0,100.0,100.0
mean,0.5740983606557377,0.5127027027027027,0.3602032699945148,0.4194350797063832,0.6008235294117646
std,0.0466292018431264,0.10217510357764822,0.042781596416716375,0.053763685740098856,0.0853008582170695
min,0.4672131147540984,0.2972972972972973,0.275,0.2857142857142857,0.3764705882352941
25%,0.5409836065573771,0.4594594594594595,0.32718531468531464,0.38396715643906665,0.5411764705882353
50%,0.5737704918032787,0.5135135135135135,0.35924528301886793,0.425531914893617,0.6
75%,0.6065573770491803,0.5675675675675675,0.3866959064327485,0.4615384615384615,0.6588235294117647
max,0.6721311475409836,0.7837837837837838,0.4615384615384615,0.54,0.7647058823529411
