Accuracy,Sensitivity,Precision,F1,Specificity,G-Mean
0.8278688524590164,0.8028169014084507,0.890625,0.8444444444444446,0.8627450980392157,0.8322417595345557
0.7786885245901639,0.803030303030303,0.7910447761194029,0.7969924812030075,0.75,0.7760623217710851
0.7459016393442623,0.7096774193548387,0.7719298245614035,0.7394957983193277,0.7833333333333333,0.7455963911491416
0.8278688524590164,0.873015873015873,0.8088235294117647,0.8396946564885497,0.7796610169491526,0.8250190563667652
0.7868852459016393,0.8333333333333334,0.7258064516129032,0.7758620689655172,0.75,0.7905694150420949
0.7704918032786885,0.746031746031746,0.7966101694915254,0.7704918032786885,0.7966101694915254,0.7709062690446925
0.7377049180327869,0.7794117647058824,0.7571428571428571,0.7681159420289856,0.6851851851851852,0.7307813587766946
0.7868852459016393,0.7611940298507462,0.8360655737704918,0.796875,0.8181818181818182,0.7891736914852324
0.7786885245901639,0.8387096774193549,0.7536231884057971,0.7938931297709925,0.7166666666666667,0.77529044158767
0.7622950819672131,0.7254901960784313,0.7115384615384616,0.7184466019417477,0.7887323943661971,0.7564506721803762
0.8278688524590164,0.7931034482758621,0.8363636363636363,0.8141592920353982,0.859375,0.8255745126044463
0.7868852459016393,0.7083333333333334,0.9107142857142857,0.796875,0.9,0.7984359711335657
0.8114754098360656,0.7808219178082192,0.890625,0.8321167883211679,0.8571428571428571,0.8180928612021389
0.8114754098360656,0.75,0.8727272727272727,0.8067226890756303,0.8793103448275862,0.8120854380055645
0.819672131147541,0.7692307692307693,0.8771929824561403,0.819672131147541,0.8771929824561403,0.821440096816907
0.7459016393442623,0.7162162162162162,0.8412698412698413,0.7737226277372262,0.7916666666666666,0.7529970149373133
0.7540983606557377,0.8529411764705882,0.7435897435897436,0.7945205479452054,0.6296296296296297,0.7328281087929399
0.7950819672131147,0.8461538461538461,0.7857142857142857,0.8148148148148148,0.7368421052631579,0.7896086254446049
0.7868852459016393,0.8059701492537313,0.8059701492537313,0.8059701492537313,0.7636363636363637,0.7845177588656465
0.8360655737704918,0.8082191780821918,0.9076923076923077,0.8550724637681159,0.8775510204081632,0.8421719328257589
0.7377049180327869,0.7586206896551724,0.7096774193548387,0.7333333333333333,0.71875,0.7384162922699194
0.7868852459016393,0.7681159420289855,0.8412698412698413,0.8030303030303031,0.8113207547169812,0.7894228308055838
0.8032786885245902,0.8103448275862069,0.7833333333333333,0.7966101694915254,0.796875,0.8035816912316747
0.7540983606557377,0.7678571428571429,0.7166666666666667,0.7413793103448276,0.7424242424242424,0.7550336135403228
0.7704918032786885,0.803030303030303,0.7794117647058824,0.7910447761194029,0.7321428571428571,0.7667678269417023
0.7131147540983607,0.6911764705882353,0.7704918032786885,0.7286821705426356,0.7407407407407407,0.7155295736767979
0.8278688524590164,0.796875,0.864406779661017,0.8292682926829269,0.8620689655172413,0.8288312294409229
0.7459016393442623,0.6964285714285714,0.7358490566037735,0.7155963302752294,0.7878787878787878,0.7407437469876467
0.7213114754098361,0.7384615384615385,0.7384615384615385,0.7384615384615385,0.7017543859649122,0.7198740330653561
0.8032786885245902,0.746031746031746,0.8545454545454545,0.7966101694915254,0.864406779661017,0.8030410320227649
0.8032786885245902,0.7931034482758621,0.7931034482758621,0.7931034482758621,0.8125,0.8027431418107152
0.8360655737704918,0.8852459016393442,0.8059701492537313,0.84375,0.7868852459016393,0.8346178400890396
0.7950819672131147,0.8253968253968254,0.7878787878787878,0.8062015503875969,0.7627118644067796,0.7934355371256381
0.7704918032786885,0.8,0.75,0.7741935483870969,0.7419354838709677,0.7704209155369384
0.8524590163934426,0.8095238095238095,0.8947368421052632,0.8500000000000001,0.8983050847457628,0.8527598456294705
0.8278688524590164,0.7605633802816901,0.9310344827586207,0.8372093023255814,0.9215686274509803,0.837204485448851
0.7704918032786885,0.7627118644067796,0.7627118644067796,0.7627118644067796,0.7777777777777778,0.7702079842374077
0.8442622950819673,0.8571428571428571,0.84375,0.8503937007874015,0.8305084745762712,0.8437205738748232
0.8032786885245902,0.8225806451612904,0.796875,0.8095238095238094,0.7833333333333333,0.8027171598450338
0.7540983606557377,0.6984126984126984,0.8,0.7457627118644068,0.8135593220338984,0.753790528874236
0.7377049180327869,0.6551724137931034,0.76,0.7037037037037037,0.8125,0.7296078304177502
0.7540983606557377,0.7384615384615385,0.7868852459016393,0.7619047619047619,0.7719298245614035,0.7550102554468777
0.8032786885245902,0.746031746031746,0.8545454545454545,0.7966101694915254,0.864406779661017,0.8030410320227649
0.8032786885245902,0.7727272727272727,0.85,0.8095238095238095,0.8392857142857143,0.8053191671871228
0.7786885245901639,0.7678571428571429,0.7543859649122807,0.7610619469026548,0.7878787878787878,0.7778035452338559
0.7622950819672131,0.7121212121212122,0.8245614035087719,0.7642276422764227,0.8214285714285714,0.7648246269287555
0.7622950819672131,0.7741935483870968,0.7619047619047619,0.768,0.75,0.762000762001143
0.8032786885245902,0.75,0.9,0.8181818181818182,0.88,0.812403840463596
0.8032786885245902,0.7878787878787878,0.8387096774193549,0.8125,0.8214285714285714,0.8044788046842173
0.819672131147541,0.7966101694915254,0.8245614035087719,0.8103448275862069,0.8412698412698413,0.8186355177013009
0.8442622950819673,0.8059701492537313,0.9,0.8503937007874016,0.8909090909090909,0.8473760280840532
0.7786885245901639,0.8392857142857143,0.7230769230769231,0.7768595041322314,0.7272727272727273,0.7812743502698718
0.8032786885245902,0.8055555555555556,0.8529411764705882,0.8285714285714286,0.8,0.8027729719194864
0.819672131147541,0.8260869565217391,0.8507462686567164,0.838235294117647,0.8113207547169812,0.8186705644073637
0.7868852459016393,0.7868852459016393,0.7868852459016393,0.7868852459016392,0.7868852459016393,0.7868852459016393
0.7868852459016393,0.7916666666666666,0.8382352941176471,0.8142857142857143,0.78,0.7858116822750855
0.8032786885245902,0.8125,0.8125,0.8125,0.7931034482758621,0.8027431418107152
0.7622950819672131,0.7205882352941176,0.8305084745762712,0.7716535433070865,0.8148148148148148,0.7662545070007162
0.7950819672131147,0.8142857142857143,0.8260869565217391,0.8201438848920863,0.7692307692307693,0.7914376958255314
0.7950819672131147,0.8387096774193549,0.7761194029850746,0.8062015503875968,0.75,0.7931155389125321
0.7540983606557377,0.6923076923076923,0.8181818181818182,0.7500000000000001,0.8245614035087719,0.7555462940344223
0.819672131147541,0.8214285714285714,0.7931034482758621,0.8070175438596492,0.8181818181818182,0.8198035875000317
0.7540983606557377,0.7352941176470589,0.8064516129032258,0.7692307692307693,0.7777777777777778,0.7562376774775251
0.8360655737704918,0.8032786885245902,0.8596491228070176,0.8305084745762712,0.8688524590163934,0.8354224463108791
0.7868852459016393,0.7758620689655172,0.7758620689655172,0.7758620689655173,0.796875,0.7862983442732768
0.7540983606557377,0.7611940298507462,0.7846153846153846,0.7727272727272727,0.7454545454545455,0.753283180168721
0.7786885245901639,0.7681159420289855,0.828125,0.7969924812030075,0.7924528301886793,0.7801894976054939
0.8114754098360656,0.8194444444444444,0.855072463768116,0.8368794326241135,0.8,0.8096638534327413
0.7704918032786885,0.7794117647058824,0.803030303030303,0.7910447761194029,0.7592592592592593,0.7692695230727267
0.7622950819672131,0.6615384615384615,0.86,0.7478260869565216,0.8771929824561403,0.761772207478305
0.8524590163934426,0.75,0.96,0.8421052631578947,0.9655172413793104,0.8509629433967631
0.8114754098360656,0.7704918032786885,0.8392857142857143,0.8034188034188035,0.8524590163934426,0.8104398094628377
0.7213114754098361,0.6349206349206349,0.7843137254901961,0.7017543859649124,0.8135593220338984,0.7187110694092335
0.7786885245901639,0.765625,0.8032786885245902,0.784,0.7931034482758621,0.7792431119915061
0.7377049180327869,0.7288135593220338,0.7288135593220338,0.7288135593220338,0.746031746031746,0.7373723972272277
0.8114754098360656,0.7761194029850746,0.8666666666666667,0.8188976377952756,0.8545454545454545,0.814388916922024
0.819672131147541,0.8245614035087719,0.7966101694915254,0.8103448275862069,0.8153846153846154,0.8199601715089573
0.7540983606557377,0.7419354838709677,0.7666666666666667,0.7540983606557377,0.7666666666666667,0.7541997111515459
0.7049180327868853,0.6885245901639344,0.711864406779661,0.7,0.7213114754098361,0.7047273855804812
0.7295081967213115,0.6984126984126984,0.7586206896551724,0.7272727272727273,0.7627118644067796,0.7298545412146992
0.7459016393442623,0.6923076923076923,0.8035714285714286,0.7438016528925621,0.8070175438596491,0.7474653526694702
0.7786885245901639,0.7241379310344828,0.7924528301886793,0.7567567567567567,0.828125,0.7743879674542542
0.8442622950819673,0.7666666666666667,0.9019607843137255,0.8288288288288289,0.9193548387096774,0.8395467287038997
0.7950819672131147,0.7727272727272727,0.8360655737704918,0.8031496062992125,0.8214285714285714,0.7967058803223808
0.7704918032786885,0.8305084745762712,0.7313432835820896,0.7777777777777778,0.7142857142857143,0.7702079842374077
0.7459016393442623,0.7424242424242424,0.7777777777777778,0.7596899224806201,0.75,0.7462025072446365
0.7786885245901639,0.7377049180327869,0.8035714285714286,0.7692307692307693,0.819672131147541,0.7776092606971425
0.7622950819672131,0.6491228070175439,0.8043478260869565,0.7184466019417476,0.8615384615384616,0.7478263598639877
0.7786885245901639,0.7910447761194029,0.803030303030303,0.7969924812030075,0.7636363636363637,0.7772197606271743
0.7950819672131147,0.8225806451612904,0.7846153846153846,0.8031496062992126,0.7666666666666667,0.7941317027359648
0.8524590163934426,0.8648648648648649,0.8888888888888888,0.8767123287671232,0.8333333333333334,0.8489527199560178
0.8032786885245902,0.7647058823529411,0.8666666666666667,0.8125,0.8518518518518519,0.8071035385899118
0.7786885245901639,0.7936507936507936,0.78125,0.7874015748031497,0.7627118644067796,0.7780275551118464
0.7622950819672131,0.8484848484848485,0.7466666666666667,0.7943262411347518,0.6607142857142857,0.7487363091276265
0.7704918032786885,0.7538461538461538,0.8032786885245902,0.7777777777777778,0.7894736842105263,0.7714542762891773
0.7459016393442623,0.7164179104477612,0.8,0.7559055118110236,0.7818181818181819,0.7484040006361868
0.7540983606557377,0.7142857142857143,0.8333333333333334,0.7692307692307692,0.8076923076923077,0.75955452531275
0.7459016393442623,0.6875,0.8,0.7394957983193278,0.8103448275862069,0.7463994031117102
0.7704918032786885,0.696969696969697,0.8518518518518519,0.7666666666666667,0.8571428571428571,0.772918234616442
0.7622950819672131,0.7611940298507462,0.796875,0.7786259541984732,0.7636363636363637,0.7624142187662383
