Accuracy,Sensitivity,Precision,F1,Specificity,G-Mean
0.48360655737704916,1.0,0.48360655737704916,0.6519337016574586,0.0,0.0
0.4918032786885246,1.0,0.4918032786885246,0.6593406593406593,0.0,0.0
0.4426229508196721,0.6376811594202898,0.5057471264367817,0.5641025641025641,0.18867924528301888,0.3468676979636771
0.4918032786885246,1.0,0.4918032786885246,0.6593406593406593,0.0,0.0
0.5573770491803278,1.0,0.5537190082644629,0.7127659574468085,0.01818181818181818,0.13483997249264842
0.5081967213114754,1.0,0.5081967213114754,0.673913043478261,0.0,0.0
0.5409836065573771,1.0,0.5409836065573771,0.7021276595744682,0.0,0.0
0.45901639344262296,1.0,0.45901639344262296,0.6292134831460674,0.0,0.0
0.5573770491803278,1.0,0.5573770491803278,0.7157894736842105,0.0,0.0
0.5163934426229508,1.0,0.5163934426229508,0.6810810810810811,0.0,0.0
0.5655737704918032,1.0,0.5655737704918032,0.7225130890052355,0.0,0.0
0.48360655737704916,0.12857142857142856,0.8181818181818182,0.2222222222222222,0.9615384615384616,0.35160542320387156
0.48360655737704916,0.8260869565217391,0.5277777777777778,0.6440677966101694,0.03773584905660377,0.17655903460014033
0.5327868852459017,1.0,0.5327868852459017,0.6951871657754011,0.0,0.0
0.48360655737704916,1.0,0.48360655737704916,0.6519337016574586,0.0,0.0
0.5163934426229508,1.0,0.5163934426229508,0.6810810810810811,0.0,0.0
0.5,1.0,0.5,0.6666666666666666,0.0,0.0
0.4426229508196721,1.0,0.4426229508196721,0.6136363636363636,0.0,0.0
0.4918032786885246,1.0,0.4918032786885246,0.6593406593406593,0.0,0.0
0.48360655737704916,1.0,0.48360655737704916,0.6519337016574586,0.0,0.0
0.5081967213114754,1.0,0.5081967213114754,0.673913043478261,0.0,0.0
0.5491803278688525,1.0,0.5491803278688525,0.7089947089947091,0.0,0.0
0.47540983606557374,0.835820895522388,0.5137614678899083,0.6363636363636364,0.03636363636363636,0.17433727974792143
0.5409836065573771,1.0,0.5409836065573771,0.7021276595744682,0.0,0.0
0.47540983606557374,1.0,0.47540983606557374,0.6444444444444445,0.0,0.0
0.5409836065573771,1.0,0.5409836065573771,0.7021276595744682,0.0,0.0
0.4016393442622951,0.375,0.4909090909090909,0.42519685039370075,0.44,0.406201920231798
0.4672131147540984,1.0,0.4672131147540984,0.6368715083798883,0.0,0.0
0.48360655737704916,1.0,0.48360655737704916,0.6519337016574586,0.0,0.0
0.4098360655737705,0.2328767123287671,0.5151515151515151,0.320754716981132,0.673469387755102,0.3960244144929398
0.45081967213114754,0.8307692307692308,0.4909090909090909,0.6171428571428572,0.017543859649122806,0.12072654548783006
0.45901639344262296,0.828125,0.49074074074074076,0.6162790697674418,0.05172413793103448,0.20696388990386205
0.4672131147540984,1.0,0.4672131147540984,0.6368715083798883,0.0,0.0
0.47540983606557374,1.0,0.47540983606557374,0.6444444444444445,0.0,0.0
0.5245901639344263,1.0,0.5245901639344263,0.6881720430107526,0.0,0.0
0.5163934426229508,0.9264705882352942,0.5384615384615384,0.681081081081081,0.0,0.0
0.5327868852459017,1.0,0.5327868852459017,0.6951871657754011,0.0,0.0
0.5655737704918032,1.0,0.5655737704918032,0.7225130890052355,0.0,0.0
0.47540983606557374,1.0,0.47540983606557374,0.6444444444444445,0.0,0.0
0.5409836065573771,1.0,0.5409836065573771,0.7021276595744682,0.0,0.0
0.5081967213114754,1.0,0.5081967213114754,0.673913043478261,0.0,0.0
0.5901639344262295,1.0,0.5901639344262295,0.7422680412371134,0.0,0.0
0.5901639344262295,1.0,0.5901639344262295,0.7422680412371134,0.0,0.0
0.5245901639344263,1.0,0.5245901639344263,0.6881720430107526,0.0,0.0
0.5491803278688525,1.0,0.5491803278688525,0.7089947089947091,0.0,0.0
0.5409836065573771,1.0,0.5409836065573771,0.7021276595744682,0.0,0.0
0.5245901639344263,1.0,0.5245901639344263,0.6881720430107526,0.0,0.0
0.5081967213114754,1.0,0.5081967213114754,0.673913043478261,0.0,0.0
0.5327868852459017,1.0,0.5327868852459017,0.6951871657754011,0.0,0.0
0.5409836065573771,1.0,0.5409836065573771,0.7021276595744682,0.0,0.0
0.4918032786885246,1.0,0.4918032786885246,0.6593406593406593,0.0,0.0
0.4426229508196721,0.5070422535211268,0.5217391304347826,0.5142857142857142,0.35294117647058826,0.4230320194477538
0.5163934426229508,1.0,0.5163934426229508,0.6810810810810811,0.0,0.0
0.4426229508196721,1.0,0.4426229508196721,0.6136363636363636,0.0,0.0
0.5655737704918032,1.0,0.5655737704918032,0.7225130890052355,0.0,0.0
0.47540983606557374,1.0,0.47540983606557374,0.6444444444444445,0.0,0.0
0.5573770491803278,1.0,0.5573770491803278,0.7157894736842105,0.0,0.0
0.45901639344262296,1.0,0.45901639344262296,0.6292134831460674,0.0,0.0
0.5491803278688525,0.9850746268656716,0.55,0.7058823529411764,0.01818181818181818,0.13382992102364116
0.6147540983606558,1.0,0.6147540983606558,0.7614213197969544,0.0,0.0
0.5327868852459017,1.0,0.5327868852459017,0.6951871657754011,0.0,0.0
0.4344262295081967,0.7246376811594203,0.5,0.5917159763313609,0.05660377358490566,0.2025271024713455
0.5737704918032787,1.0,0.5737704918032787,0.7291666666666666,0.0,0.0
0.47540983606557374,1.0,0.47540983606557374,0.6444444444444445,0.0,0.0
0.4426229508196721,1.0,0.4426229508196721,0.6136363636363636,0.0,0.0
0.4918032786885246,1.0,0.4918032786885246,0.6593406593406593,0.0,0.0
0.5409836065573771,1.0,0.5409836065573771,0.7021276595744682,0.0,0.0
0.45081967213114754,1.0,0.45081967213114754,0.6214689265536724,0.0,0.0
0.5081967213114754,1.0,0.5081967213114754,0.673913043478261,0.0,0.0
0.47540983606557374,0.8923076923076924,0.5043478260869565,0.6444444444444444,0.0,0.0
0.5327868852459017,1.0,0.5327868852459017,0.6951871657754011,0.0,0.0
0.4918032786885246,1.0,0.4918032786885246,0.6593406593406593,0.0,0.0
0.48360655737704916,1.0,0.48360655737704916,0.6519337016574586,0.0,0.0
0.47540983606557374,0.8615384615384616,0.5045045045045045,0.6363636363636364,0.03508771929824561,0.17386609704914846
0.48360655737704916,0.8656716417910447,0.5178571428571429,0.6480446927374302,0.01818181818181818,0.1254571018165206
0.5491803278688525,1.0,0.5491803278688525,0.7089947089947091,0.0,0.0
0.4918032786885246,0.9836065573770492,0.49586776859504134,0.6593406593406594,0.0,0.0
0.5327868852459017,1.0,0.5327868852459017,0.6951871657754011,0.0,0.0
0.4918032786885246,1.0,0.4918032786885246,0.6593406593406593,0.0,0.0
0.5737704918032787,1.0,0.5737704918032787,0.7291666666666666,0.0,0.0
0.5163934426229508,1.0,0.5163934426229508,0.6810810810810811,0.0,0.0
0.5081967213114754,1.0,0.5081967213114754,0.673913043478261,0.0,0.0
0.4426229508196721,0.8253968253968254,0.47706422018348627,0.6046511627906977,0.03389830508474576,0.16727089825574026
0.4918032786885246,1.0,0.4918032786885246,0.6593406593406593,0.0,0.0
0.47540983606557374,1.0,0.47540983606557374,0.6444444444444445,0.0,0.0
0.4426229508196721,1.0,0.4426229508196721,0.6136363636363636,0.0,0.0
0.5081967213114754,1.0,0.5081967213114754,0.673913043478261,0.0,0.0
0.45901639344262296,0.8615384615384616,0.49557522123893805,0.6292134831460675,0.0,0.0
0.48360655737704916,0.14285714285714285,0.7692307692307693,0.24096385542168672,0.9423076923076923,0.3668996928526714
0.47540983606557374,1.0,0.47540983606557374,0.6444444444444445,0.0,0.0
0.45901639344262296,1.0,0.45901639344262296,0.6292134831460674,0.0,0.0
0.5081967213114754,1.0,0.5081967213114754,0.673913043478261,0.0,0.0
0.45901639344262296,1.0,0.45901639344262296,0.6292134831460674,0.0,0.0
0.5573770491803278,1.0,0.5573770491803278,0.7157894736842105,0.0,0.0
0.5163934426229508,1.0,0.5163934426229508,0.6810810810810811,0.0,0.0
0.5,0.8142857142857143,0.5428571428571428,0.6514285714285714,0.07692307692307693,0.2502745744924215
0.47540983606557374,1.0,0.47540983606557374,0.6444444444444445,0.0,0.0
0.5245901639344263,1.0,0.5245901639344263,0.6881720430107526,0.0,0.0
0.5,1.0,0.5,0.6666666666666666,0.0,0.0
0.45081967213114754,1.0,0.45081967213114754,0.6214689265536724,0.0,0.0
