Accuracy,Sensitivity,Precision,F1,Specificity,G-Mean
0.5245901639344263,0.6216216216216216,0.34328358208955223,0.4423076923076923,0.4823529411764706,0.5475774077590092
0.5163934426229508,0.5135135135135135,0.31666666666666665,0.39175257731958757,0.5176470588235295,0.515576143684332
0.6639344262295082,0.43243243243243246,0.4444444444444444,0.4383561643835616,0.7647058823529411,0.5750509758284668
0.5409836065573771,0.4594594594594595,0.32075471698113206,0.37777777777777777,0.5764705882352941,0.5146502354656655
0.4918032786885246,0.5405405405405406,0.3076923076923077,0.39215686274509803,0.47058823529411764,0.5043530698606894
0.6065573770491803,0.43243243243243246,0.37209302325581395,0.4,0.6823529411764706,0.5432048804368069
0.5655737704918032,0.43243243243243246,0.3333333333333333,0.3764705882352941,0.6235294117647059,0.5192632667757037
0.5573770491803278,0.6756756756756757,0.373134328358209,0.4807692307692308,0.5058823529411764,0.5846472446150157
0.5573770491803278,0.4864864864864865,0.33962264150943394,0.39999999999999997,0.5882352941176471,0.5349472137161191
0.4672131147540984,0.4864864864864865,0.28125,0.3564356435643565,0.4588235294117647,0.4724525867649139
0.6229508196721312,0.24324324324324326,0.3333333333333333,0.28125,0.788235294117647,0.43787316585966785
0.5573770491803278,0.5945945945945946,0.36065573770491804,0.44897959183673464,0.5411764705882353,0.5672570882179837
0.6557377049180327,0.2972972972972973,0.4074074074074074,0.34375,0.8117647058823529,0.49125904887356425
0.5737704918032787,0.3783783783783784,0.32558139534883723,0.35000000000000003,0.6588235294117647,0.4992840661350444
0.5,0.43243243243243246,0.2857142857142857,0.34408602150537637,0.5294117647058824,0.47847133369734
0.5327868852459017,0.5405405405405406,0.3333333333333333,0.41237113402061853,0.5294117647058824,0.534947213716119
0.5163934426229508,0.6216216216216216,0.3382352941176471,0.4380952380952381,0.47058823529411764,0.5408584121002341
0.5245901639344263,0.43243243243243246,0.3018867924528302,0.3555555555555556,0.5647058823529412,0.4941630685459865
0.5573770491803278,0.6216216216216216,0.36507936507936506,0.46,0.5294117647058824,0.5736669762867956
0.5163934426229508,0.32432432432432434,0.2608695652173913,0.2891566265060241,0.6,0.44112877325628463
0.5655737704918032,0.5135135135135135,0.35185185185185186,0.4175824175824176,0.5882352941176471,0.5496060158468136
0.5819672131147541,0.7567567567567568,0.4,0.5233644859813084,0.5058823529411764,0.6187324855801913
0.5081967213114754,0.5405405405405406,0.31746031746031744,0.4,0.49411764705882355,0.5168081075523066
0.5491803278688525,0.4864864864864865,0.3333333333333333,0.3956043956043956,0.5764705882352941,0.5295707233537238
0.5491803278688525,0.6486486486486487,0.36363636363636365,0.4660194174757281,0.5058823529411764,0.5728349715323715
0.5327868852459017,0.4594594594594595,0.3148148148148148,0.37362637362637363,0.5647058823529412,0.5093716319736107
0.5573770491803278,0.6756756756756757,0.373134328358209,0.4807692307692308,0.5058823529411764,0.5846472446150157
0.5081967213114754,0.3783783783783784,0.27450980392156865,0.3181818181818182,0.5647058823529412,0.462247223923992
0.5901639344262295,0.3783783783783784,0.34146341463414637,0.35897435897435903,0.6823529411764706,0.5081216383545085
0.5163934426229508,0.4594594594594595,0.30357142857142855,0.3655913978494624,0.5411764705882353,0.4986468175458945
0.4672131147540984,0.35135135135135137,0.24074074074074073,0.2857142857142857,0.5176470588235295,0.42646921769419605
0.5819672131147541,0.6486486486486487,0.3870967741935484,0.48484848484848475,0.5529411764705883,0.5988860884173559
0.5901639344262295,0.2972972972972973,0.3142857142857143,0.3055555555555555,0.7176470588235294,0.4619031619307123
0.6229508196721312,0.32432432432432434,0.36363636363636365,0.34285714285714286,0.7529411764705882,0.4941630685459865
0.5409836065573771,0.2972972972972973,0.2682926829268293,0.28205128205128205,0.6470588235294118,0.438598722555895
0.5737704918032787,0.4594594594594595,0.3469387755102041,0.3953488372093023,0.6235294117647059,0.5352443241048769
0.5819672131147541,0.5405405405405406,0.37037037037037035,0.4395604395604396,0.6,0.5694947974514994
0.5901639344262295,0.5405405405405406,0.37735849056603776,0.4444444444444445,0.611764705882353,0.5750509758284668
0.5163934426229508,0.5405405405405406,0.3225806451612903,0.4040404040404041,0.5058823529411764,0.5229243927268492
0.5409836065573771,0.4594594594594595,0.32075471698113206,0.37777777777777777,0.5764705882352941,0.5146502354656655
0.6147540983606558,0.35135135135135137,0.3611111111111111,0.3561643835616438,0.7294117647058823,0.5062408608765058
0.5,0.40540540540540543,0.2777777777777778,0.3296703296703297,0.5411764705882353,0.46839712472931555
0.5491803278688525,0.6756756756756757,0.36764705882352944,0.4761904761904762,0.49411764705882355,0.57780902990499
0.5409836065573771,0.7027027027027027,0.36619718309859156,0.4814814814814815,0.47058823529411764,0.5750509758284668
0.5163934426229508,0.5135135135135135,0.31666666666666665,0.39175257731958757,0.5176470588235295,0.515576143684332
0.6147540983606558,0.4594594594594595,0.38636363636363635,0.41975308641975306,0.6823529411764706,0.5599227745979918
0.5573770491803278,0.5945945945945946,0.36065573770491804,0.44897959183673464,0.5411764705882353,0.5672570882179837
0.639344262295082,0.4594594594594595,0.4146341463414634,0.4358974358974359,0.7176470588235294,0.5742209763929995
0.5245901639344263,0.40540540540540543,0.29411764705882354,0.34090909090909094,0.5764705882352941,0.48342971829193737
0.5163934426229508,0.4594594594594595,0.30357142857142855,0.3655913978494624,0.5411764705882353,0.4986468175458945
0.5655737704918032,0.5135135135135135,0.35185185185185186,0.4175824175824176,0.5882352941176471,0.5496060158468136
0.5327868852459017,0.5135135135135135,0.3275862068965517,0.4,0.5411764705882353,0.5271635712400917
0.5,0.4594594594594595,0.29310344827586204,0.35789473684210527,0.5176470588235295,0.48768620837362
0.4672131147540984,0.5675675675675675,0.3,0.39252336448598124,0.4235294117647059,0.49028721993196683
0.5081967213114754,0.40540540540540543,0.2830188679245283,0.33333333333333337,0.5529411764705883,0.4734610245969574
0.5,0.5135135135135135,0.3064516129032258,0.3838383838383838,0.49411764705882355,0.5037222340042244
0.5327868852459017,0.2702702702702703,0.25,0.25974025974025977,0.6470588235294118,0.41818747364795283
0.6229508196721312,0.1891891891891892,0.30434782608695654,0.23333333333333334,0.8117647058823529,0.39188915080451386
0.5409836065573771,0.6486486486486487,0.3582089552238806,0.46153846153846156,0.49411764705882355,0.5661349168159087
0.5245901639344263,0.5405405405405406,0.32786885245901637,0.4081632653061225,0.5176470588235295,0.5289699622716696
0.5491803278688525,0.6756756756756757,0.36764705882352944,0.4761904761904762,0.49411764705882355,0.57780902990499
0.5163934426229508,0.5945945945945946,0.3333333333333333,0.42718446601941745,0.4823529411764706,0.5355412696612035
0.5409836065573771,0.5405405405405406,0.3389830508474576,0.4166666666666667,0.5411764705882353,0.5408584121002341
0.5655737704918032,0.43243243243243246,0.3333333333333333,0.3764705882352941,0.6235294117647059,0.5192632667757037
0.4918032786885246,0.4594594594594595,0.288135593220339,0.35416666666666663,0.5058823529411764,0.48211246865480717
0.5655737704918032,0.2972972972972973,0.2894736842105263,0.29333333333333333,0.6823529411764706,0.4504016931746887
0.48360655737704916,0.4864864864864865,0.2903225806451613,0.36363636363636365,0.4823529411764706,0.48441530487729645
0.4918032786885246,0.5405405405405406,0.3076923076923077,0.39215686274509803,0.47058823529411764,0.5043530698606894
0.5737704918032787,0.5405405405405406,0.36363636363636365,0.4347826086956522,0.5882352941176471,0.563883874434601
0.5737704918032787,0.6216216216216216,0.3770491803278688,0.4693877551020408,0.5529411764705883,0.5862765480377109
0.5737704918032787,0.2702702702702703,0.2857142857142857,0.2777777777777778,0.7058823529411765,0.43678257097602474
0.47540983606557374,0.3783783783783784,0.2545454545454545,0.3043478260869565,0.5176470588235295,0.44256802266994405
0.5491803278688525,0.5945945945945946,0.3548387096774194,0.4444444444444445,0.5294117647058824,0.5610573710494346
0.5327868852459017,0.5405405405405406,0.3333333333333333,0.41237113402061853,0.5294117647058824,0.534947213716119
0.5245901639344263,0.5135135135135135,0.3220338983050847,0.3958333333333333,0.5294117647058824,0.5214020477419581
0.5409836065573771,0.5405405405405406,0.3389830508474576,0.4166666666666667,0.5411764705882353,0.5408584121002341
0.5573770491803278,0.40540540540540543,0.3191489361702128,0.35714285714285715,0.6235294117647059,0.5027744961298898
0.5737704918032787,0.5945945945945946,0.3728813559322034,0.45833333333333337,0.5647058823529412,0.5794575611577002
0.5819672131147541,0.5945945945945946,0.3793103448275862,0.4631578947368421,0.5764705882352941,0.585462463107134
0.48360655737704916,0.5945945945945946,0.3142857142857143,0.411214953271028,0.43529411764705883,0.5087470190691683
0.5737704918032787,0.40540540540540543,0.3333333333333333,0.36585365853658536,0.6470588235294118,0.5121729636305355
0.5573770491803278,0.6486486486486487,0.36923076923076925,0.47058823529411764,0.5176470588235295,0.5794575611577003
0.5245901639344263,0.8108108108108109,0.37037037037037035,0.5084745762711864,0.4,0.5694947974514994
0.5983606557377049,0.4864864864864865,0.375,0.42352941176470593,0.6470588235294118,0.5610573710494348
0.4918032786885246,0.5135135135135135,0.30158730158730157,0.37999999999999995,0.4823529411764706,0.49768941477301537
0.5655737704918032,0.2972972972972973,0.2894736842105263,0.29333333333333333,0.6823529411764706,0.4504016931746887
0.5655737704918032,0.24324324324324326,0.2647058823529412,0.25352112676056343,0.7058823529411765,0.4143683299645178
0.5491803278688525,0.5135135135135135,0.3392857142857143,0.40860215053763443,0.5647058823529412,0.5385017193554795
0.5409836065573771,0.4864864864864865,0.32727272727272727,0.391304347826087,0.5647058823529412,0.5241390851712296
0.5409836065573771,0.2702702702702703,0.2564102564102564,0.2631578947368421,0.6588235294117647,0.42197205281218686
0.5163934426229508,0.5405405405405406,0.3225806451612903,0.4040404040404041,0.5058823529411764,0.5229243927268492
0.5655737704918032,0.5945945945945946,0.36666666666666664,0.4536082474226804,0.5529411764705883,0.5733897755089357
0.5655737704918032,0.4594594594594595,0.34,0.39080459770114945,0.611764705882353,0.5301708036860207
0.5737704918032787,0.4864864864864865,0.35294117647058826,0.40909090909090917,0.611764705882353,0.5455412562961162
0.6065573770491803,0.32432432432432434,0.34285714285714286,0.33333333333333337,0.7294117647058823,0.486380486597117
0.5737704918032787,0.5405405405405406,0.36363636363636365,0.4347826086956522,0.5882352941176471,0.563883874434601
0.5573770491803278,0.6756756756756757,0.373134328358209,0.4807692307692308,0.5058823529411764,0.5846472446150157
0.5245901639344263,0.2972972972972973,0.2558139534883721,0.275,0.6235294117647059,0.430550355827307
0.5901639344262295,0.6756756756756757,0.3968253968253968,0.5,0.5529411764705883,0.6112355544474386
0.5327868852459017,0.4594594594594595,0.3148148148148148,0.37362637362637363,0.5647058823529412,0.5093716319736107
