,Accuracy,Sensitivity,Precision,F1,Specificity,G-Mean
count,100.0,100.0,100.0,100.0,100.0,100.0
mean,0.795327868852459,0.7918918918918919,0.6317330908002009,0.7011928361909875,0.7968235294117646,0.7932409070282795
std,0.03528823653135573,0.06941243331829665,0.05171619893617586,0.04935247982594213,0.042363998028566476,0.040265676157682076
min,0.7213114754098361,0.6216216216216216,0.5263157894736842,0.5897435897435899,0.6823529411764706,0.6999886440141779
25%,0.7704918032786885,0.7567567567567568,0.5918367346938775,0.6666666666666666,0.7647058823529411,0.7677933570631503
50%,0.7950819672131147,0.8108108108108109,0.6276789785681715,0.7052139037433154,0.8,0.7963539138948588
75%,0.819672131147541,0.8378378378378378,0.6735803016858917,0.7380952380952381,0.8352941176470589,0.8229614212069194
max,0.8934426229508197,0.945945945945946,0.7857142857142857,0.8354430379746834,0.8941176470588236,0.8930040760316948
