<svg id="Outlined" xmlns="http://www.w3.org/2000/svg" width="178" height="161.085" viewBox="0 0 178 161.085">
  <g id="Group_1" data-name="Group 1">
    <rect id="Rectangle_1" data-name="Rectangle 1" width="5.753" height="25.749" transform="translate(147.895 77.117) rotate(-54.09)"/>
    <rect id="Rectangle_2" data-name="Rectangle 2" width="25.749" height="5.753" transform="translate(147.893 37.939) rotate(-35.906)"/>
    <rect id="Rectangle_3" data-name="Rectangle 3" width="23" height="5" transform="translate(155 54.988)"/>
    <path id="Path_1" data-name="Path 1" d="M132.321,122.75c-26.5-25.965-40.559-31.528-63.284-31.931V56.244c22.725-.4,36.782-5.962,63.284-31.924V56.272h5.753V20.278a3.975,3.975,0,0,0-2.336-4,4.372,4.372,0,0,0-4.732,1.251C102.453,46.079,89.467,50.188,69.037,50.5V48.721a3.96,3.96,0,0,0-3.955-3.955H15.461a3.96,3.96,0,0,0-3.955,3.955v1.8H3.955A3.96,3.96,0,0,0,0,54.475V92.589a3.96,3.96,0,0,0,3.955,3.955h7.551v1.8a3.96,3.96,0,0,0,3.955,3.955h7.752l5.149,58.848A17.467,17.467,0,0,0,45.73,177.088q.773,0,1.552-.068l5.812-.508A17.483,17.483,0,0,0,68.97,157.592L64.132,102.3h.95a3.96,3.96,0,0,0,3.955-3.955V96.567c20.426.308,33.411,4.418,61.968,32.976a5,5,0,0,0,3.475,1.518,3.774,3.774,0,0,0,1.446-.279,3.467,3.467,0,0,0,2.148-3.271V90.791h-5.753ZM5.753,90.791V56.272h5.753V90.791ZM17.259,50.519H63.284V96.544H17.259ZM63.238,158.093a11.711,11.711,0,0,1-10.645,12.687l-5.812.508a11.71,11.71,0,0,1-12.686-10.646L28.989,102.3H58.357Z" transform="translate(0 -16.003)"/>
    <circle id="Ellipse_1" data-name="Ellipse 1" cx="11.5" cy="11.5" r="11.5" transform="translate(124 45.988)" fill="#0a32ff"/>
  </g>
</svg>
