{
  "$schema": "http://json-schema.org/schema",
  "$id": "NestjsResourceSchematic",
  "title": "NestJS Resource Options Schema",
  "type": "object",
  "properties": {
    "appRootPath": {
      "type": "string",
      "description": "App root path",
      "$default": {
        "$source": "argv",
        "index": 0
      },
      "x-prompt": "App root path?"
    },
    "moduleName": {
      "type": "string",
      "description": "Module name",
      "$default": {
        "$source": "argv",
        "index": 1
      },
      "x-prompt": "Module name?"
    },
    "resourceName": {
      "type": "string",
      "description": "Resource name",
      "$default": {
        "$source": "argv",
        "index": 2
      },
      "x-prompt": "Name of the resource (singular, e.g., \"user\")?"
    },
    "createRepositoryType": {
      "type": "string",
      "description": "Type of repository to create",
      "default": "none",
      "enum": [
        "none",
        "postgres",
        "custom"
      ],
      "x-prompt": "Do you want to create repository? Select type"
    },
    "createResolver": {
      "type": "boolean",
      "description": "Create resolver?",
      "default": false,
      "x-prompt": "Do you want to create resolver?"
    }
  },
  "required": ["appRootPath", "moduleName"]
}
