{
  "$schema": "http://json-schema.org/schema",
  "$id": "NestjsResolverSchematic",
  "title": "NestJS Resolver Options Schema",
  "type": "object",
  "properties": {
    "appRootPath": {
      "type": "string",
      "description": "App root path",
      "$default": {
        "$source": "argv",
        "index": 0
      },
      "x-prompt": "App root path?"
    },
    "moduleName": {
      "type": "string",
      "description": "Module name",
      "$default": {
        "$source": "argv",
        "index": 1
      },
      "x-prompt": "Module name?"
    },
    "resourceName": {
      "type": "string",
      "description": "Resource name",
      "$default": {
        "$source": "argv",
        "index": 2
      },
      "x-prompt": "Name of the resource (singular, e.g., \"user\")?"
    }
  },
  "required": ["appRootPath", "moduleName"]
}
