{
    "project_info": {
        "project_number": "871307577977",
        "project_id": "db-1step",
        "storage_bucket": "db-1step.appspot.com"
    },
    "client": [{
        "client_info": {
            "mobilesdk_app_id": "1:871307577977:android:1e841e10f9e1160b60e2a8",
            "android_client_info": {
                "package_name": "com.example.plantilla"
            }
        },
        "oauth_client": [{
                "client_id": "871307577977-7smpc0otqgb8rkodj97v4jlf14cbm2ja.apps.googleusercontent.com",
                "client_type": 1,
                "android_info": {
                    "package_name": "com.example.plantilla",
                    "certificate_hash": "28e2e203a4107a23ca2f5c3d9df8f9a824d0c4e3"
                }
            },
            {
                "client_id": "871307577977-5stmjpl02f97blntffkqljfbek70e66p.apps.googleusercontent.com",
                "client_type": 3
            }
        ],
        "api_key": [{
            "current_key": "AIzaSyD0YDgEAEewUEb_OlZEi92PsZnwOGkusKA"
        }],
        "services": {
            "appinvite_service": {
                "other_platform_oauth_client": [{
                    "client_id": "871307577977-5stmjpl02f97blntffkqljfbek70e66p.apps.googleusercontent.com",
                    "client_type": 3
                }]
            }
        }
    }],
    "configuration_version": "1"
}