{
	"variables": [],
	"info": {
		"name": "API NODE",
		"_postman_id": "d4bf193b-8352-f993-9dc1-ca19fb26fc37",
		"description": "",
		"schema": "https://schema.getpostman.com/json/collection/v2.0.0/collection.json"
	},
	"item": [
		{
			"name": "Buscando todos alunos",
			"request": {
				"url": "localhost:4004/api/alunos",
				"method": "GET",
				"header": [],
				"body": {},
				"description": ""
			},
			"response": []
		},
		{
			"name": "Criando novo aluno",
			"request": {
				"url": "localhost:4004/api/alunos",
				"method": "POST",
				"header": [
					{
						"key": "Content-Type",
						"value": "application/x-www-form-urlencoded",
						"description": ""
					}
				],
				"body": {
					"mode": "urlencoded",
					"urlencoded": [
						{
							"key": "nome",
							"value": "Bruno Nogueira de Oliveira",
							"description": "",
							"type": "text"
						},
						{
							"key": "matricula",
							"value": "1",
							"description": "",
							"type": "text"
						}
					]
				},
				"description": ""
			},
			"response": []
		},
		{
			"name": "Buscando aluno por identificador",
			"request": {
				"url": {
					"raw": "localhost:4004/api/alunos/:id",
					"host": [
						"localhost"
					],
					"port": "4004",
					"path": [
						"api",
						"alunos",
						":id"
					],
					"query": [],
					"variable": [
						{
							"key": "id",
							"value": "59d8e1d70fab264923602789"
						}
					]
				},
				"method": "GET",
				"header": [],
				"body": {},
				"description": ""
			},
			"response": []
		},
		{
			"name": "Atualizando aluno por identificador",
			"request": {
				"url": {
					"raw": "localhost:4004/api/alunos/:id",
					"host": [
						"localhost"
					],
					"port": "4004",
					"path": [
						"api",
						"alunos",
						":id"
					],
					"query": [],
					"variable": [
						{
							"key": "id",
							"value": "59d8e1d70fab264923602789"
						}
					]
				},
				"method": "PUT",
				"header": [
					{
						"key": "Content-Type",
						"value": "application/x-www-form-urlencoded",
						"description": ""
					}
				],
				"body": {
					"mode": "urlencoded",
					"urlencoded": [
						{
							"key": "matricula",
							"value": "654321",
							"description": "",
							"type": "text"
						},
						{
							"key": "nome",
							"value": "José Maria",
							"description": "",
							"type": "text"
						}
					]
				},
				"description": ""
			},
			"response": []
		},
		{
			"name": "Apagando aluno por identificador.",
			"request": {
				"url": {
					"raw": "localhost:4004/api/alunos/:id",
					"host": [
						"localhost"
					],
					"port": "4004",
					"path": [
						"api",
						"alunos",
						":id"
					],
					"query": [],
					"variable": [
						{
							"key": "id",
							"value": "59d8e1d70fab264923602789"
						}
					]
				},
				"method": "DELETE",
				"header": [],
				"body": {},
				"description": ""
			},
			"response": []
		}
	]
}