/home/luisa/ufcg/leda/r12/src/test/java/adt/heap/FloorCeilTest.java
/home/luisa/ufcg/leda/r12/src/test/java/adt/heap/StudentMinHeapTest.java
/home/luisa/ufcg/leda/r12/src/test/java/adt/heap/StudentMaxHeapTest.java
/home/luisa/ufcg/leda/r12/src/test/java/adt/heap/OrderStatisticsTest.java
