-------------------------------------------------------------------------------
Test set: adt.queue.QueueTest
-------------------------------------------------------------------------------
Tests run: 9, Failures: 0, Errors: 0, Skipped: 0, Time elapsed: 0.009 s -- in adt.queue.QueueTest
