
{
  "header": {
    "reportVersion": 1,
    "event": "Allocation failed - JavaScript heap out of memory",
    "trigger": "FatalError",
    "filename": "report.20220408.200707.18128.0.001.json",
    "dumpEventTime": "2022-04-08T20:07:07Z",
    "dumpEventTimeStamp": "1649428627011",
    "processId": 18128,
    "cwd": "C:\\Users\\DELL\\Desktop\\Coursers\\AngularCourses\\AngularFrontend\\angularfrontend",
    "commandLine": [
      "node",
      "C:\\Users\\DELL\\Desktop\\Coursers\\AngularCourses\\AngularFrontend\\angularfrontend\\node_modules\\.bin\\\\..\\lite-server\\bin\\lite-server"
    ],
    "nodejsVersion": "v12.14.1",
    "wordSize": 64,
    "arch": "x64",
    "platform": "win32",
    "componentVersions": {
      "node": "12.14.1",
      "v8": "7.7.299.13-node.16",
      "uv": "1.33.1",
      "zlib": "1.2.11",
      "brotli": "1.0.7",
      "ares": "1.15.0",
      "modules": "72",
      "nghttp2": "1.40.0",
      "napi": "5",
      "llhttp": "2.0.1",
      "http_parser": "2.8.0",
      "openssl": "1.1.1d",
      "cldr": "35.1",
      "icu": "64.2",
      "tz": "2019c",
      "unicode": "12.1"
    },
    "release": {
      "name": "node",
      "lts": "Erbium",
      "headersUrl": "https://nodejs.org/download/release/v12.14.1/node-v12.14.1-headers.tar.gz",
      "sourceUrl": "https://nodejs.org/download/release/v12.14.1/node-v12.14.1.tar.gz",
      "libUrl": "https://nodejs.org/download/release/v12.14.1/win-x64/node.lib"
    },
    "osName": "Windows_NT",
    "osRelease": "10.0.22000",
    "osVersion": "Windows 10 Home Single Language",
    "osMachine": "x86_64",
    "cpus": [
      {
        "model": "AMD Ryzen 5 4600H with Radeon Graphics         ",
        "speed": 2994,
        "user": 4423187,
        "nice": 0,
        "sys": 2415000,
        "idle": 52262234,
        "irq": 428234
      },
      {
        "model": "AMD Ryzen 5 4600H with Radeon Graphics         ",
        "speed": 2994,
        "user": 2609125,
        "nice": 0,
        "sys": 769250,
        "idle": 55721921,
        "irq": 18343
      },
      {
        "model": "AMD Ryzen 5 4600H with Radeon Graphics         ",
        "speed": 2994,
        "user": 5895500,
        "nice": 0,
        "sys": 1644156,
        "idle": 51560640,
        "irq": 38375
      },
      {
        "model": "AMD Ryzen 5 4600H with Radeon Graphics         ",
        "speed": 2994,
        "user": 2371187,
        "nice": 0,
        "sys": 737140,
        "idle": 55991968,
        "irq": 17890
      },
      {
        "model": "AMD Ryzen 5 4600H with Radeon Graphics         ",
        "speed": 2994,
        "user": 4090062,
        "nice": 0,
        "sys": 1264406,
        "idle": 53745828,
        "irq": 32625
      },
      {
        "model": "AMD Ryzen 5 4600H with Radeon Graphics         ",
        "speed": 2994,
        "user": 2596281,
        "nice": 0,
        "sys": 730859,
        "idle": 55773156,
        "irq": 19765
      },
      {
        "model": "AMD Ryzen 5 4600H with Radeon Graphics         ",
        "speed": 2994,
        "user": 4151734,
        "nice": 0,
        "sys": 1271593,
        "idle": 53676968,
        "irq": 33453
      },
      {
        "model": "AMD Ryzen 5 4600H with Radeon Graphics         ",
        "speed": 2994,
        "user": 2665625,
        "nice": 0,
        "sys": 535031,
        "idle": 55899640,
        "irq": 13093
      },
      {
        "model": "AMD Ryzen 5 4600H with Radeon Graphics         ",
        "speed": 2994,
        "user": 4475609,
        "nice": 0,
        "sys": 1665109,
        "idle": 52959578,
        "irq": 45187
      },
      {
        "model": "AMD Ryzen 5 4600H with Radeon Graphics         ",
        "speed": 2994,
        "user": 1526390,
        "nice": 0,
        "sys": 586203,
        "idle": 56987687,
        "irq": 16875
      },
      {
        "model": "AMD Ryzen 5 4600H with Radeon Graphics         ",
        "speed": 2994,
        "user": 2961125,
        "nice": 0,
        "sys": 1133765,
        "idle": 55005390,
        "irq": 39750
      },
      {
        "model": "AMD Ryzen 5 4600H with Radeon Graphics         ",
        "speed": 2994,
        "user": 1911937,
        "nice": 0,
        "sys": 769984,
        "idle": 56418359,
        "irq": 31109
      }
    ],
    "networkInterfaces": [
      {
        "name": "Wi-Fi",
        "internal": false,
        "mac": "68:54:5a:53:dd:9c",
        "address": "fe80::6034:973c:a3ee:1d04",
        "netmask": "ffff:ffff:ffff:ffff::",
        "family": "IPv6",
        "scopeid": 19
      },
      {
        "name": "Wi-Fi",
        "internal": false,
        "mac": "68:54:5a:53:dd:9c",
        "address": "192.168.1.102",
        "netmask": "255.255.255.0",
        "family": "IPv4"
      },
      {
        "name": "Loopback Pseudo-Interface 1",
        "internal": true,
        "mac": "00:00:00:00:00:00",
        "address": "::1",
        "netmask": "ffff:ffff:ffff:ffff:ffff:ffff:ffff:ffff",
        "family": "IPv6",
        "scopeid": 0
      },
      {
        "name": "Loopback Pseudo-Interface 1",
        "internal": true,
        "mac": "00:00:00:00:00:00",
        "address": "127.0.0.1",
        "netmask": "255.0.0.0",
        "family": "IPv4"
      }
    ],
    "host": "UdithaNayanajith"
  },
  "javascriptStack": {
    "message": "No stack.",
    "stack": [
      "Unavailable."
    ]
  },
  "nativeStack": [
    {
      "pc": "0x00007ff696fb1759",
      "symbol": "std::basic_ostream<char,std::char_traits<char> >::operator<<+10873"
    },
    {
      "pc": "0x00007ff696fb5b7c",
      "symbol": "std::basic_ostream<char,std::char_traits<char> >::operator<<+28316"
    },
    {
      "pc": "0x00007ff696fb4b38",
      "symbol": "std::basic_ostream<char,std::char_traits<char> >::operator<<+24152"
    },
    {
      "pc": "0x00007ff6970a433b",
      "symbol": "v8::base::CPU::has_sse+37723"
    },
    {
      "pc": "0x00007ff6978a8c5e",
      "symbol": "v8::Isolate::ReportExternalAllocationLimitReached+94"
    },
    {
      "pc": "0x00007ff697890ca1",
      "symbol": "v8::SharedArrayBuffer::Externalize+833"
    },
    {
      "pc": "0x00007ff69775e56c",
      "symbol": "v8::internal::Heap::EphemeronKeyWriteBarrierFromCode+1436"
    },
    {
      "pc": "0x00007ff697769910",
      "symbol": "v8::internal::Heap::ProtectUnprotectedMemoryChunks+1312"
    },
    {
      "pc": "0x00007ff697766444",
      "symbol": "v8::internal::Heap::PageFlagsAreConsistent+3204"
    },
    {
      "pc": "0x00007ff69775bcd3",
      "symbol": "v8::internal::Heap::CollectGarbage+1283"
    },
    {
      "pc": "0x00007ff69775a4a4",
      "symbol": "v8::internal::Heap::AddRetainedMap+2356"
    },
    {
      "pc": "0x00007ff69777b775",
      "symbol": "v8::internal::Factory::NewFillerObject+53"
    },
    {
      "pc": "0x00007ff6974e7a49",
      "symbol": "v8::internal::interpreter::JumpTableTargetOffsets::iterator::operator=+4057"
    },
    {
      "pc": "0x00007ff697cd463d",
      "symbol": "v8::internal::SetupIsolateDelegate::SetupHeap+567949"
    },
    {
      "pc": "0x00007ff697c53983",
      "symbol": "v8::internal::SetupIsolateDelegate::SetupHeap+40403"
    },
    {
      "pc": "0x000000f3d41973eb",
      "symbol": ""
    }
  ],
  "javascriptHeap": {
    "totalMemory": 2167808000,
    "totalCommittedMemory": 2167808000,
    "usedMemory": 2138786480,
    "availableMemory": 52898832,
    "memoryLimit": 2197815296,
    "heapSpaces": {
      "read_only_space": {
        "memorySize": 262144,
        "committedMemory": 262144,
        "capacity": 261872,
        "used": 32296,
        "available": 229576
      },
      "new_space": {
        "memorySize": 22020096,
        "committedMemory": 22020096,
        "capacity": 10998624,
        "used": 2003184,
        "available": 8995440
      },
      "old_space": {
        "memorySize": 2141827072,
        "committedMemory": 2141827072,
        "capacity": 2136448912,
        "used": 2133781016,
        "available": 2667896
      },
      "code_space": {
        "memorySize": 688128,
        "committedMemory": 688128,
        "capacity": 506944,
        "used": 506944,
        "available": 0
      },
      "map_space": {
        "memorySize": 1052672,
        "committedMemory": 1052672,
        "capacity": 568080,
        "used": 568080,
        "available": 0
      },
      "large_object_space": {
        "memorySize": 1908736,
        "committedMemory": 1908736,
        "capacity": 1891408,
        "used": 1891408,
        "available": 0
      },
      "code_large_object_space": {
        "memorySize": 49152,
        "committedMemory": 49152,
        "capacity": 3552,
        "used": 3552,
        "available": 0
      },
      "new_large_object_space": {
        "memorySize": 0,
        "committedMemory": 0,
        "capacity": 10998624,
        "used": 0,
        "available": 10998624
      }
    }
  },
  "resourceUsage": {
    "userCpuSeconds": 86.078,
    "kernelCpuSeconds": 40.578,
    "cpuConsumptionPercent": 5.18869,
    "maxRss": 3468742656,
    "pageFaults": {
      "IORequired": 1068846,
      "IONotRequired": 0
    },
    "fsActivity": {
      "reads": 461,
      "writes": 6
    }
  },
  "libuv": [
  ],
  "environmentVariables": {
    "=C:": "C:\\Users\\DELL\\Desktop\\Coursers\\AngularCourses\\AngularFrontend\\angularfrontend",
    "ALLUSERSPROFILE": "C:\\ProgramData",
    "APPDATA": "C:\\Users\\DELL\\AppData\\Roaming",
    "ChocolateyInstall": "C:\\ProgramData\\chocolatey",
    "ChocolateyLastPathUpdate": "132856694628925755",
    "CHROME_CRASHPAD_PIPE_NAME": "\\\\.\\pipe\\crashpad_3996_GYSOOEVJYHXXLVYD",
    "COLORTERM": "truecolor",
    "CommonProgramFiles": "C:\\Program Files\\Common Files",
    "CommonProgramFiles(x86)": "C:\\Program Files (x86)\\Common Files",
    "CommonProgramW6432": "C:\\Program Files\\Common Files",
    "COMPUTERNAME": "UDITHANAYANAJIT",
    "ComSpec": "C:\\WINDOWS\\system32\\cmd.exe",
    "dp0": "C:\\Users\\DELL\\Desktop\\Coursers\\AngularCourses\\AngularFrontend\\angularfrontend\\node_modules\\.bin\\",
    "DriverData": "C:\\Windows\\System32\\Drivers\\DriverData",
    "GIT_ASKPASS": "c:\\Users\\DELL\\AppData\\Local\\Programs\\Microsoft VS Code\\resources\\app\\extensions\\git\\dist\\askpass.sh",
    "HOME": "C:\\Users\\DELL",
    "HOMEDRIVE": "C:",
    "HOMEPATH": "\\Users\\DELL",
    "INIT_CWD": "C:\\Users\\DELL\\Desktop\\Coursers\\AngularCourses\\AngularFrontend\\angularfrontend",
    "IntelliJ IDEA": "C:\\Program Files\\JetBrains\\IntelliJ IDEA 2018.3\\bin;",
    "IntelliJ IDEA Community Edition": "C:\\Program Files\\JetBrains\\IntelliJ IDEA Community Edition 2021.3.2\\bin;",
    "LANG": "en_US.UTF-8",
    "LOCALAPPDATA": "C:\\Users\\DELL\\AppData\\Local",
    "LOGONSERVER": "\\\\UDITHANAYANAJIT",
    "NODE": "C:\\Program Files\\nodejs\\node.exe",
    "NODE_EXE": "C:\\Program Files\\nodejs\\\\node.exe",
    "NPM_CLI_JS": "C:\\Program Files\\nodejs\\\\node_modules\\npm\\bin\\npm-cli.js",
    "npm_config_access": "",
    "npm_config_allow_same_version": "",
    "npm_config_also": "",
    "npm_config_always_auth": "",
    "npm_config_argv": "{\"remain\":[],\"cooked\":[\"run\",\"lite\"],\"original\":[\"run\",\"lite\"]}",
    "npm_config_audit": "true",
    "npm_config_audit_level": "low",
    "npm_config_auth_type": "legacy",
    "npm_config_before": "",
    "npm_config_bin_links": "true",
    "npm_config_browser": "",
    "npm_config_ca": "",
    "npm_config_cache": "C:\\Users\\DELL\\AppData\\Roaming\\npm-cache",
    "npm_config_cache_lock_retries": "10",
    "npm_config_cache_lock_stale": "60000",
    "npm_config_cache_lock_wait": "10000",
    "npm_config_cache_max": "Infinity",
    "npm_config_cache_min": "10",
    "npm_config_cafile": "",
    "npm_config_cert": "",
    "npm_config_cidr": "",
    "npm_config_color": "true",
    "npm_config_commit_hooks": "true",
    "npm_config_depth": "Infinity",
    "npm_config_description": "true",
    "npm_config_dev": "",
    "npm_config_dry_run": "",
    "npm_config_editor": "notepad.exe",
    "npm_config_engine_strict": "",
    "npm_config_fetch_retries": "2",
    "npm_config_fetch_retry_factor": "10",
    "npm_config_fetch_retry_maxtimeout": "60000",
    "npm_config_fetch_retry_mintimeout": "10000",
    "npm_config_force": "",
    "npm_config_format_package_lock": "true",
    "npm_config_fund": "true",
    "npm_config_git": "git",
    "npm_config_git_tag_version": "true",
    "npm_config_global": "",
    "npm_config_globalconfig": "C:\\Users\\DELL\\AppData\\Roaming\\npm\\etc\\npmrc",
    "npm_config_globalignorefile": "C:\\Users\\DELL\\AppData\\Roaming\\npm\\etc\\npmignore",
    "npm_config_global_style": "",
    "npm_config_group": "",
    "npm_config_ham_it_up": "",
    "npm_config_heading": "npm",
    "npm_config_https_proxy": "",
    "npm_config_if_present": "",
    "npm_config_ignore_prepublish": "",
    "npm_config_ignore_scripts": "",
    "npm_config_init_author_email": "",
    "npm_config_init_author_name": "",
    "npm_config_init_author_url": "",
    "npm_config_init_license": "ISC",
    "npm_config_init_module": "C:\\Users\\DELL\\.npm-init.js",
    "npm_config_init_version": "1.0.0",
    "npm_config_json": "",
    "npm_config_key": "",
    "npm_config_legacy_bundling": "",
    "npm_config_link": "",
    "npm_config_local_address": "",
    "npm_config_loglevel": "notice",
    "npm_config_logs_max": "10",
    "npm_config_long": "",
    "npm_config_maxsockets": "50",
    "npm_config_message": "%s",
    "npm_config_metrics_registry": "https://registry.npmjs.org/",
    "npm_config_node_gyp": "C:\\Program Files\\nodejs\\node_modules\\npm\\node_modules\\node-gyp\\bin\\node-gyp.js",
    "npm_config_node_options": "",
    "npm_config_node_version": "12.14.1",
    "npm_config_noproxy": "",
    "npm_config_offline": "",
    "npm_config_onload_script": "",
    "npm_config_only": "",
    "npm_config_optional": "true",
    "npm_config_otp": "",
    "npm_config_package_lock": "true",
    "npm_config_package_lock_only": "",
    "npm_config_parseable": "",
    "npm_config_prefer_offline": "",
    "npm_config_prefer_online": "",
    "npm_config_prefix": "C:\\Users\\DELL\\AppData\\Roaming\\npm",
    "npm_config_preid": "",
    "npm_config_production": "",
    "npm_config_progress": "true",
    "npm_config_proxy": "",
    "npm_config_read_only": "",
    "npm_config_rebuild_bundle": "true",
    "npm_config_registry": "https://registry.npmjs.org/",
    "npm_config_rollback": "true",
    "npm_config_save": "true",
    "npm_config_save_bundle": "",
    "npm_config_save_dev": "",
    "npm_config_save_exact": "",
    "npm_config_save_optional": "",
    "npm_config_save_prefix": "^",
    "npm_config_save_prod": "",
    "npm_config_scope": "",
    "npm_config_scripts_prepend_node_path": "warn-only",
    "npm_config_script_shell": "",
    "npm_config_searchexclude": "",
    "npm_config_searchlimit": "20",
    "npm_config_searchopts": "",
    "npm_config_searchstaleness": "900",
    "npm_config_send_metrics": "",
    "npm_config_shell": "C:\\WINDOWS\\system32\\cmd.exe",
    "npm_config_shrinkwrap": "true",
    "npm_config_sign_git_commit": "",
    "npm_config_sign_git_tag": "",
    "npm_config_sso_poll_frequency": "500",
    "npm_config_sso_type": "oauth",
    "npm_config_strict_ssl": "true",
    "npm_config_tag": "latest",
    "npm_config_tag_version_prefix": "v",
    "npm_config_timing": "",
    "npm_config_tmp": "C:\\Users\\DELL\\AppData\\Local\\Temp",
    "npm_config_umask": "0000",
    "npm_config_unicode": "",
    "npm_config_unsafe_perm": "true",
    "npm_config_update_notifier": "true",
    "npm_config_usage": "",
    "npm_config_user": "",
    "npm_config_userconfig": "C:\\Users\\DELL\\.npmrc",
    "npm_config_user_agent": "npm/6.13.4 node/v12.14.1 win32 x64",
    "npm_config_version": "",
    "npm_config_versions": "",
    "npm_config_viewer": "browser",
    "npm_execpath": "C:\\Program Files\\nodejs\\node_modules\\npm\\bin\\npm-cli.js",
    "npm_lifecycle_event": "lite",
    "npm_lifecycle_script": "lite-server",
    "npm_node_execpath": "C:\\Program Files\\nodejs\\node.exe",
    "npm_package_author_name": "uditha",
    "npm_package_bugs_url": "https://gitlab.com/uditha.nayanajith/angularfrontend/issues",
    "npm_package_description": "This is a test directory to learn git and node",
    "npm_package_devDependencies_lite_server": "^2.6.1",
    "npm_package_gitHead": "b52963bfb9eb90899949811eb36566380b4b7f1c",
    "npm_package_homepage": "https://gitlab.com/uditha.nayanajith/angularfrontend#readme",
    "npm_package_license": "ISC",
    "npm_package_main": "index.js",
    "npm_package_name": "angularfrontend",
    "npm_package_repository_type": "git",
    "npm_package_repository_url": "git+https://gitlab.com/uditha.nayanajith/angularfrontend.git",
    "npm_package_scripts_lite": "lite-server",
    "npm_package_scripts_start": "npm run lite",
    "npm_package_scripts_test": "echo \"Error: no test specified\" && exit 1",
    "npm_package_version": "1.0.0",
    "NPM_PREFIX_NPM_CLI_JS": "C:\\Users\\DELL\\AppData\\Roaming\\npm\\node_modules\\npm\\bin\\npm-cli.js",
    "NUMBER_OF_PROCESSORS": "12",
    "OneDrive": "C:\\Users\\DELL\\OneDrive",
    "ORIGINAL_XDG_CURRENT_DESKTOP": "undefined",
    "OS": "Windows_NT",
    "Path": "C:\\Program Files\\nodejs\\node_modules\\npm\\node_modules\\npm-lifecycle\\node-gyp-bin;C:\\Users\\DELL\\Desktop\\Coursers\\AngularCourses\\AngularFrontend\\angularfrontend\\node_modules\\.bin;C:\\Program Files\\nodejs\\node_modules\\npm\\node_modules\\npm-lifecycle\\node-gyp-bin;C:\\Users\\DELL\\Desktop\\Coursers\\AngularCourses\\AngularFrontend\\angularfrontend\\node_modules\\.bin;C:\\Python27\\;C:\\Python27\\Scripts;C:\\Program Files (x86)\\Common Files\\Oracle\\Java\\javapath;C:\\Python310\\Scripts\\;C:\\Python310\\;C:\\ProgramData\\Anaconda3;C:\\ProgramData\\Anaconda3\\Library\\mingw-w64\\bin;C:\\ProgramData\\Anaconda3\\Library\\usr\\bin;C:\\ProgramData\\Anaconda3\\Library\\bin;C:\\ProgramData\\Anaconda3\\Scripts;C:\\Program Files\\Python310\\Scripts\\;C:\\Program Files\\Python310\\;C:\\WINDOWS\\system32;C:\\WINDOWS;C:\\WINDOWS\\System32\\Wbem;C:\\WINDOWS\\System32\\WindowsPowerShell\\v1.0\\;C:\\WINDOWS\\System32\\OpenSSH\\;C:\\Program Files\\Git\\cmd;C:\\ProgramData\\Anaconda3\\condabin;C:\\ProgramData\\chocolatey\\bin;C:\\Program Files\\nodejs\\;C:\\Program Files\\dotnet\\;C:\\Users\\DELL\\AppData\\Local\\Microsoft\\WindowsApps;C:\\Users\\DELL\\AppData\\Local\\Programs\\Microsoft VS Code\\bin;D:\\SOFTWARES\\PyCharm\\PycharmInstallation\\PyCharm 2021.3\\bin;D:\\SOFTWARES\\pyCharm\\PyCharmInstallation\\PyCharm Community Edition 2021.3\\bin;C:\\Program Files\\JetBrains\\IntelliJ IDEA Community Edition 2021.3.2\\bin;C:\\Users\\DELL\\AppData\\Roaming\\npm;C:\\Program Files\\JetBrains\\IntelliJ IDEA 2018.3\\bin",
    "PATHEXT": ".COM;.EXE;.BAT;.CMD;.VBS;.VBE;.JSE;.WSF;.WSH;.MSC;.PY;.PYW;.CPL",
    "PROCESSOR_ARCHITECTURE": "AMD64",
    "PROCESSOR_IDENTIFIER": "AMD64 Family 23 Model 96 Stepping 1, AuthenticAMD",
    "PROCESSOR_LEVEL": "23",
    "PROCESSOR_REVISION": "6001",
    "ProgramData": "C:\\ProgramData",
    "ProgramFiles": "C:\\Program Files",
    "ProgramFiles(x86)": "C:\\Program Files (x86)",
    "ProgramW6432": "C:\\Program Files",
    "PROMPT": "$P$G",
    "PSModulePath": "C:\\Users\\DELL\\Documents\\WindowsPowerShell\\Modules;C:\\Program Files\\WindowsPowerShell\\Modules;C:\\WINDOWS\\system32\\WindowsPowerShell\\v1.0\\Modules",
    "PUBLIC": "C:\\Users\\Public",
    "PyCharm": "D:\\SOFTWARES\\PyCharm\\PycharmInstallation\\PyCharm 2021.3\\bin;",
    "PyCharm Community Edition": "D:\\SOFTWARES\\pyCharm\\PyCharmInstallation\\PyCharm Community Edition 2021.3\\bin;",
    "SystemDrive": "C:",
    "SystemRoot": "C:\\WINDOWS",
    "TEMP": "C:\\Users\\DELL\\AppData\\Local\\Temp",
    "TERM_PROGRAM": "vscode",
    "TERM_PROGRAM_VERSION": "1.66.1",
    "TMP": "C:\\Users\\DELL\\AppData\\Local\\Temp",
    "USERDOMAIN": "UDITHANAYANAJIT",
    "USERDOMAIN_ROAMINGPROFILE": "UDITHANAYANAJIT",
    "USERNAME": "DELL",
    "USERPROFILE": "C:\\Users\\DELL",
    "VSCODE_GIT_ASKPASS_EXTRA_ARGS": "--ms-enable-electron-run-as-node",
    "VSCODE_GIT_ASKPASS_MAIN": "c:\\Users\\DELL\\AppData\\Local\\Programs\\Microsoft VS Code\\resources\\app\\extensions\\git\\dist\\askpass-main.js",
    "VSCODE_GIT_ASKPASS_NODE": "C:\\Users\\DELL\\AppData\\Local\\Programs\\Microsoft VS Code\\Code.exe",
    "VSCODE_GIT_IPC_HANDLE": "\\\\.\\pipe\\vscode-git-226b9f6eb1-sock",
    "windir": "C:\\WINDOWS",
    "_prog": "node"
  },
  "sharedObjects": [
    "C:\\Program Files\\nodejs\\node.exe",
    "C:\\WINDOWS\\SYSTEM32\\ntdll.dll",
    "C:\\WINDOWS\\System32\\KERNEL32.DLL",
    "C:\\WINDOWS\\System32\\KERNELBASE.dll",
    "C:\\WINDOWS\\System32\\WS2_32.dll",
    "C:\\WINDOWS\\System32\\RPCRT4.dll",
    "C:\\WINDOWS\\SYSTEM32\\dbghelp.dll",
    "C:\\WINDOWS\\System32\\ADVAPI32.dll",
    "C:\\WINDOWS\\System32\\ucrtbase.dll",
    "C:\\WINDOWS\\System32\\msvcrt.dll",
    "C:\\WINDOWS\\System32\\sechost.dll",
    "C:\\WINDOWS\\System32\\USER32.dll",
    "C:\\WINDOWS\\System32\\win32u.dll",
    "C:\\WINDOWS\\System32\\GDI32.dll",
    "C:\\WINDOWS\\System32\\gdi32full.dll",
    "C:\\WINDOWS\\System32\\msvcp_win.dll",
    "C:\\WINDOWS\\System32\\PSAPI.DLL",
    "C:\\WINDOWS\\System32\\CRYPT32.dll",
    "C:\\WINDOWS\\SYSTEM32\\IPHLPAPI.DLL",
    "C:\\WINDOWS\\SYSTEM32\\bcrypt.dll",
    "C:\\WINDOWS\\SYSTEM32\\WINMM.dll",
    "C:\\WINDOWS\\SYSTEM32\\USERENV.dll",
    "C:\\WINDOWS\\System32\\IMM32.DLL",
    "C:\\WINDOWS\\SYSTEM32\\powrprof.dll",
    "C:\\WINDOWS\\SYSTEM32\\UMPDC.dll",
    "C:\\WINDOWS\\SYSTEM32\\CRYPTBASE.DLL",
    "C:\\WINDOWS\\system32\\uxtheme.dll",
    "C:\\WINDOWS\\System32\\combase.dll",
    "C:\\WINDOWS\\system32\\mswsock.dll",
    "C:\\WINDOWS\\SYSTEM32\\kernel.appcore.dll",
    "C:\\WINDOWS\\System32\\bcryptprimitives.dll",
    "C:\\WINDOWS\\System32\\NSI.dll",
    "C:\\WINDOWS\\SYSTEM32\\dhcpcsvc6.DLL",
    "C:\\WINDOWS\\SYSTEM32\\dhcpcsvc.DLL",
    "C:\\WINDOWS\\SYSTEM32\\DNSAPI.dll",
    "C:\\WINDOWS\\system32\\napinsp.dll",
    "C:\\WINDOWS\\system32\\pnrpnsp.dll",
    "C:\\WINDOWS\\System32\\winrnr.dll",
    "C:\\WINDOWS\\system32\\wshbth.dll",
    "C:\\WINDOWS\\system32\\nlansp_c.dll"
  ]
}